#gnr; time; pid; sj; sj
  2; 17:21:36,516;  -1;   0;  0;
  2; 17:21:36,516;   0;   0;  0;; not_moved
  2; 17:21:36,516;   1;   0;  0;; not_moved
  2; 17:21:36,516;   2;   0;  0;; not_moved
  2; 17:21:36,516;   3;   0;  0;; not_moved
  2; 17:21:36,516;   4;   0;  0;; not_moved
  2; 17:21:36,516;   5;   0;  0;; not_moved
  2; 17:21:39,748;   3;  -1;  0;
  2; 17:21:40,621;   0;  -1;  0;
  2; 17:21:40,755;   3;  -1;  0;; not_moved
  2; 17:21:41,622;   0;  -1;  0;; not_moved
  2; 17:21:41,841;   2;   0; -1;
  2; 17:21:41,970;   3;  -1;  1;
  2; 17:21:42,118;   5;   1;  0;
  2; 17:21:42,941;   2;   0; -1;; not_moved
  2; 17:21:43,061;   3;  -1;  1;; not_moved
  2; 17:21:43,145;   5;   1;  0;; not_moved
  2; 17:21:43,475;   5;   2;  0;
  2; 17:21:43,976;   0;  -1;  1;
  2; 17:21:43,983;   3;   0;  2;
  2; 17:21:44,163;   2;   1; -1;
  2; 17:21:44,363;   4;  -1; -1;
  2; 17:21:44,365;   5;   2; -1;
  2; 17:21:45,027;   0;  -1;  1;; not_moved
  2; 17:21:45,062;   3;   0;  2;; not_moved
  2; 17:21:45,252;   2;   1; -1;; not_moved
  2; 17:21:45,316;   5;   2; -2;
  2; 17:21:45,405;   4;  -1; -1;; not_moved
  2; 17:21:45,459;   2;   2; -1;
  2; 17:21:45,697;   3;  -1;  2;
  2; 17:21:46,360;   4;  -2; -2;
  2; 17:21:46,370;   5;   2; -2;; not_moved
  2; 17:21:46,413;   2;   1; -2;
  2; 17:21:46,656;   0;  -1;  2;
  2; 17:21:46,746;   5;   1; -2;
  2; 17:21:46,769;   3;  -1;  2;; not_moved
  2; 17:21:47,367;   1;   1;  1;
  2; 17:21:47,371;   2;   0; -3;
  2; 17:21:47,390;   4;  -2; -3;
  2; 17:21:47,412;   3;  -1;  3;
  2; 17:21:47,631;   0;  -1;  2;; not_moved
  2; 17:21:47,780;   5;   1; -2;; not_moved
  2; 17:21:48,108;   0;   0;  3;
  2; 17:21:48,264;   4;  -1; -2;
  2; 17:21:48,380;   1;   1;  1;; not_moved
  2; 17:21:48,466;   2;   0; -3;; not_moved
  2; 17:21:48,470;   3;  -1;  3;; not_moved
  2; 17:21:49,134;   0;   0;  3;; not_moved
  2; 17:21:49,233;   4;   0; -2;
  2; 17:21:49,636;   0;   1;  3;
  2; 17:21:50,313;   4;   0; -2;; not_moved
  2; 17:21:50,336;   1;   2;  2;
  2; 17:21:50,636;   0;   1;  3;; not_moved
  2; 17:21:51,384;   1;   2;  2;; not_moved
  2; 17:21:51,777;   1;   2;  3;
  2; 17:21:52,786;   1;   2;  3;; not_moved
  2; 17:21:53,735;   1;   1;  3;
  2; 17:21:54,789;   1;   1;  3;; not_moved
  2; 17:21:55,709;   1;   1;  2;
 56; 17:25:15,266;  -1;   0;  0;
 56; 17:25:15,266;   0;   0;  0;; not_moved
 56; 17:25:15,266;   1;   0;  0;; not_moved
 56; 17:25:15,266;   2;   0;  0;; not_moved
 56; 17:25:15,266;   3;   0;  0;; not_moved
 56; 17:25:15,266;   4;   0;  0;; not_moved
 56; 17:25:15,266;   5;   0;  0;; not_moved
 56; 17:25:15,266;   6;   5;  2;; not_moved
 56; 17:25:15,266;   7;  -2;  3;; not_moved
 56; 17:25:15,266;   8;   3;  5;; not_moved
 56; 17:25:15,266;   9;  -5; -2;; not_moved
 56; 17:25:18,864;   0;   0;  1;
 56; 17:25:19,918;   0;   0;  1;; not_moved
 56; 17:25:20,093;   0;  -1;  1;
 56; 17:25:21,168;   0;  -1;  1;; not_moved
 56; 17:25:21,497;   0;  -2;  1;
 56; 17:25:22,525;   0;  -2;  1;; not_moved
 56; 17:25:22,661;   2;  -1;  0;
 56; 17:25:22,751;   0;  -2;  2;
 56; 17:25:22,775;   3;   0;  1;
 56; 17:25:23,671;   1;   0;  1;
 56; 17:25:23,760;   2;  -1;  0;; not_moved
 56; 17:25:23,835;   0;  -2;  2;; not_moved
 56; 17:25:23,919;   3;   0;  1;; not_moved
 56; 17:25:23,964;   0;  -2;  3;
 56; 17:25:24,079;   2;  -1;  1;
 56; 17:25:24,256;   3;  -1;  1;
 56; 17:25:24,471;   1;   0;  2;
 56; 17:25:24,917;   3;  -2;  1;
 56; 17:25:25,036;   0;  -2;  3;; not_moved
 56; 17:25:25,162;   2;  -1;  1;; not_moved
 56; 17:25:25,323;   2;  -1;  2;
 56; 17:25:25,465;   1;  -1;  2;
 56; 17:25:25,534;   3;  -2;  2;
 56; 17:25:26,100;   2;  -2;  2;
 56; 17:25:26,207;   4;   1;  1;
 56; 17:25:26,248;   3;  -2;  3;
 56; 17:25:26,330;   1;  -1;  3;
 56; 17:25:26,884;   2;  -2;  3;
 56; 17:25:26,954;   5;  -1;  0;
 56; 17:25:27,077;   4;   2;  2;
 56; 17:25:27,259;   1;  -2;  3;
 56; 17:25:27,279;   3;  -2;  3;; not_moved
 56; 17:25:27,866;   2;  -2;  3;; not_moved
 56; 17:25:27,955;   4;   2;  3;
 56; 17:25:27,973;   5;  -1;  0;; not_moved
 56; 17:25:28,280;   1;  -2;  3;; not_moved
 56; 17:25:28,352;   5;  -2;  0;
 56; 17:25:28,780;   4;   3;  4;
 56; 17:25:29,160;   5;  -2;  1;
 56; 17:25:29,656;   4;   3;  5;
 56; 17:25:29,968;   5;  -1;  1;
 56; 17:25:30,702;   4;   3;  5;; not_moved
 56; 17:25:30,942;   5;  -1;  2;
 56; 17:25:31,979;   5;  -1;  2;; not_moved
 56; 17:25:32,284;   5;  -1;  3;
 56; 17:25:33,188;   5;  -1;  4;
 56; 17:25:34,183;   5;  -1;  4;; not_moved
 56; 17:25:34,262;   5;  -2;  3;
 56; 17:25:34,266;  -1;   0;  0;
 56; 17:25:34,266;   0;   0;  0;; not_moved
 56; 17:25:34,266;   1;   0;  0;; not_moved
 56; 17:25:34,266;   2;   0;  0;; not_moved
 56; 17:25:34,266;   3;   0;  0;; not_moved
 56; 17:25:34,266;   4;   0;  0;; not_moved
 56; 17:25:34,266;   5;   0;  0;; not_moved
 56; 17:25:34,266;   6;   5;  1;; not_moved
 56; 17:25:34,266;   7;  -5; -1;; not_moved
 56; 17:25:34,266;   8;  -1;  4;; not_moved
 56; 17:25:34,266;   9;   1; -4;; not_moved
 56; 17:25:42,895;   1;  -1;  0;
 56; 17:25:43,235;   0;  -1;  0;
 56; 17:25:43,743;   1;  -2;  0;
 56; 17:25:44,159;   2;  -1;  0;
 56; 17:25:44,277;   0;  -1;  0;; not_moved
 56; 17:25:44,493;   3;  -1;  0;
 56; 17:25:44,527;   1;  -3; -1;
 56; 17:25:44,711;   0;  -2;  0;
 56; 17:25:45,194;   2;  -1;  0;; not_moved
 56; 17:25:45,200;   2;  -2;  0;
 56; 17:25:45,340;   1;  -4; -1;
 56; 17:25:45,506;   3;  -1;  0;; not_moved
 56; 17:25:45,555;   3;  -2;  0;
 56; 17:25:45,824;   0;  -2;  0;; not_moved
 56; 17:25:45,995;   4;   0; -1;
 56; 17:25:46,137;   1;  -5; -1;
 56; 17:25:46,232;   0;  -3; -1;
 56; 17:25:46,295;   2;  -2;  0;; not_moved
 56; 17:25:46,365;   3;  -3;  0;
 56; 17:25:46,634;   2;  -3;  0;
 56; 17:25:47,025;   4;   0; -1;; not_moved
 56; 17:25:47,192;   3;  -4; -1;
 56; 17:25:47,216;   1;  -5; -1;; not_moved
 56; 17:25:47,258;   0;  -4; -1;
 56; 17:25:47,399;   4;   0; -2;
 56; 17:25:47,634;   2;  -4; -1;
 56; 17:25:47,871;   3;  -5; -1;
 56; 17:25:48,072;   4;   0; -3;
 56; 17:25:48,289;   0;  -4; -1;; not_moved
 56; 17:25:48,358;   0;  -5; -1;
 56; 17:25:48,404;   2;  -5; -1;
 56; 17:25:48,601;   4;   1; -3;
 56; 17:25:48,910;   3;  -5; -1;; not_moved
 56; 17:25:49,058;   5;  -1;  0;
 56; 17:25:49,390;   0;  -5; -1;; not_moved
 56; 17:25:49,400;   2;  -5; -1;; not_moved
 56; 17:25:49,629;   4;   1; -3;; not_moved
 56; 17:25:50,104;   5;  -1;  0;; not_moved
 56; 17:25:50,217;   4;   1; -4;
 56; 17:25:50,689;   5;  -1;  1;
 56; 17:25:51,232;   4;   1; -4;; not_moved
 56; 17:25:51,706;   5;  -1;  1;; not_moved
 56; 17:25:51,769;   5;  -2;  1;
 56; 17:25:52,387;   5;  -2;  0;
 56; 17:25:53,057;   5;  -3;  0;
 56; 17:25:54,111;   5;  -3;  0;; not_moved
 56; 17:25:54,808;   5;  -3; -1;
 56; 17:25:55,393;   5;  -4; -1;
 56; 17:25:56,414;   5;  -4; -1;; not_moved
 56; 17:25:56,506;   5;  -5; -1;
 56; 17:25:56,509;  -1;   0;  0;
 56; 17:25:56,509;   0;   0;  0;; not_moved
 56; 17:25:56,509;   1;   0;  0;; not_moved
 56; 17:25:56,509;   2;   0;  0;; not_moved
 56; 17:25:56,509;   3;   0;  0;; not_moved
 56; 17:25:56,509;   4;   0;  0;; not_moved
 56; 17:25:56,509;   5;   0;  0;; not_moved
 56; 17:25:56,509;   6;  -5; -4;; not_moved
 56; 17:25:56,509;   7;  -1; -5;; not_moved
 56; 17:25:56,509;   8;   1;  5;; not_moved
 56; 17:25:56,509;   9;   4; -1;; not_moved
 56; 17:26:04,360;   0;  -1; -1;
 56; 17:26:05,315;   1;  -1; -1;
 56; 17:26:05,434;   0;  -2; -2;
 56; 17:26:05,807;   2;  -1; -1;
 56; 17:26:06,008;   1;  -1; -2;
 56; 17:26:06,116;   3;  -1; -1;
 56; 17:26:06,416;   0;  -2; -2;; not_moved
 56; 17:26:06,509;   0;  -3; -3;
 56; 17:26:06,764;   2;  -2; -2;
 56; 17:26:06,789;   1;  -1; -3;
 56; 17:26:07,138;   3;  -1; -1;; not_moved
 56; 17:26:07,143;   3;  -2; -2;
 56; 17:26:07,512;   1;  -1; -4;
 56; 17:26:07,518;   0;  -3; -3;; not_moved
 56; 17:26:07,665;   0;  -4; -4;
 56; 17:26:07,788;   3;  -3; -3;
 56; 17:26:07,823;   2;  -2; -2;; not_moved
 56; 17:26:08,085;   2;  -3; -3;
 56; 17:26:08,498;   3;  -4; -4;
 56; 17:26:08,504;   1;  -1; -5;
 56; 17:26:08,720;   0;  -4; -4;; not_moved
 56; 17:26:08,727;   0;  -5; -4;
 56; 17:26:09,125;   2;  -3; -3;; not_moved
 56; 17:26:09,275;   3;  -5; -4;
 56; 17:26:09,551;   1;  -1; -5;; not_moved
 56; 17:26:09,685;   2;  -4; -4;
 56; 17:26:09,821;   0;  -5; -4;; not_moved
 56; 17:26:10,342;   3;  -5; -4;; not_moved
 56; 17:26:10,552;   5;  -1; -1;
 56; 17:26:10,727;   2;  -4; -4;; not_moved
 56; 17:26:11,410;   5;  -1; -2;
 56; 17:26:11,549;   2;  -5; -4;
 56; 17:26:12,031;   4;  -1; -1;
 56; 17:26:12,218;   5;  -2; -2;
 56; 17:26:12,672;   2;  -5; -4;; not_moved
 56; 17:26:12,857;   5;  -2; -3;
 56; 17:26:13,069;   4;  -1; -1;; not_moved
 56; 17:26:13,440;   4;  -2; -2;
 56; 17:26:13,505;   5;  -3; -3;
 56; 17:26:14,159;   4;  -3; -3;
 56; 17:26:14,416;   5;  -3; -4;
 56; 17:26:15,000;   5;  -4; -4;
 56; 17:26:15,060;   4;  -4; -4;
 56; 17:26:15,738;   5;  -5; -4;
 56; 17:26:16,040;   4;  -5; -4;
 56; 17:26:16,042;  -1;   0;  0;
 56; 17:26:16,042;   0;   0;  0;; not_moved
 56; 17:26:16,042;   1;   0;  0;; not_moved
 56; 17:26:16,042;   2;   0;  0;; not_moved
 56; 17:26:16,042;   3;   0;  0;; not_moved
 56; 17:26:16,042;   4;   0;  0;; not_moved
 56; 17:26:16,042;   5;   0;  0;; not_moved
 56; 17:26:16,042;   6;  -3;  2;; not_moved
 56; 17:26:16,042;   7;   2;  5;; not_moved
 56; 17:26:16,042;   8;   5;  3;; not_moved
 56; 17:26:16,042;   9;  -5; -3;; not_moved
 56; 17:26:24,262;   0;  -1;  0;
 56; 17:26:24,679;   2;   1;  1;
 56; 17:26:25,384;   0;  -1;  0;; not_moved
 56; 17:26:25,668;   0;  -1;  1;
 56; 17:26:25,749;   2;   1;  1;; not_moved
 56; 17:26:25,802;   2;   2;  1;
 56; 17:26:25,926;   3;  -1;  0;
 56; 17:26:26,745;   0;  -1;  1;; not_moved
 56; 17:26:26,851;   2;   2;  1;; not_moved
 56; 17:26:26,964;   3;  -1;  0;; not_moved
 56; 17:26:26,977;   3;  -1;  1;
 56; 17:26:26,982;   0;  -2;  1;
 56; 17:26:27,872;   3;  -2;  1;
 56; 17:26:28,088;   0;  -2;  1;; not_moved
 56; 17:26:28,088;   0;  -3;  1;
 56; 17:26:28,317;   2;   2;  2;
 56; 17:26:28,579;   3;  -2;  2;
 56; 17:26:28,696;   1;  -1;  0;
 56; 17:26:29,148;   0;  -3;  1;; not_moved
 56; 17:26:29,227;   0;  -3;  2;
 56; 17:26:29,318;   3;  -3;  2;
 56; 17:26:29,354;   2;   2;  2;; not_moved
 56; 17:26:29,443;   1;  -1;  1;
 56; 17:26:30,250;   0;  -3;  2;; not_moved
 56; 17:26:30,357;   1;  -2;  1;
 56; 17:26:30,371;   3;  -3;  2;; not_moved
 56; 17:26:31,126;   1;  -3;  1;
 56; 17:26:31,222;   5;  -1;  0;
 56; 17:26:31,419;   4;  -1;  0;
 56; 17:26:31,967;   2;   1;  2;
 56; 17:26:32,014;   1;  -3;  2;
 56; 17:26:32,238;   4;  -1;  1;
 56; 17:26:32,266;   5;  -1;  0;; not_moved
 56; 17:26:32,732;   2;   0;  2;
 56; 17:26:33,083;   1;  -3;  2;; not_moved
 56; 17:26:33,143;   4;  -2;  1;
 56; 17:26:33,324;   5;  -2; -1;
 56; 17:26:33,463;   2;  -1;  2;
 56; 17:26:33,907;   4;  -3;  1;
 56; 17:26:34,208;   5;  -2;  0;
 56; 17:26:34,560;   2;  -1;  2;; not_moved
 56; 17:26:34,753;   4;  -3;  2;
 56; 17:26:34,819;   2;  -2;  2;
 56; 17:26:35,270;   5;  -2;  0;; not_moved
 56; 17:26:35,493;   2;  -3;  2;
 56; 17:26:35,608;   5;  -3;  0;
 56; 17:26:35,843;   4;  -3;  2;; not_moved
 56; 17:26:36,562;   2;  -3;  2;; not_moved
 56; 17:26:36,671;   5;  -3;  0;; not_moved
 56; 17:26:37,872;   5;  -4; -1;
 56; 17:26:38,821;   5;  -4;  0;
 56; 17:26:39,455;   5;  -4;  1;
 56; 17:26:40,082;   5;  -3;  2;
 56; 17:26:40,084;  -1;   0;  0;
 56; 17:26:40,084;   0;   0;  0;; not_moved
 56; 17:26:40,084;   1;   0;  0;; not_moved
 56; 17:26:40,084;   2;   0;  0;; not_moved
 56; 17:26:40,084;   3;   0;  0;; not_moved
 56; 17:26:40,084;   4;   0;  0;; not_moved
 56; 17:26:40,084;   5;   0;  0;; not_moved
 56; 17:26:40,084;   6;   3; -2;; not_moved
 56; 17:26:40,084;   7;   2;  5;; not_moved
 56; 17:26:40,084;   8;  -2; -5;; not_moved
 56; 17:26:40,084;   9;  -3;  2;; not_moved
 56; 17:26:48,139;   4;  -1;  0;
 56; 17:26:48,150;   2;   1;  0;
 56; 17:26:48,806;   0;   1;  1;
 56; 17:26:48,902;   4;  -2;  0;
 56; 17:26:49,179;   2;   1;  0;; not_moved
 56; 17:26:49,873;   0;   1;  1;; not_moved
 56; 17:26:49,964;   4;  -2;  0;; not_moved
 56; 17:26:50,044;   4;  -3;  0;
 56; 17:26:50,499;   0;   0;  1;
 56; 17:26:50,757;   4;  -3;  1;
 56; 17:26:51,304;   3;  -1;  0;
 56; 17:26:51,466;   4;  -3;  2;
 56; 17:26:51,620;   0;   0;  1;; not_moved
 56; 17:26:51,844;   0;  -1;  1;
 56; 17:26:51,950;   3;  -2;  0;
 56; 17:26:52,057;   2;   1;  1;
 56; 17:26:52,480;   4;  -3;  2;; not_moved
 56; 17:26:52,493;   3;  -3;  0;
 56; 17:26:52,736;   2;   0;  1;
 56; 17:26:52,878;   0;  -1;  1;; not_moved
 56; 17:26:52,889;   0;  -2;  1;
 56; 17:26:53,166;   3;  -3;  1;
 56; 17:26:53,364;   5;  -1;  0;
 56; 17:26:53,595;   2;  -1;  1;
 56; 17:26:53,733;   1;  -1;  0;
 56; 17:26:53,777;   3;  -3;  2;
 56; 17:26:53,980;   0;  -2;  1;; not_moved
 56; 17:26:54,194;   0;  -2;  2;
 56; 17:26:54,368;   2;  -2;  1;
 56; 17:26:54,414;   5;  -1;  0;; not_moved
 56; 17:26:54,696;   5;  -2;  0;
 56; 17:26:54,768;   1;  -2;  0;
 56; 17:26:54,803;   3;  -3;  2;; not_moved
 56; 17:26:55,208;   0;  -3;  2;
 56; 17:26:55,319;   2;  -2;  2;
 56; 17:26:55,640;   5;  -1;  1;
 56; 17:26:55,760;   1;  -2;  1;
 56; 17:26:55,976;   2;  -3;  2;
 56; 17:26:56,183;   0;  -3;  2;; not_moved
 56; 17:26:56,616;   5;  -1;  1;; not_moved
 56; 17:26:56,802;   1;  -2;  2;
 56; 17:26:56,987;   2;  -3;  2;; not_moved
 56; 17:26:57,087;   5;  -2;  1;
 56; 17:26:57,732;   1;  -3;  2;
 56; 17:26:58,122;   5;  -2;  1;; not_moved
 56; 17:26:58,264;   5;  -1;  2;
 56; 17:26:58,824;   1;  -3;  2;; not_moved
 56; 17:26:59,055;   5;  -2;  2;
 56; 17:27:00,017;   5;  -2;  3;
 56; 17:27:00,900;   5;  -3;  2;
 56; 17:27:00,904;  -1;   0;  0;
 56; 17:27:00,904;   0;   0;  0;; not_moved
 56; 17:27:00,904;   1;   0;  0;; not_moved
 56; 17:27:00,904;   2;   0;  0;; not_moved
 56; 17:27:00,904;   3;   0;  0;; not_moved
 56; 17:27:00,904;   4;   0;  0;; not_moved
 56; 17:27:00,904;   5;   0;  0;; not_moved
 56; 17:27:00,904;   6;  -4; -5;; not_moved
 56; 17:27:00,904;   7;   5;  1;; not_moved
 56; 17:27:00,904;   8;   1; -4;; not_moved
 56; 17:27:00,904;   9;  -5; -1;; not_moved
 56; 17:27:09,337;   3;  -1; -1;
 56; 17:27:10,425;   3;  -1; -1;; not_moved
 56; 17:27:10,601;   0;  -1; -1;
 56; 17:27:10,681;   3;  -2; -2;
 56; 17:27:10,715;   2;   0; -1;
 56; 17:27:11,450;   3;  -2; -3;
 56; 17:27:11,604;   0;  -1; -1;; not_moved
 56; 17:27:11,647;   0;  -2; -2;
 56; 17:27:11,811;   2;   0; -1;; not_moved
 56; 17:27:12,247;   3;  -3; -4;
 56; 17:27:12,705;   0;  -2; -2;; not_moved
 56; 17:27:12,763;   0;  -3; -3;
 56; 17:27:12,936;   5;  -1; -1;
 56; 17:27:13,004;   1;  -1; -1;
 56; 17:27:13,024;   3;  -4; -5;
 56; 17:27:13,741;   0;  -4; -4;
 56; 17:27:13,743;   2;  -1; -2;
 56; 17:27:13,945;   5;  -1; -1;; not_moved
 56; 17:27:13,950;   1;  -2; -2;
 56; 17:27:14,030;   3;  -4; -5;; not_moved
 56; 17:27:14,408;   5;  -1; -2;
 56; 17:27:14,815;   2;  -1; -2;; not_moved
 56; 17:27:14,828;   0;  -4; -5;
 56; 17:27:14,834;   2;  -2; -3;
 56; 17:27:14,891;   1;  -3; -3;
 56; 17:27:15,437;   4;   0; -1;
 56; 17:27:15,447;   5;  -1; -2;; not_moved
 56; 17:27:15,527;   5;  -2; -2;
 56; 17:27:15,816;   0;  -4; -5;; not_moved
 56; 17:27:15,816;   2;  -3; -4;
 56; 17:27:15,896;   1;  -3; -4;
 56; 17:27:16,180;   4;   0; -2;
 56; 17:27:16,379;   5;  -2; -3;
 56; 17:27:16,783;   2;  -4; -5;
 56; 17:27:16,798;   4;   0; -3;
 56; 17:27:16,829;   1;  -4; -5;
 56; 17:27:17,374;   4;   1; -3;
 56; 17:27:17,450;   5;  -2; -3;; not_moved
 56; 17:27:17,818;   2;  -4; -5;; not_moved
 56; 17:27:17,849;   1;  -4; -5;; not_moved
 56; 17:27:18,019;   4;   1; -4;
 56; 17:27:18,058;   5;  -2; -4;
 56; 17:27:18,832;   5;  -3; -4;
 56; 17:27:19,114;   4;   1; -4;; not_moved
 56; 17:27:19,853;   5;  -3; -4;; not_moved
 56; 17:27:19,912;   5;  -3; -5;
 56; 17:27:20,954;   5;  -3; -5;; not_moved
 56; 17:27:21,164;   5;  -4; -5;
 56; 17:27:21,167;  -1;   0;  0;
 56; 17:27:21,167;   0;   0;  0;; not_moved
 56; 17:27:21,167;   1;   0;  0;; not_moved
 56; 17:27:21,167;   2;   0;  0;; not_moved
 56; 17:27:21,167;   3;   0;  0;; not_moved
 56; 17:27:21,167;   4;   0;  0;; not_moved
 56; 17:27:21,167;   5;   0;  0;; not_moved
 56; 17:27:21,167;   6;   2; -3;; not_moved
 56; 17:27:21,167;   7;  -2;  3;; not_moved
 56; 17:27:21,167;   8;   5;  2;; not_moved
 56; 17:27:21,167;   9;   3;  5;; not_moved
 56; 17:27:29,167;   4;   1;  0;
 56; 17:27:29,181;   0;  -1;  0;
 56; 17:27:29,397;   3;   0; -1;
 56; 17:27:30,067;   0;  -1;  1;
 56; 17:27:30,204;   4;   2;  0;
 56; 17:27:30,457;   3;   0; -1;; not_moved
 56; 17:27:30,842;   4;   3;  1;
 56; 17:27:31,138;   0;  -1;  1;; not_moved
 56; 17:27:31,248;   3;   1; -1;
 56; 17:27:31,436;   2;   1;  0;
 56; 17:27:31,914;   4;   4;  1;
 56; 17:27:32,260;   3;   1; -1;; not_moved
 56; 17:27:32,437;   2;   1;  0;; not_moved
 56; 17:27:32,603;   4;   5;  2;
 56; 17:27:32,780;   2;   2;  1;
 56; 17:27:33,582;   2;   3;  1;
 56; 17:27:33,632;   4;   5;  2;; not_moved
 56; 17:27:33,957;   1;   1;  0;
 56; 17:27:34,295;   3;   2;  0;
 56; 17:27:34,639;   2;   3;  1;; not_moved
 56; 17:27:34,707;   2;   4;  1;
 56; 17:27:34,973;   1;   1;  0;; not_moved
 56; 17:27:35,043;   1;   2;  1;
 56; 17:27:35,207;   3;   3;  1;
 56; 17:27:35,652;   2;   5;  2;
 56; 17:27:35,884;   3;   4;  1;
 56; 17:27:36,030;   5;   1;  0;
 56; 17:27:36,075;   1;   2;  1;; not_moved
 56; 17:27:36,144;   0;   0;  1;
 56; 17:27:36,176;   1;   3;  1;
 56; 17:27:36,642;   3;   5;  2;
 56; 17:27:36,788;   2;   5;  2;; not_moved
 56; 17:27:36,971;   5;   1;  1;
 56; 17:27:37,031;   1;   4;  2;
 56; 17:27:37,146;   0;   0;  1;; not_moved
 56; 17:27:37,543;   0;   1;  1;
 56; 17:27:37,668;   3;   5;  2;; not_moved
 56; 17:27:37,945;   1;   5;  2;
 56; 17:27:37,976;   5;   1;  1;; not_moved
 56; 17:27:38,032;   5;   2;  1;
 56; 17:27:38,434;   0;   2;  1;
 56; 17:27:38,786;   5;   2;  0;
 56; 17:27:38,979;   1;   5;  2;; not_moved
 56; 17:27:39,450;   0;   2;  1;; not_moved
 56; 17:27:39,556;   0;   3;  1;
 56; 17:27:39,878;   5;   2;  0;; not_moved
 56; 17:27:39,904;   5;   3;  0;
 56; 17:27:40,514;   0;   4;  1;
 56; 17:27:40,849;   5;   3;  1;
 56; 17:27:41,552;   0;   4;  1;; not_moved
 56; 17:27:41,614;   0;   5;  2;
 56; 17:27:41,620;   5;   4;  1;
 56; 17:27:42,510;   5;   5;  2;
 56; 17:27:42,512;  -1;   0;  0;
 56; 17:27:42,512;   0;   0;  0;; not_moved
 56; 17:27:42,512;   1;   0;  0;; not_moved
 56; 17:27:42,512;   2;   0;  0;; not_moved
 56; 17:27:42,512;   3;   0;  0;; not_moved
 56; 17:27:42,512;   4;   0;  0;; not_moved
 56; 17:27:42,512;   5;   0;  0;; not_moved
 56; 17:27:42,512;   6;  -5; -2;; not_moved
 56; 17:27:42,512;   7;   3;  5;; not_moved
 56; 17:27:42,512;   8;   5;  2;; not_moved
 56; 17:27:42,512;   9;  -3; -5;; not_moved
 56; 17:27:51,196;   3;  -1;  0;
 56; 17:27:51,552;   2;   1;  1;
 56; 17:27:52,289;   3;  -1;  0;; not_moved
 56; 17:27:52,565;   2;   1;  1;; not_moved
 56; 17:27:55,557;   2;   1;  2;
 56; 17:27:55,935;   3;  -2; -1;
 56; 17:27:56,335;   0;  -1;  0;
 56; 17:27:56,569;   2;   1;  2;; not_moved
 56; 17:27:56,677;   3;  -3; -1;
 56; 17:27:56,880;   1;  -1;  0;
 56; 17:27:57,370;   0;  -1;  0;; not_moved
 56; 17:27:57,504;   3;  -4; -2;
 56; 17:27:57,901;   1;  -1;  0;; not_moved
 56; 17:27:57,961;   0;  -2; -1;
 56; 17:27:57,969;   4;  -1;  0;
 56; 17:27:58,129;   3;  -5; -2;
 56; 17:27:58,186;   1;  -2; -1;
 56; 17:27:58,760;   0;  -3; -1;
 56; 17:27:58,971;   4;  -1;  0;; not_moved
 56; 17:27:59,043;   4;  -2; -1;
 56; 17:27:59,113;   1;  -3; -1;
 56; 17:27:59,200;   3;  -5; -2;; not_moved
 56; 17:27:59,485;   2;   2;  3;
 56; 17:27:59,561;   5;  -1; -1;
 56; 17:27:59,573;   0;  -4; -2;
 56; 17:27:59,900;   4;  -3; -1;
 56; 17:28:00,088;   1;  -4; -2;
 56; 17:28:00,126;   2;   3;  4;
 56; 17:28:00,337;   5;  -1;  0;
 56; 17:28:00,404;   0;  -5; -2;
 56; 17:28:00,764;   4;  -4; -2;
 56; 17:28:00,900;   2;   3;  5;
 56; 17:28:01,001;   5;  -2; -1;
 56; 17:28:01,061;   1;  -5; -2;
 56; 17:28:01,516;   0;  -5; -2;; not_moved
 56; 17:28:01,688;   5;  -2; -2;
 56; 17:28:01,738;   4;  -5; -2;
 56; 17:28:02,016;   2;   3;  5;; not_moved
 56; 17:28:02,107;   1;  -5; -2;; not_moved
 56; 17:28:02,251;   5;  -3; -2;
 56; 17:28:02,776;   4;  -5; -2;; not_moved
 56; 17:28:03,077;   5;  -3; -1;
 56; 17:28:03,648;   5;  -4; -2;
 56; 17:28:04,287;   5;  -5; -2;
 56; 17:28:04,290;  -1;   0;  0;
 56; 17:28:04,290;   0;   0;  0;; not_moved
 56; 17:28:04,290;   1;   0;  0;; not_moved
 56; 17:28:04,290;   2;   0;  0;; not_moved
 56; 17:28:04,290;   3;   0;  0;; not_moved
 56; 17:28:04,290;   4;   0;  0;; not_moved
 56; 17:28:04,290;   5;   0;  0;; not_moved
 56; 17:28:04,290;   6;  -5; -2;; not_moved
 56; 17:28:04,290;   7;   5;  2;; not_moved
 56; 17:28:04,290;   8;   2; -3;; not_moved
 56; 17:28:04,290;   9;   3;  5;; not_moved
 56; 17:28:13,180;   0;   1;  0;
 56; 17:28:13,727;   2;   1;  0;
 56; 17:28:14,154;   0;   2;  0;
 56; 17:28:14,796;   2;   1;  0;; not_moved
 56; 17:28:15,198;   0;   2;  0;; not_moved
 56; 17:28:15,208;   2;   2;  0;
 56; 17:28:15,229;   0;   3;  1;
 56; 17:28:15,364;   3;   1;  0;
 56; 17:28:15,822;   4;   1;  1;
 56; 17:28:16,233;   0;   4;  1;
 56; 17:28:16,298;   2;   2;  0;; not_moved
 56; 17:28:16,424;   3;   1;  0;; not_moved
 56; 17:28:16,532;   2;   3;  1;
 56; 17:28:16,656;   3;   2;  0;
 56; 17:28:16,897;   4;   1;  1;; not_moved
 56; 17:28:16,917;   4;   2;  2;
 56; 17:28:16,999;   1;   1;  0;
 56; 17:28:17,181;   3;   3;  1;
 56; 17:28:17,234;   0;   5;  2;
 56; 17:28:17,499;   2;   3;  1;; not_moved
 56; 17:28:17,634;   2;   4;  1;
 56; 17:28:17,808;   1;   2;  0;
 56; 17:28:17,868;   4;   2;  3;
 56; 17:28:17,904;   3;   4;  1;
 56; 17:28:17,983;   5;   1;  0;
 56; 17:28:18,313;   2;   5;  2;
 56; 17:28:18,339;   0;   5;  2;; not_moved
 56; 17:28:18,450;   1;   3;  1;
 56; 17:28:18,507;   4;   3;  4;
 56; 17:28:18,552;   3;   5;  2;
 56; 17:28:18,776;   5;   1;  1;
 56; 17:28:19,184;   1;   4;  1;
 56; 17:28:19,304;   4;   3;  5;
 56; 17:28:19,444;   2;   5;  2;; not_moved
 56; 17:28:19,629;   3;   5;  2;; not_moved
 56; 17:28:19,829;   5;   1;  1;; not_moved
 56; 17:28:19,914;   1;   5;  2;
 56; 17:28:20,184;   5;   2;  2;
 56; 17:28:20,301;   4;   3;  5;; not_moved
 56; 17:28:20,800;   5;   2;  1;
 56; 17:28:20,933;   1;   5;  2;; not_moved
 56; 17:28:21,831;   5;   2;  1;; not_moved
 56; 17:28:22,511;   5;   3;  1;
 56; 17:28:23,455;   5;   4;  1;
 56; 17:28:24,064;   5;   5;  1;
 56; 17:28:24,606;   5;   5;  2;
 56; 17:28:24,608;  -1;   0;  0;
 56; 17:28:24,608;   0;   0;  0;; not_moved
 56; 17:28:24,608;   1;   0;  0;; not_moved
 56; 17:28:24,608;   2;   0;  0;; not_moved
 56; 17:28:24,608;   3;   0;  0;; not_moved
 56; 17:28:24,608;   4;   0;  0;; not_moved
 56; 17:28:24,608;   5;   0;  0;; not_moved
 56; 17:28:24,608;   6;  -5; -3;; not_moved
 56; 17:28:24,608;   7;  -3;  2;; not_moved
 56; 17:28:24,608;   8;   3; -2;; not_moved
 56; 17:28:24,608;   9;  -2; -5;; not_moved
 56; 17:28:33,538;   4;  -1; -1;
 56; 17:28:33,942;   3;  -1; -1;
 56; 17:28:34,340;   4;  -2; -2;
 56; 17:28:34,640;   3;  -2; -2;
 56; 17:28:34,715;   0;  -1; -1;
 56; 17:28:34,831;   2;  -1; -1;
 56; 17:28:35,144;   4;  -3; -2;
 56; 17:28:35,198;   3;  -3; -2;
 56; 17:28:35,732;   0;  -1; -1;; not_moved
 56; 17:28:35,794;   3;  -4; -3;
 56; 17:28:35,847;   0;  -2; -2;
 56; 17:28:35,909;   2;  -2; -2;
 56; 17:28:36,001;   4;  -4; -3;
 56; 17:28:36,362;   3;  -5; -3;
 56; 17:28:36,682;   2;  -3; -2;
 56; 17:28:36,807;   4;  -5; -3;
 56; 17:28:36,874;   1;  -1; -1;
 56; 17:28:36,933;   0;  -2; -2;; not_moved
 56; 17:28:37,451;   3;  -5; -3;; not_moved
 56; 17:28:37,515;   1;  -2; -2;
 56; 17:28:37,525;   2;  -4; -2;
 56; 17:28:37,827;   4;  -5; -3;; not_moved
 56; 17:28:37,920;   0;  -3; -2;
 56; 17:28:38,108;   1;  -3; -2;
 56; 17:28:38,147;   2;  -5; -3;
 56; 17:28:38,684;   1;  -4; -3;
 56; 17:28:38,713;   0;  -4; -3;
 56; 17:28:38,979;   5;  -1; -1;
 56; 17:28:39,272;   2;  -5; -3;; not_moved
 56; 17:28:39,345;   1;  -5; -3;
 56; 17:28:39,516;   0;  -5; -3;
 56; 17:28:39,608;   5;  -1;  0;
 56; 17:28:40,342;   5;  -2; -1;
 56; 17:28:40,360;   1;  -5; -3;; not_moved
 56; 17:28:40,545;   0;  -5; -3;; not_moved
 56; 17:28:40,934;   5;  -2; -2;
 56; 17:28:41,478;   5;  -3; -2;
 56; 17:28:42,223;   5;  -4; -2;
 56; 17:28:42,944;   5;  -4; -3;
 56; 17:28:43,552;   5;  -5; -3;
 56; 17:28:43,554;  -1;   0;  0;
 56; 17:28:43,554;   0;   0;  0;; not_moved
 56; 17:28:43,554;   1;   0;  0;; not_moved
 56; 17:28:43,554;   2;   0;  0;; not_moved
 56; 17:28:43,554;   3;   0;  0;; not_moved
 56; 17:28:43,554;   4;   0;  0;; not_moved
 56; 17:28:43,554;   5;   0;  0;; not_moved
 56; 17:28:43,554;   6;  -5; -3;; not_moved
 56; 17:28:43,554;   7;   2;  5;; not_moved
 56; 17:28:43,554;   8;  -2; -5;; not_moved
 56; 17:28:43,554;   9;  -3;  2;; not_moved
 56; 17:28:52,730;   2;  -1;  0;
 56; 17:28:53,756;   2;  -1;  0;; not_moved
 56; 17:28:53,832;   2;  -1;  1;
 56; 17:28:54,103;   3;  -1;  0;
 56; 17:28:54,115;   0;  -1;  0;
 56; 17:28:54,857;   2;  -1;  1;; not_moved
 56; 17:28:54,943;   3;  -1;  1;
 56; 17:28:55,163;   0;  -1;  0;; not_moved
 56; 17:28:55,220;   2;  -2;  1;
 56; 17:28:55,590;   0;  -2;  0;
 56; 17:28:55,775;   3;  -2;  1;
 56; 17:28:55,898;   5;  -1;  0;
 56; 17:28:56,072;   2;  -2;  2;
 56; 17:28:56,500;   3;  -2;  2;
 56; 17:28:56,526;   1;  -1;  0;
 56; 17:28:56,571;   5;  -2;  0;
 56; 17:28:56,620;   0;  -2;  1;
 56; 17:28:56,772;   2;  -3;  2;
 56; 17:28:57,142;   5;  -1;  1;
 56; 17:28:57,158;   3;  -3;  2;
 56; 17:28:57,584;   1;  -1;  0;; not_moved
 56; 17:28:57,600;   0;  -3;  1;
 56; 17:28:57,641;   4;  -1;  0;
 56; 17:28:57,669;   1;  -1;  1;
 56; 17:28:57,760;   2;  -3;  2;; not_moved
 56; 17:28:57,943;   5;  -2;  1;
 56; 17:28:58,182;   3;  -3;  2;; not_moved
 56; 17:28:58,440;   1;  -2;  1;
 56; 17:28:58,553;   5;  -2;  2;
 56; 17:28:58,621;   0;  -3;  2;
 56; 17:28:58,632;   4;  -2;  0;
 56; 17:28:59,430;   4;  -2;  1;
 56; 17:28:59,486;   1;  -2;  1;; not_moved
 56; 17:28:59,505;   1;  -3;  1;
 56; 17:28:59,572;   5;  -1;  3;
 56; 17:28:59,667;   0;  -3;  2;; not_moved
 56; 17:29:00,098;   5;  -2;  3;
 56; 17:29:00,331;   4;  -3;  1;
 56; 17:29:00,439;   1;  -3;  2;
 56; 17:29:00,754;   5;  -3;  2;
 56; 17:29:01,198;   4;  -3;  2;
 56; 17:29:01,201;  -1;   0;  0;
 56; 17:29:01,201;   0;   0;  0;; not_moved
 56; 17:29:01,201;   1;   0;  0;; not_moved
 56; 17:29:01,201;   2;   0;  0;; not_moved
 56; 17:29:01,201;   3;   0;  0;; not_moved
 56; 17:29:01,201;   4;   0;  0;; not_moved
 56; 17:29:01,201;   5;   0;  0;; not_moved
 56; 17:29:01,201;   6;  -5; -1;; not_moved
 56; 17:29:01,201;   7;  -1;  4;; not_moved
 56; 17:29:01,201;   8;  -4; -5;; not_moved
 56; 17:29:01,201;   9;   1; -4;; not_moved
 56; 17:29:10,091;   0;  -1; -1;
 56; 17:29:10,783;   4;   0;  1;
 56; 17:29:11,031;   0;  -2; -1;
 56; 17:29:11,358;   3;  -1; -1;
 56; 17:29:11,870;   4;   0;  1;; not_moved
 56; 17:29:12,085;   0;  -2; -1;; not_moved
 56; 17:29:12,224;   2;  -1; -1;
 56; 17:29:12,400;   3;  -1; -1;; not_moved
 56; 17:29:13,279;   2;  -1; -1;; not_moved
 56; 17:29:13,321;   0;  -3; -1;
 56; 17:29:13,680;   3;  -2; -1;
 56; 17:29:14,270;   3;  -3; -1;
 56; 17:29:14,390;   0;  -3; -1;; not_moved
 56; 17:29:14,398;   0;  -4; -1;
 56; 17:29:14,408;   2;  -2; -1;
 56; 17:29:14,845;   5;  -1;  0;
 56; 17:29:15,026;   3;  -4; -1;
 56; 17:29:15,197;   2;  -3; -1;
 56; 17:29:15,360;   0;  -5; -1;
 56; 17:29:15,458;   4;  -1;  1;
 56; 17:29:15,561;   1;   0;  1;
 56; 17:29:15,821;   3;  -5; -1;
 56; 17:29:15,859;   2;  -4; -1;
 56; 17:29:15,903;   5;  -1;  0;; not_moved
 56; 17:29:16,288;   5;  -2; -1;
 56; 17:29:16,393;   0;  -5; -1;; not_moved
 56; 17:29:16,463;   2;  -5; -1;
 56; 17:29:16,478;   4;  -1;  1;; not_moved
 56; 17:29:16,606;   1;   0;  1;; not_moved
 56; 17:29:16,820;   1;   0;  2;
 56; 17:29:16,906;   3;  -5; -1;; not_moved
 56; 17:29:17,169;   4;  -1;  2;
 56; 17:29:17,232;   5;  -2;  0;
 56; 17:29:17,484;   2;  -5; -1;; not_moved
 56; 17:29:17,807;   1;   0;  2;; not_moved
 56; 17:29:17,853;   1;   0;  3;
 56; 17:29:18,015;   4;  -1;  3;
 56; 17:29:18,087;   5;  -3; -1;
 56; 17:29:18,572;   1;  -1;  3;
 56; 17:29:18,709;   5;  -3;  0;
 56; 17:29:18,856;   4;  -1;  4;
 56; 17:29:19,340;   1;  -1;  4;
 56; 17:29:19,352;   5;  -4;  0;
 56; 17:29:19,775;   5;  -4; -1;
 56; 17:29:19,885;   4;  -1;  4;; not_moved
 56; 17:29:20,367;   5;  -5; -1;
 56; 17:29:20,368;  -1;   0;  0;
 56; 17:29:20,368;   0;   0;  0;; not_moved
 56; 17:29:20,368;   1;   0;  0;; not_moved
 56; 17:29:20,368;   2;   0;  0;; not_moved
 56; 17:29:20,368;   3;   0;  0;; not_moved
 56; 17:29:20,368;   4;   0;  0;; not_moved
 56; 17:29:20,368;   5;   0;  0;; not_moved
 56; 17:29:20,368;   6;  -2;  3;; not_moved
 56; 17:29:20,368;   7;  -3; -5;; not_moved
 56; 17:29:20,368;   8;   2; -3;; not_moved
 56; 17:29:20,368;   9;   5;  2;; not_moved
 56; 17:29:28,738;   4;   0; -1;
 56; 17:29:29,355;   0;   1;  0;
 56; 17:29:29,529;   4;   1; -1;
 56; 17:29:29,540;   2;   0; -1;
 56; 17:29:30,366;   4;   1; -2;
 56; 17:29:30,411;   0;   1;  0;; not_moved
 56; 17:29:30,413;   3;   0; -1;
 56; 17:29:30,534;   2;   1; -1;
 56; 17:29:31,241;   2;   1; -2;
 56; 17:29:31,256;   3;   1; -1;
 56; 17:29:31,400;   4;   1; -2;; not_moved
 56; 17:29:31,758;   0;   2;  0;
 56; 17:29:31,834;   4;   1; -3;
 56; 17:29:31,958;   3;   1; -2;
 56; 17:29:32,128;   1;   1;  0;
 56; 17:29:32,165;   2;   2; -2;
 56; 17:29:32,391;   5;   0; -1;
 56; 17:29:32,773;   3;   1; -3;
 56; 17:29:32,779;   0;   2; -1;
 56; 17:29:32,789;   1;   1; -1;
 56; 17:29:32,835;   4;   1; -3;; not_moved
 56; 17:29:32,858;   2;   2; -3;
 56; 17:29:33,004;   4;   2; -3;
 56; 17:29:33,424;   5;   0; -1;; not_moved
 56; 17:29:33,460;   1;   1; -2;
 56; 17:29:33,500;   3;   2; -3;
 56; 17:29:33,533;   5;   0; -2;
 56; 17:29:33,749;   0;   2; -2;
 56; 17:29:33,912;   2;   2; -3;; not_moved
 56; 17:29:34,004;   4;   2; -3;; not_moved
 56; 17:29:34,147;   1;   2; -2;
 56; 17:29:34,376;   5;   1; -1;
 56; 17:29:34,528;   3;   2; -3;; not_moved
 56; 17:29:34,722;   0;   2; -3;
 56; 17:29:34,894;   1;   2; -3;
 56; 17:29:34,945;   5;   1; -2;
 56; 17:29:35,655;   5;   0; -3;
 56; 17:29:35,860;   0;   2; -3;; not_moved
 56; 17:29:35,930;   1;   2; -3;; not_moved
 56; 17:29:36,143;   5;   0; -4;
 56; 17:29:36,761;   5;   1; -3;
 56; 17:29:37,489;   5;   2; -3;
 56; 17:29:37,490;  -1;   0;  0;
 56; 17:29:37,490;   0;   0;  0;; not_moved
 56; 17:29:37,490;   1;   0;  0;; not_moved
 56; 17:29:37,490;   2;   0;  0;; not_moved
 56; 17:29:37,490;   3;   0;  0;; not_moved
 56; 17:29:37,490;   4;   0;  0;; not_moved
 56; 17:29:37,490;   5;   0;  0;; not_moved
 56; 17:29:37,490;   6;  -5; -3;; not_moved
 56; 17:29:37,490;   7;   5;  3;; not_moved
 56; 17:29:37,490;   8;  -2; -5;; not_moved
 56; 17:29:37,490;   9;   2;  5;; not_moved
 56; 17:29:46,852;   0;  -1; -1;
 56; 17:29:47,823;   0;  -1; -2;
 56; 17:29:47,829;   2;  -1; -1;
 56; 17:29:48,407;   3;  -1; -1;
 56; 17:29:48,831;   0;  -1; -2;; not_moved
 56; 17:29:48,834;   2;  -1; -1;; not_moved
 56; 17:29:48,914;   0;  -1; -3;
 56; 17:29:48,916;   2;  -1; -2;
 56; 17:29:49,233;   3;  -1; -2;
 56; 17:29:49,498;   2;  -1; -3;
 56; 17:29:49,584;   1;  -1; -1;
 56; 17:29:49,710;   4;  -1; -1;
 56; 17:29:49,932;   0;  -1; -3;; not_moved
 56; 17:29:49,960;   3;  -1; -3;
 56; 17:29:50,169;   2;  -2; -4;
 56; 17:29:50,172;   0;  -1; -4;
 56; 17:29:50,297;   1;  -1; -2;
 56; 17:29:50,680;   3;  -1; -4;
 56; 17:29:50,709;   2;  -2; -5;
 56; 17:29:50,726;   4;  -1; -1;; not_moved
 56; 17:29:50,734;   5;  -1; -1;
 56; 17:29:51,081;   0;  -2; -5;
 56; 17:29:51,130;   1;  -1; -3;
 56; 17:29:51,438;   3;  -2; -5;
 56; 17:29:51,482;   5;   0; -1;
 56; 17:29:51,656;   4;  -1; -2;
 56; 17:29:51,738;   2;  -2; -5;; not_moved
 56; 17:29:51,802;   1;  -2; -4;
 56; 17:29:52,135;   0;  -2; -5;; not_moved
 56; 17:29:52,142;   5;  -1; -2;
 56; 17:29:52,373;   4;  -1; -3;
 56; 17:29:52,455;   3;  -2; -5;; not_moved
 56; 17:29:52,461;   1;  -2; -5;
 56; 17:29:52,712;   5;   0; -2;
 56; 17:29:53,226;   4;  -2; -4;
 56; 17:29:53,311;   5;  -1; -3;
 56; 17:29:53,551;   1;  -2; -5;; not_moved
 56; 17:29:53,900;   5;  -2; -3;
 56; 17:29:54,230;   4;  -2; -4;; not_moved
 56; 17:29:54,412;   4;  -2; -5;
 56; 17:29:54,952;   5;  -2; -3;; not_moved
 56; 17:29:55,432;   4;  -2; -5;; not_moved
 56; 17:29:55,493;   5;  -2; -4;
 56; 17:29:56,054;   5;  -2; -5;
 56; 17:29:56,057;  -1;   0;  0;
 56; 17:29:56,057;   0;   0;  0;; not_moved
 56; 17:29:56,057;   1;   0;  0;; not_moved
 56; 17:29:56,057;   2;   0;  0;; not_moved
 56; 17:29:56,057;   3;   0;  0;; not_moved
 56; 17:29:56,057;   4;   0;  0;; not_moved
 56; 17:29:56,057;   5;   0;  0;; not_moved
 56; 17:29:56,057;   6;   5;  4;; not_moved
 56; 17:29:56,057;   7;  -5; -4;; not_moved
 56; 17:29:56,057;   8;   4; -1;; not_moved
 56; 17:29:56,057;   9;   1;  5;; not_moved
 56; 17:30:04,501;   4;  -1; -1;
 56; 17:30:04,691;   0;   1;  1;
 56; 17:30:05,543;   4;  -1; -1;; not_moved
 56; 17:30:05,754;   0;   1;  1;; not_moved
 56; 17:30:05,921;   3;  -1; -1;
 56; 17:30:06,762;   3;  -2; -2;
 56; 17:30:07,396;   4;  -2; -2;
 56; 17:30:07,505;   2;  -1; -1;
 56; 17:30:07,824;   3;  -2; -2;; not_moved
 56; 17:30:08,085;   1;  -1; -1;
 56; 17:30:08,136;   3;  -3; -3;
 56; 17:30:08,249;   4;  -3; -3;
 56; 17:30:08,525;   2;  -2; -2;
 56; 17:30:08,637;   0;   2;  2;
 56; 17:30:08,733;   3;  -4; -4;
 56; 17:30:09,032;   1;  -2; -2;
 56; 17:30:09,087;   4;  -4; -3;
 56; 17:30:09,414;   3;  -5; -4;
 56; 17:30:09,463;   5;  -1; -1;
 56; 17:30:09,567;   2;  -2; -2;; not_moved
 56; 17:30:09,661;   0;   2;  2;; not_moved
 56; 17:30:09,818;   1;  -3; -3;
 56; 17:30:09,887;   4;  -5; -4;
 56; 17:30:09,912;   2;  -3; -3;
 56; 17:30:09,964;   0;   3;  3;
 56; 17:30:10,487;   3;  -5; -4;; not_moved
 56; 17:30:10,520;   5;  -1; -1;; not_moved
 56; 17:30:10,537;   2;  -4; -4;
 56; 17:30:10,539;   1;  -4; -4;
 56; 17:30:10,554;   5;  -1; -2;
 56; 17:30:10,753;   0;   4;  3;
 56; 17:30:10,992;   4;  -5; -4;; not_moved
 56; 17:30:11,232;   5;  -2; -3;
 56; 17:30:11,277;   2;  -5; -4;
 56; 17:30:11,309;   1;  -5; -4;
 56; 17:30:11,566;   0;   5;  4;
 56; 17:30:11,829;   5;  -2; -2;
 56; 17:30:12,343;   5;  -3; -3;
 56; 17:30:12,377;   1;  -5; -4;; not_moved
 56; 17:30:12,392;   2;  -5; -4;; not_moved
 56; 17:30:12,708;   0;   5;  4;; not_moved
 56; 17:30:12,888;   5;  -3; -4;
 56; 17:30:13,375;   5;  -4; -4;
 56; 17:30:13,944;   5;  -5; -4;
 56; 17:30:13,947;  -1;   0;  0;
 56; 17:30:13,947;   0;   0;  0;; not_moved
 56; 17:30:13,947;   1;   0;  0;; not_moved
 56; 17:30:13,947;   2;   0;  0;; not_moved
 56; 17:30:13,947;   3;   0;  0;; not_moved
 56; 17:30:13,947;   4;   0;  0;; not_moved
 56; 17:30:13,947;   5;   0;  0;; not_moved
 56; 17:30:13,947;   6;   5;  1;; not_moved
 56; 17:30:13,947;   7;  -5; -1;; not_moved
 56; 17:30:13,947;   8;  -4; -5;; not_moved
 56; 17:30:13,947;   9;  -1;  4;; not_moved
 56; 17:30:24,059;   0;  -1;  0;
 56; 17:30:24,061;   3;   1;  0;
 56; 17:30:24,878;   3;   2;  0;
 56; 17:30:25,084;   0;  -1;  0;; not_moved
 56; 17:30:25,910;   3;   2;  0;; not_moved
 56; 17:30:26,369;   1;   1;  0;
 56; 17:30:26,383;   0;  -2;  0;
 56; 17:30:26,516;   4;   1;  0;
 56; 17:30:27,366;   3;   3;  0;
 56; 17:30:27,379;   1;   2;  0;
 56; 17:30:27,387;   0;  -2;  0;; not_moved
 56; 17:30:27,472;   0;  -3;  0;
 56; 17:30:27,576;   4;   1;  0;; not_moved
 56; 17:30:27,771;   2;  -1;  0;
 56; 17:30:28,017;   3;   4;  0;
 56; 17:30:28,240;   4;   2;  0;
 56; 17:30:28,387;   1;   3;  0;
 56; 17:30:28,492;   0;  -3;  0;; not_moved
 56; 17:30:28,505;   0;  -4; -1;
 56; 17:30:28,683;   3;   5;  1;
 56; 17:30:28,794;   2;  -1;  0;; not_moved
 56; 17:30:29,102;   2;  -2;  0;
 56; 17:30:29,122;   4;   3;  0;
 56; 17:30:29,360;   1;   4;  0;
 56; 17:30:29,427;   0;  -5; -1;
 56; 17:30:29,573;   5;   1;  0;
 56; 17:30:29,733;   3;   5;  1;; not_moved
 56; 17:30:29,885;   2;  -3;  0;
 56; 17:30:29,924;   4;   4;  1;
 56; 17:30:30,145;   1;   5;  1;
 56; 17:30:30,374;   5;   1; -1;
 56; 17:30:30,396;   2;  -4; -1;
 56; 17:30:30,494;   0;  -5; -1;; not_moved
 56; 17:30:30,737;   4;   5;  1;
 56; 17:30:30,809;   2;  -5; -1;
 56; 17:30:31,201;   1;   5;  1;; not_moved
 56; 17:30:31,404;   5;   2;  0;
 56; 17:30:31,782;   4;   5;  1;; not_moved
 56; 17:30:31,899;   2;  -5; -1;; not_moved
 56; 17:30:31,983;   5;   2; -1;
 56; 17:30:32,564;   5;   3; -1;
 56; 17:30:33,011;   5;   3; -2;
 56; 17:30:34,015;   5;   3; -2;; not_moved
 56; 17:30:34,265;   5;   4; -1;
 56; 17:30:35,317;   5;   4; -1;; not_moved
 56; 17:30:35,904;   5;   4;  0;
 56; 17:30:35,907;  -1;   0;  0;
 56; 17:30:35,907;   0;   0;  0;; not_moved
 56; 17:30:35,907;   1;   0;  0;; not_moved
 56; 17:30:35,907;   2;   0;  0;; not_moved
 56; 17:30:35,907;   3;   0;  0;; not_moved
 56; 17:30:35,907;   4;   0;  0;; not_moved
 56; 17:30:35,907;   5;   0;  0;; not_moved
 56; 17:30:35,907;   6;  -1; -5;; not_moved
 56; 17:30:35,907;   7;   4; -1;; not_moved
 56; 17:30:35,907;   8;  -5; -4;; not_moved
 56; 17:30:35,907;   9;   5;  4;; not_moved
 56; 17:30:46,122;   0;   1;  1;
 56; 17:30:46,740;   2;   0; -1;
 56; 17:30:47,219;   0;   1;  1;; not_moved
 56; 17:30:47,819;   2;   0; -1;; not_moved
 56; 17:30:48,132;   2;   0; -2;
 56; 17:30:48,432;   3;   0; -1;
 56; 17:30:48,433;   0;   2;  2;
 56; 17:30:49,221;   2;   0; -2;; not_moved
 56; 17:30:49,239;   3;   0; -2;
 56; 17:30:49,361;   1;   0; -1;
 56; 17:30:49,438;   0;   3;  3;
 56; 17:30:49,896;   2;   0; -3;
 56; 17:30:50,124;   3;   0; -3;
 56; 17:30:50,337;   1;   0; -2;
 56; 17:30:50,460;   4;   0; -1;
 56; 17:30:50,516;   0;   4;  3;
 56; 17:30:50,922;   2;   0; -4;
 56; 17:30:51,183;   3;   0; -3;; not_moved
 56; 17:30:51,186;   3;   0; -4;
 56; 17:30:51,188;   1;   0; -3;
 56; 17:30:51,202;   4;   0; -2;
 56; 17:30:51,526;   0;   4;  3;; not_moved
 56; 17:30:51,602;   0;   5;  4;
 56; 17:30:51,814;   5;   0; -1;
 56; 17:30:51,835;   2;  -1; -5;
 56; 17:30:51,863;   4;   0; -3;
 56; 17:30:51,959;   3;  -1; -5;
 56; 17:30:52,011;   1;   0; -4;
 56; 17:30:52,584;   4;   0; -4;
 56; 17:30:52,627;   0;   5;  4;; not_moved
 56; 17:30:52,836;   1;  -1; -5;
 56; 17:30:52,842;   5;   0; -1;; not_moved
 56; 17:30:52,929;   2;  -1; -5;; not_moved
 56; 17:30:52,985;   3;  -1; -5;; not_moved
 56; 17:30:53,361;   4;  -1; -5;
 56; 17:30:53,368;   5;  -1; -2;
 56; 17:30:53,833;   1;  -1; -5;; not_moved
 56; 17:30:53,954;   5;   0; -2;
 56; 17:30:54,413;   4;  -1; -5;; not_moved
 56; 17:30:54,679;   5;  -1; -3;
 56; 17:30:55,407;   5;   0; -3;
 56; 17:30:56,446;   5;   0; -3;; not_moved
 56; 17:30:57,455;   5;  -1; -4;
 56; 17:30:58,118;   5;   0; -4;
 56; 17:30:58,718;   5;  -1; -5;
 56; 17:30:58,721;  -1;   0;  0;
 56; 17:30:58,721;   0;   0;  0;; not_moved
 56; 17:30:58,721;   1;   0;  0;; not_moved
 56; 17:30:58,721;   2;   0;  0;; not_moved
 56; 17:30:58,721;   3;   0;  0;; not_moved
 56; 17:30:58,721;   4;   0;  0;; not_moved
 56; 17:30:58,721;   5;   0;  0;; not_moved
 56; 17:30:58,721;   6;   5;  1;; not_moved
 56; 17:30:58,721;   7;  -1;  4;; not_moved
 56; 17:30:58,721;   8;   1; -4;; not_moved
 56; 17:30:58,721;   9;   4;  5;; not_moved
 56; 17:31:06,579;   4;   0;  1;
 56; 17:31:07,629;   4;   0;  1;; not_moved
 56; 17:31:07,850;   4;  -1;  1;
 56; 17:31:08,415;   0;   0;  1;
 56; 17:31:08,821;   4;  -1;  2;
 56; 17:31:09,167;   1;   0;  1;
 56; 17:31:09,180;   3;   0;  1;
 56; 17:31:09,450;   0;   0;  1;; not_moved
 56; 17:31:09,716;   4;  -1;  3;
 56; 17:31:09,741;   0;   0;  2;
 56; 17:31:10,191;   2;   0;  1;
 56; 17:31:10,208;   3;   0;  1;; not_moved
 56; 17:31:10,224;   1;   0;  2;
 56; 17:31:10,298;   3;   0;  2;
 56; 17:31:10,613;   5;   0;  1;
 56; 17:31:10,667;   4;  -1;  4;
 56; 17:31:10,733;   0;   0;  3;
 56; 17:31:10,857;   3;  -1;  2;
 56; 17:31:11,105;   1;   0;  3;
 56; 17:31:11,252;   2;   0;  1;; not_moved
 56; 17:31:11,281;   2;   0;  2;
 56; 17:31:11,408;   5;  -1;  1;
 56; 17:31:11,497;   3;  -1;  3;
 56; 17:31:11,784;   4;  -1;  4;; not_moved
 56; 17:31:11,800;   0;   0;  3;; not_moved
 56; 17:31:11,800;   0;   0;  4;
 56; 17:31:11,967;   1;  -1;  3;
 56; 17:31:11,990;   5;   0;  2;
 56; 17:31:12,183;   3;  -1;  4;
 56; 17:31:12,354;   2;   0;  2;; not_moved
 56; 17:31:12,533;   5;  -1;  2;
 56; 17:31:12,673;   0;  -1;  4;
 56; 17:31:12,940;   1;  -1;  4;
 56; 17:31:13,211;   3;  -1;  4;; not_moved
 56; 17:31:13,393;   5;   0;  3;
 56; 17:31:13,761;   0;  -1;  4;; not_moved
 56; 17:31:13,962;   1;  -1;  4;; not_moved
 56; 17:31:14,471;   5;   0;  3;; not_moved
 56; 17:31:14,522;   5;   0;  4;
 56; 17:31:15,128;   2;   0;  3;
 56; 17:31:15,279;   5;  -1;  3;
 56; 17:31:15,879;   5;  -1;  4;
 56; 17:31:15,902;   2;   0;  4;
 56; 17:31:16,712;   2;  -1;  4;
 56; 17:31:16,715;  -1;   0;  0;
 56; 17:31:16,715;   0;   0;  0;; not_moved
 56; 17:31:16,715;   1;   0;  0;; not_moved
 56; 17:31:16,715;   2;   0;  0;; not_moved
 56; 17:31:16,715;   3;   0;  0;; not_moved
 56; 17:31:16,715;   4;   0;  0;; not_moved
 56; 17:31:16,715;   5;   0;  0;; not_moved
 56; 17:31:16,715;   6;  -1; -5;; not_moved
 56; 17:31:16,715;   7;   1;  5;; not_moved
 56; 17:31:16,715;   8;   5;  4;; not_moved
 56; 17:31:16,715;   9;   4; -1;; not_moved
 56; 17:31:25,498;   2;   1;  1;
 56; 17:31:26,575;   2;   1;  1;; not_moved
 56; 17:31:27,057;   0;   1;  1;
 56; 17:31:27,650;   2;   2;  2;
 56; 17:31:27,777;   3;   1;  1;
 56; 17:31:27,987;   1;   1;  1;
 56; 17:31:28,082;   0;   1;  1;; not_moved
 56; 17:31:28,206;   4;   1;  1;
 56; 17:31:28,532;   0;   2;  2;
 56; 17:31:28,608;   2;   3;  3;
 56; 17:31:28,756;   3;   2;  2;
 56; 17:31:28,972;   1;   2;  2;
 56; 17:31:29,265;   4;   1;  1;; not_moved
 56; 17:31:29,583;   0;   2;  2;; not_moved
 56; 17:31:29,586;   4;   2;  2;
 56; 17:31:29,607;   0;   3;  3;
 56; 17:31:29,679;   2;   3;  3;; not_moved
 56; 17:31:29,688;   2;   4;  4;
 56; 17:31:29,718;   3;   3;  3;
 56; 17:31:29,758;   1;   3;  3;
 56; 17:31:30,413;   1;   4;  3;
 56; 17:31:30,523;   0;   4;  3;
 56; 17:31:30,537;   4;   3;  3;
 56; 17:31:30,587;   2;   5;  4;
 56; 17:31:30,734;   3;   3;  3;; not_moved
 56; 17:31:30,855;   3;   4;  4;
 56; 17:31:31,359;   1;   5;  4;
 56; 17:31:31,407;   0;   5;  4;
 56; 17:31:31,567;   4;   3;  3;; not_moved
 56; 17:31:31,648;   4;   4;  4;
 56; 17:31:31,695;   2;   5;  4;; not_moved
 56; 17:31:31,735;   3;   5;  4;
 56; 17:31:32,428;   1;   5;  4;; not_moved
 56; 17:31:32,487;   0;   5;  4;; not_moved
 56; 17:31:32,609;   4;   5;  4;
 56; 17:31:32,737;   3;   5;  4;; not_moved
 56; 17:31:32,890;   5;   1;  1;
 56; 17:31:33,672;   4;   5;  4;; not_moved
 56; 17:31:33,936;   5;   1;  1;; not_moved
 56; 17:31:34,477;   5;   2;  1;
 56; 17:31:35,285;   5;   2;  2;
 56; 17:31:36,006;   5;   3;  2;
 56; 17:31:37,038;   5;   3;  3;
 56; 17:31:38,100;   5;   3;  3;; not_moved
 56; 17:31:38,222;   5;   4;  4;
 56; 17:31:38,681;   5;   4;  3;
 56; 17:31:39,456;   5;   5;  4;
 56; 17:31:39,458;  -1;   0;  0;
 56; 17:31:39,458;   0;   0;  0;; not_moved
 56; 17:31:39,458;   1;   0;  0;; not_moved
 56; 17:31:39,458;   2;   0;  0;; not_moved
 56; 17:31:39,458;   3;   0;  0;; not_moved
 56; 17:31:39,458;   4;   0;  0;; not_moved
 56; 17:31:39,458;   5;   0;  0;; not_moved
 56; 17:31:39,458;   6;   5;  2;; not_moved
 56; 17:31:39,458;   7;   2; -3;; not_moved
 56; 17:31:39,458;   8;  -3; -5;; not_moved
 56; 17:31:39,458;   9;  -5; -2;; not_moved
 56; 17:31:48,244;   4;  -1;  0;
 56; 17:31:48,728;   1;   1;  0;
 56; 17:31:49,296;   4;  -1;  0;; not_moved
 56; 17:31:49,497;   4;  -2; -1;
 56; 17:31:49,748;   3;  -1; -1;
 56; 17:31:49,822;   1;   1;  0;; not_moved
 56; 17:31:50,540;   4;  -2; -1;; not_moved
 56; 17:31:50,575;   3;  -2; -1;
 56; 17:31:50,907;   0;   1;  0;
 56; 17:31:51,520;   4;  -3; -1;
 56; 17:31:51,537;   3;  -3; -1;
 56; 17:31:51,589;   1;   0;  0;
 56; 17:31:51,718;   5;  -1;  0;
 56; 17:31:51,952;   0;   1;  0;; not_moved
 56; 17:31:52,081;   2;  -1; -1;
 56; 17:31:52,444;   4;  -4; -2;
 56; 17:31:52,476;   0;   2;  0;
 56; 17:31:52,562;   3;  -3; -1;; not_moved
 56; 17:31:52,639;   1;   0;  0;; not_moved
 56; 17:31:52,685;   1;  -1; -1;
 56; 17:31:52,719;   5;  -1;  0;; not_moved
 56; 17:31:53,110;   2;  -1; -1;; not_moved
 56; 17:31:53,118;   2;  -2; -1;
 56; 17:31:53,122;   3;  -4; -2;
 56; 17:31:53,330;   4;  -5; -2;
 56; 17:31:53,351;   5;  -2; -1;
 56; 17:31:53,511;   0;   2;  0;; not_moved
 56; 17:31:53,719;   2;  -3; -1;
 56; 17:31:53,740;   1;  -1; -1;; not_moved
 56; 17:31:53,750;   0;   3;  1;
 56; 17:31:53,775;   1;  -2; -1;
 56; 17:31:54,115;   5;  -2;  0;
 56; 17:31:54,150;   3;  -5; -2;
 56; 17:31:54,300;   2;  -4; -2;
 56; 17:31:54,403;   4;  -5; -2;; not_moved
 56; 17:31:54,744;   1;  -3; -1;
 56; 17:31:54,813;   0;   3;  1;; not_moved
 56; 17:31:54,816;   2;  -5; -2;
 56; 17:31:54,928;   0;   4;  1;
 56; 17:31:55,076;   5;  -3; -1;
 56; 17:31:55,165;   3;  -5; -2;; not_moved
 56; 17:31:55,674;   1;  -4; -2;
 56; 17:31:55,798;   5;  -3; -2;
 56; 17:31:55,914;   2;  -5; -2;; not_moved
 56; 17:31:55,959;   0;   5;  2;
 56; 17:31:56,553;   1;  -5; -2;
 56; 17:31:56,686;   5;  -4; -3;
 56; 17:31:57,016;   0;   5;  2;; not_moved
 56; 17:31:57,282;   5;  -4; -2;
 56; 17:31:57,555;   1;  -5; -2;; not_moved
 56; 17:31:58,116;   5;  -5; -2;
 56; 17:31:58,117;  -1;   0;  0;
 56; 17:31:58,117;   0;   0;  0;; not_moved
 56; 17:31:58,117;   1;   0;  0;; not_moved
 56; 17:31:58,117;   2;   0;  0;; not_moved
 56; 17:31:58,117;   3;   0;  0;; not_moved
 56; 17:31:58,117;   4;   0;  0;; not_moved
 56; 17:31:58,117;   5;   0;  0;; not_moved
 56; 17:31:58,117;   6;   4; -1;; not_moved
 56; 17:31:58,117;   7;   5;  4;; not_moved
 56; 17:31:58,117;   8;  -4;  1;; not_moved
 56; 17:31:58,117;   9;  -5; -4;; not_moved
 56; 17:32:07,310;   3;  -1;  0;
 56; 17:32:08,038;   3;  -1;  1;
 56; 17:32:09,128;   3;  -1;  1;; not_moved
 56; 17:32:09,544;   2;  -1; -1;
 56; 17:32:09,848;   4;  -1;  0;
 56; 17:32:09,876;   0;  -1;  0;
 56; 17:32:09,921;   1;  -1;  0;
 56; 17:32:10,635;   2;  -1; -1;; not_moved
 56; 17:32:10,714;   2;  -2; -1;
 56; 17:32:10,897;   3;  -2;  1;
 56; 17:32:10,929;   4;  -1;  0;; not_moved
 56; 17:32:10,937;   0;  -1;  0;; not_moved
 56; 17:32:10,945;   1;  -1;  1;
 56; 17:32:11,299;   2;  -2; -2;
 56; 17:32:11,802;   3;  -3;  1;
 56; 17:32:11,904;   2;  -3; -2;
 56; 17:32:11,920;   1;  -2;  1;
 56; 17:32:11,958;   0;  -1;  1;
 56; 17:32:11,980;   4;  -1;  1;
 56; 17:32:12,551;   3;  -4;  1;
 56; 17:32:12,805;   2;  -4; -3;
 56; 17:32:12,814;   4;  -2;  1;
 56; 17:32:12,878;   1;  -2;  1;; not_moved
 56; 17:32:12,885;   1;  -3;  1;
 56; 17:32:13,038;   0;  -2;  1;
 56; 17:32:13,259;   2;  -5; -4;
 56; 17:32:13,590;   3;  -4;  1;; not_moved
 56; 17:32:13,747;   1;  -4;  1;
 56; 17:32:13,851;   4;  -2;  1;; not_moved
 56; 17:32:14,004;   4;  -3;  1;
 56; 17:32:14,041;   0;  -2;  1;; not_moved
 56; 17:32:14,256;   0;  -3;  1;
 56; 17:32:14,340;   2;  -5; -4;; not_moved
 56; 17:32:14,780;   4;  -4;  1;
 56; 17:32:14,801;   1;  -4;  1;; not_moved
 56; 17:32:14,808;   0;  -4;  1;
 56; 17:32:15,094;   5;  -1;  0;
 56; 17:32:15,629;   5;  -1;  1;
 56; 17:32:15,836;   4;  -4;  1;; not_moved
 56; 17:32:15,843;   0;  -4;  1;; not_moved
 56; 17:32:16,160;   5;  -2;  0;
 56; 17:32:16,662;   5;  -2;  1;
 56; 17:32:17,197;   5;  -3;  0;
 56; 17:32:17,837;   5;  -3;  1;
 56; 17:32:18,432;   5;  -3;  2;
 56; 17:32:18,845;   5;  -4;  1;
 56; 17:32:18,848;  -1;   0;  0;
 56; 17:32:18,848;   0;   0;  0;; not_moved
 56; 17:32:18,848;   1;   0;  0;; not_moved
 56; 17:32:18,848;   2;   0;  0;; not_moved
 56; 17:32:18,848;   3;   0;  0;; not_moved
 56; 17:32:18,848;   4;   0;  0;; not_moved
 56; 17:32:18,848;   5;   0;  0;; not_moved
 56; 17:32:18,848;   6;  -1; -5;; not_moved
 56; 17:32:18,848;   7;  -5; -4;; not_moved
 56; 17:32:18,848;   8;  -4;  1;; not_moved
 56; 17:32:18,848;   9;   1;  5;; not_moved
 56; 17:32:26,524;   0;   0; -1;
 56; 17:32:27,326;   0;   0; -2;
 56; 17:32:28,181;   3;   0; -1;
 56; 17:32:28,265;   0;   0; -3;
 56; 17:32:28,293;   2;   0; -1;
 56; 17:32:28,584;   1;   0; -1;
 56; 17:32:28,780;   3;   1; -1;
 56; 17:32:28,963;   4;   0; -1;
 56; 17:32:29,228;   0;   0; -4;
 56; 17:32:29,359;   2;   0; -1;; not_moved
 56; 17:32:29,414;   3;   1; -2;
 56; 17:32:29,455;   2;   0; -2;
 56; 17:32:29,499;   1;   0; -2;
 56; 17:32:29,778;   4;   0; -2;
 56; 17:32:30,058;   0;  -1; -5;
 56; 17:32:30,141;   3;   1; -3;
 56; 17:32:30,257;   2;   0; -3;
 56; 17:32:30,294;   1;   0; -3;
 56; 17:32:30,526;   5;   0; -1;
 56; 17:32:30,631;   3;   1; -4;
 56; 17:32:30,855;   4;   0; -2;; not_moved
 56; 17:32:30,936;   4;   0; -3;
 56; 17:32:30,940;   2;  -1; -4;
 56; 17:32:31,029;   1;   0; -4;
 56; 17:32:31,063;   0;  -1; -5;; not_moved
 56; 17:32:31,355;   2;  -1; -5;
 56; 17:32:31,481;   5;   1; -1;
 56; 17:32:31,718;   3;   1; -4;; not_moved
 56; 17:32:31,836;   3;   0; -5;
 56; 17:32:31,893;   4;   0; -4;
 56; 17:32:31,992;   1;  -1; -5;
 56; 17:32:32,001;   5;   0; -2;
 56; 17:32:32,362;   2;  -1; -5;; not_moved
 56; 17:32:32,394;   3;  -1; -5;
 56; 17:32:32,580;   4;  -1; -5;
 56; 17:32:32,749;   5;   1; -2;
 56; 17:32:33,024;   1;  -1; -5;; not_moved
 56; 17:32:33,270;   5;   0; -3;
 56; 17:32:33,420;   3;  -1; -5;; not_moved
 56; 17:32:33,660;   4;  -1; -5;; not_moved
 56; 17:32:34,323;   5;   0; -3;; not_moved
 56; 17:32:34,739;   5;   0; -4;
 56; 17:32:35,188;   5;  -1; -4;
 56; 17:32:35,635;   5;  -1; -5;
 56; 17:32:35,638;  -1;   0;  0;
 56; 17:32:35,638;   0;   0;  0;; not_moved
 56; 17:32:35,638;   1;   0;  0;; not_moved
 56; 17:32:35,638;   2;   0;  0;; not_moved
 56; 17:32:35,638;   3;   0;  0;; not_moved
 56; 17:32:35,638;   4;   0;  0;; not_moved
 56; 17:32:35,638;   5;   0;  0;; not_moved
 56; 17:32:35,638;   6;   3; -2;; not_moved
 56; 17:32:35,638;   7;  -5; -3;; not_moved
 56; 17:32:35,638;   8;  -3;  2;; not_moved
 56; 17:32:35,638;   9;   5;  3;; not_moved
 56; 17:32:44,165;   0;   1;  0;
 56; 17:32:45,205;   2;   1;  0;
 56; 17:32:45,224;   0;   1;  0;; not_moved
 56; 17:32:45,224;   0;   2;  0;
 56; 17:32:45,989;   0;   2; -1;
 56; 17:32:46,094;   2;   2;  0;
 56; 17:32:46,768;   0;   2; -2;
 56; 17:32:47,024;   4;   1;  0;
 56; 17:32:47,184;   2;   2;  0;; not_moved
 56; 17:32:47,214;   3;   0; -1;
 56; 17:32:47,590;   0;   3; -2;
 56; 17:32:47,638;   2;   2; -1;
 56; 17:32:47,715;   1;   1;  0;
 56; 17:32:47,905;   3;   1; -1;
 56; 17:32:48,079;   4;   1;  0;; not_moved
 56; 17:32:48,223;   5;   1;  0;
 56; 17:32:48,395;   2;   2; -2;
 56; 17:32:48,510;   3;   2; -1;
 56; 17:32:48,517;   1;   2;  0;
 56; 17:32:48,672;   4;   2;  0;
 56; 17:32:48,696;   0;   3; -2;; not_moved
 56; 17:32:48,939;   2;   3; -2;
 56; 17:32:49,166;   3;   3; -1;
 56; 17:32:49,216;   1;   2; -1;
 56; 17:32:49,245;   5;   1;  0;; not_moved
 56; 17:32:49,262;   5;   2;  0;
 56; 17:32:49,452;   4;   2; -1;
 56; 17:32:49,796;   3;   3; -2;
 56; 17:32:49,852;   5;   1; -1;
 56; 17:32:49,864;   1;   2; -2;
 56; 17:32:49,987;   2;   3; -2;; not_moved
 56; 17:32:50,174;   4;   2; -2;
 56; 17:32:50,452;   5;   1; -2;
 56; 17:32:50,815;   1;   3; -2;
 56; 17:32:50,844;   3;   3; -2;; not_moved
 56; 17:32:51,013;   4;   3; -2;
 56; 17:32:51,149;   5;   2; -1;
 56; 17:32:51,857;   1;   3; -2;; not_moved
 56; 17:32:52,084;   4;   3; -2;; not_moved
 56; 17:32:52,150;   5;   2; -1;; not_moved
 56; 17:32:52,240;   5;   3; -1;
 56; 17:32:52,753;   5;   2; -2;
 56; 17:32:53,237;   5;   3; -2;
 56; 17:32:53,240;  -1;   0;  0;
 56; 17:32:53,240;   0;   0;  0;; not_moved
 56; 17:32:53,240;   1;   0;  0;; not_moved
 56; 17:32:53,240;   2;   0;  0;; not_moved
 56; 17:32:53,240;   3;   0;  0;; not_moved
 56; 17:32:53,240;   4;   0;  0;; not_moved
 56; 17:32:53,240;   5;   0;  0;; not_moved
 56; 17:32:53,240;   6;  -1; -5;; not_moved
 56; 17:32:53,240;   7;   4; -1;; not_moved
 56; 17:32:53,240;   8;   1;  5;; not_moved
 56; 17:32:53,240;   9;  -5; -4;; not_moved
 56; 17:33:00,830;   0;   0; -1;
 56; 17:33:01,651;   0;   0; -2;
 56; 17:33:01,990;   2;   0; -1;
 56; 17:33:02,483;   0;   0; -3;
 56; 17:33:02,652;   3;   0; -1;
 56; 17:33:03,048;   2;   0; -1;; not_moved
 56; 17:33:03,048;   2;   0; -2;
 56; 17:33:03,087;   1;   1;  0;
 56; 17:33:03,325;   0;   0; -4;
 56; 17:33:03,463;   3;   0; -2;
 56; 17:33:03,834;   2;   0; -3;
 56; 17:33:03,968;   1;   1; -1;
 56; 17:33:04,128;   0;  -1; -5;
 56; 17:33:04,151;   3;   0; -3;
 56; 17:33:04,575;   2;   0; -4;
 56; 17:33:04,596;   3;  -1; -4;
 56; 17:33:04,750;   5;   0; -1;
 56; 17:33:04,769;   1;   1; -2;
 56; 17:33:05,151;   3;  -1; -5;
 56; 17:33:05,209;   0;  -1; -5;; not_moved
 56; 17:33:05,451;   4;   0; -1;
 56; 17:33:05,467;   5;  -1; -2;
 56; 17:33:05,471;   2;  -1; -5;
 56; 17:33:05,507;   1;   1; -3;
 56; 17:33:05,933;   5;   0; -2;
 56; 17:33:06,165;   3;  -1; -5;; not_moved
 56; 17:33:06,265;   4;   0; -2;
 56; 17:33:06,419;   5;  -1; -3;
 56; 17:33:06,420;   1;   1; -4;
 56; 17:33:06,511;   2;  -1; -5;; not_moved
 56; 17:33:06,886;   5;   0; -3;
 56; 17:33:07,267;   4;   0; -3;
 56; 17:33:07,479;   1;   0; -4;
 56; 17:33:07,484;   5;  -1; -4;
 56; 17:33:07,925;   5;   0; -4;
 56; 17:33:07,968;   4;   0; -4;
 56; 17:33:08,439;   5;  -1; -5;
 56; 17:33:08,457;   1;  -1; -4;
 56; 17:33:08,663;   4;  -1; -5;
 56; 17:33:09,384;   1;  -1; -5;
 56; 17:33:09,386;  -1;   0;  0;
 56; 17:33:09,386;   0;   0;  0;; not_moved
 56; 17:33:09,386;   1;   0;  0;; not_moved
 56; 17:33:09,386;   2;   0;  0;; not_moved
 56; 17:33:09,386;   3;   0;  0;; not_moved
 56; 17:33:09,386;   4;   0;  0;; not_moved
 56; 17:33:09,386;   5;   0;  0;; not_moved
 56; 17:33:09,386;   6;   2;  5;; not_moved
 56; 17:33:09,386;   7;  -5; -3;; not_moved
 56; 17:33:09,386;   8;  -3;  2;; not_moved
 56; 17:33:09,386;   9;   5;  3;; not_moved
 56; 17:33:17,386;   0;   1;  1;
 56; 17:33:18,206;   0;   1;  2;
 56; 17:33:19,041;   1;   1;  1;
 56; 17:33:19,135;   0;   1;  3;
 56; 17:33:19,287;   3;   1;  1;
 56; 17:33:19,829;   3;   1;  2;
 56; 17:33:19,905;   1;   1;  2;
 56; 17:33:19,936;   0;   1;  4;
 56; 17:33:20,399;   3;   1;  3;
 56; 17:33:20,692;   1;   2;  2;
 56; 17:33:20,708;   0;   2;  5;
 56; 17:33:20,976;   3;   2;  4;
 56; 17:33:21,080;   4;   1;  1;
 56; 17:33:21,472;   2;   1;  1;
 56; 17:33:21,517;   3;   2;  5;
 56; 17:33:21,577;   1;   2;  3;
 56; 17:33:21,731;   0;   2;  5;; not_moved
 56; 17:33:22,124;   4;   1;  1;; not_moved
 56; 17:33:22,211;   2;   1;  2;
 56; 17:33:22,425;   5;   0;  1;
 56; 17:33:22,473;   1;   3;  4;
 56; 17:33:22,590;   3;   2;  5;; not_moved
 56; 17:33:22,745;   4;   1;  2;
 56; 17:33:22,931;   2;   1;  3;
 56; 17:33:23,068;   5;   1;  1;
 56; 17:33:23,499;   1;   4;  5;
 56; 17:33:23,553;   4;   1;  3;
 56; 17:33:23,604;   5;   1;  2;
 56; 17:33:23,928;   2;   1;  4;
 56; 17:33:24,143;   4;   2;  4;
 56; 17:33:24,340;   5;   1;  3;
 56; 17:33:24,484;   1;   3;  5;
 56; 17:33:24,500;   2;   2;  5;
 56; 17:33:24,777;   4;   2;  5;
 56; 17:33:24,805;   5;   2;  3;
 56; 17:33:25,305;   1;   2;  5;
 56; 17:33:25,412;   5;   2;  4;
 56; 17:33:25,536;   2;   2;  5;; not_moved
 56; 17:33:25,830;   4;   2;  5;; not_moved
 56; 17:33:26,049;   5;   1;  4;
 56; 17:33:26,405;   1;   2;  5;; not_moved
 56; 17:33:26,619;   5;   2;  5;
 56; 17:33:26,622;  -1;   0;  0;
 56; 17:33:26,622;   0;   0;  0;; not_moved
 56; 17:33:26,622;   1;   0;  0;; not_moved
 56; 17:33:26,622;   2;   0;  0;; not_moved
 56; 17:33:26,622;   3;   0;  0;; not_moved
 56; 17:33:26,622;   4;   0;  0;; not_moved
 56; 17:33:26,622;   5;   0;  0;; not_moved
 56; 17:33:26,622;   6;  -5; -3;; not_moved
 56; 17:33:26,622;   7;   2;  5;; not_moved
 56; 17:33:26,622;   8;  -3;  2;; not_moved
 56; 17:33:26,622;   9;   3; -2;; not_moved
 56; 17:33:34,663;   0;  -1; -1;
 56; 17:33:35,396;   4;  -1;  0;
 56; 17:33:35,554;   0;  -2; -2;
 56; 17:33:35,949;   1;  -1;  0;
 56; 17:33:36,248;   2;  -1; -1;
 56; 17:33:36,356;   0;  -3; -2;
 56; 17:33:36,450;   4;  -1;  0;; not_moved
 56; 17:33:36,588;   4;  -2;  0;
 56; 17:33:36,781;   3;  -1;  0;
 56; 17:33:37,004;   1;  -2; -1;
 56; 17:33:37,052;   2;  -2; -1;
 56; 17:33:37,287;   0;  -4; -3;
 56; 17:33:37,437;   3;  -2; -1;
 56; 17:33:37,551;   4;  -2;  0;; not_moved
 56; 17:33:37,701;   2;  -3; -2;
 56; 17:33:37,856;   1;  -2; -2;
 56; 17:33:38,130;   3;  -3; -2;
 56; 17:33:38,147;   5;  -1;  0;
 56; 17:33:38,149;   0;  -5; -3;
 56; 17:33:38,629;   5;  -1; -1;
 56; 17:33:38,648;   3;  -4; -2;
 56; 17:33:38,733;   2;  -4; -3;
 56; 17:33:38,737;   1;  -3; -3;
 56; 17:33:39,102;   5;  -2; -1;
 56; 17:33:39,161;   0;  -5; -3;; not_moved
 56; 17:33:39,368;   3;  -5; -3;
 56; 17:33:39,488;   2;  -5; -3;
 56; 17:33:39,762;   1;  -3; -2;
 56; 17:33:40,113;   5;  -2; -1;; not_moved
 56; 17:33:40,245;   5;  -2;  0;
 56; 17:33:40,341;   4;  -3;  0;
 56; 17:33:40,416;   3;  -5; -3;; not_moved
 56; 17:33:40,559;   2;  -5; -3;; not_moved
 56; 17:33:40,704;   5;  -3; -1;
 56; 17:33:40,827;   1;  -3; -2;; not_moved
 56; 17:33:41,178;   4;  -3;  1;
 56; 17:33:41,212;   1;  -4; -2;
 56; 17:33:41,305;   5;  -4; -2;
 56; 17:33:41,809;   5;  -4; -3;
 56; 17:33:41,978;   4;  -3;  2;
 56; 17:33:42,229;   1;  -4; -2;; not_moved
 56; 17:33:42,254;   1;  -4; -3;
 56; 17:33:42,317;   5;  -5; -3;
 56; 17:33:43,056;   4;  -3;  2;; not_moved
 56; 17:33:43,318;   5;  -5; -3;; not_moved
 56; 17:33:43,330;   1;  -4; -3;; not_moved
 56; 17:33:43,704;   1;  -5; -3;
 56; 17:33:43,707;  -1;   0;  0;
 56; 17:33:43,707;   0;   0;  0;; not_moved
 56; 17:33:43,707;   1;   0;  0;; not_moved
 56; 17:33:43,707;   2;   0;  0;; not_moved
 56; 17:33:43,707;   3;   0;  0;; not_moved
 56; 17:33:43,707;   4;   0;  0;; not_moved
 56; 17:33:43,707;   5;   0;  0;; not_moved
 56; 17:33:43,707;   6;  -4;  1;; not_moved
 56; 17:33:43,707;   7;   1;  5;; not_moved
 56; 17:33:43,707;   8;   4; -1;; not_moved
 56; 17:33:43,707;   9;  -1; -5;; not_moved
 56; 17:33:51,529;   0;  -1;  0;
 56; 17:33:52,373;   2;  -1;  0;
 56; 17:33:52,385;   0;  -2;  0;
 56; 17:33:52,482;   1;  -1;  0;
 56; 17:33:53,262;   0;  -3;  0;
 56; 17:33:53,310;   2;  -2;  0;
 56; 17:33:53,352;   3;  -1;  0;
 56; 17:33:53,371;   4;   0; -1;
 56; 17:33:53,485;   1;  -1;  1;
 56; 17:33:53,924;   3;  -1;  1;
 56; 17:33:54,034;   0;  -4;  0;
 56; 17:33:54,074;   2;  -3;  0;
 56; 17:33:54,104;   5;  -1;  0;
 56; 17:33:54,144;   4;   0; -2;
 56; 17:33:54,380;   1;  -1;  2;
 56; 17:33:54,414;   3;  -2;  1;
 56; 17:33:54,790;   2;  -4;  0;
 56; 17:33:54,918;   4;   0; -3;
 56; 17:33:54,936;   0;  -4;  1;
 56; 17:33:55,028;   5;  -2;  0;
 56; 17:33:55,122;   3;  -3;  1;
 56; 17:33:55,293;   1;  -2;  1;
 56; 17:33:55,475;   2;  -4;  1;
 56; 17:33:55,718;   4;  -1; -4;
 56; 17:33:55,741;   3;  -4;  1;
 56; 17:33:55,814;   5;  -3;  0;
 56; 17:33:55,974;   0;  -4;  1;; not_moved
 56; 17:33:56,143;   1;  -3;  1;
 56; 17:33:56,319;   4;  -1; -5;
 56; 17:33:56,540;   2;  -4;  1;; not_moved
 56; 17:33:56,838;   5;  -3;  0;; not_moved
 56; 17:33:56,881;   3;  -4;  1;; not_moved
 56; 17:33:57,108;   5;  -3;  1;
 56; 17:33:57,149;   1;  -3;  1;; not_moved
 56; 17:33:57,351;   1;  -2;  2;
 56; 17:33:57,375;   4;  -1; -5;; not_moved
 56; 17:33:58,139;   5;  -3;  1;; not_moved
 56; 17:33:58,292;   5;  -2;  2;
 56; 17:33:58,480;   1;  -3;  2;
 56; 17:33:59,331;   5;  -3;  2;
 56; 17:33:59,393;   1;  -4;  1;
 56; 17:33:59,853;   5;  -3;  1;
 56; 17:34:00,357;   5;  -4;  1;
 56; 17:34:00,361;  -1;   0;  0;
 56; 17:34:00,361;   0;   0;  0;; not_moved
 56; 17:34:00,361;   1;   0;  0;; not_moved
 56; 17:34:00,361;   2;   0;  0;; not_moved
 56; 17:34:00,361;   3;   0;  0;; not_moved
 56; 17:34:00,361;   4;   0;  0;; not_moved
 56; 17:34:00,361;   5;   0;  0;; not_moved
 56; 17:34:00,361;   6;   2; -3;; not_moved
 56; 17:34:00,361;   7;  -5; -2;; not_moved
 56; 17:34:00,361;   8;   3;  5;; not_moved
 56; 17:34:00,361;   9;  -2;  3;; not_moved
 56; 17:34:09,583;   3;   0; -1;
 56; 17:34:09,785;   0;  -1;  0;
 56; 17:34:09,827;   4;  -1;  0;
 56; 17:34:10,600;   4;  -2; -1;
 56; 17:34:10,658;   3;   0; -1;; not_moved
 56; 17:34:10,664;   0;  -1;  1;
 56; 17:34:10,801;   1;   0;  1;
 56; 17:34:11,320;   4;  -3; -1;
 56; 17:34:11,589;   5;  -1;  0;
 56; 17:34:11,694;   0;  -1;  1;; not_moved
 56; 17:34:11,776;   0;  -2;  1;
 56; 17:34:11,868;   1;   0;  1;; not_moved
 56; 17:34:12,044;   4;  -4; -2;
 56; 17:34:12,236;   5;  -1; -1;
 56; 17:34:12,421;   2;  -1;  0;
 56; 17:34:12,560;   0;  -2;  2;
 56; 17:34:12,614;   1;  -1;  1;
 56; 17:34:12,741;   3;  -1; -1;
 56; 17:34:12,831;   4;  -5; -2;
 56; 17:34:12,867;   5;  -2; -1;
 56; 17:34:13,398;   3;  -2; -1;
 56; 17:34:13,424;   2;  -1;  0;; not_moved
 56; 17:34:13,435;   0;  -2;  3;
 56; 17:34:13,520;   5;  -2;  0;
 56; 17:34:13,670;   1;  -1;  1;; not_moved
 56; 17:34:13,896;   4;  -5; -2;; not_moved
 56; 17:34:14,100;   5;  -3; -1;
 56; 17:34:14,248;   3;  -3; -1;
 56; 17:34:14,465;   2;  -2;  0;
 56; 17:34:14,497;   0;  -2;  3;; not_moved
 56; 17:34:14,844;   5;  -3; -2;
 56; 17:34:15,037;   2;  -3; -1;
 56; 17:34:15,056;   3;  -4; -1;
 56; 17:34:15,301;   5;  -4; -2;
 56; 17:34:15,594;   2;  -4; -2;
 56; 17:34:15,606;   1;  -2;  0;
 56; 17:34:16,067;   3;  -4; -1;; not_moved
 56; 17:34:16,188;   2;  -5; -2;
 56; 17:34:16,256;   5;  -5; -2;
 56; 17:34:16,518;   3;  -5; -2;
 56; 17:34:16,528;   1;  -3; -1;
 56; 17:34:17,230;   2;  -5; -2;; not_moved
 56; 17:34:17,272;   5;  -5; -2;; not_moved
 56; 17:34:17,300;   1;  -4; -2;
 56; 17:34:17,569;   3;  -5; -2;; not_moved
 56; 17:34:18,118;   1;  -5; -2;
 56; 17:34:18,121;  -1;   0;  0;
 56; 17:34:18,121;   0;   0;  0;; not_moved
 56; 17:34:18,121;   1;   0;  0;; not_moved
 56; 17:34:18,121;   2;   0;  0;; not_moved
 56; 17:34:18,121;   3;   0;  0;; not_moved
 56; 17:34:18,121;   4;   0;  0;; not_moved
 56; 17:34:18,121;   5;   0;  0;; not_moved
 56; 17:34:18,121;   6;  -2;  3;; not_moved
 56; 17:34:18,121;   7;   2; -3;; not_moved
 56; 17:34:18,121;   8;  -5; -2;; not_moved
 56; 17:34:18,121;   9;  -3; -5;; not_moved
 56; 17:34:26,207;   3;   0;  1;
 56; 17:34:26,591;   0;   0; -1;
 56; 17:34:27,281;   3;   0;  1;; not_moved
 56; 17:34:27,484;   0;   0; -2;
 56; 17:34:28,436;   0;   1; -2;
 56; 17:34:28,592;   3;  -1;  1;
 56; 17:34:29,224;   0;   1; -3;
 56; 17:34:29,584;   3;  -1;  1;; not_moved
 56; 17:34:29,995;   2;   0; -1;
 56; 17:34:30,234;   0;   2; -3;
 56; 17:34:30,595;   1;   0;  1;
 56; 17:34:31,054;   2;   0; -1;; not_moved
 56; 17:34:31,303;   2;   0; -2;
 56; 17:34:31,316;   0;   2; -3;; not_moved
 56; 17:34:31,736;   1;   0;  1;; not_moved
 56; 17:34:32,022;   4;   0;  1;
 56; 17:34:32,396;   2;   0; -2;; not_moved
 56; 17:34:32,396;   2;   1; -2;
 56; 17:34:32,758;   4;  -1;  1;
 56; 17:34:32,885;   1;  -1;  1;
 56; 17:34:33,229;   2;   1; -3;
 56; 17:34:33,484;   3;  -1;  2;
 56; 17:34:33,823;   4;  -1;  1;; not_moved
 56; 17:34:33,895;   1;  -1;  1;; not_moved
 56; 17:34:33,938;   2;   2; -3;
 56; 17:34:34,064;   3;  -1;  3;
 56; 17:34:34,084;   4;  -1;  2;
 56; 17:34:34,086;   1;  -1;  2;
 56; 17:34:34,820;   3;  -2;  3;
 56; 17:34:34,959;   2;   2; -3;; not_moved
 56; 17:34:35,080;   1;  -2;  2;
 56; 17:34:35,094;   5;   0; -1;
 56; 17:34:35,125;   4;  -1;  2;; not_moved
 56; 17:34:35,619;   4;  -2;  2;
 56; 17:34:35,707;   5;   0; -2;
 56; 17:34:35,892;   3;  -2;  3;; not_moved
 56; 17:34:36,098;   1;  -2;  2;; not_moved
 56; 17:34:36,110;   1;  -2;  3;
 56; 17:34:36,379;   4;  -2;  3;
 56; 17:34:36,429;   5;   1; -1;
 56; 17:34:36,984;   5;   1; -2;
 56; 17:34:37,199;   1;  -2;  3;; not_moved
 56; 17:34:37,428;   4;  -2;  3;; not_moved
 56; 17:34:37,446;   5;   0; -3;
 56; 17:34:38,342;   5;   0; -4;
 56; 17:34:38,923;   5;   1; -4;
 56; 17:34:39,660;   5;   2; -3;
 56; 17:34:39,663;  -1;   0;  0;
 56; 17:34:39,663;   0;   0;  0;; not_moved
 56; 17:34:39,663;   1;   0;  0;; not_moved
 56; 17:34:39,663;   2;   0;  0;; not_moved
 56; 17:34:39,663;   3;   0;  0;; not_moved
 56; 17:34:39,663;   4;   0;  0;; not_moved
 56; 17:34:39,663;   5;   0;  0;; not_moved
 56; 17:34:39,663;   6;   2;  5;; not_moved
 56; 17:34:39,663;   7;   3; -2;; not_moved
 56; 17:34:39,663;   8;  -2; -5;; not_moved
 56; 17:34:39,663;   9;  -3;  2;; not_moved
 56; 17:34:47,760;   4;   1;  1;
 56; 17:34:48,598;   4;   2;  2;
 56; 17:34:49,351;   4;   2;  3;
 56; 17:34:49,621;   3;   1;  1;
 56; 17:34:49,799;   0;   1;  1;
 56; 17:34:50,077;   4;   2;  4;
 56; 17:34:50,141;   3;   2;  2;
 56; 17:34:50,155;   2;   1;  1;
 56; 17:34:50,352;   1;   1;  1;
 56; 17:34:50,631;   0;   1;  2;
 56; 17:34:50,679;   3;   2;  3;
 56; 17:34:50,920;   4;   2;  5;
 56; 17:34:50,991;   1;   2;  2;
 56; 17:34:51,061;   2;   2;  2;
 56; 17:34:51,256;   3;   2;  4;
 56; 17:34:51,439;   0;   1;  3;
 56; 17:34:51,646;   1;   2;  3;
 56; 17:34:51,688;   2;   2;  3;
 56; 17:34:51,907;   5;   1;  1;
 56; 17:34:51,947;   4;   2;  5;; not_moved
 56; 17:34:51,962;   3;   2;  5;
 56; 17:34:52,300;   0;   1;  4;
 56; 17:34:52,374;   2;   2;  4;
 56; 17:34:52,470;   5;   0;  1;
 56; 17:34:52,630;   1;   2;  4;
 56; 17:34:53,016;   3;   2;  5;; not_moved
 56; 17:34:53,169;   1;   2;  5;
 56; 17:34:53,177;   0;   2;  5;
 56; 17:34:53,196;   5;   1;  2;
 56; 17:34:53,350;   2;   2;  5;
 56; 17:34:53,700;   5;   2;  2;
 56; 17:34:54,197;   5;   2;  3;
 56; 17:34:54,222;   1;   2;  5;; not_moved
 56; 17:34:54,245;   0;   2;  5;; not_moved
 56; 17:34:54,387;   2;   2;  5;; not_moved
 56; 17:34:54,676;   5;   1;  3;
 56; 17:34:55,741;   5;   1;  3;; not_moved
 56; 17:34:56,221;   5;   2;  4;
 56; 17:34:56,875;   5;   2;  5;
