#gnr; time; pid; sj; sj
  2; 10:47:52,957;  -1;   0;  0;
  2; 10:47:52,957;   0;   0;  0;; not_moved
  2; 10:47:52,957;   1;   0;  0;; not_moved
  2; 10:47:52,957;   2;   0;  0;; not_moved
  2; 10:47:52,957;   3;   0;  0;; not_moved
  2; 10:47:52,957;   4;   0;  0;; not_moved
  2; 10:47:52,957;   5;   0;  0;; not_moved
  2; 10:47:57,255;   3;  -1; -1;
  2; 10:47:58,246;   2;   1;  0;
  2; 10:47:58,287;   3;  -1; -1;; not_moved
  2; 10:47:58,452;   0;   1;  1;
  2; 10:47:59,075;   4;   0; -1;
  2; 10:47:59,315;   2;   1;  0;; not_moved
  2; 10:47:59,482;   0;   1;  1;; not_moved
  2; 10:47:59,887;   1;   0; -1;
  2; 10:48:00,115;   2;   1; -1;
  2; 10:48:00,166;   4;   0; -1;; not_moved
  2; 10:48:00,960;   1;   0; -1;; not_moved
  2; 10:48:01,064;   0;   1;  2;
  2; 10:48:01,123;   2;   1; -1;; not_moved
  2; 10:48:01,763;   3;  -1;  0;
  2; 10:48:02,078;   5;   1;  0;
  2; 10:48:02,086;   0;   1;  2;; not_moved
  2; 10:48:02,794;   3;  -1;  0;; not_moved
  2; 10:48:02,957;   5;   2;  0;
  2; 10:48:03,013;   4;   1;  0;
  2; 10:48:03,093;   2;   2; -1;
  2; 10:48:03,420;   0;   0;  2;
  2; 10:48:03,669;   5;   2;  1;
  2; 10:48:04,072;   4;   1;  0;; not_moved
  2; 10:48:04,131;   2;   2; -1;; not_moved
  2; 10:48:04,170;   3;   0;  0;
  2; 10:48:04,392;   0;   0;  2;; not_moved
  2; 10:48:04,665;   5;   1;  1;
  2; 10:48:04,845;   1;  -1; -2;
  2; 10:48:05,240;   3;   0;  0;; not_moved
  2; 10:48:05,270;   0;   0;  1;
  2; 10:48:05,516;   3;   1;  1;
  2; 10:48:05,540;   5;   1;  0;
  2; 10:48:05,600;   4;   2;  0;
  2; 10:48:05,629;   2;   1; -2;
  2; 10:48:05,867;   1;  -1; -2;; not_moved
  2; 10:48:06,295;   0;   0;  1;; not_moved
  2; 10:48:06,545;   5;   1;  0;; not_moved
  2; 10:48:06,599;   3;   1;  1;; not_moved
  2; 10:48:06,678;   2;   1; -2;; not_moved
  2; 10:48:06,704;   4;   2;  0;; not_moved
  2; 10:48:07,005;   2;   1; -1;
  2; 10:48:07,104;   0;   1;  1;
  2; 10:48:07,348;   4;   3;  0;
  2; 10:48:07,394;   3;   2;  1;
  2; 10:48:07,980;   2;   1; -1;; not_moved
  2; 10:48:08,240;   0;   1;  1;; not_moved
  2; 10:48:08,377;   4;   3;  0;; not_moved
  2; 10:48:08,402;   3;   2;  1;; not_moved
  2; 10:48:10,447;   4;   2; -1;
  2; 10:48:11,482;   4;   2; -1;; not_moved
  2; 10:48:12,408;   1;   0; -2;
  2; 10:48:13,377;   1;   0; -2;; not_moved
  2; 10:48:14,974;   1;   1; -2;
  2; 10:48:15,980;   1;   1; -2;; not_moved
  2; 10:48:19,801;   1;   2; -2;
 56; 10:51:12,923;  -1;   0;  0;
 56; 10:51:12,923;   0;   0;  0;; not_moved
 56; 10:51:12,923;   1;   0;  0;; not_moved
 56; 10:51:12,923;   2;   0;  0;; not_moved
 56; 10:51:12,923;   3;   0;  0;; not_moved
 56; 10:51:12,923;   4;   0;  0;; not_moved
 56; 10:51:12,923;   5;   0;  0;; not_moved
 56; 10:51:12,923;   6;   5;  2;; not_moved
 56; 10:51:12,923;   7;  -3; -5;; not_moved
 56; 10:51:12,923;   8;   2; -3;; not_moved
 56; 10:51:12,923;   9;   3;  5;; not_moved
 56; 10:51:18,102;   0;   1;  1;
 56; 10:51:18,977;   5;   1;  0;
 56; 10:51:19,144;   0;   1;  1;; not_moved
 56; 10:51:19,968;   5;   1; -1;
 56; 10:51:19,969;   0;   2;  2;
 56; 10:51:20,181;   1;  -1; -1;
 56; 10:51:20,277;   4;   0; -1;
 56; 10:51:20,897;   3;   0;  1;
 56; 10:51:20,974;   5;   1; -2;
 56; 10:51:20,979;   0;   2;  2;; not_moved
 56; 10:51:21,074;   0;   3;  3;
 56; 10:51:21,231;   1;  -1; -1;; not_moved
 56; 10:51:21,329;   4;   0; -1;; not_moved
 56; 10:51:21,499;   1;  -2; -2;
 56; 10:51:21,835;   5;   1; -3;
 56; 10:51:21,956;   3;   0;  1;; not_moved
 56; 10:51:22,075;   0;   3;  4;
 56; 10:51:22,533;   1;  -2; -2;; not_moved
 56; 10:51:22,603;   1;  -2; -3;
 56; 10:51:22,732;   5;   2; -3;
 56; 10:51:23,020;   0;   3;  5;
 56; 10:51:23,151;   2;   1;  0;
 56; 10:51:23,232;   4;   1; -1;
 56; 10:51:23,677;   1;  -2; -3;; not_moved
 56; 10:51:23,734;   1;  -2; -4;
 56; 10:51:23,798;   5;   2; -3;; not_moved
 56; 10:51:24,100;   0;   3;  5;; not_moved
 56; 10:51:24,174;   2;   1;  0;; not_moved
 56; 10:51:24,235;   4;   1; -1;; not_moved
 56; 10:51:24,422;   2;   2;  0;
 56; 10:51:24,503;   4;   2; -1;
 56; 10:51:24,736;   1;  -2; -4;; not_moved
 56; 10:51:24,761;   1;  -3; -5;
 56; 10:51:25,140;   2;   3;  1;
 56; 10:51:25,580;   4;   2; -1;; not_moved
 56; 10:51:25,684;   4;   2; -2;
 56; 10:51:25,838;   1;  -3; -5;; not_moved
 56; 10:51:25,913;   2;   4;  1;
 56; 10:51:26,358;   5;   3; -2;
 56; 10:51:26,702;   4;   2; -3;
 56; 10:51:26,744;   2;   5;  2;
 56; 10:51:27,065;   5;   2; -3;
 56; 10:51:27,698;   3;   1;  2;
 56; 10:51:27,740;   4;   2; -3;; not_moved
 56; 10:51:27,828;   2;   5;  2;; not_moved
 56; 10:51:28,108;   5;   2; -3;; not_moved
 56; 10:51:28,547;   0;   4;  5;
 56; 10:51:28,589;   3;   2;  3;
 56; 10:51:29,330;   3;   3;  4;
 56; 10:51:29,379;   0;   3;  4;
 56; 10:51:30,160;   0;   3;  5;
 56; 10:51:30,236;   3;   3;  5;
 56; 10:51:30,239;  -1;   0;  0;
 56; 10:51:30,239;   0;   0;  0;; not_moved
 56; 10:51:30,239;   1;   0;  0;; not_moved
 56; 10:51:30,239;   2;   0;  0;; not_moved
 56; 10:51:30,239;   3;   0;  0;; not_moved
 56; 10:51:30,239;   4;   0;  0;; not_moved
 56; 10:51:30,239;   5;   0;  0;; not_moved
 56; 10:51:30,239;   6;   5;  1;; not_moved
 56; 10:51:30,239;   7;   4;  5;; not_moved
 56; 10:51:30,239;   8;  -1;  4;; not_moved
 56; 10:51:30,239;   9;   1; -4;; not_moved
 56; 10:51:39,074;   2;   1;  0;
 56; 10:51:39,500;   4;   1;  0;
 56; 10:51:39,664;   3;   0; -1;
 56; 10:51:39,676;   2;   2;  0;
 56; 10:51:39,875;   5;   1;  0;
 56; 10:51:40,258;   2;   3;  0;
 56; 10:51:40,500;   1;   1;  1;
 56; 10:51:40,553;   4;   2;  0;
 56; 10:51:40,632;   5;   1; -1;
 56; 10:51:40,681;   3;   0; -2;
 56; 10:51:40,969;   2;   4;  0;
 56; 10:51:41,208;   5;   1; -2;
 56; 10:51:41,354;   1;   2;  2;
 56; 10:51:41,527;   3;   0; -3;
 56; 10:51:41,580;   4;   2;  0;; not_moved
 56; 10:51:41,628;   2;   5;  1;
 56; 10:51:41,761;   4;   3;  0;
 56; 10:51:41,937;   5;   1; -3;
 56; 10:51:41,965;   0;  -1;  0;
 56; 10:51:42,066;   1;   3;  3;
 56; 10:51:42,481;   3;   0; -4;
 56; 10:51:42,692;   4;   4;  0;
 56; 10:51:42,716;   5;   1; -4;
 56; 10:51:42,744;   2;   5;  1;; not_moved
 56; 10:51:42,768;   0;  -1;  1;
 56; 10:51:42,813;   1;   4;  4;
 56; 10:51:43,283;   3;   1; -4;
 56; 10:51:43,478;   1;   4;  5;
 56; 10:51:43,569;   0;  -1;  2;
 56; 10:51:43,700;   4;   4;  0;; not_moved
 56; 10:51:43,731;   5;   1; -4;; not_moved
 56; 10:51:44,014;   4;   5;  1;
 56; 10:51:44,303;   3;   1; -4;; not_moved
 56; 10:51:44,316;   0;  -1;  3;
 56; 10:51:44,564;   1;   4;  5;; not_moved
 56; 10:51:45,103;   4;   5;  1;; not_moved
 56; 10:51:45,339;   0;  -1;  3;; not_moved
 56; 10:51:47,425;   0;  -1;  4;
 56; 10:51:47,430;  -1;   0;  0;
 56; 10:51:47,430;   0;   0;  0;; not_moved
 56; 10:51:47,430;   1;   0;  0;; not_moved
 56; 10:51:47,430;   2;   0;  0;; not_moved
 56; 10:51:47,430;   3;   0;  0;; not_moved
 56; 10:51:47,430;   4;   0;  0;; not_moved
 56; 10:51:47,430;   5;   0;  0;; not_moved
 56; 10:51:47,430;   6;  -3; -5;; not_moved
 56; 10:51:47,430;   7;  -2;  3;; not_moved
 56; 10:51:47,430;   8;  -5; -2;; not_moved
 56; 10:51:47,430;   9;   2; -3;; not_moved
 56; 10:51:55,583;   1;   0;  1;
 56; 10:51:55,877;   2;  -1; -1;
 56; 10:51:55,945;   4;   0; -1;
 56; 10:51:56,352;   1;  -1;  1;
 56; 10:51:56,498;   2;  -1; -2;
 56; 10:51:56,503;   5;  -1;  0;
 56; 10:51:56,930;   4;   0; -2;
 56; 10:51:57,112;   1;  -2;  1;
 56; 10:51:57,218;   2;  -1; -3;
 56; 10:51:57,226;   3;   0; -1;
 56; 10:51:57,479;   5;  -2;  0;
 56; 10:51:57,657;   1;  -2;  2;
 56; 10:51:57,755;   4;   1; -2;
 56; 10:51:57,865;   2;  -2; -4;
 56; 10:51:58,114;   5;  -3; -1;
 56; 10:51:58,180;   3;   0; -2;
 56; 10:51:58,283;   1;  -2;  3;
 56; 10:51:58,685;   4;   1; -3;
 56; 10:51:58,688;   2;  -3; -5;
 56; 10:51:58,841;   5;  -4; -2;
 56; 10:51:59,069;   3;   0; -3;
 56; 10:51:59,285;   1;  -2;  3;; not_moved
 56; 10:51:59,630;   5;  -5; -2;
 56; 10:51:59,784;   2;  -3; -5;; not_moved
 56; 10:51:59,790;   4;   1; -3;; not_moved
 56; 10:51:59,841;   3;   1; -3;
 56; 10:52:00,658;   5;  -5; -2;; not_moved
 56; 10:52:00,737;   3;   2; -3;
 56; 10:52:01,209;   0;  -1;  0;
 56; 10:52:01,776;   4;   2; -3;
 56; 10:52:01,825;   3;   2; -3;; not_moved
 56; 10:52:02,094;   0;  -1;  1;
 56; 10:52:02,768;   4;   2; -3;; not_moved
 56; 10:52:03,165;   0;  -1;  1;; not_moved
 56; 10:52:03,356;   0;  -1;  2;
 56; 10:52:04,030;   0;  -2;  2;
 56; 10:52:04,758;   0;  -2;  3;
 56; 10:52:04,762;  -1;   0;  0;
 56; 10:52:04,762;   0;   0;  0;; not_moved
 56; 10:52:04,762;   1;   0;  0;; not_moved
 56; 10:52:04,762;   2;   0;  0;; not_moved
 56; 10:52:04,762;   3;   0;  0;; not_moved
 56; 10:52:04,762;   4;   0;  0;; not_moved
 56; 10:52:04,762;   5;   0;  0;; not_moved
 56; 10:52:04,762;   6;  -1;  4;; not_moved
 56; 10:52:04,762;   7;   1; -4;; not_moved
 56; 10:52:04,762;   8;   4;  5;; not_moved
 56; 10:52:04,762;   9;  -4; -5;; not_moved
 56; 10:52:12,204;   1;   0; -1;
 56; 10:52:12,820;   1;   0; -2;
 56; 10:52:13,010;   2;   0;  1;
 56; 10:52:13,156;   4;   0; -1;
 56; 10:52:13,324;   5;  -1;  0;
 56; 10:52:13,468;   1;   0; -3;
 56; 10:52:13,639;   2;   0;  2;
 56; 10:52:14,123;   1;   0; -4;
 56; 10:52:14,221;   5;  -1;  1;
 56; 10:52:14,224;   4;   0; -1;; not_moved
 56; 10:52:14,225;   4;   0; -2;
 56; 10:52:14,271;   2;   0;  3;
 56; 10:52:14,728;   5;  -1;  2;
 56; 10:52:14,924;   2;  -1;  3;
 56; 10:52:15,127;   3;   0;  1;
 56; 10:52:15,142;   1;   1; -4;
 56; 10:52:15,190;   0;   1;  1;
 56; 10:52:15,207;   4;   0; -3;
 56; 10:52:15,454;   2;  -1;  4;
 56; 10:52:15,779;   5;  -1;  2;; not_moved
 56; 10:52:15,869;   3;   1;  2;
 56; 10:52:16,032;   0;   2;  2;
 56; 10:52:16,219;   1;   1; -4;; not_moved
 56; 10:52:16,236;   4;   0; -4;
 56; 10:52:16,272;   5;  -1;  3;
 56; 10:52:16,477;   2;  -1;  4;; not_moved
 56; 10:52:16,707;   3;   2;  3;
 56; 10:52:16,740;   0;   3;  3;
 56; 10:52:17,101;   4;   1; -4;
 56; 10:52:17,258;   5;  -1;  4;
 56; 10:52:17,381;   0;   4;  4;
 56; 10:52:17,560;   3;   3;  4;
 56; 10:52:18,018;   0;   4;  5;
 56; 10:52:18,154;   4;   1; -4;; not_moved
 56; 10:52:18,236;   3;   4;  5;
 56; 10:52:18,239;  -1;   0;  0;
 56; 10:52:18,239;   0;   0;  0;; not_moved
 56; 10:52:18,239;   1;   0;  0;; not_moved
 56; 10:52:18,239;   2;   0;  0;; not_moved
 56; 10:52:18,239;   3;   0;  0;; not_moved
 56; 10:52:18,239;   4;   0;  0;; not_moved
 56; 10:52:18,239;   5;   0;  0;; not_moved
 56; 10:52:18,239;   6;   5;  2;; not_moved
 56; 10:52:18,239;   7;   3;  5;; not_moved
 56; 10:52:18,239;   8;  -3; -5;; not_moved
 56; 10:52:18,239;   9;  -2;  3;; not_moved
 56; 10:52:26,130;   1;   1;  1;
 56; 10:52:26,429;   5;   0;  1;
 56; 10:52:26,639;   2;   1;  0;
 56; 10:52:26,723;   1;   2;  2;
 56; 10:52:27,140;   2;   2;  0;
 56; 10:52:27,333;   1;   2;  3;
 56; 10:52:27,478;   4;   1;  0;
 56; 10:52:27,498;   5;   0;  1;; not_moved
 56; 10:52:27,612;   2;   3;  1;
 56; 10:52:28,031;   1;   3;  4;
 56; 10:52:28,195;   2;   4;  1;
 56; 10:52:28,331;   3;   1;  0;
 56; 10:52:28,491;   4;   1;  0;; not_moved
 56; 10:52:28,494;   4;   2;  0;
 56; 10:52:28,687;   1;   3;  5;
 56; 10:52:28,759;   2;   5;  2;
 56; 10:52:28,800;   5;   0;  2;
 56; 10:52:29,117;   3;   2;  0;
 56; 10:52:29,392;   4;   3;  0;
 56; 10:52:29,695;   1;   3;  5;; not_moved
 56; 10:52:29,798;   2;   5;  2;; not_moved
 56; 10:52:29,835;   5;   0;  2;; not_moved
 56; 10:52:29,903;   3;   3;  1;
 56; 10:52:29,991;   0;  -1; -1;
 56; 10:52:30,132;   5;  -1;  2;
 56; 10:52:30,395;   4;   3;  0;; not_moved
 56; 10:52:30,577;   4;   4;  1;
 56; 10:52:30,693;   0;  -2; -2;
 56; 10:52:30,816;   3;   4;  1;
 56; 10:52:30,912;   5;  -1;  3;
 56; 10:52:31,331;   0;  -3; -3;
 56; 10:52:31,496;   3;   5;  2;
 56; 10:52:31,597;   4;   4;  1;; not_moved
 56; 10:52:31,784;   4;   5;  2;
 56; 10:52:31,887;   5;  -2;  3;
 56; 10:52:32,419;   0;  -3; -3;; not_moved
 56; 10:52:32,527;   3;   5;  2;; not_moved
 56; 10:52:32,760;   0;  -4; -4;
 56; 10:52:32,800;   4;   5;  2;; not_moved
 56; 10:52:32,908;   5;  -2;  3;; not_moved
 56; 10:52:33,236;   0;  -3; -4;
 56; 10:52:33,933;   0;  -3; -5;
 56; 10:52:33,935;  -1;   0;  0;
 56; 10:52:33,935;   0;   0;  0;; not_moved
 56; 10:52:33,935;   1;   0;  0;; not_moved
 56; 10:52:33,935;   2;   0;  0;; not_moved
 56; 10:52:33,935;   3;   0;  0;; not_moved
 56; 10:52:33,935;   4;   0;  0;; not_moved
 56; 10:52:33,935;   5;   0;  0;; not_moved
 56; 10:52:33,935;   6;   1; -4;; not_moved
 56; 10:52:33,935;   7;  -1;  4;; not_moved
 56; 10:52:33,935;   8;  -4; -5;; not_moved
 56; 10:52:33,935;   9;   5;  1;; not_moved
 56; 10:52:41,305;   1;   0;  1;
 56; 10:52:41,578;   2;   0; -1;
 56; 10:52:41,667;   4;   0; -1;
 56; 10:52:41,834;   1;   0;  2;
 56; 10:52:41,974;   0;   1;  0;
 56; 10:52:42,130;   2;   0; -2;
 56; 10:52:42,420;   4;   0; -2;
 56; 10:52:42,423;   1;   0;  3;
 56; 10:52:42,537;   2;   0; -3;
 56; 10:52:42,694;   0;   2;  0;
 56; 10:52:43,064;   1;   0;  4;
 56; 10:52:43,103;   2;   0; -4;
 56; 10:52:43,144;   4;   0; -3;
 56; 10:52:43,197;   0;   3;  0;
 56; 10:52:43,621;   2;   1; -4;
 56; 10:52:43,635;   1;  -1;  4;
 56; 10:52:44,072;   0;   4;  1;
 56; 10:52:44,114;   4;   0; -3;; not_moved
 56; 10:52:44,314;   3;  -1; -1;
 56; 10:52:44,715;   1;  -1;  4;; not_moved
 56; 10:52:44,758;   2;   1; -4;; not_moved
 56; 10:52:45,078;   5;   0; -1;
 56; 10:52:45,117;   3;  -2; -2;
 56; 10:52:45,137;   0;   4;  1;; not_moved
 56; 10:52:45,212;   0;   5;  1;
 56; 10:52:45,785;   3;  -3; -3;
 56; 10:52:45,997;   5;   0; -2;
 56; 10:52:46,238;   0;   5;  1;; not_moved
 56; 10:52:46,591;   3;  -4; -4;
 56; 10:52:46,831;   5;   0; -3;
 56; 10:52:47,171;   4;  -1; -4;
 56; 10:52:47,347;   3;  -4; -5;
 56; 10:52:47,646;   5;   0; -4;
 56; 10:52:48,139;   4;   0; -4;
 56; 10:52:48,396;   3;  -4; -5;; not_moved
 56; 10:52:48,505;   5;   1; -4;
 56; 10:52:48,996;   4;   1; -4;
 56; 10:52:48,998;  -1;   0;  0;
 56; 10:52:48,998;   0;   0;  0;; not_moved
 56; 10:52:48,998;   1;   0;  0;; not_moved
 56; 10:52:48,998;   2;   0;  0;; not_moved
 56; 10:52:48,998;   3;   0;  0;; not_moved
 56; 10:52:48,998;   4;   0;  0;; not_moved
 56; 10:52:48,998;   5;   0;  0;; not_moved
 56; 10:52:48,998;   6;   2;  5;; not_moved
 56; 10:52:48,998;   7;  -5; -3;; not_moved
 56; 10:52:48,998;   8;   3; -2;; not_moved
 56; 10:52:48,998;   9;   5;  3;; not_moved
 56; 10:52:56,613;   2;   1;  1;
 56; 10:52:56,941;   3;   0;  1;
 56; 10:52:57,224;   2;   1;  2;
 56; 10:52:57,476;   1;   1;  0;
 56; 10:52:57,516;   4;   0;  1;
 56; 10:52:57,766;   3;   1;  2;
 56; 10:52:57,897;   2;   1;  3;
 56; 10:52:58,092;   1;   2;  0;
 56; 10:52:58,525;   0;  -1; -1;
 56; 10:52:58,533;   4;   0;  1;; not_moved
 56; 10:52:58,540;   2;   2;  4;
 56; 10:52:58,585;   3;   1;  3;
 56; 10:52:58,646;   1;   2; -1;
 56; 10:52:58,666;   4;   0;  2;
 56; 10:52:59,109;   2;   2;  5;
 56; 10:52:59,273;   1;   2; -2;
 56; 10:52:59,498;   3;   2;  4;
 56; 10:52:59,501;   0;  -2; -2;
 56; 10:52:59,656;   4;   1;  3;
 56; 10:52:59,969;   1;   3; -2;
 56; 10:53:00,141;   2;   2;  5;; not_moved
 56; 10:53:00,288;   0;  -3; -2;
 56; 10:53:00,425;   3;   2;  5;
 56; 10:53:00,657;   5;   0;  1;
 56; 10:53:00,700;   0;  -4; -3;
 56; 10:53:00,737;   4;   1;  3;; not_moved
 56; 10:53:00,906;   4;   2;  4;
 56; 10:53:01,080;   1;   3; -2;; not_moved
 56; 10:53:01,195;   0;  -5; -3;
 56; 10:53:01,408;   5;   0;  2;
 56; 10:53:01,470;   3;   2;  5;; not_moved
 56; 10:53:01,938;   4;   2;  4;; not_moved
 56; 10:53:02,006;   4;   2;  5;
 56; 10:53:02,111;   5;   1;  3;
 56; 10:53:02,221;   0;  -5; -3;; not_moved
 56; 10:53:02,974;   5;   2;  4;
 56; 10:53:03,043;   4;   2;  5;; not_moved
 56; 10:53:04,065;   5;   2;  4;; not_moved
 56; 10:53:04,112;   5;   2;  5;
 56; 10:53:04,114;  -1;   0;  0;
 56; 10:53:04,114;   0;   0;  0;; not_moved
 56; 10:53:04,114;   1;   0;  0;; not_moved
 56; 10:53:04,114;   2;   0;  0;; not_moved
 56; 10:53:04,114;   3;   0;  0;; not_moved
 56; 10:53:04,114;   4;   0;  0;; not_moved
 56; 10:53:04,114;   5;   0;  0;; not_moved
 56; 10:53:04,114;   6;   2;  5;; not_moved
 56; 10:53:04,114;   7;  -5; -3;; not_moved
 56; 10:53:04,114;   8;   5;  3;; not_moved
 56; 10:53:04,114;   9;   3; -2;; not_moved
 56; 10:53:11,811;   2;   0;  1;
 56; 10:53:11,854;   3;   0;  1;
 56; 10:53:11,923;   1;   1;  1;
 56; 10:53:12,238;   4;   0;  1;
 56; 10:53:12,401;   2;   1;  2;
 56; 10:53:12,469;   1;   2;  2;
 56; 10:53:12,584;   3;   1;  2;
 56; 10:53:12,899;   2;   1;  3;
 56; 10:53:13,086;   1;   3;  3;
 56; 10:53:13,136;   4;   0;  2;
 56; 10:53:13,301;   3;   2;  3;
 56; 10:53:13,387;   2;   2;  4;
 56; 10:53:13,612;   1;   4;  3;
 56; 10:53:13,957;   4;   0;  3;
 56; 10:53:14,136;   2;   2;  5;
 56; 10:53:14,215;   1;   5;  3;
 56; 10:53:14,283;   3;   2;  4;
 56; 10:53:14,738;   4;   1;  4;
 56; 10:53:14,811;   0;   1;  0;
 56; 10:53:15,116;   3;   2;  5;
 56; 10:53:15,160;   2;   2;  5;; not_moved
 56; 10:53:15,258;   1;   5;  3;; not_moved
 56; 10:53:15,550;   0;   2;  0;
 56; 10:53:15,728;   4;   2;  5;
 56; 10:53:16,031;   5;   1;  1;
 56; 10:53:16,075;   0;   2; -1;
 56; 10:53:16,088;   3;   2;  5;; not_moved
 56; 10:53:16,548;   0;   3; -1;
 56; 10:53:16,742;   5;   1;  2;
 56; 10:53:16,762;   4;   2;  5;; not_moved
 56; 10:53:17,043;   0;   3; -2;
 56; 10:53:17,481;   5;   1;  3;
 56; 10:53:18,048;   0;   3; -2;; not_moved
 56; 10:53:18,258;   5;   1;  4;
 56; 10:53:18,920;   5;   2;  5;
 56; 10:53:18,922;  -1;   0;  0;
 56; 10:53:18,922;   0;   0;  0;; not_moved
 56; 10:53:18,922;   1;   0;  0;; not_moved
 56; 10:53:18,922;   2;   0;  0;; not_moved
 56; 10:53:18,922;   3;   0;  0;; not_moved
 56; 10:53:18,922;   4;   0;  0;; not_moved
 56; 10:53:18,922;   5;   0;  0;; not_moved
 56; 10:53:18,922;   6;  -4; -5;; not_moved
 56; 10:53:18,922;   7;  -1;  4;; not_moved
 56; 10:53:18,922;   8;   4;  5;; not_moved
 56; 10:53:18,922;   9;  -5; -1;; not_moved
 56; 10:53:26,385;   1;   1;  1;
 56; 10:53:26,907;   1;   2;  2;
 56; 10:53:26,936;   4;  -1; -1;
 56; 10:53:26,970;   3;  -1; -1;
 56; 10:53:27,436;   1;   3;  3;
 56; 10:53:27,578;   3;  -2; -2;
 56; 10:53:27,941;   1;   4;  4;
 56; 10:53:27,981;   4;  -1; -1;; not_moved
 56; 10:53:28,388;   4;  -2; -2;
 56; 10:53:28,499;   3;  -3; -3;
 56; 10:53:28,519;   0;   0;  1;
 56; 10:53:28,534;   1;   4;  5;
 56; 10:53:28,622;   2;  -1; -1;
 56; 10:53:28,960;   4;  -3; -3;
 56; 10:53:29,260;   0;   0;  2;
 56; 10:53:29,384;   2;  -2; -2;
 56; 10:53:29,384;   3;  -4; -4;
 56; 10:53:29,601;   1;   4;  5;; not_moved
 56; 10:53:29,779;   0;  -1;  2;
 56; 10:53:29,840;   4;  -4; -4;
 56; 10:53:29,863;   5;  -1; -1;
 56; 10:53:30,034;   2;  -3; -3;
 56; 10:53:30,060;   3;  -4; -5;
 56; 10:53:30,284;   0;   0;  3;
 56; 10:53:30,506;   4;  -4; -5;
 56; 10:53:30,536;   2;  -4; -4;
 56; 10:53:30,658;   5;  -2; -2;
 56; 10:53:30,844;   0;  -1;  3;
 56; 10:53:31,014;   2;  -4; -5;
 56; 10:53:31,113;   3;  -4; -5;; not_moved
 56; 10:53:31,386;   5;  -3; -3;
 56; 10:53:31,413;   0;  -1;  4;
 56; 10:53:31,586;   4;  -4; -5;; not_moved
 56; 10:53:32,039;   2;  -4; -5;; not_moved
 56; 10:53:32,240;   5;  -4; -4;
 56; 10:53:32,459;   0;  -1;  4;; not_moved
 56; 10:53:33,120;   5;  -4; -5;
 56; 10:53:33,122;  -1;   0;  0;
 56; 10:53:33,122;   0;   0;  0;; not_moved
 56; 10:53:33,122;   1;   0;  0;; not_moved
 56; 10:53:33,122;   2;   0;  0;; not_moved
 56; 10:53:33,122;   3;   0;  0;; not_moved
 56; 10:53:33,122;   4;   0;  0;; not_moved
 56; 10:53:33,122;   5;   0;  0;; not_moved
 56; 10:53:33,122;   6;  -2; -5;; not_moved
 56; 10:53:33,122;   7;   2;  5;; not_moved
 56; 10:53:33,122;   8;  -3;  2;; not_moved
 56; 10:53:33,122;   9;   5;  3;; not_moved
 56; 10:53:40,651;   1;   0;  1;
 56; 10:53:40,962;   3;   0; -1;
 56; 10:53:40,992;   4;  -1; -1;
 56; 10:53:41,172;   1;   1;  2;
 56; 10:53:41,213;   0;  -1; -1;
 56; 10:53:41,531;   3;   0; -2;
 56; 10:53:41,569;   4;  -1; -2;
 56; 10:53:41,658;   2;  -1; -1;
 56; 10:53:41,723;   1;   2;  3;
 56; 10:53:41,924;   0;  -1; -2;
 56; 10:53:41,993;   2;  -1; -2;
 56; 10:53:42,194;   4;  -1; -3;
 56; 10:53:42,265;   1;   2;  4;
 56; 10:53:42,309;   3;   0; -3;
 56; 10:53:42,655;   0;  -1; -3;
 56; 10:53:42,696;   2;  -1; -3;
 56; 10:53:42,828;   1;   2;  5;
 56; 10:53:42,902;   5;  -1; -1;
 56; 10:53:43,032;   2;  -2; -4;
 56; 10:53:43,060;   3;  -1; -4;
 56; 10:53:43,165;   4;  -1; -4;
 56; 10:53:43,172;   0;  -1; -4;
 56; 10:53:43,587;   2;  -2; -5;
 56; 10:53:43,639;   3;  -2; -5;
 56; 10:53:43,653;   0;  -2; -5;
 56; 10:53:43,681;   5;  -1; -2;
 56; 10:53:43,918;   1;   2;  5;; not_moved
 56; 10:53:44,202;   4;  -1; -4;; not_moved
 56; 10:53:44,472;   4;  -2; -5;
 56; 10:53:44,648;   3;  -2; -5;; not_moved
 56; 10:53:44,660;   2;  -2; -5;; not_moved
 56; 10:53:44,673;   0;  -2; -5;; not_moved
 56; 10:53:44,718;   5;  -1; -2;; not_moved
 56; 10:53:44,984;   5;  -1; -3;
 56; 10:53:45,504;   4;  -2; -5;; not_moved
 56; 10:53:45,638;   5;  -1; -4;
 56; 10:53:46,272;   5;  -2; -5;
 56; 10:53:46,276;  -1;   0;  0;
 56; 10:53:46,276;   0;   0;  0;; not_moved
 56; 10:53:46,276;   1;   0;  0;; not_moved
 56; 10:53:46,276;   2;   0;  0;; not_moved
 56; 10:53:46,276;   3;   0;  0;; not_moved
 56; 10:53:46,276;   4;   0;  0;; not_moved
 56; 10:53:46,276;   5;   0;  0;; not_moved
 56; 10:53:46,276;   6;   5;  2;; not_moved
 56; 10:53:46,276;   7;  -2;  3;; not_moved
 56; 10:53:46,276;   8;  -5; -2;; not_moved
 56; 10:53:46,276;   9;   3;  5;; not_moved
 56; 10:53:53,591;   1;   1;  0;
 56; 10:53:53,875;   0;   1;  1;
 56; 10:53:54,091;   1;   2;  0;
 56; 10:53:54,320;   2;   1;  0;
 56; 10:53:54,385;   4;  -1;  0;
 56; 10:53:54,401;   0;   2;  2;
 56; 10:53:54,620;   1;   3;  1;
 56; 10:53:54,623;   3;   1;  0;
 56; 10:53:54,858;   0;   3;  3;
 56; 10:53:54,981;   2;   2;  0;
 56; 10:53:55,119;   4;  -2; -1;
 56; 10:53:55,232;   1;   4;  2;
 56; 10:53:55,258;   3;   2;  1;
 56; 10:53:55,298;   0;   3;  4;
 56; 10:53:55,514;   2;   3;  1;
 56; 10:53:55,745;   0;   3;  5;
 56; 10:53:55,757;   5;   1;  0;
 56; 10:53:55,857;   1;   5;  2;
 56; 10:53:55,864;   4;  -3; -1;
 56; 10:53:55,870;   3;   3;  1;
 56; 10:53:56,208;   2;   4;  1;
 56; 10:53:56,474;   3;   4;  2;
 56; 10:53:56,684;   4;  -3; -2;
 56; 10:53:56,770;   2;   5;  2;
 56; 10:53:56,797;   0;   3;  5;; not_moved
 56; 10:53:56,835;   5;   1;  0;; not_moved
 56; 10:53:56,906;   5;   2;  0;
 56; 10:53:56,935;   1;   5;  2;; not_moved
 56; 10:53:57,191;   3;   5;  2;
 56; 10:53:57,568;   5;   3;  1;
 56; 10:53:57,728;   4;  -3; -2;; not_moved
 56; 10:53:57,784;   2;   5;  2;; not_moved
 56; 10:53:58,270;   3;   5;  2;; not_moved
 56; 10:53:58,274;   5;   4;  1;
 56; 10:53:58,412;   4;  -4; -2;
 56; 10:53:58,999;   5;   5;  2;
 56; 10:53:59,271;   4;  -5; -2;
 56; 10:53:59,273;  -1;   0;  0;
 56; 10:53:59,273;   0;   0;  0;; not_moved
 56; 10:53:59,273;   1;   0;  0;; not_moved
 56; 10:53:59,273;   2;   0;  0;; not_moved
 56; 10:53:59,273;   3;   0;  0;; not_moved
 56; 10:53:59,273;   4;   0;  0;; not_moved
 56; 10:53:59,273;   5;   0;  0;; not_moved
 56; 10:53:59,273;   6;  -3;  2;; not_moved
 56; 10:53:59,273;   7;   2;  5;; not_moved
 56; 10:53:59,273;   8;  -5; -3;; not_moved
 56; 10:53:59,273;   9;   5;  3;; not_moved
 56; 10:54:06,721;   2;  -1;  0;
 56; 10:54:07,161;   4;   0;  1;
 56; 10:54:07,394;   1;   0;  1;
 56; 10:54:07,407;   2;  -2;  0;
 56; 10:54:07,510;   0;   0;  1;
 56; 10:54:07,550;   3;   0;  1;
 56; 10:54:07,855;   2;  -2;  1;
 56; 10:54:07,899;   4;  -1;  1;
 56; 10:54:07,938;   0;   0;  2;
 56; 10:54:08,114;   1;  -1;  1;
 56; 10:54:08,190;   3;  -1;  1;
 56; 10:54:08,363;   0;   1;  3;
 56; 10:54:08,458;   2;  -3;  1;
 56; 10:54:08,549;   4;  -2;  1;
 56; 10:54:08,684;   1;  -2;  1;
 56; 10:54:08,808;   3;  -2;  1;
 56; 10:54:08,851;   5;   0;  1;
 56; 10:54:08,972;   2;  -3;  2;
 56; 10:54:08,980;   0;   2;  4;
 56; 10:54:09,244;   4;  -2;  2;
 56; 10:54:09,390;   1;  -2;  2;
 56; 10:54:09,395;   3;  -3;  1;
 56; 10:54:09,633;   0;   2;  5;
 56; 10:54:09,716;   5;  -1;  1;
 56; 10:54:09,929;   3;  -3;  2;
 56; 10:54:09,942;   4;  -3;  2;
 56; 10:54:09,961;   1;  -3;  2;
 56; 10:54:09,998;   2;  -3;  2;; not_moved
 56; 10:54:10,241;   5;  -2;  1;
 56; 10:54:10,764;   0;   2;  5;; not_moved
 56; 10:54:10,830;   5;  -2;  2;
 56; 10:54:10,947;   4;  -3;  2;; not_moved
 56; 10:54:11,032;   3;  -3;  2;; not_moved
 56; 10:54:11,061;   1;  -3;  2;; not_moved
 56; 10:54:11,454;   5;  -3;  2;
 56; 10:54:11,456;  -1;   0;  0;
 56; 10:54:11,456;   0;   0;  0;; not_moved
 56; 10:54:11,456;   1;   0;  0;; not_moved
 56; 10:54:11,456;   2;   0;  0;; not_moved
 56; 10:54:11,456;   3;   0;  0;; not_moved
 56; 10:54:11,456;   4;   0;  0;; not_moved
 56; 10:54:11,456;   5;   0;  0;; not_moved
 56; 10:54:11,456;   6;  -4;  1;; not_moved
 56; 10:54:11,456;   7;   4; -1;; not_moved
 56; 10:54:11,456;   8;   5;  4;; not_moved
 56; 10:54:11,456;   9;  -1; -5;; not_moved
 56; 10:54:18,767;   3;  -1;  0;
 56; 10:54:19,215;   2;  -1;  0;
 56; 10:54:19,373;   3;  -2;  0;
 56; 10:54:19,406;   0;   1;  1;
 56; 10:54:19,679;   4;  -1;  0;
 56; 10:54:19,758;   1;   0;  1;
 56; 10:54:19,880;   2;  -2;  0;
 56; 10:54:19,968;   3;  -3;  0;
 56; 10:54:20,011;   0;   2;  2;
 56; 10:54:20,311;   1;  -1;  1;
 56; 10:54:20,369;   4;  -2;  0;
 56; 10:54:20,447;   2;  -3;  0;
 56; 10:54:20,467;   0;   3;  3;
 56; 10:54:20,592;   3;  -4;  0;
 56; 10:54:20,779;   5;  -1;  0;
 56; 10:54:20,801;   1;  -2;  1;
 56; 10:54:20,922;   0;   4;  4;
 56; 10:54:21,010;   2;  -4;  0;
 56; 10:54:21,151;   3;  -4;  1;
 56; 10:54:21,347;   1;  -3;  1;
 56; 10:54:21,399;   0;   5;  4;
 56; 10:54:21,441;   5;  -2;  0;
 56; 10:54:21,462;   4;  -2;  0;; not_moved
 56; 10:54:21,517;   4;  -3;  0;
 56; 10:54:21,547;   2;  -4;  1;
 56; 10:54:21,932;   1;  -4;  1;
 56; 10:54:22,115;   4;  -4;  0;
 56; 10:54:22,204;   3;  -4;  1;; not_moved
 56; 10:54:22,305;   5;  -3;  0;
 56; 10:54:22,431;   0;   5;  4;; not_moved
 56; 10:54:22,620;   2;  -4;  1;; not_moved
 56; 10:54:22,822;   4;  -4;  1;
 56; 10:54:22,922;   5;  -4;  0;
 56; 10:54:22,966;   1;  -4;  1;; not_moved
 56; 10:54:23,614;   5;  -4;  1;
 56; 10:54:23,616;  -1;   0;  0;
 56; 10:54:23,616;   0;   0;  0;; not_moved
 56; 10:54:23,616;   1;   0;  0;; not_moved
 56; 10:54:23,616;   2;   0;  0;; not_moved
 56; 10:54:23,616;   3;   0;  0;; not_moved
 56; 10:54:23,616;   4;   0;  0;; not_moved
 56; 10:54:23,616;   5;   0;  0;; not_moved
 56; 10:54:23,616;   6;  -2;  3;; not_moved
 56; 10:54:23,616;   7;   5;  2;; not_moved
 56; 10:54:23,616;   8;   3;  5;; not_moved
 56; 10:54:23,616;   9;  -3; -5;; not_moved
 56; 10:54:30,911;   1;   0;  1;
 56; 10:54:31,229;   2;  -1;  0;
 56; 10:54:31,398;   0;  -1; -1;
 56; 10:54:31,442;   1;  -1;  1;
 56; 10:54:31,449;   4;   0;  1;
 56; 10:54:31,708;   2;  -1;  1;
 56; 10:54:31,834;   0;  -2; -2;
 56; 10:54:31,969;   1;  -1;  2;
 56; 10:54:32,076;   4;   0;  2;
 56; 10:54:32,200;   0;  -2; -3;
 56; 10:54:32,212;   2;  -1;  2;
 56; 10:54:32,567;   1;  -2;  2;
 56; 10:54:32,575;   0;  -3; -4;
 56; 10:54:32,659;   4;  -1;  2;
 56; 10:54:32,669;   3;   0;  1;
 56; 10:54:32,883;   2;  -1;  3;
 56; 10:54:32,948;   5;   0;  1;
 56; 10:54:33,081;   0;  -3; -5;
 56; 10:54:33,249;   1;  -2;  3;
 56; 10:54:33,322;   3;  -1;  1;
 56; 10:54:33,327;   4;  -1;  3;
 56; 10:54:33,468;   2;  -2;  3;
 56; 10:54:33,604;   5;   0;  2;
 56; 10:54:33,904;   3;  -2;  1;
 56; 10:54:34,188;   0;  -3; -5;; not_moved
 56; 10:54:34,262;   4;  -2;  3;
 56; 10:54:34,288;   1;  -2;  3;; not_moved
 56; 10:54:34,439;   2;  -2;  3;; not_moved
 56; 10:54:34,466;   5;  -1;  2;
 56; 10:54:34,471;   3;  -2;  2;
 56; 10:54:35,100;   3;  -2;  3;
 56; 10:54:35,116;   5;  -1;  3;
 56; 10:54:35,320;   4;  -2;  3;; not_moved
 56; 10:54:36,085;   5;  -1;  3;; not_moved
 56; 10:54:36,143;   3;  -2;  3;; not_moved
 56; 10:54:36,258;   5;  -2;  3;
 56; 10:54:36,260;  -1;   0;  0;
 56; 10:54:36,260;   0;   0;  0;; not_moved
 56; 10:54:36,260;   1;   0;  0;; not_moved
 56; 10:54:36,260;   2;   0;  0;; not_moved
 56; 10:54:36,260;   3;   0;  0;; not_moved
 56; 10:54:36,260;   4;   0;  0;; not_moved
 56; 10:54:36,260;   5;   0;  0;; not_moved
 56; 10:54:36,260;   6;  -4;  1;; not_moved
 56; 10:54:36,260;   7;   5;  4;; not_moved
 56; 10:54:36,260;   8;  -5; -4;; not_moved
 56; 10:54:36,260;   9;   4; -1;; not_moved
 56; 10:54:43,718;   3;  -1;  0;
 56; 10:54:43,788;   1;  -1;  0;
 56; 10:54:44,246;   2;  -1;  0;
 56; 10:54:44,326;   1;  -2;  0;
 56; 10:54:44,345;   3;  -2;  0;
 56; 10:54:44,696;   4;  -1;  0;
 56; 10:54:44,750;   2;  -2;  0;
 56; 10:54:44,847;   1;  -3;  0;
 56; 10:54:44,917;   3;  -3;  0;
 56; 10:54:45,238;   2;  -3;  0;
 56; 10:54:45,246;   4;  -2;  0;
 56; 10:54:45,326;   0;   1;  1;
 56; 10:54:45,392;   1;  -4;  0;
 56; 10:54:45,454;   3;  -4;  0;
 56; 10:54:45,650;   5;  -1;  0;
 56; 10:54:45,761;   0;   2;  2;
 56; 10:54:45,763;   4;  -3;  0;
 56; 10:54:45,881;   1;  -4;  1;
 56; 10:54:45,928;   2;  -4;  0;
 56; 10:54:46,059;   3;  -4;  1;
 56; 10:54:46,271;   0;   3;  3;
 56; 10:54:46,322;   5;  -2;  0;
 56; 10:54:46,327;   4;  -4;  0;
 56; 10:54:46,466;   2;  -4;  1;
 56; 10:54:46,841;   0;   4;  4;
 56; 10:54:46,903;   5;  -3;  0;
 56; 10:54:46,906;   1;  -4;  1;; not_moved
 56; 10:54:47,156;   3;  -4;  1;; not_moved
 56; 10:54:47,160;   4;  -4;  1;
 56; 10:54:47,250;   0;   5;  4;
 56; 10:54:47,556;   2;  -4;  1;; not_moved
 56; 10:54:47,607;   5;  -4;  0;
 56; 10:54:48,195;   4;  -4;  1;; not_moved
 56; 10:54:48,208;   5;  -4;  1;
 56; 10:54:48,209;  -1;   0;  0;
 56; 10:54:48,209;   0;   0;  0;; not_moved
 56; 10:54:48,209;   1;   0;  0;; not_moved
 56; 10:54:48,209;   2;   0;  0;; not_moved
 56; 10:54:48,209;   3;   0;  0;; not_moved
 56; 10:54:48,209;   4;   0;  0;; not_moved
 56; 10:54:48,209;   5;   0;  0;; not_moved
 56; 10:54:48,209;   6;   5;  2;; not_moved
 56; 10:54:48,209;   7;  -5; -2;; not_moved
 56; 10:54:48,209;   8;  -2;  3;; not_moved
 56; 10:54:48,209;   9;  -3; -5;; not_moved
 56; 10:54:55,346;   1;   0; -1;
 56; 10:54:55,651;   2;   1;  0;
 56; 10:54:55,659;   3;  -1;  0;
 56; 10:54:55,834;   0;   1;  0;
 56; 10:54:55,855;   1;  -1; -2;
 56; 10:54:56,069;   4;   1;  0;
 56; 10:54:56,279;   0;   2;  0;
 56; 10:54:56,298;   3;  -2; -1;
 56; 10:54:56,352;   1;  -1; -3;
 56; 10:54:56,667;   2;   1;  0;; not_moved
 56; 10:54:56,906;   1;  -2; -4;
 56; 10:54:56,919;   0;   3;  1;
 56; 10:54:57,106;   4;   1;  0;; not_moved
 56; 10:54:57,216;   4;   2;  1;
 56; 10:54:57,279;   2;   2;  0;
 56; 10:54:57,304;   0;   4;  2;
 56; 10:54:57,379;   3;  -2; -1;; not_moved
 56; 10:54:57,443;   1;  -3; -5;
 56; 10:54:57,505;   5;   1;  0;
 56; 10:54:57,626;   0;   5;  2;
 56; 10:54:57,847;   4;   3;  1;
 56; 10:54:58,016;   2;   3;  1;
 56; 10:54:58,177;   5;   2;  0;
 56; 10:54:58,492;   2;   4;  1;
 56; 10:54:58,518;   1;  -3; -5;; not_moved
 56; 10:54:58,669;   4;   4;  1;
 56; 10:54:58,686;   0;   5;  2;; not_moved
 56; 10:54:58,770;   5;   3;  1;
 56; 10:54:59,020;   2;   5;  2;
 56; 10:54:59,453;   4;   5;  2;
 56; 10:54:59,504;   5;   4;  1;
 56; 10:55:00,071;   2;   5;  2;; not_moved
 56; 10:55:00,143;   5;   5;  2;
 56; 10:55:00,510;   4;   5;  2;; not_moved
 56; 10:55:01,163;   5;   5;  2;; not_moved
 56; 10:55:01,932;   3;  -3; -1;
 56; 10:55:02,522;   3;  -4; -1;
 56; 10:55:03,142;   3;  -5; -2;
 56; 10:55:03,145;  -1;   0;  0;
 56; 10:55:03,145;   0;   0;  0;; not_moved
 56; 10:55:03,145;   1;   0;  0;; not_moved
 56; 10:55:03,145;   2;   0;  0;; not_moved
 56; 10:55:03,145;   3;   0;  0;; not_moved
 56; 10:55:03,145;   4;   0;  0;; not_moved
 56; 10:55:03,145;   5;   0;  0;; not_moved
 56; 10:55:03,145;   6;   2;  5;; not_moved
 56; 10:55:03,145;   7;  -5; -3;; not_moved
 56; 10:55:03,145;   8;  -2; -5;; not_moved
 56; 10:55:03,145;   9;  -3;  2;; not_moved
 56; 10:55:10,616;   1;  -1; -1;
 56; 10:55:10,751;   2;   1;  1;
 56; 10:55:11,072;   3;   0;  1;
 56; 10:55:11,137;   1;  -2; -2;
 56; 10:55:11,340;   0;   0;  1;
 56; 10:55:11,380;   2;   1;  2;
 56; 10:55:11,656;   1;  -3; -2;
 56; 10:55:11,695;   3;   1;  2;
 56; 10:55:11,771;   0;  -1;  1;
 56; 10:55:11,854;   2;   1;  3;
 56; 10:55:12,083;   4;  -1; -1;
 56; 10:55:12,226;   1;  -4; -3;
 56; 10:55:12,297;   3;   1;  3;
 56; 10:55:12,451;   2;   2;  4;
 56; 10:55:12,454;   0;  -2;  1;
 56; 10:55:12,781;   4;  -2; -1;
 56; 10:55:12,949;   3;   2;  4;
 56; 10:55:12,956;   5;   0;  1;
 56; 10:55:13,021;   1;  -5; -3;
 56; 10:55:13,107;   2;   2;  5;
 56; 10:55:13,161;   0;  -3;  1;
 56; 10:55:13,496;   4;  -3; -2;
 56; 10:55:13,687;   3;   2;  5;
 56; 10:55:13,979;   5;   0;  1;; not_moved
 56; 10:55:14,037;   1;  -5; -3;; not_moved
 56; 10:55:14,194;   2;   2;  5;; not_moved
 56; 10:55:14,206;   0;  -3;  1;; not_moved
 56; 10:55:14,440;   0;  -3;  2;
 56; 10:55:14,529;   4;  -4; -2;
 56; 10:55:14,703;   3;   2;  5;; not_moved
 56; 10:55:14,790;   5;   0;  2;
 56; 10:55:15,408;   0;  -3;  2;; not_moved
 56; 10:55:15,468;   5;   1;  3;
 56; 10:55:15,543;   4;  -5; -3;
 56; 10:55:16,281;   5;   2;  4;
 56; 10:55:16,576;   4;  -5; -3;; not_moved
 56; 10:55:17,225;   5;   2;  5;
 56; 10:55:17,227;  -1;   0;  0;
 56; 10:55:17,227;   0;   0;  0;; not_moved
 56; 10:55:17,227;   1;   0;  0;; not_moved
 56; 10:55:17,227;   2;   0;  0;; not_moved
 56; 10:55:17,227;   3;   0;  0;; not_moved
 56; 10:55:17,227;   4;   0;  0;; not_moved
 56; 10:55:17,227;   5;   0;  0;; not_moved
 56; 10:55:17,227;   6;  -1; -5;; not_moved
 56; 10:55:17,227;   7;  -5; -4;; not_moved
 56; 10:55:17,227;   8;   1;  5;; not_moved
 56; 10:55:17,227;   9;  -4;  1;; not_moved
 56; 10:55:23,945;   1;  -1;  0;
 56; 10:55:24,563;   1;  -2;  0;
 56; 10:55:24,954;   3;   0; -1;
 56; 10:55:25,101;   1;  -3;  0;
 56; 10:55:25,149;   0;   0; -1;
 56; 10:55:25,435;   4;   0; -1;
 56; 10:55:25,523;   3;   0; -2;
 56; 10:55:25,641;   1;  -4;  0;
 56; 10:55:25,677;   0;   0; -2;
 56; 10:55:25,819;   2;  -1;  0;
 56; 10:55:26,052;   0;   0; -3;
 56; 10:55:26,072;   4;   0; -2;
 56; 10:55:26,092;   3;   0; -3;
 56; 10:55:26,177;   1;  -4;  1;
 56; 10:55:26,456;   2;  -2;  0;
 56; 10:55:26,636;   0;   0; -4;
 56; 10:55:26,736;   4;   0; -3;
 56; 10:55:26,801;   3;   0; -4;
 56; 10:55:26,864;   5;   0; -1;
 56; 10:55:26,929;   2;  -3;  0;
 56; 10:55:27,254;   1;  -4;  1;; not_moved
 56; 10:55:27,311;   3;  -1; -5;
 56; 10:55:27,469;   2;  -3;  1;
 56; 10:55:27,547;   5;   0; -2;
 56; 10:55:27,628;   0;   0; -4;; not_moved
 56; 10:55:27,750;   4;   0; -3;; not_moved
 56; 10:55:27,852;   4;   0; -4;
 56; 10:55:28,220;   5;   0; -3;
 56; 10:55:28,322;   3;  -1; -5;; not_moved
 56; 10:55:28,499;   4;  -1; -5;
 56; 10:55:28,514;   2;  -3;  1;; not_moved
 56; 10:55:28,769;   2;  -4;  1;
 56; 10:55:28,807;   5;   0; -4;
 56; 10:55:29,427;   5;  -1; -5;
 56; 10:55:29,553;   4;  -1; -5;; not_moved
 56; 10:55:29,580;   0;  -1; -5;
 56; 10:55:29,581;  -1;   0;  0;
 56; 10:55:29,581;   0;   0;  0;; not_moved
 56; 10:55:29,581;   1;   0;  0;; not_moved
 56; 10:55:29,581;   2;   0;  0;; not_moved
 56; 10:55:29,581;   3;   0;  0;; not_moved
 56; 10:55:29,581;   4;   0;  0;; not_moved
 56; 10:55:29,581;   5;   0;  0;; not_moved
 56; 10:55:29,581;   6;   3;  5;; not_moved
 56; 10:55:29,581;   7;   2; -3;; not_moved
 56; 10:55:29,581;   8;   5;  2;; not_moved
 56; 10:55:29,581;   9;  -3; -5;; not_moved
 56; 10:55:36,872;   1;   1;  1;
 56; 10:55:37,346;   1;   2;  2;
 56; 10:55:37,393;   4;   1;  1;
 56; 10:55:37,827;   1;   3;  3;
 56; 10:55:38,002;   2;   1;  1;
 56; 10:55:38,089;   4;   2;  2;
 56; 10:55:38,397;   1;   3;  4;
 56; 10:55:38,410;   5;   1;  1;
 56; 10:55:38,536;   2;   1;  2;
 56; 10:55:38,780;   4;   3;  3;
 56; 10:55:38,925;   1;   3;  5;
 56; 10:55:39,152;   2;   2;  3;
 56; 10:55:39,218;   5;   2;  2;
 56; 10:55:39,455;   4;   4;  4;
 56; 10:55:39,521;   0;   0; -1;
 56; 10:55:39,660;   2;   2;  4;
 56; 10:55:39,872;   3;   1;  1;
 56; 10:55:39,875;   5;   3;  3;
 56; 10:55:39,957;   0;   0; -2;
 56; 10:55:39,971;   1;   3;  5;; not_moved
 56; 10:55:40,272;   4;   3;  4;
 56; 10:55:40,388;   2;   3;  5;
 56; 10:55:40,534;   0;   1; -2;
 56; 10:55:40,636;   3;   2;  2;
 56; 10:55:40,676;   5;   3;  4;
 56; 10:55:40,914;   4;   3;  5;
 56; 10:55:40,958;   0;   2; -2;
 56; 10:55:41,326;   3;   3;  3;
 56; 10:55:41,340;   5;   3;  5;
 56; 10:55:41,410;   0;   2; -3;
 56; 10:55:41,431;   2;   3;  5;; not_moved
 56; 10:55:41,970;   4;   3;  5;; not_moved
 56; 10:55:42,000;   3;   3;  4;
 56; 10:55:42,326;   5;   3;  5;; not_moved
 56; 10:55:42,459;   0;   2; -3;; not_moved
 56; 10:55:42,638;   3;   3;  5;
 56; 10:55:42,640;  -1;   0;  0;
 56; 10:55:42,640;   0;   0;  0;; not_moved
 56; 10:55:42,640;   1;   0;  0;; not_moved
 56; 10:55:42,640;   2;   0;  0;; not_moved
 56; 10:55:42,640;   3;   0;  0;; not_moved
 56; 10:55:42,640;   4;   0;  0;; not_moved
 56; 10:55:42,640;   5;   0;  0;; not_moved
 56; 10:55:42,640;   6;  -3; -5;; not_moved
 56; 10:55:42,640;   7;  -2;  3;; not_moved
 56; 10:55:42,640;   8;   2; -3;; not_moved
 56; 10:55:42,640;   9;   3;  5;; not_moved
 56; 10:55:50,128;   2;  -1; -1;
 56; 10:55:50,161;   4;  -1; -1;
 56; 10:55:50,209;   1;   0; -1;
 56; 10:55:50,719;   1;  -1; -2;
 56; 10:55:50,836;   2;  -1; -2;
 56; 10:55:50,860;   4;  -1; -2;
 56; 10:55:51,240;   1;  -2; -3;
 56; 10:55:51,332;   2;  -2; -3;
 56; 10:55:51,461;   4;  -2; -3;
 56; 10:55:51,745;   1;  -3; -4;
 56; 10:55:51,970;   2;  -2; -4;
 56; 10:55:52,143;   3;  -1; -1;
 56; 10:55:52,171;   4;  -2; -4;
 56; 10:55:52,309;   1;  -3; -5;
 56; 10:55:52,452;   0;   1;  1;
 56; 10:55:52,523;   2;  -3; -5;
 56; 10:55:52,833;   3;  -1; -2;
 56; 10:55:52,897;   4;  -3; -5;
 56; 10:55:53,107;   5;  -1; -1;
 56; 10:55:53,221;   0;   2;  2;
 56; 10:55:53,390;   1;  -3; -5;; not_moved
 56; 10:55:53,484;   3;  -2; -3;
 56; 10:55:53,561;   2;  -3; -5;; not_moved
 56; 10:55:53,853;   5;  -1; -2;
 56; 10:55:53,894;   0;   3;  3;
 56; 10:55:53,964;   4;  -3; -5;; not_moved
 56; 10:55:54,100;   3;  -3; -4;
 56; 10:55:54,590;   0;   3;  4;
 56; 10:55:54,780;   3;  -3; -5;
 56; 10:55:54,800;   5;  -2; -3;
 56; 10:55:55,296;   0;   3;  5;
 56; 10:55:55,558;   5;  -3; -4;
 56; 10:55:55,869;   3;  -3; -5;; not_moved
 56; 10:55:56,323;   5;  -3; -5;
 56; 10:55:56,325;  -1;   0;  0;
 56; 10:55:56,325;   0;   0;  0;; not_moved
 56; 10:55:56,325;   1;   0;  0;; not_moved
 56; 10:55:56,325;   2;   0;  0;; not_moved
 56; 10:55:56,325;   3;   0;  0;; not_moved
 56; 10:55:56,325;   4;   0;  0;; not_moved
 56; 10:55:56,325;   5;   0;  0;; not_moved
 56; 10:55:56,325;   6;   4; -1;; not_moved
 56; 10:55:56,325;   7;  -5; -4;; not_moved
 56; 10:55:56,325;   8;   1;  5;; not_moved
 56; 10:55:56,325;   9;  -1; -5;; not_moved
 56; 10:56:03,812;   1;   1;  0;
 56; 10:56:04,101;   4;   0; -1;
 56; 10:56:04,183;   2;   1;  0;
 56; 10:56:04,369;   0;   1;  0;
 56; 10:56:04,486;   1;   2;  0;
 56; 10:56:04,720;   2;   2;  0;
 56; 10:56:04,773;   4;   1; -1;
 56; 10:56:04,804;   0;   2;  0;
 56; 10:56:04,943;   1;   3;  0;
 56; 10:56:05,161;   2;   3;  0;
 56; 10:56:05,262;   0;   3;  0;
 56; 10:56:05,395;   3;   1;  0;
 56; 10:56:05,475;   1;   4;  0;
 56; 10:56:05,500;   4;   2; -1;
 56; 10:56:05,618;   2;   4;  0;
 56; 10:56:05,657;   5;   1;  0;
 56; 10:56:05,832;   0;   4;  0;
 56; 10:56:05,912;   3;   2;  0;
 56; 10:56:06,070;   4;   3; -1;
 56; 10:56:06,111;   1;   4; -1;
 56; 10:56:06,226;   2;   4; -1;
 56; 10:56:06,259;   0;   4; -1;
 56; 10:56:06,330;   5;   2;  0;
 56; 10:56:06,528;   3;   3;  0;
 56; 10:56:06,723;   4;   4; -1;
 56; 10:56:06,906;   5;   3;  0;
 56; 10:56:07,070;   3;   4;  0;
 56; 10:56:07,252;   1;   4; -1;; not_moved
 56; 10:56:07,288;   2;   4; -1;; not_moved
 56; 10:56:07,302;   0;   4; -1;; not_moved
 56; 10:56:07,592;   5;   4;  0;
 56; 10:56:07,722;   3;   4; -1;
 56; 10:56:07,770;   4;   4; -1;; not_moved
 56; 10:56:08,278;   5;   4; -1;
 56; 10:56:08,281;  -1;   0;  0;
 56; 10:56:08,281;   0;   0;  0;; not_moved
 56; 10:56:08,281;   1;   0;  0;; not_moved
 56; 10:56:08,281;   2;   0;  0;; not_moved
 56; 10:56:08,281;   3;   0;  0;; not_moved
 56; 10:56:08,281;   4;   0;  0;; not_moved
 56; 10:56:08,281;   5;   0;  0;; not_moved
 56; 10:56:08,281;   6;   1;  5;; not_moved
 56; 10:56:08,281;   7;   4; -1;; not_moved
 56; 10:56:08,281;   8;  -5; -4;; not_moved
 56; 10:56:08,281;   9;  -1; -5;; not_moved
 56; 10:56:16,073;   1;   1;  1;
 56; 10:56:16,168;   2;   0;  1;
 56; 10:56:16,342;   3;   0;  1;
 56; 10:56:16,445;   4;   0;  1;
 56; 10:56:16,631;   1;   1;  2;
 56; 10:56:16,752;   0;  -1; -1;
 56; 10:56:16,779;   2;   0;  2;
 56; 10:56:16,901;   3;   0;  2;
 56; 10:56:17,073;   4;   0;  2;
 56; 10:56:17,194;   0;  -2; -2;
 56; 10:56:17,203;   2;   0;  3;
 56; 10:56:17,206;   1;   1;  3;
 56; 10:56:17,338;   5;   1;  1;
 56; 10:56:17,435;   3;   1;  3;
 56; 10:56:17,700;   0;  -3; -3;
 56; 10:56:17,720;   1;   1;  4;
 56; 10:56:17,766;   2;   1;  4;
 56; 10:56:18,033;   3;   1;  4;
 56; 10:56:18,054;   5;   1;  2;
 56; 10:56:18,056;   0;  -4; -4;
 56; 10:56:18,083;   4;   0;  2;; not_moved
 56; 10:56:18,096;   4;   0;  3;
 56; 10:56:18,267;   1;   1;  5;
 56; 10:56:18,300;   2;   1;  5;
 56; 10:56:18,601;   3;   1;  5;
 56; 10:56:18,665;   0;  -5; -4;
 56; 10:56:18,765;   5;   1;  3;
 56; 10:56:18,819;   4;   0;  4;
 56; 10:56:19,323;   1;   1;  5;; not_moved
 56; 10:56:19,329;   2;   1;  5;; not_moved
 56; 10:56:19,507;   5;   1;  4;
 56; 10:56:19,529;   4;   1;  5;
 56; 10:56:19,701;   3;   1;  5;; not_moved
 56; 10:56:19,721;   0;  -5; -4;; not_moved
 56; 10:56:20,168;   5;   1;  5;
 56; 10:56:20,173;  -1;   0;  0;
 56; 10:56:20,173;   0;   0;  0;; not_moved
 56; 10:56:20,173;   1;   0;  0;; not_moved
 56; 10:56:20,173;   2;   0;  0;; not_moved
 56; 10:56:20,173;   3;   0;  0;; not_moved
 56; 10:56:20,173;   4;   0;  0;; not_moved
 56; 10:56:20,173;   5;   0;  0;; not_moved
 56; 10:56:20,173;   6;  -2;  3;; not_moved
 56; 10:56:20,173;   7;   5;  2;; not_moved
 56; 10:56:20,173;   8;   3;  5;; not_moved
 56; 10:56:20,173;   9;  -3; -5;; not_moved
 56; 10:56:27,544;   1;   0;  1;
 56; 10:56:27,667;   2;  -1;  0;
 56; 10:56:27,768;   0;   0;  1;
 56; 10:56:27,908;   3;   0;  1;
 56; 10:56:28,084;   4;   0;  1;
 56; 10:56:28,098;   1;  -1;  1;
 56; 10:56:28,177;   2;  -1;  1;
 56; 10:56:28,333;   0;   0;  2;
 56; 10:56:28,439;   5;   0;  1;
 56; 10:56:28,480;   3;   0;  2;
 56; 10:56:28,608;   1;  -1;  2;
 56; 10:56:28,920;   0;   0;  3;
 56; 10:56:28,933;   4;   0;  2;
 56; 10:56:28,982;   5;   0;  2;
 56; 10:56:29,217;   2;  -1;  1;; not_moved
 56; 10:56:29,259;   2;  -2;  1;
 56; 10:56:29,332;   0;  -1;  3;
 56; 10:56:29,367;   1;  -1;  3;
 56; 10:56:29,514;   3;   0;  2;; not_moved
 56; 10:56:29,663;   4;  -1;  2;
 56; 10:56:29,780;   0;  -2;  3;
 56; 10:56:29,833;   2;  -2;  2;
 56; 10:56:29,987;   1;  -2;  3;
 56; 10:56:30,014;   5;   0;  2;; not_moved
 56; 10:56:30,123;   5;   0;  3;
 56; 10:56:30,417;   2;  -2;  3;
 56; 10:56:30,699;   4;  -1;  2;; not_moved
 56; 10:56:30,800;   5;  -1;  3;
 56; 10:56:30,835;   0;  -2;  3;; not_moved
 56; 10:56:31,038;   1;  -2;  3;; not_moved
 56; 10:56:31,319;   5;  -2;  3;
 56; 10:56:31,460;   2;  -2;  3;; not_moved
 56; 10:56:31,474;   3;  -1;  2;
 56; 10:56:32,346;   3;  -2;  2;
 56; 10:56:32,417;   5;  -2;  3;; not_moved
 56; 10:56:32,422;   4;  -1;  3;
 56; 10:56:33,052;   3;  -2;  3;
 56; 10:56:33,388;   4;  -2;  3;
 56; 10:56:33,398;  -1;   0;  0;
 56; 10:56:33,398;   0;   0;  0;; not_moved
 56; 10:56:33,398;   1;   0;  0;; not_moved
 56; 10:56:33,398;   2;   0;  0;; not_moved
 56; 10:56:33,398;   3;   0;  0;; not_moved
 56; 10:56:33,398;   4;   0;  0;; not_moved
 56; 10:56:33,398;   5;   0;  0;; not_moved
 56; 10:56:33,398;   6;   3;  5;; not_moved
 56; 10:56:33,398;   7;   5;  2;; not_moved
 56; 10:56:33,398;   8;  -2;  3;; not_moved
 56; 10:56:33,398;   9;  -3; -5;; not_moved
 56; 10:56:40,704;   2;   0;  1;
 56; 10:56:41,117;   3;   1;  1;
 56; 10:56:41,319;   2;   1;  2;
 56; 10:56:41,411;   0;  -1;  0;
 56; 10:56:41,795;   2;   1;  3;
 56; 10:56:41,817;   0;  -1;  1;
 56; 10:56:41,835;   4;   1;  1;
 56; 10:56:41,841;   3;   2;  2;
 56; 10:56:42,194;   1;   1;  1;
 56; 10:56:42,281;   0;  -1;  2;
 56; 10:56:42,447;   2;   2;  4;
 56; 10:56:42,458;   3;   3;  3;
 56; 10:56:42,759;   5;   1;  1;
 56; 10:56:42,788;   4;   2;  2;
 56; 10:56:42,844;   0;  -2;  2;
 56; 10:56:43,057;   2;   3;  5;
 56; 10:56:43,058;   3;   3;  4;
 56; 10:56:43,101;   1;   2;  2;
 56; 10:56:43,308;   0;  -2;  3;
 56; 10:56:43,517;   4;   3;  3;
 56; 10:56:43,560;   5;   2;  2;
 56; 10:56:43,631;   1;   3;  3;
 56; 10:56:43,832;   3;   3;  5;
 56; 10:56:44,133;   2;   3;  5;; not_moved
 56; 10:56:44,216;   1;   4;  4;
 56; 10:56:44,246;   5;   3;  3;
 56; 10:56:44,352;   0;  -2;  3;; not_moved
 56; 10:56:44,499;   4;   4;  4;
 56; 10:56:44,834;   3;   3;  5;; not_moved
 56; 10:56:44,983;   1;   3;  4;
 56; 10:56:45,020;   5;   3;  4;
 56; 10:56:45,465;   4;   3;  4;
 56; 10:56:45,551;   1;   3;  5;
 56; 10:56:45,712;   5;   3;  5;
 56; 10:56:46,541;   4;   3;  4;; not_moved
 56; 10:56:46,556;   1;   3;  5;; not_moved
 56; 10:56:46,734;   4;   3;  5;
 56; 10:56:46,735;   5;   3;  5;; not_moved
 56; 10:56:46,736;  -1;   0;  0;
 56; 10:56:46,736;   0;   0;  0;; not_moved
 56; 10:56:46,736;   1;   0;  0;; not_moved
 56; 10:56:46,736;   2;   0;  0;; not_moved
 56; 10:56:46,736;   3;   0;  0;; not_moved
 56; 10:56:46,736;   4;   0;  0;; not_moved
 56; 10:56:46,736;   5;   0;  0;; not_moved
 56; 10:56:46,736;   6;  -4; -5;; not_moved
 56; 10:56:46,736;   7;   1; -4;; not_moved
 56; 10:56:46,736;   8;   5;  1;; not_moved
 56; 10:56:46,736;   9;   4;  5;; not_moved
 56; 10:56:54,546;   3;  -1; -1;
 56; 10:56:54,846;   1;   0; -1;
 56; 10:56:55,176;   3;  -2; -2;
 56; 10:56:55,440;   1;  -1; -2;
 56; 10:56:55,528;   4;   0; -1;
 56; 10:56:55,638;   3;  -3; -3;
 56; 10:56:55,860;   5;  -1; -1;
 56; 10:56:55,887;   1;  -2; -3;
 56; 10:56:56,052;   2;  -1; -1;
 56; 10:56:56,175;   3;  -4; -4;
 56; 10:56:56,184;   4;  -1; -2;
 56; 10:56:56,425;   1;  -3; -4;
 56; 10:56:56,572;   5;  -2; -2;
 56; 10:56:56,745;   3;  -4; -5;
 56; 10:56:56,903;   4;  -2; -3;
 56; 10:56:56,997;   1;  -4; -5;
 56; 10:56:57,038;   2;  -2; -2;
 56; 10:56:57,163;   5;  -3; -3;
 56; 10:56:57,725;   2;  -3; -3;
 56; 10:56:57,751;   3;  -4; -5;; not_moved
 56; 10:56:57,759;   4;  -3; -4;
 56; 10:56:57,884;   5;  -4; -4;
 56; 10:56:57,896;   0;   0; -1;
 56; 10:56:58,071;   1;  -4; -5;; not_moved
 56; 10:56:58,295;   0;   0; -2;
 56; 10:56:58,363;   2;  -4; -4;
 56; 10:56:58,369;   4;  -4; -5;
 56; 10:56:58,426;   5;  -4; -5;
 56; 10:56:58,856;   0;   0; -3;
 56; 10:56:58,879;   2;  -4; -5;
 56; 10:56:59,374;   4;  -4; -5;; not_moved
 56; 10:56:59,381;   0;   0; -4;
 56; 10:56:59,451;   5;  -4; -5;; not_moved
 56; 10:56:59,912;   2;  -4; -5;; not_moved
 56; 10:56:59,932;   0;   1; -4;
 56; 10:56:59,936;  -1;   0;  0;
 56; 10:56:59,936;   0;   0;  0;; not_moved
 56; 10:56:59,936;   1;   0;  0;; not_moved
 56; 10:56:59,936;   2;   0;  0;; not_moved
 56; 10:56:59,936;   3;   0;  0;; not_moved
 56; 10:56:59,936;   4;   0;  0;; not_moved
 56; 10:56:59,936;   5;   0;  0;; not_moved
 56; 10:56:59,936;   6;  -1; -5;; not_moved
 56; 10:56:59,936;   7;   4; -1;; not_moved
 56; 10:56:59,936;   8;  -5; -4;; not_moved
 56; 10:56:59,936;   9;   1;  5;; not_moved
 56; 10:57:07,201;   1;   1;  0;
 56; 10:57:07,382;   2;  -1; -1;
 56; 10:57:07,574;   3;   0; -1;
 56; 10:57:07,649;   1;   2;  0;
 56; 10:57:07,743;   4;   0; -1;
 56; 10:57:07,958;   2;  -1; -2;
 56; 10:57:08,091;   3;   0; -2;
 56; 10:57:08,164;   1;   3;  0;
 56; 10:57:08,395;   4;   0; -2;
 56; 10:57:08,445;   5;   0; -1;
 56; 10:57:08,574;   3;   0; -3;
 56; 10:57:08,590;   2;  -1; -3;
 56; 10:57:08,690;   1;   4;  0;
 56; 10:57:09,015;   4;   0; -3;
 56; 10:57:09,099;   3;   0; -4;
 56; 10:57:09,106;   5;   0; -2;
 56; 10:57:09,191;   2;  -1; -4;
 56; 10:57:09,191;   1;   4; -1;
 56; 10:57:09,575;   4;   0; -4;
 56; 10:57:09,583;   3;  -1; -5;
 56; 10:57:09,693;   5;   0; -3;
 56; 10:57:09,736;   2;  -1; -5;
 56; 10:57:10,228;   1;   4; -1;; not_moved
 56; 10:57:10,245;   4;  -1; -5;
 56; 10:57:10,332;   0;   1;  0;
 56; 10:57:10,365;   5;   0; -4;
 56; 10:57:10,708;   3;  -1; -5;; not_moved
 56; 10:57:10,767;   0;   2;  0;
 56; 10:57:10,784;   2;  -1; -5;; not_moved
 56; 10:57:10,989;   5;  -1; -5;
 56; 10:57:11,149;   0;   3;  0;
 56; 10:57:11,289;   4;  -1; -5;; not_moved
 56; 10:57:11,538;   0;   4;  0;
 56; 10:57:11,959;   0;   4; -1;
 56; 10:57:11,963;  -1;   0;  0;
 56; 10:57:11,963;   0;   0;  0;; not_moved
 56; 10:57:11,963;   1;   0;  0;; not_moved
 56; 10:57:11,963;   2;   0;  0;; not_moved
 56; 10:57:11,963;   3;   0;  0;; not_moved
 56; 10:57:11,963;   4;   0;  0;; not_moved
 56; 10:57:11,963;   5;   0;  0;; not_moved
 56; 10:57:11,963;   6;   5;  1;; not_moved
 56; 10:57:11,963;   7;  -4; -5;; not_moved
 56; 10:57:11,963;   8;   4;  5;; not_moved
 56; 10:57:11,963;   9;   1; -4;; not_moved
 56; 10:57:19,253;   1;   1;  0;
 56; 10:57:19,393;   2;   1;  0;
 56; 10:57:19,671;   3;   1;  0;
 56; 10:57:19,773;   1;   2;  0;
 56; 10:57:19,916;   2;   2;  0;
 56; 10:57:19,984;   4;   1;  0;
 56; 10:57:20,007;   0;   1;  0;
 56; 10:57:20,156;   3;   2;  0;
 56; 10:57:20,296;   1;   3;  0;
 56; 10:57:20,350;   2;   3;  0;
 56; 10:57:20,624;   4;   2;  0;
 56; 10:57:20,645;   3;   3;  0;
 56; 10:57:20,747;   5;   1;  0;
 56; 10:57:20,810;   1;   4;  0;
 56; 10:57:20,941;   2;   4;  0;
 56; 10:57:21,051;   0;   1;  0;; not_moved
 56; 10:57:21,109;   0;   2;  0;
 56; 10:57:21,199;   3;   4;  0;
 56; 10:57:21,266;   4;   3;  0;
 56; 10:57:21,328;   1;   5;  1;
 56; 10:57:21,392;   2;   5;  1;
 56; 10:57:21,552;   0;   3;  0;
 56; 10:57:21,769;   3;   5;  1;
 56; 10:57:21,792;   5;   1;  0;; not_moved
 56; 10:57:22,016;   5;   2;  0;
 56; 10:57:22,189;   0;   4;  1;
 56; 10:57:22,306;   4;   3;  0;; not_moved
 56; 10:57:22,403;   1;   5;  1;; not_moved
 56; 10:57:22,412;   2;   5;  1;; not_moved
 56; 10:57:22,639;   0;   5;  1;
 56; 10:57:22,783;   3;   5;  1;; not_moved
 56; 10:57:22,868;   5;   3;  0;
 56; 10:57:23,018;   4;   4;  0;
 56; 10:57:23,664;   0;   5;  1;; not_moved
 56; 10:57:23,895;   5;   3;  0;; not_moved
 56; 10:57:24,108;   4;   4;  0;; not_moved
 56; 10:57:24,398;   4;   5;  1;
 56; 10:57:25,452;   4;   5;  1;; not_moved
 56; 10:57:25,494;   5;   4;  0;
 56; 10:57:26,540;   5;   4;  0;; not_moved
 56; 10:57:27,165;   5;   5;  1;
 56; 10:57:27,168;  -1;   0;  0;
 56; 10:57:27,168;   0;   0;  0;; not_moved
 56; 10:57:27,168;   1;   0;  0;; not_moved
 56; 10:57:27,168;   2;   0;  0;; not_moved
 56; 10:57:27,168;   3;   0;  0;; not_moved
 56; 10:57:27,168;   4;   0;  0;; not_moved
 56; 10:57:27,168;   5;   0;  0;; not_moved
 56; 10:57:27,168;   6;   1; -4;; not_moved
 56; 10:57:27,168;   7;  -4; -5;; not_moved
 56; 10:57:27,168;   8;   4;  5;; not_moved
 56; 10:57:27,168;   9;  -5; -1;; not_moved
 56; 10:57:34,451;   0;   0; -1;
 56; 10:57:34,723;   3;   0; -1;
 56; 10:57:34,763;   4;   0; -1;
 56; 10:57:34,865;   1;   0; -1;
 56; 10:57:35,066;   0;   0; -2;
 56; 10:57:35,266;   2;   0; -1;
 56; 10:57:35,294;   1;   0; -2;
 56; 10:57:35,297;   3;   0; -2;
 56; 10:57:35,486;   0;   0; -3;
 56; 10:57:35,539;   4;   0; -2;
 56; 10:57:35,743;   2;   0; -2;
 56; 10:57:35,748;   1;   0; -3;
 56; 10:57:35,800;   3;   0; -3;
 56; 10:57:35,947;   0;   1; -3;
 56; 10:57:36,138;   5;   0; -1;
 56; 10:57:36,177;   4;   0; -3;
 56; 10:57:36,253;   0;   1; -4;
 56; 10:57:36,290;   2;   0; -3;
 56; 10:57:36,367;   1;   0; -4;
 56; 10:57:36,384;   3;   0; -4;
 56; 10:57:36,831;   1;   1; -4;
 56; 10:57:36,912;   2;   0; -4;
 56; 10:57:36,928;   3;   1; -4;
 56; 10:57:36,941;   5;   0; -2;
 56; 10:57:37,226;   4;   0; -3;; not_moved
 56; 10:57:37,290;   0;   1; -4;; not_moved
 56; 10:57:37,435;   2;   1; -4;
 56; 10:57:37,747;   5;   0; -3;
 56; 10:57:37,923;   1;   1; -4;; not_moved
 56; 10:57:37,983;   4;   0; -4;
 56; 10:57:38,006;   3;   1; -4;; not_moved
 56; 10:57:38,489;   5;   0; -4;
 56; 10:57:38,521;   2;   1; -4;; not_moved
 56; 10:57:38,962;   4;   1; -4;
 56; 10:57:39,287;   5;   1; -4;
 56; 10:57:39,290;  -1;   0;  0;
 56; 10:57:39,290;   0;   0;  0;; not_moved
 56; 10:57:39,290;   1;   0;  0;; not_moved
 56; 10:57:39,290;   2;   0;  0;; not_moved
 56; 10:57:39,290;   3;   0;  0;; not_moved
 56; 10:57:39,290;   4;   0;  0;; not_moved
 56; 10:57:39,290;   5;   0;  0;; not_moved
 56; 10:57:39,290;   6;   5;  1;; not_moved
 56; 10:57:39,290;   7;   4;  5;; not_moved
 56; 10:57:39,290;   8;  -4; -5;; not_moved
 56; 10:57:39,290;   9;   1; -4;; not_moved
 56; 10:57:46,284;   1;   1;  0;
 56; 10:57:46,544;   2;   1;  0;
 56; 10:57:46,709;   1;   2;  0;
 56; 10:57:46,795;   3;   1;  0;
 56; 10:57:47,012;   2;   2;  0;
 56; 10:57:47,208;   1;   3;  0;
 56; 10:57:47,405;   3;   2;  0;
 56; 10:57:47,492;   2;   3;  0;
 56; 10:57:47,622;   4;   1;  0;
 56; 10:57:47,628;   1;   4;  0;
 56; 10:57:47,658;   5;   1;  0;
 56; 10:57:47,975;   2;   4;  0;
 56; 10:57:47,984;   3;   3;  0;
 56; 10:57:48,261;   4;   2;  0;
 56; 10:57:48,485;   1;   5;  1;
 56; 10:57:48,494;   3;   4;  0;
 56; 10:57:48,526;   5;   2;  0;
 56; 10:57:48,897;   4;   3;  0;
 56; 10:57:48,928;   0;   1;  1;
 56; 10:57:48,990;   2;   5;  1;
 56; 10:57:49,033;   3;   5;  1;
 56; 10:57:49,448;   0;   2;  2;
 56; 10:57:49,537;   1;   5;  1;; not_moved
 56; 10:57:49,543;   5;   2;  0;; not_moved
 56; 10:57:49,577;   4;   4;  0;
 56; 10:57:49,840;   5;   3;  0;
 56; 10:57:49,887;   0;   3;  3;
 56; 10:57:50,040;   2;   5;  1;; not_moved
 56; 10:57:50,121;   3;   5;  1;; not_moved
 56; 10:57:50,291;   4;   5;  1;
 56; 10:57:50,308;   0;   4;  4;
 56; 10:57:50,548;   5;   4;  0;
 56; 10:57:51,056;   0;   4;  5;
 56; 10:57:51,320;   5;   5;  1;
 56; 10:57:51,323;  -1;   0;  0;
 56; 10:57:51,323;   0;   0;  0;; not_moved
 56; 10:57:51,323;   1;   0;  0;; not_moved
 56; 10:57:51,323;   2;   0;  0;; not_moved
 56; 10:57:51,323;   3;   0;  0;; not_moved
 56; 10:57:51,323;   4;   0;  0;; not_moved
 56; 10:57:51,323;   5;   0;  0;; not_moved
 56; 10:57:51,323;   6;   5;  1;; not_moved
 56; 10:57:51,323;   7;   4;  5;; not_moved
 56; 10:57:51,323;   8;   1; -4;; not_moved
 56; 10:57:51,323;   9;  -5; -1;; not_moved
 56; 10:57:58,449;   1;   1;  0;
 56; 10:57:58,749;   2;   1;  0;
 56; 10:57:58,978;   4;   1;  0;
 56; 10:57:58,979;   1;   2;  0;
 56; 10:57:59,195;   3;   1;  0;
 56; 10:57:59,312;   2;   2;  0;
 56; 10:57:59,513;   5;   1;  0;
 56; 10:57:59,520;   1;   3;  0;
 56; 10:57:59,606;   4;   2;  0;
 56; 10:57:59,639;   3;   2;  0;
 56; 10:57:59,668;   2;   3;  0;
 56; 10:58:00,018;   1;   4;  0;
 56; 10:58:00,120;   2;   4;  0;
 56; 10:58:00,136;   3;   3;  0;
 56; 10:58:00,162;   0;   0; -1;
 56; 10:58:00,190;   4;   3;  0;
 56; 10:58:00,289;   5;   2;  0;
 56; 10:58:00,508;   1;   5;  1;
 56; 10:58:00,576;   0;   0; -2;
 56; 10:58:00,594;   2;   5;  1;
 56; 10:58:00,668;   3;   4;  1;
 56; 10:58:00,822;   4;   4;  0;
 56; 10:58:01,077;   0;   0; -3;
 56; 10:58:01,199;   5;   3;  0;
 56; 10:58:01,209;   3;   5;  1;
 56; 10:58:01,475;   1;   5;  1;; not_moved
 56; 10:58:01,519;   0;   0; -4;
 56; 10:58:01,524;   4;   5;  1;
 56; 10:58:01,654;   2;   5;  1;; not_moved
 56; 10:58:01,972;   5;   4;  0;
 56; 10:58:02,043;   0;   1; -4;
 56; 10:58:02,237;   3;   5;  1;; not_moved
 56; 10:58:02,556;   4;   5;  1;; not_moved
 56; 10:58:02,758;   5;   5;  1;
