HC_2022-04-22_09-12-48
PlayOrder: 2,i57,56,56,56,56,56,56,56,56,56,56,56,56,56,56,56,56,56,56,56,56,56,56,56,56,56,56,56,56,56,56,200,
List of players:
    /127.0.0.1:39876  0
    /127.0.0.1:39878  1
    /127.0.0.1:39880  2
    /127.0.0.1:39884  3
    /127.0.0.1:39886  4
    /127.0.0.1:39888  5


##### Spiel2: Vorübung gemeinsam #####  

#Feld   :   ct :ctVisMode:ctVisible:Nuggets:Ct_local:Ct_global;NugVisible:Cleared:Players
  0,  0 :    0 :     0   :   false :     0 :      0 :      0  :     true : false :  1,   3,   5,   4,   2,   0, 


Startzeit: 10:24:28,992

##### Spiel56: Experimentserie mit computed	##### 
List of players:
 id: sj: sj:ctl: vr: nM:nMisMax:  color: wh: bl:pay:isComp 
  0: -1:  0:  0: -1:  0:   true: 000000:  0:  0:  0: false 
  1: -1:  2:  0: -1:  0:   true: 00cf9e:  0:  0:  0: false 
  2: -1: -4:  0: -1:  0:   true: 88b551:  0:  0:  0: false 
  3: -3:  0:  0: -1:  0:   true: fe5f00:  0:  0:  0: false 
  4:  3:  1:  0: -1:  0:   true: ca1551:  0:  0:  0: false 
  5:  2: -2:  0: -1:  0:   true: e56399:  0:  0:  0: false 
  6:  0:  0:  0: -1:  5:   true: 222e50: 24:  6: 30:  true 
  7:  0:  0:  0: -1:  5:   true: 3a7d44: 27:  3: 10:  true 
  8:  0:  0:  0: -1:  5:   true: b3001b:  9: 21: 30:  true 
  9:  0:  0:  0: -1:  5:   true: 750b7d:  6: 24: 10:  true 


##### next Spiel56: 	##### 

commonPlGr:
#Feld   :   ct :ctVisMode:ctVisible:Nuggets:Ct_local:Ct_global;NugVisible:Cleared:Players
  5,  2 :    0 :     0   :   false :     0 :      0 :      0  :     true : false :  6, 
 -2,  3 :    0 :     0   :   false :     0 :      0 :      0  :     true : false :  7, 
  2, -3 :    0 :     0   :   false :     0 :      0 :      0  :     true : false :  8, 
 -5, -2 :    0 :     0   :   false :     0 :      0 :      0  :     true : false :  9, 
  0,  0 :    0 :     0   :   false :     0 :      0 :      0  :     true : false :  1,   3,   5,   4,   2,   0, 

Startzeit: 10:26:36,109


last common playground
#Feld   :   ct :ctVisMode:ctVisible:Nuggets:Ct_local:Ct_global;NugVisible:Cleared:Players
  5,  2 :    0 :     0   :   false :     0 :      0 :      0  :     true : false :  5,   6, 
 -2,  3 :    0 :     0   :   false :     0 :      0 :      0  :     true : false :  4,   7, 
  2, -3 :    0 :     0   :   false :     0 :      0 :      0  :     true : false :  1,   2,   8, 
 -5, -2 :    0 :     0   :   false :     0 :      0 :      0  :     true : false :  9,   3,   0, 

Balances: saldo  pay  groupbonus
  0:     10 Cent      10 Cent      0 Cent  
  1:      0 Cent       0 Cent      0 Cent  
  2:      0 Cent       0 Cent      0 Cent  
  3:     10 Cent      10 Cent      0 Cent  
  4:     10 Cent      10 Cent      0 Cent  
  5:     30 Cent      30 Cent      0 Cent  
  6:     24 wh       6 bl 
  7:     27 wh       3 bl 
  8:      9 wh      21 bl 
  9:      6 wh      24 bl 

##### next Spiel56: 	##### 

commonPlGr:
#Feld   :   ct :ctVisMode:ctVisible:Nuggets:Ct_local:Ct_global;NugVisible:Cleared:Players
 -4,  1 :    0 :     0   :   false :     0 :      0 :      0  :     true : false :  6, 
 -5, -4 :    0 :     0   :   false :     0 :      0 :      0  :     true : false :  7, 
  1,  5 :    0 :     0   :   false :     0 :      0 :      0  :     true : false :  8, 
  4, -1 :    0 :     0   :   false :     0 :      0 :      0  :     true : false :  9, 
  0,  0 :    0 :     0   :   false :     0 :      0 :      0  :     true : false :  1,   3,   5,   4,   2,   0, 

Startzeit: 10:26:46,860


last common playground
#Feld   :   ct :ctVisMode:ctVisible:Nuggets:Ct_local:Ct_global;NugVisible:Cleared:Players
 -4,  1 :    0 :     0   :   false :     0 :      0 :      0  :     true : false :  4,   5,   6, 
 -5, -4 :    0 :     0   :   false :     0 :      0 :      0  :     true : false :  3,   7,   2, 
  1,  5 :    0 :     0   :   false :     0 :      0 :      0  :     true : false :  1,   8, 
  4, -1 :    0 :     0   :   false :     0 :      0 :      0  :     true : false :  0,   9, 

Balances: saldo  pay  groupbonus
  0:     20 Cent      10 Cent      0 Cent  
  1:      0 Cent       0 Cent      0 Cent  
  2:     10 Cent      10 Cent      0 Cent  
  3:     20 Cent      10 Cent      0 Cent  
  4:     40 Cent      30 Cent      0 Cent  
  5:     60 Cent      30 Cent      0 Cent  
  6:     24 wh       6 bl 
  7:     27 wh       3 bl 
  8:      9 wh      21 bl 
  9:      6 wh      24 bl 

##### next Spiel56: 	##### 

commonPlGr:
#Feld   :   ct :ctVisMode:ctVisible:Nuggets:Ct_local:Ct_global;NugVisible:Cleared:Players
 -3, -5 :    0 :     0   :   false :     0 :      0 :      0  :     true : false :  6, 
 -2,  3 :    0 :     0   :   false :     0 :      0 :      0  :     true : false :  7, 
 -5, -2 :    0 :     0   :   false :     0 :      0 :      0  :     true : false :  8, 
  3,  5 :    0 :     0   :   false :     0 :      0 :      0  :     true : false :  9, 
  0,  0 :    0 :     0   :   false :     0 :      0 :      0  :     true : false :  1,   3,   5,   4,   2,   0, 

Startzeit: 10:26:59,608


last common playground
#Feld   :   ct :ctVisMode:ctVisible:Nuggets:Ct_local:Ct_global;NugVisible:Cleared:Players
 -3, -5 :    0 :     0   :   false :     0 :      0 :      0  :     true : false :  1,   6, 
 -2,  3 :    0 :     0   :   false :     0 :      0 :      0  :     true : false :  2,   7, 
 -5, -2 :    0 :     0   :   false :     0 :      0 :      0  :     true : false :  5,   8,   3, 
  3,  5 :    0 :     0   :   false :     0 :      0 :      0  :     true : false :  0,   4,   9, 

Balances: saldo  pay  groupbonus
  0:     30 Cent      10 Cent      0 Cent  
  1:     30 Cent      30 Cent      0 Cent  
  2:     20 Cent      10 Cent      0 Cent  
  3:     20 Cent       0 Cent      0 Cent  
  4:     50 Cent      10 Cent      0 Cent  
  5:     60 Cent       0 Cent      0 Cent  
  6:     24 wh       6 bl 
  7:     27 wh       3 bl 
  8:      9 wh      21 bl 
  9:      6 wh      24 bl 

##### next Spiel56: 	##### 

commonPlGr:
#Feld   :   ct :ctVisMode:ctVisible:Nuggets:Ct_local:Ct_global;NugVisible:Cleared:Players
 -4,  1 :    0 :     0   :   false :     0 :      0 :      0  :     true : false :  6, 
  1,  5 :    0 :     0   :   false :     0 :      0 :      0  :     true : false :  7, 
 -1, -5 :    0 :     0   :   false :     0 :      0 :      0  :     true : false :  8, 
  4, -1 :    0 :     0   :   false :     0 :      0 :      0  :     true : false :  9, 
  0,  0 :    0 :     0   :   false :     0 :      0 :      0  :     true : false :  1,   3,   5,   4,   2,   0, 

Startzeit: 10:27:15,746


last common playground
#Feld   :   ct :ctVisMode:ctVisible:Nuggets:Ct_local:Ct_global;NugVisible:Cleared:Players
 -4,  1 :    0 :     0   :   false :     0 :      0 :      0  :     true : false :  1,   5,   6, 
  1,  5 :    0 :     0   :   false :     0 :      0 :      0  :     true : false :  3,   7, 
 -1, -5 :    0 :     0   :   false :     0 :      0 :      0  :     true : false :  4,   8, 
  4, -1 :    0 :     0   :   false :     0 :      0 :      0  :     true : false :  2,   0,   9, 

Balances: saldo  pay  groupbonus
  0:     30 Cent       0 Cent      0 Cent  
  1:     30 Cent       0 Cent      0 Cent  
  2:     20 Cent       0 Cent      0 Cent  
  3:     30 Cent      10 Cent      0 Cent  
  4:     50 Cent       0 Cent      0 Cent  
  5:     60 Cent       0 Cent      0 Cent  
  6:     24 wh       6 bl 
  7:     27 wh       3 bl 
  8:      9 wh      21 bl 
  9:      6 wh      24 bl 

##### next Spiel56: 	##### 

commonPlGr:
#Feld   :   ct :ctVisMode:ctVisible:Nuggets:Ct_local:Ct_global;NugVisible:Cleared:Players
 -5, -2 :    0 :     0   :   false :     0 :      0 :      0  :     true : false :  6, 
  5,  2 :    0 :     0   :   false :     0 :      0 :      0  :     true : false :  7, 
  2, -3 :    0 :     0   :   false :     0 :      0 :      0  :     true : false :  8, 
 -2,  3 :    0 :     0   :   false :     0 :      0 :      0  :     true : false :  9, 
  0,  0 :    0 :     0   :   false :     0 :      0 :      0  :     true : false :  1,   3,   5,   4,   2,   0, 

Startzeit: 10:27:32,112


last common playground
#Feld   :   ct :ctVisMode:ctVisible:Nuggets:Ct_local:Ct_global;NugVisible:Cleared:Players
 -5, -2 :    0 :     0   :   false :     0 :      0 :      0  :     true : false :  6,   4,   1,   2, 
  5,  2 :    0 :     0   :   false :     0 :      0 :      0  :     true : false :  7, 
  2, -3 :    0 :     0   :   false :     0 :      0 :      0  :     true : false :  5,   0,   8, 
 -2,  3 :    0 :     0   :   false :     0 :      0 :      0  :     true : false :  3,   9, 

Balances: saldo  pay  groupbonus
  0:     30 Cent       0 Cent      0 Cent  
  1:     60 Cent      30 Cent      0 Cent  
  2:     50 Cent      30 Cent      0 Cent  
  3:     30 Cent       0 Cent      0 Cent  
  4:     80 Cent      30 Cent      0 Cent  
  5:     60 Cent       0 Cent      0 Cent  
  6:     24 wh       6 bl 
  7:     27 wh       3 bl 
  8:      9 wh      21 bl 
  9:      6 wh      24 bl 

##### next Spiel56: 	##### 

commonPlGr:
#Feld   :   ct :ctVisMode:ctVisible:Nuggets:Ct_local:Ct_global;NugVisible:Cleared:Players
  4, -1 :    0 :     0   :   false :     0 :      0 :      0  :     true : false :  6, 
  1,  5 :    0 :     0   :   false :     0 :      0 :      0  :     true : false :  7, 
 -5, -4 :    0 :     0   :   false :     0 :      0 :      0  :     true : false :  8, 
  5,  4 :    0 :     0   :   false :     0 :      0 :      0  :     true : false :  9, 
  0,  0 :    0 :     0   :   false :     0 :      0 :      0  :     true : false :  1,   3,   5,   4,   2,   0, 

Startzeit: 10:27:46,626


last common playground
#Feld   :   ct :ctVisMode:ctVisible:Nuggets:Ct_local:Ct_global;NugVisible:Cleared:Players
  4, -1 :    0 :     0   :   false :     0 :      0 :      0  :     true : false :  1,   4,   6, 
  1,  5 :    0 :     0   :   false :     0 :      0 :      0  :     true : false :  3,   5,   7, 
 -5, -4 :    0 :     0   :   false :     0 :      0 :      0  :     true : false :  8, 
  5,  4 :    0 :     0   :   false :     0 :      0 :      0  :     true : false :  0,   2,   9, 

Balances: saldo  pay  groupbonus
  0:     30 Cent       0 Cent      0 Cent  
  1:     90 Cent      30 Cent      0 Cent  
  2:     50 Cent       0 Cent      0 Cent  
  3:     30 Cent       0 Cent      0 Cent  
  4:    110 Cent      30 Cent      0 Cent  
  5:     60 Cent       0 Cent      0 Cent  
  6:     24 wh       6 bl 
  7:     27 wh       3 bl 
  8:      9 wh      21 bl 
  9:      6 wh      24 bl 

##### next Spiel56: 	##### 

commonPlGr:
#Feld   :   ct :ctVisMode:ctVisible:Nuggets:Ct_local:Ct_global;NugVisible:Cleared:Players
 -5, -2 :    0 :     0   :   false :     0 :      0 :      0  :     true : false :  6, 
  5,  2 :    0 :     0   :   false :     0 :      0 :      0  :     true : false :  7, 
  3,  5 :    0 :     0   :   false :     0 :      0 :      0  :     true : false :  8, 
 -2,  3 :    0 :     0   :   false :     0 :      0 :      0  :     true : false :  9, 
  0,  0 :    0 :     0   :   false :     0 :      0 :      0  :     true : false :  1,   3,   5,   4,   2,   0, 

Startzeit: 10:28:03,138


last common playground
#Feld   :   ct :ctVisMode:ctVisible:Nuggets:Ct_local:Ct_global;NugVisible:Cleared:Players
 -5, -2 :    0 :     0   :   false :     0 :      0 :      0  :     true : false :  6,   4,   1,   2,   3, 
  5,  2 :    0 :     0   :   false :     0 :      0 :      0  :     true : false :  0,   7, 
  3,  5 :    0 :     0   :   false :     0 :      0 :      0  :     true : false :  5,   8, 
 -2,  3 :    0 :     0   :   false :     0 :      0 :      0  :     true : false :  9, 

Balances: saldo  pay  groupbonus
  0:     40 Cent      10 Cent      0 Cent  
  1:    120 Cent      30 Cent      0 Cent  
  2:     80 Cent      30 Cent      0 Cent  
  3:     60 Cent      30 Cent      0 Cent  
  4:    140 Cent      30 Cent      0 Cent  
  5:     60 Cent       0 Cent      0 Cent  
  6:     24 wh       6 bl 
  7:     27 wh       3 bl 
  8:      9 wh      21 bl 
  9:      6 wh      24 bl 

##### next Spiel56: 	##### 

commonPlGr:
#Feld   :   ct :ctVisMode:ctVisible:Nuggets:Ct_local:Ct_global;NugVisible:Cleared:Players
 -1,  4 :    0 :     0   :   false :     0 :      0 :      0  :     true : false :  6, 
 -4, -5 :    0 :     0   :   false :     0 :      0 :      0  :     true : false :  7, 
  4,  5 :    0 :     0   :   false :     0 :      0 :      0  :     true : false :  8, 
 -5, -1 :    0 :     0   :   false :     0 :      0 :      0  :     true : false :  9, 
  0,  0 :    0 :     0   :   false :     0 :      0 :      0  :     true : false :  1,   3,   5,   4,   2,   0, 

Startzeit: 10:28:20,584


last common playground
#Feld   :   ct :ctVisMode:ctVisible:Nuggets:Ct_local:Ct_global;NugVisible:Cleared:Players
 -1,  4 :    0 :     0   :   false :     0 :      0 :      0  :     true : false :  2,   3,   1,   6, 
 -4, -5 :    0 :     0   :   false :     0 :      0 :      0  :     true : false :  4,   7, 
  4,  5 :    0 :     0   :   false :     0 :      0 :      0  :     true : false :  0,   8, 
 -5, -1 :    0 :     0   :   false :     0 :      0 :      0  :     true : false :  5,   9, 

Balances: saldo  pay  groupbonus
  0:     70 Cent      30 Cent      0 Cent  
  1:    150 Cent      30 Cent      0 Cent  
  2:    110 Cent      30 Cent      0 Cent  
  3:     90 Cent      30 Cent      0 Cent  
  4:    150 Cent      10 Cent      0 Cent  
  5:     60 Cent       0 Cent      0 Cent  
  6:     24 wh       6 bl 
  7:     27 wh       3 bl 
  8:      9 wh      21 bl 
  9:      6 wh      24 bl 

##### next Spiel56: 	##### 

commonPlGr:
#Feld   :   ct :ctVisMode:ctVisible:Nuggets:Ct_local:Ct_global;NugVisible:Cleared:Players
 -4, -5 :    0 :     0   :   false :     0 :      0 :      0  :     true : false :  6, 
 -1,  4 :    0 :     0   :   false :     0 :      0 :      0  :     true : false :  7, 
  1, -4 :    0 :     0   :   false :     0 :      0 :      0  :     true : false :  8, 
 -5, -1 :    0 :     0   :   false :     0 :      0 :      0  :     true : false :  9, 
  0,  0 :    0 :     0   :   false :     0 :      0 :      0  :     true : false :  1,   3,   5,   4,   2,   0, 

Startzeit: 10:28:40,370


last common playground
#Feld   :   ct :ctVisMode:ctVisible:Nuggets:Ct_local:Ct_global;NugVisible:Cleared:Players
 -4, -5 :    0 :     0   :   false :     0 :      0 :      0  :     true : false :  3,   2,   1,   4,   6, 
 -1,  4 :    0 :     0   :   false :     0 :      0 :      0  :     true : false :  5,   7, 
  1, -4 :    0 :     0   :   false :     0 :      0 :      0  :     true : false :  0,   8, 
 -5, -1 :    0 :     0   :   false :     0 :      0 :      0  :     true : false :  9, 

Balances: saldo  pay  groupbonus
  0:     70 Cent       0 Cent      0 Cent  
  1:    180 Cent      30 Cent      0 Cent  
  2:    140 Cent      30 Cent      0 Cent  
  3:    120 Cent      30 Cent      0 Cent  
  4:    180 Cent      30 Cent      0 Cent  
  5:     70 Cent      10 Cent      0 Cent  
  6:     24 wh       6 bl 
  7:     27 wh       3 bl 
  8:      9 wh      21 bl 
  9:      6 wh      24 bl 

##### next Spiel56: 	##### 

commonPlGr:
#Feld   :   ct :ctVisMode:ctVisible:Nuggets:Ct_local:Ct_global;NugVisible:Cleared:Players
  5,  1 :    0 :     0   :   false :     0 :      0 :      0  :     true : false :  6, 
  4,  5 :    0 :     0   :   false :     0 :      0 :      0  :     true : false :  7, 
  1, -4 :    0 :     0   :   false :     0 :      0 :      0  :     true : false :  8, 
 -4, -5 :    0 :     0   :   false :     0 :      0 :      0  :     true : false :  9, 
  0,  0 :    0 :     0   :   false :     0 :      0 :      0  :     true : false :  1,   3,   5,   4,   2,   0, 

Startzeit: 10:28:56,207


last common playground
#Feld   :   ct :ctVisMode:ctVisible:Nuggets:Ct_local:Ct_global;NugVisible:Cleared:Players
  5,  1 :    0 :     0   :   false :     0 :      0 :      0  :     true : false :  0,   1,   4,   3,   5,   2,   6, 
  4,  5 :    0 :     0   :   false :     0 :      0 :      0  :     true : false :  7, 
  1, -4 :    0 :     0   :   false :     0 :      0 :      0  :     true : false :  8, 
 -4, -5 :    0 :     0   :   false :     0 :      0 :      0  :     true : false :  9, 

Balances: saldo  pay  groupbonus
  0:     70 Cent       0 Cent      0 Cent  
  1:    180 Cent       0 Cent      0 Cent  
  2:    140 Cent       0 Cent      0 Cent  
  3:    120 Cent       0 Cent      0 Cent  
  4:    180 Cent       0 Cent      0 Cent  
  5:     70 Cent       0 Cent      0 Cent  
  6:     24 wh       6 bl 
  7:     27 wh       3 bl 
  8:      9 wh      21 bl 
  9:      6 wh      24 bl 

##### next Spiel56: 	##### 

commonPlGr:
#Feld   :   ct :ctVisMode:ctVisible:Nuggets:Ct_local:Ct_global;NugVisible:Cleared:Players
  3,  5 :    0 :     0   :   false :     0 :      0 :      0  :     true : false :  6, 
  5,  2 :    0 :     0   :   false :     0 :      0 :      0  :     true : false :  7, 
 -2,  3 :    0 :     0   :   false :     0 :      0 :      0  :     true : false :  8, 
  2, -3 :    0 :     0   :   false :     0 :      0 :      0  :     true : false :  9, 
  0,  0 :    0 :     0   :   false :     0 :      0 :      0  :     true : false :  1,   3,   5,   4,   2,   0, 

Startzeit: 10:29:13,619


last common playground
#Feld   :   ct :ctVisMode:ctVisible:Nuggets:Ct_local:Ct_global;NugVisible:Cleared:Players
  3,  5 :    0 :     0   :   false :     0 :      0 :      0  :     true : false :  4,   1,   3,   5,   6, 
  5,  2 :    0 :     0   :   false :     0 :      0 :      0  :     true : false :  7, 
 -2,  3 :    0 :     0   :   false :     0 :      0 :      0  :     true : false :  2,   8, 
  2, -3 :    0 :     0   :   false :     0 :      0 :      0  :     true : false :  0,   9, 

Balances: saldo  pay  groupbonus
  0:     70 Cent       0 Cent      0 Cent  
  1:    210 Cent      30 Cent      0 Cent  
  2:    140 Cent       0 Cent      0 Cent  
  3:    150 Cent      30 Cent      0 Cent  
  4:    210 Cent      30 Cent      0 Cent  
  5:    100 Cent      30 Cent      0 Cent  
  6:     24 wh       6 bl 
  7:     27 wh       3 bl 
  8:      9 wh      21 bl 
  9:      6 wh      24 bl 

##### next Spiel56: 	##### 

commonPlGr:
#Feld   :   ct :ctVisMode:ctVisible:Nuggets:Ct_local:Ct_global;NugVisible:Cleared:Players
  1,  5 :    0 :     0   :   false :     0 :      0 :      0  :     true : false :  6, 
 -4,  1 :    0 :     0   :   false :     0 :      0 :      0  :     true : false :  7, 
 -1, -5 :    0 :     0   :   false :     0 :      0 :      0  :     true : false :  8, 
  5,  4 :    0 :     0   :   false :     0 :      0 :      0  :     true : false :  9, 
  0,  0 :    0 :     0   :   false :     0 :      0 :      0  :     true : false :  1,   3,   5,   4,   2,   0, 

Startzeit: 10:29:28,063


last common playground
#Feld   :   ct :ctVisMode:ctVisible:Nuggets:Ct_local:Ct_global;NugVisible:Cleared:Players
  1,  5 :    0 :     0   :   false :     0 :      0 :      0  :     true : false :  2,   3,   5,   1,   6, 
 -4,  1 :    0 :     0   :   false :     0 :      0 :      0  :     true : false :  7,   4, 
 -1, -5 :    0 :     0   :   false :     0 :      0 :      0  :     true : false :  0,   8, 
  5,  4 :    0 :     0   :   false :     0 :      0 :      0  :     true : false :  9, 

Balances: saldo  pay  groupbonus
  0:     70 Cent       0 Cent      0 Cent  
  1:    240 Cent      30 Cent      0 Cent  
  2:    170 Cent      30 Cent      0 Cent  
  3:    180 Cent      30 Cent      0 Cent  
  4:    220 Cent      10 Cent      0 Cent  
  5:    130 Cent      30 Cent      0 Cent  
  6:     24 wh       6 bl 
  7:     27 wh       3 bl 
  8:      9 wh      21 bl 
  9:      6 wh      24 bl 

##### next Spiel56: 	##### 

commonPlGr:
#Feld   :   ct :ctVisMode:ctVisible:Nuggets:Ct_local:Ct_global;NugVisible:Cleared:Players
 -5, -2 :    0 :     0   :   false :     0 :      0 :      0  :     true : false :  6, 
  5,  2 :    0 :     0   :   false :     0 :      0 :      0  :     true : false :  7, 
 -3, -5 :    0 :     0   :   false :     0 :      0 :      0  :     true : false :  8, 
  3,  5 :    0 :     0   :   false :     0 :      0 :      0  :     true : false :  9, 
  0,  0 :    0 :     0   :   false :     0 :      0 :      0  :     true : false :  1,   3,   5,   4,   2,   0, 

Startzeit: 10:29:42,660


last common playground
#Feld   :   ct :ctVisMode:ctVisible:Nuggets:Ct_local:Ct_global;NugVisible:Cleared:Players
 -5, -2 :    0 :     0   :   false :     0 :      0 :      0  :     true : false :  4,   6,   3,   2,   1,   5, 
  5,  2 :    0 :     0   :   false :     0 :      0 :      0  :     true : false :  0,   7, 
 -3, -5 :    0 :     0   :   false :     0 :      0 :      0  :     true : false :  8, 
  3,  5 :    0 :     0   :   false :     0 :      0 :      0  :     true : false :  9, 

Balances: saldo  pay  groupbonus
  0:     80 Cent      10 Cent      0 Cent  
  1:    270 Cent      30 Cent      0 Cent  
  2:    200 Cent      30 Cent      0 Cent  
  3:    210 Cent      30 Cent      0 Cent  
  4:    250 Cent      30 Cent      0 Cent  
  5:    160 Cent      30 Cent      0 Cent  
  6:     24 wh       6 bl 
  7:     27 wh       3 bl 
  8:      9 wh      21 bl 
  9:      6 wh      24 bl 

##### next Spiel56: 	##### 

commonPlGr:
#Feld   :   ct :ctVisMode:ctVisible:Nuggets:Ct_local:Ct_global;NugVisible:Cleared:Players
 -3,  2 :    0 :     0   :   false :     0 :      0 :      0  :     true : false :  6, 
  5,  3 :    0 :     0   :   false :     0 :      0 :      0  :     true : false :  7, 
  2,  5 :    0 :     0   :   false :     0 :      0 :      0  :     true : false :  8, 
  3, -2 :    0 :     0   :   false :     0 :      0 :      0  :     true : false :  9, 
  0,  0 :    0 :     0   :   false :     0 :      0 :      0  :     true : false :  1,   3,   5,   4,   2,   0, 

Startzeit: 10:29:59,277


last common playground
#Feld   :   ct :ctVisMode:ctVisible:Nuggets:Ct_local:Ct_global;NugVisible:Cleared:Players
 -3,  2 :    0 :     0   :   false :     0 :      0 :      0  :     true : false :  1,   4,   2,   3,   5,   6, 
  5,  3 :    0 :     0   :   false :     0 :      0 :      0  :     true : false :  7, 
  2,  5 :    0 :     0   :   false :     0 :      0 :      0  :     true : false :  8, 
  3, -2 :    0 :     0   :   false :     0 :      0 :      0  :     true : false :  0,   9, 

Balances: saldo  pay  groupbonus
  0:     80 Cent       0 Cent      0 Cent  
  1:    300 Cent      30 Cent      0 Cent  
  2:    230 Cent      30 Cent      0 Cent  
  3:    240 Cent      30 Cent      0 Cent  
  4:    280 Cent      30 Cent      0 Cent  
  5:    190 Cent      30 Cent      0 Cent  
  6:     24 wh       6 bl 
  7:     27 wh       3 bl 
  8:      9 wh      21 bl 
  9:      6 wh      24 bl 

##### next Spiel56: 	##### 

commonPlGr:
#Feld   :   ct :ctVisMode:ctVisible:Nuggets:Ct_local:Ct_global;NugVisible:Cleared:Players
  3, -2 :    0 :     0   :   false :     0 :      0 :      0  :     true : false :  6, 
 -5, -3 :    0 :     0   :   false :     0 :      0 :      0  :     true : false :  7, 
  2,  5 :    0 :     0   :   false :     0 :      0 :      0  :     true : false :  8, 
 -3,  2 :    0 :     0   :   false :     0 :      0 :      0  :     true : false :  9, 
  0,  0 :    0 :     0   :   false :     0 :      0 :      0  :     true : false :  1,   3,   5,   4,   2,   0, 

Startzeit: 10:30:11,364


last common playground
#Feld   :   ct :ctVisMode:ctVisible:Nuggets:Ct_local:Ct_global;NugVisible:Cleared:Players
  3, -2 :    0 :     0   :   false :     0 :      0 :      0  :     true : false :  5,   2,   3,   1,   4,   6, 
 -5, -3 :    0 :     0   :   false :     0 :      0 :      0  :     true : false :  7, 
  2,  5 :    0 :     0   :   false :     0 :      0 :      0  :     true : false :  8, 
 -3,  2 :    0 :     0   :   false :     0 :      0 :      0  :     true : false :  0,   9, 

Balances: saldo  pay  groupbonus
  0:     80 Cent       0 Cent      0 Cent  
  1:    330 Cent      30 Cent      0 Cent  
  2:    260 Cent      30 Cent      0 Cent  
  3:    270 Cent      30 Cent      0 Cent  
  4:    310 Cent      30 Cent      0 Cent  
  5:    220 Cent      30 Cent      0 Cent  
  6:     24 wh       6 bl 
  7:     27 wh       3 bl 
  8:      9 wh      21 bl 
  9:      6 wh      24 bl 

##### next Spiel56: 	##### 

commonPlGr:
#Feld   :   ct :ctVisMode:ctVisible:Nuggets:Ct_local:Ct_global;NugVisible:Cleared:Players
  3,  5 :    0 :     0   :   false :     0 :      0 :      0  :     true : false :  6, 
 -5, -2 :    0 :     0   :   false :     0 :      0 :      0  :     true : false :  7, 
  5,  2 :    0 :     0   :   false :     0 :      0 :      0  :     true : false :  8, 
 -2,  3 :    0 :     0   :   false :     0 :      0 :      0  :     true : false :  9, 
  0,  0 :    0 :     0   :   false :     0 :      0 :      0  :     true : false :  1,   3,   5,   4,   2,   0, 

Startzeit: 10:30:32,229


last common playground
#Feld   :   ct :ctVisMode:ctVisible:Nuggets:Ct_local:Ct_global;NugVisible:Cleared:Players
  3,  5 :    0 :     0   :   false :     0 :      0 :      0  :     true : false :  1,   5,   2,   3,   6, 
 -5, -2 :    0 :     0   :   false :     0 :      0 :      0  :     true : false :  7, 
  5,  2 :    0 :     0   :   false :     0 :      0 :      0  :     true : false :  0,   8, 
 -2,  3 :    0 :     0   :   false :     0 :      0 :      0  :     true : false :  4,   9, 

Balances: saldo  pay  groupbonus
  0:     80 Cent       0 Cent      0 Cent  
  1:    360 Cent      30 Cent      0 Cent  
  2:    290 Cent      30 Cent      0 Cent  
  3:    300 Cent      30 Cent      0 Cent  
  4:    310 Cent       0 Cent      0 Cent  
  5:    250 Cent      30 Cent      0 Cent  
  6:     24 wh       6 bl 
  7:     27 wh       3 bl 
  8:      9 wh      21 bl 
  9:      6 wh      24 bl 

##### next Spiel56: 	##### 

commonPlGr:
#Feld   :   ct :ctVisMode:ctVisible:Nuggets:Ct_local:Ct_global;NugVisible:Cleared:Players
  5,  2 :    0 :     0   :   false :     0 :      0 :      0  :     true : false :  6, 
  3,  5 :    0 :     0   :   false :     0 :      0 :      0  :     true : false :  7, 
 -5, -2 :    0 :     0   :   false :     0 :      0 :      0  :     true : false :  8, 
 -3, -5 :    0 :     0   :   false :     0 :      0 :      0  :     true : false :  9, 
  0,  0 :    0 :     0   :   false :     0 :      0 :      0  :     true : false :  1,   3,   5,   4,   2,   0, 

Startzeit: 10:30:46,204


last common playground
#Feld   :   ct :ctVisMode:ctVisible:Nuggets:Ct_local:Ct_global;NugVisible:Cleared:Players
  5,  2 :    0 :     0   :   false :     0 :      0 :      0  :     true : false :  3,   0,   5,   1,   4,   6, 
  3,  5 :    0 :     0   :   false :     0 :      0 :      0  :     true : false :  2,   7, 
 -5, -2 :    0 :     0   :   false :     0 :      0 :      0  :     true : false :  8, 
 -3, -5 :    0 :     0   :   false :     0 :      0 :      0  :     true : false :  9, 

Balances: saldo  pay  groupbonus
  0:    110 Cent      30 Cent      0 Cent  
  1:    390 Cent      30 Cent      0 Cent  
  2:    300 Cent      10 Cent      0 Cent  
  3:    330 Cent      30 Cent      0 Cent  
  4:    340 Cent      30 Cent      0 Cent  
  5:    280 Cent      30 Cent      0 Cent  
  6:     24 wh       6 bl 
  7:     27 wh       3 bl 
  8:      9 wh      21 bl 
  9:      6 wh      24 bl 

##### next Spiel56: 	##### 

commonPlGr:
#Feld   :   ct :ctVisMode:ctVisible:Nuggets:Ct_local:Ct_global;NugVisible:Cleared:Players
 -4, -5 :    0 :     0   :   false :     0 :      0 :      0  :     true : false :  6, 
  5,  1 :    0 :     0   :   false :     0 :      0 :      0  :     true : false :  7, 
  4,  5 :    0 :     0   :   false :     0 :      0 :      0  :     true : false :  8, 
 -1,  4 :    0 :     0   :   false :     0 :      0 :      0  :     true : false :  9, 
  0,  0 :    0 :     0   :   false :     0 :      0 :      0  :     true : false :  1,   3,   5,   4,   2,   0, 

Startzeit: 10:31:04,364


last common playground
#Feld   :   ct :ctVisMode:ctVisible:Nuggets:Ct_local:Ct_global;NugVisible:Cleared:Players
 -4, -5 :    0 :     0   :   false :     0 :      0 :      0  :     true : false :  3,   1,   5,   2,   4,   6, 
  5,  1 :    0 :     0   :   false :     0 :      0 :      0  :     true : false :  0,   7, 
  4,  5 :    0 :     0   :   false :     0 :      0 :      0  :     true : false :  8, 
 -1,  4 :    0 :     0   :   false :     0 :      0 :      0  :     true : false :  9, 

Balances: saldo  pay  groupbonus
  0:    120 Cent      10 Cent      0 Cent  
  1:    420 Cent      30 Cent      0 Cent  
  2:    330 Cent      30 Cent      0 Cent  
  3:    360 Cent      30 Cent      0 Cent  
  4:    370 Cent      30 Cent      0 Cent  
  5:    310 Cent      30 Cent      0 Cent  
  6:     24 wh       6 bl 
  7:     27 wh       3 bl 
  8:      9 wh      21 bl 
  9:      6 wh      24 bl 

##### next Spiel56: 	##### 

commonPlGr:
#Feld   :   ct :ctVisMode:ctVisible:Nuggets:Ct_local:Ct_global;NugVisible:Cleared:Players
 -2,  3 :    0 :     0   :   false :     0 :      0 :      0  :     true : false :  6, 
  2, -3 :    0 :     0   :   false :     0 :      0 :      0  :     true : false :  7, 
  3,  5 :    0 :     0   :   false :     0 :      0 :      0  :     true : false :  8, 
 -5, -2 :    0 :     0   :   false :     0 :      0 :      0  :     true : false :  9, 
  0,  0 :    0 :     0   :   false :     0 :      0 :      0  :     true : false :  1,   3,   5,   4,   2,   0, 

Startzeit: 10:31:15,550


last common playground
#Feld   :   ct :ctVisMode:ctVisible:Nuggets:Ct_local:Ct_global;NugVisible:Cleared:Players
 -2,  3 :    0 :     0   :   false :     0 :      0 :      0  :     true : false :  3,   0,   1,   2,   4,   5,   6, 
  2, -3 :    0 :     0   :   false :     0 :      0 :      0  :     true : false :  7, 
  3,  5 :    0 :     0   :   false :     0 :      0 :      0  :     true : false :  8, 
 -5, -2 :    0 :     0   :   false :     0 :      0 :      0  :     true : false :  9, 

Balances: saldo  pay  groupbonus
  0:    150 Cent      30 Cent      0 Cent  
  1:    450 Cent      30 Cent      0 Cent  
  2:    360 Cent      30 Cent      0 Cent  
  3:    390 Cent      30 Cent      0 Cent  
  4:    400 Cent      30 Cent      0 Cent  
  5:    340 Cent      30 Cent      0 Cent  
  6:     24 wh       6 bl 
  7:     27 wh       3 bl 
  8:      9 wh      21 bl 
  9:      6 wh      24 bl 

##### next Spiel56: 	##### 

commonPlGr:
#Feld   :   ct :ctVisMode:ctVisible:Nuggets:Ct_local:Ct_global;NugVisible:Cleared:Players
 -4,  1 :    0 :     0   :   false :     0 :      0 :      0  :     true : false :  6, 
 -5, -4 :    0 :     0   :   false :     0 :      0 :      0  :     true : false :  7, 
 -1, -5 :    0 :     0   :   false :     0 :      0 :      0  :     true : false :  8, 
  4, -1 :    0 :     0   :   false :     0 :      0 :      0  :     true : false :  9, 
  0,  0 :    0 :     0   :   false :     0 :      0 :      0  :     true : false :  1,   3,   5,   4,   2,   0, 

Startzeit: 10:31:27,073


last common playground
#Feld   :   ct :ctVisMode:ctVisible:Nuggets:Ct_local:Ct_global;NugVisible:Cleared:Players
 -4,  1 :    0 :     0   :   false :     0 :      0 :      0  :     true : false :  2,   1,   3,   5,   4,   6, 
 -5, -4 :    0 :     0   :   false :     0 :      0 :      0  :     true : false :  7, 
 -1, -5 :    0 :     0   :   false :     0 :      0 :      0  :     true : false :  8, 
  4, -1 :    0 :     0   :   false :     0 :      0 :      0  :     true : false :  0,   9, 

Balances: saldo  pay  groupbonus
  0:    150 Cent       0 Cent      0 Cent  
  1:    480 Cent      30 Cent      0 Cent  
  2:    390 Cent      30 Cent      0 Cent  
  3:    420 Cent      30 Cent      0 Cent  
  4:    430 Cent      30 Cent      0 Cent  
  5:    370 Cent      30 Cent      0 Cent  
  6:     24 wh       6 bl 
  7:     27 wh       3 bl 
  8:      9 wh      21 bl 
  9:      6 wh      24 bl 

##### next Spiel56: 	##### 

commonPlGr:
#Feld   :   ct :ctVisMode:ctVisible:Nuggets:Ct_local:Ct_global;NugVisible:Cleared:Players
  2, -3 :    0 :     0   :   false :     0 :      0 :      0  :     true : false :  6, 
 -5, -2 :    0 :     0   :   false :     0 :      0 :      0  :     true : false :  7, 
 -3, -5 :    0 :     0   :   false :     0 :      0 :      0  :     true : false :  8, 
  3,  5 :    0 :     0   :   false :     0 :      0 :      0  :     true : false :  9, 
  0,  0 :    0 :     0   :   false :     0 :      0 :      0  :     true : false :  1,   3,   5,   4,   2,   0, 

Startzeit: 10:31:42,237


last common playground
#Feld   :   ct :ctVisMode:ctVisible:Nuggets:Ct_local:Ct_global;NugVisible:Cleared:Players
  2, -3 :    0 :     0   :   false :     0 :      0 :      0  :     true : false :  3,   0,   5,   2,   1,   4,   6, 
 -5, -2 :    0 :     0   :   false :     0 :      0 :      0  :     true : false :  7, 
 -3, -5 :    0 :     0   :   false :     0 :      0 :      0  :     true : false :  8, 
  3,  5 :    0 :     0   :   false :     0 :      0 :      0  :     true : false :  9, 

Balances: saldo  pay  groupbonus
  0:    180 Cent      30 Cent      0 Cent  
  1:    510 Cent      30 Cent      0 Cent  
  2:    420 Cent      30 Cent      0 Cent  
  3:    450 Cent      30 Cent      0 Cent  
  4:    460 Cent      30 Cent      0 Cent  
  5:    400 Cent      30 Cent      0 Cent  
  6:     24 wh       6 bl 
  7:     27 wh       3 bl 
  8:      9 wh      21 bl 
  9:      6 wh      24 bl 

##### next Spiel56: 	##### 

commonPlGr:
#Feld   :   ct :ctVisMode:ctVisible:Nuggets:Ct_local:Ct_global;NugVisible:Cleared:Players
  4, -1 :    0 :     0   :   false :     0 :      0 :      0  :     true : false :  6, 
 -4,  1 :    0 :     0   :   false :     0 :      0 :      0  :     true : false :  7, 
  5,  4 :    0 :     0   :   false :     0 :      0 :      0  :     true : false :  8, 
 -5, -4 :    0 :     0   :   false :     0 :      0 :      0  :     true : false :  9, 
  0,  0 :    0 :     0   :   false :     0 :      0 :      0  :     true : false :  1,   3,   5,   4,   2,   0, 

Startzeit: 10:31:53,889


last common playground
#Feld   :   ct :ctVisMode:ctVisible:Nuggets:Ct_local:Ct_global;NugVisible:Cleared:Players
  4, -1 :    0 :     0   :   false :     0 :      0 :      0  :     true : false :  1,   4,   3,   5,   2,   0,   6, 
 -4,  1 :    0 :     0   :   false :     0 :      0 :      0  :     true : false :  7, 
  5,  4 :    0 :     0   :   false :     0 :      0 :      0  :     true : false :  8, 
 -5, -4 :    0 :     0   :   false :     0 :      0 :      0  :     true : false :  9, 

Balances: saldo  pay  groupbonus
  0:    210 Cent      30 Cent      0 Cent  
  1:    540 Cent      30 Cent      0 Cent  
  2:    450 Cent      30 Cent      0 Cent  
  3:    480 Cent      30 Cent      0 Cent  
  4:    490 Cent      30 Cent      0 Cent  
  5:    430 Cent      30 Cent      0 Cent  
  6:     24 wh       6 bl 
  7:     27 wh       3 bl 
  8:      9 wh      21 bl 
  9:      6 wh      24 bl 

##### next Spiel56: 	##### 

commonPlGr:
#Feld   :   ct :ctVisMode:ctVisible:Nuggets:Ct_local:Ct_global;NugVisible:Cleared:Players
  5,  4 :    0 :     0   :   false :     0 :      0 :      0  :     true : false :  6, 
  1,  5 :    0 :     0   :   false :     0 :      0 :      0  :     true : false :  7, 
 -5, -4 :    0 :     0   :   false :     0 :      0 :      0  :     true : false :  8, 
 -4,  1 :    0 :     0   :   false :     0 :      0 :      0  :     true : false :  9, 
  0,  0 :    0 :     0   :   false :     0 :      0 :      0  :     true : false :  1,   3,   5,   4,   2,   0, 

Startzeit: 10:32:07,277


last common playground
#Feld   :   ct :ctVisMode:ctVisible:Nuggets:Ct_local:Ct_global;NugVisible:Cleared:Players
  5,  4 :    0 :     0   :   false :     0 :      0 :      0  :     true : false :  2,   0,   5,   4,   3,   1,   6, 
  1,  5 :    0 :     0   :   false :     0 :      0 :      0  :     true : false :  7, 
 -5, -4 :    0 :     0   :   false :     0 :      0 :      0  :     true : false :  8, 
 -4,  1 :    0 :     0   :   false :     0 :      0 :      0  :     true : false :  9, 

Balances: saldo  pay  groupbonus
  0:    240 Cent      30 Cent      0 Cent  
  1:    570 Cent      30 Cent      0 Cent  
  2:    480 Cent      30 Cent      0 Cent  
  3:    510 Cent      30 Cent      0 Cent  
  4:    520 Cent      30 Cent      0 Cent  
  5:    460 Cent      30 Cent      0 Cent  
  6:     24 wh       6 bl 
  7:     27 wh       3 bl 
  8:      9 wh      21 bl 
  9:      6 wh      24 bl 

##### next Spiel56: 	##### 

commonPlGr:
#Feld   :   ct :ctVisMode:ctVisible:Nuggets:Ct_local:Ct_global;NugVisible:Cleared:Players
 -5, -3 :    0 :     0   :   false :     0 :      0 :      0  :     true : false :  6, 
  3, -2 :    0 :     0   :   false :     0 :      0 :      0  :     true : false :  7, 
  5,  3 :    0 :     0   :   false :     0 :      0 :      0  :     true : false :  8, 
  2,  5 :    0 :     0   :   false :     0 :      0 :      0  :     true : false :  9, 
  0,  0 :    0 :     0   :   false :     0 :      0 :      0  :     true : false :  1,   3,   5,   4,   2,   0, 

Startzeit: 10:32:24,120


last common playground
#Feld   :   ct :ctVisMode:ctVisible:Nuggets:Ct_local:Ct_global;NugVisible:Cleared:Players
 -5, -3 :    0 :     0   :   false :     0 :      0 :      0  :     true : false :  5,   4,   6,   1,   0,   3,   2, 
  3, -2 :    0 :     0   :   false :     0 :      0 :      0  :     true : false :  7, 
  5,  3 :    0 :     0   :   false :     0 :      0 :      0  :     true : false :  8, 
  2,  5 :    0 :     0   :   false :     0 :      0 :      0  :     true : false :  9, 

Balances: saldo  pay  groupbonus
  0:    270 Cent      30 Cent      0 Cent  
  1:    600 Cent      30 Cent      0 Cent  
  2:    510 Cent      30 Cent      0 Cent  
  3:    540 Cent      30 Cent      0 Cent  
  4:    550 Cent      30 Cent      0 Cent  
  5:    490 Cent      30 Cent      0 Cent  
  6:     24 wh       6 bl 
  7:     27 wh       3 bl 
  8:      9 wh      21 bl 
  9:      6 wh      24 bl 

##### next Spiel56: 	##### 

commonPlGr:
#Feld   :   ct :ctVisMode:ctVisible:Nuggets:Ct_local:Ct_global;NugVisible:Cleared:Players
  2,  5 :    0 :     0   :   false :     0 :      0 :      0  :     true : false :  6, 
 -2, -5 :    0 :     0   :   false :     0 :      0 :      0  :     true : false :  7, 
 -3,  2 :    0 :     0   :   false :     0 :      0 :      0  :     true : false :  8, 
  5,  3 :    0 :     0   :   false :     0 :      0 :      0  :     true : false :  9, 
  0,  0 :    0 :     0   :   false :     0 :      0 :      0  :     true : false :  1,   3,   5,   4,   2,   0, 

Startzeit: 10:32:37,147


last common playground
#Feld   :   ct :ctVisMode:ctVisible:Nuggets:Ct_local:Ct_global;NugVisible:Cleared:Players
  2,  5 :    0 :     0   :   false :     0 :      0 :      0  :     true : false :  1,   3,   5,   0,   4,   2,   6, 
 -2, -5 :    0 :     0   :   false :     0 :      0 :      0  :     true : false :  7, 
 -3,  2 :    0 :     0   :   false :     0 :      0 :      0  :     true : false :  8, 
  5,  3 :    0 :     0   :   false :     0 :      0 :      0  :     true : false :  9, 

Balances: saldo  pay  groupbonus
  0:    300 Cent      30 Cent      0 Cent  
  1:    630 Cent      30 Cent      0 Cent  
  2:    540 Cent      30 Cent      0 Cent  
  3:    570 Cent      30 Cent      0 Cent  
  4:    580 Cent      30 Cent      0 Cent  
  5:    520 Cent      30 Cent      0 Cent  
  6:     24 wh       6 bl 
  7:     27 wh       3 bl 
  8:      9 wh      21 bl 
  9:      6 wh      24 bl 

##### next Spiel56: 	##### 

commonPlGr:
#Feld   :   ct :ctVisMode:ctVisible:Nuggets:Ct_local:Ct_global;NugVisible:Cleared:Players
  5,  1 :    0 :     0   :   false :     0 :      0 :      0  :     true : false :  6, 
  4,  5 :    0 :     0   :   false :     0 :      0 :      0  :     true : false :  7, 
 -1,  4 :    0 :     0   :   false :     0 :      0 :      0  :     true : false :  8, 
 -5, -1 :    0 :     0   :   false :     0 :      0 :      0  :     true : false :  9, 
  0,  0 :    0 :     0   :   false :     0 :      0 :      0  :     true : false :  1,   3,   5,   4,   2,   0, 

Startzeit: 10:32:51,510


last common playground
#Feld   :   ct :ctVisMode:ctVisible:Nuggets:Ct_local:Ct_global;NugVisible:Cleared:Players
  5,  1 :    0 :     0   :   false :     0 :      0 :      0  :     true : false :  0,   1,   5,   4,   3,   6, 
  4,  5 :    0 :     0   :   false :     0 :      0 :      0  :     true : false :  2,   7, 
 -1,  4 :    0 :     0   :   false :     0 :      0 :      0  :     true : false :  8, 
 -5, -1 :    0 :     0   :   false :     0 :      0 :      0  :     true : false :  9, 

Balances: saldo  pay  groupbonus
  0:    330 Cent      30 Cent      0 Cent  
  1:    660 Cent      30 Cent      0 Cent  
  2:    550 Cent      10 Cent      0 Cent  
  3:    600 Cent      30 Cent      0 Cent  
  4:    610 Cent      30 Cent      0 Cent  
  5:    550 Cent      30 Cent      0 Cent  
  6:     24 wh       6 bl 
  7:     27 wh       3 bl 
  8:      9 wh      21 bl 
  9:      6 wh      24 bl 

##### next Spiel56: 	##### 

commonPlGr:
#Feld   :   ct :ctVisMode:ctVisible:Nuggets:Ct_local:Ct_global;NugVisible:Cleared:Players
 -5, -3 :    0 :     0   :   false :     0 :      0 :      0  :     true : false :  6, 
  2,  5 :    0 :     0   :   false :     0 :      0 :      0  :     true : false :  7, 
  3, -2 :    0 :     0   :   false :     0 :      0 :      0  :     true : false :  8, 
 -2, -5 :    0 :     0   :   false :     0 :      0 :      0  :     true : false :  9, 
  0,  0 :    0 :     0   :   false :     0 :      0 :      0  :     true : false :  1,   3,   5,   4,   2,   0, 

Startzeit: 10:33:03,254


last common playground
#Feld   :   ct :ctVisMode:ctVisible:Nuggets:Ct_local:Ct_global;NugVisible:Cleared:Players
 -5, -3 :    0 :     0   :   false :     0 :      0 :      0  :     true : false :  6,   4,   0,   3,   1,   5,   2, 
  2,  5 :    0 :     0   :   false :     0 :      0 :      0  :     true : false :  7, 
  3, -2 :    0 :     0   :   false :     0 :      0 :      0  :     true : false :  8, 
 -2, -5 :    0 :     0   :   false :     0 :      0 :      0  :     true : false :  9, 

Balances: saldo  pay  groupbonus
  0:    360 Cent      30 Cent      0 Cent  
  1:    690 Cent      30 Cent      0 Cent  
  2:    580 Cent      30 Cent      0 Cent  
  3:    630 Cent      30 Cent      0 Cent  
  4:    640 Cent      30 Cent      0 Cent  
  5:    580 Cent      30 Cent      0 Cent  
  6:     24 wh       6 bl 
  7:     27 wh       3 bl 
  8:      9 wh      21 bl 
  9:      6 wh      24 bl 

##### next Spiel56: 	##### 

commonPlGr:
#Feld   :   ct :ctVisMode:ctVisible:Nuggets:Ct_local:Ct_global;NugVisible:Cleared:Players
 -1,  4 :    0 :     0   :   false :     0 :      0 :      0  :     true : false :  6, 
  4,  5 :    0 :     0   :   false :     0 :      0 :      0  :     true : false :  7, 
  1, -4 :    0 :     0   :   false :     0 :      0 :      0  :     true : false :  8, 
 -4, -5 :    0 :     0   :   false :     0 :      0 :      0  :     true : false :  9, 
  0,  0 :    0 :     0   :   false :     0 :      0 :      0  :     true : false :  1,   3,   5,   4,   2,   0, 

Startzeit: 10:33:15,387


last common playground
#Feld   :   ct :ctVisMode:ctVisible:Nuggets:Ct_local:Ct_global;NugVisible:Cleared:Players
 -1,  4 :    0 :     0   :   false :     0 :      0 :      0  :     true : false :  2,   4,   1,   5,   3,   0,   6, 
  4,  5 :    0 :     0   :   false :     0 :      0 :      0  :     true : false :  7, 
  1, -4 :    0 :     0   :   false :     0 :      0 :      0  :     true : false :  8, 
 -4, -5 :    0 :     0   :   false :     0 :      0 :      0  :     true : false :  9, 

Balances: saldo  pay  groupbonus
  0:    390 Cent      30 Cent      0 Cent  
  1:    720 Cent      30 Cent      0 Cent  
  2:    610 Cent      30 Cent      0 Cent  
  3:    660 Cent      30 Cent      0 Cent  
  4:    670 Cent      30 Cent      0 Cent  
  5:    610 Cent      30 Cent      0 Cent  
  6:     24 wh       6 bl 
  7:     27 wh       3 bl 
  8:      9 wh      21 bl 
  9:      6 wh      24 bl 

##### next Spiel56: 	##### 

commonPlGr:
#Feld   :   ct :ctVisMode:ctVisible:Nuggets:Ct_local:Ct_global;NugVisible:Cleared:Players
 -1, -5 :    0 :     0   :   false :     0 :      0 :      0  :     true : false :  6, 
 -5, -4 :    0 :     0   :   false :     0 :      0 :      0  :     true : false :  7, 
  1,  5 :    0 :     0   :   false :     0 :      0 :      0  :     true : false :  8, 
  4, -1 :    0 :     0   :   false :     0 :      0 :      0  :     true : false :  9, 
  0,  0 :    0 :     0   :   false :     0 :      0 :      0  :     true : false :  1,   3,   5,   4,   2,   0, 

Startzeit: 10:33:27,773


last common playground
#Feld   :   ct :ctVisMode:ctVisible:Nuggets:Ct_local:Ct_global;NugVisible:Cleared:Players
 -1, -5 :    0 :     0   :   false :     0 :      0 :      0  :     true : false :  5,   2,   4,   1,   0,   3,   6, 
 -5, -4 :    0 :     0   :   false :     0 :      0 :      0  :     true : false :  7, 
  1,  5 :    0 :     0   :   false :     0 :      0 :      0  :     true : false :  8, 
  4, -1 :    0 :     0   :   false :     0 :      0 :      0  :     true : false :  9, 

Balances: saldo  pay  groupbonus
  0:    420 Cent      30 Cent      0 Cent  
  1:    750 Cent      30 Cent      0 Cent  
  2:    640 Cent      30 Cent      0 Cent  
  3:    690 Cent      30 Cent      0 Cent  
  4:    700 Cent      30 Cent      0 Cent  
  5:    640 Cent      30 Cent      0 Cent  
  6:     24 wh       6 bl 
  7:     27 wh       3 bl 
  8:      9 wh      21 bl 
  9:      6 wh      24 bl 

##### next Spiel56: 	##### 

commonPlGr:
#Feld   :   ct :ctVisMode:ctVisible:Nuggets:Ct_local:Ct_global;NugVisible:Cleared:Players
 -2,  3 :    0 :     0   :   false :     0 :      0 :      0  :     true : false :  6, 
  2, -3 :    0 :     0   :   false :     0 :      0 :      0  :     true : false :  7, 
  5,  2 :    0 :     0   :   false :     0 :      0 :      0  :     true : false :  8, 
  3,  5 :    0 :     0   :   false :     0 :      0 :      0  :     true : false :  9, 
  0,  0 :    0 :     0   :   false :     0 :      0 :      0  :     true : false :  1,   3,   5,   4,   2,   0, 

Startzeit: 10:33:42,478


last common playground
#Feld   :   ct :ctVisMode:ctVisible:Nuggets:Ct_local:Ct_global;NugVisible:Cleared:Players
 -2,  3 :    0 :     0   :   false :     0 :      0 :      0  :     true : false :  4,   3,   1,   2,   5,   0,   6, 
  2, -3 :    0 :     0   :   false :     0 :      0 :      0  :     true : false :  7, 
  5,  2 :    0 :     0   :   false :     0 :      0 :      0  :     true : false :  8, 
  3,  5 :    0 :     0   :   false :     0 :      0 :      0  :     true : false :  9, 

Balances: saldo  pay  groupbonus
  0:    450 Cent      30 Cent      0 Cent  
  1:    780 Cent      30 Cent      0 Cent  
  2:    670 Cent      30 Cent      0 Cent  
  3:    720 Cent      30 Cent      0 Cent  
  4:    730 Cent      30 Cent      0 Cent  
  5:    670 Cent      30 Cent      0 Cent  
  6:     24 wh       6 bl 
  7:     27 wh       3 bl 
  8:      9 wh      21 bl 
  9:      6 wh      24 bl 


List of answers to questionnaire:
    /127.0.0.1:39878   1  [[, , , sastbe], []] 
    /127.0.0.1:39886   4  [[, , , RIRGCL], []] 
    /127.0.0.1:39880   2  [[, , , MaPoSt], []] 
    /127.0.0.1:39884   3  [[, , , ELENSE], []] 
    /127.0.0.1:39888   5  [[, , , ANSSHE], []] 
    /127.0.0.1:39876   0  [[, , , biigmi], []] 
