"","group","pid","condition","Account","Account.Reward","Account.Bonus","transitivity","LFScores","LQScores","LHScores","LCScores","FieldDistribution","FieldDistribution.MoveLevel","DecisionScore","Comp","Sec","Risk","Incomp","NoAg","HalfChangeRound","PersonalCode","ColorComp","ColorSec","ColorRisk","ColorIncomp"
"1",1,"1_0","independent",330,330,0,0.808954642644068,19,-37.22,566,528.78,17.5824175824176,2.71165240289664,60,7,9,7,7,0,15,"PERGJAn","lila","blau","rot","gruen"
"2",1,"1_1","independent",470,470,0,0.808954642644068,565,364.43,629,993.43,17.5824175824176,2.71165240289664,74,16,9,3,2,0,17,"elenge","lila","blau","rot","gruen"
"3",1,"1_2","independent",750,750,0,0.808954642644068,398,186.58,430,616.58,17.5824175824176,2.71165240289664,88,29,0,0,1,0,18,"JALEAL","lila","blau","rot","gruen"
"4",1,"1_3","independent",630,630,0,0.808954642644068,52,29.1,240,269.1,17.5824175824176,2.71165240289664,81,24,1,2,3,0,6,"ANIMTO","lila","blau","rot","gruen"
"5",1,"1_4","independent",660,660,0,0.808954642644068,-171,-121.58,144,22.42,17.5824175824176,2.71165240289664,84,25,2,2,1,0,5,"BEENHE","lila","blau","rot","gruen"
"6",1,"1_5","independent",660,660,0,0.808954642644068,-863,-421.32,-180,-601.32,17.5824175824176,2.71165240289664,84,26,0,2,2,0,4,"sargab","lila","blau","rot","gruen"
"7",2,"2_0","independent",640,640,0,0.772792908332249,165,98.04,561,659.04,21.5750915750916,3.10254300231259,82,23,1,5,1,0,7,"COARWO","gruen","lila","blau","rot"
"8",2,"2_1","independent",550,550,0,0.772792908332249,-92,-33.33,485,451.67,21.5750915750916,3.10254300231259,73,16,6,5,3,0,12,"IMINGE","gruen","lila","blau","rot"
"9",2,"2_2","independent",280,280,0,0.772792908332249,-104,-54.14,472,417.85,21.5750915750916,3.10254300231259,52,2,7,11,10,0,15,"JUENGY","gruen","lila","blau","rot"
"10",2,"2_3","independent",420,420,0,0.772792908332249,470,254.58,761,1015.56,21.5750915750916,3.10254300231259,67,12,9,4,5,0,12,"gurgwo","gruen","lila","blau","rot"
"11",2,"2_4","independent",700,700,0,0.772792908332249,-393,-227.53,263,35.47,21.5750915750916,3.10254300231259,83,24,1,4,1,0,9,"SETTIS","gruen","lila","blau","rot"
"12",2,"2_5","independent",290,290,0,0.772792908332249,-46,-37.6,614,576.4,21.5750915750916,3.10254300231259,58,4,6,14,6,0,14,"anigan","gruen","lila","blau","rot"
"13",3,"3_0","independent",300,300,0,0.770869492802245,-16,-22.4,650,627.61,24.7985347985348,3.33391359206574,49,3,9,5,12,1,16,"gielma","gruen","rot","lila","blau"
"14",3,"3_1","independent",440,440,0,0.770869492802245,363,226.75,916,1142.75,24.7985347985348,3.33391359206574,69,14,4,8,3,1,13,"KARGHE","gruen","rot","lila","blau"
"15",3,"3_2","independent",670,670,0,0.770869492802245,-41,-11.72,623,611.28,24.7985347985348,3.33391359206574,82,22,1,7,0,0,22,"juenth","gruen","rot","lila","blau"
"16",3,"3_3","independent",340,340,0,0.770869492802245,-188,-118.06,606,487.94,24.7985347985348,3.33391359206574,59,7,5,10,8,0,16,"PedtTh","gruen","rot","lila","blau"
"17",3,"3_4","independent",460,460,0,0.770869492802245,81,38.16,651,689.16,24.7985347985348,3.33391359206574,71,14,9,4,3,0,11,"elerjo","gruen","rot","lila","blau"
"18",3,"3_5","independent",250,250,0,0.770869492802245,-199,-112.73,431,318.27,24.7985347985348,3.33391359206574,47,2,7,7,13,1,15,"suokhe","gruen","rot","lila","blau"
"19",4,"4_0","independent",320,320,0,0.786926617473887,37,17.96,697,714.96,28.6080586080586,3.21005511227673,64,8,11,7,4,0,14,"ASRGCA","gruen","blau","lila","rot"
"20",4,"4_1","independent",460,460,0,0.786926617473887,-199,-102.07,515,412.93,28.6080586080586,3.21005511227673,76,20,4,2,4,0,15,"anigbe","gruen","blau","lila","rot"
"21",4,"4_2","independent",290,290,0,0.786926617473887,-21,-49.11,646,596.89,28.6080586080586,3.21005511227673,57,6,6,9,9,0,16,"ISBRWI","gruen","blau","lila","rot"
"22",4,"4_3","independent",250,250,0,0.786926617473887,196,94.47,716,810.47,28.6080586080586,3.21005511227673,55,5,10,5,10,0,16,"MAGÖAN","gruen","blau","lila","rot"
"23",4,"4_4","independent",260,260,0,0.786926617473887,-26,0.689999999999997,578,578.68,28.6080586080586,3.21005511227673,59,4,12,9,5,0,18,"BEERMI","gruen","blau","lila","rot"
"24",4,"4_5","independent",620,620,0,0.786926617473887,13,38.01,612,650.01,28.6080586080586,3.21005511227673,76,19,5,4,1,1,10,"urigma","gruen","blau","lila","rot"
"25",5,"5_0","independent",220,220,0,0.794634204015199,-152,-66.96,574,507.04,24.8717948717949,3.1259591470997,52,7,6,4,11,2,17,"ANENTH","gruen","lila","rot","blau"
"26",5,"5_1","independent",350,350,0,0.794634204015199,221,187.43,831,1018.43,24.8717948717949,3.1259591470997,60,9,6,7,7,1,15,"Baopkl","gruen","lila","rot","blau"
"27",5,"5_2","independent",510,510,0,0.794634204015199,51,35.91,589,624.91,24.8717948717949,3.1259591470997,79,24,0,3,1,2,6,"MADTTH","gruen","lila","rot","blau"
"28",5,"5_3","independent",390,390,0,0.794634204015199,25,-4.32,580,575.68,24.8717948717949,3.1259591470997,68,12,15,1,0,2,4,"ASDTHE","gruen","lila","rot","blau"
"29",5,"5_4","independent",290,290,0,0.794634204015199,-107,-130.58,465,334.42,24.8717948717949,3.1259591470997,59,8,5,10,5,2,14,"sorfme","gruen","lila","rot","blau"
"30",5,"5_5","independent",370,370,0,0.794634204015199,-38,-21.45,577,555.55,24.8717948717949,3.1259591470997,64,11,4,9,5,1,13,"anesfr","gruen","lila","rot","blau"
"31",6,"6_0","independent",450,450,0,0.815331133290832,10,-8.43,404,395.57,17.0329670329671,2.75831202847332,64,13,3,5,9,0,13,"sastbe","blau","gruen","rot","lila"
"32",6,"6_1","independent",780,780,0,0.815331133290832,507,285.81,427,712.81,17.0329670329671,2.75831202847332,88,28,0,2,0,0,3,"RIRGCL","blau","gruen","rot","lila"
"33",6,"6_2","independent",670,670,0,0.815331133290832,39,-13.96,200,186.04,17.0329670329671,2.75831202847332,80,22,4,2,2,0,11,"MaPoSt","blau","gruen","rot","lila"
"34",6,"6_3","independent",720,720,0,0.815331133290832,-300,-129.51,53,-76.51,17.0329670329671,2.75831202847332,82,24,3,1,2,0,4,"ELENSE","blau","gruen","rot","lila"
"35",6,"6_4","independent",730,730,0,0.815331133290832,76,35.89,260,295.89,17.0329670329671,2.75831202847332,82,24,3,1,2,0,8,"ANSSHE","blau","gruen","rot","lila"
"36",6,"6_5","independent",670,670,0,0.815331133290832,-332,-169.74,-70,-239.74,17.0329670329671,2.75831202847332,83,24,2,3,1,0,6,"biigmi","blau","gruen","rot","lila"
"37",7,"7_0","independent",640,640,0,0.820780000903837,-437,-190.32,-4,-194.32,18.6813186813187,2.89527938591032,80,22,4,2,2,0,9,"StchPe","rot","blau","lila","gruen"
"38",7,"7_1","independent",510,510,0,0.820780000903837,364,145.1,576,721.1,18.6813186813187,2.89527938591032,73,17,5,4,4,0,17,"CAHEJÜ","rot","blau","lila","gruen"
"39",7,"7_2","independent",660,660,0,0.820780000903837,544,303.91,563,866.91,18.6813186813187,2.89527938591032,85,26,0,3,1,0,15,"MAINWE","rot","blau","lila","gruen"
"40",7,"7_3","independent",510,510,0,0.820780000903837,-486,-214.04,89,-125.04,18.6813186813187,2.89527938591032,70,15,2,9,3,1,20,"SVNYU","rot","blau","lila","gruen"
"41",7,"7_4","independent",600,600,0,0.820780000903837,-498,-270.32,1,-269.32,18.6813186813187,2.89527938591032,77,20,6,1,3,0,9,"ga","rot","blau","lila","gruen"
"42",7,"7_5","independent",530,530,0,0.820780000903837,513,225.63,553,778.63,18.6813186813187,2.89527938591032,78,19,6,4,1,0,10,"KlBRFR","rot","blau","lila","gruen"
"43",8,"8_0","independent",360,360,0,0.826860290819186,268,91.57,765,856.57,20.1465201465202,2.91953700421443,59,9,4,7,10,0,15,"ELERKL","blau","rot","lila","gruen"
"44",8,"8_1","independent",360,360,0,0.826860290819186,604,295.87,723,1018.89,20.1465201465202,2.91953700421443,67,12,7,6,5,0,18,"CHAUFR","blau","rot","lila","gruen"
"45",8,"8_2","independent",420,420,0,0.826860290819186,-516,-230.3,104,-126.3,20.1465201465202,2.91953700421443,73,16,5,6,3,0,15,"SIRGFR","blau","rot","lila","gruen"
"46",8,"8_3","independent",470,470,0,0.826860290819186,-385,-185.54,236,50.46,20.1465201465202,2.91953700421443,70,13,7,7,3,0,15,"CHININ","blau","rot","lila","gruen"
"47",8,"8_4","independent",410,410,0,0.826860290819186,-264,-132.5,342,209.51,20.1465201465202,2.91953700421443,66,11,8,6,5,0,16,"CoEnMi","blau","rot","lila","gruen"
"48",8,"8_5","independent",430,430,0,0.826860290819186,293,160.93,700,860.93,20.1465201465202,2.91953700421443,68,9,18,2,1,0,10,"ANRGDE","blau","rot","lila","gruen"
