#gnr; time; pid; sj; sj
  2; 18:19:41,990;  -1;   0;  0;
  2; 18:19:41,990;   0;   0;  0;; not_moved
  2; 18:19:41,990;   1;   0;  0;; not_moved
  2; 18:19:41,990;   2;   0;  0;; not_moved
  2; 18:19:41,990;   3;   0;  0;; not_moved
  2; 18:19:41,990;   4;   0;  0;; not_moved
  2; 18:19:41,990;   5;   0;  0;; not_moved
  2; 18:19:47,527;   1;   1;  1;
  2; 18:19:47,626;   2;   0; -1;
  2; 18:19:47,669;   0;   0;  1;
  2; 18:19:48,169;   3;   0;  1;
  2; 18:19:48,550;   1;   1;  1;; not_moved
  2; 18:19:48,671;   0;   0;  1;; not_moved
  2; 18:19:48,711;   2;   0; -1;; not_moved
  2; 18:19:48,952;   2;   0; -2;
  2; 18:19:49,069;   4;   1;  0;
  2; 18:19:49,265;   3;   0;  1;; not_moved
  2; 18:19:49,562;   5;   1;  0;
  2; 18:19:50,000;   2;   1; -2;
  2; 18:19:50,079;   4;   1;  0;; not_moved
  2; 18:19:50,177;   0;  -1;  1;
  2; 18:19:50,661;   5;   1;  0;; not_moved
  2; 18:19:50,696;   1;   2;  2;
  2; 18:19:50,880;   2;   0; -3;
  2; 18:19:51,192;   0;  -1;  1;; not_moved
  2; 18:19:51,456;   2;   0; -4;
  2; 18:19:51,491;   4;   2;  0;
  2; 18:19:51,726;   1;   2;  2;; not_moved
  2; 18:19:51,941;   3;  -1;  0;
  2; 18:19:51,990;   0;  -1;  2;
  2; 18:19:52,029;   5;   2;  0;
  2; 18:19:52,483;   2;   0; -4;; not_moved
  2; 18:19:52,499;   4;   2;  0;; not_moved
  2; 18:19:52,945;   4;   2; -1;
  2; 18:19:52,980;   3;  -1;  0;; not_moved
  2; 18:19:52,995;   0;  -1;  2;; not_moved
  2; 18:19:53,095;   5;   2;  0;; not_moved
  2; 18:19:53,631;   3;  -2;  0;
  2; 18:19:53,640;   1;   3;  2;
  2; 18:19:53,732;   0;   0;  3;
  2; 18:19:54,003;   4;   2; -1;; not_moved
  2; 18:19:54,467;   5;   1; -1;
  2; 18:19:54,476;   4;   2; -2;
  2; 18:19:54,630;   1;   3;  2;; not_moved
  2; 18:19:54,682;   3;  -2;  0;; not_moved
  2; 18:19:54,840;   0;   0;  3;; not_moved
  2; 18:19:54,901;   3;  -3;  0;
  2; 18:19:55,504;   4;   2; -2;; not_moved
  2; 18:19:55,506;   5;   1; -1;; not_moved
  2; 18:19:55,691;   0;   1;  4;
  2; 18:19:55,984;   3;  -3;  0;; not_moved
  2; 18:19:56,344;   1;   3;  1;
  2; 18:19:56,385;   3;  -4;  0;
  2; 18:19:56,435;   4;   3; -2;
  2; 18:19:56,699;   0;   1;  4;; not_moved
  2; 18:19:57,052;   5;   0; -1;
  2; 18:19:57,386;   3;  -4;  0;; not_moved
  2; 18:19:57,434;   1;   3;  1;; not_moved
  2; 18:19:57,548;   4;   3; -2;; not_moved
  2; 18:19:57,914;   1;   2;  1;
  2; 18:19:58,110;   5;   0; -1;; not_moved
  2; 18:19:58,710;   5;  -1; -2;
 56; 18:23:04,941;  -1;   0;  0;
 56; 18:23:04,941;   0;   0;  0;; not_moved
 56; 18:23:04,941;   1;   0;  0;; not_moved
 56; 18:23:04,941;   2;   0;  0;; not_moved
 56; 18:23:04,941;   3;   0;  0;; not_moved
 56; 18:23:04,941;   4;   0;  0;; not_moved
 56; 18:23:04,941;   5;   0;  0;; not_moved
 56; 18:23:04,941;   6;   5;  3;; not_moved
 56; 18:23:04,941;   7;  -2; -5;; not_moved
 56; 18:23:04,941;   8;   2;  5;; not_moved
 56; 18:23:04,941;   9;  -5; -3;; not_moved
 56; 18:23:09,218;   0;   1;  1;
 56; 18:23:10,144;   1;   1;  1;
 56; 18:23:10,243;   0;   1;  1;; not_moved
 56; 18:23:10,348;   0;   2;  1;
 56; 18:23:11,183;   1;   1;  1;; not_moved
 56; 18:23:11,345;   0;   2;  1;; not_moved
 56; 18:23:11,374;   1;   2;  1;
 56; 18:23:11,481;   0;   3;  2;
 56; 18:23:12,091;   2;   1;  1;
 56; 18:23:12,211;   5;   1;  1;
 56; 18:23:12,304;   1;   1;  0;
 56; 18:23:12,546;   0;   3;  2;; not_moved
 56; 18:23:12,720;   0;   4;  2;
 56; 18:23:12,788;   2;   2;  2;
 56; 18:23:13,135;   3;   1;  1;
 56; 18:23:13,250;   5;   1;  1;; not_moved
 56; 18:23:13,309;   1;   0; -1;
 56; 18:23:13,487;   2;   3;  2;
 56; 18:23:13,749;   0;   4;  2;; not_moved
 56; 18:23:13,884;   5;   2;  1;
 56; 18:23:13,960;   0;   5;  3;
 56; 18:23:14,078;   2;   4;  3;
 56; 18:23:14,140;   3;   1;  1;; not_moved
 56; 18:23:14,393;   1;   0; -1;; not_moved
 56; 18:23:14,444;   3;   2;  1;
 56; 18:23:14,583;   2;   5;  3;
 56; 18:23:14,852;   5;   2;  1;; not_moved
 56; 18:23:14,895;   5;   3;  2;
 56; 18:23:15,072;   1;  -1; -1;
 56; 18:23:15,092;   0;   5;  3;; not_moved
 56; 18:23:15,441;   3;   2;  1;; not_moved
 56; 18:23:15,474;   1;  -2; -2;
 56; 18:23:15,514;   3;   3;  2;
 56; 18:23:15,649;   2;   5;  3;; not_moved
 56; 18:23:15,899;   5;   4;  3;
 56; 18:23:16,159;   1;  -2; -1;
 56; 18:23:16,476;   3;   4;  3;
 56; 18:23:16,562;   1;  -3; -2;
 56; 18:23:16,703;   4;   1;  1;
 56; 18:23:16,929;   5;   5;  3;
 56; 18:23:17,550;   3;   4;  3;; not_moved
 56; 18:23:17,644;   3;   5;  3;
 56; 18:23:17,660;   1;  -3; -2;; not_moved
 56; 18:23:17,754;   4;   1;  1;; not_moved
 56; 18:23:17,956;   5;   5;  3;; not_moved
 56; 18:23:18,251;   4;   2;  2;
 56; 18:23:18,651;   3;   5;  3;; not_moved
 56; 18:23:19,257;   4;   2;  2;; not_moved
 56; 18:23:19,836;   4;   3;  2;
 56; 18:23:20,859;   4;   3;  2;; not_moved
 56; 18:23:21,529;   4;   4;  2;
 56; 18:23:22,561;   4;   4;  2;; not_moved
 56; 18:23:23,064;   4;   5;  3;
 56; 18:23:23,070;  -1;   0;  0;
 56; 18:23:23,070;   0;   0;  0;; not_moved
 56; 18:23:23,070;   1;   0;  0;; not_moved
 56; 18:23:23,070;   2;   0;  0;; not_moved
 56; 18:23:23,070;   3;   0;  0;; not_moved
 56; 18:23:23,070;   4;   0;  0;; not_moved
 56; 18:23:23,070;   5;   0;  0;; not_moved
 56; 18:23:23,070;   6;   5;  4;; not_moved
 56; 18:23:23,070;   7;  -1; -5;; not_moved
 56; 18:23:23,070;   8;   1;  5;; not_moved
 56; 18:23:23,070;   9;  -5; -4;; not_moved
 56; 18:23:31,975;   0;   0;  1;
 56; 18:23:32,170;   2;   1;  1;
 56; 18:23:32,648;   4;   0;  1;
 56; 18:23:33,075;   0;   0;  1;; not_moved
 56; 18:23:33,110;   0;   0;  2;
 56; 18:23:33,180;   2;   1;  1;; not_moved
 56; 18:23:33,679;   4;   0;  1;; not_moved
 56; 18:23:34,176;   0;   0;  2;; not_moved
 56; 18:23:34,432;   0;   1;  3;
 56; 18:23:34,596;   3;   0;  1;
 56; 18:23:34,663;   2;   1;  2;
 56; 18:23:34,996;   1;  -1;  0;
 56; 18:23:35,478;   0;   1;  3;; not_moved
 56; 18:23:35,513;   5;   0;  1;
 56; 18:23:35,556;   2;   1;  3;
 56; 18:23:35,665;   0;   1;  4;
 56; 18:23:35,672;   3;   0;  1;; not_moved
 56; 18:23:35,913;   1;  -2; -1;
 56; 18:23:35,997;   3;   0;  2;
 56; 18:23:36,195;   2;   1;  4;
 56; 18:23:36,578;   5;   0;  2;
 56; 18:23:36,613;   4;   0;  2;
 56; 18:23:36,648;   1;  -3; -2;
 56; 18:23:36,679;   0;   1;  4;; not_moved
 56; 18:23:37,001;   2;   1;  5;
 56; 18:23:37,032;   0;   1;  5;
 56; 18:23:37,088;   3;   0;  3;
 56; 18:23:37,328;   1;  -4; -3;
 56; 18:23:37,582;   5;   0;  2;; not_moved
 56; 18:23:37,624;   5;   0;  3;
 56; 18:23:37,684;   4;   0;  2;; not_moved
 56; 18:23:37,940;   3;   1;  4;
 56; 18:23:37,944;   1;  -5; -4;
 56; 18:23:38,084;   0;   1;  5;; not_moved
 56; 18:23:38,087;   2;   1;  5;; not_moved
 56; 18:23:38,432;   5;   0;  4;
 56; 18:23:38,981;   3;   1;  4;; not_moved
 56; 18:23:39,043;   1;  -5; -4;; not_moved
 56; 18:23:39,068;   3;   1;  5;
 56; 18:23:39,340;   4;   0;  3;
 56; 18:23:39,353;   5;   1;  5;
 56; 18:23:40,025;   1;  -4; -4;
 56; 18:23:40,098;   3;   1;  5;; not_moved
 56; 18:23:40,386;   5;   1;  5;; not_moved
 56; 18:23:40,387;   4;   0;  3;; not_moved
 56; 18:23:40,787;   4;   1;  4;
 56; 18:23:41,054;   1;  -4; -4;; not_moved
 56; 18:23:41,352;   1;  -3; -4;
 56; 18:23:41,789;   4;   1;  4;; not_moved
 56; 18:23:41,968;   1;  -2; -4;
 56; 18:23:42,857;   4;   1;  5;
 56; 18:23:42,861;  -1;   0;  0;
 56; 18:23:42,861;   0;   0;  0;; not_moved
 56; 18:23:42,861;   1;   0;  0;; not_moved
 56; 18:23:42,861;   2;   0;  0;; not_moved
 56; 18:23:42,861;   3;   0;  0;; not_moved
 56; 18:23:42,861;   4;   0;  0;; not_moved
 56; 18:23:42,861;   5;   0;  0;; not_moved
 56; 18:23:42,861;   6;   3; -2;; not_moved
 56; 18:23:42,861;   7;  -2; -5;; not_moved
 56; 18:23:42,861;   8;   5;  3;; not_moved
 56; 18:23:42,861;   9;  -3;  2;; not_moved
 56; 18:23:52,595;   0;   0; -1;
 56; 18:23:53,201;   1;   0;  1;
 56; 18:23:53,610;   0;   0; -1;; not_moved
 56; 18:23:54,264;   0;   1; -1;
 56; 18:23:54,313;   1;   0;  1;; not_moved
 56; 18:23:54,729;   1;  -1;  0;
 56; 18:23:55,198;   0;   2; -1;
 56; 18:23:55,330;   2;   0; -1;
 56; 18:23:55,773;   1;  -1;  0;; not_moved
 56; 18:23:56,090;   2;   1; -1;
 56; 18:23:56,214;   0;   2; -1;; not_moved
 56; 18:23:56,336;   5;   1;  0;
 56; 18:23:56,609;   1;  -1; -1;
 56; 18:23:56,712;   2;   2; -1;
 56; 18:23:56,932;   0;   2; -2;
 56; 18:23:57,040;   5;   2;  0;
 56; 18:23:57,244;   2;   3; -1;
 56; 18:23:57,371;   1;   0; -1;
 56; 18:23:57,629;   3;   0; -1;
 56; 18:23:57,749;   5;   2; -1;
 56; 18:23:57,762;   2;   3; -2;
 56; 18:23:58,017;   0;   2; -2;; not_moved
 56; 18:23:58,033;   0;   3; -2;
 56; 18:23:58,280;   3;   1; -1;
 56; 18:23:58,336;   1;   1; -1;
 56; 18:23:58,449;   5;   3; -1;
 56; 18:23:58,815;   2;   3; -2;; not_moved
 56; 18:23:58,929;   1;   2; -1;
 56; 18:23:59,015;   5;   3; -2;
 56; 18:23:59,118;   0;   3; -2;; not_moved
 56; 18:23:59,130;   3;   2; -1;
 56; 18:23:59,806;   4;   1;  1;
 56; 18:23:59,834;   1;   3; -1;
 56; 18:23:59,945;   3;   3; -1;
 56; 18:24:00,114;   5;   3; -2;; not_moved
 56; 18:24:00,329;   1;   3; -2;
 56; 18:24:00,819;   4;   1;  1;; not_moved
 56; 18:24:00,848;   3;   3; -2;
 56; 18:24:01,395;   1;   3; -2;; not_moved
 56; 18:24:01,484;   4;   2;  1;
 56; 18:24:01,912;   3;   3; -2;; not_moved
 56; 18:24:02,521;   4;   2;  1;; not_moved
 56; 18:24:02,705;   4;   3;  2;
 56; 18:24:03,723;   4;   3;  2;; not_moved
 56; 18:24:03,928;   4;   4;  2;
 56; 18:24:04,925;   4;   4;  2;; not_moved
 56; 18:24:05,247;   4;   5;  3;
 56; 18:24:05,250;  -1;   0;  0;
 56; 18:24:05,250;   0;   0;  0;; not_moved
 56; 18:24:05,250;   1;   0;  0;; not_moved
 56; 18:24:05,250;   2;   0;  0;; not_moved
 56; 18:24:05,250;   3;   0;  0;; not_moved
 56; 18:24:05,250;   4;   0;  0;; not_moved
 56; 18:24:05,250;   5;   0;  0;; not_moved
 56; 18:24:05,250;   6;   3; -2;; not_moved
 56; 18:24:05,250;   7;  -2; -5;; not_moved
 56; 18:24:05,250;   8;  -5; -3;; not_moved
 56; 18:24:05,250;   9;   5;  3;; not_moved
 56; 18:24:12,971;   2;  -1; -1;
 56; 18:24:13,474;   2;  -2; -1;
 56; 18:24:13,938;   2;  -3; -2;
 56; 18:24:14,354;   1;  -1; -1;
 56; 18:24:14,446;   2;  -4; -2;
 56; 18:24:14,973;   0;  -1; -1;
 56; 18:24:14,988;   2;  -5; -3;
 56; 18:24:15,346;   1;  -2; -1;
 56; 18:24:15,716;   0;  -2; -1;
 56; 18:24:16,036;   2;  -5; -3;; not_moved
 56; 18:24:16,107;   1;  -3; -2;
 56; 18:24:16,652;   0;  -3; -2;
 56; 18:24:16,811;   1;  -4; -2;
 56; 18:24:16,990;   5;  -1; -1;
 56; 18:24:17,199;   3;  -1; -1;
 56; 18:24:17,514;   1;  -5; -3;
 56; 18:24:17,729;   5;  -2; -1;
 56; 18:24:17,745;   0;  -3; -2;; not_moved
 56; 18:24:17,786;   0;  -4; -3;
 56; 18:24:17,885;   3;  -2; -1;
 56; 18:24:17,970;   4;   1;  0;
 56; 18:24:18,320;   5;  -3; -2;
 56; 18:24:18,517;   1;  -5; -3;; not_moved
 56; 18:24:18,706;   0;  -5; -3;
 56; 18:24:18,831;   3;  -3; -2;
 56; 18:24:19,043;   4;   1;  0;; not_moved
 56; 18:24:19,102;   5;  -4; -2;
 56; 18:24:19,748;   0;  -5; -3;; not_moved
 56; 18:24:19,801;   3;  -4; -3;
 56; 18:24:19,807;   5;  -5; -3;
 56; 18:24:20,139;   4;   1; -1;
 56; 18:24:20,698;   3;  -5; -3;
 56; 18:24:20,838;   5;  -5; -3;; not_moved
 56; 18:24:21,083;   4;   2; -1;
 56; 18:24:21,737;   3;  -5; -3;; not_moved
 56; 18:24:22,149;   4;   2; -1;; not_moved
 56; 18:24:22,216;   4;   2; -2;
 56; 18:24:23,250;   4;   2; -2;; not_moved
 56; 18:24:23,393;   4;   3; -2;
 56; 18:24:23,395;  -1;   0;  0;
 56; 18:24:23,395;   0;   0;  0;; not_moved
 56; 18:24:23,395;   1;   0;  0;; not_moved
 56; 18:24:23,395;   2;   0;  0;; not_moved
 56; 18:24:23,395;   3;   0;  0;; not_moved
 56; 18:24:23,395;   4;   0;  0;; not_moved
 56; 18:24:23,395;   5;   0;  0;; not_moved
 56; 18:24:23,395;   6;   5;  1;; not_moved
 56; 18:24:23,395;   7;  -1;  4;; not_moved
 56; 18:24:23,395;   8;  -5; -1;; not_moved
 56; 18:24:23,395;   9;  -4; -5;; not_moved
 56; 18:24:30,635;   2;   1;  0;
 56; 18:24:31,347;   2;   2;  0;
 56; 18:24:32,066;   1;   1;  0;
 56; 18:24:32,292;   2;   3;  0;
 56; 18:24:32,754;   2;   4;  1;
 56; 18:24:32,930;   1;   2;  0;
 56; 18:24:32,966;   0;   1;  0;
 56; 18:24:33,212;   2;   5;  1;
 56; 18:24:33,322;   5;   1;  0;
 56; 18:24:33,483;   1;   3;  0;
 56; 18:24:33,882;   0;   2;  0;
 56; 18:24:33,947;   1;   4;  1;
 56; 18:24:34,042;   5;   2;  0;
 56; 18:24:34,257;   2;   5;  1;; not_moved
 56; 18:24:34,523;   1;   5;  1;
 56; 18:24:34,541;   4;   1;  0;
 56; 18:24:34,583;   3;   1;  0;
 56; 18:24:34,856;   0;   3;  0;
 56; 18:24:35,068;   5;   3;  0;
 56; 18:24:35,344;   3;   2;  0;
 56; 18:24:35,424;   4;   2;  0;
 56; 18:24:35,521;   5;   4;  1;
 56; 18:24:35,537;   1;   5;  1;; not_moved
 56; 18:24:35,878;   0;   3;  0;; not_moved
 56; 18:24:35,936;   5;   5;  1;
 56; 18:24:36,290;   0;   4;  1;
 56; 18:24:36,362;   3;   2;  0;; not_moved
 56; 18:24:36,467;   4;   2;  0;; not_moved
 56; 18:24:36,681;   3;   3;  0;
 56; 18:24:36,756;   4;   3;  0;
 56; 18:24:36,959;   5;   5;  1;; not_moved
 56; 18:24:37,239;   0;   5;  1;
 56; 18:24:37,408;   3;   4;  1;
 56; 18:24:37,672;   4;   4;  0;
 56; 18:24:38,332;   0;   5;  1;; not_moved
 56; 18:24:38,426;   3;   5;  1;
 56; 18:24:38,670;   4;   4;  0;; not_moved
 56; 18:24:38,686;   4;   5;  1;
 56; 18:24:38,689;  -1;   0;  0;
 56; 18:24:38,689;   0;   0;  0;; not_moved
 56; 18:24:38,689;   1;   0;  0;; not_moved
 56; 18:24:38,689;   2;   0;  0;; not_moved
 56; 18:24:38,689;   3;   0;  0;; not_moved
 56; 18:24:38,689;   4;   0;  0;; not_moved
 56; 18:24:38,689;   5;   0;  0;; not_moved
 56; 18:24:38,689;   6;   5;  3;; not_moved
 56; 18:24:38,689;   7;   3; -2;; not_moved
 56; 18:24:38,689;   8;  -5; -3;; not_moved
 56; 18:24:38,689;   9;  -3;  2;; not_moved
 56; 18:24:49,421;   0;  -1;  0;
 56; 18:24:50,504;   0;  -2;  0;
 56; 18:24:51,511;   0;  -2;  0;; not_moved
 56; 18:24:51,617;   0;  -2;  1;
 56; 18:24:51,801;   1;  -1;  0;
 56; 18:24:52,445;   1;  -2;  0;
 56; 18:24:52,714;   0;  -2;  1;; not_moved
 56; 18:24:52,836;   0;  -2;  2;
 56; 18:24:53,011;   1;  -2;  1;
 56; 18:24:53,659;   1;  -2;  2;
 56; 18:24:53,915;   0;  -2;  2;; not_moved
 56; 18:24:53,979;   0;  -3;  2;
 56; 18:24:53,982;   3;  -1;  0;
 56; 18:24:54,282;   2;  -1;  0;
 56; 18:24:54,283;   1;  -3;  2;
 56; 18:24:54,928;   3;  -2;  0;
 56; 18:24:54,994;   2;  -1;  1;
 56; 18:24:55,017;   0;  -3;  2;; not_moved
 56; 18:24:55,378;   1;  -3;  2;; not_moved
 56; 18:24:55,588;   2;  -2;  1;
 56; 18:24:55,713;   3;  -2;  1;
 56; 18:24:56,049;   2;  -2;  2;
 56; 18:24:56,300;   5;  -1;  0;
 56; 18:24:56,592;   3;  -3;  1;
 56; 18:24:56,701;   4;  -1; -1;
 56; 18:24:56,859;   2;  -3;  2;
 56; 18:24:57,061;   5;  -2;  0;
 56; 18:24:57,456;   3;  -3;  2;
 56; 18:24:57,692;   5;  -2;  1;
 56; 18:24:57,792;   4;  -1; -1;; not_moved
 56; 18:24:57,895;   2;  -3;  2;; not_moved
 56; 18:24:58,104;   4;  -2; -1;
 56; 18:24:58,230;   5;  -3;  1;
 56; 18:24:58,488;   3;  -3;  2;; not_moved
 56; 18:24:58,832;   5;  -3;  2;
 56; 18:24:59,093;   4;  -2; -1;; not_moved
 56; 18:24:59,195;   4;  -2;  0;
 56; 18:24:59,892;   5;  -3;  2;; not_moved
 56; 18:25:00,295;   4;  -2;  0;; not_moved
 56; 18:25:00,492;   4;  -2;  1;
 56; 18:25:01,499;   4;  -2;  1;; not_moved
 56; 18:25:01,588;   4;  -3;  1;
 56; 18:25:02,528;   4;  -3;  2;
 56; 18:25:02,532;  -1;   0;  0;
 56; 18:25:02,532;   0;   0;  0;; not_moved
 56; 18:25:02,532;   1;   0;  0;; not_moved
 56; 18:25:02,532;   2;   0;  0;; not_moved
 56; 18:25:02,532;   3;   0;  0;; not_moved
 56; 18:25:02,532;   4;   0;  0;; not_moved
 56; 18:25:02,532;   5;   0;  0;; not_moved
 56; 18:25:02,532;   6;   1; -4;; not_moved
 56; 18:25:02,532;   7;  -1;  4;; not_moved
 56; 18:25:02,532;   8;  -5; -1;; not_moved
 56; 18:25:02,532;   9;  -4; -5;; not_moved
 56; 18:25:09,891;   2;  -1;  0;
 56; 18:25:10,435;   2;  -2;  0;
 56; 18:25:10,671;   4;   0; -1;
 56; 18:25:10,899;   2;  -3;  0;
 56; 18:25:10,966;   5;  -1;  0;
 56; 18:25:11,363;   2;  -4;  0;
 56; 18:25:11,518;   1;  -1;  0;
 56; 18:25:11,651;   5;  -2;  0;
 56; 18:25:11,713;   4;   0; -1;; not_moved
 56; 18:25:11,757;   4;   0; -2;
 56; 18:25:11,803;   2;  -5; -1;
 56; 18:25:12,171;   1;  -2;  0;
 56; 18:25:12,350;   5;  -3;  0;
 56; 18:25:12,597;   1;  -3;  0;
 56; 18:25:12,814;   0;  -1;  0;
 56; 18:25:12,815;   4;   0; -2;; not_moved
 56; 18:25:12,820;   2;  -5; -1;; not_moved
 56; 18:25:12,906;   5;  -4;  0;
 56; 18:25:12,968;   3;  -1;  0;
 56; 18:25:13,046;   1;  -4;  0;
 56; 18:25:13,372;   5;  -5; -1;
 56; 18:25:13,476;   1;  -5; -1;
 56; 18:25:13,546;   0;  -2;  0;
 56; 18:25:13,648;   3;  -2;  0;
 56; 18:25:13,788;   4;   0; -3;
 56; 18:25:14,353;   0;  -3;  0;
 56; 18:25:14,413;   5;  -5; -1;; not_moved
 56; 18:25:14,503;   1;  -5; -1;; not_moved
 56; 18:25:14,716;   3;  -2;  0;; not_moved
 56; 18:25:14,817;   4;   0; -3;; not_moved
 56; 18:25:15,087;   4;   0; -4;
 56; 18:25:15,377;   0;  -3;  0;; not_moved
 56; 18:25:15,420;   3;  -3;  0;
 56; 18:25:15,695;   0;  -4;  0;
 56; 18:25:16,081;   3;  -4;  0;
 56; 18:25:16,119;   4;   0; -4;; not_moved
 56; 18:25:16,232;   4;   1; -4;
 56; 18:25:16,660;   0;  -5; -1;
 56; 18:25:16,978;   3;  -5; -1;
 56; 18:25:16,981;  -1;   0;  0;
 56; 18:25:16,981;   0;   0;  0;; not_moved
 56; 18:25:16,981;   1;   0;  0;; not_moved
 56; 18:25:16,981;   2;   0;  0;; not_moved
 56; 18:25:16,981;   3;   0;  0;; not_moved
 56; 18:25:16,981;   4;   0;  0;; not_moved
 56; 18:25:16,981;   5;   0;  0;; not_moved
 56; 18:25:16,981;   6;  -5; -1;; not_moved
 56; 18:25:16,981;   7;   5;  1;; not_moved
 56; 18:25:16,981;   8;   1; -4;; not_moved
 56; 18:25:16,981;   9;   4;  5;; not_moved
 56; 18:25:27,097;   0;   1;  1;
 56; 18:25:28,007;   0;   2;  2;
 56; 18:25:28,716;   1;   1;  1;
 56; 18:25:28,877;   0;   3;  3;
 56; 18:25:28,975;   3;   1;  1;
 56; 18:25:29,560;   1;   2;  2;
 56; 18:25:29,720;   4;   1;  1;
 56; 18:25:29,804;   2;   1;  1;
 56; 18:25:29,806;   0;   4;  4;
 56; 18:25:29,872;   3;   2;  2;
 56; 18:25:29,894;   5;   1;  1;
 56; 18:25:30,212;   1;   3;  3;
 56; 18:25:30,488;   5;   2;  2;
 56; 18:25:30,528;   4;   2;  2;
 56; 18:25:30,637;   3;   3;  3;
 56; 18:25:30,837;   2;   1;  1;; not_moved
 56; 18:25:30,905;   0;   4;  4;; not_moved
 56; 18:25:30,909;   1;   4;  4;
 56; 18:25:31,000;   5;   3;  3;
 56; 18:25:31,016;   0;   4;  5;
 56; 18:25:31,068;   2;   1;  2;
 56; 18:25:31,380;   4;   3;  3;
 56; 18:25:31,586;   5;   4;  4;
 56; 18:25:31,684;   1;   4;  5;
 56; 18:25:31,692;   3;   4;  4;
 56; 18:25:31,713;   2;   2;  3;
 56; 18:25:32,007;   0;   4;  5;; not_moved
 56; 18:25:32,101;   5;   4;  5;
 56; 18:25:32,205;   2;   3;  4;
 56; 18:25:32,415;   3;   4;  5;
 56; 18:25:32,438;   4;   3;  3;; not_moved
 56; 18:25:32,722;   2;   4;  5;
 56; 18:25:32,727;   1;   4;  5;; not_moved
 56; 18:25:33,124;   4;   3;  4;
 56; 18:25:33,138;   5;   4;  5;; not_moved
 56; 18:25:33,438;   3;   4;  5;; not_moved
 56; 18:25:33,784;   2;   4;  5;; not_moved
 56; 18:25:33,951;   4;   4;  5;
 56; 18:25:33,953;  -1;   0;  0;
 56; 18:25:33,953;   0;   0;  0;; not_moved
 56; 18:25:33,953;   1;   0;  0;; not_moved
 56; 18:25:33,953;   2;   0;  0;; not_moved
 56; 18:25:33,953;   3;   0;  0;; not_moved
 56; 18:25:33,953;   4;   0;  0;; not_moved
 56; 18:25:33,953;   5;   0;  0;; not_moved
 56; 18:25:33,953;   6;  -5; -4;; not_moved
 56; 18:25:33,953;   7;   5;  4;; not_moved
 56; 18:25:33,953;   8;  -4;  1;; not_moved
 56; 18:25:33,953;   9;   1;  5;; not_moved
 56; 18:25:41,270;   5;   1;  0;
 56; 18:25:41,315;   2;   1;  1;
 56; 18:25:41,790;   5;   2;  1;
 56; 18:25:41,890;   2;   2;  2;
 56; 18:25:42,370;   5;   3;  2;
 56; 18:25:42,466;   2;   3;  3;
 56; 18:25:42,902;   5;   4;  3;
 56; 18:25:42,975;   2;   4;  4;
 56; 18:25:43,309;   5;   5;  4;
 56; 18:25:43,324;   4;  -1; -1;
 56; 18:25:43,390;   2;   5;  4;
 56; 18:25:43,573;   1;   1;  1;
 56; 18:25:44,079;   0;   1;  1;
 56; 18:25:44,353;   4;  -1; -1;; not_moved
 56; 18:25:44,354;   5;   5;  4;; not_moved
 56; 18:25:44,457;   2;   5;  4;; not_moved
 56; 18:25:44,564;   3;   1;  1;
 56; 18:25:44,568;   4;  -2; -2;
 56; 18:25:44,642;   1;   1;  1;; not_moved
 56; 18:25:44,654;   1;   2;  2;
 56; 18:25:44,851;   0;   2;  2;
 56; 18:25:45,200;   3;   2;  2;
 56; 18:25:45,333;   1;   3;  3;
 56; 18:25:45,555;   4;  -2; -2;; not_moved
 56; 18:25:45,632;   4;  -3; -3;
 56; 18:25:45,684;   0;   3;  3;
 56; 18:25:45,855;   3;   3;  3;
 56; 18:25:45,905;   1;   4;  4;
 56; 18:25:46,520;   0;   4;  4;
 56; 18:25:46,637;   1;   5;  4;
 56; 18:25:46,656;   4;  -3; -3;; not_moved
 56; 18:25:46,660;   3;   4;  4;
 56; 18:25:46,876;   4;  -4; -4;
 56; 18:25:47,206;   3;   5;  4;
 56; 18:25:47,358;   0;   5;  4;
 56; 18:25:47,692;   1;   5;  4;; not_moved
 56; 18:25:47,795;   4;  -5; -4;
 56; 18:25:47,797;  -1;   0;  0;
 56; 18:25:47,797;   0;   0;  0;; not_moved
 56; 18:25:47,797;   1;   0;  0;; not_moved
 56; 18:25:47,797;   2;   0;  0;; not_moved
 56; 18:25:47,797;   3;   0;  0;; not_moved
 56; 18:25:47,797;   4;   0;  0;; not_moved
 56; 18:25:47,797;   5;   0;  0;; not_moved
 56; 18:25:47,797;   6;   5;  2;; not_moved
 56; 18:25:47,797;   7;  -3; -5;; not_moved
 56; 18:25:47,797;   8;  -2;  3;; not_moved
 56; 18:25:47,797;   9;   2; -3;; not_moved
 56; 18:25:58,226;   0;  -1; -1;
 56; 18:25:59,062;   0;  -2; -2;
 56; 18:26:00,004;   0;  -2; -3;
 56; 18:26:00,444;   3;  -1; -1;
 56; 18:26:01,012;   0;  -2; -4;
 56; 18:26:01,235;   3;  -2; -2;
 56; 18:26:01,559;   5;  -1; -1;
 56; 18:26:01,788;   2;  -1; -1;
 56; 18:26:01,952;   3;  -2; -3;
 56; 18:26:02,000;   5;  -2; -2;
 56; 18:26:02,029;   1;  -1; -1;
 56; 18:26:02,048;   0;  -2; -4;; not_moved
 56; 18:26:02,072;   4;  -1; -1;
 56; 18:26:02,089;   0;  -3; -5;
 56; 18:26:02,227;   2;  -1; -2;
 56; 18:26:02,574;   5;  -3; -3;
 56; 18:26:02,588;   1;  -2; -2;
 56; 18:26:02,723;   2;  -2; -3;
 56; 18:26:02,781;   3;  -2; -4;
 56; 18:26:02,844;   4;  -1; -2;
 56; 18:26:02,941;   5;  -3; -4;
 56; 18:26:03,029;   1;  -2; -3;
 56; 18:26:03,117;   2;  -2; -4;
 56; 18:26:03,150;   0;  -3; -5;; not_moved
 56; 18:26:03,235;   5;  -3; -5;
 56; 18:26:03,608;   3;  -3; -5;
 56; 18:26:03,696;   2;  -3; -5;
 56; 18:26:03,753;   4;  -2; -3;
 56; 18:26:03,902;   1;  -2; -4;
 56; 18:26:04,278;   5;  -3; -5;; not_moved
 56; 18:26:04,550;   4;  -2; -4;
 56; 18:26:04,578;   3;  -3; -5;; not_moved
 56; 18:26:04,714;   2;  -3; -5;; not_moved
 56; 18:26:04,821;   1;  -2; -5;
 56; 18:26:05,222;   4;  -3; -5;
 56; 18:26:05,790;   1;  -3; -5;
 56; 18:26:05,792;  -1;   0;  0;
 56; 18:26:05,792;   0;   0;  0;; not_moved
 56; 18:26:05,792;   1;   0;  0;; not_moved
 56; 18:26:05,792;   2;   0;  0;; not_moved
 56; 18:26:05,792;   3;   0;  0;; not_moved
 56; 18:26:05,792;   4;   0;  0;; not_moved
 56; 18:26:05,792;   5;   0;  0;; not_moved
 56; 18:26:05,792;   6;   3;  5;; not_moved
 56; 18:26:05,792;   7;   2; -3;; not_moved
 56; 18:26:05,792;   8;  -5; -2;; not_moved
 56; 18:26:05,792;   9;   5;  2;; not_moved
 56; 18:26:13,003;   2;   0; -1;
 56; 18:26:13,492;   2;   1; -1;
 56; 18:26:13,931;   2;   1; -2;
 56; 18:26:14,417;   2;   1; -3;
 56; 18:26:14,927;   2;   2; -3;
 56; 18:26:15,055;   3;   0; -1;
 56; 18:26:15,929;   2;   2; -3;; not_moved
 56; 18:26:15,930;   5;   0; -1;
 56; 18:26:15,947;   3;   0; -2;
 56; 18:26:16,288;   5;   0; -2;
 56; 18:26:16,398;   1;   0; -1;
 56; 18:26:16,651;   5;   1; -2;
 56; 18:26:16,828;   3;   1; -2;
 56; 18:26:17,166;   1;   0; -2;
 56; 18:26:17,482;   5;   1; -3;
 56; 18:26:17,628;   3;   2; -2;
 56; 18:26:17,768;   5;   2; -3;
 56; 18:26:17,850;   1;   1; -1;
 56; 18:26:18,254;   3;   2; -3;
 56; 18:26:18,440;   1;   1; -2;
 56; 18:26:18,836;   5;   2; -3;; not_moved
 56; 18:26:18,958;   1;   1; -3;
 56; 18:26:19,296;   3;   2; -3;; not_moved
 56; 18:26:19,477;   1;   2; -2;
 56; 18:26:19,832;   4;   1;  0;
 56; 18:26:19,992;   1;   2; -3;
 56; 18:26:20,179;   0;   0; -1;
 56; 18:26:20,628;   4;   2;  0;
 56; 18:26:20,998;   1;   2; -3;; not_moved
 56; 18:26:21,241;   0;   1; -1;
 56; 18:26:21,405;   4;   3;  1;
 56; 18:26:22,209;   4;   4;  1;
 56; 18:26:22,272;   0;   1; -1;; not_moved
 56; 18:26:22,732;   0;   1; -2;
 56; 18:26:22,984;   4;   5;  2;
 56; 18:26:23,660;   0;   1; -3;
 56; 18:26:24,088;   4;   5;  2;; not_moved
 56; 18:26:24,675;   0;   1; -3;; not_moved
 56; 18:26:24,788;   0;   2; -3;
 56; 18:26:24,793;  -1;   0;  0;
 56; 18:26:24,793;   0;   0;  0;; not_moved
 56; 18:26:24,793;   1;   0;  0;; not_moved
 56; 18:26:24,793;   2;   0;  0;; not_moved
 56; 18:26:24,793;   3;   0;  0;; not_moved
 56; 18:26:24,793;   4;   0;  0;; not_moved
 56; 18:26:24,793;   5;   0;  0;; not_moved
 56; 18:26:24,793;   6;  -1; -5;; not_moved
 56; 18:26:24,793;   7;   1;  5;; not_moved
 56; 18:26:24,793;   8;  -5; -4;; not_moved
 56; 18:26:24,793;   9;   4; -1;; not_moved
 56; 18:26:33,592;   0;   1;  0;
 56; 18:26:34,039;   1;   0; -1;
 56; 18:26:34,364;   0;   2;  0;
 56; 18:26:34,678;   1;   0; -2;
 56; 18:26:35,218;   0;   3;  0;
 56; 18:26:35,250;   1;   0; -3;
 56; 18:26:35,838;   1;   0; -4;
 56; 18:26:36,188;   0;   3; -1;
 56; 18:26:36,381;   3;   0; -1;
 56; 18:26:36,513;   1;  -1; -5;
 56; 18:26:37,074;   0;   4; -1;
 56; 18:26:37,377;   3;   0; -2;
 56; 18:26:37,564;   1;  -1; -5;; not_moved
 56; 18:26:37,901;   5;   1;  0;
 56; 18:26:38,093;   0;   4; -1;; not_moved
 56; 18:26:38,280;   5;   2;  0;
 56; 18:26:38,404;   3;   0; -3;
 56; 18:26:38,589;   4;   0; -1;
 56; 18:26:38,637;   5;   3;  0;
 56; 18:26:38,958;   5;   4;  0;
 56; 18:26:39,124;   3;   0; -4;
 56; 18:26:39,294;   5;   4; -1;
 56; 18:26:39,438;   4;   0; -2;
 56; 18:26:40,122;   3;   0; -4;; not_moved
 56; 18:26:40,332;   4;   0; -3;
 56; 18:26:40,364;   5;   4; -1;; not_moved
 56; 18:26:40,369;   3;  -1; -5;
 56; 18:26:40,923;   2;   0; -1;
 56; 18:26:41,351;   4;   0; -4;
 56; 18:26:41,424;   3;  -1; -5;; not_moved
 56; 18:26:41,584;   2;   0; -2;
 56; 18:26:41,962;   2;   0; -3;
 56; 18:26:42,134;   4;  -1; -5;
 56; 18:26:42,469;   2;   0; -4;
 56; 18:26:42,907;   2;  -1; -5;
 56; 18:26:42,909;  -1;   0;  0;
 56; 18:26:42,909;   0;   0;  0;; not_moved
 56; 18:26:42,909;   1;   0;  0;; not_moved
 56; 18:26:42,909;   2;   0;  0;; not_moved
 56; 18:26:42,909;   3;   0;  0;; not_moved
 56; 18:26:42,909;   4;   0;  0;; not_moved
 56; 18:26:42,909;   5;   0;  0;; not_moved
 56; 18:26:42,909;   6;   5;  4;; not_moved
 56; 18:26:42,909;   7;  -5; -4;; not_moved
 56; 18:26:42,909;   8;   1;  5;; not_moved
 56; 18:26:42,909;   9;   4; -1;; not_moved
 56; 18:26:49,995;   2;   1;  0;
 56; 18:26:50,499;   2;   2;  0;
 56; 18:26:51,002;   2;   3;  0;
 56; 18:26:51,359;   1;   1;  0;
 56; 18:26:51,471;   2;   3; -1;
 56; 18:26:51,895;   1;   2;  0;
 56; 18:26:51,909;   2;   4; -1;
 56; 18:26:52,310;   0;   1;  0;
 56; 18:26:52,552;   1;   3;  0;
 56; 18:26:53,028;   2;   4; -1;; not_moved
 56; 18:26:53,039;   1;   3; -1;
 56; 18:26:53,248;   0;   2;  0;
 56; 18:26:53,262;   4;   0;  1;
 56; 18:26:53,287;   3;   1;  0;
 56; 18:26:53,663;   1;   4; -1;
 56; 18:26:53,684;   5;   1;  0;
 56; 18:26:54,127;   5;   2;  0;
 56; 18:26:54,163;   0;   3;  0;
 56; 18:26:54,184;   3;   2;  0;
 56; 18:26:54,300;   4;   0;  1;; not_moved
 56; 18:26:54,323;   4;   0;  2;
 56; 18:26:54,596;   5;   3;  0;
 56; 18:26:54,670;   1;   4; -1;; not_moved
 56; 18:26:54,906;   5;   4;  0;
 56; 18:26:54,943;   0;   3; -1;
 56; 18:26:55,042;   3;   3;  0;
 56; 18:26:55,184;   5;   4; -1;
 56; 18:26:55,200;   4;   0;  3;
 56; 18:26:55,783;   3;   4;  0;
 56; 18:26:55,876;   0;   4; -1;
 56; 18:26:56,001;   4;   1;  4;
 56; 18:26:56,196;   5;   4; -1;; not_moved
 56; 18:26:56,476;   3;   4; -1;
 56; 18:26:56,851;   4;   1;  5;
 56; 18:26:56,855;  -1;   0;  0;
 56; 18:26:56,855;   0;   0;  0;; not_moved
 56; 18:26:56,855;   1;   0;  0;; not_moved
 56; 18:26:56,855;   2;   0;  0;; not_moved
 56; 18:26:56,855;   3;   0;  0;; not_moved
 56; 18:26:56,855;   4;   0;  0;; not_moved
 56; 18:26:56,855;   5;   0;  0;; not_moved
 56; 18:26:56,855;   6;  -3; -5;; not_moved
 56; 18:26:56,855;   7;  -2;  3;; not_moved
 56; 18:26:56,855;   8;   2; -3;; not_moved
 56; 18:26:56,855;   9;  -5; -2;; not_moved
 56; 18:27:04,150;   2;  -1;  0;
 56; 18:27:04,549;   2;  -2; -1;
 56; 18:27:05,016;   2;  -3; -1;
 56; 18:27:05,395;   2;  -4; -2;
 56; 18:27:05,796;   2;  -5; -2;
 56; 18:27:06,138;   1;  -1;  0;
 56; 18:27:06,264;   0;  -1;  0;
 56; 18:27:06,813;   2;  -5; -2;; not_moved
 56; 18:27:07,040;   1;  -2; -1;
 56; 18:27:07,307;   4;  -1;  0;
 56; 18:27:07,331;   0;  -1;  0;; not_moved
 56; 18:27:07,561;   0;  -2; -1;
 56; 18:27:07,593;   3;  -1;  0;
 56; 18:27:08,054;   4;  -2; -1;
 56; 18:27:08,148;   1;  -2; -1;; not_moved
 56; 18:27:08,185;   1;  -3; -1;
 56; 18:27:08,257;   3;  -2; -1;
 56; 18:27:08,381;   0;  -3; -1;
 56; 18:27:08,533;   5;  -1;  0;
 56; 18:27:08,756;   4;  -3; -1;
 56; 18:27:08,947;   3;  -3; -1;
 56; 18:27:08,984;   1;  -4; -1;
 56; 18:27:09,040;   5;  -2; -1;
 56; 18:27:09,203;   0;  -4; -1;
 56; 18:27:09,460;   4;  -4; -1;
 56; 18:27:09,508;   5;  -3; -1;
 56; 18:27:09,752;   1;  -5; -2;
 56; 18:27:09,812;   3;  -4; -1;
 56; 18:27:10,008;   5;  -4; -1;
 56; 18:27:10,036;   0;  -5; -2;
 56; 18:27:10,093;   4;  -5; -2;
 56; 18:27:10,350;   3;  -5; -2;
 56; 18:27:10,419;   5;  -5; -2;
 56; 18:27:10,420;  -1;   0;  0;
 56; 18:27:10,420;   0;   0;  0;; not_moved
 56; 18:27:10,420;   1;   0;  0;; not_moved
 56; 18:27:10,420;   2;   0;  0;; not_moved
 56; 18:27:10,420;   3;   0;  0;; not_moved
 56; 18:27:10,420;   4;   0;  0;; not_moved
 56; 18:27:10,420;   5;   0;  0;; not_moved
 56; 18:27:10,420;   6;   2; -3;; not_moved
 56; 18:27:10,420;   7;  -3; -5;; not_moved
 56; 18:27:10,420;   8;   3;  5;; not_moved
 56; 18:27:10,420;   9;   5;  2;; not_moved
 56; 18:27:22,139;   1;   1;  1;
 56; 18:27:22,395;   4;   1;  1;
 56; 18:27:22,488;   0;   1;  1;
 56; 18:27:22,553;   5;   1;  1;
 56; 18:27:23,137;   4;   2;  1;
 56; 18:27:23,164;   1;   2;  2;
 56; 18:27:23,552;   0;   1;  1;; not_moved
 56; 18:27:23,639;   5;   1;  1;; not_moved
 56; 18:27:23,945;   1;   2;  3;
 56; 18:27:24,021;   4;   3;  1;
 56; 18:27:24,231;   5;   2;  2;
 56; 18:27:24,841;   1;   3;  4;
 56; 18:27:25,063;   4;   3;  1;; not_moved
 56; 18:27:25,241;   5;   2;  2;; not_moved
 56; 18:27:25,671;   5;   2;  3;
 56; 18:27:25,734;   3;   1;  1;
 56; 18:27:25,752;   1;   3;  5;
 56; 18:27:26,423;   0;   2;  2;
 56; 18:27:26,737;   1;   3;  5;; not_moved
 56; 18:27:26,780;   5;   2;  3;; not_moved
 56; 18:27:26,780;   3;   1;  1;; not_moved
 56; 18:27:26,848;   5;   3;  4;
 56; 18:27:26,879;   3;   2;  2;
 56; 18:27:27,458;   0;   2;  2;; not_moved
 56; 18:27:27,516;   0;   2;  3;
 56; 18:27:27,714;   5;   3;  5;
 56; 18:27:27,764;   3;   2;  3;
 56; 18:27:28,076;   4;   3;  2;
 56; 18:27:28,423;   2;   1;  1;
 56; 18:27:28,561;   0;   2;  3;; not_moved
 56; 18:27:28,572;   3;   3;  4;
 56; 18:27:28,719;   4;   3;  3;
 56; 18:27:28,746;   5;   3;  5;; not_moved
 56; 18:27:28,956;   0;   3;  4;
 56; 18:27:29,195;   2;   2;  2;
 56; 18:27:29,429;   3;   3;  5;
 56; 18:27:29,506;   4;   3;  4;
 56; 18:27:29,893;   2;   2;  3;
 56; 18:27:29,975;   0;   3;  4;; not_moved
 56; 18:27:30,002;   0;   3;  5;
 56; 18:27:30,331;   4;   3;  5;
 56; 18:27:30,459;   2;   2;  4;
 56; 18:27:30,484;   3;   3;  5;; not_moved
 56; 18:27:31,076;   2;   3;  5;
 56; 18:27:31,077;   0;   3;  5;; not_moved
 56; 18:27:31,078;  -1;   0;  0;
 56; 18:27:31,078;   0;   0;  0;; not_moved
 56; 18:27:31,078;   1;   0;  0;; not_moved
 56; 18:27:31,078;   2;   0;  0;; not_moved
 56; 18:27:31,078;   3;   0;  0;; not_moved
 56; 18:27:31,078;   4;   0;  0;; not_moved
 56; 18:27:31,078;   5;   0;  0;; not_moved
 56; 18:27:31,078;   6;  -5; -2;; not_moved
 56; 18:27:31,078;   7;  -2;  3;; not_moved
 56; 18:27:31,078;   8;  -3; -5;; not_moved
 56; 18:27:31,078;   9;   2; -3;; not_moved
 56; 18:27:39,497;   4;  -1; -1;
 56; 18:27:40,285;   4;  -2; -2;
 56; 18:27:40,986;   4;  -3; -2;
 56; 18:27:41,804;   4;  -4; -2;
 56; 18:27:42,433;   1;  -1; -1;
 56; 18:27:42,679;   4;  -5; -2;
 56; 18:27:42,986;   0;  -1; -1;
 56; 18:27:43,141;   3;  -1; -1;
 56; 18:27:43,153;   1;  -2; -1;
 56; 18:27:43,673;   1;  -2;  0;
 56; 18:27:43,691;   4;  -5; -2;; not_moved
 56; 18:27:43,872;   0;  -2; -2;
 56; 18:27:44,201;   3;  -1; -1;; not_moved
 56; 18:27:44,209;   1;  -3; -1;
 56; 18:27:44,225;   3;  -2; -1;
 56; 18:27:44,818;   1;  -3;  0;
 56; 18:27:44,864;   5;  -1;  0;
 56; 18:27:44,891;   0;  -2; -2;; not_moved
 56; 18:27:44,991;   3;  -3; -2;
 56; 18:27:45,200;   0;  -2; -1;
 56; 18:27:45,301;   1;  -4; -1;
 56; 18:27:45,548;   5;  -2;  0;
 56; 18:27:45,802;   3;  -4; -2;
 56; 18:27:45,872;   1;  -5; -2;
 56; 18:27:46,104;   0;  -3; -1;
 56; 18:27:46,455;   5;  -3;  0;
 56; 18:27:46,777;   3;  -5; -2;
 56; 18:27:46,796;   2;  -1;  0;
 56; 18:27:46,874;   1;  -5; -2;; not_moved
 56; 18:27:46,920;   0;  -4; -2;
 56; 18:27:47,043;   5;  -4; -1;
 56; 18:27:47,572;   2;  -2; -1;
 56; 18:27:47,849;   3;  -5; -2;; not_moved
 56; 18:27:47,872;   0;  -5; -2;
 56; 18:27:48,050;   5;  -5; -2;
 56; 18:27:48,051;   2;  -3; -1;
 56; 18:27:48,677;   2;  -4; -2;
 56; 18:27:48,901;   0;  -5; -2;; not_moved
 56; 18:27:49,074;   5;  -5; -2;; not_moved
 56; 18:27:49,318;   2;  -5; -2;
 56; 18:27:49,321;  -1;   0;  0;
 56; 18:27:49,321;   0;   0;  0;; not_moved
 56; 18:27:49,321;   1;   0;  0;; not_moved
 56; 18:27:49,321;   2;   0;  0;; not_moved
 56; 18:27:49,321;   3;   0;  0;; not_moved
 56; 18:27:49,321;   4;   0;  0;; not_moved
 56; 18:27:49,321;   5;   0;  0;; not_moved
 56; 18:27:49,321;   6;  -1; -5;; not_moved
 56; 18:27:49,321;   7;  -5; -4;; not_moved
 56; 18:27:49,321;   8;  -4;  1;; not_moved
 56; 18:27:49,321;   9;   5;  4;; not_moved
 56; 18:27:56,543;   2;   1;  1;
 56; 18:27:57,293;   3;   0; -1;
 56; 18:27:57,309;   2;   2;  1;
 56; 18:27:57,803;   2;   3;  2;
 56; 18:27:58,234;   2;   4;  3;
 56; 18:27:58,321;   3;   0; -1;; not_moved
 56; 18:27:58,477;   4;  -1;  0;
 56; 18:27:58,685;   2;   5;  4;
 56; 18:27:59,511;   4;  -1;  0;; not_moved
 56; 18:27:59,728;   2;   5;  4;; not_moved
 56; 18:27:59,822;   4;  -2;  0;
 56; 18:28:00,255;   0;   1;  1;
 56; 18:28:00,484;   4;  -3;  0;
 56; 18:28:01,317;   0;   1;  1;; not_moved
 56; 18:28:01,353;   0;   2;  2;
 56; 18:28:01,514;   4;  -3;  0;; not_moved
 56; 18:28:02,201;   0;   3;  3;
 56; 18:28:02,218;   1;  -1; -1;
 56; 18:28:03,133;   0;   4;  4;
 56; 18:28:03,336;   1;  -1; -1;; not_moved
 56; 18:28:03,336;   1;  -2; -2;
 56; 18:28:04,112;   0;   5;  4;
 56; 18:28:04,148;   1;  -3; -2;
 56; 18:28:04,213;   4;  -4;  0;
 56; 18:28:04,225;   3;   1;  0;
 56; 18:28:04,835;   1;  -4; -3;
 56; 18:28:04,999;   3;   2;  1;
 56; 18:28:05,168;   0;   5;  4;; not_moved
 56; 18:28:05,188;   4;  -4;  1;
 56; 18:28:05,435;   1;  -5; -4;
 56; 18:28:05,860;   3;   3;  2;
 56; 18:28:05,912;   5;  -1;  0;
 56; 18:28:06,220;   4;  -4;  1;; not_moved
 56; 18:28:06,499;   1;  -5; -4;; not_moved
 56; 18:28:06,631;   3;   4;  3;
 56; 18:28:07,004;   5;  -1;  0;; not_moved
 56; 18:28:07,052;   5;  -2;  0;
 56; 18:28:07,461;   3;   5;  4;
 56; 18:28:07,781;   5;  -3;  0;
 56; 18:28:08,495;   5;  -4;  0;
 56; 18:28:08,556;   3;   5;  4;; not_moved
 56; 18:28:08,888;   5;  -4;  1;
 56; 18:28:08,891;  -1;   0;  0;
 56; 18:28:08,891;   0;   0;  0;; not_moved
 56; 18:28:08,891;   1;   0;  0;; not_moved
 56; 18:28:08,891;   2;   0;  0;; not_moved
 56; 18:28:08,891;   3;   0;  0;; not_moved
 56; 18:28:08,891;   4;   0;  0;; not_moved
 56; 18:28:08,891;   5;   0;  0;; not_moved
 56; 18:28:08,891;   6;   5;  4;; not_moved
 56; 18:28:08,891;   7;   4; -1;; not_moved
 56; 18:28:08,891;   8;  -5; -4;; not_moved
 56; 18:28:08,891;   9;  -1; -5;; not_moved
 56; 18:28:16,101;   2;   1;  1;
 56; 18:28:16,556;   2;   2;  1;
 56; 18:28:16,749;   4;   0; -1;
 56; 18:28:17,063;   5;  -1; -1;
 56; 18:28:17,212;   2;   3;  2;
 56; 18:28:17,594;   4;  -1; -2;
 56; 18:28:17,724;   2;   4;  3;
 56; 18:28:17,873;   5;  -2; -2;
 56; 18:28:18,180;   2;   5;  4;
 56; 18:28:18,367;   4;  -1; -3;
 56; 18:28:18,426;   5;  -3; -3;
 56; 18:28:18,990;   5;  -4; -4;
 56; 18:28:19,144;   3;  -1; -1;
 56; 18:28:19,209;   2;   5;  4;; not_moved
 56; 18:28:19,435;   4;  -1; -3;; not_moved
 56; 18:28:19,573;   5;  -5; -4;
 56; 18:28:19,724;   0;   1;  1;
 56; 18:28:20,182;   3;  -1; -1;; not_moved
 56; 18:28:20,322;   3;  -2; -2;
 56; 18:28:20,641;   5;  -5; -4;; not_moved
 56; 18:28:20,744;   0;   1;  1;; not_moved
 56; 18:28:21,067;   3;  -3; -3;
 56; 18:28:21,917;   3;  -4; -4;
 56; 18:28:21,953;   4;  -2; -3;
 56; 18:28:22,834;   1;   1;  1;
 56; 18:28:22,844;   4;  -3; -3;
 56; 18:28:22,868;   0;   2;  1;
 56; 18:28:23,028;   3;  -4; -4;; not_moved
 56; 18:28:23,040;   3;  -5; -4;
 56; 18:28:23,682;   1;   2;  2;
 56; 18:28:23,701;   0;   3;  2;
 56; 18:28:23,711;   4;  -4; -4;
 56; 18:28:24,096;   3;  -5; -4;; not_moved
 56; 18:28:24,491;   1;   3;  3;
 56; 18:28:24,493;   0;   4;  3;
 56; 18:28:24,597;   4;  -5; -4;
 56; 18:28:25,086;   1;   4;  3;
 56; 18:28:25,343;   0;   5;  4;
 56; 18:28:25,645;   4;  -5; -4;; not_moved
 56; 18:28:25,750;   1;   5;  4;
 56; 18:28:25,752;  -1;   0;  0;
 56; 18:28:25,752;   0;   0;  0;; not_moved
 56; 18:28:25,752;   1;   0;  0;; not_moved
 56; 18:28:25,752;   2;   0;  0;; not_moved
 56; 18:28:25,752;   3;   0;  0;; not_moved
 56; 18:28:25,752;   4;   0;  0;; not_moved
 56; 18:28:25,752;   5;   0;  0;; not_moved
 56; 18:28:25,752;   6;  -1; -5;; not_moved
 56; 18:28:25,752;   7;   4; -1;; not_moved
 56; 18:28:25,752;   8;   5;  4;; not_moved
 56; 18:28:25,752;   9;   1;  5;; not_moved
 56; 18:28:34,493;   0;   0;  1;
 56; 18:28:35,393;   0;   0;  2;
 56; 18:28:36,333;   0;   0;  3;
 56; 18:28:36,683;   1;   0;  1;
 56; 18:28:37,070;   2;   0;  1;
 56; 18:28:37,367;   0;   0;  3;; not_moved
 56; 18:28:37,403;   1;   0;  2;
 56; 18:28:37,648;   0;   0;  4;
 56; 18:28:37,781;   2;   0;  2;
 56; 18:28:38,020;   4;   1;  0;
 56; 18:28:38,052;   1;   0;  3;
 56; 18:28:38,316;   5;   0;  1;
 56; 18:28:38,417;   3;   0;  1;
 56; 18:28:38,501;   2;   0;  3;
 56; 18:28:38,668;   0;   0;  4;; not_moved
 56; 18:28:38,805;   1;   0;  4;
 56; 18:28:38,808;   4;   2;  0;
 56; 18:28:38,808;   0;   1;  5;
 56; 18:28:38,925;   5;   0;  2;
 56; 18:28:39,058;   3;   0;  2;
 56; 18:28:39,131;   2;   0;  4;
 56; 18:28:39,403;   5;   0;  3;
 56; 18:28:39,524;   1;   1;  5;
 56; 18:28:39,643;   2;   1;  5;
 56; 18:28:39,770;   0;   1;  5;; not_moved
 56; 18:28:39,791;   3;   0;  3;
 56; 18:28:39,862;   4;   2;  0;; not_moved
 56; 18:28:40,105;   5;   1;  4;
 56; 18:28:40,276;   4;   3;  0;
 56; 18:28:40,548;   1;   1;  5;; not_moved
 56; 18:28:40,554;   3;   0;  4;
 56; 18:28:40,651;   5;   1;  5;
 56; 18:28:40,736;   2;   1;  5;; not_moved
 56; 18:28:41,025;   4;   3; -1;
 56; 18:28:41,328;   3;   1;  5;
 56; 18:28:41,716;   5;   1;  5;; not_moved
 56; 18:28:41,813;   4;   4; -1;
 56; 18:28:41,814;  -1;   0;  0;
 56; 18:28:41,814;   0;   0;  0;; not_moved
 56; 18:28:41,814;   1;   0;  0;; not_moved
 56; 18:28:41,814;   2;   0;  0;; not_moved
 56; 18:28:41,814;   3;   0;  0;; not_moved
 56; 18:28:41,814;   4;   0;  0;; not_moved
 56; 18:28:41,814;   5;   0;  0;; not_moved
 56; 18:28:41,814;   6;   2;  5;; not_moved
 56; 18:28:41,814;   7;   5;  3;; not_moved
 56; 18:28:41,814;   8;  -2; -5;; not_moved
 56; 18:28:41,814;   9;   3; -2;; not_moved
 56; 18:28:52,924;   1;   0; -1;
 56; 18:28:53,438;   4;   1;  1;
 56; 18:28:53,628;   1;   1; -1;
 56; 18:28:54,292;   1;   2; -1;
 56; 18:28:54,483;   4;   1;  1;; not_moved
 56; 18:28:55,000;   4;   2;  1;
 56; 18:28:55,088;   1;   3; -1;
 56; 18:28:55,540;   1;   3; -2;
 56; 18:28:55,561;   0;   0; -1;
 56; 18:28:55,984;   4;   2;  1;; not_moved
 56; 18:28:56,492;   0;   1; -1;
 56; 18:28:56,570;   1;   3; -2;; not_moved
 56; 18:28:57,028;   5;   0; -1;
 56; 18:28:57,400;   0;   2; -1;
 56; 18:28:57,687;   5;   1; -1;
 56; 18:28:57,791;   3;   1;  0;
 56; 18:28:58,368;   0;   3; -1;
 56; 18:28:58,555;   3;   2;  0;
 56; 18:28:58,602;   5;   2; -1;
 56; 18:28:59,008;   2;   1;  0;
 56; 18:28:59,329;   3;   3;  0;
 56; 18:28:59,377;   0;   3; -2;
 56; 18:28:59,497;   5;   3; -1;
 56; 18:28:59,569;   2;   2;  0;
 56; 18:28:59,573;   4;   3;  1;
 56; 18:29:00,063;   3;   3; -1;
 56; 18:29:00,084;   2;   3;  0;
 56; 18:29:00,294;   5;   3; -2;
 56; 18:29:00,396;   0;   3; -2;; not_moved
 56; 18:29:00,462;   2;   3; -1;
 56; 18:29:00,594;   4;   3;  1;; not_moved
 56; 18:29:00,601;   4;   3;  0;
 56; 18:29:00,902;   2;   3; -2;
 56; 18:29:00,943;   3;   3; -2;
 56; 18:29:01,340;   5;   3; -2;; not_moved
 56; 18:29:01,404;   4;   3; -1;
 56; 18:29:01,945;   3;   3; -2;; not_moved
 56; 18:29:01,968;   2;   3; -2;; not_moved
 56; 18:29:02,092;   4;   3; -2;
 56; 18:29:02,104;  -1;   0;  0;
 56; 18:29:02,104;   0;   0;  0;; not_moved
 56; 18:29:02,104;   1;   0;  0;; not_moved
 56; 18:29:02,104;   2;   0;  0;; not_moved
 56; 18:29:02,104;   3;   0;  0;; not_moved
 56; 18:29:02,104;   4;   0;  0;; not_moved
 56; 18:29:02,104;   5;   0;  0;; not_moved
 56; 18:29:02,104;   6;  -5; -4;; not_moved
 56; 18:29:02,104;   7;  -1; -5;; not_moved
 56; 18:29:02,104;   8;   5;  4;; not_moved
 56; 18:29:02,104;   9;  -4;  1;; not_moved
 56; 18:29:09,086;   2;   1;  1;
 56; 18:29:09,708;   2;   2;  2;
 56; 18:29:10,104;   4;   1;  1;
 56; 18:29:10,170;   2;   3;  3;
 56; 18:29:10,556;   1;   1;  1;
 56; 18:29:10,791;   5;   1;  1;
 56; 18:29:10,836;   4;   2;  2;
 56; 18:29:10,941;   2;   4;  4;
 56; 18:29:11,220;   1;   2;  2;
 56; 18:29:11,389;   2;   5;  4;
 56; 18:29:11,395;   5;   2;  2;
 56; 18:29:11,423;   3;   1;  1;
 56; 18:29:11,724;   1;   3;  3;
 56; 18:29:11,810;   5;   3;  3;
 56; 18:29:11,922;   4;   2;  2;; not_moved
 56; 18:29:11,974;   3;   2;  2;
 56; 18:29:12,204;   1;   4;  4;
 56; 18:29:12,481;   2;   5;  4;; not_moved
 56; 18:29:12,620;   5;   4;  3;
 56; 18:29:12,641;   0;   1;  1;
 56; 18:29:12,708;   1;   5;  4;
 56; 18:29:12,870;   5;   5;  4;
 56; 18:29:13,061;   3;   2;  2;; not_moved
 56; 18:29:13,337;   3;   3;  3;
 56; 18:29:13,430;   0;   2;  2;
 56; 18:29:13,695;   1;   5;  4;; not_moved
 56; 18:29:13,941;   5;   5;  4;; not_moved
 56; 18:29:14,173;   3;   4;  4;
 56; 18:29:14,321;   0;   3;  3;
 56; 18:29:14,896;   3;   5;  4;
 56; 18:29:15,045;   4;   3;  3;
 56; 18:29:15,217;   0;   4;  4;
 56; 18:29:15,798;   4;   4;  4;
 56; 18:29:15,966;   3;   5;  4;; not_moved
 56; 18:29:16,180;   0;   5;  4;
 56; 18:29:16,492;   4;   5;  4;
 56; 18:29:16,495;  -1;   0;  0;
 56; 18:29:16,495;   0;   0;  0;; not_moved
 56; 18:29:16,495;   1;   0;  0;; not_moved
 56; 18:29:16,495;   2;   0;  0;; not_moved
 56; 18:29:16,495;   3;   0;  0;; not_moved
 56; 18:29:16,495;   4;   0;  0;; not_moved
 56; 18:29:16,495;   5;   0;  0;; not_moved
 56; 18:29:16,495;   6;   5;  3;; not_moved
 56; 18:29:16,495;   7;   3; -2;; not_moved
 56; 18:29:16,495;   8;  -3;  2;; not_moved
 56; 18:29:16,495;   9;   2;  5;; not_moved
 56; 18:29:23,758;   2;   1;  1;
 56; 18:29:24,171;   2;   2;  1;
 56; 18:29:24,581;   2;   3;  2;
 56; 18:29:25,077;   2;   4;  2;
 56; 18:29:25,509;   2;   5;  3;
 56; 18:29:26,371;   0;   1;  1;
 56; 18:29:26,599;   2;   5;  3;; not_moved
 56; 18:29:26,701;   1;   1;  1;
 56; 18:29:27,108;   0;   2;  1;
 56; 18:29:27,488;   1;   2;  1;
 56; 18:29:27,900;   0;   3;  2;
 56; 18:29:27,968;   1;   3;  2;
 56; 18:29:28,039;   4;   1;  1;
 56; 18:29:28,389;   1;   3;  3;
 56; 18:29:28,479;   5;   1;  1;
 56; 18:29:28,491;   3;   1;  1;
 56; 18:29:28,678;   0;   4;  3;
 56; 18:29:28,760;   4;   2;  2;
 56; 18:29:28,871;   1;   4;  3;
 56; 18:29:28,904;   5;   2;  1;
 56; 18:29:29,320;   3;   2;  1;
 56; 18:29:29,382;   5;   3;  2;
 56; 18:29:29,414;   4;   3;  2;
 56; 18:29:29,433;   1;   5;  3;
 56; 18:29:29,490;   0;   5;  3;
 56; 18:29:29,861;   5;   4;  3;
 56; 18:29:30,028;   3;   3;  2;
 56; 18:29:30,252;   4;   4;  3;
 56; 18:29:30,318;   5;   5;  3;
 56; 18:29:30,437;   1;   5;  3;; not_moved
 56; 18:29:30,535;   0;   5;  3;; not_moved
 56; 18:29:30,787;   3;   4;  3;
 56; 18:29:30,954;   4;   5;  3;
 56; 18:29:31,384;   5;   5;  3;; not_moved
 56; 18:29:31,692;   3;   5;  3;
 56; 18:29:31,694;  -1;   0;  0;
 56; 18:29:31,694;   0;   0;  0;; not_moved
 56; 18:29:31,694;   1;   0;  0;; not_moved
 56; 18:29:31,694;   2;   0;  0;; not_moved
 56; 18:29:31,694;   3;   0;  0;; not_moved
 56; 18:29:31,694;   4;   0;  0;; not_moved
 56; 18:29:31,694;   5;   0;  0;; not_moved
 56; 18:29:31,694;   6;   2; -3;; not_moved
 56; 18:29:31,694;   7;  -2;  3;; not_moved
 56; 18:29:31,694;   8;   5;  2;; not_moved
 56; 18:29:31,694;   9;  -5; -2;; not_moved
 56; 18:29:39,229;   4;   0;  1;
 56; 18:29:39,946;   4;  -1;  1;
 56; 18:29:40,981;   4;  -1;  1;; not_moved
 56; 18:29:41,327;   0;   0;  1;
 56; 18:29:41,965;   1;   0;  1;
 56; 18:29:42,349;   0;   0;  1;; not_moved
 56; 18:29:42,469;   1;  -1;  1;
 56; 18:29:42,952;   3;   0;  1;
 56; 18:29:42,971;   1;  -1;  2;
 56; 18:29:43,108;   2;   0;  1;
 56; 18:29:43,373;   4;  -2;  1;
 56; 18:29:43,440;   1;  -2;  2;
 56; 18:29:43,568;   0;  -1;  1;
 56; 18:29:43,691;   2;  -1;  1;
 56; 18:29:43,732;   3;  -1;  1;
 56; 18:29:44,088;   1;  -2;  3;
 56; 18:29:44,180;   2;  -1;  2;
 56; 18:29:44,216;   4;  -2;  2;
 56; 18:29:44,485;   3;  -1;  2;
 56; 18:29:44,654;   0;  -1;  1;; not_moved
 56; 18:29:44,749;   5;   0;  1;
 56; 18:29:44,821;   2;  -1;  3;
 56; 18:29:44,924;   0;  -1;  2;
 56; 18:29:44,992;   4;  -2;  3;
 56; 18:29:45,055;   1;  -2;  3;; not_moved
 56; 18:29:45,180;   3;  -2;  2;
 56; 18:29:45,261;   5;  -1;  1;
 56; 18:29:45,262;   2;  -2;  3;
 56; 18:29:45,796;   5;  -1;  2;
 56; 18:29:45,880;   3;  -2;  3;
 56; 18:29:45,955;   0;  -1;  2;; not_moved
 56; 18:29:46,009;   4;  -2;  3;; not_moved
 56; 18:29:46,272;   2;  -2;  3;; not_moved
 56; 18:29:46,358;   5;  -1;  3;
 56; 18:29:46,789;   5;  -2;  3;
 56; 18:29:46,922;   3;  -2;  3;; not_moved
 56; 18:29:47,832;   0;  -2;  2;
 56; 18:29:47,839;   5;  -2;  3;; not_moved
 56; 18:29:48,712;   0;  -2;  3;
 56; 18:29:48,715;  -1;   0;  0;
 56; 18:29:48,715;   0;   0;  0;; not_moved
 56; 18:29:48,715;   1;   0;  0;; not_moved
 56; 18:29:48,715;   2;   0;  0;; not_moved
 56; 18:29:48,715;   3;   0;  0;; not_moved
 56; 18:29:48,715;   4;   0;  0;; not_moved
 56; 18:29:48,715;   5;   0;  0;; not_moved
 56; 18:29:48,715;   6;   1; -4;; not_moved
 56; 18:29:48,715;   7;  -1;  4;; not_moved
 56; 18:29:48,715;   8;   5;  1;; not_moved
 56; 18:29:48,715;   9;   4;  5;; not_moved
 56; 18:29:57,014;   1;   0;  1;
 56; 18:29:57,942;   1;   0;  2;
 56; 18:29:58,894;   1;   0;  3;
 56; 18:29:58,944;   4;   0; -1;
 56; 18:29:59,289;   0;   0;  1;
 56; 18:29:59,552;   1;   0;  4;
 56; 18:29:59,808;   4;   0; -2;
 56; 18:30:00,108;   1;  -1;  4;
 56; 18:30:00,155;   0;   0;  2;
 56; 18:30:00,566;   4;   0; -3;
 56; 18:30:01,075;   1;  -1;  4;; not_moved
 56; 18:30:01,175;   0;   0;  2;; not_moved
 56; 18:30:01,376;   0;   0;  3;
 56; 18:30:01,538;   4;   1; -3;
 56; 18:30:01,645;   5;   0;  1;
 56; 18:30:02,167;   0;   0;  4;
 56; 18:30:02,344;   5;   0;  2;
 56; 18:30:02,403;   4;   1; -4;
 56; 18:30:02,866;   5;   0;  3;
 56; 18:30:03,061;   3;   0;  1;
 56; 18:30:03,178;   0;   0;  4;; not_moved
 56; 18:30:03,316;   0;  -1;  4;
 56; 18:30:03,430;   5;   0;  4;
 56; 18:30:03,452;   4;   1; -4;; not_moved
 56; 18:30:03,741;   3;   0;  2;
 56; 18:30:03,946;   5;  -1;  4;
 56; 18:30:04,279;   0;  -1;  4;; not_moved
 56; 18:30:04,440;   3;   0;  3;
 56; 18:30:05,000;   5;  -1;  4;; not_moved
 56; 18:30:05,108;   3;   0;  4;
 56; 18:30:05,834;   3;  -1;  4;
 56; 18:30:06,848;   3;  -1;  4;; not_moved
 56; 18:30:10,079;   2;   0;  1;
 56; 18:30:10,741;   2;   0;  2;
 56; 18:30:11,277;   2;   0;  3;
 56; 18:30:11,812;   2;   0;  4;
 56; 18:30:12,873;   2;   0;  4;; not_moved
 56; 18:30:13,952;   2;  -1;  4;
 56; 18:30:13,954;  -1;   0;  0;
 56; 18:30:13,954;   0;   0;  0;; not_moved
 56; 18:30:13,954;   1;   0;  0;; not_moved
 56; 18:30:13,954;   2;   0;  0;; not_moved
 56; 18:30:13,954;   3;   0;  0;; not_moved
 56; 18:30:13,954;   4;   0;  0;; not_moved
 56; 18:30:13,954;   5;   0;  0;; not_moved
 56; 18:30:13,954;   6;   3; -2;; not_moved
 56; 18:30:13,954;   7;  -2; -5;; not_moved
 56; 18:30:13,954;   8;  -5; -3;; not_moved
 56; 18:30:13,954;   9;   5;  3;; not_moved
 56; 18:30:21,191;   2;  -1; -1;
 56; 18:30:21,716;   2;  -2; -1;
 56; 18:30:22,274;   2;  -3; -2;
 56; 18:30:22,620;   2;  -4; -2;
 56; 18:30:22,978;   2;  -5; -3;
 56; 18:30:23,101;   4;  -1; -1;
 56; 18:30:23,242;   1;  -1; -1;
 56; 18:30:23,299;   0;  -1; -1;
 56; 18:30:23,944;   4;  -2; -1;
 56; 18:30:23,995;   2;  -5; -3;; not_moved
 56; 18:30:24,071;   1;  -2; -1;
 56; 18:30:24,220;   0;  -2; -1;
 56; 18:30:24,492;   3;  -1; -1;
 56; 18:30:24,622;   4;  -3; -2;
 56; 18:30:24,703;   1;  -3; -2;
 56; 18:30:24,791;   5;  -1; -1;
 56; 18:30:25,023;   0;  -3; -2;
 56; 18:30:25,108;   3;  -2; -1;
 56; 18:30:25,218;   5;  -2; -1;
 56; 18:30:25,244;   1;  -4; -2;
 56; 18:30:25,413;   4;  -4; -3;
 56; 18:30:25,737;   5;  -3; -2;
 56; 18:30:25,859;   0;  -4; -2;
 56; 18:30:25,869;   3;  -3; -2;
 56; 18:30:25,905;   1;  -5; -3;
 56; 18:30:26,153;   4;  -5; -3;
 56; 18:30:26,508;   5;  -4; -3;
 56; 18:30:26,668;   3;  -4; -2;
 56; 18:30:26,734;   0;  -5; -3;
 56; 18:30:26,906;   1;  -5; -3;; not_moved
 56; 18:30:26,962;   5;  -5; -3;
 56; 18:30:27,186;   4;  -5; -3;; not_moved
 56; 18:30:27,255;   3;  -5; -3;
 56; 18:30:27,256;  -1;   0;  0;
 56; 18:30:27,256;   0;   0;  0;; not_moved
 56; 18:30:27,256;   1;   0;  0;; not_moved
 56; 18:30:27,256;   2;   0;  0;; not_moved
 56; 18:30:27,256;   3;   0;  0;; not_moved
 56; 18:30:27,256;   4;   0;  0;; not_moved
 56; 18:30:27,256;   5;   0;  0;; not_moved
 56; 18:30:27,256;   6;   3; -2;; not_moved
 56; 18:30:27,256;   7;  -3;  2;; not_moved
 56; 18:30:27,256;   8;   5;  3;; not_moved
 56; 18:30:27,256;   9;  -2; -5;; not_moved
 56; 18:30:34,397;   2;   0; -1;
 56; 18:30:34,869;   1;   0; -1;
 56; 18:30:34,912;   2;   1; -1;
 56; 18:30:35,313;   2;   2; -1;
 56; 18:30:35,336;   1;   0; -2;
 56; 18:30:35,711;   2;   3; -1;
 56; 18:30:35,886;   1;   0; -3;
 56; 18:30:36,092;   2;   3; -2;
 56; 18:30:36,514;   0;   0; -1;
 56; 18:30:36,636;   1;  -1; -4;
 56; 18:30:37,114;   2;   3; -2;; not_moved
 56; 18:30:37,364;   0;   1; -1;
 56; 18:30:37,592;   1;  -2; -5;
 56; 18:30:37,937;   3;   0; -1;
 56; 18:30:38,170;   0;   2; -1;
 56; 18:30:38,622;   1;  -2; -5;; not_moved
 56; 18:30:38,992;   3;   0; -1;; not_moved
 56; 18:30:39,073;   0;   3; -1;
 56; 18:30:39,490;   5;   1;  0;
 56; 18:30:39,941;   0;   3; -2;
 56; 18:30:40,120;   5;   1; -1;
 56; 18:30:40,272;   3;   0; -2;
 56; 18:30:40,591;   5;   2; -1;
 56; 18:30:40,947;   0;   3; -2;; not_moved
 56; 18:30:40,953;   5;   3; -1;
 56; 18:30:41,165;   3;   1; -2;
 56; 18:30:41,350;   5;   3; -2;
 56; 18:30:41,978;   3;   2; -2;
 56; 18:30:42,372;   4;   0; -1;
 56; 18:30:42,422;   5;   3; -2;; not_moved
 56; 18:30:42,835;   3;   3; -2;
 56; 18:30:43,163;   4;   0; -2;
 56; 18:30:43,899;   3;   3; -2;; not_moved
 56; 18:30:44,094;   4;   1; -2;
 56; 18:30:44,746;   4;   2; -2;
 56; 18:30:45,819;   4;   2; -2;; not_moved
 56; 18:30:46,218;   4;   3; -2;
 56; 18:30:46,220;  -1;   0;  0;
 56; 18:30:46,220;   0;   0;  0;; not_moved
 56; 18:30:46,220;   1;   0;  0;; not_moved
 56; 18:30:46,220;   2;   0;  0;; not_moved
 56; 18:30:46,220;   3;   0;  0;; not_moved
 56; 18:30:46,220;   4;   0;  0;; not_moved
 56; 18:30:46,220;   5;   0;  0;; not_moved
 56; 18:30:46,220;   6;   4; -1;; not_moved
 56; 18:30:46,220;   7;   5;  4;; not_moved
 56; 18:30:46,220;   8;  -5; -4;; not_moved
 56; 18:30:46,220;   9;  -4;  1;; not_moved
 56; 18:30:53,356;   2;   1;  0;
 56; 18:30:53,765;   2;   2;  1;
 56; 18:30:54,149;   2;   3;  2;
 56; 18:30:54,606;   2;   4;  3;
 56; 18:30:54,944;   0;   1;  0;
 56; 18:30:54,981;   2;   5;  4;
 56; 18:30:55,133;   1;   1;  0;
 56; 18:30:55,721;   0;   2;  1;
 56; 18:30:55,728;   1;   2;  1;
 56; 18:30:56,049;   2;   5;  4;; not_moved
 56; 18:30:56,161;   1;   3;  2;
 56; 18:30:56,539;   0;   3;  2;
 56; 18:30:56,652;   1;   4;  3;
 56; 18:30:56,705;   3;   1;  0;
 56; 18:30:57,122;   1;   5;  4;
 56; 18:30:57,311;   3;   2;  1;
 56; 18:30:57,504;   0;   4;  3;
 56; 18:30:57,522;   5;   1;  1;
 56; 18:30:57,991;   4;   1;  0;
 56; 18:30:58,065;   3;   3;  2;
 56; 18:30:58,144;   1;   5;  4;; not_moved
 56; 18:30:58,148;   5;   2;  2;
 56; 18:30:58,496;   0;   4;  3;; not_moved
 56; 18:30:58,496;   0;   5;  4;
 56; 18:30:58,610;   5;   3;  3;
 56; 18:30:58,715;   4;   2;  1;
 56; 18:30:58,850;   3;   4;  3;
 56; 18:30:59,038;   5;   4;  4;
 56; 18:30:59,341;   5;   5;  4;
 56; 18:30:59,411;   4;   3;  2;
 56; 18:30:59,497;   0;   5;  4;; not_moved
 56; 18:30:59,511;   3;   5;  4;
 56; 18:31:00,095;   4;   4;  3;
 56; 18:31:00,400;   5;   5;  4;; not_moved
 56; 18:31:00,525;   3;   5;  4;; not_moved
 56; 18:31:00,820;   4;   5;  4;
 56; 18:31:00,822;  -1;   0;  0;
 56; 18:31:00,822;   0;   0;  0;; not_moved
 56; 18:31:00,822;   1;   0;  0;; not_moved
 56; 18:31:00,822;   2;   0;  0;; not_moved
 56; 18:31:00,822;   3;   0;  0;; not_moved
 56; 18:31:00,822;   4;   0;  0;; not_moved
 56; 18:31:00,822;   5;   0;  0;; not_moved
 56; 18:31:00,822;   6;  -3; -5;; not_moved
 56; 18:31:00,822;   7;   5;  2;; not_moved
 56; 18:31:00,822;   8;   3;  5;; not_moved
 56; 18:31:00,822;   9;   2; -3;; not_moved
 56; 18:31:09,096;   4;   0; -1;
 56; 18:31:10,154;   4;   0; -1;; not_moved
 56; 18:31:10,226;   4;   1; -1;
 56; 18:31:10,236;   1;   0; -1;
 56; 18:31:10,746;   1;   0; -2;
 56; 18:31:11,125;   4;   1; -2;
 56; 18:31:11,319;   0;   0; -1;
 56; 18:31:11,651;   3;   0; -1;
 56; 18:31:11,713;   1;   1; -2;
 56; 18:31:12,156;   4;   1; -2;; not_moved
 56; 18:31:12,166;   4;   1; -3;
 56; 18:31:12,271;   3;   1; -1;
 56; 18:31:12,274;   1;   1; -3;
 56; 18:31:12,413;   0;   0; -1;; not_moved
 56; 18:31:12,432;   5;   0; -1;
 56; 18:31:12,836;   0;   0; -2;
 56; 18:31:12,857;   1;   2; -3;
 56; 18:31:12,979;   3;   1; -2;
 56; 18:31:13,120;   5;   0; -2;
 56; 18:31:13,132;   4;   2; -3;
 56; 18:31:13,509;   5;   1; -2;
 56; 18:31:13,558;   3;   1; -3;
 56; 18:31:13,752;   0;   1; -2;
 56; 18:31:13,901;   5;   2; -2;
 56; 18:31:13,904;   1;   2; -3;; not_moved
 56; 18:31:14,147;   3;   2; -2;
 56; 18:31:14,158;   4;   2; -3;; not_moved
 56; 18:31:14,192;   5;   2; -3;
 56; 18:31:14,414;   2;   0; -1;
 56; 18:31:14,774;   0;   1; -3;
 56; 18:31:14,864;   3;   2; -3;
 56; 18:31:14,894;   2;   0; -2;
 56; 18:31:15,270;   5;   2; -3;; not_moved
 56; 18:31:15,390;   2;   1; -2;
 56; 18:31:15,701;   0;   2; -3;
 56; 18:31:15,844;   3;   2; -3;; not_moved
 56; 18:31:15,885;   2;   2; -2;
 56; 18:31:16,325;   2;   2; -3;
 56; 18:31:16,326;  -1;   0;  0;
 56; 18:31:16,326;   0;   0;  0;; not_moved
 56; 18:31:16,326;   1;   0;  0;; not_moved
 56; 18:31:16,326;   2;   0;  0;; not_moved
 56; 18:31:16,326;   3;   0;  0;; not_moved
 56; 18:31:16,326;   4;   0;  0;; not_moved
 56; 18:31:16,326;   5;   0;  0;; not_moved
 56; 18:31:16,326;   6;  -1; -5;; not_moved
 56; 18:31:16,326;   7;   1;  5;; not_moved
 56; 18:31:16,326;   8;  -5; -4;; not_moved
 56; 18:31:16,326;   9;  -4;  1;; not_moved
 56; 18:31:26,409;   1;  -1;  0;
 56; 18:31:27,020;   1;  -2;  0;
 56; 18:31:27,737;   1;  -3;  0;
 56; 18:31:27,892;   4;   0;  1;
 56; 18:31:27,965;   0;  -1;  0;
 56; 18:31:28,332;   1;  -3;  1;
 56; 18:31:28,709;   4;   0;  2;
 56; 18:31:28,819;   1;  -4;  1;
 56; 18:31:28,873;   0;  -2;  0;
 56; 18:31:29,021;   3;  -1;  0;
 56; 18:31:29,731;   0;  -3;  0;
 56; 18:31:29,777;   4;   0;  2;; not_moved
 56; 18:31:29,882;   1;  -4;  1;; not_moved
 56; 18:31:29,938;   3;  -2;  0;
 56; 18:31:30,048;   4;   0;  3;
 56; 18:31:30,550;   0;  -3;  1;
 56; 18:31:30,792;   3;  -3;  0;
 56; 18:31:30,860;   5;  -1;  0;
 56; 18:31:31,078;   4;   0;  3;; not_moved
 56; 18:31:31,437;   5;  -1;  1;
 56; 18:31:31,465;   0;  -4;  1;
 56; 18:31:31,476;   3;  -4;  0;
 56; 18:31:31,989;   2;  -1;  0;
 56; 18:31:32,228;   3;  -4;  1;
 56; 18:31:32,288;   5;  -2;  1;
 56; 18:31:32,495;   2;  -2;  0;
 56; 18:31:32,537;   0;  -4;  1;; not_moved
 56; 18:31:33,012;   5;  -3;  1;
 56; 18:31:33,029;   2;  -3;  0;
 56; 18:31:33,270;   3;  -4;  1;; not_moved
 56; 18:31:33,541;   2;  -3;  1;
 56; 18:31:33,553;   4;   0;  4;
 56; 18:31:33,932;   5;  -4;  1;
 56; 18:31:34,093;   2;  -4;  1;
 56; 18:31:34,343;   4;   1;  5;
 56; 18:31:34,346;  -1;   0;  0;
 56; 18:31:34,346;   0;   0;  0;; not_moved
 56; 18:31:34,346;   1;   0;  0;; not_moved
 56; 18:31:34,346;   2;   0;  0;; not_moved
 56; 18:31:34,346;   3;   0;  0;; not_moved
 56; 18:31:34,346;   4;   0;  0;; not_moved
 56; 18:31:34,346;   5;   0;  0;; not_moved
 56; 18:31:34,346;   6;   5;  1;; not_moved
 56; 18:31:34,346;   7;  -1;  4;; not_moved
 56; 18:31:34,346;   8;   4;  5;; not_moved
 56; 18:31:34,346;   9;  -4; -5;; not_moved
 56; 18:31:41,301;   2;  -1; -1;
 56; 18:31:41,725;   2;  -2; -2;
 56; 18:31:42,117;   2;  -3; -3;
 56; 18:31:42,509;   2;  -4; -4;
 56; 18:31:42,861;   2;  -4; -5;
 56; 18:31:43,027;   0;  -1; -1;
 56; 18:31:43,816;   0;  -2; -2;
 56; 18:31:43,943;   2;  -4; -5;; not_moved
 56; 18:31:44,478;   3;  -1; -1;
 56; 18:31:44,657;   4;  -1; -1;
 56; 18:31:44,839;   5;  -1; -1;
 56; 18:31:44,854;   0;  -2; -2;; not_moved
 56; 18:31:45,148;   0;  -3; -3;
 56; 18:31:45,256;   3;  -2; -2;
 56; 18:31:45,437;   5;  -2; -2;
 56; 18:31:45,701;   4;  -1; -1;; not_moved
 56; 18:31:45,943;   5;  -3; -3;
 56; 18:31:46,002;   1;  -1; -1;
 56; 18:31:46,010;   4;  -2; -2;
 56; 18:31:46,078;   3;  -3; -3;
 56; 18:31:46,155;   0;  -3; -3;; not_moved
 56; 18:31:46,531;   5;  -4; -4;
 56; 18:31:46,672;   3;  -4; -4;
 56; 18:31:46,707;   1;  -2; -2;
 56; 18:31:46,839;   0;  -4; -4;
 56; 18:31:46,856;   4;  -2; -3;
 56; 18:31:46,959;   5;  -4; -5;
 56; 18:31:47,252;   1;  -3; -3;
 56; 18:31:47,359;   3;  -4; -5;
 56; 18:31:47,624;   4;  -2; -4;
 56; 18:31:47,727;   1;  -4; -4;
 56; 18:31:47,857;   0;  -4; -4;; not_moved
 56; 18:31:47,956;   0;  -4; -5;
 56; 18:31:48,049;   5;  -4; -5;; not_moved
 56; 18:31:48,337;   1;  -4; -5;
 56; 18:31:48,393;   3;  -4; -5;; not_moved
 56; 18:31:48,420;   4;  -3; -5;
 56; 18:31:48,958;   0;  -4; -5;; not_moved
 56; 18:31:49,065;   4;  -3; -4;
 56; 18:31:49,406;   1;  -4; -5;; not_moved
 56; 18:31:49,873;   4;  -4; -5;
