gnr; time; pid; s1; s2
  1; 21:36:19,609;  -1;   0;  0;
  1; 21:36:21,781;   2;   0; -1;
  1; 21:36:22,218;   6;   1;  0;
  1; 21:36:22,656;   7;   1;  0;
  1; 21:36:23,750;   2;   1; -1;
  1; 21:36:23,937;   1;   0; -1;
  1; 21:36:24,406;   5;  -1;  0;
  1; 21:36:24,953;   0;   0; -1;
  1; 21:36:25,609;   2;   2;  0;
  1; 21:36:25,937;   3;   1;  0;
  1; 21:36:26,093;   6;   1;  0;; not_moved
  1; 21:36:26,593;   9;  -1; -1;
  1; 21:36:26,593;   7;   1;  0;; not_moved
  1; 21:36:27,468;   2;   3;  1;
  1; 21:36:28,015;   7;   0; -1;
  1; 21:36:28,015;   1;   0; -1;; not_moved
  1; 21:36:28,453;   5;  -1;  0;; not_moved
  1; 21:36:29,000;   6;   2;  1;
  1; 21:36:29,000;   0;   0; -1;; not_moved
  1; 21:36:29,000;   5;  -2; -1;
  1; 21:36:29,328;   8;  -1;  0;
  1; 21:36:29,328;   2;   4;  2;
  1; 21:36:30,093;   3;   1;  0;; not_moved
  1; 21:36:30,093;   4;   1;  1;
  1; 21:36:30,640;   9;  -1; -1;; not_moved
  1; 21:36:31,187;   2;   5;  3;
  1; 21:36:31,734;   0;   1;  0;
  1; 21:36:31,906;   7;   0; -1;; not_moved
  1; 21:36:33,046;   6;   2;  1;; not_moved
  1; 21:36:33,046;   5;  -2; -1;; not_moved
  1; 21:36:33,046;   2;   5;  4;
  1; 21:36:33,375;   8;  -1;  0;; not_moved
  1; 21:36:33,921;   7;   1; -1;
  1; 21:36:34,250;   4;   1;  1;; not_moved
  1; 21:36:35,234;   2;   5;  5;
  1; 21:36:35,234;   5;  -2; -2;
  1; 21:36:35,781;   0;   1;  0;; not_moved
  1; 21:36:36,218;   6;   3;  1;
  1; 21:36:36,250;   7;   1; -2;
  1; 21:36:36,250;   0;   2;  1;
  1; 21:36:36,546;   9;  -2; -2;
  1; 21:36:36,718;   1;  -1; -2;
  1; 21:36:37,093;   4;   2;  2;
  1; 21:36:38,406;   2;   4;  4;
  1; 21:36:38,406;   7;   0; -2;
  1; 21:36:38,843;   3;   0; -1;
  1; 21:36:39,390;   5;  -2; -2;; not_moved
  1; 21:36:40,156;   0;   1;  1;
  1; 21:36:40,156;   6;   3;  1;; not_moved
  1; 21:36:40,156;   2;   4;  5;
  1; 21:36:40,484;   7;  -1; -3;
  1; 21:36:40,484;   8;  -1;  1;
  1; 21:36:40,484;   9;  -2; -2;; not_moved
  1; 21:36:40,921;   1;  -1; -2;; not_moved
  1; 21:36:40,921;   5;  -3; -3;
  1; 21:36:41,015;   4;   2;  2;; not_moved
  1; 21:36:42,125;   4;   3;  3;
  1; 21:36:42,562;   7;  -2; -4;
  1; 21:36:42,703;   3;   0; -1;; not_moved
  1; 21:36:43,437;   2;   3;  4;
  1; 21:36:43,437;   6;   4;  2;
  1; 21:36:44,203;   0;   1;  1;; not_moved
  1; 21:36:44,640;   7;  -3; -5;
  1; 21:36:44,640;   8;  -1;  1;; not_moved
  1; 21:36:45,078;   5;  -3; -3;; not_moved
  1; 21:36:45,734;   8;  -2;  1;
  1; 21:36:45,734;   2;   2;  4;
  1; 21:36:46,171;   0;   0;  1;
  1; 21:36:46,171;   9;  -1; -2;
  1; 21:36:46,171;   4;   3;  3;; not_moved
  1; 21:36:46,609;   4;   4;  4;
  1; 21:36:46,750;   5;  -3; -4;
  1; 21:36:46,937;   7;  -2; -5;
  1; 21:36:47,593;   6;   4;  2;; not_moved
  1; 21:36:47,593;   2;   1;  4;
  1; 21:36:48,140;   3;   1; -1;
  1; 21:36:48,578;   0;   0;  0;
  1; 21:36:48,578;   1;  -2; -2;
  1; 21:36:48,578;   4;   5;  5;
  1; 21:36:49,453;   7;  -1; -5;
  1; 21:36:49,453;   8;  -3;  1;
  1; 21:36:50,000;   5;  -2; -4;
  1; 21:36:50,000;   2;   0;  4;
  1; 21:36:50,156;   9;  -1; -2;; not_moved
  1; 21:36:50,984;   6;   5;  2;
  1; 21:36:51,031;   0;  -1;  0;
  1; 21:36:51,421;   7;   0; -5;
  1; 21:36:51,859;   4;   4;  5;
  1; 21:36:51,875;   2;  -1;  3;
  1; 21:36:52,015;   3;   1; -1;; not_moved
  1; 21:36:52,734;   1;  -2; -2;; not_moved
  1; 21:36:52,734;   8;  -4;  1;
  1; 21:36:53,390;   0;  -1; -1;
  1; 21:36:53,390;   5;  -1; -4;
  1; 21:36:53,468;   7;   0; -4;
  1; 21:36:53,937;   2;  -2;  3;
  1; 21:36:54,375;   3;   2; -1;
  1; 21:36:55,031;   6;   5;  2;; not_moved
  1; 21:36:55,687;   7;   0; -3;
  1; 21:36:55,687;   0;   0; -1;
  1; 21:36:55,687;   2;  -3;  3;
  1; 21:36:55,906;   4;   4;  5;; not_moved
  1; 21:36:56,453;   4;   3;  4;
  1; 21:36:56,890;   8;  -4;  1;; not_moved
  1; 21:36:56,890;   9;   0; -2;
  1; 21:36:56,984;   5;  -1; -5;
  1; 21:36:57,218;   8;  -3;  2;
  1; 21:36:57,765;   6;   6;  3;
  1; 21:36:57,843;   2;  -3;  2;
  1; 21:36:57,921;   7;  -1; -4;
  1; 21:36:58,312;   3;   2; -1;; not_moved
  1; 21:36:58,312;   0;   0;  0;
  1; 21:36:59,625;   8;  -3;  3;
  1; 21:36:59,625;   4;   2;  4;
  1; 21:37:00,062;   7;  -2; -4;
  1; 21:37:00,062;   1;  -2; -1;
  1; 21:37:00,062;   5;   0; -5;
  1; 21:37:00,078;   2;  -3;  1;
  1; 21:37:00,171;   3;   3; -1;
  1; 21:37:00,937;   9;   0; -2;; not_moved
  1; 21:37:00,937;   0;   1;  0;
  1; 21:37:01,812;   2;  -4;  1;
  1; 21:37:01,812;   6;   6;  3;; not_moved
  1; 21:37:02,250;   7;  -2; -3;
  1; 21:37:02,578;   8;  -2;  3;
  1; 21:37:02,609;   5;   1; -4;
  1; 21:37:02,906;   4;   1;  3;
  1; 21:37:03,781;   2;  -5;  0;
  1; 21:37:03,781;   0;   0; -1;
  1; 21:37:03,921;   7;  -3; -3;
  1; 21:37:04,328;   3;   3; -1;; not_moved
  1; 21:37:04,328;   1;  -2; -1;; not_moved
  1; 21:37:05,312;   9;   1; -2;
  1; 21:37:05,312;   6;   5;  3;
  1; 21:37:05,750;   8;  -1;  4;
  1; 21:37:05,921;   7;  -4; -4;
  1; 21:37:06,515;   2;  -5; -1;
  1; 21:37:06,703;   5;   1; -4;; not_moved
  1; 21:37:06,765;   5;   2; -3;
  1; 21:37:06,828;   4;   1;  3;; not_moved
  1; 21:37:07,062;   3;   4; -1;
  1; 21:37:07,078;   4;   0;  3;
  1; 21:37:07,828;   0;   0; -1;; not_moved
  1; 21:37:07,890;   2;  -4; -1;
  1; 21:37:08,484;   8;   0;  5;
  1; 21:37:09,359;   9;   1; -3;
  1; 21:37:09,359;   6;   5;  3;; not_moved
  1; 21:37:09,359;   0;  -1; -1;
  1; 21:37:10,125;   7;  -4; -4;; not_moved
  1; 21:37:10,125;   7;  -5; -5;
  1; 21:37:10,890;   4;  -1;  2;
  1; 21:37:10,890;   5;   2; -3;; not_moved
  1; 21:37:10,937;   3;   4; -1;; not_moved
  1; 21:37:11,218;   1;  -2;  0;
  1; 21:37:12,093;   2;  -4; -1;; not_moved
  1; 21:37:12,093;   5;   3; -2;
  1; 21:37:12,203;   0;  -1;  0;
  1; 21:37:12,531;   7;  -5; -4;
  1; 21:37:12,531;   8;   0;  5;; not_moved
  1; 21:37:12,531;   6;   4;  2;
  1; 21:37:12,531;   4;  -1;  1;
  1; 21:37:12,968;   3;   3; -2;
  1; 21:37:13,406;   9;   1; -3;; not_moved
  1; 21:37:13,406;   8;   1;  5;
  1; 21:37:14,500;   7;  -5; -3;
  1; 21:37:14,656;   0;   0;  1;
  1; 21:37:14,937;   2;  -3; -1;
  1; 21:37:15,078;   1;  -2;  0;; not_moved
  1; 21:37:15,593;   5;   3; -1;
  1; 21:37:16,140;   7;  -6; -3;
  1; 21:37:16,140;   4;  -1;  0;
  1; 21:37:16,687;   6;   4;  2;; not_moved
  1; 21:37:16,781;   3;   3; -2;; not_moved
  1; 21:37:17,343;   2;  -2;  0;
  1; 21:37:17,343;   0;   1;  1;
  1; 21:37:17,375;   8;   2;  5;
  1; 21:37:18,109;   5;   3;  0;
  1; 21:37:18,218;   7;  -5; -2;
  1; 21:37:18,875;   4;  -2; -1;
  1; 21:37:19,312;   9;   1; -4;
  1; 21:37:19,343;   3;   3; -3;
  1; 21:37:19,375;   2;  -2; -1;
  1; 21:37:20,078;   0;   1;  0;
  1; 21:37:20,078;   6;   3;  2;
  1; 21:37:20,078;   5;   3;  1;
  1; 21:37:20,625;   7;  -4; -1;
  1; 21:37:21,171;   4;  -3; -2;
  1; 21:37:21,609;   2;  -1;  0;
  1; 21:37:21,609;   8;   2;  5;; not_moved
  1; 21:37:22,046;   5;   4;  2;
  1; 21:37:22,046;   7;  -5; -1;
  1; 21:37:22,046;   8;   3;  6;
  1; 21:37:22,265;   0;   1; -1;
  1; 21:37:22,328;   9;   0; -5;
  1; 21:37:23,578;   2;  -1; -1;
  1; 21:37:23,578;   3;   3; -3;; not_moved
  1; 21:37:23,578;   4;  -4; -3;
  1; 21:37:24,125;   1;  -2;  1;
  1; 21:37:24,125;   6;   3;  2;; not_moved
  1; 21:37:24,125;   5;   4;  3;
  1; 21:37:24,562;   0;   0; -1;
  1; 21:37:25,109;   8;   3;  5;
  1; 21:37:25,109;   4;  -5; -4;
  1; 21:37:25,656;   2;  -1; -2;
  1; 21:37:25,781;   9;  -1; -5;
  1; 21:37:26,203;   7;  -5; -1;; not_moved
  1; 21:37:26,203;   7;  -4;  0;
  1; 21:37:26,968;   5;   3;  3;
  1; 21:37:27,125;   0;  -1; -2;
  1; 21:37:27,843;   8;   4;  5;
  1; 21:37:28,015;   1;  -2;  1;; not_moved
  1; 21:37:28,390;   7;  -5;  0;
  1; 21:37:28,390;   2;  -1; -3;
  1; 21:37:28,390;   6;   2;  1;
  1; 21:37:29,265;   4;  -5; -4;; not_moved
  1; 21:37:29,703;   3;   2; -3;
  1; 21:37:29,703;   5;   3;  4;
  1; 21:37:29,812;   0;  -1; -1;
  1; 21:37:30,031;   9;  -1; -5;; not_moved
  1; 21:37:30,031;   8;   5;  5;
  1; 21:37:31,234;   7;  -4;  1;
  1; 21:37:31,234;   9;   0; -4;
  1; 21:37:32,000;   2;  -2; -4;
  1; 21:37:32,328;   8;   5;  4;
  1; 21:37:32,390;   5;   2;  4;
  1; 21:37:32,437;   6;   2;  1;; not_moved
  1; 21:37:32,765;   0;  -2; -2;
  1; 21:37:32,812;   1;  -1;  2;
  1; 21:37:33,093;   7;  -3;  1;
  1; 21:37:33,640;   3;   2; -3;; not_moved
  1; 21:37:34,187;   2;  -2; -3;
  1; 21:37:35,281;   8;   5;  3;
  1; 21:37:35,281;   9;   0; -4;; not_moved
  1; 21:37:35,421;   0;  -2; -1;
  1; 21:37:35,468;   4;  -5; -3;
  1; 21:37:35,828;   5;   1;  4;
  1; 21:37:35,828;   7;  -3;  2;
  1; 21:37:36,812;   2;  -3; -3;
  1; 21:37:36,859;   1;  -1;  2;; not_moved
  1; 21:37:37,796;   7;  -3;  3;
  1; 21:37:37,796;   0;  -1; -1;
  1; 21:37:37,937;   5;   0;  3;
  1; 21:37:38,343;   3;   1; -4;
  1; 21:37:38,343;   8;   6;  3;
  1; 21:37:38,781;   4;  -6; -3;
  1; 21:37:39,765;   7;  -2;  3;
  1; 21:37:39,765;   1;  -1;  3;
  1; 21:37:40,312;   0;  -1;  0;
  1; 21:37:40,859;   2;  -3; -3;; not_moved
  1; 21:37:40,906;   8;   5;  2;
  1; 21:37:41,515;   5;  -1;  3;
  1; 21:37:41,546;   2;  -4; -3;
  1; 21:37:42,390;   3;   1; -4;; not_moved
  1; 21:37:42,828;   4;  -6; -3;; not_moved
  1; 21:37:43,484;   6;   1;  1;
  1; 21:37:43,484;   8;   5;  1;
  1; 21:37:43,484;   0;   0;  1;
  1; 21:37:43,484;   7;  -2;  2;
  1; 21:37:43,531;   5;  -2;  2;
  1; 21:37:43,921;   1;  -1;  3;; not_moved
  1; 21:37:44,578;   4;  -5; -2;
  1; 21:37:44,593;   3;   0; -4;
  1; 21:37:44,640;   2;  -4; -2;
  1; 21:37:45,015;   7;  -1;  3;
  1; 21:37:45,671;   8;   5;  0;
  1; 21:37:46,218;   0;   1;  2;
  1; 21:37:46,421;   1;  -1;  4;
  1; 21:37:47,093;   2;  -3; -1;
  1; 21:37:47,640;   6;   1;  1;; not_moved
  1; 21:37:47,640;   5;  -2;  2;; not_moved
  1; 21:37:48,078;   5;  -3;  1;
  1; 21:37:48,078;   8;   4; -1;
  1; 21:37:48,625;   4;  -5; -2;; not_moved
  1; 21:37:48,671;   3;   0; -4;; not_moved
  1; 21:37:48,718;   9;  -1; -5;
  1; 21:37:49,062;   2;  -2;  0;
  1; 21:37:49,062;   0;   1;  1;
  1; 21:37:49,062;   7;  -1;  3;; not_moved
  1; 21:37:49,062;   7;  -1;  4;
  1; 21:37:50,375;   5;  -3;  2;
  1; 21:37:50,468;   1;  -1;  4;; not_moved
  1; 21:37:50,812;   8;   3; -2;
  1; 21:37:50,812;   2;  -1;  0;
  1; 21:37:51,468;   7;   0;  4;
  1; 21:37:51,468;   0;   2;  1;
  1; 21:37:51,484;   6;   0;  0;
  1; 21:37:52,125;   9;   0; -4;
  1; 21:37:52,890;   5;  -2;  3;
  1; 21:37:52,890;   4;  -4; -1;
  1; 21:37:52,890;   8;   3; -3;
  1; 21:37:52,890;   2;   0;  0;
  1; 21:37:52,890;   7;   0;  5;
  1; 21:37:53,765;   1;   0;  5;
  2; 21:39:02,234;  -1;   0;  0;
  2; 21:39:03,875;   2;   0; -1;
  2; 21:39:04,640;   4;  -1;  0;
  2; 21:39:04,671;   8;   1;  0;
  2; 21:39:05,843;   6;   1;  0;
  2; 21:39:05,843;   7;   1;  1;
  2; 21:39:06,062;   2;   0; -2;
  2; 21:39:06,062;   3;  -1; -1;
  2; 21:39:06,078;   9;   1;  1;
  2; 21:39:06,609;   5;  -1; -1;
  2; 21:39:06,671;   1;   0;  1;
  2; 21:39:07,375;   8;   1; -1;
  2; 21:39:07,921;   4;  -2;  0;
  2; 21:39:07,921;   2;   0; -3;
  2; 21:39:08,000;   5;  -2; -2;
  2; 21:39:08,250;   0;   0; -1;
  2; 21:39:09,125;   6;   2;  1;
  2; 21:39:09,312;   7;   2;  2;
  2; 21:39:09,437;   1;   1;  2;
  2; 21:39:10,000;   2;   0; -4;
  2; 21:39:10,000;   8;   1; -2;
  2; 21:39:10,015;   3;  -1; -2;
  2; 21:39:10,218;   9;   1;  1;; not_moved
  2; 21:39:10,546;   0;   1;  0;
  2; 21:39:10,546;   5;  -3; -3;
  2; 21:39:11,203;   9;   0;  1;
  2; 21:39:11,203;   4;  -3;  0;
  2; 21:39:11,531;   6;   3;  1;
  2; 21:39:11,531;   2;   0; -5;
  2; 21:39:11,968;   8;   2; -2;
  2; 21:39:12,625;   0;   1; -1;
  2; 21:39:12,953;   9;   0;  2;
  2; 21:39:12,953;   1;   1;  3;
  2; 21:39:12,968;   4;  -4;  0;
  2; 21:39:12,984;   5;  -4; -3;
  2; 21:39:13,609;   2;  -1; -5;
  2; 21:39:13,609;   7;   2;  2;; not_moved
  2; 21:39:14,046;   7;   1;  2;
  2; 21:39:14,046;   3;  -1; -2;; not_moved
  2; 21:39:14,484;   3;   0; -2;
  2; 21:39:14,703;   6;   4;  2;
  2; 21:39:14,703;   9;   0;  3;
  2; 21:39:14,718;   0;   0; -2;
  2; 21:39:15,140;   5;  -4; -2;
  2; 21:39:15,140;   2;  -2; -5;
  2; 21:39:15,250;   8;   2; -1;
  2; 21:39:15,687;   4;  -5;  0;
  2; 21:39:16,234;   7;   1;  3;
  2; 21:39:16,781;   0;  -1; -3;
  2; 21:39:16,953;   1;   2;  4;
  2; 21:39:17,218;   4;  -4;  1;
  2; 21:39:17,218;   8;   2;  0;
  2; 21:39:17,234;   5;  -3; -1;
  2; 21:39:17,546;   2;  -3; -6;
  2; 21:39:17,765;   9;  -1;  3;
  2; 21:39:17,984;   7;   0;  3;
  2; 21:39:18,312;   3;   1; -2;
  2; 21:39:18,750;   6;   5;  2;
  2; 21:39:19,187;   0;   0; -3;
  2; 21:39:19,406;   5;  -2;  0;
  2; 21:39:19,406;   9;  -2;  3;
  2; 21:39:19,734;   8;   1;  0;
  2; 21:39:19,953;   2;  -3; -5;
  2; 21:39:19,953;   1;   1;  4;
  2; 21:39:20,281;   4;  -3;  1;
  2; 21:39:21,265;   9;  -2;  2;
  2; 21:39:21,265;   0;   0; -2;
  2; 21:39:21,484;   6;   6;  3;
  2; 21:39:21,703;   2;  -4; -5;
  2; 21:39:21,703;   5;  -2;  1;
  2; 21:39:21,921;   8;   0;  0;
  2; 21:39:21,921;   7;   0;  3;; not_moved
  2; 21:39:22,140;   4;  -2;  1;
  2; 21:39:22,140;   1;   2;  5;
  2; 21:39:22,156;   3;   1; -2;; not_moved
  2; 21:39:22,796;   7;  -1;  3;
  2; 21:39:22,828;   9;  -3;  2;
  2; 21:39:23,343;   3;   2; -2;
  2; 21:39:23,531;   5;  -1;  2;
  2; 21:39:23,890;   8;   0;  1;
  2; 21:39:24,109;   0;  -1; -2;
  2; 21:39:24,437;   2;  -5; -5;
  2; 21:39:24,437;   4;  -1;  2;
  2; 21:39:24,562;   1;   3;  6;
  2; 21:39:24,750;   6;   5;  3;
  2; 21:39:25,750;   7;  -1;  2;
  2; 21:39:25,750;   5;   0;  3;
  2; 21:39:25,875;   8;   1;  1;
  2; 21:39:25,906;   9;  -3;  1;
  2; 21:39:26,015;   0;  -2; -3;
  2; 21:39:26,109;   2;  -5; -4;
  2; 21:39:27,281;   3;   3; -2;
  2; 21:39:27,281;   7;   0;  3;
  2; 21:39:27,828;   1;   3;  5;
  2; 21:39:27,843;   4;   0;  3;
  2; 21:39:27,906;   2;  -5; -3;
  2; 21:39:28,156;   8;   1;  0;
  2; 21:39:28,156;   6;   4;  2;
  2; 21:39:28,703;   5;   1;  3;
  2; 21:39:28,703;   0;  -2; -4;
  2; 21:39:29,140;   9;  -4;  0;
  2; 21:39:29,687;   4;   1;  3;
  2; 21:39:29,750;   2;  -6; -3;
  2; 21:39:30,671;   7;   1;  4;
  2; 21:39:30,671;   1;   3;  4;
  2; 21:39:30,687;   8;   0; -1;
  2; 21:39:30,890;   0;  -1; -4;
  2; 21:39:31,328;   5;   2;  4;
  2; 21:39:31,328;   3;   3; -2;; not_moved
  2; 21:39:31,359;   4;   1;  2;
  2; 21:39:31,765;   2;  -5; -2;
  2; 21:39:31,765;   6;   3;  2;
  2; 21:39:32,312;   3;   3; -3;
  2; 21:39:32,531;   8;  -1; -1;
  2; 21:39:32,531;   7;   2;  4;
  2; 21:39:32,968;   9;  -4; -1;
  2; 21:39:33,125;   5;   3;  4;
  2; 21:39:33,515;   0;   0; -4;
  2; 21:39:33,609;   2;  -4; -2;
  2; 21:39:33,671;   1;   3;  3;
  2; 21:39:33,843;   4;   2;  2;
  2; 21:39:34,390;   8;  -1;  0;
  2; 21:39:34,390;   7;   3;  4;
  2; 21:39:34,578;   9;  -3; -1;
  2; 21:39:35,046;   3;   2; -3;
  2; 21:39:35,046;   6;   2;  1;
  2; 21:39:35,187;   5;   2;  3;
  2; 21:39:35,593;   0;  -1; -5;
  2; 21:39:35,921;   1;   4;  3;
  2; 21:39:35,921;   4;   3;  2;
  2; 21:39:36,359;   9;  -2; -1;
  2; 21:39:36,578;   7;   3;  3;
  2; 21:39:36,906;   2;  -3; -2;
  2; 21:39:37,343;   8;   0;  0;
  2; 21:39:37,562;   5;   1;  2;
  2; 21:39:37,562;   4;   2;  1;
  2; 21:39:38,218;   0;  -2; -5;
  2; 21:39:38,265;   7;   4;  3;
  2; 21:39:38,328;   1;   4;  2;
  2; 21:39:38,546;   2;  -2; -2;
  2; 21:39:38,640;   6;   1;  1;
  2; 21:39:38,734;   8;   0;  1;
  2; 21:39:39,093;   3;   2; -3;; not_moved
  2; 21:39:39,750;   5;   0;  1;
  2; 21:39:39,750;   9;  -1;  0;
  2; 21:39:39,765;   3;   1; -3;
  2; 21:39:39,781;   4;   1;  1;
  2; 21:39:40,187;   7;   4;  2;
  2; 21:39:40,234;   0;  -2; -4;
  2; 21:39:40,625;   1;   3;  1;
  2; 21:39:41,390;   2;  -1; -1;
  2; 21:39:41,437;   6;   0;  0;
  2; 21:39:41,593;   7;   3;  1;
  2; 21:39:41,734;   5;   0;  0;
  2; 21:39:41,937;   4;   0;  1;
  2; 21:39:42,703;   0;  -1; -3;
  2; 21:39:42,734;   3;   0; -4;
  2; 21:39:42,796;   8;   0;  1;; not_moved
  3; 21:40:44,000;  -1;   0;  0;
  3; 21:40:45,812;   2;   0; -1;
  3; 21:40:46,359;   4;  -1;  0;
  3; 21:40:46,500;   6;   1;  0;
  3; 21:40:46,796;   8;   1;  0;
  3; 21:40:47,015;   9;   1;  0;
  3; 21:40:47,015;   3;  -1; -1;
  3; 21:40:47,234;   1;   0;  1;
  3; 21:40:47,234;   7;   1;  1;
  3; 21:40:47,671;   2;   1;  0;
  3; 21:40:48,000;   5;   1;  0;
  3; 21:40:48,328;   6;   2;  1;
  3; 21:40:48,328;   4;  -2;  0;
  3; 21:40:48,656;   9;   2;  0;
  3; 21:40:49,312;   8;   1; -1;
  3; 21:40:49,312;   7;   2;  2;
  3; 21:40:49,640;   3;  -2; -2;
  3; 21:40:49,656;   2;   1; -1;
  3; 21:40:49,656;   5;   0; -1;
  3; 21:40:49,859;   1;   0;  2;
  3; 21:40:50,078;   4;  -2; -1; cleared
  3; 21:40:50,515;   6;   3;  1;
  3; 21:40:50,734;   9;   3;  0;
  3; 21:40:51,062;   0;   0; -1;
  3; 21:40:51,390;   2;   2; -1;
  3; 21:40:51,390;   3;  -1; -2;
  3; 21:40:51,609;   8;   1; -2;
  3; 21:40:52,156;   5;   0; -2;
  3; 21:40:52,484;   4;  -3; -1; cleared
  3; 21:40:52,484;   7;   3;  3;
  3; 21:40:52,500;   1;  -1;  2;
  3; 21:40:52,812;   6;   4;  2;
  3; 21:40:53,140;   2;   3; -1;
  3; 21:40:53,140;   0;   0; -2;
  3; 21:40:53,468;   9;   3; -1;
  3; 21:40:53,906;   8;   1; -3;
  3; 21:40:54,781;   4;  -3;  0;
  3; 21:40:54,781;   2;   4; -1;
  3; 21:40:54,796;   5;  -1; -3;
  3; 21:40:55,000;   6;   5;  2;
  3; 21:40:55,000;   3;  -2; -3;
  3; 21:40:55,656;   9;   2; -2;
  3; 21:40:55,656;   0;  -1; -2;
  3; 21:40:55,671;   8;   1; -4;
  3; 21:40:56,312;   7;   4;  4;
  3; 21:40:56,328;   4;  -4;  0;
  3; 21:40:56,531;   1;   0;  3;
  3; 21:40:56,968;   2;   3; -2;
  3; 21:40:56,968;   5;  -2; -4;
  3; 21:40:57,187;   9;   1; -3;
  3; 21:40:57,406;   6;   6;  3;
  3; 21:40:57,625;   8;   0; -5;
  3; 21:40:57,843;   3;  -3; -3;
  3; 21:40:58,500;   0;  -2; -2;
  3; 21:40:58,828;   4;  -3;  1;
  3; 21:40:58,828;   7;   5;  5;
  3; 21:40:59,046;   2;   2; -3;
  3; 21:40:59,593;   8;  -1; -5;
  3; 21:41:00,031;   5;  -3; -4;
  3; 21:41:00,031;   9;   0; -4;
  3; 21:41:00,250;   6;   5;  3;
  3; 21:41:00,687;   0;  -3; -2;
  3; 21:41:00,687;   1;   0;  3;; not_moved
  3; 21:41:00,718;   1;   0;  4;
  3; 21:41:01,015;   2;   1; -4;
  3; 21:41:01,234;   3;  -4; -3;
  3; 21:41:01,234;   8;  -2; -5;
  3; 21:41:01,562;   4;  -2;  1;
  3; 21:41:01,562;   7;   5;  4;
  3; 21:41:01,578;   9;  -1; -4; cleared
  3; 21:41:02,109;   5;  -3; -3;
  3; 21:41:02,765;   0;  -4; -2; cleared
  3; 21:41:02,765;   8;  -3; -6;
  3; 21:41:02,984;   6;   4;  2;
  3; 21:41:02,984;   2;   1; -3;
  3; 21:41:03,531;   9;  -1; -3;
  3; 21:41:03,750;   3;  -4; -4;
  3; 21:41:03,750;   4;  -1;  1; cleared
  3; 21:41:03,968;   1;  -1;  4;
  3; 21:41:03,984;   7;   4;  3;
  3; 21:41:04,625;   2;   0; -3;
  3; 21:41:04,843;   5;  -4; -4;
  3; 21:41:05,281;   6;   3;  2;
  3; 21:41:05,281;   8;  -3; -5;
  3; 21:41:05,609;   7;   5;  3;
  3; 21:41:05,828;   9;  -2; -3;
  3; 21:41:05,828;   4;  -2;  0;
  3; 21:41:06,265;   2;  -1; -3;
  3; 21:41:06,593;   3;  -5; -5;
  3; 21:41:06,593;   0;  -3; -1; cleared
  3; 21:41:06,812;   1;  -2;  3;
  3; 21:41:07,140;   8;  -2; -5;
  3; 21:41:07,140;   5;  -5; -4;
  3; 21:41:07,468;   4;  -1;  0;
  3; 21:41:07,906;   9;  -3; -4;
  3; 21:41:07,906;   6;   2;  1;
  3; 21:41:08,343;   7;   4;  2;
  3; 21:41:08,343;   2;  -2; -3;
  3; 21:41:08,671;   8;  -1; -4; cleared
  3; 21:41:09,109;   4;   0;  0;
  3; 21:41:09,125;   3;  -4; -5;
  3; 21:41:09,656;   0;  -2;  0;
  3; 21:41:09,984;   2;  -1; -2;
  3; 21:41:10,312;   5;  -5; -3;
  3; 21:41:10,312;   8;   0; -3;
  3; 21:41:10,640;   1;  -3;  2;
  3; 21:41:10,640;   9;  -4; -4;
  3; 21:41:10,671;   6;   1;  1;
  3; 21:41:11,078;   7;   4;  1;
  3; 21:41:11,734;   2;  -2; -2;
  3; 21:41:12,390;   9;  -4; -3;
  3; 21:41:12,609;   0;  -2; -1; cleared
  3; 21:41:12,609;   8;   0; -2;
  3; 21:41:13,046;   5;  -4; -2; cleared
  3; 21:41:13,062;   4;   0;  0;; not_moved
  3; 21:41:13,109;   4;   0;  1;
  3; 21:41:13,265;   1;  -4;  1;
  3; 21:41:13,265;   3;  -4; -5;; not_moved
  3; 21:41:13,484;   6;   0;  1;
  3; 21:41:13,812;   3;  -3; -5;
  3; 21:41:14,031;   9;  -4; -2; cleared
  3; 21:41:14,796;   7;   5;  1;
  3; 21:41:15,234;   8;  -1; -3;
  3; 21:41:15,453;   5;  -4; -1;
  3; 21:41:15,453;   4;   0;  2;
  3; 21:41:16,328;   9;  -3; -1; cleared
  3; 21:41:16,328;   6;  -1;  0;
  3; 21:41:16,656;   3;  -2; -4;
  3; 21:41:16,671;   0;  -2; -1;; not_moved
  3; 21:41:16,875;   0;  -3; -2;
  3; 21:41:16,875;   1;  -5;  0;
  3; 21:41:17,531;   7;   5;  0;
  3; 21:41:18,406;   4;   0;  3;
  3; 21:41:18,734;   3;  -1; -4; cleared
  3; 21:41:19,390;   6;  -1; -1;
  3; 21:41:19,406;   7;   4;  0;
  3; 21:41:19,406;   0;  -2; -2;
  3; 21:41:19,421;   5;  -3;  0;
  3; 21:41:20,046;   1;  -5; -1;
  3; 21:41:21,687;   5;  -2;  1;
  3; 21:41:21,703;   7;   4; -1;
  3; 21:41:22,015;   0;  -3; -3;
  3; 21:41:22,781;   3;  -1; -4;; not_moved
  3; 21:41:23,328;   3;   0; -3;
  3; 21:41:23,343;   6;  -1; -1;; not_moved
  3; 21:41:23,343;   6;  -2; -1; cleared
  3; 21:41:23,656;   7;   3; -2;
  3; 21:41:23,656;   1;  -5; -2;
  3; 21:41:23,984;   5;  -1;  1; cleared
  3; 21:41:24,859;   0;  -4; -4;
  3; 21:41:26,937;   3;   1; -2;
  3; 21:41:26,937;   0;  -4; -3;
  3; 21:41:27,375;   1;  -6; -3;
  3; 21:41:29,562;   0;  -5; -3;
  3; 21:41:30,000;   3;   1; -3;
  3; 21:41:31,421;   1;  -6; -3;; not_moved
  3; 21:41:32,406;   1;  -5; -3;
  3; 21:41:34,593;   1;  -5; -4;
  4; 21:42:15,062;  -1;   0;  0;
  4; 21:42:16,484;   9;  -1; -1;
  4; 21:42:16,531;   4;  -1;  0;
  4; 21:42:16,921;   6;   1;  0;
  4; 21:42:16,921;   2;   0; -1;
  4; 21:42:17,250;   3;   1;  0;
  4; 21:42:18,343;   5;   0; -1;
  4; 21:42:18,343;   1;   0;  1;
  4; 21:42:18,562;   2;   0; -2;
  4; 21:42:18,562;   6;   2;  1;
  4; 21:42:18,578;   8;   1;  1;
  4; 21:42:18,890;   7;   0;  1;
  4; 21:42:18,906;   4;  -2;  0;
  4; 21:42:18,921;   0;   1;  1;
  4; 21:42:19,328;   3;   2;  0;
  4; 21:42:19,656;   9;  -2; -2;
  4; 21:42:20,421;   5;   1; -1;
  4; 21:42:20,640;   6;   3;  1;
  4; 21:42:20,640;   2;   0; -3;
  4; 21:42:20,968;   8;   2;  2;
  4; 21:42:20,968;   3;   3;  1;
  4; 21:42:20,968;   7;   1;  1;
  4; 21:42:21,187;   1;   1;  2; cleared
  4; 21:42:21,406;   4;  -3;  0; cleared
  4; 21:42:21,625;   9;  -2; -3;
  4; 21:42:21,625;   0;   1;  2;
  4; 21:42:22,390;   6;   4;  2;
  4; 21:42:22,390;   5;   2; -1;
  4; 21:42:22,609;   2;   1; -3;
  4; 21:42:22,609;   8;   3;  2;
  4; 21:42:23,046;   4;  -4;  0;
  4; 21:42:23,265;   3;   3;  0;
  4; 21:42:23,265;   7;   2;  2;
  4; 21:42:23,484;   9;  -3; -4;
  4; 21:42:23,812;   0;   0;  1;
  4; 21:42:24,468;   2;   2; -2;
  4; 21:42:24,468;   1;   2;  3;
  4; 21:42:24,796;   5;   2; -2;
  4; 21:42:25,125;   8;   2;  1;
  4; 21:42:25,125;   4;  -3;  1;
  4; 21:42:25,453;   6;   5;  2;
  4; 21:42:25,453;   3;   4;  0;
  4; 21:42:25,890;   9;  -4; -4;
  4; 21:42:25,890;   2;   2; -3;
  4; 21:42:26,109;   7;   3;  3;
  4; 21:42:26,437;   5;   3; -2;
  4; 21:42:26,453;   1;   3;  3;
  4; 21:42:27,312;   4;  -4;  1;
  4; 21:42:27,531;   3;   3; -1;
  4; 21:42:27,531;   6;   6;  3;
  4; 21:42:27,562;   2;   1; -4; cleared
  4; 21:42:27,859;   0;   0;  1;; not_moved
  4; 21:42:28,187;   7;   4;  3;
  4; 21:42:28,187;   5;   4; -1;
  4; 21:42:28,203;   9;  -4; -3;
  4; 21:42:28,218;   0;   0;  2;
  4; 21:42:28,406;   1;   3;  2;
  4; 21:42:28,843;   4;  -5;  0;
  4; 21:42:29,171;   8;   2;  1;; not_moved
  4; 21:42:29,171;   8;   1;  0;
  4; 21:42:29,187;   6;   5;  3;
  4; 21:42:29,609;   2;   0; -5;
  4; 21:42:29,609;   3;   2; -1;
  4; 21:42:30,265;   1;   4;  2;
  4; 21:42:30,281;   5;   5;  0;
  4; 21:42:30,593;   0;   1;  3;
  4; 21:42:30,593;   9;  -4; -2;
  4; 21:42:31,250;   2;   0; -4;
  4; 21:42:31,687;   8;   0; -1;
  4; 21:42:31,687;   4;  -5; -1;
  4; 21:42:31,703;   7;   5;  4;
  4; 21:42:31,906;   3;   1; -2;
  4; 21:42:31,906;   1;   4;  1;
  4; 21:42:31,921;   6;   4;  3;
  4; 21:42:32,234;   5;   5;  1;
  4; 21:42:32,781;   0;   2;  3;
  4; 21:42:33,000;   2;  -1; -5;
  4; 21:42:33,000;   9;  -5; -3;
  4; 21:42:33,328;   8;  -1; -2;
  4; 21:42:33,546;   6;   3;  2;
  4; 21:42:34,203;   5;   5;  2;
  4; 21:42:34,640;   3;   0; -2;
  4; 21:42:34,640;   1;   4;  0;
  4; 21:42:35,078;   8;  -2; -3;
  4; 21:42:35,078;   0;   2;  2;
  4; 21:42:35,093;   2;  -1; -4; cleared
  4; 21:42:35,296;   9;  -5; -4;
  4; 21:42:35,296;   7;   5;  5;
  4; 21:42:35,625;   4;  -5; -1;; not_moved
  4; 21:42:36,062;   6;   2;  2;
  4; 21:42:36,078;   4;  -4;  0;
  4; 21:42:36,078;   5;   4;  2;
  4; 21:42:36,609;   8;  -2; -2;
  4; 21:42:36,609;   2;  -2; -5;
  4; 21:42:36,828;   3;  -1; -3;
  4; 21:42:36,828;   1;   4; -1;
  4; 21:42:37,250;   7;   4;  4;
  4; 21:42:37,484;   0;   2;  1;
  4; 21:42:37,812;   9;  -5; -5; cleared
  4; 21:42:38,140;   5;   4;  3;
  4; 21:42:38,140;   4;  -3;  1;
  4; 21:42:38,359;   6;   1;  1;
  4; 21:42:38,375;   2;  -3; -6;
  4; 21:42:38,578;   8;  -3; -3;
  4; 21:42:38,578;   3;  -1; -2;
  4; 21:42:39,125;   1;   3; -2;
  4; 21:42:39,453;   7;   4;  5;
  4; 21:42:39,671;   0;   1;  0;
  4; 21:42:40,000;   9;  -4; -5;
  4; 21:42:40,000;   5;   3;  3;
  4; 21:42:40,328;   8;  -3; -2;
  4; 21:42:40,328;   6;   0;  1;
  4; 21:42:40,343;   4;  -2;  2;
  4; 21:42:40,359;   2;  -3; -5;
  4; 21:42:40,765;   3;  -1; -1;
  4; 21:42:41,859;   0;   0;  0;
  4; 21:42:42,078;   5;   3;  4;
  4; 21:42:42,078;   6;  -1;  0;
  4; 21:42:42,109;   7;   3;  4;
  4; 21:42:42,515;   4;  -1;  3; cleared
  4; 21:42:42,515;   2;  -2; -4;
  4; 21:42:42,531;   8;  -4; -2;
  4; 21:42:42,843;   3;  -2; -1;
  4; 21:42:43,171;   1;   3; -2;; not_moved
  4; 21:42:43,171;   9;  -4; -4;
  4; 21:42:43,500;   1;   2; -2;
  4; 21:42:43,937;   5;   3;  5;
  4; 21:42:43,937;   6;  -2;  0;
  4; 21:42:44,265;   4;  -1;  2;
  4; 21:42:44,281;   8;  -5; -3;
  4; 21:42:44,484;   0;  -1;  0;
  4; 21:42:45,031;   9;  -3; -4;
  4; 21:42:45,359;   1;   2; -1;
  4; 21:42:45,687;   5;   2;  5;
  4; 21:42:45,687;   4;   0;  3;
  4; 21:42:45,703;   3;  -3; -1;
  4; 21:42:45,718;   6;  -1;  1;
  4; 21:42:46,015;   7;   2;  4;
  4; 21:42:46,562;   0;  -1;  1;
  4; 21:42:46,578;   8;  -6; -3;
  4; 21:42:47,765;   4;   1;  3;
  4; 21:42:47,765;   1;   1; -1;
  4; 21:42:48,421;   7;   1;  4;
  4; 21:42:48,640;   8;  -5; -2;
  4; 21:42:48,640;   3;  -4; -1;
  4; 21:42:48,671;   9;  -2; -3;
  4; 21:42:48,968;   0;  -1;  2;
  4; 21:42:50,281;   1;   0; -1;
  4; 21:42:50,500;   7;   1;  5;
  4; 21:42:51,046;   0;   0;  3;
  4; 21:42:51,375;   9;  -1; -3;
  4; 21:42:52,468;   7;   0;  5;
  4; 21:42:52,796;   1;  -1; -1;
  4; 21:42:53,234;   0;   1;  4;
  4; 21:42:54,546;   7;   0;  4;
  5; 21:44:39,781;  -1;   0;  0;
  5; 21:44:50,156;   4;  -1;  0;
  5; 21:44:50,812;   3;   1;  1;
  5; 21:44:50,812;   8;   1;  0;
  5; 21:44:51,687;   5;  -1;  0;
  5; 21:44:51,687;   0;   1;  1;
  5; 21:44:51,703;   4;   0;  1;
  5; 21:44:52,562;   3;   1;  2;
  5; 21:44:52,781;   9;   0; -1;
  5; 21:44:53,109;   8;   2;  0;
  5; 21:44:53,328;   7;   1;  1;
  5; 21:44:53,328;   4;   0;  2;
  5; 21:44:53,343;   2;   1;  1;
  5; 21:44:53,359;   0;   2;  2;
  5; 21:44:54,968;   7;   2;  2;
  5; 21:44:55,406;   4;  -1;  2;
  5; 21:44:55,625;   5;  -2;  0;
  5; 21:44:55,625;   8;   2; -1;
  5; 21:44:56,062;   2;   2;  1;
  5; 21:44:56,062;   0;   2;  3;
  5; 21:44:56,281;   3;   0;  2;
  5; 21:44:56,828;   9;   0; -1;; not_moved
  5; 21:44:56,828;   9;   0; -2;
  5; 21:44:56,859;   7;   2;  3;
  5; 21:44:57,703;   4;   0;  3;
  5; 21:44:57,718;   8;   2; -2;
  5; 21:44:58,031;   0;   2;  4;
  5; 21:44:58,046;   5;  -2;  1;
  5; 21:44:58,062;   6;   1;  1;
  5; 21:44:59,234;   7;   2;  4;
  5; 21:44:59,671;   3;   1;  3;
  5; 21:44:59,671;   9;   0; -3;
  5; 21:44:59,890;   8;   2; -3;
  5; 21:45:00,109;   2;   2;  1;; not_moved
  5; 21:45:00,109;   0;   3;  5;
  5; 21:45:00,328;   5;  -1;  2;
  5; 21:45:00,328;   6;   1;  2;
  5; 21:45:00,765;   2;   2;  2;
  5; 21:45:01,421;   7;   3;  5;
  5; 21:45:01,437;   4;  -1;  3;
  5; 21:45:01,859;   0;   3;  6; NNug=2
  5; 21:45:01,859;   8;   3; -3; NNug=1
  5; 21:45:02,078;   5;   0;  3;
  5; 21:45:02,078;   3;   2;  4;
  5; 21:45:02,625;   6;   2;  3;
  5; 21:45:02,953;   9;   0; -4;
  5; 21:45:02,953;   4;  -2;  2;
  5; 21:45:03,281;   7;   3;  6; NNug=2
  5; 21:45:03,828;   2;   2;  3;
  5; 21:45:03,828;   5;   1;  4;
  5; 21:45:04,046;   1;   0;  1;
  5; 21:45:05,140;   0;   2;  5;
  5; 21:45:05,796;   5;   2;  5;
  5; 21:45:05,796;   4;  -3;  1;
  5; 21:45:06,015;   8;   3; -3; NNug=1; not_moved
  5; 21:45:06,015;   3;   3;  5;
  5; 21:45:06,031;   6;   2;  4;
  5; 21:45:06,031;   9;  -1; -5;
  5; 21:45:06,453;   1;   0;  2;
  5; 21:45:07,000;   2;   2;  4;
  5; 21:45:07,000;   0;   1;  4;
  5; 21:45:07,328;   7;   3;  6; NNug=2; not_moved
  5; 21:45:08,421;   4;  -4;  0;
  5; 21:45:08,640;   5;   3;  6; NNug=2
  5; 21:45:08,968;   6;   3;  5;
  5; 21:45:09,187;   2;   3;  5;
  5; 21:45:09,187;   9;  -2; -5;
  5; 21:45:09,203;   0;   2;  5;
  5; 21:45:10,062;   3;   3;  5;; not_moved
  5; 21:45:10,609;   1;   0;  2;; not_moved
  5; 21:45:11,046;   4;  -3;  0;
  5; 21:45:11,265;   0;   3;  6; NNug=2
  5; 21:45:11,265;   2;   3;  6; NNug=2
  5; 21:45:11,812;   9;  -2; -4;
  5; 21:45:11,812;   6;   3;  6; NNug=2
  5; 21:45:12,250;   1;   1;  3;
  5; 21:45:12,687;   5;   3;  6; NNug=2; not_moved
  5; 21:45:13,890;   0;   3;  5;
  5; 21:45:13,890;   3;   3;  6; NNug=2
  5; 21:45:14,218;   1;   2;  4;
  5; 21:45:15,093;   4;  -3;  0;; not_moved
  5; 21:45:15,531;   2;   3;  6; NNug=2; not_moved
  5; 21:45:15,859;   9;  -2; -4;; not_moved
  5; 21:45:15,859;   6;   3;  6; NNug=2; not_moved
  5; 21:45:16,187;   0;   3;  6; NNug=2
  5; 21:45:16,218;   1;   3;  5;
  5; 21:45:18,156;   3;   3;  6; NNug=2; not_moved
  5; 21:45:18,593;   4;  -2;  1;
  5; 21:45:18,593;   0;   3;  5;
  5; 21:45:20,343;   1;   3;  5;; not_moved
  5; 21:45:20,781;   0;   3;  6; NNug=2
  5; 21:45:20,828;   9;  -1; -4;
  5; 21:45:21,546;   4;  -1;  2;
  5; 21:45:21,687;   1;   3;  6; NNug=2
  5; 21:45:24,062;   9;   0; -4;
  5; 21:45:24,140;   4;   0;  3;
  5; 21:45:24,203;   3;   2;  5;
  5; 21:45:24,828;   0;   3;  6; NNug=2; not_moved
  5; 21:45:25,921;   1;   3;  6; NNug=2; not_moved
  5; 21:45:26,015;   0;   3;  5;
  5; 21:45:26,578;   4;   1;  4;
  5; 21:45:27,234;   9;   1; -3;
  5; 21:45:28,437;   4;   2;  5;
  5; 21:45:28,437;   3;   2;  5;; not_moved
  5; 21:45:29,859;   6;   2;  5;
  5; 21:45:29,875;   9;   2; -3;
  5; 21:45:30,296;   3;   1;  5;
  5; 21:45:31,609;   6;   3;  6; NNug=2
  5; 21:45:32,921;   9;   3; -3; NNug=1
  5; 21:45:34,343;   3;   1;  5;; not_moved
  5; 21:45:34,437;   3;   1;  4;
  5; 21:45:35,656;   6;   3;  6; NNug=2; not_moved
  5; 21:45:36,421;   3;   2;  4;
  5; 21:45:36,968;   6;   2;  5;
  5; 21:45:36,968;   9;   3; -3; NNug=1; not_moved
  5; 21:45:39,156;   3;   3;  5;
  5; 21:45:39,593;   6;   3;  6; NNug=2
  5; 21:45:43,203;   3;   3;  5;; not_moved
  5; 21:45:43,640;   6;   3;  6; NNug=2; not_moved
  5; 21:45:43,640;   3;   2;  5;
  5; 21:45:46,812;   3;   3;  5;
  5; 21:45:48,562;   3;   3;  6; NNug=2
