HC_2022-03-28_16-20-01
PlayOrder: 2,i56,56,56,56,56,56,56,56,56,56,56,56,56,56,56,56,56,56,56,56,56,56,56,56,56,56,56,56,56,56,56,200,
List of players:
    /127.0.0.1:43380  0
    /127.0.0.1:43382  1
    /127.0.0.1:43388  2
    /127.0.0.1:43390  3
    /127.0.0.1:43392  4
    /127.0.0.1:43394  5


##### Spiel2: Vorübung gemeinsam #####  

#Feld   :   ct :ctVisMode:ctVisible:Nuggets:Ct_local:Ct_global;NugVisible:Cleared:Players
  0,  0 :    0 :     0   :   false :     0 :      0 :      0  :     true : false :  1,   3,   5,   4,   2,   0, 


Startzeit: 17:21:36,516

##### Spiel56: Experimentserie mit computed	##### 
List of players:
 id: sj: sj:ctl: vr: nM:nMisMax:  color: wh: bl:pay:isComp 
  0:  1:  3:  0: -1:  0:   true: 000000:  0:  0:  0: false 
  1:  1:  2:  0: -1:  0:   true: 00cf9e:  0:  0:  0: false 
  2:  0: -3:  0: -1:  0:   true: 88b551:  0:  0:  0: false 
  3: -1:  3:  0: -1:  0:   true: fe5f00:  0:  0:  0: false 
  4:  0: -2:  0: -1:  0:   true: ca1551:  0:  0:  0: false 
  5:  1: -2:  0: -1:  0:   true: e56399:  0:  0:  0: false 
  6:  0:  0:  0: -1:  5:   true: b3001b: 24:  6: 30:  true 
  7:  0:  0:  0: -1:  5:   true: 750b7d: 27:  3: 10:  true 
  8:  0:  0:  0: -1:  5:   true: 222e50:  9: 21: 30:  true 
  9:  0:  0:  0: -1:  5:   true: 3a7d44:  6: 24: 10:  true 


##### next Spiel56: 	##### 

commonPlGr:
#Feld   :   ct :ctVisMode:ctVisible:Nuggets:Ct_local:Ct_global;NugVisible:Cleared:Players
  5,  2 :    0 :     0   :   false :     0 :      0 :      0  :     true : false :  6, 
 -2,  3 :    0 :     0   :   false :     0 :      0 :      0  :     true : false :  7, 
  3,  5 :    0 :     0   :   false :     0 :      0 :      0  :     true : false :  8, 
 -5, -2 :    0 :     0   :   false :     0 :      0 :      0  :     true : false :  9, 
  0,  0 :    0 :     0   :   false :     0 :      0 :      0  :     true : false :  1,   3,   5,   4,   2,   0, 

Startzeit: 17:25:15,266


last common playground
#Feld   :   ct :ctVisMode:ctVisible:Nuggets:Ct_local:Ct_global;NugVisible:Cleared:Players
  5,  2 :    0 :     0   :   false :     0 :      0 :      0  :     true : false :  6, 
 -2,  3 :    0 :     0   :   false :     0 :      0 :      0  :     true : false :  5,   0,   3,   2,   1,   7, 
  3,  5 :    0 :     0   :   false :     0 :      0 :      0  :     true : false :  4,   8, 
 -5, -2 :    0 :     0   :   false :     0 :      0 :      0  :     true : false :  9, 

Balances: saldo  pay  groupbonus
  0:     22 Cent      10 Cent     12 Cent  
  1:     22 Cent      10 Cent     12 Cent  
  2:     22 Cent      10 Cent     12 Cent  
  3:     22 Cent      10 Cent     12 Cent  
  4:     30 Cent      30 Cent      0 Cent  
  5:     22 Cent      10 Cent     12 Cent  
  6:     24 wh       6 bl 
  7:     27 wh       3 bl 
  8:      9 wh      21 bl 
  9:      6 wh      24 bl 

##### next Spiel56: 	##### 

commonPlGr:
#Feld   :   ct :ctVisMode:ctVisible:Nuggets:Ct_local:Ct_global;NugVisible:Cleared:Players
  5,  1 :    0 :     0   :   false :     0 :      0 :      0  :     true : false :  6, 
 -5, -1 :    0 :     0   :   false :     0 :      0 :      0  :     true : false :  7, 
 -1,  4 :    0 :     0   :   false :     0 :      0 :      0  :     true : false :  8, 
  1, -4 :    0 :     0   :   false :     0 :      0 :      0  :     true : false :  9, 
  0,  0 :    0 :     0   :   false :     0 :      0 :      0  :     true : false :  1,   3,   5,   4,   2,   0, 

Startzeit: 17:25:34,266


last common playground
#Feld   :   ct :ctVisMode:ctVisible:Nuggets:Ct_local:Ct_global;NugVisible:Cleared:Players
  5,  1 :    0 :     0   :   false :     0 :      0 :      0  :     true : false :  6, 
 -5, -1 :    0 :     0   :   false :     0 :      0 :      0  :     true : false :  1,   7,   3,   0,   5,   2, 
 -1,  4 :    0 :     0   :   false :     0 :      0 :      0  :     true : false :  8, 
  1, -4 :    0 :     0   :   false :     0 :      0 :      0  :     true : false :  4,   9, 

Balances: saldo  pay  groupbonus
  0:     44 Cent      10 Cent     12 Cent  
  1:     44 Cent      10 Cent     12 Cent  
  2:     44 Cent      10 Cent     12 Cent  
  3:     44 Cent      10 Cent     12 Cent  
  4:     30 Cent       0 Cent      0 Cent  
  5:     44 Cent      10 Cent     12 Cent  
  6:     24 wh       6 bl 
  7:     27 wh       3 bl 
  8:      9 wh      21 bl 
  9:      6 wh      24 bl 

##### next Spiel56: 	##### 

commonPlGr:
#Feld   :   ct :ctVisMode:ctVisible:Nuggets:Ct_local:Ct_global;NugVisible:Cleared:Players
 -5, -4 :    0 :     0   :   false :     0 :      0 :      0  :     true : false :  6, 
 -1, -5 :    0 :     0   :   false :     0 :      0 :      0  :     true : false :  7, 
  1,  5 :    0 :     0   :   false :     0 :      0 :      0  :     true : false :  8, 
  4, -1 :    0 :     0   :   false :     0 :      0 :      0  :     true : false :  9, 
  0,  0 :    0 :     0   :   false :     0 :      0 :      0  :     true : false :  1,   3,   5,   4,   2,   0, 

Startzeit: 17:25:56,509


last common playground
#Feld   :   ct :ctVisMode:ctVisible:Nuggets:Ct_local:Ct_global;NugVisible:Cleared:Players
 -5, -4 :    0 :     0   :   false :     0 :      0 :      0  :     true : false :  6,   0,   2,   5,   3,   4, 
 -1, -5 :    0 :     0   :   false :     0 :      0 :      0  :     true : false :  1,   7, 
  1,  5 :    0 :     0   :   false :     0 :      0 :      0  :     true : false :  8, 
  4, -1 :    0 :     0   :   false :     0 :      0 :      0  :     true : false :  9, 

Balances: saldo  pay  groupbonus
  0:     86 Cent      30 Cent     12 Cent  
  1:     54 Cent      10 Cent      0 Cent  
  2:     86 Cent      30 Cent     12 Cent  
  3:     86 Cent      30 Cent     12 Cent  
  4:     72 Cent      30 Cent     12 Cent  
  5:     86 Cent      30 Cent     12 Cent  
  6:     24 wh       6 bl 
  7:     27 wh       3 bl 
  8:      9 wh      21 bl 
  9:      6 wh      24 bl 

##### next Spiel56: 	##### 

commonPlGr:
#Feld   :   ct :ctVisMode:ctVisible:Nuggets:Ct_local:Ct_global;NugVisible:Cleared:Players
 -3,  2 :    0 :     0   :   false :     0 :      0 :      0  :     true : false :  6, 
  2,  5 :    0 :     0   :   false :     0 :      0 :      0  :     true : false :  7, 
  5,  3 :    0 :     0   :   false :     0 :      0 :      0  :     true : false :  8, 
 -5, -3 :    0 :     0   :   false :     0 :      0 :      0  :     true : false :  9, 
  0,  0 :    0 :     0   :   false :     0 :      0 :      0  :     true : false :  1,   3,   5,   4,   2,   0, 

Startzeit: 17:26:16,042


last common playground
#Feld   :   ct :ctVisMode:ctVisible:Nuggets:Ct_local:Ct_global;NugVisible:Cleared:Players
 -3,  2 :    0 :     0   :   false :     0 :      0 :      0  :     true : false :  0,   3,   1,   4,   5,   2,   6, 
  2,  5 :    0 :     0   :   false :     0 :      0 :      0  :     true : false :  7, 
  5,  3 :    0 :     0   :   false :     0 :      0 :      0  :     true : false :  8, 
 -5, -3 :    0 :     0   :   false :     0 :      0 :      0  :     true : false :  9, 

Balances: saldo  pay  groupbonus
  0:    131 Cent      30 Cent     15 Cent  
  1:     99 Cent      30 Cent     15 Cent  
  2:    131 Cent      30 Cent     15 Cent  
  3:    131 Cent      30 Cent     15 Cent  
  4:    117 Cent      30 Cent     15 Cent  
  5:    131 Cent      30 Cent     15 Cent  
  6:     24 wh       6 bl 
  7:     27 wh       3 bl 
  8:      9 wh      21 bl 
  9:      6 wh      24 bl 

##### next Spiel56: 	##### 

commonPlGr:
#Feld   :   ct :ctVisMode:ctVisible:Nuggets:Ct_local:Ct_global;NugVisible:Cleared:Players
  3, -2 :    0 :     0   :   false :     0 :      0 :      0  :     true : false :  6, 
  2,  5 :    0 :     0   :   false :     0 :      0 :      0  :     true : false :  7, 
 -2, -5 :    0 :     0   :   false :     0 :      0 :      0  :     true : false :  8, 
 -3,  2 :    0 :     0   :   false :     0 :      0 :      0  :     true : false :  9, 
  0,  0 :    0 :     0   :   false :     0 :      0 :      0  :     true : false :  1,   3,   5,   4,   2,   0, 

Startzeit: 17:26:40,084


last common playground
#Feld   :   ct :ctVisMode:ctVisible:Nuggets:Ct_local:Ct_global;NugVisible:Cleared:Players
  3, -2 :    0 :     0   :   false :     0 :      0 :      0  :     true : false :  6, 
  2,  5 :    0 :     0   :   false :     0 :      0 :      0  :     true : false :  7, 
 -2, -5 :    0 :     0   :   false :     0 :      0 :      0  :     true : false :  8, 
 -3,  2 :    0 :     0   :   false :     0 :      0 :      0  :     true : false :  4,   3,   0,   2,   1,   5,   9, 

Balances: saldo  pay  groupbonus
  0:    146 Cent       0 Cent     15 Cent  
  1:    114 Cent       0 Cent     15 Cent  
  2:    146 Cent       0 Cent     15 Cent  
  3:    146 Cent       0 Cent     15 Cent  
  4:    132 Cent       0 Cent     15 Cent  
  5:    146 Cent       0 Cent     15 Cent  
  6:     24 wh       6 bl 
  7:     27 wh       3 bl 
  8:      9 wh      21 bl 
  9:      6 wh      24 bl 

##### next Spiel56: 	##### 

commonPlGr:
#Feld   :   ct :ctVisMode:ctVisible:Nuggets:Ct_local:Ct_global;NugVisible:Cleared:Players
 -4, -5 :    0 :     0   :   false :     0 :      0 :      0  :     true : false :  6, 
  5,  1 :    0 :     0   :   false :     0 :      0 :      0  :     true : false :  7, 
  1, -4 :    0 :     0   :   false :     0 :      0 :      0  :     true : false :  8, 
 -5, -1 :    0 :     0   :   false :     0 :      0 :      0  :     true : false :  9, 
  0,  0 :    0 :     0   :   false :     0 :      0 :      0  :     true : false :  1,   3,   5,   4,   2,   0, 

Startzeit: 17:27:00,904


last common playground
#Feld   :   ct :ctVisMode:ctVisible:Nuggets:Ct_local:Ct_global;NugVisible:Cleared:Players
 -4, -5 :    0 :     0   :   false :     0 :      0 :      0  :     true : false :  1,   2,   0,   3,   5,   6, 
  5,  1 :    0 :     0   :   false :     0 :      0 :      0  :     true : false :  7, 
  1, -4 :    0 :     0   :   false :     0 :      0 :      0  :     true : false :  4,   8, 
 -5, -1 :    0 :     0   :   false :     0 :      0 :      0  :     true : false :  9, 

Balances: saldo  pay  groupbonus
  0:    188 Cent      30 Cent     12 Cent  
  1:    156 Cent      30 Cent     12 Cent  
  2:    188 Cent      30 Cent     12 Cent  
  3:    188 Cent      30 Cent     12 Cent  
  4:    132 Cent       0 Cent      0 Cent  
  5:    188 Cent      30 Cent     12 Cent  
  6:     24 wh       6 bl 
  7:     27 wh       3 bl 
  8:      9 wh      21 bl 
  9:      6 wh      24 bl 

##### next Spiel56: 	##### 

commonPlGr:
#Feld   :   ct :ctVisMode:ctVisible:Nuggets:Ct_local:Ct_global;NugVisible:Cleared:Players
  2, -3 :    0 :     0   :   false :     0 :      0 :      0  :     true : false :  6, 
 -2,  3 :    0 :     0   :   false :     0 :      0 :      0  :     true : false :  7, 
  5,  2 :    0 :     0   :   false :     0 :      0 :      0  :     true : false :  8, 
  3,  5 :    0 :     0   :   false :     0 :      0 :      0  :     true : false :  9, 
  0,  0 :    0 :     0   :   false :     0 :      0 :      0  :     true : false :  1,   3,   5,   4,   2,   0, 

Startzeit: 17:27:21,167


last common playground
#Feld   :   ct :ctVisMode:ctVisible:Nuggets:Ct_local:Ct_global;NugVisible:Cleared:Players
  2, -3 :    0 :     0   :   false :     0 :      0 :      0  :     true : false :  6, 
 -2,  3 :    0 :     0   :   false :     0 :      0 :      0  :     true : false :  7, 
  5,  2 :    0 :     0   :   false :     0 :      0 :      0  :     true : false :  4,   3,   0,   5,   1,   2,   8, 
  3,  5 :    0 :     0   :   false :     0 :      0 :      0  :     true : false :  9, 

Balances: saldo  pay  groupbonus
  0:    203 Cent       0 Cent     15 Cent  
  1:    171 Cent       0 Cent     15 Cent  
  2:    203 Cent       0 Cent     15 Cent  
  3:    203 Cent       0 Cent     15 Cent  
  4:    147 Cent       0 Cent     15 Cent  
  5:    203 Cent       0 Cent     15 Cent  
  6:     24 wh       6 bl 
  7:     27 wh       3 bl 
  8:      9 wh      21 bl 
  9:      6 wh      24 bl 

##### next Spiel56: 	##### 

commonPlGr:
#Feld   :   ct :ctVisMode:ctVisible:Nuggets:Ct_local:Ct_global;NugVisible:Cleared:Players
 -5, -2 :    0 :     0   :   false :     0 :      0 :      0  :     true : false :  6, 
  3,  5 :    0 :     0   :   false :     0 :      0 :      0  :     true : false :  7, 
  5,  2 :    0 :     0   :   false :     0 :      0 :      0  :     true : false :  8, 
 -3, -5 :    0 :     0   :   false :     0 :      0 :      0  :     true : false :  9, 
  0,  0 :    0 :     0   :   false :     0 :      0 :      0  :     true : false :  1,   3,   5,   4,   2,   0, 

Startzeit: 17:27:42,512


last common playground
#Feld   :   ct :ctVisMode:ctVisible:Nuggets:Ct_local:Ct_global;NugVisible:Cleared:Players
 -5, -2 :    0 :     0   :   false :     0 :      0 :      0  :     true : false :  6,   3,   0,   1,   4,   5, 
  3,  5 :    0 :     0   :   false :     0 :      0 :      0  :     true : false :  2,   7, 
  5,  2 :    0 :     0   :   false :     0 :      0 :      0  :     true : false :  8, 
 -3, -5 :    0 :     0   :   false :     0 :      0 :      0  :     true : false :  9, 

Balances: saldo  pay  groupbonus
  0:    245 Cent      30 Cent     12 Cent  
  1:    213 Cent      30 Cent     12 Cent  
  2:    213 Cent      10 Cent      0 Cent  
  3:    245 Cent      30 Cent     12 Cent  
  4:    189 Cent      30 Cent     12 Cent  
  5:    245 Cent      30 Cent     12 Cent  
  6:     24 wh       6 bl 
  7:     27 wh       3 bl 
  8:      9 wh      21 bl 
  9:      6 wh      24 bl 

##### next Spiel56: 	##### 

commonPlGr:
#Feld   :   ct :ctVisMode:ctVisible:Nuggets:Ct_local:Ct_global;NugVisible:Cleared:Players
 -5, -2 :    0 :     0   :   false :     0 :      0 :      0  :     true : false :  6, 
  5,  2 :    0 :     0   :   false :     0 :      0 :      0  :     true : false :  7, 
  2, -3 :    0 :     0   :   false :     0 :      0 :      0  :     true : false :  8, 
  3,  5 :    0 :     0   :   false :     0 :      0 :      0  :     true : false :  9, 
  0,  0 :    0 :     0   :   false :     0 :      0 :      0  :     true : false :  1,   3,   5,   4,   2,   0, 

Startzeit: 17:28:04,290


last common playground
#Feld   :   ct :ctVisMode:ctVisible:Nuggets:Ct_local:Ct_global;NugVisible:Cleared:Players
 -5, -2 :    0 :     0   :   false :     0 :      0 :      0  :     true : false :  6, 
  5,  2 :    0 :     0   :   false :     0 :      0 :      0  :     true : false :  0,   3,   5,   1,   2,   7, 
  2, -3 :    0 :     0   :   false :     0 :      0 :      0  :     true : false :  8, 
  3,  5 :    0 :     0   :   false :     0 :      0 :      0  :     true : false :  4,   9, 

Balances: saldo  pay  groupbonus
  0:    267 Cent      10 Cent     12 Cent  
  1:    235 Cent      10 Cent     12 Cent  
  2:    235 Cent      10 Cent     12 Cent  
  3:    267 Cent      10 Cent     12 Cent  
  4:    189 Cent       0 Cent      0 Cent  
  5:    267 Cent      10 Cent     12 Cent  
  6:     24 wh       6 bl 
  7:     27 wh       3 bl 
  8:      9 wh      21 bl 
  9:      6 wh      24 bl 

##### next Spiel56: 	##### 

commonPlGr:
#Feld   :   ct :ctVisMode:ctVisible:Nuggets:Ct_local:Ct_global;NugVisible:Cleared:Players
 -5, -3 :    0 :     0   :   false :     0 :      0 :      0  :     true : false :  6, 
 -3,  2 :    0 :     0   :   false :     0 :      0 :      0  :     true : false :  7, 
  3, -2 :    0 :     0   :   false :     0 :      0 :      0  :     true : false :  8, 
 -2, -5 :    0 :     0   :   false :     0 :      0 :      0  :     true : false :  9, 
  0,  0 :    0 :     0   :   false :     0 :      0 :      0  :     true : false :  1,   3,   5,   4,   2,   0, 

Startzeit: 17:28:24,608


last common playground
#Feld   :   ct :ctVisMode:ctVisible:Nuggets:Ct_local:Ct_global;NugVisible:Cleared:Players
 -5, -3 :    0 :     0   :   false :     0 :      0 :      0  :     true : false :  5,   6,   3,   4,   2,   1,   0, 
 -3,  2 :    0 :     0   :   false :     0 :      0 :      0  :     true : false :  7, 
  3, -2 :    0 :     0   :   false :     0 :      0 :      0  :     true : false :  8, 
 -2, -5 :    0 :     0   :   false :     0 :      0 :      0  :     true : false :  9, 

Balances: saldo  pay  groupbonus
  0:    282 Cent       0 Cent     15 Cent  
  1:    250 Cent       0 Cent     15 Cent  
  2:    250 Cent       0 Cent     15 Cent  
  3:    282 Cent       0 Cent     15 Cent  
  4:    204 Cent       0 Cent     15 Cent  
  5:    282 Cent       0 Cent     15 Cent  
  6:     24 wh       6 bl 
  7:     27 wh       3 bl 
  8:      9 wh      21 bl 
  9:      6 wh      24 bl 

##### next Spiel56: 	##### 

commonPlGr:
#Feld   :   ct :ctVisMode:ctVisible:Nuggets:Ct_local:Ct_global;NugVisible:Cleared:Players
 -5, -3 :    0 :     0   :   false :     0 :      0 :      0  :     true : false :  6, 
  2,  5 :    0 :     0   :   false :     0 :      0 :      0  :     true : false :  7, 
 -2, -5 :    0 :     0   :   false :     0 :      0 :      0  :     true : false :  8, 
 -3,  2 :    0 :     0   :   false :     0 :      0 :      0  :     true : false :  9, 
  0,  0 :    0 :     0   :   false :     0 :      0 :      0  :     true : false :  1,   3,   5,   4,   2,   0, 

Startzeit: 17:28:43,554


last common playground
#Feld   :   ct :ctVisMode:ctVisible:Nuggets:Ct_local:Ct_global;NugVisible:Cleared:Players
 -5, -3 :    0 :     0   :   false :     0 :      0 :      0  :     true : false :  6, 
  2,  5 :    0 :     0   :   false :     0 :      0 :      0  :     true : false :  7, 
 -2, -5 :    0 :     0   :   false :     0 :      0 :      0  :     true : false :  8, 
 -3,  2 :    0 :     0   :   false :     0 :      0 :      0  :     true : false :  2,   3,   0,   1,   9,   4,   5, 

Balances: saldo  pay  groupbonus
  0:    297 Cent       0 Cent     15 Cent  
  1:    265 Cent       0 Cent     15 Cent  
  2:    265 Cent       0 Cent     15 Cent  
  3:    297 Cent       0 Cent     15 Cent  
  4:    219 Cent       0 Cent     15 Cent  
  5:    297 Cent       0 Cent     15 Cent  
  6:     24 wh       6 bl 
  7:     27 wh       3 bl 
  8:      9 wh      21 bl 
  9:      6 wh      24 bl 

##### next Spiel56: 	##### 

commonPlGr:
#Feld   :   ct :ctVisMode:ctVisible:Nuggets:Ct_local:Ct_global;NugVisible:Cleared:Players
 -5, -1 :    0 :     0   :   false :     0 :      0 :      0  :     true : false :  6, 
 -1,  4 :    0 :     0   :   false :     0 :      0 :      0  :     true : false :  7, 
 -4, -5 :    0 :     0   :   false :     0 :      0 :      0  :     true : false :  8, 
  1, -4 :    0 :     0   :   false :     0 :      0 :      0  :     true : false :  9, 
  0,  0 :    0 :     0   :   false :     0 :      0 :      0  :     true : false :  1,   3,   5,   4,   2,   0, 

Startzeit: 17:29:01,201


last common playground
#Feld   :   ct :ctVisMode:ctVisible:Nuggets:Ct_local:Ct_global;NugVisible:Cleared:Players
 -5, -1 :    0 :     0   :   false :     0 :      0 :      0  :     true : false :  5,   0,   3,   2,   6, 
 -1,  4 :    0 :     0   :   false :     0 :      0 :      0  :     true : false :  1,   4,   7, 
 -4, -5 :    0 :     0   :   false :     0 :      0 :      0  :     true : false :  8, 
  1, -4 :    0 :     0   :   false :     0 :      0 :      0  :     true : false :  9, 

Balances: saldo  pay  groupbonus
  0:    306 Cent       0 Cent      9 Cent  
  1:    278 Cent      10 Cent      3 Cent  
  2:    274 Cent       0 Cent      9 Cent  
  3:    306 Cent       0 Cent      9 Cent  
  4:    232 Cent      10 Cent      3 Cent  
  5:    306 Cent       0 Cent      9 Cent  
  6:     24 wh       6 bl 
  7:     27 wh       3 bl 
  8:      9 wh      21 bl 
  9:      6 wh      24 bl 

##### next Spiel56: 	##### 

commonPlGr:
#Feld   :   ct :ctVisMode:ctVisible:Nuggets:Ct_local:Ct_global;NugVisible:Cleared:Players
 -2,  3 :    0 :     0   :   false :     0 :      0 :      0  :     true : false :  6, 
 -3, -5 :    0 :     0   :   false :     0 :      0 :      0  :     true : false :  7, 
  2, -3 :    0 :     0   :   false :     0 :      0 :      0  :     true : false :  8, 
  5,  2 :    0 :     0   :   false :     0 :      0 :      0  :     true : false :  9, 
  0,  0 :    0 :     0   :   false :     0 :      0 :      0  :     true : false :  1,   3,   5,   4,   2,   0, 

Startzeit: 17:29:20,368


last common playground
#Feld   :   ct :ctVisMode:ctVisible:Nuggets:Ct_local:Ct_global;NugVisible:Cleared:Players
 -2,  3 :    0 :     0   :   false :     0 :      0 :      0  :     true : false :  6, 
 -3, -5 :    0 :     0   :   false :     0 :      0 :      0  :     true : false :  7, 
  2, -3 :    0 :     0   :   false :     0 :      0 :      0  :     true : false :  4,   1,   0,   5,   3,   2,   8, 
  5,  2 :    0 :     0   :   false :     0 :      0 :      0  :     true : false :  9, 

Balances: saldo  pay  groupbonus
  0:    351 Cent      30 Cent     15 Cent  
  1:    323 Cent      30 Cent     15 Cent  
  2:    319 Cent      30 Cent     15 Cent  
  3:    351 Cent      30 Cent     15 Cent  
  4:    277 Cent      30 Cent     15 Cent  
  5:    351 Cent      30 Cent     15 Cent  
  6:     24 wh       6 bl 
  7:     27 wh       3 bl 
  8:      9 wh      21 bl 
  9:      6 wh      24 bl 

##### next Spiel56: 	##### 

commonPlGr:
#Feld   :   ct :ctVisMode:ctVisible:Nuggets:Ct_local:Ct_global;NugVisible:Cleared:Players
 -5, -3 :    0 :     0   :   false :     0 :      0 :      0  :     true : false :  6, 
  5,  3 :    0 :     0   :   false :     0 :      0 :      0  :     true : false :  7, 
 -2, -5 :    0 :     0   :   false :     0 :      0 :      0  :     true : false :  8, 
  2,  5 :    0 :     0   :   false :     0 :      0 :      0  :     true : false :  9, 
  0,  0 :    0 :     0   :   false :     0 :      0 :      0  :     true : false :  1,   3,   5,   4,   2,   0, 

Startzeit: 17:29:37,490


last common playground
#Feld   :   ct :ctVisMode:ctVisible:Nuggets:Ct_local:Ct_global;NugVisible:Cleared:Players
 -5, -3 :    0 :     0   :   false :     0 :      0 :      0  :     true : false :  6, 
  5,  3 :    0 :     0   :   false :     0 :      0 :      0  :     true : false :  7, 
 -2, -5 :    0 :     0   :   false :     0 :      0 :      0  :     true : false :  1,   5,   4,   3,   0,   2,   8, 
  2,  5 :    0 :     0   :   false :     0 :      0 :      0  :     true : false :  9, 

Balances: saldo  pay  groupbonus
  0:    366 Cent       0 Cent     15 Cent  
  1:    338 Cent       0 Cent     15 Cent  
  2:    334 Cent       0 Cent     15 Cent  
  3:    366 Cent       0 Cent     15 Cent  
  4:    292 Cent       0 Cent     15 Cent  
  5:    366 Cent       0 Cent     15 Cent  
  6:     24 wh       6 bl 
  7:     27 wh       3 bl 
  8:      9 wh      21 bl 
  9:      6 wh      24 bl 

##### next Spiel56: 	##### 

commonPlGr:
#Feld   :   ct :ctVisMode:ctVisible:Nuggets:Ct_local:Ct_global;NugVisible:Cleared:Players
  5,  4 :    0 :     0   :   false :     0 :      0 :      0  :     true : false :  6, 
 -5, -4 :    0 :     0   :   false :     0 :      0 :      0  :     true : false :  7, 
  4, -1 :    0 :     0   :   false :     0 :      0 :      0  :     true : false :  8, 
  1,  5 :    0 :     0   :   false :     0 :      0 :      0  :     true : false :  9, 
  0,  0 :    0 :     0   :   false :     0 :      0 :      0  :     true : false :  1,   3,   5,   4,   2,   0, 

Startzeit: 17:29:56,057


last common playground
#Feld   :   ct :ctVisMode:ctVisible:Nuggets:Ct_local:Ct_global;NugVisible:Cleared:Players
  5,  4 :    0 :     0   :   false :     0 :      0 :      0  :     true : false :  0,   6, 
 -5, -4 :    0 :     0   :   false :     0 :      0 :      0  :     true : false :  7,   3,   4,   2,   5,   1, 
  4, -1 :    0 :     0   :   false :     0 :      0 :      0  :     true : false :  8, 
  1,  5 :    0 :     0   :   false :     0 :      0 :      0  :     true : false :  9, 

Balances: saldo  pay  groupbonus
  0:    396 Cent      30 Cent      0 Cent  
  1:    360 Cent      10 Cent     12 Cent  
  2:    356 Cent      10 Cent     12 Cent  
  3:    388 Cent      10 Cent     12 Cent  
  4:    314 Cent      10 Cent     12 Cent  
  5:    388 Cent      10 Cent     12 Cent  
  6:     24 wh       6 bl 
  7:     27 wh       3 bl 
  8:      9 wh      21 bl 
  9:      6 wh      24 bl 

##### next Spiel56: 	##### 

commonPlGr:
#Feld   :   ct :ctVisMode:ctVisible:Nuggets:Ct_local:Ct_global;NugVisible:Cleared:Players
  5,  1 :    0 :     0   :   false :     0 :      0 :      0  :     true : false :  6, 
 -5, -1 :    0 :     0   :   false :     0 :      0 :      0  :     true : false :  7, 
 -4, -5 :    0 :     0   :   false :     0 :      0 :      0  :     true : false :  8, 
 -1,  4 :    0 :     0   :   false :     0 :      0 :      0  :     true : false :  9, 
  0,  0 :    0 :     0   :   false :     0 :      0 :      0  :     true : false :  1,   3,   5,   4,   2,   0, 

Startzeit: 17:30:13,947


last common playground
#Feld   :   ct :ctVisMode:ctVisible:Nuggets:Ct_local:Ct_global;NugVisible:Cleared:Players
  5,  1 :    0 :     0   :   false :     0 :      0 :      0  :     true : false :  3,   4,   1,   6, 
 -5, -1 :    0 :     0   :   false :     0 :      0 :      0  :     true : false :  7,   0,   2, 
 -4, -5 :    0 :     0   :   false :     0 :      0 :      0  :     true : false :  8, 
 -1,  4 :    0 :     0   :   false :     0 :      0 :      0  :     true : false :  9, 
  4,  0 :    0 :     0   :   false :     0 :      0 :      0  :     true : false :  5, 

Balances: saldo  pay  groupbonus
  0:    409 Cent      10 Cent      3 Cent  
  1:    396 Cent      30 Cent      6 Cent  
  2:    369 Cent      10 Cent      3 Cent  
  3:    424 Cent      30 Cent      6 Cent  
  4:    350 Cent      30 Cent      6 Cent  
  5:    388 Cent       0 Cent      0 Cent  
  6:     24 wh       6 bl 
  7:     27 wh       3 bl 
  8:      9 wh      21 bl 
  9:      6 wh      24 bl 

##### next Spiel56: 	##### 

commonPlGr:
#Feld   :   ct :ctVisMode:ctVisible:Nuggets:Ct_local:Ct_global;NugVisible:Cleared:Players
 -1, -5 :    0 :     0   :   false :     0 :      0 :      0  :     true : false :  6, 
  4, -1 :    0 :     0   :   false :     0 :      0 :      0  :     true : false :  7, 
 -5, -4 :    0 :     0   :   false :     0 :      0 :      0  :     true : false :  8, 
  5,  4 :    0 :     0   :   false :     0 :      0 :      0  :     true : false :  9, 
  0,  0 :    0 :     0   :   false :     0 :      0 :      0  :     true : false :  1,   3,   5,   4,   2,   0, 

Startzeit: 17:30:35,907


last common playground
#Feld   :   ct :ctVisMode:ctVisible:Nuggets:Ct_local:Ct_global;NugVisible:Cleared:Players
 -1, -5 :    0 :     0   :   false :     0 :      0 :      0  :     true : false :  4,   5,   1,   3,   2,   6, 
  4, -1 :    0 :     0   :   false :     0 :      0 :      0  :     true : false :  7, 
 -5, -4 :    0 :     0   :   false :     0 :      0 :      0  :     true : false :  8, 
  5,  4 :    0 :     0   :   false :     0 :      0 :      0  :     true : false :  0,   9, 

Balances: saldo  pay  groupbonus
  0:    409 Cent       0 Cent      0 Cent  
  1:    408 Cent       0 Cent     12 Cent  
  2:    381 Cent       0 Cent     12 Cent  
  3:    436 Cent       0 Cent     12 Cent  
  4:    362 Cent       0 Cent     12 Cent  
  5:    400 Cent       0 Cent     12 Cent  
  6:     24 wh       6 bl 
  7:     27 wh       3 bl 
  8:      9 wh      21 bl 
  9:      6 wh      24 bl 

##### next Spiel56: 	##### 

commonPlGr:
#Feld   :   ct :ctVisMode:ctVisible:Nuggets:Ct_local:Ct_global;NugVisible:Cleared:Players
  5,  1 :    0 :     0   :   false :     0 :      0 :      0  :     true : false :  6, 
 -1,  4 :    0 :     0   :   false :     0 :      0 :      0  :     true : false :  7, 
  1, -4 :    0 :     0   :   false :     0 :      0 :      0  :     true : false :  8, 
  4,  5 :    0 :     0   :   false :     0 :      0 :      0  :     true : false :  9, 
  0,  0 :    0 :     0   :   false :     0 :      0 :      0  :     true : false :  1,   3,   5,   4,   2,   0, 

Startzeit: 17:30:58,721


last common playground
#Feld   :   ct :ctVisMode:ctVisible:Nuggets:Ct_local:Ct_global;NugVisible:Cleared:Players
  5,  1 :    0 :     0   :   false :     0 :      0 :      0  :     true : false :  6, 
 -1,  4 :    0 :     0   :   false :     0 :      0 :      0  :     true : false :  4,   3,   1,   0,   5,   2,   7, 
  1, -4 :    0 :     0   :   false :     0 :      0 :      0  :     true : false :  8, 
  4,  5 :    0 :     0   :   false :     0 :      0 :      0  :     true : false :  9, 

Balances: saldo  pay  groupbonus
  0:    434 Cent      10 Cent     15 Cent  
  1:    433 Cent      10 Cent     15 Cent  
  2:    406 Cent      10 Cent     15 Cent  
  3:    461 Cent      10 Cent     15 Cent  
  4:    387 Cent      10 Cent     15 Cent  
  5:    425 Cent      10 Cent     15 Cent  
  6:     24 wh       6 bl 
  7:     27 wh       3 bl 
  8:      9 wh      21 bl 
  9:      6 wh      24 bl 

##### next Spiel56: 	##### 

commonPlGr:
#Feld   :   ct :ctVisMode:ctVisible:Nuggets:Ct_local:Ct_global;NugVisible:Cleared:Players
 -1, -5 :    0 :     0   :   false :     0 :      0 :      0  :     true : false :  6, 
  1,  5 :    0 :     0   :   false :     0 :      0 :      0  :     true : false :  7, 
  5,  4 :    0 :     0   :   false :     0 :      0 :      0  :     true : false :  8, 
  4, -1 :    0 :     0   :   false :     0 :      0 :      0  :     true : false :  9, 
  0,  0 :    0 :     0   :   false :     0 :      0 :      0  :     true : false :  1,   3,   5,   4,   2,   0, 

Startzeit: 17:31:16,715


last common playground
#Feld   :   ct :ctVisMode:ctVisible:Nuggets:Ct_local:Ct_global;NugVisible:Cleared:Players
 -1, -5 :    0 :     0   :   false :     0 :      0 :      0  :     true : false :  6, 
  1,  5 :    0 :     0   :   false :     0 :      0 :      0  :     true : false :  7, 
  5,  4 :    0 :     0   :   false :     0 :      0 :      0  :     true : false :  2,   0,   5,   4,   3,   1,   8, 
  4, -1 :    0 :     0   :   false :     0 :      0 :      0  :     true : false :  9, 

Balances: saldo  pay  groupbonus
  0:    449 Cent       0 Cent     15 Cent  
  1:    448 Cent       0 Cent     15 Cent  
  2:    421 Cent       0 Cent     15 Cent  
  3:    476 Cent       0 Cent     15 Cent  
  4:    402 Cent       0 Cent     15 Cent  
  5:    440 Cent       0 Cent     15 Cent  
  6:     24 wh       6 bl 
  7:     27 wh       3 bl 
  8:      9 wh      21 bl 
  9:      6 wh      24 bl 

##### next Spiel56: 	##### 

commonPlGr:
#Feld   :   ct :ctVisMode:ctVisible:Nuggets:Ct_local:Ct_global;NugVisible:Cleared:Players
  5,  2 :    0 :     0   :   false :     0 :      0 :      0  :     true : false :  6, 
  2, -3 :    0 :     0   :   false :     0 :      0 :      0  :     true : false :  7, 
 -3, -5 :    0 :     0   :   false :     0 :      0 :      0  :     true : false :  8, 
 -5, -2 :    0 :     0   :   false :     0 :      0 :      0  :     true : false :  9, 
  0,  0 :    0 :     0   :   false :     0 :      0 :      0  :     true : false :  1,   3,   5,   4,   2,   0, 

Startzeit: 17:31:39,458


last common playground
#Feld   :   ct :ctVisMode:ctVisible:Nuggets:Ct_local:Ct_global;NugVisible:Cleared:Players
  5,  2 :    0 :     0   :   false :     0 :      0 :      0  :     true : false :  0,   6, 
  2, -3 :    0 :     0   :   false :     0 :      0 :      0  :     true : false :  7, 
 -3, -5 :    0 :     0   :   false :     0 :      0 :      0  :     true : false :  8, 
 -5, -2 :    0 :     0   :   false :     0 :      0 :      0  :     true : false :  9,   4,   3,   2,   5,   1, 

Balances: saldo  pay  groupbonus
  0:    479 Cent      30 Cent      0 Cent  
  1:    460 Cent       0 Cent     12 Cent  
  2:    433 Cent       0 Cent     12 Cent  
  3:    488 Cent       0 Cent     12 Cent  
  4:    414 Cent       0 Cent     12 Cent  
  5:    452 Cent       0 Cent     12 Cent  
  6:     24 wh       6 bl 
  7:     27 wh       3 bl 
  8:      9 wh      21 bl 
  9:      6 wh      24 bl 

##### next Spiel56: 	##### 

commonPlGr:
#Feld   :   ct :ctVisMode:ctVisible:Nuggets:Ct_local:Ct_global;NugVisible:Cleared:Players
  4, -1 :    0 :     0   :   false :     0 :      0 :      0  :     true : false :  6, 
  5,  4 :    0 :     0   :   false :     0 :      0 :      0  :     true : false :  7, 
 -4,  1 :    0 :     0   :   false :     0 :      0 :      0  :     true : false :  8, 
 -5, -4 :    0 :     0   :   false :     0 :      0 :      0  :     true : false :  9, 
  0,  0 :    0 :     0   :   false :     0 :      0 :      0  :     true : false :  1,   3,   5,   4,   2,   0, 

Startzeit: 17:31:58,117


last common playground
#Feld   :   ct :ctVisMode:ctVisible:Nuggets:Ct_local:Ct_global;NugVisible:Cleared:Players
  4, -1 :    0 :     0   :   false :     0 :      0 :      0  :     true : false :  6, 
  5,  4 :    0 :     0   :   false :     0 :      0 :      0  :     true : false :  7, 
 -4,  1 :    0 :     0   :   false :     0 :      0 :      0  :     true : false :  3,   1,   4,   0,   5,   8, 
 -5, -4 :    0 :     0   :   false :     0 :      0 :      0  :     true : false :  2,   9, 

Balances: saldo  pay  groupbonus
  0:    491 Cent       0 Cent     12 Cent  
  1:    472 Cent       0 Cent     12 Cent  
  2:    433 Cent       0 Cent      0 Cent  
  3:    500 Cent       0 Cent     12 Cent  
  4:    426 Cent       0 Cent     12 Cent  
  5:    464 Cent       0 Cent     12 Cent  
  6:     24 wh       6 bl 
  7:     27 wh       3 bl 
  8:      9 wh      21 bl 
  9:      6 wh      24 bl 

##### next Spiel56: 	##### 

commonPlGr:
#Feld   :   ct :ctVisMode:ctVisible:Nuggets:Ct_local:Ct_global;NugVisible:Cleared:Players
 -1, -5 :    0 :     0   :   false :     0 :      0 :      0  :     true : false :  6, 
 -5, -4 :    0 :     0   :   false :     0 :      0 :      0  :     true : false :  7, 
 -4,  1 :    0 :     0   :   false :     0 :      0 :      0  :     true : false :  8, 
  1,  5 :    0 :     0   :   false :     0 :      0 :      0  :     true : false :  9, 
  0,  0 :    0 :     0   :   false :     0 :      0 :      0  :     true : false :  1,   3,   5,   4,   2,   0, 

Startzeit: 17:32:18,848


last common playground
#Feld   :   ct :ctVisMode:ctVisible:Nuggets:Ct_local:Ct_global;NugVisible:Cleared:Players
 -1, -5 :    0 :     0   :   false :     0 :      0 :      0  :     true : false :  5,   4,   1,   2,   0,   6,   3, 
 -5, -4 :    0 :     0   :   false :     0 :      0 :      0  :     true : false :  7, 
 -4,  1 :    0 :     0   :   false :     0 :      0 :      0  :     true : false :  8, 
  1,  5 :    0 :     0   :   false :     0 :      0 :      0  :     true : false :  9, 

Balances: saldo  pay  groupbonus
  0:    536 Cent      30 Cent     15 Cent  
  1:    517 Cent      30 Cent     15 Cent  
  2:    478 Cent      30 Cent     15 Cent  
  3:    545 Cent      30 Cent     15 Cent  
  4:    471 Cent      30 Cent     15 Cent  
  5:    509 Cent      30 Cent     15 Cent  
  6:     24 wh       6 bl 
  7:     27 wh       3 bl 
  8:      9 wh      21 bl 
  9:      6 wh      24 bl 

##### next Spiel56: 	##### 

commonPlGr:
#Feld   :   ct :ctVisMode:ctVisible:Nuggets:Ct_local:Ct_global;NugVisible:Cleared:Players
  3, -2 :    0 :     0   :   false :     0 :      0 :      0  :     true : false :  6, 
 -5, -3 :    0 :     0   :   false :     0 :      0 :      0  :     true : false :  7, 
 -3,  2 :    0 :     0   :   false :     0 :      0 :      0  :     true : false :  8, 
  5,  3 :    0 :     0   :   false :     0 :      0 :      0  :     true : false :  9, 
  0,  0 :    0 :     0   :   false :     0 :      0 :      0  :     true : false :  1,   3,   5,   4,   2,   0, 

Startzeit: 17:32:35,638


last common playground
#Feld   :   ct :ctVisMode:ctVisible:Nuggets:Ct_local:Ct_global;NugVisible:Cleared:Players
  3, -2 :    0 :     0   :   false :     0 :      0 :      0  :     true : false :  2,   5,   4,   1,   3,   0,   6, 
 -5, -3 :    0 :     0   :   false :     0 :      0 :      0  :     true : false :  7, 
 -3,  2 :    0 :     0   :   false :     0 :      0 :      0  :     true : false :  8, 
  5,  3 :    0 :     0   :   false :     0 :      0 :      0  :     true : false :  9, 

Balances: saldo  pay  groupbonus
  0:    581 Cent      30 Cent     15 Cent  
  1:    562 Cent      30 Cent     15 Cent  
  2:    523 Cent      30 Cent     15 Cent  
  3:    590 Cent      30 Cent     15 Cent  
  4:    516 Cent      30 Cent     15 Cent  
  5:    554 Cent      30 Cent     15 Cent  
  6:     24 wh       6 bl 
  7:     27 wh       3 bl 
  8:      9 wh      21 bl 
  9:      6 wh      24 bl 

##### next Spiel56: 	##### 

commonPlGr:
#Feld   :   ct :ctVisMode:ctVisible:Nuggets:Ct_local:Ct_global;NugVisible:Cleared:Players
 -1, -5 :    0 :     0   :   false :     0 :      0 :      0  :     true : false :  6, 
  4, -1 :    0 :     0   :   false :     0 :      0 :      0  :     true : false :  7, 
  1,  5 :    0 :     0   :   false :     0 :      0 :      0  :     true : false :  8, 
 -5, -4 :    0 :     0   :   false :     0 :      0 :      0  :     true : false :  9, 
  0,  0 :    0 :     0   :   false :     0 :      0 :      0  :     true : false :  1,   3,   5,   4,   2,   0, 

Startzeit: 17:32:53,240


last common playground
#Feld   :   ct :ctVisMode:ctVisible:Nuggets:Ct_local:Ct_global;NugVisible:Cleared:Players
 -1, -5 :    0 :     0   :   false :     0 :      0 :      0  :     true : false :  1,   4,   2,   5,   3,   0,   6, 
  4, -1 :    0 :     0   :   false :     0 :      0 :      0  :     true : false :  7, 
  1,  5 :    0 :     0   :   false :     0 :      0 :      0  :     true : false :  8, 
 -5, -4 :    0 :     0   :   false :     0 :      0 :      0  :     true : false :  9, 

Balances: saldo  pay  groupbonus
  0:    626 Cent      30 Cent     15 Cent  
  1:    607 Cent      30 Cent     15 Cent  
  2:    568 Cent      30 Cent     15 Cent  
  3:    635 Cent      30 Cent     15 Cent  
  4:    561 Cent      30 Cent     15 Cent  
  5:    599 Cent      30 Cent     15 Cent  
  6:     24 wh       6 bl 
  7:     27 wh       3 bl 
  8:      9 wh      21 bl 
  9:      6 wh      24 bl 

##### next Spiel56: 	##### 

commonPlGr:
#Feld   :   ct :ctVisMode:ctVisible:Nuggets:Ct_local:Ct_global;NugVisible:Cleared:Players
  2,  5 :    0 :     0   :   false :     0 :      0 :      0  :     true : false :  6, 
 -5, -3 :    0 :     0   :   false :     0 :      0 :      0  :     true : false :  7, 
 -3,  2 :    0 :     0   :   false :     0 :      0 :      0  :     true : false :  8, 
  5,  3 :    0 :     0   :   false :     0 :      0 :      0  :     true : false :  9, 
  0,  0 :    0 :     0   :   false :     0 :      0 :      0  :     true : false :  1,   3,   5,   4,   2,   0, 

Startzeit: 17:33:09,386


last common playground
#Feld   :   ct :ctVisMode:ctVisible:Nuggets:Ct_local:Ct_global;NugVisible:Cleared:Players
  2,  5 :    0 :     0   :   false :     0 :      0 :      0  :     true : false :  0,   3,   2,   4,   5,   1,   6, 
 -5, -3 :    0 :     0   :   false :     0 :      0 :      0  :     true : false :  7, 
 -3,  2 :    0 :     0   :   false :     0 :      0 :      0  :     true : false :  8, 
  5,  3 :    0 :     0   :   false :     0 :      0 :      0  :     true : false :  9, 

Balances: saldo  pay  groupbonus
  0:    671 Cent      30 Cent     15 Cent  
  1:    652 Cent      30 Cent     15 Cent  
  2:    613 Cent      30 Cent     15 Cent  
  3:    680 Cent      30 Cent     15 Cent  
  4:    606 Cent      30 Cent     15 Cent  
  5:    644 Cent      30 Cent     15 Cent  
  6:     24 wh       6 bl 
  7:     27 wh       3 bl 
  8:      9 wh      21 bl 
  9:      6 wh      24 bl 

##### next Spiel56: 	##### 

commonPlGr:
#Feld   :   ct :ctVisMode:ctVisible:Nuggets:Ct_local:Ct_global;NugVisible:Cleared:Players
 -5, -3 :    0 :     0   :   false :     0 :      0 :      0  :     true : false :  6, 
  2,  5 :    0 :     0   :   false :     0 :      0 :      0  :     true : false :  7, 
 -3,  2 :    0 :     0   :   false :     0 :      0 :      0  :     true : false :  8, 
  3, -2 :    0 :     0   :   false :     0 :      0 :      0  :     true : false :  9, 
  0,  0 :    0 :     0   :   false :     0 :      0 :      0  :     true : false :  1,   3,   5,   4,   2,   0, 

Startzeit: 17:33:26,622


last common playground
#Feld   :   ct :ctVisMode:ctVisible:Nuggets:Ct_local:Ct_global;NugVisible:Cleared:Players
 -5, -3 :    0 :     0   :   false :     0 :      0 :      0  :     true : false :  6,   0,   3,   5,   1,   2, 
  2,  5 :    0 :     0   :   false :     0 :      0 :      0  :     true : false :  7, 
 -3,  2 :    0 :     0   :   false :     0 :      0 :      0  :     true : false :  4,   8, 
  3, -2 :    0 :     0   :   false :     0 :      0 :      0  :     true : false :  9, 

Balances: saldo  pay  groupbonus
  0:    713 Cent      30 Cent     12 Cent  
  1:    694 Cent      30 Cent     12 Cent  
  2:    655 Cent      30 Cent     12 Cent  
  3:    722 Cent      30 Cent     12 Cent  
  4:    606 Cent       0 Cent      0 Cent  
  5:    686 Cent      30 Cent     12 Cent  
  6:     24 wh       6 bl 
  7:     27 wh       3 bl 
  8:      9 wh      21 bl 
  9:      6 wh      24 bl 

##### next Spiel56: 	##### 

commonPlGr:
#Feld   :   ct :ctVisMode:ctVisible:Nuggets:Ct_local:Ct_global;NugVisible:Cleared:Players
 -4,  1 :    0 :     0   :   false :     0 :      0 :      0  :     true : false :  6, 
  1,  5 :    0 :     0   :   false :     0 :      0 :      0  :     true : false :  7, 
  4, -1 :    0 :     0   :   false :     0 :      0 :      0  :     true : false :  8, 
 -1, -5 :    0 :     0   :   false :     0 :      0 :      0  :     true : false :  9, 
  0,  0 :    0 :     0   :   false :     0 :      0 :      0  :     true : false :  1,   3,   5,   4,   2,   0, 

Startzeit: 17:33:43,707


last common playground
#Feld   :   ct :ctVisMode:ctVisible:Nuggets:Ct_local:Ct_global;NugVisible:Cleared:Players
 -4,  1 :    0 :     0   :   false :     0 :      0 :      0  :     true : false :  5,   0,   2,   3,   6,   1, 
  1,  5 :    0 :     0   :   false :     0 :      0 :      0  :     true : false :  7, 
  4, -1 :    0 :     0   :   false :     0 :      0 :      0  :     true : false :  8, 
 -1, -5 :    0 :     0   :   false :     0 :      0 :      0  :     true : false :  4,   9, 

Balances: saldo  pay  groupbonus
  0:    725 Cent       0 Cent     12 Cent  
  1:    706 Cent       0 Cent     12 Cent  
  2:    667 Cent       0 Cent     12 Cent  
  3:    734 Cent       0 Cent     12 Cent  
  4:    606 Cent       0 Cent      0 Cent  
  5:    698 Cent       0 Cent     12 Cent  
  6:     24 wh       6 bl 
  7:     27 wh       3 bl 
  8:      9 wh      21 bl 
  9:      6 wh      24 bl 

##### next Spiel56: 	##### 

commonPlGr:
#Feld   :   ct :ctVisMode:ctVisible:Nuggets:Ct_local:Ct_global;NugVisible:Cleared:Players
  2, -3 :    0 :     0   :   false :     0 :      0 :      0  :     true : false :  6, 
 -5, -2 :    0 :     0   :   false :     0 :      0 :      0  :     true : false :  7, 
  3,  5 :    0 :     0   :   false :     0 :      0 :      0  :     true : false :  8, 
 -2,  3 :    0 :     0   :   false :     0 :      0 :      0  :     true : false :  9, 
  0,  0 :    0 :     0   :   false :     0 :      0 :      0  :     true : false :  1,   3,   5,   4,   2,   0, 

Startzeit: 17:34:00,360


last common playground
#Feld   :   ct :ctVisMode:ctVisible:Nuggets:Ct_local:Ct_global;NugVisible:Cleared:Players
  2, -3 :    0 :     0   :   false :     0 :      0 :      0  :     true : false :  6, 
 -5, -2 :    0 :     0   :   false :     0 :      0 :      0  :     true : false :  3,   7,   4,   5,   2,   1, 
  3,  5 :    0 :     0   :   false :     0 :      0 :      0  :     true : false :  8, 
 -2,  3 :    0 :     0   :   false :     0 :      0 :      0  :     true : false :  0,   9, 

Balances: saldo  pay  groupbonus
  0:    725 Cent       0 Cent      0 Cent  
  1:    728 Cent      10 Cent     12 Cent  
  2:    689 Cent      10 Cent     12 Cent  
  3:    756 Cent      10 Cent     12 Cent  
  4:    628 Cent      10 Cent     12 Cent  
  5:    720 Cent      10 Cent     12 Cent  
  6:     24 wh       6 bl 
  7:     27 wh       3 bl 
  8:      9 wh      21 bl 
  9:      6 wh      24 bl 

##### next Spiel56: 	##### 

commonPlGr:
#Feld   :   ct :ctVisMode:ctVisible:Nuggets:Ct_local:Ct_global;NugVisible:Cleared:Players
 -2,  3 :    0 :     0   :   false :     0 :      0 :      0  :     true : false :  6, 
  2, -3 :    0 :     0   :   false :     0 :      0 :      0  :     true : false :  7, 
 -5, -2 :    0 :     0   :   false :     0 :      0 :      0  :     true : false :  8, 
 -3, -5 :    0 :     0   :   false :     0 :      0 :      0  :     true : false :  9, 
  0,  0 :    0 :     0   :   false :     0 :      0 :      0  :     true : false :  1,   3,   5,   4,   2,   0, 

Startzeit: 17:34:18,121


last common playground
#Feld   :   ct :ctVisMode:ctVisible:Nuggets:Ct_local:Ct_global;NugVisible:Cleared:Players
 -2,  3 :    0 :     0   :   false :     0 :      0 :      0  :     true : false :  3,   1,   4,   6, 
  2, -3 :    0 :     0   :   false :     0 :      0 :      0  :     true : false :  2,   5,   0,   7, 
 -5, -2 :    0 :     0   :   false :     0 :      0 :      0  :     true : false :  8, 
 -3, -5 :    0 :     0   :   false :     0 :      0 :      0  :     true : false :  9, 

Balances: saldo  pay  groupbonus
  0:    741 Cent      10 Cent      6 Cent  
  1:    764 Cent      30 Cent      6 Cent  
  2:    705 Cent      10 Cent      6 Cent  
  3:    792 Cent      30 Cent      6 Cent  
  4:    664 Cent      30 Cent      6 Cent  
  5:    736 Cent      10 Cent      6 Cent  
  6:     24 wh       6 bl 
  7:     27 wh       3 bl 
  8:      9 wh      21 bl 
  9:      6 wh      24 bl 

##### next Spiel56: 	##### 

commonPlGr:
#Feld   :   ct :ctVisMode:ctVisible:Nuggets:Ct_local:Ct_global;NugVisible:Cleared:Players
  2,  5 :    0 :     0   :   false :     0 :      0 :      0  :     true : false :  6, 
  3, -2 :    0 :     0   :   false :     0 :      0 :      0  :     true : false :  7, 
 -2, -5 :    0 :     0   :   false :     0 :      0 :      0  :     true : false :  8, 
 -3,  2 :    0 :     0   :   false :     0 :      0 :      0  :     true : false :  9, 
  0,  0 :    0 :     0   :   false :     0 :      0 :      0  :     true : false :  1,   3,   5,   4,   2,   0, 

Startzeit: 17:34:39,663


last common playground
#Feld   :   ct :ctVisMode:ctVisible:Nuggets:Ct_local:Ct_global;NugVisible:Cleared:Players
  2,  5 :    0 :     0   :   false :     0 :      0 :      0  :     true : false :  4,   3,   0,   2,   5,   1,   6, 
  3, -2 :    0 :     0   :   false :     0 :      0 :      0  :     true : false :  7, 
 -2, -5 :    0 :     0   :   false :     0 :      0 :      0  :     true : false :  8, 
 -3,  2 :    0 :     0   :   false :     0 :      0 :      0  :     true : false :  9, 

Balances: saldo  pay  groupbonus
  0:    756 Cent       0 Cent     15 Cent  
  1:    779 Cent       0 Cent     15 Cent  
  2:    720 Cent       0 Cent     15 Cent  
  3:    807 Cent       0 Cent     15 Cent  
  4:    679 Cent       0 Cent     15 Cent  
  5:    751 Cent       0 Cent     15 Cent  
  6:     24 wh       6 bl 
  7:     27 wh       3 bl 
  8:      9 wh      21 bl 
  9:      6 wh      24 bl 


List of answers to questionnaire:
    /127.0.0.1:43388   2  [[, , , HEDTEN], []] 
    /127.0.0.1:43380   0  [[, , , SAENNE], []] 
    /127.0.0.1:43382   1  [[, , , VAHLVL], []] 
    /127.0.0.1:43394   5  [[, , , doenfr], []] 
    /127.0.0.1:43392   4  [[, , , doerge], []] 
    /127.0.0.1:43390   3  [[, , , GIIMAN], []] 
