"","group","pid","condition","Account","Account.Reward","Account.Bonus","transitivity","LFScores","LQScores","LHScores","LCScores","FieldDistribution","FieldDistribution.MoveLevel","DecisionScore","Comp","Sec","Risk","Incomp","NoAg","HalfChangeRound","PersonalCode","ColorComp","ColorSec","ColorRisk","ColorIncomp"
"1",9,"9_0","cohesion",838,430,408,0.86978845952365,265,173.57,46,219.57,10.6593406593407,2.83071571613988,57,8,5,8,7,2,16,"Inenfr","lila","gruen","blau","rot"
"2",9,"9_1","cohesion",767,380,387,0.86978845952365,539,224.04,334,558.04,10.6593406593407,2.83071571613988,55,8,4,8,7,3,16,"KAENJO","lila","gruen","blau","rot"
"3",9,"9_2","cohesion",768,390,378,0.86978845952365,23,10.92,-4,6.92,10.6593406593407,2.83071571613988,55,8,4,8,7,3,16,"INIMKA","lila","gruen","blau","rot"
"4",9,"9_3","cohesion",812,410,402,0.86978845952365,-675,-305.02,-264,-569.03,10.6593406593407,2.83071571613988,57,9,3,9,6,3,15,"antzho","lila","gruen","blau","rot"
"5",9,"9_4","cohesion",827,470,357,0.86978845952365,-89,-42.38,64,21.62,10.6593406593407,2.83071571613988,60,11,3,8,5,3,15,"ANRGWO","lila","gruen","blau","rot"
"6",9,"9_5","cohesion",838,430,408,0.86978845952365,-63,-61.16,49,-12.16,10.6593406593407,2.83071571613988,55,8,4,8,7,3,16,"SERTIL","lila","gruen","blau","rot"
"7",10,"10_0","cohesion",756,420,336,0.852179018484556,645,331.79,548,879.79,15.018315018315,2.544279418229,71,15,6,5,4,0,15,"HEDTEN","rot","lila","blau","gruen"
"8",10,"10_1","cohesion",779,410,369,0.852179018484556,-255,-126.64,-40,-166.64,15.018315018315,2.544279418229,71,14,8,5,3,0,13,"SAENNE","rot","lila","blau","gruen"
"9",10,"10_2","cohesion",720,360,360,0.852179018484556,197,111.95,252,363.95,15.018315018315,2.544279418229,69,13,9,4,4,0,13,"VAHLVL","rot","lila","blau","gruen"
"10",10,"10_3","cohesion",807,420,387,0.852179018484556,525,196.76,454,650.76,15.018315018315,2.544279418229,73,16,6,5,3,0,13,"doenfr","rot","lila","blau","gruen"
"11",10,"10_4","cohesion",679,370,309,0.852179018484556,-3,-62.16,257,194.84,15.018315018315,2.544279418229,66,12,4,8,6,0,15,"doerge","rot","lila","blau","gruen"
"12",10,"10_5","cohesion",751,370,381,0.852179018484556,-1109,-451.73,-547,-998.73,15.018315018315,2.544279418229,69,14,7,5,3,1,13,"GIIMAN","rot","lila","blau","gruen"
"13",11,"11_0","cohesion",1028,650,378,0.840968295181624,-930,-440.59,-392,-832.59,11.5018315018315,2.62973137973138,83,25,2,1,2,0,10,"PENNHA","rot","blau","lila","gruen"
"14",11,"11_1","cohesion",1068,660,408,0.840968295181624,30,20.26,-28,-7.74,11.5018315018315,2.62973137973138,83,25,3,0,2,0,5,"Peldka","rot","blau","lila","gruen"
"15",11,"11_2","cohesion",1065,660,405,0.840968295181624,136,49.31,84,133.31,11.5018315018315,2.62973137973138,85,26,3,0,1,0,5,"SURGOE","rot","blau","lila","gruen"
"16",11,"11_3","cohesion",1004,620,384,0.840968295181624,-498,-222.76,-269,-491.76,11.5018315018315,2.62973137973138,81,23,5,0,2,0,11,"Karglu","rot","blau","lila","gruen"
"17",11,"11_4","cohesion",1042,670,372,0.840968295181624,450,199.17,220,419.17,11.5018315018315,2.62973137973138,86,27,1,1,1,0,3,"KargPe","rot","blau","lila","gruen"
"18",11,"11_5","cohesion",989,620,369,0.840968295181624,812,394.59,534,928.59,11.5018315018315,2.62973137973138,82,23,5,1,1,0,10,"gaigra","rot","blau","lila","gruen"
"19",12,"12_0","cohesion",562,250,312,0.857706707846176,402,166.53,421,587.52,13.4065934065934,2.89388904106646,64,12,1,9,8,0,15,"pagora","lila","gruen","rot","blau"
"20",12,"12_1","cohesion",607,340,267,0.857706707846176,285,190.5,345,535.49,13.4065934065934,2.89388904106646,63,9,6,9,6,0,17,"DOIMHE","lila","gruen","rot","blau"
"21",12,"12_2","cohesion",577,280,297,0.857706707846176,-45,-44.2,158,113.8,13.4065934065934,2.89388904106646,63,10,4,9,7,0,16,"MaenSt","lila","gruen","rot","blau"
"22",12,"12_3","cohesion",591,270,321,0.857706707846176,454,164.02,575,739.02,13.4065934065934,2.89388904106646,63,11,3,8,8,0,15,"saimra","lila","gruen","rot","blau"
"23",12,"12_4","cohesion",586,250,336,0.857706707846176,-77,12.76,68,80.77,13.4065934065934,2.89388904106646,64,11,3,9,7,0,14,"saiglu","lila","gruen","rot","blau"
"24",12,"12_5","cohesion",639,300,339,0.857706707846176,-1019,-489.58,-358,-847.58,13.4065934065934,2.89388904106646,63,10,5,8,7,0,15,"GIRELE","lila","gruen","rot","blau"
"25",13,"13_0","cohesion",674,290,384,0.859559902412619,288,156.82,167,323.82,12.7838827838828,2.79486060534448,56,7,6,6,11,0,16,"MARGTH","blau","lila","rot","gruen"
"26",13,"13_1","cohesion",618,270,348,0.859559902412619,458,214.45,410,624.45,12.7838827838828,2.79486060534448,52,6,7,5,10,2,16,"Döarha","blau","lila","rot","gruen"
"27",13,"13_2","cohesion",680,290,390,0.859559902412619,348,129.97,356,485.97,12.7838827838828,2.79486060534448,58,8,6,6,10,0,15,"BIDTBE","blau","lila","rot","gruen"
"28",13,"13_3","cohesion",680,290,390,0.859559902412619,-480,-244.73,-160,-404.73,12.7838827838828,2.79486060534448,57,7,6,7,10,0,15,"sildra","blau","lila","rot","gruen"
"29",13,"13_4","cohesion",639,360,279,0.859559902412619,-332,-140.17,124,-16.17,12.7838827838828,2.79486060534448,63,10,5,8,7,0,16,"COERJÖ","blau","lila","rot","gruen"
"30",13,"13_5","cohesion",701,320,381,0.859559902412619,-282,-116.38,-76,-192.38,12.7838827838828,2.79486060534448,56,6,6,8,10,0,15,"IKNAFT","blau","lila","rot","gruen"
"31",14,"14_0","cohesion",612,330,282,0.848292709444083,-363,-173.03,45,-128.03,18.6446886446887,2.73571218768534,72,14,4,10,2,0,14,"heersa","gruen","lila","rot","blau"
"32",14,"14_1","cohesion",658,370,288,0.848292709444083,-334,-141.08,110,-31.08,18.6446886446887,2.73571218768534,65,10,6,9,5,0,15,"DOERGE","gruen","lila","rot","blau"
"33",14,"14_2","cohesion",812,530,282,0.848292709444083,510,231.05,575,806.05,18.6446886446887,2.73571218768534,78,18,2,10,0,0,11,"BIIGMI","gruen","lila","rot","blau"
"34",14,"14_3","cohesion",776,470,306,0.848292709444083,87,45.63,318,363.62,18.6446886446887,2.73571218768534,73,15,5,8,2,0,13,"KAARNO","gruen","lila","rot","blau"
"35",14,"14_4","cohesion",714,420,294,0.848292709444083,50,-21.63,295,273.37,18.6446886446887,2.73571218768534,70,13,6,8,3,0,15,"YEIGVY","gruen","lila","rot","blau"
"36",14,"14_5","cohesion",320,170,150,0.848292709444083,50,59.1,549,608.1,18.6446886446887,2.73571218768534,58,5,11,7,7,0,16,"INIMCA","gruen","lila","rot","blau"
"37",15,"15_0","cohesion",1119,750,369,0.842264469517266,407,198.36,240,438.36,11.5018315018315,2.50469856115018,85,27,1,0,2,0,18,"GIENCH","blau","gruen","rot","lila"
"38",15,"15_1","cohesion",1058,650,408,0.842264469517266,-760,-414.79,-326,-740.79,11.5018315018315,2.50469856115018,84,26,2,0,2,0,4,"Annnmi","blau","gruen","rot","lila"
"39",15,"15_2","cohesion",1044,660,384,0.842264469517266,-31,17.06,-39,-21.94,11.5018315018315,2.50469856115018,79,23,3,0,4,0,12,"YIANXI","blau","gruen","rot","lila"
"40",15,"15_3","cohesion",1069,670,399,0.842264469517266,680,353.38,247,600.38,11.5018315018315,2.50469856115018,85,26,1,2,1,0,4,"INSTTO","blau","gruen","rot","lila"
"41",15,"15_4","cohesion",1054,640,414,0.842264469517266,733,340.87,348,688.87,11.5018315018315,2.50469856115018,83,26,1,0,3,0,4,"CHIMMA","blau","gruen","rot","lila"
"42",15,"15_5","cohesion",1022,620,402,0.842264469517266,-1029,-494.87,-531,-1025.87,11.5018315018315,2.50469856115018,82,25,2,0,3,0,5,"COUMUW","blau","gruen","rot","lila"
"43",16,"16_0","cohesion",1155,720,435,0.86343415706322,-1249,-574.3,-697,-1271.3,10,2.37516739532869,89,29,0,1,0,0,2,"ChelAn","gruen","lila","blau","rot"
"44",16,"16_1","cohesion",1167,720,447,0.86343415706322,-1,-70.92,-103,-173.92,10,2.37516739532869,90,30,0,0,0,0,0,"InEnKa","gruen","lila","blau","rot"
"45",16,"16_2","cohesion",1167,720,447,0.86343415706322,983,557.69,276,833.69,10,2.37516739532869,90,30,0,0,0,0,0,"Oargca","gruen","lila","blau","rot"
"46",16,"16_3","cohesion",1167,720,447,0.86343415706322,223,113.36,-94,19.36,10,2.37516739532869,90,30,0,0,0,0,0,"ANRAMI","gruen","lila","blau","rot"
"47",16,"16_4","cohesion",1167,720,447,0.86343415706322,-469,-306.66,-373,-679.66,10,2.37516739532869,90,30,0,0,0,0,0,"sonelu","gruen","lila","blau","rot"
"48",16,"16_5","cohesion",1167,720,447,0.86343415706322,513,280.84,107,387.84,10,2.37516739532869,90,30,0,0,0,0,0,"heumfr","gruen","lila","blau","rot"
