HC_2022-03-30_17-11-58
PlayOrder: 2,i57,56,56,56,56,56,56,56,56,56,56,56,56,56,56,56,56,56,56,56,56,56,56,56,56,56,56,56,56,56,56,200,
List of players:
    /127.0.0.1:56864  0
    /127.0.0.1:56876  1
    /127.0.0.1:56878  2
    /127.0.0.1:56880  3
    /127.0.0.1:56884  4
    /127.0.0.1:56886  5


##### Spiel2: Vorübung gemeinsam #####  

#Feld   :   ct :ctVisMode:ctVisible:Nuggets:Ct_local:Ct_global;NugVisible:Cleared:Players
  0,  0 :    0 :     0   :   false :     0 :      0 :      0  :     true : false :  1,   3,   5,   4,   2,   0, 


Startzeit: 18:16:15,732

##### Spiel56: Experimentserie mit computed	##### 
List of players:
 id: sj: sj:ctl: vr: nM:nMisMax:  color: wh: bl:pay:isComp 
  0: -3:  0:  0: -1:  0:   true: 000000:  0:  0:  0: false 
  1:  0:  4:  0: -1:  0:   true: 00cf9e:  0:  0:  0: false 
  2: -1: -2:  0: -1:  0:   true: 88b551:  0:  0:  0: false 
  3:  3: -1:  0: -1:  0:   true: fe5f00:  0:  0:  0: false 
  4: -3: -1:  0: -1:  0:   true: ca1551:  0:  0:  0: false 
  5: -1: -2:  0: -1:  0:   true: e56399:  0:  0:  0: false 
  6:  0:  0:  0: -1:  5:   true: 3a7d44: 24:  6: 30:  true 
  7:  0:  0:  0: -1:  5:   true: b3001b: 27:  3: 10:  true 
  8:  0:  0:  0: -1:  5:   true: 750b7d:  9: 21: 30:  true 
  9:  0:  0:  0: -1:  5:   true: 222e50:  6: 24: 10:  true 


##### next Spiel56: 	##### 

commonPlGr:
#Feld   :   ct :ctVisMode:ctVisible:Nuggets:Ct_local:Ct_global;NugVisible:Cleared:Players
  3,  5 :    0 :     0   :   false :     0 :      0 :      0  :     true : false :  6, 
 -2,  3 :    0 :     0   :   false :     0 :      0 :      0  :     true : false :  7, 
 -3, -5 :    0 :     0   :   false :     0 :      0 :      0  :     true : false :  8, 
 -5, -2 :    0 :     0   :   false :     0 :      0 :      0  :     true : false :  9, 
  0,  0 :    0 :     0   :   false :     0 :      0 :      0  :     true : false :  1,   3,   5,   4,   2,   0, 

Startzeit: 18:18:46,693


last common playground
#Feld   :   ct :ctVisMode:ctVisible:Nuggets:Ct_local:Ct_global;NugVisible:Cleared:Players
  3,  5 :    0 :     0   :   false :     0 :      0 :      0  :     true : false :  1,   6, 
 -2,  3 :    0 :     0   :   false :     0 :      0 :      0  :     true : false :  4,   7, 
 -3, -5 :    0 :     0   :   false :     0 :      0 :      0  :     true : false :  3,   2,   8, 
 -5, -2 :    0 :     0   :   false :     0 :      0 :      0  :     true : false :  5,   9,   0, 

Balances: saldo  pay  groupbonus
  0:      0 Cent       0 Cent      0 Cent  
  1:      0 Cent       0 Cent      0 Cent  
  2:      0 Cent       0 Cent      0 Cent  
  3:      0 Cent       0 Cent      0 Cent  
  4:     10 Cent      10 Cent      0 Cent  
  5:      0 Cent       0 Cent      0 Cent  
  6:     24 wh       6 bl 
  7:     27 wh       3 bl 
  8:      9 wh      21 bl 
  9:      6 wh      24 bl 

##### next Spiel56: 	##### 

commonPlGr:
#Feld   :   ct :ctVisMode:ctVisible:Nuggets:Ct_local:Ct_global;NugVisible:Cleared:Players
 -5, -4 :    0 :     0   :   false :     0 :      0 :      0  :     true : false :  6, 
  5,  4 :    0 :     0   :   false :     0 :      0 :      0  :     true : false :  7, 
 -4,  1 :    0 :     0   :   false :     0 :      0 :      0  :     true : false :  8, 
  1,  5 :    0 :     0   :   false :     0 :      0 :      0  :     true : false :  9, 
  0,  0 :    0 :     0   :   false :     0 :      0 :      0  :     true : false :  1,   3,   5,   4,   2,   0, 

Startzeit: 18:19:08,227


last common playground
#Feld   :   ct :ctVisMode:ctVisible:Nuggets:Ct_local:Ct_global;NugVisible:Cleared:Players
 -5, -4 :    0 :     0   :   false :     0 :      0 :      0  :     true : false :  2,   6, 
  5,  4 :    0 :     0   :   false :     0 :      0 :      0  :     true : false :  4,   7, 
 -4,  1 :    0 :     0   :   false :     0 :      0 :      0  :     true : false :  1,   3,   8, 
  1,  5 :    0 :     0   :   false :     0 :      0 :      0  :     true : false :  5,   0,   9, 

Balances: saldo  pay  groupbonus
  0:     10 Cent      10 Cent      0 Cent  
  1:     30 Cent      30 Cent      0 Cent  
  2:     30 Cent      30 Cent      0 Cent  
  3:     30 Cent      30 Cent      0 Cent  
  4:     20 Cent      10 Cent      0 Cent  
  5:     10 Cent      10 Cent      0 Cent  
  6:     24 wh       6 bl 
  7:     27 wh       3 bl 
  8:      9 wh      21 bl 
  9:      6 wh      24 bl 

##### next Spiel56: 	##### 

commonPlGr:
#Feld   :   ct :ctVisMode:ctVisible:Nuggets:Ct_local:Ct_global;NugVisible:Cleared:Players
  2,  5 :    0 :     0   :   false :     0 :      0 :      0  :     true : false :  6, 
  3, -2 :    0 :     0   :   false :     0 :      0 :      0  :     true : false :  7, 
 -2, -5 :    0 :     0   :   false :     0 :      0 :      0  :     true : false :  8, 
 -5, -3 :    0 :     0   :   false :     0 :      0 :      0  :     true : false :  9, 
  0,  0 :    0 :     0   :   false :     0 :      0 :      0  :     true : false :  1,   3,   5,   4,   2,   0, 

Startzeit: 18:19:31,002


last common playground
#Feld   :   ct :ctVisMode:ctVisible:Nuggets:Ct_local:Ct_global;NugVisible:Cleared:Players
  2,  5 :    0 :     0   :   false :     0 :      0 :      0  :     true : false :  1,   2,   6, 
  3, -2 :    0 :     0   :   false :     0 :      0 :      0  :     true : false :  4,   7, 
 -2, -5 :    0 :     0   :   false :     0 :      0 :      0  :     true : false :  3,   8, 
 -5, -3 :    0 :     0   :   false :     0 :      0 :      0  :     true : false :  9,   5,   0, 

Balances: saldo  pay  groupbonus
  0:     20 Cent      10 Cent      0 Cent  
  1:     60 Cent      30 Cent      0 Cent  
  2:     60 Cent      30 Cent      0 Cent  
  3:     30 Cent       0 Cent      0 Cent  
  4:     30 Cent      10 Cent      0 Cent  
  5:     20 Cent      10 Cent      0 Cent  
  6:     24 wh       6 bl 
  7:     27 wh       3 bl 
  8:      9 wh      21 bl 
  9:      6 wh      24 bl 

##### next Spiel56: 	##### 

commonPlGr:
#Feld   :   ct :ctVisMode:ctVisible:Nuggets:Ct_local:Ct_global;NugVisible:Cleared:Players
 -3, -5 :    0 :     0   :   false :     0 :      0 :      0  :     true : false :  6, 
 -2,  3 :    0 :     0   :   false :     0 :      0 :      0  :     true : false :  7, 
  5,  2 :    0 :     0   :   false :     0 :      0 :      0  :     true : false :  8, 
  2, -3 :    0 :     0   :   false :     0 :      0 :      0  :     true : false :  9, 
  0,  0 :    0 :     0   :   false :     0 :      0 :      0  :     true : false :  1,   3,   5,   4,   2,   0, 

Startzeit: 18:19:47,334


last common playground
#Feld   :   ct :ctVisMode:ctVisible:Nuggets:Ct_local:Ct_global;NugVisible:Cleared:Players
 -3, -5 :    0 :     0   :   false :     0 :      0 :      0  :     true : false :  2,   6, 
 -2,  3 :    0 :     0   :   false :     0 :      0 :      0  :     true : false :  1,   7, 
  5,  2 :    0 :     0   :   false :     0 :      0 :      0  :     true : false :  0,   8, 
  2, -3 :    0 :     0   :   false :     0 :      0 :      0  :     true : false :  5,   4,   3,   9, 

Balances: saldo  pay  groupbonus
  0:     20 Cent       0 Cent      0 Cent  
  1:     70 Cent      10 Cent      0 Cent  
  2:     90 Cent      30 Cent      0 Cent  
  3:     40 Cent      10 Cent      0 Cent  
  4:     40 Cent      10 Cent      0 Cent  
  5:     30 Cent      10 Cent      0 Cent  
  6:     24 wh       6 bl 
  7:     27 wh       3 bl 
  8:      9 wh      21 bl 
  9:      6 wh      24 bl 

##### next Spiel56: 	##### 

commonPlGr:
#Feld   :   ct :ctVisMode:ctVisible:Nuggets:Ct_local:Ct_global;NugVisible:Cleared:Players
  5,  1 :    0 :     0   :   false :     0 :      0 :      0  :     true : false :  6, 
 -5, -1 :    0 :     0   :   false :     0 :      0 :      0  :     true : false :  7, 
  4,  5 :    0 :     0   :   false :     0 :      0 :      0  :     true : false :  8, 
 -1,  4 :    0 :     0   :   false :     0 :      0 :      0  :     true : false :  9, 
  0,  0 :    0 :     0   :   false :     0 :      0 :      0  :     true : false :  1,   3,   5,   4,   2,   0, 

Startzeit: 18:20:11,294


last common playground
#Feld   :   ct :ctVisMode:ctVisible:Nuggets:Ct_local:Ct_global;NugVisible:Cleared:Players
  5,  1 :    0 :     0   :   false :     0 :      0 :      0  :     true : false :  2,   3,   6, 
 -5, -1 :    0 :     0   :   false :     0 :      0 :      0  :     true : false :  1,   7,   5,   4, 
  4,  5 :    0 :     0   :   false :     0 :      0 :      0  :     true : false :  8, 
 -1,  4 :    0 :     0   :   false :     0 :      0 :      0  :     true : false :  0,   9, 

Balances: saldo  pay  groupbonus
  0:     20 Cent       0 Cent      0 Cent  
  1:     80 Cent      10 Cent      0 Cent  
  2:    120 Cent      30 Cent      0 Cent  
  3:     70 Cent      30 Cent      0 Cent  
  4:     50 Cent      10 Cent      0 Cent  
  5:     40 Cent      10 Cent      0 Cent  
  6:     24 wh       6 bl 
  7:     27 wh       3 bl 
  8:      9 wh      21 bl 
  9:      6 wh      24 bl 

##### next Spiel56: 	##### 

commonPlGr:
#Feld   :   ct :ctVisMode:ctVisible:Nuggets:Ct_local:Ct_global;NugVisible:Cleared:Players
 -5, -4 :    0 :     0   :   false :     0 :      0 :      0  :     true : false :  6, 
  4, -1 :    0 :     0   :   false :     0 :      0 :      0  :     true : false :  7, 
 -1, -5 :    0 :     0   :   false :     0 :      0 :      0  :     true : false :  8, 
  1,  5 :    0 :     0   :   false :     0 :      0 :      0  :     true : false :  9, 
  0,  0 :    0 :     0   :   false :     0 :      0 :      0  :     true : false :  1,   3,   5,   4,   2,   0, 

Startzeit: 18:20:24,733


last common playground
#Feld   :   ct :ctVisMode:ctVisible:Nuggets:Ct_local:Ct_global;NugVisible:Cleared:Players
 -5, -4 :    0 :     0   :   false :     0 :      0 :      0  :     true : false :  1,   6,   4,   2, 
  4, -1 :    0 :     0   :   false :     0 :      0 :      0  :     true : false :  5,   7, 
 -1, -5 :    0 :     0   :   false :     0 :      0 :      0  :     true : false :  3,   8, 
  1,  5 :    0 :     0   :   false :     0 :      0 :      0  :     true : false :  0,   9, 

Balances: saldo  pay  groupbonus
  0:     20 Cent       0 Cent      0 Cent  
  1:    110 Cent      30 Cent      0 Cent  
  2:    150 Cent      30 Cent      0 Cent  
  3:    100 Cent      30 Cent      0 Cent  
  4:     80 Cent      30 Cent      0 Cent  
  5:     50 Cent      10 Cent      0 Cent  
  6:     24 wh       6 bl 
  7:     27 wh       3 bl 
  8:      9 wh      21 bl 
  9:      6 wh      24 bl 

##### next Spiel56: 	##### 

commonPlGr:
#Feld   :   ct :ctVisMode:ctVisible:Nuggets:Ct_local:Ct_global;NugVisible:Cleared:Players
 -5, -2 :    0 :     0   :   false :     0 :      0 :      0  :     true : false :  6, 
  5,  2 :    0 :     0   :   false :     0 :      0 :      0  :     true : false :  7, 
 -3, -5 :    0 :     0   :   false :     0 :      0 :      0  :     true : false :  8, 
  2, -3 :    0 :     0   :   false :     0 :      0 :      0  :     true : false :  9, 
  0,  0 :    0 :     0   :   false :     0 :      0 :      0  :     true : false :  1,   3,   5,   4,   2,   0, 

Startzeit: 18:20:45,645


last common playground
#Feld   :   ct :ctVisMode:ctVisible:Nuggets:Ct_local:Ct_global;NugVisible:Cleared:Players
 -5, -2 :    0 :     0   :   false :     0 :      0 :      0  :     true : false :  2,   6, 
  5,  2 :    0 :     0   :   false :     0 :      0 :      0  :     true : false :  0,   7, 
 -3, -5 :    0 :     0   :   false :     0 :      0 :      0  :     true : false :  1,   8, 
  2, -3 :    0 :     0   :   false :     0 :      0 :      0  :     true : false :  3,   4,   5,   9, 

Balances: saldo  pay  groupbonus
  0:     20 Cent       0 Cent      0 Cent  
  1:    110 Cent       0 Cent      0 Cent  
  2:    180 Cent      30 Cent      0 Cent  
  3:    100 Cent       0 Cent      0 Cent  
  4:     80 Cent       0 Cent      0 Cent  
  5:     50 Cent       0 Cent      0 Cent  
  6:     24 wh       6 bl 
  7:     27 wh       3 bl 
  8:      9 wh      21 bl 
  9:      6 wh      24 bl 

##### next Spiel56: 	##### 

commonPlGr:
#Feld   :   ct :ctVisMode:ctVisible:Nuggets:Ct_local:Ct_global;NugVisible:Cleared:Players
 -5, -3 :    0 :     0   :   false :     0 :      0 :      0  :     true : false :  6, 
 -2, -5 :    0 :     0   :   false :     0 :      0 :      0  :     true : false :  7, 
  5,  3 :    0 :     0   :   false :     0 :      0 :      0  :     true : false :  8, 
  3, -2 :    0 :     0   :   false :     0 :      0 :      0  :     true : false :  9, 
  0,  0 :    0 :     0   :   false :     0 :      0 :      0  :     true : false :  1,   3,   5,   4,   2,   0, 

Startzeit: 18:21:02,949


last common playground
#Feld   :   ct :ctVisMode:ctVisible:Nuggets:Ct_local:Ct_global;NugVisible:Cleared:Players
 -5, -3 :    0 :     0   :   false :     0 :      0 :      0  :     true : false :  6,   2,   3, 
 -2, -5 :    0 :     0   :   false :     0 :      0 :      0  :     true : false :  4,   7, 
  5,  3 :    0 :     0   :   false :     0 :      0 :      0  :     true : false :  8, 
  3, -2 :    0 :     0   :   false :     0 :      0 :      0  :     true : false :  5,   0,   1,   9, 

Balances: saldo  pay  groupbonus
  0:     20 Cent       0 Cent      0 Cent  
  1:    110 Cent       0 Cent      0 Cent  
  2:    210 Cent      30 Cent      0 Cent  
  3:    130 Cent      30 Cent      0 Cent  
  4:     90 Cent      10 Cent      0 Cent  
  5:     50 Cent       0 Cent      0 Cent  
  6:     24 wh       6 bl 
  7:     27 wh       3 bl 
  8:      9 wh      21 bl 
  9:      6 wh      24 bl 

##### next Spiel56: 	##### 

commonPlGr:
#Feld   :   ct :ctVisMode:ctVisible:Nuggets:Ct_local:Ct_global;NugVisible:Cleared:Players
 -5, -3 :    0 :     0   :   false :     0 :      0 :      0  :     true : false :  6, 
  2,  5 :    0 :     0   :   false :     0 :      0 :      0  :     true : false :  7, 
  5,  3 :    0 :     0   :   false :     0 :      0 :      0  :     true : false :  8, 
 -2, -5 :    0 :     0   :   false :     0 :      0 :      0  :     true : false :  9, 
  0,  0 :    0 :     0   :   false :     0 :      0 :      0  :     true : false :  1,   3,   5,   4,   2,   0, 

Startzeit: 18:21:16,121


last common playground
#Feld   :   ct :ctVisMode:ctVisible:Nuggets:Ct_local:Ct_global;NugVisible:Cleared:Players
 -5, -3 :    0 :     0   :   false :     0 :      0 :      0  :     true : false :  6,   2,   1, 
  2,  5 :    0 :     0   :   false :     0 :      0 :      0  :     true : false :  4,   7, 
  5,  3 :    0 :     0   :   false :     0 :      0 :      0  :     true : false :  8, 
 -2, -5 :    0 :     0   :   false :     0 :      0 :      0  :     true : false :  3,   5,   0,   9, 

Balances: saldo  pay  groupbonus
  0:     20 Cent       0 Cent      0 Cent  
  1:    140 Cent      30 Cent      0 Cent  
  2:    240 Cent      30 Cent      0 Cent  
  3:    130 Cent       0 Cent      0 Cent  
  4:     90 Cent       0 Cent      0 Cent  
  5:     50 Cent       0 Cent      0 Cent  
  6:     24 wh       6 bl 
  7:     27 wh       3 bl 
  8:      9 wh      21 bl 
  9:      6 wh      24 bl 

##### next Spiel56: 	##### 

commonPlGr:
#Feld   :   ct :ctVisMode:ctVisible:Nuggets:Ct_local:Ct_global;NugVisible:Cleared:Players
 -5, -1 :    0 :     0   :   false :     0 :      0 :      0  :     true : false :  6, 
  1, -4 :    0 :     0   :   false :     0 :      0 :      0  :     true : false :  7, 
  4,  5 :    0 :     0   :   false :     0 :      0 :      0  :     true : false :  8, 
  5,  1 :    0 :     0   :   false :     0 :      0 :      0  :     true : false :  9, 
  0,  0 :    0 :     0   :   false :     0 :      0 :      0  :     true : false :  1,   3,   5,   4,   2,   0, 

Startzeit: 18:21:34,790


last common playground
#Feld   :   ct :ctVisMode:ctVisible:Nuggets:Ct_local:Ct_global;NugVisible:Cleared:Players
 -5, -1 :    0 :     0   :   false :     0 :      0 :      0  :     true : false :  6,   1,   5,   2,   4, 
  1, -4 :    0 :     0   :   false :     0 :      0 :      0  :     true : false :  0,   7, 
  4,  5 :    0 :     0   :   false :     0 :      0 :      0  :     true : false :  3,   8, 
  5,  1 :    0 :     0   :   false :     0 :      0 :      0  :     true : false :  9, 

Balances: saldo  pay  groupbonus
  0:     30 Cent      10 Cent      0 Cent  
  1:    170 Cent      30 Cent      0 Cent  
  2:    270 Cent      30 Cent      0 Cent  
  3:    160 Cent      30 Cent      0 Cent  
  4:    120 Cent      30 Cent      0 Cent  
  5:     80 Cent      30 Cent      0 Cent  
  6:     24 wh       6 bl 
  7:     27 wh       3 bl 
  8:      9 wh      21 bl 
  9:      6 wh      24 bl 

##### next Spiel56: 	##### 

commonPlGr:
#Feld   :   ct :ctVisMode:ctVisible:Nuggets:Ct_local:Ct_global;NugVisible:Cleared:Players
  5,  4 :    0 :     0   :   false :     0 :      0 :      0  :     true : false :  6, 
 -5, -4 :    0 :     0   :   false :     0 :      0 :      0  :     true : false :  7, 
 -1, -5 :    0 :     0   :   false :     0 :      0 :      0  :     true : false :  8, 
 -4,  1 :    0 :     0   :   false :     0 :      0 :      0  :     true : false :  9, 
  0,  0 :    0 :     0   :   false :     0 :      0 :      0  :     true : false :  1,   3,   5,   4,   2,   0, 

Startzeit: 18:21:48,906


last common playground
#Feld   :   ct :ctVisMode:ctVisible:Nuggets:Ct_local:Ct_global;NugVisible:Cleared:Players
  5,  4 :    0 :     0   :   false :     0 :      0 :      0  :     true : false :  2,   6, 
 -5, -4 :    0 :     0   :   false :     0 :      0 :      0  :     true : false :  3,   7, 
 -1, -5 :    0 :     0   :   false :     0 :      0 :      0  :     true : false :  0,   8, 
 -4,  1 :    0 :     0   :   false :     0 :      0 :      0  :     true : false :  5,   4,   9, 
 -1,  0 :    0 :     0   :   false :     0 :      0 :      0  :     true : false :  1, 

Balances: saldo  pay  groupbonus
  0:     60 Cent      30 Cent      0 Cent  
  1:    170 Cent       0 Cent      0 Cent  
  2:    300 Cent      30 Cent      0 Cent  
  3:    170 Cent      10 Cent      0 Cent  
  4:    130 Cent      10 Cent      0 Cent  
  5:     90 Cent      10 Cent      0 Cent  
  6:     24 wh       6 bl 
  7:     27 wh       3 bl 
  8:      9 wh      21 bl 
  9:      6 wh      24 bl 

##### next Spiel56: 	##### 

commonPlGr:
#Feld   :   ct :ctVisMode:ctVisible:Nuggets:Ct_local:Ct_global;NugVisible:Cleared:Players
  4, -1 :    0 :     0   :   false :     0 :      0 :      0  :     true : false :  6, 
  1,  5 :    0 :     0   :   false :     0 :      0 :      0  :     true : false :  7, 
  5,  4 :    0 :     0   :   false :     0 :      0 :      0  :     true : false :  8, 
 -1, -5 :    0 :     0   :   false :     0 :      0 :      0  :     true : false :  9, 
  0,  0 :    0 :     0   :   false :     0 :      0 :      0  :     true : false :  1,   3,   5,   4,   2,   0, 

Startzeit: 18:22:24,932


last common playground
#Feld   :   ct :ctVisMode:ctVisible:Nuggets:Ct_local:Ct_global;NugVisible:Cleared:Players
  4, -1 :    0 :     0   :   false :     0 :      0 :      0  :     true : false :  2,   4,   1,   6, 
  1,  5 :    0 :     0   :   false :     0 :      0 :      0  :     true : false :  5,   7, 
  5,  4 :    0 :     0   :   false :     0 :      0 :      0  :     true : false :  3,   8, 
 -1, -5 :    0 :     0   :   false :     0 :      0 :      0  :     true : false :  0,   9, 

Balances: saldo  pay  groupbonus
  0:     60 Cent       0 Cent      0 Cent  
  1:    170 Cent       0 Cent      0 Cent  
  2:    300 Cent       0 Cent      0 Cent  
  3:    170 Cent       0 Cent      0 Cent  
  4:    130 Cent       0 Cent      0 Cent  
  5:    100 Cent      10 Cent      0 Cent  
  6:     24 wh       6 bl 
  7:     27 wh       3 bl 
  8:      9 wh      21 bl 
  9:      6 wh      24 bl 

##### next Spiel56: 	##### 

commonPlGr:
#Feld   :   ct :ctVisMode:ctVisible:Nuggets:Ct_local:Ct_global;NugVisible:Cleared:Players
 -1,  4 :    0 :     0   :   false :     0 :      0 :      0  :     true : false :  6, 
  5,  1 :    0 :     0   :   false :     0 :      0 :      0  :     true : false :  7, 
 -5, -1 :    0 :     0   :   false :     0 :      0 :      0  :     true : false :  8, 
  1, -4 :    0 :     0   :   false :     0 :      0 :      0  :     true : false :  9, 
  0,  0 :    0 :     0   :   false :     0 :      0 :      0  :     true : false :  1,   3,   5,   4,   2,   0, 

Startzeit: 18:22:41,860


last common playground
#Feld   :   ct :ctVisMode:ctVisible:Nuggets:Ct_local:Ct_global;NugVisible:Cleared:Players
 -1,  4 :    0 :     0   :   false :     0 :      0 :      0  :     true : false :  4,   3,   2,   6, 
  5,  1 :    0 :     0   :   false :     0 :      0 :      0  :     true : false :  7, 
 -5, -1 :    0 :     0   :   false :     0 :      0 :      0  :     true : false :  8,   0,   5, 
  1, -4 :    0 :     0   :   false :     0 :      0 :      0  :     true : false :  1,   9, 

Balances: saldo  pay  groupbonus
  0:     60 Cent       0 Cent      0 Cent  
  1:    180 Cent      10 Cent      0 Cent  
  2:    330 Cent      30 Cent      0 Cent  
  3:    200 Cent      30 Cent      0 Cent  
  4:    160 Cent      30 Cent      0 Cent  
  5:    100 Cent       0 Cent      0 Cent  
  6:     24 wh       6 bl 
  7:     27 wh       3 bl 
  8:      9 wh      21 bl 
  9:      6 wh      24 bl 

##### next Spiel56: 	##### 

commonPlGr:
#Feld   :   ct :ctVisMode:ctVisible:Nuggets:Ct_local:Ct_global;NugVisible:Cleared:Players
  4,  5 :    0 :     0   :   false :     0 :      0 :      0  :     true : false :  6, 
 -5, -1 :    0 :     0   :   false :     0 :      0 :      0  :     true : false :  7, 
  5,  1 :    0 :     0   :   false :     0 :      0 :      0  :     true : false :  8, 
 -1,  4 :    0 :     0   :   false :     0 :      0 :      0  :     true : false :  9, 
  0,  0 :    0 :     0   :   false :     0 :      0 :      0  :     true : false :  1,   3,   5,   4,   2,   0, 

Startzeit: 18:22:57,962


last common playground
#Feld   :   ct :ctVisMode:ctVisible:Nuggets:Ct_local:Ct_global;NugVisible:Cleared:Players
  4,  5 :    0 :     0   :   false :     0 :      0 :      0  :     true : false :  4,   2,   6, 
 -5, -1 :    0 :     0   :   false :     0 :      0 :      0  :     true : false :  3,   7, 
  5,  1 :    0 :     0   :   false :     0 :      0 :      0  :     true : false :  0,   5,   8, 
 -1,  4 :    0 :     0   :   false :     0 :      0 :      0  :     true : false :  1,   9, 

Balances: saldo  pay  groupbonus
  0:     90 Cent      30 Cent      0 Cent  
  1:    180 Cent       0 Cent      0 Cent  
  2:    360 Cent      30 Cent      0 Cent  
  3:    210 Cent      10 Cent      0 Cent  
  4:    190 Cent      30 Cent      0 Cent  
  5:    130 Cent      30 Cent      0 Cent  
  6:     24 wh       6 bl 
  7:     27 wh       3 bl 
  8:      9 wh      21 bl 
  9:      6 wh      24 bl 

##### next Spiel56: 	##### 

commonPlGr:
#Feld   :   ct :ctVisMode:ctVisible:Nuggets:Ct_local:Ct_global;NugVisible:Cleared:Players
  2,  5 :    0 :     0   :   false :     0 :      0 :      0  :     true : false :  6, 
 -2, -5 :    0 :     0   :   false :     0 :      0 :      0  :     true : false :  7, 
 -3,  2 :    0 :     0   :   false :     0 :      0 :      0  :     true : false :  8, 
  5,  3 :    0 :     0   :   false :     0 :      0 :      0  :     true : false :  9, 
  0,  0 :    0 :     0   :   false :     0 :      0 :      0  :     true : false :  1,   3,   5,   4,   2,   0, 

Startzeit: 18:23:14,610


last common playground
#Feld   :   ct :ctVisMode:ctVisible:Nuggets:Ct_local:Ct_global;NugVisible:Cleared:Players
  2,  5 :    0 :     0   :   false :     0 :      0 :      0  :     true : false :  4,   0,   5,   2,   6, 
 -2, -5 :    0 :     0   :   false :     0 :      0 :      0  :     true : false :  1,   7, 
 -3,  2 :    0 :     0   :   false :     0 :      0 :      0  :     true : false :  8, 
  5,  3 :    0 :     0   :   false :     0 :      0 :      0  :     true : false :  3,   9, 

Balances: saldo  pay  groupbonus
  0:    120 Cent      30 Cent      0 Cent  
  1:    190 Cent      10 Cent      0 Cent  
  2:    390 Cent      30 Cent      0 Cent  
  3:    220 Cent      10 Cent      0 Cent  
  4:    220 Cent      30 Cent      0 Cent  
  5:    160 Cent      30 Cent      0 Cent  
  6:     24 wh       6 bl 
  7:     27 wh       3 bl 
  8:      9 wh      21 bl 
  9:      6 wh      24 bl 

##### next Spiel56: 	##### 

commonPlGr:
#Feld   :   ct :ctVisMode:ctVisible:Nuggets:Ct_local:Ct_global;NugVisible:Cleared:Players
 -2,  3 :    0 :     0   :   false :     0 :      0 :      0  :     true : false :  6, 
  5,  2 :    0 :     0   :   false :     0 :      0 :      0  :     true : false :  7, 
 -3, -5 :    0 :     0   :   false :     0 :      0 :      0  :     true : false :  8, 
  2, -3 :    0 :     0   :   false :     0 :      0 :      0  :     true : false :  9, 
  0,  0 :    0 :     0   :   false :     0 :      0 :      0  :     true : false :  1,   3,   5,   4,   2,   0, 

Startzeit: 18:23:31,116


last common playground
#Feld   :   ct :ctVisMode:ctVisible:Nuggets:Ct_local:Ct_global;NugVisible:Cleared:Players
 -2,  3 :    0 :     0   :   false :     0 :      0 :      0  :     true : false :  4,   1,   2,   6, 
  5,  2 :    0 :     0   :   false :     0 :      0 :      0  :     true : false :  0,   7, 
 -3, -5 :    0 :     0   :   false :     0 :      0 :      0  :     true : false :  3,   5,   8, 
  2, -3 :    0 :     0   :   false :     0 :      0 :      0  :     true : false :  9, 

Balances: saldo  pay  groupbonus
  0:    130 Cent      10 Cent      0 Cent  
  1:    190 Cent       0 Cent      0 Cent  
  2:    390 Cent       0 Cent      0 Cent  
  3:    220 Cent       0 Cent      0 Cent  
  4:    220 Cent       0 Cent      0 Cent  
  5:    160 Cent       0 Cent      0 Cent  
  6:     24 wh       6 bl 
  7:     27 wh       3 bl 
  8:      9 wh      21 bl 
  9:      6 wh      24 bl 

##### next Spiel56: 	##### 

commonPlGr:
#Feld   :   ct :ctVisMode:ctVisible:Nuggets:Ct_local:Ct_global;NugVisible:Cleared:Players
  5,  1 :    0 :     0   :   false :     0 :      0 :      0  :     true : false :  6, 
  4,  5 :    0 :     0   :   false :     0 :      0 :      0  :     true : false :  7, 
 -5, -1 :    0 :     0   :   false :     0 :      0 :      0  :     true : false :  8, 
  1, -4 :    0 :     0   :   false :     0 :      0 :      0  :     true : false :  9, 
  0,  0 :    0 :     0   :   false :     0 :      0 :      0  :     true : false :  1,   3,   5,   4,   2,   0, 

Startzeit: 18:23:45,433


last common playground
#Feld   :   ct :ctVisMode:ctVisible:Nuggets:Ct_local:Ct_global;NugVisible:Cleared:Players
  5,  1 :    0 :     0   :   false :     0 :      0 :      0  :     true : false :  3,   6, 
  4,  5 :    0 :     0   :   false :     0 :      0 :      0  :     true : false :  7, 
 -5, -1 :    0 :     0   :   false :     0 :      0 :      0  :     true : false :  8,   1,   2,   5,   4, 
  1, -4 :    0 :     0   :   false :     0 :      0 :      0  :     true : false :  0,   9, 

Balances: saldo  pay  groupbonus
  0:    140 Cent      10 Cent      0 Cent  
  1:    220 Cent      30 Cent      0 Cent  
  2:    420 Cent      30 Cent      0 Cent  
  3:    220 Cent       0 Cent      0 Cent  
  4:    250 Cent      30 Cent      0 Cent  
  5:    190 Cent      30 Cent      0 Cent  
  6:     24 wh       6 bl 
  7:     27 wh       3 bl 
  8:      9 wh      21 bl 
  9:      6 wh      24 bl 

##### next Spiel56: 	##### 

commonPlGr:
#Feld   :   ct :ctVisMode:ctVisible:Nuggets:Ct_local:Ct_global;NugVisible:Cleared:Players
 -2, -5 :    0 :     0   :   false :     0 :      0 :      0  :     true : false :  6, 
  5,  3 :    0 :     0   :   false :     0 :      0 :      0  :     true : false :  7, 
 -3,  2 :    0 :     0   :   false :     0 :      0 :      0  :     true : false :  8, 
  3, -2 :    0 :     0   :   false :     0 :      0 :      0  :     true : false :  9, 
  0,  0 :    0 :     0   :   false :     0 :      0 :      0  :     true : false :  1,   3,   5,   4,   2,   0, 

Startzeit: 18:24:03,777


last common playground
#Feld   :   ct :ctVisMode:ctVisible:Nuggets:Ct_local:Ct_global;NugVisible:Cleared:Players
 -2, -5 :    0 :     0   :   false :     0 :      0 :      0  :     true : false :  2,   6, 
  5,  3 :    0 :     0   :   false :     0 :      0 :      0  :     true : false :  7, 
 -3,  2 :    0 :     0   :   false :     0 :      0 :      0  :     true : false :  1,   5,   4,   8, 
  3, -2 :    0 :     0   :   false :     0 :      0 :      0  :     true : false :  0,   3,   9, 

Balances: saldo  pay  groupbonus
  0:    140 Cent       0 Cent      0 Cent  
  1:    220 Cent       0 Cent      0 Cent  
  2:    450 Cent      30 Cent      0 Cent  
  3:    220 Cent       0 Cent      0 Cent  
  4:    250 Cent       0 Cent      0 Cent  
  5:    190 Cent       0 Cent      0 Cent  
  6:     24 wh       6 bl 
  7:     27 wh       3 bl 
  8:      9 wh      21 bl 
  9:      6 wh      24 bl 

##### next Spiel56: 	##### 

commonPlGr:
#Feld   :   ct :ctVisMode:ctVisible:Nuggets:Ct_local:Ct_global;NugVisible:Cleared:Players
 -5, -4 :    0 :     0   :   false :     0 :      0 :      0  :     true : false :  6, 
 -4,  1 :    0 :     0   :   false :     0 :      0 :      0  :     true : false :  7, 
  4, -1 :    0 :     0   :   false :     0 :      0 :      0  :     true : false :  8, 
 -1, -5 :    0 :     0   :   false :     0 :      0 :      0  :     true : false :  9, 
  0,  0 :    0 :     0   :   false :     0 :      0 :      0  :     true : false :  1,   3,   5,   4,   2,   0, 

Startzeit: 18:24:22,482


last common playground
#Feld   :   ct :ctVisMode:ctVisible:Nuggets:Ct_local:Ct_global;NugVisible:Cleared:Players
 -5, -4 :    0 :     0   :   false :     0 :      0 :      0  :     true : false :  1,   6,   0,   2, 
 -4,  1 :    0 :     0   :   false :     0 :      0 :      0  :     true : false :  7, 
  4, -1 :    0 :     0   :   false :     0 :      0 :      0  :     true : false :  3,   5,   4,   8, 
 -1, -5 :    0 :     0   :   false :     0 :      0 :      0  :     true : false :  9, 

Balances: saldo  pay  groupbonus
  0:    170 Cent      30 Cent      0 Cent  
  1:    250 Cent      30 Cent      0 Cent  
  2:    480 Cent      30 Cent      0 Cent  
  3:    220 Cent       0 Cent      0 Cent  
  4:    250 Cent       0 Cent      0 Cent  
  5:    190 Cent       0 Cent      0 Cent  
  6:     24 wh       6 bl 
  7:     27 wh       3 bl 
  8:      9 wh      21 bl 
  9:      6 wh      24 bl 

##### next Spiel56: 	##### 

commonPlGr:
#Feld   :   ct :ctVisMode:ctVisible:Nuggets:Ct_local:Ct_global;NugVisible:Cleared:Players
 -4,  1 :    0 :     0   :   false :     0 :      0 :      0  :     true : false :  6, 
  5,  4 :    0 :     0   :   false :     0 :      0 :      0  :     true : false :  7, 
 -5, -4 :    0 :     0   :   false :     0 :      0 :      0  :     true : false :  8, 
 -1, -5 :    0 :     0   :   false :     0 :      0 :      0  :     true : false :  9, 
  0,  0 :    0 :     0   :   false :     0 :      0 :      0  :     true : false :  1,   3,   5,   4,   2,   0, 

Startzeit: 18:24:39,384


last common playground
#Feld   :   ct :ctVisMode:ctVisible:Nuggets:Ct_local:Ct_global;NugVisible:Cleared:Players
 -4,  1 :    0 :     0   :   false :     0 :      0 :      0  :     true : false :  1,   2,   6, 
  5,  4 :    0 :     0   :   false :     0 :      0 :      0  :     true : false :  4,   3,   5,   7, 
 -5, -4 :    0 :     0   :   false :     0 :      0 :      0  :     true : false :  8, 
 -1, -5 :    0 :     0   :   false :     0 :      0 :      0  :     true : false :  0,   9, 

Balances: saldo  pay  groupbonus
  0:    170 Cent       0 Cent      0 Cent  
  1:    280 Cent      30 Cent      0 Cent  
  2:    510 Cent      30 Cent      0 Cent  
  3:    230 Cent      10 Cent      0 Cent  
  4:    260 Cent      10 Cent      0 Cent  
  5:    200 Cent      10 Cent      0 Cent  
  6:     24 wh       6 bl 
  7:     27 wh       3 bl 
  8:      9 wh      21 bl 
  9:      6 wh      24 bl 

##### next Spiel56: 	##### 

commonPlGr:
#Feld   :   ct :ctVisMode:ctVisible:Nuggets:Ct_local:Ct_global;NugVisible:Cleared:Players
 -4,  1 :    0 :     0   :   false :     0 :      0 :      0  :     true : false :  6, 
  5,  4 :    0 :     0   :   false :     0 :      0 :      0  :     true : false :  7, 
 -1, -5 :    0 :     0   :   false :     0 :      0 :      0  :     true : false :  8, 
  4, -1 :    0 :     0   :   false :     0 :      0 :      0  :     true : false :  9, 
  0,  0 :    0 :     0   :   false :     0 :      0 :      0  :     true : false :  1,   3,   5,   4,   2,   0, 

Startzeit: 18:24:55,740


last common playground
#Feld   :   ct :ctVisMode:ctVisible:Nuggets:Ct_local:Ct_global;NugVisible:Cleared:Players
 -4,  1 :    0 :     0   :   false :     0 :      0 :      0  :     true : false :  1,   2,   3,   6, 
  5,  4 :    0 :     0   :   false :     0 :      0 :      0  :     true : false :  4,   7, 
 -1, -5 :    0 :     0   :   false :     0 :      0 :      0  :     true : false :  5,   0,   8, 
  4, -1 :    0 :     0   :   false :     0 :      0 :      0  :     true : false :  9, 

Balances: saldo  pay  groupbonus
  0:    170 Cent       0 Cent      0 Cent  
  1:    280 Cent       0 Cent      0 Cent  
  2:    510 Cent       0 Cent      0 Cent  
  3:    230 Cent       0 Cent      0 Cent  
  4:    270 Cent      10 Cent      0 Cent  
  5:    200 Cent       0 Cent      0 Cent  
  6:     24 wh       6 bl 
  7:     27 wh       3 bl 
  8:      9 wh      21 bl 
  9:      6 wh      24 bl 

##### next Spiel56: 	##### 

commonPlGr:
#Feld   :   ct :ctVisMode:ctVisible:Nuggets:Ct_local:Ct_global;NugVisible:Cleared:Players
 -4,  1 :    0 :     0   :   false :     0 :      0 :      0  :     true : false :  6, 
  4, -1 :    0 :     0   :   false :     0 :      0 :      0  :     true : false :  7, 
  5,  4 :    0 :     0   :   false :     0 :      0 :      0  :     true : false :  8, 
 -5, -4 :    0 :     0   :   false :     0 :      0 :      0  :     true : false :  9, 
  0,  0 :    0 :     0   :   false :     0 :      0 :      0  :     true : false :  1,   3,   5,   4,   2,   0, 

Startzeit: 18:25:13,386


last common playground
#Feld   :   ct :ctVisMode:ctVisible:Nuggets:Ct_local:Ct_global;NugVisible:Cleared:Players
 -4,  1 :    0 :     0   :   false :     0 :      0 :      0  :     true : false :  4,   6, 
  4, -1 :    0 :     0   :   false :     0 :      0 :      0  :     true : false :  0,   5,   2,   7, 
  5,  4 :    0 :     0   :   false :     0 :      0 :      0  :     true : false :  1,   8, 
 -5, -4 :    0 :     0   :   false :     0 :      0 :      0  :     true : false :  9,   3, 

Balances: saldo  pay  groupbonus
  0:    180 Cent      10 Cent      0 Cent  
  1:    310 Cent      30 Cent      0 Cent  
  2:    520 Cent      10 Cent      0 Cent  
  3:    230 Cent       0 Cent      0 Cent  
  4:    300 Cent      30 Cent      0 Cent  
  5:    210 Cent      10 Cent      0 Cent  
  6:     24 wh       6 bl 
  7:     27 wh       3 bl 
  8:      9 wh      21 bl 
  9:      6 wh      24 bl 

##### next Spiel56: 	##### 

commonPlGr:
#Feld   :   ct :ctVisMode:ctVisible:Nuggets:Ct_local:Ct_global;NugVisible:Cleared:Players
  5,  4 :    0 :     0   :   false :     0 :      0 :      0  :     true : false :  6, 
 -4,  1 :    0 :     0   :   false :     0 :      0 :      0  :     true : false :  7, 
  4, -1 :    0 :     0   :   false :     0 :      0 :      0  :     true : false :  8, 
 -1, -5 :    0 :     0   :   false :     0 :      0 :      0  :     true : false :  9, 
  0,  0 :    0 :     0   :   false :     0 :      0 :      0  :     true : false :  1,   3,   5,   4,   2,   0, 

Startzeit: 18:25:27,063


last common playground
#Feld   :   ct :ctVisMode:ctVisible:Nuggets:Ct_local:Ct_global;NugVisible:Cleared:Players
  5,  4 :    0 :     0   :   false :     0 :      0 :      0  :     true : false :  4,   6, 
 -4,  1 :    0 :     0   :   false :     0 :      0 :      0  :     true : false :  0,   7, 
  4, -1 :    0 :     0   :   false :     0 :      0 :      0  :     true : false :  1,   2,   8, 
 -1, -5 :    0 :     0   :   false :     0 :      0 :      0  :     true : false :  5,   3,   9, 

Balances: saldo  pay  groupbonus
  0:    190 Cent      10 Cent      0 Cent  
  1:    340 Cent      30 Cent      0 Cent  
  2:    550 Cent      30 Cent      0 Cent  
  3:    230 Cent       0 Cent      0 Cent  
  4:    330 Cent      30 Cent      0 Cent  
  5:    210 Cent       0 Cent      0 Cent  
  6:     24 wh       6 bl 
  7:     27 wh       3 bl 
  8:      9 wh      21 bl 
  9:      6 wh      24 bl 

##### next Spiel56: 	##### 

commonPlGr:
#Feld   :   ct :ctVisMode:ctVisible:Nuggets:Ct_local:Ct_global;NugVisible:Cleared:Players
 -5, -4 :    0 :     0   :   false :     0 :      0 :      0  :     true : false :  6, 
 -1, -5 :    0 :     0   :   false :     0 :      0 :      0  :     true : false :  7, 
  1,  5 :    0 :     0   :   false :     0 :      0 :      0  :     true : false :  8, 
 -4,  1 :    0 :     0   :   false :     0 :      0 :      0  :     true : false :  9, 
  0,  0 :    0 :     0   :   false :     0 :      0 :      0  :     true : false :  1,   3,   5,   4,   2,   0, 

Startzeit: 18:25:42,350


last common playground
#Feld   :   ct :ctVisMode:ctVisible:Nuggets:Ct_local:Ct_global;NugVisible:Cleared:Players
 -5, -4 :    0 :     0   :   false :     0 :      0 :      0  :     true : false :  6,   4,   3, 
 -1, -5 :    0 :     0   :   false :     0 :      0 :      0  :     true : false :  0,   7, 
  1,  5 :    0 :     0   :   false :     0 :      0 :      0  :     true : false :  1,   2,   8, 
 -4,  1 :    0 :     0   :   false :     0 :      0 :      0  :     true : false :  5,   9, 

Balances: saldo  pay  groupbonus
  0:    200 Cent      10 Cent      0 Cent  
  1:    340 Cent       0 Cent      0 Cent  
  2:    550 Cent       0 Cent      0 Cent  
  3:    260 Cent      30 Cent      0 Cent  
  4:    360 Cent      30 Cent      0 Cent  
  5:    210 Cent       0 Cent      0 Cent  
  6:     24 wh       6 bl 
  7:     27 wh       3 bl 
  8:      9 wh      21 bl 
  9:      6 wh      24 bl 

##### next Spiel56: 	##### 

commonPlGr:
#Feld   :   ct :ctVisMode:ctVisible:Nuggets:Ct_local:Ct_global;NugVisible:Cleared:Players
  5,  4 :    0 :     0   :   false :     0 :      0 :      0  :     true : false :  6, 
 -4,  1 :    0 :     0   :   false :     0 :      0 :      0  :     true : false :  7, 
  4, -1 :    0 :     0   :   false :     0 :      0 :      0  :     true : false :  8, 
  1,  5 :    0 :     0   :   false :     0 :      0 :      0  :     true : false :  9, 
  0,  0 :    0 :     0   :   false :     0 :      0 :      0  :     true : false :  1,   3,   5,   4,   2,   0, 

Startzeit: 18:25:55,144


last common playground
#Feld   :   ct :ctVisMode:ctVisible:Nuggets:Ct_local:Ct_global;NugVisible:Cleared:Players
  5,  4 :    0 :     0   :   false :     0 :      0 :      0  :     true : false :  1,   4,   6, 
 -4,  1 :    0 :     0   :   false :     0 :      0 :      0  :     true : false :  3,   7, 
  4, -1 :    0 :     0   :   false :     0 :      0 :      0  :     true : false :  2,   0,   8, 
  1,  5 :    0 :     0   :   false :     0 :      0 :      0  :     true : false :  5,   9, 

Balances: saldo  pay  groupbonus
  0:    230 Cent      30 Cent      0 Cent  
  1:    370 Cent      30 Cent      0 Cent  
  2:    580 Cent      30 Cent      0 Cent  
  3:    270 Cent      10 Cent      0 Cent  
  4:    390 Cent      30 Cent      0 Cent  
  5:    220 Cent      10 Cent      0 Cent  
  6:     24 wh       6 bl 
  7:     27 wh       3 bl 
  8:      9 wh      21 bl 
  9:      6 wh      24 bl 

##### next Spiel56: 	##### 

commonPlGr:
#Feld   :   ct :ctVisMode:ctVisible:Nuggets:Ct_local:Ct_global;NugVisible:Cleared:Players
 -5, -1 :    0 :     0   :   false :     0 :      0 :      0  :     true : false :  6, 
 -4, -5 :    0 :     0   :   false :     0 :      0 :      0  :     true : false :  7, 
  1, -4 :    0 :     0   :   false :     0 :      0 :      0  :     true : false :  8, 
 -1,  4 :    0 :     0   :   false :     0 :      0 :      0  :     true : false :  9, 
  0,  0 :    0 :     0   :   false :     0 :      0 :      0  :     true : false :  1,   3,   5,   4,   2,   0, 

Startzeit: 18:26:08,683


last common playground
#Feld   :   ct :ctVisMode:ctVisible:Nuggets:Ct_local:Ct_global;NugVisible:Cleared:Players
 -5, -1 :    0 :     0   :   false :     0 :      0 :      0  :     true : false :  6,   4,   1, 
 -4, -5 :    0 :     0   :   false :     0 :      0 :      0  :     true : false :  7, 
  1, -4 :    0 :     0   :   false :     0 :      0 :      0  :     true : false :  2,   3,   8, 
 -1,  4 :    0 :     0   :   false :     0 :      0 :      0  :     true : false :  0,   5,   9, 

Balances: saldo  pay  groupbonus
  0:    240 Cent      10 Cent      0 Cent  
  1:    400 Cent      30 Cent      0 Cent  
  2:    610 Cent      30 Cent      0 Cent  
  3:    300 Cent      30 Cent      0 Cent  
  4:    420 Cent      30 Cent      0 Cent  
  5:    230 Cent      10 Cent      0 Cent  
  6:     24 wh       6 bl 
  7:     27 wh       3 bl 
  8:      9 wh      21 bl 
  9:      6 wh      24 bl 

##### next Spiel56: 	##### 

commonPlGr:
#Feld   :   ct :ctVisMode:ctVisible:Nuggets:Ct_local:Ct_global;NugVisible:Cleared:Players
 -2,  3 :    0 :     0   :   false :     0 :      0 :      0  :     true : false :  6, 
  3,  5 :    0 :     0   :   false :     0 :      0 :      0  :     true : false :  7, 
  2, -3 :    0 :     0   :   false :     0 :      0 :      0  :     true : false :  8, 
 -5, -2 :    0 :     0   :   false :     0 :      0 :      0  :     true : false :  9, 
  0,  0 :    0 :     0   :   false :     0 :      0 :      0  :     true : false :  1,   3,   5,   4,   2,   0, 

Startzeit: 18:26:26,139


last common playground
#Feld   :   ct :ctVisMode:ctVisible:Nuggets:Ct_local:Ct_global;NugVisible:Cleared:Players
 -2,  3 :    0 :     0   :   false :     0 :      0 :      0  :     true : false :  6,   1,   2,   4, 
  3,  5 :    0 :     0   :   false :     0 :      0 :      0  :     true : false :  3,   0,   7, 
  2, -3 :    0 :     0   :   false :     0 :      0 :      0  :     true : false :  8, 
 -5, -2 :    0 :     0   :   false :     0 :      0 :      0  :     true : false :  9,   5, 

Balances: saldo  pay  groupbonus
  0:    250 Cent      10 Cent      0 Cent  
  1:    400 Cent       0 Cent      0 Cent  
  2:    610 Cent       0 Cent      0 Cent  
  3:    310 Cent      10 Cent      0 Cent  
  4:    420 Cent       0 Cent      0 Cent  
  5:    230 Cent       0 Cent      0 Cent  
  6:     24 wh       6 bl 
  7:     27 wh       3 bl 
  8:      9 wh      21 bl 
  9:      6 wh      24 bl 

##### next Spiel56: 	##### 

commonPlGr:
#Feld   :   ct :ctVisMode:ctVisible:Nuggets:Ct_local:Ct_global;NugVisible:Cleared:Players
  3, -2 :    0 :     0   :   false :     0 :      0 :      0  :     true : false :  6, 
  2,  5 :    0 :     0   :   false :     0 :      0 :      0  :     true : false :  7, 
 -3,  2 :    0 :     0   :   false :     0 :      0 :      0  :     true : false :  8, 
  5,  3 :    0 :     0   :   false :     0 :      0 :      0  :     true : false :  9, 
  0,  0 :    0 :     0   :   false :     0 :      0 :      0  :     true : false :  1,   3,   5,   4,   2,   0, 

Startzeit: 18:26:40,194


last common playground
#Feld   :   ct :ctVisMode:ctVisible:Nuggets:Ct_local:Ct_global;NugVisible:Cleared:Players
  3, -2 :    0 :     0   :   false :     0 :      0 :      0  :     true : false :  3,   6, 
  2,  5 :    0 :     0   :   false :     0 :      0 :      0  :     true : false :  0,   5,   7, 
 -3,  2 :    0 :     0   :   false :     0 :      0 :      0  :     true : false :  4,   1,   2,   8, 
  5,  3 :    0 :     0   :   false :     0 :      0 :      0  :     true : false :  9, 

Balances: saldo  pay  groupbonus
  0:    260 Cent      10 Cent      0 Cent  
  1:    400 Cent       0 Cent      0 Cent  
  2:    610 Cent       0 Cent      0 Cent  
  3:    310 Cent       0 Cent      0 Cent  
  4:    420 Cent       0 Cent      0 Cent  
  5:    240 Cent      10 Cent      0 Cent  
  6:     24 wh       6 bl 
  7:     27 wh       3 bl 
  8:      9 wh      21 bl 
  9:      6 wh      24 bl 

##### next Spiel56: 	##### 

commonPlGr:
#Feld   :   ct :ctVisMode:ctVisible:Nuggets:Ct_local:Ct_global;NugVisible:Cleared:Players
  3, -2 :    0 :     0   :   false :     0 :      0 :      0  :     true : false :  6, 
 -2, -5 :    0 :     0   :   false :     0 :      0 :      0  :     true : false :  7, 
 -5, -3 :    0 :     0   :   false :     0 :      0 :      0  :     true : false :  8, 
  2,  5 :    0 :     0   :   false :     0 :      0 :      0  :     true : false :  9, 
  0,  0 :    0 :     0   :   false :     0 :      0 :      0  :     true : false :  1,   3,   5,   4,   2,   0, 

Startzeit: 18:26:57,634


last common playground
#Feld   :   ct :ctVisMode:ctVisible:Nuggets:Ct_local:Ct_global;NugVisible:Cleared:Players
  3, -2 :    0 :     0   :   false :     0 :      0 :      0  :     true : false :  2,   4,   6, 
 -2, -5 :    0 :     0   :   false :     0 :      0 :      0  :     true : false :  0,   5,   1,   7, 
 -5, -3 :    0 :     0   :   false :     0 :      0 :      0  :     true : false :  8,   3, 
  2,  5 :    0 :     0   :   false :     0 :      0 :      0  :     true : false :  9, 

Balances: saldo  pay  groupbonus
  0:    270 Cent      10 Cent      0 Cent  
  1:    410 Cent      10 Cent      0 Cent  
  2:    640 Cent      30 Cent      0 Cent  
  3:    340 Cent      30 Cent      0 Cent  
  4:    450 Cent      30 Cent      0 Cent  
  5:    250 Cent      10 Cent      0 Cent  
  6:     24 wh       6 bl 
  7:     27 wh       3 bl 
  8:      9 wh      21 bl 
  9:      6 wh      24 bl 

##### next Spiel56: 	##### 

commonPlGr:
#Feld   :   ct :ctVisMode:ctVisible:Nuggets:Ct_local:Ct_global;NugVisible:Cleared:Players
 -5, -2 :    0 :     0   :   false :     0 :      0 :      0  :     true : false :  6, 
  5,  2 :    0 :     0   :   false :     0 :      0 :      0  :     true : false :  7, 
  2, -3 :    0 :     0   :   false :     0 :      0 :      0  :     true : false :  8, 
  3,  5 :    0 :     0   :   false :     0 :      0 :      0  :     true : false :  9, 
  0,  0 :    0 :     0   :   false :     0 :      0 :      0  :     true : false :  1,   3,   5,   4,   2,   0, 

Startzeit: 18:27:11,207


last common playground
#Feld   :   ct :ctVisMode:ctVisible:Nuggets:Ct_local:Ct_global;NugVisible:Cleared:Players
 -5, -2 :    0 :     0   :   false :     0 :      0 :      0  :     true : false :  6,   0,   2,   1, 
  5,  2 :    0 :     0   :   false :     0 :      0 :      0  :     true : false :  4,   7, 
  2, -3 :    0 :     0   :   false :     0 :      0 :      0  :     true : false :  8, 
  3,  5 :    0 :     0   :   false :     0 :      0 :      0  :     true : false :  5,   3,   9, 

Balances: saldo  pay  groupbonus
  0:    300 Cent      30 Cent      0 Cent  
  1:    440 Cent      30 Cent      0 Cent  
  2:    670 Cent      30 Cent      0 Cent  
  3:    340 Cent       0 Cent      0 Cent  
  4:    460 Cent      10 Cent      0 Cent  
  5:    250 Cent       0 Cent      0 Cent  
  6:     24 wh       6 bl 
  7:     27 wh       3 bl 
  8:      9 wh      21 bl 
  9:      6 wh      24 bl 


List of answers to questionnaire:
    /127.0.0.1:56876   1  [[, , , gielma], []] 
    /127.0.0.1:56886   5  [[, , , KARGHE], []] 
    /127.0.0.1:56878   2  [[, , , juenth], []] 
    /127.0.0.1:56880   3  [[, , , PedtTh], []] 
    /127.0.0.1:56884   4  [[, , , elerjo], []] 
    /127.0.0.1:56864   0  [[, , , suokhe], []] 
