#gnr; time; pid; sj; sj
  2; 18:14:17,692;  -1;   0;  0;
  2; 18:14:17,692;   0;   0;  0;; not_moved
  2; 18:14:17,692;   1;   0;  0;; not_moved
  2; 18:14:17,692;   2;   0;  0;; not_moved
  2; 18:14:17,692;   3;   0;  0;; not_moved
  2; 18:14:17,692;   4;   0;  0;; not_moved
  2; 18:14:17,692;   5;   0;  0;; not_moved
  2; 18:14:20,407;   3;  -1; -1;
  2; 18:14:21,474;   3;  -1; -1;; not_moved
  2; 18:14:24,133;   0;   1;  0;
  2; 18:14:24,507;   5;   1;  1;
  2; 18:14:25,138;   0;   1;  0;; not_moved
  2; 18:14:25,165;   3;  -1; -2;
  2; 18:14:25,317;   2;   1;  0;
  2; 18:14:25,602;   5;   1;  1;; not_moved
  2; 18:14:26,182;   3;  -1; -2;; not_moved
  2; 18:14:26,324;   2;   1;  0;; not_moved
  2; 18:14:27,660;   3;   0; -2;
  2; 18:14:28,244;   4;   0;  1;
  2; 18:14:28,689;   3;   0; -2;; not_moved
  2; 18:14:29,019;   5;   1;  2;
  2; 18:14:29,182;   0;   1; -1;
  2; 18:14:29,245;   4;   0;  1;; not_moved
  2; 18:14:29,408;   3;   1; -1;
  2; 18:14:29,656;   4;   0;  2;
  2; 18:14:30,046;   5;   1;  2;; not_moved
  2; 18:14:30,246;   0;   1; -1;; not_moved
  2; 18:14:30,391;   3;   1; -1;; not_moved
  2; 18:14:30,657;   4;   0;  2;; not_moved
  2; 18:14:30,796;   3;   1; -2;
  2; 18:14:31,088;   2;   2;  0;
  2; 18:14:31,103;   0;   1; -2;
  2; 18:14:31,736;   4;  -1;  2;
  2; 18:14:31,819;   3;   1; -2;; not_moved
  2; 18:14:32,135;   2;   2;  0;; not_moved
  2; 18:14:32,187;   0;   1; -2;; not_moved
  2; 18:14:32,773;   4;  -1;  2;; not_moved
  2; 18:14:32,987;   5;   2;  3;
  2; 18:14:33,039;   4;  -2;  1;
  2; 18:14:33,368;   0;   1; -3;
  2; 18:14:34,058;   5;   2;  3;; not_moved
  2; 18:14:34,077;   4;  -2;  1;; not_moved
  2; 18:14:34,392;   0;   1; -3;; not_moved
  2; 18:14:34,836;   0;   1; -4;
  2; 18:14:35,406;   5;   3;  3;
  2; 18:14:35,894;   0;   1; -4;; not_moved
  2; 18:14:36,506;   1;   0; -1;
  2; 18:14:36,508;   5;   3;  3;; not_moved
  2; 18:14:36,860;   4;  -2;  0;
  2; 18:14:37,578;   1;   0; -1;; not_moved
  2; 18:14:37,806;   5;   4;  4;
  2; 18:14:37,881;   4;  -2;  0;; not_moved
  2; 18:14:38,631;   2;   2; -1;
  2; 18:14:38,876;   5;   4;  4;; not_moved
  2; 18:14:39,401;   1;  -1; -2;
  2; 18:14:39,650;   2;   2; -1;; not_moved
  2; 18:14:40,482;   1;  -1; -2;; not_moved
  2; 18:14:41,065;   1;  -2; -3;
  2; 18:14:42,085;   1;  -2; -3;; not_moved
  2; 18:14:43,096;   1;  -3; -4;
  2; 18:14:43,465;   2;   1; -2;
  2; 18:14:44,232;   1;  -3; -4;; not_moved
  2; 18:14:44,506;   1;  -4; -5;
  2; 18:14:44,565;   2;   1; -2;; not_moved
  2; 18:14:45,593;   1;  -4; -5;; not_moved
  2; 18:14:46,222;   2;   2; -2;
 56; 18:17:02,223;  -1;   0;  0;
 56; 18:17:02,223;   0;   0;  0;; not_moved
 56; 18:17:02,223;   1;   0;  0;; not_moved
 56; 18:17:02,223;   2;   0;  0;; not_moved
 56; 18:17:02,223;   3;   0;  0;; not_moved
 56; 18:17:02,223;   4;   0;  0;; not_moved
 56; 18:17:02,223;   5;   0;  0;; not_moved
 56; 18:17:02,223;   6;   3; -2;; not_moved
 56; 18:17:02,223;   7;  -5; -3;; not_moved
 56; 18:17:02,223;   8;   2;  5;; not_moved
 56; 18:17:02,223;   9;   5;  3;; not_moved
 56; 18:17:05,173;   0;   1;  1;
 56; 18:17:06,188;   0;   1;  1;; not_moved
 56; 18:17:06,270;   3;   0;  1;
 56; 18:17:07,143;   3;   1;  2;
 56; 18:17:07,848;   2;   1;  1;
 56; 18:17:08,071;   3;   1;  3;
 56; 18:17:08,854;   2;   1;  1;; not_moved
 56; 18:17:08,895;   3;   2;  4;
 56; 18:17:09,862;   3;   2;  5;
 56; 18:17:10,012;   4;   1;  1;
 56; 18:17:10,057;   2;   1;  2;
 56; 18:17:10,827;   5;   0;  1;
 56; 18:17:10,921;   3;   2;  5;; not_moved
 56; 18:17:11,073;   2;   1;  2;; not_moved
 56; 18:17:11,095;   4;   1;  1;; not_moved
 56; 18:17:11,101;   2;   1;  3;
 56; 18:17:11,345;   1;  -1;  0;
 56; 18:17:11,640;   5;   1;  2;
 56; 18:17:12,092;   4;   1;  2;
 56; 18:17:12,212;   2;   2;  4;
 56; 18:17:12,354;   1;  -2; -1;
 56; 18:17:12,397;   5;   1;  3;
 56; 18:17:12,566;   0;   1;  2;
 56; 18:17:13,100;   4;   1;  2;; not_moved
 56; 18:17:13,125;   2;   2;  5;
 56; 18:17:13,155;   5;   2;  4;
 56; 18:17:13,379;   4;   1;  3;
 56; 18:17:13,393;   1;  -2; -1;; not_moved
 56; 18:17:13,502;   0;   1;  3;
 56; 18:17:13,968;   5;   2;  5;
 56; 18:17:14,202;   2;   2;  5;; not_moved
 56; 18:17:14,304;   4;   2;  4;
 56; 18:17:14,504;   0;   1;  3;; not_moved
 56; 18:17:14,562;   0;   2;  4;
 56; 18:17:14,961;   4;   2;  5;
 56; 18:17:14,997;   5;   2;  5;; not_moved
 56; 18:17:15,252;   0;   2;  5;
 56; 18:17:15,570;   1;  -3; -2;
 56; 18:17:16,014;   4;   2;  5;; not_moved
 56; 18:17:16,307;   0;   2;  5;; not_moved
 56; 18:17:16,476;   1;  -4; -3;
 56; 18:17:17,442;   1;  -5; -3;
 56; 18:17:17,448;  -1;   0;  0;
 56; 18:17:17,448;   0;   0;  0;; not_moved
 56; 18:17:17,448;   1;   0;  0;; not_moved
 56; 18:17:17,448;   2;   0;  0;; not_moved
 56; 18:17:17,448;   3;   0;  0;; not_moved
 56; 18:17:17,448;   4;   0;  0;; not_moved
 56; 18:17:17,448;   5;   0;  0;; not_moved
 56; 18:17:17,448;   6;  -1; -5;; not_moved
 56; 18:17:17,448;   7;   1;  5;; not_moved
 56; 18:17:17,448;   8;  -5; -4;; not_moved
 56; 18:17:17,448;   9;   4; -1;; not_moved
 56; 18:17:26,449;   0;   1;  0;
 56; 18:17:27,568;   0;   1;  0;; not_moved
 56; 18:17:27,650;   1;   1;  0;
 56; 18:17:27,683;   2;   1;  0;
 56; 18:17:27,728;   3;   1;  0;
 56; 18:17:28,562;   2;   2;  0;
 56; 18:17:28,604;   0;   2;  0;
 56; 18:17:28,717;   1;   1;  0;; not_moved
 56; 18:17:28,752;   3;   1;  0;; not_moved
 56; 18:17:29,282;   1;   2;  0;
 56; 18:17:29,464;   3;   2;  0;
 56; 18:17:29,470;   2;   3;  0;
 56; 18:17:29,549;   5;   1;  0;
 56; 18:17:29,627;   0;   2;  0;; not_moved
 56; 18:17:30,257;   0;   3;  0;
 56; 18:17:30,264;   2;   3; -1;
 56; 18:17:30,264;   5;   2;  0;
 56; 18:17:30,321;   1;   2;  0;; not_moved
 56; 18:17:30,330;   1;   3;  0;
 56; 18:17:30,416;   4;   0; -1;
 56; 18:17:30,455;   3;   2;  0;; not_moved
 56; 18:17:30,599;   3;   3;  0;
 56; 18:17:31,001;   2;   4; -1;
 56; 18:17:31,018;   4;   1; -1;
 56; 18:17:31,205;   5;   3;  0;
 56; 18:17:31,329;   0;   3;  0;; not_moved
 56; 18:17:31,423;   1;   3;  0;; not_moved
 56; 18:17:31,657;   3;   3;  0;; not_moved
 56; 18:17:31,660;   4;   1;  0;
 56; 18:17:31,779;   1;   3; -1;
 56; 18:17:32,023;   2;   4; -1;; not_moved
 56; 18:17:32,219;   5;   3;  0;; not_moved
 56; 18:17:32,495;   5;   3; -1;
 56; 18:17:32,575;   3;   3; -1;
 56; 18:17:32,618;   1;   4; -1;
 56; 18:17:32,718;   4;   2;  0;
 56; 18:17:33,144;   3;   4; -1;
 56; 18:17:33,222;   5;   4; -1;
 56; 18:17:33,627;   1;   4; -1;; not_moved
 56; 18:17:33,735;   4;   2;  0;; not_moved
 56; 18:17:33,882;   4;   3;  0;
 56; 18:17:34,165;   3;   4; -1;; not_moved
 56; 18:17:34,233;   5;   4; -1;; not_moved
 56; 18:17:34,404;   0;   4;  0;
 56; 18:17:34,936;   4;   3;  0;; not_moved
 56; 18:17:35,362;   0;   4; -1;
 56; 18:17:35,547;   4;   4;  0;
 56; 18:17:36,328;   4;   3; -1;
 56; 18:17:36,435;   0;   4; -1;; not_moved
 56; 18:17:37,165;   4;   4; -1;
 56; 18:17:37,169;  -1;   0;  0;
 56; 18:17:37,169;   0;   0;  0;; not_moved
 56; 18:17:37,169;   1;   0;  0;; not_moved
 56; 18:17:37,169;   2;   0;  0;; not_moved
 56; 18:17:37,169;   3;   0;  0;; not_moved
 56; 18:17:37,169;   4;   0;  0;; not_moved
 56; 18:17:37,169;   5;   0;  0;; not_moved
 56; 18:17:37,169;   6;  -4; -5;; not_moved
 56; 18:17:37,169;   7;   5;  1;; not_moved
 56; 18:17:37,169;   8;   1; -4;; not_moved
 56; 18:17:37,169;   9;  -5; -1;; not_moved
 56; 18:17:44,526;   0;   1;  0;
 56; 18:17:45,515;   3;   1;  0;
 56; 18:17:45,546;   0;   1;  0;; not_moved
 56; 18:17:45,812;   1;   1;  0;
 56; 18:17:45,994;   4;   1;  0;
 56; 18:17:46,586;   3;   1;  0;; not_moved
 56; 18:17:46,691;   2;   1;  0;
 56; 18:17:46,784;   3;   2;  0;
 56; 18:17:46,811;   0;   2;  0;
 56; 18:17:46,835;   1;   2;  0;
 56; 18:17:47,001;   4;   2;  0;
 56; 18:17:47,478;   2;   2;  0;
 56; 18:17:47,788;   3;   2;  0;; not_moved
 56; 18:17:47,830;   1;   3;  0;
 56; 18:17:47,849;   0;   2;  0;; not_moved
 56; 18:17:47,871;   0;   3;  0;
 56; 18:17:48,053;   4;   2;  0;; not_moved
 56; 18:17:48,280;   2;   3;  0;
 56; 18:17:48,336;   4;   2;  1;
 56; 18:17:48,426;   3;   3;  0;
 56; 18:17:48,581;   1;   4;  0;
 56; 18:17:48,992;   0;   3;  0;; not_moved
 56; 18:17:49,120;   4;   3;  1;
 56; 18:17:49,248;   2;   3;  0;; not_moved
 56; 18:17:49,269;   0;   4;  0;
 56; 18:17:49,405;   3;   4;  1;
 56; 18:17:49,425;   5;   1;  0;
 56; 18:17:49,603;   1;   5;  1;
 56; 18:17:49,884;   4;   4;  1;
 56; 18:17:50,011;   5;   2;  0;
 56; 18:17:50,125;   0;   5;  1;
 56; 18:17:50,153;   2;   4;  0;
 56; 18:17:50,395;   3;   5;  1;
 56; 18:17:50,500;   4;   5;  1;
 56; 18:17:50,612;   5;   3;  0;
 56; 18:17:50,650;   1;   5;  1;; not_moved
 56; 18:17:50,817;   2;   5;  1;
 56; 18:17:51,153;   0;   5;  1;; not_moved
 56; 18:17:51,226;   5;   4;  0;
 56; 18:17:51,472;   4;   5;  1;; not_moved
 56; 18:17:51,506;   3;   5;  1;; not_moved
 56; 18:17:51,764;   5;   5;  1;
 56; 18:17:51,766;  -1;   0;  0;
 56; 18:17:51,766;   0;   0;  0;; not_moved
 56; 18:17:51,766;   1;   0;  0;; not_moved
 56; 18:17:51,766;   2;   0;  0;; not_moved
 56; 18:17:51,766;   3;   0;  0;; not_moved
 56; 18:17:51,766;   4;   0;  0;; not_moved
 56; 18:17:51,766;   5;   0;  0;; not_moved
 56; 18:17:51,766;   6;  -3; -5;; not_moved
 56; 18:17:51,766;   7;   3;  5;; not_moved
 56; 18:17:51,766;   8;   2; -3;; not_moved
 56; 18:17:51,766;   9;   5;  2;; not_moved
 56; 18:17:58,897;   0;  -1; -1;
 56; 18:18:00,008;   0;  -1; -1;; not_moved
 56; 18:18:00,375;   2;  -1; -1;
 56; 18:18:00,399;   0;  -2; -2;
 56; 18:18:00,880;   3;  -1; -1;
 56; 18:18:01,465;   2;  -1; -1;; not_moved
 56; 18:18:01,467;   0;  -2; -2;; not_moved
 56; 18:18:01,485;   2;  -2; -2;
 56; 18:18:01,656;   3;  -2; -2;
 56; 18:18:02,245;   0;  -2; -3;
 56; 18:18:02,295;   2;  -2; -3;
 56; 18:18:02,718;   3;  -2; -2;; not_moved
 56; 18:18:03,085;   4;  -1; -1;
 56; 18:18:03,087;   3;  -2; -3;
 56; 18:18:03,280;   0;  -2; -3;; not_moved
 56; 18:18:03,408;   2;  -2; -3;; not_moved
 56; 18:18:03,416;   2;  -3; -4;
 56; 18:18:03,828;   4;  -2; -2;
 56; 18:18:04,094;   3;  -3; -4;
 56; 18:18:04,343;   2;  -3; -5;
 56; 18:18:04,528;   4;  -2; -3;
 56; 18:18:04,788;   3;  -3; -5;
 56; 18:18:04,856;   0;  -3; -4;
 56; 18:18:04,879;   5;  -1; -1;
 56; 18:18:05,192;   4;  -3; -4;
 56; 18:18:05,377;   2;  -3; -5;; not_moved
 56; 18:18:05,730;   5;  -2; -2;
 56; 18:18:05,822;   3;  -3; -5;; not_moved
 56; 18:18:05,874;   0;  -3; -5;
 56; 18:18:05,963;   4;  -3; -5;
 56; 18:18:06,412;   5;  -2; -3;
 56; 18:18:06,885;   0;  -3; -5;; not_moved
 56; 18:18:06,996;   4;  -3; -5;; not_moved
 56; 18:18:07,120;   5;  -2; -4;
 56; 18:18:07,988;   5;  -3; -5;
 56; 18:18:09,009;   5;  -3; -5;; not_moved
 56; 18:18:18,131;   1;  -1; -1;
 56; 18:18:18,940;   1;  -2; -2;
 56; 18:18:19,345;   4;  -2; -4;
 56; 18:18:19,436;   1;  -3; -3;
 56; 18:18:20,090;   1;  -3; -4;
 56; 18:18:20,414;   4;  -2; -4;; not_moved
 56; 18:18:20,426;   4;  -3; -5;
 56; 18:18:20,867;   1;  -3; -5;
 56; 18:18:20,871;  -1;   0;  0;
 56; 18:18:20,871;   0;   0;  0;; not_moved
 56; 18:18:20,871;   1;   0;  0;; not_moved
 56; 18:18:20,871;   2;   0;  0;; not_moved
 56; 18:18:20,871;   3;   0;  0;; not_moved
 56; 18:18:20,871;   4;   0;  0;; not_moved
 56; 18:18:20,871;   5;   0;  0;; not_moved
 56; 18:18:20,871;   6;  -4;  1;; not_moved
 56; 18:18:20,871;   7;  -5; -4;; not_moved
 56; 18:18:20,871;   8;   5;  4;; not_moved
 56; 18:18:20,871;   9;  -1; -5;; not_moved
 56; 18:18:27,695;   0;   0; -1;
 56; 18:18:28,715;   0;   0; -1;; not_moved
 56; 18:18:28,954;   2;   0; -1;
 56; 18:18:29,036;   0;   0; -2;
 56; 18:18:29,382;   4;   0; -1;
 56; 18:18:29,819;   1;   0; -1;
 56; 18:18:29,829;   3;   0; -1;
 56; 18:18:30,013;   2;   0; -1;; not_moved
 56; 18:18:30,049;   2;   0; -2;
 56; 18:18:30,160;   0;   0; -2;; not_moved
 56; 18:18:30,200;   4;   0; -2;
 56; 18:18:30,385;   0;   0; -3;
 56; 18:18:30,532;   3;   0; -2;
 56; 18:18:30,688;   1;   0; -2;
 56; 18:18:30,920;   2;   0; -3;
 56; 18:18:31,068;   5;   0; -1;
 56; 18:18:31,104;   4;   0; -3;
 56; 18:18:31,213;   3;   0; -3;
 56; 18:18:31,377;   0;   0; -4;
 56; 18:18:31,516;   5;   0; -2;
 56; 18:18:31,634;   2;  -1; -4;
 56; 18:18:31,696;   1;   0; -3;
 56; 18:18:31,720;   4;   0; -4;
 56; 18:18:32,063;   5;   0; -3;
 56; 18:18:32,186;   0;  -1; -5;
 56; 18:18:32,255;   3;   0; -3;; not_moved
 56; 18:18:32,262;   4;  -1; -5;
 56; 18:18:32,379;   3;   0; -4;
 56; 18:18:32,386;   2;  -1; -5;
 56; 18:18:32,683;   5;   0; -4;
 56; 18:18:32,713;   1;   0; -3;; not_moved
 56; 18:18:32,796;   1;   0; -4;
 56; 18:18:32,821;   3;  -1; -5;
 56; 18:18:33,220;   0;  -1; -5;; not_moved
 56; 18:18:33,302;   5;  -1; -5;
 56; 18:18:33,334;   4;  -1; -5;; not_moved
 56; 18:18:33,417;   2;  -1; -5;; not_moved
 56; 18:18:33,731;   1;  -1; -5;
 56; 18:18:33,734;  -1;   0;  0;
 56; 18:18:33,734;   0;   0;  0;; not_moved
 56; 18:18:33,734;   1;   0;  0;; not_moved
 56; 18:18:33,734;   2;   0;  0;; not_moved
 56; 18:18:33,734;   3;   0;  0;; not_moved
 56; 18:18:33,734;   4;   0;  0;; not_moved
 56; 18:18:33,734;   5;   0;  0;; not_moved
 56; 18:18:33,734;   6;  -5; -4;; not_moved
 56; 18:18:33,734;   7;  -4;  1;; not_moved
 56; 18:18:33,734;   8;   4; -1;; not_moved
 56; 18:18:33,734;   9;  -1; -5;; not_moved
 56; 18:18:40,632;   0;  -1;  0;
 56; 18:18:41,394;   4;  -1;  0;
 56; 18:18:41,634;   0;  -1;  0;; not_moved
 56; 18:18:41,823;   0;  -2;  0;
 56; 18:18:42,049;   4;  -2;  0;
 56; 18:18:42,217;   3;  -1;  0;
 56; 18:18:42,572;   4;  -3;  0;
 56; 18:18:42,803;   1;  -1;  0;
 56; 18:18:42,835;   0;  -2;  0;; not_moved
 56; 18:18:42,865;   3;  -2;  0;
 56; 18:18:43,048;   4;  -4;  0;
 56; 18:18:43,448;   0;  -3;  0;
 56; 18:18:43,544;   4;  -4;  1;
 56; 18:18:43,588;   5;  -1;  0;
 56; 18:18:43,610;   1;  -2;  0;
 56; 18:18:43,648;   3;  -3;  0;
 56; 18:18:44,046;   2;  -1;  0;
 56; 18:18:44,181;   5;  -2;  0;
 56; 18:18:44,256;   3;  -4;  0;
 56; 18:18:44,308;   1;  -3;  0;
 56; 18:18:44,392;   0;  -4;  0;
 56; 18:18:44,592;   4;  -4;  1;; not_moved
 56; 18:18:44,628;   5;  -3;  0;
 56; 18:18:44,768;   2;  -2;  0;
 56; 18:18:44,915;   3;  -4;  1;
 56; 18:18:44,923;   1;  -4;  0;
 56; 18:18:45,299;   5;  -4;  0;
 56; 18:18:45,397;   0;  -4;  1;
 56; 18:18:45,470;   2;  -3;  0;
 56; 18:18:45,707;   1;  -4;  1;
 56; 18:18:45,825;   5;  -4;  1;
 56; 18:18:46,003;   3;  -4;  1;; not_moved
 56; 18:18:46,231;   2;  -3;  1;
 56; 18:18:46,440;   0;  -4;  1;; not_moved
 56; 18:18:46,730;   1;  -4;  1;; not_moved
 56; 18:18:46,872;   5;  -4;  1;; not_moved
 56; 18:18:47,243;   2;  -3;  1;; not_moved
 56; 18:19:09,691;   4;; timeout
 56; 18:19:09,710;   5;; timeout
 56; 18:19:09,757;   3;; timeout
 56; 18:19:09,766;   1;; timeout
 56; 18:19:09,772;   2;; timeout
 56; 18:19:09,774;  -1;   0;  0;
 56; 18:19:09,774;   0;   0;  0;; not_moved
 56; 18:19:09,774;   1;   0;  0;; not_moved
 56; 18:19:09,774;   2;   0;  0;; not_moved
 56; 18:19:09,774;   3;   0;  0;; not_moved
 56; 18:19:09,774;   4;   0;  0;; not_moved
 56; 18:19:09,774;   5;   0;  0;; not_moved
 56; 18:19:09,774;   6;  -5; -4;; not_moved
 56; 18:19:09,774;   7;   4; -1;; not_moved
 56; 18:19:09,774;   8;  -1; -5;; not_moved
 56; 18:19:09,774;   9;   1;  5;; not_moved
 56; 18:19:16,497;   5;   1;  0;
 56; 18:19:17,514;   5;   1;  0;; not_moved
 56; 18:19:17,625;   0;   1;  0;
 56; 18:19:17,675;   1;   1;  0;
 56; 18:19:17,829;   2;   1;  0;
 56; 18:19:18,116;   4;   1;  0;
 56; 18:19:18,299;   1;   2;  0;
 56; 18:19:18,497;   5;   2;  0;
 56; 18:19:18,557;   4;   2;  0;
 56; 18:19:18,662;   0;   2;  0;
 56; 18:19:18,832;   2;   2;  0;
 56; 18:19:19,050;   4;   3;  0;
 56; 18:19:19,060;   1;   3;  0;
 56; 18:19:19,102;   3;   1;  0;
 56; 18:19:19,232;   5;   3;  0;
 56; 18:19:19,271;   0;   3;  0;
 56; 18:19:19,566;   4;   4;  0;
 56; 18:19:19,739;   1;   4;  0;
 56; 18:19:19,827;   2;   3;  0;
 56; 18:19:19,834;   3;   2;  0;
 56; 18:19:19,852;   5;   4;  0;
 56; 18:19:19,906;   0;   4;  0;
 56; 18:19:20,100;   4;   4; -1;
 56; 18:19:20,414;   5;   4; -1;
 56; 18:19:20,419;   1;   4; -1;
 56; 18:19:20,556;   3;   3;  0;
 56; 18:19:20,562;   2;   4;  0;
 56; 18:19:20,685;   0;   4; -1;
 56; 18:19:21,152;   4;   4; -1;; not_moved
 56; 18:19:21,374;   2;   4; -1;
 56; 18:19:21,418;   3;   4;  0;
 56; 18:19:21,419;   5;   4; -1;; not_moved
 56; 18:19:21,480;   1;   4; -1;; not_moved
 56; 18:19:21,732;   0;   4; -1;; not_moved
 56; 18:19:22,127;   3;   4; -1;
 56; 18:19:22,129;  -1;   0;  0;
 56; 18:19:22,129;   0;   0;  0;; not_moved
 56; 18:19:22,129;   1;   0;  0;; not_moved
 56; 18:19:22,129;   2;   0;  0;; not_moved
 56; 18:19:22,129;   3;   0;  0;; not_moved
 56; 18:19:22,129;   4;   0;  0;; not_moved
 56; 18:19:22,129;   5;   0;  0;; not_moved
 56; 18:19:22,129;   6;   5;  1;; not_moved
 56; 18:19:22,129;   7;  -1;  4;; not_moved
 56; 18:19:22,129;   8;   4;  5;; not_moved
 56; 18:19:22,129;   9;  -4; -5;; not_moved
 56; 18:19:29,574;   0;   0; -1;
 56; 18:19:29,948;   4;   1;  0;
 56; 18:19:30,602;   0;   0; -1;; not_moved
 56; 18:19:30,731;   1;   0; -1;
 56; 18:19:30,832;   4;   2;  0;
 56; 18:19:31,793;   1;   0; -1;; not_moved
 56; 18:19:31,924;   4;   2;  0;; not_moved
 56; 18:19:32,083;   1;   1; -1;
 56; 18:19:32,136;   4;   3;  0;
 56; 18:19:32,947;   1;   2; -1;
 56; 18:19:33,224;   2;   1;  0;
 56; 18:19:33,240;   4;   3;  0;; not_moved
 56; 18:19:33,340;   4;   4;  0;
 56; 18:19:33,995;   1;   2; -1;; not_moved
 56; 18:19:34,000;   2;   2;  0;
 56; 18:19:34,113;   3;   1;  0;
 56; 18:19:34,250;   1;   3; -1;
 56; 18:19:34,268;   4;   5;  1;
 56; 18:19:34,765;   2;   3;  0;
 56; 18:19:34,784;   3;   2;  0;
 56; 18:19:34,901;   5;   1;  0;
 56; 18:19:34,957;   1;   4;  0;
 56; 18:19:35,230;   4;   5;  1;; not_moved
 56; 18:19:35,352;   5;   2;  0;
 56; 18:19:35,466;   3;   3;  0;
 56; 18:19:35,561;   2;   4;  1;
 56; 18:19:35,911;   5;   3;  0;
 56; 18:19:35,998;   1;   4;  0;; not_moved
 56; 18:19:36,226;   3;   4;  0;
 56; 18:19:36,342;   2;   5;  1;
 56; 18:19:36,492;   5;   4;  0;
 56; 18:19:36,896;   3;   5;  1;
 56; 18:19:36,945;   5;   5;  1;
 56; 18:19:37,104;   1;   5;  1;
 56; 18:19:37,406;   2;   5;  1;; not_moved
 56; 18:19:37,996;   3;   5;  1;; not_moved
 56; 18:19:38,039;   5;   5;  1;; not_moved
 56; 18:19:38,201;   1;   5;  1;; not_moved
 56; 18:19:39,115;   0;   1; -1;
 56; 18:19:40,187;   0;   2; -1;
 56; 18:19:41,078;   0;   3;  0;
 56; 18:19:42,116;   0;   3;  0;; not_moved
 56; 18:19:42,131;   0;   4;  0;
 56; 18:19:42,768;   0;   5;  1;
 56; 18:19:42,770;  -1;   0;  0;
 56; 18:19:42,770;   0;   0;  0;; not_moved
 56; 18:19:42,770;   1;   0;  0;; not_moved
 56; 18:19:42,770;   2;   0;  0;; not_moved
 56; 18:19:42,770;   3;   0;  0;; not_moved
 56; 18:19:42,770;   4;   0;  0;; not_moved
 56; 18:19:42,770;   5;   0;  0;; not_moved
 56; 18:19:42,770;   6;   4;  5;; not_moved
 56; 18:19:42,770;   7;   1; -4;; not_moved
 56; 18:19:42,770;   8;  -1;  4;; not_moved
 56; 18:19:42,770;   9;   5;  1;; not_moved
 56; 18:19:50,736;   4;   1;  1;
 56; 18:19:50,838;   0;   0; -1;
 56; 18:19:51,300;   4;   2;  2;
 56; 18:19:51,854;   4;   3;  3;
 56; 18:19:51,935;   0;   0; -1;; not_moved
 56; 18:19:52,284;   1;   0; -1;
 56; 18:19:52,480;   4;   3;  4;
 56; 18:19:52,723;   2;   1;  1;
 56; 18:19:52,980;   4;   4;  5;
 56; 18:19:53,321;   1;   0; -1;; not_moved
 56; 18:19:53,671;   2;   2;  2;
 56; 18:19:54,055;   4;   4;  5;; not_moved
 56; 18:19:54,538;   5;   1;  1;
 56; 18:19:54,687;   3;   1;  1;
 56; 18:19:54,728;   2;   2;  2;; not_moved
 56; 18:19:54,762;   2;   3;  3;
 56; 18:19:55,152;   5;   1;  2;
 56; 18:19:55,515;   3;   2;  2;
 56; 18:19:55,567;   2;   3;  4;
 56; 18:19:55,665;   5;   2;  3;
 56; 18:19:56,154;   5;   3;  4;
 56; 18:19:56,507;   3;   3;  3;
 56; 18:19:56,560;   2;   4;  5;
 56; 18:19:56,676;   5;   4;  5;
 56; 18:19:57,204;   0;   1;  0;
 56; 18:19:57,260;   3;   3;  4;
 56; 18:19:57,532;   2;   4;  5;; not_moved
 56; 18:19:57,629;   1;   0;  0;
 56; 18:19:57,662;   5;   4;  5;; not_moved
 56; 18:19:57,961;   0;   1;  1;
 56; 18:19:58,148;   3;   4;  5;
 56; 18:19:58,452;   1;   1;  1;
 56; 18:19:58,677;   0;   2;  2;
 56; 18:19:59,125;   3;   4;  5;; not_moved
 56; 18:19:59,403;   1;   2;  2;
 56; 18:19:59,455;   0;   3;  3;
 56; 18:20:00,308;   1;   2;  3;
 56; 18:20:00,412;   0;   3;  4;
 56; 18:20:00,910;   0;   4;  5;
 56; 18:20:01,100;   1;   3;  4;
 56; 18:20:01,789;   1;   4;  5;
 56; 18:20:01,792;  -1;   0;  0;
 56; 18:20:01,792;   0;   0;  0;; not_moved
 56; 18:20:01,792;   1;   0;  0;; not_moved
 56; 18:20:01,792;   2;   0;  0;; not_moved
 56; 18:20:01,792;   3;   0;  0;; not_moved
 56; 18:20:01,792;   4;   0;  0;; not_moved
 56; 18:20:01,792;   5;   0;  0;; not_moved
 56; 18:20:01,792;   6;   5;  2;; not_moved
 56; 18:20:01,792;   7;   2; -3;; not_moved
 56; 18:20:01,792;   8;  -2;  3;; not_moved
 56; 18:20:01,792;   9;   3;  5;; not_moved
 56; 18:20:09,782;   1;   1;  0;
 56; 18:20:09,978;   4;   1;  0;
 56; 18:20:10,470;   4;   2;  0;
 56; 18:20:10,485;   1;   2;  0;
 56; 18:20:11,012;   4;   3;  1;
 56; 18:20:11,070;   2;   1;  0;
 56; 18:20:11,086;   1;   3;  0;
 56; 18:20:11,591;   4;   4;  2;
 56; 18:20:11,630;   0;   1;  1;
 56; 18:20:11,644;   1;   4;  1;
 56; 18:20:11,854;   2;   2;  0;
 56; 18:20:12,072;   4;   5;  2;
 56; 18:20:12,203;   1;   5;  2;
 56; 18:20:12,628;   2;   3;  1;
 56; 18:20:12,662;   0;   1;  1;; not_moved
 56; 18:20:13,082;   4;   5;  2;; not_moved
 56; 18:20:13,250;   1;   5;  2;; not_moved
 56; 18:20:13,278;   2;   4;  2;
 56; 18:20:13,284;   0;   2;  1;
 56; 18:20:13,600;   5;   1;  1;
 56; 18:20:13,647;   3;   1;  0;
 56; 18:20:14,014;   5;   2;  1;
 56; 18:20:14,060;   2;   5;  2;
 56; 18:20:14,214;   3;   2;  0;
 56; 18:20:14,265;   0;   2;  1;; not_moved
 56; 18:20:14,457;   5;   3;  1;
 56; 18:20:14,498;   0;   3;  1;
 56; 18:20:14,757;   3;   3;  1;
 56; 18:20:14,926;   5;   4;  2;
 56; 18:20:15,154;   2;   5;  2;; not_moved
 56; 18:20:15,256;   3;   4;  2;
 56; 18:20:15,287;   0;   4;  2;
 56; 18:20:15,454;   5;   5;  2;
 56; 18:20:15,640;   0;   5;  2;
 56; 18:20:15,868;   3;   5;  2;
 56; 18:20:15,870;  -1;   0;  0;
 56; 18:20:15,870;   0;   0;  0;; not_moved
 56; 18:20:15,870;   1;   0;  0;; not_moved
 56; 18:20:15,870;   2;   0;  0;; not_moved
 56; 18:20:15,870;   3;   0;  0;; not_moved
 56; 18:20:15,870;   4;   0;  0;; not_moved
 56; 18:20:15,870;   5;   0;  0;; not_moved
 56; 18:20:15,870;   6;  -3;  2;; not_moved
 56; 18:20:15,870;   7;  -2; -5;; not_moved
 56; 18:20:15,870;   8;  -5; -3;; not_moved
 56; 18:20:15,870;   9;   5;  3;; not_moved
 56; 18:20:23,330;   0;  -1; -1;
 56; 18:20:24,129;   0;  -2; -1;
 56; 18:20:24,307;   4;  -1;  0;
 56; 18:20:24,859;   4;  -2;  0;
 56; 18:20:24,910;   0;  -3; -2;
 56; 18:20:24,967;   5;  -1; -1;
 56; 18:20:25,260;   2;  -1; -1;
 56; 18:20:25,407;   4;  -2;  1;
 56; 18:20:25,475;   1;  -1; -1;
 56; 18:20:25,482;   5;  -2; -1;
 56; 18:20:25,906;   0;  -4; -2;
 56; 18:20:25,989;   2;  -2; -1;
 56; 18:20:26,098;   4;  -2;  2;
 56; 18:20:26,214;   5;  -3; -1;
 56; 18:20:26,355;   1;  -2; -1;
 56; 18:20:26,632;   4;  -3;  2;
 56; 18:20:26,698;   0;  -5; -3;
 56; 18:20:26,771;   5;  -4; -2;
 56; 18:20:26,905;   2;  -3; -2;
 56; 18:20:27,182;   1;  -3; -2;
 56; 18:20:27,456;   5;  -5; -3;
 56; 18:20:27,601;   4;  -3;  2;; not_moved
 56; 18:20:27,731;   3;  -1; -1;
 56; 18:20:27,784;   0;  -5; -3;; not_moved
 56; 18:20:27,889;   2;  -4; -2;
 56; 18:20:27,907;   1;  -4; -3;
 56; 18:20:28,370;   3;  -2; -1;
 56; 18:20:28,506;   5;  -5; -3;; not_moved
 56; 18:20:28,613;   2;  -5; -3;
 56; 18:20:28,692;   1;  -5; -3;
 56; 18:20:28,929;   3;  -3; -2;
 56; 18:20:29,489;   3;  -4; -2;
 56; 18:20:29,673;   2;  -5; -3;; not_moved
 56; 18:20:29,674;   1;  -5; -3;; not_moved
 56; 18:20:30,109;   3;  -5; -3;
 56; 18:20:30,114;  -1;   0;  0;
 56; 18:20:30,114;   0;   0;  0;; not_moved
 56; 18:20:30,114;   1;   0;  0;; not_moved
 56; 18:20:30,114;   2;   0;  0;; not_moved
 56; 18:20:30,114;   3;   0;  0;; not_moved
 56; 18:20:30,114;   4;   0;  0;; not_moved
 56; 18:20:30,114;   5;   0;  0;; not_moved
 56; 18:20:30,114;   6;   2;  5;; not_moved
 56; 18:20:30,114;   7;   3; -2;; not_moved
 56; 18:20:30,114;   8;   5;  3;; not_moved
 56; 18:20:30,114;   9;  -3;  2;; not_moved
 56; 18:20:37,644;   0;   1;  1;
 56; 18:20:38,414;   0;   2;  1;
 56; 18:20:38,478;   1;   1;  0;
 56; 18:20:38,787;   2;   1;  1;
 56; 18:20:39,084;   0;   3;  2;
 56; 18:20:39,229;   1;   2;  1;
 56; 18:20:39,705;   2;   2;  1;
 56; 18:20:39,738;   3;   1;  1;
 56; 18:20:39,811;   0;   4;  2;
 56; 18:20:39,910;   5;   1;  1;
 56; 18:20:39,933;   1;   3;  2;
 56; 18:20:40,239;   3;   2;  1;
 56; 18:20:40,303;   5;   2;  1;
 56; 18:20:40,351;   4;   1;  1;
 56; 18:20:40,446;   2;   3;  2;
 56; 18:20:40,544;   1;   4;  3;
 56; 18:20:40,575;   0;   5;  3;
 56; 18:20:40,757;   3;   3;  2;
 56; 18:20:40,824;   5;   3;  2;
 56; 18:20:41,063;   4;   2;  1;
 56; 18:20:41,129;   2;   4;  3;
 56; 18:20:41,258;   3;   4;  2;
 56; 18:20:41,268;   1;   5;  3;
 56; 18:20:41,296;   5;   4;  3;
 56; 18:20:41,599;   0;   5;  3;; not_moved
 56; 18:20:41,689;   4;   3;  2;
 56; 18:20:41,757;   5;   5;  3;
 56; 18:20:41,798;   2;   5;  3;
 56; 18:20:41,799;   3;   5;  3;
 56; 18:20:42,291;   1;   5;  3;; not_moved
 56; 18:20:42,501;   4;   4;  3;
 56; 18:20:42,835;   5;   5;  3;; not_moved
 56; 18:20:42,882;   3;   5;  3;; not_moved
 56; 18:20:42,926;   2;   5;  3;; not_moved
 56; 18:20:43,088;   4;   5;  3;
 56; 18:20:43,092;  -1;   0;  0;
 56; 18:20:43,092;   0;   0;  0;; not_moved
 56; 18:20:43,092;   1;   0;  0;; not_moved
 56; 18:20:43,092;   2;   0;  0;; not_moved
 56; 18:20:43,092;   3;   0;  0;; not_moved
 56; 18:20:43,092;   4;   0;  0;; not_moved
 56; 18:20:43,092;   5;   0;  0;; not_moved
 56; 18:20:43,092;   6;   5;  4;; not_moved
 56; 18:20:43,092;   7;   1;  5;; not_moved
 56; 18:20:43,092;   8;  -5; -4;; not_moved
 56; 18:20:43,092;   9;   4; -1;; not_moved
 56; 18:20:50,248;   0;   1;  0;
 56; 18:20:50,867;   0;   2;  0;
 56; 18:20:51,454;   0;   3;  0;
 56; 18:20:51,669;   1;   1;  0;
 56; 18:20:51,776;   5;   1;  0;
 56; 18:20:52,150;   5;   2;  0;
 56; 18:20:52,171;   0;   4;  0;
 56; 18:20:52,269;   1;   2;  0;
 56; 18:20:52,726;   5;   3;  0;
 56; 18:20:52,788;   1;   3;  0;
 56; 18:20:52,978;   0;   4; -1;
 56; 18:20:53,122;   3;   1;  0;
 56; 18:20:53,325;   5;   4;  0;
 56; 18:20:53,432;   1;   4;  0;
 56; 18:20:53,436;   2;   1;  0;
 56; 18:20:53,708;   3;   2;  0;
 56; 18:20:53,816;   5;   4; -1;
 56; 18:20:54,015;   0;   4; -1;; not_moved
 56; 18:20:54,154;   3;   3;  0;
 56; 18:20:54,237;   2;   2;  0;
 56; 18:20:54,270;   1;   4; -1;
 56; 18:20:54,690;   3;   4;  0;
 56; 18:20:54,871;   5;   4; -1;; not_moved
 56; 18:20:54,931;   4;   1;  0;
 56; 18:20:54,952;   2;   3;  0;
 56; 18:20:55,247;   3;   4; -1;
 56; 18:20:55,309;   1;   4; -1;; not_moved
 56; 18:20:55,458;   4;   2;  0;
 56; 18:20:55,756;   2;   4;  0;
 56; 18:20:56,031;   4;   3;  0;
 56; 18:20:56,301;   3;   4; -1;; not_moved
 56; 18:20:56,583;   2;   4; -1;
 56; 18:20:56,612;   4;   4;  0;
 56; 18:20:57,321;   4;   4; -1;
 56; 18:20:57,330;  -1;   0;  0;
 56; 18:20:57,330;   0;   0;  0;; not_moved
 56; 18:20:57,330;   1;   0;  0;; not_moved
 56; 18:20:57,330;   2;   0;  0;; not_moved
 56; 18:20:57,330;   3;   0;  0;; not_moved
 56; 18:20:57,330;   4;   0;  0;; not_moved
 56; 18:20:57,330;   5;   0;  0;; not_moved
 56; 18:20:57,330;   6;   1;  5;; not_moved
 56; 18:20:57,330;   7;  -4;  1;; not_moved
 56; 18:20:57,330;   8;  -1; -5;; not_moved
 56; 18:20:57,330;   9;  -5; -4;; not_moved
 56; 18:21:04,546;   0;   0;  1;
 56; 18:21:04,935;   4;   0;  1;
 56; 18:21:05,104;   0;  -1;  1;
 56; 18:21:05,404;   4;   0;  2;
 56; 18:21:05,751;   0;  -2;  1;
 56; 18:21:05,868;   4;   0;  3;
 56; 18:21:06,093;   1;   0;  1;
 56; 18:21:06,540;   0;  -3;  1;
 56; 18:21:06,719;   5;   0;  1;
 56; 18:21:06,869;   1;   0;  2;
 56; 18:21:06,954;   4;   0;  3;; not_moved
 56; 18:21:07,154;   5;  -1;  1;
 56; 18:21:07,533;   0;  -3;  1;; not_moved
 56; 18:21:07,852;   5;  -2;  1;
 56; 18:21:07,925;   1;   0;  2;; not_moved
 56; 18:21:08,113;   0;  -4;  1;
 56; 18:21:08,310;   3;   0;  1;
 56; 18:21:08,414;   5;  -3;  1;
 56; 18:21:08,420;   1;  -1;  2;
 56; 18:21:08,629;   2;   0;  1;
 56; 18:21:09,008;   5;  -4;  1;
 56; 18:21:09,135;   0;  -4;  1;; not_moved
 56; 18:21:09,171;   1;  -2;  1;
 56; 18:21:09,180;   4;   1;  4;
 56; 18:21:09,318;   3;   0;  1;; not_moved
 56; 18:21:09,359;   2;   0;  2;
 56; 18:21:09,820;   4;   1;  5;
 56; 18:21:10,005;   1;  -3;  1;
 56; 18:21:10,092;   5;  -4;  1;; not_moved
 56; 18:21:10,380;   2;   0;  2;; not_moved
 56; 18:21:10,380;   2;  -1;  2;
 56; 18:21:10,859;   4;   1;  5;; not_moved
 56; 18:21:10,971;   1;  -4;  1;
 56; 18:21:11,434;   2;  -1;  2;; not_moved
 56; 18:21:11,437;   2;  -2;  1;
 56; 18:21:11,676;   3;  -1;  1;
 56; 18:21:12,030;   1;  -4;  1;; not_moved
 56; 18:21:12,161;   2;  -3;  1;
 56; 18:21:12,187;   3;  -2;  1;
 56; 18:21:12,685;   3;  -3;  1;
 56; 18:21:13,213;   3;  -4;  1;
 56; 18:21:13,236;   2;  -3;  1;; not_moved
 56; 18:21:14,225;   3;  -4;  1;; not_moved
 56; 18:21:33,292;   4;; timeout
 56; 18:21:33,308;   0;; timeout
 56; 18:21:33,326;   5;; timeout
 56; 18:21:33,351;   3;; timeout
 56; 18:21:33,363;   1;; timeout
 56; 18:21:33,364;   2;; timeout
 56; 18:21:33,367;  -1;   0;  0;
 56; 18:21:33,367;   0;   0;  0;; not_moved
 56; 18:21:33,367;   1;   0;  0;; not_moved
 56; 18:21:33,367;   2;   0;  0;; not_moved
 56; 18:21:33,367;   3;   0;  0;; not_moved
 56; 18:21:33,367;   4;   0;  0;; not_moved
 56; 18:21:33,367;   5;   0;  0;; not_moved
 56; 18:21:33,367;   6;  -5; -3;; not_moved
 56; 18:21:33,367;   7;  -2; -5;; not_moved
 56; 18:21:33,367;   8;   3; -2;; not_moved
 56; 18:21:33,367;   9;   2;  5;; not_moved
 56; 18:21:41,230;   1;   1;  0;
 56; 18:21:41,783;   4;  -1; -1;
 56; 18:21:41,900;   1;   2;  0;
 56; 18:21:42,307;   4;  -2; -1;
 56; 18:21:42,328;   2;   1;  0;
 56; 18:21:42,393;   0;   1;  0;
 56; 18:21:42,469;   1;   3;  0;
 56; 18:21:42,953;   4;  -3; -2;
 56; 18:21:43,118;   1;   3; -1;
 56; 18:21:43,387;   2;   1;  0;; not_moved
 56; 18:21:43,481;   0;   1;  0;; not_moved
 56; 18:21:43,603;   4;  -4; -3;
 56; 18:21:43,610;   0;   2;  0;
 56; 18:21:43,701;   1;   3; -2;
 56; 18:21:43,801;   2;   2;  0;
 56; 18:21:44,251;   4;  -5; -3;
 56; 18:21:44,540;   2;   2; -1;
 56; 18:21:44,683;   0;   2;  0;; not_moved
 56; 18:21:44,781;   1;   3; -2;; not_moved
 56; 18:21:45,000;   0;   3;  0;
 56; 18:21:45,305;   2;   3; -1;
 56; 18:21:45,347;   4;  -5; -3;; not_moved
 56; 18:21:45,566;   5;   0; -1;
 56; 18:21:45,986;   0;   3;  0;; not_moved
 56; 18:21:46,200;   2;   3; -2;
 56; 18:21:46,201;   5;   1; -1;
 56; 18:21:47,113;   0;   3; -1;
 56; 18:21:47,143;   5;   2; -1;
 56; 18:21:47,192;   2;   3; -2;; not_moved
 56; 18:21:47,568;   5;   3; -1;
 56; 18:21:47,751;   3;   1;  0;
 56; 18:21:48,048;   5;   3; -2;
 56; 18:21:48,137;   0;   3; -2;
 56; 18:21:48,187;   3;   2;  0;
 56; 18:21:48,716;   3;   3;  0;
 56; 18:21:49,060;   5;   3; -2;; not_moved
 56; 18:21:49,147;   3;   3; -1;
 56; 18:21:49,190;   0;   3; -2;; not_moved
 56; 18:21:49,641;   3;   3; -2;
 56; 18:21:49,645;  -1;   0;  0;
 56; 18:21:49,645;   0;   0;  0;; not_moved
 56; 18:21:49,645;   1;   0;  0;; not_moved
 56; 18:21:49,645;   2;   0;  0;; not_moved
 56; 18:21:49,645;   3;   0;  0;; not_moved
 56; 18:21:49,645;   4;   0;  0;; not_moved
 56; 18:21:49,645;   5;   0;  0;; not_moved
 56; 18:21:49,645;   6;  -5; -1;; not_moved
 56; 18:21:49,645;   7;   4;  5;; not_moved
 56; 18:21:49,645;   8;   5;  1;; not_moved
 56; 18:21:49,645;   9;  -1;  4;; not_moved
 56; 18:21:57,246;   1;  -1;  0;
 56; 18:21:57,631;   0;   1;  0;
 56; 18:21:57,870;   1;  -2;  0;
 56; 18:21:58,092;   4;  -1;  0;
 56; 18:21:58,373;   1;  -3;  0;
 56; 18:21:58,704;   0;   1;  0;; not_moved
 56; 18:21:58,788;   4;  -2;  0;
 56; 18:21:58,997;   1;  -4;  0;
 56; 18:21:59,080;   2;  -1;  0;
 56; 18:21:59,208;   0;   0;  0;
 56; 18:21:59,338;   4;  -3;  0;
 56; 18:21:59,796;   1;  -5; -1;
 56; 18:21:59,936;   4;  -4;  0;
 56; 18:21:59,966;   3;  -1;  0;
 56; 18:22:00,011;   5;  -1;  0;
 56; 18:22:00,018;   2;  -2;  0;
 56; 18:22:00,056;   0;  -1;  0;
 56; 18:22:00,382;   3;  -2;  0;
 56; 18:22:00,406;   4;  -5; -1;
 56; 18:22:00,576;   5;  -2;  0;
 56; 18:22:00,752;   2;  -3;  0;
 56; 18:22:00,802;   1;  -5; -1;; not_moved
 56; 18:22:00,807;   0;  -2;  0;
 56; 18:22:00,822;   3;  -3;  0;
 56; 18:22:00,954;   5;  -3;  0;
 56; 18:22:01,266;   3;  -4;  0;
 56; 18:22:01,345;   5;  -4; -1;
 56; 18:22:01,475;   4;  -5; -1;; not_moved
 56; 18:22:01,553;   2;  -4;  0;
 56; 18:22:01,634;   0;  -3;  0;
 56; 18:22:01,685;   3;  -5; -1;
 56; 18:22:01,752;   5;  -5; -1;
 56; 18:22:02,258;   2;  -5; -1;
 56; 18:22:02,335;   0;  -4; -1;
 56; 18:22:02,691;   3;  -5; -1;; not_moved
 56; 18:22:02,791;   5;  -5; -1;; not_moved
 56; 18:22:03,316;   2;  -5; -1;; not_moved
 56; 18:22:03,452;   0;  -4; -1;; not_moved
 56; 18:22:04,501;   0;  -5; -1;
 56; 18:22:04,502;  -1;   0;  0;
 56; 18:22:04,502;   0;   0;  0;; not_moved
 56; 18:22:04,502;   1;   0;  0;; not_moved
 56; 18:22:04,502;   2;   0;  0;; not_moved
 56; 18:22:04,502;   3;   0;  0;; not_moved
 56; 18:22:04,502;   4;   0;  0;; not_moved
 56; 18:22:04,502;   5;   0;  0;; not_moved
 56; 18:22:04,502;   6;  -4;  1;; not_moved
 56; 18:22:04,502;   7;   1;  5;; not_moved
 56; 18:22:04,502;   8;  -1; -5;; not_moved
 56; 18:22:04,502;   9;   5;  4;; not_moved
 56; 18:22:12,454;   1;   1;  0;
 56; 18:22:12,936;   4;  -1;  0;
 56; 18:22:13,050;   1;   2;  1;
 56; 18:22:13,460;   4;  -2;  0;
 56; 18:22:13,573;   1;   3;  2;
 56; 18:22:13,894;   4;  -3;  0;
 56; 18:22:14,071;   1;   4;  3;
 56; 18:22:14,607;   4;  -3;  1;
 56; 18:22:14,693;   1;   5;  4;
 56; 18:22:15,206;   4;  -4;  1;
 56; 18:22:15,723;   1;   5;  4;; not_moved
 56; 18:22:16,302;   4;  -4;  1;; not_moved
 56; 18:22:16,470;   3;  -1;  0;
 56; 18:22:16,524;   2;   1;  1;
 56; 18:22:16,928;   3;  -2;  0;
 56; 18:22:17,201;   2;   2;  2;
 56; 18:22:17,544;   3;  -3;  0;
 56; 18:22:17,992;   3;  -3;  1;
 56; 18:22:18,013;   2;   3;  3;
 56; 18:22:18,489;   3;  -4;  1;
 56; 18:22:18,598;   0;   1;  1;
 56; 18:22:18,983;   2;   4;  3;
 56; 18:22:19,382;   0;   2;  2;
 56; 18:22:19,513;   3;  -4;  1;; not_moved
 56; 18:22:19,763;   2;   5;  4;
 56; 18:22:20,271;   0;   3;  2;
 56; 18:22:20,845;   2;   5;  4;; not_moved
 56; 18:22:20,879;   0;   4;  3;
 56; 18:22:21,738;   0;   5;  4;
 56; 18:22:22,524;   5;   1;  1;
 56; 18:22:22,837;   0;   5;  4;; not_moved
 56; 18:22:23,074;   5;   2;  2;
 56; 18:22:23,413;   5;   3;  2;
 56; 18:22:23,784;   5;   4;  3;
 56; 18:22:24,320;   5;   5;  4;
 56; 18:22:24,322;  -1;   0;  0;
 56; 18:22:24,322;   0;   0;  0;; not_moved
 56; 18:22:24,322;   1;   0;  0;; not_moved
 56; 18:22:24,322;   2;   0;  0;; not_moved
 56; 18:22:24,322;   3;   0;  0;; not_moved
 56; 18:22:24,322;   4;   0;  0;; not_moved
 56; 18:22:24,322;   5;   0;  0;; not_moved
 56; 18:22:24,322;   6;   3;  5;; not_moved
 56; 18:22:24,322;   7;  -5; -2;; not_moved
 56; 18:22:24,322;   8;   2; -3;; not_moved
 56; 18:22:24,322;   9;  -3; -5;; not_moved
 56; 18:22:31,854;   1;   0; -1;
 56; 18:22:32,445;   1;   0; -2;
 56; 18:22:33,040;   1;   0; -3;
 56; 18:22:33,528;   2;   0; -1;
 56; 18:22:33,687;   0;   0; -1;
 56; 18:22:33,729;   5;   0; -1;
 56; 18:22:33,822;   1;   1; -3;
 56; 18:22:34,321;   0;   0; -2;
 56; 18:22:34,333;   1;   2; -3;
 56; 18:22:34,563;   2;   0; -2;
 56; 18:22:34,573;   5;   0; -2;
 56; 18:22:35,059;   5;   1; -2;
 56; 18:22:35,110;   3;   0; -1;
 56; 18:22:35,171;   0;   0; -3;
 56; 18:22:35,245;   2;   1; -2;
 56; 18:22:35,356;   1;   2; -3;; not_moved
 56; 18:22:35,363;   4;   0; -1;
 56; 18:22:35,540;   5;   2; -2;
 56; 18:22:35,554;   3;   0; -2;
 56; 18:22:35,887;   0;   1; -3;
 56; 18:22:35,911;   2;   2; -2;
 56; 18:22:35,978;   4;   0; -2;
 56; 18:22:36,118;   3;   0; -3;
 56; 18:22:36,213;   5;   2; -3;
 56; 18:22:36,553;   3;   1; -3;
 56; 18:22:36,621;   2;   2; -3;
 56; 18:22:36,706;   4;   1; -2;
 56; 18:22:36,958;   0;   1; -3;; not_moved
 56; 18:22:37,076;   3;   2; -3;
 56; 18:22:37,240;   5;   2; -3;; not_moved
 56; 18:22:37,253;   4;   2; -2;
 56; 18:22:37,672;   2;   2; -3;; not_moved
 56; 18:22:37,852;   4;   2; -3;
 56; 18:22:38,069;   3;   2; -3;; not_moved
 56; 18:22:38,832;   4;   2; -3;; not_moved
 56; 18:22:38,911;   0;   2; -3;
 56; 18:22:38,912;  -1;   0;  0;
 56; 18:22:38,912;   0;   0;  0;; not_moved
 56; 18:22:38,912;   1;   0;  0;; not_moved
 56; 18:22:38,912;   2;   0;  0;; not_moved
 56; 18:22:38,912;   3;   0;  0;; not_moved
 56; 18:22:38,912;   4;   0;  0;; not_moved
 56; 18:22:38,912;   5;   0;  0;; not_moved
 56; 18:22:38,912;   6;   3;  5;; not_moved
 56; 18:22:38,912;   7;   2; -3;; not_moved
 56; 18:22:38,912;   8;  -3; -5;; not_moved
 56; 18:22:38,912;   9;   5;  2;; not_moved
 56; 18:22:46,318;   1;   1;  0;
 56; 18:22:46,854;   1;   2;  0;
 56; 18:22:47,392;   1;   3;  0;
 56; 18:22:47,824;   5;   1;  0;
 56; 18:22:47,881;   1;   4;  1;
 56; 18:22:47,960;   0;   1;  0;
 56; 18:22:48,373;   1;   5;  2;
 56; 18:22:48,438;   5;   2;  0;
 56; 18:22:48,532;   0;   2;  0;
 56; 18:22:49,023;   5;   3;  0;
 56; 18:22:49,377;   1;   5;  2;; not_moved
 56; 18:22:49,470;   0;   3;  0;
 56; 18:22:49,601;   5;   4;  1;
 56; 18:22:50,214;   3;   1;  0;
 56; 18:22:50,225;   5;   5;  2;
 56; 18:22:50,260;   2;   1;  0;
 56; 18:22:50,426;   0;   4;  1;
 56; 18:22:50,873;   2;   2;  1;
 56; 18:22:51,026;   3;   2;  0;
 56; 18:22:51,040;   0;   5;  2;
 56; 18:22:51,256;   5;   5;  2;; not_moved
 56; 18:22:51,563;   2;   3;  1;
 56; 18:22:51,709;   3;   3;  0;
 56; 18:22:52,078;   0;   5;  2;; not_moved
 56; 18:22:52,316;   2;   4;  2;
 56; 18:22:52,445;   3;   4;  1;
 56; 18:22:52,854;   4;  -1; -1;
 56; 18:22:53,085;   2;   5;  2;
 56; 18:22:53,222;   3;   5;  2;
 56; 18:22:53,477;   4;  -1; -2;
 56; 18:22:53,986;   4;  -2; -3;
 56; 18:22:54,096;   2;   5;  2;; not_moved
 56; 18:22:54,292;   3;   5;  2;; not_moved
 56; 18:22:54,552;   4;  -3; -4;
 56; 18:22:55,014;   4;  -3; -5;
 56; 18:22:55,019;  -1;   0;  0;
 56; 18:22:55,019;   0;   0;  0;; not_moved
 56; 18:22:55,019;   1;   0;  0;; not_moved
 56; 18:22:55,019;   2;   0;  0;; not_moved
 56; 18:22:55,019;   3;   0;  0;; not_moved
 56; 18:22:55,019;   4;   0;  0;; not_moved
 56; 18:22:55,019;   5;   0;  0;; not_moved
 56; 18:22:55,019;   6;   5;  1;; not_moved
 56; 18:22:55,019;   7;   1; -4;; not_moved
 56; 18:22:55,019;   8;  -4; -5;; not_moved
 56; 18:22:55,019;   9;   4;  5;; not_moved
 56; 18:23:02,604;   0;   1;  1;
 56; 18:23:02,623;   1;   1;  1;
 56; 18:23:03,383;   1;   2;  2;
 56; 18:23:03,481;   4;   1;  0;
 56; 18:23:03,590;   0;   2;  2;
 56; 18:23:03,779;   2;   1;  1;
 56; 18:23:04,398;   1;   2;  2;; not_moved
 56; 18:23:04,461;   0;   3;  3;
 56; 18:23:04,480;   2;   2;  2;
 56; 18:23:04,564;   4;   1;  0;; not_moved
 56; 18:23:04,959;   5;   1;  1;
 56; 18:23:05,136;   0;   4;  4;
 56; 18:23:05,511;   2;   2;  2;; not_moved
 56; 18:23:05,913;   0;   4;  5;
 56; 18:23:05,922;   2;   3;  3;
 56; 18:23:05,974;   5;   1;  1;; not_moved
 56; 18:23:06,314;   3;   1;  1;
 56; 18:23:06,586;   5;   2;  2;
 56; 18:23:06,600;   2;   4;  4;
 56; 18:23:06,880;   3;   2;  2;
 56; 18:23:07,003;   0;   4;  5;; not_moved
 56; 18:23:07,352;   5;   3;  3;
 56; 18:23:07,388;   2;   4;  5;
 56; 18:23:07,392;   3;   3;  3;
 56; 18:23:07,859;   5;   4;  4;
 56; 18:23:07,931;   3;   4;  4;
 56; 18:23:08,414;   2;   4;  5;; not_moved
 56; 18:23:08,446;   3;   4;  5;
 56; 18:23:08,468;   5;   4;  5;
 56; 18:23:08,934;   4;   2;  1;
 56; 18:23:09,149;   1;   3;  3;
 56; 18:23:09,479;   5;   4;  5;; not_moved
 56; 18:23:09,495;   4;   2;  2;
 56; 18:23:09,513;   3;   4;  5;; not_moved
 56; 18:23:09,870;   1;   4;  4;
 56; 18:23:10,108;   4;   3;  3;
 56; 18:23:10,593;   4;   4;  4;
 56; 18:23:10,853;   1;   4;  5;
 56; 18:23:11,010;   4;   4;  5;
 56; 18:23:11,012;  -1;   0;  0;
 56; 18:23:11,012;   0;   0;  0;; not_moved
 56; 18:23:11,012;   1;   0;  0;; not_moved
 56; 18:23:11,012;   2;   0;  0;; not_moved
 56; 18:23:11,012;   3;   0;  0;; not_moved
 56; 18:23:11,012;   4;   0;  0;; not_moved
 56; 18:23:11,012;   5;   0;  0;; not_moved
 56; 18:23:11,012;   6;  -2;  3;; not_moved
 56; 18:23:11,012;   7;  -3; -5;; not_moved
 56; 18:23:11,012;   8;   2; -3;; not_moved
 56; 18:23:11,012;   9;   3;  5;; not_moved
 56; 18:23:18,104;   0;  -1; -1;
 56; 18:23:18,541;   1;   1;  0;
 56; 18:23:18,947;   0;  -2; -2;
 56; 18:23:19,077;   1;   1; -1;
 56; 18:23:19,556;   5;  -1; -1;
 56; 18:23:19,630;   1;   1; -2;
 56; 18:23:20,026;   0;  -2; -2;; not_moved
 56; 18:23:20,046;   5;  -2; -2;
 56; 18:23:20,336;   0;  -2; -3;
 56; 18:23:20,496;   1;   1; -3;
 56; 18:23:20,582;   5;  -2; -3;
 56; 18:23:21,181;   1;   2; -3;
 56; 18:23:21,227;   5;  -2; -4;
 56; 18:23:21,302;   0;  -2; -4;
 56; 18:23:21,616;   4;   0; -1;
 56; 18:23:21,752;   5;  -3; -5;
 56; 18:23:22,038;   2;  -1; -1;
 56; 18:23:22,174;   4;   0; -2;
 56; 18:23:22,230;   1;   2; -3;; not_moved
 56; 18:23:22,328;   0;  -3; -5;
 56; 18:23:22,680;   4;   1; -2;
 56; 18:23:22,799;   5;  -3; -5;; not_moved
 56; 18:23:22,815;   2;  -1; -2;
 56; 18:23:23,330;   0;  -3; -5;; not_moved
 56; 18:23:23,498;   4;   1; -3;
 56; 18:23:23,624;   2;  -2; -3;
 56; 18:23:24,183;   4;   2; -3;
 56; 18:23:24,329;   2;  -2; -4;
 56; 18:23:24,948;   3;   0; -1;
 56; 18:23:25,071;   2;  -3; -5;
 56; 18:23:25,190;   4;   2; -3;; not_moved
 56; 18:23:25,564;   3;   0; -2;
 56; 18:23:26,091;   3;   1; -2;
 56; 18:23:26,143;   2;  -3; -5;; not_moved
 56; 18:23:26,571;   3;   2; -2;
 56; 18:23:27,051;   3;   2; -3;
 56; 18:23:27,053;  -1;   0;  0;
 56; 18:23:27,053;   0;   0;  0;; not_moved
 56; 18:23:27,053;   1;   0;  0;; not_moved
 56; 18:23:27,053;   2;   0;  0;; not_moved
 56; 18:23:27,053;   3;   0;  0;; not_moved
 56; 18:23:27,053;   4;   0;  0;; not_moved
 56; 18:23:27,053;   5;   0;  0;; not_moved
 56; 18:23:27,053;   6;  -4;  1;; not_moved
 56; 18:23:27,053;   7;   1;  5;; not_moved
 56; 18:23:27,053;   8;   5;  4;; not_moved
 56; 18:23:27,053;   9;  -5; -4;; not_moved
 56; 18:23:35,059;   4;  -1;  0;
 56; 18:23:35,438;   1;   1;  1;
 56; 18:23:35,614;   4;  -2;  0;
 56; 18:23:35,968;   1;   1;  2;
 56; 18:23:36,077;   4;  -3;  0;
 56; 18:23:36,521;   5;  -1;  0;
 56; 18:23:36,536;   4;  -4;  0;
 56; 18:23:36,600;   1;   1;  3;
 56; 18:23:36,982;   5;  -2;  0;
 56; 18:23:37,103;   1;   1;  4;
 56; 18:23:37,509;   0;  -1;  0;
 56; 18:23:37,574;   2;  -1;  0;
 56; 18:23:37,589;   5;  -3;  0;
 56; 18:23:37,607;   4;  -4;  0;; not_moved
 56; 18:23:37,611;   4;  -4;  1;
 56; 18:23:37,766;   1;   1;  5;
 56; 18:23:38,121;   5;  -3;  1;
 56; 18:23:38,145;   0;  -2;  0;
 56; 18:23:38,289;   2;  -2;  0;
 56; 18:23:38,628;   5;  -4;  1;
 56; 18:23:38,708;   4;  -4;  1;; not_moved
 56; 18:23:38,854;   1;   1;  5;; not_moved
 56; 18:23:39,012;   0;  -3;  0;
 56; 18:23:39,090;   2;  -3;  0;
 56; 18:23:39,619;   5;  -4;  1;; not_moved
 56; 18:23:39,688;   3;  -1;  0;
 56; 18:23:39,765;   2;  -3;  1;
 56; 18:23:39,851;   0;  -3;  1;
 56; 18:23:40,139;   3;  -2;  0;
 56; 18:23:40,431;   0;  -4;  1;
 56; 18:23:40,511;   3;  -3;  0;
 56; 18:23:40,786;   2;  -3;  1;; not_moved
 56; 18:23:40,899;   3;  -3;  1;
 56; 18:23:41,280;   3;  -4;  1;
 56; 18:23:41,452;   0;  -4;  1;; not_moved
 56; 18:23:42,308;   3;  -4;  1;; not_moved
 56; 18:23:51,316;   3;  -3;  1;
 56; 18:23:51,804;   3;  -4;  1;
 56; 18:23:52,821;   3;  -4;  1;; not_moved
 56; 18:24:03,035;   3;; timeout
 56; 18:24:03,039;   4;; timeout
 56; 18:24:03,054;   5;; timeout
 56; 18:24:03,087;   1;; timeout
 56; 18:24:03,093;   0;; timeout
 56; 18:24:03,116;   2;; timeout
 56; 18:24:03,117;  -1;   0;  0;
 56; 18:24:03,117;   0;   0;  0;; not_moved
 56; 18:24:03,117;   1;   0;  0;; not_moved
 56; 18:24:03,117;   2;   0;  0;; not_moved
 56; 18:24:03,117;   3;   0;  0;; not_moved
 56; 18:24:03,117;   4;   0;  0;; not_moved
 56; 18:24:03,117;   5;   0;  0;; not_moved
 56; 18:24:03,117;   6;   4; -1;; not_moved
 56; 18:24:03,117;   7;   1;  5;; not_moved
 56; 18:24:03,117;   8;   5;  4;; not_moved
 56; 18:24:03,117;   9;  -5; -4;; not_moved
 56; 18:24:10,534;   1;   1;  0;
 56; 18:24:11,350;   1;   1; -1;
 56; 18:24:11,412;   0;   1;  0;
 56; 18:24:11,432;   4;   1;  0;
 56; 18:24:12,214;   1;   2; -1;
 56; 18:24:12,272;   4;   2;  0;
 56; 18:24:12,359;   2;   1;  0;
 56; 18:24:12,489;   0;   1;  0;; not_moved
 56; 18:24:12,820;   5;   1;  0;
 56; 18:24:13,001;   1;   3; -1;
 56; 18:24:13,052;   0;   2;  0;
 56; 18:24:13,247;   2;   2;  0;
 56; 18:24:13,248;   5;   2;  0;
 56; 18:24:13,252;   4;   3;  0;
 56; 18:24:13,676;   3;   1;  0;
 56; 18:24:13,741;   5;   2; -1;
 56; 18:24:13,792;   1;   4; -1;
 56; 18:24:13,890;   0;   3;  0;
 56; 18:24:13,939;   2;   3;  0;
 56; 18:24:14,063;   4;   3; -1;
 56; 18:24:14,187;   5;   3;  0;
 56; 18:24:14,264;   3;   2;  0;
 56; 18:24:14,576;   0;   3; -1;
 56; 18:24:14,590;   2;   4;  0;
 56; 18:24:14,678;   5;   4;  0;
 56; 18:24:14,716;   3;   3;  0;
 56; 18:24:14,801;   1;   4; -1;; not_moved
 56; 18:24:14,911;   4;   4; -1;
 56; 18:24:15,196;   5;   4; -1;
 56; 18:24:15,275;   3;   4;  0;
 56; 18:24:15,636;   0;   3; -1;; not_moved
 56; 18:24:15,640;   2;   4;  0;; not_moved
 56; 18:24:15,693;   0;   4; -1;
 56; 18:24:15,731;   2;   4; -1;
 56; 18:24:15,772;   3;   4; -1;
 56; 18:24:15,774;  -1;   0;  0;
 56; 18:24:15,774;   0;   0;  0;; not_moved
 56; 18:24:15,774;   1;   0;  0;; not_moved
 56; 18:24:15,774;   2;   0;  0;; not_moved
 56; 18:24:15,774;   3;   0;  0;; not_moved
 56; 18:24:15,774;   4;   0;  0;; not_moved
 56; 18:24:15,774;   5;   0;  0;; not_moved
 56; 18:24:15,774;   6;  -2;  3;; not_moved
 56; 18:24:15,774;   7;   5;  2;; not_moved
 56; 18:24:15,774;   8;   3;  5;; not_moved
 56; 18:24:15,774;   9;  -3; -5;; not_moved
 56; 18:24:23,896;   4;  -1;  0;
 56; 18:24:24,403;   4;  -1;  1;
 56; 18:24:24,902;   4;  -2;  1;
 56; 18:24:25,049;   2;  -1;  0;
 56; 18:24:25,404;   4;  -2;  2;
 56; 18:24:25,436;   0;  -1;  0;
 56; 18:24:25,528;   1;  -1;  0;
 56; 18:24:25,717;   2;  -1;  1;
 56; 18:24:25,760;   5;  -1;  0;
 56; 18:24:25,875;   4;  -2;  3;
 56; 18:24:26,073;   1;  -1;  1;
 56; 18:24:26,224;   0;  -1;  1;
 56; 18:24:26,260;   5;  -1;  1;
 56; 18:24:26,358;   2;  -1;  2;
 56; 18:24:26,592;   5;  -2;  1;
 56; 18:24:26,949;   5;  -2;  2;
 56; 18:24:26,967;   2;  -2;  2;
 56; 18:24:26,972;   4;  -2;  3;; not_moved
 56; 18:24:27,069;   1;  -2;  1;
 56; 18:24:27,146;   3;  -1;  0;
 56; 18:24:27,309;   0;  -1;  1;; not_moved
 56; 18:24:27,343;   5;  -2;  3;
 56; 18:24:27,543;   1;  -2;  2;
 56; 18:24:27,550;   3;  -1;  1;
 56; 18:24:27,713;   2;  -2;  3;
 56; 18:24:28,350;   1;  -2;  3;
 56; 18:24:28,386;   5;  -2;  3;; not_moved
 56; 18:24:28,578;   3;  -1;  1;; not_moved
 56; 18:24:28,760;   0;  -2;  1;
 56; 18:24:28,791;   3;  -1;  2;
 56; 18:24:28,820;   2;  -2;  3;; not_moved
 56; 18:24:29,320;   3;  -2;  2;
 56; 18:24:29,394;   0;  -2;  2;
 56; 18:24:29,424;   1;  -2;  3;; not_moved
 56; 18:24:29,695;   3;  -2;  3;
 56; 18:24:30,296;   0;  -2;  3;
 56; 18:24:30,299;  -1;   0;  0;
 56; 18:24:30,299;   0;   0;  0;; not_moved
 56; 18:24:30,299;   1;   0;  0;; not_moved
 56; 18:24:30,299;   2;   0;  0;; not_moved
 56; 18:24:30,299;   3;   0;  0;; not_moved
 56; 18:24:30,299;   4;   0;  0;; not_moved
 56; 18:24:30,299;   5;   0;  0;; not_moved
 56; 18:24:30,299;   6;  -5; -4;; not_moved
 56; 18:24:30,299;   7;  -1; -5;; not_moved
 56; 18:24:30,299;   8;   4; -1;; not_moved
 56; 18:24:30,299;   9;   1;  5;; not_moved
 56; 18:24:38,360;   1;   1;  0;
 56; 18:24:38,934;   1;   1; -1;
 56; 18:24:39,416;   0;   1;  0;
 56; 18:24:39,542;   1;   2; -1;
 56; 18:24:39,746;   2;   1;  0;
 56; 18:24:39,944;   5;   1;  0;
 56; 18:24:40,062;   1;   3; -1;
 56; 18:24:40,319;   5;   1; -1;
 56; 18:24:40,428;   0;   1;  0;; not_moved
 56; 18:24:40,575;   2;   2;  0;
 56; 18:24:40,614;   4;   1;  0;
 56; 18:24:40,691;   1;   4; -1;
 56; 18:24:40,800;   5;   2; -1;
 56; 18:24:40,804;   0;   2;  0;
 56; 18:24:41,179;   5;   3; -1;
 56; 18:24:41,236;   2;   3;  0;
 56; 18:24:41,273;   0;   3;  0;
 56; 18:24:41,564;   5;   4; -1;
 56; 18:24:41,691;   4;   1;  0;; not_moved
 56; 18:24:41,741;   1;   4; -1;; not_moved
 56; 18:24:41,847;   2;   4;  0;
 56; 18:24:41,880;   0;   4;  0;
 56; 18:24:42,100;   3;   1;  0;
 56; 18:24:42,498;   3;   2;  0;
 56; 18:24:42,603;   0;   4; -1;
 56; 18:24:42,606;   5;   4; -1;; not_moved
 56; 18:24:42,642;   2;   4; -1;
 56; 18:24:42,909;   3;   3;  0;
 56; 18:24:43,292;   3;   4;  0;
 56; 18:24:43,632;   0;   4; -1;; not_moved
 56; 18:24:43,634;   3;   4; -1;
 56; 18:24:43,740;   2;   4; -1;; not_moved
 56; 18:24:43,992;   4;   1; -1;
 56; 18:24:44,694;   4;   2; -1;
 56; 18:24:44,696;   3;   4; -1;; not_moved
 56; 18:24:45,696;   4;   2; -1;; not_moved
 56; 18:24:45,993;   4;   3; -1;
 56; 18:24:46,443;   4;   4; -1;
 56; 18:24:46,445;  -1;   0;  0;
 56; 18:24:46,445;   0;   0;  0;; not_moved
 56; 18:24:46,445;   1;   0;  0;; not_moved
 56; 18:24:46,445;   2;   0;  0;; not_moved
 56; 18:24:46,445;   3;   0;  0;; not_moved
 56; 18:24:46,445;   4;   0;  0;; not_moved
 56; 18:24:46,445;   5;   0;  0;; not_moved
 56; 18:24:46,445;   6;   5;  1;; not_moved
 56; 18:24:46,445;   7;  -5; -1;; not_moved
 56; 18:24:46,445;   8;   1; -4;; not_moved
 56; 18:24:46,445;   9;  -1;  4;; not_moved
 56; 18:24:53,702;   0;   1;  0;
 56; 18:24:53,879;   1;   1;  0;
 56; 18:24:54,432;   1;   2;  0;
 56; 18:24:54,742;   0;   2;  0;
 56; 18:24:54,857;   2;   1;  0;
 56; 18:24:54,976;   1;   3;  0;
 56; 18:24:55,307;   5;   1;  0;
 56; 18:24:55,361;   0;   3;  0;
 56; 18:24:55,473;   2;   2;  0;
 56; 18:24:55,579;   1;   4;  0;
 56; 18:24:55,726;   5;   2;  0;
 56; 18:24:55,780;   4;   1;  0;
 56; 18:24:56,082;   2;   3;  0;
 56; 18:24:56,228;   0;   4;  0;
 56; 18:24:56,257;   5;   3;  0;
 56; 18:24:56,261;   1;   5;  1;
 56; 18:24:56,274;   4;   2;  0;
 56; 18:24:56,658;   0;   5;  1;
 56; 18:24:56,664;   5;   4;  0;
 56; 18:24:56,761;   2;   4;  1;
 56; 18:24:56,820;   4;   3;  0;
 56; 18:24:57,088;   5;   5;  1;
 56; 18:24:57,306;   4;   4;  0;
 56; 18:24:57,360;   1;   5;  1;; not_moved
 56; 18:24:57,524;   2;   5;  1;
 56; 18:24:57,660;   0;   5;  1;; not_moved
 56; 18:24:57,727;   4;   5;  1;
 56; 18:24:57,814;   3;   1;  0;
 56; 18:24:58,127;   5;   5;  1;; not_moved
 56; 18:24:58,247;   3;   2;  0;
 56; 18:24:58,520;   2;   5;  1;; not_moved
 56; 18:24:58,695;   3;   3;  0;
 56; 18:24:58,821;   4;   5;  1;; not_moved
 56; 18:24:59,109;   3;   4;  0;
 56; 18:24:59,572;   3;   5;  1;
 56; 18:24:59,577;  -1;   0;  0;
 56; 18:24:59,577;   0;   0;  0;; not_moved
 56; 18:24:59,577;   1;   0;  0;; not_moved
 56; 18:24:59,577;   2;   0;  0;; not_moved
 56; 18:24:59,577;   3;   0;  0;; not_moved
 56; 18:24:59,577;   4;   0;  0;; not_moved
 56; 18:24:59,577;   5;   0;  0;; not_moved
 56; 18:24:59,577;   6;  -5; -4;; not_moved
 56; 18:24:59,577;   7;   4; -1;; not_moved
 56; 18:24:59,577;   8;  -1; -5;; not_moved
 56; 18:24:59,577;   9;   5;  4;; not_moved
 56; 18:25:06,760;   1;   1;  0;
 56; 18:25:07,328;   1;   2;  0;
 56; 18:25:07,840;   1;   3;  0;
 56; 18:25:07,991;   5;   1;  0;
 56; 18:25:08,343;   5;   2;  0;
 56; 18:25:08,375;   1;   4;  0;
 56; 18:25:08,396;   0;   1;  0;
 56; 18:25:08,745;   5;   3;  0;
 56; 18:25:08,867;   2;   1;  0;
 56; 18:25:09,085;   5;   4;  0;
 56; 18:25:09,195;   0;   2;  0;
 56; 18:25:09,214;   1;   4; -1;
 56; 18:25:09,394;   5;   4; -1;
 56; 18:25:09,540;   2;   2;  0;
 56; 18:25:09,903;   0;   3;  0;
 56; 18:25:10,182;   2;   3;  0;
 56; 18:25:10,278;   1;   4; -1;; not_moved
 56; 18:25:10,296;   4;   1;  0;
 56; 18:25:10,441;   5;   4; -1;; not_moved
 56; 18:25:10,469;   3;   1;  0;
 56; 18:25:10,516;   0;   3; -1;
 56; 18:25:10,772;   4;   2;  0;
 56; 18:25:10,917;   2;   3; -1;
 56; 18:25:10,977;   3;   2;  0;
 56; 18:25:11,232;   4;   3;  0;
 56; 18:25:11,473;   3;   3;  0;
 56; 18:25:11,510;   0;   4; -1;
 56; 18:25:11,677;   2;   4; -1;
 56; 18:25:11,728;   4;   3; -1;
 56; 18:25:12,028;   3;   4;  0;
 56; 18:25:12,254;   4;   4; -1;
 56; 18:25:12,521;   3;   4; -1;
 56; 18:25:12,522;  -1;   0;  0;
 56; 18:25:12,522;   0;   0;  0;; not_moved
 56; 18:25:12,522;   1;   0;  0;; not_moved
 56; 18:25:12,522;   2;   0;  0;; not_moved
 56; 18:25:12,522;   3;   0;  0;; not_moved
 56; 18:25:12,522;   4;   0;  0;; not_moved
 56; 18:25:12,522;   5;   0;  0;; not_moved
 56; 18:25:12,522;   6;   4; -1;; not_moved
 56; 18:25:12,522;   7;  -4;  1;; not_moved
 56; 18:25:12,522;   8;   5;  4;; not_moved
 56; 18:25:12,522;   9;  -5; -4;; not_moved
 56; 18:25:20,104;   1;   1;  0;
 56; 18:25:20,640;   1;   2;  1;
 56; 18:25:21,058;   0;   1;  0;
 56; 18:25:21,096;   1;   3;  2;
 56; 18:25:21,406;   2;   1;  0;
 56; 18:25:21,608;   1;   4;  3;
 56; 18:25:21,826;   5;   1;  0;
 56; 18:25:21,953;   0;   2;  1;
 56; 18:25:22,143;   2;   2;  1;
 56; 18:25:22,214;   1;   5;  4;
 56; 18:25:22,253;   5;   2;  1;
 56; 18:25:22,532;   0;   3;  2;
 56; 18:25:22,656;   5;   3;  2;
 56; 18:25:22,756;   2;   3;  2;
 56; 18:25:23,095;   5;   4;  3;
 56; 18:25:23,114;   3;   1;  0;
 56; 18:25:23,145;   0;   4;  3;
 56; 18:25:23,295;   1;   5;  4;; not_moved
 56; 18:25:23,402;   2;   4;  3;
 56; 18:25:23,626;   3;   2;  1;
 56; 18:25:23,676;   5;   5;  4;
 56; 18:25:23,690;   0;   5;  4;
 56; 18:25:24,084;   3;   3;  2;
 56; 18:25:24,363;   2;   5;  4;
 56; 18:25:24,573;   3;   4;  3;
 56; 18:25:24,695;   0;   5;  4;; not_moved
 56; 18:25:24,804;   5;   5;  4;; not_moved
 56; 18:25:25,020;   3;   5;  4;
 56; 18:25:25,456;   2;   5;  4;; not_moved
 56; 18:25:26,053;   3;   5;  4;; not_moved
 56; 18:25:27,093;   4;   1;  1;
 56; 18:25:27,607;   4;   2;  2;
 56; 18:25:28,190;   4;   3;  3;
 56; 18:25:28,685;   4;   4;  4;
 56; 18:25:29,196;   4;   5;  4;
 56; 18:25:29,198;  -1;   0;  0;
 56; 18:25:29,198;   0;   0;  0;; not_moved
 56; 18:25:29,198;   1;   0;  0;; not_moved
 56; 18:25:29,198;   2;   0;  0;; not_moved
 56; 18:25:29,198;   3;   0;  0;; not_moved
 56; 18:25:29,198;   4;   0;  0;; not_moved
 56; 18:25:29,198;   5;   0;  0;; not_moved
 56; 18:25:29,198;   6;  -2;  3;; not_moved
 56; 18:25:29,198;   7;   2; -3;; not_moved
 56; 18:25:29,198;   8;   5;  2;; not_moved
 56; 18:25:29,198;   9;   3;  5;; not_moved
 56; 18:25:36,337;   1;   1;  0;
 56; 18:25:36,864;   1;   2;  0;
 56; 18:25:37,450;   2;   1;  0;
 56; 18:25:37,487;   1;   3;  0;
 56; 18:25:37,649;   0;   1;  0;
 56; 18:25:37,909;   5;   1;  0;
 56; 18:25:38,046;   1;   4;  1;
 56; 18:25:38,132;   2;   2;  0;
 56; 18:25:38,358;   5;   2;  0;
 56; 18:25:38,719;   0;   1;  0;; not_moved
 56; 18:25:38,738;   5;   3;  0;
 56; 18:25:38,822;   4;   1;  0;
 56; 18:25:38,845;   2;   3;  0;
 56; 18:25:38,935;   1;   5;  2;
 56; 18:25:39,079;   5;   4;  1;
 56; 18:25:39,144;   3;   1;  0;
 56; 18:25:39,192;   0;   2;  0;
 56; 18:25:39,274;   4;   2;  0;
 56; 18:25:39,382;   5;   5;  2;
 56; 18:25:39,547;   2;   4;  1;
 56; 18:25:39,608;   3;   2;  0;
 56; 18:25:39,811;   4;   3;  0;
 56; 18:25:39,849;   0;   3;  1;
 56; 18:25:40,020;   1;   5;  2;; not_moved
 56; 18:25:40,066;   3;   3;  0;
 56; 18:25:40,224;   2;   5;  2;
 56; 18:25:40,324;   4;   4;  1;
 56; 18:25:40,480;   5;   5;  2;; not_moved
 56; 18:25:40,547;   3;   4;  1;
 56; 18:25:40,658;   0;   4;  1;
 56; 18:25:40,956;   4;   5;  2;
 56; 18:25:40,959;   3;   5;  2;
 56; 18:25:41,275;   2;   5;  2;; not_moved
 56; 18:25:41,307;   0;   5;  2;
 56; 18:25:41,309;  -1;   0;  0;
 56; 18:25:41,309;   0;   0;  0;; not_moved
 56; 18:25:41,309;   1;   0;  0;; not_moved
 56; 18:25:41,309;   2;   0;  0;; not_moved
 56; 18:25:41,309;   3;   0;  0;; not_moved
 56; 18:25:41,309;   4;   0;  0;; not_moved
 56; 18:25:41,309;   5;   0;  0;; not_moved
 56; 18:25:41,309;   6;  -1;  4;; not_moved
 56; 18:25:41,309;   7;  -5; -1;; not_moved
 56; 18:25:41,309;   8;   4;  5;; not_moved
 56; 18:25:41,309;   9;   5;  1;; not_moved
 56; 18:25:48,309;   5;   1;  0;
 56; 18:25:48,836;   5;   2;  0;
 56; 18:25:49,321;   5;   3;  1;
 56; 18:25:49,752;   5;   4;  1;
 56; 18:25:50,544;   0;   1;  0;
 56; 18:25:50,796;   5;   4;  1;; not_moved
 56; 18:25:51,173;   2;   1;  0;
 56; 18:25:51,226;   0;   2;  0;
 56; 18:25:51,349;   5;   5;  1;
 56; 18:25:51,761;   2;   2;  1;
 56; 18:25:51,769;   0;   3;  1;
 56; 18:25:52,258;   1;   1;  0;
 56; 18:25:52,391;   0;   4;  1;
 56; 18:25:52,398;   5;   5;  1;; not_moved
 56; 18:25:52,463;   2;   3;  2;
 56; 18:25:52,879;   1;   2;  0;
 56; 18:25:52,963;   0;   5;  1;
 56; 18:25:53,192;   2;   4;  2;
 56; 18:25:53,535;   1;   3;  0;
 56; 18:25:53,704;   4;   1;  0;
 56; 18:25:53,929;   2;   5;  2;
 56; 18:25:53,964;   0;   5;  1;; not_moved
 56; 18:25:53,965;   3;   1;  0;
 56; 18:25:54,224;   1;   4;  0;
 56; 18:25:54,271;   4;   2;  0;
 56; 18:25:54,408;   3;   2;  1;
 56; 18:25:54,820;   2;   5;  1;
 56; 18:25:54,935;   4;   3;  0;
 56; 18:25:54,956;   1;   5;  1;
 56; 18:25:54,959;   3;   3;  1;
 56; 18:25:55,478;   4;   4;  0;
 56; 18:25:55,492;   3;   4;  1;
 56; 18:25:55,795;   2;   5;  1;; not_moved
 56; 18:25:55,954;   4;   5;  1;
 56; 18:25:56,042;   1;   5;  1;; not_moved
 56; 18:25:56,099;   3;   5;  1;
