Distanz Alt:2		Gewichtet: 0.5			LF: Neu - Alt = 4 - 2 = 2
Distanz Neu:4		Gewichtet: 0.25			LQ: Neu - Alt = 0.25 - 0.5 = -0.25

Distanz Alt:4		Gewichtet: 0.25			LF: Neu - Alt = 2 - 4 = -2
Distanz Neu:2		Gewichtet: 0.5			LQ: Neu - Alt = 0.5 - 0.25 = 0.25 -> Idea: Alt - Neu = 0.25 - 0.5 = -0.25 oder bei Neu - Alt belassen und * -1 nehmen