"";"transitivity ";"FieldDistribution ";"FieldDistribution.MoveLevel ";"Interaction.Start ";"Interaction.During ";"Interaction.None ";"Entitativity.Diagram ";"Entitivity ";"Similarity ";"Interactivity ";"Goals "
"transitivity";"";"-0.862***";"-0.915***";" 0.656***";" 0.189   ";"-0.646***";" 0.590***";" 0.583***";" 0.090   ";" 0.590***";" 0.362***"
"FieldDistribution";"";"";" 0.967***";"-0.608***";"-0.239*  ";" 0.660***";"-0.589***";"-0.591***";"-0.153   ";"-0.548***";"-0.359***"
"FieldDistribution.MoveLevel";"";"";"";"-0.655***";"-0.233*  ";" 0.666***";"-0.616***";"-0.597***";"-0.149   ";"-0.585***";"-0.372***"
"Interaction.Start";"";"";"";"";"-0.026   ";"-0.601***";" 0.598***";" 0.614***";" 0.249*  ";" 0.552***";" 0.217*  "
"Interaction.During";"";"";"";"";"";"-0.436***";" 0.113   ";" 0.239*  ";" 0.082   ";" 0.281** ";" 0.190   "
"Interaction.None";"";"";"";"";"";"";"-0.637***";"-0.653***";"-0.233*  ";"-0.673***";"-0.296** "
"Entitativity.Diagram";"";"";"";"";"";"";"";" 0.654***";" 0.280** ";" 0.577***";" 0.443***"
"Entitivity";"";"";"";"";"";"";"";"";" 0.471***";" 0.719***";" 0.413***"
"Similarity";"";"";"";"";"";"";"";"";"";" 0.453***";" 0.261*  "
"Interactivity";"";"";"";"";"";"";"";"";"";"";" 0.381***"
"Goals";"";"";"";"";"";"";"";"";"";"";""
