0.0000,0.0000,0.0000
12.4091,10.0181,10.2050
19.5961,18.8391,19.0926
20.6510,20.2187,20.2981
26.5805,25.6990,25.8409
28.7660,27.5913,27.8868
28.0742,27.3358,27.4191
28.3746,27.0155,27.1605
29.2180,28.0411,28.2409
30.6435,30.2696,30.3421
30.0749,29.3404,29.4352
31.3403,30.8176,30.8939
30.9490,30.6151,30.6486
