33.7390,28.1741,28.2526
35.0013,28.0219,28.0542
35.5380,30.0638,30.0948
33.3769,27.9839,28.0592
26.9653,22.4367,22.5418
36.4145,30.8012,30.9536
37.0016,31.2646,31.3764
33.1301,27.7634,27.8052
34.6239,27.7861,27.8791
36.7432,29.4660,31.1643
36.4819,30.7989,30.9531
35.9880,28.8354,28.9305
36.4628,29.2132,30.9354
