0.00,0.00,0.00
9.17,8.47,8.56
15.74,14.82,14.86
15.02,14.03,14.05
19.34,18.77,18.80
18.66,17.66,17.70
18.21,17.23,17.26
17.30,16.29,16.32
17.75,17.27,17.36
19.05,18.69,18.76
18.42,17.36,17.40
19.56,18.54,18.54
18.78,17.68,18.40
