0.0000,0.0000,0.0000
7.6744,3.6843,4.0208
24.3903,12.3051,12.8149
25.3470,12.4314,14.0504
37.0524,19.3677,20.1963
36.6340,18.7994,20.8726
36.3203,18.6423,19.1611
41.8003,21.4837,23.3881
43.1571,21.5388,23.6104
45.0782,23.9123,24.6044
47.1571,24.2340,24.8650
47.1076,24.1697,24.8530
47.5153,24.4634,26.5291
