﻿[
 {
  "Choice-Satz" : 1,
  "Choice-ID" : 1,
  "Anzahl an Verbindungsabbrüchen" : "3 - 4",
  "Internetgeschwindigkeit mit VPN" : "21 - 30% langsamer",
  "Akkustand des Smartphones" : "25 - 49%",
  "VPN Einschaltmethode" : "manuell - über die Statusleiste"
 },
 {
  "Choice-Satz" : 1,
  "Choice-ID" : 2,
  "Anzahl an Verbindungsabbrüchen" : "1 - 2",
  "Internetgeschwindigkeit mit VPN" : "10 - 20% langsamer",
  "Akkustand des Smartphones" : "75 - 100%",
  "VPN Einschaltmethode" : "automatisch"
 },
 {
  "Choice-Satz" : 2,
  "Choice-ID" : 1,
  "Anzahl an Verbindungsabbrüchen" : "1 - 2",
  "Internetgeschwindigkeit mit VPN" : "> 30% langsamer",
  "Akkustand des Smartphones" : "50 - 74%",
  "VPN Einschaltmethode" : "automatisch"
 },
 {
  "Choice-Satz" : 2,
  "Choice-ID" : 2,
  "Anzahl an Verbindungsabbrüchen" : "> 4",
  "Internetgeschwindigkeit mit VPN" : "10 - 20% langsamer",
  "Akkustand des Smartphones" : "25 - 49%",
  "VPN Einschaltmethode" : "manuell - über die App"
 },
 {
  "Choice-Satz" : 3,
  "Choice-ID" : 1,
  "Anzahl an Verbindungsabbrüchen" : "3 - 4",
  "Internetgeschwindigkeit mit VPN" : "21 - 30% langsamer",
  "Akkustand des Smartphones" : "50 - 74%",
  "VPN Einschaltmethode" : "manuell - über die App"
 },
 {
  "Choice-Satz" : 3,
  "Choice-ID" : 2,
  "Anzahl an Verbindungsabbrüchen" : "1 - 2",
  "Internetgeschwindigkeit mit VPN" : "10 - 20% langsamer",
  "Akkustand des Smartphones" : "25 - 49%",
  "VPN Einschaltmethode" : "manuell - über die Statusleiste"
 },
 {
  "Choice-Satz" : 4,
  "Choice-ID" : 1,
  "Anzahl an Verbindungsabbrüchen" : "3 - 4",
  "Internetgeschwindigkeit mit VPN" : "21 - 30% langsamer",
  "Akkustand des Smartphones" : "75 - 100%",
  "VPN Einschaltmethode" : "automatisch"
 },
 {
  "Choice-Satz" : 4,
  "Choice-ID" : 2,
  "Anzahl an Verbindungsabbrüchen" : "> 4",
  "Internetgeschwindigkeit mit VPN" : "10 - 20% langsamer",
  "Akkustand des Smartphones" : "50 - 74%",
  "VPN Einschaltmethode" : "manuell - über die Statusleiste"
 },
 {
  "Choice-Satz" : 5,
  "Choice-ID" : 1,
  "Anzahl an Verbindungsabbrüchen" : "> 4",
  "Internetgeschwindigkeit mit VPN" : "> 30% langsamer",
  "Akkustand des Smartphones" : "75 - 100%",
  "VPN Einschaltmethode" : "automatisch"
 },
 {
  "Choice-Satz" : 5,
  "Choice-ID" : 2,
  "Anzahl an Verbindungsabbrüchen" : "3 - 4",
  "Internetgeschwindigkeit mit VPN" : "10 - 20% langsamer",
  "Akkustand des Smartphones" : "25 - 49%",
  "VPN Einschaltmethode" : "automatisch"
 },
 {
  "Choice-Satz" : 6,
  "Choice-ID" : 1,
  "Anzahl an Verbindungsabbrüchen" : "3 - 4",
  "Internetgeschwindigkeit mit VPN" : "> 30% langsamer",
  "Akkustand des Smartphones" : "50 - 74%",
  "VPN Einschaltmethode" : "manuell - über die Statusleiste"
 },
 {
  "Choice-Satz" : 6,
  "Choice-ID" : 2,
  "Anzahl an Verbindungsabbrüchen" : "> 4",
  "Internetgeschwindigkeit mit VPN" : "21 - 30% langsamer",
  "Akkustand des Smartphones" : "75 - 100%",
  "VPN Einschaltmethode" : "automatisch"
 },
 {
  "Choice-Satz" : 7,
  "Choice-ID" : 1,
  "Anzahl an Verbindungsabbrüchen" : "3 - 4",
  "Internetgeschwindigkeit mit VPN" : "21 - 30% langsamer",
  "Akkustand des Smartphones" : "75 - 100%",
  "VPN Einschaltmethode" : "manuell - über die Statusleiste"
 },
 {
  "Choice-Satz" : 7,
  "Choice-ID" : 2,
  "Anzahl an Verbindungsabbrüchen" : "1 - 2",
  "Internetgeschwindigkeit mit VPN" : "10 - 20% langsamer",
  "Akkustand des Smartphones" : "25 - 49%",
  "VPN Einschaltmethode" : "automatisch"
 },
 {
  "Choice-Satz" : 8,
  "Choice-ID" : 1,
  "Anzahl an Verbindungsabbrüchen" : "3 - 4",
  "Internetgeschwindigkeit mit VPN" : "10 - 20% langsamer",
  "Akkustand des Smartphones" : "75 - 100%",
  "VPN Einschaltmethode" : "manuell - über die Statusleiste"
 },
 {
  "Choice-Satz" : 8,
  "Choice-ID" : 2,
  "Anzahl an Verbindungsabbrüchen" : "> 4",
  "Internetgeschwindigkeit mit VPN" : "21 - 30% langsamer",
  "Akkustand des Smartphones" : "50 - 74%",
  "VPN Einschaltmethode" : "manuell - über die App"
 },
 {
  "Choice-Satz" : 9,
  "Choice-ID" : 1,
  "Anzahl an Verbindungsabbrüchen" : "3 - 4",
  "Internetgeschwindigkeit mit VPN" : "10 - 20% langsamer",
  "Akkustand des Smartphones" : "25 - 49%",
  "VPN Einschaltmethode" : "automatisch"
 },
 {
  "Choice-Satz" : 9,
  "Choice-ID" : 2,
  "Anzahl an Verbindungsabbrüchen" : "1 - 2",
  "Internetgeschwindigkeit mit VPN" : "21 - 30% langsamer",
  "Akkustand des Smartphones" : "50 - 74%",
  "VPN Einschaltmethode" : "manuell - über die Statusleiste"
 },
 {
  "Choice-Satz" : 10,
  "Choice-ID" : 1,
  "Anzahl an Verbindungsabbrüchen" : "3 - 4",
  "Internetgeschwindigkeit mit VPN" : "> 30% langsamer",
  "Akkustand des Smartphones" : "25 - 49%",
  "VPN Einschaltmethode" : "manuell - über die Statusleiste"
 },
 {
  "Choice-Satz" : 10,
  "Choice-ID" : 2,
  "Anzahl an Verbindungsabbrüchen" : "> 4",
  "Internetgeschwindigkeit mit VPN" : "10 - 20% langsamer",
  "Akkustand des Smartphones" : "50 - 74%",
  "VPN Einschaltmethode" : "automatisch"
 },
 {
  "Choice-Satz" : 11,
  "Choice-ID" : 1,
  "Anzahl an Verbindungsabbrüchen" : "1 - 2",
  "Internetgeschwindigkeit mit VPN" : "21 - 30% langsamer",
  "Akkustand des Smartphones" : "25 - 49%",
  "VPN Einschaltmethode" : "manuell - über die App"
 },
 {
  "Choice-Satz" : 11,
  "Choice-ID" : 2,
  "Anzahl an Verbindungsabbrüchen" : "> 4",
  "Internetgeschwindigkeit mit VPN" : "10 - 20% langsamer",
  "Akkustand des Smartphones" : "50 - 74%",
  "VPN Einschaltmethode" : "manuell - über die Statusleiste"
 },
 {
  "Choice-Satz" : 12,
  "Choice-ID" : 1,
  "Anzahl an Verbindungsabbrüchen" : "1 - 2",
  "Internetgeschwindigkeit mit VPN" : "10 - 20% langsamer",
  "Akkustand des Smartphones" : "50 - 74%",
  "VPN Einschaltmethode" : "manuell - über die App"
 },
 {
  "Choice-Satz" : 12,
  "Choice-ID" : 2,
  "Anzahl an Verbindungsabbrüchen" : "> 4",
  "Internetgeschwindigkeit mit VPN" : "21 - 30% langsamer",
  "Akkustand des Smartphones" : "25 - 49%",
  "VPN Einschaltmethode" : "manuell - über die Statusleiste"
 },
 {
  "Choice-Satz" : 13,
  "Choice-ID" : 1,
  "Anzahl an Verbindungsabbrüchen" : "> 4",
  "Internetgeschwindigkeit mit VPN" : "> 30% langsamer",
  "Akkustand des Smartphones" : "25 - 49%",
  "VPN Einschaltmethode" : "automatisch"
 },
 {
  "Choice-Satz" : 13,
  "Choice-ID" : 2,
  "Anzahl an Verbindungsabbrüchen" : "1 - 2",
  "Internetgeschwindigkeit mit VPN" : "10 - 20% langsamer",
  "Akkustand des Smartphones" : "50 - 74%",
  "VPN Einschaltmethode" : "manuell - über die Statusleiste"
 },
 {
  "Choice-Satz" : 14,
  "Choice-ID" : 1,
  "Anzahl an Verbindungsabbrüchen" : "3 - 4",
  "Internetgeschwindigkeit mit VPN" : "> 30% langsamer",
  "Akkustand des Smartphones" : "50 - 74%",
  "VPN Einschaltmethode" : "automatisch"
 },
 {
  "Choice-Satz" : 14,
  "Choice-ID" : 2,
  "Anzahl an Verbindungsabbrüchen" : "1 - 2",
  "Internetgeschwindigkeit mit VPN" : "21 - 30% langsamer",
  "Akkustand des Smartphones" : "25 - 49%",
  "VPN Einschaltmethode" : "manuell - über die Statusleiste"
 },
 {
  "Choice-Satz" : 15,
  "Choice-ID" : 1,
  "Anzahl an Verbindungsabbrüchen" : "3 - 4",
  "Internetgeschwindigkeit mit VPN" : "10 - 20% langsamer",
  "Akkustand des Smartphones" : "75 - 100%",
  "VPN Einschaltmethode" : "manuell - über die App"
 },
 {
  "Choice-Satz" : 15,
  "Choice-ID" : 2,
  "Anzahl an Verbindungsabbrüchen" : "1 - 2",
  "Internetgeschwindigkeit mit VPN" : "21 - 30% langsamer",
  "Akkustand des Smartphones" : "25 - 49%",
  "VPN Einschaltmethode" : "automatisch"
 },
 {
  "Choice-Satz" : 16,
  "Choice-ID" : 1,
  "Anzahl an Verbindungsabbrüchen" : "1 - 2",
  "Internetgeschwindigkeit mit VPN" : "> 30% langsamer",
  "Akkustand des Smartphones" : "25 - 49%",
  "VPN Einschaltmethode" : "manuell - über die App"
 },
 {
  "Choice-Satz" : 16,
  "Choice-ID" : 2,
  "Anzahl an Verbindungsabbrüchen" : "3 - 4",
  "Internetgeschwindigkeit mit VPN" : "21 - 30% langsamer",
  "Akkustand des Smartphones" : "50 - 74%",
  "VPN Einschaltmethode" : "automatisch"
 }
]
