,Distanz Stadtzentroid (m),Anteil Industriefläche an Gesamtfläche (%),Anteil Wohnfläche Lärmbelastung Nacht =>50 dB (m2) an Gesamtwohnfläche,Anteil Wohnfläche Mehrfachlärmbelastung Nacht =>50 dB (m2) an Gesamtwohnfläche,"Quadratmeter Sport-, Freizeit-, Erholungsfläche pro Kind unter 15 Jahren","Quadratmeter Sport-, Freizeit-, Erholungs-, Freiraumfläche pro Kind unter 15 Jahren",Spielplatzfläche (m2),Straßennetz verkehrsberuhigte Zonen (Tempo < 30 km/h) (%),Anteil Straßennetz Spielstraßen an Gesamtstraßennetz (%),Distanz Bibliothek (m),Distanz Musikschule (m),Distanz Kindertheater (m),"Distanz Theater, Oper, Konzerthaus (m)",Distanz Bad,Distanz Gymnasiale Oberstufe (m),Distanz Ganztagsschule (m),Distanz Kinderarzt (m),Distanz Kinder- und Jugendtherapeut (m)
Distanz Stadtzentroid (m),1.0,-0.531,0.319,-0.056,-0.049,0.483,-0.271,-0.122,0.156,0.459,0.562,0.497,0.486,0.481,0.51,0.41,0.364,0.426
Anteil Industriefläche an Gesamtfläche (%),-0.531,1.0,-0.047,0.422,0.183,-0.444,0.233,-0.024,0.042,-0.335,-0.211,-0.311,-0.276,-0.243,-0.354,-0.201,-0.261,-0.245
Anteil Wohnfläche Lärmbelastung Nacht =>50 dB (m2) an Gesamtwohnfläche,0.319,-0.047,1.0,0.256,0.105,0.313,-0.098,-0.221,-0.148,0.227,0.387,0.509,0.333,0.434,0.475,0.378,0.407,0.214
Anteil Wohnfläche Mehrfachlärmbelastung Nacht =>50 dB (m2) an Gesamtwohnfläche,-0.056,0.422,0.256,1.0,-0.064,-0.294,0.157,0.003,0.144,-0.221,0.1,-0.01,-0.079,-0.046,-0.105,-0.103,-0.08,0.014
"Quadratmeter Sport-, Freizeit-, Erholungsfläche pro Kind unter 15 Jahren",-0.049,0.183,0.105,-0.064,1.0,0.403,0.051,-0.119,0.049,0.074,0.101,0.021,0.052,0.111,-0.002,0.19,0.138,-0.144
"Quadratmeter Sport-, Freizeit-, Erholungs-, Freiraumfläche pro Kind unter 15 Jahren",0.483,-0.444,0.313,-0.294,0.403,1.0,-0.333,-0.26,-0.231,0.461,0.425,0.392,0.323,0.355,0.495,0.403,0.394,0.219
Spielplatzfläche (m2),-0.271,0.233,-0.098,0.157,0.051,-0.333,1.0,0.19,0.215,-0.294,-0.301,-0.192,-0.268,-0.117,-0.223,-0.108,-0.418,-0.0
Straßennetz verkehrsberuhigte Zonen (Tempo < 30 km/h) (%),-0.122,-0.024,-0.221,0.003,-0.119,-0.26,0.19,1.0,0.179,0.023,-0.031,-0.178,0.124,-0.173,-0.099,-0.277,-0.193,0.065
Anteil Straßennetz Spielstraßen an Gesamtstraßennetz (%),0.156,0.042,-0.148,0.144,0.049,-0.231,0.215,0.179,1.0,-0.115,-0.037,-0.244,-0.213,0.144,-0.144,-0.046,-0.049,-0.156
Distanz Bibliothek (m),0.459,-0.335,0.227,-0.221,0.074,0.461,-0.294,0.023,-0.115,1.0,0.144,0.528,0.615,0.651,0.668,0.551,0.522,0.307
Distanz Musikschule (m),0.562,-0.211,0.387,0.1,0.101,0.425,-0.301,-0.031,-0.037,0.144,1.0,0.327,0.284,0.057,0.305,0.045,0.323,0.411
Distanz Kindertheater (m),0.497,-0.311,0.509,-0.01,0.021,0.392,-0.192,-0.178,-0.244,0.528,0.327,1.0,0.518,0.436,0.545,0.366,0.368,0.48
"Distanz Theater, Oper, Konzerthaus (m)",0.486,-0.276,0.333,-0.079,0.052,0.323,-0.268,0.124,-0.213,0.615,0.284,0.518,1.0,0.437,0.506,0.481,0.435,0.473
Distanz Bad,0.481,-0.243,0.434,-0.046,0.111,0.355,-0.117,-0.173,0.144,0.651,0.057,0.436,0.437,1.0,0.572,0.621,0.413,0.263
Distanz Gymnasiale Oberstufe (m),0.51,-0.354,0.475,-0.105,-0.002,0.495,-0.223,-0.099,-0.144,0.668,0.305,0.545,0.506,0.572,1.0,0.749,0.532,0.36
Distanz Ganztagsschule (m),0.41,-0.201,0.378,-0.103,0.19,0.403,-0.108,-0.277,-0.046,0.551,0.045,0.366,0.481,0.621,0.749,1.0,0.391,0.231
Distanz Kinderarzt (m),0.364,-0.261,0.407,-0.08,0.138,0.394,-0.418,-0.193,-0.049,0.522,0.323,0.368,0.435,0.413,0.532,0.391,1.0,0.074
Distanz Kinder- und Jugendtherapeut (m),0.426,-0.245,0.214,0.014,-0.144,0.219,-0.0,0.065,-0.156,0.307,0.411,0.48,0.473,0.263,0.36,0.231,0.074,1.0
