<?xml version="1.0" encoding="UTF-8" standalone="no"?>
<svg
   xmlns:dc="http://purl.org/dc/elements/1.1/"
   xmlns:cc="http://creativecommons.org/ns#"
   xmlns:rdf="http://www.w3.org/1999/02/22-rdf-syntax-ns#"
   xmlns:svg="http://www.w3.org/2000/svg"
   xmlns="http://www.w3.org/2000/svg"
   viewBox="0 0 105.545 161.395"
   height="161.395"
   width="105.545"
   xml:space="preserve"
   version="1.1"
   id="svg2"><metadata
     id="metadata8"><rdf:RDF><cc:Work
         rdf:about=""><dc:format>image/svg+xml</dc:format><dc:type
           rdf:resource="http://purl.org/dc/dcmitype/StillImage" /></cc:Work></rdf:RDF></metadata><defs
     id="defs6" /><g
     transform="matrix(1.25,0,0,-1.25,0,161.395)"
     id="g10"><g
       transform="translate(1.101,67.148)"
       id="g12"><g
         id="g14"><g
           id="g16"><g
             id="g18"><g
               id="g20"><g
                 id="g22"><g
                   id="g24"><g
                     transform="translate(2.14474,-2.14474)"
                     id="g26"><path
                       id="path28"
                       style="fill:#808080;fill-opacity:0.15;fill-rule:nonzero;stroke:none"
                       d="m 11.86998,7.97023 7.97067,0 c 4.40213,-4.40211 4.40213,-11.53918 0,-15.94131 l -15.94133,8.5e-4 c -4.40211,4.40211 -4.40211,11.53918 0,15.94131 l 7.97066,-8.5e-4 z" /></g></g></g><g
                 id="g30"><path
                   id="path32"
                   style="fill:#e7ebcc;fill-opacity:1;fill-rule:nonzero;stroke:#586e75;stroke-width:1.19553006;stroke-linecap:butt;stroke-linejoin:miter;stroke-miterlimit:10;stroke-dasharray:none;stroke-opacity:1"
                   d="m 11.86998,7.97023 7.97067,0 c 4.40213,-4.40211 4.40213,-11.53918 0,-15.94131 l -15.94133,8.5e-4 c -4.40211,4.40211 -4.40211,11.53918 0,15.94131 l 7.97066,-8.5e-4 z" /></g><g
                 transform="translate(9.516,-2.69)"
                 id="g34"><g
                   id="g36"><g
                     transform="translate(-10.617,-64.458)"
                     id="g38"><g
                       id="text40"
                       style="font-variant:normal;font-weight:normal;font-size:8.96640015px;font-family:LMMono9;-inkscape-font-specification:LMMono9-Regular;writing-mode:lr-tb;fill:#000000;fill-opacity:1;fill-rule:nonzero;stroke:none"
                       transform="matrix(1,0,0,-1,10.617,64.458)"><path
                         id="path253"
                         style=""
                         d="m 4.4563009,-0.268992 c 0,-0.11656321 -0.044832,-0.20622721 -0.1524288,-0.25105921 -0.053798,-0.0268992 -0.2510592,-0.0268992 -0.3855552,-0.0268992 L 2.8333824,-5.2363777 c -0.080698,-0.3407232 -0.2062272,-0.3496896 -0.4841856,-0.3496896 -0.2600256,0 -0.403488,0 -0.4841856,0.3407232 l -1.08493439,4.69839369 c -0.1255296,0 -0.3317568,0 -0.3855552,0.0179328 C 0.2958912,-0.47521921 0.2420928,-0.38555521 0.2420928,-0.268992 0.2420928,0 0.47521921,0 0.62764801,0 L 1.5422208,0 c 0.1613952,0 0.3765888,0 0.3765888,-0.268992 0,-0.27795841 -0.179328,-0.27795841 -0.5021184,-0.27795841 l 0.2062272,-0.93250559 1.4525569,0 0.2062272,0.93250559 c -0.3227905,0 -0.5021185,0 -0.5021185,0.27795841 C 2.779584,0 2.9947776,0 3.1561729,0 l 0.9145728,0 c 0.1524288,0 0.3855552,0 0.3855552,-0.268992 z m -1.5153217,-1.7574144 -1.1835648,0 0.5917824,-2.8154497 0.5917824,2.8154497 z" /></g><g
                       transform="translate(10.617,64.458)"
                       id="g44" /></g></g><g
                   transform="translate(-9.516,2.69)"
                   id="g46" /></g></g><g
               id="g48"><g
                 id="g50"><g
                   id="g52"><g
                     transform="translate(2.14474,-2.14474)"
                     id="g54"><path
                       id="path56"
                       style="fill:#808080;fill-opacity:0.15;fill-rule:nonzero;stroke:none"
                       d="m 55.53554,7.97023 7.97067,0 c 4.40213,-4.40211 4.40213,-11.53918 0,-15.94131 l -15.94134,8.5e-4 c -4.40214,4.40211 -4.40214,11.53918 0,15.94131 l 7.97067,-8.5e-4 z" /></g></g></g><g
                 id="g58"><path
                   id="path60"
                   style="fill:#e7ebcc;fill-opacity:1;fill-rule:nonzero;stroke:#586e75;stroke-width:1.19553006;stroke-linecap:butt;stroke-linejoin:miter;stroke-miterlimit:10;stroke-dasharray:none;stroke-opacity:1"
                   d="m 55.53554,7.97023 7.97067,0 c 4.40213,-4.40211 4.40213,-11.53918 0,-15.94131 l -15.94134,8.5e-4 c -4.40214,4.40211 -4.40214,11.53918 0,15.94131 l 7.97067,-8.5e-4 z" /></g><g
                 transform="translate(53.181,-2.69)"
                 id="g62"><g
                   id="g64"><g
                     transform="translate(-54.282,-64.458)"
                     id="g66"><g
                       id="text68"
                       style="font-variant:normal;font-weight:normal;font-size:8.96640015px;font-family:LMMono9;-inkscape-font-specification:LMMono9-Regular;writing-mode:lr-tb;fill:#000000;fill-opacity:1;fill-rule:nonzero;stroke:none"
                       transform="matrix(1,0,0,-1,54.282,64.458)"><path
                         id="path256"
                         style=""
                         d="m 4.3397377,-1.5063552 c 0,-0.2958912 -0.2151936,-0.2958912 -0.313824,-0.2958912 -0.080698,0 -0.2869248,0 -0.3048576,0.2600256 -0.062765,0.87870719 -0.7890433,1.09390079 -1.1566657,1.09390079 -0.8159424,0 -1.58705278,-0.95043839 -1.58705278,-2.29539839 0,-1.3359937 0.78007678,-2.2864321 1.57808638,-2.2864321 0.5379841,0 1.0311361,0.4124544 1.1566657,1.1387328 0.026899,0.1524288 0.044832,0.2958912 0.313824,0.2958912 0.313824,0 0.313824,-0.1882944 0.313824,-0.3676224 l 0,-1.2463296 c 0,-0.1434624 0,-0.3676224 -0.268992,-0.3676224 -0.1613952,0 -0.2062272,0.089664 -0.2510592,0.1524288 -0.017933,0.035866 -0.017933,0.053798 -0.134496,0.2779584 -0.2958912,-0.2510592 -0.7083457,-0.4303872 -1.1656321,-0.4303872 -1.1566656,0 -2.16090239,1.2014976 -2.16090239,2.8333825 0,1.6408512 1.00423679,2.8423488 2.16986879,2.8423488 1.0401025,0 1.8112129,-0.79800961 1.8112129,-1.6049856 z" /></g><g
                       transform="translate(54.282,64.458)"
                       id="g72" /></g></g><g
                   transform="translate(-53.181,2.69)"
                   id="g74" /></g></g><g
               id="g76"><g
                 id="g78"><g
                   id="g80"><g
                     transform="translate(2.14474,-2.14474)"
                     id="g82"><path
                       id="path84"
                       style="fill:#808080;fill-opacity:0.15;fill-rule:nonzero;stroke:none"
                       d="m 55.53554,-21.91809 7.97067,0 c 4.40213,-4.40213 4.40213,-11.53921 0,-15.94135 l -15.94134,8.6e-4 c -4.40214,4.40211 -4.40214,11.5392 0,15.94133 l 7.97067,-8.4e-4 z" /></g></g></g><g
                 id="g86"><path
                   id="path88"
                   style="fill:#e7ebcc;fill-opacity:1;fill-rule:nonzero;stroke:#586e75;stroke-width:1.19553006;stroke-linecap:butt;stroke-linejoin:miter;stroke-miterlimit:10;stroke-dasharray:none;stroke-opacity:1"
                   d="m 55.53554,-21.91809 7.97067,0 c 4.40213,-4.40213 4.40213,-11.53921 0,-15.94135 l -15.94134,8.6e-4 c -4.40214,4.40211 -4.40214,11.5392 0,15.94133 l 7.97067,-8.4e-4 z" /></g><g
                 transform="translate(53.181,-32.578)"
                 id="g90"><g
                   id="g92"><g
                     transform="translate(-54.282,-34.57)"
                     id="g94"><g
                       id="text96"
                       style="font-variant:normal;font-weight:normal;font-size:8.96640015px;font-family:LMMono9;-inkscape-font-specification:LMMono9-Regular;writing-mode:lr-tb;fill:#000000;fill-opacity:1;fill-rule:nonzero;stroke:none"
                       transform="matrix(1,0,0,-1,54.282,34.57)"><path
                         id="path259"
                         style=""
                         d="m 4.3218049,-1.4973888 c 0,-0.6186816 -0.4303872,-1.2014976 -1.1566656,-1.3718592 0.5738496,-0.1972609 0.9683712,-0.6635137 0.9683712,-1.2194305 0,-0.6545472 -0.5469504,-1.389792 -1.5422209,-1.389792 l -2.02640639,0 c -0.1255296,0 -0.35865601,0 -0.35865601,0.268992 0,0.2779584 0.22416001,0.2779584 0.36762241,0.2779584 l 0.2420928,0 0,4.38456969 -0.2420928,0 c -0.1434624,0 -0.36762241,0 -0.36762241,0.27795841 C 0.2062272,0 0.43935361,0 0.56488321,0 L 2.7706176,0 c 1.0132033,0 1.5511873,-0.79800961 1.5511873,-1.4973888 z m -0.806976,-2.5823233 c 0,0.3676224 -0.2869248,0.9594048 -1.1566657,0.9594048 l -0.9235392,0 0,-1.8112128 1.1208,0 c 0.7621441,0 0.9594049,0.5559168 0.9594049,0.851808 z m 0.1882944,2.5643905 c 0,0.4393536 -0.3496896,0.96837119 -1.1297665,0.96837119 l -1.1387328,0 0,-2.02640639 1.2373632,0 c 0.7621441,0 1.0311361,0.6545472 1.0311361,1.0580352 z" /></g><g
                       transform="translate(54.282,34.57)"
                       id="g100" /></g></g><g
                   transform="translate(-53.181,32.578)"
                   id="g102" /></g></g><g
               id="g104"><g
                 id="g106"><path
                   id="path108"
                   style="fill:none;stroke:#808080;stroke-width:0.59776002;stroke-linecap:butt;stroke-linejoin:miter;stroke-miterlimit:10;stroke-dasharray:none;stroke-opacity:1"
                   d="M 29.11972,4.4e-4 43.66554,0" /><g
                   id="g110"><g
                     transform="matrix(-1,2e-5,-2e-5,-1,29.11972,4.4e-4)"
                     id="g112"><g
                       id="g114"><path
                         id="path116"
                         style="fill:#808080;fill-opacity:1;fill-rule:nonzero;stroke:#808080;stroke-width:0.59776002;stroke-linecap:butt;stroke-linejoin:miter;stroke-miterlimit:10;stroke-dasharray:none;stroke-opacity:1"
                         d="M 4.1476,0 C 3.63824,0.12543 1.39934,0.8362 0,1.60966 L 0,-1.60966 C 1.39934,-0.8362 3.63824,-0.12543 4.1476,0 Z" /></g></g></g></g></g><g
               id="g118"><g
                 id="g120"><path
                   id="path122"
                   style="fill:none;stroke:#808080;stroke-width:0.59776002;stroke-linecap:butt;stroke-linejoin:miter;stroke-miterlimit:10;stroke-dasharray:none;stroke-opacity:1"
                   d="m 26.11343,-9.74953 19.62741,-13.4346" /><g
                   id="g124"><g
                     transform="matrix(-0.82692,0.56606,-0.56606,-0.82692,26.11343,-9.74953)"
                     id="g126"><g
                       id="g128"><path
                         id="path130"
                         style="fill:#808080;fill-opacity:1;fill-rule:nonzero;stroke:#808080;stroke-width:0.59776002;stroke-linecap:butt;stroke-linejoin:miter;stroke-miterlimit:10;stroke-dasharray:none;stroke-opacity:1"
                         d="M 4.1476,0 C 3.63824,0.12543 1.39934,0.8362 0,1.60966 L 0,-1.60966 C 1.39934,-0.8362 3.63824,-0.12543 4.1476,0 Z" /></g></g></g></g></g></g><g
             id="g132"><g
               id="g134"><g
                 id="g136"><g
                   transform="translate(2.14474,-2.14474)"
                   id="g138"><path
                     id="path140"
                     style="fill:#808080;fill-opacity:0.15;fill-rule:nonzero;stroke:none"
                     d="m 41.10027,22.91434 28.87056,0 0,13.94781 -28.87056,0 0,-13.94781 z" /></g></g></g><g
               id="g142"><path
                 id="path144"
                 style="fill:#fffbb3;fill-opacity:1;fill-rule:nonzero;stroke:#586e75;stroke-width:0.79701;stroke-linecap:butt;stroke-linejoin:miter;stroke-miterlimit:10;stroke-dasharray:none;stroke-opacity:1"
                 d="m 41.10027,22.91434 28.87056,0 0,13.94781 -28.87056,0 0,-13.94781 z" /></g><g
               transform="translate(44.42,27.946)"
               id="g146"><g
                 id="g148"><g
                   transform="translate(-45.521,-95.094)"
                   id="g150"><g
                     id="text152"
                     style="font-variant:normal;font-weight:normal;font-size:6.97380018px;font-family:LMMono8;-inkscape-font-specification:LMMono8-Regular;writing-mode:lr-tb;fill:#000000;fill-opacity:1;fill-rule:nonzero;stroke:none"
                     transform="matrix(1,0,0,-1,45.521,95.094)"><path
                       id="path262"
                       style=""
                       d="m 3.5984809,-0.20921401 c 0,-0.2161878 -0.1464498,-0.2161878 -0.3975066,-0.2161878 l 0,-1.68765969 c 0,-0.139476 0,-0.9344892 -0.6206682,-0.9344892 -0.209214,0 -0.4951398,0.090659 -0.6904063,0.3626376 -0.104607,-0.2371092 -0.2998734,-0.3626376 -0.5300088,-0.3626376 -0.2231616,0 -0.43237558,0.097633 -0.59974678,0.2510568 -0.0139476,-0.209214 -0.1534236,-0.209214 -0.27895201,-0.209214 l -0.2231616,0 c -0.10460701,0 -0.28592581,0 -0.28592581,0.209214 0,0.2161878 0.1464498,0.2161878 0.39750661,0.2161878 l 0,2.15490429 c -0.25105681,0 -0.39750661,0 -0.39750661,0.2161878 C -0.0278952,0 0.1603974,0 0.25803061,0 l 0.61369441,0 c 0.10460701,0 0.28592578,0 0.28592578,-0.20921401 0,-0.2161878 -0.1464498,-0.2161878 -0.39750658,-0.2161878 l 0,-1.24831019 c 0,-0.6206683 0.28592578,-0.9484369 0.57185158,-0.9484369 0.1603974,0 0.2580306,0.1185546 0.2580306,0.5718516 l 0,1.62489549 c -0.1325022,0 -0.3068472,0 -0.3068472,0.2161878 C 1.2831792,0 1.4714718,0 1.569105,0 l 0.5230351,0 c 0.104607,0 0.2859258,0 0.2859258,-0.20921401 0,-0.2161878 -0.1464498,-0.2161878 -0.3975066,-0.2161878 l 0,-1.24831019 c 0,-0.6206683 0.2859258,-0.9484369 0.5718516,-0.9484369 0.1603974,0 0.2580306,0.1185546 0.2580306,0.5718516 l 0,1.62489549 c -0.1325022,0 -0.3068472,0 -0.3068472,0.2161878 C 2.5035943,0 2.6918869,0 2.7895201,0 l 0.523035,0 c 0.104607,0 0.2859258,0 0.2859258,-0.20921401 z" /><path
                       id="path264"
                       style=""
                       d="m 7.3245822,-0.21618781 c 0,-0.209214 -0.174345,-0.209214 -0.278952,-0.209214 -0.2928996,0 -0.3626376,-0.034869 -0.418428,-0.0557904 l 0,-1.50634089 c 0,-0.4951398 -0.3765852,-1.080939 -1.3808124,-1.080939 -0.2998734,0 -1.0112011,0 -1.0112011,0.5090874 0,0.209214 0.1464498,0.3207948 0.3138211,0.3207948 0.104607,0 0.2998734,-0.062764 0.3068472,-0.3207948 0,-0.05579 0.00697,-0.062764 0.1464498,-0.076712 0.097633,-0.00697 0.1882926,-0.00697 0.2510568,-0.00697 0.5300088,0 0.8926464,0.2161878 0.8926464,0.7113276 -1.2343626,0.020922 -2.0921401,0.3696115 -2.0921401,1.03909628 0,0.48119221 0.4393495,0.93448922 1.1506771,0.93448922 0.2580306,0 0.6904062,-0.0488166 1.0181748,-0.26500441 C 6.3761454,-0.0069738 6.7108878,0 6.9758922,0 c 0.1952664,0 0.34869,0 0.34869,-0.21618781 z M 6.14601,-0.93448922 c 0,0.1603974 0,0.3068472 -0.2719782,0.43237561 -0.2510568,0.1185546 -0.5648778,0.1185546 -0.6206682,0.1185546 -0.4323756,0 -0.7183014,-0.23710921 -0.7183014,-0.50908741 0,-0.34171618 0.5997468,-0.59974678 1.6109478,-0.62764198 l 0,0.58579918 z" /><path
                       id="path266"
                       style=""
                       d="m 10.611334,-0.87172502 c 0,-0.72527518 -0.8996201,-0.87172498 -1.1227817,-0.90659398 l -0.4742184,-0.083686 c -0.2022402,-0.027895 -0.6764586,-0.1115809 -0.6764586,-0.3835591 0,-0.1813188 0.2231616,-0.3975066 0.8856726,-0.3975066 0.5788254,0 0.6764586,0.209214 0.69738,0.3905328 0.00697,0.1185546 0.020921,0.2371092 0.2371091,0.2371092 0.244083,0 0.244083,-0.1464498 0.244083,-0.2859258 l 0,-0.4811922 c 0,-0.1115808 0,-0.2859258 -0.209214,-0.2859258 -0.167371,0 -0.1952663,0.097633 -0.2092139,0.1464498 -0.3068472,-0.1464498 -0.6136944,-0.1464498 -0.7461966,-0.1464498 -1.1646246,0 -1.325022,0.5718516 -1.325022,0.8229084 0,0.6415897 0.732249,0.7601443 1.3738386,0.8577775 0.3417162,0.05579 0.8996199,0.1464498 0.8996199,0.51606118 0,0.2580306 -0.2580303,0.48816601 -0.8926461,0.48816601 -0.3277686,0 -0.7183014,-0.0767118 -0.8926464,-0.62066819 -0.034869,-0.1255284 -0.062764,-0.2022402 -0.244083,-0.2022402 -0.244083,0 -0.244083,0.1464498 -0.244083,0.28592578 l 0,0.67645861 c 0,0.11158081 0,0.28592581 0.209214,0.28592581 0.062764,0 0.174345,-0.0069738 0.2580306,-0.26500441 0.3417162,0.25105681 0.7113276,0.26500441 0.906594,0.26500441 1.1018609,0 1.3250219,-0.57882541 1.3250219,-0.91356782 z" /><path
                       id="path268"
                       style=""
                       d="m 14.246776,-0.87869882 c 0,-0.12552838 0,-0.27197818 -0.244083,-0.27197818 -0.230136,0 -0.237109,0.1464498 -0.237109,0.26500438 -0.007,0.43237561 -0.404481,0.50211361 -0.564878,0.50211361 -0.536983,0 -0.536983,-0.36263761 -0.536983,-0.53698261 l 0,-1.65976448 1.143703,0 c 0.104607,0 0.278952,0 0.278952,-0.209214 0,-0.2161878 -0.167371,-0.2161878 -0.278952,-0.2161878 l -1.143703,0 0,-0.5718516 c 0,-0.1325022 0,-0.2859258 -0.237109,-0.2859258 -0.244083,0 -0.244083,0.1464498 -0.244083,0.2859258 l 0,0.5718516 -0.606721,0 c -0.11158,0 -0.285925,0 -0.285925,0.2161878 0,0.209214 0.174345,0.209214 0.278952,0.209214 l 0.613694,0 0,1.70160728 c 0,0.66948481 0.474218,0.92054162 0.983306,0.92054162 0.516061,0 1.080939,-0.29987341 1.080939,-0.92054162 z" /><path
                       id="path270"
                       style=""
                       d="m 18.056563,-0.76014422 c 0,-0.1952664 -0.20224,-0.1952664 -0.244083,-0.1952664 -0.125528,0 -0.181319,0.0209214 -0.230135,0.1534236 -0.153424,0.35566381 -0.530009,0.41842801 -0.725276,0.41842801 -0.523035,0 -1.04607,-0.34869001 -1.15765,-0.94843679 l 2.078192,0 c 0.14645,0 0.278952,0 0.278952,-0.2580306 0,-0.7950133 -0.446323,-1.4784457 -1.352917,-1.4784457 -0.829882,0 -1.499367,0.69738 -1.499367,1.5551575 0,0.85080358 0.704354,1.5551574 1.603974,1.5551574 0.920541,0 1.24831,-0.62764202 1.24831,-0.80198702 z m -0.49514,-0.99027958 -1.855031,0 c 0.09763,-0.5090875 0.509088,-0.8926465 0.997254,-0.8926465 0.362637,0 0.795013,0.174345 0.857777,0.8926465 z" /><path
                       id="path272"
                       style=""
                       d="m 21.922141,-2.6151751 c 0,-0.139476 -0.08369,-0.4323756 -0.662511,-0.4323756 -0.355664,0 -0.801987,0.1255284 -1.185546,0.5648778 l 0,-0.2371092 c 0,-0.2161878 -0.04184,-0.2859258 -0.278952,-0.2859258 l -0.767118,0 c -0.104608,0 -0.278953,0 -0.278953,0.209214 0,0.2161878 0.167372,0.2161878 0.278953,0.2161878 l 0.564877,0 0,2.15490429 -0.564877,0 c -0.104608,0 -0.278953,0 -0.278953,0.209214 C 18.749061,0 18.916433,0 19.028014,0 l 1.820161,0 c 0.104607,0 0.285926,0 0.285926,-0.20921401 0,-0.2161878 -0.181319,-0.2161878 -0.285926,-0.2161878 l -0.774091,0 0,-0.87172499 c 0,-0.6555373 0.411454,-1.3250221 1.255284,-1.3250221 0.007,0.1673712 0.125528,0.3068472 0.299873,0.3068472 0.153424,0 0.2929,-0.1115808 0.2929,-0.2998734 z" /></g><g
                     transform="translate(45.521,95.094)"
                     id="g156" /></g></g><g
                 transform="translate(-44.42,-27.946)"
                 id="g158" /></g></g><g
             id="g160"><path
               id="path162"
               style="fill:none;stroke:#808080;stroke-width:0.79701;stroke-linecap:butt;stroke-linejoin:miter;stroke-miterlimit:10;stroke-dasharray:0.79701, 0.99628;stroke-dashoffset:0;stroke-opacity:1"
               d="m 55.53587,14.7466 -3.3e-4,7.76922" /><g
               id="g164"><g
                 transform="matrix(0,-1,1,0,55.53587,14.7466)"
                 id="g166"><g
                   id="g168"><path
                     id="path170"
                     style="fill:#808080;fill-opacity:1;fill-rule:nonzero;stroke:#808080;stroke-width:0.79701;stroke-linecap:butt;stroke-linejoin:miter;stroke-miterlimit:10;stroke-dasharray:none;stroke-opacity:1"
                     d="M 4.53381,0 C 3.97704,0.13812 1.52963,0.92084 0,1.77261 L 0,-1.77261 C 1.52963,-0.92084 3.97704,-0.13812 4.53381,0 Z" /></g></g></g></g><g
             id="g172"><g
               id="g174"><g
                 id="g176"><g
                   transform="translate(2.14474,-2.14474)"
                   id="g178"><path
                     id="path180"
                     style="fill:#808080;fill-opacity:0.15;fill-rule:nonzero;stroke:none"
                     d="m 28.13309,-66.7505 54.80489,0 0,13.94781 -54.80489,0 0,-13.94781 z" /></g></g></g><g
               id="g182"><path
                 id="path184"
                 style="fill:#d4e8f6;fill-opacity:1;fill-rule:nonzero;stroke:#586e75;stroke-width:0.79701;stroke-linecap:butt;stroke-linejoin:miter;stroke-miterlimit:10;stroke-dasharray:none;stroke-opacity:1"
                 d="m 28.13309,-66.7505 54.80489,0 0,13.94781 -54.80489,0 0,-13.94781 z" /></g><g
               transform="translate(31.453,-61.388)"
               id="g186"><g
                 id="g188"><g
                   transform="translate(-32.554,-5.76)"
                   id="g190"><g
                     id="text192"
                     style="font-variant:normal;font-weight:normal;font-size:6.97380018px;font-family:LMMono8;-inkscape-font-specification:LMMono8-Regular;writing-mode:lr-tb;fill:#000000;fill-opacity:1;fill-rule:nonzero;stroke:none"
                     transform="matrix(1,0,0,-1,32.554,5.76)"><path
                       id="path275"
                       style=""
                       d="m 3.2567647,-1.5063408 c 0,-0.8717251 -0.6485634,-1.5621313 -1.4296291,-1.5621313 -0.7810656,0 -1.42962899,0.6904062 -1.42962899,1.5621313 0,0.88567258 0.66251099,1.5481836 1.42962899,1.5481836 0.7671181,0 1.4296291,-0.66948482 1.4296291,-1.5481836 z m -0.4811922,-0.048817 c 0,0.64856338 -0.4323756,1.17159839 -0.9484369,1.17159839 -0.5160612,0 -0.94843678,-0.52303501 -0.94843678,-1.17159839 0,-0.6346159 0.45329698,-1.0879129 0.94843678,-1.0879129 0.5021137,0 0.9484369,0.453297 0.9484369,1.0879129 z" /><path
                       id="path277"
                       style=""
                       d="m 7.1014206,-2.6151751 c 0,-0.139476 -0.083686,-0.4323756 -0.662511,-0.4323756 -0.3556638,0 -0.801987,0.1255284 -1.185546,0.5648778 l 0,-0.2371092 c 0,-0.2161878 -0.041843,-0.2859258 -0.278952,-0.2859258 l -0.7671181,0 c -0.104607,0 -0.278952,0 -0.278952,0.209214 0,0.2161878 0.1673712,0.2161878 0.278952,0.2161878 l 0.5648779,0 0,2.15490429 -0.5648779,0 c -0.104607,0 -0.278952,0 -0.278952,0.209214 C 3.9283415,0 4.0957127,0 4.2072935,0 l 1.8201619,0 c 0.104607,0 0.2859258,0 0.2859258,-0.20921401 0,-0.2161878 -0.1813188,-0.2161878 -0.2859258,-0.2161878 l -0.7740918,0 0,-0.87172499 c 0,-0.6555373 0.4114542,-1.3250221 1.255284,-1.3250221 0.00697,0.1673712 0.1255284,0.3068472 0.2998734,0.3068472 0.1534236,0 0.2928996,-0.1115808 0.2928996,-0.2998734 z" /><path
                       id="path279"
                       style=""
                       d="m 10.583439,-0.20921401 c 0,-0.2161878 -0.181319,-0.2161878 -0.285926,-0.2161878 l -0.7322489,0 0,-2.29438029 c 0,-0.2161878 -0.041843,-0.2859258 -0.278952,-0.2859258 l -0.9902796,0 c -0.104607,0 -0.2859258,0 -0.2859258,0.209214 0,0.2161878 0.1813188,0.2161878 0.2859258,0.2161878 l 0.7880394,0 0,2.15490429 -0.8438298,0 c -0.1115808,0 -0.2859258,0 -0.2859258,0.2161878 C 7.9543163,0 8.1356351,0 8.2402421,0 l 2.0572709,0 c 0.104607,0 0.285926,0 0.285926,-0.20921401 z M 9.5931593,-3.8704591 c 0,-0.1952664 -0.1534236,-0.34869 -0.34869,-0.34869 -0.1952664,0 -0.34869,0.1534236 -0.34869,0.34869 0,0.1952664 0.1534236,0.34869 0.34869,0.34869 0.1952664,0 0.34869,-0.1534236 0.34869,-0.34869 z" /><path
                       id="path281"
                       style=""
                       d="m 14.665204,-2.7058345 c 0,-0.1603974 -0.132502,-0.3765852 -0.509088,-0.3765852 -0.07671,0 -0.418428,0.00697 -0.739222,0.244083 -0.111581,-0.076712 -0.355664,-0.209214 -0.676459,-0.209214 -0.655537,0 -1.150677,0.523035 -1.150677,1.115808 0,0.2998735 0.118555,0.5300089 0.223162,0.6625111 -0.07671,0.1115808 -0.139476,0.2650044 -0.139476,0.47421838 0,0.24408301 0.09763,0.41842801 0.160397,0.50211361 -0.516061,0.31382101 -0.516061,0.78803942 -0.516061,0.86475122 0,0.59974679 0.732249,1.02514859 1.624895,1.02514859 0.892647,0 1.624896,-0.4323756 1.624896,-1.02514859 0,-0.2580306 -0.125529,-0.60672061 -0.481193,-0.79501322 -0.09066,-0.0488166 -0.383559,-0.2022402 -1.011201,-0.2022402 l -0.488166,0 c -0.05579,0 -0.146449,0 -0.20224,-0.0139476 -0.104607,0 -0.14645,0 -0.230135,-0.0976332 -0.07671,-0.0976332 -0.08369,-0.25105681 -0.08369,-0.25105681 0,-0.0278952 0.01395,-0.1255284 0.04184,-0.19526641 0.02092,0.0139476 0.285926,0.17434501 0.627642,0.17434501 0.64159,0 1.150677,-0.50211358 1.150677,-1.12278188 0,-0.209214 -0.06276,-0.4114542 -0.181319,-0.6067206 0.14645,-0.083686 0.313821,-0.1115808 0.404481,-0.1185546 0.04184,0.1882926 0.20224,0.2371092 0.271978,0.2371092 0.118554,0 0.278952,-0.083686 0.278952,-0.2859258 z m -1.255284,0.7740918 c 0,0.3975067 -0.306847,0.7043539 -0.669485,0.7043539 -0.376585,0 -0.669485,-0.3277686 -0.669485,-0.6973801 0,-0.3975066 0.306847,-0.7043538 0.669485,-0.7043538 0.376585,0 0.669485,0.3277686 0.669485,0.69738 z m 0.75317,2.50359431 c 0,0.30684721 -0.523035,0.60672059 -1.220415,0.60672059 -0.69738,0 -1.220415,-0.29987338 -1.220415,-0.60672059 0,-0.1255284 0.06276,-0.34869 0.285926,-0.48816601 0.174345,-0.1115808 0.237109,-0.1115808 0.746197,-0.1115808 0.620668,0 1.408707,0 1.408707,0.59974681 z" /><path
                       id="path283"
                       style=""
                       d="m 17.993799,-0.20921401 c 0,-0.2161878 -0.181319,-0.2161878 -0.285926,-0.2161878 l -0.732249,0 0,-2.29438029 c 0,-0.2161878 -0.04184,-0.2859258 -0.278952,-0.2859258 l -0.99028,0 c -0.104607,0 -0.285925,0 -0.285925,0.209214 0,0.2161878 0.181318,0.2161878 0.285925,0.2161878 l 0.78804,0 0,2.15490429 -0.84383,0 c -0.111581,0 -0.285926,0 -0.285926,0.2161878 C 15.364676,0 15.545995,0 15.650602,0 l 2.057271,0 c 0.104607,0 0.285926,0 0.285926,-0.20921401 z m -0.99028,-3.66124509 c 0,-0.1952664 -0.153423,-0.34869 -0.34869,-0.34869 -0.195266,0 -0.34869,0.1534236 -0.34869,0.34869 0,0.1952664 0.153424,0.34869 0.34869,0.34869 0.195267,0 0.34869,-0.1534236 0.34869,-0.34869 z" /><path
                       id="path285"
                       style=""
                       d="m 22.096486,-0.20921401 c 0,-0.2161878 -0.174345,-0.2161878 -0.285926,-0.2161878 l -0.306847,0 0,-1.61792169 c 0,-0.7043538 -0.355664,-1.0042272 -0.906594,-1.0042272 -0.467245,0 -0.781066,0.2371092 -0.913568,0.3696114 0,-0.2231616 0,-0.3277686 -0.278952,-0.3277686 l -0.509088,0 c -0.111581,0 -0.285926,0 -0.285926,0.2161878 0,0.209214 0.181319,0.209214 0.278952,0.209214 l 0.313822,0 0,2.15490429 -0.306848,0 c -0.111581,0 -0.285926,0 -0.285926,0.2161878 C 18.609585,0 18.790904,0 18.888537,0 l 1.108835,0 c 0.09763,0 0.278952,0 0.278952,-0.20921401 0,-0.2161878 -0.174345,-0.2161878 -0.285926,-0.2161878 l -0.306847,0 0,-1.23436259 c 0,-0.6973801 0.516061,-0.9623845 0.871725,-0.9623845 0.369611,0 0.467244,0.1952664 0.467244,0.6136944 l 0,1.58305269 -0.271978,0 c -0.111581,0 -0.285926,0 -0.285926,0.2161878 C 20.464616,0 20.652909,0 20.750542,0 l 1.066992,0 c 0.09763,0 0.278952,0 0.278952,-0.20921401 z" /><path
                       id="path287"
                       style=""
                       d="m 25.48087,-4.5957343 c 0,-0.1255284 -0.104607,-0.244083 -0.244083,-0.244083 -0.153424,0 -0.20224,0.104607 -0.244083,0.1952664 L 22.69135,0.1673712 c -0.04882,0.11158081 -0.05579,0.11158081 -0.05579,0.16737121 0,0.1255284 0.104607,0.24408301 0.244083,0.24408301 0.153423,0 0.20224,-0.10460701 0.244083,-0.19526641 L 25.42508,-4.4283631 c 0.04882,-0.1115808 0.05579,-0.1115808 0.05579,-0.1673712 z" /><path
                       id="path289"
                       style=""
                       d="m 29.534741,-0.20921401 c 0,-0.2161878 -0.14645,-0.2161878 -0.397506,-0.2161878 l 0,-1.68765969 c 0,-0.139476 0,-0.9344892 -0.620669,-0.9344892 -0.209214,0 -0.49514,0.090659 -0.690406,0.3626376 -0.104607,-0.2371092 -0.299873,-0.3626376 -0.530009,-0.3626376 -0.223161,0 -0.432375,0.097633 -0.599747,0.2510568 -0.01395,-0.209214 -0.153423,-0.209214 -0.278952,-0.209214 l -0.223161,0 c -0.104607,0 -0.285926,0 -0.285926,0.209214 0,0.2161878 0.14645,0.2161878 0.397507,0.2161878 l 0,2.15490429 c -0.251057,0 -0.397507,0 -0.397507,0.2161878 C 25.908365,0 26.096658,0 26.194291,0 l 0.613694,0 c 0.104607,0 0.285926,0 0.285926,-0.20921401 0,-0.2161878 -0.14645,-0.2161878 -0.397507,-0.2161878 l 0,-1.24831019 c 0,-0.6206683 0.285926,-0.9484369 0.571852,-0.9484369 0.160397,0 0.258031,0.1185546 0.258031,0.5718516 l 0,1.62489549 c -0.132503,0 -0.306848,0 -0.306848,0.2161878 C 27.219439,0 27.407732,0 27.505365,0 L 28.0284,0 c 0.104607,0 0.285926,0 0.285926,-0.20921401 0,-0.2161878 -0.14645,-0.2161878 -0.397507,-0.2161878 l 0,-1.24831019 c 0,-0.6206683 0.285926,-0.9484369 0.571852,-0.9484369 0.160397,0 0.258031,0.1185546 0.258031,0.5718516 l 0,1.62489549 c -0.132503,0 -0.306848,0 -0.306848,0.2161878 C 28.439854,0 28.628147,0 28.72578,0 l 0.523035,0 c 0.104607,0 0.285926,0 0.285926,-0.20921401 z" /><path
                       id="path291"
                       style=""
                       d="m 33.260842,-0.21618781 c 0,-0.209214 -0.174345,-0.209214 -0.278952,-0.209214 -0.2929,0 -0.362638,-0.034869 -0.418428,-0.0557904 l 0,-1.50634089 c 0,-0.4951398 -0.376585,-1.080939 -1.380813,-1.080939 -0.299873,0 -1.011201,0 -1.011201,0.5090874 0,0.209214 0.14645,0.3207948 0.313821,0.3207948 0.104607,0 0.299874,-0.062764 0.306847,-0.3207948 0,-0.05579 0.007,-0.062764 0.14645,-0.076712 0.09763,-0.00697 0.188293,-0.00697 0.251057,-0.00697 0.530009,0 0.892647,0.2161878 0.892647,0.7113276 -1.234363,0.020922 -2.092141,0.3696115 -2.092141,1.03909628 0,0.48119221 0.43935,0.93448922 1.150677,0.93448922 0.258031,0 0.690407,-0.0488166 1.018175,-0.26500441 C 32.312405,-0.0069738 32.647147,0 32.912152,0 c 0.195266,0 0.34869,0 0.34869,-0.21618781 z M 32.08227,-0.93448922 c 0,0.1603974 0,0.3068472 -0.271979,0.43237561 -0.251057,0.1185546 -0.564878,0.1185546 -0.620668,0.1185546 -0.432376,0 -0.718301,-0.23710921 -0.718301,-0.50908741 0,-0.34171618 0.599746,-0.59974678 1.610948,-0.62764198 l 0,0.58579918 z" /><path
                       id="path293"
                       style=""
                       d="m 36.547593,-0.87172502 c 0,-0.72527518 -0.89962,-0.87172498 -1.122782,-0.90659398 l -0.474218,-0.083686 c -0.202241,-0.027895 -0.676459,-0.1115809 -0.676459,-0.3835591 0,-0.1813188 0.223162,-0.3975066 0.885673,-0.3975066 0.578825,0 0.676458,0.209214 0.69738,0.3905328 0.007,0.1185546 0.02092,0.2371092 0.237109,0.2371092 0.244083,0 0.244083,-0.1464498 0.244083,-0.2859258 l 0,-0.4811922 c 0,-0.1115808 0,-0.2859258 -0.209214,-0.2859258 -0.167371,0 -0.195266,0.097633 -0.209214,0.1464498 -0.306847,-0.1464498 -0.613694,-0.1464498 -0.746197,-0.1464498 -1.164624,0 -1.325022,0.5718516 -1.325022,0.8229084 0,0.6415897 0.732249,0.7601443 1.373839,0.8577775 0.341716,0.05579 0.89962,0.1464498 0.89962,0.51606118 0,0.2580306 -0.25803,0.48816601 -0.892646,0.48816601 -0.327769,0 -0.718302,-0.0767118 -0.892647,-0.62066819 -0.03487,-0.1255284 -0.06276,-0.2022402 -0.244083,-0.2022402 -0.244083,0 -0.244083,0.1464498 -0.244083,0.28592578 l 0,0.67645861 c 0,0.11158081 0,0.28592581 0.209214,0.28592581 0.06276,0 0.174345,-0.0069738 0.258031,-0.26500441 0.341716,0.25105681 0.711327,0.26500441 0.906594,0.26500441 1.10186,0 1.325022,-0.57882541 1.325022,-0.91356782 z" /><path
                       id="path295"
                       style=""
                       d="m 40.183036,-0.87869882 c 0,-0.12552838 0,-0.27197818 -0.244083,-0.27197818 -0.230135,0 -0.237109,0.1464498 -0.237109,0.26500438 -0.007,0.43237561 -0.404481,0.50211361 -0.564878,0.50211361 -0.536983,0 -0.536983,-0.36263761 -0.536983,-0.53698261 l 0,-1.65976448 1.143704,0 c 0.104607,0 0.278952,0 0.278952,-0.209214 0,-0.2161878 -0.167372,-0.2161878 -0.278952,-0.2161878 l -1.143704,0 0,-0.5718516 c 0,-0.1325022 0,-0.2859258 -0.237109,-0.2859258 -0.244083,0 -0.244083,0.1464498 -0.244083,0.2859258 l 0,0.5718516 -0.60672,0 c -0.111581,0 -0.285926,0 -0.285926,0.2161878 0,0.209214 0.174345,0.209214 0.278952,0.209214 l 0.613694,0 0,1.70160728 c 0,0.66948481 0.474219,0.92054162 0.983306,0.92054162 0.516061,0 1.080939,-0.29987341 1.080939,-0.92054162 z" /><path
                       id="path297"
                       style=""
                       d="m 43.985847,-0.76014422 c 0,-0.1952664 -0.20224,-0.1952664 -0.244083,-0.1952664 -0.125528,0 -0.181319,0.0209214 -0.230135,0.1534236 -0.153424,0.35566381 -0.530009,0.41842801 -0.725276,0.41842801 -0.523035,0 -1.04607,-0.34869001 -1.15765,-0.94843679 l 2.078192,0 c 0.14645,0 0.278952,0 0.278952,-0.2580306 0,-0.7950133 -0.446323,-1.4784457 -1.352917,-1.4784457 -0.829882,0 -1.499367,0.69738 -1.499367,1.5551575 0,0.85080358 0.704354,1.5551574 1.603974,1.5551574 0.920541,0 1.24831,-0.62764202 1.24831,-0.80198702 z m -0.49514,-0.99027958 -1.855031,0 c 0.09763,-0.5090875 0.509088,-0.8926465 0.997254,-0.8926465 0.362637,0 0.795013,0.174345 0.857777,0.8926465 z" /><path
                       id="path299"
                       style=""
                       d="m 47.851426,-2.6151751 c 0,-0.139476 -0.08369,-0.4323756 -0.662511,-0.4323756 -0.355664,0 -0.801987,0.1255284 -1.185546,0.5648778 l 0,-0.2371092 c 0,-0.2161878 -0.04184,-0.2859258 -0.278952,-0.2859258 l -0.767118,0 c -0.104607,0 -0.278952,0 -0.278952,0.209214 0,0.2161878 0.167371,0.2161878 0.278952,0.2161878 l 0.564877,0 0,2.15490429 -0.564877,0 c -0.104607,0 -0.278952,0 -0.278952,0.209214 C 44.678347,0 44.845718,0 44.957299,0 l 1.820161,0 c 0.104607,0 0.285926,0 0.285926,-0.20921401 0,-0.2161878 -0.181319,-0.2161878 -0.285926,-0.2161878 l -0.774091,0 0,-0.87172499 c 0,-0.6555373 0.411454,-1.3250221 1.255284,-1.3250221 0.007,0.1673712 0.125528,0.3068472 0.299873,0.3068472 0.153424,0 0.2929,-0.1115808 0.2929,-0.2998734 z" /></g><g
                     transform="translate(32.554,5.76)"
                     id="g196" /></g></g><g
                 transform="translate(-31.453,61.388)"
                 id="g198" /></g></g><g
             id="g200"><path
               id="path202"
               style="fill:none;stroke:#808080;stroke-width:0.79701;stroke-linecap:butt;stroke-linejoin:miter;stroke-miterlimit:10;stroke-dasharray:0.79701, 0.99628;stroke-dashoffset:0;stroke-opacity:1"
               d="m 55.53587,-44.63414 -3.3e-4,-7.77003" /><g
               id="g204"><g
                 transform="matrix(0,1,-1,0,55.53587,-44.63414)"
                 id="g206"><g
                   id="g208"><path
                     id="path210"
                     style="fill:#808080;fill-opacity:1;fill-rule:nonzero;stroke:#808080;stroke-width:0.79701;stroke-linecap:butt;stroke-linejoin:miter;stroke-miterlimit:10;stroke-dasharray:none;stroke-opacity:1"
                     d="M 4.53381,0 C 3.97704,0.13812 1.52963,0.92084 0,1.77261 L 0,-1.77261 C 1.52963,-0.92084 3.97704,-0.13812 4.53381,0 Z" /></g></g></g></g><g
             id="g212"><g
               id="g214"><g
                 id="g216"><g
                   transform="translate(2.14474,-2.14474)"
                   id="g218"><path
                     id="path220"
                     style="fill:#808080;fill-opacity:0.15;fill-rule:nonzero;stroke:none"
                     d="m 44.80516,47.62193 21.46075,0 0,13.94781 -21.46075,0 0,-13.94781 z" /></g></g></g><g
               id="g222"><path
                 id="path224"
                 style="fill:#f8d6d5;fill-opacity:1;fill-rule:nonzero;stroke:#586e75;stroke-width:0.79701;stroke-linecap:butt;stroke-linejoin:miter;stroke-miterlimit:10;stroke-dasharray:none;stroke-opacity:1"
                 d="m 44.80516,47.62193 21.46075,0 0,13.94781 -21.46075,0 0,-13.94781 z" /></g><g
               transform="translate(48.125,52.433)"
               id="g226"><g
                 id="g228"><g
                   transform="translate(-49.226,-119.581)"
                   id="g230"><g
                     id="text232"
                     style="font-variant:normal;font-weight:normal;font-size:6.97380018px;font-family:LMMono8;-inkscape-font-specification:LMMono8-Regular;writing-mode:lr-tb;fill:#000000;fill-opacity:1;fill-rule:nonzero;stroke:none"
                     transform="matrix(1,0,0,-1,49.226,119.581)"><path
                       id="path302"
                       style=""
                       d="m 3.5008477,-0.20921401 c 0,-0.2161878 -0.1673712,-0.2161878 -0.278952,-0.2161878 l -0.174345,0 0,-3.41018829 0.174345,0 c 0.104607,0 0.278952,0 0.278952,-0.209214 0,-0.2161878 -0.1673712,-0.2161878 -0.278952,-0.2161878 l -0.8298822,0 c -0.104607,0 -0.278952,0 -0.278952,0.209214 0,0.2161878 0.1673712,0.2161878 0.278952,0.2161878 l 0.174345,0 0,1.4087076 -1.4784457,0 0,-1.4087076 0.174345,0 c 0.104607,0 0.278952,0 0.278952,-0.209214 0,-0.2161878 -0.1673712,-0.2161878 -0.278952,-0.2161878 l -0.82988219,0 c -0.1115808,0 -0.27895201,0 -0.27895201,0.2161878 0,0.209214 0.17434501,0.209214 0.27895201,0.209214 l 0.17434501,0 0,3.41018829 -0.17434501,0 c -0.1115808,0 -0.27895201,0 -0.27895201,0.2161878 C 0.1534236,0 0.32776861,0 0.43237561,0 L 1.2622578,0 c 0.104607,0 0.278952,0 0.278952,-0.20921401 0,-0.2161878 -0.1673712,-0.2161878 -0.278952,-0.2161878 l -0.174345,0 0,-1.57607889 1.4784457,0 0,1.57607889 -0.174345,0 c -0.104607,0 -0.278952,0 -0.278952,0.209214 C 2.1130615,0 2.2804327,0 2.3920135,0 l 0.8298822,0 c 0.104607,0 0.278952,0 0.278952,-0.20921401 z" /><path
                       id="path304"
                       style=""
                       d="m 7.2060276,-0.28592581 0,-0.62066821 c 0,-0.13250218 0,-0.28592578 -0.2371092,-0.28592578 -0.244083,0 -0.244083,0.1464498 -0.244083,0.28592578 l 0,0.48119221 -1.8620046,0 0,-1.56910509 0.9135678,0 c 0,0.2859259 0,0.3975067 0.244083,0.3975067 0.2371092,0 0.2371092,-0.1534236 0.2371092,-0.2859258 l 0,-0.6485635 c 0,-0.1325022 0,-0.2859258 -0.2371092,-0.2859258 -0.244083,0 -0.244083,0.1115808 -0.244083,0.3975066 l -0.9135678,0 0,-1.4156814 1.708581,0 0,0.3696114 c 0,0.1325022 0,0.2859258 0.2371092,0.2859258 0.244083,0 0.244083,-0.1464498 0.244083,-0.2859258 l 0,-0.5090874 c 0,-0.2161878 -0.041843,-0.2859258 -0.278952,-0.2859258 l -2.6012275,0 c -0.104607,0 -0.2859258,0 -0.2859258,0.209214 0,0.2161878 0.1813188,0.2161878 0.2859258,0.2161878 l 0.209214,0 0,3.41018829 -0.209214,0 c -0.1115808,0 -0.2859258,0 -0.2859258,0.2161878 C 3.8864987,0 4.0678175,0 4.1724245,0 l 2.7546511,0 c 0.2301354,0 0.278952,-0.0627642 0.278952,-0.28592581 z" /><path
                       id="path306"
                       style=""
                       d="m 10.876339,-0.20921401 c 0,-0.0906594 -0.03487,-0.1603974 -0.118555,-0.1952664 -0.04184,-0.0209214 -0.195266,-0.0209214 -0.299873,-0.0209214 L 9.6140807,-4.0726993 c -0.062764,-0.2650044 -0.1603974,-0.2719782 -0.3765852,-0.2719782 -0.2022402,0 -0.313821,0 -0.3765852,0.2650044 l -0.8438298,3.65427129 c -0.097633,0 -0.2580306,0 -0.2998734,0.0139476 -0.076712,0.0418428 -0.1185546,0.1115808 -0.1185546,0.2022402 C 7.5986525,0 7.7799713,0 7.8985259,0 l 0.7113276,0 c 0.1255284,0 0.2928996,0 0.2928996,-0.20921401 0,-0.2161878 -0.139476,-0.2161878 -0.3905328,-0.2161878 l 0.1603974,-0.72527519 1.1297556,0 0.1603974,0.72527519 c -0.2510568,0 -0.3905328,0 -0.3905328,0.2161878 C 9.5722379,0 9.7396091,0 9.8651375,0 l 0.7113275,0 c 0.118555,0 0.299874,0 0.299874,-0.20921401 z m -1.1785727,-1.36686479 -0.9205416,0 0.4602708,-2.1897733 0.4602708,2.1897733 z" /><path
                       id="path308"
                       style=""
                       d="m 14.497833,-2.0991139 c 0,-1.115808 -0.599747,-2.161878 -1.527263,-2.161878 l -1.436602,0 c -0.111581,0 -0.285926,0 -0.285926,0.2161878 0,0.209214 0.181319,0.209214 0.285926,0.209214 l 0.153423,0 0,3.41018829 -0.153423,0 c -0.111581,0 -0.285926,0 -0.285926,0.2161878 C 11.248042,0 11.429361,0 11.533968,0 l 1.436602,0 c 0.913568,0 1.527263,-0.97633203 1.527263,-2.0991139 z m -0.481193,0 c 0,0.8159347 -0.40448,1.67371209 -1.178572,1.67371209 l -0.669485,0 0,-3.41018829 0.669485,0 c 0.78804,0 1.178572,0.9275154 1.178572,1.7364762 z" /></g><g
                     transform="translate(49.226,119.581)"
                     id="g236" /></g></g><g
                 transform="translate(-48.125,-52.433)"
                 id="g238" /></g></g><g
             id="g240"><path
               id="path242"
               style="fill:none;stroke:#808080;stroke-width:0.79701;stroke-linecap:butt;stroke-linejoin:miter;stroke-miterlimit:10;stroke-dasharray:0.79701, 0.99628;stroke-dashoffset:0;stroke-opacity:1"
               d="m 55.53554,43.43758 0,3.78585" /><g
               id="g244"><g
                 transform="matrix(0,-1,1,0,55.53554,43.43758)"
                 id="g246"><g
                   id="g248"><path
                     id="path250"
                     style="fill:#808080;fill-opacity:1;fill-rule:nonzero;stroke:#808080;stroke-width:0.79701;stroke-linecap:butt;stroke-linejoin:miter;stroke-miterlimit:10;stroke-dasharray:none;stroke-opacity:1"
                     d="M 4.53381,0 C 3.97704,0.13812 1.52963,0.92084 0,1.77261 L 0,-1.77261 C 1.52963,-0.92084 3.97704,-0.13812 4.53381,0 Z" /></g></g></g></g></g></g></g></g></svg>