"0","CC_T <- data_all %>% "
"0","  group_by(Object) %>% "
"0","  dplyr::summarise(category = names(sort(table(Category_eng), decreasing = TRUE))[1], "
"0","                   count = max(table(Category_eng))) %>% "
"0","  group_by(category) %>% "
"0","  dplyr::summarise(count = n())"
"0","# Make doughnut plot"
"0","# Add addition columns, needed for drawing with geom_rect."
"0","# CC_T$fraction = CC_T$count / sum(CC_T$count)"
"0","# CC_T = CC_T[order(CC_T$fraction), ]"
"0","# CC_T$ymax = cumsum(CC_T$fraction)"
"0","# CC_T$ymin = c(0, head(CC_T$ymax, n=-1))"
"0","# "
"0","# p_cat = ggplot(CC_T, aes(fill=category, ymax=ymax, ymin=ymin, xmax=4, xmin=3)) +"
"0","#   geom_rect() +"
"0","#   coord_polar(theta=""y"") +"
"0","#   xlim(c(0, 4)) +"
"0","#   theme(xlim = element_blank()) +"
"0","#   theme(panel.grid=element_blank()) +"
"0","#   theme(axis.text=element_blank()) +"
"0","#   theme(axis.ticks=element_blank()) +"
"0","#   labs(title="""") +"
"0","#   theme(legend.position='left')"
"0","# "
"0","# p_cat <- p_cat + scale_fill_brewer(palette=""RdBu"") + theme_bw()"
"0","# plot(p_cat)"
