nicht erkannt;00;
nicht erkennbar;00;
glasschwamm  buerste;glasschwamm;
abgelenkt;00;
schale wischtuch 00;schale;
xxxmesser;xx;
glas bierkrug;glas;
pfannenwender grillbesteck;pfannenwender;
deko schale;dekoschale;
apfel bosskopf;apfel;
vlltneneis;eis;
glas bierkrug;glas;
pfannenwender grillbesteck;pfannenwender;
pfannwender;pfannenwender;
cremdose;cremedose;
obstschaale;obstschale;
bbrotschneidemaschine;brotschneidemaschine;
brotschneidemaschiene;brotschneidemaschine;
manuellebrotschneidemaschine;manuelle brotschneidemaschine;
schneidemachine;schneidemaschine;
1 2 brotlaib;halber brotlaib;
kaktus blumentopf;kaktus;
topf   kaktus;topf;
topfpflanze kaktus;topfpflanze;
altersgerechte mobiltelefon;altersgerechtes mobiltelefon;
fernbedinung;fernbedienung;
kerze kerzenhalter;kerze;
kerzenhalter kerze;kerzenhalter;
kerzenstaender mit kerzee;kerzenstaender mit kerze;
kerze kerzenstaender;kerze;
kerzenstaender kerze;kerzenstaender;
kerzenhalter kerze;kerzenhalter;
karabinerhaken schluessel;karabinerhaken;
schluesselbund karabiner;schluesselbund;
karabiner schluessel;karabiner;
karrabinerhaken schluessel;karrabinerhaken;
schluessel  anhaenger;schluesselanhaenger;
schluessel karabiner;schluessel;
schluesselanhaenger karabiner;schluesselanhaenger;
schluesselmitkarabiner;schluessel mit karabiner;
komischebuerste;komische buerste;
cutter messer;cuttermesser;
cattermesser;cuttermesser;
cuttermesser teppichmesser;cuttermesser;
kattermesser;cuttermesser;
kuttermesser;cuttermesser;
teppich cutter;teppichcutter;
grosseuhr;grosse uhr;
wecker uhr;wecker;
draht buegel;drahtbuegel;
draht kleiderbuegel;drahtkleiderbuegel;
draht kleiderbuegell;drahtkleiderbuegel;
kleinekaffeetasse;kleine kaffeetasse;
tasse weiss;weisse tasse;
blechdose konservendose;blechdose;
blechdose lebensmittel;blechdose;
dose buechse;dose;
kriegsessen bzw dosenfutter;kriegsessen;
kreide wachsmalstifte;kreide;
waxmalstifte;wachsmalstifte;
kremdose;cremedose;
cremdose;cremedose;
cremedose oder haarkurdose;cremedose;
handcreme gesichtscreme;handcreme;
diadem krohne;diadem;
haarreif krone;haarreif;
krohne;krone;
krone diadem;krone;
prinzessinnen krone;prinzessinnenkrone;
ketchup flasche;ketchupflasche;
deo roller;deoroller;
defuser dinosaurierzahn;defuser;
deo spender;deospender;
;;
raumerfrischer duftsprueher;raumerfrischer;
doughnut;donut;XXX
donat;donut;
dounat;donut;
dounut;donut;
backwerk donut;backwerk;
beagel;bagel;
donat  gebaeck;donat;
donats;donat;XXX
doughnut teilchen;donat;
dount;donut;
keks gebaeck;keks;
kringel essen;kringel;
pfeile;feile;
tischlerwerkzeug feile;tischlerwerkzeug;
schale deckel;schale;
geschenk box;geschenkbox;
geschenkbox  paket;geschenkbox;
geschenke box;geschenkbox;
wentrauben;weintrauben;
reibe kuechenreibe;reibe;
foehnbuerste;foenbuerste;
foehnkamm;foenkamm;
haarbuerste lockenbuerste;haarbuerste;
haarbuerste rundbuerste;haarbuerste;
rundehaarbuerste;runde haarbuerste;
foehn;foen;
foehn haartrockner;foen;
haar foehn;haarfoen;
haarfoehn;haarfoen;
feustel;faeustel;
hammer faeustel;hammer;
damen hut;damenhut;
high heel;high heels;XXX
damen absatzschuh;damenabsatzschuh;
damen schuh;damenschuh;
damenschuh highheel;damenschuh;
damenschuh pumps;damenschuh;
highheels;high heels;
hochhakigerschuh;hochhackiger schuh;
schuh pumps;schuh;
aufbewarungsbox;aufbewahrungsbox;
kaffee teekanne;kaffee;
tee kanne;teekanne;
kubelschreiber;kugelschreiber;
citrone;zitrone;
zirtone;zitrone;
zipo feuerzeug;zippo feuerzeug;
avokado;avocado;
eine pflaume;pflaume;
plaume;pflaume;
pc maus;pcmaus;
computermouse;computermaus;XXX
mouse;maus;XXX
computer mouse;computermaus;
maus computermaus;maus;
apfelsine orange;apfelsine;
apfel oder apfelsine;apfelsine;
blassezitrone;blasse zitrone;
orange pampelmuse;orange;
farbpallette;farbpalette;
farb mischplatte;farbmischplatte;
farb palette;farbpalette;
farbpalette malen;farbpalette;
mal palette;malpalette;
maler*innenpalette;malerpalette;XXX
malpallette;malpalette;
malutensil farbpalette;malutensil;
dose box;dose;
rundebox;runde box;
pflanze palme;pflanze;
pflanze vase;pflanze;
pflanze wasserglas;pflanze;
pflanzen behaelter;pflanzenbehaelter;
vase sand;vase;
birne abate;birne;
brine;birne;
acrylbuntstift oder einfach buntstift;acrylbuntstift;
blei stift;bleistift;
weisser buntstfit;weisser buntstift;
weisserstift;weisser stift;
beistift;bleistift;
roterbleistift;roter bleistift;
wekzeugzange;werkzeugzange;
ein kopf oder couchkissen;kopfkissen;
pfeiffe;pfeife;
tabakspfeife;tabakpfeife;
eine pfeife;pfeife;
tabackpfeife;tabakpfeife;
tabakpfeiffe;tabakpfeife;
porzellan  keramikkaraffe;porzellankaraffe;
porzellan karaffe;porzellankaraffe;
waser kanne;wasserkanne;
wasserkrug vase;wasserkrug;
blume vase;blume;
pflanze vase;pflanze;
blumenvase mitzweigen;blumenvase mit zweigen;
blumenvase pflanze;blumenvase;
bumenvase;blumenvase;
deko vase;deko;
steckling bzw ast;steckling;
vase blumen;vase;
vase gefaess;vase;
vase gruenpflanze;vase;
vase zweige;vase;
weidenkaetzchen vase;weidenkaetzchen;
blumenvase zweige;blumenvase;
deko kunstaeste;deko;
deko weidenzweige;deko;
dokokram;dekokram;
kaetzchen vase;kaetzchen;
strauch vase;strauch;
vase   kaetzchen;vase;
weiden pflanze;weiden;
aaufbewahrungsbehaelter;aufbewahrungsbehaelter;
dose kekse;dose;
henkelloser top;henkelloser topf;
topf deckel;topf;
topfmdeckel;topf mit deckel;
katoffel;kartoffel;
nochnekartoffel;kartoffel;
gummi ente;gummiente;
gummiente badeente;gummiente;
pflastikente;plastikente;
plastik entchen;plastikentchen;
quietschentchen;quietscheentchen;
quitscheente;quietscheente;
quitscheenten;quietscheenten;
eier uhr;eieruhr;
schale schuessel;schale;
scheere;schere;
schraeubenzieher;schraubenzieher;
sschlitzschraubendreher;schlitzschraubendreher;
putzmittel flasche;putzmittelflasche;
speiseoel flasche;speiseoelflasche;
shampoo flasche;shampooflasche;
fluessigkeit flasche;fluessigkeit;
reinigungsmittelflasch;reinigungsmittelflasche;
bodylotion flasche;bodylotionflasche;
creme lotionflasche;creme;
kosmetik flasche;kosmetikflasche;
lotion   flasche;lotionflasche;
papertuete;papiertuete;
tragetasche einkaufstasche;tragetasche;
tuete geschenktuete;tuete;
einkaufstuete ordner;einkaufstuete;
papier tasche;papiertasche;
eiswuerfelschauffel;eiswuerfelschaufel;
handschuuber;handschuber;
schaufel schippe;schaufel;
schippe kehrblech;schippe;
schuett schaufel;schuette;
bodylotiosbehaelter;bodylotionbehaelter;
duschgel flasche;duschgelflasche;
plastikflasche shampoo;plastikflasche;
flip flop;flipflop;
flip flops;flipflop;
flip flop sandale;flipflop;
flip flopp;flipflop;
flipflop sandale;flipflop;
flipflop zehentrenner;flipflop;
flipflops;flipflop;
badelatsche;badelatschen;
badelatsch flipflop;badelatschen;
badelatschen flipflop;badelatschen;
badelatsch hausschuh;badelatschen;
hausschuh badelatschen;hausschuh;
rechterbadelatschen;rechter badelatschen;
schlappen hausschuh;schlappen;
duschgel spender;duschgelspender;
hand seifenspender;handseifenspender;
seifen spender;seifenspender;
seifennspender;seifenspender;
nicht zu beschreiben;00;
seife brot;seife;
vlltseife;seife;
spruehflasche  zerstaeuber;spruehflasche;
spruehflasche sprueher;spruehflasche;
wasserzersteuber;wasserzerstaeuber;
zerstaeuber flasche;zerstaeuber;
zerstraeuberflasche;zerstaeuberflasche;
spaydose;spraydose;
spraeidose;spraydose;
spray dose;spraydose;
sprueh lackdose;spruehlackdose;
spuehdose;spruehdose;
tacker klammerhefter;tacker;
creme  oder lotionflasche;creme;
creme lotionflasche;creme;
duschgel flasche;duschgelflasche;
flaschmann oder doch duschgel;flachmann;
kosmetikflasche schampoo;kosmetikflasche;
reinigungsmittel flasche;reinigungsmittelflasche;
schampoo;shampoo;
puder flasche;puderflasche;
rreinigungsmittelflasche;reinigungsmittelflasche;
tubenflaechchen;tubenflaeschchen;
<u 00d6>lflasche;oelflasche;
fluessigkeit flasche;fluessigkeit;
kanister flasche;kanister;
rreinigungsmittelflasche;reinigungsmittelflasche;
klebeband abroller;klebeband;
klebefilm tesa;klebefilm;
klebestreifen abroller;klebestreifenabroller;
klebestreifen spender;klebestreifenspender;
tesa abroller;tesaabroller;
tesafilm klebestreifen;tesafilm;
thesafilm;tesafilm;
gr  tasse;grosse tasse;
kaffepott;kaffeepott;
tasse becher;tasse;
vergessen;11;
creme tube;cremetube;
creme zahnpstatube;creme;
kleinetube;kleine tube;
zahnpasta  tube;zahnpastatube;
zahnpasta tube;zahnpastatube;
puppen sessel;puppensessel;
luftballon aufgebl;luftballon aufgeblasen;
luftballong;luftballon;
leirer;leiter;
spielzeug flugzeug;spielzeugflugzeug;
modell flugzeug;modellflugzeug;
popellaflugzeug;propellerflugzeug;
popeller;propeller;
spiel flugzeug;spielflugzeug;
kuehl gefrierkombination;kuehlgefrierkombination;XXX
kuehl  gefrierkombi;kuehlgefrierkombination;
kuehl  gefrierkombination;kuehlgefrierkombination;
kuehl gefrierkombi;kuehlgefrierkombination;
kuehl gefrierschrank;kuehlgefrierschrank;
kuelschrank;kuehlschrank;
spielzeug kuehlschrank;spielzeugkuehlschrank;
holzlok;holzlokomotive;XXX
holzlock;holzlokomotive;
holz lokomotive;holzlokomotive;
holzeisenbahn spieleisenbahn;holzeisenbahn;
holzspieleugeisenbahn;holzspielzeugeisenbahn;
kinder eisenbahn;kindereisenbahn;
spielzeug eisenbahn aus holz;spielzeugeisenbahn aus holz;
spielzeug holzeisenbahn;spielzeugholzeisenbahn;XXX
spielzeug lokomotive;spielzeuglokomotive;
spielzeug lkw;spielzeuglkw;
kinderspielzeug lkw;kinderspielzeuglkw;
miniatur lwk;miniaturlkw;
modell lkw;modelllkw;
modelltruck spielzeugauto;modelltruck;
spielzeug  modell lkw;spielzeugmodelllkw;
spielzeug auto;spielzeugauto;
spielzeug laster;spielzeuglaster;
spielzeuglastwagen;spielzeuglastwagen;
spiezeugauto;spielzeugauto;
wohnmobil lkw;wohnmobil;
creme zahnpastatube;creme;
cremtube;cremetube;
kosmetika tube;kosmetikatube;
salben tube;salbentube;
schuhcreme tube;schuhcremetube;
zahnpasta handcreme;zahnpasta;
creme zahnpastatube;creme;
cremtube;cremetube;
kosmetika tube;kosmetikatube;
salben tube;salbentube;
schuhcreme tube;schuhcremetube;
zahnpasta handcreme;zahnpasta;
cremtube;cremetube;
creme tube;cremetube;
creme zahnpastatube;creme;
nochnetube;tube;
tube mit haarchampo;tube mit haarshampoo;
rasierschaum tube;rasierschaumtube;
salben tube;salbentube;
tube999;tube;
zahncremtube;zahncremetube;
zahnpasta creme;zahnpasta;
zahnpasta tube;zahnpastatube;
tube4000;tube;
creme zahnpstatube;creme;
zahnpasta  tube;zahnpastatube;
creme duschgel;creme;
creme tube;cremetube;
creme zahnpastatube;creme;
cremtube;cremetube;
grossekosmetiktube;grosse kosmetiktube;
tube kosmetik;tube;
zahnpasta tube;zahnpastatube;
usb stick;usbstick;
usbstix;usbstick;
kochplatte waage;kochplatte;
kueschenwaage;kuechenwaage;
alu flasche;aluflasche;
graue thermokanne;graue thermoskanne;
iso flasche;isoflasche;
outdoor trinkflasche;outdoortrinkflasche;
sigg flasche;siggflasche;
termoskanne;thermoskanne;
termotrinkflasche;thermotrinkflasche;
thermoflasche;thermoflasche;
thermuskanne;thermoskanne;
glasvaase;glasvase;
wasser glas;wasserglas;
<u 00dc>berwachungskamera;ueberwachungskamera;
webkamera;webcam;XXX
externe pc webcam;externe pcwebcam;
pc skypekamera;pcskypekamera;
web cam;webcam;
habs verpasst;00;
prosecco flasche;proseccoflasche;
sekt weinflasche;sekt;
<u 00d6>lflasche;oelflasche;
glas flasche;glasflasche;
glasflasche weinflasche;glasflasche;
schnapsflsche;schnapsflasche;
sekt oder weinflasche;sekt;
fluessigseife zerst;fluessigseife;
highheels;high heels;
plastik kamm;plastikkamm;
pc laptop maus;pcmaus;
usb maus;usbmaus;
