Object,Recognizability,Familiarity,Details,Contact,Usage,Hstat,ModelName,PercNameAgreement
AlarmClock_MPI01,98.2058823529412,81.5,86.1176470588235,28.7352941176471,24.1470588235294,1.0696411407323125,wecker,0.007008760951188986
Apple_MPI01,98.3235294117647,98.2647058823529,85.2647058823529,79.5882352941177,71.3529411764706,0.3815804883091629,apfel,0.008010012515644555
Apple02_MPI01,99,98.5,86.0882352941177,77.6764705882353,69.2352941176471,0,apfel,0.00851063829787234
BackSponge_MPI01,43.1470588235294,39.5588235294118,42.6764705882353,18.2647058823529,15.9705882352941,3.8279097821439696,eis,0.0010012515644555694
Banana_MPI01,98.5588235294118,96.4411764705882,73.9117647058823,81.2352941176471,76.2647058823529,0,banane,0.00851063829787234
BierGlas_MPI01,95.2941176470588,81.6176470588235,71.1470588235294,37.4705882352941,25.4411764705882,2.0059604642973965,bierglas,0.00425531914893617
BigFork_MPI01,94.4117647058823,90.8823529411765,71.5588235294118,75.6176470588235,72.5882352941177,1.3719873517384964,pfannenwender,0.006257822277847309
BigSpoon_MPI01,76.9411764705882,74.7647058823529,49.5882352941176,47.6470588235294,36.5,3.426694786471964,eisloeffel--kelle,0.001501877346683354
BodyCremePot_MPI01,63.2058823529412,71.0588235294118,33.1764705882353,65.0588235294118,57.9117647058824,3.203529082279449,cremedose,0.002753441802252816
Book_MPI01,98.9705882352941,97.9705882352941,57.3529411764706,88.3823529411765,78.2647058823529,0.8040411835778966,buch,0.007259073842302879
BottleOpener_MPI01,97.1470588235294,90.1470588235294,65.0294117647059,63.3529411764706,51.1470588235294,0.3815804883091629,flaschenoeffner,0.008010012515644555
Bread_MPI01,88.4117647058823,97.5,62.0588235294118,89.6176470588235,82.3529411764706,2.0272215950096317,brot,0.0050062578222778474
BreadBasket_MPI01,51.5588235294118,55,51.6470588235294,46.6764705882353,42.7352941176471,2.682588730501833,schale,0.0025031289111389237
BreadCutMachine_MPI01,83.5294117647059,65.6764705882353,83.3823529411765,19.6470588235294,14.1764705882353,1.4668577423216964,brotschneidemaschine,0.005506883604505632
Cactus_MPI01,94.2647058823529,79,67.2941176470588,33.1764705882353,19.0294117647059,1.1284646701440773,kaktus,0.007008760951188986
Calculator_MPI01,79.7941176470588,79.9411764705882,76.6470588235294,38.1176470588235,23.5294117647059,0.4394969869215134,taschenrechner,0.007509386733416771
CandleBurnt_MPI01,90.3529411764706,72.3529411764706,82.7352941176471,32.2647058823529,25.4705882352941,2.114597946555522,kerze,0.003504380475594493
CandleStick_MPI01,93.1470588235294,81.9411764705882,68.4705882352941,39.8235294117647,33.7352941176471,1.8090654807329396,kerzenstaender,0.004755944931163955
Carabiner_Key_MPI01,81.9705882352941,91.4705882352941,79.0294117647059,85.1764705882353,85.8823529411765,2.044589471463986,schluesselbund,0.005256570713391739
CarpetBrush_MPI01,25.0294117647059,29.8529411764706,33.0294117647059,20.0588235294118,15.6764705882353,2.422675468311218,buerste,0.002753441802252816
CarpetCutter_MPI01,91.4117647058823,81.5294117647059,76.2352941176471,40.2058823529412,30.5588235294118,1.72490344142664,cuttermesser,0.0050062578222778474
ClockRectangular_MPI01,78.4705882352941,79.8823529411765,61.4705882352941,43.9705882352941,41.1764705882353,2.203266822684592,uhr,0.003254067584480601
CoatHanger_MPI01,96.1176470588235,94.4411764705882,71.6470588235294,84.6764705882353,81.3823529411765,1.1515489251884214,kleiderbuegel,0.006508135168961202
CoatHanger2_MPI01,98.4411764705882,92.9705882352941,64.5294117647059,79.3823529411765,73.3235294117647,1.7679809850096333,kleiderbuegel,0.005506883604505632
CoatHanger3_MPI01,96.7352941176471,93.7058823529412,70.4117647058823,82.4117647058823,77.7941176470588,1.094877864815888,kleiderbuegel,0.006257822277847309
CoffePot_MPI01,98.3529411764706,93.5588235294118,68.8529411764706,86.5588235294118,79.2352941176471,1.3317743281999121,tasse,0.005757196495619525
Comb_MPI01,96.5294117647059,87.5,70.2352941176471,58.4411764705882,40.8235294117647,0.8931705524970186,kamm,0.007008760951188986
Compass_MPI01,97.5,62.2352941176471,81.7647058823529,8.38235294117647,4.32352941176471,0.19143325481419338,kompass,0.008260325406758449
ConserveCan_MPI01,92.3235294117647,87.1764705882353,61.9705882352941,65.2647058823529,58.4117647058824,2.017989099784711,konservendose,0.004755944931163955
Crayons_MPI01,86.1764705882353,76.4411764705882,62.9117647058824,25.5294117647059,23.8529411764706,3.1445847115159298,wachsmalstifte,0.003504380475594493
CremeDose_MPI01,67.4411764705882,70.2647058823529,31.0588235294118,57.7941176470588,49.7352941176471,3.084353537255216,cremedose,0.003254067584480601
Crown_MPI01,93.3235294117647,51.9117647058824,58.2352941176471,2.23529411764706,1.05882352941176,1.762968180162142,krone,0.004505632040050063
Deodorant_MPI01,43.1470588235294,53.2058823529412,25.7352941176471,43.4117647058824,38.3529411764706,2.366079445682285,deoroller,0.002753441802252816
Deodorant02_MPI01,32.8235294117647,47.6470588235294,28.2352941176471,34.5588235294118,33.2941176470588,3.1083757000539416,deoroller,0.0017521902377972466
Doughnut_MPI01,88.0882352941177,80.7058823529412,51.3529411764706,22.2352941176471,14.5,0.3815804883091629,donut,0.008010012515644555
File_MPI01,68.7352941176471,52.0294117647059,47.1470588235294,17.9705882352941,13.1470588235294,2.4656044744551613,feile,0.003254067584480601
FlatDose_MPI01,38.3235294117647,42.2941176470588,36.3823529411765,23.2647058823529,20.8823529411765,3.708132064658601,zuckerdose,0.0010012515644555694
Giftbox_MPI01,87.7647058823529,74.4117647058823,61.7058823529412,28.1764705882353,24.1176470588235,2.048541884413515,geschenkbox,0.004505632040050063
Grapes_MPI01,94.5882352941177,93.0294117647059,69.5882352941177,65.8823529411765,58.1176470588235,1.272579158344312,weintrauben,0.006257822277847309
Grater_MPI01,79.3235294117647,80.7058823529412,62.7647058823529,62.2647058823529,53.8823529411765,2.649737275711495,reibe,0.002753441802252816
HairBrush_MPI01,91.7647058823529,75.0294117647059,81.0588235294118,44.7941176470588,33.4705882352941,2.5981969192263685,haarbuerste,0.003254067584480601
HairDryeer_MPI01,98.0294117647059,93.5294117647059,82.6176470588235,66.5588235294118,48.9705882352941,0.92979150831574,foen,0.007008760951188986
Hammer_MPI01,92.3529411764706,75.9117647058823,70.6764705882353,32.6470588235294,24.1176470588235,0.6990299627722347,hammer,0.007509386733416771
HandWatch_MPI01,94.2941176470588,88.5294117647059,76.1764705882353,56.1470588235294,44.4117647058824,0.6180038597674269,armbanduhr,0.007509386733416771
HatRibbon_MPI01,98.7647058823529,78.8823529411765,72.5882352941177,27.8823529411765,14.5882352941176,0.3815804883091629,hut,0.008010012515644555
HighHeels_MPI01,98.3529411764706,74.9705882352941,64.8529411764706,22.7352941176471,10.8529411764706,3.426694786471964,damenschuh,0.001501877346683354
JewelryBox_MPI01,58.4705882352941,56.3235294117647,38,36.9411764705882,29.5,3.6034123432601906,box,0.0012515644555694619
KaffeKanne_MPI01,95.8235294117647,86.1764705882353,76.9117647058823,53.5,45.5882352941176,0.5229784263810124,teekanne,0.007509386733416771
Kuli_MPI01,98.2352941176471,97.2058823529412,79.2941176470588,93.4411764705882,89.9117647058823,0.3815804883091629,kugelschreiber,0.008010012515644555
Lemon_MPI01,92.9117647058823,93.7352941176471,62.9411764705882,64.1176470588235,54.9411764705882,0,zitrone,0.00851063829787234
Lighter_MPI01,92.7941176470588,73.4705882352941,73.2352941176471,28.1176470588235,19.9411764705882,1.9224734155316097,feuerzeug,0.004005006257822278
LighterSmall_MPI01,94.2941176470588,87.7941176470588,72.3529411764706,55.2941176470588,45.8235294117647,0.3815804883091629,feuerzeug,0.008010012515644555
LiquidSoap_MPI01,90.5294117647059,88.6176470588235,65.2058823529412,72.6176470588235,73.1470588235294,1.4930089391424453,seifenspender,0.006508135168961202
Mango_MPI01,60.9705882352941,77,59.6176470588235,44.6764705882353,37.8823529411765,1.4674206216078276,mango,0.0050062578222778474
MouseWireless_MPI01,96.6764705882353,94.3235294117647,70.0588235294118,55.6176470588235,52.4117647058824,1.6039757266107144,computermaus,0.0050062578222778474
Orange_MPI01,46.3823529411765,68.4705882352941,37.8235294117647,41.5882352941176,37.4705882352941,2.8934363291449174,orange,0.0022528160200250315
Orange2_MPI01,87.2058823529412,93.6176470588235,59.6176470588235,61.9705882352941,55.5882352941176,1.0174051189440556,orange,0.006758448060075094
PaintPalette_MPI01,92.7058823529412,66.0882352941177,71.7352941176471,10.4411764705882,8.02941176470588,2.705313832636197,farbpalette,0.003254067584480601
PaintPot_MPI01,42.5,50.0882352941176,29.2941176470588,32.7941176470588,29.4117647058824,3.174225083978936,dose,0.0025031289111389237
PalmPlant_MPI01,73.7352941176471,70.3529411764706,65.1176470588235,46.2647058823529,33,2.825878929792072,zimmerpflanze,0.0022528160200250315
Pear_MPI01,96.2941176470588,93.2352941176471,80.4411764705882,60.6470588235294,50.5882352941176,0.19143325481419338,birne,0.008260325406758449
Pen_MPI01,85.1176470588235,88.6176470588235,54.6176470588235,65.4117647058823,57.4705882352941,2.9689947160724754,stift,0.002753441802252816
Pencil_MPI01,97.0588235294118,96.8235294117647,78.0588235294118,81.7352941176471,76.2647058823529,0.5704014994270119,bleistift,0.007759699624530663
Pilers_MPI01,89,62.8823529411765,62,21.8823529411765,18.8823529411765,1.1363238110605183,zange,0.006508135168961202
Pillow_MPI01,99.4705882352941,96.9117647058823,83.3823529411765,93.7352941176471,94.4411764705882,0.9700627520488552,kissen,0.006758448060075094
Pipe_MPI01,87.1470588235294,47.4705882352941,66.8823529411765,5.70588235294118,1.5,1.5681145222320785,pfeife,0.0050062578222778474
Pitcher_MPI01,89.5588235294118,68.6764705882353,62.7352941176471,32.7941176470588,24.6764705882353,3.278313060646517,kanne,0.0017521902377972466
PlantFewLeaf_MPI01,86.7352941176471,77.2941176470588,65.6176470588235,40.3235294117647,30.8235294117647,3.317439033386103,blumenvase,0.0022528160200250315
PlantSnow_MPI01,62.8823529411765,48.9705882352941,62.7058823529412,19.6764705882353,16.8823529411765,4.043855461526302,vase,0.0012515644555694619
Pot_MPI01,87.9117647058823,89.3823529411765,55.4705882352941,87.1470588235294,84.8235294117647,2.1400677626718574,kochtopf--topf,0.003254067584480601
Potato01_MPI01,94.2058823529412,93.3823529411765,78.9117647058823,72.6176470588235,67.2352941176471,0,kartoffel,0.00851063829787234
Potato02_MPI01,65.4705882352941,89.5294117647059,56.8235294117647,69.1764705882353,65.7941176470588,0,kartoffel,0.008260325406758449
ReadingGlass_MPI01,96.6176470588235,90.0588235294118,76.9117647058823,57.4705882352941,41.5294117647059,0.7870046561900534,brille,0.007008760951188986
RubberDucky_MPI01,96.5294117647059,73.4411764705882,76.5,8.73529411764706,5.29411764705882,2.6523455612658915,badeente,0.003003754693366708
SandClock_MPI01,97.0882352941177,74.5,72.9117647058823,15.4117647058824,13.8235294117647,0.3815804883091629,sanduhr,0.008010012515644555
Schuessel_MP01,96.2058823529412,93,42.0882352941176,89.2647058823529,84.0882352941177,1.8810054880546372,schuessel,0.004005006257822278
Scissors_MPI01,97.2647058823529,93.5882352941177,62.4411764705882,77.4117647058823,73.7058823529412,0.5115779700152472,schere,0.007759699624530663
Screwdriver_MPI01,97.1470588235294,90.2058823529412,73.9705882352941,57.9117647058824,45.3235294117647,1.700087840272655,schraubenzieher,0.004755944931163955
Shampoo_Big_MPI01,53.8823529411765,62.6764705882353,18.3529411764706,52.5294117647059,47.5,2.8375675574784514,flasche,0.003254067584480601
Shampoo_Round_MPI01,57.2058823529412,56.5588235294118,15.1764705882353,46.1764705882353,40.7941176470588,2.8962769185584962,flasche,0.002753441802252816
Shampoo_Shouldered_MPI01,52.6176470588235,60.8235294117647,20.6176470588235,54.7941176470588,45.3235294117647,3.064712510647918,flasche,0.0022528160200250315
ShoppingBagBig_MPI01,92.7647058823529,83.6176470588235,62.1764705882353,54.9117647058824,47.2647058823529,3.2112731370791376,papiertuete,0.0022528160200250315
ShoppingBagSmall_MPI01,81.2352941176471,73.2941176470588,47.3823529411765,48.7058823529412,41.8235294117647,3.0179399385868573,tragetasche,0.0017521902377972466
Shovel_MPI01,84.0588235294118,67.8235294117647,49.0294117647059,42.0882352941176,32.0294117647059,2.959283958535007,schaufel,0.002753441802252816
ShowerGel_MPI01,54.2352941176471,64.5588235294118,34.1764705882353,62.5294117647059,61.2058823529412,2.921192131632841,duschgel,0.002002503128911139
Slippers_MPI01,94.7352941176471,82.7941176470588,64.7647058823529,46.6176470588235,34.4705882352941,2.7862347293850673,badelatschen,0.00425531914893617
Slippers2_MPI01,98.3529411764706,91.9117647058823,72.2647058823529,63.7352941176471,46.0588235294118,0.8931705524970186,flipflop,0.007008760951188986
Soap_MPI01,40.6470588235294,69.3823529411765,26.2941176470588,55.4705882352941,52.8823529411765,1.8083754124466325,seife,0.0050062578222778474
SoapBottle_MPI01,88.5,88.0294117647059,59.8235294117647,76.2941176470588,75.3235294117647,2.256913844828164,seifenspender,0.005256570713391739
SprayBottle_MPI01,90.4411764705882,83.2058823529412,59.1470588235294,57.1176470588235,47.0588235294118,1.831002453015687,spruehflasche,0.005757196495619525
SprayCan_MPI01,86.6470588235294,71.2058823529412,55.5294117647059,33.1176470588235,23.9117647058824,2.098553754697938,spraydose,0.0037546933667083854
Stapler_MPI01,97.4117647058823,89.4117647058823,78.7352941176471,54.7058823529412,43.6470588235294,0.7483265504380477,tacker,0.006758448060075094
TalcPowder_Shouldered_MPI01,51.4411764705882,54.9117647058824,22.5294117647059,38.5588235294118,34.1176470588235,3.71508495181978,flasche--plastikflasche,0.0012515644555694619
TalcPowder_Sqr_MPI01,51.6764705882353,55.2058823529412,23.4117647058824,37.4705882352941,33.8235294117647,3.522993986280504,flasche,0.0017521902377972466
TapeDispenser_MPI01,97.5882352941177,90.8529411764706,80.1470588235294,66,56.6764705882353,3.4206677099839538,klebeband,0.0017521902377972466
Tasse_MPI01,97.8529411764706,96.4705882352941,62.4411764705882,95.0588235294118,93.2941176470588,0.7578534921839994,tasse,0.007509386733416771
TennisBall_MPI01,99.3235294117647,75.6176470588235,70.8235294117647,11.7352941176471,6.35294117647059,0,tennisball,0.008260325406758449
TGel_MPI01,60.2941176470588,66.4117647058823,18,60.2647058823529,51.6176470588235,3.578555923608793,flasche,0.0017521902377972466
Tomatoo_MPI01,93.0294117647059,91.3823529411765,61.1470588235294,78.3235294117647,74.1470588235294,0,tomate,0.00851063829787234
Toothbrush_MPI01,99.6764705882353,99.5,81.3235294117647,93.5882352941177,94.4705882352941,0.5115779700152472,zahnbuerste,0.007759699624530663
ToothPaste_MPI01,70.5588235294118,78.8823529411765,45,74.7058823529412,71.7941176470588,2.5171186521991302,tube,0.0025031289111389237
ToyArmchair_MPI01,96.7647058823529,90.4411764705882,59.7647058823529,61.6764705882353,55.7647058823529,0.7578534921839994,sessel,0.007509386733416771
ToyBalloon_MPI01,96.6470588235294,89.9705882352941,54,21.5588235294118,14.3823529411765,1.1988912920836219,luftballon,0.006508135168961202
ToyLadder_MPI01,90.1470588235294,81.5294117647059,60.5294117647059,35.7352941176471,27.7352941176471,1.51241284143745,leiter,0.005757196495619525
ToyPlane_MPI01,92.4705882352941,62.0588235294118,72.9411764705882,8.55882352941176,2.94117647058824,2.59126385880102,spielzeugflugzeug,0.0025031289111389237
ToyRefrigirator_MPI01,89.0294117647059,90.5588235294118,57,89.0294117647059,90.8235294117647,0.9886150377275047,kuehlschrank,0.007008760951188986
ToyTrain_MP01,95.5588235294118,74.7058823529412,84.8529411764706,9.52941176470588,3.20588235294118,2.6961990498148554,holzeisenbahn,0.003504380475594493
Toytruck_MPI01,91.8235294117647,67.2647058823529,65.4705882352941,9.70588235294118,3.52941176470588,3.536608254391499,spielzeuglkw,0.0025031289111389237
Tube_HandCreme_MPI01,70.4117647058823,79.7941176470588,34.2647058823529,74.9705882352941,64.0294117647059,2.647625977626525,tube,0.003504380475594493
Tube_Lrg_MPI01,73.2941176470588,75.2941176470588,32.3529411764706,72.8823529411765,68.7352941176471,1.9987450796642219,tube,0.00425531914893617
Tube_Ointment_MPI01,66.2352941176471,81.4411764705882,24.7058823529412,81.4117647058823,73.6176470588235,2.2545139227249,tube,0.004755944931163955
Tube_Thin_MPI01,67.7647058823529,78.0882352941177,25.2647058823529,74.1176470588235,70.3823529411765,2.455496126507523,tube,0.00425531914893617
Tube_Toothpaste_MPI01_MPI01,72,81.5,32.6764705882353,78.5294117647059,69.7647058823529,2.8190726546477487,tube,0.003254067584480601
TubeUsed_MPI01_MPI01,66.5294117647059,71.6176470588235,27.8235294117647,70.2941176470588,67.0882352941177,2.5589645644232903,tube,0.0037546933667083854
USBStick_MPI01,96.4411764705882,93.9705882352941,78.5588235294118,73.5294117647059,64.5,0.5704014994270119,usbstick,0.007759699624530663
Wage_MPI01,78.2352941176471,75.5588235294118,60.4117647058824,46.6176470588235,38,1.5657884369502348,kuechenwaage,0.006007509386733416
WaterBottleAlu_MPI01,86.6764705882353,76.6176470588235,62.4411764705882,45.5882352941176,41.9117647058824,2.679945131143149,trinkflasche,0.00425531914893617
WaterGlass_MPI01,68.0882352941177,80.9705882352941,46.4705882352941,82.8823529411765,82.9117647058823,1.4791951659115412,glas,0.005757196495619525
Webcam_MPI01,87.4705882352941,64.2058823529412,66.1176470588235,19.4411764705882,12.6470588235294,2.0331008896976694,webcam,0.005256570713391739
WineBottle2_MPI01,88.3823529411765,80.1176470588235,53.9705882352941,48.5882352941176,38.2647058823529,2.6281836841867765,sektflasche,0.003254067584480601
WineBottle3_MPI01,76.2058823529412,69.6470588235294,46.2058823529412,41.5882352941176,33.5588235294118,2.7892579739733505,flasche,0.003003754693366708
WineBottle4_MPI01,91.9117647058823,81.6176470588235,54.3823529411765,57.5294117647059,40.3823529411765,1.5346985024423623,weinflasche,0.006007509386733416
Wrench_MPI01,96.3235294117647,76.5588235294118,66.5,41,27.3235294117647,2.4464124990649547,schraubenschluessel,0.003003754693366708
