"Object","Recognizability","Familiarity","Details","Contact","Usage"
"AlarmClock_MPI01",97.8,95.72,91,68.72,63.6
"Apple_MPI01",92,94.96,82.6,87.6,87.04
"Apple02_MPI01",97.24,99.28,85,90,86.32
"BackSponge_MPI01",43,36.92,32.48,20.84,14.24
"Banana_MPI01",97.84,98.32,79.36,76.24,66.32
"BierGlas_MPI01",95.64,85.4,67.36,41.4,33.84
"BigFork_MPI01",95.2,93.76,75.72,85.32,77.88
"BigSpoon_MPI01",84.84,89.48,67.68,79.68,72.6
"BodyCremePot_MPI01",90.56,89.72,53.2,87,72.12
"Book_MPI01",96.04,96.24,58,95.44,86.44
"BottleOpener_MPI01",97.88,96.08,78.84,85.28,68.56
"Bread_MPI01",96.12,99.12,72.36,91.56,88.52
"BreadBasket_MPI01",68.24,77.64,53.2,60.4,52.52
"BreadCutMachine_MPI01",95.36,88.08,85.48,49.24,44.16
"Cactus_MPI01",89.16,80.72,59.6,37.92,26.08
"Calculator_MPI01",83,82.96,71.16,72.52,60.08
"CandleBurnt_MPI01",96.12,86.92,87.12,47.84,40
"CandleStick_MPI01",96.2,94.72,80.36,68.96,55.6
"Carabiner_Key_MPI01",84.8,96.08,75.64,95.08,95.56
"CarpetBrush_MPI01",40.4,41.68,38.88,30.8,29.24
"CarpetCutter_MPI01",82.44,77.8,81.36,46.44,35.08
"ClockRectangular_MPI01",70.12,79.96,39.44,74.96,72.16
"CoatHanger_MPI01",98.36,98.56,78.24,97.72,97.44
"CoatHanger2_MPI01",96.76,95.48,78.36,83.12,80.8
"CoatHanger3_MPI01",95.88,96.24,79.64,95.96,94.72
"CoffePot_MPI01",97.72,97.64,72.96,97.88,96.68
"Comb_MPI01",93.16,96.88,77.88,90.08,79.24
"Compass_MPI01",87.96,72.96,78.72,17.16,8.4
"ConserveCan_MPI01",93.76,93.6,68.4,73.12,52.84
"Crayons_MPI01",88.44,78.24,69.52,39.8,25.44
"CremeDose_MPI01",83.08,89.2,56.24,81.96,74
"Crown_MPI01",91.12,50.72,62.32,4.36,1.12
"Deodorant_MPI01",22.12,24.12,14.16,21.4,19.28
"Deodorant02_MPI01",23.16,16.64,18.2,12.04,9.8
"Doughnut_MPI01",83.8,67.52,60.96,10.76,7.72
"File_MPI01",74.4,75.36,59.32,42.36,27.8
"FlatDose_MPI01",52.84,64.12,38.92,44.76,42.48
"Giftbox_MPI01",92.12,88.96,74.2,48.08,38.4
"Grapes_MPI01",92.28,95.6,81.48,73.24,70
"Grater_MPI01",81.96,94,69.32,77.68,61.44
"HairBrush_MPI01",89.32,84.64,73.96,68.6,53.92
"HairDryeer_MPI01",95.12,96.76,80.4,81.72,61.52
"Hammer_MPI01",94.64,89.44,64.6,47.32,40.12
"HandWatch_MPI01",95.36,95.4,77.04,85.44,78.88
"HatRibbon_MPI01",96.52,86.32,75.96,28.92,17.2
"HighHeels_MPI01",96.6,88.24,82.88,47.68,21.2
"JewelryBox_MPI01",77.12,77.28,39.8,54.32,46.32
"KaffeKanne_MPI01",97.04,93.56,75,78.24,71.12
"Kuli_MPI01",93.44,97.28,75.32,96.24,93.52
"Lemon_MPI01",92.72,97.72,66.4,82.24,77.28
"Lighter_MPI01",67.76,55.48,57.48,22.2,18.96
"LighterSmall_MPI01",80.96,76.44,67.8,28.36,25.2
"LiquidSoap_MPI01",93.32,87.12,65.44,71.8,65.92
"Mango_MPI01",64.72,67.24,47.92,44.16,44.12
"MouseWireless_MPI01",92,92.24,68.2,80.68,78.52
"Orange_MPI01",68.28,86.76,41.72,58.4,55.56
"Orange2_MPI01",90.72,95.84,70.04,74.8,73.28
"PaintPalette_MPI01",92.44,62.48,81.68,6.6,4.84
"PaintPot_MPI01",70.48,76.2,42,64.6,58.84
"PalmPlant_MPI01",77.2,81.52,58.2,50.36,44.32
"Pear_MPI01",97.04,96.76,77.44,68.96,62.76
"Pen_MPI01",87.92,86.48,61.28,69.64,57.96
"Pencil_MPI01",95.56,96.6,81.32,86,75.24
"Pilers_MPI01",89.12,83.36,70.6,52.16,36.76
"Pillow_MPI01",95.84,96.88,73.52,96,88.04
"Pipe_MPI01",86.6,63.2,58.96,2.24,1.92
"Pitcher_MPI01",90.52,87.96,71.92,51.92,40.84
"PlantFewLeaf_MPI01",94.96,96,71.32,78.44,70
"PlantSnow_MPI01",87.12,89.12,60.36,58.68,51.16
"Pot_MPI01",86.56,87.6,51.88,83.76,76.48
"Potato01_MPI01",97.32,99.2,86.6,94.84,91
"Potato02_MPI01",78.68,94.6,61.6,90.72,81.64
"ReadingGlass_MPI01",97.76,99.64,90.72,99.16,99.6
"RubberDucky_MPI01",97.72,86.52,76.12,23.68,6.48
"SandClock_MPI01",93.44,87.72,82.4,42.72,37.48
"Schuessel_MP01",95.6,95.64,54.2,90.88,86.08
"Scissors_MPI01",96.28,97.68,71.72,91.28,89
"Screwdriver_MPI01",96.24,92.96,82.84,80.88,75.2
"Shampoo_Big_MPI01",81.4,83.08,31.68,69.52,57.92
"Shampoo_Round_MPI01",68.2,75.24,35.36,65.4,58.56
"Shampoo_Shouldered_MPI01",89.16,82.84,46.68,78.12,73.32
"ShoppingBagBig_MPI01",94.96,93.08,62.12,63.2,52.88
"ShoppingBagSmall_MPI01",92.2,83.44,60.6,54.44,45.2
"Shovel_MPI01",90.8,81.56,51.52,50.08,43.16
"ShowerGel_MPI01",57.2,62.72,34.28,56.68,57
"Slippers_MPI01",94.92,90.04,73.32,75.88,67.04
"Slippers2_MPI01",97.84,90.76,72.56,56.16,44.32
"Soap_MPI01",51.36,59.56,36.12,52.24,50.12
"SoapBottle_MPI01",89.52,90.76,74.32,76.68,72.24
"SprayBottle_MPI01",97.6,91.88,76.68,79.68,64.16
"SprayCan_MPI01",92,85.92,68.52,58.56,52.76
"Stapler_MPI01",97.68,97.76,87.88,69.48,62.8
"TalcPowder_Shouldered_MPI01",77.16,80.12,36.64,67.68,58.12
"TalcPowder_Sqr_MPI01",85,81.88,35.52,66,59
"TapeDispenser_MPI01",95.68,96.4,85.2,87.92,79.44
"Tasse_MPI01",97.6,98.16,77.96,98.72,98.32
"TennisBall_MPI01",92.08,82.28,76.84,15.92,11.08
"TGel_MPI01",85.08,85.64,44.96,75.72,65.16
"Tomatoo_MPI01",90.96,98.24,65.84,88.92,85.12
"Toothbrush_MPI01",97.68,98.96,86.88,98.88,98.96
"ToothPaste_MPI01",92.24,93.6,50.8,89.88,88.24
"ToyArmchair_MPI01",96.92,95.2,66.2,93.88,91.48
"ToyBalloon_MPI01",91.72,89.92,74.08,21.56,12.96
"ToyLadder_MPI01",94.24,93.52,69.32,70.92,54.24
"ToyPlane_MPI01",91.88,72.4,75.2,8.88,4.72
"ToyRefrigirator_MPI01",80.96,99.12,56.56,99.04,98.2
"ToyTrain_MP01",95.88,87.32,88.76,10.52,6.28
"Toytruck_MPI01",95.36,83.92,66.08,13.52,5.4
"Tube_HandCreme_MPI01",90.84,85.76,52.52,84.4,80.16
"Tube_Lrg_MPI01",88.04,91.4,49.52,89.96,87.44
"Tube_Ointment_MPI01",89.44,93.44,46.6,91.64,89.2
"Tube_Thin_MPI01",90,90.76,48.64,90.92,89.2
"Tube_Toothpaste_MPI01_MPI01",88.04,91.4,45.72,87.44,83.88
"TubeUsed_MPI01_MPI01",83.72,87.32,50.36,87.72,84.08
"USBStick_MPI01",85.76,85.68,71.68,58.12,53.76
"Wage_MPI01",58.24,63.24,39.84,50.8,38.64
"WaterBottleAlu_MPI01",90.24,84.12,62.72,61.96,51.64
"WaterGlass_MPI01",77.36,88.76,44.4,88.88,89.48
"Webcam_MPI01",58.96,48.64,53.76,26.16,21.48
"WineBottle2_MPI01",93.56,93.32,62.64,79.48,70.76
"WineBottle3_MPI01",90.4,80.72,48.8,64.16,54.44
"WineBottle4_MPI01",91.92,93.28,61.36,75.08,64.16
"Wrench_MPI01",96.6,89.32,79.2,56.2,42.2
