id t x y z vx vy vz xi yi zi vxi vyi vzi FGrav FDrag FSol FTide
239427  0.0000E+00  1.0319E+03 -8.0859E+02 -8.3846E+02 -0.0000E+00 -0.0000E+00  0.0000E+00  1.0319E+03 -8.0859E+02 -8.3846E+02  1.1692E-01  1.4921E-01  0.0000E+00  2.7211E-05  5.6442E-06  1.2973E-08  3.8745E-12
239494  0.0000E+00  2.0820E+03 -1.0840E+03 -3.9999E+02 -0.0000E+00  0.0000E+00 -0.0000E+00  2.0820E+03 -1.0840E+03 -3.9999E+02  1.5674E-01  3.0103E-01 -0.0000E+00  2.8393E-05  1.4684E-07  1.2973E-08  7.3354E-12
