id t x y z vx vy vz xi yi zi vxi vyi vzi FGrav FDrag FSol FTide
415001  0.0000E+00 -2.7976E+02  5.0911E+02 -1.4154E+03 -0.0000E+00 -0.0000E+00 -0.0000E+00 -2.7976E+02  5.0911E+02 -1.4154E+03 -7.3612E-02 -4.0451E-02  0.0000E+00  9.8346E-10  1.3226E-09  1.2972E-11  1.3069E-16
415007  0.0000E+00 -2.7790E+02  5.1420E+02 -1.4232E+03 -0.0000E+00 -0.0000E+00 -0.0000E+00 -2.7790E+02  5.1420E+02 -1.4232E+03 -7.4349E-02 -4.0182E-02  0.0000E+00  9.8346E-10  2.4492E-09  1.2972E-11  1.3119E-16
415007  6.0042E+02 -3.2341E+02  4.8130E+02 -1.3819E+03 -9.8099E-02 -8.5931E-02  1.4176E-01 -3.6392E+02  4.5145E+02 -1.3819E+03 -1.6769E-01 -1.3269E-01  1.4176E-01  9.9617E-10  3.0529E-10  1.2972E-11  1.3403E-16
415011  0.0000E+00 -9.2223E+01  6.7409E+02 -1.5007E+03 -0.0000E+00  0.0000E+00 -0.0000E+00 -9.2223E+01  6.7409E+02 -1.5007E+03 -9.7467E-02 -1.3335E-02  0.0000E+00  9.6380E-10  1.0434E-09  1.2972E-11  1.3000E-16
415028  0.0000E+00 -3.5744E+02  5.7898E+02 -1.3512E+03 -0.0000E+00  0.0000E+00 -0.0000E+00 -3.5744E+02  5.7898E+02 -1.3512E+03 -8.3715E-02 -5.1682E-02  0.0000E+00  9.9895E-10  1.8579E-09  1.2972E-11  1.3014E-16
415028  6.0072E+02 -3.9609E+02  5.5810E+02 -1.3362E+03 -9.0533E-02 -6.1016E-02  7.4068E-02 -4.4301E+02  5.2164E+02 -1.3362E+03 -1.7123E-01 -1.1829E-01  7.4068E-02  9.9787E-10  1.1575E-09  1.2972E-11  1.3541E-16
415029  0.0000E+00 -3.3938E+02  5.6116E+02 -1.3714E+03 -0.0000E+00  0.0000E+00 -0.0000E+00 -3.3938E+02  5.6116E+02 -1.3714E+03 -8.1139E-02 -4.9071E-02  0.0000E+00  9.9303E-10  1.6859E-09  1.2972E-11  1.3064E-16
415029  6.1782E+02 -3.7969E+02  5.3877E+02 -1.3706E+03 -1.1334E-01 -6.8126E-02  2.3046E-02 -4.2624E+02  5.0275E+02 -1.3706E+03 -1.9124E-01 -1.2303E-01  2.3046E-02  9.7953E-10  8.2206E-10  1.2972E-11  1.3710E-16
415029  1.2135E+03 -4.6009E+02  4.8643E+02 -1.3369E+03 -1.5568E-01 -9.9444E-02  7.4202E-02 -5.3793E+02  3.9865E+02 -1.3369E+03 -2.2602E-01 -1.6597E-01  7.4202E-02  9.8133E-10  1.4736E-09  1.2972E-11  1.4540E-16
415029  1.8098E+03 -5.7839E+02  4.1708E+02 -1.2782E+03 -2.1900E-01 -1.3169E-01  1.4510E-01 -6.6660E+02  2.5324E+02 -1.2782E+03 -2.7931E-01 -2.1532E-01  1.4510E-01  9.8047E-10  2.5608E-10  1.2972E-11  1.5729E-16
415040  0.0000E+00 -4.7870E+02  5.7601E+02 -1.2521E+03 -0.0000E+00 -0.0000E+00 -0.0000E+00 -4.7870E+02  5.7601E+02 -1.2521E+03 -8.3287E-02 -6.9216E-02  0.0000E+00  1.0045E-09  2.6436E-09  1.2972E-11  1.3106E-16
415040  6.0944E+02 -5.4770E+02  5.3728E+02 -1.2509E+03 -1.8928E-01 -1.1783E-01  4.0146E-02 -5.9286E+02  4.8700E+02 -1.2509E+03 -2.6697E-01 -1.9703E-01  4.0146E-02  9.8349E-10  9.7486E-10  1.2972E-11  1.4179E-16
415040  1.2009E+03 -6.7223E+02  4.5553E+02 -1.1953E+03 -2.1866E-01 -1.5114E-01  1.4959E-01 -7.4082E+02  3.3254E+02 -1.1953E+03 -2.8452E-01 -2.4833E-01  1.4959E-01  1.0051E-09  1.8063E-10  1.2972E-11  1.5604E-16
415043  0.0000E+00 -4.5343E+02  5.6987E+02 -1.2836E+03 -0.0000E+00 -0.0000E+00 -0.0000E+00 -4.5343E+02  5.6987E+02 -1.2836E+03 -8.2398E-02 -6.5562E-02  0.0000E+00  1.0025E-09  4.0487E-09  1.2972E-11  1.3162E-16
415043  6.0241E+02 -5.4843E+02  5.3937E+02 -1.3113E+03 -2.5355E-01 -8.1404E-02 -5.4346E-02 -5.9328E+02  4.8962E+02 -1.3113E+03 -3.3154E-01 -1.6070E-01 -5.4346E-02  9.4657E-10  1.1962E-09  1.2972E-11  1.4647E-16
415043  1.2047E+03 -7.2246E+02  4.8592E+02 -1.3237E+03 -3.0776E-01 -8.9676E-02  2.0655E-02 -7.9574E+02  3.5336E+02 -1.3237E+03 -3.7802E-01 -1.9414E-01  2.0655E-02  8.9137E-10  3.2539E-10  1.2972E-11  1.7070E-16
415043  1.8039E+03 -9.0862E+02  4.3583E+02 -1.2841E+03 -3.0889E-01 -7.5977E-02  1.1202E-01 -9.9028E+02  1.8678E+02 -1.2841E+03 -3.7191E-01 -2.0735E-01  1.1202E-01  8.4876E-10  1.7813E-10  1.2972E-11  1.9540E-16
415043  2.4044E+03 -1.0889E+03  3.9563E+02 -1.1895E+03 -2.8869E-01 -5.8269E-02  2.0226E-01 -1.1586E+03  9.7967E-01 -1.1895E+03 -3.4590E-01 -2.1572E-01  2.0226E-01  8.4238E-10  9.2980E-11  1.2972E-11  2.1744E-16
415043  3.0195E+03 -1.2555E+03  3.6416E+02 -1.0380E+03 -2.5021E-01 -4.5856E-02  2.8908E-01 -1.2917E+03 -2.0090E+02 -1.0380E+03 -3.0287E-01 -2.2739E-01  2.8908E-01  8.4134E-10  5.1127E-11  1.2972E-11  2.3516E-16
415043  3.6132E+03 -1.3898E+03  3.3756E+02 -8.4352E+02 -2.0004E-01 -4.5871E-02  3.6438E-01 -1.3728E+03 -4.0095E+02 -8.4352E+02 -2.4885E-01 -2.4682E-01  3.6438E-01  8.7971E-10  2.9178E-11  1.2972E-11  2.4618E-16
415043  4.2055E+03 -1.4908E+03  3.0674E+02 -6.0803E+02 -1.3966E-01 -6.0907E-02  4.2866E-01 -1.3988E+03 -5.9994E+02 -6.0803E+02 -1.8402E-01 -2.7647E-01  4.2866E-01  8.9543E-10  1.4562E-11  1.2972E-11  2.5019E-16
415043  4.8062E+03 -1.5549E+03  2.6122E+02 -3.3428E+02 -7.3332E-02 -9.3711E-02  4.8053E-01 -1.3616E+03 -7.9504E+02 -3.3428E+02 -1.1110E-01 -3.1854E-01  4.8053E-01  9.2587E-10  7.3533E-12  1.2972E-11  2.4643E-16
415045  0.0000E+00 -4.7313E+02  5.5867E+02 -1.2562E+03 -0.0000E+00  0.0000E+00 -0.0000E+00 -4.7313E+02  5.5867E+02 -1.2562E+03 -8.0779E-02 -6.8410E-02  0.0000E+00  1.0045E-09  1.7322E-09  1.2972E-11  1.3107E-16
415045  6.0499E+02 -5.0998E+02  5.1645E+02 -1.2391E+03 -1.0497E-01 -1.1407E-01  8.8188E-02 -5.5315E+02  4.6992E+02 -1.2391E+03 -1.7964E-01 -1.8781E-01  8.8188E-02  1.0117E-09  5.8237E-10  1.2972E-11  1.3761E-16
415046  0.0000E+00 -4.5943E+02  5.6418E+02 -1.2697E+03 -0.0000E+00 -0.0000E+00 -0.0000E+00 -4.5943E+02  5.6418E+02 -1.2697E+03 -8.1576E-02 -6.6430E-02  0.0000E+00  9.9850E-10  2.9948E-09  1.2972E-11  1.3102E-16
415046  6.0902E+02 -5.2987E+02  5.2062E+02 -1.2716E+03 -2.0224E-01 -1.2157E-01  2.3470E-02 -5.7360E+02  4.7201E+02 -1.2716E+03 -2.7752E-01 -1.9818E-01  2.3470E-02  9.8993E-10  1.0872E-09  1.2972E-11  1.4193E-16
415046  1.2079E+03 -6.6633E+02  4.3631E+02 -1.2253E+03 -2.3927E-01 -1.5225E-01  1.3212E-01 -7.3201E+02  3.1389E+02 -1.2253E+03 -3.0235E-01 -2.4860E-01  1.3212E-01  9.8382E-10  2.3166E-10  1.2972E-11  1.5796E-16
415061  0.0000E+00 -5.9622E+01  7.3332E+02 -1.5270E+03 -0.0000E+00 -0.0000E+00 -0.0000E+00 -5.9622E+01  7.3332E+02 -1.5270E+03 -1.0603E-01 -8.6208E-03  0.0000E+00  9.4082E-10  2.7244E-09  1.2972E-11  1.3229E-16
415061  6.1093E+02 -1.3385E+02  7.3145E+02 -1.5360E+03 -2.0449E-01  8.2907E-03  1.4627E-03 -1.9786E+02  7.1679E+02 -1.5360E+03 -3.1025E-01 -1.1063E-02  1.4627E-03  9.2305E-10  9.2853E-10  1.2972E-11  1.3706E-16
415061  1.2168E+03 -2.7251E+02  7.4515E+02 -1.5069E+03 -2.3610E-01  3.5717E-02  9.6779E-02 -3.9873E+02  6.8595E+02 -1.5069E+03 -3.4384E-01 -3.6857E-03  9.6779E-02  8.8409E-10  2.0969E-10  1.2972E-11  1.4511E-16
415061  1.8040E+03 -4.0686E+02  7.7247E+02 -1.4256E+03 -2.2227E-01  5.7694E-02  1.7320E-01 -5.9231E+02  6.4142E+02 -1.4256E+03 -3.3397E-01 -1.1333E-03  1.7320E-01  8.5675E-10  4.2915E-10  1.2972E-11  1.5315E-16
415061  2.4149E+03 -5.4205E+02  8.1267E+02 -1.2969E+03 -2.1773E-01  7.0684E-02  2.5033E-01 -7.8737E+02  5.7819E+02 -1.2969E+03 -3.3523E-01 -7.6914E-03  2.5033E-01  8.8801E-10  3.4531E-10  1.2972E-11  1.6204E-16
415061  3.0112E+03 -6.6632E+02  8.5637E+02 -1.1236E+03 -1.9395E-01  7.3239E-02  3.3380E-01 -9.6534E+02  4.9545E+02 -1.1236E+03 -3.1777E-01 -2.3106E-02  3.3380E-01  9.0662E-10  1.7264E-10  1.2972E-11  1.7038E-16
415061  3.6063E+03 -7.6552E+02  8.9407E+02 -8.9895E+02 -1.3580E-01  4.9083E-02  4.1870E-01 -1.1091E+03  3.9392E+02 -8.9895E+02 -2.6508E-01 -6.1604E-02  4.1870E-01  9.1881E-10  3.5012E-11  1.2972E-11  1.7562E-16
415061  4.2057E+03 -8.2622E+02  9.0985E+02 -6.2621E+02 -6.5739E-02 -8.5856E-04  4.8940E-01 -1.1979E+03  2.7471E+02 -6.2621E+02 -1.9730E-01 -1.2032E-01  4.8940E-01  9.9119E-10  3.0917E-12  1.2972E-11  1.7534E-16
415063  0.0000E+00 -5.2355E+02  7.3284E+02 -1.1611E+03 -0.0000E+00  0.0000E+00 -0.0000E+00 -5.2355E+02  7.3284E+02 -1.1611E+03 -1.0596E-01 -7.5700E-02  0.0000E+00  1.0102E-09  1.2209E-09  1.2972E-11  1.2744E-16
415063  6.0396E+02 -5.5053E+02  7.2712E+02 -1.1613E+03 -1.0293E-01 -1.4813E-02 -8.6400E-03 -6.1185E+02  6.7634E+02 -1.1613E+03 -2.0807E-01 -9.4415E-02 -8.6400E-03  9.9575E-10  1.6146E-09  1.2972E-11  1.3457E-16
415063  1.2149E+03 -6.4786E+02  7.1358E+02 -1.1556E+03 -1.9274E-01 -2.9817E-02  4.5009E-02 -7.6260E+02  5.8937E+02 -1.1556E+03 -2.9592E-01 -1.2349E-01  4.5009E-02  9.3069E-10  6.1018E-10  1.2972E-11  1.4909E-16
415063  1.8091E+03 -7.6383E+02  6.9151E+02 -1.1007E+03 -1.8941E-01 -4.4835E-02  1.4059E-01 -9.1668E+02  4.7045E+02 -1.1007E+03 -2.8939E-01 -1.5528E-01  1.4059E-01  9.3286E-10  2.0474E-10  1.2972E-11  1.6411E-16
415063  2.4069E+03 -8.6805E+02  6.5865E+02 -9.8854E+02 -1.5579E-01 -6.6802E-02  2.3363E-01 -1.0406E+03  3.2312E+02 -9.8854E+02 -2.5103E-01 -1.9231E-01  2.3363E-01  9.4643E-10  7.5110E-11  1.2972E-11  1.7567E-16
415063  3.0071E+03 -9.4722E+02  6.0859E+02 -8.2227E+02 -1.0671E-01 -1.0268E-01  3.1962E-01 -1.1154E+03  1.5296E+02 -8.2227E+02 -1.9471E-01 -2.3964E-01  3.1962E-01  1.0099E-09  1.1732E-11  1.2972E-11  1.8149E-16
415075  0.0000E+00 -9.3792E+00  7.6546E+02 -1.5829E+03 -0.0000E+00 -0.0000E+00 -0.0000E+00 -9.3792E+00  7.6546E+02 -1.5829E+03 -1.1068E-01 -1.3562E-03  0.0000E+00  8.9616E-10  3.1452E-09  1.2972E-11  1.3627E-16
415075  6.1114E+02 -5.4934E+01  7.5759E+02 -1.6418E+03 -1.2046E-01 -8.3073E-03 -1.5403E-01 -1.2158E+02  7.4979E+02 -1.6418E+03 -2.3000E-01 -1.6250E-02 -1.5403E-01  8.1423E-10  1.1131E-09  1.2972E-11  1.4304E-16
415075  1.2020E+03 -1.4113E+02  7.5720E+02 -1.7360E+03 -1.6478E-01  7.9422E-03 -1.5265E-01 -2.6994E+02  7.2139E+02 -1.7360E+03 -2.7427E-01 -1.2464E-02 -1.5265E-01  7.1986E-10  5.1822E-10  1.2972E-11  1.5625E-16
415075  1.8292E+03 -2.5017E+02  7.6901E+02 -1.8189E+03 -1.8019E-01  2.9453E-02 -1.0951E-01 -4.4250E+02  6.7687E+02 -1.8189E+03 -2.9138E-01 -6.7189E-03 -1.0951E-01  6.4178E-10  3.3829E-10  1.2972E-11  1.7309E-16
415075  2.4324E+03 -3.5982E+02  7.9367E+02 -1.8703E+03 -1.8167E-01  5.2534E-02 -6.0735E-02 -6.1121E+02  6.2113E+02 -1.8703E+03 -2.9643E-01  5.0690E-04 -6.0735E-02  6.0891E-10  2.2686E-10  1.2972E-11  1.9027E-16
415075  3.0179E+03 -4.6438E+02  8.3119E+02 -1.8918E+03 -1.7470E-01  7.5371E-02 -1.2997E-02 -7.7216E+02  5.5703E+02 -1.8918E+03 -2.9488E-01  8.2263E-03 -1.2997E-02  5.7102E-10  2.0651E-10  1.2972E-11  2.0689E-16
415075  3.6144E+03 -5.6452E+02  8.8254E+02 -1.8845E+03 -1.5954E-01  9.6372E-02  3.7636E-02 -9.2969E+02  4.8296E+02 -1.8845E+03 -2.8715E-01  1.4747E-02  3.7636E-02  5.4856E-10  1.5897E-10  1.2972E-11  2.2308E-16
415075  4.2301E+03 -6.5662E+02  9.4765E+02 -1.8456E+03 -1.3864E-01  1.1430E-01  8.8866E-02 -1.0817E+03  3.9881E+02 -1.8456E+03 -2.7566E-01  1.9359E-02  8.8866E-02  5.3077E-10  1.4563E-10  1.2972E-11  2.3826E-16
415075  4.8443E+03 -7.3433E+02  1.0220E+03 -1.7757E+03 -1.1363E-01  1.2680E-01  1.3885E-01 -1.2202E+03  3.0807E+02 -1.7757E+03 -2.6140E-01  2.0618E-02  1.3885E-01  5.4252E-10  1.4363E-10  1.2972E-11  2.5141E-16
415075  5.4387E+03 -7.9348E+02  1.0994E+03 -1.6785E+03 -8.4695E-02  1.3223E-01  1.8830E-01 -1.3387E+03  2.1502E+02 -1.6785E+03 -2.4366E-01  1.7501E-02  1.8830E-01  5.4476E-10  1.2202E-10  1.2972E-11  2.6175E-16
415075  6.0069E+03 -8.3290E+02  1.1741E+03 -1.5578E+03 -5.3728E-02  1.2901E-01  2.3657E-01 -1.4343E+03  1.2254E+02 -1.5578E+03 -2.2349E-01  8.5772E-03  2.3657E-01  5.5901E-10  9.5231E-11  1.2972E-11  2.6887E-16
415075  6.6369E+03 -8.5494E+02  1.2512E+03 -1.3915E+03 -1.5864E-02  1.1335E-01  2.9186E-01 -1.5153E+03  1.7777E+01 -1.3915E+03 -1.9677E-01 -1.0271E-02  2.9186E-01  5.9456E-10  6.8580E-11  1.2972E-11  2.7287E-16
415075  7.2050E+03 -8.5344E+02  1.3083E+03 -1.2114E+03  2.1632E-02  8.5336E-02  3.4227E-01 -1.5602E+03 -7.6484E+01 -1.2114E+03 -1.6754E-01 -3.8064E-02  3.4227E-01  6.3303E-10  3.4728E-11  1.2972E-11  2.7214E-16
415075  7.8053E+03 -8.2807E+02  1.3463E+03 -9.8994E+02  6.2871E-02  3.8349E-02  3.9517E-01 -1.5712E+03 -1.7228E+02 -9.8994E+02 -1.3179E-01 -8.1384E-02  3.9517E-01  6.8510E-10  1.9126E-11  1.2972E-11  2.6581E-16
415075  8.4065E+03 -7.7781E+02  1.3503E+03 -7.3718E+02  1.0420E-01 -2.8707E-02  4.4496E-01 -1.5365E+03 -2.5952E+02 -7.3718E+02 -9.1048E-02 -1.4117E-01  4.4496E-01  7.7495E-10  9.4381E-12  1.2972E-11  2.5261E-16
415075  9.0034E+03 -7.0390E+02  1.3076E+03 -4.5840E+02  1.4299E-01 -1.1875E-01  4.8765E-01 -1.4476E+03 -3.3109E+02 -4.5840E+02 -4.6079E-02 -2.2053E-01  4.8765E-01  8.9856E-10  2.1982E-12  1.2972E-11  2.3149E-16
415085  0.0000E+00 -2.3969E+01  7.7759E+02 -1.5692E+03 -0.0000E+00 -0.0000E+00 -0.0000E+00 -2.3969E+01  7.7759E+02 -1.5692E+03 -1.1243E-01 -3.4658E-03  0.0000E+00  9.1118E-10  3.4297E-09  1.2972E-11  1.3579E-16
415085  6.0995E+02 -9.5250E+01  7.6790E+02 -1.6247E+03 -1.9517E-01 -1.0697E-02 -1.4099E-01 -1.6252E+02  7.5653E+02 -1.6247E+03 -3.0620E-01 -2.4469E-02 -1.4099E-01  8.2668E-10  1.2203E-09  1.2972E-11  1.4318E-16
415085  1.2141E+03 -2.3128E+02  7.7137E+02 -1.7040E+03 -2.4373E-01  2.2638E-02 -1.1185E-01 -3.6244E+02  7.1912E+02 -1.7040E+03 -3.5527E-01 -1.0803E-02 -1.1185E-01  7.1832E-10  4.0024E-10  1.2972E-11  1.5866E-16
415085  1.8347E+03 -3.8594E+02  7.9669E+02 -1.7561E+03 -2.5051E-01  5.9132E-02 -5.5319E-02 -5.8132E+02  6.6764E+02 -1.7561E+03 -3.6570E-01  3.3277E-03 -5.5319E-02  6.4621E-10  2.8100E-10  1.2972E-11  1.7808E-16
415085  2.4375E+03 -5.3474E+02  8.4272E+02 -1.7730E+03 -2.4085E-01  9.2992E-02 -5.4976E-04 -7.9277E+02  6.0633E+02 -1.7730E+03 -3.6270E-01  1.5673E-02 -5.4976E-04  6.1188E-10  2.1523E-10  1.2972E-11  1.9828E-16
415085  3.0379E+03 -6.7377E+02  9.0787E+02 -1.7573E+03 -2.2119E-01  1.2330E-01  5.2078E-02 -9.9589E+02  5.3515E+02 -1.7573E+03 -3.5246E-01  2.5877E-02  5.2078E-02  5.7688E-10  1.8883E-10  1.2972E-11  2.1840E-16
415085  3.6044E+03 -7.9231E+02  9.8471E+02 -1.7143E+03 -1.9637E-01  1.4731E-01  9.9349E-02 -1.1774E+03  4.5950E+02 -1.7143E+03 -3.3876E-01  3.2744E-02  9.9349E-02  5.5911E-10  1.6629E-10  1.2972E-11  2.3663E-16
415085  4.2459E+03 -9.0725E+02  1.0861E+03 -1.6336E+03 -1.6053E-01  1.6700E-01  1.5219E-01 -1.3672E+03  3.6508E+02 -1.6336E+03 -3.1757E-01  3.5818E-02  1.5219E-01  5.4674E-10  1.0468E-10  1.2972E-11  2.5561E-16
415085  4.8010E+03 -9.8600E+02  1.1815E+03 -1.5363E+03 -1.2294E-01  1.7554E-01  1.9770E-01 -1.5137E+03  2.7725E+02 -1.5363E+03 -2.9377E-01  3.2971E-02  1.9770E-01  5.3594E-10  9.7197E-11  1.2972E-11  2.6981E-16
415085  5.4223E+03 -1.0480E+03  1.2906E+03 -1.3981E+03 -7.5817E-02  1.7347E-01  2.4695E-01 -1.6534E+03  1.7384E+02 -1.3981E+03 -2.6243E-01  2.1936E-02  2.4695E-01  5.2859E-10  5.5172E-11  1.2972E-11  2.8251E-16
415085  6.0381E+03 -1.0796E+03  1.3935E+03 -1.2315E+03 -2.6440E-02  1.5852E-01  2.9342E-01 -1.7614E+03  6.8044E+01 -1.2315E+03 -2.2793E-01  2.4283E-03  2.9342E-01  5.4424E-10  3.3280E-11  1.2972E-11  2.9099E-16
415085  6.6274E+03 -1.0811E+03  1.4795E+03 -1.0464E+03  2.1167E-02  1.3083E-01  3.3427E-01 -1.8320E+03 -3.3943E+01 -1.0464E+03 -1.9275E-01 -2.5489E-02  3.3427E-01  5.6039E-10  1.9936E-11  1.2972E-11  2.9463E-16
415085  7.2147E+03 -1.0552E+03  1.5449E+03 -8.3910E+02  6.6591E-02  8.9697E-02  3.7091E-01 -1.8661E+03 -1.3388E+02 -8.3910E+02 -1.5679E-01 -6.2874E-02  3.7091E-01  5.9260E-10  1.2818E-11  1.2972E-11  2.9334E-16
415085  7.8073E+03 -1.0032E+03  1.5822E+03 -6.0961E+02  1.0805E-01  3.3553E-02  4.0268E-01 -1.8592E+03 -2.3013E+02 -6.0961E+02 -1.2071E-01 -1.1150E-01  4.0268E-01  6.3085E-10  8.9369E-12  1.2972E-11  2.8650E-16
415085  8.4076E+03 -9.2732E+02  1.5813E+03 -3.5977E+02  1.4335E-01 -3.9380E-02  4.2848E-01 -1.8050E+03 -3.1963E+02 -3.5977E+02 -8.5284E-02 -1.7346E-01  4.2848E-01  6.8349E-10  5.4144E-12  1.2972E-11  2.7332E-16
415085  9.0064E+03 -8.3302E+02  1.5317E+03 -9.7460E+01  1.7009E-01 -1.2937E-01  4.4605E-01 -1.6978E+03 -3.9677E+02 -9.7460E+01 -5.1378E-02 -2.4982E-01  4.4605E-01  7.7111E-10  8.9077E-12  1.2972E-11  2.5329E-16
415085  9.6071E+03 -7.2542E+02  1.4219E+03  1.7307E+02  1.8627E-01 -2.3951E-01  4.5261E-01 -1.5296E+03 -4.5654E+02  1.7307E+02 -1.9326E-02 -3.4440E-01  4.5261E-01  9.1058E-10  6.7285E-12  1.2972E-11  2.2568E-16
415086  0.0000E+00 -2.7876E+02  5.8127E+02 -1.4425E+03 -0.0000E+00  0.0000E+00 -0.0000E+00 -2.7876E+02  5.8127E+02 -1.4425E+03 -8.4046E-02 -4.0306E-02  0.0000E+00  9.8183E-10  2.1219E-09  1.2972E-11  1.3268E-16
415086  6.0160E+02 -3.2705E+02  5.6636E+02 -1.4739E+03 -1.5672E-01 -4.4314E-02 -9.4290E-02 -3.7502E+02  5.3580E+02 -1.4739E+03 -2.3861E-01 -9.1602E-02 -9.4290E-02  9.2949E-10  1.4491E-09  1.2972E-11  1.4147E-16
415086  1.2034E+03 -4.4471E+02  5.3438E+02 -1.5283E+03 -2.2693E-01 -5.7997E-02 -7.4973E-02 -5.3051E+02  4.4932E+02 -1.5283E+03 -3.0420E-01 -1.2230E-01 -7.4973E-02  8.4064E-10  6.4304E-10  1.2972E-11  1.5906E-16
415086  1.8170E+03 -5.9564E+02  5.0043E+02 -1.5584E+03 -2.6147E-01 -5.0811E-02 -2.0902E-02 -7.0517E+02  3.2857E+02 -1.5584E+03 -3.3383E-01 -1.3694E-01 -2.0902E-02  7.7719E-10  4.3474E-10  1.2972E-11  1.8046E-16
415086  2.4280E+03 -7.6119E+02  4.7418E+02 -1.5518E+03 -2.7764E-01 -3.3292E-02  4.3873E-02 -8.7784E+02  1.8348E+02 -1.5518E+03 -3.4620E-01 -1.4335E-01  4.3873E-02  7.3830E-10  2.7564E-10  1.2972E-11  2.0279E-16
415086  3.0048E+03 -9.2239E+02  4.6101E+02 -1.5076E+03 -2.7925E-01 -1.1936E-02  1.1062E-01 -1.0307E+03  2.9912E+01 -1.5076E+03 -3.4591E-01 -1.4531E-01  1.1062E-01  7.2267E-10  2.0525E-10  1.2972E-11  2.2312E-16
415086  3.6256E+03 -1.0925E+03  4.6122E+02 -1.4158E+03 -2.6647E-01  1.2426E-02  1.8543E-01 -1.1767E+03 -1.4759E+02 -1.4158E+03 -3.3316E-01 -1.4555E-01  1.8543E-01  7.1901E-10  1.4641E-10  1.2972E-11  2.4265E-16
415086  4.2081E+03 -1.2409E+03  4.7429E+02 -1.2871E+03 -2.4083E-01  3.1522E-02  2.5607E-01 -1.2893E+03 -3.2015E+02 -1.2871E+03 -3.0941E-01 -1.4791E-01  2.5607E-01  7.1345E-10  1.0675E-10  1.2972E-11  2.5749E-16
415086  4.8302E+03 -1.3783E+03  4.9812E+02 -1.1052E+03 -1.9819E-01  4.3023E-02  3.2786E-01 -1.3759E+03 -5.0474E+02 -1.1052E+03 -2.7021E-01 -1.5627E-01  3.2786E-01  7.1911E-10  6.4013E-11  1.2972E-11  2.6835E-16
415086  5.4125E+03 -1.4794E+03  5.2328E+02 -8.9611E+02 -1.4736E-01  4.1183E-02  3.8919E-01 -1.4180E+03 -6.7212E+02 -8.9611E+02 -2.2302E-01 -1.7273E-01  3.8919E-01  7.5273E-10  4.1663E-11  1.2972E-11  2.7278E-16
415086  6.0007E+03 -1.5491E+03  5.4330E+02 -6.5089E+02 -8.8412E-02  2.4097E-02  4.4304E-01 -1.4161E+03 -8.3037E+02 -6.5089E+02 -1.6697E-01 -1.9989E-01  4.4304E-01  7.6898E-10  2.6501E-11  1.2972E-11  2.7085E-16
415086  6.6037E+03 -1.5828E+03  5.4803E+02 -3.6968E+02 -2.2988E-02 -1.1627E-02  4.8770E-01 -1.3618E+03 -9.7532E+02 -3.6968E+02 -1.0223E-01 -2.4049E-01  4.8770E-01  8.1628E-10  1.6538E-11  1.2972E-11  2.6157E-16
415086  7.2029E+03 -1.5768E+03  5.2563E+02 -6.7225E+01  4.2877E-02 -6.6580E-02  5.1982E-01 -1.2499E+03 -1.0956E+03 -6.7225E+01 -3.3125E-02 -2.9457E-01  5.1982E-01  8.7355E-10  1.0807E-11  1.2972E-11  2.4475E-16
415087  0.0000E+00 -2.9960E+02  5.5540E+02 -1.4053E+03 -0.0000E+00  0.0000E+00 -0.0000E+00 -2.9960E+02  5.5540E+02 -1.4053E+03 -8.0306E-02 -4.3320E-02  0.0000E+00  9.8531E-10  1.3471E-09  1.2972E-11  1.3091E-16
415087  6.0411E+02 -3.3687E+02  5.3146E+02 -1.3855E+03 -9.7759E-02 -7.7702E-02  8.3801E-02 -3.8195E+02  5.0004E+02 -1.3855E+03 -1.7460E-01 -1.2641E-01  8.3801E-02  9.9473E-10  5.0878E-10  1.2972E-11  1.3507E-16
415088  0.0000E+00 -2.9348E+02  5.9746E+02 -1.4017E+03 -0.0000E+00  0.0000E+00 -0.0000E+00 -2.9348E+02  5.9746E+02 -1.4017E+03 -8.6388E-02 -4.2435E-02  0.0000E+00  9.8198E-10  2.4265E-09  1.2972E-11  1.3025E-16
415088  6.0752E+02 -3.5946E+02  5.7040E+02 -1.3788E+03 -1.8692E-01 -7.3419E-02  6.4281E-02 -4.0812E+02  5.3667E+02 -1.3788E+03 -2.6940E-01 -1.2539E-01  6.4281E-02  9.8832E-10  1.5617E-09  1.2972E-11  1.3609E-16
415088  1.2055E+03 -4.9509E+02  5.1789E+02 -1.3236E+03 -2.6164E-01 -9.2160E-02  1.0455E-01 -5.7740E+02  4.2418E+02 -1.3236E+03 -3.3652E-01 -1.6375E-01  1.0455E-01  9.6694E-10  1.4270E-09  1.2972E-11  1.4733E-16
415088  1.8076E+03 -6.7883E+02  4.5653E+02 -1.2409E+03 -3.2389E-01 -1.0706E-01  1.8535E-01 -7.7374E+02  2.6562E+02 -1.2409E+03 -3.8990E-01 -2.0522E-01  1.8535E-01  9.7280E-10  2.3570E-10  1.2972E-11  1.6520E-16
415088  2.4011E+03 -8.6702E+02  3.9521E+02 -1.0988E+03 -3.0453E-01 -9.9940E-02  2.9402E-01 -9.4976E+02  7.6631E+01 -1.0988E+03 -3.6168E-01 -2.2530E-01  2.9402E-01  1.0069E-09  9.7774E-11  1.2972E-11  1.8281E-16
415101  0.0000E+00 -4.7987E+02  5.5771E+02 -1.2428E+03 -0.0000E+00 -0.0000E+00 -0.0000E+00 -4.7987E+02  5.5771E+02 -1.2428E+03 -8.0640E-02 -6.9385E-02  0.0000E+00  1.0029E-09  8.8047E-10  1.2972E-11  1.3056E-16
415103  0.0000E+00 -5.5894E+02  5.6031E+02 -1.1802E+03 -0.0000E+00 -0.0000E+00 -0.0000E+00 -5.5894E+02  5.6031E+02 -1.1802E+03 -8.1016E-02 -8.0818E-02  0.0000E+00  1.0168E-09  1.9318E-09  1.2972E-11  1.3229E-16
415103  6.0514E+02 -5.8988E+02  5.3671E+02 -1.1940E+03 -8.0787E-02 -7.8563E-02 -6.9523E-03 -6.3452E+02  4.8311E+02 -1.1940E+03 -1.5839E-01 -1.6385E-01 -6.9523E-03  9.9850E-10  5.9314E-10  1.2972E-11  1.4139E-16
415103  1.2002E+03 -6.3774E+02  4.7431E+02 -1.1646E+03 -7.4595E-02 -1.2602E-01  1.0751E-01 -7.1006E+02  3.5707E+02 -1.1646E+03 -1.4318E-01 -2.1823E-01  1.0751E-01  1.0228E-09  1.5990E-10  1.2972E-11  1.4980E-16
415106  0.0000E+00 -3.0660E+02  6.7258E+02 -1.4056E+03 -0.0000E+00 -0.0000E+00  0.0000E+00 -3.0660E+02  6.7258E+02 -1.4056E+03 -9.7249E-02 -4.4331E-02  0.0000E+00  9.7556E-10  2.6279E-09  1.2972E-11  1.3160E-16
415106  6.1143E+02 -3.8044E+02  6.9654E+02 -1.3807E+03 -1.8429E-01  7.0985E-02  7.9331E-02 -4.4045E+02  6.6023E+02 -1.3807E+03 -2.8500E-01  1.5977E-02  7.9331E-02  9.4039E-10  7.4925E-10  1.2972E-11  1.3795E-16
415106  1.2048E+03 -4.9556E+02  7.4429E+02 -1.3061E+03 -1.9264E-01  8.4479E-02  1.7401E-01 -6.1707E+02  6.4713E+02 -1.3061E+03 -3.0026E-01  1.2825E-02  1.7401E-01  9.0651E-10  3.2300E-10  1.2972E-11  1.4601E-16
415106  1.8047E+03 -6.0344E+02  7.9514E+02 -1.1769E+03 -1.6870E-01  8.6574E-02  2.5275E-01 -7.8815E+02  6.1253E+02 -1.1769E+03 -2.8366E-01 -6.7797E-04  2.5275E-01  9.3232E-10  4.5440E-10  1.2972E-11  1.5278E-16
415106  2.4070E+03 -6.9479E+02  8.4411E+02 -9.9734E+02 -1.2455E-01  6.9044E-02  3.4490E-01 -9.4102E+02  5.5655E+02 -9.9734E+02 -2.4660E-01 -3.1416E-02  3.4490E-01  9.5464E-10  5.6837E-11  1.2972E-11  1.5763E-16
415106  3.0058E+03 -7.4880E+02  8.7232E+02 -7.6574E+02 -5.4948E-02  2.1064E-02  4.2576E-01 -1.0465E+03  4.7593E+02 -7.6574E+02 -1.8108E-01 -8.7207E-02  4.2576E-01  9.8850E-10  1.1991E-11  1.2972E-11  1.5737E-16
415113  0.0000E+00 -9.7847E+01  7.0047E+02 -1.5020E+03 -0.0000E+00 -0.0000E+00 -0.0000E+00 -9.7847E+01  7.0047E+02 -1.5020E+03 -1.0128E-01 -1.4148E-02  0.0000E+00  9.5769E-10  2.4086E-09  1.2972E-11  1.3071E-16
415113  6.0970E+02 -1.3718E+02  6.7579E+02 -1.5398E+03 -1.2270E-01 -6.6311E-02 -8.1727E-02 -1.9615E+02  6.6109E+02 -1.5398E+03 -2.2042E-01 -8.6147E-02 -8.1727E-02  9.2189E-10  8.3870E-10  1.2972E-11  1.3672E-16
415113  1.2119E+03 -2.3004E+02  6.3117E+02 -1.5747E+03 -1.7744E-01 -7.3640E-02 -3.1967E-02 -3.3655E+02  5.8140E+02 -1.5747E+03 -2.6870E-01 -1.0690E-01 -3.1967E-02  8.7516E-10  5.1283E-10  1.2972E-11  1.4688E-16
415113  1.8033E+03 -3.4382E+02  5.9282E+02 -1.5783E+03 -2.0769E-01 -5.5452E-02  1.6399E-02 -4.8503E+02  4.8415E+02 -1.5783E+03 -2.9341E-01 -1.0517E-01  1.6399E-02  8.2534E-10  5.9266E-10  1.2972E-11  1.5878E-16
415113  2.4081E+03 -4.8105E+02  5.6422E+02 -1.5563E+03 -2.4543E-01 -3.9228E-02  5.8389E-02 -6.4469E+02  3.6623E+02 -1.5563E+03 -3.2701E-01 -1.0878E-01  5.8389E-02  8.0290E-10  5.4653E-10  1.2972E-11  1.7344E-16
415113  3.0277E+03 -6.4281E+02  5.4476E+02 -1.5041E+03 -2.7456E-01 -2.3809E-02  1.1220E-01 -8.1313E+02  2.2088E+02 -1.5041E+03 -3.5333E-01 -1.1675E-01  1.1220E-01  7.9775E-10  4.6697E-10  1.2972E-11  1.9088E-16
415113  3.6001E+03 -8.0421E+02  5.3533E+02 -1.4226E+03 -2.8670E-01 -8.6955E-03  1.7458E-01 -9.6394E+02  6.4442E+01 -1.4226E+03 -3.6411E-01 -1.2498E-01  1.7458E-01  7.8658E-10  2.8905E-10  1.2972E-11  2.0784E-16
415113  4.2243E+03 -9.8095E+02  5.3519E+02 -1.2889E+03 -2.7518E-01  7.6394E-03  2.5531E-01 -1.1105E+03 -1.2417E+02 -1.2889E+03 -3.5257E-01 -1.3420E-01  2.5531E-01  7.8556E-10  1.6666E-10  1.2972E-11  2.2497E-16
415113  4.8039E+03 -1.1319E+03  5.4271E+02 -1.1183E+03 -2.4182E-01  1.6771E-02  3.3285E-01 -1.2170E+03 -3.0752E+02 -1.1183E+03 -3.2030E-01 -1.4689E-01  3.3285E-01  8.0843E-10  7.7451E-11  1.2972E-11  2.3725E-16
415113  5.4087E+03 -1.2628E+03  5.5270E+02 -8.9384E+02 -1.8869E-01  1.3664E-02  4.0803E-01 -1.2855E+03 -4.9784E+02 -8.9384E+02 -2.6861E-01 -1.6893E-01  4.0803E-01  8.3882E-10  3.9031E-11  1.2972E-11  2.4433E-16
415113  6.0096E+03 -1.3576E+03  5.5559E+02 -6.2901E+02 -1.2520E-01 -7.2264E-03  4.7081E-01 -1.3008E+03 -6.7797E+02 -6.2901E+02 -2.0554E-01 -2.0352E-01  4.7081E-01  8.7134E-10  2.0086E-11  1.2972E-11  2.4426E-16
415113  6.6014E+03 -1.4115E+03  5.4052E+02 -3.3526E+02 -5.6430E-02 -4.6744E-02  5.1957E-01 -1.2569E+03 -8.3936E+02 -3.3526E+02 -1.3459E-01 -2.5083E-01  5.1957E-01  9.1492E-10  5.2123E-12  1.2972E-11  2.3654E-16
415113  7.2034E+03 -1.4239E+03  4.9522E+02 -1.1108E+01  1.5489E-02 -1.0762E-01  5.5523E-01 -1.1464E+03 -9.7903E+02 -1.1108E+01 -5.6116E-02 -3.1350E-01  5.5523E-01  9.9895E-10  4.2065E-12  1.2972E-11  2.2057E-16
415147  0.0000E+00 -3.3662E+02  6.0144E+02 -1.3711E+03 -0.0000E+00  0.0000E+00 -0.0000E+00 -3.3662E+02  6.0144E+02 -1.3711E+03 -8.6963E-02 -4.8672E-02  0.0000E+00  9.8921E-10  1.2331E-09  1.2972E-11  1.3038E-16
415147  6.0804E+02 -3.7419E+02  5.9211E+02 -1.3557E+03 -1.3190E-01 -2.5401E-02  3.4119E-02 -4.2473E+02  5.5697E+02 -1.3557E+03 -2.1752E-01 -7.9506E-02  3.4119E-02  9.9787E-10  1.3763E-09  1.2972E-11  1.3528E-16
415147  1.2110E+03 -4.7352E+02  5.7337E+02 -1.3163E+03 -1.8686E-01 -2.9266E-02  7.6802E-02 -5.6617E+02  4.8211E+02 -1.3163E+03 -2.6976E-01 -9.7733E-02  7.6802E-02  9.7182E-10  1.5253E-09  1.2972E-11  1.4458E-16
415147  1.8036E+03 -6.2399E+02  5.4938E+02 -1.2773E+03 -3.0404E-01 -5.0067E-02  8.4936E-02 -7.4455E+02  3.6991E+02 -1.2773E+03 -3.8348E-01 -1.4029E-01  8.4936E-02  9.2705E-10  6.3980E-10  1.2972E-11  1.6141E-16
415147  2.4015E+03 -8.1201E+02  5.1936E+02 -1.1987E+03 -3.1374E-01 -4.7716E-02  1.8009E-01 -9.4029E+02  2.1203E+02 -1.1987E+03 -3.8883E-01 -1.6513E-01  1.8009E-01  9.2289E-10  1.7481E-10  1.2972E-11  1.8263E-16
415147  3.0100E+03 -9.9412E+02  4.9237E+02 -1.0590E+03 -2.8057E-01 -4.1838E-02  2.7784E-01 -1.1090E+03  2.7338E+01 -1.0590E+03 -3.5177E-01 -1.8558E-01  2.7784E-01  9.3384E-10  7.8228E-11  1.2972E-11  2.0159E-16
415147  3.6103E+03 -1.1474E+03  4.6663E+02 -8.6569E+02 -2.2788E-01 -4.6318E-02  3.6370E-01 -1.2273E+03 -1.6766E+02 -8.6569E+02 -2.9535E-01 -2.1223E-01  3.6370E-01  9.4259E-10  2.4574E-11  1.2972E-11  2.1488E-16
415147  4.2001E+03 -1.2635E+03  4.3397E+02 -6.2918E+02 -1.6421E-01 -6.7572E-02  4.3571E-01 -1.2852E+03 -3.6465E+02 -6.2918E+02 -2.2696E-01 -2.5026E-01  4.3571E-01  9.9730E-10  6.6543E-12  1.2972E-11  2.2110E-16
415147  4.8040E+03 -1.3408E+03  3.8210E+02 -3.4809E+02 -9.1644E-02 -1.0701E-01  4.9254E-01 -1.2747E+03 -5.6469E+02 -3.4809E+02 -1.4689E-01 -3.0088E-01  4.9254E-01  9.9646E-10  1.3570E-11  1.2972E-11  2.1939E-16
415149  0.0000E+00 -3.4389E+02  5.8498E+02 -1.3664E+03 -0.0000E+00  0.0000E+00 -0.0000E+00 -3.4389E+02  5.8498E+02 -1.3664E+03 -8.4583E-02 -4.9724E-02  0.0000E+00  9.9303E-10  2.1181E-09  1.2972E-11  1.3047E-16
415149  6.0333E+02 -3.9654E+02  5.7674E+02 -1.3752E+03 -1.5914E-01 -2.9007E-02 -2.5653E-03 -4.4528E+02  5.4000E+02 -1.3752E+03 -2.4253E-01 -8.6343E-02 -2.5653E-03  9.7330E-10  9.1947E-10  1.2972E-11  1.3852E-16
415149  1.2170E+03 -5.1433E+02  5.5424E+02 -1.3598E+03 -2.2208E-01 -3.9859E-02  4.1384E-02 -6.0342E+02  4.5565E+02 -1.3598E+03 -3.0222E-01 -1.1423E-01  4.1384E-02  9.3927E-10  1.0286E-09  1.2972E-11  1.5185E-16
415149  1.8192E+03 -6.6734E+02  5.2901E+02 -1.3239E+03 -2.7797E-01 -4.3962E-02  8.9834E-02 -7.8194E+02  3.3729E+02 -1.3239E+03 -3.5446E-01 -1.4045E-01  8.9834E-02  8.9668E-10  5.4219E-10  1.2972E-11  1.6980E-16
415149  2.4078E+03 -8.3490E+02  5.0360E+02 -1.2461E+03 -2.8405E-01 -4.0755E-02  1.7708E-01 -9.5662E+02  1.8856E+02 -1.2461E+03 -3.5687E-01 -1.6147E-01  1.7708E-01  8.7133E-10  2.0182E-10  1.2972E-11  1.8881E-16
415149  3.0059E+03 -9.9782E+02  4.8097E+02 -1.1122E+03 -2.5655E-01 -3.5584E-02  2.7033E-01 -1.1076E+03  1.6108E+01 -1.1122E+03 -3.2610E-01 -1.7986E-01  2.7033E-01  8.9978E-10  8.7770E-11  1.2972E-11  2.0546E-16
415149  3.6137E+03 -1.1396E+03  4.5845E+02 -9.2070E+02 -2.0717E-01 -4.0880E-02  3.5852E-01 -1.2163E+03 -1.7143E+02 -9.2070E+02 -2.7346E-01 -2.0565E-01  3.5852E-01  9.2724E-10  3.4139E-11  1.2972E-11  2.1698E-16
415149  4.2074E+03 -1.2450E+03  4.2853E+02 -6.8472E+02 -1.4551E-01 -6.3222E-02  4.3416E-01 -1.2665E+03 -3.5989E+02 -6.8472E+02 -2.0747E-01 -2.4323E-01  4.3416E-01  9.9734E-10  9.9649E-12  1.2972E-11  2.2135E-16
415149  4.8015E+03 -1.3106E+03  3.7949E+02 -4.0815E+02 -7.4759E-02 -1.0462E-01  4.9424E-01 -1.2500E+03 -5.4691E+02 -4.0815E+02 -1.2963E-01 -2.9412E-01  4.9424E-01  1.0052E-09  1.6779E-11  1.2972E-11  2.1774E-16
415188  0.0000E+00 -4.6679E+02  5.0095E+02 -1.2653E+03 -0.0000E+00 -0.0000E+00 -0.0000E+00 -4.6679E+02  5.0095E+02 -1.2653E+03 -7.2433E-02 -6.7493E-02  0.0000E+00  1.0056E-09  1.5971E-09  1.2972E-11  1.3187E-16
415189  0.0000E+00 -4.6618E+02  4.8509E+02 -1.2750E+03 -0.0000E+00 -0.0000E+00 -0.0000E+00 -4.6618E+02  4.8509E+02 -1.2750E+03 -7.0140E-02 -6.7406E-02  0.0000E+00  1.0068E-09  2.1210E-09  1.2972E-11  1.3278E-16
415189  6.0929E+02 -5.1489E+02  4.7335E+02 -1.2523E+03 -1.1474E-01 -4.7560E-02  9.6007E-02 -5.5454E+02  4.2621E+02 -1.2523E+03 -1.8318E-01 -1.2201E-01  9.6007E-02  1.0037E-09  4.0708E-10  1.2972E-11  1.3961E-16
415191  0.0000E+00 -4.7470E+02  5.4643E+02 -1.2521E+03 -0.0000E+00 -0.0000E+00 -0.0000E+00 -4.7470E+02  5.4643E+02 -1.2521E+03 -7.9009E-02 -6.8637E-02  0.0000E+00  1.0033E-09  1.5217E-09  1.2972E-11  1.3098E-16
415285  0.0000E+00 -1.0762E+02  7.0568E+02 -1.5003E+03 -0.0000E+00 -0.0000E+00 -0.0000E+00 -1.0762E+02  7.0568E+02 -1.5003E+03 -1.0203E-01 -1.5561E-02  0.0000E+00  9.5277E-10  2.3158E-09  1.2972E-11  1.3095E-16
415285  6.1260E+02 -1.4786E+02  6.9843E+02 -1.5310E+03 -1.2561E-01 -1.5570E-02 -5.7998E-02 -2.0906E+02  6.8262E+02 -1.5310E+03 -2.2660E-01 -3.6949E-02 -5.7998E-02  9.2189E-10  9.2946E-10  1.2972E-11  1.3677E-16
415285  1.2202E+03 -2.4096E+02  6.9137E+02 -1.5468E+03 -1.7133E-01 -4.5732E-03  9.7346E-03 -3.5856E+02  6.3835E+02 -1.5468E+03 -2.7130E-01 -3.9414E-02  9.7346E-03  8.6086E-10  4.3160E-10  1.2972E-11  1.4580E-16
415285  1.8027E+03 -3.4545E+02  6.9384E+02 -1.5195E+03 -1.8290E-01  1.4184E-02  8.2847E-02 -5.1259E+02  5.8138E+02 -1.5195E+03 -2.8323E-01 -3.5765E-02  8.2847E-02  8.3956E-10  4.3266E-10  1.2972E-11  1.5479E-16
415285  2.4116E+03 -4.5953E+02  7.0945E+02 -1.4501E+03 -1.9428E-01  3.7717E-02  1.4494E-01 -6.7428E+02  5.0975E+02 -1.4501E+03 -2.9686E-01 -2.8727E-02  1.4494E-01  8.5801E-10  5.5693E-10  1.2972E-11  1.6425E-16
415285  3.0222E+03 -5.8205E+02  7.3905E+02 -1.3414E+03 -2.0361E-01  5.8476E-02  2.1235E-01 -8.4013E+02  4.2328E+02 -1.3414E+03 -3.1047E-01 -2.5683E-02  2.1235E-01  8.5959E-10  4.5037E-10  1.2972E-11  1.7450E-16
415285  3.6136E+03 -7.0187E+02  7.7714E+02 -1.1961E+03 -1.9942E-01  6.7696E-02  2.8149E-01 -9.9606E+02  3.2319E+02 -1.1961E+03 -3.1179E-01 -3.3789E-02  2.8149E-01  8.7851E-10  3.4602E-10  1.2972E-11  1.8444E-16
415285  4.2103E+03 -8.1093E+02  8.1501E+02 -1.0023E+03 -1.5887E-01  5.4881E-02  3.6791E-01 -1.1313E+03  2.0486E+02 -1.0023E+03 -2.7671E-01 -6.2372E-02  3.6791E-01  9.0574E-10  6.6809E-11  1.2972E-11  1.9228E-16
415285  4.8041E+03 -8.8664E+02  8.3781E+02 -7.6071E+02 -9.4910E-02  1.8085E-02  4.4388E-01 -1.2175E+03  7.6152E+01 -7.6071E+02 -2.1605E-01 -1.1011E-01  4.4388E-01  9.4474E-10  1.9292E-11  1.2972E-11  1.9440E-16
415285  5.4020E+03 -9.2238E+02  8.3147E+02 -4.7570E+02 -2.4099E-02 -4.3857E-02  5.0723E-01 -1.2404E+03 -5.8923E+01 -4.7570E+02 -1.4432E-01 -1.7723E-01  5.0723E-01  1.0293E-09  1.9124E-11  1.2972E-11  1.8915E-16
415292  0.0000E+00 -3.7730E+02  6.6437E+02 -1.3221E+03 -0.0000E+00 -0.0000E+00 -0.0000E+00 -3.7730E+02  6.6437E+02 -1.3221E+03 -9.6063E-02 -5.4554E-02  0.0000E+00  9.9531E-10  2.1538E-09  1.2972E-11  1.2920E-16
415292  6.0557E+02 -4.2398E+02  6.6881E+02 -1.3184E+03 -1.1442E-01  9.2390E-03  4.9411E-02 -4.8084E+02  6.2918E+02 -1.3184E+03 -2.1112E-01 -5.2065E-02  4.9411E-02  9.8483E-10  5.1668E-10  1.2972E-11  1.3609E-16
415292  1.2053E+03 -4.9190E+02  6.6996E+02 -1.2541E+03 -1.0149E-01 -6.8310E-03  1.6290E-01 -6.0062E+02  5.7452E+02 -1.2541E+03 -1.9836E-01 -7.7956E-02  1.6290E-01  9.9996E-10  5.4109E-11  1.2972E-11  1.4140E-16
415292  1.8063E+03 -5.6901E+02  6.6218E+02 -1.1419E+03 -1.7879E-01 -3.7597E-02  2.1654E-01 -7.2070E+02  4.9279E+02 -1.1419E+03 -2.7453E-01 -1.1987E-01  2.1654E-01  1.0089E-09  5.7080E-10  1.2972E-11  1.4574E-16
415303  0.0000E+00 -4.4130E+02  4.7035E+02 -1.3122E+03 -0.0000E+00 -0.0000E+00 -0.0000E+00 -4.4130E+02  4.7035E+02 -1.3122E+03 -6.8009E-02 -6.3808E-02  0.0000E+00  1.0015E-09  2.3836E-09  1.2972E-11  1.3397E-16
415303  6.1073E+02 -5.0062E+02  4.6189E+02 -1.3192E+03 -1.6469E-01 -3.3764E-02  3.3798E-03 -5.3941E+02  4.1594E+02 -1.3192E+03 -2.3147E-01 -1.0615E-01  3.3798E-03  9.7643E-10  8.4297E-10  1.2972E-11  1.4374E-16
415303  1.2017E+03 -6.0859E+02  4.3038E+02 -1.2917E+03 -1.9190E-01 -6.9743E-02  9.5472E-02 -6.7383E+02  3.1869E+02 -1.2917E+03 -2.5413E-01 -1.5774E-01  9.5472E-02  9.7078E-10  4.0503E-10  1.2972E-11  1.5691E-16
415303  1.8039E+03 -7.2343E+02  3.8242E+02 -1.2013E+03 -1.8385E-01 -8.7818E-02  2.0674E-01 -7.9758E+02  1.8292E+02 -1.2013E+03 -2.3914E-01 -1.9242E-01  2.0674E-01  1.0043E-09  1.3162E-10  1.2972E-11  1.6804E-16
415330  0.0000E+00 -5.1475E+02  6.6963E+02 -1.1829E+03 -0.0000E+00 -0.0000E+00 -0.0000E+00 -5.1475E+02  6.6963E+02 -1.1829E+03 -9.6823E-02 -7.4429E-02  0.0000E+00  1.0048E-09  2.7042E-09  1.2972E-11  1.2825E-16
415330  6.1163E+02 -5.8766E+02  6.4662E+02 -1.1823E+03 -1.9419E-01 -6.5965E-02  3.1798E-02 -6.4247E+02  5.9219E+02 -1.1823E+03 -2.8769E-01 -1.5094E-01  3.1798E-02  9.8021E-10  9.0052E-10  1.2972E-11  1.3953E-16
415330  1.2064E+03 -7.1285E+02  5.9876E+02 -1.1323E+03 -2.1425E-01 -9.1229E-02  1.3738E-01 -8.0595E+02  4.6596E+02 -1.1323E+03 -3.0082E-01 -1.9430E-01  1.3738E-01  9.6825E-10  2.3200E-10  1.2972E-11  1.5447E-16
415330  1.8035E+03 -8.3496E+02  5.3872E+02 -1.0190E+03 -1.8928E-01 -1.1098E-01  2.4104E-01 -9.4563E+02  3.0524E+02 -1.0190E+03 -2.6718E-01 -2.3171E-01  2.4104E-01  1.0102E-09  1.4855E-11  1.2972E-11  1.6719E-16
415359  0.0000E+00 -4.8720E+01  7.7159E+02 -1.5429E+03 -0.0000E+00 -0.0000E+00 -0.0000E+00 -4.8720E+01  7.7159E+02 -1.5429E+03 -1.1156E-01 -7.0446E-03  0.0000E+00  9.2524E-10  3.3494E-09  1.2972E-11  1.3413E-16
415359  6.1474E+02 -1.3554E+02  7.5890E+02 -1.5811E+03 -2.4261E-01 -1.5973E-02 -7.1896E-02 -2.0237E+02  7.4387E+02 -1.5811E+03 -3.5234E-01 -3.5570E-02 -7.1896E-02  8.4455E-10  1.1699E-09  1.2972E-11  1.4111E-16
415359  1.2093E+03 -2.9817E+02  7.6100E+02 -1.6059E+03 -2.8909E-01  2.3357E-02 -7.0416E-03 -4.2601E+02  6.9753E+02 -1.6059E+03 -3.9913E-01 -1.9756E-02 -7.0416E-03  7.7601E-10  3.6559E-10  1.2972E-11  1.5474E-16
415359  1.8196E+03 -4.7539E+02  7.8742E+02 -1.5894E+03 -2.8833E-01  6.2592E-02  5.9918E-02 -6.6381E+02  6.3669E+02 -1.5894E+03 -4.0218E-01 -6.1454E-03  5.9918E-02  7.3521E-10  3.2299E-10  1.2972E-11  1.7197E-16
415359  2.4193E+03 -6.4524E+02  8.3594E+02 -1.5357E+03 -2.7649E-01  9.8367E-02  1.1867E-01 -8.9266E+02  5.6417E+02 -1.5357E+03 -3.9736E-01  5.0702E-03  1.1867E-01  6.9882E-10  2.7702E-10  1.2972E-11  1.9057E-16
415359  3.0264E+03 -8.0703E+02  9.0491E+02 -1.4459E+03 -2.5429E-01  1.2746E-01  1.7800E-01 -1.1144E+03  4.7766E+02 -1.4459E+03 -3.8513E-01  1.0775E-02  1.7800E-01  6.7917E-10  1.9101E-10  1.2972E-11  2.0988E-16
415359  3.6055E+03 -9.4476E+02  9.8431E+02 -1.3256E+03 -2.1946E-01  1.4483E-01  2.3729E-01 -1.3095E+03  3.8305E+02 -1.3256E+03 -3.6178E-01  8.2239E-03  2.3729E-01  6.6445E-10  1.3452E-10  1.2972E-11  2.2730E-16
415359  4.2228E+03 -1.0652E+03  1.0760E+03 -1.1603E+03 -1.6850E-01  1.4953E-01  2.9744E-01 -1.4896E+03  2.7085E+02 -1.1603E+03 -3.2408E-01 -4.4885E-03  2.9744E-01  6.4159E-10  5.8780E-11  1.2972E-11  2.4316E-16
415359  4.8148E+03 -1.1484E+03  1.1622E+03 -9.6861E+02 -1.1174E-01  1.3938E-01  3.4883E-01 -1.6265E+03  1.5533E+02 -9.6861E+02 -2.7978E-01 -2.6660E-02  3.4883E-01  6.5304E-10  3.0823E-11  1.2972E-11  2.5437E-16
415359  5.4314E+03 -1.1984E+03  1.2409E+03 -7.3910E+02 -5.0699E-02  1.1300E-01  3.9408E-01 -1.7249E+03  3.0101E+01 -7.3910E+02 -2.3012E-01 -6.0285E-02  3.9408E-01  6.6222E-10  1.8898E-11  1.2972E-11  2.6095E-16
415359  6.0094E+03 -1.2116E+03  1.2954E+03 -5.0103E+02  4.8304E-03  7.2941E-02  4.2830E-01 -1.7714E+03 -8.8830E+01 -5.0103E+02 -1.8247E-01 -1.0224E-01  4.2830E-01  6.8638E-10  1.4205E-11  1.2972E-11  2.6181E-16
415359  6.6060E+03 -1.1927E+03  1.3226E+03 -2.3729E+02  5.7412E-02  1.5595E-02  4.5411E-01 -1.7685E+03 -2.0996E+02 -2.3729E+02 -1.3382E-01 -1.5685E-01  4.5411E-01  7.1370E-10  8.7813E-12  1.2972E-11  2.5683E-16
415359  7.2035E+03 -1.1444E+03  1.3107E+03  3.9269E+01  1.0267E-01 -5.8060E-02  4.6953E-01 -1.7092E+03 -3.2610E+02  3.9269E+01 -8.6853E-02 -2.2353E-01  4.6953E-01  7.6406E-10  8.6316E-12  1.2972E-11  2.4555E-16
415359  7.8104E+03 -1.0706E+03  1.2485E+03  3.2596E+02  1.3866E-01 -1.5011E-01  4.7329E-01 -1.5862E+03 -4.3452E+02  3.2596E+02 -4.1861E-02 -3.0491E-01  4.7329E-01  8.3510E-10  7.4640E-12  1.2972E-11  2.2743E-16
415360  0.0000E+00 -3.0094E+01  7.5267E+02 -1.5569E+03 -0.0000E+00 -0.0000E+00 -0.0000E+00 -3.0094E+01  7.5267E+02 -1.5569E+03 -1.0883E-01 -4.3513E-03  0.0000E+00  9.1734E-10  3.1381E-09  1.2972E-11  1.3437E-16
415360  6.0333E+02 -1.0995E+02  7.3584E+02 -1.6024E+03 -2.3668E-01 -3.8359E-02 -1.2094E-01 -1.7365E+02  7.2346E+02 -1.6024E+03 -3.4308E-01 -5.4257E-02 -1.2094E-01  8.5425E-10  1.1833E-09  1.2972E-11  1.4140E-16
415360  1.2023E+03 -2.7622E+02  7.2169E+02 -1.6675E+03 -3.0199E-01 -5.3445E-03 -8.6179E-02 -3.9689E+02  6.6303E+02 -1.6675E+03 -4.0634E-01 -4.5284E-02 -8.6179E-02  7.4724E-10  4.8597E-10  1.2972E-11  1.5789E-16
415360  1.8053E+03 -4.6296E+02  7.3200E+02 -1.7021E+03 -3.1328E-01  3.9513E-02 -2.9320E-02 -6.3619E+02  5.8772E+02 -1.7021E+03 -4.1912E-01 -2.7428E-02 -2.9320E-02  6.8582E-10  3.3735E-10  1.2972E-11  1.7932E-16
415360  2.4189E+03 -6.5439E+02  7.6987E+02 -1.7036E+03 -3.0848E-01  8.3520E-02  2.4405E-02 -8.7858E+02  4.9902E+02 -1.7036E+03 -4.1979E-01 -1.1099E-02  2.4405E-02  6.2658E-10  2.5967E-10  1.2972E-11  2.0362E-16
415360  3.0181E+03 -8.3473E+02  8.3210E+02 -1.6735E+03 -2.9130E-01  1.2342E-01  7.6149E-02 -1.1082E+03  4.0130E+02 -1.6735E+03 -4.1162E-01  2.7243E-03  7.6149E-02  5.8721E-10  1.9661E-10  1.2972E-11  2.2820E-16
415360  3.6244E+03 -1.0032E+03  9.1776E+02 -1.6117E+03 -2.6254E-01  1.5815E-01  1.2772E-01 -1.3278E+03  2.9260E+02 -1.6117E+03 -3.9524E-01  1.3102E-02  1.2772E-01  5.5794E-10  1.3830E-10  1.2972E-11  2.5251E-16
415360  4.2025E+03 -1.1446E+03  1.0171E+03 -1.5238E+03 -2.2507E-01  1.8426E-01  1.7606E-01 -1.5204E+03  1.8157E+02 -1.5238E+03 -3.7213E-01  1.8766E-02  1.7606E-01  5.3449E-10  1.0623E-10  1.2972E-11  2.7409E-16
415360  4.8087E+03 -1.2668E+03  1.1348E+03 -1.4025E+03 -1.7678E-01  2.0220E-01  2.2349E-01 -1.6997E+03  5.9885E+01 -1.4025E+03 -3.4087E-01  1.9032E-02  2.2349E-01  5.1531E-10  6.4449E-11  1.2972E-11  2.9407E-16
415360  5.4247E+03 -1.3591E+03  1.2622E+03 -1.2511E+03 -1.2212E-01  2.0927E-01  2.6713E-01 -1.8536E+03 -6.6614E+01 -1.2511E+03 -3.0462E-01  1.2763E-02  2.6713E-01  5.0388E-10  4.0559E-11  1.2972E-11  3.1080E-16
415360  6.0231E+03 -1.4155E+03  1.3866E+03 -1.0799E+03 -6.6289E-02  2.0469E-01  3.0450E-01 -1.9724E+03 -1.8953E+02 -1.0799E+03 -2.6678E-01  1.8544E-05  3.0450E-01  4.9831E-10  2.8000E-11  1.2972E-11  3.2306E-16
415360  6.6293E+03 -1.4385E+03  1.5061E+03 -8.8511E+02 -9.8943E-03  1.8766E-01  3.3696E-01 -2.0593E+03 -3.1159E+02 -8.8511E+02 -2.2767E-01 -2.0331E-02  3.3696E-01  4.9326E-10  2.1102E-11  1.2972E-11  3.3105E-16
415360  7.2061E+03 -1.4293E+03  1.6070E+03 -6.8313E+02  4.1118E-02  1.6035E-01  3.6260E-01 -2.1086E+03 -4.2320E+02 -6.8313E+02 -1.9124E-01 -4.6317E-02  3.6260E-01  4.9204E-10  1.4407E-11  1.2972E-11  3.3426E-16
415360  7.8237E+03 -1.3883E+03  1.6938E+03 -4.5223E+02  9.0748E-02  1.1872E-01  3.8418E-01 -2.1236E+03 -5.3551E+02 -4.5223E+02 -1.5417E-01 -8.2015E-02  3.8418E-01  5.1594E-10  1.3728E-11  1.2972E-11  3.3272E-16
415360  8.4027E+03 -1.3238E+03  1.7486E+03 -2.2524E+02  1.3079E-01  6.8462E-02  3.9877E-01 -2.1002E+03 -6.3171E+02 -2.2524E+02 -1.2204E-01 -1.2295E-01  3.9877E-01  5.2993E-10  9.2863E-12  1.2972E-11  3.2641E-16
415360  9.0095E+03 -1.2339E+03  1.7713E+03  1.9704E+01  1.6369E-01  4.5043E-03  4.0735E-01 -2.0349E+03 -7.2066E+02  1.9704E+01 -9.2425E-02 -1.7391E-01  4.0735E-01  5.5708E-10  7.3762E-12  1.2972E-11  3.1459E-16
415360  9.6118E+03 -1.1282E+03  1.7521E+03  2.6567E+02  1.8551E-01 -6.9990E-02  4.0818E-01 -1.9266E+03 -7.9433E+02  2.6567E+02 -6.7824E-02 -2.3312E-01  4.0818E-01  5.9656E-10  7.6867E-12  1.2972E-11  2.9749E-16
415360  1.0208E+04 -1.0141E+03  1.6858E+03  5.0707E+02  1.9498E-01 -1.5422E-01  3.9997E-01 -1.7742E+03 -8.4995E+02  5.0707E+02 -4.8768E-02 -3.0085E-01  3.9997E-01  6.5434E-10  3.9172E-12  1.2972E-11  2.7525E-16
415360  1.0806E+04 -8.9827E+02  1.5657E+03  7.4070E+02  1.9016E-01 -2.4938E-01  3.7941E-01 -1.5732E+03 -8.8507E+02  7.4070E+02 -3.6231E-02 -3.7926E-01  3.7941E-01  7.4844E-10  3.2989E-12  1.2972E-11  2.4774E-16
415360  1.1405E+04 -7.9012E+02  1.3845E+03  9.5742E+02  1.6605E-01 -3.5694E-01  3.3862E-01 -1.3184E+03 -8.9601E+02  9.5742E+02 -3.4130E-02 -4.7119E-01  3.3862E-01  8.7558E-10  0.0000E+00  1.2972E-11  2.1527E-16
415361  0.0000E+00 -3.0816E+01  7.4017E+02 -1.5551E+03 -0.0000E+00 -0.0000E+00 -0.0000E+00 -3.0816E+01  7.4017E+02 -1.5551E+03 -1.0702E-01 -4.4558E-03  0.0000E+00  9.1734E-10  2.4376E-09  1.2972E-11  1.3396E-16
415361  6.0145E+02 -9.5911E+01  7.2753E+02 -1.5925E+03 -2.0796E-01 -3.6538E-02 -1.0889E-01 -1.5874E+02  7.1645E+02 -1.5925E+03 -3.1316E-01 -5.0406E-02 -1.0889E-01  8.7155E-10  1.5028E-09  1.2972E-11  1.3997E-16
415361  1.2027E+03 -2.5100E+02  7.1048E+02 -1.6542E+03 -2.8813E-01 -1.3896E-02 -8.3352E-02 -3.7015E+02  6.5634E+02 -1.6542E+03 -3.9086E-01 -5.0189E-02 -8.3352E-02  7.7692E-10  4.8599E-10  1.2972E-11  1.5516E-16
415361  1.8037E+03 -4.3094E+02  7.1432E+02 -1.6881E+03 -3.0548E-01  2.7483E-02 -2.8952E-02 -6.0056E+02  5.7905E+02 -1.6881E+03 -4.0877E-01 -3.4828E-02 -2.8952E-02  7.1100E-10  3.0350E-10  1.2972E-11  1.7539E-16
415361  2.4085E+03 -6.1584E+02  7.4358E+02 -1.6888E+03 -3.0364E-01  6.8942E-02  2.6259E-02 -8.3262E+02  4.8879E+02 -1.6888E+03 -4.1116E-01 -2.0102E-02  2.6259E-02  6.5371E-10  2.8392E-10  1.2972E-11  1.9828E-16
415361  3.0051E+03 -7.9363E+02  7.9645E+02 -1.6576E+03 -2.9021E-01  1.0757E-01  7.8444E-02 -1.0552E+03  3.8834E+02 -1.6576E+03 -4.0537E-01 -7.1793E-03  7.8444E-02  6.1891E-10  2.1891E-10  1.2972E-11  2.2178E-16
415361  3.6065E+03 -9.6118E+02  8.7159E+02 -1.5946E+03 -2.6518E-01  1.4142E-01  1.3130E-01 -1.2676E+03  2.7693E+02 -1.5946E+03 -3.9121E-01  2.4463E-03  1.3130E-01  5.8718E-10  1.5867E-10  1.2972E-11  2.4507E-16
415361  4.2406E+03 -1.1177E+03  9.7058E+02 -1.4937E+03 -2.2646E-01  1.6930E-01  1.8654E-01 -1.4726E+03  1.5062E+02 -1.4937E+03 -3.6680E-01  7.6941E-03  1.8654E-01  5.6257E-10  1.1724E-10  1.2972E-11  2.6782E-16
415361  4.8211E+03 -1.2366E+03  1.0740E+03 -1.3713E+03 -1.8172E-01  1.8538E-01  2.3448E-01 -1.6376E+03  2.9633E+01 -1.3713E+03 -3.3702E-01  6.5823E-03  2.3448E-01  5.4231E-10  6.9595E-11  1.2972E-11  2.8600E-16
415361  5.4311E+03 -1.3314E+03  1.1895E+03 -1.2139E+03 -1.2834E-01  1.9111E-01  2.8081E-01 -1.7826E+03 -1.0019E+02 -1.2139E+03 -3.0033E-01 -1.4078E-03  2.8081E-01  5.3707E-10  4.3300E-11  1.2972E-11  3.0149E-16
415361  6.0320E+03 -1.3918E+03  1.3030E+03 -1.0328E+03 -7.2303E-02  1.8458E-01  3.2098E-01 -1.8929E+03 -2.2767E+02 -1.0328E+03 -2.6071E-01 -1.6657E-02  3.2098E-01  5.3791E-10  2.7712E-11  1.2972E-11  3.1247E-16
415361  6.6331E+03 -1.4182E+03  1.4088E+03 -8.2932E+02 -1.6012E-02  1.6519E-01  3.5514E-01 -1.9677E+03 -3.5206E+02 -8.2932E+02 -2.1971E-01 -3.9879E-02  3.5514E-01  5.3155E-10  1.7939E-11  1.2972E-11  3.1876E-16
415361  7.2223E+03 -1.4120E+03  1.4973E+03 -6.1156E+02  3.6664E-02  1.3329E-01  3.8294E-01 -2.0040E+03 -4.6830E+02 -6.1156E+02 -1.7983E-01 -7.0868E-02  3.8294E-01  5.4216E-10  1.5902E-11  1.2972E-11  3.2001E-16
415361  7.8160E+03 -1.3756E+03  1.5639E+03 -3.7749E+02  8.4720E-02  8.8938E-02  4.0450E-01 -2.0013E+03 -5.7713E+02 -3.7749E+02 -1.4141E-01 -1.0996E-01  4.0450E-01  5.5656E-10  1.1680E-11  1.2972E-11  3.1611E-16
415361  8.4129E+03 -1.3123E+03  1.6005E+03 -1.3125E+02  1.2613E-01  3.1539E-02  4.1943E-01 -1.9564E+03 -6.7538E+02 -1.3125E+02 -1.0529E-01 -1.5821E-01  4.1943E-01  5.8622E-10  9.4502E-12  1.2972E-11  3.0677E-16
415361  9.0037E+03 -1.2277E+03  1.5992E+03  1.1904E+02  1.5871E-01 -3.8059E-02  4.2655E-01 -1.8679E+03 -7.5860E+02  1.1904E+02 -7.2522E-02 -2.1557E-01  4.2655E-01  6.2551E-10  9.4088E-12  1.2972E-11  2.9197E-16
415361  9.6175E+03 -1.1228E+03  1.5505E+03  3.8079E+02  1.8098E-01 -1.2284E-01  4.2461E-01 -1.7266E+03 -8.2669E+02  3.8079E+02 -4.3217E-02 -2.8518E-01  4.2461E-01  6.8327E-10  2.6415E-12  1.2972E-11  2.7063E-16
415361  1.0203E+04 -1.0135E+03  1.4516E+03  6.2638E+02  1.8976E-01 -2.1721E-01  4.1154E-01 -1.5416E+03 -8.7054E+02  6.2638E+02 -2.0118E-02 -3.6375E-01  4.1154E-01  7.8157E-10  4.0630E-12  1.2972E-11  2.4467E-16
415378  0.0000E+00 -3.4687E+02  1.0307E+03 -1.1659E+03 -0.0000E+00 -0.0000E+00 -0.0000E+00 -3.4687E+02  1.0307E+03 -1.1659E+03 -1.4904E-01 -5.0154E-02  0.0000E+00  9.8718E-10  2.6677E-09  1.2972E-11  1.2427E-16
415378  6.1310E+02 -4.0595E+02  1.0296E+03 -1.1396E+03 -1.2405E-01 -7.6844E-03  1.0105E-01 -4.9551E+02  9.8961E+02 -1.1396E+03 -2.7292E-01 -6.6382E-02  1.0105E-01  9.7601E-10  3.4625E-10  1.2972E-11  1.2808E-16
415385  0.0000E+00 -5.4126E+02  7.0271E+02 -1.1177E+03 -0.0000E+00 -0.0000E+00 -0.0000E+00 -5.4126E+02  7.0271E+02 -1.1177E+03 -1.0161E-01 -7.8261E-02  0.0000E+00  1.0066E-09  3.4903E-09  1.2972E-11  1.2553E-16
415385  6.1176E+02 -6.1097E+02  6.7717E+02 -1.1064E+03 -1.5019E-01 -7.2341E-02  7.1503E-02 -6.6841E+02  6.2055E+02 -1.1064E+03 -2.4811E-01 -1.6068E-01  7.1503E-02  1.0044E-09  4.1948E-10  1.2972E-11  1.3604E-16
415406  0.0000E+00 -5.3514E+02  7.6722E+02 -1.1355E+03 -0.0000E+00  0.0000E+00 -0.0000E+00 -5.3514E+02  7.6722E+02 -1.1355E+03 -1.1093E-01 -7.7377E-02  0.0000E+00  1.0010E-09  2.7834E-09  1.2972E-11  1.2665E-16
415406  6.2446E+02 -5.9977E+02  7.5774E+02 -1.1668E+03 -1.6201E-01 -1.4769E-02 -5.4232E-02 -6.6565E+02  7.0057E+02 -1.1668E+03 -2.7157E-01 -1.0149E-01 -5.4232E-02  9.5292E-10  7.8979E-10  1.2972E-11  1.3954E-16
415406  1.2203E+03 -7.0328E+02  7.4812E+02 -1.1768E+03 -1.7858E-01 -1.9335E-02  2.4553E-02 -8.2368E+02  6.1306E+02 -1.1768E+03 -2.8675E-01 -1.2102E-01  2.4553E-02  9.0428E-10  3.3045E-10  1.2972E-11  1.5633E-16
415406  1.8133E+03 -8.0698E+02  7.3404E+02 -1.1363E+03 -1.6793E-01 -2.9574E-02  1.1155E-01 -9.6966E+02  4.9979E+02 -1.1363E+03 -2.7406E-01 -1.4626E-01  1.1155E-01  8.7481E-10  1.8451E-10  1.2972E-11  1.7161E-16
415406  2.4036E+03 -8.9860E+02  7.1172E+02 -1.0449E+03 -1.4046E-01 -4.7681E-02  1.9725E-01 -1.0873E+03  3.6311E+02 -1.0449E+03 -2.4337E-01 -1.7761E-01  1.9725E-01  8.7591E-10  8.9505E-11  1.2972E-11  1.8339E-16
415406  3.0076E+03 -9.7107E+02  6.7422E+02 -9.0069E+02 -9.8005E-02 -7.9086E-02  2.7955E-01 -1.1647E+03  2.0236E+02 -9.0069E+02 -1.9549E-01 -2.1949E-01  2.7955E-01  9.4058E-10  2.9709E-11  1.2972E-11  1.9014E-16
415406  3.6045E+03 -1.0149E+03  6.1365E+02 -7.1082E+02 -4.7743E-02 -1.2695E-01  3.5587E-01 -1.1857E+03  2.6845E+01 -7.1082E+02 -1.3647E-01 -2.7370E-01  3.5587E-01  1.0131E-09  1.6411E-11  1.2972E-11  1.9001E-16
415409  0.0000E+00 -3.0668E+02  6.7520E+02 -1.3952E+03 -0.0000E+00 -0.0000E+00 -0.0000E+00 -3.0668E+02  6.7520E+02 -1.3952E+03 -9.7628E-02 -4.4343E-02  0.0000E+00  9.7213E-10  3.5903E-09  1.2972E-11  1.3080E-16
415409  6.1084E+02 -3.8724E+02  6.9657E+02 -1.3753E+03 -1.8769E-01  6.2859E-02  7.3862E-02 -4.4717E+02  6.5969E+02 -1.3753E+03 -2.8841E-01  6.8678E-03  7.3862E-02  9.4039E-10  7.4925E-10  1.2972E-11  1.3800E-16
415409  1.2110E+03 -5.0527E+02  7.3958E+02 -1.3021E+03 -1.9438E-01  7.5797E-02  1.7146E-01 -6.2638E+02  6.4025E+02 -1.3021E+03 -3.0132E-01  2.7402E-03  1.7146E-01  9.2715E-10  2.9321E-10  1.2972E-11  1.4657E-16
415409  1.8095E+03 -6.1519E+02  7.8574E+02 -1.1755E+03 -1.7669E-01  8.0053E-02  2.4687E-01 -7.9750E+02  5.9987E+02 -1.1755E+03 -2.9030E-01 -8.8990E-03  2.4687E-01  9.2768E-10  4.6818E-10  1.2972E-11  1.5383E-16
415409  2.4129E+03 -7.1275E+02  8.3113E+02 -9.9922E+02 -1.3577E-01  6.4015E-02  3.3895E-01 -9.5393E+02  5.3740E+02 -9.9922E+02 -2.5595E-01 -3.9042E-02  3.3895E-01  9.3710E-10  6.2408E-11  1.2972E-11  1.5965E-16
415409  3.0085E+03 -7.7361E+02  8.5714E+02 -7.7258E+02 -6.7504E-02  1.9326E-02  4.1982E-01 -1.0628E+03  4.5130E+02 -7.7258E+02 -1.9144E-01 -9.2531E-02  4.1982E-01  9.7625E-10  4.6214E-12  1.2972E-11  1.6047E-16
415411  0.0000E+00 -3.0594E+02  7.1829E+02 -1.3681E+03 -0.0000E+00  0.0000E+00 -0.0000E+00 -3.0594E+02  7.1829E+02 -1.3681E+03 -1.0386E-01 -4.4237E-02  0.0000E+00  9.8323E-10  1.9331E-09  1.2972E-11  1.2904E-16
415411  6.1256E+02 -3.5042E+02  7.0898E+02 -1.3728E+03 -1.1827E-01 -2.4532E-02  1.0294E-02 -4.1176E+02  6.7521E+02 -1.3728E+03 -2.2079E-01 -7.5200E-02  1.0294E-02  9.4838E-10  7.7920E-10  1.2972E-11  1.3540E-16
415411  1.2053E+03 -4.3620E+02  6.9716E+02 -1.3389E+03 -1.6551E-01 -1.4551E-02  1.0679E-01 -5.5048E+02  6.1096E+02 -1.3389E+03 -2.6631E-01 -7.7622E-02  1.0679E-01  9.3423E-10  4.9821E-10  1.2972E-11  1.4327E-16
415411  1.8060E+03 -5.3609E+02  6.8823E+02 -1.2433E+03 -1.6201E-01 -1.1693E-02  2.0240E-01 -6.9560E+02  5.2649E+02 -1.2433E+03 -2.6152E-01 -8.9206E-02  2.0240E-01  9.6855E-10  6.6542E-10  1.2972E-11  1.5011E-16
415411  2.4026E+03 -6.5073E+02  6.8110E+02 -1.1084E+03 -2.1273E-01 -2.1604E-02  2.6795E-01 -8.4373E+02  4.1887E+02 -1.1084E+03 -3.1121E-01 -1.1569E-01  2.6795E-01  9.7674E-10  2.9877E-10  1.2972E-11  1.5811E-16
415411  3.0014E+03 -7.6709E+02  6.6134E+02 -9.1668E+02 -1.6875E-01 -4.7344E-02  3.6975E-01 -9.7407E+02  2.7749E+02 -9.1668E+02 -2.6437E-01 -1.5826E-01  3.6975E-01  1.0195E-09  3.1293E-11  1.2972E-11  1.6482E-16
415412  0.0000E+00 -4.0689E+01  7.6935E+02 -1.5494E+03 -0.0000E+00 -0.0000E+00 -0.0000E+00 -4.0689E+01  7.6935E+02 -1.5494E+03 -1.1124E-01 -5.8833E-03  0.0000E+00  9.1118E-10  3.2528E-09  1.2972E-11  1.3440E-16
415412  6.0376E+02 -1.2436E+02  7.4863E+02 -1.5909E+03 -2.3960E-01 -3.6110E-02 -9.8000E-02 -1.8915E+02  7.3494E+02 -1.5909E+03 -3.4785E-01 -5.4091E-02 -9.8000E-02  8.5425E-10  1.0290E-09  1.2972E-11  1.4124E-16
415412  1.2148E+03 -2.9307E+02  7.3718E+02 -1.6364E+03 -2.9696E-01  3.4836E-04 -4.5599E-02 -4.1738E+02  6.7463E+02 -1.6364E+03 -4.0355E-01 -4.2027E-02 -4.5599E-02  7.5414E-10  3.7119E-10  1.2972E-11  1.5667E-16
415412  1.8163E+03 -4.7520E+02  7.5025E+02 -1.6458E+03 -3.0453E-01  4.2652E-02  1.4240E-02 -6.5368E+02  6.0115E+02 -1.6458E+03 -4.1301E-01 -2.6058E-02  1.4240E-02  7.0708E-10  2.8255E-10  1.2972E-11  1.7610E-16
415412  2.4384E+03 -6.6303E+02  7.8986E+02 -1.6189E+03 -2.9703E-01  8.4353E-02  7.1631E-02 -8.9499E+02  5.1232E+02 -1.6189E+03 -4.1124E-01 -1.1515E-02  7.1631E-02  6.6902E-10  2.7635E-10  1.2972E-11  1.9841E-16
415412  3.0110E+03 -8.2864E+02  8.4813E+02 -1.5629E+03 -2.7970E-01  1.1816E-01  1.2396E-01 -1.1090E+03  4.1955E+02 -1.5629E+03 -4.0233E-01 -1.6547E-03  1.2396E-01  6.3518E-10  2.2888E-10  1.2972E-11  2.1960E-16
415412  3.6087E+03 -9.8777E+02  9.2770E+02 -1.4724E+03 -2.5075E-01  1.4673E-01  1.7907E-01 -1.3187E+03  3.1192E+02 -1.4724E+03 -3.8489E-01  3.9073E-03  1.7907E-01  6.0926E-10  1.5167E-10  1.2972E-11  2.4107E-16
415412  4.2110E+03 -1.1268E+03  1.0223E+03 -1.3478E+03 -2.0887E-01  1.6546E-01  2.3394E-01 -1.5091E+03  1.9410E+02 -1.3478E+03 -3.5669E-01  2.5269E-03  2.3394E-01  5.8689E-10  9.0647E-11  1.2972E-11  2.6073E-16
415412  4.8308E+03 -1.2402E+03  1.1279E+03 -1.1864E+03 -1.5539E-01  1.7291E-01  2.8595E-01 -1.6751E+03  6.6233E+01 -1.1864E+03 -3.1848E-01 -6.4096E-03  2.8595E-01  5.7435E-10  4.7004E-11  1.2972E-11  2.7755E-16
415412  5.4157E+03 -1.3151E+03  1.2281E+03 -1.0063E+03 -1.0036E-01  1.6741E-01  3.2913E-01 -1.7984E+03 -5.7370E+01 -1.0063E+03 -2.7793E-01 -2.2748E-02  3.2913E-01  5.6859E-10  2.8237E-11  1.2972E-11  2.8936E-16
415412  6.0024E+03 -1.3574E+03  1.3215E+03 -8.0201E+02 -4.3963E-02  1.4908E-01  3.6612E-01 -1.8858E+03 -1.8137E+02 -8.0201E+02 -2.3504E-01 -4.7191E-02  3.6612E-01  5.7666E-10  1.9381E-11  1.2972E-11  2.9668E-16
415412  6.6184E+03 -1.3668E+03  1.4039E+03 -5.6636E+02  1.2934E-02  1.1614E-01  3.9757E-01 -1.9349E+03 -3.0861E+02 -5.6636E+02 -1.9006E-01 -8.1478E-02  3.9757E-01  5.7990E-10  1.4200E-11  1.2972E-11  2.9903E-16
415412  7.2015E+03 -1.3445E+03  1.4592E+03 -3.2759E+02  6.2552E-02  7.1221E-02  4.2023E-01 -1.9385E+03 -4.2330E+02 -3.2759E+02 -1.4843E-01 -1.2318E-01  4.2023E-01  5.9905E-10  1.0545E-11  1.2972E-11  2.9594E-16
415412  7.8171E+03 -1.2917E+03  1.4849E+03 -6.3651E+01  1.0786E-01  9.8358E-03  4.3599E-01 -1.8939E+03 -5.3519E+02 -6.3651E+01 -1.0684E-01 -1.7693E-01  4.3599E-01  6.4190E-10  1.1755E-11  1.2972E-11  2.8679E-16
415412  8.4004E+03 -1.2184E+03  1.4704E+03  1.9285E+02  1.4196E-01 -6.1690E-02  4.4206E-01 -1.8030E+03 -6.2918E+02  1.9285E+02 -7.0654E-02 -2.3786E-01  4.4206E-01  6.7601E-10  6.8852E-12  1.2972E-11  2.7235E-16
415412  9.0081E+03 -1.1241E+03  1.4068E+03  4.6080E+02  1.6618E-01 -1.5025E-01  4.3788E-01 -1.6545E+03 -7.1098E+02  4.6080E+02 -3.7230E-02 -3.1279E-01  4.3788E-01  7.5609E-10  3.9736E-12  1.2972E-11  2.5128E-16
415412  9.6056E+03 -1.0207E+03  1.2871E+03  7.1807E+02  1.7807E-01 -2.5356E-01  4.2086E-01 -1.4505E+03 -7.7103E+02  7.1807E+02 -8.0275E-03 -4.0115E-01  4.2086E-01  8.8093E-10  2.7560E-12  1.2972E-11  2.2471E-16
415480  0.0000E+00 -2.3907E+02  5.8619E+02 -1.4620E+03 -0.0000E+00 -0.0000E+00 -0.0000E+00 -2.3907E+02  5.8619E+02 -1.4620E+03 -8.4758E-02 -3.4568E-02  0.0000E+00  9.7225E-10  1.9582E-09  1.2972E-11  1.3211E-16
415480  6.1844E+02 -2.5091E+02  5.6350E+02 -1.4883E+03 -3.1306E-02 -6.7070E-02 -4.5825E-02 -3.0023E+02  5.3885E+02 -1.4883E+03 -1.1278E-01 -1.0335E-01 -4.5825E-02  9.4911E-10  6.1409E-10  1.2972E-11  1.3777E-16
415480  1.2158E+03 -2.7231E+02  5.1520E+02 -1.5019E+03 -4.6980E-02 -9.1693E-02 -1.6632E-03 -3.5822E+02  4.5963E+02 -1.5019E+03 -1.2147E-01 -1.3107E-01 -1.6632E-03  9.4690E-10  7.4236E-10  1.2972E-11  1.4341E-16
415480  1.8199E+03 -3.2007E+02  4.5201E+02 -1.4972E+03 -1.1402E-01 -1.2306E-01  2.7347E-02 -4.2663E+02  3.5320E+02 -1.4972E+03 -1.7938E-01 -1.6934E-01  2.7347E-02  9.2958E-10  7.3724E-10  1.2972E-11  1.5007E-16
415480  2.4107E+03 -4.0103E+02  3.6922E+02 -1.4557E+03 -1.5328E-01 -1.5413E-01  1.2038E-01 -5.0302E+02  2.1004E+02 -1.4557E+03 -2.0667E-01 -2.1212E-01  1.2038E-01  9.5523E-10  2.3627E-10  1.2972E-11  1.5717E-16
415480  3.0036E+03 -4.9403E+02  2.7306E+02 -1.3498E+03 -1.5638E-01 -1.6845E-01  2.3799E-01 -5.6306E+02  3.9843E+01 -1.3498E+03 -1.9586E-01 -2.3989E-01  2.3799E-01  1.0064E-09  4.3719E-11  1.2972E-11  1.6089E-16
415483  0.0000E+00 -2.5444E+02  5.9759E+02 -1.4575E+03 -0.0000E+00 -0.0000E+00 -0.0000E+00 -2.5444E+02  5.9759E+02 -1.4575E+03 -8.6407E-02 -3.6789E-02  0.0000E+00  9.7225E-10  1.6424E-09  1.2972E-11  1.3258E-16
415483  6.0566E+02 -2.7450E+02  5.8923E+02 -1.4778E+03 -5.6975E-02 -2.8304E-02 -5.8133E-02 -3.2499E+02  5.6297E+02 -1.4778E+03 -1.4217E-01 -6.7995E-02 -5.8133E-02  9.6159E-10  1.3361E-09  1.2972E-11  1.3834E-16
415483  1.2056E+03 -3.2031E+02  5.6821E+02 -1.5191E+03 -9.9931E-02 -4.2796E-02 -7.3000E-02 -4.1400E+02  5.0405E+02 -1.5191E+03 -1.8209E-01 -8.9111E-02 -7.3000E-02  8.8257E-10  9.1712E-10  1.2972E-11  1.4825E-16
415483  1.8032E+03 -3.9408E+02  5.3862E+02 -1.5559E+03 -1.4744E-01 -5.5253E-02 -4.5396E-02 -5.1961E+02  4.1883E+02 -1.5559E+03 -2.2532E-01 -1.1223E-01 -4.5396E-02  8.4023E-10  6.3251E-10  1.2972E-11  1.6104E-16
415483  2.4004E+03 -4.9400E+02  5.0380E+02 -1.5692E+03 -1.8483E-01 -6.0631E-02  3.0393E-03 -6.3591E+02  3.0573E+02 -1.5692E+03 -2.5768E-01 -1.3206E-01  3.0393E-03  8.1665E-10  5.0893E-10  1.2972E-11  1.7545E-16
415483  3.0101E+03 -6.1590E+02  4.6647E+02 -1.5498E+03 -2.1381E-01 -6.0855E-02  6.2087E-02 -7.5515E+02  1.6331E+02 -1.5498E+03 -2.8126E-01 -1.4991E-01  6.2087E-02  7.7407E-10  4.2113E-10  1.2972E-11  1.9070E-16
415483  3.6067E+03 -7.4942E+02  4.3145E+02 -1.4927E+03 -2.3113E-01 -5.5765E-02  1.3158E-01 -8.6474E+02  7.4373E-01 -1.4927E+03 -2.9351E-01 -1.6413E-01  1.3158E-01  7.8511E-10  2.8612E-10  1.2972E-11  2.0510E-16
415483  4.2253E+03 -8.9395E+02  3.9981E+02 -1.3861E+03 -2.3320E-01 -4.6184E-02  2.1491E-01 -9.6159E+02 -1.8531E+02 -1.3861E+03 -2.9101E-01 -1.7544E-01  2.1491E-01  8.1066E-10  1.8839E-10  1.2972E-11  2.1780E-16
415483  4.8073E+03 -1.0258E+03  3.7535E+02 -1.2361E+03 -2.1666E-01 -3.8998E-02  3.0091E-01 -1.0282E+03 -3.6872E+02 -1.2361E+03 -2.7094E-01 -1.8732E-01  3.0091E-01  8.5247E-10  1.1455E-10  1.2972E-11  2.2599E-16
415483  5.4044E+03 -1.1445E+03  3.5185E+02 -1.0293E+03 -1.7722E-01 -4.2145E-02  3.9128E-01 -1.0603E+03 -5.5630E+02 -1.0293E+03 -2.2809E-01 -2.0763E-01  3.9128E-01  9.1660E-10  4.8753E-11  1.2972E-11  2.2871E-16
415483  6.0010E+03 -1.2336E+03  3.2128E+02 -7.7023E+02 -1.1841E-01 -6.4082E-02  4.7569E-01 -1.0427E+03 -7.3327E+02 -7.7023E+02 -1.6487E-01 -2.4244E-01  4.7569E-01  1.0000E-09  1.2330E-11  1.2972E-11  2.2384E-16
415492  0.0000E+00 -5.4787E+02  7.8113E+02 -1.1117E+03 -0.0000E+00 -0.0000E+00 -0.0000E+00 -5.4787E+02  7.8113E+02 -1.1117E+03 -1.1294E-01 -7.9217E-02  0.0000E+00  1.0038E-09  2.1997E-09  1.2972E-11  1.2601E-16
415492  6.0508E+02 -5.9312E+02  7.6946E+02 -1.0718E+03 -8.9598E-02 -3.2339E-02  1.3116E-01 -6.5809E+02  7.1469E+02 -1.0718E+03 -2.0086E-01 -1.1810E-01  1.3116E-01  9.9229E-10  2.2910E-10  1.2972E-11  1.3204E-16
415503  0.0000E+00 -1.4549E+02  4.6252E+02 -1.5203E+03 -0.0000E+00 -0.0000E+00 -0.0000E+00 -1.4549E+02  4.6252E+02 -1.5203E+03 -6.6876E-02 -2.1036E-02  0.0000E+00  9.6679E-10  2.6205E-09  1.2972E-11  1.3229E-16
415503  6.0418E+02 -2.0346E+02  4.3889E+02 -1.5480E+03 -1.5767E-01 -7.1146E-02 -5.7565E-02 -2.4097E+02  4.1947E+02 -1.5480E+03 -2.2113E-01 -1.0056E-01 -5.7565E-02  9.2164E-10  8.0196E-10  1.2972E-11  1.4010E-16
415503  1.2001E+03 -3.1332E+02  3.9196E+02 -1.5688E+03 -2.0743E-01 -8.1136E-02 -7.4084E-03 -3.7628E+02  3.3198E+02 -1.5688E+03 -2.6410E-01 -1.2644E-01 -7.4084E-03  9.0213E-10  4.8565E-10  1.2972E-11  1.5260E-16
415503  1.8031E+03 -4.4856E+02  3.4408E+02 -1.5501E+03 -2.3800E-01 -7.6028E-02  7.2625E-02 -5.2209E+02  2.1683E+02 -1.5501E+03 -2.8776E-01 -1.4089E-01  7.2625E-02  8.6363E-10  3.1948E-10  1.2972E-11  1.6637E-16
415503  2.4047E+03 -5.9681E+02  3.0111E+02 -1.4786E+03 -2.5107E-01 -6.7160E-02  1.6623E-01 -6.6369E+02  7.9733E+01 -1.4786E+03 -2.9461E-01 -1.5345E-01  1.6623E-01  8.8457E-10  2.1615E-10  1.2972E-11  1.7936E-16
415503  3.0064E+03 -7.4664E+02  2.6416E+02 -1.3486E+03 -2.4503E-01 -5.4393E-02  2.6742E-01 -7.8845E+02 -7.4845E+01 -1.3486E+03 -2.8323E-01 -1.6235E-01  2.6742E-01  9.1705E-10  1.6243E-10  1.2972E-11  1.8984E-16
415503  3.6009E+03 -8.8604E+02  2.3543E+02 -1.1567E+03 -2.1884E-01 -4.4870E-02  3.7983E-01 -8.8575E+02 -2.3653E+02 -1.1567E+03 -2.5288E-01 -1.7298E-01  3.7983E-01  1.0065E-09  3.0741E-11  1.2972E-11  1.9601E-16
415586  0.0000E+00 -3.1899E+02  9.4681E+02 -1.2178E+03 -0.0000E+00 -0.0000E+00 -0.0000E+00 -3.1899E+02  9.4681E+02 -1.2178E+03 -1.3690E-01 -4.6123E-02  0.0000E+00  9.8107E-10  8.0113E-10  1.2972E-11  1.2365E-16
415591  0.0000E+00 -4.9356E+02  6.3084E+02 -1.2428E+03 -0.0000E+00 -0.0000E+00 -0.0000E+00 -4.9356E+02  6.3084E+02 -1.2428E+03 -9.1213E-02 -7.1365E-02  0.0000E+00  1.0045E-09  5.4485E-09  1.2972E-11  1.3122E-16
415591  6.0671E+02 -6.1135E+02  6.0683E+02 -1.2570E+03 -2.8110E-01 -4.6950E-02 -1.0020E-02 -6.6217E+02  5.5093E+02 -1.2570E+03 -3.6884E-01 -1.3535E-01 -1.0020E-02  9.4245E-10  7.5547E-10  1.2972E-11  1.4754E-16
415591  1.2174E+03 -7.9329E+02  5.7905E+02 -1.2369E+03 -3.0376E-01 -4.2739E-02  7.8241E-02 -8.8243E+02  4.3119E+02 -1.2369E+03 -3.8748E-01 -1.5744E-01  7.8241E-02  8.9463E-10  2.7340E-10  1.2972E-11  1.7111E-16
415591  1.8055E+03 -9.6813E+02  5.5658E+02 -1.1647E+03 -2.8657E-01 -3.3734E-02  1.6628E-01 -1.0790E+03  2.8785E+02 -1.1647E+03 -3.6705E-01 -1.7372E-01  1.6628E-01  8.4886E-10  1.1209E-10  1.2972E-11  1.9322E-16
415591  2.4117E+03 -1.1309E+03  5.3829E+02 -1.0379E+03 -2.4796E-01 -2.8020E-02  2.5065E-01 -1.2468E+03  1.1948E+02 -1.0379E+03 -3.2579E-01 -1.9154E-01  2.5065E-01  8.3472E-10  5.2501E-11  1.2972E-11  2.1257E-16
415591  3.0093E+03 -1.2647E+03  5.2078E+02 -8.6554E+02 -1.9820E-01 -3.2609E-02  3.2487E-01 -1.3664E+03 -6.0834E+01 -8.6554E+02 -2.7350E-01 -2.1547E-01  3.2487E-01  8.6316E-10  2.8668E-11  1.2972E-11  2.2646E-16
415591  3.6101E+03 -1.3665E+03  4.9631E+02 -6.5024E+02 -1.3989E-01 -5.1738E-02  3.8997E-01 -1.4320E+03 -2.5115E+02 -6.5024E+02 -2.1165E-01 -2.4933E-01  3.8997E-01  8.6864E-10  3.3126E-11  1.2972E-11  2.3406E-16
415591  4.2047E+03 -1.4312E+03  4.5603E+02 -4.0208E+02 -7.7215E-02 -8.6431E-02  4.4274E-01 -1.4353E+03 -4.4321E+02 -4.0208E+02 -1.4315E-01 -2.9338E-01  4.4274E-01  9.1673E-10  1.5817E-11  1.2972E-11  2.3444E-16
415591  4.8042E+03 -1.4579E+03  3.8949E+02 -1.2372E+02 -1.1585E-02 -1.3875E-01  4.8394E-01 -1.3694E+03 -6.3399E+02 -1.2372E+02 -6.7902E-02 -3.4956E-01  4.8394E-01  9.7430E-10  9.5713E-12  1.2972E-11  2.2706E-16
415604  0.0000E+00 -4.4795E+02  5.6886E+02 -1.2988E+03 -0.0000E+00  0.0000E+00 -0.0000E+00 -4.4795E+02  5.6886E+02 -1.2988E+03 -8.2253E-02 -6.4770E-02  0.0000E+00  1.0025E-09  1.6818E-09  1.2972E-11  1.3241E-16
415604  6.0782E+02 -4.8554E+02  5.5163E+02 -1.3191E+03 -1.3094E-01 -5.4611E-02 -7.3557E-02 -5.3209E+02  5.0689E+02 -1.3191E+03 -2.1070E-01 -1.2482E-01 -7.3557E-02  9.7748E-10  1.7475E-09  1.2972E-11  1.4144E-16
415604  1.2056E+03 -5.9543E+02  5.1147E+02 -1.3608E+03 -2.2391E-01 -7.7875E-02 -5.0809E-02 -6.7512E+02  4.0045E+02 -1.3608E+03 -2.9787E-01 -1.6397E-01 -5.0809E-02  9.0978E-10  7.7966E-10  1.2972E-11  1.6000E-16
415604  1.8071E+03 -7.4234E+02  4.6144E+02 -1.3697E+03 -2.5678E-01 -8.4472E-02  2.5076E-02 -8.3634E+02  2.5401E+02 -1.3697E+03 -3.2350E-01 -1.9181E-01  2.5076E-02  8.4962E-10  3.3004E-10  1.2972E-11  1.8190E-16
415604  2.4196E+03 -9.0156E+02  4.1215E+02 -1.3270E+03 -2.5951E-01 -7.5015E-02  1.1497E-01 -9.8822E+02  7.8168E+01 -1.3270E+03 -3.1911E-01 -2.0537E-01  1.1497E-01  8.3817E-10  1.7606E-10  1.2972E-11  2.0309E-16
415604  3.0217E+03 -1.0541E+03  3.7053E+02 -1.2306E+03 -2.4383E-01 -6.3458E-02  2.0524E-01 -1.1119E+03 -1.1031E+02 -1.2306E+03 -2.9740E-01 -2.1587E-01  2.0524E-01  8.4968E-10  1.1454E-10  1.2972E-11  2.2046E-16
415604  3.6042E+03 -1.1875E+03  3.3565E+02 -1.0857E+03 -2.1119E-01 -5.7897E-02  2.9145E-01 -1.1970E+03 -3.0012E+02 -1.0857E+03 -2.5972E-01 -2.2960E-01  2.9145E-01  8.6620E-10  5.7281E-11  1.2972E-11  2.3231E-16
415604  4.2053E+03 -1.3005E+03  2.9951E+02 -8.8520E+02 -1.6230E-01 -6.5113E-02  3.7470E-01 -1.2385E+03 -4.9708E+02 -8.8520E+02 -2.0561E-01 -2.5315E-01  3.7470E-01  9.1653E-10  3.4120E-11  1.2972E-11  2.3793E-16
415604  4.8057E+03 -1.3799E+03  2.5365E+02 -6.3731E+02 -9.9637E-02 -9.0907E-02  4.4869E-01 -1.2223E+03 -6.8866E+02 -6.3731E+02 -1.3631E-01 -2.9042E-01  4.4869E-01  9.8686E-10  1.5623E-11  1.2972E-11  2.3560E-16
415611  0.0000E+00 -2.0778E+01  7.6218E+02 -1.5697E+03 -0.0000E+00 -0.0000E+00 -0.0000E+00 -2.0778E+01  7.6218E+02 -1.5697E+03 -1.1020E-01 -3.0043E-03  0.0000E+00  9.1734E-10  3.3287E-09  1.2972E-11  1.3539E-16
415611  6.1273E+02 -1.0210E+02  7.4320E+02 -1.6240E+03 -2.2645E-01 -3.8309E-02 -1.3972E-01 -1.6745E+02  7.3125E+02 -1.6240E+03 -3.3391E-01 -5.3071E-02 -1.3972E-01  8.3511E-10  1.2230E-09  1.2972E-11  1.4296E-16
415611  1.2195E+03 -2.6129E+02  7.2876E+02 -1.7032E+03 -2.8419E-01 -6.2038E-03 -1.1084E-01 -3.8507E+02  6.7163E+02 -1.7032E+03 -3.8956E-01 -4.3984E-02 -1.1084E-01  7.2601E-10  4.2914E-10  1.2972E-11  1.6002E-16
415611  1.8040E+03 -4.3148E+02  7.3688E+02 -1.7529E+03 -2.9495E-01  3.4255E-02 -5.8537E-02 -6.0692E+02  6.0068E+02 -1.7529E+03 -4.0150E-01 -2.8134E-02 -5.8537E-02  6.6936E-10  2.8492E-10  1.2972E-11  1.8076E-16
415611  2.4039E+03 -6.0761E+02  7.6981E+02 -1.7719E+03 -2.9000E-01  7.5429E-02 -5.2556E-03 -8.3349E+02  5.1681E+02 -1.7719E+03 -4.0131E-01 -1.2425E-02 -5.2556E-03  6.1158E-10  2.3306E-10  1.2972E-11  2.0409E-16
415611  3.0082E+03 -7.7851E+02  8.2727E+02 -1.7596E+03 -2.7412E-01  1.1437E-01  4.5759E-02 -1.0546E+03  4.2220E+02 -1.7596E+03 -3.9373E-01  1.8012E-03  4.5759E-02  5.6500E-10  1.8839E-10  1.2972E-11  2.2815E-16
415611  3.6338E+03 -9.4206E+02  9.1022E+02 -1.7148E+03 -2.4710E-01  1.4979E-01  9.6923E-02 -1.2715E+03  3.1493E+02 -1.7148E+03 -3.7871E-01  1.3571E-02  9.6923E-02  5.4607E-10  1.3878E-10  1.2972E-11  2.5247E-16
415611  4.2362E+03 -1.0807E+03  1.0091E+03 -1.6418E+03 -2.1195E-01  1.7736E-01  1.4521E-01 -1.4644E+03  2.0433E+02 -1.6418E+03 -3.5786E-01  2.1105E-02  1.4521E-01  5.1289E-10  1.1564E-10  1.2972E-11  2.7429E-16
415611  4.8358E+03 -1.1956E+03  1.1218E+03 -1.5409E+03 -1.7000E-01  1.9690E-01  1.9110E-01 -1.6370E+03  8.9052E+01 -1.5409E+03 -3.3219E-01  2.4028E-02  1.9110E-01  5.0408E-10  8.0111E-11  1.2972E-11  2.9370E-16
415611  5.4275E+03 -1.2822E+03  1.2416E+03 -1.4151E+03 -1.2189E-01  2.0641E-01  2.3375E-01 -1.7846E+03 -2.7556E+01 -1.4151E+03 -3.0142E-01  2.1021E-02  2.3375E-01  4.9071E-10  5.4291E-11  1.2972E-11  3.0987E-16
415611  6.0066E+03 -1.3383E+03  1.3614E+03 -1.2684E+03 -7.1851E-02  2.0552E-01  2.7209E-01 -1.9038E+03 -1.4225E+02 -1.2684E+03 -2.6869E-01  1.2002E-02  2.7209E-01  4.8503E-10  3.9187E-11  1.2972E-11  3.2229E-16
415611  6.6160E+03 -1.3657E+03  1.4833E+03 -1.0913E+03 -1.8008E-02  1.9255E-01  3.0851E-01 -1.9993E+03 -2.6130E+02 -1.0913E+03 -2.3248E-01 -4.9238E-03  3.0851E-01  4.8497E-10  2.9326E-11  1.2972E-11  3.3126E-16
415611  7.2211E+03 -1.3607E+03  1.5930E+03 -8.9491E+02  3.4063E-02  1.6793E-01  3.3985E-01 -2.0611E+03 -3.7556E+02 -8.9491E+02 -1.9628E-01 -2.8824E-02  3.3985E-01  4.9170E-10  1.3532E-11  1.2972E-11  3.3563E-16
415611  7.8294E+03 -1.3249E+03  1.6843E+03 -6.7981E+02  8.2779E-02  1.3017E-01  3.6651E-01 -2.0876E+03 -4.8398E+02 -6.7981E+02 -1.6075E-01 -6.1404E-02  3.6651E-01  5.0381E-10  1.3125E-11  1.2972E-11  3.3513E-16
415611  8.4195E+03 -1.2635E+03  1.7474E+03 -4.5718E+02  1.2452E-01  8.1792E-02  3.8724E-01 -2.0767E+03 -5.8059E+02 -4.5718E+02 -1.2814E-01 -1.0089E-01  3.8724E-01  5.2707E-10  8.0926E-12  1.2972E-11  3.2967E-16
415611  9.0071E+03 -1.1799E+03  1.7784E+03 -2.2490E+02  1.5857E-01  2.1775E-02  4.0230E-01 -2.0276E+03 -6.6593E+02 -2.2490E+02 -9.8568E-02 -1.4882E-01  4.0230E-01  5.5913E-10  7.4440E-12  1.2972E-11  3.1912E-16
415611  9.6081E+03 -1.0763E+03  1.7699E+03  1.9847E+01  1.8414E-01 -5.1875E-02  4.1089E-01 -1.9352E+03 -7.3909E+02  1.9847E+01 -7.1782E-02 -2.0750E-01  4.1089E-01  5.9554E-10  5.6361E-12  1.2972E-11  3.0278E-16
415611  1.0200E+04 -9.6272E+02  1.7150E+03  2.6365E+02  1.9778E-01 -1.3580E-01  4.1124E-01 -1.7993E+03 -7.9401E+02  2.6365E+02 -5.0195E-02 -2.7500E-01  4.1124E-01  6.6053E-10  7.3039E-12  1.2972E-11  2.8100E-16
415611  1.0808E+04 -8.4160E+02  1.6030E+03  5.1103E+02  1.9832E-01 -2.3509E-01  4.0059E-01 -1.6098E+03 -8.2865E+02  5.1103E+02 -3.3467E-02 -3.5678E-01  4.0059E-01  7.6436E-10  1.9101E-12  1.2972E-11  2.5264E-16
415612  0.0000E+00 -2.4688E+01  7.4210E+02 -1.5619E+03 -0.0000E+00 -0.0000E+00 -0.0000E+00 -2.4688E+01  7.4210E+02 -1.5619E+03 -1.0730E-01 -3.5696E-03  0.0000E+00  9.1734E-10  2.9441E-09  1.2972E-11  1.3441E-16
415612  6.0223E+02 -1.0012E+02  7.2392E+02 -1.6014E+03 -2.2242E-01 -4.5166E-02 -1.1024E-01 -1.6269E+02  7.1247E+02 -1.6014E+03 -3.2709E-01 -5.9642E-02 -1.1024E-01  8.7155E-10  1.5028E-09  1.2972E-11  1.4077E-16
415612  1.2016E+03 -2.6167E+02  7.0259E+02 -1.6627E+03 -2.9812E-01 -1.9844E-02 -8.1759E-02 -3.7918E+02  6.4678E+02 -1.6627E+03 -3.9971E-01 -5.7679E-02 -8.1759E-02  7.7635E-10  4.8598E-10  1.2972E-11  1.5644E-16
415612  1.8210E+03 -4.5352E+02  7.0400E+02 -1.6967E+03 -3.1662E-01  2.4936E-02 -2.7270E-02 -6.2112E+02  5.6170E+02 -1.6967E+03 -4.1841E-01 -4.0640E-02 -2.7270E-02  6.9223E-10  3.3735E-10  1.2972E-11  1.7808E-16
415612  2.4184E+03 -6.4311E+02  7.3210E+02 -1.6972E+03 -3.1568E-01  6.8846E-02  2.5387E-02 -8.5500E+02  4.6747E+02 -1.6972E+03 -4.2154E-01 -2.4142E-02  2.5387E-02  6.4486E-10  2.7302E-10  1.2972E-11  2.0170E-16
415612  3.0092E+03 -8.2620E+02  7.8477E+02 -1.6670E+03 -3.0219E-01  1.0884E-01  7.6779E-02 -1.0800E+03  3.6341E+02 -1.6670E+03 -4.1567E-01 -1.0623E-02  7.6779E-02  5.9884E-10  2.1020E-10  1.2972E-11  2.2604E-16
415612  3.6473E+03 -1.0110E+03  8.6673E+02 -1.6004E+03 -2.7477E-01  1.4708E-01  1.3200E-01 -1.3099E+03  2.4015E+02 -1.6004E+03 -4.0009E-01  8.9715E-04  1.3200E-01  5.7326E-10  1.4655E-10  1.2972E-11  2.5188E-16
415612  4.2246E+03 -1.1598E+03  9.5995E+02 -1.5099E+03 -2.3964E-01  1.7463E-01  1.8104E-01 -1.5006E+03  1.2116E+02 -1.5099E+03 -3.7845E-01  6.9352E-03  1.8104E-01  5.4834E-10  1.1251E-10  1.2972E-11  2.7366E-16
415612  4.8161E+03 -1.2883E+03  1.0695E+03 -1.3885E+03 -1.9341E-01  1.9406E-01  2.2865E-01 -1.6744E+03 -5.8937E+00 -1.3885E+03 -3.4804E-01  7.7829E-03  2.2865E-01  5.2808E-10  6.4198E-11  1.2972E-11  2.9344E-16
415612  5.4048E+03 -1.3871E+03  1.1870E+03 -1.2410E+03 -1.4147E-01  2.0335E-01  2.7165E-01 -1.8207E+03 -1.3442E+02 -1.2410E+03 -3.1309E-01  2.7870E-03  2.7165E-01  5.1616E-10  4.3606E-11  1.2972E-11  3.0977E-16
415612  6.0111E+03 -1.4557E+03  1.3103E+03 -1.0643E+03 -8.4440E-02  2.0137E-01  3.1060E-01 -1.9404E+03 -2.6611E+02 -1.0643E+03 -2.7389E-01 -9.1175E-03  3.1060E-01  5.0358E-10  2.8325E-11  1.2972E-11  3.2251E-16
415612  6.6165E+03 -1.4894E+03  1.4285E+03 -8.6596E+02 -2.6999E-02  1.8709E-01  3.4360E-01 -2.0257E+03 -3.9416E+02 -8.6596E+02 -2.3355E-01 -2.8264E-02  3.4360E-01  4.9823E-10  2.1005E-11  1.2972E-11  3.3070E-16
415612  7.2018E+03 -1.4895E+03  1.5311E+03 -6.5693E+02  2.6269E-02  1.6168E-01  3.6982E-01 -2.0738E+03 -5.1217E+02 -6.5693E+02 -1.9512E-01 -5.3685E-02  3.6982E-01  5.0444E-10  1.6112E-11  1.2972E-11  3.3402E-16
415612  7.8149E+03 -1.4573E+03  1.6189E+03 -4.2328E+02  7.7595E-02  1.2266E-01  3.9144E-01 -2.0860E+03 -6.2720E+02 -4.2328E+02 -1.5649E-01 -8.8053E-02  3.9144E-01  5.1360E-10  1.5069E-11  1.2972E-11  3.3244E-16
415612  8.4154E+03 -1.3973E+03  1.6780E+03 -1.8341E+02  1.2111E-01  7.2271E-02  4.0622E-01 -2.0583E+03 -7.2891E+02 -1.8341E+02 -1.2152E-01 -1.2976E-01  4.0622E-01  5.3033E-10  1.1928E-11  1.2972E-11  3.2573E-16
415612  9.0073E+03 -1.3149E+03  1.7033E+03  5.9716E+01  1.5559E-01  1.1407E-02  4.1404E-01 -1.9910E+03 -8.1606E+02  5.9716E+01 -9.0688E-02 -1.7871E-01  4.1404E-01  5.5564E-10  6.6117E-12  1.2972E-11  3.1397E-16
415612  9.6118E+03 -1.2128E+03  1.6887E+03  3.1047E+02  1.8022E-01 -6.1733E-02  4.1415E-01 -1.8794E+03 -8.8900E+02  3.1047E+02 -6.3950E-02 -2.3710E-01  4.1415E-01  6.0392E-10  5.3716E-12  1.2972E-11  2.9667E-16
415612  1.0210E+04 -1.1007E+03  1.6275E+03  5.5573E+02  1.9258E-01 -1.4477E-01  4.0483E-01 -1.7241E+03 -9.4212E+02  5.5573E+02 -4.2731E-02 -3.0393E-01  4.0483E-01  6.5401E-10  3.5498E-12  1.2972E-11  2.7432E-16
415612  1.0805E+04 -9.8576E+02  1.5140E+03  7.9110E+02  1.9122E-01 -2.3821E-01  3.8350E-01 -1.5223E+03 -9.7285E+02  7.9110E+02 -2.7694E-02 -3.8075E-01  3.8350E-01  7.5237E-10  1.8102E-12  1.2972E-11  2.4704E-16
415612  1.1400E+04 -8.7648E+02  1.3412E+03  1.0084E+03  1.7206E-01 -3.4452E-01  3.4181E-01 -1.2693E+03 -9.7776E+02  1.0084E+03 -2.1870E-02 -4.7125E-01  3.4181E-01  8.6499E-10  3.4332E-12  1.2972E-11  2.1526E-16
415613  0.0000E+00 -3.4156E+01  7.4715E+02 -1.5522E+03 -0.0000E+00 -0.0000E+00 -0.0000E+00 -3.4156E+01  7.4715E+02 -1.5522E+03 -1.0803E-01 -4.9386E-03  0.0000E+00  9.1734E-10  2.4167E-09  1.2972E-11  1.3397E-16
415613  6.0456E+02 -1.0272E+02  7.2976E+02 -1.5898E+03 -2.1882E-01 -4.6066E-02 -1.0633E-01 -1.6604E+02  7.1801E+02 -1.5898E+03 -3.2434E-01 -6.0919E-02 -1.0633E-01  8.7155E-10  1.5028E-09  1.2972E-11  1.4006E-16
415613  1.2248E+03 -2.6879E+02  7.0786E+02 -1.6499E+03 -2.9645E-01 -1.9056E-02 -7.4392E-02 -3.8929E+02  6.4943E+02 -1.6499E+03 -3.9880E-01 -5.7921E-02 -7.4392E-02  7.6926E-10  4.3933E-10  1.2972E-11  1.5603E-16
415613  1.8267E+03 -4.5341E+02  7.0876E+02 -1.6781E+03 -3.1322E-01  2.2659E-02 -1.9634E-02 -6.2272E+02  5.6582E+02 -1.6781E+03 -4.1570E-01 -4.2900E-02 -1.9634E-02  7.0366E-10  3.3736E-10  1.2972E-11  1.7665E-16
415613  2.4407E+03 -6.4616E+02  7.3607E+02 -1.6730E+03 -3.1233E-01  6.6283E-02  3.5721E-02 -8.6075E+02  4.6738E+02 -1.6730E+03 -4.1876E-01 -2.7146E-02  3.5721E-02  6.4640E-10  2.7303E-10  1.2972E-11  2.0040E-16
415613  3.0053E+03 -8.1934E+02  7.8410E+02 -1.6388E+03 -2.9930E-01  1.0317E-01  8.5652E-02 -1.0733E+03  3.6629E+02 -1.6388E+03 -4.1268E-01 -1.5303E-02  8.5652E-02  6.1796E-10  2.2718E-10  1.2972E-11  2.2313E-16
415613  3.6081E+03 -9.9291E+02  8.5698E+02 -1.5711E+03 -2.7498E-01  1.3766E-01  1.3916E-01 -1.2879E+03  2.4816E+02 -1.5711E+03 -3.9889E-01 -5.9031E-03  1.3916E-01  5.9078E-10  1.5876E-10  1.2972E-11  2.4697E-16
415613  4.2261E+03 -1.1520E+03  9.5110E+02 -1.4683E+03 -2.3824E-01  1.6558E-01  1.9302E-01 -1.4892E+03  1.1803E+02 -1.4683E+03 -3.7576E-01 -9.9529E-04  1.9302E-01  5.6439E-10  1.1643E-10  1.2972E-11  2.6971E-16
415613  4.8247E+03 -1.2812E+03  1.0560E+03 -1.3377E+03 -1.9187E-01  1.8319E-01  2.4266E-01 -1.6603E+03 -1.3777E+01 -1.3377E+03 -3.4456E-01 -2.0709E-03  2.4266E-01  5.4184E-10  6.4678E-11  1.2972E-11  2.8897E-16
415613  5.4329E+03 -1.3817E+03  1.1701E+03 -1.1761E+03 -1.3750E-01  1.9025E-01  2.8795E-01 -1.8044E+03 -1.4983E+02 -1.1761E+03 -3.0669E-01 -9.5202E-03  2.8795E-01  5.3578E-10  4.3013E-11  1.2972E-11  3.0479E-16
415613  6.0151E+03 -1.4458E+03  1.2802E+03 -9.9713E+02 -8.2771E-02  1.8573E-01  3.2593E-01 -1.9109E+03 -2.7909E+02 -9.9713E+02 -2.6788E-01 -2.3328E-02  3.2593E-01  5.2828E-10  2.9038E-11  1.2972E-11  3.1584E-16
415613  6.6049E+03 -1.4782E+03  1.3854E+03 -7.9495E+02 -2.6980E-02  1.6914E-01  3.5857E-01 -1.9848E+03 -4.0644E+02 -7.9495E+02 -2.2730E-01 -4.4593E-02  3.5857E-01  5.3351E-10  2.2085E-11  1.2972E-11  3.2255E-16
415613  7.2247E+03 -1.4773E+03  1.4814E+03 -5.6370E+02  2.9113E-02  1.3821E-01  3.8654E-01 -2.0229E+03 -5.3348E+02 -5.6370E+02 -1.8508E-01 -7.5393E-02  3.8654E-01  5.3851E-10  1.9548E-11  1.2972E-11  3.2439E-16
415613  7.8211E+03 -1.4450E+03  1.5518E+03 -3.2685E+02  7.8113E-02  9.6070E-02  4.0661E-01 -2.0195E+03 -6.4651E+02 -3.2685E+02 -1.4627E-01 -1.1287E-01  4.0661E-01  5.4640E-10  1.3261E-11  1.2972E-11  3.2091E-16
415613  8.4027E+03 -1.3873E+03  1.5929E+03 -8.6286E+01  1.1921E-01  4.3243E-02  4.1951E-01 -1.9764E+03 -7.4541E+02 -8.6286E+01 -1.1111E-01 -1.5734E-01  4.1951E-01  5.7152E-10  7.8075E-12  1.2972E-11  3.1243E-16
415613  9.0124E+03 -1.3035E+03  1.5993E+03  1.7166E+02  1.5378E-01 -2.4536E-02  4.2525E-01 -1.8871E+03 -8.3410E+02  1.7166E+02 -7.7460E-02 -2.1301E-01  4.2525E-01  6.1010E-10  6.2478E-12  1.2972E-11  2.9800E-16
415613  9.6065E+03 -1.2049E+03  1.5621E+03  4.2380E+02  1.7631E-01 -1.0232E-01  4.2189E-01 -1.7542E+03 -9.0264E+02  4.2380E+02 -4.9555E-02 -2.7654E-01  4.2189E-01  6.5419E-10  5.7300E-12  1.2972E-11  2.7846E-16
415613  1.0218E+04 -1.0932E+03  1.4721E+03  6.7780E+02  1.8686E-01 -1.9444E-01  4.0715E-01 -1.5676E+03 -9.5115E+02  6.7780E+02 -2.5990E-02 -3.5251E-01  4.0715E-01  7.3931E-10  4.1558E-12  1.2972E-11  2.5285E-16
415613  1.0800E+04 -9.8468E+02  1.3299E+03  9.0739E+02  1.8355E-01 -2.9646E-01  3.7798E-01 -1.3389E+03 -9.7244E+02  9.0739E+02 -8.7499E-03 -4.3883E-01  3.7798E-01  8.8755E-10  0.0000E+00  1.2972E-11  2.2357E-16
415657  0.0000E+00 -3.1609E+01  7.5968E+02 -1.5561E+03 -0.0000E+00 -0.0000E+00 -0.0000E+00 -3.1609E+01  7.5968E+02 -1.5561E+03 -1.0984E-01 -4.5704E-03  0.0000E+00  9.1734E-10  2.9621E-09  1.2972E-11  1.3451E-16
415657  6.0668E+02 -1.1519E+02  7.3549E+02 -1.5936E+03 -2.4950E-01 -5.0186E-02 -1.0410E-01 -1.7918E+02  7.2257E+02 -1.5936E+03 -3.5584E-01 -6.6841E-02 -1.0410E-01  8.5425E-10  1.1834E-09  1.2972E-11  1.4091E-16
415657  1.2087E+03 -2.9027E+02  7.1452E+02 -1.6471E+03 -3.1450E-01 -1.5760E-02 -6.3178E-02 -4.1009E+02  6.5316E+02 -1.6471E+03 -4.1782E-01 -5.7730E-02 -6.3178E-02  7.6162E-10  3.9901E-10  1.2972E-11  1.5714E-16
415657  1.8074E+03 -4.8333E+02  7.1838E+02 -1.6677E+03 -3.2668E-01  2.8918E-02 -5.9375E-03 -6.5252E+02  5.6911E+02 -1.6677E+03 -4.3055E-01 -4.0967E-02 -5.9375E-03  6.9612E-10  3.0026E-10  1.2972E-11  1.7829E-16
415657  2.4076E+03 -6.7910E+02  7.4920E+02 -1.6549E+03 -3.2352E-01  7.3135E-02  4.7885E-02 -8.9394E+02  4.7261E+02 -1.6549E+03 -4.3184E-01 -2.5057E-02  4.7885E-02  6.5345E-10  2.5047E-10  1.2972E-11  2.0216E-16
415657  3.0385E+03 -8.7829E+02  8.0889E+02 -1.6070E+03 -3.0550E-01  1.1511E-01  1.0392E-01 -1.1389E+03  3.5850E+02 -1.6070E+03 -4.2246E-01 -1.1882E-02  1.0392E-01  6.0973E-10  1.9693E-10  1.2972E-11  2.2827E-16
415657  3.6086E+03 -1.0455E+03  8.8401E+02 -1.5332E+03 -2.7914E-01  1.4750E-01  1.5506E-01 -1.3470E+03  2.4530E+02 -1.5332E+03 -4.0696E-01 -3.6655E-03  1.5506E-01  5.8632E-10  1.3806E-10  1.2972E-11  2.5133E-16
415657  4.2282E+03 -1.2063E+03  9.8438E+02 -1.4204E+03 -2.3793E-01  1.7494E-01  2.0836E-01 -1.5528E+03  1.1369E+02 -1.4204E+03 -3.8027E-01  5.2482E-04  2.0836E-01  5.6094E-10  9.0949E-11  1.2972E-11  2.7451E-16
415657  4.8274E+03 -1.3342E+03  1.0947E+03 -1.2810E+03 -1.8773E-01  1.9162E-01  2.5629E-01 -1.7257E+03 -1.8783E+01 -1.2810E+03 -3.4602E-01 -1.2954E-03  2.5629E-01  5.4294E-10  5.5390E-11  1.2972E-11  2.9394E-16
415657  5.4152E+03 -1.4287E+03  1.2096E+03 -1.1178E+03 -1.3314E-01  1.9752E-01  2.9782E-01 -1.8659E+03 -1.5041E+02 -1.1178E+03 -3.0804E-01 -9.0507E-03  2.9782E-01  5.2637E-10  4.1532E-11  1.2972E-11  3.0933E-16
415657  6.0236E+03 -1.4918E+03  1.3286E+03 -9.2512E+02 -7.4429E-02  1.9148E-01  3.3462E-01 -1.9772E+03 -2.8547E+02 -9.2512E+02 -2.6653E-01 -2.4231E-02  3.3462E-01  5.1703E-10  2.5756E-11  1.2972E-11  3.2094E-16
415657  6.6027E+03 -1.5189E+03  1.4350E+03 -7.2265E+02 -1.9240E-02  1.7423E-01  3.6362E-01 -2.0489E+03 -4.1039E+02 -7.2265E+02 -2.2673E-01 -4.5383E-02  3.6362E-01  5.1186E-10  1.8617E-11  1.2972E-11  3.2757E-16
415657  7.2185E+03 -1.5134E+03  1.5336E+03 -4.9096E+02  3.6135E-02  1.4374E-01  3.8781E-01 -2.0867E+03 -5.3667E+02 -4.9096E+02 -1.8561E-01 -7.5086E-02  3.8781E-01  5.2485E-10  1.3088E-11  1.2972E-11  3.2966E-16
415657  7.8240E+03 -1.4763E+03  1.6082E+03 -2.5062E+02  8.5249E-02  1.0095E-01  4.0493E-01 -2.0835E+03 -6.5173E+02 -2.5062E+02 -1.4728E-01 -1.1251E-01  4.0493E-01  5.2846E-10  1.1173E-11  1.2972E-11  3.2655E-16
415657  8.4005E+03 -1.4154E+03  1.6520E+03 -1.4040E+01  1.2469E-01  4.9333E-02  4.1482E-01 -2.0419E+03 -7.5059E+02 -1.4040E+01 -1.1418E-01 -1.5533E-01  4.1482E-01  5.4953E-10  8.6004E-12  1.2972E-11  3.1872E-16
415657  9.0081E+03 -1.3292E+03  1.6626E+03  2.3935E+02  1.5744E-01 -1.6216E-02  4.1789E-01 -1.9555E+03 -8.4090E+02  2.3935E+02 -8.2963E-02 -2.0841E-01  4.1789E-01  5.8133E-10  4.9650E-12  1.2972E-11  3.0527E-16
415657  9.6042E+03 -1.2286E+03  1.6312E+03  4.8722E+02  1.7817E-01 -9.0850E-02  4.1220E-01 -1.8267E+03 -9.1283E+02  4.8722E+02 -5.7687E-02 -2.6849E-01  4.1220E-01  6.1944E-10  7.4133E-12  1.2972E-11  2.8689E-16
415657  1.0203E+04 -1.1187E+03  1.5519E+03  7.2988E+02  1.8636E-01 -1.7563E-01  3.9618E-01 -1.6515E+03 -9.6562E+02  7.2988E+02 -3.8026E-02 -3.3738E-01  3.9618E-01  6.7721E-10  3.7480E-12  1.2972E-11  2.6346E-16
415657  1.0804E+04 -1.0079E+03  1.4183E+03  9.5953E+02  1.7970E-01 -2.7098E-01  3.6525E-01 -1.4269E+03 -9.9566E+02  9.5953E+02 -2.5368E-02 -4.1672E-01  3.6525E-01  7.8533E-10  4.0794E-12  1.2972E-11  2.3534E-16
415704  0.0000E+00 -1.8466E+02  6.8698E+02 -1.4710E+03 -0.0000E+00 -0.0000E+00 -0.0000E+00 -1.8466E+02  6.8698E+02 -1.4710E+03 -9.9331E-02 -2.6700E-02  0.0000E+00  9.7026E-10  1.1912E-09  1.2972E-11  1.3107E-16
415704  6.0326E+02 -1.9447E+02  6.7996E+02 -1.4805E+03 -3.7713E-02 -1.5204E-02 -2.1060E-02 -2.5297E+02  6.6044E+02 -1.4805E+03 -1.3603E-01 -4.3323E-02 -2.1060E-02  9.7026E-10  7.3630E-10  1.2972E-11  1.3464E-16
415704  1.2111E+03 -2.2584E+02  6.6720E+02 -1.4749E+03 -5.9409E-02 -2.7003E-02  4.3281E-02 -3.3862E+02  6.1765E+02 -1.4749E+03 -1.5588E-01 -5.9658E-02  4.3281E-02  9.6305E-10  5.1412E-10  1.2972E-11  1.3881E-16
415706  0.0000E+00 -1.2275E+02  5.4723E+02 -1.5221E+03 -0.0000E+00  0.0000E+00 -0.0000E+00 -1.2275E+02  5.4723E+02 -1.5221E+03 -7.9125E-02 -1.7749E-02  0.0000E+00  9.6397E-10  8.0731E-10  1.2972E-11  1.3148E-16
415715  0.0000E+00 -2.6346E+02  5.8524E+02 -1.4523E+03 -0.0000E+00 -0.0000E+00 -0.0000E+00 -2.6346E+02  5.8524E+02 -1.4523E+03 -8.4621E-02 -3.8095E-02  0.0000E+00  9.7902E-10  1.5246E-09  1.2972E-11  1.3263E-16
415715  6.1254E+02 -2.7874E+02  5.6494E+02 -1.4568E+03 -3.6504E-02 -5.4407E-02 -7.6752E-03 -3.2762E+02  5.3808E+02 -1.4568E+03 -1.1819E-01 -9.4711E-02 -7.6752E-03  9.6516E-10  2.0396E-09  1.2972E-11  1.3691E-16
415715  1.2155E+03 -3.4047E+02  5.2353E+02 -1.4868E+03 -1.5992E-01 -8.5991E-02 -6.6233E-02 -4.2676E+02  4.5593E+02 -1.4868E+03 -2.3562E-01 -1.3522E-01 -6.6233E-02  9.1502E-10  9.9586E-10  1.2972E-11  1.4724E-16
415715  1.8195E+03 -4.5752E+02  4.6366E+02 -1.5132E+03 -2.1980E-01 -1.0900E-01 -1.4061E-02 -5.6235E+02  3.2872E+02 -1.5132E+03 -2.8684E-01 -1.7515E-01 -1.4061E-02  8.8054E-10  4.9492E-10  1.2972E-11  1.6353E-16
415715  2.4142E+03 -5.9825E+02  3.9733E+02 -1.5007E+03 -2.5064E-01 -1.1239E-01  5.8526E-02 -6.9807E+02  1.6874E+02 -1.5007E+03 -3.0809E-01 -1.9890E-01  5.8526E-02  8.4113E-10  3.4843E-10  1.2972E-11  1.8090E-16
415715  3.0196E+03 -7.5577E+02  3.3172E+02 -1.4398E+03 -2.6618E-01 -1.0250E-01  1.4484E-01 -8.2515E+02 -1.8994E+01 -1.4398E+03 -3.1414E-01 -2.1178E-01  1.4484E-01  8.4145E-10  1.8703E-10  1.2972E-11  1.9782E-16
415715  3.6069E+03 -9.1224E+02  2.7682E+02 -1.3280E+03 -2.6427E-01 -8.3557E-02  2.3739E-01 -9.2888E+02 -2.1447E+02 -1.3280E+03 -3.0430E-01 -2.1546E-01  2.3739E-01  8.8514E-10  1.4318E-10  1.2972E-11  2.1161E-16
415715  4.2003E+03 -1.0638E+03  2.3206E+02 -1.1575E+03 -2.4197E-01 -6.9603E-02  3.3781E-01 -1.0060E+03 -4.1650E+02 -1.1575E+03 -2.7552E-01 -2.2341E-01  3.3781E-01  9.2977E-10  7.3426E-11  1.2972E-11  2.2118E-16
415715  4.8056E+03 -1.1961E+03  1.8999E+02 -9.2281E+02 -1.9165E-01 -7.2532E-02  4.3596E-01 -1.0405E+03 -6.1991E+02 -9.2281E+02 -2.1912E-01 -2.4548E-01  4.3596E-01  9.9787E-10  8.7274E-12  1.2972E-11  2.2424E-16
415716  0.0000E+00 -2.7490E+02  5.7624E+02 -1.4471E+03 -0.0000E+00  0.0000E+00 -0.0000E+00 -2.7490E+02  5.7624E+02 -1.4471E+03 -8.3320E-02 -3.9748E-02  0.0000E+00  9.8183E-10  1.8301E-09  1.2972E-11  1.3283E-16
415716  6.2031E+02 -3.1553E+02  5.7236E+02 -1.4738E+03 -1.2722E-01 -2.0655E-02 -8.7189E-02 -3.6553E+02  5.4180E+02 -1.4738E+03 -2.0997E-01 -6.6277E-02 -8.7189E-02  9.2949E-10  1.4817E-09  1.2972E-11  1.4077E-16
415716  1.2055E+03 -4.1416E+02  5.5444E+02 -1.5272E+03 -2.0106E-01 -3.6927E-02 -8.2183E-02 -5.0404E+02  4.7421E+02 -1.5272E+03 -2.8123E-01 -9.6812E-02 -8.2183E-02  8.5031E-10  6.7959E-10  1.2972E-11  1.5631E-16
415716  1.8210E+03 -5.4982E+02  5.3299E+02 -1.5633E+03 -2.3693E-01 -3.1726E-02 -3.3646E-02 -6.6959E+02  3.7153E+02 -1.5633E+03 -3.1399E-01 -1.1122E-01 -3.3646E-02  7.8966E-10  4.9169E-10  1.2972E-11  1.7616E-16
415716  2.4098E+03 -6.9554E+02  5.1789E+02 -1.5669E+03 -2.5501E-01 -1.7708E-02  2.3303E-02 -8.3056E+02  2.4929E+02 -1.5669E+03 -3.2989E-01 -1.1828E-01  2.3303E-02  7.4999E-10  3.4726E-10  1.2972E-11  1.9641E-16
415716  3.0197E+03 -8.5335E+02  5.1311E+02 -1.5330E+03 -2.6021E-01  2.4811E-03  8.8583E-02 -9.9027E+02  1.0410E+02 -1.5330E+03 -3.3440E-01 -1.2091E-01  8.8583E-02  7.2139E-10  2.8153E-10  1.2972E-11  2.1698E-16
415716  3.6184E+03 -1.0076E+03  5.2074E+02 -1.4598E+03 -2.5198E-01  2.2816E-02  1.5690E-01 -1.1330E+03 -5.2383E+01 -1.4598E+03 -3.2728E-01 -1.2288E-01  1.5690E-01  6.9652E-10  1.7915E-10  1.2972E-11  2.3552E-16
415716  4.2203E+03 -1.1532E+03  5.3984E+02 -1.3442E+03 -2.2943E-01  3.9757E-02  2.2716E-01 -1.2544E+03 -2.1842E+02 -1.3442E+03 -3.0748E-01 -1.2698E-01  2.2716E-01  7.0404E-10  1.3154E-10  1.2972E-11  2.5104E-16
415716  4.8330E+03 -1.2832E+03  5.6777E+02 -1.1833E+03 -1.9242E-01  4.9610E-02  2.9764E-01 -1.3477E+03 -3.9084E+02 -1.1833E+03 -2.7451E-01 -1.3594E-01  2.9764E-01  7.1465E-10  7.2496E-11  1.2972E-11  2.6239E-16
415716  5.4196E+03 -1.3828E+03  5.9677E+02 -9.8977E+02 -1.4534E-01  4.7145E-02  3.6106E-01 -1.4007E+03 -5.5331E+02 -9.8977E+02 -2.3163E-01 -1.5279E-01  3.6106E-01  7.3391E-10  4.5630E-11  1.2972E-11  2.6786E-16
415716  6.0150E+03 -1.4528E+03  6.2048E+02 -7.5718E+02 -8.8869E-02  2.9746E-02  4.1886E-01 -1.4113E+03 -7.0991E+02 -7.5718E+02 -1.7859E-01 -1.8032E-01  4.1886E-01  7.7083E-10  2.6326E-11  1.2972E-11  2.6708E-16
415716  6.6116E+03 -1.4876E+03  6.2875E+02 -4.9235E+02 -2.7051E-02 -5.1371E-03  4.6723E-01 -1.3716E+03 -8.5250E+02 -4.9235E+02 -1.1796E-01 -2.2023E-01  4.6723E-01  8.0439E-10  1.9535E-11  1.2972E-11  2.5916E-16
415716  7.2020E+03 -1.4850E+03  6.1105E+02 -2.0507E+02  3.5842E-02 -5.8227E-02  5.0411E-01 -1.2774E+03 -9.7309E+02 -2.0507E+02 -5.2510E-02 -2.7295E-01  5.0411E-01  8.6996E-10  9.7530E-12  1.2972E-11  2.4384E-16
415716  7.8037E+03 -1.4439E+03  5.5405E+02  1.0691E+02  1.0094E-01 -1.3517E-01  5.3070E-01 -1.1189E+03 -1.0676E+03  1.0691E+02  2.0830E-02 -3.4394E-01  5.3070E-01  9.9244E-10  1.3177E-11  1.2972E-11  2.2036E-16
415738  0.0000E+00 -3.7451E+02  6.9746E+02 -1.3061E+03 -0.0000E+00  0.0000E+00 -0.0000E+00 -3.7451E+02  6.9746E+02 -1.3061E+03 -1.0085E-01 -5.4151E-02  0.0000E+00  1.0001E-09  8.5010E-10  1.2972E-11  1.2796E-16
415738  6.0508E+02 -3.9533E+02  6.9257E+02 -1.2945E+03 -7.5060E-02 -1.8937E-02  4.1806E-02 -4.5433E+02  6.5538E+02 -1.2945E+03 -1.7520E-01 -7.6097E-02  4.1806E-02  1.0025E-09  7.6424E-10  1.2972E-11  1.3223E-16
415740  0.0000E+00 -3.7904E+02  6.9570E+02 -1.2995E+03 -0.0000E+00  0.0000E+00 -0.0000E+00 -3.7904E+02  6.9570E+02 -1.2995E+03 -1.0059E-01 -5.4806E-02  0.0000E+00  1.0025E-09  1.4669E-09  1.2972E-11  1.2772E-16
415740  6.0319E+02 -4.0799E+02  6.9075E+02 -1.2888E+03 -7.5248E-02 -2.2740E-02  5.8978E-02 -4.6661E+02  6.5259E+02 -1.2888E+03 -1.7513E-01 -8.1732E-02  5.8978E-02  9.9868E-10  3.6406E-10  1.2972E-11  1.3268E-16
415778  0.0000E+00 -2.8802E+02  5.8890E+02 -1.4166E+03 -0.0000E+00 -0.0000E+00 -0.0000E+00 -2.8802E+02  5.8890E+02 -1.4166E+03 -8.5150E-02 -4.1645E-02  0.0000E+00  9.8198E-10  3.0741E-09  1.2972E-11  1.3112E-16
415778  6.0124E+02 -3.7460E+02  5.5322E+02 -1.4035E+03 -2.3955E-01 -9.9008E-02  4.4103E-02 -4.2122E+02  5.1861E+02 -1.4035E+03 -3.1954E-01 -1.5317E-01  4.4103E-02  9.6979E-10  1.0860E-09  1.2972E-11  1.3921E-16
415778  1.2004E+03 -5.4052E+02  4.8643E+02 -1.3612E+03 -3.0951E-01 -1.1678E-01  9.2817E-02 -6.1640E+02  3.8578E+02 -1.3612E+03 -3.7984E-01 -1.9494E-01  9.2817E-02  9.4128E-10  8.1907E-10  1.2972E-11  1.5482E-16
415778  1.8074E+03 -7.4019E+02  4.1524E+02 -1.2793E+03 -3.3680E-01 -1.1371E-01  1.8355E-01 -8.2234E+02  2.0990E+02 -1.2793E+03 -3.9684E-01 -2.2074E-01  1.8355E-01  9.1645E-10  2.1660E-10  1.2972E-11  1.7540E-16
415778  2.4050E+03 -9.3806E+02  3.5195E+02 -1.1384E+03 -3.2007E-01 -9.8032E-02  2.8814E-01 -1.0018E+03  1.1215E+01 -1.1384E+03 -3.7096E-01 -2.3367E-01  2.8814E-01  9.6129E-10  5.5720E-11  1.2972E-11  1.9484E-16
415778  3.0007E+03 -1.1168E+03  2.9630E+02 -9.3692E+02 -2.7632E-01 -9.1153E-02  3.8633E-01 -1.1379E+03 -2.0065E+02 -9.3692E+02 -3.1916E-01 -2.5263E-01  3.8633E-01  1.0050E-09  3.4824E-11  1.2972E-11  2.0991E-16
415779  0.0000E+00 -3.0415E+02  6.0387E+02 -1.3905E+03 -0.0000E+00  0.0000E+00 -0.0000E+00 -3.0415E+02  6.0387E+02 -1.3905E+03 -8.7315E-02 -4.3978E-02  0.0000E+00  9.8364E-10  1.7406E-09  1.2972E-11  1.2998E-16
415781  0.0000E+00 -3.1865E+02  5.6767E+02 -1.3885E+03 -0.0000E+00  0.0000E+00 -0.0000E+00 -3.1865E+02  5.6767E+02 -1.3885E+03 -8.2081E-02 -4.6075E-02  0.0000E+00  9.9303E-10  1.4733E-09  1.2972E-11  1.3070E-16
415781  6.0486E+02 -3.5521E+02  5.4387E+02 -1.3853E+03 -1.1210E-01 -8.2542E-02  1.6679E-02 -4.0135E+02  5.1076E+02 -1.3853E+03 -1.9074E-01 -1.3390E-01  1.6679E-02  9.9063E-10  1.1275E-09  1.2972E-11  1.3635E-16
415781  1.2080E+03 -4.3712E+02  4.7680E+02 -1.3534E+03 -1.5154E-01 -1.3183E-01  8.3708E-02 -5.1332E+02  3.9358E+02 -1.3534E+03 -2.2048E-01 -1.9503E-01  8.3708E-02  9.8133E-10  1.0757E-09  1.2972E-11  1.4467E-16
415781  1.8100E+03 -5.4797E+02  3.8603E+02 -1.2925E+03 -2.0116E-01 -1.6605E-01  1.4598E-01 -6.2919E+02  2.3110E+02 -1.2925E+03 -2.5698E-01 -2.4528E-01  1.4598E-01  9.9625E-10  1.9566E-10  1.2972E-11  1.5540E-16
415782  0.0000E+00 -3.3379E+02  5.9489E+02 -1.3750E+03 -0.0000E+00  0.0000E+00 -0.0000E+00 -3.3379E+02  5.9489E+02 -1.3750E+03 -8.6015E-02 -4.8262E-02  0.0000E+00  9.8921E-10  1.2027E-09  1.2972E-11  1.3051E-16
415782  6.0495E+02 -3.7224E+02  5.8778E+02 -1.3623E+03 -1.3521E-01 -1.8839E-02  2.7277E-02 -4.2216E+02  5.5302E+02 -1.3623E+03 -2.2020E-01 -7.2661E-02  2.7277E-02  9.9787E-10  1.3762E-09  1.2972E-11  1.3565E-16
415782  1.2042E+03 -4.7504E+02  5.7066E+02 -1.3263E+03 -1.9439E-01 -3.0056E-02  7.6576E-02 -5.6671E+02  4.7974E+02 -1.3263E+03 -2.7690E-01 -9.8742E-02  7.6576E-02  9.7182E-10  1.3484E-09  1.2972E-11  1.4546E-16
415782  1.8132E+03 -6.2899E+02  5.4626E+02 -1.2829E+03 -2.9999E-01 -4.8932E-02  9.2222E-02 -7.4907E+02  3.6458E+02 -1.2829E+03 -3.7897E-01 -1.3988E-01  9.2222E-02  9.2705E-10  6.3981E-10  1.2972E-11  1.6246E-16
415782  2.4110E+03 -8.1418E+02  5.1700E+02 -1.2002E+03 -3.0868E-01 -4.6595E-02  1.8696E-01 -9.4181E+02  2.0778E+02 -1.2002E+03 -3.8343E-01 -1.6432E-01  1.8696E-01  9.2289E-10  1.7481E-10  1.2972E-11  1.8308E-16
415782  3.0063E+03 -9.8942E+02  4.9098E+02 -1.0600E+03 -2.7597E-01 -4.1617E-02  2.8276E-01 -1.1042E+03  2.8651E+01 -1.0600E+03 -3.4696E-01 -1.8468E-01  2.8276E-01  9.3384E-10  7.8229E-11  1.2972E-11  2.0101E-16
415782  3.6037E+03 -1.1394E+03  4.6521E+02 -8.6476E+02 -2.2358E-01 -4.7089E-02  3.6872E-01 -1.2197E+03 -1.6370E+02 -8.6476E+02 -2.9084E-01 -2.1183E-01  3.6872E-01  9.4259E-10  1.5602E-11  1.2972E-11  2.1364E-16
415782  4.2042E+03 -1.2544E+03  4.3091E+02 -6.2034E+02 -1.5791E-01 -7.0518E-02  4.4269E-01 -1.2758E+03 -3.6271E+02 -6.2034E+02 -2.2022E-01 -2.5189E-01  4.4269E-01  9.9730E-10  1.2954E-11  1.2972E-11  2.1930E-16
415782  4.8000E+03 -1.3271E+03  3.7752E+02 -3.3907E+02 -8.5916E-02 -1.1147E-01  4.9878E-01 -1.2616E+03 -5.5870E+02 -3.3907E+02 -1.4050E-01 -3.0335E-01  4.9878E-01  1.0084E-09  3.8327E-12  1.2972E-11  2.1687E-16
415783  0.0000E+00 -2.8627E+02  5.8084E+02 -1.4224E+03 -0.0000E+00 -0.0000E+00 -0.0000E+00 -2.8627E+02  5.8084E+02 -1.4224E+03 -8.3985E-02 -4.1393E-02  0.0000E+00  9.8531E-10  4.0213E-09  1.2972E-11  1.3148E-16
415783  6.0945E+02 -3.8531E+02  5.3678E+02 -1.4177E+03 -2.5772E-01 -1.1487E-01  2.7405E-02 -4.3106E+02  5.0079E+02 -1.4177E+03 -3.3533E-01 -1.7058E-01  2.7405E-02  9.5367E-10  1.0149E-09  1.2972E-11  1.4130E-16
415783  1.2010E+03 -5.5619E+02  4.6347E+02 -1.3846E+03 -3.1461E-01 -1.2758E-01  8.4670E-02 -6.2791E+02  3.6039E+02 -1.3846E+03 -3.8163E-01 -2.0800E-01  8.4670E-02  9.1647E-10  5.3274E-10  1.2972E-11  1.5843E-16
415783  1.8084E+03 -7.5581E+02  3.8731E+02 -1.3068E+03 -3.3659E-01 -1.1979E-01  1.7613E-01 -8.3024E+02  1.7876E+02 -1.3068E+03 -3.9259E-01 -2.2908E-01  1.7613E-01  9.0618E-10  1.9333E-10  1.2972E-11  1.7954E-16
415783  2.4047E+03 -9.5399E+02  3.2189E+02 -1.1711E+03 -3.2337E-01 -9.9718E-02  2.7930E-01 -1.0066E+03 -2.2432E+01 -1.1711E+03 -3.6991E-01 -2.3766E-01  2.7930E-01  9.3975E-10  7.6624E-11  1.2972E-11  1.9933E-16
415783  3.0010E+03 -1.1360E+03  2.6639E+02 -9.7439E+02 -2.8324E-01 -8.8859E-02  3.7868E-01 -1.1427E+03 -2.3590E+02 -9.7439E+02 -3.2175E-01 -2.5311E-01  3.7868E-01  9.8387E-10  3.8214E-11  1.2972E-11  2.1489E-16
415785  0.0000E+00 -2.9311E+02  6.1340E+02 -1.4222E+03 -0.0000E+00 -0.0000E+00 -0.0000E+00 -2.9311E+02  6.1340E+02 -1.4222E+03 -8.8692E-02 -4.2381E-02  0.0000E+00  9.8198E-10  3.9726E-09  1.2972E-11  1.3190E-16
415785  6.1150E+02 -4.1205E+02  5.8140E+02 -1.4243E+03 -3.1030E-01 -7.3754E-02  1.9061E-03 -4.6178E+02  5.4274E+02 -1.4243E+03 -3.9437E-01 -1.3333E-01  1.9061E-03  9.3473E-10  1.0921E-09  1.2972E-11  1.4368E-16
415785  1.2107E+03 -6.1955E+02  5.4102E+02 -1.4100E+03 -3.7210E-01 -5.6968E-02  4.7570E-02 -7.0431E+02  4.2485E+02 -1.4100E+03 -4.5033E-01 -1.4655E-01  4.7570E-02  8.5289E-10  5.9683E-10  1.2972E-11  1.6598E-16
415785  1.8049E+03 -8.4801E+02  5.1527E+02 -1.3618E+03 -3.8870E-01 -2.8357E-02  1.1901E-01 -9.5225E+02  2.7902E+02 -1.3618E+03 -4.6321E-01 -1.5097E-01  1.1901E-01  8.1933E-10  2.3686E-10  1.2972E-11  1.9295E-16
415785  2.4284E+03 -1.0861E+03  5.0852E+02 -1.2613E+03 -3.7081E-01  6.6535E-03  2.0294E-01 -1.1947E+03  1.0392E+02 -1.2613E+03 -4.4434E-01 -1.5039E-01  2.0294E-01  7.7369E-10  1.2132E-10  1.2972E-11  2.2144E-16
415785  3.0112E+03 -1.2921E+03  5.2127E+02 -1.1214E+03 -3.3335E-01  3.6059E-02  2.7566E-01 -1.3914E+03 -7.2330E+01 -1.1214E+03 -4.0872E-01 -1.5077E-01  2.7566E-01  7.5505E-10  6.6075E-11  1.2972E-11  2.4543E-16
415785  3.6059E+03 -1.4756E+03  5.4963E+02 -9.3788E+02 -2.8201E-01  5.7550E-02  3.3982E-01 -1.5533E+03 -2.5837E+02 -9.3788E+02 -3.6149E-01 -1.5581E-01  3.3982E-01  7.3425E-10  4.5020E-11  1.2972E-11  2.6560E-16
415785  4.2071E+03 -1.6273E+03  5.8787E+02 -7.1694E+02 -2.2179E-01  6.7682E-02  3.9328E-01 -1.6714E+03 -4.4756E+02 -7.1694E+02 -3.0679E-01 -1.6761E-01  3.9328E-01  7.0995E-10  3.4004E-11  1.2972E-11  2.8060E-16
415785  4.8163E+03 -1.7428E+03  6.2888E+02 -4.6383E+02 -1.5679E-01  6.4715E-02  4.3551E-01 -1.7404E+03 -6.3547E+02 -4.6383E+02 -2.4772E-01 -1.8728E-01  4.3551E-01  7.0701E-10  2.7441E-11  1.2972E-11  2.8972E-16
415785  5.4041E+03 -1.8161E+03  6.6265E+02 -1.9886E+02 -9.2768E-02  4.7751E-02  4.6422E-01 -1.7560E+03 -8.0856E+02 -1.9886E+02 -1.8858E-01 -2.1484E-01  4.6422E-01  7.0015E-10  1.8807E-11  1.2972E-11  2.9243E-16
415785  6.0077E+03 -1.8526E+03  6.8265E+02  8.7174E+01 -2.9064E-02  1.6182E-02  4.8157E-01 -1.7177E+03 -9.7352E+02  8.7174E+01 -1.2777E-01 -2.5169E-01  4.8157E-01  7.1514E-10  1.4623E-11  1.2972E-11  2.8890E-16
415785  6.6015E+03 -1.8522E+03  6.7973E+02  3.7504E+02  2.9683E-02 -2.8046E-02  4.8596E-01 -1.6253E+03 -1.1186E+03  3.7504E+02 -6.8600E-02 -2.9586E-01  4.8596E-01  7.3960E-10  1.0066E-11  1.2972E-11  2.7935E-16
415785  7.2079E+03 -1.8171E+03  6.4593E+02  6.6751E+02  8.5544E-02 -8.5348E-02  4.7616E-01 -1.4742E+03 -1.2433E+03  6.6751E+02 -7.8528E-03 -3.4808E-01  4.7616E-01  7.8210E-10  2.5271E-11  1.2972E-11  2.6373E-16
415785  7.8030E+03 -1.7504E+03  5.7564E+02  9.4404E+02  1.3766E-01 -1.5278E-01  4.5024E-01 -1.2698E+03 -1.3353E+03  9.4404E+02  5.4425E-02 -4.0588E-01  4.5024E-01  8.7972E-10  1.8751E-11  1.2972E-11  2.4324E-16
415791  0.0000E+00 -5.3304E+02  7.4633E+02 -1.1295E+03 -0.0000E+00 -0.0000E+00 -0.0000E+00 -5.3304E+02  7.4633E+02 -1.1295E+03 -1.0791E-01 -7.7073E-02  0.0000E+00  1.0021E-09  4.0831E-09  1.2972E-11  1.2593E-16
415791  6.0923E+02 -6.2846E+02  7.1569E+02 -1.1332E+03 -2.2464E-01 -7.1589E-02  3.0030E-02 -6.8898E+02  6.5763E+02 -1.1332E+03 -3.2812E-01 -1.6246E-01  3.0030E-02  9.6212E-10  5.3527E-10  1.2972E-11  1.3954E-16
415791  1.2065E+03 -7.6556E+02  6.6927E+02 -1.0842E+03 -2.2570E-01 -8.3770E-02  1.3335E-01 -8.7010E+02  5.2623E+02 -1.0842E+03 -3.2247E-01 -1.9446E-01  1.3335E-01  9.4618E-10  1.8684E-10  1.2972E-11  1.5645E-16
415791  1.8019E+03 -8.9140E+02  6.1486E+02 -9.7631E+02 -1.9416E-01 -1.0075E-01  2.2723E-01 -1.0197E+03  3.6449E+02 -9.7631E+02 -2.8307E-01 -2.2964E-01  2.2723E-01  9.6087E-10  2.5000E-11  1.2972E-11  1.7089E-16
415791  2.4049E+03 -9.9475E+02  5.4610E+02 -8.1260E+02 -1.4750E-01 -1.2978E-01  3.1483E-01 -1.1213E+03  1.7444E+02 -8.1260E+02 -2.2646E-01 -2.7361E-01  3.1483E-01  1.0249E-09  8.5336E-12  1.2972E-11  1.8066E-16
415793  0.0000E+00 -5.3574E+02  7.2159E+02 -1.1232E+03 -0.0000E+00  0.0000E+00 -0.0000E+00 -5.3574E+02  7.2159E+02 -1.1232E+03 -1.0434E-01 -7.7463E-02  0.0000E+00  1.0078E-09  1.4448E-09  1.2972E-11  1.2556E-16
415798  0.0000E+00 -2.6805E+02  4.8910E+02 -1.4476E+03 -0.0000E+00 -0.0000E+00 -0.0000E+00 -2.6805E+02  4.8910E+02 -1.4476E+03 -7.0720E-02 -3.8757E-02  0.0000E+00  9.8873E-10  3.3229E-09  1.2972E-11  1.3274E-16
415798  6.1036E+02 -3.4773E+02  4.6676E+02 -1.4510E+03 -1.9014E-01 -6.7831E-02  2.6946E-02 -3.8752E+02  4.3429E+02 -1.4510E+03 -2.5763E-01 -1.1811E-01  2.6946E-02  9.5373E-10  6.9816E-10  1.2972E-11  1.4168E-16
415798  1.2036E+03 -4.6968E+02  4.1580E+02 -1.4082E+03 -2.1540E-01 -1.0014E-01  1.1712E-01 -5.3458E+02  3.2819E+02 -1.4082E+03 -2.7552E-01 -1.6805E-01  1.1712E-01  9.3922E-10  4.4060E-10  1.2972E-11  1.5258E-16
415798  1.8087E+03 -6.0316E+02  3.4951E+02 -1.3083E+03 -2.2121E-01 -1.1564E-01  2.1839E-01 -6.7302E+02  1.8168E+02 -1.3083E+03 -2.7175E-01 -2.0286E-01  2.1839E-01  9.6520E-10  1.5995E-10  1.2972E-11  1.6289E-16
415820  0.0000E+00 -9.0029E+01  7.0606E+02 -1.5058E+03 -0.0000E+00 -0.0000E+00 -0.0000E+00 -9.0029E+01  7.0606E+02 -1.5058E+03 -1.0209E-01 -1.3017E-02  0.0000E+00  9.5574E-10  2.7634E-09  1.2972E-11  1.3088E-16
415820  6.0094E+02 -1.3589E+02  6.8552E+02 -1.5466E+03 -1.4061E-01 -5.4212E-02 -9.0774E-02 -1.9487E+02  6.7114E+02 -1.5466E+03 -2.3973E-01 -7.3861E-02 -9.0774E-02  8.9085E-10  1.0501E-09  1.2972E-11  1.3729E-16
415820  1.2038E+03 -2.4206E+02  6.5144E+02 -1.5875E+03 -2.0232E-01 -5.2833E-02 -4.1465E-02 -3.5123E+02  5.9968E+02 -1.5875E+03 -2.9652E-01 -8.7834E-02 -4.1465E-02  8.4138E-10  5.3942E-10  1.2972E-11  1.4876E-16
415820  1.8057E+03 -3.7319E+02  6.2632E+02 -1.5962E+03 -2.3039E-01 -2.8496E-02  1.1114E-02 -5.2221E+02  5.0877E+02 -1.5962E+03 -3.2095E-01 -8.2455E-02  1.1114E-02  8.0897E-10  4.9385E-10  1.2972E-11  1.6278E-16
415820  2.4132E+03 -5.2019E+02  6.1667E+02 -1.5744E+03 -2.5250E-01 -3.4170E-03  6.1061E-02 -6.9968E+02  4.0166E+02 -1.5744E+03 -3.4167E-01 -7.8633E-02  6.1061E-02  7.7996E-10  4.5396E-10  1.2972E-11  1.7902E-16
415820  3.0189E+03 -6.7830E+02  6.2151E+02 -1.5218E+03 -2.6778E-01  1.8847E-02  1.1359E-01 -8.7746E+02  2.7646E+02 -1.5218E+03 -3.5765E-01 -7.9230E-02  1.1359E-01  7.3999E-10  3.7941E-10  1.2972E-11  1.9683E-16
415820  3.6262E+03 -8.4234E+02  6.3983E+02 -1.4348E+03 -2.6963E-01  4.0978E-02  1.7518E-01 -1.0495E+03  1.3218E+02 -1.4348E+03 -3.6215E-01 -8.0817E-02  1.7518E-01  7.3904E-10  2.9966E-10  1.2972E-11  2.1523E-16
415820  4.2050E+03 -9.9467E+02  6.6857E+02 -1.3142E+03 -2.5369E-01  5.7246E-02  2.4218E-01 -1.1983E+03 -1.9439E+01 -1.3142E+03 -3.5035E-01 -8.6575E-02  2.4218E-01  7.3691E-10  1.8425E-10  1.2972E-11  2.3152E-16
415820  4.8281E+03 -1.1421E+03  7.0746E+02 -1.1401E+03 -2.1596E-01  6.5774E-02  3.1600E-01 -1.3296E+03 -1.9212E+02 -1.1401E+03 -3.1826E-01 -9.9361E-02  3.1600E-01  7.3824E-10  8.5795E-11  1.2972E-11  2.4562E-16
415820  5.4046E+03 -1.2528E+03  7.4477E+02 -9.3953E+02 -1.6628E-01  6.1294E-02  3.7860E-01 -1.4139E+03 -3.5370E+02 -9.3953E+02 -2.7397E-01 -1.1986E-01  3.7860E-01  7.5380E-10  4.1236E-11  1.2972E-11  2.5382E-16
415820  6.0048E+03 -1.3347E+03  7.7627E+02 -6.9485E+02 -1.0572E-01  4.0784E-02  4.3502E-01 -1.4549E+03 -5.1707E+02 -6.9485E+02 -2.1797E-01 -1.5221E-01  4.3502E-01  7.8713E-10  1.8586E-11  1.2972E-11  2.5618E-16
415820  6.6167E+03 -1.3795E+03  7.9019E+02 -4.1399E+02 -3.9958E-02  1.5490E-03  4.8112E-01 -1.4407E+03 -6.7212E+02 -4.1399E+02 -1.5421E-01 -1.9791E-01  4.8112E-01  8.2384E-10  1.2748E-11  1.2972E-11  2.5126E-16
415820  7.2085E+03 -1.3841E+03  7.7499E+02 -1.1893E+02  2.3960E-02 -5.6274E-02  5.1379E-01 -1.3672E+03 -8.0445E+02 -1.1893E+02 -8.8098E-02 -2.5640E-01  5.1379E-01  8.8043E-10  7.8965E-12  1.2972E-11  2.3894E-16
415820  7.8003E+03 -1.3519E+03  7.1950E+02  1.9146E+02  8.4433E-02 -1.3509E-01  5.3291E-01 -1.2295E+03 -9.1304E+02  1.9146E+02 -1.9601E-02 -3.3056E-01  5.3291E-01  9.7105E-10  7.2701E-12  1.2972E-11  2.1908E-16
415821  0.0000E+00 -6.0862E+01  6.9625E+02 -1.5236E+03 -0.0000E+00  0.0000E+00 -0.0000E+00 -6.0862E+01  6.9625E+02 -1.5236E+03 -1.0067E-01 -8.8002E-03  0.0000E+00  9.4504E-10  1.4543E-09  1.2972E-11  1.3131E-16
415821  6.0840E+02 -8.5494E+01  6.6757E+02 -1.5231E+03 -7.9433E-02 -8.1785E-02  1.8568E-03 -1.4381E+02  6.5748E+02 -1.5231E+03 -1.7596E-01 -9.4146E-02  1.8568E-03  9.4736E-10  1.3234E-09  1.2972E-11  1.3324E-16
415821  1.2004E+03 -1.4985E+02  6.0016E+02 -1.5075E+03 -1.2127E-01 -1.3196E-01  6.3223E-02 -2.5124E+02  5.6527E+02 -1.5075E+03 -2.0804E-01 -1.5363E-01  6.3223E-02  9.6977E-10  3.8666E-10  1.2972E-11  1.3644E-16
