id t x y z vx vy vz xi yi zi vxi vyi vzi FGrav FDrag FSol FTide
5763  0.0000E+00  1.1142E+03  4.7685E+02  1.1299E+03 -0.0000E+00  0.0000E+00 -0.0000E+00  1.1142E+03  4.7685E+02  1.1299E+03 -6.8948E-02  1.6110E-01  0.0000E+00  2.2943E-02  2.1939E-04  1.2973E-06  7.4693E-09
5935  0.0000E+00  1.1197E+03  5.0109E+02  1.0966E+03 -0.0000E+00  0.0000E+00 -0.0000E+00  1.1197E+03  5.0109E+02  1.0966E+03 -7.2454E-02  1.6189E-01  0.0000E+00  2.2665E-02  1.4146E-04  1.2973E-06  7.4742E-09
5935  6.0547E+02  1.1210E+03  4.8670E+02  1.0720E+03  3.8616E-03 -4.7895E-02 -8.1317E-02  1.0742E+03  5.8285E+02  1.0720E+03 -6.6511E-02  1.1419E-01 -8.1317E-02  2.2830E-02  4.9154E-06  1.2973E-06  7.4263E-09
5937  0.0000E+00  1.1187E+03  4.8636E+02  1.0977E+03 -0.0000E+00 -0.0000E+00 -0.0000E+00  1.1187E+03  4.8636E+02  1.0977E+03 -7.0323E-02  1.6175E-01  0.0000E+00  2.2898E-02  1.1012E-04  1.2973E-06  7.4421E-09
