id t x y z vx vy vz xi yi zi vxi vyi vzi FGrav FDrag FSol FTide
285244  0.0000E+00 -1.0068E+03 -3.8291E+02  1.1998E+03 -0.0000E+00  0.0000E+00  0.0000E+00 -1.0068E+03 -3.8291E+02  1.1998E+03  5.5366E-02 -1.4557E-01  0.0000E+00  9.2473E-04  2.2280E-05  1.2972E-07  1.4990E-10
285248  0.0000E+00 -1.0049E+03 -3.7384E+02  1.2033E+03 -0.0000E+00  0.0000E+00  0.0000E+00 -1.0049E+03 -3.7384E+02  1.2033E+03  5.4054E-02 -1.4530E-01  0.0000E+00  9.2201E-04  2.5375E-05  1.2972E-07  1.4935E-10
285404  0.0000E+00 -1.0126E+03 -4.1453E+02  1.1856E+03 -0.0000E+00  0.0000E+00  0.0000E+00 -1.0126E+03 -4.1453E+02  1.1856E+03  5.9938E-02 -1.4641E-01  0.0000E+00  9.1457E-04  2.2017E-05  1.2972E-07  1.5181E-10
