id t x y z vx vy vz xi yi zi vxi vyi vzi FGrav FDrag FSol FTide
177880  0.0000E+00 -2.7957E+02 -1.1585E+02  8.9834E+02  0.0000E+00 -0.0000E+00 -0.0000E+00 -2.7957E+02 -1.1585E+02  8.9834E+02  1.6751E-02 -4.0423E-02  0.0000E+00  8.4345E-01  2.5665E-04  1.2972E-05  7.2795E-08
177880  6.0724E+02 -2.9030E+02 -1.0138E+02  8.6828E+02 -3.4024E-02  4.8879E-02 -9.8679E-02 -2.8030E+02 -1.2645E+02  8.6828E+02 -1.9365E-02  6.9033E-03 -9.8679E-02  8.3737E-01  1.1437E-04  1.2972E-05  7.0780E-08
177932  0.0000E+00 -6.7030E+02 -4.3370E+02  9.6746E+02  0.0000E+00  0.0000E+00 -0.0000E+00 -6.7030E+02 -4.3370E+02  9.6746E+02  6.2710E-02 -9.6919E-02  0.0000E+00  9.1258E-01  1.6304E-03  1.2972E-05  1.1377E-07
