id t x y z vx vy vz xi yi zi vxi vyi vzi FGrav FDrag FSol FTide
190008  0.0000E+00  4.3690E+02 -9.6082E+02  3.2771E+02 -0.0000E+00 -0.0000E+00 -0.0000E+00  4.3690E+02 -9.6082E+02  3.2771E+02  1.3893E-01  6.3172E-02 -0.0000E+00  7.7081E-07  5.0346E-07  1.2972E-09  8.4871E-14
190041  0.0000E+00  3.3693E+02 -1.0602E+03  1.4796E+02 -0.0000E+00 -0.0000E+00 -0.0000E+00  3.3693E+02 -1.0602E+03  1.4796E+02  1.5330E-01  4.8718E-02 -0.0000E+00  8.3639E-07  6.7723E-07  1.2972E-09  8.9446E-14
190041  6.0671E+02  3.2949E+02 -1.0544E+03  1.3789E+02 -2.5490E-02  2.1131E-02 -3.5012E-02  4.2060E+02 -1.0214E+03  1.3789E+02  1.2696E-01  6.8773E-02 -3.5012E-02  8.3639E-07  6.8910E-07  1.2972E-09  8.6434E-14
190041  1.2063E+03  3.0521E+02 -1.0317E+03  1.0594E+02 -5.6043E-02  5.3557E-02 -6.8609E-02  4.7961E+02 -9.6303E+02  1.0594E+02  9.3125E-02  9.7688E-02 -6.8609E-02  8.3721E-07  7.4132E-07  1.2972E-09  8.3108E-14
190042  0.0000E+00  3.1910E+02 -1.0392E+03  1.3490E+02 -0.0000E+00 -0.0000E+00 -0.0000E+00  3.1910E+02 -1.0392E+03  1.3490E+02  1.5026E-01  4.6140E-02 -0.0000E+00  8.3949E-07  6.2775E-07  1.2972E-09  8.7791E-14
190042  6.0108E+02  3.0881E+02 -1.0275E+03  1.2556E+02 -3.4172E-02  3.8022E-02 -3.2192E-02  3.9683E+02 -9.9683E+02  1.2556E+02  1.1440E-01  8.2673E-02 -3.2192E-02  8.3721E-07  7.0630E-07  1.2972E-09  8.4180E-14
190044  0.0000E+00  2.9383E+02 -1.0113E+03  1.2849E+02 -0.0000E+00 -0.0000E+00  0.0000E+00  2.9383E+02 -1.0113E+03  1.2849E+02  1.4623E-01  4.2485E-02  0.0000E+00  8.3721E-07  6.8866E-07  1.2972E-09  8.5642E-14
190044  6.1080E+02  2.8311E+02 -1.0033E+03  1.1986E+02 -3.2919E-02  2.5816E-02 -2.7557E-02  3.7050E+02 -9.7444E+02  1.1986E+02  1.1215E-01  6.6751E-02 -2.7557E-02  8.3550E-07  6.9846E-07  1.2972E-09  8.2161E-14
190056  0.0000E+00  4.2604E+02 -1.1076E+03  2.4647E+02 -0.0000E+00 -0.0000E+00 -0.0000E+00  4.2604E+02 -1.1076E+03  2.4647E+02  1.6015E-01  6.1601E-02 -0.0000E+00  8.2980E-07  6.7949E-07  1.2972E-09  9.3994E-14
190056  6.1506E+02  4.1828E+02 -1.1017E+03  2.3659E+02 -2.4588E-02  1.9695E-02 -3.0351E-02  5.1448E+02 -1.0602E+03  2.3659E+02  1.3471E-01  8.0175E-02 -3.0351E-02  8.2980E-07  6.6680E-07  1.2972E-09  9.2302E-14
190060  0.0000E+00  2.8101E+02 -1.0000E+03  1.2679E+02 -0.0000E+00 -0.0000E+00  0.0000E+00  2.8101E+02 -1.0000E+03  1.2679E+02  1.4459E-01  4.0632E-02  0.0000E+00  8.3550E-07  6.7577E-07  1.2972E-09  8.4822E-14
190063  0.0000E+00  2.3610E+02 -9.7098E+02  1.5146E+02 -0.0000E+00 -0.0000E+00 -0.0000E+00  2.3610E+02 -9.7098E+02  1.5146E+02  1.4040E-01  3.4139E-02 -0.0000E+00  8.3212E-07  6.9874E-07  1.2972E-09  8.2927E-14
190065  0.0000E+00  3.7828E+02 -1.0880E+03  1.3524E+02 -0.0000E+00 -0.0000E+00 -0.0000E+00  3.7828E+02 -1.0880E+03  1.3524E+02  1.5732E-01  5.4695E-02 -0.0000E+00  8.3927E-07  7.3143E-07  1.2972E-09  9.1674E-14
190065  6.0593E+02  3.6988E+02 -1.0833E+03  1.2670E+02 -2.6189E-02  1.7128E-02 -2.6620E-02  4.6325E+02 -1.0468E+03  1.2670E+02  1.3044E-01  7.0609E-02 -2.6620E-02  8.4252E-07  6.6909E-07  1.2972E-09  8.9020E-14
190065  1.2063E+03  3.4705E+02 -1.0663E+03  1.0336E+02 -4.9963E-02  4.1003E-02 -5.2670E-02  5.2682E+02 -9.8986E+02  1.0336E+02  1.0421E-01  9.1184E-02 -5.2670E-02  8.4492E-07  7.2097E-07  1.2972E-09  8.6473E-14
190072  0.0000E+00  3.1633E+02 -1.0394E+03  1.6027E+02 -0.0000E+00 -0.0000E+00 -0.0000E+00  3.1633E+02 -1.0394E+03  1.6027E+02  1.5028E-01  4.5739E-02 -0.0000E+00  8.3639E-07  6.2217E-07  1.2972E-09  8.7787E-14
190072  6.1061E+02  3.0780E+02 -1.0299E+03  1.4833E+02 -2.9214E-02  3.2002E-02 -3.8833E-02  3.9741E+02 -9.9880E+02  1.4833E+02  1.1971E-01  7.6507E-02 -3.8833E-02  8.3288E-07  6.4349E-07  1.2972E-09  8.4406E-14
190072  1.2042E+03  2.8188E+02 -1.0024E+03  1.1492E+02 -5.7231E-02  6.0333E-02 -7.0582E-02  4.5127E+02 -9.3838E+02  1.1492E+02  8.7703E-02  1.0109E-01 -7.0582E-02  8.3550E-07  7.3103E-07  1.2972E-09  8.0606E-14
190077  0.0000E+00  3.2537E+02 -1.0473E+03  1.3137E+02 -0.0000E+00 -0.0000E+00 -0.0000E+00  3.2537E+02 -1.0473E+03  1.3137E+02  1.5143E-01  4.7046E-02 -0.0000E+00  8.3949E-07  6.6251E-07  1.2972E-09  8.8453E-14
190077  6.0425E+02  3.1464E+02 -1.0367E+03  1.1946E+02 -3.3676E-02  3.5116E-02 -3.7090E-02  4.0391E+02 -1.0053E+03  1.1946E+02  1.1623E-01  8.0611E-02 -3.7090E-02  8.3501E-07  6.5094E-07  1.2972E-09  8.4923E-14
190077  1.2064E+03  2.8562E+02 -1.0079E+03  8.8880E+01 -6.1048E-02  6.0702E-02 -6.1821E-02  4.5621E+02 -9.4304E+02  8.8880E+01  8.4686E-02  1.0200E-01 -6.1821E-02  8.4178E-07  7.2356E-07  1.2972E-09  8.0953E-14
190105  0.0000E+00  4.2643E+01 -9.0448E+02  5.9100E+01 -0.0000E+00 -0.0000E+00  0.0000E+00  4.2643E+01 -9.0448E+02  5.9100E+01  1.3078E-01  6.1658E-03  0.0000E+00  8.5569E-07  6.8570E-07  1.2972E-09  8.5774E-14
190105  6.0522E+02  2.8451E+01 -8.9470E+02  5.5914E+01 -4.4178E-02  3.3745E-02 -1.0172E-02  1.0654E+02 -8.8879E+02  5.5914E+01  8.5188E-02  3.7858E-02 -1.0172E-02  8.5569E-07  6.6602E-07  1.2972E-09  8.0756E-14
190115  0.0000E+00  8.8565E+02 -7.7305E+02  1.0496E+03 -0.0000E+00 -0.0000E+00 -0.0000E+00  8.8565E+02 -7.7305E+02  1.0496E+03  1.1178E-01  1.2806E-01 -0.0000E+00  8.0733E-07  5.6538E-07  1.2972E-09  1.5182E-13
190115  6.1026E+02  8.7535E+02 -7.6807E+02  1.0219E+03 -3.1190E-02  1.8430E-02 -8.9794E-02  9.3963E+02 -6.8794E+02  1.0219E+03  7.9865E-02  1.4500E-01 -8.9794E-02  7.9483E-07  5.0319E-07  1.2972E-09  1.5658E-13
190115  1.2095E+03  8.5419E+02 -7.4705E+02  9.4286E+02 -2.9755E-02  5.5118E-02 -1.7460E-01  9.7115E+02 -5.8703E+02  9.4286E+02  7.8262E-02  1.7863E-01 -1.7460E-01  7.8693E-07  2.3021E-07  1.2972E-09  1.5676E-13
190127  0.0000E+00  1.2319E+02 -9.0287E+02  1.6316E+02 -0.0000E+00 -0.0000E+00  0.0000E+00  1.2319E+02 -9.0287E+02  1.6316E+02  1.3055E-01  1.7813E-02  0.0000E+00  8.3495E-07  5.8827E-07  1.2972E-09  8.0038E-14
190128  0.0000E+00  3.1095E+02 -1.0316E+03  1.5835E+02 -0.0000E+00 -0.0000E+00 -0.0000E+00  3.1095E+02 -1.0316E+03  1.5835E+02  1.4916E-01  4.4961E-02 -0.0000E+00  8.3288E-07  6.5354E-07  1.2972E-09  8.7162E-14
190128  6.0790E+02  3.0010E+02 -1.0222E+03  1.4665E+02 -3.4744E-02  3.0365E-02 -3.7825E-02  3.8867E+02 -9.9187E+02  1.4665E+02  1.1305E-01  7.3757E-02 -3.7825E-02  8.3288E-07  6.9035E-07  1.2972E-09  8.3761E-14
190128  1.2057E+03  2.7034E+02 -9.9569E+02  1.1447E+02 -6.1907E-02  5.7704E-02 -6.6636E-02  4.3894E+02 -9.3371E+02  1.1447E+02  8.2061E-02  9.6792E-02 -6.6636E-02  8.3550E-07  7.0454E-07  1.2972E-09  7.9954E-14
190129  0.0000E+00  3.1002E+02 -1.0337E+03  1.7838E+02 -0.0000E+00 -0.0000E+00 -0.0000E+00  3.1002E+02 -1.0337E+03  1.7838E+02  1.4946E-01  4.4826E-02 -0.0000E+00  8.3036E-07  6.8201E-07  1.2972E-09  8.7345E-14
190129  6.0784E+02  2.9883E+02 -1.0259E+03  1.6495E+02 -3.6725E-02  2.7420E-02 -4.2908E-02  3.8773E+02 -9.9575E+02  1.6495E+02  1.1162E-01  7.0629E-02 -4.2908E-02  8.3288E-07  6.5173E-07  1.2972E-09  8.4138E-14
190129  1.2138E+03  2.6692E+02 -9.9906E+02  1.2996E+02 -6.6438E-02  6.0577E-02 -7.1372E-02  4.3726E+02 -9.3710E+02  1.2996E+02  7.8017E-02  9.9172E-02 -7.1372E-02  8.3550E-07  7.4620E-07  1.2972E-09  8.0254E-14
190138  0.0000E+00  4.8645E+01 -9.0879E+02  6.4448E+01 -0.0000E+00 -0.0000E+00  0.0000E+00  4.8645E+01 -9.0879E+02  6.4448E+01  1.3140E-01  7.0336E-03  0.0000E+00  8.4949E-07  6.5005E-07  1.2972E-09  8.5733E-14
190138  6.1327E+02  3.5287E+01 -8.9791E+02  6.1692E+01 -4.2493E-02  3.6575E-02 -8.7953E-03  1.1467E+02 -8.9126E+02  6.1692E+01  8.7337E-02  4.1677E-02 -8.7953E-03  8.5569E-07  6.4862E-07  1.2972E-09  8.0505E-14
190139  0.0000E+00  3.0539E+02 -1.0281E+03  1.7349E+02 -0.0000E+00 -0.0000E+00 -0.0000E+00  3.0539E+02 -1.0281E+03  1.7349E+02  1.4866E-01  4.4157E-02 -0.0000E+00  8.3036E-07  6.9281E-07  1.2972E-09  8.6904E-14
190139  6.0919E+02  2.9284E+02 -1.0191E+03  1.6120E+02 -3.9234E-02  3.0011E-02 -3.9045E-02  3.8136E+02 -9.8942E+02  1.6120E+02  1.0812E-01  7.2353E-02 -3.9045E-02  8.3288E-07  6.9994E-07  1.2972E-09  8.3556E-14
190139  1.2155E+03  2.5946E+02 -9.9081E+02  1.2906E+02 -6.8381E-02  6.1777E-02 -6.6379E-02  4.2871E+02 -9.3019E+02  1.2906E+02  7.4883E-02  9.9293E-02 -6.6379E-02  8.3550E-07  7.4638E-07  1.2972E-09  7.9537E-14
190144  0.0000E+00  3.6252E+01 -8.9727E+02  6.4047E+01 -0.0000E+00 -0.0000E+00  0.0000E+00  3.6252E+01 -8.9727E+02  6.4047E+01  1.2974E-01  5.2418E-03  0.0000E+00  8.5569E-07  6.4860E-07  1.2972E-09  8.5353E-14
190147  0.0000E+00  4.4787E+02 -1.1275E+03  2.4272E+02 -0.0000E+00 -0.0000E+00 -0.0000E+00  4.4787E+02 -1.1275E+03  2.4272E+02  1.6303E-01  6.4758E-02 -0.0000E+00  8.3564E-07  6.7220E-07  1.2972E-09  9.5782E-14
190147  6.0994E+02  4.4039E+02 -1.1214E+03  2.3090E+02 -2.4069E-02  1.9518E-02 -3.6356E-02  5.3745E+02 -1.0783E+03  2.3090E+02  1.3808E-01  8.3195E-02 -3.6356E-02  8.3159E-07  6.7986E-07  1.2972E-09  9.4198E-14
190150  0.0000E+00  4.4103E+02 -1.1200E+03  2.3124E+02 -0.0000E+00 -0.0000E+00  0.0000E+00  4.4103E+02 -1.1200E+03  2.3124E+02  1.6194E-01  6.3769E-02  0.0000E+00  8.3159E-07  6.7984E-07  1.2972E-09  9.4999E-14
190153  0.0000E+00  8.9931E+02 -8.1543E+02  9.8815E+02 -0.0000E+00 -0.0000E+00  0.0000E+00  8.9931E+02 -8.1543E+02  9.8815E+02  1.1790E-01  1.3003E-01  0.0000E+00  8.1163E-07  5.8592E-07  1.2972E-09  1.4893E-13
190153  6.0711E+02  8.9059E+02 -8.1439E+02  9.6165E+02 -2.7624E-02  6.5084E-03 -8.4922E-02  9.5856E+02 -7.3317E+02  9.6165E+02  9.0129E-02  1.3528E-01 -8.4922E-02  8.0871E-07  4.0433E-07  1.2972E-09  1.5410E-13
190154  0.0000E+00  9.0947E+02 -8.3590E+02  1.0455E+03 -0.0000E+00 -0.0000E+00 -0.0000E+00  9.0947E+02 -8.3590E+02  1.0455E+03  1.2086E-01  1.3150E-01 -0.0000E+00  8.0967E-07  6.6255E-07  1.2972E-09  1.5352E-13
190154  6.1466E+02  8.9726E+02 -8.3630E+02  1.0158E+03 -3.6590E-02  2.8211E-03 -9.3362E-02  9.6795E+02 -7.5336E+02  1.0158E+03  8.4331E-02  1.3256E-01 -9.3362E-02  8.1334E-07  5.5548E-07  1.2972E-09  1.5830E-13
190154  1.2029E+03  8.6820E+02 -8.2899E+02  9.3751E+02 -5.8462E-02  2.4666E-02 -1.7241E-01  9.9856E+02 -6.6623E+02  9.3751E+02  6.1403E-02  1.5020E-01 -1.7241E-01  8.1169E-07  4.0198E-07  1.2972E-09  1.5793E-13
190155  0.0000E+00  9.0859E+02 -8.3713E+02  1.0537E+03 -0.0000E+00 -0.0000E+00 -0.0000E+00  9.0859E+02 -8.3713E+02  1.0537E+03  1.2104E-01  1.3137E-01 -0.0000E+00  8.0967E-07  6.8427E-07  1.2972E-09  1.5396E-13
190155  6.1271E+02  8.9613E+02 -8.3931E+02  1.0234E+03 -3.8671E-02 -1.8567E-03 -9.5560E-02  9.6688E+02 -7.5674E+02  1.0234E+03  8.2687E-02  1.2772E-01 -9.5560E-02  8.1334E-07  5.4629E-07  1.2972E-09  1.5864E-13
190155  1.2011E+03  8.6563E+02 -8.3463E+02  9.4425E+02 -6.1685E-02  1.9726E-02 -1.7373E-01  9.9683E+02 -6.7249E+02  9.4425E+02  5.8995E-02  1.4489E-01 -1.7373E-01  8.1169E-07  4.1444E-07  1.2972E-09  1.5805E-13
190179  0.0000E+00  5.2966E+02 -9.5491E+02  4.8399E+02 -0.0000E+00 -0.0000E+00  0.0000E+00  5.2966E+02 -9.5491E+02  4.8399E+02  1.3807E-01  7.6584E-02  0.0000E+00  7.7286E-07  5.4806E-07  1.2972E-09  9.3418E-14
190179  6.0555E+02  5.2274E+02 -9.4746E+02  4.6677E+02 -2.2663E-02  2.6002E-02 -5.6594E-02  6.0359E+02 -8.9812E+02  4.6677E+02  1.1433E-01  1.0159E-01 -5.6594E-02  7.6413E-07  4.3237E-07  1.2972E-09  9.4936E-14
190182  0.0000E+00  6.1267E+02 -1.2589E+03  3.2901E+02 -0.0000E+00 -0.0000E+00  0.0000E+00  6.1267E+02 -1.2589E+03  3.2901E+02  1.8202E-01  8.8587E-02  0.0000E+00  8.3303E-07  6.6391E-07  1.2972E-09  1.1044E-13
190193  0.0000E+00  8.7989E+02 -7.4939E+02  1.0365E+03 -0.0000E+00 -0.0000E+00 -0.0000E+00  8.7989E+02 -7.4939E+02  1.0365E+03  1.0835E-01  1.2723E-01 -0.0000E+00  7.9041E-07  3.4784E-07  1.2972E-09  1.5058E-13
190194  0.0000E+00  8.9517E+02 -8.1845E+02  1.0774E+03 -0.0000E+00 -0.0000E+00 -0.0000E+00  8.9517E+02 -8.1845E+02  1.0774E+03  1.1834E-01  1.2943E-01 -0.0000E+00  8.1278E-07  4.1436E-07  1.2972E-09  1.5428E-13
190194  6.1163E+02  8.8863E+02 -8.1016E+02  1.0488E+03 -2.0058E-02  2.7460E-02 -9.2685E-02  9.5671E+02 -7.2851E+02  1.0488E+03  9.7084E-02  1.5595E-01 -9.2685E-02  8.0982E-07  4.2625E-07  1.2972E-09  1.5958E-13
190194  1.2001E+03  8.7307E+02 -7.8607E+02  9.7004E+02 -3.0584E-02  5.4033E-02 -1.7269E-01  9.9568E+02 -6.2352E+02  9.7004E+02  8.3075E-02  1.8027E-01 -1.7269E-01  8.0097E-07  4.7658E-07  1.2972E-09  1.6048E-13
190208  0.0000E+00  5.4292E+02 -9.7455E+02  5.0593E+02 -0.0000E+00 -0.0000E+00  0.0000E+00  5.4292E+02 -9.7455E+02  5.0593E+02  1.4091E-01  7.8502E-02  0.0000E+00  7.6934E-07  6.1735E-07  1.2972E-09  9.5934E-14
190208  6.0349E+02  5.3475E+02 -9.6951E+02  4.9141E+02 -2.6426E-02  1.8559E-02 -5.0594E-02  6.1721E+02 -9.1922E+02  4.9141E+02  1.1376E-01  9.5879E-02 -5.0594E-02  7.7286E-07  5.7496E-07  1.2972E-09  9.7701E-14
190251  0.0000E+00  8.9127E+02 -8.0407E+02  9.8693E+02 -0.0000E+00 -0.0000E+00  0.0000E+00  8.9127E+02 -8.0407E+02  9.8693E+02  1.1626E-01  1.2887E-01  0.0000E+00  8.1163E-07  6.6030E-07  1.2972E-09  1.4811E-13
190251  6.0195E+02  8.7991E+02 -8.0157E+02  9.6179E+02 -3.2349E-02  1.1691E-02 -8.0801E-02  9.4626E+02 -7.2204E+02  9.6179E+02  8.3550E-02  1.3892E-01 -8.0801E-02  8.0297E-07  5.3293E-07  1.2972E-09  1.5294E-13
190255  0.0000E+00  8.9862E+02 -8.1363E+02  9.9578E+02 -0.0000E+00 -0.0000E+00  0.0000E+00  8.9862E+02 -8.1363E+02  9.9578E+02  1.1764E-01  1.2993E-01  0.0000E+00  8.1163E-07  5.6866E-07  1.2972E-09  1.4936E-13
190255  6.1217E+02  8.9010E+02 -8.1261E+02  9.6891E+02 -2.7924E-02  5.4754E-03 -8.6137E-02  9.5845E+02 -7.3075E+02  9.6891E+02  8.9573E-02  1.3418E-01 -8.6137E-02  8.0871E-07  5.4524E-07  1.2972E-09  1.5458E-13
190286  0.0000E+00  8.1347E+02 -1.2085E+03  7.1613E+02 -0.0000E+00 -0.0000E+00 -0.0000E+00  8.1347E+02 -1.2085E+03  7.1613E+02  1.7474E-01  1.1762E-01 -0.0000E+00  8.3836E-07  6.0162E-07  1.2972E-09  1.3167E-13
190295  0.0000E+00  6.3494E+02 -1.2725E+03  2.6707E+02 -0.0000E+00 -0.0000E+00 -0.0000E+00  6.3494E+02 -1.2725E+03  2.6707E+02  1.8399E-01  9.1808E-02 -0.0000E+00  8.4827E-07  6.9024E-07  1.2972E-09  1.1111E-13
190296  0.0000E+00  6.1728E+02 -1.2551E+03  3.0381E+02 -0.0000E+00 -0.0000E+00 -0.0000E+00  6.1728E+02 -1.2551E+03  3.0381E+02  1.8148E-01  8.9253E-02 -0.0000E+00  8.4303E-07  7.1072E-07  1.2972E-09  1.0991E-13
190296  6.1108E+02  6.0834E+02 -1.2476E+03  2.9189E+02 -2.8520E-02  2.6958E-02 -3.7446E-02  7.1605E+02 -1.1890E+03  2.9189E+02  1.5187E-01  1.1492E-01 -3.7446E-02  8.3984E-07  6.6953E-07  1.2972E-09  1.0999E-13
190383  0.0000E+00  7.0737E+02 -1.3468E+03  4.7579E+02 -0.0000E+00 -0.0000E+00  0.0000E+00  7.0737E+02 -1.3468E+03  4.7579E+02  1.9473E-01  1.0228E-01  0.0000E+00  8.3773E-07  6.3004E-07  1.2972E-09  1.2299E-13
190401  0.0000E+00  6.4420E+02 -1.2177E+03  4.9865E+02 -0.0000E+00 -0.0000E+00 -0.0000E+00  6.4420E+02 -1.2177E+03  4.9865E+02  1.7607E-01  9.3146E-02 -0.0000E+00  8.1128E-07  5.1091E-07  1.2972E-09  1.1340E-13
190403  0.0000E+00  7.7844E+02 -6.4756E+02  6.7738E+02 -0.0000E+00 -0.0000E+00  0.0000E+00  7.7844E+02 -6.4756E+02  6.7738E+02  9.3632E-02  1.1256E-01  0.0000E+00  7.2510E-07  4.0356E-07  1.2972E-09  1.1830E-13
190437  0.0000E+00  8.2209E+02 -1.2210E+03  7.1434E+02 -0.0000E+00 -0.0000E+00 -0.0000E+00  8.2209E+02 -1.2210E+03  7.1434E+02  1.7655E-01  1.1887E-01 -0.0000E+00  8.3551E-07  5.6509E-07  1.2972E-09  1.3263E-13
190444  0.0000E+00  9.0678E+02 -8.3004E+02  1.0276E+03 -0.0000E+00 -0.0000E+00 -0.0000E+00  9.0678E+02 -8.3004E+02  1.0276E+03  1.2002E-01  1.3111E-01 -0.0000E+00  8.1334E-07  5.6405E-07  1.2972E-09  1.5213E-13
190444  6.0194E+02  8.9733E+02 -8.2680E+02  1.0019E+03 -3.0804E-02  1.2419E-02 -8.6336E-02  9.6580E+02 -7.4567E+02  1.0019E+03  8.8744E-02  1.4216E-01 -8.6336E-02  8.1642E-07  5.1672E-07  1.2972E-09  1.5728E-13
190444  1.2054E+03  8.7249E+02 -8.1431E+02  9.2455E+02 -4.7348E-02  3.2053E-02 -1.6827E-01  1.0005E+03 -6.5067E+02  9.2455E+02  7.0394E-02  1.5821E-01 -1.6827E-01  8.0631E-07  4.5471E-07  1.2972E-09  1.5761E-13
190485  0.0000E+00  4.0028E+02 -1.0863E+03  2.0686E+02 -0.0000E+00 -0.0000E+00  0.0000E+00  4.0028E+02 -1.0863E+03  2.0686E+02  1.5707E-01  5.7877E-02  0.0000E+00  8.3068E-07  5.5872E-07  1.2972E-09  9.1752E-14
190495  0.0000E+00  7.6504E+02 -5.9234E+02  6.7899E+02 -0.0000E+00 -0.0000E+00  0.0000E+00  7.6504E+02 -5.9234E+02  6.7899E+02  8.5647E-02  1.1062E-01  0.0000E+00  7.1437E-07  5.1509E-07  1.2972E-09  1.1742E-13
190495  6.1014E+02  7.5838E+02 -5.8838E+02  6.5657E+02 -2.0858E-02  1.4103E-02 -7.3269E-02  8.0727E+02 -5.1927E+02  6.5657E+02  6.4216E-02  1.2376E-01 -7.3269E-02  7.1206E-07  4.8962E-07  1.2972E-09  1.2178E-13
190495  1.2001E+03  7.4533E+02 -5.7293E+02  5.9170E+02 -1.6003E-02  3.9181E-02 -1.4891E-01  8.3305E+02 -4.3564E+02  5.9170E+02  6.6837E-02  1.4695E-01 -1.4891E-01  6.8961E-07  1.4175E-07  1.2972E-09  1.2271E-13
190498  0.0000E+00  7.6025E+02 -5.8244E+02  6.6976E+02 -0.0000E+00 -0.0000E+00  0.0000E+00  7.6025E+02 -5.8244E+02  6.6976E+02  8.4216E-02  1.0993E-01  0.0000E+00  7.0783E-07  5.0559E-07  1.2972E-09  1.1645E-13
190498  6.0962E+02  7.5428E+02 -5.7635E+02  6.4735E+02 -1.5054E-02  2.1017E-02 -7.4758E-02  8.0209E+02 -5.0771E+02  6.4735E+02  6.8281E-02  1.3008E-01 -7.4758E-02  7.0783E-07  3.6207E-07  1.2972E-09  1.2085E-13
190557  0.0000E+00  8.9951E+02 -8.1400E+02  1.0497E+03 -0.0000E+00 -0.0000E+00 -0.0000E+00  8.9951E+02 -8.1400E+02  1.0497E+03  1.1770E-01  1.3006E-01 -0.0000E+00  8.0982E-07  3.8075E-07  1.2972E-09  1.5293E-13
190557  6.0606E+02  8.9505E+02 -8.0576E+02  1.0222E+03 -1.5919E-02  2.6162E-02 -9.0394E-02  9.6213E+02 -7.2433E+02  1.0222E+03  1.0059E-01  1.5558E-01 -9.0394E-02  8.1016E-07  4.8855E-07  1.2972E-09  1.5848E-13
190573  0.0000E+00  3.7345E+02 -1.0830E+03  1.1381E+02 -0.0000E+00 -0.0000E+00 -0.0000E+00  3.7345E+02 -1.0830E+03  1.1381E+02  1.5659E-01  5.3998E-02 -0.0000E+00  8.4252E-07  7.2002E-07  1.2972E-09  9.1302E-14
190573  6.1135E+02  3.6614E+02 -1.0787E+03  1.0413E+02 -2.4492E-02  1.5621E-02 -2.9444E-02  4.5994E+02 -1.0422E+03  1.0413E+02  1.3148E-01  6.8561E-02 -2.9444E-02  8.4492E-07  6.8670E-07  1.2972E-09  8.8550E-14
190589  0.0000E+00  3.1618E+02 -1.0334E+03  1.2659E+02 -0.0000E+00 -0.0000E+00 -0.0000E+00  3.1618E+02 -1.0334E+03  1.2659E+02  1.4942E-01  4.5717E-02 -0.0000E+00  8.2426E-07  6.5114E-07  1.2972E-09  8.7335E-14
190589  6.1639E+02  3.0449E+02 -1.0225E+03  1.1534E+02 -3.5501E-02  3.3820E-02 -3.5191E-02  3.9429E+02 -9.9134E+02  1.1534E+02  1.1234E-01  7.7846E-02 -3.5191E-02  8.3721E-07  6.7398E-07  1.2972E-09  8.3702E-14
190601  0.0000E+00  7.7483E+02 -6.3378E+02  6.7126E+02 -0.0000E+00 -0.0000E+00  0.0000E+00  7.7483E+02 -6.3378E+02  6.7126E+02  9.1639E-02  1.1203E-01  0.0000E+00  7.0896E-07  4.0720E-07  1.2972E-09  1.1765E-13
190602  0.0000E+00  7.6701E+02 -5.9523E+02  6.8554E+02 -0.0000E+00 -0.0000E+00  0.0000E+00  7.6701E+02 -5.9523E+02  6.8554E+02  8.6065E-02  1.1090E-01  0.0000E+00  7.1437E-07  5.2163E-07  1.2972E-09  1.1800E-13
190602  6.0325E+02  7.6084E+02 -5.9287E+02  6.6364E+02 -1.9602E-02  1.0819E-02 -7.2700E-02  8.0959E+02 -5.2433E+02  6.6364E+02  6.6121E-02  1.2083E-01 -7.2700E-02  7.1206E-07  4.9941E-07  1.2972E-09  1.2238E-13
190602  1.2024E+03  7.4673E+02 -5.7954E+02  5.9801E+02 -1.9659E-02  3.5571E-02 -1.4840E-01  8.3572E+02 -4.4164E+02  5.9801E+02  6.4137E-02  1.4354E-01 -1.4840E-01  6.8961E-07  1.8404E-07  1.2972E-09  1.2325E-13
190609  0.0000E+00  8.9639E+02 -8.0066E+02  1.0429E+03 -0.0000E+00 -0.0000E+00  0.0000E+00  8.9639E+02 -8.0066E+02  1.0429E+03  1.1577E-01  1.2961E-01  0.0000E+00  8.0982E-07  4.4046E-07  1.2972E-09  1.5225E-13
190609  6.0654E+02  8.9024E+02 -7.9191E+02  1.0161E+03 -1.7310E-02  2.8180E-02 -8.8591E-02  9.5618E+02 -7.1089E+02  1.0161E+03  9.7193E-02  1.5690E-01 -8.8591E-02  8.0576E-07  3.9576E-07  1.2972E-09  1.5764E-13
190615  0.0000E+00  4.7022E+02 -1.1461E+03  2.2568E+02 -0.0000E+00 -0.0000E+00 -0.0000E+00  4.7022E+02 -1.1461E+03  2.2568E+02  1.6572E-01  6.7989E-02 -0.0000E+00  8.4109E-07  6.6667E-07  1.2972E-09  9.7387E-14
190694  0.0000E+00  3.2066E+02 -1.0385E+03  1.1883E+02 -0.0000E+00 -0.0000E+00 -0.0000E+00  3.2066E+02 -1.0385E+03  1.1883E+02  1.5015E-01  4.6364E-02 -0.0000E+00  8.3949E-07  6.7704E-07  1.2972E-09  8.7767E-14
190694  6.0463E+02  3.0969E+02 -1.0294E+03  1.0914E+02 -3.6838E-02  2.8277E-02 -3.1249E-02  3.9839E+02 -9.9847E+02  1.0914E+02  1.1201E-01  7.3056E-02 -3.1249E-02  8.3721E-07  7.4128E-07  1.2972E-09  8.4310E-14
190696  0.0000E+00  6.3111E+02 -1.2805E+03  3.2232E+02 -0.0000E+00 -0.0000E+00 -0.0000E+00  6.3111E+02 -1.2805E+03  3.2232E+02  1.8515E-01  9.1253E-02 -0.0000E+00  8.4069E-07  6.0245E-07  1.2972E-09  1.1239E-13
190696  6.0448E+02  6.2396E+02 -1.2697E+03  3.0847E+02 -2.4332E-02  3.3523E-02 -4.4484E-02  7.3241E+02 -1.2104E+03  3.0847E+02  1.5926E-01  1.2374E-01 -4.4484E-02  8.4303E-07  6.9109E-07  1.2972E-09  1.1241E-13
190712  0.0000E+00  8.9333E+02 -8.0583E+02  9.9548E+02 -0.0000E+00 -0.0000E+00  0.0000E+00  8.9333E+02 -8.0583E+02  9.9548E+02  1.1652E-01  1.2917E-01  0.0000E+00  8.1163E-07  6.3018E-07  1.2972E-09  1.4885E-13
190712  6.1551E+02  8.8164E+02 -8.0439E+02  9.6959E+02 -3.6167E-02  8.3012E-03 -8.3427E-02  9.4964E+02 -7.2284E+02  9.6959E+02  8.0141E-02  1.3578E-01 -8.3427E-02  8.0297E-07  5.2463E-07  1.2972E-09  1.5378E-13
190751  0.0000E+00  9.0152E+02 -8.1934E+02  1.0119E+03 -0.0000E+00 -0.0000E+00 -0.0000E+00  9.0152E+02 -8.1934E+02  1.0119E+03  1.1847E-01  1.3035E-01 -0.0000E+00  8.1016E-07  5.7139E-07  1.2972E-09  1.5065E-13
190751  6.0972E+02  8.9174E+02 -8.1623E+02  9.8414E+02 -3.0578E-02  9.9997E-03 -9.0283E-02  9.6015E+02 -7.3455E+02  9.8414E+02  8.7442E-02  1.3894E-01 -9.0283E-02  8.1163E-07  5.7561E-07  1.2972E-09  1.5568E-13
190757  0.0000E+00  9.1386E+02 -8.4722E+02  9.9744E+02 -0.0000E+00 -0.0000E+00  0.0000E+00  9.1386E+02 -8.4722E+02  9.9744E+02  1.2250E-01  1.3214E-01  0.0000E+00  8.1642E-07  5.3725E-07  1.2972E-09  1.5084E-13
190757  6.0344E+02  9.0610E+02 -8.4424E+02  9.7216E+02 -2.5913E-02  1.1876E-02 -8.2666E-02  9.7622E+02 -7.6207E+02  9.7216E+02  9.6156E-02  1.4289E-01 -8.2666E-02  8.1957E-07  5.4457E-07  1.2972E-09  1.5630E-13
190784  0.0000E+00  5.8287E+02 -1.1976E+03  3.6483E+02 -0.0000E+00 -0.0000E+00 -0.0000E+00  5.8287E+02 -1.1976E+03  3.6483E+02  1.7317E-01  8.4278E-02 -0.0000E+00  8.2683E-07  5.8364E-07  1.2972E-09  1.0610E-13
190784  6.1115E+02  5.7550E+02 -1.1846E+03  3.5224E+02 -2.3072E-02  4.2653E-02 -4.1152E-02  6.7780E+02 -1.1292E+03  3.5224E+02  1.4822E-01  1.2587E-01 -4.1152E-02  8.3077E-07  5.8643E-07  1.2972E-09  1.0613E-13
190807  0.0000E+00  9.0303E+02 -8.2876E+02  1.0566E+03 -0.0000E+00 -0.0000E+00 -0.0000E+00  9.0303E+02 -8.2876E+02  1.0566E+03  1.1983E-01  1.3057E-01 -0.0000E+00  8.0967E-07  4.7368E-07  1.2972E-09  1.5364E-13
190807  6.0464E+02  8.9578E+02 -8.2370E+02  1.0294E+03 -2.5150E-02  1.8481E-02 -8.9376E-02  9.6428E+02 -7.4234E+02  1.0294E+03  9.3950E-02  1.4800E-01 -8.9376E-02  8.1016E-07  5.1228E-07  1.2972E-09  1.5893E-13
190807  1.2057E+03  8.7304E+02 -8.0676E+02  9.5052E+02 -4.8867E-02  3.6945E-02 -1.7106E-01  9.9973E+02 -6.4311E+02  9.5052E+02  6.7784E-02  1.6318E-01 -1.7106E-01  8.0297E-07  5.0052E-07  1.2972E-09  1.5930E-13
190808  0.0000E+00  9.1417E+02 -8.4113E+02  1.0406E+03 -0.0000E+00 -0.0000E+00  0.0000E+00  9.1417E+02 -8.4113E+02  1.0406E+03  1.2162E-01  1.3218E-01  0.0000E+00  8.0967E-07  6.1923E-07  1.2972E-09  1.5364E-13
190808  6.0760E+02  9.0473E+02 -8.4325E+02  1.0139E+03 -3.1351E-02 -2.3007E-03 -8.7665E-02  9.7523E+02 -7.6061E+02  1.0139E+03  9.0575E-02  1.2852E-01 -8.7665E-02  8.1334E-07  5.2555E-07  1.2972E-09  1.5887E-13
190808  1.2084E+03  8.7826E+02 -8.3892E+02  9.3688E+02 -5.4873E-02  1.8149E-02 -1.6822E-01  1.0107E+03 -6.7348E+02  9.3688E+02  6.6428E-02  1.4514E-01 -1.6822E-01  8.1169E-07  4.6824E-07  1.2972E-09  1.5911E-13
190809  0.0000E+00  9.1688E+02 -8.4557E+02  1.0264E+03 -0.0000E+00 -0.0000E+00  0.0000E+00  9.1688E+02 -8.4557E+02  1.0264E+03  1.2226E-01  1.3257E-01  0.0000E+00  8.2226E-07  5.8101E-07  1.2972E-09  1.5298E-13
190809  6.0741E+02  9.0841E+02 -8.4495E+02  1.0000E+03 -2.7172E-02  6.2984E-03 -8.6130E-02  9.7902E+02 -7.6201E+02  1.0000E+03  9.5000E-02  1.3765E-01 -8.6130E-02  8.1642E-07  5.1795E-07  1.2972E-09  1.5836E-13
190809  1.2091E+03  8.8459E+02 -8.3549E+02  9.2407E+02 -5.0341E-02  2.7124E-02 -1.6558E-01  1.0164E+03 -6.6889E+02  9.2407E+02  7.0463E-02  1.5503E-01 -1.6558E-01  8.1169E-07  3.7479E-07  1.2972E-09  1.5903E-13
190810  0.0000E+00  9.1269E+02 -8.3941E+02  1.0313E+03 -0.0000E+00 -0.0000E+00 -0.0000E+00  9.1269E+02 -8.3941E+02  1.0313E+03  1.2137E-01  1.3197E-01 -0.0000E+00  8.1334E-07  6.1016E-07  1.2972E-09  1.5291E-13
190810  6.1316E+02  9.0322E+02 -8.3949E+02  1.0038E+03 -3.0378E-02  4.9561E-03 -8.8912E-02  9.7400E+02 -7.5622E+02  1.0038E+03  9.1005E-02  1.3555E-01 -8.8912E-02  8.1642E-07  4.9423E-07  1.2972E-09  1.5814E-13
190810  1.2076E+03  8.7851E+02 -8.3030E+02  9.2701E+02 -4.9798E-02  2.8324E-02 -1.6775E-01  1.0094E+03 -6.6506E+02  9.2701E+02  7.0256E-02  1.5535E-01 -1.6775E-01  8.1169E-07  3.8330E-07  1.2972E-09  1.5849E-13
190811  0.0000E+00  9.0589E+02 -8.2969E+02  9.9789E+02 -0.0000E+00 -0.0000E+00  0.0000E+00  9.0589E+02 -8.2969E+02  9.9789E+02  1.1997E-01  1.3098E-01  0.0000E+00  8.1642E-07  4.8470E-07  1.2972E-09  1.5014E-13
190811  6.1230E+02  8.9946E+02 -8.2443E+02  9.7065E+02 -2.0234E-02  1.6839E-02 -8.7511E-02  9.6883E+02 -7.4167E+02  9.7065E+02  9.8972E-02  1.4689E-01 -8.7511E-02  8.0871E-07  5.1965E-07  1.2972E-09  1.5566E-13
190812  0.0000E+00  9.0440E+02 -8.2762E+02  1.0428E+03 -0.0000E+00 -0.0000E+00 -0.0000E+00  9.0440E+02 -8.2762E+02  1.0428E+03  1.1967E-01  1.3077E-01 -0.0000E+00  8.0967E-07  5.1583E-07  1.2972E-09  1.5288E-13
190812  6.1331E+02  8.9484E+02 -8.2171E+02  1.0149E+03 -2.9997E-02  1.9052E-02 -8.9941E-02  9.6410E+02 -7.3923E+02  1.0149E+03  8.8815E-02  1.4844E-01 -8.9941E-02  8.1016E-07  5.2366E-07  1.2972E-09  1.5801E-13
190812  1.2067E+03  8.6969E+02 -8.0491E+02  9.3726E+02 -5.1770E-02  3.7853E-02 -1.7046E-01  9.9622E+02 -6.4172E+02  9.3726E+02  6.4613E-02  1.6360E-01 -1.7046E-01  8.0631E-07  4.2519E-07  1.2972E-09  1.5810E-13
190813  0.0000E+00  8.9831E+02 -8.0864E+02  1.0414E+03 -0.0000E+00 -0.0000E+00  0.0000E+00  8.9831E+02 -8.0864E+02  1.0414E+03  1.1692E-01  1.2989E-01  0.0000E+00  8.0982E-07  4.1249E-07  1.2972E-09  1.5230E-13
190814  0.0000E+00  8.9719E+02 -8.1054E+02  1.0151E+03 -0.0000E+00 -0.0000E+00 -0.0000E+00  8.9719E+02 -8.1054E+02  1.0151E+03  1.1720E-01  1.2973E-01 -0.0000E+00  8.1016E-07  5.2326E-07  1.2972E-09  1.5047E-13
190814  6.0433E+02  8.8818E+02 -8.0560E+02  9.8857E+02 -3.1264E-02  1.5564E-02 -8.5872E-02  9.5510E+02 -7.2501E+02  9.8857E+02  8.5219E-02  1.4399E-01 -8.5872E-02  8.1163E-07  6.6025E-07  1.2972E-09  1.5555E-13
190814  1.2056E+03  8.6248E+02 -7.9087E+02  9.1319E+02 -4.8411E-02  3.5259E-02 -1.6552E-01  9.8658E+02 -6.2930E+02  9.1319E+02  6.5943E-02  1.5997E-01 -1.6552E-01  7.9217E-07  3.5182E-07  1.2972E-09  1.5574E-13
190815  0.0000E+00  8.9913E+02 -8.1306E+02  1.0331E+03 -0.0000E+00 -0.0000E+00  0.0000E+00  8.9913E+02 -8.1306E+02  1.0331E+03  1.1756E-01  1.3001E-01  0.0000E+00  8.1016E-07  4.4460E-07  1.2972E-09  1.5181E-13
190815  6.0932E+02  8.9251E+02 -8.0604E+02  1.0057E+03 -2.3358E-02  2.1518E-02 -8.9344E-02  9.5997E+02 -7.2438E+02  1.0057E+03  9.3188E-02  1.5057E-01 -8.9344E-02  8.1016E-07  5.5353E-07  1.2972E-09  1.5718E-13
190852  0.0000E+00  3.0860E+02 -1.0232E+03  1.0848E+02 -0.0000E+00 -0.0000E+00 -0.0000E+00  3.0860E+02 -1.0232E+03  1.0848E+02  1.4794E-01  4.4621E-02 -0.0000E+00  8.3721E-07  7.4130E-07  1.2972E-09  8.6598E-14
190852  6.1256E+02  2.9678E+02 -1.0174E+03  9.8741E+01 -3.7711E-02  2.0301E-02 -2.8930E-02  3.8561E+02 -9.8714E+02  9.8741E+01  1.0939E-01  6.3213E-02 -2.8930E-02  8.4178E-07  7.4486E-07  1.2972E-09  8.3297E-14
190853  0.0000E+00  3.4828E+02 -1.0639E+03  1.1596E+02 -0.0000E+00 -0.0000E+00 -0.0000E+00  3.4828E+02 -1.0639E+03  1.1596E+02  1.5382E-01  5.0358E-02 -0.0000E+00  8.3110E-07  7.5291E-07  1.2972E-09  8.9766E-14
190853  6.0347E+02  3.3878E+02 -1.0598E+03  1.0679E+02 -3.1054E-02  1.6651E-02 -2.9671E-02  4.2985E+02 -1.0263E+03  1.0679E+02  1.2219E-01  6.5636E-02 -2.9671E-02  8.3949E-07  7.1379E-07  1.2972E-09  8.6866E-14
190853  1.2143E+03  3.1077E+02 -1.0395E+03  7.9512E+01 -5.9116E-02  5.3011E-02 -5.7359E-02  4.8757E+02 -9.6925E+02  7.9512E+01  9.1189E-02  9.7946E-02 -5.7359E-02  8.4078E-07  6.4681E-07  1.2972E-09  8.3663E-14
190861  0.0000E+00  7.7969E+02 -6.5114E+02  6.9145E+02 -0.0000E+00 -0.0000E+00  0.0000E+00  7.7969E+02 -6.5114E+02  6.9145E+02  9.4150E-02  1.1274E-01  0.0000E+00  7.2510E-07  4.0739E-07  1.2972E-09  1.1924E-13
190872  0.0000E+00  2.9817E+02 -1.0156E+03  1.3509E+02 -0.0000E+00 -0.0000E+00 -0.0000E+00  2.9817E+02 -1.0156E+03  1.3509E+02  1.4685E-01  4.3113E-02 -0.0000E+00  8.3288E-07  6.9435E-07  1.2972E-09  8.5944E-14
190872  6.1207E+02  2.8742E+02 -1.0080E+03  1.2519E+02 -3.4177E-02  2.6071E-02 -3.1028E-02  3.7539E+02 -9.7870E+02  1.2519E+02  1.1158E-01  6.7629E-02 -3.1028E-02  8.3721E-07  6.9496E-07  1.2972E-09  8.2543E-14
190873  0.0000E+00  2.7889E+02 -9.9916E+02  1.1852E+02 -0.0000E+00 -0.0000E+00  0.0000E+00  2.7889E+02 -9.9916E+02  1.1852E+02  1.4447E-01  4.0325E-02  0.0000E+00  8.3550E-07  6.9230E-07  1.2972E-09  8.4820E-14
190873  6.0013E+02  2.7124E+02 -9.9423E+02  1.1252E+02 -2.5409E-02  1.7018E-02 -2.0418E-02  3.5639E+02 -9.6699E+02  1.1252E+02  1.1835E-01  5.6238E-02 -2.0418E-02  8.3550E-07  7.0444E-07  1.2972E-09  8.1491E-14
190874  0.0000E+00  2.8715E+02 -1.0051E+03  1.3108E+02 -0.0000E+00 -0.0000E+00  0.0000E+00  2.8715E+02 -1.0051E+03  1.3108E+02  1.4533E-01  4.1519E-02  0.0000E+00  8.3721E-07  7.1514E-07  1.2972E-09  8.5171E-14
190874  6.0122E+02  2.7739E+02 -9.9948E+02  1.2392E+02 -3.1352E-02  2.0537E-02 -2.5092E-02  3.6311E+02 -9.7162E+02  1.2392E+02  1.1316E-01  6.0645E-02 -2.5092E-02  8.3550E-07  6.9844E-07  1.2972E-09  8.1896E-14
190875  0.0000E+00  2.7561E+02 -9.9466E+02  1.3266E+02 -0.0000E+00 -0.0000E+00  0.0000E+00  2.7561E+02 -9.9466E+02  1.3266E+02  1.4382E-01  3.9851E-02  0.0000E+00  8.3550E-07  6.8727E-07  1.2972E-09  8.4402E-14
190879  0.0000E+00  2.7931E+02 -8.9693E+02  2.4523E+02 -0.0000E+00 -0.0000E+00  0.0000E+00  2.7931E+02 -8.9693E+02  2.4523E+02  1.2969E-01  4.0385E-02  0.0000E+00  7.9967E-07  3.3980E-07  1.2972E-09  7.6234E-14
190881  0.0000E+00  3.3304E+02 -1.0511E+03  1.0910E+02 -0.0000E+00 -0.0000E+00 -0.0000E+00  3.3304E+02 -1.0511E+03  1.0910E+02  1.5199E-01  4.8155E-02 -0.0000E+00  8.3949E-07  6.6989E-07  1.2972E-09  8.8804E-14
190881  6.1581E+02  3.2302E+02 -1.0408E+03  9.6763E+01 -3.2771E-02  3.7418E-02 -3.7499E-02  4.1429E+02 -1.0079E+03  9.6763E+01  1.1772E-01  8.4124E-02 -3.7499E-02  8.4459E-07  6.8136E-07  1.2972E-09  8.5225E-14
190894  0.0000E+00  8.5939E+02 -7.5851E+02  9.3724E+02 -0.0000E+00 -0.0000E+00  0.0000E+00  8.5939E+02 -7.5851E+02  9.3724E+02  1.0967E-01  1.2426E-01  0.0000E+00  7.8889E-07  4.1392E-07  1.2972E-09  1.4199E-13
190903  0.0000E+00  8.6784E+02 -6.9448E+02  1.0266E+03 -0.0000E+00 -0.0000E+00 -0.0000E+00  8.6784E+02 -6.9448E+02  1.0266E+03  1.0042E-01  1.2548E-01 -0.0000E+00  7.8295E-07  5.6321E-07  1.2972E-09  1.4928E-13
190903  6.1241E+02  8.5861E+02 -6.9105E+02  9.9718E+02 -2.6616E-02  1.4417E-02 -9.4788E-02  9.1636E+02 -6.1241E+02  9.9718E+02  7.3304E-02  1.3856E-01 -9.4788E-02  7.8384E-07  4.2687E-07  1.2972E-09  1.5374E-13
190903  1.2050E+03  8.3912E+02 -6.7548E+02  9.1796E+02 -3.3748E-02  4.1314E-02 -1.7333E-01  9.4351E+02 -5.1980E+02  9.1796E+02  6.3921E-02  1.6264E-01 -1.7333E-01  7.7915E-07  1.8382E-07  1.2972E-09  1.5359E-13
190997  0.0000E+00  5.8858E+02 -1.2053E+03  3.5122E+02 -0.0000E+00 -0.0000E+00 -0.0000E+00  5.8858E+02 -1.2053E+03  3.5122E+02  1.7428E-01  8.5103E-02 -0.0000E+00  8.3143E-07  6.2291E-07  1.2972E-09  1.0651E-13
190997  6.0183E+02  5.8098E+02 -1.1943E+03  3.3985E+02 -2.3628E-02  3.8779E-02 -3.5945E-02  6.8258E+02 -1.1393E+03  3.3985E+02  1.4905E-01  1.2278E-01 -3.5945E-02  8.3367E-07  5.9567E-07  1.2972E-09  1.0661E-13
190998  0.0000E+00  5.9940E+02 -1.2277E+03  3.6020E+02 -0.0000E+00 -0.0000E+00 -0.0000E+00  5.9940E+02 -1.2277E+03  3.6020E+02  1.7752E-01  8.6668E-02 -0.0000E+00  8.3469E-07  5.3281E-07  1.2972E-09  1.0854E-13
