 0h  0'  0.4"   End of Setup
 0h  0'  1.6"      1.0% complete     Block Time:  0h  0'  1.2" (     1.185)      1665      2740         0
 0h  0'  3.4"      2.0% complete     Block Time:  0h  0'  1.8" (     1.796)      1596      2666         0
 0h  0' 23.0"      3.0% complete     Block Time:  0h  0' 19.6" (    19.618)       711      1212         0
 0h  0' 46.3"      4.0% complete     Block Time:  0h  0' 23.3" (    23.341)       474      1062         0
 0h  1' 17.3"      5.0% complete     Block Time:  0h  0' 31.0" (    30.959)       552       720         0
 0h  1' 55.9"      6.0% complete     Block Time:  0h  0' 38.7" (    38.658)       302       475         0
 0h  2' 28.7"      7.0% complete     Block Time:  0h  0' 32.8" (    32.777)       788      1104         0
 0h  2' 54.5"      8.0% complete     Block Time:  0h  0' 25.7" (    25.730)      1513      1220         0
 0h  3' 21.1"      9.0% complete     Block Time:  0h  0' 26.6" (    26.614)      1442      1305         0
 0h  3' 36.3"     10.0% complete     Block Time:  0h  0' 15.2" (    15.247)      1485      2131         0
 0h  3' 44.0"     11.0% complete     Block Time:  0h  0'  7.7" (     7.672)      2135      2138         0
 0h  4'  7.6"     12.0% complete     Block Time:  0h  0' 23.6" (    23.573)      1341      1752         0
 0h  5' 10.1"     13.0% complete     Block Time:  0h  1'  2.5" (    62.513)       224       608         0
 0h  5' 26.5"     14.0% complete     Block Time:  0h  0' 16.5" (    16.479)      1056      2518         0
 0h  5' 30.2"     15.0% complete     Block Time:  0h  0'  3.7" (     3.675)      2569      1836         0
 0h  5' 36.2"     16.0% complete     Block Time:  0h  0'  5.9" (     5.933)      2441      1838         0
 0h  5' 39.9"     17.0% complete     Block Time:  0h  0'  3.7" (     3.730)      1276      3049         0
 0h  5' 40.8"     18.0% complete     Block Time:  0h  0'  0.9" (     0.868)       556      3823         0
 0h  5' 45.5"     19.0% complete     Block Time:  0h  0'  4.8" (     4.794)      1048      3173         0
 0h  5' 49.7"     20.0% complete     Block Time:  0h  0'  4.1" (     4.126)      1586      2789         0
 0h  5' 59.1"     21.0% complete     Block Time:  0h  0'  9.4" (     9.391)      1693      2433         0
 0h  6'  2.1"     22.0% complete     Block Time:  0h  0'  3.1" (     3.081)      1165      3166         0
 0h  6' 31.5"     23.0% complete     Block Time:  0h  0' 29.3" (    29.330)       572      2398         0
 0h  7' 40.1"     24.0% complete     Block Time:  0h  1'  8.6" (    68.626)       455       698         0
 0h  8' 51.4"     25.0% complete     Block Time:  0h  1' 11.3" (    71.312)       421       757         0
 0h 10'  7.5"     26.0% complete     Block Time:  0h  1' 16.1" (    76.052)       424       692         0
 0h 11' 19.3"     27.0% complete     Block Time:  0h  1' 11.8" (    71.815)       555       849         0
 0h 12'  3.1"     28.0% complete     Block Time:  0h  0' 43.8" (    43.848)       800      1880         0
 0h 12' 50.8"     29.0% complete     Block Time:  0h  0' 47.7" (    47.705)       785      1780         0
 0h 13' 40.2"     30.0% complete     Block Time:  0h  0' 49.4" (    49.414)       820      1740         0
 0h 14' 26.6"     31.0% complete     Block Time:  0h  0' 46.3" (    46.322)       702      1965         0
 0h 15'  9.8"     32.0% complete     Block Time:  0h  0' 43.2" (    43.196)       674      2135         0
 0h 15' 49.9"     33.0% complete     Block Time:  0h  0' 40.1" (    40.147)       839      2157         0
 0h 15' 52.8" : Density Calculation Complete.    Block Time:  0h  0'  2.9"
 0h 17' 32.6" : Writing Results Complete.    Block Time:  0h  1' 39.8"
