id t x y z vx vy vz xi yi zi vxi vyi vzi FGrav FDrag FSol FTide
320018  0.0000E+00 -1.9739E+03 -8.3260E+02 -5.5076E+02 -0.0000E+00 -0.0000E+00 -0.0000E+00 -1.9739E+03 -8.3260E+02 -5.5076E+02  1.2039E-01 -2.8541E-01  0.0000E+00  9.2664E-07  7.0702E-07  1.2972E-09  3.3735E-13
320018  6.1578E+02 -1.9688E+03 -8.4193E+02 -5.4362E+02  1.6119E-02 -2.9651E-02  2.4033E-02 -1.8862E+03 -1.0137E+03 -5.4362E+02  1.3785E-01 -3.1433E-01  2.4033E-02  9.2664E-07  6.3772E-07  1.2972E-09  3.3858E-13
320034  0.0000E+00 -2.1264E+03 -7.7218E+02 -4.5699E+02 -0.0000E+00 -0.0000E+00 -0.0000E+00 -2.1264E+03 -7.7218E+02 -4.5699E+02  1.1165E-01 -3.0746E-01  0.0000E+00  9.0210E-07  6.8341E-07  1.2972E-09  3.4882E-13
320034  6.1282E+02 -2.1182E+03 -7.8124E+02 -4.5607E+02  2.5663E-02 -3.0800E-02  7.3852E-03 -2.0408E+03 -9.6562E+02 -4.5607E+02  1.3862E-01 -3.3707E-01  7.3852E-03  9.0210E-07  6.1326E-07  1.2972E-09  3.5106E-13
320055  0.0000E+00 -1.5605E+03 -6.8555E+02 -9.3948E+02 -0.0000E+00 -0.0000E+00 -0.0000E+00 -1.5605E+03 -6.8555E+02 -9.3948E+02  9.9125E-02 -2.2564E-01  0.0000E+00  9.7160E-07  6.6288E-07  1.2972E-09  2.9392E-13
320087  0.0000E+00 -2.0411E+03 -7.5253E+02 -5.5837E+02 -0.0000E+00 -0.0000E+00 -0.0000E+00 -2.0411E+03 -7.5253E+02 -5.5837E+02  1.0881E-01 -2.9512E-01  0.0000E+00  9.1194E-07  6.7915E-07  1.2972E-09  3.4091E-13
320087  6.0443E+02 -2.0367E+03 -7.6249E+02 -5.5156E+02  1.5545E-02 -3.2713E-02  2.2280E-02 -1.9624E+03 -9.3735E+02 -5.5156E+02  1.2580E-01 -3.2720E-01  2.2280E-02  9.1821E-07  6.2094E-07  1.2972E-09  3.4323E-13
320106  0.0000E+00 -1.1490E+03 -9.3941E+02 -9.1857E+02 -0.0000E+00 -0.0000E+00 -0.0000E+00 -1.1490E+03 -9.3941E+02 -9.1857E+02  1.3583E-01 -1.6613E-01  0.0000E+00  9.7355E-07  6.8551E-07  1.2972E-09  2.6037E-13
320148  0.0000E+00 -1.1669E+03 -9.2979E+02 -9.1629E+02  0.0000E+00 -0.0000E+00  0.0000E+00 -1.1669E+03 -9.2979E+02 -9.1629E+02  1.3444E-01 -1.6873E-01  0.0000E+00  9.7346E-07  5.9195E-07  1.2972E-09  2.6168E-13
320148  6.1619E+02 -1.1642E+03 -9.3360E+02 -8.9111E+02  7.6518E-03 -1.4981E-02  8.0011E-02 -1.0765E+03 -1.0335E+03 -8.9111E+02  1.4264E-01 -1.8331E-01  8.0011E-02  9.6651E-07  5.0027E-07  1.2972E-09  2.5740E-13
320165  0.0000E+00 -2.0872E+03 -1.1290E+03 -3.1122E+02  0.0000E+00 -0.0000E+00 -0.0000E+00 -2.0872E+03 -1.1290E+03 -3.1122E+02  1.6325E-01 -3.0179E-01  0.0000E+00  8.6493E-07  5.1881E-07  1.2972E-09  3.6265E-13
320165  6.0015E+02 -2.0723E+03 -1.1313E+03 -3.0795E+02  4.9133E-02 -1.0927E-02  1.0896E-02 -1.9665E+03 -1.3066E+03 -3.0795E+02  2.1271E-01 -3.1057E-01  1.0896E-02  8.7055E-07  5.4993E-07  1.2972E-09  3.6035E-13
320165  1.2129E+03 -2.0266E+03 -1.1420E+03 -2.9970E+02  1.0018E-01 -2.2469E-02  1.6344E-02 -1.7962E+03 -1.4781E+03 -2.9970E+02  2.6531E-01 -3.1549E-01  1.6344E-02  8.7683E-07  4.7025E-07  1.2972E-09  3.5195E-13
320243  0.0000E+00 -1.8521E+03 -1.4580E+03 -2.2308E+02 -0.0000E+00 -0.0000E+00 -0.0000E+00 -1.8521E+03 -1.4580E+03 -2.2308E+02  2.1082E-01 -2.6780E-01  0.0000E+00  8.3855E-07  6.4092E-07  1.2972E-09  3.5426E-13
320243  6.0319E+02 -1.8460E+03 -1.4594E+03 -2.2557E+02  1.9219E-02 -4.8904E-03 -7.2981E-03 -1.7118E+03 -1.6146E+03 -2.2557E+02  2.3024E-01 -2.7180E-01 -7.2981E-03  8.3081E-07  6.2876E-07  1.2972E-09  3.4952E-13
320243  1.2014E+03 -1.8303E+03 -1.4641E+03 -2.3092E+02  3.3353E-02 -1.0406E-02 -1.1828E-02 -1.5497E+03 -1.7584E+03 -2.3092E+02  2.4504E-01 -2.7506E-01 -1.1828E-02  8.4075E-07  6.1929E-07  1.2972E-09  3.4199E-13
320243  1.8024E+03 -1.8062E+03 -1.4742E+03 -2.3931E+02  4.6807E-02 -2.5236E-02 -1.5844E-02 -1.3654E+03 -1.8898E+03 -2.3931E+02  2.5996E-01 -2.8640E-01 -1.5844E-02  8.4845E-07  6.4640E-07  1.2972E-09  3.3178E-13
320243  2.4169E+03 -1.7719E+03 -1.4948E+03 -2.4898E+02  6.5036E-02 -4.3829E-02 -1.4923E-02 -1.1530E+03 -2.0112E+03 -2.4898E+02  2.8117E-01 -3.0003E-01 -1.4923E-02  8.2291E-07  6.4661E-07  1.2972E-09  3.1862E-13
320243  3.0023E+03 -1.7268E+03 -1.5240E+03 -2.5595E+02  8.8687E-02 -5.2680E-02 -7.6397E-03 -9.2568E+02 -2.1089E+03 -2.5595E+02  3.0904E-01 -3.0237E-01 -7.6397E-03  7.8509E-07  4.8689E-07  1.2972E-09  3.0293E-13
320243  3.6089E+03 -1.6666E+03 -1.5558E+03 -2.5647E+02  1.0733E-01 -5.3153E-02  5.7696E-03 -6.6931E+02 -2.1795E+03 -2.5647E+02  3.3229E-01 -2.9413E-01  5.7696E-03  7.6159E-07  4.2849E-07  1.2972E-09  2.8308E-13
320243  4.2315E+03 -1.5963E+03 -1.5906E+03 -2.4960E+02  1.1774E-01 -6.0595E-02  1.6090E-02 -3.9314E+02 -2.2190E+03 -2.4960E+02  3.4772E-01 -2.9141E-01  1.6090E-02  7.4718E-07  4.6296E-07  1.2972E-09  2.6035E-13
320243  4.8003E+03 -1.5276E+03 -1.6276E+03 -2.3757E+02  1.2278E-01 -6.9456E-02  2.5742E-02 -1.3304E+02 -2.2282E+03 -2.3757E+02  3.5812E-01 -2.9034E-01  2.5742E-02  7.2697E-07  4.2733E-07  1.2972E-09  2.3875E-13
320243  5.4089E+03 -1.4532E+03 -1.6729E+03 -2.1970E+02  1.1978E-01 -7.8760E-02  3.2105E-02  1.4804E+02 -2.2110E+03 -2.1970E+02  3.6168E-01 -2.8888E-01  3.2105E-02  6.8852E-07  4.0664E-07  1.2972E-09  2.1639E-13
320243  6.0372E+03 -1.3810E+03 -1.7247E+03 -1.9914E+02  1.0897E-01 -8.6365E-02  3.2823E-02  4.3406E+02 -2.1664E+03 -1.9914E+02  3.5835E-01 -2.8605E-01  3.2823E-02  6.7052E-07  4.1367E-07  1.2972E-09  1.9635E-13
320243  6.6118E+03 -1.3223E+03 -1.7772E+03 -1.8078E+02  9.4936E-02 -9.7122E-02  3.0751E-02  6.8910E+02 -2.1053E+03 -1.8078E+02  3.5190E-01 -2.8832E-01  3.0751E-02  6.3554E-07  4.2147E-07  1.2972E-09  1.8266E-13
320243  7.2282E+03 -1.2690E+03 -1.8423E+03 -1.6278E+02  7.7563E-02 -1.1474E-01  2.7651E-02  9.5676E+02 -2.0221E+03 -1.6278E+02  3.4394E-01 -2.9823E-01  2.7651E-02  6.0322E-07  4.5317E-07  1.2972E-09  1.7480E-13
320243  7.8111E+03 -1.2292E+03 -1.9147E+03 -1.4759E+02  5.8708E-02 -1.3343E-01  2.4916E-02  1.2061E+03 -1.9293E+03 -1.4759E+02  3.3555E-01 -3.1115E-01  2.4916E-02  5.5744E-07  4.3321E-07  1.2972E-09  1.7513E-13
320243  8.4300E+03 -1.1997E+03 -2.0028E+03 -1.3256E+02  3.6068E-02 -1.5107E-01  2.3826E-02  1.4666E+03 -1.8165E+03 -1.3256E+02  3.2566E-01 -3.2454E-01  2.3826E-02  5.1730E-07  3.8859E-07  1.2972E-09  1.8401E-13
320243  9.0432E+03 -1.1850E+03 -2.1001E+03 -1.1810E+02  1.1551E-02 -1.6543E-01  2.3770E-02  1.7194E+03 -1.6906E+03 -1.1810E+02  3.1521E-01 -3.3677E-01  2.3770E-02  4.8163E-07  3.4779E-07  1.2972E-09  2.0053E-13
320243  9.6118E+03 -1.1857E+03 -2.1972E+03 -1.0433E+02 -1.4260E-02 -1.7580E-01  2.4805E-02  1.9479E+03 -1.5618E+03 -1.0433E+02  3.0344E-01 -3.4724E-01  2.4805E-02  4.4842E-07  3.1538E-07  1.2972E-09  2.2125E-13
320243  1.0235E+04 -1.2039E+03 -2.3093E+03 -8.8733E+01 -4.4981E-02 -1.8299E-01  2.5317E-02  2.1905E+03 -1.4086E+03 -8.8733E+01  2.8893E-01 -3.5707E-01  2.5317E-02  4.1036E-07  2.6652E-07  1.2972E-09  2.4830E-13
320243  1.0832E+04 -1.2402E+03 -2.4193E+03 -7.3321E+01 -7.6827E-02 -1.8522E-01  2.6201E-02  2.4136E+03 -1.2514E+03 -7.3321E+01  2.7299E-01 -3.6454E-01  2.6201E-02  3.7644E-07  2.4407E-07  1.2972E-09  2.7702E-13
320243  1.1434E+04 -1.2966E+03 -2.5307E+03 -5.7488E+01 -1.1098E-01 -1.8385E-01  2.6418E-02  2.6288E+03 -1.0839E+03 -5.7488E+01  2.5493E-01 -3.7133E-01  2.6418E-02  3.5206E-07  2.1122E-07  1.2972E-09  3.0772E-13
320243  1.2006E+04 -1.3697E+03 -2.6345E+03 -4.2238E+01 -1.4468E-01 -1.7842E-01  2.6887E-02  2.8238E+03 -9.1800E+02 -4.2238E+01  2.3625E-01 -3.7646E-01  2.6887E-02  3.2214E-07  2.0081E-07  1.2972E-09  3.3781E-13
320243  1.2621E+04 -1.4700E+03 -2.7415E+03 -2.5632E+01 -1.8157E-01 -1.6853E-01  2.7086E-02  3.0230E+03 -7.3378E+02 -2.5632E+01  2.1483E-01 -3.8107E-01  2.7086E-02  3.0095E-07  1.6776E-07  1.2972E-09  3.7061E-13
320243  1.3239E+04 -1.5938E+03 -2.8414E+03 -8.8483E+00 -2.1878E-01 -1.5351E-01  2.7182E-02  3.2122E+03 -5.4378E+02 -8.8483E+00  1.9206E-01 -3.8396E-01  2.7182E-02  2.7484E-07  1.5304E-07  1.2972E-09  4.0364E-13
320243  1.3836E+04 -1.7349E+03 -2.9274E+03  7.3285E+00 -2.5387E-01 -1.3398E-01  2.7101E-02  3.3840E+03 -3.5740E+02  7.3285E+00  1.6941E-01 -3.8483E-01  2.7101E-02  2.5475E-07  1.3127E-07  1.2972E-09  4.3519E-13
320243  1.4420E+04 -1.8928E+03 -2.9990E+03  2.3174E+01 -2.8670E-01 -1.1068E-01  2.7070E-02  3.5422E+03 -1.7297E+02  2.3174E+01  1.4693E-01 -3.8437E-01  2.7070E-02  2.3936E-07  1.1474E-07  1.2972E-09  4.6558E-13
320243  1.5026E+04 -2.0764E+03 -3.0576E+03  3.9502E+01 -3.1861E-01 -8.2023E-02  2.6781E-02  3.6960E+03  1.9613E+01  3.9502E+01  1.2349E-01 -3.8226E-01  2.6781E-02  2.2288E-07  1.0024E-07  1.2972E-09  4.9644E-13
320243  1.5613E+04 -2.2718E+03 -3.0966E+03  5.5149E+01 -3.4668E-01 -5.0397E-02  2.6589E-02  3.8350E+03  2.0648E+02  5.5149E+01  1.0107E-01 -3.7888E-01  2.6589E-02  2.1014E-07  9.4486E-08  1.2972E-09  5.2554E-13
320243  1.6222E+04 -2.4908E+03 -3.1164E+03  7.1312E+01 -3.7240E-01 -1.4089E-02  2.6522E-02  3.9694E+03  4.0007E+02  7.1312E+01  7.8210E-02 -3.7424E-01  2.6522E-02  1.9725E-07  8.1411E-08  1.2972E-09  5.5485E-13
320243  1.6814E+04 -2.7180E+03 -3.1135E+03  8.6968E+01 -3.9375E-01  2.4422E-02  2.6226E-02  4.0909E+03  5.8794E+02  8.6968E+01  5.6433E-02 -3.6858E-01  2.6226E-02  1.8659E-07  7.4260E-08  1.2972E-09  5.8249E-13
320243  1.7414E+04 -2.9596E+03 -3.0864E+03  1.0258E+02 -4.1133E-01  6.6237E-02  2.5886E-02  4.2050E+03  7.7696E+02  1.0258E+02  3.4939E-02 -3.6170E-01  2.5886E-02  1.7364E-07  6.5970E-08  1.2972E-09  6.0953E-13
320243  1.8007E+04 -3.2078E+03 -3.0343E+03  1.1784E+02 -4.2433E-01  1.1006E-01  2.5529E-02  4.3093E+03  9.6245E+02  1.1784E+02  1.4395E-02 -3.5376E-01  2.5529E-02  1.6403E-07  5.9187E-08  1.2972E-09  6.3534E-13
320243  1.8618E+04 -3.4695E+03 -2.9528E+03  1.3331E+02 -4.3261E-01  1.5741E-01  2.5121E-02  4.4081E+03  1.1513E+03  1.3331E+02 -5.6640E-03 -3.4425E-01  2.5121E-02  1.5677E-07  4.7368E-08  1.2972E-09  6.6089E-13
320243  1.9219E+04 -3.7308E+03 -2.8437E+03  1.4828E+02 -4.3542E-01  2.0568E-01  2.4667E-02  4.4970E+03  1.3350E+03  1.4828E+02 -2.4246E-02 -3.3376E-01  2.4667E-02  1.4615E-07  4.2261E-08  1.2972E-09  6.8503E-13
320243  1.9806E+04 -3.9857E+03 -2.7090E+03  1.6264E+02 -4.3298E-01  2.5358E-01  2.4307E-02  4.5760E+03  1.5117E+03  1.6264E+02 -4.1284E-02 -3.2272E-01  2.4307E-02  1.3991E-07  3.6851E-08  1.2972E-09  7.0758E-13
320243  2.0418E+04 -4.2487E+03 -2.5383E+03  1.7742E+02 -4.2491E-01  3.0381E-01  2.3931E-02  4.6505E+03  1.6934E+03  1.7742E+02 -5.7892E-02 -3.1052E-01  2.3931E-02  1.3271E-07  3.2065E-08  1.2972E-09  7.3008E-13
320243  2.1003E+04 -4.4938E+03 -2.3465E+03  1.9128E+02 -4.1186E-01  3.5148E-01  2.3468E-02  4.7145E+03  1.8640E+03  1.9128E+02 -7.2573E-02 -2.9829E-01  2.3468E-02  1.2669E-07  2.6975E-08  1.2972E-09  7.5058E-13
320243  2.1623E+04 -4.7433E+03 -2.1133E+03  2.0569E+02 -3.9240E-01  4.0100E-01  2.3020E-02  4.7747E+03  2.0414E+03  2.0569E+02 -8.6834E-02 -2.8484E-01  2.3020E-02  1.2086E-07  2.3924E-08  1.2972E-09  7.7124E-13
320243  2.2206E+04 -4.9656E+03 -1.8662E+03  2.1900E+02 -3.6891E-01  4.4605E-01  2.2642E-02  4.8246E+03  2.2052E+03  2.1900E+02 -9.9068E-02 -2.7193E-01  2.2642E-02  1.1682E-07  2.1077E-08  1.2972E-09  7.8970E-13
320243  2.2811E+04 -5.1800E+03 -1.5828E+03  2.3258E+02 -3.3932E-01  4.9065E-01  2.2281E-02  4.8696E+03  2.3717E+03  2.3258E+02 -1.1046E-01 -2.5834E-01  2.2281E-02  1.0962E-07  1.8629E-08  1.2972E-09  8.0786E-13
320243  2.3420E+04 -5.3763E+03 -1.2711E+03  2.4605E+02 -3.0444E-01  5.3276E-01  2.1955E-02  4.9081E+03  2.5358E+03  2.4605E+02 -1.2066E-01 -2.4460E-01  2.1955E-02  1.0468E-07  1.5183E-08  1.2972E-09  8.2513E-13
320243  2.4014E+04 -5.5458E+03 -9.4341E+02  2.5895E+02 -2.6592E-01  5.7063E-01  2.1472E-02  4.9393E+03  2.6923E+03  2.5895E+02 -1.2951E-01 -2.3125E-01  2.1472E-02  1.0367E-07  1.2800E-08  1.2972E-09  8.4101E-13
320243  2.4622E+04 -5.6944E+03 -5.8559E+02  2.7184E+02 -2.2218E-01  6.0563E-01  2.0934E-02  4.9650E+03  2.8491E+03  2.7184E+02 -1.3751E-01 -2.1772E-01  2.0934E-02  9.7318E-08  1.0523E-08  1.2972E-09  8.5630E-13
320243  2.5201E+04 -5.8101E+03 -2.2612E+02  2.8383E+02 -1.7691E-01  6.3507E-01  2.0449E-02  4.9838E+03  2.9950E+03  2.8383E+02 -1.4421E-01 -2.0502E-01  2.0449E-02  9.4351E-08  7.9455E-09  1.2972E-09  8.6997E-13
320243  2.5814E+04 -5.9030E+03  1.7171E+02  2.9621E+02 -1.2563E-01  6.6171E-01  1.9961E-02  4.9978E+03  3.1459E+03  2.9621E+02 -1.5046E-01 -1.9181E-01  1.9961E-02  9.0539E-08  8.1963E-09  1.2972E-09  8.8352E-13
320243  2.6418E+04 -5.9629E+03  5.7791E+02  3.0812E+02 -7.2210E-02  6.8309E-01  1.9496E-02  5.0060E+03  3.2909E+03  3.0812E+02 -1.5577E-01 -1.7909E-01  1.9496E-02  8.6156E-08  7.4276E-09  1.2972E-09  8.9595E-13
320243  2.7020E+04 -5.9897E+03  9.9453E+02  3.1974E+02 -1.6632E-02  6.9940E-01  1.9070E-02  5.0087E+03  3.4320E+03  3.1974E+02 -1.6043E-01 -1.6666E-01  1.9070E-02  8.4147E-08  6.3978E-09  1.2972E-09  9.0748E-13
320243  2.7608E+04 -5.9831E+03  1.4093E+03  3.3083E+02  3.9480E-02  7.1026E-01  1.8670E-02  5.0064E+03  3.5664E+03  3.3083E+02 -1.6430E-01 -1.5484E-01  1.8670E-02  8.1516E-08  5.7553E-09  1.2972E-09  9.1793E-13
320243  2.8221E+04 -5.9406E+03  1.8466E+03  3.4215E+02  9.9333E-02  7.1611E-01  1.8285E-02  4.9990E+03  3.7028E+03  3.4215E+02 -1.6767E-01 -1.4285E-01  1.8285E-02  8.0851E-08  4.5181E-09  1.2972E-09  9.2798E-13
320243  2.8813E+04 -5.8644E+03  2.2712E+03  3.5287E+02  1.5814E-01  7.1628E-01  1.7879E-02  4.9871E+03  3.8312E+03  3.5287E+02 -1.7025E-01 -1.3165E-01  1.7879E-02  7.5994E-08  3.7121E-09  1.2972E-09  9.3689E-13
320243  2.9408E+04 -5.7526E+03  2.6961E+03  3.6336E+02  2.1747E-01  7.1103E-01  1.7376E-02  4.9705E+03  3.9567E+03  3.6336E+02 -1.7237E-01 -1.2075E-01  1.7376E-02  7.4074E-08  3.0365E-09  1.2972E-09  9.4507E-13
320243  3.0016E+04 -5.6021E+03  3.1251E+03  3.7377E+02  2.7784E-01  7.0000E-01  1.6891E-02  4.9490E+03  4.0814E+03  3.7377E+02 -1.7403E-01 -1.1001E-01  1.6891E-02  7.3607E-08  2.4991E-09  1.2972E-09  9.5264E-13
320243  3.0612E+04 -5.4191E+03  3.5377E+03  3.8370E+02  3.3628E-01  6.8372E-01  1.6440E-02  4.9235E+03  4.2001E+03  3.8370E+02 -1.7524E-01 -9.9826E-02  1.6440E-02  7.2385E-08  2.1147E-09  1.2972E-09  9.5930E-13
320243  3.1226E+04 -5.1943E+03  3.9511E+03  3.9367E+02  3.9521E-01  6.6135E-01  1.5993E-02  4.8928E+03  4.3188E+03  3.9367E+02 -1.7609E-01 -8.9699E-02  1.5993E-02  6.9212E-08  1.6589E-09  1.2972E-09  9.6540E-13
320243  3.1829E+04 -4.9391E+03  4.3417E+03  4.0318E+02  4.5118E-01  6.3406E-01  1.5565E-02  4.8586E+03  4.4317E+03  4.0318E+02 -1.7660E-01 -8.0100E-02  1.5565E-02  6.8201E-08  1.5222E-09  1.2972E-09  9.7064E-13
320243  3.2427E+04 -4.6533E+03  4.7116E+03  4.1236E+02  5.0444E-01  6.0191E-01  1.5153E-02  4.8206E+03  4.5402E+03  4.1236E+02 -1.7681E-01 -7.0911E-02  1.5153E-02  6.7502E-08  1.0723E-09  1.2972E-09  9.7512E-13
320243  3.3003E+04 -4.3483E+03  5.0484E+03  4.2098E+02  5.5320E-01  5.6637E-01  1.4763E-02  4.7804E+03  4.6414E+03  4.2098E+02 -1.7677E-01 -6.2369E-02  1.4763E-02  6.7673E-08  9.0994E-10  1.2972E-09  9.7879E-13
320243  3.3601E+04 -4.0031E+03  5.3750E+03  4.2969E+02  6.0068E-01  5.2500E-01  1.4359E-02  4.7350E+03  4.7429E+03  4.2969E+02 -1.7650E-01 -5.3821E-02  1.4359E-02  6.4865E-08  8.1615E-10  1.2972E-09  9.8192E-13
320243  3.4210E+04 -3.6239E+03  5.6805E+03  4.3830E+02  6.4530E-01  4.7858E-01  1.3951E-02  4.6852E+03  4.8425E+03  4.3830E+02 -1.7605E-01 -4.5409E-02  1.3951E-02  6.4308E-08  6.6453E-10  1.2972E-09  9.8441E-13
320243  3.4826E+04 -3.2131E+03  5.9600E+03  4.4678E+02  6.8636E-01  4.2741E-01  1.3542E-02  4.6309E+03  4.9397E+03  4.4678E+02 -1.7541E-01 -3.7179E-02  1.3542E-02  6.3125E-08  5.2415E-10  1.2972E-09  9.8624E-13
320243  3.5434E+04 -2.7852E+03  6.2033E+03  4.5486E+02  7.2229E-01  3.7340E-01  1.3061E-02  4.5739E+03  5.0317E+03  4.5486E+02 -1.7466E-01 -2.9321E-02  1.3061E-02  6.2793E-08  4.5397E-10  1.2972E-09  9.8736E-13
320243  3.6022E+04 -2.3511E+03  6.4069E+03  4.6240E+02  7.5256E-01  3.1802E-01  1.2549E-02  4.5155E+03  5.1173E+03  4.6240E+02 -1.7382E-01 -2.1936E-02  1.2549E-02  6.2076E-08  3.8525E-10  1.2972E-09  9.8781E-13
320243  3.6600E+04 -1.9084E+03  6.5744E+03  4.6951E+02  7.7771E-01  2.6106E-01  1.2050E-02  4.4550E+03  5.1979E+03  4.6951E+02 -1.7290E-01 -1.4883E-02  1.2050E-02  6.1341E-08  4.1982E-10  1.2972E-09  9.8765E-13
320243  3.7205E+04 -1.4316E+03  6.7137E+03  4.7664E+02  7.9887E-01  1.9931E-01  1.1528E-02  4.3886E+03  5.2786E+03  4.7664E+02 -1.7187E-01 -7.6874E-03  1.1528E-02  6.1747E-08  3.3125E-10  1.2972E-09  9.8686E-13
320243  3.7833E+04 -9.2401E+02  6.8183E+03  4.8371E+02  8.1512E-01  1.3321E-01  1.0984E-02  4.3163E+03  5.3584E+03  4.8371E+02 -1.7074E-01 -3.8989E-04  1.0984E-02  6.1408E-08  3.1315E-10  1.2972E-09  9.8537E-13
320243  3.8414E+04 -4.4731E+02  6.8776E+03  4.8995E+02  8.2478E-01  7.0898E-02  1.0479E-02  4.2465E+03  5.4285E+03  4.8995E+02 -1.6966E-01  6.2207E-03  1.0479E-02  6.0525E-08  3.0853E-10  1.2972E-09  9.8338E-13
320243  3.9021E+04  5.4371E+01  6.9007E+03  4.9614E+02  8.2928E-01  5.1568E-03  9.9534E-03  4.1709E+03  5.4979E+03  4.9614E+02 -1.6850E-01  1.3018E-02  9.9534E-03  6.0752E-08  3.1213E-10  1.2972E-09  9.8070E-13
320243  3.9617E+04  5.4855E+02  6.8844E+03  5.0192E+02  8.2809E-01 -5.9720E-02  9.4322E-03  4.0936E+03  5.5623E+03  5.0192E+02 -1.6734E-01  1.9595E-02  9.4322E-03  6.0406E-08  2.5922E-10  1.2972E-09  9.7746E-13
320243  4.0207E+04  1.0357E+03  6.8303E+03  5.0733E+02  8.2145E-01 -1.2368E-01  8.9229E-03  4.0144E+03  5.6222E+03  5.0733E+02 -1.6615E-01  2.6062E-02  8.9229E-03  6.1177E-08  2.6651E-10  1.2972E-09  9.7366E-13
320243  4.0826E+04  1.5406E+03  6.7331E+03  5.1269E+02  8.0866E-01 -1.8997E-01  8.3811E-03  3.9286E+03  5.6811E+03  5.1269E+02 -1.6489E-01  3.2780E-02  8.3811E-03  6.1382E-08  3.1628E-10  1.2972E-09  9.6906E-13
320243  4.1412E+04  2.0094E+03  6.6038E+03  5.1745E+02  7.9116E-01 -2.5142E-01  7.8663E-03  3.8448E+03  5.7328E+03  5.1745E+02 -1.6369E-01  3.9120E-02  7.8663E-03  6.1002E-08  2.4554E-10  1.2972E-09  9.6413E-13
320243  4.2032E+04  2.4932E+03  6.4280E+03  5.2216E+02  7.6706E-01 -3.1462E-01  7.3146E-03  3.7533E+03  5.7835E+03  5.2216E+02 -1.6238E-01  4.5873E-02  7.3146E-03  6.1524E-08  3.2893E-10  1.2972E-09  9.5829E-13
320243  4.2613E+04  2.9307E+03  6.2287E+03  5.2626E+02  7.3950E-01 -3.7154E-01  6.7967E-03  3.6653E+03  5.8268E+03  5.2626E+02 -1.6113E-01  5.2213E-02  6.7967E-03  6.2172E-08  2.8835E-10  1.2972E-09  9.5225E-13
320243  4.3210E+04  3.3626E+03  5.9901E+03  5.3015E+02  7.0631E-01 -4.2741E-01  6.2562E-03  3.5724E+03  5.8674E+03  5.3015E+02 -1.5981E-01  5.8787E-02  6.2562E-03  6.1499E-08  2.4881E-10  1.2972E-09  9.4547E-13
320243  4.3800E+04  3.7687E+03  5.7222E+03  5.3369E+02  6.6892E-01 -4.7956E-01  5.7149E-03  3.4781E+03  5.9033E+03  5.3369E+02 -1.5847E-01  6.5367E-02  5.7149E-03  6.2586E-08  2.6995E-10  1.2972E-09  9.3820E-13
320243  4.4416E+04  4.1674E+03  5.4111E+03  5.3703E+02  6.2539E-01 -5.3025E-01  5.1432E-03  3.3775E+03  5.9364E+03  5.3703E+02 -1.5702E-01  7.2321E-02  5.1432E-03  6.2982E-08  2.7311E-10  1.2972E-09  9.3001E-13
320243  4.5022E+04  4.5320E+03  5.0761E+03  5.3997E+02  5.7845E-01 -5.7597E-01  4.5730E-03  3.2761E+03  5.9643E+03  5.3997E+02 -1.5551E-01  7.9321E-02  4.5730E-03  6.3953E-08  2.7532E-10  1.2972E-09  9.2134E-13
320243  4.5617E+04  4.8619E+03  4.7206E+03  5.4252E+02  5.2863E-01 -6.1663E-01  3.9602E-03  3.1741E+03  5.9873E+03  5.4252E+02 -1.5393E-01  8.6361E-02  3.9602E-03  6.5236E-08  2.4859E-10  1.2972E-09  9.1224E-13
320243  4.6215E+04  5.1623E+03  4.3408E+03  5.4470E+02  4.7538E-01 -6.5284E-01  3.3388E-03  3.0695E+03  6.0058E+03  5.4470E+02 -1.5226E-01  9.3592E-02  3.3388E-03  6.5830E-08  2.7173E-10  1.2972E-09  9.0251E-13
320243  4.6822E+04  5.4336E+03  3.9349E+03  5.4654E+02  4.1850E-01 -6.8451E-01  2.7279E-03  2.9613E+03  6.0198E+03  5.4654E+02 -1.5045E-01  1.0114E-01  2.7279E-03  6.7907E-08  2.4903E-10  1.2972E-09  8.9203E-13
320243  4.7413E+04  5.6639E+03  3.5226E+03  5.4797E+02  3.6080E-01 -7.1025E-01  2.1208E-03  2.8537E+03  6.0287E+03  5.4797E+02 -1.4854E-01  1.0870E-01  2.1208E-03  6.7832E-08  2.3437E-10  1.2972E-09  8.8124E-13
320243  4.8030E+04  5.8674E+03  3.0776E+03  5.4908E+02  2.9862E-01 -7.3150E-01  1.4688E-03  2.7393E+03  6.0328E+03  5.4908E+02 -1.4638E-01  1.1687E-01  1.4688E-03  6.8774E-08  2.0143E-10  1.2972E-09  8.6935E-13
320243  4.8634E+04  6.0290E+03  2.6309E+03  5.4977E+02  2.3636E-01 -7.4660E-01  8.1132E-04  2.6251E+03  6.0315E+03  5.4977E+02 -1.4404E-01  1.2515E-01  8.1132E-04  7.2012E-08  2.1822E-10  1.2972E-09  8.5708E-13
320243  4.9201E+04  6.1464E+03  2.2043E+03  5.5005E+02  1.7708E-01 -7.5551E-01  1.2373E-04  2.5159E+03  6.0255E+03  5.5005E+02 -1.4164E-01  1.3320E-01  1.2373E-04  7.3564E-08  2.3588E-10  1.2972E-09  8.4497E-13
320243  4.9833E+04  6.2374E+03  1.7253E+03  5.4985E+02  1.1082E-01 -7.5934E-01 -7.0952E-04  2.3923E+03  6.0132E+03  5.4985E+02 -1.3865E-01  1.4253E-01 -7.0952E-04  7.5607E-08  2.1186E-10  1.2972E-09  8.3084E-13
320243  5.0429E+04  6.2848E+03  1.2732E+03  5.4922E+02  4.8618E-02 -7.5703E-01 -1.4219E-03  2.2737E+03  5.9958E+03  5.4922E+02 -1.3547E-01  1.5170E-01 -1.4219E-03  7.5893E-08  2.9378E-10  1.2972E-09  8.1686E-13
320243  5.1012E+04  6.2956E+03  8.3420E+02  5.4818E+02 -1.1393E-02 -7.4929E-01 -2.1484E-03  2.1560E+03  5.9735E+03  5.4818E+02 -1.3201E-01  1.6100E-01 -2.1484E-03  7.8474E-08  3.1170E-10  1.2972E-09  8.0260E-13
320243  5.1607E+04  6.2709E+03  3.9158E+02  5.4667E+02 -7.1392E-02 -7.3582E-01 -2.9194E-03  2.0337E+03  5.9448E+03  5.4667E+02 -1.2801E-01  1.7090E-01 -2.9194E-03  7.9807E-08  4.1910E-10  1.2972E-09  7.8737E-13
320243  5.2223E+04  6.2084E+03 -5.5528E+01  5.4462E+02 -1.3142E-01 -7.1616E-01 -3.7552E-03  1.9054E+03  5.9090E+03  5.4462E+02 -1.2339E-01  1.8151E-01 -3.7552E-03  8.3248E-08  4.5325E-10  1.2972E-09  7.7095E-13
320243  5.2824E+04  6.1124E+03 -4.7884E+02  5.4211E+02 -1.8751E-01 -6.9151E-01 -4.6056E-03  1.7782E+03  5.8676E+03  5.4211E+02 -1.1827E-01  1.9229E-01 -4.6056E-03  8.5810E-08  7.4494E-10  1.2972E-09  7.5424E-13
320243  5.3411E+04  5.9871E+03 -8.7621E+02  5.3916E+02 -2.3929E-01 -6.6251E-01 -5.4741E-03  1.6523E+03  5.8209E+03  5.3916E+02 -1.1260E-01  2.0317E-01 -5.4741E-03  8.7554E-08  1.0834E-09  1.2972E-09  7.3727E-13
320243  5.4029E+04  5.8232E+03 -1.2750E+03  5.3548E+02 -2.9015E-01 -6.2698E-01 -6.4265E-03  1.5178E+03  5.7647E+03  5.3548E+02 -1.0579E-01  2.1501E-01 -6.4265E-03  9.1574E-08  1.2847E-09  1.2972E-09  7.1867E-13
320243  5.4609E+04  5.6420E+03 -1.6280E+03  5.3148E+02 -3.3397E-01 -5.8933E-01 -7.3574E-03  1.3897E+03  5.7054E+03  5.3148E+02 -9.8581E-02  2.2646E-01 -7.3574E-03  9.5629E-08  2.0316E-09  1.2972E-09  7.0055E-13
320243  5.5224E+04  5.4233E+03 -1.9773E+03  5.2664E+02 -3.7586E-01 -5.4527E-01 -8.3981E-03  1.2521E+03  5.6351E+03  5.2664E+02 -8.9953E-02  2.3889E-01 -8.3981E-03  9.7632E-08  2.8045E-09  1.2972E-09  6.8061E-13
320243  5.5816E+04  5.1900E+03 -2.2868E+03  5.2136E+02 -4.1122E-01 -4.9935E-01 -9.4449E-03  1.1180E+03  5.5602E+03  5.2136E+02 -8.0572E-02  2.5109E-01 -9.4449E-03  1.0009E-07  3.3837E-09  1.2972E-09  6.6072E-13
320243  5.6406E+04  4.9386E+03 -2.5669E+03  5.1548E+02 -4.4124E-01 -4.5074E-01 -1.0522E-02  9.8287E+02  5.4783E+03  5.1548E+02 -7.0091E-02  2.6334E-01 -1.0522E-02  1.0411E-07  4.4758E-09  1.2972E-09  6.4024E-13
320243  5.7031E+04  4.6542E+03 -2.8320E+03  5.0853E+02 -4.6712E-01 -3.9659E-01 -1.1703E-02  8.3776E+02  5.3833E+03  5.0853E+02 -5.7636E-02  2.7636E-01 -1.1703E-02  1.0816E-07  6.4471E-09  1.2972E-09  6.1777E-13
320243  5.7616E+04  4.3755E+03 -3.0485E+03  5.0135E+02 -4.8548E-01 -3.4421E-01 -1.2861E-02  7.0068E+02  5.2866E+03  5.0135E+02 -4.4692E-02  2.8846E-01 -1.2861E-02  1.1177E-07  8.3549E-09  1.2972E-09  5.9611E-13
320243  5.8220E+04  4.0780E+03 -3.2398E+03  4.9321E+02 -4.9835E-01 -2.8893E-01 -1.4093E-02  5.5751E+02  5.1784E+03  4.9321E+02 -2.9905E-02  3.0071E-01 -1.4093E-02  1.1645E-07  1.0167E-08  1.2972E-09  5.7304E-13
320243  5.8801E+04  3.7863E+03 -3.3921E+03  4.8467E+02 -5.0482E-01 -2.3533E-01 -1.5326E-02  4.1856E+02  5.0663E+03  4.8467E+02 -1.4353E-02  3.1215E-01 -1.5326E-02  1.2167E-07  1.2553E-08  1.2972E-09  5.5024E-13
320243  5.9404E+04  3.4815E+03 -3.5172E+03  4.7503E+02 -5.0545E-01 -1.7985E-01 -1.6662E-02  2.7319E+02  4.9414E+03  4.7503E+02  3.1127E-03  3.2354E-01 -1.6662E-02  1.2841E-07  1.4152E-08  1.2972E-09  5.2597E-13
320243  6.0023E+04  3.1697E+03 -3.6112E+03  4.6431E+02 -4.9970E-01 -1.2360E-01 -1.7927E-02  1.2267E+02  4.8034E+03  4.6431E+02  2.2449E-02  3.3471E-01 -1.7927E-02  1.3645E-07  1.7772E-08  1.2972E-09  5.0042E-13
320243  6.0623E+04  2.8731E+03 -3.6694E+03  4.5317E+02 -4.8807E-01 -7.0644E-02 -1.9223E-02 -2.3840E+01  4.6603E+03  4.5317E+02  4.2487E-02  3.4479E-01 -1.9223E-02  1.4416E-07  2.1016E-08  1.2972E-09  4.7516E-13
320243  6.1212E+04  2.5905E+03 -3.6962E+03  4.4146E+02 -4.7100E-01 -2.0693E-02 -2.0572E-02 -1.6820E+02  4.5104E+03  4.4146E+02  6.3434E-02  3.5387E-01 -2.0572E-02  1.4957E-07  2.3264E-08  1.2972E-09  4.4992E-13
320243  6.1828E+04  2.3073E+03 -3.6935E+03  4.2831E+02 -4.4755E-01  2.8934E-02 -2.2126E-02 -3.1944E+02  4.3432E+03  4.2831E+02  8.6492E-02  3.6255E-01 -2.2126E-02  1.5902E-07  2.7365E-08  1.2972E-09  4.2317E-13
320243  6.2432E+04  2.0452E+03 -3.6621E+03  4.1450E+02 -4.1928E-01  7.4393E-02 -2.3603E-02 -4.6761E+02  4.1684E+03  4.1450E+02  1.1023E-01  3.7012E-01 -2.3603E-02  1.7071E-07  3.1969E-08  1.2972E-09  3.9671E-13
320243  6.3001E+04  1.8155E+03 -3.6084E+03  4.0066E+02 -3.8836E-01  1.1406E-01 -2.5136E-02 -6.0650E+02  3.9936E+03  4.0066E+02  1.3338E-01  3.7657E-01 -2.5136E-02  1.8203E-07  3.4015E-08  1.2972E-09  3.7175E-13
320243  6.3623E+04  1.5857E+03 -3.5250E+03  3.8444E+02 -3.5006E-01  1.5350E-01 -2.7043E-02 -7.5733E+02  3.7903E+03  3.8444E+02  1.5963E-01  3.8277E-01 -2.7043E-02  1.9660E-07  3.7689E-08  1.2972E-09  3.4459E-13
320243  6.4214E+04  1.3904E+03 -3.4241E+03  3.6786E+02 -3.0977E-01  1.8702E-01 -2.8988E-02 -8.9899E+02  3.5846E+03  3.6786E+02  1.8532E-01  3.8806E-01 -2.8988E-02  2.1248E-07  4.2109E-08  1.2972E-09  3.1919E-13
320243  6.4813E+04  1.2179E+03 -3.3030E+03  3.4991E+02 -2.6562E-01  2.1644E-01 -3.1001E-02 -1.0399E+03  3.3633E+03  3.4991E+02  2.1197E-01  3.9255E-01 -3.1001E-02  2.2856E-07  5.2636E-08  1.2972E-09  2.9432E-13
320243  6.5419E+04  1.0713E+03 -3.1641E+03  3.3043E+02 -2.1814E-01  2.4131E-01 -3.3392E-02 -1.1788E+03  3.1257E+03  3.3043E+02  2.3937E-01  3.9621E-01 -3.3392E-02  2.5104E-07  6.1970E-08  1.2972E-09  2.7056E-13
320243  6.6013E+04  9.5596E+02 -3.0146E+03  3.0984E+02 -1.6943E-01  2.6072E-01 -3.5767E-02 -1.3105E+03  2.8782E+03  3.0984E+02  2.6645E-01  3.9895E-01 -3.5767E-02  2.7583E-07  7.5195E-08  1.2972E-09  2.4935E-13
320243  6.6615E+04  8.6910E+02 -2.8530E+03  2.8755E+02 -1.1896E-01  2.7503E-01 -3.8374E-02 -1.4375E+03  2.6131E+03  2.8755E+02  2.9355E-01  4.0069E-01 -3.8374E-02  3.0207E-07  1.0112E-07  1.2972E-09  2.3093E-13
320243  6.7230E+04  8.1190E+02 -2.6810E+03  2.6315E+02 -6.7168E-02  2.8379E-01 -4.1093E-02 -1.5588E+03  2.3274E+03  2.6315E+02  3.2048E-01  4.0118E-01 -4.1093E-02  3.3857E-07  1.2443E-07  1.2972E-09  2.1642E-13
320243  6.7827E+04  7.8657E+02 -2.5105E+03  2.3773E+02 -1.7865E-02  2.8639E-01 -4.4053E-02 -1.6665E+03  2.0357E+03  2.3773E+02  3.4513E-01  4.0012E-01 -4.4053E-02  3.7367E-07  1.6693E-07  1.2972E-09  2.0754E-13
320243  6.8435E+04  7.9040E+02 -2.3369E+03  2.0992E+02  2.9983E-02  2.8299E-01 -4.7368E-02 -1.7637E+03  1.7248E+03  2.0992E+02  3.6788E-01  3.9728E-01 -4.7368E-02  4.2325E-07  2.2563E-07  1.2972E-09  2.0449E-13
320243  6.9005E+04  8.1924E+02 -2.1783E+03  1.8200E+02  7.0435E-02  2.7314E-01 -5.0810E-02 -1.8408E+03  1.4239E+03  1.8200E+02  3.8540E-01  3.9159E-01 -5.0810E-02  4.7434E-07  2.9830E-07  1.2972E-09  2.0719E-13
320243  6.9612E+04  8.7364E+02 -2.0176E+03  1.4963E+02  1.0679E-01  2.5405E-01 -5.5885E-02 -1.9062E+03  1.0955E+03  1.4963E+02  3.9851E-01  3.8037E-01 -5.5885E-02  5.5385E-07  4.0775E-07  1.2972E-09  2.1533E-13
320243  7.0210E+04  9.4589E+02 -1.8735E+03  1.1409E+02  1.3342E-01  2.2679E-01 -6.3424E-02 -1.9519E+03  7.7117E+02  1.1409E+02  4.0432E-01  3.6356E-01 -6.3424E-02  6.4797E-07  5.5088E-07  1.2972E-09  2.2735E-13
320243  7.0805E+04  1.0296E+03 -1.7489E+03  7.3447E+01  1.4486E-01  1.9195E-01 -7.3539E-02 -1.9780E+03  4.5415E+02  7.3447E+01  3.9774E-01  3.4081E-01 -7.3539E-02  7.4122E-07  7.0960E-07  1.2972E-09  2.4173E-13
320243  7.1402E+04  1.1137E+03 -1.6432E+03  2.6383E+01  1.3298E-01  1.6580E-01 -8.4752E-02 -1.9794E+03  1.5032E+02  2.6383E+01  3.7057E-01  3.2683E-01 -8.4752E-02  8.3461E-07  7.8552E-07  1.2972E-09  2.5627E-13
320257  0.0000E+00 -2.0702E+03 -1.1322E+03 -3.0245E+02 -0.0000E+00 -0.0000E+00 -0.0000E+00 -2.0702E+03 -1.1322E+03 -3.0245E+02  1.6370E-01 -2.9933E-01  0.0000E+00  8.7055E-07  5.6442E-07  1.2972E-09  3.6034E-13
320259  0.0000E+00 -2.1449E+03 -1.1802E+03 -2.6083E+02 -0.0000E+00 -0.0000E+00 -0.0000E+00 -2.1449E+03 -1.1802E+03 -2.6083E+02  1.7065E-01 -3.1013E-01  0.0000E+00  8.5913E-07  7.0118E-07  1.2972E-09  3.7176E-13
320259  6.0902E+02 -2.1385E+03 -1.1861E+03 -2.6290E+02  2.0347E-02 -1.8249E-02 -5.9477E-03 -2.0259E+03 -1.3696E+03 -2.6290E+02  1.9185E-01 -3.2746E-01 -5.9477E-03  8.4191E-07  5.4731E-07  1.2972E-09  3.7082E-13
320259  1.2157E+03 -2.1157E+03 -1.1972E+03 -2.6711E+02  5.7774E-02 -1.4962E-02 -6.2563E-03 -1.8738E+03 -1.5487E+03 -2.6711E+02  2.3087E-01 -3.2088E-01 -6.2563E-03  8.4191E-07  3.7155E-07  1.2972E-09  3.6585E-13
320259  1.8180E+03 -2.0689E+03 -1.2028E+03 -2.6969E+02  9.7276E-02 -5.0126E-03 -3.3313E-03 -1.6853E+03 -1.6991E+03 -2.6969E+02  2.7119E-01 -3.0416E-01 -3.3313E-03  8.5619E-07  4.2772E-07  1.2972E-09  3.5494E-13
320259  2.4094E+03 -2.0024E+03 -1.2075E+03 -2.7250E+02  1.2515E-01 -1.3799E-02 -8.2324E-03 -1.4699E+03 -1.8185E+03 -2.7250E+02  2.9974E-01 -3.0333E-01 -8.2324E-03  8.7385E-07  5.8728E-07  1.2972E-09  3.3923E-13
320295  0.0000E+00 -1.4503E+03 -7.7168E+02 -9.7149E+02 -0.0000E+00 -0.0000E+00 -0.0000E+00 -1.4503E+03 -7.7168E+02 -9.7149E+02  1.1158E-01 -2.0970E-01  0.0000E+00  9.7597E-07  7.5407E-07  1.2972E-09  2.8790E-13
320295  6.1510E+02 -1.4494E+03 -7.8054E+02 -9.5481E+02  5.0652E-03 -2.6729E-02  5.3027E-02 -1.3743E+03 -9.0619E+02 -9.5481E+02  1.1792E-01 -2.3630E-01  5.3027E-02  9.7597E-07  6.5851E-07  1.2972E-09  2.8725E-13
320310  0.0000E+00 -1.6419E+03 -7.8990E+02 -7.9209E+02  0.0000E+00  0.0000E+00  0.0000E+00 -1.6419E+03 -7.8990E+02 -7.9209E+02  1.1421E-01 -2.3741E-01  0.0000E+00  9.5760E-07  1.5164E-07  1.2972E-09  3.0359E-13
320317  0.0000E+00 -1.3741E+03 -8.0234E+02 -1.0099E+03 -0.0000E+00 -0.0000E+00 -0.0000E+00 -1.3741E+03 -8.0234E+02 -1.0099E+03  1.1601E-01 -1.9868E-01  0.0000E+00  9.6124E-07  7.1791E-07  1.2972E-09  2.8282E-13
320363  0.0000E+00 -1.1465E+03 -9.4205E+02 -9.1390E+02 -0.0000E+00 -0.0000E+00 -0.0000E+00 -1.1465E+03 -9.4205E+02 -9.1390E+02  1.3621E-01 -1.6578E-01  0.0000E+00  9.5729E-07  6.2798E-07  1.2972E-09  2.6002E-13
320364  0.0000E+00 -1.1898E+03 -9.3015E+02 -9.2581E+02 -0.0000E+00 -0.0000E+00  0.0000E+00 -1.1898E+03 -9.3015E+02 -9.2581E+02  1.3449E-01 -1.7204E-01  0.0000E+00  9.6855E-07  6.0850E-07  1.2972E-09  2.6499E-13
320364  6.1157E+02 -1.1827E+03 -9.3537E+02 -8.9901E+02  1.9888E-02 -1.8375E-02  8.3471E-02 -1.0955E+03 -1.0362E+03 -8.9901E+02  1.5513E-01 -1.8939E-01  8.3471E-02  9.6651E-07  7.1333E-07  1.2972E-09  2.6030E-13
320377  0.0000E+00 -1.8113E+03 -1.4559E+03 -2.4623E+02 -0.0000E+00 -0.0000E+00 -0.0000E+00 -1.8113E+03 -1.4559E+03 -2.4623E+02  2.1051E-01 -2.6189E-01  0.0000E+00  8.4845E-07  6.6235E-07  1.2972E-09  3.4991E-13
320377  6.0506E+02 -1.8066E+03 -1.4579E+03 -2.4530E+02  1.5037E-02 -7.0855E-03  2.7767E-03 -1.6723E+03 -1.6102E+03 -2.4530E+02  2.2584E-01 -2.6831E-01  2.7767E-03  8.4845E-07  6.6764E-07  1.2972E-09  3.4511E-13
320377  1.2001E+03 -1.7938E+03 -1.4646E+03 -2.4422E+02  2.9307E-02 -1.6588E-02  1.8163E-03 -1.5140E+03 -1.7523E+03 -2.4422E+02  2.4108E-01 -2.7596E-01  1.8163E-03  8.4845E-07  6.8086E-07  1.2972E-09  3.3774E-13
320377  1.8099E+03 -1.7701E+03 -1.4785E+03 -2.4275E+02  4.9333E-02 -2.9992E-02  3.5804E-03 -1.3273E+03 -1.8861E+03 -2.4275E+02  2.6311E-01 -2.8593E-01  3.5804E-03  8.5300E-07  7.1335E-07  1.2972E-09  3.2719E-13
320377  2.4249E+03 -1.7312E+03 -1.5013E+03 -2.3896E+02  7.8199E-02 -4.0565E-02  1.0081E-02 -1.1102E+03 -2.0046E+03 -2.3896E+02  2.9527E-01 -2.9088E-01  1.0081E-02  8.2693E-07  5.1374E-07  1.2972E-09  3.1287E-13
320377  3.0083E+03 -1.6781E+03 -1.5228E+03 -2.2856E+02  1.0172E-01 -3.3684E-02  2.5802E-02 -8.8014E+02 -2.0881E+03 -2.2856E+02  3.2191E-01 -2.7632E-01  2.5802E-02  7.9638E-07  4.1963E-07  1.2972E-09  2.9512E-13
320377  3.6139E+03 -1.6110E+03 -1.5432E+03 -2.0878E+02  1.1869E-01 -3.5179E-02  3.9752E-02 -6.2586E+02 -2.1413E+03 -2.0878E+02  3.4182E-01 -2.6812E-01  3.9752E-02  8.0329E-07  4.8037E-07  1.2972E-09  2.7337E-13
320377  4.2088E+03 -1.5367E+03 -1.5674E+03 -1.8053E+02  1.3003E-01 -4.6282E-02  5.4604E-02 -3.6477E+02 -2.1645E+03 -1.8053E+02  3.5666E-01 -2.6848E-01  5.4604E-02  7.8241E-07  4.8525E-07  1.2972E-09  2.5003E-13
320377  4.8048E+03 -1.4577E+03 -1.5979E+03 -1.4467E+02  1.3433E-01 -5.5713E-02  6.4767E-02 -9.6859E+01 -2.1607E+03 -1.4467E+02  3.6538E-01 -2.6648E-01  6.4767E-02  7.5943E-07  4.4298E-07  1.2972E-09  2.2617E-13
320377  5.4161E+03 -1.3757E+03 -1.6334E+03 -1.0470E+02  1.3263E-01 -6.0861E-02  6.4005E-02  1.7734E+02 -2.1282E+03 -1.0470E+02  3.6880E-01 -2.5978E-01  6.4005E-02  7.3774E-07  4.4634E-07  1.2972E-09  2.0301E-13
320377  6.0127E+03 -1.2987E+03 -1.6732E+03 -6.8977E+01  1.2444E-01 -7.5350E-02  5.5625E-02  4.4015E+02 -2.0719E+03 -6.8977E+01  3.6637E-01 -2.6314E-01  5.5625E-02  6.9574E-07  5.5612E-07  1.2972E-09  1.8387E-13
320377  6.6081E+03 -1.2285E+03 -1.7253E+03 -3.8523E+01  1.1096E-01 -1.0004E-01  4.6780E-02  6.9972E+02 -1.9991E+03 -3.8523E+01  3.6042E-01 -2.7767E-01  4.6780E-02  6.5688E-07  5.4508E-07  1.2972E-09  1.7057E-13
320377  7.2187E+03 -1.1656E+03 -1.7945E+03 -1.1907E+01  9.4505E-02 -1.2611E-01  4.1016E-02  9.6471E+02 -1.9100E+03 -1.1907E+01  3.5397E-01 -2.9464E-01  4.1016E-02  6.2073E-07  5.0067E-07  1.2972E-09  1.6505E-13
320377  7.8030E+03 -1.1153E+03 -1.8746E+03  1.1039E+01  7.6928E-02 -1.4703E-01  3.8429E-02  1.2164E+03 -1.8107E+03  1.1039E+01  3.4798E-01 -3.0829E-01  3.8429E-02  5.8806E-07  4.2465E-07  1.2972E-09  1.6860E-13
320377  8.4049E+03 -1.0749E+03 -1.9679E+03  3.4053E+01  5.6940E-02 -1.6248E-01  3.8118E-02  1.4707E+03 -1.6927E+03  3.4053E+01  3.4148E-01 -3.1790E-01  3.8118E-02  5.2993E-07  3.6473E-07  1.2972E-09  1.8090E-13
320377  9.0204E+03 -1.0470E+03 -2.0719E+03  5.7495E+01  3.3042E-02 -1.7495E-01  3.8026E-02  1.7230E+03 -1.5558E+03  5.7495E+01  3.3262E-01 -3.2634E-01  3.8026E-02  4.9235E-07  3.2922E-07  1.2972E-09  2.0094E-13
320377  9.6070E+03 -1.0352E+03 -2.1778E+03  7.9784E+01  6.6830E-03 -1.8609E-01  3.7896E-02  1.9549E+03 -1.4117E+03  7.9784E+01  3.2158E-01 -3.3577E-01  3.7896E-02  4.4880E-07  3.1179E-07  1.2972E-09  2.2520E-13
320377  1.0225E+04 -1.0410E+03 -2.2964E+03  1.0292E+02 -2.5991E-02 -1.9786E-01  3.6914E-02  2.1907E+03 -1.2483E+03  1.0292E+02  3.0605E-01 -3.4837E-01  3.6914E-02  4.1163E-07  3.0001E-07  1.2972E-09  2.5458E-13
320377  1.0807E+04 -1.0661E+03 -2.4145E+03  1.2418E+02 -6.1181E-02 -2.0818E-01  3.5969E-02  2.4057E+03 -1.0860E+03  1.2418E+02  2.8794E-01 -3.6233E-01  3.5969E-02  3.8589E-07  2.9413E-07  1.2972E-09  2.8475E-13
320377  1.1444E+04 -1.1186E+03 -2.5500E+03  1.4682E+02 -1.0418E-01 -2.1623E-01  3.4856E-02  2.6348E+03 -9.0084E+02  1.4682E+02  2.6453E-01 -3.7797E-01  3.4856E-02  3.4840E-07  2.7293E-07  1.2972E-09  3.1977E-13
320377  1.2040E+04 -1.1935E+03 -2.6801E+03  1.6714E+02 -1.4768E-01 -2.1951E-01  3.3418E-02  2.8434E+03 -7.2256E+02  1.6714E+02  2.3984E-01 -3.9208E-01  3.3418E-02  3.2011E-07  2.5018E-07  1.2972E-09  3.5375E-13
320377  1.2610E+04 -1.2899E+03 -2.8048E+03  1.8579E+02 -1.9104E-01 -2.1775E-01  3.2197E-02  3.0381E+03 -5.4841E+02  1.8579E+02  2.1451E-01 -4.0426E-01  3.2197E-02  2.9497E-07  2.3195E-07  1.2972E-09  3.8696E-13
320377  1.3242E+04 -1.4263E+03 -2.9400E+03  2.0573E+02 -2.4029E-01 -2.0821E-01  3.0868E-02  3.2487E+03 -3.5154E+02  2.0573E+02  1.8480E-01 -4.1444E-01  3.0868E-02  2.6509E-07  1.9188E-07  1.2972E-09  4.2432E-13
320377  1.3836E+04 -1.5826E+03 -3.0589E+03  2.2374E+02 -2.8573E-01 -1.9075E-01  2.9807E-02  3.4402E+03 -1.6405E+02  2.2374E+02  1.5656E-01 -4.1958E-01  2.9807E-02  2.4387E-07  1.5141E-07  1.2972E-09  4.5950E-13
320377  1.4430E+04 -1.7652E+03 -3.1651E+03  2.4108E+02 -3.2923E-01 -1.6564E-01  2.8677E-02  3.6240E+03  2.4886E+01  2.4108E+02  1.2842E-01 -4.2088E-01  2.8677E-02  2.2513E-07  1.2383E-07  1.2972E-09  4.9433E-13
320377  1.5032E+04 -1.9760E+03 -3.2554E+03  2.5806E+02 -3.7044E-01 -1.3333E-01  2.7741E-02  3.8020E+03  2.1743E+02  2.5806E+02  1.0027E-01 -4.1905E-01  2.7741E-02  2.0474E-07  9.8069E-08  1.2972E-09  5.2908E-13
320377  1.5601E+04 -2.1971E+03 -3.3212E+03  2.7365E+02 -4.0606E-01 -9.7226E-02  2.7098E-02  3.9621E+03  3.9955E+02  2.7365E+02  7.4164E-02 -4.1490E-01  2.7098E-02  1.9184E-07  8.0281E-08  1.2972E-09  5.6124E-13
320377  1.6217E+04 -2.4580E+03 -3.3678E+03  2.9007E+02 -4.4053E-01 -5.3057E-02  2.6181E-02  4.1265E+03  5.9627E+02  2.9007E+02  4.6419E-02 -4.0847E-01  2.6181E-02  1.7717E-07  7.1155E-08  1.2972E-09  5.9519E-13
320377  1.6814E+04 -2.7301E+03 -3.3856E+03  3.0547E+02 -4.6943E-01 -5.8343E-03  2.5395E-02  4.2775E+03  7.8614E+02  3.0547E+02  2.0097E-02 -4.0058E-01  2.5395E-02  1.6129E-07  6.2694E-08  1.2972E-09  6.2723E-13
320377  1.7419E+04 -3.0215E+03 -3.3737E+03  3.2063E+02 -4.9358E-01  4.5753E-02  2.4738E-02  4.4223E+03  9.7698E+02  3.2063E+02 -5.7776E-03 -3.9113E-01  2.4738E-02  1.5424E-07  5.4411E-08  1.2972E-09  6.5876E-13
320377  1.8012E+04 -3.3198E+03 -3.3307E+03  3.3506E+02 -5.1161E-01  9.9686E-02  2.3915E-02  4.5567E+03  1.1625E+03  3.3506E+02 -3.0022E-02 -3.8033E-01  2.3915E-02  1.4163E-07  4.6897E-08  1.2972E-09  6.8877E-13
320377  1.8607E+04 -3.6285E+03 -3.2545E+03  3.4906E+02 -5.2384E-01  1.5661E-01  2.3111E-02  4.6843E+03  1.3470E+03  3.4906E+02 -5.3269E-02 -3.6803E-01  2.3111E-02  1.3238E-07  4.0047E-08  1.2972E-09  7.1802E-13
320377  1.9202E+04 -3.9423E+03 -3.1438E+03  3.6259E+02 -5.2977E-01  2.1556E-01  2.2371E-02  4.8049E+03  1.5292E+03  3.6259E+02 -7.5196E-02 -3.5446E-01  2.2371E-02  1.2434E-07  3.3562E-08  1.2972E-09  7.4633E-13
320377  1.9803E+04 -4.2605E+03 -2.9962E+03  3.7581E+02 -5.2918E-01  2.7640E-01  2.1682E-02  4.9196E+03  1.7106E+03  3.7581E+02 -9.5953E-02 -3.3964E-01  2.1682E-02  1.1757E-07  2.8740E-08  1.2972E-09  7.7398E-13
320377  2.0407E+04 -4.5781E+03 -2.8107E+03  3.8865E+02 -5.2173E-01  3.3824E-01  2.0853E-02  5.0284E+03  1.8906E+03  3.8865E+02 -1.1533E-01 -3.2371E-01  2.0853E-02  1.1004E-07  2.4322E-08  1.2972E-09  8.0086E-13
320377  2.1022E+04 -4.8950E+03 -2.5831E+03  4.0124E+02 -5.0709E-01  4.0110E-01  2.0085E-02  5.1326E+03  2.0714E+03  4.0124E+02 -1.3359E-01 -3.0668E-01  2.0085E-02  1.0369E-07  2.0803E-08  1.2972E-09  8.2733E-13
320377  2.1609E+04 -5.1871E+03 -2.3302E+03  4.1284E+02 -4.8646E-01  4.6030E-01  1.9404E-02  5.2261E+03  2.2412E+03  4.1284E+02 -1.4954E-01 -2.8971E-01  1.9404E-02  9.8788E-08  1.8107E-08  1.2972E-09  8.5173E-13
320377  2.2202E+04 -5.4676E+03 -2.0400E+03  4.2414E+02 -4.5910E-01  5.1853E-01  1.8769E-02  5.3149E+03  2.4101E+03  4.2414E+02 -1.6414E-01 -2.7204E-01  1.8769E-02  9.3081E-08  1.5030E-08  1.2972E-09  8.7552E-13
320377  2.2807E+04 -5.7353E+03 -1.7088E+03  4.3531E+02 -4.2454E-01  5.7568E-01  1.8153E-02  5.3998E+03  2.5797E+03  4.3531E+02 -1.7746E-01 -2.5359E-01  1.8153E-02  8.9973E-08  1.3201E-08  1.2972E-09  8.9897E-13
320377  2.3424E+04 -5.9847E+03 -1.3362E+03  4.4633E+02 -3.8269E-01  6.3091E-01  1.7565E-02  5.4809E+03  2.7500E+03  4.4633E+02 -1.8948E-01 -2.3443E-01  1.7565E-02  8.4049E-08  1.1174E-08  1.2972E-09  9.2205E-13
320377  2.4022E+04 -6.1998E+03 -9.4421E+02  4.5665E+02 -3.3616E-01  6.8074E-01  1.6923E-02  5.5542E+03  2.9120E+03  4.5665E+02 -1.9963E-01 -2.1569E-01  1.6923E-02  8.0129E-08  8.4999E-09  1.2972E-09  9.4358E-13
320377  2.4626E+04 -6.3874E+03 -5.1842E+02  4.6667E+02 -2.8342E-01  7.2691E-01  1.6247E-02  5.6234E+03  3.0733E+03  4.6667E+02 -2.0846E-01 -1.9664E-01  1.6247E-02  7.6001E-08  7.6881E-09  1.2972E-09  9.6460E-13
320377  2.5206E+04 -6.5358E+03 -8.5361E+01  4.7591E+02 -2.2794E-01  7.6663E-01  1.5640E-02  5.6852E+03  3.2253E+03  4.7591E+02 -2.1560E-01 -1.7839E-01  1.5640E-02  7.3812E-08  7.3728E-09  1.2972E-09  9.8403E-13
320377  2.5819E+04 -6.6562E+03  3.9575E+02  4.8530E+02 -1.6458E-01  8.0329E-01  1.5024E-02  5.7459E+03  3.3833E+03  4.8530E+02 -2.2180E-01 -1.5914E-01  1.5024E-02  6.8780E-08  6.0697E-09  1.2972E-09  1.0038E-12
320377  2.6402E+04 -6.7337E+03  8.7362E+02  4.9392E+02 -1.0013E-01  8.3269E-01  1.4480E-02  5.7995E+03  3.5315E+03  4.9392E+02 -2.2645E-01 -1.4094E-01  1.4480E-02  6.7433E-08  5.2482E-09  1.2972E-09  1.0220E-12
320377  2.7016E+04 -6.7734E+03  1.3920E+03  5.0263E+02 -2.8791E-02  8.5734E-01  1.3945E-02  5.8516E+03  3.6844E+03  5.0263E+02 -2.3007E-01 -1.2203E-01  1.3945E-02  6.3570E-08  4.4706E-09  1.2972E-09  1.0405E-12
320377  2.7610E+04 -6.7692E+03  1.9070E+03  5.1077E+02  4.3363E-02  8.7481E-01  1.3464E-02  5.8982E+03  3.8302E+03  5.1077E+02 -2.3237E-01 -1.0396E-01  1.3464E-02  6.1226E-08  3.7007E-09  1.2972E-09  1.0577E-12
320377  2.8218E+04 -6.7197E+03  2.4432E+03  5.1882E+02  1.1978E-01  8.8581E-01  1.3000E-02  5.9420E+03  3.9769E+03  5.1882E+02 -2.3348E-01 -8.5797E-02  1.3000E-02  5.9835E-08  3.2636E-09  1.2972E-09  1.0747E-12
320377  2.8813E+04 -6.6257E+03  2.9716E+03  5.2642E+02  1.9624E-01  8.8957E-01  1.2574E-02  5.9811E+03  4.1179E+03  5.2642E+02 -2.3342E-01 -6.8454E-02  1.2574E-02  5.7391E-08  2.3644E-09  1.2972E-09  1.0907E-12
320377  2.9404E+04 -6.4871E+03  3.4965E+03  5.3374E+02  2.7327E-01  8.8629E-01  1.2179E-02  6.0164E+03  4.2556E+03  5.3374E+02 -2.3229E-01 -5.1682E-02  1.2179E-02  5.5088E-08  2.2417E-09  1.2972E-09  1.1060E-12
320377  3.0025E+04 -6.2920E+03  4.0441E+03  5.4118E+02  3.5470E-01  8.7519E-01  1.1783E-02  6.0500E+03  4.3979E+03  5.4118E+02 -2.3004E-01 -3.4579E-02  1.1783E-02  5.3665E-08  1.6009E-09  1.2972E-09  1.1215E-12
320377  3.0618E+04 -6.0588E+03  4.5579E+03  5.4806E+02  4.3213E-01  8.5724E-01  1.1428E-02  6.0788E+03  4.5312E+03  5.4806E+02 -2.2691E-01 -1.8805E-02  1.1428E-02  5.0929E-08  1.4195E-09  1.2972E-09  1.1357E-12
320377  3.1208E+04 -5.7816E+03  5.0563E+03  5.5468E+02  5.0817E-01  8.3226E-01  1.1033E-02  6.1042E+03  4.6616E+03  5.5468E+02 -2.2292E-01 -3.7021E-03  1.1033E-02  4.9585E-08  1.1358E-09  1.2972E-09  1.1493E-12
320377  3.1812E+04 -5.4510E+03  5.5501E+03  5.6123E+02  5.8451E-01  7.9935E-01  1.0619E-02  6.1273E+03  4.7930E+03  5.6123E+02 -2.1799E-01  1.1184E-02  1.0619E-02  4.7847E-08  1.0676E-09  1.2972E-09  1.1627E-12
320377  3.2438E+04 -5.0614E+03  6.0374E+03  5.6774E+02  6.6095E-01  7.5768E-01  1.0207E-02  6.1480E+03  4.9264E+03  5.6774E+02 -2.1200E-01  2.5849E-02  1.0207E-02  4.7426E-08  7.3078E-10  1.2972E-09  1.1760E-12
320377  3.3013E+04 -4.6621E+03  6.4602E+03  5.7350E+02  7.2831E-01  7.1272E-01  9.8404E-03  6.1642E+03  5.0469E+03  5.7350E+02 -2.0578E-01  3.8630E-02  9.8404E-03  4.5555E-08  6.3848E-10  1.2972E-09  1.1878E-12
320377  3.3609E+04 -4.2076E+03  6.8698E+03  5.7926E+02  7.9465E-01  6.5957E-01  9.4708E-03  6.1784E+03  5.1697E+03  5.7926E+02 -1.9866E-01  5.1186E-02  9.4708E-03  4.4807E-08  5.4757E-10  1.2972E-09  1.1995E-12
320377  3.4240E+04 -3.6856E+03  7.2662E+03  5.8511E+02  8.6015E-01  5.9655E-01  9.0919E-03  6.1905E+03  5.2971E+03  5.8511E+02 -1.9048E-01  6.3646E-02  9.0919E-03  4.3542E-08  4.4774E-10  1.2972E-09  1.2114E-12
320377  3.4808E+04 -3.1813E+03  7.5876E+03  5.9018E+02  9.1453E-01  5.3413E-01  8.7636E-03  6.1989E+03  5.4098E+03  5.9018E+02 -1.8257E-01  7.4140E-02  8.7636E-03  4.2900E-08  3.6925E-10  1.2972E-09  1.2216E-12
320377  3.5445E+04 -2.5809E+03  7.9040E+03  5.9565E+02  9.6967E-01  4.5822E-01  8.4039E-03  6.2057E+03  5.5338E+03  5.9565E+02 -1.7318E-01  8.5047E-02  8.4039E-03  4.2089E-08  3.6060E-10  1.2972E-09  1.2326E-12
320377  3.6048E+04 -1.9817E+03  8.1574E+03  6.0062E+02  1.0157E+00  3.8105E-01  8.0701E-03  6.2096E+03  5.6490E+03  6.0062E+02 -1.6383E-01  9.4522E-02  8.0701E-03  4.0793E-08  3.2006E-10  1.2972E-09  1.2426E-12
320377  3.6641E+04 -1.3671E+03  8.3599E+03  6.0532E+02  1.0545E+00  3.0071E-01  7.7539E-03  6.2111E+03  5.7602E+03  6.0532E+02 -1.5427E-01  1.0304E-01  7.7539E-03  4.0109E-08  2.9085E-10  1.2972E-09  1.2519E-12
320377  3.7211E+04 -7.5738E+02  8.5083E+03  6.0965E+02  1.0854E+00  2.1998E-01  7.4573E-03  6.2104E+03  5.8649E+03  6.0965E+02 -1.4481E-01  1.1047E-01  7.4573E-03  3.9833E-08  2.1631E-10  1.2972E-09  1.2605E-12
320377  3.7830E+04 -7.6843E+01  8.6165E+03  6.1417E+02  1.1116E+00  1.2881E-01  7.1436E-03  6.2074E+03  5.9765E+03  6.1417E+02 -1.3428E-01  1.1770E-01  7.1436E-03  3.9267E-08  2.1960E-10  1.2972E-09  1.2694E-12
320377  3.8432E+04  5.9806E+02  8.6666E+03  6.1838E+02  1.1293E+00  3.7418E-02  6.8452E-03  6.2022E+03  6.0828E+03  6.1838E+02 -1.2384E-01  1.2389E-01  6.8452E-03  3.8297E-08  2.0559E-10  1.2972E-09  1.2776E-12
320377  3.9039E+04  1.2871E+03  8.6608E+03  6.2244E+02  1.1391E+00 -5.6770E-02  6.5546E-03  6.1949E+03  6.1879E+03  6.2244E+02 -1.1317E-01  1.2934E-01  6.5546E-03  3.7637E-08  2.1628E-10  1.2972E-09  1.2855E-12
320377  3.9606E+04  1.9339E+03  8.6034E+03  6.2609E+02  1.1408E+00 -1.4597E-01  6.2893E-03  6.1861E+03  6.2841E+03  6.2609E+02 -1.0316E-01  1.3366E-01  6.2893E-03  3.7601E-08  2.0435E-10  1.2972E-09  1.2925E-12
320377  4.0205E+04  2.6148E+03  8.4878E+03  6.2976E+02  1.1347E+00 -2.4062E-01  6.0122E-03  6.1750E+03  6.3835E+03  6.2976E+02 -9.2568E-02  1.3745E-01  6.0122E-03  3.6935E-08  2.1767E-10  1.2972E-09  1.2995E-12
320377  4.0800E+04  3.2871E+03  8.3163E+03  6.3327E+02  1.1204E+00 -3.3481E-01  5.7434E-03  6.1619E+03  6.4805E+03  6.3327E+02 -8.2052E-02  1.4048E-01  5.7434E-03  3.6672E-08  1.9625E-10  1.2972E-09  1.3061E-12
320377  4.1410E+04  3.9630E+03  8.0832E+03  6.3668E+02  1.0974E+00 -4.3021E-01  5.4722E-03  6.1467E+03  6.5775E+03  6.3668E+02 -7.1394E-02  1.4282E-01  5.4722E-03  3.5973E-08  2.0660E-10  1.2972E-09  1.3124E-12
320377  4.2045E+04  4.6508E+03  7.7785E+03  6.4007E+02  1.0643E+00 -5.2798E-01  5.1955E-03  6.1287E+03  6.6764E+03  6.4007E+02 -6.0413E-02  1.4448E-01  5.1955E-03  3.5430E-08  1.7967E-10  1.2972E-09  1.3187E-12
320377  4.2622E+04  5.2536E+03  7.4492E+03  6.4300E+02  1.0265E+00 -6.1429E-01  4.9523E-03  6.1106E+03  6.7640E+03  6.4300E+02 -5.0638E-02  1.4533E-01  4.9523E-03  3.5572E-08  1.7040E-10  1.2972E-09  1.3239E-12
320377  4.3241E+04  5.8747E+03  7.0408E+03  6.4599E+02  9.7767E-01 -7.0386E-01  4.6931E-03  6.0893E+03  6.8560E+03  6.4599E+02 -4.0363E-02  1.4558E-01  4.6931E-03  3.5353E-08  1.7740E-10  1.2972E-09  1.3292E-12
320377  4.3821E+04  6.4268E+03  6.6090E+03  6.4864E+02  9.2461E-01 -7.8405E-01  4.4545E-03  6.0677E+03  6.9402E+03  6.4864E+02 -3.0999E-02  1.4521E-01  4.4545E-03  3.5135E-08  1.4902E-10  1.2972E-09  1.3338E-12
320377  4.4437E+04  6.9770E+03  6.1011E+03  6.5130E+02  8.6080E-01 -8.6457E-01  4.1815E-03  6.0430E+03  7.0274E+03  6.5130E+02 -2.1359E-02  1.4425E-01  4.1815E-03  3.4457E-08  1.4569E-10  1.2972E-09  1.3383E-12
320377  4.5019E+04  7.4586E+03  5.5773E+03  6.5365E+02  7.9388E-01 -9.3560E-01  3.9003E-03  6.0180E+03  7.1077E+03  6.5365E+02 -1.2550E-02  1.4284E-01  3.9003E-03  3.4058E-08  1.4744E-10  1.2972E-09  1.3422E-12
320377  4.5645E+04  7.9313E+03  4.9691E+03  6.5600E+02  7.1505E-01 -1.0060E+00  3.6010E-03  5.9894E+03  7.1920E+03  6.5600E+02 -3.4282E-03  1.4083E-01  3.6010E-03  3.4218E-08  1.5224E-10  1.2972E-09  1.3460E-12
320377  4.6226E+04  8.3242E+03  4.3670E+03  6.5801E+02  6.3611E-01 -1.0651E+00  3.3268E-03  5.9613E+03  7.2681E+03  6.5801E+02  4.6859E-03  1.3852E-01  3.3268E-03  3.4044E-08  1.2238E-10  1.2972E-09  1.3492E-12
320377  4.6832E+04  8.6835E+03  3.7043E+03  6.5994E+02  5.4838E-01 -1.1198E+00  3.0435E-03  5.9303E+03  7.3455E+03  6.5994E+02  1.2772E-02  1.3573E-01  3.0435E-03  3.3767E-08  1.6208E-10  1.2972E-09  1.3522E-12
320377  4.7422E+04  8.9805E+03  3.0302E+03  6.6166E+02  4.5840E-01 -1.1658E+00  2.7718E-03  5.8987E+03  7.4187E+03  6.6166E+02  2.0262E-02  1.3267E-01  2.7718E-03  3.3608E-08  1.5085E-10  1.2972E-09  1.3548E-12
320377  4.8004E+04  9.2205E+03  2.3401E+03  6.6320E+02  3.6566E-01 -1.2039E+00  2.5090E-03  5.8660E+03  7.4890E+03  6.6320E+02  2.7294E-02  1.2935E-01  2.5090E-03  3.3732E-08  1.9245E-10  1.2972E-09  1.3570E-12
320377  4.8623E+04  9.4155E+03  1.5842E+03  6.6466E+02  2.6345E-01 -1.2358E+00  2.2293E-03  5.8295E+03  7.5616E+03  6.6466E+02  3.4380E-02  1.2555E-01  2.2293E-03  3.3489E-08  1.9808E-10  1.2972E-09  1.3591E-12
320377  4.9201E+04  9.5395E+03  8.6327E+02  6.6588E+02  1.6544E-01 -1.2576E+00  1.9695E-03  5.7941E+03  7.6273E+03  6.6588E+02  4.0623E-02  1.2177E-01  1.9695E-03  3.3518E-08  2.0374E-10  1.2972E-09  1.3606E-12
320377  4.9817E+04  9.6087E+03  8.3901E+01  6.6701E+02  5.9053E-02 -1.2718E+00  1.6981E-03  5.7548E+03  7.6953E+03  6.6701E+02  4.6921E-02  1.1755E-01  1.6981E-03  3.3106E-08  2.7551E-10  1.2972E-09  1.3619E-12
320377  5.0428E+04  9.6122E+03 -6.9531E+02  6.6796E+02 -4.7746E-02 -1.2767E+00  1.4323E-03  5.7142E+03  7.7605E+03  6.6796E+02  5.2790E-02  1.1319E-01  1.4323E-03  3.3024E-08  3.6814E-10  1.2972E-09  1.3629E-12
320377  5.1032E+04  9.5514E+03 -1.4657E+03  6.6875E+02 -1.5365E-01 -1.2723E+00  1.1708E-03  5.6727E+03  7.8229E+03  6.6875E+02  5.8281E-02  1.0873E-01  1.1708E-03  3.2356E-08  4.7579E-10  1.2972E-09  1.3635E-12
320377  5.1616E+04  9.4319E+03 -2.2053E+03  6.6936E+02 -2.5558E-01 -1.2595E+00  9.2499E-04  5.6311E+03  7.8813E+03  6.6936E+02  6.3283E-02  1.0429E-01  9.2499E-04  3.2779E-08  6.5426E-10  1.2972E-09  1.3637E-12
320377  5.2232E+04  9.2416E+03 -2.9748E+03  6.6985E+02 -3.6185E-01 -1.2367E+00  6.6586E-04  5.5858E+03  7.9407E+03  6.6985E+02  6.8277E-02  9.9506E-02  6.6586E-04  3.2591E-08  8.4205E-10  1.2972E-09  1.3637E-12
320377  5.2842E+04  8.9894E+03 -3.7197E+03  6.7018E+02 -4.6490E-01 -1.2051E+00  4.1665E-04  5.5395E+03  7.9974E+03  6.7018E+02  7.2944E-02  9.4668E-02  4.1665E-04  3.2225E-08  1.0472E-09  1.2972E-09  1.3633E-12
320377  5.3437E+04  8.6834E+03 -4.4257E+03  6.7035E+02 -5.6266E-01 -1.1657E+00  1.7513E-04  5.4930E+03  8.0508E+03  6.7035E+02  7.7253E-02  8.9838E-02  1.7513E-04  3.2047E-08  1.2660E-09  1.2972E-09  1.3626E-12
320377  5.4038E+04  8.3169E+03 -5.1115E+03  6.7039E+02 -6.5770E-01 -1.1177E+00 -5.8019E-05  5.4447E+03  8.1027E+03  6.7039E+02  8.1378E-02  8.4867E-02 -5.8019E-05  3.2021E-08  1.6296E-09  1.2972E-09  1.3616E-12
320377  5.4618E+04  7.9097E+03 -5.7446E+03  6.7029E+02 -7.4546E-01 -1.0637E+00 -2.7556E-04  5.3968E+03  8.1510E+03  6.7029E+02  8.5162E-02  7.9954E-02 -2.7556E-04  3.1911E-08  1.8220E-09  1.2972E-09  1.3603E-12
320377  5.5202E+04  7.4496E+03 -6.3483E+03  6.7007E+02 -8.2915E-01 -1.0022E+00 -4.9271E-04  5.3474E+03  8.1977E+03  6.7007E+02  8.8765E-02  7.4897E-02 -4.9271E-04  3.1924E-08  2.1923E-09  1.2972E-09  1.3588E-12
320377  5.5826E+04  6.9062E+03 -6.9509E+03  6.6969E+02 -9.1266E-01 -9.2920E-01 -7.1599E-04  5.2934E+03  8.2456E+03  6.6969E+02  9.2380E-02  6.9378E-02 -7.1599E-04  3.1058E-08  2.4553E-09  1.2972E-09  1.3569E-12
320377  5.6437E+04  6.3253E+03 -7.4949E+03  6.6919E+02 -9.8799E-01 -8.5076E-01 -9.2394E-04  5.2392E+03  8.2906E+03  6.6919E+02  9.5711E-02  6.3822E-02 -9.2394E-04  3.1217E-08  2.8709E-09  1.2972E-09  1.3546E-12
320377  5.7018E+04  5.7316E+03 -7.9664E+03  6.6859E+02 -1.0532E+00 -7.7033E-01 -1.1220E-03  5.1865E+03  8.3316E+03  6.6859E+02  9.8663E-02  5.8407E-02 -1.1220E-03  3.0875E-08  3.0655E-09  1.2972E-09  1.3523E-12
320377  5.7635E+04  5.0618E+03 -8.4143E+03  6.6784E+02 -1.1151E+00 -6.7937E-01 -1.3297E-03  5.1294E+03  8.3732E+03  6.6784E+02  1.0155E-01  5.2521E-02 -1.3297E-03  3.0786E-08  3.2771E-09  1.2972E-09  1.3495E-12
320377  5.8202E+04  4.4156E+03 -8.7745E+03  6.6703E+02 -1.1647E+00 -5.9146E-01 -1.5134E-03  5.0759E+03  8.4097E+03  6.6703E+02  1.0398E-01  4.6995E-02 -1.5134E-03  3.0639E-08  3.5190E-09  1.2972E-09  1.3467E-12
320377  5.8816E+04  3.6861E+03 -9.1072E+03  6.6604E+02 -1.2105E+00 -4.9212E-01 -1.7038E-03  5.0170E+03  8.4474E+03  6.6604E+02  1.0635E-01  4.0870E-02 -1.7038E-03  3.0656E-08  3.9688E-09  1.2972E-09  1.3433E-12
320377  5.9419E+04  2.9451E+03 -9.3736E+03  6.6496E+02 -1.2469E+00 -3.9115E-01 -1.8827E-03  4.9581E+03  8.4827E+03  6.6496E+02  1.0845E-01  3.4686E-02 -1.8827E-03  3.0451E-08  5.4421E-09  1.2972E-09  1.3398E-12
320377  6.0037E+04  2.1649E+03 -9.5828E+03  6.6375E+02 -1.2752E+00 -2.8511E-01 -2.0210E-03  4.8966E+03  8.5170E+03  6.6375E+02  1.1041E-01  2.7918E-02 -2.0210E-03  3.0366E-08  9.0837E-09  1.2972E-09  1.3360E-12
320377  6.0607E+04  1.4324E+03 -9.7171E+03  6.6258E+02 -1.2930E+00 -1.8605E-01 -2.0634E-03  4.8392E+03  8.5473E+03  6.6258E+02  1.1205E-01  2.1063E-02 -2.0634E-03  3.0578E-08  1.4608E-08  1.2972E-09  1.3323E-12
320377  6.1207E+04  6.5344E+02 -9.7973E+03  6.6135E+02 -1.3032E+00 -8.1393E-02 -2.0217E-03  4.7781E+03  8.5782E+03  6.6135E+02  1.1342E-01  1.3089E-02 -2.0217E-03  3.0360E-08  1.7803E-08  1.2972E-09  1.3282E-12
320377  6.1806E+04 -1.2807E+02 -9.8148E+03  6.6016E+02 -1.3049E+00  2.3188E-02 -1.9453E-03  4.7165E+03  8.6081E+03  6.6016E+02  1.1423E-01  4.6705E-03 -1.9453E-03  3.0536E-08  2.0155E-08  1.2972E-09  1.3240E-12
320377  6.2423E+04 -9.3183E+02 -9.7673E+03  6.5899E+02 -1.2979E+00  1.3042E-01 -1.8463E-03  4.6527E+03  8.6383E+03  6.5899E+02  1.1437E-01 -4.3103E-03 -1.8463E-03  3.0251E-08  2.1470E-08  1.2972E-09  1.3196E-12
320377  6.3005E+04 -1.6834E+03 -9.6622E+03  6.5795E+02 -1.2833E+00  2.3052E-01 -1.7636E-03  4.5922E+03  8.6662E+03  6.5795E+02  1.1378E-01 -1.2884E-02 -1.7636E-03  3.0251E-08  2.1814E-08  1.2972E-09  1.3154E-12
320377  6.3615E+04 -2.4597E+03 -9.4899E+03  6.5689E+02 -1.2597E+00  3.3378E-01 -1.6879E-03  4.5285E+03  8.6949E+03  6.5689E+02  1.1244E-01 -2.1872E-02 -1.6879E-03  3.0458E-08  2.2506E-08  1.2972E-09  1.3110E-12
320377  6.4200E+04 -3.1882E+03 -9.2662E+03  6.5591E+02 -1.2294E+00  4.3065E-01 -1.6675E-03  4.4671E+03  8.7219E+03  6.5591E+02  1.1045E-01 -3.0328E-02 -1.6675E-03  3.0437E-08  2.2106E-08  1.2972E-09  1.3067E-12
320377  6.4825E+04 -3.9439E+03 -8.9656E+03  6.5487E+02 -1.1887E+00  5.3113E-01 -1.6818E-03  4.4014E+03  8.7501E+03  6.5487E+02  1.0761E-01 -3.9113E-02 -1.6818E-03  3.0632E-08  2.2134E-08  1.2972E-09  1.3020E-12
320377  6.5407E+04 -4.6226E+03 -8.6302E+03  6.5388E+02 -1.1435E+00  6.2144E-01 -1.7191E-03  4.3399E+03  8.7757E+03  6.5388E+02  1.0433E-01 -4.6938E-02 -1.7191E-03  3.1080E-08  1.9930E-08  1.2972E-09  1.2976E-12
320377  6.6017E+04 -5.3043E+03 -8.2229E+03  6.5281E+02 -1.0885E+00  7.1242E-01 -1.7953E-03  4.2752E+03  8.8019E+03  6.5281E+02  1.0046E-01 -5.4537E-02 -1.7953E-03  3.1147E-08  1.6973E-08  1.2972E-09  1.2929E-12
320377  6.6610E+04 -5.9323E+03 -7.7751E+03  6.5171E+02 -1.0277E+00  7.9657E-01 -1.9182E-03  4.2120E+03  8.8263E+03  6.5171E+02  9.6518E-02 -6.1180E-02 -1.9182E-03  3.1066E-08  1.2071E-08  1.2972E-09  1.2883E-12
320377  6.7241E+04 -6.5583E+03 -7.2456E+03  6.5045E+02 -9.5529E-01  8.8079E-01 -2.0836E-03  4.1441E+03  8.8508E+03  6.5045E+02  9.2353E-02 -6.7490E-02 -2.0836E-03  3.1328E-08  8.2132E-09  1.2972E-09  1.2832E-12
320377  6.7827E+04 -7.0968E+03 -6.7079E+03  6.4918E+02 -8.8148E-01  9.5322E-01 -2.2290E-03  4.0804E+03  8.8719E+03  6.4918E+02  8.8418E-02 -7.2917E-02 -2.2290E-03  3.1492E-08  6.5064E-09  1.2972E-09  1.2782E-12
320377  6.8414E+04 -7.5906E+03 -6.1292E+03  6.4784E+02 -8.0190E-01  1.0195E+00 -2.3650E-03  4.0160E+03  8.8913E+03  6.4784E+02  8.4332E-02 -7.8056E-02 -2.3650E-03  3.1640E-08  6.1312E-09  1.2972E-09  1.2730E-12
320377  6.9006E+04 -8.0403E+03 -5.5074E+03  6.4640E+02 -7.1630E-01  1.0796E+00 -2.5054E-03  3.9503E+03  8.9092E+03  6.4640E+02  8.0029E-02 -8.3003E-02 -2.5054E-03  3.1970E-08  5.4406E-09  1.2972E-09  1.2676E-12
320377  6.9633E+04 -8.4601E+03 -4.8120E+03  6.4477E+02 -6.2052E-01  1.1352E+00 -2.6646E-03  3.8797E+03  8.9261E+03  6.4477E+02  7.5253E-02 -8.8010E-02 -2.6646E-03  3.1673E-08  4.7795E-09  1.2972E-09  1.2616E-12
320377  7.0217E+04 -8.7950E+03 -4.1366E+03  6.4317E+02 -5.2750E-01  1.1792E+00 -2.8192E-03  3.8135E+03  8.9399E+03  6.4317E+02  7.0627E-02 -9.2455E-02 -2.8192E-03  3.2095E-08  4.5789E-09  1.2972E-09  1.2558E-12
320377  7.0823E+04 -9.0845E+03 -3.4105E+03  6.4142E+02 -4.2752E-01  1.2167E+00 -2.9845E-03  3.7439E+03  8.9522E+03  6.4142E+02  6.5609E-02 -9.6882E-02 -2.9845E-03  3.2158E-08  4.3112E-09  1.2972E-09  1.2496E-12
320377  7.1434E+04 -9.3142E+03 -2.6576E+03  6.3954E+02 -3.2390E-01  1.2456E+00 -3.1589E-03  3.6729E+03  8.9625E+03  6.3954E+02  6.0364E-02 -1.0114E-01 -3.1589E-03  3.2285E-08  3.7838E-09  1.2972E-09  1.2430E-12
320377  7.2020E+04 -9.4746E+03 -1.9209E+03  6.3764E+02 -2.2262E-01  1.2649E+00 -3.3312E-03  3.6040E+03  8.9704E+03  6.3764E+02  5.5134E-02 -1.0503E-01 -3.3312E-03  3.2336E-08  3.5004E-09  1.2972E-09  1.2364E-12
320377  7.2611E+04 -9.5757E+03 -1.1695E+03  6.3561E+02 -1.1946E-01  1.2758E+00 -3.5117E-03  3.5339E+03  8.9763E+03  6.3561E+02  4.9644E-02 -1.0877E-01 -3.5117E-03  3.2440E-08  3.1831E-09  1.2972E-09  1.2296E-12
320377  7.3226E+04 -9.6161E+03 -3.8382E+02  6.3339E+02 -1.1787E-02  1.2779E+00 -3.7057E-03  3.4601E+03  8.9802E+03  6.3339E+02  4.3710E-02 -1.1246E-01 -3.7057E-03  3.2778E-08  2.9963E-09  1.2972E-09  1.2222E-12
320377  7.3834E+04 -9.5910E+03  3.9120E+02  6.3108E+02  9.4185E-02  1.2709E+00 -3.8967E-03  3.3864E+03  8.9817E+03  6.3108E+02  3.7621E-02 -1.1589E-01 -3.8967E-03  3.2790E-08  2.8272E-09  1.2972E-09  1.2146E-12
320377  7.4445E+04 -9.5012E+03  1.1632E+03  6.2864E+02  1.9942E-01  1.2547E+00 -4.0919E-03  3.3116E+03  8.9810E+03  6.2864E+02  3.1233E-02 -1.1911E-01 -4.0919E-03  3.2966E-08  2.6970E-09  1.2972E-09  1.2068E-12
320377  7.5036E+04 -9.3536E+03  1.8983E+03  6.2617E+02  2.9930E-01  1.2304E+00 -4.2879E-03  3.2385E+03  8.9781E+03  6.2617E+02  2.4815E-02 -1.2202E-01 -4.2879E-03  3.2746E-08  2.3483E-09  1.2972E-09  1.1989E-12
320377  7.5618E+04 -9.1517E+03  2.6047E+03  6.2362E+02  3.9488E-01  1.1986E+00 -4.4813E-03  3.1658E+03  8.9731E+03  6.2362E+02  1.8272E-02 -1.2464E-01 -4.4813E-03  3.2893E-08  2.0956E-09  1.2972E-09  1.1909E-12
320377  7.6206E+04 -8.8917E+03  3.2987E+03  6.2092E+02  4.8837E-01  1.1586E+00 -4.6792E-03  3.0916E+03  8.9658E+03  6.2092E+02  1.1412E-02 -1.2704E-01 -4.6792E-03  3.3285E-08  1.8629E-09  1.2972E-09  1.1826E-12
320377  7.6841E+04 -8.5511E+03  4.0177E+03  6.1789E+02  5.8466E-01  1.1071E+00 -4.8955E-03  3.0108E+03  8.9553E+03  6.1789E+02  3.7367E-03 -1.2932E-01 -4.8955E-03  3.3235E-08  1.6463E-09  1.2972E-09  1.1733E-12
320377  7.7432E+04 -8.1796E+03  4.6569E+03  6.1493E+02  6.6966E-01  1.0516E+00 -5.0961E-03  2.9347E+03  8.9432E+03  6.1493E+02 -3.6872E-03 -1.3114E-01 -5.0961E-03  3.3319E-08  1.4697E-09  1.2972E-09  1.1644E-12
320377  7.8034E+04 -7.7523E+03  5.2705E+03  6.1180E+02  7.5058E-01  9.8828E-01 -5.3017E-03  2.8566E+03  8.9284E+03  6.1180E+02 -1.1499E-02 -1.3264E-01 -5.3017E-03  3.3459E-08  1.1902E-09  1.2972E-09  1.1550E-12
320377  7.8622E+04 -7.2888E+03  5.8323E+03  6.0862E+02  8.2391E-01  9.2015E-01 -5.5088E-03  2.7795E+03  8.9116E+03  6.0862E+02 -1.9384E-02 -1.3375E-01 -5.5088E-03  3.4097E-08  1.0225E-09  1.2972E-09  1.1456E-12
320377  7.9224E+04 -6.7720E+03  6.3636E+03  6.0524E+02  8.9242E-01  8.4469E-01 -5.7244E-03  2.6999E+03  8.8919E+03  6.0524E+02 -2.7705E-02 -1.3449E-01 -5.7244E-03  3.3983E-08  8.5110E-10  1.2972E-09  1.1357E-12
320377  7.9829E+04 -6.2128E+03  6.8506E+03  6.0171E+02  9.5421E-01  7.6354E-01 -5.9427E-03  2.6191E+03  8.8696E+03  6.0171E+02 -3.6325E-02 -1.3477E-01 -5.9427E-03  3.4219E-08  7.5749E-10  1.2972E-09  1.1255E-12
320377  8.0435E+04 -5.6181E+03  7.2872E+03  5.9805E+02  1.0085E+00  6.7775E-01 -6.1638E-03  2.5376E+03  8.8446E+03  5.9805E+02 -4.5176E-02 -1.3458E-01 -6.1638E-03  3.4792E-08  6.3880E-10  1.2972E-09  1.1150E-12
320377  8.1040E+04 -4.9936E+03  7.6703E+03  5.9425E+02  1.0548E+00  5.8815E-01 -6.3948E-03  2.4555E+03  8.8170E+03  5.9425E+02 -5.4216E-02 -1.3388E-01 -6.3948E-03  3.4818E-08  5.1776E-10  1.2972E-09  1.1042E-12
320377  8.1630E+04 -4.3591E+03  7.9911E+03  5.9041E+02  1.0922E+00  4.9763E-01 -6.6217E-03  2.3747E+03  8.7875E+03  5.9041E+02 -6.3224E-02 -1.3266E-01 -6.6217E-03  3.5122E-08  4.1301E-10  1.2972E-09  1.0934E-12
320377  8.2241E+04 -3.6827E+03  8.2657E+03  5.8629E+02  1.1225E+00  4.0167E-01 -6.8680E-03  2.2905E+03  8.7543E+03  5.8629E+02 -7.2680E-02 -1.3082E-01 -6.8680E-03  3.5403E-08  3.8393E-10  1.2972E-09  1.0819E-12
320377  8.2848E+04 -2.9940E+03  8.4802E+03  5.8204E+02  1.1439E+00  3.0455E-01 -7.1181E-03  2.2060E+03  8.7184E+03  5.8204E+02 -8.2216E-02 -1.2835E-01 -7.1181E-03  3.5922E-08  3.2444E-10  1.2972E-09  1.0702E-12
320377  8.3441E+04 -2.3116E+03  8.6324E+03  5.7775E+02  1.1566E+00  2.0892E-01 -7.3701E-03  2.1230E+03  8.6807E+03  5.7775E+02 -9.1609E-02 -1.2532E-01 -7.3701E-03  3.6783E-08  2.7568E-10  1.2972E-09  1.0585E-12
320377  8.4033E+04 -1.6250E+03  8.7278E+03  5.7331E+02  1.1609E+00  1.1332E-01 -7.6308E-03  2.0395E+03  8.6404E+03  5.7331E+02 -1.0103E-01 -1.2164E-01 -7.6308E-03  3.7193E-08  2.7149E-10  1.2972E-09  1.0466E-12
320377  8.4604E+04 -9.6299E+02  8.7663E+03  5.6888E+02  1.1574E+00  2.1773E-02 -7.8850E-03  1.9584E+03  8.5989E+03  5.6888E+02 -1.1011E-01 -1.1747E-01 -7.8850E-03  3.7084E-08  2.5702E-10  1.2972E-09  1.0348E-12
320377  8.5201E+04 -2.7490E+02  8.7511E+03  5.6409E+02  1.1458E+00 -7.2630E-02 -8.1580E-03  1.8730E+03  8.5527E+03  5.6409E+02 -1.1956E-01 -1.1238E-01 -8.1580E-03  3.7515E-08  2.1346E-10  1.2972E-09  1.0221E-12
320377  8.5820E+04  4.2788E+02  8.6764E+03  5.5895E+02  1.1253E+00 -1.6828E-01 -8.4562E-03  1.7840E+03  8.5018E+03  5.5895E+02 -1.2924E-01 -1.0642E-01 -8.4562E-03  3.8333E-08  1.8544E-10  1.2972E-09  1.0088E-12
320447  0.0000E+00 -1.4929E+03 -1.3494E+03 -5.6918E+02 -0.0000E+00 -0.0000E+00  0.0000E+00 -1.4929E+03 -1.3494E+03 -5.6918E+02  1.9511E-01 -2.1587E-01  0.0000E+00  9.0353E-07  6.2459E-07  1.2972E-09  3.1609E-13
320447  6.1146E+02 -1.4882E+03 -1.3500E+03 -5.5681E+02  1.4480E-02 -4.5411E-03  4.0879E-02 -1.3631E+03 -1.4762E+03 -5.5681E+02  2.0968E-01 -2.1971E-01  4.0879E-02  9.0353E-07  7.1292E-07  1.2972E-09  3.1008E-13
320460  0.0000E+00 -1.7068E+03 -9.4724E+02 -6.7666E+02 -0.0000E+00 -0.0000E+00  0.0000E+00 -1.7068E+03 -9.4724E+02 -6.7666E+02  1.3696E-01 -2.4679E-01  0.0000E+00  9.4291E-07  6.5851E-07  1.2972E-09  3.1723E-13
320460  6.1482E+02 -1.7093E+03 -9.4806E+02 -6.5818E+02 -7.1400E-03 -4.1803E-03  5.7673E-02 -1.6184E+03 -1.0961E+03 -6.5818E+02  1.2994E-01 -2.5133E-01  5.7673E-02  9.5135E-07  6.8896E-07  1.2972E-09  3.1619E-13
320502  0.0000E+00 -1.8043E+03 -9.8403E+02 -5.6768E+02 -0.0000E+00 -0.0000E+00 -0.0000E+00 -1.8043E+03 -9.8403E+02 -5.6768E+02  1.4228E-01 -2.6089E-01  0.0000E+00  9.3827E-07  6.6184E-07  1.2972E-09  3.2711E-13
320502  6.0374E+02 -1.7966E+03 -9.9154E+02 -5.5621E+02  2.3603E-02 -2.6228E-02  3.6947E-02 -1.7033E+03 -1.1444E+03 -5.5621E+02  1.6697E-01 -2.8600E-01  3.6947E-02  9.3827E-07  7.2768E-07  1.2972E-09  3.2566E-13
320507  0.0000E+00 -1.3464E+03 -1.3603E+03 -5.8300E+02 -0.0000E+00 -0.0000E+00  0.0000E+00 -1.3464E+03 -1.3603E+03 -5.8300E+02  1.9668E-01 -1.9467E-01  0.0000E+00  9.1899E-07  5.9362E-07  1.2972E-09  2.9983E-13
320531  0.0000E+00 -2.1361E+03 -7.7120E+02 -4.5064E+02 -0.0000E+00 -0.0000E+00 -0.0000E+00 -2.1361E+03 -7.7120E+02 -4.5064E+02  1.1151E-01 -3.0886E-01  0.0000E+00  9.0210E-07  5.7131E-07  1.2972E-09  3.4974E-13
320570  0.0000E+00 -2.0266E+03 -1.4103E+03 -1.7304E+02 -0.0000E+00 -0.0000E+00 -0.0000E+00 -2.0266E+03 -1.4103E+03 -1.7304E+02  2.0392E-01 -2.9303E-01  0.0000E+00  8.1447E-07  5.7933E-07  1.2972E-09  3.7051E-13
320570  6.1102E+02 -2.0233E+03 -1.4061E+03 -1.8100E+02  1.1437E-02  1.4821E-02 -2.6127E-02 -1.8913E+03 -1.5791E+03 -1.8100E+02  2.1474E-01 -2.7773E-01 -2.6127E-02  8.3254E-07  5.7047E-07  1.2972E-09  3.6706E-13
320570  1.2105E+03 -2.0110E+03 -1.3901E+03 -2.0272E+02  3.1478E-02  4.0386E-02 -4.3226E-02 -1.7382E+03 -1.7191E+03 -2.0272E+02  2.3248E-01 -2.5039E-01 -4.3226E-02  8.3792E-07  4.2048E-07  1.2972E-09  3.6037E-13
320570  1.8154E+03 -1.9859E+03 -1.3561E+03 -2.3339E+02  5.0212E-02  7.4597E-02 -5.7847E-02 -1.5660E+03 -1.8249E+03 -2.3339E+02  2.4629E-01 -2.1254E-01 -5.7847E-02  8.5103E-07  4.0738E-07  1.2972E-09  3.4962E-13
320584  0.0000E+00 -1.6408E+03 -1.0150E+03 -6.4417E+02 -0.0000E+00 -0.0000E+00 -0.0000E+00 -1.6408E+03 -1.0150E+03 -6.4417E+02  1.4677E-01 -2.3725E-01  0.0000E+00  9.5007E-07  7.1149E-07  1.2972E-09  3.1229E-13
320585  0.0000E+00 -1.6552E+03 -9.9780E+02 -6.8366E+02 -0.0000E+00 -0.0000E+00 -0.0000E+00 -1.6552E+03 -9.9780E+02 -6.8366E+02  1.4427E-01 -2.3933E-01  0.0000E+00  9.5303E-07  6.7806E-07  1.2972E-09  3.1475E-13
320585  6.0191E+02 -1.6557E+03 -1.0014E+03 -6.6440E+02 -8.7126E-04 -1.3031E-02  6.3446E-02 -1.5623E+03 -1.1415E+03 -6.6440E+02  1.4393E-01 -2.5242E-01  6.3446E-02  9.5023E-07  6.8891E-07  1.2972E-09  3.1296E-13
320627  0.0000E+00 -1.8207E+03 -1.4449E+03 -3.1831E+02 -0.0000E+00 -0.0000E+00 -0.0000E+00 -1.8207E+03 -1.4449E+03 -3.1831E+02  2.0892E-01 -2.6326E-01  0.0000E+00  8.3578E-07  6.4037E-07  1.2972E-09  3.5314E-13
320628  0.0000E+00 -1.8286E+03 -1.4417E+03 -3.1293E+02 -0.0000E+00 -0.0000E+00 -0.0000E+00 -1.8286E+03 -1.4417E+03 -3.1293E+02  2.0846E-01 -2.6440E-01  0.0000E+00  8.4705E-07  6.6965E-07  1.2972E-09  3.5366E-13
320628  6.0761E+02 -1.8298E+03 -1.4387E+03 -3.1788E+02 -3.1845E-03  9.5391E-03 -1.5708E-02 -1.6965E+03 -1.5937E+03 -3.1788E+02  2.0484E-01 -2.5503E-01 -1.5708E-02  8.3578E-07  5.8071E-07  1.2972E-09  3.4965E-13
320628  1.2163E+03 -1.8272E+03 -1.4240E+03 -3.3281E+02  1.4534E-02  4.3559E-02 -3.0327E-02 -1.5499E+03 -1.7218E+03 -3.3281E+02  2.2044E-01 -2.2064E-01 -3.0327E-02  8.5037E-07  3.9178E-07  1.2972E-09  3.4303E-13
320654  0.0000E+00 -1.2193E+03 -1.3215E+03 -7.0850E+02 -0.0000E+00 -0.0000E+00 -0.0000E+00 -1.2193E+03 -1.3215E+03 -7.0850E+02  1.9108E-01 -1.7630E-01  0.0000E+00  9.1884E-07  5.1962E-07  1.2972E-09  2.8759E-13
320654  6.0966E+02 -1.2258E+03 -1.3076E+03 -7.0080E+02 -1.8285E-02  4.4576E-02  2.2234E-02 -1.1059E+03 -1.4104E+03 -7.0080E+02  1.7078E-01 -1.3266E-01  2.2234E-02  9.2831E-07  5.8811E-07  1.2972E-09  2.8119E-13
320669  0.0000E+00 -1.8035E+03 -9.8672E+02 -5.5793E+02 -0.0000E+00 -0.0000E+00 -0.0000E+00 -1.8035E+03 -9.8672E+02 -5.5793E+02  1.4267E-01 -2.6077E-01  0.0000E+00  9.3827E-07  7.1689E-07  1.2972E-09  3.2674E-13
320669  6.0874E+02 -1.7972E+03 -9.9587E+02 -5.4612E+02  2.0471E-02 -2.9835E-02  3.5237E-02 -1.7027E+03 -1.1500E+03 -5.4612E+02  1.6446E-01 -2.8970E-01  3.5237E-02  9.4025E-07  7.3373E-07  1.2972E-09  3.2555E-13
320685  0.0000E+00 -1.5880E+03 -1.3586E+03 -5.2850E+02 -0.0000E+00 -0.0000E+00 -0.0000E+00 -1.5880E+03 -1.3586E+03 -5.2850E+02  1.9645E-01 -2.2960E-01  0.0000E+00  8.9709E-07  6.5328E-07  1.2972E-09  3.2660E-13
320685  6.0312E+02 -1.5801E+03 -1.3612E+03 -5.1784E+02  2.6104E-02 -6.6751E-03  3.4592E-02 -1.4556E+03 -1.4936E+03 -5.1784E+02  2.2292E-01 -2.3515E-01  3.4592E-02  8.9959E-07  6.3613E-07  1.2972E-09  3.2083E-13
320687  0.0000E+00 -1.5591E+03 -1.3560E+03 -5.4771E+02  0.0000E+00 -0.0000E+00  0.0000E+00 -1.5591E+03 -1.3560E+03 -5.4771E+02  1.9606E-01 -2.2543E-01  0.0000E+00  8.9962E-07  5.4767E-07  1.2972E-09  3.2372E-13
320688  0.0000E+00 -1.5991E+03 -1.3470E+03 -5.6360E+02 -0.0000E+00 -0.0000E+00 -0.0000E+00 -1.5991E+03 -1.3470E+03 -5.6360E+02  1.9476E-01 -2.3122E-01  0.0000E+00  8.8946E-07  6.6602E-07  1.2972E-09  3.2866E-13
320688  6.0352E+02 -1.5963E+03 -1.3498E+03 -5.5339E+02  9.8424E-03 -1.0827E-02  3.3465E-02 -1.4726E+03 -1.4837E+03 -5.5339E+02  2.0501E-01 -2.4164E-01  3.3465E-02  8.9709E-07  7.1520E-07  1.2972E-09  3.2369E-13
320722  0.0000E+00 -1.8953E+03 -9.9958E+02 -4.6974E+02 -0.0000E+00 -0.0000E+00 -0.0000E+00 -1.8953E+03 -9.9958E+02 -4.6974E+02  1.4453E-01 -2.7405E-01  0.0000E+00  9.2985E-07  7.5942E-07  1.2972E-09  3.3542E-13
320722  6.0977E+02 -1.8912E+03 -1.0080E+03 -4.6349E+02  1.2848E-02 -2.6808E-02  2.0291E-02 -1.7951E+03 -1.1706E+03 -4.6349E+02  1.5859E-01 -3.0026E-01  2.0291E-02  9.2622E-07  6.8094E-07  1.2972E-09  3.3501E-13
320722  1.2132E+03 -1.8799E+03 -1.0300E+03 -4.4530E+02  2.2516E-02 -4.5204E-02  3.8339E-02 -1.6713E+03 -1.3422E+03 -4.4530E+02  1.7144E-01 -3.1702E-01  3.8339E-02  9.2622E-07  6.9613E-07  1.2972E-09  3.3190E-13
320725  0.0000E+00 -2.0236E+03 -1.1713E+03 -2.4018E+02  0.0000E+00 -0.0000E+00 -0.0000E+00 -2.0236E+03 -1.1713E+03 -2.4018E+02  1.6936E-01 -2.9260E-01  0.0000E+00  8.7575E-07  5.4944E-07  1.2972E-09  3.5475E-13
320769  0.0000E+00 -1.7482E+03 -1.3918E+03 -4.2567E+02 -0.0000E+00 -0.0000E+00 -0.0000E+00 -1.7482E+03 -1.3918E+03 -4.2567E+02  2.0125E-01 -2.5278E-01  0.0000E+00  8.7332E-07  6.7545E-07  1.2972E-09  3.4448E-13
320769  6.0001E+02 -1.7540E+03 -1.3880E+03 -4.2138E+02 -1.8784E-02  1.5802E-02  1.3288E-02 -1.6271E+03 -1.5348E+03 -4.2138E+02  1.8191E-01 -2.3781E-01  1.3288E-02  8.7332E-07  6.2331E-07  1.2972E-09  3.4075E-13
320772  0.0000E+00 -1.7222E+03 -1.4424E+03 -3.5885E+02 -0.0000E+00 -0.0000E+00 -0.0000E+00 -1.7222E+03 -1.4424E+03 -3.5885E+02  2.0855E-01 -2.4902E-01  0.0000E+00  8.6343E-07  7.1250E-07  1.2972E-09  3.4239E-13
320772  6.1072E+02 -1.7201E+03 -1.4450E+03 -3.5756E+02  6.6696E-03 -8.7327E-03  4.2081E-03 -1.5860E+03 -1.5910E+03 -3.5756E+02  2.1560E-01 -2.5744E-01  4.2081E-03  8.6343E-07  7.1249E-07  1.2972E-09  3.3761E-13
320772  1.2157E+03 -1.7113E+03 -1.4529E+03 -3.5204E+02  2.4620E-02 -1.6782E-02  1.4081E-02 -1.4309E+03 -1.7298E+03 -3.5204E+02  2.3470E-01 -2.6422E-01  1.4081E-02  8.6343E-07  6.3324E-07  1.2972E-09  3.3032E-13
320772  1.8141E+03 -1.6890E+03 -1.4639E+03 -3.3768E+02  5.0427E-02 -1.6657E-02  3.4355E-02 -1.2517E+03 -1.8518E+03 -3.3768E+02  2.6210E-01 -2.6088E-01  3.4355E-02  8.4784E-07  4.9822E-07  1.2972E-09  3.1928E-13
320772  2.4153E+03 -1.6505E+03 -1.4728E+03 -3.1125E+02  7.7799E-02 -1.4049E-02  5.3806E-02 -1.0469E+03 -1.9486E+03 -3.1125E+02  2.9075E-01 -2.5269E-01  5.3806E-02  8.5642E-07  5.3020E-07  1.2972E-09  3.0367E-13
320772  3.0209E+03 -1.5948E+03 -1.4809E+03 -2.7269E+02  1.0495E-01 -1.2449E-02  7.2977E-02 -8.1856E+02 -2.0165E+03 -2.7269E+02  3.1907E-01 -2.4304E-01  7.2977E-02  8.6465E-07  5.1104E-07  1.2972E-09  2.8369E-13
320772  3.6144E+03 -1.5268E+03 -1.4898E+03 -2.2434E+02  1.2273E-01 -1.9305E-02  9.0219E-02 -5.7941E+02 -2.0531E+03 -2.2434E+02  3.3814E-01 -2.4007E-01  9.0219E-02  8.4068E-07  5.4343E-07  1.2972E-09  2.6097E-13
320772  4.2164E+03 -1.4497E+03 -1.5034E+03 -1.6515E+02  1.3200E-01 -2.4694E-02  1.0628E-01 -3.2768E+02 -2.0626E+03 -1.6515E+02  3.4938E-01 -2.3431E-01  1.0628E-01  8.4720E-07  4.8243E-07  1.2972E-09  2.3626E-13
320772  4.8173E+03 -1.3677E+03 -1.5134E+03 -9.8616E+01  1.4161E-01 -7.3607E-03  1.1069E-01 -7.8145E+01 -2.0383E+03 -9.8616E+01  3.6043E-01 -2.0511E-01  1.1069E-01  8.3680E-07  3.9576E-07  1.2972E-09  2.1117E-13
320772  5.4144E+03 -1.2812E+03 -1.5167E+03 -3.5383E+01  1.4607E-01 -8.8102E-03  1.0117E-01  1.6155E+02 -1.9788E+03 -3.5383E+01  3.6538E-01 -1.9406E-01  1.0117E-01  8.0746E-07  5.8456E-07  1.2972E-09  1.8732E-13
320772  6.0061E+03 -1.1958E+03 -1.5281E+03  2.0856E+01  1.4073E-01 -3.1406E-02  8.7226E-02  3.9387E+02 -1.9000E+03  2.0856E+01  3.6167E-01 -2.0431E-01  8.7226E-02  8.0576E-07  6.7677E-07  1.2972E-09  1.6730E-13
320772  6.6005E+03 -1.1155E+03 -1.5554E+03  6.6802E+01  1.2979E-01 -6.1120E-02  6.7491E-02  6.2430E+02 -1.8094E+03  6.6802E+01  3.5469E-01 -2.2240E-01  6.7491E-02  7.8051E-07  6.6075E-07  1.2972E-09  1.5329E-13
320772  7.2039E+03 -1.0396E+03 -1.5985E+03  1.0312E+02  1.2289E-01 -7.6283E-02  5.5122E-02  8.5503E+02 -1.7043E+03  1.0312E+02  3.5402E-01 -2.2660E-01  5.5122E-02  7.5335E-07  4.4579E-07  1.2972E-09  1.4696E-13
320772  7.8272E+03 -9.6481E+02 -1.6447E+03  1.3626E+02  1.1678E-01 -6.9592E-02  5.2032E-02  1.0786E+03 -1.5724E+03  1.3626E+02  3.5460E-01 -2.0910E-01  5.2032E-02  6.9633E-07  2.9693E-07  1.2972E-09  1.4880E-13
320772  8.4058E+03 -8.9926E+02 -1.6805E+03  1.6576E+02  1.0961E-01 -5.3021E-02  4.9829E-02  1.2626E+03 -1.4278E+03  1.6576E+02  3.5261E-01 -1.8305E-01  4.9829E-02  6.6687E-07  2.0611E-07  1.2972E-09  1.5682E-13
320772  9.0503E+03 -8.3146E+02 -1.7068E+03  1.9602E+02  1.0082E-01 -2.8025E-02  4.3668E-02  1.4330E+03 -1.2455E+03  1.9602E+02  3.4761E-01 -1.4825E-01  4.3668E-02  6.3911E-07  1.5973E-07  1.2972E-09  1.7006E-13
320772  9.6410E+03 -7.7428E+02 -1.7152E+03  2.1908E+02  9.3053E-02  2.3388E-04  3.4059E-02  1.5523E+03 -1.0639E+03  2.1908E+02  3.4106E-01 -1.1172E-01  3.4059E-02  6.3248E-07  1.2293E-07  1.2972E-09  1.8345E-13
320772  1.0213E+04 -7.2276E+02 -1.7068E+03  2.3555E+02  8.7178E-02  2.9039E-02  2.3399E-02  1.6314E+03 -8.7983E+02  2.3555E+02  3.3396E-01 -7.5465E-02  2.3399E-02  6.2107E-07  1.3069E-07  1.2972E-09  1.9544E-13
320772  1.0833E+04 -6.7007E+02 -1.6790E+03  2.4654E+02  8.3233E-02  6.1120E-02  1.2081E-02  1.6760E+03 -6.7751E+02  2.4654E+02  3.2600E-01 -3.5767E-02  1.2081E-02  6.2780E-07  1.4069E-07  1.2972E-09  2.0586E-13
320772  1.1419E+04 -6.2160E+02 -1.6339E+03  2.5055E+02  8.3114E-02  9.3140E-02  1.5196E-03  1.6785E+03 -4.8864E+02  2.5055E+02  3.1937E-01  3.2628E-03  1.5196E-03  6.5170E-07  1.3713E-07  1.2972E-09  2.1219E-13
320772  1.2019E+04 -5.7039E+02 -1.5674E+03  2.4786E+02  8.7894E-02  1.2844E-01 -1.0416E-02  1.6404E+03 -3.0177E+02  2.4786E+02  3.1452E-01  4.5968E-02 -1.0416E-02  6.6954E-07  1.6315E-07  1.2972E-09  2.1428E-13
320772  1.2618E+04 -5.1536E+02 -1.4798E+03  2.3789E+02  9.6745E-02  1.6462E-01 -2.3482E-02  1.5618E+03 -1.2760E+02  2.3789E+02  3.1072E-01  9.0104E-02 -2.3482E-02  6.9753E-07  1.5775E-07  1.2972E-09  2.1129E-13
320772  1.3222E+04 -4.5302E+02 -1.3686E+03  2.1893E+02  1.1034E-01  2.0375E-01 -3.9581E-02  1.4413E+03  3.0838E+01  2.1893E+02  3.0824E-01  1.3825E-01 -3.9581E-02  7.2582E-07  1.7099E-07  1.2972E-09  2.0252E-13
320772  1.3801E+04 -3.8431E+02 -1.2395E+03  1.9104E+02  1.2813E-01  2.4292E-01 -5.7466E-02  1.2878E+03  1.6050E+02  1.9104E+02  3.0735E-01  1.8736E-01 -5.7466E-02  7.7566E-07  1.7233E-07  1.2972E-09  1.8821E-13
320772  1.4413E+04 -2.9858E+02 -1.0781E+03  1.4933E+02  1.5297E-01  2.8407E-01 -7.8777E-02  1.0858E+03  2.6916E+02  1.4933E+02  3.0885E-01  2.4090E-01 -7.8777E-02  8.0980E-07  2.1869E-07  1.2972E-09  1.6637E-13
320772  1.5005E+04 -1.9853E+02 -8.9927E+02  9.7170E+01  1.8804E-01  3.1989E-01 -9.6775E-02  8.5472E+02  3.4285E+02  9.7170E+01  3.1807E-01  2.9118E-01 -9.6775E-02  8.7572E-07  2.8432E-07  1.2972E-09  1.3882E-13
320786  0.0000E+00 -9.9329E+02 -8.2515E+02 -1.1324E+03 -0.0000E+00 -0.0000E+00 -0.0000E+00 -9.9329E+02 -8.2515E+02 -1.1324E+03  1.1931E-01 -1.4362E-01  0.0000E+00  9.7028E-07  6.7033E-07  1.2972E-09  2.4617E-13
320786  6.1049E+02 -9.8831E+02 -8.3051E+02 -1.1124E+03  1.6243E-02 -1.7121E-02  6.6824E-02 -9.1125E+02 -9.1441E+02 -1.1124E+03  1.3633E-01 -1.6002E-01  6.6824E-02  9.8244E-07  6.5407E-07  1.2972E-09  2.4210E-13
320792  0.0000E+00 -1.1880E+03 -9.2767E+02 -8.9620E+02 -0.0000E+00 -0.0000E+00 -0.0000E+00 -1.1880E+03 -9.2767E+02 -8.9620E+02  1.3413E-01 -1.7177E-01  0.0000E+00  9.6729E-07  6.4027E-07  1.2972E-09  2.6292E-13
320796  0.0000E+00 -1.9025E+03 -9.9393E+02 -4.7524E+02 -0.0000E+00 -0.0000E+00 -0.0000E+00 -1.9025E+03 -9.9393E+02 -4.7524E+02  1.4371E-01 -2.7508E-01  0.0000E+00  9.2985E-07  6.9632E-07  1.2972E-09  3.3617E-13
320796  6.0178E+02 -1.8996E+03 -9.9840E+02 -4.6829E+02  1.0617E-02 -1.6696E-02  2.1347E-02 -1.8056E+03 -1.1597E+03 -4.6829E+02  1.5498E-01 -2.9136E-01  2.1347E-02  9.2985E-07  7.5073E-07  1.2972E-09  3.3573E-13
320796  1.2253E+03 -1.8889E+03 -1.0167E+03 -4.4895E+02  2.2924E-02 -4.0025E-02  4.0761E-02 -1.6802E+03 -1.3336E+03 -4.4895E+02  1.6992E-01 -3.1315E-01  4.0761E-02  9.2622E-07  7.0905E-07  1.2972E-09  3.3249E-13
320803  0.0000E+00 -1.6206E+03 -1.0250E+03 -6.6004E+02 -0.0000E+00 -0.0000E+00 -0.0000E+00 -1.6206E+03 -1.0250E+03 -6.6004E+02  1.4820E-01 -2.3432E-01  0.0000E+00  9.5246E-07  7.2345E-07  1.2972E-09  3.1125E-13
320821  0.0000E+00 -1.1881E+03 -8.4317E+02 -9.9617E+02 -0.0000E+00 -0.0000E+00  0.0000E+00 -1.1881E+03 -8.4317E+02 -9.9617E+02  1.2192E-01 -1.7178E-01  0.0000E+00  9.7118E-07  7.0460E-07  1.2972E-09  2.6236E-13
320821  6.0978E+02 -1.1907E+03 -8.4962E+02 -9.7045E+02 -9.8026E-03 -2.1447E-02  8.1250E-02 -1.1113E+03 -9.5117E+02 -9.7045E+02  1.1305E-01 -1.9361E-01  8.1250E-02  9.6286E-07  7.0806E-07  1.2972E-09  2.5972E-13
320825  0.0000E+00 -1.9197E+03 -8.3877E+02 -5.8898E+02 -0.0000E+00 -0.0000E+00 -0.0000E+00 -1.9197E+03 -8.3877E+02 -5.8898E+02  1.2128E-01 -2.7757E-01  0.0000E+00  9.2720E-07  6.1197E-07  1.2972E-09  3.3255E-13
320825  6.0383E+02 -1.9051E+03 -8.4658E+02 -5.8303E+02  4.7179E-02 -2.6964E-02  1.9848E-02 -1.8241E+03 -1.0095E+03 -5.8303E+02  1.6959E-01 -3.0243E-01  1.9848E-02  9.3222E-07  5.9215E-07  1.2972E-09  3.3217E-13
320898  0.0000E+00 -1.7773E+03 -9.9309E+02 -5.6878E+02 -0.0000E+00 -0.0000E+00 -0.0000E+00 -1.7773E+03 -9.9309E+02 -5.6878E+02  1.4359E-01 -2.5698E-01  0.0000E+00  9.4332E-07  7.0034E-07  1.2972E-09  3.2437E-13
320914  0.0000E+00 -1.6234E+03 -9.1549E+02 -8.2904E+02 -0.0000E+00 -0.0000E+00 -0.0000E+00 -1.6234E+03 -9.1549E+02 -8.2904E+02  1.3237E-01 -2.3473E-01  0.0000E+00  9.1703E-07  6.3424E-07  1.2972E-09  3.1207E-13
320914  6.0647E+02 -1.6255E+03 -9.1709E+02 -8.1375E+02 -6.8778E-03 -5.8939E-03  5.2876E-02 -1.5389E+03 -1.0559E+03 -8.1375E+02  1.2572E-01 -2.4092E-01  5.2876E-02  9.4110E-07  6.3627E-07  1.2972E-09  3.1105E-13
320931  0.0000E+00 -1.4606E+03 -6.9839E+02 -1.0455E+03 -0.0000E+00 -0.0000E+00 -0.0000E+00 -1.4606E+03 -6.9839E+02 -1.0455E+03  1.0098E-01 -2.1118E-01  0.0000E+00  9.6486E-07  7.0332E-07  1.2972E-09  2.8826E-13
320995  0.0000E+00 -1.9644E+03 -1.0325E+03 -3.8870E+02  0.0000E+00 -0.0000E+00 -0.0000E+00 -1.9644E+03 -1.0325E+03 -3.8870E+02  1.4930E-01 -2.8404E-01  0.0000E+00  9.0037E-07  4.3399E-07  1.2972E-09  3.4314E-13
