id t x y z vx vy vz xi yi zi vxi vyi vzi FGrav FDrag FSol FTide
128062  0.0000E+00 -4.5763E+02 -1.2996E+03 -3.5641E+02 -0.0000E+00 -0.0000E+00 -0.0000E+00 -4.5763E+02 -1.2996E+03 -3.5641E+02  1.8791E-01 -6.6170E-02  0.0000E+00  9.1880E-07  7.5213E-07  1.2972E-09  1.8316E-13
128062  6.0347E+02 -4.7114E+02 -1.2958E+03 -3.5724E+02 -4.4102E-02  1.2417E-02 -2.2430E-03 -3.5642E+02 -1.3319E+03 -3.5724E+02  1.4326E-01 -5.5705E-02 -2.2430E-03  9.2642E-07  8.0124E-07  1.2972E-09  1.7607E-13
128170  0.0000E+00 -4.5250E+02 -1.2964E+03 -4.0365E+02 -0.0000E+00 -0.0000E+00 -0.0000E+00 -4.5250E+02 -1.2964E+03 -4.0365E+02  1.8745E-01 -6.5428E-02  0.0000E+00  9.1927E-07  6.9747E-07  1.2972E-09  1.8449E-13
128170  6.0615E+02 -4.6580E+02 -1.2909E+03 -3.9887E+02 -4.4525E-02  1.8906E-02  1.4023E-02 -3.5102E+02 -1.3267E+03 -3.9887E+02  1.4213E-01 -4.8445E-02  1.4023E-02  9.2959E-07  7.6604E-07  1.2972E-09  1.7694E-13
128212  0.0000E+00 -4.4158E+02 -1.2844E+03 -5.1571E+02 -0.0000E+00 -0.0000E+00 -0.0000E+00 -4.4158E+02 -1.2844E+03 -5.1571E+02  1.8572E-01 -6.3849E-02  0.0000E+00  9.2188E-07  6.8904E-07  1.2972E-09  1.8765E-13
128212  6.0237E+02 -4.5686E+02 -1.2745E+03 -5.1746E+02 -4.8158E-02  3.5964E-02 -5.3268E-03 -3.4426E+02 -1.3094E+03 -5.1746E+02  1.3613E-01 -3.0093E-02 -5.3268E-03  9.3564E-07  5.3549E-07  1.2972E-09  1.8034E-13
128293  0.0000E+00 -3.2207E+02 -1.1481E+03 -6.3484E+02 -0.0000E+00 -0.0000E+00 -0.0000E+00 -3.2207E+02 -1.1481E+03 -6.3484E+02  1.6601E-01 -4.6568E-02  0.0000E+00  9.4186E-07  7.4456E-07  1.2972E-09  1.6958E-13
128363  0.0000E+00 -4.5898E+02 -1.2800E+03 -4.9280E+02 -0.0000E+00 -0.0000E+00 -0.0000E+00 -4.5898E+02 -1.2800E+03 -4.9280E+02  1.8507E-01 -6.6365E-02  0.0000E+00  9.2298E-07  7.4072E-07  1.2972E-09  1.8789E-13
128459  0.0000E+00 -4.5494E+02 -1.2970E+03 -3.7997E+02 -0.0000E+00 -0.0000E+00 -0.0000E+00 -4.5494E+02 -1.2970E+03 -3.7997E+02  1.8753E-01 -6.5781E-02  0.0000E+00  9.1927E-07  7.4769E-07  1.2972E-09  1.8370E-13
128459  6.0460E+02 -4.6792E+02 -1.2936E+03 -3.7596E+02 -4.3012E-02  1.3424E-02  1.2245E-02 -3.5319E+02 -1.3295E+03 -3.7596E+02  1.4403E-01 -5.4234E-02  1.2245E-02  9.2959E-07  7.4697E-07  1.2972E-09  1.7637E-13
128516  0.0000E+00 -4.2423E+02 -1.2479E+03 -5.5951E+02 -0.0000E+00 -0.0000E+00 -0.0000E+00 -4.2423E+02 -1.2479E+03 -5.5951E+02  1.8044E-01 -6.1340E-02  0.0000E+00  9.2642E-07  6.6992E-07  1.2972E-09  1.8478E-13
128554  0.0000E+00 -4.4840E+02 -1.2908E+03 -4.8510E+02 -0.0000E+00 -0.0000E+00  0.0000E+00 -4.4840E+02 -1.2908E+03 -4.8510E+02  1.8663E-01 -6.4834E-02  0.0000E+00  9.2298E-07  7.1383E-07  1.2972E-09  1.8742E-13
128554  6.1267E+02 -4.6541E+02 -1.2836E+03 -4.7900E+02 -5.2080E-02  2.4374E-02  1.8439E-02 -3.5002E+02 -1.3198E+03 -4.7900E+02  1.3352E-01 -4.2921E-02  1.8439E-02  9.2884E-07  7.1053E-07  1.2972E-09  1.7997E-13
128678  0.0000E+00 -4.3724E+02 -1.2952E+03 -4.5172E+02 -0.0000E+00 -0.0000E+00 -0.0000E+00 -4.3724E+02 -1.2952E+03 -4.5172E+02  1.8728E-01 -6.3222E-02  0.0000E+00  9.2198E-07  7.3274E-07  1.2972E-09  1.8508E-13
128678  6.0970E+02 -4.5343E+02 -1.2903E+03 -4.4416E+02 -5.2464E-02  1.7103E-02  2.1554E-02 -3.3806E+02 -1.3252E+03 -4.4416E+02  1.3411E-01 -4.8459E-02  2.1554E-02  9.2198E-07  7.2147E-07  1.2972E-09  1.7765E-13
128806  0.0000E+00 -4.6050E+02 -1.2961E+03 -3.6510E+02 -0.0000E+00 -0.0000E+00 -0.0000E+00 -4.6050E+02 -1.2961E+03 -3.6510E+02  1.8741E-01 -6.6584E-02  0.0000E+00  9.1880E-07  7.5302E-07  1.2972E-09  1.8352E-13
128806  6.1432E+02 -4.7695E+02 -1.2907E+03 -3.6486E+02 -5.0796E-02  1.9901E-02  2.5283E-03 -3.6057E+02 -1.3279E+03 -3.6486E+02  1.3583E-01 -4.9062E-02  2.5283E-03  9.2642E-07  6.8900E-07  1.2972E-09  1.7644E-13
128868  0.0000E+00 -4.5848E+02 -1.2870E+03 -4.2620E+02 -0.0000E+00 -0.0000E+00 -0.0000E+00 -4.5848E+02 -1.2870E+03 -4.2620E+02  1.8609E-01 -6.6293E-02  0.0000E+00  9.1996E-07  7.4919E-07  1.2972E-09  1.8529E-13
128868  6.1798E+02 -4.7687E+02 -1.2808E+03 -4.2252E+02 -5.1726E-02  2.1286E-02  1.3829E-02 -3.6067E+02 -1.3183E+03 -4.2252E+02  1.3347E-01 -4.7665E-02  1.3829E-02  9.3119E-07  6.8147E-07  1.2972E-09  1.7819E-13
128996  0.0000E+00 -3.1889E+02 -1.1481E+03 -6.4459E+02 -0.0000E+00 -0.0000E+00 -0.0000E+00 -3.1889E+02 -1.1481E+03 -6.4459E+02  1.6600E-01 -4.6108E-02  0.0000E+00  9.4186E-07  7.3527E-07  1.2972E-09  1.6980E-13
128996  6.0141E+02 -3.3284E+02 -1.1440E+03 -6.3903E+02 -4.5028E-02  1.4482E-02  1.9200E-02 -2.3222E+02 -1.1686E+03 -6.3903E+02  1.2039E-01 -3.3644E-02  1.9200E-02  9.4186E-07  7.0571E-07  1.2972E-09  1.6309E-13
