id t x y z vx vy vz xi yi zi vxi vyi vzi FGrav FDrag FSol FTide
160003  0.0000E+00  1.6151E+03 -1.1159E+03  1.0163E+03 -0.0000E+00 -0.0000E+00  0.0000E+00  1.6151E+03 -1.1159E+03  1.0163E+03  1.6136E-01  2.3352E-01  0.0000E+00  8.9163E-07  6.2441E-07  1.2972E-09  2.2550E-13
160003  6.0262E+02  1.5979E+03 -1.1200E+03  9.9667E+02 -5.6466E-02 -5.0328E-03 -6.4525E-02  1.6893E+03 -9.7673E+02  9.9667E+02  1.0548E-01  2.2601E-01 -6.4525E-02  9.0572E-07  4.0490E-07  1.2972E-09  2.3534E-13
160047  0.0000E+00  9.5112E+02 -8.8833E+02  1.0026E+03 -0.0000E+00 -0.0000E+00  0.0000E+00  9.5112E+02 -8.8833E+02  1.0026E+03  1.2844E-01  1.3752E-01  0.0000E+00  8.3714E-07  6.4315E-07  1.2972E-09  1.5474E-13
160047  6.1094E+02  9.4144E+02 -8.8873E+02  9.7806E+02 -2.7597E-02  1.6028E-03 -8.0915E-02  1.0162E+03 -8.0221E+02  9.7806E+02  1.0091E-01  1.3773E-01 -8.0915E-02  8.2884E-07  4.7839E-07  1.2972E-09  1.6048E-13
160065  0.0000E+00  1.1125E+03 -1.6072E+03  5.2664E+02 -0.0000E+00 -0.0000E+00  0.0000E+00  1.1125E+03 -1.6072E+03  5.2664E+02  2.3238E-01  1.6086E-01  0.0000E+00  8.3196E-07  6.8643E-07  1.2972E-09  1.6104E-13
160065  6.1101E+02  1.0968E+03 -1.5991E+03  5.1559E+02 -4.9329E-02  2.7996E-02 -3.5796E-02  1.2336E+03 -1.4961E+03  5.1559E+02  1.8189E-01  1.8659E-01 -3.5796E-02  8.4986E-07  6.9806E-07  1.2972E-09  1.6604E-13
160065  1.2001E+03  1.0566E+03 -1.5726E+03  4.8664E+02 -8.1320E-02  6.1783E-02 -5.7127E-02  1.3122E+03 -1.3665E+03  4.8664E+02  1.4606E-01  2.1456E-01 -5.7127E-02  8.6403E-07  6.1761E-07  1.2972E-09  1.6901E-13
160077  0.0000E+00  1.1322E+03 -1.2709E+03  9.7476E+02 -0.0000E+00 -0.0000E+00  0.0000E+00  1.1322E+03 -1.2709E+03  9.7476E+02  1.8376E-01  1.6371E-01  0.0000E+00  8.3306E-07  4.5286E-07  1.2972E-09  1.7250E-13
160082  0.0000E+00  1.1536E+03 -1.6528E+03  4.9649E+02 -0.0000E+00 -0.0000E+00 -0.0000E+00  1.1536E+03 -1.6528E+03  4.9649E+02  2.3897E-01  1.6681E-01 -0.0000E+00  8.2628E-07  6.6152E-07  1.2972E-09  1.6495E-13
160082  6.1599E+02  1.1363E+03 -1.6386E+03  4.8028E+02 -5.2934E-02  4.5153E-02 -4.8244E-02  1.2775E+03 -1.5311E+03  4.8028E+02  1.8400E-01  2.0945E-01 -4.8244E-02  8.2987E-07  6.7797E-07  1.2972E-09  1.6964E-13
160082  1.2127E+03  1.0917E+03 -1.6040E+03  4.4222E+02 -9.2037E-02  6.9582E-02 -7.5226E-02  1.3548E+03 -1.3890E+03  4.4222E+02  1.3989E-01  2.2744E-01 -7.5226E-02  8.6293E-07  6.8568E-07  1.2972E-09  1.7197E-13
160117  0.0000E+00  1.1932E+03 -1.4210E+03  1.0138E+03 -0.0000E+00 -0.0000E+00 -0.0000E+00  1.1932E+03 -1.4210E+03  1.0138E+03  2.0546E-01  1.7253E-01 -0.0000E+00  7.8219E-07  5.6911E-07  1.2972E-09  1.8231E-13
160117  6.0718E+02  1.1799E+03 -1.4184E+03  9.8912E+02 -4.0123E-02  1.1892E-02 -7.8759E-02  1.2998E+03 -1.3095E+03  9.8912E+02  1.6497E-01  1.8250E-01 -7.8759E-02  7.8146E-07  4.7444E-07  1.2972E-09  1.8963E-13
160117  1.2117E+03  1.1449E+03 -1.4064E+03  9.2421E+02 -7.8324E-02  2.8439E-02 -1.3207E-01  1.3725E+03 -1.1853E+03  9.2421E+02  1.2503E-01  1.9398E-01 -1.3207E-01  8.0403E-07  5.8702E-07  1.2972E-09  1.9328E-13
160134  0.0000E+00  1.2148E+03 -1.6699E+03  7.7633E+02  0.0000E+00 -0.0000E+00 -0.0000E+00  1.2148E+03 -1.6699E+03  7.7633E+02  2.4145E-01  1.7564E-01 -0.0000E+00  7.3499E-07  4.0933E-07  1.2972E-09  1.7961E-13
160134  6.0067E+02  1.2177E+03 -1.6668E+03  7.5680E+02  1.0671E-02  8.6454E-03 -6.4622E-02  1.3577E+03 -1.5549E+03  7.5680E+02  2.5168E-01  1.8471E-01 -6.4622E-02  7.5623E-07  4.1737E-07  1.2972E-09  1.8759E-13
160134  1.2087E+03  1.2269E+03 -1.6608E+03  7.0165E+02  9.9413E-03  2.6881E-03 -1.1629E-01  1.4969E+03 -1.4222E+03  7.0165E+02  2.5007E-01  1.8008E-01 -1.1629E-01  8.1176E-07  6.2077E-07  1.2972E-09  1.9665E-13
160144  0.0000E+00  1.1616E+03 -1.6855E+03  5.1793E+02 -0.0000E+00 -0.0000E+00 -0.0000E+00  1.1616E+03 -1.6855E+03  5.1793E+02  2.4372E-01  1.6796E-01 -0.0000E+00  8.2097E-07  5.4428E-07  1.2972E-09  1.6753E-13
160144  6.0585E+02  1.1469E+03 -1.6712E+03  5.0335E+02 -4.7572E-02  4.8026E-02 -4.6737E-02  1.2887E+03 -1.5644E+03  5.0335E+02  1.9406E-01  2.1386E-01 -4.6737E-02  8.0687E-07  6.0004E-07  1.2972E-09  1.7233E-13
160144  1.2200E+03  1.1037E+03 -1.6307E+03  4.6411E+02 -9.2955E-02  7.8438E-02 -7.8676E-02  1.3728E+03 -1.4117E+03  4.6411E+02  1.4283E-01  2.3803E-01 -7.8676E-02  8.5071E-07  8.5428E-07  1.2972E-09  1.7488E-13
160174  0.0000E+00  1.2079E+03 -1.6733E+03  7.8595E+02 -0.0000E+00 -0.0000E+00 -0.0000E+00  1.2079E+03 -1.6733E+03  7.8595E+02  2.4195E-01  1.7465E-01 -0.0000E+00  7.3499E-07  6.2735E-07  1.2972E-09  1.7958E-13
160174  6.1543E+02  1.1980E+03 -1.6748E+03  7.6923E+02 -2.9164E-02  1.5483E-03 -5.4390E-02  1.3421E+03 -1.5617E+03  7.6923E+02  2.1299E-01  1.7476E-01 -5.4390E-02  7.3499E-07  4.2932E-07  1.2972E-09  1.8685E-13
160174  1.2086E+03  1.1741E+03 -1.6674E+03  7.2362E+02 -5.1215E-02  2.5978E-02 -9.6910E-02  1.4461E+03 -1.4379E+03  7.2362E+02  1.8988E-01  1.9574E-01 -9.6910E-02  7.5216E-07  4.3455E-07  1.2972E-09  1.9263E-13
160174  1.8109E+03  1.1359E+03 -1.6388E+03  6.5633E+02 -7.9032E-02  7.0501E-02 -1.2504E-01  1.5214E+03 -1.2889E+03  6.5633E+02  1.5793E-01  2.3475E-01 -1.2504E-01  7.8819E-07  5.0681E-07  1.2972E-09  1.9647E-13
160174  2.4039E+03  1.0820E+03 -1.5794E+03  5.7374E+02 -9.9085E-02  1.2784E-01 -1.5153E-01  1.5553E+03 -1.1164E+03  5.7374E+02  1.2928E-01  2.8429E-01 -1.5153E-01  8.3183E-07  5.5215E-07  1.2972E-09  1.9699E-13
160175  0.0000E+00  1.1706E+03 -1.6539E+03  6.8572E+02 -0.0000E+00 -0.0000E+00  0.0000E+00  1.1706E+03 -1.6539E+03  6.8572E+02  2.3914E-01  1.6925E-01  0.0000E+00  7.9308E-07  4.7142E-07  1.2972E-09  1.7232E-13
160175  6.0782E+02  1.1578E+03 -1.6412E+03  6.7620E+02 -4.2647E-02  4.0299E-02 -2.9621E-02  1.2974E+03 -1.5333E+03  6.7620E+02  1.9466E-01  2.0770E-01 -2.9621E-02  7.9308E-07  5.5571E-07  1.2972E-09  1.7844E-13
160175  1.2028E+03  1.1212E+03 -1.6030E+03  6.5082E+02 -7.5418E-02  9.3595E-02 -5.7492E-02  1.3817E+03 -1.3848E+03  6.5082E+02  1.5637E-01  2.5572E-01 -5.7492E-02  8.0731E-07  4.2866E-07  1.2972E-09  1.8248E-13
160175  1.8073E+03  1.0708E+03 -1.5293E+03  6.0901E+02 -9.1379E-02  1.4641E-01 -7.8550E-02  1.4295E+03 -1.2007E+03  6.0901E+02  1.2974E-01  3.0124E-01 -7.8550E-02  8.5617E-07  5.9372E-07  1.2972E-09  1.8425E-13
160242  0.0000E+00  1.1368E+03 -1.6300E+03  5.8017E+02 -0.0000E+00 -0.0000E+00  0.0000E+00  1.1368E+03 -1.6300E+03  5.8017E+02  2.3569E-01  1.6438E-01  0.0000E+00  8.2685E-07  5.0068E-07  1.2972E-09  1.6536E-13
160242  6.1232E+02  1.1239E+03 -1.6123E+03  5.7142E+02 -3.8516E-02  5.9791E-02 -2.8724E-02  1.2620E+03 -1.5066E+03  5.7142E+02  1.9461E-01  2.2229E-01 -2.8724E-02  8.2106E-07  4.5959E-07  1.2972E-09  1.7072E-13
160257  0.0000E+00  1.1956E+03 -1.6585E+03  7.4883E+02 -0.0000E+00 -0.0000E+00 -0.0000E+00  1.1956E+03 -1.6585E+03  7.4883E+02  2.3981E-01  1.7288E-01 -0.0000E+00  7.7650E-07  6.4584E-07  1.2972E-09  1.7670E-13
160257  6.0814E+02  1.1832E+03 -1.6580E+03  7.3123E+02 -4.0346E-02  6.7281E-03 -5.5033E-02  1.3242E+03 -1.5477E+03  7.3123E+02  1.9938E-01  1.7780E-01 -5.5033E-02  7.7926E-07  4.9552E-07  1.2972E-09  1.8337E-13
160257  1.2049E+03  1.1519E+03 -1.6424E+03  6.8894E+02 -6.8962E-02  4.8926E-02 -8.4037E-02  1.4191E+03 -1.4178E+03  6.8894E+02  1.6851E-01  2.1548E-01 -8.4037E-02  7.7432E-07  5.2924E-07  1.2972E-09  1.8822E-13
160257  1.8055E+03  1.1015E+03 -1.5961E+03  6.3051E+02 -9.3944E-02  1.0776E-01 -1.1059E-01  1.4761E+03 -1.2578E+03  6.3051E+02  1.3685E-01  2.6702E-01 -1.1059E-01  8.1790E-07  5.0431E-07  1.2972E-09  1.9037E-13
160274  0.0000E+00  1.1176E+03 -1.6135E+03  5.3153E+02 -0.0000E+00 -0.0000E+00 -0.0000E+00  1.1176E+03 -1.6135E+03  5.3153E+02  2.3329E-01  1.6160E-01 -0.0000E+00  8.3196E-07  6.1496E-07  1.2972E-09  1.6181E-13
160274  6.0980E+02  1.1024E+03 -1.6024E+03  5.2195E+02 -4.8434E-02  3.5480E-02 -3.1940E-02  1.2392E+03 -1.4991E+03  5.2195E+02  1.8326E-01  1.9488E-01 -3.1940E-02  8.4986E-07  6.0767E-07  1.2972E-09  1.6682E-13
160274  1.2114E+03  1.0616E+03 -1.5706E+03  4.9392E+02 -8.3343E-02  7.0818E-02 -5.6974E-02  1.3191E+03 -1.3616E+03  4.9392E+02  1.4375E-01  2.2432E-01 -5.6974E-02  8.6403E-07  5.2527E-07  1.2972E-09  1.6984E-13
160291  0.0000E+00  1.1734E+03 -1.6322E+03  7.2745E+02 -0.0000E+00 -0.0000E+00  0.0000E+00  1.1734E+03 -1.6322E+03  7.2745E+02  2.3600E-01  1.6966E-01  0.0000E+00  7.9672E-07  4.1637E-07  1.2972E-09  1.7329E-13
160292  0.0000E+00  1.1298E+03 -1.6362E+03  5.4484E+02 -0.0000E+00 -0.0000E+00 -0.0000E+00  1.1298E+03 -1.6362E+03  5.4484E+02  2.3657E-01  1.6337E-01 -0.0000E+00  8.2153E-07  5.0318E-07  1.2972E-09  1.6402E-13
160292  6.0612E+02  1.1166E+03 -1.6209E+03  5.3512E+02 -4.2548E-02  5.1184E-02 -3.0679E-02  1.2542E+03 -1.5170E+03  5.3512E+02  1.9182E-01  2.1263E-01 -3.0679E-02  8.3196E-07  5.2153E-07  1.2972E-09  1.6906E-13
160292  1.2012E+03  1.0802E+03 -1.5786E+03  5.0832E+02 -7.7807E-02  9.0452E-02 -5.7585E-02  1.3367E+03 -1.3682E+03  5.0832E+02  1.5045E-01  2.4663E-01 -5.7585E-02  8.5231E-07  6.5336E-07  1.2972E-09  1.7219E-13
160303  0.0000E+00  1.1597E+03 -1.6590E+03  4.9259E+02 -0.0000E+00 -0.0000E+00 -0.0000E+00  1.1597E+03 -1.6590E+03  4.9259E+02  2.3988E-01  1.6768E-01 -0.0000E+00  8.3173E-07  6.4047E-07  1.2972E-09  1.6553E-13
160303  6.0224E+02  1.1424E+03 -1.6464E+03  4.7873E+02 -5.4588E-02  4.3925E-02 -4.5259E-02  1.2812E+03 -1.5408E+03  4.7873E+02  1.8347E-01  2.0910E-01 -4.5259E-02  8.2987E-07  6.0373E-07  1.2972E-09  1.7020E-13
160303  1.2005E+03  1.0963E+03 -1.6121E+03  4.4205E+02 -9.7720E-02  6.7928E-02 -7.4153E-02  1.3583E+03 -1.3985E+03  4.4205E+02  1.3537E-01  2.2645E-01 -7.4153E-02  8.5071E-07  7.2662E-07  1.2972E-09  1.7247E-13
160305  0.0000E+00  9.1183E+02 -8.4020E+02  1.0686E+03 -0.0000E+00 -0.0000E+00 -0.0000E+00  9.1183E+02 -8.4020E+02  1.0686E+03  1.2149E-01  1.3184E-01 -0.0000E+00  8.0412E-07  6.2969E-07  1.2972E-09  1.5523E-13
160305  6.0843E+02  9.0593E+02 -8.4835E+02  1.0423E+03 -2.3193E-02 -2.1778E-02 -8.6302E-02  9.7696E+02 -7.6548E+02  1.0423E+03  9.9471E-02  1.0921E-01 -8.6302E-02  8.0967E-07  5.9683E-07  1.2972E-09  1.6081E-13
160305  1.2104E+03  8.8292E+02 -8.5853E+02  9.6552E+02 -5.3064E-02 -8.2386E-03 -1.6727E-01  1.0189E+03 -6.9167E+02  9.6552E+02  7.1071E-02  1.1942E-01 -1.6727E-01  8.0414E-07  5.5950E-07  1.2972E-09  1.6150E-13
160311  0.0000E+00  1.1125E+03 -1.5464E+03  6.1221E+02 -0.0000E+00 -0.0000E+00  0.0000E+00  1.1125E+03 -1.5464E+03  6.1221E+02  2.2359E-01  1.6086E-01  0.0000E+00  8.4279E-07  5.9675E-07  1.2972E-09  1.6142E-13
160311  6.0217E+02  1.1000E+03 -1.5372E+03  6.0303E+02 -4.1474E-02  2.9177E-02 -3.0092E-02  1.2295E+03 -1.4357E+03  6.0303E+02  1.8079E-01  1.8822E-01 -3.0092E-02  8.4639E-07  6.2117E-07  1.2972E-09  1.6720E-13
160329  0.0000E+00  1.1326E+03 -1.6370E+03  5.2959E+02 -0.0000E+00 -0.0000E+00 -0.0000E+00  1.1326E+03 -1.6370E+03  5.2959E+02  2.3670E-01  1.6377E-01 -0.0000E+00  8.2153E-07  5.5155E-07  1.2972E-09  1.6379E-13
160329  6.0915E+02  1.1179E+03 -1.6234E+03  5.1745E+02 -4.8194E-02  4.4787E-02 -4.0141E-02  1.2564E+03 -1.5188E+03  5.1745E+02  1.8653E-01  2.0642E-01 -4.0141E-02  8.3884E-07  6.4987E-07  1.2972E-09  1.6870E-13
160329  1.2077E+03  1.0750E+03 -1.5883E+03  4.8311E+02 -9.1004E-02  6.9923E-02 -6.9400E-02  1.3346E+03 -1.3773E+03  4.8311E+02  1.3865E-01  2.2536E-01 -6.9400E-02  8.5872E-07  6.3453E-07  1.2972E-09  1.7123E-13
160331  0.0000E+00  1.1852E+03 -1.4037E+03  1.0120E+03 -0.0000E+00 -0.0000E+00 -0.0000E+00  1.1852E+03 -1.4037E+03  1.0120E+03  2.0296E-01  1.7138E-01 -0.0000E+00  7.8219E-07  4.6857E-07  1.2972E-09  1.8122E-13
160331  6.1152E+02  1.1709E+03 -1.3943E+03  9.9006E+02 -4.5393E-02  3.2615E-02 -6.9837E-02  1.2895E+03 -1.2854E+03  9.9006E+02  1.5621E-01  2.0192E-01 -6.9837E-02  7.9866E-07  5.0838E-07  1.2972E-09  1.8850E-13
160331  1.2124E+03  1.1322E+03 -1.3641E+03  9.3033E+02 -7.9176E-02  7.2061E-02 -1.2602E-01  1.3527E+03 -1.1457E+03  9.3033E+02  1.1806E-01  2.3576E-01 -1.2602E-01  8.3694E-07  4.2774E-07  1.2972E-09  1.9156E-13
160342  0.0000E+00  1.1578E+03 -1.6648E+03  6.1998E+02 -0.0000E+00 -0.0000E+00  0.0000E+00  1.1578E+03 -1.6648E+03  6.1998E+02  2.4071E-01  1.6741E-01  0.0000E+00  8.1060E-07  4.4148E-07  1.2972E-09  1.6955E-13
160342  6.1266E+02  1.1451E+03 -1.6478E+03  6.1134E+02 -4.0237E-02  5.4614E-02 -2.8208E-02  1.2864E+03 -1.5400E+03  6.1134E+02  1.9802E-01  2.2019E-01 -2.8208E-02  8.0867E-07  4.9993E-07  1.2972E-09  1.7518E-13
160342  1.2010E+03  1.1112E+03 -1.5985E+03  5.8424E+02 -7.1138E-02  1.1453E-01 -6.2500E-02  1.3707E+03 -1.3825E+03  5.8424E+02  1.5999E-01  2.7520E-01 -6.2500E-02  8.3873E-07  4.6971E-07  1.2972E-09  1.7865E-13
160355  0.0000E+00  1.1060E+03 -1.5940E+03  4.7084E+02 -0.0000E+00 -0.0000E+00  0.0000E+00  1.1060E+03 -1.5940E+03  4.7084E+02  2.3048E-01  1.5991E-01  0.0000E+00  8.5485E-07  6.6259E-07  1.2972E-09  1.5841E-13
160356  0.0000E+00  1.1683E+03 -1.6568E+03  6.6919E+02 -0.0000E+00 -0.0000E+00  0.0000E+00  1.1683E+03 -1.6568E+03  6.6919E+02  2.3957E-01  1.6892E-01  0.0000E+00  8.0335E-07  4.6797E-07  1.2972E-09  1.7168E-13
160356  6.0780E+02  1.1554E+03 -1.6434E+03  6.5967E+02 -4.3610E-02  4.2478E-02 -3.0293E-02  1.2952E+03 -1.5356E+03  6.5967E+02  1.9401E-01  2.0954E-01 -3.0293E-02  8.0335E-07  6.1361E-07  1.2972E-09  1.7766E-13
160356  1.2160E+03  1.1159E+03 -1.6043E+03  6.3224E+02 -8.1025E-02  9.3846E-02 -6.1039E-02  1.3793E+03 -1.3844E+03  6.3224E+02  1.5094E-01  2.5519E-01 -6.1039E-02  8.1790E-07  4.1775E-07  1.2972E-09  1.8146E-13
160356  1.8079E+03  1.0630E+03 -1.5331E+03  5.8932E+02 -9.6465E-02  1.4397E-01 -8.1590E-02  1.4231E+03 -1.2063E+03  5.8932E+02  1.2521E-01  2.9767E-01 -8.1590E-02  8.5547E-07  5.5463E-07  1.2972E-09  1.8272E-13
160359  0.0000E+00  1.1676E+03 -1.3584E+03  1.0018E+03 -0.0000E+00 -0.0000E+00  0.0000E+00  1.1676E+03 -1.3584E+03  1.0018E+03  1.9641E-01  1.6882E-01  0.0000E+00  8.0814E-07  4.0965E-07  1.2972E-09  1.7838E-13
160359  6.1523E+02  1.1559E+03 -1.3432E+03  9.7968E+02 -3.5563E-02  4.8337E-02 -7.0711E-02  1.2706E+03 -1.2352E+03  9.7968E+02  1.5866E-01  2.1546E-01 -7.0711E-02  8.0814E-07  4.2375E-07  1.2972E-09  1.8579E-13
160367  0.0000E+00  9.2563E+02 -8.5473E+02  1.0371E+03 -0.0000E+00 -0.0000E+00  0.0000E+00  9.2563E+02 -8.5473E+02  1.0371E+03  1.2359E-01  1.3384E-01  0.0000E+00  8.2880E-07  5.7952E-07  1.2972E-09  1.5450E-13
160387  0.0000E+00  1.1157E+03 -1.5507E+03  6.3874E+02 -0.0000E+00 -0.0000E+00  0.0000E+00  1.1157E+03 -1.5507E+03  6.3874E+02  2.2422E-01  1.6132E-01  0.0000E+00  8.3475E-07  4.8804E-07  1.2972E-09  1.6276E-13
160393  0.0000E+00  1.2207E+03 -1.4114E+03  9.3102E+02 -0.0000E+00 -0.0000E+00  0.0000E+00  1.2207E+03 -1.4114E+03  9.3102E+02  2.0407E-01  1.7651E-01  0.0000E+00  8.3419E-07  5.5252E-07  1.2972E-09  1.8041E-13
160393  6.0861E+02  1.2087E+03 -1.4080E+03  9.1264E+02 -3.8876E-02  1.2906E-02 -5.6957E-02  1.3277E+03 -1.2963E+03  9.1264E+02  1.6471E-01  1.8767E-01 -5.6957E-02  8.3949E-07  5.6633E-07  1.2972E-09  1.8835E-13
160415  0.0000E+00  1.1635E+03 -1.7056E+03  5.4576E+02 -0.0000E+00 -0.0000E+00 -0.0000E+00  1.1635E+03 -1.7056E+03  5.4576E+02  2.4661E-01  1.6824E-01 -0.0000E+00  7.9666E-07  5.5542E-07  1.2972E-09  1.6934E-13
160415  6.0043E+02  1.1500E+03 -1.6956E+03  5.3448E+02 -4.5044E-02  3.6151E-02 -3.8723E-02  1.2927E+03 -1.5895E+03  5.3448E+02  2.0013E-01  2.0243E-01 -3.8723E-02  7.7816E-07  5.0605E-07  1.2972E-09  1.7446E-13
160415  1.2144E+03  1.1112E+03 -1.6595E+03  4.9999E+02 -8.2024E-02  7.9063E-02 -7.1145E-02  1.3840E+03 -1.4399E+03  4.9999E+02  1.5793E-01  2.3973E-01 -7.1145E-02  8.1622E-07  6.6592E-07  1.2972E-09  1.7775E-13
160415  1.8112E+03  1.0510E+03 -1.6051E+03  4.5218E+02 -1.1367E-01  1.0321E-01 -8.7124E-02  1.4307E+03 -1.2782E+03  4.5218E+02  1.1841E-01  2.5517E-01 -8.7124E-02  8.3933E-07  6.2914E-07  1.2972E-09  1.7848E-13
160425  0.0000E+00  1.1852E+03 -1.6482E+03  7.3173E+02 -0.0000E+00 -0.0000E+00  0.0000E+00  1.1852E+03 -1.6482E+03  7.3173E+02  2.3831E-01  1.7138E-01  0.0000E+00  7.9158E-07  5.2215E-07  1.2972E-09  1.7490E-13
160425  6.1104E+02  1.1720E+03 -1.6385E+03  7.2347E+02 -4.4341E-02  3.4685E-02 -2.7737E-02  1.3120E+03 -1.5287E+03  7.2347E+02  1.9258E-01  2.0415E-01 -2.7737E-02  7.7926E-07  4.3221E-07  1.2972E-09  1.8153E-13
160425  1.2040E+03  1.1384E+03 -1.6002E+03  6.9937E+02 -6.5082E-02  9.6858E-02 -5.4447E-02  1.3984E+03 -1.3788E+03  6.9937E+02  1.6629E-01  2.6147E-01 -5.4447E-02  8.0989E-07  3.6596E-07  1.2972E-09  1.8613E-13
160425  1.8092E+03  1.0989E+03 -1.5207E+03  6.5651E+02 -6.2611E-02  1.6369E-01 -8.5729E-02  1.4548E+03 -1.1848E+03  6.5651E+02  1.5727E-01  3.2259E-01 -8.5729E-02  8.4060E-07  4.3107E-07  1.2972E-09  1.8910E-13
160426  0.0000E+00  1.2021E+03 -1.6656E+03  7.7064E+02 -0.0000E+00 -0.0000E+00 -0.0000E+00  1.2021E+03 -1.6656E+03  7.7064E+02  2.4084E-01  1.7381E-01 -0.0000E+00  7.3499E-07  5.9863E-07  1.2972E-09  1.7828E-13
160426  6.0487E+02  1.1953E+03 -1.6675E+03  7.5158E+02 -2.4965E-02 -2.1598E-03 -5.9611E-02  1.3364E+03 -1.5567E+03  7.5158E+02  2.1614E-01  1.7067E-01 -5.9611E-02  7.5051E-07  5.1861E-07  1.2972E-09  1.8550E-13
160426  1.2079E+03  1.1726E+03 -1.6649E+03  7.0153E+02 -4.8383E-02  1.8724E-02 -1.0214E-01  1.4441E+03 -1.4358E+03  7.0153E+02  1.9234E-01  1.8827E-01 -1.0214E-01  7.9308E-07  4.3232E-07  1.2972E-09  1.9146E-13
160426  1.8007E+03  1.1340E+03 -1.6399E+03  6.3214E+02 -8.3561E-02  6.5595E-02 -1.3233E-01  1.5179E+03 -1.2927E+03  6.3214E+02  1.5355E-01  2.2956E-01 -1.3233E-01  7.9929E-07  5.1923E-07  1.2972E-09  1.9506E-13
160426  2.4035E+03  1.0761E+03 -1.5816E+03  5.4325E+02 -1.0287E-01  1.2683E-01 -1.5909E-01  1.5504E+03 -1.1205E+03  5.4325E+02  1.2581E-01  2.8243E-01 -1.5909E-01  8.4327E-07  5.3472E-07  1.2972E-09  1.9510E-13
160427  0.0000E+00  1.2113E+03 -1.6756E+03  8.0002E+02 -0.0000E+00 -0.0000E+00 -0.0000E+00  1.2113E+03 -1.6756E+03  8.0002E+02  2.4227E-01  1.7514E-01 -0.0000E+00  7.1848E-07  6.4484E-07  1.2972E-09  1.8048E-13
160427  6.0332E+02  1.2000E+03 -1.6790E+03  7.8459E+02 -3.8019E-02 -6.8237E-03 -5.1704E-02  1.3417E+03 -1.5681E+03  7.8459E+02  2.0476E-01  1.6668E-01 -5.1704E-02  7.3499E-07  4.8772E-07  1.2972E-09  1.8761E-13
160427  1.2235E+03  1.1692E+03 -1.6746E+03  7.3711E+02 -6.0669E-02  2.4574E-02 -9.7951E-02  1.4457E+03 -1.4427E+03  7.3711E+02  1.8147E-01  1.9363E-01 -9.7951E-02  7.3548E-07  3.6076E-07  1.2972E-09  1.9324E-13
160427  1.8084E+03  1.1284E+03 -1.6479E+03  6.7113E+02 -8.1612E-02  6.8729E-02 -1.2645E-01  1.5160E+03 -1.3002E+03  6.7113E+02  1.5666E-01  2.3189E-01 -1.2645E-01  7.8819E-07  5.1342E-07  1.2972E-09  1.9656E-13
160427  2.4102E+03  1.0726E+03 -1.5900E+03  5.8752E+02 -1.0196E-01  1.2237E-01 -1.4943E-01  1.5511E+03 -1.1282E+03  5.8752E+02  1.2795E-01  2.7746E-01 -1.4943E-01  8.1988E-07  6.1812E-07  1.2972E-09  1.9703E-13
160431  0.0000E+00  1.1652E+03 -1.7007E+03  5.3043E+02 -0.0000E+00 -0.0000E+00 -0.0000E+00  1.1652E+03 -1.7007E+03  5.3043E+02  2.4591E-01  1.6848E-01 -0.0000E+00  7.9666E-07  5.7922E-07  1.2972E-09  1.6880E-13
160431  6.0749E+02  1.1491E+03 -1.6894E+03  5.1621E+02 -5.0309E-02  3.9715E-02 -4.6069E-02  1.2929E+03 -1.5820E+03  5.1621E+02  1.9396E-01  2.0587E-01 -4.6069E-02  8.0687E-07  5.4617E-07  1.2972E-09  1.7364E-13
160431  1.2030E+03  1.1074E+03 -1.6544E+03  4.7917E+02 -9.0839E-02  7.4164E-02 -7.6013E-02  1.3771E+03 -1.4378E+03  4.7917E+02  1.4837E-01  2.3429E-01 -7.6013E-02  8.2160E-07  8.1775E-07  1.2972E-09  1.7631E-13
160431  1.8047E+03  1.0415E+03 -1.6043E+03  4.2792E+02 -1.1987E-01  9.5149E-02 -9.3203E-02  1.4201E+03 -1.2812E+03  4.2792E+02  1.1209E-01  2.4574E-01 -9.3203E-02  8.6461E-07  6.5703E-07  1.2972E-09  1.7652E-13
160438  0.0000E+00  9.2579E+02 -1.3352E+03  7.8046E+02 -0.0000E+00 -0.0000E+00 -0.0000E+00  9.2579E+02 -1.3352E+03  7.8046E+02  1.9305E-01  1.3386E-01 -0.0000E+00  8.4113E-07  6.5301E-07  1.2972E-09  1.4695E-13
160438  6.0952E+02  9.1554E+02 -1.3280E+03  7.6654E+02 -3.0460E-02  2.9593E-02 -4.5162E-02  1.0289E+03 -1.2423E+03  7.6654E+02  1.6156E-01  1.6197E-01 -4.5162E-02  8.4932E-07  4.8441E-07  1.2972E-09  1.5217E-13
160444  0.0000E+00  1.9850E+03 -8.5551E+02  8.7133E+02 -0.0000E+00 -0.0000E+00  0.0000E+00  1.9850E+03 -8.5551E+02  8.7133E+02  1.2370E-01  2.8701E-01  0.0000E+00  9.2332E-07  5.2509E-07  1.2972E-09  2.6789E-13
160449  0.0000E+00  1.1768E+03 -1.4349E+03  8.3216E+02 -0.0000E+00 -0.0000E+00  0.0000E+00  1.1768E+03 -1.4349E+03  8.3216E+02  2.0748E-01  1.7016E-01  0.0000E+00  8.3946E-07  5.6622E-07  1.2972E-09  1.7226E-13
160455  0.0000E+00  1.2141E+03 -1.4110E+03  9.7499E+02  0.0000E+00 -0.0000E+00 -0.0000E+00  1.2141E+03 -1.4110E+03  9.7499E+02  2.0402E-01  1.7555E-01 -0.0000E+00  8.1224E-07  5.4677E-07  1.2972E-09  1.8202E-13
160455  6.1147E+02  1.2147E+03 -1.4143E+03  9.5438E+02 -8.5703E-03 -1.2673E-02 -6.8813E-02  1.3349E+03 -1.3015E+03  9.5438E+02  1.9592E-01  1.6297E-01 -6.8813E-02  8.1224E-07  6.8524E-07  1.2972E-09  1.9125E-13
160455  1.2042E+03  1.1990E+03 -1.4239E+03  8.9575E+02 -4.2284E-02 -1.1914E-02 -1.2600E-01  1.4275E+03 -1.1947E+03  8.9575E+02  1.6360E-01  1.6145E-01 -1.2600E-01  8.3949E-07  4.7909E-07  1.2972E-09  1.9767E-13
160462  0.0000E+00  1.1713E+03 -1.3639E+03  1.0219E+03 -0.0000E+00 -0.0000E+00 -0.0000E+00  1.1713E+03 -1.3639E+03  1.0219E+03  1.9720E-01  1.6937E-01 -0.0000E+00  7.9165E-07  5.7165E-07  1.2972E-09  1.7986E-13
160462  6.1071E+02  1.1549E+03 -1.3540E+03  9.9936E+02 -4.9041E-02  3.6489E-02 -7.3339E-02  1.2698E+03 -1.2468E+03  9.9936E+02  1.4673E-01  2.0348E-01 -7.3339E-02  7.9739E-07  4.9347E-07  1.2972E-09  1.8683E-13
160462  1.2047E+03  1.1169E+03 -1.3173E+03  9.3762E+02 -7.2923E-02  9.0248E-02 -1.3411E-01  1.3283E+03 -1.1038E+03  9.3762E+02  1.1755E-01  2.5174E-01 -1.3411E-01  8.4133E-07  2.6066E-07  1.2972E-09  1.8947E-13
160477  0.0000E+00  1.2060E+03 -1.3936E+03  9.4455E+02 -0.0000E+00 -0.0000E+00 -0.0000E+00  1.2060E+03 -1.3936E+03  9.4455E+02  2.0151E-01  1.7438E-01 -0.0000E+00  8.3337E-07  7.5625E-07  1.2972E-09  1.7946E-13
160477  6.1691E+02  1.1927E+03 -1.3995E+03  9.1944E+02 -4.4147E-02 -1.3855E-02 -7.4764E-02  1.3126E+03 -1.2876E+03  9.1944E+02  1.5820E-01  1.5860E-01 -7.4764E-02  8.2913E-07  6.0462E-07  1.2972E-09  1.8713E-13
160478  0.0000E+00  1.2129E+03 -1.3984E+03  9.4034E+02 -0.0000E+00 -0.0000E+00  0.0000E+00  1.2129E+03 -1.3984E+03  9.4034E+02  2.0219E-01  1.7537E-01  0.0000E+00  8.2913E-07  7.3295E-07  1.2972E-09  1.7994E-13
160478  6.0131E+02  1.1995E+03 -1.4015E+03  9.2092E+02 -4.3917E-02 -5.2083E-03 -6.2506E-02  1.3167E+03 -1.2920E+03  9.2092E+02  1.5872E-01  1.6823E-01 -6.2506E-02  8.2913E-07  6.2672E-07  1.2972E-09  1.8764E-13
160482  0.0000E+00  1.1980E+03 -1.6639E+03  7.8605E+02 -0.0000E+00 -0.0000E+00 -0.0000E+00  1.1980E+03 -1.6639E+03  7.8605E+02  2.4058E-01  1.7322E-01 -0.0000E+00  7.6083E-07  3.9940E-07  1.2972E-09  1.7851E-13
160482  6.1390E+02  1.1841E+03 -1.6488E+03  7.7163E+02 -4.4920E-02  4.9359E-02 -4.5254E-02  1.3256E+03 -1.5374E+03  7.7163E+02  1.9349E-01  2.2057E-01 -4.5254E-02  7.4395E-07  4.5045E-07  1.2972E-09  1.8495E-13
160482  1.2016E+03  1.1487E+03 -1.6042E+03  7.3472E+02 -7.1060E-02  1.0478E-01 -8.0373E-02  1.4087E+03 -1.3815E+03  7.3472E+02  1.6089E-01  2.7087E-01 -8.0373E-02  7.9828E-07  3.6971E-07  1.2972E-09  1.8874E-13
160482  1.8021E+03  1.1053E+03 -1.5217E+03  6.7574E+02 -6.9428E-02  1.6921E-01 -1.1531E-01  1.4600E+03 -1.1856E+03  6.7574E+02  1.5059E-01  3.2902E-01 -1.1531E-01  8.2985E-07  3.9288E-07  1.2972E-09  1.9053E-13
160499  0.0000E+00  9.0448E+02 -1.5988E+03  4.7391E+02 -0.0000E+00 -0.0000E+00 -0.0000E+00  9.0448E+02 -1.5988E+03  4.7391E+02  2.3118E-01  1.3078E-01 -0.0000E+00  8.2111E-07  5.4144E-07  1.2972E-09  1.4674E-13
160499  6.0369E+02  8.9313E+02 -1.5838E+03  4.6507E+02 -3.5829E-02  4.9479E-02 -2.8162E-02  1.0278E+03 -1.4999E+03  4.6507E+02  1.9317E-01  1.7862E-01 -2.8162E-02  8.2111E-07  5.4691E-07  1.2972E-09  1.4880E-13
160500  0.0000E+00  1.1674E+03 -1.6815E+03  4.9478E+02 -0.0000E+00 -0.0000E+00 -0.0000E+00  1.1674E+03 -1.6815E+03  4.9478E+02  2.4313E-01  1.6880E-01 -0.0000E+00  8.2251E-07  5.5758E-07  1.2972E-09  1.6710E-13
160500  6.0759E+02  1.1531E+03 -1.6655E+03  4.8180E+02 -4.2338E-02  5.2916E-02 -4.0977E-02  1.2948E+03 -1.5579E+03  4.8180E+02  1.9848E-01  2.1964E-01 -4.0977E-02  8.0985E-07  5.6092E-07  1.2972E-09  1.7196E-13
160500  1.2009E+03  1.1161E+03 -1.6237E+03  4.4663E+02 -8.2856E-02  8.1795E-02 -7.4453E-02  1.3799E+03 -1.4065E+03  4.4663E+02  1.5192E-01  2.4318E-01 -7.4453E-02  8.5071E-07  7.8505E-07  1.2972E-09  1.7487E-13
160508  0.0000E+00  1.1661E+03 -1.5811E+03  7.5164E+02 -0.0000E+00 -0.0000E+00  0.0000E+00  1.1661E+03 -1.5811E+03  7.5164E+02  2.2861E-01  1.6860E-01  0.0000E+00  7.9798E-07  4.8658E-07  1.2972E-09  1.7194E-13
160508  6.0931E+02  1.1530E+03 -1.5655E+03  7.4087E+02 -3.9105E-02  5.4251E-02 -3.4998E-02  1.2862E+03 -1.4580E+03  7.4087E+02  1.8725E-01  2.2096E-01 -3.4998E-02  8.0011E-07  4.1594E-07  1.2972E-09  1.7842E-13
160508  1.2009E+03  1.1270E+03 -1.5138E+03  7.0871E+02 -4.3818E-02  1.2050E-01 -7.3698E-02  1.3716E+03 -1.2963E+03  7.0871E+02  1.7506E-01  2.8346E-01 -7.3698E-02  8.3606E-07  3.6751E-07  1.2972E-09  1.8302E-13
160547  0.0000E+00  1.1270E+03 -1.5990E+03  5.8169E+02 -0.0000E+00 -0.0000E+00  0.0000E+00  1.1270E+03 -1.5990E+03  5.8169E+02  2.3120E-01  1.6296E-01  0.0000E+00  8.3220E-07  3.8292E-07  1.2972E-09  1.6347E-13
160568  0.0000E+00  1.0832E+03 -1.5751E+03  5.0423E+02 -0.0000E+00 -0.0000E+00  0.0000E+00  1.0832E+03 -1.5751E+03  5.0423E+02  2.2774E-01  1.5662E-01  0.0000E+00  8.5231E-07  6.5325E-07  1.2972E-09  1.5699E-13
160574  0.0000E+00  1.1652E+03 -1.3489E+03  1.0125E+03 -0.0000E+00 -0.0000E+00 -0.0000E+00  1.1652E+03 -1.3489E+03  1.0125E+03  1.9504E-01  1.6848E-01 -0.0000E+00  7.9165E-07  5.1964E-07  1.2972E-09  1.7859E-13
160574  6.0540E+02  1.1501E+03 -1.3379E+03  9.9085E+02 -4.6969E-02  3.9432E-02 -6.9540E-02  1.2627E+03 -1.2322E+03  9.9085E+02  1.4648E-01  2.0573E-01 -6.9540E-02  7.9739E-07  4.4047E-07  1.2972E-09  1.8558E-13
160579  0.0000E+00  1.1783E+03 -1.6781E+03  6.6532E+02 -0.0000E+00 -0.0000E+00  0.0000E+00  1.1783E+03 -1.6781E+03  6.6532E+02  2.4265E-01  1.7037E-01  0.0000E+00  7.8328E-07  5.8014E-07  1.2972E-09  1.7309E-13
160579  6.0274E+02  1.1676E+03 -1.6734E+03  6.5539E+02 -3.3796E-02  2.2719E-02 -3.2394E-02  1.3088E+03 -1.5654E+03  6.5539E+02  2.0816E-01  1.9154E-01 -3.2394E-02  7.8328E-07  4.0333E-07  1.2972E-09  1.7945E-13
160579  1.2027E+03  1.1391E+03 -1.6443E+03  6.2678E+02 -6.2556E-02  7.3715E-02 -6.3118E-02  1.4065E+03 -1.4224E+03  6.2678E+02  1.7519E-01  2.3842E-01 -6.3118E-02  7.9929E-07  5.4160E-07  1.2972E-09  1.8446E-13
160579  1.8021E+03  1.0938E+03 -1.5819E+03  5.7911E+02 -8.3967E-02  1.3312E-01 -9.3607E-02  1.4645E+03 -1.2467E+03  5.7911E+02  1.4477E-01  2.9128E-01 -9.3607E-02  8.3183E-07  4.6661E-07  1.2972E-09  1.8689E-13
160585  0.0000E+00  1.1110E+03 -1.5965E+03  4.9424E+02 -0.0000E+00 -0.0000E+00  0.0000E+00  1.1110E+03 -1.5965E+03  4.9424E+02  2.3084E-01  1.6063E-01  0.0000E+00  8.5485E-07  7.3249E-07  1.2972E-09  1.5953E-13
160585  6.1030E+02  1.0961E+03 -1.5913E+03  4.8375E+02 -4.7410E-02  1.8713E-02 -3.3148E-02  1.2321E+03 -1.4885E+03  4.8375E+02  1.8268E-01  1.7720E-01 -3.3148E-02  8.5485E-07  6.8946E-07  1.2972E-09  1.6463E-13
160600  0.0000E+00  1.0951E+03 -1.5844E+03  4.9665E+02 -0.0000E+00 -0.0000E+00  0.0000E+00  1.0951E+03 -1.5844E+03  4.9665E+02  2.2909E-01  1.5834E-01  0.0000E+00  8.4986E-07  7.0736E-07  1.2972E-09  1.5798E-13
160600  6.0462E+02  1.0816E+03 -1.5786E+03  4.8661E+02 -4.1278E-02  2.0948E-02 -2.9014E-02  1.2153E+03 -1.4781E+03  4.8661E+02  1.8697E-01  1.7734E-01 -2.9014E-02  8.5872E-07  6.4342E-07  1.2972E-09  1.6299E-13
160601  0.0000E+00  1.0857E+03 -1.5761E+03  5.1245E+02 -0.0000E+00 -0.0000E+00 -0.0000E+00  1.0857E+03 -1.5761E+03  5.1245E+02  2.2789E-01  1.5698E-01 -0.0000E+00  8.5231E-07  6.7777E-07  1.2972E-09  1.5744E-13
160601  6.1609E+02  1.0716E+03 -1.5675E+03  5.0575E+02 -4.2750E-02  2.8938E-02 -1.8552E-02  1.2068E+03 -1.4660E+03  5.0575E+02  1.8390E-01  1.8388E-01 -1.8552E-02  8.5886E-07  6.6506E-07  1.2972E-09  1.6255E-13
160644  0.0000E+00  1.1923E+03 -1.4129E+03  1.0004E+03 -0.0000E+00 -0.0000E+00 -0.0000E+00  1.1923E+03 -1.4129E+03  1.0004E+03  2.0429E-01  1.7239E-01 -0.0000E+00  7.9631E-07  6.0003E-07  1.2972E-09  1.8139E-13
160644  6.0504E+02  1.1789E+03 -1.4115E+03  9.7517E+02 -4.2267E-02  5.6780E-03 -8.0153E-02  1.2977E+03 -1.3031E+03  9.7517E+02  1.6182E-01  1.7614E-01 -8.0153E-02  7.8146E-07  5.8815E-07  1.2972E-09  1.8865E-13
160644  1.2132E+03  1.1396E+03 -1.4048E+03  9.0920E+02 -8.6052E-02  1.8778E-02 -1.3249E-01  1.3673E+03 -1.1843E+03  9.0920E+02  1.1706E-01  1.8355E-01 -1.3249E-01  8.2273E-07  6.2240E-07  1.2972E-09  1.9193E-13
160651  0.0000E+00  9.3067E+02 -8.6571E+02  1.0228E+03 -0.0000E+00 -0.0000E+00  0.0000E+00  9.3067E+02 -8.6571E+02  1.0228E+03  1.2517E-01  1.3457E-01  0.0000E+00  8.3163E-07  6.1163E-07  1.2972E-09  1.5404E-13
160651  6.0656E+02  9.2248E+02 -8.6597E+02  1.0001E+03 -2.6755E-02  3.2899E-03 -7.5361E-02  9.9478E+02 -7.8184E+02  1.0001E+03  9.8457E-02  1.3667E-01 -7.5361E-02  8.3061E-07  6.2544E-07  1.2972E-09  1.5981E-13
160651  1.2109E+03  8.9695E+02 -8.6072E+02  9.3018E+02 -5.2790E-02  1.7843E-02 -1.5512E-01  1.0332E+03 -6.9133E+02  9.3018E+02  7.1663E-02  1.4753E-01 -1.5512E-01  8.2659E-07  3.2956E-07  1.2972E-09  1.6088E-13
160655  0.0000E+00  1.1602E+03 -1.6889E+03  5.8175E+02 -0.0000E+00 -0.0000E+00  0.0000E+00  1.1602E+03 -1.6889E+03  5.8175E+02  2.4420E-01  1.6776E-01  0.0000E+00  8.1169E-07  4.9927E-07  1.2972E-09  1.6949E-13
160655  6.0213E+02  1.1464E+03 -1.6750E+03  5.7433E+02 -4.4886E-02  4.7795E-02 -2.3936E-02  1.2878E+03 -1.5690E+03  5.7433E+02  1.9731E-01  2.1356E-01 -2.3936E-02  7.9683E-07  5.1060E-07  1.2972E-09  1.7478E-13
160655  1.2108E+03  1.1102E+03 -1.6269E+03  5.5130E+02 -7.0282E-02  1.1073E-01 -5.1387E-02  1.3766E+03 -1.4086E+03  5.5130E+02  1.6495E-01  2.7126E-01 -5.1387E-02  8.3196E-07  4.8965E-07  1.2972E-09  1.7837E-13
160656  0.0000E+00  1.1885E+03 -1.3861E+03  9.4540E+02 -0.0000E+00 -0.0000E+00 -0.0000E+00  1.1885E+03 -1.3861E+03  9.4540E+02  2.0042E-01  1.7185E-01 -0.0000E+00  8.2201E-07  7.7272E-07  1.2972E-09  1.7780E-13
160656  6.1534E+02  1.1760E+03 -1.3925E+03  9.2258E+02 -3.9941E-02 -1.4804E-02 -7.0780E-02  1.2951E+03 -1.2825E+03  9.2258E+02  1.6140E-01  1.5524E-01 -7.0780E-02  8.3297E-07  5.7801E-07  1.2972E-09  1.8551E-13
160656  1.2061E+03  1.1428E+03 -1.3975E+03  8.6724E+02 -7.0703E-02  1.7142E-03 -1.1374E-01  1.3679E+03 -1.1780E+03  8.6724E+02  1.3136E-01  1.6695E-01 -1.1374E-01  8.4009E-07  5.7652E-07  1.2972E-09  1.8983E-13
160667  0.0000E+00  1.1530E+03 -1.3776E+03  9.0780E+02 -0.0000E+00 -0.0000E+00  0.0000E+00  1.1530E+03 -1.3776E+03  9.0780E+02  1.9919E-01  1.6671E-01  0.0000E+00  8.4214E-07  6.4808E-07  1.2972E-09  1.7261E-13
160667  6.0562E+02  1.1445E+03 -1.3779E+03  8.9271E+02 -2.8453E-02  2.4729E-03 -4.9409E-02  1.2606E+03 -1.2725E+03  8.9271E+02  1.7078E-01  1.6795E-01 -4.9409E-02  8.4214E-07  5.7396E-07  1.2972E-09  1.8048E-13
160675  0.0000E+00  1.3084E+03 -1.3865E+03  9.9812E+02 -0.0000E+00 -0.0000E+00  0.0000E+00  1.3084E+03 -1.3865E+03  9.9812E+02  2.0048E-01  1.8919E-01  0.0000E+00  8.3928E-07  6.5919E-07  1.2972E-09  1.9163E-13
160676  0.0000E+00  1.2021E+03 -1.6682E+03  7.7796E+02 -0.0000E+00 -0.0000E+00  0.0000E+00  1.2021E+03 -1.6682E+03  7.7796E+02  2.4120E-01  1.7381E-01  0.0000E+00  7.3499E-07  6.5453E-07  1.2972E-09  1.7865E-13
160676  6.1572E+02  1.1859E+03 -1.6648E+03  7.6221E+02 -4.6500E-02  1.9927E-02 -4.9854E-02  1.3292E+03 -1.5528E+03  7.6221E+02  1.9422E-01  1.9140E-01 -4.9854E-02  7.7650E-07  3.7371E-07  1.2972E-09  1.8522E-13
160676  1.2193E+03  1.1495E+03 -1.6400E+03  7.2008E+02 -7.2872E-02  6.5401E-02 -8.7330E-02  1.4193E+03 -1.4130E+03  7.2008E+02  1.6426E-01  2.3161E-01 -8.7330E-02  7.5949E-07  3.9486E-07  1.2972E-09  1.8952E-13
160676  1.8021E+03  1.1030E+03 -1.5844E+03  6.6110E+02 -8.3463E-02  1.2679E-01 -1.1529E-01  1.4740E+03 -1.2467E+03  6.6110E+02  1.4562E-01  2.8628E-01 -1.1529E-01  8.0731E-07  4.2695E-07  1.2972E-09  1.9145E-13
160686  0.0000E+00  1.1827E+03 -1.7047E+03  5.0224E+02 -0.0000E+00 -0.0000E+00 -0.0000E+00  1.1827E+03 -1.7047E+03  5.0224E+02  2.4648E-01  1.7101E-01 -0.0000E+00  8.0170E-07  6.7935E-07  1.2972E-09  1.6936E-13
160686  6.0545E+02  1.1733E+03 -1.7039E+03  4.9500E+02 -3.2104E-02  9.2096E-03 -2.3424E-02  1.3178E+03 -1.5948E+03  4.9500E+02  2.1426E-01  1.7887E-01 -2.3424E-02  8.0557E-07  5.1491E-07  1.2972E-09  1.7544E-13
160686  1.2018E+03  1.1429E+03 -1.6853E+03  4.7369E+02 -6.8029E-02  5.3029E-02 -4.8883E-02  1.4171E+03 -1.4623E+03  4.7369E+02  1.7565E-01  2.1828E-01 -4.8883E-02  8.0985E-07  5.8398E-07  1.2972E-09  1.8043E-13
160686  1.8064E+03  1.0904E+03 -1.6459E+03  4.3652E+02 -1.0671E-01  7.3687E-02 -7.3111E-02  1.4784E+03 -1.3085E+03  4.3652E+02  1.3128E-01  2.3135E-01 -7.3111E-02  8.1933E-07  8.2022E-07  1.2972E-09  1.8321E-13
160686  2.4084E+03  1.0207E+03 -1.5944E+03  3.8674E+02 -1.1765E-01  9.8923E-02 -9.3103E-02  1.5035E+03 -1.1505E+03  3.8674E+02  1.1289E-01  2.4650E-01 -9.3103E-02  8.6135E-07  7.2588E-07  1.2972E-09  1.8346E-13
160746  0.0000E+00  9.5185E+02 -8.8008E+02  1.0344E+03 -0.0000E+00 -0.0000E+00  0.0000E+00  9.5185E+02 -8.8008E+02  1.0344E+03  1.2725E-01  1.3763E-01  0.0000E+00  8.3508E-07  6.2834E-07  1.2972E-09  1.5683E-13
160746  6.1264E+02  9.4203E+02 -8.8106E+02  1.0135E+03 -3.0807E-02 -4.4248E-03 -6.9299E-02  1.0163E+03 -7.9427E+02  1.0135E+03  9.6587E-02  1.3178E-01 -6.9299E-02  8.3163E-07  6.2255E-07  1.2972E-09  1.6279E-13
160746  1.2077E+03  9.1422E+02 -8.8560E+02  9.4998E+02 -6.3810E-02 -4.6755E-03 -1.4494E-01  1.0542E+03 -7.1330E+02  9.4998E+02  6.4240E-02  1.2751E-01 -1.4494E-01  8.1872E-07  4.8397E-07  1.2972E-09  1.6407E-13
160747  0.0000E+00  9.4926E+02 -8.8019E+02  1.0236E+03 -0.0000E+00 -0.0000E+00  0.0000E+00  9.4926E+02 -8.8019E+02  1.0236E+03  1.2727E-01  1.3725E-01  0.0000E+00  8.3508E-07  6.4523E-07  1.2972E-09  1.5589E-13
160747  6.0126E+02  9.3995E+02 -8.8267E+02  1.0024E+03 -3.0262E-02 -9.1951E-03 -7.1221E-02  1.0130E+03 -7.9772E+02  1.0024E+03  9.7364E-02  1.2671E-01 -7.1221E-02  8.3061E-07  6.7077E-07  1.2972E-09  1.6171E-13
160747  1.2012E+03  9.1245E+02 -8.8779E+02  9.3679E+02 -5.8905E-02 -4.3598E-04 -1.4697E-01  1.0521E+03 -7.1675E+02  9.3679E+02  6.9462E-02  1.3150E-01 -1.4697E-01  8.2873E-07  3.3917E-07  1.2972E-09  1.6298E-13
160783  0.0000E+00  7.3829E+02 -1.3920E+03  4.5585E+02 -0.0000E+00 -0.0000E+00  0.0000E+00  7.3829E+02 -1.3920E+03  4.5585E+02  2.0126E-01  1.0675E-01  0.0000E+00  8.3656E-07  5.6573E-07  1.2972E-09  1.2650E-13
160789  0.0000E+00  1.1738E+03 -1.6616E+03  6.8784E+02 -0.0000E+00 -0.0000E+00  0.0000E+00  1.1738E+03 -1.6616E+03  6.8784E+02  2.4025E-01  1.6973E-01  0.0000E+00  7.9308E-07  4.3097E-07  1.2972E-09  1.7293E-13
160789  6.0704E+02  1.1627E+03 -1.6481E+03  6.7794E+02 -3.7564E-02  4.4214E-02 -3.2186E-02  1.3027E+03 -1.5399E+03  6.7794E+02  2.0074E-01  2.1233E-01 -3.2186E-02  7.9308E-07  5.5772E-07  1.2972E-09  1.7913E-13
160789  1.2124E+03  1.1278E+03 -1.6081E+03  6.5062E+02 -7.3736E-02  9.4356E-02 -6.0420E-02  1.3910E+03 -1.3868E+03  6.5062E+02  1.5878E-01  2.5743E-01 -6.0420E-02  8.0704E-07  4.5160E-07  1.2972E-09  1.8341E-13
160789  1.8081E+03  1.0786E+03 -1.5340E+03  6.0670E+02 -9.0649E-02  1.4951E-01 -8.4130E-02  1.4385E+03 -1.2031E+03  6.0670E+02  1.3115E-01  3.0547E-01 -8.4130E-02  8.5617E-07  6.1877E-07  1.2972E-09  1.8512E-13
160821  0.0000E+00  1.1801E+03 -1.3887E+03  9.8454E+02 -0.0000E+00 -0.0000E+00 -0.0000E+00  1.1801E+03 -1.3887E+03  9.8454E+02  2.0079E-01  1.7063E-01 -0.0000E+00  7.9866E-07  5.7535E-07  1.2972E-09  1.7909E-13
160821  6.0835E+02  1.1639E+03 -1.3822E+03  9.6293E+02 -5.2312E-02  2.1884E-02 -6.8629E-02  1.2809E+03 -1.2746E+03  9.6293E+02  1.4754E-01  1.9018E-01 -6.8629E-02  8.1686E-07  6.2232E-07  1.2972E-09  1.8614E-13
160821  1.2111E+03  1.1223E+03 -1.3578E+03  9.0526E+02 -8.0513E-02  6.2811E-02 -1.1778E-01  1.3417E+03 -1.1415E+03  9.0526E+02  1.1581E-01  2.2509E-01 -1.1778E-01  8.4730E-07  5.2900E-07  1.2972E-09  1.8906E-13
160870  0.0000E+00  1.1178E+03 -1.6053E+03  5.0733E+02 -0.0000E+00 -0.0000E+00 -0.0000E+00  1.1178E+03 -1.6053E+03  5.0733E+02  2.3211E-01  1.6163E-01 -0.0000E+00  8.3884E-07  7.1980E-07  1.2972E-09  1.6076E-13
160870  6.1570E+02  1.1030E+03 -1.6003E+03  4.9161E+02 -4.8645E-02  1.7345E-02 -4.7799E-02  1.2410E+03 -1.4959E+03  4.9161E+02  1.8274E-01  1.7684E-01 -4.7799E-02  8.5485E-07  7.4953E-07  1.2972E-09  1.6586E-13
160870  1.2117E+03  1.0633E+03 -1.5835E+03  4.5544E+02 -7.8167E-02  4.0009E-02 -6.9040E-02  1.3231E+03 -1.3740E+03  4.5544E+02  1.5080E-01  1.9376E-01 -6.9040E-02  8.6226E-07  6.1872E-07  1.2972E-09  1.6908E-13
160880  0.0000E+00  1.1043E+03 -1.5354E+03  6.2235E+02 -0.0000E+00 -0.0000E+00  0.0000E+00  1.1043E+03 -1.5354E+03  6.2235E+02  2.2200E-01  1.5968E-01  0.0000E+00  8.4507E-07  7.2588E-07  1.2972E-09  1.6076E-13
160880  6.1356E+02  1.0883E+03 -1.5276E+03  6.1475E+02 -4.7398E-02  3.0961E-02 -2.6491E-02  1.2194E+03 -1.4251E+03  6.1475E+02  1.7348E-01  1.8832E-01 -2.6491E-02  8.5617E-07  5.1560E-07  1.2972E-09  1.6650E-13
160891  0.0000E+00  1.1308E+03 -1.5671E+03  6.7333E+02 -0.0000E+00 -0.0000E+00  0.0000E+00  1.1308E+03 -1.5671E+03  6.7333E+02  2.2660E-01  1.6350E-01  0.0000E+00  8.2473E-07  3.0700E-07  1.2972E-09  1.6575E-13
160899  0.0000E+00  1.1760E+03 -1.3809E+03  9.8837E+02 -0.0000E+00 -0.0000E+00 -0.0000E+00  1.1760E+03 -1.3809E+03  9.8837E+02  1.9967E-01  1.7005E-01 -0.0000E+00  7.9866E-07  5.5741E-07  1.2972E-09  1.7879E-13
160899  6.1579E+02  1.1589E+03 -1.3709E+03  9.6669E+02 -5.3374E-02  3.3723E-02 -6.8514E-02  1.2762E+03 -1.2624E+03  9.6669E+02  1.4485E-01  2.0129E-01 -6.8514E-02  8.1686E-07  5.4492E-07  1.2972E-09  1.8580E-13
160938  0.0000E+00  9.1744E+02 -1.6333E+03  4.9203E+02 -0.0000E+00 -0.0000E+00 -0.0000E+00  9.1744E+02 -1.6333E+03  4.9203E+02  2.3616E-01  1.3265E-01 -0.0000E+00  8.1136E-07  4.4140E-07  1.2972E-09  1.4977E-13
160938  6.1491E+02  9.0717E+02 -1.6157E+03  4.8185E+02 -3.4177E-02  5.7211E-02 -3.3551E-02  1.0471E+03 -1.5288E+03  4.8185E+02  1.9944E-01  1.8838E-01 -3.3551E-02  7.9616E-07  5.1598E-07  1.2972E-09  1.5185E-13
160938  1.2104E+03  8.7876E+02 -1.5660E+03  4.5374E+02 -5.8143E-02  1.0712E-01 -5.7140E-02  1.1380E+03 -1.3891E+03  4.5374E+02  1.6829E-01  2.3419E-01 -5.7140E-02  8.3422E-07  6.0528E-07  1.2972E-09  1.5271E-13
160946  0.0000E+00  1.1267E+03 -1.2603E+03  9.6723E+02 -0.0000E+00 -0.0000E+00  0.0000E+00  1.1267E+03 -1.2603E+03  9.6723E+02  1.8223E-01  1.6292E-01  0.0000E+00  8.3306E-07  4.0564E-07  1.2972E-09  1.7146E-13
160951  0.0000E+00  1.1652E+03 -1.6595E+03  6.5112E+02 -0.0000E+00 -0.0000E+00  0.0000E+00  1.1652E+03 -1.6595E+03  6.5112E+02  2.3995E-01  1.6848E-01  0.0000E+00  8.0335E-07  3.9647E-07  1.2972E-09  1.7093E-13
160951  6.0583E+02  1.1538E+03 -1.6446E+03  6.4225E+02 -4.1412E-02  4.6390E-02 -2.9310E-02  1.2932E+03 -1.5373E+03  6.4225E+02  1.9638E-01  2.1321E-01 -2.9310E-02  7.9929E-07  6.0700E-07  1.2972E-09  1.7686E-13
160951  1.2137E+03  1.1164E+03 -1.6012E+03  6.1485E+02 -7.6403E-02  1.0123E-01 -6.1235E-02  1.3788E+03 -1.3817E+03  6.1485E+02  1.5512E-01  2.6265E-01 -6.1235E-02  8.2783E-07  4.2153E-07  1.2972E-09  1.8066E-13
160957  0.0000E+00  1.2184E+03 -1.4318E+03  9.1370E+02 -0.0000E+00  0.0000E+00  0.0000E+00  1.2184E+03 -1.4318E+03  9.1370E+02  2.0703E-01  1.7617E-01  0.0000E+00  8.3481E-07  3.2153E-07  1.2972E-09  1.7971E-13
160989  0.0000E+00  2.0099E+03 -8.6506E+02  8.5232E+02 -0.0000E+00 -0.0000E+00  0.0000E+00  2.0099E+03 -8.6506E+02  8.5232E+02  1.2508E-01  2.9061E-01  0.0000E+00  9.2327E-07  4.9827E-07  1.2972E-09  2.6979E-13
