id t x y z vx vy vz xi yi zi vxi vyi vzi FGrav FDrag FSol FTide
432070  0.0000E+00 -6.1343E+02  2.5968E+01 -1.4001E+03 -0.0000E+00 -0.0000E+00  0.0000E+00 -6.1343E+02  2.5968E+01 -1.4001E+03 -3.7548E-03 -8.8696E-02  0.0000E+00  3.1006E-02  4.3855E-04  1.2973E-06  5.3920E-09
432629  0.0000E+00 -6.1173E+02  4.6200E+01 -1.3752E+03 -0.0000E+00 -0.0000E+00  0.0000E+00 -6.1173E+02  4.6200E+01 -1.3752E+03 -6.6801E-03 -8.8451E-02  0.0000E+00  3.1040E-02  3.7259E-04  1.2973E-06  5.2965E-09
