id t x y z vx vy vz xi yi zi vxi vyi vzi FGrav FDrag FSol FTide
62669  0.0000E+00  1.4789E+03 -7.8163E+02  1.1834E+03 -0.0000E+00 -0.0000E+00  0.0000E+00  1.4789E+03 -7.8163E+02  1.1834E+03  1.1302E-01  2.1384E-01  0.0000E+00  9.0295E-07  5.2601E-07  1.2972E-09  2.2555E-13
62949  0.0000E+00  1.7188E+03 -6.9731E+02  1.1803E+03 -0.0000E+00 -0.0000E+00  0.0000E+00  1.7188E+03 -6.9731E+02  1.1803E+03  1.0082E-01  2.4852E-01  0.0000E+00  9.1061E-07  4.7855E-07  1.2972E-09  2.5646E-13
