id t x y z vx vy vz xi yi zi vxi vyi vzi FGrav FDrag FSol FTide
70035  0.0000E+00  1.1271E+03  2.7430E+02  1.2101E+03 -0.0000E+00 -0.0000E+00  0.0000E+00  1.1271E+03  2.7430E+02  1.2101E+03 -3.9661E-02  1.6296E-01  0.0000E+00  7.8722E-04  6.1912E-05  1.2972E-07  2.3026E-10
70036  0.0000E+00  1.1148E+03  2.7910E+02  1.2316E+03 -0.0000E+00 -0.0000E+00  0.0000E+00  1.1148E+03  2.7910E+02  1.2316E+03 -4.0356E-02  1.6119E-01  0.0000E+00  7.6689E-04  5.1222E-05  1.2972E-07  2.3050E-10
70036  6.0367E+02  1.1164E+03  2.6931E+02  1.2020E+03  4.4455E-03 -3.2602E-02 -9.8661E-02  1.0887E+03  3.6561E+02  1.2020E+03 -3.4494E-02  1.2882E-01 -9.8661E-02  7.7528E-04  1.9765E-05  1.2972E-07  2.3070E-10
70162  0.0000E+00  1.1043E+03  3.4383E+02  1.2651E+03 -0.0000E+00 -0.0000E+00  0.0000E+00  1.1043E+03  3.4383E+02  1.2651E+03 -4.9715E-02  1.5968E-01  0.0000E+00  7.4834E-04  4.9911E-05  1.2972E-07  2.3536E-10
70272  0.0000E+00  1.1066E+03  2.7861E+02  1.2287E+03  0.0000E+00 -0.0000E+00  0.0000E+00  1.1066E+03  2.7861E+02  1.2287E+03 -4.0284E-02  1.6001E-01  0.0000E+00  7.6689E-04  4.6515E-05  1.2972E-07  2.2930E-10
70910  0.0000E+00  1.0884E+03  3.7587E+02  1.2442E+03 -0.0000E+00 -0.0000E+00 -0.0000E+00  1.0884E+03  3.7587E+02  1.2442E+03 -5.4347E-02  1.5737E-01  0.0000E+00  7.1601E-04  3.7743E-05  1.2972E-07  2.3406E-10
70919  0.0000E+00  1.0980E+03  3.5162E+02  1.2589E+03 -0.0000E+00 -0.0000E+00  0.0000E+00  1.0980E+03  3.5162E+02  1.2589E+03 -5.0841E-02  1.5876E-01  0.0000E+00  7.4081E-04  5.1415E-05  1.2972E-07  2.3467E-10
70969  0.0000E+00  1.0889E+03  3.7293E+02  1.2581E+03 -0.0000E+00 -0.0000E+00 -0.0000E+00  1.0889E+03  3.7293E+02  1.2581E+03 -5.3922E-02  1.5744E-01  0.0000E+00  7.1650E-04  3.2455E-05  1.2972E-07  2.3486E-10
70969  6.0139E+02  1.0888E+03  3.6425E+02  1.2311E+03 -6.0708E-04 -2.9367E-02 -9.0171E-02  1.0531E+03  4.5744E+02  1.2311E+03 -5.3275E-02  1.2806E-01 -9.0171E-02  7.2484E-04  3.1955E-05  1.2972E-07  2.3417E-10
