id t x y z vx vy vz xi yi zi vxi vyi vzi FGrav FDrag FSol FTide
96886  0.0000E+00  2.4401E+03 -7.2531E+02 -2.1618E+02  0.0000E+00 -0.0000E+00  0.0000E+00  2.4401E+03 -7.2531E+02 -2.1618E+02  1.0487E-01  3.5282E-01  0.0000E+00  8.3945E-10  7.0493E-10  1.2972E-11  2.8899E-16
96945  0.0000E+00  2.4642E+03 -6.9765E+02 -2.5391E+02  0.0000E+00 -0.0000E+00 -0.0000E+00  2.4642E+03 -6.9765E+02 -2.5391E+02  1.0087E-01  3.5631E-01 -0.0000E+00  8.1281E-10  1.4232E-09  1.2972E-11  2.9204E-16
96945  6.1544E+02  2.4691E+03 -7.1441E+02 -2.7859E+02  1.5901E-04 -3.4618E-02 -6.4537E-02  2.5229E+03 -4.9215E+02 -2.7859E+02  1.0346E-01  3.2240E-01 -6.4537E-02  7.8384E-10  3.7838E-10  1.2972E-11  3.0641E-16
96945  1.2184E+03  2.4543E+03 -7.2934E+02 -3.1993E+02 -5.2897E-02 -1.2365E-02 -6.5865E-02  2.5442E+03 -2.8790E+02 -3.1993E+02  5.2559E-02  3.4251E-01 -6.5865E-02  7.5143E-10  1.5696E-10  1.2972E-11  3.1658E-16
96945  1.8062E+03  2.4063E+03 -7.2693E+02 -3.5252E+02 -1.1077E-01  2.2981E-02 -4.2067E-02  2.5124E+03 -8.0978E+01 -3.5252E+02 -5.6616E-03  3.7091E-01 -4.2067E-02  7.8812E-10  2.6698E-11  1.2972E-11  3.2108E-16
96945  2.4130E+03  2.3215E+03 -6.9847E+02 -3.6657E+02 -1.6868E-01  7.2973E-02 -2.2459E-03  2.4204E+03  1.3725E+02 -3.6657E+02 -6.7689E-02  4.0864E-01 -2.2459E-03  8.7174E-10  4.7298E-12  1.2972E-11  3.1963E-16
