id t x y z vx vy vz xi yi zi vxi vyi vzi FGrav FDrag FSol FTide
14037  0.0000E+00  1.0768E+03  4.1129E+02  1.0102E+03 -0.0000E+00 -0.0000E+00  0.0000E+00  1.0768E+03  4.1129E+02  1.0102E+03 -5.9469E-02  1.5569E-01  0.0000E+00  2.2827E-08  3.6564E-08  1.2973E-10  6.9549E-15
14037  6.1516E+02  1.0389E+03  3.9298E+02  9.9176E+02 -1.0184E-01 -5.2021E-02 -6.9056E-02  9.9993E+02  4.8372E+02  9.9176E+02 -1.5866E-01  9.8202E-02 -6.9056E-02  2.2454E-08  8.1582E-09  1.2973E-10  6.7754E-15
14037  1.2060E+03  9.7298E+02  3.5395E+02  9.2635E+02 -1.1835E-01 -7.7637E-02 -1.5195E-01  8.9682E+02  5.1739E+02  9.2635E+02 -1.6953E-01  6.3048E-02 -1.5195E-01  2.1381E-08  2.3662E-09  1.2973E-10  6.3285E-15
14037  1.8065E+03  8.9968E+02  3.0261E+02  8.1083E+02 -1.2684E-01 -9.1953E-02 -2.3149E-01  7.9101E+02  5.2468E+02  8.1083E+02 -1.7060E-01  3.8132E-02 -2.3149E-01  2.0541E-08  1.9850E-09  1.2973E-10  5.7203E-15
14037  2.4014E+03  8.1938E+02  2.4586E+02  6.5026E+02 -1.4382E-01 -9.7359E-02 -3.0909E-01  6.8681E+02  5.1002E+02  6.5026E+02 -1.7937E-01  2.1116E-02 -3.0909E-01  1.9786E-08  1.6204E-09  1.2973E-10  4.9872E-15
14037  3.0001E+03  7.2794E+02  1.8802E+02  4.4157E+02 -1.6289E-01 -9.4573E-02 -3.8840E-01  5.8150E+02  4.7656E+02  4.4157E+02 -1.9008E-01  1.0682E-02 -3.8840E-01  2.0446E-08  1.1400E-09  1.2973E-10  4.1288E-15
14048  0.0000E+00  1.1479E+03  5.6160E+02  1.0706E+03 -0.0000E+00  0.0000E+00 -0.0000E+00  1.1479E+03  5.6160E+02  1.0706E+03 -8.1202E-02  1.6597E-01  0.0000E+00  2.2822E-08  1.6271E-09  1.2973E-10  7.6583E-15
14048  6.1302E+02  1.1460E+03  5.4731E+02  1.0456E+03 -9.1645E-03 -4.8072E-02 -8.5191E-02  1.0931E+03  6.4661E+02  1.0456E+03 -8.8300E-02  1.1763E-01 -8.5191E-02  2.2812E-08  3.9147E-10  1.2973E-10  7.5855E-15
14048  1.2047E+03  1.1396E+03  5.0423E+02  9.7259E+02 -1.3095E-02 -9.8139E-02 -1.6134E-01  1.0350E+03  6.9411E+02  9.7259E+02 -8.6002E-02  6.6642E-02 -1.6134E-01  2.3123E-08  2.0568E-10  1.2973E-10  7.3316E-15
14164  0.0000E+00  9.9839E+02  2.9488E+02  7.3255E+02 -0.0000E+00 -0.0000E+00  0.0000E+00  9.9839E+02  2.9488E+02  7.3255E+02 -4.2637E-02  1.4436E-01  0.0000E+00  2.0548E-08  2.3860E-08  1.2973E-10  5.8840E-15
14164  6.0525E+02  9.7598E+02  2.8479E+02  7.1014E+02 -6.4464E-02 -3.1623E-02 -7.6087E-02  9.4736E+02  3.6901E+02  7.1014E+02 -1.0564E-01  1.0950E-01 -7.6087E-02  2.0366E-08  9.0831E-09  1.2973E-10  5.7930E-15
14164  1.2015E+03  9.3344E+02  2.5731E+02  6.4119E+02 -7.3051E-02 -5.9803E-02 -1.5395E-01  8.7491E+02  4.1479E+02  6.4119E+02 -1.1026E-01  7.5164E-02 -1.5395E-01  1.9643E-08  1.0167E-09  1.2973E-10  5.4801E-15
14164  1.8114E+03  8.8879E+02  2.1359E+02  5.2467E+02 -7.4653E-02 -8.2555E-02 -2.2808E-01  8.0318E+02  4.3643E+02  5.2467E+02 -1.0554E-01  4.5957E-02 -2.2808E-01  1.9009E-08  9.0121E-10  1.2973E-10  5.0391E-15
14164  2.4020E+03  8.4165E+02  1.5942E+02  3.6911E+02 -8.7309E-02 -9.9971E-02 -2.9919E-01  7.3714E+02  4.3637E+02  3.6911E+02 -1.1036E-01  2.1725E-02 -2.9919E-01  1.9393E-08  8.2992E-10  1.2973E-10  4.5167E-15
14410  0.0000E+00  1.0738E+03  4.2367E+02  9.9840E+02 -0.0000E+00  0.0000E+00  0.0000E+00  1.0738E+03  4.2367E+02  9.9840E+02 -6.1259E-02  1.5527E-01  0.0000E+00  2.2725E-08  8.5538E-09  1.2973E-10  6.9458E-15
14410  6.1208E+02  1.0649E+03  4.1343E+02  9.7584E+02 -3.9441E-02 -3.3316E-02 -7.4956E-02  1.0242E+03  5.0594E+02  9.7584E+02 -9.9219E-02  1.2066E-01 -7.4956E-02  2.2333E-08  1.4395E-08  1.2973E-10  6.8837E-15
14410  1.2067E+03  1.0333E+03  3.8509E+02  9.0603E+02 -6.1668E-02 -6.0504E-02 -1.5981E-01  9.5073E+02  5.5861E+02  9.0603E+02 -1.1735E-01  8.8897E-02 -1.5981E-01  2.1858E-08  3.3402E-09  1.2973E-10  6.5827E-15
14410  1.8038E+03  9.9589E+02  3.3862E+02  7.8625E+02 -6.2165E-02 -9.5084E-02 -2.3894E-01  8.7489E+02  5.8398E+02  7.8625E+02 -1.1113E-01  4.8913E-02 -2.3894E-01  2.1162E-08  1.1784E-09  1.2973E-10  6.1234E-15
14410  2.4033E+03  9.5370E+02  2.7560E+02  6.2046E+02 -7.8301E-02 -1.1644E-01 -3.1452E-01  8.0284E+02  5.8390E+02  6.2046E+02 -1.1815E-01  2.1461E-02 -3.1452E-01  1.9714E-08  7.3896E-10  1.2973E-10  5.5443E-15
14410  3.0032E+03  9.0367E+02  1.9845E+02  4.1086E+02 -9.0879E-02 -1.3946E-01 -3.8389E-01  7.3631E+02  5.6023E+02  4.1086E+02 -1.1957E-01 -8.7978E-03 -3.8389E-01  1.8853E-08  1.0230E-09  1.2973E-10  4.8727E-15
14499  0.0000E+00  9.4405E+02  1.5017E+02  8.6331E+02 -0.0000E+00 -0.0000E+00  0.0000E+00  9.4405E+02  1.5017E+02  8.6331E+02 -2.1713E-02  1.3650E-01  0.0000E+00  2.1335E-08  3.3656E-08  1.2973E-10  5.6467E-15
14499  6.1686E+02  9.1275E+02  1.4433E+02  8.4729E+02 -8.8449E-02 -1.4952E-02 -5.5899E-02  8.9626E+02  2.2506E+02  8.4729E+02 -1.0932E-01  1.1702E-01 -5.5899E-02  2.0731E-08  1.9341E-08  1.2973E-10  5.5701E-15
14499  1.2116E+03  8.4816E+02  1.3360E+02  7.9271E+02 -1.2474E-01 -2.0164E-02 -1.3055E-01  8.1190E+02  2.7938E+02  7.9271E+02 -1.4405E-01  1.0247E-01 -1.3055E-01  2.0039E-08  8.1640E-09  1.2973E-10  5.2435E-15
14499  1.8112E+03  7.6939E+02  1.2203E+02  6.8830E+02 -1.3463E-01 -1.7603E-02 -2.1755E-01  7.1156E+02  3.1707E+02  6.8830E+02 -1.5228E-01  9.3644E-02 -2.1755E-01  1.9656E-08  2.2892E-09  1.2973E-10  4.7301E-15
14499  2.4040E+03  6.8900E+02  1.1377E+02  5.3449E+02 -1.3703E-01 -9.4428E-03 -3.0129E-01  6.0904E+02  3.4167E+02  5.3449E+02 -1.5348E-01  9.0180E-02 -3.0129E-01  2.0146E-08  1.0439E-09  1.2973E-10  4.0936E-15
14592  0.0000E+00  1.0667E+03  3.8978E+02  9.5869E+02 -0.0000E+00 -0.0000E+00  0.0000E+00  1.0667E+03  3.8978E+02  9.5869E+02 -5.6359E-02  1.5423E-01  0.0000E+00  2.2598E-08  1.1604E-08  1.2973E-10  6.7715E-15
14659  0.0000E+00  1.1140E+03  4.8716E+02  1.1821E+03 -0.0000E+00  0.0000E+00  0.0000E+00  1.1140E+03  4.8716E+02  1.1821E+03 -7.0440E-02  1.6108E-01  0.0000E+00  2.2966E-08  2.0426E-08  1.2973E-10  7.5950E-15
14659  6.1652E+02  1.0912E+03  4.7824E+02  1.1595E+03 -6.7320E-02 -2.9534E-02 -7.3595E-02  1.0443E+03  5.7349E+02  1.1595E+03 -1.3647E-01  1.2825E-01 -7.3595E-02  2.2266E-08  1.4416E-08  1.2973E-10  7.4682E-15
14659  1.2032E+03  1.0424E+03  4.5399E+02  1.0929E+03 -9.3535E-02 -5.0371E-02 -1.5464E-01  9.4806E+02  6.2757E+02  1.0929E+03 -1.5918E-01  1.0035E-01 -1.5464E-01  2.2105E-08  5.3080E-09  1.2973E-10  7.0933E-15
14659  1.8117E+03  9.7846E+02  4.2045E+02  9.7355E+02 -1.1547E-01 -6.0737E-02 -2.3833E-01  8.3620E+02  6.5950E+02  9.7355E+02 -1.7626E-01  8.0740E-02 -2.3833E-01  2.1475E-08  3.8551E-09  1.2973E-10  6.5132E-15
14659  2.4080E+03  9.0587E+02  3.7986E+02  8.0752E+02 -1.2718E-01 -7.5075E-02 -3.1720E-01  7.2191E+02  6.6613E+02  8.0752E+02 -1.8211E-01  5.5906E-02 -3.1720E-01  2.0592E-08  1.7182E-09  1.2973E-10  5.7834E-15
14659  3.0043E+03  8.2553E+02  3.3226E+02  5.9624E+02 -1.4293E-01 -8.3939E-02 -3.9150E-01  6.0903E+02  6.4883E+02  5.9624E+02 -1.9097E-01  3.5426E-02 -3.9150E-01  1.9920E-08  1.1372E-09  1.2973E-10  4.9295E-15
14659  3.6022E+03  7.3324E+02  2.8076E+02  3.3970E+02 -1.6855E-01 -8.7673E-02 -4.6729E-01  4.9630E+02  6.0840E+02  3.3970E+02 -2.0915E-01  1.8347E-02 -4.6729E-01  2.1737E-08  9.3323E-10  1.2973E-10  3.9668E-15
14671  0.0000E+00  1.1140E+03  4.8762E+02  1.1735E+03 -0.0000E+00  0.0000E+00  0.0000E+00  1.1140E+03  4.8762E+02  1.1735E+03 -7.0506E-02  1.6107E-01  0.0000E+00  2.2966E-08  1.8994E-08  1.2973E-10  7.5784E-15
14671  6.0595E+02  1.0914E+03  4.7807E+02  1.1493E+03 -7.0131E-02 -3.2032E-02 -7.7871E-02  1.0454E+03  5.7173E+02  1.1493E+03 -1.3926E-01  1.2577E-01 -7.7871E-02  2.2290E-08  1.0210E-08  1.2973E-10  7.4480E-15
14671  1.2006E+03  1.0403E+03  4.5232E+02  1.0781E+03 -9.5233E-02 -5.2144E-02 -1.6183E-01  9.4658E+02  6.2521E+02  1.0781E+03 -1.6063E-01  9.8280E-02 -1.6183E-01  2.2105E-08  5.9453E-09  1.2973E-10  7.0528E-15
14671  1.8033E+03  9.7702E+02  4.1785E+02  9.5564E+02 -1.1429E-01 -6.3554E-02 -2.4474E-01  8.3627E+02  6.5559E+02  9.5564E+02 -1.7471E-01  7.7714E-02 -2.4474E-01  2.1475E-08  3.9254E-09  1.2973E-10  6.4691E-15
14671  2.4035E+03  9.0509E+02  3.7493E+02  7.8481E+02 -1.2546E-01 -7.8777E-02 -3.2308E-01  7.2329E+02  6.6077E+02  7.8481E+02 -1.7968E-01  5.2091E-02 -3.2308E-01  2.0396E-08  2.1284E-09  1.2973E-10  5.7320E-15
14671  3.0034E+03  8.2518E+02  3.2468E+02  5.6862E+02 -1.4183E-01 -8.8170E-02 -3.9764E-01  6.1198E+02  6.4173E+02  5.6862E+02 -1.8878E-01  3.1143E-02 -3.9764E-01  1.9988E-08  1.3778E-09  1.2973E-10  4.8725E-15
14689  0.0000E+00  1.1019E+03  4.3359E+02  1.1393E+03 -0.0000E+00  0.0000E+00 -0.0000E+00  1.1019E+03  4.3359E+02  1.1393E+03 -6.2693E-02  1.5933E-01  0.0000E+00  2.3235E-08  3.4401E-09  1.2973E-10  7.3533E-15
14690  0.0000E+00  1.0842E+03  4.1807E+02  1.0477E+03 -0.0000E+00 -0.0000E+00  0.0000E+00  1.0842E+03  4.1807E+02  1.0477E+03 -6.0449E-02  1.5676E-01  0.0000E+00  2.2779E-08  1.6140E-08  1.2973E-10  7.0710E-15
14690  6.0897E+02  1.0700E+03  4.1249E+02  1.0211E+03 -4.6569E-02 -1.8876E-02 -8.3342E-02  1.0296E+03  5.0499E+02  1.0211E+03 -1.0621E-01  1.3584E-01 -8.3342E-02  2.2827E-08  3.2504E-08  1.2973E-10  6.9909E-15
14690  1.2073E+03  1.0235E+03  3.9371E+02  9.4846E+02 -9.4901E-02 -4.4570E-02 -1.6223E-01  9.3956E+02  5.6549E+02  9.4846E+02 -1.5183E-01  1.0342E-01 -1.6223E-01  2.1883E-08  5.9529E-09  1.2973E-10  6.6380E-15
14690  1.8073E+03  9.6410E+02  3.5978E+02  8.2625E+02 -1.0033E-01 -6.8509E-02 -2.4358E-01  8.3842E+02  5.9664E+02  8.2625E+02 -1.5235E-01  7.0891E-02 -2.4358E-01  2.1073E-08  7.6950E-10  1.2973E-10  6.0903E-15
14690  2.4042E+03  9.0141E+02  3.1366E+02  6.5897E+02 -1.1180E-01 -8.4962E-02 -3.1745E-01  7.4064E+02  6.0197E+02  6.5897E+02 -1.5716E-01  4.5374E-02 -3.1745E-01  1.9898E-08  1.4391E-09  1.2973E-10  5.4206E-15
14690  3.0070E+03  8.3009E+02  2.5811E+02  4.4527E+02 -1.2651E-01 -9.8329E-02 -3.9110E-01  6.4414E+02  5.8374E+02  4.4527E+02 -1.6383E-01  2.1694E-02 -3.9110E-01  1.9769E-08  1.3279E-09  1.2973E-10  4.6334E-15
14691  0.0000E+00  1.0773E+03  3.4215E+02  1.0743E+03 -0.0000E+00  0.0000E+00 -0.0000E+00  1.0773E+03  3.4215E+02  1.0743E+03 -4.9472E-02  1.5576E-01  0.0000E+00  2.3123E-08  1.8903E-08  1.2973E-10  6.9461E-15
14691  6.1517E+02  1.0592E+03  3.3184E+02  1.0446E+03 -4.9410E-02 -3.8170E-02 -9.8625E-02  1.0255E+03  4.2462E+02  1.0446E+03 -9.7391E-02  1.1498E-01 -9.8625E-02  2.2793E-08  7.9265E-09  1.2973E-10  6.8549E-15
14691  1.2037E+03  1.0287E+03  2.9679E+02  9.5925E+02 -5.1521E-02 -7.8173E-02 -1.8939E-01  9.6176E+02  4.7043E+02  9.5925E+02 -9.4434E-02  7.0567E-02 -1.8939E-01  2.2688E-08  1.1499E-09  1.2973E-10  6.5383E-15
14748  0.0000E+00  1.1133E+03  4.7515E+02  1.1472E+03 -0.0000E+00  0.0000E+00  0.0000E+00  1.1133E+03  4.7515E+02  1.1472E+03 -6.8702E-02  1.6097E-01  0.0000E+00  2.2943E-08  2.1352E-08  1.2973E-10  7.4972E-15
14748  6.0290E+02  1.0902E+03  4.5941E+02  1.1224E+03 -6.4333E-02 -5.0703E-02 -8.4900E-02  1.0461E+03  5.5259E+02  1.1224E+03 -1.3076E-01  1.0694E-01 -8.4900E-02  2.2545E-08  4.2944E-09  1.2973E-10  7.3559E-15
14748  1.2080E+03  1.0467E+03  4.2132E+02  1.0443E+03 -8.5223E-02 -6.8805E-02 -1.7093E-01  9.5760E+02  5.9680E+02  1.0443E+03 -1.4614E-01  8.2544E-02 -1.7093E-01  2.2275E-08  1.1294E-08  1.2973E-10  6.9637E-15
14748  1.8084E+03  9.8469E+02  3.7524E+02  9.1687E+02 -1.1484E-01 -8.6895E-02 -2.5376E-01  8.5422E+02  6.1704E+02  9.1687E+02 -1.6910E-01  5.5483E-02 -2.5376E-01  2.1579E-08  3.0797E-09  1.2973E-10  6.3715E-15
14748  2.4026E+03  9.1344E+02  3.1828E+02  7.4299E+02 -1.2726E-01 -1.0293E-01 -3.2931E-01  7.5051E+02  6.1025E+02  7.4299E+02 -1.7328E-01  2.9148E-02 -3.2931E-01  2.0334E-08  3.3319E-09  1.2973E-10  5.6340E-15
14748  3.0088E+03  8.3070E+02  2.5300E+02  5.2013E+02 -1.4546E-01 -1.1158E-01 -4.0565E-01  6.4670E+02  5.7953E+02  5.2013E+02 -1.8204E-01  8.5335E-03 -4.0565E-01  1.9459E-08  1.1852E-09  1.2973E-10  4.7625E-15
14757  0.0000E+00  9.6586E+02  1.7850E+02  9.5690E+02 -0.0000E+00 -0.0000E+00  0.0000E+00  9.6586E+02  1.7850E+02  9.5690E+02 -2.5809E-02  1.3965E-01  0.0000E+00  2.2351E-08  2.6548E-08  1.2973E-10  5.9710E-15
14757  6.0218E+02  9.4466E+02  1.7428E+02  9.4530E+02 -6.3891E-02 -9.0998E-03 -4.7069E-02  9.2593E+02  2.5577E+02  9.4530E+02 -8.9091E-02  1.2749E-01 -4.7069E-02  2.1887E-08  1.8230E-08  1.2973E-10  5.9401E-15
14757  1.2096E+03  8.9386E+02  1.6720E+02  8.9313E+02 -9.4124E-02 -1.2590E-02 -1.2603E-01  8.5112E+02  3.2019E+02  8.9313E+02 -1.1830E-01  1.1665E-01 -1.2603E-01  2.1106E-08  8.8772E-09  1.2973E-10  5.6766E-15
14757  1.8068E+03  8.3224E+02  1.5988E+02  7.9532E+02 -1.1289E-01 -1.1424E-02 -2.0304E-01  7.6270E+02  3.6942E+02  7.9532E+02 -1.3600E-01  1.0891E-01 -2.0304E-01  2.0176E-08  6.3411E-09  1.2973E-10  5.2462E-15
14757  2.4038E+03  7.6222E+02  1.5333E+02  6.4891E+02 -1.1942E-01 -1.0227E-02 -2.8747E-01  6.6441E+02  4.0378E+02  6.4891E+02 -1.4159E-01  9.9983E-02 -2.8747E-01  1.9749E-08  1.4817E-09  1.2973E-10  4.6602E-15
14757  3.0008E+03  6.9015E+02  1.4813E+02  4.5247E+02 -1.2322E-01 -6.7305E-03 -3.7069E-01  5.6392E+02  4.2455E+02  4.5247E+02 -1.4464E-01  9.3059E-02 -3.7069E-01  2.0627E-08  1.8740E-09  1.2973E-10  3.9580E-15
14829  0.0000E+00  9.6487E+02  1.7170E+02  9.5093E+02 -0.0000E+00 -0.0000E+00  0.0000E+00  9.6487E+02  1.7170E+02  9.5093E+02 -2.4826E-02  1.3951E-01  0.0000E+00  2.2351E-08  3.8037E-08  1.2973E-10  5.9426E-15
14829  6.1943E+02  9.3007E+02  1.5616E+02  9.4244E+02 -9.8350E-02 -4.2297E-02 -4.0236E-02  9.1238E+02  2.3873E+02  9.4244E+02 -1.2093E-01  9.2184E-02 -4.0236E-02  2.1811E-08  1.1488E-08  1.2973E-10  5.8501E-15
14829  1.2156E+03  8.6305E+02  1.2848E+02  8.9650E+02 -1.2391E-01 -4.8539E-02 -1.1485E-01  8.2728E+02  2.7742E+02  8.9650E+02 -1.4248E-01  7.6250E-02 -1.1485E-01  2.0949E-08  7.4062E-09  1.2973E-10  5.5084E-15
14829  1.8139E+03  7.8244E+02  1.0043E+02  8.0410E+02 -1.4534E-01 -4.3586E-02 -1.9554E-01  7.2965E+02  2.9986E+02  8.0410E+02 -1.5986E-01  6.9549E-02 -1.9554E-01  2.0087E-08  5.4060E-09  1.2973E-10  4.9959E-15
14829  2.4039E+03  6.9300E+02  7.7952E+01  6.6343E+02 -1.5618E-01 -3.1542E-02 -2.8132E-01  6.2500E+02  3.0935E+02  6.6343E+02 -1.6745E-01  6.8660E-02 -2.8132E-01  1.9890E-08  1.7689E-09  1.2973E-10  4.3364E-15
14829  3.0012E+03  5.9814E+02  6.4849E+01  4.6957E+02 -1.6164E-01 -1.0914E-02 -3.6838E-01  5.1544E+02  3.1033E+02  4.6957E+02 -1.7102E-01  7.5572E-02 -3.6838E-01  2.1114E-08  1.2245E-09  1.2973E-10  3.5439E-15
14863  0.0000E+00  1.0712E+03  2.9577E+02  1.1457E+03 -0.0000E+00  0.0000E+00 -0.0000E+00  1.0712E+03  2.9577E+02  1.1457E+03 -4.2765E-02  1.5489E-01  0.0000E+00  2.3605E-08  8.1624E-09  1.2973E-10  6.9785E-15
14863  6.0108E+02  1.0646E+03  2.8668E+02  1.1178E+03 -2.4642E-02 -2.6988E-02 -9.2461E-02  1.0357E+03  3.7801E+02  1.1178E+03 -6.6094E-02  1.2695E-01 -9.2461E-02  2.3142E-08  8.3364E-09  1.2973E-10  6.9476E-15
14864  0.0000E+00  1.0805E+03  3.4140E+02  1.1597E+03 -0.0000E+00  0.0000E+00  0.0000E+00  1.0805E+03  3.4140E+02  1.1597E+03 -4.9363E-02  1.5624E-01  0.0000E+00  2.3442E-08  1.5154E-08  1.2973E-10  7.1306E-15
14864  6.0841E+02  1.0656E+03  3.3019E+02  1.1353E+03 -4.9400E-02 -3.7154E-02 -8.1489E-02  1.0325E+03  4.2254E+02  1.1353E+03 -9.7143E-02  1.1693E-01 -8.1489E-02  2.3375E-08  1.3782E-08  1.2973E-10  7.0608E-15
14864  1.2071E+03  1.0249E+03  2.9777E+02  1.0595E+03 -8.0137E-02 -7.0696E-02 -1.7407E-01  9.5763E+02  4.7122E+02  1.0595E+03 -1.2319E-01  7.7497E-02 -1.7407E-01  2.2732E-08  3.8976E-09  1.2973E-10  6.7254E-15
14864  1.8023E+03  9.7647E+02  2.4706E+02  9.2890E+02 -8.0790E-02 -9.8754E-02 -2.6361E-01  8.7985E+02  4.9032E+02  9.2890E+02 -1.1651E-01  4.2436E-02 -2.6361E-01  2.2342E-08  1.2006E-09  1.2973E-10  6.2112E-15
14864  2.4024E+03  9.2834E+02  1.8041E+02  7.4622E+02 -8.1791E-02 -1.1914E-01 -3.4435E-01  8.1148E+02  4.8567E+02  7.4622E+02 -1.0788E-01  1.5092E-02 -3.4435E-01  2.0036E-08  1.2472E-08  1.2973E-10  5.5862E-15
14864  3.0037E+03  8.7588E+02  1.0481E+02  5.1406E+02 -9.0721E-02 -1.3277E-01 -4.2466E-01  7.5046E+02  4.6363E+02  5.1406E+02 -1.0587E-01 -6.1288E-03 -4.2466E-01  1.8702E-08  7.2229E-10  1.2973E-10  4.8761E-15
14982  0.0000E+00  1.0684E+03  2.8045E+02  1.1369E+03 -0.0000E+00  0.0000E+00  0.0000E+00  1.0684E+03  2.8045E+02  1.1369E+03 -4.0550E-02  1.5448E-01  0.0000E+00  2.3822E-08  1.1828E-08  1.2973E-10  6.9205E-15
14982  6.1069E+02  1.0588E+03  2.7156E+02  1.1070E+03 -2.7673E-02 -3.1880E-02 -9.6672E-02  1.0307E+03  3.6387E+02  1.1070E+03 -6.6938E-02  1.2121E-01 -9.6672E-02  2.3418E-08  2.9187E-09  1.2973E-10  6.8785E-15
