id t x y z vx vy vz xi yi zi vxi vyi vzi FGrav FDrag FSol FTide
306040  0.0000E+00 -1.7927E+03  4.6579E+02  1.3800E+03 -0.0000E+00 -0.0000E+00  0.0000E+00 -1.7927E+03  4.6579E+02  1.3800E+03 -6.7349E-02 -2.5921E-01  0.0000E+00  2.6707E-08  1.9631E-08  1.2973E-10  6.5905E-15
306040  6.0589E+02 -1.7861E+03  4.5277E+02  1.3801E+03  1.8828E-02 -4.9615E-02  2.1984E-04 -1.8189E+03  2.9475E+02  1.3801E+03 -4.6638E-02 -3.0787E-01  2.1984E-04  2.6943E-08  2.0895E-08  1.2973E-10  6.8122E-15
306075  0.0000E+00 -1.8630E+03  4.1001E+02  1.3048E+03 -0.0000E+00 -0.0000E+00  0.0000E+00 -1.8630E+03  4.1001E+02  1.3048E+03 -5.9284E-02 -2.6937E-01  0.0000E+00  2.7026E-08  3.0448E-08  1.2973E-10  6.8422E-15
306075  6.0745E+02 -1.8793E+03  3.9809E+02  1.2988E+03 -5.0253E-02 -4.0465E-02 -2.3734E-02 -1.9070E+03  2.3170E+02  1.2988E+03 -1.0781E-01 -3.1220E-01 -2.3734E-02  2.6580E-08  2.3778E-08  1.2973E-10  7.1650E-15
306075  1.2000E+03 -1.9134E+03  3.6155E+02  1.2737E+03 -5.7515E-02 -8.0857E-02 -6.3835E-02 -1.9470E+03  2.5782E+01  1.2737E+03 -1.0979E-01 -3.5751E-01 -6.3835E-02  2.6116E-08  1.1331E-08  1.2973E-10  7.5537E-15
306075  1.8137E+03 -1.9457E+03  3.0392E+02  1.2197E+03 -5.0195E-02 -1.0355E-01 -1.1489E-01 -1.9579E+03 -2.1090E+02  1.2197E+03 -9.4139E-02 -3.8488E-01 -1.1489E-01  2.5837E-08  1.0861E-08  1.2973E-10  7.9336E-15
306075  2.4086E+03 -1.9720E+03  2.3604E+02  1.1333E+03 -3.2980E-02 -1.2630E-01 -1.7589E-01 -1.9342E+03 -4.5111E+02  1.1333E+03 -6.7110E-02 -4.1144E-01 -1.7589E-01  2.6099E-08  5.0640E-09  1.2973E-10  8.2533E-15
306075  3.0048E+03 -1.9801E+03  1.5246E+02  1.0113E+03  8.9128E-03 -1.5415E-01 -2.3184E-01 -1.8603E+03 -6.9517E+02  1.0113E+03 -1.3131E-02 -4.4045E-01 -2.3184E-01  2.7793E-08  6.3791E-10  1.2973E-10  8.4565E-15
306299  0.0000E+00 -1.4825E+03  5.1234E+02  1.6291E+03 -0.0000E+00 -0.0000E+00  0.0000E+00 -1.4825E+03  5.1234E+02  1.6291E+03 -7.4080E-02 -2.1435E-01  0.0000E+00  2.5780E-08  3.6669E-08  1.2973E-10  5.8333E-15
306299  6.0011E+02 -1.5027E+03  4.8771E+02  1.6237E+03 -6.2234E-02 -7.4860E-02 -2.5617E-02 -1.5393E+03  3.5565E+02  1.6237E+03 -1.3275E-01 -2.9214E-01 -2.5617E-02  2.5297E-08  2.1716E-08  1.2973E-10  6.0361E-15
306299  1.2044E+03 -1.5520E+03  4.2777E+02  1.5921E+03 -9.6411E-02 -1.1586E-01 -8.7404E-02 -1.6027E+03  1.5238E+02  1.5921E+03 -1.5826E-01 -3.4027E-01 -8.7404E-02  2.5533E-08  7.2907E-09  1.2973E-10  6.3370E-15
306423  0.0000E+00 -1.4654E+03  4.9885E+02  1.6009E+03 -0.0000E+00 -0.0000E+00  0.0000E+00 -1.4654E+03  4.9885E+02  1.6009E+03 -7.2130E-02 -2.1189E-01  0.0000E+00  2.6559E-08  5.7011E-08  1.2973E-10  5.7562E-15
306423  6.0850E+02 -1.4800E+03  4.3305E+02  1.5920E+03 -4.4856E-02 -1.8540E-01 -3.6023E-02 -1.5123E+03  3.0133E+02  1.5920E+03 -1.0747E-01 -3.9939E-01 -3.6023E-02  2.6637E-08  1.6503E-08  1.2973E-10  5.9516E-15
306423  1.2003E+03 -1.5151E+03  3.1459E+02  1.5508E+03 -7.9775E-02 -2.1035E-01 -9.8881E-02 -1.5467E+03  4.8223E+01  1.5508E+03 -1.2526E-01 -4.2942E-01 -9.8881E-02  2.6200E-08  1.2352E-08  1.2973E-10  6.2181E-15
306423  1.8002E+03 -1.5710E+03  1.8380E+02  1.4684E+03 -1.0099E-01 -2.1973E-01 -1.8378E-01 -1.5654E+03 -2.2670E+02  1.4684E+03 -1.2757E-01 -4.4688E-01 -1.8378E-01  2.7950E-08  2.6330E-09  1.2973E-10  6.5575E-15
306511  0.0000E+00 -1.4874E+03  5.3023E+02  1.6148E+03 -0.0000E+00 -0.0000E+00 -0.0000E+00 -1.4874E+03  5.3023E+02  1.6148E+03 -7.6666E-02 -2.1507E-01  0.0000E+00  2.5391E-08  3.5582E-08  1.2973E-10  5.8268E-15
306511  6.0412E+02 -1.5215E+03  5.2347E+02  1.5948E+03 -9.6257E-02 -1.5091E-02 -7.1229E-02 -1.5613E+03  3.8874E+02  1.5948E+03 -1.7195E-01 -2.3508E-01 -7.1229E-02  2.6097E-08  1.5059E-08  1.2973E-10  6.0560E-15
306551  0.0000E+00 -1.8989E+03  3.0390E+02  1.2261E+03 -0.0000E+00  0.0000E+00 -0.0000E+00 -1.8989E+03  3.0390E+02  1.2261E+03 -4.3941E-02 -2.7457E-01  0.0000E+00  2.7576E-08  1.6114E-08  1.2973E-10  7.0446E-15
306553  0.0000E+00 -1.8987E+03  4.5731E+02  1.2255E+03 -0.0000E+00 -0.0000E+00 -0.0000E+00 -1.8987E+03  4.5731E+02  1.2255E+03 -6.6123E-02 -2.7453E-01  0.0000E+00  2.6452E-08  3.7408E-08  1.2973E-10  6.9084E-15
306553  6.0958E+02 -1.9244E+03  4.4491E+02  1.1983E+03 -7.5942E-02 -3.2461E-02 -8.7079E-02 -1.9561E+03  2.7378E+02  1.1983E+03 -1.4027E-01 -3.1071E-01 -8.7079E-02  2.5663E-08  2.4932E-08  1.2973E-10  7.2855E-15
306553  1.2187E+03 -1.9783E+03  4.2211E+02  1.1217E+03 -9.2463E-02 -4.1733E-02 -1.6111E-01 -2.0217E+03  6.8773E+01  1.1217E+03 -1.5350E-01 -3.2778E-01 -1.6111E-01  2.4418E-08  1.1729E-08  1.2973E-10  7.7814E-15
306553  1.8200E+03 -2.0294E+03  3.9374E+02  1.0067E+03 -7.3415E-02 -5.3496E-02 -2.1918E-01 -2.0620E+03 -1.4773E+02  1.0067E+03 -1.3035E-01 -3.4693E-01 -2.1918E-01  2.3667E-08  6.1690E-09  1.2973E-10  8.2758E-15
306553  2.4134E+03 -2.0618E+03  3.5662E+02  8.6280E+02 -3.3456E-02 -7.3089E-02 -2.6365E-01 -2.0595E+03 -3.6986E+02  8.6280E+02 -8.5020E-02 -3.7121E-01 -2.6365E-01  2.3831E-08  2.4823E-09  1.2973E-10  8.6912E-15
306553  3.0093E+03 -2.0676E+03  3.0448E+02  6.9568E+02  1.4790E-02 -1.0409E-01 -2.9552E-01 -2.0033E+03 -5.9541E+02  6.9568E+02 -2.9234E-02 -4.0304E-01 -2.9552E-01  2.4747E-08  8.3704E-10  1.2973E-10  8.9759E-15
306553  3.6145E+03 -2.0434E+03  2.2844E+02  5.1016E+02  6.5227E-02 -1.4983E-01 -3.1555E-01 -1.8847E+03 -8.2204E+02  5.1016E+02  3.2197E-02 -4.4529E-01 -3.1555E-01  2.6039E-08  3.5568E-10  1.2973E-10  9.0901E-15
306553  4.2077E+03 -1.9902E+03  1.2277E+02  3.2007E+02  1.1419E-01 -2.0877E-01 -3.2336E-01 -1.7032E+03 -1.0367E+03  3.2007E+02  9.6443E-02 -4.9653E-01 -3.2336E-01  2.8411E-08  7.3684E-11  1.2973E-10  8.9987E-15
306665  0.0000E+00 -1.8897E+03  3.4525E+02  1.2203E+03 -0.0000E+00  0.0000E+00 -0.0000E+00 -1.8897E+03  3.4525E+02  1.2203E+03 -4.9920E-02 -2.7323E-01  0.0000E+00  2.7201E-08  1.6691E-08  1.2973E-10  6.9697E-15
306666  0.0000E+00 -1.8884E+03  3.5440E+02  1.2175E+03 -0.0000E+00  0.0000E+00 -0.0000E+00 -1.8884E+03  3.5440E+02  1.2175E+03 -5.1244E-02 -2.7304E-01  0.0000E+00  2.7201E-08  1.8327E-08  1.2973E-10  6.9557E-15
306666  6.1239E+02 -1.8897E+03  3.4389E+02  1.1967E+03  5.6513E-04 -3.4121E-02 -6.7764E-02 -1.9127E+03  1.7544E+02  1.1967E+03 -4.9159E-02 -3.0736E-01 -6.7764E-02  2.7459E-08  1.0454E-08  1.2973E-10  7.2290E-15
306666  1.2018E+03 -1.8852E+03  3.1646E+02  1.1386E+03  1.5891E-02 -6.0323E-02 -1.3107E-01 -1.9115E+03 -1.4257E+01  1.1386E+03 -2.9866E-02 -3.3291E-01 -1.3107E-01  2.7617E-08  1.2897E-08  1.2973E-10  7.4627E-15
306728  0.0000E+00 -1.8400E+03  4.4380E+02  1.3469E+03 -0.0000E+00 -0.0000E+00  0.0000E+00 -1.8400E+03  4.4380E+02  1.3469E+03 -6.4169E-02 -2.6604E-01  0.0000E+00  2.6780E-08  1.8688E-08  1.2973E-10  6.7526E-15
306730  0.0000E+00 -1.8644E+03  4.2885E+02  1.3060E+03 -0.0000E+00 -0.0000E+00  0.0000E+00 -1.8644E+03  4.2885E+02  1.3060E+03 -6.2008E-02 -2.6958E-01  0.0000E+00  2.6840E-08  2.1037E-08  1.2973E-10  6.8332E-15
306730  6.0523E+02 -1.8695E+03  4.2067E+02  1.2963E+03 -1.4598E-02 -2.5223E-02 -3.2281E-02 -1.8991E+03  2.5566E+02  1.2963E+03 -7.5423E-02 -2.9554E-01 -3.2281E-02  2.7026E-08  1.8606E-08  1.2973E-10  7.1105E-15
306730  1.2063E+03 -1.8895E+03  3.9592E+02  1.2701E+03 -5.0043E-02 -5.9186E-02 -5.4431E-02 -1.9295E+03  6.2014E+01  1.2701E+03 -1.0729E-01 -3.3239E-01 -5.4431E-02  2.6874E-08  1.9107E-08  1.2973E-10  7.4400E-15
306730  1.8145E+03 -1.9222E+03  3.4680E+02  1.2258E+03 -5.4662E-02 -9.6928E-02 -9.5446E-02 -1.9464E+03 -1.6362E+02  1.2258E+03 -1.0481E-01 -3.7486E-01 -9.5446E-02  2.6360E-08  1.1625E-08  1.2973E-10  7.8157E-15
306730  2.4136E+03 -1.9539E+03  2.8154E+02  1.1513E+03 -4.8612E-02 -1.2096E-01 -1.5425E-01 -1.9324E+03 -4.0355E+02  1.1513E+03 -8.9320E-02 -4.0348E-01 -1.5425E-01  2.6627E-08  7.3198E-09  1.2973E-10  8.1590E-15
306730  3.0027E+03 -1.9737E+03  2.0171E+02  1.0431E+03 -1.5167E-02 -1.4961E-01 -2.1143E-01 -1.8754E+03 -6.4723E+02  1.0431E+03 -4.4333E-02 -4.3498E-01 -2.1143E-01  2.6952E-08  1.9212E-09  1.2973E-10  8.4113E-15
306781  0.0000E+00 -1.4780E+03  5.0866E+02  1.6263E+03 -0.0000E+00 -0.0000E+00  0.0000E+00 -1.4780E+03  5.0866E+02  1.6263E+03 -7.3547E-02 -2.1371E-01  0.0000E+00  2.5780E-08  6.0846E-08  1.2973E-10  5.8186E-15
306781  6.0206E+02 -1.4915E+03  4.5473E+02  1.6223E+03 -4.0677E-02 -1.4162E-01 -2.0004E-02 -1.5253E+03  3.2334E+02  1.6223E+03 -1.0643E-01 -3.5727E-01 -2.0004E-02  2.5241E-08  1.8248E-08  1.2973E-10  6.0096E-15
306781  1.2113E+03 -1.5244E+03  3.5449E+02  1.5913E+03 -6.7306E-02 -1.7783E-01 -8.4882E-02 -1.5628E+03  8.3435E+01  1.5913E+03 -1.1856E-01 -3.9824E-01 -8.4882E-02  2.5662E-08  1.1099E-08  1.2973E-10  6.2696E-15
306781  1.8004E+03 -1.5719E+03  2.4648E+02  1.5222E+03 -9.1156E-02 -1.8805E-01 -1.5349E-01 -1.5824E+03 -1.6643E+02  1.5222E+03 -1.2679E-01 -4.1534E-01 -1.5349E-01  2.6490E-08  6.8834E-09  1.2973E-10  6.5653E-15
306813  0.0000E+00 -1.4498E+03  3.6464E+02  1.5547E+03 -0.0000E+00 -0.0000E+00  0.0000E+00 -1.4498E+03  3.6464E+02  1.5547E+03 -5.2723E-02 -2.0963E-01  0.0000E+00  2.7472E-08  4.9769E-08  1.2973E-10  5.6991E-15
306813  6.0872E+02 -1.4817E+03  3.3616E+02  1.5561E+03 -8.8579E-02 -8.4758E-02 -2.7182E-03 -1.5055E+03  2.0462E+02  1.5561E+03 -1.3718E-01 -2.9899E-01 -2.7182E-03  2.6916E-08  2.6540E-08  1.2973E-10  5.9575E-15
306813  1.2070E+03 -1.5431E+03  2.7521E+02  1.5389E+03 -1.1094E-01 -1.1158E-01 -6.0586E-02 -1.5674E+03  3.0866E+00  1.5389E+03 -1.5073E-01 -3.3470E-01 -6.0586E-02  2.6856E-08  1.1542E-08  1.2973E-10  6.3237E-15
306813  1.8021E+03 -1.6098E+03  2.0771E+02  1.4782E+03 -1.0945E-01 -1.1045E-01 -1.4865E-01 -1.6090E+03 -2.1404E+02  1.4782E+03 -1.3948E-01 -3.4321E-01 -1.4865E-01  2.7429E-08  1.0317E-09  1.2973E-10  6.6975E-15
306818  0.0000E+00 -1.8801E+03  4.7649E+02  1.1832E+03 -0.0000E+00  0.0000E+00 -0.0000E+00 -1.8801E+03  4.7649E+02  1.1832E+03 -6.8896E-02 -2.7184E-01  0.0000E+00  2.6195E-08  1.6312E-08  1.2973E-10  6.8145E-15
306818  6.0149E+02 -1.8738E+03  4.7091E+02  1.1585E+03  2.4918E-02 -2.0684E-02 -8.0706E-02 -1.9077E+03  3.0637E+02  1.1585E+03 -4.3173E-02 -2.9163E-01 -8.0706E-02  2.6715E-08  9.6254E-09  1.2973E-10  7.0632E-15
306818  1.2006E+03 -1.8489E+03  4.5287E+02  1.0887E+03  5.7606E-02 -3.7869E-02 -1.5126E-01 -1.8993E+03  1.2672E+02  1.0887E+03 -7.8752E-03 -3.0521E-01 -1.5126E-01  2.7311E-08  1.4814E-08  1.2973E-10  7.2295E-15
306866  0.0000E+00 -1.8873E+03  4.9815E+02  1.1998E+03 -0.0000E+00 -0.0000E+00 -0.0000E+00 -1.8873E+03  4.9815E+02  1.1998E+03 -7.2029E-02 -2.7288E-01  0.0000E+00  2.5900E-08  2.9544E-08  1.2973E-10  6.8291E-15
306866  6.0197E+02 -1.8928E+03  4.8973E+02  1.1622E+03 -3.2813E-03 -2.3254E-02 -1.1613E-01 -1.9282E+03  3.2334E+02  1.1622E+03 -7.4093E-02 -2.9693E-01 -1.1613E-01  2.6195E-08  1.0477E-08  1.2973E-10  7.1243E-15
306866  1.2102E+03 -1.8812E+03  4.7187E+02  1.0699E+03  4.0396E-02 -3.6528E-02 -1.8384E-01 -1.9346E+03  1.3715E+02  1.0699E+03 -2.7832E-02 -3.0854E-01 -1.8384E-01  2.6075E-08  9.8295E-09  1.2973E-10  7.3544E-15
306866  1.8003E+03 -1.8453E+03  4.4213E+02  9.4554E+02  8.4658E-02 -7.0602E-02 -2.3668E-01 -1.8969E+03 -4.7701E+01  9.4554E+02  2.0729E-02 -3.3741E-01 -2.3668E-01  2.7398E-08  1.5943E-09  1.2973E-10  7.4736E-15
306867  0.0000E+00 -1.8819E+03  4.6883E+02  1.1861E+03 -0.0000E+00  0.0000E+00 -0.0000E+00 -1.8819E+03  4.6883E+02  1.1861E+03 -6.7790E-02 -2.7211E-01  0.0000E+00  2.6188E-08  2.3768E-08  1.2973E-10  6.8278E-15
306867  6.0658E+02 -1.8844E+03  4.6496E+02  1.1580E+03  1.2870E-03 -1.4314E-02 -8.8896E-02 -1.9179E+03  2.9811E+02  1.1580E+03 -6.5942E-02 -2.8678E-01 -8.8896E-02  2.6512E-08  1.2229E-08  1.2973E-10  7.1101E-15
306867  1.2046E+03 -1.8751E+03  4.5450E+02  1.0834E+03  2.8865E-02 -2.0563E-02 -1.6003E-01 -1.9255E+03  1.2267E+02  1.0834E+03 -3.6852E-02 -2.9169E-01 -1.6003E-01  2.6480E-08  1.5124E-08  1.2973E-10  7.3366E-15
306867  1.8040E+03 -1.8497E+03  4.3489E+02  9.6940E+02  5.6766E-02 -5.1144E-02 -2.1949E-01 -1.8993E+03 -5.6850E+01  9.6940E+02 -6.1159E-03 -3.1860E-01 -2.1949E-01  2.7968E-08  4.6813E-09  1.2973E-10  7.4921E-15
306949  0.0000E+00 -1.8710E+03  4.3246E+02  1.1567E+03 -0.0000E+00 -0.0000E+00 -0.0000E+00 -1.8710E+03  4.3246E+02  1.1567E+03 -6.2531E-02 -2.7053E-01  0.0000E+00  2.7150E-08  3.6401E-08  1.2973E-10  6.8099E-15
306949  6.0934E+02 -1.8887E+03  4.2458E+02  1.1200E+03 -4.9613E-02 -2.0104E-02 -1.1302E-01 -1.9187E+03  2.5674E+02  1.1200E+03 -1.1100E-01 -2.9320E-01 -1.1302E-01  2.6792E-08  2.2142E-08  1.2973E-10  7.1535E-15
306949  1.2192E+03 -1.9184E+03  4.0618E+02  1.0274E+03 -4.1371E-02 -4.0033E-02 -1.8681E-01 -1.9599E+03  6.3454E+01  1.0274E+03 -1.0010E-01 -3.1742E-01 -1.8681E-01  2.6197E-08  9.9290E-09  1.2973E-10  7.5534E-15
306949  1.8035E+03 -1.9307E+03  3.7472E+02  9.0158E+02  4.6762E-03 -7.0775E-02 -2.4027E-01 -1.9620E+03 -1.3572E+02  9.0158E+02 -4.9505E-02 -3.4994E-01 -2.4027E-01  2.7353E-08  1.9446E-09  1.2973E-10  7.8826E-15
306949  2.4044E+03 -1.9093E+03  3.1843E+02  7.4608E+02  6.6224E-02 -1.1898E-01 -2.7456E-01 -1.9035E+03 -3.5110E+02  7.4608E+02  2.0182E-02 -3.9504E-01 -2.7456E-01  2.7336E-08  3.8269E-10  1.2973E-10  8.0732E-15
306949  3.0072E+03 -1.8513E+03  2.2798E+02  5.7357E+02  1.2572E-01 -1.8425E-01 -2.9614E-01 -1.7751E+03 -5.7307E+02  5.7357E+02  9.2757E-02 -4.5193E-01 -2.9614E-01  2.9490E-08  1.3024E-10  1.2973E-10  8.0718E-15
