id t x y z vx vy vz xi yi zi vxi vyi vzi FGrav FDrag FSol FTide
140312  0.0000E+00  6.8495E+02 -9.5183E+02 -6.0052E+02 -0.0000E+00  0.0000E+00  0.0000E+00  6.8495E+02 -9.5183E+02 -6.0052E+02  1.3763E-01  9.9038E-02  0.0000E+00  8.7820E-04  1.3664E-05  1.2972E-07  1.0167E-10
140312  6.0828E+02  6.8783E+02 -9.3066E+02 -5.7462E+02  1.1157E-02  6.8749E-02  8.4737E-02  7.6692E+02 -8.6664E+02 -5.7462E+02  1.4572E-01  1.6820E-01  8.4737E-02  8.5202E-04  1.3676E-05  1.2972E-07  9.9358E-11
