id t x y z vx vy vz xi yi zi vxi vyi vzi FGrav FDrag FSol FTide
98018  0.0000E+00  2.4352E+03 -7.1151E+02 -2.5278E+02 -0.0000E+00 -0.0000E+00 -0.0000E+00  2.4352E+03 -7.1151E+02 -2.5278E+02  1.0288E-01  3.5211E-01 -0.0000E+00  8.3296E-10  1.1999E-09  1.2972E-11  2.8785E-16
98018  6.0439E+02  2.4026E+03 -7.1481E+02 -2.7296E+02 -9.9903E-02  6.0939E-03 -3.5334E-02  2.4558E+03 -5.0239E+02 -2.7296E+02  3.4528E-03  3.5349E-01 -3.5334E-02  8.4402E-10  7.2415E-11  1.2972E-11  2.9733E-16
98020  0.0000E+00  2.4481E+03 -7.0901E+02 -2.5264E+02  0.0000E+00 -0.0000E+00 -0.0000E+00  2.4481E+03 -7.0901E+02 -2.5264E+02  1.0252E-01  3.5398E-01 -0.0000E+00  8.0280E-10  2.4630E-09  1.2972E-11  2.8962E-16
98020  6.0549E+02  2.4449E+03 -7.3681E+02 -3.0054E+02 -3.2656E-02 -5.6312E-02 -1.0710E-01  2.5000E+03 -5.2021E+02 -3.0054E+02  7.3880E-02  2.9721E-01 -1.0710E-01  7.8555E-10  1.7488E-10  1.2972E-11  3.0176E-16
98020  1.2178E+03  2.4036E+03 -7.6204E+02 -3.6059E+02 -1.0141E-01 -2.2877E-02 -8.5322E-02  2.4999E+03 -3.2921E+02 -3.6059E+02  8.7774E-03  3.2466E-01 -8.5322E-02  7.8003E-10  5.0838E-11  1.2972E-11  3.0788E-16
98020  1.8182E+03  2.3239E+03 -7.6183E+02 -4.0143E+02 -1.6335E-01  2.5899E-02 -4.8668E-02  2.4420E+03 -1.3173E+02 -4.0143E+02 -5.3201E-02  3.6192E-01 -4.8668E-02  8.3906E-10  1.8094E-11  1.2972E-11  3.0803E-16
98020  2.4036E+03  2.2117E+03 -7.2968E+02 -4.1608E+02 -2.1917E-01  8.5995E-02  6.7543E-04  2.3280E+03  6.7220E+01 -4.1608E+02 -1.1366E-01  4.0579E-01  6.7543E-04  8.9963E-10  1.4381E-11  1.2972E-11  3.0236E-16
98038  0.0000E+00  2.3328E+03 -7.9717E+02 -1.6915E+02  0.0000E+00 -0.0000E+00  0.0000E+00  2.3328E+03 -7.9717E+02 -1.6915E+02  1.1526E-01  3.3730E-01  0.0000E+00  8.8360E-10  1.2590E-09  1.2972E-11  2.7415E-16
98038  6.0633E+02  2.3119E+03 -8.2207E+02 -1.4641E+02 -8.4043E-02 -5.3589E-02  5.8067E-02  2.3750E+03 -6.1649E+02 -1.4641E+02  3.4822E-02  2.8069E-01  5.8067E-02  9.0222E-10  1.4866E-10  1.2972E-11  2.8598E-16
98039  0.0000E+00  2.3192E+03 -8.0116E+02 -1.4284E+02  0.0000E+00 -0.0000E+00  0.0000E+00  2.3192E+03 -8.0116E+02 -1.4284E+02  1.1584E-01  3.3534E-01  0.0000E+00  9.0222E-10  7.0251E-10  1.2972E-11  2.7298E-16
98077  0.0000E+00  2.3705E+03 -7.9396E+02 -1.9827E+02  0.0000E+00 -0.0000E+00  0.0000E+00  2.3705E+03 -7.9396E+02 -1.9827E+02  1.1480E-01  3.4276E-01  0.0000E+00  8.7061E-10  2.1597E-09  1.2972E-11  2.7836E-16
98077  6.1447E+02  2.3719E+03 -8.4194E+02 -1.7770E+02 -1.8066E-02 -1.1082E-01  5.0552E-02  2.4373E+03 -6.2817E+02 -1.7770E+02  1.0367E-01  2.3213E-01  5.0552E-02  8.3988E-10  3.7733E-10  1.2972E-11  2.9287E-16
98077  1.2147E+03  2.3390E+03 -9.0548E+02 -1.4140E+02 -9.1918E-02 -9.0904E-02  7.0949E-02  2.4612E+03 -4.8286E+02 -1.4140E+02  3.9008E-02  2.4730E-01  7.0949E-02  8.3572E-10  1.2378E-10  1.2972E-11  3.0244E-16
98077  1.8030E+03  2.2653E+03 -9.4309E+02 -9.5008E+01 -1.5396E-01 -3.3681E-02  8.4403E-02  2.4319E+03 -3.2732E+02 -9.5008E+01 -1.7597E-02  2.9386E-01  8.4403E-02  8.8046E-10  3.0859E-10  1.2972E-11  3.0638E-16
98129  0.0000E+00  2.4447E+03 -7.0319E+02 -2.5701E+02  0.0000E+00 -0.0000E+00 -0.0000E+00  2.4447E+03 -7.0319E+02 -2.5701E+02  1.0168E-01  3.5348E-01 -0.0000E+00  8.2137E-10  1.8834E-09  1.2972E-11  2.8924E-16
98129  6.0523E+02  2.4230E+03 -7.0633E+02 -2.9505E+02 -7.5710E-02  8.4894E-03 -7.8371E-02  2.4755E+03 -4.9186E+02 -2.9505E+02  2.6419E-02  3.5884E-01 -7.8371E-02  7.9532E-10  9.9878E-11  1.2972E-11  2.9975E-16
98129  1.2193E+03  2.3560E+03 -6.8794E+02 -3.3351E+02 -1.4086E-01  5.3567E-02 -4.3526E-02  2.4401E+03 -2.6407E+02 -3.3351E+02 -4.1385E-02  3.9423E-01 -4.3526E-02  8.4046E-10  1.1754E-11  1.2972E-11  3.0347E-16
98146  0.0000E+00  2.3278E+03 -7.9617E+02 -1.5496E+02  0.0000E+00 -0.0000E+00  0.0000E+00  2.3278E+03 -7.9617E+02 -1.5496E+02  1.1512E-01  3.3658E-01  0.0000E+00  8.8453E-10  9.8244E-10  1.2972E-11  2.7391E-16
98147  0.0000E+00  2.3345E+03 -7.9039E+02 -1.5308E+02  0.0000E+00 -0.0000E+00  0.0000E+00  2.3345E+03 -7.9039E+02 -1.5308E+02  1.1428E-01  3.3754E-01  0.0000E+00  8.9081E-10  1.2860E-09  1.2972E-11  2.7498E-16
98147  6.0371E+02  2.3180E+03 -8.1975E+02 -1.2953E+02 -6.5855E-02 -7.1027E-02  7.0448E-02  2.3807E+03 -6.1454E+02 -1.2953E+02  5.2673E-02  2.6414E-01  7.0448E-02  9.0669E-10  2.2146E-10  1.2972E-11  2.8728E-16
98149  0.0000E+00  2.3482E+03 -7.9663E+02 -1.7902E+02  0.0000E+00 -0.0000E+00  0.0000E+00  2.3482E+03 -7.9663E+02 -1.7902E+02  1.1519E-01  3.3952E-01  0.0000E+00  8.8360E-10  2.2785E-09  1.2972E-11  2.7589E-16
98149  6.0382E+02  2.3367E+03 -8.4682E+02 -1.4164E+02 -5.5931E-02 -1.2131E-01  9.7498E-02  2.4016E+03 -6.3985E+02 -1.4164E+02  6.6512E-02  2.1655E-01  9.7498E-02  8.6855E-10  2.6027E-10  1.2972E-11  2.8880E-16
98149  1.2087E+03  2.2742E+03 -9.0891E+02 -7.5016E+01 -1.4557E-01 -7.3608E-02  1.1958E-01  2.3976E+03 -4.9962E+02 -7.5016E+01 -1.4149E-02  2.5522E-01  1.1958E-01  9.0095E-10  2.0551E-10  1.2972E-11  2.9536E-16
98245  0.0000E+00  2.4206E+03 -7.4354E+02 -2.0460E+02  0.0000E+00 -0.0000E+00  0.0000E+00  2.4206E+03 -7.4354E+02 -2.0460E+02  1.0751E-01  3.5000E-01  0.0000E+00  8.3019E-10  6.4150E-10  1.2972E-11  2.8619E-16
98245  6.0079E+02  2.4139E+03 -7.4988E+02 -1.9229E+02 -3.5443E-02 -7.2710E-03  3.8376E-02  2.4699E+03 -5.3762E+02 -1.9229E+02  7.2984E-02  3.4176E-01  3.8376E-02  8.5836E-10  2.2186E-11  1.2972E-11  3.0003E-16
98286  0.0000E+00  2.4496E+03 -7.0021E+02 -2.5779E+02  0.0000E+00 -0.0000E+00 -0.0000E+00  2.4496E+03 -7.0021E+02 -2.5779E+02  1.0124E-01  3.5420E-01 -0.0000E+00  7.9415E-10  1.7538E-09  1.2972E-11  2.8996E-16
98286  6.1683E+02  2.4345E+03 -7.0554E+02 -2.9591E+02 -5.7145E-02  3.8089E-03 -7.9972E-02  2.4877E+03 -4.8590E+02 -2.9591E+02  4.4871E-02  3.5582E-01 -7.9972E-02  7.9532E-10  1.1935E-10  1.2972E-11  3.0156E-16
98286  1.2041E+03  2.3817E+03 -6.9191E+02 -3.3593E+02 -1.2103E-01  4.4012E-02 -5.2678E-02  2.4656E+03 -2.6889E+02 -3.3593E+02 -2.0990E-02  3.8839E-01 -5.2678E-02  8.4046E-10  1.9737E-11  1.2972E-11  3.0657E-16
98286  1.8106E+03  2.2901E+03 -6.4989E+02 -3.5506E+02 -1.8032E-01  9.6206E-02 -8.3599E-03  2.3803E+03 -3.5020E+01 -3.5506E+02 -8.6349E-02  4.2734E-01 -8.3599E-03  9.0273E-10  1.1555E-11  1.2972E-11  3.0569E-16
98344  0.0000E+00  2.3568E+03 -7.9630E+02 -1.8378E+02  0.0000E+00 -0.0000E+00  0.0000E+00  2.3568E+03 -7.9630E+02 -1.8378E+02  1.1514E-01  3.4077E-01  0.0000E+00  8.5846E-10  1.7185E-09  1.2972E-11  2.7689E-16
98344  6.0669E+02  2.3636E+03 -8.3626E+02 -1.6185E+02 -2.0926E-04 -1.0982E-01  6.3537E-02  2.4278E+03 -6.2597E+02 -1.6185E+02  1.2071E-01  2.3194E-01  6.3537E-02  8.3784E-10  5.4666E-10  1.2972E-11  2.9215E-16
98344  1.2180E+03  2.3410E+03 -9.0433E+02 -1.1321E+02 -7.6174E-02 -9.8723E-02  9.3036E-02  2.4632E+03 -4.8021E+02 -1.1321E+02  5.4585E-02  2.3976E-01  9.3036E-02  8.3620E-10  1.2758E-10  1.2972E-11  3.0364E-16
98344  1.8051E+03  2.2778E+03 -9.4750E+02 -5.4135E+01 -1.3192E-01 -4.4791E-02  1.0543E-01  2.4452E+03 -3.2761E+02 -5.4135E+01  5.0849E-03  2.8456E-01  1.0543E-01  8.6129E-10  3.6364E-10  1.2972E-11  3.0942E-16
98344  2.4051E+03  2.1999E+03 -9.7200E+02  5.4377E+00 -1.2494E-01 -8.5642E-02  7.5199E-02  2.3995E+03 -1.6412E+02  5.4377E+00  1.5603E-02  2.3244E-01  7.5199E-02  9.3348E-10  1.5058E-09  1.2972E-11  3.1276E-16
98345  0.0000E+00  2.3647E+03 -7.8976E+02 -1.7965E+02  0.0000E+00 -0.0000E+00  0.0000E+00  2.3647E+03 -7.8976E+02 -1.7965E+02  1.1419E-01  3.4191E-01  0.0000E+00  8.7231E-10  1.4652E-09  1.2972E-11  2.7821E-16
98345  6.2267E+02  2.3760E+03 -8.1925E+02 -1.5185E+02  2.1472E-02 -8.3110E-02  8.0190E-02  2.4400E+03 -6.0230E+02 -1.5185E+02  1.3993E-01  2.6044E-01  8.0190E-02  8.5445E-10  7.1061E-10  1.2972E-11  2.9487E-16
98345  1.2014E+03  2.3733E+03 -8.6940E+02 -9.4026E+01 -3.6438E-02 -7.8864E-02  1.1487E-01  2.4878E+03 -4.4611E+02 -9.4026E+01  8.9270E-02  2.6429E-01  1.1487E-01  8.2123E-10  1.4927E-10  1.2972E-11  3.0885E-16
98345  1.8088E+03  2.3298E+03 -9.0397E+02 -1.8702E+01 -1.0557E-01 -3.0149E-02  1.3185E-01  2.4843E+03 -2.7081E+02 -1.8702E+01  2.5131E-02  3.0673E-01  1.3185E-01  8.3555E-10  1.3968E-10  1.2972E-11  3.1831E-16
98347  0.0000E+00  2.3495E+03 -7.8322E+02 -1.5963E+02  0.0000E+00 -0.0000E+00  0.0000E+00  2.3495E+03 -7.8322E+02 -1.5963E+02  1.1325E-01  3.3972E-01  0.0000E+00  8.9081E-10  2.1711E-09  1.2972E-11  2.7697E-16
98347  6.0243E+02  2.3570E+03 -8.2300E+02 -1.1903E+02 -2.3272E-03 -9.5260E-02  1.1215E-01  2.4197E+03 -6.1483E+02 -1.1903E+02  1.1667E-01  2.4554E-01  1.1215E-01  8.5075E-10  4.1579E-10  1.2972E-11  2.9269E-16
98347  1.2099E+03  2.3315E+03 -8.7235E+02 -4.0098E+01 -8.2374E-02 -5.9974E-02  1.4237E-01  2.4478E+03 -4.5325E+02 -4.0098E+01  4.3760E-02  2.7714E-01  1.4237E-01  8.4972E-10  7.2831E-11  1.2972E-11  3.0492E-16
98347  1.8010E+03  2.2600E+03 -8.9004E+02  4.7179E+01 -1.5916E-01  3.9799E-03  1.5110E-01  2.4130E+03 -2.7812E+02  4.7179E+01 -3.0464E-02  3.3076E-01  1.5110E-01  9.2331E-10  3.6984E-12  1.2972E-11  3.1067E-16
98460  0.0000E+00  2.3742E+03 -7.9437E+02 -2.1941E+02  0.0000E+00 -0.0000E+00  0.0000E+00  2.3742E+03 -7.9437E+02 -2.1941E+02  1.1486E-01  3.4328E-01  0.0000E+00  8.7061E-10  6.1166E-10  1.2972E-11  2.7828E-16
98476  0.0000E+00  2.3685E+03 -7.7239E+02 -1.5896E+02  0.0000E+00 -0.0000E+00  0.0000E+00  2.3685E+03 -7.7239E+02 -1.5896E+02  1.1168E-01  3.4247E-01  0.0000E+00  8.7079E-10  1.2991E-09  1.2972E-11  2.7977E-16
98476  6.1344E+02  2.3719E+03 -7.9198E+02 -1.3052E+02  2.6051E-03 -4.1705E-02  8.6739E-02  2.4327E+03 -5.7876E+02 -1.3052E+02  1.1712E-01  3.0125E-01  8.6739E-02  8.6479E-10  4.1532E-10  1.2972E-11  2.9537E-16
98476  1.2211E+03  2.3563E+03 -8.0977E+02 -6.2101E+01 -5.8407E-02 -1.2066E-02  1.3160E-01  2.4619E+03 -3.8331E+02 -6.2101E+01  5.8678E-02  3.2863E-01  1.3160E-01  8.4451E-10  9.8207E-11  1.2972E-11  3.0899E-16
98476  1.8077E+03  2.3002E+03 -8.0227E+02  1.8922E+01 -1.3279E-01  3.9969E-02  1.4147E-01  2.4294E+03 -1.8061E+02  1.8922E+01 -1.6788E-02  3.7256E-01  1.4147E-01  8.9842E-10  2.6360E-11  1.2972E-11  3.1642E-16
98477  0.0000E+00  2.3524E+03 -7.7893E+02 -1.5124E+02  0.0000E+00 -0.0000E+00  0.0000E+00  2.3524E+03 -7.7893E+02 -1.5124E+02  1.1263E-01  3.4013E-01  0.0000E+00  8.9081E-10  1.2978E-09  1.2972E-11  2.7768E-16
98477  6.0315E+02  2.3565E+03 -7.9535E+02 -1.1884E+02 -2.2161E-03 -3.8733E-02  1.0020E-01  2.4168E+03 -5.8708E+02 -1.1884E+02  1.1278E-01  3.0200E-01  1.0020E-01  8.5075E-10  4.0631E-10  1.2972E-11  2.9331E-16
98477  1.2036E+03  2.3339E+03 -8.0869E+02 -4.7152E+01 -7.6185E-02 -8.8184E-04  1.3159E-01  2.4387E+03 -3.9236E+02 -4.7152E+01  4.0744E-02  3.3658E-01  1.3159E-01  8.7671E-10  7.3641E-11  1.2972E-11  3.0600E-16
98478  0.0000E+00  2.3397E+03 -7.9190E+02 -1.6773E+02  0.0000E+00 -0.0000E+00  0.0000E+00  2.3397E+03 -7.9190E+02 -1.6773E+02  1.1450E-01  3.3830E-01  0.0000E+00  8.8340E-10  1.4700E-09  1.2972E-11  2.7523E-16
98478  6.0785E+02  2.3244E+03 -8.2876E+02 -1.4241E+02 -6.6901E-02 -9.6620E-02  7.3431E-02  2.3881E+03 -6.2153E+02 -1.4241E+02  5.2930E-02  2.3946E-01  7.3431E-02  8.9768E-10  4.2566E-10  1.2972E-11  2.8765E-16
98580  0.0000E+00  2.3321E+03 -8.0254E+02 -1.7729E+02  0.0000E+00 -0.0000E+00  0.0000E+00  2.3321E+03 -8.0254E+02 -1.7729E+02  1.1604E-01  3.3720E-01  0.0000E+00  8.8360E-10  1.1523E-09  1.2972E-11  2.7370E-16
98596  0.0000E+00  2.3225E+03 -7.9685E+02 -1.3704E+02  0.0000E+00 -0.0000E+00  0.0000E+00  2.3225E+03 -7.9685E+02 -1.3704E+02  1.1522E-01  3.3581E-01  0.0000E+00  9.0222E-10  7.1552E-10  1.2972E-11  2.7368E-16
98601  0.0000E+00  2.3300E+03 -7.8829E+02 -1.2797E+02  0.0000E+00 -0.0000E+00  0.0000E+00  2.3300E+03 -7.8829E+02 -1.2797E+02  1.1398E-01  3.3690E-01  0.0000E+00  8.9286E-10  6.9801E-10  1.2972E-11  2.7515E-16
98614  0.0000E+00  2.3813E+03 -7.8835E+02 -2.0610E+02  0.0000E+00 -0.0000E+00  0.0000E+00  2.3813E+03 -7.8835E+02 -2.0610E+02  1.1399E-01  3.4432E-01  0.0000E+00  8.7061E-10  1.8698E-09  1.2972E-11  2.7971E-16
98614  6.1388E+02  2.3966E+03 -8.1895E+02 -1.8804E+02  2.3238E-02 -6.7661E-02  4.9941E-02  2.4598E+03 -6.0327E+02 -1.8804E+02  1.4165E-01  2.7887E-01  4.9941E-02  8.2608E-10  3.8956E-10  1.2972E-11  2.9642E-16
98614  1.2110E+03  2.3963E+03 -8.5856E+02 -1.5105E+02 -2.6065E-02 -6.3179E-02  7.3705E-02  2.5093E+03 -4.2799E+02 -1.5105E+02  9.8075E-02  2.8331E-01  7.3705E-02  7.9289E-10  2.7223E-10  1.2972E-11  3.1072E-16
98614  1.8184E+03  2.3629E+03 -8.9017E+02 -9.7990E+01 -8.5733E-02 -3.5759E-02  1.0027E-01  2.5131E+03 -2.4543E+02 -9.7990E+01  4.2978E-02  3.0590E-01  1.0027E-01  8.0676E-10  1.5858E-10  1.2972E-11  3.2076E-16
98614  2.4041E+03  2.2949E+03 -8.9637E+02 -3.4117E+01 -1.4669E-01  2.0061E-02  1.1658E-01  2.4630E+03 -6.1001E+01 -3.4117E+01 -1.7088E-02  3.5188E-01  1.1658E-01  9.0170E-10  6.2969E-11  1.2972E-11  3.2499E-16
98615  0.0000E+00  2.3563E+03 -8.0078E+02 -1.9264E+02  0.0000E+00 -0.0000E+00  0.0000E+00  2.3563E+03 -8.0078E+02 -1.9264E+02  1.1579E-01  3.4071E-01  0.0000E+00  8.5846E-10  1.1161E-09  1.2972E-11  2.7647E-16
98615  6.1503E+02  2.3544E+03 -8.2790E+02 -1.8478E+02 -1.9114E-02 -8.4025E-02  2.4797E-02  2.4186E+03 -6.1553E+02 -1.8478E+02  1.0059E-01  2.5640E-01  2.4797E-02  8.7007E-10  5.6060E-10  1.2972E-11  2.9067E-16
98615  1.2112E+03  2.3189E+03 -8.7850E+02 -1.6506E+02 -1.0167E-01 -7.4240E-02  4.2497E-02  2.4365E+03 -4.6103E+02 -1.6506E+02  2.5356E-02  2.6105E-01  4.2497E-02  8.8163E-10  1.5584E-10  1.2972E-11  2.9935E-16
98616  0.0000E+00  2.3744E+03 -7.9264E+02 -2.0590E+02  0.0000E+00 -0.0000E+00  0.0000E+00  2.3744E+03 -7.9264E+02 -2.0590E+02  1.1461E-01  3.4332E-01  0.0000E+00  8.7061E-10  2.1448E-09  1.2972E-11  2.7870E-16
98616  6.0658E+02  2.3796E+03 -8.3852E+02 -2.0324E+02 -1.5816E-02 -1.0601E-01  7.2363E-03  2.4439E+03 -6.2686E+02 -2.0324E+02  1.0543E-01  2.3807E-01  7.2363E-03  8.4229E-10  4.0747E-10  1.2972E-11  2.9310E-16
98616  1.2107E+03  2.3473E+03 -8.9936E+02 -1.9428E+02 -9.2313E-02 -8.7234E-02  2.2830E-02  2.4681E+03 -4.7679E+02 -1.9428E+02  3.7727E-02  2.5217E-01  2.2830E-02  8.3573E-10  7.9789E-11  1.2972E-11  3.0207E-16
98616  1.8102E+03  2.2711E+03 -9.3530E+02 -1.7583E+02 -1.6011E-01 -2.8311E-02  4.0336E-02  2.4357E+03 -3.1578E+02 -1.7583E+02 -2.4874E-02  3.0006E-01  4.0336E-02  8.7602E-10  7.3366E-11  1.2972E-11  3.0496E-16
98743  0.0000E+00  2.3358E+03 -7.8742E+02 -1.4421E+02  0.0000E+00 -0.0000E+00  0.0000E+00  2.3358E+03 -7.8742E+02 -1.4421E+02  1.1385E-01  3.3773E-01  0.0000E+00  8.9081E-10  1.1839E-09  1.2972E-11  2.7548E-16
98743  6.0305E+02  2.3283E+03 -8.1240E+02 -1.2273E+02 -4.0027E-02 -6.5319E-02  7.0738E-02  2.3902E+03 -6.0655E+02 -1.2273E+02  7.7440E-02  2.7133E-01  7.0738E-02  8.8272E-10  4.0076E-10  1.2972E-11  2.8900E-16
98787  0.0000E+00  2.4601E+03 -6.9145E+02 -2.5853E+02  0.0000E+00 -0.0000E+00 -0.0000E+00  2.4601E+03 -6.9145E+02 -2.5853E+02  9.9978E-02  3.5570E-01 -0.0000E+00  7.9415E-10  5.2978E-10  1.2972E-11  2.9158E-16
98787  6.0329E+02  2.4381E+03 -6.8357E+02 -2.6689E+02 -7.0515E-02  3.0858E-02 -1.0907E-02  2.4884E+03 -4.6856E+02 -2.6689E+02  2.8323E-02  3.8339E-01 -1.0907E-02  8.2137E-10  1.6026E-11  1.2972E-11  3.0309E-16
98838  0.0000E+00  2.3699E+03 -7.7710E+02 -1.6654E+02  0.0000E+00 -0.0000E+00  0.0000E+00  2.3699E+03 -7.7710E+02 -1.6654E+02  1.1236E-01  3.4266E-01  0.0000E+00  8.7231E-10  7.4908E-10  1.2972E-11  2.7960E-16
98838  6.0438E+02  2.3699E+03 -7.8510E+02 -1.5055E+02  2.5875E-03 -2.8824E-02  5.9148E-02  2.4294E+03 -5.7526E+02 -1.5055E+02  1.1611E-01  3.1384E-01  5.9148E-02  8.7079E-10  9.9776E-10  1.2972E-11  2.9448E-16
98838  1.2134E+03  2.3646E+03 -8.0337E+02 -9.1391E+01 -3.3880E-02 -2.0287E-02  1.2507E-01  2.4685E+03 -3.7829E+02 -9.1391E+01  8.2280E-02  3.2161E-01  1.2507E-01  8.4733E-10  1.9170E-10  1.2972E-11  3.0918E-16
98838  1.8037E+03  2.3234E+03 -8.0249E+02 -1.1503E+01 -1.0640E-01  2.6407E-02  1.4161E-01  2.4518E+03 -1.7626E+02 -1.1503E+01  9.6350E-03  3.6235E-01  1.4161E-01  9.0480E-10  3.5789E-11  1.2972E-11  3.1860E-16
98839  0.0000E+00  2.3748E+03 -7.8959E+02 -1.9170E+02  0.0000E+00 -0.0000E+00  0.0000E+00  2.3748E+03 -7.8959E+02 -1.9170E+02  1.1417E-01  3.4337E-01  0.0000E+00  8.7231E-10  1.1762E-09  1.2972E-11  2.7920E-16
98839  6.1241E+02  2.3840E+03 -8.0941E+02 -1.7203E+02  2.0428E-02 -5.4604E-02  6.1200E-02  2.4462E+03 -5.9542E+02 -1.7203E+02  1.3746E-01  2.9010E-01  6.1200E-02  8.5846E-10  6.9960E-10  1.2972E-11  2.9536E-16
98839  1.2016E+03  2.3876E+03 -8.4623E+02 -1.2472E+02 -1.5206E-02 -6.4423E-02  9.8402E-02  2.4980E+03 -4.2075E+02 -1.2472E+02  1.0715E-01  2.8081E-01  9.8402E-02  8.0636E-10  2.7409E-10  1.2972E-11  3.1030E-16
98839  1.8107E+03  2.3588E+03 -8.7742E+02 -5.5905E+01 -8.0417E-02 -3.1802E-02  1.2508E-01  2.5056E+03 -2.3697E+02 -5.5905E+01  4.6450E-02  3.0927E-01  1.2508E-01  8.2034E-10  7.3845E-11  1.2972E-11  3.2148E-16
98839  2.4058E+03  2.2908E+03 -8.7984E+02  2.2633E+01 -1.4857E-01  2.7066E-02  1.3693E-01  2.4536E+03 -4.6220E+01  2.2633E+01 -2.1348E-02  3.5830E-01  1.3693E-01  9.1224E-10  4.6831E-11  1.2972E-11  3.2639E-16
