,Name,Address,Description,Longitude,Latitude,TimeStamp,TimeSpan:begin,TimeSpan:end,GettyID,id
27556,Babilonia,Babilonia,b.MAT.001.011,44.431644,32.541781,27556,,,,27556
27557,Babilonia,Babilonia,b.MAT.001.012,44.431644,32.541781,27557,,,,27557
27562,Babilonia,Babilonia,b.MAT.001.017,44.431644,32.541781,27562,,,,27562
27572,Belén,Belén,b.MAT.002.001,35.2024425,31.7053821,27572,,,,27572
27573,Jerusalén,Jerusalén,b.MAT.002.001,35.21371,31.768319,27573,,,,27573
27574,Judea,Judea,b.MAT.002.001,35.2035394,31.903215399999997,27574,,,,27574
27576,Jerusalén,Jerusalén,b.MAT.002.003,35.21371,31.768319,27576,,,,27576
27578,Belén,Belén,b.MAT.002.005,35.2024425,31.7053821,27578,,,,27578
27579,Judea,Judea,b.MAT.002.005,35.2035394,31.903215399999997,27579,,,,27579
27580,Belén,Belén,b.MAT.002.006,35.2024425,31.7053821,27580,,,,27580
27581,Judea,Judea,b.MAT.002.006,35.2035394,31.903215399999997,27581,,,,27581
27583,Belén,Belén,b.MAT.002.008,35.2024425,31.7053821,27583,,,,27583
27588,Egipto,Egipto,b.MAT.002.013,30.802497999999996,26.820553000000004,27588,,,,27588
27589,Egipto,Egipto,b.MAT.002.014,30.802497999999996,26.820553000000004,27589,,,,27589
27590,Egipto,Egipto,b.MAT.002.015,30.802497999999996,26.820553000000004,27590,,,,27590
27591,Belén,Belén,b.MAT.002.016,35.2024425,31.7053821,27591,,,,27591
27593,Ramá,Ramá,b.MAT.002.018,35.366984,32.937112,27593,,,,27593
27594,Egipto,Egipto,b.MAT.002.019,30.802497999999996,26.820553000000004,27594,,,,27594
27595,Israel,Israel,b.MAT.002.020,34.851612,31.046051000000002,27595,,,,27595
27596,Israel,Israel,b.MAT.002.021,34.851612,31.046051000000002,27596,,,,27596
27597,Judea,Judea,b.MAT.002.022,35.2035394,31.903215399999997,27597,,,,27597
27598,Galilea,Galilea,b.MAT.002.022,35.5879975,32.8244321,27598,,,,27598
27599,Nazaret,Nazaret,b.MAT.002.023,35.303546000000004,32.699635,27599,,,,27599
27600,Judea,Judea,b.MAT.003.001,35.2035394,31.903215399999997,27600,,,,27600
27604,Jordán,Jordán,b.MAT.003.005,36.238414,30.585164000000002,27604,,,,27604
27605,Jerusalén,Jerusalén,b.MAT.003.005,35.21371,31.768319,27605,,,,27605
27606,Judea,Judea,b.MAT.003.005,35.2035394,31.903215399999997,27606,,,,27606
27607,Jordán,Jordán,b.MAT.003.006,36.238414,30.585164000000002,27607,,,,27607
27614,Jordán,Jordán,b.MAT.003.013,36.238414,30.585164000000002,27614,,,,27614
27615,Galilea,Galilea,b.MAT.003.013,35.5879975,32.8244321,27615,,,,27615
27624,templo,templo,b.MAT.004.005,35.619167,33.186667,27624,,,,27624
27625,Jerusalén,Jerusalén,b.MAT.004.005,35.21371,31.768319,27625,,,,27625
27630,Nínive,Nínive,b.MAT.004.010,42.2362435,36.229574,27630,,,,27630
27632,Galilea,Galilea,b.MAT.004.012,35.5879975,32.8244321,27632,,,,27632
27633,mar mediterráneo,mar mediterráneo,b.MAT.004.013,18.0480105,34.5531284,27633,,,,27633
27634,Neftalí,Neftalí,b.MAT.004.013,35.553944,33.028429,27634,,,,27634
27635,Zabulón,Zabulón,b.MAT.004.013,35.117095,32.7932395,27635,,,,27635
27636,Nazaret,Nazaret,b.MAT.004.013,35.303546000000004,32.699635,27636,,,,27636
27637,Capernaúm,Capernaúm,b.MAT.004.013,35.573307,32.88033,27637,,,,27637
27639,Jordán,Jordán,b.MAT.004.015,36.238414,30.585164000000002,27639,,,,27639
27640,mar mediterráneo,mar mediterráneo,b.MAT.004.015,18.0480105,34.5531284,27640,,,,27640
27641,Neftalí,Neftalí,b.MAT.004.015,35.553944,33.028429,27641,,,,27641
27642,Zabulón,Zabulón,b.MAT.004.015,35.117095,32.7932395,27642,,,,27642
27643,Galilea,Galilea,b.MAT.004.015,35.5879975,32.8244321,27643,,,,27643
27644,Neftalí,Neftalí,b.MAT.004.016,35.553944,33.028429,27644,,,,27644
27645,Zabulón,Zabulón,b.MAT.004.016,35.117095,32.7932395,27645,,,,27645
27647,Galilea,Galilea,b.MAT.004.018,35.5879975,32.8244321,27647,,,,27647
27648,mar de Galilea,mar de Galilea,b.MAT.004.018,35.5879975,32.8244321,27648,,,,27648
27653,Galilea,Galilea,b.MAT.004.023,35.5879975,32.8244321,27653,,,,27653
27655,Siria,Siria,b.MAT.004.024,38.996815000000005,34.802075,27655,,,,27655
27656,Jordán,Jordán,b.MAT.004.025,36.238414,30.585164000000002,27656,,,,27656
27657,Jerusalén,Jerusalén,b.MAT.004.025,35.21371,31.768319,27657,,,,27657
27658,Judea,Judea,b.MAT.004.025,35.2035394,31.903215399999997,27658,,,,27658
27659,Galilea,Galilea,b.MAT.004.025,35.5879975,32.8244321,27659,,,,27659
27695,Jerusalén,Jerusalén,b.MAT.005.035,35.21371,31.768319,27695,,,,27695
27718,tierra,tierra,b.MAT.006.010,0.0,-90.0,27718,,,,27718
27779,Capernaúm,Capernaúm,b.MAT.008.005,35.573307,32.88033,27779,,,,27779
27784,Israel,Israel,b.MAT.008.010,34.851612,31.046051000000002,27784,,,,27784
27788,Judea,Judea,b.MAT.008.012,35.2035394,31.903215399999997,27788,,,,27788
27800,mar de Galilea,mar de Galilea,b.MAT.008.024,35.5879975,32.8244321,27800,,,,27800
27802,mar de Galilea,mar de Galilea,b.MAT.008.026,35.5879975,32.8244321,27802,,,,27802
27808,mar de Galilea,mar de Galilea,b.MAT.008.032,35.5879975,32.8244321,27808,,,,27808
27811,Nazaret,Nazaret,b.MAT.009.001,35.303546000000004,32.699635,27811,,,,27811
27836,Judea,Judea,b.MAT.009.026,35.2035394,31.903215399999997,27836,,,,27836
27843,Israel,Israel,b.MAT.009.033,34.851612,31.046051000000002,27843,,,,27843
27845,Judea,Judea,b.MAT.009.035,35.2035394,31.903215399999997,27845,,,,27845
27856,Israel,Israel,b.MAT.010.006,34.851612,31.046051000000002,27856,,,,27856
27875,Israel,Israel,b.MAT.010.023,34.851612,31.046051000000002,27875,,,,27875
27895,Judea,Judea,b.MAT.011.001,35.2035394,31.903215399999997,27895,,,,27895
27915,Sidón,Sidón,b.MAT.011.021,35.372948,33.5570691,27915,,,,27915
27916,Tiro,Tiro,b.MAT.011.021,35.2037641,33.2704888,27916,,,,27916
27919,Sidón,Sidón,b.MAT.011.022,35.372948,33.5570691,27919,,,,27919
27920,Tiro,Tiro,b.MAT.011.022,35.2037641,33.2704888,27920,,,,27920
27924,Capernaúm,Capernaúm,b.MAT.011.023,35.573307,32.88033,27924,,,,27924
27926,tierra,tierra,b.MAT.011.025,0.0,-90.0,27926,,,,27926
27936,templo,templo,b.MAT.012.004,35.619167,33.186667,27936,,,,27936
27937,templo,templo,b.MAT.012.005,35.619167,33.186667,27937,,,,27937
27938,templo,templo,b.MAT.012.006,35.619167,33.186667,27938,,,,27938
27958,Nínive,Nínive,b.MAT.012.026,42.2362435,36.229574,27958,,,,27958
27973,Nínive,Nínive,b.MAT.012.041,42.2362435,36.229574,27973,,,,27973
27983,mar de Galilea,mar de Galilea,b.MAT.013.001,35.5879975,32.8244321,27983,,,,27983
28020,tierra,tierra,b.MAT.013.038,0.0,-90.0,28020,,,,28020
28036,Nazaret,Nazaret,b.MAT.013.054,35.303546000000004,32.699635,28036,,,,28036
28040,Nazaret,Nazaret,b.MAT.013.057,35.303546000000004,32.699635,28040,,,,28040
28063,mar de Galilea,mar de Galilea,b.MAT.014.022,35.5879975,32.8244321,28063,,,,28063
28065,mar de Galilea,mar de Galilea,b.MAT.014.024,35.5879975,32.8244321,28065,,,,28065
28066,mar de Galilea,mar de Galilea,b.MAT.014.025,35.5879975,32.8244321,28066,,,,28066
28067,mar de Galilea,mar de Galilea,b.MAT.014.026,35.5879975,32.8244321,28067,,,,28067
28070,mar de Galilea,mar de Galilea,b.MAT.014.029,35.5879975,32.8244321,28070,,,,28070
28075,mar de Galilea,mar de Galilea,b.MAT.014.034,35.5879975,32.8244321,28075,,,,28075
28076,Genesaret,Genesaret,b.MAT.014.034,35.5879975,32.8244321,28076,,,,28076
28077,Genesaret,Genesaret,b.MAT.014.035,35.5879975,32.8244321,28077,,,,28077
28079,Jerusalén,Jerusalén,b.MAT.015.001,35.21371,31.768319,28079,,,,28079
28099,Sidón,Sidón,b.MAT.015.021,35.372948,33.5570691,28099,,,,28099
28100,Tiro,Tiro,b.MAT.015.021,35.2037641,33.2704888,28100,,,,28100
28103,Israel,Israel,b.MAT.015.024,34.851612,31.046051000000002,28103,,,,28103
28108,Galilea,Galilea,b.MAT.015.029,35.5879975,32.8244321,28108,,,,28108
28110,Israel,Israel,b.MAT.015.031,34.851612,31.046051000000002,28110,,,,28110
28123,mar de Galilea,mar de Galilea,b.MAT.016.005,35.5879975,32.8244321,28123,,,,28123
28131,Cesarea,Cesarea,b.MAT.016.013,34.891667,32.5,28131,,,,28131
28138,tierra,tierra,b.MAT.016.019,0.0,-90.0,28138,,,,28138
28142,Jerusalén,Jerusalén,b.MAT.016.021,35.21371,31.768319,28142,,,,28142
28171,Galilea,Galilea,b.MAT.017.022,35.5879975,32.8244321,28171,,,,28171
28173,templo,templo,b.MAT.017.024,35.619167,33.186667,28173,,,,28173
28174,Capernaúm,Capernaúm,b.MAT.017.024,35.573307,32.88033,28174,,,,28174
28175,tierra,tierra,b.MAT.017.025,0.0,-90.0,28175,,,,28175
28177,mar de Galilea,mar de Galilea,b.MAT.017.027,35.5879975,32.8244321,28177,,,,28177
28195,tierra,tierra,b.MAT.018.018,0.0,-90.0,28195,,,,28195
28197,tierra,tierra,b.MAT.018.019,0.0,-90.0,28197,,,,28197
28215,Jordán,Jordán,b.MAT.019.001,36.238414,30.585164000000002,28215,,,,28215
28217,Judea,Judea,b.MAT.019.001,35.2035394,31.903215399999997,28217,,,,28217
28218,Galilea,Galilea,b.MAT.019.001,35.5879975,32.8244321,28218,,,,28218
28245,Israel,Israel,b.MAT.019.028,34.851612,31.046051000000002,28245,,,,28245
28264,Jerusalén,Jerusalén,b.MAT.020.017,35.21371,31.768319,28264,,,,28264
28265,Jerusalén,Jerusalén,b.MAT.020.018,35.21371,31.768319,28265,,,,28265
28276,Jericó,Jericó,b.MAT.020.029,35.4617583,31.8611058,28276,,,,28276
28282,Jerusalén,Jerusalén,b.MAT.021.001,35.21371,31.768319,28282,,,,28282
28283,monte de los Olivos,monte de los Olivos,b.MAT.021.001,35.245698299999994,31.777931699999996,28283,,,,28283
28284,Betfagé,Betfagé,b.MAT.021.001,35.250766600000006,31.7772471,28284,,,,28284
28288,Sión,Sión,b.MAT.021.005,35.228611111111,31.771666666667,28288,,,,28288
28289,Jerusalén,Jerusalén,b.MAT.021.005,35.21371,31.768319,28289,,,,28289
28294,Jerusalén,Jerusalén,b.MAT.021.010,35.21371,31.768319,28294,,,,28294
28295,Jerusalén,Jerusalén,b.MAT.021.011,35.21371,31.768319,28295,,,,28295
28296,Galilea,Galilea,b.MAT.021.011,35.5879975,32.8244321,28296,,,,28296
28297,Nazaret,Nazaret,b.MAT.021.011,35.303546000000004,32.699635,28297,,,,28297
28298,templo,templo,b.MAT.021.012,35.619167,33.186667,28298,,,,28298
28299,templo,templo,b.MAT.021.013,35.619167,33.186667,28299,,,,28299
28300,templo,templo,b.MAT.021.014,35.619167,33.186667,28300,,,,28300
28301,templo,templo,b.MAT.021.015,35.619167,33.186667,28301,,,,28301
28303,Jerusalén,Jerusalén,b.MAT.021.017,35.21371,31.768319,28303,,,,28303
28304,Betania,Betania,b.MAT.021.017,35.25164,31.76233,28304,,,,28304
28305,Jerusalén,Jerusalén,b.MAT.021.018,35.21371,31.768319,28305,,,,28305
28310,templo,templo,b.MAT.021.023,35.619167,33.186667,28310,,,,28310
28400,templo,templo,b.MAT.023.021,35.619167,33.186667,28400,,,,28400
28416,Jerusalén,Jerusalén,b.MAT.023.037,35.21371,31.768319,28416,,,,28416
28419,templo,templo,b.MAT.024.001,35.619167,33.186667,28419,,,,28419
28421,tierra,tierra,b.MAT.024.003,0.0,-90.0,28421,,,,28421
28422,monte de los Olivos,monte de los Olivos,b.MAT.024.003,35.245698299999994,31.777931699999996,28422,,,,28422
28433,tierra,tierra,b.MAT.024.014,0.0,-90.0,28433,,,,28433
28434,templo,templo,b.MAT.024.015,35.619167,33.186667,28434,,,,28434
28435,Judea,Judea,b.MAT.024.016,35.2035394,31.903215399999997,28435,,,,28435
28440,tierra,tierra,b.MAT.024.021,0.0,-90.0,28440,,,,28440
28449,tierra,tierra,b.MAT.024.030,0.0,-90.0,28449,,,,28449
28455,tierra,tierra,b.MAT.024.035,0.0,-90.0,28455,,,,28455
28506,tierra,tierra,b.MAT.025.034,0.0,-90.0,28506,,,,28506
28526,Betania,Betania,b.MAT.026.006,35.25164,31.76233,28526,,,,28526
28538,Jerusalén,Jerusalén,b.MAT.026.018,35.21371,31.768319,28538,,,,28538
28550,monte de los Olivos,monte de los Olivos,b.MAT.026.030,35.245698299999994,31.777931699999996,28550,,,,28550
28552,Galilea,Galilea,b.MAT.026.032,35.5879975,32.8244321,28552,,,,28552
28575,templo,templo,b.MAT.026.055,35.619167,33.186667,28575,,,,28575
28581,templo,templo,b.MAT.026.061,35.619167,33.186667,28581,,,,28581
28591,Nazaret,Nazaret,b.MAT.026.071,35.303546000000004,32.699635,28591,,,,28591
28600,templo,templo,b.MAT.027.005,35.619167,33.186667,28600,,,,28600
28604,Israel,Israel,b.MAT.027.009,34.851612,31.046051000000002,28604,,,,28604
28627,Cirene,Cirene,b.MAT.027.032,21.862820499999998,32.8034486,28627,,,,28627
28628,Gólgota,Gólgota,b.MAT.027.033,35.2302743,31.7839847,28628,,,,28628
28635,templo,templo,b.MAT.027.040,35.619167,33.186667,28635,,,,28635
28637,Israel,Israel,b.MAT.027.042,34.851612,31.046051000000002,28637,,,,28637
28640,tierra,tierra,b.MAT.027.045,0.0,-90.0,28640,,,,28640
28646,tierra,tierra,b.MAT.027.051,0.0,-90.0,28646,,,,28646
28647,templo,templo,b.MAT.027.051,35.619167,33.186667,28647,,,,28647
28649,Jerusalén,Jerusalén,b.MAT.027.053,35.21371,31.768319,28649,,,,28649
28651,Galilea,Galilea,b.MAT.027.055,35.5879975,32.8244321,28651,,,,28651
28669,Galilea,Galilea,b.MAT.028.007,35.5879975,32.8244321,28669,,,,28669
28672,Galilea,Galilea,b.MAT.028.010,35.5879975,32.8244321,28672,,,,28672
28673,Jerusalén,Jerusalén,b.MAT.028.011,35.21371,31.768319,28673,,,,28673
28678,Galilea,Galilea,b.MAT.028.016,35.5879975,32.8244321,28678,,,,28678
28680,tierra,tierra,b.MAT.028.018,0.0,-90.0,28680,,,,28680
28683,tierra,tierra,b.MAT.028.020,0.0,-90.0,28683,,,,28683
28688,Jordán,Jordán,b.MAR.001.005,36.238414,30.585164000000002,28688,,,,28688
28689,Jerusalén,Jerusalén,b.MAR.001.005,35.21371,31.768319,28689,,,,28689
28690,Judea,Judea,b.MAR.001.005,35.2035394,31.903215399999997,28690,,,,28690
28694,Jordán,Jordán,b.MAR.001.009,36.238414,30.585164000000002,28694,,,,28694
28695,Galilea,Galilea,b.MAR.001.009,35.5879975,32.8244321,28695,,,,28695
28696,Nazaret,Nazaret,b.MAR.001.009,35.303546000000004,32.699635,28696,,,,28696
28701,Galilea,Galilea,b.MAR.001.014,35.5879975,32.8244321,28701,,,,28701
28704,Galilea,Galilea,b.MAR.001.016,35.5879975,32.8244321,28704,,,,28704
28705,mar de Galilea,mar de Galilea,b.MAR.001.016,35.5879975,32.8244321,28705,,,,28705
28710,Capernaúm,Capernaúm,b.MAR.001.021,35.573307,32.88033,28710,,,,28710
28718,Galilea,Galilea,b.MAR.001.028,35.5879975,32.8244321,28718,,,,28718
28723,Capernaúm,Capernaúm,b.MAR.001.033,35.573307,32.88033,28723,,,,28723
28729,Galilea,Galilea,b.MAR.001.039,35.5879975,32.8244321,28729,,,,28729
28736,Capernaúm,Capernaúm,b.MAR.001.045,35.573307,32.88033,28736,,,,28736
28737,Capernaúm,Capernaúm,b.MAR.002.001,35.573307,32.88033,28737,,,,28737
28746,tierra,tierra,b.MAR.002.010,0.0,-90.0,28746,,,,28746
28749,mar de Galilea,mar de Galilea,b.MAR.002.013,35.5879975,32.8244321,28749,,,,28749
28771,Judea,Judea,b.MAR.003.007,35.2035394,31.903215399999997,28771,,,,28771
28772,Galilea,Galilea,b.MAR.003.007,35.5879975,32.8244321,28772,,,,28772
28773,mar de Galilea,mar de Galilea,b.MAR.003.007,35.5879975,32.8244321,28773,,,,28773
28774,Sidón,Sidón,b.MAR.003.008,35.372948,33.5570691,28774,,,,28774
28775,Jordán,Jordán,b.MAR.003.008,36.238414,30.585164000000002,28775,,,,28775
28776,Jerusalén,Jerusalén,b.MAR.003.008,35.21371,31.768319,28776,,,,28776
28777,Tiro,Tiro,b.MAR.003.008,35.2037641,33.2704888,28777,,,,28777
28792,Jerusalén,Jerusalén,b.MAR.003.022,35.21371,31.768319,28792,,,,28792
28806,mar de Galilea,mar de Galilea,b.MAR.004.001,35.5879975,32.8244321,28806,,,,28806
28844,mar de Galilea,mar de Galilea,b.MAR.004.039,35.5879975,32.8244321,28844,,,,28844
28846,mar de Galilea,mar de Galilea,b.MAR.004.041,35.5879975,32.8244321,28846,,,,28846
28847,mar de Galilea,mar de Galilea,b.MAR.005.001,35.5879975,32.8244321,28847,,,,28847
28860,mar de Galilea,mar de Galilea,b.MAR.005.013,35.5879975,32.8244321,28860,,,,28860
28868,mar de Galilea,mar de Galilea,b.MAR.005.021,35.5879975,32.8244321,28868,,,,28868
28891,Nazaret,Nazaret,b.MAR.006.001,35.303546000000004,32.699635,28891,,,,28891
28912,Galilea,Galilea,b.MAR.006.021,35.5879975,32.8244321,28912,,,,28912
28914,Judea,Judea,b.MAR.006.023,35.2035394,31.903215399999997,28914,,,,28914
28938,mar de Galilea,mar de Galilea,b.MAR.006.047,35.5879975,32.8244321,28938,,,,28938
28939,mar de Galilea,mar de Galilea,b.MAR.006.048,35.5879975,32.8244321,28939,,,,28939
28940,mar de Galilea,mar de Galilea,b.MAR.006.049,35.5879975,32.8244321,28940,,,,28940
28944,Genesaret,Genesaret,b.MAR.006.053,35.5879975,32.8244321,28944,,,,28944
28946,Genesaret,Genesaret,b.MAR.006.055,35.5879975,32.8244321,28946,,,,28946
28947,Genesaret,Genesaret,b.MAR.006.056,35.5879975,32.8244321,28947,,,,28947
28948,Jerusalén,Jerusalén,b.MAR.007.001,35.21371,31.768319,28948,,,,28948
28971,Sidón,Sidón,b.MAR.007.024,35.372948,33.5570691,28971,,,,28971
28972,Tiro,Tiro,b.MAR.007.024,35.2037641,33.2704888,28972,,,,28972
28979,Sidón,Sidón,b.MAR.007.031,35.372948,33.5570691,28979,,,,28979
28980,Tiro,Tiro,b.MAR.007.031,35.2037641,33.2704888,28980,,,,28980
28981,Galilea,Galilea,b.MAR.007.031,35.5879975,32.8244321,28981,,,,28981
28982,mar de Galilea,mar de Galilea,b.MAR.007.031,35.5879975,32.8244321,28982,,,,28982
29016,Cesarea,Cesarea,b.MAR.008.027,34.891667,32.5,29016,,,,29016
29058,Galilea,Galilea,b.MAR.009.030,35.5879975,32.8244321,29058,,,,29058
29061,Capernaúm,Capernaúm,b.MAR.009.033,35.573307,32.88033,29061,,,,29061
29080,Jordán,Jordán,b.MAR.010.001,36.238414,30.585164000000002,29080,,,,29080
29081,Judea,Judea,b.MAR.010.001,35.2035394,31.903215399999997,29081,,,,29081
29112,Jerusalén,Jerusalén,b.MAR.010.032,35.21371,31.768319,29112,,,,29112
29113,Jerusalén,Jerusalén,b.MAR.010.033,35.21371,31.768319,29113,,,,29113
29126,Jericó,Jericó,b.MAR.010.046,35.4617583,31.8611058,29126,,,,29126
29133,Jerusalén,Jerusalén,b.MAR.011.001,35.21371,31.768319,29133,,,,29133
29134,monte de los Olivos,monte de los Olivos,b.MAR.011.001,35.245698299999994,31.777931699999996,29134,,,,29134
29135,Betfagé,Betfagé,b.MAR.011.001,35.250766600000006,31.7772471,29135,,,,29135
29136,Betania,Betania,b.MAR.011.001,35.25164,31.76233,29136,,,,29136
29137,Betania,Betania,b.MAR.011.002,35.25164,31.76233,29137,,,,29137
29145,Israel,Israel,b.MAR.011.010,34.851612,31.046051000000002,29145,,,,29145
29146,templo,templo,b.MAR.011.011,35.619167,33.186667,29146,,,,29146
29147,Jerusalén,Jerusalén,b.MAR.011.011,35.21371,31.768319,29147,,,,29147
29148,Betania,Betania,b.MAR.011.011,35.25164,31.76233,29148,,,,29148
29149,Betania,Betania,b.MAR.011.012,35.25164,31.76233,29149,,,,29149
29152,templo,templo,b.MAR.011.015,35.619167,33.186667,29152,,,,29152
29153,Jerusalén,Jerusalén,b.MAR.011.015,35.21371,31.768319,29153,,,,29153
29154,templo,templo,b.MAR.011.016,35.619167,33.186667,29154,,,,29154
29155,templo,templo,b.MAR.011.017,35.619167,33.186667,29155,,,,29155
29157,Jerusalén,Jerusalén,b.MAR.011.019,35.21371,31.768319,29157,,,,29157
29165,templo,templo,b.MAR.011.027,35.619167,33.186667,29165,,,,29165
29166,Jerusalén,Jerusalén,b.MAR.011.027,35.21371,31.768319,29166,,,,29166
29201,Israel,Israel,b.MAR.012.029,34.851612,31.046051000000002,29201,,,,29201
29207,templo,templo,b.MAR.012.035,35.619167,33.186667,29207,,,,29207
29217,templo,templo,b.MAR.013.001,35.619167,33.186667,29217,,,,29217
29218,templo,templo,b.MAR.013.002,35.619167,33.186667,29218,,,,29218
29219,templo,templo,b.MAR.013.003,35.619167,33.186667,29219,,,,29219
29220,monte de los Olivos,monte de los Olivos,b.MAR.013.003,35.245698299999994,31.777931699999996,29220,,,,29220
29231,Judea,Judea,b.MAR.013.014,35.2035394,31.903215399999997,29231,,,,29231
29244,tierra,tierra,b.MAR.013.027,0.0,-90.0,29244,,,,29244
29249,tierra,tierra,b.MAR.013.031,0.0,-90.0,29249,,,,29249
29258,Betania,Betania,b.MAR.014.003,35.25164,31.76233,29258,,,,29258
29264,tierra,tierra,b.MAR.014.009,0.0,-90.0,29264,,,,29264
29268,Jerusalén,Jerusalén,b.MAR.014.013,35.21371,31.768319,29268,,,,29268
29271,Jerusalén,Jerusalén,b.MAR.014.016,35.21371,31.768319,29271,,,,29271
29281,monte de los Olivos,monte de los Olivos,b.MAR.014.026,35.245698299999994,31.777931699999996,29281,,,,29281
29283,Galilea,Galilea,b.MAR.014.028,35.5879975,32.8244321,29283,,,,29283
29304,templo,templo,b.MAR.014.049,35.619167,33.186667,29304,,,,29304
29313,templo,templo,b.MAR.014.058,35.619167,33.186667,29313,,,,29313
29348,Cirene,Cirene,b.MAR.015.021,21.862820499999998,32.8034486,29348,,,,29348
29349,Gólgota,Gólgota,b.MAR.015.022,35.2302743,31.7839847,29349,,,,29349
29356,templo,templo,b.MAR.015.029,35.619167,33.186667,29356,,,,29356
29359,Israel,Israel,b.MAR.015.032,34.851612,31.046051000000002,29359,,,,29359
29365,templo,templo,b.MAR.015.038,35.619167,33.186667,29365,,,,29365
29368,Jerusalén,Jerusalén,b.MAR.015.041,35.21371,31.768319,29368,,,,29368
29369,Galilea,Galilea,b.MAR.015.041,35.5879975,32.8244321,29369,,,,29369
29383,Galilea,Galilea,b.MAR.016.007,35.5879975,32.8244321,29383,,,,29383
29401,Judea,Judea,b.LUK.001.005,35.2035394,31.903215399999997,29401,,,,29401
29412,Israel,Israel,b.LUK.001.016,34.851612,31.046051000000002,29412,,,,29412
29422,Galilea,Galilea,b.LUK.001.026,35.5879975,32.8244321,29422,,,,29422
29423,Nazaret,Nazaret,b.LUK.001.026,35.303546000000004,32.699635,29423,,,,29423
29462,Judea,Judea,b.LUK.001.065,35.2035394,31.903215399999997,29462,,,,29462
29479,Siria,Siria,b.LUK.002.002,38.996815000000005,34.802075,29479,,,,29479
29481,Belén,Belén,b.LUK.002.004,35.2024425,31.7053821,29481,,,,29481
29482,Judea,Judea,b.LUK.002.004,35.2035394,31.903215399999997,29482,,,,29482
29483,Galilea,Galilea,b.LUK.002.004,35.5879975,32.8244321,29483,,,,29483
29484,Nazaret,Nazaret,b.LUK.002.004,35.303546000000004,32.699635,29484,,,,29484
29488,Judea,Judea,b.LUK.002.008,35.2035394,31.903215399999997,29488,,,,29488
29491,Belén,Belén,b.LUK.002.011,35.2024425,31.7053821,29491,,,,29491
29494,tierra,tierra,b.LUK.002.014,0.0,-90.0,29494,,,,29494
29496,Belén,Belén,b.LUK.002.015,35.2024425,31.7053821,29496,,,,29496
29503,Jerusalén,Jerusalén,b.LUK.002.022,35.21371,31.768319,29503,,,,29503
29506,Israel,Israel,b.LUK.002.025,34.851612,31.046051000000002,29506,,,,29506
29507,Jerusalén,Jerusalén,b.LUK.002.025,35.21371,31.768319,29507,,,,29507
29509,templo,templo,b.LUK.002.027,35.619167,33.186667,29509,,,,29509
29516,Israel,Israel,b.LUK.002.034,34.851612,31.046051000000002,29516,,,,29516
29518,Aser,Aser,b.LUK.002.036,35.241856,33.171148,29518,,,,29518
29519,templo,templo,b.LUK.002.037,35.619167,33.186667,29519,,,,29519
29520,Jerusalén,Jerusalén,b.LUK.002.038,35.21371,31.768319,29520,,,,29520
29521,Galilea,Galilea,b.LUK.002.039,35.5879975,32.8244321,29521,,,,29521
29522,Nazaret,Nazaret,b.LUK.002.039,35.303546000000004,32.699635,29522,,,,29522
29524,Jerusalén,Jerusalén,b.LUK.002.041,35.21371,31.768319,29524,,,,29524
29525,Jerusalén,Jerusalén,b.LUK.002.042,35.21371,31.768319,29525,,,,29525
29526,Jerusalén,Jerusalén,b.LUK.002.043,35.21371,31.768319,29526,,,,29526
29528,Jerusalén,Jerusalén,b.LUK.002.045,35.21371,31.768319,29528,,,,29528
29529,templo,templo,b.LUK.002.046,35.619167,33.186667,29529,,,,29529
29534,Nazaret,Nazaret,b.LUK.002.051,35.303546000000004,32.699635,29534,,,,29534
29536,Judea,Judea,b.LUK.003.001,35.2035394,31.903215399999997,29536,,,,29536
29537,Galilea,Galilea,b.LUK.003.001,35.5879975,32.8244321,29537,,,,29537
29539,Pisidia,Pisidia,b.LUK.003.001,30.284870899999998,37.7188751,29539,,,,29539
29543,Jordán,Jordán,b.LUK.003.003,36.238414,30.585164000000002,29543,,,,29543
29544,Sinaí,Sinaí,b.LUK.003.004,34.0,29.5,29544,,,,29544
29579,Jordán,Jordán,b.LUK.004.001,36.238414,30.585164000000002,29579,,,,29579
29583,tierra,tierra,b.LUK.004.005,0.0,-90.0,29583,,,,29583
29587,templo,templo,b.LUK.004.009,35.619167,33.186667,29587,,,,29587
29588,Jerusalén,Jerusalén,b.LUK.004.009,35.21371,31.768319,29588,,,,29588
29593,Galilea,Galilea,b.LUK.004.014,35.5879975,32.8244321,29593,,,,29593
29595,Nazaret,Nazaret,b.LUK.004.016,35.303546000000004,32.699635,29595,,,,29595
29603,Nazaret,Nazaret,b.LUK.004.023,35.303546000000004,32.699635,29603,,,,29603
29604,Capernaúm,Capernaúm,b.LUK.004.023,35.573307,32.88033,29604,,,,29604
29605,Nazaret,Nazaret,b.LUK.004.024,35.303546000000004,32.699635,29605,,,,29605
29606,Israel,Israel,b.LUK.004.025,34.851612,31.046051000000002,29606,,,,29606
29607,Sidón,Sidón,b.LUK.004.026,35.372948,33.5570691,29607,,,,29607
29609,Israel,Israel,b.LUK.004.027,34.851612,31.046051000000002,29609,,,,29609
29611,Jerusalén,Jerusalén,b.LUK.004.029,35.21371,31.768319,29611,,,,29611
29613,Galilea,Galilea,b.LUK.004.031,35.5879975,32.8244321,29613,,,,29613
29614,Capernaúm,Capernaúm,b.LUK.004.031,35.573307,32.88033,29614,,,,29614
29620,Galilea,Galilea,b.LUK.004.037,35.5879975,32.8244321,29620,,,,29620
29627,Galilea,Galilea,b.LUK.004.044,35.5879975,32.8244321,29627,,,,29627
29629,Genesaret,Genesaret,b.LUK.005.001,35.5879975,32.8244321,29629,,,,29629
29630,Genesaret,Genesaret,b.LUK.005.002,35.5879975,32.8244321,29630,,,,29630
29645,Jerusalén,Jerusalén,b.LUK.005.017,35.21371,31.768319,29645,,,,29645
29646,Judea,Judea,b.LUK.005.017,35.2035394,31.903215399999997,29646,,,,29646
29647,Galilea,Galilea,b.LUK.005.017,35.5879975,32.8244321,29647,,,,29647
29654,tierra,tierra,b.LUK.005.024,0.0,-90.0,29654,,,,29654
29673,templo,templo,b.LUK.006.004,35.619167,33.186667,29673,,,,29673
29686,Sidón,Sidón,b.LUK.006.017,35.372948,33.5570691,29686,,,,29686
29687,Jerusalén,Jerusalén,b.LUK.006.017,35.21371,31.768319,29687,,,,29687
29688,Judea,Judea,b.LUK.006.017,35.2035394,31.903215399999997,29688,,,,29688
29689,Tiro,Tiro,b.LUK.006.017,35.2037641,33.2704888,29689,,,,29689
29722,Capernaúm,Capernaúm,b.LUK.007.001,35.573307,32.88033,29722,,,,29722
29730,Israel,Israel,b.LUK.007.009,34.851612,31.046051000000002,29730,,,,29730
29738,Judea,Judea,b.LUK.007.017,35.2035394,31.903215399999997,29738,,,,29738
29772,Judea,Judea,b.LUK.008.001,35.2035394,31.903215399999997,29772,,,,29772
29776,Judea,Judea,b.LUK.008.004,35.2035394,31.903215399999997,29776,,,,29776
29794,mar de Galilea,mar de Galilea,b.LUK.008.022,35.5879975,32.8244321,29794,,,,29794
29798,Gad,Gad,b.LUK.008.026,35.797279,31.971978,29798,,,,29798
29799,Galilea,Galilea,b.LUK.008.026,35.5879975,32.8244321,29799,,,,29799
29800,Gad,Gad,b.LUK.008.027,35.797279,31.971978,29800,,,,29800
29807,Gad,Gad,b.LUK.008.034,35.797279,31.971978,29807,,,,29807
29810,Gad,Gad,b.LUK.008.037,35.797279,31.971978,29810,,,,29810
29812,Gad,Gad,b.LUK.008.039,35.797279,31.971978,29812,,,,29812
29835,Judea,Judea,b.LUK.009.006,35.2035394,31.903215399999997,29835,,,,29835
29860,Jerusalén,Jerusalén,b.LUK.009.031,35.21371,31.768319,29860,,,,29860
29880,Jerusalén,Jerusalén,b.LUK.009.051,35.21371,31.768319,29880,,,,29880
29881,Samaria,Samaria,b.LUK.009.052,35.3027226,32.422877,29881,,,,29881
29882,Jerusalén,Jerusalén,b.LUK.009.053,35.21371,31.768319,29882,,,,29882
29885,Betania,Betania,b.LUK.009.056,35.25164,31.76233,29885,,,,29885
29904,Sidón,Sidón,b.LUK.010.013,35.372948,33.5570691,29904,,,,29904
29905,Tiro,Tiro,b.LUK.010.013,35.2037641,33.2704888,29905,,,,29905
29908,Sidón,Sidón,b.LUK.010.014,35.372948,33.5570691,29908,,,,29908
29909,Tiro,Tiro,b.LUK.010.014,35.2037641,33.2704888,29909,,,,29909
29913,Capernaúm,Capernaúm,b.LUK.010.015,35.573307,32.88033,29913,,,,29913
29914,Capernaúm,Capernaúm,b.LUK.010.016,35.573307,32.88033,29914,,,,29914
29919,tierra,tierra,b.LUK.010.021,0.0,-90.0,29919,,,,29919
29929,Jericó,Jericó,b.LUK.010.030,35.4617583,31.8611058,29929,,,,29929
29930,Jerusalén,Jerusalén,b.LUK.010.030,35.21371,31.768319,29930,,,,29930
29944,tierra,tierra,b.LUK.011.002,0.0,-90.0,29944,,,,29944
29976,Nínive,Nínive,b.LUK.011.032,42.2362435,36.229574,29976,,,,29976
29995,templo,templo,b.LUK.011.051,35.619167,33.186667,29995,,,,29995
30047,tierra,tierra,b.LUK.012.049,0.0,-90.0,30047,,,,30047
30049,tierra,tierra,b.LUK.012.051,0.0,-90.0,30049,,,,30049
30061,Jerusalén,Jerusalén,b.LUK.013.004,35.21371,31.768319,30061,,,,30061
30080,Jerusalén,Jerusalén,b.LUK.013.022,35.21371,31.768319,30080,,,,30080
30081,Judea,Judea,b.LUK.013.022,35.2035394,31.903215399999997,30081,,,,30081
30092,Jerusalén,Jerusalén,b.LUK.013.033,35.21371,31.768319,30092,,,,30092
30093,Jerusalén,Jerusalén,b.LUK.013.034,35.21371,31.768319,30093,,,,30093
30094,Jerusalén,Jerusalén,b.LUK.013.035,35.21371,31.768319,30094,,,,30094
30178,tierra,tierra,b.LUK.016.017,0.0,-90.0,30178,,,,30178
30204,Jerusalén,Jerusalén,b.LUK.017.011,35.21371,31.768319,30204,,,,30204
30205,Galilea,Galilea,b.LUK.017.011,35.5879975,32.8244321,30205,,,,30205
30206,Samaria,Samaria,b.LUK.017.011,35.3027226,32.422877,30206,,,,30206
30207,Samaria,Samaria,b.LUK.017.012,35.3027226,32.422877,30207,,,,30207
30240,tierra,tierra,b.LUK.018.008,0.0,-90.0,30240,,,,30240
30242,templo,templo,b.LUK.018.010,35.619167,33.186667,30242,,,,30242
30263,Jerusalén,Jerusalén,b.LUK.018.031,35.21371,31.768319,30263,,,,30263
30267,Jericó,Jericó,b.LUK.018.035,35.4617583,31.8611058,30267,,,,30267
30276,Jericó,Jericó,b.LUK.019.001,35.4617583,31.8611058,30276,,,,30276
30286,Jerusalén,Jerusalén,b.LUK.019.011,35.21371,31.768319,30286,,,,30286
30304,Jerusalén,Jerusalén,b.LUK.019.028,35.21371,31.768319,30304,,,,30304
30305,monte de los Olivos,monte de los Olivos,b.LUK.019.029,35.245698299999994,31.777931699999996,30305,,,,30305
30306,Betfagé,Betfagé,b.LUK.019.029,35.250766600000006,31.7772471,30306,,,,30306
30307,Betania,Betania,b.LUK.019.029,35.25164,31.76233,30307,,,,30307
30308,Jerusalén,Jerusalén,b.LUK.019.030,35.21371,31.768319,30308,,,,30308
30315,monte de los Olivos,monte de los Olivos,b.LUK.019.037,35.245698299999994,31.777931699999996,30315,,,,30315
30319,Jerusalén,Jerusalén,b.LUK.019.041,35.21371,31.768319,30319,,,,30319
30320,Jerusalén,Jerusalén,b.LUK.019.042,35.21371,31.768319,30320,,,,30320
30321,Jerusalén,Jerusalén,b.LUK.019.043,35.21371,31.768319,30321,,,,30321
30322,Jerusalén,Jerusalén,b.LUK.019.044,35.21371,31.768319,30322,,,,30322
30323,templo,templo,b.LUK.019.045,35.619167,33.186667,30323,,,,30323
30324,templo,templo,b.LUK.019.046,35.619167,33.186667,30324,,,,30324
30325,templo,templo,b.LUK.019.047,35.619167,33.186667,30325,,,,30325
30327,templo,templo,b.LUK.020.001,35.619167,33.186667,30327,,,,30327
30378,templo,templo,b.LUK.021.005,35.619167,33.186667,30378,,,,30378
30379,templo,templo,b.LUK.021.006,35.619167,33.186667,30379,,,,30379
30384,tierra,tierra,b.LUK.021.011,0.0,-90.0,30384,,,,30384
30393,Jerusalén,Jerusalén,b.LUK.021.020,35.21371,31.768319,30393,,,,30393
30394,Judea,Judea,b.LUK.021.021,35.2035394,31.903215399999997,30394,,,,30394
30396,tierra,tierra,b.LUK.021.023,0.0,-90.0,30396,,,,30396
30397,Jerusalén,Jerusalén,b.LUK.021.024,35.21371,31.768319,30397,,,,30397
30398,tierra,tierra,b.LUK.021.025,0.0,-90.0,30398,,,,30398
30399,tierra,tierra,b.LUK.021.026,0.0,-90.0,30399,,,,30399
30410,templo,templo,b.LUK.021.037,35.619167,33.186667,30410,,,,30410
30411,monte de los Olivos,monte de los Olivos,b.LUK.021.037,35.245698299999994,31.777931699999996,30411,,,,30411
30412,templo,templo,b.LUK.021.038,35.619167,33.186667,30412,,,,30412
30422,Jerusalén,Jerusalén,b.LUK.022.010,35.21371,31.768319,30422,,,,30422
30442,Israel,Israel,b.LUK.022.030,34.851612,31.046051000000002,30442,,,,30442
30452,monte de los Olivos,monte de los Olivos,b.LUK.022.039,35.245698299999994,31.777931699999996,30452,,,,30452
30453,monte de los Olivos,monte de los Olivos,b.LUK.022.040,35.245698299999994,31.777931699999996,30453,,,,30453
30465,templo,templo,b.LUK.022.052,35.619167,33.186667,30465,,,,30465
30466,templo,templo,b.LUK.022.053,35.619167,33.186667,30466,,,,30466
30486,Judea,Judea,b.LUK.023.002,35.2035394,31.903215399999997,30486,,,,30486
30489,Judea,Judea,b.LUK.023.005,35.2035394,31.903215399999997,30489,,,,30489
30490,Galilea,Galilea,b.LUK.023.005,35.5879975,32.8244321,30490,,,,30490
30491,Galilea,Galilea,b.LUK.023.006,35.5879975,32.8244321,30491,,,,30491
30492,Jerusalén,Jerusalén,b.LUK.023.007,35.21371,31.768319,30492,,,,30492
30504,Jerusalén,Jerusalén,b.LUK.023.019,35.21371,31.768319,30504,,,,30504
30511,Cirene,Cirene,b.LUK.023.026,21.862820499999998,32.8034486,30511,,,,30511
30513,Jerusalén,Jerusalén,b.LUK.023.028,35.21371,31.768319,30513,,,,30513
30518,Gólgota,Gólgota,b.LUK.023.033,35.2302743,31.7839847,30518,,,,30518
30529,tierra,tierra,b.LUK.023.044,0.0,-90.0,30529,,,,30529
30530,templo,templo,b.LUK.023.045,35.619167,33.186667,30530,,,,30530
30534,Galilea,Galilea,b.LUK.023.049,35.5879975,32.8244321,30534,,,,30534
30535,Judea,Judea,b.LUK.023.050,35.2035394,31.903215399999997,30535,,,,30535
30541,Galilea,Galilea,b.LUK.023.055,35.5879975,32.8244321,30541,,,,30541
30549,Galilea,Galilea,b.LUK.024.006,35.5879975,32.8244321,30549,,,,30549
30556,Jerusalén,Jerusalén,b.LUK.024.013,35.21371,31.768319,30556,,,,30556
30562,Jerusalén,Jerusalén,b.LUK.024.018,35.21371,31.768319,30562,,,,30562
30577,Jerusalén,Jerusalén,b.LUK.024.033,35.21371,31.768319,30577,,,,30577
30591,Jerusalén,Jerusalén,b.LUK.024.047,35.21371,31.768319,30591,,,,30591
30593,Jerusalén,Jerusalén,b.LUK.024.049,35.21371,31.768319,30593,,,,30593
30594,Betania,Betania,b.LUK.024.050,35.25164,31.76233,30594,,,,30594
30596,Jerusalén,Jerusalén,b.LUK.024.052,35.21371,31.768319,30596,,,,30596
30597,templo,templo,b.LUK.024.053,35.619167,33.186667,30597,,,,30597
30616,Jerusalén,Jerusalén,b.JOH.001.019,35.21371,31.768319,30616,,,,30616
30625,Jordán,Jordán,b.JOH.001.028,36.238414,30.585164000000002,30625,,,,30625
30629,Israel,Israel,b.JOH.001.031,34.851612,31.046051000000002,30629,,,,30629
30641,Galilea,Galilea,b.JOH.001.043,35.5879975,32.8244321,30641,,,,30641
30643,Nazaret,Nazaret,b.JOH.001.045,35.303546000000004,32.699635,30643,,,,30643
30644,Nazaret,Nazaret,b.JOH.001.046,35.303546000000004,32.699635,30644,,,,30644
30645,Israel,Israel,b.JOH.001.047,34.851612,31.046051000000002,30645,,,,30645
30647,Israel,Israel,b.JOH.001.049,34.851612,31.046051000000002,30647,,,,30647
30651,Galilea,Galilea,b.JOH.002.001,35.5879975,32.8244321,30651,,,,30651
30662,Galilea,Galilea,b.JOH.002.011,35.5879975,32.8244321,30662,,,,30662
30663,Capernaúm,Capernaúm,b.JOH.002.012,35.573307,32.88033,30663,,,,30663
30664,Jerusalén,Jerusalén,b.JOH.002.013,35.21371,31.768319,30664,,,,30664
30665,templo,templo,b.JOH.002.014,35.619167,33.186667,30665,,,,30665
30666,templo,templo,b.JOH.002.015,35.619167,33.186667,30666,,,,30666
30667,templo,templo,b.JOH.002.016,35.619167,33.186667,30667,,,,30667
30671,templo,templo,b.JOH.002.020,35.619167,33.186667,30671,,,,30671
30674,Jerusalén,Jerusalén,b.JOH.002.023,35.21371,31.768319,30674,,,,30674
30686,Israel,Israel,b.JOH.003.010,34.851612,31.046051000000002,30686,,,,30686
30698,Judea,Judea,b.JOH.003.022,35.2035394,31.903215399999997,30698,,,,30698
30702,Jordán,Jordán,b.JOH.003.026,36.238414,30.585164000000002,30702,,,,30702
30715,Judea,Judea,b.JOH.004.003,35.2035394,31.903215399999997,30715,,,,30715
30716,Galilea,Galilea,b.JOH.004.003,35.5879975,32.8244321,30716,,,,30716
30734,Jerusalén,Jerusalén,b.JOH.004.020,35.21371,31.768319,30734,,,,30734
30735,Jerusalén,Jerusalén,b.JOH.004.021,35.21371,31.768319,30735,,,,30735
30757,Galilea,Galilea,b.JOH.004.043,35.5879975,32.8244321,30757,,,,30757
30759,Jerusalén,Jerusalén,b.JOH.004.045,35.21371,31.768319,30759,,,,30759
30760,Galilea,Galilea,b.JOH.004.045,35.5879975,32.8244321,30760,,,,30760
30762,Galilea,Galilea,b.JOH.004.046,35.5879975,32.8244321,30762,,,,30762
30763,Capernaúm,Capernaúm,b.JOH.004.046,35.573307,32.88033,30763,,,,30763
30764,Judea,Judea,b.JOH.004.047,35.2035394,31.903215399999997,30764,,,,30764
30765,Galilea,Galilea,b.JOH.004.047,35.5879975,32.8244321,30765,,,,30765
30772,Judea,Judea,b.JOH.004.054,35.2035394,31.903215399999997,30772,,,,30772
30773,Galilea,Galilea,b.JOH.004.054,35.5879975,32.8244321,30773,,,,30773
30774,Jerusalén,Jerusalén,b.JOH.005.001,35.21371,31.768319,30774,,,,30774
30775,Jerusalén,Jerusalén,b.JOH.005.002,35.21371,31.768319,30775,,,,30775
30789,templo,templo,b.JOH.005.014,35.619167,33.186667,30789,,,,30789
30823,Galilea,Galilea,b.JOH.006.001,35.5879975,32.8244321,30823,,,,30823
30824,mar de Galilea,mar de Galilea,b.JOH.006.001,35.5879975,32.8244321,30824,,,,30824
30840,mar de Galilea,mar de Galilea,b.JOH.006.016,35.5879975,32.8244321,30840,,,,30840
30841,mar de Galilea,mar de Galilea,b.JOH.006.017,35.5879975,32.8244321,30841,,,,30841
30842,Capernaúm,Capernaúm,b.JOH.006.017,35.573307,32.88033,30842,,,,30842
30843,mar de Galilea,mar de Galilea,b.JOH.006.018,35.5879975,32.8244321,30843,,,,30843
30844,mar de Galilea,mar de Galilea,b.JOH.006.019,35.5879975,32.8244321,30844,,,,30844
30847,mar de Galilea,mar de Galilea,b.JOH.006.022,35.5879975,32.8244321,30847,,,,30847
30849,Capernaúm,Capernaúm,b.JOH.006.024,35.573307,32.88033,30849,,,,30849
30850,mar de Galilea,mar de Galilea,b.JOH.006.025,35.5879975,32.8244321,30850,,,,30850
30884,Capernaúm,Capernaúm,b.JOH.006.059,35.573307,32.88033,30884,,,,30884
30898,Judea,Judea,b.JOH.007.001,35.2035394,31.903215399999997,30898,,,,30898
30899,Galilea,Galilea,b.JOH.007.001,35.5879975,32.8244321,30899,,,,30899
30901,Judea,Judea,b.JOH.007.003,35.2035394,31.903215399999997,30901,,,,30901
30907,Galilea,Galilea,b.JOH.007.009,35.5879975,32.8244321,30907,,,,30907
30912,templo,templo,b.JOH.007.014,35.619167,33.186667,30912,,,,30912
30923,Jerusalén,Jerusalén,b.JOH.007.025,35.21371,31.768319,30923,,,,30923
30926,templo,templo,b.JOH.007.028,35.619167,33.186667,30926,,,,30926
30939,Galilea,Galilea,b.JOH.007.041,35.5879975,32.8244321,30939,,,,30939
30940,Belén,Belén,b.JOH.007.042,35.2024425,31.7053821,30940,,,,30940
30950,Galilea,Galilea,b.JOH.007.052,35.5879975,32.8244321,30950,,,,30950
30952,monte de los Olivos,monte de los Olivos,b.JOH.008.001,35.245698299999994,31.777931699999996,30952,,,,30952
30953,templo,templo,b.JOH.008.002,35.619167,33.186667,30953,,,,30953
30971,templo,templo,b.JOH.008.020,35.619167,33.186667,30971,,,,30971
31010,templo,templo,b.JOH.008.059,35.619167,33.186667,31010,,,,31010
31073,Jerusalén,Jerusalén,b.JOH.010.022,35.21371,31.768319,31073,,,,31073
31074,templo,templo,b.JOH.010.023,35.619167,33.186667,31074,,,,31074
31091,Jordán,Jordán,b.JOH.010.040,36.238414,30.585164000000002,31091,,,,31091
31094,Betania,Betania,b.JOH.011.001,35.25164,31.76233,31094,,,,31094
31100,Judea,Judea,b.JOH.011.007,35.2035394,31.903215399999997,31100,,,,31100
31111,Jerusalén,Jerusalén,b.JOH.011.018,35.21371,31.768319,31111,,,,31111
31112,Betania,Betania,b.JOH.011.018,35.25164,31.76233,31112,,,,31112
31124,Betania,Betania,b.JOH.011.030,35.25164,31.76233,31124,,,,31124
31142,Israel,Israel,b.JOH.011.048,34.851612,31.046051000000002,31142,,,,31142
31143,templo,templo,b.JOH.011.048,35.619167,33.186667,31143,,,,31143
31146,Israel,Israel,b.JOH.011.051,34.851612,31.046051000000002,31146,,,,31146
31149,Efraín,Efraín,b.JOH.011.054,35.289528,32.055556,31149,,,,31149
31150,Jerusalén,Jerusalén,b.JOH.011.055,35.21371,31.768319,31150,,,,31150
31151,Efraín,Efraín,b.JOH.011.055,35.289528,32.055556,31151,,,,31151
31152,templo,templo,b.JOH.011.056,35.619167,33.186667,31152,,,,31152
31154,Betania,Betania,b.JOH.012.001,35.25164,31.76233,31154,,,,31154
31165,Jerusalén,Jerusalén,b.JOH.012.012,35.21371,31.768319,31165,,,,31165
31166,Israel,Israel,b.JOH.012.013,34.851612,31.046051000000002,31166,,,,31166
31168,Israel,Israel,b.JOH.012.015,34.851612,31.046051000000002,31168,,,,31168
31174,Galilea,Galilea,b.JOH.012.021,35.5879975,32.8244321,31174,,,,31174
31379,templo,templo,b.JOH.018.020,35.619167,33.186667,31379,,,,31379
31417,Gólgota,Gólgota,b.JOH.019.017,35.2302743,31.7839847,31417,,,,31417
31474,mar de Galilea,mar de Galilea,b.JOH.021.001,35.5879975,32.8244321,31474,,,,31474
31477,Galilea,Galilea,b.JOH.021.002,35.5879975,32.8244321,31477,,,,31477
31482,mar de Galilea,mar de Galilea,b.JOH.021.007,35.5879975,32.8244321,31482,,,,31482
31504,Jerusalén,Jerusalén,b.ACT.001.004,35.21371,31.768319,31504,,,,31504
31506,Israel,Israel,b.ACT.001.006,34.851612,31.046051000000002,31506,,,,31506
31508,tierra,tierra,b.ACT.001.008,0.0,-90.0,31508,,,,31508
31509,Jerusalén,Jerusalén,b.ACT.001.008,35.21371,31.768319,31509,,,,31509
31510,Judea,Judea,b.ACT.001.008,35.2035394,31.903215399999997,31510,,,,31510
31511,Samaria,Samaria,b.ACT.001.008,35.3027226,32.422877,31511,,,,31511
31516,Jerusalén,Jerusalén,b.ACT.001.012,35.21371,31.768319,31516,,,,31516
31523,Jerusalén,Jerusalén,b.ACT.001.019,35.21371,31.768319,31523,,,,31523
31537,Jerusalén,Jerusalén,b.ACT.002.005,35.21371,31.768319,31537,,,,31537
31541,Mesopotamia,Mesopotamia,b.ACT.002.009,43.483738,34.5337527,31541,,,,31541
31542,Judea,Judea,b.ACT.002.009,35.2035394,31.903215399999997,31542,,,,31542
31545,Asia,Asia,b.ACT.002.009,34.126575,39.555216,31545,,,,31545
31546,Egipto,Egipto,b.ACT.002.010,30.802497999999996,26.820553000000004,31546,,,,31546
31547,Cirene,Cirene,b.ACT.002.010,21.862820499999998,32.8034486,31547,,,,31547
31549,Panfilia,Panfilia,b.ACT.002.010,31.0,37.0,31549,,,,31549
31550,África,África,b.ACT.002.010,34.508523,-8.783195,31550,,,,31550
31554,Jerusalén,Jerusalén,b.ACT.002.014,35.21371,31.768319,31554,,,,31554
31559,tierra,tierra,b.ACT.002.019,0.0,-90.0,31559,,,,31559
31577,Israel,Israel,b.ACT.002.036,34.851612,31.046051000000002,31577,,,,31577
31587,templo,templo,b.ACT.002.046,35.619167,33.186667,31587,,,,31587
31589,templo,templo,b.ACT.003.001,35.619167,33.186667,31589,,,,31589
31590,templo,templo,b.ACT.003.002,35.619167,33.186667,31590,,,,31590
31591,templo,templo,b.ACT.003.003,35.619167,33.186667,31591,,,,31591
31594,Nazaret,Nazaret,b.ACT.003.006,35.303546000000004,32.699635,31594,,,,31594
31596,templo,templo,b.ACT.003.008,35.619167,33.186667,31596,,,,31596
31598,templo,templo,b.ACT.003.010,35.619167,33.186667,31598,,,,31598
31599,templo,templo,b.ACT.003.011,35.619167,33.186667,31599,,,,31599
31613,tierra,tierra,b.ACT.003.025,0.0,-90.0,31613,,,,31613
31615,templo,templo,b.ACT.004.001,35.619167,33.186667,31615,,,,31615
31619,Jerusalén,Jerusalén,b.ACT.004.005,35.21371,31.768319,31619,,,,31619
31622,Israel,Israel,b.ACT.004.008,34.851612,31.046051000000002,31622,,,,31622
31624,Israel,Israel,b.ACT.004.010,34.851612,31.046051000000002,31624,,,,31624
31625,Nazaret,Nazaret,b.ACT.004.010,35.303546000000004,32.699635,31625,,,,31625
31631,Jerusalén,Jerusalén,b.ACT.004.016,35.21371,31.768319,31631,,,,31631
31639,tierra,tierra,b.ACT.004.024,0.0,-90.0,31639,,,,31639
31642,tierra,tierra,b.ACT.004.026,0.0,-90.0,31642,,,,31642
31643,Israel,Israel,b.ACT.004.027,34.851612,31.046051000000002,31643,,,,31643
31644,Jerusalén,Jerusalén,b.ACT.004.027,35.21371,31.768319,31644,,,,31644
31653,Chipre,Chipre,b.ACT.004.036,33.429859,35.126413,31653,,,,31653
31670,Jerusalén,Jerusalén,b.ACT.005.016,35.21371,31.768319,31670,,,,31670
31674,templo,templo,b.ACT.005.020,35.619167,33.186667,31674,,,,31674
31675,Israel,Israel,b.ACT.005.021,34.851612,31.046051000000002,31675,,,,31675
31676,templo,templo,b.ACT.005.021,35.619167,33.186667,31676,,,,31676
31679,templo,templo,b.ACT.005.024,35.619167,33.186667,31679,,,,31679
31680,templo,templo,b.ACT.005.025,35.619167,33.186667,31680,,,,31680
31683,Jerusalén,Jerusalén,b.ACT.005.028,35.21371,31.768319,31683,,,,31683
31686,Israel,Israel,b.ACT.005.031,34.851612,31.046051000000002,31686,,,,31686
31697,templo,templo,b.ACT.005.042,35.619167,33.186667,31697,,,,31697
31702,Antioquía,Antioquía,b.ACT.006.005,36.1612344,36.196803100000004,31702,,,,31702
31704,Jerusalén,Jerusalén,b.ACT.006.007,35.21371,31.768319,31704,,,,31704
31708,Cirene,Cirene,b.ACT.006.009,21.862820499999998,32.8034486,31708,,,,31708
31709,Asia,Asia,b.ACT.006.009,34.126575,39.555216,31709,,,,31709
31710,Alejandría,Alejandría,b.ACT.006.009,29.9187387,31.2000924,31710,,,,31710
31714,templo,templo,b.ACT.006.013,35.619167,33.186667,31714,,,,31714
31715,templo,templo,b.ACT.006.014,35.619167,33.186667,31715,,,,31715
31716,Nazaret,Nazaret,b.ACT.006.014,35.303546000000004,32.699635,31716,,,,31716
31719,Mesopotamia,Mesopotamia,b.ACT.007.002,43.483738,34.5337527,31719,,,,31719
31721,Canaán,Canaán,b.ACT.007.003,35.289528,32.055556,31721,,,,31721
31722,Ur,Ur,b.ACT.007.003,46.10444,30.96222,31722,,,,31722
31723,Ur,Ur,b.ACT.007.004,46.10444,30.96222,31723,,,,31723
31726,Egipto,Egipto,b.ACT.007.006,30.802497999999996,26.820553000000004,31726,,,,31726
31729,Egipto,Egipto,b.ACT.007.009,30.802497999999996,26.820553000000004,31729,,,,31729
31730,Egipto,Egipto,b.ACT.007.010,30.802497999999996,26.820553000000004,31730,,,,31730
31731,Canaán,Canaán,b.ACT.007.011,35.289528,32.055556,31731,,,,31731
31732,Egipto,Egipto,b.ACT.007.011,30.802497999999996,26.820553000000004,31732,,,,31732
31733,Egipto,Egipto,b.ACT.007.012,30.802497999999996,26.820553000000004,31733,,,,31733
31736,Egipto,Egipto,b.ACT.007.015,30.802497999999996,26.820553000000004,31736,,,,31736
31737,Macpela,Macpela,b.ACT.007.016,35.098611,31.535,31737,,,,31737
31738,Siquem,Siquem,b.ACT.007.016,35.266111,32.216111,31738,,,,31738
31739,Egipto,Egipto,b.ACT.007.017,30.802497999999996,26.820553000000004,31739,,,,31739
31740,Egipto,Egipto,b.ACT.007.018,30.802497999999996,26.820553000000004,31740,,,,31740
31752,Sinaí,Sinaí,b.ACT.007.030,34.0,29.5,31752,,,,31752
31755,Sinaí,Sinaí,b.ACT.007.033,34.0,29.5,31755,,,,31755
31756,Egipto,Egipto,b.ACT.007.034,30.802497999999996,26.820553000000004,31756,,,,31756
31758,Egipto,Egipto,b.ACT.007.036,30.802497999999996,26.820553000000004,31758,,,,31758
31759,Sinaí,Sinaí,b.ACT.007.036,34.0,29.5,31759,,,,31759
31760,Mar Rojo,Mar Rojo,b.ACT.007.036,38.512572999999996,20.280232,31760,,,,31760
31761,Israel,Israel,b.ACT.007.037,34.851612,31.046051000000002,31761,,,,31761
31762,Sinaí,Sinaí,b.ACT.007.038,34.0,29.5,31762,,,,31762
31763,Sinaí,Sinaí,b.ACT.007.038,34.0,29.5,31763,,,,31763
31764,Egipto,Egipto,b.ACT.007.039,30.802497999999996,26.820553000000004,31764,,,,31764
31765,Egipto,Egipto,b.ACT.007.040,30.802497999999996,26.820553000000004,31765,,,,31765
31768,Israel,Israel,b.ACT.007.042,34.851612,31.046051000000002,31768,,,,31768
31769,Sinaí,Sinaí,b.ACT.007.042,34.0,29.5,31769,,,,31769
31771,Babilonia,Babilonia,b.ACT.007.043,44.431644,32.541781,31771,,,,31771
31772,Sinaí,Sinaí,b.ACT.007.044,34.0,29.5,31772,,,,31772
31773,Canaán,Canaán,b.ACT.007.045,35.289528,32.055556,31773,,,,31773
31775,templo,templo,b.ACT.007.047,35.619167,33.186667,31775,,,,31775
31777,tierra,tierra,b.ACT.007.049,0.0,-90.0,31777,,,,31777
31779,templo,templo,b.ACT.007.049,35.619167,33.186667,31779,,,,31779
31788,Jerusalén,Jerusalén,b.ACT.007.058,35.21371,31.768319,31788,,,,31788
31791,Jerusalén,Jerusalén,b.ACT.008.001,35.21371,31.768319,31791,,,,31791
31792,Judea,Judea,b.ACT.008.001,35.2035394,31.903215399999997,31792,,,,31792
31793,Samaria,Samaria,b.ACT.008.001,35.3027226,32.422877,31793,,,,31793
31797,Samaria,Samaria,b.ACT.008.005,35.3027226,32.422877,31797,,,,31797
31800,Samaria,Samaria,b.ACT.008.008,35.3027226,32.422877,31800,,,,31800
31801,Samaria,Samaria,b.ACT.008.009,35.3027226,32.422877,31801,,,,31801
31807,Jerusalén,Jerusalén,b.ACT.008.014,35.21371,31.768319,31807,,,,31807
31808,Samaria,Samaria,b.ACT.008.014,35.3027226,32.422877,31808,,,,31808
31819,Jerusalén,Jerusalén,b.ACT.008.025,35.21371,31.768319,31819,,,,31819
31820,Gaza,Gaza,b.ACT.008.026,34.3088255,31.354676300000005,31820,,,,31820
31821,Jerusalén,Jerusalén,b.ACT.008.026,35.21371,31.768319,31821,,,,31821
31822,Jerusalén,Jerusalén,b.ACT.008.027,35.21371,31.768319,31822,,,,31822
31828,tierra,tierra,b.ACT.008.033,0.0,-90.0,31828,,,,31828
31835,Cesarea,Cesarea,b.ACT.008.040,34.891667,32.5,31835,,,,31835
31838,Damasco,Damasco,b.ACT.009.002,36.2765279,33.5138073,31838,,,,31838
31839,Jerusalén,Jerusalén,b.ACT.009.002,35.21371,31.768319,31839,,,,31839
31840,Damasco,Damasco,b.ACT.009.003,36.2765279,33.5138073,31840,,,,31840
31843,Damasco,Damasco,b.ACT.009.006,36.2765279,33.5138073,31843,,,,31843
31845,Damasco,Damasco,b.ACT.009.008,36.2765279,33.5138073,31845,,,,31845
31847,Damasco,Damasco,b.ACT.009.010,36.2765279,33.5138073,31847,,,,31847
31848,Tarso,Tarso,b.ACT.009.011,34.8952102,36.916561200000004,31848,,,,31848
31850,Jerusalén,Jerusalén,b.ACT.009.013,35.21371,31.768319,31850,,,,31850
31852,Israel,Israel,b.ACT.009.015,34.851612,31.046051000000002,31852,,,,31852
31856,Damasco,Damasco,b.ACT.009.019,36.2765279,33.5138073,31856,,,,31856
31858,Jerusalén,Jerusalén,b.ACT.009.021,35.21371,31.768319,31858,,,,31858
31859,Damasco,Damasco,b.ACT.009.022,36.2765279,33.5138073,31859,,,,31859
31863,Jerusalén,Jerusalén,b.ACT.009.026,35.21371,31.768319,31863,,,,31863
31864,Damasco,Damasco,b.ACT.009.027,36.2765279,33.5138073,31864,,,,31864
31865,Jerusalén,Jerusalén,b.ACT.009.028,35.21371,31.768319,31865,,,,31865
31867,Cesarea,Cesarea,b.ACT.009.030,34.891667,32.5,31867,,,,31867
31868,Tarso,Tarso,b.ACT.009.030,34.8952102,36.916561200000004,31868,,,,31868
31869,Judea,Judea,b.ACT.009.031,35.2035394,31.903215399999997,31869,,,,31869
31870,Galilea,Galilea,b.ACT.009.031,35.5879975,32.8244321,31870,,,,31870
31871,Samaria,Samaria,b.ACT.009.031,35.3027226,32.422877,31871,,,,31871
31886,Cesarea,Cesarea,b.ACT.010.001,34.891667,32.5,31886,,,,31886
31896,tierra,tierra,b.ACT.010.011,0.0,-90.0,31896,,,,31896
31910,Cesarea,Cesarea,b.ACT.010.024,34.891667,32.5,31910,,,,31910
31922,Israel,Israel,b.ACT.010.036,34.851612,31.046051000000002,31922,,,,31922
31923,Judea,Judea,b.ACT.010.037,35.2035394,31.903215399999997,31923,,,,31923
31924,Galilea,Galilea,b.ACT.010.037,35.5879975,32.8244321,31924,,,,31924
31925,Nazaret,Nazaret,b.ACT.010.038,35.303546000000004,32.699635,31925,,,,31925
31926,tierra,tierra,b.ACT.010.039,0.0,-90.0,31926,,,,31926
31927,Jerusalén,Jerusalén,b.ACT.010.039,35.21371,31.768319,31927,,,,31927
31928,Judea,Judea,b.ACT.010.039,35.2035394,31.903215399999997,31928,,,,31928
31938,Judea,Judea,b.ACT.011.001,35.2035394,31.903215399999997,31938,,,,31938
31939,Jerusalén,Jerusalén,b.ACT.011.002,35.21371,31.768319,31939,,,,31939
31949,Cesarea,Cesarea,b.ACT.011.011,34.891667,32.5,31949,,,,31949
31957,Antioquía,Antioquía,b.ACT.011.019,36.1612344,36.196803100000004,31957,,,,31957
31958,Fenicia,Fenicia,b.ACT.011.019,35.506519,33.898013,31958,,,,31958
31959,Chipre,Chipre,b.ACT.011.019,33.429859,35.126413,31959,,,,31959
31960,Cirene,Cirene,b.ACT.011.020,21.862820499999998,32.8034486,31960,,,,31960
31961,Antioquía,Antioquía,b.ACT.011.020,36.1612344,36.196803100000004,31961,,,,31961
31962,Chipre,Chipre,b.ACT.011.020,33.429859,35.126413,31962,,,,31962
31964,Jerusalén,Jerusalén,b.ACT.011.022,35.21371,31.768319,31964,,,,31964
31965,Antioquía,Antioquía,b.ACT.011.022,36.1612344,36.196803100000004,31965,,,,31965
31968,Antioquía,Antioquía,b.ACT.011.025,36.1612344,36.196803100000004,31968,,,,31968
31969,Tarso,Tarso,b.ACT.011.025,34.8952102,36.916561200000004,31969,,,,31969
31970,Antioquía,Antioquía,b.ACT.011.026,36.1612344,36.196803100000004,31970,,,,31970
31971,Jerusalén,Jerusalén,b.ACT.011.027,35.21371,31.768319,31971,,,,31971
31972,Antioquía,Antioquía,b.ACT.011.027,36.1612344,36.196803100000004,31972,,,,31972
31973,tierra,tierra,b.ACT.011.028,0.0,-90.0,31973,,,,31973
31974,Judea,Judea,b.ACT.011.029,35.2035394,31.903215399999997,31974,,,,31974
31985,Jerusalén,Jerusalén,b.ACT.012.010,35.21371,31.768319,31985,,,,31985
31994,Judea,Judea,b.ACT.012.019,35.2035394,31.903215399999997,31994,,,,31994
31995,Cesarea,Cesarea,b.ACT.012.019,34.891667,32.5,31995,,,,31995
31996,Sidón,Sidón,b.ACT.012.020,35.372948,33.5570691,31996,,,,31996
31997,Tiro,Tiro,b.ACT.012.020,35.2037641,33.2704888,31997,,,,31997
32002,Jerusalén,Jerusalén,b.ACT.012.025,35.21371,31.768319,32002,,,,32002
32003,Cirene,Cirene,b.ACT.013.001,21.862820499999998,32.8034486,32003,,,,32003
32004,Antioquía,Antioquía,b.ACT.013.001,36.1612344,36.196803100000004,32004,,,,32004
32007,Chipre,Chipre,b.ACT.013.004,33.429859,35.126413,32007,,,,32007
32009,Salamina,Salamina,b.ACT.013.005,23.5133267,37.929078600000004,32009,,,,32009
32010,Pafos,Pafos,b.ACT.013.006,32.4297369,34.7720133,32010,,,,32010
32017,Jerusalén,Jerusalén,b.ACT.013.013,35.21371,31.768319,32017,,,,32017
32018,Pafos,Pafos,b.ACT.013.013,32.4297369,34.7720133,32018,,,,32018
32019,Perge,Perge,b.ACT.013.013,30.854056800000002,36.9613995,32019,,,,32019
32021,Pisidia,Pisidia,b.ACT.013.014,30.284870899999998,37.7188751,32021,,,,32021
32022,Perge,Perge,b.ACT.013.014,30.854056800000002,36.9613995,32022,,,,32022
32023,Antioquía,Antioquía,b.ACT.013.014,36.1612344,36.196803100000004,32023,,,,32023
32026,Egipto,Egipto,b.ACT.013.017,30.802497999999996,26.820553000000004,32026,,,,32026
32027,Israel,Israel,b.ACT.013.017,34.851612,31.046051000000002,32027,,,,32027
32028,Sinaí,Sinaí,b.ACT.013.018,34.0,29.5,32028,,,,32028
32029,Canaán,Canaán,b.ACT.013.019,35.289528,32.055556,32029,,,,32029
32033,Israel,Israel,b.ACT.013.023,34.851612,31.046051000000002,32033,,,,32033
32034,Israel,Israel,b.ACT.013.024,34.851612,31.046051000000002,32034,,,,32034
32037,Jerusalén,Jerusalén,b.ACT.013.027,35.21371,31.768319,32037,,,,32037
32041,Jerusalén,Jerusalén,b.ACT.013.031,35.21371,31.768319,32041,,,,32041
32042,Galilea,Galilea,b.ACT.013.031,35.5879975,32.8244321,32042,,,,32042
32055,Antioquía,Antioquía,b.ACT.013.044,36.1612344,36.196803100000004,32055,,,,32055
32058,tierra,tierra,b.ACT.013.047,0.0,-90.0,32058,,,,32058
32060,Pisidia,Pisidia,b.ACT.013.049,30.284870899999998,37.7188751,32060,,,,32060
32061,Antioquía,Antioquía,b.ACT.013.050,36.1612344,36.196803100000004,32061,,,,32061
32062,Iconio,Iconio,b.ACT.013.051,32.4931554,37.8746429,32062,,,,32062
32064,Iconio,Iconio,b.ACT.014.001,32.4931554,37.8746429,32064,,,,32064
32067,Iconio,Iconio,b.ACT.014.004,32.4931554,37.8746429,32067,,,,32067
32069,Fenicia,Fenicia,b.ACT.014.006,35.506519,33.898013,32069,,,,32069
32070,Listra,Listra,b.ACT.014.006,32.21071,37.66411,32070,,,,32070
32074,Listra,Listra,b.ACT.014.008,32.21071,37.66411,32074,,,,32074
32079,Listra,Listra,b.ACT.014.013,32.21071,37.66411,32079,,,,32079
32081,tierra,tierra,b.ACT.014.015,0.0,-90.0,32081,,,,32081
32085,Antioquía,Antioquía,b.ACT.014.019,36.1612344,36.196803100000004,32085,,,,32085
32086,Iconio,Iconio,b.ACT.014.019,32.4931554,37.8746429,32086,,,,32086
32087,Listra,Listra,b.ACT.014.019,32.21071,37.66411,32087,,,,32087
32088,Listra,Listra,b.ACT.014.020,32.21071,37.66411,32088,,,,32088
32090,Antioquía,Antioquía,b.ACT.014.021,36.1612344,36.196803100000004,32090,,,,32090
32091,Iconio,Iconio,b.ACT.014.021,32.4931554,37.8746429,32091,,,,32091
32092,Listra,Listra,b.ACT.014.021,32.21071,37.66411,32092,,,,32092
32098,Perge,Perge,b.ACT.014.025,30.854056800000002,36.9613995,32098,,,,32098
32100,Antioquía,Antioquía,b.ACT.014.026,36.1612344,36.196803100000004,32100,,,,32100
32103,Judea,Judea,b.ACT.015.001,35.2035394,31.903215399999997,32103,,,,32103
32104,Jerusalén,Jerusalén,b.ACT.015.002,35.21371,31.768319,32104,,,,32104
32105,Samaria,Samaria,b.ACT.015.003,35.3027226,32.422877,32105,,,,32105
32106,Fenicia,Fenicia,b.ACT.015.003,35.506519,33.898013,32106,,,,32106
32107,Jerusalén,Jerusalén,b.ACT.015.004,35.21371,31.768319,32107,,,,32107
32125,Antioquía,Antioquía,b.ACT.015.022,36.1612344,36.196803100000004,32125,,,,32125
32126,Siria,Siria,b.ACT.015.023,38.996815000000005,34.802075,32126,,,,32126
32128,Antioquía,Antioquía,b.ACT.015.023,36.1612344,36.196803100000004,32128,,,,32128
32135,Antioquía,Antioquía,b.ACT.015.030,36.1612344,36.196803100000004,32135,,,,32135
32140,Antioquía,Antioquía,b.ACT.015.035,36.1612344,36.196803100000004,32140,,,,32140
32144,Chipre,Chipre,b.ACT.015.039,33.429859,35.126413,32144,,,,32144
32146,Siria,Siria,b.ACT.015.041,38.996815000000005,34.802075,32146,,,,32146
32148,Listra,Listra,b.ACT.016.001,32.21071,37.66411,32148,,,,32148
32150,Iconio,Iconio,b.ACT.016.002,32.4931554,37.8746429,32150,,,,32150
32151,Listra,Listra,b.ACT.016.002,32.21071,37.66411,32151,,,,32151
32152,Iconio,Iconio,b.ACT.016.003,32.4931554,37.8746429,32152,,,,32152
32153,Listra,Listra,b.ACT.016.003,32.21071,37.66411,32153,,,,32153
32154,Jerusalén,Jerusalén,b.ACT.016.004,35.21371,31.768319,32154,,,,32154
32155,Iconio,Iconio,b.ACT.016.004,32.4931554,37.8746429,32155,,,,32155
32156,Listra,Listra,b.ACT.016.004,32.21071,37.66411,32156,,,,32156
32158,Asia,Asia,b.ACT.016.006,34.126575,39.555216,32158,,,,32158
32163,Troas,Troas,b.ACT.016.008,26.158790600000003,39.75172070000001,32163,,,,32163
32165,Macedonia,Macedonia,b.ACT.016.009,21.745275,41.608635,32165,,,,32165
32166,Macedonia,Macedonia,b.ACT.016.010,21.745275,41.608635,32166,,,,32166
32167,Troas,Troas,b.ACT.016.011,26.158790600000003,39.75172070000001,32167,,,,32167
32168,Samotracia,Samotracia,b.ACT.016.011,25.5917918,40.447683399999995,32168,,,,32168
32169,Neápolis,Neápolis,b.ACT.016.011,25.604853100000003,35.2563455,32169,,,,32169
32170,Macedonia,Macedonia,b.ACT.016.012,21.745275,41.608635,32170,,,,32170
32202,Tesalónica,Tesalónica,b.ACT.017.001,22.9444191,40.6400629,32202,,,,32202
32206,Tesalónica,Tesalónica,b.ACT.017.005,22.9444191,40.6400629,32206,,,,32206
32207,Tesalónica,Tesalónica,b.ACT.017.006,22.9444191,40.6400629,32207,,,,32207
32209,Tesalónica,Tesalónica,b.ACT.017.008,22.9444191,40.6400629,32209,,,,32209
32212,Tesalónica,Tesalónica,b.ACT.017.011,22.9444191,40.6400629,32212,,,,32212
32214,Tesalónica,Tesalónica,b.ACT.017.013,22.9444191,40.6400629,32214,,,,32214
32216,mar mediterráneo,mar mediterráneo,b.ACT.017.014,18.0480105,34.5531284,32216,,,,32216
32217,Atenas,Atenas,b.ACT.017.015,23.7275388,37.9838096,32217,,,,32217
32218,Atenas,Atenas,b.ACT.017.016,23.7275388,37.9838096,32218,,,,32218
32226,tierra,tierra,b.ACT.017.024,0.0,-90.0,32226,,,,32226
32229,tierra,tierra,b.ACT.017.026,0.0,-90.0,32229,,,,32229
32234,tierra,tierra,b.ACT.017.031,0.0,-90.0,32234,,,,32234
32238,Atenas,Atenas,b.ACT.018.001,23.7275388,37.9838096,32238,,,,32238
32239,Corinto,Corinto,b.ACT.018.001,22.9322383,37.9386365,32239,,,,32239
32241,Italia,Italia,b.ACT.018.002,12.56738,41.87194,32241,,,,32241
32242,Roma,Roma,b.ACT.018.002,12.4963655,41.902783500000005,32242,,,,32242
32245,Macedonia,Macedonia,b.ACT.018.005,21.745275,41.608635,32245,,,,32245
32250,Corinto,Corinto,b.ACT.018.010,22.9322383,37.9386365,32250,,,,32250
32258,Siria,Siria,b.ACT.018.018,38.996815000000005,34.802075,32258,,,,32258
32260,Éfeso,Éfeso,b.ACT.018.019,27.368055199999997,37.9484155,32260,,,,32260
32262,Jerusalén,Jerusalén,b.ACT.018.021,35.21371,31.768319,32262,,,,32262
32263,Éfeso,Éfeso,b.ACT.018.021,27.368055199999997,37.9484155,32263,,,,32263
32264,Cesarea,Cesarea,b.ACT.018.022,34.891667,32.5,32264,,,,32264
32265,Antioquía,Antioquía,b.ACT.018.022,36.1612344,36.196803100000004,32265,,,,32265
32268,Éfeso,Éfeso,b.ACT.018.024,27.368055199999997,37.9484155,32268,,,,32268
32269,Alejandría,Alejandría,b.ACT.018.024,29.9187387,31.2000924,32269,,,,32269
32274,Corinto,Corinto,b.ACT.019.001,22.9322383,37.9386365,32274,,,,32274
32275,Éfeso,Éfeso,b.ACT.019.001,27.368055199999997,37.9484155,32275,,,,32275
32284,Asia,Asia,b.ACT.019.010,34.126575,39.555216,32284,,,,32284
32291,Éfeso,Éfeso,b.ACT.019.017,27.368055199999997,37.9484155,32291,,,,32291
32295,Jerusalén,Jerusalén,b.ACT.019.021,35.21371,31.768319,32295,,,,32295
32296,Macedonia,Macedonia,b.ACT.019.021,21.745275,41.608635,32296,,,,32296
32297,Roma,Roma,b.ACT.019.021,12.4963655,41.902783500000005,32297,,,,32297
32299,Asia,Asia,b.ACT.019.022,34.126575,39.555216,32299,,,,32299
32300,Macedonia,Macedonia,b.ACT.019.022,21.745275,41.608635,32300,,,,32300
32304,Asia,Asia,b.ACT.019.026,34.126575,39.555216,32304,,,,32304
32305,Éfeso,Éfeso,b.ACT.019.026,27.368055199999997,37.9484155,32305,,,,32305
32306,Asia,Asia,b.ACT.019.027,34.126575,39.555216,32306,,,,32306
32308,Éfeso,Éfeso,b.ACT.019.029,27.368055199999997,37.9484155,32308,,,,32308
32310,Asia,Asia,b.ACT.019.031,34.126575,39.555216,32310,,,,32310
32314,Éfeso,Éfeso,b.ACT.019.035,27.368055199999997,37.9484155,32314,,,,32314
32321,Macedonia,Macedonia,b.ACT.020.001,21.745275,41.608635,32321,,,,32321
32322,Grecia,Grecia,b.ACT.020.002,21.824312,39.074208,32322,,,,32322
32323,Siria,Siria,b.ACT.020.003,38.996815000000005,34.802075,32323,,,,32323
32324,Macedonia,Macedonia,b.ACT.020.003,21.745275,41.608635,32324,,,,32324
32325,Asia,Asia,b.ACT.020.004,34.126575,39.555216,32325,,,,32325
32327,Tesalónica,Tesalónica,b.ACT.020.004,22.9444191,40.6400629,32327,,,,32327
32329,Troas,Troas,b.ACT.020.005,26.158790600000003,39.75172070000001,32329,,,,32329
32330,Troas,Troas,b.ACT.020.006,26.158790600000003,39.75172070000001,32330,,,,32330
32344,Jerusalén,Jerusalén,b.ACT.020.016,35.21371,31.768319,32344,,,,32344
32345,Asia,Asia,b.ACT.020.016,34.126575,39.555216,32345,,,,32345
32346,Éfeso,Éfeso,b.ACT.020.016,27.368055199999997,37.9484155,32346,,,,32346
32347,Éfeso,Éfeso,b.ACT.020.017,27.368055199999997,37.9484155,32347,,,,32347
32349,Asia,Asia,b.ACT.020.018,34.126575,39.555216,32349,,,,32349
32353,Jerusalén,Jerusalén,b.ACT.020.022,35.21371,31.768319,32353,,,,32353
32371,Rodas,Rodas,b.ACT.021.001,28.217637899999996,36.4340533,32371,,,,32371
32373,Fenicia,Fenicia,b.ACT.021.002,35.506519,33.898013,32373,,,,32373
32374,Tiro,Tiro,b.ACT.021.003,35.2037641,33.2704888,32374,,,,32374
32375,Siria,Siria,b.ACT.021.003,38.996815000000005,34.802075,32375,,,,32375
32376,Chipre,Chipre,b.ACT.021.003,33.429859,35.126413,32376,,,,32376
32377,Jerusalén,Jerusalén,b.ACT.021.004,35.21371,31.768319,32377,,,,32377
32378,Tiro,Tiro,b.ACT.021.005,35.2037641,33.2704888,32378,,,,32378
32380,Tiro,Tiro,b.ACT.021.007,35.2037641,33.2704888,32380,,,,32380
32382,Cesarea,Cesarea,b.ACT.021.008,34.891667,32.5,32382,,,,32382
32384,Judea,Judea,b.ACT.021.010,35.2035394,31.903215399999997,32384,,,,32384
32385,Jerusalén,Jerusalén,b.ACT.021.011,35.21371,31.768319,32385,,,,32385
32386,Jerusalén,Jerusalén,b.ACT.021.012,35.21371,31.768319,32386,,,,32386
32387,Cesarea,Cesarea,b.ACT.021.012,34.891667,32.5,32387,,,,32387
32388,Jerusalén,Jerusalén,b.ACT.021.013,35.21371,31.768319,32388,,,,32388
32390,Jerusalén,Jerusalén,b.ACT.021.015,35.21371,31.768319,32390,,,,32390
32391,Cesarea,Cesarea,b.ACT.021.016,34.891667,32.5,32391,,,,32391
32392,Chipre,Chipre,b.ACT.021.016,33.429859,35.126413,32392,,,,32392
32393,Jerusalén,Jerusalén,b.ACT.021.017,35.21371,31.768319,32393,,,,32393
32402,templo,templo,b.ACT.021.026,35.619167,33.186667,32402,,,,32402
32403,templo,templo,b.ACT.021.027,35.619167,33.186667,32403,,,,32403
32404,Asia,Asia,b.ACT.021.027,34.126575,39.555216,32404,,,,32404
32405,templo,templo,b.ACT.021.028,35.619167,33.186667,32405,,,,32405
32406,templo,templo,b.ACT.021.029,35.619167,33.186667,32406,,,,32406
32407,Éfeso,Éfeso,b.ACT.021.029,27.368055199999997,37.9484155,32407,,,,32407
32408,templo,templo,b.ACT.021.030,35.619167,33.186667,32408,,,,32408
32409,Jerusalén,Jerusalén,b.ACT.021.030,35.21371,31.768319,32409,,,,32409
32410,Jerusalén,Jerusalén,b.ACT.021.031,35.21371,31.768319,32410,,,,32410
32419,Tarso,Tarso,b.ACT.021.039,34.8952102,36.916561200000004,32419,,,,32419
32423,Jerusalén,Jerusalén,b.ACT.022.003,35.21371,31.768319,32423,,,,32423
32425,Tarso,Tarso,b.ACT.022.003,34.8952102,36.916561200000004,32425,,,,32425
32427,Damasco,Damasco,b.ACT.022.005,36.2765279,33.5138073,32427,,,,32427
32428,Jerusalén,Jerusalén,b.ACT.022.005,35.21371,31.768319,32428,,,,32428
32429,Damasco,Damasco,b.ACT.022.006,36.2765279,33.5138073,32429,,,,32429
32431,Nazaret,Nazaret,b.ACT.022.008,35.303546000000004,32.699635,32431,,,,32431
32433,Damasco,Damasco,b.ACT.022.010,36.2765279,33.5138073,32433,,,,32433
32434,Damasco,Damasco,b.ACT.022.011,36.2765279,33.5138073,32434,,,,32434
32440,templo,templo,b.ACT.022.017,35.619167,33.186667,32440,,,,32440
32441,Jerusalén,Jerusalén,b.ACT.022.017,35.21371,31.768319,32441,,,,32441
32442,Jerusalén,Jerusalén,b.ACT.022.018,35.21371,31.768319,32442,,,,32442
32446,tierra,tierra,b.ACT.022.022,0.0,-90.0,32446,,,,32446
32465,Jerusalén,Jerusalén,b.ACT.023.011,35.21371,31.768319,32465,,,,32465
32466,Roma,Roma,b.ACT.023.011,12.4963655,41.902783500000005,32466,,,,32466
32478,Cesarea,Cesarea,b.ACT.023.023,34.891667,32.5,32478,,,,32478
32488,Cesarea,Cesarea,b.ACT.023.033,34.891667,32.5,32488,,,,32488
32495,tierra,tierra,b.ACT.024.005,0.0,-90.0,32495,,,,32495
32496,templo,templo,b.ACT.024.006,35.619167,33.186667,32496,,,,32496
32500,Israel,Israel,b.ACT.024.010,34.851612,31.046051000000002,32500,,,,32500
32501,Jerusalén,Jerusalén,b.ACT.024.011,35.21371,31.768319,32501,,,,32501
32502,templo,templo,b.ACT.024.012,35.619167,33.186667,32502,,,,32502
32503,Jerusalén,Jerusalén,b.ACT.024.012,35.21371,31.768319,32503,,,,32503
32508,Tarso,Tarso,b.ACT.024.017,34.8952102,36.916561200000004,32508,,,,32508
32509,templo,templo,b.ACT.024.018,35.619167,33.186667,32509,,,,32509
32510,Asia,Asia,b.ACT.024.018,34.126575,39.555216,32510,,,,32510
32520,Jerusalén,Jerusalén,b.ACT.025.001,35.21371,31.768319,32520,,,,32520
32521,Cesarea,Cesarea,b.ACT.025.001,34.891667,32.5,32521,,,,32521
32523,Jerusalén,Jerusalén,b.ACT.025.003,35.21371,31.768319,32523,,,,32523
32524,Cesarea,Cesarea,b.ACT.025.004,34.891667,32.5,32524,,,,32524
32526,Cesarea,Cesarea,b.ACT.025.006,34.891667,32.5,32526,,,,32526
32527,Jerusalén,Jerusalén,b.ACT.025.007,35.21371,31.768319,32527,,,,32527
32528,templo,templo,b.ACT.025.008,35.619167,33.186667,32528,,,,32528
32529,Jerusalén,Jerusalén,b.ACT.025.009,35.21371,31.768319,32529,,,,32529
32533,Cesarea,Cesarea,b.ACT.025.013,34.891667,32.5,32533,,,,32533
32535,Jerusalén,Jerusalén,b.ACT.025.015,35.21371,31.768319,32535,,,,32535
32540,Jerusalén,Jerusalén,b.ACT.025.020,35.21371,31.768319,32540,,,,32540
32543,Roma,Roma,b.ACT.025.023,12.4963655,41.902783500000005,32543,,,,32543
32544,Jerusalén,Jerusalén,b.ACT.025.024,35.21371,31.768319,32544,,,,32544
32551,Jerusalén,Jerusalén,b.ACT.026.004,35.21371,31.768319,32551,,,,32551
32556,Nazaret,Nazaret,b.ACT.026.009,35.303546000000004,32.699635,32556,,,,32556
32557,Jerusalén,Jerusalén,b.ACT.026.010,35.21371,31.768319,32557,,,,32557
32559,Damasco,Damasco,b.ACT.026.012,36.2765279,33.5138073,32559,,,,32559
32567,Damasco,Damasco,b.ACT.026.020,36.2765279,33.5138073,32567,,,,32567
32568,Jerusalén,Jerusalén,b.ACT.026.020,35.21371,31.768319,32568,,,,32568
32569,Judea,Judea,b.ACT.026.020,35.2035394,31.903215399999997,32569,,,,32569
32570,templo,templo,b.ACT.026.021,35.619167,33.186667,32570,,,,32570
32582,Italia,Italia,b.ACT.027.001,12.56738,41.87194,32582,,,,32582
32583,Asia,Asia,b.ACT.027.002,34.126575,39.555216,32583,,,,32583
32584,Tesalónica,Tesalónica,b.ACT.027.002,22.9444191,40.6400629,32584,,,,32584
32585,Sidón,Sidón,b.ACT.027.003,35.372948,33.5570691,32585,,,,32585
32586,Chipre,Chipre,b.ACT.027.004,33.429859,35.126413,32586,,,,32586
32591,Italia,Italia,b.ACT.027.006,12.56738,41.87194,32591,,,,32591
32594,Creta,Creta,b.ACT.027.007,24.8092691,35.240117,32594,,,,32594
32601,Creta,Creta,b.ACT.027.012,24.8092691,35.240117,32601,,,,32601
32603,Creta,Creta,b.ACT.027.013,24.8092691,35.240117,32603,,,,32603
32611,Creta,Creta,b.ACT.027.021,24.8092691,35.240117,32611,,,,32611
32617,mar Adriático,mar Adriático,b.ACT.027.027,17.2902839,41.855090399999995,32617,,,,32617
32620,mar Adriático,mar Adriático,b.ACT.027.030,17.2902839,41.855090399999995,32620,,,,32620
32628,mar Adriático,mar Adriático,b.ACT.027.038,17.2902839,41.855090399999995,32628,,,,32628
32630,mar Adriático,mar Adriático,b.ACT.027.040,17.2902839,41.855090399999995,32630,,,,32630
32631,mar Adriático,mar Adriático,b.ACT.027.041,17.2902839,41.855090399999995,32631,,,,32631
32635,Malta,Malta,b.ACT.028.001,14.375416,35.937496,32635,,,,32635
32636,Malta,Malta,b.ACT.028.002,14.375416,35.937496,32636,,,,32636
32641,Malta,Malta,b.ACT.028.007,14.375416,35.937496,32641,,,,32641
32643,Malta,Malta,b.ACT.028.009,14.375416,35.937496,32643,,,,32643
32645,Malta,Malta,b.ACT.028.011,14.375416,35.937496,32645,,,,32645
32646,Siracusa,Siracusa,b.ACT.028.012,15.286586100000001,37.0754739,32646,,,,32646
32649,Roma,Roma,b.ACT.028.014,12.4963655,41.902783500000005,32649,,,,32649
32652,Roma,Roma,b.ACT.028.016,12.4963655,41.902783500000005,32652,,,,32652
32653,Jerusalén,Jerusalén,b.ACT.028.017,35.21371,31.768319,32653,,,,32653
32656,Patmos,Patmos,b.ACT.028.020,26.5468773,37.312976299999995,32656,,,,32656
32657,Judea,Judea,b.ACT.028.021,35.2035394,31.903215399999997,32657,,,,32657
