dx,dy,filename,time
0,0,small_stage_fixed_calibration_images/img0_dx0_dy0.png,2023-09-13 14:59:39.774124
-25,-25,small_stage_fixed_calibration_images/img1_dx-25_dy-25.png,2023-09-13 14:59:42.721363
0,0,small_stage_fixed_calibration_images/img2_dx0_dy0.png,2023-09-13 14:59:45.577810
-25,-20,small_stage_fixed_calibration_images/img3_dx-25_dy-20.png,2023-09-13 14:59:48.477867
0,0,small_stage_fixed_calibration_images/img4_dx0_dy0.png,2023-09-13 14:59:51.162292
-25,-15,small_stage_fixed_calibration_images/img5_dx-25_dy-15.png,2023-09-13 14:59:54.041154
0,0,small_stage_fixed_calibration_images/img6_dx0_dy0.png,2023-09-13 14:59:56.737407
-25,-10,small_stage_fixed_calibration_images/img7_dx-25_dy-10.png,2023-09-13 14:59:59.594859
0,0,small_stage_fixed_calibration_images/img8_dx0_dy0.png,2023-09-13 15:00:02.459815
-25,-5,small_stage_fixed_calibration_images/img9_dx-25_dy-5.png,2023-09-13 15:00:05.310199
0,0,small_stage_fixed_calibration_images/img10_dx0_dy0.png,2023-09-13 15:00:08.175686
-25,0,small_stage_fixed_calibration_images/img11_dx-25_dy0.png,2023-09-13 15:00:10.928782
0,0,small_stage_fixed_calibration_images/img12_dx0_dy0.png,2023-09-13 15:00:13.680940
-25,5,small_stage_fixed_calibration_images/img13_dx-25_dy5.png,2023-09-13 15:00:16.543608
0,0,small_stage_fixed_calibration_images/img14_dx0_dy0.png,2023-09-13 15:00:19.416039
-25,10,small_stage_fixed_calibration_images/img15_dx-25_dy10.png,2023-09-13 15:00:22.278125
0,0,small_stage_fixed_calibration_images/img16_dx0_dy0.png,2023-09-13 15:00:25.146100
-25,15,small_stage_fixed_calibration_images/img17_dx-25_dy15.png,2023-09-13 15:00:27.913488
0,0,small_stage_fixed_calibration_images/img18_dx0_dy0.png,2023-09-13 15:00:30.769044
-25,20,small_stage_fixed_calibration_images/img19_dx-25_dy20.png,2023-09-13 15:00:33.618486
0,0,small_stage_fixed_calibration_images/img20_dx0_dy0.png,2023-09-13 15:00:36.479834
-25,25,small_stage_fixed_calibration_images/img21_dx-25_dy25.png,2023-09-13 15:00:39.358737
0,0,small_stage_fixed_calibration_images/img22_dx0_dy0.png,2023-09-13 15:00:42.214881
-20,-25,small_stage_fixed_calibration_images/img23_dx-20_dy-25.png,2023-09-13 15:00:45.069818
0,0,small_stage_fixed_calibration_images/img24_dx0_dy0.png,2023-09-13 15:00:47.917177
-20,-20,small_stage_fixed_calibration_images/img25_dx-20_dy-20.png,2023-09-13 15:00:50.659310
0,0,small_stage_fixed_calibration_images/img26_dx0_dy0.png,2023-09-13 15:00:53.330924
-20,-15,small_stage_fixed_calibration_images/img27_dx-20_dy-15.png,2023-09-13 15:00:56.131421
0,0,small_stage_fixed_calibration_images/img28_dx0_dy0.png,2023-09-13 15:00:58.993328
-20,-10,small_stage_fixed_calibration_images/img29_dx-20_dy-10.png,2023-09-13 15:01:01.861635
0,0,small_stage_fixed_calibration_images/img30_dx0_dy0.png,2023-09-13 15:01:04.716445
-20,-5,small_stage_fixed_calibration_images/img31_dx-20_dy-5.png,2023-09-13 15:01:07.582970
0,0,small_stage_fixed_calibration_images/img32_dx0_dy0.png,2023-09-13 15:01:10.262047
-20,0,small_stage_fixed_calibration_images/img33_dx-20_dy0.png,2023-09-13 15:01:13.018011
0,0,small_stage_fixed_calibration_images/img34_dx0_dy0.png,2023-09-13 15:01:15.759355
-20,5,small_stage_fixed_calibration_images/img35_dx-20_dy5.png,2023-09-13 15:01:18.634164
0,0,small_stage_fixed_calibration_images/img36_dx0_dy0.png,2023-09-13 15:01:21.477003
-20,10,small_stage_fixed_calibration_images/img37_dx-20_dy10.png,2023-09-13 15:01:24.196135
0,0,small_stage_fixed_calibration_images/img38_dx0_dy0.png,2023-09-13 15:01:27.058606
-20,15,small_stage_fixed_calibration_images/img39_dx-20_dy15.png,2023-09-13 15:01:29.903203
0,0,small_stage_fixed_calibration_images/img40_dx0_dy0.png,2023-09-13 15:01:32.749874
-20,20,small_stage_fixed_calibration_images/img41_dx-20_dy20.png,2023-09-13 15:01:35.621032
0,0,small_stage_fixed_calibration_images/img42_dx0_dy0.png,2023-09-13 15:01:38.474142
-20,25,small_stage_fixed_calibration_images/img43_dx-20_dy25.png,2023-09-13 15:01:41.333478
0,0,small_stage_fixed_calibration_images/img44_dx0_dy0.png,2023-09-13 15:01:44.038299
-15,-25,small_stage_fixed_calibration_images/img45_dx-15_dy-25.png,2023-09-13 15:01:46.908776
0,0,small_stage_fixed_calibration_images/img46_dx0_dy0.png,2023-09-13 15:01:49.753138
-15,-20,small_stage_fixed_calibration_images/img47_dx-15_dy-20.png,2023-09-13 15:01:52.571223
0,0,small_stage_fixed_calibration_images/img48_dx0_dy0.png,2023-09-13 15:01:55.247649
-15,-15,small_stage_fixed_calibration_images/img49_dx-15_dy-15.png,2023-09-13 15:01:58.113625
0,0,small_stage_fixed_calibration_images/img50_dx0_dy0.png,2023-09-13 15:02:00.964622
-15,-10,small_stage_fixed_calibration_images/img51_dx-15_dy-10.png,2023-09-13 15:02:03.850211
0,0,small_stage_fixed_calibration_images/img52_dx0_dy0.png,2023-09-13 15:02:06.566689
-15,-5,small_stage_fixed_calibration_images/img53_dx-15_dy-5.png,2023-09-13 15:02:09.252396
0,0,small_stage_fixed_calibration_images/img54_dx0_dy0.png,2023-09-13 15:02:11.942135
-15,0,small_stage_fixed_calibration_images/img55_dx-15_dy0.png,2023-09-13 15:02:14.701817
0,0,small_stage_fixed_calibration_images/img56_dx0_dy0.png,2023-09-13 15:02:17.461964
-15,5,small_stage_fixed_calibration_images/img57_dx-15_dy5.png,2023-09-13 15:02:20.288832
0,0,small_stage_fixed_calibration_images/img58_dx0_dy0.png,2023-09-13 15:02:23.127760
-15,10,small_stage_fixed_calibration_images/img59_dx-15_dy10.png,2023-09-13 15:02:25.979712
0,0,small_stage_fixed_calibration_images/img60_dx0_dy0.png,2023-09-13 15:02:28.803380
-15,15,small_stage_fixed_calibration_images/img61_dx-15_dy15.png,2023-09-13 15:02:31.670577
0,0,small_stage_fixed_calibration_images/img62_dx0_dy0.png,2023-09-13 15:02:34.531817
-15,20,small_stage_fixed_calibration_images/img63_dx-15_dy20.png,2023-09-13 15:02:37.389158
0,0,small_stage_fixed_calibration_images/img64_dx0_dy0.png,2023-09-13 15:02:40.216002
-15,25,small_stage_fixed_calibration_images/img65_dx-15_dy25.png,2023-09-13 15:02:43.094705
0,0,small_stage_fixed_calibration_images/img66_dx0_dy0.png,2023-09-13 15:02:45.919661
-10,-25,small_stage_fixed_calibration_images/img67_dx-10_dy-25.png,2023-09-13 15:02:48.779824
0,0,small_stage_fixed_calibration_images/img68_dx0_dy0.png,2023-09-13 15:02:51.622825
-10,-20,small_stage_fixed_calibration_images/img69_dx-10_dy-20.png,2023-09-13 15:02:54.501123
0,0,small_stage_fixed_calibration_images/img70_dx0_dy0.png,2023-09-13 15:02:57.323507
-10,-15,small_stage_fixed_calibration_images/img71_dx-10_dy-15.png,2023-09-13 15:03:00.175075
0,0,small_stage_fixed_calibration_images/img72_dx0_dy0.png,2023-09-13 15:03:02.979180
-10,-10,small_stage_fixed_calibration_images/img73_dx-10_dy-10.png,2023-09-13 15:03:05.839205
0,0,small_stage_fixed_calibration_images/img74_dx0_dy0.png,2023-09-13 15:03:08.648577
-10,-5,small_stage_fixed_calibration_images/img75_dx-10_dy-5.png,2023-09-13 15:03:11.528218
0,0,small_stage_fixed_calibration_images/img76_dx0_dy0.png,2023-09-13 15:03:14.222351
-10,0,small_stage_fixed_calibration_images/img77_dx-10_dy0.png,2023-09-13 15:03:16.799243
0,0,small_stage_fixed_calibration_images/img78_dx0_dy0.png,2023-09-13 15:03:19.513962
-10,5,small_stage_fixed_calibration_images/img79_dx-10_dy5.png,2023-09-13 15:03:22.354942
0,0,small_stage_fixed_calibration_images/img80_dx0_dy0.png,2023-09-13 15:03:25.039319
-10,10,small_stage_fixed_calibration_images/img81_dx-10_dy10.png,2023-09-13 15:03:27.895773
0,0,small_stage_fixed_calibration_images/img82_dx0_dy0.png,2023-09-13 15:03:30.703831
-10,15,small_stage_fixed_calibration_images/img83_dx-10_dy15.png,2023-09-13 15:03:33.590861
0,0,small_stage_fixed_calibration_images/img84_dx0_dy0.png,2023-09-13 15:03:36.279130
-10,20,small_stage_fixed_calibration_images/img85_dx-10_dy20.png,2023-09-13 15:03:39.120022
0,0,small_stage_fixed_calibration_images/img86_dx0_dy0.png,2023-09-13 15:03:41.956137
-10,25,small_stage_fixed_calibration_images/img87_dx-10_dy25.png,2023-09-13 15:03:44.822160
0,0,small_stage_fixed_calibration_images/img88_dx0_dy0.png,2023-09-13 15:03:47.664177
-5,-25,small_stage_fixed_calibration_images/img89_dx-5_dy-25.png,2023-09-13 15:03:50.544303
0,0,small_stage_fixed_calibration_images/img90_dx0_dy0.png,2023-09-13 15:03:53.370878
-5,-20,small_stage_fixed_calibration_images/img91_dx-5_dy-20.png,2023-09-13 15:03:56.260245
0,0,small_stage_fixed_calibration_images/img92_dx0_dy0.png,2023-09-13 15:03:59.091721
-5,-15,small_stage_fixed_calibration_images/img93_dx-5_dy-15.png,2023-09-13 15:04:01.795490
0,0,small_stage_fixed_calibration_images/img94_dx0_dy0.png,2023-09-13 15:04:04.649859
-5,-10,small_stage_fixed_calibration_images/img95_dx-5_dy-10.png,2023-09-13 15:04:07.474245
0,0,small_stage_fixed_calibration_images/img96_dx0_dy0.png,2023-09-13 15:04:10.178547
-5,-5,small_stage_fixed_calibration_images/img97_dx-5_dy-5.png,2023-09-13 15:04:13.004527
0,0,small_stage_fixed_calibration_images/img98_dx0_dy0.png,2023-09-13 15:04:15.831028
-5,0,small_stage_fixed_calibration_images/img99_dx-5_dy0.png,2023-09-13 15:04:18.574056
0,0,small_stage_fixed_calibration_images/img100_dx0_dy0.png,2023-09-13 15:04:21.289372
-5,5,small_stage_fixed_calibration_images/img101_dx-5_dy5.png,2023-09-13 15:04:23.996391
0,0,small_stage_fixed_calibration_images/img102_dx0_dy0.png,2023-09-13 15:04:26.848048
-5,10,small_stage_fixed_calibration_images/img103_dx-5_dy10.png,2023-09-13 15:04:29.561998
0,0,small_stage_fixed_calibration_images/img104_dx0_dy0.png,2023-09-13 15:04:32.416889
-5,15,small_stage_fixed_calibration_images/img105_dx-5_dy15.png,2023-09-13 15:04:35.164147
0,0,small_stage_fixed_calibration_images/img106_dx0_dy0.png,2023-09-13 15:04:37.861453
-5,20,small_stage_fixed_calibration_images/img107_dx-5_dy20.png,2023-09-13 15:04:40.728374
0,0,small_stage_fixed_calibration_images/img108_dx0_dy0.png,2023-09-13 15:04:43.567598
-5,25,small_stage_fixed_calibration_images/img109_dx-5_dy25.png,2023-09-13 15:04:46.404317
0,0,small_stage_fixed_calibration_images/img110_dx0_dy0.png,2023-09-13 15:04:49.206083
0,-25,small_stage_fixed_calibration_images/img111_dx0_dy-25.png,2023-09-13 15:04:51.968616
0,0,small_stage_fixed_calibration_images/img112_dx0_dy0.png,2023-09-13 15:04:54.555816
0,-20,small_stage_fixed_calibration_images/img113_dx0_dy-20.png,2023-09-13 15:04:57.317968
0,0,small_stage_fixed_calibration_images/img114_dx0_dy0.png,2023-09-13 15:04:59.908033
0,-15,small_stage_fixed_calibration_images/img115_dx0_dy-15.png,2023-09-13 15:05:02.499607
0,0,small_stage_fixed_calibration_images/img116_dx0_dy0.png,2023-09-13 15:05:05.110128
0,-10,small_stage_fixed_calibration_images/img117_dx0_dy-10.png,2023-09-13 15:05:07.845533
0,0,small_stage_fixed_calibration_images/img118_dx0_dy0.png,2023-09-13 15:05:10.591201
0,-5,small_stage_fixed_calibration_images/img119_dx0_dy-5.png,2023-09-13 15:05:13.321415
0,0,small_stage_fixed_calibration_images/img120_dx0_dy0.png,2023-09-13 15:05:15.931761
0,0,small_stage_fixed_calibration_images/img121_dx0_dy0.png,2023-09-13 15:05:18.512843
0,0,small_stage_fixed_calibration_images/img122_dx0_dy0.png,2023-09-13 15:05:21.127644
0,5,small_stage_fixed_calibration_images/img123_dx0_dy5.png,2023-09-13 15:05:24.092716
0,0,small_stage_fixed_calibration_images/img124_dx0_dy0.png,2023-09-13 15:05:26.826407
0,10,small_stage_fixed_calibration_images/img125_dx0_dy10.png,2023-09-13 15:05:29.419735
0,0,small_stage_fixed_calibration_images/img126_dx0_dy0.png,2023-09-13 15:05:32.155419
0,15,small_stage_fixed_calibration_images/img127_dx0_dy15.png,2023-09-13 15:05:34.931996
0,0,small_stage_fixed_calibration_images/img128_dx0_dy0.png,2023-09-13 15:05:37.659955
0,20,small_stage_fixed_calibration_images/img129_dx0_dy20.png,2023-09-13 15:05:40.410835
0,0,small_stage_fixed_calibration_images/img130_dx0_dy0.png,2023-09-13 15:05:43.135601
0,25,small_stage_fixed_calibration_images/img131_dx0_dy25.png,2023-09-13 15:05:45.743806
0,0,small_stage_fixed_calibration_images/img132_dx0_dy0.png,2023-09-13 15:05:48.448487
5,-25,small_stage_fixed_calibration_images/img133_dx5_dy-25.png,2023-09-13 15:05:51.331738
0,0,small_stage_fixed_calibration_images/img134_dx0_dy0.png,2023-09-13 15:05:54.047842
5,-20,small_stage_fixed_calibration_images/img135_dx5_dy-20.png,2023-09-13 15:05:56.909553
0,0,small_stage_fixed_calibration_images/img136_dx0_dy0.png,2023-09-13 15:05:59.731441
5,-15,small_stage_fixed_calibration_images/img137_dx5_dy-15.png,2023-09-13 15:06:02.424608
0,0,small_stage_fixed_calibration_images/img138_dx0_dy0.png,2023-09-13 15:06:05.150286
5,-10,small_stage_fixed_calibration_images/img139_dx5_dy-10.png,2023-09-13 15:06:07.975657
0,0,small_stage_fixed_calibration_images/img140_dx0_dy0.png,2023-09-13 15:06:10.838676
5,-5,small_stage_fixed_calibration_images/img141_dx5_dy-5.png,2023-09-13 15:06:13.543628
0,0,small_stage_fixed_calibration_images/img142_dx0_dy0.png,2023-09-13 15:06:16.283304
5,0,small_stage_fixed_calibration_images/img143_dx5_dy0.png,2023-09-13 15:06:19.358278
0,0,small_stage_fixed_calibration_images/img144_dx0_dy0.png,2023-09-13 15:06:21.963823
5,5,small_stage_fixed_calibration_images/img145_dx5_dy5.png,2023-09-13 15:06:24.679510
0,0,small_stage_fixed_calibration_images/img146_dx0_dy0.png,2023-09-13 15:06:27.514999
5,10,small_stage_fixed_calibration_images/img147_dx5_dy10.png,2023-09-13 15:06:30.204786
0,0,small_stage_fixed_calibration_images/img148_dx0_dy0.png,2023-09-13 15:06:32.913623
5,15,small_stage_fixed_calibration_images/img149_dx5_dy15.png,2023-09-13 15:06:35.725607
0,0,small_stage_fixed_calibration_images/img150_dx0_dy0.png,2023-09-13 15:06:38.564074
5,20,small_stage_fixed_calibration_images/img151_dx5_dy20.png,2023-09-13 15:06:41.398998
0,0,small_stage_fixed_calibration_images/img152_dx0_dy0.png,2023-09-13 15:06:44.196518
5,25,small_stage_fixed_calibration_images/img153_dx5_dy25.png,2023-09-13 15:06:46.910262
0,0,small_stage_fixed_calibration_images/img154_dx0_dy0.png,2023-09-13 15:06:49.623008
10,-25,small_stage_fixed_calibration_images/img155_dx10_dy-25.png,2023-09-13 15:06:52.498321
0,0,small_stage_fixed_calibration_images/img156_dx0_dy0.png,2023-09-13 15:06:55.210207
10,-20,small_stage_fixed_calibration_images/img157_dx10_dy-20.png,2023-09-13 15:06:57.927835
0,0,small_stage_fixed_calibration_images/img158_dx0_dy0.png,2023-09-13 15:07:00.645896
10,-15,small_stage_fixed_calibration_images/img159_dx10_dy-15.png,2023-09-13 15:07:03.515225
0,0,small_stage_fixed_calibration_images/img160_dx0_dy0.png,2023-09-13 15:07:06.228464
10,-10,small_stage_fixed_calibration_images/img161_dx10_dy-10.png,2023-09-13 15:07:08.935497
0,0,small_stage_fixed_calibration_images/img162_dx0_dy0.png,2023-09-13 15:07:11.649946
10,-5,small_stage_fixed_calibration_images/img163_dx10_dy-5.png,2023-09-13 15:07:14.485366
0,0,small_stage_fixed_calibration_images/img164_dx0_dy0.png,2023-09-13 15:07:17.202101
10,0,small_stage_fixed_calibration_images/img165_dx10_dy0.png,2023-09-13 15:07:19.820100
0,0,small_stage_fixed_calibration_images/img166_dx0_dy0.png,2023-09-13 15:07:22.569436
10,5,small_stage_fixed_calibration_images/img167_dx10_dy5.png,2023-09-13 15:07:25.377925
0,0,small_stage_fixed_calibration_images/img168_dx0_dy0.png,2023-09-13 15:07:28.222593
10,10,small_stage_fixed_calibration_images/img169_dx10_dy10.png,2023-09-13 15:07:30.933869
0,0,small_stage_fixed_calibration_images/img170_dx0_dy0.png,2023-09-13 15:07:33.658703
10,15,small_stage_fixed_calibration_images/img171_dx10_dy15.png,2023-09-13 15:07:36.499108
0,0,small_stage_fixed_calibration_images/img172_dx0_dy0.png,2023-09-13 15:07:39.214074
10,20,small_stage_fixed_calibration_images/img173_dx10_dy20.png,2023-09-13 15:07:42.039497
0,0,small_stage_fixed_calibration_images/img174_dx0_dy0.png,2023-09-13 15:07:44.746259
10,25,small_stage_fixed_calibration_images/img175_dx10_dy25.png,2023-09-13 15:07:47.469947
0,0,small_stage_fixed_calibration_images/img176_dx0_dy0.png,2023-09-13 15:07:50.177646
15,-25,small_stage_fixed_calibration_images/img177_dx15_dy-25.png,2023-09-13 15:07:53.059405
0,0,small_stage_fixed_calibration_images/img178_dx0_dy0.png,2023-09-13 15:07:55.788108
15,-20,small_stage_fixed_calibration_images/img179_dx15_dy-20.png,2023-09-13 15:07:58.675862
0,0,small_stage_fixed_calibration_images/img180_dx0_dy0.png,2023-09-13 15:08:01.379081
15,-15,small_stage_fixed_calibration_images/img181_dx15_dy-15.png,2023-09-13 15:08:04.248273
0,0,small_stage_fixed_calibration_images/img182_dx0_dy0.png,2023-09-13 15:08:07.107809
15,-10,small_stage_fixed_calibration_images/img183_dx15_dy-10.png,2023-09-13 15:08:09.828946
0,0,small_stage_fixed_calibration_images/img184_dx0_dy0.png,2023-09-13 15:08:12.551358
15,-5,small_stage_fixed_calibration_images/img185_dx15_dy-5.png,2023-09-13 15:08:15.270154
0,0,small_stage_fixed_calibration_images/img186_dx0_dy0.png,2023-09-13 15:08:17.969518
15,0,small_stage_fixed_calibration_images/img187_dx15_dy0.png,2023-09-13 15:08:20.699516
0,0,small_stage_fixed_calibration_images/img188_dx0_dy0.png,2023-09-13 15:08:23.308810
15,5,small_stage_fixed_calibration_images/img189_dx15_dy5.png,2023-09-13 15:08:26.118774
0,0,small_stage_fixed_calibration_images/img190_dx0_dy0.png,2023-09-13 15:08:28.816285
15,10,small_stage_fixed_calibration_images/img191_dx15_dy10.png,2023-09-13 15:08:31.640642
0,0,small_stage_fixed_calibration_images/img192_dx0_dy0.png,2023-09-13 15:08:34.371865
15,15,small_stage_fixed_calibration_images/img193_dx15_dy15.png,2023-09-13 15:08:37.227141
0,0,small_stage_fixed_calibration_images/img194_dx0_dy0.png,2023-09-13 15:08:39.937627
15,20,small_stage_fixed_calibration_images/img195_dx15_dy20.png,2023-09-13 15:08:42.786610
0,0,small_stage_fixed_calibration_images/img196_dx0_dy0.png,2023-09-13 15:08:45.502573
15,25,small_stage_fixed_calibration_images/img197_dx15_dy25.png,2023-09-13 15:08:48.334860
0,0,small_stage_fixed_calibration_images/img198_dx0_dy0.png,2023-09-13 15:08:51.176303
20,-25,small_stage_fixed_calibration_images/img199_dx20_dy-25.png,2023-09-13 15:08:54.069789
0,0,small_stage_fixed_calibration_images/img200_dx0_dy0.png,2023-09-13 15:08:56.791491
20,-20,small_stage_fixed_calibration_images/img201_dx20_dy-20.png,2023-09-13 15:08:59.661857
0,0,small_stage_fixed_calibration_images/img202_dx0_dy0.png,2023-09-13 15:09:02.498880
20,-15,small_stage_fixed_calibration_images/img203_dx20_dy-15.png,2023-09-13 15:09:05.380051
0,0,small_stage_fixed_calibration_images/img204_dx0_dy0.png,2023-09-13 15:09:08.085081
20,-10,small_stage_fixed_calibration_images/img205_dx20_dy-10.png,2023-09-13 15:09:10.942938
0,0,small_stage_fixed_calibration_images/img206_dx0_dy0.png,2023-09-13 15:09:13.642479
20,-5,small_stage_fixed_calibration_images/img207_dx20_dy-5.png,2023-09-13 15:09:16.346914
0,0,small_stage_fixed_calibration_images/img208_dx0_dy0.png,2023-09-13 15:09:19.204229
20,0,small_stage_fixed_calibration_images/img209_dx20_dy0.png,2023-09-13 15:09:21.949257
0,0,small_stage_fixed_calibration_images/img210_dx0_dy0.png,2023-09-13 15:09:24.673097
20,5,small_stage_fixed_calibration_images/img211_dx20_dy5.png,2023-09-13 15:09:27.543548
0,0,small_stage_fixed_calibration_images/img212_dx0_dy0.png,2023-09-13 15:09:30.360310
20,10,small_stage_fixed_calibration_images/img213_dx20_dy10.png,2023-09-13 15:09:33.188319
0,0,small_stage_fixed_calibration_images/img214_dx0_dy0.png,2023-09-13 15:09:36.025760
20,15,small_stage_fixed_calibration_images/img215_dx20_dy15.png,2023-09-13 15:09:38.734857
0,0,small_stage_fixed_calibration_images/img216_dx0_dy0.png,2023-09-13 15:09:41.450156
20,20,small_stage_fixed_calibration_images/img217_dx20_dy20.png,2023-09-13 15:09:44.151708
0,0,small_stage_fixed_calibration_images/img218_dx0_dy0.png,2023-09-13 15:09:46.848634
20,25,small_stage_fixed_calibration_images/img219_dx20_dy25.png,2023-09-13 15:09:49.555711
0,0,small_stage_fixed_calibration_images/img220_dx0_dy0.png,2023-09-13 15:09:52.277832
25,-25,small_stage_fixed_calibration_images/img221_dx25_dy-25.png,2023-09-13 15:09:55.028434
0,0,small_stage_fixed_calibration_images/img222_dx0_dy0.png,2023-09-13 15:09:57.757258
25,-20,small_stage_fixed_calibration_images/img223_dx25_dy-20.png,2023-09-13 15:10:00.497040
0,0,small_stage_fixed_calibration_images/img224_dx0_dy0.png,2023-09-13 15:10:03.343371
25,-15,small_stage_fixed_calibration_images/img225_dx25_dy-15.png,2023-09-13 15:10:06.219032
0,0,small_stage_fixed_calibration_images/img226_dx0_dy0.png,2023-09-13 15:10:08.931686
25,-10,small_stage_fixed_calibration_images/img227_dx25_dy-10.png,2023-09-13 15:10:11.814601
0,0,small_stage_fixed_calibration_images/img228_dx0_dy0.png,2023-09-13 15:10:14.658689
25,-5,small_stage_fixed_calibration_images/img229_dx25_dy-5.png,2023-09-13 15:10:17.377600
0,0,small_stage_fixed_calibration_images/img230_dx0_dy0.png,2023-09-13 15:10:20.095445
25,0,small_stage_fixed_calibration_images/img231_dx25_dy0.png,2023-09-13 15:10:22.711691
0,0,small_stage_fixed_calibration_images/img232_dx0_dy0.png,2023-09-13 15:10:25.312215
25,5,small_stage_fixed_calibration_images/img233_dx25_dy5.png,2023-09-13 15:10:28.174264
0,0,small_stage_fixed_calibration_images/img234_dx0_dy0.png,2023-09-13 15:10:30.887947
25,10,small_stage_fixed_calibration_images/img235_dx25_dy10.png,2023-09-13 15:10:33.745087
0,0,small_stage_fixed_calibration_images/img236_dx0_dy0.png,2023-09-13 15:10:36.462449
25,15,small_stage_fixed_calibration_images/img237_dx25_dy15.png,2023-09-13 15:10:39.176847
0,0,small_stage_fixed_calibration_images/img238_dx0_dy0.png,2023-09-13 15:10:41.992302
25,20,small_stage_fixed_calibration_images/img239_dx25_dy20.png,2023-09-13 15:10:44.706076
0,0,small_stage_fixed_calibration_images/img240_dx0_dy0.png,2023-09-13 15:10:47.540535
25,25,small_stage_fixed_calibration_images/img241_dx25_dy25.png,2023-09-13 15:10:50.426982
0,0,small_stage_fixed_calibration_images/img242_dx0_dy0.png,2023-09-13 15:10:53.130009
