
 2023-03-26 01:27:25.526326
 Params true {0: 0.335, 1: 0.98, 2: 1.32, 3: 0.855}
 chisquare of params [0, 1, 2, 3]	 in range {0: [0.01, 1.0], 1: [0.2, 2.0], 2: [0.01, 2.0], 3: [0.01, 2.0]}
 with observables ['/ALEPH_2004_S5765862/d54-x01-y01' '/ALEPH_1991_S2435284/d01-x01-y01'
 '/ALEPH_2001_S4656318/d01-x01-y02' '/ALEPH_1999_S4193598/d01-x01-y01']
 for number events = 1000 with seed 6 and noise 0 ,real: on ,normalizey = True
 #baseest GaussianProcessRegressor(kernel=1**2 * Matern(length_scale=[1, 1, 1, 1], nu=2.5),
                         n_restarts_optimizer=10, noise=0, normalize_y=True,
                         random_state=1687321482)

 Closure test for true values {0: 0.335, 1: 0.98, 2: 1.32, 3: 0.855}
 2023-03-26 01:28:59.877759
 Params true {0: 0.335, 1: 0.98, 2: 1.32, 3: 0.855}
 chisquare of params [0, 1, 2, 3]	 in range {0: [0.01, 1.0], 1: [0.2, 2.0], 2: [0.01, 2.0], 3: [0.01, 2.0]}
 with observables ['/ALEPH_2004_S5765862/d54-x01-y01' '/ALEPH_1991_S2435284/d01-x01-y01'
 '/ALEPH_2001_S4656318/d01-x01-y02' '/ALEPH_1999_S4193598/d01-x01-y01']
 for number events = 1000 with seed 6 and noise 0 ,real: on ,normalizey = True
 #baseest GaussianProcessRegressor(kernel=1**2 * Matern(length_scale=[1, 1, 1, 1], nu=2.5),
                         n_restarts_optimizer=10, noise=0, normalize_y=True,
                         random_state=1687321482)

 Closure test for true values {0: 0.335, 1: 0.98, 2: 1.32, 3: 0.855}
 2023-03-26 01:29:10.162531
 Params true {0: 0.335, 1: 0.98, 2: 1.32, 3: 0.855}
 chisquare of params [0, 1, 2, 3]	 in range {0: [0.01, 1.0], 1: [0.2, 2.0], 2: [0.01, 2.0], 3: [0.01, 2.0]}
 with observables ['/ALEPH_2004_S5765862/d54-x01-y01' '/ALEPH_1991_S2435284/d01-x01-y01'
 '/ALEPH_2001_S4656318/d01-x01-y02' '/ALEPH_1999_S4193598/d01-x01-y01']
 for number events = 1000 with seed 6 and noise 0 ,real: on ,normalizey = True
 #baseest GaussianProcessRegressor(kernel=1**2 * Matern(length_scale=[1, 1, 1, 1], nu=2.5),
                         n_restarts_optimizer=10, noise=0, normalize_y=True,
                         random_state=1687321482)

 Closure test for true values {0: 0.335, 1: 0.98, 2: 1.32, 3: 0.855}
 2023-03-26 01:33:48.500886
 Params true {0: 0.335, 1: 0.98, 2: 1.32, 3: 0.855}
 chisquare of params [0, 1, 2, 3]	 in range {0: [0.01, 1.0], 1: [0.2, 2.0], 2: [0.01, 2.0], 3: [0.01, 2.0]}
 with observables ['/ALEPH_2004_S5765862/d54-x01-y01' '/ALEPH_1991_S2435284/d01-x01-y01'
 '/ALEPH_2001_S4656318/d01-x01-y02' '/ALEPH_1999_S4193598/d01-x01-y01']
 for number events = 1000 with seed 6 and noise 0 ,real: on ,normalizey = True
 #baseest GaussianProcessRegressor(kernel=1**2 * Matern(length_scale=[1, 1, 1, 1], nu=2.5),
                         n_restarts_optimizer=2, noise='gaussian',
                         normalize_y=True, random_state=1687321482)

 Closure test for true values {0: 0.335, 1: 0.98, 2: 1.32, 3: 0.855}
 2023-03-26 01:35:50.600234
 Params true {0: 0.335, 1: 0.98, 2: 1.32, 3: 0.855}
 chisquare of params [0, 1, 2, 3]	 in range {0: [0.01, 1.0], 1: [0.2, 2.0], 2: [0.01, 2.0], 3: [0.01, 2.0]}
 with observables ['/ALEPH_2004_S5765862/d54-x01-y01' '/ALEPH_1991_S2435284/d01-x01-y01'
 '/ALEPH_2001_S4656318/d01-x01-y02' '/ALEPH_1999_S4193598/d01-x01-y01']
 for number events = 1000 with seed 6 and noise 0 ,real: on ,normalizey = True
 #baseest GaussianProcessRegressor(kernel=1**2 * Matern(length_scale=[1, 1, 1, 1], nu=2.5),
                         n_restarts_optimizer=2, noise='gaussian',
                         normalize_y=True, random_state=1687321482)

 Closure test for true values {0: 0.335, 1: 0.98, 2: 1.32, 3: 0.855}
 2023-03-26 01:37:03.107075
 Params true {0: 0.335, 1: 0.98, 2: 1.32, 3: 0.855}
 chisquare of params [0, 1, 2, 3]	 in range {0: [0.01, 1.0], 1: [0.2, 2.0], 2: [0.01, 2.0], 3: [0.01, 2.0]}
 with observables ['/ALEPH_2004_S5765862/d54-x01-y01' '/ALEPH_1991_S2435284/d01-x01-y01'
 '/ALEPH_2001_S4656318/d01-x01-y02' '/ALEPH_1999_S4193598/d01-x01-y01']
 for number events = 1000 with seed 6 and noise 0 ,real: on ,normalizey = True
 #baseest GaussianProcessRegressor(kernel=1**2 * Matern(length_scale=[1, 1, 1, 1], nu=2.5),
                         n_restarts_optimizer=2, noise='gaussian',
                         normalize_y=True, random_state=1687321482)

 Closure test for true values {0: 0.335, 1: 0.98, 2: 1.32, 3: 0.855}
 2023-03-26 01:42:35.723891
 Params true {0: 0.335, 1: 0.98, 2: 1.32, 3: 0.855}
 chisquare of params [0, 1, 2, 3]	 in range {0: [0.01, 1.0], 1: [0.2, 2.0], 2: [0.01, 2.0], 3: [0.01, 2.0]}
 with observables ['/ALEPH_2004_S5765862/d54-x01-y01' '/ALEPH_1991_S2435284/d01-x01-y01'
 '/ALEPH_2001_S4656318/d01-x01-y02' '/ALEPH_1999_S4193598/d01-x01-y01']
 for number events = 100 with seed 7 and noise gaussian ,real: on ,normalizey = True
 #baseest GaussianProcessRegressor(kernel=1**2 * Matern(length_scale=[1, 1, 1, 1], nu=2.5),
                         n_restarts_optimizer=2, noise='gaussian',
                         normalize_y=True, random_state=327741615)

 Closure test for true values {0: 0.335, 1: 0.98, 2: 1.32, 3: 0.855}
 2023-03-26 01:47:00.983553
 Params true {0: 0.335, 1: 0.98, 2: 1.32, 3: 0.855}
 chisquare of params [0, 1, 2, 3]	 in range {0: [0.01, 1.0], 1: [0.2, 2.0], 2: [0.01, 2.0], 3: [0.01, 2.0]}
 with observables ['/ALEPH_2004_S5765862/d54-x01-y01' '/ALEPH_1991_S2435284/d01-x01-y01'
 '/ALEPH_2001_S4656318/d01-x01-y02' '/ALEPH_1999_S4193598/d01-x01-y01']
 for number events = 1000000 with seed 7 and noise gaussian ,real: on ,normalizey = True
 #baseest GaussianProcessRegressor(kernel=1**2 * Matern(length_scale=[1, 1, 1, 1], nu=2.5),
                         n_restarts_optimizer=2, noise='gaussian',
                         normalize_y=True, random_state=327741615)

 Closure test for true values {0: 0.335, 1: 0.98, 2: 1.32, 3: 0.855}
 2023-03-29 11:04:19.948505
 Params true {0: 0.335, 1: 0.98, 2: 1.32, 3: 0.855}
 chisquare of params [0, 1, 2, 3]	 in range {0: [0.01, 1.0], 1: [0.2, 2.0], 2: [0.01, 2.0], 3: [0.01, 2.0]}
 with observables ['/ALEPH_2004_S5765862/d54-x01-y01' '/ALEPH_1991_S2435284/d01-x01-y01'
 '/ALEPH_2001_S4656318/d01-x01-y02' '/ALEPH_1999_S4193598/d01-x01-y01']
 for number events = 1000000 with seed 7 and noise gaussian ,real: on ,normalizey = True
 #baseest GaussianProcessRegressor(kernel=1**2 * Matern(length_scale=[1, 1, 1, 1], nu=2.5),
                         n_restarts_optimizer=2, noise='gaussian',
                         normalize_y=True, random_state=327741615)

 Closure test for true values {0: 0.335, 1: 0.98, 2: 1.32, 3: 0.855}
 2023-03-29 11:07:06.414470
 Params true {0: 0.335, 1: 0.98, 2: 1.32, 3: 0.855}
 chisquare of params [0, 1, 2, 3]	 in range {0: [0.01, 1.0], 1: [0.2, 2.0], 2: [0.01, 2.0], 3: [0.01, 2.0]}
 with observables ['/ALEPH_2004_S5765862/d54-x01-y01' '/ALEPH_1991_S2435284/d01-x01-y01'
 '/ALEPH_2001_S4656318/d01-x01-y02' '/ALEPH_1999_S4193598/d01-x01-y01']
 for number events = 1000000 with seed 7 and noise gaussian ,real: on ,normalizey = True
 #baseest GaussianProcessRegressor(kernel=1**2 * Matern(length_scale=[1, 1, 1, 1], nu=2.5),
                         n_restarts_optimizer=2, noise='gaussian',
                         normalize_y=True, random_state=327741615)

 Closure test for true values {0: 0.335, 1: 0.98, 2: 1.32, 3: 0.855}
 2023-03-29 11:17:32.657007
 Params true {0: 0.335, 1: 0.98, 2: 1.32, 3: 0.855}
 chisquare of params [0, 1, 2, 3]	 in range {0: [0.01, 1.0], 1: [0.2, 2.0], 2: [0.01, 2.0], 3: [0.01, 2.0]}
 with observables ['/ALEPH_2004_S5765862/d54-x01-y01' '/ALEPH_1991_S2435284/d01-x01-y01'
 '/ALEPH_2001_S4656318/d01-x01-y02' '/ALEPH_1999_S4193598/d01-x01-y01']
 for number events = 1000000 with seed 7 and noise gaussian ,real: on ,normalizey = True
 #baseest GaussianProcessRegressor(kernel=1**2 * Matern(length_scale=[1, 1, 1, 1], nu=2.5),
                         n_restarts_optimizer=2, noise='gaussian',
                         normalize_y=True, random_state=327741615)

 Closure test for true values {0: 0.335, 1: 0.98, 2: 1.32, 3: 0.855}
 2023-03-29 11:47:36.211528
 Params true {0: 0.335, 1: 0.98, 2: 1.32, 3: 0.855}
 chisquare of params [0, 1, 2, 3]	 in range {0: [0.01, 1.0], 1: [0.2, 2.0], 2: [0.01, 2.0], 3: [0.01, 2.0]}
 with observables ['/ALEPH_2004_S5765862/d54-x01-y01' '/ALEPH_1991_S2435284/d01-x01-y01'
 '/ALEPH_2001_S4656318/d01-x01-y02' '/ALEPH_1999_S4193598/d01-x01-y01']
 for number events = 1000000 with seed 7 and noise gaussian ,real: on ,normalizey = True
 #baseest GaussianProcessRegressor(kernel=1**2 * Matern(length_scale=[1, 1, 1, 1], nu=2.5),
                         n_restarts_optimizer=2, noise='gaussian',
                         normalize_y=True, random_state=327741615)

 Closure test for true values {0: 0.335, 1: 0.98, 2: 1.32, 3: 0.855}
 2023-03-29 12:00:30.724108
 Params true {0: 0.335, 1: 0.98, 2: 1.32, 3: 0.855}
 chisquare of params [0, 1, 2, 3]	 in range {0: [0.01, 1.0], 1: [0.2, 2.0], 2: [0.01, 2.0], 3: [0.01, 2.0]}
 with observables ['/ALEPH_2004_S5765862/d54-x01-y01' '/ALEPH_1991_S2435284/d01-x01-y01'
 '/ALEPH_2001_S4656318/d01-x01-y02' '/ALEPH_1999_S4193598/d01-x01-y01']
 for number events = 1000000 with seed 7 and noise gaussian ,real: on ,normalizey = True
 #baseest GaussianProcessRegressor(kernel=1**2 * Matern(length_scale=[1, 1, 1, 1], nu=2.5),
                         n_restarts_optimizer=2, noise='gaussian',
                         normalize_y=True, random_state=327741615)

 Closure test for true values {0: 0.335, 1: 0.98, 2: 1.32, 3: 0.855}
 2023-03-29 12:27:38.612258
 Params true {0: 0.335, 1: 0.98, 2: 1.32, 3: 0.855}
 chisquare of params [0, 1, 2, 3]	 in range {0: [0.01, 1.0], 1: [0.2, 2.0], 2: [0.01, 2.0], 3: [0.01, 2.0]}
 with observables ['/ALEPH_2004_S5765862/d54-x01-y01' '/ALEPH_1991_S2435284/d01-x01-y01'
 '/ALEPH_2001_S4656318/d01-x01-y02' '/ALEPH_1999_S4193598/d01-x01-y01']
 for number events = 1000000 with seed 7 and noise gaussian ,real: on ,normalizey = True
 #baseest GaussianProcessRegressor(kernel=1**2 * Matern(length_scale=[1, 1, 1, 1], nu=2.5),
                         n_restarts_optimizer=2, noise='gaussian',
                         normalize_y=True, random_state=327741615)

 Closure test for true values {0: 0.335, 1: 0.98, 2: 1.32, 3: 0.855}