# BEGIN PLOT
Legend=1
LogY=1
Title=$\geq$6-jet fraction ($E_\mathrm{CMS}=91.2$ GeV)
XLabel=$\ln(y_\mathrm{cut})$
YLabel=$\sigma(\geq\mathrm{6~jet})/\sigma(\mathrm{inclusive})$
LegendXPos=0.05
LegendYPos=0.6
DrawOnly=/ALEPH_2004_S5765862/d227-x01-y01 //net/theorie/home/k.schmitt/gitrepos/BayesianOptimisation/Analyses/samp_envelop.yoda/ALEPH_2004_S5765862/d227-x01-y01
LegendOnly=/ALEPH_2004_S5765862/d227-x01-y01 //net/theorie/home/k.schmitt/gitrepos/BayesianOptimisation/Analyses/samp_envelop.yoda/ALEPH_2004_S5765862/d227-x01-y01
RatioPlot=1
RatioPlotReference=/ALEPH_2004_S5765862/d227-x01-y01
# END PLOT

# BEGIN HISTO1D /ALEPH_2004_S5765862/d227-x01-y01
ConnectBins=0
ErrorBars=1
IsRef=1
Path=/ALEPH_2004_S5765862/d227-x01-y01
PolyMarker=*
Title=Data
# xlow	 xhigh	 val	 errminus	 errplus
-1.000000e+01	-9.800000e+00	9.920500e-01	2.417292e-03	2.417292e-03
-9.800000e+00	-9.600000e+00	9.851700e-01	2.619332e-03	2.619332e-03
-9.600000e+00	-9.400000e+00	9.727200e-01	2.908161e-03	2.908161e-03
-9.400000e+00	-9.200000e+00	9.514000e-01	3.064213e-03	3.064213e-03
-9.200000e+00	-9.000000e+00	9.188700e-01	3.636729e-03	3.636729e-03
-9.000000e+00	-8.800000e+00	8.718600e-01	5.257395e-03	5.257395e-03
-8.800000e+00	-8.600000e+00	8.101500e-01	7.154558e-03	7.154558e-03
-8.600000e+00	-8.400000e+00	7.339200e-01	1.005340e-02	1.005340e-02
-8.400000e+00	-8.200000e+00	6.471600e-01	1.246697e-02	1.246697e-02
-8.200000e+00	-8.000000e+00	5.542200e-01	1.341656e-02	1.341656e-02
-8.000000e+00	-7.800000e+00	4.603800e-01	1.319365e-02	1.319365e-02
-7.800000e+00	-7.600000e+00	3.694200e-01	1.257113e-02	1.257113e-02
-7.600000e+00	-7.400000e+00	2.854000e-01	1.205913e-02	1.205913e-02
-7.400000e+00	-7.200000e+00	2.121300e-01	1.097067e-02	1.097067e-02
-7.200000e+00	-7.000000e+00	1.518000e-01	9.308689e-03	9.308689e-03
-7.000000e+00	-6.800000e+00	1.040800e-01	7.979261e-03	7.979261e-03
-6.800000e+00	-6.600000e+00	6.837000e-02	6.213091e-03	6.213091e-03
-6.600000e+00	-6.400000e+00	4.305000e-02	4.902907e-03	4.902907e-03
-6.400000e+00	-6.200000e+00	2.592000e-02	3.524613e-03	3.524613e-03
-6.200000e+00	-6.000000e+00	1.501000e-02	2.365840e-03	2.365840e-03
-6.000000e+00	-5.800000e+00	8.340000e-03	1.671466e-03	1.671466e-03
-5.800000e+00	-5.600000e+00	4.440000e-03	1.096084e-03	1.096084e-03
-5.600000e+00	-5.400000e+00	2.370000e-03	6.599242e-04	6.599242e-04
-5.400000e+00	-5.200000e+00	1.170000e-03	3.366007e-04	3.366007e-04
-5.200000e+00	-5.000000e+00	5.800000e-04	1.720465e-04	1.720465e-04
-5.000000e+00	-4.800000e+00	2.600000e-04	9.433981e-05	9.433981e-05
-4.800000e+00	-4.600000e+00	1.100000e-04	4.582576e-05	4.582576e-05
-4.600000e+00	-4.400000e+00	4.000000e-05	1.732051e-05	1.732051e-05
-4.400000e+00	-4.200000e+00	1.000000e-05	2.000000e-05	2.000000e-05
# END HISTO1D


# BEGIN HISTO1D //net/theorie/home/k.schmitt/gitrepos/BayesianOptimisation/Analyses/samp_envelop.yoda/ALEPH_2004_S5765862/d227-x01-y01
ErrorBandOpacity=0.6
ErrorBands=1
ErrorBreakdown={0: {"": {up: 0.03159143000000364, dn: 0.03159142999999998}}, 1: {"": {up: 0.03159143000000009, dn: 0.0315914300000053}}, 2: {"": {up: 0.03157562000000358, dn: 0.03157562000000003}}, 3: {"": {up: 0.03149643000000002, dn: 0.03149643000000535}}, 4: {"": {up: 0.03141704000000356, dn: 0.03141704000000001}}, 5: {"": {up: 0.03117629000000344, dn: 0.03117629}}, 6: {"": {up: 0.03086937999999995, dn: 0.03086938000000505}}, 7: {"": {up: 0.03054338000000323, dn: 0.03054338000000001}}, 8: {"": {up: 0.02994686999999996, dn: 0.02994687000000473}}, 9: {"": {up: 0.02909915000000296, dn: 0.02909914999999996}}, 10: {"": {up: 0.02813586999999995, dn: 0.02813587000000062}}, 11: {"": {up: 0.02665876, dn: 0.02665876000000056}}, 12: {"": {up: 0.02440757000000215, dn: 0.02440757000000005}}, 13: {"": {up: 0.02262348000000003, dn: 0.02262348000000047}}, 14: {"": {up: 0.02017043999999962, dn: 0.02017038999999998}}, 15: {"": {up: 0.01757247000000001, dn: 0.01757247000000023}}, 16: {"": {up: 0.01486000999999981, dn: 0.01485996000000001}}, 17: {"": {up: 0.0119097900000005, dn: 0.01190979}}, 18: {"": {up: 0.009322222000000005, dn: 0.009322222000000074}}, 19: {"": {up: 0.007276084000000002, dn: 0.007276084000000051}}, 20: {"": {up: 0.005193279000000002, dn: 0.005193279000000023}}, 21: {"": {up: 0.003997792999999989, dn: 0.003997788}}, 22: {"": {up: 0.002826863000000028, dn: 0.002826863000000001}}, 23: {"": {up: 0.001731093499999998, dn: 0.001731093}}, 24: {"": {up: 0.0009994470999999997, dn: 0.000999447100000001}}, 25: {"": {up: 0, dn: 0}}, 26: {"": {up: 0, dn: 0}}, 27: {"": {up: 0, dn: 0}}, 28: {"": {up: 0, dn: 0}}}
LineColor=red
LineStyle=solid
Path=//net/theorie/home/k.schmitt/gitrepos/BayesianOptimisation/Analyses/samp_envelop.yoda/ALEPH_2004_S5765862/d227-x01-y01
Title=samp_envelop
# xlow	 xhigh	 val	 errminus	 errplus
-1.000000e+01	-9.800000e+00	9.980010e-01	3.159143e-02	3.159143e-02
-9.800000e+00	-9.600000e+00	9.980010e-01	3.159143e-02	3.159143e-02
-9.600000e+00	-9.400000e+00	9.970015e-01	3.157562e-02	3.157562e-02
-9.400000e+00	-9.200000e+00	9.920045e-01	3.149643e-02	3.149643e-02
-9.200000e+00	-9.000000e+00	9.870070e-01	3.141704e-02	3.141704e-02
-9.000000e+00	-8.800000e+00	9.719730e-01	3.117629e-02	3.117629e-02
-8.800000e+00	-8.600000e+00	9.529525e-01	3.086938e-02	3.086938e-02
-8.600000e+00	-8.400000e+00	9.329425e-01	3.054338e-02	3.054338e-02
-8.400000e+00	-8.200000e+00	8.969020e-01	2.994687e-02	2.994687e-02
-8.200000e+00	-8.000000e+00	8.468755e-01	2.909915e-02	2.909915e-02
-8.000000e+00	-7.800000e+00	7.918100e-01	2.813587e-02	2.813587e-02
-7.800000e+00	-7.600000e+00	7.108410e-01	2.665876e-02	2.665876e-02
-7.600000e+00	-7.400000e+00	5.958620e-01	2.440757e-02	2.440757e-02
-7.400000e+00	-7.200000e+00	5.119085e-01	2.262348e-02	2.262348e-02
-7.200000e+00	-7.000000e+00	4.069203e-01	2.017039e-02	2.017044e-02
-7.000000e+00	-6.800000e+00	3.088950e-01	1.757247e-02	1.757247e-02
-6.800000e+00	-6.600000e+00	2.209086e-01	1.485996e-02	1.486001e-02
-6.600000e+00	-6.400000e+00	1.419215e-01	1.190979e-02	1.190979e-02
-6.400000e+00	-6.200000e+00	8.695190e-02	9.322222e-03	9.322222e-03
-6.200000e+00	-6.000000e+00	5.297070e-02	7.276084e-03	7.276084e-03
-6.000000e+00	-5.800000e+00	2.698507e-02	5.193279e-03	5.193279e-03
-5.800000e+00	-5.600000e+00	1.599115e-02	3.997788e-03	3.997793e-03
-5.600000e+00	-5.400000e+00	7.995575e-03	2.826863e-03	2.826863e-03
-5.400000e+00	-5.200000e+00	2.998341e-03	1.731093e-03	1.731093e-03
-5.200000e+00	-5.000000e+00	9.994470e-04	9.994471e-04	9.994471e-04
-5.000000e+00	-4.800000e+00	0.000000e+00	0.000000e+00	0.000000e+00
-4.800000e+00	-4.600000e+00	0.000000e+00	0.000000e+00	0.000000e+00
-4.600000e+00	-4.400000e+00	0.000000e+00	0.000000e+00	0.000000e+00
-4.400000e+00	-4.200000e+00	0.000000e+00	0.000000e+00	0.000000e+00
# END HISTO1D

