planetname,ra_str,ra,dec_str,dec,period,transitduration,transitdepthdb,transitdepthcalc,ttv,midpointcalendar,propmidpointunc,midpointairmass,targetobsstartcalendar,targetobsendcalendar,fractionobservable
Kepler-325 b,19h19m20.50s,"289,835434",49d49m32.25s,"49,825626","4,544431","2,0171","0,0894",0,0,07/04/2018 00:20,"0,00205","1,00326",07/03/2018 21:39,07/04/2018 01:09,"0,91"
Kepler-325 b,19h19m20.50s,"289,835434",49d49m32.25s,"49,825626","4,544438","1,7405",,"0,079023",0,07/04/2018 00:26,"0,004606","1,00474",07/03/2018 21:39,07/04/2018 01:09,"0,917"
Kepler-325 b,19h19m20.50s,"289,835434",49d49m32.25s,"49,825626","4,544439","1,7568",,"0,076858",0,07/04/2018 00:26,"0,006912","1,00478",07/03/2018 21:39,07/04/2018 01:09,"0,912"
Kepler-372 b,19h25m01.49s,"291,256195",49d15m32.23s,"49,258953","6,849762","4,5761",,"0,01317",0,07/03/2018 23:57,"0,03306","1,00054",07/03/2018 21:39,07/04/2018 01:09,"0,765"
Kepler-372 b,19h25m01.49s,"291,256195",49d15m32.23s,"49,258953","6,849692","4,1208",,"0,012809",0,07/03/2018 23:32,"0,077998","1,00299",07/03/2018 21:39,07/04/2018 01:09,"0,85"
Kepler-374 c,19h36m33.10s,"294,13793",42d22m13.81s,"42,370502","3,282803","3,2436",,"0,012936",0,07/04/2018 00:14,"0,016936","1,01292",07/03/2018 21:39,07/04/2018 01:09,"0,783"
Kepler-374 c,19h36m33.10s,"294,13793",42d22m13.81s,"42,370502","3,282807","3,3096",,"0,013186",0,07/04/2018 00:20,"0,02409","1,0134",07/03/2018 21:39,07/04/2018 01:09,"0,747"
Kepler-42 c,19h28m52.57s,"292,219033",44d37m08.98s,"44,61916","0,453287",,,"0,166215",0,07/04/2018 00:25,"0,000498","1,0097",07/03/2018 21:39,07/04/2018 01:09,
Kepler-42 c,19h28m52.57s,"292,219033",44d37m08.98s,"44,61916","0,453285",,"0,156","0,166215",0,07/04/2018 00:01,"0,00756","1,00714",07/03/2018 21:39,07/04/2018 01:09,
Kepler-42 d,19h28m52.57s,"292,219033",44d37m08.98s,"44,61916","1,865112",,,"0,141627",0,07/03/2018 23:29,"0,001742","1,01134",07/03/2018 21:39,07/04/2018 01:09,
Kepler-42 d,19h28m52.57s,"292,219033",44d37m08.98s,"44,61916","1,865115","0,3973",,"0,145987",0,07/03/2018 23:34,"0,002505","1,01019",07/03/2018 21:39,07/04/2018 01:09,1
Kepler-60 d,19h15m50.70s,"288,961242",42d15m54.04s,"42,265011","11,903",,,0,1,07/04/2018 00:44,"0,298","1,02754",07/03/2018 21:39,07/04/2018 01:09,
Kepler-611 b,19h04m01.19s,"286,004962",45d28m49.41s,"45,480392","2,437033","3,3918","0,0251",0,0,07/03/2018 23:29,"0,006808","1,00559",07/03/2018 21:39,07/04/2018 01:09,"0,99"
Kepler-611 b,19h04m01.19s,"286,004962",45d28m49.41s,"45,480392","2,437033","3,2009",,"0,024084",0,07/03/2018 23:31,"0,008501","1,0055",07/03/2018 21:39,07/04/2018 01:09,1
Kepler-727 b,19h39m23.26s,"294,846908",45d02m03.90s,"45,034416","5,154484","2,9653","0,0799",0,0,07/04/2018 00:11,"0,003363","1,00628",07/03/2018 21:39,07/04/2018 01:09,"0,829"
Kepler-727 b,19h39m23.26s,"294,846908",45d02m03.90s,"45,034416","5,154484","2,8866",,"0,078517",0,07/04/2018 00:13,"0,006821","1,00629",07/03/2018 21:39,07/04/2018 01:09,"0,825"
Kepler-770 c,19h05m57.70s,"286,490428",38d22m29.67s,"38,374907","1,475322","2,3261",,"0,015379",0,07/03/2018 23:42,"0,011952","1,02693",07/03/2018 21:39,07/04/2018 01:09,1
Kepler-781 b,19h10m36.87s,"287,653619",47d24m53.32s,"47,414811","13,214045","3,6215","0,1606",0,0,07/04/2018 00:39,"0,003877","1,01538",07/03/2018 21:39,07/04/2018 01:09,"0,639"
Kepler-781 b,19h10m36.87s,"287,653619",47d24m53.32s,"47,414811","13,214073","3,4241",,"0,124392",0,07/04/2018 00:48,"0,011304","1,0198",07/03/2018 21:39,07/04/2018 01:09,"0,604"
Kepler-788 b,19h20m00.10s,"290,000414",38d32m23.61s,"38,539892","8,398463","6,4879",,"0,038724",0,07/04/2018 00:01,"0,027834","1,02661",07/03/2018 21:39,07/04/2018 01:09,"0,54"
Kepler-80 b,19h44m27.02s,"296,112564",39d58m43.60s,"39,978779","7,053512","2,7763","0,1535",0,1,07/03/2018 23:10,"0,002572","1,04174",07/03/2018 21:39,07/04/2018 01:09,1
Kepler-80 b,19h44m27.02s,"296,112564",39d58m43.60s,"39,978779","7,053514","2,4271",,"0,130996",1,07/03/2018 23:11,"0,003544","1,04079",07/03/2018 21:39,07/04/2018 01:09,1
Kepler-80 f,19h44m27.02s,"296,112564",39d58m43.60s,"39,978779","0,986787","1,4007",,"0,02729",0,07/03/2018 23:37,"0,006614","1,02808",07/03/2018 21:39,07/04/2018 01:09,1
Kepler-808 b,19h26m22.58s,"291,59409",48d26m44.21s,"48,445614","0,631332","1,547","0,0491",0,0,07/04/2018 00:48,"0,003272","1,01091",07/03/2018 21:39,07/04/2018 01:09,"0,733"
Kepler-808 b,19h26m22.58s,"291,59409",48d26m44.21s,"48,445614","0,631332","1,1076",,"0,038116",0,07/04/2018 00:51,"0,002292","1,01207",07/03/2018 21:39,07/04/2018 01:09,"0,783"
Kepler-831 b,19h39m56.52s,"294,985491",42d43m39.61s,"42,727669","5,621545","2,5291","0,0175",0,0,07/03/2018 23:12,"0,004934","1,02781",07/03/2018 21:39,07/04/2018 01:09,1
Kepler-831 b,19h39m56.52s,"294,985491",42d43m39.61s,"42,727669","5,621539","2,3638",,"0,01543",0,07/03/2018 23:07,"0,009343","1,03086",07/03/2018 21:39,07/04/2018 01:09,1
Kepler-845 b,19h23m49.82s,"290,957565",49d12m13.72s,"49,203812","0,927859","1,6474","0,0536",0,0,07/03/2018 23:43,"0,002797","1,00122",07/03/2018 21:39,07/04/2018 01:09,1
Kepler-845 b,19h23m49.82s,"290,957565",49d12m13.72s,"49,203812","0,92786","1,4398",,"0,066952",0,07/03/2018 23:45,"0,002498","1,00102",07/03/2018 21:39,07/04/2018 01:09,1
EPIC 220674823 b,00h52m19.15s,"13,07978",10d47m40.92s,"10,794699","0,571299",,,"0,030481",0,07/04/2018 00:26,"0,025081","3,19051",07/03/2018 22:49,07/04/2018 01:09,
EPIC 220674823 b,00h52m19.15s,"13,07978",10d47m40.92s,"10,794699","0,571308",,,"0,027891",0,07/04/2018 00:46,"0,046335","2,75427",07/03/2018 22:49,07/04/2018 01:09,
HAT-P-28 b,00h52m00.18s,"13,000766",34d43m42.29s,"34,728413","3,257215","3,2184","1,4719","1,380261",0,07/03/2018 23:46,"0,006732","2,00976",07/03/2018 21:39,07/04/2018 01:09,"0,929"
HAT-P-36 b,12h33m03.90s,"188,266255",44d54m55.27s,"44,915352","1,327347",,,"1,787433",0,07/03/2018 23:57,"0,00135","2,19267",07/03/2018 21:39,07/04/2018 01:09,
HAT-P-36 b,12h33m03.90s,"188,266255",44d54m55.27s,"44,915352","1,327347","2,2152",,"1,501239",0,07/03/2018 23:57,"0,006389","2,19333",07/03/2018 21:39,07/04/2018 01:09,1
HAT-P-44 b,14h12m34.58s,"213,144074",47d00m52.87s,"47,014687","4,301219","3,1248",,"1,943288",0,07/03/2018 23:25,"0,011754","1,39092",07/03/2018 21:39,07/04/2018 01:09,1
HAT-P-65 b,21h03m37.32s,"315,905487",11d59m21.85s,"11,989404","2,605455","4,3656",,"1,173921",0,07/03/2018 23:57,"0,002714","1,39595",07/03/2018 21:39,07/04/2018 01:09,"0,774"
K2-201 b,19h34m14.58s,"293,56073",-23d07m51.73s,"-23,131035","1,05979",,,"0,02294",0,07/03/2018 23:39,"0,042543","3,80613",07/03/2018 21:39,07/04/2018 01:09,
K2-62 c,22h17m27.40s,"334,364166",-12d11m14.99s,"-12,187498","16,197201",,,"0,076858",0,07/04/2018 00:26,"0,06886","3,04157",07/03/2018 22:14,07/04/2018 01:09,
K2-62 c,22h17m27.40s,"334,364166",-12d11m14.99s,"-12,187498","16,1966","1,29",,"0,077833",0,07/03/2018 23:15,"0,0996","5,03479",07/03/2018 22:14,07/04/2018 01:09,1
KELT-18 b,14h26m05.76s,"216,524017",59d26m39.39s,"59,444275","2,871752","4,644","0,716","0,768199",0,07/04/2018 00:56,"0,001132","1,47438",07/03/2018 21:39,07/04/2018 01:09,"0,548"
KOI-94 b,19h49m19.93s,"297,333057",41d53m28.02s,"41,891117","3,743168","4,1413","0,0135",0,0,07/04/2018 00:36,"0,008547","1,01521",07/03/2018 21:39,07/04/2018 01:09,"0,633"
KOI-94 b,19h49m19.93s,"297,333057",41d53m28.02s,"41,891117","3,743176","3,7301",,"0,012973",0,07/04/2018 00:45,"0,010107","1,01683",07/03/2018 21:39,07/04/2018 01:09,"0,608"
KPS-1 b,11h00m40.18s,"165,167404",64d57m50.47s,"64,96402","1,706291","1,68",,"1,456575",0,07/04/2018 00:02,"0,028279","1,8127",07/03/2018 21:39,07/04/2018 01:09,1
Kepler-1012 b,19h17m11.10s,"289,29627",46d27m28.63s,"46,457954","5,50861","3,1185","0,0207",0,0,07/04/2018 00:22,"0,004419","1,00826",07/03/2018 21:39,07/04/2018 01:09,"0,751"
Kepler-1012 b,19h17m11.10s,"289,29627",46d27m28.63s,"46,457954","5,508604","2,9468",,"0,018157",0,07/04/2018 00:18,"0,008635","1,00714",07/03/2018 21:39,07/04/2018 01:09,"0,791"
Kepler-1067 b,19h01m32.98s,"285,387409",45d02m56.59s,"45,049053","0,762129","1,0759",,"0,006627",0,07/04/2018 00:11,"0,01449","1,01238",07/03/2018 21:39,07/04/2018 01:09,1
Kepler-1096 b,19h38m50.25s,"294,70938",45d58m10.20s,"45,969501","2,892218","1,3657",,"0,035294",0,07/03/2018 23:54,"0,008534","1,0057",07/03/2018 21:39,07/04/2018 01:09,1
Kepler-1105 b,18h44m26.83s,"281,111771",42d27m17.75s,"42,454931","4,421571","2,202","0,071",0,0,07/03/2018 23:17,"0,005442","1,01253",07/03/2018 21:39,07/04/2018 01:09,1
Kepler-1105 b,18h44m26.83s,"281,111771",42d27m17.75s,"42,454931","4,421572","2,0749",,"0,078782",0,07/03/2018 23:17,"0,009236","1,01253",07/03/2018 21:39,07/04/2018 01:09,1
Kepler-1106 b,19h24m34.85s,"291,145201",44d03m45.17s,"44,062546","1,252752","2,0755",,"0,017948",0,07/04/2018 00:03,"0,007098","1,00855",07/03/2018 21:39,07/04/2018 01:09,1
Kepler-1107 b,19h24m11.98s,"291,049927",39d08m30.03s,"39,141674","0,571039","1,0421",,"0,024349",0,07/04/2018 00:22,"0,003045","1,02702",07/03/2018 21:39,07/04/2018 01:09,1
Kepler-1339 b,18h54m58.99s,"283,745794",48d22m24.22s,"48,373394","1,341555","1,7009",,"0,005217",0,07/04/2018 00:40,"0,011566","1,02249",07/03/2018 21:39,07/04/2018 01:09,"0,79"
Kepler-1350 c,19h13m00.14s,"288,250582",46d40m46.57s,"46,679602","1,766789","1,3395",,"0,095991",0,07/04/2018 01:08,"0,0182","1,03233",07/03/2018 21:39,07/04/2018 01:09,"0,515"
Kepler-1367 b,19h13m39.97s,"288,416528",47d52m43.43s,"47,878731","1,57409","1,5994",,"0,021236",0,07/04/2018 00:11,"0,014224","1,00429",07/03/2018 21:39,07/04/2018 01:09,1
Kepler-1377 b,19h16m46.91s,"289,195458",46d39m06.13s,"46,651703","0,740928","1,1202",,"0,02121",0,07/04/2018 00:47,"0,010446","1,01733",07/03/2018 21:39,07/04/2018 01:09,"0,838"
Kepler-1388 e,18h53m20.65s,"283,33604",47d10m28.33s,"47,174535","37,632708","4,547",,"0,146545",0,07/04/2018 00:15,"0,086467","1,01261",07/03/2018 21:39,07/04/2018 01:09,"0,7"
Kepler-1394 b,18h53m48.77s,"283,4532",45d05m02.91s,"45,084141","3,937664","4,9159",,"0,002688",0,07/03/2018 23:30,"0,039085","1,00626",07/03/2018 21:39,07/04/2018 01:09,"0,712"
Kepler-1420 b,19h44m48.91s,"296,20381",42d46m40.20s,"42,777832","6,6996","2,7041",,"0,023675",0,07/04/2018 01:09,"0,02769","1,02378",07/03/2018 21:39,07/04/2018 01:09,"0,505"
Kepler-1421 b,19h06m19.34s,"286,580592",48d32m39.11s,"48,544197","6,913111","4,7681",,"0,003884",0,07/04/2018 01:02,"0,08198","1,02937",07/03/2018 21:39,07/04/2018 01:09,"0,525"
Kepler-1427 b,19h41m23.92s,"295,349667",45d06m52.37s,"45,114548","0,968972","1,6219",,"0,010704",0,07/04/2018 00:56,"0,029623","1,01396",07/03/2018 21:39,07/04/2018 01:09,"0,636"
Kepler-1542 c,19h02m54.84s,"285,728495",42d39m16.31s,"42,65453","2,89223","2,6071",,"0,003902",0,07/03/2018 23:57,"0,020847","1,01416",07/03/2018 21:39,07/04/2018 01:09,"0,961"
Kepler-1585 b,19h44m38.16s,"296,159005",44d33m47.21s,"44,563114","3,582746","1,541",,"0,035148",0,07/03/2018 23:39,"0,0206","1,01323",07/03/2018 21:39,07/04/2018 01:09,1
Kepler-1589 b,19h37m46.03s,"294,441792",40d34m18.07s,"40,571686","0,991665","2,3779",,"0,006846",0,07/03/2018 23:19,"0,031617","1,03045",07/03/2018 21:39,07/04/2018 01:09,1
Kepler-166 d,19h32m38.44s,"293,160171",48d52m52.29s,"48,881191","1,554002","2,0802","0,0419",0,0,07/04/2018 00:44,"0,004138","1,00694",07/03/2018 21:39,07/04/2018 01:09,"0,703"
Kepler-166 d,19h32m38.44s,"293,160171",48d52m52.29s,"48,881191","1,554004","1,7696",,"0,039141",0,07/04/2018 00:50,"0,003763","1,00883",07/03/2018 21:39,07/04/2018 01:09,"0,685"
Kepler-210 b,19h30m00.81s,"292,503389",43d04m59.34s,"43,083149","2,453235","2,0069","0,1765",0,0,07/03/2018 23:50,"0,000474","1,01144",07/03/2018 21:39,07/04/2018 01:09,1
Kepler-210 b,19h30m00.81s,"292,503389",43d04m59.34s,"43,083149","2,453236","1,6483",,"0,156853",0,07/03/2018 23:51,"0,000799","1,01131",07/03/2018 21:39,07/04/2018 01:09,1
Kepler-210 b,19h30m00.81s,"292,503389",43d04m59.34s,"43,083149","2,453234","1,7472",,"0,184721",0,07/03/2018 23:47,"0,001525","1,0118",07/03/2018 21:39,07/04/2018 01:09,1
Kepler-255 d,19h44m15.42s,"296,064233",45d58m36.63s,"45,976841","1,045623","1,8269",,"0,021405",0,07/04/2018 00:00,"0,01068","1,00564",07/03/2018 21:39,07/04/2018 01:09,1
Kepler-256 c,19h30m19.31s,"292,580445",46d05m50.60s,"46,097389","3,38802","2,628",,"0,0248",0,07/03/2018 23:07,"0,018104","1,01694",07/03/2018 21:39,07/04/2018 01:09,1
Kepler-314 b,19h38m41.79s,"294,674114",42d04m32.12s,"42,075588","2,461067","2,1814",,"0,006946",0,07/04/2018 00:39,"0,018867","1,01727",07/03/2018 21:39,07/04/2018 01:09,"0,733"
Kepler-314 b,19h38m41.79s,"294,674114",42d04m32.12s,"42,075588","2,461069","2,292",,"0,006899",0,07/04/2018 00:34,"0,021038","1,01612",07/03/2018 21:39,07/04/2018 01:09,"0,757"
WASP-48 b,19h24m38.96s,"291,16233",55d28m23.38s,"55,47316","2,143634","3,1848","0,96","1,035376",0,07/03/2018 23:20,"0,004533","1,00647",07/03/2018 21:39,07/04/2018 01:09,1
Kepler-972 b,19h43m18.89s,"295,828703",43d25m31.78s,"43,425495","7,039371","3,0019","0,0966",0,0,07/04/2018 00:16,"0,003898","1,00993",07/03/2018 21:39,07/04/2018 01:09,"0,794"
Kepler-972 b,19h43m18.89s,"295,828703",43d25m31.78s,"43,425495","7,039326","3,4481",,"0,131558",0,07/03/2018 23:51,"0,009522","1,01246",07/03/2018 21:39,07/04/2018 01:09,"0,877"
Kepler-990 c,19h51m45.17s,"297,938209",46d52m53.01s,"46,881393","0,538354","1,4801",,"0,018029",0,07/04/2018 00:32,"0,005155","1,00339",07/03/2018 21:39,07/04/2018 01:09,"0,917"
Kepler-994 b,19h16m17.33s,"289,072225",47d24m25.45s,"47,40707","1,151166","1,4084","0,0616",0,0,07/03/2018 23:06,"0,002127","1,00964",07/03/2018 21:39,07/04/2018 01:09,1
Kepler-994 b,19h16m17.33s,"289,072225",47d24m25.45s,"47,40707","1,151167","1,1881",,"0,079731",0,07/03/2018 23:07,"0,002058","1,0092",07/03/2018 21:39,07/04/2018 01:09,1
Kepler-997 b,19h16m56.01s,"289,233369",49d56m20.16s,"49,938934","2,707294","3,6084","0,0075",0,0,07/04/2018 00:34,"0,006587","1,00796",07/03/2018 21:39,07/04/2018 01:09,"0,663"
Kepler-997 b,19h16m56.01s,"289,233369",49d56m20.16s,"49,938934","2,707307","3,4623",,"0,00684",0,07/04/2018 00:57,"0,008436","1,01824",07/03/2018 21:39,07/04/2018 01:09,"0,558"
TrES-2 b,19h07m14.03s,"286,808473",49d18m59.05s,"49,316402","2,47063",,,"1,748174",0,07/03/2018 23:22,"0,01859","1,00163",07/03/2018 21:39,07/04/2018 01:09,
WASP-11 b,03h09m28.55s,"47,368964",30d40m24.94s,"30,673594","3,72248",,,"1,879447",0,07/03/2018 23:42,"0,000632","7,12404",07/03/2018 22:59,07/04/2018 01:09,
WASP-11 b,03h09m28.55s,"47,368964",30d40m24.94s,"30,673594","3,722465","2,556","1,62","1,719335",0,07/03/2018 23:20,"0,006374","10,02655",07/03/2018 22:59,07/04/2018 01:09,"0,634"
WASP-11 b,03h09m28.55s,"47,368964",30d40m24.94s,"30,673594","3,722475","2,616","1,729","1,840006",0,07/03/2018 23:35,"0,006348","7,88959",07/03/2018 22:59,07/04/2018 01:09,"0,725"
WASP-33 b,02h26m51.06s,"36,712746",37d33m01.74s,"37,550484","1,21987",,,"3,205107",0,07/03/2018 23:07,"0,6107","3,99634",07/03/2018 21:39,07/04/2018 01:09,
WASP-33 b,02h26m51.06s,"36,712746",37d33m01.74s,"37,550484","1,219868",,,0,0,07/03/2018 23:00,"0,002821","4,22071",07/03/2018 21:39,07/04/2018 01:09,
WASP-48 b,19h24m38.96s,"291,16233",55d28m23.38s,"55,47316","2,143636",,,"3,170839",0,07/03/2018 23:26,"0,006507","1,00503",07/03/2018 21:39,07/04/2018 01:09,
WASP-48 b,19h24m38.96s,"291,16233",55d28m23.38s,"55,47316","2,143635",,,"0,959014",0,07/03/2018 23:26,"0,001035","1,00517",07/03/2018 21:39,07/04/2018 01:09,
