<?xml version="1.0" encoding="UTF-8" standalone="no"?>
<!-- Created with Inkscape (http://www.inkscape.org/) -->

<svg
   xmlns:dc="http://purl.org/dc/elements/1.1/"
   xmlns:cc="http://creativecommons.org/ns#"
   xmlns:rdf="http://www.w3.org/1999/02/22-rdf-syntax-ns#"
   xmlns:svg="http://www.w3.org/2000/svg"
   xmlns="http://www.w3.org/2000/svg"
   xmlns:sodipodi="http://sodipodi.sourceforge.net/DTD/sodipodi-0.dtd"
   xmlns:inkscape="http://www.inkscape.org/namespaces/inkscape"
   inkscape:version="0.48.5 r10040"
   version="1.1"
   id="svg5839"
   height="297mm"
   width="210mm"
   sodipodi:docname="diffraction_parabola.svg"
   inkscape:export-filename="/home/upgp/kevin/Documents/10.Semester/fprakt/AG_GPR/proc/diffraction_parabola.png"
   inkscape:export-xdpi="300"
   inkscape:export-ydpi="300">
  <sodipodi:namedview
     id="base"
     pagecolor="#ffffff"
     bordercolor="#666666"
     borderopacity="1.0"
     inkscape:pageopacity="0.0"
     inkscape:pageshadow="2"
     inkscape:zoom="0.98994949"
     inkscape:cx="346.92377"
     inkscape:cy="611.47148"
     inkscape:document-units="px"
     inkscape:current-layer="layer1"
     showgrid="false"
     inkscape:window-width="1920"
     inkscape:window-height="1154"
     inkscape:window-x="0"
     inkscape:window-y="22"
     inkscape:window-maximized="0" />
  <defs
     id="defs5841">
    <marker
       inkscape:stockid="Arrow1Lend"
       orient="auto"
       refY="0.0"
       refX="0.0"
       id="Arrow1Lend"
       style="overflow:visible;">
      <path
         id="path3780"
         d="M 0.0,0.0 L 5.0,-5.0 L -12.5,0.0 L 5.0,5.0 L 0.0,0.0 z "
         style="fill-rule:evenodd;stroke:#000000;stroke-width:1.0pt;"
         transform="scale(0.8) rotate(180) translate(12.5,0)" />
    </marker>
  </defs>
  <metadata
     id="metadata5844">
    <rdf:RDF>
      <cc:Work
         rdf:about="">
        <dc:format>image/svg+xml</dc:format>
        <dc:type
           rdf:resource="http://purl.org/dc/dcmitype/StillImage" />
        <dc:title></dc:title>
      </cc:Work>
    </rdf:RDF>
  </metadata>
  <g
     inkscape:label="Ebene 1"
     inkscape:groupmode="layer"
     id="layer1">
    <path
       style="fill:none;stroke:#000000;stroke-width:1px;stroke-linecap:butt;stroke-linejoin:miter;stroke-opacity:1;marker-end:url(#Arrow1Lend)"
       d="m 137.5,213.79075 c 412.5,0 412.5,0 412.5,0"
       id="path5847"
       inkscape:connector-curvature="0" />
    <path
       style="fill:none;stroke:#000000;stroke-width:1px;stroke-linecap:butt;stroke-linejoin:miter;stroke-opacity:1;marker-end:url(#Arrow1Lend)"
       d="m 137.99277,213.28839 c 0,412.5 0,412.5 0,412.5"
       id="path5847-0"
       inkscape:connector-curvature="0" />
    <path
       id="path6972"
       title="x*x"
       d="m 485.75461,500.23424 c -73.22748,-168.57143 -146.45496,-168.57143 -219.68244,0"
       style="fill:none;stroke:#ff0101;stroke-width:2.54652572;stroke-linecap:square;stroke-linejoin:miter;stroke-miterlimit:4;stroke-opacity:1;stroke-dasharray:none;stroke-dashoffset:0"
       inkscape:connector-curvature="0" />
    <text
       xml:space="preserve"
       style="font-size:24px;font-style:normal;font-weight:normal;line-height:125%;letter-spacing:0px;word-spacing:0px;fill:#000000;fill-opacity:1;stroke:none;font-family:Sans"
       x="447.85715"
       y="186.6479"
       id="text6983"
       sodipodi:linespacing="125%"><tspan
         sodipodi:role="line"
         id="tspan6985"
         x="447.85715"
         y="186.6479">distance x</tspan></text>
    <text
       xml:space="preserve"
       style="font-size:24px;font-style:normal;font-weight:normal;line-height:125%;letter-spacing:0px;word-spacing:0px;fill:#000000;fill-opacity:1;stroke:none;font-family:Sans"
       x="77.85714"
       y="570.93359"
       id="text6987"
       sodipodi:linespacing="125%"><tspan
         sodipodi:role="line"
         id="tspan6989"
         x="77.85714"
         y="570.93359">time</tspan><tspan
         sodipodi:role="line"
         x="77.85714"
         y="600.93359"
         id="tspan6991">t</tspan></text>
    <text
       xml:space="preserve"
       style="font-size:24px;font-style:normal;font-weight:normal;line-height:125%;letter-spacing:0px;word-spacing:0px;fill:#000000;fill-opacity:1;stroke:none;font-family:Sans"
       x="363.57141"
       y="205.93359"
       id="text6993"
       sodipodi:linespacing="125%"><tspan
         sodipodi:role="line"
         id="tspan6995"
         x="363.57141"
         y="205.93359">x<tspan
   style="font-size:65.00091553%;baseline-shift:sub"
   id="tspan7001">0</tspan></tspan></text>
    <text
       xml:space="preserve"
       x="132.14285"
       y="182.36218"
       id="text6997"><tspan
         sodipodi:role="line"
         id="tspan6999"
         x="132.14285"
         y="182.36218" /></text>
    <text
       xml:space="preserve"
       style="font-size:24px;font-style:normal;font-weight:normal;line-height:125%;letter-spacing:0px;word-spacing:0px;fill:#000000;fill-opacity:1;stroke:none;font-family:Sans"
       x="234.28571"
       y="207.3622"
       id="text7005"
       sodipodi:linespacing="125%"><tspan
         sodipodi:role="line"
         id="tspan7009"
         x="234.28571"
         y="207.3622">x<tspan
   style="font-size:65.00091553%;baseline-shift:sub"
   id="tspan7011">0</tspan>+Δx</tspan></text>
    <path
       style="fill:none;stroke:#000000;stroke-width:0.99705964;stroke-linecap:butt;stroke-linejoin:miter;stroke-miterlimit:4;stroke-opacity:1;stroke-dasharray:1.99411926, 0.99705962;stroke-dashoffset:0"
       d="m 375,372.54081 0,-159.06046"
       id="path7013"
       inkscape:connector-curvature="0" />
    <path
       style="fill:none;stroke:#000000;stroke-width:1.31317377;stroke-linecap:butt;stroke-linejoin:miter;stroke-miterlimit:4;stroke-opacity:1;stroke-dasharray:2.62634736, 1.31317368;stroke-dashoffset:0"
       d="m 268.70058,489.81603 0,-275.90802"
       id="path7013-3"
       inkscape:connector-curvature="0" />
    <path
       style="fill:none;stroke:#000000;stroke-width:1.21668899;stroke-linecap:butt;stroke-linejoin:miter;stroke-miterlimit:4;stroke-opacity:1;stroke-dasharray:2.43337792, 1.21668895;stroke-dashoffset:0"
       d="m 137.8071,372.33062 236.85312,0"
       id="path7013-6"
       inkscape:connector-curvature="0" />
    <path
       style="fill:none;stroke:#000000;stroke-width:0.90661544;stroke-linecap:butt;stroke-linejoin:miter;stroke-miterlimit:4;stroke-opacity:1;stroke-dasharray:1.81323075, 0.90661537;stroke-dashoffset:0"
       d="m 137.91327,489.50504 131.51223,0"
       id="path7013-6-0"
       inkscape:connector-curvature="0" />
    <text
       xml:space="preserve"
       style="font-size:24px;font-style:normal;font-weight:normal;line-height:125%;letter-spacing:0px;word-spacing:0px;fill:#000000;fill-opacity:1;stroke:none;font-family:Sans"
       x="115"
       y="377.36218"
       id="text7069"
       sodipodi:linespacing="125%"><tspan
         sodipodi:role="line"
         id="tspan7071"
         x="115"
         y="377.36218">t<tspan
   style="font-size:65.00091553%;baseline-shift:sub"
   id="tspan7081">0</tspan></tspan></text>
    <text
       xml:space="preserve"
       style="font-size:24px;font-style:normal;font-weight:normal;line-height:125%;letter-spacing:0px;word-spacing:0px;fill:#000000;fill-opacity:1;stroke:none;font-family:Sans"
       x="69.285713"
       y="494.50504"
       id="text7073"
       sodipodi:linespacing="125%"><tspan
         sodipodi:role="line"
         id="tspan7075"
         x="69.285713"
         y="494.50504">t<tspan
   style="font-size:65.00091553%;baseline-shift:sub"
   id="tspan7083">0</tspan>+Δt</tspan></text>
    <text
       xml:space="preserve"
       style="font-size:24px;font-style:normal;font-weight:normal;line-height:125%;letter-spacing:0px;word-spacing:0px;fill:#000000;fill-opacity:1;stroke:none;font-family:Sans"
       x="291.93408"
       y="530.11328"
       id="text7085"
       sodipodi:linespacing="125%"><tspan
         sodipodi:role="line"
         id="tspan7087"
         x="291.93408"
         y="530.11328">diffraction parabola</tspan></text>
  </g>
</svg>
