%!PS-Adobe-2.0 EPSF-2.0
%%Title: minimum_w.tex
%%Creator: gnuplot 4.6 patchlevel 3
%%CreationDate: Fri Aug  5 08:55:16 2016
%%DocumentFonts: 
%%BoundingBox: 50 50 410 302
%%EndComments
%%BeginProlog
/gnudict 256 dict def
gnudict begin
%
% The following true/false flags may be edited by hand if desired.
% The unit line width and grayscale image gamma correction may also be changed.
%
/Color true def
/Blacktext true def
/Solid false def
/Dashlength 1 def
/Landscape false def
/Level1 false def
/Rounded false def
/ClipToBoundingBox false def
/SuppressPDFMark false def
/TransparentPatterns false def
/gnulinewidth 5.000 def
/userlinewidth gnulinewidth def
/Gamma 1.0 def
/BackgroundColor {-1.000 -1.000 -1.000} def
%
/vshift -73 def
/dl1 {
  10.0 Dashlength mul mul
  Rounded { currentlinewidth 0.75 mul sub dup 0 le { pop 0.01 } if } if
} def
/dl2 {
  10.0 Dashlength mul mul
  Rounded { currentlinewidth 0.75 mul add } if
} def
/hpt_ 31.5 def
/vpt_ 31.5 def
/hpt hpt_ def
/vpt vpt_ def
/doclip {
  ClipToBoundingBox {
    newpath 50 50 moveto 410 50 lineto 410 302 lineto 50 302 lineto closepath
    clip
  } if
} def
%
% Gnuplot Prolog Version 4.6 (September 2012)
%
%/SuppressPDFMark true def
%
/M {moveto} bind def
/L {lineto} bind def
/R {rmoveto} bind def
/V {rlineto} bind def
/N {newpath moveto} bind def
/Z {closepath} bind def
/C {setrgbcolor} bind def
/f {rlineto fill} bind def
/g {setgray} bind def
/Gshow {show} def   % May be redefined later in the file to support UTF-8
/vpt2 vpt 2 mul def
/hpt2 hpt 2 mul def
/Lshow {currentpoint stroke M 0 vshift R 
	Blacktext {gsave 0 setgray show grestore} {show} ifelse} def
/Rshow {currentpoint stroke M dup stringwidth pop neg vshift R
	Blacktext {gsave 0 setgray show grestore} {show} ifelse} def
/Cshow {currentpoint stroke M dup stringwidth pop -2 div vshift R 
	Blacktext {gsave 0 setgray show grestore} {show} ifelse} def
/UP {dup vpt_ mul /vpt exch def hpt_ mul /hpt exch def
  /hpt2 hpt 2 mul def /vpt2 vpt 2 mul def} def
/DL {Color {setrgbcolor Solid {pop []} if 0 setdash}
 {pop pop pop 0 setgray Solid {pop []} if 0 setdash} ifelse} def
/BL {stroke userlinewidth 2 mul setlinewidth
	Rounded {1 setlinejoin 1 setlinecap} if} def
/AL {stroke userlinewidth 2 div setlinewidth
	Rounded {1 setlinejoin 1 setlinecap} if} def
/UL {dup gnulinewidth mul /userlinewidth exch def
	dup 1 lt {pop 1} if 10 mul /udl exch def} def
/PL {stroke userlinewidth setlinewidth
	Rounded {1 setlinejoin 1 setlinecap} if} def
3.8 setmiterlimit
% Default Line colors
/LCw {1 1 1} def
/LCb {0 0 0} def
/LCa {0 0 0} def
/LC0 {1 0 0} def
/LC1 {0 1 0} def
/LC2 {0 0 1} def
/LC3 {1 0 1} def
/LC4 {0 1 1} def
/LC5 {1 1 0} def
/LC6 {0 0 0} def
/LC7 {1 0.3 0} def
/LC8 {0.5 0.5 0.5} def
% Default Line Types
/LTw {PL [] 1 setgray} def
/LTb {BL [] LCb DL} def
/LTa {AL [1 udl mul 2 udl mul] 0 setdash LCa setrgbcolor} def
/LT0 {PL [] LC0 DL} def
/LT1 {PL [4 dl1 2 dl2] LC1 DL} def
/LT2 {PL [2 dl1 3 dl2] LC2 DL} def
/LT3 {PL [1 dl1 1.5 dl2] LC3 DL} def
/LT4 {PL [6 dl1 2 dl2 1 dl1 2 dl2] LC4 DL} def
/LT5 {PL [3 dl1 3 dl2 1 dl1 3 dl2] LC5 DL} def
/LT6 {PL [2 dl1 2 dl2 2 dl1 6 dl2] LC6 DL} def
/LT7 {PL [1 dl1 2 dl2 6 dl1 2 dl2 1 dl1 2 dl2] LC7 DL} def
/LT8 {PL [2 dl1 2 dl2 2 dl1 2 dl2 2 dl1 2 dl2 2 dl1 4 dl2] LC8 DL} def
/Pnt {stroke [] 0 setdash gsave 1 setlinecap M 0 0 V stroke grestore} def
/Dia {stroke [] 0 setdash 2 copy vpt add M
  hpt neg vpt neg V hpt vpt neg V
  hpt vpt V hpt neg vpt V closepath stroke
  Pnt} def
/Pls {stroke [] 0 setdash vpt sub M 0 vpt2 V
  currentpoint stroke M
  hpt neg vpt neg R hpt2 0 V stroke
 } def
/Box {stroke [] 0 setdash 2 copy exch hpt sub exch vpt add M
  0 vpt2 neg V hpt2 0 V 0 vpt2 V
  hpt2 neg 0 V closepath stroke
  Pnt} def
/Crs {stroke [] 0 setdash exch hpt sub exch vpt add M
  hpt2 vpt2 neg V currentpoint stroke M
  hpt2 neg 0 R hpt2 vpt2 V stroke} def
/TriU {stroke [] 0 setdash 2 copy vpt 1.12 mul add M
  hpt neg vpt -1.62 mul V
  hpt 2 mul 0 V
  hpt neg vpt 1.62 mul V closepath stroke
  Pnt} def
/Star {2 copy Pls Crs} def
/BoxF {stroke [] 0 setdash exch hpt sub exch vpt add M
  0 vpt2 neg V hpt2 0 V 0 vpt2 V
  hpt2 neg 0 V closepath fill} def
/TriUF {stroke [] 0 setdash vpt 1.12 mul add M
  hpt neg vpt -1.62 mul V
  hpt 2 mul 0 V
  hpt neg vpt 1.62 mul V closepath fill} def
/TriD {stroke [] 0 setdash 2 copy vpt 1.12 mul sub M
  hpt neg vpt 1.62 mul V
  hpt 2 mul 0 V
  hpt neg vpt -1.62 mul V closepath stroke
  Pnt} def
/TriDF {stroke [] 0 setdash vpt 1.12 mul sub M
  hpt neg vpt 1.62 mul V
  hpt 2 mul 0 V
  hpt neg vpt -1.62 mul V closepath fill} def
/DiaF {stroke [] 0 setdash vpt add M
  hpt neg vpt neg V hpt vpt neg V
  hpt vpt V hpt neg vpt V closepath fill} def
/Pent {stroke [] 0 setdash 2 copy gsave
  translate 0 hpt M 4 {72 rotate 0 hpt L} repeat
  closepath stroke grestore Pnt} def
/PentF {stroke [] 0 setdash gsave
  translate 0 hpt M 4 {72 rotate 0 hpt L} repeat
  closepath fill grestore} def
/Circle {stroke [] 0 setdash 2 copy
  hpt 0 360 arc stroke Pnt} def
/CircleF {stroke [] 0 setdash hpt 0 360 arc fill} def
/C0 {BL [] 0 setdash 2 copy moveto vpt 90 450 arc} bind def
/C1 {BL [] 0 setdash 2 copy moveto
	2 copy vpt 0 90 arc closepath fill
	vpt 0 360 arc closepath} bind def
/C2 {BL [] 0 setdash 2 copy moveto
	2 copy vpt 90 180 arc closepath fill
	vpt 0 360 arc closepath} bind def
/C3 {BL [] 0 setdash 2 copy moveto
	2 copy vpt 0 180 arc closepath fill
	vpt 0 360 arc closepath} bind def
/C4 {BL [] 0 setdash 2 copy moveto
	2 copy vpt 180 270 arc closepath fill
	vpt 0 360 arc closepath} bind def
/C5 {BL [] 0 setdash 2 copy moveto
	2 copy vpt 0 90 arc
	2 copy moveto
	2 copy vpt 180 270 arc closepath fill
	vpt 0 360 arc} bind def
/C6 {BL [] 0 setdash 2 copy moveto
	2 copy vpt 90 270 arc closepath fill
	vpt 0 360 arc closepath} bind def
/C7 {BL [] 0 setdash 2 copy moveto
	2 copy vpt 0 270 arc closepath fill
	vpt 0 360 arc closepath} bind def
/C8 {BL [] 0 setdash 2 copy moveto
	2 copy vpt 270 360 arc closepath fill
	vpt 0 360 arc closepath} bind def
/C9 {BL [] 0 setdash 2 copy moveto
	2 copy vpt 270 450 arc closepath fill
	vpt 0 360 arc closepath} bind def
/C10 {BL [] 0 setdash 2 copy 2 copy moveto vpt 270 360 arc closepath fill
	2 copy moveto
	2 copy vpt 90 180 arc closepath fill
	vpt 0 360 arc closepath} bind def
/C11 {BL [] 0 setdash 2 copy moveto
	2 copy vpt 0 180 arc closepath fill
	2 copy moveto
	2 copy vpt 270 360 arc closepath fill
	vpt 0 360 arc closepath} bind def
/C12 {BL [] 0 setdash 2 copy moveto
	2 copy vpt 180 360 arc closepath fill
	vpt 0 360 arc closepath} bind def
/C13 {BL [] 0 setdash 2 copy moveto
	2 copy vpt 0 90 arc closepath fill
	2 copy moveto
	2 copy vpt 180 360 arc closepath fill
	vpt 0 360 arc closepath} bind def
/C14 {BL [] 0 setdash 2 copy moveto
	2 copy vpt 90 360 arc closepath fill
	vpt 0 360 arc} bind def
/C15 {BL [] 0 setdash 2 copy vpt 0 360 arc closepath fill
	vpt 0 360 arc closepath} bind def
/Rec {newpath 4 2 roll moveto 1 index 0 rlineto 0 exch rlineto
	neg 0 rlineto closepath} bind def
/Square {dup Rec} bind def
/Bsquare {vpt sub exch vpt sub exch vpt2 Square} bind def
/S0 {BL [] 0 setdash 2 copy moveto 0 vpt rlineto BL Bsquare} bind def
/S1 {BL [] 0 setdash 2 copy vpt Square fill Bsquare} bind def
/S2 {BL [] 0 setdash 2 copy exch vpt sub exch vpt Square fill Bsquare} bind def
/S3 {BL [] 0 setdash 2 copy exch vpt sub exch vpt2 vpt Rec fill Bsquare} bind def
/S4 {BL [] 0 setdash 2 copy exch vpt sub exch vpt sub vpt Square fill Bsquare} bind def
/S5 {BL [] 0 setdash 2 copy 2 copy vpt Square fill
	exch vpt sub exch vpt sub vpt Square fill Bsquare} bind def
/S6 {BL [] 0 setdash 2 copy exch vpt sub exch vpt sub vpt vpt2 Rec fill Bsquare} bind def
/S7 {BL [] 0 setdash 2 copy exch vpt sub exch vpt sub vpt vpt2 Rec fill
	2 copy vpt Square fill Bsquare} bind def
/S8 {BL [] 0 setdash 2 copy vpt sub vpt Square fill Bsquare} bind def
/S9 {BL [] 0 setdash 2 copy vpt sub vpt vpt2 Rec fill Bsquare} bind def
/S10 {BL [] 0 setdash 2 copy vpt sub vpt Square fill 2 copy exch vpt sub exch vpt Square fill
	Bsquare} bind def
/S11 {BL [] 0 setdash 2 copy vpt sub vpt Square fill 2 copy exch vpt sub exch vpt2 vpt Rec fill
	Bsquare} bind def
/S12 {BL [] 0 setdash 2 copy exch vpt sub exch vpt sub vpt2 vpt Rec fill Bsquare} bind def
/S13 {BL [] 0 setdash 2 copy exch vpt sub exch vpt sub vpt2 vpt Rec fill
	2 copy vpt Square fill Bsquare} bind def
/S14 {BL [] 0 setdash 2 copy exch vpt sub exch vpt sub vpt2 vpt Rec fill
	2 copy exch vpt sub exch vpt Square fill Bsquare} bind def
/S15 {BL [] 0 setdash 2 copy Bsquare fill Bsquare} bind def
/D0 {gsave translate 45 rotate 0 0 S0 stroke grestore} bind def
/D1 {gsave translate 45 rotate 0 0 S1 stroke grestore} bind def
/D2 {gsave translate 45 rotate 0 0 S2 stroke grestore} bind def
/D3 {gsave translate 45 rotate 0 0 S3 stroke grestore} bind def
/D4 {gsave translate 45 rotate 0 0 S4 stroke grestore} bind def
/D5 {gsave translate 45 rotate 0 0 S5 stroke grestore} bind def
/D6 {gsave translate 45 rotate 0 0 S6 stroke grestore} bind def
/D7 {gsave translate 45 rotate 0 0 S7 stroke grestore} bind def
/D8 {gsave translate 45 rotate 0 0 S8 stroke grestore} bind def
/D9 {gsave translate 45 rotate 0 0 S9 stroke grestore} bind def
/D10 {gsave translate 45 rotate 0 0 S10 stroke grestore} bind def
/D11 {gsave translate 45 rotate 0 0 S11 stroke grestore} bind def
/D12 {gsave translate 45 rotate 0 0 S12 stroke grestore} bind def
/D13 {gsave translate 45 rotate 0 0 S13 stroke grestore} bind def
/D14 {gsave translate 45 rotate 0 0 S14 stroke grestore} bind def
/D15 {gsave translate 45 rotate 0 0 S15 stroke grestore} bind def
/DiaE {stroke [] 0 setdash vpt add M
  hpt neg vpt neg V hpt vpt neg V
  hpt vpt V hpt neg vpt V closepath stroke} def
/BoxE {stroke [] 0 setdash exch hpt sub exch vpt add M
  0 vpt2 neg V hpt2 0 V 0 vpt2 V
  hpt2 neg 0 V closepath stroke} def
/TriUE {stroke [] 0 setdash vpt 1.12 mul add M
  hpt neg vpt -1.62 mul V
  hpt 2 mul 0 V
  hpt neg vpt 1.62 mul V closepath stroke} def
/TriDE {stroke [] 0 setdash vpt 1.12 mul sub M
  hpt neg vpt 1.62 mul V
  hpt 2 mul 0 V
  hpt neg vpt -1.62 mul V closepath stroke} def
/PentE {stroke [] 0 setdash gsave
  translate 0 hpt M 4 {72 rotate 0 hpt L} repeat
  closepath stroke grestore} def
/CircE {stroke [] 0 setdash 
  hpt 0 360 arc stroke} def
/Opaque {gsave closepath 1 setgray fill grestore 0 setgray closepath} def
/DiaW {stroke [] 0 setdash vpt add M
  hpt neg vpt neg V hpt vpt neg V
  hpt vpt V hpt neg vpt V Opaque stroke} def
/BoxW {stroke [] 0 setdash exch hpt sub exch vpt add M
  0 vpt2 neg V hpt2 0 V 0 vpt2 V
  hpt2 neg 0 V Opaque stroke} def
/TriUW {stroke [] 0 setdash vpt 1.12 mul add M
  hpt neg vpt -1.62 mul V
  hpt 2 mul 0 V
  hpt neg vpt 1.62 mul V Opaque stroke} def
/TriDW {stroke [] 0 setdash vpt 1.12 mul sub M
  hpt neg vpt 1.62 mul V
  hpt 2 mul 0 V
  hpt neg vpt -1.62 mul V Opaque stroke} def
/PentW {stroke [] 0 setdash gsave
  translate 0 hpt M 4 {72 rotate 0 hpt L} repeat
  Opaque stroke grestore} def
/CircW {stroke [] 0 setdash 
  hpt 0 360 arc Opaque stroke} def
/BoxFill {gsave Rec 1 setgray fill grestore} def
/Density {
  /Fillden exch def
  currentrgbcolor
  /ColB exch def /ColG exch def /ColR exch def
  /ColR ColR Fillden mul Fillden sub 1 add def
  /ColG ColG Fillden mul Fillden sub 1 add def
  /ColB ColB Fillden mul Fillden sub 1 add def
  ColR ColG ColB setrgbcolor} def
/BoxColFill {gsave Rec PolyFill} def
/PolyFill {gsave Density fill grestore grestore} def
/h {rlineto rlineto rlineto gsave closepath fill grestore} bind def
%
% PostScript Level 1 Pattern Fill routine for rectangles
% Usage: x y w h s a XX PatternFill
%	x,y = lower left corner of box to be filled
%	w,h = width and height of box
%	  a = angle in degrees between lines and x-axis
%	 XX = 0/1 for no/yes cross-hatch
%
/PatternFill {gsave /PFa [ 9 2 roll ] def
  PFa 0 get PFa 2 get 2 div add PFa 1 get PFa 3 get 2 div add translate
  PFa 2 get -2 div PFa 3 get -2 div PFa 2 get PFa 3 get Rec
  TransparentPatterns {} {gsave 1 setgray fill grestore} ifelse
  clip
  currentlinewidth 0.5 mul setlinewidth
  /PFs PFa 2 get dup mul PFa 3 get dup mul add sqrt def
  0 0 M PFa 5 get rotate PFs -2 div dup translate
  0 1 PFs PFa 4 get div 1 add floor cvi
	{PFa 4 get mul 0 M 0 PFs V} for
  0 PFa 6 get ne {
	0 1 PFs PFa 4 get div 1 add floor cvi
	{PFa 4 get mul 0 2 1 roll M PFs 0 V} for
 } if
  stroke grestore} def
%
/languagelevel where
 {pop languagelevel} {1} ifelse
 2 lt
	{/InterpretLevel1 true def}
	{/InterpretLevel1 Level1 def}
 ifelse
%
% PostScript level 2 pattern fill definitions
%
/Level2PatternFill {
/Tile8x8 {/PaintType 2 /PatternType 1 /TilingType 1 /BBox [0 0 8 8] /XStep 8 /YStep 8}
	bind def
/KeepColor {currentrgbcolor [/Pattern /DeviceRGB] setcolorspace} bind def
<< Tile8x8
 /PaintProc {0.5 setlinewidth pop 0 0 M 8 8 L 0 8 M 8 0 L stroke} 
>> matrix makepattern
/Pat1 exch def
<< Tile8x8
 /PaintProc {0.5 setlinewidth pop 0 0 M 8 8 L 0 8 M 8 0 L stroke
	0 4 M 4 8 L 8 4 L 4 0 L 0 4 L stroke}
>> matrix makepattern
/Pat2 exch def
<< Tile8x8
 /PaintProc {0.5 setlinewidth pop 0 0 M 0 8 L
	8 8 L 8 0 L 0 0 L fill}
>> matrix makepattern
/Pat3 exch def
<< Tile8x8
 /PaintProc {0.5 setlinewidth pop -4 8 M 8 -4 L
	0 12 M 12 0 L stroke}
>> matrix makepattern
/Pat4 exch def
<< Tile8x8
 /PaintProc {0.5 setlinewidth pop -4 0 M 8 12 L
	0 -4 M 12 8 L stroke}
>> matrix makepattern
/Pat5 exch def
<< Tile8x8
 /PaintProc {0.5 setlinewidth pop -2 8 M 4 -4 L
	0 12 M 8 -4 L 4 12 M 10 0 L stroke}
>> matrix makepattern
/Pat6 exch def
<< Tile8x8
 /PaintProc {0.5 setlinewidth pop -2 0 M 4 12 L
	0 -4 M 8 12 L 4 -4 M 10 8 L stroke}
>> matrix makepattern
/Pat7 exch def
<< Tile8x8
 /PaintProc {0.5 setlinewidth pop 8 -2 M -4 4 L
	12 0 M -4 8 L 12 4 M 0 10 L stroke}
>> matrix makepattern
/Pat8 exch def
<< Tile8x8
 /PaintProc {0.5 setlinewidth pop 0 -2 M 12 4 L
	-4 0 M 12 8 L -4 4 M 8 10 L stroke}
>> matrix makepattern
/Pat9 exch def
/Pattern1 {PatternBgnd KeepColor Pat1 setpattern} bind def
/Pattern2 {PatternBgnd KeepColor Pat2 setpattern} bind def
/Pattern3 {PatternBgnd KeepColor Pat3 setpattern} bind def
/Pattern4 {PatternBgnd KeepColor Landscape {Pat5} {Pat4} ifelse setpattern} bind def
/Pattern5 {PatternBgnd KeepColor Landscape {Pat4} {Pat5} ifelse setpattern} bind def
/Pattern6 {PatternBgnd KeepColor Landscape {Pat9} {Pat6} ifelse setpattern} bind def
/Pattern7 {PatternBgnd KeepColor Landscape {Pat8} {Pat7} ifelse setpattern} bind def
} def
%
%
%End of PostScript Level 2 code
%
/PatternBgnd {
  TransparentPatterns {} {gsave 1 setgray fill grestore} ifelse
} def
%
% Substitute for Level 2 pattern fill codes with
% grayscale if Level 2 support is not selected.
%
/Level1PatternFill {
/Pattern1 {0.250 Density} bind def
/Pattern2 {0.500 Density} bind def
/Pattern3 {0.750 Density} bind def
/Pattern4 {0.125 Density} bind def
/Pattern5 {0.375 Density} bind def
/Pattern6 {0.625 Density} bind def
/Pattern7 {0.875 Density} bind def
} def
%
% Now test for support of Level 2 code
%
Level1 {Level1PatternFill} {Level2PatternFill} ifelse
%
/Symbol-Oblique /Symbol findfont [1 0 .167 1 0 0] makefont
dup length dict begin {1 index /FID eq {pop pop} {def} ifelse} forall
currentdict end definefont pop
Level1 SuppressPDFMark or 
{} {
/SDict 10 dict def
systemdict /pdfmark known not {
  userdict /pdfmark systemdict /cleartomark get put
} if
SDict begin [
  /Title (minimum_w.tex)
  /Subject (gnuplot plot)
  /Creator (gnuplot 4.6 patchlevel 3)
  /Author (kevin)
%  /Producer (gnuplot)
%  /Keywords ()
  /CreationDate (Fri Aug  5 08:55:16 2016)
  /DOCINFO pdfmark
end
} ifelse
end
%%EndProlog
%%Page: 1 1
gnudict begin
gsave
doclip
50 50 translate
0.050 0.050 scale
0 setgray
newpath
1.000 UL
LTb
LCb setrgbcolor
1342 704 M
63 0 V
5398 0 R
-63 0 V
stroke
LTb
1342 1156 M
63 0 V
5398 0 R
-63 0 V
1342 1609 M
63 0 V
5398 0 R
-63 0 V
1342 2061 M
63 0 V
5398 0 R
-63 0 V
1342 2513 M
63 0 V
5398 0 R
-63 0 V
1342 2966 M
63 0 V
5398 0 R
-63 0 V
1342 3418 M
63 0 V
5398 0 R
-63 0 V
1342 3870 M
63 0 V
5398 0 R
-63 0 V
1342 4323 M
63 0 V
5398 0 R
-63 0 V
1342 4775 M
63 0 V
5398 0 R
-63 0 V
1663 704 M
0 63 V
0 4008 R
0 -63 V
2306 704 M
0 63 V
0 4008 R
0 -63 V
2948 704 M
0 63 V
0 4008 R
0 -63 V
3591 704 M
0 63 V
0 4008 R
0 -63 V
4233 704 M
0 63 V
0 4008 R
0 -63 V
4876 704 M
0 63 V
0 4008 R
0 -63 V
5518 704 M
0 63 V
0 4008 R
0 -63 V
6161 704 M
0 63 V
0 4008 R
0 -63 V
6803 704 M
0 63 V
0 4008 R
0 -63 V
stroke
1342 4775 N
0 -4071 V
5461 0 V
0 4071 V
-5461 0 V
Z stroke
1.000 UP
1.000 UL
LTb
1.000 UP
1.000 UL
LT0
LC0 setrgbcolor
LCb setrgbcolor
LT0
LC0 setrgbcolor
5948 4602 M
591 0 V
1342 4775 M
32 0 V
32 0 V
32 0 V
32 0 V
33 0 V
32 0 V
32 0 V
32 -57 V
32 -235 V
32 -212 V
32 -191 V
32 -174 V
33 -160 V
32 -145 V
32 -135 V
32 -124 V
32 -114 V
32 -106 V
32 -99 V
32 -93 V
33 -86 V
32 -82 V
32 -76 V
32 -72 V
32 -67 V
32 -64 V
32 -61 V
32 -57 V
33 -54 V
32 -52 V
32 -49 V
32 -46 V
32 -45 V
32 -43 V
32 -40 V
32 -39 V
33 -37 V
32 -36 V
32 -34 V
32 -33 V
32 -32 V
32 -30 V
32 -29 V
32 -28 V
33 -28 V
32 -25 V
32 -26 V
32 -24 V
32 -24 V
32 -22 V
32 -22 V
32 -22 V
33 -20 V
32 -20 V
32 -19 V
32 -19 V
32 -18 V
32 -18 V
32 -17 V
32 -17 V
33 -16 V
32 -16 V
32 -15 V
32 -15 V
32 -14 V
32 -14 V
32 -15 V
32 -13 V
33 -13 V
32 -12 V
32 -13 V
32 -12 V
32 -12 V
32 -11 V
32 -12 V
32 -11 V
33 -10 V
32 -11 V
32 -10 V
32 -10 V
32 -10 V
32 -10 V
32 -9 V
32 -10 V
33 -9 V
32 -8 V
32 -9 V
32 -8 V
32 -9 V
32 -8 V
32 -8 V
32 -8 V
32 -7 V
33 -8 V
32 -7 V
32 -7 V
32 -8 V
32 -6 V
32 -7 V
32 -7 V
32 -6 V
33 -7 V
stroke 4619 966 M
32 -6 V
32 -7 V
32 -6 V
32 -6 V
32 -6 V
32 -6 V
32 -5 V
33 -6 V
32 -5 V
32 -6 V
32 -5 V
32 -6 V
32 -5 V
32 -5 V
32 -5 V
33 -5 V
32 -5 V
32 -5 V
32 -4 V
32 -5 V
32 -5 V
32 -4 V
32 -4 V
33 -5 V
32 -4 V
32 -4 V
32 -4 V
32 -4 V
32 -5 V
32 -4 V
32 -4 V
33 -4 V
32 -3 V
32 -4 V
32 -4 V
32 -4 V
32 -3 V
32 -4 V
32 -4 V
33 -3 V
32 -3 V
32 -4 V
32 -3 V
32 -4 V
32 -3 V
32 -2 V
32 -3 V
33 4 V
32 52 V
32 1134 V
32 2830 V
32 0 V
32 0 V
32 0 V
32 0 V
33 0 V
32 0 V
32 0 V
32 0 V
32 0 V
32 0 V
32 0 V
32 0 V
33 0 V
32 0 V
32 0 V
32 0 V
32 0 V
1342 4775 Pls
1374 4775 Pls
1406 4775 Pls
1438 4775 Pls
1470 4775 Pls
1503 4775 Pls
1535 4775 Pls
1567 4775 Pls
1599 4718 Pls
1631 4483 Pls
1663 4271 Pls
1695 4080 Pls
1727 3906 Pls
1760 3746 Pls
1792 3601 Pls
1824 3466 Pls
1856 3342 Pls
1888 3228 Pls
1920 3122 Pls
1952 3023 Pls
1984 2930 Pls
2017 2844 Pls
2049 2762 Pls
2081 2686 Pls
2113 2614 Pls
2145 2547 Pls
2177 2483 Pls
2209 2422 Pls
2241 2365 Pls
2274 2311 Pls
2306 2259 Pls
2338 2210 Pls
2370 2164 Pls
2402 2119 Pls
2434 2076 Pls
2466 2036 Pls
2498 1997 Pls
2531 1960 Pls
2563 1924 Pls
2595 1890 Pls
2627 1857 Pls
2659 1825 Pls
2691 1795 Pls
2723 1766 Pls
2755 1738 Pls
2788 1710 Pls
2820 1685 Pls
2852 1659 Pls
2884 1635 Pls
2916 1611 Pls
2948 1589 Pls
2980 1567 Pls
3012 1545 Pls
3045 1525 Pls
3077 1505 Pls
3109 1486 Pls
3141 1467 Pls
3173 1449 Pls
3205 1431 Pls
3237 1414 Pls
3269 1397 Pls
3302 1381 Pls
3334 1365 Pls
3366 1350 Pls
3398 1335 Pls
3430 1321 Pls
3462 1307 Pls
3494 1292 Pls
3526 1279 Pls
3559 1266 Pls
3591 1254 Pls
3623 1241 Pls
3655 1229 Pls
3687 1217 Pls
3719 1206 Pls
3751 1194 Pls
3783 1183 Pls
3816 1173 Pls
3848 1162 Pls
3880 1152 Pls
3912 1142 Pls
3944 1132 Pls
3976 1122 Pls
4008 1113 Pls
4040 1103 Pls
4073 1094 Pls
4105 1086 Pls
4137 1077 Pls
4169 1069 Pls
4201 1060 Pls
4233 1052 Pls
4265 1044 Pls
4297 1036 Pls
4329 1029 Pls
4362 1021 Pls
4394 1014 Pls
4426 1007 Pls
4458 999 Pls
4490 993 Pls
4522 986 Pls
4554 979 Pls
4586 973 Pls
4619 966 Pls
4651 960 Pls
4683 953 Pls
4715 947 Pls
4747 941 Pls
4779 935 Pls
4811 929 Pls
4843 924 Pls
4876 918 Pls
4908 913 Pls
4940 907 Pls
4972 902 Pls
5004 896 Pls
5036 891 Pls
5068 886 Pls
5100 881 Pls
5133 876 Pls
5165 871 Pls
5197 866 Pls
5229 862 Pls
5261 857 Pls
5293 852 Pls
5325 848 Pls
5357 844 Pls
5390 839 Pls
5422 835 Pls
5454 831 Pls
5486 827 Pls
5518 823 Pls
5550 818 Pls
5582 814 Pls
5614 810 Pls
5647 806 Pls
5679 803 Pls
5711 799 Pls
5743 795 Pls
5775 791 Pls
5807 788 Pls
5839 784 Pls
5871 780 Pls
5904 777 Pls
5936 774 Pls
5968 770 Pls
6000 767 Pls
6032 763 Pls
6064 760 Pls
6096 758 Pls
6128 755 Pls
6161 759 Pls
6193 811 Pls
6225 1945 Pls
6257 4775 Pls
6289 4775 Pls
6321 4775 Pls
6353 4775 Pls
6385 4775 Pls
6418 4775 Pls
6450 4775 Pls
6482 4775 Pls
6514 4775 Pls
6546 4775 Pls
6578 4775 Pls
6610 4775 Pls
6642 4775 Pls
6675 4775 Pls
6707 4775 Pls
6739 4775 Pls
6771 4775 Pls
6803 4775 Pls
6243 4602 Pls
1.000 UL
LT1
LC1 setrgbcolor
LCb setrgbcolor
LT1
LC1 setrgbcolor
5948 4382 M
591 0 V
1342 755 M
11 0 V
11 0 V
11 0 V
11 0 V
11 0 V
11 0 V
11 0 V
11 0 V
10 0 V
11 0 V
11 0 V
11 0 V
11 0 V
11 0 V
11 0 V
11 0 V
11 0 V
11 0 V
11 0 V
11 0 V
11 0 V
11 0 V
11 0 V
11 0 V
11 0 V
11 0 V
10 0 V
11 0 V
11 0 V
11 0 V
11 0 V
11 0 V
11 0 V
11 0 V
11 0 V
11 0 V
11 0 V
11 0 V
11 0 V
11 0 V
11 0 V
11 0 V
11 0 V
11 0 V
10 0 V
11 0 V
11 0 V
11 0 V
11 0 V
11 0 V
11 0 V
11 0 V
11 0 V
11 0 V
11 0 V
11 0 V
11 0 V
11 0 V
11 0 V
11 0 V
11 0 V
11 0 V
10 0 V
11 0 V
11 0 V
11 0 V
11 0 V
11 0 V
11 0 V
11 0 V
11 0 V
11 0 V
11 0 V
11 0 V
11 0 V
11 0 V
11 0 V
11 0 V
11 0 V
11 0 V
10 0 V
11 0 V
11 0 V
11 0 V
11 0 V
11 0 V
11 0 V
11 0 V
11 0 V
11 0 V
11 0 V
11 0 V
11 0 V
11 0 V
11 0 V
11 0 V
11 0 V
11 0 V
10 0 V
11 0 V
11 0 V
11 0 V
stroke 2458 755 M
11 0 V
11 0 V
11 0 V
11 0 V
11 0 V
11 0 V
11 0 V
11 0 V
11 0 V
11 0 V
11 0 V
11 0 V
11 0 V
10 0 V
11 0 V
11 0 V
11 0 V
11 0 V
11 0 V
11 0 V
11 0 V
11 0 V
11 0 V
11 0 V
11 0 V
11 0 V
11 0 V
11 0 V
11 0 V
11 0 V
11 0 V
10 0 V
11 0 V
11 0 V
11 0 V
11 0 V
11 0 V
11 0 V
11 0 V
11 0 V
11 0 V
11 0 V
11 0 V
11 0 V
11 0 V
11 0 V
11 0 V
11 0 V
11 0 V
10 0 V
11 0 V
11 0 V
11 0 V
11 0 V
11 0 V
11 0 V
11 0 V
11 0 V
11 0 V
11 0 V
11 0 V
11 0 V
11 0 V
11 0 V
11 0 V
11 0 V
11 0 V
10 0 V
11 0 V
11 0 V
11 0 V
11 0 V
11 0 V
11 0 V
11 0 V
11 0 V
11 0 V
11 0 V
11 0 V
11 0 V
11 0 V
11 0 V
11 0 V
11 0 V
11 0 V
10 0 V
11 0 V
11 0 V
11 0 V
11 0 V
11 0 V
11 0 V
11 0 V
11 0 V
11 0 V
11 0 V
11 0 V
11 0 V
11 0 V
11 0 V
11 0 V
11 0 V
10 0 V
11 0 V
stroke 3596 755 M
11 0 V
11 0 V
11 0 V
11 0 V
11 0 V
11 0 V
11 0 V
11 0 V
11 0 V
11 0 V
11 0 V
11 0 V
11 0 V
11 0 V
11 0 V
11 0 V
10 0 V
11 0 V
11 0 V
11 0 V
11 0 V
11 0 V
11 0 V
11 0 V
11 0 V
11 0 V
11 0 V
11 0 V
11 0 V
11 0 V
11 0 V
11 0 V
11 0 V
11 0 V
10 0 V
11 0 V
11 0 V
11 0 V
11 0 V
11 0 V
11 0 V
11 0 V
11 0 V
11 0 V
11 0 V
11 0 V
11 0 V
11 0 V
11 0 V
11 0 V
11 0 V
11 0 V
10 0 V
11 0 V
11 0 V
11 0 V
11 0 V
11 0 V
11 0 V
11 0 V
11 0 V
11 0 V
11 0 V
11 0 V
11 0 V
11 0 V
11 0 V
11 0 V
11 0 V
11 0 V
10 0 V
11 0 V
11 0 V
11 0 V
11 0 V
11 0 V
11 0 V
11 0 V
11 0 V
11 0 V
11 0 V
11 0 V
11 0 V
11 0 V
11 0 V
11 0 V
11 0 V
11 0 V
10 0 V
11 0 V
11 0 V
11 0 V
11 0 V
11 0 V
11 0 V
11 0 V
11 0 V
11 0 V
11 0 V
11 0 V
11 0 V
11 0 V
11 0 V
11 0 V
stroke 4735 755 M
11 0 V
10 0 V
11 0 V
11 0 V
11 0 V
11 0 V
11 0 V
11 0 V
11 0 V
11 0 V
11 0 V
11 0 V
11 0 V
11 0 V
11 0 V
11 0 V
11 0 V
11 0 V
11 0 V
10 0 V
11 0 V
11 0 V
11 0 V
11 0 V
11 0 V
11 0 V
11 0 V
11 0 V
11 0 V
11 0 V
11 0 V
11 0 V
11 0 V
11 0 V
11 0 V
11 0 V
11 0 V
10 0 V
11 0 V
11 0 V
11 0 V
11 0 V
11 0 V
11 0 V
11 0 V
11 0 V
11 0 V
11 0 V
11 0 V
11 0 V
11 0 V
11 0 V
11 0 V
11 0 V
11 0 V
10 0 V
11 0 V
11 0 V
11 0 V
11 0 V
11 0 V
11 0 V
11 0 V
11 0 V
11 0 V
11 0 V
11 0 V
11 0 V
11 0 V
11 0 V
11 0 V
11 0 V
11 0 V
10 0 V
11 0 V
11 0 V
11 0 V
11 0 V
11 0 V
11 0 V
11 0 V
11 0 V
11 0 V
11 0 V
11 0 V
11 0 V
11 0 V
11 0 V
11 0 V
11 0 V
10 0 V
11 0 V
11 0 V
11 0 V
11 0 V
11 0 V
11 0 V
11 0 V
11 0 V
11 0 V
11 0 V
11 0 V
11 0 V
11 0 V
stroke 5873 755 M
11 0 V
11 0 V
11 0 V
11 0 V
10 0 V
11 0 V
11 0 V
11 0 V
11 0 V
11 0 V
11 0 V
11 0 V
11 0 V
11 0 V
11 0 V
11 0 V
11 0 V
11 0 V
11 0 V
11 0 V
11 0 V
11 0 V
10 0 V
11 0 V
11 0 V
11 0 V
11 0 V
11 0 V
11 0 V
11 0 V
11 0 V
11 0 V
11 0 V
11 0 V
11 0 V
11 0 V
11 0 V
11 0 V
11 0 V
11 0 V
10 0 V
11 0 V
11 0 V
11 0 V
11 0 V
11 0 V
11 0 V
11 0 V
11 0 V
11 0 V
11 0 V
11 0 V
11 0 V
11 0 V
11 0 V
11 0 V
11 0 V
11 0 V
10 0 V
11 0 V
11 0 V
11 0 V
11 0 V
11 0 V
11 0 V
11 0 V
11 0 V
11 0 V
11 0 V
11 0 V
11 0 V
11 0 V
11 0 V
11 0 V
11 0 V
11 0 V
10 0 V
11 0 V
11 0 V
11 0 V
11 0 V
11 0 V
11 0 V
11 0 V
11 0 V
stroke
LTb
LCb setrgbcolor
1342 4775 N
0 -4071 V
5461 0 V
0 4071 V
-5461 0 V
Z stroke
1.000 UP
1.000 UL
LTb
stroke
grestore
end
showpage
%%Trailer
