\relax 
\providecommand\hyper@newdestlabel[2]{}
\bibstyle{biblatex}
\bibdata{Prohaupt_neu-blx,literatur}
\citation{biblatex-control}
\catcode `"\active 
\providecommand\HyperFirstAtBeginDocument{\AtBeginDocument}
\HyperFirstAtBeginDocument{\ifx\hyper@anchor\@undefined
\global\let\oldcontentsline\contentsline
\gdef\contentsline#1#2#3#4{\oldcontentsline{#1}{#2}{#3}}
\global\let\oldnewlabel\newlabel
\gdef\newlabel#1#2{\newlabelxx{#1}#2}
\gdef\newlabelxx#1#2#3#4#5#6{\oldnewlabel{#1}{{#2}{#3}}}
\AtEndDocument{\ifx\hyper@anchor\@undefined
\let\contentsline\oldcontentsline
\let\newlabel\oldnewlabel
\fi}
\fi}
\global\let\hyper@last\relax 
\gdef\HyperFirstAtBeginDocument#1{#1}
\providecommand\HyField@AuxAddToFields[1]{}
\providecommand\HyField@AuxAddToCoFields[2]{}
\@writefile{toc}{\boolfalse {citerequest}\boolfalse {citetracker}\boolfalse {pagetracker}\boolfalse {backtracker}\relax }
\@writefile{lof}{\boolfalse {citerequest}\boolfalse {citetracker}\boolfalse {pagetracker}\boolfalse {backtracker}\relax }
\@writefile{lot}{\boolfalse {citerequest}\boolfalse {citetracker}\boolfalse {pagetracker}\boolfalse {backtracker}\relax }
\select@language{ngerman}
\@writefile{toc}{\defcounter {refsection}{0}\relax }\@writefile{toc}{\select@language{ngerman}}
\@writefile{lof}{\defcounter {refsection}{0}\relax }\@writefile{lof}{\select@language{ngerman}}
\@writefile{lot}{\defcounter {refsection}{0}\relax }\@writefile{lot}{\select@language{ngerman}}
\citation{Hecht}
\citation{Hecht}
\citation{Hecht}
\citation{Hecht}
\@writefile{toc}{\contentsline {section}{\numberline {1}Einleitung}{1}{section.1}}
\newlabel{sec:einleitung}{{1}{1}{Einleitung}{section.1}{}}
\@writefile{toc}{\contentsline {section}{\numberline {2}Theorie}{1}{section.2}}
\newlabel{sec:theorie}{{2}{1}{Theorie}{section.2}{}}
\@writefile{toc}{\contentsline {subsection}{\numberline {2.1}Interferenz}{1}{subsection.2.1}}
\@writefile{toc}{\contentsline {subsection}{\numberline {2.2}Fresnel-Huygens-Prinzip}{1}{subsection.2.2}}
\citation{Hecht}
\citation{prakti}
\@writefile{toc}{\contentsline {subsection}{\numberline {2.3}Fraunhofer-Beugung}{2}{subsection.2.3}}
\newlabel{eq:Fraunhofer}{{2}{2}{Fraunhofer-Beugung}{equation.2.2}{}}
\@writefile{toc}{\contentsline {subsection}{\numberline {2.4}L\IeC {\"o}sungen der Intensit\IeC {\"a}tsverteilung f\IeC {\"u}r die verschiedenen Objekte}{2}{subsection.2.4}}
\newlabel{eq:epsilon}{{3}{2}{Lösungen der Intensitätsverteilung für die verschiedenen Objekte}{equation.2.3}{}}
\citation{Hecht}
\@writefile{lot}{\contentsline {table}{\numberline {1}{\ignorespaces \relax }}{3}{table.caption.1}}
\providecommand*\caption@xref[2]{\@setref\relax\@undefined{#1}}
\newlabel{tab:intensit\IeC {\"a}ten}{{1}{3}{\relax }{table.caption.1}{}}
\newlabel{eq:Babinet}{{4}{3}{Lösungen der Intensitätsverteilung für die verschiedenen Objekte}{equation.2.4}{}}
\@writefile{lot}{\contentsline {table}{\numberline {2}{\ignorespaces \relax }}{3}{table.caption.2}}
\newlabel{tab:bessel}{{2}{3}{\relax }{table.caption.2}{}}
\@writefile{toc}{\contentsline {section}{\numberline {3}Durchf\IeC {\"u}hrung}{3}{section.3}}
\newlabel{sec:durchfuehrung}{{3}{3}{Durchführung}{section.3}{}}
\@writefile{lof}{\contentsline {figure}{\numberline {1}{\ignorespaces Schema des Versuchsaufbaus: ein He-Ne-Laser, eine Zerstreuungslinse, eine Sammellinse, beugende Objekte, eine Photodiode.\relax }}{4}{figure.caption.3}}
\newlabel{fig:aufbau}{{1}{4}{Schema des Versuchsaufbaus: ein He-Ne-Laser, eine Zerstreuungslinse, eine Sammellinse, beugende Objekte, eine Photodiode.\relax }{figure.caption.3}{}}
\@writefile{toc}{\contentsline {section}{\numberline {4}Auswertung}{4}{section.4}}
\newlabel{sec:auswertung}{{4}{4}{Auswertung}{section.4}{}}
\@writefile{toc}{\contentsline {section}{\numberline {5}Diskussion}{4}{section.5}}
\newlabel{sec:diskussion}{{5}{4}{Diskussion}{section.5}{}}
\@writefile{lof}{\contentsline {figure}{\numberline {2}{\ignorespaces Spalt\relax }}{5}{figure.caption.4}}
\newlabel{fig:spalt}{{2}{5}{Spalt\relax }{figure.caption.4}{}}
\@writefile{lof}{\contentsline {figure}{\numberline {3}{\ignorespaces Steg\relax }}{5}{figure.caption.5}}
\newlabel{fig:steg}{{3}{5}{Steg\relax }{figure.caption.5}{}}
\@writefile{lof}{\contentsline {figure}{\numberline {4}{\ignorespaces Gitter\relax }}{6}{figure.caption.6}}
\newlabel{fig:gitter}{{4}{6}{Gitter\relax }{figure.caption.6}{}}
\@writefile{lof}{\contentsline {figure}{\numberline {5}{\ignorespaces Loch\relax }}{6}{figure.caption.7}}
\newlabel{fig:loch}{{5}{6}{Loch\relax }{figure.caption.7}{}}
\@writefile{lof}{\contentsline {figure}{\numberline {6}{\ignorespaces Doppelloch\relax }}{7}{figure.caption.8}}
\newlabel{fig:doppelloch}{{6}{7}{Doppelloch\relax }{figure.caption.8}{}}
\@writefile{toc}{\contentsline {section}{\nonumberline Literatur}{7}{section*.9}}
