This is BibTeX, Version 0.99d (TeX Live 2014)
Capacity: max_strings=35307, hash_size=35307, hash_prime=30011
The top-level auxiliary file: Prohaupt.aux
The style file: biblatex.bst
Reallocated singl_function (elt_size=4) to 100 items from 50.
Reallocated singl_function (elt_size=4) to 100 items from 50.
Reallocated singl_function (elt_size=4) to 100 items from 50.
Reallocated singl_function (elt_size=4) to 100 items from 50.
Reallocated singl_function (elt_size=4) to 100 items from 50.
Reallocated wiz_functions (elt_size=4) to 6000 items from 3000.
Reallocated singl_function (elt_size=4) to 100 items from 50.
Reallocated singl_function (elt_size=4) to 100 items from 50.
Reallocated singl_function (elt_size=4) to 100 items from 50.
Reallocated singl_function (elt_size=4) to 100 items from 50.
Reallocated singl_function (elt_size=4) to 100 items from 50.
Database file #1: Prohaupt-blx.bib
Database file #2: literatur.bib
Biblatex version: 2.8
Reallocated singl_function (elt_size=4) to 100 items from 50.
Reallocated wiz_functions (elt_size=4) to 9000 items from 6000.
You've used 3 entries,
            6047 wiz_defined-function locations,
            1141 strings with 8305 characters,
and the built_in function-call counts, 7756 in all, are:
= -- 392
> -- 255
< -- 90
+ -- 110
- -- 72
* -- 357
:= -- 620
add.period$ -- 0
call.type$ -- 3
change.case$ -- 59
chr.to.int$ -- 34
cite$ -- 4
duplicate$ -- 753
empty$ -- 766
format.name$ -- 98
if$ -- 1814
int.to.chr$ -- 0
int.to.str$ -- 6
missing$ -- 0
newline$ -- 60
num.names$ -- 127
pop$ -- 680
preamble$ -- 1
purify$ -- 61
quote$ -- 0
skip$ -- 509
stack$ -- 0
substring$ -- 344
swap$ -- 230
text.length$ -- 66
text.prefix$ -- 2
top$ -- 1
type$ -- 102
warning$ -- 0
while$ -- 84
width$ -- 0
write$ -- 56
