\relax 
\providecommand\hyper@newdestlabel[2]{}
\bibstyle{biblatex}
\bibdata{Prohaupt-blx,literatur}
\citation{biblatex-control}
\catcode `"\active 
\providecommand\HyperFirstAtBeginDocument{\AtBeginDocument}
\HyperFirstAtBeginDocument{\ifx\hyper@anchor\@undefined
\global\let\oldcontentsline\contentsline
\gdef\contentsline#1#2#3#4{\oldcontentsline{#1}{#2}{#3}}
\global\let\oldnewlabel\newlabel
\gdef\newlabel#1#2{\newlabelxx{#1}#2}
\gdef\newlabelxx#1#2#3#4#5#6{\oldnewlabel{#1}{{#2}{#3}}}
\AtEndDocument{\ifx\hyper@anchor\@undefined
\let\contentsline\oldcontentsline
\let\newlabel\oldnewlabel
\fi}
\fi}
\global\let\hyper@last\relax 
\gdef\HyperFirstAtBeginDocument#1{#1}
\providecommand\HyField@AuxAddToFields[1]{}
\providecommand\HyField@AuxAddToCoFields[2]{}
\@writefile{toc}{\boolfalse {citerequest}\boolfalse {citetracker}\boolfalse {pagetracker}\boolfalse {backtracker}\relax }
\@writefile{lof}{\boolfalse {citerequest}\boolfalse {citetracker}\boolfalse {pagetracker}\boolfalse {backtracker}\relax }
\@writefile{lot}{\boolfalse {citerequest}\boolfalse {citetracker}\boolfalse {pagetracker}\boolfalse {backtracker}\relax }
\select@language{ngerman}
\@writefile{toc}{\defcounter {refsection}{0}\relax }\@writefile{toc}{\select@language{ngerman}}
\@writefile{lof}{\defcounter {refsection}{0}\relax }\@writefile{lof}{\select@language{ngerman}}
\@writefile{lot}{\defcounter {refsection}{0}\relax }\@writefile{lot}{\select@language{ngerman}}
\citation{Hecht}
\citation{Hecht}
\citation{Hecht}
\citation{Hecht}
\@writefile{toc}{\contentsline {section}{\numberline {1}Einleitung}{1}{section.1}}
\newlabel{sec:einleitung}{{1}{1}{Einleitung}{section.1}{}}
\@writefile{toc}{\contentsline {section}{\numberline {2}Theorie}{1}{section.2}}
\newlabel{sec:theorie}{{2}{1}{Theorie}{section.2}{}}
\@writefile{toc}{\contentsline {subsection}{\numberline {2.1}Interferenz}{1}{subsection.2.1}}
\@writefile{toc}{\contentsline {subsection}{\numberline {2.2}Fresnel-Huygens-Prinzip}{1}{subsection.2.2}}
\citation{Hecht}
\citation{prakti}
\@writefile{toc}{\contentsline {subsection}{\numberline {2.3}Fraunhofer-Beugung}{2}{subsection.2.3}}
\newlabel{eq:Fraunhofer}{{2}{2}{Fraunhofer-Beugung}{equation.2.2}{}}
\@writefile{toc}{\contentsline {subsection}{\numberline {2.4}L\IeC {\"o}sungen der Intensit\IeC {\"a}tsverteilung f\IeC {\"u}r die verschiedenen Objekte}{2}{subsection.2.4}}
\newlabel{eq:epsilon}{{3}{2}{Lösungen der Intensitätsverteilung für die verschiedenen Objekte}{equation.2.3}{}}
\citation{Hecht}
\@writefile{lot}{\contentsline {table}{\numberline {1}{\ignorespaces \relax }}{3}{table.caption.1}}
\providecommand*\caption@xref[2]{\@setref\relax\@undefined{#1}}
\newlabel{tab:intensit\IeC {\"a}ten}{{1}{3}{\relax }{table.caption.1}{}}
\newlabel{eq:Babinet}{{4}{3}{Lösungen der Intensitätsverteilung für die verschiedenen Objekte}{equation.2.4}{}}
\@writefile{lot}{\contentsline {table}{\numberline {2}{\ignorespaces \relax }}{3}{table.caption.2}}
\newlabel{tab:bessel}{{2}{3}{\relax }{table.caption.2}{}}
\@writefile{toc}{\contentsline {section}{\numberline {3}Durchf\IeC {\"u}hrung}{3}{section.3}}
\newlabel{sec:durchfuehrung}{{3}{3}{Durchführung}{section.3}{}}
\@writefile{lof}{\contentsline {figure}{\numberline {1}{\ignorespaces Schema des Versuchsaufbaus: ein He-Ne-Laser, eine Zerstreuungslinse, eine Sammellinse, beugende Objekte, eine Photodiode.\relax }}{4}{figure.caption.3}}
\newlabel{fig:aufbau}{{1}{4}{Schema des Versuchsaufbaus: ein He-Ne-Laser, eine Zerstreuungslinse, eine Sammellinse, beugende Objekte, eine Photodiode.\relax }{figure.caption.3}{}}
\@writefile{toc}{\contentsline {section}{\numberline {4}Auswertung}{4}{section.4}}
\newlabel{sec:auswertung}{{4}{4}{Auswertung}{section.4}{}}
\citation{prakti}
\@writefile{toc}{\contentsline {subsection}{\numberline {4.1}Spalt}{5}{subsection.4.1}}
\@writefile{lof}{\contentsline {figure}{\numberline {2}{\ignorespaces Intensit\IeC {\"a}tsverteilung, anhand der gemessenen Spannung, am Spalt aufgetragen gegen die absolute Position\relax }}{5}{figure.caption.4}}
\newlabel{fig:spalt}{{2}{5}{Intensitätsverteilung, anhand der gemessenen Spannung, am Spalt aufgetragen gegen die absolute Position\relax }{figure.caption.4}{}}
\citation{prakti}
\@writefile{lof}{\contentsline {figure}{\numberline {3}{\ignorespaces Relative Verteilung der Extrema aufgetragen gegen den Auslenkwinkel. Zus\IeC {\"a}tzlich wurde die Regression aufgetragen\relax }}{6}{figure.caption.5}}
\newlabel{fig:sext}{{3}{6}{Relative Verteilung der Extrema aufgetragen gegen den Auslenkwinkel. Zusätzlich wurde die Regression aufgetragen\relax }{figure.caption.5}{}}
\newlabel{eq:epsi}{{9}{6}{Spalt}{equation.4.9}{}}
\@writefile{lot}{\contentsline {table}{\numberline {3}{\ignorespaces Ergebnisse der Extremaverteilung bei der Beugung am Spalt.\relax }}{7}{table.caption.6}}
\newlabel{tab:spalterg}{{3}{7}{Ergebnisse der Extremaverteilung bei der Beugung am Spalt.\relax }{table.caption.6}{}}
\@writefile{toc}{\contentsline {subsection}{\numberline {4.2}Steg}{7}{subsection.4.2}}
\@writefile{lof}{\contentsline {figure}{\numberline {4}{\ignorespaces Intensit\IeC {\"a}tsverteilung der Beugung am Steg.\relax }}{7}{figure.caption.7}}
\newlabel{fig:steg}{{4}{7}{Intensitätsverteilung der Beugung am Steg.\relax }{figure.caption.7}{}}
\@writefile{lof}{\contentsline {figure}{\numberline {5}{\ignorespaces Verteilung der Extrema bei der Beugung am Steg. Zus\IeC {\"a}tzlich wurde die Regression eingetragen.\relax }}{8}{figure.caption.8}}
\newlabel{fig:stext}{{5}{8}{Verteilung der Extrema bei der Beugung am Steg. Zusätzlich wurde die Regression eingetragen.\relax }{figure.caption.8}{}}
\@writefile{toc}{\contentsline {subsection}{\numberline {4.3}Gitter}{8}{subsection.4.3}}
\@writefile{lot}{\contentsline {table}{\numberline {4}{\ignorespaces Ergebnisse der Extremaverteilung bei der Beugung am Steg.\relax }}{9}{table.caption.9}}
\newlabel{tab:stegerg}{{4}{9}{Ergebnisse der Extremaverteilung bei der Beugung am Steg.\relax }{table.caption.9}{}}
\@writefile{lof}{\contentsline {figure}{\numberline {6}{\ignorespaces Intensit\IeC {\"a}tsverteilung bei der Beugung am Gitter.\relax }}{9}{figure.caption.10}}
\newlabel{fig:gitter}{{6}{9}{Intensitätsverteilung bei der Beugung am Gitter.\relax }{figure.caption.10}{}}
\@writefile{lof}{\contentsline {figure}{\numberline {7}{\ignorespaces Verteilung der Extrema bei der Beugung am Gitter. Zus\IeC {\"a}tzlich ist die Regression eingezeichnet.\relax }}{10}{figure.caption.11}}
\newlabel{fig:gitter_ext}{{7}{10}{Verteilung der Extrema bei der Beugung am Gitter. Zusätzlich ist die Regression eingezeichnet.\relax }{figure.caption.11}{}}
\@writefile{toc}{\contentsline {subsection}{\numberline {4.4}Lochblende}{10}{subsection.4.4}}
\@writefile{lot}{\contentsline {table}{\numberline {5}{\ignorespaces Ergebnisse der Extremaverteilung bei der Beugung am Gitter.\relax }}{11}{table.caption.12}}
\newlabel{tab:gittererg}{{5}{11}{Ergebnisse der Extremaverteilung bei der Beugung am Gitter.\relax }{table.caption.12}{}}
\@writefile{lof}{\contentsline {figure}{\numberline {8}{\ignorespaces Intensit\IeC {\"a}tsverteilung der Beugung an einer einzelnen Lochblende.\relax }}{11}{figure.caption.13}}
\newlabel{fig:loch}{{8}{11}{Intensitätsverteilung der Beugung an einer einzelnen Lochblende.\relax }{figure.caption.13}{}}
\@writefile{lof}{\contentsline {figure}{\numberline {9}{\ignorespaces Extremaverteilung der Beugung an einer Lochblende. Zus\IeC {\"a}tzlich ist eine Regression eingetragen.\relax }}{12}{figure.caption.14}}
\newlabel{fig:lext}{{9}{12}{Extremaverteilung der Beugung an einer Lochblende. Zusätzlich ist eine Regression eingetragen.\relax }{figure.caption.14}{}}
\@writefile{lot}{\contentsline {table}{\numberline {6}{\ignorespaces Ergebnisse der Extremaverteilung bei der Beugung an einer Lochblende.\relax }}{12}{table.caption.15}}
\newlabel{tab:locherg}{{6}{12}{Ergebnisse der Extremaverteilung bei der Beugung an einer Lochblende.\relax }{table.caption.15}{}}
\@writefile{toc}{\contentsline {subsection}{\numberline {4.5}Doppelloch}{12}{subsection.4.5}}
\@writefile{lof}{\contentsline {figure}{\numberline {10}{\ignorespaces Intensit\IeC {\"a}tsverteilung der Beugung an einer Doppellochblende\relax }}{13}{figure.caption.16}}
\newlabel{fig:doppelloch}{{10}{13}{Intensitätsverteilung der Beugung an einer Doppellochblende\relax }{figure.caption.16}{}}
\@writefile{lof}{\contentsline {figure}{\numberline {11}{\ignorespaces Verteilung der Extrema bei der Beugung an einer Doppellochblende. Zus\IeC {\"a}tzlich ist eine Regression eingetragen.\relax }}{13}{figure.caption.17}}
\newlabel{fig:dopext}{{11}{13}{Verteilung der Extrema bei der Beugung an einer Doppellochblende. Zusätzlich ist eine Regression eingetragen.\relax }{figure.caption.17}{}}
\citation{prakti}
\@writefile{lot}{\contentsline {table}{\numberline {7}{\ignorespaces Ergebnisse der Extremaverteilung bei der Beugung an einer Doppellochblende.\relax }}{14}{table.caption.18}}
\newlabel{tab:doppellocherg}{{7}{14}{Ergebnisse der Extremaverteilung bei der Beugung an einer Doppellochblende.\relax }{table.caption.18}{}}
\@writefile{toc}{\contentsline {subsection}{\numberline {4.6}Wellenl\IeC {\"a}nge des He-Ne lasers}{14}{subsection.4.6}}
\@writefile{toc}{\contentsline {section}{\numberline {5}Diskussion}{15}{section.5}}
\newlabel{sec:diskussion}{{5}{15}{Diskussion}{section.5}{}}
\@writefile{toc}{\contentsline {subsection}{\numberline {5.1}Beugungsmuster}{15}{subsection.5.1}}
\@writefile{toc}{\contentsline {subsection}{\numberline {5.2}Wellenl\IeC {\"a}nge und Genauigkeit}{15}{subsection.5.2}}
\@writefile{toc}{\contentsline {section}{\nonumberline Literatur}{16}{section*.19}}
