%!PS-Adobe-2.0 EPSF-2.0
%%Title: doppelloch.tex
%%Creator: gnuplot 4.6 patchlevel 5
%%CreationDate: Tue Mar 17 17:16:13 2015
%%DocumentFonts: 
%%BoundingBox: 50 50 410 302
%%EndComments
%%BeginProlog
/gnudict 256 dict def
gnudict begin
%
% The following true/false flags may be edited by hand if desired.
% The unit line width and grayscale image gamma correction may also be changed.
%
/Color true def
/Blacktext true def
/Solid false def
/Dashlength 1 def
/Landscape false def
/Level1 false def
/Rounded false def
/ClipToBoundingBox false def
/SuppressPDFMark false def
/TransparentPatterns false def
/gnulinewidth 5.000 def
/userlinewidth gnulinewidth def
/Gamma 1.0 def
/BackgroundColor {-1.000 -1.000 -1.000} def
%
/vshift -73 def
/dl1 {
  10.0 Dashlength mul mul
  Rounded { currentlinewidth 0.75 mul sub dup 0 le { pop 0.01 } if } if
} def
/dl2 {
  10.0 Dashlength mul mul
  Rounded { currentlinewidth 0.75 mul add } if
} def
/hpt_ 31.5 def
/vpt_ 31.5 def
/hpt hpt_ def
/vpt vpt_ def
/doclip {
  ClipToBoundingBox {
    newpath 50 50 moveto 410 50 lineto 410 302 lineto 50 302 lineto closepath
    clip
  } if
} def
%
% Gnuplot Prolog Version 4.6 (September 2012)
%
%/SuppressPDFMark true def
%
/M {moveto} bind def
/L {lineto} bind def
/R {rmoveto} bind def
/V {rlineto} bind def
/N {newpath moveto} bind def
/Z {closepath} bind def
/C {setrgbcolor} bind def
/f {rlineto fill} bind def
/g {setgray} bind def
/Gshow {show} def   % May be redefined later in the file to support UTF-8
/vpt2 vpt 2 mul def
/hpt2 hpt 2 mul def
/Lshow {currentpoint stroke M 0 vshift R 
	Blacktext {gsave 0 setgray show grestore} {show} ifelse} def
/Rshow {currentpoint stroke M dup stringwidth pop neg vshift R
	Blacktext {gsave 0 setgray show grestore} {show} ifelse} def
/Cshow {currentpoint stroke M dup stringwidth pop -2 div vshift R 
	Blacktext {gsave 0 setgray show grestore} {show} ifelse} def
/UP {dup vpt_ mul /vpt exch def hpt_ mul /hpt exch def
  /hpt2 hpt 2 mul def /vpt2 vpt 2 mul def} def
/DL {Color {setrgbcolor Solid {pop []} if 0 setdash}
 {pop pop pop 0 setgray Solid {pop []} if 0 setdash} ifelse} def
/BL {stroke userlinewidth 2 mul setlinewidth
	Rounded {1 setlinejoin 1 setlinecap} if} def
/AL {stroke userlinewidth 2 div setlinewidth
	Rounded {1 setlinejoin 1 setlinecap} if} def
/UL {dup gnulinewidth mul /userlinewidth exch def
	dup 1 lt {pop 1} if 10 mul /udl exch def} def
/PL {stroke userlinewidth setlinewidth
	Rounded {1 setlinejoin 1 setlinecap} if} def
3.8 setmiterlimit
% Default Line colors
/LCw {1 1 1} def
/LCb {0 0 0} def
/LCa {0 0 0} def
/LC0 {1 0 0} def
/LC1 {0 1 0} def
/LC2 {0 0 1} def
/LC3 {1 0 1} def
/LC4 {0 1 1} def
/LC5 {1 1 0} def
/LC6 {0 0 0} def
/LC7 {1 0.3 0} def
/LC8 {0.5 0.5 0.5} def
% Default Line Types
/LTw {PL [] 1 setgray} def
/LTb {BL [] LCb DL} def
/LTa {AL [1 udl mul 2 udl mul] 0 setdash LCa setrgbcolor} def
/LT0 {PL [] LC0 DL} def
/LT1 {PL [4 dl1 2 dl2] LC1 DL} def
/LT2 {PL [2 dl1 3 dl2] LC2 DL} def
/LT3 {PL [1 dl1 1.5 dl2] LC3 DL} def
/LT4 {PL [6 dl1 2 dl2 1 dl1 2 dl2] LC4 DL} def
/LT5 {PL [3 dl1 3 dl2 1 dl1 3 dl2] LC5 DL} def
/LT6 {PL [2 dl1 2 dl2 2 dl1 6 dl2] LC6 DL} def
/LT7 {PL [1 dl1 2 dl2 6 dl1 2 dl2 1 dl1 2 dl2] LC7 DL} def
/LT8 {PL [2 dl1 2 dl2 2 dl1 2 dl2 2 dl1 2 dl2 2 dl1 4 dl2] LC8 DL} def
/Pnt {stroke [] 0 setdash gsave 1 setlinecap M 0 0 V stroke grestore} def
/Dia {stroke [] 0 setdash 2 copy vpt add M
  hpt neg vpt neg V hpt vpt neg V
  hpt vpt V hpt neg vpt V closepath stroke
  Pnt} def
/Pls {stroke [] 0 setdash vpt sub M 0 vpt2 V
  currentpoint stroke M
  hpt neg vpt neg R hpt2 0 V stroke
 } def
/Box {stroke [] 0 setdash 2 copy exch hpt sub exch vpt add M
  0 vpt2 neg V hpt2 0 V 0 vpt2 V
  hpt2 neg 0 V closepath stroke
  Pnt} def
/Crs {stroke [] 0 setdash exch hpt sub exch vpt add M
  hpt2 vpt2 neg V currentpoint stroke M
  hpt2 neg 0 R hpt2 vpt2 V stroke} def
/TriU {stroke [] 0 setdash 2 copy vpt 1.12 mul add M
  hpt neg vpt -1.62 mul V
  hpt 2 mul 0 V
  hpt neg vpt 1.62 mul V closepath stroke
  Pnt} def
/Star {2 copy Pls Crs} def
/BoxF {stroke [] 0 setdash exch hpt sub exch vpt add M
  0 vpt2 neg V hpt2 0 V 0 vpt2 V
  hpt2 neg 0 V closepath fill} def
/TriUF {stroke [] 0 setdash vpt 1.12 mul add M
  hpt neg vpt -1.62 mul V
  hpt 2 mul 0 V
  hpt neg vpt 1.62 mul V closepath fill} def
/TriD {stroke [] 0 setdash 2 copy vpt 1.12 mul sub M
  hpt neg vpt 1.62 mul V
  hpt 2 mul 0 V
  hpt neg vpt -1.62 mul V closepath stroke
  Pnt} def
/TriDF {stroke [] 0 setdash vpt 1.12 mul sub M
  hpt neg vpt 1.62 mul V
  hpt 2 mul 0 V
  hpt neg vpt -1.62 mul V closepath fill} def
/DiaF {stroke [] 0 setdash vpt add M
  hpt neg vpt neg V hpt vpt neg V
  hpt vpt V hpt neg vpt V closepath fill} def
/Pent {stroke [] 0 setdash 2 copy gsave
  translate 0 hpt M 4 {72 rotate 0 hpt L} repeat
  closepath stroke grestore Pnt} def
/PentF {stroke [] 0 setdash gsave
  translate 0 hpt M 4 {72 rotate 0 hpt L} repeat
  closepath fill grestore} def
/Circle {stroke [] 0 setdash 2 copy
  hpt 0 360 arc stroke Pnt} def
/CircleF {stroke [] 0 setdash hpt 0 360 arc fill} def
/C0 {BL [] 0 setdash 2 copy moveto vpt 90 450 arc} bind def
/C1 {BL [] 0 setdash 2 copy moveto
	2 copy vpt 0 90 arc closepath fill
	vpt 0 360 arc closepath} bind def
/C2 {BL [] 0 setdash 2 copy moveto
	2 copy vpt 90 180 arc closepath fill
	vpt 0 360 arc closepath} bind def
/C3 {BL [] 0 setdash 2 copy moveto
	2 copy vpt 0 180 arc closepath fill
	vpt 0 360 arc closepath} bind def
/C4 {BL [] 0 setdash 2 copy moveto
	2 copy vpt 180 270 arc closepath fill
	vpt 0 360 arc closepath} bind def
/C5 {BL [] 0 setdash 2 copy moveto
	2 copy vpt 0 90 arc
	2 copy moveto
	2 copy vpt 180 270 arc closepath fill
	vpt 0 360 arc} bind def
/C6 {BL [] 0 setdash 2 copy moveto
	2 copy vpt 90 270 arc closepath fill
	vpt 0 360 arc closepath} bind def
/C7 {BL [] 0 setdash 2 copy moveto
	2 copy vpt 0 270 arc closepath fill
	vpt 0 360 arc closepath} bind def
/C8 {BL [] 0 setdash 2 copy moveto
	2 copy vpt 270 360 arc closepath fill
	vpt 0 360 arc closepath} bind def
/C9 {BL [] 0 setdash 2 copy moveto
	2 copy vpt 270 450 arc closepath fill
	vpt 0 360 arc closepath} bind def
/C10 {BL [] 0 setdash 2 copy 2 copy moveto vpt 270 360 arc closepath fill
	2 copy moveto
	2 copy vpt 90 180 arc closepath fill
	vpt 0 360 arc closepath} bind def
/C11 {BL [] 0 setdash 2 copy moveto
	2 copy vpt 0 180 arc closepath fill
	2 copy moveto
	2 copy vpt 270 360 arc closepath fill
	vpt 0 360 arc closepath} bind def
/C12 {BL [] 0 setdash 2 copy moveto
	2 copy vpt 180 360 arc closepath fill
	vpt 0 360 arc closepath} bind def
/C13 {BL [] 0 setdash 2 copy moveto
	2 copy vpt 0 90 arc closepath fill
	2 copy moveto
	2 copy vpt 180 360 arc closepath fill
	vpt 0 360 arc closepath} bind def
/C14 {BL [] 0 setdash 2 copy moveto
	2 copy vpt 90 360 arc closepath fill
	vpt 0 360 arc} bind def
/C15 {BL [] 0 setdash 2 copy vpt 0 360 arc closepath fill
	vpt 0 360 arc closepath} bind def
/Rec {newpath 4 2 roll moveto 1 index 0 rlineto 0 exch rlineto
	neg 0 rlineto closepath} bind def
/Square {dup Rec} bind def
/Bsquare {vpt sub exch vpt sub exch vpt2 Square} bind def
/S0 {BL [] 0 setdash 2 copy moveto 0 vpt rlineto BL Bsquare} bind def
/S1 {BL [] 0 setdash 2 copy vpt Square fill Bsquare} bind def
/S2 {BL [] 0 setdash 2 copy exch vpt sub exch vpt Square fill Bsquare} bind def
/S3 {BL [] 0 setdash 2 copy exch vpt sub exch vpt2 vpt Rec fill Bsquare} bind def
/S4 {BL [] 0 setdash 2 copy exch vpt sub exch vpt sub vpt Square fill Bsquare} bind def
/S5 {BL [] 0 setdash 2 copy 2 copy vpt Square fill
	exch vpt sub exch vpt sub vpt Square fill Bsquare} bind def
/S6 {BL [] 0 setdash 2 copy exch vpt sub exch vpt sub vpt vpt2 Rec fill Bsquare} bind def
/S7 {BL [] 0 setdash 2 copy exch vpt sub exch vpt sub vpt vpt2 Rec fill
	2 copy vpt Square fill Bsquare} bind def
/S8 {BL [] 0 setdash 2 copy vpt sub vpt Square fill Bsquare} bind def
/S9 {BL [] 0 setdash 2 copy vpt sub vpt vpt2 Rec fill Bsquare} bind def
/S10 {BL [] 0 setdash 2 copy vpt sub vpt Square fill 2 copy exch vpt sub exch vpt Square fill
	Bsquare} bind def
/S11 {BL [] 0 setdash 2 copy vpt sub vpt Square fill 2 copy exch vpt sub exch vpt2 vpt Rec fill
	Bsquare} bind def
/S12 {BL [] 0 setdash 2 copy exch vpt sub exch vpt sub vpt2 vpt Rec fill Bsquare} bind def
/S13 {BL [] 0 setdash 2 copy exch vpt sub exch vpt sub vpt2 vpt Rec fill
	2 copy vpt Square fill Bsquare} bind def
/S14 {BL [] 0 setdash 2 copy exch vpt sub exch vpt sub vpt2 vpt Rec fill
	2 copy exch vpt sub exch vpt Square fill Bsquare} bind def
/S15 {BL [] 0 setdash 2 copy Bsquare fill Bsquare} bind def
/D0 {gsave translate 45 rotate 0 0 S0 stroke grestore} bind def
/D1 {gsave translate 45 rotate 0 0 S1 stroke grestore} bind def
/D2 {gsave translate 45 rotate 0 0 S2 stroke grestore} bind def
/D3 {gsave translate 45 rotate 0 0 S3 stroke grestore} bind def
/D4 {gsave translate 45 rotate 0 0 S4 stroke grestore} bind def
/D5 {gsave translate 45 rotate 0 0 S5 stroke grestore} bind def
/D6 {gsave translate 45 rotate 0 0 S6 stroke grestore} bind def
/D7 {gsave translate 45 rotate 0 0 S7 stroke grestore} bind def
/D8 {gsave translate 45 rotate 0 0 S8 stroke grestore} bind def
/D9 {gsave translate 45 rotate 0 0 S9 stroke grestore} bind def
/D10 {gsave translate 45 rotate 0 0 S10 stroke grestore} bind def
/D11 {gsave translate 45 rotate 0 0 S11 stroke grestore} bind def
/D12 {gsave translate 45 rotate 0 0 S12 stroke grestore} bind def
/D13 {gsave translate 45 rotate 0 0 S13 stroke grestore} bind def
/D14 {gsave translate 45 rotate 0 0 S14 stroke grestore} bind def
/D15 {gsave translate 45 rotate 0 0 S15 stroke grestore} bind def
/DiaE {stroke [] 0 setdash vpt add M
  hpt neg vpt neg V hpt vpt neg V
  hpt vpt V hpt neg vpt V closepath stroke} def
/BoxE {stroke [] 0 setdash exch hpt sub exch vpt add M
  0 vpt2 neg V hpt2 0 V 0 vpt2 V
  hpt2 neg 0 V closepath stroke} def
/TriUE {stroke [] 0 setdash vpt 1.12 mul add M
  hpt neg vpt -1.62 mul V
  hpt 2 mul 0 V
  hpt neg vpt 1.62 mul V closepath stroke} def
/TriDE {stroke [] 0 setdash vpt 1.12 mul sub M
  hpt neg vpt 1.62 mul V
  hpt 2 mul 0 V
  hpt neg vpt -1.62 mul V closepath stroke} def
/PentE {stroke [] 0 setdash gsave
  translate 0 hpt M 4 {72 rotate 0 hpt L} repeat
  closepath stroke grestore} def
/CircE {stroke [] 0 setdash 
  hpt 0 360 arc stroke} def
/Opaque {gsave closepath 1 setgray fill grestore 0 setgray closepath} def
/DiaW {stroke [] 0 setdash vpt add M
  hpt neg vpt neg V hpt vpt neg V
  hpt vpt V hpt neg vpt V Opaque stroke} def
/BoxW {stroke [] 0 setdash exch hpt sub exch vpt add M
  0 vpt2 neg V hpt2 0 V 0 vpt2 V
  hpt2 neg 0 V Opaque stroke} def
/TriUW {stroke [] 0 setdash vpt 1.12 mul add M
  hpt neg vpt -1.62 mul V
  hpt 2 mul 0 V
  hpt neg vpt 1.62 mul V Opaque stroke} def
/TriDW {stroke [] 0 setdash vpt 1.12 mul sub M
  hpt neg vpt 1.62 mul V
  hpt 2 mul 0 V
  hpt neg vpt -1.62 mul V Opaque stroke} def
/PentW {stroke [] 0 setdash gsave
  translate 0 hpt M 4 {72 rotate 0 hpt L} repeat
  Opaque stroke grestore} def
/CircW {stroke [] 0 setdash 
  hpt 0 360 arc Opaque stroke} def
/BoxFill {gsave Rec 1 setgray fill grestore} def
/Density {
  /Fillden exch def
  currentrgbcolor
  /ColB exch def /ColG exch def /ColR exch def
  /ColR ColR Fillden mul Fillden sub 1 add def
  /ColG ColG Fillden mul Fillden sub 1 add def
  /ColB ColB Fillden mul Fillden sub 1 add def
  ColR ColG ColB setrgbcolor} def
/BoxColFill {gsave Rec PolyFill} def
/PolyFill {gsave Density fill grestore grestore} def
/h {rlineto rlineto rlineto gsave closepath fill grestore} bind def
%
% PostScript Level 1 Pattern Fill routine for rectangles
% Usage: x y w h s a XX PatternFill
%	x,y = lower left corner of box to be filled
%	w,h = width and height of box
%	  a = angle in degrees between lines and x-axis
%	 XX = 0/1 for no/yes cross-hatch
%
/PatternFill {gsave /PFa [ 9 2 roll ] def
  PFa 0 get PFa 2 get 2 div add PFa 1 get PFa 3 get 2 div add translate
  PFa 2 get -2 div PFa 3 get -2 div PFa 2 get PFa 3 get Rec
  TransparentPatterns {} {gsave 1 setgray fill grestore} ifelse
  clip
  currentlinewidth 0.5 mul setlinewidth
  /PFs PFa 2 get dup mul PFa 3 get dup mul add sqrt def
  0 0 M PFa 5 get rotate PFs -2 div dup translate
  0 1 PFs PFa 4 get div 1 add floor cvi
	{PFa 4 get mul 0 M 0 PFs V} for
  0 PFa 6 get ne {
	0 1 PFs PFa 4 get div 1 add floor cvi
	{PFa 4 get mul 0 2 1 roll M PFs 0 V} for
 } if
  stroke grestore} def
%
/languagelevel where
 {pop languagelevel} {1} ifelse
 2 lt
	{/InterpretLevel1 true def}
	{/InterpretLevel1 Level1 def}
 ifelse
%
% PostScript level 2 pattern fill definitions
%
/Level2PatternFill {
/Tile8x8 {/PaintType 2 /PatternType 1 /TilingType 1 /BBox [0 0 8 8] /XStep 8 /YStep 8}
	bind def
/KeepColor {currentrgbcolor [/Pattern /DeviceRGB] setcolorspace} bind def
<< Tile8x8
 /PaintProc {0.5 setlinewidth pop 0 0 M 8 8 L 0 8 M 8 0 L stroke} 
>> matrix makepattern
/Pat1 exch def
<< Tile8x8
 /PaintProc {0.5 setlinewidth pop 0 0 M 8 8 L 0 8 M 8 0 L stroke
	0 4 M 4 8 L 8 4 L 4 0 L 0 4 L stroke}
>> matrix makepattern
/Pat2 exch def
<< Tile8x8
 /PaintProc {0.5 setlinewidth pop 0 0 M 0 8 L
	8 8 L 8 0 L 0 0 L fill}
>> matrix makepattern
/Pat3 exch def
<< Tile8x8
 /PaintProc {0.5 setlinewidth pop -4 8 M 8 -4 L
	0 12 M 12 0 L stroke}
>> matrix makepattern
/Pat4 exch def
<< Tile8x8
 /PaintProc {0.5 setlinewidth pop -4 0 M 8 12 L
	0 -4 M 12 8 L stroke}
>> matrix makepattern
/Pat5 exch def
<< Tile8x8
 /PaintProc {0.5 setlinewidth pop -2 8 M 4 -4 L
	0 12 M 8 -4 L 4 12 M 10 0 L stroke}
>> matrix makepattern
/Pat6 exch def
<< Tile8x8
 /PaintProc {0.5 setlinewidth pop -2 0 M 4 12 L
	0 -4 M 8 12 L 4 -4 M 10 8 L stroke}
>> matrix makepattern
/Pat7 exch def
<< Tile8x8
 /PaintProc {0.5 setlinewidth pop 8 -2 M -4 4 L
	12 0 M -4 8 L 12 4 M 0 10 L stroke}
>> matrix makepattern
/Pat8 exch def
<< Tile8x8
 /PaintProc {0.5 setlinewidth pop 0 -2 M 12 4 L
	-4 0 M 12 8 L -4 4 M 8 10 L stroke}
>> matrix makepattern
/Pat9 exch def
/Pattern1 {PatternBgnd KeepColor Pat1 setpattern} bind def
/Pattern2 {PatternBgnd KeepColor Pat2 setpattern} bind def
/Pattern3 {PatternBgnd KeepColor Pat3 setpattern} bind def
/Pattern4 {PatternBgnd KeepColor Landscape {Pat5} {Pat4} ifelse setpattern} bind def
/Pattern5 {PatternBgnd KeepColor Landscape {Pat4} {Pat5} ifelse setpattern} bind def
/Pattern6 {PatternBgnd KeepColor Landscape {Pat9} {Pat6} ifelse setpattern} bind def
/Pattern7 {PatternBgnd KeepColor Landscape {Pat8} {Pat7} ifelse setpattern} bind def
} def
%
%
%End of PostScript Level 2 code
%
/PatternBgnd {
  TransparentPatterns {} {gsave 1 setgray fill grestore} ifelse
} def
%
% Substitute for Level 2 pattern fill codes with
% grayscale if Level 2 support is not selected.
%
/Level1PatternFill {
/Pattern1 {0.250 Density} bind def
/Pattern2 {0.500 Density} bind def
/Pattern3 {0.750 Density} bind def
/Pattern4 {0.125 Density} bind def
/Pattern5 {0.375 Density} bind def
/Pattern6 {0.625 Density} bind def
/Pattern7 {0.875 Density} bind def
} def
%
% Now test for support of Level 2 code
%
Level1 {Level1PatternFill} {Level2PatternFill} ifelse
%
/Symbol-Oblique /Symbol findfont [1 0 .167 1 0 0] makefont
dup length dict begin {1 index /FID eq {pop pop} {def} ifelse} forall
currentdict end definefont pop
Level1 SuppressPDFMark or 
{} {
/SDict 10 dict def
systemdict /pdfmark known not {
  userdict /pdfmark systemdict /cleartomark get put
} if
SDict begin [
  /Title (doppelloch.tex)
  /Subject (gnuplot plot)
  /Creator (gnuplot 4.6 patchlevel 5)
  /Author (kevin.luedemann)
%  /Producer (gnuplot)
%  /Keywords ()
  /CreationDate (Tue Mar 17 17:16:13 2015)
  /DOCINFO pdfmark
end
} ifelse
end
%%EndProlog
%%Page: 1 1
gnudict begin
gsave
doclip
50 50 translate
0.050 0.050 scale
0 setgray
newpath
1.000 UL
LTb
LCb setrgbcolor
1342 704 M
63 0 V
5398 0 R
-63 0 V
stroke
LTb
1342 1074 M
63 0 V
5398 0 R
-63 0 V
1342 1444 M
63 0 V
5398 0 R
-63 0 V
1342 1814 M
63 0 V
5398 0 R
-63 0 V
1342 2184 M
63 0 V
5398 0 R
-63 0 V
1342 2554 M
63 0 V
5398 0 R
-63 0 V
1342 2925 M
63 0 V
5398 0 R
-63 0 V
1342 3295 M
63 0 V
5398 0 R
-63 0 V
1342 3665 M
63 0 V
5398 0 R
-63 0 V
1342 4035 M
63 0 V
5398 0 R
-63 0 V
1342 4405 M
63 0 V
5398 0 R
-63 0 V
1342 4775 M
63 0 V
5398 0 R
-63 0 V
1342 704 M
0 63 V
0 4008 R
0 -63 V
2252 704 M
0 63 V
0 4008 R
0 -63 V
3162 704 M
0 63 V
0 4008 R
0 -63 V
4073 704 M
0 63 V
0 4008 R
0 -63 V
4983 704 M
0 63 V
0 4008 R
0 -63 V
5893 704 M
0 63 V
0 4008 R
0 -63 V
6803 704 M
0 63 V
0 4008 R
0 -63 V
stroke
1342 4775 N
0 -4071 V
5461 0 V
0 4071 V
-5461 0 V
Z stroke
1.000 UP
1.000 UL
LTb
1.000 UP
1.000 UL
LT0
LC0 setrgbcolor
LCb setrgbcolor
LT0
LC0 setrgbcolor
1824 1082 Pls
1836 1079 Pls
1847 1086 Pls
1859 1082 Pls
1870 1079 Pls
1881 1090 Pls
1893 1082 Pls
1904 1082 Pls
1915 1079 Pls
1927 1079 Pls
1938 1082 Pls
1950 1082 Pls
1961 1075 Pls
1972 1082 Pls
1984 1086 Pls
1995 1082 Pls
2006 1079 Pls
2018 1082 Pls
2029 1086 Pls
2041 1086 Pls
2052 1090 Pls
2063 1090 Pls
2075 1090 Pls
2086 1094 Pls
2097 1086 Pls
2109 1086 Pls
2120 1094 Pls
2132 1086 Pls
2143 1086 Pls
2154 1086 Pls
2166 1086 Pls
2177 1082 Pls
2188 1094 Pls
2200 1079 Pls
2211 1079 Pls
2223 1090 Pls
2234 1086 Pls
2245 1086 Pls
2257 1090 Pls
2268 1090 Pls
2279 1086 Pls
2291 1086 Pls
2302 1086 Pls
2314 1086 Pls
2325 1094 Pls
2336 1090 Pls
2348 1094 Pls
2359 1090 Pls
2370 1098 Pls
2382 1098 Pls
2393 1094 Pls
2405 1094 Pls
2416 1101 Pls
2427 1090 Pls
2439 1094 Pls
2450 1094 Pls
2462 1098 Pls
2473 1086 Pls
2484 1086 Pls
2496 1086 Pls
2507 1086 Pls
2518 1090 Pls
2530 1090 Pls
2541 1090 Pls
2553 1090 Pls
2564 1098 Pls
2575 1086 Pls
2587 1090 Pls
2598 1090 Pls
2609 1094 Pls
2621 1090 Pls
2632 1094 Pls
2644 1086 Pls
2655 1094 Pls
2666 1082 Pls
2678 1086 Pls
2689 1090 Pls
2700 1086 Pls
2712 1086 Pls
2723 1086 Pls
2735 1086 Pls
2746 1090 Pls
2757 1086 Pls
2769 1094 Pls
2780 1094 Pls
2791 1094 Pls
2803 1094 Pls
2814 1086 Pls
2826 1086 Pls
2837 1090 Pls
2848 1094 Pls
2860 1094 Pls
2871 1082 Pls
2882 1094 Pls
2894 1101 Pls
2905 1098 Pls
2917 1094 Pls
2928 1094 Pls
2939 1098 Pls
2951 1098 Pls
2962 1094 Pls
2973 1094 Pls
2985 1094 Pls
2996 1094 Pls
3008 1098 Pls
3019 1094 Pls
3030 1086 Pls
3042 1082 Pls
3053 1082 Pls
3064 1090 Pls
3076 1090 Pls
3087 1082 Pls
3099 1079 Pls
3110 1086 Pls
3121 1082 Pls
3133 1082 Pls
3144 1071 Pls
3156 1082 Pls
3167 1090 Pls
3178 1101 Pls
3190 1086 Pls
3201 1090 Pls
3212 1090 Pls
3224 1094 Pls
3235 1101 Pls
3247 1098 Pls
3258 1101 Pls
3269 1098 Pls
3281 1109 Pls
3292 1101 Pls
3303 1109 Pls
3315 1105 Pls
3326 1109 Pls
3338 1113 Pls
3349 1098 Pls
3360 1116 Pls
3372 1116 Pls
3383 1124 Pls
3394 1124 Pls
3406 1124 Pls
3417 1128 Pls
3429 1124 Pls
3440 1124 Pls
3451 1128 Pls
3463 1113 Pls
3474 1116 Pls
3485 1120 Pls
3497 1116 Pls
3508 1116 Pls
3520 1116 Pls
3531 1113 Pls
3542 1116 Pls
3554 1113 Pls
3565 1120 Pls
3576 1124 Pls
3588 1135 Pls
3599 1135 Pls
3611 1135 Pls
3622 1135 Pls
3633 1135 Pls
3645 1132 Pls
3656 1135 Pls
3667 1124 Pls
3679 1132 Pls
3690 1116 Pls
3702 1116 Pls
3713 1116 Pls
3724 1109 Pls
3736 1109 Pls
3747 1101 Pls
3758 1105 Pls
3770 1101 Pls
3781 1113 Pls
3793 1105 Pls
3804 1109 Pls
3815 1105 Pls
3827 1116 Pls
3838 1105 Pls
3850 1116 Pls
3861 1124 Pls
3872 1116 Pls
3884 1128 Pls
3895 1132 Pls
3906 1139 Pls
3918 1135 Pls
3929 1169 Pls
3941 1196 Pls
3952 1218 Pls
3963 1241 Pls
3975 1264 Pls
3986 1290 Pls
3997 1309 Pls
4009 1328 Pls
4020 1350 Pls
4032 1369 Pls
4043 1388 Pls
4054 1414 Pls
4066 1445 Pls
4077 1479 Pls
4088 1516 Pls
4100 1565 Pls
4111 1633 Pls
4123 1686 Pls
4134 1761 Pls
4145 1841 Pls
4157 1924 Pls
4168 1984 Pls
4179 2029 Pls
4191 2067 Pls
4202 2075 Pls
4214 2090 Pls
4225 2090 Pls
4236 2082 Pls
4248 2063 Pls
4259 2086 Pls
4270 2097 Pls
4282 2097 Pls
4293 2154 Pls
4305 2207 Pls
4316 2339 Pls
4327 2459 Pls
4339 2663 Pls
4350 2859 Pls
4361 3070 Pls
4373 3289 Pls
4384 3414 Pls
4396 3538 Pls
4407 3640 Pls
4418 3693 Pls
4430 3700 Pls
4441 3715 Pls
4452 3610 Pls
4464 3531 Pls
4475 3368 Pls
4487 3187 Pls
4498 3029 Pls
4509 2855 Pls
4521 2723 Pls
4532 2644 Pls
4544 2648 Pls
4555 2723 Pls
4566 2810 Pls
4578 2999 Pls
4589 3244 Pls
4600 3485 Pls
4612 3738 Pls
4623 3968 Pls
4635 4187 Pls
4646 4398 Pls
4657 4493 Pls
4669 4549 Pls
4680 4572 Pls
4691 4451 Pls
4703 4232 Pls
4714 3976 Pls
4726 3648 Pls
4737 3342 Pls
4748 3014 Pls
4760 2735 Pls
4771 2497 Pls
4782 2331 Pls
4794 2214 Pls
4805 2161 Pls
4817 2195 Pls
4828 2278 Pls
4839 2391 Pls
4851 2580 Pls
4862 2723 Pls
4873 2942 Pls
4885 3161 Pls
4896 3297 Pls
4908 3353 Pls
4919 3361 Pls
4930 3289 Pls
4942 3191 Pls
4953 3036 Pls
4964 2840 Pls
4976 2629 Pls
4987 2422 Pls
4999 2214 Pls
5010 2010 Pls
5021 1829 Pls
5033 1660 Pls
5044 1524 Pls
5055 1441 Pls
5067 1407 Pls
5078 1418 Pls
5090 1448 Pls
5101 1494 Pls
5112 1550 Pls
5124 1603 Pls
5135 1641 Pls
5146 1667 Pls
5158 1679 Pls
5169 1652 Pls
5181 1663 Pls
5192 1618 Pls
5203 1577 Pls
5215 1513 Pls
5226 1433 Pls
5238 1358 Pls
5249 1298 Pls
5260 1237 Pls
5272 1192 Pls
5283 1158 Pls
5294 1147 Pls
5306 1132 Pls
5317 1116 Pls
5329 1128 Pls
5340 1120 Pls
5351 1116 Pls
5363 1116 Pls
5374 1120 Pls
5385 1109 Pls
5397 1105 Pls
5408 1113 Pls
5420 1101 Pls
5431 1094 Pls
5442 1094 Pls
5454 1098 Pls
5465 1086 Pls
5476 1098 Pls
5488 1101 Pls
5499 1109 Pls
5511 1113 Pls
5522 1113 Pls
5533 1116 Pls
5545 1124 Pls
5556 1113 Pls
5567 1116 Pls
5579 1116 Pls
5590 1116 Pls
5602 1116 Pls
5613 1124 Pls
5624 1116 Pls
5636 1120 Pls
5647 1128 Pls
5658 1132 Pls
5670 1128 Pls
5681 1135 Pls
5693 1124 Pls
5704 1135 Pls
5715 1132 Pls
5727 1132 Pls
5738 1143 Pls
5749 1128 Pls
5761 1132 Pls
5772 1124 Pls
5784 1113 Pls
5795 1113 Pls
5806 1109 Pls
5818 1101 Pls
5829 1105 Pls
5840 1098 Pls
5852 1094 Pls
5863 1101 Pls
5875 1105 Pls
5886 1105 Pls
5897 1101 Pls
5909 1105 Pls
5920 1113 Pls
5932 1109 Pls
5943 1105 Pls
5954 1105 Pls
5966 1105 Pls
5977 1105 Pls
5988 1098 Pls
6000 1094 Pls
6011 1090 Pls
6023 1090 Pls
6034 1086 Pls
6045 1086 Pls
6057 1086 Pls
6068 1090 Pls
6079 1101 Pls
6091 1101 Pls
6102 1094 Pls
6114 1098 Pls
6125 1101 Pls
6136 1101 Pls
6148 1090 Pls
6159 1101 Pls
6170 1094 Pls
6182 1094 Pls
6193 1094 Pls
6205 1094 Pls
6216 1094 Pls
6227 1094 Pls
6239 1098 Pls
6250 1098 Pls
6261 1101 Pls
6273 1094 Pls
6284 1094 Pls
6296 1094 Pls
6307 1090 Pls
6318 1098 Pls
6330 1090 Pls
6341 1094 Pls
6352 1086 Pls
6364 1094 Pls
6375 1082 Pls
6387 1086 Pls
6398 1094 Pls
6409 1090 Pls
6421 1094 Pls
6432 1098 Pls
6443 1094 Pls
6455 1098 Pls
6466 1098 Pls
6478 1101 Pls
6489 1098 Pls
6500 1101 Pls
6512 1094 Pls
6523 1101 Pls
6535 1090 Pls
6546 1094 Pls
6557 1090 Pls
6569 1094 Pls
6580 1098 Pls
6243 4602 Pls
1.000 UL
LTb
LCb setrgbcolor
1342 4775 N
0 -4071 V
5461 0 V
0 4071 V
-5461 0 V
Z stroke
1.000 UP
1.000 UL
LTb
stroke
grestore
end
showpage
%%Trailer
