%!PS-Adobe-2.0 EPSF-2.0
%%Title: steg.tex
%%Creator: gnuplot 4.6 patchlevel 5
%%CreationDate: Tue Mar 17 17:16:15 2015
%%DocumentFonts: 
%%BoundingBox: 50 50 410 302
%%EndComments
%%BeginProlog
/gnudict 256 dict def
gnudict begin
%
% The following true/false flags may be edited by hand if desired.
% The unit line width and grayscale image gamma correction may also be changed.
%
/Color true def
/Blacktext true def
/Solid false def
/Dashlength 1 def
/Landscape false def
/Level1 false def
/Rounded false def
/ClipToBoundingBox false def
/SuppressPDFMark false def
/TransparentPatterns false def
/gnulinewidth 5.000 def
/userlinewidth gnulinewidth def
/Gamma 1.0 def
/BackgroundColor {-1.000 -1.000 -1.000} def
%
/vshift -73 def
/dl1 {
  10.0 Dashlength mul mul
  Rounded { currentlinewidth 0.75 mul sub dup 0 le { pop 0.01 } if } if
} def
/dl2 {
  10.0 Dashlength mul mul
  Rounded { currentlinewidth 0.75 mul add } if
} def
/hpt_ 31.5 def
/vpt_ 31.5 def
/hpt hpt_ def
/vpt vpt_ def
/doclip {
  ClipToBoundingBox {
    newpath 50 50 moveto 410 50 lineto 410 302 lineto 50 302 lineto closepath
    clip
  } if
} def
%
% Gnuplot Prolog Version 4.6 (September 2012)
%
%/SuppressPDFMark true def
%
/M {moveto} bind def
/L {lineto} bind def
/R {rmoveto} bind def
/V {rlineto} bind def
/N {newpath moveto} bind def
/Z {closepath} bind def
/C {setrgbcolor} bind def
/f {rlineto fill} bind def
/g {setgray} bind def
/Gshow {show} def   % May be redefined later in the file to support UTF-8
/vpt2 vpt 2 mul def
/hpt2 hpt 2 mul def
/Lshow {currentpoint stroke M 0 vshift R 
	Blacktext {gsave 0 setgray show grestore} {show} ifelse} def
/Rshow {currentpoint stroke M dup stringwidth pop neg vshift R
	Blacktext {gsave 0 setgray show grestore} {show} ifelse} def
/Cshow {currentpoint stroke M dup stringwidth pop -2 div vshift R 
	Blacktext {gsave 0 setgray show grestore} {show} ifelse} def
/UP {dup vpt_ mul /vpt exch def hpt_ mul /hpt exch def
  /hpt2 hpt 2 mul def /vpt2 vpt 2 mul def} def
/DL {Color {setrgbcolor Solid {pop []} if 0 setdash}
 {pop pop pop 0 setgray Solid {pop []} if 0 setdash} ifelse} def
/BL {stroke userlinewidth 2 mul setlinewidth
	Rounded {1 setlinejoin 1 setlinecap} if} def
/AL {stroke userlinewidth 2 div setlinewidth
	Rounded {1 setlinejoin 1 setlinecap} if} def
/UL {dup gnulinewidth mul /userlinewidth exch def
	dup 1 lt {pop 1} if 10 mul /udl exch def} def
/PL {stroke userlinewidth setlinewidth
	Rounded {1 setlinejoin 1 setlinecap} if} def
3.8 setmiterlimit
% Default Line colors
/LCw {1 1 1} def
/LCb {0 0 0} def
/LCa {0 0 0} def
/LC0 {1 0 0} def
/LC1 {0 1 0} def
/LC2 {0 0 1} def
/LC3 {1 0 1} def
/LC4 {0 1 1} def
/LC5 {1 1 0} def
/LC6 {0 0 0} def
/LC7 {1 0.3 0} def
/LC8 {0.5 0.5 0.5} def
% Default Line Types
/LTw {PL [] 1 setgray} def
/LTb {BL [] LCb DL} def
/LTa {AL [1 udl mul 2 udl mul] 0 setdash LCa setrgbcolor} def
/LT0 {PL [] LC0 DL} def
/LT1 {PL [4 dl1 2 dl2] LC1 DL} def
/LT2 {PL [2 dl1 3 dl2] LC2 DL} def
/LT3 {PL [1 dl1 1.5 dl2] LC3 DL} def
/LT4 {PL [6 dl1 2 dl2 1 dl1 2 dl2] LC4 DL} def
/LT5 {PL [3 dl1 3 dl2 1 dl1 3 dl2] LC5 DL} def
/LT6 {PL [2 dl1 2 dl2 2 dl1 6 dl2] LC6 DL} def
/LT7 {PL [1 dl1 2 dl2 6 dl1 2 dl2 1 dl1 2 dl2] LC7 DL} def
/LT8 {PL [2 dl1 2 dl2 2 dl1 2 dl2 2 dl1 2 dl2 2 dl1 4 dl2] LC8 DL} def
/Pnt {stroke [] 0 setdash gsave 1 setlinecap M 0 0 V stroke grestore} def
/Dia {stroke [] 0 setdash 2 copy vpt add M
  hpt neg vpt neg V hpt vpt neg V
  hpt vpt V hpt neg vpt V closepath stroke
  Pnt} def
/Pls {stroke [] 0 setdash vpt sub M 0 vpt2 V
  currentpoint stroke M
  hpt neg vpt neg R hpt2 0 V stroke
 } def
/Box {stroke [] 0 setdash 2 copy exch hpt sub exch vpt add M
  0 vpt2 neg V hpt2 0 V 0 vpt2 V
  hpt2 neg 0 V closepath stroke
  Pnt} def
/Crs {stroke [] 0 setdash exch hpt sub exch vpt add M
  hpt2 vpt2 neg V currentpoint stroke M
  hpt2 neg 0 R hpt2 vpt2 V stroke} def
/TriU {stroke [] 0 setdash 2 copy vpt 1.12 mul add M
  hpt neg vpt -1.62 mul V
  hpt 2 mul 0 V
  hpt neg vpt 1.62 mul V closepath stroke
  Pnt} def
/Star {2 copy Pls Crs} def
/BoxF {stroke [] 0 setdash exch hpt sub exch vpt add M
  0 vpt2 neg V hpt2 0 V 0 vpt2 V
  hpt2 neg 0 V closepath fill} def
/TriUF {stroke [] 0 setdash vpt 1.12 mul add M
  hpt neg vpt -1.62 mul V
  hpt 2 mul 0 V
  hpt neg vpt 1.62 mul V closepath fill} def
/TriD {stroke [] 0 setdash 2 copy vpt 1.12 mul sub M
  hpt neg vpt 1.62 mul V
  hpt 2 mul 0 V
  hpt neg vpt -1.62 mul V closepath stroke
  Pnt} def
/TriDF {stroke [] 0 setdash vpt 1.12 mul sub M
  hpt neg vpt 1.62 mul V
  hpt 2 mul 0 V
  hpt neg vpt -1.62 mul V closepath fill} def
/DiaF {stroke [] 0 setdash vpt add M
  hpt neg vpt neg V hpt vpt neg V
  hpt vpt V hpt neg vpt V closepath fill} def
/Pent {stroke [] 0 setdash 2 copy gsave
  translate 0 hpt M 4 {72 rotate 0 hpt L} repeat
  closepath stroke grestore Pnt} def
/PentF {stroke [] 0 setdash gsave
  translate 0 hpt M 4 {72 rotate 0 hpt L} repeat
  closepath fill grestore} def
/Circle {stroke [] 0 setdash 2 copy
  hpt 0 360 arc stroke Pnt} def
/CircleF {stroke [] 0 setdash hpt 0 360 arc fill} def
/C0 {BL [] 0 setdash 2 copy moveto vpt 90 450 arc} bind def
/C1 {BL [] 0 setdash 2 copy moveto
	2 copy vpt 0 90 arc closepath fill
	vpt 0 360 arc closepath} bind def
/C2 {BL [] 0 setdash 2 copy moveto
	2 copy vpt 90 180 arc closepath fill
	vpt 0 360 arc closepath} bind def
/C3 {BL [] 0 setdash 2 copy moveto
	2 copy vpt 0 180 arc closepath fill
	vpt 0 360 arc closepath} bind def
/C4 {BL [] 0 setdash 2 copy moveto
	2 copy vpt 180 270 arc closepath fill
	vpt 0 360 arc closepath} bind def
/C5 {BL [] 0 setdash 2 copy moveto
	2 copy vpt 0 90 arc
	2 copy moveto
	2 copy vpt 180 270 arc closepath fill
	vpt 0 360 arc} bind def
/C6 {BL [] 0 setdash 2 copy moveto
	2 copy vpt 90 270 arc closepath fill
	vpt 0 360 arc closepath} bind def
/C7 {BL [] 0 setdash 2 copy moveto
	2 copy vpt 0 270 arc closepath fill
	vpt 0 360 arc closepath} bind def
/C8 {BL [] 0 setdash 2 copy moveto
	2 copy vpt 270 360 arc closepath fill
	vpt 0 360 arc closepath} bind def
/C9 {BL [] 0 setdash 2 copy moveto
	2 copy vpt 270 450 arc closepath fill
	vpt 0 360 arc closepath} bind def
/C10 {BL [] 0 setdash 2 copy 2 copy moveto vpt 270 360 arc closepath fill
	2 copy moveto
	2 copy vpt 90 180 arc closepath fill
	vpt 0 360 arc closepath} bind def
/C11 {BL [] 0 setdash 2 copy moveto
	2 copy vpt 0 180 arc closepath fill
	2 copy moveto
	2 copy vpt 270 360 arc closepath fill
	vpt 0 360 arc closepath} bind def
/C12 {BL [] 0 setdash 2 copy moveto
	2 copy vpt 180 360 arc closepath fill
	vpt 0 360 arc closepath} bind def
/C13 {BL [] 0 setdash 2 copy moveto
	2 copy vpt 0 90 arc closepath fill
	2 copy moveto
	2 copy vpt 180 360 arc closepath fill
	vpt 0 360 arc closepath} bind def
/C14 {BL [] 0 setdash 2 copy moveto
	2 copy vpt 90 360 arc closepath fill
	vpt 0 360 arc} bind def
/C15 {BL [] 0 setdash 2 copy vpt 0 360 arc closepath fill
	vpt 0 360 arc closepath} bind def
/Rec {newpath 4 2 roll moveto 1 index 0 rlineto 0 exch rlineto
	neg 0 rlineto closepath} bind def
/Square {dup Rec} bind def
/Bsquare {vpt sub exch vpt sub exch vpt2 Square} bind def
/S0 {BL [] 0 setdash 2 copy moveto 0 vpt rlineto BL Bsquare} bind def
/S1 {BL [] 0 setdash 2 copy vpt Square fill Bsquare} bind def
/S2 {BL [] 0 setdash 2 copy exch vpt sub exch vpt Square fill Bsquare} bind def
/S3 {BL [] 0 setdash 2 copy exch vpt sub exch vpt2 vpt Rec fill Bsquare} bind def
/S4 {BL [] 0 setdash 2 copy exch vpt sub exch vpt sub vpt Square fill Bsquare} bind def
/S5 {BL [] 0 setdash 2 copy 2 copy vpt Square fill
	exch vpt sub exch vpt sub vpt Square fill Bsquare} bind def
/S6 {BL [] 0 setdash 2 copy exch vpt sub exch vpt sub vpt vpt2 Rec fill Bsquare} bind def
/S7 {BL [] 0 setdash 2 copy exch vpt sub exch vpt sub vpt vpt2 Rec fill
	2 copy vpt Square fill Bsquare} bind def
/S8 {BL [] 0 setdash 2 copy vpt sub vpt Square fill Bsquare} bind def
/S9 {BL [] 0 setdash 2 copy vpt sub vpt vpt2 Rec fill Bsquare} bind def
/S10 {BL [] 0 setdash 2 copy vpt sub vpt Square fill 2 copy exch vpt sub exch vpt Square fill
	Bsquare} bind def
/S11 {BL [] 0 setdash 2 copy vpt sub vpt Square fill 2 copy exch vpt sub exch vpt2 vpt Rec fill
	Bsquare} bind def
/S12 {BL [] 0 setdash 2 copy exch vpt sub exch vpt sub vpt2 vpt Rec fill Bsquare} bind def
/S13 {BL [] 0 setdash 2 copy exch vpt sub exch vpt sub vpt2 vpt Rec fill
	2 copy vpt Square fill Bsquare} bind def
/S14 {BL [] 0 setdash 2 copy exch vpt sub exch vpt sub vpt2 vpt Rec fill
	2 copy exch vpt sub exch vpt Square fill Bsquare} bind def
/S15 {BL [] 0 setdash 2 copy Bsquare fill Bsquare} bind def
/D0 {gsave translate 45 rotate 0 0 S0 stroke grestore} bind def
/D1 {gsave translate 45 rotate 0 0 S1 stroke grestore} bind def
/D2 {gsave translate 45 rotate 0 0 S2 stroke grestore} bind def
/D3 {gsave translate 45 rotate 0 0 S3 stroke grestore} bind def
/D4 {gsave translate 45 rotate 0 0 S4 stroke grestore} bind def
/D5 {gsave translate 45 rotate 0 0 S5 stroke grestore} bind def
/D6 {gsave translate 45 rotate 0 0 S6 stroke grestore} bind def
/D7 {gsave translate 45 rotate 0 0 S7 stroke grestore} bind def
/D8 {gsave translate 45 rotate 0 0 S8 stroke grestore} bind def
/D9 {gsave translate 45 rotate 0 0 S9 stroke grestore} bind def
/D10 {gsave translate 45 rotate 0 0 S10 stroke grestore} bind def
/D11 {gsave translate 45 rotate 0 0 S11 stroke grestore} bind def
/D12 {gsave translate 45 rotate 0 0 S12 stroke grestore} bind def
/D13 {gsave translate 45 rotate 0 0 S13 stroke grestore} bind def
/D14 {gsave translate 45 rotate 0 0 S14 stroke grestore} bind def
/D15 {gsave translate 45 rotate 0 0 S15 stroke grestore} bind def
/DiaE {stroke [] 0 setdash vpt add M
  hpt neg vpt neg V hpt vpt neg V
  hpt vpt V hpt neg vpt V closepath stroke} def
/BoxE {stroke [] 0 setdash exch hpt sub exch vpt add M
  0 vpt2 neg V hpt2 0 V 0 vpt2 V
  hpt2 neg 0 V closepath stroke} def
/TriUE {stroke [] 0 setdash vpt 1.12 mul add M
  hpt neg vpt -1.62 mul V
  hpt 2 mul 0 V
  hpt neg vpt 1.62 mul V closepath stroke} def
/TriDE {stroke [] 0 setdash vpt 1.12 mul sub M
  hpt neg vpt 1.62 mul V
  hpt 2 mul 0 V
  hpt neg vpt -1.62 mul V closepath stroke} def
/PentE {stroke [] 0 setdash gsave
  translate 0 hpt M 4 {72 rotate 0 hpt L} repeat
  closepath stroke grestore} def
/CircE {stroke [] 0 setdash 
  hpt 0 360 arc stroke} def
/Opaque {gsave closepath 1 setgray fill grestore 0 setgray closepath} def
/DiaW {stroke [] 0 setdash vpt add M
  hpt neg vpt neg V hpt vpt neg V
  hpt vpt V hpt neg vpt V Opaque stroke} def
/BoxW {stroke [] 0 setdash exch hpt sub exch vpt add M
  0 vpt2 neg V hpt2 0 V 0 vpt2 V
  hpt2 neg 0 V Opaque stroke} def
/TriUW {stroke [] 0 setdash vpt 1.12 mul add M
  hpt neg vpt -1.62 mul V
  hpt 2 mul 0 V
  hpt neg vpt 1.62 mul V Opaque stroke} def
/TriDW {stroke [] 0 setdash vpt 1.12 mul sub M
  hpt neg vpt 1.62 mul V
  hpt 2 mul 0 V
  hpt neg vpt -1.62 mul V Opaque stroke} def
/PentW {stroke [] 0 setdash gsave
  translate 0 hpt M 4 {72 rotate 0 hpt L} repeat
  Opaque stroke grestore} def
/CircW {stroke [] 0 setdash 
  hpt 0 360 arc Opaque stroke} def
/BoxFill {gsave Rec 1 setgray fill grestore} def
/Density {
  /Fillden exch def
  currentrgbcolor
  /ColB exch def /ColG exch def /ColR exch def
  /ColR ColR Fillden mul Fillden sub 1 add def
  /ColG ColG Fillden mul Fillden sub 1 add def
  /ColB ColB Fillden mul Fillden sub 1 add def
  ColR ColG ColB setrgbcolor} def
/BoxColFill {gsave Rec PolyFill} def
/PolyFill {gsave Density fill grestore grestore} def
/h {rlineto rlineto rlineto gsave closepath fill grestore} bind def
%
% PostScript Level 1 Pattern Fill routine for rectangles
% Usage: x y w h s a XX PatternFill
%	x,y = lower left corner of box to be filled
%	w,h = width and height of box
%	  a = angle in degrees between lines and x-axis
%	 XX = 0/1 for no/yes cross-hatch
%
/PatternFill {gsave /PFa [ 9 2 roll ] def
  PFa 0 get PFa 2 get 2 div add PFa 1 get PFa 3 get 2 div add translate
  PFa 2 get -2 div PFa 3 get -2 div PFa 2 get PFa 3 get Rec
  TransparentPatterns {} {gsave 1 setgray fill grestore} ifelse
  clip
  currentlinewidth 0.5 mul setlinewidth
  /PFs PFa 2 get dup mul PFa 3 get dup mul add sqrt def
  0 0 M PFa 5 get rotate PFs -2 div dup translate
  0 1 PFs PFa 4 get div 1 add floor cvi
	{PFa 4 get mul 0 M 0 PFs V} for
  0 PFa 6 get ne {
	0 1 PFs PFa 4 get div 1 add floor cvi
	{PFa 4 get mul 0 2 1 roll M PFs 0 V} for
 } if
  stroke grestore} def
%
/languagelevel where
 {pop languagelevel} {1} ifelse
 2 lt
	{/InterpretLevel1 true def}
	{/InterpretLevel1 Level1 def}
 ifelse
%
% PostScript level 2 pattern fill definitions
%
/Level2PatternFill {
/Tile8x8 {/PaintType 2 /PatternType 1 /TilingType 1 /BBox [0 0 8 8] /XStep 8 /YStep 8}
	bind def
/KeepColor {currentrgbcolor [/Pattern /DeviceRGB] setcolorspace} bind def
<< Tile8x8
 /PaintProc {0.5 setlinewidth pop 0 0 M 8 8 L 0 8 M 8 0 L stroke} 
>> matrix makepattern
/Pat1 exch def
<< Tile8x8
 /PaintProc {0.5 setlinewidth pop 0 0 M 8 8 L 0 8 M 8 0 L stroke
	0 4 M 4 8 L 8 4 L 4 0 L 0 4 L stroke}
>> matrix makepattern
/Pat2 exch def
<< Tile8x8
 /PaintProc {0.5 setlinewidth pop 0 0 M 0 8 L
	8 8 L 8 0 L 0 0 L fill}
>> matrix makepattern
/Pat3 exch def
<< Tile8x8
 /PaintProc {0.5 setlinewidth pop -4 8 M 8 -4 L
	0 12 M 12 0 L stroke}
>> matrix makepattern
/Pat4 exch def
<< Tile8x8
 /PaintProc {0.5 setlinewidth pop -4 0 M 8 12 L
	0 -4 M 12 8 L stroke}
>> matrix makepattern
/Pat5 exch def
<< Tile8x8
 /PaintProc {0.5 setlinewidth pop -2 8 M 4 -4 L
	0 12 M 8 -4 L 4 12 M 10 0 L stroke}
>> matrix makepattern
/Pat6 exch def
<< Tile8x8
 /PaintProc {0.5 setlinewidth pop -2 0 M 4 12 L
	0 -4 M 8 12 L 4 -4 M 10 8 L stroke}
>> matrix makepattern
/Pat7 exch def
<< Tile8x8
 /PaintProc {0.5 setlinewidth pop 8 -2 M -4 4 L
	12 0 M -4 8 L 12 4 M 0 10 L stroke}
>> matrix makepattern
/Pat8 exch def
<< Tile8x8
 /PaintProc {0.5 setlinewidth pop 0 -2 M 12 4 L
	-4 0 M 12 8 L -4 4 M 8 10 L stroke}
>> matrix makepattern
/Pat9 exch def
/Pattern1 {PatternBgnd KeepColor Pat1 setpattern} bind def
/Pattern2 {PatternBgnd KeepColor Pat2 setpattern} bind def
/Pattern3 {PatternBgnd KeepColor Pat3 setpattern} bind def
/Pattern4 {PatternBgnd KeepColor Landscape {Pat5} {Pat4} ifelse setpattern} bind def
/Pattern5 {PatternBgnd KeepColor Landscape {Pat4} {Pat5} ifelse setpattern} bind def
/Pattern6 {PatternBgnd KeepColor Landscape {Pat9} {Pat6} ifelse setpattern} bind def
/Pattern7 {PatternBgnd KeepColor Landscape {Pat8} {Pat7} ifelse setpattern} bind def
} def
%
%
%End of PostScript Level 2 code
%
/PatternBgnd {
  TransparentPatterns {} {gsave 1 setgray fill grestore} ifelse
} def
%
% Substitute for Level 2 pattern fill codes with
% grayscale if Level 2 support is not selected.
%
/Level1PatternFill {
/Pattern1 {0.250 Density} bind def
/Pattern2 {0.500 Density} bind def
/Pattern3 {0.750 Density} bind def
/Pattern4 {0.125 Density} bind def
/Pattern5 {0.375 Density} bind def
/Pattern6 {0.625 Density} bind def
/Pattern7 {0.875 Density} bind def
} def
%
% Now test for support of Level 2 code
%
Level1 {Level1PatternFill} {Level2PatternFill} ifelse
%
/Symbol-Oblique /Symbol findfont [1 0 .167 1 0 0] makefont
dup length dict begin {1 index /FID eq {pop pop} {def} ifelse} forall
currentdict end definefont pop
Level1 SuppressPDFMark or 
{} {
/SDict 10 dict def
systemdict /pdfmark known not {
  userdict /pdfmark systemdict /cleartomark get put
} if
SDict begin [
  /Title (steg.tex)
  /Subject (gnuplot plot)
  /Creator (gnuplot 4.6 patchlevel 5)
  /Author (kevin.luedemann)
%  /Producer (gnuplot)
%  /Keywords ()
  /CreationDate (Tue Mar 17 17:16:15 2015)
  /DOCINFO pdfmark
end
} ifelse
end
%%EndProlog
%%Page: 1 1
gnudict begin
gsave
doclip
50 50 translate
0.050 0.050 scale
0 setgray
newpath
1.000 UL
LTb
LCb setrgbcolor
1078 704 M
63 0 V
5662 0 R
-63 0 V
stroke
LTb
1078 1213 M
63 0 V
5662 0 R
-63 0 V
1078 1722 M
63 0 V
5662 0 R
-63 0 V
1078 2231 M
63 0 V
5662 0 R
-63 0 V
1078 2740 M
63 0 V
5662 0 R
-63 0 V
1078 3248 M
63 0 V
5662 0 R
-63 0 V
1078 3757 M
63 0 V
5662 0 R
-63 0 V
1078 4266 M
63 0 V
5662 0 R
-63 0 V
1078 4775 M
63 0 V
5662 0 R
-63 0 V
1078 704 M
0 63 V
0 4008 R
0 -63 V
1794 704 M
0 63 V
0 4008 R
0 -63 V
2509 704 M
0 63 V
0 4008 R
0 -63 V
3225 704 M
0 63 V
0 4008 R
0 -63 V
3941 704 M
0 63 V
0 4008 R
0 -63 V
4656 704 M
0 63 V
0 4008 R
0 -63 V
5372 704 M
0 63 V
0 4008 R
0 -63 V
6087 704 M
0 63 V
0 4008 R
0 -63 V
6803 704 M
0 63 V
0 4008 R
0 -63 V
stroke
1078 4775 N
0 -4071 V
5725 0 V
0 4071 V
-5725 0 V
Z stroke
1.000 UP
1.000 UL
LTb
1.000 UP
1.000 UL
LT0
LC0 setrgbcolor
LCb setrgbcolor
LT0
LC0 setrgbcolor
3992 726 Pls
4001 724 Pls
4010 721 Pls
4019 719 Pls
4028 717 Pls
4037 716 Pls
4046 714 Pls
4055 714 Pls
4064 713 Pls
4073 712 Pls
4082 711 Pls
4091 711 Pls
4100 710 Pls
4109 710 Pls
4118 710 Pls
4127 711 Pls
4136 712 Pls
4144 712 Pls
4153 712 Pls
4162 713 Pls
4171 714 Pls
4180 715 Pls
4189 716 Pls
4198 716 Pls
4207 717 Pls
4216 717 Pls
4225 718 Pls
4234 718 Pls
4243 719 Pls
4252 720 Pls
4261 720 Pls
4270 720 Pls
4279 720 Pls
4288 720 Pls
4297 721 Pls
4305 721 Pls
4314 721 Pls
4323 721 Pls
4332 720 Pls
4341 720 Pls
4350 720 Pls
4359 720 Pls
4368 719 Pls
4377 719 Pls
4386 718 Pls
4395 718 Pls
4404 717 Pls
4413 717 Pls
4422 716 Pls
4431 715 Pls
4440 714 Pls
4449 714 Pls
4458 713 Pls
4466 712 Pls
4475 711 Pls
4484 711 Pls
4493 710 Pls
4502 710 Pls
4511 709 Pls
4520 709 Pls
4529 708 Pls
4538 708 Pls
4547 708 Pls
4556 707 Pls
4565 707 Pls
4574 707 Pls
4583 707 Pls
4592 706 Pls
4601 706 Pls
4610 706 Pls
4619 706 Pls
4628 706 Pls
4636 706 Pls
4645 706 Pls
4654 707 Pls
4663 707 Pls
4672 707 Pls
4681 707 Pls
4690 707 Pls
4699 707 Pls
4708 708 Pls
4717 708 Pls
4726 708 Pls
4735 708 Pls
4744 709 Pls
4753 709 Pls
4762 709 Pls
4771 709 Pls
4780 709 Pls
4789 710 Pls
4797 710 Pls
4806 710 Pls
4815 710 Pls
4824 710 Pls
4833 710 Pls
4842 710 Pls
4851 710 Pls
4860 710 Pls
4869 710 Pls
4878 710 Pls
4887 710 Pls
4896 710 Pls
4905 709 Pls
4914 709 Pls
4923 709 Pls
4932 709 Pls
4941 709 Pls
4950 708 Pls
4958 708 Pls
4967 708 Pls
4976 708 Pls
4985 708 Pls
4994 707 Pls
5003 707 Pls
5012 707 Pls
5021 707 Pls
5030 706 Pls
5039 706 Pls
5048 706 Pls
5057 706 Pls
5066 706 Pls
5075 706 Pls
5084 705 Pls
5093 705 Pls
5102 705 Pls
5111 705 Pls
5119 705 Pls
5128 705 Pls
5137 705 Pls
5146 705 Pls
5155 705 Pls
5164 705 Pls
5173 705 Pls
5182 705 Pls
5191 705 Pls
5200 705 Pls
5209 706 Pls
5218 706 Pls
5227 706 Pls
5236 706 Pls
5245 706 Pls
5254 706 Pls
5263 706 Pls
5272 706 Pls
5281 706 Pls
5289 706 Pls
5298 706 Pls
5307 707 Pls
5316 707 Pls
5325 707 Pls
5334 707 Pls
5343 707 Pls
5352 707 Pls
5361 707 Pls
5370 707 Pls
5379 707 Pls
5388 707 Pls
5397 707 Pls
5406 707 Pls
5415 707 Pls
5424 707 Pls
5433 707 Pls
5442 707 Pls
5450 706 Pls
5459 706 Pls
5468 706 Pls
5477 706 Pls
5486 706 Pls
5495 706 Pls
5504 706 Pls
5513 706 Pls
5522 706 Pls
5531 706 Pls
5540 706 Pls
5549 705 Pls
5558 705 Pls
5567 705 Pls
5576 705 Pls
5585 705 Pls
5594 705 Pls
5603 705 Pls
5611 705 Pls
5620 705 Pls
5629 705 Pls
5638 705 Pls
5647 705 Pls
5656 705 Pls
5665 705 Pls
5674 705 Pls
5683 705 Pls
5692 705 Pls
5701 705 Pls
5710 705 Pls
5719 705 Pls
5728 705 Pls
5737 705 Pls
5746 705 Pls
5755 705 Pls
5764 705 Pls
5773 705 Pls
5781 705 Pls
5790 705 Pls
5799 705 Pls
5808 705 Pls
5817 706 Pls
5826 705 Pls
5835 706 Pls
5844 706 Pls
5853 706 Pls
5862 706 Pls
5871 706 Pls
5880 706 Pls
5889 706 Pls
5898 706 Pls
5907 706 Pls
5916 706 Pls
5925 706 Pls
5934 706 Pls
5942 706 Pls
5951 706 Pls
5960 706 Pls
5969 706 Pls
5978 706 Pls
5987 706 Pls
5996 705 Pls
6005 705 Pls
6014 705 Pls
6023 705 Pls
6032 705 Pls
6041 705 Pls
6050 705 Pls
6059 705 Pls
6068 705 Pls
6077 705 Pls
6086 705 Pls
6095 705 Pls
6103 705 Pls
6112 705 Pls
6121 705 Pls
6130 705 Pls
6139 705 Pls
6148 705 Pls
6157 705 Pls
6166 705 Pls
6175 705 Pls
6184 705 Pls
6193 705 Pls
6202 705 Pls
6211 705 Pls
6220 705 Pls
6229 705 Pls
6238 705 Pls
6247 705 Pls
6256 705 Pls
6264 705 Pls
6273 705 Pls
6282 705 Pls
6291 705 Pls
6243 4602 Pls
1.000 UP
1.000 UL
LT0
1148 705 Pls
1157 705 Pls
1166 705 Pls
1175 705 Pls
1184 705 Pls
1193 705 Pls
1201 705 Pls
1210 705 Pls
1219 705 Pls
1228 705 Pls
1237 706 Pls
1246 705 Pls
1255 706 Pls
1264 706 Pls
1273 705 Pls
1282 705 Pls
1291 705 Pls
1300 705 Pls
1309 705 Pls
1318 705 Pls
1327 705 Pls
1336 705 Pls
1345 705 Pls
1354 705 Pls
1362 705 Pls
1371 705 Pls
1380 705 Pls
1389 705 Pls
1398 705 Pls
1407 705 Pls
1416 705 Pls
1425 705 Pls
1434 705 Pls
1443 705 Pls
1452 705 Pls
1461 705 Pls
1470 705 Pls
1479 705 Pls
1488 705 Pls
1497 705 Pls
1506 705 Pls
1515 705 Pls
1523 705 Pls
1532 705 Pls
1541 705 Pls
1550 705 Pls
1559 705 Pls
1568 705 Pls
1577 705 Pls
1586 705 Pls
1595 705 Pls
1604 705 Pls
1613 706 Pls
1622 706 Pls
1631 706 Pls
1640 706 Pls
1649 706 Pls
1658 706 Pls
1667 706 Pls
1676 706 Pls
1684 706 Pls
1693 706 Pls
1702 706 Pls
1711 707 Pls
1720 707 Pls
1729 706 Pls
1738 707 Pls
1747 707 Pls
1756 707 Pls
1765 707 Pls
1774 707 Pls
1783 706 Pls
1792 706 Pls
1801 706 Pls
1810 706 Pls
1819 706 Pls
1828 706 Pls
1837 706 Pls
1846 706 Pls
1854 706 Pls
1863 706 Pls
1872 706 Pls
1881 706 Pls
1890 706 Pls
1899 706 Pls
1908 705 Pls
1917 705 Pls
1926 705 Pls
1935 705 Pls
1944 705 Pls
1953 705 Pls
1962 705 Pls
1971 705 Pls
1980 705 Pls
1989 705 Pls
1998 705 Pls
2007 705 Pls
2015 705 Pls
2024 705 Pls
2033 705 Pls
2042 705 Pls
2051 706 Pls
2060 706 Pls
2069 706 Pls
2078 706 Pls
2087 706 Pls
2096 706 Pls
2105 706 Pls
2114 707 Pls
2123 707 Pls
2132 707 Pls
2141 707 Pls
2150 707 Pls
2159 708 Pls
2168 708 Pls
2176 708 Pls
2185 708 Pls
2194 708 Pls
2203 708 Pls
2212 709 Pls
2221 709 Pls
2230 709 Pls
2239 709 Pls
2248 709 Pls
2257 709 Pls
2266 709 Pls
2275 709 Pls
2284 709 Pls
2293 709 Pls
2302 709 Pls
2311 709 Pls
2320 709 Pls
2329 709 Pls
2337 709 Pls
2346 709 Pls
2355 709 Pls
2364 708 Pls
2373 708 Pls
2382 708 Pls
2391 708 Pls
2400 708 Pls
2409 707 Pls
2418 707 Pls
2427 707 Pls
2436 707 Pls
2445 707 Pls
2454 707 Pls
2463 706 Pls
2472 706 Pls
2481 706 Pls
2490 706 Pls
2499 706 Pls
2507 706 Pls
2516 706 Pls
2525 706 Pls
2534 706 Pls
2543 707 Pls
2552 707 Pls
2561 707 Pls
2570 707 Pls
2579 708 Pls
2588 708 Pls
2597 709 Pls
2606 709 Pls
2615 710 Pls
2624 710 Pls
2633 710 Pls
2642 711 Pls
2651 712 Pls
2660 712 Pls
2668 712 Pls
2677 713 Pls
2686 714 Pls
2695 714 Pls
2704 715 Pls
2713 716 Pls
2722 716 Pls
2731 717 Pls
2740 717 Pls
2749 718 Pls
2758 718 Pls
2767 718 Pls
2776 718 Pls
2785 719 Pls
2794 719 Pls
2803 719 Pls
2812 719 Pls
2821 719 Pls
2829 719 Pls
2838 719 Pls
2847 719 Pls
2856 719 Pls
2865 718 Pls
2874 718 Pls
2883 717 Pls
2892 717 Pls
2901 716 Pls
2910 716 Pls
2919 716 Pls
2928 715 Pls
2937 715 Pls
2946 714 Pls
2955 713 Pls
2964 713 Pls
2973 713 Pls
2982 713 Pls
2991 713 Pls
2999 712 Pls
3008 711 Pls
3017 712 Pls
3026 712 Pls
3035 713 Pls
3044 713 Pls
3053 714 Pls
3062 715 Pls
3071 717 Pls
3080 718 Pls
3089 720 Pls
3098 721 Pls
1.000 UP
1.000 UL
LT0
3112 723 Pls
3126 733 Pls
3141 733 Pls
3155 744 Pls
3169 770 Pls
3184 791 Pls
3198 796 Pls
3212 811 Pls
3227 853 Pls
3241 905 Pls
3255 925 Pls
3270 956 Pls
3284 1117 Pls
3298 1325 Pls
3313 1511 Pls
3327 1724 Pls
3341 1957 Pls
3355 2103 Pls
3370 2092 Pls
3384 2082 Pls
3398 2269 Pls
3413 2844 Pls
3427 3695 Pls
3441 4364 Pls
3456 4597 Pls
3470 4499 Pls
3484 4255 Pls
3499 4037 Pls
3513 3923 Pls
3527 3902 Pls
3542 3965 Pls
3556 4037 Pls
3570 4006 Pls
3584 3767 Pls
3599 3394 Pls
3613 2948 Pls
3627 2455 Pls
3642 2066 Pls
3656 1838 Pls
3670 1719 Pls
3685 1750 Pls
3699 1833 Pls
3713 1859 Pls
3728 1714 Pls
3742 1444 Pls
3756 1169 Pls
3771 941 Pls
3785 863 Pls
3799 894 Pls
3813 936 Pls
3828 920 Pls
3842 848 Pls
3856 811 Pls
3871 816 Pls
3885 801 Pls
3899 775 Pls
3914 765 Pls
3928 765 Pls
3942 754 Pls
3957 749 Pls
3971 733 Pls
3985 728 Pls
4000 723 Pls
1.000 UL
LTb
LCb setrgbcolor
1078 4775 N
0 -4071 V
5725 0 V
0 4071 V
-5725 0 V
Z stroke
1.000 UP
1.000 UL
LTb
stroke
grestore
end
showpage
%%Trailer
