%!PS-Adobe-2.0 EPSF-2.0
%%Title: spalt.tex
%%Creator: gnuplot 4.6 patchlevel 5
%%CreationDate: Tue Mar 17 17:16:14 2015
%%DocumentFonts: 
%%BoundingBox: 50 50 410 302
%%EndComments
%%BeginProlog
/gnudict 256 dict def
gnudict begin
%
% The following true/false flags may be edited by hand if desired.
% The unit line width and grayscale image gamma correction may also be changed.
%
/Color true def
/Blacktext true def
/Solid false def
/Dashlength 1 def
/Landscape false def
/Level1 false def
/Rounded false def
/ClipToBoundingBox false def
/SuppressPDFMark false def
/TransparentPatterns false def
/gnulinewidth 5.000 def
/userlinewidth gnulinewidth def
/Gamma 1.0 def
/BackgroundColor {-1.000 -1.000 -1.000} def
%
/vshift -73 def
/dl1 {
  10.0 Dashlength mul mul
  Rounded { currentlinewidth 0.75 mul sub dup 0 le { pop 0.01 } if } if
} def
/dl2 {
  10.0 Dashlength mul mul
  Rounded { currentlinewidth 0.75 mul add } if
} def
/hpt_ 31.5 def
/vpt_ 31.5 def
/hpt hpt_ def
/vpt vpt_ def
/doclip {
  ClipToBoundingBox {
    newpath 50 50 moveto 410 50 lineto 410 302 lineto 50 302 lineto closepath
    clip
  } if
} def
%
% Gnuplot Prolog Version 4.6 (September 2012)
%
%/SuppressPDFMark true def
%
/M {moveto} bind def
/L {lineto} bind def
/R {rmoveto} bind def
/V {rlineto} bind def
/N {newpath moveto} bind def
/Z {closepath} bind def
/C {setrgbcolor} bind def
/f {rlineto fill} bind def
/g {setgray} bind def
/Gshow {show} def   % May be redefined later in the file to support UTF-8
/vpt2 vpt 2 mul def
/hpt2 hpt 2 mul def
/Lshow {currentpoint stroke M 0 vshift R 
	Blacktext {gsave 0 setgray show grestore} {show} ifelse} def
/Rshow {currentpoint stroke M dup stringwidth pop neg vshift R
	Blacktext {gsave 0 setgray show grestore} {show} ifelse} def
/Cshow {currentpoint stroke M dup stringwidth pop -2 div vshift R 
	Blacktext {gsave 0 setgray show grestore} {show} ifelse} def
/UP {dup vpt_ mul /vpt exch def hpt_ mul /hpt exch def
  /hpt2 hpt 2 mul def /vpt2 vpt 2 mul def} def
/DL {Color {setrgbcolor Solid {pop []} if 0 setdash}
 {pop pop pop 0 setgray Solid {pop []} if 0 setdash} ifelse} def
/BL {stroke userlinewidth 2 mul setlinewidth
	Rounded {1 setlinejoin 1 setlinecap} if} def
/AL {stroke userlinewidth 2 div setlinewidth
	Rounded {1 setlinejoin 1 setlinecap} if} def
/UL {dup gnulinewidth mul /userlinewidth exch def
	dup 1 lt {pop 1} if 10 mul /udl exch def} def
/PL {stroke userlinewidth setlinewidth
	Rounded {1 setlinejoin 1 setlinecap} if} def
3.8 setmiterlimit
% Default Line colors
/LCw {1 1 1} def
/LCb {0 0 0} def
/LCa {0 0 0} def
/LC0 {1 0 0} def
/LC1 {0 1 0} def
/LC2 {0 0 1} def
/LC3 {1 0 1} def
/LC4 {0 1 1} def
/LC5 {1 1 0} def
/LC6 {0 0 0} def
/LC7 {1 0.3 0} def
/LC8 {0.5 0.5 0.5} def
% Default Line Types
/LTw {PL [] 1 setgray} def
/LTb {BL [] LCb DL} def
/LTa {AL [1 udl mul 2 udl mul] 0 setdash LCa setrgbcolor} def
/LT0 {PL [] LC0 DL} def
/LT1 {PL [4 dl1 2 dl2] LC1 DL} def
/LT2 {PL [2 dl1 3 dl2] LC2 DL} def
/LT3 {PL [1 dl1 1.5 dl2] LC3 DL} def
/LT4 {PL [6 dl1 2 dl2 1 dl1 2 dl2] LC4 DL} def
/LT5 {PL [3 dl1 3 dl2 1 dl1 3 dl2] LC5 DL} def
/LT6 {PL [2 dl1 2 dl2 2 dl1 6 dl2] LC6 DL} def
/LT7 {PL [1 dl1 2 dl2 6 dl1 2 dl2 1 dl1 2 dl2] LC7 DL} def
/LT8 {PL [2 dl1 2 dl2 2 dl1 2 dl2 2 dl1 2 dl2 2 dl1 4 dl2] LC8 DL} def
/Pnt {stroke [] 0 setdash gsave 1 setlinecap M 0 0 V stroke grestore} def
/Dia {stroke [] 0 setdash 2 copy vpt add M
  hpt neg vpt neg V hpt vpt neg V
  hpt vpt V hpt neg vpt V closepath stroke
  Pnt} def
/Pls {stroke [] 0 setdash vpt sub M 0 vpt2 V
  currentpoint stroke M
  hpt neg vpt neg R hpt2 0 V stroke
 } def
/Box {stroke [] 0 setdash 2 copy exch hpt sub exch vpt add M
  0 vpt2 neg V hpt2 0 V 0 vpt2 V
  hpt2 neg 0 V closepath stroke
  Pnt} def
/Crs {stroke [] 0 setdash exch hpt sub exch vpt add M
  hpt2 vpt2 neg V currentpoint stroke M
  hpt2 neg 0 R hpt2 vpt2 V stroke} def
/TriU {stroke [] 0 setdash 2 copy vpt 1.12 mul add M
  hpt neg vpt -1.62 mul V
  hpt 2 mul 0 V
  hpt neg vpt 1.62 mul V closepath stroke
  Pnt} def
/Star {2 copy Pls Crs} def
/BoxF {stroke [] 0 setdash exch hpt sub exch vpt add M
  0 vpt2 neg V hpt2 0 V 0 vpt2 V
  hpt2 neg 0 V closepath fill} def
/TriUF {stroke [] 0 setdash vpt 1.12 mul add M
  hpt neg vpt -1.62 mul V
  hpt 2 mul 0 V
  hpt neg vpt 1.62 mul V closepath fill} def
/TriD {stroke [] 0 setdash 2 copy vpt 1.12 mul sub M
  hpt neg vpt 1.62 mul V
  hpt 2 mul 0 V
  hpt neg vpt -1.62 mul V closepath stroke
  Pnt} def
/TriDF {stroke [] 0 setdash vpt 1.12 mul sub M
  hpt neg vpt 1.62 mul V
  hpt 2 mul 0 V
  hpt neg vpt -1.62 mul V closepath fill} def
/DiaF {stroke [] 0 setdash vpt add M
  hpt neg vpt neg V hpt vpt neg V
  hpt vpt V hpt neg vpt V closepath fill} def
/Pent {stroke [] 0 setdash 2 copy gsave
  translate 0 hpt M 4 {72 rotate 0 hpt L} repeat
  closepath stroke grestore Pnt} def
/PentF {stroke [] 0 setdash gsave
  translate 0 hpt M 4 {72 rotate 0 hpt L} repeat
  closepath fill grestore} def
/Circle {stroke [] 0 setdash 2 copy
  hpt 0 360 arc stroke Pnt} def
/CircleF {stroke [] 0 setdash hpt 0 360 arc fill} def
/C0 {BL [] 0 setdash 2 copy moveto vpt 90 450 arc} bind def
/C1 {BL [] 0 setdash 2 copy moveto
	2 copy vpt 0 90 arc closepath fill
	vpt 0 360 arc closepath} bind def
/C2 {BL [] 0 setdash 2 copy moveto
	2 copy vpt 90 180 arc closepath fill
	vpt 0 360 arc closepath} bind def
/C3 {BL [] 0 setdash 2 copy moveto
	2 copy vpt 0 180 arc closepath fill
	vpt 0 360 arc closepath} bind def
/C4 {BL [] 0 setdash 2 copy moveto
	2 copy vpt 180 270 arc closepath fill
	vpt 0 360 arc closepath} bind def
/C5 {BL [] 0 setdash 2 copy moveto
	2 copy vpt 0 90 arc
	2 copy moveto
	2 copy vpt 180 270 arc closepath fill
	vpt 0 360 arc} bind def
/C6 {BL [] 0 setdash 2 copy moveto
	2 copy vpt 90 270 arc closepath fill
	vpt 0 360 arc closepath} bind def
/C7 {BL [] 0 setdash 2 copy moveto
	2 copy vpt 0 270 arc closepath fill
	vpt 0 360 arc closepath} bind def
/C8 {BL [] 0 setdash 2 copy moveto
	2 copy vpt 270 360 arc closepath fill
	vpt 0 360 arc closepath} bind def
/C9 {BL [] 0 setdash 2 copy moveto
	2 copy vpt 270 450 arc closepath fill
	vpt 0 360 arc closepath} bind def
/C10 {BL [] 0 setdash 2 copy 2 copy moveto vpt 270 360 arc closepath fill
	2 copy moveto
	2 copy vpt 90 180 arc closepath fill
	vpt 0 360 arc closepath} bind def
/C11 {BL [] 0 setdash 2 copy moveto
	2 copy vpt 0 180 arc closepath fill
	2 copy moveto
	2 copy vpt 270 360 arc closepath fill
	vpt 0 360 arc closepath} bind def
/C12 {BL [] 0 setdash 2 copy moveto
	2 copy vpt 180 360 arc closepath fill
	vpt 0 360 arc closepath} bind def
/C13 {BL [] 0 setdash 2 copy moveto
	2 copy vpt 0 90 arc closepath fill
	2 copy moveto
	2 copy vpt 180 360 arc closepath fill
	vpt 0 360 arc closepath} bind def
/C14 {BL [] 0 setdash 2 copy moveto
	2 copy vpt 90 360 arc closepath fill
	vpt 0 360 arc} bind def
/C15 {BL [] 0 setdash 2 copy vpt 0 360 arc closepath fill
	vpt 0 360 arc closepath} bind def
/Rec {newpath 4 2 roll moveto 1 index 0 rlineto 0 exch rlineto
	neg 0 rlineto closepath} bind def
/Square {dup Rec} bind def
/Bsquare {vpt sub exch vpt sub exch vpt2 Square} bind def
/S0 {BL [] 0 setdash 2 copy moveto 0 vpt rlineto BL Bsquare} bind def
/S1 {BL [] 0 setdash 2 copy vpt Square fill Bsquare} bind def
/S2 {BL [] 0 setdash 2 copy exch vpt sub exch vpt Square fill Bsquare} bind def
/S3 {BL [] 0 setdash 2 copy exch vpt sub exch vpt2 vpt Rec fill Bsquare} bind def
/S4 {BL [] 0 setdash 2 copy exch vpt sub exch vpt sub vpt Square fill Bsquare} bind def
/S5 {BL [] 0 setdash 2 copy 2 copy vpt Square fill
	exch vpt sub exch vpt sub vpt Square fill Bsquare} bind def
/S6 {BL [] 0 setdash 2 copy exch vpt sub exch vpt sub vpt vpt2 Rec fill Bsquare} bind def
/S7 {BL [] 0 setdash 2 copy exch vpt sub exch vpt sub vpt vpt2 Rec fill
	2 copy vpt Square fill Bsquare} bind def
/S8 {BL [] 0 setdash 2 copy vpt sub vpt Square fill Bsquare} bind def
/S9 {BL [] 0 setdash 2 copy vpt sub vpt vpt2 Rec fill Bsquare} bind def
/S10 {BL [] 0 setdash 2 copy vpt sub vpt Square fill 2 copy exch vpt sub exch vpt Square fill
	Bsquare} bind def
/S11 {BL [] 0 setdash 2 copy vpt sub vpt Square fill 2 copy exch vpt sub exch vpt2 vpt Rec fill
	Bsquare} bind def
/S12 {BL [] 0 setdash 2 copy exch vpt sub exch vpt sub vpt2 vpt Rec fill Bsquare} bind def
/S13 {BL [] 0 setdash 2 copy exch vpt sub exch vpt sub vpt2 vpt Rec fill
	2 copy vpt Square fill Bsquare} bind def
/S14 {BL [] 0 setdash 2 copy exch vpt sub exch vpt sub vpt2 vpt Rec fill
	2 copy exch vpt sub exch vpt Square fill Bsquare} bind def
/S15 {BL [] 0 setdash 2 copy Bsquare fill Bsquare} bind def
/D0 {gsave translate 45 rotate 0 0 S0 stroke grestore} bind def
/D1 {gsave translate 45 rotate 0 0 S1 stroke grestore} bind def
/D2 {gsave translate 45 rotate 0 0 S2 stroke grestore} bind def
/D3 {gsave translate 45 rotate 0 0 S3 stroke grestore} bind def
/D4 {gsave translate 45 rotate 0 0 S4 stroke grestore} bind def
/D5 {gsave translate 45 rotate 0 0 S5 stroke grestore} bind def
/D6 {gsave translate 45 rotate 0 0 S6 stroke grestore} bind def
/D7 {gsave translate 45 rotate 0 0 S7 stroke grestore} bind def
/D8 {gsave translate 45 rotate 0 0 S8 stroke grestore} bind def
/D9 {gsave translate 45 rotate 0 0 S9 stroke grestore} bind def
/D10 {gsave translate 45 rotate 0 0 S10 stroke grestore} bind def
/D11 {gsave translate 45 rotate 0 0 S11 stroke grestore} bind def
/D12 {gsave translate 45 rotate 0 0 S12 stroke grestore} bind def
/D13 {gsave translate 45 rotate 0 0 S13 stroke grestore} bind def
/D14 {gsave translate 45 rotate 0 0 S14 stroke grestore} bind def
/D15 {gsave translate 45 rotate 0 0 S15 stroke grestore} bind def
/DiaE {stroke [] 0 setdash vpt add M
  hpt neg vpt neg V hpt vpt neg V
  hpt vpt V hpt neg vpt V closepath stroke} def
/BoxE {stroke [] 0 setdash exch hpt sub exch vpt add M
  0 vpt2 neg V hpt2 0 V 0 vpt2 V
  hpt2 neg 0 V closepath stroke} def
/TriUE {stroke [] 0 setdash vpt 1.12 mul add M
  hpt neg vpt -1.62 mul V
  hpt 2 mul 0 V
  hpt neg vpt 1.62 mul V closepath stroke} def
/TriDE {stroke [] 0 setdash vpt 1.12 mul sub M
  hpt neg vpt 1.62 mul V
  hpt 2 mul 0 V
  hpt neg vpt -1.62 mul V closepath stroke} def
/PentE {stroke [] 0 setdash gsave
  translate 0 hpt M 4 {72 rotate 0 hpt L} repeat
  closepath stroke grestore} def
/CircE {stroke [] 0 setdash 
  hpt 0 360 arc stroke} def
/Opaque {gsave closepath 1 setgray fill grestore 0 setgray closepath} def
/DiaW {stroke [] 0 setdash vpt add M
  hpt neg vpt neg V hpt vpt neg V
  hpt vpt V hpt neg vpt V Opaque stroke} def
/BoxW {stroke [] 0 setdash exch hpt sub exch vpt add M
  0 vpt2 neg V hpt2 0 V 0 vpt2 V
  hpt2 neg 0 V Opaque stroke} def
/TriUW {stroke [] 0 setdash vpt 1.12 mul add M
  hpt neg vpt -1.62 mul V
  hpt 2 mul 0 V
  hpt neg vpt 1.62 mul V Opaque stroke} def
/TriDW {stroke [] 0 setdash vpt 1.12 mul sub M
  hpt neg vpt 1.62 mul V
  hpt 2 mul 0 V
  hpt neg vpt -1.62 mul V Opaque stroke} def
/PentW {stroke [] 0 setdash gsave
  translate 0 hpt M 4 {72 rotate 0 hpt L} repeat
  Opaque stroke grestore} def
/CircW {stroke [] 0 setdash 
  hpt 0 360 arc Opaque stroke} def
/BoxFill {gsave Rec 1 setgray fill grestore} def
/Density {
  /Fillden exch def
  currentrgbcolor
  /ColB exch def /ColG exch def /ColR exch def
  /ColR ColR Fillden mul Fillden sub 1 add def
  /ColG ColG Fillden mul Fillden sub 1 add def
  /ColB ColB Fillden mul Fillden sub 1 add def
  ColR ColG ColB setrgbcolor} def
/BoxColFill {gsave Rec PolyFill} def
/PolyFill {gsave Density fill grestore grestore} def
/h {rlineto rlineto rlineto gsave closepath fill grestore} bind def
%
% PostScript Level 1 Pattern Fill routine for rectangles
% Usage: x y w h s a XX PatternFill
%	x,y = lower left corner of box to be filled
%	w,h = width and height of box
%	  a = angle in degrees between lines and x-axis
%	 XX = 0/1 for no/yes cross-hatch
%
/PatternFill {gsave /PFa [ 9 2 roll ] def
  PFa 0 get PFa 2 get 2 div add PFa 1 get PFa 3 get 2 div add translate
  PFa 2 get -2 div PFa 3 get -2 div PFa 2 get PFa 3 get Rec
  TransparentPatterns {} {gsave 1 setgray fill grestore} ifelse
  clip
  currentlinewidth 0.5 mul setlinewidth
  /PFs PFa 2 get dup mul PFa 3 get dup mul add sqrt def
  0 0 M PFa 5 get rotate PFs -2 div dup translate
  0 1 PFs PFa 4 get div 1 add floor cvi
	{PFa 4 get mul 0 M 0 PFs V} for
  0 PFa 6 get ne {
	0 1 PFs PFa 4 get div 1 add floor cvi
	{PFa 4 get mul 0 2 1 roll M PFs 0 V} for
 } if
  stroke grestore} def
%
/languagelevel where
 {pop languagelevel} {1} ifelse
 2 lt
	{/InterpretLevel1 true def}
	{/InterpretLevel1 Level1 def}
 ifelse
%
% PostScript level 2 pattern fill definitions
%
/Level2PatternFill {
/Tile8x8 {/PaintType 2 /PatternType 1 /TilingType 1 /BBox [0 0 8 8] /XStep 8 /YStep 8}
	bind def
/KeepColor {currentrgbcolor [/Pattern /DeviceRGB] setcolorspace} bind def
<< Tile8x8
 /PaintProc {0.5 setlinewidth pop 0 0 M 8 8 L 0 8 M 8 0 L stroke} 
>> matrix makepattern
/Pat1 exch def
<< Tile8x8
 /PaintProc {0.5 setlinewidth pop 0 0 M 8 8 L 0 8 M 8 0 L stroke
	0 4 M 4 8 L 8 4 L 4 0 L 0 4 L stroke}
>> matrix makepattern
/Pat2 exch def
<< Tile8x8
 /PaintProc {0.5 setlinewidth pop 0 0 M 0 8 L
	8 8 L 8 0 L 0 0 L fill}
>> matrix makepattern
/Pat3 exch def
<< Tile8x8
 /PaintProc {0.5 setlinewidth pop -4 8 M 8 -4 L
	0 12 M 12 0 L stroke}
>> matrix makepattern
/Pat4 exch def
<< Tile8x8
 /PaintProc {0.5 setlinewidth pop -4 0 M 8 12 L
	0 -4 M 12 8 L stroke}
>> matrix makepattern
/Pat5 exch def
<< Tile8x8
 /PaintProc {0.5 setlinewidth pop -2 8 M 4 -4 L
	0 12 M 8 -4 L 4 12 M 10 0 L stroke}
>> matrix makepattern
/Pat6 exch def
<< Tile8x8
 /PaintProc {0.5 setlinewidth pop -2 0 M 4 12 L
	0 -4 M 8 12 L 4 -4 M 10 8 L stroke}
>> matrix makepattern
/Pat7 exch def
<< Tile8x8
 /PaintProc {0.5 setlinewidth pop 8 -2 M -4 4 L
	12 0 M -4 8 L 12 4 M 0 10 L stroke}
>> matrix makepattern
/Pat8 exch def
<< Tile8x8
 /PaintProc {0.5 setlinewidth pop 0 -2 M 12 4 L
	-4 0 M 12 8 L -4 4 M 8 10 L stroke}
>> matrix makepattern
/Pat9 exch def
/Pattern1 {PatternBgnd KeepColor Pat1 setpattern} bind def
/Pattern2 {PatternBgnd KeepColor Pat2 setpattern} bind def
/Pattern3 {PatternBgnd KeepColor Pat3 setpattern} bind def
/Pattern4 {PatternBgnd KeepColor Landscape {Pat5} {Pat4} ifelse setpattern} bind def
/Pattern5 {PatternBgnd KeepColor Landscape {Pat4} {Pat5} ifelse setpattern} bind def
/Pattern6 {PatternBgnd KeepColor Landscape {Pat9} {Pat6} ifelse setpattern} bind def
/Pattern7 {PatternBgnd KeepColor Landscape {Pat8} {Pat7} ifelse setpattern} bind def
} def
%
%
%End of PostScript Level 2 code
%
/PatternBgnd {
  TransparentPatterns {} {gsave 1 setgray fill grestore} ifelse
} def
%
% Substitute for Level 2 pattern fill codes with
% grayscale if Level 2 support is not selected.
%
/Level1PatternFill {
/Pattern1 {0.250 Density} bind def
/Pattern2 {0.500 Density} bind def
/Pattern3 {0.750 Density} bind def
/Pattern4 {0.125 Density} bind def
/Pattern5 {0.375 Density} bind def
/Pattern6 {0.625 Density} bind def
/Pattern7 {0.875 Density} bind def
} def
%
% Now test for support of Level 2 code
%
Level1 {Level1PatternFill} {Level2PatternFill} ifelse
%
/Symbol-Oblique /Symbol findfont [1 0 .167 1 0 0] makefont
dup length dict begin {1 index /FID eq {pop pop} {def} ifelse} forall
currentdict end definefont pop
Level1 SuppressPDFMark or 
{} {
/SDict 10 dict def
systemdict /pdfmark known not {
  userdict /pdfmark systemdict /cleartomark get put
} if
SDict begin [
  /Title (spalt.tex)
  /Subject (gnuplot plot)
  /Creator (gnuplot 4.6 patchlevel 5)
  /Author (kevin.luedemann)
%  /Producer (gnuplot)
%  /Keywords ()
  /CreationDate (Tue Mar 17 17:16:14 2015)
  /DOCINFO pdfmark
end
} ifelse
end
%%EndProlog
%%Page: 1 1
gnudict begin
gsave
doclip
50 50 translate
0.050 0.050 scale
0 setgray
newpath
1.000 UL
LTb
LCb setrgbcolor
1210 704 M
63 0 V
5530 0 R
-63 0 V
stroke
LTb
1210 1156 M
63 0 V
5530 0 R
-63 0 V
1210 1609 M
63 0 V
5530 0 R
-63 0 V
1210 2061 M
63 0 V
5530 0 R
-63 0 V
1210 2513 M
63 0 V
5530 0 R
-63 0 V
1210 2966 M
63 0 V
5530 0 R
-63 0 V
1210 3418 M
63 0 V
5530 0 R
-63 0 V
1210 3870 M
63 0 V
5530 0 R
-63 0 V
1210 4323 M
63 0 V
5530 0 R
-63 0 V
1210 4775 M
63 0 V
5530 0 R
-63 0 V
1210 704 M
0 63 V
0 4008 R
0 -63 V
2009 704 M
0 63 V
0 4008 R
0 -63 V
2808 704 M
0 63 V
0 4008 R
0 -63 V
3607 704 M
0 63 V
0 4008 R
0 -63 V
4406 704 M
0 63 V
0 4008 R
0 -63 V
5205 704 M
0 63 V
0 4008 R
0 -63 V
6004 704 M
0 63 V
0 4008 R
0 -63 V
6803 704 M
0 63 V
0 4008 R
0 -63 V
stroke
1210 4775 N
0 -4071 V
5593 0 V
0 4071 V
-5593 0 V
Z stroke
1.000 UP
1.000 UL
LTb
1.000 UP
1.000 UL
LT0
LC0 setrgbcolor
LCb setrgbcolor
LT0
LC0 setrgbcolor
1578 802 Pls
1588 806 Pls
1598 797 Pls
1608 797 Pls
1617 783 Pls
1627 788 Pls
1637 811 Pls
1647 793 Pls
1657 802 Pls
1667 806 Pls
1677 802 Pls
1687 806 Pls
1697 825 Pls
1707 820 Pls
1717 811 Pls
1727 820 Pls
1737 820 Pls
1747 825 Pls
1757 825 Pls
1767 825 Pls
1777 820 Pls
1787 825 Pls
1797 816 Pls
1807 811 Pls
1817 816 Pls
1827 820 Pls
1837 820 Pls
1847 806 Pls
1857 811 Pls
1867 806 Pls
1877 793 Pls
1887 802 Pls
1897 802 Pls
1907 802 Pls
1917 797 Pls
1927 779 Pls
1937 806 Pls
1947 806 Pls
1957 802 Pls
1967 802 Pls
1977 797 Pls
1987 788 Pls
1997 802 Pls
2007 806 Pls
2017 806 Pls
2027 811 Pls
2037 816 Pls
2047 816 Pls
2057 820 Pls
2067 825 Pls
2077 816 Pls
2087 825 Pls
2097 811 Pls
2107 816 Pls
2117 806 Pls
2127 806 Pls
2137 820 Pls
2147 816 Pls
2157 811 Pls
2167 811 Pls
2177 806 Pls
2187 806 Pls
2197 783 Pls
2207 779 Pls
2217 806 Pls
2227 806 Pls
2237 811 Pls
2247 811 Pls
2257 806 Pls
2267 802 Pls
2277 806 Pls
2287 797 Pls
2297 806 Pls
2307 802 Pls
2317 793 Pls
2327 793 Pls
2337 802 Pls
2347 802 Pls
2357 806 Pls
2367 793 Pls
2377 783 Pls
2387 770 Pls
2397 774 Pls
2407 770 Pls
2416 765 Pls
2426 756 Pls
2436 770 Pls
2446 774 Pls
2456 797 Pls
2466 793 Pls
2476 793 Pls
2486 793 Pls
2496 797 Pls
2506 802 Pls
2516 788 Pls
2526 811 Pls
2536 806 Pls
2546 816 Pls
2556 811 Pls
2566 806 Pls
2576 820 Pls
2586 825 Pls
2596 816 Pls
2606 820 Pls
2616 820 Pls
2626 839 Pls
2636 834 Pls
2646 848 Pls
2656 839 Pls
2666 843 Pls
2676 843 Pls
2686 848 Pls
2696 848 Pls
2706 843 Pls
2716 848 Pls
2726 843 Pls
2736 830 Pls
2746 839 Pls
2756 843 Pls
2766 843 Pls
2776 839 Pls
2786 839 Pls
2796 834 Pls
2806 834 Pls
2816 830 Pls
2826 839 Pls
2836 834 Pls
2846 816 Pls
2856 816 Pls
2866 806 Pls
2876 806 Pls
2886 806 Pls
2896 820 Pls
2906 811 Pls
2916 806 Pls
2926 793 Pls
2936 802 Pls
2946 806 Pls
2956 797 Pls
2966 802 Pls
2976 802 Pls
2986 802 Pls
2996 797 Pls
3006 802 Pls
3016 816 Pls
3026 802 Pls
3036 820 Pls
3046 825 Pls
3056 825 Pls
3066 862 Pls
3076 862 Pls
3086 866 Pls
3096 880 Pls
3106 885 Pls
3116 885 Pls
3126 894 Pls
3136 899 Pls
3146 899 Pls
3156 908 Pls
3166 913 Pls
3176 926 Pls
3186 940 Pls
3196 940 Pls
3206 945 Pls
3215 963 Pls
3225 963 Pls
3235 959 Pls
3245 963 Pls
3255 963 Pls
3265 954 Pls
3275 959 Pls
3285 949 Pls
3295 926 Pls
3305 949 Pls
3315 940 Pls
3325 931 Pls
3335 917 Pls
3345 913 Pls
3355 908 Pls
3365 899 Pls
3375 871 Pls
3385 876 Pls
3395 866 Pls
3405 866 Pls
3415 866 Pls
3425 871 Pls
3435 876 Pls
3445 876 Pls
3455 857 Pls
3465 876 Pls
3475 876 Pls
3485 889 Pls
3495 894 Pls
3505 917 Pls
3515 954 Pls
3525 972 Pls
3535 1009 Pls
3545 1042 Pls
3555 1083 Pls
3565 1157 Pls
3575 1189 Pls
3585 1258 Pls
3595 1309 Pls
3605 1364 Pls
3615 1420 Pls
3625 1507 Pls
3635 1567 Pls
3645 1609 Pls
3655 1724 Pls
3665 1812 Pls
3675 1945 Pls
3685 2139 Pls
3695 2176 Pls
3705 2282 Pls
3715 2406 Pls
3725 2503 Pls
3735 2632 Pls
3745 2771 Pls
3755 2854 Pls
3765 2978 Pls
3775 3107 Pls
3785 3167 Pls
3795 3245 Pls
3805 3351 Pls
3815 3494 Pls
3825 3628 Pls
3835 3734 Pls
3845 3849 Pls
3855 3974 Pls
3865 4052 Pls
3875 4117 Pls
3885 4218 Pls
3895 4306 Pls
3905 4370 Pls
3915 4403 Pls
3925 4453 Pls
3935 4481 Pls
3945 4490 Pls
3955 4504 Pls
3965 4536 Pls
3975 4527 Pls
3985 4522 Pls
3995 4518 Pls
4005 4499 Pls
4014 4458 Pls
4024 4389 Pls
4034 4347 Pls
4044 4292 Pls
4054 4255 Pls
4064 4407 Pls
4074 4241 Pls
4084 4038 Pls
4094 4002 Pls
4104 4057 Pls
4114 4071 Pls
4124 4002 Pls
4134 3854 Pls
4144 3716 Pls
4154 3757 Pls
4164 3361 Pls
4174 3471 Pls
4184 3370 Pls
4194 3245 Pls
4204 3116 Pls
4214 2729 Pls
4224 2581 Pls
4234 2416 Pls
4244 2402 Pls
4254 2291 Pls
4264 2162 Pls
4274 2024 Pls
4284 1931 Pls
4294 1798 Pls
4304 1673 Pls
4314 1590 Pls
4324 1512 Pls
4334 1401 Pls
4344 1337 Pls
4354 1346 Pls
4364 1383 Pls
4374 1314 Pls
4384 1120 Pls
4394 1083 Pls
4404 1051 Pls
4414 1005 Pls
4424 986 Pls
4434 982 Pls
4444 1051 Pls
4454 1009 Pls
4464 982 Pls
4474 940 Pls
4484 913 Pls
4494 894 Pls
4504 871 Pls
4514 839 Pls
4524 806 Pls
4534 806 Pls
4544 839 Pls
4554 834 Pls
4564 820 Pls
4574 830 Pls
4584 820 Pls
4594 830 Pls
4604 834 Pls
4614 843 Pls
4624 857 Pls
4634 880 Pls
4644 866 Pls
4654 862 Pls
4664 862 Pls
4674 866 Pls
4684 885 Pls
4694 899 Pls
4704 899 Pls
4714 913 Pls
4724 917 Pls
4734 922 Pls
4744 931 Pls
4754 959 Pls
4764 954 Pls
4774 940 Pls
4784 931 Pls
4794 926 Pls
4804 931 Pls
4813 931 Pls
4823 931 Pls
4833 926 Pls
4843 917 Pls
4853 880 Pls
4863 876 Pls
4873 866 Pls
4883 853 Pls
4893 839 Pls
4903 834 Pls
4913 825 Pls
4923 816 Pls
4933 806 Pls
4943 816 Pls
4953 806 Pls
4963 797 Pls
4973 811 Pls
4983 811 Pls
4993 816 Pls
5003 820 Pls
5013 811 Pls
5023 811 Pls
5033 816 Pls
5043 816 Pls
5053 820 Pls
5063 825 Pls
5073 820 Pls
5083 834 Pls
5093 839 Pls
5103 843 Pls
5113 848 Pls
5123 843 Pls
5133 853 Pls
5143 848 Pls
5153 843 Pls
5163 853 Pls
5173 848 Pls
5183 862 Pls
5193 857 Pls
5203 843 Pls
5213 848 Pls
5223 853 Pls
5233 853 Pls
5243 857 Pls
5253 862 Pls
5263 862 Pls
5273 853 Pls
5283 848 Pls
5293 857 Pls
5303 853 Pls
5313 853 Pls
5323 857 Pls
5333 843 Pls
5343 853 Pls
5353 857 Pls
5363 857 Pls
5373 848 Pls
5383 843 Pls
5393 848 Pls
5403 839 Pls
5413 834 Pls
5423 834 Pls
5433 830 Pls
5443 834 Pls
5453 830 Pls
5463 825 Pls
5473 830 Pls
5483 830 Pls
5493 830 Pls
5503 830 Pls
5513 820 Pls
5523 825 Pls
5533 816 Pls
5543 830 Pls
5553 816 Pls
5563 820 Pls
5573 816 Pls
5583 816 Pls
5593 806 Pls
5603 811 Pls
5612 811 Pls
5622 811 Pls
5632 806 Pls
5642 811 Pls
5652 816 Pls
5662 811 Pls
5672 811 Pls
5682 806 Pls
5692 811 Pls
5702 816 Pls
5712 816 Pls
5722 816 Pls
5732 811 Pls
5742 830 Pls
5752 816 Pls
5762 797 Pls
5772 825 Pls
5782 816 Pls
5792 806 Pls
5802 825 Pls
5812 825 Pls
5822 820 Pls
5832 825 Pls
5842 825 Pls
5852 825 Pls
5862 830 Pls
5872 806 Pls
5882 816 Pls
5892 816 Pls
5902 811 Pls
5912 811 Pls
5922 816 Pls
5932 816 Pls
5942 816 Pls
5952 816 Pls
5962 820 Pls
5972 816 Pls
5982 820 Pls
5992 820 Pls
6002 816 Pls
6012 811 Pls
6022 816 Pls
6032 811 Pls
6042 811 Pls
6052 806 Pls
6062 811 Pls
6072 820 Pls
6082 806 Pls
6092 816 Pls
6102 806 Pls
6112 806 Pls
6122 806 Pls
6132 811 Pls
6142 811 Pls
6152 811 Pls
6162 811 Pls
6172 816 Pls
6182 816 Pls
6192 797 Pls
6202 816 Pls
6212 811 Pls
6222 811 Pls
6232 806 Pls
6242 811 Pls
6252 806 Pls
6262 811 Pls
6272 811 Pls
6282 811 Pls
6243 4602 Pls
1.000 UP
1.000 UL
LT0
5333 840 Pls
5343 827 Pls
5353 822 Pls
5363 818 Pls
5373 807 Pls
5383 801 Pls
5393 801 Pls
5403 800 Pls
5413 801 Pls
5423 795 Pls
5433 787 Pls
5443 790 Pls
5453 809 Pls
5463 790 Pls
5473 806 Pls
5483 807 Pls
5493 811 Pls
5503 812 Pls
5513 807 Pls
5523 809 Pls
5533 791 Pls
5543 807 Pls
5553 810 Pls
5563 811 Pls
5573 813 Pls
5583 801 Pls
5593 809 Pls
5603 810 Pls
5612 811 Pls
5622 814 Pls
5632 815 Pls
5642 813 Pls
5652 815 Pls
5662 815 Pls
5672 817 Pls
5682 817 Pls
5692 818 Pls
5702 809 Pls
5712 798 Pls
5722 813 Pls
5732 811 Pls
5742 813 Pls
5752 812 Pls
5762 811 Pls
5772 811 Pls
5782 816 Pls
5792 815 Pls
5802 814 Pls
5812 794 Pls
5822 801 Pls
5832 800 Pls
5842 801 Pls
5852 796 Pls
5862 794 Pls
5872 807 Pls
5882 806 Pls
5892 808 Pls
5902 788 Pls
5912 788 Pls
5922 789 Pls
5932 788 Pls
5942 789 Pls
5952 789 Pls
5962 788 Pls
5972 788 Pls
5982 788 Pls
5992 788 Pls
6002 788 Pls
6012 789 Pls
6022 790 Pls
6032 788 Pls
6042 805 Pls
6052 807 Pls
6062 808 Pls
6072 811 Pls
6082 807 Pls
6092 806 Pls
6102 804 Pls
6112 797 Pls
6122 794 Pls
6132 794 Pls
6142 793 Pls
6152 794 Pls
6162 794 Pls
6172 795 Pls
6182 799 Pls
6192 802 Pls
6202 816 Pls
6212 818 Pls
6222 814 Pls
6232 802 Pls
6242 801 Pls
6252 801 Pls
6262 799 Pls
6272 799 Pls
6282 800 Pls
6292 801 Pls
6302 794 Pls
6312 794 Pls
6322 796 Pls
6332 797 Pls
6342 798 Pls
6352 804 Pls
6362 815 Pls
6372 817 Pls
6382 821 Pls
1.000 UP
1.000 UL
LT0
1917 827 Pls
1927 826 Pls
1937 827 Pls
1947 827 Pls
1957 827 Pls
1967 827 Pls
1977 827 Pls
1987 827 Pls
1997 828 Pls
2007 828 Pls
2017 830 Pls
2027 830 Pls
2037 831 Pls
2047 831 Pls
2057 828 Pls
2067 827 Pls
2077 828 Pls
2087 835 Pls
2097 836 Pls
2107 838 Pls
2117 837 Pls
2127 837 Pls
2137 839 Pls
2147 824 Pls
2157 836 Pls
2167 837 Pls
2177 836 Pls
2187 837 Pls
2197 836 Pls
2207 836 Pls
2217 836 Pls
2227 836 Pls
2237 836 Pls
2247 835 Pls
2257 834 Pls
2267 828 Pls
2277 829 Pls
2287 832 Pls
2297 830 Pls
2307 828 Pls
2317 826 Pls
2327 824 Pls
2337 825 Pls
2347 818 Pls
2357 811 Pls
2367 816 Pls
2377 814 Pls
2387 811 Pls
2397 811 Pls
2407 810 Pls
2416 810 Pls
2426 810 Pls
2436 811 Pls
2446 811 Pls
2456 812 Pls
2466 813 Pls
2476 813 Pls
2486 806 Pls
2496 808 Pls
2506 807 Pls
2516 806 Pls
2526 817 Pls
2536 822 Pls
2546 812 Pls
2556 814 Pls
2566 817 Pls
2576 819 Pls
2586 818 Pls
2596 817 Pls
2606 823 Pls
2616 842 Pls
2626 843 Pls
2636 844 Pls
2646 847 Pls
2656 851 Pls
2666 853 Pls
2676 858 Pls
2686 857 Pls
2696 863 Pls
2706 865 Pls
2716 867 Pls
2726 864 Pls
2736 858 Pls
2746 861 Pls
2756 860 Pls
2766 859 Pls
2776 857 Pls
2786 856 Pls
2796 853 Pls
2806 853 Pls
2816 851 Pls
2826 849 Pls
2836 847 Pls
2846 845 Pls
2856 842 Pls
2866 840 Pls
2876 838 Pls
2886 836 Pls
2896 834 Pls
2906 833 Pls
2916 832 Pls
2926 830 Pls
2936 829 Pls
2946 829 Pls
2956 829 Pls
2966 831 Pls
2976 831 Pls
2986 834 Pls
2996 837 Pls
3006 841 Pls
3016 842 Pls
3026 848 Pls
3036 854 Pls
3046 860 Pls
3056 871 Pls
3066 876 Pls
3076 883 Pls
3086 891 Pls
3096 898 Pls
3106 905 Pls
3116 912 Pls
3126 919 Pls
3136 924 Pls
3146 928 Pls
3156 934 Pls
3166 937 Pls
3176 942 Pls
3186 951 Pls
3196 956 Pls
3206 959 Pls
3215 962 Pls
3225 962 Pls
3235 964 Pls
3245 964 Pls
3255 965 Pls
3265 960 Pls
3275 959 Pls
3285 956 Pls
3295 953 Pls
3305 950 Pls
3315 942 Pls
3325 938 Pls
3335 931 Pls
3345 922 Pls
3355 914 Pls
3365 907 Pls
3375 899 Pls
3385 886 Pls
3395 881 Pls
3405 878 Pls
3415 875 Pls
3425 873 Pls
3435 873 Pls
3445 876 Pls
3455 878 Pls
3465 884 Pls
3475 891 Pls
3485 903 Pls
1.000 UL
LTb
LCb setrgbcolor
1210 4775 N
0 -4071 V
5593 0 V
0 4071 V
-5593 0 V
Z stroke
1.000 UP
1.000 UL
LTb
stroke
grestore
end
showpage
%%Trailer
