%!PS-Adobe-2.0 EPSF-2.0
%%Title: gitter.tex
%%Creator: gnuplot 4.6 patchlevel 5
%%CreationDate: Tue Mar 17 17:16:13 2015
%%DocumentFonts: 
%%BoundingBox: 50 50 410 302
%%EndComments
%%BeginProlog
/gnudict 256 dict def
gnudict begin
%
% The following true/false flags may be edited by hand if desired.
% The unit line width and grayscale image gamma correction may also be changed.
%
/Color true def
/Blacktext true def
/Solid false def
/Dashlength 1 def
/Landscape false def
/Level1 false def
/Rounded false def
/ClipToBoundingBox false def
/SuppressPDFMark false def
/TransparentPatterns false def
/gnulinewidth 5.000 def
/userlinewidth gnulinewidth def
/Gamma 1.0 def
/BackgroundColor {-1.000 -1.000 -1.000} def
%
/vshift -73 def
/dl1 {
  10.0 Dashlength mul mul
  Rounded { currentlinewidth 0.75 mul sub dup 0 le { pop 0.01 } if } if
} def
/dl2 {
  10.0 Dashlength mul mul
  Rounded { currentlinewidth 0.75 mul add } if
} def
/hpt_ 31.5 def
/vpt_ 31.5 def
/hpt hpt_ def
/vpt vpt_ def
/doclip {
  ClipToBoundingBox {
    newpath 50 50 moveto 410 50 lineto 410 302 lineto 50 302 lineto closepath
    clip
  } if
} def
%
% Gnuplot Prolog Version 4.6 (September 2012)
%
%/SuppressPDFMark true def
%
/M {moveto} bind def
/L {lineto} bind def
/R {rmoveto} bind def
/V {rlineto} bind def
/N {newpath moveto} bind def
/Z {closepath} bind def
/C {setrgbcolor} bind def
/f {rlineto fill} bind def
/g {setgray} bind def
/Gshow {show} def   % May be redefined later in the file to support UTF-8
/vpt2 vpt 2 mul def
/hpt2 hpt 2 mul def
/Lshow {currentpoint stroke M 0 vshift R 
	Blacktext {gsave 0 setgray show grestore} {show} ifelse} def
/Rshow {currentpoint stroke M dup stringwidth pop neg vshift R
	Blacktext {gsave 0 setgray show grestore} {show} ifelse} def
/Cshow {currentpoint stroke M dup stringwidth pop -2 div vshift R 
	Blacktext {gsave 0 setgray show grestore} {show} ifelse} def
/UP {dup vpt_ mul /vpt exch def hpt_ mul /hpt exch def
  /hpt2 hpt 2 mul def /vpt2 vpt 2 mul def} def
/DL {Color {setrgbcolor Solid {pop []} if 0 setdash}
 {pop pop pop 0 setgray Solid {pop []} if 0 setdash} ifelse} def
/BL {stroke userlinewidth 2 mul setlinewidth
	Rounded {1 setlinejoin 1 setlinecap} if} def
/AL {stroke userlinewidth 2 div setlinewidth
	Rounded {1 setlinejoin 1 setlinecap} if} def
/UL {dup gnulinewidth mul /userlinewidth exch def
	dup 1 lt {pop 1} if 10 mul /udl exch def} def
/PL {stroke userlinewidth setlinewidth
	Rounded {1 setlinejoin 1 setlinecap} if} def
3.8 setmiterlimit
% Default Line colors
/LCw {1 1 1} def
/LCb {0 0 0} def
/LCa {0 0 0} def
/LC0 {1 0 0} def
/LC1 {0 1 0} def
/LC2 {0 0 1} def
/LC3 {1 0 1} def
/LC4 {0 1 1} def
/LC5 {1 1 0} def
/LC6 {0 0 0} def
/LC7 {1 0.3 0} def
/LC8 {0.5 0.5 0.5} def
% Default Line Types
/LTw {PL [] 1 setgray} def
/LTb {BL [] LCb DL} def
/LTa {AL [1 udl mul 2 udl mul] 0 setdash LCa setrgbcolor} def
/LT0 {PL [] LC0 DL} def
/LT1 {PL [4 dl1 2 dl2] LC1 DL} def
/LT2 {PL [2 dl1 3 dl2] LC2 DL} def
/LT3 {PL [1 dl1 1.5 dl2] LC3 DL} def
/LT4 {PL [6 dl1 2 dl2 1 dl1 2 dl2] LC4 DL} def
/LT5 {PL [3 dl1 3 dl2 1 dl1 3 dl2] LC5 DL} def
/LT6 {PL [2 dl1 2 dl2 2 dl1 6 dl2] LC6 DL} def
/LT7 {PL [1 dl1 2 dl2 6 dl1 2 dl2 1 dl1 2 dl2] LC7 DL} def
/LT8 {PL [2 dl1 2 dl2 2 dl1 2 dl2 2 dl1 2 dl2 2 dl1 4 dl2] LC8 DL} def
/Pnt {stroke [] 0 setdash gsave 1 setlinecap M 0 0 V stroke grestore} def
/Dia {stroke [] 0 setdash 2 copy vpt add M
  hpt neg vpt neg V hpt vpt neg V
  hpt vpt V hpt neg vpt V closepath stroke
  Pnt} def
/Pls {stroke [] 0 setdash vpt sub M 0 vpt2 V
  currentpoint stroke M
  hpt neg vpt neg R hpt2 0 V stroke
 } def
/Box {stroke [] 0 setdash 2 copy exch hpt sub exch vpt add M
  0 vpt2 neg V hpt2 0 V 0 vpt2 V
  hpt2 neg 0 V closepath stroke
  Pnt} def
/Crs {stroke [] 0 setdash exch hpt sub exch vpt add M
  hpt2 vpt2 neg V currentpoint stroke M
  hpt2 neg 0 R hpt2 vpt2 V stroke} def
/TriU {stroke [] 0 setdash 2 copy vpt 1.12 mul add M
  hpt neg vpt -1.62 mul V
  hpt 2 mul 0 V
  hpt neg vpt 1.62 mul V closepath stroke
  Pnt} def
/Star {2 copy Pls Crs} def
/BoxF {stroke [] 0 setdash exch hpt sub exch vpt add M
  0 vpt2 neg V hpt2 0 V 0 vpt2 V
  hpt2 neg 0 V closepath fill} def
/TriUF {stroke [] 0 setdash vpt 1.12 mul add M
  hpt neg vpt -1.62 mul V
  hpt 2 mul 0 V
  hpt neg vpt 1.62 mul V closepath fill} def
/TriD {stroke [] 0 setdash 2 copy vpt 1.12 mul sub M
  hpt neg vpt 1.62 mul V
  hpt 2 mul 0 V
  hpt neg vpt -1.62 mul V closepath stroke
  Pnt} def
/TriDF {stroke [] 0 setdash vpt 1.12 mul sub M
  hpt neg vpt 1.62 mul V
  hpt 2 mul 0 V
  hpt neg vpt -1.62 mul V closepath fill} def
/DiaF {stroke [] 0 setdash vpt add M
  hpt neg vpt neg V hpt vpt neg V
  hpt vpt V hpt neg vpt V closepath fill} def
/Pent {stroke [] 0 setdash 2 copy gsave
  translate 0 hpt M 4 {72 rotate 0 hpt L} repeat
  closepath stroke grestore Pnt} def
/PentF {stroke [] 0 setdash gsave
  translate 0 hpt M 4 {72 rotate 0 hpt L} repeat
  closepath fill grestore} def
/Circle {stroke [] 0 setdash 2 copy
  hpt 0 360 arc stroke Pnt} def
/CircleF {stroke [] 0 setdash hpt 0 360 arc fill} def
/C0 {BL [] 0 setdash 2 copy moveto vpt 90 450 arc} bind def
/C1 {BL [] 0 setdash 2 copy moveto
	2 copy vpt 0 90 arc closepath fill
	vpt 0 360 arc closepath} bind def
/C2 {BL [] 0 setdash 2 copy moveto
	2 copy vpt 90 180 arc closepath fill
	vpt 0 360 arc closepath} bind def
/C3 {BL [] 0 setdash 2 copy moveto
	2 copy vpt 0 180 arc closepath fill
	vpt 0 360 arc closepath} bind def
/C4 {BL [] 0 setdash 2 copy moveto
	2 copy vpt 180 270 arc closepath fill
	vpt 0 360 arc closepath} bind def
/C5 {BL [] 0 setdash 2 copy moveto
	2 copy vpt 0 90 arc
	2 copy moveto
	2 copy vpt 180 270 arc closepath fill
	vpt 0 360 arc} bind def
/C6 {BL [] 0 setdash 2 copy moveto
	2 copy vpt 90 270 arc closepath fill
	vpt 0 360 arc closepath} bind def
/C7 {BL [] 0 setdash 2 copy moveto
	2 copy vpt 0 270 arc closepath fill
	vpt 0 360 arc closepath} bind def
/C8 {BL [] 0 setdash 2 copy moveto
	2 copy vpt 270 360 arc closepath fill
	vpt 0 360 arc closepath} bind def
/C9 {BL [] 0 setdash 2 copy moveto
	2 copy vpt 270 450 arc closepath fill
	vpt 0 360 arc closepath} bind def
/C10 {BL [] 0 setdash 2 copy 2 copy moveto vpt 270 360 arc closepath fill
	2 copy moveto
	2 copy vpt 90 180 arc closepath fill
	vpt 0 360 arc closepath} bind def
/C11 {BL [] 0 setdash 2 copy moveto
	2 copy vpt 0 180 arc closepath fill
	2 copy moveto
	2 copy vpt 270 360 arc closepath fill
	vpt 0 360 arc closepath} bind def
/C12 {BL [] 0 setdash 2 copy moveto
	2 copy vpt 180 360 arc closepath fill
	vpt 0 360 arc closepath} bind def
/C13 {BL [] 0 setdash 2 copy moveto
	2 copy vpt 0 90 arc closepath fill
	2 copy moveto
	2 copy vpt 180 360 arc closepath fill
	vpt 0 360 arc closepath} bind def
/C14 {BL [] 0 setdash 2 copy moveto
	2 copy vpt 90 360 arc closepath fill
	vpt 0 360 arc} bind def
/C15 {BL [] 0 setdash 2 copy vpt 0 360 arc closepath fill
	vpt 0 360 arc closepath} bind def
/Rec {newpath 4 2 roll moveto 1 index 0 rlineto 0 exch rlineto
	neg 0 rlineto closepath} bind def
/Square {dup Rec} bind def
/Bsquare {vpt sub exch vpt sub exch vpt2 Square} bind def
/S0 {BL [] 0 setdash 2 copy moveto 0 vpt rlineto BL Bsquare} bind def
/S1 {BL [] 0 setdash 2 copy vpt Square fill Bsquare} bind def
/S2 {BL [] 0 setdash 2 copy exch vpt sub exch vpt Square fill Bsquare} bind def
/S3 {BL [] 0 setdash 2 copy exch vpt sub exch vpt2 vpt Rec fill Bsquare} bind def
/S4 {BL [] 0 setdash 2 copy exch vpt sub exch vpt sub vpt Square fill Bsquare} bind def
/S5 {BL [] 0 setdash 2 copy 2 copy vpt Square fill
	exch vpt sub exch vpt sub vpt Square fill Bsquare} bind def
/S6 {BL [] 0 setdash 2 copy exch vpt sub exch vpt sub vpt vpt2 Rec fill Bsquare} bind def
/S7 {BL [] 0 setdash 2 copy exch vpt sub exch vpt sub vpt vpt2 Rec fill
	2 copy vpt Square fill Bsquare} bind def
/S8 {BL [] 0 setdash 2 copy vpt sub vpt Square fill Bsquare} bind def
/S9 {BL [] 0 setdash 2 copy vpt sub vpt vpt2 Rec fill Bsquare} bind def
/S10 {BL [] 0 setdash 2 copy vpt sub vpt Square fill 2 copy exch vpt sub exch vpt Square fill
	Bsquare} bind def
/S11 {BL [] 0 setdash 2 copy vpt sub vpt Square fill 2 copy exch vpt sub exch vpt2 vpt Rec fill
	Bsquare} bind def
/S12 {BL [] 0 setdash 2 copy exch vpt sub exch vpt sub vpt2 vpt Rec fill Bsquare} bind def
/S13 {BL [] 0 setdash 2 copy exch vpt sub exch vpt sub vpt2 vpt Rec fill
	2 copy vpt Square fill Bsquare} bind def
/S14 {BL [] 0 setdash 2 copy exch vpt sub exch vpt sub vpt2 vpt Rec fill
	2 copy exch vpt sub exch vpt Square fill Bsquare} bind def
/S15 {BL [] 0 setdash 2 copy Bsquare fill Bsquare} bind def
/D0 {gsave translate 45 rotate 0 0 S0 stroke grestore} bind def
/D1 {gsave translate 45 rotate 0 0 S1 stroke grestore} bind def
/D2 {gsave translate 45 rotate 0 0 S2 stroke grestore} bind def
/D3 {gsave translate 45 rotate 0 0 S3 stroke grestore} bind def
/D4 {gsave translate 45 rotate 0 0 S4 stroke grestore} bind def
/D5 {gsave translate 45 rotate 0 0 S5 stroke grestore} bind def
/D6 {gsave translate 45 rotate 0 0 S6 stroke grestore} bind def
/D7 {gsave translate 45 rotate 0 0 S7 stroke grestore} bind def
/D8 {gsave translate 45 rotate 0 0 S8 stroke grestore} bind def
/D9 {gsave translate 45 rotate 0 0 S9 stroke grestore} bind def
/D10 {gsave translate 45 rotate 0 0 S10 stroke grestore} bind def
/D11 {gsave translate 45 rotate 0 0 S11 stroke grestore} bind def
/D12 {gsave translate 45 rotate 0 0 S12 stroke grestore} bind def
/D13 {gsave translate 45 rotate 0 0 S13 stroke grestore} bind def
/D14 {gsave translate 45 rotate 0 0 S14 stroke grestore} bind def
/D15 {gsave translate 45 rotate 0 0 S15 stroke grestore} bind def
/DiaE {stroke [] 0 setdash vpt add M
  hpt neg vpt neg V hpt vpt neg V
  hpt vpt V hpt neg vpt V closepath stroke} def
/BoxE {stroke [] 0 setdash exch hpt sub exch vpt add M
  0 vpt2 neg V hpt2 0 V 0 vpt2 V
  hpt2 neg 0 V closepath stroke} def
/TriUE {stroke [] 0 setdash vpt 1.12 mul add M
  hpt neg vpt -1.62 mul V
  hpt 2 mul 0 V
  hpt neg vpt 1.62 mul V closepath stroke} def
/TriDE {stroke [] 0 setdash vpt 1.12 mul sub M
  hpt neg vpt 1.62 mul V
  hpt 2 mul 0 V
  hpt neg vpt -1.62 mul V closepath stroke} def
/PentE {stroke [] 0 setdash gsave
  translate 0 hpt M 4 {72 rotate 0 hpt L} repeat
  closepath stroke grestore} def
/CircE {stroke [] 0 setdash 
  hpt 0 360 arc stroke} def
/Opaque {gsave closepath 1 setgray fill grestore 0 setgray closepath} def
/DiaW {stroke [] 0 setdash vpt add M
  hpt neg vpt neg V hpt vpt neg V
  hpt vpt V hpt neg vpt V Opaque stroke} def
/BoxW {stroke [] 0 setdash exch hpt sub exch vpt add M
  0 vpt2 neg V hpt2 0 V 0 vpt2 V
  hpt2 neg 0 V Opaque stroke} def
/TriUW {stroke [] 0 setdash vpt 1.12 mul add M
  hpt neg vpt -1.62 mul V
  hpt 2 mul 0 V
  hpt neg vpt 1.62 mul V Opaque stroke} def
/TriDW {stroke [] 0 setdash vpt 1.12 mul sub M
  hpt neg vpt 1.62 mul V
  hpt 2 mul 0 V
  hpt neg vpt -1.62 mul V Opaque stroke} def
/PentW {stroke [] 0 setdash gsave
  translate 0 hpt M 4 {72 rotate 0 hpt L} repeat
  Opaque stroke grestore} def
/CircW {stroke [] 0 setdash 
  hpt 0 360 arc Opaque stroke} def
/BoxFill {gsave Rec 1 setgray fill grestore} def
/Density {
  /Fillden exch def
  currentrgbcolor
  /ColB exch def /ColG exch def /ColR exch def
  /ColR ColR Fillden mul Fillden sub 1 add def
  /ColG ColG Fillden mul Fillden sub 1 add def
  /ColB ColB Fillden mul Fillden sub 1 add def
  ColR ColG ColB setrgbcolor} def
/BoxColFill {gsave Rec PolyFill} def
/PolyFill {gsave Density fill grestore grestore} def
/h {rlineto rlineto rlineto gsave closepath fill grestore} bind def
%
% PostScript Level 1 Pattern Fill routine for rectangles
% Usage: x y w h s a XX PatternFill
%	x,y = lower left corner of box to be filled
%	w,h = width and height of box
%	  a = angle in degrees between lines and x-axis
%	 XX = 0/1 for no/yes cross-hatch
%
/PatternFill {gsave /PFa [ 9 2 roll ] def
  PFa 0 get PFa 2 get 2 div add PFa 1 get PFa 3 get 2 div add translate
  PFa 2 get -2 div PFa 3 get -2 div PFa 2 get PFa 3 get Rec
  TransparentPatterns {} {gsave 1 setgray fill grestore} ifelse
  clip
  currentlinewidth 0.5 mul setlinewidth
  /PFs PFa 2 get dup mul PFa 3 get dup mul add sqrt def
  0 0 M PFa 5 get rotate PFs -2 div dup translate
  0 1 PFs PFa 4 get div 1 add floor cvi
	{PFa 4 get mul 0 M 0 PFs V} for
  0 PFa 6 get ne {
	0 1 PFs PFa 4 get div 1 add floor cvi
	{PFa 4 get mul 0 2 1 roll M PFs 0 V} for
 } if
  stroke grestore} def
%
/languagelevel where
 {pop languagelevel} {1} ifelse
 2 lt
	{/InterpretLevel1 true def}
	{/InterpretLevel1 Level1 def}
 ifelse
%
% PostScript level 2 pattern fill definitions
%
/Level2PatternFill {
/Tile8x8 {/PaintType 2 /PatternType 1 /TilingType 1 /BBox [0 0 8 8] /XStep 8 /YStep 8}
	bind def
/KeepColor {currentrgbcolor [/Pattern /DeviceRGB] setcolorspace} bind def
<< Tile8x8
 /PaintProc {0.5 setlinewidth pop 0 0 M 8 8 L 0 8 M 8 0 L stroke} 
>> matrix makepattern
/Pat1 exch def
<< Tile8x8
 /PaintProc {0.5 setlinewidth pop 0 0 M 8 8 L 0 8 M 8 0 L stroke
	0 4 M 4 8 L 8 4 L 4 0 L 0 4 L stroke}
>> matrix makepattern
/Pat2 exch def
<< Tile8x8
 /PaintProc {0.5 setlinewidth pop 0 0 M 0 8 L
	8 8 L 8 0 L 0 0 L fill}
>> matrix makepattern
/Pat3 exch def
<< Tile8x8
 /PaintProc {0.5 setlinewidth pop -4 8 M 8 -4 L
	0 12 M 12 0 L stroke}
>> matrix makepattern
/Pat4 exch def
<< Tile8x8
 /PaintProc {0.5 setlinewidth pop -4 0 M 8 12 L
	0 -4 M 12 8 L stroke}
>> matrix makepattern
/Pat5 exch def
<< Tile8x8
 /PaintProc {0.5 setlinewidth pop -2 8 M 4 -4 L
	0 12 M 8 -4 L 4 12 M 10 0 L stroke}
>> matrix makepattern
/Pat6 exch def
<< Tile8x8
 /PaintProc {0.5 setlinewidth pop -2 0 M 4 12 L
	0 -4 M 8 12 L 4 -4 M 10 8 L stroke}
>> matrix makepattern
/Pat7 exch def
<< Tile8x8
 /PaintProc {0.5 setlinewidth pop 8 -2 M -4 4 L
	12 0 M -4 8 L 12 4 M 0 10 L stroke}
>> matrix makepattern
/Pat8 exch def
<< Tile8x8
 /PaintProc {0.5 setlinewidth pop 0 -2 M 12 4 L
	-4 0 M 12 8 L -4 4 M 8 10 L stroke}
>> matrix makepattern
/Pat9 exch def
/Pattern1 {PatternBgnd KeepColor Pat1 setpattern} bind def
/Pattern2 {PatternBgnd KeepColor Pat2 setpattern} bind def
/Pattern3 {PatternBgnd KeepColor Pat3 setpattern} bind def
/Pattern4 {PatternBgnd KeepColor Landscape {Pat5} {Pat4} ifelse setpattern} bind def
/Pattern5 {PatternBgnd KeepColor Landscape {Pat4} {Pat5} ifelse setpattern} bind def
/Pattern6 {PatternBgnd KeepColor Landscape {Pat9} {Pat6} ifelse setpattern} bind def
/Pattern7 {PatternBgnd KeepColor Landscape {Pat8} {Pat7} ifelse setpattern} bind def
} def
%
%
%End of PostScript Level 2 code
%
/PatternBgnd {
  TransparentPatterns {} {gsave 1 setgray fill grestore} ifelse
} def
%
% Substitute for Level 2 pattern fill codes with
% grayscale if Level 2 support is not selected.
%
/Level1PatternFill {
/Pattern1 {0.250 Density} bind def
/Pattern2 {0.500 Density} bind def
/Pattern3 {0.750 Density} bind def
/Pattern4 {0.125 Density} bind def
/Pattern5 {0.375 Density} bind def
/Pattern6 {0.625 Density} bind def
/Pattern7 {0.875 Density} bind def
} def
%
% Now test for support of Level 2 code
%
Level1 {Level1PatternFill} {Level2PatternFill} ifelse
%
/Symbol-Oblique /Symbol findfont [1 0 .167 1 0 0] makefont
dup length dict begin {1 index /FID eq {pop pop} {def} ifelse} forall
currentdict end definefont pop
Level1 SuppressPDFMark or 
{} {
/SDict 10 dict def
systemdict /pdfmark known not {
  userdict /pdfmark systemdict /cleartomark get put
} if
SDict begin [
  /Title (gitter.tex)
  /Subject (gnuplot plot)
  /Creator (gnuplot 4.6 patchlevel 5)
  /Author (kevin.luedemann)
%  /Producer (gnuplot)
%  /Keywords ()
  /CreationDate (Tue Mar 17 17:16:13 2015)
  /DOCINFO pdfmark
end
} ifelse
end
%%EndProlog
%%Page: 1 1
gnudict begin
gsave
doclip
50 50 translate
0.050 0.050 scale
0 setgray
newpath
1.000 UL
LTb
LCb setrgbcolor
1078 704 M
63 0 V
5662 0 R
-63 0 V
stroke
LTb
1078 1111 M
63 0 V
5662 0 R
-63 0 V
1078 1518 M
63 0 V
5662 0 R
-63 0 V
1078 1925 M
63 0 V
5662 0 R
-63 0 V
1078 2332 M
63 0 V
5662 0 R
-63 0 V
1078 2740 M
63 0 V
5662 0 R
-63 0 V
1078 3147 M
63 0 V
5662 0 R
-63 0 V
1078 3554 M
63 0 V
5662 0 R
-63 0 V
1078 3961 M
63 0 V
5662 0 R
-63 0 V
1078 4368 M
63 0 V
5662 0 R
-63 0 V
1078 4775 M
63 0 V
5662 0 R
-63 0 V
1078 704 M
0 63 V
0 4008 R
0 -63 V
1794 704 M
0 63 V
0 4008 R
0 -63 V
2509 704 M
0 63 V
0 4008 R
0 -63 V
3225 704 M
0 63 V
0 4008 R
0 -63 V
3941 704 M
0 63 V
0 4008 R
0 -63 V
4656 704 M
0 63 V
0 4008 R
0 -63 V
5372 704 M
0 63 V
0 4008 R
0 -63 V
6087 704 M
0 63 V
0 4008 R
0 -63 V
6803 704 M
0 63 V
0 4008 R
0 -63 V
stroke
1078 4775 N
0 -4071 V
5725 0 V
0 4071 V
-5725 0 V
Z stroke
1.000 UP
1.000 UL
LTb
1.000 UP
1.000 UL
LT0
LC0 setrgbcolor
LCb setrgbcolor
LT0
LC0 setrgbcolor
3695 763 Pls
3704 763 Pls
3713 773 Pls
3722 773 Pls
3731 784 Pls
3740 794 Pls
3749 804 Pls
3758 804 Pls
3767 794 Pls
3776 773 Pls
3785 753 Pls
3794 753 Pls
3803 753 Pls
3812 753 Pls
3821 773 Pls
3830 773 Pls
3839 804 Pls
3847 867 Pls
3856 939 Pls
3865 1022 Pls
3874 1116 Pls
3883 1188 Pls
3892 1219 Pls
3901 1271 Pls
3910 1375 Pls
3919 1551 Pls
3928 1738 Pls
3937 1862 Pls
3946 1842 Pls
3955 1645 Pls
3964 1313 Pls
3973 1064 Pls
3982 970 Pls
3991 1053 Pls
4000 1157 Pls
4008 1282 Pls
4017 1354 Pls
4026 1468 Pls
4035 1665 Pls
4044 2018 Pls
4053 2412 Pls
4062 2568 Pls
4071 2671 Pls
4080 2765 Pls
4089 3066 Pls
4098 3646 Pls
4107 4196 Pls
4116 4559 Pls
4125 4300 Pls
4134 3543 Pls
4143 2329 Pls
4152 1728 Pls
4161 1323 Pls
4170 1167 Pls
4178 1167 Pls
4187 1126 Pls
4196 1022 Pls
4205 991 Pls
4214 1053 Pls
4223 1188 Pls
4232 1261 Pls
4241 1282 Pls
4250 1250 Pls
4259 1271 Pls
4268 1416 Pls
4277 1603 Pls
4286 1728 Pls
4295 1717 Pls
4304 1572 Pls
4313 1365 Pls
4322 1167 Pls
4331 929 Pls
4339 836 Pls
4348 794 Pls
4357 763 Pls
4366 753 Pls
4375 753 Pls
4384 753 Pls
4393 763 Pls
4402 763 Pls
4411 763 Pls
4420 773 Pls
4429 773 Pls
4438 794 Pls
6243 4602 Pls
1.000 UP
1.000 UL
LT0
4442 793 Pls
4447 796 Pls
4451 799 Pls
4456 801 Pls
4460 803 Pls
4465 803 Pls
4469 801 Pls
4474 797 Pls
4478 790 Pls
4483 781 Pls
4487 771 Pls
4492 763 Pls
4496 754 Pls
4500 746 Pls
4505 741 Pls
4509 738 Pls
4514 737 Pls
4518 736 Pls
4523 736 Pls
4527 736 Pls
4532 737 Pls
4536 737 Pls
4541 736 Pls
4545 735 Pls
4550 735 Pls
4554 737 Pls
4559 738 Pls
4563 742 Pls
4568 744 Pls
4572 747 Pls
4577 748 Pls
4581 749 Pls
4585 749 Pls
4590 748 Pls
4594 748 Pls
4599 748 Pls
4603 747 Pls
4608 750 Pls
4612 756 Pls
4617 761 Pls
4621 766 Pls
4626 770 Pls
4630 772 Pls
4635 773 Pls
4639 772 Pls
4644 769 Pls
4648 766 Pls
4653 763 Pls
4657 759 Pls
4661 754 Pls
4666 751 Pls
4670 748 Pls
4675 744 Pls
4679 742 Pls
4684 738 Pls
4688 736 Pls
4693 733 Pls
4697 733 Pls
4702 732 Pls
4706 732 Pls
4711 733 Pls
4715 735 Pls
4720 736 Pls
4724 737 Pls
4729 738 Pls
4733 739 Pls
4738 740 Pls
4742 742 Pls
4746 743 Pls
4751 744 Pls
4755 746 Pls
4760 747 Pls
4764 749 Pls
4769 752 Pls
4773 754 Pls
4778 758 Pls
4782 761 Pls
4787 765 Pls
4791 768 Pls
4796 772 Pls
4800 776 Pls
4805 778 Pls
4809 780 Pls
4814 780 Pls
4818 779 Pls
4823 774 Pls
4827 769 Pls
4831 763 Pls
4836 756 Pls
4840 748 Pls
4845 743 Pls
4849 739 Pls
4854 735 Pls
4858 732 Pls
4863 731 Pls
4867 730 Pls
4872 730 Pls
4876 730 Pls
4881 728 Pls
4885 726 Pls
4890 726 Pls
4894 726 Pls
4899 726 Pls
4903 726 Pls
4907 725 Pls
4912 724 Pls
4916 728 Pls
4921 729 Pls
4925 728 Pls
4930 728 Pls
4934 728 Pls
4939 729 Pls
4943 726 Pls
4948 726 Pls
4952 728 Pls
4957 728 Pls
4961 729 Pls
4966 729 Pls
4970 729 Pls
4975 729 Pls
4979 728 Pls
4984 726 Pls
4988 723 Pls
4992 724 Pls
4997 725 Pls
5001 726 Pls
5006 725 Pls
5010 726 Pls
5015 726 Pls
5019 726 Pls
5024 726 Pls
5028 726 Pls
5033 726 Pls
5037 726 Pls
5042 723 Pls
5046 726 Pls
5051 726 Pls
5055 728 Pls
5060 728 Pls
5064 728 Pls
5069 728 Pls
5073 728 Pls
5077 729 Pls
5082 731 Pls
5086 729 Pls
5091 726 Pls
5095 726 Pls
5100 726 Pls
5104 728 Pls
5109 728 Pls
5113 729 Pls
5118 730 Pls
5122 731 Pls
5127 732 Pls
5131 734 Pls
5136 738 Pls
5140 741 Pls
5145 743 Pls
5149 746 Pls
5153 748 Pls
5158 747 Pls
5162 746 Pls
5167 746 Pls
5171 744 Pls
5176 742 Pls
5180 740 Pls
5185 738 Pls
5189 735 Pls
5194 732 Pls
5198 731 Pls
5203 729 Pls
5207 728 Pls
5212 726 Pls
5216 725 Pls
5221 725 Pls
5225 724 Pls
5230 724 Pls
5234 724 Pls
5238 723 Pls
5243 724 Pls
5247 724 Pls
5252 724 Pls
5256 724 Pls
5261 724 Pls
5265 725 Pls
5270 724 Pls
5274 725 Pls
5279 726 Pls
5283 726 Pls
5288 726 Pls
5292 726 Pls
5297 728 Pls
5301 729 Pls
5306 730 Pls
5310 730 Pls
5315 731 Pls
5319 731 Pls
5323 731 Pls
5328 732 Pls
5332 731 Pls
1.000 UP
1.000 UL
LT0
5337 731 Pls
5341 732 Pls
5346 731 Pls
5350 731 Pls
5355 730 Pls
5359 729 Pls
5364 728 Pls
5368 727 Pls
5373 727 Pls
5377 727 Pls
5382 727 Pls
5386 727 Pls
5391 727 Pls
5395 727 Pls
5399 727 Pls
5404 727 Pls
5408 726 Pls
5413 726 Pls
5417 726 Pls
5422 726 Pls
5426 726 Pls
5431 725 Pls
5435 726 Pls
5440 726 Pls
5444 726 Pls
5449 726 Pls
5453 726 Pls
5458 725 Pls
5462 726 Pls
5467 726 Pls
5471 726 Pls
5476 726 Pls
5480 727 Pls
5484 727 Pls
5489 728 Pls
5493 728 Pls
5498 729 Pls
5502 729 Pls
5507 730 Pls
5511 730 Pls
5516 730 Pls
5520 730 Pls
5525 730 Pls
5529 730 Pls
5534 730 Pls
5538 729 Pls
5543 729 Pls
5547 728 Pls
5552 727 Pls
5556 727 Pls
5560 726 Pls
5565 726 Pls
5569 726 Pls
5574 726 Pls
5578 727 Pls
5583 727 Pls
5587 727 Pls
5592 727 Pls
5596 727 Pls
5601 727 Pls
5605 727 Pls
5610 724 Pls
5614 728 Pls
5619 727 Pls
5623 728 Pls
5628 729 Pls
5632 729 Pls
5637 729 Pls
5641 730 Pls
5645 730 Pls
5650 730 Pls
5654 731 Pls
5659 732 Pls
5663 732 Pls
5668 733 Pls
5672 733 Pls
5677 733 Pls
5681 734 Pls
5686 734 Pls
5690 733 Pls
5695 733 Pls
5699 732 Pls
5704 731 Pls
5708 730 Pls
5713 730 Pls
5717 728 Pls
5722 727 Pls
5726 727 Pls
5730 727 Pls
5735 727 Pls
5739 727 Pls
5744 727 Pls
5748 727 Pls
5753 727 Pls
5757 726 Pls
5762 726 Pls
5766 726 Pls
5771 726 Pls
5775 726 Pls
5780 727 Pls
5784 727 Pls
5789 727 Pls
5793 727 Pls
5798 727 Pls
5802 727 Pls
5806 727 Pls
5811 727 Pls
5815 727 Pls
5820 727 Pls
5824 727 Pls
5829 728 Pls
5833 728 Pls
5838 728 Pls
5842 728 Pls
5847 728 Pls
5851 728 Pls
5856 728 Pls
5860 727 Pls
5865 727 Pls
5869 727 Pls
5874 727 Pls
5878 726 Pls
5883 726 Pls
5887 726 Pls
5891 727 Pls
5896 727 Pls
5900 728 Pls
5905 728 Pls
5909 728 Pls
5914 728 Pls
5918 729 Pls
5923 729 Pls
5927 729 Pls
5932 729 Pls
5936 729 Pls
5941 730 Pls
5945 729 Pls
5950 730 Pls
5954 730 Pls
5959 730 Pls
5963 730 Pls
5968 730 Pls
5972 729 Pls
5976 729 Pls
5981 730 Pls
5985 730 Pls
5990 730 Pls
5994 730 Pls
5999 730 Pls
6003 730 Pls
6008 731 Pls
6012 731 Pls
6017 732 Pls
6021 732 Pls
6026 732 Pls
6030 732 Pls
6035 733 Pls
6039 730 Pls
6044 726 Pls
6048 726 Pls
6052 731 Pls
6057 731 Pls
6061 730 Pls
6066 725 Pls
6070 725 Pls
6075 724 Pls
6079 728 Pls
6084 728 Pls
6088 727 Pls
6093 728 Pls
6097 728 Pls
6102 727 Pls
6106 728 Pls
6111 728 Pls
6115 729 Pls
6120 728 Pls
6124 728 Pls
6129 728 Pls
6133 729 Pls
6137 729 Pls
6142 729 Pls
6146 729 Pls
6151 729 Pls
6155 729 Pls
6160 729 Pls
6164 729 Pls
6169 730 Pls
6173 730 Pls
6178 730 Pls
6182 730 Pls
6187 730 Pls
6191 730 Pls
6196 730 Pls
6200 730 Pls
6205 730 Pls
6209 729 Pls
6214 729 Pls
6218 729 Pls
6222 729 Pls
6227 729 Pls
1.000 UP
1.000 UL
LT0
1512 726 Pls
1516 726 Pls
1521 725 Pls
1525 725 Pls
1530 725 Pls
1534 725 Pls
1539 725 Pls
1543 725 Pls
1548 725 Pls
1552 725 Pls
1557 725 Pls
1561 725 Pls
1566 725 Pls
1570 725 Pls
1574 726 Pls
1579 726 Pls
1583 726 Pls
1588 726 Pls
1592 726 Pls
1597 726 Pls
1601 727 Pls
1606 727 Pls
1610 727 Pls
1615 727 Pls
1619 727 Pls
1624 727 Pls
1628 727 Pls
1633 727 Pls
1637 727 Pls
1642 727 Pls
1646 727 Pls
1.000 UP
1.000 UL
LT0
1653 727 Pls
1660 727 Pls
1667 726 Pls
1675 727 Pls
1682 727 Pls
1689 726 Pls
1696 727 Pls
1703 727 Pls
1710 727 Pls
1718 727 Pls
1725 727 Pls
1732 726 Pls
1739 726 Pls
1746 726 Pls
1753 726 Pls
1761 727 Pls
1768 726 Pls
1775 726 Pls
1782 725 Pls
1789 724 Pls
1796 725 Pls
1803 727 Pls
1811 726 Pls
1818 726 Pls
1825 726 Pls
1832 727 Pls
1839 727 Pls
1846 728 Pls
1854 728 Pls
1861 727 Pls
1868 727 Pls
1875 727 Pls
1882 726 Pls
1889 727 Pls
1896 727 Pls
1904 727 Pls
1911 727 Pls
1918 727 Pls
1925 727 Pls
1932 726 Pls
1939 728 Pls
1947 725 Pls
1954 727 Pls
1961 727 Pls
1968 727 Pls
1975 727 Pls
1982 725 Pls
1990 727 Pls
1997 727 Pls
2004 726 Pls
2011 727 Pls
2018 727 Pls
2025 727 Pls
2032 727 Pls
2040 727 Pls
2047 727 Pls
2054 726 Pls
2061 726 Pls
2068 726 Pls
2075 726 Pls
2083 726 Pls
2090 726 Pls
2097 726 Pls
2104 727 Pls
2111 726 Pls
2118 727 Pls
2125 727 Pls
2133 727 Pls
2140 728 Pls
2147 728 Pls
2154 728 Pls
2161 727 Pls
2168 728 Pls
2176 728 Pls
2183 728 Pls
2190 729 Pls
2197 728 Pls
2204 727 Pls
2211 727 Pls
2219 726 Pls
2226 726 Pls
2233 726 Pls
2240 726 Pls
2247 726 Pls
2254 726 Pls
2261 727 Pls
2269 727 Pls
2276 727 Pls
2283 727 Pls
2290 727 Pls
2297 727 Pls
2304 726 Pls
2312 725 Pls
2319 726 Pls
2326 726 Pls
2333 726 Pls
2340 726 Pls
2347 725 Pls
2354 725 Pls
2362 726 Pls
2369 726 Pls
2376 726 Pls
2383 727 Pls
2390 727 Pls
2397 727 Pls
2405 727 Pls
2412 728 Pls
2419 727 Pls
2426 728 Pls
2433 728 Pls
2440 728 Pls
2448 728 Pls
2455 729 Pls
2462 729 Pls
2469 729 Pls
2476 730 Pls
2483 730 Pls
2490 730 Pls
2498 730 Pls
2505 730 Pls
2512 730 Pls
2519 730 Pls
2526 730 Pls
2533 730 Pls
2541 730 Pls
2548 730 Pls
2555 729 Pls
2562 729 Pls
2569 728 Pls
2576 728 Pls
2583 728 Pls
2591 727 Pls
2598 727 Pls
2605 728 Pls
2612 727 Pls
2619 727 Pls
2626 728 Pls
2634 728 Pls
2641 728 Pls
2648 728 Pls
2655 728 Pls
2662 728 Pls
2669 729 Pls
2677 729 Pls
2684 727 Pls
2691 728 Pls
2698 728 Pls
2705 729 Pls
2712 729 Pls
2719 730 Pls
2727 728 Pls
2734 728 Pls
2741 727 Pls
2748 727 Pls
2755 727 Pls
2762 727 Pls
2770 727 Pls
2777 728 Pls
2784 727 Pls
2791 727 Pls
2798 727 Pls
2805 727 Pls
2812 726 Pls
2820 726 Pls
2827 726 Pls
2834 727 Pls
2841 727 Pls
2848 727 Pls
2855 727 Pls
2863 727 Pls
2870 727 Pls
2877 727 Pls
2884 727 Pls
2891 727 Pls
2898 726 Pls
2906 726 Pls
2913 725 Pls
2920 725 Pls
2927 724 Pls
2934 725 Pls
2941 725 Pls
2948 725 Pls
2956 726 Pls
2963 726 Pls
2970 726 Pls
2977 727 Pls
2984 729 Pls
2991 729 Pls
2999 731 Pls
3006 733 Pls
3013 733 Pls
3020 734 Pls
3027 734 Pls
3034 734 Pls
3041 735 Pls
3049 737 Pls
3056 738 Pls
3063 740 Pls
3070 740 Pls
3077 738 Pls
3084 736 Pls
3092 733 Pls
3099 730 Pls
3106 728 Pls
3113 727 Pls
3120 727 Pls
3127 728 Pls
3135 728 Pls
3142 728 Pls
3149 727 Pls
3156 726 Pls
3163 725 Pls
3170 725 Pls
3177 726 Pls
3185 726 Pls
3192 726 Pls
3199 726 Pls
3206 726 Pls
3213 726 Pls
3220 725 Pls
3228 726 Pls
3235 726 Pls
3242 727 Pls
3249 727 Pls
3256 728 Pls
3263 727 Pls
3270 727 Pls
3278 728 Pls
3285 728 Pls
3292 729 Pls
3299 730 Pls
3306 732 Pls
3313 733 Pls
3321 734 Pls
3328 736 Pls
3335 738 Pls
3342 741 Pls
3349 745 Pls
3356 747 Pls
3364 749 Pls
3371 749 Pls
3378 750 Pls
3385 751 Pls
3392 754 Pls
3399 758 Pls
3406 762 Pls
3414 763 Pls
3421 760 Pls
3428 755 Pls
3435 749 Pls
3442 742 Pls
3449 736 Pls
3457 733 Pls
3464 732 Pls
3471 731 Pls
3478 730 Pls
3485 731 Pls
3492 731 Pls
3499 731 Pls
3507 732 Pls
3514 733 Pls
3521 735 Pls
3528 737 Pls
3535 740 Pls
3542 742 Pls
3550 744 Pls
3557 746 Pls
3564 748 Pls
3571 750 Pls
3578 755 Pls
3585 761 Pls
3593 766 Pls
3600 771 Pls
3607 771 Pls
3614 765 Pls
3621 755 Pls
3628 745 Pls
3635 739 Pls
3643 738 Pls
3650 741 Pls
3657 745 Pls
3664 748 Pls
3671 749 Pls
3678 748 Pls
3686 747 Pls
3693 750 Pls
3700 755 Pls
3707 764 Pls
3714 769 Pls
3721 771 Pls
3728 771 Pls
3736 771 Pls
3743 772 Pls
3750 777 Pls
3757 785 Pls
3764 788 Pls
3771 785 Pls
3779 775 Pls
3786 752 Pls
3793 749 Pls
3800 745 Pls
3807 745 Pls
3814 744 Pls
3822 754 Pls
3829 765 Pls
3836 781 Pls
3843 805 Pls
3850 837 Pls
3857 874 Pls
3864 918 Pls
3872 918 Pls
1.000 UL
LTb
LCb setrgbcolor
1078 4775 N
0 -4071 V
5725 0 V
0 4071 V
-5725 0 V
Z stroke
1.000 UP
1.000 UL
LTb
stroke
grestore
end
showpage
%%Trailer
