%!PS-Adobe-2.0 EPSF-2.0
%%Title: loch.tex
%%Creator: gnuplot 4.6 patchlevel 5
%%CreationDate: Tue Mar 17 17:16:14 2015
%%DocumentFonts: 
%%BoundingBox: 50 50 410 302
%%EndComments
%%BeginProlog
/gnudict 256 dict def
gnudict begin
%
% The following true/false flags may be edited by hand if desired.
% The unit line width and grayscale image gamma correction may also be changed.
%
/Color true def
/Blacktext true def
/Solid false def
/Dashlength 1 def
/Landscape false def
/Level1 false def
/Rounded false def
/ClipToBoundingBox false def
/SuppressPDFMark false def
/TransparentPatterns false def
/gnulinewidth 5.000 def
/userlinewidth gnulinewidth def
/Gamma 1.0 def
/BackgroundColor {-1.000 -1.000 -1.000} def
%
/vshift -73 def
/dl1 {
  10.0 Dashlength mul mul
  Rounded { currentlinewidth 0.75 mul sub dup 0 le { pop 0.01 } if } if
} def
/dl2 {
  10.0 Dashlength mul mul
  Rounded { currentlinewidth 0.75 mul add } if
} def
/hpt_ 31.5 def
/vpt_ 31.5 def
/hpt hpt_ def
/vpt vpt_ def
/doclip {
  ClipToBoundingBox {
    newpath 50 50 moveto 410 50 lineto 410 302 lineto 50 302 lineto closepath
    clip
  } if
} def
%
% Gnuplot Prolog Version 4.6 (September 2012)
%
%/SuppressPDFMark true def
%
/M {moveto} bind def
/L {lineto} bind def
/R {rmoveto} bind def
/V {rlineto} bind def
/N {newpath moveto} bind def
/Z {closepath} bind def
/C {setrgbcolor} bind def
/f {rlineto fill} bind def
/g {setgray} bind def
/Gshow {show} def   % May be redefined later in the file to support UTF-8
/vpt2 vpt 2 mul def
/hpt2 hpt 2 mul def
/Lshow {currentpoint stroke M 0 vshift R 
	Blacktext {gsave 0 setgray show grestore} {show} ifelse} def
/Rshow {currentpoint stroke M dup stringwidth pop neg vshift R
	Blacktext {gsave 0 setgray show grestore} {show} ifelse} def
/Cshow {currentpoint stroke M dup stringwidth pop -2 div vshift R 
	Blacktext {gsave 0 setgray show grestore} {show} ifelse} def
/UP {dup vpt_ mul /vpt exch def hpt_ mul /hpt exch def
  /hpt2 hpt 2 mul def /vpt2 vpt 2 mul def} def
/DL {Color {setrgbcolor Solid {pop []} if 0 setdash}
 {pop pop pop 0 setgray Solid {pop []} if 0 setdash} ifelse} def
/BL {stroke userlinewidth 2 mul setlinewidth
	Rounded {1 setlinejoin 1 setlinecap} if} def
/AL {stroke userlinewidth 2 div setlinewidth
	Rounded {1 setlinejoin 1 setlinecap} if} def
/UL {dup gnulinewidth mul /userlinewidth exch def
	dup 1 lt {pop 1} if 10 mul /udl exch def} def
/PL {stroke userlinewidth setlinewidth
	Rounded {1 setlinejoin 1 setlinecap} if} def
3.8 setmiterlimit
% Default Line colors
/LCw {1 1 1} def
/LCb {0 0 0} def
/LCa {0 0 0} def
/LC0 {1 0 0} def
/LC1 {0 1 0} def
/LC2 {0 0 1} def
/LC3 {1 0 1} def
/LC4 {0 1 1} def
/LC5 {1 1 0} def
/LC6 {0 0 0} def
/LC7 {1 0.3 0} def
/LC8 {0.5 0.5 0.5} def
% Default Line Types
/LTw {PL [] 1 setgray} def
/LTb {BL [] LCb DL} def
/LTa {AL [1 udl mul 2 udl mul] 0 setdash LCa setrgbcolor} def
/LT0 {PL [] LC0 DL} def
/LT1 {PL [4 dl1 2 dl2] LC1 DL} def
/LT2 {PL [2 dl1 3 dl2] LC2 DL} def
/LT3 {PL [1 dl1 1.5 dl2] LC3 DL} def
/LT4 {PL [6 dl1 2 dl2 1 dl1 2 dl2] LC4 DL} def
/LT5 {PL [3 dl1 3 dl2 1 dl1 3 dl2] LC5 DL} def
/LT6 {PL [2 dl1 2 dl2 2 dl1 6 dl2] LC6 DL} def
/LT7 {PL [1 dl1 2 dl2 6 dl1 2 dl2 1 dl1 2 dl2] LC7 DL} def
/LT8 {PL [2 dl1 2 dl2 2 dl1 2 dl2 2 dl1 2 dl2 2 dl1 4 dl2] LC8 DL} def
/Pnt {stroke [] 0 setdash gsave 1 setlinecap M 0 0 V stroke grestore} def
/Dia {stroke [] 0 setdash 2 copy vpt add M
  hpt neg vpt neg V hpt vpt neg V
  hpt vpt V hpt neg vpt V closepath stroke
  Pnt} def
/Pls {stroke [] 0 setdash vpt sub M 0 vpt2 V
  currentpoint stroke M
  hpt neg vpt neg R hpt2 0 V stroke
 } def
/Box {stroke [] 0 setdash 2 copy exch hpt sub exch vpt add M
  0 vpt2 neg V hpt2 0 V 0 vpt2 V
  hpt2 neg 0 V closepath stroke
  Pnt} def
/Crs {stroke [] 0 setdash exch hpt sub exch vpt add M
  hpt2 vpt2 neg V currentpoint stroke M
  hpt2 neg 0 R hpt2 vpt2 V stroke} def
/TriU {stroke [] 0 setdash 2 copy vpt 1.12 mul add M
  hpt neg vpt -1.62 mul V
  hpt 2 mul 0 V
  hpt neg vpt 1.62 mul V closepath stroke
  Pnt} def
/Star {2 copy Pls Crs} def
/BoxF {stroke [] 0 setdash exch hpt sub exch vpt add M
  0 vpt2 neg V hpt2 0 V 0 vpt2 V
  hpt2 neg 0 V closepath fill} def
/TriUF {stroke [] 0 setdash vpt 1.12 mul add M
  hpt neg vpt -1.62 mul V
  hpt 2 mul 0 V
  hpt neg vpt 1.62 mul V closepath fill} def
/TriD {stroke [] 0 setdash 2 copy vpt 1.12 mul sub M
  hpt neg vpt 1.62 mul V
  hpt 2 mul 0 V
  hpt neg vpt -1.62 mul V closepath stroke
  Pnt} def
/TriDF {stroke [] 0 setdash vpt 1.12 mul sub M
  hpt neg vpt 1.62 mul V
  hpt 2 mul 0 V
  hpt neg vpt -1.62 mul V closepath fill} def
/DiaF {stroke [] 0 setdash vpt add M
  hpt neg vpt neg V hpt vpt neg V
  hpt vpt V hpt neg vpt V closepath fill} def
/Pent {stroke [] 0 setdash 2 copy gsave
  translate 0 hpt M 4 {72 rotate 0 hpt L} repeat
  closepath stroke grestore Pnt} def
/PentF {stroke [] 0 setdash gsave
  translate 0 hpt M 4 {72 rotate 0 hpt L} repeat
  closepath fill grestore} def
/Circle {stroke [] 0 setdash 2 copy
  hpt 0 360 arc stroke Pnt} def
/CircleF {stroke [] 0 setdash hpt 0 360 arc fill} def
/C0 {BL [] 0 setdash 2 copy moveto vpt 90 450 arc} bind def
/C1 {BL [] 0 setdash 2 copy moveto
	2 copy vpt 0 90 arc closepath fill
	vpt 0 360 arc closepath} bind def
/C2 {BL [] 0 setdash 2 copy moveto
	2 copy vpt 90 180 arc closepath fill
	vpt 0 360 arc closepath} bind def
/C3 {BL [] 0 setdash 2 copy moveto
	2 copy vpt 0 180 arc closepath fill
	vpt 0 360 arc closepath} bind def
/C4 {BL [] 0 setdash 2 copy moveto
	2 copy vpt 180 270 arc closepath fill
	vpt 0 360 arc closepath} bind def
/C5 {BL [] 0 setdash 2 copy moveto
	2 copy vpt 0 90 arc
	2 copy moveto
	2 copy vpt 180 270 arc closepath fill
	vpt 0 360 arc} bind def
/C6 {BL [] 0 setdash 2 copy moveto
	2 copy vpt 90 270 arc closepath fill
	vpt 0 360 arc closepath} bind def
/C7 {BL [] 0 setdash 2 copy moveto
	2 copy vpt 0 270 arc closepath fill
	vpt 0 360 arc closepath} bind def
/C8 {BL [] 0 setdash 2 copy moveto
	2 copy vpt 270 360 arc closepath fill
	vpt 0 360 arc closepath} bind def
/C9 {BL [] 0 setdash 2 copy moveto
	2 copy vpt 270 450 arc closepath fill
	vpt 0 360 arc closepath} bind def
/C10 {BL [] 0 setdash 2 copy 2 copy moveto vpt 270 360 arc closepath fill
	2 copy moveto
	2 copy vpt 90 180 arc closepath fill
	vpt 0 360 arc closepath} bind def
/C11 {BL [] 0 setdash 2 copy moveto
	2 copy vpt 0 180 arc closepath fill
	2 copy moveto
	2 copy vpt 270 360 arc closepath fill
	vpt 0 360 arc closepath} bind def
/C12 {BL [] 0 setdash 2 copy moveto
	2 copy vpt 180 360 arc closepath fill
	vpt 0 360 arc closepath} bind def
/C13 {BL [] 0 setdash 2 copy moveto
	2 copy vpt 0 90 arc closepath fill
	2 copy moveto
	2 copy vpt 180 360 arc closepath fill
	vpt 0 360 arc closepath} bind def
/C14 {BL [] 0 setdash 2 copy moveto
	2 copy vpt 90 360 arc closepath fill
	vpt 0 360 arc} bind def
/C15 {BL [] 0 setdash 2 copy vpt 0 360 arc closepath fill
	vpt 0 360 arc closepath} bind def
/Rec {newpath 4 2 roll moveto 1 index 0 rlineto 0 exch rlineto
	neg 0 rlineto closepath} bind def
/Square {dup Rec} bind def
/Bsquare {vpt sub exch vpt sub exch vpt2 Square} bind def
/S0 {BL [] 0 setdash 2 copy moveto 0 vpt rlineto BL Bsquare} bind def
/S1 {BL [] 0 setdash 2 copy vpt Square fill Bsquare} bind def
/S2 {BL [] 0 setdash 2 copy exch vpt sub exch vpt Square fill Bsquare} bind def
/S3 {BL [] 0 setdash 2 copy exch vpt sub exch vpt2 vpt Rec fill Bsquare} bind def
/S4 {BL [] 0 setdash 2 copy exch vpt sub exch vpt sub vpt Square fill Bsquare} bind def
/S5 {BL [] 0 setdash 2 copy 2 copy vpt Square fill
	exch vpt sub exch vpt sub vpt Square fill Bsquare} bind def
/S6 {BL [] 0 setdash 2 copy exch vpt sub exch vpt sub vpt vpt2 Rec fill Bsquare} bind def
/S7 {BL [] 0 setdash 2 copy exch vpt sub exch vpt sub vpt vpt2 Rec fill
	2 copy vpt Square fill Bsquare} bind def
/S8 {BL [] 0 setdash 2 copy vpt sub vpt Square fill Bsquare} bind def
/S9 {BL [] 0 setdash 2 copy vpt sub vpt vpt2 Rec fill Bsquare} bind def
/S10 {BL [] 0 setdash 2 copy vpt sub vpt Square fill 2 copy exch vpt sub exch vpt Square fill
	Bsquare} bind def
/S11 {BL [] 0 setdash 2 copy vpt sub vpt Square fill 2 copy exch vpt sub exch vpt2 vpt Rec fill
	Bsquare} bind def
/S12 {BL [] 0 setdash 2 copy exch vpt sub exch vpt sub vpt2 vpt Rec fill Bsquare} bind def
/S13 {BL [] 0 setdash 2 copy exch vpt sub exch vpt sub vpt2 vpt Rec fill
	2 copy vpt Square fill Bsquare} bind def
/S14 {BL [] 0 setdash 2 copy exch vpt sub exch vpt sub vpt2 vpt Rec fill
	2 copy exch vpt sub exch vpt Square fill Bsquare} bind def
/S15 {BL [] 0 setdash 2 copy Bsquare fill Bsquare} bind def
/D0 {gsave translate 45 rotate 0 0 S0 stroke grestore} bind def
/D1 {gsave translate 45 rotate 0 0 S1 stroke grestore} bind def
/D2 {gsave translate 45 rotate 0 0 S2 stroke grestore} bind def
/D3 {gsave translate 45 rotate 0 0 S3 stroke grestore} bind def
/D4 {gsave translate 45 rotate 0 0 S4 stroke grestore} bind def
/D5 {gsave translate 45 rotate 0 0 S5 stroke grestore} bind def
/D6 {gsave translate 45 rotate 0 0 S6 stroke grestore} bind def
/D7 {gsave translate 45 rotate 0 0 S7 stroke grestore} bind def
/D8 {gsave translate 45 rotate 0 0 S8 stroke grestore} bind def
/D9 {gsave translate 45 rotate 0 0 S9 stroke grestore} bind def
/D10 {gsave translate 45 rotate 0 0 S10 stroke grestore} bind def
/D11 {gsave translate 45 rotate 0 0 S11 stroke grestore} bind def
/D12 {gsave translate 45 rotate 0 0 S12 stroke grestore} bind def
/D13 {gsave translate 45 rotate 0 0 S13 stroke grestore} bind def
/D14 {gsave translate 45 rotate 0 0 S14 stroke grestore} bind def
/D15 {gsave translate 45 rotate 0 0 S15 stroke grestore} bind def
/DiaE {stroke [] 0 setdash vpt add M
  hpt neg vpt neg V hpt vpt neg V
  hpt vpt V hpt neg vpt V closepath stroke} def
/BoxE {stroke [] 0 setdash exch hpt sub exch vpt add M
  0 vpt2 neg V hpt2 0 V 0 vpt2 V
  hpt2 neg 0 V closepath stroke} def
/TriUE {stroke [] 0 setdash vpt 1.12 mul add M
  hpt neg vpt -1.62 mul V
  hpt 2 mul 0 V
  hpt neg vpt 1.62 mul V closepath stroke} def
/TriDE {stroke [] 0 setdash vpt 1.12 mul sub M
  hpt neg vpt 1.62 mul V
  hpt 2 mul 0 V
  hpt neg vpt -1.62 mul V closepath stroke} def
/PentE {stroke [] 0 setdash gsave
  translate 0 hpt M 4 {72 rotate 0 hpt L} repeat
  closepath stroke grestore} def
/CircE {stroke [] 0 setdash 
  hpt 0 360 arc stroke} def
/Opaque {gsave closepath 1 setgray fill grestore 0 setgray closepath} def
/DiaW {stroke [] 0 setdash vpt add M
  hpt neg vpt neg V hpt vpt neg V
  hpt vpt V hpt neg vpt V Opaque stroke} def
/BoxW {stroke [] 0 setdash exch hpt sub exch vpt add M
  0 vpt2 neg V hpt2 0 V 0 vpt2 V
  hpt2 neg 0 V Opaque stroke} def
/TriUW {stroke [] 0 setdash vpt 1.12 mul add M
  hpt neg vpt -1.62 mul V
  hpt 2 mul 0 V
  hpt neg vpt 1.62 mul V Opaque stroke} def
/TriDW {stroke [] 0 setdash vpt 1.12 mul sub M
  hpt neg vpt 1.62 mul V
  hpt 2 mul 0 V
  hpt neg vpt -1.62 mul V Opaque stroke} def
/PentW {stroke [] 0 setdash gsave
  translate 0 hpt M 4 {72 rotate 0 hpt L} repeat
  Opaque stroke grestore} def
/CircW {stroke [] 0 setdash 
  hpt 0 360 arc Opaque stroke} def
/BoxFill {gsave Rec 1 setgray fill grestore} def
/Density {
  /Fillden exch def
  currentrgbcolor
  /ColB exch def /ColG exch def /ColR exch def
  /ColR ColR Fillden mul Fillden sub 1 add def
  /ColG ColG Fillden mul Fillden sub 1 add def
  /ColB ColB Fillden mul Fillden sub 1 add def
  ColR ColG ColB setrgbcolor} def
/BoxColFill {gsave Rec PolyFill} def
/PolyFill {gsave Density fill grestore grestore} def
/h {rlineto rlineto rlineto gsave closepath fill grestore} bind def
%
% PostScript Level 1 Pattern Fill routine for rectangles
% Usage: x y w h s a XX PatternFill
%	x,y = lower left corner of box to be filled
%	w,h = width and height of box
%	  a = angle in degrees between lines and x-axis
%	 XX = 0/1 for no/yes cross-hatch
%
/PatternFill {gsave /PFa [ 9 2 roll ] def
  PFa 0 get PFa 2 get 2 div add PFa 1 get PFa 3 get 2 div add translate
  PFa 2 get -2 div PFa 3 get -2 div PFa 2 get PFa 3 get Rec
  TransparentPatterns {} {gsave 1 setgray fill grestore} ifelse
  clip
  currentlinewidth 0.5 mul setlinewidth
  /PFs PFa 2 get dup mul PFa 3 get dup mul add sqrt def
  0 0 M PFa 5 get rotate PFs -2 div dup translate
  0 1 PFs PFa 4 get div 1 add floor cvi
	{PFa 4 get mul 0 M 0 PFs V} for
  0 PFa 6 get ne {
	0 1 PFs PFa 4 get div 1 add floor cvi
	{PFa 4 get mul 0 2 1 roll M PFs 0 V} for
 } if
  stroke grestore} def
%
/languagelevel where
 {pop languagelevel} {1} ifelse
 2 lt
	{/InterpretLevel1 true def}
	{/InterpretLevel1 Level1 def}
 ifelse
%
% PostScript level 2 pattern fill definitions
%
/Level2PatternFill {
/Tile8x8 {/PaintType 2 /PatternType 1 /TilingType 1 /BBox [0 0 8 8] /XStep 8 /YStep 8}
	bind def
/KeepColor {currentrgbcolor [/Pattern /DeviceRGB] setcolorspace} bind def
<< Tile8x8
 /PaintProc {0.5 setlinewidth pop 0 0 M 8 8 L 0 8 M 8 0 L stroke} 
>> matrix makepattern
/Pat1 exch def
<< Tile8x8
 /PaintProc {0.5 setlinewidth pop 0 0 M 8 8 L 0 8 M 8 0 L stroke
	0 4 M 4 8 L 8 4 L 4 0 L 0 4 L stroke}
>> matrix makepattern
/Pat2 exch def
<< Tile8x8
 /PaintProc {0.5 setlinewidth pop 0 0 M 0 8 L
	8 8 L 8 0 L 0 0 L fill}
>> matrix makepattern
/Pat3 exch def
<< Tile8x8
 /PaintProc {0.5 setlinewidth pop -4 8 M 8 -4 L
	0 12 M 12 0 L stroke}
>> matrix makepattern
/Pat4 exch def
<< Tile8x8
 /PaintProc {0.5 setlinewidth pop -4 0 M 8 12 L
	0 -4 M 12 8 L stroke}
>> matrix makepattern
/Pat5 exch def
<< Tile8x8
 /PaintProc {0.5 setlinewidth pop -2 8 M 4 -4 L
	0 12 M 8 -4 L 4 12 M 10 0 L stroke}
>> matrix makepattern
/Pat6 exch def
<< Tile8x8
 /PaintProc {0.5 setlinewidth pop -2 0 M 4 12 L
	0 -4 M 8 12 L 4 -4 M 10 8 L stroke}
>> matrix makepattern
/Pat7 exch def
<< Tile8x8
 /PaintProc {0.5 setlinewidth pop 8 -2 M -4 4 L
	12 0 M -4 8 L 12 4 M 0 10 L stroke}
>> matrix makepattern
/Pat8 exch def
<< Tile8x8
 /PaintProc {0.5 setlinewidth pop 0 -2 M 12 4 L
	-4 0 M 12 8 L -4 4 M 8 10 L stroke}
>> matrix makepattern
/Pat9 exch def
/Pattern1 {PatternBgnd KeepColor Pat1 setpattern} bind def
/Pattern2 {PatternBgnd KeepColor Pat2 setpattern} bind def
/Pattern3 {PatternBgnd KeepColor Pat3 setpattern} bind def
/Pattern4 {PatternBgnd KeepColor Landscape {Pat5} {Pat4} ifelse setpattern} bind def
/Pattern5 {PatternBgnd KeepColor Landscape {Pat4} {Pat5} ifelse setpattern} bind def
/Pattern6 {PatternBgnd KeepColor Landscape {Pat9} {Pat6} ifelse setpattern} bind def
/Pattern7 {PatternBgnd KeepColor Landscape {Pat8} {Pat7} ifelse setpattern} bind def
} def
%
%
%End of PostScript Level 2 code
%
/PatternBgnd {
  TransparentPatterns {} {gsave 1 setgray fill grestore} ifelse
} def
%
% Substitute for Level 2 pattern fill codes with
% grayscale if Level 2 support is not selected.
%
/Level1PatternFill {
/Pattern1 {0.250 Density} bind def
/Pattern2 {0.500 Density} bind def
/Pattern3 {0.750 Density} bind def
/Pattern4 {0.125 Density} bind def
/Pattern5 {0.375 Density} bind def
/Pattern6 {0.625 Density} bind def
/Pattern7 {0.875 Density} bind def
} def
%
% Now test for support of Level 2 code
%
Level1 {Level1PatternFill} {Level2PatternFill} ifelse
%
/Symbol-Oblique /Symbol findfont [1 0 .167 1 0 0] makefont
dup length dict begin {1 index /FID eq {pop pop} {def} ifelse} forall
currentdict end definefont pop
Level1 SuppressPDFMark or 
{} {
/SDict 10 dict def
systemdict /pdfmark known not {
  userdict /pdfmark systemdict /cleartomark get put
} if
SDict begin [
  /Title (loch.tex)
  /Subject (gnuplot plot)
  /Creator (gnuplot 4.6 patchlevel 5)
  /Author (kevin.luedemann)
%  /Producer (gnuplot)
%  /Keywords ()
  /CreationDate (Tue Mar 17 17:16:14 2015)
  /DOCINFO pdfmark
end
} ifelse
end
%%EndProlog
%%Page: 1 1
gnudict begin
gsave
doclip
50 50 translate
0.050 0.050 scale
0 setgray
newpath
1.000 UL
LTb
LCb setrgbcolor
1342 704 M
63 0 V
5398 0 R
-63 0 V
stroke
LTb
1342 1111 M
63 0 V
5398 0 R
-63 0 V
1342 1518 M
63 0 V
5398 0 R
-63 0 V
1342 1925 M
63 0 V
5398 0 R
-63 0 V
1342 2332 M
63 0 V
5398 0 R
-63 0 V
1342 2740 M
63 0 V
5398 0 R
-63 0 V
1342 3147 M
63 0 V
5398 0 R
-63 0 V
1342 3554 M
63 0 V
5398 0 R
-63 0 V
1342 3961 M
63 0 V
5398 0 R
-63 0 V
1342 4368 M
63 0 V
5398 0 R
-63 0 V
1342 4775 M
63 0 V
5398 0 R
-63 0 V
1342 704 M
0 63 V
0 4008 R
0 -63 V
2025 704 M
0 63 V
0 4008 R
0 -63 V
2707 704 M
0 63 V
0 4008 R
0 -63 V
3390 704 M
0 63 V
0 4008 R
0 -63 V
4073 704 M
0 63 V
0 4008 R
0 -63 V
4755 704 M
0 63 V
0 4008 R
0 -63 V
5438 704 M
0 63 V
0 4008 R
0 -63 V
6120 704 M
0 63 V
0 4008 R
0 -63 V
6803 704 M
0 63 V
0 4008 R
0 -63 V
stroke
1342 4775 N
0 -4071 V
5461 0 V
0 4071 V
-5461 0 V
Z stroke
1.000 UP
1.000 UL
LTb
1.000 UP
1.000 UL
LT0
LC0 setrgbcolor
LCb setrgbcolor
LT0
LC0 setrgbcolor
1789 1113 Pls
1798 1103 Pls
1806 1103 Pls
1815 1124 Pls
1823 1134 Pls
1832 1124 Pls
1840 1113 Pls
1849 1134 Pls
1857 1145 Pls
1866 1145 Pls
1874 1145 Pls
1883 1165 Pls
1892 1145 Pls
1900 1145 Pls
1909 1155 Pls
1917 1145 Pls
1926 1155 Pls
1934 1155 Pls
1943 1145 Pls
1951 1145 Pls
1960 1155 Pls
1968 1155 Pls
1977 1124 Pls
1985 1145 Pls
1994 1134 Pls
2002 1145 Pls
2011 1134 Pls
2020 1134 Pls
2028 1145 Pls
2037 1134 Pls
2045 1124 Pls
2054 1113 Pls
2062 1134 Pls
2071 1124 Pls
2079 1113 Pls
2088 1124 Pls
2096 1113 Pls
2105 1124 Pls
2113 1124 Pls
2122 1134 Pls
2130 1134 Pls
2139 1134 Pls
2147 1134 Pls
2156 1145 Pls
2165 1134 Pls
2173 1155 Pls
2182 1155 Pls
2190 1165 Pls
2199 1176 Pls
2207 1155 Pls
2216 1155 Pls
2224 1165 Pls
2233 1145 Pls
2241 1155 Pls
2250 1155 Pls
2258 1145 Pls
2267 1134 Pls
2275 1145 Pls
2284 1134 Pls
2293 1134 Pls
2301 1134 Pls
2310 1134 Pls
2318 1103 Pls
2327 1134 Pls
2335 1134 Pls
2344 1124 Pls
2352 1134 Pls
2361 1155 Pls
2369 1165 Pls
2378 1155 Pls
2386 1155 Pls
2395 1155 Pls
2403 1165 Pls
2412 1155 Pls
2421 1165 Pls
2429 1155 Pls
2438 1145 Pls
2446 1134 Pls
2455 1155 Pls
2463 1145 Pls
2472 1134 Pls
2480 1155 Pls
2489 1145 Pls
2497 1134 Pls
2506 1134 Pls
2514 1145 Pls
2523 1113 Pls
2531 1134 Pls
2540 1113 Pls
2549 1134 Pls
2557 1113 Pls
2566 1113 Pls
2574 1134 Pls
2583 1134 Pls
2591 1113 Pls
2600 1134 Pls
2608 1113 Pls
2617 1124 Pls
2625 1113 Pls
2634 1134 Pls
2642 1134 Pls
2651 1134 Pls
2659 1124 Pls
2668 1124 Pls
2677 1134 Pls
2685 1124 Pls
2694 1134 Pls
2702 1134 Pls
2711 1113 Pls
2719 1124 Pls
2728 1124 Pls
2736 1134 Pls
2745 1124 Pls
2753 1134 Pls
2762 1134 Pls
2770 1134 Pls
2779 1113 Pls
2787 1145 Pls
2796 1145 Pls
2805 1134 Pls
2813 1134 Pls
2822 1145 Pls
2830 1145 Pls
2839 1124 Pls
2847 1134 Pls
2856 1155 Pls
2864 1155 Pls
2873 1165 Pls
2881 1165 Pls
2890 1165 Pls
2898 1134 Pls
2907 1165 Pls
2915 1155 Pls
2924 1165 Pls
2933 1155 Pls
2941 1155 Pls
2950 1155 Pls
2958 1155 Pls
2967 1145 Pls
2975 1155 Pls
2984 1165 Pls
2992 1155 Pls
3001 1165 Pls
3009 1145 Pls
3018 1155 Pls
3026 1155 Pls
3035 1165 Pls
3043 1165 Pls
3052 1134 Pls
3061 1134 Pls
3069 1134 Pls
3078 1145 Pls
3086 1134 Pls
3095 1134 Pls
3103 1134 Pls
3112 1124 Pls
3120 1134 Pls
3129 1124 Pls
3137 1134 Pls
3146 1134 Pls
3154 1145 Pls
3163 1134 Pls
3171 1145 Pls
3180 1165 Pls
3189 1134 Pls
3197 1145 Pls
3206 1155 Pls
3214 1165 Pls
3223 1165 Pls
3231 1165 Pls
3240 1186 Pls
3248 1176 Pls
3257 1176 Pls
3265 1186 Pls
3274 1176 Pls
3282 1176 Pls
3291 1165 Pls
3299 1165 Pls
3308 1176 Pls
3316 1165 Pls
3325 1155 Pls
3334 1165 Pls
3342 1165 Pls
3351 1155 Pls
3359 1145 Pls
3368 1145 Pls
3376 1124 Pls
3385 1145 Pls
3393 1134 Pls
3402 1124 Pls
3410 1145 Pls
3419 1113 Pls
3427 1124 Pls
3436 1155 Pls
3444 1134 Pls
3453 1134 Pls
3462 1134 Pls
3470 1145 Pls
3479 1134 Pls
3487 1145 Pls
3496 1145 Pls
3504 1145 Pls
3513 1165 Pls
3521 1145 Pls
3530 1165 Pls
3538 1165 Pls
3547 1176 Pls
3555 1165 Pls
3564 1186 Pls
3572 1207 Pls
3581 1196 Pls
3590 1196 Pls
3598 1207 Pls
3607 1186 Pls
3615 1196 Pls
3624 1207 Pls
3632 1207 Pls
3641 1217 Pls
3649 1228 Pls
3658 1207 Pls
3666 1207 Pls
3675 1196 Pls
3683 1207 Pls
3692 1217 Pls
3700 1207 Pls
3709 1228 Pls
3718 1207 Pls
3726 1228 Pls
3735 1207 Pls
3743 1186 Pls
3752 1186 Pls
3760 1196 Pls
3769 1186 Pls
3777 1176 Pls
3786 1186 Pls
3794 1165 Pls
3803 1165 Pls
3811 1165 Pls
3820 1176 Pls
3828 1165 Pls
3837 1155 Pls
3846 1155 Pls
3854 1165 Pls
3863 1155 Pls
3871 1145 Pls
3880 1145 Pls
3888 1165 Pls
3897 1165 Pls
3905 1176 Pls
3914 1186 Pls
3922 1186 Pls
3931 1207 Pls
3939 1196 Pls
3948 1196 Pls
3956 1217 Pls
3965 1217 Pls
3974 1238 Pls
3982 1259 Pls
3991 1290 Pls
3999 1311 Pls
4008 1311 Pls
4016 1342 Pls
4025 1352 Pls
4033 1394 Pls
4042 1394 Pls
4050 1414 Pls
4059 1456 Pls
4067 1487 Pls
4076 1518 Pls
4084 1560 Pls
4093 1580 Pls
4102 1632 Pls
4110 1694 Pls
4119 1767 Pls
4127 1809 Pls
4136 1881 Pls
4144 1933 Pls
4153 2006 Pls
4161 2078 Pls
4170 2140 Pls
4178 2192 Pls
4187 2265 Pls
4195 2317 Pls
4204 2379 Pls
4212 2441 Pls
4221 2514 Pls
4230 2587 Pls
4238 2669 Pls
4247 2742 Pls
4255 2835 Pls
4264 2929 Pls
4272 3001 Pls
4281 3105 Pls
4289 3178 Pls
4298 3271 Pls
4306 3354 Pls
4315 3448 Pls
4323 3520 Pls
4332 3593 Pls
4340 3676 Pls
4349 3738 Pls
4357 3790 Pls
4366 3842 Pls
4375 3873 Pls
4383 3904 Pls
4392 3966 Pls
4400 3997 Pls
4409 4060 Pls
4417 4143 Pls
4426 4215 Pls
4434 4267 Pls
4443 4288 Pls
4451 4381 Pls
4460 4402 Pls
4468 4454 Pls
4477 4454 Pls
4485 4464 Pls
4494 4443 Pls
4503 4485 Pls
4511 4506 Pls
4520 4516 Pls
4528 4516 Pls
4537 4506 Pls
4545 4485 Pls
4554 4454 Pls
4562 4423 Pls
4571 4412 Pls
4579 4340 Pls
4588 4298 Pls
4596 4267 Pls
4605 4205 Pls
4613 4153 Pls
4622 4091 Pls
4631 4018 Pls
4639 3966 Pls
4648 3862 Pls
4656 3800 Pls
4665 3717 Pls
4673 3624 Pls
4682 3541 Pls
4690 3458 Pls
4699 3354 Pls
4707 3240 Pls
4716 3167 Pls
4724 3074 Pls
4733 3001 Pls
4741 2929 Pls
4750 2815 Pls
4759 2742 Pls
4767 2680 Pls
4776 2607 Pls
4784 2524 Pls
4793 2441 Pls
4801 2379 Pls
4810 2296 Pls
4818 2223 Pls
4827 2151 Pls
4835 2057 Pls
4844 2016 Pls
4852 1933 Pls
4861 1871 Pls
4869 1809 Pls
4878 1757 Pls
4887 1726 Pls
4895 1674 Pls
4904 1622 Pls
4912 1570 Pls
4921 1539 Pls
4929 1487 Pls
4938 1456 Pls
4946 1425 Pls
4955 1383 Pls
4963 1352 Pls
4972 1300 Pls
4980 1279 Pls
4989 1259 Pls
4997 1238 Pls
5006 1217 Pls
5015 1207 Pls
5023 1196 Pls
5032 1165 Pls
5040 1176 Pls
5049 1165 Pls
5057 1145 Pls
5066 1165 Pls
5074 1145 Pls
5083 1155 Pls
5091 1145 Pls
5100 1145 Pls
5108 1155 Pls
5117 1145 Pls
5125 1145 Pls
5134 1165 Pls
5143 1165 Pls
5151 1186 Pls
5160 1186 Pls
5168 1186 Pls
5177 1196 Pls
5185 1207 Pls
5194 1186 Pls
5202 1176 Pls
5211 1207 Pls
5219 1196 Pls
5228 1196 Pls
5236 1217 Pls
5245 1207 Pls
5253 1207 Pls
5262 1196 Pls
5271 1207 Pls
5279 1207 Pls
5288 1196 Pls
5296 1207 Pls
5305 1217 Pls
5313 1207 Pls
5322 1196 Pls
5330 1186 Pls
5339 1186 Pls
5347 1176 Pls
5356 1186 Pls
5364 1186 Pls
5373 1176 Pls
5381 1176 Pls
5390 1165 Pls
5398 1165 Pls
5407 1155 Pls
5416 1145 Pls
5424 1145 Pls
5433 1155 Pls
5441 1165 Pls
5450 1155 Pls
5458 1165 Pls
5467 1155 Pls
5475 1155 Pls
5484 1165 Pls
5492 1165 Pls
5501 1165 Pls
5509 1155 Pls
5518 1176 Pls
5526 1165 Pls
5535 1165 Pls
5544 1145 Pls
5552 1165 Pls
5561 1186 Pls
5569 1165 Pls
5578 1134 Pls
5586 1145 Pls
5595 1165 Pls
5603 1155 Pls
5612 1165 Pls
5620 1165 Pls
5629 1165 Pls
5637 1186 Pls
5646 1165 Pls
5654 1134 Pls
5663 1155 Pls
5672 1165 Pls
5680 1145 Pls
5689 1155 Pls
5697 1134 Pls
5706 1145 Pls
5714 1145 Pls
5723 1145 Pls
5731 1124 Pls
5740 1134 Pls
5748 1134 Pls
5757 1145 Pls
5765 1165 Pls
5774 1155 Pls
5782 1176 Pls
5791 1165 Pls
5800 1176 Pls
5808 1196 Pls
5817 1176 Pls
5825 1176 Pls
5834 1145 Pls
5842 1165 Pls
5851 1165 Pls
5859 1176 Pls
5868 1155 Pls
5876 1134 Pls
5885 1176 Pls
5893 1186 Pls
5902 1186 Pls
5910 1155 Pls
5919 1165 Pls
5928 1145 Pls
5936 1145 Pls
5945 1176 Pls
5953 1145 Pls
5962 1165 Pls
5970 1134 Pls
5979 1155 Pls
5987 1134 Pls
5996 1124 Pls
6004 1145 Pls
6013 1134 Pls
6021 1124 Pls
6030 1134 Pls
6038 1134 Pls
6047 1145 Pls
6056 1145 Pls
6064 1155 Pls
6073 1124 Pls
6081 1165 Pls
6090 1165 Pls
6098 1155 Pls
6107 1165 Pls
6115 1155 Pls
6124 1155 Pls
6132 1134 Pls
6141 1155 Pls
6149 1134 Pls
6158 1124 Pls
6166 1124 Pls
6175 1113 Pls
6184 1134 Pls
6192 1134 Pls
6201 1124 Pls
6209 1155 Pls
6218 1165 Pls
6226 1145 Pls
6235 1155 Pls
6243 1165 Pls
6252 1165 Pls
6260 1165 Pls
6269 1145 Pls
6277 1176 Pls
6286 1165 Pls
6294 1145 Pls
6303 1176 Pls
6312 1165 Pls
6320 1165 Pls
6329 1176 Pls
6337 1155 Pls
6346 1165 Pls
6354 1155 Pls
6363 1155 Pls
6371 1155 Pls
6380 1165 Pls
6388 1165 Pls
6397 1165 Pls
6405 1145 Pls
6414 1186 Pls
6422 1145 Pls
6431 1145 Pls
6440 1134 Pls
6448 1134 Pls
6457 1134 Pls
6465 1134 Pls
6474 1134 Pls
6243 4602 Pls
1.000 UL
LTb
LCb setrgbcolor
1342 4775 N
0 -4071 V
5461 0 V
0 4071 V
-5461 0 V
Z stroke
1.000 UP
1.000 UL
LTb
stroke
grestore
end
showpage
%%Trailer
