%!PS-Adobe-2.0 EPSF-2.0
%%Title: loch.tex
%%Creator: gnuplot 4.6 patchlevel 5
%%CreationDate: Tue Mar 17 14:59:11 2015
%%DocumentFonts: 
%%BoundingBox: 50 50 410 302
%%EndComments
%%BeginProlog
/gnudict 256 dict def
gnudict begin
%
% The following true/false flags may be edited by hand if desired.
% The unit line width and grayscale image gamma correction may also be changed.
%
/Color true def
/Blacktext true def
/Solid false def
/Dashlength 1 def
/Landscape false def
/Level1 false def
/Rounded false def
/ClipToBoundingBox false def
/SuppressPDFMark false def
/TransparentPatterns false def
/gnulinewidth 5.000 def
/userlinewidth gnulinewidth def
/Gamma 1.0 def
/BackgroundColor {-1.000 -1.000 -1.000} def
%
/vshift -73 def
/dl1 {
  10.0 Dashlength mul mul
  Rounded { currentlinewidth 0.75 mul sub dup 0 le { pop 0.01 } if } if
} def
/dl2 {
  10.0 Dashlength mul mul
  Rounded { currentlinewidth 0.75 mul add } if
} def
/hpt_ 31.5 def
/vpt_ 31.5 def
/hpt hpt_ def
/vpt vpt_ def
/doclip {
  ClipToBoundingBox {
    newpath 50 50 moveto 410 50 lineto 410 302 lineto 50 302 lineto closepath
    clip
  } if
} def
%
% Gnuplot Prolog Version 4.6 (September 2012)
%
%/SuppressPDFMark true def
%
/M {moveto} bind def
/L {lineto} bind def
/R {rmoveto} bind def
/V {rlineto} bind def
/N {newpath moveto} bind def
/Z {closepath} bind def
/C {setrgbcolor} bind def
/f {rlineto fill} bind def
/g {setgray} bind def
/Gshow {show} def   % May be redefined later in the file to support UTF-8
/vpt2 vpt 2 mul def
/hpt2 hpt 2 mul def
/Lshow {currentpoint stroke M 0 vshift R 
	Blacktext {gsave 0 setgray show grestore} {show} ifelse} def
/Rshow {currentpoint stroke M dup stringwidth pop neg vshift R
	Blacktext {gsave 0 setgray show grestore} {show} ifelse} def
/Cshow {currentpoint stroke M dup stringwidth pop -2 div vshift R 
	Blacktext {gsave 0 setgray show grestore} {show} ifelse} def
/UP {dup vpt_ mul /vpt exch def hpt_ mul /hpt exch def
  /hpt2 hpt 2 mul def /vpt2 vpt 2 mul def} def
/DL {Color {setrgbcolor Solid {pop []} if 0 setdash}
 {pop pop pop 0 setgray Solid {pop []} if 0 setdash} ifelse} def
/BL {stroke userlinewidth 2 mul setlinewidth
	Rounded {1 setlinejoin 1 setlinecap} if} def
/AL {stroke userlinewidth 2 div setlinewidth
	Rounded {1 setlinejoin 1 setlinecap} if} def
/UL {dup gnulinewidth mul /userlinewidth exch def
	dup 1 lt {pop 1} if 10 mul /udl exch def} def
/PL {stroke userlinewidth setlinewidth
	Rounded {1 setlinejoin 1 setlinecap} if} def
3.8 setmiterlimit
% Default Line colors
/LCw {1 1 1} def
/LCb {0 0 0} def
/LCa {0 0 0} def
/LC0 {1 0 0} def
/LC1 {0 1 0} def
/LC2 {0 0 1} def
/LC3 {1 0 1} def
/LC4 {0 1 1} def
/LC5 {1 1 0} def
/LC6 {0 0 0} def
/LC7 {1 0.3 0} def
/LC8 {0.5 0.5 0.5} def
% Default Line Types
/LTw {PL [] 1 setgray} def
/LTb {BL [] LCb DL} def
/LTa {AL [1 udl mul 2 udl mul] 0 setdash LCa setrgbcolor} def
/LT0 {PL [] LC0 DL} def
/LT1 {PL [4 dl1 2 dl2] LC1 DL} def
/LT2 {PL [2 dl1 3 dl2] LC2 DL} def
/LT3 {PL [1 dl1 1.5 dl2] LC3 DL} def
/LT4 {PL [6 dl1 2 dl2 1 dl1 2 dl2] LC4 DL} def
/LT5 {PL [3 dl1 3 dl2 1 dl1 3 dl2] LC5 DL} def
/LT6 {PL [2 dl1 2 dl2 2 dl1 6 dl2] LC6 DL} def
/LT7 {PL [1 dl1 2 dl2 6 dl1 2 dl2 1 dl1 2 dl2] LC7 DL} def
/LT8 {PL [2 dl1 2 dl2 2 dl1 2 dl2 2 dl1 2 dl2 2 dl1 4 dl2] LC8 DL} def
/Pnt {stroke [] 0 setdash gsave 1 setlinecap M 0 0 V stroke grestore} def
/Dia {stroke [] 0 setdash 2 copy vpt add M
  hpt neg vpt neg V hpt vpt neg V
  hpt vpt V hpt neg vpt V closepath stroke
  Pnt} def
/Pls {stroke [] 0 setdash vpt sub M 0 vpt2 V
  currentpoint stroke M
  hpt neg vpt neg R hpt2 0 V stroke
 } def
/Box {stroke [] 0 setdash 2 copy exch hpt sub exch vpt add M
  0 vpt2 neg V hpt2 0 V 0 vpt2 V
  hpt2 neg 0 V closepath stroke
  Pnt} def
/Crs {stroke [] 0 setdash exch hpt sub exch vpt add M
  hpt2 vpt2 neg V currentpoint stroke M
  hpt2 neg 0 R hpt2 vpt2 V stroke} def
/TriU {stroke [] 0 setdash 2 copy vpt 1.12 mul add M
  hpt neg vpt -1.62 mul V
  hpt 2 mul 0 V
  hpt neg vpt 1.62 mul V closepath stroke
  Pnt} def
/Star {2 copy Pls Crs} def
/BoxF {stroke [] 0 setdash exch hpt sub exch vpt add M
  0 vpt2 neg V hpt2 0 V 0 vpt2 V
  hpt2 neg 0 V closepath fill} def
/TriUF {stroke [] 0 setdash vpt 1.12 mul add M
  hpt neg vpt -1.62 mul V
  hpt 2 mul 0 V
  hpt neg vpt 1.62 mul V closepath fill} def
/TriD {stroke [] 0 setdash 2 copy vpt 1.12 mul sub M
  hpt neg vpt 1.62 mul V
  hpt 2 mul 0 V
  hpt neg vpt -1.62 mul V closepath stroke
  Pnt} def
/TriDF {stroke [] 0 setdash vpt 1.12 mul sub M
  hpt neg vpt 1.62 mul V
  hpt 2 mul 0 V
  hpt neg vpt -1.62 mul V closepath fill} def
/DiaF {stroke [] 0 setdash vpt add M
  hpt neg vpt neg V hpt vpt neg V
  hpt vpt V hpt neg vpt V closepath fill} def
/Pent {stroke [] 0 setdash 2 copy gsave
  translate 0 hpt M 4 {72 rotate 0 hpt L} repeat
  closepath stroke grestore Pnt} def
/PentF {stroke [] 0 setdash gsave
  translate 0 hpt M 4 {72 rotate 0 hpt L} repeat
  closepath fill grestore} def
/Circle {stroke [] 0 setdash 2 copy
  hpt 0 360 arc stroke Pnt} def
/CircleF {stroke [] 0 setdash hpt 0 360 arc fill} def
/C0 {BL [] 0 setdash 2 copy moveto vpt 90 450 arc} bind def
/C1 {BL [] 0 setdash 2 copy moveto
	2 copy vpt 0 90 arc closepath fill
	vpt 0 360 arc closepath} bind def
/C2 {BL [] 0 setdash 2 copy moveto
	2 copy vpt 90 180 arc closepath fill
	vpt 0 360 arc closepath} bind def
/C3 {BL [] 0 setdash 2 copy moveto
	2 copy vpt 0 180 arc closepath fill
	vpt 0 360 arc closepath} bind def
/C4 {BL [] 0 setdash 2 copy moveto
	2 copy vpt 180 270 arc closepath fill
	vpt 0 360 arc closepath} bind def
/C5 {BL [] 0 setdash 2 copy moveto
	2 copy vpt 0 90 arc
	2 copy moveto
	2 copy vpt 180 270 arc closepath fill
	vpt 0 360 arc} bind def
/C6 {BL [] 0 setdash 2 copy moveto
	2 copy vpt 90 270 arc closepath fill
	vpt 0 360 arc closepath} bind def
/C7 {BL [] 0 setdash 2 copy moveto
	2 copy vpt 0 270 arc closepath fill
	vpt 0 360 arc closepath} bind def
/C8 {BL [] 0 setdash 2 copy moveto
	2 copy vpt 270 360 arc closepath fill
	vpt 0 360 arc closepath} bind def
/C9 {BL [] 0 setdash 2 copy moveto
	2 copy vpt 270 450 arc closepath fill
	vpt 0 360 arc closepath} bind def
/C10 {BL [] 0 setdash 2 copy 2 copy moveto vpt 270 360 arc closepath fill
	2 copy moveto
	2 copy vpt 90 180 arc closepath fill
	vpt 0 360 arc closepath} bind def
/C11 {BL [] 0 setdash 2 copy moveto
	2 copy vpt 0 180 arc closepath fill
	2 copy moveto
	2 copy vpt 270 360 arc closepath fill
	vpt 0 360 arc closepath} bind def
/C12 {BL [] 0 setdash 2 copy moveto
	2 copy vpt 180 360 arc closepath fill
	vpt 0 360 arc closepath} bind def
/C13 {BL [] 0 setdash 2 copy moveto
	2 copy vpt 0 90 arc closepath fill
	2 copy moveto
	2 copy vpt 180 360 arc closepath fill
	vpt 0 360 arc closepath} bind def
/C14 {BL [] 0 setdash 2 copy moveto
	2 copy vpt 90 360 arc closepath fill
	vpt 0 360 arc} bind def
/C15 {BL [] 0 setdash 2 copy vpt 0 360 arc closepath fill
	vpt 0 360 arc closepath} bind def
/Rec {newpath 4 2 roll moveto 1 index 0 rlineto 0 exch rlineto
	neg 0 rlineto closepath} bind def
/Square {dup Rec} bind def
/Bsquare {vpt sub exch vpt sub exch vpt2 Square} bind def
/S0 {BL [] 0 setdash 2 copy moveto 0 vpt rlineto BL Bsquare} bind def
/S1 {BL [] 0 setdash 2 copy vpt Square fill Bsquare} bind def
/S2 {BL [] 0 setdash 2 copy exch vpt sub exch vpt Square fill Bsquare} bind def
/S3 {BL [] 0 setdash 2 copy exch vpt sub exch vpt2 vpt Rec fill Bsquare} bind def
/S4 {BL [] 0 setdash 2 copy exch vpt sub exch vpt sub vpt Square fill Bsquare} bind def
/S5 {BL [] 0 setdash 2 copy 2 copy vpt Square fill
	exch vpt sub exch vpt sub vpt Square fill Bsquare} bind def
/S6 {BL [] 0 setdash 2 copy exch vpt sub exch vpt sub vpt vpt2 Rec fill Bsquare} bind def
/S7 {BL [] 0 setdash 2 copy exch vpt sub exch vpt sub vpt vpt2 Rec fill
	2 copy vpt Square fill Bsquare} bind def
/S8 {BL [] 0 setdash 2 copy vpt sub vpt Square fill Bsquare} bind def
/S9 {BL [] 0 setdash 2 copy vpt sub vpt vpt2 Rec fill Bsquare} bind def
/S10 {BL [] 0 setdash 2 copy vpt sub vpt Square fill 2 copy exch vpt sub exch vpt Square fill
	Bsquare} bind def
/S11 {BL [] 0 setdash 2 copy vpt sub vpt Square fill 2 copy exch vpt sub exch vpt2 vpt Rec fill
	Bsquare} bind def
/S12 {BL [] 0 setdash 2 copy exch vpt sub exch vpt sub vpt2 vpt Rec fill Bsquare} bind def
/S13 {BL [] 0 setdash 2 copy exch vpt sub exch vpt sub vpt2 vpt Rec fill
	2 copy vpt Square fill Bsquare} bind def
/S14 {BL [] 0 setdash 2 copy exch vpt sub exch vpt sub vpt2 vpt Rec fill
	2 copy exch vpt sub exch vpt Square fill Bsquare} bind def
/S15 {BL [] 0 setdash 2 copy Bsquare fill Bsquare} bind def
/D0 {gsave translate 45 rotate 0 0 S0 stroke grestore} bind def
/D1 {gsave translate 45 rotate 0 0 S1 stroke grestore} bind def
/D2 {gsave translate 45 rotate 0 0 S2 stroke grestore} bind def
/D3 {gsave translate 45 rotate 0 0 S3 stroke grestore} bind def
/D4 {gsave translate 45 rotate 0 0 S4 stroke grestore} bind def
/D5 {gsave translate 45 rotate 0 0 S5 stroke grestore} bind def
/D6 {gsave translate 45 rotate 0 0 S6 stroke grestore} bind def
/D7 {gsave translate 45 rotate 0 0 S7 stroke grestore} bind def
/D8 {gsave translate 45 rotate 0 0 S8 stroke grestore} bind def
/D9 {gsave translate 45 rotate 0 0 S9 stroke grestore} bind def
/D10 {gsave translate 45 rotate 0 0 S10 stroke grestore} bind def
/D11 {gsave translate 45 rotate 0 0 S11 stroke grestore} bind def
/D12 {gsave translate 45 rotate 0 0 S12 stroke grestore} bind def
/D13 {gsave translate 45 rotate 0 0 S13 stroke grestore} bind def
/D14 {gsave translate 45 rotate 0 0 S14 stroke grestore} bind def
/D15 {gsave translate 45 rotate 0 0 S15 stroke grestore} bind def
/DiaE {stroke [] 0 setdash vpt add M
  hpt neg vpt neg V hpt vpt neg V
  hpt vpt V hpt neg vpt V closepath stroke} def
/BoxE {stroke [] 0 setdash exch hpt sub exch vpt add M
  0 vpt2 neg V hpt2 0 V 0 vpt2 V
  hpt2 neg 0 V closepath stroke} def
/TriUE {stroke [] 0 setdash vpt 1.12 mul add M
  hpt neg vpt -1.62 mul V
  hpt 2 mul 0 V
  hpt neg vpt 1.62 mul V closepath stroke} def
/TriDE {stroke [] 0 setdash vpt 1.12 mul sub M
  hpt neg vpt 1.62 mul V
  hpt 2 mul 0 V
  hpt neg vpt -1.62 mul V closepath stroke} def
/PentE {stroke [] 0 setdash gsave
  translate 0 hpt M 4 {72 rotate 0 hpt L} repeat
  closepath stroke grestore} def
/CircE {stroke [] 0 setdash 
  hpt 0 360 arc stroke} def
/Opaque {gsave closepath 1 setgray fill grestore 0 setgray closepath} def
/DiaW {stroke [] 0 setdash vpt add M
  hpt neg vpt neg V hpt vpt neg V
  hpt vpt V hpt neg vpt V Opaque stroke} def
/BoxW {stroke [] 0 setdash exch hpt sub exch vpt add M
  0 vpt2 neg V hpt2 0 V 0 vpt2 V
  hpt2 neg 0 V Opaque stroke} def
/TriUW {stroke [] 0 setdash vpt 1.12 mul add M
  hpt neg vpt -1.62 mul V
  hpt 2 mul 0 V
  hpt neg vpt 1.62 mul V Opaque stroke} def
/TriDW {stroke [] 0 setdash vpt 1.12 mul sub M
  hpt neg vpt 1.62 mul V
  hpt 2 mul 0 V
  hpt neg vpt -1.62 mul V Opaque stroke} def
/PentW {stroke [] 0 setdash gsave
  translate 0 hpt M 4 {72 rotate 0 hpt L} repeat
  Opaque stroke grestore} def
/CircW {stroke [] 0 setdash 
  hpt 0 360 arc Opaque stroke} def
/BoxFill {gsave Rec 1 setgray fill grestore} def
/Density {
  /Fillden exch def
  currentrgbcolor
  /ColB exch def /ColG exch def /ColR exch def
  /ColR ColR Fillden mul Fillden sub 1 add def
  /ColG ColG Fillden mul Fillden sub 1 add def
  /ColB ColB Fillden mul Fillden sub 1 add def
  ColR ColG ColB setrgbcolor} def
/BoxColFill {gsave Rec PolyFill} def
/PolyFill {gsave Density fill grestore grestore} def
/h {rlineto rlineto rlineto gsave closepath fill grestore} bind def
%
% PostScript Level 1 Pattern Fill routine for rectangles
% Usage: x y w h s a XX PatternFill
%	x,y = lower left corner of box to be filled
%	w,h = width and height of box
%	  a = angle in degrees between lines and x-axis
%	 XX = 0/1 for no/yes cross-hatch
%
/PatternFill {gsave /PFa [ 9 2 roll ] def
  PFa 0 get PFa 2 get 2 div add PFa 1 get PFa 3 get 2 div add translate
  PFa 2 get -2 div PFa 3 get -2 div PFa 2 get PFa 3 get Rec
  TransparentPatterns {} {gsave 1 setgray fill grestore} ifelse
  clip
  currentlinewidth 0.5 mul setlinewidth
  /PFs PFa 2 get dup mul PFa 3 get dup mul add sqrt def
  0 0 M PFa 5 get rotate PFs -2 div dup translate
  0 1 PFs PFa 4 get div 1 add floor cvi
	{PFa 4 get mul 0 M 0 PFs V} for
  0 PFa 6 get ne {
	0 1 PFs PFa 4 get div 1 add floor cvi
	{PFa 4 get mul 0 2 1 roll M PFs 0 V} for
 } if
  stroke grestore} def
%
/languagelevel where
 {pop languagelevel} {1} ifelse
 2 lt
	{/InterpretLevel1 true def}
	{/InterpretLevel1 Level1 def}
 ifelse
%
% PostScript level 2 pattern fill definitions
%
/Level2PatternFill {
/Tile8x8 {/PaintType 2 /PatternType 1 /TilingType 1 /BBox [0 0 8 8] /XStep 8 /YStep 8}
	bind def
/KeepColor {currentrgbcolor [/Pattern /DeviceRGB] setcolorspace} bind def
<< Tile8x8
 /PaintProc {0.5 setlinewidth pop 0 0 M 8 8 L 0 8 M 8 0 L stroke} 
>> matrix makepattern
/Pat1 exch def
<< Tile8x8
 /PaintProc {0.5 setlinewidth pop 0 0 M 8 8 L 0 8 M 8 0 L stroke
	0 4 M 4 8 L 8 4 L 4 0 L 0 4 L stroke}
>> matrix makepattern
/Pat2 exch def
<< Tile8x8
 /PaintProc {0.5 setlinewidth pop 0 0 M 0 8 L
	8 8 L 8 0 L 0 0 L fill}
>> matrix makepattern
/Pat3 exch def
<< Tile8x8
 /PaintProc {0.5 setlinewidth pop -4 8 M 8 -4 L
	0 12 M 12 0 L stroke}
>> matrix makepattern
/Pat4 exch def
<< Tile8x8
 /PaintProc {0.5 setlinewidth pop -4 0 M 8 12 L
	0 -4 M 12 8 L stroke}
>> matrix makepattern
/Pat5 exch def
<< Tile8x8
 /PaintProc {0.5 setlinewidth pop -2 8 M 4 -4 L
	0 12 M 8 -4 L 4 12 M 10 0 L stroke}
>> matrix makepattern
/Pat6 exch def
<< Tile8x8
 /PaintProc {0.5 setlinewidth pop -2 0 M 4 12 L
	0 -4 M 8 12 L 4 -4 M 10 8 L stroke}
>> matrix makepattern
/Pat7 exch def
<< Tile8x8
 /PaintProc {0.5 setlinewidth pop 8 -2 M -4 4 L
	12 0 M -4 8 L 12 4 M 0 10 L stroke}
>> matrix makepattern
/Pat8 exch def
<< Tile8x8
 /PaintProc {0.5 setlinewidth pop 0 -2 M 12 4 L
	-4 0 M 12 8 L -4 4 M 8 10 L stroke}
>> matrix makepattern
/Pat9 exch def
/Pattern1 {PatternBgnd KeepColor Pat1 setpattern} bind def
/Pattern2 {PatternBgnd KeepColor Pat2 setpattern} bind def
/Pattern3 {PatternBgnd KeepColor Pat3 setpattern} bind def
/Pattern4 {PatternBgnd KeepColor Landscape {Pat5} {Pat4} ifelse setpattern} bind def
/Pattern5 {PatternBgnd KeepColor Landscape {Pat4} {Pat5} ifelse setpattern} bind def
/Pattern6 {PatternBgnd KeepColor Landscape {Pat9} {Pat6} ifelse setpattern} bind def
/Pattern7 {PatternBgnd KeepColor Landscape {Pat8} {Pat7} ifelse setpattern} bind def
} def
%
%
%End of PostScript Level 2 code
%
/PatternBgnd {
  TransparentPatterns {} {gsave 1 setgray fill grestore} ifelse
} def
%
% Substitute for Level 2 pattern fill codes with
% grayscale if Level 2 support is not selected.
%
/Level1PatternFill {
/Pattern1 {0.250 Density} bind def
/Pattern2 {0.500 Density} bind def
/Pattern3 {0.750 Density} bind def
/Pattern4 {0.125 Density} bind def
/Pattern5 {0.375 Density} bind def
/Pattern6 {0.625 Density} bind def
/Pattern7 {0.875 Density} bind def
} def
%
% Now test for support of Level 2 code
%
Level1 {Level1PatternFill} {Level2PatternFill} ifelse
%
/Symbol-Oblique /Symbol findfont [1 0 .167 1 0 0] makefont
dup length dict begin {1 index /FID eq {pop pop} {def} ifelse} forall
currentdict end definefont pop
Level1 SuppressPDFMark or 
{} {
/SDict 10 dict def
systemdict /pdfmark known not {
  userdict /pdfmark systemdict /cleartomark get put
} if
SDict begin [
  /Title (loch.tex)
  /Subject (gnuplot plot)
  /Creator (gnuplot 4.6 patchlevel 5)
  /Author (kevin.luedemann)
%  /Producer (gnuplot)
%  /Keywords ()
  /CreationDate (Tue Mar 17 14:59:11 2015)
  /DOCINFO pdfmark
end
} ifelse
end
%%EndProlog
%%Page: 1 1
gnudict begin
gsave
doclip
50 50 translate
0.050 0.050 scale
0 setgray
newpath
1.000 UL
LTb
LCb setrgbcolor
1122 440 M
63 0 V
5618 0 R
-63 0 V
stroke
LTb
1122 874 M
63 0 V
5618 0 R
-63 0 V
1122 1307 M
63 0 V
5618 0 R
-63 0 V
1122 1740 M
63 0 V
5618 0 R
-63 0 V
1122 2174 M
63 0 V
5618 0 R
-63 0 V
1122 2607 M
63 0 V
5618 0 R
-63 0 V
1122 3041 M
63 0 V
5618 0 R
-63 0 V
1122 3474 M
63 0 V
5618 0 R
-63 0 V
1122 3908 M
63 0 V
5618 0 R
-63 0 V
1122 4342 M
63 0 V
5618 0 R
-63 0 V
1122 4775 M
63 0 V
5618 0 R
-63 0 V
1122 440 M
0 63 V
0 4272 R
0 -63 V
1832 440 M
0 63 V
0 4272 R
0 -63 V
2542 440 M
0 63 V
0 4272 R
0 -63 V
3252 440 M
0 63 V
0 4272 R
0 -63 V
3963 440 M
0 63 V
0 4272 R
0 -63 V
4673 440 M
0 63 V
0 4272 R
0 -63 V
5383 440 M
0 63 V
0 4272 R
0 -63 V
6093 440 M
0 63 V
0 4272 R
0 -63 V
6803 440 M
0 63 V
0 4272 R
0 -63 V
stroke
1122 4775 N
0 -4335 V
5681 0 V
0 4335 V
-5681 0 V
Z stroke
1.000 UP
1.000 UL
LTb
1.000 UP
1.000 UL
LT0
LC0 setrgbcolor
LCb setrgbcolor
LT0
LC0 setrgbcolor
1587 876 Pls
1596 865 Pls
1605 865 Pls
1614 887 Pls
1623 898 Pls
1632 887 Pls
1640 876 Pls
1649 898 Pls
1658 909 Pls
1667 909 Pls
1676 909 Pls
1685 931 Pls
1694 909 Pls
1703 909 Pls
1711 920 Pls
1720 909 Pls
1729 920 Pls
1738 920 Pls
1747 909 Pls
1756 909 Pls
1765 920 Pls
1774 920 Pls
1782 887 Pls
1791 909 Pls
1800 898 Pls
1809 909 Pls
1818 898 Pls
1827 898 Pls
1836 909 Pls
1845 898 Pls
1853 887 Pls
1862 876 Pls
1871 898 Pls
1880 887 Pls
1889 876 Pls
1898 887 Pls
1907 876 Pls
1916 887 Pls
1924 887 Pls
1933 898 Pls
1942 898 Pls
1951 898 Pls
1960 898 Pls
1969 909 Pls
1978 898 Pls
1987 920 Pls
1995 920 Pls
2004 931 Pls
2013 942 Pls
2022 920 Pls
2031 920 Pls
2040 931 Pls
2049 909 Pls
2058 920 Pls
2066 920 Pls
2075 909 Pls
2084 898 Pls
2093 909 Pls
2102 898 Pls
2111 898 Pls
2120 898 Pls
2129 898 Pls
2137 865 Pls
2146 898 Pls
2155 898 Pls
2164 887 Pls
2173 898 Pls
2182 920 Pls
2191 931 Pls
2200 920 Pls
2208 920 Pls
2217 920 Pls
2226 931 Pls
2235 920 Pls
2244 931 Pls
2253 920 Pls
2262 909 Pls
2271 898 Pls
2280 920 Pls
2288 909 Pls
2297 898 Pls
2306 920 Pls
2315 909 Pls
2324 898 Pls
2333 898 Pls
2342 909 Pls
2351 876 Pls
2359 898 Pls
2368 876 Pls
2377 898 Pls
2386 876 Pls
2395 876 Pls
2404 898 Pls
2413 898 Pls
2422 876 Pls
2430 898 Pls
2439 876 Pls
2448 887 Pls
2457 876 Pls
2466 898 Pls
2475 898 Pls
2484 898 Pls
2493 887 Pls
2501 887 Pls
2510 898 Pls
2519 887 Pls
2528 898 Pls
2537 898 Pls
2546 876 Pls
2555 887 Pls
2564 887 Pls
2572 898 Pls
2581 887 Pls
2590 898 Pls
2599 898 Pls
2608 898 Pls
2617 876 Pls
2626 909 Pls
2635 909 Pls
2643 898 Pls
2652 898 Pls
2661 909 Pls
2670 909 Pls
2679 887 Pls
2688 898 Pls
2697 920 Pls
2706 920 Pls
2714 931 Pls
2723 931 Pls
2732 931 Pls
2741 898 Pls
2750 931 Pls
2759 920 Pls
2768 931 Pls
2777 920 Pls
2785 920 Pls
2794 920 Pls
2803 920 Pls
2812 909 Pls
2821 920 Pls
2830 931 Pls
2839 920 Pls
2848 931 Pls
2856 909 Pls
2865 920 Pls
2874 920 Pls
2883 931 Pls
2892 931 Pls
2901 898 Pls
2910 898 Pls
2919 898 Pls
2927 909 Pls
2936 898 Pls
2945 898 Pls
2954 898 Pls
2963 887 Pls
2972 898 Pls
2981 887 Pls
2990 898 Pls
2999 898 Pls
3007 909 Pls
3016 898 Pls
3025 909 Pls
3034 931 Pls
3043 898 Pls
3052 909 Pls
3061 920 Pls
3070 931 Pls
3078 931 Pls
3087 931 Pls
3096 953 Pls
3105 942 Pls
3114 942 Pls
3123 953 Pls
3132 942 Pls
3141 942 Pls
3149 931 Pls
3158 931 Pls
3167 942 Pls
3176 931 Pls
3185 920 Pls
3194 931 Pls
3203 931 Pls
3212 920 Pls
3220 909 Pls
3229 909 Pls
3238 887 Pls
3247 909 Pls
3256 898 Pls
3265 887 Pls
3274 909 Pls
3283 876 Pls
3291 887 Pls
3300 920 Pls
3309 898 Pls
3318 898 Pls
3327 898 Pls
3336 909 Pls
3345 898 Pls
3354 909 Pls
3362 909 Pls
3371 909 Pls
3380 931 Pls
3389 909 Pls
3398 931 Pls
3407 931 Pls
3416 942 Pls
3425 931 Pls
3433 953 Pls
3442 975 Pls
3451 964 Pls
3460 964 Pls
3469 975 Pls
3478 953 Pls
3487 964 Pls
3496 975 Pls
3504 975 Pls
3513 986 Pls
3522 998 Pls
3531 975 Pls
3540 975 Pls
3549 964 Pls
3558 975 Pls
3567 986 Pls
3575 975 Pls
3584 998 Pls
3593 975 Pls
3602 998 Pls
3611 975 Pls
3620 953 Pls
3629 953 Pls
3638 964 Pls
3646 953 Pls
3655 942 Pls
3664 953 Pls
3673 931 Pls
3682 931 Pls
3691 931 Pls
3700 942 Pls
3709 931 Pls
3718 920 Pls
3726 920 Pls
3735 931 Pls
3744 920 Pls
3753 909 Pls
3762 909 Pls
3771 931 Pls
3780 931 Pls
3789 942 Pls
3797 953 Pls
3806 953 Pls
3815 975 Pls
3824 964 Pls
3833 964 Pls
3842 986 Pls
3851 986 Pls
3860 1009 Pls
3868 1031 Pls
3877 1064 Pls
3886 1086 Pls
3895 1086 Pls
3904 1119 Pls
3913 1130 Pls
3922 1174 Pls
3931 1174 Pls
3939 1196 Pls
3948 1241 Pls
3957 1274 Pls
3966 1307 Pls
3975 1351 Pls
3984 1373 Pls
3993 1428 Pls
4002 1495 Pls
4010 1572 Pls
4019 1616 Pls
4028 1693 Pls
4037 1749 Pls
4046 1826 Pls
4055 1903 Pls
4064 1970 Pls
4073 2025 Pls
4081 2102 Pls
4090 2157 Pls
4099 2224 Pls
4108 2290 Pls
4117 2367 Pls
4126 2445 Pls
4135 2533 Pls
4144 2610 Pls
4152 2710 Pls
4161 2809 Pls
4170 2886 Pls
4179 2997 Pls
4188 3074 Pls
4197 3174 Pls
4206 3262 Pls
4215 3361 Pls
4223 3439 Pls
4232 3516 Pls
4241 3604 Pls
4250 3671 Pls
4259 3726 Pls
4268 3781 Pls
4277 3814 Pls
4286 3847 Pls
4294 3914 Pls
4303 3947 Pls
4312 4013 Pls
4321 4102 Pls
4330 4179 Pls
4339 4234 Pls
4348 4256 Pls
4357 4356 Pls
4365 4378 Pls
4374 4433 Pls
4383 4433 Pls
4392 4444 Pls
4401 4422 Pls
4410 4466 Pls
4419 4488 Pls
4428 4499 Pls
4437 4499 Pls
4445 4488 Pls
4454 4466 Pls
4463 4433 Pls
4472 4400 Pls
4481 4389 Pls
4490 4311 Pls
4499 4267 Pls
4508 4234 Pls
4516 4168 Pls
4525 4113 Pls
4534 4046 Pls
4543 3969 Pls
4552 3914 Pls
4561 3803 Pls
4570 3737 Pls
4579 3649 Pls
4587 3549 Pls
4596 3461 Pls
4605 3372 Pls
4614 3262 Pls
4623 3140 Pls
4632 3063 Pls
4641 2964 Pls
4650 2886 Pls
4658 2809 Pls
4667 2688 Pls
4676 2610 Pls
4685 2544 Pls
4694 2467 Pls
4703 2378 Pls
4712 2290 Pls
4721 2224 Pls
4729 2135 Pls
4738 2058 Pls
4747 1981 Pls
4756 1881 Pls
4765 1837 Pls
4774 1749 Pls
4783 1682 Pls
4792 1616 Pls
4800 1561 Pls
4809 1528 Pls
4818 1473 Pls
4827 1417 Pls
4836 1362 Pls
4845 1329 Pls
4854 1274 Pls
4863 1241 Pls
4871 1207 Pls
4880 1163 Pls
4889 1130 Pls
4898 1075 Pls
4907 1053 Pls
4916 1031 Pls
4925 1009 Pls
4934 986 Pls
4942 975 Pls
4951 964 Pls
4960 931 Pls
4969 942 Pls
4978 931 Pls
4987 909 Pls
4996 931 Pls
5005 909 Pls
5013 920 Pls
5022 909 Pls
5031 909 Pls
5040 920 Pls
5049 909 Pls
5058 909 Pls
5067 931 Pls
5076 931 Pls
5084 953 Pls
5093 953 Pls
5102 953 Pls
5111 964 Pls
5120 975 Pls
5129 953 Pls
5138 942 Pls
5147 975 Pls
5156 964 Pls
5164 964 Pls
5173 986 Pls
5182 975 Pls
5191 975 Pls
5200 964 Pls
5209 975 Pls
5218 975 Pls
5227 964 Pls
5235 975 Pls
5244 986 Pls
5253 975 Pls
5262 964 Pls
5271 953 Pls
5280 953 Pls
5289 942 Pls
5298 953 Pls
5306 953 Pls
5315 942 Pls
5324 942 Pls
5333 931 Pls
5342 931 Pls
5351 920 Pls
5360 909 Pls
5369 909 Pls
5377 920 Pls
5386 931 Pls
5395 920 Pls
5404 931 Pls
5413 920 Pls
5422 920 Pls
5431 931 Pls
5440 931 Pls
5448 931 Pls
5457 920 Pls
5466 942 Pls
5475 931 Pls
5484 931 Pls
5493 909 Pls
5502 931 Pls
5511 953 Pls
5519 931 Pls
5528 898 Pls
5537 909 Pls
5546 931 Pls
5555 920 Pls
5564 931 Pls
5573 931 Pls
5582 931 Pls
5590 953 Pls
5599 931 Pls
5608 898 Pls
5617 920 Pls
5626 931 Pls
5635 909 Pls
5644 920 Pls
5653 898 Pls
5661 909 Pls
5670 909 Pls
5679 909 Pls
5688 887 Pls
5697 898 Pls
5706 898 Pls
5715 909 Pls
5724 931 Pls
5732 920 Pls
5741 942 Pls
5750 931 Pls
5759 942 Pls
5768 964 Pls
5777 942 Pls
5786 942 Pls
5795 909 Pls
5803 931 Pls
5812 931 Pls
5821 942 Pls
5830 920 Pls
5839 898 Pls
5848 942 Pls
5857 953 Pls
5866 953 Pls
5875 920 Pls
5883 931 Pls
5892 909 Pls
5901 909 Pls
5910 942 Pls
5919 909 Pls
5928 931 Pls
5937 898 Pls
5946 920 Pls
5954 898 Pls
5963 887 Pls
5972 909 Pls
5981 898 Pls
5990 887 Pls
5999 898 Pls
6008 898 Pls
6017 909 Pls
6025 909 Pls
6034 920 Pls
6043 887 Pls
6052 931 Pls
6061 931 Pls
6070 920 Pls
6079 931 Pls
6088 920 Pls
6096 920 Pls
6105 898 Pls
6114 920 Pls
6123 898 Pls
6132 887 Pls
6141 887 Pls
6150 876 Pls
6159 898 Pls
6167 898 Pls
6176 887 Pls
6185 920 Pls
6194 931 Pls
6203 909 Pls
6212 920 Pls
6221 931 Pls
6230 931 Pls
6238 931 Pls
6247 909 Pls
6256 942 Pls
6265 931 Pls
6274 909 Pls
6283 942 Pls
6292 931 Pls
6301 931 Pls
6309 942 Pls
6318 920 Pls
6327 931 Pls
6336 920 Pls
6345 920 Pls
6354 920 Pls
6363 931 Pls
6372 931 Pls
6380 931 Pls
6389 909 Pls
6398 953 Pls
6407 909 Pls
6416 909 Pls
6425 898 Pls
6434 898 Pls
6443 898 Pls
6451 898 Pls
6460 898 Pls
6243 4602 Pls
1.000 UL
LTb
LCb setrgbcolor
1122 4775 N
0 -4335 V
5681 0 V
0 4335 V
-5681 0 V
Z stroke
1.000 UP
1.000 UL
LTb
stroke
grestore
end
showpage
%%Trailer
