%!PS-Adobe-2.0 EPSF-2.0
%%Title: spalt.tex
%%Creator: gnuplot 4.6 patchlevel 5
%%CreationDate: Tue Mar 17 14:59:12 2015
%%DocumentFonts: 
%%BoundingBox: 50 50 410 302
%%EndComments
%%BeginProlog
/gnudict 256 dict def
gnudict begin
%
% The following true/false flags may be edited by hand if desired.
% The unit line width and grayscale image gamma correction may also be changed.
%
/Color true def
/Blacktext true def
/Solid false def
/Dashlength 1 def
/Landscape false def
/Level1 false def
/Rounded false def
/ClipToBoundingBox false def
/SuppressPDFMark false def
/TransparentPatterns false def
/gnulinewidth 5.000 def
/userlinewidth gnulinewidth def
/Gamma 1.0 def
/BackgroundColor {-1.000 -1.000 -1.000} def
%
/vshift -73 def
/dl1 {
  10.0 Dashlength mul mul
  Rounded { currentlinewidth 0.75 mul sub dup 0 le { pop 0.01 } if } if
} def
/dl2 {
  10.0 Dashlength mul mul
  Rounded { currentlinewidth 0.75 mul add } if
} def
/hpt_ 31.5 def
/vpt_ 31.5 def
/hpt hpt_ def
/vpt vpt_ def
/doclip {
  ClipToBoundingBox {
    newpath 50 50 moveto 410 50 lineto 410 302 lineto 50 302 lineto closepath
    clip
  } if
} def
%
% Gnuplot Prolog Version 4.6 (September 2012)
%
%/SuppressPDFMark true def
%
/M {moveto} bind def
/L {lineto} bind def
/R {rmoveto} bind def
/V {rlineto} bind def
/N {newpath moveto} bind def
/Z {closepath} bind def
/C {setrgbcolor} bind def
/f {rlineto fill} bind def
/g {setgray} bind def
/Gshow {show} def   % May be redefined later in the file to support UTF-8
/vpt2 vpt 2 mul def
/hpt2 hpt 2 mul def
/Lshow {currentpoint stroke M 0 vshift R 
	Blacktext {gsave 0 setgray show grestore} {show} ifelse} def
/Rshow {currentpoint stroke M dup stringwidth pop neg vshift R
	Blacktext {gsave 0 setgray show grestore} {show} ifelse} def
/Cshow {currentpoint stroke M dup stringwidth pop -2 div vshift R 
	Blacktext {gsave 0 setgray show grestore} {show} ifelse} def
/UP {dup vpt_ mul /vpt exch def hpt_ mul /hpt exch def
  /hpt2 hpt 2 mul def /vpt2 vpt 2 mul def} def
/DL {Color {setrgbcolor Solid {pop []} if 0 setdash}
 {pop pop pop 0 setgray Solid {pop []} if 0 setdash} ifelse} def
/BL {stroke userlinewidth 2 mul setlinewidth
	Rounded {1 setlinejoin 1 setlinecap} if} def
/AL {stroke userlinewidth 2 div setlinewidth
	Rounded {1 setlinejoin 1 setlinecap} if} def
/UL {dup gnulinewidth mul /userlinewidth exch def
	dup 1 lt {pop 1} if 10 mul /udl exch def} def
/PL {stroke userlinewidth setlinewidth
	Rounded {1 setlinejoin 1 setlinecap} if} def
3.8 setmiterlimit
% Default Line colors
/LCw {1 1 1} def
/LCb {0 0 0} def
/LCa {0 0 0} def
/LC0 {1 0 0} def
/LC1 {0 1 0} def
/LC2 {0 0 1} def
/LC3 {1 0 1} def
/LC4 {0 1 1} def
/LC5 {1 1 0} def
/LC6 {0 0 0} def
/LC7 {1 0.3 0} def
/LC8 {0.5 0.5 0.5} def
% Default Line Types
/LTw {PL [] 1 setgray} def
/LTb {BL [] LCb DL} def
/LTa {AL [1 udl mul 2 udl mul] 0 setdash LCa setrgbcolor} def
/LT0 {PL [] LC0 DL} def
/LT1 {PL [4 dl1 2 dl2] LC1 DL} def
/LT2 {PL [2 dl1 3 dl2] LC2 DL} def
/LT3 {PL [1 dl1 1.5 dl2] LC3 DL} def
/LT4 {PL [6 dl1 2 dl2 1 dl1 2 dl2] LC4 DL} def
/LT5 {PL [3 dl1 3 dl2 1 dl1 3 dl2] LC5 DL} def
/LT6 {PL [2 dl1 2 dl2 2 dl1 6 dl2] LC6 DL} def
/LT7 {PL [1 dl1 2 dl2 6 dl1 2 dl2 1 dl1 2 dl2] LC7 DL} def
/LT8 {PL [2 dl1 2 dl2 2 dl1 2 dl2 2 dl1 2 dl2 2 dl1 4 dl2] LC8 DL} def
/Pnt {stroke [] 0 setdash gsave 1 setlinecap M 0 0 V stroke grestore} def
/Dia {stroke [] 0 setdash 2 copy vpt add M
  hpt neg vpt neg V hpt vpt neg V
  hpt vpt V hpt neg vpt V closepath stroke
  Pnt} def
/Pls {stroke [] 0 setdash vpt sub M 0 vpt2 V
  currentpoint stroke M
  hpt neg vpt neg R hpt2 0 V stroke
 } def
/Box {stroke [] 0 setdash 2 copy exch hpt sub exch vpt add M
  0 vpt2 neg V hpt2 0 V 0 vpt2 V
  hpt2 neg 0 V closepath stroke
  Pnt} def
/Crs {stroke [] 0 setdash exch hpt sub exch vpt add M
  hpt2 vpt2 neg V currentpoint stroke M
  hpt2 neg 0 R hpt2 vpt2 V stroke} def
/TriU {stroke [] 0 setdash 2 copy vpt 1.12 mul add M
  hpt neg vpt -1.62 mul V
  hpt 2 mul 0 V
  hpt neg vpt 1.62 mul V closepath stroke
  Pnt} def
/Star {2 copy Pls Crs} def
/BoxF {stroke [] 0 setdash exch hpt sub exch vpt add M
  0 vpt2 neg V hpt2 0 V 0 vpt2 V
  hpt2 neg 0 V closepath fill} def
/TriUF {stroke [] 0 setdash vpt 1.12 mul add M
  hpt neg vpt -1.62 mul V
  hpt 2 mul 0 V
  hpt neg vpt 1.62 mul V closepath fill} def
/TriD {stroke [] 0 setdash 2 copy vpt 1.12 mul sub M
  hpt neg vpt 1.62 mul V
  hpt 2 mul 0 V
  hpt neg vpt -1.62 mul V closepath stroke
  Pnt} def
/TriDF {stroke [] 0 setdash vpt 1.12 mul sub M
  hpt neg vpt 1.62 mul V
  hpt 2 mul 0 V
  hpt neg vpt -1.62 mul V closepath fill} def
/DiaF {stroke [] 0 setdash vpt add M
  hpt neg vpt neg V hpt vpt neg V
  hpt vpt V hpt neg vpt V closepath fill} def
/Pent {stroke [] 0 setdash 2 copy gsave
  translate 0 hpt M 4 {72 rotate 0 hpt L} repeat
  closepath stroke grestore Pnt} def
/PentF {stroke [] 0 setdash gsave
  translate 0 hpt M 4 {72 rotate 0 hpt L} repeat
  closepath fill grestore} def
/Circle {stroke [] 0 setdash 2 copy
  hpt 0 360 arc stroke Pnt} def
/CircleF {stroke [] 0 setdash hpt 0 360 arc fill} def
/C0 {BL [] 0 setdash 2 copy moveto vpt 90 450 arc} bind def
/C1 {BL [] 0 setdash 2 copy moveto
	2 copy vpt 0 90 arc closepath fill
	vpt 0 360 arc closepath} bind def
/C2 {BL [] 0 setdash 2 copy moveto
	2 copy vpt 90 180 arc closepath fill
	vpt 0 360 arc closepath} bind def
/C3 {BL [] 0 setdash 2 copy moveto
	2 copy vpt 0 180 arc closepath fill
	vpt 0 360 arc closepath} bind def
/C4 {BL [] 0 setdash 2 copy moveto
	2 copy vpt 180 270 arc closepath fill
	vpt 0 360 arc closepath} bind def
/C5 {BL [] 0 setdash 2 copy moveto
	2 copy vpt 0 90 arc
	2 copy moveto
	2 copy vpt 180 270 arc closepath fill
	vpt 0 360 arc} bind def
/C6 {BL [] 0 setdash 2 copy moveto
	2 copy vpt 90 270 arc closepath fill
	vpt 0 360 arc closepath} bind def
/C7 {BL [] 0 setdash 2 copy moveto
	2 copy vpt 0 270 arc closepath fill
	vpt 0 360 arc closepath} bind def
/C8 {BL [] 0 setdash 2 copy moveto
	2 copy vpt 270 360 arc closepath fill
	vpt 0 360 arc closepath} bind def
/C9 {BL [] 0 setdash 2 copy moveto
	2 copy vpt 270 450 arc closepath fill
	vpt 0 360 arc closepath} bind def
/C10 {BL [] 0 setdash 2 copy 2 copy moveto vpt 270 360 arc closepath fill
	2 copy moveto
	2 copy vpt 90 180 arc closepath fill
	vpt 0 360 arc closepath} bind def
/C11 {BL [] 0 setdash 2 copy moveto
	2 copy vpt 0 180 arc closepath fill
	2 copy moveto
	2 copy vpt 270 360 arc closepath fill
	vpt 0 360 arc closepath} bind def
/C12 {BL [] 0 setdash 2 copy moveto
	2 copy vpt 180 360 arc closepath fill
	vpt 0 360 arc closepath} bind def
/C13 {BL [] 0 setdash 2 copy moveto
	2 copy vpt 0 90 arc closepath fill
	2 copy moveto
	2 copy vpt 180 360 arc closepath fill
	vpt 0 360 arc closepath} bind def
/C14 {BL [] 0 setdash 2 copy moveto
	2 copy vpt 90 360 arc closepath fill
	vpt 0 360 arc} bind def
/C15 {BL [] 0 setdash 2 copy vpt 0 360 arc closepath fill
	vpt 0 360 arc closepath} bind def
/Rec {newpath 4 2 roll moveto 1 index 0 rlineto 0 exch rlineto
	neg 0 rlineto closepath} bind def
/Square {dup Rec} bind def
/Bsquare {vpt sub exch vpt sub exch vpt2 Square} bind def
/S0 {BL [] 0 setdash 2 copy moveto 0 vpt rlineto BL Bsquare} bind def
/S1 {BL [] 0 setdash 2 copy vpt Square fill Bsquare} bind def
/S2 {BL [] 0 setdash 2 copy exch vpt sub exch vpt Square fill Bsquare} bind def
/S3 {BL [] 0 setdash 2 copy exch vpt sub exch vpt2 vpt Rec fill Bsquare} bind def
/S4 {BL [] 0 setdash 2 copy exch vpt sub exch vpt sub vpt Square fill Bsquare} bind def
/S5 {BL [] 0 setdash 2 copy 2 copy vpt Square fill
	exch vpt sub exch vpt sub vpt Square fill Bsquare} bind def
/S6 {BL [] 0 setdash 2 copy exch vpt sub exch vpt sub vpt vpt2 Rec fill Bsquare} bind def
/S7 {BL [] 0 setdash 2 copy exch vpt sub exch vpt sub vpt vpt2 Rec fill
	2 copy vpt Square fill Bsquare} bind def
/S8 {BL [] 0 setdash 2 copy vpt sub vpt Square fill Bsquare} bind def
/S9 {BL [] 0 setdash 2 copy vpt sub vpt vpt2 Rec fill Bsquare} bind def
/S10 {BL [] 0 setdash 2 copy vpt sub vpt Square fill 2 copy exch vpt sub exch vpt Square fill
	Bsquare} bind def
/S11 {BL [] 0 setdash 2 copy vpt sub vpt Square fill 2 copy exch vpt sub exch vpt2 vpt Rec fill
	Bsquare} bind def
/S12 {BL [] 0 setdash 2 copy exch vpt sub exch vpt sub vpt2 vpt Rec fill Bsquare} bind def
/S13 {BL [] 0 setdash 2 copy exch vpt sub exch vpt sub vpt2 vpt Rec fill
	2 copy vpt Square fill Bsquare} bind def
/S14 {BL [] 0 setdash 2 copy exch vpt sub exch vpt sub vpt2 vpt Rec fill
	2 copy exch vpt sub exch vpt Square fill Bsquare} bind def
/S15 {BL [] 0 setdash 2 copy Bsquare fill Bsquare} bind def
/D0 {gsave translate 45 rotate 0 0 S0 stroke grestore} bind def
/D1 {gsave translate 45 rotate 0 0 S1 stroke grestore} bind def
/D2 {gsave translate 45 rotate 0 0 S2 stroke grestore} bind def
/D3 {gsave translate 45 rotate 0 0 S3 stroke grestore} bind def
/D4 {gsave translate 45 rotate 0 0 S4 stroke grestore} bind def
/D5 {gsave translate 45 rotate 0 0 S5 stroke grestore} bind def
/D6 {gsave translate 45 rotate 0 0 S6 stroke grestore} bind def
/D7 {gsave translate 45 rotate 0 0 S7 stroke grestore} bind def
/D8 {gsave translate 45 rotate 0 0 S8 stroke grestore} bind def
/D9 {gsave translate 45 rotate 0 0 S9 stroke grestore} bind def
/D10 {gsave translate 45 rotate 0 0 S10 stroke grestore} bind def
/D11 {gsave translate 45 rotate 0 0 S11 stroke grestore} bind def
/D12 {gsave translate 45 rotate 0 0 S12 stroke grestore} bind def
/D13 {gsave translate 45 rotate 0 0 S13 stroke grestore} bind def
/D14 {gsave translate 45 rotate 0 0 S14 stroke grestore} bind def
/D15 {gsave translate 45 rotate 0 0 S15 stroke grestore} bind def
/DiaE {stroke [] 0 setdash vpt add M
  hpt neg vpt neg V hpt vpt neg V
  hpt vpt V hpt neg vpt V closepath stroke} def
/BoxE {stroke [] 0 setdash exch hpt sub exch vpt add M
  0 vpt2 neg V hpt2 0 V 0 vpt2 V
  hpt2 neg 0 V closepath stroke} def
/TriUE {stroke [] 0 setdash vpt 1.12 mul add M
  hpt neg vpt -1.62 mul V
  hpt 2 mul 0 V
  hpt neg vpt 1.62 mul V closepath stroke} def
/TriDE {stroke [] 0 setdash vpt 1.12 mul sub M
  hpt neg vpt 1.62 mul V
  hpt 2 mul 0 V
  hpt neg vpt -1.62 mul V closepath stroke} def
/PentE {stroke [] 0 setdash gsave
  translate 0 hpt M 4 {72 rotate 0 hpt L} repeat
  closepath stroke grestore} def
/CircE {stroke [] 0 setdash 
  hpt 0 360 arc stroke} def
/Opaque {gsave closepath 1 setgray fill grestore 0 setgray closepath} def
/DiaW {stroke [] 0 setdash vpt add M
  hpt neg vpt neg V hpt vpt neg V
  hpt vpt V hpt neg vpt V Opaque stroke} def
/BoxW {stroke [] 0 setdash exch hpt sub exch vpt add M
  0 vpt2 neg V hpt2 0 V 0 vpt2 V
  hpt2 neg 0 V Opaque stroke} def
/TriUW {stroke [] 0 setdash vpt 1.12 mul add M
  hpt neg vpt -1.62 mul V
  hpt 2 mul 0 V
  hpt neg vpt 1.62 mul V Opaque stroke} def
/TriDW {stroke [] 0 setdash vpt 1.12 mul sub M
  hpt neg vpt 1.62 mul V
  hpt 2 mul 0 V
  hpt neg vpt -1.62 mul V Opaque stroke} def
/PentW {stroke [] 0 setdash gsave
  translate 0 hpt M 4 {72 rotate 0 hpt L} repeat
  Opaque stroke grestore} def
/CircW {stroke [] 0 setdash 
  hpt 0 360 arc Opaque stroke} def
/BoxFill {gsave Rec 1 setgray fill grestore} def
/Density {
  /Fillden exch def
  currentrgbcolor
  /ColB exch def /ColG exch def /ColR exch def
  /ColR ColR Fillden mul Fillden sub 1 add def
  /ColG ColG Fillden mul Fillden sub 1 add def
  /ColB ColB Fillden mul Fillden sub 1 add def
  ColR ColG ColB setrgbcolor} def
/BoxColFill {gsave Rec PolyFill} def
/PolyFill {gsave Density fill grestore grestore} def
/h {rlineto rlineto rlineto gsave closepath fill grestore} bind def
%
% PostScript Level 1 Pattern Fill routine for rectangles
% Usage: x y w h s a XX PatternFill
%	x,y = lower left corner of box to be filled
%	w,h = width and height of box
%	  a = angle in degrees between lines and x-axis
%	 XX = 0/1 for no/yes cross-hatch
%
/PatternFill {gsave /PFa [ 9 2 roll ] def
  PFa 0 get PFa 2 get 2 div add PFa 1 get PFa 3 get 2 div add translate
  PFa 2 get -2 div PFa 3 get -2 div PFa 2 get PFa 3 get Rec
  TransparentPatterns {} {gsave 1 setgray fill grestore} ifelse
  clip
  currentlinewidth 0.5 mul setlinewidth
  /PFs PFa 2 get dup mul PFa 3 get dup mul add sqrt def
  0 0 M PFa 5 get rotate PFs -2 div dup translate
  0 1 PFs PFa 4 get div 1 add floor cvi
	{PFa 4 get mul 0 M 0 PFs V} for
  0 PFa 6 get ne {
	0 1 PFs PFa 4 get div 1 add floor cvi
	{PFa 4 get mul 0 2 1 roll M PFs 0 V} for
 } if
  stroke grestore} def
%
/languagelevel where
 {pop languagelevel} {1} ifelse
 2 lt
	{/InterpretLevel1 true def}
	{/InterpretLevel1 Level1 def}
 ifelse
%
% PostScript level 2 pattern fill definitions
%
/Level2PatternFill {
/Tile8x8 {/PaintType 2 /PatternType 1 /TilingType 1 /BBox [0 0 8 8] /XStep 8 /YStep 8}
	bind def
/KeepColor {currentrgbcolor [/Pattern /DeviceRGB] setcolorspace} bind def
<< Tile8x8
 /PaintProc {0.5 setlinewidth pop 0 0 M 8 8 L 0 8 M 8 0 L stroke} 
>> matrix makepattern
/Pat1 exch def
<< Tile8x8
 /PaintProc {0.5 setlinewidth pop 0 0 M 8 8 L 0 8 M 8 0 L stroke
	0 4 M 4 8 L 8 4 L 4 0 L 0 4 L stroke}
>> matrix makepattern
/Pat2 exch def
<< Tile8x8
 /PaintProc {0.5 setlinewidth pop 0 0 M 0 8 L
	8 8 L 8 0 L 0 0 L fill}
>> matrix makepattern
/Pat3 exch def
<< Tile8x8
 /PaintProc {0.5 setlinewidth pop -4 8 M 8 -4 L
	0 12 M 12 0 L stroke}
>> matrix makepattern
/Pat4 exch def
<< Tile8x8
 /PaintProc {0.5 setlinewidth pop -4 0 M 8 12 L
	0 -4 M 12 8 L stroke}
>> matrix makepattern
/Pat5 exch def
<< Tile8x8
 /PaintProc {0.5 setlinewidth pop -2 8 M 4 -4 L
	0 12 M 8 -4 L 4 12 M 10 0 L stroke}
>> matrix makepattern
/Pat6 exch def
<< Tile8x8
 /PaintProc {0.5 setlinewidth pop -2 0 M 4 12 L
	0 -4 M 8 12 L 4 -4 M 10 8 L stroke}
>> matrix makepattern
/Pat7 exch def
<< Tile8x8
 /PaintProc {0.5 setlinewidth pop 8 -2 M -4 4 L
	12 0 M -4 8 L 12 4 M 0 10 L stroke}
>> matrix makepattern
/Pat8 exch def
<< Tile8x8
 /PaintProc {0.5 setlinewidth pop 0 -2 M 12 4 L
	-4 0 M 12 8 L -4 4 M 8 10 L stroke}
>> matrix makepattern
/Pat9 exch def
/Pattern1 {PatternBgnd KeepColor Pat1 setpattern} bind def
/Pattern2 {PatternBgnd KeepColor Pat2 setpattern} bind def
/Pattern3 {PatternBgnd KeepColor Pat3 setpattern} bind def
/Pattern4 {PatternBgnd KeepColor Landscape {Pat5} {Pat4} ifelse setpattern} bind def
/Pattern5 {PatternBgnd KeepColor Landscape {Pat4} {Pat5} ifelse setpattern} bind def
/Pattern6 {PatternBgnd KeepColor Landscape {Pat9} {Pat6} ifelse setpattern} bind def
/Pattern7 {PatternBgnd KeepColor Landscape {Pat8} {Pat7} ifelse setpattern} bind def
} def
%
%
%End of PostScript Level 2 code
%
/PatternBgnd {
  TransparentPatterns {} {gsave 1 setgray fill grestore} ifelse
} def
%
% Substitute for Level 2 pattern fill codes with
% grayscale if Level 2 support is not selected.
%
/Level1PatternFill {
/Pattern1 {0.250 Density} bind def
/Pattern2 {0.500 Density} bind def
/Pattern3 {0.750 Density} bind def
/Pattern4 {0.125 Density} bind def
/Pattern5 {0.375 Density} bind def
/Pattern6 {0.625 Density} bind def
/Pattern7 {0.875 Density} bind def
} def
%
% Now test for support of Level 2 code
%
Level1 {Level1PatternFill} {Level2PatternFill} ifelse
%
/Symbol-Oblique /Symbol findfont [1 0 .167 1 0 0] makefont
dup length dict begin {1 index /FID eq {pop pop} {def} ifelse} forall
currentdict end definefont pop
Level1 SuppressPDFMark or 
{} {
/SDict 10 dict def
systemdict /pdfmark known not {
  userdict /pdfmark systemdict /cleartomark get put
} if
SDict begin [
  /Title (spalt.tex)
  /Subject (gnuplot plot)
  /Creator (gnuplot 4.6 patchlevel 5)
  /Author (kevin.luedemann)
%  /Producer (gnuplot)
%  /Keywords ()
  /CreationDate (Tue Mar 17 14:59:12 2015)
  /DOCINFO pdfmark
end
} ifelse
end
%%EndProlog
%%Page: 1 1
gnudict begin
gsave
doclip
50 50 translate
0.050 0.050 scale
0 setgray
newpath
1.000 UL
LTb
LCb setrgbcolor
990 440 M
63 0 V
5750 0 R
-63 0 V
stroke
LTb
990 874 M
63 0 V
5750 0 R
-63 0 V
990 1307 M
63 0 V
5750 0 R
-63 0 V
990 1741 M
63 0 V
5750 0 R
-63 0 V
990 2174 M
63 0 V
5750 0 R
-63 0 V
990 2608 M
63 0 V
5750 0 R
-63 0 V
990 3041 M
63 0 V
5750 0 R
-63 0 V
990 3475 M
63 0 V
5750 0 R
-63 0 V
990 3908 M
63 0 V
5750 0 R
-63 0 V
990 4342 M
63 0 V
5750 0 R
-63 0 V
990 4775 M
63 0 V
5750 0 R
-63 0 V
990 440 M
0 63 V
0 4272 R
0 -63 V
1820 440 M
0 63 V
0 4272 R
0 -63 V
2651 440 M
0 63 V
0 4272 R
0 -63 V
3481 440 M
0 63 V
0 4272 R
0 -63 V
4312 440 M
0 63 V
0 4272 R
0 -63 V
5142 440 M
0 63 V
0 4272 R
0 -63 V
5973 440 M
0 63 V
0 4272 R
0 -63 V
6803 440 M
0 63 V
0 4272 R
0 -63 V
stroke
990 4775 N
990 440 L
5813 0 V
0 4335 V
-5813 0 V
Z stroke
1.000 UP
1.000 UL
LTb
1.000 UP
1.000 UL
LT0
LC0 setrgbcolor
LCb setrgbcolor
LT0
LC0 setrgbcolor
3338 603 Pls
3355 647 Pls
3371 647 Pls
3388 691 Pls
3404 779 Pls
3421 868 Pls
3438 912 Pls
3454 1000 Pls
3471 1089 Pls
3488 1177 Pls
3504 1309 Pls
3521 1442 Pls
3537 1619 Pls
3554 1795 Pls
3571 1972 Pls
3587 2193 Pls
3604 2370 Pls
3620 2591 Pls
3637 2723 Pls
3654 2944 Pls
3670 3121 Pls
3687 3298 Pls
3703 3518 Pls
3720 3695 Pls
3737 3872 Pls
3753 4049 Pls
3770 4181 Pls
3786 4270 Pls
3803 4358 Pls
3820 4446 Pls
3836 4490 Pls
3853 4535 Pls
3870 4535 Pls
3886 4490 Pls
3903 4446 Pls
3919 4402 Pls
3936 4270 Pls
3953 4181 Pls
3969 4049 Pls
3986 3916 Pls
4002 3784 Pls
4019 3607 Pls
4036 3386 Pls
4052 3209 Pls
4069 2988 Pls
4085 2767 Pls
4102 2591 Pls
4119 2414 Pls
4135 2237 Pls
4152 2061 Pls
4168 1884 Pls
4185 1707 Pls
4202 1530 Pls
4218 1398 Pls
4235 1221 Pls
4252 1089 Pls
4268 956 Pls
4285 868 Pls
4301 823 Pls
4318 735 Pls
4335 691 Pls
4351 647 Pls
4368 647 Pls
4384 603 Pls
4401 558 Pls
4418 603 Pls
4434 558 Pls
4451 558 Pls
4467 603 Pls
4484 603 Pls
4501 603 Pls
4517 647 Pls
4534 647 Pls
4550 691 Pls
4567 691 Pls
4584 691 Pls
4600 691 Pls
4617 691 Pls
4634 691 Pls
4650 735 Pls
4667 691 Pls
4683 691 Pls
4700 691 Pls
4717 691 Pls
4733 691 Pls
4750 647 Pls
4766 647 Pls
4783 647 Pls
4800 603 Pls
4816 603 Pls
4833 603 Pls
4849 558 Pls
4866 603 Pls
4883 558 Pls
4899 558 Pls
4916 558 Pls
4932 558 Pls
4949 558 Pls
4966 558 Pls
4982 558 Pls
4999 558 Pls
5016 558 Pls
6243 4602 Pls
1.000 UP
1.000 UL
LT0
1372 534 Pls
1382 538 Pls
1393 529 Pls
1403 529 Pls
1414 516 Pls
1424 521 Pls
1434 543 Pls
1445 525 Pls
1455 534 Pls
1465 538 Pls
1476 534 Pls
1486 538 Pls
1497 556 Pls
1507 551 Pls
1517 543 Pls
1528 551 Pls
1538 551 Pls
1548 556 Pls
1559 556 Pls
1569 556 Pls
1580 551 Pls
1590 556 Pls
1600 547 Pls
1611 543 Pls
1621 547 Pls
1632 551 Pls
1642 551 Pls
1652 538 Pls
1663 543 Pls
1673 538 Pls
1683 525 Pls
1694 534 Pls
1704 534 Pls
1715 534 Pls
1725 529 Pls
1735 512 Pls
1746 538 Pls
1756 538 Pls
1766 534 Pls
1777 534 Pls
1787 529 Pls
1798 521 Pls
1808 534 Pls
1818 538 Pls
1829 538 Pls
1839 543 Pls
1849 547 Pls
1860 547 Pls
1870 551 Pls
1881 556 Pls
1891 547 Pls
1901 556 Pls
1912 543 Pls
1922 547 Pls
1933 538 Pls
1943 538 Pls
1953 551 Pls
1964 547 Pls
1974 543 Pls
1984 543 Pls
1995 538 Pls
2005 538 Pls
2016 516 Pls
2026 512 Pls
2036 538 Pls
2047 538 Pls
2057 543 Pls
2067 543 Pls
2078 538 Pls
2088 534 Pls
2099 538 Pls
2109 529 Pls
2119 538 Pls
2130 534 Pls
2140 525 Pls
2151 525 Pls
2161 534 Pls
2171 534 Pls
2182 538 Pls
2192 525 Pls
2202 516 Pls
2213 503 Pls
2223 507 Pls
2234 503 Pls
2244 498 Pls
2254 490 Pls
2265 503 Pls
2275 507 Pls
2285 529 Pls
2296 525 Pls
2306 525 Pls
2317 525 Pls
2327 529 Pls
2337 534 Pls
2348 521 Pls
2358 543 Pls
2369 538 Pls
2379 547 Pls
2389 543 Pls
2400 538 Pls
2410 551 Pls
2420 556 Pls
2431 547 Pls
2441 551 Pls
2452 551 Pls
2462 569 Pls
2472 565 Pls
2483 578 Pls
2493 569 Pls
2503 574 Pls
2514 574 Pls
2524 578 Pls
2535 578 Pls
2545 574 Pls
2555 578 Pls
2566 574 Pls
2576 560 Pls
2586 569 Pls
2597 574 Pls
2607 574 Pls
2618 569 Pls
2628 569 Pls
2638 565 Pls
2649 565 Pls
2659 560 Pls
2670 569 Pls
2680 565 Pls
2690 547 Pls
2701 547 Pls
2711 538 Pls
2721 538 Pls
2732 538 Pls
2742 551 Pls
2753 543 Pls
2763 538 Pls
2773 525 Pls
2784 534 Pls
2794 538 Pls
2804 529 Pls
2815 534 Pls
2825 534 Pls
2836 534 Pls
2846 529 Pls
2856 534 Pls
2867 547 Pls
2877 534 Pls
2888 551 Pls
2898 556 Pls
2908 556 Pls
2919 591 Pls
2929 591 Pls
2939 596 Pls
2950 609 Pls
2960 613 Pls
2971 613 Pls
2981 622 Pls
2991 627 Pls
3002 627 Pls
3012 635 Pls
3022 640 Pls
3033 653 Pls
3043 666 Pls
3054 666 Pls
3064 671 Pls
3074 688 Pls
3085 688 Pls
3095 684 Pls
3106 688 Pls
3116 688 Pls
3126 680 Pls
3137 684 Pls
3147 675 Pls
3157 653 Pls
3168 675 Pls
3178 666 Pls
3189 658 Pls
3199 644 Pls
3209 640 Pls
3220 635 Pls
3230 627 Pls
3240 600 Pls
3251 604 Pls
3261 596 Pls
3272 596 Pls
3282 596 Pls
3292 600 Pls
3303 604 Pls
3313 604 Pls
3324 587 Pls
3334 604 Pls
3344 604 Pls
3355 618 Pls
3365 622 Pls
3375 644 Pls
3386 680 Pls
3396 697 Pls
3407 733 Pls
3417 764 Pls
3427 803 Pls
3438 874 Pls
3448 905 Pls
3458 971 Pls
3469 1020 Pls
3479 1073 Pls
3490 1126 Pls
3500 1210 Pls
3510 1267 Pls
3521 1307 Pls
3531 1417 Pls
3541 1501 Pls
3552 1630 Pls
3562 1815 Pls
3573 1850 Pls
3583 1952 Pls
3593 2071 Pls
3604 2164 Pls
3614 2288 Pls
3625 2420 Pls
3635 2500 Pls
3645 2619 Pls
3656 2743 Pls
3666 2800 Pls
3676 2876 Pls
3687 2977 Pls
3697 3114 Pls
3708 3242 Pls
3718 3344 Pls
3728 3454 Pls
3739 3574 Pls
3749 3649 Pls
3759 3711 Pls
3770 3808 Pls
3780 3892 Pls
3791 3954 Pls
3801 3985 Pls
3811 4033 Pls
3822 4060 Pls
3832 4069 Pls
3843 4082 Pls
3853 4113 Pls
3863 4104 Pls
3874 4099 Pls
3884 4095 Pls
3894 4077 Pls
3905 4038 Pls
3915 3971 Pls
3926 3932 Pls
3936 3879 Pls
3946 3843 Pls
3957 3989 Pls
3967 3830 Pls
3977 3636 Pls
3988 3600 Pls
3998 3653 Pls
4009 3666 Pls
4019 3600 Pls
4029 3459 Pls
4040 3326 Pls
4050 3366 Pls
4061 2986 Pls
4071 3092 Pls
4081 2995 Pls
4092 2876 Pls
4102 2752 Pls
4112 2381 Pls
4123 2239 Pls
4133 2080 Pls
4144 2067 Pls
4154 1961 Pls
4164 1837 Pls
4175 1705 Pls
4185 1616 Pls
4195 1488 Pls
4206 1369 Pls
4216 1289 Pls
4227 1214 Pls
4237 1108 Pls
4247 1046 Pls
4258 1055 Pls
4268 1091 Pls
4278 1024 Pls
4289 839 Pls
4299 803 Pls
4310 772 Pls
4320 728 Pls
4330 711 Pls
4341 706 Pls
4351 772 Pls
4362 733 Pls
4372 706 Pls
4382 666 Pls
4393 640 Pls
4403 622 Pls
4413 600 Pls
4424 569 Pls
4434 538 Pls
4445 538 Pls
4455 569 Pls
4465 565 Pls
4476 551 Pls
4486 560 Pls
4496 551 Pls
4507 560 Pls
4517 565 Pls
4528 574 Pls
4538 587 Pls
4548 609 Pls
4559 596 Pls
4569 591 Pls
4580 591 Pls
4590 596 Pls
4600 613 Pls
4611 627 Pls
4621 627 Pls
4631 640 Pls
4642 644 Pls
4652 649 Pls
4663 658 Pls
4673 684 Pls
4683 680 Pls
4694 666 Pls
4704 658 Pls
4714 653 Pls
4725 658 Pls
4735 658 Pls
4746 658 Pls
4756 653 Pls
4766 644 Pls
4777 609 Pls
4787 604 Pls
4798 596 Pls
4808 582 Pls
4818 569 Pls
4829 565 Pls
4839 556 Pls
4849 547 Pls
4860 538 Pls
4870 547 Pls
4881 538 Pls
4891 529 Pls
4901 543 Pls
4912 543 Pls
4922 547 Pls
4932 551 Pls
4943 543 Pls
4953 543 Pls
4964 547 Pls
4974 547 Pls
4984 551 Pls
4995 556 Pls
5005 551 Pls
5016 565 Pls
5026 569 Pls
5036 574 Pls
5047 578 Pls
5057 574 Pls
5067 582 Pls
5078 578 Pls
5088 574 Pls
5099 582 Pls
5109 578 Pls
5119 591 Pls
5130 587 Pls
5140 574 Pls
5150 578 Pls
5161 582 Pls
5171 582 Pls
5182 587 Pls
5192 591 Pls
5202 591 Pls
5213 582 Pls
5223 578 Pls
5233 587 Pls
5244 582 Pls
5254 582 Pls
5265 587 Pls
5275 574 Pls
5285 582 Pls
5296 587 Pls
5306 587 Pls
5317 578 Pls
5327 574 Pls
5337 578 Pls
5348 569 Pls
5358 565 Pls
5368 565 Pls
5379 560 Pls
5389 565 Pls
5400 560 Pls
5410 556 Pls
5420 560 Pls
5431 560 Pls
5441 560 Pls
5451 560 Pls
5462 551 Pls
5472 556 Pls
5483 547 Pls
5493 560 Pls
5503 547 Pls
5514 551 Pls
5524 547 Pls
5535 547 Pls
5545 538 Pls
5555 543 Pls
5566 543 Pls
5576 543 Pls
5586 538 Pls
5597 543 Pls
5607 547 Pls
5618 543 Pls
5628 543 Pls
5638 538 Pls
5649 543 Pls
5659 547 Pls
5669 547 Pls
5680 547 Pls
5690 543 Pls
5701 560 Pls
5711 547 Pls
5721 529 Pls
5732 556 Pls
5742 547 Pls
5753 538 Pls
5763 556 Pls
5773 556 Pls
5784 551 Pls
5794 556 Pls
5804 556 Pls
5815 556 Pls
5825 560 Pls
5836 538 Pls
5846 547 Pls
5856 547 Pls
5867 543 Pls
5877 543 Pls
5887 547 Pls
5898 547 Pls
5908 547 Pls
5919 547 Pls
5929 551 Pls
5939 547 Pls
5950 551 Pls
5960 551 Pls
5970 547 Pls
5981 543 Pls
5991 547 Pls
6002 543 Pls
6012 543 Pls
6022 538 Pls
6033 543 Pls
6043 551 Pls
6054 538 Pls
6064 547 Pls
6074 538 Pls
6085 538 Pls
6095 538 Pls
6105 543 Pls
6116 543 Pls
6126 543 Pls
6137 543 Pls
6147 547 Pls
6157 547 Pls
6168 529 Pls
6178 547 Pls
6188 543 Pls
6199 543 Pls
6209 538 Pls
6220 543 Pls
6230 538 Pls
6240 543 Pls
6251 543 Pls
6261 543 Pls
1.000 UP
1.000 UL
LT0
5275 570 Pls
5285 558 Pls
5296 553 Pls
5306 549 Pls
5317 539 Pls
5327 533 Pls
5337 533 Pls
5348 532 Pls
5358 533 Pls
5368 527 Pls
5379 519 Pls
5389 523 Pls
5400 541 Pls
5410 522 Pls
5420 537 Pls
5431 539 Pls
5441 543 Pls
5451 543 Pls
5462 539 Pls
5472 540 Pls
5483 523 Pls
5493 539 Pls
5503 541 Pls
5514 542 Pls
5524 545 Pls
5535 533 Pls
5545 541 Pls
5555 541 Pls
5566 543 Pls
5576 545 Pls
5586 546 Pls
5597 545 Pls
5607 546 Pls
5618 546 Pls
5628 548 Pls
5638 548 Pls
5649 549 Pls
5659 541 Pls
5669 530 Pls
5680 544 Pls
5690 543 Pls
5701 544 Pls
5711 543 Pls
5721 542 Pls
5732 543 Pls
5742 547 Pls
5753 547 Pls
5763 546 Pls
5773 526 Pls
5784 533 Pls
5794 532 Pls
5804 533 Pls
5815 528 Pls
5825 527 Pls
5836 539 Pls
5846 538 Pls
5856 540 Pls
5867 521 Pls
5877 520 Pls
5887 521 Pls
5898 521 Pls
5908 522 Pls
5919 522 Pls
5929 521 Pls
5939 521 Pls
5950 521 Pls
5960 521 Pls
5970 520 Pls
5981 522 Pls
5991 523 Pls
6002 521 Pls
6012 537 Pls
6022 539 Pls
6033 540 Pls
6043 542 Pls
6054 539 Pls
6064 538 Pls
6074 536 Pls
6085 529 Pls
6095 526 Pls
6105 526 Pls
6116 525 Pls
6126 526 Pls
6137 526 Pls
6147 527 Pls
6157 531 Pls
6168 534 Pls
6178 547 Pls
6188 549 Pls
6199 546 Pls
6209 534 Pls
6220 533 Pls
6230 533 Pls
6240 531 Pls
6251 531 Pls
6261 532 Pls
6272 533 Pls
6282 526 Pls
6292 527 Pls
6303 528 Pls
6313 529 Pls
6323 530 Pls
6334 536 Pls
6344 547 Pls
6355 548 Pls
6365 552 Pls
1.000 UP
1.000 UL
LT0
1725 558 Pls
1735 557 Pls
1746 558 Pls
1756 558 Pls
1766 558 Pls
1777 558 Pls
1787 558 Pls
1798 558 Pls
1808 559 Pls
1818 559 Pls
1829 560 Pls
1839 561 Pls
1849 562 Pls
1860 562 Pls
1870 559 Pls
1881 558 Pls
1891 559 Pls
1901 565 Pls
1912 567 Pls
1922 568 Pls
1933 567 Pls
1943 568 Pls
1953 570 Pls
1964 555 Pls
1974 566 Pls
1984 567 Pls
1995 567 Pls
2005 568 Pls
2016 567 Pls
2026 567 Pls
2036 566 Pls
2047 567 Pls
2057 566 Pls
2067 566 Pls
2078 564 Pls
2088 559 Pls
2099 559 Pls
2109 562 Pls
2119 561 Pls
2130 559 Pls
2140 557 Pls
2151 555 Pls
2161 556 Pls
2171 549 Pls
2182 542 Pls
2192 547 Pls
2202 545 Pls
2213 542 Pls
2223 542 Pls
2234 541 Pls
2244 542 Pls
2254 541 Pls
2265 543 Pls
2275 542 Pls
2285 543 Pls
2296 545 Pls
2306 545 Pls
2317 538 Pls
2327 540 Pls
2337 539 Pls
2348 538 Pls
2358 548 Pls
2369 553 Pls
2379 543 Pls
2389 545 Pls
2400 548 Pls
2410 550 Pls
2420 549 Pls
2431 548 Pls
2441 554 Pls
2452 572 Pls
2462 574 Pls
2472 574 Pls
2483 577 Pls
2493 581 Pls
2503 583 Pls
2514 587 Pls
2524 586 Pls
2535 593 Pls
2545 595 Pls
2555 596 Pls
2566 593 Pls
2576 588 Pls
2586 591 Pls
2597 589 Pls
2607 588 Pls
2618 587 Pls
2628 585 Pls
2638 583 Pls
2649 582 Pls
2659 581 Pls
2670 579 Pls
2680 578 Pls
2690 575 Pls
2701 572 Pls
2711 570 Pls
2721 568 Pls
2732 566 Pls
2742 564 Pls
2753 563 Pls
2763 562 Pls
2773 561 Pls
2784 560 Pls
2794 560 Pls
2804 560 Pls
2815 562 Pls
2825 562 Pls
2836 565 Pls
2846 567 Pls
2856 571 Pls
2867 572 Pls
2877 578 Pls
2888 584 Pls
2898 589 Pls
2908 600 Pls
2919 605 Pls
2929 612 Pls
2939 619 Pls
2950 626 Pls
2960 633 Pls
2971 639 Pls
2981 646 Pls
2991 650 Pls
3002 654 Pls
3012 661 Pls
3022 663 Pls
3033 669 Pls
3043 676 Pls
3054 682 Pls
3064 684 Pls
3074 688 Pls
3085 688 Pls
3095 689 Pls
3106 689 Pls
3116 690 Pls
3126 685 Pls
3137 684 Pls
3147 682 Pls
3157 679 Pls
3168 676 Pls
3178 668 Pls
3189 664 Pls
3199 658 Pls
3209 649 Pls
3220 642 Pls
3230 634 Pls
3240 627 Pls
3251 615 Pls
3261 610 Pls
3272 607 Pls
3282 604 Pls
3292 602 Pls
3303 602 Pls
3313 604 Pls
3324 607 Pls
3334 613 Pls
3344 619 Pls
3355 631 Pls
1.000 UL
LTb
LCb setrgbcolor
990 4775 N
990 440 L
5813 0 V
0 4335 V
-5813 0 V
Z stroke
1.000 UP
1.000 UL
LTb
stroke
grestore
end
showpage
%%Trailer
