%!PS-Adobe-2.0 EPSF-2.0
%%Title: doppelloch.tex
%%Creator: gnuplot 4.6 patchlevel 5
%%CreationDate: Tue Mar 17 14:59:11 2015
%%DocumentFonts: 
%%BoundingBox: 50 50 410 302
%%EndComments
%%BeginProlog
/gnudict 256 dict def
gnudict begin
%
% The following true/false flags may be edited by hand if desired.
% The unit line width and grayscale image gamma correction may also be changed.
%
/Color true def
/Blacktext true def
/Solid false def
/Dashlength 1 def
/Landscape false def
/Level1 false def
/Rounded false def
/ClipToBoundingBox false def
/SuppressPDFMark false def
/TransparentPatterns false def
/gnulinewidth 5.000 def
/userlinewidth gnulinewidth def
/Gamma 1.0 def
/BackgroundColor {-1.000 -1.000 -1.000} def
%
/vshift -73 def
/dl1 {
  10.0 Dashlength mul mul
  Rounded { currentlinewidth 0.75 mul sub dup 0 le { pop 0.01 } if } if
} def
/dl2 {
  10.0 Dashlength mul mul
  Rounded { currentlinewidth 0.75 mul add } if
} def
/hpt_ 31.5 def
/vpt_ 31.5 def
/hpt hpt_ def
/vpt vpt_ def
/doclip {
  ClipToBoundingBox {
    newpath 50 50 moveto 410 50 lineto 410 302 lineto 50 302 lineto closepath
    clip
  } if
} def
%
% Gnuplot Prolog Version 4.6 (September 2012)
%
%/SuppressPDFMark true def
%
/M {moveto} bind def
/L {lineto} bind def
/R {rmoveto} bind def
/V {rlineto} bind def
/N {newpath moveto} bind def
/Z {closepath} bind def
/C {setrgbcolor} bind def
/f {rlineto fill} bind def
/g {setgray} bind def
/Gshow {show} def   % May be redefined later in the file to support UTF-8
/vpt2 vpt 2 mul def
/hpt2 hpt 2 mul def
/Lshow {currentpoint stroke M 0 vshift R 
	Blacktext {gsave 0 setgray show grestore} {show} ifelse} def
/Rshow {currentpoint stroke M dup stringwidth pop neg vshift R
	Blacktext {gsave 0 setgray show grestore} {show} ifelse} def
/Cshow {currentpoint stroke M dup stringwidth pop -2 div vshift R 
	Blacktext {gsave 0 setgray show grestore} {show} ifelse} def
/UP {dup vpt_ mul /vpt exch def hpt_ mul /hpt exch def
  /hpt2 hpt 2 mul def /vpt2 vpt 2 mul def} def
/DL {Color {setrgbcolor Solid {pop []} if 0 setdash}
 {pop pop pop 0 setgray Solid {pop []} if 0 setdash} ifelse} def
/BL {stroke userlinewidth 2 mul setlinewidth
	Rounded {1 setlinejoin 1 setlinecap} if} def
/AL {stroke userlinewidth 2 div setlinewidth
	Rounded {1 setlinejoin 1 setlinecap} if} def
/UL {dup gnulinewidth mul /userlinewidth exch def
	dup 1 lt {pop 1} if 10 mul /udl exch def} def
/PL {stroke userlinewidth setlinewidth
	Rounded {1 setlinejoin 1 setlinecap} if} def
3.8 setmiterlimit
% Default Line colors
/LCw {1 1 1} def
/LCb {0 0 0} def
/LCa {0 0 0} def
/LC0 {1 0 0} def
/LC1 {0 1 0} def
/LC2 {0 0 1} def
/LC3 {1 0 1} def
/LC4 {0 1 1} def
/LC5 {1 1 0} def
/LC6 {0 0 0} def
/LC7 {1 0.3 0} def
/LC8 {0.5 0.5 0.5} def
% Default Line Types
/LTw {PL [] 1 setgray} def
/LTb {BL [] LCb DL} def
/LTa {AL [1 udl mul 2 udl mul] 0 setdash LCa setrgbcolor} def
/LT0 {PL [] LC0 DL} def
/LT1 {PL [4 dl1 2 dl2] LC1 DL} def
/LT2 {PL [2 dl1 3 dl2] LC2 DL} def
/LT3 {PL [1 dl1 1.5 dl2] LC3 DL} def
/LT4 {PL [6 dl1 2 dl2 1 dl1 2 dl2] LC4 DL} def
/LT5 {PL [3 dl1 3 dl2 1 dl1 3 dl2] LC5 DL} def
/LT6 {PL [2 dl1 2 dl2 2 dl1 6 dl2] LC6 DL} def
/LT7 {PL [1 dl1 2 dl2 6 dl1 2 dl2 1 dl1 2 dl2] LC7 DL} def
/LT8 {PL [2 dl1 2 dl2 2 dl1 2 dl2 2 dl1 2 dl2 2 dl1 4 dl2] LC8 DL} def
/Pnt {stroke [] 0 setdash gsave 1 setlinecap M 0 0 V stroke grestore} def
/Dia {stroke [] 0 setdash 2 copy vpt add M
  hpt neg vpt neg V hpt vpt neg V
  hpt vpt V hpt neg vpt V closepath stroke
  Pnt} def
/Pls {stroke [] 0 setdash vpt sub M 0 vpt2 V
  currentpoint stroke M
  hpt neg vpt neg R hpt2 0 V stroke
 } def
/Box {stroke [] 0 setdash 2 copy exch hpt sub exch vpt add M
  0 vpt2 neg V hpt2 0 V 0 vpt2 V
  hpt2 neg 0 V closepath stroke
  Pnt} def
/Crs {stroke [] 0 setdash exch hpt sub exch vpt add M
  hpt2 vpt2 neg V currentpoint stroke M
  hpt2 neg 0 R hpt2 vpt2 V stroke} def
/TriU {stroke [] 0 setdash 2 copy vpt 1.12 mul add M
  hpt neg vpt -1.62 mul V
  hpt 2 mul 0 V
  hpt neg vpt 1.62 mul V closepath stroke
  Pnt} def
/Star {2 copy Pls Crs} def
/BoxF {stroke [] 0 setdash exch hpt sub exch vpt add M
  0 vpt2 neg V hpt2 0 V 0 vpt2 V
  hpt2 neg 0 V closepath fill} def
/TriUF {stroke [] 0 setdash vpt 1.12 mul add M
  hpt neg vpt -1.62 mul V
  hpt 2 mul 0 V
  hpt neg vpt 1.62 mul V closepath fill} def
/TriD {stroke [] 0 setdash 2 copy vpt 1.12 mul sub M
  hpt neg vpt 1.62 mul V
  hpt 2 mul 0 V
  hpt neg vpt -1.62 mul V closepath stroke
  Pnt} def
/TriDF {stroke [] 0 setdash vpt 1.12 mul sub M
  hpt neg vpt 1.62 mul V
  hpt 2 mul 0 V
  hpt neg vpt -1.62 mul V closepath fill} def
/DiaF {stroke [] 0 setdash vpt add M
  hpt neg vpt neg V hpt vpt neg V
  hpt vpt V hpt neg vpt V closepath fill} def
/Pent {stroke [] 0 setdash 2 copy gsave
  translate 0 hpt M 4 {72 rotate 0 hpt L} repeat
  closepath stroke grestore Pnt} def
/PentF {stroke [] 0 setdash gsave
  translate 0 hpt M 4 {72 rotate 0 hpt L} repeat
  closepath fill grestore} def
/Circle {stroke [] 0 setdash 2 copy
  hpt 0 360 arc stroke Pnt} def
/CircleF {stroke [] 0 setdash hpt 0 360 arc fill} def
/C0 {BL [] 0 setdash 2 copy moveto vpt 90 450 arc} bind def
/C1 {BL [] 0 setdash 2 copy moveto
	2 copy vpt 0 90 arc closepath fill
	vpt 0 360 arc closepath} bind def
/C2 {BL [] 0 setdash 2 copy moveto
	2 copy vpt 90 180 arc closepath fill
	vpt 0 360 arc closepath} bind def
/C3 {BL [] 0 setdash 2 copy moveto
	2 copy vpt 0 180 arc closepath fill
	vpt 0 360 arc closepath} bind def
/C4 {BL [] 0 setdash 2 copy moveto
	2 copy vpt 180 270 arc closepath fill
	vpt 0 360 arc closepath} bind def
/C5 {BL [] 0 setdash 2 copy moveto
	2 copy vpt 0 90 arc
	2 copy moveto
	2 copy vpt 180 270 arc closepath fill
	vpt 0 360 arc} bind def
/C6 {BL [] 0 setdash 2 copy moveto
	2 copy vpt 90 270 arc closepath fill
	vpt 0 360 arc closepath} bind def
/C7 {BL [] 0 setdash 2 copy moveto
	2 copy vpt 0 270 arc closepath fill
	vpt 0 360 arc closepath} bind def
/C8 {BL [] 0 setdash 2 copy moveto
	2 copy vpt 270 360 arc closepath fill
	vpt 0 360 arc closepath} bind def
/C9 {BL [] 0 setdash 2 copy moveto
	2 copy vpt 270 450 arc closepath fill
	vpt 0 360 arc closepath} bind def
/C10 {BL [] 0 setdash 2 copy 2 copy moveto vpt 270 360 arc closepath fill
	2 copy moveto
	2 copy vpt 90 180 arc closepath fill
	vpt 0 360 arc closepath} bind def
/C11 {BL [] 0 setdash 2 copy moveto
	2 copy vpt 0 180 arc closepath fill
	2 copy moveto
	2 copy vpt 270 360 arc closepath fill
	vpt 0 360 arc closepath} bind def
/C12 {BL [] 0 setdash 2 copy moveto
	2 copy vpt 180 360 arc closepath fill
	vpt 0 360 arc closepath} bind def
/C13 {BL [] 0 setdash 2 copy moveto
	2 copy vpt 0 90 arc closepath fill
	2 copy moveto
	2 copy vpt 180 360 arc closepath fill
	vpt 0 360 arc closepath} bind def
/C14 {BL [] 0 setdash 2 copy moveto
	2 copy vpt 90 360 arc closepath fill
	vpt 0 360 arc} bind def
/C15 {BL [] 0 setdash 2 copy vpt 0 360 arc closepath fill
	vpt 0 360 arc closepath} bind def
/Rec {newpath 4 2 roll moveto 1 index 0 rlineto 0 exch rlineto
	neg 0 rlineto closepath} bind def
/Square {dup Rec} bind def
/Bsquare {vpt sub exch vpt sub exch vpt2 Square} bind def
/S0 {BL [] 0 setdash 2 copy moveto 0 vpt rlineto BL Bsquare} bind def
/S1 {BL [] 0 setdash 2 copy vpt Square fill Bsquare} bind def
/S2 {BL [] 0 setdash 2 copy exch vpt sub exch vpt Square fill Bsquare} bind def
/S3 {BL [] 0 setdash 2 copy exch vpt sub exch vpt2 vpt Rec fill Bsquare} bind def
/S4 {BL [] 0 setdash 2 copy exch vpt sub exch vpt sub vpt Square fill Bsquare} bind def
/S5 {BL [] 0 setdash 2 copy 2 copy vpt Square fill
	exch vpt sub exch vpt sub vpt Square fill Bsquare} bind def
/S6 {BL [] 0 setdash 2 copy exch vpt sub exch vpt sub vpt vpt2 Rec fill Bsquare} bind def
/S7 {BL [] 0 setdash 2 copy exch vpt sub exch vpt sub vpt vpt2 Rec fill
	2 copy vpt Square fill Bsquare} bind def
/S8 {BL [] 0 setdash 2 copy vpt sub vpt Square fill Bsquare} bind def
/S9 {BL [] 0 setdash 2 copy vpt sub vpt vpt2 Rec fill Bsquare} bind def
/S10 {BL [] 0 setdash 2 copy vpt sub vpt Square fill 2 copy exch vpt sub exch vpt Square fill
	Bsquare} bind def
/S11 {BL [] 0 setdash 2 copy vpt sub vpt Square fill 2 copy exch vpt sub exch vpt2 vpt Rec fill
	Bsquare} bind def
/S12 {BL [] 0 setdash 2 copy exch vpt sub exch vpt sub vpt2 vpt Rec fill Bsquare} bind def
/S13 {BL [] 0 setdash 2 copy exch vpt sub exch vpt sub vpt2 vpt Rec fill
	2 copy vpt Square fill Bsquare} bind def
/S14 {BL [] 0 setdash 2 copy exch vpt sub exch vpt sub vpt2 vpt Rec fill
	2 copy exch vpt sub exch vpt Square fill Bsquare} bind def
/S15 {BL [] 0 setdash 2 copy Bsquare fill Bsquare} bind def
/D0 {gsave translate 45 rotate 0 0 S0 stroke grestore} bind def
/D1 {gsave translate 45 rotate 0 0 S1 stroke grestore} bind def
/D2 {gsave translate 45 rotate 0 0 S2 stroke grestore} bind def
/D3 {gsave translate 45 rotate 0 0 S3 stroke grestore} bind def
/D4 {gsave translate 45 rotate 0 0 S4 stroke grestore} bind def
/D5 {gsave translate 45 rotate 0 0 S5 stroke grestore} bind def
/D6 {gsave translate 45 rotate 0 0 S6 stroke grestore} bind def
/D7 {gsave translate 45 rotate 0 0 S7 stroke grestore} bind def
/D8 {gsave translate 45 rotate 0 0 S8 stroke grestore} bind def
/D9 {gsave translate 45 rotate 0 0 S9 stroke grestore} bind def
/D10 {gsave translate 45 rotate 0 0 S10 stroke grestore} bind def
/D11 {gsave translate 45 rotate 0 0 S11 stroke grestore} bind def
/D12 {gsave translate 45 rotate 0 0 S12 stroke grestore} bind def
/D13 {gsave translate 45 rotate 0 0 S13 stroke grestore} bind def
/D14 {gsave translate 45 rotate 0 0 S14 stroke grestore} bind def
/D15 {gsave translate 45 rotate 0 0 S15 stroke grestore} bind def
/DiaE {stroke [] 0 setdash vpt add M
  hpt neg vpt neg V hpt vpt neg V
  hpt vpt V hpt neg vpt V closepath stroke} def
/BoxE {stroke [] 0 setdash exch hpt sub exch vpt add M
  0 vpt2 neg V hpt2 0 V 0 vpt2 V
  hpt2 neg 0 V closepath stroke} def
/TriUE {stroke [] 0 setdash vpt 1.12 mul add M
  hpt neg vpt -1.62 mul V
  hpt 2 mul 0 V
  hpt neg vpt 1.62 mul V closepath stroke} def
/TriDE {stroke [] 0 setdash vpt 1.12 mul sub M
  hpt neg vpt 1.62 mul V
  hpt 2 mul 0 V
  hpt neg vpt -1.62 mul V closepath stroke} def
/PentE {stroke [] 0 setdash gsave
  translate 0 hpt M 4 {72 rotate 0 hpt L} repeat
  closepath stroke grestore} def
/CircE {stroke [] 0 setdash 
  hpt 0 360 arc stroke} def
/Opaque {gsave closepath 1 setgray fill grestore 0 setgray closepath} def
/DiaW {stroke [] 0 setdash vpt add M
  hpt neg vpt neg V hpt vpt neg V
  hpt vpt V hpt neg vpt V Opaque stroke} def
/BoxW {stroke [] 0 setdash exch hpt sub exch vpt add M
  0 vpt2 neg V hpt2 0 V 0 vpt2 V
  hpt2 neg 0 V Opaque stroke} def
/TriUW {stroke [] 0 setdash vpt 1.12 mul add M
  hpt neg vpt -1.62 mul V
  hpt 2 mul 0 V
  hpt neg vpt 1.62 mul V Opaque stroke} def
/TriDW {stroke [] 0 setdash vpt 1.12 mul sub M
  hpt neg vpt 1.62 mul V
  hpt 2 mul 0 V
  hpt neg vpt -1.62 mul V Opaque stroke} def
/PentW {stroke [] 0 setdash gsave
  translate 0 hpt M 4 {72 rotate 0 hpt L} repeat
  Opaque stroke grestore} def
/CircW {stroke [] 0 setdash 
  hpt 0 360 arc Opaque stroke} def
/BoxFill {gsave Rec 1 setgray fill grestore} def
/Density {
  /Fillden exch def
  currentrgbcolor
  /ColB exch def /ColG exch def /ColR exch def
  /ColR ColR Fillden mul Fillden sub 1 add def
  /ColG ColG Fillden mul Fillden sub 1 add def
  /ColB ColB Fillden mul Fillden sub 1 add def
  ColR ColG ColB setrgbcolor} def
/BoxColFill {gsave Rec PolyFill} def
/PolyFill {gsave Density fill grestore grestore} def
/h {rlineto rlineto rlineto gsave closepath fill grestore} bind def
%
% PostScript Level 1 Pattern Fill routine for rectangles
% Usage: x y w h s a XX PatternFill
%	x,y = lower left corner of box to be filled
%	w,h = width and height of box
%	  a = angle in degrees between lines and x-axis
%	 XX = 0/1 for no/yes cross-hatch
%
/PatternFill {gsave /PFa [ 9 2 roll ] def
  PFa 0 get PFa 2 get 2 div add PFa 1 get PFa 3 get 2 div add translate
  PFa 2 get -2 div PFa 3 get -2 div PFa 2 get PFa 3 get Rec
  TransparentPatterns {} {gsave 1 setgray fill grestore} ifelse
  clip
  currentlinewidth 0.5 mul setlinewidth
  /PFs PFa 2 get dup mul PFa 3 get dup mul add sqrt def
  0 0 M PFa 5 get rotate PFs -2 div dup translate
  0 1 PFs PFa 4 get div 1 add floor cvi
	{PFa 4 get mul 0 M 0 PFs V} for
  0 PFa 6 get ne {
	0 1 PFs PFa 4 get div 1 add floor cvi
	{PFa 4 get mul 0 2 1 roll M PFs 0 V} for
 } if
  stroke grestore} def
%
/languagelevel where
 {pop languagelevel} {1} ifelse
 2 lt
	{/InterpretLevel1 true def}
	{/InterpretLevel1 Level1 def}
 ifelse
%
% PostScript level 2 pattern fill definitions
%
/Level2PatternFill {
/Tile8x8 {/PaintType 2 /PatternType 1 /TilingType 1 /BBox [0 0 8 8] /XStep 8 /YStep 8}
	bind def
/KeepColor {currentrgbcolor [/Pattern /DeviceRGB] setcolorspace} bind def
<< Tile8x8
 /PaintProc {0.5 setlinewidth pop 0 0 M 8 8 L 0 8 M 8 0 L stroke} 
>> matrix makepattern
/Pat1 exch def
<< Tile8x8
 /PaintProc {0.5 setlinewidth pop 0 0 M 8 8 L 0 8 M 8 0 L stroke
	0 4 M 4 8 L 8 4 L 4 0 L 0 4 L stroke}
>> matrix makepattern
/Pat2 exch def
<< Tile8x8
 /PaintProc {0.5 setlinewidth pop 0 0 M 0 8 L
	8 8 L 8 0 L 0 0 L fill}
>> matrix makepattern
/Pat3 exch def
<< Tile8x8
 /PaintProc {0.5 setlinewidth pop -4 8 M 8 -4 L
	0 12 M 12 0 L stroke}
>> matrix makepattern
/Pat4 exch def
<< Tile8x8
 /PaintProc {0.5 setlinewidth pop -4 0 M 8 12 L
	0 -4 M 12 8 L stroke}
>> matrix makepattern
/Pat5 exch def
<< Tile8x8
 /PaintProc {0.5 setlinewidth pop -2 8 M 4 -4 L
	0 12 M 8 -4 L 4 12 M 10 0 L stroke}
>> matrix makepattern
/Pat6 exch def
<< Tile8x8
 /PaintProc {0.5 setlinewidth pop -2 0 M 4 12 L
	0 -4 M 8 12 L 4 -4 M 10 8 L stroke}
>> matrix makepattern
/Pat7 exch def
<< Tile8x8
 /PaintProc {0.5 setlinewidth pop 8 -2 M -4 4 L
	12 0 M -4 8 L 12 4 M 0 10 L stroke}
>> matrix makepattern
/Pat8 exch def
<< Tile8x8
 /PaintProc {0.5 setlinewidth pop 0 -2 M 12 4 L
	-4 0 M 12 8 L -4 4 M 8 10 L stroke}
>> matrix makepattern
/Pat9 exch def
/Pattern1 {PatternBgnd KeepColor Pat1 setpattern} bind def
/Pattern2 {PatternBgnd KeepColor Pat2 setpattern} bind def
/Pattern3 {PatternBgnd KeepColor Pat3 setpattern} bind def
/Pattern4 {PatternBgnd KeepColor Landscape {Pat5} {Pat4} ifelse setpattern} bind def
/Pattern5 {PatternBgnd KeepColor Landscape {Pat4} {Pat5} ifelse setpattern} bind def
/Pattern6 {PatternBgnd KeepColor Landscape {Pat9} {Pat6} ifelse setpattern} bind def
/Pattern7 {PatternBgnd KeepColor Landscape {Pat8} {Pat7} ifelse setpattern} bind def
} def
%
%
%End of PostScript Level 2 code
%
/PatternBgnd {
  TransparentPatterns {} {gsave 1 setgray fill grestore} ifelse
} def
%
% Substitute for Level 2 pattern fill codes with
% grayscale if Level 2 support is not selected.
%
/Level1PatternFill {
/Pattern1 {0.250 Density} bind def
/Pattern2 {0.500 Density} bind def
/Pattern3 {0.750 Density} bind def
/Pattern4 {0.125 Density} bind def
/Pattern5 {0.375 Density} bind def
/Pattern6 {0.625 Density} bind def
/Pattern7 {0.875 Density} bind def
} def
%
% Now test for support of Level 2 code
%
Level1 {Level1PatternFill} {Level2PatternFill} ifelse
%
/Symbol-Oblique /Symbol findfont [1 0 .167 1 0 0] makefont
dup length dict begin {1 index /FID eq {pop pop} {def} ifelse} forall
currentdict end definefont pop
Level1 SuppressPDFMark or 
{} {
/SDict 10 dict def
systemdict /pdfmark known not {
  userdict /pdfmark systemdict /cleartomark get put
} if
SDict begin [
  /Title (doppelloch.tex)
  /Subject (gnuplot plot)
  /Creator (gnuplot 4.6 patchlevel 5)
  /Author (kevin.luedemann)
%  /Producer (gnuplot)
%  /Keywords ()
  /CreationDate (Tue Mar 17 14:59:11 2015)
  /DOCINFO pdfmark
end
} ifelse
end
%%EndProlog
%%Page: 1 1
gnudict begin
gsave
doclip
50 50 translate
0.050 0.050 scale
0 setgray
newpath
1.000 UL
LTb
LCb setrgbcolor
1122 440 M
63 0 V
5618 0 R
-63 0 V
stroke
LTb
1122 834 M
63 0 V
5618 0 R
-63 0 V
1122 1228 M
63 0 V
5618 0 R
-63 0 V
1122 1622 M
63 0 V
5618 0 R
-63 0 V
1122 2016 M
63 0 V
5618 0 R
-63 0 V
1122 2410 M
63 0 V
5618 0 R
-63 0 V
1122 2805 M
63 0 V
5618 0 R
-63 0 V
1122 3199 M
63 0 V
5618 0 R
-63 0 V
1122 3593 M
63 0 V
5618 0 R
-63 0 V
1122 3987 M
63 0 V
5618 0 R
-63 0 V
1122 4381 M
63 0 V
5618 0 R
-63 0 V
1122 4775 M
63 0 V
5618 0 R
-63 0 V
1122 440 M
0 63 V
0 4272 R
0 -63 V
2069 440 M
0 63 V
0 4272 R
0 -63 V
3016 440 M
0 63 V
0 4272 R
0 -63 V
3963 440 M
0 63 V
0 4272 R
0 -63 V
4909 440 M
0 63 V
0 4272 R
0 -63 V
5856 440 M
0 63 V
0 4272 R
0 -63 V
6803 440 M
0 63 V
0 4272 R
0 -63 V
stroke
1122 4775 N
0 -4335 V
5681 0 V
0 4335 V
-5681 0 V
Z stroke
1.000 UP
1.000 UL
LTb
1.000 UP
1.000 UL
LT0
LC0 setrgbcolor
LCb setrgbcolor
LT0
LC0 setrgbcolor
1624 843 Pls
1636 839 Pls
1647 847 Pls
1659 843 Pls
1671 839 Pls
1683 851 Pls
1695 843 Pls
1707 843 Pls
1719 839 Pls
1730 839 Pls
1742 843 Pls
1754 843 Pls
1766 835 Pls
1778 843 Pls
1790 847 Pls
1801 843 Pls
1813 839 Pls
1825 843 Pls
1837 847 Pls
1849 847 Pls
1861 851 Pls
1872 851 Pls
1884 851 Pls
1896 855 Pls
1908 847 Pls
1920 847 Pls
1932 855 Pls
1943 847 Pls
1955 847 Pls
1967 847 Pls
1979 847 Pls
1991 843 Pls
2003 855 Pls
2014 839 Pls
2026 839 Pls
2038 851 Pls
2050 847 Pls
2062 847 Pls
2074 851 Pls
2085 851 Pls
2097 847 Pls
2109 847 Pls
2121 847 Pls
2133 847 Pls
2145 855 Pls
2156 851 Pls
2168 855 Pls
2180 851 Pls
2192 859 Pls
2204 859 Pls
2216 855 Pls
2227 855 Pls
2239 863 Pls
2251 851 Pls
2263 855 Pls
2275 855 Pls
2287 859 Pls
2298 847 Pls
2310 847 Pls
2322 847 Pls
2334 847 Pls
2346 851 Pls
2358 851 Pls
2369 851 Pls
2381 851 Pls
2393 859 Pls
2405 847 Pls
2417 851 Pls
2429 851 Pls
2440 855 Pls
2452 851 Pls
2464 855 Pls
2476 847 Pls
2488 855 Pls
2500 843 Pls
2511 847 Pls
2523 851 Pls
2535 847 Pls
2547 847 Pls
2559 847 Pls
2571 847 Pls
2582 851 Pls
2594 847 Pls
2606 855 Pls
2618 855 Pls
2630 855 Pls
2642 855 Pls
2654 847 Pls
2665 847 Pls
2677 851 Pls
2689 855 Pls
2701 855 Pls
2713 843 Pls
2725 855 Pls
2736 863 Pls
2748 859 Pls
2760 855 Pls
2772 855 Pls
2784 859 Pls
2796 859 Pls
2807 855 Pls
2819 855 Pls
2831 855 Pls
2843 855 Pls
2855 859 Pls
2867 855 Pls
2878 847 Pls
2890 843 Pls
2902 843 Pls
2914 851 Pls
2926 851 Pls
2938 843 Pls
2949 839 Pls
2961 847 Pls
2973 843 Pls
2985 843 Pls
2997 831 Pls
3009 843 Pls
3020 851 Pls
3032 863 Pls
3044 847 Pls
3056 851 Pls
3068 851 Pls
3080 855 Pls
3091 863 Pls
3103 859 Pls
3115 863 Pls
3127 859 Pls
3139 871 Pls
3151 863 Pls
3162 871 Pls
3174 867 Pls
3186 871 Pls
3198 875 Pls
3210 859 Pls
3222 879 Pls
3233 879 Pls
3245 887 Pls
3257 887 Pls
3269 887 Pls
3281 891 Pls
3293 887 Pls
3304 887 Pls
3316 891 Pls
3328 875 Pls
3340 879 Pls
3352 883 Pls
3364 879 Pls
3375 879 Pls
3387 879 Pls
3399 875 Pls
3411 879 Pls
3423 875 Pls
3435 883 Pls
3446 887 Pls
3458 899 Pls
3470 899 Pls
3482 899 Pls
3494 899 Pls
3506 899 Pls
3517 895 Pls
3529 899 Pls
3541 887 Pls
3553 895 Pls
3565 879 Pls
3577 879 Pls
3589 879 Pls
3600 871 Pls
3612 871 Pls
3624 863 Pls
3636 867 Pls
3648 863 Pls
3660 875 Pls
3671 867 Pls
3683 871 Pls
3695 867 Pls
3707 879 Pls
3719 867 Pls
3731 879 Pls
3742 887 Pls
3754 879 Pls
3766 891 Pls
3778 895 Pls
3790 903 Pls
3802 899 Pls
3813 935 Pls
3825 964 Pls
3837 988 Pls
3849 1012 Pls
3861 1036 Pls
3873 1064 Pls
3884 1084 Pls
3896 1104 Pls
3908 1128 Pls
3920 1148 Pls
3932 1168 Pls
3944 1197 Pls
3955 1229 Pls
3967 1265 Pls
3979 1305 Pls
3991 1357 Pls
4003 1429 Pls
4015 1486 Pls
4026 1566 Pls
4038 1650 Pls
4050 1739 Pls
4062 1803 Pls
4074 1851 Pls
4086 1891 Pls
4097 1899 Pls
4109 1916 Pls
4121 1916 Pls
4133 1907 Pls
4145 1887 Pls
4157 1912 Pls
4168 1924 Pls
4180 1924 Pls
4192 1984 Pls
4204 2040 Pls
4216 2181 Pls
4228 2309 Pls
4239 2526 Pls
4251 2735 Pls
4263 2960 Pls
4275 3193 Pls
4287 3325 Pls
4299 3458 Pls
4310 3566 Pls
4322 3623 Pls
4334 3631 Pls
4346 3647 Pls
4358 3534 Pls
4370 3450 Pls
4381 3277 Pls
4393 3084 Pls
4405 2916 Pls
4417 2731 Pls
4429 2590 Pls
4441 2506 Pls
4452 2510 Pls
4464 2590 Pls
4476 2683 Pls
4488 2884 Pls
4500 3145 Pls
4512 3402 Pls
4523 3671 Pls
4535 3916 Pls
4547 4149 Pls
4559 4374 Pls
4571 4474 Pls
4583 4534 Pls
4595 4559 Pls
4606 4430 Pls
4618 4197 Pls
4630 3924 Pls
4642 3574 Pls
4654 3249 Pls
4666 2900 Pls
4677 2602 Pls
4689 2349 Pls
4701 2173 Pls
4713 2048 Pls
4725 1992 Pls
4737 2028 Pls
4748 2116 Pls
4760 2237 Pls
4772 2438 Pls
4784 2590 Pls
4796 2823 Pls
4808 3056 Pls
4819 3201 Pls
4831 3261 Pls
4843 3269 Pls
4855 3193 Pls
4867 3088 Pls
4879 2924 Pls
4890 2715 Pls
4902 2490 Pls
4914 2269 Pls
4926 2048 Pls
4938 1831 Pls
4950 1638 Pls
4961 1458 Pls
4973 1313 Pls
4985 1225 Pls
4997 1188 Pls
5009 1201 Pls
5021 1233 Pls
5032 1281 Pls
5044 1341 Pls
5056 1397 Pls
5068 1438 Pls
5080 1466 Pls
5092 1478 Pls
5103 1450 Pls
5115 1462 Pls
5127 1413 Pls
5139 1369 Pls
5151 1301 Pls
5163 1217 Pls
5174 1136 Pls
5186 1072 Pls
5198 1008 Pls
5210 960 Pls
5222 923 Pls
5234 911 Pls
5245 895 Pls
5257 879 Pls
5269 891 Pls
5281 883 Pls
5293 879 Pls
5305 879 Pls
5316 883 Pls
5328 871 Pls
5340 867 Pls
5352 875 Pls
5364 863 Pls
5376 855 Pls
5387 855 Pls
5399 859 Pls
5411 847 Pls
5423 859 Pls
5435 863 Pls
5447 871 Pls
5458 875 Pls
5470 875 Pls
5482 879 Pls
5494 887 Pls
5506 875 Pls
5518 879 Pls
5530 879 Pls
5541 879 Pls
5553 879 Pls
5565 887 Pls
5577 879 Pls
5589 883 Pls
5601 891 Pls
5612 895 Pls
5624 891 Pls
5636 899 Pls
5648 887 Pls
5660 899 Pls
5672 895 Pls
5683 895 Pls
5695 907 Pls
5707 891 Pls
5719 895 Pls
5731 887 Pls
5743 875 Pls
5754 875 Pls
5766 871 Pls
5778 863 Pls
5790 867 Pls
5802 859 Pls
5814 855 Pls
5825 863 Pls
5837 867 Pls
5849 867 Pls
5861 863 Pls
5873 867 Pls
5885 875 Pls
5896 871 Pls
5908 867 Pls
5920 867 Pls
5932 867 Pls
5944 867 Pls
5956 859 Pls
5967 855 Pls
5979 851 Pls
5991 851 Pls
6003 847 Pls
6015 847 Pls
6027 847 Pls
6038 851 Pls
6050 863 Pls
6062 863 Pls
6074 855 Pls
6086 859 Pls
6098 863 Pls
6109 863 Pls
6121 851 Pls
6133 863 Pls
6145 855 Pls
6157 855 Pls
6169 855 Pls
6180 855 Pls
6192 855 Pls
6204 855 Pls
6216 859 Pls
6228 859 Pls
6240 863 Pls
6251 855 Pls
6263 855 Pls
6275 855 Pls
6287 851 Pls
6299 859 Pls
6311 851 Pls
6322 855 Pls
6334 847 Pls
6346 855 Pls
6358 843 Pls
6370 847 Pls
6382 855 Pls
6393 851 Pls
6405 855 Pls
6417 859 Pls
6429 855 Pls
6441 859 Pls
6453 859 Pls
6465 863 Pls
6476 859 Pls
6488 863 Pls
6500 855 Pls
6512 863 Pls
6524 851 Pls
6536 855 Pls
6547 851 Pls
6559 855 Pls
6571 859 Pls
6243 4602 Pls
1.000 UL
LTb
LCb setrgbcolor
1122 4775 N
0 -4335 V
5681 0 V
0 4335 V
-5681 0 V
Z stroke
1.000 UP
1.000 UL
LTb
stroke
grestore
end
showpage
%%Trailer
