%!PS-Adobe-2.0 EPSF-2.0
%%Title: gitter.tex
%%Creator: gnuplot 4.6 patchlevel 5
%%CreationDate: Tue Mar 17 14:59:11 2015
%%DocumentFonts: 
%%BoundingBox: 50 50 410 302
%%EndComments
%%BeginProlog
/gnudict 256 dict def
gnudict begin
%
% The following true/false flags may be edited by hand if desired.
% The unit line width and grayscale image gamma correction may also be changed.
%
/Color true def
/Blacktext true def
/Solid false def
/Dashlength 1 def
/Landscape false def
/Level1 false def
/Rounded false def
/ClipToBoundingBox false def
/SuppressPDFMark false def
/TransparentPatterns false def
/gnulinewidth 5.000 def
/userlinewidth gnulinewidth def
/Gamma 1.0 def
/BackgroundColor {-1.000 -1.000 -1.000} def
%
/vshift -73 def
/dl1 {
  10.0 Dashlength mul mul
  Rounded { currentlinewidth 0.75 mul sub dup 0 le { pop 0.01 } if } if
} def
/dl2 {
  10.0 Dashlength mul mul
  Rounded { currentlinewidth 0.75 mul add } if
} def
/hpt_ 31.5 def
/vpt_ 31.5 def
/hpt hpt_ def
/vpt vpt_ def
/doclip {
  ClipToBoundingBox {
    newpath 50 50 moveto 410 50 lineto 410 302 lineto 50 302 lineto closepath
    clip
  } if
} def
%
% Gnuplot Prolog Version 4.6 (September 2012)
%
%/SuppressPDFMark true def
%
/M {moveto} bind def
/L {lineto} bind def
/R {rmoveto} bind def
/V {rlineto} bind def
/N {newpath moveto} bind def
/Z {closepath} bind def
/C {setrgbcolor} bind def
/f {rlineto fill} bind def
/g {setgray} bind def
/Gshow {show} def   % May be redefined later in the file to support UTF-8
/vpt2 vpt 2 mul def
/hpt2 hpt 2 mul def
/Lshow {currentpoint stroke M 0 vshift R 
	Blacktext {gsave 0 setgray show grestore} {show} ifelse} def
/Rshow {currentpoint stroke M dup stringwidth pop neg vshift R
	Blacktext {gsave 0 setgray show grestore} {show} ifelse} def
/Cshow {currentpoint stroke M dup stringwidth pop -2 div vshift R 
	Blacktext {gsave 0 setgray show grestore} {show} ifelse} def
/UP {dup vpt_ mul /vpt exch def hpt_ mul /hpt exch def
  /hpt2 hpt 2 mul def /vpt2 vpt 2 mul def} def
/DL {Color {setrgbcolor Solid {pop []} if 0 setdash}
 {pop pop pop 0 setgray Solid {pop []} if 0 setdash} ifelse} def
/BL {stroke userlinewidth 2 mul setlinewidth
	Rounded {1 setlinejoin 1 setlinecap} if} def
/AL {stroke userlinewidth 2 div setlinewidth
	Rounded {1 setlinejoin 1 setlinecap} if} def
/UL {dup gnulinewidth mul /userlinewidth exch def
	dup 1 lt {pop 1} if 10 mul /udl exch def} def
/PL {stroke userlinewidth setlinewidth
	Rounded {1 setlinejoin 1 setlinecap} if} def
3.8 setmiterlimit
% Default Line colors
/LCw {1 1 1} def
/LCb {0 0 0} def
/LCa {0 0 0} def
/LC0 {1 0 0} def
/LC1 {0 1 0} def
/LC2 {0 0 1} def
/LC3 {1 0 1} def
/LC4 {0 1 1} def
/LC5 {1 1 0} def
/LC6 {0 0 0} def
/LC7 {1 0.3 0} def
/LC8 {0.5 0.5 0.5} def
% Default Line Types
/LTw {PL [] 1 setgray} def
/LTb {BL [] LCb DL} def
/LTa {AL [1 udl mul 2 udl mul] 0 setdash LCa setrgbcolor} def
/LT0 {PL [] LC0 DL} def
/LT1 {PL [4 dl1 2 dl2] LC1 DL} def
/LT2 {PL [2 dl1 3 dl2] LC2 DL} def
/LT3 {PL [1 dl1 1.5 dl2] LC3 DL} def
/LT4 {PL [6 dl1 2 dl2 1 dl1 2 dl2] LC4 DL} def
/LT5 {PL [3 dl1 3 dl2 1 dl1 3 dl2] LC5 DL} def
/LT6 {PL [2 dl1 2 dl2 2 dl1 6 dl2] LC6 DL} def
/LT7 {PL [1 dl1 2 dl2 6 dl1 2 dl2 1 dl1 2 dl2] LC7 DL} def
/LT8 {PL [2 dl1 2 dl2 2 dl1 2 dl2 2 dl1 2 dl2 2 dl1 4 dl2] LC8 DL} def
/Pnt {stroke [] 0 setdash gsave 1 setlinecap M 0 0 V stroke grestore} def
/Dia {stroke [] 0 setdash 2 copy vpt add M
  hpt neg vpt neg V hpt vpt neg V
  hpt vpt V hpt neg vpt V closepath stroke
  Pnt} def
/Pls {stroke [] 0 setdash vpt sub M 0 vpt2 V
  currentpoint stroke M
  hpt neg vpt neg R hpt2 0 V stroke
 } def
/Box {stroke [] 0 setdash 2 copy exch hpt sub exch vpt add M
  0 vpt2 neg V hpt2 0 V 0 vpt2 V
  hpt2 neg 0 V closepath stroke
  Pnt} def
/Crs {stroke [] 0 setdash exch hpt sub exch vpt add M
  hpt2 vpt2 neg V currentpoint stroke M
  hpt2 neg 0 R hpt2 vpt2 V stroke} def
/TriU {stroke [] 0 setdash 2 copy vpt 1.12 mul add M
  hpt neg vpt -1.62 mul V
  hpt 2 mul 0 V
  hpt neg vpt 1.62 mul V closepath stroke
  Pnt} def
/Star {2 copy Pls Crs} def
/BoxF {stroke [] 0 setdash exch hpt sub exch vpt add M
  0 vpt2 neg V hpt2 0 V 0 vpt2 V
  hpt2 neg 0 V closepath fill} def
/TriUF {stroke [] 0 setdash vpt 1.12 mul add M
  hpt neg vpt -1.62 mul V
  hpt 2 mul 0 V
  hpt neg vpt 1.62 mul V closepath fill} def
/TriD {stroke [] 0 setdash 2 copy vpt 1.12 mul sub M
  hpt neg vpt 1.62 mul V
  hpt 2 mul 0 V
  hpt neg vpt -1.62 mul V closepath stroke
  Pnt} def
/TriDF {stroke [] 0 setdash vpt 1.12 mul sub M
  hpt neg vpt 1.62 mul V
  hpt 2 mul 0 V
  hpt neg vpt -1.62 mul V closepath fill} def
/DiaF {stroke [] 0 setdash vpt add M
  hpt neg vpt neg V hpt vpt neg V
  hpt vpt V hpt neg vpt V closepath fill} def
/Pent {stroke [] 0 setdash 2 copy gsave
  translate 0 hpt M 4 {72 rotate 0 hpt L} repeat
  closepath stroke grestore Pnt} def
/PentF {stroke [] 0 setdash gsave
  translate 0 hpt M 4 {72 rotate 0 hpt L} repeat
  closepath fill grestore} def
/Circle {stroke [] 0 setdash 2 copy
  hpt 0 360 arc stroke Pnt} def
/CircleF {stroke [] 0 setdash hpt 0 360 arc fill} def
/C0 {BL [] 0 setdash 2 copy moveto vpt 90 450 arc} bind def
/C1 {BL [] 0 setdash 2 copy moveto
	2 copy vpt 0 90 arc closepath fill
	vpt 0 360 arc closepath} bind def
/C2 {BL [] 0 setdash 2 copy moveto
	2 copy vpt 90 180 arc closepath fill
	vpt 0 360 arc closepath} bind def
/C3 {BL [] 0 setdash 2 copy moveto
	2 copy vpt 0 180 arc closepath fill
	vpt 0 360 arc closepath} bind def
/C4 {BL [] 0 setdash 2 copy moveto
	2 copy vpt 180 270 arc closepath fill
	vpt 0 360 arc closepath} bind def
/C5 {BL [] 0 setdash 2 copy moveto
	2 copy vpt 0 90 arc
	2 copy moveto
	2 copy vpt 180 270 arc closepath fill
	vpt 0 360 arc} bind def
/C6 {BL [] 0 setdash 2 copy moveto
	2 copy vpt 90 270 arc closepath fill
	vpt 0 360 arc closepath} bind def
/C7 {BL [] 0 setdash 2 copy moveto
	2 copy vpt 0 270 arc closepath fill
	vpt 0 360 arc closepath} bind def
/C8 {BL [] 0 setdash 2 copy moveto
	2 copy vpt 270 360 arc closepath fill
	vpt 0 360 arc closepath} bind def
/C9 {BL [] 0 setdash 2 copy moveto
	2 copy vpt 270 450 arc closepath fill
	vpt 0 360 arc closepath} bind def
/C10 {BL [] 0 setdash 2 copy 2 copy moveto vpt 270 360 arc closepath fill
	2 copy moveto
	2 copy vpt 90 180 arc closepath fill
	vpt 0 360 arc closepath} bind def
/C11 {BL [] 0 setdash 2 copy moveto
	2 copy vpt 0 180 arc closepath fill
	2 copy moveto
	2 copy vpt 270 360 arc closepath fill
	vpt 0 360 arc closepath} bind def
/C12 {BL [] 0 setdash 2 copy moveto
	2 copy vpt 180 360 arc closepath fill
	vpt 0 360 arc closepath} bind def
/C13 {BL [] 0 setdash 2 copy moveto
	2 copy vpt 0 90 arc closepath fill
	2 copy moveto
	2 copy vpt 180 360 arc closepath fill
	vpt 0 360 arc closepath} bind def
/C14 {BL [] 0 setdash 2 copy moveto
	2 copy vpt 90 360 arc closepath fill
	vpt 0 360 arc} bind def
/C15 {BL [] 0 setdash 2 copy vpt 0 360 arc closepath fill
	vpt 0 360 arc closepath} bind def
/Rec {newpath 4 2 roll moveto 1 index 0 rlineto 0 exch rlineto
	neg 0 rlineto closepath} bind def
/Square {dup Rec} bind def
/Bsquare {vpt sub exch vpt sub exch vpt2 Square} bind def
/S0 {BL [] 0 setdash 2 copy moveto 0 vpt rlineto BL Bsquare} bind def
/S1 {BL [] 0 setdash 2 copy vpt Square fill Bsquare} bind def
/S2 {BL [] 0 setdash 2 copy exch vpt sub exch vpt Square fill Bsquare} bind def
/S3 {BL [] 0 setdash 2 copy exch vpt sub exch vpt2 vpt Rec fill Bsquare} bind def
/S4 {BL [] 0 setdash 2 copy exch vpt sub exch vpt sub vpt Square fill Bsquare} bind def
/S5 {BL [] 0 setdash 2 copy 2 copy vpt Square fill
	exch vpt sub exch vpt sub vpt Square fill Bsquare} bind def
/S6 {BL [] 0 setdash 2 copy exch vpt sub exch vpt sub vpt vpt2 Rec fill Bsquare} bind def
/S7 {BL [] 0 setdash 2 copy exch vpt sub exch vpt sub vpt vpt2 Rec fill
	2 copy vpt Square fill Bsquare} bind def
/S8 {BL [] 0 setdash 2 copy vpt sub vpt Square fill Bsquare} bind def
/S9 {BL [] 0 setdash 2 copy vpt sub vpt vpt2 Rec fill Bsquare} bind def
/S10 {BL [] 0 setdash 2 copy vpt sub vpt Square fill 2 copy exch vpt sub exch vpt Square fill
	Bsquare} bind def
/S11 {BL [] 0 setdash 2 copy vpt sub vpt Square fill 2 copy exch vpt sub exch vpt2 vpt Rec fill
	Bsquare} bind def
/S12 {BL [] 0 setdash 2 copy exch vpt sub exch vpt sub vpt2 vpt Rec fill Bsquare} bind def
/S13 {BL [] 0 setdash 2 copy exch vpt sub exch vpt sub vpt2 vpt Rec fill
	2 copy vpt Square fill Bsquare} bind def
/S14 {BL [] 0 setdash 2 copy exch vpt sub exch vpt sub vpt2 vpt Rec fill
	2 copy exch vpt sub exch vpt Square fill Bsquare} bind def
/S15 {BL [] 0 setdash 2 copy Bsquare fill Bsquare} bind def
/D0 {gsave translate 45 rotate 0 0 S0 stroke grestore} bind def
/D1 {gsave translate 45 rotate 0 0 S1 stroke grestore} bind def
/D2 {gsave translate 45 rotate 0 0 S2 stroke grestore} bind def
/D3 {gsave translate 45 rotate 0 0 S3 stroke grestore} bind def
/D4 {gsave translate 45 rotate 0 0 S4 stroke grestore} bind def
/D5 {gsave translate 45 rotate 0 0 S5 stroke grestore} bind def
/D6 {gsave translate 45 rotate 0 0 S6 stroke grestore} bind def
/D7 {gsave translate 45 rotate 0 0 S7 stroke grestore} bind def
/D8 {gsave translate 45 rotate 0 0 S8 stroke grestore} bind def
/D9 {gsave translate 45 rotate 0 0 S9 stroke grestore} bind def
/D10 {gsave translate 45 rotate 0 0 S10 stroke grestore} bind def
/D11 {gsave translate 45 rotate 0 0 S11 stroke grestore} bind def
/D12 {gsave translate 45 rotate 0 0 S12 stroke grestore} bind def
/D13 {gsave translate 45 rotate 0 0 S13 stroke grestore} bind def
/D14 {gsave translate 45 rotate 0 0 S14 stroke grestore} bind def
/D15 {gsave translate 45 rotate 0 0 S15 stroke grestore} bind def
/DiaE {stroke [] 0 setdash vpt add M
  hpt neg vpt neg V hpt vpt neg V
  hpt vpt V hpt neg vpt V closepath stroke} def
/BoxE {stroke [] 0 setdash exch hpt sub exch vpt add M
  0 vpt2 neg V hpt2 0 V 0 vpt2 V
  hpt2 neg 0 V closepath stroke} def
/TriUE {stroke [] 0 setdash vpt 1.12 mul add M
  hpt neg vpt -1.62 mul V
  hpt 2 mul 0 V
  hpt neg vpt 1.62 mul V closepath stroke} def
/TriDE {stroke [] 0 setdash vpt 1.12 mul sub M
  hpt neg vpt 1.62 mul V
  hpt 2 mul 0 V
  hpt neg vpt -1.62 mul V closepath stroke} def
/PentE {stroke [] 0 setdash gsave
  translate 0 hpt M 4 {72 rotate 0 hpt L} repeat
  closepath stroke grestore} def
/CircE {stroke [] 0 setdash 
  hpt 0 360 arc stroke} def
/Opaque {gsave closepath 1 setgray fill grestore 0 setgray closepath} def
/DiaW {stroke [] 0 setdash vpt add M
  hpt neg vpt neg V hpt vpt neg V
  hpt vpt V hpt neg vpt V Opaque stroke} def
/BoxW {stroke [] 0 setdash exch hpt sub exch vpt add M
  0 vpt2 neg V hpt2 0 V 0 vpt2 V
  hpt2 neg 0 V Opaque stroke} def
/TriUW {stroke [] 0 setdash vpt 1.12 mul add M
  hpt neg vpt -1.62 mul V
  hpt 2 mul 0 V
  hpt neg vpt 1.62 mul V Opaque stroke} def
/TriDW {stroke [] 0 setdash vpt 1.12 mul sub M
  hpt neg vpt 1.62 mul V
  hpt 2 mul 0 V
  hpt neg vpt -1.62 mul V Opaque stroke} def
/PentW {stroke [] 0 setdash gsave
  translate 0 hpt M 4 {72 rotate 0 hpt L} repeat
  Opaque stroke grestore} def
/CircW {stroke [] 0 setdash 
  hpt 0 360 arc Opaque stroke} def
/BoxFill {gsave Rec 1 setgray fill grestore} def
/Density {
  /Fillden exch def
  currentrgbcolor
  /ColB exch def /ColG exch def /ColR exch def
  /ColR ColR Fillden mul Fillden sub 1 add def
  /ColG ColG Fillden mul Fillden sub 1 add def
  /ColB ColB Fillden mul Fillden sub 1 add def
  ColR ColG ColB setrgbcolor} def
/BoxColFill {gsave Rec PolyFill} def
/PolyFill {gsave Density fill grestore grestore} def
/h {rlineto rlineto rlineto gsave closepath fill grestore} bind def
%
% PostScript Level 1 Pattern Fill routine for rectangles
% Usage: x y w h s a XX PatternFill
%	x,y = lower left corner of box to be filled
%	w,h = width and height of box
%	  a = angle in degrees between lines and x-axis
%	 XX = 0/1 for no/yes cross-hatch
%
/PatternFill {gsave /PFa [ 9 2 roll ] def
  PFa 0 get PFa 2 get 2 div add PFa 1 get PFa 3 get 2 div add translate
  PFa 2 get -2 div PFa 3 get -2 div PFa 2 get PFa 3 get Rec
  TransparentPatterns {} {gsave 1 setgray fill grestore} ifelse
  clip
  currentlinewidth 0.5 mul setlinewidth
  /PFs PFa 2 get dup mul PFa 3 get dup mul add sqrt def
  0 0 M PFa 5 get rotate PFs -2 div dup translate
  0 1 PFs PFa 4 get div 1 add floor cvi
	{PFa 4 get mul 0 M 0 PFs V} for
  0 PFa 6 get ne {
	0 1 PFs PFa 4 get div 1 add floor cvi
	{PFa 4 get mul 0 2 1 roll M PFs 0 V} for
 } if
  stroke grestore} def
%
/languagelevel where
 {pop languagelevel} {1} ifelse
 2 lt
	{/InterpretLevel1 true def}
	{/InterpretLevel1 Level1 def}
 ifelse
%
% PostScript level 2 pattern fill definitions
%
/Level2PatternFill {
/Tile8x8 {/PaintType 2 /PatternType 1 /TilingType 1 /BBox [0 0 8 8] /XStep 8 /YStep 8}
	bind def
/KeepColor {currentrgbcolor [/Pattern /DeviceRGB] setcolorspace} bind def
<< Tile8x8
 /PaintProc {0.5 setlinewidth pop 0 0 M 8 8 L 0 8 M 8 0 L stroke} 
>> matrix makepattern
/Pat1 exch def
<< Tile8x8
 /PaintProc {0.5 setlinewidth pop 0 0 M 8 8 L 0 8 M 8 0 L stroke
	0 4 M 4 8 L 8 4 L 4 0 L 0 4 L stroke}
>> matrix makepattern
/Pat2 exch def
<< Tile8x8
 /PaintProc {0.5 setlinewidth pop 0 0 M 0 8 L
	8 8 L 8 0 L 0 0 L fill}
>> matrix makepattern
/Pat3 exch def
<< Tile8x8
 /PaintProc {0.5 setlinewidth pop -4 8 M 8 -4 L
	0 12 M 12 0 L stroke}
>> matrix makepattern
/Pat4 exch def
<< Tile8x8
 /PaintProc {0.5 setlinewidth pop -4 0 M 8 12 L
	0 -4 M 12 8 L stroke}
>> matrix makepattern
/Pat5 exch def
<< Tile8x8
 /PaintProc {0.5 setlinewidth pop -2 8 M 4 -4 L
	0 12 M 8 -4 L 4 12 M 10 0 L stroke}
>> matrix makepattern
/Pat6 exch def
<< Tile8x8
 /PaintProc {0.5 setlinewidth pop -2 0 M 4 12 L
	0 -4 M 8 12 L 4 -4 M 10 8 L stroke}
>> matrix makepattern
/Pat7 exch def
<< Tile8x8
 /PaintProc {0.5 setlinewidth pop 8 -2 M -4 4 L
	12 0 M -4 8 L 12 4 M 0 10 L stroke}
>> matrix makepattern
/Pat8 exch def
<< Tile8x8
 /PaintProc {0.5 setlinewidth pop 0 -2 M 12 4 L
	-4 0 M 12 8 L -4 4 M 8 10 L stroke}
>> matrix makepattern
/Pat9 exch def
/Pattern1 {PatternBgnd KeepColor Pat1 setpattern} bind def
/Pattern2 {PatternBgnd KeepColor Pat2 setpattern} bind def
/Pattern3 {PatternBgnd KeepColor Pat3 setpattern} bind def
/Pattern4 {PatternBgnd KeepColor Landscape {Pat5} {Pat4} ifelse setpattern} bind def
/Pattern5 {PatternBgnd KeepColor Landscape {Pat4} {Pat5} ifelse setpattern} bind def
/Pattern6 {PatternBgnd KeepColor Landscape {Pat9} {Pat6} ifelse setpattern} bind def
/Pattern7 {PatternBgnd KeepColor Landscape {Pat8} {Pat7} ifelse setpattern} bind def
} def
%
%
%End of PostScript Level 2 code
%
/PatternBgnd {
  TransparentPatterns {} {gsave 1 setgray fill grestore} ifelse
} def
%
% Substitute for Level 2 pattern fill codes with
% grayscale if Level 2 support is not selected.
%
/Level1PatternFill {
/Pattern1 {0.250 Density} bind def
/Pattern2 {0.500 Density} bind def
/Pattern3 {0.750 Density} bind def
/Pattern4 {0.125 Density} bind def
/Pattern5 {0.375 Density} bind def
/Pattern6 {0.625 Density} bind def
/Pattern7 {0.875 Density} bind def
} def
%
% Now test for support of Level 2 code
%
Level1 {Level1PatternFill} {Level2PatternFill} ifelse
%
/Symbol-Oblique /Symbol findfont [1 0 .167 1 0 0] makefont
dup length dict begin {1 index /FID eq {pop pop} {def} ifelse} forall
currentdict end definefont pop
Level1 SuppressPDFMark or 
{} {
/SDict 10 dict def
systemdict /pdfmark known not {
  userdict /pdfmark systemdict /cleartomark get put
} if
SDict begin [
  /Title (gitter.tex)
  /Subject (gnuplot plot)
  /Creator (gnuplot 4.6 patchlevel 5)
  /Author (kevin.luedemann)
%  /Producer (gnuplot)
%  /Keywords ()
  /CreationDate (Tue Mar 17 14:59:11 2015)
  /DOCINFO pdfmark
end
} ifelse
end
%%EndProlog
%%Page: 1 1
gnudict begin
gsave
doclip
50 50 translate
0.050 0.050 scale
0 setgray
newpath
1.000 UL
LTb
LCb setrgbcolor
858 440 M
63 0 V
5882 0 R
-63 0 V
stroke
LTb
858 874 M
63 0 V
5882 0 R
-63 0 V
858 1307 M
63 0 V
5882 0 R
-63 0 V
858 1741 M
63 0 V
5882 0 R
-63 0 V
858 2174 M
63 0 V
5882 0 R
-63 0 V
858 2608 M
63 0 V
5882 0 R
-63 0 V
858 3041 M
63 0 V
5882 0 R
-63 0 V
858 3475 M
63 0 V
5882 0 R
-63 0 V
858 3908 M
63 0 V
5882 0 R
-63 0 V
858 4342 M
63 0 V
5882 0 R
-63 0 V
858 4775 M
63 0 V
5882 0 R
-63 0 V
858 440 M
0 63 V
0 4272 R
0 -63 V
1849 440 M
0 63 V
0 4272 R
0 -63 V
2840 440 M
0 63 V
0 4272 R
0 -63 V
3831 440 M
0 63 V
0 4272 R
0 -63 V
4821 440 M
0 63 V
0 4272 R
0 -63 V
5812 440 M
0 63 V
0 4272 R
0 -63 V
6803 440 M
0 63 V
0 4272 R
0 -63 V
stroke
858 4775 N
858 440 L
5945 0 V
0 4335 V
-5945 0 V
Z stroke
1.000 UP
1.000 UL
LTb
1.000 UP
1.000 UL
LT0
LC0 setrgbcolor
LCb setrgbcolor
LT0
LC0 setrgbcolor
3757 503 Pls
3767 503 Pls
3777 514 Pls
3787 514 Pls
3797 525 Pls
3807 536 Pls
3817 547 Pls
3827 547 Pls
3836 536 Pls
3846 514 Pls
3856 492 Pls
3866 492 Pls
3876 492 Pls
3886 492 Pls
3896 514 Pls
3906 514 Pls
3916 547 Pls
3926 613 Pls
3936 690 Pls
3945 779 Pls
3955 878 Pls
3965 956 Pls
3975 989 Pls
3985 1044 Pls
3995 1154 Pls
4005 1342 Pls
4015 1541 Pls
4025 1674 Pls
4035 1651 Pls
4045 1442 Pls
4054 1088 Pls
4064 823 Pls
4074 724 Pls
4084 812 Pls
4094 922 Pls
4104 1055 Pls
4114 1132 Pls
4124 1254 Pls
4134 1464 Pls
4144 1839 Pls
4154 2259 Pls
4163 2425 Pls
4173 2535 Pls
4183 2634 Pls
4193 2955 Pls
4203 3573 Pls
4213 4159 Pls
4223 4545 Pls
4233 4269 Pls
4243 3463 Pls
4253 2171 Pls
4263 1530 Pls
4272 1099 Pls
4282 933 Pls
4292 933 Pls
4302 889 Pls
4312 779 Pls
4322 746 Pls
4332 812 Pls
4342 956 Pls
4352 1033 Pls
4362 1055 Pls
4371 1022 Pls
4381 1044 Pls
4391 1199 Pls
4401 1397 Pls
4411 1530 Pls
4421 1519 Pls
4431 1364 Pls
4441 1143 Pls
4451 933 Pls
4461 679 Pls
4471 580 Pls
4480 536 Pls
4490 503 Pls
4500 492 Pls
4510 492 Pls
4520 492 Pls
4530 503 Pls
4540 503 Pls
4550 503 Pls
4560 514 Pls
4570 514 Pls
4580 536 Pls
6243 4602 Pls
1.000 UP
1.000 UL
LT0
4585 535 Pls
4589 538 Pls
4594 541 Pls
4599 543 Pls
4604 546 Pls
4609 546 Pls
4614 543 Pls
4619 539 Pls
4624 531 Pls
4629 522 Pls
4634 511 Pls
4639 503 Pls
4644 494 Pls
4649 485 Pls
4654 479 Pls
4659 476 Pls
4664 475 Pls
4669 474 Pls
4674 474 Pls
4679 474 Pls
4684 475 Pls
4689 475 Pls
4694 474 Pls
4698 473 Pls
4703 473 Pls
4708 475 Pls
4713 476 Pls
4718 481 Pls
4723 483 Pls
4728 486 Pls
4733 487 Pls
4738 488 Pls
4743 488 Pls
4748 487 Pls
4753 487 Pls
4758 487 Pls
4763 486 Pls
4768 489 Pls
4773 495 Pls
4778 500 Pls
4783 506 Pls
4788 510 Pls
4793 513 Pls
4798 514 Pls
4803 513 Pls
4807 509 Pls
4812 506 Pls
4817 503 Pls
4822 498 Pls
4827 494 Pls
4832 490 Pls
4837 487 Pls
4842 483 Pls
4847 481 Pls
4852 476 Pls
4857 474 Pls
4862 471 Pls
4867 471 Pls
4872 469 Pls
4877 469 Pls
4882 471 Pls
4887 473 Pls
4892 474 Pls
4897 475 Pls
4902 476 Pls
4907 477 Pls
4911 478 Pls
4916 481 Pls
4921 482 Pls
4926 483 Pls
4931 485 Pls
4936 486 Pls
4941 488 Pls
4946 492 Pls
4951 494 Pls
4956 497 Pls
4961 500 Pls
4966 505 Pls
4971 508 Pls
4976 513 Pls
4981 517 Pls
4986 519 Pls
4991 521 Pls
4996 521 Pls
5001 520 Pls
5006 515 Pls
5011 509 Pls
5016 503 Pls
5020 495 Pls
5025 487 Pls
5030 482 Pls
5035 477 Pls
5040 473 Pls
5045 469 Pls
5050 468 Pls
5055 467 Pls
5060 467 Pls
5065 467 Pls
5070 465 Pls
5075 464 Pls
5080 464 Pls
5085 464 Pls
5090 464 Pls
5095 464 Pls
5100 463 Pls
5105 462 Pls
5110 465 Pls
5115 466 Pls
5120 465 Pls
5125 465 Pls
5129 465 Pls
5134 466 Pls
5139 464 Pls
5144 464 Pls
5149 465 Pls
5154 465 Pls
5159 466 Pls
5164 466 Pls
5169 466 Pls
5174 466 Pls
5179 465 Pls
5184 464 Pls
5189 461 Pls
5194 462 Pls
5199 463 Pls
5204 464 Pls
5209 463 Pls
5214 464 Pls
5219 464 Pls
5224 464 Pls
5229 464 Pls
5234 464 Pls
5238 464 Pls
5243 464 Pls
5248 461 Pls
5253 464 Pls
5258 464 Pls
5263 465 Pls
5268 465 Pls
5273 465 Pls
5278 465 Pls
5283 465 Pls
5288 466 Pls
5293 468 Pls
5298 466 Pls
5303 464 Pls
5308 464 Pls
5313 464 Pls
5318 465 Pls
5323 465 Pls
5328 466 Pls
5333 467 Pls
5338 468 Pls
5343 469 Pls
5347 472 Pls
5352 476 Pls
5357 479 Pls
5362 482 Pls
5367 485 Pls
5372 487 Pls
5377 486 Pls
5382 485 Pls
5387 485 Pls
5392 483 Pls
5397 481 Pls
5402 478 Pls
5407 476 Pls
5412 473 Pls
5417 469 Pls
5422 468 Pls
5427 466 Pls
5432 465 Pls
5437 464 Pls
5442 463 Pls
5447 463 Pls
5452 462 Pls
5456 462 Pls
5461 462 Pls
5466 461 Pls
5471 462 Pls
5476 462 Pls
5481 462 Pls
5486 462 Pls
5491 462 Pls
5496 463 Pls
5501 462 Pls
5506 463 Pls
5511 464 Pls
5516 464 Pls
5521 464 Pls
5526 464 Pls
5531 465 Pls
5536 466 Pls
5541 467 Pls
5546 467 Pls
5551 468 Pls
5556 468 Pls
5560 468 Pls
5565 469 Pls
5570 468 Pls
1.000 UP
1.000 UL
LT0
5575 469 Pls
5580 469 Pls
5585 469 Pls
5590 468 Pls
5595 468 Pls
5600 466 Pls
5605 466 Pls
5610 465 Pls
5615 465 Pls
5620 465 Pls
5625 464 Pls
5630 464 Pls
5635 464 Pls
5640 464 Pls
5645 464 Pls
5650 464 Pls
5655 463 Pls
5660 464 Pls
5665 463 Pls
5669 463 Pls
5674 463 Pls
5679 463 Pls
5684 463 Pls
5689 463 Pls
5694 464 Pls
5699 463 Pls
5704 463 Pls
5709 463 Pls
5714 463 Pls
5719 463 Pls
5724 464 Pls
5729 464 Pls
5734 464 Pls
5739 465 Pls
5744 465 Pls
5749 466 Pls
5754 467 Pls
5759 467 Pls
5764 467 Pls
5769 467 Pls
5774 468 Pls
5778 467 Pls
5783 467 Pls
5788 468 Pls
5793 467 Pls
5798 467 Pls
5803 466 Pls
5808 465 Pls
5813 465 Pls
5818 465 Pls
5823 464 Pls
5828 463 Pls
5833 464 Pls
5838 464 Pls
5843 464 Pls
5848 464 Pls
5853 464 Pls
5858 464 Pls
5863 464 Pls
5868 465 Pls
5873 464 Pls
5878 461 Pls
5883 465 Pls
5887 465 Pls
5892 466 Pls
5897 466 Pls
5902 466 Pls
5907 467 Pls
5912 467 Pls
5917 468 Pls
5922 468 Pls
5927 469 Pls
5932 469 Pls
5937 470 Pls
5942 471 Pls
5947 471 Pls
5952 471 Pls
5957 472 Pls
5962 472 Pls
5967 471 Pls
5972 470 Pls
5977 470 Pls
5982 469 Pls
5987 468 Pls
5992 467 Pls
5996 466 Pls
6001 465 Pls
6006 465 Pls
6011 465 Pls
6016 465 Pls
6021 464 Pls
6026 464 Pls
6031 464 Pls
6036 464 Pls
6041 464 Pls
6046 464 Pls
6051 464 Pls
6056 464 Pls
6061 464 Pls
6066 464 Pls
6071 464 Pls
6076 464 Pls
6081 464 Pls
6086 464 Pls
6091 464 Pls
6096 464 Pls
6100 464 Pls
6105 465 Pls
6110 465 Pls
6115 465 Pls
6120 465 Pls
6125 465 Pls
6130 465 Pls
6135 465 Pls
6140 465 Pls
6145 465 Pls
6150 465 Pls
6155 465 Pls
6160 465 Pls
6165 465 Pls
6170 464 Pls
6175 464 Pls
6180 464 Pls
6185 464 Pls
6190 464 Pls
6195 465 Pls
6200 465 Pls
6205 466 Pls
6209 466 Pls
6214 465 Pls
6219 466 Pls
6224 467 Pls
6229 467 Pls
6234 467 Pls
6239 467 Pls
6244 467 Pls
6249 467 Pls
6254 467 Pls
6259 468 Pls
6264 468 Pls
6269 468 Pls
6274 468 Pls
6279 467 Pls
6284 467 Pls
6289 468 Pls
6294 468 Pls
6299 467 Pls
6304 467 Pls
6309 468 Pls
6314 468 Pls
6318 468 Pls
6323 469 Pls
6328 470 Pls
6333 470 Pls
6338 470 Pls
6343 470 Pls
6348 471 Pls
6353 468 Pls
6358 464 Pls
6363 463 Pls
6368 469 Pls
6373 469 Pls
6378 468 Pls
6383 462 Pls
6388 462 Pls
6393 462 Pls
6398 466 Pls
6403 466 Pls
6408 464 Pls
6413 465 Pls
6418 465 Pls
6423 464 Pls
6427 465 Pls
6432 466 Pls
6437 466 Pls
6442 466 Pls
6447 465 Pls
6452 466 Pls
6457 466 Pls
6462 467 Pls
6467 466 Pls
6472 467 Pls
6477 467 Pls
6482 467 Pls
6487 467 Pls
6492 467 Pls
6497 467 Pls
6502 467 Pls
6507 468 Pls
6512 467 Pls
6517 468 Pls
6522 468 Pls
6527 467 Pls
6532 467 Pls
6536 467 Pls
6541 467 Pls
6546 467 Pls
6551 467 Pls
6556 467 Pls
6561 467 Pls
1.000 UP
1.000 UL
LT0
1339 464 Pls
1344 464 Pls
1348 463 Pls
1353 463 Pls
1358 462 Pls
1363 462 Pls
1368 462 Pls
1373 462 Pls
1378 462 Pls
1383 462 Pls
1388 463 Pls
1393 462 Pls
1398 463 Pls
1403 463 Pls
1408 463 Pls
1413 464 Pls
1418 464 Pls
1423 463 Pls
1428 464 Pls
1433 464 Pls
1438 465 Pls
1443 465 Pls
1448 465 Pls
1453 465 Pls
1457 465 Pls
1462 465 Pls
1467 465 Pls
1472 465 Pls
1477 464 Pls
1482 464 Pls
1487 464 Pls
1.000 UP
1.000 UL
LT0
1495 465 Pls
1503 464 Pls
1511 464 Pls
1519 464 Pls
1527 464 Pls
1535 464 Pls
1543 464 Pls
1551 464 Pls
1559 464 Pls
1566 464 Pls
1574 464 Pls
1582 463 Pls
1590 463 Pls
1598 463 Pls
1606 463 Pls
1614 464 Pls
1622 464 Pls
1630 464 Pls
1638 463 Pls
1646 461 Pls
1654 463 Pls
1662 464 Pls
1669 464 Pls
1677 464 Pls
1685 464 Pls
1693 464 Pls
1701 465 Pls
1709 465 Pls
1717 465 Pls
1725 465 Pls
1733 465 Pls
1741 465 Pls
1749 464 Pls
1757 464 Pls
1765 465 Pls
1773 464 Pls
1780 465 Pls
1788 465 Pls
1796 465 Pls
1804 464 Pls
1812 465 Pls
1820 462 Pls
1828 464 Pls
1836 465 Pls
1844 464 Pls
1852 465 Pls
1860 462 Pls
1868 464 Pls
1876 464 Pls
1884 463 Pls
1891 464 Pls
1899 464 Pls
1907 464 Pls
1915 464 Pls
1923 464 Pls
1931 464 Pls
1939 464 Pls
1947 464 Pls
1955 464 Pls
1963 463 Pls
1971 464 Pls
1979 464 Pls
1987 464 Pls
1994 464 Pls
2002 464 Pls
2010 464 Pls
2018 465 Pls
2026 465 Pls
2034 465 Pls
2042 466 Pls
2050 465 Pls
2058 465 Pls
2066 465 Pls
2074 465 Pls
2082 466 Pls
2090 466 Pls
2098 465 Pls
2105 464 Pls
2113 464 Pls
2121 464 Pls
2129 463 Pls
2137 464 Pls
2145 464 Pls
2153 464 Pls
2161 464 Pls
2169 464 Pls
2177 464 Pls
2185 465 Pls
2193 464 Pls
2201 464 Pls
2209 464 Pls
2216 464 Pls
2224 463 Pls
2232 463 Pls
2240 463 Pls
2248 463 Pls
2256 464 Pls
2264 462 Pls
2272 462 Pls
2280 464 Pls
2288 464 Pls
2296 464 Pls
2304 465 Pls
2312 464 Pls
2319 464 Pls
2327 465 Pls
2335 465 Pls
2343 465 Pls
2351 465 Pls
2359 466 Pls
2367 466 Pls
2375 466 Pls
2383 466 Pls
2391 466 Pls
2399 467 Pls
2407 468 Pls
2415 467 Pls
2423 468 Pls
2430 468 Pls
2438 467 Pls
2446 467 Pls
2454 468 Pls
2462 468 Pls
2470 468 Pls
2478 468 Pls
2486 467 Pls
2494 467 Pls
2502 466 Pls
2510 466 Pls
2518 465 Pls
2526 465 Pls
2533 465 Pls
2541 465 Pls
2549 465 Pls
2557 465 Pls
2565 465 Pls
2573 465 Pls
2581 465 Pls
2589 465 Pls
2597 466 Pls
2605 466 Pls
2613 466 Pls
2621 467 Pls
2629 466 Pls
2637 464 Pls
2644 465 Pls
2652 466 Pls
2660 466 Pls
2668 467 Pls
2676 467 Pls
2684 466 Pls
2692 465 Pls
2700 465 Pls
2708 464 Pls
2716 464 Pls
2724 464 Pls
2732 465 Pls
2740 465 Pls
2748 465 Pls
2755 464 Pls
2763 464 Pls
2771 464 Pls
2779 463 Pls
2787 463 Pls
2795 464 Pls
2803 465 Pls
2811 465 Pls
2819 465 Pls
2827 464 Pls
2835 464 Pls
2843 464 Pls
2851 464 Pls
2858 464 Pls
2866 464 Pls
2874 463 Pls
2882 463 Pls
2890 462 Pls
2898 462 Pls
2906 462 Pls
2914 462 Pls
2922 462 Pls
2930 463 Pls
2938 463 Pls
2946 463 Pls
2954 464 Pls
2962 465 Pls
2969 466 Pls
2977 467 Pls
2985 468 Pls
2993 470 Pls
3001 471 Pls
3009 472 Pls
3017 472 Pls
3025 472 Pls
3033 473 Pls
3041 475 Pls
3049 476 Pls
3057 478 Pls
3065 478 Pls
3073 476 Pls
3080 474 Pls
3088 471 Pls
3096 468 Pls
3104 465 Pls
3112 465 Pls
3120 465 Pls
3128 466 Pls
3136 466 Pls
3144 465 Pls
3152 465 Pls
3160 463 Pls
3168 463 Pls
3176 462 Pls
3183 463 Pls
3191 463 Pls
3199 463 Pls
3207 463 Pls
3215 464 Pls
3223 464 Pls
3231 462 Pls
3239 463 Pls
3247 463 Pls
3255 464 Pls
3263 465 Pls
3271 465 Pls
3279 465 Pls
3287 465 Pls
3294 465 Pls
3302 466 Pls
3310 467 Pls
3318 468 Pls
3326 470 Pls
3334 470 Pls
3342 472 Pls
3350 474 Pls
3358 476 Pls
3366 479 Pls
3374 484 Pls
3382 486 Pls
3390 488 Pls
3398 488 Pls
3405 489 Pls
3413 490 Pls
3421 493 Pls
3429 498 Pls
3437 502 Pls
3445 502 Pls
3453 500 Pls
3461 495 Pls
3469 488 Pls
3477 480 Pls
3485 474 Pls
3493 471 Pls
3501 470 Pls
3508 469 Pls
3516 468 Pls
3524 469 Pls
3532 469 Pls
3540 469 Pls
3548 470 Pls
3556 471 Pls
3564 473 Pls
3572 475 Pls
3580 478 Pls
3588 480 Pls
3596 483 Pls
3604 484 Pls
3612 486 Pls
3619 490 Pls
3627 495 Pls
3635 501 Pls
3643 506 Pls
3651 511 Pls
3659 512 Pls
3667 505 Pls
3675 494 Pls
3683 484 Pls
3691 477 Pls
3699 476 Pls
3707 479 Pls
3715 483 Pls
3722 487 Pls
3730 488 Pls
3738 487 Pls
3746 486 Pls
3754 489 Pls
3762 494 Pls
3770 504 Pls
3778 509 Pls
3786 511 Pls
3794 511 Pls
3802 511 Pls
3810 513 Pls
3818 518 Pls
3826 526 Pls
3833 530 Pls
3841 526 Pls
3849 515 Pls
3857 491 Pls
3865 488 Pls
3873 484 Pls
3881 484 Pls
3889 483 Pls
3897 493 Pls
3905 505 Pls
3913 522 Pls
3921 547 Pls
3929 582 Pls
3937 621 Pls
3944 668 Pls
3952 668 Pls
1.000 UL
LTb
LCb setrgbcolor
858 4775 N
858 440 L
5945 0 V
0 4335 V
-5945 0 V
Z stroke
1.000 UP
1.000 UL
LTb
stroke
grestore
end
showpage
%%Trailer
