%!PS-Adobe-2.0 EPSF-2.0
%%Title: steg.tex
%%Creator: gnuplot 4.6 patchlevel 5
%%CreationDate: Tue Mar 17 14:59:12 2015
%%DocumentFonts: 
%%BoundingBox: 50 50 410 302
%%EndComments
%%BeginProlog
/gnudict 256 dict def
gnudict begin
%
% The following true/false flags may be edited by hand if desired.
% The unit line width and grayscale image gamma correction may also be changed.
%
/Color true def
/Blacktext true def
/Solid false def
/Dashlength 1 def
/Landscape false def
/Level1 false def
/Rounded false def
/ClipToBoundingBox false def
/SuppressPDFMark false def
/TransparentPatterns false def
/gnulinewidth 5.000 def
/userlinewidth gnulinewidth def
/Gamma 1.0 def
/BackgroundColor {-1.000 -1.000 -1.000} def
%
/vshift -73 def
/dl1 {
  10.0 Dashlength mul mul
  Rounded { currentlinewidth 0.75 mul sub dup 0 le { pop 0.01 } if } if
} def
/dl2 {
  10.0 Dashlength mul mul
  Rounded { currentlinewidth 0.75 mul add } if
} def
/hpt_ 31.5 def
/vpt_ 31.5 def
/hpt hpt_ def
/vpt vpt_ def
/doclip {
  ClipToBoundingBox {
    newpath 50 50 moveto 410 50 lineto 410 302 lineto 50 302 lineto closepath
    clip
  } if
} def
%
% Gnuplot Prolog Version 4.6 (September 2012)
%
%/SuppressPDFMark true def
%
/M {moveto} bind def
/L {lineto} bind def
/R {rmoveto} bind def
/V {rlineto} bind def
/N {newpath moveto} bind def
/Z {closepath} bind def
/C {setrgbcolor} bind def
/f {rlineto fill} bind def
/g {setgray} bind def
/Gshow {show} def   % May be redefined later in the file to support UTF-8
/vpt2 vpt 2 mul def
/hpt2 hpt 2 mul def
/Lshow {currentpoint stroke M 0 vshift R 
	Blacktext {gsave 0 setgray show grestore} {show} ifelse} def
/Rshow {currentpoint stroke M dup stringwidth pop neg vshift R
	Blacktext {gsave 0 setgray show grestore} {show} ifelse} def
/Cshow {currentpoint stroke M dup stringwidth pop -2 div vshift R 
	Blacktext {gsave 0 setgray show grestore} {show} ifelse} def
/UP {dup vpt_ mul /vpt exch def hpt_ mul /hpt exch def
  /hpt2 hpt 2 mul def /vpt2 vpt 2 mul def} def
/DL {Color {setrgbcolor Solid {pop []} if 0 setdash}
 {pop pop pop 0 setgray Solid {pop []} if 0 setdash} ifelse} def
/BL {stroke userlinewidth 2 mul setlinewidth
	Rounded {1 setlinejoin 1 setlinecap} if} def
/AL {stroke userlinewidth 2 div setlinewidth
	Rounded {1 setlinejoin 1 setlinecap} if} def
/UL {dup gnulinewidth mul /userlinewidth exch def
	dup 1 lt {pop 1} if 10 mul /udl exch def} def
/PL {stroke userlinewidth setlinewidth
	Rounded {1 setlinejoin 1 setlinecap} if} def
3.8 setmiterlimit
% Default Line colors
/LCw {1 1 1} def
/LCb {0 0 0} def
/LCa {0 0 0} def
/LC0 {1 0 0} def
/LC1 {0 1 0} def
/LC2 {0 0 1} def
/LC3 {1 0 1} def
/LC4 {0 1 1} def
/LC5 {1 1 0} def
/LC6 {0 0 0} def
/LC7 {1 0.3 0} def
/LC8 {0.5 0.5 0.5} def
% Default Line Types
/LTw {PL [] 1 setgray} def
/LTb {BL [] LCb DL} def
/LTa {AL [1 udl mul 2 udl mul] 0 setdash LCa setrgbcolor} def
/LT0 {PL [] LC0 DL} def
/LT1 {PL [4 dl1 2 dl2] LC1 DL} def
/LT2 {PL [2 dl1 3 dl2] LC2 DL} def
/LT3 {PL [1 dl1 1.5 dl2] LC3 DL} def
/LT4 {PL [6 dl1 2 dl2 1 dl1 2 dl2] LC4 DL} def
/LT5 {PL [3 dl1 3 dl2 1 dl1 3 dl2] LC5 DL} def
/LT6 {PL [2 dl1 2 dl2 2 dl1 6 dl2] LC6 DL} def
/LT7 {PL [1 dl1 2 dl2 6 dl1 2 dl2 1 dl1 2 dl2] LC7 DL} def
/LT8 {PL [2 dl1 2 dl2 2 dl1 2 dl2 2 dl1 2 dl2 2 dl1 4 dl2] LC8 DL} def
/Pnt {stroke [] 0 setdash gsave 1 setlinecap M 0 0 V stroke grestore} def
/Dia {stroke [] 0 setdash 2 copy vpt add M
  hpt neg vpt neg V hpt vpt neg V
  hpt vpt V hpt neg vpt V closepath stroke
  Pnt} def
/Pls {stroke [] 0 setdash vpt sub M 0 vpt2 V
  currentpoint stroke M
  hpt neg vpt neg R hpt2 0 V stroke
 } def
/Box {stroke [] 0 setdash 2 copy exch hpt sub exch vpt add M
  0 vpt2 neg V hpt2 0 V 0 vpt2 V
  hpt2 neg 0 V closepath stroke
  Pnt} def
/Crs {stroke [] 0 setdash exch hpt sub exch vpt add M
  hpt2 vpt2 neg V currentpoint stroke M
  hpt2 neg 0 R hpt2 vpt2 V stroke} def
/TriU {stroke [] 0 setdash 2 copy vpt 1.12 mul add M
  hpt neg vpt -1.62 mul V
  hpt 2 mul 0 V
  hpt neg vpt 1.62 mul V closepath stroke
  Pnt} def
/Star {2 copy Pls Crs} def
/BoxF {stroke [] 0 setdash exch hpt sub exch vpt add M
  0 vpt2 neg V hpt2 0 V 0 vpt2 V
  hpt2 neg 0 V closepath fill} def
/TriUF {stroke [] 0 setdash vpt 1.12 mul add M
  hpt neg vpt -1.62 mul V
  hpt 2 mul 0 V
  hpt neg vpt 1.62 mul V closepath fill} def
/TriD {stroke [] 0 setdash 2 copy vpt 1.12 mul sub M
  hpt neg vpt 1.62 mul V
  hpt 2 mul 0 V
  hpt neg vpt -1.62 mul V closepath stroke
  Pnt} def
/TriDF {stroke [] 0 setdash vpt 1.12 mul sub M
  hpt neg vpt 1.62 mul V
  hpt 2 mul 0 V
  hpt neg vpt -1.62 mul V closepath fill} def
/DiaF {stroke [] 0 setdash vpt add M
  hpt neg vpt neg V hpt vpt neg V
  hpt vpt V hpt neg vpt V closepath fill} def
/Pent {stroke [] 0 setdash 2 copy gsave
  translate 0 hpt M 4 {72 rotate 0 hpt L} repeat
  closepath stroke grestore Pnt} def
/PentF {stroke [] 0 setdash gsave
  translate 0 hpt M 4 {72 rotate 0 hpt L} repeat
  closepath fill grestore} def
/Circle {stroke [] 0 setdash 2 copy
  hpt 0 360 arc stroke Pnt} def
/CircleF {stroke [] 0 setdash hpt 0 360 arc fill} def
/C0 {BL [] 0 setdash 2 copy moveto vpt 90 450 arc} bind def
/C1 {BL [] 0 setdash 2 copy moveto
	2 copy vpt 0 90 arc closepath fill
	vpt 0 360 arc closepath} bind def
/C2 {BL [] 0 setdash 2 copy moveto
	2 copy vpt 90 180 arc closepath fill
	vpt 0 360 arc closepath} bind def
/C3 {BL [] 0 setdash 2 copy moveto
	2 copy vpt 0 180 arc closepath fill
	vpt 0 360 arc closepath} bind def
/C4 {BL [] 0 setdash 2 copy moveto
	2 copy vpt 180 270 arc closepath fill
	vpt 0 360 arc closepath} bind def
/C5 {BL [] 0 setdash 2 copy moveto
	2 copy vpt 0 90 arc
	2 copy moveto
	2 copy vpt 180 270 arc closepath fill
	vpt 0 360 arc} bind def
/C6 {BL [] 0 setdash 2 copy moveto
	2 copy vpt 90 270 arc closepath fill
	vpt 0 360 arc closepath} bind def
/C7 {BL [] 0 setdash 2 copy moveto
	2 copy vpt 0 270 arc closepath fill
	vpt 0 360 arc closepath} bind def
/C8 {BL [] 0 setdash 2 copy moveto
	2 copy vpt 270 360 arc closepath fill
	vpt 0 360 arc closepath} bind def
/C9 {BL [] 0 setdash 2 copy moveto
	2 copy vpt 270 450 arc closepath fill
	vpt 0 360 arc closepath} bind def
/C10 {BL [] 0 setdash 2 copy 2 copy moveto vpt 270 360 arc closepath fill
	2 copy moveto
	2 copy vpt 90 180 arc closepath fill
	vpt 0 360 arc closepath} bind def
/C11 {BL [] 0 setdash 2 copy moveto
	2 copy vpt 0 180 arc closepath fill
	2 copy moveto
	2 copy vpt 270 360 arc closepath fill
	vpt 0 360 arc closepath} bind def
/C12 {BL [] 0 setdash 2 copy moveto
	2 copy vpt 180 360 arc closepath fill
	vpt 0 360 arc closepath} bind def
/C13 {BL [] 0 setdash 2 copy moveto
	2 copy vpt 0 90 arc closepath fill
	2 copy moveto
	2 copy vpt 180 360 arc closepath fill
	vpt 0 360 arc closepath} bind def
/C14 {BL [] 0 setdash 2 copy moveto
	2 copy vpt 90 360 arc closepath fill
	vpt 0 360 arc} bind def
/C15 {BL [] 0 setdash 2 copy vpt 0 360 arc closepath fill
	vpt 0 360 arc closepath} bind def
/Rec {newpath 4 2 roll moveto 1 index 0 rlineto 0 exch rlineto
	neg 0 rlineto closepath} bind def
/Square {dup Rec} bind def
/Bsquare {vpt sub exch vpt sub exch vpt2 Square} bind def
/S0 {BL [] 0 setdash 2 copy moveto 0 vpt rlineto BL Bsquare} bind def
/S1 {BL [] 0 setdash 2 copy vpt Square fill Bsquare} bind def
/S2 {BL [] 0 setdash 2 copy exch vpt sub exch vpt Square fill Bsquare} bind def
/S3 {BL [] 0 setdash 2 copy exch vpt sub exch vpt2 vpt Rec fill Bsquare} bind def
/S4 {BL [] 0 setdash 2 copy exch vpt sub exch vpt sub vpt Square fill Bsquare} bind def
/S5 {BL [] 0 setdash 2 copy 2 copy vpt Square fill
	exch vpt sub exch vpt sub vpt Square fill Bsquare} bind def
/S6 {BL [] 0 setdash 2 copy exch vpt sub exch vpt sub vpt vpt2 Rec fill Bsquare} bind def
/S7 {BL [] 0 setdash 2 copy exch vpt sub exch vpt sub vpt vpt2 Rec fill
	2 copy vpt Square fill Bsquare} bind def
/S8 {BL [] 0 setdash 2 copy vpt sub vpt Square fill Bsquare} bind def
/S9 {BL [] 0 setdash 2 copy vpt sub vpt vpt2 Rec fill Bsquare} bind def
/S10 {BL [] 0 setdash 2 copy vpt sub vpt Square fill 2 copy exch vpt sub exch vpt Square fill
	Bsquare} bind def
/S11 {BL [] 0 setdash 2 copy vpt sub vpt Square fill 2 copy exch vpt sub exch vpt2 vpt Rec fill
	Bsquare} bind def
/S12 {BL [] 0 setdash 2 copy exch vpt sub exch vpt sub vpt2 vpt Rec fill Bsquare} bind def
/S13 {BL [] 0 setdash 2 copy exch vpt sub exch vpt sub vpt2 vpt Rec fill
	2 copy vpt Square fill Bsquare} bind def
/S14 {BL [] 0 setdash 2 copy exch vpt sub exch vpt sub vpt2 vpt Rec fill
	2 copy exch vpt sub exch vpt Square fill Bsquare} bind def
/S15 {BL [] 0 setdash 2 copy Bsquare fill Bsquare} bind def
/D0 {gsave translate 45 rotate 0 0 S0 stroke grestore} bind def
/D1 {gsave translate 45 rotate 0 0 S1 stroke grestore} bind def
/D2 {gsave translate 45 rotate 0 0 S2 stroke grestore} bind def
/D3 {gsave translate 45 rotate 0 0 S3 stroke grestore} bind def
/D4 {gsave translate 45 rotate 0 0 S4 stroke grestore} bind def
/D5 {gsave translate 45 rotate 0 0 S5 stroke grestore} bind def
/D6 {gsave translate 45 rotate 0 0 S6 stroke grestore} bind def
/D7 {gsave translate 45 rotate 0 0 S7 stroke grestore} bind def
/D8 {gsave translate 45 rotate 0 0 S8 stroke grestore} bind def
/D9 {gsave translate 45 rotate 0 0 S9 stroke grestore} bind def
/D10 {gsave translate 45 rotate 0 0 S10 stroke grestore} bind def
/D11 {gsave translate 45 rotate 0 0 S11 stroke grestore} bind def
/D12 {gsave translate 45 rotate 0 0 S12 stroke grestore} bind def
/D13 {gsave translate 45 rotate 0 0 S13 stroke grestore} bind def
/D14 {gsave translate 45 rotate 0 0 S14 stroke grestore} bind def
/D15 {gsave translate 45 rotate 0 0 S15 stroke grestore} bind def
/DiaE {stroke [] 0 setdash vpt add M
  hpt neg vpt neg V hpt vpt neg V
  hpt vpt V hpt neg vpt V closepath stroke} def
/BoxE {stroke [] 0 setdash exch hpt sub exch vpt add M
  0 vpt2 neg V hpt2 0 V 0 vpt2 V
  hpt2 neg 0 V closepath stroke} def
/TriUE {stroke [] 0 setdash vpt 1.12 mul add M
  hpt neg vpt -1.62 mul V
  hpt 2 mul 0 V
  hpt neg vpt 1.62 mul V closepath stroke} def
/TriDE {stroke [] 0 setdash vpt 1.12 mul sub M
  hpt neg vpt 1.62 mul V
  hpt 2 mul 0 V
  hpt neg vpt -1.62 mul V closepath stroke} def
/PentE {stroke [] 0 setdash gsave
  translate 0 hpt M 4 {72 rotate 0 hpt L} repeat
  closepath stroke grestore} def
/CircE {stroke [] 0 setdash 
  hpt 0 360 arc stroke} def
/Opaque {gsave closepath 1 setgray fill grestore 0 setgray closepath} def
/DiaW {stroke [] 0 setdash vpt add M
  hpt neg vpt neg V hpt vpt neg V
  hpt vpt V hpt neg vpt V Opaque stroke} def
/BoxW {stroke [] 0 setdash exch hpt sub exch vpt add M
  0 vpt2 neg V hpt2 0 V 0 vpt2 V
  hpt2 neg 0 V Opaque stroke} def
/TriUW {stroke [] 0 setdash vpt 1.12 mul add M
  hpt neg vpt -1.62 mul V
  hpt 2 mul 0 V
  hpt neg vpt 1.62 mul V Opaque stroke} def
/TriDW {stroke [] 0 setdash vpt 1.12 mul sub M
  hpt neg vpt 1.62 mul V
  hpt 2 mul 0 V
  hpt neg vpt -1.62 mul V Opaque stroke} def
/PentW {stroke [] 0 setdash gsave
  translate 0 hpt M 4 {72 rotate 0 hpt L} repeat
  Opaque stroke grestore} def
/CircW {stroke [] 0 setdash 
  hpt 0 360 arc Opaque stroke} def
/BoxFill {gsave Rec 1 setgray fill grestore} def
/Density {
  /Fillden exch def
  currentrgbcolor
  /ColB exch def /ColG exch def /ColR exch def
  /ColR ColR Fillden mul Fillden sub 1 add def
  /ColG ColG Fillden mul Fillden sub 1 add def
  /ColB ColB Fillden mul Fillden sub 1 add def
  ColR ColG ColB setrgbcolor} def
/BoxColFill {gsave Rec PolyFill} def
/PolyFill {gsave Density fill grestore grestore} def
/h {rlineto rlineto rlineto gsave closepath fill grestore} bind def
%
% PostScript Level 1 Pattern Fill routine for rectangles
% Usage: x y w h s a XX PatternFill
%	x,y = lower left corner of box to be filled
%	w,h = width and height of box
%	  a = angle in degrees between lines and x-axis
%	 XX = 0/1 for no/yes cross-hatch
%
/PatternFill {gsave /PFa [ 9 2 roll ] def
  PFa 0 get PFa 2 get 2 div add PFa 1 get PFa 3 get 2 div add translate
  PFa 2 get -2 div PFa 3 get -2 div PFa 2 get PFa 3 get Rec
  TransparentPatterns {} {gsave 1 setgray fill grestore} ifelse
  clip
  currentlinewidth 0.5 mul setlinewidth
  /PFs PFa 2 get dup mul PFa 3 get dup mul add sqrt def
  0 0 M PFa 5 get rotate PFs -2 div dup translate
  0 1 PFs PFa 4 get div 1 add floor cvi
	{PFa 4 get mul 0 M 0 PFs V} for
  0 PFa 6 get ne {
	0 1 PFs PFa 4 get div 1 add floor cvi
	{PFa 4 get mul 0 2 1 roll M PFs 0 V} for
 } if
  stroke grestore} def
%
/languagelevel where
 {pop languagelevel} {1} ifelse
 2 lt
	{/InterpretLevel1 true def}
	{/InterpretLevel1 Level1 def}
 ifelse
%
% PostScript level 2 pattern fill definitions
%
/Level2PatternFill {
/Tile8x8 {/PaintType 2 /PatternType 1 /TilingType 1 /BBox [0 0 8 8] /XStep 8 /YStep 8}
	bind def
/KeepColor {currentrgbcolor [/Pattern /DeviceRGB] setcolorspace} bind def
<< Tile8x8
 /PaintProc {0.5 setlinewidth pop 0 0 M 8 8 L 0 8 M 8 0 L stroke} 
>> matrix makepattern
/Pat1 exch def
<< Tile8x8
 /PaintProc {0.5 setlinewidth pop 0 0 M 8 8 L 0 8 M 8 0 L stroke
	0 4 M 4 8 L 8 4 L 4 0 L 0 4 L stroke}
>> matrix makepattern
/Pat2 exch def
<< Tile8x8
 /PaintProc {0.5 setlinewidth pop 0 0 M 0 8 L
	8 8 L 8 0 L 0 0 L fill}
>> matrix makepattern
/Pat3 exch def
<< Tile8x8
 /PaintProc {0.5 setlinewidth pop -4 8 M 8 -4 L
	0 12 M 12 0 L stroke}
>> matrix makepattern
/Pat4 exch def
<< Tile8x8
 /PaintProc {0.5 setlinewidth pop -4 0 M 8 12 L
	0 -4 M 12 8 L stroke}
>> matrix makepattern
/Pat5 exch def
<< Tile8x8
 /PaintProc {0.5 setlinewidth pop -2 8 M 4 -4 L
	0 12 M 8 -4 L 4 12 M 10 0 L stroke}
>> matrix makepattern
/Pat6 exch def
<< Tile8x8
 /PaintProc {0.5 setlinewidth pop -2 0 M 4 12 L
	0 -4 M 8 12 L 4 -4 M 10 8 L stroke}
>> matrix makepattern
/Pat7 exch def
<< Tile8x8
 /PaintProc {0.5 setlinewidth pop 8 -2 M -4 4 L
	12 0 M -4 8 L 12 4 M 0 10 L stroke}
>> matrix makepattern
/Pat8 exch def
<< Tile8x8
 /PaintProc {0.5 setlinewidth pop 0 -2 M 12 4 L
	-4 0 M 12 8 L -4 4 M 8 10 L stroke}
>> matrix makepattern
/Pat9 exch def
/Pattern1 {PatternBgnd KeepColor Pat1 setpattern} bind def
/Pattern2 {PatternBgnd KeepColor Pat2 setpattern} bind def
/Pattern3 {PatternBgnd KeepColor Pat3 setpattern} bind def
/Pattern4 {PatternBgnd KeepColor Landscape {Pat5} {Pat4} ifelse setpattern} bind def
/Pattern5 {PatternBgnd KeepColor Landscape {Pat4} {Pat5} ifelse setpattern} bind def
/Pattern6 {PatternBgnd KeepColor Landscape {Pat9} {Pat6} ifelse setpattern} bind def
/Pattern7 {PatternBgnd KeepColor Landscape {Pat8} {Pat7} ifelse setpattern} bind def
} def
%
%
%End of PostScript Level 2 code
%
/PatternBgnd {
  TransparentPatterns {} {gsave 1 setgray fill grestore} ifelse
} def
%
% Substitute for Level 2 pattern fill codes with
% grayscale if Level 2 support is not selected.
%
/Level1PatternFill {
/Pattern1 {0.250 Density} bind def
/Pattern2 {0.500 Density} bind def
/Pattern3 {0.750 Density} bind def
/Pattern4 {0.125 Density} bind def
/Pattern5 {0.375 Density} bind def
/Pattern6 {0.625 Density} bind def
/Pattern7 {0.875 Density} bind def
} def
%
% Now test for support of Level 2 code
%
Level1 {Level1PatternFill} {Level2PatternFill} ifelse
%
/Symbol-Oblique /Symbol findfont [1 0 .167 1 0 0] makefont
dup length dict begin {1 index /FID eq {pop pop} {def} ifelse} forall
currentdict end definefont pop
Level1 SuppressPDFMark or 
{} {
/SDict 10 dict def
systemdict /pdfmark known not {
  userdict /pdfmark systemdict /cleartomark get put
} if
SDict begin [
  /Title (steg.tex)
  /Subject (gnuplot plot)
  /Creator (gnuplot 4.6 patchlevel 5)
  /Author (kevin.luedemann)
%  /Producer (gnuplot)
%  /Keywords ()
  /CreationDate (Tue Mar 17 14:59:12 2015)
  /DOCINFO pdfmark
end
} ifelse
end
%%EndProlog
%%Page: 1 1
gnudict begin
gsave
doclip
50 50 translate
0.050 0.050 scale
0 setgray
newpath
1.000 UL
LTb
LCb setrgbcolor
858 440 M
63 0 V
5882 0 R
-63 0 V
stroke
LTb
858 982 M
63 0 V
5882 0 R
-63 0 V
858 1524 M
63 0 V
5882 0 R
-63 0 V
858 2066 M
63 0 V
5882 0 R
-63 0 V
858 2608 M
63 0 V
5882 0 R
-63 0 V
858 3149 M
63 0 V
5882 0 R
-63 0 V
858 3691 M
63 0 V
5882 0 R
-63 0 V
858 4233 M
63 0 V
5882 0 R
-63 0 V
858 4775 M
63 0 V
5882 0 R
-63 0 V
858 440 M
0 63 V
0 4272 R
0 -63 V
1601 440 M
0 63 V
0 4272 R
0 -63 V
2344 440 M
0 63 V
0 4272 R
0 -63 V
3087 440 M
0 63 V
0 4272 R
0 -63 V
3831 440 M
0 63 V
0 4272 R
0 -63 V
4574 440 M
0 63 V
0 4272 R
0 -63 V
5317 440 M
0 63 V
0 4272 R
0 -63 V
6060 440 M
0 63 V
0 4272 R
0 -63 V
6803 440 M
0 63 V
0 4272 R
0 -63 V
stroke
858 4775 N
858 440 L
5945 0 V
0 4335 V
-5945 0 V
Z stroke
1.000 UP
1.000 UL
LTb
1.000 UP
1.000 UL
LT0
LC0 setrgbcolor
LCb setrgbcolor
LT0
LC0 setrgbcolor
2389 455 Pls
2398 455 Pls
2407 455 Pls
2417 455 Pls
2426 455 Pls
2435 455 Pls
2445 455 Pls
2454 455 Pls
2463 455 Pls
2472 455 Pls
2482 455 Pls
2491 455 Pls
2500 455 Pls
2510 460 Pls
2519 460 Pls
2528 460 Pls
2537 460 Pls
2547 460 Pls
2556 460 Pls
2565 460 Pls
2575 466 Pls
2584 466 Pls
2593 466 Pls
2602 466 Pls
2612 466 Pls
2621 466 Pls
2630 471 Pls
2640 466 Pls
2649 466 Pls
2658 466 Pls
2668 466 Pls
2677 466 Pls
2686 466 Pls
2695 466 Pls
2705 466 Pls
2714 466 Pls
2723 460 Pls
2733 466 Pls
2742 460 Pls
2751 460 Pls
2760 460 Pls
2770 460 Pls
2779 460 Pls
2788 455 Pls
2798 455 Pls
2807 455 Pls
2816 455 Pls
2825 455 Pls
2835 455 Pls
2844 455 Pls
2853 455 Pls
2863 455 Pls
2872 455 Pls
2881 460 Pls
2890 460 Pls
2900 460 Pls
2909 460 Pls
2918 460 Pls
2928 466 Pls
2937 466 Pls
2946 471 Pls
2955 471 Pls
2965 477 Pls
2974 477 Pls
2983 482 Pls
2993 482 Pls
3002 488 Pls
3011 499 Pls
3020 510 Pls
3030 532 Pls
3039 538 Pls
3048 543 Pls
3058 554 Pls
3067 576 Pls
3076 609 Pls
3086 643 Pls
3095 665 Pls
3104 681 Pls
3113 698 Pls
3123 742 Pls
3132 825 Pls
3141 924 Pls
3151 1051 Pls
3160 1167 Pls
3169 1272 Pls
3178 1399 Pls
3188 1576 Pls
3197 1714 Pls
3206 1841 Pls
3216 1891 Pls
3225 1880 Pls
3234 1880 Pls
3243 1940 Pls
3253 2189 Pls
3262 2548 Pls
3271 2885 Pls
3281 3349 Pls
3290 3912 Pls
3299 4160 Pls
3308 4426 Pls
3318 4531 Pls
3327 4464 Pls
3336 4321 Pls
3346 4116 Pls
3355 4000 Pls
3364 3906 Pls
3373 3840 Pls
3383 3829 Pls
3392 3851 Pls
3401 3879 Pls
3411 3923 Pls
3420 3940 Pls
3429 3940 Pls
3439 3851 Pls
3448 3829 Pls
3457 3387 Pls
3466 3144 Pls
3476 2885 Pls
3485 2653 Pls
3494 2277 Pls
3504 1974 Pls
3513 1813 Pls
3522 1670 Pls
3531 1587 Pls
3541 1576 Pls
3550 1604 Pls
3559 1664 Pls
3569 1708 Pls
3578 1719 Pls
3587 1631 Pls
3596 1581 Pls
3606 1388 Pls
3615 1189 Pls
3624 1018 Pls
3634 836 Pls
3643 714 Pls
3652 643 Pls
3661 643 Pls
3671 670 Pls
3680 692 Pls
3689 698 Pls
3699 676 Pls
3708 643 Pls
3717 598 Pls
3726 565 Pls
3736 560 Pls
3745 565 Pls
3754 565 Pls
3764 549 Pls
3773 532 Pls
3782 521 Pls
3791 516 Pls
3801 510 Pls
3810 510 Pls
3819 499 Pls
3829 493 Pls
3838 488 Pls
3847 482 Pls
3857 477 Pls
3866 471 Pls
3875 471 Pls
3884 466 Pls
3894 466 Pls
3903 460 Pls
3912 455 Pls
3922 455 Pls
3931 455 Pls
6243 4602 Pls
1.000 UP
1.000 UL
LT0
3940 458 Pls
3949 457 Pls
3959 456 Pls
3968 455 Pls
3977 454 Pls
3987 453 Pls
3996 453 Pls
4005 454 Pls
4014 454 Pls
4024 455 Pls
4033 458 Pls
4042 457 Pls
4052 458 Pls
4061 459 Pls
4070 461 Pls
4079 462 Pls
4089 462 Pls
4098 462 Pls
4107 461 Pls
4117 462 Pls
4126 463 Pls
4135 465 Pls
4144 467 Pls
4154 467 Pls
4163 468 Pls
4172 467 Pls
4182 467 Pls
4191 468 Pls
4200 468 Pls
4209 468 Pls
4219 467 Pls
4228 467 Pls
4237 467 Pls
4247 467 Pls
4256 467 Pls
4265 466 Pls
4275 464 Pls
4284 463 Pls
4293 463 Pls
4302 462 Pls
4312 462 Pls
4321 462 Pls
4330 460 Pls
4340 461 Pls
4349 462 Pls
4358 462 Pls
4367 461 Pls
4377 461 Pls
4386 461 Pls
4395 458 Pls
4405 458 Pls
4414 456 Pls
4423 457 Pls
4432 456 Pls
4442 456 Pls
4451 456 Pls
4460 455 Pls
4470 453 Pls
1.000 UP
1.000 UL
LT0
3884 464 Pls
3894 461 Pls
3903 459 Pls
3912 456 Pls
3922 454 Pls
3931 452 Pls
3940 451 Pls
3949 451 Pls
3959 450 Pls
3968 449 Pls
3977 448 Pls
3987 447 Pls
3996 447 Pls
4005 447 Pls
4014 447 Pls
4024 447 Pls
4033 448 Pls
4042 449 Pls
4052 449 Pls
4061 449 Pls
4070 450 Pls
4079 452 Pls
4089 453 Pls
4098 453 Pls
4107 453 Pls
4117 454 Pls
4126 454 Pls
4135 455 Pls
4144 456 Pls
4154 457 Pls
4163 457 Pls
4172 457 Pls
4182 457 Pls
4191 457 Pls
4200 458 Pls
4209 458 Pls
4219 458 Pls
4228 458 Pls
4237 457 Pls
4247 457 Pls
4256 457 Pls
4265 457 Pls
4275 456 Pls
4284 456 Pls
4293 455 Pls
4302 455 Pls
4312 454 Pls
4321 453 Pls
4330 453 Pls
4340 452 Pls
4349 451 Pls
4358 450 Pls
4367 450 Pls
4377 449 Pls
4386 448 Pls
4395 447 Pls
4405 447 Pls
4414 446 Pls
4423 446 Pls
4432 445 Pls
4442 445 Pls
4451 444 Pls
4460 444 Pls
4470 443 Pls
4479 443 Pls
4488 443 Pls
4497 443 Pls
4507 442 Pls
4516 442 Pls
4525 442 Pls
4535 442 Pls
4544 442 Pls
4553 442 Pls
4562 443 Pls
4572 443 Pls
4581 443 Pls
4590 443 Pls
4600 443 Pls
4609 443 Pls
4618 444 Pls
4628 444 Pls
4637 444 Pls
4646 444 Pls
4655 445 Pls
4665 445 Pls
4674 445 Pls
4683 445 Pls
4693 446 Pls
4702 446 Pls
4711 446 Pls
4720 446 Pls
4730 446 Pls
4739 446 Pls
4748 446 Pls
4758 446 Pls
4767 446 Pls
4776 446 Pls
4785 446 Pls
4795 446 Pls
4804 446 Pls
4813 446 Pls
4823 446 Pls
4832 446 Pls
4841 445 Pls
4850 445 Pls
4860 445 Pls
4869 445 Pls
4878 445 Pls
4888 444 Pls
4897 444 Pls
4906 444 Pls
4915 444 Pls
4925 444 Pls
4934 443 Pls
4943 443 Pls
4953 443 Pls
4962 443 Pls
4971 442 Pls
4980 442 Pls
4990 442 Pls
4999 442 Pls
5008 442 Pls
5018 442 Pls
5027 442 Pls
5036 441 Pls
5046 441 Pls
5055 441 Pls
5064 441 Pls
5073 441 Pls
5083 441 Pls
5092 441 Pls
5101 441 Pls
5111 442 Pls
5120 441 Pls
5129 441 Pls
5138 442 Pls
5148 442 Pls
5157 442 Pls
5166 442 Pls
5176 442 Pls
5185 442 Pls
5194 442 Pls
5203 442 Pls
5213 442 Pls
5222 442 Pls
5231 443 Pls
5241 442 Pls
5250 443 Pls
5259 443 Pls
5268 443 Pls
5278 443 Pls
5287 443 Pls
5296 443 Pls
5306 443 Pls
5315 443 Pls
5324 443 Pls
5333 443 Pls
5343 443 Pls
5352 443 Pls
5361 443 Pls
5371 443 Pls
5380 443 Pls
5389 443 Pls
5398 443 Pls
5408 442 Pls
5417 442 Pls
5426 442 Pls
5436 442 Pls
5445 442 Pls
5454 442 Pls
5464 442 Pls
5473 442 Pls
5482 442 Pls
5491 442 Pls
5501 441 Pls
5510 441 Pls
5519 441 Pls
5529 441 Pls
5538 441 Pls
5547 441 Pls
5556 441 Pls
5566 441 Pls
5575 441 Pls
5584 441 Pls
5594 441 Pls
5603 441 Pls
5612 441 Pls
5621 441 Pls
5631 441 Pls
5640 441 Pls
5649 441 Pls
5659 441 Pls
5668 441 Pls
5677 441 Pls
5686 441 Pls
5696 441 Pls
5705 441 Pls
5714 441 Pls
5724 441 Pls
5733 441 Pls
5742 441 Pls
5751 441 Pls
5761 442 Pls
5770 441 Pls
5779 442 Pls
5789 442 Pls
5798 442 Pls
5807 442 Pls
5817 442 Pls
5826 442 Pls
5835 442 Pls
5844 442 Pls
5854 442 Pls
5863 442 Pls
5872 442 Pls
5882 442 Pls
5891 442 Pls
5900 442 Pls
5909 442 Pls
5919 442 Pls
5928 442 Pls
5937 442 Pls
5947 442 Pls
5956 442 Pls
5965 442 Pls
5974 442 Pls
5984 441 Pls
5993 441 Pls
6002 441 Pls
6012 441 Pls
6021 441 Pls
6030 441 Pls
6039 441 Pls
6049 441 Pls
6058 441 Pls
6067 441 Pls
6077 441 Pls
6086 441 Pls
6095 441 Pls
6104 441 Pls
6114 441 Pls
6123 441 Pls
6132 441 Pls
6142 441 Pls
6151 441 Pls
6160 441 Pls
6169 441 Pls
6179 441 Pls
6188 441 Pls
6197 441 Pls
6207 441 Pls
6216 441 Pls
6225 441 Pls
6235 441 Pls
6244 441 Pls
6253 441 Pls
6262 441 Pls
6272 441 Pls
1.000 UP
1.000 UL
LT0
930 441 Pls
940 441 Pls
949 441 Pls
958 441 Pls
968 441 Pls
977 442 Pls
986 442 Pls
995 442 Pls
1005 442 Pls
1014 442 Pls
1023 442 Pls
1033 442 Pls
1042 442 Pls
1051 442 Pls
1061 442 Pls
1070 441 Pls
1079 441 Pls
1088 441 Pls
1098 441 Pls
1107 441 Pls
1116 441 Pls
1126 441 Pls
1135 441 Pls
1144 441 Pls
1153 441 Pls
1163 441 Pls
1172 441 Pls
1181 441 Pls
1191 441 Pls
1200 441 Pls
1209 441 Pls
1218 441 Pls
1228 441 Pls
1237 441 Pls
1246 441 Pls
1256 441 Pls
1265 441 Pls
1274 441 Pls
1283 441 Pls
1293 441 Pls
1302 441 Pls
1311 441 Pls
1321 441 Pls
1330 441 Pls
1339 441 Pls
1348 441 Pls
1358 441 Pls
1367 441 Pls
1376 441 Pls
1386 441 Pls
1395 442 Pls
1404 442 Pls
1413 442 Pls
1423 442 Pls
1432 442 Pls
1441 442 Pls
1451 442 Pls
1460 442 Pls
1469 442 Pls
1479 442 Pls
1488 442 Pls
1497 442 Pls
1506 443 Pls
1516 443 Pls
1525 443 Pls
1534 443 Pls
1544 443 Pls
1553 443 Pls
1562 443 Pls
1571 443 Pls
1581 443 Pls
1590 443 Pls
1599 443 Pls
1609 443 Pls
1618 443 Pls
1627 442 Pls
1636 442 Pls
1646 442 Pls
1655 442 Pls
1664 442 Pls
1674 442 Pls
1683 442 Pls
1692 442 Pls
1701 442 Pls
1711 442 Pls
1720 442 Pls
1729 442 Pls
1739 441 Pls
1748 441 Pls
1757 441 Pls
1766 441 Pls
1776 441 Pls
1785 441 Pls
1794 441 Pls
1804 441 Pls
1813 441 Pls
1822 441 Pls
1831 441 Pls
1841 441 Pls
1850 441 Pls
1859 441 Pls
1869 442 Pls
1878 442 Pls
1887 442 Pls
1897 442 Pls
1906 442 Pls
1915 442 Pls
1924 442 Pls
1934 443 Pls
1943 443 Pls
1952 443 Pls
1962 443 Pls
1971 443 Pls
1980 444 Pls
1989 444 Pls
1999 444 Pls
2008 444 Pls
2017 444 Pls
2027 445 Pls
2036 445 Pls
2045 445 Pls
2054 445 Pls
2064 445 Pls
2073 445 Pls
2082 445 Pls
2092 445 Pls
2101 446 Pls
2110 446 Pls
2119 445 Pls
2129 445 Pls
2138 445 Pls
2147 445 Pls
2157 445 Pls
2166 445 Pls
2175 445 Pls
2184 445 Pls
2194 445 Pls
2203 444 Pls
2212 444 Pls
2222 444 Pls
2231 444 Pls
2240 444 Pls
2250 443 Pls
2259 443 Pls
2268 443 Pls
2277 443 Pls
2287 443 Pls
2296 443 Pls
2305 442 Pls
2315 442 Pls
2324 442 Pls
2333 442 Pls
2342 442 Pls
2352 442 Pls
2361 442 Pls
2370 442 Pls
2380 443 Pls
2389 443 Pls
2398 443 Pls
2407 443 Pls
2417 444 Pls
2426 444 Pls
2435 445 Pls
2445 445 Pls
2454 446 Pls
2463 446 Pls
2472 447 Pls
2482 447 Pls
2491 448 Pls
2500 449 Pls
2510 449 Pls
2519 450 Pls
2528 450 Pls
2537 451 Pls
2547 452 Pls
2556 452 Pls
2565 453 Pls
2575 453 Pls
2584 454 Pls
2593 455 Pls
2602 455 Pls
2612 455 Pls
2621 455 Pls
2630 456 Pls
2640 456 Pls
2649 456 Pls
2658 456 Pls
2668 456 Pls
2677 456 Pls
2686 456 Pls
2695 456 Pls
2705 456 Pls
2714 455 Pls
2723 455 Pls
2733 454 Pls
2742 453 Pls
2751 453 Pls
2760 453 Pls
2770 452 Pls
2779 452 Pls
2788 452 Pls
2798 451 Pls
2807 450 Pls
2816 450 Pls
2825 449 Pls
2835 450 Pls
2844 449 Pls
2853 448 Pls
2863 448 Pls
2872 448 Pls
2881 449 Pls
2890 449 Pls
2900 450 Pls
2909 450 Pls
2918 452 Pls
2928 453 Pls
2937 455 Pls
2946 457 Pls
2955 458 Pls
1.000 UP
1.000 UL
LT0
2970 460 Pls
2985 471 Pls
3000 471 Pls
3015 482 Pls
3030 510 Pls
3045 532 Pls
3060 538 Pls
3074 554 Pls
3089 598 Pls
3104 654 Pls
3119 676 Pls
3134 709 Pls
3149 880 Pls
3164 1101 Pls
3178 1300 Pls
3193 1526 Pls
3208 1775 Pls
3223 1929 Pls
3238 1918 Pls
3253 1907 Pls
3268 2106 Pls
3282 2719 Pls
3297 3625 Pls
3312 4337 Pls
3327 4586 Pls
3342 4481 Pls
3357 4221 Pls
3372 3989 Pls
3386 3868 Pls
3401 3846 Pls
3416 3912 Pls
3431 3989 Pls
3446 3956 Pls
3461 3702 Pls
3476 3304 Pls
3491 2830 Pls
3505 2305 Pls
3520 1891 Pls
3535 1648 Pls
3550 1521 Pls
3565 1554 Pls
3580 1642 Pls
3595 1670 Pls
3609 1515 Pls
3624 1228 Pls
3639 935 Pls
3654 692 Pls
3669 609 Pls
3684 643 Pls
3699 687 Pls
3713 670 Pls
3728 593 Pls
3743 554 Pls
3758 560 Pls
3773 543 Pls
3788 516 Pls
3803 504 Pls
3817 504 Pls
3832 493 Pls
3847 488 Pls
3862 471 Pls
3877 466 Pls
3892 460 Pls
1.000 UL
LTb
LCb setrgbcolor
858 4775 N
858 440 L
5945 0 V
0 4335 V
-5945 0 V
Z stroke
1.000 UP
1.000 UL
LTb
stroke
grestore
end
showpage
%%Trailer
