,Diffusion,Kevin Lüdemann und Michael Lohmann,30.06.14
Zeit [min],Zeit [s],Höhe [1/100 mm],
0,0,761,
0.5,0.5,,
1,1,771,
1.5,1 1/2,777,
2,120,782,
2.5,150,785,
3,180,790,
3.5,210,793,
4,240,796,
4.5,270,798,
5,300,802,
5.5,330,805,
6,360,807,
6.5,390,810,
7,420,813,
7.5,450,814,
8,480,817,
8.5,510,821,
9,540,824,
9.5,570,826,
10,600,830,
10.5,630,832,
11,660,835,
11.5,690,837,
12,720,840,
12.5,750,843,
13,780,845,
13.5,810,849,
14,840,851,
14.5,870,860,
15,900,863,
15.5,930,865,
16,960,867,
16.5,990,869,
17,1020,870,
17.5,1050,873,
18,1080,876,
18.5,1110,878,
19,1140,880,
19.5,1170,882,
20,1200,885,
20.5,1230,887,
21,1260,889,
21.5,1290,891,
22,1320,893,
22.5,1350,896,
23,1380,898,
23.5,1410,900,
24,1440,902,
24.5,1470,904,
25,1500,905,
25.5,1530,908,
26,1560,910,
26.5,1590,912,
27,1620,914,
27.5,1650,917,
28,1680,919,
28.5,1710,921,
29,1740,921,
29.5,1770,925,
30,1800,926,
30.5,1830,928,
31,1860,930,
