%!PS-Adobe-2.0 EPSF-2.0
%%Title: zeitplot1.tex
%%Creator: gnuplot 4.6 patchlevel 1
%%CreationDate: Wed Jul  9 11:32:47 2014
%%DocumentFonts: 
%%BoundingBox: 50 50 410 302
%%EndComments
%%BeginProlog
/gnudict 256 dict def
gnudict begin
%
% The following true/false flags may be edited by hand if desired.
% The unit line width and grayscale image gamma correction may also be changed.
%
/Color true def
/Blacktext true def
/Solid false def
/Dashlength 1 def
/Landscape false def
/Level1 false def
/Rounded false def
/ClipToBoundingBox false def
/SuppressPDFMark false def
/TransparentPatterns false def
/gnulinewidth 5.000 def
/userlinewidth gnulinewidth def
/Gamma 1.0 def
/BackgroundColor {-1.000 -1.000 -1.000} def
%
/vshift -73 def
/dl1 {
  10.0 Dashlength mul mul
  Rounded { currentlinewidth 0.75 mul sub dup 0 le { pop 0.01 } if } if
} def
/dl2 {
  10.0 Dashlength mul mul
  Rounded { currentlinewidth 0.75 mul add } if
} def
/hpt_ 31.5 def
/vpt_ 31.5 def
/hpt hpt_ def
/vpt vpt_ def
/doclip {
  ClipToBoundingBox {
    newpath 50 50 moveto 410 50 lineto 410 302 lineto 50 302 lineto closepath
    clip
  } if
} def
%
% Gnuplot Prolog Version 4.6 (September 2012)
%
%/SuppressPDFMark true def
%
/M {moveto} bind def
/L {lineto} bind def
/R {rmoveto} bind def
/V {rlineto} bind def
/N {newpath moveto} bind def
/Z {closepath} bind def
/C {setrgbcolor} bind def
/f {rlineto fill} bind def
/g {setgray} bind def
/Gshow {show} def   % May be redefined later in the file to support UTF-8
/vpt2 vpt 2 mul def
/hpt2 hpt 2 mul def
/Lshow {currentpoint stroke M 0 vshift R 
	Blacktext {gsave 0 setgray show grestore} {show} ifelse} def
/Rshow {currentpoint stroke M dup stringwidth pop neg vshift R
	Blacktext {gsave 0 setgray show grestore} {show} ifelse} def
/Cshow {currentpoint stroke M dup stringwidth pop -2 div vshift R 
	Blacktext {gsave 0 setgray show grestore} {show} ifelse} def
/UP {dup vpt_ mul /vpt exch def hpt_ mul /hpt exch def
  /hpt2 hpt 2 mul def /vpt2 vpt 2 mul def} def
/DL {Color {setrgbcolor Solid {pop []} if 0 setdash}
 {pop pop pop 0 setgray Solid {pop []} if 0 setdash} ifelse} def
/BL {stroke userlinewidth 2 mul setlinewidth
	Rounded {1 setlinejoin 1 setlinecap} if} def
/AL {stroke userlinewidth 2 div setlinewidth
	Rounded {1 setlinejoin 1 setlinecap} if} def
/UL {dup gnulinewidth mul /userlinewidth exch def
	dup 1 lt {pop 1} if 10 mul /udl exch def} def
/PL {stroke userlinewidth setlinewidth
	Rounded {1 setlinejoin 1 setlinecap} if} def
3.8 setmiterlimit
% Default Line colors
/LCw {1 1 1} def
/LCb {0 0 0} def
/LCa {0 0 0} def
/LC0 {1 0 0} def
/LC1 {0 1 0} def
/LC2 {0 0 1} def
/LC3 {1 0 1} def
/LC4 {0 1 1} def
/LC5 {1 1 0} def
/LC6 {0 0 0} def
/LC7 {1 0.3 0} def
/LC8 {0.5 0.5 0.5} def
% Default Line Types
/LTw {PL [] 1 setgray} def
/LTb {BL [] LCb DL} def
/LTa {AL [1 udl mul 2 udl mul] 0 setdash LCa setrgbcolor} def
/LT0 {PL [] LC0 DL} def
/LT1 {PL [4 dl1 2 dl2] LC1 DL} def
/LT2 {PL [2 dl1 3 dl2] LC2 DL} def
/LT3 {PL [1 dl1 1.5 dl2] LC3 DL} def
/LT4 {PL [6 dl1 2 dl2 1 dl1 2 dl2] LC4 DL} def
/LT5 {PL [3 dl1 3 dl2 1 dl1 3 dl2] LC5 DL} def
/LT6 {PL [2 dl1 2 dl2 2 dl1 6 dl2] LC6 DL} def
/LT7 {PL [1 dl1 2 dl2 6 dl1 2 dl2 1 dl1 2 dl2] LC7 DL} def
/LT8 {PL [2 dl1 2 dl2 2 dl1 2 dl2 2 dl1 2 dl2 2 dl1 4 dl2] LC8 DL} def
/Pnt {stroke [] 0 setdash gsave 1 setlinecap M 0 0 V stroke grestore} def
/Dia {stroke [] 0 setdash 2 copy vpt add M
  hpt neg vpt neg V hpt vpt neg V
  hpt vpt V hpt neg vpt V closepath stroke
  Pnt} def
/Pls {stroke [] 0 setdash vpt sub M 0 vpt2 V
  currentpoint stroke M
  hpt neg vpt neg R hpt2 0 V stroke
 } def
/Box {stroke [] 0 setdash 2 copy exch hpt sub exch vpt add M
  0 vpt2 neg V hpt2 0 V 0 vpt2 V
  hpt2 neg 0 V closepath stroke
  Pnt} def
/Crs {stroke [] 0 setdash exch hpt sub exch vpt add M
  hpt2 vpt2 neg V currentpoint stroke M
  hpt2 neg 0 R hpt2 vpt2 V stroke} def
/TriU {stroke [] 0 setdash 2 copy vpt 1.12 mul add M
  hpt neg vpt -1.62 mul V
  hpt 2 mul 0 V
  hpt neg vpt 1.62 mul V closepath stroke
  Pnt} def
/Star {2 copy Pls Crs} def
/BoxF {stroke [] 0 setdash exch hpt sub exch vpt add M
  0 vpt2 neg V hpt2 0 V 0 vpt2 V
  hpt2 neg 0 V closepath fill} def
/TriUF {stroke [] 0 setdash vpt 1.12 mul add M
  hpt neg vpt -1.62 mul V
  hpt 2 mul 0 V
  hpt neg vpt 1.62 mul V closepath fill} def
/TriD {stroke [] 0 setdash 2 copy vpt 1.12 mul sub M
  hpt neg vpt 1.62 mul V
  hpt 2 mul 0 V
  hpt neg vpt -1.62 mul V closepath stroke
  Pnt} def
/TriDF {stroke [] 0 setdash vpt 1.12 mul sub M
  hpt neg vpt 1.62 mul V
  hpt 2 mul 0 V
  hpt neg vpt -1.62 mul V closepath fill} def
/DiaF {stroke [] 0 setdash vpt add M
  hpt neg vpt neg V hpt vpt neg V
  hpt vpt V hpt neg vpt V closepath fill} def
/Pent {stroke [] 0 setdash 2 copy gsave
  translate 0 hpt M 4 {72 rotate 0 hpt L} repeat
  closepath stroke grestore Pnt} def
/PentF {stroke [] 0 setdash gsave
  translate 0 hpt M 4 {72 rotate 0 hpt L} repeat
  closepath fill grestore} def
/Circle {stroke [] 0 setdash 2 copy
  hpt 0 360 arc stroke Pnt} def
/CircleF {stroke [] 0 setdash hpt 0 360 arc fill} def
/C0 {BL [] 0 setdash 2 copy moveto vpt 90 450 arc} bind def
/C1 {BL [] 0 setdash 2 copy moveto
	2 copy vpt 0 90 arc closepath fill
	vpt 0 360 arc closepath} bind def
/C2 {BL [] 0 setdash 2 copy moveto
	2 copy vpt 90 180 arc closepath fill
	vpt 0 360 arc closepath} bind def
/C3 {BL [] 0 setdash 2 copy moveto
	2 copy vpt 0 180 arc closepath fill
	vpt 0 360 arc closepath} bind def
/C4 {BL [] 0 setdash 2 copy moveto
	2 copy vpt 180 270 arc closepath fill
	vpt 0 360 arc closepath} bind def
/C5 {BL [] 0 setdash 2 copy moveto
	2 copy vpt 0 90 arc
	2 copy moveto
	2 copy vpt 180 270 arc closepath fill
	vpt 0 360 arc} bind def
/C6 {BL [] 0 setdash 2 copy moveto
	2 copy vpt 90 270 arc closepath fill
	vpt 0 360 arc closepath} bind def
/C7 {BL [] 0 setdash 2 copy moveto
	2 copy vpt 0 270 arc closepath fill
	vpt 0 360 arc closepath} bind def
/C8 {BL [] 0 setdash 2 copy moveto
	2 copy vpt 270 360 arc closepath fill
	vpt 0 360 arc closepath} bind def
/C9 {BL [] 0 setdash 2 copy moveto
	2 copy vpt 270 450 arc closepath fill
	vpt 0 360 arc closepath} bind def
/C10 {BL [] 0 setdash 2 copy 2 copy moveto vpt 270 360 arc closepath fill
	2 copy moveto
	2 copy vpt 90 180 arc closepath fill
	vpt 0 360 arc closepath} bind def
/C11 {BL [] 0 setdash 2 copy moveto
	2 copy vpt 0 180 arc closepath fill
	2 copy moveto
	2 copy vpt 270 360 arc closepath fill
	vpt 0 360 arc closepath} bind def
/C12 {BL [] 0 setdash 2 copy moveto
	2 copy vpt 180 360 arc closepath fill
	vpt 0 360 arc closepath} bind def
/C13 {BL [] 0 setdash 2 copy moveto
	2 copy vpt 0 90 arc closepath fill
	2 copy moveto
	2 copy vpt 180 360 arc closepath fill
	vpt 0 360 arc closepath} bind def
/C14 {BL [] 0 setdash 2 copy moveto
	2 copy vpt 90 360 arc closepath fill
	vpt 0 360 arc} bind def
/C15 {BL [] 0 setdash 2 copy vpt 0 360 arc closepath fill
	vpt 0 360 arc closepath} bind def
/Rec {newpath 4 2 roll moveto 1 index 0 rlineto 0 exch rlineto
	neg 0 rlineto closepath} bind def
/Square {dup Rec} bind def
/Bsquare {vpt sub exch vpt sub exch vpt2 Square} bind def
/S0 {BL [] 0 setdash 2 copy moveto 0 vpt rlineto BL Bsquare} bind def
/S1 {BL [] 0 setdash 2 copy vpt Square fill Bsquare} bind def
/S2 {BL [] 0 setdash 2 copy exch vpt sub exch vpt Square fill Bsquare} bind def
/S3 {BL [] 0 setdash 2 copy exch vpt sub exch vpt2 vpt Rec fill Bsquare} bind def
/S4 {BL [] 0 setdash 2 copy exch vpt sub exch vpt sub vpt Square fill Bsquare} bind def
/S5 {BL [] 0 setdash 2 copy 2 copy vpt Square fill
	exch vpt sub exch vpt sub vpt Square fill Bsquare} bind def
/S6 {BL [] 0 setdash 2 copy exch vpt sub exch vpt sub vpt vpt2 Rec fill Bsquare} bind def
/S7 {BL [] 0 setdash 2 copy exch vpt sub exch vpt sub vpt vpt2 Rec fill
	2 copy vpt Square fill Bsquare} bind def
/S8 {BL [] 0 setdash 2 copy vpt sub vpt Square fill Bsquare} bind def
/S9 {BL [] 0 setdash 2 copy vpt sub vpt vpt2 Rec fill Bsquare} bind def
/S10 {BL [] 0 setdash 2 copy vpt sub vpt Square fill 2 copy exch vpt sub exch vpt Square fill
	Bsquare} bind def
/S11 {BL [] 0 setdash 2 copy vpt sub vpt Square fill 2 copy exch vpt sub exch vpt2 vpt Rec fill
	Bsquare} bind def
/S12 {BL [] 0 setdash 2 copy exch vpt sub exch vpt sub vpt2 vpt Rec fill Bsquare} bind def
/S13 {BL [] 0 setdash 2 copy exch vpt sub exch vpt sub vpt2 vpt Rec fill
	2 copy vpt Square fill Bsquare} bind def
/S14 {BL [] 0 setdash 2 copy exch vpt sub exch vpt sub vpt2 vpt Rec fill
	2 copy exch vpt sub exch vpt Square fill Bsquare} bind def
/S15 {BL [] 0 setdash 2 copy Bsquare fill Bsquare} bind def
/D0 {gsave translate 45 rotate 0 0 S0 stroke grestore} bind def
/D1 {gsave translate 45 rotate 0 0 S1 stroke grestore} bind def
/D2 {gsave translate 45 rotate 0 0 S2 stroke grestore} bind def
/D3 {gsave translate 45 rotate 0 0 S3 stroke grestore} bind def
/D4 {gsave translate 45 rotate 0 0 S4 stroke grestore} bind def
/D5 {gsave translate 45 rotate 0 0 S5 stroke grestore} bind def
/D6 {gsave translate 45 rotate 0 0 S6 stroke grestore} bind def
/D7 {gsave translate 45 rotate 0 0 S7 stroke grestore} bind def
/D8 {gsave translate 45 rotate 0 0 S8 stroke grestore} bind def
/D9 {gsave translate 45 rotate 0 0 S9 stroke grestore} bind def
/D10 {gsave translate 45 rotate 0 0 S10 stroke grestore} bind def
/D11 {gsave translate 45 rotate 0 0 S11 stroke grestore} bind def
/D12 {gsave translate 45 rotate 0 0 S12 stroke grestore} bind def
/D13 {gsave translate 45 rotate 0 0 S13 stroke grestore} bind def
/D14 {gsave translate 45 rotate 0 0 S14 stroke grestore} bind def
/D15 {gsave translate 45 rotate 0 0 S15 stroke grestore} bind def
/DiaE {stroke [] 0 setdash vpt add M
  hpt neg vpt neg V hpt vpt neg V
  hpt vpt V hpt neg vpt V closepath stroke} def
/BoxE {stroke [] 0 setdash exch hpt sub exch vpt add M
  0 vpt2 neg V hpt2 0 V 0 vpt2 V
  hpt2 neg 0 V closepath stroke} def
/TriUE {stroke [] 0 setdash vpt 1.12 mul add M
  hpt neg vpt -1.62 mul V
  hpt 2 mul 0 V
  hpt neg vpt 1.62 mul V closepath stroke} def
/TriDE {stroke [] 0 setdash vpt 1.12 mul sub M
  hpt neg vpt 1.62 mul V
  hpt 2 mul 0 V
  hpt neg vpt -1.62 mul V closepath stroke} def
/PentE {stroke [] 0 setdash gsave
  translate 0 hpt M 4 {72 rotate 0 hpt L} repeat
  closepath stroke grestore} def
/CircE {stroke [] 0 setdash 
  hpt 0 360 arc stroke} def
/Opaque {gsave closepath 1 setgray fill grestore 0 setgray closepath} def
/DiaW {stroke [] 0 setdash vpt add M
  hpt neg vpt neg V hpt vpt neg V
  hpt vpt V hpt neg vpt V Opaque stroke} def
/BoxW {stroke [] 0 setdash exch hpt sub exch vpt add M
  0 vpt2 neg V hpt2 0 V 0 vpt2 V
  hpt2 neg 0 V Opaque stroke} def
/TriUW {stroke [] 0 setdash vpt 1.12 mul add M
  hpt neg vpt -1.62 mul V
  hpt 2 mul 0 V
  hpt neg vpt 1.62 mul V Opaque stroke} def
/TriDW {stroke [] 0 setdash vpt 1.12 mul sub M
  hpt neg vpt 1.62 mul V
  hpt 2 mul 0 V
  hpt neg vpt -1.62 mul V Opaque stroke} def
/PentW {stroke [] 0 setdash gsave
  translate 0 hpt M 4 {72 rotate 0 hpt L} repeat
  Opaque stroke grestore} def
/CircW {stroke [] 0 setdash 
  hpt 0 360 arc Opaque stroke} def
/BoxFill {gsave Rec 1 setgray fill grestore} def
/Density {
  /Fillden exch def
  currentrgbcolor
  /ColB exch def /ColG exch def /ColR exch def
  /ColR ColR Fillden mul Fillden sub 1 add def
  /ColG ColG Fillden mul Fillden sub 1 add def
  /ColB ColB Fillden mul Fillden sub 1 add def
  ColR ColG ColB setrgbcolor} def
/BoxColFill {gsave Rec PolyFill} def
/PolyFill {gsave Density fill grestore grestore} def
/h {rlineto rlineto rlineto gsave closepath fill grestore} bind def
%
% PostScript Level 1 Pattern Fill routine for rectangles
% Usage: x y w h s a XX PatternFill
%	x,y = lower left corner of box to be filled
%	w,h = width and height of box
%	  a = angle in degrees between lines and x-axis
%	 XX = 0/1 for no/yes cross-hatch
%
/PatternFill {gsave /PFa [ 9 2 roll ] def
  PFa 0 get PFa 2 get 2 div add PFa 1 get PFa 3 get 2 div add translate
  PFa 2 get -2 div PFa 3 get -2 div PFa 2 get PFa 3 get Rec
  TransparentPatterns {} {gsave 1 setgray fill grestore} ifelse
  clip
  currentlinewidth 0.5 mul setlinewidth
  /PFs PFa 2 get dup mul PFa 3 get dup mul add sqrt def
  0 0 M PFa 5 get rotate PFs -2 div dup translate
  0 1 PFs PFa 4 get div 1 add floor cvi
	{PFa 4 get mul 0 M 0 PFs V} for
  0 PFa 6 get ne {
	0 1 PFs PFa 4 get div 1 add floor cvi
	{PFa 4 get mul 0 2 1 roll M PFs 0 V} for
 } if
  stroke grestore} def
%
/languagelevel where
 {pop languagelevel} {1} ifelse
 2 lt
	{/InterpretLevel1 true def}
	{/InterpretLevel1 Level1 def}
 ifelse
%
% PostScript level 2 pattern fill definitions
%
/Level2PatternFill {
/Tile8x8 {/PaintType 2 /PatternType 1 /TilingType 1 /BBox [0 0 8 8] /XStep 8 /YStep 8}
	bind def
/KeepColor {currentrgbcolor [/Pattern /DeviceRGB] setcolorspace} bind def
<< Tile8x8
 /PaintProc {0.5 setlinewidth pop 0 0 M 8 8 L 0 8 M 8 0 L stroke} 
>> matrix makepattern
/Pat1 exch def
<< Tile8x8
 /PaintProc {0.5 setlinewidth pop 0 0 M 8 8 L 0 8 M 8 0 L stroke
	0 4 M 4 8 L 8 4 L 4 0 L 0 4 L stroke}
>> matrix makepattern
/Pat2 exch def
<< Tile8x8
 /PaintProc {0.5 setlinewidth pop 0 0 M 0 8 L
	8 8 L 8 0 L 0 0 L fill}
>> matrix makepattern
/Pat3 exch def
<< Tile8x8
 /PaintProc {0.5 setlinewidth pop -4 8 M 8 -4 L
	0 12 M 12 0 L stroke}
>> matrix makepattern
/Pat4 exch def
<< Tile8x8
 /PaintProc {0.5 setlinewidth pop -4 0 M 8 12 L
	0 -4 M 12 8 L stroke}
>> matrix makepattern
/Pat5 exch def
<< Tile8x8
 /PaintProc {0.5 setlinewidth pop -2 8 M 4 -4 L
	0 12 M 8 -4 L 4 12 M 10 0 L stroke}
>> matrix makepattern
/Pat6 exch def
<< Tile8x8
 /PaintProc {0.5 setlinewidth pop -2 0 M 4 12 L
	0 -4 M 8 12 L 4 -4 M 10 8 L stroke}
>> matrix makepattern
/Pat7 exch def
<< Tile8x8
 /PaintProc {0.5 setlinewidth pop 8 -2 M -4 4 L
	12 0 M -4 8 L 12 4 M 0 10 L stroke}
>> matrix makepattern
/Pat8 exch def
<< Tile8x8
 /PaintProc {0.5 setlinewidth pop 0 -2 M 12 4 L
	-4 0 M 12 8 L -4 4 M 8 10 L stroke}
>> matrix makepattern
/Pat9 exch def
/Pattern1 {PatternBgnd KeepColor Pat1 setpattern} bind def
/Pattern2 {PatternBgnd KeepColor Pat2 setpattern} bind def
/Pattern3 {PatternBgnd KeepColor Pat3 setpattern} bind def
/Pattern4 {PatternBgnd KeepColor Landscape {Pat5} {Pat4} ifelse setpattern} bind def
/Pattern5 {PatternBgnd KeepColor Landscape {Pat4} {Pat5} ifelse setpattern} bind def
/Pattern6 {PatternBgnd KeepColor Landscape {Pat9} {Pat6} ifelse setpattern} bind def
/Pattern7 {PatternBgnd KeepColor Landscape {Pat8} {Pat7} ifelse setpattern} bind def
} def
%
%
%End of PostScript Level 2 code
%
/PatternBgnd {
  TransparentPatterns {} {gsave 1 setgray fill grestore} ifelse
} def
%
% Substitute for Level 2 pattern fill codes with
% grayscale if Level 2 support is not selected.
%
/Level1PatternFill {
/Pattern1 {0.250 Density} bind def
/Pattern2 {0.500 Density} bind def
/Pattern3 {0.750 Density} bind def
/Pattern4 {0.125 Density} bind def
/Pattern5 {0.375 Density} bind def
/Pattern6 {0.625 Density} bind def
/Pattern7 {0.875 Density} bind def
} def
%
% Now test for support of Level 2 code
%
Level1 {Level1PatternFill} {Level2PatternFill} ifelse
%
/Symbol-Oblique /Symbol findfont [1 0 .167 1 0 0] makefont
dup length dict begin {1 index /FID eq {pop pop} {def} ifelse} forall
currentdict end definefont pop
Level1 SuppressPDFMark or 
{} {
/SDict 10 dict def
systemdict /pdfmark known not {
  userdict /pdfmark systemdict /cleartomark get put
} if
SDict begin [
  /Title (zeitplot1.tex)
  /Subject (gnuplot plot)
  /Creator (gnuplot 4.6 patchlevel 1)
  /Author (kevin.luedemann)
%  /Producer (gnuplot)
%  /Keywords ()
  /CreationDate (Wed Jul  9 11:32:47 2014)
  /DOCINFO pdfmark
end
} ifelse
end
%%EndProlog
%%Page: 1 1
gnudict begin
gsave
doclip
50 50 translate
0.050 0.050 scale
0 setgray
newpath
1.000 UL
LTb
LCb setrgbcolor
1342 704 M
63 0 V
5398 0 R
-63 0 V
stroke
LTb
1342 1213 M
63 0 V
5398 0 R
-63 0 V
1342 1722 M
63 0 V
5398 0 R
-63 0 V
1342 2231 M
63 0 V
5398 0 R
-63 0 V
1342 2740 M
63 0 V
5398 0 R
-63 0 V
1342 3248 M
63 0 V
5398 0 R
-63 0 V
1342 3757 M
63 0 V
5398 0 R
-63 0 V
1342 4266 M
63 0 V
5398 0 R
-63 0 V
1342 4775 M
63 0 V
5398 0 R
-63 0 V
1342 704 M
0 63 V
0 4008 R
0 -63 V
1888 704 M
0 63 V
0 4008 R
0 -63 V
2434 704 M
0 63 V
0 4008 R
0 -63 V
2980 704 M
0 63 V
0 4008 R
0 -63 V
3526 704 M
0 63 V
0 4008 R
0 -63 V
4073 704 M
0 63 V
0 4008 R
0 -63 V
4619 704 M
0 63 V
0 4008 R
0 -63 V
5165 704 M
0 63 V
0 4008 R
0 -63 V
5711 704 M
0 63 V
0 4008 R
0 -63 V
6257 704 M
0 63 V
0 4008 R
0 -63 V
6803 704 M
0 63 V
0 4008 R
0 -63 V
stroke
1342 4775 N
0 -4071 V
5461 0 V
0 4071 V
-5461 0 V
Z stroke
1.000 UP
1.000 UL
LTb
1.000 UL
LT0
LC0 setrgbcolor
LC1 setrgbcolor
LCb setrgbcolor
LT0
LC0 setrgbcolor
LC1 setrgbcolor
3982 4602 M
591 0 V
1342 1213 M
51 13 V
52 12 V
51 13 V
51 13 V
52 13 V
51 13 V
51 12 V
51 13 V
52 13 V
51 13 V
51 12 V
52 13 V
51 13 V
51 13 V
52 12 V
51 13 V
51 13 V
51 13 V
52 13 V
51 12 V
51 13 V
52 13 V
51 13 V
51 12 V
52 13 V
51 13 V
51 13 V
51 13 V
52 12 V
51 13 V
51 13 V
52 13 V
51 12 V
51 13 V
52 13 V
51 13 V
51 12 V
51 13 V
52 13 V
51 13 V
51 13 V
52 12 V
51 13 V
51 13 V
52 13 V
51 12 V
51 13 V
51 13 V
52 13 V
51 13 V
51 12 V
52 13 V
51 13 V
51 13 V
52 12 V
51 13 V
51 13 V
51 13 V
52 12 V
51 13 V
51 13 V
52 13 V
51 13 V
51 12 V
52 13 V
51 13 V
51 13 V
51 12 V
52 13 V
51 13 V
51 13 V
52 13 V
51 12 V
51 13 V
52 13 V
51 13 V
51 12 V
51 13 V
52 13 V
51 13 V
51 12 V
52 13 V
51 13 V
51 13 V
52 13 V
51 12 V
51 13 V
51 13 V
52 13 V
51 12 V
51 13 V
52 13 V
51 13 V
51 13 V
52 12 V
51 13 V
51 13 V
51 13 V
52 12 V
1.000 UP
stroke
LT1
LC1 setrgbcolor
LCb setrgbcolor
LT1
LC1 setrgbcolor
3982 4382 M
591 0 V
-591 31 R
0 -62 V
591 62 R
0 -62 V
1342 704 M
0 1018 V
1311 704 M
62 0 V
-62 1018 R
62 0 V
133 -505 R
0 2 V
-31 -2 R
62 0 V
-62 2 R
62 0 V
51 5 R
0 4 V
-31 -4 R
62 0 V
-62 4 R
62 0 V
51 5 R
0 4 V
-31 -4 R
62 0 V
-62 4 R
62 0 V
51 3 R
0 5 V
-31 -5 R
62 0 V
-62 5 R
62 0 V
50 8 R
0 6 V
-31 -6 R
62 0 V
-62 6 R
62 0 V
51 3 R
0 6 V
-31 -6 R
62 0 V
-62 6 R
62 0 V
51 4 R
0 7 V
-31 -7 R
62 0 V
-62 7 R
62 0 V
51 0 R
0 7 V
-31 -7 R
62 0 V
-62 7 R
62 0 V
51 8 R
0 9 V
-31 -9 R
62 0 V
-62 9 R
62 0 V
51 4 R
0 9 V
-31 -9 R
62 0 V
-62 9 R
62 0 V
51 0 R
0 9 V
-31 -9 R
62 0 V
-62 9 R
62 0 V
51 5 R
0 10 V
-31 -10 R
62 0 V
-62 10 R
62 0 V
51 5 R
0 11 V
-31 -11 R
62 0 V
-62 11 R
62 0 V
51 -6 R
0 11 V
-31 -11 R
62 0 V
-62 11 R
62 0 V
51 6 R
0 11 V
-31 -11 R
62 0 V
-62 11 R
62 0 V
51 12 R
0 12 V
-31 -12 R
62 0 V
stroke 2766 1390 M
-62 12 R
62 0 V
50 6 R
0 13 V
-31 -13 R
62 0 V
-62 13 R
62 0 V
51 0 R
0 13 V
-31 -13 R
62 0 V
-62 13 R
62 0 V
51 14 R
0 14 V
-31 -14 R
62 0 V
-62 14 R
62 0 V
51 0 R
0 15 V
-31 -15 R
62 0 V
-62 15 R
62 0 V
51 7 R
0 15 V
-31 -15 R
62 0 V
-62 15 R
62 0 V
51 0 R
0 16 V
-31 -16 R
62 0 V
-62 16 R
62 0 V
51 7 R
0 17 V
-31 -17 R
62 0 V
-62 17 R
62 0 V
51 8 R
0 16 V
-31 -16 R
62 0 V
-62 16 R
62 0 V
51 0 R
0 17 V
-31 -17 R
62 0 V
-62 17 R
62 0 V
51 18 R
0 18 V
-31 -18 R
62 0 V
-62 18 R
62 0 V
51 0 R
0 18 V
-31 -18 R
62 0 V
-62 18 R
62 0 V
51 68 R
0 20 V
-31 -20 R
62 0 V
-62 20 R
62 0 V
50 10 R
0 21 V
-31 -21 R
62 0 V
-62 21 R
62 0 V
51 0 R
0 21 V
-31 -21 R
62 0 V
-62 21 R
62 0 V
51 0 R
0 21 V
-31 -21 R
62 0 V
-62 21 R
62 0 V
51 0 R
0 22 V
-31 -22 R
62 0 V
-62 22 R
62 0 V
51 -11 R
0 23 V
-31 -23 R
62 0 V
-62 23 R
62 0 V
stroke 4158 1829 M
51 11 R
0 23 V
-31 -23 R
62 0 V
-62 23 R
62 0 V
51 11 R
0 24 V
-31 -24 R
62 0 V
-62 24 R
62 0 V
51 0 R
0 23 V
-31 -23 R
62 0 V
-62 23 R
62 0 V
51 0 R
0 25 V
-31 -25 R
62 0 V
-62 25 R
62 0 V
51 0 R
0 24 V
-31 -24 R
62 0 V
-62 24 R
62 0 V
51 13 R
0 25 V
-31 -25 R
62 0 V
-62 25 R
62 0 V
51 0 R
0 26 V
-31 -26 R
62 0 V
-62 26 R
62 0 V
50 0 R
0 26 V
-31 -26 R
62 0 V
-62 26 R
62 0 V
51 0 R
0 26 V
-31 -26 R
62 0 V
-62 26 R
62 0 V
51 0 R
0 27 V
-31 -27 R
62 0 V
-62 27 R
62 0 V
51 14 R
0 27 V
-31 -27 R
62 0 V
-62 27 R
62 0 V
51 0 R
0 28 V
-31 -28 R
62 0 V
-62 28 R
62 0 V
51 0 R
0 28 V
-31 -28 R
62 0 V
-62 28 R
62 0 V
51 0 R
0 29 V
-31 -29 R
62 0 V
-62 29 R
62 0 V
51 0 R
0 29 V
-31 -29 R
62 0 V
-62 29 R
62 0 V
51 -15 R
0 30 V
-31 -30 R
62 0 V
-62 30 R
62 0 V
51 15 R
0 29 V
-31 -29 R
62 0 V
-62 29 R
62 0 V
51 0 R
0 31 V
stroke 5602 2358 M
-31 -31 R
62 0 V
-62 31 R
62 0 V
50 0 R
0 31 V
-31 -31 R
62 0 V
-62 31 R
62 0 V
51 0 R
0 31 V
-31 -31 R
62 0 V
-62 31 R
62 0 V
51 15 R
0 32 V
-31 -32 R
62 0 V
-62 32 R
62 0 V
51 0 R
0 32 V
-31 -32 R
62 0 V
-62 32 R
62 0 V
51 0 R
0 33 V
-31 -33 R
62 0 V
-62 33 R
62 0 V
51 -33 R
0 33 V
-31 -33 R
62 0 V
-62 33 R
62 0 V
51 33 R
0 33 V
-31 -33 R
62 0 V
-62 33 R
62 0 V
51 -17 R
0 34 V
-31 -34 R
62 0 V
-62 34 R
62 0 V
51 0 R
0 34 V
-31 -34 R
62 0 V
-62 34 R
62 0 V
51 0 R
0 34 V
-31 -34 R
62 0 V
-62 34 R
62 0 V
1342 1213 Crs
1506 1218 Crs
1588 1226 Crs
1670 1235 Crs
1752 1242 Crs
1833 1256 Crs
1915 1265 Crs
1997 1275 Crs
2079 1283 Crs
2161 1298 Crs
2243 1311 Crs
2325 1321 Crs
2407 1335 Crs
2489 1350 Crs
2571 1356 Crs
2653 1372 Crs
2735 1396 Crs
2816 1415 Crs
2898 1428 Crs
2980 1455 Crs
3062 1469 Crs
3144 1492 Crs
3226 1507 Crs
3308 1530 Crs
3390 1555 Crs
3472 1572 Crs
3554 1607 Crs
3636 1625 Crs
3718 1712 Crs
3799 1742 Crs
3881 1763 Crs
3963 1785 Crs
4045 1806 Crs
4127 1817 Crs
4209 1851 Crs
4291 1886 Crs
4373 1909 Crs
4455 1933 Crs
4537 1958 Crs
4619 1995 Crs
4701 2021 Crs
4782 2047 Crs
4864 2073 Crs
4946 2100 Crs
5028 2140 Crs
5110 2168 Crs
5192 2196 Crs
5274 2225 Crs
5356 2253 Crs
5438 2268 Crs
5520 2313 Crs
5602 2343 Crs
5683 2373 Crs
5765 2404 Crs
5847 2451 Crs
5929 2483 Crs
6011 2516 Crs
6093 2516 Crs
6175 2582 Crs
6257 2598 Crs
6339 2632 Crs
6421 2666 Crs
4277 4382 Crs
1.000 UL
LT0
LC0 setrgbcolor
LC3 setrgbcolor
LCb setrgbcolor
LT0
LC0 setrgbcolor
LC3 setrgbcolor
3982 4162 M
591 0 V
1342 1213 M
51 27 V
52 27 V
51 26 V
51 27 V
52 27 V
51 27 V
51 27 V
51 27 V
52 27 V
51 27 V
51 26 V
52 27 V
51 27 V
51 27 V
52 27 V
51 27 V
51 27 V
51 27 V
52 26 V
51 27 V
51 27 V
52 27 V
51 27 V
51 27 V
52 27 V
51 26 V
51 27 V
51 27 V
52 27 V
51 27 V
51 27 V
52 27 V
51 27 V
51 26 V
52 27 V
51 27 V
51 27 V
51 27 V
52 27 V
51 27 V
51 27 V
52 26 V
51 27 V
51 27 V
52 27 V
51 27 V
51 27 V
51 27 V
52 27 V
51 26 V
51 27 V
52 27 V
51 27 V
51 27 V
52 27 V
51 27 V
51 26 V
51 27 V
52 27 V
51 27 V
51 27 V
52 27 V
51 27 V
51 27 V
52 26 V
51 27 V
51 27 V
51 27 V
52 27 V
51 27 V
51 27 V
52 27 V
51 26 V
51 27 V
52 27 V
51 27 V
51 27 V
51 27 V
52 27 V
51 26 V
51 27 V
52 27 V
51 27 V
51 27 V
52 27 V
51 27 V
51 27 V
51 26 V
52 27 V
51 27 V
51 27 V
52 27 V
51 27 V
51 27 V
52 27 V
51 26 V
51 27 V
51 27 V
52 27 V
1.000 UP
stroke
LT3
LC3 setrgbcolor
LCb setrgbcolor
LT3
LC3 setrgbcolor
3982 3942 M
591 0 V
-591 31 R
0 -62 V
591 62 R
0 -62 V
1342 704 M
0 1018 V
1311 704 M
62 0 V
-62 1018 R
62 0 V
51 -507 R
0 2 V
-31 -2 R
62 0 V
-62 2 R
62 0 V
51 5 R
0 3 V
-31 -3 R
62 0 V
-62 3 R
62 0 V
51 8 R
0 4 V
-31 -4 R
62 0 V
-62 4 R
62 0 V
51 5 R
0 5 V
-31 -5 R
62 0 V
-62 5 R
62 0 V
51 15 R
0 6 V
-31 -6 R
62 0 V
-62 6 R
62 0 V
50 11 R
0 7 V
-31 -7 R
62 0 V
-62 7 R
62 0 V
133 21 R
0 9 V
-31 -9 R
62 0 V
-62 9 R
62 0 V
51 19 R
0 10 V
-31 -10 R
62 0 V
-62 10 R
62 0 V
51 5 R
0 11 V
-31 -11 R
62 0 V
-62 11 R
62 0 V
51 17 R
0 12 V
-31 -12 R
62 0 V
-62 12 R
62 0 V
51 12 R
0 13 V
-31 -13 R
62 0 V
-62 13 R
62 0 V
51 10 R
0 13 V
-31 -13 R
62 0 V
-62 13 R
62 0 V
51 10 R
0 14 V
-31 -14 R
62 0 V
-62 14 R
62 0 V
51 11 R
0 15 V
-31 -15 R
62 0 V
-62 15 R
62 0 V
51 11 R
0 16 V
-31 -16 R
62 0 V
-62 16 R
62 0 V
51 15 R
0 17 V
-31 -17 R
62 0 V
stroke 2766 1530 M
-62 17 R
62 0 V
50 21 R
0 17 V
-31 -17 R
62 0 V
-62 17 R
62 0 V
51 40 R
0 19 V
-31 -19 R
62 0 V
-62 19 R
62 0 V
51 14 R
0 19 V
-31 -19 R
62 0 V
-62 19 R
62 0 V
51 15 R
0 20 V
-31 -20 R
62 0 V
-62 20 R
62 0 V
51 20 R
0 21 V
-31 -21 R
62 0 V
-62 21 R
62 0 V
51 5 R
0 21 V
-31 -21 R
62 0 V
-62 21 R
62 0 V
51 27 R
0 23 V
-31 -23 R
62 0 V
-62 23 R
62 0 V
51 45 R
0 24 V
-31 -24 R
62 0 V
-62 24 R
62 0 V
51 29 R
0 25 V
-31 -25 R
62 0 V
-62 25 R
62 0 V
51 31 R
0 25 V
-31 -25 R
62 0 V
-62 25 R
62 0 V
51 32 R
0 26 V
-31 -26 R
62 0 V
-62 26 R
62 0 V
51 -6 R
0 26 V
-31 -26 R
62 0 V
-62 26 R
62 0 V
50 75 R
0 28 V
-31 -28 R
62 0 V
-62 28 R
62 0 V
51 21 R
0 29 V
-31 -29 R
62 0 V
-62 29 R
62 0 V
51 36 R
0 30 V
-31 -30 R
62 0 V
-62 30 R
62 0 V
51 22 R
0 31 V
-31 -31 R
62 0 V
-62 31 R
62 0 V
51 23 R
0 31 V
-31 -31 R
62 0 V
-62 31 R
62 0 V
stroke 4158 2412 M
51 39 R
0 32 V
-31 -32 R
62 0 V
-62 32 R
62 0 V
51 65 R
0 33 V
-31 -33 R
62 0 V
-62 33 R
62 0 V
51 26 R
0 34 V
-31 -34 R
62 0 V
-62 34 R
62 0 V
51 8 R
0 34 V
-31 -34 R
62 0 V
-62 34 R
62 0 V
51 27 R
0 35 V
-31 -35 R
62 0 V
-62 35 R
62 0 V
51 26 R
0 36 V
-31 -36 R
62 0 V
-62 36 R
62 0 V
51 36 R
0 37 V
-31 -37 R
62 0 V
-62 37 R
62 0 V
50 56 R
0 37 V
-31 -37 R
62 0 V
-62 37 R
62 0 V
51 0 R
0 38 V
-31 -38 R
62 0 V
-62 38 R
62 0 V
51 20 R
0 38 V
-31 -38 R
62 0 V
-62 38 R
62 0 V
51 20 R
0 39 V
-31 -39 R
62 0 V
-62 39 R
62 0 V
51 20 R
0 40 V
-31 -40 R
62 0 V
-62 40 R
62 0 V
51 20 R
0 40 V
-31 -40 R
62 0 V
-62 40 R
62 0 V
51 41 R
0 42 V
-31 -42 R
62 0 V
-62 42 R
62 0 V
51 62 R
0 43 V
-31 -43 R
62 0 V
-62 43 R
62 0 V
51 21 R
0 43 V
-31 -43 R
62 0 V
-62 43 R
62 0 V
51 65 R
0 44 V
-31 -44 R
62 0 V
-62 44 R
62 0 V
51 22 R
0 45 V
stroke 5602 3676 M
-31 -45 R
62 0 V
-62 45 R
62 0 V
50 22 R
0 45 V
-31 -45 R
62 0 V
-62 45 R
62 0 V
51 35 R
0 45 V
-31 -45 R
62 0 V
-62 45 R
62 0 V
51 24 R
0 46 V
-31 -46 R
62 0 V
-62 46 R
62 0 V
51 47 R
0 47 V
-31 -47 R
62 0 V
-62 47 R
62 0 V
51 12 R
0 48 V
-31 -48 R
62 0 V
-62 48 R
62 0 V
51 12 R
0 48 V
-31 -48 R
62 0 V
-62 48 R
62 0 V
51 25 R
0 49 V
-31 -49 R
62 0 V
-62 49 R
62 0 V
51 61 R
0 50 V
-31 -50 R
62 0 V
-62 50 R
62 0 V
51 51 R
0 50 V
-31 -50 R
62 0 V
-62 50 R
62 0 V
51 39 R
0 51 V
-31 -51 R
62 0 V
-62 51 R
62 0 V
1342 1213 Box
1424 1216 Box
1506 1224 Box
1588 1235 Box
1670 1245 Box
1752 1265 Box
1833 1283 Box
1997 1311 Box
2079 1340 Box
2161 1356 Box
2243 1384 Box
2325 1408 Box
2407 1431 Box
2489 1455 Box
2571 1480 Box
2653 1507 Box
2735 1539 Box
2816 1576 Box
2898 1634 Box
2980 1667 Box
3062 1702 Box
3144 1742 Box
3226 1769 Box
3308 1817 Box
3390 1886 Box
3472 1940 Box
3554 1995 Box
3636 2053 Box
3718 2073 Box
3799 2175 Box
3881 2225 Box
3963 2290 Box
4045 2343 Box
4127 2396 Box
4209 2467 Box
4291 2565 Box
4373 2624 Box
4455 2666 Box
4537 2727 Box
4619 2789 Box
4701 2862 Box
4782 2954 Box
4864 2992 Box
4946 3050 Box
5028 3108 Box
5110 3168 Box
5192 3228 Box
5274 3310 Box
5356 3414 Box
5438 3478 Box
5520 3587 Box
5602 3653 Box
5683 3721 Box
5765 3801 Box
5847 3870 Box
5929 3964 Box
6011 4023 Box
6093 4083 Box
6175 4156 Box
6257 4267 Box
6339 4368 Box
6421 4457 Box
4277 3942 Box
1.000 UL
LTb
LCb setrgbcolor
1342 4775 N
0 -4071 V
5461 0 V
0 4071 V
-5461 0 V
Z stroke
1.000 UP
1.000 UL
LTb
stroke
grestore
end
showpage
%%Trailer
