%!PS-Adobe-2.0 EPSF-2.0
%%Title: plot1.tex
%%Creator: gnuplot 4.6 patchlevel 5
%%CreationDate: Tue Mar 10 15:23:27 2015
%%DocumentFonts: 
%%BoundingBox: 50 50 410 302
%%EndComments
%%BeginProlog
/gnudict 256 dict def
gnudict begin
%
% The following true/false flags may be edited by hand if desired.
% The unit line width and grayscale image gamma correction may also be changed.
%
/Color true def
/Blacktext true def
/Solid true def
/Dashlength 1 def
/Landscape false def
/Level1 false def
/Rounded false def
/ClipToBoundingBox false def
/SuppressPDFMark false def
/TransparentPatterns false def
/gnulinewidth 5.000 def
/userlinewidth gnulinewidth def
/Gamma 1.0 def
/BackgroundColor {-1.000 -1.000 -1.000} def
%
/vshift -73 def
/dl1 {
  10.0 Dashlength mul mul
  Rounded { currentlinewidth 0.75 mul sub dup 0 le { pop 0.01 } if } if
} def
/dl2 {
  10.0 Dashlength mul mul
  Rounded { currentlinewidth 0.75 mul add } if
} def
/hpt_ 31.5 def
/vpt_ 31.5 def
/hpt hpt_ def
/vpt vpt_ def
/doclip {
  ClipToBoundingBox {
    newpath 50 50 moveto 410 50 lineto 410 302 lineto 50 302 lineto closepath
    clip
  } if
} def
%
% Gnuplot Prolog Version 4.6 (September 2012)
%
%/SuppressPDFMark true def
%
/M {moveto} bind def
/L {lineto} bind def
/R {rmoveto} bind def
/V {rlineto} bind def
/N {newpath moveto} bind def
/Z {closepath} bind def
/C {setrgbcolor} bind def
/f {rlineto fill} bind def
/g {setgray} bind def
/Gshow {show} def   % May be redefined later in the file to support UTF-8
/vpt2 vpt 2 mul def
/hpt2 hpt 2 mul def
/Lshow {currentpoint stroke M 0 vshift R 
	Blacktext {gsave 0 setgray show grestore} {show} ifelse} def
/Rshow {currentpoint stroke M dup stringwidth pop neg vshift R
	Blacktext {gsave 0 setgray show grestore} {show} ifelse} def
/Cshow {currentpoint stroke M dup stringwidth pop -2 div vshift R 
	Blacktext {gsave 0 setgray show grestore} {show} ifelse} def
/UP {dup vpt_ mul /vpt exch def hpt_ mul /hpt exch def
  /hpt2 hpt 2 mul def /vpt2 vpt 2 mul def} def
/DL {Color {setrgbcolor Solid {pop []} if 0 setdash}
 {pop pop pop 0 setgray Solid {pop []} if 0 setdash} ifelse} def
/BL {stroke userlinewidth 2 mul setlinewidth
	Rounded {1 setlinejoin 1 setlinecap} if} def
/AL {stroke userlinewidth 2 div setlinewidth
	Rounded {1 setlinejoin 1 setlinecap} if} def
/UL {dup gnulinewidth mul /userlinewidth exch def
	dup 1 lt {pop 1} if 10 mul /udl exch def} def
/PL {stroke userlinewidth setlinewidth
	Rounded {1 setlinejoin 1 setlinecap} if} def
3.8 setmiterlimit
% Default Line colors
/LCw {1 1 1} def
/LCb {0 0 0} def
/LCa {0 0 0} def
/LC0 {1 0 0} def
/LC1 {0 1 0} def
/LC2 {0 0 1} def
/LC3 {1 0 1} def
/LC4 {0 1 1} def
/LC5 {1 1 0} def
/LC6 {0 0 0} def
/LC7 {1 0.3 0} def
/LC8 {0.5 0.5 0.5} def
% Default Line Types
/LTw {PL [] 1 setgray} def
/LTb {BL [] LCb DL} def
/LTa {AL [1 udl mul 2 udl mul] 0 setdash LCa setrgbcolor} def
/LT0 {PL [] LC0 DL} def
/LT1 {PL [4 dl1 2 dl2] LC1 DL} def
/LT2 {PL [2 dl1 3 dl2] LC2 DL} def
/LT3 {PL [1 dl1 1.5 dl2] LC3 DL} def
/LT4 {PL [6 dl1 2 dl2 1 dl1 2 dl2] LC4 DL} def
/LT5 {PL [3 dl1 3 dl2 1 dl1 3 dl2] LC5 DL} def
/LT6 {PL [2 dl1 2 dl2 2 dl1 6 dl2] LC6 DL} def
/LT7 {PL [1 dl1 2 dl2 6 dl1 2 dl2 1 dl1 2 dl2] LC7 DL} def
/LT8 {PL [2 dl1 2 dl2 2 dl1 2 dl2 2 dl1 2 dl2 2 dl1 4 dl2] LC8 DL} def
/Pnt {stroke [] 0 setdash gsave 1 setlinecap M 0 0 V stroke grestore} def
/Dia {stroke [] 0 setdash 2 copy vpt add M
  hpt neg vpt neg V hpt vpt neg V
  hpt vpt V hpt neg vpt V closepath stroke
  Pnt} def
/Pls {stroke [] 0 setdash vpt sub M 0 vpt2 V
  currentpoint stroke M
  hpt neg vpt neg R hpt2 0 V stroke
 } def
/Box {stroke [] 0 setdash 2 copy exch hpt sub exch vpt add M
  0 vpt2 neg V hpt2 0 V 0 vpt2 V
  hpt2 neg 0 V closepath stroke
  Pnt} def
/Crs {stroke [] 0 setdash exch hpt sub exch vpt add M
  hpt2 vpt2 neg V currentpoint stroke M
  hpt2 neg 0 R hpt2 vpt2 V stroke} def
/TriU {stroke [] 0 setdash 2 copy vpt 1.12 mul add M
  hpt neg vpt -1.62 mul V
  hpt 2 mul 0 V
  hpt neg vpt 1.62 mul V closepath stroke
  Pnt} def
/Star {2 copy Pls Crs} def
/BoxF {stroke [] 0 setdash exch hpt sub exch vpt add M
  0 vpt2 neg V hpt2 0 V 0 vpt2 V
  hpt2 neg 0 V closepath fill} def
/TriUF {stroke [] 0 setdash vpt 1.12 mul add M
  hpt neg vpt -1.62 mul V
  hpt 2 mul 0 V
  hpt neg vpt 1.62 mul V closepath fill} def
/TriD {stroke [] 0 setdash 2 copy vpt 1.12 mul sub M
  hpt neg vpt 1.62 mul V
  hpt 2 mul 0 V
  hpt neg vpt -1.62 mul V closepath stroke
  Pnt} def
/TriDF {stroke [] 0 setdash vpt 1.12 mul sub M
  hpt neg vpt 1.62 mul V
  hpt 2 mul 0 V
  hpt neg vpt -1.62 mul V closepath fill} def
/DiaF {stroke [] 0 setdash vpt add M
  hpt neg vpt neg V hpt vpt neg V
  hpt vpt V hpt neg vpt V closepath fill} def
/Pent {stroke [] 0 setdash 2 copy gsave
  translate 0 hpt M 4 {72 rotate 0 hpt L} repeat
  closepath stroke grestore Pnt} def
/PentF {stroke [] 0 setdash gsave
  translate 0 hpt M 4 {72 rotate 0 hpt L} repeat
  closepath fill grestore} def
/Circle {stroke [] 0 setdash 2 copy
  hpt 0 360 arc stroke Pnt} def
/CircleF {stroke [] 0 setdash hpt 0 360 arc fill} def
/C0 {BL [] 0 setdash 2 copy moveto vpt 90 450 arc} bind def
/C1 {BL [] 0 setdash 2 copy moveto
	2 copy vpt 0 90 arc closepath fill
	vpt 0 360 arc closepath} bind def
/C2 {BL [] 0 setdash 2 copy moveto
	2 copy vpt 90 180 arc closepath fill
	vpt 0 360 arc closepath} bind def
/C3 {BL [] 0 setdash 2 copy moveto
	2 copy vpt 0 180 arc closepath fill
	vpt 0 360 arc closepath} bind def
/C4 {BL [] 0 setdash 2 copy moveto
	2 copy vpt 180 270 arc closepath fill
	vpt 0 360 arc closepath} bind def
/C5 {BL [] 0 setdash 2 copy moveto
	2 copy vpt 0 90 arc
	2 copy moveto
	2 copy vpt 180 270 arc closepath fill
	vpt 0 360 arc} bind def
/C6 {BL [] 0 setdash 2 copy moveto
	2 copy vpt 90 270 arc closepath fill
	vpt 0 360 arc closepath} bind def
/C7 {BL [] 0 setdash 2 copy moveto
	2 copy vpt 0 270 arc closepath fill
	vpt 0 360 arc closepath} bind def
/C8 {BL [] 0 setdash 2 copy moveto
	2 copy vpt 270 360 arc closepath fill
	vpt 0 360 arc closepath} bind def
/C9 {BL [] 0 setdash 2 copy moveto
	2 copy vpt 270 450 arc closepath fill
	vpt 0 360 arc closepath} bind def
/C10 {BL [] 0 setdash 2 copy 2 copy moveto vpt 270 360 arc closepath fill
	2 copy moveto
	2 copy vpt 90 180 arc closepath fill
	vpt 0 360 arc closepath} bind def
/C11 {BL [] 0 setdash 2 copy moveto
	2 copy vpt 0 180 arc closepath fill
	2 copy moveto
	2 copy vpt 270 360 arc closepath fill
	vpt 0 360 arc closepath} bind def
/C12 {BL [] 0 setdash 2 copy moveto
	2 copy vpt 180 360 arc closepath fill
	vpt 0 360 arc closepath} bind def
/C13 {BL [] 0 setdash 2 copy moveto
	2 copy vpt 0 90 arc closepath fill
	2 copy moveto
	2 copy vpt 180 360 arc closepath fill
	vpt 0 360 arc closepath} bind def
/C14 {BL [] 0 setdash 2 copy moveto
	2 copy vpt 90 360 arc closepath fill
	vpt 0 360 arc} bind def
/C15 {BL [] 0 setdash 2 copy vpt 0 360 arc closepath fill
	vpt 0 360 arc closepath} bind def
/Rec {newpath 4 2 roll moveto 1 index 0 rlineto 0 exch rlineto
	neg 0 rlineto closepath} bind def
/Square {dup Rec} bind def
/Bsquare {vpt sub exch vpt sub exch vpt2 Square} bind def
/S0 {BL [] 0 setdash 2 copy moveto 0 vpt rlineto BL Bsquare} bind def
/S1 {BL [] 0 setdash 2 copy vpt Square fill Bsquare} bind def
/S2 {BL [] 0 setdash 2 copy exch vpt sub exch vpt Square fill Bsquare} bind def
/S3 {BL [] 0 setdash 2 copy exch vpt sub exch vpt2 vpt Rec fill Bsquare} bind def
/S4 {BL [] 0 setdash 2 copy exch vpt sub exch vpt sub vpt Square fill Bsquare} bind def
/S5 {BL [] 0 setdash 2 copy 2 copy vpt Square fill
	exch vpt sub exch vpt sub vpt Square fill Bsquare} bind def
/S6 {BL [] 0 setdash 2 copy exch vpt sub exch vpt sub vpt vpt2 Rec fill Bsquare} bind def
/S7 {BL [] 0 setdash 2 copy exch vpt sub exch vpt sub vpt vpt2 Rec fill
	2 copy vpt Square fill Bsquare} bind def
/S8 {BL [] 0 setdash 2 copy vpt sub vpt Square fill Bsquare} bind def
/S9 {BL [] 0 setdash 2 copy vpt sub vpt vpt2 Rec fill Bsquare} bind def
/S10 {BL [] 0 setdash 2 copy vpt sub vpt Square fill 2 copy exch vpt sub exch vpt Square fill
	Bsquare} bind def
/S11 {BL [] 0 setdash 2 copy vpt sub vpt Square fill 2 copy exch vpt sub exch vpt2 vpt Rec fill
	Bsquare} bind def
/S12 {BL [] 0 setdash 2 copy exch vpt sub exch vpt sub vpt2 vpt Rec fill Bsquare} bind def
/S13 {BL [] 0 setdash 2 copy exch vpt sub exch vpt sub vpt2 vpt Rec fill
	2 copy vpt Square fill Bsquare} bind def
/S14 {BL [] 0 setdash 2 copy exch vpt sub exch vpt sub vpt2 vpt Rec fill
	2 copy exch vpt sub exch vpt Square fill Bsquare} bind def
/S15 {BL [] 0 setdash 2 copy Bsquare fill Bsquare} bind def
/D0 {gsave translate 45 rotate 0 0 S0 stroke grestore} bind def
/D1 {gsave translate 45 rotate 0 0 S1 stroke grestore} bind def
/D2 {gsave translate 45 rotate 0 0 S2 stroke grestore} bind def
/D3 {gsave translate 45 rotate 0 0 S3 stroke grestore} bind def
/D4 {gsave translate 45 rotate 0 0 S4 stroke grestore} bind def
/D5 {gsave translate 45 rotate 0 0 S5 stroke grestore} bind def
/D6 {gsave translate 45 rotate 0 0 S6 stroke grestore} bind def
/D7 {gsave translate 45 rotate 0 0 S7 stroke grestore} bind def
/D8 {gsave translate 45 rotate 0 0 S8 stroke grestore} bind def
/D9 {gsave translate 45 rotate 0 0 S9 stroke grestore} bind def
/D10 {gsave translate 45 rotate 0 0 S10 stroke grestore} bind def
/D11 {gsave translate 45 rotate 0 0 S11 stroke grestore} bind def
/D12 {gsave translate 45 rotate 0 0 S12 stroke grestore} bind def
/D13 {gsave translate 45 rotate 0 0 S13 stroke grestore} bind def
/D14 {gsave translate 45 rotate 0 0 S14 stroke grestore} bind def
/D15 {gsave translate 45 rotate 0 0 S15 stroke grestore} bind def
/DiaE {stroke [] 0 setdash vpt add M
  hpt neg vpt neg V hpt vpt neg V
  hpt vpt V hpt neg vpt V closepath stroke} def
/BoxE {stroke [] 0 setdash exch hpt sub exch vpt add M
  0 vpt2 neg V hpt2 0 V 0 vpt2 V
  hpt2 neg 0 V closepath stroke} def
/TriUE {stroke [] 0 setdash vpt 1.12 mul add M
  hpt neg vpt -1.62 mul V
  hpt 2 mul 0 V
  hpt neg vpt 1.62 mul V closepath stroke} def
/TriDE {stroke [] 0 setdash vpt 1.12 mul sub M
  hpt neg vpt 1.62 mul V
  hpt 2 mul 0 V
  hpt neg vpt -1.62 mul V closepath stroke} def
/PentE {stroke [] 0 setdash gsave
  translate 0 hpt M 4 {72 rotate 0 hpt L} repeat
  closepath stroke grestore} def
/CircE {stroke [] 0 setdash 
  hpt 0 360 arc stroke} def
/Opaque {gsave closepath 1 setgray fill grestore 0 setgray closepath} def
/DiaW {stroke [] 0 setdash vpt add M
  hpt neg vpt neg V hpt vpt neg V
  hpt vpt V hpt neg vpt V Opaque stroke} def
/BoxW {stroke [] 0 setdash exch hpt sub exch vpt add M
  0 vpt2 neg V hpt2 0 V 0 vpt2 V
  hpt2 neg 0 V Opaque stroke} def
/TriUW {stroke [] 0 setdash vpt 1.12 mul add M
  hpt neg vpt -1.62 mul V
  hpt 2 mul 0 V
  hpt neg vpt 1.62 mul V Opaque stroke} def
/TriDW {stroke [] 0 setdash vpt 1.12 mul sub M
  hpt neg vpt 1.62 mul V
  hpt 2 mul 0 V
  hpt neg vpt -1.62 mul V Opaque stroke} def
/PentW {stroke [] 0 setdash gsave
  translate 0 hpt M 4 {72 rotate 0 hpt L} repeat
  Opaque stroke grestore} def
/CircW {stroke [] 0 setdash 
  hpt 0 360 arc Opaque stroke} def
/BoxFill {gsave Rec 1 setgray fill grestore} def
/Density {
  /Fillden exch def
  currentrgbcolor
  /ColB exch def /ColG exch def /ColR exch def
  /ColR ColR Fillden mul Fillden sub 1 add def
  /ColG ColG Fillden mul Fillden sub 1 add def
  /ColB ColB Fillden mul Fillden sub 1 add def
  ColR ColG ColB setrgbcolor} def
/BoxColFill {gsave Rec PolyFill} def
/PolyFill {gsave Density fill grestore grestore} def
/h {rlineto rlineto rlineto gsave closepath fill grestore} bind def
%
% PostScript Level 1 Pattern Fill routine for rectangles
% Usage: x y w h s a XX PatternFill
%	x,y = lower left corner of box to be filled
%	w,h = width and height of box
%	  a = angle in degrees between lines and x-axis
%	 XX = 0/1 for no/yes cross-hatch
%
/PatternFill {gsave /PFa [ 9 2 roll ] def
  PFa 0 get PFa 2 get 2 div add PFa 1 get PFa 3 get 2 div add translate
  PFa 2 get -2 div PFa 3 get -2 div PFa 2 get PFa 3 get Rec
  TransparentPatterns {} {gsave 1 setgray fill grestore} ifelse
  clip
  currentlinewidth 0.5 mul setlinewidth
  /PFs PFa 2 get dup mul PFa 3 get dup mul add sqrt def
  0 0 M PFa 5 get rotate PFs -2 div dup translate
  0 1 PFs PFa 4 get div 1 add floor cvi
	{PFa 4 get mul 0 M 0 PFs V} for
  0 PFa 6 get ne {
	0 1 PFs PFa 4 get div 1 add floor cvi
	{PFa 4 get mul 0 2 1 roll M PFs 0 V} for
 } if
  stroke grestore} def
%
/languagelevel where
 {pop languagelevel} {1} ifelse
 2 lt
	{/InterpretLevel1 true def}
	{/InterpretLevel1 Level1 def}
 ifelse
%
% PostScript level 2 pattern fill definitions
%
/Level2PatternFill {
/Tile8x8 {/PaintType 2 /PatternType 1 /TilingType 1 /BBox [0 0 8 8] /XStep 8 /YStep 8}
	bind def
/KeepColor {currentrgbcolor [/Pattern /DeviceRGB] setcolorspace} bind def
<< Tile8x8
 /PaintProc {0.5 setlinewidth pop 0 0 M 8 8 L 0 8 M 8 0 L stroke} 
>> matrix makepattern
/Pat1 exch def
<< Tile8x8
 /PaintProc {0.5 setlinewidth pop 0 0 M 8 8 L 0 8 M 8 0 L stroke
	0 4 M 4 8 L 8 4 L 4 0 L 0 4 L stroke}
>> matrix makepattern
/Pat2 exch def
<< Tile8x8
 /PaintProc {0.5 setlinewidth pop 0 0 M 0 8 L
	8 8 L 8 0 L 0 0 L fill}
>> matrix makepattern
/Pat3 exch def
<< Tile8x8
 /PaintProc {0.5 setlinewidth pop -4 8 M 8 -4 L
	0 12 M 12 0 L stroke}
>> matrix makepattern
/Pat4 exch def
<< Tile8x8
 /PaintProc {0.5 setlinewidth pop -4 0 M 8 12 L
	0 -4 M 12 8 L stroke}
>> matrix makepattern
/Pat5 exch def
<< Tile8x8
 /PaintProc {0.5 setlinewidth pop -2 8 M 4 -4 L
	0 12 M 8 -4 L 4 12 M 10 0 L stroke}
>> matrix makepattern
/Pat6 exch def
<< Tile8x8
 /PaintProc {0.5 setlinewidth pop -2 0 M 4 12 L
	0 -4 M 8 12 L 4 -4 M 10 8 L stroke}
>> matrix makepattern
/Pat7 exch def
<< Tile8x8
 /PaintProc {0.5 setlinewidth pop 8 -2 M -4 4 L
	12 0 M -4 8 L 12 4 M 0 10 L stroke}
>> matrix makepattern
/Pat8 exch def
<< Tile8x8
 /PaintProc {0.5 setlinewidth pop 0 -2 M 12 4 L
	-4 0 M 12 8 L -4 4 M 8 10 L stroke}
>> matrix makepattern
/Pat9 exch def
/Pattern1 {PatternBgnd KeepColor Pat1 setpattern} bind def
/Pattern2 {PatternBgnd KeepColor Pat2 setpattern} bind def
/Pattern3 {PatternBgnd KeepColor Pat3 setpattern} bind def
/Pattern4 {PatternBgnd KeepColor Landscape {Pat5} {Pat4} ifelse setpattern} bind def
/Pattern5 {PatternBgnd KeepColor Landscape {Pat4} {Pat5} ifelse setpattern} bind def
/Pattern6 {PatternBgnd KeepColor Landscape {Pat9} {Pat6} ifelse setpattern} bind def
/Pattern7 {PatternBgnd KeepColor Landscape {Pat8} {Pat7} ifelse setpattern} bind def
} def
%
%
%End of PostScript Level 2 code
%
/PatternBgnd {
  TransparentPatterns {} {gsave 1 setgray fill grestore} ifelse
} def
%
% Substitute for Level 2 pattern fill codes with
% grayscale if Level 2 support is not selected.
%
/Level1PatternFill {
/Pattern1 {0.250 Density} bind def
/Pattern2 {0.500 Density} bind def
/Pattern3 {0.750 Density} bind def
/Pattern4 {0.125 Density} bind def
/Pattern5 {0.375 Density} bind def
/Pattern6 {0.625 Density} bind def
/Pattern7 {0.875 Density} bind def
} def
%
% Now test for support of Level 2 code
%
Level1 {Level1PatternFill} {Level2PatternFill} ifelse
%
/Symbol-Oblique /Symbol findfont [1 0 .167 1 0 0] makefont
dup length dict begin {1 index /FID eq {pop pop} {def} ifelse} forall
currentdict end definefont pop
Level1 SuppressPDFMark or 
{} {
/SDict 10 dict def
systemdict /pdfmark known not {
  userdict /pdfmark systemdict /cleartomark get put
} if
SDict begin [
  /Title (plot1.tex)
  /Subject (gnuplot plot)
  /Creator (gnuplot 4.6 patchlevel 5)
  /Author (eric.bertok)
%  /Producer (gnuplot)
%  /Keywords ()
  /CreationDate (Tue Mar 10 15:23:27 2015)
  /DOCINFO pdfmark
end
} ifelse
end
%%EndProlog
%%Page: 1 1
gnudict begin
gsave
doclip
50 50 translate
0.050 0.050 scale
0 setgray
newpath
1.000 UL
LTb
LCb setrgbcolor
990 440 M
63 0 V
5750 0 R
-63 0 V
stroke
LTb
990 922 M
63 0 V
5750 0 R
-63 0 V
990 1403 M
63 0 V
5750 0 R
-63 0 V
990 1885 M
63 0 V
5750 0 R
-63 0 V
990 2367 M
63 0 V
5750 0 R
-63 0 V
990 2848 M
63 0 V
5750 0 R
-63 0 V
990 3330 M
63 0 V
5750 0 R
-63 0 V
990 3812 M
63 0 V
5750 0 R
-63 0 V
990 4293 M
63 0 V
5750 0 R
-63 0 V
990 4775 M
63 0 V
5750 0 R
-63 0 V
990 440 M
0 63 V
0 4272 R
0 -63 V
1959 440 M
0 63 V
0 4272 R
0 -63 V
2928 440 M
0 63 V
0 4272 R
0 -63 V
3897 440 M
0 63 V
0 4272 R
0 -63 V
4865 440 M
0 63 V
0 4272 R
0 -63 V
5834 440 M
0 63 V
0 4272 R
0 -63 V
6803 440 M
0 63 V
0 4272 R
0 -63 V
stroke
990 4775 N
990 440 L
5813 0 V
0 4335 V
-5813 0 V
Z stroke
1.000 UP
1.000 UL
LTb
1.000 UP
1.000 UL
LT0
LC0 setrgbcolor
LCb setrgbcolor
LT0
LC0 setrgbcolor
2442 4602 M
591 0 V
-591 31 R
0 -62 V
591 62 R
0 -62 V
1038 482 M
0 1 V
-31 -1 R
62 0 V
-62 1 R
62 0 V
18 -1 R
0 1 V
-31 -1 R
62 0 V
-62 1 R
62 0 V
17 -1 R
0 1 V
-31 -1 R
62 0 V
-62 1 R
62 0 V
18 0 R
0 1 V
-31 -1 R
62 0 V
-62 1 R
62 0 V
17 -1 R
0 1 V
-31 -1 R
62 0 V
-62 1 R
62 0 V
18 -1 R
0 1 V
-31 -1 R
62 0 V
-62 1 R
62 0 V
17 -1 R
0 1 V
-31 -1 R
62 0 V
-62 1 R
62 0 V
18 -1 R
0 1 V
-31 -1 R
62 0 V
-62 1 R
62 0 V
-2 -1 R
0 1 V
-31 -1 R
62 0 V
-62 1 R
62 0 V
-22 -3 R
0 1 V
-31 -1 R
62 0 V
-62 1 R
62 0 V
-21 -4 R
0 1 V
-31 -1 R
62 0 V
-62 1 R
62 0 V
-21 -7 R
0 1 V
-31 -1 R
62 0 V
-62 1 R
62 0 V
-22 -7 R
0 1 V
-31 -1 R
62 0 V
-62 1 R
62 0 V
-21 -12 R
0 1 V
-31 -1 R
62 0 V
-62 1 R
62 0 V
-21 -14 R
0 1 V
-31 -1 R
62 0 V
-62 1 R
62 0 V
-22 11 R
0 1 V
-31 -1 R
62 0 V
-62 1 R
62 0 V
-21 12 R
0 1 V
-31 -1 R
62 0 V
stroke 1515 467 M
-62 1 R
62 0 V
-12 26 R
0 1 V
-31 -1 R
62 0 V
-62 1 R
62 0 V
-11 27 R
0 1 V
-31 -1 R
62 0 V
-62 1 R
62 0 V
-12 21 R
0 1 V
-31 -1 R
62 0 V
-62 1 R
62 0 V
-2 35 R
0 1 V
-31 -1 R
62 0 V
-62 1 R
62 0 V
18 51 R
0 1 V
-31 -1 R
62 0 V
-62 1 R
62 0 V
17 47 R
0 1 V
-31 -1 R
62 0 V
-62 1 R
62 0 V
18 38 R
0 1 V
-31 -1 R
62 0 V
-62 1 R
62 0 V
17 33 R
0 1 V
-31 -1 R
62 0 V
-62 1 R
62 0 V
18 25 R
0 1 V
-31 -1 R
62 0 V
-62 1 R
62 0 V
17 28 R
0 1 V
-31 -1 R
62 0 V
-62 1 R
62 0 V
17 24 R
0 1 V
-31 -1 R
62 0 V
-62 1 R
62 0 V
18 26 R
-31 0 R
62 0 V
-62 0 R
62 0 V
17 22 R
0 1 V
-31 -1 R
62 0 V
-62 1 R
62 0 V
18 19 R
0 1 V
-31 -1 R
62 0 V
-62 1 R
62 0 V
17 19 R
0 1 V
-31 -1 R
62 0 V
-62 1 R
62 0 V
18 20 R
0 1 V
-31 -1 R
62 0 V
-62 1 R
62 0 V
17 16 R
0 1 V
-31 -1 R
62 0 V
-62 1 R
62 0 V
17 16 R
0 1 V
stroke 2249 978 M
-31 -1 R
62 0 V
-62 1 R
62 0 V
18 15 R
0 1 V
-31 -1 R
62 0 V
-62 1 R
62 0 V
17 12 R
0 1 V
-31 -1 R
62 0 V
-62 1 R
62 0 V
18 18 R
0 1 V
-31 -1 R
62 0 V
-62 1 R
62 0 V
17 16 R
0 1 V
-31 -1 R
62 0 V
-62 1 R
62 0 V
18 18 R
0 1 V
-31 -1 R
62 0 V
-62 1 R
62 0 V
17 42 R
0 1 V
-31 -1 R
62 0 V
-62 1 R
62 0 V
-2 7 R
0 1 V
-31 -1 R
62 0 V
-62 1 R
62 0 V
-11 -7 R
0 1 V
-31 -1 R
62 0 V
-62 1 R
62 0 V
-12 -13 R
0 1 V
-31 -1 R
62 0 V
-62 1 R
62 0 V
-60 15 R
0 1 V
-31 -1 R
62 0 V
-62 1 R
62 0 V
-12 -9 R
0 1 V
-31 -1 R
62 0 V
-62 1 R
62 0 V
8 -40 R
0 1 V
-31 -1 R
62 0 V
-62 1 R
62 0 V
17 -72 R
-31 0 R
62 0 V
-62 0 R
62 0 V
18 -98 R
0 1 V
-31 -1 R
62 0 V
-62 1 R
62 0 V
17 -104 R
0 1 V
-31 -1 R
62 0 V
-62 1 R
62 0 V
18 -92 R
0 1 V
-31 -1 R
62 0 V
-62 1 R
62 0 V
17 -88 R
0 1 V
-31 -1 R
62 0 V
-62 1 R
62 0 V
stroke 2910 614 M
18 -69 R
0 1 V
-31 -1 R
62 0 V
-62 1 R
62 0 V
17 -55 R
0 1 V
-31 -1 R
62 0 V
-62 1 R
62 0 V
8 -33 R
0 1 V
-31 -1 R
62 0 V
-62 1 R
62 0 V
-21 -10 R
0 1 V
-31 -1 R
62 0 V
-62 1 R
62 0 V
-51 14 R
0 1 V
-31 -1 R
62 0 V
-62 1 R
62 0 V
-41 7 R
0 1 V
-31 -1 R
62 0 V
-62 1 R
62 0 V
8 -32 R
0 1 V
-31 -1 R
62 0 V
-62 1 R
62 0 V
-21 -1 R
0 1 V
-31 -1 R
62 0 V
-62 1 R
62 0 V
-21 2 R
0 1 V
-31 -1 R
62 0 V
-62 1 R
62 0 V
-22 2 R
0 1 V
-31 -1 R
62 0 V
-62 1 R
62 0 V
-21 -1 R
0 1 V
-31 -1 R
62 0 V
-62 1 R
62 0 V
17 31 R
0 1 V
-31 -1 R
62 0 V
-62 1 R
62 0 V
18 107 R
0 1 V
-31 -1 R
62 0 V
-62 1 R
62 0 V
17 122 R
0 1 V
-31 -1 R
62 0 V
-62 1 R
62 0 V
18 122 R
0 1 V
-31 -1 R
62 0 V
-62 1 R
62 0 V
17 126 R
0 1 V
-31 -1 R
62 0 V
-62 1 R
62 0 V
18 118 R
0 1 V
-31 -1 R
62 0 V
-62 1 R
62 0 V
17 104 R
0 1 V
stroke 3412 1186 M
-31 -1 R
62 0 V
-62 1 R
62 0 V
18 95 R
0 1 V
-31 -1 R
62 0 V
-62 1 R
62 0 V
17 84 R
0 1 V
-31 -1 R
62 0 V
-62 1 R
62 0 V
17 73 R
0 1 V
-31 -1 R
62 0 V
-62 1 R
62 0 V
18 63 R
0 1 V
-31 -1 R
62 0 V
-62 1 R
62 0 V
17 56 R
0 1 V
-31 -1 R
62 0 V
-62 1 R
62 0 V
18 47 R
0 1 V
-31 -1 R
62 0 V
-62 1 R
62 0 V
17 41 R
0 1 V
-31 -1 R
62 0 V
-62 1 R
62 0 V
18 29 R
0 1 V
-31 -1 R
62 0 V
-62 1 R
62 0 V
66 80 R
0 1 V
-31 -1 R
62 0 V
-62 1 R
62 0 V
17 28 R
0 1 V
-31 -1 R
62 0 V
-62 1 R
62 0 V
17 30 R
0 1 V
-31 -1 R
62 0 V
-62 1 R
62 0 V
18 26 R
0 1 V
-31 -1 R
62 0 V
-62 1 R
62 0 V
17 27 R
0 1 V
-31 -1 R
62 0 V
-62 1 R
62 0 V
18 16 R
0 1 V
-31 -1 R
62 0 V
-62 1 R
62 0 V
17 -23 R
0 1 V
-31 -1 R
62 0 V
-62 1 R
62 0 V
-99 15 R
0 1 V
-31 -1 R
62 0 V
-62 1 R
62 0 V
8 3 R
0 1 V
-31 -1 R
62 0 V
stroke 4189 1892 M
-62 1 R
62 0 V
-41 1 R
0 1 V
-31 -1 R
62 0 V
-62 1 R
62 0 V
-50 -4 R
0 1 V
-31 -1 R
62 0 V
-62 1 R
62 0 V
76 -98 R
0 1 V
-31 -1 R
62 0 V
-62 1 R
62 0 V
17 -141 R
0 1 V
-31 -1 R
62 0 V
-62 1 R
62 0 V
17 -159 R
0 1 V
-31 -1 R
62 0 V
-62 1 R
62 0 V
18 -196 R
0 1 V
-31 -1 R
62 0 V
-62 1 R
62 0 V
17 -183 R
0 1 V
-31 -1 R
62 0 V
-62 1 R
62 0 V
18 -184 R
0 1 V
-31 -1 R
62 0 V
-62 1 R
62 0 V
17 -144 R
0 1 V
-31 -1 R
62 0 V
-62 1 R
62 0 V
18 -137 R
0 1 V
-31 -1 R
62 0 V
-62 1 R
62 0 V
17 -100 R
0 1 V
-31 -1 R
62 0 V
-62 1 R
62 0 V
18 -82 R
0 1 V
-31 -1 R
62 0 V
-62 1 R
62 0 V
17 -7 R
0 1 V
-31 -1 R
62 0 V
-62 1 R
62 0 V
17 127 R
0 1 V
-31 -1 R
62 0 V
-62 1 R
62 0 V
-40 -42 R
-31 0 R
62 0 V
-62 0 R
62 0 V
-41 -23 R
0 1 V
-31 -1 R
62 0 V
-62 1 R
62 0 V
-41 -27 R
0 1 V
-31 -1 R
62 0 V
-62 1 R
62 0 V
-40 -22 R
0 1 V
stroke 4730 489 M
-31 -1 R
62 0 V
-62 1 R
62 0 V
-51 -24 R
0 1 V
-31 -1 R
62 0 V
-62 1 R
62 0 V
-40 -6 R
0 1 V
-31 -1 R
62 0 V
-62 1 R
62 0 V
-41 1 R
0 1 V
-31 -1 R
62 0 V
-62 1 R
62 0 V
-41 3 R
0 1 V
-31 -1 R
62 0 V
-62 1 R
62 0 V
105 315 R
0 1 V
-31 -1 R
62 0 V
-62 1 R
62 0 V
17 182 R
-31 0 R
62 0 V
-62 0 R
62 0 V
18 195 R
0 1 V
-31 -1 R
62 0 V
-62 1 R
62 0 V
17 224 R
0 1 V
-31 -1 R
62 0 V
-62 1 R
62 0 V
18 215 R
0 1 V
-31 -1 R
62 0 V
-62 1 R
62 0 V
17 205 R
0 1 V
-31 -1 R
62 0 V
-62 1 R
62 0 V
18 198 R
0 1 V
-31 -1 R
62 0 V
-62 1 R
62 0 V
17 189 R
0 1 V
-31 -1 R
62 0 V
-62 1 R
62 0 V
17 179 R
0 1 V
-31 -1 R
62 0 V
-62 1 R
62 0 V
18 172 R
0 1 V
-31 -1 R
62 0 V
-62 1 R
62 0 V
17 163 R
0 1 V
-31 -1 R
62 0 V
-62 1 R
62 0 V
18 158 R
0 1 V
-31 -1 R
62 0 V
-62 1 R
62 0 V
17 143 R
0 1 V
-31 -1 R
62 0 V
-62 1 R
62 0 V
stroke 5429 3017 M
18 149 R
0 1 V
-31 -1 R
62 0 V
-62 1 R
62 0 V
17 138 R
0 1 V
-31 -1 R
62 0 V
-62 1 R
62 0 V
18 139 R
0 1 V
-31 -1 R
62 0 V
-62 1 R
62 0 V
17 144 R
0 1 V
-31 -1 R
62 0 V
-62 1 R
62 0 V
17 143 R
0 1 V
-31 -1 R
62 0 V
-62 1 R
62 0 V
18 148 R
0 1 V
-31 -1 R
62 0 V
-62 1 R
62 0 V
17 154 R
0 1 V
-31 -1 R
62 0 V
-62 1 R
62 0 V
18 129 R
0 1 V
-31 -1 R
62 0 V
-62 1 R
62 0 V
17 42 R
0 1 V
-31 -1 R
62 0 V
-62 1 R
62 0 V
18 -54 R
0 1 V
-31 -1 R
62 0 V
-62 1 R
62 0 V
-41 18 R
0 1 V
-31 -1 R
62 0 V
-62 1 R
62 0 V
-41 9 R
0 1 V
-31 -1 R
62 0 V
-62 1 R
62 0 V
-40 13 R
0 1 V
-31 -1 R
62 0 V
-62 1 R
62 0 V
-41 4 R
0 1 V
-31 -1 R
62 0 V
-62 1 R
62 0 V
-51 4 R
0 1 V
-31 -1 R
62 0 V
-62 1 R
62 0 V
-40 -6 R
0 1 V
-31 -1 R
62 0 V
-62 1 R
62 0 V
-41 -10 R
-31 0 R
62 0 V
-62 0 R
62 0 V
-41 -10 R
0 1 V
-31 -1 R
62 0 V
stroke 5826 4187 M
-62 1 R
62 0 V
66 -44 R
-31 0 R
62 0 V
-62 0 R
62 0 V
-21 -15 R
0 1 V
-31 -1 R
62 0 V
-62 1 R
62 0 V
-21 -25 R
0 1 V
-31 -1 R
62 0 V
-62 1 R
62 0 V
-22 -30 R
0 1 V
-31 -1 R
62 0 V
-62 1 R
62 0 V
-21 -39 R
0 1 V
-31 -1 R
62 0 V
-62 1 R
62 0 V
17 -156 R
0 1 V
-31 -1 R
62 0 V
-62 1 R
62 0 V
18 -222 R
0 1 V
-31 -1 R
62 0 V
-62 1 R
62 0 V
17 -223 R
0 1 V
-31 -1 R
62 0 V
-62 1 R
62 0 V
18 -232 R
0 1 V
-31 -1 R
62 0 V
-62 1 R
62 0 V
17 -165 R
0 1 V
-31 -1 R
62 0 V
-62 1 R
62 0 V
18 -25 R
0 1 V
-31 -1 R
62 0 V
-62 1 R
62 0 V
1038 482 Pls
1087 483 Pls
1135 483 Pls
1184 483 Pls
1232 483 Pls
1281 483 Pls
1329 484 Pls
1378 484 Pls
1407 483 Pls
1416 482 Pls
1426 479 Pls
1436 473 Pls
1445 466 Pls
1455 456 Pls
1465 442 Pls
1474 454 Pls
1484 468 Pls
1503 494 Pls
1523 523 Pls
1542 545 Pls
1571 581 Pls
1620 633 Pls
1668 681 Pls
1717 719 Pls
1765 753 Pls
1814 780 Pls
1862 808 Pls
1910 833 Pls
1959 860 Pls
2007 882 Pls
2056 902 Pls
2104 922 Pls
2153 943 Pls
2201 960 Pls
2249 977 Pls
2298 993 Pls
2346 1007 Pls
2395 1026 Pls
2443 1042 Pls
2492 1061 Pls
2540 1105 Pls
2569 1113 Pls
2589 1106 Pls
2608 1095 Pls
2579 1111 Pls
2598 1102 Pls
2637 1064 Pls
2685 992 Pls
2734 894 Pls
2782 792 Pls
2831 700 Pls
2879 614 Pls
2928 545 Pls
2976 491 Pls
3015 459 Pls
3025 450 Pls
3005 465 Pls
2995 473 Pls
3034 443 Pls
3044 442 Pls
3054 446 Pls
3063 449 Pls
3073 449 Pls
3121 480 Pls
3170 588 Pls
3218 712 Pls
3267 835 Pls
3315 961 Pls
3364 1081 Pls
3412 1186 Pls
3461 1281 Pls
3509 1367 Pls
3557 1440 Pls
3606 1505 Pls
3654 1561 Pls
3703 1609 Pls
3751 1652 Pls
3800 1682 Pls
3897 1762 Pls
3945 1791 Pls
3993 1823 Pls
4042 1849 Pls
4090 1877 Pls
4139 1894 Pls
4187 1872 Pls
4119 1889 Pls
4158 1893 Pls
4148 1895 Pls
4129 1892 Pls
4236 1794 Pls
4284 1654 Pls
4332 1497 Pls
4381 1301 Pls
4429 1120 Pls
4478 936 Pls
4526 793 Pls
4575 657 Pls
4623 558 Pls
4672 478 Pls
4720 471 Pls
4768 600 Pls
4759 558 Pls
4749 536 Pls
4739 509 Pls
4730 488 Pls
4710 466 Pls
4701 461 Pls
4691 463 Pls
4681 467 Pls
4817 783 Pls
4865 965 Pls
4914 1160 Pls
4962 1385 Pls
5011 1601 Pls
5059 1808 Pls
5108 2007 Pls
5156 2196 Pls
5204 2376 Pls
5253 2550 Pls
5301 2713 Pls
5350 2872 Pls
5398 3017 Pls
5447 3166 Pls
5495 3306 Pls
5544 3446 Pls
5592 3590 Pls
5640 3735 Pls
5689 3884 Pls
5737 4038 Pls
5786 4168 Pls
5834 4211 Pls
5883 4158 Pls
5873 4178 Pls
5863 4187 Pls
5854 4202 Pls
5844 4207 Pls
5824 4211 Pls
5815 4207 Pls
5805 4197 Pls
5795 4187 Pls
5892 4144 Pls
5902 4130 Pls
5912 4105 Pls
5921 4077 Pls
5931 4038 Pls
5979 3884 Pls
6028 3662 Pls
6076 3441 Pls
6125 3210 Pls
6173 3046 Pls
6222 3022 Pls
2737 4602 Pls
1.000 UL
LT1
LC1 setrgbcolor
LCb setrgbcolor
LT1
LC1 setrgbcolor
2442 4382 M
591 0 V
1149 440 M
17 9 V
59 28 V
59 29 V
58 28 V
59 28 V
59 29 V
58 28 V
59 29 V
59 28 V
59 29 V
58 28 V
59 29 V
59 28 V
58 29 V
59 28 V
59 29 V
59 28 V
58 29 V
59 28 V
59 29 V
58 28 V
59 29 V
59 28 V
59 29 V
58 28 V
59 28 V
59 29 V
59 28 V
58 29 V
59 28 V
59 29 V
58 28 V
59 29 V
59 28 V
59 29 V
58 28 V
59 29 V
59 28 V
58 29 V
59 28 V
59 29 V
59 28 V
58 29 V
59 28 V
59 29 V
58 28 V
59 28 V
59 29 V
59 28 V
58 29 V
59 28 V
59 29 V
58 28 V
59 29 V
59 28 V
59 29 V
58 28 V
59 29 V
59 28 V
58 29 V
59 28 V
59 29 V
59 28 V
58 29 V
59 28 V
59 29 V
58 28 V
59 28 V
59 29 V
59 28 V
58 29 V
59 28 V
59 29 V
59 28 V
58 29 V
59 28 V
59 29 V
58 28 V
59 29 V
59 28 V
59 29 V
58 28 V
59 29 V
59 28 V
58 29 V
59 28 V
59 29 V
59 28 V
58 29 V
59 28 V
59 28 V
58 29 V
59 28 V
59 29 V
59 28 V
58 29 V
59 28 V
stroke
LT2
LC2 setrgbcolor
LCb setrgbcolor
LT2
LC2 setrgbcolor
2442 4162 M
591 0 V
990 4111 M
59 -109 V
58 -108 V
59 -109 V
59 -108 V
59 -109 V
58 -108 V
59 -109 V
59 -108 V
58 -109 V
59 -108 V
59 -108 V
59 -109 V
58 -108 V
59 -109 V
59 -108 V
58 -109 V
59 -108 V
59 -109 V
59 -108 V
58 -108 V
59 -109 V
59 -108 V
58 -109 V
59 -108 V
59 -109 V
59 -108 V
58 -109 V
59 -108 V
59 -108 V
59 -109 V
58 -108 V
59 -109 V
59 -108 V
49 -92 V
stroke
LT3
LC3 setrgbcolor
LCb setrgbcolor
LT3
LC3 setrgbcolor
2442 3942 M
591 0 V
3005 440 M
40 61 V
59 89 V
59 89 V
58 89 V
59 89 V
59 90 V
58 89 V
59 89 V
59 89 V
59 90 V
58 89 V
59 89 V
59 89 V
58 89 V
59 90 V
59 89 V
59 89 V
58 89 V
59 90 V
59 89 V
58 89 V
59 89 V
59 90 V
59 89 V
58 89 V
59 89 V
59 89 V
58 90 V
59 89 V
59 89 V
59 89 V
58 90 V
59 89 V
59 89 V
58 89 V
59 89 V
59 90 V
59 89 V
58 89 V
59 89 V
59 90 V
59 89 V
58 89 V
59 89 V
59 89 V
58 90 V
59 89 V
59 89 V
53 81 V
stroke
LT4
LC4 setrgbcolor
LCb setrgbcolor
LT4
LC4 setrgbcolor
2442 3722 M
591 0 V
348 1053 R
16 -56 V
59 -204 V
59 -204 V
59 -204 V
58 -204 V
59 -204 V
59 -204 V
58 -204 V
59 -204 V
59 -204 V
59 -203 V
58 -204 V
59 -204 V
59 -204 V
58 -204 V
59 -204 V
59 -204 V
59 -204 V
58 -204 V
59 -204 V
59 -203 V
57 -201 V
stroke
LT5
LC5 setrgbcolor
LCb setrgbcolor
LT5
LC5 setrgbcolor
2442 3502 M
591 0 V
4682 440 M
7 24 V
59 206 V
59 207 V
58 206 V
59 206 V
59 207 V
58 206 V
59 206 V
59 207 V
59 206 V
58 206 V
59 207 V
59 206 V
59 206 V
58 207 V
59 206 V
59 206 V
58 207 V
59 206 V
59 206 V
59 207 V
52 184 V
stroke
LT6
LC6 setrgbcolor
LCb setrgbcolor
LT6
LC6 setrgbcolor
2442 3282 M
591 0 V
5740 4775 M
6 -24 V
59 -232 V
59 -233 V
58 -232 V
59 -232 V
59 -233 V
58 -232 V
59 -233 V
59 -232 V
59 -232 V
58 -233 V
59 -232 V
59 -232 V
58 -233 V
59 -232 V
59 -233 V
59 -232 V
58 -232 V
59 -233 V
stroke
LTb
LCb setrgbcolor
990 4775 N
990 440 L
5813 0 V
0 4335 V
-5813 0 V
Z stroke
1.000 UP
1.000 UL
LTb
stroke
grestore
end
showpage
%%Trailer
