\relax 
\providecommand\hyper@newdestlabel[2]{}
\bibstyle{biblatex}
\bibdata{Prohaupt-blx,literatur}
\citation{biblatex-control} 
\catcode `"\active 
\providecommand\HyperFirstAtBeginDocument{\AtBeginDocument}
\HyperFirstAtBeginDocument{\ifx\hyper@anchor\@undefined
\global\let\oldcontentsline\contentsline
\gdef\contentsline#1#2#3#4{\oldcontentsline{#1}{#2}{#3}}
\global\let\oldnewlabel\newlabel
\gdef\newlabel#1#2{\newlabelxx{#1}#2}
\gdef\newlabelxx#1#2#3#4#5#6{\oldnewlabel{#1}{{#2}{#3}}}
\AtEndDocument{\ifx\hyper@anchor\@undefined
\let\contentsline\oldcontentsline
\let\newlabel\oldnewlabel
\fi}
\fi}
\global\let\hyper@last\relax 
\gdef\HyperFirstAtBeginDocument#1{#1}
\providecommand\HyField@AuxAddToFields[1]{}
\providecommand\HyField@AuxAddToCoFields[2]{}
\providecommand \oddpage@label [2]{}
\@writefile{toc}{\boolfalse{citerequest}\boolfalse{citetracker}\boolfalse{pagetracker}}
\@writefile{lof}{\boolfalse{citerequest}\boolfalse{citetracker}\boolfalse{pagetracker}}
\@writefile{lot}{\boolfalse{citerequest}\boolfalse{citetracker}\boolfalse{pagetracker}}
\select@language{ngerman}
\@writefile{toc}{\defcounter{refsection}{0}}
\@writefile{toc}{\select@language{ngerman}}
\@writefile{lof}{\defcounter{refsection}{0}}
\@writefile{lof}{\select@language{ngerman}}
\@writefile{lot}{\defcounter{refsection}{0}}
\@writefile{lot}{\select@language{ngerman}}
\citation{hecht}
\citation{LP20}
\citation{LP20}
\citation{BergSchaef3}
\@writefile{toc}{\contentsline {section}{\numberline {1}Einleitung}{1}{section.1}}
\newlabel{sec:einleitung}{{1}{1}{Einleitung}{section.1}{}}
\@writefile{toc}{\contentsline {section}{\numberline {2}Theorie}{1}{section.2}}
\newlabel{sec:theorie}{{2}{1}{Theorie}{section.2}{}}
\@writefile{toc}{\contentsline {subsection}{\numberline {2.1}Polarisation}{1}{subsection.2.1}}
\@writefile{lof}{\contentsline {figure}{\numberline {1}{\ignorespaces Links: Lineare Polarisation, Rechts: Zirkulare Polarisation \cite [abgerufen am 18.03.15]{LP20}\relax }}{1}{figure.caption.1}}
\providecommand*\caption@xref[2]{\@setref\relax\@undefined{#1}}
\newlabel{fig:pol}{{1}{1}{Links: Lineare Polarisation, Rechts: Zirkulare Polarisation \cite [abgerufen am 18.03.15]{LP20}\relax }{figure.caption.1}{}}
\citation{LP20}
\citation{LP20}
\citation{BergSchaef3}
\@writefile{toc}{\contentsline {subsection}{\numberline {2.2}Fresnel'sche Formeln}{2}{subsection.2.2}}
\newlabel{eq:fresnel}{{2.2.1}{2}{Fresnel'sche Formeln}{equation.2.2.1}{}}
\@writefile{lof}{\contentsline {figure}{\numberline {2}{\ignorespaces Links: Zur Veranschaulichung der Winkel und Polarisationsrichtungen an einer dielektrischen Grenzschicht, rechts: Skizzierung der Schwingungsebene zwischen p- und s-polarisiertem Licht \cite [abgerufen am 18.03.15]{LP20}.\relax }}{2}{figure.caption.2}}
\newlabel{fig:winkel}{{2}{2}{Links: Zur Veranschaulichung der Winkel und Polarisationsrichtungen an einer dielektrischen Grenzschicht, rechts: Skizzierung der Schwingungsebene zwischen p- und s-polarisiertem Licht \cite [abgerufen am 18.03.15]{LP20}.\relax }{figure.caption.2}{}}
\citation{LP20}
\citation{LP20}
\citation{LP20}
\citation{LP20}
\citation{BergSchaef3}
\@writefile{toc}{\contentsline {subsection}{\numberline {2.3}Brewster'sches Gesetz}{3}{subsection.2.3}}
\newlabel{eq:brewster}{{2.3.1}{3}{Brewster'sches Gesetz}{equation.2.3.1}{}}
\@writefile{lof}{\contentsline {figure}{\numberline {3}{\ignorespaces Auftragung der Reflexionsverh\IeC {\"a}ltnisse f\IeC {\"u}r p- und s-polarisiertes Licht \cite [abgerufen am 18.03.15]{LP20}.\relax }}{3}{figure.caption.3}}
\newlabel{fig:reflexion}{{3}{3}{Auftragung der Reflexionsverhältnisse für p- und s-polarisiertes Licht \cite [abgerufen am 18.03.15]{LP20}.\relax }{figure.caption.3}{}}
\@writefile{lof}{\contentsline {figure}{\numberline {4}{\ignorespaces Schematische Zeichnung eines \textsc  {Nicol}'schen Prismas \cite [abgerufen am 18.03.15]{LP20}.\relax }}{3}{figure.caption.3}}
\newlabel{fig:nicol}{{4}{3}{Schematische Zeichnung eines \person {Nicol}'schen Prismas \cite [abgerufen am 18.03.15]{LP20}.\relax }{figure.caption.3}{}}
\@writefile{toc}{\contentsline {subsection}{\numberline {2.4}Doppelbrechung}{3}{subsection.2.4}}
\citation{BergSchaef3}
\citation{LP20}
\citation{LP20}
\@writefile{toc}{\contentsline {section}{\numberline {3}Aufbau und Durchf\IeC {\"u}hrung}{4}{section.3}}
\@writefile{toc}{\contentsline {subsection}{\numberline {3.1}Versuchsaufbau}{4}{subsection.3.1}}
\newlabel{sec:durchfuehrung}{{3.1}{4}{Versuchsaufbau}{subsection.3.1}{}}
\@writefile{lof}{\contentsline {figure}{\numberline {5}{\ignorespaces Versuchsaufbau: Hg: Quecksilberdampflampe, L: Linsen, F: Farbfilter, P: dichroitischer Polarisationsfilter, G: Glasprisma auf Drehtisch, A: Analysator, Ok: Messokular, $\alpha $: Einfallswinkel, $\theta $: Glanzwinkel, $\phi $: Drehwinkel \cite [abgerufen am 18.03.15]{LP20}.\relax }}{4}{figure.caption.4}}
\newlabel{fig:aufbau}{{5}{4}{Versuchsaufbau: Hg: Quecksilberdampflampe, L: Linsen, F: Farbfilter, P: dichroitischer Polarisationsfilter, G: Glasprisma auf Drehtisch, A: Analysator, Ok: Messokular, $\alpha $: Einfallswinkel, $\theta $: Glanzwinkel, $\phi $: Drehwinkel \cite [abgerufen am 18.03.15]{LP20}.\relax }{figure.caption.4}{}}
\@writefile{toc}{\contentsline {subsection}{\numberline {3.2}Durchf\IeC {\"u}hrung}{5}{subsection.3.2}}
\@writefile{toc}{\contentsline {section}{\numberline {4}Auswertung}{6}{section.4}}
\newlabel{sec:auswertung}{{4}{6}{Auswertung}{section.4}{}}
\@writefile{toc}{\contentsline {subsection}{\numberline {4.1}Drehung der Schwingungsebene}{6}{subsection.4.1}}
\@writefile{toc}{\contentsline {subsubsection}{\numberline {4.1.1}Umrechnung der Rohdaten und Fehlerintervalle}{6}{subsubsection.4.1.1}}
\newlabel{eq:alpha}{{4.1.1}{6}{Umrechnung der Rohdaten und Fehlerintervalle}{equation.4.1.1}{}}
\@writefile{lot}{\contentsline {table}{\numberline {1}{\ignorespaces Zusammenfassung der Messwerte\relax }}{7}{table.caption.5}}
\newlabel{tab:mess}{{1}{7}{Zusammenfassung der Messwerte\relax }{table.caption.5}{}}
\@writefile{toc}{\contentsline {subsubsection}{\numberline {4.1.2}Bestimmung des Brechungsindex des Glasprismas}{7}{subsubsection.4.1.2}}
\newlabel{eq:tan}{{4.1.2}{7}{Bestimmung des Brechungsindex des Glasprismas}{equation.4.1.2}{}}
\newlabel{eq:tan2}{{4.1.3}{7}{Bestimmung des Brechungsindex des Glasprismas}{equation.4.1.3}{}}
\@writefile{lof}{\contentsline {figure}{\numberline {6}{\ignorespaces Blau: Auftragung der Drehung $\gamma $ \IeC {\"u}ber dem Einfallswinkel, rot: Regressionsgerade $f(\alpha )$, schwarz: Theoriewerte mit Fehlerbalken der gemessenen Einfallswinkel $\alpha $, gr\IeC {\"u}n/grau: Theoriekurve mit eingezeichnetem Fehlerschlauch.\relax }}{8}{figure.caption.6}}
\newlabel{fig:plot1}{{6}{8}{Blau: Auftragung der Drehung $\gamma $ über dem Einfallswinkel, rot: Regressionsgerade $f(\alpha )$, schwarz: Theoriewerte mit Fehlerbalken der gemessenen Einfallswinkel $\alpha $, grün/grau: Theoriekurve mit eingezeichnetem Fehlerschlauch.\relax }{figure.caption.6}{}}
\newlabel{eq:sprung1}{{4.1.4}{8}{Bestimmung des Brechungsindex des Glasprismas}{equation.4.1.4}{}}
\newlabel{eq:sprung2}{{4.1.5}{8}{Bestimmung des Brechungsindex des Glasprismas}{equation.4.1.5}{}}
\newlabel{eq:45}{{4.1.6}{8}{Bestimmung des Brechungsindex des Glasprismas}{equation.4.1.6}{}}
\citation{prakti}
\newlabel{eq:regression}{{4.1.7}{9}{Bestimmung des Brechungsindex des Glasprismas}{equation.4.1.7}{}}
\newlabel{eq:alphafit}{{4.1.8}{9}{Bestimmung des Brechungsindex des Glasprismas}{equation.4.1.8}{}}
\newlabel{eq:nfit}{{4.1.10}{9}{Bestimmung des Brechungsindex des Glasprismas}{equation.4.1.10}{}}
\@writefile{toc}{\contentsline {subsubsection}{\numberline {4.1.3}Vergleich der gemessenen Drehung mit dem Experiment}{9}{subsubsection.4.1.3}}
\newlabel{eq:theo}{{4.1.12}{9}{Vergleich der gemessenen Drehung mit dem Experiment}{equation.4.1.12}{}}
\newlabel{eq:theofehler}{{4.1.13}{10}{Vergleich der gemessenen Drehung mit dem Experiment}{equation.4.1.13}{}}
\newlabel{eq:abweichung}{{4.1.16}{10}{Vergleich der gemessenen Drehung mit dem Experiment}{equation.4.1.16}{}}
\@writefile{toc}{\contentsline {subsection}{\numberline {4.2}Direkte Messung des Brewsterwinkels}{10}{subsection.4.2}}
\@writefile{lot}{\contentsline {table}{\numberline {2}{\ignorespaces Messwerte vom Brewsterwinkel\relax }}{10}{table.caption.8}}
\newlabel{tab:brewster}{{2}{10}{Messwerte vom Brewsterwinkel\relax }{table.caption.8}{}}
\newlabel{eq:mittelbrew}{{4.2.1}{10}{Direkte Messung des Brewsterwinkels}{equation.4.2.1}{}}
\@writefile{lof}{\contentsline {figure}{\numberline {7}{\ignorespaces Blau: Abweichung der Messwerte von $\gamma $ zu den Theoriewerten nach Gleichung \textup  {\hbox {\mathsurround \z@ \normalfont  (\ignorespaces \ref  {eq:theo}\unskip \@@italiccorr )}}, grau: Abweichung mit Einbeziehung der $\alpha $-Ungenauigkeit der Messwerte.\relax }}{11}{figure.caption.7}}
\newlabel{fig:plot2}{{7}{11}{Blau: Abweichung der Messwerte von $\gamma $ zu den Theoriewerten nach Gleichung \eqref {eq:theo}, grau: Abweichung mit Einbeziehung der $\alpha $-Ungenauigkeit der Messwerte.\relax }{figure.caption.7}{}}
\newlabel{eq:nbrew}{{4.2.2}{11}{Direkte Messung des Brewsterwinkels}{equation.4.2.2}{}}
\newlabel{eq:sigmanbrew}{{4.2.3}{11}{Direkte Messung des Brewsterwinkels}{equation.4.2.3}{}}
\@writefile{toc}{\contentsline {section}{\numberline {5}Diskussion}{11}{section.5}}
\newlabel{sec:diskussion}{{5}{11}{Diskussion}{section.5}{}}
\@writefile{toc}{\contentsline {subsection}{\numberline {5.1}Bestimmung des Brechungsindex aus der Drehung der Schwingungsebene}{11}{subsection.5.1}}
\@writefile{toc}{\contentsline {subsection}{\numberline {5.2}Vergleich der gemessenen Drehung $\gamma $ mit der Theoriekurve}{12}{subsection.5.2}}
\@writefile{toc}{\contentsline {subsection}{\numberline {5.3}Direkte Messung des Brewsterwinkels}{12}{subsection.5.3}}
\@writefile{toc}{\contentsline {section}{\nonumberline Literatur}{14}{section*.9}}
