%!PS-Adobe-2.0 EPSF-2.0
%%Title: d0_f0_extrema.tex
%%Creator: gnuplot 4.6 patchlevel 1
%%CreationDate: Wed May 28 11:52:30 2014
%%DocumentFonts: 
%%BoundingBox: 50 50 410 302
%%EndComments
%%BeginProlog
/gnudict 256 dict def
gnudict begin
%
% The following true/false flags may be edited by hand if desired.
% The unit line width and grayscale image gamma correction may also be changed.
%
/Color true def
/Blacktext true def
/Solid false def
/Dashlength 1 def
/Landscape false def
/Level1 false def
/Rounded false def
/ClipToBoundingBox false def
/SuppressPDFMark false def
/TransparentPatterns false def
/gnulinewidth 5.000 def
/userlinewidth gnulinewidth def
/Gamma 1.0 def
/BackgroundColor {-1.000 -1.000 -1.000} def
%
/vshift -73 def
/dl1 {
  10.0 Dashlength mul mul
  Rounded { currentlinewidth 0.75 mul sub dup 0 le { pop 0.01 } if } if
} def
/dl2 {
  10.0 Dashlength mul mul
  Rounded { currentlinewidth 0.75 mul add } if
} def
/hpt_ 31.5 def
/vpt_ 31.5 def
/hpt hpt_ def
/vpt vpt_ def
/doclip {
  ClipToBoundingBox {
    newpath 50 50 moveto 410 50 lineto 410 302 lineto 50 302 lineto closepath
    clip
  } if
} def
%
% Gnuplot Prolog Version 4.6 (September 2012)
%
%/SuppressPDFMark true def
%
/M {moveto} bind def
/L {lineto} bind def
/R {rmoveto} bind def
/V {rlineto} bind def
/N {newpath moveto} bind def
/Z {closepath} bind def
/C {setrgbcolor} bind def
/f {rlineto fill} bind def
/g {setgray} bind def
/Gshow {show} def   % May be redefined later in the file to support UTF-8
/vpt2 vpt 2 mul def
/hpt2 hpt 2 mul def
/Lshow {currentpoint stroke M 0 vshift R 
	Blacktext {gsave 0 setgray show grestore} {show} ifelse} def
/Rshow {currentpoint stroke M dup stringwidth pop neg vshift R
	Blacktext {gsave 0 setgray show grestore} {show} ifelse} def
/Cshow {currentpoint stroke M dup stringwidth pop -2 div vshift R 
	Blacktext {gsave 0 setgray show grestore} {show} ifelse} def
/UP {dup vpt_ mul /vpt exch def hpt_ mul /hpt exch def
  /hpt2 hpt 2 mul def /vpt2 vpt 2 mul def} def
/DL {Color {setrgbcolor Solid {pop []} if 0 setdash}
 {pop pop pop 0 setgray Solid {pop []} if 0 setdash} ifelse} def
/BL {stroke userlinewidth 2 mul setlinewidth
	Rounded {1 setlinejoin 1 setlinecap} if} def
/AL {stroke userlinewidth 2 div setlinewidth
	Rounded {1 setlinejoin 1 setlinecap} if} def
/UL {dup gnulinewidth mul /userlinewidth exch def
	dup 1 lt {pop 1} if 10 mul /udl exch def} def
/PL {stroke userlinewidth setlinewidth
	Rounded {1 setlinejoin 1 setlinecap} if} def
3.8 setmiterlimit
% Default Line colors
/LCw {1 1 1} def
/LCb {0 0 0} def
/LCa {0 0 0} def
/LC0 {1 0 0} def
/LC1 {0 1 0} def
/LC2 {0 0 1} def
/LC3 {1 0 1} def
/LC4 {0 1 1} def
/LC5 {1 1 0} def
/LC6 {0 0 0} def
/LC7 {1 0.3 0} def
/LC8 {0.5 0.5 0.5} def
% Default Line Types
/LTw {PL [] 1 setgray} def
/LTb {BL [] LCb DL} def
/LTa {AL [1 udl mul 2 udl mul] 0 setdash LCa setrgbcolor} def
/LT0 {PL [] LC0 DL} def
/LT1 {PL [4 dl1 2 dl2] LC1 DL} def
/LT2 {PL [2 dl1 3 dl2] LC2 DL} def
/LT3 {PL [1 dl1 1.5 dl2] LC3 DL} def
/LT4 {PL [6 dl1 2 dl2 1 dl1 2 dl2] LC4 DL} def
/LT5 {PL [3 dl1 3 dl2 1 dl1 3 dl2] LC5 DL} def
/LT6 {PL [2 dl1 2 dl2 2 dl1 6 dl2] LC6 DL} def
/LT7 {PL [1 dl1 2 dl2 6 dl1 2 dl2 1 dl1 2 dl2] LC7 DL} def
/LT8 {PL [2 dl1 2 dl2 2 dl1 2 dl2 2 dl1 2 dl2 2 dl1 4 dl2] LC8 DL} def
/Pnt {stroke [] 0 setdash gsave 1 setlinecap M 0 0 V stroke grestore} def
/Dia {stroke [] 0 setdash 2 copy vpt add M
  hpt neg vpt neg V hpt vpt neg V
  hpt vpt V hpt neg vpt V closepath stroke
  Pnt} def
/Pls {stroke [] 0 setdash vpt sub M 0 vpt2 V
  currentpoint stroke M
  hpt neg vpt neg R hpt2 0 V stroke
 } def
/Box {stroke [] 0 setdash 2 copy exch hpt sub exch vpt add M
  0 vpt2 neg V hpt2 0 V 0 vpt2 V
  hpt2 neg 0 V closepath stroke
  Pnt} def
/Crs {stroke [] 0 setdash exch hpt sub exch vpt add M
  hpt2 vpt2 neg V currentpoint stroke M
  hpt2 neg 0 R hpt2 vpt2 V stroke} def
/TriU {stroke [] 0 setdash 2 copy vpt 1.12 mul add M
  hpt neg vpt -1.62 mul V
  hpt 2 mul 0 V
  hpt neg vpt 1.62 mul V closepath stroke
  Pnt} def
/Star {2 copy Pls Crs} def
/BoxF {stroke [] 0 setdash exch hpt sub exch vpt add M
  0 vpt2 neg V hpt2 0 V 0 vpt2 V
  hpt2 neg 0 V closepath fill} def
/TriUF {stroke [] 0 setdash vpt 1.12 mul add M
  hpt neg vpt -1.62 mul V
  hpt 2 mul 0 V
  hpt neg vpt 1.62 mul V closepath fill} def
/TriD {stroke [] 0 setdash 2 copy vpt 1.12 mul sub M
  hpt neg vpt 1.62 mul V
  hpt 2 mul 0 V
  hpt neg vpt -1.62 mul V closepath stroke
  Pnt} def
/TriDF {stroke [] 0 setdash vpt 1.12 mul sub M
  hpt neg vpt 1.62 mul V
  hpt 2 mul 0 V
  hpt neg vpt -1.62 mul V closepath fill} def
/DiaF {stroke [] 0 setdash vpt add M
  hpt neg vpt neg V hpt vpt neg V
  hpt vpt V hpt neg vpt V closepath fill} def
/Pent {stroke [] 0 setdash 2 copy gsave
  translate 0 hpt M 4 {72 rotate 0 hpt L} repeat
  closepath stroke grestore Pnt} def
/PentF {stroke [] 0 setdash gsave
  translate 0 hpt M 4 {72 rotate 0 hpt L} repeat
  closepath fill grestore} def
/Circle {stroke [] 0 setdash 2 copy
  hpt 0 360 arc stroke Pnt} def
/CircleF {stroke [] 0 setdash hpt 0 360 arc fill} def
/C0 {BL [] 0 setdash 2 copy moveto vpt 90 450 arc} bind def
/C1 {BL [] 0 setdash 2 copy moveto
	2 copy vpt 0 90 arc closepath fill
	vpt 0 360 arc closepath} bind def
/C2 {BL [] 0 setdash 2 copy moveto
	2 copy vpt 90 180 arc closepath fill
	vpt 0 360 arc closepath} bind def
/C3 {BL [] 0 setdash 2 copy moveto
	2 copy vpt 0 180 arc closepath fill
	vpt 0 360 arc closepath} bind def
/C4 {BL [] 0 setdash 2 copy moveto
	2 copy vpt 180 270 arc closepath fill
	vpt 0 360 arc closepath} bind def
/C5 {BL [] 0 setdash 2 copy moveto
	2 copy vpt 0 90 arc
	2 copy moveto
	2 copy vpt 180 270 arc closepath fill
	vpt 0 360 arc} bind def
/C6 {BL [] 0 setdash 2 copy moveto
	2 copy vpt 90 270 arc closepath fill
	vpt 0 360 arc closepath} bind def
/C7 {BL [] 0 setdash 2 copy moveto
	2 copy vpt 0 270 arc closepath fill
	vpt 0 360 arc closepath} bind def
/C8 {BL [] 0 setdash 2 copy moveto
	2 copy vpt 270 360 arc closepath fill
	vpt 0 360 arc closepath} bind def
/C9 {BL [] 0 setdash 2 copy moveto
	2 copy vpt 270 450 arc closepath fill
	vpt 0 360 arc closepath} bind def
/C10 {BL [] 0 setdash 2 copy 2 copy moveto vpt 270 360 arc closepath fill
	2 copy moveto
	2 copy vpt 90 180 arc closepath fill
	vpt 0 360 arc closepath} bind def
/C11 {BL [] 0 setdash 2 copy moveto
	2 copy vpt 0 180 arc closepath fill
	2 copy moveto
	2 copy vpt 270 360 arc closepath fill
	vpt 0 360 arc closepath} bind def
/C12 {BL [] 0 setdash 2 copy moveto
	2 copy vpt 180 360 arc closepath fill
	vpt 0 360 arc closepath} bind def
/C13 {BL [] 0 setdash 2 copy moveto
	2 copy vpt 0 90 arc closepath fill
	2 copy moveto
	2 copy vpt 180 360 arc closepath fill
	vpt 0 360 arc closepath} bind def
/C14 {BL [] 0 setdash 2 copy moveto
	2 copy vpt 90 360 arc closepath fill
	vpt 0 360 arc} bind def
/C15 {BL [] 0 setdash 2 copy vpt 0 360 arc closepath fill
	vpt 0 360 arc closepath} bind def
/Rec {newpath 4 2 roll moveto 1 index 0 rlineto 0 exch rlineto
	neg 0 rlineto closepath} bind def
/Square {dup Rec} bind def
/Bsquare {vpt sub exch vpt sub exch vpt2 Square} bind def
/S0 {BL [] 0 setdash 2 copy moveto 0 vpt rlineto BL Bsquare} bind def
/S1 {BL [] 0 setdash 2 copy vpt Square fill Bsquare} bind def
/S2 {BL [] 0 setdash 2 copy exch vpt sub exch vpt Square fill Bsquare} bind def
/S3 {BL [] 0 setdash 2 copy exch vpt sub exch vpt2 vpt Rec fill Bsquare} bind def
/S4 {BL [] 0 setdash 2 copy exch vpt sub exch vpt sub vpt Square fill Bsquare} bind def
/S5 {BL [] 0 setdash 2 copy 2 copy vpt Square fill
	exch vpt sub exch vpt sub vpt Square fill Bsquare} bind def
/S6 {BL [] 0 setdash 2 copy exch vpt sub exch vpt sub vpt vpt2 Rec fill Bsquare} bind def
/S7 {BL [] 0 setdash 2 copy exch vpt sub exch vpt sub vpt vpt2 Rec fill
	2 copy vpt Square fill Bsquare} bind def
/S8 {BL [] 0 setdash 2 copy vpt sub vpt Square fill Bsquare} bind def
/S9 {BL [] 0 setdash 2 copy vpt sub vpt vpt2 Rec fill Bsquare} bind def
/S10 {BL [] 0 setdash 2 copy vpt sub vpt Square fill 2 copy exch vpt sub exch vpt Square fill
	Bsquare} bind def
/S11 {BL [] 0 setdash 2 copy vpt sub vpt Square fill 2 copy exch vpt sub exch vpt2 vpt Rec fill
	Bsquare} bind def
/S12 {BL [] 0 setdash 2 copy exch vpt sub exch vpt sub vpt2 vpt Rec fill Bsquare} bind def
/S13 {BL [] 0 setdash 2 copy exch vpt sub exch vpt sub vpt2 vpt Rec fill
	2 copy vpt Square fill Bsquare} bind def
/S14 {BL [] 0 setdash 2 copy exch vpt sub exch vpt sub vpt2 vpt Rec fill
	2 copy exch vpt sub exch vpt Square fill Bsquare} bind def
/S15 {BL [] 0 setdash 2 copy Bsquare fill Bsquare} bind def
/D0 {gsave translate 45 rotate 0 0 S0 stroke grestore} bind def
/D1 {gsave translate 45 rotate 0 0 S1 stroke grestore} bind def
/D2 {gsave translate 45 rotate 0 0 S2 stroke grestore} bind def
/D3 {gsave translate 45 rotate 0 0 S3 stroke grestore} bind def
/D4 {gsave translate 45 rotate 0 0 S4 stroke grestore} bind def
/D5 {gsave translate 45 rotate 0 0 S5 stroke grestore} bind def
/D6 {gsave translate 45 rotate 0 0 S6 stroke grestore} bind def
/D7 {gsave translate 45 rotate 0 0 S7 stroke grestore} bind def
/D8 {gsave translate 45 rotate 0 0 S8 stroke grestore} bind def
/D9 {gsave translate 45 rotate 0 0 S9 stroke grestore} bind def
/D10 {gsave translate 45 rotate 0 0 S10 stroke grestore} bind def
/D11 {gsave translate 45 rotate 0 0 S11 stroke grestore} bind def
/D12 {gsave translate 45 rotate 0 0 S12 stroke grestore} bind def
/D13 {gsave translate 45 rotate 0 0 S13 stroke grestore} bind def
/D14 {gsave translate 45 rotate 0 0 S14 stroke grestore} bind def
/D15 {gsave translate 45 rotate 0 0 S15 stroke grestore} bind def
/DiaE {stroke [] 0 setdash vpt add M
  hpt neg vpt neg V hpt vpt neg V
  hpt vpt V hpt neg vpt V closepath stroke} def
/BoxE {stroke [] 0 setdash exch hpt sub exch vpt add M
  0 vpt2 neg V hpt2 0 V 0 vpt2 V
  hpt2 neg 0 V closepath stroke} def
/TriUE {stroke [] 0 setdash vpt 1.12 mul add M
  hpt neg vpt -1.62 mul V
  hpt 2 mul 0 V
  hpt neg vpt 1.62 mul V closepath stroke} def
/TriDE {stroke [] 0 setdash vpt 1.12 mul sub M
  hpt neg vpt 1.62 mul V
  hpt 2 mul 0 V
  hpt neg vpt -1.62 mul V closepath stroke} def
/PentE {stroke [] 0 setdash gsave
  translate 0 hpt M 4 {72 rotate 0 hpt L} repeat
  closepath stroke grestore} def
/CircE {stroke [] 0 setdash 
  hpt 0 360 arc stroke} def
/Opaque {gsave closepath 1 setgray fill grestore 0 setgray closepath} def
/DiaW {stroke [] 0 setdash vpt add M
  hpt neg vpt neg V hpt vpt neg V
  hpt vpt V hpt neg vpt V Opaque stroke} def
/BoxW {stroke [] 0 setdash exch hpt sub exch vpt add M
  0 vpt2 neg V hpt2 0 V 0 vpt2 V
  hpt2 neg 0 V Opaque stroke} def
/TriUW {stroke [] 0 setdash vpt 1.12 mul add M
  hpt neg vpt -1.62 mul V
  hpt 2 mul 0 V
  hpt neg vpt 1.62 mul V Opaque stroke} def
/TriDW {stroke [] 0 setdash vpt 1.12 mul sub M
  hpt neg vpt 1.62 mul V
  hpt 2 mul 0 V
  hpt neg vpt -1.62 mul V Opaque stroke} def
/PentW {stroke [] 0 setdash gsave
  translate 0 hpt M 4 {72 rotate 0 hpt L} repeat
  Opaque stroke grestore} def
/CircW {stroke [] 0 setdash 
  hpt 0 360 arc Opaque stroke} def
/BoxFill {gsave Rec 1 setgray fill grestore} def
/Density {
  /Fillden exch def
  currentrgbcolor
  /ColB exch def /ColG exch def /ColR exch def
  /ColR ColR Fillden mul Fillden sub 1 add def
  /ColG ColG Fillden mul Fillden sub 1 add def
  /ColB ColB Fillden mul Fillden sub 1 add def
  ColR ColG ColB setrgbcolor} def
/BoxColFill {gsave Rec PolyFill} def
/PolyFill {gsave Density fill grestore grestore} def
/h {rlineto rlineto rlineto gsave closepath fill grestore} bind def
%
% PostScript Level 1 Pattern Fill routine for rectangles
% Usage: x y w h s a XX PatternFill
%	x,y = lower left corner of box to be filled
%	w,h = width and height of box
%	  a = angle in degrees between lines and x-axis
%	 XX = 0/1 for no/yes cross-hatch
%
/PatternFill {gsave /PFa [ 9 2 roll ] def
  PFa 0 get PFa 2 get 2 div add PFa 1 get PFa 3 get 2 div add translate
  PFa 2 get -2 div PFa 3 get -2 div PFa 2 get PFa 3 get Rec
  TransparentPatterns {} {gsave 1 setgray fill grestore} ifelse
  clip
  currentlinewidth 0.5 mul setlinewidth
  /PFs PFa 2 get dup mul PFa 3 get dup mul add sqrt def
  0 0 M PFa 5 get rotate PFs -2 div dup translate
  0 1 PFs PFa 4 get div 1 add floor cvi
	{PFa 4 get mul 0 M 0 PFs V} for
  0 PFa 6 get ne {
	0 1 PFs PFa 4 get div 1 add floor cvi
	{PFa 4 get mul 0 2 1 roll M PFs 0 V} for
 } if
  stroke grestore} def
%
/languagelevel where
 {pop languagelevel} {1} ifelse
 2 lt
	{/InterpretLevel1 true def}
	{/InterpretLevel1 Level1 def}
 ifelse
%
% PostScript level 2 pattern fill definitions
%
/Level2PatternFill {
/Tile8x8 {/PaintType 2 /PatternType 1 /TilingType 1 /BBox [0 0 8 8] /XStep 8 /YStep 8}
	bind def
/KeepColor {currentrgbcolor [/Pattern /DeviceRGB] setcolorspace} bind def
<< Tile8x8
 /PaintProc {0.5 setlinewidth pop 0 0 M 8 8 L 0 8 M 8 0 L stroke} 
>> matrix makepattern
/Pat1 exch def
<< Tile8x8
 /PaintProc {0.5 setlinewidth pop 0 0 M 8 8 L 0 8 M 8 0 L stroke
	0 4 M 4 8 L 8 4 L 4 0 L 0 4 L stroke}
>> matrix makepattern
/Pat2 exch def
<< Tile8x8
 /PaintProc {0.5 setlinewidth pop 0 0 M 0 8 L
	8 8 L 8 0 L 0 0 L fill}
>> matrix makepattern
/Pat3 exch def
<< Tile8x8
 /PaintProc {0.5 setlinewidth pop -4 8 M 8 -4 L
	0 12 M 12 0 L stroke}
>> matrix makepattern
/Pat4 exch def
<< Tile8x8
 /PaintProc {0.5 setlinewidth pop -4 0 M 8 12 L
	0 -4 M 12 8 L stroke}
>> matrix makepattern
/Pat5 exch def
<< Tile8x8
 /PaintProc {0.5 setlinewidth pop -2 8 M 4 -4 L
	0 12 M 8 -4 L 4 12 M 10 0 L stroke}
>> matrix makepattern
/Pat6 exch def
<< Tile8x8
 /PaintProc {0.5 setlinewidth pop -2 0 M 4 12 L
	0 -4 M 8 12 L 4 -4 M 10 8 L stroke}
>> matrix makepattern
/Pat7 exch def
<< Tile8x8
 /PaintProc {0.5 setlinewidth pop 8 -2 M -4 4 L
	12 0 M -4 8 L 12 4 M 0 10 L stroke}
>> matrix makepattern
/Pat8 exch def
<< Tile8x8
 /PaintProc {0.5 setlinewidth pop 0 -2 M 12 4 L
	-4 0 M 12 8 L -4 4 M 8 10 L stroke}
>> matrix makepattern
/Pat9 exch def
/Pattern1 {PatternBgnd KeepColor Pat1 setpattern} bind def
/Pattern2 {PatternBgnd KeepColor Pat2 setpattern} bind def
/Pattern3 {PatternBgnd KeepColor Pat3 setpattern} bind def
/Pattern4 {PatternBgnd KeepColor Landscape {Pat5} {Pat4} ifelse setpattern} bind def
/Pattern5 {PatternBgnd KeepColor Landscape {Pat4} {Pat5} ifelse setpattern} bind def
/Pattern6 {PatternBgnd KeepColor Landscape {Pat9} {Pat6} ifelse setpattern} bind def
/Pattern7 {PatternBgnd KeepColor Landscape {Pat8} {Pat7} ifelse setpattern} bind def
} def
%
%
%End of PostScript Level 2 code
%
/PatternBgnd {
  TransparentPatterns {} {gsave 1 setgray fill grestore} ifelse
} def
%
% Substitute for Level 2 pattern fill codes with
% grayscale if Level 2 support is not selected.
%
/Level1PatternFill {
/Pattern1 {0.250 Density} bind def
/Pattern2 {0.500 Density} bind def
/Pattern3 {0.750 Density} bind def
/Pattern4 {0.125 Density} bind def
/Pattern5 {0.375 Density} bind def
/Pattern6 {0.625 Density} bind def
/Pattern7 {0.875 Density} bind def
} def
%
% Now test for support of Level 2 code
%
Level1 {Level1PatternFill} {Level2PatternFill} ifelse
%
/Symbol-Oblique /Symbol findfont [1 0 .167 1 0 0] makefont
dup length dict begin {1 index /FID eq {pop pop} {def} ifelse} forall
currentdict end definefont pop
Level1 SuppressPDFMark or 
{} {
/SDict 10 dict def
systemdict /pdfmark known not {
  userdict /pdfmark systemdict /cleartomark get put
} if
SDict begin [
  /Title (d0_f0_extrema.tex)
  /Subject (gnuplot plot)
  /Creator (gnuplot 4.6 patchlevel 1)
  /Author (kevin.luedemann)
%  /Producer (gnuplot)
%  /Keywords ()
  /CreationDate (Wed May 28 11:52:30 2014)
  /DOCINFO pdfmark
end
} ifelse
end
%%EndProlog
%%Page: 1 1
gnudict begin
gsave
doclip
50 50 translate
0.050 0.050 scale
0 setgray
newpath
1.000 UL
LTb
LCb setrgbcolor
1078 704 M
63 0 V
5662 0 R
-63 0 V
stroke
LTb
1078 1156 M
63 0 V
5662 0 R
-63 0 V
1078 1609 M
63 0 V
5662 0 R
-63 0 V
1078 2061 M
63 0 V
5662 0 R
-63 0 V
1078 2513 M
63 0 V
5662 0 R
-63 0 V
1078 2966 M
63 0 V
5662 0 R
-63 0 V
1078 3418 M
63 0 V
5662 0 R
-63 0 V
1078 3870 M
63 0 V
5662 0 R
-63 0 V
1078 4323 M
63 0 V
5662 0 R
-63 0 V
1078 4775 M
63 0 V
5662 0 R
-63 0 V
1078 704 M
0 63 V
0 4008 R
0 -63 V
1651 704 M
0 63 V
0 4008 R
0 -63 V
2223 704 M
0 63 V
0 4008 R
0 -63 V
2796 704 M
0 63 V
0 4008 R
0 -63 V
3368 704 M
0 63 V
0 4008 R
0 -63 V
3941 704 M
0 63 V
0 4008 R
0 -63 V
4513 704 M
0 63 V
0 4008 R
0 -63 V
5086 704 M
0 63 V
0 4008 R
0 -63 V
5658 704 M
0 63 V
0 4008 R
0 -63 V
6231 704 M
0 63 V
0 4008 R
0 -63 V
6803 704 M
0 63 V
0 4008 R
0 -63 V
stroke
1078 4775 N
0 -4071 V
5725 0 V
0 4071 V
-5725 0 V
Z stroke
1.000 UP
1.000 UL
LTb
1.000 UP
1.000 UL
LT0
LC0 setrgbcolor
LCb setrgbcolor
LT0
LC0 setrgbcolor
5948 4602 M
591 0 V
-591 31 R
0 -62 V
591 62 R
0 -62 V
1099 4506 M
0 12 V
-31 -12 R
62 0 V
-62 12 R
62 0 V
15 6 R
0 -12 V
-31 12 R
62 0 V
-62 -12 R
62 0 V
15 -50 R
0 13 V
-31 -13 R
62 0 V
-62 13 R
62 0 V
15 0 R
0 -13 V
-31 13 R
62 0 V
-62 -13 R
62 0 V
15 -46 R
0 13 V
-31 -13 R
62 0 V
-62 13 R
62 0 V
14 0 R
0 -13 V
-31 13 R
62 0 V
-62 -13 R
62 0 V
14 -57 R
0 15 V
-31 -15 R
62 0 V
-62 15 R
62 0 V
15 7 R
0 -14 V
-31 14 R
62 0 V
-62 -14 R
62 0 V
14 -52 R
0 15 V
-31 -15 R
62 0 V
-62 15 R
62 0 V
14 0 R
0 -15 V
-31 15 R
62 0 V
-62 -15 R
62 0 V
14 -55 R
0 16 V
-31 -16 R
62 0 V
-62 16 R
62 0 V
15 8 R
0 -16 V
-31 16 R
62 0 V
-62 -16 R
62 0 V
13 -58 R
0 17 V
-31 -17 R
62 0 V
-62 17 R
62 0 V
14 9 R
0 -17 V
-31 17 R
62 0 V
-62 -17 R
62 0 V
14 -52 R
0 17 V
-31 -17 R
62 0 V
-62 17 R
62 0 V
13 0 R
0 -17 V
-31 17 R
62 0 V
-62 -17 R
62 0 V
15 -46 R
0 18 V
-31 -18 R
62 0 V
stroke 1855 4121 M
-62 18 R
62 0 V
14 0 R
0 -18 V
-31 18 R
62 0 V
-62 -18 R
62 0 V
13 -49 R
0 20 V
-31 -20 R
62 0 V
-62 20 R
62 0 V
14 0 R
0 -20 V
-31 20 R
62 0 V
-62 -20 R
62 0 V
13 -51 R
0 21 V
-31 -21 R
62 0 V
-62 21 R
62 0 V
13 0 R
0 -21 V
-31 21 R
62 0 V
-62 -21 R
62 0 V
13 -54 R
0 22 V
-31 -22 R
62 0 V
-62 22 R
62 0 V
15 11 R
0 -22 V
-31 22 R
62 0 V
-62 -22 R
62 0 V
12 -57 R
0 23 V
-31 -23 R
62 0 V
-62 23 R
62 0 V
13 0 R
0 -23 V
-31 23 R
62 0 V
-62 -23 R
62 0 V
13 -48 R
0 24 V
-31 -24 R
62 0 V
-62 24 R
62 0 V
14 0 R
0 -24 V
-31 24 R
62 0 V
-62 -24 R
62 0 V
13 -51 R
0 26 V
-31 -26 R
62 0 V
-62 26 R
62 0 V
13 0 R
0 -26 V
-31 26 R
62 0 V
-62 -26 R
62 0 V
14 -40 R
0 27 V
-31 -27 R
62 0 V
-62 27 R
62 0 V
13 0 R
0 -27 V
-31 27 R
62 0 V
-62 -27 R
62 0 V
13 -57 R
0 29 V
-31 -29 R
62 0 V
-62 29 R
62 0 V
13 0 R
0 -29 V
-31 29 R
62 0 V
-62 -29 R
62 0 V
stroke 2608 3725 M
12 -45 R
0 31 V
-31 -31 R
62 0 V
-62 31 R
62 0 V
13 0 R
0 -31 V
-31 31 R
62 0 V
-62 -31 R
62 0 V
14 -47 R
0 32 V
-31 -32 R
62 0 V
-62 32 R
62 0 V
12 0 R
0 -32 V
-31 32 R
62 0 V
-62 -32 R
62 0 V
13 -50 R
0 34 V
-31 -34 R
62 0 V
-62 34 R
62 0 V
13 0 R
0 -34 V
-31 34 R
62 0 V
-62 -34 R
62 0 V
13 -52 R
0 35 V
-31 -35 R
62 0 V
-62 35 R
62 0 V
13 0 R
0 -35 V
-31 35 R
62 0 V
-62 -35 R
62 0 V
14 -37 R
0 37 V
-31 -37 R
62 0 V
-62 37 R
62 0 V
13 0 R
0 -37 V
-31 37 R
62 0 V
-62 -37 R
62 0 V
12 -59 R
0 40 V
-31 -40 R
62 0 V
-62 40 R
62 0 V
12 0 R
0 -40 V
-31 40 R
62 0 V
-62 -40 R
62 0 V
14 -41 R
0 41 V
-31 -41 R
62 0 V
-62 41 R
62 0 V
12 0 R
0 -41 V
-31 41 R
62 0 V
-62 -41 R
62 0 V
14 -43 R
0 43 V
-31 -43 R
62 0 V
-62 43 R
62 0 V
13 0 R
0 -43 V
-31 43 R
62 0 V
-62 -43 R
62 0 V
11 -68 R
0 46 V
-31 -46 R
62 0 V
-62 46 R
62 0 V
14 22 R
0 -45 V
stroke 3367 3306 M
-31 45 R
62 0 V
-62 -45 R
62 0 V
12 -72 R
0 49 V
-31 -49 R
62 0 V
-62 49 R
62 0 V
14 23 R
0 -48 V
-31 48 R
62 0 V
-62 -48 R
62 0 V
13 -50 R
0 50 V
-31 -50 R
62 0 V
-62 50 R
62 0 V
12 0 R
0 -50 V
-31 50 R
62 0 V
-62 -50 R
62 0 V
13 -53 R
0 53 V
-31 -53 R
62 0 V
-62 53 R
62 0 V
13 0 R
0 -53 V
-31 53 R
62 0 V
-62 -53 R
62 0 V
12 -57 R
0 57 V
-31 -57 R
62 0 V
-62 57 R
62 0 V
12 0 R
0 -57 V
-31 57 R
62 0 V
-62 -57 R
62 0 V
13 -60 R
0 61 V
-31 -61 R
62 0 V
-62 61 R
62 0 V
14 28 R
0 -58 V
-31 58 R
62 0 V
-62 -58 R
62 0 V
12 -63 R
0 63 V
-31 -63 R
62 0 V
-62 63 R
62 0 V
11 0 R
0 -63 V
-31 63 R
62 0 V
-62 -63 R
62 0 V
13 -66 R
0 67 V
-31 -67 R
62 0 V
-62 67 R
62 0 V
15 31 R
0 -64 V
-31 64 R
62 0 V
-62 -64 R
62 0 V
12 -70 R
0 70 V
-31 -70 R
62 0 V
-62 70 R
62 0 V
11 0 R
0 -70 V
-31 70 R
62 0 V
-62 -70 R
62 0 V
13 -75 R
0 75 V
-31 -75 R
62 0 V
stroke 4140 2829 M
-62 75 R
62 0 V
14 36 R
0 -73 V
-31 73 R
62 0 V
-62 -73 R
62 0 V
11 -78 R
0 78 V
-31 -78 R
62 0 V
-62 78 R
62 0 V
15 37 R
0 -75 V
-31 75 R
62 0 V
-62 -75 R
62 0 V
12 -82 R
0 82 V
-31 -82 R
62 0 V
-62 82 R
62 0 V
11 0 R
0 -82 V
-31 82 R
62 0 V
-62 -82 R
62 0 V
15 -44 R
0 86 V
-31 -86 R
62 0 V
-62 86 R
62 0 V
11 0 R
0 -86 V
-31 86 R
62 0 V
-62 -86 R
62 0 V
14 -47 R
0 91 V
-31 -91 R
62 0 V
-62 91 R
62 0 V
10 0 R
0 -91 V
-31 91 R
62 0 V
-62 -91 R
62 0 V
15 -48 R
0 95 V
-31 -95 R
62 0 V
-62 95 R
62 0 V
11 0 R
0 -95 V
-31 95 R
62 0 V
-62 -95 R
62 0 V
14 -52 R
0 100 V
-31 -100 R
62 0 V
-62 100 R
62 0 V
11 0 R
0 -100 V
-31 100 R
62 0 V
-62 -100 R
62 0 V
15 -55 R
0 107 V
-31 -107 R
62 0 V
-62 107 R
62 0 V
10 0 R
0 -107 V
-31 107 R
62 0 V
-62 -107 R
62 0 V
15 -58 R
0 113 V
-31 -113 R
62 0 V
-62 113 R
62 0 V
10 0 R
0 -113 V
-31 113 R
62 0 V
-62 -113 R
62 0 V
stroke 4881 2443 M
15 -62 R
0 121 V
-31 -121 R
62 0 V
-62 121 R
62 0 V
11 0 R
0 -121 V
-31 121 R
62 0 V
-62 -121 R
62 0 V
12 -67 R
0 129 V
-31 -129 R
62 0 V
-62 129 R
62 0 V
15 59 R
0 -121 V
-31 121 R
62 0 V
-62 -121 R
62 0 V
10 -139 R
0 139 V
-31 -139 R
62 0 V
-62 139 R
62 0 V
15 62 R
0 -129 V
-31 129 R
62 0 V
-62 -129 R
62 0 V
13 -72 R
0 139 V
-31 -139 R
62 0 V
-62 139 R
62 0 V
10 0 R
0 -139 V
-31 139 R
62 0 V
-62 -139 R
62 0 V
14 -78 R
0 151 V
-31 -151 R
62 0 V
-62 151 R
62 0 V
11 0 R
0 -151 V
-31 151 R
62 0 V
-62 -151 R
62 0 V
13 -86 R
0 165 V
-31 -165 R
62 0 V
-62 165 R
62 0 V
15 72 R
0 -151 V
-31 151 R
62 0 V
-62 -151 R
62 0 V
13 -86 R
0 165 V
-31 -165 R
62 0 V
-62 165 R
62 0 V
9 0 R
0 -165 V
-31 165 R
62 0 V
-62 -165 R
62 0 V
15 -94 R
0 181 V
-31 -181 R
62 0 V
-62 181 R
62 0 V
11 0 R
0 -181 V
-31 181 R
62 0 V
-62 -181 R
62 0 V
12 -105 R
0 201 V
-31 -201 R
62 0 V
-62 201 R
62 0 V
15 85 R
0 -181 V
stroke 5637 1984 M
-31 181 R
62 0 V
-62 -181 R
62 0 V
13 -105 R
0 201 V
-31 -201 R
62 0 V
-62 201 R
62 0 V
10 0 R
0 -201 V
-31 201 R
62 0 V
-62 -201 R
62 0 V
12 -119 R
0 226 V
-31 -226 R
62 0 V
-62 226 R
62 0 V
15 94 R
0 -201 V
-31 201 R
62 0 V
-62 -201 R
62 0 V
13 -119 R
0 226 V
-31 -226 R
62 0 V
-62 226 R
62 0 V
10 0 R
0 -226 V
-31 226 R
62 0 V
-62 -226 R
62 0 V
12 -137 R
0 258 V
-31 -258 R
62 0 V
-62 258 R
62 0 V
15 105 R
0 -226 V
-31 226 R
62 0 V
-62 -226 R
62 0 V
13 -137 R
0 258 V
-31 -258 R
62 0 V
-62 258 R
62 0 V
10 0 R
0 -258 V
-31 258 R
62 0 V
-62 -258 R
62 0 V
13 -161 R
0 301 V
-31 -301 R
62 0 V
-62 301 R
62 0 V
11 118 R
0 -258 V
-31 258 R
62 0 V
-62 -258 R
62 0 V
15 -161 R
0 301 V
-31 -301 R
62 0 V
-62 301 R
62 0 V
14 118 R
0 -258 V
-31 258 R
62 0 V
-62 -258 R
62 0 V
12 -161 R
0 301 V
-31 -301 R
62 0 V
-62 301 R
62 0 V
11 0 R
0 -301 V
-31 301 R
62 0 V
-62 -301 R
62 0 V
12 -196 R
0 362 V
-31 -362 R
62 0 V
stroke 6406 1266 M
-62 362 R
62 0 V
16 135 R
0 -301 V
-31 301 R
62 0 V
-62 -301 R
62 0 V
13 -443 R
0 453 V
-31 -453 R
62 0 V
-62 453 R
62 0 V
13 291 R
0 -301 V
-31 301 R
62 0 V
-62 -301 R
62 0 V
13 -443 R
0 453 V
-31 -453 R
62 0 V
-62 453 R
62 0 V
8 156 R
0 -362 V
-31 362 R
62 0 V
-62 -362 R
62 0 V
1099 4512 Pls
1145 4518 Pls
1191 4468 Pls
1237 4468 Pls
1283 4422 Pls
1328 4422 Pls
1373 4367 Pls
1419 4374 Pls
1464 4322 Pls
1509 4322 Pls
1554 4268 Pls
1600 4276 Pls
1644 4219 Pls
1689 4227 Pls
1734 4175 Pls
1778 4175 Pls
1824 4130 Pls
1869 4130 Pls
1913 4082 Pls
1958 4082 Pls
2002 4032 Pls
2046 4032 Pls
2090 3978 Pls
2136 3989 Pls
2179 3933 Pls
2223 3933 Pls
2267 3885 Pls
2312 3885 Pls
2356 3835 Pls
2400 3835 Pls
2445 3795 Pls
2489 3795 Pls
2533 3740 Pls
2577 3740 Pls
2620 3695 Pls
2664 3695 Pls
2709 3649 Pls
2752 3649 Pls
2796 3600 Pls
2840 3600 Pls
2884 3548 Pls
2928 3548 Pls
2973 3512 Pls
3017 3512 Pls
3060 3455 Pls
3103 3455 Pls
3148 3415 Pls
3191 3415 Pls
3236 3373 Pls
3280 3373 Pls
3322 3306 Pls
3367 3329 Pls
3410 3258 Pls
3455 3282 Pls
3499 3233 Pls
3542 3233 Pls
3586 3182 Pls
3630 3182 Pls
3673 3127 Pls
3716 3127 Pls
3760 3068 Pls
3805 3098 Pls
3848 3038 Pls
3890 3038 Pls
3934 2973 Pls
3980 3006 Pls
4023 2939 Pls
4065 2939 Pls
4109 2866 Pls
4154 2903 Pls
4196 2828 Pls
4242 2866 Pls
4285 2788 Pls
4327 2788 Pls
4373 2746 Pls
4415 2746 Pls
4460 2702 Pls
4501 2702 Pls
4547 2655 Pls
4589 2655 Pls
4634 2606 Pls
4676 2606 Pls
4722 2555 Pls
4763 2555 Pls
4809 2500 Pls
4850 2500 Pls
4896 2441 Pls
4938 2441 Pls
4981 2379 Pls
5027 2441 Pls
5068 2312 Pls
5114 2379 Pls
5158 2312 Pls
5199 2312 Pls
5244 2239 Pls
5286 2239 Pls
5330 2161 Pls
5376 2239 Pls
5420 2161 Pls
5460 2161 Pls
5506 2074 Pls
5548 2074 Pls
5591 1979 Pls
5637 2074 Pls
5681 1979 Pls
5722 1979 Pls
5765 1873 Pls
5811 1979 Pls
5855 1873 Pls
5896 1873 Pls
5939 1752 Pls
5985 1873 Pls
6029 1752 Pls
6070 1752 Pls
6114 1612 Pls
6156 1752 Pls
6202 1612 Pls
6247 1752 Pls
6290 1612 Pls
6332 1612 Pls
6375 1447 Pls
6422 1612 Pls
6466 1246 Pls
6510 1612 Pls
6554 1246 Pls
6593 1447 Pls
6243 4602 Pls
1.000 UL
LT1
LC1 setrgbcolor
LCb setrgbcolor
LT1
LC1 setrgbcolor
5948 4382 M
591 0 V
1099 4532 M
55 -30 V
56 -30 V
55 -30 V
56 -30 V
55 -31 V
56 -30 V
55 -30 V
56 -30 V
55 -30 V
56 -30 V
55 -30 V
56 -30 V
55 -30 V
56 -30 V
55 -30 V
56 -30 V
55 -30 V
56 -31 V
55 -30 V
56 -30 V
55 -30 V
56 -30 V
55 -30 V
56 -30 V
55 -30 V
56 -30 V
55 -30 V
56 -30 V
55 -30 V
56 -31 V
55 -30 V
56 -30 V
55 -30 V
56 -30 V
55 -30 V
56 -30 V
55 -30 V
56 -30 V
55 -30 V
56 -30 V
55 -30 V
56 -31 V
55 -30 V
56 -30 V
55 -30 V
56 -30 V
55 -30 V
56 -30 V
55 -30 V
56 -30 V
55 -30 V
56 -30 V
55 -30 V
56 -31 V
55 -30 V
56 -30 V
55 -30 V
56 -30 V
55 -30 V
56 -30 V
55 -30 V
56 -30 V
55 -30 V
56 -30 V
55 -30 V
56 -31 V
55 -30 V
56 -30 V
55 -30 V
56 -30 V
55 -30 V
56 -30 V
55 -30 V
56 -30 V
55 -30 V
56 -30 V
55 -30 V
56 -30 V
55 -31 V
56 -30 V
55 -30 V
56 -30 V
55 -30 V
56 -30 V
55 -30 V
56 -30 V
55 -30 V
56 -30 V
55 -30 V
56 -30 V
55 -31 V
56 -30 V
55 -30 V
56 -30 V
55 -30 V
56 -30 V
55 -30 V
56 -30 V
55 -30 V
stroke
LTb
LCb setrgbcolor
1078 4775 N
0 -4071 V
5725 0 V
0 4071 V
-5725 0 V
Z stroke
1.000 UP
1.000 UL
LTb
stroke
grestore
end
showpage
%%Trailer
