%!PS-Adobe-2.0
%%Title: pd6_f0.eps
%%Creator: gnuplot 4.6 patchlevel 1
%%CreationDate: Sun Nov 30 18:08:05 2014
%%DocumentFonts: (atend)
%%BoundingBox: 50 50 554 770
%%Orientation: Landscape
%%Pages: (atend)
%%EndComments
%%BeginProlog
/gnudict 256 dict def
gnudict begin
%
% The following true/false flags may be edited by hand if desired.
% The unit line width and grayscale image gamma correction may also be changed.
%
/Color true def
/Blacktext false def
/Solid false def
/Dashlength 1 def
/Landscape true def
/Level1 false def
/Rounded false def
/ClipToBoundingBox false def
/SuppressPDFMark false def
/TransparentPatterns false def
/gnulinewidth 5.000 def
/userlinewidth gnulinewidth def
/Gamma 1.0 def
/BackgroundColor {-1.000 -1.000 -1.000} def
%
/vshift -70 def
/dl1 {
  10.0 Dashlength mul mul
  Rounded { currentlinewidth 0.75 mul sub dup 0 le { pop 0.01 } if } if
} def
/dl2 {
  10.0 Dashlength mul mul
  Rounded { currentlinewidth 0.75 mul add } if
} def
/hpt_ 31.5 def
/vpt_ 31.5 def
/hpt hpt_ def
/vpt vpt_ def
/doclip {
  ClipToBoundingBox {
    newpath 50 50 moveto 554 50 lineto 554 770 lineto 50 770 lineto closepath
    clip
  } if
} def
%
% Gnuplot Prolog Version 4.6 (September 2012)
%
%/SuppressPDFMark true def
%
/M {moveto} bind def
/L {lineto} bind def
/R {rmoveto} bind def
/V {rlineto} bind def
/N {newpath moveto} bind def
/Z {closepath} bind def
/C {setrgbcolor} bind def
/f {rlineto fill} bind def
/g {setgray} bind def
/Gshow {show} def   % May be redefined later in the file to support UTF-8
/vpt2 vpt 2 mul def
/hpt2 hpt 2 mul def
/Lshow {currentpoint stroke M 0 vshift R 
	Blacktext {gsave 0 setgray show grestore} {show} ifelse} def
/Rshow {currentpoint stroke M dup stringwidth pop neg vshift R
	Blacktext {gsave 0 setgray show grestore} {show} ifelse} def
/Cshow {currentpoint stroke M dup stringwidth pop -2 div vshift R 
	Blacktext {gsave 0 setgray show grestore} {show} ifelse} def
/UP {dup vpt_ mul /vpt exch def hpt_ mul /hpt exch def
  /hpt2 hpt 2 mul def /vpt2 vpt 2 mul def} def
/DL {Color {setrgbcolor Solid {pop []} if 0 setdash}
 {pop pop pop 0 setgray Solid {pop []} if 0 setdash} ifelse} def
/BL {stroke userlinewidth 2 mul setlinewidth
	Rounded {1 setlinejoin 1 setlinecap} if} def
/AL {stroke userlinewidth 2 div setlinewidth
	Rounded {1 setlinejoin 1 setlinecap} if} def
/UL {dup gnulinewidth mul /userlinewidth exch def
	dup 1 lt {pop 1} if 10 mul /udl exch def} def
/PL {stroke userlinewidth setlinewidth
	Rounded {1 setlinejoin 1 setlinecap} if} def
3.8 setmiterlimit
% Default Line colors
/LCw {1 1 1} def
/LCb {0 0 0} def
/LCa {0 0 0} def
/LC0 {1 0 0} def
/LC1 {0 1 0} def
/LC2 {0 0 1} def
/LC3 {1 0 1} def
/LC4 {0 1 1} def
/LC5 {1 1 0} def
/LC6 {0 0 0} def
/LC7 {1 0.3 0} def
/LC8 {0.5 0.5 0.5} def
% Default Line Types
/LTw {PL [] 1 setgray} def
/LTb {BL [] LCb DL} def
/LTa {AL [1 udl mul 2 udl mul] 0 setdash LCa setrgbcolor} def
/LT0 {PL [] LC0 DL} def
/LT1 {PL [4 dl1 2 dl2] LC1 DL} def
/LT2 {PL [2 dl1 3 dl2] LC2 DL} def
/LT3 {PL [1 dl1 1.5 dl2] LC3 DL} def
/LT4 {PL [6 dl1 2 dl2 1 dl1 2 dl2] LC4 DL} def
/LT5 {PL [3 dl1 3 dl2 1 dl1 3 dl2] LC5 DL} def
/LT6 {PL [2 dl1 2 dl2 2 dl1 6 dl2] LC6 DL} def
/LT7 {PL [1 dl1 2 dl2 6 dl1 2 dl2 1 dl1 2 dl2] LC7 DL} def
/LT8 {PL [2 dl1 2 dl2 2 dl1 2 dl2 2 dl1 2 dl2 2 dl1 4 dl2] LC8 DL} def
/Pnt {stroke [] 0 setdash gsave 1 setlinecap M 0 0 V stroke grestore} def
/Dia {stroke [] 0 setdash 2 copy vpt add M
  hpt neg vpt neg V hpt vpt neg V
  hpt vpt V hpt neg vpt V closepath stroke
  Pnt} def
/Pls {stroke [] 0 setdash vpt sub M 0 vpt2 V
  currentpoint stroke M
  hpt neg vpt neg R hpt2 0 V stroke
 } def
/Box {stroke [] 0 setdash 2 copy exch hpt sub exch vpt add M
  0 vpt2 neg V hpt2 0 V 0 vpt2 V
  hpt2 neg 0 V closepath stroke
  Pnt} def
/Crs {stroke [] 0 setdash exch hpt sub exch vpt add M
  hpt2 vpt2 neg V currentpoint stroke M
  hpt2 neg 0 R hpt2 vpt2 V stroke} def
/TriU {stroke [] 0 setdash 2 copy vpt 1.12 mul add M
  hpt neg vpt -1.62 mul V
  hpt 2 mul 0 V
  hpt neg vpt 1.62 mul V closepath stroke
  Pnt} def
/Star {2 copy Pls Crs} def
/BoxF {stroke [] 0 setdash exch hpt sub exch vpt add M
  0 vpt2 neg V hpt2 0 V 0 vpt2 V
  hpt2 neg 0 V closepath fill} def
/TriUF {stroke [] 0 setdash vpt 1.12 mul add M
  hpt neg vpt -1.62 mul V
  hpt 2 mul 0 V
  hpt neg vpt 1.62 mul V closepath fill} def
/TriD {stroke [] 0 setdash 2 copy vpt 1.12 mul sub M
  hpt neg vpt 1.62 mul V
  hpt 2 mul 0 V
  hpt neg vpt -1.62 mul V closepath stroke
  Pnt} def
/TriDF {stroke [] 0 setdash vpt 1.12 mul sub M
  hpt neg vpt 1.62 mul V
  hpt 2 mul 0 V
  hpt neg vpt -1.62 mul V closepath fill} def
/DiaF {stroke [] 0 setdash vpt add M
  hpt neg vpt neg V hpt vpt neg V
  hpt vpt V hpt neg vpt V closepath fill} def
/Pent {stroke [] 0 setdash 2 copy gsave
  translate 0 hpt M 4 {72 rotate 0 hpt L} repeat
  closepath stroke grestore Pnt} def
/PentF {stroke [] 0 setdash gsave
  translate 0 hpt M 4 {72 rotate 0 hpt L} repeat
  closepath fill grestore} def
/Circle {stroke [] 0 setdash 2 copy
  hpt 0 360 arc stroke Pnt} def
/CircleF {stroke [] 0 setdash hpt 0 360 arc fill} def
/C0 {BL [] 0 setdash 2 copy moveto vpt 90 450 arc} bind def
/C1 {BL [] 0 setdash 2 copy moveto
	2 copy vpt 0 90 arc closepath fill
	vpt 0 360 arc closepath} bind def
/C2 {BL [] 0 setdash 2 copy moveto
	2 copy vpt 90 180 arc closepath fill
	vpt 0 360 arc closepath} bind def
/C3 {BL [] 0 setdash 2 copy moveto
	2 copy vpt 0 180 arc closepath fill
	vpt 0 360 arc closepath} bind def
/C4 {BL [] 0 setdash 2 copy moveto
	2 copy vpt 180 270 arc closepath fill
	vpt 0 360 arc closepath} bind def
/C5 {BL [] 0 setdash 2 copy moveto
	2 copy vpt 0 90 arc
	2 copy moveto
	2 copy vpt 180 270 arc closepath fill
	vpt 0 360 arc} bind def
/C6 {BL [] 0 setdash 2 copy moveto
	2 copy vpt 90 270 arc closepath fill
	vpt 0 360 arc closepath} bind def
/C7 {BL [] 0 setdash 2 copy moveto
	2 copy vpt 0 270 arc closepath fill
	vpt 0 360 arc closepath} bind def
/C8 {BL [] 0 setdash 2 copy moveto
	2 copy vpt 270 360 arc closepath fill
	vpt 0 360 arc closepath} bind def
/C9 {BL [] 0 setdash 2 copy moveto
	2 copy vpt 270 450 arc closepath fill
	vpt 0 360 arc closepath} bind def
/C10 {BL [] 0 setdash 2 copy 2 copy moveto vpt 270 360 arc closepath fill
	2 copy moveto
	2 copy vpt 90 180 arc closepath fill
	vpt 0 360 arc closepath} bind def
/C11 {BL [] 0 setdash 2 copy moveto
	2 copy vpt 0 180 arc closepath fill
	2 copy moveto
	2 copy vpt 270 360 arc closepath fill
	vpt 0 360 arc closepath} bind def
/C12 {BL [] 0 setdash 2 copy moveto
	2 copy vpt 180 360 arc closepath fill
	vpt 0 360 arc closepath} bind def
/C13 {BL [] 0 setdash 2 copy moveto
	2 copy vpt 0 90 arc closepath fill
	2 copy moveto
	2 copy vpt 180 360 arc closepath fill
	vpt 0 360 arc closepath} bind def
/C14 {BL [] 0 setdash 2 copy moveto
	2 copy vpt 90 360 arc closepath fill
	vpt 0 360 arc} bind def
/C15 {BL [] 0 setdash 2 copy vpt 0 360 arc closepath fill
	vpt 0 360 arc closepath} bind def
/Rec {newpath 4 2 roll moveto 1 index 0 rlineto 0 exch rlineto
	neg 0 rlineto closepath} bind def
/Square {dup Rec} bind def
/Bsquare {vpt sub exch vpt sub exch vpt2 Square} bind def
/S0 {BL [] 0 setdash 2 copy moveto 0 vpt rlineto BL Bsquare} bind def
/S1 {BL [] 0 setdash 2 copy vpt Square fill Bsquare} bind def
/S2 {BL [] 0 setdash 2 copy exch vpt sub exch vpt Square fill Bsquare} bind def
/S3 {BL [] 0 setdash 2 copy exch vpt sub exch vpt2 vpt Rec fill Bsquare} bind def
/S4 {BL [] 0 setdash 2 copy exch vpt sub exch vpt sub vpt Square fill Bsquare} bind def
/S5 {BL [] 0 setdash 2 copy 2 copy vpt Square fill
	exch vpt sub exch vpt sub vpt Square fill Bsquare} bind def
/S6 {BL [] 0 setdash 2 copy exch vpt sub exch vpt sub vpt vpt2 Rec fill Bsquare} bind def
/S7 {BL [] 0 setdash 2 copy exch vpt sub exch vpt sub vpt vpt2 Rec fill
	2 copy vpt Square fill Bsquare} bind def
/S8 {BL [] 0 setdash 2 copy vpt sub vpt Square fill Bsquare} bind def
/S9 {BL [] 0 setdash 2 copy vpt sub vpt vpt2 Rec fill Bsquare} bind def
/S10 {BL [] 0 setdash 2 copy vpt sub vpt Square fill 2 copy exch vpt sub exch vpt Square fill
	Bsquare} bind def
/S11 {BL [] 0 setdash 2 copy vpt sub vpt Square fill 2 copy exch vpt sub exch vpt2 vpt Rec fill
	Bsquare} bind def
/S12 {BL [] 0 setdash 2 copy exch vpt sub exch vpt sub vpt2 vpt Rec fill Bsquare} bind def
/S13 {BL [] 0 setdash 2 copy exch vpt sub exch vpt sub vpt2 vpt Rec fill
	2 copy vpt Square fill Bsquare} bind def
/S14 {BL [] 0 setdash 2 copy exch vpt sub exch vpt sub vpt2 vpt Rec fill
	2 copy exch vpt sub exch vpt Square fill Bsquare} bind def
/S15 {BL [] 0 setdash 2 copy Bsquare fill Bsquare} bind def
/D0 {gsave translate 45 rotate 0 0 S0 stroke grestore} bind def
/D1 {gsave translate 45 rotate 0 0 S1 stroke grestore} bind def
/D2 {gsave translate 45 rotate 0 0 S2 stroke grestore} bind def
/D3 {gsave translate 45 rotate 0 0 S3 stroke grestore} bind def
/D4 {gsave translate 45 rotate 0 0 S4 stroke grestore} bind def
/D5 {gsave translate 45 rotate 0 0 S5 stroke grestore} bind def
/D6 {gsave translate 45 rotate 0 0 S6 stroke grestore} bind def
/D7 {gsave translate 45 rotate 0 0 S7 stroke grestore} bind def
/D8 {gsave translate 45 rotate 0 0 S8 stroke grestore} bind def
/D9 {gsave translate 45 rotate 0 0 S9 stroke grestore} bind def
/D10 {gsave translate 45 rotate 0 0 S10 stroke grestore} bind def
/D11 {gsave translate 45 rotate 0 0 S11 stroke grestore} bind def
/D12 {gsave translate 45 rotate 0 0 S12 stroke grestore} bind def
/D13 {gsave translate 45 rotate 0 0 S13 stroke grestore} bind def
/D14 {gsave translate 45 rotate 0 0 S14 stroke grestore} bind def
/D15 {gsave translate 45 rotate 0 0 S15 stroke grestore} bind def
/DiaE {stroke [] 0 setdash vpt add M
  hpt neg vpt neg V hpt vpt neg V
  hpt vpt V hpt neg vpt V closepath stroke} def
/BoxE {stroke [] 0 setdash exch hpt sub exch vpt add M
  0 vpt2 neg V hpt2 0 V 0 vpt2 V
  hpt2 neg 0 V closepath stroke} def
/TriUE {stroke [] 0 setdash vpt 1.12 mul add M
  hpt neg vpt -1.62 mul V
  hpt 2 mul 0 V
  hpt neg vpt 1.62 mul V closepath stroke} def
/TriDE {stroke [] 0 setdash vpt 1.12 mul sub M
  hpt neg vpt 1.62 mul V
  hpt 2 mul 0 V
  hpt neg vpt -1.62 mul V closepath stroke} def
/PentE {stroke [] 0 setdash gsave
  translate 0 hpt M 4 {72 rotate 0 hpt L} repeat
  closepath stroke grestore} def
/CircE {stroke [] 0 setdash 
  hpt 0 360 arc stroke} def
/Opaque {gsave closepath 1 setgray fill grestore 0 setgray closepath} def
/DiaW {stroke [] 0 setdash vpt add M
  hpt neg vpt neg V hpt vpt neg V
  hpt vpt V hpt neg vpt V Opaque stroke} def
/BoxW {stroke [] 0 setdash exch hpt sub exch vpt add M
  0 vpt2 neg V hpt2 0 V 0 vpt2 V
  hpt2 neg 0 V Opaque stroke} def
/TriUW {stroke [] 0 setdash vpt 1.12 mul add M
  hpt neg vpt -1.62 mul V
  hpt 2 mul 0 V
  hpt neg vpt 1.62 mul V Opaque stroke} def
/TriDW {stroke [] 0 setdash vpt 1.12 mul sub M
  hpt neg vpt 1.62 mul V
  hpt 2 mul 0 V
  hpt neg vpt -1.62 mul V Opaque stroke} def
/PentW {stroke [] 0 setdash gsave
  translate 0 hpt M 4 {72 rotate 0 hpt L} repeat
  Opaque stroke grestore} def
/CircW {stroke [] 0 setdash 
  hpt 0 360 arc Opaque stroke} def
/BoxFill {gsave Rec 1 setgray fill grestore} def
/Density {
  /Fillden exch def
  currentrgbcolor
  /ColB exch def /ColG exch def /ColR exch def
  /ColR ColR Fillden mul Fillden sub 1 add def
  /ColG ColG Fillden mul Fillden sub 1 add def
  /ColB ColB Fillden mul Fillden sub 1 add def
  ColR ColG ColB setrgbcolor} def
/BoxColFill {gsave Rec PolyFill} def
/PolyFill {gsave Density fill grestore grestore} def
/h {rlineto rlineto rlineto gsave closepath fill grestore} bind def
%
% PostScript Level 1 Pattern Fill routine for rectangles
% Usage: x y w h s a XX PatternFill
%	x,y = lower left corner of box to be filled
%	w,h = width and height of box
%	  a = angle in degrees between lines and x-axis
%	 XX = 0/1 for no/yes cross-hatch
%
/PatternFill {gsave /PFa [ 9 2 roll ] def
  PFa 0 get PFa 2 get 2 div add PFa 1 get PFa 3 get 2 div add translate
  PFa 2 get -2 div PFa 3 get -2 div PFa 2 get PFa 3 get Rec
  TransparentPatterns {} {gsave 1 setgray fill grestore} ifelse
  clip
  currentlinewidth 0.5 mul setlinewidth
  /PFs PFa 2 get dup mul PFa 3 get dup mul add sqrt def
  0 0 M PFa 5 get rotate PFs -2 div dup translate
  0 1 PFs PFa 4 get div 1 add floor cvi
	{PFa 4 get mul 0 M 0 PFs V} for
  0 PFa 6 get ne {
	0 1 PFs PFa 4 get div 1 add floor cvi
	{PFa 4 get mul 0 2 1 roll M PFs 0 V} for
 } if
  stroke grestore} def
%
/languagelevel where
 {pop languagelevel} {1} ifelse
 2 lt
	{/InterpretLevel1 true def}
	{/InterpretLevel1 Level1 def}
 ifelse
%
% PostScript level 2 pattern fill definitions
%
/Level2PatternFill {
/Tile8x8 {/PaintType 2 /PatternType 1 /TilingType 1 /BBox [0 0 8 8] /XStep 8 /YStep 8}
	bind def
/KeepColor {currentrgbcolor [/Pattern /DeviceRGB] setcolorspace} bind def
<< Tile8x8
 /PaintProc {0.5 setlinewidth pop 0 0 M 8 8 L 0 8 M 8 0 L stroke} 
>> matrix makepattern
/Pat1 exch def
<< Tile8x8
 /PaintProc {0.5 setlinewidth pop 0 0 M 8 8 L 0 8 M 8 0 L stroke
	0 4 M 4 8 L 8 4 L 4 0 L 0 4 L stroke}
>> matrix makepattern
/Pat2 exch def
<< Tile8x8
 /PaintProc {0.5 setlinewidth pop 0 0 M 0 8 L
	8 8 L 8 0 L 0 0 L fill}
>> matrix makepattern
/Pat3 exch def
<< Tile8x8
 /PaintProc {0.5 setlinewidth pop -4 8 M 8 -4 L
	0 12 M 12 0 L stroke}
>> matrix makepattern
/Pat4 exch def
<< Tile8x8
 /PaintProc {0.5 setlinewidth pop -4 0 M 8 12 L
	0 -4 M 12 8 L stroke}
>> matrix makepattern
/Pat5 exch def
<< Tile8x8
 /PaintProc {0.5 setlinewidth pop -2 8 M 4 -4 L
	0 12 M 8 -4 L 4 12 M 10 0 L stroke}
>> matrix makepattern
/Pat6 exch def
<< Tile8x8
 /PaintProc {0.5 setlinewidth pop -2 0 M 4 12 L
	0 -4 M 8 12 L 4 -4 M 10 8 L stroke}
>> matrix makepattern
/Pat7 exch def
<< Tile8x8
 /PaintProc {0.5 setlinewidth pop 8 -2 M -4 4 L
	12 0 M -4 8 L 12 4 M 0 10 L stroke}
>> matrix makepattern
/Pat8 exch def
<< Tile8x8
 /PaintProc {0.5 setlinewidth pop 0 -2 M 12 4 L
	-4 0 M 12 8 L -4 4 M 8 10 L stroke}
>> matrix makepattern
/Pat9 exch def
/Pattern1 {PatternBgnd KeepColor Pat1 setpattern} bind def
/Pattern2 {PatternBgnd KeepColor Pat2 setpattern} bind def
/Pattern3 {PatternBgnd KeepColor Pat3 setpattern} bind def
/Pattern4 {PatternBgnd KeepColor Landscape {Pat5} {Pat4} ifelse setpattern} bind def
/Pattern5 {PatternBgnd KeepColor Landscape {Pat4} {Pat5} ifelse setpattern} bind def
/Pattern6 {PatternBgnd KeepColor Landscape {Pat9} {Pat6} ifelse setpattern} bind def
/Pattern7 {PatternBgnd KeepColor Landscape {Pat8} {Pat7} ifelse setpattern} bind def
} def
%
%
%End of PostScript Level 2 code
%
/PatternBgnd {
  TransparentPatterns {} {gsave 1 setgray fill grestore} ifelse
} def
%
% Substitute for Level 2 pattern fill codes with
% grayscale if Level 2 support is not selected.
%
/Level1PatternFill {
/Pattern1 {0.250 Density} bind def
/Pattern2 {0.500 Density} bind def
/Pattern3 {0.750 Density} bind def
/Pattern4 {0.125 Density} bind def
/Pattern5 {0.375 Density} bind def
/Pattern6 {0.625 Density} bind def
/Pattern7 {0.875 Density} bind def
} def
%
% Now test for support of Level 2 code
%
Level1 {Level1PatternFill} {Level2PatternFill} ifelse
%
/Symbol-Oblique /Symbol findfont [1 0 .167 1 0 0] makefont
dup length dict begin {1 index /FID eq {pop pop} {def} ifelse} forall
currentdict end definefont pop
/MFshow {
   { dup 5 get 3 ge
     { 5 get 3 eq {gsave} {grestore} ifelse }
     {dup dup 0 get findfont exch 1 get scalefont setfont
     [ currentpoint ] exch dup 2 get 0 exch R dup 5 get 2 ne {dup dup 6
     get exch 4 get {Gshow} {stringwidth pop 0 R} ifelse }if dup 5 get 0 eq
     {dup 3 get {2 get neg 0 exch R pop} {pop aload pop M} ifelse} {dup 5
     get 1 eq {dup 2 get exch dup 3 get exch 6 get stringwidth pop -2 div
     dup 0 R} {dup 6 get stringwidth pop -2 div 0 R 6 get
     show 2 index {aload pop M neg 3 -1 roll neg R pop pop} {pop pop pop
     pop aload pop M} ifelse }ifelse }ifelse }
     ifelse }
   forall} def
/Gswidth {dup type /stringtype eq {stringwidth} {pop (n) stringwidth} ifelse} def
/MFwidth {0 exch { dup 5 get 3 ge { 5 get 3 eq { 0 } { pop } ifelse }
 {dup 3 get{dup dup 0 get findfont exch 1 get scalefont setfont
     6 get Gswidth pop add} {pop} ifelse} ifelse} forall} def
/MLshow { currentpoint stroke M
  0 exch R
  Blacktext {gsave 0 setgray MFshow grestore} {MFshow} ifelse } bind def
/MRshow { currentpoint stroke M
  exch dup MFwidth neg 3 -1 roll R
  Blacktext {gsave 0 setgray MFshow grestore} {MFshow} ifelse } bind def
/MCshow { currentpoint stroke M
  exch dup MFwidth -2 div 3 -1 roll R
  Blacktext {gsave 0 setgray MFshow grestore} {MFshow} ifelse } bind def
/XYsave    { [( ) 1 2 true false 3 ()] } bind def
/XYrestore { [( ) 1 2 true false 4 ()] } bind def
Level1 SuppressPDFMark or 
{} {
/SDict 10 dict def
systemdict /pdfmark known not {
  userdict /pdfmark systemdict /cleartomark get put
} if
SDict begin [
  /Title (pd6_f0.eps)
  /Subject (gnuplot plot)
  /Creator (gnuplot 4.6 patchlevel 1)
  /Author (kevin.luedemann)
%  /Producer (gnuplot)
%  /Keywords ()
  /CreationDate (Sun Nov 30 18:08:05 2014)
  /DOCINFO pdfmark
end
} ifelse
end
%%EndProlog
%%Page: 1 1
gnudict begin
gsave
doclip
50 50 translate
0.100 0.100 scale
90 rotate
0 -5040 translate
0 setgray
newpath
(Roman) findfont 210 scalefont setfont
BackgroundColor 0 lt 3 1 roll 0 lt exch 0 lt or or not {gsave BackgroundColor C clippath fill grestore} if
1.000 UL
LTb
1.000 UL
LTa
903 672 M
5918 0 V
stroke
LTb
903 672 M
63 0 V
5855 0 R
-63 0 V
stroke
777 672 M
[ [(Roman) 210.0 0.0 true true 0 (-50)]
] -70.0 MRshow
1.000 UL
LTb
1.000 UL
LTa
903 1186 M
5918 0 V
stroke
LTb
903 1186 M
63 0 V
5855 0 R
-63 0 V
stroke
777 1186 M
[ [(Roman) 210.0 0.0 true true 0 (-40)]
] -70.0 MRshow
1.000 UL
LTb
1.000 UL
LTa
903 1701 M
5918 0 V
stroke
LTb
903 1701 M
63 0 V
5855 0 R
-63 0 V
stroke
777 1701 M
[ [(Roman) 210.0 0.0 true true 0 (-30)]
] -70.0 MRshow
1.000 UL
LTb
1.000 UL
LTa
903 2215 M
5918 0 V
stroke
LTb
903 2215 M
63 0 V
5855 0 R
-63 0 V
stroke
777 2215 M
[ [(Roman) 210.0 0.0 true true 0 (-20)]
] -70.0 MRshow
1.000 UL
LTb
1.000 UL
LTa
903 2730 M
5918 0 V
stroke
LTb
903 2730 M
63 0 V
5855 0 R
-63 0 V
stroke
777 2730 M
[ [(Roman) 210.0 0.0 true true 0 (-10)]
] -70.0 MRshow
1.000 UL
LTb
1.000 UL
LTa
903 3244 M
5918 0 V
stroke
LTb
903 3244 M
63 0 V
5855 0 R
-63 0 V
stroke
777 3244 M
[ [(Roman) 210.0 0.0 true true 0 ( 0)]
] -70.0 MRshow
1.000 UL
LTb
1.000 UL
LTa
903 3758 M
5918 0 V
stroke
LTb
903 3758 M
63 0 V
5855 0 R
-63 0 V
stroke
777 3758 M
[ [(Roman) 210.0 0.0 true true 0 ( 10)]
] -70.0 MRshow
1.000 UL
LTb
1.000 UL
LTa
903 4273 M
5918 0 V
stroke
LTb
903 4273 M
63 0 V
5855 0 R
-63 0 V
stroke
777 4273 M
[ [(Roman) 210.0 0.0 true true 0 ( 20)]
] -70.0 MRshow
1.000 UL
LTb
1.000 UL
LTa
903 4787 M
5918 0 V
stroke
LTb
903 4787 M
63 0 V
5855 0 R
-63 0 V
stroke
777 4787 M
[ [(Roman) 210.0 0.0 true true 0 ( 30)]
] -70.0 MRshow
1.000 UL
LTb
1.000 UL
LTa
903 672 M
0 4115 V
stroke
LTb
903 672 M
0 63 V
0 4052 R
0 -63 V
stroke
903 462 M
[ [(Roman) 210.0 0.0 true true 0 ( 0)]
] -70.0 MCshow
1.000 UL
LTb
1.000 UL
LTa
1643 672 M
0 4115 V
stroke
LTb
1643 672 M
0 63 V
0 4052 R
0 -63 V
stroke
1643 462 M
[ [(Roman) 210.0 0.0 true true 0 ( 2)]
] -70.0 MCshow
1.000 UL
LTb
1.000 UL
LTa
2383 672 M
0 4115 V
stroke
LTb
2383 672 M
0 63 V
0 4052 R
0 -63 V
stroke
2383 462 M
[ [(Roman) 210.0 0.0 true true 0 ( 4)]
] -70.0 MCshow
1.000 UL
LTb
1.000 UL
LTa
3122 672 M
0 4115 V
stroke
LTb
3122 672 M
0 63 V
0 4052 R
0 -63 V
stroke
3122 462 M
[ [(Roman) 210.0 0.0 true true 0 ( 6)]
] -70.0 MCshow
1.000 UL
LTb
1.000 UL
LTa
3862 672 M
0 4115 V
stroke
LTb
3862 672 M
0 63 V
0 4052 R
0 -63 V
stroke
3862 462 M
[ [(Roman) 210.0 0.0 true true 0 ( 8)]
] -70.0 MCshow
1.000 UL
LTb
1.000 UL
LTa
4602 672 M
0 3842 V
0 210 R
0 63 V
stroke
LTb
4602 672 M
0 63 V
0 4052 R
0 -63 V
stroke
4602 462 M
[ [(Roman) 210.0 0.0 true true 0 ( 10)]
] -70.0 MCshow
1.000 UL
LTb
1.000 UL
LTa
5342 672 M
0 3842 V
0 210 R
0 63 V
stroke
LTb
5342 672 M
0 63 V
0 4052 R
0 -63 V
stroke
5342 462 M
[ [(Roman) 210.0 0.0 true true 0 ( 12)]
] -70.0 MCshow
1.000 UL
LTb
1.000 UL
LTa
6081 672 M
0 3842 V
0 210 R
0 63 V
stroke
LTb
6081 672 M
0 63 V
0 4052 R
0 -63 V
stroke
6081 462 M
[ [(Roman) 210.0 0.0 true true 0 ( 14)]
] -70.0 MCshow
1.000 UL
LTb
1.000 UL
LTa
6821 672 M
0 4115 V
stroke
LTb
6821 672 M
0 63 V
0 4052 R
0 -63 V
stroke
6821 462 M
[ [(Roman) 210.0 0.0 true true 0 ( 16)]
] -70.0 MCshow
1.000 UL
LTb
1.000 UL
LTb
903 4787 N
903 672 L
5918 0 V
0 4115 V
-5918 0 V
Z stroke
LCb setrgbcolor
168 2729 M
currentpoint gsave translate -270 rotate 0 0 moveto
[ [(Roman) 210.0 0.0 true true 0 (Winkel [rad])]
] -70.0 MCshow
grestore
LTb
LCb setrgbcolor
3862 147 M
[ [(Roman) 210.0 0.0 true true 0 (Zeit [s])]
] -70.0 MCshow
LTb
1.000 UP
1.000 UL
LTb
% Begin plot #1
1.000 UP
1.000 UL
LT0
LCb setrgbcolor
5876 4619 M
[ [(Roman) 210.0 0.0 true true 0 (Daempfung 6mm)]
] -70.0 MRshow
LT0
903 3302 Pls
909 3225 Pls
915 3147 Pls
920 3032 Pls
926 2955 Pls
932 2839 Pls
938 2762 Pls
943 2684 Pls
949 2607 Pls
955 2492 Pls
961 2414 Pls
967 2337 Pls
972 2260 Pls
978 2183 Pls
984 2106 Pls
990 2029 Pls
995 1952 Pls
1001 1913 Pls
1007 1836 Pls
1013 1759 Pls
1019 1720 Pls
1024 1643 Pls
1030 1566 Pls
1036 1527 Pls
1042 1489 Pls
1047 1411 Pls
1053 1373 Pls
1059 1334 Pls
1065 1257 Pls
1071 1219 Pls
1076 1180 Pls
1082 1141 Pls
1088 1103 Pls
1094 1103 Pls
1099 1064 Pls
1105 1026 Pls
1111 987 Pls
1117 987 Pls
1123 948 Pls
1128 948 Pls
1134 910 Pls
1140 910 Pls
1146 910 Pls
1151 871 Pls
1157 871 Pls
1163 871 Pls
1169 871 Pls
1175 871 Pls
1180 871 Pls
1186 871 Pls
1192 871 Pls
1198 871 Pls
1204 910 Pls
1209 910 Pls
1215 910 Pls
1221 948 Pls
1227 948 Pls
1232 987 Pls
1238 1026 Pls
1244 1026 Pls
1250 1064 Pls
1256 1103 Pls
1261 1141 Pls
1267 1141 Pls
1273 1180 Pls
1279 1219 Pls
1284 1257 Pls
1290 1296 Pls
1296 1373 Pls
1302 1411 Pls
1308 1450 Pls
1313 1489 Pls
1319 1527 Pls
1325 1604 Pls
1331 1643 Pls
1336 1681 Pls
1342 1720 Pls
1348 1797 Pls
1354 1836 Pls
1360 1913 Pls
1365 1952 Pls
1371 2029 Pls
1377 2067 Pls
1383 2106 Pls
1388 2183 Pls
1394 2260 Pls
1400 2299 Pls
1406 2376 Pls
1412 2414 Pls
1417 2492 Pls
1423 2530 Pls
1429 2607 Pls
1435 2684 Pls
1440 2723 Pls
1446 2800 Pls
1452 2839 Pls
1458 2916 Pls
1464 2955 Pls
1469 3032 Pls
1475 3070 Pls
1481 3147 Pls
1487 3186 Pls
1492 3263 Pls
1498 3302 Pls
1504 3379 Pls
1510 3417 Pls
1516 3495 Pls
1521 3533 Pls
1527 3572 Pls
1533 3649 Pls
1539 3688 Pls
1545 3726 Pls
1550 3803 Pls
1556 3842 Pls
1562 3880 Pls
1568 3919 Pls
1573 3996 Pls
1579 4035 Pls
1585 4073 Pls
1591 4112 Pls
1597 4150 Pls
1602 4189 Pls
1608 4228 Pls
1614 4266 Pls
1620 4305 Pls
1625 4343 Pls
1631 4343 Pls
1637 4382 Pls
1643 4421 Pls
1649 4459 Pls
1654 4459 Pls
1660 4498 Pls
1666 4498 Pls
1672 4536 Pls
1677 4575 Pls
1683 4575 Pls
1689 4575 Pls
1695 4613 Pls
1701 4613 Pls
1706 4613 Pls
1712 4652 Pls
1718 4652 Pls
1724 4652 Pls
1729 4652 Pls
1735 4652 Pls
1741 4652 Pls
1747 4652 Pls
1753 4652 Pls
1758 4652 Pls
1764 4652 Pls
1770 4613 Pls
1776 4613 Pls
1781 4613 Pls
1787 4613 Pls
1793 4613 Pls
1799 4575 Pls
1805 4575 Pls
1810 4536 Pls
1816 4536 Pls
1822 4536 Pls
1828 4498 Pls
1833 4498 Pls
1839 4459 Pls
1845 4421 Pls
1851 4421 Pls
1857 4382 Pls
1862 4382 Pls
1868 4343 Pls
1874 4305 Pls
1880 4266 Pls
1885 4266 Pls
1891 4228 Pls
1897 4189 Pls
1903 4150 Pls
1909 4112 Pls
1914 4112 Pls
1920 4073 Pls
1926 4035 Pls
1932 3996 Pls
1937 3958 Pls
1943 3919 Pls
1949 3880 Pls
1955 3842 Pls
1961 3803 Pls
1966 3765 Pls
1972 3726 Pls
1978 3726 Pls
1984 3688 Pls
1990 3649 Pls
1995 3610 Pls
2001 3572 Pls
2007 3533 Pls
2013 3495 Pls
2018 3456 Pls
2024 3417 Pls
2030 3379 Pls
2036 3340 Pls
2042 3302 Pls
2047 3263 Pls
2053 3225 Pls
2059 3186 Pls
2065 3147 Pls
2070 3109 Pls
2076 3070 Pls
2082 3032 Pls
2088 2993 Pls
2094 2993 Pls
2099 2955 Pls
2105 2916 Pls
2111 2877 Pls
2117 2839 Pls
2122 2800 Pls
2128 2800 Pls
2134 2762 Pls
2140 2723 Pls
2146 2684 Pls
2151 2684 Pls
2157 2646 Pls
2163 2607 Pls
2169 2607 Pls
2174 2569 Pls
2180 2569 Pls
2186 2530 Pls
2192 2530 Pls
2198 2492 Pls
2203 2453 Pls
2209 2453 Pls
2215 2453 Pls
2221 2414 Pls
2226 2414 Pls
2232 2376 Pls
2238 2376 Pls
2244 2376 Pls
2250 2337 Pls
2255 2337 Pls
2261 2337 Pls
2267 2337 Pls
2273 2299 Pls
2278 2299 Pls
2284 2299 Pls
2290 2299 Pls
2296 2299 Pls
2302 2299 Pls
2307 2299 Pls
2313 2299 Pls
2319 2299 Pls
2325 2299 Pls
2330 2299 Pls
2336 2299 Pls
2342 2337 Pls
2348 2337 Pls
2354 2337 Pls
2359 2337 Pls
2365 2337 Pls
2371 2337 Pls
2377 2376 Pls
2383 2376 Pls
2388 2376 Pls
2394 2376 Pls
2400 2414 Pls
2406 2414 Pls
2411 2414 Pls
2417 2453 Pls
2423 2453 Pls
2429 2453 Pls
2435 2492 Pls
2440 2492 Pls
2446 2530 Pls
2452 2530 Pls
2458 2569 Pls
2463 2569 Pls
2469 2607 Pls
2475 2607 Pls
2481 2646 Pls
2487 2646 Pls
2492 2684 Pls
2498 2684 Pls
2504 2723 Pls
2510 2723 Pls
2515 2762 Pls
2521 2800 Pls
2527 2800 Pls
2533 2839 Pls
2539 2839 Pls
2544 2877 Pls
2550 2916 Pls
2556 2916 Pls
2562 2955 Pls
2567 2955 Pls
2573 2993 Pls
2579 3032 Pls
2585 3032 Pls
2591 3070 Pls
2596 3070 Pls
2602 3109 Pls
2608 3147 Pls
2614 3147 Pls
2619 3186 Pls
2625 3186 Pls
2631 3225 Pls
2637 3263 Pls
2643 3263 Pls
2648 3302 Pls
2654 3302 Pls
2660 3340 Pls
2666 3340 Pls
2671 3379 Pls
2677 3379 Pls
2683 3417 Pls
2689 3417 Pls
2695 3456 Pls
2700 3456 Pls
2706 3495 Pls
2712 3495 Pls
2718 3533 Pls
2723 3533 Pls
2729 3572 Pls
2735 3572 Pls
2741 3572 Pls
2747 3610 Pls
2752 3610 Pls
2758 3649 Pls
2764 3649 Pls
2770 3649 Pls
2775 3649 Pls
2781 3688 Pls
2787 3688 Pls
2793 3688 Pls
2799 3726 Pls
2804 3726 Pls
2810 3726 Pls
2816 3726 Pls
2822 3726 Pls
2827 3765 Pls
2833 3765 Pls
2839 3765 Pls
2845 3765 Pls
2851 3765 Pls
2856 3765 Pls
2862 3765 Pls
2868 3765 Pls
2874 3765 Pls
2880 3765 Pls
2885 3765 Pls
2891 3765 Pls
2897 3765 Pls
2903 3765 Pls
2908 3765 Pls
2914 3765 Pls
2920 3765 Pls
2926 3765 Pls
2932 3726 Pls
2937 3726 Pls
2943 3726 Pls
2949 3726 Pls
2955 3726 Pls
2960 3726 Pls
2966 3688 Pls
2972 3688 Pls
2978 3688 Pls
2984 3688 Pls
2989 3688 Pls
2995 3649 Pls
3001 3649 Pls
3007 3649 Pls
3012 3649 Pls
3018 3610 Pls
3024 3610 Pls
3030 3610 Pls
3036 3572 Pls
3041 3572 Pls
3047 3572 Pls
3053 3533 Pls
3059 3533 Pls
3064 3533 Pls
3070 3495 Pls
3076 3495 Pls
3082 3495 Pls
3088 3456 Pls
3093 3456 Pls
3099 3456 Pls
3105 3417 Pls
3111 3417 Pls
3116 3417 Pls
3122 3379 Pls
3128 3379 Pls
3134 3340 Pls
3140 3340 Pls
3145 3340 Pls
3151 3302 Pls
3157 3302 Pls
3163 3302 Pls
3168 3263 Pls
3174 3263 Pls
3180 3225 Pls
3186 3225 Pls
3192 3225 Pls
3197 3186 Pls
3203 3186 Pls
3209 3186 Pls
3215 3147 Pls
3220 3147 Pls
3226 3147 Pls
3232 3109 Pls
3238 3109 Pls
3244 3109 Pls
3249 3070 Pls
3255 3070 Pls
3261 3070 Pls
3267 3032 Pls
3272 3032 Pls
3278 3032 Pls
3284 2993 Pls
3290 2993 Pls
3296 2993 Pls
3301 2993 Pls
3307 2955 Pls
3313 2955 Pls
3319 2955 Pls
3324 2955 Pls
3330 2955 Pls
3336 2916 Pls
3342 2916 Pls
3348 2916 Pls
3353 2916 Pls
3359 2916 Pls
3365 2877 Pls
3371 2877 Pls
3377 2877 Pls
3382 2877 Pls
3388 2877 Pls
3394 2877 Pls
3400 2877 Pls
3405 2877 Pls
3411 2877 Pls
3417 2839 Pls
3423 2839 Pls
3429 2839 Pls
3434 2839 Pls
3440 2839 Pls
3446 2839 Pls
3452 2839 Pls
3457 2839 Pls
3463 2839 Pls
3469 2839 Pls
3475 2839 Pls
3481 2839 Pls
3486 2839 Pls
3492 2839 Pls
3498 2839 Pls
3504 2839 Pls
3509 2839 Pls
3515 2839 Pls
3521 2839 Pls
3527 2839 Pls
3533 2877 Pls
3538 2877 Pls
3544 2877 Pls
3550 2877 Pls
3556 2877 Pls
3561 2877 Pls
3567 2877 Pls
3573 2877 Pls
3579 2916 Pls
3585 2916 Pls
3590 2916 Pls
3596 2916 Pls
3602 2916 Pls
3608 2955 Pls
3613 2955 Pls
3619 2955 Pls
3625 2955 Pls
3631 2955 Pls
3637 2993 Pls
3642 2993 Pls
3648 2993 Pls
3654 2993 Pls
3660 2993 Pls
3665 3032 Pls
3671 3032 Pls
3677 3032 Pls
3683 3032 Pls
3689 3070 Pls
3694 3070 Pls
3700 3070 Pls
3706 3070 Pls
3712 3109 Pls
3718 3109 Pls
3723 3109 Pls
3729 3109 Pls
3735 3109 Pls
3741 3147 Pls
3746 3147 Pls
3752 3147 Pls
3758 3147 Pls
3764 3186 Pls
3770 3186 Pls
3775 3186 Pls
3781 3186 Pls
3787 3225 Pls
3793 3225 Pls
3798 3225 Pls
3804 3225 Pls
3810 3225 Pls
3816 3263 Pls
3822 3263 Pls
3827 3263 Pls
3833 3263 Pls
3839 3263 Pls
3845 3302 Pls
3850 3302 Pls
3856 3302 Pls
3862 3302 Pls
3868 3302 Pls
3874 3302 Pls
3879 3340 Pls
3885 3340 Pls
3891 3340 Pls
3897 3340 Pls
3902 3340 Pls
3908 3340 Pls
3914 3340 Pls
3920 3340 Pls
3926 3379 Pls
3931 3379 Pls
3937 3379 Pls
3943 3379 Pls
3949 3379 Pls
3954 3379 Pls
3960 3379 Pls
3966 3379 Pls
3972 3379 Pls
3978 3379 Pls
3983 3417 Pls
3989 3417 Pls
3995 3417 Pls
4001 3417 Pls
4006 3417 Pls
4012 3417 Pls
4018 3417 Pls
4024 3417 Pls
4030 3417 Pls
4035 3417 Pls
4041 3417 Pls
4047 3417 Pls
4053 3417 Pls
4058 3417 Pls
4064 3417 Pls
4070 3417 Pls
4076 3417 Pls
4082 3417 Pls
4087 3417 Pls
4093 3417 Pls
4099 3379 Pls
4105 3379 Pls
4110 3379 Pls
4116 3379 Pls
4122 3379 Pls
4128 3379 Pls
4134 3379 Pls
4139 3379 Pls
4145 3379 Pls
4151 3379 Pls
4157 3379 Pls
4163 3340 Pls
4168 3340 Pls
4174 3340 Pls
4180 3340 Pls
4186 3340 Pls
4191 3340 Pls
4197 3340 Pls
4203 3340 Pls
4209 3340 Pls
4215 3302 Pls
4220 3302 Pls
4226 3302 Pls
4232 3302 Pls
4238 3302 Pls
4243 3302 Pls
4249 3302 Pls
4255 3263 Pls
4261 3263 Pls
4267 3263 Pls
4272 3263 Pls
4278 3263 Pls
4284 3263 Pls
4290 3263 Pls
4295 3225 Pls
4301 3225 Pls
4307 3225 Pls
4313 3225 Pls
4319 3225 Pls
4324 3225 Pls
4330 3186 Pls
4336 3186 Pls
4342 3186 Pls
4347 3186 Pls
4353 3186 Pls
4359 3186 Pls
4365 3186 Pls
4371 3186 Pls
4376 3147 Pls
4382 3147 Pls
4388 3147 Pls
4394 3147 Pls
4399 3147 Pls
4405 3147 Pls
4411 3147 Pls
4417 3147 Pls
4423 3109 Pls
4428 3109 Pls
4434 3109 Pls
4440 3109 Pls
4446 3109 Pls
4451 3109 Pls
4457 3109 Pls
4463 3109 Pls
4469 3109 Pls
4475 3109 Pls
4480 3109 Pls
4486 3070 Pls
4492 3070 Pls
4498 3070 Pls
4504 3070 Pls
4509 3070 Pls
4515 3070 Pls
4521 3070 Pls
4527 3070 Pls
4532 3070 Pls
4538 3070 Pls
4544 3070 Pls
4550 3070 Pls
4556 3070 Pls
4561 3070 Pls
4567 3070 Pls
4573 3070 Pls
4579 3070 Pls
4584 3070 Pls
4590 3070 Pls
4596 3070 Pls
4602 3070 Pls
4608 3070 Pls
4613 3070 Pls
4619 3070 Pls
4625 3070 Pls
4631 3070 Pls
4636 3070 Pls
4642 3070 Pls
4648 3070 Pls
4654 3070 Pls
4660 3109 Pls
4665 3109 Pls
4671 3109 Pls
4677 3109 Pls
4683 3109 Pls
4688 3109 Pls
4694 3109 Pls
4700 3109 Pls
4706 3109 Pls
4712 3109 Pls
4717 3109 Pls
4723 3109 Pls
4729 3109 Pls
4735 3109 Pls
4740 3109 Pls
4746 3109 Pls
4752 3109 Pls
4758 3147 Pls
4764 3147 Pls
4769 3147 Pls
4775 3147 Pls
4781 3147 Pls
4787 3147 Pls
4792 3147 Pls
4798 3147 Pls
4804 3147 Pls
4810 3147 Pls
4816 3147 Pls
4821 3147 Pls
4827 3186 Pls
4833 3186 Pls
4839 3186 Pls
4844 3186 Pls
4850 3186 Pls
4856 3186 Pls
4862 3186 Pls
4868 3186 Pls
4873 3186 Pls
4879 3186 Pls
4885 3186 Pls
4891 3225 Pls
4896 3225 Pls
4902 3225 Pls
4908 3225 Pls
4914 3225 Pls
4920 3225 Pls
4925 3225 Pls
4931 3225 Pls
4937 3225 Pls
4943 3225 Pls
4949 3225 Pls
4954 3225 Pls
4960 3263 Pls
4966 3263 Pls
4972 3263 Pls
4977 3263 Pls
4983 3263 Pls
4989 3263 Pls
4995 3263 Pls
5001 3263 Pls
5006 3263 Pls
5012 3263 Pls
5018 3263 Pls
5024 3263 Pls
5029 3263 Pls
5035 3263 Pls
5041 3263 Pls
5047 3263 Pls
5053 3263 Pls
5058 3302 Pls
5064 3302 Pls
5070 3302 Pls
5076 3302 Pls
5081 3302 Pls
5087 3302 Pls
5093 3302 Pls
5099 3302 Pls
5105 3302 Pls
5110 3302 Pls
5116 3302 Pls
5122 3302 Pls
5128 3302 Pls
5133 3302 Pls
5139 3302 Pls
5145 3302 Pls
5151 3302 Pls
5157 3302 Pls
5162 3302 Pls
5168 3302 Pls
5174 3302 Pls
5180 3302 Pls
5185 3302 Pls
5191 3302 Pls
5197 3302 Pls
5203 3302 Pls
5209 3302 Pls
5214 3302 Pls
5220 3302 Pls
5226 3302 Pls
5232 3302 Pls
5237 3302 Pls
5243 3302 Pls
5249 3302 Pls
5255 3302 Pls
5261 3302 Pls
5266 3302 Pls
5272 3302 Pls
5278 3302 Pls
5284 3302 Pls
5289 3302 Pls
5295 3302 Pls
5301 3302 Pls
5307 3302 Pls
5313 3302 Pls
5318 3302 Pls
5324 3302 Pls
5330 3302 Pls
5336 3302 Pls
5342 3302 Pls
5347 3302 Pls
5353 3302 Pls
5359 3263 Pls
5365 3263 Pls
5370 3263 Pls
5376 3263 Pls
5382 3263 Pls
5388 3263 Pls
5394 3263 Pls
5399 3263 Pls
5405 3263 Pls
5411 3263 Pls
5417 3263 Pls
5422 3263 Pls
5428 3263 Pls
5434 3263 Pls
5440 3263 Pls
5446 3263 Pls
5451 3263 Pls
5457 3263 Pls
5463 3225 Pls
5469 3225 Pls
5474 3225 Pls
5480 3225 Pls
5486 3225 Pls
5492 3225 Pls
5498 3225 Pls
5503 3225 Pls
5509 3225 Pls
5515 3225 Pls
5521 3225 Pls
5526 3225 Pls
5532 3225 Pls
5538 3225 Pls
5544 3225 Pls
5550 3225 Pls
5555 3225 Pls
5561 3225 Pls
5567 3225 Pls
5573 3225 Pls
5578 3225 Pls
5584 3186 Pls
5590 3186 Pls
5596 3186 Pls
5602 3186 Pls
5607 3186 Pls
5613 3186 Pls
5619 3186 Pls
5625 3186 Pls
5630 3186 Pls
5636 3186 Pls
5642 3186 Pls
5648 3186 Pls
5654 3186 Pls
5659 3186 Pls
5665 3186 Pls
5671 3186 Pls
5677 3186 Pls
5682 3186 Pls
5688 3186 Pls
5694 3186 Pls
5700 3186 Pls
5706 3186 Pls
5711 3186 Pls
5717 3186 Pls
5723 3186 Pls
5729 3186 Pls
5734 3186 Pls
5740 3186 Pls
5746 3186 Pls
5752 3186 Pls
5758 3186 Pls
5763 3186 Pls
5769 3186 Pls
5775 3186 Pls
5781 3186 Pls
5786 3186 Pls
5792 3186 Pls
5798 3186 Pls
5804 3186 Pls
5810 3186 Pls
5815 3186 Pls
5821 3186 Pls
5827 3186 Pls
5833 3186 Pls
5839 3186 Pls
5844 3186 Pls
5850 3186 Pls
5856 3186 Pls
5862 3186 Pls
5867 3186 Pls
5873 3186 Pls
5879 3186 Pls
5885 3186 Pls
5891 3186 Pls
5896 3186 Pls
5902 3186 Pls
5908 3186 Pls
5914 3186 Pls
5919 3186 Pls
5925 3186 Pls
5931 3186 Pls
5937 3186 Pls
5943 3186 Pls
5948 3186 Pls
5954 3186 Pls
5960 3186 Pls
5966 3186 Pls
5971 3186 Pls
5977 3186 Pls
5983 3186 Pls
5989 3186 Pls
5995 3186 Pls
6000 3186 Pls
6006 3186 Pls
6012 3186 Pls
6018 3186 Pls
6023 3186 Pls
6029 3186 Pls
6035 3186 Pls
6041 3186 Pls
6047 3186 Pls
6052 3186 Pls
6058 3186 Pls
6064 3186 Pls
6070 3186 Pls
6075 3186 Pls
6081 3186 Pls
6087 3186 Pls
6093 3186 Pls
6099 3186 Pls
6104 3186 Pls
6110 3186 Pls
6116 3186 Pls
6122 3186 Pls
6127 3186 Pls
6133 3186 Pls
6139 3186 Pls
6145 3186 Pls
6151 3186 Pls
6156 3186 Pls
6162 3186 Pls
6168 3186 Pls
6174 3186 Pls
6179 3186 Pls
6185 3186 Pls
6191 3186 Pls
6197 3186 Pls
6203 3186 Pls
6208 3186 Pls
6214 3186 Pls
6220 3186 Pls
6226 3186 Pls
6231 3186 Pls
6237 3186 Pls
6243 3186 Pls
6249 3186 Pls
6255 3186 Pls
6260 3186 Pls
6266 3186 Pls
6272 3186 Pls
6278 3186 Pls
6283 3186 Pls
6289 3186 Pls
6295 3186 Pls
6301 3186 Pls
6307 3186 Pls
6312 3186 Pls
6318 3186 Pls
6324 3186 Pls
6330 3186 Pls
6336 3186 Pls
6341 3186 Pls
6347 3186 Pls
6353 3186 Pls
6359 3186 Pls
6364 3186 Pls
6370 3186 Pls
6376 3186 Pls
6382 3186 Pls
6388 3186 Pls
6393 3186 Pls
6399 3186 Pls
6405 3186 Pls
6411 3186 Pls
6416 3186 Pls
6422 3186 Pls
6428 3186 Pls
6434 3186 Pls
6440 3186 Pls
6445 3186 Pls
6451 3186 Pls
6457 3186 Pls
6463 3186 Pls
6468 3186 Pls
6474 3186 Pls
6480 3186 Pls
6486 3186 Pls
6492 3186 Pls
6497 3186 Pls
6503 3186 Pls
6509 3186 Pls
6515 3186 Pls
6520 3186 Pls
6526 3186 Pls
6532 3186 Pls
6538 3186 Pls
6544 3186 Pls
6549 3186 Pls
6555 3186 Pls
6561 3186 Pls
6567 3186 Pls
6567 3186 Pls
6567 3186 Pls
6285 4619 Pls
% End plot #1
1.000 UL
LTb
903 4787 N
903 672 L
5918 0 V
0 4115 V
-5918 0 V
Z stroke
1.000 UP
1.000 UL
LTb
stroke
grestore
end
showpage
%%Trailer
%%DocumentFonts: Roman
%%Pages: 1
