0	0.0171504	5.53e-05	3.07113	0.00933067	2.04589	0.00621581	0.052671	0.000233348	2.04596	0.00621559
4	0.15415	0.002541	3.06986	0.0279593	2.04673	0.018641	0.473219	0.00891199	2.05253	0.0185894
6	0.308362	0.009086	3.11386	0.0571724	2.01781	0.0370483	0.960195	0.0333358	2.04124	0.0366489
8	0.465396	0.01356	3.13748	0.0890813	2.00262	0.0568597	1.46017	0.0594036	2.05599	0.0554688
2.04659	0.00578823
2.04645	0.00578782
2.03495	0.00576824
1.99959	0.00626254
1.93787	0.00805181
