%!PS-Adobe-2.0 EPSF-2.0
%%Title: d6_f0.tex
%%Creator: gnuplot 4.6 patchlevel 1
%%CreationDate: Wed May 28 11:45:34 2014
%%DocumentFonts: 
%%BoundingBox: 50 50 410 302
%%EndComments
%%BeginProlog
/gnudict 256 dict def
gnudict begin
%
% The following true/false flags may be edited by hand if desired.
% The unit line width and grayscale image gamma correction may also be changed.
%
/Color true def
/Blacktext true def
/Solid false def
/Dashlength 1 def
/Landscape false def
/Level1 false def
/Rounded false def
/ClipToBoundingBox false def
/SuppressPDFMark false def
/TransparentPatterns false def
/gnulinewidth 5.000 def
/userlinewidth gnulinewidth def
/Gamma 1.0 def
/BackgroundColor {-1.000 -1.000 -1.000} def
%
/vshift -73 def
/dl1 {
  10.0 Dashlength mul mul
  Rounded { currentlinewidth 0.75 mul sub dup 0 le { pop 0.01 } if } if
} def
/dl2 {
  10.0 Dashlength mul mul
  Rounded { currentlinewidth 0.75 mul add } if
} def
/hpt_ 31.5 def
/vpt_ 31.5 def
/hpt hpt_ def
/vpt vpt_ def
/doclip {
  ClipToBoundingBox {
    newpath 50 50 moveto 410 50 lineto 410 302 lineto 50 302 lineto closepath
    clip
  } if
} def
%
% Gnuplot Prolog Version 4.6 (September 2012)
%
%/SuppressPDFMark true def
%
/M {moveto} bind def
/L {lineto} bind def
/R {rmoveto} bind def
/V {rlineto} bind def
/N {newpath moveto} bind def
/Z {closepath} bind def
/C {setrgbcolor} bind def
/f {rlineto fill} bind def
/g {setgray} bind def
/Gshow {show} def   % May be redefined later in the file to support UTF-8
/vpt2 vpt 2 mul def
/hpt2 hpt 2 mul def
/Lshow {currentpoint stroke M 0 vshift R 
	Blacktext {gsave 0 setgray show grestore} {show} ifelse} def
/Rshow {currentpoint stroke M dup stringwidth pop neg vshift R
	Blacktext {gsave 0 setgray show grestore} {show} ifelse} def
/Cshow {currentpoint stroke M dup stringwidth pop -2 div vshift R 
	Blacktext {gsave 0 setgray show grestore} {show} ifelse} def
/UP {dup vpt_ mul /vpt exch def hpt_ mul /hpt exch def
  /hpt2 hpt 2 mul def /vpt2 vpt 2 mul def} def
/DL {Color {setrgbcolor Solid {pop []} if 0 setdash}
 {pop pop pop 0 setgray Solid {pop []} if 0 setdash} ifelse} def
/BL {stroke userlinewidth 2 mul setlinewidth
	Rounded {1 setlinejoin 1 setlinecap} if} def
/AL {stroke userlinewidth 2 div setlinewidth
	Rounded {1 setlinejoin 1 setlinecap} if} def
/UL {dup gnulinewidth mul /userlinewidth exch def
	dup 1 lt {pop 1} if 10 mul /udl exch def} def
/PL {stroke userlinewidth setlinewidth
	Rounded {1 setlinejoin 1 setlinecap} if} def
3.8 setmiterlimit
% Default Line colors
/LCw {1 1 1} def
/LCb {0 0 0} def
/LCa {0 0 0} def
/LC0 {1 0 0} def
/LC1 {0 1 0} def
/LC2 {0 0 1} def
/LC3 {1 0 1} def
/LC4 {0 1 1} def
/LC5 {1 1 0} def
/LC6 {0 0 0} def
/LC7 {1 0.3 0} def
/LC8 {0.5 0.5 0.5} def
% Default Line Types
/LTw {PL [] 1 setgray} def
/LTb {BL [] LCb DL} def
/LTa {AL [1 udl mul 2 udl mul] 0 setdash LCa setrgbcolor} def
/LT0 {PL [] LC0 DL} def
/LT1 {PL [4 dl1 2 dl2] LC1 DL} def
/LT2 {PL [2 dl1 3 dl2] LC2 DL} def
/LT3 {PL [1 dl1 1.5 dl2] LC3 DL} def
/LT4 {PL [6 dl1 2 dl2 1 dl1 2 dl2] LC4 DL} def
/LT5 {PL [3 dl1 3 dl2 1 dl1 3 dl2] LC5 DL} def
/LT6 {PL [2 dl1 2 dl2 2 dl1 6 dl2] LC6 DL} def
/LT7 {PL [1 dl1 2 dl2 6 dl1 2 dl2 1 dl1 2 dl2] LC7 DL} def
/LT8 {PL [2 dl1 2 dl2 2 dl1 2 dl2 2 dl1 2 dl2 2 dl1 4 dl2] LC8 DL} def
/Pnt {stroke [] 0 setdash gsave 1 setlinecap M 0 0 V stroke grestore} def
/Dia {stroke [] 0 setdash 2 copy vpt add M
  hpt neg vpt neg V hpt vpt neg V
  hpt vpt V hpt neg vpt V closepath stroke
  Pnt} def
/Pls {stroke [] 0 setdash vpt sub M 0 vpt2 V
  currentpoint stroke M
  hpt neg vpt neg R hpt2 0 V stroke
 } def
/Box {stroke [] 0 setdash 2 copy exch hpt sub exch vpt add M
  0 vpt2 neg V hpt2 0 V 0 vpt2 V
  hpt2 neg 0 V closepath stroke
  Pnt} def
/Crs {stroke [] 0 setdash exch hpt sub exch vpt add M
  hpt2 vpt2 neg V currentpoint stroke M
  hpt2 neg 0 R hpt2 vpt2 V stroke} def
/TriU {stroke [] 0 setdash 2 copy vpt 1.12 mul add M
  hpt neg vpt -1.62 mul V
  hpt 2 mul 0 V
  hpt neg vpt 1.62 mul V closepath stroke
  Pnt} def
/Star {2 copy Pls Crs} def
/BoxF {stroke [] 0 setdash exch hpt sub exch vpt add M
  0 vpt2 neg V hpt2 0 V 0 vpt2 V
  hpt2 neg 0 V closepath fill} def
/TriUF {stroke [] 0 setdash vpt 1.12 mul add M
  hpt neg vpt -1.62 mul V
  hpt 2 mul 0 V
  hpt neg vpt 1.62 mul V closepath fill} def
/TriD {stroke [] 0 setdash 2 copy vpt 1.12 mul sub M
  hpt neg vpt 1.62 mul V
  hpt 2 mul 0 V
  hpt neg vpt -1.62 mul V closepath stroke
  Pnt} def
/TriDF {stroke [] 0 setdash vpt 1.12 mul sub M
  hpt neg vpt 1.62 mul V
  hpt 2 mul 0 V
  hpt neg vpt -1.62 mul V closepath fill} def
/DiaF {stroke [] 0 setdash vpt add M
  hpt neg vpt neg V hpt vpt neg V
  hpt vpt V hpt neg vpt V closepath fill} def
/Pent {stroke [] 0 setdash 2 copy gsave
  translate 0 hpt M 4 {72 rotate 0 hpt L} repeat
  closepath stroke grestore Pnt} def
/PentF {stroke [] 0 setdash gsave
  translate 0 hpt M 4 {72 rotate 0 hpt L} repeat
  closepath fill grestore} def
/Circle {stroke [] 0 setdash 2 copy
  hpt 0 360 arc stroke Pnt} def
/CircleF {stroke [] 0 setdash hpt 0 360 arc fill} def
/C0 {BL [] 0 setdash 2 copy moveto vpt 90 450 arc} bind def
/C1 {BL [] 0 setdash 2 copy moveto
	2 copy vpt 0 90 arc closepath fill
	vpt 0 360 arc closepath} bind def
/C2 {BL [] 0 setdash 2 copy moveto
	2 copy vpt 90 180 arc closepath fill
	vpt 0 360 arc closepath} bind def
/C3 {BL [] 0 setdash 2 copy moveto
	2 copy vpt 0 180 arc closepath fill
	vpt 0 360 arc closepath} bind def
/C4 {BL [] 0 setdash 2 copy moveto
	2 copy vpt 180 270 arc closepath fill
	vpt 0 360 arc closepath} bind def
/C5 {BL [] 0 setdash 2 copy moveto
	2 copy vpt 0 90 arc
	2 copy moveto
	2 copy vpt 180 270 arc closepath fill
	vpt 0 360 arc} bind def
/C6 {BL [] 0 setdash 2 copy moveto
	2 copy vpt 90 270 arc closepath fill
	vpt 0 360 arc closepath} bind def
/C7 {BL [] 0 setdash 2 copy moveto
	2 copy vpt 0 270 arc closepath fill
	vpt 0 360 arc closepath} bind def
/C8 {BL [] 0 setdash 2 copy moveto
	2 copy vpt 270 360 arc closepath fill
	vpt 0 360 arc closepath} bind def
/C9 {BL [] 0 setdash 2 copy moveto
	2 copy vpt 270 450 arc closepath fill
	vpt 0 360 arc closepath} bind def
/C10 {BL [] 0 setdash 2 copy 2 copy moveto vpt 270 360 arc closepath fill
	2 copy moveto
	2 copy vpt 90 180 arc closepath fill
	vpt 0 360 arc closepath} bind def
/C11 {BL [] 0 setdash 2 copy moveto
	2 copy vpt 0 180 arc closepath fill
	2 copy moveto
	2 copy vpt 270 360 arc closepath fill
	vpt 0 360 arc closepath} bind def
/C12 {BL [] 0 setdash 2 copy moveto
	2 copy vpt 180 360 arc closepath fill
	vpt 0 360 arc closepath} bind def
/C13 {BL [] 0 setdash 2 copy moveto
	2 copy vpt 0 90 arc closepath fill
	2 copy moveto
	2 copy vpt 180 360 arc closepath fill
	vpt 0 360 arc closepath} bind def
/C14 {BL [] 0 setdash 2 copy moveto
	2 copy vpt 90 360 arc closepath fill
	vpt 0 360 arc} bind def
/C15 {BL [] 0 setdash 2 copy vpt 0 360 arc closepath fill
	vpt 0 360 arc closepath} bind def
/Rec {newpath 4 2 roll moveto 1 index 0 rlineto 0 exch rlineto
	neg 0 rlineto closepath} bind def
/Square {dup Rec} bind def
/Bsquare {vpt sub exch vpt sub exch vpt2 Square} bind def
/S0 {BL [] 0 setdash 2 copy moveto 0 vpt rlineto BL Bsquare} bind def
/S1 {BL [] 0 setdash 2 copy vpt Square fill Bsquare} bind def
/S2 {BL [] 0 setdash 2 copy exch vpt sub exch vpt Square fill Bsquare} bind def
/S3 {BL [] 0 setdash 2 copy exch vpt sub exch vpt2 vpt Rec fill Bsquare} bind def
/S4 {BL [] 0 setdash 2 copy exch vpt sub exch vpt sub vpt Square fill Bsquare} bind def
/S5 {BL [] 0 setdash 2 copy 2 copy vpt Square fill
	exch vpt sub exch vpt sub vpt Square fill Bsquare} bind def
/S6 {BL [] 0 setdash 2 copy exch vpt sub exch vpt sub vpt vpt2 Rec fill Bsquare} bind def
/S7 {BL [] 0 setdash 2 copy exch vpt sub exch vpt sub vpt vpt2 Rec fill
	2 copy vpt Square fill Bsquare} bind def
/S8 {BL [] 0 setdash 2 copy vpt sub vpt Square fill Bsquare} bind def
/S9 {BL [] 0 setdash 2 copy vpt sub vpt vpt2 Rec fill Bsquare} bind def
/S10 {BL [] 0 setdash 2 copy vpt sub vpt Square fill 2 copy exch vpt sub exch vpt Square fill
	Bsquare} bind def
/S11 {BL [] 0 setdash 2 copy vpt sub vpt Square fill 2 copy exch vpt sub exch vpt2 vpt Rec fill
	Bsquare} bind def
/S12 {BL [] 0 setdash 2 copy exch vpt sub exch vpt sub vpt2 vpt Rec fill Bsquare} bind def
/S13 {BL [] 0 setdash 2 copy exch vpt sub exch vpt sub vpt2 vpt Rec fill
	2 copy vpt Square fill Bsquare} bind def
/S14 {BL [] 0 setdash 2 copy exch vpt sub exch vpt sub vpt2 vpt Rec fill
	2 copy exch vpt sub exch vpt Square fill Bsquare} bind def
/S15 {BL [] 0 setdash 2 copy Bsquare fill Bsquare} bind def
/D0 {gsave translate 45 rotate 0 0 S0 stroke grestore} bind def
/D1 {gsave translate 45 rotate 0 0 S1 stroke grestore} bind def
/D2 {gsave translate 45 rotate 0 0 S2 stroke grestore} bind def
/D3 {gsave translate 45 rotate 0 0 S3 stroke grestore} bind def
/D4 {gsave translate 45 rotate 0 0 S4 stroke grestore} bind def
/D5 {gsave translate 45 rotate 0 0 S5 stroke grestore} bind def
/D6 {gsave translate 45 rotate 0 0 S6 stroke grestore} bind def
/D7 {gsave translate 45 rotate 0 0 S7 stroke grestore} bind def
/D8 {gsave translate 45 rotate 0 0 S8 stroke grestore} bind def
/D9 {gsave translate 45 rotate 0 0 S9 stroke grestore} bind def
/D10 {gsave translate 45 rotate 0 0 S10 stroke grestore} bind def
/D11 {gsave translate 45 rotate 0 0 S11 stroke grestore} bind def
/D12 {gsave translate 45 rotate 0 0 S12 stroke grestore} bind def
/D13 {gsave translate 45 rotate 0 0 S13 stroke grestore} bind def
/D14 {gsave translate 45 rotate 0 0 S14 stroke grestore} bind def
/D15 {gsave translate 45 rotate 0 0 S15 stroke grestore} bind def
/DiaE {stroke [] 0 setdash vpt add M
  hpt neg vpt neg V hpt vpt neg V
  hpt vpt V hpt neg vpt V closepath stroke} def
/BoxE {stroke [] 0 setdash exch hpt sub exch vpt add M
  0 vpt2 neg V hpt2 0 V 0 vpt2 V
  hpt2 neg 0 V closepath stroke} def
/TriUE {stroke [] 0 setdash vpt 1.12 mul add M
  hpt neg vpt -1.62 mul V
  hpt 2 mul 0 V
  hpt neg vpt 1.62 mul V closepath stroke} def
/TriDE {stroke [] 0 setdash vpt 1.12 mul sub M
  hpt neg vpt 1.62 mul V
  hpt 2 mul 0 V
  hpt neg vpt -1.62 mul V closepath stroke} def
/PentE {stroke [] 0 setdash gsave
  translate 0 hpt M 4 {72 rotate 0 hpt L} repeat
  closepath stroke grestore} def
/CircE {stroke [] 0 setdash 
  hpt 0 360 arc stroke} def
/Opaque {gsave closepath 1 setgray fill grestore 0 setgray closepath} def
/DiaW {stroke [] 0 setdash vpt add M
  hpt neg vpt neg V hpt vpt neg V
  hpt vpt V hpt neg vpt V Opaque stroke} def
/BoxW {stroke [] 0 setdash exch hpt sub exch vpt add M
  0 vpt2 neg V hpt2 0 V 0 vpt2 V
  hpt2 neg 0 V Opaque stroke} def
/TriUW {stroke [] 0 setdash vpt 1.12 mul add M
  hpt neg vpt -1.62 mul V
  hpt 2 mul 0 V
  hpt neg vpt 1.62 mul V Opaque stroke} def
/TriDW {stroke [] 0 setdash vpt 1.12 mul sub M
  hpt neg vpt 1.62 mul V
  hpt 2 mul 0 V
  hpt neg vpt -1.62 mul V Opaque stroke} def
/PentW {stroke [] 0 setdash gsave
  translate 0 hpt M 4 {72 rotate 0 hpt L} repeat
  Opaque stroke grestore} def
/CircW {stroke [] 0 setdash 
  hpt 0 360 arc Opaque stroke} def
/BoxFill {gsave Rec 1 setgray fill grestore} def
/Density {
  /Fillden exch def
  currentrgbcolor
  /ColB exch def /ColG exch def /ColR exch def
  /ColR ColR Fillden mul Fillden sub 1 add def
  /ColG ColG Fillden mul Fillden sub 1 add def
  /ColB ColB Fillden mul Fillden sub 1 add def
  ColR ColG ColB setrgbcolor} def
/BoxColFill {gsave Rec PolyFill} def
/PolyFill {gsave Density fill grestore grestore} def
/h {rlineto rlineto rlineto gsave closepath fill grestore} bind def
%
% PostScript Level 1 Pattern Fill routine for rectangles
% Usage: x y w h s a XX PatternFill
%	x,y = lower left corner of box to be filled
%	w,h = width and height of box
%	  a = angle in degrees between lines and x-axis
%	 XX = 0/1 for no/yes cross-hatch
%
/PatternFill {gsave /PFa [ 9 2 roll ] def
  PFa 0 get PFa 2 get 2 div add PFa 1 get PFa 3 get 2 div add translate
  PFa 2 get -2 div PFa 3 get -2 div PFa 2 get PFa 3 get Rec
  TransparentPatterns {} {gsave 1 setgray fill grestore} ifelse
  clip
  currentlinewidth 0.5 mul setlinewidth
  /PFs PFa 2 get dup mul PFa 3 get dup mul add sqrt def
  0 0 M PFa 5 get rotate PFs -2 div dup translate
  0 1 PFs PFa 4 get div 1 add floor cvi
	{PFa 4 get mul 0 M 0 PFs V} for
  0 PFa 6 get ne {
	0 1 PFs PFa 4 get div 1 add floor cvi
	{PFa 4 get mul 0 2 1 roll M PFs 0 V} for
 } if
  stroke grestore} def
%
/languagelevel where
 {pop languagelevel} {1} ifelse
 2 lt
	{/InterpretLevel1 true def}
	{/InterpretLevel1 Level1 def}
 ifelse
%
% PostScript level 2 pattern fill definitions
%
/Level2PatternFill {
/Tile8x8 {/PaintType 2 /PatternType 1 /TilingType 1 /BBox [0 0 8 8] /XStep 8 /YStep 8}
	bind def
/KeepColor {currentrgbcolor [/Pattern /DeviceRGB] setcolorspace} bind def
<< Tile8x8
 /PaintProc {0.5 setlinewidth pop 0 0 M 8 8 L 0 8 M 8 0 L stroke} 
>> matrix makepattern
/Pat1 exch def
<< Tile8x8
 /PaintProc {0.5 setlinewidth pop 0 0 M 8 8 L 0 8 M 8 0 L stroke
	0 4 M 4 8 L 8 4 L 4 0 L 0 4 L stroke}
>> matrix makepattern
/Pat2 exch def
<< Tile8x8
 /PaintProc {0.5 setlinewidth pop 0 0 M 0 8 L
	8 8 L 8 0 L 0 0 L fill}
>> matrix makepattern
/Pat3 exch def
<< Tile8x8
 /PaintProc {0.5 setlinewidth pop -4 8 M 8 -4 L
	0 12 M 12 0 L stroke}
>> matrix makepattern
/Pat4 exch def
<< Tile8x8
 /PaintProc {0.5 setlinewidth pop -4 0 M 8 12 L
	0 -4 M 12 8 L stroke}
>> matrix makepattern
/Pat5 exch def
<< Tile8x8
 /PaintProc {0.5 setlinewidth pop -2 8 M 4 -4 L
	0 12 M 8 -4 L 4 12 M 10 0 L stroke}
>> matrix makepattern
/Pat6 exch def
<< Tile8x8
 /PaintProc {0.5 setlinewidth pop -2 0 M 4 12 L
	0 -4 M 8 12 L 4 -4 M 10 8 L stroke}
>> matrix makepattern
/Pat7 exch def
<< Tile8x8
 /PaintProc {0.5 setlinewidth pop 8 -2 M -4 4 L
	12 0 M -4 8 L 12 4 M 0 10 L stroke}
>> matrix makepattern
/Pat8 exch def
<< Tile8x8
 /PaintProc {0.5 setlinewidth pop 0 -2 M 12 4 L
	-4 0 M 12 8 L -4 4 M 8 10 L stroke}
>> matrix makepattern
/Pat9 exch def
/Pattern1 {PatternBgnd KeepColor Pat1 setpattern} bind def
/Pattern2 {PatternBgnd KeepColor Pat2 setpattern} bind def
/Pattern3 {PatternBgnd KeepColor Pat3 setpattern} bind def
/Pattern4 {PatternBgnd KeepColor Landscape {Pat5} {Pat4} ifelse setpattern} bind def
/Pattern5 {PatternBgnd KeepColor Landscape {Pat4} {Pat5} ifelse setpattern} bind def
/Pattern6 {PatternBgnd KeepColor Landscape {Pat9} {Pat6} ifelse setpattern} bind def
/Pattern7 {PatternBgnd KeepColor Landscape {Pat8} {Pat7} ifelse setpattern} bind def
} def
%
%
%End of PostScript Level 2 code
%
/PatternBgnd {
  TransparentPatterns {} {gsave 1 setgray fill grestore} ifelse
} def
%
% Substitute for Level 2 pattern fill codes with
% grayscale if Level 2 support is not selected.
%
/Level1PatternFill {
/Pattern1 {0.250 Density} bind def
/Pattern2 {0.500 Density} bind def
/Pattern3 {0.750 Density} bind def
/Pattern4 {0.125 Density} bind def
/Pattern5 {0.375 Density} bind def
/Pattern6 {0.625 Density} bind def
/Pattern7 {0.875 Density} bind def
} def
%
% Now test for support of Level 2 code
%
Level1 {Level1PatternFill} {Level2PatternFill} ifelse
%
/Symbol-Oblique /Symbol findfont [1 0 .167 1 0 0] makefont
dup length dict begin {1 index /FID eq {pop pop} {def} ifelse} forall
currentdict end definefont pop
Level1 SuppressPDFMark or 
{} {
/SDict 10 dict def
systemdict /pdfmark known not {
  userdict /pdfmark systemdict /cleartomark get put
} if
SDict begin [
  /Title (d6_f0.tex)
  /Subject (gnuplot plot)
  /Creator (gnuplot 4.6 patchlevel 1)
  /Author (kevin.luedemann)
%  /Producer (gnuplot)
%  /Keywords ()
  /CreationDate (Wed May 28 11:45:34 2014)
  /DOCINFO pdfmark
end
} ifelse
end
%%EndProlog
%%Page: 1 1
gnudict begin
gsave
doclip
50 50 translate
0.050 0.050 scale
0 setgray
newpath
1.000 UL
LTb
LCb setrgbcolor
946 704 M
63 0 V
5794 0 R
-63 0 V
stroke
LTb
946 1213 M
63 0 V
5794 0 R
-63 0 V
946 1722 M
63 0 V
5794 0 R
-63 0 V
946 2231 M
63 0 V
5794 0 R
-63 0 V
946 2740 M
63 0 V
5794 0 R
-63 0 V
946 3248 M
63 0 V
5794 0 R
-63 0 V
946 3757 M
63 0 V
5794 0 R
-63 0 V
946 4266 M
63 0 V
5794 0 R
-63 0 V
946 4775 M
63 0 V
5794 0 R
-63 0 V
946 704 M
0 63 V
0 4008 R
0 -63 V
1678 704 M
0 63 V
0 4008 R
0 -63 V
2410 704 M
0 63 V
0 4008 R
0 -63 V
3142 704 M
0 63 V
0 4008 R
0 -63 V
3875 704 M
0 63 V
0 4008 R
0 -63 V
4607 704 M
0 63 V
0 4008 R
0 -63 V
5339 704 M
0 63 V
0 4008 R
0 -63 V
6071 704 M
0 63 V
0 4008 R
0 -63 V
6803 704 M
0 63 V
0 4008 R
0 -63 V
stroke
946 4775 N
946 704 L
5857 0 V
0 4071 V
-5857 0 V
Z stroke
1.000 UP
1.000 UL
LTb
1.000 UP
1.000 UL
LT0
LC0 setrgbcolor
LCb setrgbcolor
LT0
LC0 setrgbcolor
946 3312 Pls
952 3236 Pls
957 3159 Pls
963 3045 Pls
969 2968 Pls
975 2854 Pls
980 2778 Pls
986 2701 Pls
992 2625 Pls
997 2511 Pls
1003 2434 Pls
1009 2358 Pls
1015 2282 Pls
1020 2205 Pls
1026 2129 Pls
1032 2053 Pls
1038 1976 Pls
1043 1938 Pls
1049 1862 Pls
1055 1785 Pls
1060 1747 Pls
1066 1671 Pls
1072 1595 Pls
1078 1556 Pls
1083 1518 Pls
1089 1442 Pls
1095 1404 Pls
1100 1366 Pls
1106 1289 Pls
1112 1251 Pls
1118 1213 Pls
1123 1175 Pls
1129 1137 Pls
1135 1137 Pls
1140 1098 Pls
1146 1060 Pls
1152 1022 Pls
1158 1022 Pls
1163 984 Pls
1169 984 Pls
1175 946 Pls
1180 946 Pls
1186 946 Pls
1192 908 Pls
1198 908 Pls
1203 908 Pls
1209 908 Pls
1215 908 Pls
1221 908 Pls
1226 908 Pls
1232 908 Pls
1238 908 Pls
1243 946 Pls
1249 946 Pls
1255 946 Pls
1261 984 Pls
1266 984 Pls
1272 1022 Pls
1278 1060 Pls
1283 1060 Pls
1289 1098 Pls
1295 1137 Pls
1301 1175 Pls
1306 1175 Pls
1312 1213 Pls
1318 1251 Pls
1323 1289 Pls
1329 1327 Pls
1335 1404 Pls
1341 1442 Pls
1346 1480 Pls
1352 1518 Pls
1358 1556 Pls
1364 1633 Pls
1369 1671 Pls
1375 1709 Pls
1381 1747 Pls
1386 1824 Pls
1392 1862 Pls
1398 1938 Pls
1404 1976 Pls
1409 2053 Pls
1415 2091 Pls
1421 2129 Pls
1426 2205 Pls
1432 2282 Pls
1438 2320 Pls
1444 2396 Pls
1449 2434 Pls
1455 2511 Pls
1461 2549 Pls
1466 2625 Pls
1472 2701 Pls
1478 2740 Pls
1484 2816 Pls
1489 2854 Pls
1495 2930 Pls
1501 2968 Pls
1507 3045 Pls
1512 3083 Pls
1518 3159 Pls
1524 3197 Pls
1529 3274 Pls
1535 3312 Pls
1541 3388 Pls
1547 3426 Pls
1552 3503 Pls
1558 3541 Pls
1564 3579 Pls
1569 3655 Pls
1575 3694 Pls
1581 3732 Pls
1587 3808 Pls
1592 3846 Pls
1598 3884 Pls
1604 3923 Pls
1609 3999 Pls
1615 4037 Pls
1621 4075 Pls
1627 4113 Pls
1632 4152 Pls
1638 4190 Pls
1644 4228 Pls
1649 4266 Pls
1655 4304 Pls
1661 4342 Pls
1667 4342 Pls
1672 4381 Pls
1678 4419 Pls
1684 4457 Pls
1690 4457 Pls
1695 4495 Pls
1701 4495 Pls
1707 4533 Pls
1712 4571 Pls
1718 4571 Pls
1724 4571 Pls
1730 4610 Pls
1735 4610 Pls
1741 4610 Pls
1747 4648 Pls
1752 4648 Pls
1758 4648 Pls
1764 4648 Pls
1770 4648 Pls
1775 4648 Pls
1781 4648 Pls
1787 4648 Pls
1793 4648 Pls
1798 4648 Pls
1804 4610 Pls
1810 4610 Pls
1815 4610 Pls
1821 4610 Pls
1827 4610 Pls
1833 4571 Pls
1838 4571 Pls
1844 4533 Pls
1850 4533 Pls
1855 4533 Pls
1861 4495 Pls
1867 4495 Pls
1873 4457 Pls
1878 4419 Pls
1884 4419 Pls
1890 4381 Pls
1895 4381 Pls
1901 4342 Pls
1907 4304 Pls
1913 4266 Pls
1918 4266 Pls
1924 4228 Pls
1930 4190 Pls
1936 4152 Pls
1941 4113 Pls
1947 4113 Pls
1953 4075 Pls
1958 4037 Pls
1964 3999 Pls
1970 3961 Pls
1976 3923 Pls
1981 3884 Pls
1987 3846 Pls
1993 3808 Pls
1998 3770 Pls
2004 3732 Pls
2010 3732 Pls
2016 3694 Pls
2021 3655 Pls
2027 3617 Pls
2033 3579 Pls
2038 3541 Pls
2044 3503 Pls
2050 3465 Pls
2056 3426 Pls
2061 3388 Pls
2067 3350 Pls
2073 3312 Pls
2078 3274 Pls
2084 3236 Pls
2090 3197 Pls
2096 3159 Pls
2101 3121 Pls
2107 3083 Pls
2113 3045 Pls
2119 3007 Pls
2124 3007 Pls
2130 2968 Pls
2136 2930 Pls
2141 2892 Pls
2147 2854 Pls
2153 2816 Pls
2159 2816 Pls
2164 2778 Pls
2170 2740 Pls
2176 2701 Pls
2181 2701 Pls
2187 2663 Pls
2193 2625 Pls
2199 2625 Pls
2204 2587 Pls
2210 2587 Pls
2216 2549 Pls
2222 2549 Pls
2227 2511 Pls
2233 2472 Pls
2239 2472 Pls
2244 2472 Pls
2250 2434 Pls
2256 2434 Pls
2262 2396 Pls
2267 2396 Pls
2273 2396 Pls
2279 2358 Pls
2284 2358 Pls
2290 2358 Pls
2296 2358 Pls
2302 2320 Pls
2307 2320 Pls
2313 2320 Pls
2319 2320 Pls
2324 2320 Pls
2330 2320 Pls
2336 2320 Pls
2342 2320 Pls
2347 2320 Pls
2353 2320 Pls
2359 2320 Pls
2364 2320 Pls
2370 2358 Pls
2376 2358 Pls
2382 2358 Pls
2387 2358 Pls
2393 2358 Pls
2399 2358 Pls
2405 2396 Pls
2410 2396 Pls
2416 2396 Pls
2422 2396 Pls
2427 2434 Pls
2433 2434 Pls
2439 2434 Pls
2445 2472 Pls
2450 2472 Pls
2456 2472 Pls
2462 2511 Pls
2467 2511 Pls
2473 2549 Pls
2479 2549 Pls
2485 2587 Pls
2490 2587 Pls
2496 2625 Pls
2502 2625 Pls
2507 2663 Pls
2513 2663 Pls
2519 2701 Pls
2525 2701 Pls
2530 2740 Pls
2536 2740 Pls
2542 2778 Pls
2548 2816 Pls
2553 2816 Pls
2559 2854 Pls
2565 2854 Pls
2570 2892 Pls
2576 2930 Pls
2582 2930 Pls
2588 2968 Pls
2593 2968 Pls
2599 3007 Pls
2605 3045 Pls
2610 3045 Pls
2616 3083 Pls
2622 3083 Pls
2628 3121 Pls
2633 3159 Pls
2639 3159 Pls
2645 3197 Pls
2650 3197 Pls
2656 3236 Pls
2662 3274 Pls
2668 3274 Pls
2673 3312 Pls
2679 3312 Pls
2685 3350 Pls
2691 3350 Pls
2696 3388 Pls
2702 3388 Pls
2708 3426 Pls
2713 3426 Pls
2719 3465 Pls
2725 3465 Pls
2731 3503 Pls
2736 3503 Pls
2742 3541 Pls
2748 3541 Pls
2753 3579 Pls
2759 3579 Pls
2765 3579 Pls
2771 3617 Pls
2776 3617 Pls
2782 3655 Pls
2788 3655 Pls
2793 3655 Pls
2799 3655 Pls
2805 3694 Pls
2811 3694 Pls
2816 3694 Pls
2822 3732 Pls
2828 3732 Pls
2833 3732 Pls
2839 3732 Pls
2845 3732 Pls
2851 3770 Pls
2856 3770 Pls
2862 3770 Pls
2868 3770 Pls
2874 3770 Pls
2879 3770 Pls
2885 3770 Pls
2891 3770 Pls
2896 3770 Pls
2902 3770 Pls
2908 3770 Pls
2914 3770 Pls
2919 3770 Pls
2925 3770 Pls
2931 3770 Pls
2936 3770 Pls
2942 3770 Pls
2948 3770 Pls
2954 3732 Pls
2959 3732 Pls
2965 3732 Pls
2971 3732 Pls
2976 3732 Pls
2982 3732 Pls
2988 3694 Pls
2994 3694 Pls
2999 3694 Pls
3005 3694 Pls
3011 3694 Pls
3017 3655 Pls
3022 3655 Pls
3028 3655 Pls
3034 3655 Pls
3039 3617 Pls
3045 3617 Pls
3051 3617 Pls
3057 3579 Pls
3062 3579 Pls
3068 3579 Pls
3074 3541 Pls
3079 3541 Pls
3085 3541 Pls
3091 3503 Pls
3097 3503 Pls
3102 3503 Pls
3108 3465 Pls
3114 3465 Pls
3119 3465 Pls
3125 3426 Pls
3131 3426 Pls
3137 3426 Pls
3142 3388 Pls
3148 3388 Pls
3154 3350 Pls
3160 3350 Pls
3165 3350 Pls
3171 3312 Pls
3177 3312 Pls
3182 3312 Pls
3188 3274 Pls
3194 3274 Pls
3200 3236 Pls
3205 3236 Pls
3211 3236 Pls
3217 3197 Pls
3222 3197 Pls
3228 3197 Pls
3234 3159 Pls
3240 3159 Pls
3245 3159 Pls
3251 3121 Pls
3257 3121 Pls
3262 3121 Pls
3268 3083 Pls
3274 3083 Pls
3280 3083 Pls
3285 3045 Pls
3291 3045 Pls
3297 3045 Pls
3303 3007 Pls
3308 3007 Pls
3314 3007 Pls
3320 3007 Pls
3325 2968 Pls
3331 2968 Pls
3337 2968 Pls
3343 2968 Pls
3348 2968 Pls
3354 2930 Pls
3360 2930 Pls
3365 2930 Pls
3371 2930 Pls
3377 2930 Pls
3383 2892 Pls
3388 2892 Pls
3394 2892 Pls
3400 2892 Pls
3405 2892 Pls
3411 2892 Pls
3417 2892 Pls
3423 2892 Pls
3428 2892 Pls
3434 2854 Pls
3440 2854 Pls
3446 2854 Pls
3451 2854 Pls
3457 2854 Pls
3463 2854 Pls
3468 2854 Pls
3474 2854 Pls
3480 2854 Pls
3486 2854 Pls
3491 2854 Pls
3497 2854 Pls
3503 2854 Pls
3508 2854 Pls
3514 2854 Pls
3520 2854 Pls
3526 2854 Pls
3531 2854 Pls
3537 2854 Pls
3543 2854 Pls
3548 2892 Pls
3554 2892 Pls
3560 2892 Pls
3566 2892 Pls
3571 2892 Pls
3577 2892 Pls
3583 2892 Pls
3588 2892 Pls
3594 2930 Pls
3600 2930 Pls
3606 2930 Pls
3611 2930 Pls
3617 2930 Pls
3623 2968 Pls
3629 2968 Pls
3634 2968 Pls
3640 2968 Pls
3646 2968 Pls
3651 3007 Pls
3657 3007 Pls
3663 3007 Pls
3669 3007 Pls
3674 3007 Pls
3680 3045 Pls
3686 3045 Pls
3691 3045 Pls
3697 3045 Pls
3703 3083 Pls
3709 3083 Pls
3714 3083 Pls
3720 3083 Pls
3726 3121 Pls
3732 3121 Pls
3737 3121 Pls
3743 3121 Pls
3749 3121 Pls
3754 3159 Pls
3760 3159 Pls
3766 3159 Pls
3772 3159 Pls
3777 3197 Pls
3783 3197 Pls
3789 3197 Pls
3794 3197 Pls
3800 3236 Pls
3806 3236 Pls
3812 3236 Pls
3817 3236 Pls
3823 3236 Pls
3829 3274 Pls
3834 3274 Pls
3840 3274 Pls
3846 3274 Pls
3852 3274 Pls
3857 3312 Pls
3863 3312 Pls
3869 3312 Pls
3875 3312 Pls
3880 3312 Pls
3886 3312 Pls
3892 3350 Pls
3897 3350 Pls
3903 3350 Pls
3909 3350 Pls
3915 3350 Pls
3920 3350 Pls
3926 3350 Pls
3932 3350 Pls
3937 3388 Pls
3943 3388 Pls
3949 3388 Pls
3955 3388 Pls
3960 3388 Pls
3966 3388 Pls
3972 3388 Pls
3977 3388 Pls
3983 3388 Pls
3989 3388 Pls
3995 3426 Pls
4000 3426 Pls
4006 3426 Pls
4012 3426 Pls
4017 3426 Pls
4023 3426 Pls
4029 3426 Pls
4035 3426 Pls
4040 3426 Pls
4046 3426 Pls
4052 3426 Pls
4058 3426 Pls
4063 3426 Pls
4069 3426 Pls
4075 3426 Pls
4080 3426 Pls
4086 3426 Pls
4092 3426 Pls
4098 3426 Pls
4103 3426 Pls
4109 3388 Pls
4115 3388 Pls
4120 3388 Pls
4126 3388 Pls
4132 3388 Pls
4138 3388 Pls
4143 3388 Pls
4149 3388 Pls
4155 3388 Pls
4160 3388 Pls
4166 3388 Pls
4172 3350 Pls
4178 3350 Pls
4183 3350 Pls
4189 3350 Pls
4195 3350 Pls
4201 3350 Pls
4206 3350 Pls
4212 3350 Pls
4218 3350 Pls
4223 3312 Pls
4229 3312 Pls
4235 3312 Pls
4241 3312 Pls
4246 3312 Pls
4252 3312 Pls
4258 3312 Pls
4263 3274 Pls
4269 3274 Pls
4275 3274 Pls
4281 3274 Pls
4286 3274 Pls
4292 3274 Pls
4298 3274 Pls
4303 3236 Pls
4309 3236 Pls
4315 3236 Pls
4321 3236 Pls
4326 3236 Pls
4332 3236 Pls
4338 3197 Pls
4343 3197 Pls
4349 3197 Pls
4355 3197 Pls
4361 3197 Pls
4366 3197 Pls
4372 3197 Pls
4378 3197 Pls
4384 3159 Pls
4389 3159 Pls
4395 3159 Pls
4401 3159 Pls
4406 3159 Pls
4412 3159 Pls
4418 3159 Pls
4424 3159 Pls
4429 3121 Pls
4435 3121 Pls
4441 3121 Pls
4446 3121 Pls
4452 3121 Pls
4458 3121 Pls
4464 3121 Pls
4469 3121 Pls
4475 3121 Pls
4481 3121 Pls
4486 3121 Pls
4492 3083 Pls
4498 3083 Pls
4504 3083 Pls
4509 3083 Pls
4515 3083 Pls
4521 3083 Pls
4527 3083 Pls
4532 3083 Pls
4538 3083 Pls
4544 3083 Pls
4549 3083 Pls
4555 3083 Pls
4561 3083 Pls
4567 3083 Pls
4572 3083 Pls
4578 3083 Pls
4584 3083 Pls
4589 3083 Pls
4595 3083 Pls
4601 3083 Pls
4607 3083 Pls
4612 3083 Pls
4618 3083 Pls
4624 3083 Pls
4630 3083 Pls
4635 3083 Pls
4641 3083 Pls
4647 3083 Pls
4652 3083 Pls
4658 3083 Pls
4664 3121 Pls
4670 3121 Pls
4675 3121 Pls
4681 3121 Pls
4687 3121 Pls
4692 3121 Pls
4698 3121 Pls
4704 3121 Pls
4710 3121 Pls
4715 3121 Pls
4721 3121 Pls
4727 3121 Pls
4732 3121 Pls
4738 3121 Pls
4744 3121 Pls
4750 3121 Pls
4755 3121 Pls
4761 3159 Pls
4767 3159 Pls
4772 3159 Pls
4778 3159 Pls
4784 3159 Pls
4790 3159 Pls
4795 3159 Pls
4801 3159 Pls
4807 3159 Pls
4813 3159 Pls
4818 3159 Pls
4824 3159 Pls
4830 3197 Pls
4835 3197 Pls
4841 3197 Pls
4847 3197 Pls
4853 3197 Pls
4858 3197 Pls
4864 3197 Pls
4870 3197 Pls
4875 3197 Pls
4881 3197 Pls
4887 3197 Pls
4893 3236 Pls
4898 3236 Pls
4904 3236 Pls
4910 3236 Pls
4915 3236 Pls
4921 3236 Pls
4927 3236 Pls
4933 3236 Pls
4938 3236 Pls
4944 3236 Pls
4950 3236 Pls
4956 3236 Pls
4961 3274 Pls
4967 3274 Pls
4973 3274 Pls
4978 3274 Pls
4984 3274 Pls
4990 3274 Pls
4996 3274 Pls
5001 3274 Pls
5007 3274 Pls
5013 3274 Pls
5018 3274 Pls
5024 3274 Pls
5030 3274 Pls
5036 3274 Pls
5041 3274 Pls
5047 3274 Pls
5053 3274 Pls
5058 3312 Pls
5064 3312 Pls
5070 3312 Pls
5076 3312 Pls
5081 3312 Pls
5087 3312 Pls
5093 3312 Pls
5099 3312 Pls
5104 3312 Pls
5110 3312 Pls
5116 3312 Pls
5121 3312 Pls
5127 3312 Pls
5133 3312 Pls
5139 3312 Pls
5144 3312 Pls
5150 3312 Pls
5156 3312 Pls
5161 3312 Pls
5167 3312 Pls
5173 3312 Pls
5179 3312 Pls
5184 3312 Pls
5190 3312 Pls
5196 3312 Pls
5201 3312 Pls
5207 3312 Pls
5213 3312 Pls
5219 3312 Pls
5224 3312 Pls
5230 3312 Pls
5236 3312 Pls
5242 3312 Pls
5247 3312 Pls
5253 3312 Pls
5259 3312 Pls
5264 3312 Pls
5270 3312 Pls
5276 3312 Pls
5282 3312 Pls
5287 3312 Pls
5293 3312 Pls
5299 3312 Pls
5304 3312 Pls
5310 3312 Pls
5316 3312 Pls
5322 3312 Pls
5327 3312 Pls
5333 3312 Pls
5339 3312 Pls
5344 3312 Pls
5350 3312 Pls
5356 3274 Pls
5362 3274 Pls
5367 3274 Pls
5373 3274 Pls
5379 3274 Pls
5385 3274 Pls
5390 3274 Pls
5396 3274 Pls
5402 3274 Pls
5407 3274 Pls
5413 3274 Pls
5419 3274 Pls
5425 3274 Pls
5430 3274 Pls
5436 3274 Pls
5442 3274 Pls
5447 3274 Pls
5453 3274 Pls
5459 3236 Pls
5465 3236 Pls
5470 3236 Pls
5476 3236 Pls
5482 3236 Pls
5487 3236 Pls
5493 3236 Pls
5499 3236 Pls
5505 3236 Pls
5510 3236 Pls
5516 3236 Pls
5522 3236 Pls
5527 3236 Pls
5533 3236 Pls
5539 3236 Pls
5545 3236 Pls
5550 3236 Pls
5556 3236 Pls
5562 3236 Pls
5568 3236 Pls
5573 3236 Pls
5579 3197 Pls
5585 3197 Pls
5590 3197 Pls
5596 3197 Pls
5602 3197 Pls
5608 3197 Pls
5613 3197 Pls
5619 3197 Pls
5625 3197 Pls
5630 3197 Pls
5636 3197 Pls
5642 3197 Pls
5648 3197 Pls
5653 3197 Pls
5659 3197 Pls
5665 3197 Pls
5670 3197 Pls
5676 3197 Pls
5682 3197 Pls
5688 3197 Pls
5693 3197 Pls
5699 3197 Pls
5705 3197 Pls
5711 3197 Pls
5716 3197 Pls
5722 3197 Pls
5728 3197 Pls
5733 3197 Pls
5739 3197 Pls
5745 3197 Pls
5751 3197 Pls
5756 3197 Pls
5762 3197 Pls
5768 3197 Pls
5773 3197 Pls
5779 3197 Pls
5785 3197 Pls
5791 3197 Pls
5796 3197 Pls
5802 3197 Pls
5808 3197 Pls
5813 3197 Pls
5819 3197 Pls
5825 3197 Pls
5831 3197 Pls
5836 3197 Pls
5842 3197 Pls
5848 3197 Pls
5854 3197 Pls
5859 3197 Pls
5865 3197 Pls
5871 3197 Pls
5876 3197 Pls
5882 3197 Pls
5888 3197 Pls
5894 3197 Pls
5899 3197 Pls
5905 3197 Pls
5911 3197 Pls
5916 3197 Pls
5922 3197 Pls
5928 3197 Pls
5934 3197 Pls
5939 3197 Pls
5945 3197 Pls
5951 3197 Pls
5956 3197 Pls
5962 3197 Pls
5968 3197 Pls
5974 3197 Pls
5979 3197 Pls
5985 3197 Pls
5991 3197 Pls
5996 3197 Pls
6002 3197 Pls
6008 3197 Pls
6014 3197 Pls
6019 3197 Pls
6025 3197 Pls
6031 3197 Pls
6037 3197 Pls
6042 3197 Pls
6048 3197 Pls
6054 3197 Pls
6059 3197 Pls
6065 3197 Pls
6071 3197 Pls
6077 3197 Pls
6082 3197 Pls
6088 3197 Pls
6094 3197 Pls
6099 3197 Pls
6105 3197 Pls
6111 3197 Pls
6117 3197 Pls
6122 3197 Pls
6128 3197 Pls
6134 3197 Pls
6140 3197 Pls
6145 3197 Pls
6151 3197 Pls
6157 3197 Pls
6162 3197 Pls
6168 3197 Pls
6174 3197 Pls
6180 3197 Pls
6185 3197 Pls
6191 3197 Pls
6197 3197 Pls
6202 3197 Pls
6208 3197 Pls
6214 3197 Pls
6220 3197 Pls
6225 3197 Pls
6231 3197 Pls
6237 3197 Pls
6242 3197 Pls
6248 3197 Pls
6254 3197 Pls
6260 3197 Pls
6265 3197 Pls
6271 3197 Pls
6277 3197 Pls
6282 3197 Pls
6288 3197 Pls
6294 3197 Pls
6300 3197 Pls
6305 3197 Pls
6311 3197 Pls
6317 3197 Pls
6323 3197 Pls
6328 3197 Pls
6334 3197 Pls
6340 3197 Pls
6345 3197 Pls
6351 3197 Pls
6357 3197 Pls
6363 3197 Pls
6368 3197 Pls
6374 3197 Pls
6380 3197 Pls
6385 3197 Pls
6391 3197 Pls
6397 3197 Pls
6403 3197 Pls
6408 3197 Pls
6414 3197 Pls
6420 3197 Pls
6425 3197 Pls
6431 3197 Pls
6437 3197 Pls
6443 3197 Pls
6448 3197 Pls
6454 3197 Pls
6460 3197 Pls
6466 3197 Pls
6471 3197 Pls
6477 3197 Pls
6483 3197 Pls
6488 3197 Pls
6494 3197 Pls
6500 3197 Pls
6506 3197 Pls
6511 3197 Pls
6517 3197 Pls
6523 3197 Pls
6528 3197 Pls
6534 3197 Pls
6540 3197 Pls
6546 3197 Pls
6551 3197 Pls
6551 3197 Pls
6551 3197 Pls
2825 877 Pls
1.000 UL
LTb
LCb setrgbcolor
946 4775 N
946 704 L
5857 0 V
0 4071 V
-5857 0 V
Z stroke
1.000 UP
1.000 UL
LTb
stroke
grestore
end
showpage
%%Trailer
