%!PS-Adobe-2.0 EPSF-2.0
%%Title: d8_f0.tex
%%Creator: gnuplot 4.6 patchlevel 1
%%CreationDate: Wed May 28 11:52:33 2014
%%DocumentFonts: 
%%BoundingBox: 50 50 410 302
%%EndComments
%%BeginProlog
/gnudict 256 dict def
gnudict begin
%
% The following true/false flags may be edited by hand if desired.
% The unit line width and grayscale image gamma correction may also be changed.
%
/Color true def
/Blacktext true def
/Solid false def
/Dashlength 1 def
/Landscape false def
/Level1 false def
/Rounded false def
/ClipToBoundingBox false def
/SuppressPDFMark false def
/TransparentPatterns false def
/gnulinewidth 5.000 def
/userlinewidth gnulinewidth def
/Gamma 1.0 def
/BackgroundColor {-1.000 -1.000 -1.000} def
%
/vshift -73 def
/dl1 {
  10.0 Dashlength mul mul
  Rounded { currentlinewidth 0.75 mul sub dup 0 le { pop 0.01 } if } if
} def
/dl2 {
  10.0 Dashlength mul mul
  Rounded { currentlinewidth 0.75 mul add } if
} def
/hpt_ 31.5 def
/vpt_ 31.5 def
/hpt hpt_ def
/vpt vpt_ def
/doclip {
  ClipToBoundingBox {
    newpath 50 50 moveto 410 50 lineto 410 302 lineto 50 302 lineto closepath
    clip
  } if
} def
%
% Gnuplot Prolog Version 4.6 (September 2012)
%
%/SuppressPDFMark true def
%
/M {moveto} bind def
/L {lineto} bind def
/R {rmoveto} bind def
/V {rlineto} bind def
/N {newpath moveto} bind def
/Z {closepath} bind def
/C {setrgbcolor} bind def
/f {rlineto fill} bind def
/g {setgray} bind def
/Gshow {show} def   % May be redefined later in the file to support UTF-8
/vpt2 vpt 2 mul def
/hpt2 hpt 2 mul def
/Lshow {currentpoint stroke M 0 vshift R 
	Blacktext {gsave 0 setgray show grestore} {show} ifelse} def
/Rshow {currentpoint stroke M dup stringwidth pop neg vshift R
	Blacktext {gsave 0 setgray show grestore} {show} ifelse} def
/Cshow {currentpoint stroke M dup stringwidth pop -2 div vshift R 
	Blacktext {gsave 0 setgray show grestore} {show} ifelse} def
/UP {dup vpt_ mul /vpt exch def hpt_ mul /hpt exch def
  /hpt2 hpt 2 mul def /vpt2 vpt 2 mul def} def
/DL {Color {setrgbcolor Solid {pop []} if 0 setdash}
 {pop pop pop 0 setgray Solid {pop []} if 0 setdash} ifelse} def
/BL {stroke userlinewidth 2 mul setlinewidth
	Rounded {1 setlinejoin 1 setlinecap} if} def
/AL {stroke userlinewidth 2 div setlinewidth
	Rounded {1 setlinejoin 1 setlinecap} if} def
/UL {dup gnulinewidth mul /userlinewidth exch def
	dup 1 lt {pop 1} if 10 mul /udl exch def} def
/PL {stroke userlinewidth setlinewidth
	Rounded {1 setlinejoin 1 setlinecap} if} def
3.8 setmiterlimit
% Default Line colors
/LCw {1 1 1} def
/LCb {0 0 0} def
/LCa {0 0 0} def
/LC0 {1 0 0} def
/LC1 {0 1 0} def
/LC2 {0 0 1} def
/LC3 {1 0 1} def
/LC4 {0 1 1} def
/LC5 {1 1 0} def
/LC6 {0 0 0} def
/LC7 {1 0.3 0} def
/LC8 {0.5 0.5 0.5} def
% Default Line Types
/LTw {PL [] 1 setgray} def
/LTb {BL [] LCb DL} def
/LTa {AL [1 udl mul 2 udl mul] 0 setdash LCa setrgbcolor} def
/LT0 {PL [] LC0 DL} def
/LT1 {PL [4 dl1 2 dl2] LC1 DL} def
/LT2 {PL [2 dl1 3 dl2] LC2 DL} def
/LT3 {PL [1 dl1 1.5 dl2] LC3 DL} def
/LT4 {PL [6 dl1 2 dl2 1 dl1 2 dl2] LC4 DL} def
/LT5 {PL [3 dl1 3 dl2 1 dl1 3 dl2] LC5 DL} def
/LT6 {PL [2 dl1 2 dl2 2 dl1 6 dl2] LC6 DL} def
/LT7 {PL [1 dl1 2 dl2 6 dl1 2 dl2 1 dl1 2 dl2] LC7 DL} def
/LT8 {PL [2 dl1 2 dl2 2 dl1 2 dl2 2 dl1 2 dl2 2 dl1 4 dl2] LC8 DL} def
/Pnt {stroke [] 0 setdash gsave 1 setlinecap M 0 0 V stroke grestore} def
/Dia {stroke [] 0 setdash 2 copy vpt add M
  hpt neg vpt neg V hpt vpt neg V
  hpt vpt V hpt neg vpt V closepath stroke
  Pnt} def
/Pls {stroke [] 0 setdash vpt sub M 0 vpt2 V
  currentpoint stroke M
  hpt neg vpt neg R hpt2 0 V stroke
 } def
/Box {stroke [] 0 setdash 2 copy exch hpt sub exch vpt add M
  0 vpt2 neg V hpt2 0 V 0 vpt2 V
  hpt2 neg 0 V closepath stroke
  Pnt} def
/Crs {stroke [] 0 setdash exch hpt sub exch vpt add M
  hpt2 vpt2 neg V currentpoint stroke M
  hpt2 neg 0 R hpt2 vpt2 V stroke} def
/TriU {stroke [] 0 setdash 2 copy vpt 1.12 mul add M
  hpt neg vpt -1.62 mul V
  hpt 2 mul 0 V
  hpt neg vpt 1.62 mul V closepath stroke
  Pnt} def
/Star {2 copy Pls Crs} def
/BoxF {stroke [] 0 setdash exch hpt sub exch vpt add M
  0 vpt2 neg V hpt2 0 V 0 vpt2 V
  hpt2 neg 0 V closepath fill} def
/TriUF {stroke [] 0 setdash vpt 1.12 mul add M
  hpt neg vpt -1.62 mul V
  hpt 2 mul 0 V
  hpt neg vpt 1.62 mul V closepath fill} def
/TriD {stroke [] 0 setdash 2 copy vpt 1.12 mul sub M
  hpt neg vpt 1.62 mul V
  hpt 2 mul 0 V
  hpt neg vpt -1.62 mul V closepath stroke
  Pnt} def
/TriDF {stroke [] 0 setdash vpt 1.12 mul sub M
  hpt neg vpt 1.62 mul V
  hpt 2 mul 0 V
  hpt neg vpt -1.62 mul V closepath fill} def
/DiaF {stroke [] 0 setdash vpt add M
  hpt neg vpt neg V hpt vpt neg V
  hpt vpt V hpt neg vpt V closepath fill} def
/Pent {stroke [] 0 setdash 2 copy gsave
  translate 0 hpt M 4 {72 rotate 0 hpt L} repeat
  closepath stroke grestore Pnt} def
/PentF {stroke [] 0 setdash gsave
  translate 0 hpt M 4 {72 rotate 0 hpt L} repeat
  closepath fill grestore} def
/Circle {stroke [] 0 setdash 2 copy
  hpt 0 360 arc stroke Pnt} def
/CircleF {stroke [] 0 setdash hpt 0 360 arc fill} def
/C0 {BL [] 0 setdash 2 copy moveto vpt 90 450 arc} bind def
/C1 {BL [] 0 setdash 2 copy moveto
	2 copy vpt 0 90 arc closepath fill
	vpt 0 360 arc closepath} bind def
/C2 {BL [] 0 setdash 2 copy moveto
	2 copy vpt 90 180 arc closepath fill
	vpt 0 360 arc closepath} bind def
/C3 {BL [] 0 setdash 2 copy moveto
	2 copy vpt 0 180 arc closepath fill
	vpt 0 360 arc closepath} bind def
/C4 {BL [] 0 setdash 2 copy moveto
	2 copy vpt 180 270 arc closepath fill
	vpt 0 360 arc closepath} bind def
/C5 {BL [] 0 setdash 2 copy moveto
	2 copy vpt 0 90 arc
	2 copy moveto
	2 copy vpt 180 270 arc closepath fill
	vpt 0 360 arc} bind def
/C6 {BL [] 0 setdash 2 copy moveto
	2 copy vpt 90 270 arc closepath fill
	vpt 0 360 arc closepath} bind def
/C7 {BL [] 0 setdash 2 copy moveto
	2 copy vpt 0 270 arc closepath fill
	vpt 0 360 arc closepath} bind def
/C8 {BL [] 0 setdash 2 copy moveto
	2 copy vpt 270 360 arc closepath fill
	vpt 0 360 arc closepath} bind def
/C9 {BL [] 0 setdash 2 copy moveto
	2 copy vpt 270 450 arc closepath fill
	vpt 0 360 arc closepath} bind def
/C10 {BL [] 0 setdash 2 copy 2 copy moveto vpt 270 360 arc closepath fill
	2 copy moveto
	2 copy vpt 90 180 arc closepath fill
	vpt 0 360 arc closepath} bind def
/C11 {BL [] 0 setdash 2 copy moveto
	2 copy vpt 0 180 arc closepath fill
	2 copy moveto
	2 copy vpt 270 360 arc closepath fill
	vpt 0 360 arc closepath} bind def
/C12 {BL [] 0 setdash 2 copy moveto
	2 copy vpt 180 360 arc closepath fill
	vpt 0 360 arc closepath} bind def
/C13 {BL [] 0 setdash 2 copy moveto
	2 copy vpt 0 90 arc closepath fill
	2 copy moveto
	2 copy vpt 180 360 arc closepath fill
	vpt 0 360 arc closepath} bind def
/C14 {BL [] 0 setdash 2 copy moveto
	2 copy vpt 90 360 arc closepath fill
	vpt 0 360 arc} bind def
/C15 {BL [] 0 setdash 2 copy vpt 0 360 arc closepath fill
	vpt 0 360 arc closepath} bind def
/Rec {newpath 4 2 roll moveto 1 index 0 rlineto 0 exch rlineto
	neg 0 rlineto closepath} bind def
/Square {dup Rec} bind def
/Bsquare {vpt sub exch vpt sub exch vpt2 Square} bind def
/S0 {BL [] 0 setdash 2 copy moveto 0 vpt rlineto BL Bsquare} bind def
/S1 {BL [] 0 setdash 2 copy vpt Square fill Bsquare} bind def
/S2 {BL [] 0 setdash 2 copy exch vpt sub exch vpt Square fill Bsquare} bind def
/S3 {BL [] 0 setdash 2 copy exch vpt sub exch vpt2 vpt Rec fill Bsquare} bind def
/S4 {BL [] 0 setdash 2 copy exch vpt sub exch vpt sub vpt Square fill Bsquare} bind def
/S5 {BL [] 0 setdash 2 copy 2 copy vpt Square fill
	exch vpt sub exch vpt sub vpt Square fill Bsquare} bind def
/S6 {BL [] 0 setdash 2 copy exch vpt sub exch vpt sub vpt vpt2 Rec fill Bsquare} bind def
/S7 {BL [] 0 setdash 2 copy exch vpt sub exch vpt sub vpt vpt2 Rec fill
	2 copy vpt Square fill Bsquare} bind def
/S8 {BL [] 0 setdash 2 copy vpt sub vpt Square fill Bsquare} bind def
/S9 {BL [] 0 setdash 2 copy vpt sub vpt vpt2 Rec fill Bsquare} bind def
/S10 {BL [] 0 setdash 2 copy vpt sub vpt Square fill 2 copy exch vpt sub exch vpt Square fill
	Bsquare} bind def
/S11 {BL [] 0 setdash 2 copy vpt sub vpt Square fill 2 copy exch vpt sub exch vpt2 vpt Rec fill
	Bsquare} bind def
/S12 {BL [] 0 setdash 2 copy exch vpt sub exch vpt sub vpt2 vpt Rec fill Bsquare} bind def
/S13 {BL [] 0 setdash 2 copy exch vpt sub exch vpt sub vpt2 vpt Rec fill
	2 copy vpt Square fill Bsquare} bind def
/S14 {BL [] 0 setdash 2 copy exch vpt sub exch vpt sub vpt2 vpt Rec fill
	2 copy exch vpt sub exch vpt Square fill Bsquare} bind def
/S15 {BL [] 0 setdash 2 copy Bsquare fill Bsquare} bind def
/D0 {gsave translate 45 rotate 0 0 S0 stroke grestore} bind def
/D1 {gsave translate 45 rotate 0 0 S1 stroke grestore} bind def
/D2 {gsave translate 45 rotate 0 0 S2 stroke grestore} bind def
/D3 {gsave translate 45 rotate 0 0 S3 stroke grestore} bind def
/D4 {gsave translate 45 rotate 0 0 S4 stroke grestore} bind def
/D5 {gsave translate 45 rotate 0 0 S5 stroke grestore} bind def
/D6 {gsave translate 45 rotate 0 0 S6 stroke grestore} bind def
/D7 {gsave translate 45 rotate 0 0 S7 stroke grestore} bind def
/D8 {gsave translate 45 rotate 0 0 S8 stroke grestore} bind def
/D9 {gsave translate 45 rotate 0 0 S9 stroke grestore} bind def
/D10 {gsave translate 45 rotate 0 0 S10 stroke grestore} bind def
/D11 {gsave translate 45 rotate 0 0 S11 stroke grestore} bind def
/D12 {gsave translate 45 rotate 0 0 S12 stroke grestore} bind def
/D13 {gsave translate 45 rotate 0 0 S13 stroke grestore} bind def
/D14 {gsave translate 45 rotate 0 0 S14 stroke grestore} bind def
/D15 {gsave translate 45 rotate 0 0 S15 stroke grestore} bind def
/DiaE {stroke [] 0 setdash vpt add M
  hpt neg vpt neg V hpt vpt neg V
  hpt vpt V hpt neg vpt V closepath stroke} def
/BoxE {stroke [] 0 setdash exch hpt sub exch vpt add M
  0 vpt2 neg V hpt2 0 V 0 vpt2 V
  hpt2 neg 0 V closepath stroke} def
/TriUE {stroke [] 0 setdash vpt 1.12 mul add M
  hpt neg vpt -1.62 mul V
  hpt 2 mul 0 V
  hpt neg vpt 1.62 mul V closepath stroke} def
/TriDE {stroke [] 0 setdash vpt 1.12 mul sub M
  hpt neg vpt 1.62 mul V
  hpt 2 mul 0 V
  hpt neg vpt -1.62 mul V closepath stroke} def
/PentE {stroke [] 0 setdash gsave
  translate 0 hpt M 4 {72 rotate 0 hpt L} repeat
  closepath stroke grestore} def
/CircE {stroke [] 0 setdash 
  hpt 0 360 arc stroke} def
/Opaque {gsave closepath 1 setgray fill grestore 0 setgray closepath} def
/DiaW {stroke [] 0 setdash vpt add M
  hpt neg vpt neg V hpt vpt neg V
  hpt vpt V hpt neg vpt V Opaque stroke} def
/BoxW {stroke [] 0 setdash exch hpt sub exch vpt add M
  0 vpt2 neg V hpt2 0 V 0 vpt2 V
  hpt2 neg 0 V Opaque stroke} def
/TriUW {stroke [] 0 setdash vpt 1.12 mul add M
  hpt neg vpt -1.62 mul V
  hpt 2 mul 0 V
  hpt neg vpt 1.62 mul V Opaque stroke} def
/TriDW {stroke [] 0 setdash vpt 1.12 mul sub M
  hpt neg vpt 1.62 mul V
  hpt 2 mul 0 V
  hpt neg vpt -1.62 mul V Opaque stroke} def
/PentW {stroke [] 0 setdash gsave
  translate 0 hpt M 4 {72 rotate 0 hpt L} repeat
  Opaque stroke grestore} def
/CircW {stroke [] 0 setdash 
  hpt 0 360 arc Opaque stroke} def
/BoxFill {gsave Rec 1 setgray fill grestore} def
/Density {
  /Fillden exch def
  currentrgbcolor
  /ColB exch def /ColG exch def /ColR exch def
  /ColR ColR Fillden mul Fillden sub 1 add def
  /ColG ColG Fillden mul Fillden sub 1 add def
  /ColB ColB Fillden mul Fillden sub 1 add def
  ColR ColG ColB setrgbcolor} def
/BoxColFill {gsave Rec PolyFill} def
/PolyFill {gsave Density fill grestore grestore} def
/h {rlineto rlineto rlineto gsave closepath fill grestore} bind def
%
% PostScript Level 1 Pattern Fill routine for rectangles
% Usage: x y w h s a XX PatternFill
%	x,y = lower left corner of box to be filled
%	w,h = width and height of box
%	  a = angle in degrees between lines and x-axis
%	 XX = 0/1 for no/yes cross-hatch
%
/PatternFill {gsave /PFa [ 9 2 roll ] def
  PFa 0 get PFa 2 get 2 div add PFa 1 get PFa 3 get 2 div add translate
  PFa 2 get -2 div PFa 3 get -2 div PFa 2 get PFa 3 get Rec
  TransparentPatterns {} {gsave 1 setgray fill grestore} ifelse
  clip
  currentlinewidth 0.5 mul setlinewidth
  /PFs PFa 2 get dup mul PFa 3 get dup mul add sqrt def
  0 0 M PFa 5 get rotate PFs -2 div dup translate
  0 1 PFs PFa 4 get div 1 add floor cvi
	{PFa 4 get mul 0 M 0 PFs V} for
  0 PFa 6 get ne {
	0 1 PFs PFa 4 get div 1 add floor cvi
	{PFa 4 get mul 0 2 1 roll M PFs 0 V} for
 } if
  stroke grestore} def
%
/languagelevel where
 {pop languagelevel} {1} ifelse
 2 lt
	{/InterpretLevel1 true def}
	{/InterpretLevel1 Level1 def}
 ifelse
%
% PostScript level 2 pattern fill definitions
%
/Level2PatternFill {
/Tile8x8 {/PaintType 2 /PatternType 1 /TilingType 1 /BBox [0 0 8 8] /XStep 8 /YStep 8}
	bind def
/KeepColor {currentrgbcolor [/Pattern /DeviceRGB] setcolorspace} bind def
<< Tile8x8
 /PaintProc {0.5 setlinewidth pop 0 0 M 8 8 L 0 8 M 8 0 L stroke} 
>> matrix makepattern
/Pat1 exch def
<< Tile8x8
 /PaintProc {0.5 setlinewidth pop 0 0 M 8 8 L 0 8 M 8 0 L stroke
	0 4 M 4 8 L 8 4 L 4 0 L 0 4 L stroke}
>> matrix makepattern
/Pat2 exch def
<< Tile8x8
 /PaintProc {0.5 setlinewidth pop 0 0 M 0 8 L
	8 8 L 8 0 L 0 0 L fill}
>> matrix makepattern
/Pat3 exch def
<< Tile8x8
 /PaintProc {0.5 setlinewidth pop -4 8 M 8 -4 L
	0 12 M 12 0 L stroke}
>> matrix makepattern
/Pat4 exch def
<< Tile8x8
 /PaintProc {0.5 setlinewidth pop -4 0 M 8 12 L
	0 -4 M 12 8 L stroke}
>> matrix makepattern
/Pat5 exch def
<< Tile8x8
 /PaintProc {0.5 setlinewidth pop -2 8 M 4 -4 L
	0 12 M 8 -4 L 4 12 M 10 0 L stroke}
>> matrix makepattern
/Pat6 exch def
<< Tile8x8
 /PaintProc {0.5 setlinewidth pop -2 0 M 4 12 L
	0 -4 M 8 12 L 4 -4 M 10 8 L stroke}
>> matrix makepattern
/Pat7 exch def
<< Tile8x8
 /PaintProc {0.5 setlinewidth pop 8 -2 M -4 4 L
	12 0 M -4 8 L 12 4 M 0 10 L stroke}
>> matrix makepattern
/Pat8 exch def
<< Tile8x8
 /PaintProc {0.5 setlinewidth pop 0 -2 M 12 4 L
	-4 0 M 12 8 L -4 4 M 8 10 L stroke}
>> matrix makepattern
/Pat9 exch def
/Pattern1 {PatternBgnd KeepColor Pat1 setpattern} bind def
/Pattern2 {PatternBgnd KeepColor Pat2 setpattern} bind def
/Pattern3 {PatternBgnd KeepColor Pat3 setpattern} bind def
/Pattern4 {PatternBgnd KeepColor Landscape {Pat5} {Pat4} ifelse setpattern} bind def
/Pattern5 {PatternBgnd KeepColor Landscape {Pat4} {Pat5} ifelse setpattern} bind def
/Pattern6 {PatternBgnd KeepColor Landscape {Pat9} {Pat6} ifelse setpattern} bind def
/Pattern7 {PatternBgnd KeepColor Landscape {Pat8} {Pat7} ifelse setpattern} bind def
} def
%
%
%End of PostScript Level 2 code
%
/PatternBgnd {
  TransparentPatterns {} {gsave 1 setgray fill grestore} ifelse
} def
%
% Substitute for Level 2 pattern fill codes with
% grayscale if Level 2 support is not selected.
%
/Level1PatternFill {
/Pattern1 {0.250 Density} bind def
/Pattern2 {0.500 Density} bind def
/Pattern3 {0.750 Density} bind def
/Pattern4 {0.125 Density} bind def
/Pattern5 {0.375 Density} bind def
/Pattern6 {0.625 Density} bind def
/Pattern7 {0.875 Density} bind def
} def
%
% Now test for support of Level 2 code
%
Level1 {Level1PatternFill} {Level2PatternFill} ifelse
%
/Symbol-Oblique /Symbol findfont [1 0 .167 1 0 0] makefont
dup length dict begin {1 index /FID eq {pop pop} {def} ifelse} forall
currentdict end definefont pop
Level1 SuppressPDFMark or 
{} {
/SDict 10 dict def
systemdict /pdfmark known not {
  userdict /pdfmark systemdict /cleartomark get put
} if
SDict begin [
  /Title (d8_f0.tex)
  /Subject (gnuplot plot)
  /Creator (gnuplot 4.6 patchlevel 1)
  /Author (kevin.luedemann)
%  /Producer (gnuplot)
%  /Keywords ()
  /CreationDate (Wed May 28 11:52:33 2014)
  /DOCINFO pdfmark
end
} ifelse
end
%%EndProlog
%%Page: 1 1
gnudict begin
gsave
doclip
50 50 translate
0.050 0.050 scale
0 setgray
newpath
1.000 UL
LTb
LCb setrgbcolor
946 704 M
63 0 V
5794 0 R
-63 0 V
stroke
LTb
946 1156 M
63 0 V
5794 0 R
-63 0 V
946 1609 M
63 0 V
5794 0 R
-63 0 V
946 2061 M
63 0 V
5794 0 R
-63 0 V
946 2513 M
63 0 V
5794 0 R
-63 0 V
946 2966 M
63 0 V
5794 0 R
-63 0 V
946 3418 M
63 0 V
5794 0 R
-63 0 V
946 3870 M
63 0 V
5794 0 R
-63 0 V
946 4323 M
63 0 V
5794 0 R
-63 0 V
946 4775 M
63 0 V
5794 0 R
-63 0 V
946 704 M
0 63 V
0 4008 R
0 -63 V
1532 704 M
0 63 V
0 4008 R
0 -63 V
2117 704 M
0 63 V
0 4008 R
0 -63 V
2703 704 M
0 63 V
0 4008 R
0 -63 V
3289 704 M
0 63 V
0 4008 R
0 -63 V
3875 704 M
0 63 V
0 4008 R
0 -63 V
4460 704 M
0 63 V
0 4008 R
0 -63 V
5046 704 M
0 63 V
0 4008 R
0 -63 V
5632 704 M
0 63 V
0 4008 R
0 -63 V
6217 704 M
0 63 V
0 4008 R
0 -63 V
6803 704 M
0 63 V
0 4008 R
0 -63 V
stroke
946 4775 N
946 704 L
5857 0 V
0 4071 V
-5857 0 V
Z stroke
1.000 UP
1.000 UL
LTb
1.000 UP
1.000 UL
LT0
LC0 setrgbcolor
LCb setrgbcolor
LT0
LC0 setrgbcolor
946 3712 Pls
955 3576 Pls
964 3508 Pls
973 3373 Pls
983 3305 Pls
992 3169 Pls
1001 3101 Pls
1010 2966 Pls
1019 2898 Pls
1028 2830 Pls
1037 2694 Pls
1047 2626 Pls
1056 2559 Pls
1065 2491 Pls
1074 2355 Pls
1083 2287 Pls
1092 2219 Pls
1102 2151 Pls
1111 2084 Pls
1120 2016 Pls
1129 1948 Pls
1138 1880 Pls
1147 1812 Pls
1157 1744 Pls
1166 1677 Pls
1175 1677 Pls
1184 1609 Pls
1193 1541 Pls
1202 1473 Pls
1211 1473 Pls
1221 1405 Pls
1230 1405 Pls
1239 1337 Pls
1248 1337 Pls
1257 1269 Pls
1266 1269 Pls
1275 1202 Pls
1285 1202 Pls
1294 1202 Pls
1303 1202 Pls
1312 1134 Pls
1321 1134 Pls
1330 1134 Pls
1339 1134 Pls
1349 1134 Pls
1358 1134 Pls
1367 1134 Pls
1376 1134 Pls
1385 1134 Pls
1394 1202 Pls
1404 1202 Pls
1413 1202 Pls
1422 1202 Pls
1431 1202 Pls
1440 1269 Pls
1449 1269 Pls
1458 1269 Pls
1468 1337 Pls
1477 1337 Pls
1486 1337 Pls
1495 1405 Pls
1504 1405 Pls
1513 1473 Pls
1523 1473 Pls
1532 1541 Pls
1541 1541 Pls
1550 1609 Pls
1559 1677 Pls
1568 1677 Pls
1577 1744 Pls
1587 1744 Pls
1596 1812 Pls
1605 1880 Pls
1614 1880 Pls
1623 1948 Pls
1632 2016 Pls
1642 2084 Pls
1651 2084 Pls
1660 2151 Pls
1669 2219 Pls
1678 2287 Pls
1687 2287 Pls
1696 2355 Pls
1706 2423 Pls
1715 2491 Pls
1724 2491 Pls
1733 2559 Pls
1742 2626 Pls
1751 2694 Pls
1760 2762 Pls
1770 2762 Pls
1779 2830 Pls
1788 2898 Pls
1797 2966 Pls
1806 3034 Pls
1815 3034 Pls
1825 3101 Pls
1834 3169 Pls
1843 3237 Pls
1852 3237 Pls
1861 3305 Pls
1870 3373 Pls
1879 3441 Pls
1889 3441 Pls
1898 3508 Pls
1907 3576 Pls
1916 3644 Pls
1925 3644 Pls
1934 3712 Pls
1944 3780 Pls
1953 3780 Pls
1962 3848 Pls
1971 3848 Pls
1980 3848 Pls
1989 3916 Pls
1998 3916 Pls
2008 3983 Pls
2017 3983 Pls
2026 4051 Pls
2035 4051 Pls
2044 4119 Pls
2053 4119 Pls
2062 4187 Pls
2072 4187 Pls
2081 4187 Pls
2090 4255 Pls
2099 4255 Pls
2108 4323 Pls
2117 4323 Pls
2127 4323 Pls
2136 4391 Pls
2145 4391 Pls
2154 4391 Pls
2163 4391 Pls
2172 4458 Pls
2181 4458 Pls
2191 4458 Pls
2200 4458 Pls
2209 4458 Pls
2218 4458 Pls
2227 4458 Pls
2236 4526 Pls
2245 4526 Pls
2255 4526 Pls
2264 4526 Pls
2273 4526 Pls
2282 4526 Pls
2291 4526 Pls
2300 4526 Pls
2310 4526 Pls
2319 4526 Pls
2328 4526 Pls
2337 4526 Pls
2346 4526 Pls
2355 4526 Pls
2364 4526 Pls
2374 4526 Pls
2383 4458 Pls
2392 4458 Pls
2401 4458 Pls
2410 4458 Pls
2419 4458 Pls
2429 4391 Pls
2438 4391 Pls
2447 4391 Pls
2456 4391 Pls
2465 4323 Pls
2474 4323 Pls
2483 4323 Pls
2493 4323 Pls
2502 4255 Pls
2511 4255 Pls
2520 4255 Pls
2529 4187 Pls
2538 4187 Pls
2548 4187 Pls
2557 4119 Pls
2566 4119 Pls
2575 4119 Pls
2584 4051 Pls
2593 4051 Pls
2602 3983 Pls
2612 3983 Pls
2621 3983 Pls
2630 3916 Pls
2639 3916 Pls
2648 3916 Pls
2657 3848 Pls
2666 3780 Pls
2676 3780 Pls
2685 3712 Pls
2694 3712 Pls
2703 3644 Pls
2712 3644 Pls
2721 3644 Pls
2731 3576 Pls
2740 3576 Pls
2749 3576 Pls
2758 3508 Pls
2767 3508 Pls
2776 3441 Pls
2785 3441 Pls
2795 3441 Pls
2804 3373 Pls
2813 3373 Pls
2822 3373 Pls
2831 3305 Pls
2840 3305 Pls
2850 3305 Pls
2859 3305 Pls
2868 3237 Pls
2877 3237 Pls
2886 3237 Pls
2895 3169 Pls
2904 3169 Pls
2914 3169 Pls
2923 3169 Pls
2932 3101 Pls
2941 3101 Pls
2950 3101 Pls
2959 3101 Pls
2968 3034 Pls
2978 3034 Pls
2987 3034 Pls
2996 3034 Pls
3005 3034 Pls
3014 2966 Pls
3023 2966 Pls
3033 2966 Pls
3042 2966 Pls
3051 2966 Pls
3060 2966 Pls
3069 2966 Pls
3078 2898 Pls
3087 2898 Pls
3097 2898 Pls
3106 2898 Pls
3115 2898 Pls
3124 2898 Pls
3133 2898 Pls
3142 2898 Pls
3152 2898 Pls
3161 2898 Pls
3170 2898 Pls
3179 2898 Pls
3188 2898 Pls
3197 2898 Pls
3206 2898 Pls
3216 2898 Pls
3225 2898 Pls
3234 2898 Pls
3243 2898 Pls
3252 2898 Pls
3261 2898 Pls
3270 2898 Pls
3280 2966 Pls
3289 2966 Pls
3298 2966 Pls
3307 2966 Pls
3316 2966 Pls
3325 2966 Pls
3335 2966 Pls
3344 2966 Pls
3353 2966 Pls
3362 2966 Pls
3371 2966 Pls
3380 3034 Pls
3389 3034 Pls
3399 3034 Pls
3408 3034 Pls
3417 3034 Pls
3426 3034 Pls
3435 3034 Pls
3444 3101 Pls
3453 3101 Pls
3463 3101 Pls
3472 3101 Pls
3481 3101 Pls
3490 3101 Pls
3499 3169 Pls
3508 3169 Pls
3518 3169 Pls
3527 3169 Pls
3536 3169 Pls
3545 3169 Pls
3554 3237 Pls
3563 3237 Pls
3573 3237 Pls
3582 3237 Pls
3591 3237 Pls
3600 3237 Pls
3609 3305 Pls
3618 3305 Pls
3627 3305 Pls
3637 3305 Pls
3646 3305 Pls
3655 3305 Pls
3664 3373 Pls
3673 3373 Pls
3682 3373 Pls
3691 3373 Pls
3701 3373 Pls
3710 3373 Pls
3719 3441 Pls
3728 3441 Pls
3737 3441 Pls
3746 3441 Pls
3755 3441 Pls
3765 3441 Pls
3774 3508 Pls
3783 3508 Pls
3792 3508 Pls
3801 3508 Pls
3810 3508 Pls
3820 3508 Pls
3829 3508 Pls
3838 3508 Pls
3847 3576 Pls
3856 3576 Pls
3865 3576 Pls
3875 3576 Pls
3884 3576 Pls
3893 3576 Pls
3902 3576 Pls
3911 3576 Pls
3920 3576 Pls
3929 3576 Pls
3939 3644 Pls
3948 3644 Pls
3957 3644 Pls
3966 3644 Pls
3975 3644 Pls
3984 3644 Pls
3993 3644 Pls
4003 3644 Pls
4012 3644 Pls
4021 3644 Pls
4030 3644 Pls
4039 3644 Pls
4048 3644 Pls
4058 3644 Pls
4067 3644 Pls
4076 3644 Pls
4085 3644 Pls
4094 3644 Pls
4103 3644 Pls
4112 3644 Pls
4122 3644 Pls
4131 3644 Pls
4140 3644 Pls
4149 3644 Pls
4158 3644 Pls
4167 3644 Pls
4176 3644 Pls
4186 3644 Pls
4195 3644 Pls
4204 3644 Pls
4213 3644 Pls
4222 3644 Pls
4231 3644 Pls
4241 3644 Pls
4250 3644 Pls
4259 3644 Pls
4268 3644 Pls
4277 3644 Pls
4286 3644 Pls
4295 3644 Pls
4305 3644 Pls
4314 3644 Pls
4323 3644 Pls
4332 3644 Pls
4341 3644 Pls
4350 3644 Pls
4360 3644 Pls
4369 3644 Pls
4378 3644 Pls
4387 3644 Pls
4396 3576 Pls
4405 3576 Pls
4414 3576 Pls
4424 3576 Pls
4433 3576 Pls
4442 3576 Pls
4451 3576 Pls
4460 3576 Pls
4469 3576 Pls
4478 3576 Pls
4488 3576 Pls
4497 3576 Pls
4506 3508 Pls
4515 3508 Pls
4524 3508 Pls
4533 3508 Pls
4543 3508 Pls
4552 3508 Pls
4561 3508 Pls
4570 3508 Pls
4579 3508 Pls
4588 3508 Pls
4597 3508 Pls
4607 3508 Pls
4616 3508 Pls
4625 3441 Pls
4634 3441 Pls
4643 3441 Pls
4652 3441 Pls
4662 3441 Pls
4671 3441 Pls
4680 3441 Pls
4689 3441 Pls
4698 3441 Pls
4707 3441 Pls
4716 3441 Pls
4726 3441 Pls
4735 3441 Pls
4744 3441 Pls
4753 3441 Pls
4762 3373 Pls
4771 3373 Pls
4780 3373 Pls
4790 3373 Pls
4799 3373 Pls
4808 3373 Pls
4817 3373 Pls
4826 3373 Pls
4835 3373 Pls
4845 3373 Pls
4854 3373 Pls
4863 3373 Pls
4872 3373 Pls
4881 3373 Pls
4890 3373 Pls
4899 3373 Pls
4909 3373 Pls
4918 3373 Pls
4927 3373 Pls
4936 3373 Pls
4945 3373 Pls
4954 3373 Pls
4964 3373 Pls
4973 3373 Pls
4982 3373 Pls
4991 3373 Pls
5000 3373 Pls
5009 3373 Pls
5018 3373 Pls
5028 3373 Pls
5037 3373 Pls
5046 3373 Pls
5055 3373 Pls
5064 3373 Pls
5073 3373 Pls
5083 3373 Pls
5092 3373 Pls
5101 3373 Pls
5110 3373 Pls
5119 3373 Pls
5128 3373 Pls
5137 3373 Pls
5147 3373 Pls
5156 3373 Pls
5165 3373 Pls
5174 3373 Pls
5183 3373 Pls
5192 3373 Pls
5201 3373 Pls
5211 3373 Pls
5220 3373 Pls
5229 3373 Pls
5238 3373 Pls
5247 3373 Pls
5256 3373 Pls
5266 3373 Pls
5275 3373 Pls
5284 3373 Pls
5293 3373 Pls
5302 3373 Pls
5311 3373 Pls
5320 3373 Pls
5330 3373 Pls
5339 3373 Pls
5348 3373 Pls
5357 3373 Pls
5366 3373 Pls
5375 3373 Pls
5384 3373 Pls
5394 3373 Pls
5403 3373 Pls
5412 3373 Pls
5421 3373 Pls
5430 3373 Pls
5439 3373 Pls
5449 3373 Pls
5458 3373 Pls
5467 3373 Pls
5476 3373 Pls
5485 3373 Pls
5494 3441 Pls
5503 3441 Pls
5513 3441 Pls
5522 3441 Pls
5531 3441 Pls
5540 3441 Pls
5549 3441 Pls
5558 3441 Pls
5568 3441 Pls
5577 3441 Pls
5586 3441 Pls
5595 3441 Pls
5604 3441 Pls
5613 3441 Pls
5622 3441 Pls
5632 3441 Pls
5641 3441 Pls
5650 3441 Pls
5659 3441 Pls
5668 3441 Pls
5677 3441 Pls
5686 3441 Pls
5696 3441 Pls
5705 3441 Pls
5714 3441 Pls
5723 3441 Pls
5732 3441 Pls
5741 3441 Pls
5751 3441 Pls
5760 3441 Pls
5769 3441 Pls
5778 3441 Pls
5787 3441 Pls
5796 3441 Pls
5805 3441 Pls
5815 3441 Pls
5824 3441 Pls
5833 3441 Pls
5842 3441 Pls
5851 3441 Pls
5860 3441 Pls
5870 3441 Pls
5879 3441 Pls
5888 3441 Pls
5897 3441 Pls
5906 3441 Pls
5915 3441 Pls
5924 3441 Pls
5934 3441 Pls
5943 3441 Pls
5952 3441 Pls
5961 3441 Pls
5970 3441 Pls
5979 3441 Pls
5989 3441 Pls
5998 3441 Pls
6007 3441 Pls
6016 3441 Pls
6025 3441 Pls
6034 3441 Pls
6043 3441 Pls
6053 3441 Pls
6062 3441 Pls
6071 3441 Pls
6080 3441 Pls
6089 3441 Pls
6098 3441 Pls
6107 3441 Pls
6117 3441 Pls
6126 3441 Pls
6135 3441 Pls
6144 3441 Pls
6153 3441 Pls
6162 3441 Pls
6171 3441 Pls
6181 3441 Pls
6190 3441 Pls
6199 3441 Pls
6208 3441 Pls
6217 3441 Pls
6226 3441 Pls
6236 3441 Pls
6245 3441 Pls
6254 3441 Pls
6263 3441 Pls
6272 3441 Pls
6281 3441 Pls
6291 3441 Pls
6300 3441 Pls
6309 3441 Pls
6318 3441 Pls
6327 3441 Pls
6336 3441 Pls
6345 3441 Pls
6355 3441 Pls
6364 3441 Pls
6373 3441 Pls
6382 3441 Pls
6391 3441 Pls
6400 3373 Pls
6409 3373 Pls
6419 3373 Pls
6428 3373 Pls
6437 3373 Pls
6446 3373 Pls
6455 3373 Pls
6464 3373 Pls
6474 3373 Pls
6483 3373 Pls
6492 3373 Pls
6501 3373 Pls
6510 3373 Pls
6519 3373 Pls
6528 3373 Pls
6538 3373 Pls
6547 3373 Pls
6556 3373 Pls
6565 3373 Pls
6574 3373 Pls
6583 3373 Pls
6592 3373 Pls
6602 3373 Pls
6611 3373 Pls
6620 3373 Pls
6629 3373 Pls
6638 3373 Pls
6647 3373 Pls
6657 3373 Pls
6666 3373 Pls
6675 3373 Pls
6684 3373 Pls
6693 3373 Pls
6702 3373 Pls
6711 3373 Pls
6721 3373 Pls
6730 3373 Pls
6739 3373 Pls
6748 3373 Pls
6757 3373 Pls
6766 3373 Pls
6776 3373 Pls
6776 3373 Pls
6776 3373 Pls
2825 877 Pls
1.000 UL
LTb
LCb setrgbcolor
946 4775 N
946 704 L
5857 0 V
0 4071 V
-5857 0 V
Z stroke
1.000 UP
1.000 UL
LTb
stroke
grestore
end
showpage
%%Trailer
