%!PS-Adobe-2.0
%%Title: pd4_f0.eps
%%Creator: gnuplot 4.6 patchlevel 1
%%CreationDate: Sun Nov 30 18:08:05 2014
%%DocumentFonts: (atend)
%%BoundingBox: 50 50 554 770
%%Orientation: Landscape
%%Pages: (atend)
%%EndComments
%%BeginProlog
/gnudict 256 dict def
gnudict begin
%
% The following true/false flags may be edited by hand if desired.
% The unit line width and grayscale image gamma correction may also be changed.
%
/Color true def
/Blacktext false def
/Solid false def
/Dashlength 1 def
/Landscape true def
/Level1 false def
/Rounded false def
/ClipToBoundingBox false def
/SuppressPDFMark false def
/TransparentPatterns false def
/gnulinewidth 5.000 def
/userlinewidth gnulinewidth def
/Gamma 1.0 def
/BackgroundColor {-1.000 -1.000 -1.000} def
%
/vshift -70 def
/dl1 {
  10.0 Dashlength mul mul
  Rounded { currentlinewidth 0.75 mul sub dup 0 le { pop 0.01 } if } if
} def
/dl2 {
  10.0 Dashlength mul mul
  Rounded { currentlinewidth 0.75 mul add } if
} def
/hpt_ 31.5 def
/vpt_ 31.5 def
/hpt hpt_ def
/vpt vpt_ def
/doclip {
  ClipToBoundingBox {
    newpath 50 50 moveto 554 50 lineto 554 770 lineto 50 770 lineto closepath
    clip
  } if
} def
%
% Gnuplot Prolog Version 4.6 (September 2012)
%
%/SuppressPDFMark true def
%
/M {moveto} bind def
/L {lineto} bind def
/R {rmoveto} bind def
/V {rlineto} bind def
/N {newpath moveto} bind def
/Z {closepath} bind def
/C {setrgbcolor} bind def
/f {rlineto fill} bind def
/g {setgray} bind def
/Gshow {show} def   % May be redefined later in the file to support UTF-8
/vpt2 vpt 2 mul def
/hpt2 hpt 2 mul def
/Lshow {currentpoint stroke M 0 vshift R 
	Blacktext {gsave 0 setgray show grestore} {show} ifelse} def
/Rshow {currentpoint stroke M dup stringwidth pop neg vshift R
	Blacktext {gsave 0 setgray show grestore} {show} ifelse} def
/Cshow {currentpoint stroke M dup stringwidth pop -2 div vshift R 
	Blacktext {gsave 0 setgray show grestore} {show} ifelse} def
/UP {dup vpt_ mul /vpt exch def hpt_ mul /hpt exch def
  /hpt2 hpt 2 mul def /vpt2 vpt 2 mul def} def
/DL {Color {setrgbcolor Solid {pop []} if 0 setdash}
 {pop pop pop 0 setgray Solid {pop []} if 0 setdash} ifelse} def
/BL {stroke userlinewidth 2 mul setlinewidth
	Rounded {1 setlinejoin 1 setlinecap} if} def
/AL {stroke userlinewidth 2 div setlinewidth
	Rounded {1 setlinejoin 1 setlinecap} if} def
/UL {dup gnulinewidth mul /userlinewidth exch def
	dup 1 lt {pop 1} if 10 mul /udl exch def} def
/PL {stroke userlinewidth setlinewidth
	Rounded {1 setlinejoin 1 setlinecap} if} def
3.8 setmiterlimit
% Default Line colors
/LCw {1 1 1} def
/LCb {0 0 0} def
/LCa {0 0 0} def
/LC0 {1 0 0} def
/LC1 {0 1 0} def
/LC2 {0 0 1} def
/LC3 {1 0 1} def
/LC4 {0 1 1} def
/LC5 {1 1 0} def
/LC6 {0 0 0} def
/LC7 {1 0.3 0} def
/LC8 {0.5 0.5 0.5} def
% Default Line Types
/LTw {PL [] 1 setgray} def
/LTb {BL [] LCb DL} def
/LTa {AL [1 udl mul 2 udl mul] 0 setdash LCa setrgbcolor} def
/LT0 {PL [] LC0 DL} def
/LT1 {PL [4 dl1 2 dl2] LC1 DL} def
/LT2 {PL [2 dl1 3 dl2] LC2 DL} def
/LT3 {PL [1 dl1 1.5 dl2] LC3 DL} def
/LT4 {PL [6 dl1 2 dl2 1 dl1 2 dl2] LC4 DL} def
/LT5 {PL [3 dl1 3 dl2 1 dl1 3 dl2] LC5 DL} def
/LT6 {PL [2 dl1 2 dl2 2 dl1 6 dl2] LC6 DL} def
/LT7 {PL [1 dl1 2 dl2 6 dl1 2 dl2 1 dl1 2 dl2] LC7 DL} def
/LT8 {PL [2 dl1 2 dl2 2 dl1 2 dl2 2 dl1 2 dl2 2 dl1 4 dl2] LC8 DL} def
/Pnt {stroke [] 0 setdash gsave 1 setlinecap M 0 0 V stroke grestore} def
/Dia {stroke [] 0 setdash 2 copy vpt add M
  hpt neg vpt neg V hpt vpt neg V
  hpt vpt V hpt neg vpt V closepath stroke
  Pnt} def
/Pls {stroke [] 0 setdash vpt sub M 0 vpt2 V
  currentpoint stroke M
  hpt neg vpt neg R hpt2 0 V stroke
 } def
/Box {stroke [] 0 setdash 2 copy exch hpt sub exch vpt add M
  0 vpt2 neg V hpt2 0 V 0 vpt2 V
  hpt2 neg 0 V closepath stroke
  Pnt} def
/Crs {stroke [] 0 setdash exch hpt sub exch vpt add M
  hpt2 vpt2 neg V currentpoint stroke M
  hpt2 neg 0 R hpt2 vpt2 V stroke} def
/TriU {stroke [] 0 setdash 2 copy vpt 1.12 mul add M
  hpt neg vpt -1.62 mul V
  hpt 2 mul 0 V
  hpt neg vpt 1.62 mul V closepath stroke
  Pnt} def
/Star {2 copy Pls Crs} def
/BoxF {stroke [] 0 setdash exch hpt sub exch vpt add M
  0 vpt2 neg V hpt2 0 V 0 vpt2 V
  hpt2 neg 0 V closepath fill} def
/TriUF {stroke [] 0 setdash vpt 1.12 mul add M
  hpt neg vpt -1.62 mul V
  hpt 2 mul 0 V
  hpt neg vpt 1.62 mul V closepath fill} def
/TriD {stroke [] 0 setdash 2 copy vpt 1.12 mul sub M
  hpt neg vpt 1.62 mul V
  hpt 2 mul 0 V
  hpt neg vpt -1.62 mul V closepath stroke
  Pnt} def
/TriDF {stroke [] 0 setdash vpt 1.12 mul sub M
  hpt neg vpt 1.62 mul V
  hpt 2 mul 0 V
  hpt neg vpt -1.62 mul V closepath fill} def
/DiaF {stroke [] 0 setdash vpt add M
  hpt neg vpt neg V hpt vpt neg V
  hpt vpt V hpt neg vpt V closepath fill} def
/Pent {stroke [] 0 setdash 2 copy gsave
  translate 0 hpt M 4 {72 rotate 0 hpt L} repeat
  closepath stroke grestore Pnt} def
/PentF {stroke [] 0 setdash gsave
  translate 0 hpt M 4 {72 rotate 0 hpt L} repeat
  closepath fill grestore} def
/Circle {stroke [] 0 setdash 2 copy
  hpt 0 360 arc stroke Pnt} def
/CircleF {stroke [] 0 setdash hpt 0 360 arc fill} def
/C0 {BL [] 0 setdash 2 copy moveto vpt 90 450 arc} bind def
/C1 {BL [] 0 setdash 2 copy moveto
	2 copy vpt 0 90 arc closepath fill
	vpt 0 360 arc closepath} bind def
/C2 {BL [] 0 setdash 2 copy moveto
	2 copy vpt 90 180 arc closepath fill
	vpt 0 360 arc closepath} bind def
/C3 {BL [] 0 setdash 2 copy moveto
	2 copy vpt 0 180 arc closepath fill
	vpt 0 360 arc closepath} bind def
/C4 {BL [] 0 setdash 2 copy moveto
	2 copy vpt 180 270 arc closepath fill
	vpt 0 360 arc closepath} bind def
/C5 {BL [] 0 setdash 2 copy moveto
	2 copy vpt 0 90 arc
	2 copy moveto
	2 copy vpt 180 270 arc closepath fill
	vpt 0 360 arc} bind def
/C6 {BL [] 0 setdash 2 copy moveto
	2 copy vpt 90 270 arc closepath fill
	vpt 0 360 arc closepath} bind def
/C7 {BL [] 0 setdash 2 copy moveto
	2 copy vpt 0 270 arc closepath fill
	vpt 0 360 arc closepath} bind def
/C8 {BL [] 0 setdash 2 copy moveto
	2 copy vpt 270 360 arc closepath fill
	vpt 0 360 arc closepath} bind def
/C9 {BL [] 0 setdash 2 copy moveto
	2 copy vpt 270 450 arc closepath fill
	vpt 0 360 arc closepath} bind def
/C10 {BL [] 0 setdash 2 copy 2 copy moveto vpt 270 360 arc closepath fill
	2 copy moveto
	2 copy vpt 90 180 arc closepath fill
	vpt 0 360 arc closepath} bind def
/C11 {BL [] 0 setdash 2 copy moveto
	2 copy vpt 0 180 arc closepath fill
	2 copy moveto
	2 copy vpt 270 360 arc closepath fill
	vpt 0 360 arc closepath} bind def
/C12 {BL [] 0 setdash 2 copy moveto
	2 copy vpt 180 360 arc closepath fill
	vpt 0 360 arc closepath} bind def
/C13 {BL [] 0 setdash 2 copy moveto
	2 copy vpt 0 90 arc closepath fill
	2 copy moveto
	2 copy vpt 180 360 arc closepath fill
	vpt 0 360 arc closepath} bind def
/C14 {BL [] 0 setdash 2 copy moveto
	2 copy vpt 90 360 arc closepath fill
	vpt 0 360 arc} bind def
/C15 {BL [] 0 setdash 2 copy vpt 0 360 arc closepath fill
	vpt 0 360 arc closepath} bind def
/Rec {newpath 4 2 roll moveto 1 index 0 rlineto 0 exch rlineto
	neg 0 rlineto closepath} bind def
/Square {dup Rec} bind def
/Bsquare {vpt sub exch vpt sub exch vpt2 Square} bind def
/S0 {BL [] 0 setdash 2 copy moveto 0 vpt rlineto BL Bsquare} bind def
/S1 {BL [] 0 setdash 2 copy vpt Square fill Bsquare} bind def
/S2 {BL [] 0 setdash 2 copy exch vpt sub exch vpt Square fill Bsquare} bind def
/S3 {BL [] 0 setdash 2 copy exch vpt sub exch vpt2 vpt Rec fill Bsquare} bind def
/S4 {BL [] 0 setdash 2 copy exch vpt sub exch vpt sub vpt Square fill Bsquare} bind def
/S5 {BL [] 0 setdash 2 copy 2 copy vpt Square fill
	exch vpt sub exch vpt sub vpt Square fill Bsquare} bind def
/S6 {BL [] 0 setdash 2 copy exch vpt sub exch vpt sub vpt vpt2 Rec fill Bsquare} bind def
/S7 {BL [] 0 setdash 2 copy exch vpt sub exch vpt sub vpt vpt2 Rec fill
	2 copy vpt Square fill Bsquare} bind def
/S8 {BL [] 0 setdash 2 copy vpt sub vpt Square fill Bsquare} bind def
/S9 {BL [] 0 setdash 2 copy vpt sub vpt vpt2 Rec fill Bsquare} bind def
/S10 {BL [] 0 setdash 2 copy vpt sub vpt Square fill 2 copy exch vpt sub exch vpt Square fill
	Bsquare} bind def
/S11 {BL [] 0 setdash 2 copy vpt sub vpt Square fill 2 copy exch vpt sub exch vpt2 vpt Rec fill
	Bsquare} bind def
/S12 {BL [] 0 setdash 2 copy exch vpt sub exch vpt sub vpt2 vpt Rec fill Bsquare} bind def
/S13 {BL [] 0 setdash 2 copy exch vpt sub exch vpt sub vpt2 vpt Rec fill
	2 copy vpt Square fill Bsquare} bind def
/S14 {BL [] 0 setdash 2 copy exch vpt sub exch vpt sub vpt2 vpt Rec fill
	2 copy exch vpt sub exch vpt Square fill Bsquare} bind def
/S15 {BL [] 0 setdash 2 copy Bsquare fill Bsquare} bind def
/D0 {gsave translate 45 rotate 0 0 S0 stroke grestore} bind def
/D1 {gsave translate 45 rotate 0 0 S1 stroke grestore} bind def
/D2 {gsave translate 45 rotate 0 0 S2 stroke grestore} bind def
/D3 {gsave translate 45 rotate 0 0 S3 stroke grestore} bind def
/D4 {gsave translate 45 rotate 0 0 S4 stroke grestore} bind def
/D5 {gsave translate 45 rotate 0 0 S5 stroke grestore} bind def
/D6 {gsave translate 45 rotate 0 0 S6 stroke grestore} bind def
/D7 {gsave translate 45 rotate 0 0 S7 stroke grestore} bind def
/D8 {gsave translate 45 rotate 0 0 S8 stroke grestore} bind def
/D9 {gsave translate 45 rotate 0 0 S9 stroke grestore} bind def
/D10 {gsave translate 45 rotate 0 0 S10 stroke grestore} bind def
/D11 {gsave translate 45 rotate 0 0 S11 stroke grestore} bind def
/D12 {gsave translate 45 rotate 0 0 S12 stroke grestore} bind def
/D13 {gsave translate 45 rotate 0 0 S13 stroke grestore} bind def
/D14 {gsave translate 45 rotate 0 0 S14 stroke grestore} bind def
/D15 {gsave translate 45 rotate 0 0 S15 stroke grestore} bind def
/DiaE {stroke [] 0 setdash vpt add M
  hpt neg vpt neg V hpt vpt neg V
  hpt vpt V hpt neg vpt V closepath stroke} def
/BoxE {stroke [] 0 setdash exch hpt sub exch vpt add M
  0 vpt2 neg V hpt2 0 V 0 vpt2 V
  hpt2 neg 0 V closepath stroke} def
/TriUE {stroke [] 0 setdash vpt 1.12 mul add M
  hpt neg vpt -1.62 mul V
  hpt 2 mul 0 V
  hpt neg vpt 1.62 mul V closepath stroke} def
/TriDE {stroke [] 0 setdash vpt 1.12 mul sub M
  hpt neg vpt 1.62 mul V
  hpt 2 mul 0 V
  hpt neg vpt -1.62 mul V closepath stroke} def
/PentE {stroke [] 0 setdash gsave
  translate 0 hpt M 4 {72 rotate 0 hpt L} repeat
  closepath stroke grestore} def
/CircE {stroke [] 0 setdash 
  hpt 0 360 arc stroke} def
/Opaque {gsave closepath 1 setgray fill grestore 0 setgray closepath} def
/DiaW {stroke [] 0 setdash vpt add M
  hpt neg vpt neg V hpt vpt neg V
  hpt vpt V hpt neg vpt V Opaque stroke} def
/BoxW {stroke [] 0 setdash exch hpt sub exch vpt add M
  0 vpt2 neg V hpt2 0 V 0 vpt2 V
  hpt2 neg 0 V Opaque stroke} def
/TriUW {stroke [] 0 setdash vpt 1.12 mul add M
  hpt neg vpt -1.62 mul V
  hpt 2 mul 0 V
  hpt neg vpt 1.62 mul V Opaque stroke} def
/TriDW {stroke [] 0 setdash vpt 1.12 mul sub M
  hpt neg vpt 1.62 mul V
  hpt 2 mul 0 V
  hpt neg vpt -1.62 mul V Opaque stroke} def
/PentW {stroke [] 0 setdash gsave
  translate 0 hpt M 4 {72 rotate 0 hpt L} repeat
  Opaque stroke grestore} def
/CircW {stroke [] 0 setdash 
  hpt 0 360 arc Opaque stroke} def
/BoxFill {gsave Rec 1 setgray fill grestore} def
/Density {
  /Fillden exch def
  currentrgbcolor
  /ColB exch def /ColG exch def /ColR exch def
  /ColR ColR Fillden mul Fillden sub 1 add def
  /ColG ColG Fillden mul Fillden sub 1 add def
  /ColB ColB Fillden mul Fillden sub 1 add def
  ColR ColG ColB setrgbcolor} def
/BoxColFill {gsave Rec PolyFill} def
/PolyFill {gsave Density fill grestore grestore} def
/h {rlineto rlineto rlineto gsave closepath fill grestore} bind def
%
% PostScript Level 1 Pattern Fill routine for rectangles
% Usage: x y w h s a XX PatternFill
%	x,y = lower left corner of box to be filled
%	w,h = width and height of box
%	  a = angle in degrees between lines and x-axis
%	 XX = 0/1 for no/yes cross-hatch
%
/PatternFill {gsave /PFa [ 9 2 roll ] def
  PFa 0 get PFa 2 get 2 div add PFa 1 get PFa 3 get 2 div add translate
  PFa 2 get -2 div PFa 3 get -2 div PFa 2 get PFa 3 get Rec
  TransparentPatterns {} {gsave 1 setgray fill grestore} ifelse
  clip
  currentlinewidth 0.5 mul setlinewidth
  /PFs PFa 2 get dup mul PFa 3 get dup mul add sqrt def
  0 0 M PFa 5 get rotate PFs -2 div dup translate
  0 1 PFs PFa 4 get div 1 add floor cvi
	{PFa 4 get mul 0 M 0 PFs V} for
  0 PFa 6 get ne {
	0 1 PFs PFa 4 get div 1 add floor cvi
	{PFa 4 get mul 0 2 1 roll M PFs 0 V} for
 } if
  stroke grestore} def
%
/languagelevel where
 {pop languagelevel} {1} ifelse
 2 lt
	{/InterpretLevel1 true def}
	{/InterpretLevel1 Level1 def}
 ifelse
%
% PostScript level 2 pattern fill definitions
%
/Level2PatternFill {
/Tile8x8 {/PaintType 2 /PatternType 1 /TilingType 1 /BBox [0 0 8 8] /XStep 8 /YStep 8}
	bind def
/KeepColor {currentrgbcolor [/Pattern /DeviceRGB] setcolorspace} bind def
<< Tile8x8
 /PaintProc {0.5 setlinewidth pop 0 0 M 8 8 L 0 8 M 8 0 L stroke} 
>> matrix makepattern
/Pat1 exch def
<< Tile8x8
 /PaintProc {0.5 setlinewidth pop 0 0 M 8 8 L 0 8 M 8 0 L stroke
	0 4 M 4 8 L 8 4 L 4 0 L 0 4 L stroke}
>> matrix makepattern
/Pat2 exch def
<< Tile8x8
 /PaintProc {0.5 setlinewidth pop 0 0 M 0 8 L
	8 8 L 8 0 L 0 0 L fill}
>> matrix makepattern
/Pat3 exch def
<< Tile8x8
 /PaintProc {0.5 setlinewidth pop -4 8 M 8 -4 L
	0 12 M 12 0 L stroke}
>> matrix makepattern
/Pat4 exch def
<< Tile8x8
 /PaintProc {0.5 setlinewidth pop -4 0 M 8 12 L
	0 -4 M 12 8 L stroke}
>> matrix makepattern
/Pat5 exch def
<< Tile8x8
 /PaintProc {0.5 setlinewidth pop -2 8 M 4 -4 L
	0 12 M 8 -4 L 4 12 M 10 0 L stroke}
>> matrix makepattern
/Pat6 exch def
<< Tile8x8
 /PaintProc {0.5 setlinewidth pop -2 0 M 4 12 L
	0 -4 M 8 12 L 4 -4 M 10 8 L stroke}
>> matrix makepattern
/Pat7 exch def
<< Tile8x8
 /PaintProc {0.5 setlinewidth pop 8 -2 M -4 4 L
	12 0 M -4 8 L 12 4 M 0 10 L stroke}
>> matrix makepattern
/Pat8 exch def
<< Tile8x8
 /PaintProc {0.5 setlinewidth pop 0 -2 M 12 4 L
	-4 0 M 12 8 L -4 4 M 8 10 L stroke}
>> matrix makepattern
/Pat9 exch def
/Pattern1 {PatternBgnd KeepColor Pat1 setpattern} bind def
/Pattern2 {PatternBgnd KeepColor Pat2 setpattern} bind def
/Pattern3 {PatternBgnd KeepColor Pat3 setpattern} bind def
/Pattern4 {PatternBgnd KeepColor Landscape {Pat5} {Pat4} ifelse setpattern} bind def
/Pattern5 {PatternBgnd KeepColor Landscape {Pat4} {Pat5} ifelse setpattern} bind def
/Pattern6 {PatternBgnd KeepColor Landscape {Pat9} {Pat6} ifelse setpattern} bind def
/Pattern7 {PatternBgnd KeepColor Landscape {Pat8} {Pat7} ifelse setpattern} bind def
} def
%
%
%End of PostScript Level 2 code
%
/PatternBgnd {
  TransparentPatterns {} {gsave 1 setgray fill grestore} ifelse
} def
%
% Substitute for Level 2 pattern fill codes with
% grayscale if Level 2 support is not selected.
%
/Level1PatternFill {
/Pattern1 {0.250 Density} bind def
/Pattern2 {0.500 Density} bind def
/Pattern3 {0.750 Density} bind def
/Pattern4 {0.125 Density} bind def
/Pattern5 {0.375 Density} bind def
/Pattern6 {0.625 Density} bind def
/Pattern7 {0.875 Density} bind def
} def
%
% Now test for support of Level 2 code
%
Level1 {Level1PatternFill} {Level2PatternFill} ifelse
%
/Symbol-Oblique /Symbol findfont [1 0 .167 1 0 0] makefont
dup length dict begin {1 index /FID eq {pop pop} {def} ifelse} forall
currentdict end definefont pop
/MFshow {
   { dup 5 get 3 ge
     { 5 get 3 eq {gsave} {grestore} ifelse }
     {dup dup 0 get findfont exch 1 get scalefont setfont
     [ currentpoint ] exch dup 2 get 0 exch R dup 5 get 2 ne {dup dup 6
     get exch 4 get {Gshow} {stringwidth pop 0 R} ifelse }if dup 5 get 0 eq
     {dup 3 get {2 get neg 0 exch R pop} {pop aload pop M} ifelse} {dup 5
     get 1 eq {dup 2 get exch dup 3 get exch 6 get stringwidth pop -2 div
     dup 0 R} {dup 6 get stringwidth pop -2 div 0 R 6 get
     show 2 index {aload pop M neg 3 -1 roll neg R pop pop} {pop pop pop
     pop aload pop M} ifelse }ifelse }ifelse }
     ifelse }
   forall} def
/Gswidth {dup type /stringtype eq {stringwidth} {pop (n) stringwidth} ifelse} def
/MFwidth {0 exch { dup 5 get 3 ge { 5 get 3 eq { 0 } { pop } ifelse }
 {dup 3 get{dup dup 0 get findfont exch 1 get scalefont setfont
     6 get Gswidth pop add} {pop} ifelse} ifelse} forall} def
/MLshow { currentpoint stroke M
  0 exch R
  Blacktext {gsave 0 setgray MFshow grestore} {MFshow} ifelse } bind def
/MRshow { currentpoint stroke M
  exch dup MFwidth neg 3 -1 roll R
  Blacktext {gsave 0 setgray MFshow grestore} {MFshow} ifelse } bind def
/MCshow { currentpoint stroke M
  exch dup MFwidth -2 div 3 -1 roll R
  Blacktext {gsave 0 setgray MFshow grestore} {MFshow} ifelse } bind def
/XYsave    { [( ) 1 2 true false 3 ()] } bind def
/XYrestore { [( ) 1 2 true false 4 ()] } bind def
Level1 SuppressPDFMark or 
{} {
/SDict 10 dict def
systemdict /pdfmark known not {
  userdict /pdfmark systemdict /cleartomark get put
} if
SDict begin [
  /Title (pd4_f0.eps)
  /Subject (gnuplot plot)
  /Creator (gnuplot 4.6 patchlevel 1)
  /Author (kevin.luedemann)
%  /Producer (gnuplot)
%  /Keywords ()
  /CreationDate (Sun Nov 30 18:08:05 2014)
  /DOCINFO pdfmark
end
} ifelse
end
%%EndProlog
%%Page: 1 1
gnudict begin
gsave
doclip
50 50 translate
0.100 0.100 scale
90 rotate
0 -5040 translate
0 setgray
newpath
(Roman) findfont 210 scalefont setfont
BackgroundColor 0 lt 3 1 roll 0 lt exch 0 lt or or not {gsave BackgroundColor C clippath fill grestore} if
1.000 UL
LTb
1.000 UL
LTa
903 672 M
5918 0 V
stroke
LTb
903 672 M
63 0 V
5855 0 R
-63 0 V
stroke
777 672 M
[ [(Roman) 210.0 0.0 true true 0 (-60)]
] -70.0 MRshow
1.000 UL
LTb
1.000 UL
LTa
903 1358 M
5918 0 V
stroke
LTb
903 1358 M
63 0 V
5855 0 R
-63 0 V
stroke
777 1358 M
[ [(Roman) 210.0 0.0 true true 0 (-40)]
] -70.0 MRshow
1.000 UL
LTb
1.000 UL
LTa
903 2044 M
5918 0 V
stroke
LTb
903 2044 M
63 0 V
5855 0 R
-63 0 V
stroke
777 2044 M
[ [(Roman) 210.0 0.0 true true 0 (-20)]
] -70.0 MRshow
1.000 UL
LTb
1.000 UL
LTa
903 2730 M
5918 0 V
stroke
LTb
903 2730 M
63 0 V
5855 0 R
-63 0 V
stroke
777 2730 M
[ [(Roman) 210.0 0.0 true true 0 ( 0)]
] -70.0 MRshow
1.000 UL
LTb
1.000 UL
LTa
903 3415 M
5918 0 V
stroke
LTb
903 3415 M
63 0 V
5855 0 R
-63 0 V
stroke
777 3415 M
[ [(Roman) 210.0 0.0 true true 0 ( 20)]
] -70.0 MRshow
1.000 UL
LTb
1.000 UL
LTa
903 4101 M
5918 0 V
stroke
LTb
903 4101 M
63 0 V
5855 0 R
-63 0 V
stroke
777 4101 M
[ [(Roman) 210.0 0.0 true true 0 ( 40)]
] -70.0 MRshow
1.000 UL
LTb
1.000 UL
LTa
903 4787 M
5918 0 V
stroke
LTb
903 4787 M
63 0 V
5855 0 R
-63 0 V
stroke
777 4787 M
[ [(Roman) 210.0 0.0 true true 0 ( 60)]
] -70.0 MRshow
1.000 UL
LTb
1.000 UL
LTa
903 672 M
0 4115 V
stroke
LTb
903 672 M
0 63 V
0 4052 R
0 -63 V
stroke
903 462 M
[ [(Roman) 210.0 0.0 true true 0 ( 0)]
] -70.0 MCshow
1.000 UL
LTb
1.000 UL
LTa
1889 672 M
0 4115 V
stroke
LTb
1889 672 M
0 63 V
0 4052 R
0 -63 V
stroke
1889 462 M
[ [(Roman) 210.0 0.0 true true 0 ( 5)]
] -70.0 MCshow
1.000 UL
LTb
1.000 UL
LTa
2876 672 M
0 4115 V
stroke
LTb
2876 672 M
0 63 V
0 4052 R
0 -63 V
stroke
2876 462 M
[ [(Roman) 210.0 0.0 true true 0 ( 10)]
] -70.0 MCshow
1.000 UL
LTb
1.000 UL
LTa
3862 672 M
0 4115 V
stroke
LTb
3862 672 M
0 63 V
0 4052 R
0 -63 V
stroke
3862 462 M
[ [(Roman) 210.0 0.0 true true 0 ( 15)]
] -70.0 MCshow
1.000 UL
LTb
1.000 UL
LTa
4848 672 M
0 3842 V
0 210 R
0 63 V
stroke
LTb
4848 672 M
0 63 V
0 4052 R
0 -63 V
stroke
4848 462 M
[ [(Roman) 210.0 0.0 true true 0 ( 20)]
] -70.0 MCshow
1.000 UL
LTb
1.000 UL
LTa
5835 672 M
0 3842 V
0 210 R
0 63 V
stroke
LTb
5835 672 M
0 63 V
0 4052 R
0 -63 V
stroke
5835 462 M
[ [(Roman) 210.0 0.0 true true 0 ( 25)]
] -70.0 MCshow
1.000 UL
LTb
1.000 UL
LTa
6821 672 M
0 4115 V
stroke
LTb
6821 672 M
0 63 V
0 4052 R
0 -63 V
stroke
6821 462 M
[ [(Roman) 210.0 0.0 true true 0 ( 30)]
] -70.0 MCshow
1.000 UL
LTb
1.000 UL
LTb
903 4787 N
903 672 L
5918 0 V
0 4115 V
-5918 0 V
Z stroke
LCb setrgbcolor
168 2729 M
currentpoint gsave translate -270 rotate 0 0 moveto
[ [(Roman) 210.0 0.0 true true 0 (Winkel [rad])]
] -70.0 MCshow
grestore
LTb
LCb setrgbcolor
3862 147 M
[ [(Roman) 210.0 0.0 true true 0 (Zeit [s])]
] -70.0 MCshow
LTb
1.000 UP
1.000 UL
LTb
% Begin plot #1
1.000 UP
1.000 UL
LT0
LCb setrgbcolor
5876 4619 M
[ [(Roman) 210.0 0.0 true true 0 (Daempfung 4mm)]
] -70.0 MRshow
LT0
903 2922 Pls
906 3000 Pls
909 3051 Pls
912 3128 Pls
915 3180 Pls
918 3257 Pls
921 3334 Pls
925 3385 Pls
928 3437 Pls
931 3514 Pls
934 3565 Pls
937 3617 Pls
940 3694 Pls
943 3745 Pls
946 3797 Pls
949 3848 Pls
952 3900 Pls
955 3951 Pls
958 4003 Pls
962 4054 Pls
965 4105 Pls
968 4131 Pls
971 4183 Pls
974 4208 Pls
977 4260 Pls
980 4285 Pls
983 4337 Pls
986 4363 Pls
989 4388 Pls
992 4414 Pls
995 4466 Pls
999 4466 Pls
1002 4491 Pls
1005 4517 Pls
1008 4543 Pls
1011 4568 Pls
1014 4568 Pls
1017 4594 Pls
1020 4594 Pls
1023 4620 Pls
1026 4620 Pls
1029 4620 Pls
1032 4620 Pls
1036 4620 Pls
1039 4620 Pls
1042 4620 Pls
1045 4620 Pls
1048 4594 Pls
1051 4594 Pls
1054 4594 Pls
1057 4568 Pls
1060 4568 Pls
1063 4543 Pls
1066 4517 Pls
1069 4517 Pls
1073 4491 Pls
1076 4466 Pls
1079 4440 Pls
1082 4414 Pls
1085 4388 Pls
1088 4363 Pls
1091 4311 Pls
1094 4285 Pls
1097 4260 Pls
1100 4234 Pls
1103 4183 Pls
1106 4157 Pls
1109 4105 Pls
1113 4054 Pls
1116 4028 Pls
1119 3977 Pls
1122 3925 Pls
1125 3874 Pls
1128 3848 Pls
1131 3797 Pls
1134 3745 Pls
1137 3694 Pls
1140 3643 Pls
1143 3591 Pls
1147 3540 Pls
1150 3488 Pls
1153 3437 Pls
1156 3385 Pls
1159 3334 Pls
1162 3257 Pls
1165 3231 Pls
1168 3154 Pls
1171 3102 Pls
1174 3051 Pls
1177 3000 Pls
1180 2948 Pls
1183 2871 Pls
1190 2794 Pls
1193 2742 Pls
1196 2691 Pls
1199 2639 Pls
1202 2588 Pls
1205 2511 Pls
1208 2459 Pls
1211 2408 Pls
1214 2357 Pls
1217 2305 Pls
1220 2254 Pls
1224 2202 Pls
1227 2151 Pls
1230 2099 Pls
1233 2074 Pls
1236 2022 Pls
1239 1971 Pls
1242 1919 Pls
1245 1868 Pls
1248 1842 Pls
1251 1791 Pls
1254 1739 Pls
1257 1714 Pls
1261 1662 Pls
1264 1636 Pls
1267 1585 Pls
1270 1559 Pls
1273 1534 Pls
1276 1482 Pls
1279 1456 Pls
1282 1431 Pls
1285 1405 Pls
1288 1379 Pls
1291 1354 Pls
1294 1328 Pls
1298 1302 Pls
1301 1276 Pls
1304 1276 Pls
1307 1251 Pls
1310 1225 Pls
1313 1225 Pls
1316 1199 Pls
1319 1199 Pls
1322 1174 Pls
1325 1174 Pls
1328 1174 Pls
1331 1174 Pls
1335 1148 Pls
1338 1148 Pls
1341 1148 Pls
1344 1148 Pls
1347 1148 Pls
1350 1148 Pls
1353 1148 Pls
1356 1148 Pls
1359 1174 Pls
1362 1174 Pls
1365 1199 Pls
1368 1199 Pls
1372 1225 Pls
1375 1225 Pls
1378 1251 Pls
1381 1251 Pls
1384 1276 Pls
1387 1302 Pls
1390 1328 Pls
1393 1354 Pls
1396 1379 Pls
1399 1405 Pls
1402 1431 Pls
1405 1456 Pls
1408 1482 Pls
1412 1508 Pls
1415 1534 Pls
1418 1585 Pls
1421 1611 Pls
1424 1636 Pls
1427 1662 Pls
1430 1714 Pls
1433 1739 Pls
1436 1791 Pls
1439 1816 Pls
1442 1868 Pls
1445 1894 Pls
1449 1945 Pls
1452 1971 Pls
1455 2022 Pls
1458 2074 Pls
1461 2099 Pls
1464 2151 Pls
1467 2202 Pls
1470 2228 Pls
1473 2279 Pls
1476 2331 Pls
1479 2357 Pls
1482 2408 Pls
1486 2459 Pls
1489 2485 Pls
1492 2537 Pls
1495 2588 Pls
1498 2614 Pls
1501 2665 Pls
1504 2717 Pls
1507 2768 Pls
1510 2794 Pls
1513 2871 Pls
1516 2897 Pls
1519 2948 Pls
1523 3000 Pls
1526 3025 Pls
1529 3077 Pls
1532 3102 Pls
1535 3154 Pls
1538 3180 Pls
1541 3231 Pls
1544 3257 Pls
1547 3308 Pls
1550 3334 Pls
1553 3360 Pls
1556 3411 Pls
1560 3437 Pls
1563 3462 Pls
1566 3488 Pls
1569 3540 Pls
1572 3565 Pls
1575 3591 Pls
1578 3617 Pls
1581 3643 Pls
1584 3668 Pls
1587 3694 Pls
1590 3720 Pls
1593 3720 Pls
1597 3745 Pls
1600 3771 Pls
1603 3797 Pls
1606 3797 Pls
1609 3823 Pls
1612 3823 Pls
1615 3848 Pls
1618 3848 Pls
1621 3874 Pls
1624 3874 Pls
1627 3874 Pls
1630 3900 Pls
1633 3900 Pls
1637 3900 Pls
1640 3900 Pls
1643 3900 Pls
1646 3900 Pls
1649 3900 Pls
1652 3900 Pls
1655 3874 Pls
1658 3874 Pls
1661 3874 Pls
1664 3874 Pls
1667 3848 Pls
1670 3848 Pls
1674 3848 Pls
1677 3823 Pls
1680 3823 Pls
1683 3797 Pls
1686 3797 Pls
1689 3771 Pls
1692 3745 Pls
1695 3745 Pls
1698 3720 Pls
1701 3694 Pls
1704 3668 Pls
1707 3668 Pls
1711 3643 Pls
1714 3617 Pls
1717 3591 Pls
1720 3565 Pls
1723 3540 Pls
1726 3514 Pls
1729 3488 Pls
1732 3462 Pls
1735 3411 Pls
1738 3385 Pls
1741 3360 Pls
1744 3334 Pls
1748 3308 Pls
1751 3257 Pls
1754 3231 Pls
1757 3205 Pls
1760 3180 Pls
1763 3128 Pls
1766 3102 Pls
1769 3077 Pls
1772 3051 Pls
1775 3000 Pls
1778 2974 Pls
1781 2948 Pls
1785 2897 Pls
1788 2871 Pls
1791 2845 Pls
1794 2794 Pls
1797 2768 Pls
1800 2717 Pls
1803 2691 Pls
1806 2665 Pls
1809 2639 Pls
1812 2588 Pls
1815 2562 Pls
1818 2537 Pls
1822 2511 Pls
1825 2459 Pls
1828 2434 Pls
1831 2408 Pls
1834 2382 Pls
1837 2331 Pls
1840 2305 Pls
1843 2279 Pls
1846 2254 Pls
1849 2228 Pls
1852 2202 Pls
1855 2177 Pls
1859 2151 Pls
1862 2125 Pls
1865 2099 Pls
1868 2074 Pls
1871 2048 Pls
1874 2022 Pls
1877 1997 Pls
1880 1971 Pls
1883 1971 Pls
1886 1945 Pls
1889 1919 Pls
1892 1894 Pls
1895 1894 Pls
1899 1868 Pls
1902 1868 Pls
1905 1842 Pls
1908 1842 Pls
1911 1816 Pls
1914 1816 Pls
1917 1791 Pls
1920 1791 Pls
1923 1791 Pls
1926 1765 Pls
1929 1765 Pls
1932 1765 Pls
1936 1765 Pls
1939 1765 Pls
1942 1765 Pls
1945 1765 Pls
1948 1765 Pls
1951 1765 Pls
1954 1765 Pls
1957 1765 Pls
1960 1765 Pls
1963 1791 Pls
1966 1791 Pls
1969 1791 Pls
1973 1791 Pls
1976 1816 Pls
1979 1816 Pls
1982 1816 Pls
1985 1842 Pls
1988 1842 Pls
1991 1868 Pls
1994 1868 Pls
1997 1894 Pls
2000 1894 Pls
2003 1919 Pls
2006 1945 Pls
2010 1945 Pls
2013 1971 Pls
2016 1997 Pls
2019 1997 Pls
2022 2022 Pls
2025 2048 Pls
2028 2074 Pls
2031 2074 Pls
2034 2099 Pls
2037 2125 Pls
2040 2151 Pls
2043 2177 Pls
2047 2202 Pls
2050 2228 Pls
2053 2254 Pls
2056 2279 Pls
2059 2305 Pls
2062 2331 Pls
2065 2357 Pls
2068 2382 Pls
2071 2408 Pls
2074 2434 Pls
2077 2459 Pls
2080 2485 Pls
2084 2511 Pls
2087 2537 Pls
2090 2562 Pls
2093 2588 Pls
2096 2614 Pls
2099 2639 Pls
2102 2665 Pls
2105 2691 Pls
2108 2717 Pls
2111 2742 Pls
2114 2768 Pls
2117 2794 Pls
2120 2820 Pls
2124 2845 Pls
2127 2871 Pls
2130 2897 Pls
2133 2922 Pls
2136 2948 Pls
2139 2974 Pls
2142 3000 Pls
2145 3025 Pls
2148 3051 Pls
2151 3077 Pls
2154 3102 Pls
2157 3102 Pls
2161 3128 Pls
2164 3154 Pls
2167 3180 Pls
2170 3180 Pls
2173 3205 Pls
2176 3231 Pls
2179 3257 Pls
2182 3257 Pls
2185 3282 Pls
2188 3282 Pls
2191 3308 Pls
2194 3334 Pls
2198 3334 Pls
2201 3360 Pls
2204 3360 Pls
2207 3360 Pls
2210 3385 Pls
2213 3385 Pls
2216 3411 Pls
2219 3411 Pls
2222 3411 Pls
2225 3411 Pls
2228 3437 Pls
2231 3437 Pls
2235 3437 Pls
2238 3437 Pls
2241 3437 Pls
2244 3437 Pls
2247 3437 Pls
2250 3437 Pls
2253 3437 Pls
2256 3437 Pls
2259 3437 Pls
2262 3437 Pls
2265 3437 Pls
2268 3411 Pls
2272 3411 Pls
2275 3411 Pls
2278 3411 Pls
2281 3385 Pls
2284 3385 Pls
2287 3385 Pls
2290 3360 Pls
2293 3360 Pls
2296 3360 Pls
2299 3334 Pls
2302 3334 Pls
2305 3308 Pls
2309 3308 Pls
2312 3282 Pls
2315 3282 Pls
2318 3257 Pls
2321 3257 Pls
2324 3231 Pls
2327 3205 Pls
2330 3205 Pls
2333 3180 Pls
2336 3154 Pls
2339 3154 Pls
2342 3128 Pls
2346 3102 Pls
2349 3102 Pls
2352 3077 Pls
2355 3051 Pls
2358 3025 Pls
2361 3025 Pls
2364 3000 Pls
2367 2974 Pls
2370 2948 Pls
2373 2922 Pls
2376 2922 Pls
2379 2897 Pls
2383 2871 Pls
2386 2845 Pls
2389 2820 Pls
2392 2820 Pls
2395 2794 Pls
2398 2768 Pls
2401 2742 Pls
2404 2717 Pls
2407 2691 Pls
2410 2691 Pls
2413 2665 Pls
2416 2639 Pls
2419 2614 Pls
2423 2588 Pls
2426 2588 Pls
2429 2562 Pls
2432 2537 Pls
2435 2511 Pls
2438 2511 Pls
2441 2485 Pls
2444 2459 Pls
2447 2459 Pls
2450 2434 Pls
2453 2408 Pls
2456 2382 Pls
2460 2382 Pls
2463 2357 Pls
2466 2357 Pls
2469 2331 Pls
2472 2305 Pls
2475 2305 Pls
2478 2279 Pls
2481 2279 Pls
2484 2254 Pls
2487 2254 Pls
2490 2228 Pls
2493 2228 Pls
2497 2202 Pls
2500 2202 Pls
2503 2202 Pls
2506 2177 Pls
2509 2177 Pls
2512 2177 Pls
2515 2151 Pls
2518 2151 Pls
2521 2151 Pls
2524 2151 Pls
2527 2125 Pls
2530 2125 Pls
2534 2125 Pls
2537 2125 Pls
2540 2125 Pls
2543 2125 Pls
2546 2125 Pls
2549 2125 Pls
2552 2125 Pls
2555 2125 Pls
2558 2125 Pls
2561 2125 Pls
2564 2125 Pls
2567 2151 Pls
2571 2151 Pls
2574 2151 Pls
2577 2151 Pls
2580 2151 Pls
2583 2151 Pls
2586 2177 Pls
2589 2177 Pls
2592 2177 Pls
2595 2177 Pls
2598 2202 Pls
2601 2202 Pls
2604 2202 Pls
2608 2228 Pls
2611 2228 Pls
2614 2254 Pls
2617 2254 Pls
2620 2279 Pls
2623 2279 Pls
2626 2279 Pls
2629 2305 Pls
2632 2305 Pls
2635 2331 Pls
2638 2331 Pls
2641 2357 Pls
2644 2382 Pls
2648 2382 Pls
2651 2408 Pls
2654 2408 Pls
2657 2434 Pls
2660 2434 Pls
2663 2459 Pls
2666 2485 Pls
2669 2485 Pls
2672 2511 Pls
2675 2511 Pls
2678 2537 Pls
2681 2562 Pls
2685 2562 Pls
2688 2588 Pls
2691 2614 Pls
2694 2614 Pls
2697 2639 Pls
2700 2665 Pls
2703 2665 Pls
2706 2691 Pls
2709 2717 Pls
2712 2717 Pls
2715 2742 Pls
2718 2742 Pls
2722 2768 Pls
2725 2794 Pls
2728 2794 Pls
2731 2820 Pls
2734 2845 Pls
2737 2845 Pls
2740 2871 Pls
2743 2871 Pls
2746 2897 Pls
2749 2897 Pls
2752 2922 Pls
2755 2922 Pls
2759 2948 Pls
2762 2974 Pls
2765 2974 Pls
2768 2974 Pls
2771 3000 Pls
2774 3000 Pls
2777 3025 Pls
2780 3025 Pls
2783 3051 Pls
2786 3051 Pls
2789 3051 Pls
2792 3077 Pls
2796 3077 Pls
2799 3077 Pls
2802 3102 Pls
2805 3102 Pls
2808 3102 Pls
2811 3128 Pls
2814 3128 Pls
2817 3128 Pls
2820 3128 Pls
2823 3154 Pls
2826 3154 Pls
2829 3154 Pls
2833 3154 Pls
2836 3154 Pls
2839 3154 Pls
2842 3154 Pls
2845 3154 Pls
2848 3154 Pls
2851 3154 Pls
2854 3154 Pls
2857 3154 Pls
2860 3154 Pls
2863 3154 Pls
2866 3154 Pls
2869 3154 Pls
2873 3154 Pls
2876 3128 Pls
2879 3128 Pls
2882 3128 Pls
2885 3128 Pls
2888 3128 Pls
2891 3128 Pls
2894 3102 Pls
2897 3102 Pls
2900 3102 Pls
2903 3102 Pls
2906 3077 Pls
2910 3077 Pls
2913 3077 Pls
2916 3051 Pls
2919 3051 Pls
2922 3051 Pls
2925 3025 Pls
2928 3025 Pls
2931 3025 Pls
2934 3000 Pls
2937 3000 Pls
2940 2974 Pls
2943 2974 Pls
2947 2948 Pls
2950 2948 Pls
2953 2948 Pls
2956 2922 Pls
2959 2922 Pls
2962 2897 Pls
2965 2897 Pls
2968 2871 Pls
2971 2871 Pls
2974 2845 Pls
2977 2845 Pls
2980 2820 Pls
2984 2820 Pls
2987 2794 Pls
2990 2794 Pls
2993 2768 Pls
2996 2768 Pls
2999 2742 Pls
3002 2742 Pls
3005 2717 Pls
3008 2717 Pls
3011 2691 Pls
3014 2691 Pls
3017 2665 Pls
3021 2665 Pls
3024 2639 Pls
3027 2639 Pls
3030 2614 Pls
3033 2614 Pls
3036 2588 Pls
3039 2588 Pls
3042 2562 Pls
3045 2562 Pls
3048 2562 Pls
3051 2537 Pls
3054 2537 Pls
3058 2511 Pls
3061 2511 Pls
3064 2485 Pls
3067 2485 Pls
3070 2485 Pls
3073 2459 Pls
3076 2459 Pls
3079 2459 Pls
3082 2434 Pls
3085 2434 Pls
3088 2434 Pls
3091 2408 Pls
3095 2408 Pls
3098 2408 Pls
3101 2408 Pls
3104 2382 Pls
3107 2382 Pls
3110 2382 Pls
3113 2382 Pls
3116 2382 Pls
3119 2357 Pls
3122 2357 Pls
3125 2357 Pls
3128 2357 Pls
3131 2357 Pls
3135 2357 Pls
3138 2357 Pls
3141 2357 Pls
3144 2357 Pls
3147 2357 Pls
3150 2357 Pls
3153 2331 Pls
3156 2331 Pls
3159 2331 Pls
3162 2331 Pls
3165 2331 Pls
3168 2331 Pls
3172 2331 Pls
3175 2331 Pls
3178 2331 Pls
3181 2331 Pls
3184 2357 Pls
3187 2357 Pls
3190 2357 Pls
3193 2357 Pls
3196 2357 Pls
3199 2357 Pls
3202 2382 Pls
3205 2382 Pls
3209 2382 Pls
3212 2382 Pls
3215 2408 Pls
3218 2408 Pls
3221 2408 Pls
3224 2408 Pls
3227 2434 Pls
3230 2434 Pls
3233 2434 Pls
3236 2459 Pls
3239 2459 Pls
3242 2459 Pls
3246 2485 Pls
3249 2485 Pls
3252 2485 Pls
3255 2511 Pls
3258 2511 Pls
3261 2511 Pls
3264 2537 Pls
3267 2537 Pls
3270 2537 Pls
3273 2562 Pls
3276 2562 Pls
3279 2588 Pls
3283 2588 Pls
3286 2588 Pls
3289 2614 Pls
3292 2614 Pls
3295 2639 Pls
3298 2639 Pls
3301 2639 Pls
3304 2665 Pls
3307 2665 Pls
3310 2665 Pls
3313 2691 Pls
3316 2691 Pls
3320 2717 Pls
3323 2717 Pls
3326 2717 Pls
3329 2742 Pls
3332 2742 Pls
3335 2768 Pls
3338 2768 Pls
3341 2768 Pls
3344 2794 Pls
3347 2794 Pls
3350 2794 Pls
3353 2820 Pls
3357 2820 Pls
3360 2845 Pls
3363 2871 Pls
3366 2871 Pls
3369 2871 Pls
3372 2897 Pls
3375 2897 Pls
3378 2897 Pls
3381 2897 Pls
3384 2922 Pls
3387 2922 Pls
3390 2922 Pls
3393 2922 Pls
3397 2948 Pls
3400 2948 Pls
3403 2948 Pls
3406 2948 Pls
3409 2948 Pls
3412 2948 Pls
3415 2974 Pls
3418 2974 Pls
3421 2974 Pls
3424 2974 Pls
3427 2974 Pls
3430 2974 Pls
3434 2974 Pls
3437 2974 Pls
3440 2974 Pls
3443 3000 Pls
3446 3000 Pls
3449 3000 Pls
3452 3000 Pls
3455 3000 Pls
3458 3000 Pls
3461 3000 Pls
3464 3000 Pls
3467 3000 Pls
3471 3000 Pls
3474 3000 Pls
3477 3000 Pls
3480 3000 Pls
3483 3000 Pls
3486 3000 Pls
3489 3000 Pls
3492 2974 Pls
3495 2974 Pls
3498 2974 Pls
3501 2974 Pls
3504 2974 Pls
3508 2974 Pls
3511 2948 Pls
3514 2948 Pls
3517 2948 Pls
3520 2948 Pls
3523 2948 Pls
3526 2922 Pls
3529 2922 Pls
3532 2922 Pls
3535 2922 Pls
3538 2897 Pls
3541 2897 Pls
3545 2897 Pls
3548 2897 Pls
3551 2871 Pls
3554 2871 Pls
3557 2845 Pls
3560 2845 Pls
3563 2820 Pls
3566 2820 Pls
3569 2820 Pls
3572 2794 Pls
3575 2794 Pls
3578 2794 Pls
3582 2794 Pls
3585 2768 Pls
3588 2768 Pls
3591 2768 Pls
3594 2742 Pls
3597 2742 Pls
3600 2742 Pls
3603 2717 Pls
3606 2717 Pls
3609 2717 Pls
3612 2691 Pls
3615 2691 Pls
3618 2691 Pls
3622 2691 Pls
3625 2665 Pls
3628 2665 Pls
3631 2665 Pls
3634 2639 Pls
3637 2639 Pls
3640 2639 Pls
3643 2614 Pls
3646 2614 Pls
3649 2614 Pls
3652 2614 Pls
3655 2588 Pls
3659 2588 Pls
3662 2588 Pls
3665 2588 Pls
3668 2562 Pls
3671 2562 Pls
3674 2562 Pls
3677 2562 Pls
3680 2562 Pls
3683 2537 Pls
3686 2537 Pls
3689 2537 Pls
3692 2537 Pls
3696 2537 Pls
3699 2511 Pls
3702 2511 Pls
3705 2511 Pls
3708 2511 Pls
3711 2511 Pls
3714 2511 Pls
3717 2511 Pls
3720 2485 Pls
3723 2485 Pls
3726 2485 Pls
3729 2485 Pls
3733 2485 Pls
3736 2485 Pls
3739 2485 Pls
3742 2485 Pls
3745 2485 Pls
3748 2485 Pls
3751 2485 Pls
3754 2485 Pls
3757 2485 Pls
3760 2485 Pls
3763 2485 Pls
3766 2485 Pls
3770 2485 Pls
3773 2485 Pls
3776 2485 Pls
3779 2511 Pls
3782 2511 Pls
3785 2511 Pls
3788 2511 Pls
3791 2511 Pls
3794 2511 Pls
3797 2511 Pls
3800 2511 Pls
3803 2511 Pls
3807 2511 Pls
3810 2537 Pls
3813 2537 Pls
3816 2537 Pls
3819 2537 Pls
3822 2537 Pls
3825 2537 Pls
3828 2562 Pls
3831 2562 Pls
3834 2562 Pls
3837 2562 Pls
3840 2562 Pls
3843 2562 Pls
3847 2588 Pls
3850 2588 Pls
3853 2588 Pls
3856 2588 Pls
3859 2614 Pls
3862 2614 Pls
3865 2614 Pls
3868 2614 Pls
3871 2614 Pls
3874 2639 Pls
3877 2639 Pls
3880 2639 Pls
3884 2639 Pls
3887 2665 Pls
3890 2665 Pls
3893 2665 Pls
3896 2665 Pls
3899 2691 Pls
3902 2691 Pls
3905 2691 Pls
3908 2691 Pls
3911 2717 Pls
3914 2717 Pls
3917 2717 Pls
3921 2717 Pls
3924 2717 Pls
3927 2742 Pls
3930 2742 Pls
3933 2742 Pls
3936 2742 Pls
3939 2768 Pls
3942 2768 Pls
3945 2768 Pls
3948 2768 Pls
3951 2768 Pls
3954 2794 Pls
3958 2794 Pls
3961 2794 Pls
3964 2794 Pls
3967 2794 Pls
3970 2820 Pls
3973 2820 Pls
3976 2820 Pls
3979 2820 Pls
3982 2820 Pls
3985 2845 Pls
3988 2845 Pls
3991 2845 Pls
3995 2845 Pls
3998 2845 Pls
4001 2845 Pls
4004 2845 Pls
4007 2845 Pls
4010 2871 Pls
4013 2871 Pls
4016 2871 Pls
4019 2871 Pls
4022 2871 Pls
4025 2871 Pls
4028 2871 Pls
4032 2871 Pls
4035 2871 Pls
4038 2871 Pls
4041 2871 Pls
4044 2871 Pls
4047 2871 Pls
4050 2871 Pls
4053 2871 Pls
4056 2871 Pls
4059 2871 Pls
4062 2871 Pls
4065 2871 Pls
4068 2871 Pls
4072 2871 Pls
4075 2871 Pls
4078 2871 Pls
4081 2871 Pls
4084 2871 Pls
4087 2871 Pls
4090 2871 Pls
4093 2845 Pls
4096 2845 Pls
4099 2845 Pls
4102 2845 Pls
4106 2845 Pls
4109 2845 Pls
4112 2845 Pls
4115 2845 Pls
4118 2845 Pls
4121 2845 Pls
4124 2820 Pls
4127 2820 Pls
4130 2820 Pls
4133 2820 Pls
4136 2820 Pls
4139 2820 Pls
4142 2820 Pls
4146 2794 Pls
4149 2794 Pls
4152 2794 Pls
4155 2794 Pls
4158 2794 Pls
4161 2794 Pls
4164 2768 Pls
4167 2768 Pls
4170 2768 Pls
4173 2768 Pls
4176 2768 Pls
4179 2768 Pls
4183 2742 Pls
4186 2742 Pls
4189 2742 Pls
4192 2742 Pls
4195 2742 Pls
4198 2717 Pls
4201 2717 Pls
4204 2717 Pls
4207 2717 Pls
4210 2717 Pls
4213 2691 Pls
4216 2691 Pls
4220 2691 Pls
4223 2691 Pls
4226 2691 Pls
4229 2691 Pls
4232 2665 Pls
4235 2665 Pls
4238 2665 Pls
4241 2665 Pls
4244 2665 Pls
4247 2639 Pls
4250 2639 Pls
4253 2639 Pls
4257 2639 Pls
4260 2639 Pls
4263 2639 Pls
4266 2639 Pls
4269 2614 Pls
4272 2614 Pls
4275 2614 Pls
4278 2614 Pls
4281 2614 Pls
4284 2614 Pls
4287 2614 Pls
4290 2588 Pls
4294 2588 Pls
4297 2588 Pls
4300 2588 Pls
4303 2588 Pls
4306 2588 Pls
4309 2588 Pls
4312 2588 Pls
4315 2588 Pls
4318 2588 Pls
4321 2588 Pls
4324 2562 Pls
4327 2562 Pls
4331 2562 Pls
4334 2562 Pls
4337 2562 Pls
4340 2562 Pls
4343 2562 Pls
4346 2562 Pls
4349 2562 Pls
4352 2562 Pls
4355 2562 Pls
4358 2562 Pls
4361 2562 Pls
4364 2562 Pls
4367 2562 Pls
4371 2562 Pls
4374 2562 Pls
4377 2562 Pls
4380 2562 Pls
4383 2562 Pls
4386 2562 Pls
4389 2562 Pls
4392 2562 Pls
4395 2562 Pls
4398 2562 Pls
4401 2562 Pls
4404 2562 Pls
4408 2562 Pls
4411 2562 Pls
4414 2562 Pls
4417 2588 Pls
4420 2588 Pls
4423 2588 Pls
4426 2588 Pls
4429 2588 Pls
4432 2588 Pls
4435 2588 Pls
4438 2588 Pls
4441 2588 Pls
4445 2614 Pls
4448 2614 Pls
4451 2614 Pls
4454 2614 Pls
4457 2614 Pls
4460 2614 Pls
4463 2614 Pls
4466 2614 Pls
4469 2639 Pls
4472 2639 Pls
4475 2639 Pls
4478 2639 Pls
4482 2639 Pls
4485 2639 Pls
4488 2639 Pls
4491 2665 Pls
4494 2665 Pls
4497 2665 Pls
4500 2665 Pls
4503 2665 Pls
4506 2665 Pls
4509 2665 Pls
4512 2691 Pls
4515 2691 Pls
4519 2691 Pls
4522 2691 Pls
4525 2691 Pls
4528 2691 Pls
4531 2691 Pls
4534 2717 Pls
4537 2717 Pls
4540 2717 Pls
4543 2717 Pls
4546 2717 Pls
4549 2717 Pls
4552 2717 Pls
4556 2742 Pls
4559 2742 Pls
4562 2742 Pls
4565 2742 Pls
4568 2742 Pls
4571 2742 Pls
4574 2742 Pls
4577 2742 Pls
4580 2742 Pls
4583 2768 Pls
4586 2768 Pls
4589 2768 Pls
4592 2768 Pls
4596 2768 Pls
4599 2768 Pls
4602 2768 Pls
4605 2768 Pls
4608 2768 Pls
4611 2768 Pls
4614 2768 Pls
4617 2768 Pls
4620 2768 Pls
4623 2794 Pls
4626 2794 Pls
4629 2794 Pls
4633 2794 Pls
4636 2794 Pls
4639 2794 Pls
4642 2794 Pls
4645 2794 Pls
4648 2794 Pls
4651 2794 Pls
4654 2794 Pls
4657 2794 Pls
4660 2794 Pls
4663 2794 Pls
4666 2794 Pls
4670 2794 Pls
4673 2794 Pls
4676 2794 Pls
4679 2794 Pls
4682 2794 Pls
4685 2794 Pls
4688 2794 Pls
4691 2794 Pls
4694 2794 Pls
4697 2794 Pls
4700 2794 Pls
4703 2794 Pls
4707 2794 Pls
4710 2794 Pls
4713 2794 Pls
4716 2794 Pls
4719 2794 Pls
4722 2794 Pls
4725 2768 Pls
4728 2768 Pls
4731 2768 Pls
4734 2768 Pls
4737 2768 Pls
4740 2768 Pls
4744 2768 Pls
4747 2768 Pls
4750 2768 Pls
4753 2768 Pls
4756 2768 Pls
4759 2742 Pls
4762 2742 Pls
4765 2742 Pls
4768 2742 Pls
4771 2742 Pls
4774 2742 Pls
4777 2742 Pls
4781 2742 Pls
4784 2742 Pls
4787 2717 Pls
4790 2717 Pls
4793 2717 Pls
4796 2717 Pls
4799 2717 Pls
4802 2717 Pls
4805 2717 Pls
4808 2717 Pls
4811 2691 Pls
4814 2691 Pls
4818 2691 Pls
4821 2691 Pls
4824 2691 Pls
4827 2691 Pls
4830 2691 Pls
4833 2691 Pls
4836 2691 Pls
4839 2691 Pls
4842 2665 Pls
4845 2665 Pls
4848 2665 Pls
4851 2665 Pls
4854 2665 Pls
4858 2665 Pls
4861 2665 Pls
4864 2665 Pls
4867 2665 Pls
4870 2665 Pls
4873 2639 Pls
4876 2639 Pls
4879 2639 Pls
4882 2639 Pls
4885 2639 Pls
4888 2639 Pls
4891 2639 Pls
4895 2639 Pls
4898 2639 Pls
4901 2639 Pls
4904 2639 Pls
4907 2639 Pls
4910 2639 Pls
4913 2639 Pls
4916 2639 Pls
4919 2614 Pls
4922 2614 Pls
4925 2614 Pls
4928 2614 Pls
4932 2614 Pls
4935 2614 Pls
4938 2614 Pls
4941 2614 Pls
4944 2614 Pls
4947 2614 Pls
4950 2614 Pls
4953 2614 Pls
4956 2614 Pls
4959 2614 Pls
4962 2614 Pls
4965 2614 Pls
4969 2614 Pls
4972 2614 Pls
4975 2614 Pls
4978 2614 Pls
4981 2614 Pls
4984 2614 Pls
4987 2614 Pls
4990 2614 Pls
4993 2614 Pls
4996 2614 Pls
4999 2614 Pls
5002 2614 Pls
5006 2614 Pls
5009 2614 Pls
5012 2614 Pls
5015 2614 Pls
5018 2614 Pls
5021 2614 Pls
5024 2614 Pls
5027 2614 Pls
5030 2614 Pls
5033 2614 Pls
5036 2614 Pls
5039 2614 Pls
5043 2614 Pls
5046 2614 Pls
5049 2614 Pls
5052 2614 Pls
5055 2614 Pls
5058 2614 Pls
5061 2614 Pls
5064 2614 Pls
5067 2614 Pls
5070 2614 Pls
5073 2639 Pls
5076 2639 Pls
5079 2639 Pls
5083 2639 Pls
5086 2639 Pls
5089 2639 Pls
5092 2639 Pls
5095 2639 Pls
5098 2639 Pls
5101 2639 Pls
5104 2639 Pls
5107 2665 Pls
5110 2665 Pls
5113 2665 Pls
5116 2665 Pls
5120 2665 Pls
5123 2665 Pls
5126 2665 Pls
5129 2665 Pls
5132 2665 Pls
5135 2665 Pls
5138 2665 Pls
5141 2691 Pls
5144 2691 Pls
5147 2691 Pls
5150 2691 Pls
5153 2691 Pls
5157 2691 Pls
5160 2691 Pls
5163 2691 Pls
5166 2691 Pls
5169 2691 Pls
5172 2691 Pls
5175 2691 Pls
5178 2691 Pls
5181 2691 Pls
5184 2717 Pls
5187 2717 Pls
5190 2717 Pls
5194 2717 Pls
5197 2717 Pls
5200 2717 Pls
5203 2717 Pls
5206 2717 Pls
5209 2717 Pls
5212 2717 Pls
5215 2717 Pls
5218 2717 Pls
5221 2717 Pls
5224 2717 Pls
5227 2717 Pls
5231 2717 Pls
5234 2717 Pls
5237 2717 Pls
5240 2717 Pls
5243 2717 Pls
5246 2717 Pls
5249 2717 Pls
5252 2717 Pls
5255 2717 Pls
5258 2717 Pls
5261 2717 Pls
5264 2717 Pls
5268 2717 Pls
5271 2717 Pls
5274 2717 Pls
5277 2717 Pls
5280 2717 Pls
5283 2717 Pls
5286 2717 Pls
5289 2717 Pls
5292 2717 Pls
5295 2717 Pls
5298 2717 Pls
5301 2717 Pls
5305 2717 Pls
5308 2717 Pls
5311 2717 Pls
5314 2717 Pls
5317 2717 Pls
5320 2717 Pls
5323 2717 Pls
5326 2717 Pls
5329 2717 Pls
5332 2717 Pls
5335 2717 Pls
5338 2717 Pls
5342 2717 Pls
5345 2717 Pls
5348 2717 Pls
5351 2717 Pls
5354 2717 Pls
5357 2717 Pls
5360 2717 Pls
5363 2691 Pls
5366 2691 Pls
5369 2691 Pls
5372 2691 Pls
5375 2691 Pls
5378 2691 Pls
5382 2691 Pls
5385 2691 Pls
5388 2691 Pls
5391 2691 Pls
5394 2691 Pls
5397 2691 Pls
5400 2691 Pls
5403 2691 Pls
5406 2691 Pls
5409 2665 Pls
5412 2665 Pls
5415 2665 Pls
5419 2665 Pls
5422 2665 Pls
5425 2665 Pls
5428 2665 Pls
5431 2665 Pls
5434 2665 Pls
5437 2665 Pls
5440 2665 Pls
5443 2665 Pls
5446 2665 Pls
5449 2665 Pls
5452 2665 Pls
5456 2639 Pls
5459 2639 Pls
5462 2639 Pls
5465 2639 Pls
5468 2639 Pls
5471 2639 Pls
5474 2639 Pls
5477 2639 Pls
5480 2639 Pls
5483 2639 Pls
5486 2639 Pls
5489 2639 Pls
5493 2639 Pls
5496 2639 Pls
5499 2639 Pls
5502 2639 Pls
5505 2639 Pls
5508 2639 Pls
5511 2639 Pls
5514 2639 Pls
5517 2639 Pls
5520 2639 Pls
5523 2639 Pls
5526 2639 Pls
5530 2639 Pls
5533 2639 Pls
5536 2639 Pls
5539 2614 Pls
5542 2614 Pls
5545 2614 Pls
5548 2614 Pls
5551 2614 Pls
5554 2614 Pls
5557 2614 Pls
5560 2614 Pls
5563 2614 Pls
5567 2614 Pls
5570 2614 Pls
5573 2614 Pls
5576 2614 Pls
5579 2614 Pls
5582 2614 Pls
5585 2614 Pls
5588 2614 Pls
5591 2614 Pls
5594 2614 Pls
5597 2614 Pls
5600 2614 Pls
5603 2614 Pls
5607 2614 Pls
5610 2614 Pls
5613 2614 Pls
5616 2614 Pls
5619 2614 Pls
5622 2614 Pls
5625 2614 Pls
5628 2614 Pls
5631 2614 Pls
5634 2639 Pls
5637 2639 Pls
5640 2639 Pls
5644 2639 Pls
5647 2639 Pls
5650 2639 Pls
5653 2639 Pls
5656 2639 Pls
5659 2639 Pls
5662 2639 Pls
5665 2639 Pls
5668 2639 Pls
5671 2639 Pls
5674 2639 Pls
5677 2639 Pls
5681 2639 Pls
5684 2639 Pls
5687 2639 Pls
5690 2639 Pls
5693 2639 Pls
5696 2665 Pls
5699 2665 Pls
5702 2665 Pls
5705 2665 Pls
5708 2665 Pls
5711 2665 Pls
5714 2665 Pls
5718 2665 Pls
5721 2665 Pls
5724 2665 Pls
5727 2665 Pls
5730 2665 Pls
5733 2665 Pls
5736 2665 Pls
5739 2665 Pls
5742 2665 Pls
5745 2665 Pls
5748 2665 Pls
5751 2665 Pls
5755 2665 Pls
5758 2691 Pls
5761 2691 Pls
5764 2691 Pls
5767 2691 Pls
5770 2691 Pls
5773 2691 Pls
5776 2691 Pls
5779 2691 Pls
5782 2691 Pls
5785 2691 Pls
5788 2691 Pls
5792 2691 Pls
5795 2691 Pls
5798 2691 Pls
5801 2691 Pls
5804 2691 Pls
5807 2691 Pls
5810 2691 Pls
5813 2691 Pls
5816 2691 Pls
5819 2691 Pls
5822 2691 Pls
5825 2691 Pls
5828 2691 Pls
5832 2691 Pls
5835 2691 Pls
5838 2691 Pls
5841 2691 Pls
5844 2691 Pls
5847 2691 Pls
5850 2691 Pls
5853 2691 Pls
5856 2691 Pls
5859 2691 Pls
5862 2691 Pls
5865 2691 Pls
5869 2691 Pls
5872 2691 Pls
5875 2691 Pls
5878 2691 Pls
5881 2691 Pls
5884 2691 Pls
5887 2691 Pls
5890 2691 Pls
5893 2691 Pls
5896 2691 Pls
5899 2691 Pls
5902 2691 Pls
5906 2691 Pls
5909 2691 Pls
5912 2691 Pls
5915 2691 Pls
5918 2691 Pls
5921 2691 Pls
5924 2691 Pls
5927 2691 Pls
5930 2691 Pls
5933 2691 Pls
5936 2691 Pls
5939 2691 Pls
5943 2691 Pls
5946 2691 Pls
5949 2691 Pls
5952 2691 Pls
5955 2691 Pls
5958 2691 Pls
5961 2691 Pls
5964 2691 Pls
5967 2691 Pls
5970 2691 Pls
5973 2691 Pls
5976 2691 Pls
5980 2691 Pls
5983 2691 Pls
5986 2691 Pls
5989 2691 Pls
5992 2691 Pls
5995 2691 Pls
5998 2691 Pls
6001 2665 Pls
6004 2665 Pls
6007 2665 Pls
6010 2665 Pls
6013 2665 Pls
6017 2665 Pls
6020 2665 Pls
6023 2665 Pls
6026 2665 Pls
6029 2665 Pls
6032 2665 Pls
6035 2665 Pls
6038 2665 Pls
6041 2665 Pls
6044 2665 Pls
6047 2665 Pls
6050 2665 Pls
6054 2665 Pls
6057 2665 Pls
6060 2665 Pls
6063 2665 Pls
6066 2665 Pls
6069 2665 Pls
6072 2665 Pls
6075 2665 Pls
6078 2665 Pls
6081 2665 Pls
6084 2665 Pls
6087 2639 Pls
6090 2639 Pls
6094 2639 Pls
6097 2639 Pls
6100 2639 Pls
6103 2639 Pls
6106 2639 Pls
6109 2639 Pls
6112 2639 Pls
6115 2639 Pls
6118 2639 Pls
6121 2639 Pls
6124 2639 Pls
6127 2639 Pls
6131 2639 Pls
6134 2639 Pls
6137 2639 Pls
6140 2639 Pls
6143 2639 Pls
6146 2639 Pls
6149 2639 Pls
6152 2639 Pls
6155 2639 Pls
6158 2639 Pls
6161 2639 Pls
6164 2639 Pls
6168 2639 Pls
6171 2639 Pls
6174 2639 Pls
6177 2639 Pls
6180 2639 Pls
6183 2639 Pls
6186 2639 Pls
6189 2639 Pls
6192 2639 Pls
6195 2639 Pls
6198 2639 Pls
6201 2639 Pls
6205 2639 Pls
6208 2639 Pls
6211 2639 Pls
6214 2639 Pls
6217 2639 Pls
6220 2639 Pls
6223 2639 Pls
6226 2639 Pls
6229 2639 Pls
6232 2639 Pls
6235 2639 Pls
6238 2639 Pls
6242 2639 Pls
6245 2639 Pls
6248 2639 Pls
6251 2639 Pls
6254 2639 Pls
6257 2639 Pls
6260 2639 Pls
6263 2639 Pls
6266 2639 Pls
6269 2639 Pls
6272 2639 Pls
6275 2639 Pls
6279 2665 Pls
6282 2665 Pls
6285 2665 Pls
6288 2665 Pls
6291 2665 Pls
6294 2665 Pls
6297 2665 Pls
6300 2665 Pls
6303 2665 Pls
6306 2665 Pls
6309 2665 Pls
6312 2665 Pls
6316 2665 Pls
6319 2665 Pls
6322 2665 Pls
6325 2665 Pls
6328 2665 Pls
6331 2665 Pls
6334 2665 Pls
6337 2665 Pls
6340 2665 Pls
6343 2665 Pls
6346 2665 Pls
6349 2665 Pls
6352 2665 Pls
6356 2665 Pls
6359 2665 Pls
6362 2665 Pls
6365 2665 Pls
6368 2665 Pls
6371 2665 Pls
6374 2665 Pls
6377 2665 Pls
6380 2665 Pls
6383 2665 Pls
6386 2665 Pls
6389 2665 Pls
6393 2665 Pls
6396 2665 Pls
6399 2665 Pls
6402 2665 Pls
6405 2665 Pls
6408 2665 Pls
6411 2665 Pls
6414 2665 Pls
6417 2665 Pls
6420 2665 Pls
6423 2665 Pls
6426 2665 Pls
6430 2665 Pls
6433 2665 Pls
6436 2665 Pls
6439 2665 Pls
6442 2665 Pls
6445 2665 Pls
6448 2665 Pls
6451 2665 Pls
6454 2665 Pls
6457 2665 Pls
6460 2665 Pls
6463 2665 Pls
6467 2665 Pls
6470 2665 Pls
6473 2665 Pls
6476 2665 Pls
6479 2665 Pls
6482 2665 Pls
6485 2665 Pls
6488 2665 Pls
6491 2665 Pls
6494 2665 Pls
6497 2665 Pls
6500 2665 Pls
6504 2665 Pls
6507 2665 Pls
6510 2665 Pls
6513 2665 Pls
6516 2665 Pls
6519 2665 Pls
6522 2665 Pls
6525 2665 Pls
6528 2665 Pls
6531 2665 Pls
6534 2665 Pls
6537 2665 Pls
6541 2665 Pls
6544 2665 Pls
6547 2665 Pls
6550 2665 Pls
6553 2665 Pls
6556 2665 Pls
6559 2665 Pls
6562 2665 Pls
6565 2665 Pls
6568 2665 Pls
6571 2665 Pls
6574 2665 Pls
6577 2665 Pls
6581 2665 Pls
6584 2665 Pls
6587 2665 Pls
6590 2665 Pls
6593 2665 Pls
6596 2665 Pls
6599 2665 Pls
6602 2665 Pls
6605 2665 Pls
6608 2665 Pls
6611 2665 Pls
6614 2665 Pls
6618 2665 Pls
6621 2665 Pls
6624 2665 Pls
6627 2665 Pls
6630 2665 Pls
6633 2665 Pls
6636 2665 Pls
6639 2665 Pls
6642 2665 Pls
6645 2665 Pls
6648 2665 Pls
6651 2665 Pls
6655 2665 Pls
6658 2665 Pls
6661 2665 Pls
6664 2665 Pls
6667 2665 Pls
6670 2665 Pls
6673 2665 Pls
6676 2665 Pls
6679 2665 Pls
6682 2665 Pls
6685 2665 Pls
6688 2665 Pls
6692 2665 Pls
6695 2665 Pls
6698 2665 Pls
6701 2665 Pls
6704 2665 Pls
6707 2665 Pls
6710 2665 Pls
6713 2665 Pls
6716 2665 Pls
6719 2665 Pls
6722 2665 Pls
6725 2665 Pls
6729 2665 Pls
6732 2665 Pls
6735 2665 Pls
6738 2665 Pls
6741 2665 Pls
6744 2665 Pls
6747 2665 Pls
6750 2665 Pls
6753 2665 Pls
6756 2665 Pls
6759 2665 Pls
6762 2665 Pls
6766 2665 Pls
6769 2665 Pls
6772 2665 Pls
6775 2665 Pls
6778 2665 Pls
6781 2665 Pls
6784 2665 Pls
6787 2665 Pls
6787 2665 Pls
6787 2665 Pls
6285 4619 Pls
% End plot #1
1.000 UL
LTb
903 4787 N
903 672 L
5918 0 V
0 4115 V
-5918 0 V
Z stroke
1.000 UP
1.000 UL
LTb
stroke
grestore
end
showpage
%%Trailer
%%DocumentFonts: Roman
%%Pages: 1
