#635
0 -0.75 0
15.6 -2.25 0
31.2 -3 0
46.8 -4.5 0
62.5 -5.25 0
78.1 -6.75 0
93.7 -7.5 0
109.4 -9 0
125 -9.75 0
140.6 -10.5 0
156.2 -12 0
171.8 -12.75 0
187.5 -13.5 0
203.1 -14.25 0
218.7 -15.75 0
234.4 -16.5 0
250 -17.25 0
265.6 -18 0
281.2 -18.75 0
296.8 -19.5 0
312.5 -20.25 0
328.1 -21 0
343.7 -21.75 0
359.4 -22.5 0
375 -23.25 0
390.6 -23.25 0
406.2 -24 0
421.8 -24.75 0
437.5 -25.5 0
453.1 -25.5 0
468.7 -26.25 0
484.4 -26.25 0
500 -27 0
515.6 -27 0
531.2 -27.75 0
546.8 -27.75 0
562.5 -28.5 0
578.1 -28.5 0
593.7 -28.5 0
609.4 -28.5 0
625 -29.25 0
640.6 -29.25 0
656.2 -29.25 0
671.8 -29.25 0
687.5 -29.25 0
703.1 -29.25 0
718.7 -29.25 0
734.4 -29.25 0
750 -29.25 0
765.6 -28.5 0
781.2 -28.5 0
796.8 -28.5 0
812.5 -28.5 0
828.1 -28.5 0
843.7 -27.75 0
859.4 -27.75 0
875 -27.75 0
890.6 -27 0
906.2 -27 0
921.8 -27 0
937.5 -26.25 0
953.1 -26.25 0
968.7 -25.5 0
984.4 -25.5 0
1000 -24.75 0
1015.6 -24.75 0
1031.2 -24 0
1046.8 -23.25 0
1062.5 -23.25 0
1078.1 -22.5 0
1093.7 -22.5 0
1109.4 -21.75 0
1125 -21 0
1140.6 -21 0
1156.2 -20.25 0
1171.8 -19.5 0
1187.5 -18.75 0
1203.1 -18.75 0
1218.7 -18 0
1234.4 -17.25 0
1250 -16.5 0
1265.6 -16.5 0
1281.2 -15.75 0
1296.8 -15 0
1312.5 -14.25 0
1328.1 -14.25 0
1343.7 -13.5 0
1359.4 -12.75 0
1375 -12 0
1390.6 -11.25 0
1406.2 -11.25 0
1421.8 -10.5 0
1437.5 -9.75 0
1453.1 -9 0
1468.7 -8.25 0
1484.4 -8.25 0
1500 -7.5 0
1515.6 -6.75 0
1531.2 -6 0
1546.8 -6 0
1562.5 -5.25 0
1578.1 -4.5 0
1593.7 -3.75 0
1609.4 -3.75 0
1625 -3 0
1640.6 -2.25 0
1656.2 -1.5 0
1671.8 -1.5 0
1687.5 -0.75 0
1703.1 0 0
1718.7 0 0
1734.4 0.75 0
1750 0.75 0
1765.6 0.75 0
1781.2 1.5 0
1796.8 1.5 0
1812.5 2.25 0
1828.1 2.25 0
1843.7 3 0
1859.4 3 0
1875 3.75 0
1890.6 3.75 0
1906.2 4.5 0
1921.8 4.5 0
1937.5 4.5 0
1953.1 5.25 0
1968.7 5.25 0
1984.4 6 0
2000 6 0
2015.6 6 0
2031.2 6.75 0
2046.8 6.75 0
2062.5 6.75 0
2078.1 6.75 0
2093.7 7.5 0
2109.4 7.5 0
2125 7.5 0
2140.6 7.5 0
2156.2 7.5 0
2171.8 7.5 0
2187.5 7.5 0
2203.1 8.25 0
2218.7 8.25 0
2234.4 8.25 0
2250 8.25 0
2265.6 8.25 0
2281.2 8.25 0
2296.8 8.25 0
2312.5 8.25 0
2328.1 8.25 0
2343.7 8.25 0
2359.4 8.25 0
2375 8.25 0
2390.6 8.25 0
2406.2 8.25 0
2421.8 8.25 0
2437.5 8.25 0
2453.1 7.5 0
2468.7 7.5 0
2484.4 7.5 0
2500 7.5 0
2515.6 7.5 0
2531.2 6.75 0
2546.8 6.75 0
2562.5 6.75 0
2578.1 6.75 0
2593.7 6 0
2609.4 6 0
2625 6 0
2640.6 6 0
2656.2 5.25 0
2671.8 5.25 0
2687.5 5.25 0
2703.1 4.5 0
2718.7 4.5 0
2734.4 4.5 0
2750 3.75 0
2765.6 3.75 0
2781.2 3.75 0
2796.8 3 0
2812.5 3 0
2828.1 2.25 0
2843.7 2.25 0
2859.4 2.25 0
2875 1.5 0
2890.6 1.5 0
2906.2 1.5 0
2921.8 0.75 0
2937.5 0 0
2953.1 0 0
2968.7 -0.75 0
2984.4 -0.75 0
3000 -1.5 0
3015.6 -1.5 0
3031.2 -1.5 0
3046.8 -2.25 0
3062.5 -2.25 0
3078.1 -2.25 0
3093.7 -3 0
3109.4 -3 0
3125 -3.75 0
3140.6 -3.75 0
3156.2 -3.75 0
3171.8 -4.5 0
3187.5 -4.5 0
3203.1 -4.5 0
3218.7 -5.25 0
3234.4 -5.25 0
3250 -5.25 0
3265.6 -5.25 0
3281.2 -6 0
3296.8 -6 0
3312.5 -6 0
3328.1 -6.75 0
3343.7 -6.75 0
3359.4 -6.75 0
3375 -6.75 0
3390.6 -7.5 0
3406.2 -7.5 0
3421.8 -7.5 0
3437.5 -7.5 0
3453.1 -8.25 0
3468.7 -8.25 0
3484.4 -8.25 0
3500 -8.25 0
3515.6 -8.25 0
3531.2 -9 0
3546.8 -9 0
3562.5 -9 0
3578.1 -9 0
3593.7 -9 0
3609.4 -9 0
3625 -9 0
3640.6 -9.75 0
3656.2 -9.75 0
3671.8 -9.75 0
3687.5 -9.75 0
3703.1 -9.75 0
3718.7 -9.75 0
3734.4 -9.75 0
3750 -9.75 0
3765.6 -9.75 0
3781.2 -9.75 0
3796.8 -9.75 0
3812.5 -9.75 0
3828.1 -9.75 0
3843.7 -9.75 0
3859.4 -9.75 0
3875 -9.75 0
3890.6 -9.75 0
3906.2 -9.75 0
3921.8 -9.75 0
3937.5 -9.75 0
3953.1 -9.75 0
3968.7 -9.75 0
3984.4 -9 0
4000 -9 0
4015.6 -9 0
4031.2 -9 0
4046.8 -9 0
4062.5 -9 0
4078.1 -9 0
4093.7 -9 0
4109.4 -9 0
4125 -9 0
4140.6 -9 0
4156.2 -8.25 0
4171.8 -8.25 0
4187.5 -8.25 0
4203.1 -8.25 0
4218.7 -8.25 0
4234.4 -8.25 0
4250 -8.25 0
4265.6 -7.5 0
4281.2 -7.5 0
4296.8 -7.5 0
4312.5 -7.5 0
4328.1 -7.5 0
4343.7 -7.5 0
4359.4 -6.75 0
4375 -6.75 0
4390.6 -6.75 0
4406.2 -6.75 0
4421.8 -6.75 0
4437.5 -6.75 0
4453.1 -6 0
4468.7 -6 0
4484.4 -6 0
4500 -6 0
4515.6 -6 0
4531.2 -6 0
4546.8 -5.25 0
4562.5 -5.25 0
4578.1 -5.25 0
4593.7 -5.25 0
4609.4 -5.25 0
4625 -5.25 0
4640.6 -4.5 0
4656.2 -4.5 0
4671.8 -4.5 0
4687.5 -4.5 0
4703.1 -4.5 0
4718.7 -4.5 0
4734.4 -3.75 0
4750 -3.75 0
4765.6 -3.75 0
4781.2 -3.75 0
4796.8 -3.75 0
4812.5 -3.75 0
4828.1 -3 0
4843.7 -3 0
4859.4 -3 0
4875 -3 0
4890.6 -3 0
4906.2 -3 0
4921.8 -3 0
4937.5 -3 0
4953.1 -2.25 0
4968.7 -2.25 0
4984.4 -2.25 0
5000 -2.25 0
5015.6 -2.25 0
5031.2 -2.25 0
5046.8 -2.25 0
5062.5 -2.25 0
5078.1 -2.25 0
5093.7 -2.25 0
5109.4 -1.5 0
5125 -1.5 0
5140.6 -1.5 0
5156.2 -1.5 0
5171.8 -1.5 0
5187.5 -1.5 0
5203.1 -1.5 0
5218.7 -1.5 0
5234.4 -1.5 0
5250 -1.5 0
5265.6 -1.5 0
5281.2 -1.5 0
5296.8 -1.5 0
5312.5 -1.5 0
5328.1 -1.5 0
5343.7 -1.5 0
5359.4 -1.5 0
5375 -1.5 0
5390.6 -1.5 0
5406.2 -1.5 0
5421.8 -1.5 0
5437.5 -1.5 0
5453.1 -1.5 0
5468.7 -1.5 0
5484.4 -1.5 0
5500 -1.5 0
5515.6 -1.5 0
5531.2 -1.5 0
5546.8 -1.5 0
5562.5 -1.5 0
5578.1 -1.5 0
5593.7 -1.5 0
5609.4 -1.5 0
5625 -1.5 0
5640.6 -1.5 0
5656.2 -1.5 0
5671.8 -1.5 0
5687.5 -1.5 0
5703.1 -1.5 0
5718.7 -1.5 0
5734.4 -1.5 0
5750 -1.5 0
5765.6 -1.5 0
5781.2 -1.5 0
5796.8 -1.5 0
5812.5 -1.5 0
5828.1 -1.5 0
5843.7 -1.5 0
5859.4 -1.5 0
5875 -1.5 0
5890.6 -2.25 0
5906.2 -2.25 0
5921.8 -2.25 0
5937.5 -2.25 0
5953.1 -2.25 0
5968.7 -2.25 0
5984.4 -2.25 0
6000 -2.25 0
6015.6 -2.25 0
6031.2 -2.25 0
6046.8 -2.25 0
6062.5 -2.25 0
6078.1 -3 0
6093.7 -3 0
6109.4 -3 0
6125 -3 0
6140.6 -3 0
6156.2 -3 0
6171.8 -3 0
6187.5 -3 0
6203.1 -3 0
6218.7 -3 0
6234.4 -3 0
6250 -3 0
6265.6 -3 0
6281.2 -3.75 0
6296.8 -3.75 0
6312.5 -3.75 0
6328.1 -3.75 0
6343.7 -3.75 0
6359.4 -3.75 0
6375 -3.75 0
6390.6 -3.75 0
6406.2 -3.75 0
6421.8 -3.75 0
6437.5 -3.75 0
6453.1 -3.75 0
6468.7 -3.75 0
6484.4 -3.75 0
6500 -3.75 0
6515.6 -4.5 0
6531.2 -4.5 0
6546.8 -4.5 0
6562.5 -4.5 0
6578.1 -4.5 0
6593.7 -4.5 0
6609.4 -4.5 0
6625 -4.5 0
6640.6 -4.5 0
6656.2 -4.5 0
6671.8 -4.5 0
6687.5 -4.5 0
6703.1 -4.5 0
6718.7 -4.5 0
6734.4 -4.5 0
6750 -4.5 0
6765.6 -4.5 0
6781.2 -4.5 0
6796.8 -4.5 0
6812.5 -4.5 0
6828.1 -4.5 0
6843.7 -4.5 0
6859.4 -4.5 0
6875 -4.5 0
6890.6 -4.5 0
6906.2 -4.5 0
6921.8 -4.5 0
6937.5 -4.5 0
6953.1 -4.5 0
6968.7 -4.5 0
6984.4 -4.5 0
7000 -4.5 0
7015.6 -4.5 0
7031.2 -4.5 0
7046.8 -4.5 0
7062.5 -4.5 0
7078.1 -4.5 0
7093.7 -4.5 0
7109.4 -4.5 0
7125 -4.5 0
7140.6 -4.5 0
7156.2 -4.5 0
7171.8 -4.5 0
7187.5 -4.5 0
7203.1 -4.5 0
7218.7 -4.5 0
7234.4 -4.5 0
7250 -4.5 0
7265.6 -4.5 0
7281.2 -4.5 0
7296.8 -4.5 0
7312.5 -4.5 0
7328.1 -4.5 0
7343.7 -4.5 0
7359.4 -4.5 0
7375 -4.5 0
7390.6 -4.5 0
7406.2 -4.5 0
7421.8 -4.5 0
7437.5 -4.5 0
7453.1 -4.5 0
7468.7 -4.5 0
7484.4 -4.5 0
7500 -4.5 0
7515.6 -4.5 0
7531.2 -4.5 0
7546.8 -4.5 0
7562.5 -4.5 0
7578.1 -4.5 0
7593.7 -4.5 0
7609.4 -4.5 0
7625 -4.5 0
7640.6 -4.5 0
7656.2 -4.5 0
7671.8 -4.5 0
7687.5 -4.5 0
7703.1 -4.5 0
7718.7 -4.5 0
7734.4 -4.5 0
7750 -4.5 0
7765.6 -3.75 0
7781.2 -3.75 0
7796.8 -3.75 0
7812.5 -3.75 0
7828.1 -3.75 0
7843.7 -3.75 0
7859.4 -3.75 0
7875 -3.75 0
7890.6 -3.75 0
7906.2 -3.75 0
7921.8 -3.75 0
7937.5 -3.75 0
7953.1 -3.75 0
7968.7 -3.75 0
7984.4 -3.75 0
8000 -3.75 0
8015.6 -3.75 0
8031.2 -3.75 0
8046.8 -3.75 0
8062.5 -3.75 0
8078.1 -3.75 0
8093.7 -3.75 0
8109.4 -3.75 0
8125 -3.75 0
8140.6 -3.75 0
8156.2 -3.75 0
8171.8 -3.75 0
8187.5 -3.75 0
8203.1 -3.75 0
8218.7 -3.75 0
8234.4 -3.75 0
8250 -3.75 0
8265.6 -3.75 0
8281.2 -3.75 0
8296.8 -3.75 0
8312.5 -3.75 0
8328.1 -3.75 0
8343.7 -3.75 0
8359.4 -3.75 0
8375 -3.75 0
8390.6 -3.75 0
8406.2 -3.75 0
8421.8 -3.75 0
8437.5 -3.75 0
8453.1 -3.75 0
8468.7 -3.75 0
8484.4 -3.75 0
8500 -3.75 0
8515.6 -3.75 0
8531.2 -3.75 0
8546.8 -3.75 0
8562.5 -3.75 0
8578.1 -3.75 0
8593.7 -3.75 0
8609.4 -3.75 0
8625 -3.75 0
8640.6 -3.75 0
8656.2 -3.75 0
8671.8 -3.75 0
8687.5 -3.75 0
8703.1 -3.75 0
8718.7 -3.75 0
8734.4 -3.75 0
8750 -3.75 0
8765.6 -3.75 0
8781.2 -3.75 0
8796.8 -3.75 0
8812.5 -3.75 0
8828.1 -3.75 0
8843.7 -3.75 0
8859.4 -3.75 0
8875 -3.75 0
8890.6 -3.75 0
8906.2 -3.75 0
8921.8 -3.75 0
8937.5 -3.75 0
8953.1 -3.75 0
8968.7 -3.75 0
8984.4 -3.75 0
9000 -3.75 0
9015.6 -3.75 0
9031.2 -3.75 0
9046.8 -3.75 0
9062.5 -3.75 0
9078.1 -3.75 0
9093.7 -3.75 0
9109.4 -3.75 0
9125 -3.75 0
9140.6 -3.75 0
9156.2 -3.75 0
9171.8 -3.75 0
9187.5 -3.75 0
9203.1 -3.75 0
9218.7 -3.75 0
9234.4 -3.75 0
9250 -3.75 0
9265.6 -3.75 0
9281.2 -3.75 0
9296.8 -3.75 0
9312.5 -4.5 0
9328.1 -4.5 0
9343.7 -4.5 0
9359.4 -4.5 0
9375 -4.5 0
9390.6 -4.5 0
9406.2 -4.5 0
9421.8 -4.5 0
9437.5 -4.5 0
9453.1 -4.5 0
9468.7 -4.5 0
9484.4 -4.5 0
9500 -4.5 0
9515.6 -4.5 0
9531.2 -4.5 0
9546.8 -4.5 0
9562.5 -4.5 0
9578.1 -4.5 0
9593.7 -4.5 0
9609.4 -4.5 0
9625 -4.5 0
9640.6 -4.5 0
9656.2 -4.5 0
9671.8 -4.5 0
9687.5 -4.5 0
9703.1 -4.5 0
9718.7 -4.5 0
9734.4 -4.5 0
9750 -4.5 0
9765.6 -4.5 0
9781.2 -4.5 0
9796.8 -4.5 0
9812.5 -4.5 0
9828.1 -4.5 0
9843.7 -4.5 0
9859.4 -4.5 0
9875 -4.5 0
9890.6 -4.5 0
9906.2 -4.5 0
9921.8 -4.5 0
9937.5 -4.5 0
9953.1 -4.5 0
9953.1 -4.5 0
9953.1 -4.5 0
