%!PS-Adobe-2.0 EPSF-2.0
%%Title: d4_f0.tex
%%Creator: gnuplot 4.6 patchlevel 1
%%CreationDate: Wed May 28 11:52:32 2014
%%DocumentFonts: 
%%BoundingBox: 50 50 410 302
%%EndComments
%%BeginProlog
/gnudict 256 dict def
gnudict begin
%
% The following true/false flags may be edited by hand if desired.
% The unit line width and grayscale image gamma correction may also be changed.
%
/Color true def
/Blacktext true def
/Solid false def
/Dashlength 1 def
/Landscape false def
/Level1 false def
/Rounded false def
/ClipToBoundingBox false def
/SuppressPDFMark false def
/TransparentPatterns false def
/gnulinewidth 5.000 def
/userlinewidth gnulinewidth def
/Gamma 1.0 def
/BackgroundColor {-1.000 -1.000 -1.000} def
%
/vshift -73 def
/dl1 {
  10.0 Dashlength mul mul
  Rounded { currentlinewidth 0.75 mul sub dup 0 le { pop 0.01 } if } if
} def
/dl2 {
  10.0 Dashlength mul mul
  Rounded { currentlinewidth 0.75 mul add } if
} def
/hpt_ 31.5 def
/vpt_ 31.5 def
/hpt hpt_ def
/vpt vpt_ def
/doclip {
  ClipToBoundingBox {
    newpath 50 50 moveto 410 50 lineto 410 302 lineto 50 302 lineto closepath
    clip
  } if
} def
%
% Gnuplot Prolog Version 4.6 (September 2012)
%
%/SuppressPDFMark true def
%
/M {moveto} bind def
/L {lineto} bind def
/R {rmoveto} bind def
/V {rlineto} bind def
/N {newpath moveto} bind def
/Z {closepath} bind def
/C {setrgbcolor} bind def
/f {rlineto fill} bind def
/g {setgray} bind def
/Gshow {show} def   % May be redefined later in the file to support UTF-8
/vpt2 vpt 2 mul def
/hpt2 hpt 2 mul def
/Lshow {currentpoint stroke M 0 vshift R 
	Blacktext {gsave 0 setgray show grestore} {show} ifelse} def
/Rshow {currentpoint stroke M dup stringwidth pop neg vshift R
	Blacktext {gsave 0 setgray show grestore} {show} ifelse} def
/Cshow {currentpoint stroke M dup stringwidth pop -2 div vshift R 
	Blacktext {gsave 0 setgray show grestore} {show} ifelse} def
/UP {dup vpt_ mul /vpt exch def hpt_ mul /hpt exch def
  /hpt2 hpt 2 mul def /vpt2 vpt 2 mul def} def
/DL {Color {setrgbcolor Solid {pop []} if 0 setdash}
 {pop pop pop 0 setgray Solid {pop []} if 0 setdash} ifelse} def
/BL {stroke userlinewidth 2 mul setlinewidth
	Rounded {1 setlinejoin 1 setlinecap} if} def
/AL {stroke userlinewidth 2 div setlinewidth
	Rounded {1 setlinejoin 1 setlinecap} if} def
/UL {dup gnulinewidth mul /userlinewidth exch def
	dup 1 lt {pop 1} if 10 mul /udl exch def} def
/PL {stroke userlinewidth setlinewidth
	Rounded {1 setlinejoin 1 setlinecap} if} def
3.8 setmiterlimit
% Default Line colors
/LCw {1 1 1} def
/LCb {0 0 0} def
/LCa {0 0 0} def
/LC0 {1 0 0} def
/LC1 {0 1 0} def
/LC2 {0 0 1} def
/LC3 {1 0 1} def
/LC4 {0 1 1} def
/LC5 {1 1 0} def
/LC6 {0 0 0} def
/LC7 {1 0.3 0} def
/LC8 {0.5 0.5 0.5} def
% Default Line Types
/LTw {PL [] 1 setgray} def
/LTb {BL [] LCb DL} def
/LTa {AL [1 udl mul 2 udl mul] 0 setdash LCa setrgbcolor} def
/LT0 {PL [] LC0 DL} def
/LT1 {PL [4 dl1 2 dl2] LC1 DL} def
/LT2 {PL [2 dl1 3 dl2] LC2 DL} def
/LT3 {PL [1 dl1 1.5 dl2] LC3 DL} def
/LT4 {PL [6 dl1 2 dl2 1 dl1 2 dl2] LC4 DL} def
/LT5 {PL [3 dl1 3 dl2 1 dl1 3 dl2] LC5 DL} def
/LT6 {PL [2 dl1 2 dl2 2 dl1 6 dl2] LC6 DL} def
/LT7 {PL [1 dl1 2 dl2 6 dl1 2 dl2 1 dl1 2 dl2] LC7 DL} def
/LT8 {PL [2 dl1 2 dl2 2 dl1 2 dl2 2 dl1 2 dl2 2 dl1 4 dl2] LC8 DL} def
/Pnt {stroke [] 0 setdash gsave 1 setlinecap M 0 0 V stroke grestore} def
/Dia {stroke [] 0 setdash 2 copy vpt add M
  hpt neg vpt neg V hpt vpt neg V
  hpt vpt V hpt neg vpt V closepath stroke
  Pnt} def
/Pls {stroke [] 0 setdash vpt sub M 0 vpt2 V
  currentpoint stroke M
  hpt neg vpt neg R hpt2 0 V stroke
 } def
/Box {stroke [] 0 setdash 2 copy exch hpt sub exch vpt add M
  0 vpt2 neg V hpt2 0 V 0 vpt2 V
  hpt2 neg 0 V closepath stroke
  Pnt} def
/Crs {stroke [] 0 setdash exch hpt sub exch vpt add M
  hpt2 vpt2 neg V currentpoint stroke M
  hpt2 neg 0 R hpt2 vpt2 V stroke} def
/TriU {stroke [] 0 setdash 2 copy vpt 1.12 mul add M
  hpt neg vpt -1.62 mul V
  hpt 2 mul 0 V
  hpt neg vpt 1.62 mul V closepath stroke
  Pnt} def
/Star {2 copy Pls Crs} def
/BoxF {stroke [] 0 setdash exch hpt sub exch vpt add M
  0 vpt2 neg V hpt2 0 V 0 vpt2 V
  hpt2 neg 0 V closepath fill} def
/TriUF {stroke [] 0 setdash vpt 1.12 mul add M
  hpt neg vpt -1.62 mul V
  hpt 2 mul 0 V
  hpt neg vpt 1.62 mul V closepath fill} def
/TriD {stroke [] 0 setdash 2 copy vpt 1.12 mul sub M
  hpt neg vpt 1.62 mul V
  hpt 2 mul 0 V
  hpt neg vpt -1.62 mul V closepath stroke
  Pnt} def
/TriDF {stroke [] 0 setdash vpt 1.12 mul sub M
  hpt neg vpt 1.62 mul V
  hpt 2 mul 0 V
  hpt neg vpt -1.62 mul V closepath fill} def
/DiaF {stroke [] 0 setdash vpt add M
  hpt neg vpt neg V hpt vpt neg V
  hpt vpt V hpt neg vpt V closepath fill} def
/Pent {stroke [] 0 setdash 2 copy gsave
  translate 0 hpt M 4 {72 rotate 0 hpt L} repeat
  closepath stroke grestore Pnt} def
/PentF {stroke [] 0 setdash gsave
  translate 0 hpt M 4 {72 rotate 0 hpt L} repeat
  closepath fill grestore} def
/Circle {stroke [] 0 setdash 2 copy
  hpt 0 360 arc stroke Pnt} def
/CircleF {stroke [] 0 setdash hpt 0 360 arc fill} def
/C0 {BL [] 0 setdash 2 copy moveto vpt 90 450 arc} bind def
/C1 {BL [] 0 setdash 2 copy moveto
	2 copy vpt 0 90 arc closepath fill
	vpt 0 360 arc closepath} bind def
/C2 {BL [] 0 setdash 2 copy moveto
	2 copy vpt 90 180 arc closepath fill
	vpt 0 360 arc closepath} bind def
/C3 {BL [] 0 setdash 2 copy moveto
	2 copy vpt 0 180 arc closepath fill
	vpt 0 360 arc closepath} bind def
/C4 {BL [] 0 setdash 2 copy moveto
	2 copy vpt 180 270 arc closepath fill
	vpt 0 360 arc closepath} bind def
/C5 {BL [] 0 setdash 2 copy moveto
	2 copy vpt 0 90 arc
	2 copy moveto
	2 copy vpt 180 270 arc closepath fill
	vpt 0 360 arc} bind def
/C6 {BL [] 0 setdash 2 copy moveto
	2 copy vpt 90 270 arc closepath fill
	vpt 0 360 arc closepath} bind def
/C7 {BL [] 0 setdash 2 copy moveto
	2 copy vpt 0 270 arc closepath fill
	vpt 0 360 arc closepath} bind def
/C8 {BL [] 0 setdash 2 copy moveto
	2 copy vpt 270 360 arc closepath fill
	vpt 0 360 arc closepath} bind def
/C9 {BL [] 0 setdash 2 copy moveto
	2 copy vpt 270 450 arc closepath fill
	vpt 0 360 arc closepath} bind def
/C10 {BL [] 0 setdash 2 copy 2 copy moveto vpt 270 360 arc closepath fill
	2 copy moveto
	2 copy vpt 90 180 arc closepath fill
	vpt 0 360 arc closepath} bind def
/C11 {BL [] 0 setdash 2 copy moveto
	2 copy vpt 0 180 arc closepath fill
	2 copy moveto
	2 copy vpt 270 360 arc closepath fill
	vpt 0 360 arc closepath} bind def
/C12 {BL [] 0 setdash 2 copy moveto
	2 copy vpt 180 360 arc closepath fill
	vpt 0 360 arc closepath} bind def
/C13 {BL [] 0 setdash 2 copy moveto
	2 copy vpt 0 90 arc closepath fill
	2 copy moveto
	2 copy vpt 180 360 arc closepath fill
	vpt 0 360 arc closepath} bind def
/C14 {BL [] 0 setdash 2 copy moveto
	2 copy vpt 90 360 arc closepath fill
	vpt 0 360 arc} bind def
/C15 {BL [] 0 setdash 2 copy vpt 0 360 arc closepath fill
	vpt 0 360 arc closepath} bind def
/Rec {newpath 4 2 roll moveto 1 index 0 rlineto 0 exch rlineto
	neg 0 rlineto closepath} bind def
/Square {dup Rec} bind def
/Bsquare {vpt sub exch vpt sub exch vpt2 Square} bind def
/S0 {BL [] 0 setdash 2 copy moveto 0 vpt rlineto BL Bsquare} bind def
/S1 {BL [] 0 setdash 2 copy vpt Square fill Bsquare} bind def
/S2 {BL [] 0 setdash 2 copy exch vpt sub exch vpt Square fill Bsquare} bind def
/S3 {BL [] 0 setdash 2 copy exch vpt sub exch vpt2 vpt Rec fill Bsquare} bind def
/S4 {BL [] 0 setdash 2 copy exch vpt sub exch vpt sub vpt Square fill Bsquare} bind def
/S5 {BL [] 0 setdash 2 copy 2 copy vpt Square fill
	exch vpt sub exch vpt sub vpt Square fill Bsquare} bind def
/S6 {BL [] 0 setdash 2 copy exch vpt sub exch vpt sub vpt vpt2 Rec fill Bsquare} bind def
/S7 {BL [] 0 setdash 2 copy exch vpt sub exch vpt sub vpt vpt2 Rec fill
	2 copy vpt Square fill Bsquare} bind def
/S8 {BL [] 0 setdash 2 copy vpt sub vpt Square fill Bsquare} bind def
/S9 {BL [] 0 setdash 2 copy vpt sub vpt vpt2 Rec fill Bsquare} bind def
/S10 {BL [] 0 setdash 2 copy vpt sub vpt Square fill 2 copy exch vpt sub exch vpt Square fill
	Bsquare} bind def
/S11 {BL [] 0 setdash 2 copy vpt sub vpt Square fill 2 copy exch vpt sub exch vpt2 vpt Rec fill
	Bsquare} bind def
/S12 {BL [] 0 setdash 2 copy exch vpt sub exch vpt sub vpt2 vpt Rec fill Bsquare} bind def
/S13 {BL [] 0 setdash 2 copy exch vpt sub exch vpt sub vpt2 vpt Rec fill
	2 copy vpt Square fill Bsquare} bind def
/S14 {BL [] 0 setdash 2 copy exch vpt sub exch vpt sub vpt2 vpt Rec fill
	2 copy exch vpt sub exch vpt Square fill Bsquare} bind def
/S15 {BL [] 0 setdash 2 copy Bsquare fill Bsquare} bind def
/D0 {gsave translate 45 rotate 0 0 S0 stroke grestore} bind def
/D1 {gsave translate 45 rotate 0 0 S1 stroke grestore} bind def
/D2 {gsave translate 45 rotate 0 0 S2 stroke grestore} bind def
/D3 {gsave translate 45 rotate 0 0 S3 stroke grestore} bind def
/D4 {gsave translate 45 rotate 0 0 S4 stroke grestore} bind def
/D5 {gsave translate 45 rotate 0 0 S5 stroke grestore} bind def
/D6 {gsave translate 45 rotate 0 0 S6 stroke grestore} bind def
/D7 {gsave translate 45 rotate 0 0 S7 stroke grestore} bind def
/D8 {gsave translate 45 rotate 0 0 S8 stroke grestore} bind def
/D9 {gsave translate 45 rotate 0 0 S9 stroke grestore} bind def
/D10 {gsave translate 45 rotate 0 0 S10 stroke grestore} bind def
/D11 {gsave translate 45 rotate 0 0 S11 stroke grestore} bind def
/D12 {gsave translate 45 rotate 0 0 S12 stroke grestore} bind def
/D13 {gsave translate 45 rotate 0 0 S13 stroke grestore} bind def
/D14 {gsave translate 45 rotate 0 0 S14 stroke grestore} bind def
/D15 {gsave translate 45 rotate 0 0 S15 stroke grestore} bind def
/DiaE {stroke [] 0 setdash vpt add M
  hpt neg vpt neg V hpt vpt neg V
  hpt vpt V hpt neg vpt V closepath stroke} def
/BoxE {stroke [] 0 setdash exch hpt sub exch vpt add M
  0 vpt2 neg V hpt2 0 V 0 vpt2 V
  hpt2 neg 0 V closepath stroke} def
/TriUE {stroke [] 0 setdash vpt 1.12 mul add M
  hpt neg vpt -1.62 mul V
  hpt 2 mul 0 V
  hpt neg vpt 1.62 mul V closepath stroke} def
/TriDE {stroke [] 0 setdash vpt 1.12 mul sub M
  hpt neg vpt 1.62 mul V
  hpt 2 mul 0 V
  hpt neg vpt -1.62 mul V closepath stroke} def
/PentE {stroke [] 0 setdash gsave
  translate 0 hpt M 4 {72 rotate 0 hpt L} repeat
  closepath stroke grestore} def
/CircE {stroke [] 0 setdash 
  hpt 0 360 arc stroke} def
/Opaque {gsave closepath 1 setgray fill grestore 0 setgray closepath} def
/DiaW {stroke [] 0 setdash vpt add M
  hpt neg vpt neg V hpt vpt neg V
  hpt vpt V hpt neg vpt V Opaque stroke} def
/BoxW {stroke [] 0 setdash exch hpt sub exch vpt add M
  0 vpt2 neg V hpt2 0 V 0 vpt2 V
  hpt2 neg 0 V Opaque stroke} def
/TriUW {stroke [] 0 setdash vpt 1.12 mul add M
  hpt neg vpt -1.62 mul V
  hpt 2 mul 0 V
  hpt neg vpt 1.62 mul V Opaque stroke} def
/TriDW {stroke [] 0 setdash vpt 1.12 mul sub M
  hpt neg vpt 1.62 mul V
  hpt 2 mul 0 V
  hpt neg vpt -1.62 mul V Opaque stroke} def
/PentW {stroke [] 0 setdash gsave
  translate 0 hpt M 4 {72 rotate 0 hpt L} repeat
  Opaque stroke grestore} def
/CircW {stroke [] 0 setdash 
  hpt 0 360 arc Opaque stroke} def
/BoxFill {gsave Rec 1 setgray fill grestore} def
/Density {
  /Fillden exch def
  currentrgbcolor
  /ColB exch def /ColG exch def /ColR exch def
  /ColR ColR Fillden mul Fillden sub 1 add def
  /ColG ColG Fillden mul Fillden sub 1 add def
  /ColB ColB Fillden mul Fillden sub 1 add def
  ColR ColG ColB setrgbcolor} def
/BoxColFill {gsave Rec PolyFill} def
/PolyFill {gsave Density fill grestore grestore} def
/h {rlineto rlineto rlineto gsave closepath fill grestore} bind def
%
% PostScript Level 1 Pattern Fill routine for rectangles
% Usage: x y w h s a XX PatternFill
%	x,y = lower left corner of box to be filled
%	w,h = width and height of box
%	  a = angle in degrees between lines and x-axis
%	 XX = 0/1 for no/yes cross-hatch
%
/PatternFill {gsave /PFa [ 9 2 roll ] def
  PFa 0 get PFa 2 get 2 div add PFa 1 get PFa 3 get 2 div add translate
  PFa 2 get -2 div PFa 3 get -2 div PFa 2 get PFa 3 get Rec
  TransparentPatterns {} {gsave 1 setgray fill grestore} ifelse
  clip
  currentlinewidth 0.5 mul setlinewidth
  /PFs PFa 2 get dup mul PFa 3 get dup mul add sqrt def
  0 0 M PFa 5 get rotate PFs -2 div dup translate
  0 1 PFs PFa 4 get div 1 add floor cvi
	{PFa 4 get mul 0 M 0 PFs V} for
  0 PFa 6 get ne {
	0 1 PFs PFa 4 get div 1 add floor cvi
	{PFa 4 get mul 0 2 1 roll M PFs 0 V} for
 } if
  stroke grestore} def
%
/languagelevel where
 {pop languagelevel} {1} ifelse
 2 lt
	{/InterpretLevel1 true def}
	{/InterpretLevel1 Level1 def}
 ifelse
%
% PostScript level 2 pattern fill definitions
%
/Level2PatternFill {
/Tile8x8 {/PaintType 2 /PatternType 1 /TilingType 1 /BBox [0 0 8 8] /XStep 8 /YStep 8}
	bind def
/KeepColor {currentrgbcolor [/Pattern /DeviceRGB] setcolorspace} bind def
<< Tile8x8
 /PaintProc {0.5 setlinewidth pop 0 0 M 8 8 L 0 8 M 8 0 L stroke} 
>> matrix makepattern
/Pat1 exch def
<< Tile8x8
 /PaintProc {0.5 setlinewidth pop 0 0 M 8 8 L 0 8 M 8 0 L stroke
	0 4 M 4 8 L 8 4 L 4 0 L 0 4 L stroke}
>> matrix makepattern
/Pat2 exch def
<< Tile8x8
 /PaintProc {0.5 setlinewidth pop 0 0 M 0 8 L
	8 8 L 8 0 L 0 0 L fill}
>> matrix makepattern
/Pat3 exch def
<< Tile8x8
 /PaintProc {0.5 setlinewidth pop -4 8 M 8 -4 L
	0 12 M 12 0 L stroke}
>> matrix makepattern
/Pat4 exch def
<< Tile8x8
 /PaintProc {0.5 setlinewidth pop -4 0 M 8 12 L
	0 -4 M 12 8 L stroke}
>> matrix makepattern
/Pat5 exch def
<< Tile8x8
 /PaintProc {0.5 setlinewidth pop -2 8 M 4 -4 L
	0 12 M 8 -4 L 4 12 M 10 0 L stroke}
>> matrix makepattern
/Pat6 exch def
<< Tile8x8
 /PaintProc {0.5 setlinewidth pop -2 0 M 4 12 L
	0 -4 M 8 12 L 4 -4 M 10 8 L stroke}
>> matrix makepattern
/Pat7 exch def
<< Tile8x8
 /PaintProc {0.5 setlinewidth pop 8 -2 M -4 4 L
	12 0 M -4 8 L 12 4 M 0 10 L stroke}
>> matrix makepattern
/Pat8 exch def
<< Tile8x8
 /PaintProc {0.5 setlinewidth pop 0 -2 M 12 4 L
	-4 0 M 12 8 L -4 4 M 8 10 L stroke}
>> matrix makepattern
/Pat9 exch def
/Pattern1 {PatternBgnd KeepColor Pat1 setpattern} bind def
/Pattern2 {PatternBgnd KeepColor Pat2 setpattern} bind def
/Pattern3 {PatternBgnd KeepColor Pat3 setpattern} bind def
/Pattern4 {PatternBgnd KeepColor Landscape {Pat5} {Pat4} ifelse setpattern} bind def
/Pattern5 {PatternBgnd KeepColor Landscape {Pat4} {Pat5} ifelse setpattern} bind def
/Pattern6 {PatternBgnd KeepColor Landscape {Pat9} {Pat6} ifelse setpattern} bind def
/Pattern7 {PatternBgnd KeepColor Landscape {Pat8} {Pat7} ifelse setpattern} bind def
} def
%
%
%End of PostScript Level 2 code
%
/PatternBgnd {
  TransparentPatterns {} {gsave 1 setgray fill grestore} ifelse
} def
%
% Substitute for Level 2 pattern fill codes with
% grayscale if Level 2 support is not selected.
%
/Level1PatternFill {
/Pattern1 {0.250 Density} bind def
/Pattern2 {0.500 Density} bind def
/Pattern3 {0.750 Density} bind def
/Pattern4 {0.125 Density} bind def
/Pattern5 {0.375 Density} bind def
/Pattern6 {0.625 Density} bind def
/Pattern7 {0.875 Density} bind def
} def
%
% Now test for support of Level 2 code
%
Level1 {Level1PatternFill} {Level2PatternFill} ifelse
%
/Symbol-Oblique /Symbol findfont [1 0 .167 1 0 0] makefont
dup length dict begin {1 index /FID eq {pop pop} {def} ifelse} forall
currentdict end definefont pop
Level1 SuppressPDFMark or 
{} {
/SDict 10 dict def
systemdict /pdfmark known not {
  userdict /pdfmark systemdict /cleartomark get put
} if
SDict begin [
  /Title (d4_f0.tex)
  /Subject (gnuplot plot)
  /Creator (gnuplot 4.6 patchlevel 1)
  /Author (kevin.luedemann)
%  /Producer (gnuplot)
%  /Keywords ()
  /CreationDate (Wed May 28 11:52:32 2014)
  /DOCINFO pdfmark
end
} ifelse
end
%%EndProlog
%%Page: 1 1
gnudict begin
gsave
doclip
50 50 translate
0.050 0.050 scale
0 setgray
newpath
1.000 UL
LTb
LCb setrgbcolor
946 704 M
63 0 V
5794 0 R
-63 0 V
stroke
LTb
946 1383 M
63 0 V
5794 0 R
-63 0 V
946 2061 M
63 0 V
5794 0 R
-63 0 V
946 2740 M
63 0 V
5794 0 R
-63 0 V
946 3418 M
63 0 V
5794 0 R
-63 0 V
946 4097 M
63 0 V
5794 0 R
-63 0 V
946 4775 M
63 0 V
5794 0 R
-63 0 V
946 704 M
0 63 V
0 4008 R
0 -63 V
1922 704 M
0 63 V
0 4008 R
0 -63 V
2898 704 M
0 63 V
0 4008 R
0 -63 V
3875 704 M
0 63 V
0 4008 R
0 -63 V
4851 704 M
0 63 V
0 4008 R
0 -63 V
5827 704 M
0 63 V
0 4008 R
0 -63 V
6803 704 M
0 63 V
0 4008 R
0 -63 V
stroke
946 4775 N
946 704 L
5857 0 V
0 4071 V
-5857 0 V
Z stroke
1.000 UP
1.000 UL
LTb
1.000 UP
1.000 UL
LT0
LC0 setrgbcolor
LCb setrgbcolor
LT0
LC0 setrgbcolor
946 2952 Pls
949 3028 Pls
952 3079 Pls
955 3155 Pls
958 3206 Pls
961 3282 Pls
964 3359 Pls
967 3410 Pls
970 3460 Pls
973 3537 Pls
976 3588 Pls
980 3639 Pls
983 3715 Pls
986 3766 Pls
989 3817 Pls
992 3868 Pls
995 3918 Pls
998 3969 Pls
1001 4020 Pls
1004 4071 Pls
1007 4122 Pls
1010 4147 Pls
1013 4198 Pls
1016 4224 Pls
1019 4275 Pls
1022 4300 Pls
1025 4351 Pls
1028 4376 Pls
1031 4402 Pls
1034 4427 Pls
1038 4478 Pls
1041 4478 Pls
1044 4504 Pls
1047 4529 Pls
1050 4554 Pls
1053 4580 Pls
1056 4580 Pls
1059 4605 Pls
1062 4605 Pls
1065 4631 Pls
1068 4631 Pls
1071 4631 Pls
1074 4631 Pls
1077 4631 Pls
1080 4631 Pls
1083 4631 Pls
1086 4631 Pls
1089 4605 Pls
1092 4605 Pls
1095 4605 Pls
1099 4580 Pls
1102 4580 Pls
1105 4554 Pls
1108 4529 Pls
1111 4529 Pls
1114 4504 Pls
1117 4478 Pls
1120 4453 Pls
1123 4427 Pls
1126 4402 Pls
1129 4376 Pls
1132 4325 Pls
1135 4300 Pls
1138 4275 Pls
1141 4249 Pls
1144 4198 Pls
1147 4173 Pls
1150 4122 Pls
1153 4071 Pls
1156 4046 Pls
1160 3995 Pls
1163 3944 Pls
1166 3893 Pls
1169 3868 Pls
1172 3817 Pls
1175 3766 Pls
1178 3715 Pls
1181 3664 Pls
1184 3613 Pls
1187 3562 Pls
1190 3511 Pls
1193 3460 Pls
1196 3410 Pls
1199 3359 Pls
1202 3282 Pls
1205 3257 Pls
1208 3181 Pls
1211 3130 Pls
1214 3079 Pls
1217 3028 Pls
1221 2977 Pls
1224 2901 Pls
1230 2824 Pls
1233 2773 Pls
1236 2723 Pls
1239 2672 Pls
1242 2621 Pls
1245 2544 Pls
1248 2494 Pls
1251 2443 Pls
1254 2392 Pls
1257 2341 Pls
1260 2290 Pls
1263 2239 Pls
1266 2188 Pls
1269 2137 Pls
1272 2112 Pls
1275 2061 Pls
1279 2010 Pls
1282 1959 Pls
1285 1908 Pls
1288 1883 Pls
1291 1832 Pls
1294 1781 Pls
1297 1756 Pls
1300 1705 Pls
1303 1679 Pls
1306 1628 Pls
1309 1603 Pls
1312 1578 Pls
1315 1527 Pls
1318 1501 Pls
1321 1476 Pls
1324 1450 Pls
1327 1425 Pls
1330 1399 Pls
1333 1374 Pls
1336 1349 Pls
1340 1323 Pls
1343 1323 Pls
1346 1298 Pls
1349 1272 Pls
1352 1272 Pls
1355 1247 Pls
1358 1247 Pls
1361 1221 Pls
1364 1221 Pls
1367 1221 Pls
1370 1221 Pls
1373 1196 Pls
1376 1196 Pls
1379 1196 Pls
1382 1196 Pls
1385 1196 Pls
1388 1196 Pls
1391 1196 Pls
1394 1196 Pls
1397 1221 Pls
1401 1221 Pls
1404 1247 Pls
1407 1247 Pls
1410 1272 Pls
1413 1272 Pls
1416 1298 Pls
1419 1298 Pls
1422 1323 Pls
1425 1349 Pls
1428 1374 Pls
1431 1399 Pls
1434 1425 Pls
1437 1450 Pls
1440 1476 Pls
1443 1501 Pls
1446 1527 Pls
1449 1552 Pls
1452 1578 Pls
1455 1628 Pls
1458 1654 Pls
1462 1679 Pls
1465 1705 Pls
1468 1756 Pls
1471 1781 Pls
1474 1832 Pls
1477 1857 Pls
1480 1908 Pls
1483 1934 Pls
1486 1985 Pls
1489 2010 Pls
1492 2061 Pls
1495 2112 Pls
1498 2137 Pls
1501 2188 Pls
1504 2239 Pls
1507 2265 Pls
1510 2315 Pls
1513 2366 Pls
1516 2392 Pls
1519 2443 Pls
1523 2494 Pls
1526 2519 Pls
1529 2570 Pls
1532 2621 Pls
1535 2646 Pls
1538 2697 Pls
1541 2748 Pls
1544 2799 Pls
1547 2824 Pls
1550 2901 Pls
1553 2926 Pls
1556 2977 Pls
1559 3028 Pls
1562 3053 Pls
1565 3104 Pls
1568 3130 Pls
1571 3181 Pls
1574 3206 Pls
1577 3257 Pls
1581 3282 Pls
1584 3333 Pls
1587 3359 Pls
1590 3384 Pls
1593 3435 Pls
1596 3460 Pls
1599 3486 Pls
1602 3511 Pls
1605 3562 Pls
1608 3588 Pls
1611 3613 Pls
1614 3639 Pls
1617 3664 Pls
1620 3689 Pls
1623 3715 Pls
1626 3740 Pls
1629 3740 Pls
1632 3766 Pls
1635 3791 Pls
1638 3817 Pls
1642 3817 Pls
1645 3842 Pls
1648 3842 Pls
1651 3868 Pls
1654 3868 Pls
1657 3893 Pls
1660 3893 Pls
1663 3893 Pls
1666 3918 Pls
1669 3918 Pls
1672 3918 Pls
1675 3918 Pls
1678 3918 Pls
1681 3918 Pls
1684 3918 Pls
1687 3918 Pls
1690 3893 Pls
1693 3893 Pls
1696 3893 Pls
1699 3893 Pls
1703 3868 Pls
1706 3868 Pls
1709 3868 Pls
1712 3842 Pls
1715 3842 Pls
1718 3817 Pls
1721 3817 Pls
1724 3791 Pls
1727 3766 Pls
1730 3766 Pls
1733 3740 Pls
1736 3715 Pls
1739 3689 Pls
1742 3689 Pls
1745 3664 Pls
1748 3639 Pls
1751 3613 Pls
1754 3588 Pls
1757 3562 Pls
1760 3537 Pls
1764 3511 Pls
1767 3486 Pls
1770 3435 Pls
1773 3410 Pls
1776 3384 Pls
1779 3359 Pls
1782 3333 Pls
1785 3282 Pls
1788 3257 Pls
1791 3231 Pls
1794 3206 Pls
1797 3155 Pls
1800 3130 Pls
1803 3104 Pls
1806 3079 Pls
1809 3028 Pls
1812 3002 Pls
1815 2977 Pls
1818 2926 Pls
1822 2901 Pls
1825 2875 Pls
1828 2824 Pls
1831 2799 Pls
1834 2748 Pls
1837 2723 Pls
1840 2697 Pls
1843 2672 Pls
1846 2621 Pls
1849 2595 Pls
1852 2570 Pls
1855 2544 Pls
1858 2494 Pls
1861 2468 Pls
1864 2443 Pls
1867 2417 Pls
1870 2366 Pls
1873 2341 Pls
1876 2315 Pls
1879 2290 Pls
1882 2265 Pls
1886 2239 Pls
1889 2214 Pls
1892 2188 Pls
1895 2163 Pls
1898 2137 Pls
1901 2112 Pls
1904 2086 Pls
1907 2061 Pls
1910 2036 Pls
1913 2010 Pls
1916 2010 Pls
1919 1985 Pls
1922 1959 Pls
1925 1934 Pls
1928 1934 Pls
1931 1908 Pls
1934 1908 Pls
1937 1883 Pls
1940 1883 Pls
1944 1857 Pls
1947 1857 Pls
1950 1832 Pls
1953 1832 Pls
1956 1832 Pls
1959 1807 Pls
1962 1807 Pls
1965 1807 Pls
1968 1807 Pls
1971 1807 Pls
1974 1807 Pls
1977 1807 Pls
1980 1807 Pls
1983 1807 Pls
1986 1807 Pls
1989 1807 Pls
1992 1807 Pls
1995 1832 Pls
1998 1832 Pls
2001 1832 Pls
2005 1832 Pls
2008 1857 Pls
2011 1857 Pls
2014 1857 Pls
2017 1883 Pls
2020 1883 Pls
2023 1908 Pls
2026 1908 Pls
2029 1934 Pls
2032 1934 Pls
2035 1959 Pls
2038 1985 Pls
2041 1985 Pls
2044 2010 Pls
2047 2036 Pls
2050 2036 Pls
2053 2061 Pls
2056 2086 Pls
2059 2112 Pls
2062 2112 Pls
2066 2137 Pls
2069 2163 Pls
2072 2188 Pls
2075 2214 Pls
2078 2239 Pls
2081 2265 Pls
2084 2290 Pls
2087 2315 Pls
2090 2341 Pls
2093 2366 Pls
2096 2392 Pls
2099 2417 Pls
2102 2443 Pls
2105 2468 Pls
2108 2494 Pls
2111 2519 Pls
2114 2544 Pls
2117 2570 Pls
2120 2595 Pls
2123 2621 Pls
2127 2646 Pls
2130 2672 Pls
2133 2697 Pls
2136 2723 Pls
2139 2748 Pls
2142 2773 Pls
2145 2799 Pls
2148 2824 Pls
2151 2850 Pls
2154 2875 Pls
2157 2901 Pls
2160 2926 Pls
2163 2952 Pls
2166 2977 Pls
2169 3002 Pls
2172 3028 Pls
2175 3053 Pls
2178 3079 Pls
2181 3104 Pls
2185 3130 Pls
2188 3130 Pls
2191 3155 Pls
2194 3181 Pls
2197 3206 Pls
2200 3206 Pls
2203 3231 Pls
2206 3257 Pls
2209 3282 Pls
2212 3282 Pls
2215 3308 Pls
2218 3308 Pls
2221 3333 Pls
2224 3359 Pls
2227 3359 Pls
2230 3384 Pls
2233 3384 Pls
2236 3384 Pls
2239 3410 Pls
2242 3410 Pls
2246 3435 Pls
2249 3435 Pls
2252 3435 Pls
2255 3435 Pls
2258 3460 Pls
2261 3460 Pls
2264 3460 Pls
2267 3460 Pls
2270 3460 Pls
2273 3460 Pls
2276 3460 Pls
2279 3460 Pls
2282 3460 Pls
2285 3460 Pls
2288 3460 Pls
2291 3460 Pls
2294 3460 Pls
2297 3435 Pls
2300 3435 Pls
2303 3435 Pls
2307 3435 Pls
2310 3410 Pls
2313 3410 Pls
2316 3410 Pls
2319 3384 Pls
2322 3384 Pls
2325 3384 Pls
2328 3359 Pls
2331 3359 Pls
2334 3333 Pls
2337 3333 Pls
2340 3308 Pls
2343 3308 Pls
2346 3282 Pls
2349 3282 Pls
2352 3257 Pls
2355 3231 Pls
2358 3231 Pls
2361 3206 Pls
2364 3181 Pls
2368 3181 Pls
2371 3155 Pls
2374 3130 Pls
2377 3130 Pls
2380 3104 Pls
2383 3079 Pls
2386 3053 Pls
2389 3053 Pls
2392 3028 Pls
2395 3002 Pls
2398 2977 Pls
2401 2952 Pls
2404 2952 Pls
2407 2926 Pls
2410 2901 Pls
2413 2875 Pls
2416 2850 Pls
2419 2850 Pls
2422 2824 Pls
2425 2799 Pls
2429 2773 Pls
2432 2748 Pls
2435 2723 Pls
2438 2723 Pls
2441 2697 Pls
2444 2672 Pls
2447 2646 Pls
2450 2621 Pls
2453 2621 Pls
2456 2595 Pls
2459 2570 Pls
2462 2544 Pls
2465 2544 Pls
2468 2519 Pls
2471 2494 Pls
2474 2494 Pls
2477 2468 Pls
2480 2443 Pls
2483 2417 Pls
2487 2417 Pls
2490 2392 Pls
2493 2392 Pls
2496 2366 Pls
2499 2341 Pls
2502 2341 Pls
2505 2315 Pls
2508 2315 Pls
2511 2290 Pls
2514 2290 Pls
2517 2265 Pls
2520 2265 Pls
2523 2239 Pls
2526 2239 Pls
2529 2239 Pls
2532 2214 Pls
2535 2214 Pls
2538 2214 Pls
2541 2188 Pls
2544 2188 Pls
2548 2188 Pls
2551 2188 Pls
2554 2163 Pls
2557 2163 Pls
2560 2163 Pls
2563 2163 Pls
2566 2163 Pls
2569 2163 Pls
2572 2163 Pls
2575 2163 Pls
2578 2163 Pls
2581 2163 Pls
2584 2163 Pls
2587 2163 Pls
2590 2163 Pls
2593 2188 Pls
2596 2188 Pls
2599 2188 Pls
2602 2188 Pls
2605 2188 Pls
2609 2188 Pls
2612 2214 Pls
2615 2214 Pls
2618 2214 Pls
2621 2214 Pls
2624 2239 Pls
2627 2239 Pls
2630 2239 Pls
2633 2265 Pls
2636 2265 Pls
2639 2290 Pls
2642 2290 Pls
2645 2315 Pls
2648 2315 Pls
2651 2315 Pls
2654 2341 Pls
2657 2341 Pls
2660 2366 Pls
2663 2366 Pls
2666 2392 Pls
2670 2417 Pls
2673 2417 Pls
2676 2443 Pls
2679 2443 Pls
2682 2468 Pls
2685 2468 Pls
2688 2494 Pls
2691 2519 Pls
2694 2519 Pls
2697 2544 Pls
2700 2544 Pls
2703 2570 Pls
2706 2595 Pls
2709 2595 Pls
2712 2621 Pls
2715 2646 Pls
2718 2646 Pls
2721 2672 Pls
2724 2697 Pls
2728 2697 Pls
2731 2723 Pls
2734 2748 Pls
2737 2748 Pls
2740 2773 Pls
2743 2773 Pls
2746 2799 Pls
2749 2824 Pls
2752 2824 Pls
2755 2850 Pls
2758 2875 Pls
2761 2875 Pls
2764 2901 Pls
2767 2901 Pls
2770 2926 Pls
2773 2926 Pls
2776 2952 Pls
2779 2952 Pls
2782 2977 Pls
2785 3002 Pls
2789 3002 Pls
2792 3002 Pls
2795 3028 Pls
2798 3028 Pls
2801 3053 Pls
2804 3053 Pls
2807 3079 Pls
2810 3079 Pls
2813 3079 Pls
2816 3104 Pls
2819 3104 Pls
2822 3104 Pls
2825 3130 Pls
2828 3130 Pls
2831 3130 Pls
2834 3155 Pls
2837 3155 Pls
2840 3155 Pls
2843 3155 Pls
2846 3181 Pls
2850 3181 Pls
2853 3181 Pls
2856 3181 Pls
2859 3181 Pls
2862 3181 Pls
2865 3181 Pls
2868 3181 Pls
2871 3181 Pls
2874 3181 Pls
2877 3181 Pls
2880 3181 Pls
2883 3181 Pls
2886 3181 Pls
2889 3181 Pls
2892 3181 Pls
2895 3181 Pls
2898 3155 Pls
2901 3155 Pls
2904 3155 Pls
2907 3155 Pls
2911 3155 Pls
2914 3155 Pls
2917 3130 Pls
2920 3130 Pls
2923 3130 Pls
2926 3130 Pls
2929 3104 Pls
2932 3104 Pls
2935 3104 Pls
2938 3079 Pls
2941 3079 Pls
2944 3079 Pls
2947 3053 Pls
2950 3053 Pls
2953 3053 Pls
2956 3028 Pls
2959 3028 Pls
2962 3002 Pls
2965 3002 Pls
2969 2977 Pls
2972 2977 Pls
2975 2977 Pls
2978 2952 Pls
2981 2952 Pls
2984 2926 Pls
2987 2926 Pls
2990 2901 Pls
2993 2901 Pls
2996 2875 Pls
2999 2875 Pls
3002 2850 Pls
3005 2850 Pls
3008 2824 Pls
3011 2824 Pls
3014 2799 Pls
3017 2799 Pls
3020 2773 Pls
3023 2773 Pls
3026 2748 Pls
3029 2748 Pls
3033 2723 Pls
3036 2723 Pls
3039 2697 Pls
3042 2697 Pls
3045 2672 Pls
3048 2672 Pls
3051 2646 Pls
3054 2646 Pls
3057 2621 Pls
3060 2621 Pls
3063 2595 Pls
3066 2595 Pls
3069 2595 Pls
3072 2570 Pls
3075 2570 Pls
3078 2544 Pls
3081 2544 Pls
3084 2519 Pls
3087 2519 Pls
3091 2519 Pls
3094 2494 Pls
3097 2494 Pls
3100 2494 Pls
3103 2468 Pls
3106 2468 Pls
3109 2468 Pls
3112 2443 Pls
3115 2443 Pls
3118 2443 Pls
3121 2443 Pls
3124 2417 Pls
3127 2417 Pls
3130 2417 Pls
3133 2417 Pls
3136 2417 Pls
3139 2392 Pls
3142 2392 Pls
3145 2392 Pls
3148 2392 Pls
3152 2392 Pls
3155 2392 Pls
3158 2392 Pls
3161 2392 Pls
3164 2392 Pls
3167 2392 Pls
3170 2392 Pls
3173 2366 Pls
3176 2366 Pls
3179 2366 Pls
3182 2366 Pls
3185 2366 Pls
3188 2366 Pls
3191 2366 Pls
3194 2366 Pls
3197 2366 Pls
3200 2366 Pls
3203 2392 Pls
3206 2392 Pls
3209 2392 Pls
3213 2392 Pls
3216 2392 Pls
3219 2392 Pls
3222 2417 Pls
3225 2417 Pls
3228 2417 Pls
3231 2417 Pls
3234 2443 Pls
3237 2443 Pls
3240 2443 Pls
3243 2443 Pls
3246 2468 Pls
3249 2468 Pls
3252 2468 Pls
3255 2494 Pls
3258 2494 Pls
3261 2494 Pls
3264 2519 Pls
3267 2519 Pls
3270 2519 Pls
3274 2544 Pls
3277 2544 Pls
3280 2544 Pls
3283 2570 Pls
3286 2570 Pls
3289 2570 Pls
3292 2595 Pls
3295 2595 Pls
3298 2621 Pls
3301 2621 Pls
3304 2621 Pls
3307 2646 Pls
3310 2646 Pls
3313 2672 Pls
3316 2672 Pls
3319 2672 Pls
3322 2697 Pls
3325 2697 Pls
3328 2697 Pls
3331 2723 Pls
3335 2723 Pls
3338 2748 Pls
3341 2748 Pls
3344 2748 Pls
3347 2773 Pls
3350 2773 Pls
3353 2799 Pls
3356 2799 Pls
3359 2799 Pls
3362 2824 Pls
3365 2824 Pls
3368 2824 Pls
3371 2850 Pls
3374 2850 Pls
3377 2875 Pls
3380 2901 Pls
3383 2901 Pls
3386 2901 Pls
3389 2926 Pls
3393 2926 Pls
3396 2926 Pls
3399 2926 Pls
3402 2952 Pls
3405 2952 Pls
3408 2952 Pls
3411 2952 Pls
3414 2977 Pls
3417 2977 Pls
3420 2977 Pls
3423 2977 Pls
3426 2977 Pls
3429 2977 Pls
3432 3002 Pls
3435 3002 Pls
3438 3002 Pls
3441 3002 Pls
3444 3002 Pls
3447 3002 Pls
3450 3002 Pls
3454 3002 Pls
3457 3002 Pls
3460 3028 Pls
3463 3028 Pls
3466 3028 Pls
3469 3028 Pls
3472 3028 Pls
3475 3028 Pls
3478 3028 Pls
3481 3028 Pls
3484 3028 Pls
3487 3028 Pls
3490 3028 Pls
3493 3028 Pls
3496 3028 Pls
3499 3028 Pls
3502 3028 Pls
3505 3028 Pls
3508 3002 Pls
3511 3002 Pls
3515 3002 Pls
3518 3002 Pls
3521 3002 Pls
3524 3002 Pls
3527 2977 Pls
3530 2977 Pls
3533 2977 Pls
3536 2977 Pls
3539 2977 Pls
3542 2952 Pls
3545 2952 Pls
3548 2952 Pls
3551 2952 Pls
3554 2926 Pls
3557 2926 Pls
3560 2926 Pls
3563 2926 Pls
3566 2901 Pls
3569 2901 Pls
3572 2875 Pls
3576 2875 Pls
3579 2850 Pls
3582 2850 Pls
3585 2850 Pls
3588 2824 Pls
3591 2824 Pls
3594 2824 Pls
3597 2824 Pls
3600 2799 Pls
3603 2799 Pls
3606 2799 Pls
3609 2773 Pls
3612 2773 Pls
3615 2773 Pls
3618 2748 Pls
3621 2748 Pls
3624 2748 Pls
3627 2723 Pls
3630 2723 Pls
3634 2723 Pls
3637 2723 Pls
3640 2697 Pls
3643 2697 Pls
3646 2697 Pls
3649 2672 Pls
3652 2672 Pls
3655 2672 Pls
3658 2646 Pls
3661 2646 Pls
3664 2646 Pls
3667 2646 Pls
3670 2621 Pls
3673 2621 Pls
3676 2621 Pls
3679 2621 Pls
3682 2595 Pls
3685 2595 Pls
3688 2595 Pls
3691 2595 Pls
3695 2595 Pls
3698 2570 Pls
3701 2570 Pls
3704 2570 Pls
3707 2570 Pls
3710 2570 Pls
3713 2544 Pls
3716 2544 Pls
3719 2544 Pls
3722 2544 Pls
3725 2544 Pls
3728 2544 Pls
3731 2544 Pls
3734 2519 Pls
3737 2519 Pls
3740 2519 Pls
3743 2519 Pls
3746 2519 Pls
3749 2519 Pls
3752 2519 Pls
3756 2519 Pls
3759 2519 Pls
3762 2519 Pls
3765 2519 Pls
3768 2519 Pls
3771 2519 Pls
3774 2519 Pls
3777 2519 Pls
3780 2519 Pls
3783 2519 Pls
3786 2519 Pls
3789 2519 Pls
3792 2544 Pls
3795 2544 Pls
3798 2544 Pls
3801 2544 Pls
3804 2544 Pls
3807 2544 Pls
3810 2544 Pls
3813 2544 Pls
3817 2544 Pls
3820 2544 Pls
3823 2570 Pls
3826 2570 Pls
3829 2570 Pls
3832 2570 Pls
3835 2570 Pls
3838 2570 Pls
3841 2595 Pls
3844 2595 Pls
3847 2595 Pls
3850 2595 Pls
3853 2595 Pls
3856 2595 Pls
3859 2621 Pls
3862 2621 Pls
3865 2621 Pls
3868 2621 Pls
3871 2646 Pls
3875 2646 Pls
3878 2646 Pls
3881 2646 Pls
3884 2646 Pls
3887 2672 Pls
3890 2672 Pls
3893 2672 Pls
3896 2672 Pls
3899 2697 Pls
3902 2697 Pls
3905 2697 Pls
3908 2697 Pls
3911 2723 Pls
3914 2723 Pls
3917 2723 Pls
3920 2723 Pls
3923 2748 Pls
3926 2748 Pls
3929 2748 Pls
3932 2748 Pls
3936 2748 Pls
3939 2773 Pls
3942 2773 Pls
3945 2773 Pls
3948 2773 Pls
3951 2799 Pls
3954 2799 Pls
3957 2799 Pls
3960 2799 Pls
3963 2799 Pls
3966 2824 Pls
3969 2824 Pls
3972 2824 Pls
3975 2824 Pls
3978 2824 Pls
3981 2850 Pls
3984 2850 Pls
3987 2850 Pls
3990 2850 Pls
3993 2850 Pls
3997 2875 Pls
4000 2875 Pls
4003 2875 Pls
4006 2875 Pls
4009 2875 Pls
4012 2875 Pls
4015 2875 Pls
4018 2875 Pls
4021 2901 Pls
4024 2901 Pls
4027 2901 Pls
4030 2901 Pls
4033 2901 Pls
4036 2901 Pls
4039 2901 Pls
4042 2901 Pls
4045 2901 Pls
4048 2901 Pls
4051 2901 Pls
4054 2901 Pls
4058 2901 Pls
4061 2901 Pls
4064 2901 Pls
4067 2901 Pls
4070 2901 Pls
4073 2901 Pls
4076 2901 Pls
4079 2901 Pls
4082 2901 Pls
4085 2901 Pls
4088 2901 Pls
4091 2901 Pls
4094 2901 Pls
4097 2901 Pls
4100 2901 Pls
4103 2875 Pls
4106 2875 Pls
4109 2875 Pls
4112 2875 Pls
4115 2875 Pls
4119 2875 Pls
4122 2875 Pls
4125 2875 Pls
4128 2875 Pls
4131 2875 Pls
4134 2850 Pls
4137 2850 Pls
4140 2850 Pls
4143 2850 Pls
4146 2850 Pls
4149 2850 Pls
4152 2850 Pls
4155 2824 Pls
4158 2824 Pls
4161 2824 Pls
4164 2824 Pls
4167 2824 Pls
4170 2824 Pls
4173 2799 Pls
4176 2799 Pls
4180 2799 Pls
4183 2799 Pls
4186 2799 Pls
4189 2799 Pls
4192 2773 Pls
4195 2773 Pls
4198 2773 Pls
4201 2773 Pls
4204 2773 Pls
4207 2748 Pls
4210 2748 Pls
4213 2748 Pls
4216 2748 Pls
4219 2748 Pls
4222 2723 Pls
4225 2723 Pls
4228 2723 Pls
4231 2723 Pls
4234 2723 Pls
4238 2723 Pls
4241 2697 Pls
4244 2697 Pls
4247 2697 Pls
4250 2697 Pls
4253 2697 Pls
4256 2672 Pls
4259 2672 Pls
4262 2672 Pls
4265 2672 Pls
4268 2672 Pls
4271 2672 Pls
4274 2672 Pls
4277 2646 Pls
4280 2646 Pls
4283 2646 Pls
4286 2646 Pls
4289 2646 Pls
4292 2646 Pls
4295 2646 Pls
4299 2621 Pls
4302 2621 Pls
4305 2621 Pls
4308 2621 Pls
4311 2621 Pls
4314 2621 Pls
4317 2621 Pls
4320 2621 Pls
4323 2621 Pls
4326 2621 Pls
4329 2621 Pls
4332 2595 Pls
4335 2595 Pls
4338 2595 Pls
4341 2595 Pls
4344 2595 Pls
4347 2595 Pls
4350 2595 Pls
4353 2595 Pls
4356 2595 Pls
4360 2595 Pls
4363 2595 Pls
4366 2595 Pls
4369 2595 Pls
4372 2595 Pls
4375 2595 Pls
4378 2595 Pls
4381 2595 Pls
4384 2595 Pls
4387 2595 Pls
4390 2595 Pls
4393 2595 Pls
4396 2595 Pls
4399 2595 Pls
4402 2595 Pls
4405 2595 Pls
4408 2595 Pls
4411 2595 Pls
4414 2595 Pls
4417 2595 Pls
4421 2595 Pls
4424 2621 Pls
4427 2621 Pls
4430 2621 Pls
4433 2621 Pls
4436 2621 Pls
4439 2621 Pls
4442 2621 Pls
4445 2621 Pls
4448 2621 Pls
4451 2646 Pls
4454 2646 Pls
4457 2646 Pls
4460 2646 Pls
4463 2646 Pls
4466 2646 Pls
4469 2646 Pls
4472 2646 Pls
4475 2672 Pls
4478 2672 Pls
4482 2672 Pls
4485 2672 Pls
4488 2672 Pls
4491 2672 Pls
4494 2672 Pls
4497 2697 Pls
4500 2697 Pls
4503 2697 Pls
4506 2697 Pls
4509 2697 Pls
4512 2697 Pls
4515 2697 Pls
4518 2723 Pls
4521 2723 Pls
4524 2723 Pls
4527 2723 Pls
4530 2723 Pls
4533 2723 Pls
4536 2723 Pls
4540 2748 Pls
4543 2748 Pls
4546 2748 Pls
4549 2748 Pls
4552 2748 Pls
4555 2748 Pls
4558 2748 Pls
4561 2773 Pls
4564 2773 Pls
4567 2773 Pls
4570 2773 Pls
4573 2773 Pls
4576 2773 Pls
4579 2773 Pls
4582 2773 Pls
4585 2773 Pls
4588 2799 Pls
4591 2799 Pls
4594 2799 Pls
4597 2799 Pls
4601 2799 Pls
4604 2799 Pls
4607 2799 Pls
4610 2799 Pls
4613 2799 Pls
4616 2799 Pls
4619 2799 Pls
4622 2799 Pls
4625 2799 Pls
4628 2824 Pls
4631 2824 Pls
4634 2824 Pls
4637 2824 Pls
4640 2824 Pls
4643 2824 Pls
4646 2824 Pls
4649 2824 Pls
4652 2824 Pls
4655 2824 Pls
4658 2824 Pls
4662 2824 Pls
4665 2824 Pls
4668 2824 Pls
4671 2824 Pls
4674 2824 Pls
4677 2824 Pls
4680 2824 Pls
4683 2824 Pls
4686 2824 Pls
4689 2824 Pls
4692 2824 Pls
4695 2824 Pls
4698 2824 Pls
4701 2824 Pls
4704 2824 Pls
4707 2824 Pls
4710 2824 Pls
4713 2824 Pls
4716 2824 Pls
4719 2824 Pls
4723 2824 Pls
4726 2824 Pls
4729 2799 Pls
4732 2799 Pls
4735 2799 Pls
4738 2799 Pls
4741 2799 Pls
4744 2799 Pls
4747 2799 Pls
4750 2799 Pls
4753 2799 Pls
4756 2799 Pls
4759 2799 Pls
4762 2773 Pls
4765 2773 Pls
4768 2773 Pls
4771 2773 Pls
4774 2773 Pls
4777 2773 Pls
4780 2773 Pls
4784 2773 Pls
4787 2773 Pls
4790 2748 Pls
4793 2748 Pls
4796 2748 Pls
4799 2748 Pls
4802 2748 Pls
4805 2748 Pls
4808 2748 Pls
4811 2748 Pls
4814 2723 Pls
4817 2723 Pls
4820 2723 Pls
4823 2723 Pls
4826 2723 Pls
4829 2723 Pls
4832 2723 Pls
4835 2723 Pls
4838 2723 Pls
4842 2723 Pls
4845 2697 Pls
4848 2697 Pls
4851 2697 Pls
4854 2697 Pls
4857 2697 Pls
4860 2697 Pls
4863 2697 Pls
4866 2697 Pls
4869 2697 Pls
4872 2697 Pls
4875 2672 Pls
4878 2672 Pls
4881 2672 Pls
4884 2672 Pls
4887 2672 Pls
4890 2672 Pls
4893 2672 Pls
4896 2672 Pls
4899 2672 Pls
4903 2672 Pls
4906 2672 Pls
4909 2672 Pls
4912 2672 Pls
4915 2672 Pls
4918 2672 Pls
4921 2646 Pls
4924 2646 Pls
4927 2646 Pls
4930 2646 Pls
4933 2646 Pls
4936 2646 Pls
4939 2646 Pls
4942 2646 Pls
4945 2646 Pls
4948 2646 Pls
4951 2646 Pls
4954 2646 Pls
4957 2646 Pls
4960 2646 Pls
4964 2646 Pls
4967 2646 Pls
4970 2646 Pls
4973 2646 Pls
4976 2646 Pls
4979 2646 Pls
4982 2646 Pls
4985 2646 Pls
4988 2646 Pls
4991 2646 Pls
4994 2646 Pls
4997 2646 Pls
5000 2646 Pls
5003 2646 Pls
5006 2646 Pls
5009 2646 Pls
5012 2646 Pls
5015 2646 Pls
5018 2646 Pls
5021 2646 Pls
5025 2646 Pls
5028 2646 Pls
5031 2646 Pls
5034 2646 Pls
5037 2646 Pls
5040 2646 Pls
5043 2646 Pls
5046 2646 Pls
5049 2646 Pls
5052 2646 Pls
5055 2646 Pls
5058 2646 Pls
5061 2646 Pls
5064 2646 Pls
5067 2646 Pls
5070 2646 Pls
5073 2672 Pls
5076 2672 Pls
5079 2672 Pls
5083 2672 Pls
5086 2672 Pls
5089 2672 Pls
5092 2672 Pls
5095 2672 Pls
5098 2672 Pls
5101 2672 Pls
5104 2672 Pls
5107 2697 Pls
5110 2697 Pls
5113 2697 Pls
5116 2697 Pls
5119 2697 Pls
5122 2697 Pls
5125 2697 Pls
5128 2697 Pls
5131 2697 Pls
5134 2697 Pls
5137 2697 Pls
5140 2723 Pls
5144 2723 Pls
5147 2723 Pls
5150 2723 Pls
5153 2723 Pls
5156 2723 Pls
5159 2723 Pls
5162 2723 Pls
5165 2723 Pls
5168 2723 Pls
5171 2723 Pls
5174 2723 Pls
5177 2723 Pls
5180 2723 Pls
5183 2748 Pls
5186 2748 Pls
5189 2748 Pls
5192 2748 Pls
5195 2748 Pls
5198 2748 Pls
5201 2748 Pls
5205 2748 Pls
5208 2748 Pls
5211 2748 Pls
5214 2748 Pls
5217 2748 Pls
5220 2748 Pls
5223 2748 Pls
5226 2748 Pls
5229 2748 Pls
5232 2748 Pls
5235 2748 Pls
5238 2748 Pls
5241 2748 Pls
5244 2748 Pls
5247 2748 Pls
5250 2748 Pls
5253 2748 Pls
5256 2748 Pls
5259 2748 Pls
5262 2748 Pls
5266 2748 Pls
5269 2748 Pls
5272 2748 Pls
5275 2748 Pls
5278 2748 Pls
5281 2748 Pls
5284 2748 Pls
5287 2748 Pls
5290 2748 Pls
5293 2748 Pls
5296 2748 Pls
5299 2748 Pls
5302 2748 Pls
5305 2748 Pls
5308 2748 Pls
5311 2748 Pls
5314 2748 Pls
5317 2748 Pls
5320 2748 Pls
5323 2748 Pls
5327 2748 Pls
5330 2748 Pls
5333 2748 Pls
5336 2748 Pls
5339 2748 Pls
5342 2748 Pls
5345 2748 Pls
5348 2748 Pls
5351 2748 Pls
5354 2748 Pls
5357 2748 Pls
5360 2723 Pls
5363 2723 Pls
5366 2723 Pls
5369 2723 Pls
5372 2723 Pls
5375 2723 Pls
5378 2723 Pls
5381 2723 Pls
5385 2723 Pls
5388 2723 Pls
5391 2723 Pls
5394 2723 Pls
5397 2723 Pls
5400 2723 Pls
5403 2723 Pls
5406 2697 Pls
5409 2697 Pls
5412 2697 Pls
5415 2697 Pls
5418 2697 Pls
5421 2697 Pls
5424 2697 Pls
5427 2697 Pls
5430 2697 Pls
5433 2697 Pls
5436 2697 Pls
5439 2697 Pls
5442 2697 Pls
5446 2697 Pls
5449 2697 Pls
5452 2672 Pls
5455 2672 Pls
5458 2672 Pls
5461 2672 Pls
5464 2672 Pls
5467 2672 Pls
5470 2672 Pls
5473 2672 Pls
5476 2672 Pls
5479 2672 Pls
5482 2672 Pls
5485 2672 Pls
5488 2672 Pls
5491 2672 Pls
5494 2672 Pls
5497 2672 Pls
5500 2672 Pls
5503 2672 Pls
5507 2672 Pls
5510 2672 Pls
5513 2672 Pls
5516 2672 Pls
5519 2672 Pls
5522 2672 Pls
5525 2672 Pls
5528 2672 Pls
5531 2672 Pls
5534 2646 Pls
5537 2646 Pls
5540 2646 Pls
5543 2646 Pls
5546 2646 Pls
5549 2646 Pls
5552 2646 Pls
5555 2646 Pls
5558 2646 Pls
5561 2646 Pls
5564 2646 Pls
5568 2646 Pls
5571 2646 Pls
5574 2646 Pls
5577 2646 Pls
5580 2646 Pls
5583 2646 Pls
5586 2646 Pls
5589 2646 Pls
5592 2646 Pls
5595 2646 Pls
5598 2646 Pls
5601 2646 Pls
5604 2646 Pls
5607 2646 Pls
5610 2646 Pls
5613 2646 Pls
5616 2646 Pls
5619 2646 Pls
5622 2646 Pls
5625 2646 Pls
5629 2672 Pls
5632 2672 Pls
5635 2672 Pls
5638 2672 Pls
5641 2672 Pls
5644 2672 Pls
5647 2672 Pls
5650 2672 Pls
5653 2672 Pls
5656 2672 Pls
5659 2672 Pls
5662 2672 Pls
5665 2672 Pls
5668 2672 Pls
5671 2672 Pls
5674 2672 Pls
5677 2672 Pls
5680 2672 Pls
5683 2672 Pls
5686 2672 Pls
5690 2697 Pls
5693 2697 Pls
5696 2697 Pls
5699 2697 Pls
5702 2697 Pls
5705 2697 Pls
5708 2697 Pls
5711 2697 Pls
5714 2697 Pls
5717 2697 Pls
5720 2697 Pls
5723 2697 Pls
5726 2697 Pls
5729 2697 Pls
5732 2697 Pls
5735 2697 Pls
5738 2697 Pls
5741 2697 Pls
5744 2697 Pls
5748 2697 Pls
5751 2723 Pls
5754 2723 Pls
5757 2723 Pls
5760 2723 Pls
5763 2723 Pls
5766 2723 Pls
5769 2723 Pls
5772 2723 Pls
5775 2723 Pls
5778 2723 Pls
5781 2723 Pls
5784 2723 Pls
5787 2723 Pls
5790 2723 Pls
5793 2723 Pls
5796 2723 Pls
5799 2723 Pls
5802 2723 Pls
5805 2723 Pls
5809 2723 Pls
5812 2723 Pls
5815 2723 Pls
5818 2723 Pls
5821 2723 Pls
5824 2723 Pls
5827 2723 Pls
5830 2723 Pls
5833 2723 Pls
5836 2723 Pls
5839 2723 Pls
5842 2723 Pls
5845 2723 Pls
5848 2723 Pls
5851 2723 Pls
5854 2723 Pls
5857 2723 Pls
5860 2723 Pls
5863 2723 Pls
5866 2723 Pls
5870 2723 Pls
5873 2723 Pls
5876 2723 Pls
5879 2723 Pls
5882 2723 Pls
5885 2723 Pls
5888 2723 Pls
5891 2723 Pls
5894 2723 Pls
5897 2723 Pls
5900 2723 Pls
5903 2723 Pls
5906 2723 Pls
5909 2723 Pls
5912 2723 Pls
5915 2723 Pls
5918 2723 Pls
5921 2723 Pls
5924 2723 Pls
5927 2723 Pls
5931 2723 Pls
5934 2723 Pls
5937 2723 Pls
5940 2723 Pls
5943 2723 Pls
5946 2723 Pls
5949 2723 Pls
5952 2723 Pls
5955 2723 Pls
5958 2723 Pls
5961 2723 Pls
5964 2723 Pls
5967 2723 Pls
5970 2723 Pls
5973 2723 Pls
5976 2723 Pls
5979 2723 Pls
5982 2723 Pls
5985 2723 Pls
5989 2723 Pls
5992 2697 Pls
5995 2697 Pls
5998 2697 Pls
6001 2697 Pls
6004 2697 Pls
6007 2697 Pls
6010 2697 Pls
6013 2697 Pls
6016 2697 Pls
6019 2697 Pls
6022 2697 Pls
6025 2697 Pls
6028 2697 Pls
6031 2697 Pls
6034 2697 Pls
6037 2697 Pls
6040 2697 Pls
6043 2697 Pls
6046 2697 Pls
6050 2697 Pls
6053 2697 Pls
6056 2697 Pls
6059 2697 Pls
6062 2697 Pls
6065 2697 Pls
6068 2697 Pls
6071 2697 Pls
6074 2697 Pls
6077 2672 Pls
6080 2672 Pls
6083 2672 Pls
6086 2672 Pls
6089 2672 Pls
6092 2672 Pls
6095 2672 Pls
6098 2672 Pls
6101 2672 Pls
6104 2672 Pls
6107 2672 Pls
6111 2672 Pls
6114 2672 Pls
6117 2672 Pls
6120 2672 Pls
6123 2672 Pls
6126 2672 Pls
6129 2672 Pls
6132 2672 Pls
6135 2672 Pls
6138 2672 Pls
6141 2672 Pls
6144 2672 Pls
6147 2672 Pls
6150 2672 Pls
6153 2672 Pls
6156 2672 Pls
6159 2672 Pls
6162 2672 Pls
6165 2672 Pls
6168 2672 Pls
6172 2672 Pls
6175 2672 Pls
6178 2672 Pls
6181 2672 Pls
6184 2672 Pls
6187 2672 Pls
6190 2672 Pls
6193 2672 Pls
6196 2672 Pls
6199 2672 Pls
6202 2672 Pls
6205 2672 Pls
6208 2672 Pls
6211 2672 Pls
6214 2672 Pls
6217 2672 Pls
6220 2672 Pls
6223 2672 Pls
6226 2672 Pls
6230 2672 Pls
6233 2672 Pls
6236 2672 Pls
6239 2672 Pls
6242 2672 Pls
6245 2672 Pls
6248 2672 Pls
6251 2672 Pls
6254 2672 Pls
6257 2672 Pls
6260 2672 Pls
6263 2672 Pls
6266 2697 Pls
6269 2697 Pls
6272 2697 Pls
6275 2697 Pls
6278 2697 Pls
6281 2697 Pls
6284 2697 Pls
6287 2697 Pls
6291 2697 Pls
6294 2697 Pls
6297 2697 Pls
6300 2697 Pls
6303 2697 Pls
6306 2697 Pls
6309 2697 Pls
6312 2697 Pls
6315 2697 Pls
6318 2697 Pls
6321 2697 Pls
6324 2697 Pls
6327 2697 Pls
6330 2697 Pls
6333 2697 Pls
6336 2697 Pls
6339 2697 Pls
6342 2697 Pls
6345 2697 Pls
6348 2697 Pls
6352 2697 Pls
6355 2697 Pls
6358 2697 Pls
6361 2697 Pls
6364 2697 Pls
6367 2697 Pls
6370 2697 Pls
6373 2697 Pls
6376 2697 Pls
6379 2697 Pls
6382 2697 Pls
6385 2697 Pls
6388 2697 Pls
6391 2697 Pls
6394 2697 Pls
6397 2697 Pls
6400 2697 Pls
6403 2697 Pls
6406 2697 Pls
6409 2697 Pls
6413 2697 Pls
6416 2697 Pls
6419 2697 Pls
6422 2697 Pls
6425 2697 Pls
6428 2697 Pls
6431 2697 Pls
6434 2697 Pls
6437 2697 Pls
6440 2697 Pls
6443 2697 Pls
6446 2697 Pls
6449 2697 Pls
6452 2697 Pls
6455 2697 Pls
6458 2697 Pls
6461 2697 Pls
6464 2697 Pls
6467 2697 Pls
6470 2697 Pls
6474 2697 Pls
6477 2697 Pls
6480 2697 Pls
6483 2697 Pls
6486 2697 Pls
6489 2697 Pls
6492 2697 Pls
6495 2697 Pls
6498 2697 Pls
6501 2697 Pls
6504 2697 Pls
6507 2697 Pls
6510 2697 Pls
6513 2697 Pls
6516 2697 Pls
6519 2697 Pls
6522 2697 Pls
6525 2697 Pls
6528 2697 Pls
6532 2697 Pls
6535 2697 Pls
6538 2697 Pls
6541 2697 Pls
6544 2697 Pls
6547 2697 Pls
6550 2697 Pls
6553 2697 Pls
6556 2697 Pls
6559 2697 Pls
6562 2697 Pls
6565 2697 Pls
6568 2697 Pls
6571 2697 Pls
6574 2697 Pls
6577 2697 Pls
6580 2697 Pls
6583 2697 Pls
6586 2697 Pls
6589 2697 Pls
6592 2697 Pls
6596 2697 Pls
6599 2697 Pls
6602 2697 Pls
6605 2697 Pls
6608 2697 Pls
6611 2697 Pls
6614 2697 Pls
6617 2697 Pls
6620 2697 Pls
6623 2697 Pls
6626 2697 Pls
6629 2697 Pls
6632 2697 Pls
6635 2697 Pls
6638 2697 Pls
6641 2697 Pls
6644 2697 Pls
6647 2697 Pls
6650 2697 Pls
6654 2697 Pls
6657 2697 Pls
6660 2697 Pls
6663 2697 Pls
6666 2697 Pls
6669 2697 Pls
6672 2697 Pls
6675 2697 Pls
6678 2697 Pls
6681 2697 Pls
6684 2697 Pls
6687 2697 Pls
6690 2697 Pls
6693 2697 Pls
6696 2697 Pls
6699 2697 Pls
6702 2697 Pls
6705 2697 Pls
6708 2697 Pls
6711 2697 Pls
6715 2697 Pls
6718 2697 Pls
6721 2697 Pls
6724 2697 Pls
6727 2697 Pls
6730 2697 Pls
6733 2697 Pls
6736 2697 Pls
6739 2697 Pls
6742 2697 Pls
6745 2697 Pls
6748 2697 Pls
6751 2697 Pls
6754 2697 Pls
6757 2697 Pls
6760 2697 Pls
6763 2697 Pls
6766 2697 Pls
6769 2697 Pls
6769 2697 Pls
6769 2697 Pls
2825 877 Pls
1.000 UL
LTb
LCb setrgbcolor
946 4775 N
946 704 L
5857 0 V
0 4071 V
-5857 0 V
Z stroke
1.000 UP
1.000 UL
LTb
stroke
grestore
end
showpage
%%Trailer
