%!PS-Adobe-2.0
%%Title: pd8_f0.eps
%%Creator: gnuplot 4.6 patchlevel 1
%%CreationDate: Sun Nov 30 18:08:05 2014
%%DocumentFonts: (atend)
%%BoundingBox: 50 50 554 770
%%Orientation: Landscape
%%Pages: (atend)
%%EndComments
%%BeginProlog
/gnudict 256 dict def
gnudict begin
%
% The following true/false flags may be edited by hand if desired.
% The unit line width and grayscale image gamma correction may also be changed.
%
/Color true def
/Blacktext false def
/Solid false def
/Dashlength 1 def
/Landscape true def
/Level1 false def
/Rounded false def
/ClipToBoundingBox false def
/SuppressPDFMark false def
/TransparentPatterns false def
/gnulinewidth 5.000 def
/userlinewidth gnulinewidth def
/Gamma 1.0 def
/BackgroundColor {-1.000 -1.000 -1.000} def
%
/vshift -70 def
/dl1 {
  10.0 Dashlength mul mul
  Rounded { currentlinewidth 0.75 mul sub dup 0 le { pop 0.01 } if } if
} def
/dl2 {
  10.0 Dashlength mul mul
  Rounded { currentlinewidth 0.75 mul add } if
} def
/hpt_ 31.5 def
/vpt_ 31.5 def
/hpt hpt_ def
/vpt vpt_ def
/doclip {
  ClipToBoundingBox {
    newpath 50 50 moveto 554 50 lineto 554 770 lineto 50 770 lineto closepath
    clip
  } if
} def
%
% Gnuplot Prolog Version 4.6 (September 2012)
%
%/SuppressPDFMark true def
%
/M {moveto} bind def
/L {lineto} bind def
/R {rmoveto} bind def
/V {rlineto} bind def
/N {newpath moveto} bind def
/Z {closepath} bind def
/C {setrgbcolor} bind def
/f {rlineto fill} bind def
/g {setgray} bind def
/Gshow {show} def   % May be redefined later in the file to support UTF-8
/vpt2 vpt 2 mul def
/hpt2 hpt 2 mul def
/Lshow {currentpoint stroke M 0 vshift R 
	Blacktext {gsave 0 setgray show grestore} {show} ifelse} def
/Rshow {currentpoint stroke M dup stringwidth pop neg vshift R
	Blacktext {gsave 0 setgray show grestore} {show} ifelse} def
/Cshow {currentpoint stroke M dup stringwidth pop -2 div vshift R 
	Blacktext {gsave 0 setgray show grestore} {show} ifelse} def
/UP {dup vpt_ mul /vpt exch def hpt_ mul /hpt exch def
  /hpt2 hpt 2 mul def /vpt2 vpt 2 mul def} def
/DL {Color {setrgbcolor Solid {pop []} if 0 setdash}
 {pop pop pop 0 setgray Solid {pop []} if 0 setdash} ifelse} def
/BL {stroke userlinewidth 2 mul setlinewidth
	Rounded {1 setlinejoin 1 setlinecap} if} def
/AL {stroke userlinewidth 2 div setlinewidth
	Rounded {1 setlinejoin 1 setlinecap} if} def
/UL {dup gnulinewidth mul /userlinewidth exch def
	dup 1 lt {pop 1} if 10 mul /udl exch def} def
/PL {stroke userlinewidth setlinewidth
	Rounded {1 setlinejoin 1 setlinecap} if} def
3.8 setmiterlimit
% Default Line colors
/LCw {1 1 1} def
/LCb {0 0 0} def
/LCa {0 0 0} def
/LC0 {1 0 0} def
/LC1 {0 1 0} def
/LC2 {0 0 1} def
/LC3 {1 0 1} def
/LC4 {0 1 1} def
/LC5 {1 1 0} def
/LC6 {0 0 0} def
/LC7 {1 0.3 0} def
/LC8 {0.5 0.5 0.5} def
% Default Line Types
/LTw {PL [] 1 setgray} def
/LTb {BL [] LCb DL} def
/LTa {AL [1 udl mul 2 udl mul] 0 setdash LCa setrgbcolor} def
/LT0 {PL [] LC0 DL} def
/LT1 {PL [4 dl1 2 dl2] LC1 DL} def
/LT2 {PL [2 dl1 3 dl2] LC2 DL} def
/LT3 {PL [1 dl1 1.5 dl2] LC3 DL} def
/LT4 {PL [6 dl1 2 dl2 1 dl1 2 dl2] LC4 DL} def
/LT5 {PL [3 dl1 3 dl2 1 dl1 3 dl2] LC5 DL} def
/LT6 {PL [2 dl1 2 dl2 2 dl1 6 dl2] LC6 DL} def
/LT7 {PL [1 dl1 2 dl2 6 dl1 2 dl2 1 dl1 2 dl2] LC7 DL} def
/LT8 {PL [2 dl1 2 dl2 2 dl1 2 dl2 2 dl1 2 dl2 2 dl1 4 dl2] LC8 DL} def
/Pnt {stroke [] 0 setdash gsave 1 setlinecap M 0 0 V stroke grestore} def
/Dia {stroke [] 0 setdash 2 copy vpt add M
  hpt neg vpt neg V hpt vpt neg V
  hpt vpt V hpt neg vpt V closepath stroke
  Pnt} def
/Pls {stroke [] 0 setdash vpt sub M 0 vpt2 V
  currentpoint stroke M
  hpt neg vpt neg R hpt2 0 V stroke
 } def
/Box {stroke [] 0 setdash 2 copy exch hpt sub exch vpt add M
  0 vpt2 neg V hpt2 0 V 0 vpt2 V
  hpt2 neg 0 V closepath stroke
  Pnt} def
/Crs {stroke [] 0 setdash exch hpt sub exch vpt add M
  hpt2 vpt2 neg V currentpoint stroke M
  hpt2 neg 0 R hpt2 vpt2 V stroke} def
/TriU {stroke [] 0 setdash 2 copy vpt 1.12 mul add M
  hpt neg vpt -1.62 mul V
  hpt 2 mul 0 V
  hpt neg vpt 1.62 mul V closepath stroke
  Pnt} def
/Star {2 copy Pls Crs} def
/BoxF {stroke [] 0 setdash exch hpt sub exch vpt add M
  0 vpt2 neg V hpt2 0 V 0 vpt2 V
  hpt2 neg 0 V closepath fill} def
/TriUF {stroke [] 0 setdash vpt 1.12 mul add M
  hpt neg vpt -1.62 mul V
  hpt 2 mul 0 V
  hpt neg vpt 1.62 mul V closepath fill} def
/TriD {stroke [] 0 setdash 2 copy vpt 1.12 mul sub M
  hpt neg vpt 1.62 mul V
  hpt 2 mul 0 V
  hpt neg vpt -1.62 mul V closepath stroke
  Pnt} def
/TriDF {stroke [] 0 setdash vpt 1.12 mul sub M
  hpt neg vpt 1.62 mul V
  hpt 2 mul 0 V
  hpt neg vpt -1.62 mul V closepath fill} def
/DiaF {stroke [] 0 setdash vpt add M
  hpt neg vpt neg V hpt vpt neg V
  hpt vpt V hpt neg vpt V closepath fill} def
/Pent {stroke [] 0 setdash 2 copy gsave
  translate 0 hpt M 4 {72 rotate 0 hpt L} repeat
  closepath stroke grestore Pnt} def
/PentF {stroke [] 0 setdash gsave
  translate 0 hpt M 4 {72 rotate 0 hpt L} repeat
  closepath fill grestore} def
/Circle {stroke [] 0 setdash 2 copy
  hpt 0 360 arc stroke Pnt} def
/CircleF {stroke [] 0 setdash hpt 0 360 arc fill} def
/C0 {BL [] 0 setdash 2 copy moveto vpt 90 450 arc} bind def
/C1 {BL [] 0 setdash 2 copy moveto
	2 copy vpt 0 90 arc closepath fill
	vpt 0 360 arc closepath} bind def
/C2 {BL [] 0 setdash 2 copy moveto
	2 copy vpt 90 180 arc closepath fill
	vpt 0 360 arc closepath} bind def
/C3 {BL [] 0 setdash 2 copy moveto
	2 copy vpt 0 180 arc closepath fill
	vpt 0 360 arc closepath} bind def
/C4 {BL [] 0 setdash 2 copy moveto
	2 copy vpt 180 270 arc closepath fill
	vpt 0 360 arc closepath} bind def
/C5 {BL [] 0 setdash 2 copy moveto
	2 copy vpt 0 90 arc
	2 copy moveto
	2 copy vpt 180 270 arc closepath fill
	vpt 0 360 arc} bind def
/C6 {BL [] 0 setdash 2 copy moveto
	2 copy vpt 90 270 arc closepath fill
	vpt 0 360 arc closepath} bind def
/C7 {BL [] 0 setdash 2 copy moveto
	2 copy vpt 0 270 arc closepath fill
	vpt 0 360 arc closepath} bind def
/C8 {BL [] 0 setdash 2 copy moveto
	2 copy vpt 270 360 arc closepath fill
	vpt 0 360 arc closepath} bind def
/C9 {BL [] 0 setdash 2 copy moveto
	2 copy vpt 270 450 arc closepath fill
	vpt 0 360 arc closepath} bind def
/C10 {BL [] 0 setdash 2 copy 2 copy moveto vpt 270 360 arc closepath fill
	2 copy moveto
	2 copy vpt 90 180 arc closepath fill
	vpt 0 360 arc closepath} bind def
/C11 {BL [] 0 setdash 2 copy moveto
	2 copy vpt 0 180 arc closepath fill
	2 copy moveto
	2 copy vpt 270 360 arc closepath fill
	vpt 0 360 arc closepath} bind def
/C12 {BL [] 0 setdash 2 copy moveto
	2 copy vpt 180 360 arc closepath fill
	vpt 0 360 arc closepath} bind def
/C13 {BL [] 0 setdash 2 copy moveto
	2 copy vpt 0 90 arc closepath fill
	2 copy moveto
	2 copy vpt 180 360 arc closepath fill
	vpt 0 360 arc closepath} bind def
/C14 {BL [] 0 setdash 2 copy moveto
	2 copy vpt 90 360 arc closepath fill
	vpt 0 360 arc} bind def
/C15 {BL [] 0 setdash 2 copy vpt 0 360 arc closepath fill
	vpt 0 360 arc closepath} bind def
/Rec {newpath 4 2 roll moveto 1 index 0 rlineto 0 exch rlineto
	neg 0 rlineto closepath} bind def
/Square {dup Rec} bind def
/Bsquare {vpt sub exch vpt sub exch vpt2 Square} bind def
/S0 {BL [] 0 setdash 2 copy moveto 0 vpt rlineto BL Bsquare} bind def
/S1 {BL [] 0 setdash 2 copy vpt Square fill Bsquare} bind def
/S2 {BL [] 0 setdash 2 copy exch vpt sub exch vpt Square fill Bsquare} bind def
/S3 {BL [] 0 setdash 2 copy exch vpt sub exch vpt2 vpt Rec fill Bsquare} bind def
/S4 {BL [] 0 setdash 2 copy exch vpt sub exch vpt sub vpt Square fill Bsquare} bind def
/S5 {BL [] 0 setdash 2 copy 2 copy vpt Square fill
	exch vpt sub exch vpt sub vpt Square fill Bsquare} bind def
/S6 {BL [] 0 setdash 2 copy exch vpt sub exch vpt sub vpt vpt2 Rec fill Bsquare} bind def
/S7 {BL [] 0 setdash 2 copy exch vpt sub exch vpt sub vpt vpt2 Rec fill
	2 copy vpt Square fill Bsquare} bind def
/S8 {BL [] 0 setdash 2 copy vpt sub vpt Square fill Bsquare} bind def
/S9 {BL [] 0 setdash 2 copy vpt sub vpt vpt2 Rec fill Bsquare} bind def
/S10 {BL [] 0 setdash 2 copy vpt sub vpt Square fill 2 copy exch vpt sub exch vpt Square fill
	Bsquare} bind def
/S11 {BL [] 0 setdash 2 copy vpt sub vpt Square fill 2 copy exch vpt sub exch vpt2 vpt Rec fill
	Bsquare} bind def
/S12 {BL [] 0 setdash 2 copy exch vpt sub exch vpt sub vpt2 vpt Rec fill Bsquare} bind def
/S13 {BL [] 0 setdash 2 copy exch vpt sub exch vpt sub vpt2 vpt Rec fill
	2 copy vpt Square fill Bsquare} bind def
/S14 {BL [] 0 setdash 2 copy exch vpt sub exch vpt sub vpt2 vpt Rec fill
	2 copy exch vpt sub exch vpt Square fill Bsquare} bind def
/S15 {BL [] 0 setdash 2 copy Bsquare fill Bsquare} bind def
/D0 {gsave translate 45 rotate 0 0 S0 stroke grestore} bind def
/D1 {gsave translate 45 rotate 0 0 S1 stroke grestore} bind def
/D2 {gsave translate 45 rotate 0 0 S2 stroke grestore} bind def
/D3 {gsave translate 45 rotate 0 0 S3 stroke grestore} bind def
/D4 {gsave translate 45 rotate 0 0 S4 stroke grestore} bind def
/D5 {gsave translate 45 rotate 0 0 S5 stroke grestore} bind def
/D6 {gsave translate 45 rotate 0 0 S6 stroke grestore} bind def
/D7 {gsave translate 45 rotate 0 0 S7 stroke grestore} bind def
/D8 {gsave translate 45 rotate 0 0 S8 stroke grestore} bind def
/D9 {gsave translate 45 rotate 0 0 S9 stroke grestore} bind def
/D10 {gsave translate 45 rotate 0 0 S10 stroke grestore} bind def
/D11 {gsave translate 45 rotate 0 0 S11 stroke grestore} bind def
/D12 {gsave translate 45 rotate 0 0 S12 stroke grestore} bind def
/D13 {gsave translate 45 rotate 0 0 S13 stroke grestore} bind def
/D14 {gsave translate 45 rotate 0 0 S14 stroke grestore} bind def
/D15 {gsave translate 45 rotate 0 0 S15 stroke grestore} bind def
/DiaE {stroke [] 0 setdash vpt add M
  hpt neg vpt neg V hpt vpt neg V
  hpt vpt V hpt neg vpt V closepath stroke} def
/BoxE {stroke [] 0 setdash exch hpt sub exch vpt add M
  0 vpt2 neg V hpt2 0 V 0 vpt2 V
  hpt2 neg 0 V closepath stroke} def
/TriUE {stroke [] 0 setdash vpt 1.12 mul add M
  hpt neg vpt -1.62 mul V
  hpt 2 mul 0 V
  hpt neg vpt 1.62 mul V closepath stroke} def
/TriDE {stroke [] 0 setdash vpt 1.12 mul sub M
  hpt neg vpt 1.62 mul V
  hpt 2 mul 0 V
  hpt neg vpt -1.62 mul V closepath stroke} def
/PentE {stroke [] 0 setdash gsave
  translate 0 hpt M 4 {72 rotate 0 hpt L} repeat
  closepath stroke grestore} def
/CircE {stroke [] 0 setdash 
  hpt 0 360 arc stroke} def
/Opaque {gsave closepath 1 setgray fill grestore 0 setgray closepath} def
/DiaW {stroke [] 0 setdash vpt add M
  hpt neg vpt neg V hpt vpt neg V
  hpt vpt V hpt neg vpt V Opaque stroke} def
/BoxW {stroke [] 0 setdash exch hpt sub exch vpt add M
  0 vpt2 neg V hpt2 0 V 0 vpt2 V
  hpt2 neg 0 V Opaque stroke} def
/TriUW {stroke [] 0 setdash vpt 1.12 mul add M
  hpt neg vpt -1.62 mul V
  hpt 2 mul 0 V
  hpt neg vpt 1.62 mul V Opaque stroke} def
/TriDW {stroke [] 0 setdash vpt 1.12 mul sub M
  hpt neg vpt 1.62 mul V
  hpt 2 mul 0 V
  hpt neg vpt -1.62 mul V Opaque stroke} def
/PentW {stroke [] 0 setdash gsave
  translate 0 hpt M 4 {72 rotate 0 hpt L} repeat
  Opaque stroke grestore} def
/CircW {stroke [] 0 setdash 
  hpt 0 360 arc Opaque stroke} def
/BoxFill {gsave Rec 1 setgray fill grestore} def
/Density {
  /Fillden exch def
  currentrgbcolor
  /ColB exch def /ColG exch def /ColR exch def
  /ColR ColR Fillden mul Fillden sub 1 add def
  /ColG ColG Fillden mul Fillden sub 1 add def
  /ColB ColB Fillden mul Fillden sub 1 add def
  ColR ColG ColB setrgbcolor} def
/BoxColFill {gsave Rec PolyFill} def
/PolyFill {gsave Density fill grestore grestore} def
/h {rlineto rlineto rlineto gsave closepath fill grestore} bind def
%
% PostScript Level 1 Pattern Fill routine for rectangles
% Usage: x y w h s a XX PatternFill
%	x,y = lower left corner of box to be filled
%	w,h = width and height of box
%	  a = angle in degrees between lines and x-axis
%	 XX = 0/1 for no/yes cross-hatch
%
/PatternFill {gsave /PFa [ 9 2 roll ] def
  PFa 0 get PFa 2 get 2 div add PFa 1 get PFa 3 get 2 div add translate
  PFa 2 get -2 div PFa 3 get -2 div PFa 2 get PFa 3 get Rec
  TransparentPatterns {} {gsave 1 setgray fill grestore} ifelse
  clip
  currentlinewidth 0.5 mul setlinewidth
  /PFs PFa 2 get dup mul PFa 3 get dup mul add sqrt def
  0 0 M PFa 5 get rotate PFs -2 div dup translate
  0 1 PFs PFa 4 get div 1 add floor cvi
	{PFa 4 get mul 0 M 0 PFs V} for
  0 PFa 6 get ne {
	0 1 PFs PFa 4 get div 1 add floor cvi
	{PFa 4 get mul 0 2 1 roll M PFs 0 V} for
 } if
  stroke grestore} def
%
/languagelevel where
 {pop languagelevel} {1} ifelse
 2 lt
	{/InterpretLevel1 true def}
	{/InterpretLevel1 Level1 def}
 ifelse
%
% PostScript level 2 pattern fill definitions
%
/Level2PatternFill {
/Tile8x8 {/PaintType 2 /PatternType 1 /TilingType 1 /BBox [0 0 8 8] /XStep 8 /YStep 8}
	bind def
/KeepColor {currentrgbcolor [/Pattern /DeviceRGB] setcolorspace} bind def
<< Tile8x8
 /PaintProc {0.5 setlinewidth pop 0 0 M 8 8 L 0 8 M 8 0 L stroke} 
>> matrix makepattern
/Pat1 exch def
<< Tile8x8
 /PaintProc {0.5 setlinewidth pop 0 0 M 8 8 L 0 8 M 8 0 L stroke
	0 4 M 4 8 L 8 4 L 4 0 L 0 4 L stroke}
>> matrix makepattern
/Pat2 exch def
<< Tile8x8
 /PaintProc {0.5 setlinewidth pop 0 0 M 0 8 L
	8 8 L 8 0 L 0 0 L fill}
>> matrix makepattern
/Pat3 exch def
<< Tile8x8
 /PaintProc {0.5 setlinewidth pop -4 8 M 8 -4 L
	0 12 M 12 0 L stroke}
>> matrix makepattern
/Pat4 exch def
<< Tile8x8
 /PaintProc {0.5 setlinewidth pop -4 0 M 8 12 L
	0 -4 M 12 8 L stroke}
>> matrix makepattern
/Pat5 exch def
<< Tile8x8
 /PaintProc {0.5 setlinewidth pop -2 8 M 4 -4 L
	0 12 M 8 -4 L 4 12 M 10 0 L stroke}
>> matrix makepattern
/Pat6 exch def
<< Tile8x8
 /PaintProc {0.5 setlinewidth pop -2 0 M 4 12 L
	0 -4 M 8 12 L 4 -4 M 10 8 L stroke}
>> matrix makepattern
/Pat7 exch def
<< Tile8x8
 /PaintProc {0.5 setlinewidth pop 8 -2 M -4 4 L
	12 0 M -4 8 L 12 4 M 0 10 L stroke}
>> matrix makepattern
/Pat8 exch def
<< Tile8x8
 /PaintProc {0.5 setlinewidth pop 0 -2 M 12 4 L
	-4 0 M 12 8 L -4 4 M 8 10 L stroke}
>> matrix makepattern
/Pat9 exch def
/Pattern1 {PatternBgnd KeepColor Pat1 setpattern} bind def
/Pattern2 {PatternBgnd KeepColor Pat2 setpattern} bind def
/Pattern3 {PatternBgnd KeepColor Pat3 setpattern} bind def
/Pattern4 {PatternBgnd KeepColor Landscape {Pat5} {Pat4} ifelse setpattern} bind def
/Pattern5 {PatternBgnd KeepColor Landscape {Pat4} {Pat5} ifelse setpattern} bind def
/Pattern6 {PatternBgnd KeepColor Landscape {Pat9} {Pat6} ifelse setpattern} bind def
/Pattern7 {PatternBgnd KeepColor Landscape {Pat8} {Pat7} ifelse setpattern} bind def
} def
%
%
%End of PostScript Level 2 code
%
/PatternBgnd {
  TransparentPatterns {} {gsave 1 setgray fill grestore} ifelse
} def
%
% Substitute for Level 2 pattern fill codes with
% grayscale if Level 2 support is not selected.
%
/Level1PatternFill {
/Pattern1 {0.250 Density} bind def
/Pattern2 {0.500 Density} bind def
/Pattern3 {0.750 Density} bind def
/Pattern4 {0.125 Density} bind def
/Pattern5 {0.375 Density} bind def
/Pattern6 {0.625 Density} bind def
/Pattern7 {0.875 Density} bind def
} def
%
% Now test for support of Level 2 code
%
Level1 {Level1PatternFill} {Level2PatternFill} ifelse
%
/Symbol-Oblique /Symbol findfont [1 0 .167 1 0 0] makefont
dup length dict begin {1 index /FID eq {pop pop} {def} ifelse} forall
currentdict end definefont pop
/MFshow {
   { dup 5 get 3 ge
     { 5 get 3 eq {gsave} {grestore} ifelse }
     {dup dup 0 get findfont exch 1 get scalefont setfont
     [ currentpoint ] exch dup 2 get 0 exch R dup 5 get 2 ne {dup dup 6
     get exch 4 get {Gshow} {stringwidth pop 0 R} ifelse }if dup 5 get 0 eq
     {dup 3 get {2 get neg 0 exch R pop} {pop aload pop M} ifelse} {dup 5
     get 1 eq {dup 2 get exch dup 3 get exch 6 get stringwidth pop -2 div
     dup 0 R} {dup 6 get stringwidth pop -2 div 0 R 6 get
     show 2 index {aload pop M neg 3 -1 roll neg R pop pop} {pop pop pop
     pop aload pop M} ifelse }ifelse }ifelse }
     ifelse }
   forall} def
/Gswidth {dup type /stringtype eq {stringwidth} {pop (n) stringwidth} ifelse} def
/MFwidth {0 exch { dup 5 get 3 ge { 5 get 3 eq { 0 } { pop } ifelse }
 {dup 3 get{dup dup 0 get findfont exch 1 get scalefont setfont
     6 get Gswidth pop add} {pop} ifelse} ifelse} forall} def
/MLshow { currentpoint stroke M
  0 exch R
  Blacktext {gsave 0 setgray MFshow grestore} {MFshow} ifelse } bind def
/MRshow { currentpoint stroke M
  exch dup MFwidth neg 3 -1 roll R
  Blacktext {gsave 0 setgray MFshow grestore} {MFshow} ifelse } bind def
/MCshow { currentpoint stroke M
  exch dup MFwidth -2 div 3 -1 roll R
  Blacktext {gsave 0 setgray MFshow grestore} {MFshow} ifelse } bind def
/XYsave    { [( ) 1 2 true false 3 ()] } bind def
/XYrestore { [( ) 1 2 true false 4 ()] } bind def
Level1 SuppressPDFMark or 
{} {
/SDict 10 dict def
systemdict /pdfmark known not {
  userdict /pdfmark systemdict /cleartomark get put
} if
SDict begin [
  /Title (pd8_f0.eps)
  /Subject (gnuplot plot)
  /Creator (gnuplot 4.6 patchlevel 1)
  /Author (kevin.luedemann)
%  /Producer (gnuplot)
%  /Keywords ()
  /CreationDate (Sun Nov 30 18:08:05 2014)
  /DOCINFO pdfmark
end
} ifelse
end
%%EndProlog
%%Page: 1 1
gnudict begin
gsave
doclip
50 50 translate
0.100 0.100 scale
90 rotate
0 -5040 translate
0 setgray
newpath
(Roman) findfont 210 scalefont setfont
BackgroundColor 0 lt 3 1 roll 0 lt exch 0 lt or or not {gsave BackgroundColor C clippath fill grestore} if
1.000 UL
LTb
1.000 UL
LTa
903 672 M
5918 0 V
stroke
LTb
903 672 M
63 0 V
5855 0 R
-63 0 V
stroke
777 672 M
[ [(Roman) 210.0 0.0 true true 0 (-30)]
] -70.0 MRshow
1.000 UL
LTb
1.000 UL
LTa
903 1129 M
5918 0 V
stroke
LTb
903 1129 M
63 0 V
5855 0 R
-63 0 V
stroke
777 1129 M
[ [(Roman) 210.0 0.0 true true 0 (-25)]
] -70.0 MRshow
1.000 UL
LTb
1.000 UL
LTa
903 1586 M
5918 0 V
stroke
LTb
903 1586 M
63 0 V
5855 0 R
-63 0 V
stroke
777 1586 M
[ [(Roman) 210.0 0.0 true true 0 (-20)]
] -70.0 MRshow
1.000 UL
LTb
1.000 UL
LTa
903 2044 M
5918 0 V
stroke
LTb
903 2044 M
63 0 V
5855 0 R
-63 0 V
stroke
777 2044 M
[ [(Roman) 210.0 0.0 true true 0 (-15)]
] -70.0 MRshow
1.000 UL
LTb
1.000 UL
LTa
903 2501 M
5918 0 V
stroke
LTb
903 2501 M
63 0 V
5855 0 R
-63 0 V
stroke
777 2501 M
[ [(Roman) 210.0 0.0 true true 0 (-10)]
] -70.0 MRshow
1.000 UL
LTb
1.000 UL
LTa
903 2958 M
5918 0 V
stroke
LTb
903 2958 M
63 0 V
5855 0 R
-63 0 V
stroke
777 2958 M
[ [(Roman) 210.0 0.0 true true 0 (-5)]
] -70.0 MRshow
1.000 UL
LTb
1.000 UL
LTa
903 3415 M
5918 0 V
stroke
LTb
903 3415 M
63 0 V
5855 0 R
-63 0 V
stroke
777 3415 M
[ [(Roman) 210.0 0.0 true true 0 ( 0)]
] -70.0 MRshow
1.000 UL
LTb
1.000 UL
LTa
903 3873 M
5918 0 V
stroke
LTb
903 3873 M
63 0 V
5855 0 R
-63 0 V
stroke
777 3873 M
[ [(Roman) 210.0 0.0 true true 0 ( 5)]
] -70.0 MRshow
1.000 UL
LTb
1.000 UL
LTa
903 4330 M
5918 0 V
stroke
LTb
903 4330 M
63 0 V
5855 0 R
-63 0 V
stroke
777 4330 M
[ [(Roman) 210.0 0.0 true true 0 ( 10)]
] -70.0 MRshow
1.000 UL
LTb
1.000 UL
LTa
903 4787 M
5918 0 V
stroke
LTb
903 4787 M
63 0 V
5855 0 R
-63 0 V
stroke
777 4787 M
[ [(Roman) 210.0 0.0 true true 0 ( 15)]
] -70.0 MRshow
1.000 UL
LTb
1.000 UL
LTa
903 672 M
0 4115 V
stroke
LTb
903 672 M
0 63 V
0 4052 R
0 -63 V
stroke
903 462 M
[ [(Roman) 210.0 0.0 true true 0 ( 0)]
] -70.0 MCshow
1.000 UL
LTb
1.000 UL
LTa
1495 672 M
0 4115 V
stroke
LTb
1495 672 M
0 63 V
0 4052 R
0 -63 V
stroke
1495 462 M
[ [(Roman) 210.0 0.0 true true 0 ( 1)]
] -70.0 MCshow
1.000 UL
LTb
1.000 UL
LTa
2087 672 M
0 4115 V
stroke
LTb
2087 672 M
0 63 V
0 4052 R
0 -63 V
stroke
2087 462 M
[ [(Roman) 210.0 0.0 true true 0 ( 2)]
] -70.0 MCshow
1.000 UL
LTb
1.000 UL
LTa
2678 672 M
0 4115 V
stroke
LTb
2678 672 M
0 63 V
0 4052 R
0 -63 V
stroke
2678 462 M
[ [(Roman) 210.0 0.0 true true 0 ( 3)]
] -70.0 MCshow
1.000 UL
LTb
1.000 UL
LTa
3270 672 M
0 4115 V
stroke
LTb
3270 672 M
0 63 V
0 4052 R
0 -63 V
stroke
3270 462 M
[ [(Roman) 210.0 0.0 true true 0 ( 4)]
] -70.0 MCshow
1.000 UL
LTb
1.000 UL
LTa
3862 672 M
0 4115 V
stroke
LTb
3862 672 M
0 63 V
0 4052 R
0 -63 V
stroke
3862 462 M
[ [(Roman) 210.0 0.0 true true 0 ( 5)]
] -70.0 MCshow
1.000 UL
LTb
1.000 UL
LTa
4454 672 M
0 3842 V
0 210 R
0 63 V
stroke
LTb
4454 672 M
0 63 V
0 4052 R
0 -63 V
stroke
4454 462 M
[ [(Roman) 210.0 0.0 true true 0 ( 6)]
] -70.0 MCshow
1.000 UL
LTb
1.000 UL
LTa
5046 672 M
0 3842 V
0 210 R
0 63 V
stroke
LTb
5046 672 M
0 63 V
0 4052 R
0 -63 V
stroke
5046 462 M
[ [(Roman) 210.0 0.0 true true 0 ( 7)]
] -70.0 MCshow
1.000 UL
LTb
1.000 UL
LTa
5637 672 M
0 3842 V
0 210 R
0 63 V
stroke
LTb
5637 672 M
0 63 V
0 4052 R
0 -63 V
stroke
5637 462 M
[ [(Roman) 210.0 0.0 true true 0 ( 8)]
] -70.0 MCshow
1.000 UL
LTb
1.000 UL
LTa
6229 672 M
0 3842 V
0 210 R
0 63 V
stroke
LTb
6229 672 M
0 63 V
0 4052 R
0 -63 V
stroke
6229 462 M
[ [(Roman) 210.0 0.0 true true 0 ( 9)]
] -70.0 MCshow
1.000 UL
LTb
1.000 UL
LTa
6821 672 M
0 4115 V
stroke
LTb
6821 672 M
0 63 V
0 4052 R
0 -63 V
stroke
6821 462 M
[ [(Roman) 210.0 0.0 true true 0 ( 10)]
] -70.0 MCshow
1.000 UL
LTb
1.000 UL
LTb
903 4787 N
903 672 L
5918 0 V
0 4115 V
-5918 0 V
Z stroke
LCb setrgbcolor
168 2729 M
currentpoint gsave translate -270 rotate 0 0 moveto
[ [(Roman) 210.0 0.0 true true 0 (Winkel [rad])]
] -70.0 MCshow
grestore
LTb
LCb setrgbcolor
3862 147 M
[ [(Roman) 210.0 0.0 true true 0 (Zeit [s])]
] -70.0 MCshow
LTb
1.000 UP
1.000 UL
LTb
% Begin plot #1
1.000 UP
1.000 UL
LT0
LCb setrgbcolor
5876 4619 M
[ [(Roman) 210.0 0.0 true true 0 (Daempfung 8mm)]
] -70.0 MRshow
LT0
903 3655 Pls
912 3518 Pls
921 3450 Pls
931 3312 Pls
940 3244 Pls
949 3107 Pls
958 3038 Pls
968 2901 Pls
977 2832 Pls
986 2764 Pls
995 2627 Pls
1005 2558 Pls
1014 2489 Pls
1023 2421 Pls
1032 2284 Pls
1042 2215 Pls
1051 2147 Pls
1060 2078 Pls
1069 2009 Pls
1079 1941 Pls
1088 1872 Pls
1097 1804 Pls
1106 1735 Pls
1116 1666 Pls
1125 1598 Pls
1134 1598 Pls
1143 1529 Pls
1153 1461 Pls
1162 1392 Pls
1171 1392 Pls
1180 1324 Pls
1190 1324 Pls
1199 1255 Pls
1208 1255 Pls
1217 1186 Pls
1227 1186 Pls
1236 1118 Pls
1245 1118 Pls
1254 1118 Pls
1264 1118 Pls
1273 1049 Pls
1282 1049 Pls
1291 1049 Pls
1301 1049 Pls
1310 1049 Pls
1319 1049 Pls
1328 1049 Pls
1338 1049 Pls
1347 1049 Pls
1356 1118 Pls
1365 1118 Pls
1375 1118 Pls
1384 1118 Pls
1393 1118 Pls
1402 1186 Pls
1412 1186 Pls
1421 1186 Pls
1430 1255 Pls
1439 1255 Pls
1449 1255 Pls
1458 1324 Pls
1467 1324 Pls
1476 1392 Pls
1486 1392 Pls
1495 1461 Pls
1504 1461 Pls
1513 1529 Pls
1522 1598 Pls
1532 1598 Pls
1541 1666 Pls
1550 1666 Pls
1560 1735 Pls
1569 1804 Pls
1578 1804 Pls
1587 1872 Pls
1596 1941 Pls
1606 2009 Pls
1615 2009 Pls
1624 2078 Pls
1634 2147 Pls
1643 2215 Pls
1652 2215 Pls
1661 2284 Pls
1670 2352 Pls
1680 2421 Pls
1689 2421 Pls
1698 2489 Pls
1707 2558 Pls
1717 2627 Pls
1726 2695 Pls
1735 2695 Pls
1744 2764 Pls
1754 2832 Pls
1763 2901 Pls
1772 2970 Pls
1781 2970 Pls
1791 3038 Pls
1800 3107 Pls
1809 3175 Pls
1818 3175 Pls
1828 3244 Pls
1837 3312 Pls
1846 3381 Pls
1855 3381 Pls
1865 3450 Pls
1874 3518 Pls
1883 3587 Pls
1892 3587 Pls
1902 3655 Pls
1911 3724 Pls
1920 3724 Pls
1929 3793 Pls
1939 3793 Pls
1948 3793 Pls
1957 3861 Pls
1966 3861 Pls
1976 3930 Pls
1985 3930 Pls
1994 3998 Pls
2003 3998 Pls
2013 4067 Pls
2022 4067 Pls
2031 4135 Pls
2040 4135 Pls
2050 4135 Pls
2059 4204 Pls
2068 4204 Pls
2077 4273 Pls
2087 4273 Pls
2096 4273 Pls
2105 4341 Pls
2114 4341 Pls
2124 4341 Pls
2133 4341 Pls
2142 4410 Pls
2151 4410 Pls
2161 4410 Pls
2170 4410 Pls
2179 4410 Pls
2188 4410 Pls
2198 4410 Pls
2207 4478 Pls
2216 4478 Pls
2225 4478 Pls
2235 4478 Pls
2244 4478 Pls
2253 4478 Pls
2262 4478 Pls
2272 4478 Pls
2281 4478 Pls
2290 4478 Pls
2299 4478 Pls
2309 4478 Pls
2318 4478 Pls
2327 4478 Pls
2336 4478 Pls
2346 4478 Pls
2355 4410 Pls
2364 4410 Pls
2373 4410 Pls
2383 4410 Pls
2392 4410 Pls
2401 4341 Pls
2410 4341 Pls
2419 4341 Pls
2429 4341 Pls
2438 4273 Pls
2447 4273 Pls
2456 4273 Pls
2466 4273 Pls
2475 4204 Pls
2484 4204 Pls
2493 4204 Pls
2503 4135 Pls
2512 4135 Pls
2521 4135 Pls
2530 4067 Pls
2540 4067 Pls
2549 4067 Pls
2558 3998 Pls
2567 3998 Pls
2577 3930 Pls
2586 3930 Pls
2595 3930 Pls
2604 3861 Pls
2614 3861 Pls
2623 3861 Pls
2632 3793 Pls
2641 3724 Pls
2651 3724 Pls
2660 3655 Pls
2669 3655 Pls
2678 3587 Pls
2688 3587 Pls
2697 3587 Pls
2706 3518 Pls
2715 3518 Pls
2725 3518 Pls
2734 3450 Pls
2743 3450 Pls
2752 3381 Pls
2762 3381 Pls
2771 3381 Pls
2780 3312 Pls
2789 3312 Pls
2799 3312 Pls
2808 3244 Pls
2817 3244 Pls
2826 3244 Pls
2836 3244 Pls
2845 3175 Pls
2854 3175 Pls
2863 3175 Pls
2873 3107 Pls
2882 3107 Pls
2891 3107 Pls
2900 3107 Pls
2910 3038 Pls
2919 3038 Pls
2928 3038 Pls
2937 3038 Pls
2947 2970 Pls
2956 2970 Pls
2965 2970 Pls
2974 2970 Pls
2984 2970 Pls
2993 2901 Pls
3002 2901 Pls
3011 2901 Pls
3021 2901 Pls
3030 2901 Pls
3039 2901 Pls
3048 2901 Pls
3058 2832 Pls
3067 2832 Pls
3076 2832 Pls
3085 2832 Pls
3094 2832 Pls
3104 2832 Pls
3113 2832 Pls
3122 2832 Pls
3131 2832 Pls
3141 2832 Pls
3150 2832 Pls
3159 2832 Pls
3168 2832 Pls
3178 2832 Pls
3187 2832 Pls
3196 2832 Pls
3205 2832 Pls
3215 2832 Pls
3224 2832 Pls
3233 2832 Pls
3242 2832 Pls
3252 2832 Pls
3261 2901 Pls
3270 2901 Pls
3279 2901 Pls
3289 2901 Pls
3298 2901 Pls
3307 2901 Pls
3316 2901 Pls
3326 2901 Pls
3335 2901 Pls
3344 2901 Pls
3353 2901 Pls
3363 2970 Pls
3372 2970 Pls
3381 2970 Pls
3390 2970 Pls
3400 2970 Pls
3409 2970 Pls
3418 2970 Pls
3427 3038 Pls
3437 3038 Pls
3446 3038 Pls
3455 3038 Pls
3464 3038 Pls
3474 3038 Pls
3483 3107 Pls
3492 3107 Pls
3501 3107 Pls
3511 3107 Pls
3520 3107 Pls
3529 3107 Pls
3538 3175 Pls
3548 3175 Pls
3557 3175 Pls
3566 3175 Pls
3575 3175 Pls
3585 3175 Pls
3594 3244 Pls
3603 3244 Pls
3612 3244 Pls
3622 3244 Pls
3631 3244 Pls
3640 3244 Pls
3649 3312 Pls
3659 3312 Pls
3668 3312 Pls
3677 3312 Pls
3686 3312 Pls
3696 3312 Pls
3705 3381 Pls
3714 3381 Pls
3723 3381 Pls
3733 3381 Pls
3742 3381 Pls
3751 3381 Pls
3760 3450 Pls
3770 3450 Pls
3779 3450 Pls
3788 3450 Pls
3797 3450 Pls
3806 3450 Pls
3816 3450 Pls
3825 3450 Pls
3834 3518 Pls
3843 3518 Pls
3853 3518 Pls
3862 3518 Pls
3871 3518 Pls
3880 3518 Pls
3890 3518 Pls
3899 3518 Pls
3908 3518 Pls
3917 3518 Pls
3927 3587 Pls
3936 3587 Pls
3945 3587 Pls
3954 3587 Pls
3964 3587 Pls
3973 3587 Pls
3982 3587 Pls
3991 3587 Pls
4001 3587 Pls
4010 3587 Pls
4019 3587 Pls
4028 3587 Pls
4038 3587 Pls
4047 3587 Pls
4056 3587 Pls
4065 3587 Pls
4075 3587 Pls
4084 3587 Pls
4093 3587 Pls
4102 3587 Pls
4112 3587 Pls
4121 3587 Pls
4130 3587 Pls
4139 3587 Pls
4149 3587 Pls
4158 3587 Pls
4167 3587 Pls
4176 3587 Pls
4186 3587 Pls
4195 3587 Pls
4204 3587 Pls
4213 3587 Pls
4223 3587 Pls
4232 3587 Pls
4241 3587 Pls
4250 3587 Pls
4260 3587 Pls
4269 3587 Pls
4278 3587 Pls
4287 3587 Pls
4297 3587 Pls
4306 3587 Pls
4315 3587 Pls
4324 3587 Pls
4334 3587 Pls
4343 3587 Pls
4352 3587 Pls
4361 3587 Pls
4371 3587 Pls
4380 3587 Pls
4389 3518 Pls
4398 3518 Pls
4408 3518 Pls
4417 3518 Pls
4426 3518 Pls
4435 3518 Pls
4445 3518 Pls
4454 3518 Pls
4463 3518 Pls
4472 3518 Pls
4481 3518 Pls
4491 3518 Pls
4500 3450 Pls
4509 3450 Pls
4519 3450 Pls
4528 3450 Pls
4537 3450 Pls
4546 3450 Pls
4555 3450 Pls
4565 3450 Pls
4574 3450 Pls
4583 3450 Pls
4593 3450 Pls
4602 3450 Pls
4611 3450 Pls
4620 3381 Pls
4629 3381 Pls
4639 3381 Pls
4648 3381 Pls
4657 3381 Pls
4666 3381 Pls
4676 3381 Pls
4685 3381 Pls
4694 3381 Pls
4703 3381 Pls
4713 3381 Pls
4722 3381 Pls
4731 3381 Pls
4740 3381 Pls
4750 3381 Pls
4759 3312 Pls
4768 3312 Pls
4777 3312 Pls
4787 3312 Pls
4796 3312 Pls
4805 3312 Pls
4814 3312 Pls
4824 3312 Pls
4833 3312 Pls
4842 3312 Pls
4851 3312 Pls
4861 3312 Pls
4870 3312 Pls
4879 3312 Pls
4888 3312 Pls
4898 3312 Pls
4907 3312 Pls
4916 3312 Pls
4925 3312 Pls
4935 3312 Pls
4944 3312 Pls
4953 3312 Pls
4962 3312 Pls
4972 3312 Pls
4981 3312 Pls
4990 3312 Pls
4999 3312 Pls
5009 3312 Pls
5018 3312 Pls
5027 3312 Pls
5036 3312 Pls
5046 3312 Pls
5055 3312 Pls
5064 3312 Pls
5073 3312 Pls
5083 3312 Pls
5092 3312 Pls
5101 3312 Pls
5110 3312 Pls
5120 3312 Pls
5129 3312 Pls
5138 3312 Pls
5147 3312 Pls
5157 3312 Pls
5166 3312 Pls
5175 3312 Pls
5184 3312 Pls
5194 3312 Pls
5203 3312 Pls
5212 3312 Pls
5221 3312 Pls
5231 3312 Pls
5240 3312 Pls
5249 3312 Pls
5258 3312 Pls
5268 3312 Pls
5277 3312 Pls
5286 3312 Pls
5295 3312 Pls
5305 3312 Pls
5314 3312 Pls
5323 3312 Pls
5332 3312 Pls
5342 3312 Pls
5351 3312 Pls
5360 3312 Pls
5369 3312 Pls
5378 3312 Pls
5388 3312 Pls
5397 3312 Pls
5406 3312 Pls
5415 3312 Pls
5425 3312 Pls
5434 3312 Pls
5443 3312 Pls
5452 3312 Pls
5462 3312 Pls
5471 3312 Pls
5480 3312 Pls
5489 3312 Pls
5499 3381 Pls
5508 3381 Pls
5517 3381 Pls
5526 3381 Pls
5536 3381 Pls
5545 3381 Pls
5554 3381 Pls
5563 3381 Pls
5573 3381 Pls
5582 3381 Pls
5591 3381 Pls
5600 3381 Pls
5610 3381 Pls
5619 3381 Pls
5628 3381 Pls
5637 3381 Pls
5647 3381 Pls
5656 3381 Pls
5665 3381 Pls
5674 3381 Pls
5684 3381 Pls
5693 3381 Pls
5702 3381 Pls
5711 3381 Pls
5721 3381 Pls
5730 3381 Pls
5739 3381 Pls
5748 3381 Pls
5758 3381 Pls
5767 3381 Pls
5776 3381 Pls
5785 3381 Pls
5795 3381 Pls
5804 3381 Pls
5813 3381 Pls
5822 3381 Pls
5832 3381 Pls
5841 3381 Pls
5850 3381 Pls
5859 3381 Pls
5869 3381 Pls
5878 3381 Pls
5887 3381 Pls
5896 3381 Pls
5906 3381 Pls
5915 3381 Pls
5924 3381 Pls
5933 3381 Pls
5943 3381 Pls
5952 3381 Pls
5961 3381 Pls
5970 3381 Pls
5980 3381 Pls
5989 3381 Pls
5998 3381 Pls
6007 3381 Pls
6017 3381 Pls
6026 3381 Pls
6035 3381 Pls
6044 3381 Pls
6053 3381 Pls
6063 3381 Pls
6072 3381 Pls
6081 3381 Pls
6090 3381 Pls
6100 3381 Pls
6109 3381 Pls
6118 3381 Pls
6127 3381 Pls
6137 3381 Pls
6146 3381 Pls
6155 3381 Pls
6164 3381 Pls
6174 3381 Pls
6183 3381 Pls
6192 3381 Pls
6201 3381 Pls
6211 3381 Pls
6220 3381 Pls
6229 3381 Pls
6238 3381 Pls
6248 3381 Pls
6257 3381 Pls
6266 3381 Pls
6275 3381 Pls
6285 3381 Pls
6294 3381 Pls
6303 3381 Pls
6312 3381 Pls
6322 3381 Pls
6331 3381 Pls
6340 3381 Pls
6349 3381 Pls
6359 3381 Pls
6368 3381 Pls
6377 3381 Pls
6386 3381 Pls
6396 3381 Pls
6405 3381 Pls
6414 3312 Pls
6423 3312 Pls
6433 3312 Pls
6442 3312 Pls
6451 3312 Pls
6460 3312 Pls
6470 3312 Pls
6479 3312 Pls
6488 3312 Pls
6497 3312 Pls
6507 3312 Pls
6516 3312 Pls
6525 3312 Pls
6534 3312 Pls
6544 3312 Pls
6553 3312 Pls
6562 3312 Pls
6571 3312 Pls
6581 3312 Pls
6590 3312 Pls
6599 3312 Pls
6608 3312 Pls
6618 3312 Pls
6627 3312 Pls
6636 3312 Pls
6645 3312 Pls
6655 3312 Pls
6664 3312 Pls
6673 3312 Pls
6682 3312 Pls
6692 3312 Pls
6701 3312 Pls
6710 3312 Pls
6719 3312 Pls
6729 3312 Pls
6738 3312 Pls
6747 3312 Pls
6756 3312 Pls
6765 3312 Pls
6775 3312 Pls
6784 3312 Pls
6793 3312 Pls
6793 3312 Pls
6793 3312 Pls
6285 4619 Pls
% End plot #1
1.000 UL
LTb
903 4787 N
903 672 L
5918 0 V
0 4115 V
-5918 0 V
Z stroke
1.000 UP
1.000 UL
LTb
stroke
grestore
end
showpage
%%Trailer
%%DocumentFonts: Roman
%%Pages: 1
