100 9.75 -3 4936.63 2.4262 0.489957 0.0742008 0.000458308
200 13.875 -3.375 2472.92 19.5193 0.449797 0.100411 0.00113514
250 19.125 -3.375 1979.76 8.34341 0.681943 0.18064 0.00184766
280 25.125 -3.375 1766.23 1.36383 0.909951 0.285136 0.000847707
300 28.875 -3.375 1652.64 6.01338 1.18068 0.358188 0.00194083
310 30.375 -3.375 1594.27 6.56116 1.4938 0.426986 0.00163255
313 30.375 -3.375 1580.73 2.83094 1.35959 0.433214 0.00143722
315 30.375 -3.375 1566.89 1.48451 1.5708 0.454191 0.00102388
320 30.375 -3.375 1546.88 1.94789 1.5708 0.481982 0.000485432
330 29.625 -3.375 1501.51 1.11045 1.35719 0.570443 0.000997529
340 27.375 -3.375 1458.91 1.29292 1.25716 0.598516 0.0013469
400 13.875 -3.375 1238.15 0.950116 0.683982 0.806183 0.000806882
500 6.375 -3.375 989.979 9.58815 0.56861 0.898085 0.00177954
600 3.78947 -3.03947 824.426 5.30392 0.644947 0.928662 0.00392645
