%!PS-Adobe-2.0 EPSF-2.0
%%Title: plot1.tex
%%Creator: gnuplot 4.6 patchlevel 4
%%CreationDate: Thu Mar 12 21:06:25 2015
%%DocumentFonts: 
%%BoundingBox: 50 50 410 302
%%EndComments
%%BeginProlog
/gnudict 256 dict def
gnudict begin
%
% The following true/false flags may be edited by hand if desired.
% The unit line width and grayscale image gamma correction may also be changed.
%
/Color true def
/Blacktext true def
/Solid true def
/Dashlength 1 def
/Landscape false def
/Level1 false def
/Rounded false def
/ClipToBoundingBox false def
/SuppressPDFMark false def
/TransparentPatterns false def
/gnulinewidth 5.000 def
/userlinewidth gnulinewidth def
/Gamma 1.0 def
/BackgroundColor {-1.000 -1.000 -1.000} def
%
/vshift -73 def
/dl1 {
  10.0 Dashlength mul mul
  Rounded { currentlinewidth 0.75 mul sub dup 0 le { pop 0.01 } if } if
} def
/dl2 {
  10.0 Dashlength mul mul
  Rounded { currentlinewidth 0.75 mul add } if
} def
/hpt_ 31.5 def
/vpt_ 31.5 def
/hpt hpt_ def
/vpt vpt_ def
/doclip {
  ClipToBoundingBox {
    newpath 50 50 moveto 410 50 lineto 410 302 lineto 50 302 lineto closepath
    clip
  } if
} def
%
% Gnuplot Prolog Version 4.6 (September 2012)
%
%/SuppressPDFMark true def
%
/M {moveto} bind def
/L {lineto} bind def
/R {rmoveto} bind def
/V {rlineto} bind def
/N {newpath moveto} bind def
/Z {closepath} bind def
/C {setrgbcolor} bind def
/f {rlineto fill} bind def
/g {setgray} bind def
/Gshow {show} def   % May be redefined later in the file to support UTF-8
/vpt2 vpt 2 mul def
/hpt2 hpt 2 mul def
/Lshow {currentpoint stroke M 0 vshift R 
	Blacktext {gsave 0 setgray show grestore} {show} ifelse} def
/Rshow {currentpoint stroke M dup stringwidth pop neg vshift R
	Blacktext {gsave 0 setgray show grestore} {show} ifelse} def
/Cshow {currentpoint stroke M dup stringwidth pop -2 div vshift R 
	Blacktext {gsave 0 setgray show grestore} {show} ifelse} def
/UP {dup vpt_ mul /vpt exch def hpt_ mul /hpt exch def
  /hpt2 hpt 2 mul def /vpt2 vpt 2 mul def} def
/DL {Color {setrgbcolor Solid {pop []} if 0 setdash}
 {pop pop pop 0 setgray Solid {pop []} if 0 setdash} ifelse} def
/BL {stroke userlinewidth 2 mul setlinewidth
	Rounded {1 setlinejoin 1 setlinecap} if} def
/AL {stroke userlinewidth 2 div setlinewidth
	Rounded {1 setlinejoin 1 setlinecap} if} def
/UL {dup gnulinewidth mul /userlinewidth exch def
	dup 1 lt {pop 1} if 10 mul /udl exch def} def
/PL {stroke userlinewidth setlinewidth
	Rounded {1 setlinejoin 1 setlinecap} if} def
3.8 setmiterlimit
% Default Line colors
/LCw {1 1 1} def
/LCb {0 0 0} def
/LCa {0 0 0} def
/LC0 {1 0 0} def
/LC1 {0 1 0} def
/LC2 {0 0 1} def
/LC3 {1 0 1} def
/LC4 {0 1 1} def
/LC5 {1 1 0} def
/LC6 {0 0 0} def
/LC7 {1 0.3 0} def
/LC8 {0.5 0.5 0.5} def
% Default Line Types
/LTw {PL [] 1 setgray} def
/LTb {BL [] LCb DL} def
/LTa {AL [1 udl mul 2 udl mul] 0 setdash LCa setrgbcolor} def
/LT0 {PL [] LC0 DL} def
/LT1 {PL [4 dl1 2 dl2] LC1 DL} def
/LT2 {PL [2 dl1 3 dl2] LC2 DL} def
/LT3 {PL [1 dl1 1.5 dl2] LC3 DL} def
/LT4 {PL [6 dl1 2 dl2 1 dl1 2 dl2] LC4 DL} def
/LT5 {PL [3 dl1 3 dl2 1 dl1 3 dl2] LC5 DL} def
/LT6 {PL [2 dl1 2 dl2 2 dl1 6 dl2] LC6 DL} def
/LT7 {PL [1 dl1 2 dl2 6 dl1 2 dl2 1 dl1 2 dl2] LC7 DL} def
/LT8 {PL [2 dl1 2 dl2 2 dl1 2 dl2 2 dl1 2 dl2 2 dl1 4 dl2] LC8 DL} def
/Pnt {stroke [] 0 setdash gsave 1 setlinecap M 0 0 V stroke grestore} def
/Dia {stroke [] 0 setdash 2 copy vpt add M
  hpt neg vpt neg V hpt vpt neg V
  hpt vpt V hpt neg vpt V closepath stroke
  Pnt} def
/Pls {stroke [] 0 setdash vpt sub M 0 vpt2 V
  currentpoint stroke M
  hpt neg vpt neg R hpt2 0 V stroke
 } def
/Box {stroke [] 0 setdash 2 copy exch hpt sub exch vpt add M
  0 vpt2 neg V hpt2 0 V 0 vpt2 V
  hpt2 neg 0 V closepath stroke
  Pnt} def
/Crs {stroke [] 0 setdash exch hpt sub exch vpt add M
  hpt2 vpt2 neg V currentpoint stroke M
  hpt2 neg 0 R hpt2 vpt2 V stroke} def
/TriU {stroke [] 0 setdash 2 copy vpt 1.12 mul add M
  hpt neg vpt -1.62 mul V
  hpt 2 mul 0 V
  hpt neg vpt 1.62 mul V closepath stroke
  Pnt} def
/Star {2 copy Pls Crs} def
/BoxF {stroke [] 0 setdash exch hpt sub exch vpt add M
  0 vpt2 neg V hpt2 0 V 0 vpt2 V
  hpt2 neg 0 V closepath fill} def
/TriUF {stroke [] 0 setdash vpt 1.12 mul add M
  hpt neg vpt -1.62 mul V
  hpt 2 mul 0 V
  hpt neg vpt 1.62 mul V closepath fill} def
/TriD {stroke [] 0 setdash 2 copy vpt 1.12 mul sub M
  hpt neg vpt 1.62 mul V
  hpt 2 mul 0 V
  hpt neg vpt -1.62 mul V closepath stroke
  Pnt} def
/TriDF {stroke [] 0 setdash vpt 1.12 mul sub M
  hpt neg vpt 1.62 mul V
  hpt 2 mul 0 V
  hpt neg vpt -1.62 mul V closepath fill} def
/DiaF {stroke [] 0 setdash vpt add M
  hpt neg vpt neg V hpt vpt neg V
  hpt vpt V hpt neg vpt V closepath fill} def
/Pent {stroke [] 0 setdash 2 copy gsave
  translate 0 hpt M 4 {72 rotate 0 hpt L} repeat
  closepath stroke grestore Pnt} def
/PentF {stroke [] 0 setdash gsave
  translate 0 hpt M 4 {72 rotate 0 hpt L} repeat
  closepath fill grestore} def
/Circle {stroke [] 0 setdash 2 copy
  hpt 0 360 arc stroke Pnt} def
/CircleF {stroke [] 0 setdash hpt 0 360 arc fill} def
/C0 {BL [] 0 setdash 2 copy moveto vpt 90 450 arc} bind def
/C1 {BL [] 0 setdash 2 copy moveto
	2 copy vpt 0 90 arc closepath fill
	vpt 0 360 arc closepath} bind def
/C2 {BL [] 0 setdash 2 copy moveto
	2 copy vpt 90 180 arc closepath fill
	vpt 0 360 arc closepath} bind def
/C3 {BL [] 0 setdash 2 copy moveto
	2 copy vpt 0 180 arc closepath fill
	vpt 0 360 arc closepath} bind def
/C4 {BL [] 0 setdash 2 copy moveto
	2 copy vpt 180 270 arc closepath fill
	vpt 0 360 arc closepath} bind def
/C5 {BL [] 0 setdash 2 copy moveto
	2 copy vpt 0 90 arc
	2 copy moveto
	2 copy vpt 180 270 arc closepath fill
	vpt 0 360 arc} bind def
/C6 {BL [] 0 setdash 2 copy moveto
	2 copy vpt 90 270 arc closepath fill
	vpt 0 360 arc closepath} bind def
/C7 {BL [] 0 setdash 2 copy moveto
	2 copy vpt 0 270 arc closepath fill
	vpt 0 360 arc closepath} bind def
/C8 {BL [] 0 setdash 2 copy moveto
	2 copy vpt 270 360 arc closepath fill
	vpt 0 360 arc closepath} bind def
/C9 {BL [] 0 setdash 2 copy moveto
	2 copy vpt 270 450 arc closepath fill
	vpt 0 360 arc closepath} bind def
/C10 {BL [] 0 setdash 2 copy 2 copy moveto vpt 270 360 arc closepath fill
	2 copy moveto
	2 copy vpt 90 180 arc closepath fill
	vpt 0 360 arc closepath} bind def
/C11 {BL [] 0 setdash 2 copy moveto
	2 copy vpt 0 180 arc closepath fill
	2 copy moveto
	2 copy vpt 270 360 arc closepath fill
	vpt 0 360 arc closepath} bind def
/C12 {BL [] 0 setdash 2 copy moveto
	2 copy vpt 180 360 arc closepath fill
	vpt 0 360 arc closepath} bind def
/C13 {BL [] 0 setdash 2 copy moveto
	2 copy vpt 0 90 arc closepath fill
	2 copy moveto
	2 copy vpt 180 360 arc closepath fill
	vpt 0 360 arc closepath} bind def
/C14 {BL [] 0 setdash 2 copy moveto
	2 copy vpt 90 360 arc closepath fill
	vpt 0 360 arc} bind def
/C15 {BL [] 0 setdash 2 copy vpt 0 360 arc closepath fill
	vpt 0 360 arc closepath} bind def
/Rec {newpath 4 2 roll moveto 1 index 0 rlineto 0 exch rlineto
	neg 0 rlineto closepath} bind def
/Square {dup Rec} bind def
/Bsquare {vpt sub exch vpt sub exch vpt2 Square} bind def
/S0 {BL [] 0 setdash 2 copy moveto 0 vpt rlineto BL Bsquare} bind def
/S1 {BL [] 0 setdash 2 copy vpt Square fill Bsquare} bind def
/S2 {BL [] 0 setdash 2 copy exch vpt sub exch vpt Square fill Bsquare} bind def
/S3 {BL [] 0 setdash 2 copy exch vpt sub exch vpt2 vpt Rec fill Bsquare} bind def
/S4 {BL [] 0 setdash 2 copy exch vpt sub exch vpt sub vpt Square fill Bsquare} bind def
/S5 {BL [] 0 setdash 2 copy 2 copy vpt Square fill
	exch vpt sub exch vpt sub vpt Square fill Bsquare} bind def
/S6 {BL [] 0 setdash 2 copy exch vpt sub exch vpt sub vpt vpt2 Rec fill Bsquare} bind def
/S7 {BL [] 0 setdash 2 copy exch vpt sub exch vpt sub vpt vpt2 Rec fill
	2 copy vpt Square fill Bsquare} bind def
/S8 {BL [] 0 setdash 2 copy vpt sub vpt Square fill Bsquare} bind def
/S9 {BL [] 0 setdash 2 copy vpt sub vpt vpt2 Rec fill Bsquare} bind def
/S10 {BL [] 0 setdash 2 copy vpt sub vpt Square fill 2 copy exch vpt sub exch vpt Square fill
	Bsquare} bind def
/S11 {BL [] 0 setdash 2 copy vpt sub vpt Square fill 2 copy exch vpt sub exch vpt2 vpt Rec fill
	Bsquare} bind def
/S12 {BL [] 0 setdash 2 copy exch vpt sub exch vpt sub vpt2 vpt Rec fill Bsquare} bind def
/S13 {BL [] 0 setdash 2 copy exch vpt sub exch vpt sub vpt2 vpt Rec fill
	2 copy vpt Square fill Bsquare} bind def
/S14 {BL [] 0 setdash 2 copy exch vpt sub exch vpt sub vpt2 vpt Rec fill
	2 copy exch vpt sub exch vpt Square fill Bsquare} bind def
/S15 {BL [] 0 setdash 2 copy Bsquare fill Bsquare} bind def
/D0 {gsave translate 45 rotate 0 0 S0 stroke grestore} bind def
/D1 {gsave translate 45 rotate 0 0 S1 stroke grestore} bind def
/D2 {gsave translate 45 rotate 0 0 S2 stroke grestore} bind def
/D3 {gsave translate 45 rotate 0 0 S3 stroke grestore} bind def
/D4 {gsave translate 45 rotate 0 0 S4 stroke grestore} bind def
/D5 {gsave translate 45 rotate 0 0 S5 stroke grestore} bind def
/D6 {gsave translate 45 rotate 0 0 S6 stroke grestore} bind def
/D7 {gsave translate 45 rotate 0 0 S7 stroke grestore} bind def
/D8 {gsave translate 45 rotate 0 0 S8 stroke grestore} bind def
/D9 {gsave translate 45 rotate 0 0 S9 stroke grestore} bind def
/D10 {gsave translate 45 rotate 0 0 S10 stroke grestore} bind def
/D11 {gsave translate 45 rotate 0 0 S11 stroke grestore} bind def
/D12 {gsave translate 45 rotate 0 0 S12 stroke grestore} bind def
/D13 {gsave translate 45 rotate 0 0 S13 stroke grestore} bind def
/D14 {gsave translate 45 rotate 0 0 S14 stroke grestore} bind def
/D15 {gsave translate 45 rotate 0 0 S15 stroke grestore} bind def
/DiaE {stroke [] 0 setdash vpt add M
  hpt neg vpt neg V hpt vpt neg V
  hpt vpt V hpt neg vpt V closepath stroke} def
/BoxE {stroke [] 0 setdash exch hpt sub exch vpt add M
  0 vpt2 neg V hpt2 0 V 0 vpt2 V
  hpt2 neg 0 V closepath stroke} def
/TriUE {stroke [] 0 setdash vpt 1.12 mul add M
  hpt neg vpt -1.62 mul V
  hpt 2 mul 0 V
  hpt neg vpt 1.62 mul V closepath stroke} def
/TriDE {stroke [] 0 setdash vpt 1.12 mul sub M
  hpt neg vpt 1.62 mul V
  hpt 2 mul 0 V
  hpt neg vpt -1.62 mul V closepath stroke} def
/PentE {stroke [] 0 setdash gsave
  translate 0 hpt M 4 {72 rotate 0 hpt L} repeat
  closepath stroke grestore} def
/CircE {stroke [] 0 setdash 
  hpt 0 360 arc stroke} def
/Opaque {gsave closepath 1 setgray fill grestore 0 setgray closepath} def
/DiaW {stroke [] 0 setdash vpt add M
  hpt neg vpt neg V hpt vpt neg V
  hpt vpt V hpt neg vpt V Opaque stroke} def
/BoxW {stroke [] 0 setdash exch hpt sub exch vpt add M
  0 vpt2 neg V hpt2 0 V 0 vpt2 V
  hpt2 neg 0 V Opaque stroke} def
/TriUW {stroke [] 0 setdash vpt 1.12 mul add M
  hpt neg vpt -1.62 mul V
  hpt 2 mul 0 V
  hpt neg vpt 1.62 mul V Opaque stroke} def
/TriDW {stroke [] 0 setdash vpt 1.12 mul sub M
  hpt neg vpt 1.62 mul V
  hpt 2 mul 0 V
  hpt neg vpt -1.62 mul V Opaque stroke} def
/PentW {stroke [] 0 setdash gsave
  translate 0 hpt M 4 {72 rotate 0 hpt L} repeat
  Opaque stroke grestore} def
/CircW {stroke [] 0 setdash 
  hpt 0 360 arc Opaque stroke} def
/BoxFill {gsave Rec 1 setgray fill grestore} def
/Density {
  /Fillden exch def
  currentrgbcolor
  /ColB exch def /ColG exch def /ColR exch def
  /ColR ColR Fillden mul Fillden sub 1 add def
  /ColG ColG Fillden mul Fillden sub 1 add def
  /ColB ColB Fillden mul Fillden sub 1 add def
  ColR ColG ColB setrgbcolor} def
/BoxColFill {gsave Rec PolyFill} def
/PolyFill {gsave Density fill grestore grestore} def
/h {rlineto rlineto rlineto gsave closepath fill grestore} bind def
%
% PostScript Level 1 Pattern Fill routine for rectangles
% Usage: x y w h s a XX PatternFill
%	x,y = lower left corner of box to be filled
%	w,h = width and height of box
%	  a = angle in degrees between lines and x-axis
%	 XX = 0/1 for no/yes cross-hatch
%
/PatternFill {gsave /PFa [ 9 2 roll ] def
  PFa 0 get PFa 2 get 2 div add PFa 1 get PFa 3 get 2 div add translate
  PFa 2 get -2 div PFa 3 get -2 div PFa 2 get PFa 3 get Rec
  TransparentPatterns {} {gsave 1 setgray fill grestore} ifelse
  clip
  currentlinewidth 0.5 mul setlinewidth
  /PFs PFa 2 get dup mul PFa 3 get dup mul add sqrt def
  0 0 M PFa 5 get rotate PFs -2 div dup translate
  0 1 PFs PFa 4 get div 1 add floor cvi
	{PFa 4 get mul 0 M 0 PFs V} for
  0 PFa 6 get ne {
	0 1 PFs PFa 4 get div 1 add floor cvi
	{PFa 4 get mul 0 2 1 roll M PFs 0 V} for
 } if
  stroke grestore} def
%
/languagelevel where
 {pop languagelevel} {1} ifelse
 2 lt
	{/InterpretLevel1 true def}
	{/InterpretLevel1 Level1 def}
 ifelse
%
% PostScript level 2 pattern fill definitions
%
/Level2PatternFill {
/Tile8x8 {/PaintType 2 /PatternType 1 /TilingType 1 /BBox [0 0 8 8] /XStep 8 /YStep 8}
	bind def
/KeepColor {currentrgbcolor [/Pattern /DeviceRGB] setcolorspace} bind def
<< Tile8x8
 /PaintProc {0.5 setlinewidth pop 0 0 M 8 8 L 0 8 M 8 0 L stroke} 
>> matrix makepattern
/Pat1 exch def
<< Tile8x8
 /PaintProc {0.5 setlinewidth pop 0 0 M 8 8 L 0 8 M 8 0 L stroke
	0 4 M 4 8 L 8 4 L 4 0 L 0 4 L stroke}
>> matrix makepattern
/Pat2 exch def
<< Tile8x8
 /PaintProc {0.5 setlinewidth pop 0 0 M 0 8 L
	8 8 L 8 0 L 0 0 L fill}
>> matrix makepattern
/Pat3 exch def
<< Tile8x8
 /PaintProc {0.5 setlinewidth pop -4 8 M 8 -4 L
	0 12 M 12 0 L stroke}
>> matrix makepattern
/Pat4 exch def
<< Tile8x8
 /PaintProc {0.5 setlinewidth pop -4 0 M 8 12 L
	0 -4 M 12 8 L stroke}
>> matrix makepattern
/Pat5 exch def
<< Tile8x8
 /PaintProc {0.5 setlinewidth pop -2 8 M 4 -4 L
	0 12 M 8 -4 L 4 12 M 10 0 L stroke}
>> matrix makepattern
/Pat6 exch def
<< Tile8x8
 /PaintProc {0.5 setlinewidth pop -2 0 M 4 12 L
	0 -4 M 8 12 L 4 -4 M 10 8 L stroke}
>> matrix makepattern
/Pat7 exch def
<< Tile8x8
 /PaintProc {0.5 setlinewidth pop 8 -2 M -4 4 L
	12 0 M -4 8 L 12 4 M 0 10 L stroke}
>> matrix makepattern
/Pat8 exch def
<< Tile8x8
 /PaintProc {0.5 setlinewidth pop 0 -2 M 12 4 L
	-4 0 M 12 8 L -4 4 M 8 10 L stroke}
>> matrix makepattern
/Pat9 exch def
/Pattern1 {PatternBgnd KeepColor Pat1 setpattern} bind def
/Pattern2 {PatternBgnd KeepColor Pat2 setpattern} bind def
/Pattern3 {PatternBgnd KeepColor Pat3 setpattern} bind def
/Pattern4 {PatternBgnd KeepColor Landscape {Pat5} {Pat4} ifelse setpattern} bind def
/Pattern5 {PatternBgnd KeepColor Landscape {Pat4} {Pat5} ifelse setpattern} bind def
/Pattern6 {PatternBgnd KeepColor Landscape {Pat9} {Pat6} ifelse setpattern} bind def
/Pattern7 {PatternBgnd KeepColor Landscape {Pat8} {Pat7} ifelse setpattern} bind def
} def
%
%
%End of PostScript Level 2 code
%
/PatternBgnd {
  TransparentPatterns {} {gsave 1 setgray fill grestore} ifelse
} def
%
% Substitute for Level 2 pattern fill codes with
% grayscale if Level 2 support is not selected.
%
/Level1PatternFill {
/Pattern1 {0.250 Density} bind def
/Pattern2 {0.500 Density} bind def
/Pattern3 {0.750 Density} bind def
/Pattern4 {0.125 Density} bind def
/Pattern5 {0.375 Density} bind def
/Pattern6 {0.625 Density} bind def
/Pattern7 {0.875 Density} bind def
} def
%
% Now test for support of Level 2 code
%
Level1 {Level1PatternFill} {Level2PatternFill} ifelse
%
/Symbol-Oblique /Symbol findfont [1 0 .167 1 0 0] makefont
dup length dict begin {1 index /FID eq {pop pop} {def} ifelse} forall
currentdict end definefont pop
Level1 SuppressPDFMark or 
{} {
/SDict 10 dict def
systemdict /pdfmark known not {
  userdict /pdfmark systemdict /cleartomark get put
} if
SDict begin [
  /Title (plot1.tex)
  /Subject (gnuplot plot)
  /Creator (gnuplot 4.6 patchlevel 4)
  /Author (eric)
%  /Producer (gnuplot)
%  /Keywords ()
  /CreationDate (Thu Mar 12 21:06:25 2015)
  /DOCINFO pdfmark
end
} ifelse
end
%%EndProlog
%%Page: 1 1
gnudict begin
gsave
doclip
50 50 translate
0.050 0.050 scale
0 setgray
newpath
1.000 UL
LTb
LCb setrgbcolor
1078 934 M
63 0 V
5662 0 R
-63 0 V
stroke
LTb
1078 1393 M
63 0 V
5662 0 R
-63 0 V
1078 1852 M
63 0 V
5662 0 R
-63 0 V
1078 2312 M
63 0 V
5662 0 R
-63 0 V
1078 2771 M
63 0 V
5662 0 R
-63 0 V
1078 3231 M
63 0 V
5662 0 R
-63 0 V
1078 3690 M
63 0 V
5662 0 R
-63 0 V
1078 4149 M
63 0 V
5662 0 R
-63 0 V
1078 704 M
0 63 V
0 3612 R
0 -63 V
2223 704 M
0 63 V
0 3612 R
0 -63 V
3368 704 M
0 63 V
0 3612 R
0 -63 V
4513 704 M
0 63 V
0 3612 R
0 -63 V
5658 704 M
0 63 V
0 3612 R
0 -63 V
6803 704 M
0 63 V
0 3612 R
0 -63 V
stroke
1078 4379 N
0 -3675 V
5725 0 V
0 3675 V
-5725 0 V
Z stroke
1.000 UP
1.000 UL
LTb
1.000 UL
LT0
LC0 setrgbcolor
LC0 setrgbcolor
LCb setrgbcolor
LT0
LC0 setrgbcolor
LC0 setrgbcolor
5948 4206 M
591 0 V
1187 4379 M
7 -28 V
57 -216 V
58 -201 V
58 -188 V
58 -176 V
58 -164 V
58 -154 V
57 -143 V
58 -134 V
58 -125 V
58 -117 V
58 -109 V
58 -102 V
57 -96 V
58 -89 V
58 -83 V
58 -78 V
58 -73 V
58 -68 V
57 -64 V
58 -59 V
58 -56 V
58 -52 V
58 -49 V
58 -46 V
57 -42 V
58 -40 V
58 -38 V
58 -35 V
58 -32 V
58 -31 V
57 -29 V
58 -27 V
58 -25 V
58 -24 V
58 -22 V
57 -21 V
58 -19 V
58 -19 V
58 -17 V
58 -16 V
58 -15 V
57 -14 V
58 -14 V
58 -12 V
58 -12 V
58 -11 V
58 -10 V
57 -10 V
58 -10 V
58 -8 V
58 -8 V
58 -8 V
58 -7 V
57 -7 V
58 -7 V
58 -6 V
58 -6 V
58 -5 V
58 -6 V
57 -4 V
58 -5 V
58 -5 V
58 -4 V
58 -4 V
57 -4 V
58 -3 V
58 -4 V
58 -3 V
58 -3 V
58 -3 V
57 -3 V
58 -2 V
58 -3 V
58 -2 V
58 -3 V
58 -2 V
57 -2 V
58 -2 V
58 -2 V
58 -2 V
58 -2 V
58 -2 V
57 -2 V
58 -1 V
58 -2 V
58 -1 V
58 -2 V
58 -1 V
57 -2 V
58 -1 V
58 -1 V
58 -2 V
58 -1 V
58 -1 V
57 -1 V
58 -1 V
58 -1 V
stroke
LT1
LC1 setrgbcolor
LC1 setrgbcolor
LCb setrgbcolor
LT1
LC1 setrgbcolor
LC1 setrgbcolor
5948 3986 M
591 0 V
1318 4379 M
49 -179 V
58 -197 V
58 -185 V
58 -173 V
57 -161 V
58 -151 V
58 -141 V
58 -132 V
58 -123 V
58 -115 V
57 -108 V
58 -101 V
58 -95 V
58 -88 V
58 -82 V
58 -78 V
57 -72 V
58 -68 V
58 -63 V
58 -60 V
58 -56 V
58 -52 V
57 -49 V
58 -45 V
58 -43 V
58 -40 V
58 -38 V
58 -36 V
57 -33 V
58 -31 V
58 -29 V
58 -28 V
58 -26 V
57 -24 V
58 -23 V
58 -21 V
58 -20 V
58 -19 V
58 -18 V
57 -17 V
58 -16 V
58 -15 V
58 -14 V
58 -13 V
58 -13 V
57 -12 V
58 -11 V
58 -11 V
58 -10 V
58 -9 V
58 -9 V
57 -9 V
58 -8 V
58 -8 V
58 -7 V
58 -7 V
58 -7 V
57 -6 V
58 -6 V
58 -6 V
58 -5 V
58 -5 V
57 -5 V
58 -5 V
58 -5 V
58 -4 V
58 -4 V
58 -4 V
57 -4 V
58 -4 V
58 -3 V
58 -4 V
58 -3 V
58 -3 V
57 -3 V
58 -3 V
58 -3 V
58 -3 V
58 -2 V
58 -3 V
57 -2 V
58 -3 V
58 -2 V
58 -3 V
58 -2 V
58 -2 V
57 -2 V
58 -2 V
58 -2 V
58 -2 V
58 -2 V
58 -2 V
57 -2 V
58 -1 V
58 -2 V
stroke
LT2
LC2 setrgbcolor
LC2 setrgbcolor
LCb setrgbcolor
LT2
LC2 setrgbcolor
LC2 setrgbcolor
5948 3766 M
591 0 V
1461 4379 M
22 -81 V
58 -196 V
57 -184 V
58 -172 V
58 -161 V
58 -151 V
58 -140 V
58 -132 V
57 -123 V
58 -116 V
58 -108 V
58 -101 V
58 -94 V
58 -89 V
57 -83 V
58 -78 V
58 -73 V
58 -68 V
58 -64 V
58 -60 V
57 -56 V
58 -53 V
58 -49 V
58 -47 V
58 -44 V
58 -41 V
57 -38 V
58 -36 V
58 -34 V
58 -32 V
58 -30 V
57 -29 V
58 -26 V
58 -25 V
58 -24 V
58 -22 V
58 -22 V
57 -19 V
58 -19 V
58 -18 V
58 -17 V
58 -15 V
58 -15 V
57 -15 V
58 -13 V
58 -13 V
58 -12 V
58 -11 V
58 -11 V
57 -10 V
58 -10 V
58 -10 V
58 -9 V
58 -8 V
58 -8 V
57 -8 V
58 -7 V
58 -7 V
58 -7 V
58 -7 V
57 -6 V
58 -6 V
58 -6 V
58 -5 V
58 -5 V
58 -6 V
57 -4 V
58 -5 V
58 -5 V
58 -4 V
58 -4 V
58 -4 V
57 -4 V
58 -4 V
58 -4 V
58 -4 V
58 -3 V
58 -4 V
57 -3 V
58 -3 V
58 -3 V
58 -3 V
58 -3 V
58 -3 V
57 -3 V
58 -3 V
58 -2 V
58 -3 V
58 -3 V
58 -2 V
57 -3 V
58 -2 V
58 -2 V
stroke
LT3
LC3 setrgbcolor
LC3 setrgbcolor
LCb setrgbcolor
LT3
LC3 setrgbcolor
LC3 setrgbcolor
5948 3546 M
591 0 V
1413 4379 M
12 -42 V
58 -192 V
58 -178 V
57 -168 V
58 -156 V
58 -147 V
58 -137 V
58 -129 V
58 -120 V
57 -113 V
58 -105 V
58 -99 V
58 -93 V
58 -87 V
58 -82 V
57 -76 V
58 -72 V
58 -67 V
58 -63 V
58 -60 V
58 -55 V
57 -53 V
58 -49 V
58 -46 V
58 -44 V
58 -40 V
58 -39 V
57 -36 V
58 -34 V
58 -33 V
58 -30 V
58 -29 V
57 -27 V
58 -25 V
58 -24 V
58 -23 V
58 -22 V
58 -20 V
57 -19 V
58 -19 V
58 -17 V
58 -17 V
58 -15 V
58 -15 V
57 -14 V
58 -14 V
58 -12 V
58 -13 V
58 -11 V
58 -11 V
57 -11 V
58 -10 V
58 -10 V
58 -9 V
58 -9 V
58 -8 V
57 -9 V
58 -7 V
58 -8 V
58 -7 V
58 -7 V
57 -7 V
58 -6 V
58 -7 V
58 -6 V
58 -5 V
58 -6 V
57 -6 V
58 -5 V
58 -5 V
58 -5 V
58 -5 V
58 -4 V
57 -5 V
58 -4 V
58 -5 V
58 -4 V
58 -4 V
58 -4 V
57 -4 V
58 -4 V
58 -3 V
58 -4 V
58 -3 V
58 -4 V
57 -3 V
58 -4 V
58 -3 V
58 -3 V
58 -3 V
58 -3 V
57 -3 V
58 -3 V
58 -3 V
stroke
LT4
LC4 setrgbcolor
LC4 setrgbcolor
LCb setrgbcolor
LT4
LC4 setrgbcolor
LC4 setrgbcolor
5948 3326 M
591 0 V
1078 937 M
58 0 V
58 0 V
57 0 V
58 0 V
58 0 V
58 0 V
58 0 V
58 0 V
57 0 V
58 0 V
58 0 V
58 0 V
58 0 V
58 0 V
57 0 V
58 0 V
58 0 V
58 0 V
58 0 V
58 0 V
57 0 V
58 0 V
58 0 V
58 0 V
58 0 V
58 0 V
57 0 V
58 0 V
58 0 V
58 0 V
58 0 V
58 0 V
57 0 V
58 0 V
58 0 V
58 0 V
58 0 V
57 0 V
58 0 V
58 0 V
58 0 V
58 0 V
58 0 V
57 0 V
58 0 V
58 0 V
58 0 V
58 0 V
58 0 V
57 0 V
58 0 V
58 0 V
58 0 V
58 0 V
58 0 V
57 0 V
58 0 V
58 0 V
58 0 V
58 0 V
58 0 V
57 0 V
58 0 V
58 0 V
58 0 V
58 0 V
57 0 V
58 0 V
58 0 V
58 0 V
58 0 V
58 0 V
57 0 V
58 0 V
58 0 V
58 0 V
58 0 V
58 0 V
57 0 V
58 0 V
58 0 V
58 0 V
58 0 V
58 0 V
57 0 V
58 0 V
58 0 V
58 0 V
58 0 V
58 0 V
57 0 V
58 0 V
58 0 V
58 0 V
58 0 V
58 0 V
57 0 V
58 0 V
58 0 V
1.000 UP
stroke
LT5
LC5 setrgbcolor
LC0 setrgbcolor
LCb setrgbcolor
LT5
LC5 setrgbcolor
LC0 setrgbcolor
5948 3106 M
591 0 V
-591 31 R
0 -62 V
591 62 R
0 -62 V
1616 2554 M
0 985 V
-31 -985 R
62 0 V
-62 985 R
62 0 V
84 -1106 R
0 952 V
-31 -952 R
62 0 V
-62 952 R
62 0 V
83 -1201 R
0 881 V
-31 -881 R
62 0 V
-62 881 R
62 0 V
84 -1249 R
0 762 V
-31 -762 R
62 0 V
-62 762 R
62 0 V
83 -789 R
0 752 V
-31 -752 R
62 0 V
-62 752 R
62 0 V
84 -655 R
0 787 V
-31 -787 R
62 0 V
-62 787 R
62 0 V
85 -1023 R
0 699 V
-31 -699 R
62 0 V
-62 699 R
62 0 V
84 -722 R
0 690 V
-31 -690 R
62 0 V
-62 690 R
62 0 V
83 -786 R
0 652 V
-31 -652 R
62 0 V
-62 652 R
62 0 V
84 -812 R
0 577 V
-31 -577 R
62 0 V
-62 577 R
62 0 V
83 -657 R
0 535 V
-31 -535 R
62 0 V
-62 535 R
62 0 V
84 -539 R
0 534 V
-31 -534 R
62 0 V
-62 534 R
62 0 V
83 -685 R
0 441 V
-31 -441 R
62 0 V
-62 441 R
62 0 V
84 -455 R
0 431 V
-31 -431 R
62 0 V
-62 431 R
62 0 V
83 -441 R
0 424 V
-31 -424 R
62 0 V
-62 424 R
62 0 V
84 -407 R
0 436 V
-31 -436 R
62 0 V
-62 436 R
62 0 V
83 -443 R
0 431 V
-31 -431 R
62 0 V
stroke 3481 1122 M
-62 431 R
62 0 V
84 -496 R
0 378 V
-31 -378 R
62 0 V
-62 378 R
62 0 V
83 -422 R
0 338 V
-31 -338 R
62 0 V
-62 338 R
62 0 V
86 -347 R
0 328 V
-31 -328 R
62 0 V
-62 328 R
62 0 V
84 -310 R
0 347 V
-31 -347 R
62 0 V
-62 347 R
62 0 V
83 -388 R
0 301 V
3994 981 M
62 0 V
-62 301 R
62 0 V
84 -281 R
0 325 V
-31 -325 R
62 0 V
-62 325 R
62 0 V
83 -340 R
0 308 V
4223 986 M
62 0 V
-62 308 R
62 0 V
84 -305 R
0 312 V
4338 989 M
62 0 V
-62 312 R
62 0 V
83 -326 R
0 294 V
4452 975 M
62 0 V
-62 294 R
62 0 V
84 -268 R
0 325 V
-31 -325 R
62 0 V
-62 325 R
62 0 V
83 -354 R
0 291 V
4681 972 M
62 0 V
-62 291 R
62 0 V
84 -315 R
0 256 V
4796 948 M
62 0 V
-62 256 R
62 0 V
83 -270 R
0 229 V
4910 934 M
62 0 V
-62 229 R
62 0 V
84 -180 R
0 305 V
5025 983 M
62 0 V
-62 305 R
62 0 V
83 -357 R
0 225 V
5139 931 M
62 0 V
-62 225 R
62 0 V
84 -197 R
0 271 V
5254 959 M
62 0 V
-62 271 R
62 0 V
83 -269 R
0 276 V
5368 961 M
62 0 V
-62 276 R
62 0 V
stroke 5430 1237 M
84 -301 R
0 234 V
5483 936 M
62 0 V
-62 234 R
62 0 V
86 -232 R
0 239 V
5600 938 M
62 0 V
-62 239 R
62 0 V
83 -258 R
0 195 V
5714 919 M
62 0 V
-62 195 R
62 0 V
84 -185 R
0 220 V
5829 929 M
62 0 V
-62 220 R
62 0 V
83 -232 R
0 189 V
5943 917 M
62 0 V
-62 189 R
62 0 V
84 -185 R
0 200 V
6058 921 M
62 0 V
-62 200 R
62 0 V
83 -206 R
0 184 V
6172 915 M
62 0 V
-62 184 R
62 0 V
84 -194 R
0 130 V
6287 905 M
62 0 V
-62 130 R
62 0 V
83 -112 R
0 205 V
6401 923 M
62 0 V
-62 205 R
62 0 V
84 -205 R
0 205 V
6516 923 M
62 0 V
-62 205 R
62 0 V
83 -209 R
0 195 V
6630 919 M
62 0 V
-62 195 R
62 0 V
84 -185 R
0 220 V
6745 929 M
58 0 V
-58 220 R
58 0 V
1616 3047 Circle
1731 2909 Circle
1845 2624 Circle
1960 2197 Circle
2074 2165 Circle
2189 2280 Circle
2305 1999 Circle
2420 1972 Circle
2534 1857 Circle
2649 1660 Circle
2763 1558 Circle
2878 1554 Circle
2992 1356 Circle
3107 1338 Circle
3221 1324 Circle
3336 1347 Circle
3450 1338 Circle
3565 1246 Circle
3679 1182 Circle
3796 1168 Circle
3911 1196 Circle
4025 1131 Circle
4140 1163 Circle
4254 1140 Circle
4369 1145 Circle
4483 1122 Circle
4598 1163 Circle
4712 1117 Circle
4827 1076 Circle
4941 1049 Circle
5056 1136 Circle
5170 1044 Circle
5285 1094 Circle
5399 1099 Circle
5514 1053 Circle
5631 1058 Circle
5745 1016 Circle
5860 1039 Circle
5974 1012 Circle
6089 1021 Circle
6203 1007 Circle
6318 970 Circle
6432 1026 Circle
6547 1026 Circle
6661 1016 Circle
6776 1039 Circle
6243 3106 Circle
1.000 UP
1.000 UL
LT6
LC6 setrgbcolor
LC1 setrgbcolor
LCb setrgbcolor
LT6
LC6 setrgbcolor
LC1 setrgbcolor
5948 2886 M
591 0 V
-591 31 R
0 -62 V
591 62 R
0 -62 V
-4923 50 R
0 1074 V
1585 2905 M
62 0 V
-62 1074 R
62 0 V
84 -1295 R
0 1019 V
1700 2684 M
62 0 V
-62 1019 R
62 0 V
83 -1202 R
0 972 V
-31 -972 R
62 0 V
-62 972 R
62 0 V
84 -1209 R
0 904 V
-31 -904 R
62 0 V
-62 904 R
62 0 V
85 -1024 R
0 869 V
-31 -869 R
62 0 V
-62 869 R
62 0 V
84 -1220 R
0 753 V
-31 -753 R
62 0 V
-62 753 R
62 0 V
83 -792 R
0 739 V
-31 -739 R
62 0 V
-62 739 R
62 0 V
84 -770 R
0 728 V
-31 -728 R
62 0 V
-62 728 R
62 0 V
83 -866 R
0 673 V
-31 -673 R
62 0 V
-62 673 R
62 0 V
84 -708 R
0 660 V
-31 -660 R
62 0 V
-62 660 R
62 0 V
83 -850 R
0 572 V
-31 -572 R
62 0 V
-62 572 R
62 0 V
84 -539 R
0 588 V
-31 -588 R
62 0 V
-62 588 R
62 0 V
83 -651 R
0 557 V
-31 -557 R
62 0 V
-62 557 R
62 0 V
84 -564 R
0 553 V
-31 -553 R
62 0 V
-62 553 R
62 0 V
83 -553 R
0 553 V
-31 -553 R
62 0 V
-62 553 R
62 0 V
84 -664 R
0 491 V
-31 -491 R
62 0 V
-62 491 R
62 0 V
83 -515 R
0 475 V
-31 -475 R
62 0 V
stroke 3481 1188 M
-62 475 R
62 0 V
84 -524 R
0 443 V
-31 -443 R
62 0 V
-62 443 R
62 0 V
83 -470 R
0 424 V
-31 -424 R
62 0 V
-62 424 R
62 0 V
86 -440 R
0 411 V
-31 -411 R
62 0 V
-62 411 R
62 0 V
84 -469 R
0 361 V
-31 -361 R
62 0 V
-62 361 R
62 0 V
83 -349 R
0 373 V
-31 -373 R
62 0 V
-62 373 R
62 0 V
84 -340 R
0 400 V
-31 -400 R
62 0 V
-62 400 R
62 0 V
83 -413 R
0 389 V
-31 -389 R
62 0 V
-62 389 R
62 0 V
84 -418 R
0 364 V
-31 -364 R
62 0 V
-62 364 R
62 0 V
83 -424 R
0 301 V
4452 981 M
62 0 V
-62 301 R
62 0 V
84 -247 R
0 358 V
-31 -358 R
62 0 V
-62 358 R
62 0 V
83 -362 R
0 356 V
-31 -356 R
62 0 V
-62 356 R
62 0 V
84 -423 R
0 279 V
4796 964 M
62 0 V
-62 279 R
62 0 V
83 -199 R
0 367 V
-31 -367 R
62 0 V
-62 367 R
62 0 V
84 -392 R
0 344 V
-31 -344 R
62 0 V
-62 344 R
62 0 V
83 -388 R
0 294 V
5139 975 M
62 0 V
-62 294 R
62 0 V
84 -234 R
0 358 V
-31 -358 R
62 0 V
-62 358 R
62 0 V
83 -432 R
0 276 V
5368 961 M
62 0 V
-62 276 R
62 0 V
stroke 5430 1237 M
84 -259 R
0 297 V
5483 978 M
62 0 V
-62 297 R
62 0 V
86 -314 R
0 276 V
5600 961 M
62 0 V
-62 276 R
62 0 V
83 -239 R
0 322 V
5714 998 M
62 0 V
-62 322 R
62 0 V
84 -331 R
0 312 V
5829 989 M
62 0 V
-62 312 R
62 0 V
83 -337 R
0 279 V
5943 964 M
62 0 V
-62 279 R
62 0 V
84 -300 R
0 248 V
6058 943 M
62 0 V
-62 248 R
62 0 V
83 -238 R
0 264 V
6172 953 M
62 0 V
-62 264 R
62 0 V
84 -302 R
0 184 V
6287 915 M
62 0 V
-62 184 R
62 0 V
83 -146 R
0 264 V
6401 953 M
62 0 V
-62 264 R
62 0 V
84 -279 R
0 239 V
6516 938 M
62 0 V
-62 239 R
62 0 V
83 -241 R
0 234 V
6630 936 M
62 0 V
-62 234 R
62 0 V
84 -236 R
0 229 V
6745 934 M
58 0 V
-58 229 R
58 0 V
1616 3442 CircleF
1731 3194 CircleF
1845 2987 CircleF
1960 2716 CircleF
2076 2578 CircleF
2191 2169 CircleF
2305 2123 CircleF
2420 2087 CircleF
2534 1921 CircleF
2649 1880 CircleF
2763 1646 CircleF
2878 1687 CircleF
2992 1609 CircleF
3107 1600 CircleF
3221 1600 CircleF
3336 1457 CircleF
3450 1425 CircleF
3565 1361 CircleF
3679 1324 CircleF
3796 1301 CircleF
3911 1219 CircleF
4025 1237 CircleF
4140 1283 CircleF
4254 1264 CircleF
4369 1223 CircleF
4483 1131 CircleF
4598 1214 CircleF
4712 1209 CircleF
4827 1104 CircleF
4941 1228 CircleF
5056 1191 CircleF
5170 1122 CircleF
5285 1214 CircleF
5399 1099 CircleF
5514 1127 CircleF
5631 1099 CircleF
5745 1159 CircleF
5860 1145 CircleF
5974 1104 CircleF
6089 1067 CircleF
6203 1085 CircleF
6318 1007 CircleF
6432 1085 CircleF
6547 1058 CircleF
6661 1053 CircleF
6776 1049 CircleF
6243 2886 CircleF
1.000 UP
1.000 UL
LT7
LC7 setrgbcolor
LC2 setrgbcolor
LCb setrgbcolor
LT7
LC7 setrgbcolor
LC2 setrgbcolor
5948 2666 M
591 0 V
-591 31 R
0 -62 V
591 62 R
0 -62 V
1662 3078 M
0 1114 V
1631 3078 M
62 0 V
-62 1114 R
62 0 V
83 -1168 R
0 1102 V
1745 3024 M
62 0 V
-62 1102 R
62 0 V
84 -1527 R
0 997 V
-31 -997 R
62 0 V
-62 997 R
62 0 V
83 -1304 R
0 913 V
-31 -913 R
62 0 V
-62 913 R
62 0 V
86 -784 R
0 949 V
-31 -949 R
62 0 V
-62 949 R
62 0 V
84 -1286 R
0 851 V
-31 -851 R
62 0 V
-62 851 R
62 0 V
83 -1064 R
0 781 V
-31 -781 R
62 0 V
-62 781 R
62 0 V
84 -655 R
0 823 V
-31 -823 R
62 0 V
-62 823 R
62 0 V
83 -1182 R
0 695 V
-31 -695 R
62 0 V
-62 695 R
62 0 V
84 -618 R
0 725 V
-31 -725 R
62 0 V
-62 725 R
62 0 V
83 -787 R
0 702 V
-31 -702 R
62 0 V
-62 702 R
62 0 V
84 -827 R
0 649 V
-31 -649 R
62 0 V
-62 649 R
62 0 V
83 -653 R
0 648 V
-31 -648 R
62 0 V
-62 648 R
62 0 V
84 -852 R
0 551 V
-31 -551 R
62 0 V
-62 551 R
62 0 V
83 -562 R
0 545 V
-31 -545 R
62 0 V
-62 545 R
62 0 V
84 -553 R
0 542 V
-31 -542 R
62 0 V
-62 542 R
62 0 V
83 -603 R
0 508 V
-31 -508 R
62 0 V
stroke 3527 1240 M
-62 508 R
62 0 V
86 -465 R
0 532 V
-31 -532 R
62 0 V
-62 532 R
62 0 V
84 -627 R
0 475 V
-31 -475 R
62 0 V
-62 475 R
62 0 V
83 -426 R
0 505 V
-31 -505 R
62 0 V
-62 505 R
62 0 V
84 -609 R
0 438 V
-31 -438 R
62 0 V
-62 438 R
62 0 V
83 -383 R
0 475 V
-31 -475 R
62 0 V
-62 475 R
62 0 V
84 -567 R
0 411 V
-31 -411 R
62 0 V
-62 411 R
62 0 V
83 -391 R
0 426 V
-31 -426 R
62 0 V
-62 426 R
62 0 V
84 -347 R
0 479 V
-31 -479 R
62 0 V
-62 479 R
62 0 V
83 -636 R
0 361 V
-31 -361 R
62 0 V
-62 361 R
62 0 V
84 -364 R
0 358 V
-31 -358 R
62 0 V
-62 358 R
62 0 V
83 -368 R
0 350 V
-31 -350 R
62 0 V
-62 350 R
62 0 V
84 -386 R
0 312 V
4842 989 M
62 0 V
-62 312 R
62 0 V
83 -225 R
0 395 V
-31 -395 R
62 0 V
-62 395 R
62 0 V
84 -467 R
0 328 V
-31 -328 R
62 0 V
-62 328 R
62 0 V
83 -343 R
0 312 V
5185 989 M
62 0 V
-62 312 R
62 0 V
84 -294 R
0 331 V
-31 -331 R
62 0 V
-62 331 R
62 0 V
83 -337 R
0 325 V
-31 -325 R
62 0 V
-62 325 R
62 0 V
stroke 5476 1326 M
86 -234 R
0 409 V
-31 -409 R
62 0 V
-62 409 R
62 0 V
83 -503 R
0 322 V
5645 998 M
62 0 V
-62 322 R
62 0 V
84 -313 R
0 331 V
-31 -331 R
62 0 V
-62 331 R
62 0 V
83 -325 R
0 338 V
-31 -338 R
62 0 V
-62 338 R
62 0 V
84 -347 R
0 328 V
-31 -328 R
62 0 V
-62 328 R
62 0 V
83 -346 R
0 308 V
6103 986 M
62 0 V
-62 308 R
62 0 V
84 -272 R
0 347 V
-31 -347 R
62 0 V
-62 347 R
62 0 V
83 -421 R
0 256 V
6332 948 M
62 0 V
-62 256 R
62 0 V
84 -240 R
0 279 V
6447 964 M
62 0 V
-62 279 R
62 0 V
83 -245 R
0 322 V
6561 998 M
62 0 V
-62 322 R
62 0 V
84 -342 R
0 297 V
6676 978 M
62 0 V
-62 297 R
62 0 V
1662 3635 TriU
1776 3575 TriU
1891 3097 TriU
2005 2748 TriU
2122 2895 TriU
2237 2509 TriU
2351 2261 TriU
2466 2408 TriU
2580 1986 TriU
2695 2078 TriU
2809 2004 TriU
2924 1852 TriU
3038 1848 TriU
3153 1595 TriU
3267 1581 TriU
3382 1572 TriU
3496 1494 TriU
3613 1549 TriU
3728 1425 TriU
3842 1490 TriU
3957 1352 TriU
4071 1425 TriU
4186 1301 TriU
4300 1329 TriU
4415 1434 TriU
4529 1219 TriU
4644 1214 TriU
4758 1200 TriU
4873 1145 TriU
4987 1274 TriU
5102 1168 TriU
5216 1145 TriU
5331 1173 TriU
5445 1163 TriU
5562 1297 TriU
5676 1159 TriU
5791 1173 TriU
5905 1182 TriU
6020 1168 TriU
6134 1140 TriU
6249 1196 TriU
6363 1076 TriU
6478 1104 TriU
6592 1159 TriU
6707 1127 TriU
6243 2666 TriU
1.000 UP
1.000 UL
LT8
LC8 setrgbcolor
LC3 setrgbcolor
LCb setrgbcolor
LT8
LC8 setrgbcolor
LC3 setrgbcolor
5948 2446 M
591 0 V
-591 31 R
0 -62 V
591 62 R
0 -62 V
1731 2864 M
0 1064 V
1700 2864 M
62 0 V
-62 1064 R
62 0 V
83 -1109 R
0 1053 V
1814 2819 M
62 0 V
-62 1053 R
62 0 V
84 -1411 R
0 960 V
-31 -960 R
62 0 V
-62 960 R
62 0 V
83 -1293 R
0 864 V
-31 -864 R
62 0 V
-62 864 R
62 0 V
86 -1015 R
0 817 V
-31 -817 R
62 0 V
-62 817 R
62 0 V
83 -634 R
0 874 V
-31 -874 R
62 0 V
-62 874 R
62 0 V
84 -1041 R
0 822 V
-31 -822 R
62 0 V
-62 822 R
62 0 V
83 -814 R
0 824 V
-31 -824 R
62 0 V
-62 824 R
62 0 V
84 -1044 R
0 749 V
-31 -749 R
62 0 V
-62 749 R
62 0 V
83 -807 R
0 728 V
-31 -728 R
62 0 V
-62 728 R
62 0 V
84 -870 R
0 672 V
-31 -672 R
62 0 V
-62 672 R
62 0 V
83 -619 R
0 694 V
-31 -694 R
62 0 V
-62 694 R
62 0 V
84 -990 R
0 561 V
-31 -561 R
62 0 V
-62 561 R
62 0 V
83 -356 R
0 656 V
-31 -656 R
62 0 V
-62 656 R
62 0 V
84 -983 R
0 492 V
-31 -492 R
62 0 V
-62 492 R
62 0 V
83 -378 R
0 557 V
-31 -557 R
62 0 V
-62 557 R
62 0 V
84 -593 R
0 538 V
-31 -538 R
62 0 V
stroke 3596 1294 M
-62 538 R
62 0 V
83 -634 R
0 482 V
-31 -482 R
62 0 V
-62 482 R
62 0 V
84 -432 R
0 511 V
-31 -511 R
62 0 V
-62 511 R
62 0 V
86 -609 R
0 450 V
-31 -450 R
62 0 V
-62 450 R
62 0 V
83 -299 R
0 542 V
-31 -542 R
62 0 V
-62 542 R
62 0 V
84 -610 R
0 504 V
-31 -504 R
62 0 V
-62 504 R
62 0 V
83 -560 R
0 469 V
-31 -469 R
62 0 V
-62 469 R
62 0 V
84 -513 R
0 438 V
-31 -438 R
62 0 V
-62 438 R
62 0 V
83 -390 R
0 470 V
-31 -470 R
62 0 V
-62 470 R
62 0 V
84 -568 R
0 400 V
-31 -400 R
62 0 V
-62 400 R
62 0 V
83 -391 R
0 409 V
-31 -409 R
62 0 V
-62 409 R
62 0 V
84 -444 R
0 378 V
-31 -378 R
62 0 V
-62 378 R
62 0 V
83 -369 R
0 387 V
-31 -387 R
62 0 V
-62 387 R
62 0 V
84 -337 R
0 426 V
-31 -426 R
62 0 V
-62 426 R
62 0 V
83 -446 R
0 411 V
-31 -411 R
62 0 V
-62 411 R
62 0 V
84 -415 R
0 409 V
-31 -409 R
62 0 V
-62 409 R
62 0 V
83 -435 R
0 387 V
-31 -387 R
62 0 V
-62 387 R
62 0 V
84 -406 R
0 370 V
-31 -370 R
62 0 V
-62 370 R
62 0 V
stroke 5545 1417 M
83 -379 R
0 361 V
-31 -361 R
62 0 V
-62 361 R
62 0 V
84 -355 R
0 367 V
-31 -367 R
62 0 V
-62 367 R
62 0 V
86 -425 R
0 308 V
5829 986 M
62 0 V
-62 308 R
62 0 V
83 -263 R
0 356 V
-31 -356 R
62 0 V
-62 356 R
62 0 V
84 -389 R
0 322 V
6058 998 M
62 0 V
-62 322 R
62 0 V
83 -316 R
0 328 V
-31 -328 R
62 0 V
-62 328 R
62 0 V
84 -275 R
0 378 V
-31 -378 R
62 0 V
-62 378 R
62 0 V
83 -407 R
0 353 V
-31 -353 R
62 0 V
-62 353 R
62 0 V
84 -386 R
0 318 V
6516 995 M
62 0 V
-62 318 R
62 0 V
83 -327 R
0 308 V
6630 986 M
62 0 V
-62 308 R
62 0 V
84 -299 R
0 318 V
6745 995 M
58 0 V
-58 318 R
58 0 V
1731 3396 TriUF
1845 3345 TriUF
1960 2941 TriUF
2074 2560 TriUF
2191 2385 TriUF
2305 2597 TriUF
2420 2404 TriUF
2534 2413 TriUF
2649 2156 TriUF
2763 2087 TriUF
2878 1917 TriUF
2992 1981 TriUF
3107 1618 TriUF
3221 1871 TriUF
3336 1462 TriUF
3450 1609 TriUF
3565 1563 TriUF
3679 1439 TriUF
3794 1503 TriUF
3911 1375 TriUF
4025 1572 TriUF
4140 1485 TriUF
4254 1411 TriUF
4369 1352 TriUF
4483 1416 TriUF
4598 1283 TriUF
4712 1297 TriUF
4827 1246 TriUF
4941 1260 TriUF
5056 1329 TriUF
5170 1301 TriUF
5285 1297 TriUF
5399 1260 TriUF
5514 1232 TriUF
5628 1219 TriUF
5743 1228 TriUF
5860 1140 TriUF
5974 1209 TriUF
6089 1159 TriUF
6203 1168 TriUF
6318 1246 TriUF
6432 1205 TriUF
6547 1154 TriUF
6661 1140 TriUF
6776 1154 TriUF
6243 2446 TriUF
1.000 UP
1.000 UL
LT0
LC0 setrgbcolor
LC4 setrgbcolor
LCb setrgbcolor
LT0
LC0 setrgbcolor
LC4 setrgbcolor
5948 2226 M
591 0 V
-591 31 R
0 -62 V
591 62 R
0 -62 V
1188 906 M
0 92 V
-31 -92 R
62 0 V
-62 92 R
62 0 V
83 -88 R
0 65 V
-31 -65 R
62 0 V
-62 65 R
62 0 V
84 -65 R
0 65 V
-31 -65 R
62 0 V
-62 65 R
62 0 V
83 -60 R
0 46 V
-31 -46 R
62 0 V
-62 46 R
62 0 V
84 -55 R
0 92 V
-31 -92 R
62 0 V
-62 92 R
62 0 V
83 -76 R
0 23 V
-31 -23 R
62 0 V
-62 23 R
62 0 V
86 -35 R
0 65 V
-31 -65 R
62 0 V
-62 65 R
62 0 V
84 -53 R
0 23 V
-31 -23 R
62 0 V
-62 23 R
62 0 V
83 -30 R
0 46 V
-31 -46 R
62 0 V
-62 46 R
62 0 V
84 -51 R
0 65 V
-31 -65 R
62 0 V
-62 65 R
62 0 V
83 -60 R
0 46 V
-31 -46 R
62 0 V
-62 46 R
62 0 V
84 -51 R
0 65 V
-31 -65 R
62 0 V
-62 65 R
62 0 V
83 -67 R
0 79 V
-31 -79 R
62 0 V
-62 79 R
62 0 V
84 -79 R
0 79 V
-31 -79 R
62 0 V
-62 79 R
62 0 V
83 -79 R
0 79 V
-31 -79 R
62 0 V
-62 79 R
62 0 V
84 -77 R
0 65 V
-31 -65 R
62 0 V
-62 65 R
62 0 V
83 -60 R
0 46 V
-31 -46 R
62 0 V
stroke 3053 915 M
-62 46 R
62 0 V
84 -39 R
0 23 V
-31 -23 R
62 0 V
-62 23 R
62 0 V
83 -39 R
0 92 V
-31 -92 R
62 0 V
-62 92 R
62 0 V
84 -92 R
0 92 V
-31 -92 R
62 0 V
-62 92 R
62 0 V
86 -88 R
0 65 V
-31 -65 R
62 0 V
-62 65 R
62 0 V
83 -60 R
0 46 V
-31 -46 R
62 0 V
-62 46 R
62 0 V
84 -56 R
0 122 V
3681 905 M
62 0 V
-62 122 R
62 0 V
83 -119 R
0 79 V
-31 -79 R
62 0 V
-62 79 R
62 0 V
84 -72 R
0 46 V
-31 -46 R
62 0 V
-62 46 R
62 0 V
83 -39 R
0 23 V
-31 -23 R
62 0 V
-62 23 R
62 0 V
84 -37 R
0 79 V
-31 -79 R
62 0 V
-62 79 R
62 0 V
83 -72 R
0 46 V
-31 -46 R
62 0 V
-62 46 R
62 0 V
84 -46 R
0 46 V
-31 -46 R
62 0 V
-62 46 R
62 0 V
83 -39 R
0 23 V
-31 -23 R
62 0 V
-62 23 R
62 0 V
84 -23 R
0 23 V
-31 -23 R
62 0 V
-62 23 R
62 0 V
83 -35 R
0 65 V
-31 -65 R
62 0 V
-62 65 R
62 0 V
84 -65 R
0 65 V
-31 -65 R
62 0 V
-62 65 R
62 0 V
83 -67 R
0 79 V
-31 -79 R
62 0 V
-62 79 R
62 0 V
stroke 5002 987 M
84 -65 R
0 23 V
-31 -23 R
62 0 V
-62 23 R
62 0 V
83 -30 R
0 46 V
-31 -46 R
62 0 V
-62 46 R
62 0 V
84 -51 R
0 65 V
-31 -65 R
62 0 V
-62 65 R
62 0 V
85 -65 R
0 65 V
-31 -65 R
62 0 V
-62 65 R
62 0 V
84 -53 R
0 23 V
-31 -23 R
62 0 V
-62 23 R
62 0 V
83 -40 R
0 103 V
5629 905 M
62 0 V
-62 103 R
62 0 V
84 -100 R
0 79 V
-31 -79 R
62 0 V
-62 79 R
62 0 V
83 -77 R
0 65 V
-31 -65 R
62 0 V
-62 65 R
62 0 V
84 -60 R
0 46 V
-31 -46 R
62 0 V
-62 46 R
62 0 V
83 -56 R
0 103 V
6087 905 M
62 0 V
-62 103 R
62 0 V
84 -103 R
0 122 V
6202 905 M
62 0 V
-62 122 R
62 0 V
83 -117 R
0 65 V
-31 -65 R
62 0 V
-62 65 R
62 0 V
84 -65 R
0 65 V
-31 -65 R
62 0 V
-62 65 R
62 0 V
83 -53 R
0 23 V
-31 -23 R
62 0 V
-62 23 R
62 0 V
84 -37 R
0 79 V
-31 -79 R
62 0 V
-62 79 R
62 0 V
1188 952 TriD
1302 943 TriD
1417 943 TriD
1531 938 TriD
1646 952 TriD
1760 934 TriD
1877 943 TriD
1992 934 TriD
2106 938 TriD
2221 943 TriD
2335 938 TriD
2450 943 TriD
2564 947 TriD
2679 947 TriD
2793 947 TriD
2908 943 TriD
3022 938 TriD
3137 934 TriD
3251 952 TriD
3366 952 TriD
3483 943 TriD
3597 938 TriD
3712 966 TriD
3826 947 TriD
3941 938 TriD
4055 934 TriD
4170 947 TriD
4284 938 TriD
4399 938 TriD
4513 934 TriD
4628 934 TriD
4742 943 TriD
4857 943 TriD
4971 947 TriD
5086 934 TriD
5200 938 TriD
5315 943 TriD
5431 943 TriD
5546 934 TriD
5660 957 TriD
5775 947 TriD
5889 943 TriD
6004 938 TriD
6118 957 TriD
6233 966 TriD
6347 943 TriD
6462 943 TriD
6576 934 TriD
6691 947 TriD
6243 2226 TriD
1.000 UL
LTb
LCb setrgbcolor
1078 4379 N
0 -3675 V
5725 0 V
0 3675 V
-5725 0 V
Z stroke
1.000 UP
1.000 UL
LTb
stroke
grestore
end
showpage
%%Trailer
