%!PS-Adobe-2.0 EPSF-2.0
%%Title: plot1min.tex
%%Creator: gnuplot 4.6 patchlevel 4
%%CreationDate: Thu Mar 12 21:06:25 2015
%%DocumentFonts: 
%%BoundingBox: 50 50 410 302
%%EndComments
%%BeginProlog
/gnudict 256 dict def
gnudict begin
%
% The following true/false flags may be edited by hand if desired.
% The unit line width and grayscale image gamma correction may also be changed.
%
/Color true def
/Blacktext true def
/Solid true def
/Dashlength 1 def
/Landscape false def
/Level1 false def
/Rounded false def
/ClipToBoundingBox false def
/SuppressPDFMark false def
/TransparentPatterns false def
/gnulinewidth 5.000 def
/userlinewidth gnulinewidth def
/Gamma 1.0 def
/BackgroundColor {-1.000 -1.000 -1.000} def
%
/vshift -73 def
/dl1 {
  10.0 Dashlength mul mul
  Rounded { currentlinewidth 0.75 mul sub dup 0 le { pop 0.01 } if } if
} def
/dl2 {
  10.0 Dashlength mul mul
  Rounded { currentlinewidth 0.75 mul add } if
} def
/hpt_ 31.5 def
/vpt_ 31.5 def
/hpt hpt_ def
/vpt vpt_ def
/doclip {
  ClipToBoundingBox {
    newpath 50 50 moveto 410 50 lineto 410 302 lineto 50 302 lineto closepath
    clip
  } if
} def
%
% Gnuplot Prolog Version 4.6 (September 2012)
%
%/SuppressPDFMark true def
%
/M {moveto} bind def
/L {lineto} bind def
/R {rmoveto} bind def
/V {rlineto} bind def
/N {newpath moveto} bind def
/Z {closepath} bind def
/C {setrgbcolor} bind def
/f {rlineto fill} bind def
/g {setgray} bind def
/Gshow {show} def   % May be redefined later in the file to support UTF-8
/vpt2 vpt 2 mul def
/hpt2 hpt 2 mul def
/Lshow {currentpoint stroke M 0 vshift R 
	Blacktext {gsave 0 setgray show grestore} {show} ifelse} def
/Rshow {currentpoint stroke M dup stringwidth pop neg vshift R
	Blacktext {gsave 0 setgray show grestore} {show} ifelse} def
/Cshow {currentpoint stroke M dup stringwidth pop -2 div vshift R 
	Blacktext {gsave 0 setgray show grestore} {show} ifelse} def
/UP {dup vpt_ mul /vpt exch def hpt_ mul /hpt exch def
  /hpt2 hpt 2 mul def /vpt2 vpt 2 mul def} def
/DL {Color {setrgbcolor Solid {pop []} if 0 setdash}
 {pop pop pop 0 setgray Solid {pop []} if 0 setdash} ifelse} def
/BL {stroke userlinewidth 2 mul setlinewidth
	Rounded {1 setlinejoin 1 setlinecap} if} def
/AL {stroke userlinewidth 2 div setlinewidth
	Rounded {1 setlinejoin 1 setlinecap} if} def
/UL {dup gnulinewidth mul /userlinewidth exch def
	dup 1 lt {pop 1} if 10 mul /udl exch def} def
/PL {stroke userlinewidth setlinewidth
	Rounded {1 setlinejoin 1 setlinecap} if} def
3.8 setmiterlimit
% Default Line colors
/LCw {1 1 1} def
/LCb {0 0 0} def
/LCa {0 0 0} def
/LC0 {1 0 0} def
/LC1 {0 1 0} def
/LC2 {0 0 1} def
/LC3 {1 0 1} def
/LC4 {0 1 1} def
/LC5 {1 1 0} def
/LC6 {0 0 0} def
/LC7 {1 0.3 0} def
/LC8 {0.5 0.5 0.5} def
% Default Line Types
/LTw {PL [] 1 setgray} def
/LTb {BL [] LCb DL} def
/LTa {AL [1 udl mul 2 udl mul] 0 setdash LCa setrgbcolor} def
/LT0 {PL [] LC0 DL} def
/LT1 {PL [4 dl1 2 dl2] LC1 DL} def
/LT2 {PL [2 dl1 3 dl2] LC2 DL} def
/LT3 {PL [1 dl1 1.5 dl2] LC3 DL} def
/LT4 {PL [6 dl1 2 dl2 1 dl1 2 dl2] LC4 DL} def
/LT5 {PL [3 dl1 3 dl2 1 dl1 3 dl2] LC5 DL} def
/LT6 {PL [2 dl1 2 dl2 2 dl1 6 dl2] LC6 DL} def
/LT7 {PL [1 dl1 2 dl2 6 dl1 2 dl2 1 dl1 2 dl2] LC7 DL} def
/LT8 {PL [2 dl1 2 dl2 2 dl1 2 dl2 2 dl1 2 dl2 2 dl1 4 dl2] LC8 DL} def
/Pnt {stroke [] 0 setdash gsave 1 setlinecap M 0 0 V stroke grestore} def
/Dia {stroke [] 0 setdash 2 copy vpt add M
  hpt neg vpt neg V hpt vpt neg V
  hpt vpt V hpt neg vpt V closepath stroke
  Pnt} def
/Pls {stroke [] 0 setdash vpt sub M 0 vpt2 V
  currentpoint stroke M
  hpt neg vpt neg R hpt2 0 V stroke
 } def
/Box {stroke [] 0 setdash 2 copy exch hpt sub exch vpt add M
  0 vpt2 neg V hpt2 0 V 0 vpt2 V
  hpt2 neg 0 V closepath stroke
  Pnt} def
/Crs {stroke [] 0 setdash exch hpt sub exch vpt add M
  hpt2 vpt2 neg V currentpoint stroke M
  hpt2 neg 0 R hpt2 vpt2 V stroke} def
/TriU {stroke [] 0 setdash 2 copy vpt 1.12 mul add M
  hpt neg vpt -1.62 mul V
  hpt 2 mul 0 V
  hpt neg vpt 1.62 mul V closepath stroke
  Pnt} def
/Star {2 copy Pls Crs} def
/BoxF {stroke [] 0 setdash exch hpt sub exch vpt add M
  0 vpt2 neg V hpt2 0 V 0 vpt2 V
  hpt2 neg 0 V closepath fill} def
/TriUF {stroke [] 0 setdash vpt 1.12 mul add M
  hpt neg vpt -1.62 mul V
  hpt 2 mul 0 V
  hpt neg vpt 1.62 mul V closepath fill} def
/TriD {stroke [] 0 setdash 2 copy vpt 1.12 mul sub M
  hpt neg vpt 1.62 mul V
  hpt 2 mul 0 V
  hpt neg vpt -1.62 mul V closepath stroke
  Pnt} def
/TriDF {stroke [] 0 setdash vpt 1.12 mul sub M
  hpt neg vpt 1.62 mul V
  hpt 2 mul 0 V
  hpt neg vpt -1.62 mul V closepath fill} def
/DiaF {stroke [] 0 setdash vpt add M
  hpt neg vpt neg V hpt vpt neg V
  hpt vpt V hpt neg vpt V closepath fill} def
/Pent {stroke [] 0 setdash 2 copy gsave
  translate 0 hpt M 4 {72 rotate 0 hpt L} repeat
  closepath stroke grestore Pnt} def
/PentF {stroke [] 0 setdash gsave
  translate 0 hpt M 4 {72 rotate 0 hpt L} repeat
  closepath fill grestore} def
/Circle {stroke [] 0 setdash 2 copy
  hpt 0 360 arc stroke Pnt} def
/CircleF {stroke [] 0 setdash hpt 0 360 arc fill} def
/C0 {BL [] 0 setdash 2 copy moveto vpt 90 450 arc} bind def
/C1 {BL [] 0 setdash 2 copy moveto
	2 copy vpt 0 90 arc closepath fill
	vpt 0 360 arc closepath} bind def
/C2 {BL [] 0 setdash 2 copy moveto
	2 copy vpt 90 180 arc closepath fill
	vpt 0 360 arc closepath} bind def
/C3 {BL [] 0 setdash 2 copy moveto
	2 copy vpt 0 180 arc closepath fill
	vpt 0 360 arc closepath} bind def
/C4 {BL [] 0 setdash 2 copy moveto
	2 copy vpt 180 270 arc closepath fill
	vpt 0 360 arc closepath} bind def
/C5 {BL [] 0 setdash 2 copy moveto
	2 copy vpt 0 90 arc
	2 copy moveto
	2 copy vpt 180 270 arc closepath fill
	vpt 0 360 arc} bind def
/C6 {BL [] 0 setdash 2 copy moveto
	2 copy vpt 90 270 arc closepath fill
	vpt 0 360 arc closepath} bind def
/C7 {BL [] 0 setdash 2 copy moveto
	2 copy vpt 0 270 arc closepath fill
	vpt 0 360 arc closepath} bind def
/C8 {BL [] 0 setdash 2 copy moveto
	2 copy vpt 270 360 arc closepath fill
	vpt 0 360 arc closepath} bind def
/C9 {BL [] 0 setdash 2 copy moveto
	2 copy vpt 270 450 arc closepath fill
	vpt 0 360 arc closepath} bind def
/C10 {BL [] 0 setdash 2 copy 2 copy moveto vpt 270 360 arc closepath fill
	2 copy moveto
	2 copy vpt 90 180 arc closepath fill
	vpt 0 360 arc closepath} bind def
/C11 {BL [] 0 setdash 2 copy moveto
	2 copy vpt 0 180 arc closepath fill
	2 copy moveto
	2 copy vpt 270 360 arc closepath fill
	vpt 0 360 arc closepath} bind def
/C12 {BL [] 0 setdash 2 copy moveto
	2 copy vpt 180 360 arc closepath fill
	vpt 0 360 arc closepath} bind def
/C13 {BL [] 0 setdash 2 copy moveto
	2 copy vpt 0 90 arc closepath fill
	2 copy moveto
	2 copy vpt 180 360 arc closepath fill
	vpt 0 360 arc closepath} bind def
/C14 {BL [] 0 setdash 2 copy moveto
	2 copy vpt 90 360 arc closepath fill
	vpt 0 360 arc} bind def
/C15 {BL [] 0 setdash 2 copy vpt 0 360 arc closepath fill
	vpt 0 360 arc closepath} bind def
/Rec {newpath 4 2 roll moveto 1 index 0 rlineto 0 exch rlineto
	neg 0 rlineto closepath} bind def
/Square {dup Rec} bind def
/Bsquare {vpt sub exch vpt sub exch vpt2 Square} bind def
/S0 {BL [] 0 setdash 2 copy moveto 0 vpt rlineto BL Bsquare} bind def
/S1 {BL [] 0 setdash 2 copy vpt Square fill Bsquare} bind def
/S2 {BL [] 0 setdash 2 copy exch vpt sub exch vpt Square fill Bsquare} bind def
/S3 {BL [] 0 setdash 2 copy exch vpt sub exch vpt2 vpt Rec fill Bsquare} bind def
/S4 {BL [] 0 setdash 2 copy exch vpt sub exch vpt sub vpt Square fill Bsquare} bind def
/S5 {BL [] 0 setdash 2 copy 2 copy vpt Square fill
	exch vpt sub exch vpt sub vpt Square fill Bsquare} bind def
/S6 {BL [] 0 setdash 2 copy exch vpt sub exch vpt sub vpt vpt2 Rec fill Bsquare} bind def
/S7 {BL [] 0 setdash 2 copy exch vpt sub exch vpt sub vpt vpt2 Rec fill
	2 copy vpt Square fill Bsquare} bind def
/S8 {BL [] 0 setdash 2 copy vpt sub vpt Square fill Bsquare} bind def
/S9 {BL [] 0 setdash 2 copy vpt sub vpt vpt2 Rec fill Bsquare} bind def
/S10 {BL [] 0 setdash 2 copy vpt sub vpt Square fill 2 copy exch vpt sub exch vpt Square fill
	Bsquare} bind def
/S11 {BL [] 0 setdash 2 copy vpt sub vpt Square fill 2 copy exch vpt sub exch vpt2 vpt Rec fill
	Bsquare} bind def
/S12 {BL [] 0 setdash 2 copy exch vpt sub exch vpt sub vpt2 vpt Rec fill Bsquare} bind def
/S13 {BL [] 0 setdash 2 copy exch vpt sub exch vpt sub vpt2 vpt Rec fill
	2 copy vpt Square fill Bsquare} bind def
/S14 {BL [] 0 setdash 2 copy exch vpt sub exch vpt sub vpt2 vpt Rec fill
	2 copy exch vpt sub exch vpt Square fill Bsquare} bind def
/S15 {BL [] 0 setdash 2 copy Bsquare fill Bsquare} bind def
/D0 {gsave translate 45 rotate 0 0 S0 stroke grestore} bind def
/D1 {gsave translate 45 rotate 0 0 S1 stroke grestore} bind def
/D2 {gsave translate 45 rotate 0 0 S2 stroke grestore} bind def
/D3 {gsave translate 45 rotate 0 0 S3 stroke grestore} bind def
/D4 {gsave translate 45 rotate 0 0 S4 stroke grestore} bind def
/D5 {gsave translate 45 rotate 0 0 S5 stroke grestore} bind def
/D6 {gsave translate 45 rotate 0 0 S6 stroke grestore} bind def
/D7 {gsave translate 45 rotate 0 0 S7 stroke grestore} bind def
/D8 {gsave translate 45 rotate 0 0 S8 stroke grestore} bind def
/D9 {gsave translate 45 rotate 0 0 S9 stroke grestore} bind def
/D10 {gsave translate 45 rotate 0 0 S10 stroke grestore} bind def
/D11 {gsave translate 45 rotate 0 0 S11 stroke grestore} bind def
/D12 {gsave translate 45 rotate 0 0 S12 stroke grestore} bind def
/D13 {gsave translate 45 rotate 0 0 S13 stroke grestore} bind def
/D14 {gsave translate 45 rotate 0 0 S14 stroke grestore} bind def
/D15 {gsave translate 45 rotate 0 0 S15 stroke grestore} bind def
/DiaE {stroke [] 0 setdash vpt add M
  hpt neg vpt neg V hpt vpt neg V
  hpt vpt V hpt neg vpt V closepath stroke} def
/BoxE {stroke [] 0 setdash exch hpt sub exch vpt add M
  0 vpt2 neg V hpt2 0 V 0 vpt2 V
  hpt2 neg 0 V closepath stroke} def
/TriUE {stroke [] 0 setdash vpt 1.12 mul add M
  hpt neg vpt -1.62 mul V
  hpt 2 mul 0 V
  hpt neg vpt 1.62 mul V closepath stroke} def
/TriDE {stroke [] 0 setdash vpt 1.12 mul sub M
  hpt neg vpt 1.62 mul V
  hpt 2 mul 0 V
  hpt neg vpt -1.62 mul V closepath stroke} def
/PentE {stroke [] 0 setdash gsave
  translate 0 hpt M 4 {72 rotate 0 hpt L} repeat
  closepath stroke grestore} def
/CircE {stroke [] 0 setdash 
  hpt 0 360 arc stroke} def
/Opaque {gsave closepath 1 setgray fill grestore 0 setgray closepath} def
/DiaW {stroke [] 0 setdash vpt add M
  hpt neg vpt neg V hpt vpt neg V
  hpt vpt V hpt neg vpt V Opaque stroke} def
/BoxW {stroke [] 0 setdash exch hpt sub exch vpt add M
  0 vpt2 neg V hpt2 0 V 0 vpt2 V
  hpt2 neg 0 V Opaque stroke} def
/TriUW {stroke [] 0 setdash vpt 1.12 mul add M
  hpt neg vpt -1.62 mul V
  hpt 2 mul 0 V
  hpt neg vpt 1.62 mul V Opaque stroke} def
/TriDW {stroke [] 0 setdash vpt 1.12 mul sub M
  hpt neg vpt 1.62 mul V
  hpt 2 mul 0 V
  hpt neg vpt -1.62 mul V Opaque stroke} def
/PentW {stroke [] 0 setdash gsave
  translate 0 hpt M 4 {72 rotate 0 hpt L} repeat
  Opaque stroke grestore} def
/CircW {stroke [] 0 setdash 
  hpt 0 360 arc Opaque stroke} def
/BoxFill {gsave Rec 1 setgray fill grestore} def
/Density {
  /Fillden exch def
  currentrgbcolor
  /ColB exch def /ColG exch def /ColR exch def
  /ColR ColR Fillden mul Fillden sub 1 add def
  /ColG ColG Fillden mul Fillden sub 1 add def
  /ColB ColB Fillden mul Fillden sub 1 add def
  ColR ColG ColB setrgbcolor} def
/BoxColFill {gsave Rec PolyFill} def
/PolyFill {gsave Density fill grestore grestore} def
/h {rlineto rlineto rlineto gsave closepath fill grestore} bind def
%
% PostScript Level 1 Pattern Fill routine for rectangles
% Usage: x y w h s a XX PatternFill
%	x,y = lower left corner of box to be filled
%	w,h = width and height of box
%	  a = angle in degrees between lines and x-axis
%	 XX = 0/1 for no/yes cross-hatch
%
/PatternFill {gsave /PFa [ 9 2 roll ] def
  PFa 0 get PFa 2 get 2 div add PFa 1 get PFa 3 get 2 div add translate
  PFa 2 get -2 div PFa 3 get -2 div PFa 2 get PFa 3 get Rec
  TransparentPatterns {} {gsave 1 setgray fill grestore} ifelse
  clip
  currentlinewidth 0.5 mul setlinewidth
  /PFs PFa 2 get dup mul PFa 3 get dup mul add sqrt def
  0 0 M PFa 5 get rotate PFs -2 div dup translate
  0 1 PFs PFa 4 get div 1 add floor cvi
	{PFa 4 get mul 0 M 0 PFs V} for
  0 PFa 6 get ne {
	0 1 PFs PFa 4 get div 1 add floor cvi
	{PFa 4 get mul 0 2 1 roll M PFs 0 V} for
 } if
  stroke grestore} def
%
/languagelevel where
 {pop languagelevel} {1} ifelse
 2 lt
	{/InterpretLevel1 true def}
	{/InterpretLevel1 Level1 def}
 ifelse
%
% PostScript level 2 pattern fill definitions
%
/Level2PatternFill {
/Tile8x8 {/PaintType 2 /PatternType 1 /TilingType 1 /BBox [0 0 8 8] /XStep 8 /YStep 8}
	bind def
/KeepColor {currentrgbcolor [/Pattern /DeviceRGB] setcolorspace} bind def
<< Tile8x8
 /PaintProc {0.5 setlinewidth pop 0 0 M 8 8 L 0 8 M 8 0 L stroke} 
>> matrix makepattern
/Pat1 exch def
<< Tile8x8
 /PaintProc {0.5 setlinewidth pop 0 0 M 8 8 L 0 8 M 8 0 L stroke
	0 4 M 4 8 L 8 4 L 4 0 L 0 4 L stroke}
>> matrix makepattern
/Pat2 exch def
<< Tile8x8
 /PaintProc {0.5 setlinewidth pop 0 0 M 0 8 L
	8 8 L 8 0 L 0 0 L fill}
>> matrix makepattern
/Pat3 exch def
<< Tile8x8
 /PaintProc {0.5 setlinewidth pop -4 8 M 8 -4 L
	0 12 M 12 0 L stroke}
>> matrix makepattern
/Pat4 exch def
<< Tile8x8
 /PaintProc {0.5 setlinewidth pop -4 0 M 8 12 L
	0 -4 M 12 8 L stroke}
>> matrix makepattern
/Pat5 exch def
<< Tile8x8
 /PaintProc {0.5 setlinewidth pop -2 8 M 4 -4 L
	0 12 M 8 -4 L 4 12 M 10 0 L stroke}
>> matrix makepattern
/Pat6 exch def
<< Tile8x8
 /PaintProc {0.5 setlinewidth pop -2 0 M 4 12 L
	0 -4 M 8 12 L 4 -4 M 10 8 L stroke}
>> matrix makepattern
/Pat7 exch def
<< Tile8x8
 /PaintProc {0.5 setlinewidth pop 8 -2 M -4 4 L
	12 0 M -4 8 L 12 4 M 0 10 L stroke}
>> matrix makepattern
/Pat8 exch def
<< Tile8x8
 /PaintProc {0.5 setlinewidth pop 0 -2 M 12 4 L
	-4 0 M 12 8 L -4 4 M 8 10 L stroke}
>> matrix makepattern
/Pat9 exch def
/Pattern1 {PatternBgnd KeepColor Pat1 setpattern} bind def
/Pattern2 {PatternBgnd KeepColor Pat2 setpattern} bind def
/Pattern3 {PatternBgnd KeepColor Pat3 setpattern} bind def
/Pattern4 {PatternBgnd KeepColor Landscape {Pat5} {Pat4} ifelse setpattern} bind def
/Pattern5 {PatternBgnd KeepColor Landscape {Pat4} {Pat5} ifelse setpattern} bind def
/Pattern6 {PatternBgnd KeepColor Landscape {Pat9} {Pat6} ifelse setpattern} bind def
/Pattern7 {PatternBgnd KeepColor Landscape {Pat8} {Pat7} ifelse setpattern} bind def
} def
%
%
%End of PostScript Level 2 code
%
/PatternBgnd {
  TransparentPatterns {} {gsave 1 setgray fill grestore} ifelse
} def
%
% Substitute for Level 2 pattern fill codes with
% grayscale if Level 2 support is not selected.
%
/Level1PatternFill {
/Pattern1 {0.250 Density} bind def
/Pattern2 {0.500 Density} bind def
/Pattern3 {0.750 Density} bind def
/Pattern4 {0.125 Density} bind def
/Pattern5 {0.375 Density} bind def
/Pattern6 {0.625 Density} bind def
/Pattern7 {0.875 Density} bind def
} def
%
% Now test for support of Level 2 code
%
Level1 {Level1PatternFill} {Level2PatternFill} ifelse
%
/Symbol-Oblique /Symbol findfont [1 0 .167 1 0 0] makefont
dup length dict begin {1 index /FID eq {pop pop} {def} ifelse} forall
currentdict end definefont pop
Level1 SuppressPDFMark or 
{} {
/SDict 10 dict def
systemdict /pdfmark known not {
  userdict /pdfmark systemdict /cleartomark get put
} if
SDict begin [
  /Title (plot1min.tex)
  /Subject (gnuplot plot)
  /Creator (gnuplot 4.6 patchlevel 4)
  /Author (eric)
%  /Producer (gnuplot)
%  /Keywords ()
  /CreationDate (Thu Mar 12 21:06:25 2015)
  /DOCINFO pdfmark
end
} ifelse
end
%%EndProlog
%%Page: 1 1
gnudict begin
gsave
doclip
50 50 translate
0.050 0.050 scale
0 setgray
newpath
1.000 UL
LTb
LCb setrgbcolor
1078 934 M
63 0 V
5662 0 R
-63 0 V
stroke
LTb
1078 1393 M
63 0 V
5662 0 R
-63 0 V
1078 1852 M
63 0 V
5662 0 R
-63 0 V
1078 2312 M
63 0 V
5662 0 R
-63 0 V
1078 2771 M
63 0 V
5662 0 R
-63 0 V
1078 3231 M
63 0 V
5662 0 R
-63 0 V
1078 3690 M
63 0 V
5662 0 R
-63 0 V
1078 4149 M
63 0 V
5662 0 R
-63 0 V
1078 704 M
0 63 V
0 3612 R
0 -63 V
2223 704 M
0 63 V
0 3612 R
0 -63 V
3368 704 M
0 63 V
0 3612 R
0 -63 V
4513 704 M
0 63 V
0 3612 R
0 -63 V
5658 704 M
0 63 V
0 3612 R
0 -63 V
6803 704 M
0 63 V
0 3612 R
0 -63 V
stroke
1078 4379 N
0 -3675 V
5725 0 V
0 3675 V
-5725 0 V
Z stroke
1.000 UP
1.000 UL
LTb
1.000 UL
LT0
LC0 setrgbcolor
LCb setrgbcolor
LT0
LC0 setrgbcolor
5948 4206 M
591 0 V
1132 4379 M
4 -16 V
58 -228 V
57 -213 V
58 -199 V
58 -185 V
58 -174 V
58 -161 V
58 -151 V
57 -141 V
58 -131 V
58 -123 V
58 -115 V
58 -107 V
58 -99 V
57 -94 V
58 -87 V
58 -81 V
58 -75 V
58 -71 V
58 -66 V
57 -62 V
58 -57 V
58 -54 V
58 -50 V
58 -47 V
58 -43 V
57 -41 V
58 -38 V
58 -36 V
58 -33 V
58 -31 V
58 -29 V
57 -27 V
58 -25 V
58 -23 V
58 -22 V
58 -21 V
57 -19 V
58 -17 V
58 -17 V
58 -16 V
58 -14 V
58 -14 V
57 -12 V
58 -12 V
58 -11 V
58 -10 V
58 -10 V
58 -9 V
57 -8 V
58 -8 V
58 -7 V
58 -7 V
58 -6 V
58 -6 V
57 -6 V
58 -5 V
58 -5 V
58 -4 V
58 -4 V
58 -4 V
57 -4 V
58 -3 V
58 -4 V
58 -3 V
58 -2 V
57 -3 V
58 -2 V
58 -3 V
58 -2 V
58 -2 V
58 -1 V
57 -2 V
58 -2 V
58 -1 V
58 -2 V
58 -1 V
58 -1 V
57 -1 V
58 -1 V
58 -1 V
58 -1 V
58 -1 V
58 -1 V
57 -1 V
58 0 V
58 -1 V
58 -1 V
58 0 V
58 -1 V
57 0 V
58 -1 V
58 0 V
58 0 V
58 -1 V
58 0 V
57 -1 V
58 0 V
58 0 V
stroke
LT1
LC1 setrgbcolor
LCb setrgbcolor
LT1
LC1 setrgbcolor
5948 3986 M
591 0 V
1078 1158 M
58 -3 V
58 -2 V
57 -3 V
58 -3 V
58 -2 V
58 -3 V
58 -2 V
58 -3 V
57 -2 V
58 -2 V
58 -3 V
58 -2 V
58 -3 V
58 -2 V
57 -2 V
58 -2 V
58 -3 V
58 -2 V
58 -2 V
58 -2 V
57 -2 V
58 -2 V
58 -2 V
58 -2 V
58 -2 V
58 -2 V
57 -2 V
58 -2 V
58 -2 V
58 -2 V
58 -2 V
58 -2 V
57 -1 V
58 -2 V
58 -2 V
58 -2 V
58 -2 V
57 -1 V
58 -2 V
58 -2 V
58 -1 V
58 -2 V
58 -2 V
57 -1 V
58 -2 V
58 -1 V
58 -2 V
58 -1 V
58 -2 V
57 -1 V
58 -2 V
58 -1 V
58 -2 V
58 -1 V
58 -1 V
57 -2 V
58 -1 V
58 -1 V
58 -2 V
58 -1 V
58 -1 V
57 -2 V
58 -1 V
58 -1 V
58 -1 V
58 -2 V
57 -1 V
58 -1 V
58 -1 V
58 -1 V
58 -1 V
58 -2 V
57 -1 V
58 -1 V
58 -1 V
58 -1 V
58 -1 V
58 -1 V
57 -1 V
58 -1 V
58 -1 V
58 -1 V
58 -1 V
58 -1 V
57 -1 V
58 -1 V
58 -1 V
58 -1 V
58 -1 V
58 -1 V
57 -1 V
58 0 V
58 -1 V
58 -1 V
58 -1 V
58 -1 V
57 -1 V
58 -1 V
58 0 V
stroke
LT2
LC2 setrgbcolor
LCb setrgbcolor
LT2
LC2 setrgbcolor
5948 3766 M
591 0 V
1187 4379 M
7 -28 V
57 -216 V
58 -201 V
58 -188 V
58 -176 V
58 -164 V
58 -154 V
57 -143 V
58 -134 V
58 -125 V
58 -117 V
58 -109 V
58 -102 V
57 -96 V
58 -89 V
58 -83 V
58 -78 V
58 -73 V
58 -68 V
57 -64 V
58 -59 V
58 -56 V
58 -52 V
58 -49 V
58 -46 V
57 -42 V
58 -40 V
58 -38 V
58 -35 V
58 -32 V
58 -31 V
57 -29 V
58 -27 V
58 -25 V
58 -24 V
58 -22 V
57 -21 V
58 -19 V
58 -19 V
58 -17 V
58 -16 V
58 -15 V
57 -14 V
58 -14 V
58 -12 V
58 -12 V
58 -11 V
58 -10 V
57 -10 V
58 -10 V
58 -8 V
58 -8 V
58 -8 V
58 -7 V
57 -7 V
58 -7 V
58 -6 V
58 -6 V
58 -5 V
58 -6 V
57 -4 V
58 -5 V
58 -5 V
58 -4 V
58 -4 V
57 -4 V
58 -3 V
58 -4 V
58 -3 V
58 -3 V
58 -3 V
57 -3 V
58 -2 V
58 -3 V
58 -2 V
58 -3 V
58 -2 V
57 -2 V
58 -2 V
58 -2 V
58 -2 V
58 -2 V
58 -2 V
57 -2 V
58 -1 V
58 -2 V
58 -1 V
58 -2 V
58 -1 V
57 -2 V
58 -1 V
58 -1 V
58 -2 V
58 -1 V
58 -1 V
57 -1 V
58 -1 V
58 -1 V
stroke
LT3
LC3 setrgbcolor
LCb setrgbcolor
LT3
LC3 setrgbcolor
5948 3546 M
591 0 V
1078 937 M
58 0 V
58 0 V
57 0 V
58 0 V
58 0 V
58 0 V
58 0 V
58 0 V
57 0 V
58 0 V
58 0 V
58 0 V
58 0 V
58 0 V
57 0 V
58 0 V
58 0 V
58 0 V
58 0 V
58 0 V
57 0 V
58 0 V
58 0 V
58 0 V
58 0 V
58 0 V
57 0 V
58 0 V
58 0 V
58 0 V
58 0 V
58 0 V
57 0 V
58 0 V
58 0 V
58 0 V
58 0 V
57 0 V
58 0 V
58 0 V
58 0 V
58 0 V
58 0 V
57 0 V
58 0 V
58 0 V
58 0 V
58 0 V
58 0 V
57 0 V
58 0 V
58 0 V
58 0 V
58 0 V
58 0 V
57 0 V
58 0 V
58 0 V
58 0 V
58 0 V
58 0 V
57 0 V
58 0 V
58 0 V
58 0 V
58 0 V
57 0 V
58 0 V
58 0 V
58 0 V
58 0 V
58 0 V
57 0 V
58 0 V
58 0 V
58 0 V
58 0 V
58 0 V
57 0 V
58 0 V
58 0 V
58 0 V
58 0 V
58 0 V
57 0 V
58 0 V
58 0 V
58 0 V
58 0 V
58 0 V
57 0 V
58 0 V
58 0 V
58 0 V
58 0 V
58 0 V
57 0 V
58 0 V
58 0 V
1.000 UP
stroke
LT4
LC4 setrgbcolor
LCa setrgbcolor
LCb setrgbcolor
LT4
LC4 setrgbcolor
LCa setrgbcolor
5948 3326 M
591 0 V
-591 31 R
0 -62 V
591 62 R
0 -62 V
1616 2554 M
0 985 V
-31 -985 R
62 0 V
-62 985 R
62 0 V
84 -1106 R
0 952 V
-31 -952 R
62 0 V
-62 952 R
62 0 V
83 -1201 R
0 881 V
-31 -881 R
62 0 V
-62 881 R
62 0 V
84 -1249 R
0 762 V
-31 -762 R
62 0 V
-62 762 R
62 0 V
83 -789 R
0 752 V
-31 -752 R
62 0 V
-62 752 R
62 0 V
84 -655 R
0 787 V
-31 -787 R
62 0 V
-62 787 R
62 0 V
85 -1023 R
0 699 V
-31 -699 R
62 0 V
-62 699 R
62 0 V
84 -722 R
0 690 V
-31 -690 R
62 0 V
-62 690 R
62 0 V
83 -786 R
0 652 V
-31 -652 R
62 0 V
-62 652 R
62 0 V
84 -812 R
0 577 V
-31 -577 R
62 0 V
-62 577 R
62 0 V
83 -657 R
0 535 V
-31 -535 R
62 0 V
-62 535 R
62 0 V
84 -539 R
0 534 V
-31 -534 R
62 0 V
-62 534 R
62 0 V
83 -685 R
0 441 V
-31 -441 R
62 0 V
-62 441 R
62 0 V
84 -455 R
0 431 V
-31 -431 R
62 0 V
-62 431 R
62 0 V
83 -441 R
0 424 V
-31 -424 R
62 0 V
-62 424 R
62 0 V
84 -407 R
0 436 V
-31 -436 R
62 0 V
-62 436 R
62 0 V
83 -443 R
0 431 V
-31 -431 R
62 0 V
stroke 3481 1122 M
-62 431 R
62 0 V
84 -496 R
0 378 V
-31 -378 R
62 0 V
-62 378 R
62 0 V
83 -422 R
0 338 V
-31 -338 R
62 0 V
-62 338 R
62 0 V
86 -347 R
0 328 V
-31 -328 R
62 0 V
-62 328 R
62 0 V
84 -310 R
0 347 V
-31 -347 R
62 0 V
-62 347 R
62 0 V
83 -388 R
0 301 V
3994 981 M
62 0 V
-62 301 R
62 0 V
84 -281 R
0 325 V
-31 -325 R
62 0 V
-62 325 R
62 0 V
83 -340 R
0 308 V
4223 986 M
62 0 V
-62 308 R
62 0 V
84 -305 R
0 312 V
4338 989 M
62 0 V
-62 312 R
62 0 V
83 -326 R
0 294 V
4452 975 M
62 0 V
-62 294 R
62 0 V
84 -268 R
0 325 V
-31 -325 R
62 0 V
-62 325 R
62 0 V
83 -354 R
0 291 V
4681 972 M
62 0 V
-62 291 R
62 0 V
84 -315 R
0 256 V
4796 948 M
62 0 V
-62 256 R
62 0 V
83 -270 R
0 229 V
4910 934 M
62 0 V
-62 229 R
62 0 V
84 -180 R
0 305 V
5025 983 M
62 0 V
-62 305 R
62 0 V
83 -357 R
0 225 V
5139 931 M
62 0 V
-62 225 R
62 0 V
84 -197 R
0 271 V
5254 959 M
62 0 V
-62 271 R
62 0 V
83 -269 R
0 276 V
5368 961 M
62 0 V
-62 276 R
62 0 V
stroke 5430 1237 M
84 -301 R
0 234 V
5483 936 M
62 0 V
-62 234 R
62 0 V
86 -232 R
0 239 V
5600 938 M
62 0 V
-62 239 R
62 0 V
83 -258 R
0 195 V
5714 919 M
62 0 V
-62 195 R
62 0 V
84 -185 R
0 220 V
5829 929 M
62 0 V
-62 220 R
62 0 V
83 -232 R
0 189 V
5943 917 M
62 0 V
-62 189 R
62 0 V
84 -185 R
0 200 V
6058 921 M
62 0 V
-62 200 R
62 0 V
83 -206 R
0 184 V
6172 915 M
62 0 V
-62 184 R
62 0 V
84 -194 R
0 130 V
6287 905 M
62 0 V
-62 130 R
62 0 V
83 -112 R
0 205 V
6401 923 M
62 0 V
-62 205 R
62 0 V
84 -205 R
0 205 V
6516 923 M
62 0 V
-62 205 R
62 0 V
83 -209 R
0 195 V
6630 919 M
62 0 V
-62 195 R
62 0 V
84 -185 R
0 220 V
6745 929 M
58 0 V
-58 220 R
58 0 V
1616 3047 BoxF
1731 2909 BoxF
1845 2624 BoxF
1960 2197 BoxF
2074 2165 BoxF
2189 2280 BoxF
2305 1999 BoxF
2420 1972 BoxF
2534 1857 BoxF
2649 1660 BoxF
2763 1558 BoxF
2878 1554 BoxF
2992 1356 BoxF
3107 1338 BoxF
3221 1324 BoxF
3336 1347 BoxF
3450 1338 BoxF
3565 1246 BoxF
3679 1182 BoxF
3796 1168 BoxF
3911 1196 BoxF
4025 1131 BoxF
4140 1163 BoxF
4254 1140 BoxF
4369 1145 BoxF
4483 1122 BoxF
4598 1163 BoxF
4712 1117 BoxF
4827 1076 BoxF
4941 1049 BoxF
5056 1136 BoxF
5170 1044 BoxF
5285 1094 BoxF
5399 1099 BoxF
5514 1053 BoxF
5631 1058 BoxF
5745 1016 BoxF
5860 1039 BoxF
5974 1012 BoxF
6089 1021 BoxF
6203 1007 BoxF
6318 970 BoxF
6432 1026 BoxF
6547 1026 BoxF
6661 1016 BoxF
6776 1039 BoxF
6243 3326 BoxF
1.000 UL
LTb
LCb setrgbcolor
1078 4379 N
0 -3675 V
5725 0 V
0 3675 V
-5725 0 V
Z stroke
1.000 UP
1.000 UL
LTb
stroke
grestore
end
showpage
%%Trailer
