%!PS-Adobe-2.0 EPSF-2.0
%%Title: plot4min.tex
%%Creator: gnuplot 4.6 patchlevel 4
%%CreationDate: Thu Mar 12 21:06:25 2015
%%DocumentFonts: 
%%BoundingBox: 50 50 410 302
%%EndComments
%%BeginProlog
/gnudict 256 dict def
gnudict begin
%
% The following true/false flags may be edited by hand if desired.
% The unit line width and grayscale image gamma correction may also be changed.
%
/Color true def
/Blacktext true def
/Solid true def
/Dashlength 1 def
/Landscape false def
/Level1 false def
/Rounded false def
/ClipToBoundingBox false def
/SuppressPDFMark false def
/TransparentPatterns false def
/gnulinewidth 5.000 def
/userlinewidth gnulinewidth def
/Gamma 1.0 def
/BackgroundColor {-1.000 -1.000 -1.000} def
%
/vshift -73 def
/dl1 {
  10.0 Dashlength mul mul
  Rounded { currentlinewidth 0.75 mul sub dup 0 le { pop 0.01 } if } if
} def
/dl2 {
  10.0 Dashlength mul mul
  Rounded { currentlinewidth 0.75 mul add } if
} def
/hpt_ 31.5 def
/vpt_ 31.5 def
/hpt hpt_ def
/vpt vpt_ def
/doclip {
  ClipToBoundingBox {
    newpath 50 50 moveto 410 50 lineto 410 302 lineto 50 302 lineto closepath
    clip
  } if
} def
%
% Gnuplot Prolog Version 4.6 (September 2012)
%
%/SuppressPDFMark true def
%
/M {moveto} bind def
/L {lineto} bind def
/R {rmoveto} bind def
/V {rlineto} bind def
/N {newpath moveto} bind def
/Z {closepath} bind def
/C {setrgbcolor} bind def
/f {rlineto fill} bind def
/g {setgray} bind def
/Gshow {show} def   % May be redefined later in the file to support UTF-8
/vpt2 vpt 2 mul def
/hpt2 hpt 2 mul def
/Lshow {currentpoint stroke M 0 vshift R 
	Blacktext {gsave 0 setgray show grestore} {show} ifelse} def
/Rshow {currentpoint stroke M dup stringwidth pop neg vshift R
	Blacktext {gsave 0 setgray show grestore} {show} ifelse} def
/Cshow {currentpoint stroke M dup stringwidth pop -2 div vshift R 
	Blacktext {gsave 0 setgray show grestore} {show} ifelse} def
/UP {dup vpt_ mul /vpt exch def hpt_ mul /hpt exch def
  /hpt2 hpt 2 mul def /vpt2 vpt 2 mul def} def
/DL {Color {setrgbcolor Solid {pop []} if 0 setdash}
 {pop pop pop 0 setgray Solid {pop []} if 0 setdash} ifelse} def
/BL {stroke userlinewidth 2 mul setlinewidth
	Rounded {1 setlinejoin 1 setlinecap} if} def
/AL {stroke userlinewidth 2 div setlinewidth
	Rounded {1 setlinejoin 1 setlinecap} if} def
/UL {dup gnulinewidth mul /userlinewidth exch def
	dup 1 lt {pop 1} if 10 mul /udl exch def} def
/PL {stroke userlinewidth setlinewidth
	Rounded {1 setlinejoin 1 setlinecap} if} def
3.8 setmiterlimit
% Default Line colors
/LCw {1 1 1} def
/LCb {0 0 0} def
/LCa {0 0 0} def
/LC0 {1 0 0} def
/LC1 {0 1 0} def
/LC2 {0 0 1} def
/LC3 {1 0 1} def
/LC4 {0 1 1} def
/LC5 {1 1 0} def
/LC6 {0 0 0} def
/LC7 {1 0.3 0} def
/LC8 {0.5 0.5 0.5} def
% Default Line Types
/LTw {PL [] 1 setgray} def
/LTb {BL [] LCb DL} def
/LTa {AL [1 udl mul 2 udl mul] 0 setdash LCa setrgbcolor} def
/LT0 {PL [] LC0 DL} def
/LT1 {PL [4 dl1 2 dl2] LC1 DL} def
/LT2 {PL [2 dl1 3 dl2] LC2 DL} def
/LT3 {PL [1 dl1 1.5 dl2] LC3 DL} def
/LT4 {PL [6 dl1 2 dl2 1 dl1 2 dl2] LC4 DL} def
/LT5 {PL [3 dl1 3 dl2 1 dl1 3 dl2] LC5 DL} def
/LT6 {PL [2 dl1 2 dl2 2 dl1 6 dl2] LC6 DL} def
/LT7 {PL [1 dl1 2 dl2 6 dl1 2 dl2 1 dl1 2 dl2] LC7 DL} def
/LT8 {PL [2 dl1 2 dl2 2 dl1 2 dl2 2 dl1 2 dl2 2 dl1 4 dl2] LC8 DL} def
/Pnt {stroke [] 0 setdash gsave 1 setlinecap M 0 0 V stroke grestore} def
/Dia {stroke [] 0 setdash 2 copy vpt add M
  hpt neg vpt neg V hpt vpt neg V
  hpt vpt V hpt neg vpt V closepath stroke
  Pnt} def
/Pls {stroke [] 0 setdash vpt sub M 0 vpt2 V
  currentpoint stroke M
  hpt neg vpt neg R hpt2 0 V stroke
 } def
/Box {stroke [] 0 setdash 2 copy exch hpt sub exch vpt add M
  0 vpt2 neg V hpt2 0 V 0 vpt2 V
  hpt2 neg 0 V closepath stroke
  Pnt} def
/Crs {stroke [] 0 setdash exch hpt sub exch vpt add M
  hpt2 vpt2 neg V currentpoint stroke M
  hpt2 neg 0 R hpt2 vpt2 V stroke} def
/TriU {stroke [] 0 setdash 2 copy vpt 1.12 mul add M
  hpt neg vpt -1.62 mul V
  hpt 2 mul 0 V
  hpt neg vpt 1.62 mul V closepath stroke
  Pnt} def
/Star {2 copy Pls Crs} def
/BoxF {stroke [] 0 setdash exch hpt sub exch vpt add M
  0 vpt2 neg V hpt2 0 V 0 vpt2 V
  hpt2 neg 0 V closepath fill} def
/TriUF {stroke [] 0 setdash vpt 1.12 mul add M
  hpt neg vpt -1.62 mul V
  hpt 2 mul 0 V
  hpt neg vpt 1.62 mul V closepath fill} def
/TriD {stroke [] 0 setdash 2 copy vpt 1.12 mul sub M
  hpt neg vpt 1.62 mul V
  hpt 2 mul 0 V
  hpt neg vpt -1.62 mul V closepath stroke
  Pnt} def
/TriDF {stroke [] 0 setdash vpt 1.12 mul sub M
  hpt neg vpt 1.62 mul V
  hpt 2 mul 0 V
  hpt neg vpt -1.62 mul V closepath fill} def
/DiaF {stroke [] 0 setdash vpt add M
  hpt neg vpt neg V hpt vpt neg V
  hpt vpt V hpt neg vpt V closepath fill} def
/Pent {stroke [] 0 setdash 2 copy gsave
  translate 0 hpt M 4 {72 rotate 0 hpt L} repeat
  closepath stroke grestore Pnt} def
/PentF {stroke [] 0 setdash gsave
  translate 0 hpt M 4 {72 rotate 0 hpt L} repeat
  closepath fill grestore} def
/Circle {stroke [] 0 setdash 2 copy
  hpt 0 360 arc stroke Pnt} def
/CircleF {stroke [] 0 setdash hpt 0 360 arc fill} def
/C0 {BL [] 0 setdash 2 copy moveto vpt 90 450 arc} bind def
/C1 {BL [] 0 setdash 2 copy moveto
	2 copy vpt 0 90 arc closepath fill
	vpt 0 360 arc closepath} bind def
/C2 {BL [] 0 setdash 2 copy moveto
	2 copy vpt 90 180 arc closepath fill
	vpt 0 360 arc closepath} bind def
/C3 {BL [] 0 setdash 2 copy moveto
	2 copy vpt 0 180 arc closepath fill
	vpt 0 360 arc closepath} bind def
/C4 {BL [] 0 setdash 2 copy moveto
	2 copy vpt 180 270 arc closepath fill
	vpt 0 360 arc closepath} bind def
/C5 {BL [] 0 setdash 2 copy moveto
	2 copy vpt 0 90 arc
	2 copy moveto
	2 copy vpt 180 270 arc closepath fill
	vpt 0 360 arc} bind def
/C6 {BL [] 0 setdash 2 copy moveto
	2 copy vpt 90 270 arc closepath fill
	vpt 0 360 arc closepath} bind def
/C7 {BL [] 0 setdash 2 copy moveto
	2 copy vpt 0 270 arc closepath fill
	vpt 0 360 arc closepath} bind def
/C8 {BL [] 0 setdash 2 copy moveto
	2 copy vpt 270 360 arc closepath fill
	vpt 0 360 arc closepath} bind def
/C9 {BL [] 0 setdash 2 copy moveto
	2 copy vpt 270 450 arc closepath fill
	vpt 0 360 arc closepath} bind def
/C10 {BL [] 0 setdash 2 copy 2 copy moveto vpt 270 360 arc closepath fill
	2 copy moveto
	2 copy vpt 90 180 arc closepath fill
	vpt 0 360 arc closepath} bind def
/C11 {BL [] 0 setdash 2 copy moveto
	2 copy vpt 0 180 arc closepath fill
	2 copy moveto
	2 copy vpt 270 360 arc closepath fill
	vpt 0 360 arc closepath} bind def
/C12 {BL [] 0 setdash 2 copy moveto
	2 copy vpt 180 360 arc closepath fill
	vpt 0 360 arc closepath} bind def
/C13 {BL [] 0 setdash 2 copy moveto
	2 copy vpt 0 90 arc closepath fill
	2 copy moveto
	2 copy vpt 180 360 arc closepath fill
	vpt 0 360 arc closepath} bind def
/C14 {BL [] 0 setdash 2 copy moveto
	2 copy vpt 90 360 arc closepath fill
	vpt 0 360 arc} bind def
/C15 {BL [] 0 setdash 2 copy vpt 0 360 arc closepath fill
	vpt 0 360 arc closepath} bind def
/Rec {newpath 4 2 roll moveto 1 index 0 rlineto 0 exch rlineto
	neg 0 rlineto closepath} bind def
/Square {dup Rec} bind def
/Bsquare {vpt sub exch vpt sub exch vpt2 Square} bind def
/S0 {BL [] 0 setdash 2 copy moveto 0 vpt rlineto BL Bsquare} bind def
/S1 {BL [] 0 setdash 2 copy vpt Square fill Bsquare} bind def
/S2 {BL [] 0 setdash 2 copy exch vpt sub exch vpt Square fill Bsquare} bind def
/S3 {BL [] 0 setdash 2 copy exch vpt sub exch vpt2 vpt Rec fill Bsquare} bind def
/S4 {BL [] 0 setdash 2 copy exch vpt sub exch vpt sub vpt Square fill Bsquare} bind def
/S5 {BL [] 0 setdash 2 copy 2 copy vpt Square fill
	exch vpt sub exch vpt sub vpt Square fill Bsquare} bind def
/S6 {BL [] 0 setdash 2 copy exch vpt sub exch vpt sub vpt vpt2 Rec fill Bsquare} bind def
/S7 {BL [] 0 setdash 2 copy exch vpt sub exch vpt sub vpt vpt2 Rec fill
	2 copy vpt Square fill Bsquare} bind def
/S8 {BL [] 0 setdash 2 copy vpt sub vpt Square fill Bsquare} bind def
/S9 {BL [] 0 setdash 2 copy vpt sub vpt vpt2 Rec fill Bsquare} bind def
/S10 {BL [] 0 setdash 2 copy vpt sub vpt Square fill 2 copy exch vpt sub exch vpt Square fill
	Bsquare} bind def
/S11 {BL [] 0 setdash 2 copy vpt sub vpt Square fill 2 copy exch vpt sub exch vpt2 vpt Rec fill
	Bsquare} bind def
/S12 {BL [] 0 setdash 2 copy exch vpt sub exch vpt sub vpt2 vpt Rec fill Bsquare} bind def
/S13 {BL [] 0 setdash 2 copy exch vpt sub exch vpt sub vpt2 vpt Rec fill
	2 copy vpt Square fill Bsquare} bind def
/S14 {BL [] 0 setdash 2 copy exch vpt sub exch vpt sub vpt2 vpt Rec fill
	2 copy exch vpt sub exch vpt Square fill Bsquare} bind def
/S15 {BL [] 0 setdash 2 copy Bsquare fill Bsquare} bind def
/D0 {gsave translate 45 rotate 0 0 S0 stroke grestore} bind def
/D1 {gsave translate 45 rotate 0 0 S1 stroke grestore} bind def
/D2 {gsave translate 45 rotate 0 0 S2 stroke grestore} bind def
/D3 {gsave translate 45 rotate 0 0 S3 stroke grestore} bind def
/D4 {gsave translate 45 rotate 0 0 S4 stroke grestore} bind def
/D5 {gsave translate 45 rotate 0 0 S5 stroke grestore} bind def
/D6 {gsave translate 45 rotate 0 0 S6 stroke grestore} bind def
/D7 {gsave translate 45 rotate 0 0 S7 stroke grestore} bind def
/D8 {gsave translate 45 rotate 0 0 S8 stroke grestore} bind def
/D9 {gsave translate 45 rotate 0 0 S9 stroke grestore} bind def
/D10 {gsave translate 45 rotate 0 0 S10 stroke grestore} bind def
/D11 {gsave translate 45 rotate 0 0 S11 stroke grestore} bind def
/D12 {gsave translate 45 rotate 0 0 S12 stroke grestore} bind def
/D13 {gsave translate 45 rotate 0 0 S13 stroke grestore} bind def
/D14 {gsave translate 45 rotate 0 0 S14 stroke grestore} bind def
/D15 {gsave translate 45 rotate 0 0 S15 stroke grestore} bind def
/DiaE {stroke [] 0 setdash vpt add M
  hpt neg vpt neg V hpt vpt neg V
  hpt vpt V hpt neg vpt V closepath stroke} def
/BoxE {stroke [] 0 setdash exch hpt sub exch vpt add M
  0 vpt2 neg V hpt2 0 V 0 vpt2 V
  hpt2 neg 0 V closepath stroke} def
/TriUE {stroke [] 0 setdash vpt 1.12 mul add M
  hpt neg vpt -1.62 mul V
  hpt 2 mul 0 V
  hpt neg vpt 1.62 mul V closepath stroke} def
/TriDE {stroke [] 0 setdash vpt 1.12 mul sub M
  hpt neg vpt 1.62 mul V
  hpt 2 mul 0 V
  hpt neg vpt -1.62 mul V closepath stroke} def
/PentE {stroke [] 0 setdash gsave
  translate 0 hpt M 4 {72 rotate 0 hpt L} repeat
  closepath stroke grestore} def
/CircE {stroke [] 0 setdash 
  hpt 0 360 arc stroke} def
/Opaque {gsave closepath 1 setgray fill grestore 0 setgray closepath} def
/DiaW {stroke [] 0 setdash vpt add M
  hpt neg vpt neg V hpt vpt neg V
  hpt vpt V hpt neg vpt V Opaque stroke} def
/BoxW {stroke [] 0 setdash exch hpt sub exch vpt add M
  0 vpt2 neg V hpt2 0 V 0 vpt2 V
  hpt2 neg 0 V Opaque stroke} def
/TriUW {stroke [] 0 setdash vpt 1.12 mul add M
  hpt neg vpt -1.62 mul V
  hpt 2 mul 0 V
  hpt neg vpt 1.62 mul V Opaque stroke} def
/TriDW {stroke [] 0 setdash vpt 1.12 mul sub M
  hpt neg vpt 1.62 mul V
  hpt 2 mul 0 V
  hpt neg vpt -1.62 mul V Opaque stroke} def
/PentW {stroke [] 0 setdash gsave
  translate 0 hpt M 4 {72 rotate 0 hpt L} repeat
  Opaque stroke grestore} def
/CircW {stroke [] 0 setdash 
  hpt 0 360 arc Opaque stroke} def
/BoxFill {gsave Rec 1 setgray fill grestore} def
/Density {
  /Fillden exch def
  currentrgbcolor
  /ColB exch def /ColG exch def /ColR exch def
  /ColR ColR Fillden mul Fillden sub 1 add def
  /ColG ColG Fillden mul Fillden sub 1 add def
  /ColB ColB Fillden mul Fillden sub 1 add def
  ColR ColG ColB setrgbcolor} def
/BoxColFill {gsave Rec PolyFill} def
/PolyFill {gsave Density fill grestore grestore} def
/h {rlineto rlineto rlineto gsave closepath fill grestore} bind def
%
% PostScript Level 1 Pattern Fill routine for rectangles
% Usage: x y w h s a XX PatternFill
%	x,y = lower left corner of box to be filled
%	w,h = width and height of box
%	  a = angle in degrees between lines and x-axis
%	 XX = 0/1 for no/yes cross-hatch
%
/PatternFill {gsave /PFa [ 9 2 roll ] def
  PFa 0 get PFa 2 get 2 div add PFa 1 get PFa 3 get 2 div add translate
  PFa 2 get -2 div PFa 3 get -2 div PFa 2 get PFa 3 get Rec
  TransparentPatterns {} {gsave 1 setgray fill grestore} ifelse
  clip
  currentlinewidth 0.5 mul setlinewidth
  /PFs PFa 2 get dup mul PFa 3 get dup mul add sqrt def
  0 0 M PFa 5 get rotate PFs -2 div dup translate
  0 1 PFs PFa 4 get div 1 add floor cvi
	{PFa 4 get mul 0 M 0 PFs V} for
  0 PFa 6 get ne {
	0 1 PFs PFa 4 get div 1 add floor cvi
	{PFa 4 get mul 0 2 1 roll M PFs 0 V} for
 } if
  stroke grestore} def
%
/languagelevel where
 {pop languagelevel} {1} ifelse
 2 lt
	{/InterpretLevel1 true def}
	{/InterpretLevel1 Level1 def}
 ifelse
%
% PostScript level 2 pattern fill definitions
%
/Level2PatternFill {
/Tile8x8 {/PaintType 2 /PatternType 1 /TilingType 1 /BBox [0 0 8 8] /XStep 8 /YStep 8}
	bind def
/KeepColor {currentrgbcolor [/Pattern /DeviceRGB] setcolorspace} bind def
<< Tile8x8
 /PaintProc {0.5 setlinewidth pop 0 0 M 8 8 L 0 8 M 8 0 L stroke} 
>> matrix makepattern
/Pat1 exch def
<< Tile8x8
 /PaintProc {0.5 setlinewidth pop 0 0 M 8 8 L 0 8 M 8 0 L stroke
	0 4 M 4 8 L 8 4 L 4 0 L 0 4 L stroke}
>> matrix makepattern
/Pat2 exch def
<< Tile8x8
 /PaintProc {0.5 setlinewidth pop 0 0 M 0 8 L
	8 8 L 8 0 L 0 0 L fill}
>> matrix makepattern
/Pat3 exch def
<< Tile8x8
 /PaintProc {0.5 setlinewidth pop -4 8 M 8 -4 L
	0 12 M 12 0 L stroke}
>> matrix makepattern
/Pat4 exch def
<< Tile8x8
 /PaintProc {0.5 setlinewidth pop -4 0 M 8 12 L
	0 -4 M 12 8 L stroke}
>> matrix makepattern
/Pat5 exch def
<< Tile8x8
 /PaintProc {0.5 setlinewidth pop -2 8 M 4 -4 L
	0 12 M 8 -4 L 4 12 M 10 0 L stroke}
>> matrix makepattern
/Pat6 exch def
<< Tile8x8
 /PaintProc {0.5 setlinewidth pop -2 0 M 4 12 L
	0 -4 M 8 12 L 4 -4 M 10 8 L stroke}
>> matrix makepattern
/Pat7 exch def
<< Tile8x8
 /PaintProc {0.5 setlinewidth pop 8 -2 M -4 4 L
	12 0 M -4 8 L 12 4 M 0 10 L stroke}
>> matrix makepattern
/Pat8 exch def
<< Tile8x8
 /PaintProc {0.5 setlinewidth pop 0 -2 M 12 4 L
	-4 0 M 12 8 L -4 4 M 8 10 L stroke}
>> matrix makepattern
/Pat9 exch def
/Pattern1 {PatternBgnd KeepColor Pat1 setpattern} bind def
/Pattern2 {PatternBgnd KeepColor Pat2 setpattern} bind def
/Pattern3 {PatternBgnd KeepColor Pat3 setpattern} bind def
/Pattern4 {PatternBgnd KeepColor Landscape {Pat5} {Pat4} ifelse setpattern} bind def
/Pattern5 {PatternBgnd KeepColor Landscape {Pat4} {Pat5} ifelse setpattern} bind def
/Pattern6 {PatternBgnd KeepColor Landscape {Pat9} {Pat6} ifelse setpattern} bind def
/Pattern7 {PatternBgnd KeepColor Landscape {Pat8} {Pat7} ifelse setpattern} bind def
} def
%
%
%End of PostScript Level 2 code
%
/PatternBgnd {
  TransparentPatterns {} {gsave 1 setgray fill grestore} ifelse
} def
%
% Substitute for Level 2 pattern fill codes with
% grayscale if Level 2 support is not selected.
%
/Level1PatternFill {
/Pattern1 {0.250 Density} bind def
/Pattern2 {0.500 Density} bind def
/Pattern3 {0.750 Density} bind def
/Pattern4 {0.125 Density} bind def
/Pattern5 {0.375 Density} bind def
/Pattern6 {0.625 Density} bind def
/Pattern7 {0.875 Density} bind def
} def
%
% Now test for support of Level 2 code
%
Level1 {Level1PatternFill} {Level2PatternFill} ifelse
%
/Symbol-Oblique /Symbol findfont [1 0 .167 1 0 0] makefont
dup length dict begin {1 index /FID eq {pop pop} {def} ifelse} forall
currentdict end definefont pop
Level1 SuppressPDFMark or 
{} {
/SDict 10 dict def
systemdict /pdfmark known not {
  userdict /pdfmark systemdict /cleartomark get put
} if
SDict begin [
  /Title (plot4min.tex)
  /Subject (gnuplot plot)
  /Creator (gnuplot 4.6 patchlevel 4)
  /Author (eric)
%  /Producer (gnuplot)
%  /Keywords ()
  /CreationDate (Thu Mar 12 21:06:25 2015)
  /DOCINFO pdfmark
end
} ifelse
end
%%EndProlog
%%Page: 1 1
gnudict begin
gsave
doclip
50 50 translate
0.050 0.050 scale
0 setgray
newpath
1.000 UL
LTb
LCb setrgbcolor
1078 934 M
63 0 V
5662 0 R
-63 0 V
stroke
LTb
1078 1393 M
63 0 V
5662 0 R
-63 0 V
1078 1852 M
63 0 V
5662 0 R
-63 0 V
1078 2312 M
63 0 V
5662 0 R
-63 0 V
1078 2771 M
63 0 V
5662 0 R
-63 0 V
1078 3231 M
63 0 V
5662 0 R
-63 0 V
1078 3690 M
63 0 V
5662 0 R
-63 0 V
1078 4149 M
63 0 V
5662 0 R
-63 0 V
1078 704 M
0 63 V
0 3612 R
0 -63 V
2223 704 M
0 63 V
0 3612 R
0 -63 V
3368 704 M
0 63 V
0 3612 R
0 -63 V
4513 704 M
0 63 V
0 3612 R
0 -63 V
5658 704 M
0 63 V
0 3612 R
0 -63 V
6803 704 M
0 63 V
0 3612 R
0 -63 V
stroke
1078 4379 N
0 -3675 V
5725 0 V
0 3675 V
-5725 0 V
Z stroke
1.000 UP
1.000 UL
LTb
1.000 UL
LT0
LC0 setrgbcolor
LCb setrgbcolor
LT0
LC0 setrgbcolor
5948 4206 M
591 0 V
1328 4379 M
39 -157 V
58 -218 V
58 -205 V
58 -190 V
57 -178 V
58 -166 V
58 -155 V
58 -145 V
58 -135 V
58 -126 V
57 -118 V
58 -110 V
58 -102 V
58 -96 V
58 -89 V
58 -84 V
57 -77 V
58 -73 V
58 -68 V
58 -63 V
58 -59 V
58 -55 V
57 -52 V
58 -48 V
58 -45 V
58 -42 V
58 -39 V
58 -36 V
57 -34 V
58 -32 V
58 -30 V
58 -27 V
58 -26 V
57 -24 V
58 -23 V
58 -21 V
58 -19 V
58 -19 V
58 -17 V
57 -16 V
58 -15 V
58 -13 V
58 -13 V
58 -12 V
58 -12 V
57 -10 V
58 -10 V
58 -9 V
58 -9 V
58 -8 V
58 -7 V
57 -7 V
58 -7 V
58 -6 V
58 -6 V
58 -5 V
58 -5 V
57 -4 V
58 -5 V
58 -4 V
58 -4 V
58 -3 V
57 -3 V
58 -3 V
58 -3 V
58 -3 V
58 -2 V
58 -3 V
57 -2 V
58 -2 V
58 -2 V
58 -1 V
58 -2 V
58 -2 V
57 -1 V
58 -1 V
58 -2 V
58 -1 V
58 -1 V
58 -1 V
57 -1 V
58 -1 V
58 -1 V
58 0 V
58 -1 V
58 -1 V
57 0 V
58 -1 V
58 0 V
58 -1 V
58 0 V
58 -1 V
57 0 V
58 -1 V
58 0 V
stroke
LT1
LC1 setrgbcolor
LCb setrgbcolor
LT1
LC1 setrgbcolor
5948 3986 M
591 0 V
1078 1481 M
58 -7 V
58 -6 V
57 -7 V
58 -6 V
58 -7 V
58 -6 V
58 -6 V
58 -6 V
57 -6 V
58 -6 V
58 -6 V
58 -6 V
58 -5 V
58 -6 V
57 -5 V
58 -6 V
58 -5 V
58 -6 V
58 -5 V
58 -5 V
57 -6 V
58 -5 V
58 -5 V
58 -5 V
58 -5 V
58 -5 V
57 -4 V
58 -5 V
58 -5 V
58 -4 V
58 -5 V
58 -5 V
57 -4 V
58 -4 V
58 -5 V
58 -4 V
58 -4 V
57 -5 V
58 -4 V
58 -4 V
58 -4 V
58 -4 V
58 -4 V
57 -4 V
58 -4 V
58 -4 V
58 -3 V
58 -4 V
58 -4 V
57 -3 V
58 -4 V
58 -3 V
58 -4 V
58 -3 V
58 -4 V
57 -3 V
58 -4 V
58 -3 V
58 -3 V
58 -3 V
58 -3 V
57 -4 V
58 -3 V
58 -3 V
58 -3 V
58 -3 V
57 -3 V
58 -3 V
58 -3 V
58 -2 V
58 -3 V
58 -3 V
57 -3 V
58 -2 V
58 -3 V
58 -3 V
58 -2 V
58 -3 V
57 -2 V
58 -3 V
58 -2 V
58 -3 V
58 -2 V
58 -3 V
57 -2 V
58 -2 V
58 -3 V
58 -2 V
58 -2 V
58 -3 V
57 -2 V
58 -2 V
58 -2 V
58 -2 V
58 -2 V
58 -2 V
57 -2 V
58 -2 V
58 -2 V
stroke
LT2
LC2 setrgbcolor
LCb setrgbcolor
LT2
LC2 setrgbcolor
5948 3766 M
591 0 V
1461 4379 M
22 -81 V
58 -196 V
57 -184 V
58 -172 V
58 -161 V
58 -151 V
58 -140 V
58 -132 V
57 -123 V
58 -116 V
58 -108 V
58 -101 V
58 -94 V
58 -89 V
57 -83 V
58 -78 V
58 -73 V
58 -68 V
58 -64 V
58 -60 V
57 -56 V
58 -53 V
58 -49 V
58 -47 V
58 -44 V
58 -41 V
57 -38 V
58 -36 V
58 -34 V
58 -32 V
58 -30 V
57 -29 V
58 -26 V
58 -25 V
58 -24 V
58 -22 V
58 -22 V
57 -19 V
58 -19 V
58 -18 V
58 -17 V
58 -15 V
58 -15 V
57 -15 V
58 -13 V
58 -13 V
58 -12 V
58 -11 V
58 -11 V
57 -10 V
58 -10 V
58 -10 V
58 -9 V
58 -8 V
58 -8 V
57 -8 V
58 -7 V
58 -7 V
58 -7 V
58 -7 V
57 -6 V
58 -6 V
58 -6 V
58 -5 V
58 -5 V
58 -6 V
57 -4 V
58 -5 V
58 -5 V
58 -4 V
58 -4 V
58 -4 V
57 -4 V
58 -4 V
58 -4 V
58 -4 V
58 -3 V
58 -4 V
57 -3 V
58 -3 V
58 -3 V
58 -3 V
58 -3 V
58 -3 V
57 -3 V
58 -3 V
58 -2 V
58 -3 V
58 -3 V
58 -2 V
57 -3 V
58 -2 V
58 -2 V
stroke
LT3
LC3 setrgbcolor
LCb setrgbcolor
LT3
LC3 setrgbcolor
5948 3546 M
591 0 V
1078 937 M
58 0 V
58 0 V
57 0 V
58 0 V
58 0 V
58 0 V
58 0 V
58 0 V
57 0 V
58 0 V
58 0 V
58 0 V
58 0 V
58 0 V
57 0 V
58 0 V
58 0 V
58 0 V
58 0 V
58 0 V
57 0 V
58 0 V
58 0 V
58 0 V
58 0 V
58 0 V
57 0 V
58 0 V
58 0 V
58 0 V
58 0 V
58 0 V
57 0 V
58 0 V
58 0 V
58 0 V
58 0 V
57 0 V
58 0 V
58 0 V
58 0 V
58 0 V
58 0 V
57 0 V
58 0 V
58 0 V
58 0 V
58 0 V
58 0 V
57 0 V
58 0 V
58 0 V
58 0 V
58 0 V
58 0 V
57 0 V
58 0 V
58 0 V
58 0 V
58 0 V
58 0 V
57 0 V
58 0 V
58 0 V
58 0 V
58 0 V
57 0 V
58 0 V
58 0 V
58 0 V
58 0 V
58 0 V
57 0 V
58 0 V
58 0 V
58 0 V
58 0 V
58 0 V
57 0 V
58 0 V
58 0 V
58 0 V
58 0 V
58 0 V
57 0 V
58 0 V
58 0 V
58 0 V
58 0 V
58 0 V
57 0 V
58 0 V
58 0 V
58 0 V
58 0 V
58 0 V
57 0 V
58 0 V
58 0 V
1.000 UP
stroke
LT4
LC4 setrgbcolor
LCa setrgbcolor
LCb setrgbcolor
LT4
LC4 setrgbcolor
LCa setrgbcolor
5948 3326 M
591 0 V
-591 31 R
0 -62 V
591 62 R
0 -62 V
1662 3078 M
0 1114 V
1631 3078 M
62 0 V
-62 1114 R
62 0 V
83 -1168 R
0 1102 V
1745 3024 M
62 0 V
-62 1102 R
62 0 V
84 -1527 R
0 997 V
-31 -997 R
62 0 V
-62 997 R
62 0 V
83 -1304 R
0 913 V
-31 -913 R
62 0 V
-62 913 R
62 0 V
86 -784 R
0 949 V
-31 -949 R
62 0 V
-62 949 R
62 0 V
84 -1286 R
0 851 V
-31 -851 R
62 0 V
-62 851 R
62 0 V
83 -1064 R
0 781 V
-31 -781 R
62 0 V
-62 781 R
62 0 V
84 -655 R
0 823 V
-31 -823 R
62 0 V
-62 823 R
62 0 V
83 -1182 R
0 695 V
-31 -695 R
62 0 V
-62 695 R
62 0 V
84 -618 R
0 725 V
-31 -725 R
62 0 V
-62 725 R
62 0 V
83 -787 R
0 702 V
-31 -702 R
62 0 V
-62 702 R
62 0 V
84 -827 R
0 649 V
-31 -649 R
62 0 V
-62 649 R
62 0 V
83 -653 R
0 648 V
-31 -648 R
62 0 V
-62 648 R
62 0 V
84 -852 R
0 551 V
-31 -551 R
62 0 V
-62 551 R
62 0 V
83 -562 R
0 545 V
-31 -545 R
62 0 V
-62 545 R
62 0 V
84 -553 R
0 542 V
-31 -542 R
62 0 V
-62 542 R
62 0 V
83 -603 R
0 508 V
-31 -508 R
62 0 V
stroke 3527 1240 M
-62 508 R
62 0 V
86 -465 R
0 532 V
-31 -532 R
62 0 V
-62 532 R
62 0 V
84 -627 R
0 475 V
-31 -475 R
62 0 V
-62 475 R
62 0 V
83 -426 R
0 505 V
-31 -505 R
62 0 V
-62 505 R
62 0 V
84 -609 R
0 438 V
-31 -438 R
62 0 V
-62 438 R
62 0 V
83 -383 R
0 475 V
-31 -475 R
62 0 V
-62 475 R
62 0 V
84 -567 R
0 411 V
-31 -411 R
62 0 V
-62 411 R
62 0 V
83 -391 R
0 426 V
-31 -426 R
62 0 V
-62 426 R
62 0 V
84 -347 R
0 479 V
-31 -479 R
62 0 V
-62 479 R
62 0 V
83 -636 R
0 361 V
-31 -361 R
62 0 V
-62 361 R
62 0 V
84 -364 R
0 358 V
-31 -358 R
62 0 V
-62 358 R
62 0 V
83 -368 R
0 350 V
-31 -350 R
62 0 V
-62 350 R
62 0 V
84 -386 R
0 312 V
4842 989 M
62 0 V
-62 312 R
62 0 V
83 -225 R
0 395 V
-31 -395 R
62 0 V
-62 395 R
62 0 V
84 -467 R
0 328 V
-31 -328 R
62 0 V
-62 328 R
62 0 V
83 -343 R
0 312 V
5185 989 M
62 0 V
-62 312 R
62 0 V
84 -294 R
0 331 V
-31 -331 R
62 0 V
-62 331 R
62 0 V
83 -337 R
0 325 V
-31 -325 R
62 0 V
-62 325 R
62 0 V
stroke 5476 1326 M
86 -234 R
0 409 V
-31 -409 R
62 0 V
-62 409 R
62 0 V
83 -503 R
0 322 V
5645 998 M
62 0 V
-62 322 R
62 0 V
84 -313 R
0 331 V
-31 -331 R
62 0 V
-62 331 R
62 0 V
83 -325 R
0 338 V
-31 -338 R
62 0 V
-62 338 R
62 0 V
84 -347 R
0 328 V
-31 -328 R
62 0 V
-62 328 R
62 0 V
83 -346 R
0 308 V
6103 986 M
62 0 V
-62 308 R
62 0 V
84 -272 R
0 347 V
-31 -347 R
62 0 V
-62 347 R
62 0 V
83 -421 R
0 256 V
6332 948 M
62 0 V
-62 256 R
62 0 V
84 -240 R
0 279 V
6447 964 M
62 0 V
-62 279 R
62 0 V
83 -245 R
0 322 V
6561 998 M
62 0 V
-62 322 R
62 0 V
84 -342 R
0 297 V
6676 978 M
62 0 V
-62 297 R
62 0 V
1662 3635 BoxF
1776 3575 BoxF
1891 3097 BoxF
2005 2748 BoxF
2122 2895 BoxF
2237 2509 BoxF
2351 2261 BoxF
2466 2408 BoxF
2580 1986 BoxF
2695 2078 BoxF
2809 2004 BoxF
2924 1852 BoxF
3038 1848 BoxF
3153 1595 BoxF
3267 1581 BoxF
3382 1572 BoxF
3496 1494 BoxF
3613 1549 BoxF
3728 1425 BoxF
3842 1490 BoxF
3957 1352 BoxF
4071 1425 BoxF
4186 1301 BoxF
4300 1329 BoxF
4415 1434 BoxF
4529 1219 BoxF
4644 1214 BoxF
4758 1200 BoxF
4873 1145 BoxF
4987 1274 BoxF
5102 1168 BoxF
5216 1145 BoxF
5331 1173 BoxF
5445 1163 BoxF
5562 1297 BoxF
5676 1159 BoxF
5791 1173 BoxF
5905 1182 BoxF
6020 1168 BoxF
6134 1140 BoxF
6249 1196 BoxF
6363 1076 BoxF
6478 1104 BoxF
6592 1159 BoxF
6707 1127 BoxF
6243 3326 BoxF
1.000 UL
LTb
LCb setrgbcolor
1078 4379 N
0 -3675 V
5725 0 V
0 3675 V
-5725 0 V
Z stroke
1.000 UP
1.000 UL
LTb
stroke
grestore
end
showpage
%%Trailer
