%!PS-Adobe-2.0 EPSF-2.0
%%Title: plot8minlog.tex
%%Creator: gnuplot 4.6 patchlevel 4
%%CreationDate: Thu Mar 12 21:06:25 2015
%%DocumentFonts: 
%%BoundingBox: 50 50 410 302
%%EndComments
%%BeginProlog
/gnudict 256 dict def
gnudict begin
%
% The following true/false flags may be edited by hand if desired.
% The unit line width and grayscale image gamma correction may also be changed.
%
/Color true def
/Blacktext true def
/Solid true def
/Dashlength 1 def
/Landscape false def
/Level1 false def
/Rounded false def
/ClipToBoundingBox false def
/SuppressPDFMark false def
/TransparentPatterns false def
/gnulinewidth 5.000 def
/userlinewidth gnulinewidth def
/Gamma 1.0 def
/BackgroundColor {-1.000 -1.000 -1.000} def
%
/vshift -73 def
/dl1 {
  10.0 Dashlength mul mul
  Rounded { currentlinewidth 0.75 mul sub dup 0 le { pop 0.01 } if } if
} def
/dl2 {
  10.0 Dashlength mul mul
  Rounded { currentlinewidth 0.75 mul add } if
} def
/hpt_ 31.5 def
/vpt_ 31.5 def
/hpt hpt_ def
/vpt vpt_ def
/doclip {
  ClipToBoundingBox {
    newpath 50 50 moveto 410 50 lineto 410 302 lineto 50 302 lineto closepath
    clip
  } if
} def
%
% Gnuplot Prolog Version 4.6 (September 2012)
%
%/SuppressPDFMark true def
%
/M {moveto} bind def
/L {lineto} bind def
/R {rmoveto} bind def
/V {rlineto} bind def
/N {newpath moveto} bind def
/Z {closepath} bind def
/C {setrgbcolor} bind def
/f {rlineto fill} bind def
/g {setgray} bind def
/Gshow {show} def   % May be redefined later in the file to support UTF-8
/vpt2 vpt 2 mul def
/hpt2 hpt 2 mul def
/Lshow {currentpoint stroke M 0 vshift R 
	Blacktext {gsave 0 setgray show grestore} {show} ifelse} def
/Rshow {currentpoint stroke M dup stringwidth pop neg vshift R
	Blacktext {gsave 0 setgray show grestore} {show} ifelse} def
/Cshow {currentpoint stroke M dup stringwidth pop -2 div vshift R 
	Blacktext {gsave 0 setgray show grestore} {show} ifelse} def
/UP {dup vpt_ mul /vpt exch def hpt_ mul /hpt exch def
  /hpt2 hpt 2 mul def /vpt2 vpt 2 mul def} def
/DL {Color {setrgbcolor Solid {pop []} if 0 setdash}
 {pop pop pop 0 setgray Solid {pop []} if 0 setdash} ifelse} def
/BL {stroke userlinewidth 2 mul setlinewidth
	Rounded {1 setlinejoin 1 setlinecap} if} def
/AL {stroke userlinewidth 2 div setlinewidth
	Rounded {1 setlinejoin 1 setlinecap} if} def
/UL {dup gnulinewidth mul /userlinewidth exch def
	dup 1 lt {pop 1} if 10 mul /udl exch def} def
/PL {stroke userlinewidth setlinewidth
	Rounded {1 setlinejoin 1 setlinecap} if} def
3.8 setmiterlimit
% Default Line colors
/LCw {1 1 1} def
/LCb {0 0 0} def
/LCa {0 0 0} def
/LC0 {1 0 0} def
/LC1 {0 1 0} def
/LC2 {0 0 1} def
/LC3 {1 0 1} def
/LC4 {0 1 1} def
/LC5 {1 1 0} def
/LC6 {0 0 0} def
/LC7 {1 0.3 0} def
/LC8 {0.5 0.5 0.5} def
% Default Line Types
/LTw {PL [] 1 setgray} def
/LTb {BL [] LCb DL} def
/LTa {AL [1 udl mul 2 udl mul] 0 setdash LCa setrgbcolor} def
/LT0 {PL [] LC0 DL} def
/LT1 {PL [4 dl1 2 dl2] LC1 DL} def
/LT2 {PL [2 dl1 3 dl2] LC2 DL} def
/LT3 {PL [1 dl1 1.5 dl2] LC3 DL} def
/LT4 {PL [6 dl1 2 dl2 1 dl1 2 dl2] LC4 DL} def
/LT5 {PL [3 dl1 3 dl2 1 dl1 3 dl2] LC5 DL} def
/LT6 {PL [2 dl1 2 dl2 2 dl1 6 dl2] LC6 DL} def
/LT7 {PL [1 dl1 2 dl2 6 dl1 2 dl2 1 dl1 2 dl2] LC7 DL} def
/LT8 {PL [2 dl1 2 dl2 2 dl1 2 dl2 2 dl1 2 dl2 2 dl1 4 dl2] LC8 DL} def
/Pnt {stroke [] 0 setdash gsave 1 setlinecap M 0 0 V stroke grestore} def
/Dia {stroke [] 0 setdash 2 copy vpt add M
  hpt neg vpt neg V hpt vpt neg V
  hpt vpt V hpt neg vpt V closepath stroke
  Pnt} def
/Pls {stroke [] 0 setdash vpt sub M 0 vpt2 V
  currentpoint stroke M
  hpt neg vpt neg R hpt2 0 V stroke
 } def
/Box {stroke [] 0 setdash 2 copy exch hpt sub exch vpt add M
  0 vpt2 neg V hpt2 0 V 0 vpt2 V
  hpt2 neg 0 V closepath stroke
  Pnt} def
/Crs {stroke [] 0 setdash exch hpt sub exch vpt add M
  hpt2 vpt2 neg V currentpoint stroke M
  hpt2 neg 0 R hpt2 vpt2 V stroke} def
/TriU {stroke [] 0 setdash 2 copy vpt 1.12 mul add M
  hpt neg vpt -1.62 mul V
  hpt 2 mul 0 V
  hpt neg vpt 1.62 mul V closepath stroke
  Pnt} def
/Star {2 copy Pls Crs} def
/BoxF {stroke [] 0 setdash exch hpt sub exch vpt add M
  0 vpt2 neg V hpt2 0 V 0 vpt2 V
  hpt2 neg 0 V closepath fill} def
/TriUF {stroke [] 0 setdash vpt 1.12 mul add M
  hpt neg vpt -1.62 mul V
  hpt 2 mul 0 V
  hpt neg vpt 1.62 mul V closepath fill} def
/TriD {stroke [] 0 setdash 2 copy vpt 1.12 mul sub M
  hpt neg vpt 1.62 mul V
  hpt 2 mul 0 V
  hpt neg vpt -1.62 mul V closepath stroke
  Pnt} def
/TriDF {stroke [] 0 setdash vpt 1.12 mul sub M
  hpt neg vpt 1.62 mul V
  hpt 2 mul 0 V
  hpt neg vpt -1.62 mul V closepath fill} def
/DiaF {stroke [] 0 setdash vpt add M
  hpt neg vpt neg V hpt vpt neg V
  hpt vpt V hpt neg vpt V closepath fill} def
/Pent {stroke [] 0 setdash 2 copy gsave
  translate 0 hpt M 4 {72 rotate 0 hpt L} repeat
  closepath stroke grestore Pnt} def
/PentF {stroke [] 0 setdash gsave
  translate 0 hpt M 4 {72 rotate 0 hpt L} repeat
  closepath fill grestore} def
/Circle {stroke [] 0 setdash 2 copy
  hpt 0 360 arc stroke Pnt} def
/CircleF {stroke [] 0 setdash hpt 0 360 arc fill} def
/C0 {BL [] 0 setdash 2 copy moveto vpt 90 450 arc} bind def
/C1 {BL [] 0 setdash 2 copy moveto
	2 copy vpt 0 90 arc closepath fill
	vpt 0 360 arc closepath} bind def
/C2 {BL [] 0 setdash 2 copy moveto
	2 copy vpt 90 180 arc closepath fill
	vpt 0 360 arc closepath} bind def
/C3 {BL [] 0 setdash 2 copy moveto
	2 copy vpt 0 180 arc closepath fill
	vpt 0 360 arc closepath} bind def
/C4 {BL [] 0 setdash 2 copy moveto
	2 copy vpt 180 270 arc closepath fill
	vpt 0 360 arc closepath} bind def
/C5 {BL [] 0 setdash 2 copy moveto
	2 copy vpt 0 90 arc
	2 copy moveto
	2 copy vpt 180 270 arc closepath fill
	vpt 0 360 arc} bind def
/C6 {BL [] 0 setdash 2 copy moveto
	2 copy vpt 90 270 arc closepath fill
	vpt 0 360 arc closepath} bind def
/C7 {BL [] 0 setdash 2 copy moveto
	2 copy vpt 0 270 arc closepath fill
	vpt 0 360 arc closepath} bind def
/C8 {BL [] 0 setdash 2 copy moveto
	2 copy vpt 270 360 arc closepath fill
	vpt 0 360 arc closepath} bind def
/C9 {BL [] 0 setdash 2 copy moveto
	2 copy vpt 270 450 arc closepath fill
	vpt 0 360 arc closepath} bind def
/C10 {BL [] 0 setdash 2 copy 2 copy moveto vpt 270 360 arc closepath fill
	2 copy moveto
	2 copy vpt 90 180 arc closepath fill
	vpt 0 360 arc closepath} bind def
/C11 {BL [] 0 setdash 2 copy moveto
	2 copy vpt 0 180 arc closepath fill
	2 copy moveto
	2 copy vpt 270 360 arc closepath fill
	vpt 0 360 arc closepath} bind def
/C12 {BL [] 0 setdash 2 copy moveto
	2 copy vpt 180 360 arc closepath fill
	vpt 0 360 arc closepath} bind def
/C13 {BL [] 0 setdash 2 copy moveto
	2 copy vpt 0 90 arc closepath fill
	2 copy moveto
	2 copy vpt 180 360 arc closepath fill
	vpt 0 360 arc closepath} bind def
/C14 {BL [] 0 setdash 2 copy moveto
	2 copy vpt 90 360 arc closepath fill
	vpt 0 360 arc} bind def
/C15 {BL [] 0 setdash 2 copy vpt 0 360 arc closepath fill
	vpt 0 360 arc closepath} bind def
/Rec {newpath 4 2 roll moveto 1 index 0 rlineto 0 exch rlineto
	neg 0 rlineto closepath} bind def
/Square {dup Rec} bind def
/Bsquare {vpt sub exch vpt sub exch vpt2 Square} bind def
/S0 {BL [] 0 setdash 2 copy moveto 0 vpt rlineto BL Bsquare} bind def
/S1 {BL [] 0 setdash 2 copy vpt Square fill Bsquare} bind def
/S2 {BL [] 0 setdash 2 copy exch vpt sub exch vpt Square fill Bsquare} bind def
/S3 {BL [] 0 setdash 2 copy exch vpt sub exch vpt2 vpt Rec fill Bsquare} bind def
/S4 {BL [] 0 setdash 2 copy exch vpt sub exch vpt sub vpt Square fill Bsquare} bind def
/S5 {BL [] 0 setdash 2 copy 2 copy vpt Square fill
	exch vpt sub exch vpt sub vpt Square fill Bsquare} bind def
/S6 {BL [] 0 setdash 2 copy exch vpt sub exch vpt sub vpt vpt2 Rec fill Bsquare} bind def
/S7 {BL [] 0 setdash 2 copy exch vpt sub exch vpt sub vpt vpt2 Rec fill
	2 copy vpt Square fill Bsquare} bind def
/S8 {BL [] 0 setdash 2 copy vpt sub vpt Square fill Bsquare} bind def
/S9 {BL [] 0 setdash 2 copy vpt sub vpt vpt2 Rec fill Bsquare} bind def
/S10 {BL [] 0 setdash 2 copy vpt sub vpt Square fill 2 copy exch vpt sub exch vpt Square fill
	Bsquare} bind def
/S11 {BL [] 0 setdash 2 copy vpt sub vpt Square fill 2 copy exch vpt sub exch vpt2 vpt Rec fill
	Bsquare} bind def
/S12 {BL [] 0 setdash 2 copy exch vpt sub exch vpt sub vpt2 vpt Rec fill Bsquare} bind def
/S13 {BL [] 0 setdash 2 copy exch vpt sub exch vpt sub vpt2 vpt Rec fill
	2 copy vpt Square fill Bsquare} bind def
/S14 {BL [] 0 setdash 2 copy exch vpt sub exch vpt sub vpt2 vpt Rec fill
	2 copy exch vpt sub exch vpt Square fill Bsquare} bind def
/S15 {BL [] 0 setdash 2 copy Bsquare fill Bsquare} bind def
/D0 {gsave translate 45 rotate 0 0 S0 stroke grestore} bind def
/D1 {gsave translate 45 rotate 0 0 S1 stroke grestore} bind def
/D2 {gsave translate 45 rotate 0 0 S2 stroke grestore} bind def
/D3 {gsave translate 45 rotate 0 0 S3 stroke grestore} bind def
/D4 {gsave translate 45 rotate 0 0 S4 stroke grestore} bind def
/D5 {gsave translate 45 rotate 0 0 S5 stroke grestore} bind def
/D6 {gsave translate 45 rotate 0 0 S6 stroke grestore} bind def
/D7 {gsave translate 45 rotate 0 0 S7 stroke grestore} bind def
/D8 {gsave translate 45 rotate 0 0 S8 stroke grestore} bind def
/D9 {gsave translate 45 rotate 0 0 S9 stroke grestore} bind def
/D10 {gsave translate 45 rotate 0 0 S10 stroke grestore} bind def
/D11 {gsave translate 45 rotate 0 0 S11 stroke grestore} bind def
/D12 {gsave translate 45 rotate 0 0 S12 stroke grestore} bind def
/D13 {gsave translate 45 rotate 0 0 S13 stroke grestore} bind def
/D14 {gsave translate 45 rotate 0 0 S14 stroke grestore} bind def
/D15 {gsave translate 45 rotate 0 0 S15 stroke grestore} bind def
/DiaE {stroke [] 0 setdash vpt add M
  hpt neg vpt neg V hpt vpt neg V
  hpt vpt V hpt neg vpt V closepath stroke} def
/BoxE {stroke [] 0 setdash exch hpt sub exch vpt add M
  0 vpt2 neg V hpt2 0 V 0 vpt2 V
  hpt2 neg 0 V closepath stroke} def
/TriUE {stroke [] 0 setdash vpt 1.12 mul add M
  hpt neg vpt -1.62 mul V
  hpt 2 mul 0 V
  hpt neg vpt 1.62 mul V closepath stroke} def
/TriDE {stroke [] 0 setdash vpt 1.12 mul sub M
  hpt neg vpt 1.62 mul V
  hpt 2 mul 0 V
  hpt neg vpt -1.62 mul V closepath stroke} def
/PentE {stroke [] 0 setdash gsave
  translate 0 hpt M 4 {72 rotate 0 hpt L} repeat
  closepath stroke grestore} def
/CircE {stroke [] 0 setdash 
  hpt 0 360 arc stroke} def
/Opaque {gsave closepath 1 setgray fill grestore 0 setgray closepath} def
/DiaW {stroke [] 0 setdash vpt add M
  hpt neg vpt neg V hpt vpt neg V
  hpt vpt V hpt neg vpt V Opaque stroke} def
/BoxW {stroke [] 0 setdash exch hpt sub exch vpt add M
  0 vpt2 neg V hpt2 0 V 0 vpt2 V
  hpt2 neg 0 V Opaque stroke} def
/TriUW {stroke [] 0 setdash vpt 1.12 mul add M
  hpt neg vpt -1.62 mul V
  hpt 2 mul 0 V
  hpt neg vpt 1.62 mul V Opaque stroke} def
/TriDW {stroke [] 0 setdash vpt 1.12 mul sub M
  hpt neg vpt 1.62 mul V
  hpt 2 mul 0 V
  hpt neg vpt -1.62 mul V Opaque stroke} def
/PentW {stroke [] 0 setdash gsave
  translate 0 hpt M 4 {72 rotate 0 hpt L} repeat
  Opaque stroke grestore} def
/CircW {stroke [] 0 setdash 
  hpt 0 360 arc Opaque stroke} def
/BoxFill {gsave Rec 1 setgray fill grestore} def
/Density {
  /Fillden exch def
  currentrgbcolor
  /ColB exch def /ColG exch def /ColR exch def
  /ColR ColR Fillden mul Fillden sub 1 add def
  /ColG ColG Fillden mul Fillden sub 1 add def
  /ColB ColB Fillden mul Fillden sub 1 add def
  ColR ColG ColB setrgbcolor} def
/BoxColFill {gsave Rec PolyFill} def
/PolyFill {gsave Density fill grestore grestore} def
/h {rlineto rlineto rlineto gsave closepath fill grestore} bind def
%
% PostScript Level 1 Pattern Fill routine for rectangles
% Usage: x y w h s a XX PatternFill
%	x,y = lower left corner of box to be filled
%	w,h = width and height of box
%	  a = angle in degrees between lines and x-axis
%	 XX = 0/1 for no/yes cross-hatch
%
/PatternFill {gsave /PFa [ 9 2 roll ] def
  PFa 0 get PFa 2 get 2 div add PFa 1 get PFa 3 get 2 div add translate
  PFa 2 get -2 div PFa 3 get -2 div PFa 2 get PFa 3 get Rec
  TransparentPatterns {} {gsave 1 setgray fill grestore} ifelse
  clip
  currentlinewidth 0.5 mul setlinewidth
  /PFs PFa 2 get dup mul PFa 3 get dup mul add sqrt def
  0 0 M PFa 5 get rotate PFs -2 div dup translate
  0 1 PFs PFa 4 get div 1 add floor cvi
	{PFa 4 get mul 0 M 0 PFs V} for
  0 PFa 6 get ne {
	0 1 PFs PFa 4 get div 1 add floor cvi
	{PFa 4 get mul 0 2 1 roll M PFs 0 V} for
 } if
  stroke grestore} def
%
/languagelevel where
 {pop languagelevel} {1} ifelse
 2 lt
	{/InterpretLevel1 true def}
	{/InterpretLevel1 Level1 def}
 ifelse
%
% PostScript level 2 pattern fill definitions
%
/Level2PatternFill {
/Tile8x8 {/PaintType 2 /PatternType 1 /TilingType 1 /BBox [0 0 8 8] /XStep 8 /YStep 8}
	bind def
/KeepColor {currentrgbcolor [/Pattern /DeviceRGB] setcolorspace} bind def
<< Tile8x8
 /PaintProc {0.5 setlinewidth pop 0 0 M 8 8 L 0 8 M 8 0 L stroke} 
>> matrix makepattern
/Pat1 exch def
<< Tile8x8
 /PaintProc {0.5 setlinewidth pop 0 0 M 8 8 L 0 8 M 8 0 L stroke
	0 4 M 4 8 L 8 4 L 4 0 L 0 4 L stroke}
>> matrix makepattern
/Pat2 exch def
<< Tile8x8
 /PaintProc {0.5 setlinewidth pop 0 0 M 0 8 L
	8 8 L 8 0 L 0 0 L fill}
>> matrix makepattern
/Pat3 exch def
<< Tile8x8
 /PaintProc {0.5 setlinewidth pop -4 8 M 8 -4 L
	0 12 M 12 0 L stroke}
>> matrix makepattern
/Pat4 exch def
<< Tile8x8
 /PaintProc {0.5 setlinewidth pop -4 0 M 8 12 L
	0 -4 M 12 8 L stroke}
>> matrix makepattern
/Pat5 exch def
<< Tile8x8
 /PaintProc {0.5 setlinewidth pop -2 8 M 4 -4 L
	0 12 M 8 -4 L 4 12 M 10 0 L stroke}
>> matrix makepattern
/Pat6 exch def
<< Tile8x8
 /PaintProc {0.5 setlinewidth pop -2 0 M 4 12 L
	0 -4 M 8 12 L 4 -4 M 10 8 L stroke}
>> matrix makepattern
/Pat7 exch def
<< Tile8x8
 /PaintProc {0.5 setlinewidth pop 8 -2 M -4 4 L
	12 0 M -4 8 L 12 4 M 0 10 L stroke}
>> matrix makepattern
/Pat8 exch def
<< Tile8x8
 /PaintProc {0.5 setlinewidth pop 0 -2 M 12 4 L
	-4 0 M 12 8 L -4 4 M 8 10 L stroke}
>> matrix makepattern
/Pat9 exch def
/Pattern1 {PatternBgnd KeepColor Pat1 setpattern} bind def
/Pattern2 {PatternBgnd KeepColor Pat2 setpattern} bind def
/Pattern3 {PatternBgnd KeepColor Pat3 setpattern} bind def
/Pattern4 {PatternBgnd KeepColor Landscape {Pat5} {Pat4} ifelse setpattern} bind def
/Pattern5 {PatternBgnd KeepColor Landscape {Pat4} {Pat5} ifelse setpattern} bind def
/Pattern6 {PatternBgnd KeepColor Landscape {Pat9} {Pat6} ifelse setpattern} bind def
/Pattern7 {PatternBgnd KeepColor Landscape {Pat8} {Pat7} ifelse setpattern} bind def
} def
%
%
%End of PostScript Level 2 code
%
/PatternBgnd {
  TransparentPatterns {} {gsave 1 setgray fill grestore} ifelse
} def
%
% Substitute for Level 2 pattern fill codes with
% grayscale if Level 2 support is not selected.
%
/Level1PatternFill {
/Pattern1 {0.250 Density} bind def
/Pattern2 {0.500 Density} bind def
/Pattern3 {0.750 Density} bind def
/Pattern4 {0.125 Density} bind def
/Pattern5 {0.375 Density} bind def
/Pattern6 {0.625 Density} bind def
/Pattern7 {0.875 Density} bind def
} def
%
% Now test for support of Level 2 code
%
Level1 {Level1PatternFill} {Level2PatternFill} ifelse
%
/Symbol-Oblique /Symbol findfont [1 0 .167 1 0 0] makefont
dup length dict begin {1 index /FID eq {pop pop} {def} ifelse} forall
currentdict end definefont pop
Level1 SuppressPDFMark or 
{} {
/SDict 10 dict def
systemdict /pdfmark known not {
  userdict /pdfmark systemdict /cleartomark get put
} if
SDict begin [
  /Title (plot8minlog.tex)
  /Subject (gnuplot plot)
  /Creator (gnuplot 4.6 patchlevel 4)
  /Author (eric)
%  /Producer (gnuplot)
%  /Keywords ()
  /CreationDate (Thu Mar 12 21:06:25 2015)
  /DOCINFO pdfmark
end
} ifelse
end
%%EndProlog
%%Page: 1 1
gnudict begin
gsave
doclip
50 50 translate
0.050 0.050 scale
0 setgray
newpath
1.000 UL
LTb
LCb setrgbcolor
1078 704 M
63 0 V
5662 0 R
-63 0 V
stroke
LTb
1078 1212 M
31 0 V
5694 0 R
-31 0 V
1078 1510 M
31 0 V
5694 0 R
-31 0 V
1078 1721 M
31 0 V
5694 0 R
-31 0 V
1078 1884 M
31 0 V
5694 0 R
-31 0 V
1078 2018 M
31 0 V
5694 0 R
-31 0 V
1078 2131 M
31 0 V
5694 0 R
-31 0 V
-5694 98 R
31 0 V
5694 0 R
-31 0 V
-5694 87 R
31 0 V
5694 0 R
-31 0 V
-5694 77 R
63 0 V
5662 0 R
-63 0 V
1078 2901 M
31 0 V
5694 0 R
-31 0 V
1078 3199 M
31 0 V
5694 0 R
-31 0 V
1078 3410 M
31 0 V
5694 0 R
-31 0 V
1078 3573 M
31 0 V
5694 0 R
-31 0 V
1078 3707 M
31 0 V
5694 0 R
-31 0 V
1078 3820 M
31 0 V
5694 0 R
-31 0 V
-5694 98 R
31 0 V
5694 0 R
-31 0 V
-5694 86 R
31 0 V
5694 0 R
-31 0 V
-5694 78 R
63 0 V
5662 0 R
-63 0 V
1078 704 M
0 63 V
0 3612 R
0 -63 V
2032 704 M
0 63 V
0 3612 R
0 -63 V
2986 704 M
0 63 V
0 3612 R
0 -63 V
3941 704 M
0 63 V
0 3612 R
0 -63 V
4895 704 M
0 63 V
0 3612 R
0 -63 V
5849 704 M
0 63 V
0 3612 R
0 -63 V
6803 704 M
0 63 V
0 3612 R
0 -63 V
stroke
1078 4379 N
0 -3675 V
5725 0 V
0 3675 V
-5725 0 V
Z stroke
1.000 UP
1.000 UL
LTb
1.000 UL
LT0
LC0 setrgbcolor
LCb setrgbcolor
LT0
LC0 setrgbcolor
5948 4206 M
591 0 V
1210 4379 M
41 -43 V
58 -61 V
58 -60 V
58 -61 V
58 -60 V
58 -61 V
57 -61 V
58 -60 V
58 -61 V
58 -60 V
58 -61 V
58 -60 V
57 -61 V
58 -60 V
58 -61 V
58 -60 V
58 -61 V
58 -60 V
57 -60 V
58 -61 V
58 -60 V
58 -60 V
58 -61 V
58 -60 V
57 -60 V
58 -61 V
58 -60 V
58 -60 V
58 -60 V
58 -60 V
57 -60 V
58 -60 V
58 -60 V
58 -60 V
58 -59 V
57 -60 V
58 -59 V
58 -60 V
58 -59 V
58 -59 V
58 -60 V
57 -59 V
58 -58 V
58 -59 V
58 -59 V
58 -58 V
58 -58 V
57 -58 V
58 -58 V
58 -58 V
58 -57 V
58 -57 V
58 -57 V
57 -56 V
58 -56 V
58 -56 V
58 -55 V
58 -55 V
58 -54 V
57 -54 V
58 -54 V
58 -53 V
39 -35 V
stroke
LT1
LC1 setrgbcolor
LCb setrgbcolor
LT1
LC1 setrgbcolor
5948 3986 M
591 0 V
1078 3211 M
58 -10 V
58 -11 V
57 -11 V
58 -10 V
58 -11 V
58 -11 V
58 -11 V
58 -10 V
57 -11 V
58 -11 V
58 -11 V
58 -10 V
58 -11 V
58 -11 V
57 -10 V
58 -11 V
58 -11 V
58 -11 V
58 -10 V
58 -11 V
57 -11 V
58 -10 V
58 -11 V
58 -11 V
58 -11 V
58 -10 V
57 -11 V
58 -11 V
58 -10 V
58 -11 V
58 -11 V
58 -11 V
57 -10 V
58 -11 V
58 -11 V
58 -10 V
58 -11 V
57 -11 V
58 -10 V
58 -11 V
58 -11 V
58 -11 V
58 -10 V
57 -11 V
58 -11 V
58 -10 V
58 -11 V
58 -11 V
58 -10 V
57 -11 V
58 -11 V
58 -10 V
58 -11 V
58 -11 V
58 -10 V
57 -11 V
58 -11 V
58 -10 V
58 -11 V
58 -11 V
58 -10 V
57 -11 V
58 -11 V
58 -10 V
58 -11 V
58 -11 V
57 -10 V
58 -11 V
58 -11 V
58 -10 V
58 -11 V
58 -11 V
57 -10 V
58 -11 V
58 -11 V
58 -10 V
58 -11 V
58 -10 V
57 -11 V
58 -11 V
58 -10 V
58 -11 V
58 -11 V
58 -10 V
57 -11 V
58 -10 V
58 -11 V
58 -11 V
58 -10 V
58 -11 V
57 -10 V
58 -11 V
58 -11 V
58 -10 V
58 -11 V
58 -10 V
57 -11 V
58 -11 V
58 -10 V
stroke
LT2
LC2 setrgbcolor
LCb setrgbcolor
LT2
LC2 setrgbcolor
5948 3766 M
591 0 V
1357 4379 M
10 -9 V
58 -51 V
58 -50 V
58 -50 V
57 -49 V
58 -49 V
58 -47 V
58 -48 V
58 -46 V
58 -46 V
57 -45 V
58 -44 V
58 -44 V
58 -43 V
58 -42 V
58 -41 V
57 -41 V
58 -39 V
58 -39 V
58 -38 V
58 -37 V
58 -36 V
57 -36 V
58 -34 V
58 -34 V
58 -33 V
58 -32 V
58 -31 V
57 -30 V
58 -30 V
58 -29 V
58 -28 V
58 -27 V
57 -26 V
58 -26 V
58 -25 V
58 -24 V
58 -24 V
58 -23 V
57 -23 V
58 -21 V
58 -22 V
58 -20 V
58 -20 V
58 -20 V
57 -19 V
58 -19 V
58 -18 V
58 -18 V
58 -17 V
58 -17 V
57 -17 V
58 -16 V
58 -16 V
58 -16 V
58 -15 V
58 -15 V
57 -15 V
58 -14 V
58 -15 V
58 -14 V
58 -14 V
57 -13 V
58 -14 V
58 -13 V
58 -13 V
58 -13 V
58 -13 V
57 -13 V
58 -12 V
58 -13 V
58 -12 V
58 -12 V
58 -12 V
57 -12 V
58 -12 V
58 -12 V
58 -12 V
58 -11 V
58 -12 V
57 -12 V
58 -11 V
58 -11 V
58 -12 V
58 -11 V
58 -11 V
57 -12 V
58 -11 V
58 -11 V
58 -11 V
58 -11 V
58 -11 V
57 -11 V
58 -11 V
58 -11 V
stroke
LT3
LC3 setrgbcolor
LCb setrgbcolor
LT3
LC3 setrgbcolor
5948 3546 M
591 0 V
1.000 UP
stroke
LT4
LC4 setrgbcolor
LCa setrgbcolor
LCb setrgbcolor
LT4
LC4 setrgbcolor
LCa setrgbcolor
5948 3326 M
591 0 V
-591 31 R
0 -62 V
591 62 R
0 -62 V
1622 3954 M
0 322 V
-31 -322 R
62 0 V
-62 322 R
62 0 V
64 -339 R
0 325 V
-31 -325 R
62 0 V
-62 325 R
62 0 V
65 -480 R
0 358 V
-31 -358 R
62 0 V
-62 358 R
62 0 V
64 -538 R
0 399 V
-31 -399 R
62 0 V
-62 399 R
62 0 V
66 -498 R
0 424 V
-31 -424 R
62 0 V
-62 424 R
62 0 V
65 -306 R
0 395 V
-31 -395 R
62 0 V
-62 395 R
62 0 V
64 -502 R
0 421 V
-31 -421 R
62 0 V
-62 421 R
62 0 V
65 -416 R
0 420 V
-31 -420 R
62 0 V
-62 420 R
62 0 V
64 -589 R
0 465 V
-31 -465 R
62 0 V
-62 465 R
62 0 V
65 -517 R
0 479 V
-31 -479 R
62 0 V
-62 479 R
62 0 V
64 -625 R
0 523 V
-31 -523 R
62 0 V
-62 523 R
62 0 V
64 -464 R
0 504 V
-31 -504 R
62 0 V
-62 504 R
62 0 V
65 -908 R
0 638 V
-31 -638 R
62 0 V
-62 638 R
62 0 V
64 -337 R
0 536 V
-31 -536 R
62 0 V
-62 536 R
62 0 V
65 -1101 R
0 741 V
-31 -741 R
62 0 V
-62 741 R
62 0 V
64 -490 R
0 643 V
-31 -643 R
62 0 V
-62 643 R
62 0 V
64 -714 R
0 670 V
-31 -670 R
62 0 V
stroke 3181 2723 M
-62 670 R
62 0 V
65 -897 R
0 761 V
-31 -761 R
62 0 V
-62 761 R
62 0 V
64 -635 R
0 709 V
-31 -709 R
62 0 V
-62 709 R
62 0 V
67 -983 R
0 826 V
-31 -826 R
62 0 V
-62 826 R
62 0 V
64 -436 R
0 664 V
-31 -664 R
62 0 V
-62 664 R
62 0 V
64 -814 R
0 723 V
-31 -723 R
62 0 V
-62 723 R
62 0 V
65 -875 R
0 787 V
-31 -787 R
62 0 V
-62 787 R
62 0 V
64 -936 R
0 854 V
-31 -854 R
62 0 V
-62 854 R
62 0 V
65 -695 R
0 782 V
-31 -782 R
62 0 V
-62 782 R
62 0 V
64 -1153 R
0 957 V
-31 -957 R
62 0 V
-62 957 R
62 0 V
65 -910 R
0 934 V
-31 -934 R
62 0 V
-62 934 R
62 0 V
64 -1121 R
0 1031 V
4171 1935 M
62 0 V
-62 1031 R
62 0 V
64 -976 R
0 1002 V
4266 1990 M
62 0 V
-62 1002 R
62 0 V
65 -770 R
0 885 V
-31 -885 R
62 0 V
-62 885 R
62 0 V
64 -970 R
0 926 V
-31 -926 R
62 0 V
-62 926 R
62 0 V
65 -941 R
0 934 V
-31 -934 R
62 0 V
-62 934 R
62 0 V
64 -1066 R
0 1002 V
4648 1990 M
62 0 V
-62 1002 R
62 0 V
64 -1117 R
0 1064 V
4743 1875 M
62 0 V
-62 1064 R
62 0 V
stroke 4805 2939 M
65 -1128 R
0 1100 V
4839 1811 M
62 0 V
-62 1100 R
62 0 V
64 -1057 R
0 1076 V
4934 1854 M
62 0 V
-62 1076 R
62 0 V
67 -1618 R
0 1412 V
5032 1312 M
62 0 V
-62 1412 R
62 0 V
64 -958 R
0 1126 V
5127 1766 M
62 0 V
-62 1126 R
62 0 V
64 -1433 R
0 1314 V
5222 1459 M
62 0 V
-62 1314 R
62 0 V
65 -1249 R
0 1273 V
5318 1524 M
62 0 V
-62 1273 R
62 0 V
64 -862 R
0 1031 V
5413 1935 M
62 0 V
-62 1031 R
62 0 V
65 -1224 R
0 1140 V
5509 1742 M
62 0 V
-62 1140 R
62 0 V
64 -1457 R
0 1336 V
5604 1425 M
62 0 V
-62 1336 R
62 0 V
65 -1449 R
0 1412 V
5700 1312 M
62 0 V
-62 1412 R
62 0 V
64 -1299 R
0 1336 V
5795 1425 M
62 0 V
-62 1336 R
62 0 V
64 -736 R
0 983 V
-31 -983 R
62 0 V
-62 983 R
62 0 V
65 -1826 R
0 1502 V
5986 1182 M
62 0 V
-62 1502 R
62 0 V
64 -966 R
0 1154 V
6081 1718 M
62 0 V
-62 1154 R
62 0 V
65 -1106 R
0 1126 V
6177 1766 M
62 0 V
-62 1126 R
62 0 V
66 -1758 R
0 1537 V
6274 1134 M
62 0 V
-62 1537 R
62 0 V
64 -1320 R
0 1386 V
6369 1351 M
62 0 V
-62 1386 R
62 0 V
6496 704 M
0 1666 V
stroke 6496 2370 M
-31 0 R
62 0 V
64 -911 R
0 1314 V
6560 1459 M
62 0 V
-62 1314 R
62 0 V
6687 704 M
0 1808 V
-31 0 R
62 0 V
64 -1200 R
0 1412 V
6751 1312 M
52 0 V
-52 1412 R
52 0 V
1622 4133 BoxF
1717 4117 BoxF
1813 3983 BoxF
1908 3828 BoxF
2005 3745 BoxF
2101 3845 BoxF
2196 3754 BoxF
2292 3759 BoxF
2387 3619 BoxF
2483 3576 BoxF
2578 3459 BoxF
2673 3506 BoxF
2769 3194 BoxF
2864 3424 BoxF
2960 3004 BoxF
3055 3184 BoxF
3150 3132 BoxF
3246 2971 BoxF
3341 3059 BoxF
3439 2871 BoxF
3534 3143 BoxF
3629 3035 BoxF
3725 2930 BoxF
3820 2832 BoxF
3916 2937 BoxF
4011 2700 BoxF
4107 2728 BoxF
4202 2618 BoxF
4297 2650 BoxF
4393 2791 BoxF
4488 2738 BoxF
4584 2728 BoxF
4679 2650 BoxF
4774 2585 BoxF
4870 2551 BoxF
4965 2574 BoxF
5063 2316 BoxF
5158 2527 BoxF
5253 2378 BoxF
5349 2407 BoxF
5444 2618 BoxF
5540 2514 BoxF
5635 2363 BoxF
5731 2316 BoxF
5826 2363 BoxF
5921 2670 BoxF
6017 2265 BoxF
6112 2502 BoxF
6208 2527 BoxF
6305 2247 BoxF
6400 2332 BoxF
6496 1854 BoxF
6591 2378 BoxF
6687 2042 BoxF
6782 2316 BoxF
6243 3326 BoxF
1.000 UL
LTb
LCb setrgbcolor
1078 4379 N
0 -3675 V
5725 0 V
0 3675 V
-5725 0 V
Z stroke
1.000 UP
1.000 UL
LTb
stroke
grestore
end
showpage
%%Trailer
