

*******************************************************************************
Thu Mar 12 18:05:48 2015


FIT:    data read from 'data.dat' using (($1)-2.5):-2:(($2)/5):(max(0.5,sqrt($2)))
        format = x:y:z:s
        x range restricted to [0.00000 : 250.000]
        y range restricted to [-10.0000 : 150.000]
        #datapoints = 231
function used for fitting: f(x,y)
fitted parameters initialized with current variable values



 Iteration 0
 WSSR        : 106.053           delta(WSSR)/WSSR   : 0
 delta(WSSR) : 0                 limit for stopping : 1e-05
 lambda	  : 0.157137

initial set of free parameter values

N_a1            = 148.413
N_a2            = 181.272
N_a4            = 181.272
N_a8            = 221.406
N_b1            = 11.0232
N_b2            = 14.8797
N_b4            = 27.1126
N_b8            = 29.9641
T_a             = 30.1368
T_b             = 165.035
N_0             = 0.64

After 5 iterations the fit converged.
final sum of squares of residuals : 16.1962
rel. change during last iteration : -6.24404e-08

degrees of freedom    (FIT_NDF)                        : 220
rms of residuals      (FIT_STDFIT) = sqrt(WSSR/ndf)    : 0.271329
variance of residuals (reduced chisquare) = WSSR/ndf   : 0.0736192

Final set of parameters            Asymptotic Standard Error
=======================            ==========================

N_a1            = 159.816          +/- 7.661        (4.794%)
N_a2            = 178.289          +/- 7.683        (4.309%)
N_a4            = 201.891          +/- 8.793        (4.355%)
N_a8            = 181.114          +/- 10.16        (5.611%)
N_b1            = 9.62915          +/- 2.776        (28.83%)
N_b2            = 16.767           +/- 4.291        (25.59%)
N_b4            = 23.681           +/- 5.712        (24.12%)
N_b8            = 30.3928          +/- 6.919        (22.76%)
T_a             = 25.3965          +/- 1.439        (5.666%)
T_b             = 142.873          +/- 31.6         (22.11%)
N_0             = 0.139323         +/- 0.03582      (25.71%)


correlation matrix of the fit parameters:

               N_a1   N_a2   N_a4   N_a8   N_b1   N_b2   N_b4   N_b8   T_a    T_b    N_0    
N_a1            1.000 
N_a2            0.444  1.000 
N_a4            0.356  0.416  1.000 
N_a8            0.119  0.296  0.394  1.000 
N_b1            0.407  0.198  0.001 -0.380  1.000 
N_b2            0.485  0.091 -0.023 -0.406  0.949  1.000 
N_b4            0.479  0.169 -0.111 -0.417  0.953  0.965  1.000 
N_b8            0.464  0.151 -0.052 -0.502  0.954  0.967  0.972  1.000 
T_a            -0.678 -0.424 -0.247  0.143 -0.900 -0.896 -0.894 -0.884  1.000 
T_b            -0.424 -0.102  0.104  0.483 -0.956 -0.973 -0.979 -0.985  0.857  1.000 
N_0             0.003 -0.004 -0.009 -0.012 -0.025 -0.012 -0.006 -0.002  0.006 -0.014  1.000 


*******************************************************************************
Thu Mar 12 18:09:46 2015


FIT:    data read from 'data.dat' using (($1)-2.5):-2:(($2)/5):(max(0.5,sqrt($2)))
        format = x:y:z:s
        x range restricted to [0.00000 : 250.000]
        y range restricted to [-10.0000 : 150.000]
        #datapoints = 231
function used for fitting: f(x,y)
fitted parameters initialized with current variable values



 Iteration 0
 WSSR        : 106.053           delta(WSSR)/WSSR   : 0
 delta(WSSR) : 0                 limit for stopping : 1e-05
 lambda	  : 0.157137

initial set of free parameter values

N_a1            = 148.413
N_a2            = 181.272
N_a4            = 181.272
N_a8            = 221.406
N_b1            = 11.0232
N_b2            = 14.8797
N_b4            = 27.1126
N_b8            = 29.9641
T_a             = 30.1368
T_b             = 165.035
N_0             = 0.64

After 5 iterations the fit converged.
final sum of squares of residuals : 16.1962
rel. change during last iteration : -6.24404e-08

degrees of freedom    (FIT_NDF)                        : 220
rms of residuals      (FIT_STDFIT) = sqrt(WSSR/ndf)    : 0.271329
variance of residuals (reduced chisquare) = WSSR/ndf   : 0.0736192

Final set of parameters            Asymptotic Standard Error
=======================            ==========================

N_a1            = 159.816          +/- 7.661        (4.794%)
N_a2            = 178.289          +/- 7.683        (4.309%)
N_a4            = 201.891          +/- 8.793        (4.355%)
N_a8            = 181.114          +/- 10.16        (5.611%)
N_b1            = 9.62915          +/- 2.776        (28.83%)
N_b2            = 16.767           +/- 4.291        (25.59%)
N_b4            = 23.681           +/- 5.712        (24.12%)
N_b8            = 30.3928          +/- 6.919        (22.76%)
T_a             = 25.3965          +/- 1.439        (5.666%)
T_b             = 142.873          +/- 31.6         (22.11%)
N_0             = 0.139323         +/- 0.03582      (25.71%)


correlation matrix of the fit parameters:

               N_a1   N_a2   N_a4   N_a8   N_b1   N_b2   N_b4   N_b8   T_a    T_b    N_0    
N_a1            1.000 
N_a2            0.444  1.000 
N_a4            0.356  0.416  1.000 
N_a8            0.119  0.296  0.394  1.000 
N_b1            0.407  0.198  0.001 -0.380  1.000 
N_b2            0.485  0.091 -0.023 -0.406  0.949  1.000 
N_b4            0.479  0.169 -0.111 -0.417  0.953  0.965  1.000 
N_b8            0.464  0.151 -0.052 -0.502  0.954  0.967  0.972  1.000 
T_a            -0.678 -0.424 -0.247  0.143 -0.900 -0.896 -0.894 -0.884  1.000 
T_b            -0.424 -0.102  0.104  0.483 -0.956 -0.973 -0.979 -0.985  0.857  1.000 
N_0             0.003 -0.004 -0.009 -0.012 -0.025 -0.012 -0.006 -0.002  0.006 -0.014  1.000 


*******************************************************************************
Thu Mar 12 18:13:13 2015


FIT:    data read from 'data.dat' using (($1)-2.5):-2:(($2)/5):(max(0.5,sqrt($2)))
        format = x:y:z:s
        x range restricted to [0.00000 : 250.000]
        y range restricted to [-10.0000 : 150.000]
        #datapoints = 231
function used for fitting: f(x,y)
fitted parameters initialized with current variable values



 Iteration 0
 WSSR        : 106.053           delta(WSSR)/WSSR   : 0
 delta(WSSR) : 0                 limit for stopping : 1e-05
 lambda	  : 0.157137

initial set of free parameter values

N_a1            = 148.413
N_a2            = 181.272
N_a4            = 181.272
N_a8            = 221.406
N_b1            = 11.0232
N_b2            = 14.8797
N_b4            = 27.1126
N_b8            = 29.9641
T_a             = 30.1368
T_b             = 165.035
N_0             = 0.64

After 5 iterations the fit converged.
final sum of squares of residuals : 16.1962
rel. change during last iteration : -6.24404e-08

degrees of freedom    (FIT_NDF)                        : 220
rms of residuals      (FIT_STDFIT) = sqrt(WSSR/ndf)    : 0.271329
variance of residuals (reduced chisquare) = WSSR/ndf   : 0.0736192

Final set of parameters            Asymptotic Standard Error
=======================            ==========================

N_a1            = 159.816          +/- 7.661        (4.794%)
N_a2            = 178.289          +/- 7.683        (4.309%)
N_a4            = 201.891          +/- 8.793        (4.355%)
N_a8            = 181.114          +/- 10.16        (5.611%)
N_b1            = 9.62915          +/- 2.776        (28.83%)
N_b2            = 16.767           +/- 4.291        (25.59%)
N_b4            = 23.681           +/- 5.712        (24.12%)
N_b8            = 30.3928          +/- 6.919        (22.76%)
T_a             = 25.3965          +/- 1.439        (5.666%)
T_b             = 142.873          +/- 31.6         (22.11%)
N_0             = 0.139323         +/- 0.03582      (25.71%)


correlation matrix of the fit parameters:

               N_a1   N_a2   N_a4   N_a8   N_b1   N_b2   N_b4   N_b8   T_a    T_b    N_0    
N_a1            1.000 
N_a2            0.444  1.000 
N_a4            0.356  0.416  1.000 
N_a8            0.119  0.296  0.394  1.000 
N_b1            0.407  0.198  0.001 -0.380  1.000 
N_b2            0.485  0.091 -0.023 -0.406  0.949  1.000 
N_b4            0.479  0.169 -0.111 -0.417  0.953  0.965  1.000 
N_b8            0.464  0.151 -0.052 -0.502  0.954  0.967  0.972  1.000 
T_a            -0.678 -0.424 -0.247  0.143 -0.900 -0.896 -0.894 -0.884  1.000 
T_b            -0.424 -0.102  0.104  0.483 -0.956 -0.973 -0.979 -0.985  0.857  1.000 
N_0             0.003 -0.004 -0.009 -0.012 -0.025 -0.012 -0.006 -0.002  0.006 -0.014  1.000 


*******************************************************************************
Thu Mar 12 18:15:34 2015


FIT:    data read from 'data.dat' using (($1)-2.5):-2:(($2)/5):(max(0.5,sqrt($2)))
        format = x:y:z:s
        x range restricted to [0.00000 : 250.000]
        y range restricted to [-10.0000 : 150.000]
        #datapoints = 231
function used for fitting: f(x,y)
fitted parameters initialized with current variable values



 Iteration 0
 WSSR        : 106.053           delta(WSSR)/WSSR   : 0
 delta(WSSR) : 0                 limit for stopping : 1e-05
 lambda	  : 0.157137

initial set of free parameter values

N_a1            = 148.413
N_a2            = 181.272
N_a4            = 181.272
N_a8            = 221.406
N_b1            = 11.0232
N_b2            = 14.8797
N_b4            = 27.1126
N_b8            = 29.9641
T_a             = 30.1368
T_b             = 165.035
N_0             = 0.64

After 5 iterations the fit converged.
final sum of squares of residuals : 16.1962
rel. change during last iteration : -6.24404e-08

degrees of freedom    (FIT_NDF)                        : 220
rms of residuals      (FIT_STDFIT) = sqrt(WSSR/ndf)    : 0.271329
variance of residuals (reduced chisquare) = WSSR/ndf   : 0.0736192

Final set of parameters            Asymptotic Standard Error
=======================            ==========================

N_a1            = 159.816          +/- 7.661        (4.794%)
N_a2            = 178.289          +/- 7.683        (4.309%)
N_a4            = 201.891          +/- 8.793        (4.355%)
N_a8            = 181.114          +/- 10.16        (5.611%)
N_b1            = 9.62915          +/- 2.776        (28.83%)
N_b2            = 16.767           +/- 4.291        (25.59%)
N_b4            = 23.681           +/- 5.712        (24.12%)
N_b8            = 30.3928          +/- 6.919        (22.76%)
T_a             = 25.3965          +/- 1.439        (5.666%)
T_b             = 142.873          +/- 31.6         (22.11%)
N_0             = 0.139323         +/- 0.03582      (25.71%)


correlation matrix of the fit parameters:

               N_a1   N_a2   N_a4   N_a8   N_b1   N_b2   N_b4   N_b8   T_a    T_b    N_0    
N_a1            1.000 
N_a2            0.444  1.000 
N_a4            0.356  0.416  1.000 
N_a8            0.119  0.296  0.394  1.000 
N_b1            0.407  0.198  0.001 -0.380  1.000 
N_b2            0.485  0.091 -0.023 -0.406  0.949  1.000 
N_b4            0.479  0.169 -0.111 -0.417  0.953  0.965  1.000 
N_b8            0.464  0.151 -0.052 -0.502  0.954  0.967  0.972  1.000 
T_a            -0.678 -0.424 -0.247  0.143 -0.900 -0.896 -0.894 -0.884  1.000 
T_b            -0.424 -0.102  0.104  0.483 -0.956 -0.973 -0.979 -0.985  0.857  1.000 
N_0             0.003 -0.004 -0.009 -0.012 -0.025 -0.012 -0.006 -0.002  0.006 -0.014  1.000 


*******************************************************************************
Thu Mar 12 18:20:48 2015


FIT:    data read from 'data.dat' using (($1)-2.5):-2:(($2)/5):(max(0.5,sqrt($2)))
        format = x:y:z:s
        x range restricted to [0.00000 : 250.000]
        y range restricted to [-10.0000 : 150.000]
        #datapoints = 231
function used for fitting: f(x,y)
fitted parameters initialized with current variable values



 Iteration 0
 WSSR        : 106.053           delta(WSSR)/WSSR   : 0
 delta(WSSR) : 0                 limit for stopping : 1e-05
 lambda	  : 0.157137

initial set of free parameter values

N_a1            = 148.413
N_a2            = 181.272
N_a4            = 181.272
N_a8            = 221.406
N_b1            = 11.0232
N_b2            = 14.8797
N_b4            = 27.1126
N_b8            = 29.9641
T_a             = 30.1368
T_b             = 165.035
N_0             = 0.64

After 5 iterations the fit converged.
final sum of squares of residuals : 16.1962
rel. change during last iteration : -6.24404e-08

degrees of freedom    (FIT_NDF)                        : 220
rms of residuals      (FIT_STDFIT) = sqrt(WSSR/ndf)    : 0.271329
variance of residuals (reduced chisquare) = WSSR/ndf   : 0.0736192

Final set of parameters            Asymptotic Standard Error
=======================            ==========================

N_a1            = 159.816          +/- 7.661        (4.794%)
N_a2            = 178.289          +/- 7.683        (4.309%)
N_a4            = 201.891          +/- 8.793        (4.355%)
N_a8            = 181.114          +/- 10.16        (5.611%)
N_b1            = 9.62915          +/- 2.776        (28.83%)
N_b2            = 16.767           +/- 4.291        (25.59%)
N_b4            = 23.681           +/- 5.712        (24.12%)
N_b8            = 30.3928          +/- 6.919        (22.76%)
T_a             = 25.3965          +/- 1.439        (5.666%)
T_b             = 142.873          +/- 31.6         (22.11%)
N_0             = 0.139323         +/- 0.03582      (25.71%)


correlation matrix of the fit parameters:

               N_a1   N_a2   N_a4   N_a8   N_b1   N_b2   N_b4   N_b8   T_a    T_b    N_0    
N_a1            1.000 
N_a2            0.444  1.000 
N_a4            0.356  0.416  1.000 
N_a8            0.119  0.296  0.394  1.000 
N_b1            0.407  0.198  0.001 -0.380  1.000 
N_b2            0.485  0.091 -0.023 -0.406  0.949  1.000 
N_b4            0.479  0.169 -0.111 -0.417  0.953  0.965  1.000 
N_b8            0.464  0.151 -0.052 -0.502  0.954  0.967  0.972  1.000 
T_a            -0.678 -0.424 -0.247  0.143 -0.900 -0.896 -0.894 -0.884  1.000 
T_b            -0.424 -0.102  0.104  0.483 -0.956 -0.973 -0.979 -0.985  0.857  1.000 
N_0             0.003 -0.004 -0.009 -0.012 -0.025 -0.012 -0.006 -0.002  0.006 -0.014  1.000 


*******************************************************************************
Thu Mar 12 19:37:56 2015


FIT:    data read from 'data.dat' using (($1)-2.5):-2:(($2)/5):(max(0.5,sqrt($2)))
        format = x:y:z:s
        x range restricted to [0.00000 : 250.000]
        y range restricted to [-10.0000 : 150.000]
        #datapoints = 231
function used for fitting: f(x,y)
fitted parameters initialized with current variable values



 Iteration 0
 WSSR        : 106.053           delta(WSSR)/WSSR   : 0
 delta(WSSR) : 0                 limit for stopping : 1e-05
 lambda	  : 0.157137

initial set of free parameter values

N_a1            = 148.413
N_a2            = 181.272
N_a4            = 181.272
N_a8            = 221.406
N_b1            = 11.0232
N_b2            = 14.8797
N_b4            = 27.1126
N_b8            = 29.9641
T_a             = 30.1368
T_b             = 165.035
N_0             = 0.64

After 5 iterations the fit converged.
final sum of squares of residuals : 16.1962
rel. change during last iteration : -6.24404e-08

degrees of freedom    (FIT_NDF)                        : 220
rms of residuals      (FIT_STDFIT) = sqrt(WSSR/ndf)    : 0.271329
variance of residuals (reduced chisquare) = WSSR/ndf   : 0.0736192

Final set of parameters            Asymptotic Standard Error
=======================            ==========================

N_a1            = 159.816          +/- 7.661        (4.794%)
N_a2            = 178.289          +/- 7.683        (4.309%)
N_a4            = 201.891          +/- 8.793        (4.355%)
N_a8            = 181.114          +/- 10.16        (5.611%)
N_b1            = 9.62915          +/- 2.776        (28.83%)
N_b2            = 16.767           +/- 4.291        (25.59%)
N_b4            = 23.681           +/- 5.712        (24.12%)
N_b8            = 30.3928          +/- 6.919        (22.76%)
T_a             = 25.3965          +/- 1.439        (5.666%)
T_b             = 142.873          +/- 31.6         (22.11%)
N_0             = 0.139323         +/- 0.03582      (25.71%)


correlation matrix of the fit parameters:

               N_a1   N_a2   N_a4   N_a8   N_b1   N_b2   N_b4   N_b8   T_a    T_b    N_0    
N_a1            1.000 
N_a2            0.444  1.000 
N_a4            0.356  0.416  1.000 
N_a8            0.119  0.296  0.394  1.000 
N_b1            0.407  0.198  0.001 -0.380  1.000 
N_b2            0.485  0.091 -0.023 -0.406  0.949  1.000 
N_b4            0.479  0.169 -0.111 -0.417  0.953  0.965  1.000 
N_b8            0.464  0.151 -0.052 -0.502  0.954  0.967  0.972  1.000 
T_a            -0.678 -0.424 -0.247  0.143 -0.900 -0.896 -0.894 -0.884  1.000 
T_b            -0.424 -0.102  0.104  0.483 -0.956 -0.973 -0.979 -0.985  0.857  1.000 
N_0             0.003 -0.004 -0.009 -0.012 -0.025 -0.012 -0.006 -0.002  0.006 -0.014  1.000 


*******************************************************************************
Thu Mar 12 19:41:32 2015


FIT:    data read from 'data.dat' using (($1)-2.5):-2:(($2)/5):(max(0.5,sqrt($2)))
        format = x:y:z:s
        x range restricted to [0.00000 : 250.000]
        y range restricted to [-10.0000 : 150.000]
        #datapoints = 231
function used for fitting: f(x,y)
fitted parameters initialized with current variable values



 Iteration 0
 WSSR        : 106.053           delta(WSSR)/WSSR   : 0
 delta(WSSR) : 0                 limit for stopping : 1e-05
 lambda	  : 0.157137

initial set of free parameter values

N_a1            = 148.413
N_a2            = 181.272
N_a4            = 181.272
N_a8            = 221.406
N_b1            = 11.0232
N_b2            = 14.8797
N_b4            = 27.1126
N_b8            = 29.9641
T_a             = 30.1368
T_b             = 165.035
N_0             = 0.64

After 5 iterations the fit converged.
final sum of squares of residuals : 16.1962
rel. change during last iteration : -6.24404e-08

degrees of freedom    (FIT_NDF)                        : 220
rms of residuals      (FIT_STDFIT) = sqrt(WSSR/ndf)    : 0.271329
variance of residuals (reduced chisquare) = WSSR/ndf   : 0.0736192

Final set of parameters            Asymptotic Standard Error
=======================            ==========================

N_a1            = 159.816          +/- 7.661        (4.794%)
N_a2            = 178.289          +/- 7.683        (4.309%)
N_a4            = 201.891          +/- 8.793        (4.355%)
N_a8            = 181.114          +/- 10.16        (5.611%)
N_b1            = 9.62915          +/- 2.776        (28.83%)
N_b2            = 16.767           +/- 4.291        (25.59%)
N_b4            = 23.681           +/- 5.712        (24.12%)
N_b8            = 30.3928          +/- 6.919        (22.76%)
T_a             = 25.3965          +/- 1.439        (5.666%)
T_b             = 142.873          +/- 31.6         (22.11%)
N_0             = 0.139323         +/- 0.03582      (25.71%)


correlation matrix of the fit parameters:

               N_a1   N_a2   N_a4   N_a8   N_b1   N_b2   N_b4   N_b8   T_a    T_b    N_0    
N_a1            1.000 
N_a2            0.444  1.000 
N_a4            0.356  0.416  1.000 
N_a8            0.119  0.296  0.394  1.000 
N_b1            0.407  0.198  0.001 -0.380  1.000 
N_b2            0.485  0.091 -0.023 -0.406  0.949  1.000 
N_b4            0.479  0.169 -0.111 -0.417  0.953  0.965  1.000 
N_b8            0.464  0.151 -0.052 -0.502  0.954  0.967  0.972  1.000 
T_a            -0.678 -0.424 -0.247  0.143 -0.900 -0.896 -0.894 -0.884  1.000 
T_b            -0.424 -0.102  0.104  0.483 -0.956 -0.973 -0.979 -0.985  0.857  1.000 
N_0             0.003 -0.004 -0.009 -0.012 -0.025 -0.012 -0.006 -0.002  0.006 -0.014  1.000 


*******************************************************************************
Thu Mar 12 19:44:35 2015


FIT:    data read from 'data.dat' using (($1)-2.5):-2:(($2)/5):(max(0.5,sqrt($2)))
        format = x:y:z:s
        x range restricted to [0.00000 : 250.000]
        y range restricted to [-10.0000 : 150.000]
        #datapoints = 231
function used for fitting: f(x,y)
fitted parameters initialized with current variable values



 Iteration 0
 WSSR        : 106.053           delta(WSSR)/WSSR   : 0
 delta(WSSR) : 0                 limit for stopping : 1e-05
 lambda	  : 0.157137

initial set of free parameter values

N_a1            = 148.413
N_a2            = 181.272
N_a4            = 181.272
N_a8            = 221.406
N_b1            = 11.0232
N_b2            = 14.8797
N_b4            = 27.1126
N_b8            = 29.9641
T_a             = 30.1368
T_b             = 165.035
N_0             = 0.64

After 5 iterations the fit converged.
final sum of squares of residuals : 16.1962
rel. change during last iteration : -6.24404e-08

degrees of freedom    (FIT_NDF)                        : 220
rms of residuals      (FIT_STDFIT) = sqrt(WSSR/ndf)    : 0.271329
variance of residuals (reduced chisquare) = WSSR/ndf   : 0.0736192

Final set of parameters            Asymptotic Standard Error
=======================            ==========================

N_a1            = 159.816          +/- 7.661        (4.794%)
N_a2            = 178.289          +/- 7.683        (4.309%)
N_a4            = 201.891          +/- 8.793        (4.355%)
N_a8            = 181.114          +/- 10.16        (5.611%)
N_b1            = 9.62915          +/- 2.776        (28.83%)
N_b2            = 16.767           +/- 4.291        (25.59%)
N_b4            = 23.681           +/- 5.712        (24.12%)
N_b8            = 30.3928          +/- 6.919        (22.76%)
T_a             = 25.3965          +/- 1.439        (5.666%)
T_b             = 142.873          +/- 31.6         (22.11%)
N_0             = 0.139323         +/- 0.03582      (25.71%)


correlation matrix of the fit parameters:

               N_a1   N_a2   N_a4   N_a8   N_b1   N_b2   N_b4   N_b8   T_a    T_b    N_0    
N_a1            1.000 
N_a2            0.444  1.000 
N_a4            0.356  0.416  1.000 
N_a8            0.119  0.296  0.394  1.000 
N_b1            0.407  0.198  0.001 -0.380  1.000 
N_b2            0.485  0.091 -0.023 -0.406  0.949  1.000 
N_b4            0.479  0.169 -0.111 -0.417  0.953  0.965  1.000 
N_b8            0.464  0.151 -0.052 -0.502  0.954  0.967  0.972  1.000 
T_a            -0.678 -0.424 -0.247  0.143 -0.900 -0.896 -0.894 -0.884  1.000 
T_b            -0.424 -0.102  0.104  0.483 -0.956 -0.973 -0.979 -0.985  0.857  1.000 
N_0             0.003 -0.004 -0.009 -0.012 -0.025 -0.012 -0.006 -0.002  0.006 -0.014  1.000 


*******************************************************************************
Thu Mar 12 19:48:17 2015


FIT:    data read from 'data.dat' using (($1)-2.5):-2:(($2)/5):(max(0.5,sqrt($2)))
        format = x:y:z:s
        x range restricted to [0.00000 : 250.000]
        y range restricted to [-10.0000 : 150.000]
        #datapoints = 231
function used for fitting: f(x,y)
fitted parameters initialized with current variable values



 Iteration 0
 WSSR        : 106.053           delta(WSSR)/WSSR   : 0
 delta(WSSR) : 0                 limit for stopping : 1e-05
 lambda	  : 0.157137

initial set of free parameter values

N_a1            = 148.413
N_a2            = 181.272
N_a4            = 181.272
N_a8            = 221.406
N_b1            = 11.0232
N_b2            = 14.8797
N_b4            = 27.1126
N_b8            = 29.9641
T_a             = 30.1368
T_b             = 165.035
N_0             = 0.64

After 5 iterations the fit converged.
final sum of squares of residuals : 16.1962
rel. change during last iteration : -6.24404e-08

degrees of freedom    (FIT_NDF)                        : 220
rms of residuals      (FIT_STDFIT) = sqrt(WSSR/ndf)    : 0.271329
variance of residuals (reduced chisquare) = WSSR/ndf   : 0.0736192

Final set of parameters            Asymptotic Standard Error
=======================            ==========================

N_a1            = 159.816          +/- 7.661        (4.794%)
N_a2            = 178.289          +/- 7.683        (4.309%)
N_a4            = 201.891          +/- 8.793        (4.355%)
N_a8            = 181.114          +/- 10.16        (5.611%)
N_b1            = 9.62915          +/- 2.776        (28.83%)
N_b2            = 16.767           +/- 4.291        (25.59%)
N_b4            = 23.681           +/- 5.712        (24.12%)
N_b8            = 30.3928          +/- 6.919        (22.76%)
T_a             = 25.3965          +/- 1.439        (5.666%)
T_b             = 142.873          +/- 31.6         (22.11%)
N_0             = 0.139323         +/- 0.03582      (25.71%)


correlation matrix of the fit parameters:

               N_a1   N_a2   N_a4   N_a8   N_b1   N_b2   N_b4   N_b8   T_a    T_b    N_0    
N_a1            1.000 
N_a2            0.444  1.000 
N_a4            0.356  0.416  1.000 
N_a8            0.119  0.296  0.394  1.000 
N_b1            0.407  0.198  0.001 -0.380  1.000 
N_b2            0.485  0.091 -0.023 -0.406  0.949  1.000 
N_b4            0.479  0.169 -0.111 -0.417  0.953  0.965  1.000 
N_b8            0.464  0.151 -0.052 -0.502  0.954  0.967  0.972  1.000 
T_a            -0.678 -0.424 -0.247  0.143 -0.900 -0.896 -0.894 -0.884  1.000 
T_b            -0.424 -0.102  0.104  0.483 -0.956 -0.973 -0.979 -0.985  0.857  1.000 
N_0             0.003 -0.004 -0.009 -0.012 -0.025 -0.012 -0.006 -0.002  0.006 -0.014  1.000 


*******************************************************************************
Thu Mar 12 19:48:28 2015


FIT:    data read from 'data.dat' using (($1)-2.5):-2:(($2)/5):(max(0.5,sqrt($2)))
        format = x:y:z:s
        x range restricted to [0.00000 : 250.000]
        y range restricted to [-10.0000 : 150.000]
        #datapoints = 231
function used for fitting: f(x,y)
fitted parameters initialized with current variable values



 Iteration 0
 WSSR        : 106.053           delta(WSSR)/WSSR   : 0
 delta(WSSR) : 0                 limit for stopping : 1e-05
 lambda	  : 0.157137

initial set of free parameter values

N_a1            = 148.413
N_a2            = 181.272
N_a4            = 181.272
N_a8            = 221.406
N_b1            = 11.0232
N_b2            = 14.8797
N_b4            = 27.1126
N_b8            = 29.9641
T_a             = 30.1368
T_b             = 165.035
N_0             = 0.64

After 5 iterations the fit converged.
final sum of squares of residuals : 16.1962
rel. change during last iteration : -6.24404e-08

degrees of freedom    (FIT_NDF)                        : 220
rms of residuals      (FIT_STDFIT) = sqrt(WSSR/ndf)    : 0.271329
variance of residuals (reduced chisquare) = WSSR/ndf   : 0.0736192

Final set of parameters            Asymptotic Standard Error
=======================            ==========================

N_a1            = 159.816          +/- 7.661        (4.794%)
N_a2            = 178.289          +/- 7.683        (4.309%)
N_a4            = 201.891          +/- 8.793        (4.355%)
N_a8            = 181.114          +/- 10.16        (5.611%)
N_b1            = 9.62915          +/- 2.776        (28.83%)
N_b2            = 16.767           +/- 4.291        (25.59%)
N_b4            = 23.681           +/- 5.712        (24.12%)
N_b8            = 30.3928          +/- 6.919        (22.76%)
T_a             = 25.3965          +/- 1.439        (5.666%)
T_b             = 142.873          +/- 31.6         (22.11%)
N_0             = 0.139323         +/- 0.03582      (25.71%)


correlation matrix of the fit parameters:

               N_a1   N_a2   N_a4   N_a8   N_b1   N_b2   N_b4   N_b8   T_a    T_b    N_0    
N_a1            1.000 
N_a2            0.444  1.000 
N_a4            0.356  0.416  1.000 
N_a8            0.119  0.296  0.394  1.000 
N_b1            0.407  0.198  0.001 -0.380  1.000 
N_b2            0.485  0.091 -0.023 -0.406  0.949  1.000 
N_b4            0.479  0.169 -0.111 -0.417  0.953  0.965  1.000 
N_b8            0.464  0.151 -0.052 -0.502  0.954  0.967  0.972  1.000 
T_a            -0.678 -0.424 -0.247  0.143 -0.900 -0.896 -0.894 -0.884  1.000 
T_b            -0.424 -0.102  0.104  0.483 -0.956 -0.973 -0.979 -0.985  0.857  1.000 
N_0             0.003 -0.004 -0.009 -0.012 -0.025 -0.012 -0.006 -0.002  0.006 -0.014  1.000 


*******************************************************************************
Thu Mar 12 19:49:58 2015


FIT:    data read from 'data.dat' using (($1)-2.5):-2:(($2)/5):(max(0.5,sqrt($2)))
        format = x:y:z:s
        x range restricted to [0.00000 : 250.000]
        y range restricted to [-10.0000 : 150.000]
        #datapoints = 231
function used for fitting: f(x,y)
fitted parameters initialized with current variable values



 Iteration 0
 WSSR        : 106.053           delta(WSSR)/WSSR   : 0
 delta(WSSR) : 0                 limit for stopping : 1e-05
 lambda	  : 0.157137

initial set of free parameter values

N_a1            = 148.413
N_a2            = 181.272
N_a4            = 181.272
N_a8            = 221.406
N_b1            = 11.0232
N_b2            = 14.8797
N_b4            = 27.1126
N_b8            = 29.9641
T_a             = 30.1368
T_b             = 165.035
N_0             = 0.64

After 5 iterations the fit converged.
final sum of squares of residuals : 16.1962
rel. change during last iteration : -6.24404e-08

degrees of freedom    (FIT_NDF)                        : 220
rms of residuals      (FIT_STDFIT) = sqrt(WSSR/ndf)    : 0.271329
variance of residuals (reduced chisquare) = WSSR/ndf   : 0.0736192

Final set of parameters            Asymptotic Standard Error
=======================            ==========================

N_a1            = 159.816          +/- 7.661        (4.794%)
N_a2            = 178.289          +/- 7.683        (4.309%)
N_a4            = 201.891          +/- 8.793        (4.355%)
N_a8            = 181.114          +/- 10.16        (5.611%)
N_b1            = 9.62915          +/- 2.776        (28.83%)
N_b2            = 16.767           +/- 4.291        (25.59%)
N_b4            = 23.681           +/- 5.712        (24.12%)
N_b8            = 30.3928          +/- 6.919        (22.76%)
T_a             = 25.3965          +/- 1.439        (5.666%)
T_b             = 142.873          +/- 31.6         (22.11%)
N_0             = 0.139323         +/- 0.03582      (25.71%)


correlation matrix of the fit parameters:

               N_a1   N_a2   N_a4   N_a8   N_b1   N_b2   N_b4   N_b8   T_a    T_b    N_0    
N_a1            1.000 
N_a2            0.444  1.000 
N_a4            0.356  0.416  1.000 
N_a8            0.119  0.296  0.394  1.000 
N_b1            0.407  0.198  0.001 -0.380  1.000 
N_b2            0.485  0.091 -0.023 -0.406  0.949  1.000 
N_b4            0.479  0.169 -0.111 -0.417  0.953  0.965  1.000 
N_b8            0.464  0.151 -0.052 -0.502  0.954  0.967  0.972  1.000 
T_a            -0.678 -0.424 -0.247  0.143 -0.900 -0.896 -0.894 -0.884  1.000 
T_b            -0.424 -0.102  0.104  0.483 -0.956 -0.973 -0.979 -0.985  0.857  1.000 
N_0             0.003 -0.004 -0.009 -0.012 -0.025 -0.012 -0.006 -0.002  0.006 -0.014  1.000 


*******************************************************************************
Thu Mar 12 19:51:38 2015


FIT:    data read from 'data.dat' using (($1)-2.5):-2:(($2)/5):(max(0.5,sqrt($2)))
        format = x:y:z:s
        x range restricted to [0.00000 : 250.000]
        y range restricted to [-10.0000 : 150.000]
        #datapoints = 231
function used for fitting: f(x,y)
fitted parameters initialized with current variable values



 Iteration 0
 WSSR        : 106.053           delta(WSSR)/WSSR   : 0
 delta(WSSR) : 0                 limit for stopping : 1e-05
 lambda	  : 0.157137

initial set of free parameter values

N_a1            = 148.413
N_a2            = 181.272
N_a4            = 181.272
N_a8            = 221.406
N_b1            = 11.0232
N_b2            = 14.8797
N_b4            = 27.1126
N_b8            = 29.9641
T_a             = 30.1368
T_b             = 165.035
N_0             = 0.64

After 5 iterations the fit converged.
final sum of squares of residuals : 16.1962
rel. change during last iteration : -6.24404e-08

degrees of freedom    (FIT_NDF)                        : 220
rms of residuals      (FIT_STDFIT) = sqrt(WSSR/ndf)    : 0.271329
variance of residuals (reduced chisquare) = WSSR/ndf   : 0.0736192

Final set of parameters            Asymptotic Standard Error
=======================            ==========================

N_a1            = 159.816          +/- 7.661        (4.794%)
N_a2            = 178.289          +/- 7.683        (4.309%)
N_a4            = 201.891          +/- 8.793        (4.355%)
N_a8            = 181.114          +/- 10.16        (5.611%)
N_b1            = 9.62915          +/- 2.776        (28.83%)
N_b2            = 16.767           +/- 4.291        (25.59%)
N_b4            = 23.681           +/- 5.712        (24.12%)
N_b8            = 30.3928          +/- 6.919        (22.76%)
T_a             = 25.3965          +/- 1.439        (5.666%)
T_b             = 142.873          +/- 31.6         (22.11%)
N_0             = 0.139323         +/- 0.03582      (25.71%)


correlation matrix of the fit parameters:

               N_a1   N_a2   N_a4   N_a8   N_b1   N_b2   N_b4   N_b8   T_a    T_b    N_0    
N_a1            1.000 
N_a2            0.444  1.000 
N_a4            0.356  0.416  1.000 
N_a8            0.119  0.296  0.394  1.000 
N_b1            0.407  0.198  0.001 -0.380  1.000 
N_b2            0.485  0.091 -0.023 -0.406  0.949  1.000 
N_b4            0.479  0.169 -0.111 -0.417  0.953  0.965  1.000 
N_b8            0.464  0.151 -0.052 -0.502  0.954  0.967  0.972  1.000 
T_a            -0.678 -0.424 -0.247  0.143 -0.900 -0.896 -0.894 -0.884  1.000 
T_b            -0.424 -0.102  0.104  0.483 -0.956 -0.973 -0.979 -0.985  0.857  1.000 
N_0             0.003 -0.004 -0.009 -0.012 -0.025 -0.012 -0.006 -0.002  0.006 -0.014  1.000 


*******************************************************************************
Thu Mar 12 19:52:31 2015


FIT:    data read from 'data.dat' using (($1)-2.5):-2:(($2)/5):(max(0.5,sqrt($2)))
        format = x:y:z:s
        x range restricted to [0.00000 : 250.000]
        y range restricted to [-10.0000 : 150.000]
        #datapoints = 231
function used for fitting: f(x,y)
fitted parameters initialized with current variable values



 Iteration 0
 WSSR        : 106.053           delta(WSSR)/WSSR   : 0
 delta(WSSR) : 0                 limit for stopping : 1e-05
 lambda	  : 0.157137

initial set of free parameter values

N_a1            = 148.413
N_a2            = 181.272
N_a4            = 181.272
N_a8            = 221.406
N_b1            = 11.0232
N_b2            = 14.8797
N_b4            = 27.1126
N_b8            = 29.9641
T_a             = 30.1368
T_b             = 165.035
N_0             = 0.64

After 5 iterations the fit converged.
final sum of squares of residuals : 16.1962
rel. change during last iteration : -6.24404e-08

degrees of freedom    (FIT_NDF)                        : 220
rms of residuals      (FIT_STDFIT) = sqrt(WSSR/ndf)    : 0.271329
variance of residuals (reduced chisquare) = WSSR/ndf   : 0.0736192

Final set of parameters            Asymptotic Standard Error
=======================            ==========================

N_a1            = 159.816          +/- 7.661        (4.794%)
N_a2            = 178.289          +/- 7.683        (4.309%)
N_a4            = 201.891          +/- 8.793        (4.355%)
N_a8            = 181.114          +/- 10.16        (5.611%)
N_b1            = 9.62915          +/- 2.776        (28.83%)
N_b2            = 16.767           +/- 4.291        (25.59%)
N_b4            = 23.681           +/- 5.712        (24.12%)
N_b8            = 30.3928          +/- 6.919        (22.76%)
T_a             = 25.3965          +/- 1.439        (5.666%)
T_b             = 142.873          +/- 31.6         (22.11%)
N_0             = 0.139323         +/- 0.03582      (25.71%)


correlation matrix of the fit parameters:

               N_a1   N_a2   N_a4   N_a8   N_b1   N_b2   N_b4   N_b8   T_a    T_b    N_0    
N_a1            1.000 
N_a2            0.444  1.000 
N_a4            0.356  0.416  1.000 
N_a8            0.119  0.296  0.394  1.000 
N_b1            0.407  0.198  0.001 -0.380  1.000 
N_b2            0.485  0.091 -0.023 -0.406  0.949  1.000 
N_b4            0.479  0.169 -0.111 -0.417  0.953  0.965  1.000 
N_b8            0.464  0.151 -0.052 -0.502  0.954  0.967  0.972  1.000 
T_a            -0.678 -0.424 -0.247  0.143 -0.900 -0.896 -0.894 -0.884  1.000 
T_b            -0.424 -0.102  0.104  0.483 -0.956 -0.973 -0.979 -0.985  0.857  1.000 
N_0             0.003 -0.004 -0.009 -0.012 -0.025 -0.012 -0.006 -0.002  0.006 -0.014  1.000 


*******************************************************************************
Thu Mar 12 19:53:43 2015


FIT:    data read from 'data.dat' using (($1)-2.5):-2:(($2)/5):(max(0.5,sqrt($2)))
        format = x:y:z:s
        x range restricted to [0.00000 : 250.000]
        y range restricted to [-10.0000 : 150.000]
        #datapoints = 231
function used for fitting: f(x,y)
fitted parameters initialized with current variable values



 Iteration 0
 WSSR        : 106.053           delta(WSSR)/WSSR   : 0
 delta(WSSR) : 0                 limit for stopping : 1e-05
 lambda	  : 0.157137

initial set of free parameter values

N_a1            = 148.413
N_a2            = 181.272
N_a4            = 181.272
N_a8            = 221.406
N_b1            = 11.0232
N_b2            = 14.8797
N_b4            = 27.1126
N_b8            = 29.9641
T_a             = 30.1368
T_b             = 165.035
N_0             = 0.64

After 5 iterations the fit converged.
final sum of squares of residuals : 16.1962
rel. change during last iteration : -6.24404e-08

degrees of freedom    (FIT_NDF)                        : 220
rms of residuals      (FIT_STDFIT) = sqrt(WSSR/ndf)    : 0.271329
variance of residuals (reduced chisquare) = WSSR/ndf   : 0.0736192

Final set of parameters            Asymptotic Standard Error
=======================            ==========================

N_a1            = 159.816          +/- 7.661        (4.794%)
N_a2            = 178.289          +/- 7.683        (4.309%)
N_a4            = 201.891          +/- 8.793        (4.355%)
N_a8            = 181.114          +/- 10.16        (5.611%)
N_b1            = 9.62915          +/- 2.776        (28.83%)
N_b2            = 16.767           +/- 4.291        (25.59%)
N_b4            = 23.681           +/- 5.712        (24.12%)
N_b8            = 30.3928          +/- 6.919        (22.76%)
T_a             = 25.3965          +/- 1.439        (5.666%)
T_b             = 142.873          +/- 31.6         (22.11%)
N_0             = 0.139323         +/- 0.03582      (25.71%)


correlation matrix of the fit parameters:

               N_a1   N_a2   N_a4   N_a8   N_b1   N_b2   N_b4   N_b8   T_a    T_b    N_0    
N_a1            1.000 
N_a2            0.444  1.000 
N_a4            0.356  0.416  1.000 
N_a8            0.119  0.296  0.394  1.000 
N_b1            0.407  0.198  0.001 -0.380  1.000 
N_b2            0.485  0.091 -0.023 -0.406  0.949  1.000 
N_b4            0.479  0.169 -0.111 -0.417  0.953  0.965  1.000 
N_b8            0.464  0.151 -0.052 -0.502  0.954  0.967  0.972  1.000 
T_a            -0.678 -0.424 -0.247  0.143 -0.900 -0.896 -0.894 -0.884  1.000 
T_b            -0.424 -0.102  0.104  0.483 -0.956 -0.973 -0.979 -0.985  0.857  1.000 
N_0             0.003 -0.004 -0.009 -0.012 -0.025 -0.012 -0.006 -0.002  0.006 -0.014  1.000 


*******************************************************************************
Thu Mar 12 19:54:12 2015


FIT:    data read from 'data.dat' using (($1)-2.5):-2:(($2)/5):(max(0.5,sqrt($2)))
        format = x:y:z:s
        x range restricted to [0.00000 : 250.000]
        y range restricted to [-10.0000 : 150.000]
        #datapoints = 231
function used for fitting: f(x,y)
fitted parameters initialized with current variable values



 Iteration 0
 WSSR        : 106.053           delta(WSSR)/WSSR   : 0
 delta(WSSR) : 0                 limit for stopping : 1e-05
 lambda	  : 0.157137

initial set of free parameter values

N_a1            = 148.413
N_a2            = 181.272
N_a4            = 181.272
N_a8            = 221.406
N_b1            = 11.0232
N_b2            = 14.8797
N_b4            = 27.1126
N_b8            = 29.9641
T_a             = 30.1368
T_b             = 165.035
N_0             = 0.64

After 5 iterations the fit converged.
final sum of squares of residuals : 16.1962
rel. change during last iteration : -6.24404e-08

degrees of freedom    (FIT_NDF)                        : 220
rms of residuals      (FIT_STDFIT) = sqrt(WSSR/ndf)    : 0.271329
variance of residuals (reduced chisquare) = WSSR/ndf   : 0.0736192

Final set of parameters            Asymptotic Standard Error
=======================            ==========================

N_a1            = 159.816          +/- 7.661        (4.794%)
N_a2            = 178.289          +/- 7.683        (4.309%)
N_a4            = 201.891          +/- 8.793        (4.355%)
N_a8            = 181.114          +/- 10.16        (5.611%)
N_b1            = 9.62915          +/- 2.776        (28.83%)
N_b2            = 16.767           +/- 4.291        (25.59%)
N_b4            = 23.681           +/- 5.712        (24.12%)
N_b8            = 30.3928          +/- 6.919        (22.76%)
T_a             = 25.3965          +/- 1.439        (5.666%)
T_b             = 142.873          +/- 31.6         (22.11%)
N_0             = 0.139323         +/- 0.03582      (25.71%)


correlation matrix of the fit parameters:

               N_a1   N_a2   N_a4   N_a8   N_b1   N_b2   N_b4   N_b8   T_a    T_b    N_0    
N_a1            1.000 
N_a2            0.444  1.000 
N_a4            0.356  0.416  1.000 
N_a8            0.119  0.296  0.394  1.000 
N_b1            0.407  0.198  0.001 -0.380  1.000 
N_b2            0.485  0.091 -0.023 -0.406  0.949  1.000 
N_b4            0.479  0.169 -0.111 -0.417  0.953  0.965  1.000 
N_b8            0.464  0.151 -0.052 -0.502  0.954  0.967  0.972  1.000 
T_a            -0.678 -0.424 -0.247  0.143 -0.900 -0.896 -0.894 -0.884  1.000 
T_b            -0.424 -0.102  0.104  0.483 -0.956 -0.973 -0.979 -0.985  0.857  1.000 
N_0             0.003 -0.004 -0.009 -0.012 -0.025 -0.012 -0.006 -0.002  0.006 -0.014  1.000 


*******************************************************************************
Thu Mar 12 19:54:54 2015


FIT:    data read from 'data.dat' using (($1)-2.5):-2:(($2)/5):(max(0.5,sqrt($2)))
        format = x:y:z:s
        x range restricted to [0.00000 : 250.000]
        y range restricted to [-10.0000 : 150.000]
        #datapoints = 231
function used for fitting: f(x,y)
fitted parameters initialized with current variable values



 Iteration 0
 WSSR        : 106.053           delta(WSSR)/WSSR   : 0
 delta(WSSR) : 0                 limit for stopping : 1e-05
 lambda	  : 0.157137

initial set of free parameter values

N_a1            = 148.413
N_a2            = 181.272
N_a4            = 181.272
N_a8            = 221.406
N_b1            = 11.0232
N_b2            = 14.8797
N_b4            = 27.1126
N_b8            = 29.9641
T_a             = 30.1368
T_b             = 165.035
N_0             = 0.64

After 5 iterations the fit converged.
final sum of squares of residuals : 16.1962
rel. change during last iteration : -6.24404e-08

degrees of freedom    (FIT_NDF)                        : 220
rms of residuals      (FIT_STDFIT) = sqrt(WSSR/ndf)    : 0.271329
variance of residuals (reduced chisquare) = WSSR/ndf   : 0.0736192

Final set of parameters            Asymptotic Standard Error
=======================            ==========================

N_a1            = 159.816          +/- 7.661        (4.794%)
N_a2            = 178.289          +/- 7.683        (4.309%)
N_a4            = 201.891          +/- 8.793        (4.355%)
N_a8            = 181.114          +/- 10.16        (5.611%)
N_b1            = 9.62915          +/- 2.776        (28.83%)
N_b2            = 16.767           +/- 4.291        (25.59%)
N_b4            = 23.681           +/- 5.712        (24.12%)
N_b8            = 30.3928          +/- 6.919        (22.76%)
T_a             = 25.3965          +/- 1.439        (5.666%)
T_b             = 142.873          +/- 31.6         (22.11%)
N_0             = 0.139323         +/- 0.03582      (25.71%)


correlation matrix of the fit parameters:

               N_a1   N_a2   N_a4   N_a8   N_b1   N_b2   N_b4   N_b8   T_a    T_b    N_0    
N_a1            1.000 
N_a2            0.444  1.000 
N_a4            0.356  0.416  1.000 
N_a8            0.119  0.296  0.394  1.000 
N_b1            0.407  0.198  0.001 -0.380  1.000 
N_b2            0.485  0.091 -0.023 -0.406  0.949  1.000 
N_b4            0.479  0.169 -0.111 -0.417  0.953  0.965  1.000 
N_b8            0.464  0.151 -0.052 -0.502  0.954  0.967  0.972  1.000 
T_a            -0.678 -0.424 -0.247  0.143 -0.900 -0.896 -0.894 -0.884  1.000 
T_b            -0.424 -0.102  0.104  0.483 -0.956 -0.973 -0.979 -0.985  0.857  1.000 
N_0             0.003 -0.004 -0.009 -0.012 -0.025 -0.012 -0.006 -0.002  0.006 -0.014  1.000 


*******************************************************************************
Thu Mar 12 19:55:58 2015


FIT:    data read from 'data.dat' using (($1)-2.5):-2:(($2)/5):(max(0.5,sqrt($2)))
        format = x:y:z:s
        x range restricted to [0.00000 : 250.000]
        y range restricted to [-10.0000 : 150.000]
        #datapoints = 231
function used for fitting: f(x,y)
fitted parameters initialized with current variable values



 Iteration 0
 WSSR        : 106.053           delta(WSSR)/WSSR   : 0
 delta(WSSR) : 0                 limit for stopping : 1e-05
 lambda	  : 0.157137

initial set of free parameter values

N_a1            = 148.413
N_a2            = 181.272
N_a4            = 181.272
N_a8            = 221.406
N_b1            = 11.0232
N_b2            = 14.8797
N_b4            = 27.1126
N_b8            = 29.9641
T_a             = 30.1368
T_b             = 165.035
N_0             = 0.64

After 5 iterations the fit converged.
final sum of squares of residuals : 16.1962
rel. change during last iteration : -6.24404e-08

degrees of freedom    (FIT_NDF)                        : 220
rms of residuals      (FIT_STDFIT) = sqrt(WSSR/ndf)    : 0.271329
variance of residuals (reduced chisquare) = WSSR/ndf   : 0.0736192

Final set of parameters            Asymptotic Standard Error
=======================            ==========================

N_a1            = 159.816          +/- 7.661        (4.794%)
N_a2            = 178.289          +/- 7.683        (4.309%)
N_a4            = 201.891          +/- 8.793        (4.355%)
N_a8            = 181.114          +/- 10.16        (5.611%)
N_b1            = 9.62915          +/- 2.776        (28.83%)
N_b2            = 16.767           +/- 4.291        (25.59%)
N_b4            = 23.681           +/- 5.712        (24.12%)
N_b8            = 30.3928          +/- 6.919        (22.76%)
T_a             = 25.3965          +/- 1.439        (5.666%)
T_b             = 142.873          +/- 31.6         (22.11%)
N_0             = 0.139323         +/- 0.03582      (25.71%)


correlation matrix of the fit parameters:

               N_a1   N_a2   N_a4   N_a8   N_b1   N_b2   N_b4   N_b8   T_a    T_b    N_0    
N_a1            1.000 
N_a2            0.444  1.000 
N_a4            0.356  0.416  1.000 
N_a8            0.119  0.296  0.394  1.000 
N_b1            0.407  0.198  0.001 -0.380  1.000 
N_b2            0.485  0.091 -0.023 -0.406  0.949  1.000 
N_b4            0.479  0.169 -0.111 -0.417  0.953  0.965  1.000 
N_b8            0.464  0.151 -0.052 -0.502  0.954  0.967  0.972  1.000 
T_a            -0.678 -0.424 -0.247  0.143 -0.900 -0.896 -0.894 -0.884  1.000 
T_b            -0.424 -0.102  0.104  0.483 -0.956 -0.973 -0.979 -0.985  0.857  1.000 
N_0             0.003 -0.004 -0.009 -0.012 -0.025 -0.012 -0.006 -0.002  0.006 -0.014  1.000 


*******************************************************************************
Thu Mar 12 19:56:24 2015


FIT:    data read from 'data.dat' using (($1)-2.5):-2:(($2)/5):(max(0.5,sqrt($2)))
        format = x:y:z:s
        x range restricted to [0.00000 : 250.000]
        y range restricted to [-10.0000 : 150.000]
        #datapoints = 231
function used for fitting: f(x,y)
fitted parameters initialized with current variable values



 Iteration 0
 WSSR        : 106.053           delta(WSSR)/WSSR   : 0
 delta(WSSR) : 0                 limit for stopping : 1e-05
 lambda	  : 0.157137

initial set of free parameter values

N_a1            = 148.413
N_a2            = 181.272
N_a4            = 181.272
N_a8            = 221.406
N_b1            = 11.0232
N_b2            = 14.8797
N_b4            = 27.1126
N_b8            = 29.9641
T_a             = 30.1368
T_b             = 165.035
N_0             = 0.64

After 5 iterations the fit converged.
final sum of squares of residuals : 16.1962
rel. change during last iteration : -6.24404e-08

degrees of freedom    (FIT_NDF)                        : 220
rms of residuals      (FIT_STDFIT) = sqrt(WSSR/ndf)    : 0.271329
variance of residuals (reduced chisquare) = WSSR/ndf   : 0.0736192

Final set of parameters            Asymptotic Standard Error
=======================            ==========================

N_a1            = 159.816          +/- 7.661        (4.794%)
N_a2            = 178.289          +/- 7.683        (4.309%)
N_a4            = 201.891          +/- 8.793        (4.355%)
N_a8            = 181.114          +/- 10.16        (5.611%)
N_b1            = 9.62915          +/- 2.776        (28.83%)
N_b2            = 16.767           +/- 4.291        (25.59%)
N_b4            = 23.681           +/- 5.712        (24.12%)
N_b8            = 30.3928          +/- 6.919        (22.76%)
T_a             = 25.3965          +/- 1.439        (5.666%)
T_b             = 142.873          +/- 31.6         (22.11%)
N_0             = 0.139323         +/- 0.03582      (25.71%)


correlation matrix of the fit parameters:

               N_a1   N_a2   N_a4   N_a8   N_b1   N_b2   N_b4   N_b8   T_a    T_b    N_0    
N_a1            1.000 
N_a2            0.444  1.000 
N_a4            0.356  0.416  1.000 
N_a8            0.119  0.296  0.394  1.000 
N_b1            0.407  0.198  0.001 -0.380  1.000 
N_b2            0.485  0.091 -0.023 -0.406  0.949  1.000 
N_b4            0.479  0.169 -0.111 -0.417  0.953  0.965  1.000 
N_b8            0.464  0.151 -0.052 -0.502  0.954  0.967  0.972  1.000 
T_a            -0.678 -0.424 -0.247  0.143 -0.900 -0.896 -0.894 -0.884  1.000 
T_b            -0.424 -0.102  0.104  0.483 -0.956 -0.973 -0.979 -0.985  0.857  1.000 
N_0             0.003 -0.004 -0.009 -0.012 -0.025 -0.012 -0.006 -0.002  0.006 -0.014  1.000 


*******************************************************************************
Thu Mar 12 19:56:58 2015


FIT:    data read from 'data.dat' using (($1)-2.5):-2:(($2)/5):(max(0.5,sqrt($2)))
        format = x:y:z:s
        x range restricted to [0.00000 : 250.000]
        y range restricted to [-10.0000 : 150.000]
        #datapoints = 231
function used for fitting: f(x,y)
fitted parameters initialized with current variable values



 Iteration 0
 WSSR        : 106.053           delta(WSSR)/WSSR   : 0
 delta(WSSR) : 0                 limit for stopping : 1e-05
 lambda	  : 0.157137

initial set of free parameter values

N_a1            = 148.413
N_a2            = 181.272
N_a4            = 181.272
N_a8            = 221.406
N_b1            = 11.0232
N_b2            = 14.8797
N_b4            = 27.1126
N_b8            = 29.9641
T_a             = 30.1368
T_b             = 165.035
N_0             = 0.64

After 5 iterations the fit converged.
final sum of squares of residuals : 16.1962
rel. change during last iteration : -6.24404e-08

degrees of freedom    (FIT_NDF)                        : 220
rms of residuals      (FIT_STDFIT) = sqrt(WSSR/ndf)    : 0.271329
variance of residuals (reduced chisquare) = WSSR/ndf   : 0.0736192

Final set of parameters            Asymptotic Standard Error
=======================            ==========================

N_a1            = 159.816          +/- 7.661        (4.794%)
N_a2            = 178.289          +/- 7.683        (4.309%)
N_a4            = 201.891          +/- 8.793        (4.355%)
N_a8            = 181.114          +/- 10.16        (5.611%)
N_b1            = 9.62915          +/- 2.776        (28.83%)
N_b2            = 16.767           +/- 4.291        (25.59%)
N_b4            = 23.681           +/- 5.712        (24.12%)
N_b8            = 30.3928          +/- 6.919        (22.76%)
T_a             = 25.3965          +/- 1.439        (5.666%)
T_b             = 142.873          +/- 31.6         (22.11%)
N_0             = 0.139323         +/- 0.03582      (25.71%)


correlation matrix of the fit parameters:

               N_a1   N_a2   N_a4   N_a8   N_b1   N_b2   N_b4   N_b8   T_a    T_b    N_0    
N_a1            1.000 
N_a2            0.444  1.000 
N_a4            0.356  0.416  1.000 
N_a8            0.119  0.296  0.394  1.000 
N_b1            0.407  0.198  0.001 -0.380  1.000 
N_b2            0.485  0.091 -0.023 -0.406  0.949  1.000 
N_b4            0.479  0.169 -0.111 -0.417  0.953  0.965  1.000 
N_b8            0.464  0.151 -0.052 -0.502  0.954  0.967  0.972  1.000 
T_a            -0.678 -0.424 -0.247  0.143 -0.900 -0.896 -0.894 -0.884  1.000 
T_b            -0.424 -0.102  0.104  0.483 -0.956 -0.973 -0.979 -0.985  0.857  1.000 
N_0             0.003 -0.004 -0.009 -0.012 -0.025 -0.012 -0.006 -0.002  0.006 -0.014  1.000 


*******************************************************************************
Thu Mar 12 19:57:38 2015


FIT:    data read from 'data.dat' using (($1)-2.5):-2:(($2)/5):(max(0.5,sqrt($2)))
        format = x:y:z:s
        x range restricted to [0.00000 : 250.000]
        y range restricted to [-10.0000 : 150.000]
        #datapoints = 231
function used for fitting: f(x,y)
fitted parameters initialized with current variable values



 Iteration 0
 WSSR        : 106.053           delta(WSSR)/WSSR   : 0
 delta(WSSR) : 0                 limit for stopping : 1e-05
 lambda	  : 0.157137

initial set of free parameter values

N_a1            = 148.413
N_a2            = 181.272
N_a4            = 181.272
N_a8            = 221.406
N_b1            = 11.0232
N_b2            = 14.8797
N_b4            = 27.1126
N_b8            = 29.9641
T_a             = 30.1368
T_b             = 165.035
N_0             = 0.64

After 5 iterations the fit converged.
final sum of squares of residuals : 16.1962
rel. change during last iteration : -6.24404e-08

degrees of freedom    (FIT_NDF)                        : 220
rms of residuals      (FIT_STDFIT) = sqrt(WSSR/ndf)    : 0.271329
variance of residuals (reduced chisquare) = WSSR/ndf   : 0.0736192

Final set of parameters            Asymptotic Standard Error
=======================            ==========================

N_a1            = 159.816          +/- 7.661        (4.794%)
N_a2            = 178.289          +/- 7.683        (4.309%)
N_a4            = 201.891          +/- 8.793        (4.355%)
N_a8            = 181.114          +/- 10.16        (5.611%)
N_b1            = 9.62915          +/- 2.776        (28.83%)
N_b2            = 16.767           +/- 4.291        (25.59%)
N_b4            = 23.681           +/- 5.712        (24.12%)
N_b8            = 30.3928          +/- 6.919        (22.76%)
T_a             = 25.3965          +/- 1.439        (5.666%)
T_b             = 142.873          +/- 31.6         (22.11%)
N_0             = 0.139323         +/- 0.03582      (25.71%)


correlation matrix of the fit parameters:

               N_a1   N_a2   N_a4   N_a8   N_b1   N_b2   N_b4   N_b8   T_a    T_b    N_0    
N_a1            1.000 
N_a2            0.444  1.000 
N_a4            0.356  0.416  1.000 
N_a8            0.119  0.296  0.394  1.000 
N_b1            0.407  0.198  0.001 -0.380  1.000 
N_b2            0.485  0.091 -0.023 -0.406  0.949  1.000 
N_b4            0.479  0.169 -0.111 -0.417  0.953  0.965  1.000 
N_b8            0.464  0.151 -0.052 -0.502  0.954  0.967  0.972  1.000 
T_a            -0.678 -0.424 -0.247  0.143 -0.900 -0.896 -0.894 -0.884  1.000 
T_b            -0.424 -0.102  0.104  0.483 -0.956 -0.973 -0.979 -0.985  0.857  1.000 
N_0             0.003 -0.004 -0.009 -0.012 -0.025 -0.012 -0.006 -0.002  0.006 -0.014  1.000 


*******************************************************************************
Thu Mar 12 19:58:20 2015


FIT:    data read from 'data.dat' using (($1)-2.5):-2:(($2)/5):(max(0.5,sqrt($2)))
        format = x:y:z:s
        x range restricted to [0.00000 : 250.000]
        y range restricted to [-10.0000 : 150.000]
        #datapoints = 231
function used for fitting: f(x,y)
fitted parameters initialized with current variable values



 Iteration 0
 WSSR        : 106.053           delta(WSSR)/WSSR   : 0
 delta(WSSR) : 0                 limit for stopping : 1e-05
 lambda	  : 0.157137

initial set of free parameter values

N_a1            = 148.413
N_a2            = 181.272
N_a4            = 181.272
N_a8            = 221.406
N_b1            = 11.0232
N_b2            = 14.8797
N_b4            = 27.1126
N_b8            = 29.9641
T_a             = 30.1368
T_b             = 165.035
N_0             = 0.64

After 5 iterations the fit converged.
final sum of squares of residuals : 16.1962
rel. change during last iteration : -6.24404e-08

degrees of freedom    (FIT_NDF)                        : 220
rms of residuals      (FIT_STDFIT) = sqrt(WSSR/ndf)    : 0.271329
variance of residuals (reduced chisquare) = WSSR/ndf   : 0.0736192

Final set of parameters            Asymptotic Standard Error
=======================            ==========================

N_a1            = 159.816          +/- 7.661        (4.794%)
N_a2            = 178.289          +/- 7.683        (4.309%)
N_a4            = 201.891          +/- 8.793        (4.355%)
N_a8            = 181.114          +/- 10.16        (5.611%)
N_b1            = 9.62915          +/- 2.776        (28.83%)
N_b2            = 16.767           +/- 4.291        (25.59%)
N_b4            = 23.681           +/- 5.712        (24.12%)
N_b8            = 30.3928          +/- 6.919        (22.76%)
T_a             = 25.3965          +/- 1.439        (5.666%)
T_b             = 142.873          +/- 31.6         (22.11%)
N_0             = 0.139323         +/- 0.03582      (25.71%)


correlation matrix of the fit parameters:

               N_a1   N_a2   N_a4   N_a8   N_b1   N_b2   N_b4   N_b8   T_a    T_b    N_0    
N_a1            1.000 
N_a2            0.444  1.000 
N_a4            0.356  0.416  1.000 
N_a8            0.119  0.296  0.394  1.000 
N_b1            0.407  0.198  0.001 -0.380  1.000 
N_b2            0.485  0.091 -0.023 -0.406  0.949  1.000 
N_b4            0.479  0.169 -0.111 -0.417  0.953  0.965  1.000 
N_b8            0.464  0.151 -0.052 -0.502  0.954  0.967  0.972  1.000 
T_a            -0.678 -0.424 -0.247  0.143 -0.900 -0.896 -0.894 -0.884  1.000 
T_b            -0.424 -0.102  0.104  0.483 -0.956 -0.973 -0.979 -0.985  0.857  1.000 
N_0             0.003 -0.004 -0.009 -0.012 -0.025 -0.012 -0.006 -0.002  0.006 -0.014  1.000 


*******************************************************************************
Thu Mar 12 20:06:18 2015


FIT:    data read from 'data.dat' using (($1)-2.5):-2:(($2)/5):(max(0.5,sqrt($2)))
        format = x:y:z:s
        x range restricted to [0.00000 : 250.000]
        y range restricted to [-10.0000 : 150.000]
        #datapoints = 231
function used for fitting: f(x,y)
fitted parameters initialized with current variable values



 Iteration 0
 WSSR        : 106.053           delta(WSSR)/WSSR   : 0
 delta(WSSR) : 0                 limit for stopping : 1e-05
 lambda	  : 0.157137

initial set of free parameter values

N_a1            = 148.413
N_a2            = 181.272
N_a4            = 181.272
N_a8            = 221.406
N_b1            = 11.0232
N_b2            = 14.8797
N_b4            = 27.1126
N_b8            = 29.9641
T_a             = 30.1368
T_b             = 165.035
N_0             = 0.64

After 5 iterations the fit converged.
final sum of squares of residuals : 16.1962
rel. change during last iteration : -6.24404e-08

degrees of freedom    (FIT_NDF)                        : 220
rms of residuals      (FIT_STDFIT) = sqrt(WSSR/ndf)    : 0.271329
variance of residuals (reduced chisquare) = WSSR/ndf   : 0.0736192

Final set of parameters            Asymptotic Standard Error
=======================            ==========================

N_a1            = 159.816          +/- 7.661        (4.794%)
N_a2            = 178.289          +/- 7.683        (4.309%)
N_a4            = 201.891          +/- 8.793        (4.355%)
N_a8            = 181.114          +/- 10.16        (5.611%)
N_b1            = 9.62915          +/- 2.776        (28.83%)
N_b2            = 16.767           +/- 4.291        (25.59%)
N_b4            = 23.681           +/- 5.712        (24.12%)
N_b8            = 30.3928          +/- 6.919        (22.76%)
T_a             = 25.3965          +/- 1.439        (5.666%)
T_b             = 142.873          +/- 31.6         (22.11%)
N_0             = 0.139323         +/- 0.03582      (25.71%)


correlation matrix of the fit parameters:

               N_a1   N_a2   N_a4   N_a8   N_b1   N_b2   N_b4   N_b8   T_a    T_b    N_0    
N_a1            1.000 
N_a2            0.444  1.000 
N_a4            0.356  0.416  1.000 
N_a8            0.119  0.296  0.394  1.000 
N_b1            0.407  0.198  0.001 -0.380  1.000 
N_b2            0.485  0.091 -0.023 -0.406  0.949  1.000 
N_b4            0.479  0.169 -0.111 -0.417  0.953  0.965  1.000 
N_b8            0.464  0.151 -0.052 -0.502  0.954  0.967  0.972  1.000 
T_a            -0.678 -0.424 -0.247  0.143 -0.900 -0.896 -0.894 -0.884  1.000 
T_b            -0.424 -0.102  0.104  0.483 -0.956 -0.973 -0.979 -0.985  0.857  1.000 
N_0             0.003 -0.004 -0.009 -0.012 -0.025 -0.012 -0.006 -0.002  0.006 -0.014  1.000 


*******************************************************************************
Thu Mar 12 20:52:16 2015


FIT:    data read from 'data.dat' using (($1)-2.5):-2:(($2)/5):(max(0.5,sqrt($2)))
        format = x:y:z:s
        x range restricted to [0.00000 : 250.000]
        y range restricted to [-10.0000 : 150.000]
        #datapoints = 231
function used for fitting: f(x,y)
fitted parameters initialized with current variable values



 Iteration 0
 WSSR        : 106.053           delta(WSSR)/WSSR   : 0
 delta(WSSR) : 0                 limit for stopping : 1e-05
 lambda	  : 0.157137

initial set of free parameter values

N_a1            = 148.413
N_a2            = 181.272
N_a4            = 181.272
N_a8            = 221.406
N_b1            = 11.0232
N_b2            = 14.8797
N_b4            = 27.1126
N_b8            = 29.9641
T_a             = 30.1368
T_b             = 165.035
N_0             = 0.64

After 5 iterations the fit converged.
final sum of squares of residuals : 16.1962
rel. change during last iteration : -6.24404e-08

degrees of freedom    (FIT_NDF)                        : 220
rms of residuals      (FIT_STDFIT) = sqrt(WSSR/ndf)    : 0.271329
variance of residuals (reduced chisquare) = WSSR/ndf   : 0.0736192

Final set of parameters            Asymptotic Standard Error
=======================            ==========================

N_a1            = 159.816          +/- 7.661        (4.794%)
N_a2            = 178.289          +/- 7.683        (4.309%)
N_a4            = 201.891          +/- 8.793        (4.355%)
N_a8            = 181.114          +/- 10.16        (5.611%)
N_b1            = 9.62915          +/- 2.776        (28.83%)
N_b2            = 16.767           +/- 4.291        (25.59%)
N_b4            = 23.681           +/- 5.712        (24.12%)
N_b8            = 30.3928          +/- 6.919        (22.76%)
T_a             = 25.3965          +/- 1.439        (5.666%)
T_b             = 142.873          +/- 31.6         (22.11%)
N_0             = 0.139323         +/- 0.03582      (25.71%)


correlation matrix of the fit parameters:

               N_a1   N_a2   N_a4   N_a8   N_b1   N_b2   N_b4   N_b8   T_a    T_b    N_0    
N_a1            1.000 
N_a2            0.444  1.000 
N_a4            0.356  0.416  1.000 
N_a8            0.119  0.296  0.394  1.000 
N_b1            0.407  0.198  0.001 -0.380  1.000 
N_b2            0.485  0.091 -0.023 -0.406  0.949  1.000 
N_b4            0.479  0.169 -0.111 -0.417  0.953  0.965  1.000 
N_b8            0.464  0.151 -0.052 -0.502  0.954  0.967  0.972  1.000 
T_a            -0.678 -0.424 -0.247  0.143 -0.900 -0.896 -0.894 -0.884  1.000 
T_b            -0.424 -0.102  0.104  0.483 -0.956 -0.973 -0.979 -0.985  0.857  1.000 
N_0             0.003 -0.004 -0.009 -0.012 -0.025 -0.012 -0.006 -0.002  0.006 -0.014  1.000 


*******************************************************************************
Thu Mar 12 20:52:39 2015


FIT:    data read from 'data.dat' using (($1)-2.5):-2:(($2)/5):(max(0.5,sqrt($2)))
        format = x:y:z:s
        x range restricted to [0.00000 : 250.000]
        y range restricted to [-10.0000 : 150.000]
        #datapoints = 231
function used for fitting: f(x,y)
fitted parameters initialized with current variable values



 Iteration 0
 WSSR        : 106.053           delta(WSSR)/WSSR   : 0
 delta(WSSR) : 0                 limit for stopping : 1e-05
 lambda	  : 0.157137

initial set of free parameter values

N_a1            = 148.413
N_a2            = 181.272
N_a4            = 181.272
N_a8            = 221.406
N_b1            = 11.0232
N_b2            = 14.8797
N_b4            = 27.1126
N_b8            = 29.9641
T_a             = 30.1368
T_b             = 165.035
N_0             = 0.64

After 5 iterations the fit converged.
final sum of squares of residuals : 16.1962
rel. change during last iteration : -6.24404e-08

degrees of freedom    (FIT_NDF)                        : 220
rms of residuals      (FIT_STDFIT) = sqrt(WSSR/ndf)    : 0.271329
variance of residuals (reduced chisquare) = WSSR/ndf   : 0.0736192

Final set of parameters            Asymptotic Standard Error
=======================            ==========================

N_a1            = 159.816          +/- 7.661        (4.794%)
N_a2            = 178.289          +/- 7.683        (4.309%)
N_a4            = 201.891          +/- 8.793        (4.355%)
N_a8            = 181.114          +/- 10.16        (5.611%)
N_b1            = 9.62915          +/- 2.776        (28.83%)
N_b2            = 16.767           +/- 4.291        (25.59%)
N_b4            = 23.681           +/- 5.712        (24.12%)
N_b8            = 30.3928          +/- 6.919        (22.76%)
T_a             = 25.3965          +/- 1.439        (5.666%)
T_b             = 142.873          +/- 31.6         (22.11%)
N_0             = 0.139323         +/- 0.03582      (25.71%)


correlation matrix of the fit parameters:

               N_a1   N_a2   N_a4   N_a8   N_b1   N_b2   N_b4   N_b8   T_a    T_b    N_0    
N_a1            1.000 
N_a2            0.444  1.000 
N_a4            0.356  0.416  1.000 
N_a8            0.119  0.296  0.394  1.000 
N_b1            0.407  0.198  0.001 -0.380  1.000 
N_b2            0.485  0.091 -0.023 -0.406  0.949  1.000 
N_b4            0.479  0.169 -0.111 -0.417  0.953  0.965  1.000 
N_b8            0.464  0.151 -0.052 -0.502  0.954  0.967  0.972  1.000 
T_a            -0.678 -0.424 -0.247  0.143 -0.900 -0.896 -0.894 -0.884  1.000 
T_b            -0.424 -0.102  0.104  0.483 -0.956 -0.973 -0.979 -0.985  0.857  1.000 
N_0             0.003 -0.004 -0.009 -0.012 -0.025 -0.012 -0.006 -0.002  0.006 -0.014  1.000 


*******************************************************************************
Thu Mar 12 20:52:55 2015


FIT:    data read from 'data.dat' using (($1)-2.5):-2:(($2)/5):(max(0.5,sqrt($2)))
        format = x:y:z:s
        x range restricted to [0.00000 : 250.000]
        y range restricted to [-10.0000 : 150.000]
        #datapoints = 231
function used for fitting: f(x,y)
fitted parameters initialized with current variable values



 Iteration 0
 WSSR        : 106.053           delta(WSSR)/WSSR   : 0
 delta(WSSR) : 0                 limit for stopping : 1e-05
 lambda	  : 0.157137

initial set of free parameter values

N_a1            = 148.413
N_a2            = 181.272
N_a4            = 181.272
N_a8            = 221.406
N_b1            = 11.0232
N_b2            = 14.8797
N_b4            = 27.1126
N_b8            = 29.9641
T_a             = 30.1368
T_b             = 165.035
N_0             = 0.64

After 5 iterations the fit converged.
final sum of squares of residuals : 16.1962
rel. change during last iteration : -6.24404e-08

degrees of freedom    (FIT_NDF)                        : 220
rms of residuals      (FIT_STDFIT) = sqrt(WSSR/ndf)    : 0.271329
variance of residuals (reduced chisquare) = WSSR/ndf   : 0.0736192

Final set of parameters            Asymptotic Standard Error
=======================            ==========================

N_a1            = 159.816          +/- 7.661        (4.794%)
N_a2            = 178.289          +/- 7.683        (4.309%)
N_a4            = 201.891          +/- 8.793        (4.355%)
N_a8            = 181.114          +/- 10.16        (5.611%)
N_b1            = 9.62915          +/- 2.776        (28.83%)
N_b2            = 16.767           +/- 4.291        (25.59%)
N_b4            = 23.681           +/- 5.712        (24.12%)
N_b8            = 30.3928          +/- 6.919        (22.76%)
T_a             = 25.3965          +/- 1.439        (5.666%)
T_b             = 142.873          +/- 31.6         (22.11%)
N_0             = 0.139323         +/- 0.03582      (25.71%)


correlation matrix of the fit parameters:

               N_a1   N_a2   N_a4   N_a8   N_b1   N_b2   N_b4   N_b8   T_a    T_b    N_0    
N_a1            1.000 
N_a2            0.444  1.000 
N_a4            0.356  0.416  1.000 
N_a8            0.119  0.296  0.394  1.000 
N_b1            0.407  0.198  0.001 -0.380  1.000 
N_b2            0.485  0.091 -0.023 -0.406  0.949  1.000 
N_b4            0.479  0.169 -0.111 -0.417  0.953  0.965  1.000 
N_b8            0.464  0.151 -0.052 -0.502  0.954  0.967  0.972  1.000 
T_a            -0.678 -0.424 -0.247  0.143 -0.900 -0.896 -0.894 -0.884  1.000 
T_b            -0.424 -0.102  0.104  0.483 -0.956 -0.973 -0.979 -0.985  0.857  1.000 
N_0             0.003 -0.004 -0.009 -0.012 -0.025 -0.012 -0.006 -0.002  0.006 -0.014  1.000 


*******************************************************************************
Thu Mar 12 20:52:55 2015


FIT:    data read from 'aktivierungA.dat' u 1:2:3
        format = x:z:s
        x range restricted to [0.00000 : 300.000]
        #datapoints = 4
function used for fitting: a(x)
fitted parameters initialized with current variable values



 Iteration 0
 WSSR        : 1663.04           delta(WSSR)/WSSR   : 0
 delta(WSSR) : 0                 limit for stopping : 1e-05
 lambda	  : 0.0114045

initial set of free parameter values

Q               = 1

After 3 iterations the fit converged.
final sum of squares of residuals : 505.748
rel. change during last iteration : -5.6922e-07

degrees of freedom    (FIT_NDF)                        : 3
rms of residuals      (FIT_STDFIT) = sqrt(WSSR/ndf)    : 12.9839
variance of residuals (reduced chisquare) = WSSR/ndf   : 168.583

Final set of parameters            Asymptotic Standard Error
=======================            ==========================

Q               = 1492.48          +/- 569.2        (38.14%)


correlation matrix of the fit parameters:

               Q      
Q               1.000 


*******************************************************************************
Thu Mar 12 20:52:55 2015


FIT:    data read from 'aktivierungB.dat' u 1:2:3
        format = x:z:s
        x range restricted to [0.00000 : 300.000]
        #datapoints = 4
function used for fitting: b(x)
fitted parameters initialized with current variable values



 Iteration 0
 WSSR        : 56.9404           delta(WSSR)/WSSR   : 0
 delta(WSSR) : 0                 limit for stopping : 1e-05
 lambda	  : 0.003466

initial set of free parameter values

W               = 1

After 3 iterations the fit converged.
final sum of squares of residuals : 6.99729
rel. change during last iteration : -1.77549e-06

degrees of freedom    (FIT_NDF)                        : 3
rms of residuals      (FIT_STDFIT) = sqrt(WSSR/ndf)    : 1.52723
variance of residuals (reduced chisquare) = WSSR/ndf   : 2.33243

Final set of parameters            Asymptotic Standard Error
=======================            ==========================

W               = 1020.48          +/- 220.3        (21.59%)


correlation matrix of the fit parameters:

               W      
W               1.000 


*******************************************************************************
Thu Mar 12 20:56:13 2015


FIT:    data read from 'data.dat' using (($1)-2.5):-2:(($2)/5):(max(0.5,sqrt($2)))
        format = x:y:z:s
        x range restricted to [0.00000 : 250.000]
        y range restricted to [-10.0000 : 150.000]
        #datapoints = 231
function used for fitting: f(x,y)
fitted parameters initialized with current variable values



 Iteration 0
 WSSR        : 106.053           delta(WSSR)/WSSR   : 0
 delta(WSSR) : 0                 limit for stopping : 1e-05
 lambda	  : 0.157137

initial set of free parameter values

N_a1            = 148.413
N_a2            = 181.272
N_a4            = 181.272
N_a8            = 221.406
N_b1            = 11.0232
N_b2            = 14.8797
N_b4            = 27.1126
N_b8            = 29.9641
T_a             = 30.1368
T_b             = 165.035
N_0             = 0.64

After 5 iterations the fit converged.
final sum of squares of residuals : 16.1962
rel. change during last iteration : -6.24404e-08

degrees of freedom    (FIT_NDF)                        : 220
rms of residuals      (FIT_STDFIT) = sqrt(WSSR/ndf)    : 0.271329
variance of residuals (reduced chisquare) = WSSR/ndf   : 0.0736192

Final set of parameters            Asymptotic Standard Error
=======================            ==========================

N_a1            = 159.816          +/- 7.661        (4.794%)
N_a2            = 178.289          +/- 7.683        (4.309%)
N_a4            = 201.891          +/- 8.793        (4.355%)
N_a8            = 181.114          +/- 10.16        (5.611%)
N_b1            = 9.62915          +/- 2.776        (28.83%)
N_b2            = 16.767           +/- 4.291        (25.59%)
N_b4            = 23.681           +/- 5.712        (24.12%)
N_b8            = 30.3928          +/- 6.919        (22.76%)
T_a             = 25.3965          +/- 1.439        (5.666%)
T_b             = 142.873          +/- 31.6         (22.11%)
N_0             = 0.139323         +/- 0.03582      (25.71%)


correlation matrix of the fit parameters:

               N_a1   N_a2   N_a4   N_a8   N_b1   N_b2   N_b4   N_b8   T_a    T_b    N_0    
N_a1            1.000 
N_a2            0.444  1.000 
N_a4            0.356  0.416  1.000 
N_a8            0.119  0.296  0.394  1.000 
N_b1            0.407  0.198  0.001 -0.380  1.000 
N_b2            0.485  0.091 -0.023 -0.406  0.949  1.000 
N_b4            0.479  0.169 -0.111 -0.417  0.953  0.965  1.000 
N_b8            0.464  0.151 -0.052 -0.502  0.954  0.967  0.972  1.000 
T_a            -0.678 -0.424 -0.247  0.143 -0.900 -0.896 -0.894 -0.884  1.000 
T_b            -0.424 -0.102  0.104  0.483 -0.956 -0.973 -0.979 -0.985  0.857  1.000 
N_0             0.003 -0.004 -0.009 -0.012 -0.025 -0.012 -0.006 -0.002  0.006 -0.014  1.000 


*******************************************************************************
Thu Mar 12 20:56:13 2015


FIT:    data read from 'aktivierungA.dat' u 1:2:3
        format = x:z:s
        #datapoints = 4
function used for fitting: a(x)
fitted parameters initialized with current variable values



 Iteration 0
 WSSR        : 1663.04           delta(WSSR)/WSSR   : 0
 delta(WSSR) : 0                 limit for stopping : 1e-05
 lambda	  : 0.0114045

initial set of free parameter values

Q               = 1

After 3 iterations the fit converged.
final sum of squares of residuals : 505.748
rel. change during last iteration : -5.6922e-07

degrees of freedom    (FIT_NDF)                        : 3
rms of residuals      (FIT_STDFIT) = sqrt(WSSR/ndf)    : 12.9839
variance of residuals (reduced chisquare) = WSSR/ndf   : 168.583

Final set of parameters            Asymptotic Standard Error
=======================            ==========================

Q               = 1492.48          +/- 569.2        (38.14%)


correlation matrix of the fit parameters:

               Q      
Q               1.000 


*******************************************************************************
Thu Mar 12 20:56:13 2015


FIT:    data read from 'aktivierungB.dat' u 1:2:3
        format = x:z:s
        #datapoints = 4
function used for fitting: b(x)
fitted parameters initialized with current variable values



 Iteration 0
 WSSR        : 56.9404           delta(WSSR)/WSSR   : 0
 delta(WSSR) : 0                 limit for stopping : 1e-05
 lambda	  : 0.003466

initial set of free parameter values

W               = 1

After 3 iterations the fit converged.
final sum of squares of residuals : 6.99729
rel. change during last iteration : -1.77549e-06

degrees of freedom    (FIT_NDF)                        : 3
rms of residuals      (FIT_STDFIT) = sqrt(WSSR/ndf)    : 1.52723
variance of residuals (reduced chisquare) = WSSR/ndf   : 2.33243

Final set of parameters            Asymptotic Standard Error
=======================            ==========================

W               = 1020.48          +/- 220.3        (21.59%)


correlation matrix of the fit parameters:

               W      
W               1.000 


*******************************************************************************
Thu Mar 12 20:57:34 2015


FIT:    data read from 'data.dat' using (($1)-2.5):-2:(($2)/5):(max(0.5,sqrt($2)))
        format = x:y:z:s
        x range restricted to [0.00000 : 250.000]
        y range restricted to [-10.0000 : 150.000]
        #datapoints = 231
function used for fitting: f(x,y)
fitted parameters initialized with current variable values



 Iteration 0
 WSSR        : 106.053           delta(WSSR)/WSSR   : 0
 delta(WSSR) : 0                 limit for stopping : 1e-05
 lambda	  : 0.157137

initial set of free parameter values

N_a1            = 148.413
N_a2            = 181.272
N_a4            = 181.272
N_a8            = 221.406
N_b1            = 11.0232
N_b2            = 14.8797
N_b4            = 27.1126
N_b8            = 29.9641
T_a             = 30.1368
T_b             = 165.035
N_0             = 0.64

After 5 iterations the fit converged.
final sum of squares of residuals : 16.1962
rel. change during last iteration : -6.24404e-08

degrees of freedom    (FIT_NDF)                        : 220
rms of residuals      (FIT_STDFIT) = sqrt(WSSR/ndf)    : 0.271329
variance of residuals (reduced chisquare) = WSSR/ndf   : 0.0736192

Final set of parameters            Asymptotic Standard Error
=======================            ==========================

N_a1            = 159.816          +/- 7.661        (4.794%)
N_a2            = 178.289          +/- 7.683        (4.309%)
N_a4            = 201.891          +/- 8.793        (4.355%)
N_a8            = 181.114          +/- 10.16        (5.611%)
N_b1            = 9.62915          +/- 2.776        (28.83%)
N_b2            = 16.767           +/- 4.291        (25.59%)
N_b4            = 23.681           +/- 5.712        (24.12%)
N_b8            = 30.3928          +/- 6.919        (22.76%)
T_a             = 25.3965          +/- 1.439        (5.666%)
T_b             = 142.873          +/- 31.6         (22.11%)
N_0             = 0.139323         +/- 0.03582      (25.71%)


correlation matrix of the fit parameters:

               N_a1   N_a2   N_a4   N_a8   N_b1   N_b2   N_b4   N_b8   T_a    T_b    N_0    
N_a1            1.000 
N_a2            0.444  1.000 
N_a4            0.356  0.416  1.000 
N_a8            0.119  0.296  0.394  1.000 
N_b1            0.407  0.198  0.001 -0.380  1.000 
N_b2            0.485  0.091 -0.023 -0.406  0.949  1.000 
N_b4            0.479  0.169 -0.111 -0.417  0.953  0.965  1.000 
N_b8            0.464  0.151 -0.052 -0.502  0.954  0.967  0.972  1.000 
T_a            -0.678 -0.424 -0.247  0.143 -0.900 -0.896 -0.894 -0.884  1.000 
T_b            -0.424 -0.102  0.104  0.483 -0.956 -0.973 -0.979 -0.985  0.857  1.000 
N_0             0.003 -0.004 -0.009 -0.012 -0.025 -0.012 -0.006 -0.002  0.006 -0.014  1.000 


*******************************************************************************
Thu Mar 12 20:57:34 2015


FIT:    data read from 'aktivierungA.dat' u 1:2:3
        format = x:z:s
        #datapoints = 4
function used for fitting: a(x)
fitted parameters initialized with current variable values



 Iteration 0
 WSSR        : 1374.82           delta(WSSR)/WSSR   : 0
 delta(WSSR) : 0                 limit for stopping : 1e-05
 lambda	  : 0.0114045

initial set of free parameter values

Q               = 200

After 3 iterations the fit converged.
final sum of squares of residuals : 505.748
rel. change during last iteration : -4.27457e-07

degrees of freedom    (FIT_NDF)                        : 3
rms of residuals      (FIT_STDFIT) = sqrt(WSSR/ndf)    : 12.9839
variance of residuals (reduced chisquare) = WSSR/ndf   : 168.583

Final set of parameters            Asymptotic Standard Error
=======================            ==========================

Q               = 1492.48          +/- 569.2        (38.14%)


correlation matrix of the fit parameters:

               Q      
Q               1.000 


*******************************************************************************
Thu Mar 12 20:57:34 2015


FIT:    data read from 'aktivierungB.dat' u 1:2:3
        format = x:z:s
        #datapoints = 4
function used for fitting: b(x)
fitted parameters initialized with current variable values



 Iteration 0
 WSSR        : 54.1395           delta(WSSR)/WSSR   : 0
 delta(WSSR) : 0                 limit for stopping : 1e-05
 lambda	  : 0.003466

initial set of free parameter values

W               = 30

After 3 iterations the fit converged.
final sum of squares of residuals : 6.99729
rel. change during last iteration : -1.67591e-06

degrees of freedom    (FIT_NDF)                        : 3
rms of residuals      (FIT_STDFIT) = sqrt(WSSR/ndf)    : 1.52723
variance of residuals (reduced chisquare) = WSSR/ndf   : 2.33243

Final set of parameters            Asymptotic Standard Error
=======================            ==========================

W               = 1020.48          +/- 220.3        (21.59%)


correlation matrix of the fit parameters:

               W      
W               1.000 


*******************************************************************************
Thu Mar 12 20:59:34 2015


FIT:    data read from 'data.dat' using (($1)-2.5):-2:(($2)/5):(max(0.5,sqrt($2)))
        format = x:y:z:s
        x range restricted to [0.00000 : 250.000]
        y range restricted to [-10.0000 : 150.000]
        #datapoints = 231
function used for fitting: f(x,y)
fitted parameters initialized with current variable values



 Iteration 0
 WSSR        : 106.053           delta(WSSR)/WSSR   : 0
 delta(WSSR) : 0                 limit for stopping : 1e-05
 lambda	  : 0.157137

initial set of free parameter values

N_a1            = 148.413
N_a2            = 181.272
N_a4            = 181.272
N_a8            = 221.406
N_b1            = 11.0232
N_b2            = 14.8797
N_b4            = 27.1126
N_b8            = 29.9641
T_a             = 30.1368
T_b             = 165.035
N_0             = 0.64

After 5 iterations the fit converged.
final sum of squares of residuals : 16.1962
rel. change during last iteration : -6.24404e-08

degrees of freedom    (FIT_NDF)                        : 220
rms of residuals      (FIT_STDFIT) = sqrt(WSSR/ndf)    : 0.271329
variance of residuals (reduced chisquare) = WSSR/ndf   : 0.0736192

Final set of parameters            Asymptotic Standard Error
=======================            ==========================

N_a1            = 159.816          +/- 7.661        (4.794%)
N_a2            = 178.289          +/- 7.683        (4.309%)
N_a4            = 201.891          +/- 8.793        (4.355%)
N_a8            = 181.114          +/- 10.16        (5.611%)
N_b1            = 9.62915          +/- 2.776        (28.83%)
N_b2            = 16.767           +/- 4.291        (25.59%)
N_b4            = 23.681           +/- 5.712        (24.12%)
N_b8            = 30.3928          +/- 6.919        (22.76%)
T_a             = 25.3965          +/- 1.439        (5.666%)
T_b             = 142.873          +/- 31.6         (22.11%)
N_0             = 0.139323         +/- 0.03582      (25.71%)


correlation matrix of the fit parameters:

               N_a1   N_a2   N_a4   N_a8   N_b1   N_b2   N_b4   N_b8   T_a    T_b    N_0    
N_a1            1.000 
N_a2            0.444  1.000 
N_a4            0.356  0.416  1.000 
N_a8            0.119  0.296  0.394  1.000 
N_b1            0.407  0.198  0.001 -0.380  1.000 
N_b2            0.485  0.091 -0.023 -0.406  0.949  1.000 
N_b4            0.479  0.169 -0.111 -0.417  0.953  0.965  1.000 
N_b8            0.464  0.151 -0.052 -0.502  0.954  0.967  0.972  1.000 
T_a            -0.678 -0.424 -0.247  0.143 -0.900 -0.896 -0.894 -0.884  1.000 
T_b            -0.424 -0.102  0.104  0.483 -0.956 -0.973 -0.979 -0.985  0.857  1.000 
N_0             0.003 -0.004 -0.009 -0.012 -0.025 -0.012 -0.006 -0.002  0.006 -0.014  1.000 


*******************************************************************************
Thu Mar 12 20:59:35 2015


FIT:    data read from 'aktivierungA.dat' u 1:2:3
        format = x:z:s
        #datapoints = 4
function used for fitting: a(x)
fitted parameters initialized with current variable values



 Iteration 0
 WSSR        : 73.4932           delta(WSSR)/WSSR   : 0
 delta(WSSR) : 0                 limit for stopping : 1e-05
 lambda	  : 4.54182

initial set of free parameter values

Q               = 200
T_A             = 1

After 6 iterations the fit converged.
final sum of squares of residuals : 2.9463
rel. change during last iteration : -4.28395e-07

degrees of freedom    (FIT_NDF)                        : 2
rms of residuals      (FIT_STDFIT) = sqrt(WSSR/ndf)    : 1.21373
variance of residuals (reduced chisquare) = WSSR/ndf   : 1.47315

Final set of parameters            Asymptotic Standard Error
=======================            ==========================

Q               = 189.609          +/- 7.4          (3.903%)
T_A             = 0.386561         +/- 0.08248      (21.34%)


correlation matrix of the fit parameters:

               Q      T_A    
Q               1.000 
T_A             0.646  1.000 


*******************************************************************************
Thu Mar 12 20:59:35 2015


FIT:    data read from 'aktivierungB.dat' u 1:2:3
        format = x:z:s
        #datapoints = 4
function used for fitting: b(x)
fitted parameters initialized with current variable values



 Iteration 0
 WSSR        : 4.46071           delta(WSSR)/WSSR   : 0
 delta(WSSR) : 0                 limit for stopping : 1e-05
 lambda	  : 1.46509

initial set of free parameter values

W               = 30
T_B             = 1

After 5 iterations the fit converged.
final sum of squares of residuals : 0.0108356
rel. change during last iteration : -6.81199e-07

degrees of freedom    (FIT_NDF)                        : 2
rms of residuals      (FIT_STDFIT) = sqrt(WSSR/ndf)    : 0.0736057
variance of residuals (reduced chisquare) = WSSR/ndf   : 0.0054178

Final set of parameters            Asymptotic Standard Error
=======================            ==========================

W               = 31.1359          +/- 0.6263       (2.011%)
T_B             = 1.79288          +/- 0.06882      (3.838%)


correlation matrix of the fit parameters:

               W      T_B    
W               1.000 
T_B             0.875  1.000 


*******************************************************************************
Thu Mar 12 21:06:25 2015


FIT:    data read from 'data.dat' using (($1)-2.5):-2:(($2)/5):(max(0.5,sqrt($2)))
        format = x:y:z:s
        x range restricted to [0.00000 : 250.000]
        y range restricted to [-10.0000 : 150.000]
        #datapoints = 231
function used for fitting: f(x,y)
fitted parameters initialized with current variable values



 Iteration 0
 WSSR        : 106.053           delta(WSSR)/WSSR   : 0
 delta(WSSR) : 0                 limit for stopping : 1e-05
 lambda	  : 0.157137

initial set of free parameter values

N_a1            = 148.413
N_a2            = 181.272
N_a4            = 181.272
N_a8            = 221.406
N_b1            = 11.0232
N_b2            = 14.8797
N_b4            = 27.1126
N_b8            = 29.9641
T_a             = 30.1368
T_b             = 165.035
N_0             = 0.64

After 5 iterations the fit converged.
final sum of squares of residuals : 16.1962
rel. change during last iteration : -6.24404e-08

degrees of freedom    (FIT_NDF)                        : 220
rms of residuals      (FIT_STDFIT) = sqrt(WSSR/ndf)    : 0.271329
variance of residuals (reduced chisquare) = WSSR/ndf   : 0.0736192

Final set of parameters            Asymptotic Standard Error
=======================            ==========================

N_a1            = 159.816          +/- 7.661        (4.794%)
N_a2            = 178.289          +/- 7.683        (4.309%)
N_a4            = 201.891          +/- 8.793        (4.355%)
N_a8            = 181.114          +/- 10.16        (5.611%)
N_b1            = 9.62915          +/- 2.776        (28.83%)
N_b2            = 16.767           +/- 4.291        (25.59%)
N_b4            = 23.681           +/- 5.712        (24.12%)
N_b8            = 30.3928          +/- 6.919        (22.76%)
T_a             = 25.3965          +/- 1.439        (5.666%)
T_b             = 142.873          +/- 31.6         (22.11%)
N_0             = 0.139323         +/- 0.03582      (25.71%)


correlation matrix of the fit parameters:

               N_a1   N_a2   N_a4   N_a8   N_b1   N_b2   N_b4   N_b8   T_a    T_b    N_0    
N_a1            1.000 
N_a2            0.444  1.000 
N_a4            0.356  0.416  1.000 
N_a8            0.119  0.296  0.394  1.000 
N_b1            0.407  0.198  0.001 -0.380  1.000 
N_b2            0.485  0.091 -0.023 -0.406  0.949  1.000 
N_b4            0.479  0.169 -0.111 -0.417  0.953  0.965  1.000 
N_b8            0.464  0.151 -0.052 -0.502  0.954  0.967  0.972  1.000 
T_a            -0.678 -0.424 -0.247  0.143 -0.900 -0.896 -0.894 -0.884  1.000 
T_b            -0.424 -0.102  0.104  0.483 -0.956 -0.973 -0.979 -0.985  0.857  1.000 
N_0             0.003 -0.004 -0.009 -0.012 -0.025 -0.012 -0.006 -0.002  0.006 -0.014  1.000 


*******************************************************************************
Thu Mar 12 21:06:25 2015


FIT:    data read from 'aktivierungA.dat' u 1:2:3
        format = x:z:s
        #datapoints = 4
function used for fitting: a(x)
fitted parameters initialized with current variable values



 Iteration 0
 WSSR        : 73.4932           delta(WSSR)/WSSR   : 0
 delta(WSSR) : 0                 limit for stopping : 1e-05
 lambda	  : 4.54182

initial set of free parameter values

Q               = 200
T_A             = 1

After 6 iterations the fit converged.
final sum of squares of residuals : 2.9463
rel. change during last iteration : -4.28395e-07

degrees of freedom    (FIT_NDF)                        : 2
rms of residuals      (FIT_STDFIT) = sqrt(WSSR/ndf)    : 1.21373
variance of residuals (reduced chisquare) = WSSR/ndf   : 1.47315

Final set of parameters            Asymptotic Standard Error
=======================            ==========================

Q               = 189.609          +/- 7.4          (3.903%)
T_A             = 0.386561         +/- 0.08248      (21.34%)


correlation matrix of the fit parameters:

               Q      T_A    
Q               1.000 
T_A             0.646  1.000 


*******************************************************************************
Thu Mar 12 21:06:25 2015


FIT:    data read from 'aktivierungB.dat' u 1:2:3
        format = x:z:s
        #datapoints = 4
function used for fitting: b(x)
fitted parameters initialized with current variable values



 Iteration 0
 WSSR        : 4.46071           delta(WSSR)/WSSR   : 0
 delta(WSSR) : 0                 limit for stopping : 1e-05
 lambda	  : 1.46509

initial set of free parameter values

W               = 30
T_B             = 1

After 5 iterations the fit converged.
final sum of squares of residuals : 0.0108356
rel. change during last iteration : -6.81199e-07

degrees of freedom    (FIT_NDF)                        : 2
rms of residuals      (FIT_STDFIT) = sqrt(WSSR/ndf)    : 0.0736057
variance of residuals (reduced chisquare) = WSSR/ndf   : 0.0054178

Final set of parameters            Asymptotic Standard Error
=======================            ==========================

W               = 31.1359          +/- 0.6263       (2.011%)
T_B             = 1.79288          +/- 0.06882      (3.838%)


correlation matrix of the fit parameters:

               W      T_B    
W               1.000 
T_B             0.875  1.000 
