\relax 
\providecommand\hyper@newdestlabel[2]{}
\bibstyle{biblatex}
\bibdata{Prohaupt-blx,literatur}
\citation{biblatex-control}
\catcode `"\active 
\providecommand\HyperFirstAtBeginDocument{\AtBeginDocument}
\HyperFirstAtBeginDocument{\ifx\hyper@anchor\@undefined
\global\let\oldcontentsline\contentsline
\gdef\contentsline#1#2#3#4{\oldcontentsline{#1}{#2}{#3}}
\global\let\oldnewlabel\newlabel
\gdef\newlabel#1#2{\newlabelxx{#1}#2}
\gdef\newlabelxx#1#2#3#4#5#6{\oldnewlabel{#1}{{#2}{#3}}}
\AtEndDocument{\ifx\hyper@anchor\@undefined
\let\contentsline\oldcontentsline
\let\newlabel\oldnewlabel
\fi}
\fi}
\global\let\hyper@last\relax 
\gdef\HyperFirstAtBeginDocument#1{#1}
\providecommand\HyField@AuxAddToFields[1]{}
\providecommand\HyField@AuxAddToCoFields[2]{}
\providecommand \oddpage@label [2]{}
\@writefile{toc}{\boolfalse {citerequest}\boolfalse {citetracker}\boolfalse {pagetracker}\boolfalse {backtracker}\relax }
\@writefile{lof}{\boolfalse {citerequest}\boolfalse {citetracker}\boolfalse {pagetracker}\boolfalse {backtracker}\relax }
\@writefile{lot}{\boolfalse {citerequest}\boolfalse {citetracker}\boolfalse {pagetracker}\boolfalse {backtracker}\relax }
\select@language{ngerman}
\@writefile{toc}{\defcounter {refsection}{0}\relax }\@writefile{toc}{\select@language{ngerman}}
\@writefile{lof}{\defcounter {refsection}{0}\relax }\@writefile{lof}{\select@language{ngerman}}
\@writefile{lot}{\defcounter {refsection}{0}\relax }\@writefile{lot}{\select@language{ngerman}}
\citation{prakti}
\citation{demtroeder4}
\@writefile{toc}{\contentsline {section}{\numberline {1}Einleitung}{1}{section.1}}
\newlabel{sec:einleitung}{{1}{1}{Einleitung}{section.1}{}}
\@writefile{toc}{\contentsline {section}{\numberline {2}Theorie}{1}{section.2}}
\newlabel{sec:theorie}{{2}{1}{Theorie}{section.2}{}}
\@writefile{toc}{\contentsline {subsection}{\numberline {2.1}Kernkr\IeC {\"a}fte und das Atom}{1}{subsection.2.1}}
\@writefile{toc}{\contentsline {subsection}{\numberline {2.2}Zerfall}{1}{subsection.2.2}}
\citation{demtroeder4}
\citation{demtroeder4}
\citation{demtroeder4}
\citation{prakti}
\@writefile{toc}{\contentsline {subsubsection}{\numberline {2.2.1}$\alpha $-Zerfall}{2}{subsubsection.2.2.1}}
\@writefile{toc}{\contentsline {subsubsection}{\numberline {2.2.2}$\beta $-Zerfall}{2}{subsubsection.2.2.2}}
\@writefile{toc}{\contentsline {subsubsection}{\numberline {2.2.3}$\gamma $-Zerfall}{2}{subsubsection.2.2.3}}
\@writefile{toc}{\contentsline {subsection}{\numberline {2.3}Aktivierung von Silber}{2}{subsection.2.3}}
\@writefile{toc}{\contentsline {section}{\numberline {3}Durchf\IeC {\"u}hrung}{3}{section.3}}
\newlabel{sec:durchfuehrung}{{3}{3}{Durchführung}{section.3}{}}
\@writefile{toc}{\contentsline {section}{\numberline {4}Auswertung}{4}{section.4}}
\newlabel{sec:auswertung}{{4}{4}{Auswertung}{section.4}{}}
\newlabel{eq:funktion}{{4.0.5}{4}{Auswertung}{equation.4.0.5}{}}
\@writefile{lof}{\contentsline {figure}{\numberline {1}{\ignorespaces Zusammenfassung aller Messwerte und Fits.\relax }}{5}{figure.caption.1}}
\providecommand*\caption@xref[2]{\@setref\relax\@undefined{#1}}
\newlabel{fig:plot1}{{1}{5}{Zusammenfassung aller Messwerte und Fits.\relax }{figure.caption.1}{}}
\@writefile{lot}{\contentsline {table}{\numberline {1}{\ignorespaces Ergebnisse des $\chi ^2$-Fits\relax }}{5}{table.caption.2}}
\newlabel{tab:fit}{{1}{5}{Ergebnisse des $\chi ^2$-Fits\relax }{table.caption.2}{}}
\@writefile{lof}{\contentsline {figure}{\numberline {2}{\ignorespaces Linearer Plot f\IeC {\"u}r die Aktivierungszeit von 1 Minute\relax }}{6}{figure.caption.3}}
\newlabel{fig:plot1min}{{2}{6}{Linearer Plot für die Aktivierungszeit von 1 Minute\relax }{figure.caption.3}{}}
\@writefile{lof}{\contentsline {figure}{\numberline {3}{\ignorespaces Halblogarithmischer Plot f\IeC {\"u}r die Aktivierungszeit von 1 Minute\relax }}{6}{figure.caption.4}}
\newlabel{fig:plot1minlog}{{3}{6}{Halblogarithmischer Plot für die Aktivierungszeit von 1 Minute\relax }{figure.caption.4}{}}
\@writefile{lof}{\contentsline {figure}{\numberline {4}{\ignorespaces Linearer Plot f\IeC {\"u}r die Aktivierungszeit von 2 Minuten\relax }}{7}{figure.caption.5}}
\newlabel{fig:plot1minlog}{{4}{7}{Linearer Plot für die Aktivierungszeit von 2 Minuten\relax }{figure.caption.5}{}}
\@writefile{lof}{\contentsline {figure}{\numberline {5}{\ignorespaces Halblogarithmischer Plot f\IeC {\"u}r die Aktivierungszeit von 2 Minuten\relax }}{7}{figure.caption.6}}
\newlabel{fig:plot2minlog}{{5}{7}{Halblogarithmischer Plot für die Aktivierungszeit von 2 Minuten\relax }{figure.caption.6}{}}
\@writefile{lof}{\contentsline {figure}{\numberline {6}{\ignorespaces Linearer Plot f\IeC {\"u}r die Aktivierungszeit von 4 Minuten\relax }}{8}{figure.caption.7}}
\newlabel{fig:plot1minlog}{{6}{8}{Linearer Plot für die Aktivierungszeit von 4 Minuten\relax }{figure.caption.7}{}}
\@writefile{lof}{\contentsline {figure}{\numberline {7}{\ignorespaces Halblogarithmischer Plot f\IeC {\"u}r die Aktivierungszeit von 4 Minuten\relax }}{8}{figure.caption.8}}
\newlabel{fig:plot4minlog}{{7}{8}{Halblogarithmischer Plot für die Aktivierungszeit von 4 Minuten\relax }{figure.caption.8}{}}
\@writefile{lof}{\contentsline {figure}{\numberline {8}{\ignorespaces Linearer Plot f\IeC {\"u}r die Aktivierungszeit von 8 Minuten\relax }}{9}{figure.caption.9}}
\newlabel{fig:plot8minlog}{{8}{9}{Linearer Plot für die Aktivierungszeit von 8 Minuten\relax }{figure.caption.9}{}}
\@writefile{lof}{\contentsline {figure}{\numberline {9}{\ignorespaces Halblogarithmischer Plot f\IeC {\"u}r die Aktivierungszeit von 8 Minuten\relax }}{9}{figure.caption.10}}
\newlabel{fig:plot8minlog}{{9}{9}{Halblogarithmischer Plot für die Aktivierungszeit von 8 Minuten\relax }{figure.caption.10}{}}
\@writefile{lot}{\contentsline {table}{\numberline {2}{\ignorespaces Ergebnisse der Fits f\IeC {\"u}r die Endaktivit\IeC {\"a}ten\relax }}{10}{table.caption.12}}
\newlabel{tab:akti}{{2}{10}{Ergebnisse der Fits für die Endaktivitäten\relax }{table.caption.12}{}}
\newlabel{eq:aktivierung}{{4.0.6}{10}{Auswertung}{equation.4.0.6}{}}
\@writefile{lof}{\contentsline {figure}{\numberline {10}{\ignorespaces Bestimmung des asymptotischen Grenzwertes f\IeC {\"u}r unendlich lange Aktivierungszeit f\IeC {\"u}r Isotop A.\relax }}{10}{figure.caption.11}}
\newlabel{fig:aktivierungA}{{10}{10}{Bestimmung des asymptotischen Grenzwertes für unendlich lange Aktivierungszeit für Isotop A.\relax }{figure.caption.11}{}}
\@writefile{lot}{\contentsline {table}{\numberline {3}{\ignorespaces Vergleich der Halbwertszeiten\relax }}{11}{table.caption.14}}
\newlabel{tab:lit}{{3}{11}{Vergleich der Halbwertszeiten\relax }{table.caption.14}{}}
\@writefile{lof}{\contentsline {figure}{\numberline {11}{\ignorespaces Bestimmung des asymptotischen Grenzwertes f\IeC {\"u}r unendlich lange Aktivierungszeit f\IeC {\"u}r Isotop B.\relax }}{11}{figure.caption.13}}
\newlabel{fig:aktivierungB}{{11}{11}{Bestimmung des asymptotischen Grenzwertes für unendlich lange Aktivierungszeit für Isotop B.\relax }{figure.caption.13}{}}
\@writefile{toc}{\contentsline {section}{\numberline {5}Diskussion}{11}{section.5}}
\newlabel{sec:diskussion}{{5}{11}{Diskussion}{section.5}{}}
\@writefile{toc}{\contentsline {subsection}{\numberline {5.1}Halbwertszeiten}{11}{subsection.5.1}}
\@writefile{toc}{\contentsline {subsection}{\numberline {5.2}Aktivit\IeC {\"a}ten}{12}{subsection.5.2}}
\@writefile{toc}{\contentsline {section}{\nonumberline Literatur}{13}{section*.15}}
