39.0	15.0
39.2	16.0
39.4	16.0
39.5	14.0
39.8	22.0
40.0	34.0
40.2	55.0
40.4	69.0
40.5	75.0
40.8	83.0
41.0	97.0
41.2	99.0
41.4	87.0
41.5	76.0
41.8	57.0
42.0	53.0
42.2	51.0
42.4	47.0
42.6	50.0
42.8	45.0
43.0	44.0
