%!PS-Adobe-2.0 EPSF-2.0
%%Title: charStrahl_plot.tex
%%Creator: gnuplot 4.6 patchlevel 5
%%CreationDate: Fri Mar 13 09:02:07 2015
%%DocumentFonts: 
%%BoundingBox: 50 50 410 302
%%EndComments
%%BeginProlog
/gnudict 256 dict def
gnudict begin
%
% The following true/false flags may be edited by hand if desired.
% The unit line width and grayscale image gamma correction may also be changed.
%
/Color true def
/Blacktext true def
/Solid false def
/Dashlength 1 def
/Landscape false def
/Level1 false def
/Rounded false def
/ClipToBoundingBox false def
/SuppressPDFMark false def
/TransparentPatterns false def
/gnulinewidth 5.000 def
/userlinewidth gnulinewidth def
/Gamma 1.0 def
/BackgroundColor {-1.000 -1.000 -1.000} def
%
/vshift -73 def
/dl1 {
  10.0 Dashlength mul mul
  Rounded { currentlinewidth 0.75 mul sub dup 0 le { pop 0.01 } if } if
} def
/dl2 {
  10.0 Dashlength mul mul
  Rounded { currentlinewidth 0.75 mul add } if
} def
/hpt_ 31.5 def
/vpt_ 31.5 def
/hpt hpt_ def
/vpt vpt_ def
/doclip {
  ClipToBoundingBox {
    newpath 50 50 moveto 410 50 lineto 410 302 lineto 50 302 lineto closepath
    clip
  } if
} def
%
% Gnuplot Prolog Version 4.6 (September 2012)
%
%/SuppressPDFMark true def
%
/M {moveto} bind def
/L {lineto} bind def
/R {rmoveto} bind def
/V {rlineto} bind def
/N {newpath moveto} bind def
/Z {closepath} bind def
/C {setrgbcolor} bind def
/f {rlineto fill} bind def
/g {setgray} bind def
/Gshow {show} def   % May be redefined later in the file to support UTF-8
/vpt2 vpt 2 mul def
/hpt2 hpt 2 mul def
/Lshow {currentpoint stroke M 0 vshift R 
	Blacktext {gsave 0 setgray show grestore} {show} ifelse} def
/Rshow {currentpoint stroke M dup stringwidth pop neg vshift R
	Blacktext {gsave 0 setgray show grestore} {show} ifelse} def
/Cshow {currentpoint stroke M dup stringwidth pop -2 div vshift R 
	Blacktext {gsave 0 setgray show grestore} {show} ifelse} def
/UP {dup vpt_ mul /vpt exch def hpt_ mul /hpt exch def
  /hpt2 hpt 2 mul def /vpt2 vpt 2 mul def} def
/DL {Color {setrgbcolor Solid {pop []} if 0 setdash}
 {pop pop pop 0 setgray Solid {pop []} if 0 setdash} ifelse} def
/BL {stroke userlinewidth 2 mul setlinewidth
	Rounded {1 setlinejoin 1 setlinecap} if} def
/AL {stroke userlinewidth 2 div setlinewidth
	Rounded {1 setlinejoin 1 setlinecap} if} def
/UL {dup gnulinewidth mul /userlinewidth exch def
	dup 1 lt {pop 1} if 10 mul /udl exch def} def
/PL {stroke userlinewidth setlinewidth
	Rounded {1 setlinejoin 1 setlinecap} if} def
3.8 setmiterlimit
% Default Line colors
/LCw {1 1 1} def
/LCb {0 0 0} def
/LCa {0 0 0} def
/LC0 {1 0 0} def
/LC1 {0 1 0} def
/LC2 {0 0 1} def
/LC3 {1 0 1} def
/LC4 {0 1 1} def
/LC5 {1 1 0} def
/LC6 {0 0 0} def
/LC7 {1 0.3 0} def
/LC8 {0.5 0.5 0.5} def
% Default Line Types
/LTw {PL [] 1 setgray} def
/LTb {BL [] LCb DL} def
/LTa {AL [1 udl mul 2 udl mul] 0 setdash LCa setrgbcolor} def
/LT0 {PL [] LC0 DL} def
/LT1 {PL [4 dl1 2 dl2] LC1 DL} def
/LT2 {PL [2 dl1 3 dl2] LC2 DL} def
/LT3 {PL [1 dl1 1.5 dl2] LC3 DL} def
/LT4 {PL [6 dl1 2 dl2 1 dl1 2 dl2] LC4 DL} def
/LT5 {PL [3 dl1 3 dl2 1 dl1 3 dl2] LC5 DL} def
/LT6 {PL [2 dl1 2 dl2 2 dl1 6 dl2] LC6 DL} def
/LT7 {PL [1 dl1 2 dl2 6 dl1 2 dl2 1 dl1 2 dl2] LC7 DL} def
/LT8 {PL [2 dl1 2 dl2 2 dl1 2 dl2 2 dl1 2 dl2 2 dl1 4 dl2] LC8 DL} def
/Pnt {stroke [] 0 setdash gsave 1 setlinecap M 0 0 V stroke grestore} def
/Dia {stroke [] 0 setdash 2 copy vpt add M
  hpt neg vpt neg V hpt vpt neg V
  hpt vpt V hpt neg vpt V closepath stroke
  Pnt} def
/Pls {stroke [] 0 setdash vpt sub M 0 vpt2 V
  currentpoint stroke M
  hpt neg vpt neg R hpt2 0 V stroke
 } def
/Box {stroke [] 0 setdash 2 copy exch hpt sub exch vpt add M
  0 vpt2 neg V hpt2 0 V 0 vpt2 V
  hpt2 neg 0 V closepath stroke
  Pnt} def
/Crs {stroke [] 0 setdash exch hpt sub exch vpt add M
  hpt2 vpt2 neg V currentpoint stroke M
  hpt2 neg 0 R hpt2 vpt2 V stroke} def
/TriU {stroke [] 0 setdash 2 copy vpt 1.12 mul add M
  hpt neg vpt -1.62 mul V
  hpt 2 mul 0 V
  hpt neg vpt 1.62 mul V closepath stroke
  Pnt} def
/Star {2 copy Pls Crs} def
/BoxF {stroke [] 0 setdash exch hpt sub exch vpt add M
  0 vpt2 neg V hpt2 0 V 0 vpt2 V
  hpt2 neg 0 V closepath fill} def
/TriUF {stroke [] 0 setdash vpt 1.12 mul add M
  hpt neg vpt -1.62 mul V
  hpt 2 mul 0 V
  hpt neg vpt 1.62 mul V closepath fill} def
/TriD {stroke [] 0 setdash 2 copy vpt 1.12 mul sub M
  hpt neg vpt 1.62 mul V
  hpt 2 mul 0 V
  hpt neg vpt -1.62 mul V closepath stroke
  Pnt} def
/TriDF {stroke [] 0 setdash vpt 1.12 mul sub M
  hpt neg vpt 1.62 mul V
  hpt 2 mul 0 V
  hpt neg vpt -1.62 mul V closepath fill} def
/DiaF {stroke [] 0 setdash vpt add M
  hpt neg vpt neg V hpt vpt neg V
  hpt vpt V hpt neg vpt V closepath fill} def
/Pent {stroke [] 0 setdash 2 copy gsave
  translate 0 hpt M 4 {72 rotate 0 hpt L} repeat
  closepath stroke grestore Pnt} def
/PentF {stroke [] 0 setdash gsave
  translate 0 hpt M 4 {72 rotate 0 hpt L} repeat
  closepath fill grestore} def
/Circle {stroke [] 0 setdash 2 copy
  hpt 0 360 arc stroke Pnt} def
/CircleF {stroke [] 0 setdash hpt 0 360 arc fill} def
/C0 {BL [] 0 setdash 2 copy moveto vpt 90 450 arc} bind def
/C1 {BL [] 0 setdash 2 copy moveto
	2 copy vpt 0 90 arc closepath fill
	vpt 0 360 arc closepath} bind def
/C2 {BL [] 0 setdash 2 copy moveto
	2 copy vpt 90 180 arc closepath fill
	vpt 0 360 arc closepath} bind def
/C3 {BL [] 0 setdash 2 copy moveto
	2 copy vpt 0 180 arc closepath fill
	vpt 0 360 arc closepath} bind def
/C4 {BL [] 0 setdash 2 copy moveto
	2 copy vpt 180 270 arc closepath fill
	vpt 0 360 arc closepath} bind def
/C5 {BL [] 0 setdash 2 copy moveto
	2 copy vpt 0 90 arc
	2 copy moveto
	2 copy vpt 180 270 arc closepath fill
	vpt 0 360 arc} bind def
/C6 {BL [] 0 setdash 2 copy moveto
	2 copy vpt 90 270 arc closepath fill
	vpt 0 360 arc closepath} bind def
/C7 {BL [] 0 setdash 2 copy moveto
	2 copy vpt 0 270 arc closepath fill
	vpt 0 360 arc closepath} bind def
/C8 {BL [] 0 setdash 2 copy moveto
	2 copy vpt 270 360 arc closepath fill
	vpt 0 360 arc closepath} bind def
/C9 {BL [] 0 setdash 2 copy moveto
	2 copy vpt 270 450 arc closepath fill
	vpt 0 360 arc closepath} bind def
/C10 {BL [] 0 setdash 2 copy 2 copy moveto vpt 270 360 arc closepath fill
	2 copy moveto
	2 copy vpt 90 180 arc closepath fill
	vpt 0 360 arc closepath} bind def
/C11 {BL [] 0 setdash 2 copy moveto
	2 copy vpt 0 180 arc closepath fill
	2 copy moveto
	2 copy vpt 270 360 arc closepath fill
	vpt 0 360 arc closepath} bind def
/C12 {BL [] 0 setdash 2 copy moveto
	2 copy vpt 180 360 arc closepath fill
	vpt 0 360 arc closepath} bind def
/C13 {BL [] 0 setdash 2 copy moveto
	2 copy vpt 0 90 arc closepath fill
	2 copy moveto
	2 copy vpt 180 360 arc closepath fill
	vpt 0 360 arc closepath} bind def
/C14 {BL [] 0 setdash 2 copy moveto
	2 copy vpt 90 360 arc closepath fill
	vpt 0 360 arc} bind def
/C15 {BL [] 0 setdash 2 copy vpt 0 360 arc closepath fill
	vpt 0 360 arc closepath} bind def
/Rec {newpath 4 2 roll moveto 1 index 0 rlineto 0 exch rlineto
	neg 0 rlineto closepath} bind def
/Square {dup Rec} bind def
/Bsquare {vpt sub exch vpt sub exch vpt2 Square} bind def
/S0 {BL [] 0 setdash 2 copy moveto 0 vpt rlineto BL Bsquare} bind def
/S1 {BL [] 0 setdash 2 copy vpt Square fill Bsquare} bind def
/S2 {BL [] 0 setdash 2 copy exch vpt sub exch vpt Square fill Bsquare} bind def
/S3 {BL [] 0 setdash 2 copy exch vpt sub exch vpt2 vpt Rec fill Bsquare} bind def
/S4 {BL [] 0 setdash 2 copy exch vpt sub exch vpt sub vpt Square fill Bsquare} bind def
/S5 {BL [] 0 setdash 2 copy 2 copy vpt Square fill
	exch vpt sub exch vpt sub vpt Square fill Bsquare} bind def
/S6 {BL [] 0 setdash 2 copy exch vpt sub exch vpt sub vpt vpt2 Rec fill Bsquare} bind def
/S7 {BL [] 0 setdash 2 copy exch vpt sub exch vpt sub vpt vpt2 Rec fill
	2 copy vpt Square fill Bsquare} bind def
/S8 {BL [] 0 setdash 2 copy vpt sub vpt Square fill Bsquare} bind def
/S9 {BL [] 0 setdash 2 copy vpt sub vpt vpt2 Rec fill Bsquare} bind def
/S10 {BL [] 0 setdash 2 copy vpt sub vpt Square fill 2 copy exch vpt sub exch vpt Square fill
	Bsquare} bind def
/S11 {BL [] 0 setdash 2 copy vpt sub vpt Square fill 2 copy exch vpt sub exch vpt2 vpt Rec fill
	Bsquare} bind def
/S12 {BL [] 0 setdash 2 copy exch vpt sub exch vpt sub vpt2 vpt Rec fill Bsquare} bind def
/S13 {BL [] 0 setdash 2 copy exch vpt sub exch vpt sub vpt2 vpt Rec fill
	2 copy vpt Square fill Bsquare} bind def
/S14 {BL [] 0 setdash 2 copy exch vpt sub exch vpt sub vpt2 vpt Rec fill
	2 copy exch vpt sub exch vpt Square fill Bsquare} bind def
/S15 {BL [] 0 setdash 2 copy Bsquare fill Bsquare} bind def
/D0 {gsave translate 45 rotate 0 0 S0 stroke grestore} bind def
/D1 {gsave translate 45 rotate 0 0 S1 stroke grestore} bind def
/D2 {gsave translate 45 rotate 0 0 S2 stroke grestore} bind def
/D3 {gsave translate 45 rotate 0 0 S3 stroke grestore} bind def
/D4 {gsave translate 45 rotate 0 0 S4 stroke grestore} bind def
/D5 {gsave translate 45 rotate 0 0 S5 stroke grestore} bind def
/D6 {gsave translate 45 rotate 0 0 S6 stroke grestore} bind def
/D7 {gsave translate 45 rotate 0 0 S7 stroke grestore} bind def
/D8 {gsave translate 45 rotate 0 0 S8 stroke grestore} bind def
/D9 {gsave translate 45 rotate 0 0 S9 stroke grestore} bind def
/D10 {gsave translate 45 rotate 0 0 S10 stroke grestore} bind def
/D11 {gsave translate 45 rotate 0 0 S11 stroke grestore} bind def
/D12 {gsave translate 45 rotate 0 0 S12 stroke grestore} bind def
/D13 {gsave translate 45 rotate 0 0 S13 stroke grestore} bind def
/D14 {gsave translate 45 rotate 0 0 S14 stroke grestore} bind def
/D15 {gsave translate 45 rotate 0 0 S15 stroke grestore} bind def
/DiaE {stroke [] 0 setdash vpt add M
  hpt neg vpt neg V hpt vpt neg V
  hpt vpt V hpt neg vpt V closepath stroke} def
/BoxE {stroke [] 0 setdash exch hpt sub exch vpt add M
  0 vpt2 neg V hpt2 0 V 0 vpt2 V
  hpt2 neg 0 V closepath stroke} def
/TriUE {stroke [] 0 setdash vpt 1.12 mul add M
  hpt neg vpt -1.62 mul V
  hpt 2 mul 0 V
  hpt neg vpt 1.62 mul V closepath stroke} def
/TriDE {stroke [] 0 setdash vpt 1.12 mul sub M
  hpt neg vpt 1.62 mul V
  hpt 2 mul 0 V
  hpt neg vpt -1.62 mul V closepath stroke} def
/PentE {stroke [] 0 setdash gsave
  translate 0 hpt M 4 {72 rotate 0 hpt L} repeat
  closepath stroke grestore} def
/CircE {stroke [] 0 setdash 
  hpt 0 360 arc stroke} def
/Opaque {gsave closepath 1 setgray fill grestore 0 setgray closepath} def
/DiaW {stroke [] 0 setdash vpt add M
  hpt neg vpt neg V hpt vpt neg V
  hpt vpt V hpt neg vpt V Opaque stroke} def
/BoxW {stroke [] 0 setdash exch hpt sub exch vpt add M
  0 vpt2 neg V hpt2 0 V 0 vpt2 V
  hpt2 neg 0 V Opaque stroke} def
/TriUW {stroke [] 0 setdash vpt 1.12 mul add M
  hpt neg vpt -1.62 mul V
  hpt 2 mul 0 V
  hpt neg vpt 1.62 mul V Opaque stroke} def
/TriDW {stroke [] 0 setdash vpt 1.12 mul sub M
  hpt neg vpt 1.62 mul V
  hpt 2 mul 0 V
  hpt neg vpt -1.62 mul V Opaque stroke} def
/PentW {stroke [] 0 setdash gsave
  translate 0 hpt M 4 {72 rotate 0 hpt L} repeat
  Opaque stroke grestore} def
/CircW {stroke [] 0 setdash 
  hpt 0 360 arc Opaque stroke} def
/BoxFill {gsave Rec 1 setgray fill grestore} def
/Density {
  /Fillden exch def
  currentrgbcolor
  /ColB exch def /ColG exch def /ColR exch def
  /ColR ColR Fillden mul Fillden sub 1 add def
  /ColG ColG Fillden mul Fillden sub 1 add def
  /ColB ColB Fillden mul Fillden sub 1 add def
  ColR ColG ColB setrgbcolor} def
/BoxColFill {gsave Rec PolyFill} def
/PolyFill {gsave Density fill grestore grestore} def
/h {rlineto rlineto rlineto gsave closepath fill grestore} bind def
%
% PostScript Level 1 Pattern Fill routine for rectangles
% Usage: x y w h s a XX PatternFill
%	x,y = lower left corner of box to be filled
%	w,h = width and height of box
%	  a = angle in degrees between lines and x-axis
%	 XX = 0/1 for no/yes cross-hatch
%
/PatternFill {gsave /PFa [ 9 2 roll ] def
  PFa 0 get PFa 2 get 2 div add PFa 1 get PFa 3 get 2 div add translate
  PFa 2 get -2 div PFa 3 get -2 div PFa 2 get PFa 3 get Rec
  TransparentPatterns {} {gsave 1 setgray fill grestore} ifelse
  clip
  currentlinewidth 0.5 mul setlinewidth
  /PFs PFa 2 get dup mul PFa 3 get dup mul add sqrt def
  0 0 M PFa 5 get rotate PFs -2 div dup translate
  0 1 PFs PFa 4 get div 1 add floor cvi
	{PFa 4 get mul 0 M 0 PFs V} for
  0 PFa 6 get ne {
	0 1 PFs PFa 4 get div 1 add floor cvi
	{PFa 4 get mul 0 2 1 roll M PFs 0 V} for
 } if
  stroke grestore} def
%
/languagelevel where
 {pop languagelevel} {1} ifelse
 2 lt
	{/InterpretLevel1 true def}
	{/InterpretLevel1 Level1 def}
 ifelse
%
% PostScript level 2 pattern fill definitions
%
/Level2PatternFill {
/Tile8x8 {/PaintType 2 /PatternType 1 /TilingType 1 /BBox [0 0 8 8] /XStep 8 /YStep 8}
	bind def
/KeepColor {currentrgbcolor [/Pattern /DeviceRGB] setcolorspace} bind def
<< Tile8x8
 /PaintProc {0.5 setlinewidth pop 0 0 M 8 8 L 0 8 M 8 0 L stroke} 
>> matrix makepattern
/Pat1 exch def
<< Tile8x8
 /PaintProc {0.5 setlinewidth pop 0 0 M 8 8 L 0 8 M 8 0 L stroke
	0 4 M 4 8 L 8 4 L 4 0 L 0 4 L stroke}
>> matrix makepattern
/Pat2 exch def
<< Tile8x8
 /PaintProc {0.5 setlinewidth pop 0 0 M 0 8 L
	8 8 L 8 0 L 0 0 L fill}
>> matrix makepattern
/Pat3 exch def
<< Tile8x8
 /PaintProc {0.5 setlinewidth pop -4 8 M 8 -4 L
	0 12 M 12 0 L stroke}
>> matrix makepattern
/Pat4 exch def
<< Tile8x8
 /PaintProc {0.5 setlinewidth pop -4 0 M 8 12 L
	0 -4 M 12 8 L stroke}
>> matrix makepattern
/Pat5 exch def
<< Tile8x8
 /PaintProc {0.5 setlinewidth pop -2 8 M 4 -4 L
	0 12 M 8 -4 L 4 12 M 10 0 L stroke}
>> matrix makepattern
/Pat6 exch def
<< Tile8x8
 /PaintProc {0.5 setlinewidth pop -2 0 M 4 12 L
	0 -4 M 8 12 L 4 -4 M 10 8 L stroke}
>> matrix makepattern
/Pat7 exch def
<< Tile8x8
 /PaintProc {0.5 setlinewidth pop 8 -2 M -4 4 L
	12 0 M -4 8 L 12 4 M 0 10 L stroke}
>> matrix makepattern
/Pat8 exch def
<< Tile8x8
 /PaintProc {0.5 setlinewidth pop 0 -2 M 12 4 L
	-4 0 M 12 8 L -4 4 M 8 10 L stroke}
>> matrix makepattern
/Pat9 exch def
/Pattern1 {PatternBgnd KeepColor Pat1 setpattern} bind def
/Pattern2 {PatternBgnd KeepColor Pat2 setpattern} bind def
/Pattern3 {PatternBgnd KeepColor Pat3 setpattern} bind def
/Pattern4 {PatternBgnd KeepColor Landscape {Pat5} {Pat4} ifelse setpattern} bind def
/Pattern5 {PatternBgnd KeepColor Landscape {Pat4} {Pat5} ifelse setpattern} bind def
/Pattern6 {PatternBgnd KeepColor Landscape {Pat9} {Pat6} ifelse setpattern} bind def
/Pattern7 {PatternBgnd KeepColor Landscape {Pat8} {Pat7} ifelse setpattern} bind def
} def
%
%
%End of PostScript Level 2 code
%
/PatternBgnd {
  TransparentPatterns {} {gsave 1 setgray fill grestore} ifelse
} def
%
% Substitute for Level 2 pattern fill codes with
% grayscale if Level 2 support is not selected.
%
/Level1PatternFill {
/Pattern1 {0.250 Density} bind def
/Pattern2 {0.500 Density} bind def
/Pattern3 {0.750 Density} bind def
/Pattern4 {0.125 Density} bind def
/Pattern5 {0.375 Density} bind def
/Pattern6 {0.625 Density} bind def
/Pattern7 {0.875 Density} bind def
} def
%
% Now test for support of Level 2 code
%
Level1 {Level1PatternFill} {Level2PatternFill} ifelse
%
/Symbol-Oblique /Symbol findfont [1 0 .167 1 0 0] makefont
dup length dict begin {1 index /FID eq {pop pop} {def} ifelse} forall
currentdict end definefont pop
Level1 SuppressPDFMark or 
{} {
/SDict 10 dict def
systemdict /pdfmark known not {
  userdict /pdfmark systemdict /cleartomark get put
} if
SDict begin [
  /Title (charStrahl_plot.tex)
  /Subject (gnuplot plot)
  /Creator (gnuplot 4.6 patchlevel 5)
  /Author (kevin.luedemann)
%  /Producer (gnuplot)
%  /Keywords ()
  /CreationDate (Fri Mar 13 09:02:07 2015)
  /DOCINFO pdfmark
end
} ifelse
end
%%EndProlog
%%Page: 1 1
gnudict begin
gsave
doclip
50 50 translate
0.050 0.050 scale
0 setgray
newpath
1.000 UL
LTb
LCb setrgbcolor
1078 704 M
63 0 V
5662 0 R
-63 0 V
stroke
LTb
1078 1156 M
63 0 V
5662 0 R
-63 0 V
1078 1609 M
63 0 V
5662 0 R
-63 0 V
1078 2061 M
63 0 V
5662 0 R
-63 0 V
1078 2513 M
63 0 V
5662 0 R
-63 0 V
1078 2966 M
63 0 V
5662 0 R
-63 0 V
1078 3418 M
63 0 V
5662 0 R
-63 0 V
1078 3870 M
63 0 V
5662 0 R
-63 0 V
1078 4323 M
63 0 V
5662 0 R
-63 0 V
1078 4775 M
63 0 V
5662 0 R
-63 0 V
1078 704 M
0 63 V
0 4008 R
0 -63 V
1651 704 M
0 63 V
0 4008 R
0 -63 V
2223 704 M
0 63 V
0 4008 R
0 -63 V
2796 704 M
0 63 V
0 4008 R
0 -63 V
3368 704 M
0 63 V
0 4008 R
0 -63 V
3941 704 M
0 63 V
0 4008 R
0 -63 V
4513 704 M
0 63 V
0 4008 R
0 -63 V
5086 704 M
0 63 V
0 4008 R
0 -63 V
5658 704 M
0 63 V
0 4008 R
0 -63 V
6231 704 M
0 63 V
0 4008 R
0 -63 V
6803 704 M
0 63 V
0 4008 R
0 -63 V
stroke
1078 4775 N
0 -4071 V
5725 0 V
0 4071 V
-5725 0 V
Z stroke
1.000 UP
1.000 UL
LTb
1.000 UP
1.000 UL
LT0
LC0 setrgbcolor
LCb setrgbcolor
LT0
LC0 setrgbcolor
1422 1622 Pls
1433 1594 Pls
1444 1472 Pls
1456 1491 Pls
1467 1328 Pls
1479 1314 Pls
1490 1175 Pls
1502 1189 Pls
1513 1092 Pls
1525 1027 Pls
1536 986 Pls
1547 899 Pls
1559 886 Pls
1570 804 Pls
1582 790 Pls
1593 758 Pls
1605 772 Pls
1616 776 Pls
1628 763 Pls
1639 767 Pls
1651 781 Pls
1662 754 Pls
1673 767 Pls
1685 767 Pls
1696 758 Pls
1708 767 Pls
1719 763 Pls
1725 754 Pls
1742 745 Pls
1754 763 Pls
1765 763 Pls
1776 767 Pls
1788 790 Pls
1799 786 Pls
1811 786 Pls
1822 772 Pls
1834 772 Pls
1845 772 Pls
1857 795 Pls
1868 831 Pls
1880 836 Pls
1891 867 Pls
1902 963 Pls
1914 963 Pls
1925 1041 Pls
1937 1106 Pls
1948 1110 Pls
1960 1156 Pls
1971 1152 Pls
1983 1272 Pls
1994 1323 Pls
2005 1351 Pls
2017 1337 Pls
2028 1393 Pls
2034 1370 Pls
2051 1365 Pls
2063 1440 Pls
2074 1491 Pls
2086 1774 Pls
2091 1911 Pls
2109 2036 Pls
2120 1950 Pls
2131 1726 Pls
2143 1655 Pls
2154 1608 Pls
2166 1726 Pls
2177 1627 Pls
2189 1840 Pls
2200 1845 Pls
2212 2199 Pls
2223 3911 Pls
2234 4653 Pls
2246 4520 Pls
2257 3180 Pls
2269 2364 Pls
2280 1807 Pls
2292 1831 Pls
2303 1883 Pls
2315 1783 Pls
2320 1892 Pls
2338 1911 Pls
2349 1883 Pls
2360 1883 Pls
2372 1859 Pls
2383 1859 Pls
2395 1931 Pls
2406 2074 Pls
2418 1892 Pls
2429 1993 Pls
2441 1997 Pls
2452 1959 Pls
2463 1873 Pls
2475 1978 Pls
2486 2036 Pls
2492 2141 Pls
2509 2007 Pls
2521 2045 Pls
2532 2017 Pls
2544 2021 Pls
2555 1988 Pls
2567 2055 Pls
2578 2026 Pls
2589 1869 Pls
2601 1854 Pls
2612 1802 Pls
2624 1859 Pls
2635 1883 Pls
2647 1826 Pls
2658 1812 Pls
2670 1859 Pls
2681 1788 Pls
2692 1850 Pls
2704 1793 Pls
2715 1816 Pls
2727 1850 Pls
2738 1778 Pls
2750 1850 Pls
2761 1778 Pls
2773 1821 Pls
2784 1793 Pls
2796 1821 Pls
2807 1769 Pls
2818 1821 Pls
2830 1759 Pls
2841 1850 Pls
2853 1826 Pls
2864 1888 Pls
2876 1840 Pls
2887 1774 Pls
2899 1740 Pls
2910 1755 Pls
2921 1726 Pls
2933 1707 Pls
2939 1873 Pls
2956 1902 Pls
2967 1845 Pls
2979 1783 Pls
2990 1769 Pls
3002 1679 Pls
3013 1764 Pls
3025 1703 Pls
3036 1769 Pls
3047 1707 Pls
3053 1722 Pls
3070 1655 Pls
3082 1693 Pls
3093 1731 Pls
3105 1693 Pls
3110 1707 Pls
3128 1731 Pls
3139 1698 Pls
3150 1807 Pls
3162 1835 Pls
3168 1717 Pls
3185 1632 Pls
3196 1594 Pls
3208 1580 Pls
3219 1585 Pls
3225 1566 Pls
3242 1608 Pls
3254 1557 Pls
3265 1538 Pls
3276 1566 Pls
3288 1627 Pls
3299 1528 Pls
3311 1500 Pls
3322 1566 Pls
3334 1524 Pls
3339 1524 Pls
3357 1356 Pls
3368 1543 Pls
3379 1552 Pls
3391 1538 Pls
3397 1613 Pls
3414 1637 Pls
3425 1812 Pls
3437 1783 Pls
3448 1693 Pls
3454 1674 Pls
3471 1365 Pls
3483 1309 Pls
3494 1360 Pls
3505 1309 Pls
3517 1407 Pls
3528 1337 Pls
3540 1286 Pls
3551 1277 Pls
3563 1314 Pls
3574 1346 Pls
3586 1230 Pls
3597 1258 Pls
3608 1281 Pls
3620 1221 Pls
3626 1295 Pls
3643 1337 Pls
3654 1477 Pls
3666 1411 Pls
3677 1230 Pls
3683 1142 Pls
3700 1175 Pls
3712 1106 Pls
3723 1147 Pls
3734 1119 Pls
3740 1083 Pls
3757 1133 Pls
3769 1147 Pls
3780 1110 Pls
3792 1124 Pls
3803 1064 Pls
3815 1073 Pls
3826 1073 Pls
3837 1069 Pls
3849 1037 Pls
3860 1027 Pls
3872 1032 Pls
3883 1041 Pls
3895 1027 Pls
3906 1050 Pls
3912 1032 Pls
3929 1023 Pls
3941 1032 Pls
3952 977 Pls
3963 991 Pls
3969 963 Pls
3986 918 Pls
3998 986 Pls
4009 931 Pls
4021 954 Pls
4032 940 Pls
4044 1005 Pls
4055 986 Pls
4066 945 Pls
4078 954 Pls
4089 986 Pls
4101 931 Pls
4112 913 Pls
4124 972 Pls
4135 927 Pls
4147 922 Pls
4158 950 Pls
4170 908 Pls
4181 899 Pls
4192 908 Pls
4204 881 Pls
4215 908 Pls
4227 867 Pls
4238 863 Pls
4250 927 Pls
4261 872 Pls
4273 863 Pls
4284 867 Pls
4295 867 Pls
4307 895 Pls
4318 858 Pls
4330 863 Pls
4341 854 Pls
4353 826 Pls
4364 863 Pls
4376 858 Pls
4387 854 Pls
4399 840 Pls
4410 858 Pls
4421 845 Pls
4433 867 Pls
4444 831 Pls
4456 822 Pls
4467 804 Pls
4479 817 Pls
4490 858 Pls
4502 808 Pls
4513 817 Pls
4524 822 Pls
4536 836 Pls
4547 804 Pls
4559 804 Pls
4570 804 Pls
4582 845 Pls
4593 813 Pls
4605 795 Pls
4616 826 Pls
4628 826 Pls
4639 804 Pls
4650 799 Pls
4662 831 Pls
4673 817 Pls
4685 786 Pls
4696 836 Pls
4708 840 Pls
4719 854 Pls
4731 877 Pls
4742 863 Pls
4748 858 Pls
4765 831 Pls
4776 813 Pls
4788 813 Pls
4799 799 Pls
4811 781 Pls
4822 795 Pls
4834 799 Pls
4845 799 Pls
4857 817 Pls
4868 772 Pls
4879 772 Pls
4891 795 Pls
4902 799 Pls
4914 799 Pls
4925 804 Pls
4937 786 Pls
4948 804 Pls
4960 781 Pls
4971 772 Pls
4982 799 Pls
4994 781 Pls
5005 808 Pls
5017 776 Pls
5028 776 Pls
5034 786 Pls
5051 781 Pls
5063 790 Pls
5074 790 Pls
5086 781 Pls
5097 790 Pls
5108 790 Pls
5120 808 Pls
5131 790 Pls
5143 799 Pls
5154 758 Pls
5166 808 Pls
5177 776 Pls
5189 767 Pls
5200 781 Pls
5211 767 Pls
5223 758 Pls
5234 767 Pls
5246 767 Pls
5257 772 Pls
5269 740 Pls
5280 781 Pls
5292 786 Pls
5303 776 Pls
5315 767 Pls
5320 781 Pls
5337 745 Pls
5349 758 Pls
5360 772 Pls
5372 781 Pls
5383 772 Pls
5395 795 Pls
5406 776 Pls
5418 795 Pls
5429 754 Pls
5440 772 Pls
5452 772 Pls
5463 772 Pls
5475 767 Pls
5486 758 Pls
5498 772 Pls
5509 749 Pls
5521 758 Pls
5532 763 Pls
5544 776 Pls
5555 772 Pls
5566 740 Pls
5578 767 Pls
5589 758 Pls
5601 763 Pls
5606 763 Pls
5624 776 Pls
5635 763 Pls
5647 763 Pls
5658 767 Pls
5669 758 Pls
5681 767 Pls
5692 745 Pls
5704 772 Pls
5715 763 Pls
5721 754 Pls
5738 740 Pls
5750 772 Pls
5761 758 Pls
5773 745 Pls
5784 758 Pls
5795 754 Pls
5807 758 Pls
5818 754 Pls
5830 749 Pls
5841 772 Pls
5853 754 Pls
5864 749 Pls
5876 758 Pls
5887 754 Pls
5893 758 Pls
5910 740 Pls
5921 758 Pls
5933 749 Pls
5944 754 Pls
5956 745 Pls
5967 749 Pls
5979 749 Pls
5990 749 Pls
6002 745 Pls
6007 754 Pls
6024 736 Pls
6036 767 Pls
6047 754 Pls
6059 767 Pls
6070 736 Pls
6082 754 Pls
6093 749 Pls
6105 749 Pls
6116 745 Pls
6127 731 Pls
6139 736 Pls
6150 736 Pls
6162 731 Pls
6173 758 Pls
6179 740 Pls
6196 772 Pls
6208 745 Pls
6219 745 Pls
6231 736 Pls
6242 754 Pls
6253 754 Pls
6265 749 Pls
6276 740 Pls
6288 727 Pls
6293 745 Pls
6311 745 Pls
6322 745 Pls
6334 745 Pls
6345 758 Pls
6356 749 Pls
6368 758 Pls
6379 745 Pls
6391 754 Pls
6402 745 Pls
6414 749 Pls
6425 740 Pls
6437 754 Pls
6448 754 Pls
6460 736 Pls
6465 736 Pls
6482 731 Pls
6494 749 Pls
6505 745 Pls
6517 731 Pls
6528 749 Pls
6540 736 Pls
6551 740 Pls
6563 745 Pls
6574 727 Pls
6580 731 Pls
6597 727 Pls
6608 731 Pls
6620 749 Pls
6631 731 Pls
6643 718 Pls
6654 754 Pls
6666 727 Pls
6677 731 Pls
6689 736 Pls
6700 740 Pls
6711 749 Pls
6723 745 Pls
6734 740 Pls
6746 749 Pls
6751 731 Pls
6769 736 Pls
6780 772 Pls
6792 763 Pls
6803 772 Pls
6243 4602 Pls
1.000 UL
LTb
LCb setrgbcolor
1078 4775 N
0 -4071 V
5725 0 V
0 4071 V
-5725 0 V
Z stroke
1.000 UP
1.000 UL
LTb
stroke
grestore
end
showpage
%%Trailer
