\BOOKMARK [1][-]{section.1}{Einleitung}{}% 1
\BOOKMARK [1][-]{section.2}{Theorie}{}% 2
\BOOKMARK [2][-]{subsection.2.1}{Spektrum der R\366ntgenstrahlung}{section.2}% 3
\BOOKMARK [2][-]{subsection.2.2}{Bragg-Reflektion}{section.2}% 4
\BOOKMARK [2][-]{subsection.2.3}{Absorption}{section.2}% 5
\BOOKMARK [1][-]{section.3}{Durchf\374hrung}{}% 6
\BOOKMARK [1][-]{section.4}{Auswertung}{}% 7
\BOOKMARK [2][-]{subsection.4.1}{Charakteristische Spannung}{section.4}% 8
\BOOKMARK [2][-]{subsection.4.2}{Bremsstrahlung}{section.4}% 9
\BOOKMARK [2][-]{subsection.4.3}{Intensit\344t der charakteristischen Linien}{section.4}% 10
\BOOKMARK [2][-]{subsection.4.4}{Absobtion von Nickel und Kufper}{section.4}% 11
\BOOKMARK [2][-]{subsection.4.5}{Absorbtionskoeffizient}{section.4}% 12
\BOOKMARK [1][-]{section.5}{Diskussion}{}% 13
\BOOKMARK [1][-]{section*.14}{Literatur}{}% 14
