\relax 
\providecommand\hyper@newdestlabel[2]{}
\bibstyle{biblatex}
\bibdata{Prohaupt-blx,literatur}
\citation{biblatex-control}
\catcode `"\active 
\providecommand\HyperFirstAtBeginDocument{\AtBeginDocument}
\HyperFirstAtBeginDocument{\ifx\hyper@anchor\@undefined
\global\let\oldcontentsline\contentsline
\gdef\contentsline#1#2#3#4{\oldcontentsline{#1}{#2}{#3}}
\global\let\oldnewlabel\newlabel
\gdef\newlabel#1#2{\newlabelxx{#1}#2}
\gdef\newlabelxx#1#2#3#4#5#6{\oldnewlabel{#1}{{#2}{#3}}}
\AtEndDocument{\ifx\hyper@anchor\@undefined
\let\contentsline\oldcontentsline
\let\newlabel\oldnewlabel
\fi}
\fi}
\global\let\hyper@last\relax 
\gdef\HyperFirstAtBeginDocument#1{#1}
\providecommand\HyField@AuxAddToFields[1]{}
\providecommand\HyField@AuxAddToCoFields[2]{}
\providecommand \oddpage@label [2]{}
\@writefile{toc}{\boolfalse {citerequest}\boolfalse {citetracker}\boolfalse {pagetracker}\boolfalse {backtracker}\relax }
\@writefile{lof}{\boolfalse {citerequest}\boolfalse {citetracker}\boolfalse {pagetracker}\boolfalse {backtracker}\relax }
\@writefile{lot}{\boolfalse {citerequest}\boolfalse {citetracker}\boolfalse {pagetracker}\boolfalse {backtracker}\relax }
\select@language{ngerman}
\@writefile{toc}{\defcounter {refsection}{0}\relax }\@writefile{toc}{\select@language{ngerman}}
\@writefile{lof}{\defcounter {refsection}{0}\relax }\@writefile{lof}{\select@language{ngerman}}
\@writefile{lot}{\defcounter {refsection}{0}\relax }\@writefile{lot}{\select@language{ngerman}}
\citation{LP23}
\citation{LP23}
\citation{dem3}
\@writefile{toc}{\contentsline {section}{\numberline {1}Einleitung}{1}{section.1}}
\newlabel{sec:einleitung}{{1}{1}{Einleitung}{section.1}{}}
\@writefile{toc}{\contentsline {section}{\numberline {2}Theorie}{1}{section.2}}
\newlabel{sec:theorie}{{2}{1}{Theorie}{section.2}{}}
\@writefile{toc}{\contentsline {subsection}{\numberline {2.1}Spektrum der R\IeC {\"o}ntgenstrahlung}{1}{subsection.2.1}}
\@writefile{lof}{\contentsline {figure}{\numberline {1}{\ignorespaces R\IeC {\"o}ntgenspektrum \cite [abgerufen am: 11.03.15]{LP23}\relax }}{1}{figure.caption.1}}
\providecommand*\caption@xref[2]{\@setref\relax\@undefined{#1}}
\newlabel{fig:spektrum}{{1}{1}{Röntgenspektrum \cite [abgerufen am: 11.03.15]{LP23}\relax }{figure.caption.1}{}}
\citation{dem3}
\citation{prakti}
\citation{dem3}
\citation{LP23}
\citation{LP23}
\newlabel{eq:ryd}{{2.1.1}{2}{Spektrum der Röntgenstrahlung}{equation.2.1.1}{}}
\newlabel{eq:energie}{{2.1.2}{2}{Spektrum der Röntgenstrahlung}{equation.2.1.2}{}}
\newlabel{eq:grenzspannung}{{2.1.3}{2}{Spektrum der Röntgenstrahlung}{equation.2.1.3}{}}
\newlabel{eq:intensit\IeC {\"a}t}{{2.1.4}{2}{Spektrum der Röntgenstrahlung}{equation.2.1.4}{}}
\@writefile{toc}{\contentsline {subsection}{\numberline {2.2}Bragg-Reflektion}{2}{subsection.2.2}}
\newlabel{eq:bragg}{{2.2.1}{2}{Bragg-Reflektion}{equation.2.2.1}{}}
\@writefile{toc}{\contentsline {subsection}{\numberline {2.3}Absorption}{2}{subsection.2.3}}
\citation{dem3}
\@writefile{lof}{\contentsline {figure}{\numberline {2}{\ignorespaces Schema zur Bragg-Bedingung \cite [abgerufen am: 11.03.15]{LP23}\relax }}{3}{figure.caption.2}}
\newlabel{fig:bragg}{{2}{3}{Schema zur Bragg-Bedingung \cite [abgerufen am: 11.03.15]{LP23}\relax }{figure.caption.2}{}}
\newlabel{eq:lambert}{{2.3.1}{3}{Absorption}{equation.2.3.1}{}}
\@writefile{toc}{\contentsline {section}{\numberline {3}Durchf\IeC {\"u}hrung}{3}{section.3}}
\newlabel{sec:durchfuehrung}{{3}{3}{Durchführung}{section.3}{}}
\citation{prakti}
\citation{prakti}
\@writefile{lof}{\contentsline {figure}{\numberline {3}{\ignorespaces Schema des Versuchsaufbaus\relax }}{4}{figure.caption.3}}
\newlabel{fig:aufbau}{{3}{4}{Schema des Versuchsaufbaus\relax }{figure.caption.3}{}}
\@writefile{toc}{\contentsline {section}{\numberline {4}Auswertung}{4}{section.4}}
\newlabel{sec:auswertung}{{4}{4}{Auswertung}{section.4}{}}
\@writefile{toc}{\contentsline {subsection}{\numberline {4.1}Charakteristische Spannung}{4}{subsection.4.1}}
\citation{prakti}
\citation{prakti}
\@writefile{lof}{\contentsline {figure}{\numberline {4}{\ignorespaces Messung der charakteristischen Strahlung. Impulsrate gegen Ablenkwinkel $\theta $ aufgetragen\relax }}{5}{figure.caption.4}}
\newlabel{fig:charstrahl}{{4}{5}{Messung der charakteristischen Strahlung. Impulsrate gegen Ablenkwinkel $\theta $ aufgetragen\relax }{figure.caption.4}{}}
\newlabel{eq:siglam}{{4.1.1}{5}{Charakteristische Spannung}{equation.4.1.1}{}}
\@writefile{lot}{\contentsline {table}{\numberline {1}{\ignorespaces Ergebnisse der Wellenl\IeC {\"a}nge und der Energie bei den Winkeln aus den Daten der Graphik \ref  {fig:charstrahl}\relax }}{5}{table.caption.5}}
\newlabel{tab:wertelae}{{1}{5}{Ergebnisse der Wellenlänge und der Energie bei den Winkeln aus den Daten der Graphik \ref {fig:charstrahl}\relax }{table.caption.5}{}}
\@writefile{toc}{\contentsline {subsection}{\numberline {4.2}Bremsstrahlung}{6}{subsection.4.2}}
\@writefile{lof}{\contentsline {figure}{\numberline {5}{\ignorespaces Es ist der Bremsstrahlungsbereich der zweiten Messung mit verschiedenen Spannungen aufgetragen.\relax }}{6}{figure.caption.6}}
\newlabel{fig:brems}{{5}{6}{Es ist der Bremsstrahlungsbereich der zweiten Messung mit verschiedenen Spannungen aufgetragen.\relax }{figure.caption.6}{}}
\@writefile{lot}{\contentsline {table}{\numberline {2}{\ignorespaces Ergebnisse der Wellenl\IeC {\"a}nge und der Plankkonstante zu den Grenzwinkeln $\theta $ und den verschiedene Anodenspannungen $U_A$.\relax }}{7}{table.caption.7}}
\newlabel{tab:plank}{{2}{7}{Ergebnisse der Wellenlänge und der Plankkonstante zu den Grenzwinkeln $\theta $ und den verschiedene Anodenspannungen $U_A$.\relax }{table.caption.7}{}}
\@writefile{toc}{\contentsline {subsection}{\numberline {4.3}Intensit\IeC {\"a}t der charakteristischen Linien}{7}{subsection.4.3}}
\@writefile{lof}{\contentsline {figure}{\numberline {6}{\ignorespaces Hier sind die Peaks der f\IeC {\"u}nf verschiedenen Anodenspannungen aufgetragen. \relax }}{7}{figure.caption.8}}
\newlabel{fig:peaks}{{6}{7}{Hier sind die Peaks der fünf verschiedenen Anodenspannungen aufgetragen. \relax }{figure.caption.8}{}}
\@writefile{lof}{\contentsline {figure}{\numberline {7}{\ignorespaces Regression der Maxima der charakteristischen Strahlung der K$_\beta $ und K$_\alpha $ Linie.\relax }}{8}{figure.caption.9}}
\newlabel{fig:intenpeak}{{7}{8}{Regression der Maxima der charakteristischen Strahlung der K$_\beta $ und K$_\alpha $ Linie.\relax }{figure.caption.9}{}}
\@writefile{toc}{\contentsline {subsection}{\numberline {4.4}Absobtion von Nickel und Kufper}{8}{subsection.4.4}}
\citation{prakti}
\@writefile{lof}{\contentsline {figure}{\numberline {8}{\ignorespaces Absorbtionskurven von Nickel und Kupfer in einem Plot. Die Absorbtionskanten sind gut zu erkennen.\relax }}{9}{figure.caption.10}}
\newlabel{fig:niku}{{8}{9}{Absorbtionskurven von Nickel und Kupfer in einem Plot. Die Absorbtionskanten sind gut zu erkennen.\relax }{figure.caption.10}{}}
\@writefile{lot}{\contentsline {table}{\numberline {3}{\ignorespaces Ergebnisse aus der Absorbtion. Bestimmung von $\theta $ und daraus dann die Wellenl\IeC {\"a}nge und die Rydbergkonstante R$_\nu $.\relax }}{9}{table.caption.11}}
\newlabel{tab:ryd}{{3}{9}{Ergebnisse aus der Absorbtion. Bestimmung von $\theta $ und daraus dann die Wellenlänge und die Rydbergkonstante R$_\nu $.\relax }{table.caption.11}{}}
\@writefile{toc}{\contentsline {subsection}{\numberline {4.5}Absorbtionskoeffizient}{9}{subsection.4.5}}
\@writefile{lof}{\contentsline {figure}{\numberline {9}{\ignorespaces Absorbtion von AL, SN, ZN, NI und ohne Absorber.\relax }}{10}{figure.caption.12}}
\newlabel{fig:absk}{{9}{10}{Absorbtion von AL, SN, ZN, NI und ohne Absorber.\relax }{figure.caption.12}{}}
\@writefile{toc}{\contentsline {section}{\numberline {5}Diskussion}{10}{section.5}}
\newlabel{sec:diskussion}{{5}{10}{Diskussion}{section.5}{}}
\@writefile{lof}{\contentsline {figure}{\numberline {10}{\ignorespaces dies ist ein plot. Er ist fast sch\IeC {\"o}n. Es sind die Wellenl\IeC {\"a}ngen aus den Absorbtionskurven zur dritten Potenz gegen die Absorbtionskoeffizienten der Metalle gezeichnet. Zu dem sind Regressionen durchgef\IeC {\"u}hrt, die den Zusammenhang darstellen.\relax }}{11}{figure.caption.13}}
\newlabel{fig:abslog}{{10}{11}{dies ist ein plot. Er ist fast schön. Es sind die Wellenlängen aus den Absorbtionskurven zur dritten Potenz gegen die Absorbtionskoeffizienten der Metalle gezeichnet. Zu dem sind Regressionen durchgeführt, die den Zusammenhang darstellen.\relax }{figure.caption.13}{}}
\@writefile{toc}{\contentsline {section}{\nonumberline Literatur}{11}{section*.14}}
