# kond		Fehler Kond	druck	fehler druck
0.1		0.02		19.62	9.81
0.225		0.03		9.81	9.81
0.4		0.04		49.05	9.81
0.625		0.05		58.86	9.81
0.9		0.06		98.1	9.81
1.225		0.07		117.72	9.81
1.6		0.08		176.58	9.81
2.025		0.09		215.82	9.81
2.5		0.10		250.6	9.81
