\relax 
\providecommand\hyper@newdestlabel[2]{}
\catcode `"\active 
\providecommand\HyperFirstAtBeginDocument{\AtBeginDocument}
\HyperFirstAtBeginDocument{\ifx\hyper@anchor\@undefined
\global\let\oldcontentsline\contentsline
\gdef\contentsline#1#2#3#4{\oldcontentsline{#1}{#2}{#3}}
\global\let\oldnewlabel\newlabel
\gdef\newlabel#1#2{\newlabelxx{#1}#2}
\gdef\newlabelxx#1#2#3#4#5#6{\oldnewlabel{#1}{{#2}{#3}}}
\AtEndDocument{\ifx\hyper@anchor\@undefined
\let\contentsline\oldcontentsline
\let\newlabel\oldnewlabel
\fi}
\fi}
\global\let\hyper@last\relax 
\gdef\HyperFirstAtBeginDocument#1{#1}
\providecommand\HyField@AuxAddToFields[1]{}
\providecommand\HyField@AuxAddToCoFields[2]{}
\bibstyle{biblatex}
\bibdata{protokoll-blx,lit}
\citation{biblatex-control} 
\@writefile{toc}{\boolfalse{citerequest}\boolfalse{citetracker}\boolfalse{pagetracker}}
\@writefile{lof}{\boolfalse{citerequest}\boolfalse{citetracker}\boolfalse{pagetracker}}
\@writefile{lot}{\boolfalse{citerequest}\boolfalse{citetracker}\boolfalse{pagetracker}}
\select@language{ngerman}
\@writefile{toc}{\defcounter{refsection}{0}}
\@writefile{toc}{\select@language{ngerman}}
\@writefile{lof}{\defcounter{refsection}{0}}
\@writefile{lof}{\select@language{ngerman}}
\@writefile{lot}{\defcounter{refsection}{0}}
\@writefile{lot}{\select@language{ngerman}}
\citation{dem2}
\citation{dem2}
\citation{dem2}
\@writefile{toc}{\contentsline {section}{\numberline {1}Einleitung}{1}{section.1}}
\newlabel{sec:einleitung}{{1}{1}{Einleitung}{section.1}{}}
\@writefile{toc}{\contentsline {section}{\numberline {2}Theorie}{1}{section.2}}
\newlabel{sec:theorie}{{2}{1}{Theorie}{section.2}{}}
\@writefile{toc}{\contentsline {subsection}{\numberline {2.1}Unbelasteter Transformator}{1}{subsection.2.1}}
\newlabel{eq:uind1}{{1}{1}{Unbelasteter Transformator}{equation.2.1}{}}
\newlabel{eq:uind2}{{2}{1}{Unbelasteter Transformator}{equation.2.2}{}}
\newlabel{eq:trafo1}{{3}{1}{Unbelasteter Transformator}{equation.2.3}{}}
\newlabel{eq:leistungtrafo1}{{4}{1}{Unbelasteter Transformator}{equation.2.4}{}}
\@writefile{toc}{\contentsline {subsection}{\numberline {2.2}Belasteter Transformator}{2}{subsection.2.2}}
\newlabel{eq:trafobelastet}{{5}{2}{Belasteter Transformator}{equation.2.5}{}}
\newlabel{eq:herleitungI1}{{6}{2}{Belasteter Transformator}{equation.2.6}{}}
\@writefile{lof}{\contentsline {figure}{\numberline {1}{\ignorespaces Abbildung zur Gleichung \ref  {eq:herleitungI1}\relax }}{2}{figure.caption.1}}
\providecommand*\caption@xref[2]{\@setref\relax\@undefined{#1}}
\newlabel{im:complex1}{{1}{2}{Abbildung zur Gleichung \ref {eq:herleitungI1}\relax }{figure.caption.1}{}}
\@writefile{lof}{\contentsline {figure}{\numberline {2}{\ignorespaces Eine Lissajous-Figur einer xy-Schwingung mit gleicher Frequenz\relax }}{3}{figure.caption.2}}
\newlabel{im:lissajous}{{2}{3}{Eine Lissajous-Figur einer xy-Schwingung mit gleicher Frequenz\relax }{figure.caption.2}{}}
\@writefile{toc}{\contentsline {subsection}{\numberline {2.3}Lissajous-Figuren}{3}{subsection.2.3}}
\@writefile{toc}{\contentsline {section}{\numberline {3}Durchf\"uhrung}{3}{section.3}}
\newlabel{sec:durchfuehrung}{{3}{3}{Durchf\"uhrung}{section.3}{}}
\@writefile{toc}{\contentsline {section}{\numberline {4}Auswertung}{3}{section.4}}
\newlabel{sec:auswertung}{{4}{3}{Auswertung}{section.4}{}}
\@writefile{toc}{\contentsline {section}{\numberline {5}Diskussion}{3}{section.5}}
\newlabel{sec:diskussion}{{5}{3}{Diskussion}{section.5}{}}
\citation{*}
\@writefile{toc}{\contentsline {section}{\nonumberline Literatur}{4}{section*.3}}
