This is BibTeX, Version 0.99d (TeX Live 2013/Debian)
Capacity: max_strings=35307, hash_size=35307, hash_prime=30011
The top-level auxiliary file: protokoll.aux
The style file: biblatex.bst
Reallocated singl_function (elt_size=4) to 100 items from 50.
Reallocated singl_function (elt_size=4) to 100 items from 50.
Reallocated singl_function (elt_size=4) to 100 items from 50.
Reallocated singl_function (elt_size=4) to 100 items from 50.
Reallocated singl_function (elt_size=4) to 100 items from 50.
Reallocated singl_function (elt_size=4) to 100 items from 50.
Reallocated singl_function (elt_size=4) to 100 items from 50.
Reallocated wiz_functions (elt_size=4) to 6000 items from 3000.
Reallocated singl_function (elt_size=4) to 100 items from 50.
Reallocated singl_function (elt_size=4) to 100 items from 50.
Database file #1: protokoll-blx.bib
Database file #2: lit.bib
Biblatex version: 0.8i
Reallocated singl_function (elt_size=4) to 100 items from 50.
You've used 3 entries,
            5526 wiz_defined-function locations,
            1048 strings with 7685 characters,
and the built_in function-call counts, 6161 in all, are:
= -- 252
> -- 225
< -- 51
+ -- 75
- -- 74
* -- 322
:= -- 629
add.period$ -- 0
call.type$ -- 3
change.case$ -- 18
chr.to.int$ -- 34
cite$ -- 4
duplicate$ -- 570
empty$ -- 630
format.name$ -- 102
if$ -- 1423
int.to.chr$ -- 0
int.to.str$ -- 6
missing$ -- 0
newline$ -- 50
num.names$ -- 88
pop$ -- 601
preamble$ -- 1
purify$ -- 20
quote$ -- 0
skip$ -- 374
stack$ -- 0
substring$ -- 177
swap$ -- 131
text.length$ -- 66
text.prefix$ -- 0
top$ -- 1
type$ -- 102
warning$ -- 0
while$ -- 86
width$ -- 0
write$ -- 46
