v 20130925 2
C 40000 40000 0 0 0 title-B.sym
C 44300 45400 1 90 0 voltage-1.sym
{
T 43800 45500 5 10 0 0 90 0 1
device=VOLTAGE_SOURCE
T 43800 45700 5 10 1 2 90 0 1
Generator=G
}
C 47200 45400 1 90 0 voltmeter-1.sym
{
T 46350 45500 5 10 0 0 90 0 1
device=VOLTAGE_SOURCE
T 46600 45700 5 10 1 1 90 0 1
refdes=U
}
C 49200 44500 1 90 0 voltmeter-1.sym
{
T 48350 44600 5 10 0 0 90 0 1
device=VOLTAGE_SOURCE
T 48600 44800 5 10 1 1 90 0 1
refdes=I
}
C 49000 45600 1 90 0 resistor-2.sym
{
T 48650 46000 5 10 0 0 90 0 1
device=RESISTOR
T 48700 45800 5 10 1 1 90 0 1
refdes=RL
}
C 49000 46800 1 90 0 inductor-1.sym
{
T 48500 47000 5 10 0 0 90 0 1
device=INDUCTOR
T 48700 47000 5 10 1 1 90 0 1
refdes=L
T 48300 47000 5 10 0 0 90 0 1
symversion=0.1
}
C 50200 46200 1 90 0 capacitor-1.sym
{
T 49500 46400 5 10 0 0 90 0 1
device=CAPACITOR
T 49700 46400 5 10 1 1 90 0 1
refdes=C
T 49300 46400 5 10 0 0 90 0 1
symversion=0.1
}
N 48900 46800 48900 46500 4
N 48900 45300 48900 45600 4
C 45800 45600 1 90 0 voltmeter-1.sym
{
T 44950 45700 5 10 0 0 90 0 1
device=VOLTAGE_SOURCE
T 45200 45900 5 10 1 1 90 0 1
refdes=Oszilloskop
}
C 48200 44400 1 90 0 voltmeter-1.sym
{
T 47350 44500 5 10 0 0 90 0 1
device=VOLTAGE_SOURCE
T 47600 44700 5 10 1 1 90 0 1
refdes=Oszilloskop
}
N 47900 45300 48900 45300 4
N 44100 46300 44100 47700 4
N 44100 47700 50000 47700 4
N 50000 47700 50000 47100 4
N 50000 46200 50000 45400 4
N 50000 45400 48900 45400 4
N 46900 46300 46900 47700 4
N 45500 46500 45500 47700 4
N 48900 44500 48900 44400 4
N 44100 44400 48900 44400 4
N 44100 45400 44100 44400 4
N 46900 45400 46900 44400 4
N 45500 45600 45500 44400 4
