\relax 
\providecommand\hyper@newdestlabel[2]{}
\catcode `"\active 
\providecommand\HyperFirstAtBeginDocument{\AtBeginDocument}
\HyperFirstAtBeginDocument{\ifx\hyper@anchor\@undefined
\global\let\oldcontentsline\contentsline
\gdef\contentsline#1#2#3#4{\oldcontentsline{#1}{#2}{#3}}
\global\let\oldnewlabel\newlabel
\gdef\newlabel#1#2{\newlabelxx{#1}#2}
\gdef\newlabelxx#1#2#3#4#5#6{\oldnewlabel{#1}{{#2}{#3}}}
\AtEndDocument{\ifx\hyper@anchor\@undefined
\let\contentsline\oldcontentsline
\let\newlabel\oldnewlabel
\fi}
\fi}
\global\let\hyper@last\relax 
\gdef\HyperFirstAtBeginDocument#1{#1}
\providecommand\HyField@AuxAddToFields[1]{}
\providecommand\HyField@AuxAddToCoFields[2]{}
\bibstyle{biblatex}
\bibdata{protokoll-blx,lit}
\citation{biblatex-control}
\@writefile{toc}{\boolfalse {citerequest}\boolfalse {citetracker}\boolfalse {pagetracker}\boolfalse {backtracker}\relax }
\@writefile{lof}{\boolfalse {citerequest}\boolfalse {citetracker}\boolfalse {pagetracker}\boolfalse {backtracker}\relax }
\@writefile{lot}{\boolfalse {citerequest}\boolfalse {citetracker}\boolfalse {pagetracker}\boolfalse {backtracker}\relax }
\select@language{ngerman}
\@writefile{toc}{\defcounter {refsection}{0}\relax }\@writefile{toc}{\select@language{ngerman}}
\@writefile{lof}{\defcounter {refsection}{0}\relax }\@writefile{lof}{\select@language{ngerman}}
\@writefile{lot}{\defcounter {refsection}{0}\relax }\@writefile{lot}{\select@language{ngerman}}
\citation{dem2}
\@writefile{toc}{\contentsline {section}{\numberline {1}Einleitung}{1}{section.1}}
\newlabel{sec:einleitung}{{1}{1}{Einleitung}{section.1}{}}
\@writefile{toc}{\contentsline {section}{\numberline {2}Theorie}{1}{section.2}}
\newlabel{sec:theorie}{{2}{1}{Theorie}{section.2}{}}
\@writefile{toc}{\contentsline {subsection}{\numberline {2.1}Widerstandsmessung mit dem Ohmschen Gesetz}{1}{subsection.2.1}}
\@writefile{toc}{\contentsline {subsection}{\numberline {2.2}Entladung eines Kondensators}{1}{subsection.2.2}}
\newlabel{eq:Rkond}{{1}{1}{Entladung eines Kondensators}{equation.2.1}{}}
\citation{dem2}
\citation{dem2}
\newlabel{eq:mkond}{{2}{2}{Entladung eines Kondensators}{equation.2.2}{}}
\newlabel{eq:Riso}{{3}{2}{Entladung eines Kondensators}{equation.2.3}{}}
\newlabel{eq:kondensator}{{4}{2}{Entladung eines Kondensators}{equation.2.4}{}}
\@writefile{toc}{\contentsline {subsection}{\numberline {2.3}Analoger Stromintegrator}{2}{subsection.2.3}}
\@writefile{lof}{\contentsline {figure}{\numberline {1}{\ignorespaces Aufbau eines analogen Stromintegrators mit einem Operationsverst\IeC {\"a}rker.\relax }}{2}{figure.caption.1}}
\providecommand*\caption@xref[2]{\@setref\relax\@undefined{#1}}
\newlabel{im:integrator}{{1}{2}{Aufbau eines analogen Stromintegrators mit einem Operationsverstärker.\relax }{figure.caption.1}{}}
\citation{dem1}
\citation{dem2}
\newlabel{eq:integrator}{{5}{3}{Analoger Stromintegrator}{equation.2.5}{}}
\@writefile{toc}{\contentsline {subsection}{\numberline {2.4}RLC-Schwingkreis}{3}{subsection.2.4}}
\@writefile{lof}{\contentsline {figure}{\numberline {2}{\ignorespaces Schaltskizze des Schwingkreises\relax }}{3}{figure.caption.2}}
\newlabel{im:schwingkreis}{{2}{3}{Schaltskizze des Schwingkreises\relax }{figure.caption.2}{}}
\newlabel{eq:schwingkreisdgl}{{6}{3}{RLC-Schwingkreis}{equation.2.6}{}}
\newlabel{eq:schwinkreisvars}{{7}{3}{RLC-Schwingkreis}{equation.2.7}{}}
\citation{dem2}
\newlabel{eq:dekrement}{{8}{4}{RLC-Schwingkreis}{equation.2.8}{}}
\@writefile{toc}{\contentsline {subsection}{\numberline {2.5}Bestimmung der Induktivit\IeC {\"a}t}{4}{subsection.2.5}}
\newlabel{eq:indukt1}{{9}{4}{Bestimmung der Induktivität}{equation.2.9}{}}
\newlabel{eq:indukt2}{{10}{4}{Bestimmung der Induktivität}{equation.2.10}{}}
\@writefile{toc}{\contentsline {section}{\numberline {3}Durchf\"uhrung}{4}{section.3}}
\newlabel{sec:durchfuehrung}{{3}{4}{Durchf\"uhrung}{section.3}{}}
\@writefile{toc}{\contentsline {section}{\numberline {4}Auswertung}{4}{section.4}}
\newlabel{sec:auswertung}{{4}{4}{Auswertung}{section.4}{}}
\@writefile{toc}{\contentsline {subsection}{\numberline {4.1}Bestimmung von $\epsilon _0$}{4}{subsection.4.1}}
\@writefile{lot}{\contentsline {table}{\numberline {1}{\ignorespaces Tabelle der vom Stromintegrator gemessenen Skalenteile von der Gesamtladung $Q_0$ des Kondensators\relax }}{4}{table.caption.3}}
\newlabel{tab:skt0}{{1}{4}{Tabelle der vom Stromintegrator gemessenen Skalenteile von der Gesamtladung $Q_0$ des Kondensators\relax }{table.caption.3}{}}
\newlabel{eq:ladung}{{12}{5}{Bestimmung von $\epsilon _0$}{equation.4.12}{}}
\@writefile{toc}{\contentsline {subsection}{\numberline {4.2}Bestimmung von $R_x$ \IeC {\"u}ber die Kondensatorentladung}{5}{subsection.4.2}}
\@writefile{lof}{\contentsline {figure}{\numberline {3}{\ignorespaces Logarithmische Auftragung der Kondensatorentladung mit parallelgeschaltetem $R_x$. Es wird ein linearer Zusammenhang erwartet. Die Regressionsgerade ist in rot eingezeichnet.\relax }}{6}{figure.caption.4}}
\newlabel{fig:2bkond}{{3}{6}{Logarithmische Auftragung der Kondensatorentladung mit parallelgeschaltetem $R_x$. Es wird ein linearer Zusammenhang erwartet. Die Regressionsgerade ist in rot eingezeichnet.\relax }{figure.caption.4}{}}
\@writefile{lof}{\contentsline {figure}{\numberline {4}{\ignorespaces Logarithmische Auftragung der Kondensatorentladung ohne den zus\IeC {\"a}tzlichen Widerstand $R_x$, also nur \IeC {\"u}ber den Isolationswiderstand $R_{iso}$. Wieder wird ein linearer Zusammenhang erwartet. Der Fit ist in rot eingezeichnet.\relax }}{7}{figure.caption.5}}
\newlabel{fig:2ckond}{{4}{7}{Logarithmische Auftragung der Kondensatorentladung ohne den zusätzlichen Widerstand $R_x$, also nur über den Isolationswiderstand $R_{iso}$. Wieder wird ein linearer Zusammenhang erwartet. Der Fit ist in rot eingezeichnet.\relax }{figure.caption.5}{}}
\@writefile{toc}{\contentsline {section}{\numberline {5}Diskussion}{7}{section.5}}
\newlabel{sec:diskussion}{{5}{7}{Diskussion}{section.5}{}}
\citation{*}
\@writefile{toc}{\contentsline {section}{Literatur}{8}{section*.6}}
