\relax 
\providecommand\hyper@newdestlabel[2]{}
\bibstyle{biblatex}
\bibdata{Prohaupt-blx,literatur}
\citation{biblatex-control}
\catcode `"\active 
\providecommand\HyperFirstAtBeginDocument{\AtBeginDocument}
\HyperFirstAtBeginDocument{\ifx\hyper@anchor\@undefined
\global\let\oldcontentsline\contentsline
\gdef\contentsline#1#2#3#4{\oldcontentsline{#1}{#2}{#3}}
\global\let\oldnewlabel\newlabel
\gdef\newlabel#1#2{\newlabelxx{#1}#2}
\gdef\newlabelxx#1#2#3#4#5#6{\oldnewlabel{#1}{{#2}{#3}}}
\AtEndDocument{\ifx\hyper@anchor\@undefined
\let\contentsline\oldcontentsline
\let\newlabel\oldnewlabel
\fi}
\fi}
\global\let\hyper@last\relax 
\gdef\HyperFirstAtBeginDocument#1{#1}
\providecommand\HyField@AuxAddToFields[1]{}
\providecommand\HyField@AuxAddToCoFields[2]{}
\@writefile{toc}{\boolfalse {citerequest}\boolfalse {citetracker}\boolfalse {pagetracker}\boolfalse {backtracker}\relax }
\@writefile{lof}{\boolfalse {citerequest}\boolfalse {citetracker}\boolfalse {pagetracker}\boolfalse {backtracker}\relax }
\@writefile{lot}{\boolfalse {citerequest}\boolfalse {citetracker}\boolfalse {pagetracker}\boolfalse {backtracker}\relax }
\select@language{ngerman}
\@writefile{toc}{\defcounter {refsection}{0}\relax }\@writefile{toc}{\select@language{ngerman}}
\@writefile{lof}{\defcounter {refsection}{0}\relax }\@writefile{lof}{\select@language{ngerman}}
\@writefile{lot}{\defcounter {refsection}{0}\relax }\@writefile{lot}{\select@language{ngerman}}
\citation{griffith}
\@writefile{toc}{\contentsline {section}{\numberline {1}Einleitung}{1}{section.1}}
\newlabel{sec:einleitung}{{1}{1}{Einleitung}{section.1}{}}
\@writefile{toc}{\contentsline {section}{\numberline {2}Theorie}{1}{section.2}}
\newlabel{sec:theorie}{{2}{1}{Theorie}{section.2}{}}
\@writefile{toc}{\contentsline {subsection}{\numberline {2.1}Helmholtzspule}{1}{subsection.2.1}}
\newlabel{eq:B}{{1}{1}{Helmholtzspule}{equation.2.1}{}}
\@writefile{toc}{\contentsline {subsection}{\numberline {2.2}Fadenstrahlrohr}{1}{subsection.2.2}}
\@writefile{toc}{\contentsline {subsection}{\numberline {2.3}Lorentzkraft}{2}{subsection.2.3}}
\@writefile{toc}{\contentsline {subsection}{\numberline {2.4}Berechnung der spezifischen Elektronenladung}{2}{subsection.2.4}}
\citation{LP}
\citation{LP}
\newlabel{eq:v}{{9}{3}{Berechnung der spezifischen Elektronenladung}{equation.2.9}{}}
\newlabel{eq:evb}{{11}{3}{Berechnung der spezifischen Elektronenladung}{equation.2.11}{}}
\newlabel{eq:spe}{{12}{3}{Berechnung der spezifischen Elektronenladung}{equation.2.12}{}}
\@writefile{toc}{\contentsline {section}{\numberline {3}Durchf\IeC {\"u}hrung}{3}{section.3}}
\newlabel{sec:durchfuehrung}{{3}{3}{Durchführung}{section.3}{}}
\@writefile{lof}{\contentsline {figure}{\numberline {1}{\ignorespaces Bild des Versuchsaufbau mit Helmholtzspule, Gaskugel und der Elektronenkanone\cite {LP}\relax }}{4}{figure.caption.1}}
\providecommand*\caption@xref[2]{\@setref\relax\@undefined{#1}}
\newlabel{fig:aufb}{{1}{4}{Bild des Versuchsaufbau mit Helmholtzspule, Gaskugel und der Elektronenkanone\cite {LP}\relax }{figure.caption.1}{}}
\@writefile{toc}{\contentsline {section}{\numberline {4}Auswertung}{4}{section.4}}
\newlabel{sec:auswertung}{{4}{4}{Auswertung}{section.4}{}}
\newlabel{eq:radius}{{13}{4}{Auswertung}{equation.4.13}{}}
\newlabel{eq:fehlerradius}{{15}{5}{Auswertung}{equation.4.15}{}}
\newlabel{eq:fehlerspe}{{16}{5}{Auswertung}{equation.4.16}{}}
\@writefile{toc}{\contentsline {subsection}{\numberline {4.1}Konstanter Strom}{5}{subsection.4.1}}
\@writefile{lot}{\contentsline {table}{\numberline {1}{\ignorespaces Messreihe f\IeC {\"u}r einen konstanten Spulenstrom $I=580$\tmspace  +\thickmuskip {.2777em}mA.\relax }}{5}{table.caption.2}}
\newlabel{tab:messreihe1}{{1}{5}{Messreihe für einen konstanten Spulenstrom $I=580$\;mA.\relax }{table.caption.2}{}}
\citation{demtroeder2}
\@writefile{lot}{\contentsline {table}{\numberline {2}{\ignorespaces Messreihe f\IeC {\"u}r einen konstanten Spulenstrom $I=510$\tmspace  +\thickmuskip {.2777em}mA.\relax }}{6}{table.caption.3}}
\newlabel{tab:messreihe2}{{2}{6}{Messreihe für einen konstanten Spulenstrom $I=510$\;mA.\relax }{table.caption.3}{}}
\@writefile{toc}{\contentsline {subsection}{\numberline {4.2}Konstante Beschleunigungsspannung}{6}{subsection.4.2}}
\@writefile{lot}{\contentsline {table}{\numberline {3}{\ignorespaces Messreihe f\IeC {\"u}r eine konstante Beschleunigungsspannung von $U_B=240,5$\tmspace  +\thickmuskip {.2777em}V\relax }}{6}{table.caption.4}}
\newlabel{tab:messreihe3}{{3}{6}{Messreihe für eine konstante Beschleunigungsspannung von $U_B=240,5$\;V\relax }{table.caption.4}{}}
\@writefile{toc}{\contentsline {subsection}{\numberline {4.3}Auftragung der Endergebnisse}{6}{subsection.4.3}}
\@writefile{lot}{\contentsline {table}{\numberline {4}{\ignorespaces Messreihe f\IeC {\"u}r eine konstante Beschleunigungsspannung von $U_B=109,5$\tmspace  +\thickmuskip {.2777em}V\relax }}{7}{table.caption.5}}
\newlabel{tab:messreihe4}{{4}{7}{Messreihe für eine konstante Beschleunigungsspannung von $U_B=109,5$\;V\relax }{table.caption.5}{}}
\newlabel{literaturwert}{{17}{7}{Auftragung der Endergebnisse}{equation.4.17}{}}
\@writefile{toc}{\contentsline {subsection}{\numberline {4.4}Berechnung des Magnetfeldes}{7}{subsection.4.4}}
\newlabel{eq:bprax}{{18}{7}{Berechnung des Magnetfeldes}{equation.4.18}{}}
\newlabel{eq:btheo}{{19}{7}{Berechnung des Magnetfeldes}{equation.4.19}{}}
\@writefile{lof}{\contentsline {figure}{\numberline {2}{\ignorespaces Auftragung der gemessenen spezifischen Elektronenladungen $\nicefrac  {e}{m_e}$ in Abh\IeC {\"a}ngigkeit von den Radien des Elektronenstrahls. In braun ist der Literaturwert von $\left (\frac  {e}{m_e}\right )_{lit}=1.7588\cdot 10^{11}$\tmspace  +\thickmuskip {.2777em}C\tmspace  +\thickmuskip {.2777em}kg$^{-1}$ aufgetragen.\relax }}{8}{figure.caption.6}}
\newlabel{fig:fehlerplot}{{2}{8}{Auftragung der gemessenen spezifischen Elektronenladungen $\nicefrac {e}{m_e}$ in Abhängigkeit von den Radien des Elektronenstrahls. In braun ist der Literaturwert von $\left (\frac {e}{m_e}\right )_{lit}=1.7588\cdot 10^{11}$\;C\;kg$^{-1}$ aufgetragen.\relax }{figure.caption.6}{}}
\@writefile{toc}{\contentsline {section}{\numberline {5}Diskussion}{8}{section.5}}
\newlabel{sec:diskussion}{{5}{8}{Diskussion}{section.5}{}}
\@writefile{toc}{\contentsline {section}{Literatur}{10}{section*.7}}
