\boolfalse {citerequest}\boolfalse {citetracker}\boolfalse {pagetracker}\boolfalse {backtracker}\relax 
\defcounter {refsection}{0}\relax 
\select@language {ngerman}
\contentsline {section}{\numberline {1}Einleitung}{1}{section.1}
\contentsline {section}{\numberline {2}Theorie}{1}{section.2}
\contentsline {section}{\numberline {3}Durchf\"uhrung}{1}{section.3}
\contentsline {section}{\numberline {4}Auswertung}{1}{section.4}
\contentsline {subsection}{\numberline {4.1}Konstanter Strom}{1}{subsection.4.1}
\contentsline {section}{\numberline {5}Diskussion}{1}{section.5}
\contentsline {section}{Literatur}{3}{section*.6}
