\relax 
\providecommand\hyper@newdestlabel[2]{}
\catcode `"\active 
\providecommand\HyperFirstAtBeginDocument{\AtBeginDocument}
\HyperFirstAtBeginDocument{\ifx\hyper@anchor\@undefined
\global\let\oldcontentsline\contentsline
\gdef\contentsline#1#2#3#4{\oldcontentsline{#1}{#2}{#3}}
\global\let\oldnewlabel\newlabel
\gdef\newlabel#1#2{\newlabelxx{#1}#2}
\gdef\newlabelxx#1#2#3#4#5#6{\oldnewlabel{#1}{{#2}{#3}}}
\AtEndDocument{\ifx\hyper@anchor\@undefined
\let\contentsline\oldcontentsline
\let\newlabel\oldnewlabel
\fi}
\fi}
\global\let\hyper@last\relax 
\gdef\HyperFirstAtBeginDocument#1{#1}
\providecommand\HyField@AuxAddToFields[1]{}
\providecommand\HyField@AuxAddToCoFields[2]{}
\bibstyle{biblatex}
\bibdata{protokoll-blx,lit}
\citation{biblatex-control}
\@writefile{toc}{\boolfalse {citerequest}\boolfalse {citetracker}\boolfalse {pagetracker}\boolfalse {backtracker}\relax }
\@writefile{lof}{\boolfalse {citerequest}\boolfalse {citetracker}\boolfalse {pagetracker}\boolfalse {backtracker}\relax }
\@writefile{lot}{\boolfalse {citerequest}\boolfalse {citetracker}\boolfalse {pagetracker}\boolfalse {backtracker}\relax }
\select@language{ngerman}
\@writefile{toc}{\defcounter {refsection}{0}\relax }\@writefile{toc}{\select@language{ngerman}}
\@writefile{lof}{\defcounter {refsection}{0}\relax }\@writefile{lof}{\select@language{ngerman}}
\@writefile{lot}{\defcounter {refsection}{0}\relax }\@writefile{lot}{\select@language{ngerman}}
\@writefile{toc}{\contentsline {section}{\numberline {1}Einleitung}{1}{section.1}}
\newlabel{sec:einleitung}{{1}{1}{Einleitung}{section.1}{}}
\@writefile{toc}{\contentsline {section}{\numberline {2}Theorie}{1}{section.2}}
\newlabel{sec:theorie}{{2}{1}{Theorie}{section.2}{}}
\@writefile{toc}{\contentsline {section}{\numberline {3}Durchf\"uhrung}{1}{section.3}}
\newlabel{sec:durchfuehrung}{{3}{1}{Durchf\"uhrung}{section.3}{}}
\@writefile{toc}{\contentsline {section}{\numberline {4}Auswertung}{1}{section.4}}
\newlabel{sec:auswertung}{{4}{1}{Auswertung}{section.4}{}}
\newlabel{eq:radius}{{1}{1}{Auswertung}{equation.4.1}{}}
\newlabel{eq:fehlerradius}{{3}{1}{Auswertung}{equation.4.3}{}}
\newlabel{eq:fehlerspe}{{4}{1}{Auswertung}{equation.4.4}{}}
\@writefile{toc}{\contentsline {subsection}{\numberline {4.1}Konstanter Strom}{1}{subsection.4.1}}
\@writefile{toc}{\contentsline {section}{\numberline {5}Diskussion}{1}{section.5}}
\newlabel{sec:diskussion}{{5}{1}{Diskussion}{section.5}{}}
\@writefile{lot}{\contentsline {table}{\numberline {1}{\ignorespaces Messreihe f\IeC {\"u}r einen konstanten Spulenstrom $I=580$\tmspace  +\thickmuskip {.2777em}mA.\relax }}{2}{table.caption.1}}
\providecommand*\caption@xref[2]{\@setref\relax\@undefined{#1}}
\newlabel{tab:messreihe1}{{1}{2}{Messreihe für einen konstanten Spulenstrom $I=580$\;mA.\relax }{table.caption.1}{}}
\@writefile{lot}{\contentsline {table}{\numberline {2}{\ignorespaces Messreihe f\IeC {\"u}r einen konstanten Spulenstrom $I=510$\tmspace  +\thickmuskip {.2777em}mA.\relax }}{2}{table.caption.2}}
\newlabel{tab:messreihe2}{{2}{2}{Messreihe für einen konstanten Spulenstrom $I=510$\;mA.\relax }{table.caption.2}{}}
\@writefile{lot}{\contentsline {table}{\numberline {3}{\ignorespaces Messreihe f\IeC {\"u}r eine konstante Beschleunigungsspannung von $U_B=240,5$\tmspace  +\thickmuskip {.2777em}V\relax }}{2}{table.caption.3}}
\newlabel{tab:messreihe3}{{3}{2}{Messreihe für eine konstante Beschleunigungsspannung von $U_B=240,5$\;V\relax }{table.caption.3}{}}
\citation{*}
\@writefile{lot}{\contentsline {table}{\numberline {4}{\ignorespaces Messreihe f\IeC {\"u}r eine konstante Beschleunigungsspannung von $U_B=109,5$\tmspace  +\thickmuskip {.2777em}V\relax }}{3}{table.caption.4}}
\newlabel{tab:messreihe4}{{4}{3}{Messreihe für eine konstante Beschleunigungsspannung von $U_B=109,5$\;V\relax }{table.caption.4}{}}
\@writefile{lof}{\contentsline {figure}{\numberline {1}{\ignorespaces Auftragung der gemessenen spezifischen Elektronenladungen $\nicefrac  {e}{m_e}$ in Abh\IeC {\"a}ngigkeit von den Radien des Elektronenstrahls.\relax }}{3}{figure.caption.5}}
\newlabel{fig:fehlerplot}{{1}{3}{Auftragung der gemessenen spezifischen Elektronenladungen $\nicefrac {e}{m_e}$ in Abhängigkeit von den Radien des Elektronenstrahls.\relax }{figure.caption.5}{}}
\@writefile{toc}{\contentsline {section}{Literatur}{3}{section*.6}}
