function value,$v^0_1$,$v^0_2$,$v^0_p$
0.753141660843013,0.47945912261045587,4.900374296196336,2.7546064415213167
0.1562443008123957,0.47945912261045587,4.900374296196336,4.5718102396217315
0.1438143254136357,0.47945912261045587,5.9952532118378645,4.5718102396217315
0.11541575686124805,0.5670920569539093,5.9952532118378645,4.5718102396217315
0.11753018204259491,0.5670920569539093,5.9952532118378645,4.5718102396217315
0.15368491381004745,0.5670920569539093,5.9952532118378645,4.5718102396217315
0.16252926408291768,0.5670920569539093,5.9952532118378645,4.5718102396217315
0.09453994657027942,0.5670920569539093,5.9952532118378645,4.413403713365243
0.10507084089707142,0.5670920569539093,5.9952532118378645,4.413403713365243
0.1011526196856185,0.5420631043820654,5.9952532118378645,4.413403713365243
0.1114523094942681,0.5420631043820654,5.9952532118378645,4.413403713365243
0.06336999636312468,0.5420631043820654,0.6518762247833405,4.413403713365243
0.06416947134531426,0.5420631043820654,0.6518762247833405,4.413403713365243
0.03272950432220956,0.5420631043820654,0.6518762247833405,2.164949172517872
0.053883650886761836,0.5420631043820654,0.6518762247833405,2.164949172517872
-0.010277384880650331,0.7231928503064813,0.6518762247833405,2.164949172517872
