function value,$v^0_1$,$v^0_2$,$v^0_p$
0.2002985312448372,3.460765288681906,4.449423994385292,1.8278083813267254
0.048470870652336684,3.460765288681906,4.449423994385292,1.3874355354065353
0.2738435858965962,3.460765288681906,4.449423994385292,1.3874355354065353
0.35269751944627337,3.460765288681906,4.449423994385292,1.3874355354065353
0.30862501636077244,3.460765288681906,4.449423994385292,4.8901965160042895
0.4088176959555829,3.460765288681906,4.449423994385292,4.8901965160042895
0.06293428055165606,4.044188299507672,4.449423994385292,4.8901965160042895
0.39559568642178533,4.044188299507672,4.449423994385292,4.8901965160042895
0.18975953693796632,4.044188299507672,2.404836844608522,4.8901965160042895
0.001920521416900134,2.540638588924902,2.404836844608522,4.8901965160042895
0.10022312839250946,2.540638588924902,2.404836844608522,4.8901965160042895
0.01586459349473357,2.540638588924902,2.3154143979660824,4.8901965160042895
0.3345050989855811,2.540638588924902,2.3154143979660824,4.8901965160042895
0.13730199638345386,2.540638588924902,2.3154143979660824,1.0454595745197737
-0.05346799396237778,2.540638588924902,2.8999376669745875,1.0454595745197737
0.25846122899354873,2.540638588924902,2.8999376669745875,1.0454595745197737
0.21344008658653546,2.540638588924902,2.8999376669745875,5.108820699736133
-0.004621477228381687,2.540638588924902,2.364217849664452,5.108820699736133
0.32863718383774354,2.540638588924902,2.364217849664452,5.108820699736133
0.20464687432775786,2.540638588924902,2.364217849664452,1.7517884442444271
0.1100297459259254,2.540638588924902,4.420570720993218,1.7517884442444271
0.6649804904044139,2.540638588924902,4.420570720993218,1.7517884442444271
0.007182126043548287,2.540638588924902,4.420570720993218,1.2163318907939076
-0.025704573340588288,2.540638588924902,3.6828490766963213,1.2163318907939076
0.31618917966226745,2.540638588924902,3.6828490766963213,1.2163318907939076
0.3358583610436011,2.540638588924902,3.6828490766963213,1.2163318907939076
0.26320693532151895,2.540638588924902,4.217980035899689,1.2163318907939076
-0.16781821450189094,2.2292230752511557,4.217980035899689,1.2163318907939076
0.2638843774207641,2.2292230752511557,4.217980035899689,1.2163318907939076
0.12418064948838059,2.2292230752511557,4.537049021792185,1.2163318907939076
0.45206381218335356,2.2292230752511557,4.537049021792185,1.2163318907939076
0.3625526651928661,2.2292230752511557,4.537049021792185,5.124543507386934
0.42684083510310356,2.2292230752511557,4.537049021792185,5.124543507386934
0.22301504470502176,2.3260292506620033,4.537049021792185,5.124543507386934
0.08865081518593665,2.3260292506620033,4.537049021792185,0.004221587056500553
0.089485952335712,2.3260292506620033,4.537049021792185,0.004221587056500553
0.11549182219275211,2.3260292506620033,4.537049021792185,0.004221587056500553
0.35191621960906594,2.3260292506620033,4.537049021792185,0.004221587056500553
-0.04754587548741818,2.3260292506620033,3.989459190266598,0.004221587056500553
-0.11728009122950911,2.2599788224818487,3.989459190266598,0.004221587056500553
-0.2287566615509109,2.2599788224818487,3.989459190266598,5.745652821467351
-0.009102971480703714,2.2599788224818487,3.989459190266598,5.745652821467351
0.3654406345468503,2.2599788224818487,3.989459190266598,5.745652821467351
-0.04433383617134956,2.2599788224818487,3.989459190266598,1.3007529592049387
0.36069762527050686,2.2599788224818487,3.989459190266598,1.3007529592049387
0.03813089072150955,3.935358343523506,3.989459190266598,1.3007529592049387
0.48488160566077565,3.935358343523506,3.989459190266598,1.3007529592049387
0.2611262632027689,3.935358343523506,1.0779671939577993,1.3007529592049387
-0.0995089414087671,4.16215256521505,1.0779671939577993,1.3007529592049387
0.19979142089962942,4.16215256521505,1.0779671939577993,1.3007529592049387
0.3609588310861498,4.16215256521505,1.0779671939577993,1.3007529592049387
0.09802179578194314,3.8594411996926534,1.0779671939577993,1.3007529592049387
0.39164251801264416,3.8594411996926534,1.0779671939577993,1.3007529592049387
0.11948183798423462,3.8594411996926534,6.2071574898129676,1.3007529592049387
0.38789426086699397,3.8594411996926534,6.2071574898129676,1.3007529592049387
0.15494282775383017,3.8594411996926534,6.2071574898129676,5.352770837338486
-0.22902918723288268,3.8594411996926534,0.7768935652466746,5.352770837338486
0.21852110480873355,3.8594411996926534,0.7768935652466746,5.352770837338486
0.43446920994105853,3.8594411996926534,0.7768935652466746,5.352770837338486
0.5519374232660771,3.8594411996926534,0.7768935652466746,5.352770837338486
0.0764132223901931,3.8529992349755733,0.7768935652466746,5.352770837338486
0.09513649832231508,3.8529992349755733,0.7768935652466746,5.352770837338486
0.018150798542423963,3.8529992349755733,5.8523437592218155,5.352770837338486
-0.006271017296259673,3.2107132525013418,5.8523437592218155,5.352770837338486
0.005378938648286646,3.2107132525013418,5.8523437592218155,5.352770837338486
0.35118142785114526,3.2107132525013418,5.8523437592218155,5.352770837338486
0.3096134886240147,3.5641576250554152,5.8523437592218155,5.352770837338486
0.299921258932626,3.5641576250554152,5.8523437592218155,1.619217963341482
0.1715777379994481,3.5641576250554152,4.256645454286933,1.619217963341482
-0.0814715134400178,6.0119324715016,4.256645454286933,1.619217963341482
0.13757450250026915,6.0119324715016,4.256645454286933,1.619217963341482
0.3104050840582293,6.0119324715016,4.256645454286933,1.619217963341482
0.28241016041968214,3.9836154296548267,4.256645454286933,1.619217963341482
0.27762771639513595,3.9836154296548267,4.256645454286933,4.507699938201359
0.5445826609474617,3.9836154296548267,4.256645454286933,4.507699938201359
-0.05522306216300088,5.187547691026046,4.256645454286933,4.507699938201359
