function value,$v^0_1$,$v^0_2$,$v^0_p$
1.1108782774138288,6.076027676094974,3.4383616276357367,6.111556079054741
0.11511735594637407,6.076027676094974,3.4383616276357367,4.396057096886935
0.11459718932935614,6.076027676094974,3.7448963944552403,4.396057096886935
0.061429835250314424,5.5245307255431655,3.7448963944552403,4.396057096886935
0.01160983157985973,5.5245307255431655,3.7448963944552403,3.9133580448770844
0.004516025122237144,5.5245307255431655,3.9307321196290594,3.9133580448770844
0.000922453910953247,5.487080999283418,3.9307321196290594,3.9133580448770844
-0.0013903192296467193,5.487080999283418,3.9307321196290594,3.8516622553938955
0.0023749552659031448,5.487080999283418,3.9307321196290594,3.8516622553938955
-0.0008079857889431441,5.488134874418961,3.9307321196290594,3.8516622553938955
-0.0001749411743199314,5.488134874418961,3.9307321196290594,3.8516622553938955
-0.0007855980262211348,5.488134874418961,3.947689751038592,3.8516622553938955
-0.00020432541040293906,5.488134874418961,3.947689751038592,3.8516622553938955
-0.0005403078647820969,5.488134874418961,3.947689751038592,2.4302375259264464
0.001227159843809833,5.488134874418961,3.947689751038592,2.4302375259264464
-0.0023832138374746403,5.487454855196282,3.947689751038592,2.4302375259264464
0.00218056232915409,5.487454855196282,3.947689751038592,2.4302375259264464
0.001760228937572772,5.487454855196282,3.949964570912916,2.4302375259264464
0.0008905191594752448,5.481848678947485,3.949964570912916,2.4302375259264464
0.000702751035638105,5.481848678947485,3.949964570912916,2.433321760095637
-0.001078455341473994,5.481848678947485,3.9524631533329395,2.433321760095637
0.00042715942713666966,5.481848678947485,3.9524631533329395,2.433321760095637
-0.000263229380022989,5.481848678947485,3.9524631533329395,3.849910961995712
0.000295032142668461,5.481848678947485,3.9524631533329395,3.849910961995712
0.00345103943397429,5.481848678947485,3.9524631533329395,3.849910961995712
0.0017692259042526581,5.481848678947485,3.9524631533329395,3.843588785018009
8.820641722351308e-05,5.481848678947485,3.950670860784396,3.843588785018009
-0.0030104488660780415,5.482327341083809,3.950670860784396,3.843588785018009
0.001999733762695133,5.482327341083809,3.950670860784396,3.843588785018009
0.0020454693247903277,5.482327341083809,3.950670860784396,3.843588785018009
-0.0025687329314781904,5.484398466693474,3.950670860784396,3.843588785018009
-0.0005750276160775281,5.484398466693474,3.950670860784396,3.843588785018009
-0.001652005040558291,5.484398466693474,3.955018485074407,3.843588785018009
-0.0005252005624457601,5.484398466693474,3.955018485074407,3.843588785018009
-0.00030738932970819643,5.484398466693474,3.955018485074407,3.843588785018009
-0.00012260169423639056,5.484398466693474,3.955018485074407,3.843588785018009
-0.001135127886572107,5.481807945731021,3.955018485074407,3.843588785018009
0.0012910385551774262,5.481807945731021,3.955018485074407,3.843588785018009
0.00054425634612143,5.481807945731021,3.9555936275368317,3.843588785018009
-0.00021286931591879554,5.483030507312046,3.9555936275368317,3.843588785018009
-0.0039911978506809165,5.483030507312046,3.9555936275368317,3.8440005091811957
0.001277858051016878,5.483030507312046,3.9555936275368317,3.8440005091811957
0.0005115492717988612,5.483972405234658,3.9555936275368317,3.8440005091811957
-0.0002701567703938812,5.483972405234658,3.9555936275368317,3.8409710466839924
-0.0019386503845326697,5.483972405234658,3.9516225289893026,3.8409710466839924
0.002310852110716799,5.483972405234658,3.9516225289893026,3.8409710466839924
0.0004858359830027803,5.483972405234658,3.9516225289893026,3.8565513976893713
-0.0004501975649433554,5.483972405234658,3.9538967259165743,3.8565513976893713
-0.0030165324858040243,5.4820930389468785,3.9538967259165743,3.8565513976893713
2.747980919615145e-05,5.4820930389468785,3.9538967259165743,3.8565513976893713
-0.0026814753179138506,5.4820930389468785,3.9511293529153457,3.8565513976893713
0.00354404245021378,5.4820930389468785,3.9511293529153457,3.8565513976893713
0.002375580889121487,5.4820930389468785,3.9511293529153457,3.8462782442463217
0.0027682987396656644,5.4820930389468785,3.9511293529153457,3.8462782442463217
-0.0011118436043374702,5.483990364749642,3.9511293529153457,3.8462782442463217
-0.0016560000160861232,5.483990364749642,3.9511293529153457,3.8326337435147897
0.0009655723148069839,5.483990364749642,3.9511293529153457,3.8326337435147897
-0.00018677543482559233,5.483364987520691,3.9511293529153457,3.8326337435147897
0.0016294561288622278,5.483364987520691,3.9511293529153457,3.8326337435147897
9.093106281832242e-05,5.483364987520691,3.9469646364657747,3.8326337435147897
0.0018957106166255233,5.483364987520691,3.9469646364657747,3.8326337435147897
0.000985965825396673,5.483364987520691,3.9469646364657747,2.4320061172338887
-0.000568344320724723,5.483364987520691,3.9550211944503126,2.4320061172338887
0.00031239081578504635,5.483364987520691,3.9550211944503126,2.4320061172338887
-0.0008246044083835002,5.483364987520691,3.9550211944503126,2.4300268988709455
0.0010570684255488683,5.483364987520691,3.9550211944503126,2.4300268988709455
0.0011091037856706398,5.483364987520691,3.9550211944503126,2.4300268988709455
0.00014332210315970428,5.483364987520691,3.9550211944503126,3.847871494088073
0.0004834838423726229,5.483364987520691,3.9550211944503126,3.847871494088073
0.0005406879937406295,5.483364987520691,3.9550211944503126,3.847871494088073
0.0017211513371035991,5.483364987520691,3.9550211944503126,3.847871494088073
-0.0027600044152720216,5.483364987520691,3.9467142777996447,3.847871494088073
-0.00041351568537617567,5.483364987520691,3.9467142777996447,3.847871494088073
-0.00021377617352968947,5.483364987520691,3.9467142777996447,3.847871494088073
0.0011882176888424745,5.483364987520691,3.9467142777996447,3.847871494088073
0.0028489172053185463,5.483364987520691,3.9467142777996447,3.847871494088073
