function value,$v^0_1$,$v^0_2$,$v^0_p$
0.3968526705717834,5.610005784868826,2.0858906349486963,5.159934759824945
0.16007139855984853,5.610005784868826,2.0858906349486963,1.6952171462075425
0.12117795095903683,5.610005784868826,3.9188303433840583,1.6952171462075425
0.12051956564111355,5.487019556225193,3.9188303433840583,1.6952171462075425
0.00031677318343503735,5.487019556225193,3.9188303433840583,3.8458665341837794
7.835185976801107e-06,5.487019556225193,3.9491182022745175,3.8458665341837794
1.233838217817862e-06,5.484062203022539,3.9491182022745175,3.8458665341837794
6.957315186184587e-07,5.484062203022539,3.9491182022745175,3.843777418630261
6.591467505145943e-08,5.484062203022539,3.95047665215437,3.843777418630261
6.255747697636593e-09,5.483781426983638,3.95047665215437,3.843777418630261
6.230423399422591e-09,5.483781426983638,3.95047665215437,2.4394222382480075
5.891245269395995e-10,5.483781426983638,3.950605177708654,2.4394222382480075
5.581701767454206e-11,5.483754879843791,3.950605177708654,2.4394222382480075
