function value,$v^0_1$,$v^0_2$,$v^0_p$
0.9500865876971498,5.4879187904801805,6.0855204620424574,5.461310364152818
0.17039289956542847,5.4879187904801805,6.0855204620424574,4.681827047254721
0.1583510728963775,5.4879187904801805,3.9396474668658508,4.681827047254721
0.15835097054668468,5.484301071702346,3.9396474668658508,4.681827047254721
3.931915482147108e-05,5.484301071702346,3.9396474668658508,3.8440785908327766
2.1858587573309052e-07,5.484301071702346,3.950366538820359,3.8440785908327766
3.1822441792783707e-08,5.483804185630559,3.950366538820359,3.8440785908327766
1.964532492237936e-08,5.483804185630559,3.950366538820359,3.843763985338164
1.8587460459684735e-09,5.483804185630559,3.9505947606229874,3.843763985338164
1.7612877822870132e-10,5.483757031370346,3.9505947606229874,3.843763985338164
1.7570711552394869e-10,5.483757031370346,3.9505947606229874,2.4394231727674582
1.661104587213913e-11,5.483757031370346,3.9506163439270914,2.4394231727674582
