function value,$v^0_1$,$v^0_2$,$v^0_p$
1.0945459623087248,6.076027676094974,3.4383616276357367,6.111556079054741
0.0759341806779058,6.076027676094974,3.4383616276357367,1.917495327455527
0.195864661916625,6.076027676094974,3.4383616276357367,1.917495327455527
0.0987849542150796,5.546966564889871,3.4383616276357367,1.917495327455527
0.04459100661094839,5.546966564889871,3.4383616276357367,2.183206801165898
0.011315803577941819,5.546966564889871,3.8849467164642166,2.183206801165898
0.025321120801411134,5.546966564889871,3.8849467164642166,2.183206801165898
0.03350788477528999,5.546966564889871,3.8849467164642166,2.183206801165898
0.03146666039529755,5.546966564889871,3.9160935776189776,2.183206801165898
0.02468469543711027,5.4476285001504525,3.9160935776189776,2.183206801165898
0.008511527698122134,5.4476285001504525,3.9160935776189776,2.4383785425486733
-0.014854194445044655,5.4476285001504525,3.95847868711662,2.4383785425486733
-0.010426968993502483,5.4476285001504525,3.95847868711662,2.4383785425486733
-0.032318407844070585,5.4476285001504525,3.95847868711662,3.8715082559313796
-0.007611728134464424,5.4476285001504525,3.95847868711662,3.8715082559313796
-0.0042573244577834846,5.4476285001504525,3.95847868711662,3.8715082559313796
0.007707248719959425,5.4476285001504525,3.95847868711662,3.8715082559313796
-0.012495871588095175,5.4476285001504525,3.9887889352697052,3.8715082559313796
0.005618622453975597,5.4476285001504525,3.9887889352697052,3.8715082559313796
0.008942061724265038,5.4476285001504525,3.9887889352697052,3.8715082559313796
-0.0069913203248784805,5.4476285001504525,3.957397968394604,3.8715082559313796
0.009429413038791634,5.4476285001504525,3.957397968394604,3.8715082559313796
0.012559514880412848,5.4476285001504525,3.957397968394604,3.8715082559313796
0.012450924779819017,5.4476285001504525,3.9537234721029435,3.8715082559313796
0.012486508042970135,5.4476285001504525,3.9537234721029435,3.8715082559313796
0.02147462697322111,5.4476285001504525,3.9537234721029435,3.8715082559313796
-0.014659675351734514,5.4476285001504525,3.9715924714089925,3.8715082559313796
-0.022712460640523457,5.4589126504896335,3.9715924714089925,3.8715082559313796
-0.010759262812110593,5.4589126504896335,3.9715924714089925,3.8715082559313796
-0.005191657063141619,5.4589126504896335,3.9715924714089925,3.8715082559313796
-0.0228090822328032,5.490215033867507,3.9715924714089925,3.8715082559313796
0.00955219519218331,5.490215033867507,3.9715924714089925,3.8715082559313796
0.011546922721808128,5.490215033867507,3.9715924714089925,3.8715082559313796
-0.010179610367415992,5.498364984263164,3.9715924714089925,3.8715082559313796
0.006183150835274098,5.498364984263164,3.9715924714089925,3.8715082559313796
0.022859541362413527,5.498364984263164,3.9715924714089925,3.8715082559313796
0.011798902455649074,5.449096285428919,3.9715924714089925,3.8715082559313796
-0.036124720932116716,5.449096285428919,3.9715924714089925,3.8481247230496654
0.01950644941827151,5.449096285428919,3.9715924714089925,3.8481247230496654
-0.004831540114251798,5.4886681227606475,3.9715924714089925,3.8481247230496654
0.017409317979943717,5.4886681227606475,3.9715924714089925,3.8481247230496654
0.016823493707193382,5.4886681227606475,3.926364354301728,3.8481247230496654
-0.0005116741557765758,5.466256884538156,3.926364354301728,3.8481247230496654
-0.0014799208092926008,5.466256884538156,3.926364354301728,2.409223046739207
-0.005409008281596184,5.466256884538156,3.94763448186256,2.409223046739207
0.026869780194605508,5.466256884538156,3.94763448186256,2.409223046739207
0.03519557200442436,5.466256884538156,3.94763448186256,2.409223046739207
0.010911884461846322,5.466256884538156,3.963331166734168,2.409223046739207
-0.006845043915742144,5.473340333973841,3.963331166734168,2.409223046739207
0.014146114500788398,5.473340333973841,3.963331166734168,2.409223046739207
0.013319322965770874,5.473340333973841,3.9714474295863464,2.409223046739207
0.016432012105000005,5.473340333973841,3.9714474295863464,2.409223046739207
-0.017199066159382936,5.473340333973841,3.9714474295863464,3.813660141752486
0.013115659684316272,5.473340333973841,3.9714474295863464,3.813660141752486
0.018884145039079314,5.473340333973841,3.9714474295863464,3.813660141752486
0.01366029744954167,5.473340333973841,3.9714474295863464,2.48619328116987
0.00987005724819734,5.473340333973841,3.986973724848425,2.48619328116987
0.0060161984817482805,5.475422314048483,3.986973724848425,2.48619328116987
0.0023988884260486287,5.475422314048483,3.986973724848425,3.8022457907687244
0.005492445268437951,5.475422314048483,3.986973724848425,3.8022457907687244
-0.0004933169409148119,5.465887815430543,3.986973724848425,3.8022457907687244
0.020179386200256944,5.465887815430543,3.986973724848425,3.8022457907687244
0.0019446773359648173,5.465887815430543,3.9766610376353366,3.8022457907687244
0.013682093464559508,5.465887815430543,3.9766610376353366,3.8022457907687244
-0.008501210707931861,5.465887815430543,3.9766610376353366,2.341804749679495
0.010011994740040109,5.465887815430543,3.9766610376353366,2.341804749679495
0.0014572752052068871,5.445469862482653,3.9766610376353366,2.341804749679495
-0.0029928624591097908,5.445469862482653,3.9766610376353366,3.866633635400971
0.017344515679577732,5.445469862482653,3.9766610376353366,3.866633635400971
-0.01734261849943164,5.4814548805511905,3.9766610376353366,3.866633635400971
-0.005220459191630944,5.4814548805511905,3.9766610376353366,3.866633635400971
-0.004740049185944506,5.4814548805511905,3.9766610376353366,3.866633635400971
0.007727202209948714,5.4814548805511905,3.9766610376353366,3.866633635400971
-0.01574768107643021,5.4814548805511905,3.9766610376353366,2.3366553150875324
0.007766997204137982,5.4814548805511905,3.9766610376353366,2.3366553150875324
-0.02091663556770229,5.491970606386093,3.9766610376353366,2.3366553150875324
