{"displaycolor": {"U"    : ["#A0D7E4", "#000000"],
                    "U'"    : ["#A0D7E4", "#000000"],
                    "U_dg"    : ["#A0D7E4", "#000000"],
                    "U'_dg"    : ["#A0D7E4", "#000000"],
                    "W"  : ["#bbbbaa", "#000000"],
                    "W_odd"  : ["#bbbbaa", "#000000"],
                    "W_odd^2"  : ["#bbbbaa", "#000000"],
                    "W_odd2"  : ["#bbbbaa", "#000000"],
                    "W_even"  : ["#bbbbaa", "#000000"],
                    "L"  : ["#B0FFB0", "#000000"],
                    "R"  : ["#FA8381", "#000000"],
                    "U^*"    : ["#A0D7E4", "#000000"],
                    "U'^*"    : ["#A0D7E4", "#000000"],
                    "U_dg^*"    : ["#A0D7E4", "#000000"],
                    "U'_dg^*"    : ["#A0D7E4", "#000000"],
                    "U^*_dg"    : ["#A0D7E4", "#000000"],
                    "U'^*_dg"    : ["#A0D7E4", "#000000"],
                    "W^*"  : ["#bbbbaa", "#000000"],
                    "L^*"  : ["#B0FFB0", "#000000"],
                    "R^*"  : ["#FF8381", "#000000"],
                    "V"  : ["#FA6361", "#000000"],
                    "...  ..."  : ["#FFFFFF", "#000000"],
                    "Id" : ["#6FA4FF", "#000000"],
                    "U_O" : ["#F37626", "#000000"],
                    "A" : ["#FFF023", "#000000"],
                    "A_dg" : ["#FFF023", "#000000"],
                    "B" : ["#FFF023", "#000000"]
                },
"displaytext": {"U_dg": "U^\\dagger", "U'_dg":"U'^\\dagger", "R^*":"R^*", "L^*": "L^*", "U^*":"U^*", "U'^*_dg":"U'^{T}", "W^*":"W^*", "W_odd":"W_{odd}", "W_odd2":"W_{odd}^{1/2}", "W_odd^2":"W_{odd}^2", "W_even":"W_{even}", "A_dg": "A^\\dagger", "U_O": "U_\\hat{O}"},
"fontsize": 13,
"subfontsize": 0,
"subtextcolor": "#999999",
"usepiformat": true,
"latexdrawerstyle":true
}
