function value,$v^0_1$,$v^0_2$,$v^0_p$
0.6949208882916688,3.448296944257913,4.493667318642264,3.787273988239316
0.5394149598366117,3.448296944257913,4.493667318642264,5.1847509726174
0.19148402908421236,3.448296944257913,1.2439858905514654,5.1847509726174
0.06265417682513863,4.012106983250123,1.2439858905514654,5.1847509726174
0.23253866344151453,4.012106983250123,1.2439858905514654,5.1847509726174
-0.06981869944877728,4.012106983250123,0.9821850606547495,5.1847509726174
