function value,$v^0_1$,$v^0_2$,$v^0_p$
1.1072727841685324,6.076027676094974,3.4383616276357367,6.111556079054741
0.11159361053046046,6.076027676094974,3.4383616276357367,1.8871368228627579
0.11965064935701841,6.076027676094974,3.4383616276357367,1.8871368228627579
0.0787958028464174,5.58777091738842,3.4383616276357367,1.8871368228627579
0.04982664394051195,5.58777091738842,3.4383616276357367,2.1832792576122126
0.014964508958918876,5.58777091738842,3.9023574240689998,2.1832792576122126
0.012302695234804872,5.4924027142541805,3.9023574240689998,2.1832792576122126
0.003656239809479045,5.4924027142541805,3.9023574240689998,3.852422190804034
0.001636405760802151,5.4924027142541805,3.945868959987056,3.852422190804034
0.0011849003890503917,5.482483382699704,3.945868959987056,3.852422190804034
0.0006805287162900964,5.482483382699704,3.945868959987056,2.440357357719022
-0.0015723614648391893,5.482483382699704,3.9502906465302816,2.440357357719022
