function value,$v^0_1$,$v^0_2$,$v^0_p$
0.36977397042497806,2.620226532717789,4.525932273597346,0.0007186381718527407
-0.07430648213582447,2.620226532717789,4.525932273597346,5.430727940922077
-0.017812435917947234,2.620226532717789,4.525932273597346,5.430727940922077
0.06785274209904113,2.620226532717789,4.525932273597346,5.430727940922077
-0.07951247583441379,2.620226532717789,4.525932273597346,1.1910455817446541
0.3615788346200741,2.620226532717789,4.525932273597346,1.1910455817446541
-0.2569504437177159,3.44154814141875,4.525932273597346,1.1910455817446541
0.2090588909642257,3.44154814141875,4.525932273597346,1.1910455817446541
-0.06556671130818303,3.44154814141875,3.805650342697917,1.1910455817446541
0.5963969037485409,3.44154814141875,3.805650342697917,1.1910455817446541
0.09164691302148964,3.44154814141875,3.805650342697917,4.586936744906184
0.4043641236999924,3.44154814141875,3.805650342697917,4.586936744906184
0.0776759367132065,6.150304704751023,3.805650342697917,4.586936744906184
0.2568345474208321,6.150304704751023,3.805650342697917,4.586936744906184
0.32532565433423755,6.150304704751023,3.805650342697917,4.586936744906184
0.2820759070893126,4.464241608833999,3.805650342697917,4.586936744906184
0.2737978146311305,4.464241608833999,3.805650342697917,1.713514351941311
0.4592636915877264,4.464241608833999,3.805650342697917,1.713514351941311
0.15361227930194288,5.576495904641728,3.805650342697917,1.713514351941311
-0.26501958828806615,5.576495904641728,3.805650342697917,4.231824930754852
-0.13872358071584434,5.576495904641728,3.805650342697917,4.231824930754852
0.25703000134370346,5.576495904641728,3.805650342697917,4.231824930754852
-0.23034754830095616,5.576495904641728,3.805650342697917,2.8343016354260095
0.09306349998685948,5.576495904641728,3.805650342697917,2.8343016354260095
0.06059659537937989,5.476840745094979,3.805650342697917,2.8343016354260095
-0.04519794475175365,5.476840745094979,3.805650342697917,2.7270839653094874
0.6248012021812842,5.476840745094979,3.805650342697917,2.7270839653094874
0.13521350822621825,5.658681077216966,3.805650342697917,2.7270839653094874
0.000723912157851947,5.658681077216966,3.805650342697917,4.458362392245727
-0.11914189236733153,5.658681077216966,4.104042226022158,4.458362392245727
0.4997619773516623,5.658681077216966,4.104042226022158,4.458362392245727
0.40746652391656457,5.658681077216966,4.104042226022158,4.376441652178029
0.20001027351446377,5.658681077216966,4.149078630816908,4.376441652178029
0.17174163709026835,3.865482459378,4.149078630816908,4.376441652178029
0.26898858545226223,3.865482459378,4.149078630816908,4.376441652178029
0.5299449940510013,3.865482459378,4.149078630816908,4.376441652178029
1.0202855686261827,3.865482459378,4.149078630816908,4.376441652178029
0.36244038487878527,3.865482459378,4.149078630816908,4.6017688986812715
0.12095570844570824,3.865482459378,1.4120646877713559,4.6017688986812715
0.37089923771473887,3.865482459378,1.4120646877713559,4.6017688986812715
0.10302374945274484,3.865482459378,1.4120646877713559,0.7187516902984674
-0.11584573880374083,3.865482459378,0.9211012486550607,0.7187516902984674
-0.12452130418219953,4.189688525537557,0.9211012486550607,0.7187516902984674
0.07695581783355832,4.189688525537557,0.9211012486550607,0.7187516902984674
0.009771314065622705,4.189688525537557,0.9009813108236946,0.7187516902984674
-0.002745348268180181,4.013952561777071,0.9009813108236946,0.7187516902984674
-0.01021626367637618,4.013952561777071,0.9009813108236946,0.34017148489455096
-0.002440304443400043,4.013952561777071,0.9009813108236946,0.34017148489455096
-0.0323397047116285,3.9105923103132834,0.9009813108236946,0.34017148489455096
0.11526236623207087,3.9105923103132834,0.9009813108236946,0.34017148489455096
0.016399825708566906,3.9105923103132834,0.6570568533868206,0.34017148489455096
0.2202078455665587,3.9105923103132834,0.6570568533868206,0.34017148489455096
0.0850145696340201,3.9105923103132834,0.6570568533868206,5.880617447281842
-0.04719597761172856,3.9105923103132834,0.8578285763892972,5.880617447281842
0.008814217267567481,3.9105923103132834,0.8578285763892972,5.880617447281842
0.02029591580145329,3.9105923103132834,0.8578285763892972,5.880617447281842
-0.08796490843082472,3.9105923103132834,1.0007321018116535,5.880617447281842
0.1367729862496826,3.9105923103132834,1.0007321018116535,5.880617447281842
0.09514646607372157,3.9105923103132834,1.0007321018116535,0.6583403244454753
-0.1375917105828961,3.9105923103132834,0.30172239499022924,0.6583403244454753
-0.01798219756337638,3.9105923103132834,0.30172239499022924,0.6583403244454753
0.15389678413737296,3.9105923103132834,0.30172239499022924,0.6583403244454753
0.31143361626966215,3.9105923103132834,0.30172239499022924,0.6583403244454753
0.09580861773823657,3.7870711599199303,0.30172239499022924,0.6583403244454753
0.1903473774023997,3.7870711599199303,0.30172239499022924,0.6583403244454753
0.15345504401898324,3.7870711599199303,0.613849311032598,0.6583403244454753
0.09207427316450012,3.6272254877799908,0.613849311032598,0.6583403244454753
0.25902290821026697,3.6272254877799908,0.613849311032598,0.6583403244454753
0.2590076014917946,3.6272254877799908,0.6718571401382181,0.6583403244454753
0.09583027201049521,3.7828724533401266,0.6718571401382181,0.6583403244454753
0.14640171925749057,3.7828724533401266,0.6718571401382181,0.6583403244454753
0.05391680464913784,3.7828724533401266,0.21210547461773066,0.6583403244454753
-0.11865843497243111,3.7714561084778597,0.21210547461773066,0.6583403244454753
0.7148177934463049,3.7714561084778597,0.21210547461773066,0.6583403244454753
0.11655009373913527,3.7714561084778597,0.9145868281798233,0.6583403244454753
0.3820155739127551,3.7714561084778597,0.9145868281798233,0.6583403244454753
