,title,movieID,score
0,Best Men (1997),1473,19.6
1,Groove (2000),3790,19.587767469347238
2,Welcome to Woop-Woop (1997),1793,19.583833228334786
3,Point Blank (1967),26172,19.5823141951574
4,Flipped (2010),80586,19.580269033353368
5,Locke (2013),110882,19.57998666250408
6,"Hot Spot, The (1990)",3765,19.57718579316546
7,Dragonslayer (1981),5039,19.574529202099484
8,Push (2009),66171,19.572019552557702
9,Nico and Dani (Krámpack) (2000),4147,19.5605360341378
