{
  "DynamicsTimeAxis_in": {
  "P": [12.3456, 29.3],
 "Tmid0": [9.8765432, 15.4029],
 "t": [0, 2, 4, 6, 8, 10, 12, 14, 16, 18, 20, 22, 24, 26, 28, 30, 32, 34, 36, 38, 40, 42, 44, 46, 48, 50, 52, 54, 56, 58, 60, 62, 64, 66, 68, 70, 72, 74, 76, 78, 80, 82, 84, 86, 88, 90, 92, 94, 96, 98, 100]
},
 "DynamicsTimeAxis_out": {
  "td": [9.8765432, 22.2221432, 34.5677432, 46.9133432, 59.2589432, 71.6045432, 83.9501432, 96.2957432, 15.4029, 44.7029, 74.0029],
 "BeginIdx": [1, 9],
 "EndIdx": [8, 11],
 "Ntr": [8, 3]
},
 "SecularInteractionsMatrix_in": {
  "n": [0.508941267105656, 0.21444318454537837],
 "mu": [0.0000124, 0.00003],
 "aor": [30, 53.37780961713591],
 "J2": 0
},
 "SecularInteractionsMatrix_out": {
  "AA": [[0, 0], [
  0, 0]],
 "BB": [[0, 0], [
  0, 0]]
},
 "ResonantInteractions2_in": {
  "P": [12.3456, 29.3],
 "mu": [0.0000124, 0.00003],
 "Lambda": [[0, -1.185089551126007], [
  6.283185307179585, 1.462340227997416], [
  12.56637061435917, 4.109770007120838], [
  18.84955592153876, 6.757199786244263], [
  25.132741228718346, 9.404629565367684], [
  31.41592653589793, 12.052059344491108], [
  37.69911184307752, 14.699489123614532], [
  43.982297150257107, 17.34691890273795], [
  2.812591032269959, 0], [
  17.72457015846568, 6.283185307179585], [
  32.6365492846614, 12.56637061435917]],
 "free_all": [[0.012339557547914512, 0.009979959850555533], [
  0.012339004473772508, 0.009979909666475853], [
  0.012338451385660646, 0.009979859485067766], [
  0.012337898283580484, 0.009979809306330912], [
  0.012337345167533562, 0.009979759130264917], [
  0.012336792037521437, 0.009979708956869416], [
  0.012336238893545656, 0.009979658786144045], [
  0.012335685735607774, 0.009979608618088432], [
  0.012339309972768508, 0.009979937385935924], [
  0.0123379973159001, 0.009979818290489164], [
  0.012336684580360637, 0.009979699210086745]],
 "free_i": [[0.01606581768755532, 0.018933582849494394], [
  0.016065791875630357, 0.01893359085263363], [
  0.01606576607363741, 0.01893359885269526], [
  0.016065740281576616, 0.018933606849679237], [
  0.01606571449944809, 0.01893361484358553], [
  0.01606568872725193, 0.0189336228344141], [
  0.01606566296498827, 0.01893363082216492], [
  0.016065637212657234, 0.018933638806837944], [
  0.01606580613193502, 0.01893358643238224], [
  0.016065744898838928, 0.01893360541806908], [
  0.01606568372168742, 0.01893362438642051]],
 "tT": [9.8765432, 22.2221432, 34.5677432, 46.9133432, 59.2589432, 71.6045432, 83.9501432, 96.2957432, 15.4029, 44.7029, 74.0029],
 "BeginIdx": [1, 9],
 "EndIdx": [8, 11],
 "ExtraIters": 0, "OrdersAll": [],
 "Calculate3PlanetsCrossTerms": 0, "MaxPower": 4
},
 "ResonantInteractions2_out": {
  "dz": [[-0.00008738116796037676, 0.00003048439535255596], [
  -0.00009702530491457448, 0.00002136801982976398], [
  -0.0000228987018002731, 0.000009318397563152297], [
  0.00003914002422284154, 0.00004569416722227264], [
  0.00009195295911571708, 0.00002128786836490009], [
  0.00002974247003785153, 0.00004601116914012804], [
  -0.000029304895037751586, 0.00000726554178882454], [
  -0.00009858010814314693, 0.00001749920116370736], [
  -0.00008561543958943676, -0.00001709881922379285], [
  0.000015215790445970213, 0.00003745219747523768], [
  0.000007887115337407073, 0.000035715899896072748]],
 "dLambda": [[-0.0000566545500414017, 0.00004129311267897479], [
  -0.000018655842746272589, -0.00001985781311331344], [
  -0.000025377469963391905, 0.0000308818148270501], [
  0.00007633026008161808, -0.00003329726886042744], [
  0.00003819265483743017, -0.000010896249692588866], [
  -0.00003612807934768944, 0.0000229740665310436], [
  -0.0000051012406031541769, -0.000020595328433267], [
  -0.000055820100921910308, 0.00004359209714865559], [
  -0.00002362850772137619, 0.000014759772846115725], [
  0.00004730739843249682, -0.00003550373938284271], [
  -0.000008576088232887155, 0.00002742818938439284]],
 "du": [[5.5444412244396658e-8, -4.063809763379553e-8], [
  7.1793888407213e-8, -2.707040782083544e-8], [
  -8.386647283206804e-8, 4.5126278510321497e-8], [
  -6.569071758452892e-8, -1.9175512352638593e-8], [
  6.094723356576214e-8, 3.0714528897704336e-8], [
  -6.302814303479826e-8, -1.734224766869318e-8], [
  -5.7307992991461236e-8, 5.0521448847299067e-8], [
  4.651348856955105e-8, -2.5026437592318765e-8], [
  6.668488557371885e-8, 2.684740802506323e-8], [
  -7.723000064088749e-8, 1.911526543296742e-9], [
  -8.18021877622004e-8, -2.5031689906382606e-9]],
 "da_oa": [[-0.000010993907203354938, 0.0000196754923404056], [
  -0.000013554012121793384, 0.000007878194293989328], [
  -0.000006533949172798245, -0.000022369451892093325], [
  0.000007218981393362983, 0.00004189273137838802], [
  0.000004559285544315714, -0.00004788129261676794], [
  0.000008843071538935403, 0.00003780191371692855], [
  -2.701529846404293e-7, -0.00002859935495075764], [
  -0.00001142124846968833, 0.000006184958774335028], [
  0.000007824192164413239, -0.00004893519169072487], [
  -0.000017522699949560254, 0.000027087722117219293], [
  -0.000013035682704831493, 0.00001865802636111877]],
 "dTheta_Z": [[0.00003743557101835867, 0.00009319037153645356], [
  -0.00001680071657644499, -0.00007270929732435078], [
  -0.00020820258459380145, 0.00003885059057319284], [
  -0.00010187750326874448, -0.00003777714686166451], [
  0.00004942071525841391, -0.000008272931737454048], [
  0.0001487663291880672, 0.000033312779164728897], [
  0.00016613161814663089, -0.00003325425886982757], [
  -0.00007232299984973891, 0.00009078654684899348], [
  0.000028249014365561784, 0.000010711012675035844], [
  -0.0001484665941707634, 0.00001018199961019689], [
  0.0001878834088136468, -0.000010333922993144154]],
 "z": [[0.012252176379954136, 0.010010444245908088], [
  0.012241979168857932, 0.010001277686305616], [
  0.012315552683860374, 0.009989177882630918], [
  0.012377038307803325, 0.010025503473553185], [
  0.012429298126649278, 0.010001046998629816], [
  0.012366534507559289, 0.010025720126009544], [
  0.012306933998507906, 0.00998692432793287], [
  0.012237105627464629, 0.00999710781925214], [
  0.012253694533179073, 0.00996283856671213], [
  0.012353213106346073, 0.010017270487964402], [
  0.012344571695698045, 0.010015415109982818]],
 "u": [[0.016065873131967568, 0.01893354221139676], [
  0.016065863669518764, 0.01893356378222581], [
  0.01606568220716458, 0.018933643978973768], [
  0.01606567459085903, 0.018933587674166885], [
  0.01606577544668165, 0.01893364555811443], [
  0.016065625699108897, 0.018933605492166433], [
  0.01606560565699528, 0.018933681343613768], [
  0.016065683726145805, 0.01893361378040035], [
  0.016065872816820597, 0.01893361327979027], [
  0.01606566766883829, 0.018933607329595624], [
  0.016065601919499657, 0.01893362188325152]],
 "TTV": [[-0.00007170962678249437, -0.0004257184411159203], [
  0.000032183006821283077, 0.0003321547037409787], [
  0.0003987698894539214, -0.00017747601992280777], [
  0.00019510561925855315, 0.00017257632749612307], [
  -0.00009463592038706828, 0.00003778978829911029], [
  -0.0002849127943645689, -0.00015218093488922194], [
  -0.000318203922296645, 0.0001519102202099681], [
  0.0001385417188766194, -0.00041473979509010727], [
  -0.000054113617896254099, -0.00004893032883734996], [
  0.0002843313058157466, -0.00004651395897329442], [
  -0.00035983288011216347, 0.000047207449053256907]]
},
 "TransitsProperties_in": {
  "Nt": 51, "Npl": 2, "BeginIdx": [1, 9],
 "EndIdx": [8, 11],
 "t": [0, 2, 4, 6, 8, 10, 12, 14, 16, 18, 20, 22, 24, 26, 28, 30, 32, 34, 36, 38, 40, 42, 44, 46, 48, 50, 52, 54, 56, 58, 60, 62, 64, 66, 68, 70, 72, 74, 76, 78, 80, 82, 84, 86, 88, 90, 92, 94, 96, 98, 100],
 "tT": [9.8765432, 22.2221432, 34.5677432, 46.9133432, 59.2589432, 71.6045432, 83.9501432, 96.2957432, 15.4029, 44.7029, 74.0029],
 "TTV": [[-0.00007170962678249437, -0.0004257184411159203], [
  0.000032183006821283077, 0.0003321547037409787], [
  0.0003987698894539214, -0.00017747601992280777], [
  0.00019510561925855315, 0.00017257632749612307], [
  -0.00009463592038706828, 0.00003778978829911029], [
  -0.0002849127943645689, -0.00015218093488922194], [
  -0.000318203922296645, 0.0001519102202099681], [
  0.0001385417188766194, -0.00041473979509010727], [
  -0.000054113617896254099, -0.00004893032883734996], [
  0.0002843313058157466, -0.00004651395897329442], [
  -0.00035983288011216347, 0.000047207449053256907]],
 "P": [12.3456, 29.3],
 "n": [0.508941267105656, 0.21444318454537837],
 "da_oa": [[-0.000010993907203354938, 0.0000196754923404056], [
  -0.000013554012121793384, 0.000007878194293989328], [
  -0.000006533949172798245, -0.000022369451892093325], [
  0.000007218981393362983, 0.00004189273137838802], [
  0.000004559285544315714, -0.00004788129261676794], [
  0.000008843071538935403, 0.00003780191371692855], [
  -2.701529846404293e-7, -0.00002859935495075764], [
  -0.00001142124846968833, 0.000006184958774335028], [
  0.000007824192164413239, -0.00004893519169072487], [
  -0.000017522699949560254, 0.000027087722117219293], [
  -0.000013035682704831493, 0.00001865802636111877]],
 "aor": [30, 53.37780961713591],
 "zT": [[0.012252176379954136, 0.010010444245908088], [
  0.012241979168857932, 0.010001277686305616], [
  0.012315552683860374, 0.009989177882630918], [
  0.012377038307803325, 0.010025503473553185], [
  0.012429298126649278, 0.010001046998629816], [
  0.012366534507559289, 0.010025720126009544], [
  0.012306933998507906, 0.00998692432793287], [
  0.012237105627464629, 0.00999710781925214], [
  0.012253694533179073, 0.00996283856671213], [
  0.012353213106346073, 0.010017270487964402], [
  0.012344571695698045, 0.010015415109982818]],
 "uT": [[0.016065873131967568, 0.01893354221139676], [
  0.016065863669518764, 0.01893356378222581], [
  0.01606568220716458, 0.018933643978973768], [
  0.01606567459085903, 0.018933587674166885], [
  0.01606577544668165, 0.01893364555811443], [
  0.016065625699108897, 0.018933605492166433], [
  0.01606560565699528, 0.018933681343613768], [
  0.016065683726145805, 0.01893361378040035], [
  0.016065872816820597, 0.01893361327979027], [
  0.01606566766883829, 0.018933607329595624], [
  0.016065601919499657, 0.01893362188325152]],
 "ror": [0.021, 0.027],
 "CalcDurations": true
},
 "TransitsProperties_out": [{
  "D": [[0.12671988003268665, 0.15951243346427608], [
  0.12671988003268665, 0.15951243346427608], [
  0.12671988003268665, 0.15951243346427608], [
  0.12671988003268665, 0.15951243346427608], [
  0.12671988003268665, 0.15951243346427608], [
  0.12671988003268665, 0.15951243346427608], [
  0.12671988003268665, 0.15951243346427608], [
  0.12671988003268665, 0.15951243346427608], [
  0.12671988003268665, 0.15951243346427608], [
  0.12672081004008638, 0.15951243346427608], [
  0.12672081004008638, 0.15951243346427608], [
  0.12672081004008638, 0.15951243346427608], [
  0.12672081004008638, 0.15951243346427608], [
  0.12672081004008638, 0.15951243346427608], [
  0.12672081004008638, 0.15951243346427608], [
  0.1267119087385761, 0.15951243346427608], [
  0.1267119087385761, 0.1595096462661935], [
  0.1267119087385761, 0.1595096462661935], [
  0.1267119087385761, 0.1595096462661935], [
  0.1267119087385761, 0.1595096462661935], [
  0.1267119087385761, 0.1595096462661935], [
  0.12670523392821265, 0.1595096462661935], [
  0.12670523392821265, 0.1595096462661935], [
  0.12670523392821265, 0.1595096462661935], [
  0.12670523392821265, 0.1595096462661935], [
  0.12670523392821265, 0.1595096462661935], [
  0.12670523392821265, 0.1595096462661935], [
  0.12669883048973197, 0.1595096462661935], [
  0.12669883048973197, 0.1595096462661935], [
  0.12669883048973197, 0.1595096462661935], [
  0.12669883048973197, 0.15950985350671285], [
  0.12669883048973197, 0.15950985350671285], [
  0.12669883048973197, 0.15950985350671285], [
  0.12670667218240257, 0.15950985350671285], [
  0.12670667218240257, 0.15950985350671285], [
  0.12670667218240257, 0.15950985350671285], [
  0.12670667218240257, 0.15950985350671285], [
  0.12670667218240257, 0.15950985350671285], [
  0.12670667218240257, 0.15950985350671285], [
  0.12671332366633476, 0.15950985350671285], [
  0.12671332366633476, 0.15950985350671285], [
  0.12671332366633476, 0.15950985350671285], [
  0.12671332366633476, 0.15950985350671285], [
  0.12671332366633476, 0.15950985350671285], [
  0.12671332366633476, 0.15950985350671285], [
  0.12671332366633476, 0.15950985350671285], [
  0.12672078086282666, 0.15950985350671285], [
  0.12672078086282666, 0.15950985350671285], [
  0.12672078086282666, 0.15950985350671285], [
  0.12672078086282666, 0.15950985350671285], [
  0.12672078086282666, 0.15950985350671285]],
 "D1": [0.12671988003268665, 0.12672081004008638, 0.1267119087385761, 0.12670523392821265, 0.12669883048973197, 0.12670667218240257, 0.12671332366633476, 0.12672078086282666],
 "Tau": [[0.002775317094550099, 0.005065206818773767], [
  0.002775317094550099, 0.005065206818773767], [
  0.002775317094550099, 0.005065206818773767], [
  0.002775317094550099, 0.005065206818773767], [
  0.002775317094550099, 0.005065206818773767], [
  0.002775317094550099, 0.005065206818773767], [
  0.002775317094550099, 0.005065206818773767], [
  0.002775317094550099, 0.005065206818773767], [
  0.002775317094550099, 0.005065206818773767], [
  0.002775340102303907, 0.005065206818773767], [
  0.002775340102303907, 0.005065206818773767], [
  0.002775340102303907, 0.005065206818773767], [
  0.002775340102303907, 0.005065206818773767], [
  0.002775340102303907, 0.005065206818773767], [
  0.002775340102303907, 0.005065206818773767], [
  0.002775134322569524, 0.005065206818773767], [
  0.002775134322569524, 0.005065133705098761], [
  0.002775134322569524, 0.005065133705098761], [
  0.002775134322569524, 0.005065133705098761], [
  0.002775134322569524, 0.005065133705098761], [
  0.002775134322569524, 0.005065133705098761], [
  0.002774977689172641, 0.005065133705098761], [
  0.002774977689172641, 0.005065133705098761], [
  0.002774977689172641, 0.005065133705098761], [
  0.002774977689172641, 0.005065133705098761], [
  0.002774977689172641, 0.005065133705098761], [
  0.002774977689172641, 0.005065133705098761], [
  0.002774833097339809, 0.005065133705098761], [
  0.002774833097339809, 0.005065133705098761], [
  0.002774833097339809, 0.005065133705098761], [
  0.002774833097339809, 0.005065095080382899], [
  0.002774833097339809, 0.005065095080382899], [
  0.002774833097339809, 0.005065095080382899], [
  0.0027750327018487557, 0.005065095080382899], [
  0.0027750327018487557, 0.005065095080382899], [
  0.0027750327018487557, 0.005065095080382899], [
  0.0027750327018487557, 0.005065095080382899], [
  0.0027750327018487557, 0.005065095080382899], [
  0.0027750327018487557, 0.005065095080382899], [
  0.002775191387430142, 0.005065095080382899], [
  0.002775191387430142, 0.005065095080382899], [
  0.002775191387430142, 0.005065095080382899], [
  0.002775191387430142, 0.005065095080382899], [
  0.002775191387430142, 0.005065095080382899], [
  0.002775191387430142, 0.005065095080382899], [
  0.002775191387430142, 0.005065095080382899], [
  0.002775372340135374, 0.005065095080382899], [
  0.002775372340135374, 0.005065095080382899], [
  0.002775372340135374, 0.005065095080382899], [
  0.002775372340135374, 0.005065095080382899], [
  0.002775372340135374, 0.005065095080382899]],
 "Tau1": [0.002775317094550099, 0.002775340102303907, 0.002775134322569524, 0.002774977689172641, 0.002774833097339809, 0.0027750327018487557, 0.002775191387430142, 0.002775372340135374],
 "w": [[0.5220438691154558, 0.21890334542080196], [
  0.5220438691154558, 0.21890334542080196], [
  0.5220438691154558, 0.21890334542080196], [
  0.5220438691154558, 0.21890334542080196], [
  0.5220438691154558, 0.21890334542080196], [
  0.5220438691154558, 0.21890334542080196], [
  0.5220438691154558, 0.21890334542080196], [
  0.5220438691154558, 0.21890334542080196], [
  0.5220438691154558, 0.21890334542080196], [
  0.5220368833074489, 0.21890334542080196], [
  0.5220368833074489, 0.21890334542080196], [
  0.5220368833074489, 0.21890334542080196], [
  0.5220368833074489, 0.21890334542080196], [
  0.5220368833074489, 0.21890334542080196], [
  0.5220368833074489, 0.21890334542080196], [
  0.5221121004871147, 0.21890334542080196], [
  0.5221121004871147, 0.21890202070399546], [
  0.5221121004871147, 0.21890202070399546], [
  0.5221121004871147, 0.21890202070399546], [
  0.5221121004871147, 0.21890202070399546], [
  0.5221121004871147, 0.21890202070399546], [
  0.5221659102177719, 0.21890202070399546], [
  0.5221659102177719, 0.21890202070399546], [
  0.5221659102177719, 0.21890202070399546], [
  0.5221659102177719, 0.21890202070399546], [
  0.5221659102177719, 0.21890202070399546], [
  0.5221659102177719, 0.21890202070399546], [
  0.5222194179153047, 0.21890202070399546], [
  0.5222194179153047, 0.21890202070399546], [
  0.5222194179153047, 0.21890202070399546], [
  0.5222194179153047, 0.21890449919219266], [
  0.5222194179153047, 0.21890449919219266], [
  0.5222194179153047, 0.21890449919219266], [
  0.522146888909835, 0.21890449919219266], [
  0.522146888909835, 0.21890449919219266], [
  0.522146888909835, 0.21890449919219266], [
  0.522146888909835, 0.21890449919219266], [
  0.522146888909835, 0.21890449919219266], [
  0.522146888909835, 0.21890449919219266], [
  0.5220916729987855, 0.21890449919219266], [
  0.5220916729987855, 0.21890449919219266], [
  0.5220916729987855, 0.21890449919219266], [
  0.5220916729987855, 0.21890449919219266], [
  0.5220916729987855, 0.21890449919219266], [
  0.5220916729987855, 0.21890449919219266], [
  0.5220916729987855, 0.21890449919219266], [
  0.5220304788779714, 0.21890449919219266], [
  0.5220304788779714, 0.21890449919219266], [
  0.5220304788779714, 0.21890449919219266], [
  0.5220304788779714, 0.21890449919219266], [
  0.5220304788779714, 0.21890449919219266]],
 "w1": [0.5220438691154558, 0.5220368833074489, 0.5221121004871147, 0.5221659102177719, 0.5222194179153047, 0.522146888909835, 0.5220916729987855, 0.5220304788779714],
 "d": [[29.61587754410602, 52.82454657751092], [
  29.61587754410602, 52.82454657751092], [
  29.61587754410602, 52.82454657751092], [
  29.61587754410602, 52.82454657751092], [
  29.61587754410602, 52.82454657751092], [
  29.61587754410602, 52.82454657751092], [
  29.61587754410602, 52.82454657751092], [
  29.61587754410602, 52.82454657751092], [
  29.61587754410602, 52.82454657751092], [
  29.61604230169987, 52.82454657751092], [
  29.61604230169987, 52.82454657751092], [
  29.61604230169987, 52.82454657751092], [
  29.61604230169987, 52.82454657751092], [
  29.61604230169987, 52.82454657751092], [
  29.61604230169987, 52.82454657751092], [
  29.61391529767007, 52.82454657751092], [
  29.61391529767007, 52.82570878312685], [
  29.61391529767007, 52.82570878312685], [
  29.61391529767007, 52.82570878312685], [
  29.61391529767007, 52.82570878312685], [
  29.61391529767007, 52.82570878312685], [
  29.61248027233968, 52.82570878312685], [
  29.61248027233968, 52.82570878312685], [
  29.61248027233968, 52.82570878312685], [
  29.61248027233968, 52.82570878312685], [
  29.61248027233968, 52.82570878312685], [
  29.61248027233968, 52.82570878312685], [
  29.61096696514055, 52.82570878312685], [
  29.61096696514055, 52.82570878312685], [
  29.61096696514055, 52.82570878312685], [
  29.61096696514055, 52.82527772480565], [
  29.61096696514055, 52.82527772480565], [
  29.61096696514055, 52.82527772480565], [
  29.613097019962276, 52.82527772480565], [
  29.613097019962276, 52.82527772480565], [
  29.613097019962276, 52.82527772480565], [
  29.613097019962276, 52.82527772480565], [
  29.613097019962276, 52.82527772480565], [
  29.613097019962276, 52.82527772480565], [
  29.614603703403657, 52.82527772480565], [
  29.614603703403657, 52.82527772480565], [
  29.614603703403657, 52.82527772480565], [
  29.614603703403657, 52.82527772480565], [
  29.614603703403657, 52.82527772480565], [
  29.614603703403657, 52.82527772480565], [
  29.614603703403657, 52.82527772480565], [
  29.616236998673977, 52.82527772480565], [
  29.616236998673977, 52.82527772480565], [
  29.616236998673977, 52.82527772480565], [
  29.616236998673977, 52.82527772480565], [
  29.616236998673977, 52.82527772480565]],
 "d1": [29.61587754410602, 29.61604230169987, 29.61391529767007, 29.61248027233968, 29.61096696514055, 29.613097019962276, 29.614603703403657, 29.616236998673977],
 "b": [[0.2019629217059415, 0.3867441629834576], [
  0.2019629217059415, 0.3867441629834576], [
  0.2019629217059415, 0.3867441629834576], [
  0.2019629217059415, 0.3867441629834576], [
  0.2019629217059415, 0.3867441629834576], [
  0.2019629217059415, 0.3867441629834576], [
  0.2019629217059415, 0.3867441629834576], [
  0.2019629217059415, 0.3867441629834576], [
  0.2019629217059415, 0.3867441629834576], [
  0.20196519007141784, 0.3867441629834576], [
  0.20196519007141784, 0.3867441629834576], [
  0.20196519007141784, 0.3867441629834576], [
  0.20196519007141784, 0.3867441629834576], [
  0.20196519007141784, 0.3867441629834576], [
  0.20196519007141784, 0.3867441629834576], [
  0.2019557966233618, 0.3867441629834576], [
  0.2019557966233618, 0.38674750735038906], [
  0.2019557966233618, 0.38674750735038906], [
  0.2019557966233618, 0.38674750735038906], [
  0.2019557966233618, 0.38674750735038906], [
  0.2019557966233618, 0.38674750735038906], [
  0.2019467704253461, 0.38674750735038906], [
  0.2019467704253461, 0.38674750735038906], [
  0.2019467704253461, 0.38674750735038906], [
  0.2019467704253461, 0.38674750735038906], [
  0.2019467704253461, 0.38674750735038906], [
  0.2019467704253461, 0.38674750735038906], [
  0.20194295838351049, 0.38674750735038906], [
  0.20194295838351049, 0.38674750735038906], [
  0.20194295838351049, 0.38674750735038906], [
  0.20194295838351049, 0.3867376975201834], [
  0.20194295838351049, 0.3867376975201834], [
  0.20194295838351049, 0.3867376975201834], [
  0.20196693108977549, 0.3867376975201834], [
  0.20196693108977549, 0.3867376975201834], [
  0.20196693108977549, 0.3867376975201834], [
  0.20196693108977549, 0.3867376975201834], [
  0.20196693108977549, 0.3867376975201834], [
  0.20196693108977549, 0.3867376975201834], [
  0.20197815255442537, 0.3867376975201834], [
  0.20197815255442537, 0.3867376975201834], [
  0.20197815255442537, 0.3867376975201834], [
  0.20197815255442537, 0.3867376975201834], [
  0.20197815255442537, 0.3867376975201834], [
  0.20197815255442537, 0.3867376975201834], [
  0.20197815255442537, 0.3867376975201834], [
  0.20199333316712712, 0.3867376975201834], [
  0.20199333316712712, 0.3867376975201834], [
  0.20199333316712712, 0.3867376975201834], [
  0.20199333316712712, 0.3867376975201834], [
  0.20199333316712712, 0.3867376975201834]],
 "b1": [0.2019629217059415, 0.20196519007141784, 0.2019557966233618, 0.2019467704253461, 0.20194295838351049, 0.20196693108977549, 0.20197815255442537, 0.20199333316712712],
 "AssociatedTmid": [[9.876471490373218, 15.402851069671164], [
  9.876471490373218, 15.402851069671164], [
  9.876471490373218, 15.402851069671164], [
  9.876471490373218, 15.402851069671164], [
  9.876471490373218, 15.402851069671164], [
  9.876471490373218, 15.402851069671164], [
  9.876471490373218, 15.402851069671164], [
  9.876471490373218, 15.402851069671164], [
  9.876471490373218, 15.402851069671164], [
  22.22217538300682, 15.402851069671164], [
  22.22217538300682, 15.402851069671164], [
  22.22217538300682, 15.402851069671164], [
  22.22217538300682, 15.402851069671164], [
  22.22217538300682, 15.402851069671164], [
  22.22217538300682, 15.402851069671164], [
  34.568141969889449, 15.402851069671164], [
  34.568141969889449, 44.70285348604103], [
  34.568141969889449, 44.70285348604103], [
  34.568141969889449, 44.70285348604103], [
  34.568141969889449, 44.70285348604103], [
  34.568141969889449, 44.70285348604103], [
  46.913538305619258, 44.70285348604103], [
  46.913538305619258, 44.70285348604103], [
  46.913538305619258, 44.70285348604103], [
  46.913538305619258, 44.70285348604103], [
  46.913538305619258, 44.70285348604103], [
  46.913538305619258, 44.70285348604103], [
  59.258848564079617, 44.70285348604103], [
  59.258848564079617, 44.70285348604103], [
  59.258848564079617, 44.70285348604103], [
  59.258848564079617, 74.00294720744906], [
  59.258848564079617, 74.00294720744906], [
  59.258848564079617, 74.00294720744906], [
  71.60425828720563, 74.00294720744906], [
  71.60425828720563, 74.00294720744906], [
  71.60425828720563, 74.00294720744906], [
  71.60425828720563, 74.00294720744906], [
  71.60425828720563, 74.00294720744906], [
  71.60425828720563, 74.00294720744906], [
  83.94982499607771, 74.00294720744906], [
  83.94982499607771, 74.00294720744906], [
  83.94982499607771, 74.00294720744906], [
  83.94982499607771, 74.00294720744906], [
  83.94982499607771, 74.00294720744906], [
  83.94982499607771, 74.00294720744906], [
  83.94982499607771, 74.00294720744906], [
  96.29588174171889, 74.00294720744906], [
  96.29588174171889, 74.00294720744906], [
  96.29588174171889, 74.00294720744906], [
  96.29588174171889, 74.00294720744906], [
  96.29588174171889, 74.00294720744906]],
 "AssociatedInd": [[1, 1], [
  1, 1], [
  1, 1], [
  1, 1], [
  1, 1], [
  1, 1], [
  1, 1], [
  1, 1], [
  1, 1], [
  2, 1], [
  2, 1], [
  2, 1], [
  2, 1], [
  2, 1], [
  2, 1], [
  3, 1], [
  3, 2], [
  3, 2], [
  3, 2], [
  3, 2], [
  3, 2], [
  4, 2], [
  4, 2], [
  4, 2], [
  4, 2], [
  4, 2], [
  4, 2], [
  5, 2], [
  5, 2], [
  5, 2], [
  5, 3], [
  5, 3], [
  5, 3], [
  6, 3], [
  6, 3], [
  6, 3], [
  6, 3], [
  6, 3], [
  6, 3], [
  7, 3], [
  7, 3], [
  7, 3], [
  7, 3], [
  7, 3], [
  7, 3], [
  7, 3], [
  8, 3], [
  8, 3], [
  8, 3], [
  8, 3], [
  8, 3]],
 "dbdt": [2.963114685375551e-7, -1.103321377835323e-7],
 "b0": [0.2019482767195627, 0.3867480547845321]
}, {
  
  "D": [[0.12671988003268665, 0.15951243346427608], [
  0.12671988003268665, 0.15951243346427608], [
  0.12671988003268665, 0.15951243346427608], [
  0.12671988003268665, 0.15951243346427608], [
  0.12671988003268665, 0.15951243346427608], [
  0.12671988003268665, 0.15951243346427608], [
  0.12671988003268665, 0.15951243346427608], [
  0.12671988003268665, 0.15951243346427608], [
  0.12671988003268665, 0.15951243346427608], [
  0.12672081004008638, 0.15951243346427608], [
  0.12672081004008638, 0.15951243346427608], [
  0.12672081004008638, 0.15951243346427608], [
  0.12672081004008638, 0.15951243346427608], [
  0.12672081004008638, 0.15951243346427608], [
  0.12672081004008638, 0.15951243346427608], [
  0.1267119087385761, 0.15951243346427608], [
  0.1267119087385761, 0.1595096462661935], [
  0.1267119087385761, 0.1595096462661935], [
  0.1267119087385761, 0.1595096462661935], [
  0.1267119087385761, 0.1595096462661935], [
  0.1267119087385761, 0.1595096462661935], [
  0.12670523392821265, 0.1595096462661935], [
  0.12670523392821265, 0.1595096462661935], [
  0.12670523392821265, 0.1595096462661935], [
  0.12670523392821265, 0.1595096462661935], [
  0.12670523392821265, 0.1595096462661935], [
  0.12670523392821265, 0.1595096462661935], [
  0.12669883048973197, 0.1595096462661935], [
  0.12669883048973197, 0.1595096462661935], [
  0.12669883048973197, 0.1595096462661935], [
  0.12669883048973197, 0.15950985350671285], [
  0.12669883048973197, 0.15950985350671285], [
  0.12669883048973197, 0.15950985350671285], [
  0.12670667218240257, 0.15950985350671285], [
  0.12670667218240257, 0.15950985350671285], [
  0.12670667218240257, 0.15950985350671285], [
  0.12670667218240257, 0.15950985350671285], [
  0.12670667218240257, 0.15950985350671285], [
  0.12670667218240257, 0.15950985350671285], [
  0.12671332366633476, 0.15950985350671285], [
  0.12671332366633476, 0.15950985350671285], [
  0.12671332366633476, 0.15950985350671285], [
  0.12671332366633476, 0.15950985350671285], [
  0.12671332366633476, 0.15950985350671285], [
  0.12671332366633476, 0.15950985350671285], [
  0.12671332366633476, 0.15950985350671285], [
  0.12672078086282666, 0.15950985350671285], [
  0.12672078086282666, 0.15950985350671285], [
  0.12672078086282666, 0.15950985350671285], [
  0.12672078086282666, 0.15950985350671285], [
  0.12672078086282666, 0.15950985350671285]],
 "D1": [0.15951243346427608, 0.1595096462661935, 0.15950985350671285],
 "Tau": [[0.002775317094550099, 0.005065206818773767], [
  0.002775317094550099, 0.005065206818773767], [
  0.002775317094550099, 0.005065206818773767], [
  0.002775317094550099, 0.005065206818773767], [
  0.002775317094550099, 0.005065206818773767], [
  0.002775317094550099, 0.005065206818773767], [
  0.002775317094550099, 0.005065206818773767], [
  0.002775317094550099, 0.005065206818773767], [
  0.002775317094550099, 0.005065206818773767], [
  0.002775340102303907, 0.005065206818773767], [
  0.002775340102303907, 0.005065206818773767], [
  0.002775340102303907, 0.005065206818773767], [
  0.002775340102303907, 0.005065206818773767], [
  0.002775340102303907, 0.005065206818773767], [
  0.002775340102303907, 0.005065206818773767], [
  0.002775134322569524, 0.005065206818773767], [
  0.002775134322569524, 0.005065133705098761], [
  0.002775134322569524, 0.005065133705098761], [
  0.002775134322569524, 0.005065133705098761], [
  0.002775134322569524, 0.005065133705098761], [
  0.002775134322569524, 0.005065133705098761], [
  0.002774977689172641, 0.005065133705098761], [
  0.002774977689172641, 0.005065133705098761], [
  0.002774977689172641, 0.005065133705098761], [
  0.002774977689172641, 0.005065133705098761], [
  0.002774977689172641, 0.005065133705098761], [
  0.002774977689172641, 0.005065133705098761], [
  0.002774833097339809, 0.005065133705098761], [
  0.002774833097339809, 0.005065133705098761], [
  0.002774833097339809, 0.005065133705098761], [
  0.002774833097339809, 0.005065095080382899], [
  0.002774833097339809, 0.005065095080382899], [
  0.002774833097339809, 0.005065095080382899], [
  0.0027750327018487557, 0.005065095080382899], [
  0.0027750327018487557, 0.005065095080382899], [
  0.0027750327018487557, 0.005065095080382899], [
  0.0027750327018487557, 0.005065095080382899], [
  0.0027750327018487557, 0.005065095080382899], [
  0.0027750327018487557, 0.005065095080382899], [
  0.002775191387430142, 0.005065095080382899], [
  0.002775191387430142, 0.005065095080382899], [
  0.002775191387430142, 0.005065095080382899], [
  0.002775191387430142, 0.005065095080382899], [
  0.002775191387430142, 0.005065095080382899], [
  0.002775191387430142, 0.005065095080382899], [
  0.002775191387430142, 0.005065095080382899], [
  0.002775372340135374, 0.005065095080382899], [
  0.002775372340135374, 0.005065095080382899], [
  0.002775372340135374, 0.005065095080382899], [
  0.002775372340135374, 0.005065095080382899], [
  0.002775372340135374, 0.005065095080382899]],
 "Tau1": [0.005065206818773767, 0.005065133705098761, 0.005065095080382899],
 "w": [[0.5220438691154558, 0.21890334542080196], [
  0.5220438691154558, 0.21890334542080196], [
  0.5220438691154558, 0.21890334542080196], [
  0.5220438691154558, 0.21890334542080196], [
  0.5220438691154558, 0.21890334542080196], [
  0.5220438691154558, 0.21890334542080196], [
  0.5220438691154558, 0.21890334542080196], [
  0.5220438691154558, 0.21890334542080196], [
  0.5220438691154558, 0.21890334542080196], [
  0.5220368833074489, 0.21890334542080196], [
  0.5220368833074489, 0.21890334542080196], [
  0.5220368833074489, 0.21890334542080196], [
  0.5220368833074489, 0.21890334542080196], [
  0.5220368833074489, 0.21890334542080196], [
  0.5220368833074489, 0.21890334542080196], [
  0.5221121004871147, 0.21890334542080196], [
  0.5221121004871147, 0.21890202070399546], [
  0.5221121004871147, 0.21890202070399546], [
  0.5221121004871147, 0.21890202070399546], [
  0.5221121004871147, 0.21890202070399546], [
  0.5221121004871147, 0.21890202070399546], [
  0.5221659102177719, 0.21890202070399546], [
  0.5221659102177719, 0.21890202070399546], [
  0.5221659102177719, 0.21890202070399546], [
  0.5221659102177719, 0.21890202070399546], [
  0.5221659102177719, 0.21890202070399546], [
  0.5221659102177719, 0.21890202070399546], [
  0.5222194179153047, 0.21890202070399546], [
  0.5222194179153047, 0.21890202070399546], [
  0.5222194179153047, 0.21890202070399546], [
  0.5222194179153047, 0.21890449919219266], [
  0.5222194179153047, 0.21890449919219266], [
  0.5222194179153047, 0.21890449919219266], [
  0.522146888909835, 0.21890449919219266], [
  0.522146888909835, 0.21890449919219266], [
  0.522146888909835, 0.21890449919219266], [
  0.522146888909835, 0.21890449919219266], [
  0.522146888909835, 0.21890449919219266], [
  0.522146888909835, 0.21890449919219266], [
  0.5220916729987855, 0.21890449919219266], [
  0.5220916729987855, 0.21890449919219266], [
  0.5220916729987855, 0.21890449919219266], [
  0.5220916729987855, 0.21890449919219266], [
  0.5220916729987855, 0.21890449919219266], [
  0.5220916729987855, 0.21890449919219266], [
  0.5220916729987855, 0.21890449919219266], [
  0.5220304788779714, 0.21890449919219266], [
  0.5220304788779714, 0.21890449919219266], [
  0.5220304788779714, 0.21890449919219266], [
  0.5220304788779714, 0.21890449919219266], [
  0.5220304788779714, 0.21890449919219266]],
 "w1": [0.21890334542080196, 0.21890202070399546, 0.21890449919219266],
 "d": [[29.61587754410602, 52.82454657751092], [
  29.61587754410602, 52.82454657751092], [
  29.61587754410602, 52.82454657751092], [
  29.61587754410602, 52.82454657751092], [
  29.61587754410602, 52.82454657751092], [
  29.61587754410602, 52.82454657751092], [
  29.61587754410602, 52.82454657751092], [
  29.61587754410602, 52.82454657751092], [
  29.61587754410602, 52.82454657751092], [
  29.61604230169987, 52.82454657751092], [
  29.61604230169987, 52.82454657751092], [
  29.61604230169987, 52.82454657751092], [
  29.61604230169987, 52.82454657751092], [
  29.61604230169987, 52.82454657751092], [
  29.61604230169987, 52.82454657751092], [
  29.61391529767007, 52.82454657751092], [
  29.61391529767007, 52.82570878312685], [
  29.61391529767007, 52.82570878312685], [
  29.61391529767007, 52.82570878312685], [
  29.61391529767007, 52.82570878312685], [
  29.61391529767007, 52.82570878312685], [
  29.61248027233968, 52.82570878312685], [
  29.61248027233968, 52.82570878312685], [
  29.61248027233968, 52.82570878312685], [
  29.61248027233968, 52.82570878312685], [
  29.61248027233968, 52.82570878312685], [
  29.61248027233968, 52.82570878312685], [
  29.61096696514055, 52.82570878312685], [
  29.61096696514055, 52.82570878312685], [
  29.61096696514055, 52.82570878312685], [
  29.61096696514055, 52.82527772480565], [
  29.61096696514055, 52.82527772480565], [
  29.61096696514055, 52.82527772480565], [
  29.613097019962276, 52.82527772480565], [
  29.613097019962276, 52.82527772480565], [
  29.613097019962276, 52.82527772480565], [
  29.613097019962276, 52.82527772480565], [
  29.613097019962276, 52.82527772480565], [
  29.613097019962276, 52.82527772480565], [
  29.614603703403657, 52.82527772480565], [
  29.614603703403657, 52.82527772480565], [
  29.614603703403657, 52.82527772480565], [
  29.614603703403657, 52.82527772480565], [
  29.614603703403657, 52.82527772480565], [
  29.614603703403657, 52.82527772480565], [
  29.614603703403657, 52.82527772480565], [
  29.616236998673977, 52.82527772480565], [
  29.616236998673977, 52.82527772480565], [
  29.616236998673977, 52.82527772480565], [
  29.616236998673977, 52.82527772480565], [
  29.616236998673977, 52.82527772480565]],
 "d1": [52.82454657751092, 52.82570878312685, 52.82527772480565],
 "b": [[0.2019629217059415, 0.3867441629834576], [
  0.2019629217059415, 0.3867441629834576], [
  0.2019629217059415, 0.3867441629834576], [
  0.2019629217059415, 0.3867441629834576], [
  0.2019629217059415, 0.3867441629834576], [
  0.2019629217059415, 0.3867441629834576], [
  0.2019629217059415, 0.3867441629834576], [
  0.2019629217059415, 0.3867441629834576], [
  0.2019629217059415, 0.3867441629834576], [
  0.20196519007141784, 0.3867441629834576], [
  0.20196519007141784, 0.3867441629834576], [
  0.20196519007141784, 0.3867441629834576], [
  0.20196519007141784, 0.3867441629834576], [
  0.20196519007141784, 0.3867441629834576], [
  0.20196519007141784, 0.3867441629834576], [
  0.2019557966233618, 0.3867441629834576], [
  0.2019557966233618, 0.38674750735038906], [
  0.2019557966233618, 0.38674750735038906], [
  0.2019557966233618, 0.38674750735038906], [
  0.2019557966233618, 0.38674750735038906], [
  0.2019557966233618, 0.38674750735038906], [
  0.2019467704253461, 0.38674750735038906], [
  0.2019467704253461, 0.38674750735038906], [
  0.2019467704253461, 0.38674750735038906], [
  0.2019467704253461, 0.38674750735038906], [
  0.2019467704253461, 0.38674750735038906], [
  0.2019467704253461, 0.38674750735038906], [
  0.20194295838351049, 0.38674750735038906], [
  0.20194295838351049, 0.38674750735038906], [
  0.20194295838351049, 0.38674750735038906], [
  0.20194295838351049, 0.3867376975201834], [
  0.20194295838351049, 0.3867376975201834], [
  0.20194295838351049, 0.3867376975201834], [
  0.20196693108977549, 0.3867376975201834], [
  0.20196693108977549, 0.3867376975201834], [
  0.20196693108977549, 0.3867376975201834], [
  0.20196693108977549, 0.3867376975201834], [
  0.20196693108977549, 0.3867376975201834], [
  0.20196693108977549, 0.3867376975201834], [
  0.20197815255442537, 0.3867376975201834], [
  0.20197815255442537, 0.3867376975201834], [
  0.20197815255442537, 0.3867376975201834], [
  0.20197815255442537, 0.3867376975201834], [
  0.20197815255442537, 0.3867376975201834], [
  0.20197815255442537, 0.3867376975201834], [
  0.20197815255442537, 0.3867376975201834], [
  0.20199333316712712, 0.3867376975201834], [
  0.20199333316712712, 0.3867376975201834], [
  0.20199333316712712, 0.3867376975201834], [
  0.20199333316712712, 0.3867376975201834], [
  0.20199333316712712, 0.3867376975201834]],
 "b1": [0.3867441629834576, 0.38674750735038906, 0.3867376975201834],
 "AssociatedTmid": [[9.876471490373218, 15.402851069671164], [
  9.876471490373218, 15.402851069671164], [
  9.876471490373218, 15.402851069671164], [
  9.876471490373218, 15.402851069671164], [
  9.876471490373218, 15.402851069671164], [
  9.876471490373218, 15.402851069671164], [
  9.876471490373218, 15.402851069671164], [
  9.876471490373218, 15.402851069671164], [
  9.876471490373218, 15.402851069671164], [
  22.22217538300682, 15.402851069671164], [
  22.22217538300682, 15.402851069671164], [
  22.22217538300682, 15.402851069671164], [
  22.22217538300682, 15.402851069671164], [
  22.22217538300682, 15.402851069671164], [
  22.22217538300682, 15.402851069671164], [
  34.568141969889449, 15.402851069671164], [
  34.568141969889449, 44.70285348604103], [
  34.568141969889449, 44.70285348604103], [
  34.568141969889449, 44.70285348604103], [
  34.568141969889449, 44.70285348604103], [
  34.568141969889449, 44.70285348604103], [
  46.913538305619258, 44.70285348604103], [
  46.913538305619258, 44.70285348604103], [
  46.913538305619258, 44.70285348604103], [
  46.913538305619258, 44.70285348604103], [
  46.913538305619258, 44.70285348604103], [
  46.913538305619258, 44.70285348604103], [
  59.258848564079617, 44.70285348604103], [
  59.258848564079617, 44.70285348604103], [
  59.258848564079617, 44.70285348604103], [
  59.258848564079617, 74.00294720744906], [
  59.258848564079617, 74.00294720744906], [
  59.258848564079617, 74.00294720744906], [
  71.60425828720563, 74.00294720744906], [
  71.60425828720563, 74.00294720744906], [
  71.60425828720563, 74.00294720744906], [
  71.60425828720563, 74.00294720744906], [
  71.60425828720563, 74.00294720744906], [
  71.60425828720563, 74.00294720744906], [
  83.94982499607771, 74.00294720744906], [
  83.94982499607771, 74.00294720744906], [
  83.94982499607771, 74.00294720744906], [
  83.94982499607771, 74.00294720744906], [
  83.94982499607771, 74.00294720744906], [
  83.94982499607771, 74.00294720744906], [
  83.94982499607771, 74.00294720744906], [
  96.29588174171889, 74.00294720744906], [
  96.29588174171889, 74.00294720744906], [
  96.29588174171889, 74.00294720744906], [
  96.29588174171889, 74.00294720744906], [
  96.29588174171889, 74.00294720744906]],
 "AssociatedInd": [[1, 1], [
  1, 1], [
  1, 1], [
  1, 1], [
  1, 1], [
  1, 1], [
  1, 1], [
  1, 1], [
  1, 1], [
  2, 1], [
  2, 1], [
  2, 1], [
  2, 1], [
  2, 1], [
  2, 1], [
  3, 1], [
  3, 2], [
  3, 2], [
  3, 2], [
  3, 2], [
  3, 2], [
  4, 2], [
  4, 2], [
  4, 2], [
  4, 2], [
  4, 2], [
  4, 2], [
  5, 2], [
  5, 2], [
  5, 2], [
  5, 3], [
  5, 3], [
  5, 3], [
  6, 3], [
  6, 3], [
  6, 3], [
  6, 3], [
  6, 3], [
  6, 3], [
  7, 3], [
  7, 3], [
  7, 3], [
  7, 3], [
  7, 3], [
  7, 3], [
  7, 3], [
  8, 3], [
  8, 3], [
  8, 3], [
  8, 3], [
  8, 3]],
 "dbdt": [2.963114685375551e-7, -1.103321377835323e-7],
 "b0": [0.2019482767195627, 0.3867480547845321]
}],
 "GenerateLightCurve_in": {
  "Nt": 51, "Npl": 2, "Ncad": 1, "CadenceType": [1, 1, 1, 1, 1, 1, 1, 1, 1, 1, 1, 1, 1, 1, 1, 1, 1, 1, 1, 1, 1, 1, 1, 1, 1, 1, 1, 1, 1, 1, 1, 1, 1, 1, 1, 1, 1, 1, 1, 1, 1, 1, 1, 1, 1, 1, 1, 1, 1, 1, 1],
 "t": [0, 2, 4, 6, 8, 10, 12, 14, 16, 18, 20, 22, 24, 26, 28, 30, 32, 34, 36, 38, 40, 42, 44, 46, 48, 50, 52, 54, 56, 58, 60, 62, 64, 66, 68, 70, 72, 74, 76, 78, 80, 82, 84, 86, 88, 90, 92, 94, 96, 98, 100],
 "BinningTime": 100, "AssociatedTmid": [[9.876471490373218, 15.402851069671164], [
  9.876471490373218, 15.402851069671164], [
  9.876471490373218, 15.402851069671164], [
  9.876471490373218, 15.402851069671164], [
  9.876471490373218, 15.402851069671164], [
  9.876471490373218, 15.402851069671164], [
  9.876471490373218, 15.402851069671164], [
  9.876471490373218, 15.402851069671164], [
  9.876471490373218, 15.402851069671164], [
  22.22217538300682, 15.402851069671164], [
  22.22217538300682, 15.402851069671164], [
  22.22217538300682, 15.402851069671164], [
  22.22217538300682, 15.402851069671164], [
  22.22217538300682, 15.402851069671164], [
  22.22217538300682, 15.402851069671164], [
  34.568141969889449, 15.402851069671164], [
  34.568141969889449, 44.70285348604103], [
  34.568141969889449, 44.70285348604103], [
  34.568141969889449, 44.70285348604103], [
  34.568141969889449, 44.70285348604103], [
  34.568141969889449, 44.70285348604103], [
  46.913538305619258, 44.70285348604103], [
  46.913538305619258, 44.70285348604103], [
  46.913538305619258, 44.70285348604103], [
  46.913538305619258, 44.70285348604103], [
  46.913538305619258, 44.70285348604103], [
  46.913538305619258, 44.70285348604103], [
  59.258848564079617, 44.70285348604103], [
  59.258848564079617, 44.70285348604103], [
  59.258848564079617, 44.70285348604103], [
  59.258848564079617, 74.00294720744906], [
  59.258848564079617, 74.00294720744906], [
  59.258848564079617, 74.00294720744906], [
  71.60425828720563, 74.00294720744906], [
  71.60425828720563, 74.00294720744906], [
  71.60425828720563, 74.00294720744906], [
  71.60425828720563, 74.00294720744906], [
  71.60425828720563, 74.00294720744906], [
  71.60425828720563, 74.00294720744906], [
  83.94982499607771, 74.00294720744906], [
  83.94982499607771, 74.00294720744906], [
  83.94982499607771, 74.00294720744906], [
  83.94982499607771, 74.00294720744906], [
  83.94982499607771, 74.00294720744906], [
  83.94982499607771, 74.00294720744906], [
  83.94982499607771, 74.00294720744906], [
  96.29588174171889, 74.00294720744906], [
  96.29588174171889, 74.00294720744906], [
  96.29588174171889, 74.00294720744906], [
  96.29588174171889, 74.00294720744906], [
  96.29588174171889, 74.00294720744906]],
 "w": [[0.5220438691154558, 0.21890334542080196], [
  0.5220438691154558, 0.21890334542080196], [
  0.5220438691154558, 0.21890334542080196], [
  0.5220438691154558, 0.21890334542080196], [
  0.5220438691154558, 0.21890334542080196], [
  0.5220438691154558, 0.21890334542080196], [
  0.5220438691154558, 0.21890334542080196], [
  0.5220438691154558, 0.21890334542080196], [
  0.5220438691154558, 0.21890334542080196], [
  0.5220368833074489, 0.21890334542080196], [
  0.5220368833074489, 0.21890334542080196], [
  0.5220368833074489, 0.21890334542080196], [
  0.5220368833074489, 0.21890334542080196], [
  0.5220368833074489, 0.21890334542080196], [
  0.5220368833074489, 0.21890334542080196], [
  0.5221121004871147, 0.21890334542080196], [
  0.5221121004871147, 0.21890202070399546], [
  0.5221121004871147, 0.21890202070399546], [
  0.5221121004871147, 0.21890202070399546], [
  0.5221121004871147, 0.21890202070399546], [
  0.5221121004871147, 0.21890202070399546], [
  0.5221659102177719, 0.21890202070399546], [
  0.5221659102177719, 0.21890202070399546], [
  0.5221659102177719, 0.21890202070399546], [
  0.5221659102177719, 0.21890202070399546], [
  0.5221659102177719, 0.21890202070399546], [
  0.5221659102177719, 0.21890202070399546], [
  0.5222194179153047, 0.21890202070399546], [
  0.5222194179153047, 0.21890202070399546], [
  0.5222194179153047, 0.21890202070399546], [
  0.5222194179153047, 0.21890449919219266], [
  0.5222194179153047, 0.21890449919219266], [
  0.5222194179153047, 0.21890449919219266], [
  0.522146888909835, 0.21890449919219266], [
  0.522146888909835, 0.21890449919219266], [
  0.522146888909835, 0.21890449919219266], [
  0.522146888909835, 0.21890449919219266], [
  0.522146888909835, 0.21890449919219266], [
  0.522146888909835, 0.21890449919219266], [
  0.5220916729987855, 0.21890449919219266], [
  0.5220916729987855, 0.21890449919219266], [
  0.5220916729987855, 0.21890449919219266], [
  0.5220916729987855, 0.21890449919219266], [
  0.5220916729987855, 0.21890449919219266], [
  0.5220916729987855, 0.21890449919219266], [
  0.5220916729987855, 0.21890449919219266], [
  0.5220304788779714, 0.21890449919219266], [
  0.5220304788779714, 0.21890449919219266], [
  0.5220304788779714, 0.21890449919219266], [
  0.5220304788779714, 0.21890449919219266], [
  0.5220304788779714, 0.21890449919219266]],
 "d": [[29.61587754410602, 52.82454657751092], [
  29.61587754410602, 52.82454657751092], [
  29.61587754410602, 52.82454657751092], [
  29.61587754410602, 52.82454657751092], [
  29.61587754410602, 52.82454657751092], [
  29.61587754410602, 52.82454657751092], [
  29.61587754410602, 52.82454657751092], [
  29.61587754410602, 52.82454657751092], [
  29.61587754410602, 52.82454657751092], [
  29.61604230169987, 52.82454657751092], [
  29.61604230169987, 52.82454657751092], [
  29.61604230169987, 52.82454657751092], [
  29.61604230169987, 52.82454657751092], [
  29.61604230169987, 52.82454657751092], [
  29.61604230169987, 52.82454657751092], [
  29.61391529767007, 52.82454657751092], [
  29.61391529767007, 52.82570878312685], [
  29.61391529767007, 52.82570878312685], [
  29.61391529767007, 52.82570878312685], [
  29.61391529767007, 52.82570878312685], [
  29.61391529767007, 52.82570878312685], [
  29.61248027233968, 52.82570878312685], [
  29.61248027233968, 52.82570878312685], [
  29.61248027233968, 52.82570878312685], [
  29.61248027233968, 52.82570878312685], [
  29.61248027233968, 52.82570878312685], [
  29.61248027233968, 52.82570878312685], [
  29.61096696514055, 52.82570878312685], [
  29.61096696514055, 52.82570878312685], [
  29.61096696514055, 52.82570878312685], [
  29.61096696514055, 52.82527772480565], [
  29.61096696514055, 52.82527772480565], [
  29.61096696514055, 52.82527772480565], [
  29.613097019962276, 52.82527772480565], [
  29.613097019962276, 52.82527772480565], [
  29.613097019962276, 52.82527772480565], [
  29.613097019962276, 52.82527772480565], [
  29.613097019962276, 52.82527772480565], [
  29.613097019962276, 52.82527772480565], [
  29.614603703403657, 52.82527772480565], [
  29.614603703403657, 52.82527772480565], [
  29.614603703403657, 52.82527772480565], [
  29.614603703403657, 52.82527772480565], [
  29.614603703403657, 52.82527772480565], [
  29.614603703403657, 52.82527772480565], [
  29.614603703403657, 52.82527772480565], [
  29.616236998673977, 52.82527772480565], [
  29.616236998673977, 52.82527772480565], [
  29.616236998673977, 52.82527772480565], [
  29.616236998673977, 52.82527772480565], [
  29.616236998673977, 52.82527772480565]],
 "b": [[0.2019629217059415, 0.3867441629834576], [
  0.2019629217059415, 0.3867441629834576], [
  0.2019629217059415, 0.3867441629834576], [
  0.2019629217059415, 0.3867441629834576], [
  0.2019629217059415, 0.3867441629834576], [
  0.2019629217059415, 0.3867441629834576], [
  0.2019629217059415, 0.3867441629834576], [
  0.2019629217059415, 0.3867441629834576], [
  0.2019629217059415, 0.3867441629834576], [
  0.20196519007141784, 0.3867441629834576], [
  0.20196519007141784, 0.3867441629834576], [
  0.20196519007141784, 0.3867441629834576], [
  0.20196519007141784, 0.3867441629834576], [
  0.20196519007141784, 0.3867441629834576], [
  0.20196519007141784, 0.3867441629834576], [
  0.2019557966233618, 0.3867441629834576], [
  0.2019557966233618, 0.38674750735038906], [
  0.2019557966233618, 0.38674750735038906], [
  0.2019557966233618, 0.38674750735038906], [
  0.2019557966233618, 0.38674750735038906], [
  0.2019557966233618, 0.38674750735038906], [
  0.2019467704253461, 0.38674750735038906], [
  0.2019467704253461, 0.38674750735038906], [
  0.2019467704253461, 0.38674750735038906], [
  0.2019467704253461, 0.38674750735038906], [
  0.2019467704253461, 0.38674750735038906], [
  0.2019467704253461, 0.38674750735038906], [
  0.20194295838351049, 0.38674750735038906], [
  0.20194295838351049, 0.38674750735038906], [
  0.20194295838351049, 0.38674750735038906], [
  0.20194295838351049, 0.3867376975201834], [
  0.20194295838351049, 0.3867376975201834], [
  0.20194295838351049, 0.3867376975201834], [
  0.20196693108977549, 0.3867376975201834], [
  0.20196693108977549, 0.3867376975201834], [
  0.20196693108977549, 0.3867376975201834], [
  0.20196693108977549, 0.3867376975201834], [
  0.20196693108977549, 0.3867376975201834], [
  0.20196693108977549, 0.3867376975201834], [
  0.20197815255442537, 0.3867376975201834], [
  0.20197815255442537, 0.3867376975201834], [
  0.20197815255442537, 0.3867376975201834], [
  0.20197815255442537, 0.3867376975201834], [
  0.20197815255442537, 0.3867376975201834], [
  0.20197815255442537, 0.3867376975201834], [
  0.20197815255442537, 0.3867376975201834], [
  0.20199333316712712, 0.3867376975201834], [
  0.20199333316712712, 0.3867376975201834], [
  0.20199333316712712, 0.3867376975201834], [
  0.20199333316712712, 0.3867376975201834], [
  0.20199333316712712, 0.3867376975201834]],
 "ror": [0.021, 0.027],
 "u1": 0.5, "u2": 0.3
},
 "GenerateLightCurve_out": {
  "AllLC": [[1, 1], [
  1, 1], [
  1, 1], [
  1, 1], [
  1, 1], [
  1, 1], [
  1, 1], [
  1, 1], [
  1, 1], [
  1, 1], [
  1, 1], [
  1, 1], [
  1, 1], [
  1, 1], [
  1, 1], [
  1, 1], [
  1, 1], [
  1, 1], [
  1, 1], [
  1, 1], [
  1, 1], [
  1, 1], [
  1, 1], [
  1, 1], [
  1, 1], [
  1, 1], [
  1, 1], [
  1, 1], [
  1, 1], [
  1, 1], [
  1, 1], [
  1, 1], [
  1, 1], [
  1, 1], [
  1, 1], [
  1, 1], [
  1, 1], [
  1, 0.9991076981992282], [
  1, 1], [
  1, 1], [
  1, 1], [
  1, 1], [
  0.9995776786481624, 1], [
  1, 1], [
  1, 1], [
  1, 1], [
  1, 1], [
  1, 1], [
  1, 1], [
  1, 1], [
  1, 1]]
},
 "CalcRV_in": {
  "Lambda": [-5.0265525685061569, -3.303082330132205],
 "z": [0.3879832028479516, 0.5138813839960528],
 "u": [0.016065770625252688, 0.018933616451128296],
 "mu": [0.0000124, 0.00003],
 "aor": [30, 53.37780961713591],
 "n": [0.508941267105656, 0.21444318454537837],
 "CalcAstrometry": true
},
 "CalcRV_out": {
  "RV_o_r": -0.00023314885227041044, "Y_o_r": -0.000540576731813987, "Z_o_r": -0.00002022657562838954
},
 "AnalyticLC_in": [{
  "P": [12.3456, 29.3],
 "Tmid0": [9.8765432, 15.4029],
 "ror": [0.021, 0.027],
 "aor": [30, 53.37780961713591],
 "mu": [0.0000124, 0.00003],
 "ex0": [0.01234, 0.00998],
 "ey0": [0.02345, 0.0189],
 "I0": [0.01745329, 0.0203],
 "Omega0": [0.4014257, 0.369],
 "t": [0, 2, 4, 6, 8, 10, 12, 14, 16, 18, 20, 22, 24, 26, 28, 30, 32, 34, 36, 38, 40, 42, 44, 46, 48, 50, 52, 54, 56, 58, 60, 62, 64, 66, 68, 70, 72, 74, 76, 78, 80, 82, 84, 86, 88, 90, 92, 94, 96, 98, 100],
 "u1": 0.5, "u2": 0.3, "varargin": "tRV"
}, {
  
  "P": [12.3456, 29.3],
 "Tmid0": [9.8765432, 15.4029],
 "ror": [0.021, 0.027],
 "aor": [30, 53.37780961713591],
 "mu": [0.0000124, 0.00003],
 "ex0": [0.01234, 0.00998],
 "ey0": [0.02345, 0.0189],
 "I0": [0.01745329, 0.0203],
 "Omega0": [0.4014257, 0.369],
 "t": [0, 2, 4, 6, 8, 10, 12, 14, 16, 18, 20, 22, 24, 26, 28, 30, 32, 34, 36, 38, 40, 42, 44, 46, 48, 50, 52, 54, 56, 58, 60, 62, 64, 66, 68, 70, 72, 74, 76, 78, 80, 82, 84, 86, 88, 90, 92, 94, 96, 98, 100],
 "u1": 0.5, "u2": 0.3, "varargin": 0
}],
 "AnalyticLC_out": {
  "LC": [1, 1, 1, 1, 1, 1, 1, 1, 1, 1, 1, 1, 1, 1, 1, 1, 1, 1, 1, 1, 1, 1, 1, 1, 1, 1, 1, 1, 1, 1, 1, 1, 1, 1, 1, 1, 1, 0.9991076981992282, 1, 1, 1, 1, 0.9995776786481625, 1, 1, 1, 1, 1, 1, 1, 1],
 "RV_o_r": -0.00023314885227041044, "Y_o_r": -0.000540576731813987, "Z_o_r": -0.00002022657562838954, "O": {
  "tT": [9.8765432, 22.222143199999999, 34.567743199999998, 46.9133432, 59.2589432, 71.6045432, 83.9501432, 96.29574319999999, 15.4029, 44.7029, 74.0029],
 "tRV": 0, "zT": [[0.012252176379954135, 0.010010444245908088], [
  0.012241979168857932, 0.010001277686305616], [
  0.012315552683860374, 0.009989177882630918], [
  0.012377038307803325, 0.010025503473553185], [
  0.012429298126649278, 0.010001046998629816], [
  0.012366534507559289, 0.010025720126009544], [
  0.012306933998507906, 0.00998692432793287], [
  0.012237105627464627, 0.00999710781925214], [
  0.012253694533179071, 0.00996283856671213], [
  0.012353213106346071, 0.010017270487964402], [
  0.012344571695698045, 0.010015415109982818]],
 "zRV": [0.012355472745353478, 0.009966048632324889],
 "uT": [[0.016065873131967568, 0.01893354221139676], [
  0.016065863669518764, 0.01893356378222581], [
  0.01606568220716458, 0.018933643978973768], [
  0.01606567459085903, 0.018933587674166885], [
  0.01606577544668165, 0.01893364555811443], [
  0.016065625699108897, 0.018933605492166433], [
  0.01606560565699528, 0.018933681343613768], [
  0.016065683726145805, 0.01893361378040035], [
  0.016065872816820597, 0.018933613279790267], [
  0.016065667668838287, 0.018933607329595624], [
  0.016065601919499657, 0.018933621883251519]],
 "uRV": [0.016065770625252688, 0.018933616451128296],
 "D": [[0.12671988003268665, 0.15951243346427608], [
  0.12671988003268665, 0.15951243346427608], [
  0.12671988003268665, 0.15951243346427608], [
  0.12671988003268665, 0.15951243346427608], [
  0.12671988003268665, 0.15951243346427608], [
  0.12671988003268665, 0.15951243346427608], [
  0.12671988003268665, 0.15951243346427608], [
  0.12671988003268665, 0.15951243346427608], [
  0.12671988003268665, 0.15951243346427608], [
  0.12672081004008638, 0.15951243346427608], [
  0.12672081004008638, 0.15951243346427608], [
  0.12672081004008638, 0.15951243346427608], [
  0.12672081004008638, 0.15951243346427608], [
  0.12672081004008638, 0.15951243346427608], [
  0.12672081004008638, 0.15951243346427608], [
  0.1267119087385761, 0.15951243346427608], [
  0.1267119087385761, 0.15950964626619347], [
  0.1267119087385761, 0.15950964626619347], [
  0.1267119087385761, 0.15950964626619347], [
  0.1267119087385761, 0.15950964626619347], [
  0.1267119087385761, 0.15950964626619347], [
  0.12670523392821265, 0.15950964626619347], [
  0.12670523392821265, 0.15950964626619347], [
  0.12670523392821265, 0.15950964626619347], [
  0.12670523392821265, 0.15950964626619347], [
  0.12670523392821265, 0.15950964626619347], [
  0.12670523392821265, 0.15950964626619347], [
  0.12669883048973197, 0.15950964626619347], [
  0.12669883048973197, 0.15950964626619347], [
  0.12669883048973197, 0.15950964626619347], [
  0.12669883048973197, 0.15950985350671283], [
  0.12669883048973197, 0.15950985350671283], [
  0.12669883048973197, 0.15950985350671283], [
  0.12670667218240257, 0.15950985350671283], [
  0.12670667218240257, 0.15950985350671283], [
  0.12670667218240257, 0.15950985350671283], [
  0.12670667218240257, 0.15950985350671283], [
  0.12670667218240257, 0.15950985350671283], [
  0.12670667218240257, 0.15950985350671283], [
  0.12671332366633476, 0.15950985350671283], [
  0.12671332366633476, 0.15950985350671283], [
  0.12671332366633476, 0.15950985350671283], [
  0.12671332366633476, 0.15950985350671283], [
  0.12671332366633476, 0.15950985350671283], [
  0.12671332366633476, 0.15950985350671283], [
  0.12671332366633476, 0.15950985350671283], [
  0.12672078086282666, 0.15950985350671283], [
  0.12672078086282666, 0.15950985350671283], [
  0.12672078086282666, 0.15950985350671283], [
  0.12672078086282666, 0.15950985350671283], [
  0.12672078086282666, 0.15950985350671283]],
 "Tau": [[0.002775317094550099, 0.005065206818773767], [
  0.002775317094550099, 0.005065206818773767], [
  0.002775317094550099, 0.005065206818773767], [
  0.002775317094550099, 0.005065206818773767], [
  0.002775317094550099, 0.005065206818773767], [
  0.002775317094550099, 0.005065206818773767], [
  0.002775317094550099, 0.005065206818773767], [
  0.002775317094550099, 0.005065206818773767], [
  0.002775317094550099, 0.005065206818773767], [
  0.0027753401023039067, 0.005065206818773767], [
  0.0027753401023039067, 0.005065206818773767], [
  0.0027753401023039067, 0.005065206818773767], [
  0.0027753401023039067, 0.005065206818773767], [
  0.0027753401023039067, 0.005065206818773767], [
  0.0027753401023039067, 0.005065206818773767], [
  0.002775134322569524, 0.005065206818773767], [
  0.002775134322569524, 0.005065133705098761], [
  0.002775134322569524, 0.005065133705098761], [
  0.002775134322569524, 0.005065133705098761], [
  0.002775134322569524, 0.005065133705098761], [
  0.002775134322569524, 0.005065133705098761], [
  0.002774977689172641, 0.005065133705098761], [
  0.002774977689172641, 0.005065133705098761], [
  0.002774977689172641, 0.005065133705098761], [
  0.002774977689172641, 0.005065133705098761], [
  0.002774977689172641, 0.005065133705098761], [
  0.002774977689172641, 0.005065133705098761], [
  0.002774833097339809, 0.005065133705098761], [
  0.002774833097339809, 0.005065133705098761], [
  0.002774833097339809, 0.005065133705098761], [
  0.002774833097339809, 0.005065095080382899], [
  0.002774833097339809, 0.005065095080382899], [
  0.002774833097339809, 0.005065095080382899], [
  0.0027750327018487557, 0.005065095080382899], [
  0.0027750327018487557, 0.005065095080382899], [
  0.0027750327018487557, 0.005065095080382899], [
  0.0027750327018487557, 0.005065095080382899], [
  0.0027750327018487557, 0.005065095080382899], [
  0.0027750327018487557, 0.005065095080382899], [
  0.002775191387430142, 0.005065095080382899], [
  0.002775191387430142, 0.005065095080382899], [
  0.002775191387430142, 0.005065095080382899], [
  0.002775191387430142, 0.005065095080382899], [
  0.002775191387430142, 0.005065095080382899], [
  0.002775191387430142, 0.005065095080382899], [
  0.002775191387430142, 0.005065095080382899], [
  0.0027753723401353739, 0.005065095080382899], [
  0.0027753723401353739, 0.005065095080382899], [
  0.0027753723401353739, 0.005065095080382899], [
  0.0027753723401353739, 0.005065095080382899], [
  0.0027753723401353739, 0.005065095080382899]],
 "w": [[0.5220438691154558, 0.21890334542080196], [
  0.5220438691154558, 0.21890334542080196], [
  0.5220438691154558, 0.21890334542080196], [
  0.5220438691154558, 0.21890334542080196], [
  0.5220438691154558, 0.21890334542080196], [
  0.5220438691154558, 0.21890334542080196], [
  0.5220438691154558, 0.21890334542080196], [
  0.5220438691154558, 0.21890334542080196], [
  0.5220438691154558, 0.21890334542080196], [
  0.5220368833074489, 0.21890334542080196], [
  0.5220368833074489, 0.21890334542080196], [
  0.5220368833074489, 0.21890334542080196], [
  0.5220368833074489, 0.21890334542080196], [
  0.5220368833074489, 0.21890334542080196], [
  0.5220368833074489, 0.21890334542080196], [
  0.5221121004871147, 0.21890334542080196], [
  0.5221121004871147, 0.21890202070399546], [
  0.5221121004871147, 0.21890202070399546], [
  0.5221121004871147, 0.21890202070399546], [
  0.5221121004871147, 0.21890202070399546], [
  0.5221121004871147, 0.21890202070399546], [
  0.5221659102177719, 0.21890202070399546], [
  0.5221659102177719, 0.21890202070399546], [
  0.5221659102177719, 0.21890202070399546], [
  0.5221659102177719, 0.21890202070399546], [
  0.5221659102177719, 0.21890202070399546], [
  0.5221659102177719, 0.21890202070399546], [
  0.5222194179153047, 0.21890202070399546], [
  0.5222194179153047, 0.21890202070399546], [
  0.5222194179153047, 0.21890202070399546], [
  0.5222194179153047, 0.21890449919219263], [
  0.5222194179153047, 0.21890449919219263], [
  0.5222194179153047, 0.21890449919219263], [
  0.522146888909835, 0.21890449919219263], [
  0.522146888909835, 0.21890449919219263], [
  0.522146888909835, 0.21890449919219263], [
  0.522146888909835, 0.21890449919219263], [
  0.522146888909835, 0.21890449919219263], [
  0.522146888909835, 0.21890449919219263], [
  0.5220916729987855, 0.21890449919219263], [
  0.5220916729987855, 0.21890449919219263], [
  0.5220916729987855, 0.21890449919219263], [
  0.5220916729987855, 0.21890449919219263], [
  0.5220916729987855, 0.21890449919219263], [
  0.5220916729987855, 0.21890449919219263], [
  0.5220916729987855, 0.21890449919219263], [
  0.5220304788779714, 0.21890449919219263], [
  0.5220304788779714, 0.21890449919219263], [
  0.5220304788779714, 0.21890449919219263], [
  0.5220304788779714, 0.21890449919219263], [
  0.5220304788779714, 0.21890449919219263]],
 "d": [[29.61587754410602, 52.82454657751092], [
  29.61587754410602, 52.82454657751092], [
  29.61587754410602, 52.82454657751092], [
  29.61587754410602, 52.82454657751092], [
  29.61587754410602, 52.82454657751092], [
  29.61587754410602, 52.82454657751092], [
  29.61587754410602, 52.82454657751092], [
  29.61587754410602, 52.82454657751092], [
  29.61587754410602, 52.82454657751092], [
  29.61604230169987, 52.82454657751092], [
  29.61604230169987, 52.82454657751092], [
  29.61604230169987, 52.82454657751092], [
  29.61604230169987, 52.82454657751092], [
  29.61604230169987, 52.82454657751092], [
  29.61604230169987, 52.82454657751092], [
  29.61391529767007, 52.82454657751092], [
  29.61391529767007, 52.82570878312685], [
  29.61391529767007, 52.82570878312685], [
  29.61391529767007, 52.82570878312685], [
  29.61391529767007, 52.82570878312685], [
  29.61391529767007, 52.82570878312685], [
  29.612480272339675, 52.82570878312685], [
  29.612480272339675, 52.82570878312685], [
  29.612480272339675, 52.82570878312685], [
  29.612480272339675, 52.82570878312685], [
  29.612480272339675, 52.82570878312685], [
  29.612480272339675, 52.82570878312685], [
  29.61096696514055, 52.82570878312685], [
  29.61096696514055, 52.82570878312685], [
  29.61096696514055, 52.82570878312685], [
  29.61096696514055, 52.82527772480565], [
  29.61096696514055, 52.82527772480565], [
  29.61096696514055, 52.82527772480565], [
  29.613097019962276, 52.82527772480565], [
  29.613097019962276, 52.82527772480565], [
  29.613097019962276, 52.82527772480565], [
  29.613097019962276, 52.82527772480565], [
  29.613097019962276, 52.82527772480565], [
  29.613097019962276, 52.82527772480565], [
  29.614603703403657, 52.82527772480565], [
  29.614603703403657, 52.82527772480565], [
  29.614603703403657, 52.82527772480565], [
  29.614603703403657, 52.82527772480565], [
  29.614603703403657, 52.82527772480565], [
  29.614603703403657, 52.82527772480565], [
  29.614603703403657, 52.82527772480565], [
  29.616236998673974, 52.82527772480565], [
  29.616236998673974, 52.82527772480565], [
  29.616236998673974, 52.82527772480565], [
  29.616236998673974, 52.82527772480565], [
  29.616236998673974, 52.82527772480565]],
 "b": [[0.20196292170594147, 0.38674416298345756], [
  0.20196292170594147, 0.38674416298345756], [
  0.20196292170594147, 0.38674416298345756], [
  0.20196292170594147, 0.38674416298345756], [
  0.20196292170594147, 0.38674416298345756], [
  0.20196292170594147, 0.38674416298345756], [
  0.20196292170594147, 0.38674416298345756], [
  0.20196292170594147, 0.38674416298345756], [
  0.20196292170594147, 0.38674416298345756], [
  0.20196519007141784, 0.38674416298345756], [
  0.20196519007141784, 0.38674416298345756], [
  0.20196519007141784, 0.38674416298345756], [
  0.20196519007141784, 0.38674416298345756], [
  0.20196519007141784, 0.38674416298345756], [
  0.20196519007141784, 0.38674416298345756], [
  0.2019557966233618, 0.38674416298345756], [
  0.2019557966233618, 0.38674750735038906], [
  0.2019557966233618, 0.38674750735038906], [
  0.2019557966233618, 0.38674750735038906], [
  0.2019557966233618, 0.38674750735038906], [
  0.2019557966233618, 0.38674750735038906], [
  0.20194677042534607, 0.38674750735038906], [
  0.20194677042534607, 0.38674750735038906], [
  0.20194677042534607, 0.38674750735038906], [
  0.20194677042534607, 0.38674750735038906], [
  0.20194677042534607, 0.38674750735038906], [
  0.20194677042534607, 0.38674750735038906], [
  0.20194295838351043, 0.38674750735038906], [
  0.20194295838351043, 0.38674750735038906], [
  0.20194295838351043, 0.38674750735038906], [
  0.20194295838351043, 0.3867376975201834], [
  0.20194295838351043, 0.3867376975201834], [
  0.20194295838351043, 0.3867376975201834], [
  0.20196693108977549, 0.3867376975201834], [
  0.20196693108977549, 0.3867376975201834], [
  0.20196693108977549, 0.3867376975201834], [
  0.20196693108977549, 0.3867376975201834], [
  0.20196693108977549, 0.3867376975201834], [
  0.20196693108977549, 0.3867376975201834], [
  0.20197815255442537, 0.3867376975201834], [
  0.20197815255442537, 0.3867376975201834], [
  0.20197815255442537, 0.3867376975201834], [
  0.20197815255442537, 0.3867376975201834], [
  0.20197815255442537, 0.3867376975201834], [
  0.20197815255442537, 0.3867376975201834], [
  0.20197815255442537, 0.3867376975201834], [
  0.20199333316712712, 0.3867376975201834], [
  0.20199333316712712, 0.3867376975201834], [
  0.20199333316712712, 0.3867376975201834], [
  0.20199333316712712, 0.3867376975201834], [
  0.20199333316712712, 0.3867376975201834]],
 "AssociatedTmid": [[9.876471490373218, 15.402851069671164], [
  9.876471490373218, 15.402851069671164], [
  9.876471490373218, 15.402851069671164], [
  9.876471490373218, 15.402851069671164], [
  9.876471490373218, 15.402851069671164], [
  9.876471490373218, 15.402851069671164], [
  9.876471490373218, 15.402851069671164], [
  9.876471490373218, 15.402851069671164], [
  9.876471490373218, 15.402851069671164], [
  22.222175383006819, 15.402851069671164], [
  22.222175383006819, 15.402851069671164], [
  22.222175383006819, 15.402851069671164], [
  22.222175383006819, 15.402851069671164], [
  22.222175383006819, 15.402851069671164], [
  22.222175383006819, 15.402851069671164], [
  34.568141969889449, 15.402851069671164], [
  34.568141969889449, 44.70285348604103], [
  34.568141969889449, 44.70285348604103], [
  34.568141969889449, 44.70285348604103], [
  34.568141969889449, 44.70285348604103], [
  34.568141969889449, 44.70285348604103], [
  46.913538305619258, 44.70285348604103], [
  46.913538305619258, 44.70285348604103], [
  46.913538305619258, 44.70285348604103], [
  46.913538305619258, 44.70285348604103], [
  46.913538305619258, 44.70285348604103], [
  46.913538305619258, 44.70285348604103], [
  59.258848564079617, 44.70285348604103], [
  59.258848564079617, 44.70285348604103], [
  59.258848564079617, 44.70285348604103], [
  59.258848564079617, 74.00294720744906], [
  59.258848564079617, 74.00294720744906], [
  59.258848564079617, 74.00294720744906], [
  71.60425828720563, 74.00294720744906], [
  71.60425828720563, 74.00294720744906], [
  71.60425828720563, 74.00294720744906], [
  71.60425828720563, 74.00294720744906], [
  71.60425828720563, 74.00294720744906], [
  71.60425828720563, 74.00294720744906], [
  83.94982499607771, 74.00294720744906], [
  83.94982499607771, 74.00294720744906], [
  83.94982499607771, 74.00294720744906], [
  83.94982499607771, 74.00294720744906], [
  83.94982499607771, 74.00294720744906], [
  83.94982499607771, 74.00294720744906], [
  83.94982499607771, 74.00294720744906], [
  96.29588174171887, 74.00294720744906], [
  96.29588174171887, 74.00294720744906], [
  96.29588174171887, 74.00294720744906], [
  96.29588174171887, 74.00294720744906], [
  96.29588174171887, 74.00294720744906]],
 "AssociatedInd": [[1, 1], [
  1, 1], [
  1, 1], [
  1, 1], [
  1, 1], [
  1, 1], [
  1, 1], [
  1, 1], [
  1, 1], [
  2, 1], [
  2, 1], [
  2, 1], [
  2, 1], [
  2, 1], [
  2, 1], [
  3, 1], [
  3, 2], [
  3, 2], [
  3, 2], [
  3, 2], [
  3, 2], [
  4, 2], [
  4, 2], [
  4, 2], [
  4, 2], [
  4, 2], [
  4, 2], [
  5, 2], [
  5, 2], [
  5, 2], [
  5, 3], [
  5, 3], [
  5, 3], [
  6, 3], [
  6, 3], [
  6, 3], [
  6, 3], [
  6, 3], [
  6, 3], [
  7, 3], [
  7, 3], [
  7, 3], [
  7, 3], [
  7, 3], [
  7, 3], [
  7, 3], [
  8, 3], [
  8, 3], [
  8, 3], [
  8, 3], [
  8, 3]],
 "AllLC": [[1, 1], [
  1, 1], [
  1, 1], [
  1, 1], [
  1, 1], [
  1, 1], [
  1, 1], [
  1, 1], [
  1, 1], [
  1, 1], [
  1, 1], [
  1, 1], [
  1, 1], [
  1, 1], [
  1, 1], [
  1, 1], [
  1, 1], [
  1, 1], [
  1, 1], [
  1, 1], [
  1, 1], [
  1, 1], [
  1, 1], [
  1, 1], [
  1, 1], [
  1, 1], [
  1, 1], [
  1, 1], [
  1, 1], [
  1, 1], [
  1, 1], [
  1, 1], [
  1, 1], [
  1, 1], [
  1, 1], [
  1, 1], [
  1, 1], [
  1, 0.9991076981992282], [
  1, 1], [
  1, 1], [
  1, 1], [
  1, 1], [
  0.9995776786481625, 1], [
  1, 1], [
  1, 1], [
  1, 1], [
  1, 1], [
  1, 1], [
  1, 1], [
  1, 1], [
  1, 1]],
 "TmidActualCell": [[9.876471490373218, 22.222175383006819, 34.568141969889449, 46.913538305619258, 59.258848564079617, 71.60425828720563, 83.94982499607771, 96.29588174171887], [
  15.402851069671164, 44.70285348604103, 74.00294720744906]],
 "free_e_T": [[0.012339557547914512, 0.009979959850555533], [
  0.012339004473772507, 0.009979909666475853], [
  0.012338451385660646, 0.009979859485067766], [
  0.012337898283580484, 0.009979809306330912], [
  0.012337345167533562, 0.009979759130264915], [
  0.012336792037521437, 0.009979708956869416], [
  0.012336238893545657, 0.009979658786144045], [
  0.012335685735607774, 0.009979608618088432], [
  0.012339309972768508, 0.009979937385935924], [
  0.012337997315900101, 0.009979818290489164], [
  0.012336684580360637, 0.009979699210086745]],
 "free_I_T": [[0.01606581768755532, 0.018933582849494394], [
  0.016065791875630357, 0.01893359085263363], [
  0.01606576607363741, 0.018933598852695259], [
  0.016065740281576616, 0.018933606849679237], [
  0.016065714499448087, 0.01893361484358553], [
  0.01606568872725193, 0.0189336228344141], [
  0.01606566296498827, 0.01893363082216492], [
  0.016065637212657234, 0.018933638806837944], [
  0.01606580613193502, 0.01893358643238224], [
  0.016065744898838928, 0.01893360541806908], [
  0.01606568372168742, 0.01893362438642051]],
 "free_e_RV": [0.012339999999999999, 0.00998],
 "free_I_RV": [0.016065838344378484, 0.018933576444726157],
 "TTVCell": [[-0.00007170962678249437, 0.000032183006821283077, 0.0003987698894539214, 0.00019510561925855315, -0.00009463592038706828, -0.0002849127943645689, -0.000318203922296645, 0.0001385417188766194], [
  -0.000048930328837349959, -0.00004651395897329442, 0.000047207449053256907]],
 "dzCell": [[-0.00008738116796037676, -0.00009702530491457447, -0.000022898701800273099, 0.00003914002422284154, 0.00009195295911571707, 0.00002974247003785153, -0.000029304895037751583, -0.00009858010814314693], [
  -0.000017098819223792847, 0.00003745219747523768, 0.000035715899896072748]],
 "duCell": [[5.544441224439665e-8, 7.179388840721299e-8, -8.386647283206802e-8, -6.569071758452891e-8, 6.094723356576214e-8, -6.302814303479824e-8, -5.730799299146121e-8, 4.651348856955105e-8], [
  2.684740802506323e-8, 1.911526543296742e-9, -2.5031689906382606e-9]],
 "dLambdaCell": [[-0.0000566545500414017, -0.000018655842746272589, -0.000025377469963391905, 0.00007633026008161808, 0.00003819265483743017, -0.000036128079347689436, -0.0000051012406031541769, -0.000055820100921910308], [
  0.000014759772846115725, -0.00003550373938284271, 0.000027428189384392839]],
 "zfreeCell": [[0.012339557547914512, 0.012339004473772507, 0.012338451385660646, 0.012337898283580484, 0.012337345167533562, 0.012336792037521437, 0.012336238893545657, 0.012335685735607774], [
  0.009979937385935924, 0.009979818290489164, 0.009979699210086745]],
 "dbdt": [2.963114685375551e-7, -1.1033213778353226e-7],
 "b0": [0.2019482767195627, 0.3867480547845321],
 "Lambda_T": [[0, -1.1850895511260067], [
  6.283185307179585, 1.4623402279974159], [
  12.56637061435917, 4.109770007120838], [
  18.84955592153876, 6.7571997862442629], [
  25.132741228718346, 9.404629565367685], [
  31.41592653589793, 12.052059344491108], [
  37.69911184307752, 14.699489123614532], [
  43.982297150257107, 17.34691890273795], [
  2.8125910322699587, 0], [
  17.724570158465679, 6.283185307179585], [
  32.6365492846614, 12.56637061435917]],
 "P": [12.3456, 29.3],
 "BeginIdx": [1, 9],
 "EndIdx": [8, 11],
 "Ntr": [8, 3]
}
}
}
