# This file was produced by samtools stats (1.16.1+htslib-1.16) and can be plotted using plot-bamstats
# This file contains statistics for all reads.
# The command line was:  stats PCR2_ANC.assembled.fastq_sorted.bam
# CHK, Checksum	[2]Read Names	[3]Sequences	[4]Qualities
# CHK, CRC32 of reads which passed filtering followed by addition (32bit overflow)
CHK	8ed66f56	8ad344bb	4e6bff3c
# Summary Numbers. Use `grep ^SN | cut -f 2-` to extract this part.
SN	raw total sequences:	463383	# excluding supplementary and secondary reads
SN	filtered sequences:	0
SN	sequences:	463383
SN	is sorted:	1
SN	1st fragments:	463383
SN	last fragments:	0
SN	reads mapped:	463314
SN	reads mapped and paired:	0	# paired-end technology bit set + both mates mapped
SN	reads unmapped:	69
SN	reads properly paired:	0	# proper-pair bit set
SN	reads paired:	0	# paired-end technology bit set
SN	reads duplicated:	0	# PCR or optical duplicate bit set
SN	reads MQ0:	0	# mapped and MQ=0
SN	reads QC failed:	0
SN	non-primary alignments:	0
SN	supplementary alignments:	15
SN	total length:	80647874	# ignores clipping
SN	total first fragment length:	80647874	# ignores clipping
SN	total last fragment length:	0	# ignores clipping
SN	bases mapped:	80636460	# ignores clipping
SN	bases mapped (cigar):	72231481	# more accurate
SN	bases trimmed:	0
SN	bases duplicated:	0
SN	mismatches:	11624750	# from NM fields
SN	error rate:	1.609374e-01	# mismatches / bases mapped (cigar)
SN	average length:	174
SN	average first fragment length:	174
SN	average last fragment length:	0
SN	maximum length:	277
SN	maximum first fragment length:	277
SN	maximum last fragment length:	0
SN	average quality:	38.8
SN	insert size average:	0.0
SN	insert size standard deviation:	0.0
SN	inward oriented pairs:	0
SN	outward oriented pairs:	0
SN	pairs with other orientation:	0
SN	pairs on different chromosomes:	0
SN	percentage of properly paired reads (%):	0.0
# First Fragment Qualities. Use `grep ^FFQ | cut -f 2-` to extract this part.
# Columns correspond to qualities and rows to cycles. First column is the cycle number.
FFQ	1	0	0	0	0	0	0	0	0	0	0	0	0	0	0	0	0	6392	1	5027	0	0	0	0	0	0	0	0	0	0	10404	3419	993	106845	153278	156797	19650	286	0	0	0	291	0
FFQ	2	0	0	0	0	0	0	0	0	0	0	0	0	0	0	0	0	5231	0	3074	0	0	0	0	0	0	0	0	0	0	8250	3851	2051	89695	153913	169295	27265	414	0	0	0	344	0
FFQ	3	0	0	0	0	0	0	0	0	0	0	0	0	0	0	0	0	6275	1	3740	0	0	0	0	0	0	0	0	0	0	7334	5266	3423	87629	152275	168543	28088	415	0	0	0	394	0
FFQ	4	0	0	0	0	0	0	0	0	0	0	0	0	0	0	0	0	5686	0	3246	0	0	0	0	0	0	0	0	0	1	6739	5023	3471	88601	154170	168390	27223	385	1	0	0	447	0
FFQ	5	0	0	0	0	0	0	0	0	0	0	0	0	0	0	0	0	8085	0	4327	0	0	0	0	0	0	0	0	1	0	7255	5629	3447	90662	151010	165974	26111	387	0	0	0	495	0
FFQ	6	0	0	0	0	0	0	0	0	0	0	0	0	0	0	44	9	7054	71	2890	1518	1160	0	0	0	0	0	0	0	0	3699	2598	4560	21512	63738	67063	29746	153	257020	0	0	548	0
FFQ	7	0	0	0	0	0	0	0	0	0	0	0	0	0	0	105	118	6718	294	2305	1354	990	0	0	0	0	0	0	12	0	3573	2436	4212	21332	64548	68866	29794	153	255987	0	0	586	0
FFQ	8	0	0	0	0	0	0	0	0	0	0	0	0	27	0	170	183	8220	851	2729	1905	1450	0	0	0	7	0	0	16	0	3848	3136	5140	21448	63557	67990	30506	189	251409	0	0	602	0
FFQ	9	0	0	0	0	0	0	0	0	0	0	0	0	28	0	68	134	3951	179	902	314	221	0	0	0	17	1	17	29	5	3854	1873	3776	22112	64461	69305	30228	145	261131	0	0	632	0
FFQ	10	0	0	0	0	0	0	0	0	0	0	0	0	32	0	109	249	4528	285	545	327	144	0	0	0	13	0	16	45	15	2625	1521	3499	16557	64853	74787	29248	201	263129	0	0	655	0
FFQ	11	0	0	0	0	0	0	0	0	0	0	0	0	44	1	97	186	1746	347	67	273	104	0	0	0	72	9	36	40	10	5146	850	1876	39487	123521	105077	32390	184	151113	0	0	707	0
FFQ	12	0	0	0	0	0	0	0	0	0	0	0	0	12	0	31	143	1521	212	1	288	167	0	0	0	20	5	23	14	9	2489	836	2436	31527	126455	101032	35452	135	159832	0	0	743	0
FFQ	13	0	0	0	0	0	0	0	0	0	0	0	0	8	1	39	78	1013	185	3	103	4	0	0	0	18	2	11	11	15	29	89	171	4032	1400	1296	262	16858	19520	417446	0	789	0
FFQ	14	0	0	0	0	0	0	0	0	0	0	0	0	8	4	60	255	3483	373	25	403	3	0	0	0	11	2	0	6	0	7	1676	12	4054	3439	5970	3038	12598	28541	398588	0	827	0
FFQ	15	0	0	0	0	0	0	0	0	0	0	0	0	8	2	57	200	4262	146	24	237	323	2	0	0	18	2	4	11	1	5	204	10	5194	3740	2231	4376	16361	30166	394933	0	866	0
FFQ	16	0	0	0	0	0	0	0	0	0	0	0	0	8	3	54	98	7145	232	1632	368	1548	5	0	0	14	2	3	4	2	6	31	15	2621	8011	4150	6429	3016	40017	387036	0	933	0
FFQ	17	0	0	0	0	0	0	0	0	0	0	0	0	99	3	251	1104	3716	609	1325	6	764	6	0	0	30	2	37	43	22	47	1271	142	4969	3569	5126	3743	14165	29681	391664	0	989	0
FFQ	18	0	0	0	0	0	0	0	0	0	0	0	0	19	19	112	1092	3071	799	1844	3	257	2	0	0	46	7	16	36	2	50	1560	14	9793	3104	5536	1279	32788	20938	379823	0	1173	0
FFQ	19	0	0	0	0	0	0	0	0	0	0	0	0	30	14	179	2889	2055	1294	7	6	11	0	0	0	28	8	13	34	0	42	1360	46	13117	311	4191	2	51787	17979	366616	1	1363	0
FFQ	20	0	0	0	0	0	0	0	0	0	0	0	0	63	9	328	3186	379	699	5	2	1	0	0	0	34	8	13	46	25	80	1067	175	12008	191	3181	0	47247	14338	378725	0	1573	0
FFQ	21	0	0	0	0	0	0	0	0	0	0	0	0	24	4	164	3972	16	477	1	3	3	0	0	0	34	10	14	47	10	97	1412	199	11854	233	4065	0	45276	11038	381245	0	3185	0
FFQ	22	0	0	0	0	0	0	0	0	0	0	0	0	24	17	158	3660	24	415	5	96	1	1	0	0	23	8	5	19	6	34	1369	64	7667	327	5467	4	27892	13417	351444	4	51232	0
FFQ	23	0	0	0	0	0	0	0	0	0	0	0	0	19	14	106	2677	27	423	12	175	8	1	0	0	17	1	4	21	2	21	343	77	6491	525	3463	19	20270	14753	140121	176189	97604	0
FFQ	24	0	0	0	0	0	0	0	0	0	0	0	0	32	26	17	2166	84	182	8	125	3	0	0	0	10	4	3	24	4	25	142	19	2700	778	3651	14	1400	18329	30966	256241	146430	0
FFQ	25	0	0	0	0	0	0	0	0	0	0	0	0	4	4	16	4008	76	468	10	236	1	0	0	0	4	1	0	16	1	16	168	112	4441	422	5118	40	1153	17046	21281	158372	250369	0
FFQ	26	0	0	0	0	0	0	0	0	0	0	0	0	3	6	11	2093	145	519	11	11	3	0	0	0	3	1	3	17	6	17	150	72	2613	672	2150	86	964	7891	6872	88501	350563	0
FFQ	27	0	0	0	0	0	0	0	0	0	0	0	0	0	0	1	10	94	34	20	1	15	0	0	0	0	1	1	3	4	15	43	98	731	488	88	111	57	287	222	1834	459225	0
FFQ	28	0	0	0	0	0	0	0	0	0	0	0	0	0	0	0	2	33	6	6	0	11	0	0	0	0	0	0	1	2	12	24	82	224	117	10	50	31	162	136	1102	461372	0
FFQ	29	0	0	0	0	0	0	0	0	0	0	0	0	0	0	1	0	30	8	1	0	7	0	0	0	1	1	1	2	7	17	42	266	125	35	14	55	23	149	123	1109	461366	0
FFQ	30	0	0	0	0	0	0	0	0	0	0	0	0	0	0	1	3	45	50	6	0	22	0	0	0	3	1	1	13	1	22	58	391	272	77	28	172	28	271	232	1406	460280	0
FFQ	31	0	0	0	0	0	0	0	0	0	0	0	0	0	0	2	7	58	57	2	0	27	0	0	0	0	0	2	7	57	25	373	411	347	89	71	171	34	261	250	1655	459477	0
FFQ	32	0	0	0	0	0	0	0	0	0	0	0	0	0	0	2	16	49	55	3	0	13	0	0	0	1	0	1	1	26	42	187	203	432	61	122	84	57	213	241	1730	459844	0
FFQ	33	0	0	0	0	0	0	0	0	0	0	0	0	1	0	4	23	39	23	3	0	3	0	0	0	1	0	0	2	28	16	236	150	254	22	125	44	45	156	357	1406	460445	0
FFQ	34	0	0	0	0	0	0	0	0	0	0	0	0	0	0	2	12	23	15	6	0	0	0	0	0	1	1	1	0	1	16	44	112	140	19	94	32	44	100	383	981	461356	0
FFQ	35	0	0	0	0	0	0	0	0	0	0	0	0	0	0	1	0	3	20	2	0	1	0	0	0	1	0	2	4	0	6	12	28	47	27	43	26	23	92	570	425	462050	0
FFQ	36	0	0	0	0	0	0	0	0	0	0	0	0	1	0	1	2	4	23	3	0	1	0	0	0	0	0	2	5	4	5	22	25	31	30	40	25	27	76	515	460	462081	0
FFQ	37	0	0	0	0	0	0	0	0	0	0	0	0	0	0	1	2	22	16	5	0	5	0	0	0	1	0	8	3	3	17	60	93	85	50	44	41	42	217	752	820	461096	0
FFQ	38	0	0	0	0	0	0	0	0	0	0	0	0	0	0	3	3	18	15	4	0	2	0	0	0	0	0	5	3	10	32	129	183	57	36	54	42	30	246	754	1839	459918	0
FFQ	39	0	0	0	0	0	0	0	0	0	0	0	0	0	0	1	0	31	3	6	0	10	0	0	0	0	1	0	0	9	6	74	9	195	59	30	106	65	288	456	1876	460158	0
FFQ	40	0	0	0	0	0	0	0	0	0	0	0	0	0	0	0	0	58	2	10	0	8	0	0	0	0	0	0	2	6	17	241	7	95	59	49	14	31	213	177	1251	461143	0
FFQ	41	0	0	0	0	0	0	0	0	0	0	0	0	0	0	0	0	3	3	6	0	17	0	0	0	0	0	1	0	0	2	3	2	12	19	4	9	5	44	38	515	462700	0
FFQ	42	0	0	0	0	0	0	0	0	0	0	0	0	0	0	0	0	0	2	0	0	10	0	0	0	0	0	0	1	0	2	4	3	7	24	3	7	5	46	44	612	462613	0
FFQ	43	0	0	0	0	0	0	0	0	0	0	0	0	0	0	0	0	1	5	4	0	12	0	0	0	1	0	0	0	0	1	5	6	16	33	7	22	4	40	53	686	462487	0
FFQ	44	0	0	0	0	0	0	0	0	0	0	0	0	0	0	0	2	18	25	4	0	9	0	0	0	0	0	0	0	0	4	8	17	105	124	44	26	18	196	259	1267	461257	0
FFQ	45	0	0	0	0	0	0	0	0	0	0	0	0	0	0	0	3	18	17	14	0	4	0	0	0	0	0	0	1	2	3	11	49	99	283	18	53	42	190	281	1388	460907	0
FFQ	46	0	0	0	0	0	0	0	0	0	0	0	0	0	0	0	1	66	14	3	0	8	0	0	0	1	0	1	2	13	10	44	293	167	255	49	99	38	264	296	1462	460297	0
FFQ	47	0	0	0	0	0	0	0	0	0	0	0	0	0	0	0	0	76	17	13	0	6	0	0	0	0	0	0	2	6	5	31	155	123	491	25	120	49	277	289	1702	459996	0
FFQ	48	0	0	0	0	0	0	0	0	0	0	0	0	0	0	1	0	25	4	11	0	4	0	0	0	0	0	0	5	1	0	21	105	41	104	9	63	32	154	267	1644	460892	0
FFQ	49	0	0	0	0	0	0	0	0	0	0	0	0	0	0	0	0	19	13	8	2	4	0	0	0	0	0	0	1	0	1	22	3	33	157	1	43	22	134	201	1509	461210	0
FFQ	50	0	0	0	0	0	0	0	0	0	0	0	0	0	0	0	0	1	4	2	1	2	0	0	0	1	0	0	0	0	0	3	7	13	22	5	8	8	29	37	473	462767	0
FFQ	51	0	0	0	0	0	0	0	0	0	0	0	0	0	0	0	1	3	4	4	0	3	0	0	0	0	0	0	0	0	1	6	3	14	20	6	12	1	38	38	578	462650	0
FFQ	52	0	0	0	0	0	0	0	0	0	0	0	0	0	0	0	3	28	8	9	0	2	0	0	0	0	0	0	4	0	7	5	14	141	66	30	27	49	176	221	1046	461546	0
FFQ	53	0	0	0	0	0	0	0	0	0	0	0	0	0	0	1	0	26	6	10	0	1	0	0	0	0	1	0	2	0	2	20	42	317	68	38	34	32	191	248	1239	461104	0
FFQ	54	0	0	0	0	0	0	0	0	0	0	0	0	0	0	0	1	41	3	5	1	0	0	0	0	0	0	0	3	3	9	203	63	390	72	56	31	43	267	236	1484	460471	0
FFQ	55	0	0	0	0	0	0	0	0	0	0	0	0	0	0	1	0	20	8	6	0	5	0	0	0	0	0	2	1	3	4	107	28	188	105	19	31	40	168	171	926	461549	0
FFQ	56	0	0	0	0	0	0	0	0	0	0	0	0	0	0	0	0	33	11	3	0	6	0	0	0	0	0	0	2	1	3	199	16	79	42	13	39	23	157	302	1439	461014	0
FFQ	57	0	0	0	0	0	0	0	0	0	0	0	0	0	0	0	0	2	4	2	1	16	0	0	0	0	0	0	0	0	1	3	1	7	26	8	28	10	79	287	1790	461117	0
FFQ	58	0	0	0	0	0	0	0	0	0	0	0	0	0	0	0	0	9	42	0	2	27	0	0	0	1	0	0	1	1	9	8	19	40	277	26	40	38	221	228	1824	460569	0
FFQ	59	0	0	0	0	0	0	0	0	0	0	0	0	0	0	4	4	15	56	1	5	15	0	0	0	0	0	0	2	8	21	31	260	53	238	22	32	56	196	496	1122	460745	0
FFQ	60	0	0	0	0	0	0	0	0	0	0	0	0	0	0	3	0	12	32	3	7	11	0	0	0	0	0	0	1	0	7	16	105	50	271	25	53	76	186	484	534	461506	0
FFQ	61	0	0	0	0	0	0	0	0	0	0	0	0	0	0	1	8	13	39	11	7	12	0	0	0	0	0	0	1	6	14	38	269	61	171	26	20	83	136	516	434	461516	0
FFQ	62	0	0	0	0	0	0	0	0	0	0	0	0	0	0	0	0	26	30	10	8	10	0	0	0	0	0	1	2	0	5	14	12	137	268	38	72	13	149	168	903	461516	0
FFQ	63	0	0	0	0	0	0	0	0	0	0	0	0	0	0	0	0	49	38	16	4	15	0	0	0	0	0	1	2	2	6	15	24	331	617	70	92	44	237	153	900	460765	0
FFQ	64	0	0	0	0	0	0	0	0	0	0	0	0	0	0	0	0	41	32	23	3	5	0	0	0	1	0	0	1	0	4	14	32	452	638	96	96	25	183	118	755	460862	0
FFQ	65	0	0	0	0	0	0	0	0	0	0	0	0	0	0	0	0	46	11	10	5	2	0	0	0	1	0	0	0	1	4	10	26	373	468	75	99	39	174	140	746	461151	0
FFQ	66	0	0	0	0	0	0	0	0	0	0	0	0	0	0	0	0	43	9	5	1	4	0	0	0	0	0	0	0	0	2	7	13	261	205	43	101	25	138	124	658	461742	0
FFQ	67	0	0	0	0	0	0	0	0	0	0	0	0	0	0	0	0	40	15	8	2	17	0	0	0	1	0	0	4	0	10	7	24	215	509	53	168	40	163	135	779	461191	0
FFQ	68	0	0	0	0	0	0	0	0	0	0	0	0	0	0	0	0	44	37	12	2	10	0	0	0	0	0	1	1	2	16	14	18	49	670	22	259	39	193	186	601	461205	0
FFQ	69	0	0	0	0	0	0	0	0	0	0	0	0	0	0	0	0	1	3	0	1	14	0	0	0	0	0	0	0	1	0	0	2	2	23	26	124	14	140	203	617	462210	0
FFQ	70	0	0	0	0	0	0	0	0	0	0	0	0	0	0	0	1	4	73	0	10	65	0	0	0	0	0	0	0	0	11	2	25	38	71	452	59	80	279	161	640	461410	0
FFQ	71	0	0	0	0	0	0	0	0	0	0	0	0	0	0	0	0	5	88	1	9	60	0	0	0	2	0	0	3	1	8	6	43	51	117	684	61	111	330	177	698	460926	0
FFQ	72	0	0	0	0	0	0	0	0	0	0	0	0	0	0	0	0	2	59	0	0	27	0	0	0	0	0	1	0	0	9	7	10	29	123	258	85	42	188	213	1018	461310	0
FFQ	73	0	0	0	0	0	0	0	0	0	0	0	0	0	0	0	0	10	95	2	3	42	0	0	0	1	0	0	3	0	11	10	44	94	521	446	84	146	299	166	821	460583	0
FFQ	74	0	0	0	0	0	0	0	0	0	0	0	0	0	0	0	0	8	38	0	6	46	0	0	0	0	0	0	2	0	8	14	42	101	489	40	85	141	170	150	618	461423	0
FFQ	75	0	0	0	0	0	0	0	0	0	0	0	0	0	0	0	1	29	11	3	3	2	0	0	0	0	1	0	5	3	7	48	46	445	125	32	108	107	149	140	480	461636	0
FFQ	76	0	0	0	0	0	0	0	0	0	0	0	0	0	0	0	1	35	9	4	2	18	0	0	0	3	0	2	2	4	7	62	27	523	81	33	88	97	163	176	601	461443	0
FFQ	77	0	0	0	0	0	0	0	0	0	0	0	0	0	0	1	1	54	33	6	1	16	0	0	0	2	0	0	3	12	25	450	134	689	95	101	160	123	145	143	795	460392	0
FFQ	78	0	0	0	0	0	0	0	0	0	0	0	0	0	0	0	1	40	68	2	3	38	0	0	0	2	0	1	3	3	14	502	150	155	62	176	144	54	210	330	1564	459859	0
FFQ	79	0	0	0	0	0	0	0	0	0	0	0	0	0	0	1	0	31	39	1	2	40	0	0	0	0	0	0	4	10	24	512	260	38	53	212	110	45	201	232	1167	460399	0
FFQ	80	0	0	0	0	0	0	0	0	0	0	0	0	0	0	2	1	12	7	0	3	21	0	0	0	0	0	1	2	6	16	192	88	18	59	56	49	45	192	341	1038	461232	0
FFQ	81	0	0	0	0	0	0	0	0	0	0	0	0	0	0	1	3	12	6	4	2	15	0	0	0	1	1	2	1	6	10	86	41	13	128	45	29	36	141	210	525	462063	0
FFQ	82	0	0	0	0	0	0	0	0	0	0	0	0	0	0	3	0	23	4	7	0	6	0	0	0	0	0	0	1	7	17	194	13	15	99	40	16	28	222	362	1032	461292	0
FFQ	83	0	0	0	0	0	0	0	0	0	0	0	0	0	0	10	5	11	2	10	1	6	0	0	0	0	0	7	3	85	32	80	17	16	94	26	33	65	144	422	953	461359	0
FFQ	84	0	0	0	0	0	0	0	0	0	0	0	0	0	0	18	9	15	3	3	1	5	0	0	0	1	0	5	3	199	83	87	21	20	31	15	3	127	98	363	473	461798	0
FFQ	85	0	0	0	0	0	0	0	0	0	0	0	0	0	0	12	4	65	4	42	1	9	0	0	0	0	2	5	2	191	66	257	54	105	92	63	4	96	248	362	799	460898	0
FFQ	86	0	0	0	0	0	0	0	0	0	0	0	0	0	0	4	3	59	4	76	1	11	0	0	0	0	0	6	15	134	250	298	40	148	85	59	3	96	212	257	797	460823	0
FFQ	87	0	0	0	0	0	0	0	0	0	0	0	0	0	0	17	4	61	3	40	1	0	0	0	0	1	0	2	3	45	315	414	64	145	47	46	5	124	224	760	986	460074	0
FFQ	88	0	0	0	0	0	0	0	0	0	0	0	0	0	0	27	13	86	16	22	5	2	0	0	0	0	0	6	5	129	427	941	34	341	39	68	14	150	56	889	55	460056	0
FFQ	89	0	0	0	0	0	0	0	0	0	0	0	0	0	0	16	12	98	15	7	4	1	0	0	0	0	0	1	2	65	99	973	43	326	38	83	13	231	40	922	39	460353	0
FFQ	90	0	0	0	0	0	0	0	0	0	0	0	0	0	0	9	4	58	15	10	9	0	0	0	0	0	0	2	5	40	79	461	70	33	61	13	9	192	45	728	86	461452	0
FFQ	91	0	0	0	0	0	0	0	0	0	0	0	0	0	0	3	21	37	5	14	2	1	0	0	0	2	1	4	2	14	50	296	89	96	42	32	6	83	85	254	243	461999	0
FFQ	92	0	0	0	0	0	0	0	0	0	0	0	0	0	0	6	18	42	20	13	3	1	0	0	0	0	0	1	5	35	100	451	206	151	96	55	16	32	122	225	579	461204	0
FFQ	93	0	0	0	0	0	0	0	0	0	0	0	0	0	0	4	52	83	25	16	5	0	0	0	0	0	0	2	4	7	144	230	453	418	245	80	38	46	144	114	819	460452	0
FFQ	94	0	0	0	0	0	0	0	0	0	0	0	0	0	0	1	12	59	37	23	5	2	0	0	0	1	0	4	8	97	190	349	327	313	165	53	29	59	128	144	724	460650	0
FFQ	95	0	0	0	0	0	0	0	0	0	0	0	0	0	0	7	18	82	46	54	15	2	0	0	0	2	0	2	5	94	172	321	248	367	381	146	107	72	170	163	643	460262	0
FFQ	96	0	0	0	0	0	0	0	0	0	0	0	0	0	1	12	21	136	89	75	21	1	0	0	0	0	1	3	8	150	218	458	328	435	377	235	150	115	198	204	638	459505	0
FFQ	97	0	0	0	0	0	0	0	0	0	0	0	0	0	0	12	30	196	137	96	26	6	0	0	0	3	0	5	8	132	236	516	452	673	682	366	251	187	268	226	667	458202	0
FFQ	98	0	0	0	0	0	0	0	0	0	0	0	0	0	0	14	28	154	168	52	45	7	0	0	0	1	1	5	7	131	185	494	503	636	622	393	278	231	259	277	628	458258	0
FFQ	99	0	0	0	0	0	0	0	0	0	0	0	0	0	0	28	22	153	155	39	38	7	0	0	0	5	1	8	5	181	200	546	446	538	604	328	283	257	233	265	602	458433	0
FFQ	100	0	0	0	0	0	0	0	0	0	0	0	0	0	1	28	32	137	133	44	32	8	0	0	0	1	0	6	5	200	197	528	453	478	557	288	243	246	221	282	552	458705	0
FFQ	101	0	0	0	0	0	0	0	0	0	0	0	0	0	0	45	38	178	154	44	32	8	0	0	0	1	1	5	9	241	238	575	469	549	533	341	211	183	247	279	543	458453	0
FFQ	102	0	0	0	0	0	0	0	0	0	0	0	0	0	0	32	32	136	136	35	23	7	0	0	0	1	1	4	12	233	240	503	453	461	545	286	196	173	202	300	524	458842	0
FFQ	103	0	0	0	0	0	0	0	0	0	0	0	0	0	0	34	28	130	113	46	23	8	0	0	0	2	1	7	9	224	221	545	486	451	458	252	202	186	209	283	566	458893	0
FFQ	104	0	0	0	0	0	0	0	0	0	0	0	0	0	0	45	31	155	132	46	43	8	0	0	0	1	1	7	17	242	256	578	503	522	573	310	243	193	248	317	522	458384	0
FFQ	105	0	0	0	0	0	0	0	0	0	0	0	0	0	0	24	23	148	125	42	27	13	0	0	0	0	1	7	7	209	244	524	431	488	547	299	221	195	231	256	539	458776	0
FFQ	106	0	0	0	0	0	0	0	0	0	0	0	0	0	0	28	34	141	137	41	38	17	0	0	0	2	0	11	19	226	246	552	504	480	546	323	242	199	226	303	517	458545	0
FFQ	107	0	0	0	0	0	0	0	0	0	0	0	0	0	0	34	31	131	180	46	35	18	0	0	0	1	0	8	21	277	288	606	541	543	572	360	231	214	247	313	531	458149	0
FFQ	108	0	0	0	0	0	0	0	0	0	0	0	0	0	0	36	54	184	160	37	31	9	0	0	0	1	1	7	18	280	279	646	561	539	583	410	304	239	261	348	557	457832	0
FFQ	109	0	0	0	0	0	0	0	0	0	0	0	0	0	0	26	33	138	149	39	25	12	0	0	0	1	0	6	13	213	234	505	455	425	492	299	210	167	227	308	521	458879	0
FFQ	110	0	0	0	0	0	0	0	0	0	0	0	0	0	0	27	37	130	150	33	24	14	0	0	0	2	0	6	26	179	252	488	451	463	458	293	202	211	214	304	591	458822	0
FFQ	111	0	0	0	0	0	0	0	0	0	0	0	0	0	0	30	39	154	163	41	27	13	0	0	0	0	0	6	20	240	264	591	515	518	563	353	256	206	247	322	542	458267	0
FFQ	112	0	0	0	0	0	0	0	0	0	0	0	0	0	0	27	25	113	155	30	25	16	0	0	0	1	1	4	17	196	235	518	444	451	488	303	214	181	218	259	545	458911	0
FFQ	113	0	0	0	0	0	0	0	0	0	0	0	0	0	0	24	23	141	143	33	25	10	0	0	0	2	3	3	23	209	213	565	434	473	444	296	222	178	230	283	544	458856	0
FFQ	114	0	0	0	0	0	0	0	0	0	0	0	0	0	1	21	37	118	133	26	22	17	0	0	0	2	0	4	22	191	208	480	382	431	492	277	199	154	214	288	539	459116	0
FFQ	115	0	0	0	0	0	0	0	0	0	0	0	0	0	0	30	32	132	119	27	22	10	0	0	0	1	1	5	29	234	242	521	423	518	496	307	201	158	211	252	522	458881	0
FFQ	116	0	0	0	0	0	0	0	0	0	0	0	0	0	0	51	51	115	92	31	25	11	0	0	0	1	1	10	27	327	279	574	405	466	427	239	159	132	194	279	503	458973	0
FFQ	117	0	0	0	0	0	0	0	0	0	0	0	0	0	0	51	41	114	82	37	34	3	0	0	0	1	1	13	37	430	288	656	432	399	332	174	91	122	174	283	477	459098	0
FFQ	118	0	0	0	0	0	0	0	0	0	0	0	0	0	0	78	69	117	64	25	23	0	0	0	0	1	1	13	39	500	402	677	437	410	354	132	82	96	161	262	465	458960	0
FFQ	119	0	0	0	0	0	0	0	0	0	0	0	0	0	0	60	70	146	86	39	21	0	0	0	0	1	1	16	49	548	441	726	492	427	418	145	82	136	202	280	465	458515	0
FFQ	120	0	0	0	0	0	0	0	0	0	0	0	0	0	0	42	53	119	85	30	31	1	0	0	0	3	1	10	46	472	362	619	403	343	343	140	71	106	185	332	527	459042	0
FFQ	121	0	0	0	0	0	0	0	0	0	0	0	0	0	0	34	33	97	52	18	12	2	0	0	0	1	0	4	44	272	232	763	283	230	215	83	52	95	155	308	367	460014	0
FFQ	122	0	0	0	0	0	0	0	0	0	0	0	0	0	0	3	10	61	29	25	10	0	0	0	0	2	0	7	23	177	146	683	179	119	101	61	26	81	107	310	319	460887	0
FFQ	123	0	0	0	0	0	0	0	0	0	0	0	0	0	0	2	14	33	17	8	2	2	0	0	0	0	1	0	28	22	65	584	266	111	63	57	21	56	82	278	283	461371	0
FFQ	124	0	0	0	0	0	0	0	0	0	0	0	0	0	0	0	29	47	11	14	1	1	0	0	0	0	0	2	45	16	218	386	184	87	84	68	18	32	95	296	344	461388	0
FFQ	125	0	0	0	0	0	0	0	0	0	0	0	0	0	0	0	18	38	6	10	0	2	0	0	0	1	0	1	21	14	129	362	105	89	44	62	23	42	77	293	212	461817	0
FFQ	126	0	0	0	0	0	0	0	0	0	0	0	0	0	0	0	9	70	12	14	5	2	0	0	0	1	0	1	14	12	149	221	38	287	65	55	31	57	144	324	283	461572	0
FFQ	127	0	0	0	0	0	0	0	0	0	0	0	0	0	0	2	0	46	12	20	3	5	0	0	0	0	0	1	8	7	15	157	115	168	81	69	37	37	140	249	395	461799	0
FFQ	128	0	0	0	0	0	0	0	0	0	0	0	0	0	0	7	5	33	8	7	1	5	0	0	0	0	0	1	9	15	30	113	153	117	69	42	32	34	98	103	621	461861	0
FFQ	129	0	0	0	0	0	0	0	0	0	0	0	0	0	0	21	17	21	6	12	4	1	0	0	0	0	0	10	30	235	51	190	124	81	79	31	32	42	58	224	382	461713	0
FFQ	130	0	0	0	0	0	0	0	0	0	0	0	0	0	0	65	21	29	12	7	6	0	0	0	0	2	0	10	51	748	96	312	32	80	30	51	21	111	96	289	665	460630	0
FFQ	131	0	0	0	0	0	0	0	0	0	0	0	0	0	0	125	41	53	43	22	13	0	0	0	0	2	0	4	38	1409	116	294	109	114	54	78	47	89	112	255	585	459761	0
FFQ	132	0	0	0	0	0	0	0	0	0	0	0	0	0	0	133	24	89	39	17	8	0	0	0	0	0	0	15	84	1569	81	313	145	84	80	76	35	97	185	273	923	459093	0
FFQ	133	0	0	0	0	0	0	0	0	0	0	0	0	0	0	5	8	120	27	20	0	0	0	0	0	1	0	3	51	31	34	814	105	89	183	43	42	40	166	273	912	460393	0
FFQ	134	0	0	0	0	0	0	0	0	0	0	0	0	0	0	1	2	88	21	17	0	1	0	0	0	1	0	6	30	53	24	754	81	80	122	64	49	24	147	201	744	460850	0
FFQ	135	0	0	0	0	0	0	0	0	0	0	0	0	0	0	0	1	75	43	18	4	4	0	0	0	5	0	3	49	28	46	569	141	256	111	52	58	10	144	213	830	460699	0
FFQ	136	0	0	0	0	0	0	0	0	0	0	0	0	0	0	0	0	11	29	12	2	7	0	0	0	1	0	1	19	5	22	129	97	62	69	35	19	9	134	262	455	461978	0
FFQ	137	0	0	0	0	0	0	0	0	0	0	0	0	0	0	3	6	11	42	11	0	11	0	0	0	0	0	2	10	2	26	78	236	81	62	55	36	10	121	339	454	461760	0
FFQ	138	0	0	0	0	0	0	0	0	0	0	0	0	0	0	14	7	15	15	6	0	8	0	0	0	0	0	0	20	23	88	75	204	42	45	93	25	26	65	401	77	462107	0
FFQ	139	0	0	0	0	0	0	0	0	0	0	0	0	0	0	12	18	53	40	8	0	1	0	0	0	3	0	2	45	32	120	240	461	72	79	121	35	31	129	417	570	460866	0
FFQ	140	0	0	0	0	0	0	0	0	0	0	0	0	0	0	12	21	32	13	0	0	1	0	0	0	0	0	0	31	21	90	170	243	62	96	64	13	85	96	295	630	461371	0
FFQ	141	0	0	0	0	0	0	0	0	0	0	0	0	0	0	4	13	124	45	3	0	0	0	0	0	3	1	3	81	23	55	517	847	97	183	72	43	50	244	235	875	459810	0
FFQ	142	0	0	0	0	0	0	0	0	0	0	0	0	0	0	1	11	78	17	2	0	0	0	0	0	2	0	0	52	9	53	308	951	63	111	19	72	31	127	210	645	460532	0
FFQ	143	0	0	0	0	0	0	0	0	0	0	0	0	0	0	0	13	107	30	20	4	0	0	0	0	1	0	3	85	91	310	300	747	94	106	25	61	18	146	211	680	460207	0
FFQ	144	0	0	0	0	0	0	0	0	0	0	0	0	0	0	3	35	41	23	11	9	0	0	0	0	0	0	1	46	78	420	214	229	57	69	25	23	16	84	206	331	461320	0
FFQ	145	0	0	0	0	0	0	0	0	0	0	0	0	0	0	1	45	90	13	13	11	0	0	0	0	0	0	4	116	112	691	239	79	56	57	82	19	13	25	293	90	461192	0
FFQ	146	0	0	0	0	0	0	0	0	0	0	0	0	0	0	4	44	86	11	12	3	0	0	0	0	4	3	4	127	149	625	225	61	89	62	108	35	41	77	537	43	460890	0
FFQ	147	0	0	0	0	0	0	0	0	0	0	0	0	0	0	1	12	9	5	3	6	1	0	0	0	1	1	2	56	11	177	113	66	81	44	164	32	49	51	865	49	461436	0
FFQ	148	0	0	0	0	0	0	0	0	0	0	0	0	0	0	3	31	28	2	5	6	5	0	0	0	1	0	2	57	59	172	121	58	88	50	222	75	67	102	958	175	460936	0
FFQ	149	0	0	0	0	0	0	0	0	0	0	0	0	0	0	1	28	37	2	8	6	12	0	0	0	0	0	1	65	11	191	148	36	50	70	133	82	31	92	574	396	461232	0
FFQ	150	0	0	0	0	0	0	0	0	0	0	0	0	0	0	1	128	46	2	9	19	7	0	0	0	0	0	0	15	59	340	276	30	88	110	137	8	78	373	1357	1958	458121	0
FFQ	151	0	0	0	0	0	0	0	0	0	0	0	0	5	2	66	5887	907	32	181	655	0	0	0	0	6	2	1	14	45	550	675	33	1236	3235	4445	47	1236	15050	51892	72366	304540	0
FFQ	152	0	0	0	0	0	0	0	0	0	0	0	0	18	12	212	7769	5329	311	284	770	4	0	0	0	14	3	8	18	2	29	1398	9	5195	5752	10579	930	15921	30837	182309	195352	0	0
FFQ	153	0	0	0	0	0	0	0	0	0	0	0	0	25	14	291	8802	2835	321	291	927	2	0	0	0	11	2	2	18	1	35	1401	7	7227	3698	15144	883	18085	30035	297376	75579	0	0
FFQ	154	0	0	0	0	0	0	0	0	0	0	0	0	27	34	352	4140	4215	853	194	299	1	0	0	0	8	2	5	18	0	43	4353	0	9349	610	23551	887	29095	24221	359679	1017	0	0
FFQ	155	0	0	0	0	0	0	0	0	0	0	0	0	21	54	428	3256	7192	941	198	271	3	1	0	0	10	0	5	14	0	36	4952	6	9238	474	25347	52	21989	21619	366558	230	0	0
FFQ	156	0	0	0	0	0	0	0	0	0	0	0	0	14	75	478	2863	9290	1117	185	10	5	0	0	0	15	0	2	11	3	32	6036	8	9341	449	22609	62	27433	18365	364309	133	0	0
FFQ	157	0	0	0	0	0	0	0	0	0	0	0	0	10	40	327	1673	9942	664	588	11	118	0	0	0	6	2	9	10	2	30	3270	6	7173	2245	10569	1240	16266	16572	391885	139	0	0
FFQ	158	0	0	0	0	0	0	0	0	0	0	0	0	7	21	165	753	6730	515	3998	6	229	4	0	0	20	1	5	13	2	20	1166	16	5749	3671	4111	2441	10216	17837	404927	151	0	0
FFQ	159	0	0	0	0	0	0	0	0	0	0	0	0	2	1	26	96	3610	335	6807	5	328	9	0	0	10	0	11	9	1	21	28	28	3358	5833	1010	3767	2353	22169	412779	155	0	0
FFQ	160	0	0	0	0	0	0	0	0	0	0	0	0	3	0	26	64	2167	457	9655	11	277	189	0	0	11	0	9	11	2	15	16	44	3822	5094	714	4654	2684	24161	408496	133	0	0
FFQ	161	0	0	0	0	0	0	0	0	0	0	0	0	2	0	25	78	2305	299	7718	16	222	188	0	0	11	1	5	14	1	87	18	370	4015	6909	1922	4673	2382	63211	368076	130	0	0
FFQ	162	0	0	0	0	0	0	0	0	0	0	0	0	2	1	47	189	3013	354	6447	37	197	238	0	0	12	5	4	17	2	240	68	879	5402	11362	5090	6228	2397	138424	281861	133	0	0
FFQ	163	0	0	0	0	0	0	0	0	0	0	0	0	4	11	83	363	3343	241	5076	105	268	86	0	0	13	0	7	22	4	988	347	1795	7669	24064	14911	8075	1163	244427	149402	145	0	0
FFQ	164	0	0	0	0	0	0	0	0	0	0	0	0	25	10	180	576	5121	269	4823	162	375	35	0	0	9	2	9	23	3	1770	809	2770	11815	39166	25331	11887	613	303931	52704	155	0	0
FFQ	165	0	0	0	0	0	0	0	0	0	0	0	0	36	11	267	573	6583	275	3878	273	419	1	0	0	14	3	6	20	0	3493	1134	3349	18098	57901	39907	15696	16	309629	795	134	0	0
FFQ	166	0	0	0	0	0	0	0	0	0	0	0	0	54	4	300	475	7678	313	2681	405	366	0	0	0	8	1	4	26	1	4317	1924	4112	21922	75146	53575	19156	15	269656	212	101	0	0
FFQ	167	0	0	0	0	0	0	0	0	0	0	0	0	28	2	264	332	8560	346	2343	683	548	0	0	0	6	1	0	16	2	4968	2183	4500	24781	83371	60552	20551	17	248038	229	58	0	0
FFQ	168	0	0	0	0	0	0	0	0	0	0	0	0	9	0	157	186	9588	251	2688	787	647	0	0	0	1	0	1	6	1	4969	2829	4598	32017	94716	69102	18620	21	220841	212	31	0	0
FFQ	169	0	0	0	0	0	0	0	0	0	0	0	0	1	0	87	86	10378	160	3280	784	706	0	0	0	2	0	0	2	0	6083	3473	4504	48191	111593	77602	14126	14	180813	207	20	0	0
FFQ	170	0	0	0	0	0	0	0	0	0	0	0	0	2	0	41	40	11146	62	3610	428	400	0	0	0	0	0	0	0	0	8205	4525	4420	75569	146353	101011	7346	16	98543	193	19	0	0
FFQ	171	0	0	0	0	0	0	0	0	0	0	0	0	2	0	26	29	12092	54	4107	144	159	0	0	0	0	0	0	1	0	10222	5640	4403	95082	172431	116878	3308	11	36829	194	9	0	0
FFQ	172	0	0	0	0	0	0	0	0	0	0	0	0	1	0	24	25	12732	40	4598	2	4	0	0	0	0	0	0	0	0	12256	5741	3782	108624	184811	125630	980	7	511	191	6	0	0
FFQ	173	0	0	0	0	0	0	0	0	0	0	0	0	0	0	16	32	12098	38	4869	1	0	0	0	0	0	0	0	0	0	11913	5016	2998	100844	162591	109876	837	8	113	176	11	0	0
FFQ	174	0	0	0	0	0	0	0	0	0	0	0	0	1	0	13	36	9562	46	4417	1	0	0	0	0	0	0	0	1	0	10156	3559	1739	81207	122750	82507	593	3	109	173	14	0	0
FFQ	175	0	0	0	0	0	0	0	0	0	0	0	0	0	0	17	43	5333	29	2659	0	0	0	0	0	0	1	0	0	0	5605	1840	811	43568	63167	41963	278	5	99	158	12	0	0
FFQ	176	0	0	0	0	0	0	0	0	0	0	0	0	1	0	18	46	2048	29	1148	0	1	0	0	0	0	0	0	1	0	2123	671	200	16662	22375	15030	113	4	99	129	9	0	0
FFQ	177	0	0	0	0	0	0	0	0	0	0	0	0	0	0	21	40	113	29	24	0	0	0	0	0	1	0	0	0	0	38	8	7	239	360	224	9	6	119	86	6	0	0
FFQ	178	0	0	0	0	0	0	0	0	0	0	0	0	0	1	21	35	70	28	17	0	0	0	0	0	0	0	0	1	0	6	5	1	59	100	44	18	5	123	54	5	0	0
FFQ	179	0	0	0	0	0	0	0	0	0	0	0	0	0	0	21	34	63	27	20	0	0	0	0	0	0	0	0	0	0	3	3	3	57	89	45	19	5	124	34	4	0	0
FFQ	180	0	0	0	0	0	0	0	0	0	0	0	0	0	0	6	38	74	21	17	0	0	0	0	0	0	0	0	0	0	3	3	1	64	84	41	17	4	114	28	2	0	0
FFQ	181	0	0	0	0	0	0	0	0	0	0	0	0	0	0	7	29	67	27	25	0	0	0	0	0	0	0	0	0	0	5	1	5	54	81	38	25	8	105	18	3	0	0
FFQ	182	0	0	0	0	0	0	0	0	0	0	0	0	0	0	4	27	73	25	32	1	0	0	0	0	0	0	0	0	0	3	6	1	44	74	34	29	5	98	15	2	0	0
FFQ	183	0	0	0	0	0	0	0	0	0	0	0	0	0	0	5	35	63	26	33	0	1	0	0	0	0	0	1	2	0	4	5	2	45	83	30	18	3	82	12	5	0	0
FFQ	184	0	0	0	0	0	0	0	0	0	0	0	0	0	0	7	45	70	17	27	0	1	0	0	0	1	0	0	0	0	3	2	3	47	89	41	11	5	58	12	2	0	0
FFQ	185	0	0	0	0	0	0	0	0	0	0	0	0	0	0	9	44	69	14	29	0	0	0	0	0	0	0	0	0	0	7	1	2	52	87	45	8	3	43	12	4	0	0
FFQ	186	0	0	0	0	0	0	0	0	0	0	0	0	0	0	8	47	58	15	36	0	0	0	0	0	0	0	0	0	0	11	2	0	55	97	41	6	7	21	8	5	0	0
FFQ	187	0	0	0	0	0	0	0	0	0	0	0	0	0	0	10	55	63	8	29	0	0	0	0	0	0	0	0	0	0	10	1	1	53	86	35	12	2	15	8	8	0	0
FFQ	188	0	0	0	0	0	0	0	0	0	0	0	0	0	0	7	64	72	7	26	0	0	0	0	0	0	0	0	0	0	7	2	4	40	65	38	9	3	10	4	11	0	0
FFQ	189	0	0	0	0	0	0	0	0	0	0	0	0	0	0	4	61	68	9	31	0	0	0	0	0	0	0	0	0	0	5	1	2	42	49	19	5	1	9	2	12	0	0
FFQ	190	0	0	0	0	0	0	0	0	0	0	0	0	0	0	4	54	79	8	30	0	0	0	0	0	0	0	0	1	0	1	1	0	32	30	11	5	2	3	7	10	0	0
FFQ	191	0	0	0	0	0	0	0	0	0	0	0	0	0	0	4	39	75	8	42	0	0	0	0	0	0	0	0	0	0	0	0	0	30	16	8	5	0	9	9	8	0	0
FFQ	192	0	0	0	0	0	0	0	0	0	0	0	0	0	1	2	38	71	10	56	0	0	0	0	0	0	0	0	0	0	0	0	0	16	15	3	6	0	3	13	6	0	0
FFQ	193	0	0	0	0	0	0	0	0	0	0	0	0	1	0	1	41	70	11	53	1	0	0	0	0	0	0	0	0	0	1	1	0	11	20	1	2	3	7	9	2	0	0
FFQ	194	0	0	0	0	0	0	0	0	0	0	0	0	0	0	2	36	70	7	54	0	0	0	0	0	0	0	0	0	0	0	1	0	21	20	1	2	2	5	7	3	0	0
FFQ	195	0	0	0	0	0	0	0	0	0	0	0	0	0	0	1	36	74	6	48	0	0	0	0	0	0	0	0	0	0	2	1	1	13	21	4	3	3	6	6	4	0	0
FFQ	196	0	0	0	0	0	0	0	0	0	0	0	0	0	0	1	30	83	1	46	1	0	0	0	0	0	0	0	0	0	3	1	2	21	17	2	1	0	2	12	4	0	0
FFQ	197	0	0	0	0	0	0	0	0	0	0	0	0	0	0	3	33	105	1	27	0	0	0	0	0	0	0	1	0	0	2	1	2	18	15	1	1	1	3	8	5	0	0
FFQ	198	0	0	0	0	0	0	0	0	0	0	0	0	0	0	7	27	103	0	24	0	0	0	0	0	0	0	0	0	1	2	1	2	21	21	1	0	1	3	10	2	0	0
FFQ	199	0	0	0	0	0	0	0	0	0	0	0	0	0	0	5	25	111	0	25	1	0	0	0	0	0	0	0	0	0	4	1	0	23	13	1	0	2	4	8	3	0	0
FFQ	200	0	0	0	0	0	0	0	0	0	0	0	0	0	0	4	22	112	0	33	0	0	0	0	0	0	0	0	0	0	4	0	3	18	12	1	1	2	3	5	6	0	0
FFQ	201	0	0	0	0	0	0	0	0	0	0	0	0	0	0	5	23	109	0	37	0	0	0	0	0	0	0	0	0	0	5	0	5	9	13	1	0	0	7	5	5	0	0
FFQ	202	0	0	0	0	0	0	0	0	0	0	0	0	0	1	2	16	114	0	35	1	0	0	0	0	0	0	0	0	1	8	0	2	7	14	1	0	0	8	6	6	0	0
FFQ	203	0	0	0	0	0	0	0	0	0	0	0	0	1	0	4	7	119	0	30	0	0	0	0	0	0	0	0	0	0	7	1	2	13	14	2	1	0	6	3	8	0	0
FFQ	204	0	0	0	0	0	0	0	0	0	0	0	0	1	0	0	7	117	0	32	1	1	0	0	0	0	0	0	0	1	14	0	1	8	12	2	1	1	6	1	8	0	0
FFQ	205	0	0	0	0	0	0	0	0	0	0	0	0	1	0	1	8	133	1	22	0	0	0	0	0	0	0	0	0	0	12	0	3	1	7	4	2	0	2	5	8	0	0
FFQ	206	0	0	0	0	0	0	0	0	0	0	0	0	1	0	0	3	133	1	27	0	1	0	0	0	0	0	0	0	0	10	0	3	1	11	4	2	0	5	1	6	0	0
FFQ	207	0	0	0	0	0	0	0	0	0	0	0	0	1	0	0	1	125	0	27	1	0	0	0	0	0	0	0	0	0	15	0	7	1	11	3	2	0	4	3	6	0	0
FFQ	208	0	0	0	0	0	0	0	0	0	0	0	0	0	0	1	0	118	1	32	1	0	0	0	0	0	0	0	0	0	17	0	6	1	10	3	0	0	4	2	8	0	0
FFQ	209	0	0	0	0	0	0	0	0	0	0	0	0	0	0	1	0	121	1	15	0	0	0	0	0	0	0	0	0	1	19	2	7	1	16	1	0	2	6	1	6	0	0
FFQ	210	0	0	0	0	0	0	0	0	0	0	0	0	0	0	0	0	124	1	17	0	0	0	0	0	0	0	0	0	0	12	2	7	4	9	2	2	2	2	4	5	0	0
FFQ	211	0	0	0	0	0	0	0	0	0	0	0	0	0	0	0	0	127	0	6	0	0	0	0	0	0	0	0	0	0	29	1	4	2	5	3	0	2	3	5	2	0	0
FFQ	212	0	0	0	0	0	0	0	0	0	0	0	0	0	0	0	0	129	1	3	0	1	0	0	0	0	0	0	0	0	27	0	4	3	4	0	0	1	2	4	4	0	0
FFQ	213	0	0	0	0	0	0	0	0	0	0	0	0	0	0	1	0	114	1	1	0	1	0	0	0	0	0	0	0	0	26	1	0	7	1	0	0	2	1	6	3	0	0
FFQ	214	0	0	0	0	0	0	0	0	0	0	0	0	0	0	1	0	86	1	0	0	0	0	0	0	0	0	0	0	0	30	1	0	5	1	0	2	1	5	4	1	0	0
FFQ	215	0	0	0	0	0	0	0	0	0	0	0	0	0	0	0	0	70	0	0	0	0	0	0	0	0	0	0	0	0	19	2	0	4	0	0	0	2	4	4	4	0	0
FFQ	216	0	0	0	0	0	0	0	0	0	0	0	0	0	0	0	0	35	0	0	0	1	0	0	0	0	0	0	0	0	11	1	1	6	0	0	0	2	2	3	4	0	0
FFQ	217	0	0	0	0	0	0	0	0	0	0	0	0	0	0	1	0	11	0	0	0	1	0	0	0	0	0	0	0	0	9	1	0	1	0	0	0	4	2	3	4	0	0
FFQ	218	0	0	0	0	0	0	0	0	0	0	0	0	0	0	0	1	1	0	1	0	0	0	0	0	0	0	0	0	0	0	0	1	2	0	0	0	4	2	2	3	0	0
FFQ	219	0	0	0	0	0	0	0	0	0	0	0	0	0	0	1	1	1	0	1	0	0	0	0	0	0	0	0	0	0	0	0	0	2	0	1	0	1	1	3	5	0	0
FFQ	220	0	0	0	0	0	0	0	0	0	0	0	0	0	0	1	0	0	0	0	0	0	0	0	0	0	0	0	0	0	0	0	0	2	0	1	0	2	1	5	4	0	0
FFQ	221	0	0	0	0	0	0	0	0	0	0	0	0	0	0	1	1	1	0	0	0	0	0	0	0	0	0	0	0	0	0	0	0	1	0	0	0	3	1	5	3	0	0
FFQ	222	0	0	0	0	0	0	0	0	0	0	0	0	0	0	1	0	1	0	0	0	0	0	0	0	0	0	0	0	0	0	0	0	0	0	0	1	0	2	6	5	0	0
FFQ	223	0	0	0	0	0	0	0	0	0	0	0	0	0	0	0	0	1	0	1	0	0	0	0	0	0	0	0	0	0	0	0	0	0	1	0	0	0	3	3	7	0	0
FFQ	224	0	0	0	0	0	0	0	0	0	0	0	0	0	0	0	1	0	0	0	0	0	0	0	0	0	0	0	0	0	0	0	0	0	0	0	0	1	0	4	10	0	0
FFQ	225	0	0	0	0	0	0	0	0	0	0	0	0	0	0	0	1	0	0	0	0	0	0	0	0	0	0	0	0	0	0	0	0	0	0	0	0	0	2	2	11	0	0
FFQ	226	0	0	0	0	0	0	0	0	0	0	0	0	0	0	0	0	0	0	0	0	0	0	0	0	0	0	0	0	0	0	0	0	0	1	0	0	1	1	3	10	0	0
FFQ	227	0	0	0	0	0	0	0	0	0	0	0	0	0	0	0	0	1	0	0	0	0	0	0	0	0	0	0	0	0	0	0	0	0	0	0	0	0	1	1	13	0	0
FFQ	228	0	0	0	0	0	0	0	0	0	0	0	0	0	0	0	0	1	0	0	0	0	0	0	0	0	0	0	0	0	0	0	0	0	1	0	0	1	0	3	10	0	0
FFQ	229	0	0	0	0	0	0	0	0	0	0	0	0	0	0	0	0	1	0	0	0	0	0	0	0	0	0	0	0	0	0	0	0	0	0	1	0	1	1	4	8	0	0
FFQ	230	0	0	0	0	0	0	0	0	0	0	0	0	0	0	0	0	1	0	0	0	0	0	0	0	0	0	0	0	0	0	0	0	0	0	0	0	3	0	3	9	0	0
FFQ	231	0	0	0	0	0	0	0	0	0	0	0	0	0	0	1	0	0	0	0	0	0	0	0	0	0	0	0	0	0	0	0	0	0	1	0	0	2	2	4	6	0	0
FFQ	232	0	0	0	0	0	0	0	0	0	0	0	0	0	0	1	0	0	0	0	0	0	0	0	0	0	0	0	0	0	0	0	0	0	0	2	1	4	1	4	3	0	0
FFQ	233	0	0	0	0	0	0	0	0	0	0	0	0	0	0	0	0	0	0	0	0	0	0	0	0	0	0	0	0	0	0	0	0	2	0	1	1	3	1	4	4	0	0
FFQ	234	0	0	0	0	0	0	0	0	0	0	0	0	0	0	1	0	0	0	0	0	0	0	0	0	0	0	0	0	0	0	0	0	1	0	0	1	1	1	6	5	0	0
FFQ	235	0	0	0	0	0	0	0	0	0	0	0	0	0	0	1	0	0	0	0	0	0	0	0	0	0	0	0	0	0	0	0	0	0	0	0	1	2	0	7	5	0	0
FFQ	236	0	0	0	0	0	0	0	0	0	0	0	0	0	0	0	0	0	0	0	0	0	0	0	0	0	0	0	0	0	0	1	0	0	1	0	0	0	0	8	6	0	0
FFQ	237	0	0	0	0	0	0	0	0	0	0	0	0	0	0	0	0	1	0	0	0	0	0	0	0	0	0	0	0	0	0	0	0	0	0	1	0	0	0	5	9	0	0
FFQ	238	0	0	0	0	0	0	0	0	0	0	0	0	0	0	0	0	0	0	0	0	0	0	0	0	0	0	0	0	0	0	0	0	0	1	0	0	0	2	4	9	0	0
FFQ	239	0	0	0	0	0	0	0	0	0	0	0	0	0	0	0	1	0	0	0	0	0	0	0	0	0	0	0	0	0	0	0	0	0	0	0	0	1	1	6	7	0	0
FFQ	240	0	0	0	0	0	0	0	0	0	0	0	0	0	0	0	0	0	0	0	0	0	0	0	0	0	0	0	0	0	0	0	0	0	0	0	0	1	1	7	7	0	0
FFQ	241	0	0	0	0	0	0	0	0	0	0	0	0	0	0	1	0	0	0	0	0	0	0	0	0	0	0	0	0	0	0	0	0	0	0	0	0	2	0	12	1	0	0
FFQ	242	0	0	0	0	0	0	0	0	0	0	0	0	0	0	0	0	0	0	0	0	0	0	0	0	0	0	0	0	0	0	1	0	0	0	0	0	3	0	12	0	0	0
FFQ	243	0	0	0	0	0	0	0	0	0	0	0	0	0	0	0	0	0	0	0	0	0	0	0	0	0	0	0	0	0	0	1	0	0	0	1	0	1	1	10	2	0	0
FFQ	244	0	0	0	0	0	0	0	0	0	0	0	0	0	0	0	0	0	0	0	0	0	0	0	0	0	0	0	0	0	0	2	0	0	0	0	0	0	2	8	4	0	0
FFQ	245	0	0	0	0	0	0	0	0	0	0	0	0	0	0	0	0	0	0	0	0	0	0	0	0	0	0	0	0	0	0	0	0	0	0	2	0	0	3	6	5	0	0
FFQ	246	0	0	0	0	0	0	0	0	0	0	0	0	0	0	0	0	0	0	0	0	0	0	0	0	0	0	0	0	0	0	0	0	0	1	1	1	0	4	3	6	0	0
FFQ	247	0	0	0	0	0	0	0	0	0	0	0	0	0	0	0	0	0	0	0	0	0	0	0	0	0	0	0	0	0	0	0	0	0	0	1	0	0	5	4	6	0	0
FFQ	248	0	0	0	0	0	0	0	0	0	0	0	0	0	0	0	0	0	0	0	0	0	0	0	0	0	0	0	0	0	0	1	0	0	0	2	0	0	3	4	6	0	0
FFQ	249	0	0	0	0	0	0	0	0	0	0	0	0	0	0	0	0	0	0	0	0	0	0	0	0	0	0	0	0	0	0	0	0	0	0	2	0	2	4	2	6	0	0
FFQ	250	0	0	0	0	0	0	0	0	0	0	0	0	0	0	0	0	0	0	0	0	0	0	0	0	0	0	0	0	0	0	0	0	0	1	2	0	0	2	0	11	0	0
FFQ	251	0	0	0	0	0	0	0	0	0	0	0	0	0	0	0	0	0	0	0	0	0	0	0	0	0	0	0	0	0	0	0	0	0	0	3	0	0	4	1	8	0	0
FFQ	252	0	0	0	0	0	0	0	0	0	0	0	0	0	0	0	0	0	0	0	0	0	0	0	0	0	0	0	0	0	0	0	0	0	1	2	0	2	0	5	6	0	0
FFQ	253	0	0	0	0	0	0	0	0	0	0	0	0	0	0	0	0	0	0	0	0	0	0	0	0	0	0	0	0	0	0	0	0	1	0	2	0	1	1	8	3	0	0
FFQ	254	0	0	0	0	0	0	0	0	0	0	0	0	0	0	0	0	0	0	0	0	0	0	0	0	0	0	0	0	0	0	0	0	0	1	2	0	1	3	7	2	0	0
FFQ	255	0	0	0	0	0	0	0	0	0	0	0	0	0	0	0	0	1	0	0	0	0	0	0	0	0	0	0	0	0	0	0	0	0	1	2	0	2	0	10	0	0	0
FFQ	256	0	0	0	0	0	0	0	0	0	0	0	0	0	0	0	0	0	0	0	0	0	0	0	0	0	0	0	0	0	0	1	0	0	1	4	0	0	0	9	0	0	0
FFQ	257	0	0	0	0	0	0	0	0	0	0	0	0	0	0	0	0	0	0	0	0	0	0	0	0	0	0	0	0	0	0	0	0	0	0	2	0	1	0	10	0	0	0
FFQ	258	0	0	0	0	0	0	0	0	0	0	0	0	0	0	0	0	0	0	0	0	0	0	0	0	0	0	0	0	0	0	0	0	0	0	0	0	0	0	13	0	0	0
FFQ	259	0	0	0	0	0	0	0	0	0	0	0	0	0	0	0	0	0	0	0	0	0	0	0	0	0	0	0	0	0	0	0	0	0	0	0	0	0	0	13	0	0	0
FFQ	260	0	0	0	0	0	0	0	0	0	0	0	0	0	0	0	0	0	0	0	0	0	0	0	0	0	0	0	0	0	0	0	0	0	0	0	0	0	0	13	0	0	0
FFQ	261	0	0	0	0	0	0	0	0	0	0	0	0	0	0	0	0	0	0	0	0	0	0	0	0	0	0	0	0	0	0	0	0	0	0	0	0	1	1	11	0	0	0
FFQ	262	0	0	0	0	0	0	0	0	0	0	0	0	0	0	0	0	0	0	0	0	0	0	0	0	0	0	0	0	0	0	0	0	0	1	0	0	0	5	7	0	0	0
FFQ	263	0	0	0	0	0	0	0	0	0	0	0	0	0	0	0	0	0	0	0	0	0	0	0	0	0	0	0	0	0	0	0	1	0	0	0	0	1	7	4	0	0	0
FFQ	264	0	0	0	0	0	0	0	0	0	0	0	0	0	0	0	0	1	0	0	0	0	0	0	0	0	0	0	0	0	0	0	0	0	0	0	1	0	10	1	0	0	0
FFQ	265	0	0	0	0	0	0	0	0	0	0	0	0	0	0	0	0	0	0	0	0	0	0	0	0	0	0	0	0	0	0	0	1	0	4	0	1	0	6	1	0	0	0
FFQ	266	0	0	0	0	0	0	0	0	0	0	0	0	0	0	0	0	1	0	0	1	0	0	0	0	0	0	0	0	0	0	0	0	0	3	1	0	0	7	0	0	0	0
FFQ	267	0	0	0	0	0	0	0	0	0	0	0	0	0	0	0	0	0	0	0	0	0	0	0	0	0	0	0	0	0	0	0	0	2	2	1	1	0	7	0	0	0	0
FFQ	268	0	0	0	0	0	0	0	0	0	0	0	0	0	0	0	0	0	0	0	0	0	0	0	0	0	0	0	0	0	0	0	0	1	4	1	1	0	6	0	0	0	0
FFQ	269	0	0	0	0	0	0	0	0	0	0	0	0	0	0	0	0	0	0	0	0	0	0	0	0	0	0	0	0	0	0	0	1	1	3	3	1	0	4	0	0	0	0
FFQ	270	0	0	0	0	0	0	0	0	0	0	0	0	0	0	0	0	0	0	0	0	0	0	0	0	0	0	0	0	0	0	0	0	3	5	1	1	0	3	0	0	0	0
FFQ	271	0	0	0	0	0	0	0	0	0	0	0	0	0	0	0	0	0	0	0	0	0	0	0	0	0	0	0	0	0	0	1	1	2	4	2	1	0	2	0	0	0	0
FFQ	272	0	0	0	0	0	0	0	0	0	0	0	0	0	0	0	0	0	0	0	0	0	0	0	0	0	0	0	0	0	0	0	0	2	8	2	0	0	1	0	0	0	0
FFQ	273	0	0	0	0	0	0	0	0	0	0	0	0	0	0	0	0	0	0	0	0	0	0	0	0	0	0	0	0	0	0	0	0	5	4	4	0	0	0	0	0	0	0
FFQ	274	0	0	0	0	0	0	0	0	0	0	0	0	0	0	0	0	0	0	0	0	0	0	0	0	0	0	0	0	0	1	0	0	3	3	1	0	0	0	0	0	0	0
FFQ	275	0	0	0	0	0	0	0	0	0	0	0	0	0	0	0	0	0	0	0	0	0	0	0	0	0	0	0	0	0	0	0	0	3	1	1	0	0	0	0	0	0	0
FFQ	276	0	0	0	0	0	0	0	0	0	0	0	0	0	0	0	0	1	0	0	0	0	0	0	0	0	0	0	0	0	0	1	0	0	1	0	0	0	0	0	0	0	0
FFQ	277	0	0	0	0	0	0	0	0	0	0	0	0	0	0	0	0	0	0	0	0	0	0	0	0	0	0	0	0	0	1	0	0	1	0	0	0	0	0	0	0	0	0
# Last Fragment Qualities. Use `grep ^LFQ | cut -f 2-` to extract this part.
# Columns correspond to qualities and rows to cycles. First column is the cycle number.
# GC Content of first fragments. Use `grep ^GCF | cut -f 2-` to extract this part.
GCF	16.83	0
GCF	33.92	1
GCF	34.42	0
GCF	34.92	3
GCF	35.43	6
GCF	35.93	8
GCF	36.43	9
GCF	36.93	13
GCF	37.44	30
GCF	37.94	91
GCF	38.44	211
GCF	38.94	557
GCF	39.45	1385
GCF	39.95	2517
GCF	40.45	5334
GCF	40.95	9705
GCF	41.46	14749
GCF	41.96	23663
GCF	42.46	32010
GCF	42.96	42567
GCF	43.47	49718
GCF	43.97	53947
GCF	44.47	55510
GCF	44.97	53210
GCF	45.48	47024
GCF	45.98	41996
GCF	46.48	31995
GCF	46.98	22551
GCF	47.49	14553
GCF	47.99	11861
GCF	48.49	6911
GCF	48.99	3730
GCF	49.50	1813
GCF	50.00	1097
GCF	50.50	476
GCF	51.01	196
GCF	51.51	55
GCF	52.01	45
GCF	52.51	15
GCF	53.02	6
GCF	53.52	2
# GC Content of last fragments. Use `grep ^GCL | cut -f 2-` to extract this part.
# ACGT content per cycle. Use `grep ^GCC | cut -f 2-` to extract this part. The columns are: cycle; A,C,G,T base counts as a percentage of all A/C/G/T bases [%]; and N and O counts as a percentage of all A/C/G/T bases [%]
GCC	1	22.05	30.18	22.33	25.43	0.00	0.00
GCC	2	23.97	29.16	21.99	24.89	0.00	0.00
GCC	3	22.58	31.01	21.66	24.75	0.00	0.00
GCC	4	22.29	31.74	20.87	25.11	0.00	0.00
GCC	5	22.45	31.73	21.11	24.70	0.00	0.00
GCC	6	22.89	30.92	20.79	25.39	0.00	0.00
GCC	7	23.27	30.67	21.54	24.51	0.00	0.00
GCC	8	22.83	30.63	22.37	24.17	0.00	0.00
GCC	9	34.51	33.45	0.18	31.86	0.00	0.00
GCC	10	0.21	65.28	34.45	0.06	0.00	0.00
GCC	11	33.30	66.60	0.06	0.03	0.00	0.00
GCC	12	32.17	67.76	0.03	0.04	0.00	0.00
GCC	13	67.71	32.06	0.03	0.20	0.00	0.00
GCC	14	32.05	34.62	0.04	33.28	0.00	0.00
GCC	15	34.45	33.33	0.21	32.01	0.00	0.00
GCC	16	0.09	32.19	33.28	34.44	0.00	0.00
GCC	17	0.24	67.67	32.01	0.08	0.00	0.00
GCC	18	33.29	32.07	34.61	0.04	0.00	0.00
GCC	19	32.03	34.60	33.33	0.04	0.00	0.00
GCC	20	34.62	33.32	32.00	0.06	0.00	0.00
GCC	21	33.34	32.00	34.39	0.27	0.00	0.00
GCC	22	32.01	34.38	0.09	33.52	0.00	0.00
GCC	23	34.39	0.31	0.03	65.27	0.00	0.00
GCC	24	0.12	33.24	0.27	66.38	0.00	0.00
GCC	25	0.29	31.96	33.27	34.48	0.00	0.00
GCC	26	33.30	34.31	31.99	0.40	0.00	0.00
GCC	27	32.02	0.09	34.33	33.56	0.00	0.00
GCC	28	34.60	0.01	0.10	65.29	0.00	0.00
GCC	29	33.35	0.02	0.03	66.60	0.00	0.00
GCC	30	32.00	0.03	0.26	67.70	0.00	0.00
GCC	31	34.34	0.27	33.26	32.13	0.00	0.00
GCC	32	0.10	33.26	31.99	34.65	0.00	0.00
GCC	33	0.03	31.99	34.32	33.66	0.00	0.00
GCC	34	0.04	34.32	0.08	65.56	0.00	0.00
GCC	35	0.06	0.09	0.00	99.85	0.00	0.00
GCC	36	0.30	0.01	0.00	99.68	0.00	0.00
GCC	37	33.53	0.01	0.01	66.45	0.00	0.00
GCC	38	65.26	0.01	0.01	34.72	0.00	0.00
GCC	39	66.32	0.01	0.01	33.66	0.00	0.00
GCC	40	34.42	0.01	0.01	65.56	0.00	0.00
GCC	41	0.12	0.01	0.01	99.86	0.00	0.00
GCC	42	0.04	0.02	0.01	99.92	0.00	0.00
GCC	43	0.28	0.03	0.01	99.67	0.00	0.00
GCC	44	33.27	0.27	0.02	66.43	0.00	0.00
GCC	45	32.00	33.26	0.03	34.70	0.00	0.00
GCC	46	34.33	32.00	0.28	33.40	0.00	0.00
GCC	47	0.10	34.33	33.26	32.31	0.00	0.00
GCC	48	0.03	0.10	31.98	67.88	0.00	0.00
GCC	49	0.04	0.02	34.31	65.63	0.00	0.00
GCC	50	0.06	0.02	0.08	99.84	0.00	0.00
GCC	51	0.31	0.03	0.00	99.66	0.00	0.00
GCC	52	33.30	0.04	0.01	66.65	0.00	0.00
GCC	53	32.04	0.28	0.01	67.67	0.00	0.00
GCC	54	34.63	33.28	0.01	32.09	0.00	0.00
GCC	55	33.63	32.01	0.01	34.34	0.00	0.00
GCC	56	65.52	34.35	0.02	0.11	0.00	0.00
GCC	57	99.56	0.37	0.02	0.05	0.00	0.00
GCC	58	66.39	33.52	0.02	0.07	0.00	0.00
GCC	59	34.41	65.24	0.03	0.33	0.00	0.00
GCC	60	0.11	66.30	0.04	33.55	0.00	0.00
GCC	61	0.06	34.39	0.28	65.28	0.00	0.00
GCC	62	0.30	0.11	33.26	66.32	0.00	0.00
GCC	63	33.30	0.04	31.99	34.68	0.00	0.00
GCC	64	32.03	0.28	34.32	33.37	0.00	0.00
GCC	65	34.37	33.26	0.10	32.27	0.00	0.00
GCC	66	0.41	31.99	0.02	67.58	0.00	0.00
GCC	67	33.58	34.31	0.03	32.08	0.00	0.00
GCC	68	65.54	0.09	0.04	34.33	0.00	0.00
GCC	69	99.56	0.01	0.30	0.13	0.00	0.00
GCC	70	66.40	0.01	33.28	0.30	0.00	0.00
GCC	71	34.45	0.01	32.27	33.27	0.00	0.00
GCC	72	0.43	0.02	67.56	32.00	0.00	0.00
GCC	73	33.58	0.02	32.08	34.32	0.00	0.00
GCC	74	65.28	0.02	34.31	0.39	0.00	0.00
GCC	75	66.60	0.02	0.12	33.26	0.00	0.00
GCC	76	67.67	0.03	0.30	31.99	0.00	0.00
GCC	77	32.39	0.06	33.26	34.29	0.00	0.00
GCC	78	67.56	0.35	31.98	0.11	0.00	0.00
GCC	79	32.12	33.58	34.29	0.01	0.00	0.00
GCC	80	34.62	65.25	0.12	0.01	0.00	0.00
GCC	81	33.66	66.30	0.03	0.02	0.00	0.00
GCC	82	65.23	34.71	0.04	0.02	0.00	0.00
GCC	83	66.25	33.68	0.05	0.02	0.00	0.00
GCC	84	34.37	65.26	0.35	0.02	0.00	0.00
GCC	85	0.13	66.57	33.27	0.02	0.00	0.00
GCC	86	0.04	67.53	32.41	0.02	0.00	0.00
GCC	87	0.44	32.05	67.50	0.02	0.00	0.00
GCC	88	33.25	34.61	32.10	0.03	0.00	0.00
GCC	89	32.00	33.71	34.24	0.05	0.00	0.00
GCC	90	34.16	65.13	0.25	0.46	0.00	0.00
GCC	91	0.16	66.04	0.46	33.33	0.00	0.00
GCC	92	0.38	34.37	33.14	32.11	0.00	0.00
GCC	93	33.13	0.70	31.91	34.25	0.00	0.00
GCC	94	32.00	33.37	34.32	0.31	0.00	0.00
GCC	95	42.06	37.97	8.54	11.43	0.00	0.00
GCC	96	15.81	45.64	16.36	22.20	0.00	0.00
GCC	97	24.03	17.64	24.86	33.46	0.00	0.00
GCC	98	24.23	17.60	24.88	33.28	0.00	0.00
GCC	99	24.44	17.39	24.92	33.25	0.00	0.00
GCC	100	24.63	17.37	24.64	33.37	0.00	0.00
GCC	101	24.64	17.25	24.57	33.54	0.00	0.00
GCC	102	24.89	17.61	24.12	33.38	0.00	0.00
GCC	103	24.57	18.20	23.87	33.37	0.00	0.00
GCC	104	24.45	18.34	23.85	33.36	0.00	0.00
GCC	105	24.42	18.55	23.95	33.09	0.00	0.00
GCC	106	24.92	17.91	24.02	33.14	0.00	0.00
GCC	107	24.93	17.78	24.08	33.20	0.00	0.00
GCC	108	24.89	17.68	23.54	33.88	0.00	0.00
GCC	109	24.66	17.35	23.43	34.56	0.00	0.00
GCC	110	24.69	17.48	23.39	34.44	0.00	0.00
GCC	111	24.82	17.36	23.49	34.33	0.00	0.00
GCC	112	24.79	17.56	23.43	34.22	0.00	0.00
GCC	113	25.01	17.59	23.26	34.14	0.00	0.00
GCC	114	24.90	17.83	23.10	34.17	0.00	0.00
GCC	115	24.85	18.01	22.94	34.20	0.00	0.00
GCC	116	24.39	18.03	22.92	34.66	0.00	0.00
GCC	117	24.20	18.18	22.64	34.98	0.00	0.00
GCC	118	24.55	17.68	22.75	35.02	0.00	0.00
GCC	119	24.96	17.93	22.57	34.55	0.00	0.00
GCC	120	17.02	12.47	47.67	22.84	0.00	0.00
GCC	121	9.34	39.46	39.38	11.82	0.00	0.00
GCC	122	33.13	32.10	34.02	0.75	0.00	0.00
GCC	123	31.95	34.60	0.36	33.09	0.00	0.00
GCC	124	33.93	33.92	0.12	32.04	0.00	0.00
GCC	125	0.31	65.01	0.12	34.56	0.00	0.00
GCC	126	0.09	66.40	0.12	33.39	0.00	0.00
GCC	127	0.10	67.20	0.14	32.55	0.00	0.00
GCC	128	0.12	32.82	0.17	66.89	0.00	0.00
GCC	129	0.18	66.89	0.69	32.24	0.00	0.00
GCC	130	0.74	32.27	33.05	33.94	0.00	0.00
GCC	131	33.65	33.98	32.00	0.37	0.00	0.00
GCC	132	64.95	0.48	34.48	0.10	0.00	0.00
GCC	133	65.85	0.74	33.32	0.09	0.00	0.00
GCC	134	34.77	33.13	31.99	0.11	0.00	0.00
GCC	135	33.31	32.63	33.94	0.12	0.00	0.00
GCC	136	31.97	67.44	0.43	0.16	0.00	0.00
GCC	137	33.90	65.21	0.19	0.71	0.00	0.00
GCC	138	0.37	65.80	0.73	33.09	0.00	0.00
GCC	139	0.14	34.22	33.06	32.58	0.00	0.00
GCC	140	0.70	0.44	32.04	66.82	0.00	0.00
GCC	141	33.02	0.20	34.54	32.24	0.00	0.00
GCC	142	31.96	0.77	33.36	33.91	0.00	0.00
GCC	143	33.88	33.63	32.08	0.42	0.00	0.00
GCC	144	0.37	64.87	34.63	0.13	0.00	0.00
GCC	145	0.10	65.72	34.00	0.18	0.00	0.00
GCC	146	0.12	34.14	65.51	0.24	0.00	0.00
GCC	147	0.12	0.41	98.61	0.87	0.00	0.00
GCC	148	0.14	0.16	66.00	33.70	0.00	0.00
GCC	149	0.16	0.76	34.19	64.88	0.00	0.00
GCC	150	0.20	33.02	1.10	65.68	0.00	0.00
GCC	151	0.91	32.01	32.94	34.14	0.00	0.00
GCC	152	33.76	33.85	31.93	0.45	0.00	0.00
GCC	153	64.93	0.47	34.42	0.18	0.00	0.00
GCC	154	66.34	0.17	33.31	0.18	0.00	0.00
GCC	155	66.97	0.22	32.62	0.20	0.00	0.00
GCC	156	32.24	0.89	66.60	0.27	0.00	0.00
GCC	157	33.75	33.11	32.21	0.92	0.00	0.00
GCC	158	0.43	32.80	33.70	33.07	0.00	0.00
GCC	159	0.13	67.37	0.39	32.12	0.00	0.00
GCC	160	0.12	65.06	0.09	34.73	0.00	0.00
GCC	161	0.18	65.46	0.10	34.25	0.00	0.00
GCC	162	0.94	33.96	0.10	65.00	0.00	0.00
GCC	163	33.74	0.42	0.11	65.73	0.00	0.00
GCC	164	64.85	0.17	0.23	34.75	0.00	0.00
GCC	165	67.85	2.18	4.42	25.55	0.00	0.00
GCC	166	40.92	6.18	23.93	28.97	0.00	0.00
GCC	167	14.86	12.77	34.48	37.89	0.00	0.00
GCC	168	20.13	17.46	42.03	20.38	0.00	0.00
GCC	169	23.20	20.19	32.29	24.33	0.00	0.00
GCC	170	23.48	20.52	31.62	24.39	0.00	0.00
GCC	171	23.35	20.56	31.40	24.68	0.00	0.00
GCC	172	23.62	20.69	31.60	24.09	0.00	0.00
GCC	173	23.83	20.86	30.39	24.92	0.00	0.00
GCC	174	24.50	21.08	28.88	25.54	0.00	0.00
GCC	175	25.34	21.32	26.41	26.93	0.00	0.00
GCC	176	26.65	21.92	24.55	26.88	0.00	0.00
GCC	177	22.93	21.65	20.00	35.41	0.00	0.00
GCC	178	28.50	19.73	16.19	35.58	0.00	0.00
GCC	179	31.03	20.15	16.70	32.12	0.00	0.00
GCC	180	22.24	22.44	21.08	34.24	0.00	0.00
GCC	181	17.67	29.92	16.67	35.74	0.00	0.00
GCC	182	15.86	28.33	18.39	37.42	0.00	0.00
GCC	183	14.51	25.49	25.27	34.73	0.00	0.00
GCC	184	16.78	25.40	25.62	32.20	0.00	0.00
GCC	185	14.69	23.54	31.00	30.77	0.00	0.00
GCC	186	13.67	16.07	30.70	39.57	0.00	0.00
GCC	187	16.92	16.67	28.28	38.13	0.00	0.00
GCC	188	17.89	21.41	26.02	34.69	0.00	0.00
GCC	189	21.25	22.81	22.81	33.12	0.00	0.00
GCC	190	29.86	23.02	24.10	23.02	0.00	0.00
GCC	191	31.62	26.48	21.34	20.55	0.00	0.00
GCC	192	32.92	24.58	21.25	21.25	0.00	0.00
GCC	193	29.79	22.98	19.15	28.09	0.00	0.00
GCC	194	24.68	22.94	18.61	33.77	0.00	0.00
GCC	195	14.41	27.95	18.34	39.30	0.00	0.00
GCC	196	14.98	20.70	20.26	44.05	0.00	0.00
GCC	197	19.82	22.03	23.35	34.80	0.00	0.00
GCC	198	19.91	13.72	33.63	32.74	0.00	0.00
GCC	199	22.57	14.16	34.96	28.32	0.00	0.00
GCC	200	17.26	15.04	38.50	29.20	0.00	0.00
GCC	201	25.45	16.07	32.14	26.34	0.00	0.00
GCC	202	25.23	19.37	26.13	29.28	0.00	0.00
GCC	203	23.39	18.35	30.73	27.52	0.00	0.00
GCC	204	27.57	18.69	25.23	28.50	0.00	0.00
GCC	205	22.86	19.05	37.14	20.95	0.00	0.00
GCC	206	28.23	26.32	27.75	17.70	0.00	0.00
GCC	207	31.40	18.84	28.02	21.74	0.00	0.00
GCC	208	24.51	22.06	25.00	28.43	0.00	0.00
GCC	209	31.00	18.50	27.00	23.50	0.00	0.00
GCC	210	34.20	16.06	36.27	13.47	0.00	0.00
GCC	211	34.92	13.23	29.63	22.22	0.00	0.00
GCC	212	29.51	6.56	41.53	22.40	0.00	0.00
GCC	213	43.03	8.48	32.73	15.76	0.00	0.00
GCC	214	45.65	7.97	36.23	10.14	0.00	0.00
GCC	215	47.71	10.09	27.52	14.68	0.00	0.00
GCC	216	34.85	9.09	42.42	13.64	0.00	0.00
GCC	217	56.76	13.51	5.41	24.32	0.00	0.00
GCC	218	35.29	11.76	35.29	17.65	0.00	0.00
GCC	219	11.76	29.41	41.18	17.65	0.00	0.00
GCC	220	12.50	12.50	37.50	37.50	0.00	0.00
GCC	221	12.50	31.25	43.75	12.50	0.00	0.00
GCC	222	18.75	25.00	37.50	18.75	0.00	0.00
GCC	223	31.25	31.25	12.50	25.00	0.00	0.00
GCC	224	31.25	31.25	12.50	25.00	0.00	0.00
GCC	225	12.50	56.25	6.25	25.00	0.00	0.00
GCC	226	0.00	68.75	0.00	31.25	0.00	0.00
GCC	227	0.00	68.75	12.50	18.75	0.00	0.00
GCC	228	0.00	31.25	18.75	50.00	0.00	0.00
GCC	229	0.00	50.00	18.75	31.25	0.00	0.00
GCC	230	0.00	25.00	25.00	50.00	0.00	0.00
GCC	231	18.75	37.50	12.50	31.25	0.00	0.00
GCC	232	37.50	25.00	31.25	6.25	0.00	0.00
GCC	233	50.00	6.25	43.75	0.00	0.00	0.00
GCC	234	62.50	25.00	12.50	0.00	0.00	0.00
GCC	235	62.50	6.25	31.25	0.00	0.00	0.00
GCC	236	12.50	56.25	31.25	0.00	0.00	0.00
GCC	237	43.75	50.00	6.25	0.00	0.00	0.00
GCC	238	25.00	37.50	12.50	25.00	0.00	0.00
GCC	239	0.00	62.50	31.25	6.25	0.00	0.00
GCC	240	0.00	25.00	6.25	68.75	0.00	0.00
GCC	241	25.00	12.50	31.25	31.25	0.00	0.00
GCC	242	12.50	18.75	43.75	25.00	0.00	0.00
GCC	243	25.00	31.25	12.50	31.25	0.00	0.00
GCC	244	18.75	37.50	25.00	18.75	0.00	0.00
GCC	245	12.50	37.50	43.75	6.25	0.00	0.00
GCC	246	18.75	43.75	37.50	0.00	0.00	0.00
GCC	247	6.25	18.75	62.50	12.50	0.00	0.00
GCC	248	0.00	0.00	62.50	37.50	0.00	0.00
GCC	249	6.25	0.00	56.25	37.50	0.00	0.00
GCC	250	0.00	25.00	25.00	50.00	0.00	0.00
GCC	251	6.25	18.75	31.25	43.75	0.00	0.00
GCC	252	31.25	25.00	25.00	18.75	0.00	0.00
GCC	253	37.50	31.25	31.25	0.00	0.00	0.00
GCC	254	37.50	0.00	56.25	6.25	0.00	0.00
GCC	255	81.25	6.25	12.50	0.00	0.00	0.00
GCC	256	33.33	0.00	60.00	6.67	0.00	0.00
GCC	257	30.77	30.77	38.46	0.00	0.00	0.00
GCC	258	23.08	15.38	30.77	30.77	0.00	0.00
GCC	259	0.00	61.54	23.08	15.38	0.00	0.00
GCC	260	0.00	69.23	0.00	30.77	0.00	0.00
GCC	261	0.00	46.15	0.00	53.85	0.00	0.00
GCC	262	0.00	53.85	0.00	46.15	0.00	0.00
GCC	263	30.77	23.08	0.00	46.15	0.00	0.00
GCC	264	46.15	0.00	0.00	53.85	0.00	0.00
GCC	265	46.15	0.00	0.00	53.85	0.00	0.00
GCC	266	61.54	7.69	15.38	15.38	0.00	0.00
GCC	267	46.15	7.69	7.69	38.46	0.00	0.00
GCC	268	23.08	15.38	23.08	38.46	0.00	0.00
GCC	269	30.77	7.69	53.85	7.69	0.00	0.00
GCC	270	15.38	23.08	46.15	15.38	0.00	0.00
GCC	271	15.38	15.38	30.77	38.46	0.00	0.00
GCC	272	0.00	30.77	38.46	30.77	0.00	0.00
GCC	273	23.08	30.77	30.77	15.38	0.00	0.00
GCC	274	12.50	12.50	25.00	50.00	0.00	0.00
GCC	275	20.00	20.00	40.00	20.00	0.00	0.00
GCC	276	33.33	66.67	0.00	0.00	0.00	0.00
GCC	277	50.00	0.00	50.00	0.00	0.00	0.00
# ACGT content per cycle, read oriented. Use `grep ^GCT | cut -f 2-` to extract this part. The columns are: cycle; A,C,G,T base counts as a percentage of all A/C/G/T bases [%]
GCT	1	25.43	22.33	30.18	22.05
GCT	2	24.89	21.99	29.16	23.96
GCT	3	24.75	21.65	31.01	22.58
GCT	4	25.11	20.86	31.75	22.29
GCT	5	24.70	21.11	31.73	22.45
GCT	6	25.39	20.79	30.92	22.90
GCT	7	24.52	21.54	30.68	23.27
GCT	8	24.17	22.37	30.63	22.83
GCT	9	31.86	0.18	33.46	34.51
GCT	10	0.06	34.45	65.28	0.21
GCT	11	0.03	0.05	66.61	33.31
GCT	12	0.04	0.02	67.77	32.18
GCT	13	0.19	0.03	32.06	67.72
GCT	14	33.29	0.04	34.62	32.05
GCT	15	32.01	0.20	33.33	34.45
GCT	16	34.44	33.28	32.19	0.09
GCT	17	0.08	32.01	67.67	0.24
GCT	18	0.03	34.61	32.07	33.29
GCT	19	0.04	33.33	34.60	32.03
GCT	20	0.06	32.00	33.32	34.62
GCT	21	0.27	34.39	32.00	33.34
GCT	22	33.52	0.08	34.39	32.01
GCT	23	65.27	0.03	0.31	34.39
GCT	24	66.39	0.26	33.24	0.11
GCT	25	34.49	33.27	31.96	0.28
GCT	26	0.40	31.99	34.31	33.30
GCT	27	33.56	34.33	0.09	32.02
GCT	28	65.29	0.10	0.01	34.59
GCT	29	66.61	0.03	0.02	33.35
GCT	30	67.71	0.26	0.03	32.00
GCT	31	32.13	33.26	0.26	34.34
GCT	32	34.65	31.99	33.26	0.10
GCT	33	33.66	34.32	31.99	0.02
GCT	34	65.57	0.08	34.33	0.03
GCT	35	99.87	0.00	0.09	0.04
GCT	36	99.70	0.00	0.01	0.29
GCT	37	66.46	0.01	0.01	33.53
GCT	38	34.72	0.01	0.01	65.26
GCT	39	33.66	0.01	0.01	66.32
GCT	40	65.56	0.01	0.01	34.42
GCT	41	99.87	0.01	0.01	0.10
GCT	42	99.94	0.01	0.02	0.03
GCT	43	99.69	0.01	0.03	0.27
GCT	44	66.44	0.02	0.27	33.27
GCT	45	34.70	0.03	33.27	32.00
GCT	46	33.40	0.27	32.00	34.33
GCT	47	32.31	33.26	34.33	0.10
GCT	48	67.89	31.98	0.10	0.02
GCT	49	65.64	34.31	0.02	0.03
GCT	50	99.85	0.08	0.02	0.05
GCT	51	99.68	0.00	0.03	0.29
GCT	52	66.66	0.01	0.04	33.30
GCT	53	67.67	0.01	0.28	32.04
GCT	54	32.09	0.00	33.28	34.63
GCT	55	34.34	0.01	32.02	33.64
GCT	56	0.10	0.01	34.36	65.53
GCT	57	0.03	0.02	0.38	99.57
GCT	58	0.06	0.01	33.53	66.40
GCT	59	0.32	0.02	65.25	34.41
GCT	60	33.56	0.03	66.31	0.11
GCT	61	65.29	0.27	34.39	0.05
GCT	62	66.33	33.27	0.11	0.30
GCT	63	34.68	31.99	0.03	33.30
GCT	64	33.38	34.32	0.28	32.03
GCT	65	32.28	0.10	33.26	34.37
GCT	66	67.59	0.02	31.99	0.40
GCT	67	32.08	0.03	34.32	33.58
GCT	68	34.32	0.04	0.09	65.55
GCT	69	0.12	0.30	0.01	99.57
GCT	70	0.30	33.28	0.01	66.41
GCT	71	33.27	32.28	0.01	34.45
GCT	72	32.00	67.57	0.01	0.42
GCT	73	34.32	32.09	0.02	33.58
GCT	74	0.38	34.31	0.02	65.29
GCT	75	33.26	0.12	0.02	66.60
GCT	76	31.99	0.30	0.03	67.68
GCT	77	34.29	33.26	0.06	32.40
GCT	78	0.10	31.98	0.34	67.57
GCT	79	0.01	34.29	33.58	32.12
GCT	80	0.01	0.11	65.26	34.62
GCT	81	0.01	0.02	66.30	33.67
GCT	82	0.01	0.03	34.72	65.24
GCT	83	0.01	0.04	33.69	66.26
GCT	84	0.01	0.34	65.27	34.38
GCT	85	0.02	33.27	66.58	0.13
GCT	86	0.01	32.41	67.53	0.05
GCT	87	0.02	67.50	32.04	0.44
GCT	88	0.03	32.10	34.62	33.26
GCT	89	0.04	34.24	33.71	32.01
GCT	90	0.46	0.24	65.13	34.16
GCT	91	33.33	0.46	66.05	0.16
GCT	92	32.11	33.14	34.37	0.38
GCT	93	34.25	31.91	0.70	33.14
GCT	94	0.30	34.31	33.38	32.01
GCT	95	11.42	8.54	37.97	42.07
GCT	96	22.20	16.35	45.64	15.81
GCT	97	33.47	24.87	17.64	24.03
GCT	98	33.28	24.88	17.60	24.23
GCT	99	33.26	24.92	17.39	24.44
GCT	100	33.37	24.64	17.36	24.63
GCT	101	33.54	24.57	17.25	24.64
GCT	102	33.38	24.12	17.61	24.89
GCT	103	33.37	23.86	18.20	24.56
GCT	104	33.36	23.85	18.34	24.45
GCT	105	33.09	23.95	18.55	24.42
GCT	106	33.14	24.02	17.91	24.92
GCT	107	33.21	24.08	17.78	24.93
GCT	108	33.88	23.54	17.68	24.89
GCT	109	34.56	23.43	17.35	24.66
GCT	110	34.44	23.39	17.48	24.69
GCT	111	34.34	23.49	17.35	24.81
GCT	112	34.23	23.43	17.56	24.79
GCT	113	34.14	23.26	17.59	25.01
GCT	114	34.16	23.10	17.83	24.90
GCT	115	34.20	22.94	18.01	24.85
GCT	116	34.66	22.92	18.03	24.39
GCT	117	34.98	22.65	18.18	24.20
GCT	118	35.02	22.76	17.68	24.55
GCT	119	34.55	22.57	17.93	24.95
GCT	120	22.84	47.67	12.46	17.02
GCT	121	11.82	39.38	39.46	9.34
GCT	122	0.75	34.02	32.10	33.14
GCT	123	33.09	0.36	34.60	31.95
GCT	124	32.04	0.11	33.92	33.93
GCT	125	34.56	0.11	65.02	0.31
GCT	126	33.40	0.11	66.41	0.09
GCT	127	32.56	0.13	67.21	0.10
GCT	128	66.90	0.17	32.82	0.11
GCT	129	32.25	0.68	66.90	0.17
GCT	130	33.95	33.05	32.27	0.74
GCT	131	0.37	32.00	33.98	33.66
GCT	132	0.09	34.48	0.47	64.96
GCT	133	0.08	33.32	0.73	65.86
GCT	134	0.11	31.99	33.13	34.77
GCT	135	0.12	33.94	32.63	33.31
GCT	136	0.16	0.42	67.45	31.97
GCT	137	0.70	0.18	65.21	33.90
GCT	138	33.10	0.73	65.81	0.37
GCT	139	32.58	33.06	34.22	0.14
GCT	140	66.82	32.04	0.44	0.70
GCT	141	32.24	34.55	0.19	33.02
GCT	142	33.91	33.36	0.77	31.96
GCT	143	0.42	32.07	33.63	33.88
GCT	144	0.13	34.63	64.87	0.37
GCT	145	0.18	33.99	65.72	0.10
GCT	146	0.24	65.51	34.13	0.12
GCT	147	0.87	98.62	0.39	0.12
GCT	148	33.70	66.01	0.16	0.14
GCT	149	64.89	34.20	0.76	0.15
GCT	150	65.69	1.09	33.03	0.19
GCT	151	34.15	32.93	32.01	0.91
GCT	152	0.45	31.93	33.86	33.76
GCT	153	0.17	34.43	0.47	64.94
GCT	154	0.17	33.32	0.16	66.35
GCT	155	0.19	32.62	0.21	66.98
GCT	156	0.27	66.60	0.88	32.25
GCT	157	0.92	32.21	33.12	33.75
GCT	158	33.07	33.70	32.80	0.43
GCT	159	32.12	0.38	67.37	0.12
GCT	160	34.73	0.08	65.07	0.12
GCT	161	34.26	0.10	65.47	0.18
GCT	162	65.01	0.10	33.96	0.93
GCT	163	65.73	0.11	0.42	33.74
GCT	164	34.75	0.23	0.17	64.85
GCT	165	25.54	4.42	2.18	67.86
GCT	166	28.97	23.93	6.18	40.92
GCT	167	37.89	34.48	12.77	14.86
GCT	168	20.38	42.04	17.46	20.13
GCT	169	24.33	32.29	20.18	23.20
GCT	170	24.39	31.62	20.52	23.48
GCT	171	24.69	31.41	20.56	23.35
GCT	172	24.09	31.60	20.69	23.62
GCT	173	24.92	30.39	20.86	23.83
GCT	174	25.54	28.88	21.08	24.50
GCT	175	26.93	26.41	21.31	25.34
GCT	176	26.88	24.55	21.92	26.65
GCT	177	35.41	20.00	21.65	22.93
GCT	178	35.58	16.19	19.73	28.50
GCT	179	32.12	16.70	20.15	31.03
GCT	180	34.24	21.08	22.44	22.24
GCT	181	35.74	16.67	29.92	17.67
GCT	182	37.42	18.39	28.33	15.86
GCT	183	34.73	25.27	25.49	14.51
GCT	184	32.20	25.62	25.40	16.78
GCT	185	30.77	31.00	23.54	14.69
GCT	186	39.57	30.70	16.07	13.67
GCT	187	38.13	28.28	16.67	16.92
GCT	188	34.69	26.02	21.41	17.89
GCT	189	33.12	22.81	22.81	21.25
GCT	190	23.02	24.10	23.02	29.86
GCT	191	20.55	21.34	26.48	31.62
GCT	192	21.25	21.25	24.58	32.92
GCT	193	28.09	19.15	22.98	29.79
GCT	194	33.77	18.61	22.94	24.68
GCT	195	39.30	18.34	27.95	14.41
GCT	196	44.05	20.26	20.70	14.98
GCT	197	34.80	23.35	22.03	19.82
GCT	198	32.74	33.63	13.72	19.91
GCT	199	28.32	34.96	14.16	22.57
GCT	200	29.20	38.50	15.04	17.26
GCT	201	26.34	32.14	16.07	25.45
GCT	202	29.28	26.13	19.37	25.23
GCT	203	27.52	30.73	18.35	23.39
GCT	204	28.50	25.23	18.69	27.57
GCT	205	20.95	37.14	19.05	22.86
GCT	206	17.70	27.75	26.32	28.23
GCT	207	21.74	28.02	18.84	31.40
GCT	208	28.43	25.00	22.06	24.51
GCT	209	23.50	27.00	18.50	31.00
GCT	210	13.47	36.27	16.06	34.20
GCT	211	22.22	29.63	13.23	34.92
GCT	212	22.40	41.53	6.56	29.51
GCT	213	15.76	32.73	8.48	43.03
GCT	214	10.14	36.23	7.97	45.65
GCT	215	14.68	27.52	10.09	47.71
GCT	216	13.64	42.42	9.09	34.85
GCT	217	24.32	5.41	13.51	56.76
GCT	218	17.65	35.29	11.76	35.29
GCT	219	17.65	41.18	29.41	11.76
GCT	220	37.50	37.50	12.50	12.50
GCT	221	12.50	43.75	31.25	12.50
GCT	222	18.75	37.50	25.00	18.75
GCT	223	25.00	12.50	31.25	31.25
GCT	224	25.00	12.50	31.25	31.25
GCT	225	25.00	6.25	56.25	12.50
GCT	226	31.25	0.00	68.75	0.00
GCT	227	18.75	12.50	68.75	0.00
GCT	228	50.00	18.75	31.25	0.00
GCT	229	31.25	18.75	50.00	0.00
GCT	230	50.00	25.00	25.00	0.00
GCT	231	31.25	12.50	37.50	18.75
GCT	232	6.25	31.25	25.00	37.50
GCT	233	0.00	43.75	6.25	50.00
GCT	234	0.00	12.50	25.00	62.50
GCT	235	0.00	31.25	6.25	62.50
GCT	236	0.00	31.25	56.25	12.50
GCT	237	0.00	6.25	50.00	43.75
GCT	238	25.00	12.50	37.50	25.00
GCT	239	6.25	31.25	62.50	0.00
GCT	240	68.75	6.25	25.00	0.00
GCT	241	31.25	31.25	12.50	25.00
GCT	242	25.00	43.75	18.75	12.50
GCT	243	31.25	12.50	31.25	25.00
GCT	244	18.75	25.00	37.50	18.75
GCT	245	6.25	43.75	37.50	12.50
GCT	246	0.00	37.50	43.75	18.75
GCT	247	12.50	62.50	18.75	6.25
GCT	248	37.50	62.50	0.00	0.00
GCT	249	37.50	56.25	0.00	6.25
GCT	250	50.00	25.00	25.00	0.00
GCT	251	43.75	31.25	18.75	6.25
GCT	252	18.75	25.00	25.00	31.25
GCT	253	0.00	31.25	31.25	37.50
GCT	254	6.25	56.25	0.00	37.50
GCT	255	0.00	12.50	6.25	81.25
GCT	256	6.67	60.00	0.00	33.33
GCT	257	0.00	38.46	30.77	30.77
GCT	258	30.77	30.77	15.38	23.08
GCT	259	15.38	23.08	61.54	0.00
GCT	260	30.77	0.00	69.23	0.00
GCT	261	53.85	0.00	46.15	0.00
GCT	262	46.15	0.00	53.85	0.00
GCT	263	46.15	0.00	23.08	30.77
GCT	264	53.85	0.00	0.00	46.15
GCT	265	53.85	0.00	0.00	46.15
GCT	266	15.38	15.38	7.69	61.54
GCT	267	38.46	7.69	7.69	46.15
GCT	268	38.46	23.08	15.38	23.08
GCT	269	7.69	53.85	7.69	30.77
GCT	270	15.38	46.15	23.08	15.38
GCT	271	38.46	30.77	15.38	15.38
GCT	272	30.77	38.46	30.77	0.00
GCT	273	15.38	30.77	30.77	23.08
GCT	274	50.00	25.00	12.50	12.50
GCT	275	20.00	40.00	20.00	20.00
GCT	276	0.00	0.00	66.67	33.33
GCT	277	0.00	50.00	0.00	50.00
# ACGT content per cycle for first fragments. Use `grep ^FBC | cut -f 2-` to extract this part. The columns are: cycle; A,C,G,T base counts as a percentage of all A/C/G/T bases [%]; and N and O counts as a percentage of all A/C/G/T bases [%]
FBC	1	22.05	30.18	22.33	25.43	0.00	0.00
FBC	2	23.97	29.16	21.99	24.89	0.00	0.00
FBC	3	22.58	31.01	21.66	24.75	0.00	0.00
FBC	4	22.29	31.74	20.87	25.11	0.00	0.00
FBC	5	22.45	31.73	21.11	24.70	0.00	0.00
FBC	6	22.89	30.92	20.79	25.39	0.00	0.00
FBC	7	23.27	30.67	21.54	24.51	0.00	0.00
FBC	8	22.83	30.63	22.37	24.17	0.00	0.00
FBC	9	34.51	33.45	0.18	31.86	0.00	0.00
FBC	10	0.21	65.28	34.45	0.06	0.00	0.00
FBC	11	33.30	66.60	0.06	0.03	0.00	0.00
FBC	12	32.17	67.76	0.03	0.04	0.00	0.00
FBC	13	67.71	32.06	0.03	0.20	0.00	0.00
FBC	14	32.05	34.62	0.04	33.28	0.00	0.00
FBC	15	34.45	33.33	0.21	32.01	0.00	0.00
FBC	16	0.09	32.19	33.28	34.44	0.00	0.00
FBC	17	0.24	67.67	32.01	0.08	0.00	0.00
FBC	18	33.29	32.07	34.61	0.04	0.00	0.00
FBC	19	32.03	34.60	33.33	0.04	0.00	0.00
FBC	20	34.62	33.32	32.00	0.06	0.00	0.00
FBC	21	33.34	32.00	34.39	0.27	0.00	0.00
FBC	22	32.01	34.38	0.09	33.52	0.00	0.00
FBC	23	34.39	0.31	0.03	65.27	0.00	0.00
FBC	24	0.12	33.24	0.27	66.38	0.00	0.00
FBC	25	0.29	31.96	33.27	34.48	0.00	0.00
FBC	26	33.30	34.31	31.99	0.40	0.00	0.00
FBC	27	32.02	0.09	34.33	33.56	0.00	0.00
FBC	28	34.60	0.01	0.10	65.29	0.00	0.00
FBC	29	33.35	0.02	0.03	66.60	0.00	0.00
FBC	30	32.00	0.03	0.26	67.70	0.00	0.00
FBC	31	34.34	0.27	33.26	32.13	0.00	0.00
FBC	32	0.10	33.26	31.99	34.65	0.00	0.00
FBC	33	0.03	31.99	34.32	33.66	0.00	0.00
FBC	34	0.04	34.32	0.08	65.56	0.00	0.00
FBC	35	0.06	0.09	0.00	99.85	0.00	0.00
FBC	36	0.30	0.01	0.00	99.68	0.00	0.00
FBC	37	33.53	0.01	0.01	66.45	0.00	0.00
FBC	38	65.26	0.01	0.01	34.72	0.00	0.00
FBC	39	66.32	0.01	0.01	33.66	0.00	0.00
FBC	40	34.42	0.01	0.01	65.56	0.00	0.00
FBC	41	0.12	0.01	0.01	99.86	0.00	0.00
FBC	42	0.04	0.02	0.01	99.92	0.00	0.00
FBC	43	0.28	0.03	0.01	99.67	0.00	0.00
FBC	44	33.27	0.27	0.02	66.43	0.00	0.00
FBC	45	32.00	33.26	0.03	34.70	0.00	0.00
FBC	46	34.33	32.00	0.28	33.40	0.00	0.00
FBC	47	0.10	34.33	33.26	32.31	0.00	0.00
FBC	48	0.03	0.10	31.98	67.88	0.00	0.00
FBC	49	0.04	0.02	34.31	65.63	0.00	0.00
FBC	50	0.06	0.02	0.08	99.84	0.00	0.00
FBC	51	0.31	0.03	0.00	99.66	0.00	0.00
FBC	52	33.30	0.04	0.01	66.65	0.00	0.00
FBC	53	32.04	0.28	0.01	67.67	0.00	0.00
FBC	54	34.63	33.28	0.01	32.09	0.00	0.00
FBC	55	33.63	32.01	0.01	34.34	0.00	0.00
FBC	56	65.52	34.35	0.02	0.11	0.00	0.00
FBC	57	99.56	0.37	0.02	0.05	0.00	0.00
FBC	58	66.39	33.52	0.02	0.07	0.00	0.00
FBC	59	34.41	65.24	0.03	0.33	0.00	0.00
FBC	60	0.11	66.30	0.04	33.55	0.00	0.00
FBC	61	0.06	34.39	0.28	65.28	0.00	0.00
FBC	62	0.30	0.11	33.26	66.32	0.00	0.00
FBC	63	33.30	0.04	31.99	34.68	0.00	0.00
FBC	64	32.03	0.28	34.32	33.37	0.00	0.00
FBC	65	34.37	33.26	0.10	32.27	0.00	0.00
FBC	66	0.41	31.99	0.02	67.58	0.00	0.00
FBC	67	33.58	34.31	0.03	32.08	0.00	0.00
FBC	68	65.54	0.09	0.04	34.33	0.00	0.00
FBC	69	99.56	0.01	0.30	0.13	0.00	0.00
FBC	70	66.40	0.01	33.28	0.30	0.00	0.00
FBC	71	34.45	0.01	32.27	33.27	0.00	0.00
FBC	72	0.43	0.02	67.56	32.00	0.00	0.00
FBC	73	33.58	0.02	32.08	34.32	0.00	0.00
FBC	74	65.28	0.02	34.31	0.39	0.00	0.00
FBC	75	66.60	0.02	0.12	33.26	0.00	0.00
FBC	76	67.67	0.03	0.30	31.99	0.00	0.00
FBC	77	32.39	0.06	33.26	34.29	0.00	0.00
FBC	78	67.56	0.35	31.98	0.11	0.00	0.00
FBC	79	32.12	33.58	34.29	0.01	0.00	0.00
FBC	80	34.62	65.25	0.12	0.01	0.00	0.00
FBC	81	33.66	66.30	0.03	0.02	0.00	0.00
FBC	82	65.23	34.71	0.04	0.02	0.00	0.00
FBC	83	66.25	33.68	0.05	0.02	0.00	0.00
FBC	84	34.37	65.26	0.35	0.02	0.00	0.00
FBC	85	0.13	66.57	33.27	0.02	0.00	0.00
FBC	86	0.04	67.53	32.41	0.02	0.00	0.00
FBC	87	0.44	32.05	67.50	0.02	0.00	0.00
FBC	88	33.25	34.61	32.10	0.03	0.00	0.00
FBC	89	32.00	33.71	34.24	0.05	0.00	0.00
FBC	90	34.16	65.13	0.25	0.46	0.00	0.00
FBC	91	0.16	66.04	0.46	33.33	0.00	0.00
FBC	92	0.38	34.37	33.14	32.11	0.00	0.00
FBC	93	33.13	0.70	31.91	34.25	0.00	0.00
FBC	94	32.00	33.37	34.32	0.31	0.00	0.00
FBC	95	42.06	37.97	8.54	11.43	0.00	0.00
FBC	96	15.81	45.64	16.36	22.20	0.00	0.00
FBC	97	24.03	17.64	24.86	33.46	0.00	0.00
FBC	98	24.23	17.60	24.88	33.28	0.00	0.00
FBC	99	24.44	17.39	24.92	33.25	0.00	0.00
FBC	100	24.63	17.37	24.64	33.37	0.00	0.00
FBC	101	24.64	17.25	24.57	33.54	0.00	0.00
FBC	102	24.89	17.61	24.12	33.38	0.00	0.00
FBC	103	24.57	18.20	23.87	33.37	0.00	0.00
FBC	104	24.45	18.34	23.85	33.36	0.00	0.00
FBC	105	24.42	18.55	23.95	33.09	0.00	0.00
FBC	106	24.92	17.91	24.02	33.14	0.00	0.00
FBC	107	24.93	17.78	24.08	33.20	0.00	0.00
FBC	108	24.89	17.68	23.54	33.88	0.00	0.00
FBC	109	24.66	17.35	23.43	34.56	0.00	0.00
FBC	110	24.69	17.48	23.39	34.44	0.00	0.00
FBC	111	24.82	17.36	23.49	34.33	0.00	0.00
FBC	112	24.79	17.56	23.43	34.22	0.00	0.00
FBC	113	25.01	17.59	23.26	34.14	0.00	0.00
FBC	114	24.90	17.83	23.10	34.17	0.00	0.00
FBC	115	24.85	18.01	22.94	34.20	0.00	0.00
FBC	116	24.39	18.03	22.92	34.66	0.00	0.00
FBC	117	24.20	18.18	22.64	34.98	0.00	0.00
FBC	118	24.55	17.68	22.75	35.02	0.00	0.00
FBC	119	24.96	17.93	22.57	34.55	0.00	0.00
FBC	120	17.02	12.47	47.67	22.84	0.00	0.00
FBC	121	9.34	39.46	39.38	11.82	0.00	0.00
FBC	122	33.13	32.10	34.02	0.75	0.00	0.00
FBC	123	31.95	34.60	0.36	33.09	0.00	0.00
FBC	124	33.93	33.92	0.12	32.04	0.00	0.00
FBC	125	0.31	65.01	0.12	34.56	0.00	0.00
FBC	126	0.09	66.40	0.12	33.39	0.00	0.00
FBC	127	0.10	67.20	0.14	32.55	0.00	0.00
FBC	128	0.12	32.82	0.17	66.89	0.00	0.00
FBC	129	0.18	66.89	0.69	32.24	0.00	0.00
FBC	130	0.74	32.27	33.05	33.94	0.00	0.00
FBC	131	33.65	33.98	32.00	0.37	0.00	0.00
FBC	132	64.95	0.48	34.48	0.10	0.00	0.00
FBC	133	65.85	0.74	33.32	0.09	0.00	0.00
FBC	134	34.77	33.13	31.99	0.11	0.00	0.00
FBC	135	33.31	32.63	33.94	0.12	0.00	0.00
FBC	136	31.97	67.44	0.43	0.16	0.00	0.00
FBC	137	33.90	65.21	0.19	0.71	0.00	0.00
FBC	138	0.37	65.80	0.73	33.09	0.00	0.00
FBC	139	0.14	34.22	33.06	32.58	0.00	0.00
FBC	140	0.70	0.44	32.04	66.82	0.00	0.00
FBC	141	33.02	0.20	34.54	32.24	0.00	0.00
FBC	142	31.96	0.77	33.36	33.91	0.00	0.00
FBC	143	33.88	33.63	32.08	0.42	0.00	0.00
FBC	144	0.37	64.87	34.63	0.13	0.00	0.00
FBC	145	0.10	65.72	34.00	0.18	0.00	0.00
FBC	146	0.12	34.14	65.51	0.24	0.00	0.00
FBC	147	0.12	0.41	98.61	0.87	0.00	0.00
FBC	148	0.14	0.16	66.00	33.70	0.00	0.00
FBC	149	0.16	0.76	34.19	64.88	0.00	0.00
FBC	150	0.20	33.02	1.10	65.68	0.00	0.00
FBC	151	0.91	32.01	32.94	34.14	0.00	0.00
FBC	152	33.76	33.85	31.93	0.45	0.00	0.00
FBC	153	64.93	0.47	34.42	0.18	0.00	0.00
FBC	154	66.34	0.17	33.31	0.18	0.00	0.00
FBC	155	66.97	0.22	32.62	0.20	0.00	0.00
FBC	156	32.24	0.89	66.60	0.27	0.00	0.00
FBC	157	33.75	33.11	32.21	0.92	0.00	0.00
FBC	158	0.43	32.80	33.70	33.07	0.00	0.00
FBC	159	0.13	67.37	0.39	32.12	0.00	0.00
FBC	160	0.12	65.06	0.09	34.73	0.00	0.00
FBC	161	0.18	65.46	0.10	34.25	0.00	0.00
FBC	162	0.94	33.96	0.10	65.00	0.00	0.00
FBC	163	33.74	0.42	0.11	65.73	0.00	0.00
FBC	164	64.85	0.17	0.23	34.75	0.00	0.00
FBC	165	67.85	2.18	4.42	25.55	0.00	0.00
FBC	166	40.92	6.18	23.93	28.97	0.00	0.00
FBC	167	14.86	12.77	34.48	37.89	0.00	0.00
FBC	168	20.13	17.46	42.03	20.38	0.00	0.00
FBC	169	23.20	20.19	32.29	24.33	0.00	0.00
FBC	170	23.48	20.52	31.62	24.39	0.00	0.00
FBC	171	23.35	20.56	31.40	24.68	0.00	0.00
FBC	172	23.62	20.69	31.60	24.09	0.00	0.00
FBC	173	23.83	20.86	30.39	24.92	0.00	0.00
FBC	174	24.50	21.08	28.88	25.54	0.00	0.00
FBC	175	25.34	21.32	26.41	26.93	0.00	0.00
FBC	176	26.65	21.92	24.55	26.88	0.00	0.00
FBC	177	22.93	21.65	20.00	35.41	0.00	0.00
FBC	178	28.50	19.73	16.19	35.58	0.00	0.00
FBC	179	31.03	20.15	16.70	32.12	0.00	0.00
FBC	180	22.24	22.44	21.08	34.24	0.00	0.00
FBC	181	17.67	29.92	16.67	35.74	0.00	0.00
FBC	182	15.86	28.33	18.39	37.42	0.00	0.00
FBC	183	14.51	25.49	25.27	34.73	0.00	0.00
FBC	184	16.78	25.40	25.62	32.20	0.00	0.00
FBC	185	14.69	23.54	31.00	30.77	0.00	0.00
FBC	186	13.67	16.07	30.70	39.57	0.00	0.00
FBC	187	16.92	16.67	28.28	38.13	0.00	0.00
FBC	188	17.89	21.41	26.02	34.69	0.00	0.00
FBC	189	21.25	22.81	22.81	33.12	0.00	0.00
FBC	190	29.86	23.02	24.10	23.02	0.00	0.00
FBC	191	31.62	26.48	21.34	20.55	0.00	0.00
FBC	192	32.92	24.58	21.25	21.25	0.00	0.00
FBC	193	29.79	22.98	19.15	28.09	0.00	0.00
FBC	194	24.68	22.94	18.61	33.77	0.00	0.00
FBC	195	14.41	27.95	18.34	39.30	0.00	0.00
FBC	196	14.98	20.70	20.26	44.05	0.00	0.00
FBC	197	19.82	22.03	23.35	34.80	0.00	0.00
FBC	198	19.91	13.72	33.63	32.74	0.00	0.00
FBC	199	22.57	14.16	34.96	28.32	0.00	0.00
FBC	200	17.26	15.04	38.50	29.20	0.00	0.00
FBC	201	25.45	16.07	32.14	26.34	0.00	0.00
FBC	202	25.23	19.37	26.13	29.28	0.00	0.00
FBC	203	23.39	18.35	30.73	27.52	0.00	0.00
FBC	204	27.57	18.69	25.23	28.50	0.00	0.00
FBC	205	22.86	19.05	37.14	20.95	0.00	0.00
FBC	206	28.23	26.32	27.75	17.70	0.00	0.00
FBC	207	31.40	18.84	28.02	21.74	0.00	0.00
FBC	208	24.51	22.06	25.00	28.43	0.00	0.00
FBC	209	31.00	18.50	27.00	23.50	0.00	0.00
FBC	210	34.20	16.06	36.27	13.47	0.00	0.00
FBC	211	34.92	13.23	29.63	22.22	0.00	0.00
FBC	212	29.51	6.56	41.53	22.40	0.00	0.00
FBC	213	43.03	8.48	32.73	15.76	0.00	0.00
FBC	214	45.65	7.97	36.23	10.14	0.00	0.00
FBC	215	47.71	10.09	27.52	14.68	0.00	0.00
FBC	216	34.85	9.09	42.42	13.64	0.00	0.00
FBC	217	56.76	13.51	5.41	24.32	0.00	0.00
FBC	218	35.29	11.76	35.29	17.65	0.00	0.00
FBC	219	11.76	29.41	41.18	17.65	0.00	0.00
FBC	220	12.50	12.50	37.50	37.50	0.00	0.00
FBC	221	12.50	31.25	43.75	12.50	0.00	0.00
FBC	222	18.75	25.00	37.50	18.75	0.00	0.00
FBC	223	31.25	31.25	12.50	25.00	0.00	0.00
FBC	224	31.25	31.25	12.50	25.00	0.00	0.00
FBC	225	12.50	56.25	6.25	25.00	0.00	0.00
FBC	226	0.00	68.75	0.00	31.25	0.00	0.00
FBC	227	0.00	68.75	12.50	18.75	0.00	0.00
FBC	228	0.00	31.25	18.75	50.00	0.00	0.00
FBC	229	0.00	50.00	18.75	31.25	0.00	0.00
FBC	230	0.00	25.00	25.00	50.00	0.00	0.00
FBC	231	18.75	37.50	12.50	31.25	0.00	0.00
FBC	232	37.50	25.00	31.25	6.25	0.00	0.00
FBC	233	50.00	6.25	43.75	0.00	0.00	0.00
FBC	234	62.50	25.00	12.50	0.00	0.00	0.00
FBC	235	62.50	6.25	31.25	0.00	0.00	0.00
FBC	236	12.50	56.25	31.25	0.00	0.00	0.00
FBC	237	43.75	50.00	6.25	0.00	0.00	0.00
FBC	238	25.00	37.50	12.50	25.00	0.00	0.00
FBC	239	0.00	62.50	31.25	6.25	0.00	0.00
FBC	240	0.00	25.00	6.25	68.75	0.00	0.00
FBC	241	25.00	12.50	31.25	31.25	0.00	0.00
FBC	242	12.50	18.75	43.75	25.00	0.00	0.00
FBC	243	25.00	31.25	12.50	31.25	0.00	0.00
FBC	244	18.75	37.50	25.00	18.75	0.00	0.00
FBC	245	12.50	37.50	43.75	6.25	0.00	0.00
FBC	246	18.75	43.75	37.50	0.00	0.00	0.00
FBC	247	6.25	18.75	62.50	12.50	0.00	0.00
FBC	248	0.00	0.00	62.50	37.50	0.00	0.00
FBC	249	6.25	0.00	56.25	37.50	0.00	0.00
FBC	250	0.00	25.00	25.00	50.00	0.00	0.00
FBC	251	6.25	18.75	31.25	43.75	0.00	0.00
FBC	252	31.25	25.00	25.00	18.75	0.00	0.00
FBC	253	37.50	31.25	31.25	0.00	0.00	0.00
FBC	254	37.50	0.00	56.25	6.25	0.00	0.00
FBC	255	81.25	6.25	12.50	0.00	0.00	0.00
FBC	256	33.33	0.00	60.00	6.67	0.00	0.00
FBC	257	30.77	30.77	38.46	0.00	0.00	0.00
FBC	258	23.08	15.38	30.77	30.77	0.00	0.00
FBC	259	0.00	61.54	23.08	15.38	0.00	0.00
FBC	260	0.00	69.23	0.00	30.77	0.00	0.00
FBC	261	0.00	46.15	0.00	53.85	0.00	0.00
FBC	262	0.00	53.85	0.00	46.15	0.00	0.00
FBC	263	30.77	23.08	0.00	46.15	0.00	0.00
FBC	264	46.15	0.00	0.00	53.85	0.00	0.00
FBC	265	46.15	0.00	0.00	53.85	0.00	0.00
FBC	266	61.54	7.69	15.38	15.38	0.00	0.00
FBC	267	46.15	7.69	7.69	38.46	0.00	0.00
FBC	268	23.08	15.38	23.08	38.46	0.00	0.00
FBC	269	30.77	7.69	53.85	7.69	0.00	0.00
FBC	270	15.38	23.08	46.15	15.38	0.00	0.00
FBC	271	15.38	15.38	30.77	38.46	0.00	0.00
FBC	272	0.00	30.77	38.46	30.77	0.00	0.00
FBC	273	23.08	30.77	30.77	15.38	0.00	0.00
FBC	274	12.50	12.50	25.00	50.00	0.00	0.00
FBC	275	20.00	20.00	40.00	20.00	0.00	0.00
FBC	276	33.33	66.67	0.00	0.00	0.00	0.00
FBC	277	50.00	0.00	50.00	0.00	0.00	0.00
# ACGT raw counters for first fragments. Use `grep ^FTC | cut -f 2-` to extract this part. The columns are: A,C,G,T,N base counters
FTC	20947061	20161839	15703967	23835007	0
# ACGT content per cycle for last fragments. Use `grep ^LBC | cut -f 2-` to extract this part. The columns are: cycle; A,C,G,T base counts as a percentage of all A/C/G/T bases [%]; and N and O counts as a percentage of all A/C/G/T bases [%]
# ACGT raw counters for last fragments. Use `grep ^LTC | cut -f 2-` to extract this part. The columns are: A,C,G,T,N base counters
LTC	0	0	0	0	0
# Insert sizes. Use `grep ^IS | cut -f 2-` to extract this part. The columns are: insert size, pairs total, inward oriented pairs, outward oriented pairs, other pairs
# Read lengths. Use `grep ^RL | cut -f 2-` to extract this part. The columns are: read length, count
RL	50	1
RL	62	1
RL	93	1
RL	94	1
RL	96	2
RL	113	3
RL	115	2
RL	116	2
RL	117	2
RL	118	2
RL	127	2
RL	131	1
RL	132	3
RL	134	1
RL	135	1
RL	136	2
RL	138	1
RL	139	9
RL	140	18
RL	141	34
RL	142	35
RL	143	18
RL	145	1
RL	146	5
RL	147	12
RL	148	17
RL	149	44
RL	150	54
RL	151	43
RL	152	53
RL	153	59
RL	154	58
RL	155	50
RL	156	48
RL	157	23
RL	158	23
RL	159	36
RL	160	37
RL	161	29
RL	162	37
RL	163	39
RL	164	62
RL	165	59
RL	166	73
RL	167	101
RL	168	166
RL	169	183
RL	170	308
RL	171	1656
RL	172	48528
RL	173	94550
RL	174	151299
RL	175	104881
RL	176	59377
RL	177	737
RL	178	42
RL	179	34
RL	180	19
RL	181	25
RL	182	18
RL	183	14
RL	184	12
RL	185	12
RL	186	21
RL	187	27
RL	188	49
RL	189	42
RL	190	25
RL	191	13
RL	192	5
RL	193	4
RL	194	2
RL	195	2
RL	197	1
RL	200	2
RL	201	2
RL	202	4
RL	203	4
RL	204	4
RL	205	1
RL	206	2
RL	207	3
RL	208	4
RL	209	7
RL	210	4
RL	211	6
RL	212	18
RL	213	27
RL	214	29
RL	215	43
RL	216	29
RL	217	20
RL	219	1
RL	255	1
RL	256	2
RL	273	5
RL	274	3
RL	275	2
RL	276	1
RL	277	2
# Read lengths - first fragments. Use `grep ^FRL | cut -f 2-` to extract this part. The columns are: read length, count
FRL	50	1
FRL	62	1
FRL	93	1
FRL	94	1
FRL	96	2
FRL	113	3
FRL	115	2
FRL	116	2
FRL	117	2
FRL	118	2
FRL	127	2
FRL	131	1
FRL	132	3
FRL	134	1
FRL	135	1
FRL	136	2
FRL	138	1
FRL	139	9
FRL	140	18
FRL	141	34
FRL	142	35
FRL	143	18
FRL	145	1
FRL	146	5
FRL	147	12
FRL	148	17
FRL	149	44
FRL	150	54
FRL	151	43
FRL	152	53
FRL	153	59
FRL	154	58
FRL	155	50
FRL	156	48
FRL	157	23
FRL	158	23
FRL	159	36
FRL	160	37
FRL	161	29
FRL	162	37
FRL	163	39
FRL	164	62
FRL	165	59
FRL	166	73
FRL	167	101
FRL	168	166
FRL	169	183
FRL	170	308
FRL	171	1656
FRL	172	48528
FRL	173	94550
FRL	174	151299
FRL	175	104881
FRL	176	59377
FRL	177	737
FRL	178	42
FRL	179	34
FRL	180	19
FRL	181	25
FRL	182	18
FRL	183	14
FRL	184	12
FRL	185	12
FRL	186	21
FRL	187	27
FRL	188	49
FRL	189	42
FRL	190	25
FRL	191	13
FRL	192	5
FRL	193	4
FRL	194	2
FRL	195	2
FRL	197	1
FRL	200	2
FRL	201	2
FRL	202	4
FRL	203	4
FRL	204	4
FRL	205	1
FRL	206	2
FRL	207	3
FRL	208	4
FRL	209	7
FRL	210	4
FRL	211	6
FRL	212	18
FRL	213	27
FRL	214	29
FRL	215	43
FRL	216	29
FRL	217	20
FRL	219	1
FRL	255	1
FRL	256	2
FRL	273	5
FRL	274	3
FRL	275	2
FRL	276	1
FRL	277	2
# Read lengths - last fragments. Use `grep ^LRL | cut -f 2-` to extract this part. The columns are: read length, count
# Indel distribution. Use `grep ^ID | cut -f 2-` to extract this part. The columns are: length, number of insertions, number of deletions
ID	1	3899	9297
ID	2	58	419
ID	3	27	175
ID	4	57	98
ID	5	26	59
ID	6	24	443
ID	7	23	25
ID	8	17	35
ID	9	14	62
ID	10	10	60
ID	11	9	53
ID	12	12	53
ID	13	9	30
ID	14	107	213
ID	15	25	14
ID	16	16	15
ID	17	13	8
ID	18	1	8
ID	19	2	3
ID	20	1	0
ID	21	0	18
ID	22	0	2
ID	23	0	123
ID	24	0	14
ID	25	0	26
ID	27	0	2
ID	28	0	2
ID	29	0	3
ID	33	0	5
ID	36	0	1
ID	41	0	3
# Indels per cycle. Use `grep ^IC | cut -f 2-` to extract this part. The columns are: cycle, number of insertions (fwd), .. (rev) , number of deletions (fwd), .. (rev)
IC	12	0	0	55	0
IC	13	0	0	69	0
IC	14	6	0	101	0
IC	15	19	0	93	0
IC	16	39	0	79	0
IC	17	34	0	90	0
IC	18	42	0	87	0
IC	19	15	0	101	0
IC	20	23	0	106	0
IC	21	23	0	83	0
IC	22	27	0	127	0
IC	23	21	0	131	0
IC	24	41	0	170	0
IC	25	45	0	63	0
IC	26	78	0	23	0
IC	27	21	0	9	0
IC	28	12	0	4	0
IC	29	1	0	13	0
IC	31	0	0	1	0
IC	33	0	0	1	0
IC	35	0	0	1	0
IC	36	0	0	2	0
IC	37	0	0	6	0
IC	38	0	0	2	0
IC	39	0	0	1	0
IC	41	1	0	0	0
IC	42	0	0	20	0
IC	43	0	0	35	0
IC	44	2	0	26	0
IC	45	8	0	0	0
IC	46	7	0	0	0
IC	47	1	0	0	0
IC	48	0	0	1	0
IC	50	0	0	6	0
IC	51	0	0	6	0
IC	52	0	0	2	0
IC	53	2	0	0	0
IC	55	0	0	1	0
IC	56	0	0	6	0
IC	57	0	0	9	0
IC	58	0	0	8	0
IC	60	0	0	4	0
IC	61	0	0	4	0
IC	62	0	0	5	0
IC	63	1	0	4	0
IC	64	0	0	12	0
IC	65	6	0	9	0
IC	66	4	0	11	0
IC	67	6	0	11	0
IC	68	4	0	38	0
IC	69	2	0	54	0
IC	70	18	0	60	0
IC	71	25	0	20	0
IC	72	27	0	27	0
IC	73	28	0	35	0
IC	74	24	0	32	0
IC	75	17	0	80	0
IC	76	17	0	28	0
IC	77	16	0	46	0
IC	78	9	0	32	0
IC	79	27	0	56	0
IC	80	16	0	46	0
IC	81	14	0	75	0
IC	82	9	0	29	0
IC	83	23	0	51	0
IC	84	15	0	31	0
IC	85	22	0	423	0
IC	86	43	0	443	0
IC	87	45	0	507	0
IC	88	41	0	41	0
IC	89	27	0	70	0
IC	90	20	0	166	0
IC	91	56	0	201	0
IC	92	57	0	245	0
IC	93	103	0	250	0
IC	94	38	0	204	0
IC	95	41	0	122	0
IC	96	7	0	12	0
IC	97	0	0	7	0
IC	98	0	0	16	0
IC	99	0	0	49	0
IC	100	0	0	104	0
IC	101	0	0	119	0
IC	102	0	0	74	0
IC	103	0	0	71	0
IC	104	1	0	55	0
IC	105	0	0	41	0
IC	106	1	0	19	0
IC	107	1	0	11	0
IC	108	0	0	12	0
IC	109	0	0	6	0
IC	110	0	0	11	0
IC	111	0	0	17	0
IC	112	0	0	14	0
IC	113	0	0	15	0
IC	114	0	0	35	0
IC	115	0	0	39	0
IC	116	1	0	65	0
IC	117	0	0	121	0
IC	118	0	0	659	0
IC	119	11	0	611	0
IC	120	422	0	664	0
IC	121	501	0	90	0
IC	122	533	0	107	0
IC	123	207	0	60	0
IC	124	69	0	72	0
IC	125	57	0	64	0
IC	126	45	0	75	0
IC	127	59	0	38	0
IC	128	52	0	31	0
IC	129	51	0	23	0
IC	130	51	0	14	0
IC	131	49	0	71	0
IC	132	29	0	92	0
IC	133	19	0	106	0
IC	134	8	0	47	0
IC	135	14	0	31	0
IC	136	11	0	17	0
IC	137	6	0	17	0
IC	138	9	0	28	0
IC	139	21	0	29	0
IC	140	22	0	26	0
IC	141	29	0	58	0
IC	142	22	0	46	0
IC	143	22	0	191	0
IC	144	33	0	142	0
IC	145	68	0	151	0
IC	146	68	0	35	0
IC	147	30	0	41	0
IC	148	21	0	77	0
IC	149	11	0	77	0
IC	150	20	0	96	0
IC	151	12	0	87	0
IC	152	26	0	126	0
IC	153	20	0	138	0
IC	154	41	0	165	0
IC	155	44	0	125	0
IC	156	66	0	135	0
IC	157	51	0	149	0
IC	158	55	0	112	0
IC	159	41	0	198	0
IC	160	33	0	111	0
IC	161	49	0	113	0
IC	162	33	0	1	0
IC	163	28	0	0	0
IC	170	1	0	0	0
# Coverage distribution. Use `grep ^COV | cut -f 2-` to extract this part.
COV	[1000<]	1000	156
# GC-depth. Use `grep ^GCD | cut -f 2-` to extract this part. The columns are: GC%, unique sequence percentiles, 10th, 25th, 50th, 75th and 90th depth percentile
GCD	0.0	100.000	0.000	0.000	0.000	0.000	0.000
