Textname;Annotierenden-Kürzel;Gattung;Perspektive;Typ der Erzählinstanz;Beteiligung der Erzählinstanz am Geschehen;Tagset;Phänomene
Andreae__Die_chymische_Hochzeit;A1;Roman;first;homodiegetisch;beteiligt;Reflexion IV, Attribution IV;GI
Andreae__Die_chymische_Hochzeit;A2;Roman;first;homodiegetisch;beteiligt;Reflexion IV, Attribution IV;Comment, NfR
Andreae__Die_chymische_Hochzeit;A3;Roman;first;homodiegetisch;beteiligt;Reflexion IV, Attribution IV;Comment, NfR
Andreae__Die_chymische_Hochzeit;A4;Roman;first;homodiegetisch;beteiligt;Reflexion IV, Attribution IV;GI, NfR
Andreae__Die_chymische_Hochzeit;A5;Roman;first;homodiegetisch;beteiligt;Reflexion IV, Attribution IV;Comment
Andreae__Die_chymische_Hochzeit;A6;Roman;first;homodiegetisch;beteiligt;Reflexion IV, Attribution IV;GI, NfR
Andreae__Die_chymische_Hochzeit;GGG;Roman;first;homodiegetisch;beteiligt;Reflexion IV;Comment, GI, NfR
Bürger__Münchhausen;A1;Roman;first;homodiegetisch;beteiligt;Reflexion IV;NfR
Bürger__Münchhausen;A2;Erzählung;first;homodiegetisch;beteiligt;Reflexion IV;Comment
Bürger__Münchhausen;A3;Erzählung;first;homodiegetisch;beteiligt;Reflexion IV;NfR
Bürger__Münchhausen;A4;Erzählung;first;homodiegetisch;beteiligt;Reflexion IV;GI
Bürger__Münchhausen;A5;Erzählung;first;homodiegetisch;beteiligt;Reflexion IV;GI
Bürger__Münchhausen;A6;Roman;first;homodiegetisch;beteiligt;Reflexion IV;Comment
Bürger__Münchhausen;A7;Roman;first;homodiegetisch;beteiligt;Attribution IV;
Bürger__Münchhausen;A9;Roman;first;homodiegetisch;beteiligt;Attribution IV;
Bürger__Münchhausen;A10;Roman;first;homodiegetisch;beteiligt;Attribution IV;
Bürger__Münchhausen;A11;Roman;first;homodiegetisch;beteiligt;Attribution IV;
Bürger__Münchhausen;GGG;Roman;first;homodiegetisch;beteiligt;Reflexion IV;Comment, GI
Dahn__Kampf_um_Rom_ab_Kapitel_2;A1;Roman;third;heterodiegetisch;unbeteiligt;Reflexion IV, Attribution IV;GI
Dahn__Kampf_um_Rom_ab_Kapitel_2;A2;Roman;third;heterodiegetisch;unbeteiligt;Reflexion IV, Attribution IV;Comment
Dahn__Kampf_um_Rom_ab_Kapitel_2;A3;Roman;third;heterodiegetisch;unbeteiligt;Reflexion IV, Attribution IV;NfR
Dahn__Kampf_um_Rom_ab_Kapitel_2;A4;Roman;third;heterodiegetisch;unbeteiligt;Reflexion IV, Attribution IV;NfR
Dahn__Kampf_um_Rom_ab_Kapitel_2;A5;Roman;third;heterodiegetisch;unbeteiligt;Reflexion IV, Attribution IV;Comment
Dahn__Kampf_um_Rom_ab_Kapitel_2;A6;Roman;third;heterodiegetisch;unbeteiligt;Reflexion IV, Attribution IV;GI
Dahn__Kampf_um_Rom_ab_Kapitel_2;A7;Roman;third;heterodiegetisch;unbeteiligt;Reflexion IV;NfR
Dahn__Kampf_um_Rom_ab_Kapitel_2;A8;Roman;third;heterodiegetisch;unbeteiligt;Reflexion IV;Comment
Dahn__Kampf_um_Rom_ab_Kapitel_2;A9;Roman;third;heterodiegetisch;unbeteiligt;Reflexion IV;Comment
Dahn__Kampf_um_Rom_ab_Kapitel_2;A10;Roman;third;heterodiegetisch;unbeteiligt;Reflexion IV;GI
Dahn__Kampf_um_Rom_ab_Kapitel_2;A11;Roman;third;heterodiegetisch;unbeteiligt;Reflexion IV;GI
Dahn__Kampf_um_Rom_ab_Kapitel_2;A12;Roman;third;heterodiegetisch;unbeteiligt;Reflexion IV;NfR
Dahn__Kampf_um_Rom_ab_Kapitel_2;GGG;Roman;third;heterodiegetisch;unbeteiligt;Reflexion IV;Comment, GI, NfR
Fontane__Der_Stechlin;A1;Roman;third;heterodiegetisch;unbeteiligt;Reflexion IV, Attribution IV;Comment
Fontane__Der_Stechlin;A2;Roman;third;heterodiegetisch;unbeteiligt;Reflexion IV, Attribution IV;NfR
Fontane__Der_Stechlin;A3;Roman;third;heterodiegetisch;unbeteiligt;Reflexion IV, Attribution IV;GI
Fontane__Der_Stechlin;A4;Roman;third;heterodiegetisch;unbeteiligt;Reflexion IV, Attribution IV;Comment
Fontane__Der_Stechlin;A5;Roman;third;heterodiegetisch;unbeteiligt;Reflexion IV, Attribution IV;NfR
Fontane__Der_Stechlin;A6;Roman;third;heterodiegetisch;unbeteiligt;Reflexion IV, Attribution IV;Comment, GI
Fontane__Der_Stechlin;GGG;Roman;third;heterodiegetisch;unbeteiligt;Reflexion IV;Comment, GI, NfR
Gellert__Das_Leben_der_schwedischen_Gräfin_von_G;A1;Roman;first;homodiegetisch;beteiligt;Reflexion IV, Attribution IV;Comment
Gellert__Das_Leben_der_schwedischen_Gräfin_von_G;A2;Roman;first;homodiegetisch;beteiligt;Reflexion IV, Attribution IV;GI
Gellert__Das_Leben_der_schwedischen_Gräfin_von_G;A3;Roman;first;homodiegetisch;beteiligt;Reflexion IV, Attribution IV;GI
Gellert__Das_Leben_der_schwedischen_Gräfin_von_G;A4;Roman;first;homodiegetisch;beteiligt;Reflexion IV, Attribution IV;Comment
Gellert__Das_Leben_der_schwedischen_Gräfin_von_G;A5;Roman;first;homodiegetisch;beteiligt;Reflexion IV, Attribution IV;NfR
Gellert__Das_Leben_der_schwedischen_Gräfin_von_G;A6;Roman;first;homodiegetisch;beteiligt;Reflexion IV, Attribution IV;NfR
Gellert__Das_Leben_der_schwedischen_Gräfin_von_G;A7;Roman;first;homodiegetisch;beteiligt;Reflexion IV;GI
Gellert__Das_Leben_der_schwedischen_Gräfin_von_G;A8;Roman;first;homodiegetisch;beteiligt;Reflexion IV;
Gellert__Das_Leben_der_schwedischen_Gräfin_von_G;A9;Roman;first;homodiegetisch;beteiligt;Reflexion IV;GI
Gellert__Das_Leben_der_schwedischen_Gräfin_von_G;A10;Roman;first;homodiegetisch;beteiligt;Reflexion IV;
Gellert__Das_Leben_der_schwedischen_Gräfin_von_G;A11;Roman;first;homodiegetisch;beteiligt;Reflexion IV;Comment
Gellert__Das_Leben_der_schwedischen_Gräfin_von_G;A12;Roman;first;homodiegetisch;beteiligt;Reflexion IV;Comment
Gellert__Das_Leben_der_schwedischen_Gräfin_von_G;GGG;Roman;first;homodiegetisch;beteiligt;Reflexion IV;Comment, GI, NfR
Goethe__Die_Wahlverwandtschaften;A1;Roman;third;heterodiegetisch;unbeteiligt;Reflexion IV, Attribution IV;Comment, GI, NfR
Goethe__Die_Wahlverwandtschaften;A2;Roman;third;heterodiegetisch;unbeteiligt;Reflexion IV, Attribution IV;Comment, GI, NfR
Goethe__Die_Wahlverwandtschaften;A3;Roman;third;heterodiegetisch;unbeteiligt;Attribution IV;
Goethe__Die_Wahlverwandtschaften;A4;Roman;third;heterodiegetisch;unbeteiligt;Attribution IV;
Goethe__Die_Wahlverwandtschaften;A5;Roman;third;heterodiegetisch;unbeteiligt;Reflexion IV, Attribution IV;Comment, GI, NfR
Goethe__Die_Wahlverwandtschaften;A6;Roman;third;heterodiegetisch;unbeteiligt;Reflexion IV, Attribution IV;Comment, GI, NfR
Goethe__Die_Wahlverwandtschaften;GGG;Roman;third;heterodiegetisch;unbeteiligt;Reflexion IV;Comment, GI, NfR
Grillparzer__Der_arme_Spielmann;A1;Erzählung;first;homodiegetisch;beteiligt;Reflexion IV, Attribution IV;Comment
Grillparzer__Der_arme_Spielmann;A2;Erzählung;first;homodiegetisch;beteiligt;Reflexion IV, Attribution IV;NfR
Grillparzer__Der_arme_Spielmann;A3;Erzählung;first;homodiegetisch;beteiligt;Reflexion IV, Attribution IV;NfR
Grillparzer__Der_arme_Spielmann;A4;Erzählung;first;homodiegetisch;beteiligt;Reflexion IV, Attribution IV;Comment
Grillparzer__Der_arme_Spielmann;A5;Erzählung;first;homodiegetisch;beteiligt;Reflexion IV, Attribution IV;GI
Grillparzer__Der_arme_Spielmann;A6;Roman;first;homodiegetisch;beteiligt;Reflexion IV, Attribution IV;GI
Grillparzer__Der_arme_Spielmann;GGG;Erzählung;first;homodiegetisch;beteiligt;Reflexion IV;Comment, GI, NfR
Grimmelshausen__Der_abenteuerliche_Simplicissimus;A1;Roman;first;homodiegetisch;beteiligt;Reflexion IV, Attribution IV;GI
Grimmelshausen__Der_abenteuerliche_Simplicissimus;A2;Roman;first;homodiegetisch;beteiligt;Reflexion IV, Attribution IV;NfR
Grimmelshausen__Der_abenteuerliche_Simplicissimus;A3;Roman;first;homodiegetisch;beteiligt;Reflexion IV, Attribution IV;NfR
Grimmelshausen__Der_abenteuerliche_Simplicissimus;A4;Roman;first;homodiegetisch;beteiligt;Reflexion IV, Attribution IV;Comment
Grimmelshausen__Der_abenteuerliche_Simplicissimus;A5;Roman;first;homodiegetisch;beteiligt;Reflexion IV, Attribution IV;Comment, GI
Grimmelshausen__Der_abenteuerliche_Simplicissimus;A6;Roman;first;homodiegetisch;beteiligt;Reflexion IV, Attribution IV;Comment
Grimmelshausen__Der_abenteuerliche_Simplicissimus;GGG;Roman;first;homodiegetisch;beteiligt;Reflexion IV;Comment, GI, NfR
Hoffmann__Der_Sandmann;A1;Erzählung;Sonderfall;Sonderfall;Sonderfall;Reflexion IV, Attribution IV;GI
Hoffmann__Der_Sandmann;A2;Erzählung;Sonderfall;Sonderfall;Sonderfall;Reflexion IV, Attribution IV;Comment
Hoffmann__Der_Sandmann;A3;Erzählung;first;homodiegetisch;unbeteiligt;Reflexion IV, Attribution IV;NfR
Hoffmann__Der_Sandmann;A4;Erzählung;first;heterodiegetisch;unbeteiligt;Reflexion IV, Attribution IV;NfR
Hoffmann__Der_Sandmann;A5;Erzählung;first;homodiegetisch;beteiligt;Reflexion IV, Attribution IV;Comment
Hoffmann__Der_Sandmann;A6;Erzählung;first;homodiegetisch;unbeteiligt;Reflexion IV, Attribution IV;GI
Hoffmann__Der_Sandmann;A7;Erzählung;first;heterodiegetisch;beteiligt;Reflexion IV;GI
Hoffmann__Der_Sandmann;A8;Erzählung;first;heterodiegetisch;beteiligt;Reflexion IV;NfR
Hoffmann__Der_Sandmann;A9;Erzählung;Sonderfall;Sonderfall;Sonderfall;Reflexion IV;GI
Hoffmann__Der_Sandmann;A10;Erzählung;first;heterodiegetisch;unbeteiligt;Reflexion IV;NfR
Hoffmann__Der_Sandmann;A11;Erzählung;Sonderfall;Sonderfall;Sonderfall;Reflexion IV;Comment
Hoffmann__Der_Sandmann;A12;Erzählung;first;heterodiegetisch;beteiligt;Reflexion IV;Comment
Hoffmann__Der_Sandmann;GGG;Roman;Sonderfall;Sonderfall;Sonderfall;Reflexion IV;Comment, GI, NfR
Hölderlin__Hyperion_oder_der_Eremit_in_Griechenland;A1;Roman;first;homodiegetisch;beteiligt;Reflexion IV, Attribution IV;GI
Hölderlin__Hyperion_oder_der_Eremit_in_Griechenland;A2;Roman;first;homodiegetisch;beteiligt;Reflexion IV, Attribution IV;NfR
Hölderlin__Hyperion_oder_der_Eremit_in_Griechenland;A3;Roman;first;homodiegetisch;beteiligt;Reflexion IV, Attribution IV;NfR
Hölderlin__Hyperion_oder_der_Eremit_in_Griechenland;A4;Roman;first;homodiegetisch;beteiligt;Reflexion IV, Attribution IV;GI
Hölderlin__Hyperion_oder_der_Eremit_in_Griechenland;A5;Roman;first;homodiegetisch;beteiligt;Reflexion IV, Attribution IV;Comment
Hölderlin__Hyperion_oder_der_Eremit_in_Griechenland;A6;Roman;first;homodiegetisch;beteiligt;Reflexion IV, Attribution IV;Comment
Hölderlin__Hyperion_oder_der_Eremit_in_Griechenland;GGG;Roman;first;homodiegetisch;beteiligt;Reflexion IV;Comment, GI, NfR
Kafka__Der_Bau;A1;Erzählung;first;homodiegetisch;beteiligt;Reflexion IV, Attribution IV;NfR
Kafka__Der_Bau;A2;Erzählung;first;homodiegetisch;beteiligt;Reflexion IV, Attribution IV;NfR
Kafka__Der_Bau;A3;Erzählung;first;homodiegetisch;beteiligt;Reflexion IV, Attribution IV;Comment
Kafka__Der_Bau;A4;Erzählung;first;homodiegetisch;beteiligt;Reflexion IV, Attribution IV;GI
Kafka__Der_Bau;A5;Erzählung;first;homodiegetisch;beteiligt;Reflexion IV, Attribution IV;GI
Kafka__Der_Bau;A6;Erzählung;first;homodiegetisch;beteiligt;Reflexion IV, Attribution IV;Comment
Kafka__Der_Bau;GGG;Erzählung;first;homodiegetisch;beteiligt;Reflexion IV;Comment, GI, NfR
Keller__Der_grüne_Heinrich;A4;Roman;third;heterodiegetisch;unbeteiligt;Reflexion IV;NfR
Keller__Der_grüne_Heinrich;A5;Roman;third;heterodiegetisch;unbeteiligt;Reflexion IV;Comment
Keller__Der_grüne_Heinrich;A6;Roman;third;heterodiegetisch;unbeteiligt;Reflexion IV;GI
Keller__Der_grüne_Heinrich;A7;Roman;third;heterodiegetisch;unbeteiligt;Attribution IV;
Keller__Der_grüne_Heinrich;A8;Roman;third;heterodiegetisch;unbeteiligt;Attribution IV;
Keller__Der_grüne_Heinrich;A9;Roman;third;heterodiegetisch;unbeteiligt;Reflexion IV, Attribution IV;NfR
Keller__Der_grüne_Heinrich;A10;Roman;third;heterodiegetisch;unbeteiligt;Reflexion IV, Attribution IV;Comment
Keller__Der_grüne_Heinrich;A11;Roman;third;heterodiegetisch;unbeteiligt;Attribution IV;
Keller__Der_grüne_Heinrich;A12;Roman;third;heterodiegetisch;unbeteiligt;Reflexion IV;GI
Keller__Der_grüne_Heinrich;GGG;Roman;third;heterodiegetisch;unbeteiligt;Reflexion IV;Comment, GI, NfR
Kleist__Michael_Kohlhaas;A1;Erzählung;third;heterodiegetisch;unbeteiligt;Reflexion IV, Attribution IV;Comment, NfR
Kleist__Michael_Kohlhaas;A2;Erzählung;third;heterodiegetisch;unbeteiligt;Reflexion IV, Attribution IV;Comment
Kleist__Michael_Kohlhaas;A3;Erzählung;third;heterodiegetisch;unbeteiligt;Reflexion IV, Attribution IV;GI, NfR
Kleist__Michael_Kohlhaas;A4;Erzählung;third;heterodiegetisch;unbeteiligt;Reflexion IV, Attribution IV;GI, NfR
Kleist__Michael_Kohlhaas;A5;Erzählung;third;heterodiegetisch;unbeteiligt;Reflexion IV, Attribution IV;Comment, GI
Kleist__Michael_Kohlhaas;A6;Erzählung;third;heterodiegetisch;unbeteiligt;Reflexion IV, Attribution IV;GI, NfR
Kleist__Michael_Kohlhaas;GGG;Erzählung;third;heterodiegetisch;unbeteiligt;Reflexion IV;Comment, GI, NfR
Knigge__Die_Reise_nach_Braunschweig;A1;Roman;third;heterodiegetisch;unbeteiligt;Reflexion IV;Comment
Knigge__Die_Reise_nach_Braunschweig;A2;Roman;third;heterodiegetisch;unbeteiligt;Reflexion IV, Attribution IV;GI
Knigge__Die_Reise_nach_Braunschweig;A3;Roman;third;heterodiegetisch;unbeteiligt;Reflexion IV, Attribution IV;Comment
Knigge__Die_Reise_nach_Braunschweig;A4;Roman;third;heterodiegetisch;unbeteiligt;Reflexion IV, Attribution IV;GI
Knigge__Die_Reise_nach_Braunschweig;A5;Roman;third;heterodiegetisch;unbeteiligt;Reflexion IV, Attribution IV;NfR
Knigge__Die_Reise_nach_Braunschweig;A6;Roman;third;heterodiegetisch;unbeteiligt;Reflexion IV, Attribution IV;NfR
Knigge__Die_Reise_nach_Braunschweig;GGG;Roman;third;heterodiegetisch;unbeteiligt;Reflexion IV;Comment, GI, NfR
Kotzebue__Das_merkwürdigste_Jahr_meines_Lebens;A1;Roman;first;homodiegetisch;beteiligt;Reflexion IV;GI
Kotzebue__Das_merkwürdigste_Jahr_meines_Lebens;A2;Roman;first;homodiegetisch;beteiligt;Reflexion IV;NfR
Kotzebue__Das_merkwürdigste_Jahr_meines_Lebens;A3;Roman;first;homodiegetisch;beteiligt;Reflexion IV;Comment
Kotzebue__Das_merkwürdigste_Jahr_meines_Lebens;A4;Roman;first;homodiegetisch;beteiligt;Reflexion IV;GI
Kotzebue__Das_merkwürdigste_Jahr_meines_Lebens;A5;Roman;first;homodiegetisch;beteiligt;Reflexion IV;NfR
Kotzebue__Das_merkwürdigste_Jahr_meines_Lebens;A6;Roman;first;homodiegetisch;beteiligt;Reflexion IV;Comment
Kotzebue__Das_merkwürdigste_Jahr_meines_Lebens;A7;Roman;first;homodiegetisch;beteiligt;Attribution IV;
Kotzebue__Das_merkwürdigste_Jahr_meines_Lebens;A9;Roman;first;homodiegetisch;beteiligt;Attribution IV;
Kotzebue__Das_merkwürdigste_Jahr_meines_Lebens;A10;Roman;first;homodiegetisch;beteiligt;Attribution IV;
Kotzebue__Das_merkwürdigste_Jahr_meines_Lebens;A11;Roman;first;homodiegetisch;beteiligt;Attribution IV;
Kotzebue__Das_merkwürdigste_Jahr_meines_Lebens;GGG;Roman;first;homodiegetisch;beteiligt;Reflexion IV;Comment, GI
LaRoche__Geschichte_des_Fräuleins_von_Sternheim;A1;Roman;first;homodiegetisch;beteiligt;Reflexion IV, Attribution IV;Comment
LaRoche__Geschichte_des_Fräuleins_von_Sternheim;A2;Roman;first;homodiegetisch;beteiligt;Reflexion IV, Attribution IV;GI
LaRoche__Geschichte_des_Fräuleins_von_Sternheim;A3;Roman;first;homodiegetisch;beteiligt;Reflexion IV, Attribution IV;GI
LaRoche__Geschichte_des_Fräuleins_von_Sternheim;A4;Roman;first;homodiegetisch;beteiligt;Reflexion IV, Attribution IV;Comment
LaRoche__Geschichte_des_Fräuleins_von_Sternheim;A5;Roman;first;homodiegetisch;beteiligt;Reflexion IV, Attribution IV;NfR
LaRoche__Geschichte_des_Fräuleins_von_Sternheim;A6;Roman;first;homodiegetisch;beteiligt;Reflexion IV, Attribution IV;NfR
LaRoche__Geschichte_des_Fräuleins_von_Sternheim;A7;Roman;first;homodiegetisch;beteiligt;Reflexion IV;Comment
LaRoche__Geschichte_des_Fräuleins_von_Sternheim;A8;Roman;first;homodiegetisch;beteiligt;Reflexion IV;GI
LaRoche__Geschichte_des_Fräuleins_von_Sternheim;A9;Roman;first;homodiegetisch;beteiligt;Reflexion IV;NfR
LaRoche__Geschichte_des_Fräuleins_von_Sternheim;A10;Roman;first;homodiegetisch;beteiligt;Reflexion IV;Comment
LaRoche__Geschichte_des_Fräuleins_von_Sternheim;A11;Roman;Sonderfall;Sonderfall;Sonderfall;Reflexion IV;NfR
LaRoche__Geschichte_des_Fräuleins_von_Sternheim;A12;Roman;first;homodiegetisch;beteiligt;Reflexion IV;GI
LaRoche__Geschichte_des_Fräuleins_von_Sternheim;GGG;Roman;first;homodiegetisch;beteiligt;Reflexion IV;Comment, GI, NfR
Lewald__Jenny;A1;Roman;third;heterodiegetisch;unbeteiligt;Reflexion IV;GI
Lewald__Jenny;A2;Roman;third;heterodiegetisch;unbeteiligt;Reflexion IV;Comment
Lewald__Jenny;A3;Roman;third;heterodiegetisch;unbeteiligt;Reflexion IV;Comment
Lewald__Jenny;A4;Roman;third;heterodiegetisch;unbeteiligt;Reflexion IV;GI
Lewald__Jenny;A5;Roman;third;heterodiegetisch;unbeteiligt;Reflexion IV;NfR
Lewald__Jenny;A6;Roman;third;heterodiegetisch;unbeteiligt;Reflexion IV;NfR
Lewald__Jenny;A7;Roman;third;heterodiegetisch;unbeteiligt;Attribution IV;
Lewald__Jenny;A8;Roman;third;heterodiegetisch;unbeteiligt;Attribution IV;
Lewald__Jenny;A9;Roman;third;heterodiegetisch;unbeteiligt;Attribution IV;
Lewald__Jenny;A10;Roman;third;heterodiegetisch;unbeteiligt;Attribution IV;
Lewald__Jenny;A11;Roman;third;heterodiegetisch;unbeteiligt;Attribution IV;
Lewald__Jenny;A12;Roman;third;heterodiegetisch;unbeteiligt;Attribution IV;
Lewald__Jenny;GGG;Roman;third;heterodiegetisch;unbeteiligt;Reflexion IV;Comment, GI, NfR
Lohenstein__Großmütiger_Feldherr_Arminius_Buch_1_bis_5;A1;Roman;third;heterodiegetisch;unbeteiligt;Reflexion IV;Comment
Lohenstein__Großmütiger_Feldherr_Arminius_Buch_1_bis_5;A2;Roman;third;heterodiegetisch;unbeteiligt;Reflexion IV;GI
Lohenstein__Großmütiger_Feldherr_Arminius_Buch_1_bis_5;A3;Roman;third;heterodiegetisch;unbeteiligt;Reflexion IV;GI
Lohenstein__Großmütiger_Feldherr_Arminius_Buch_1_bis_5;A4;Roman;third;heterodiegetisch;unbeteiligt;Reflexion IV;Comment
Lohenstein__Großmütiger_Feldherr_Arminius_Buch_1_bis_5;A5;Roman;third;heterodiegetisch;unbeteiligt;Reflexion IV;NfR
Lohenstein__Großmütiger_Feldherr_Arminius_Buch_1_bis_5;A6;Roman;third;heterodiegetisch;unbeteiligt;Reflexion IV;NfR
Lohenstein__Großmütiger_Feldherr_Arminius_Buch_1_bis_5;A8;Roman;third;heterodiegetisch;unbeteiligt;Attribution IV;
Lohenstein__Großmütiger_Feldherr_Arminius_Buch_1_bis_5;A9;Roman;third;heterodiegetisch;unbeteiligt;Attribution IV;
Lohenstein__Großmütiger_Feldherr_Arminius_Buch_1_bis_5;A10;Roman;third;heterodiegetisch;unbeteiligt;Attribution IV;
Lohenstein__Großmütiger_Feldherr_Arminius_Buch_1_bis_5;A11;Roman;third;heterodiegetisch;unbeteiligt;Attribution IV;
Lohenstein__Großmütiger_Feldherr_Arminius_Buch_1_bis_5;GGG;Roman;third;heterodiegetisch;unbeteiligt;Reflexion IV;Comment, GI, NfR
Mann__Der_Zauberberg;A1;Roman;third;heterodiegetisch;unbeteiligt;Reflexion IV, Attribution IV;Comment
Mann__Der_Zauberberg;A2;Roman;third;heterodiegetisch;unbeteiligt;Reflexion IV, Attribution IV;GI
Mann__Der_Zauberberg;A3;Roman;third;heterodiegetisch;unbeteiligt;Reflexion IV, Attribution IV;Comment
Mann__Der_Zauberberg;A4;Roman;third;heterodiegetisch;unbeteiligt;Reflexion IV, Attribution IV;NfR
Mann__Der_Zauberberg;A5;Roman;third;heterodiegetisch;unbeteiligt;Reflexion IV, Attribution IV;NfR
Mann__Der_Zauberberg;A6;Roman;third;heterodiegetisch;unbeteiligt;Reflexion IV, Attribution IV;GI
Mann__Der_Zauberberg;GGG;Roman;third;heterodiegetisch;unbeteiligt;Reflexion IV;Comment, GI, NfR
May__Winnetou_II;A1;Roman;first;homodiegetisch;beteiligt;Reflexion IV, Attribution IV;GI
May__Winnetou_II;A2;Roman;first;homodiegetisch;beteiligt;Reflexion IV, Attribution IV;GI, NfR
May__Winnetou_II;A3;Roman;first;homodiegetisch;beteiligt;Reflexion IV, Attribution IV;Comment
May__Winnetou_II;A4;Roman;first;homodiegetisch;beteiligt;Reflexion IV, Attribution IV;Comment
May__Winnetou_II;A5;Erzählung;first;homodiegetisch;beteiligt;Reflexion IV, Attribution IV;NfR
May__Winnetou_II;A6;Roman;first;homodiegetisch;beteiligt;Reflexion IV, Attribution IV;GI, NfR
May__Winnetou_II;GGG;Roman;first;homodiegetisch;beteiligt;Reflexion IV;Comment, GI, NfR
Musil__Der_Mann_ohne_Eigenschaften;A1;Roman;third;heterodiegetisch;unbeteiligt;Reflexion IV, Attribution IV;NfR
Musil__Der_Mann_ohne_Eigenschaften;A2;Roman;third;heterodiegetisch;unbeteiligt;Reflexion IV, Attribution IV;Comment, GI
Musil__Der_Mann_ohne_Eigenschaften;A3;Roman;third;heterodiegetisch;unbeteiligt;Reflexion IV, Attribution IV;Comment
Musil__Der_Mann_ohne_Eigenschaften;A4;Roman;third;heterodiegetisch;unbeteiligt;Reflexion IV, Attribution IV;Comment
Musil__Der_Mann_ohne_Eigenschaften;A5;Roman;third;heterodiegetisch;unbeteiligt;Reflexion IV, Attribution IV;GI
Musil__Der_Mann_ohne_Eigenschaften;A6;Roman;third;heterodiegetisch;unbeteiligt;Reflexion IV, Attribution IV;NfR
Musil__Der_Mann_ohne_Eigenschaften;GGG;Roman;third;heterodiegetisch;unbeteiligt;Reflexion IV;Comment, GI, NfR
Nicolai__Das_Leben_und_die_Meinungen_des_Herrn_Magister_Sebaldus_Nothanker;A1;Roman;third;heterodiegetisch;unbeteiligt;Reflexion IV;Comment
Nicolai__Das_Leben_und_die_Meinungen_des_Herrn_Magister_Sebaldus_Nothanker;A2;Roman;third;heterodiegetisch;unbeteiligt;Reflexion IV;GI
Nicolai__Das_Leben_und_die_Meinungen_des_Herrn_Magister_Sebaldus_Nothanker;A3;Roman;third;heterodiegetisch;unbeteiligt;Reflexion IV;NfR
Nicolai__Das_Leben_und_die_Meinungen_des_Herrn_Magister_Sebaldus_Nothanker;A7;Roman;third;heterodiegetisch;unbeteiligt;Reflexion IV;NfR
Nicolai__Das_Leben_und_die_Meinungen_des_Herrn_Magister_Sebaldus_Nothanker;A8;Roman;third;heterodiegetisch;unbeteiligt;Reflexion IV, Attribution IV;Comment
Nicolai__Das_Leben_und_die_Meinungen_des_Herrn_Magister_Sebaldus_Nothanker;A9;Roman;third;heterodiegetisch;unbeteiligt;Attribution IV;
Nicolai__Das_Leben_und_die_Meinungen_des_Herrn_Magister_Sebaldus_Nothanker;A10;Roman;third;heterodiegetisch;unbeteiligt;Attribution IV;
Nicolai__Das_Leben_und_die_Meinungen_des_Herrn_Magister_Sebaldus_Nothanker;A11;Roman;third;heterodiegetisch;unbeteiligt;Reflexion IV, Attribution IV;GI
Nicolai__Das_Leben_und_die_Meinungen_des_Herrn_Magister_Sebaldus_Nothanker;GGG;Roman;third;heterodiegetisch;unbeteiligt;Reflexion IV;Comment, GI, NfR
Novalis__Die_Lehrlinge_zu_Sais;A1;Roman;first;homodiegetisch;beteiligt;Reflexion IV, Attribution IV;NfR
Novalis__Die_Lehrlinge_zu_Sais;A2;Roman;first;homodiegetisch;beteiligt;Reflexion IV, Attribution IV;Comment, NfR
Novalis__Die_Lehrlinge_zu_Sais;A3;Roman;first;homodiegetisch;beteiligt;Reflexion IV, Attribution IV;Comment, GI
Novalis__Die_Lehrlinge_zu_Sais;A4;Roman;first;homodiegetisch;beteiligt;Reflexion IV, Attribution IV;GI, NfR
Novalis__Die_Lehrlinge_zu_Sais;A5;Roman;third;heterodiegetisch;unbeteiligt;Reflexion IV, Attribution IV;Comment, GI
Novalis__Die_Lehrlinge_zu_Sais;A6;Roman;first;homodiegetisch;beteiligt;Reflexion IV, Attribution IV;Comment, GI
Novalis__Die_Lehrlinge_zu_Sais;GGG;Roman;third;heterodiegetisch;unbeteiligt;Reflexion IV;Comment, GI, NfR
Reuter__Schelmuffskys_kuriose_und_sehr_gefährliche_Reisebeschreibung_zu_Wasser_und_Lande;A1;Roman;first;homodiegetisch;beteiligt;Reflexion IV, Attribution IV;GI
Reuter__Schelmuffskys_kuriose_und_sehr_gefährliche_Reisebeschreibung_zu_Wasser_und_Lande;A2;Roman;first;homodiegetisch;beteiligt;Reflexion IV, Attribution IV;NfR
Reuter__Schelmuffskys_kuriose_und_sehr_gefährliche_Reisebeschreibung_zu_Wasser_und_Lande;A3;Roman;first;homodiegetisch;beteiligt;Reflexion IV, Attribution IV;GI
Reuter__Schelmuffskys_kuriose_und_sehr_gefährliche_Reisebeschreibung_zu_Wasser_und_Lande;A4;Roman;first;homodiegetisch;beteiligt;Reflexion IV, Attribution IV;NfR
Reuter__Schelmuffskys_kuriose_und_sehr_gefährliche_Reisebeschreibung_zu_Wasser_und_Lande;A5;Roman;first;homodiegetisch;beteiligt;Reflexion IV, Attribution IV;Comment
Reuter__Schelmuffskys_kuriose_und_sehr_gefährliche_Reisebeschreibung_zu_Wasser_und_Lande;A6;Roman;first;homodiegetisch;beteiligt;Reflexion IV, Attribution IV;Comment
Reuter__Schelmuffskys_kuriose_und_sehr_gefährliche_Reisebeschreibung_zu_Wasser_und_Lande;GGG;Roman;first;homodiegetisch;beteiligt;Reflexion IV;Comment, GI, NfR
Rilke__Die_Aufzeichnungen_des_Malte_Laurids_Brigge;A1;Roman;first;homodiegetisch;beteiligt;Reflexion IV, Attribution IV;NfR
Rilke__Die_Aufzeichnungen_des_Malte_Laurids_Brigge;A2;Roman;first;homodiegetisch;beteiligt;Reflexion IV, Attribution IV;Comment
Rilke__Die_Aufzeichnungen_des_Malte_Laurids_Brigge;A3;Roman;first;homodiegetisch;beteiligt;Reflexion IV, Attribution IV;NfR
Rilke__Die_Aufzeichnungen_des_Malte_Laurids_Brigge;A4;Roman;first;homodiegetisch;beteiligt;Reflexion IV, Attribution IV;Comment
Rilke__Die_Aufzeichnungen_des_Malte_Laurids_Brigge;A5;Roman;first;homodiegetisch;beteiligt;Reflexion IV, Attribution IV;GI
Rilke__Die_Aufzeichnungen_des_Malte_Laurids_Brigge;A6;Roman;first;homodiegetisch;beteiligt;Reflexion IV, Attribution IV;GI
Rilke__Die_Aufzeichnungen_des_Malte_Laurids_Brigge;GGG;Roman;first;homodiegetisch;beteiligt;Reflexion IV;Comment, GI, NfR
Schiller__Der_Geisterseher;A1;Roman;first;homodiegetisch;beteiligt;Reflexion IV;Comment
Schiller__Der_Geisterseher;A2;Roman;first;homodiegetisch;beteiligt;Reflexion IV;GI
Schiller__Der_Geisterseher;A3;Roman;first;homodiegetisch;beteiligt;Reflexion IV;NfR
Schiller__Der_Geisterseher;A4;Roman;first;homodiegetisch;beteiligt;Reflexion IV;Comment
Schiller__Der_Geisterseher;A5;Roman;first;homodiegetisch;beteiligt;Reflexion IV;GI
Schiller__Der_Geisterseher;A6;Roman;first;homodiegetisch;beteiligt;Reflexion IV;NfR
Schiller__Der_Geisterseher;A7;Roman;first;homodiegetisch;beteiligt;Attribution IV;
Schiller__Der_Geisterseher;A8;Roman;first;homodiegetisch;beteiligt;Attribution IV;
Schiller__Der_Geisterseher;A9;Roman;first;homodiegetisch;beteiligt;Attribution IV;
Schiller__Der_Geisterseher;A10;Roman;first;homodiegetisch;beteiligt;Attribution IV;
Schiller__Der_Geisterseher;A12;Roman;first;homodiegetisch;beteiligt;Attribution IV;
Schiller__Der_Geisterseher;GGG;Roman;first;homodiegetisch;beteiligt;Reflexion IV;Comment, GI, NfR
Schnabel__Die_Insel_Felsenburg;A1;Roman;first;homodiegetisch;beteiligt;Reflexion IV, Attribution IV;NfR
Schnabel__Die_Insel_Felsenburg;A2;Roman;first;homodiegetisch;beteiligt;Reflexion IV, Attribution IV;Comment
Schnabel__Die_Insel_Felsenburg;A3;Roman;first;homodiegetisch;beteiligt;Reflexion IV, Attribution IV;Comment
Schnabel__Die_Insel_Felsenburg;A4;Roman;first;homodiegetisch;beteiligt;Reflexion IV, Attribution IV;NfR
Schnabel__Die_Insel_Felsenburg;A5;Roman;first;homodiegetisch;beteiligt;Reflexion IV, Attribution IV;GI
Schnabel__Die_Insel_Felsenburg;A6;Roman;first;homodiegetisch;beteiligt;Reflexion IV, Attribution IV;GI
Schnabel__Die_Insel_Felsenburg;GGG;Roman;first;homodiegetisch;beteiligt;Reflexion IV;Comment, GI, NfR
Seghers__Das_siebte_Kreuz;A1;Roman;third;heterodiegetisch;unbeteiligt;Reflexion IV, Attribution IV;Comment, GI, NfR
Seghers__Das_siebte_Kreuz;A2;Roman;third;heterodiegetisch;unbeteiligt;Reflexion IV, Attribution IV;Comment, GI, NfR
Seghers__Das_siebte_Kreuz;A3;Roman;third;heterodiegetisch;unbeteiligt;Reflexion IV, Attribution IV;Comment, GI, NfR
Seghers__Das_siebte_Kreuz;A4;Roman;third;heterodiegetisch;unbeteiligt;Reflexion IV, Attribution IV;Comment, GI, NfR
Seghers__Das_siebte_Kreuz;A5;Roman;third;heterodiegetisch;unbeteiligt;Reflexion IV, Attribution IV;Comment, GI, NfR
Seghers__Das_siebte_Kreuz;A6;Roman;third;heterodiegetisch;unbeteiligt;Reflexion IV, Attribution IV;Comment, GI, NfR
Seghers__Das_siebte_Kreuz;GGG;Roman;third;heterodiegetisch;unbeteiligt;Reflexion IV;Comment, GI, NfR
Stockfleth__Die_Kunst_und_Tugend_gezierte_Macarie;A7;Roman;third;heterodiegetisch;unbeteiligt;Reflexion IV;GI
Stockfleth__Die_Kunst_und_Tugend_gezierte_Macarie;A8;Roman;third;heterodiegetisch;unbeteiligt;Reflexion IV, Attribution IV;NfR
Stockfleth__Die_Kunst_und_Tugend_gezierte_Macarie;A9;Roman;third;heterodiegetisch;unbeteiligt;Reflexion IV, Attribution IV;GI
Stockfleth__Die_Kunst_und_Tugend_gezierte_Macarie;A10;Roman;third;heterodiegetisch;unbeteiligt;Reflexion IV, Attribution IV;NfR
Stockfleth__Die_Kunst_und_Tugend_gezierte_Macarie;A11;Roman;third;heterodiegetisch;unbeteiligt;Reflexion IV, Attribution IV;Comment
Stockfleth__Die_Kunst_und_Tugend_gezierte_Macarie;A12;Roman;third;heterodiegetisch;unbeteiligt;Reflexion IV;Comment
Stockfleth__Die_Kunst_und_Tugend_gezierte_Macarie;GGG;Roman;third;heterodiegetisch;unbeteiligt;Reflexion IV;Comment, GI, NfR
Storm__Der_Schimmelreiter;A1;Erzählung;third;homodiegetisch;unbeteiligt;Reflexion IV;NfR
Storm__Der_Schimmelreiter;A2;Erzählung;third;homodiegetisch;unbeteiligt;Reflexion IV;Comment
Storm__Der_Schimmelreiter;A3;Erzählung;first;homodiegetisch;unbeteiligt;Reflexion IV;GI
Storm__Der_Schimmelreiter;A4;Erzählung;Sonderfall;Sonderfall;Sonderfall;Reflexion IV;NfR
Storm__Der_Schimmelreiter;A5;Erzählung;third;homodiegetisch;unbeteiligt;Reflexion IV;Comment
Storm__Der_Schimmelreiter;A6;Erzählung;third;homodiegetisch;unbeteiligt;Reflexion IV;GI
Storm__Der_Schimmelreiter;A7;Erzählung;Sonderfall;Sonderfall;Sonderfall;Attribution IV;
Storm__Der_Schimmelreiter;A8;Erzählung;Sonderfall;Sonderfall;Sonderfall;Attribution IV;
Storm__Der_Schimmelreiter;A9;Erzählung;Sonderfall;Sonderfall;Sonderfall;Attribution IV;
Storm__Der_Schimmelreiter;A10;Erzählung;Sonderfall;Sonderfall;Sonderfall;Attribution IV;
Storm__Der_Schimmelreiter;A11;Erzählung;Sonderfall;Sonderfall;Sonderfall;Attribution IV;
Storm__Der_Schimmelreiter;A12;Erzählung;Sonderfall;Sonderfall;Sonderfall;Attribution IV;
Storm__Der_Schimmelreiter;GGG;Erzählung;Sonderfall;Sonderfall;Sonderfall;Reflexion IV;Comment, GI, NfR
Wernicke__Ein_Heldengedicht_Hans_Sachs_genannt;A3;Vers;third;heterodiegetisch;unbeteiligt;Reflexion IV, Attribution IV;Comment
Wernicke__Ein_Heldengedicht_Hans_Sachs_genannt;A4;Vers;third;heterodiegetisch;unbeteiligt;Reflexion IV, Attribution IV;Comment
Wernicke__Ein_Heldengedicht_Hans_Sachs_genannt;A5;Vers;third;heterodiegetisch;unbeteiligt;Reflexion IV;GI, NfR
Wernicke__Ein_Heldengedicht_Hans_Sachs_genannt;A6;Vers;third;heterodiegetisch;unbeteiligt;Reflexion IV, Attribution IV;GI, NfR
Wernicke__Ein_Heldengedicht_Hans_Sachs_genannt;GGG;Vers;third;heterodiegetisch;unbeteiligt;Reflexion IV;Comment, GI, NfR
Wieland__Geschichte_des_Agathon;A1;Roman;third;heterodiegetisch;unbeteiligt;Reflexion IV, Attribution IV;Comment, GI, NfR
Wieland__Geschichte_des_Agathon;A2;Roman;third;heterodiegetisch;unbeteiligt;Reflexion IV, Attribution IV;Comment, GI, NfR
Wieland__Geschichte_des_Agathon;A3;Roman;third;heterodiegetisch;unbeteiligt;Reflexion IV, Attribution IV;Comment, GI, NfR
Wieland__Geschichte_des_Agathon;A4;Roman;third;heterodiegetisch;unbeteiligt;Reflexion IV, Attribution IV;Comment, GI, NfR
Wieland__Geschichte_des_Agathon;A5;Roman;third;heterodiegetisch;unbeteiligt;Reflexion IV, Attribution IV;Comment, GI, NfR
Wieland__Geschichte_des_Agathon;A6;Roman;third;heterodiegetisch;unbeteiligt;Reflexion IV, Attribution IV;Comment, GI, NfR
Wieland__Geschichte_des_Agathon;GGG;Roman;third;heterodiegetisch;unbeteiligt;Reflexion IV;Comment, GI, NfR
Wildermuth__Die_drei_Zöpfe;A1;Erzählung;first;heterodiegetisch;unbeteiligt;Reflexion IV, Attribution IV;GI
Wildermuth__Die_drei_Zöpfe;A2;Erzählung;first;homodiegetisch;unbeteiligt;Reflexion IV, Attribution IV;NfR
Wildermuth__Die_drei_Zöpfe;A3;Erzählung;first;heterodiegetisch;unbeteiligt;Reflexion IV, Attribution IV;GI
Wildermuth__Die_drei_Zöpfe;A4;Erzählung;first;homodiegetisch;unbeteiligt;Reflexion IV, Attribution IV;Comment
Wildermuth__Die_drei_Zöpfe;A5;Erzählung;first;heterodiegetisch;unbeteiligt;Reflexion IV, Attribution IV;Comment
Wildermuth__Die_drei_Zöpfe;A6;Erzählung;first;homodiegetisch;unbeteiligt;Reflexion IV, Attribution IV;NfR
Wildermuth__Die_drei_Zöpfe;GGG;Erzählung;first;heterodiegetisch;unbeteiligt;Reflexion IV;Comment, GI, NfR
Zesen__Adriatische_Rosemund;A1;Roman;third;heterodiegetisch;unbeteiligt;Reflexion IV, Attribution IV;NfR
Zesen__Adriatische_Rosemund;A2;Roman;third;heterodiegetisch;unbeteiligt;Reflexion IV, Attribution IV;NfR
Zesen__Adriatische_Rosemund;A3;Roman;third;heterodiegetisch;unbeteiligt;Reflexion IV, Attribution IV;Comment
Zesen__Adriatische_Rosemund;A4;Roman;third;heterodiegetisch;unbeteiligt;Reflexion IV, Attribution IV;GI
Zesen__Adriatische_Rosemund;A5;Roman;third;heterodiegetisch;unbeteiligt;Reflexion IV, Attribution IV;GI
Zesen__Adriatische_Rosemund;A6;Roman;third;heterodiegetisch;unbeteiligt;Reflexion IV, Attribution IV;Comment
Zesen__Adriatische_Rosemund;GGG;Roman;third;heterodiegetisch;unbeteiligt;Reflexion IV;Comment, GI, NfR
