time
2017-02-01T01:00:00
2017-02-01T16:30:00
2017-02-02T12:00:00
2017-02-02T19:00:00
2017-02-03T12:00:00
2017-02-04T03:00:00
2017-02-05T09:00:00
2017-02-05T20:00:00
2017-02-06T16:00:00
2017-02-07T15:00:00
2017-02-08T05:00:00
2017-02-08T19:00:00
2017-02-09T03:00:00
2017-02-09T19:30:00
2017-02-15T23:00:00
2017-02-16T14:00:00
2017-02-17T06:00:00
2017-02-19T21:00:00
2017-02-24T13:30:00
2017-02-24T17:00:00
2017-02-25T11:30:00
2017-02-26T15:30:00
2017-02-27T18:00:00
2017-02-28T18:30:00
2017-03-02T17:00:00
2017-03-04T00:00:00
2017-03-04T16:30:00
2017-03-05T20:00:00
2017-03-06T11:30:00
2017-03-07T11:30:00
2017-03-08T11:00:00
2017-03-08T20:00:00
2017-03-09T06:30:00
2017-03-10T02:00:00
2017-03-10T15:00:00
2017-03-12T17:00:00
2017-03-12T22:00:00
2017-03-13T17:00:00
2017-03-14T11:00:00
2017-03-14T19:30:00
2017-03-15T18:00:00
2017-03-16T05:30:00
2017-03-16T11:30:00
2017-03-16T19:00:00
2017-03-17T19:30:00
2017-03-18T20:30:00
2017-03-19T05:00:00
2017-03-20T10:00:00
2017-03-25T03:00:00
2017-03-25T14:00:00
2017-03-29T03:30:00
2017-03-29T17:30:00
2017-03-31T09:30:00
2017-04-01T10:00:00
2017-04-01T15:30:00
2017-04-01T23:30:00
2017-04-05T19:30:00
2017-04-06T14:00:00
2017-04-08T11:30:00
2017-04-09T17:30:00
2017-04-11T22:00:00
2017-04-12T17:00:00
2017-04-13T19:30:00
2017-04-15T05:00:00
2017-04-15T10:30:00
2017-04-15T22:00:00
2017-04-16T08:00:00
2017-04-17T12:30:00
2017-04-18T23:30:00
2017-04-19T15:30:00
2017-04-20T21:00:00
2017-04-23T12:30:00
2017-04-25T15:30:00
2017-04-26T16:30:00
2017-04-28T11:30:00
2017-04-29T12:00:00
2017-05-02T18:00:00
2017-05-04T18:00:00
2017-05-05T17:30:00
2017-05-06T17:00:00
2017-05-07T20:00:00
2017-05-08T11:00:00
2017-05-09T20:00:00
2017-05-10T16:00:00
2017-05-13T11:30:00
2017-05-13T16:00:00
2017-05-14T06:00:00
2017-05-14T22:30:00
2017-05-18T00:00:00
2017-05-21T21:30:00
2017-05-22T18:00:00
2017-05-23T22:30:00
2017-05-25T21:00:00
2017-05-30T16:00:00
2017-05-31T17:00:00
2018-02-01T07:30:00
2018-02-01T18:00:00
2018-02-02T13:00:00
2018-02-03T17:00:00
2018-02-10T07:30:00
2018-02-11T15:00:00
2018-02-11T21:00:00
2018-02-12T11:00:00
2018-02-12T15:00:00
2018-02-13T19:00:00
2018-02-14T06:00:00
2018-02-14T18:00:00
2018-02-15T16:00:00
2018-02-16T22:30:00
2018-02-17T04:00:00
2018-02-17T20:30:00
2018-02-18T18:30:00
2018-02-23T21:00:00
2018-02-26T17:30:00
2018-02-27T20:00:00
2018-03-03T21:00:00
2018-03-04T22:00:00
2018-03-05T15:30:00
2018-03-08T19:30:00
2018-03-11T05:30:00
2018-03-13T08:30:00
2018-03-13T20:00:00
2018-03-15T16:30:00
2018-03-15T23:00:00
2018-03-16T09:30:00
2018-03-17T13:00:00
2018-03-18T11:00:00
2018-03-19T18:00:00
2018-03-20T22:30:00
2018-03-21T07:30:00
2018-03-22T07:00:00
2018-03-22T12:00:00
2018-04-01T01:30:00
2018-04-01T18:30:00
2018-04-02T09:30:00
2018-04-03T12:30:00
2018-04-05T10:00:00
2018-04-08T22:30:00
2018-04-09T07:30:00
2018-04-09T18:30:00
2018-04-11T01:00:00
2018-04-11T05:30:00
2018-04-12T18:30:00
2018-04-13T18:30:00
2018-04-15T10:00:00
2018-04-17T15:00:00
2018-04-18T21:30:00
2018-04-19T01:00:00
2018-04-20T16:30:00
2018-04-22T12:00:00
2018-04-22T18:00:00
2018-04-23T19:30:00
2018-04-24T15:00:00
2018-04-25T12:00:00
2018-04-27T21:30:00
2018-04-29T12:00:00
2018-04-30T12:30:00
2018-05-01T13:00:00
2018-05-02T17:00:00
2018-05-03T09:30:00
2018-05-04T17:30:00
2018-05-05T15:30:00
2018-05-07T17:00:00
2018-05-08T22:00:00
2018-05-09T17:00:00
2018-05-10T14:00:00
2018-05-10T18:00:00
2018-05-12T14:00:00
2018-05-14T08:30:00
2018-05-14T16:30:00
2018-05-15T12:30:00
2018-05-15T19:00:00
2018-05-16T13:30:00
2018-05-18T20:00:00
2018-05-19T17:00:00
2018-05-20T17:30:00
2018-05-21T10:00:00
2018-05-22T06:30:00
2018-05-22T18:00:00
2018-05-25T17:00:00
2018-05-26T18:00:00
2018-05-29T19:30:00
2018-05-31T22:00:00
2019-02-02T00:00:00
2019-02-02T16:00:00
2019-02-03T16:30:00
2019-02-04T18:00:00
2019-02-05T02:00:00
2019-02-05T13:30:00
2019-02-06T18:00:00
2019-02-07T15:30:00
2019-02-08T14:30:00
2019-02-09T20:30:00
2019-02-10T10:30:00
2019-02-12T22:30:00
2019-02-13T15:30:00
2019-02-14T10:00:00
2019-02-15T07:00:00
2019-02-18T17:30:00
2019-02-20T20:30:00
2019-02-21T10:00:00
2019-02-24T21:00:00
2019-02-25T20:30:00
2019-02-26T08:30:00
2019-02-26T18:00:00
2019-02-27T14:30:00
2019-03-06T02:30:00
2019-03-06T18:00:00
2019-03-08T00:30:00
2019-03-09T17:00:00
2019-03-10T10:00:00
2019-03-11T11:30:00
2019-03-11T16:30:00
2019-03-21T21:30:00
2019-03-24T00:00:00
2019-03-25T17:30:00
2019-03-27T19:00:00
2019-03-29T08:00:00
2019-03-29T21:00:00
2019-03-30T05:00:00
2019-03-30T11:30:00
2019-03-30T20:30:00
2019-04-01T22:30:00
2019-04-04T06:00:00
2019-04-04T10:00:00
2019-04-06T18:00:00
2019-04-07T17:30:00
2019-04-08T08:30:00
2019-04-09T02:30:00
2019-04-09T14:30:00
2019-04-09T20:00:00
2019-04-12T16:00:00
2019-04-12T19:30:00
2019-04-13T15:00:00
2019-04-14T10:00:00
2019-04-15T15:00:00
2019-04-16T08:00:00
2019-04-18T20:00:00
2019-04-19T03:30:00
2019-04-19T19:30:00
2019-04-20T05:00:00
2019-04-21T07:00:00
2019-04-21T17:30:00
2019-04-22T03:00:00
2019-04-23T02:30:00
2019-04-23T10:00:00
2019-04-23T20:30:00
2019-04-24T06:00:00
2019-04-24T17:00:00
2019-04-25T17:30:00
2019-04-26T16:00:00
2019-04-27T08:30:00
2019-04-28T18:30:00
2019-04-29T01:30:00
2019-04-29T19:00:00
2019-04-29T22:30:00
2019-05-01T17:30:00
2019-05-02T02:30:00
2019-05-02T16:30:00
2019-05-02T20:30:00
2019-05-03T10:00:00
2019-05-03T20:30:00
2019-05-04T13:00:00
2019-05-05T15:30:00
2019-05-05T19:30:00
2019-05-07T07:30:00
2019-05-08T15:30:00
2019-05-10T14:30:00
2019-05-12T10:30:00
2019-05-15T19:00:00
2019-05-16T19:00:00
2019-05-18T13:00:00
2019-05-19T19:00:00
2019-05-20T15:30:00
2019-05-22T00:30:00
2019-05-22T10:00:00
2019-05-22T20:00:00
2019-05-23T18:30:00
2019-05-24T17:30:00
2019-05-27T01:00:00
2019-05-27T17:00:00
2019-05-29T14:30:00
2019-05-30T18:30:00
2019-05-31T09:00:00
2019-05-31T13:00:00
2020-02-01T17:30:00
2020-02-10T16:30:00
2020-02-11T11:30:00
2020-02-11T18:00:00
2020-02-12T06:00:00
2020-02-13T06:00:00
2020-02-13T19:00:00
2020-02-14T15:30:00
2020-02-14T20:30:00
2020-02-15T18:30:00
2020-02-16T07:00:00
2020-02-17T21:30:00
2020-02-18T19:30:00
2020-02-19T20:30:00
2020-02-22T17:30:00
2020-02-23T21:00:00
2020-02-25T01:30:00
2020-02-26T20:30:00
2020-03-01T20:00:00
2020-03-02T07:30:00
2020-03-03T22:00:00
2020-03-05T03:00:00
2020-03-06T00:00:00
2020-03-06T20:30:00
2020-03-13T15:00:00
2020-03-14T08:30:00
2020-03-14T20:30:00
2020-03-15T20:30:00
2020-03-17T20:30:00
2020-03-19T09:30:00
2020-03-20T20:00:00
2020-03-23T15:00:00
2020-03-24T20:00:00
2020-03-26T18:30:00
2020-03-27T18:00:00
2020-03-28T18:30:00
2020-03-29T02:00:00
2020-03-29T16:30:00
2020-03-30T01:30:00
2020-03-30T10:30:00
2020-03-31T14:30:00
2020-04-01T17:30:00
2020-04-02T22:00:00
2020-04-03T21:30:00
2020-04-05T21:30:00
2020-04-06T16:30:00
2020-04-07T09:30:00
2020-04-07T19:00:00
2020-04-08T04:00:00
2020-04-08T18:00:00
2020-04-09T10:00:00
2020-04-10T16:30:00
2020-04-11T07:30:00
2020-04-11T13:00:00
2020-04-12T17:00:00
2020-04-14T23:00:00
2020-04-17T15:00:00
2020-04-18T09:30:00
2020-04-20T19:30:00
2020-04-20T23:00:00
2020-04-22T18:30:00
2020-04-23T21:30:00
2020-04-25T08:00:00
2020-04-25T13:30:00
2020-04-27T00:30:00
2020-04-28T16:00:00
2020-04-29T15:30:00
2020-04-30T17:30:00
2020-04-30T22:30:00
2020-05-01T19:00:00
2020-05-02T17:30:00
2020-05-03T20:30:00
2020-05-04T11:00:00
2020-05-04T22:00:00
2020-05-05T19:00:00
2020-05-06T09:30:00
2020-05-08T05:30:00
2020-05-08T19:30:00
2020-05-10T17:30:00
2020-05-11T15:30:00
2020-05-12T11:00:00
2020-05-12T21:00:00
2020-05-13T14:30:00
2020-05-14T13:00:00
2020-05-14T19:00:00
2020-05-15T16:30:00
2020-05-16T20:00:00
2020-05-17T19:00:00
2020-05-18T16:30:00
2020-05-19T13:00:00
2020-05-19T21:30:00
2020-05-20T19:00:00
2020-05-21T18:00:00
2020-05-22T20:30:00
2020-05-23T09:30:00
2020-05-24T02:00:00
2020-05-24T20:00:00
2020-05-25T05:30:00
2020-05-25T19:00:00
2020-05-26T18:00:00
2020-05-27T23:00:00
2020-05-29T01:30:00
2020-05-29T06:00:00
2020-05-29T18:00:00
2020-05-31T18:00:00
