<?xml version="1.0" encoding="utf-8"?>
<svg xmlns="http://www.w3.org/2000/svg" xmlns:xlink="http://www.w3.org/1999/xlink" width="600" height="400" viewBox="0 0 2400 1600">
<defs>
  <clipPath id="clip580">
    <rect x="0" y="0" width="2400" height="1600"/>
  </clipPath>
</defs>
<path clip-path="url(#clip580)" d="M0 1600 L2400 1600 L2400 0 L0 0  Z" fill="#ffffff" fill-rule="evenodd" fill-opacity="1"/>
<defs>
  <clipPath id="clip581">
    <rect x="480" y="0" width="1681" height="1600"/>
  </clipPath>
</defs>
<path clip-path="url(#clip580)" d="M300.812 1410.22 L2352.76 1410.22 L2352.76 47.2441 L300.812 47.2441  Z" fill="#ffffff" fill-rule="evenodd" fill-opacity="1"/>
<defs>
  <clipPath id="clip582">
    <rect x="300" y="47" width="2053" height="1364"/>
  </clipPath>
</defs>
<polyline clip-path="url(#clip582)" style="stroke:#000000; stroke-linecap:round; stroke-linejoin:round; stroke-width:2; stroke-opacity:0.1; fill:none" points="300.812,1410.22 300.812,47.2441 "/>
<polyline clip-path="url(#clip582)" style="stroke:#000000; stroke-linecap:round; stroke-linejoin:round; stroke-width:2; stroke-opacity:0.1; fill:none" points="703.154,1410.22 703.154,47.2441 "/>
<polyline clip-path="url(#clip582)" style="stroke:#000000; stroke-linecap:round; stroke-linejoin:round; stroke-width:2; stroke-opacity:0.1; fill:none" points="1105.5,1410.22 1105.5,47.2441 "/>
<polyline clip-path="url(#clip582)" style="stroke:#000000; stroke-linecap:round; stroke-linejoin:round; stroke-width:2; stroke-opacity:0.1; fill:none" points="1507.84,1410.22 1507.84,47.2441 "/>
<polyline clip-path="url(#clip582)" style="stroke:#000000; stroke-linecap:round; stroke-linejoin:round; stroke-width:2; stroke-opacity:0.1; fill:none" points="1910.18,1410.22 1910.18,47.2441 "/>
<polyline clip-path="url(#clip582)" style="stroke:#000000; stroke-linecap:round; stroke-linejoin:round; stroke-width:2; stroke-opacity:0.1; fill:none" points="2312.52,1410.22 2312.52,47.2441 "/>
<polyline clip-path="url(#clip580)" style="stroke:#000000; stroke-linecap:round; stroke-linejoin:round; stroke-width:4; stroke-opacity:1; fill:none" points="300.812,1410.22 2352.76,1410.22 "/>
<polyline clip-path="url(#clip580)" style="stroke:#000000; stroke-linecap:round; stroke-linejoin:round; stroke-width:4; stroke-opacity:1; fill:none" points="300.812,1410.22 300.812,1391.32 "/>
<polyline clip-path="url(#clip580)" style="stroke:#000000; stroke-linecap:round; stroke-linejoin:round; stroke-width:4; stroke-opacity:1; fill:none" points="703.154,1410.22 703.154,1391.32 "/>
<polyline clip-path="url(#clip580)" style="stroke:#000000; stroke-linecap:round; stroke-linejoin:round; stroke-width:4; stroke-opacity:1; fill:none" points="1105.5,1410.22 1105.5,1391.32 "/>
<polyline clip-path="url(#clip580)" style="stroke:#000000; stroke-linecap:round; stroke-linejoin:round; stroke-width:4; stroke-opacity:1; fill:none" points="1507.84,1410.22 1507.84,1391.32 "/>
<polyline clip-path="url(#clip580)" style="stroke:#000000; stroke-linecap:round; stroke-linejoin:round; stroke-width:4; stroke-opacity:1; fill:none" points="1910.18,1410.22 1910.18,1391.32 "/>
<polyline clip-path="url(#clip580)" style="stroke:#000000; stroke-linecap:round; stroke-linejoin:round; stroke-width:4; stroke-opacity:1; fill:none" points="2312.52,1410.22 2312.52,1391.32 "/>
<path clip-path="url(#clip580)" d="M263.115 1441.14 Q259.504 1441.14 257.676 1444.7 Q255.87 1448.24 255.87 1455.37 Q255.87 1462.48 257.676 1466.05 Q259.504 1469.59 263.115 1469.59 Q266.75 1469.59 268.555 1466.05 Q270.384 1462.48 270.384 1455.37 Q270.384 1448.24 268.555 1444.7 Q266.75 1441.14 263.115 1441.14 M263.115 1437.43 Q268.926 1437.43 271.981 1442.04 Q275.06 1446.62 275.06 1455.37 Q275.06 1464.1 271.981 1468.71 Q268.926 1473.29 263.115 1473.29 Q257.305 1473.29 254.227 1468.71 Q251.171 1464.1 251.171 1455.37 Q251.171 1446.62 254.227 1442.04 Q257.305 1437.43 263.115 1437.43 Z" fill="#000000" fill-rule="nonzero" fill-opacity="1" /><path clip-path="url(#clip580)" d="M283.277 1466.74 L288.162 1466.74 L288.162 1472.62 L283.277 1472.62 L283.277 1466.74 Z" fill="#000000" fill-rule="nonzero" fill-opacity="1" /><path clip-path="url(#clip580)" d="M308.347 1441.14 Q304.736 1441.14 302.907 1444.7 Q301.101 1448.24 301.101 1455.37 Q301.101 1462.48 302.907 1466.05 Q304.736 1469.59 308.347 1469.59 Q311.981 1469.59 313.786 1466.05 Q315.615 1462.48 315.615 1455.37 Q315.615 1448.24 313.786 1444.7 Q311.981 1441.14 308.347 1441.14 M308.347 1437.43 Q314.157 1437.43 317.212 1442.04 Q320.291 1446.62 320.291 1455.37 Q320.291 1464.1 317.212 1468.71 Q314.157 1473.29 308.347 1473.29 Q302.537 1473.29 299.458 1468.71 Q296.402 1464.1 296.402 1455.37 Q296.402 1446.62 299.458 1442.04 Q302.537 1437.43 308.347 1437.43 Z" fill="#000000" fill-rule="nonzero" fill-opacity="1" /><path clip-path="url(#clip580)" d="M338.509 1441.14 Q334.897 1441.14 333.069 1444.7 Q331.263 1448.24 331.263 1455.37 Q331.263 1462.48 333.069 1466.05 Q334.897 1469.59 338.509 1469.59 Q342.143 1469.59 343.948 1466.05 Q345.777 1462.48 345.777 1455.37 Q345.777 1448.24 343.948 1444.7 Q342.143 1441.14 338.509 1441.14 M338.509 1437.43 Q344.319 1437.43 347.374 1442.04 Q350.453 1446.62 350.453 1455.37 Q350.453 1464.1 347.374 1468.71 Q344.319 1473.29 338.509 1473.29 Q332.698 1473.29 329.62 1468.71 Q326.564 1464.1 326.564 1455.37 Q326.564 1446.62 329.62 1442.04 Q332.698 1437.43 338.509 1437.43 Z" fill="#000000" fill-rule="nonzero" fill-opacity="1" /><path clip-path="url(#clip580)" d="M665.955 1441.14 Q662.344 1441.14 660.515 1444.7 Q658.71 1448.24 658.71 1455.37 Q658.71 1462.48 660.515 1466.05 Q662.344 1469.59 665.955 1469.59 Q669.589 1469.59 671.395 1466.05 Q673.224 1462.48 673.224 1455.37 Q673.224 1448.24 671.395 1444.7 Q669.589 1441.14 665.955 1441.14 M665.955 1437.43 Q671.765 1437.43 674.821 1442.04 Q677.899 1446.62 677.899 1455.37 Q677.899 1464.1 674.821 1468.71 Q671.765 1473.29 665.955 1473.29 Q660.145 1473.29 657.066 1468.71 Q654.011 1464.1 654.011 1455.37 Q654.011 1446.62 657.066 1442.04 Q660.145 1437.43 665.955 1437.43 Z" fill="#000000" fill-rule="nonzero" fill-opacity="1" /><path clip-path="url(#clip580)" d="M686.117 1466.74 L691.001 1466.74 L691.001 1472.62 L686.117 1472.62 L686.117 1466.74 Z" fill="#000000" fill-rule="nonzero" fill-opacity="1" /><path clip-path="url(#clip580)" d="M711.186 1441.14 Q707.575 1441.14 705.747 1444.7 Q703.941 1448.24 703.941 1455.37 Q703.941 1462.48 705.747 1466.05 Q707.575 1469.59 711.186 1469.59 Q714.821 1469.59 716.626 1466.05 Q718.455 1462.48 718.455 1455.37 Q718.455 1448.24 716.626 1444.7 Q714.821 1441.14 711.186 1441.14 M711.186 1437.43 Q716.996 1437.43 720.052 1442.04 Q723.131 1446.62 723.131 1455.37 Q723.131 1464.1 720.052 1468.71 Q716.996 1473.29 711.186 1473.29 Q705.376 1473.29 702.297 1468.71 Q699.242 1464.1 699.242 1455.37 Q699.242 1446.62 702.297 1442.04 Q705.376 1437.43 711.186 1437.43 Z" fill="#000000" fill-rule="nonzero" fill-opacity="1" /><path clip-path="url(#clip580)" d="M731.395 1438.06 L749.751 1438.06 L749.751 1442 L735.677 1442 L735.677 1450.47 Q736.695 1450.12 737.714 1449.96 Q738.732 1449.77 739.751 1449.77 Q745.538 1449.77 748.918 1452.94 Q752.297 1456.12 752.297 1461.53 Q752.297 1467.11 748.825 1470.21 Q745.353 1473.29 739.033 1473.29 Q736.857 1473.29 734.589 1472.92 Q732.344 1472.55 729.936 1471.81 L729.936 1467.11 Q732.02 1468.24 734.242 1468.8 Q736.464 1469.36 738.941 1469.36 Q742.945 1469.36 745.283 1467.25 Q747.621 1465.14 747.621 1461.53 Q747.621 1457.92 745.283 1455.81 Q742.945 1453.71 738.941 1453.71 Q737.066 1453.71 735.191 1454.12 Q733.339 1454.54 731.395 1455.42 L731.395 1438.06 Z" fill="#000000" fill-rule="nonzero" fill-opacity="1" /><path clip-path="url(#clip580)" d="M1067.8 1441.14 Q1064.19 1441.14 1062.36 1444.7 Q1060.55 1448.24 1060.55 1455.37 Q1060.55 1462.48 1062.36 1466.05 Q1064.19 1469.59 1067.8 1469.59 Q1071.43 1469.59 1073.24 1466.05 Q1075.07 1462.48 1075.07 1455.37 Q1075.07 1448.24 1073.24 1444.7 Q1071.43 1441.14 1067.8 1441.14 M1067.8 1437.43 Q1073.61 1437.43 1076.67 1442.04 Q1079.74 1446.62 1079.74 1455.37 Q1079.74 1464.1 1076.67 1468.71 Q1073.61 1473.29 1067.8 1473.29 Q1061.99 1473.29 1058.91 1468.71 Q1055.85 1464.1 1055.85 1455.37 Q1055.85 1446.62 1058.91 1442.04 Q1061.99 1437.43 1067.8 1437.43 Z" fill="#000000" fill-rule="nonzero" fill-opacity="1" /><path clip-path="url(#clip580)" d="M1087.96 1466.74 L1092.85 1466.74 L1092.85 1472.62 L1087.96 1472.62 L1087.96 1466.74 Z" fill="#000000" fill-rule="nonzero" fill-opacity="1" /><path clip-path="url(#clip580)" d="M1103.84 1468.68 L1111.48 1468.68 L1111.48 1442.32 L1103.17 1443.99 L1103.17 1439.73 L1111.43 1438.06 L1116.11 1438.06 L1116.11 1468.68 L1123.75 1468.68 L1123.75 1472.62 L1103.84 1472.62 L1103.84 1468.68 Z" fill="#000000" fill-rule="nonzero" fill-opacity="1" /><path clip-path="url(#clip580)" d="M1143.19 1441.14 Q1139.58 1441.14 1137.75 1444.7 Q1135.95 1448.24 1135.95 1455.37 Q1135.95 1462.48 1137.75 1466.05 Q1139.58 1469.59 1143.19 1469.59 Q1146.83 1469.59 1148.63 1466.05 Q1150.46 1462.48 1150.46 1455.37 Q1150.46 1448.24 1148.63 1444.7 Q1146.83 1441.14 1143.19 1441.14 M1143.19 1437.43 Q1149 1437.43 1152.06 1442.04 Q1155.14 1446.62 1155.14 1455.37 Q1155.14 1464.1 1152.06 1468.71 Q1149 1473.29 1143.19 1473.29 Q1137.38 1473.29 1134.3 1468.71 Q1131.25 1464.1 1131.25 1455.37 Q1131.25 1446.62 1134.3 1442.04 Q1137.38 1437.43 1143.19 1437.43 Z" fill="#000000" fill-rule="nonzero" fill-opacity="1" /><path clip-path="url(#clip580)" d="M1470.64 1441.14 Q1467.03 1441.14 1465.2 1444.7 Q1463.39 1448.24 1463.39 1455.37 Q1463.39 1462.48 1465.2 1466.05 Q1467.03 1469.59 1470.64 1469.59 Q1474.27 1469.59 1476.08 1466.05 Q1477.91 1462.48 1477.91 1455.37 Q1477.91 1448.24 1476.08 1444.7 Q1474.27 1441.14 1470.64 1441.14 M1470.64 1437.43 Q1476.45 1437.43 1479.5 1442.04 Q1482.58 1446.62 1482.58 1455.37 Q1482.58 1464.1 1479.5 1468.71 Q1476.45 1473.29 1470.64 1473.29 Q1464.83 1473.29 1461.75 1468.71 Q1458.69 1464.1 1458.69 1455.37 Q1458.69 1446.62 1461.75 1442.04 Q1464.83 1437.43 1470.64 1437.43 Z" fill="#000000" fill-rule="nonzero" fill-opacity="1" /><path clip-path="url(#clip580)" d="M1490.8 1466.74 L1495.69 1466.74 L1495.69 1472.62 L1490.8 1472.62 L1490.8 1466.74 Z" fill="#000000" fill-rule="nonzero" fill-opacity="1" /><path clip-path="url(#clip580)" d="M1506.68 1468.68 L1514.32 1468.68 L1514.32 1442.32 L1506.01 1443.99 L1506.01 1439.73 L1514.27 1438.06 L1518.95 1438.06 L1518.95 1468.68 L1526.59 1468.68 L1526.59 1472.62 L1506.68 1472.62 L1506.68 1468.68 Z" fill="#000000" fill-rule="nonzero" fill-opacity="1" /><path clip-path="url(#clip580)" d="M1536.08 1438.06 L1554.43 1438.06 L1554.43 1442 L1540.36 1442 L1540.36 1450.47 Q1541.38 1450.12 1542.4 1449.96 Q1543.42 1449.77 1544.43 1449.77 Q1550.22 1449.77 1553.6 1452.94 Q1556.98 1456.12 1556.98 1461.53 Q1556.98 1467.11 1553.51 1470.21 Q1550.04 1473.29 1543.72 1473.29 Q1541.54 1473.29 1539.27 1472.92 Q1537.03 1472.55 1534.62 1471.81 L1534.62 1467.11 Q1536.7 1468.24 1538.93 1468.8 Q1541.15 1469.36 1543.62 1469.36 Q1547.63 1469.36 1549.97 1467.25 Q1552.31 1465.14 1552.31 1461.53 Q1552.31 1457.92 1549.97 1455.81 Q1547.63 1453.71 1543.62 1453.71 Q1541.75 1453.71 1539.87 1454.12 Q1538.02 1454.54 1536.08 1455.42 L1536.08 1438.06 Z" fill="#000000" fill-rule="nonzero" fill-opacity="1" /><path clip-path="url(#clip580)" d="M1872.48 1441.14 Q1868.87 1441.14 1867.04 1444.7 Q1865.24 1448.24 1865.24 1455.37 Q1865.24 1462.48 1867.04 1466.05 Q1868.87 1469.59 1872.48 1469.59 Q1876.12 1469.59 1877.92 1466.05 Q1879.75 1462.48 1879.75 1455.37 Q1879.75 1448.24 1877.92 1444.7 Q1876.12 1441.14 1872.48 1441.14 M1872.48 1437.43 Q1878.29 1437.43 1881.35 1442.04 Q1884.43 1446.62 1884.43 1455.37 Q1884.43 1464.1 1881.35 1468.71 Q1878.29 1473.29 1872.48 1473.29 Q1866.67 1473.29 1863.59 1468.71 Q1860.54 1464.1 1860.54 1455.37 Q1860.54 1446.62 1863.59 1442.04 Q1866.67 1437.43 1872.48 1437.43 Z" fill="#000000" fill-rule="nonzero" fill-opacity="1" /><path clip-path="url(#clip580)" d="M1892.65 1466.74 L1897.53 1466.74 L1897.53 1472.62 L1892.65 1472.62 L1892.65 1466.74 Z" fill="#000000" fill-rule="nonzero" fill-opacity="1" /><path clip-path="url(#clip580)" d="M1911.74 1468.68 L1928.06 1468.68 L1928.06 1472.62 L1906.12 1472.62 L1906.12 1468.68 Q1908.78 1465.93 1913.36 1461.3 Q1917.97 1456.65 1919.15 1455.31 Q1921.39 1452.78 1922.27 1451.05 Q1923.18 1449.29 1923.18 1447.6 Q1923.18 1444.84 1921.23 1443.11 Q1919.31 1441.37 1916.21 1441.37 Q1914.01 1441.37 1911.56 1442.13 Q1909.13 1442.9 1906.35 1444.45 L1906.35 1439.73 Q1909.17 1438.59 1911.63 1438.01 Q1914.08 1437.43 1916.12 1437.43 Q1921.49 1437.43 1924.68 1440.12 Q1927.88 1442.81 1927.88 1447.3 Q1927.88 1449.43 1927.07 1451.35 Q1926.28 1453.24 1924.17 1455.84 Q1923.59 1456.51 1920.49 1459.73 Q1917.39 1462.92 1911.74 1468.68 Z" fill="#000000" fill-rule="nonzero" fill-opacity="1" /><path clip-path="url(#clip580)" d="M1947.88 1441.14 Q1944.27 1441.14 1942.44 1444.7 Q1940.63 1448.24 1940.63 1455.37 Q1940.63 1462.48 1942.44 1466.05 Q1944.27 1469.59 1947.88 1469.59 Q1951.51 1469.59 1953.32 1466.05 Q1955.14 1462.48 1955.14 1455.37 Q1955.14 1448.24 1953.32 1444.7 Q1951.51 1441.14 1947.88 1441.14 M1947.88 1437.43 Q1953.69 1437.43 1956.74 1442.04 Q1959.82 1446.62 1959.82 1455.37 Q1959.82 1464.1 1956.74 1468.71 Q1953.69 1473.29 1947.88 1473.29 Q1942.07 1473.29 1938.99 1468.71 Q1935.93 1464.1 1935.93 1455.37 Q1935.93 1446.62 1938.99 1442.04 Q1942.07 1437.43 1947.88 1437.43 Z" fill="#000000" fill-rule="nonzero" fill-opacity="1" /><path clip-path="url(#clip580)" d="M2275.32 1441.14 Q2271.71 1441.14 2269.88 1444.7 Q2268.08 1448.24 2268.08 1455.37 Q2268.08 1462.48 2269.88 1466.05 Q2271.71 1469.59 2275.32 1469.59 Q2278.96 1469.59 2280.76 1466.05 Q2282.59 1462.48 2282.59 1455.37 Q2282.59 1448.24 2280.76 1444.7 Q2278.96 1441.14 2275.32 1441.14 M2275.32 1437.43 Q2281.13 1437.43 2284.19 1442.04 Q2287.27 1446.62 2287.27 1455.37 Q2287.27 1464.1 2284.19 1468.71 Q2281.13 1473.29 2275.32 1473.29 Q2269.51 1473.29 2266.43 1468.71 Q2263.38 1464.1 2263.38 1455.37 Q2263.38 1446.62 2266.43 1442.04 Q2269.51 1437.43 2275.32 1437.43 Z" fill="#000000" fill-rule="nonzero" fill-opacity="1" /><path clip-path="url(#clip580)" d="M2295.48 1466.74 L2300.37 1466.74 L2300.37 1472.62 L2295.48 1472.62 L2295.48 1466.74 Z" fill="#000000" fill-rule="nonzero" fill-opacity="1" /><path clip-path="url(#clip580)" d="M2314.58 1468.68 L2330.9 1468.68 L2330.9 1472.62 L2308.96 1472.62 L2308.96 1468.68 Q2311.62 1465.93 2316.2 1461.3 Q2320.81 1456.65 2321.99 1455.31 Q2324.23 1452.78 2325.11 1451.05 Q2326.02 1449.29 2326.02 1447.6 Q2326.02 1444.84 2324.07 1443.11 Q2322.15 1441.37 2319.05 1441.37 Q2316.85 1441.37 2314.4 1442.13 Q2311.97 1442.9 2309.19 1444.45 L2309.19 1439.73 Q2312.01 1438.59 2314.47 1438.01 Q2316.92 1437.43 2318.96 1437.43 Q2324.33 1437.43 2327.52 1440.12 Q2330.72 1442.81 2330.72 1447.3 Q2330.72 1449.43 2329.91 1451.35 Q2329.12 1453.24 2327.01 1455.84 Q2326.43 1456.51 2323.33 1459.73 Q2320.23 1462.92 2314.58 1468.68 Z" fill="#000000" fill-rule="nonzero" fill-opacity="1" /><path clip-path="url(#clip580)" d="M2340.76 1438.06 L2359.12 1438.06 L2359.12 1442 L2345.04 1442 L2345.04 1450.47 Q2346.06 1450.12 2347.08 1449.96 Q2348.1 1449.77 2349.12 1449.77 Q2354.91 1449.77 2358.29 1452.94 Q2361.66 1456.12 2361.66 1461.53 Q2361.66 1467.11 2358.19 1470.21 Q2354.72 1473.29 2348.4 1473.29 Q2346.23 1473.29 2343.96 1472.92 Q2341.71 1472.55 2339.3 1471.81 L2339.3 1467.11 Q2341.39 1468.24 2343.61 1468.8 Q2345.83 1469.36 2348.31 1469.36 Q2352.31 1469.36 2354.65 1467.25 Q2356.99 1465.14 2356.99 1461.53 Q2356.99 1457.92 2354.65 1455.81 Q2352.31 1453.71 2348.31 1453.71 Q2346.43 1453.71 2344.56 1454.12 Q2342.71 1454.54 2340.76 1455.42 L2340.76 1438.06 Z" fill="#000000" fill-rule="nonzero" fill-opacity="1" /><path clip-path="url(#clip580)" d="M1256.92 1507.21 L1256.92 1504.59 Q1267 1504.59 1272.21 1499.22 Q1273.64 1499.22 1273.89 1499.55 Q1274.13 1499.88 1274.13 1501.39 L1274.13 1548.49 Q1274.13 1550.99 1275.36 1551.77 Q1276.59 1552.55 1281.96 1552.55 L1284.63 1552.55 L1284.63 1555.13 Q1281.68 1554.88 1271.02 1554.88 Q1260.36 1554.88 1257.45 1555.13 L1257.45 1552.55 L1260.12 1552.55 Q1265.4 1552.55 1266.67 1551.81 Q1267.94 1551.03 1267.94 1548.49 L1267.94 1505 Q1263.56 1507.21 1256.92 1507.21 Z" fill="#000000" fill-rule="nonzero" fill-opacity="1" /><path clip-path="url(#clip580)" d="M1298.49 1574.93 Q1298.49 1574.52 1298.82 1573.62 L1328.45 1494.42 Q1328.45 1494.34 1328.66 1493.89 Q1328.86 1493.44 1328.98 1493.15 Q1329.11 1492.83 1329.35 1492.58 Q1329.64 1492.33 1329.97 1492.33 Q1330.79 1492.33 1330.79 1493.36 Q1330.79 1493.44 1330.54 1494.42 L1300.82 1573.7 Q1300.33 1575.13 1300.01 1575.54 Q1299.72 1575.95 1299.23 1575.95 Q1298.49 1575.95 1298.49 1574.93 Z" fill="#000000" fill-rule="nonzero" fill-opacity="1" /><path clip-path="url(#clip580)" d="M1390.76 1534.39 Q1390.76 1534.63 1390.43 1535.58 L1383.79 1553.69 Q1383.43 1554.76 1383.06 1554.97 Q1382.69 1555.13 1381.17 1555.13 L1342.31 1555.13 Q1341.37 1555.13 1341 1555.09 Q1340.63 1555.05 1340.35 1554.84 Q1340.06 1554.64 1340.06 1554.19 Q1340.06 1553.37 1340.35 1553 Q1340.67 1552.63 1341.04 1552.59 Q1341.41 1552.55 1342.31 1552.55 Q1344.36 1552.55 1345.59 1552.42 Q1346.82 1552.3 1347.6 1552.14 Q1348.42 1551.93 1348.83 1551.36 Q1349.28 1550.78 1349.49 1550.29 Q1349.69 1549.76 1349.98 1548.57 L1361.21 1503.48 Q1361.54 1502.13 1361.54 1501.93 Q1361.54 1501.15 1361.05 1500.94 Q1360.59 1500.7 1359.28 1500.57 L1356.09 1500.41 Q1355.1 1500.41 1354.69 1500.37 Q1354.32 1500.33 1354.04 1500.12 Q1353.75 1499.92 1353.75 1499.47 Q1353.75 1498.69 1354.04 1498.32 Q1354.36 1497.91 1354.61 1497.87 Q1354.9 1497.79 1355.35 1497.79 L1366.5 1498.03 L1378.92 1497.79 Q1380.27 1497.79 1380.27 1498.81 Q1380.27 1499.96 1379.7 1500.2 Q1379.12 1500.41 1377.07 1500.41 Q1373.14 1500.41 1371.33 1500.82 Q1369.57 1501.23 1369.08 1501.93 Q1368.63 1502.58 1368.18 1504.34 L1356.82 1549.68 Q1356.41 1551.19 1356.41 1551.6 Q1356.41 1552.05 1356.62 1552.22 Q1356.86 1552.34 1357.52 1552.42 Q1358.26 1552.55 1359.36 1552.55 L1367.23 1552.55 Q1369.61 1552.55 1371.7 1552.18 Q1373.79 1551.81 1375.39 1551.28 Q1377.03 1550.74 1378.51 1549.76 Q1379.98 1548.78 1381.01 1547.91 Q1382.07 1547.01 1383.1 1545.62 Q1384.16 1544.18 1384.78 1543.2 Q1385.43 1542.18 1386.17 1540.54 Q1386.91 1538.86 1387.28 1537.91 Q1387.69 1536.93 1388.3 1535.25 Q1388.67 1534.39 1388.8 1534.14 Q1388.92 1533.9 1389.12 1533.69 Q1389.37 1533.49 1389.74 1533.49 Q1390.23 1533.49 1390.48 1533.77 Q1390.76 1534.06 1390.76 1534.39 Z" fill="#000000" fill-rule="nonzero" fill-opacity="1" /><polyline clip-path="url(#clip582)" style="stroke:#000000; stroke-linecap:round; stroke-linejoin:round; stroke-width:2; stroke-opacity:0.1; fill:none" points="300.812,1345.32 2352.76,1345.32 "/>
<polyline clip-path="url(#clip582)" style="stroke:#000000; stroke-linecap:round; stroke-linejoin:round; stroke-width:2; stroke-opacity:0.1; fill:none" points="300.812,1128.97 2352.76,1128.97 "/>
<polyline clip-path="url(#clip582)" style="stroke:#000000; stroke-linecap:round; stroke-linejoin:round; stroke-width:2; stroke-opacity:0.1; fill:none" points="300.812,912.626 2352.76,912.626 "/>
<polyline clip-path="url(#clip582)" style="stroke:#000000; stroke-linecap:round; stroke-linejoin:round; stroke-width:2; stroke-opacity:0.1; fill:none" points="300.812,696.28 2352.76,696.28 "/>
<polyline clip-path="url(#clip582)" style="stroke:#000000; stroke-linecap:round; stroke-linejoin:round; stroke-width:2; stroke-opacity:0.1; fill:none" points="300.812,479.935 2352.76,479.935 "/>
<polyline clip-path="url(#clip582)" style="stroke:#000000; stroke-linecap:round; stroke-linejoin:round; stroke-width:2; stroke-opacity:0.1; fill:none" points="300.812,263.589 2352.76,263.589 "/>
<polyline clip-path="url(#clip582)" style="stroke:#000000; stroke-linecap:round; stroke-linejoin:round; stroke-width:2; stroke-opacity:0.1; fill:none" points="300.812,47.2441 2352.76,47.2441 "/>
<polyline clip-path="url(#clip580)" style="stroke:#000000; stroke-linecap:round; stroke-linejoin:round; stroke-width:4; stroke-opacity:1; fill:none" points="300.812,1410.22 300.812,47.2441 "/>
<polyline clip-path="url(#clip580)" style="stroke:#000000; stroke-linecap:round; stroke-linejoin:round; stroke-width:4; stroke-opacity:1; fill:none" points="300.812,1345.32 319.71,1345.32 "/>
<polyline clip-path="url(#clip580)" style="stroke:#000000; stroke-linecap:round; stroke-linejoin:round; stroke-width:4; stroke-opacity:1; fill:none" points="300.812,1128.97 319.71,1128.97 "/>
<polyline clip-path="url(#clip580)" style="stroke:#000000; stroke-linecap:round; stroke-linejoin:round; stroke-width:4; stroke-opacity:1; fill:none" points="300.812,912.626 319.71,912.626 "/>
<polyline clip-path="url(#clip580)" style="stroke:#000000; stroke-linecap:round; stroke-linejoin:round; stroke-width:4; stroke-opacity:1; fill:none" points="300.812,696.28 319.71,696.28 "/>
<polyline clip-path="url(#clip580)" style="stroke:#000000; stroke-linecap:round; stroke-linejoin:round; stroke-width:4; stroke-opacity:1; fill:none" points="300.812,479.935 319.71,479.935 "/>
<polyline clip-path="url(#clip580)" style="stroke:#000000; stroke-linecap:round; stroke-linejoin:round; stroke-width:4; stroke-opacity:1; fill:none" points="300.812,263.589 319.71,263.589 "/>
<polyline clip-path="url(#clip580)" style="stroke:#000000; stroke-linecap:round; stroke-linejoin:round; stroke-width:4; stroke-opacity:1; fill:none" points="300.812,47.2441 319.71,47.2441 "/>
<path clip-path="url(#clip580)" d="M127.706 1345.77 L157.382 1345.77 L157.382 1349.7 L127.706 1349.7 L127.706 1345.77 Z" fill="#000000" fill-rule="nonzero" fill-opacity="1" /><path clip-path="url(#clip580)" d="M177.475 1331.11 Q173.863 1331.11 172.035 1334.68 Q170.229 1338.22 170.229 1345.35 Q170.229 1352.46 172.035 1356.02 Q173.863 1359.56 177.475 1359.56 Q181.109 1359.56 182.914 1356.02 Q184.743 1352.46 184.743 1345.35 Q184.743 1338.22 182.914 1334.68 Q181.109 1331.11 177.475 1331.11 M177.475 1327.41 Q183.285 1327.41 186.34 1332.02 Q189.419 1336.6 189.419 1345.35 Q189.419 1354.08 186.34 1358.68 Q183.285 1363.27 177.475 1363.27 Q171.664 1363.27 168.586 1358.68 Q165.53 1354.08 165.53 1345.35 Q165.53 1336.6 168.586 1332.02 Q171.664 1327.41 177.475 1327.41 Z" fill="#000000" fill-rule="nonzero" fill-opacity="1" /><path clip-path="url(#clip580)" d="M197.636 1356.72 L202.521 1356.72 L202.521 1362.6 L197.636 1362.6 L197.636 1356.72 Z" fill="#000000" fill-rule="nonzero" fill-opacity="1" /><path clip-path="url(#clip580)" d="M212.752 1328.04 L231.108 1328.04 L231.108 1331.97 L217.034 1331.97 L217.034 1340.44 Q218.053 1340.1 219.072 1339.93 Q220.09 1339.75 221.109 1339.75 Q226.896 1339.75 230.275 1342.92 Q233.655 1346.09 233.655 1351.51 Q233.655 1357.09 230.183 1360.19 Q226.71 1363.27 220.391 1363.27 Q218.215 1363.27 215.947 1362.9 Q213.701 1362.53 211.294 1361.79 L211.294 1357.09 Q213.377 1358.22 215.599 1358.78 Q217.822 1359.33 220.298 1359.33 Q224.303 1359.33 226.641 1357.23 Q228.979 1355.12 228.979 1351.51 Q228.979 1347.9 226.641 1345.79 Q224.303 1343.68 220.298 1343.68 Q218.423 1343.68 216.548 1344.1 Q214.697 1344.52 212.752 1345.4 L212.752 1328.04 Z" fill="#000000" fill-rule="nonzero" fill-opacity="1" /><path clip-path="url(#clip580)" d="M252.868 1331.11 Q249.257 1331.11 247.428 1334.68 Q245.622 1338.22 245.622 1345.35 Q245.622 1352.46 247.428 1356.02 Q249.257 1359.56 252.868 1359.56 Q256.502 1359.56 258.307 1356.02 Q260.136 1352.46 260.136 1345.35 Q260.136 1338.22 258.307 1334.68 Q256.502 1331.11 252.868 1331.11 M252.868 1327.41 Q258.678 1327.41 261.733 1332.02 Q264.812 1336.6 264.812 1345.35 Q264.812 1354.08 261.733 1358.68 Q258.678 1363.27 252.868 1363.27 Q247.057 1363.27 243.979 1358.68 Q240.923 1354.08 240.923 1345.35 Q240.923 1336.6 243.979 1332.02 Q247.057 1327.41 252.868 1327.41 Z" fill="#000000" fill-rule="nonzero" fill-opacity="1" /><path clip-path="url(#clip580)" d="M127.891 1129.42 L157.567 1129.42 L157.567 1133.36 L127.891 1133.36 L127.891 1129.42 Z" fill="#000000" fill-rule="nonzero" fill-opacity="1" /><path clip-path="url(#clip580)" d="M177.66 1114.77 Q174.049 1114.77 172.22 1118.33 Q170.414 1121.88 170.414 1129.01 Q170.414 1136.11 172.22 1139.68 Q174.049 1143.22 177.66 1143.22 Q181.294 1143.22 183.099 1139.68 Q184.928 1136.11 184.928 1129.01 Q184.928 1121.88 183.099 1118.33 Q181.294 1114.77 177.66 1114.77 M177.66 1111.07 Q183.47 1111.07 186.525 1115.67 Q189.604 1120.26 189.604 1129.01 Q189.604 1137.73 186.525 1142.34 Q183.47 1146.92 177.66 1146.92 Q171.85 1146.92 168.771 1142.34 Q165.715 1137.73 165.715 1129.01 Q165.715 1120.26 168.771 1115.67 Q171.85 1111.07 177.66 1111.07 Z" fill="#000000" fill-rule="nonzero" fill-opacity="1" /><path clip-path="url(#clip580)" d="M197.822 1140.37 L202.706 1140.37 L202.706 1146.25 L197.822 1146.25 L197.822 1140.37 Z" fill="#000000" fill-rule="nonzero" fill-opacity="1" /><path clip-path="url(#clip580)" d="M225.738 1115.76 L213.933 1134.21 L225.738 1134.21 L225.738 1115.76 M224.511 1111.69 L230.391 1111.69 L230.391 1134.21 L235.321 1134.21 L235.321 1138.1 L230.391 1138.1 L230.391 1146.25 L225.738 1146.25 L225.738 1138.1 L210.136 1138.1 L210.136 1133.59 L224.511 1111.69 Z" fill="#000000" fill-rule="nonzero" fill-opacity="1" /><path clip-path="url(#clip580)" d="M243.192 1145.53 L243.192 1141.27 Q244.951 1142.11 246.757 1142.55 Q248.562 1142.99 250.298 1142.99 Q254.928 1142.99 257.358 1139.89 Q259.812 1136.76 260.159 1130.42 Q258.817 1132.41 256.757 1133.47 Q254.696 1134.54 252.196 1134.54 Q247.011 1134.54 243.979 1131.41 Q240.97 1128.26 240.97 1122.83 Q240.97 1117.5 244.118 1114.28 Q247.266 1111.07 252.497 1111.07 Q258.493 1111.07 261.641 1115.67 Q264.812 1120.26 264.812 1129.01 Q264.812 1137.18 260.923 1142.06 Q257.057 1146.92 250.507 1146.92 Q248.747 1146.92 246.942 1146.57 Q245.136 1146.23 243.192 1145.53 M252.497 1130.88 Q255.645 1130.88 257.474 1128.73 Q259.326 1126.58 259.326 1122.83 Q259.326 1119.1 257.474 1116.95 Q255.645 1114.77 252.497 1114.77 Q249.349 1114.77 247.497 1116.95 Q245.669 1119.1 245.669 1122.83 Q245.669 1126.58 247.497 1128.73 Q249.349 1130.88 252.497 1130.88 Z" fill="#000000" fill-rule="nonzero" fill-opacity="1" /><path clip-path="url(#clip580)" d="M127.799 913.077 L157.475 913.077 L157.475 917.012 L127.799 917.012 L127.799 913.077 Z" fill="#000000" fill-rule="nonzero" fill-opacity="1" /><path clip-path="url(#clip580)" d="M177.567 898.424 Q173.956 898.424 172.127 901.989 Q170.322 905.531 170.322 912.66 Q170.322 919.767 172.127 923.331 Q173.956 926.873 177.567 926.873 Q181.201 926.873 183.007 923.331 Q184.836 919.767 184.836 912.66 Q184.836 905.531 183.007 901.989 Q181.201 898.424 177.567 898.424 M177.567 894.721 Q183.377 894.721 186.433 899.327 Q189.511 903.91 189.511 912.66 Q189.511 921.387 186.433 925.994 Q183.377 930.577 177.567 930.577 Q171.757 930.577 168.678 925.994 Q165.623 921.387 165.623 912.66 Q165.623 903.91 168.678 899.327 Q171.757 894.721 177.567 894.721 Z" fill="#000000" fill-rule="nonzero" fill-opacity="1" /><path clip-path="url(#clip580)" d="M197.729 924.026 L202.613 924.026 L202.613 929.906 L197.729 929.906 L197.729 924.026 Z" fill="#000000" fill-rule="nonzero" fill-opacity="1" /><path clip-path="url(#clip580)" d="M225.646 899.42 L213.84 917.869 L225.646 917.869 L225.646 899.42 M224.419 895.346 L230.298 895.346 L230.298 917.869 L235.229 917.869 L235.229 921.757 L230.298 921.757 L230.298 929.906 L225.646 929.906 L225.646 921.757 L210.044 921.757 L210.044 917.244 L224.419 895.346 Z" fill="#000000" fill-rule="nonzero" fill-opacity="1" /><path clip-path="url(#clip580)" d="M252.96 913.494 Q249.627 913.494 247.706 915.276 Q245.807 917.058 245.807 920.183 Q245.807 923.308 247.706 925.091 Q249.627 926.873 252.96 926.873 Q256.294 926.873 258.215 925.091 Q260.136 923.285 260.136 920.183 Q260.136 917.058 258.215 915.276 Q256.317 913.494 252.96 913.494 M248.284 911.503 Q245.275 910.762 243.585 908.702 Q241.919 906.642 241.919 903.679 Q241.919 899.535 244.858 897.128 Q247.821 894.721 252.96 894.721 Q258.122 894.721 261.062 897.128 Q264.002 899.535 264.002 903.679 Q264.002 906.642 262.312 908.702 Q260.645 910.762 257.659 911.503 Q261.039 912.29 262.914 914.582 Q264.812 916.873 264.812 920.183 Q264.812 925.206 261.733 927.892 Q258.678 930.577 252.96 930.577 Q247.243 930.577 244.164 927.892 Q241.108 925.206 241.108 920.183 Q241.108 916.873 243.007 914.582 Q244.905 912.29 248.284 911.503 M246.571 904.119 Q246.571 906.804 248.238 908.308 Q249.928 909.813 252.96 909.813 Q255.969 909.813 257.659 908.308 Q259.372 906.804 259.372 904.119 Q259.372 901.433 257.659 899.929 Q255.969 898.424 252.96 898.424 Q249.928 898.424 248.238 899.929 Q246.571 901.433 246.571 904.119 Z" fill="#000000" fill-rule="nonzero" fill-opacity="1" /><path clip-path="url(#clip580)" d="M128.609 696.732 L158.285 696.732 L158.285 700.667 L128.609 700.667 L128.609 696.732 Z" fill="#000000" fill-rule="nonzero" fill-opacity="1" /><path clip-path="url(#clip580)" d="M178.377 682.079 Q174.766 682.079 172.938 685.644 Q171.132 689.185 171.132 696.315 Q171.132 703.421 172.938 706.986 Q174.766 710.528 178.377 710.528 Q182.012 710.528 183.817 706.986 Q185.646 703.421 185.646 696.315 Q185.646 689.185 183.817 685.644 Q182.012 682.079 178.377 682.079 M178.377 678.375 Q184.187 678.375 187.243 682.982 Q190.322 687.565 190.322 696.315 Q190.322 705.042 187.243 709.648 Q184.187 714.231 178.377 714.231 Q172.567 714.231 169.488 709.648 Q166.433 705.042 166.433 696.315 Q166.433 687.565 169.488 682.982 Q172.567 678.375 178.377 678.375 Z" fill="#000000" fill-rule="nonzero" fill-opacity="1" /><path clip-path="url(#clip580)" d="M198.539 707.681 L203.423 707.681 L203.423 713.56 L198.539 713.56 L198.539 707.681 Z" fill="#000000" fill-rule="nonzero" fill-opacity="1" /><path clip-path="url(#clip580)" d="M226.456 683.074 L214.65 701.523 L226.456 701.523 L226.456 683.074 M225.229 679 L231.108 679 L231.108 701.523 L236.039 701.523 L236.039 705.412 L231.108 705.412 L231.108 713.56 L226.456 713.56 L226.456 705.412 L210.854 705.412 L210.854 700.898 L225.229 679 Z" fill="#000000" fill-rule="nonzero" fill-opacity="1" /><path clip-path="url(#clip580)" d="M242.59 679 L264.812 679 L264.812 680.991 L252.266 713.56 L247.382 713.56 L259.187 682.935 L242.59 682.935 L242.59 679 Z" fill="#000000" fill-rule="nonzero" fill-opacity="1" /><path clip-path="url(#clip580)" d="M127.544 480.386 L157.22 480.386 L157.22 484.321 L127.544 484.321 L127.544 480.386 Z" fill="#000000" fill-rule="nonzero" fill-opacity="1" /><path clip-path="url(#clip580)" d="M177.312 465.733 Q173.701 465.733 171.873 469.298 Q170.067 472.84 170.067 479.97 Q170.067 487.076 171.873 490.641 Q173.701 494.182 177.312 494.182 Q180.947 494.182 182.752 490.641 Q184.581 487.076 184.581 479.97 Q184.581 472.84 182.752 469.298 Q180.947 465.733 177.312 465.733 M177.312 462.03 Q183.123 462.03 186.178 466.636 Q189.257 471.22 189.257 479.97 Q189.257 488.696 186.178 493.303 Q183.123 497.886 177.312 497.886 Q171.502 497.886 168.424 493.303 Q165.368 488.696 165.368 479.97 Q165.368 471.22 168.424 466.636 Q171.502 462.03 177.312 462.03 Z" fill="#000000" fill-rule="nonzero" fill-opacity="1" /><path clip-path="url(#clip580)" d="M197.474 491.335 L202.359 491.335 L202.359 497.215 L197.474 497.215 L197.474 491.335 Z" fill="#000000" fill-rule="nonzero" fill-opacity="1" /><path clip-path="url(#clip580)" d="M225.391 466.729 L213.585 485.178 L225.391 485.178 L225.391 466.729 M224.164 462.655 L230.044 462.655 L230.044 485.178 L234.974 485.178 L234.974 489.067 L230.044 489.067 L230.044 497.215 L225.391 497.215 L225.391 489.067 L209.789 489.067 L209.789 484.553 L224.164 462.655 Z" fill="#000000" fill-rule="nonzero" fill-opacity="1" /><path clip-path="url(#clip580)" d="M253.284 478.071 Q250.136 478.071 248.284 480.224 Q246.456 482.377 246.456 486.127 Q246.456 489.854 248.284 492.03 Q250.136 494.182 253.284 494.182 Q256.432 494.182 258.261 492.03 Q260.113 489.854 260.113 486.127 Q260.113 482.377 258.261 480.224 Q256.432 478.071 253.284 478.071 M262.567 463.419 L262.567 467.678 Q260.807 466.845 259.002 466.405 Q257.219 465.965 255.46 465.965 Q250.831 465.965 248.377 469.09 Q245.946 472.215 245.599 478.534 Q246.965 476.52 249.025 475.456 Q251.085 474.368 253.562 474.368 Q258.77 474.368 261.78 477.539 Q264.812 480.687 264.812 486.127 Q264.812 491.451 261.664 494.669 Q258.516 497.886 253.284 497.886 Q247.289 497.886 244.118 493.303 Q240.946 488.696 240.946 479.97 Q240.946 471.775 244.835 466.914 Q248.724 462.03 255.275 462.03 Q257.034 462.03 258.817 462.377 Q260.622 462.724 262.567 463.419 Z" fill="#000000" fill-rule="nonzero" fill-opacity="1" /><path clip-path="url(#clip580)" d="M128.702 264.041 L158.377 264.041 L158.377 267.976 L128.702 267.976 L128.702 264.041 Z" fill="#000000" fill-rule="nonzero" fill-opacity="1" /><path clip-path="url(#clip580)" d="M178.47 249.388 Q174.859 249.388 173.03 252.953 Q171.225 256.495 171.225 263.624 Q171.225 270.731 173.03 274.295 Q174.859 277.837 178.47 277.837 Q182.104 277.837 183.91 274.295 Q185.738 270.731 185.738 263.624 Q185.738 256.495 183.91 252.953 Q182.104 249.388 178.47 249.388 M178.47 245.684 Q184.28 245.684 187.336 250.291 Q190.414 254.874 190.414 263.624 Q190.414 272.351 187.336 276.957 Q184.28 281.541 178.47 281.541 Q172.66 281.541 169.581 276.957 Q166.526 272.351 166.526 263.624 Q166.526 254.874 169.581 250.291 Q172.66 245.684 178.47 245.684 Z" fill="#000000" fill-rule="nonzero" fill-opacity="1" /><path clip-path="url(#clip580)" d="M198.632 274.99 L203.516 274.99 L203.516 280.869 L198.632 280.869 L198.632 274.99 Z" fill="#000000" fill-rule="nonzero" fill-opacity="1" /><path clip-path="url(#clip580)" d="M226.548 250.384 L214.743 268.832 L226.548 268.832 L226.548 250.384 M225.321 246.309 L231.201 246.309 L231.201 268.832 L236.132 268.832 L236.132 272.721 L231.201 272.721 L231.201 280.869 L226.548 280.869 L226.548 272.721 L210.947 272.721 L210.947 268.207 L225.321 246.309 Z" fill="#000000" fill-rule="nonzero" fill-opacity="1" /><path clip-path="url(#clip580)" d="M243.909 246.309 L262.266 246.309 L262.266 250.245 L248.192 250.245 L248.192 258.717 Q249.21 258.37 250.229 258.208 Q251.247 258.022 252.266 258.022 Q258.053 258.022 261.432 261.194 Q264.812 264.365 264.812 269.782 Q264.812 275.36 261.34 278.462 Q257.868 281.541 251.548 281.541 Q249.372 281.541 247.104 281.17 Q244.858 280.8 242.451 280.059 L242.451 275.36 Q244.534 276.494 246.757 277.05 Q248.979 277.606 251.456 277.606 Q255.46 277.606 257.798 275.499 Q260.136 273.393 260.136 269.782 Q260.136 266.17 257.798 264.064 Q255.46 261.958 251.456 261.958 Q249.581 261.958 247.706 262.374 Q245.854 262.791 243.909 263.67 L243.909 246.309 Z" fill="#000000" fill-rule="nonzero" fill-opacity="1" /><path clip-path="url(#clip580)" d="M127.22 47.6955 L156.896 47.6955 L156.896 51.6306 L127.22 51.6306 L127.22 47.6955 Z" fill="#000000" fill-rule="nonzero" fill-opacity="1" /><path clip-path="url(#clip580)" d="M176.988 33.0428 Q173.377 33.0428 171.549 36.6076 Q169.743 40.1492 169.743 47.2788 Q169.743 54.3853 171.549 57.9501 Q173.377 61.4917 176.988 61.4917 Q180.623 61.4917 182.428 57.9501 Q184.257 54.3853 184.257 47.2788 Q184.257 40.1492 182.428 36.6076 Q180.623 33.0428 176.988 33.0428 M176.988 29.3391 Q182.799 29.3391 185.854 33.9456 Q188.933 38.5289 188.933 47.2788 Q188.933 56.0056 185.854 60.6121 Q182.799 65.1954 176.988 65.1954 Q171.178 65.1954 168.1 60.6121 Q165.044 56.0056 165.044 47.2788 Q165.044 38.5289 168.1 33.9456 Q171.178 29.3391 176.988 29.3391 Z" fill="#000000" fill-rule="nonzero" fill-opacity="1" /><path clip-path="url(#clip580)" d="M197.15 58.6445 L202.035 58.6445 L202.035 64.5241 L197.15 64.5241 L197.15 58.6445 Z" fill="#000000" fill-rule="nonzero" fill-opacity="1" /><path clip-path="url(#clip580)" d="M225.067 34.0381 L213.261 52.4871 L225.067 52.4871 L225.067 34.0381 M223.84 29.9641 L229.72 29.9641 L229.72 52.4871 L234.65 52.4871 L234.65 56.376 L229.72 56.376 L229.72 64.5241 L225.067 64.5241 L225.067 56.376 L209.465 56.376 L209.465 51.8621 L223.84 29.9641 Z" fill="#000000" fill-rule="nonzero" fill-opacity="1" /><path clip-path="url(#clip580)" d="M255.229 34.0381 L243.423 52.4871 L255.229 52.4871 L255.229 34.0381 M254.002 29.9641 L259.881 29.9641 L259.881 52.4871 L264.812 52.4871 L264.812 56.376 L259.881 56.376 L259.881 64.5241 L255.229 64.5241 L255.229 56.376 L239.627 56.376 L239.627 51.8621 L254.002 29.9641 Z" fill="#000000" fill-rule="nonzero" fill-opacity="1" /><path clip-path="url(#clip580)" d="M18.9546 792.265 L33.4649 793.946 Q34.7765 794.069 35.1864 794.274 Q35.5553 794.479 35.5553 795.135 Q35.5553 795.626 35.2684 795.913 Q34.9405 796.159 34.5716 796.159 Q34.3666 796.159 33.8338 796.118 Q33.3009 796.077 33.055 796.077 Q30.5136 795.708 28.5871 795.708 Q25.0211 795.708 23.0946 796.774 Q21.1271 797.84 20.2253 800.586 Q19.2826 803.332 19.2826 808.497 L19.2826 820.302 Q19.2826 823.007 19.7744 823.663 Q20.2663 824.278 22.5617 824.852 L42.7694 829.893 L42.7694 821.983 Q42.7694 819.031 42.4005 817.269 Q42.0316 815.465 41.0069 814.277 Q39.9412 813.047 38.5065 812.391 Q37.0719 811.694 34.4896 810.997 Q33.6288 810.792 33.3009 810.587 Q32.973 810.342 32.973 809.809 Q32.973 809.399 33.2599 809.112 Q33.5058 808.825 33.8747 808.825 L53.5086 813.621 Q54.4924 813.867 54.8613 814.113 Q55.1892 814.358 55.1892 814.85 Q55.1892 815.383 54.9022 815.67 Q54.6153 815.957 54.2874 815.957 Q53.9595 815.957 53.3447 815.711 Q50.6804 815.096 49.2457 815.096 Q48.4259 815.096 48.016 815.178 Q47.6062 815.219 47.0323 815.588 Q46.4175 815.916 46.1305 816.654 Q45.8436 817.392 45.6387 818.785 Q45.3927 820.179 45.3927 822.269 L45.3927 830.549 L68.3057 836.288 Q69.8223 836.698 70.2322 836.698 Q70.6831 836.698 70.8471 836.493 Q70.97 836.247 71.052 835.591 Q71.175 834.853 71.175 833.746 L71.175 821.491 Q71.175 818.785 70.9291 816.613 Q70.6831 814.44 70.0683 812.637 Q69.4534 810.792 68.7566 809.399 Q68.0598 808.005 66.7891 806.694 Q65.4775 805.382 64.3298 804.48 Q63.1411 803.537 61.1326 802.431 Q59.1241 801.324 57.4846 800.545 Q55.804 799.766 53.0987 798.578 Q52.115 798.25 52.115 797.471 Q52.115 797.02 52.3609 796.774 Q52.5659 796.528 52.7708 796.487 L53.0167 796.487 Q53.7955 796.733 54.2054 796.897 L72.3227 804.603 Q73.3474 805.054 73.5524 805.423 Q73.7573 805.792 73.7573 807.226 L73.7573 850.798 Q73.7573 851.782 73.7163 852.192 Q73.6753 852.561 73.4704 852.847 Q73.2245 853.134 72.7326 853.134 Q71.9538 853.134 71.6259 852.806 Q71.257 852.479 71.216 852.11 Q71.175 851.741 71.175 850.798 Q71.175 848.749 71.052 847.519 Q70.9291 846.289 70.7651 845.51 Q70.5602 844.691 69.9863 844.281 Q69.4125 843.83 68.9206 843.625 Q68.3877 843.42 67.199 843.133 L22.8076 832.066 Q21.291 831.656 20.7992 831.656 Q20.2663 831.656 19.9384 832.025 Q19.6105 832.353 19.4875 833.255 Q19.3236 834.156 19.3236 834.894 Q19.2826 835.591 19.2826 837.108 Q19.2826 838.091 19.2416 838.501 Q19.2006 838.87 18.9956 839.157 Q18.7907 839.444 18.3398 839.444 Q17.1921 839.444 16.9462 838.952 Q16.6592 838.419 16.6592 836.944 L16.6592 794.561 Q16.6592 792.88 17.0282 792.511 Q17.3561 792.101 18.9546 792.265 Z" fill="#000000" fill-rule="nonzero" fill-opacity="1" /><path clip-path="url(#clip580)" d="M78.2212 783.737 Q69.5848 783.737 64.8792 781.556 Q57.8783 778.515 57.8783 771.342 Q57.8783 769.821 58.3086 768.243 Q58.7103 766.636 60.2884 764.628 Q61.8665 762.59 64.4488 761.357 Q69.4413 759.004 78.2212 759.004 Q86.8003 759.004 91.4772 761.185 Q98.306 764.369 98.306 771.399 Q98.306 774.039 96.9574 776.736 Q95.6089 779.404 92.3666 781.097 Q87.5176 783.737 78.2212 783.737 M77.5039 778.859 Q86.3699 778.859 89.8991 778.228 Q93.7152 777.511 95.3793 775.559 Q97.0148 773.58 97.0148 771.399 Q97.0148 769.046 95.2646 767.095 Q93.4856 765.115 89.6695 764.513 Q85.9108 763.853 77.5039 763.882 Q69.3266 763.882 66.0556 764.456 Q62.2395 765.23 60.7188 767.296 Q59.1694 769.333 59.1694 771.399 Q59.1694 772.174 59.399 773.006 Q59.6285 773.809 60.2884 774.986 Q60.9483 776.162 62.5838 777.08 Q64.2193 777.97 66.6868 778.4 Q69.8717 778.859 77.5039 778.859 Z" fill="#000000" fill-rule="nonzero" fill-opacity="1" /><path clip-path="url(#clip580)" d="M93.5551 750.288 Q93.1452 750.288 92.2435 749.96 L13.0522 720.325 Q12.9702 720.325 12.5193 720.12 Q12.0685 719.915 11.7815 719.792 Q11.4536 719.669 11.2077 719.423 Q10.9617 719.136 10.9617 718.808 Q10.9617 717.988 11.9865 717.988 Q12.0685 717.988 13.0522 718.234 L92.3255 747.951 Q93.7601 748.443 94.17 748.771 Q94.5799 749.058 94.5799 749.55 Q94.5799 750.288 93.5551 750.288 Z" fill="#000000" fill-rule="nonzero" fill-opacity="1" /><path clip-path="url(#clip580)" d="M53.0167 658.014 Q53.2627 658.014 54.2054 658.342 L72.3227 664.982 Q73.3884 665.351 73.5934 665.72 Q73.7573 666.089 73.7573 667.605 L73.7573 706.463 Q73.7573 707.406 73.7163 707.775 Q73.6753 708.144 73.4704 708.431 Q73.2654 708.717 72.8146 708.717 Q71.9948 708.717 71.6259 708.431 Q71.257 708.103 71.216 707.734 Q71.175 707.365 71.175 706.463 Q71.175 704.414 71.052 703.184 Q70.9291 701.954 70.7651 701.175 Q70.5602 700.356 69.9863 699.946 Q69.4125 699.495 68.9206 699.29 Q68.3877 699.085 67.199 698.798 L22.1108 687.567 Q20.7582 687.239 20.5532 687.239 Q19.7744 687.239 19.5695 687.731 Q19.3236 688.182 19.2006 689.494 L19.0366 692.691 Q19.0366 693.674 18.9956 694.084 Q18.9546 694.453 18.7497 694.74 Q18.5448 695.027 18.0939 695.027 Q17.3151 695.027 16.9462 694.74 Q16.5363 694.412 16.4953 694.166 Q16.4133 693.879 16.4133 693.428 L16.6592 682.279 L16.4133 669.86 Q16.4133 668.507 17.438 668.507 Q18.5857 668.507 18.8317 669.081 Q19.0366 669.655 19.0366 671.704 Q19.0366 675.639 19.4465 677.443 Q19.8564 679.205 20.5532 679.697 Q21.2091 680.148 22.9716 680.599 L68.3057 691.953 Q69.8223 692.363 70.2322 692.363 Q70.6831 692.363 70.8471 692.158 Q70.97 691.912 71.052 691.256 Q71.175 690.518 71.175 689.412 L71.175 681.542 Q71.175 679.164 70.8061 677.074 Q70.4372 674.983 69.9043 673.385 Q69.3715 671.745 68.3877 670.27 Q67.404 668.794 66.5432 667.769 Q65.6414 666.703 64.2478 665.679 Q62.8132 664.613 61.8294 663.998 Q60.8047 663.342 59.1651 662.605 Q57.4846 661.867 56.5418 661.498 Q55.5581 661.088 53.8775 660.473 Q53.0167 660.104 52.7708 659.981 Q52.5249 659.858 52.3199 659.653 Q52.115 659.407 52.115 659.038 Q52.115 658.547 52.4019 658.301 Q52.6888 658.014 53.0167 658.014 Z" fill="#000000" fill-rule="nonzero" fill-opacity="1" /><path clip-path="url(#clip580)" d="M17.438 603.268 Q18.2168 603.268 18.5857 603.596 Q18.9137 603.924 18.9956 604.293 Q19.0366 604.662 19.0366 605.522 Q19.0366 607.285 19.1596 608.228 Q19.2826 609.17 19.8154 609.744 Q20.3073 610.318 20.7992 610.523 Q21.291 610.687 22.5617 610.974 L61.7475 620.811 Q67.7729 622.328 71.7078 627.821 Q75.6018 633.313 75.6018 639.339 Q75.6018 644.257 73.0195 647.372 Q70.3962 650.447 66.4612 650.447 Q64.4527 650.447 63.0181 649.791 Q61.5835 649.135 60.9277 648.151 Q60.2718 647.168 60.0259 646.348 Q59.739 645.487 59.739 644.79 Q59.739 643.437 60.5998 642.29 Q61.4605 641.101 63.2641 641.101 Q65.2725 641.101 66.9531 642.659 Q68.6337 644.216 68.6337 646.553 Q68.6337 647.331 68.5517 647.577 Q70.5602 646.963 71.8308 645.364 Q73.0605 643.765 73.4294 642.372 Q73.7573 640.937 73.7573 639.584 Q73.7573 636.059 70.3552 632.493 Q66.9531 628.927 61.1736 627.493 L22.6437 617.86 Q21.332 617.532 20.8811 617.532 Q20.0204 617.532 19.7334 618.065 Q19.4055 618.557 19.2006 620.115 Q19.0366 622.205 19.0366 624.992 Q19.0366 625.976 19.0366 626.386 Q18.9956 626.796 18.9137 627.206 Q18.8317 627.616 18.6677 627.739 Q18.4628 627.862 18.0939 627.862 Q17.3151 627.862 16.9462 627.534 Q16.5363 627.206 16.4953 626.919 Q16.4133 626.632 16.4133 626.099 L16.6592 613.761 Q16.6592 612.696 16.5363 609.088 Q16.4133 605.481 16.4133 604.416 Q16.4133 603.268 17.438 603.268 Z" fill="#000000" fill-rule="nonzero" fill-opacity="1" /><polyline clip-path="url(#clip582)" style="stroke:#008000; stroke-linecap:round; stroke-linejoin:round; stroke-width:4; stroke-opacity:1; fill:none" stroke-dasharray="16, 10" points="-1751.13,115.332 4404.7,115.332 "/>
<circle clip-path="url(#clip582)" cx="2312.52" cy="1345.32" r="14.4" fill="#ff0000" fill-rule="evenodd" fill-opacity="1" stroke="#000000" stroke-opacity="1" stroke-width="3.2"/>
<circle clip-path="url(#clip582)" cx="1641.95" cy="634.173" r="14.4" fill="#ff0000" fill-rule="evenodd" fill-opacity="1" stroke="#000000" stroke-opacity="1" stroke-width="3.2"/>
<circle clip-path="url(#clip582)" cx="1306.67" cy="401.762" r="14.4" fill="#ff0000" fill-rule="evenodd" fill-opacity="1" stroke="#000000" stroke-opacity="1" stroke-width="3.2"/>
<circle clip-path="url(#clip582)" cx="1105.5" cy="297.007" r="14.4" fill="#ff0000" fill-rule="evenodd" fill-opacity="1" stroke="#000000" stroke-opacity="1" stroke-width="3.2"/>
<circle clip-path="url(#clip582)" cx="971.382" cy="240.857" r="14.4" fill="#ff0000" fill-rule="evenodd" fill-opacity="1" stroke="#000000" stroke-opacity="1" stroke-width="3.2"/>
<circle clip-path="url(#clip582)" cx="875.586" cy="207.262" r="14.4" fill="#ff0000" fill-rule="evenodd" fill-opacity="1" stroke="#000000" stroke-opacity="1" stroke-width="3.2"/>
<circle clip-path="url(#clip582)" cx="803.739" cy="185.565" r="14.4" fill="#ff0000" fill-rule="evenodd" fill-opacity="1" stroke="#000000" stroke-opacity="1" stroke-width="3.2"/>
<circle clip-path="url(#clip582)" cx="747.859" cy="170.74" r="14.4" fill="#ff0000" fill-rule="evenodd" fill-opacity="1" stroke="#000000" stroke-opacity="1" stroke-width="3.2"/>
<circle clip-path="url(#clip582)" cx="703.154" cy="160.162" r="14.4" fill="#ff0000" fill-rule="evenodd" fill-opacity="1" stroke="#000000" stroke-opacity="1" stroke-width="3.2"/>
<circle clip-path="url(#clip582)" cx="666.577" cy="152.349" r="14.4" fill="#ff0000" fill-rule="evenodd" fill-opacity="1" stroke="#000000" stroke-opacity="1" stroke-width="3.2"/>
<circle clip-path="url(#clip582)" cx="636.097" cy="146.415" r="14.4" fill="#ff0000" fill-rule="evenodd" fill-opacity="1" stroke="#000000" stroke-opacity="1" stroke-width="3.2"/>
<polyline clip-path="url(#clip582)" style="stroke:#ff0000; stroke-linecap:round; stroke-linejoin:round; stroke-width:4; stroke-opacity:1; fill:none" points="2312.52,1345.32 1641.95,634.173 1306.67,401.762 1105.5,297.007 971.382,240.857 875.586,207.262 803.739,185.565 747.859,170.74 703.154,160.162 666.577,152.349 636.097,146.415 "/>
<path clip-path="url(#clip580)" d="M369.21 1364.79 L1167.88 1364.79 L1167.88 1209.27 L369.21 1209.27  Z" fill="#ffffff" fill-rule="evenodd" fill-opacity="1"/>
<polyline clip-path="url(#clip580)" style="stroke:#000000; stroke-linecap:round; stroke-linejoin:round; stroke-width:4; stroke-opacity:1; fill:none" points="369.21,1364.79 1167.88,1364.79 1167.88,1209.27 369.21,1209.27 369.21,1364.79 "/>
<polyline clip-path="url(#clip580)" style="stroke:#008000; stroke-linecap:round; stroke-linejoin:round; stroke-width:6; stroke-opacity:1; fill:none" stroke-dasharray="24, 15" points="392.01,1287.03 528.806,1287.03 "/>
<path clip-path="url(#clip580)" d="M603.779 1257.87 L602.338 1270.31 Q602.233 1271.44 602.057 1271.79 Q601.881 1272.1 601.319 1272.1 Q600.898 1272.1 600.652 1271.86 Q600.441 1271.58 600.441 1271.26 Q600.441 1271.08 600.476 1270.63 Q600.511 1270.17 600.511 1269.96 Q600.827 1267.78 600.827 1266.13 Q600.827 1263.07 599.914 1261.42 Q599 1259.74 596.647 1258.96 Q594.293 1258.15 589.866 1258.15 L579.747 1258.15 Q577.428 1258.15 576.866 1258.58 Q576.339 1259 575.847 1260.97 L571.526 1278.29 L578.307 1278.29 Q580.836 1278.29 582.347 1277.97 Q583.893 1277.65 584.912 1276.78 Q585.966 1275.86 586.528 1274.63 Q587.125 1273.4 587.723 1271.19 Q587.898 1270.45 588.074 1270.17 Q588.285 1269.89 588.741 1269.89 Q589.093 1269.89 589.339 1270.14 Q589.585 1270.35 589.585 1270.66 L585.474 1287.49 Q585.263 1288.33 585.052 1288.65 Q584.842 1288.93 584.42 1288.93 Q583.963 1288.93 583.717 1288.69 Q583.471 1288.44 583.471 1288.16 Q583.471 1287.88 583.682 1287.35 Q584.209 1285.07 584.209 1283.84 Q584.209 1283.14 584.139 1282.78 Q584.104 1282.43 583.788 1281.94 Q583.507 1281.41 582.874 1281.17 Q582.242 1280.92 581.047 1280.75 Q579.853 1280.54 578.061 1280.54 L570.964 1280.54 L566.045 1300.17 Q565.694 1301.47 565.694 1301.83 Q565.694 1302.21 565.869 1302.35 Q566.08 1302.46 566.642 1302.53 Q567.275 1302.63 568.223 1302.63 L578.728 1302.63 Q581.047 1302.63 582.909 1302.42 Q584.771 1302.21 586.317 1301.69 Q587.898 1301.16 589.093 1300.56 Q590.287 1299.96 591.412 1298.87 Q592.536 1297.75 593.309 1296.77 Q594.117 1295.75 595.066 1294.03 Q596.014 1292.3 596.682 1290.9 Q597.349 1289.46 598.368 1287.14 Q598.649 1286.3 599.317 1286.3 Q599.703 1286.3 599.914 1286.51 Q600.125 1286.68 600.16 1286.86 L600.16 1287.07 Q599.949 1287.74 599.809 1288.09 L593.203 1303.62 Q592.817 1304.5 592.501 1304.67 Q592.185 1304.85 590.955 1304.85 L553.608 1304.85 Q552.765 1304.85 552.413 1304.81 Q552.097 1304.78 551.851 1304.6 Q551.605 1304.39 551.605 1303.97 Q551.605 1303.3 551.886 1303.02 Q552.167 1302.7 552.483 1302.67 Q552.8 1302.63 553.608 1302.63 Q555.364 1302.63 556.418 1302.53 Q557.472 1302.42 558.14 1302.28 Q558.843 1302.11 559.194 1301.62 Q559.58 1301.12 559.756 1300.7 Q559.932 1300.25 560.178 1299.23 L569.664 1261.18 Q570.015 1259.88 570.015 1259.45 Q570.015 1259 569.699 1258.72 Q569.418 1258.44 568.645 1258.33 Q567.872 1258.19 567.24 1258.19 Q566.642 1258.15 565.342 1258.15 Q564.499 1258.15 564.148 1258.12 Q563.832 1258.08 563.586 1257.91 Q563.34 1257.73 563.34 1257.35 Q563.34 1256.36 563.761 1256.15 Q564.218 1255.91 565.483 1255.91 L601.811 1255.91 Q603.252 1255.91 603.568 1256.22 Q603.919 1256.5 603.779 1257.87 Z" fill="#000000" fill-rule="nonzero" fill-opacity="1" /><path clip-path="url(#clip580)" d="M655.76 1307.2 Q655.76 1310.2 654.579 1312.81 Q653.423 1315.39 651.161 1317.01 Q648.923 1318.64 646.094 1318.64 Q641.717 1318.64 637.536 1315.14 Q636.7 1314.43 636.109 1313.77 Q635.519 1313.1 633.011 1310.05 Q632.592 1310.77 632.15 1311.43 Q631.707 1312.07 630.453 1313.52 Q629.199 1314.97 627.895 1315.98 Q626.616 1316.99 624.624 1317.83 Q622.657 1318.64 620.615 1318.64 Q618.451 1318.64 616.607 1317.65 Q614.787 1316.64 613.582 1315.05 Q612.401 1313.42 611.737 1311.41 Q611.098 1309.36 611.098 1307.25 Q611.098 1304.25 612.254 1301.67 Q613.434 1299.06 615.672 1297.44 Q617.935 1295.81 620.763 1295.81 Q625.165 1295.81 629.321 1299.28 Q630.158 1299.99 630.748 1300.66 Q631.338 1301.32 633.847 1304.37 Q634.166 1303.83 634.511 1303.34 Q634.855 1302.82 635.716 1301.69 Q636.577 1300.56 637.585 1299.65 Q638.618 1298.74 639.921 1297.81 Q641.225 1296.87 642.873 1296.35 Q644.52 1295.81 646.242 1295.81 Q648.406 1295.81 650.226 1296.82 Q652.071 1297.81 653.251 1299.43 Q654.456 1301.03 655.096 1303.07 Q655.76 1305.09 655.76 1307.2 M654.653 1307.2 Q654.653 1305.45 654.136 1303.76 Q653.62 1302.06 652.636 1300.63 Q651.677 1299.18 650.103 1298.3 Q648.529 1297.41 646.611 1297.41 Q644.594 1297.41 642.725 1298.27 Q640.88 1299.11 639.429 1300.54 Q638.003 1301.96 637.019 1303.29 Q636.036 1304.62 635.175 1306.14 Q635.617 1306.68 637.511 1309.19 Q639.429 1311.7 640.241 1312.59 Q643.561 1316.2 646.906 1316.2 Q650.103 1316.2 652.366 1313.6 Q654.653 1310.96 654.653 1307.2 M631.682 1308.31 Q631.264 1307.79 629.321 1305.28 Q627.403 1302.75 626.592 1301.86 Q623.247 1298.22 619.951 1298.22 Q616.754 1298.22 614.467 1300.86 Q612.204 1303.49 612.204 1307.25 Q612.204 1309 612.721 1310.69 Q613.237 1312.39 614.196 1313.82 Q615.18 1315.24 616.754 1316.13 Q618.328 1317.01 620.246 1317.01 Q621.87 1317.01 623.419 1316.42 Q624.993 1315.83 626.174 1314.95 Q627.354 1314.06 628.461 1312.83 Q629.567 1311.6 630.281 1310.55 Q631.018 1309.49 631.682 1308.31 Z" fill="#000000" fill-rule="nonzero" fill-opacity="1" /><path clip-path="url(#clip580)" d="M668.664 1321.82 Q668.664 1321.47 668.945 1320.69 L694.346 1252.81 Q694.346 1252.74 694.522 1252.36 Q694.698 1251.97 694.803 1251.73 Q694.908 1251.44 695.119 1251.23 Q695.365 1251.02 695.646 1251.02 Q696.349 1251.02 696.349 1251.9 Q696.349 1251.97 696.138 1252.81 L670.666 1320.76 Q670.245 1321.99 669.964 1322.34 Q669.718 1322.7 669.296 1322.7 Q668.664 1322.7 668.664 1321.82 Z" fill="#000000" fill-rule="nonzero" fill-opacity="1" /><path clip-path="url(#clip580)" d="M747.757 1287.07 Q747.757 1287.28 747.476 1288.09 L741.784 1303.62 Q741.468 1304.53 741.152 1304.71 Q740.835 1304.85 739.535 1304.85 L706.229 1304.85 Q705.421 1304.85 705.104 1304.81 Q704.788 1304.78 704.542 1304.6 Q704.296 1304.43 704.296 1304.04 Q704.296 1303.34 704.542 1303.02 Q704.823 1302.7 705.14 1302.67 Q705.456 1302.63 706.229 1302.63 Q707.985 1302.63 709.039 1302.53 Q710.093 1302.42 710.761 1302.28 Q711.464 1302.11 711.815 1301.62 Q712.201 1301.12 712.377 1300.7 Q712.553 1300.25 712.799 1299.23 L722.425 1260.58 Q722.706 1259.42 722.706 1259.24 Q722.706 1258.58 722.285 1258.4 Q721.898 1258.19 720.774 1258.08 L718.034 1257.94 Q717.19 1257.94 716.839 1257.91 Q716.523 1257.87 716.277 1257.7 Q716.031 1257.52 716.031 1257.14 Q716.031 1256.47 716.277 1256.15 Q716.558 1255.8 716.769 1255.77 Q717.015 1255.7 717.401 1255.7 L726.958 1255.91 L737.603 1255.7 Q738.763 1255.7 738.763 1256.57 Q738.763 1257.56 738.271 1257.77 Q737.779 1257.94 736.022 1257.94 Q732.649 1257.94 731.103 1258.3 Q729.593 1258.65 729.171 1259.24 Q728.785 1259.81 728.398 1261.32 L718.666 1300.17 Q718.315 1301.47 718.315 1301.83 Q718.315 1302.21 718.49 1302.35 Q718.701 1302.46 719.263 1302.53 Q719.896 1302.63 720.844 1302.63 L727.59 1302.63 Q729.628 1302.63 731.42 1302.32 Q733.211 1302 734.582 1301.55 Q735.987 1301.09 737.252 1300.25 Q738.517 1299.4 739.395 1298.66 Q740.308 1297.89 741.187 1296.7 Q742.1 1295.47 742.627 1294.62 Q743.189 1293.75 743.822 1292.34 Q744.454 1290.9 744.77 1290.09 Q745.122 1289.25 745.649 1287.81 Q745.965 1287.07 746.07 1286.86 Q746.176 1286.65 746.351 1286.47 Q746.562 1286.3 746.878 1286.3 Q747.3 1286.3 747.511 1286.54 Q747.757 1286.79 747.757 1287.07 Z" fill="#000000" fill-rule="nonzero" fill-opacity="1" /><path clip-path="url(#clip580)" d="M794.683 1256.57 Q794.683 1257.24 794.402 1257.56 Q794.121 1257.84 793.805 1257.91 Q793.489 1257.94 792.751 1257.94 Q791.24 1257.94 790.432 1258.05 Q789.624 1258.15 789.132 1258.61 Q788.64 1259.03 788.465 1259.45 Q788.324 1259.88 788.078 1260.97 L779.646 1294.55 Q778.346 1299.72 773.638 1303.09 Q768.93 1306.43 763.766 1306.43 Q759.55 1306.43 756.879 1304.22 Q754.244 1301.97 754.244 1298.59 Q754.244 1296.87 754.806 1295.64 Q755.369 1294.41 756.212 1293.85 Q757.055 1293.29 757.758 1293.08 Q758.496 1292.83 759.093 1292.83 Q760.252 1292.83 761.236 1293.57 Q762.255 1294.31 762.255 1295.85 Q762.255 1297.57 760.92 1299.02 Q759.585 1300.46 757.582 1300.46 Q756.915 1300.46 756.704 1300.39 Q757.231 1302.11 758.601 1303.2 Q759.971 1304.25 761.166 1304.57 Q762.395 1304.85 763.555 1304.85 Q766.576 1304.85 769.633 1301.93 Q772.69 1299.02 773.919 1294.06 L782.176 1261.04 Q782.457 1259.91 782.457 1259.53 Q782.457 1258.79 782 1258.54 Q781.578 1258.26 780.243 1258.08 Q778.451 1257.94 776.062 1257.94 Q775.219 1257.94 774.868 1257.94 Q774.516 1257.91 774.165 1257.84 Q773.814 1257.77 773.708 1257.63 Q773.603 1257.45 773.603 1257.14 Q773.603 1256.47 773.884 1256.15 Q774.165 1255.8 774.411 1255.77 Q774.657 1255.7 775.114 1255.7 L785.689 1255.91 Q786.602 1255.91 789.694 1255.8 Q792.786 1255.7 793.699 1255.7 Q794.683 1255.7 794.683 1256.57 Z" fill="#000000" fill-rule="nonzero" fill-opacity="1" /><path clip-path="url(#clip580)" d="M813.736 1293.92 Q813.806 1293.04 815.177 1293.04 L859.269 1293.04 Q861.342 1293.04 861.377 1293.85 Q861.377 1294.73 859.41 1294.69 L815.668 1294.69 Q813.736 1294.73 813.736 1293.92 M813.736 1279.87 Q813.736 1278.99 815.247 1279.02 L859.199 1279.02 Q861.342 1279.02 861.377 1279.87 Q861.377 1280.68 859.55 1280.68 L815.177 1280.68 Q813.736 1280.68 813.736 1279.87 Z" fill="#000000" fill-rule="nonzero" fill-opacity="1" /><path clip-path="url(#clip580)" d="M956.593 1285.84 Q957.014 1286.26 957.014 1286.86 Q957.014 1287.46 956.593 1287.88 Q956.171 1288.3 955.574 1288.3 L910.532 1288.3 Q909.935 1288.3 909.514 1287.88 Q909.092 1287.46 909.092 1286.86 Q909.092 1286.26 909.514 1285.84 Q909.935 1285.42 910.532 1285.42 L955.574 1285.42 Q956.171 1285.42 956.593 1285.84 Z" fill="#000000" fill-rule="nonzero" fill-opacity="1" /><path clip-path="url(#clip580)" d="M984.486 1281.84 Q984.486 1271.26 987.156 1265.5 Q990.881 1256.93 999.664 1256.93 Q1001.53 1256.93 1003.46 1257.45 Q1005.43 1257.94 1007.89 1259.88 Q1010.38 1261.81 1011.89 1264.97 Q1014.77 1271.08 1014.77 1281.84 Q1014.77 1292.34 1012.1 1298.07 Q1008.2 1306.43 999.594 1306.43 Q996.361 1306.43 993.059 1304.78 Q989.791 1303.13 987.719 1299.16 Q984.486 1293.22 984.486 1281.84 M990.459 1280.96 Q990.459 1291.81 991.232 1296.13 Q992.11 1300.81 994.499 1302.85 Q996.924 1304.85 999.594 1304.85 Q1002.47 1304.85 1004.86 1302.7 Q1007.29 1300.53 1008.03 1295.85 Q1008.83 1291.25 1008.8 1280.96 Q1008.8 1270.94 1008.1 1266.94 Q1007.15 1262.27 1004.62 1260.4 Q1002.12 1258.51 999.594 1258.51 Q998.645 1258.51 997.626 1258.79 Q996.643 1259.07 995.202 1259.88 Q993.762 1260.68 992.637 1262.69 Q991.548 1264.69 991.021 1267.71 Q990.459 1271.61 990.459 1280.96 Z" fill="#000000" fill-rule="nonzero" fill-opacity="1" /><path clip-path="url(#clip580)" d="M1021.21 1303.69 Q1020.12 1302.53 1020.12 1301.02 Q1020.12 1299.51 1021.21 1298.42 Q1022.3 1297.29 1023.95 1297.29 Q1025.53 1297.29 1026.58 1298.35 Q1027.67 1299.37 1027.67 1301.05 Q1027.67 1302.7 1026.51 1303.79 Q1025.39 1304.85 1023.95 1304.85 Q1022.3 1304.85 1021.21 1303.69 Z" fill="#000000" fill-rule="nonzero" fill-opacity="1" /><path clip-path="url(#clip580)" d="M1039.92 1292.97 L1039.92 1290.76 L1062.02 1257 Q1062.58 1256.12 1063.46 1256.15 Q1064.27 1256.15 1064.44 1256.47 Q1064.62 1256.78 1064.62 1258.01 L1064.62 1290.76 L1071.82 1290.76 L1071.82 1292.97 L1064.62 1292.97 L1064.62 1299.23 Q1064.62 1301.3 1065.46 1301.97 Q1066.34 1302.63 1070.06 1302.63 L1071.57 1302.63 L1071.57 1304.85 Q1068.62 1304.64 1061.81 1304.64 Q1055.03 1304.64 1052.08 1304.85 L1052.08 1302.63 L1053.59 1302.63 Q1057.31 1302.63 1058.19 1302 Q1059.07 1301.33 1059.07 1299.23 L1059.07 1292.97 L1039.92 1292.97 M1041.96 1290.76 L1059.49 1290.76 L1059.49 1263.92 L1041.96 1290.76 Z" fill="#000000" fill-rule="nonzero" fill-opacity="1" /><path clip-path="url(#clip580)" d="M1072.09 1292.97 L1072.09 1290.76 L1094.19 1257 Q1094.75 1256.12 1095.63 1256.15 Q1096.44 1256.15 1096.61 1256.47 Q1096.79 1256.78 1096.79 1258.01 L1096.79 1290.76 L1103.99 1290.76 L1103.99 1292.97 L1096.79 1292.97 L1096.79 1299.23 Q1096.79 1301.3 1097.63 1301.97 Q1098.51 1302.63 1102.23 1302.63 L1103.75 1302.63 L1103.75 1304.85 Q1100.79 1304.64 1093.98 1304.64 Q1087.2 1304.64 1084.25 1304.85 L1084.25 1302.63 L1085.76 1302.63 Q1089.48 1302.63 1090.36 1302 Q1091.24 1301.33 1091.24 1299.23 L1091.24 1292.97 L1072.09 1292.97 M1074.13 1290.76 L1091.66 1290.76 L1091.66 1263.92 L1074.13 1290.76 Z" fill="#000000" fill-rule="nonzero" fill-opacity="1" /><path clip-path="url(#clip580)" d="M1109.45 1295.15 Q1109.45 1293.01 1110.68 1291.99 Q1111.91 1290.97 1113.49 1290.97 Q1115.14 1290.97 1116.3 1292.06 Q1117.5 1293.11 1117.5 1294.98 Q1117.5 1296.98 1116.09 1298.1 Q1114.72 1299.23 1112.75 1298.95 Q1114.47 1301.83 1117.64 1303.13 Q1120.83 1304.43 1123.79 1304.43 Q1126.88 1304.43 1129.37 1301.76 Q1131.9 1299.09 1131.9 1292.55 Q1131.9 1287 1129.72 1283.8 Q1127.58 1280.61 1123.33 1280.61 L1120.17 1280.61 Q1119.08 1280.61 1118.76 1280.5 Q1118.44 1280.39 1118.44 1279.8 Q1118.44 1279.09 1119.53 1278.95 Q1120.62 1278.95 1122.34 1278.74 Q1126.53 1278.6 1128.74 1274.98 Q1130.74 1271.61 1130.74 1266.8 Q1130.74 1262.41 1128.63 1260.58 Q1126.56 1258.72 1123.86 1258.72 Q1121.33 1258.72 1118.55 1259.77 Q1115.77 1260.83 1114.26 1263.18 Q1118.73 1263.18 1118.73 1266.8 Q1118.73 1268.38 1117.71 1269.43 Q1116.72 1270.45 1115.07 1270.45 Q1113.49 1270.45 1112.44 1269.47 Q1111.38 1268.45 1111.38 1266.73 Q1111.38 1262.62 1115.04 1259.77 Q1118.73 1256.93 1124.14 1256.93 Q1129.48 1256.93 1133.41 1259.74 Q1137.38 1262.55 1137.38 1266.87 Q1137.38 1271.12 1134.57 1274.6 Q1131.76 1278.08 1127.3 1279.52 Q1132.78 1280.61 1136.05 1284.33 Q1139.31 1288.02 1139.31 1292.55 Q1139.31 1298.17 1134.89 1302.32 Q1130.46 1306.43 1124 1306.43 Q1118.02 1306.43 1113.74 1303.2 Q1109.45 1299.96 1109.45 1295.15 Z" fill="#000000" fill-rule="nonzero" fill-opacity="1" /></svg>
