#Current [mA],Temperature [ºC],Intensity [mW]
590,37.5,112
570,37.1,109
550,37.0,101
530,37.5,94.7
510,37.3,91.5
490,37.4,81.6
470,38.4,72.5
450,37.3,66
430,37.6,59.3
410,37.5,50.8
390,37.8,45.5
370,38.3,39.8
350,38.5,33.7
330,38.5,28.2
310,38.7,22.9
290,38.6,18.5
270,38.8,12.8
250,39.1,8.9
230,40.1,4.2
210,40.6,0.8
190,NaN,0