\relax 
\citation{Hanslmayr2008}
\bibstyle{unsrt}
\bibdata{sample}
\bibcite{Hanslmayr2008}{1}
\pgfsyspdfmark {pgfid1}{1780200}{797160}
\@writefile{lof}{\contentsline {figure}{\numberline {1}{\ignorespaces Gratton Effect\relax }}{2}}
\@writefile{lot}{\contentsline {table}{\numberline {1}{\ignorespaces Behavioral Results of Main Stroop Phase\relax }}{2}}
\@writefile{lof}{\contentsline {figure}{\numberline {2}{\ignorespaces Stroop Effect\relax }}{2}}
\@writefile{lof}{\contentsline {figure}{\numberline {3}{\ignorespaces Gratton Effect\relax }}{2}}
