best_paramset_1 = [194.36020474399999, 0.78011232392600005, 47.622390483499998, 6.6730176655799998, 66.109132063700002, 378.73591011299999, -361.11562151099997]
best_paramset_statistic_1 = 4.3937927763
best_paramset_2 = [141.18056980099999, 0.68215220992600001, 40.1462275186, 4.9254402444699998, 83.705995326999997, 421.77503218099997, -8.7818576510300002]
best_paramset_statistic_2 = 4.80258113821
ID = "Tarana_propersims_23"