congruent,corrAns,letterColor,signal,selectedrownumber_novariable,Anzeigetext,practice.thisRepN,practice.thisTrialN,practice.thisN,practice.thisIndex,Wrongresponse.thisRepN,Wrongresponse.thisTrialN,Wrongresponse.thisN,Wrongresponse.thisIndex,trials.thisRepN,trials.thisTrialN,trials.thisN,trials.thisIndex,resp.keys,resp.corr,resp.rt,date,frameRate,expName,session,participant,
congruent,left,"[0.568627451, -0.7882352941, -0.7882352941]", ,0,ROT,0,0,0,0,0,0,0,0,,,,,left,1,0.587067909469,2017_Jun_01_1216,98.8183085567,Stroop,B-1,1STACS-6,
,,,,,,0,0,0,0,,,,,,,,,,,,2017_Jun_01_1216,98.8183085567,Stroop,B-1,1STACS-6,
neutral,right,"[-0.8745098039, -0.2078431373, 0.637254902]", ,14,SOLL,1,0,1,0,0,0,0,0,,,,,down,0,0.49125936397,2017_Jun_01_1216,98.8183085567,Stroop,B-1,1STACS-6,
,,,,,,1,0,1,0,,,,,,,,,,,,2017_Jun_01_1216,98.8183085567,Stroop,B-1,1STACS-6,
neutral,right,"[-0.8745098039, -0.2078431373, 0.637254902]", ,14,SOLL,2,0,2,0,0,0,0,0,,,,,right,1,0.481374867476,2017_Jun_01_1216,98.8183085567,Stroop,B-1,1STACS-6,
,,,,,,2,0,2,0,,,,,,,,,,,,2017_Jun_01_1216,98.8183085567,Stroop,B-1,1STACS-6,
neutralofneutral,down,"[-0.7725490196, 0.0745098039, -1]", ,16,HALS,3,0,3,0,0,0,0,0,,,,,down,1,0.526202631899,2017_Jun_01_1216,98.8183085567,Stroop,B-1,1STACS-6,
,,,,,,3,0,3,0,,,,,,,,,,,,2017_Jun_01_1216,98.8183085567,Stroop,B-1,1STACS-6,
incongruent,left,"[0.568627451, -0.7882352941, -0.7882352941]", ,6,BLAU,4,0,4,0,0,0,0,0,,,,,left,1,0.934187724976,2017_Jun_01_1216,98.8183085567,Stroop,B-1,1STACS-6,
,,,,,,4,0,4,0,,,,,,,,,,,,2017_Jun_01_1216,98.8183085567,Stroop,B-1,1STACS-6,
incongruent,right,"[-0.8745098039, -0.2078431373, 0.637254902]", ,2,ROT,5,0,5,0,0,0,0,0,,,,,right,1,0.773160555322,2017_Jun_01_1216,98.8183085567,Stroop,B-1,1STACS-6,
,,,,,,5,0,5,0,,,,,,,,,,,,2017_Jun_01_1216,98.8183085567,Stroop,B-1,1STACS-6,
incongruent,right,"[-0.8745098039, -0.2078431373, 0.637254902]", ,5,GRÜN,6,0,6,0,0,0,0,0,,,,,right,1,0.773984123681,2017_Jun_01_1216,98.8183085567,Stroop,B-1,1STACS-6,
,,,,,,6,0,6,0,,,,,,,,,,,,2017_Jun_01_1216,98.8183085567,Stroop,B-1,1STACS-6,
neutral,down,"[-0.7725490196, 0.0745098039, -1]", ,13,SOLL,7,0,7,0,0,0,0,0,,,,,down,1,0.677135501859,2017_Jun_01_1216,98.8183085567,Stroop,B-1,1STACS-6,
,,,,,,7,0,7,0,,,,,,,,,,,,2017_Jun_01_1216,98.8183085567,Stroop,B-1,1STACS-6,
neutralofneutral,down,"[-0.7725490196, 0.0745098039, -1]", ,19,MODE,8,0,8,0,0,0,0,0,,,,,down,1,0.594462983424,2017_Jun_01_1216,98.8183085567,Stroop,B-1,1STACS-6,
,,,,,,8,0,8,0,,,,,,,,,,,,2017_Jun_01_1216,98.8183085567,Stroop,B-1,1STACS-6,
incongruent,down,"[-0.7725490196, 0.0745098039, -1]", ,1,ROT,9,0,9,0,0,0,0,0,,,,,down,1,0.567079056137,2017_Jun_01_1216,98.8183085567,Stroop,B-1,1STACS-6,
,,,,,,9,0,9,0,,,,,,,,,,,,2017_Jun_01_1216,98.8183085567,Stroop,B-1,1STACS-6,
neutral,left,"[0.568627451, -0.7882352941, -0.7882352941]", ,12,SOLL,10,0,10,0,0,0,0,0,,,,,left,1,0.844781389814,2017_Jun_01_1216,98.8183085567,Stroop,B-1,1STACS-6,
,,,,,,10,0,10,0,,,,,,,,,,,,2017_Jun_01_1216,98.8183085567,Stroop,B-1,1STACS-6,
neutralofneutral,right,"[-0.8745098039, -0.2078431373, 0.637254902]", ,17,HALS,11,0,11,0,0,0,0,0,,,,,right,1,0.438519141399,2017_Jun_01_1216,98.8183085567,Stroop,B-1,1STACS-6,
,,,,,,11,0,11,0,,,,,,,,,,,,2017_Jun_01_1216,98.8183085567,Stroop,B-1,1STACS-6,
incongruent,down,"[-0.7725490196, 0.0745098039, -1]", ,7,BLAU,12,0,12,0,0,0,0,0,,,,,down,1,0.923682758563,2017_Jun_01_1216,98.8183085567,Stroop,B-1,1STACS-6,
,,,,,,12,0,12,0,,,,,,,,,,,,2017_Jun_01_1216,98.8183085567,Stroop,B-1,1STACS-6,
neutral,right,"[-0.8745098039, -0.2078431373, 0.637254902]", ,14,SOLL,13,0,13,0,0,0,0,0,,,,,right,1,0.753154101988,2017_Jun_01_1216,98.8183085567,Stroop,B-1,1STACS-6,
,,,,,,13,0,13,0,,,,,,,,,,,,2017_Jun_01_1216,98.8183085567,Stroop,B-1,1STACS-6,
incongruent,right,"[-0.8745098039, -0.2078431373, 0.637254902]", ,2,ROT,14,0,14,0,0,0,0,0,,,,,right,1,0.601432025579,2017_Jun_01_1216,98.8183085567,Stroop,B-1,1STACS-6,
,,,,,,14,0,14,0,,,,,,,,,,,,2017_Jun_01_1216,98.8183085567,Stroop,B-1,1STACS-6,
neutral,right,"[-0.8745098039, -0.2078431373, 0.637254902]", ,11,PECH,15,0,15,0,0,0,0,0,,,,,right,1,0.559114077348,2017_Jun_01_1216,98.8183085567,Stroop,B-1,1STACS-6,
,,,,,,15,0,15,0,,,,,,,,,,,,2017_Jun_01_1216,98.8183085567,Stroop,B-1,1STACS-6,
incongruent,down,"[-0.7725490196, 0.0745098039, -1]", ,7,BLAU,16,0,16,0,0,0,0,0,,,,,down,1,0.708571899501,2017_Jun_01_1216,98.8183085567,Stroop,B-1,1STACS-6,
,,,,,,16,0,16,0,,,,,,,,,,,,2017_Jun_01_1216,98.8183085567,Stroop,B-1,1STACS-6,
neutralofneutral,down,"[-0.7725490196, 0.0745098039, -1]", ,19,MODE,17,0,17,0,0,0,0,0,,,,,down,1,0.615540801974,2017_Jun_01_1216,98.8183085567,Stroop,B-1,1STACS-6,
,,,,,,17,0,17,0,,,,,,,,,,,,2017_Jun_01_1216,98.8183085567,Stroop,B-1,1STACS-6,
congruent,down,"[-0.7725490196, 0.0745098039, -1]", ,4,GRÜN,18,0,18,0,0,0,0,0,,,,,down,1,0.558410915354,2017_Jun_01_1216,98.8183085567,Stroop,B-1,1STACS-6,
,,,,,,18,0,18,0,,,,,,,,,,,,2017_Jun_01_1216,98.8183085567,Stroop,B-1,1STACS-6,
congruent,down,"[-0.7725490196, 0.0745098039, -1]", ,4,GRÜN,19,0,19,0,0,0,0,0,,,,,down,1,0.502453803486,2017_Jun_01_1216,98.8183085567,Stroop,B-1,1STACS-6,
,,,,,,19,0,19,0,,,,,,,,,,,,2017_Jun_01_1216,98.8183085567,Stroop,B-1,1STACS-6,
neutral,down,"[-0.7725490196, 0.0745098039, -1]", ,13,SOLL,20,0,20,0,0,0,0,0,,,,,down,1,0.635114518745,2017_Jun_01_1216,98.8183085567,Stroop,B-1,1STACS-6,
,,,,,,20,0,20,0,,,,,,,,,,,,2017_Jun_01_1216,98.8183085567,Stroop,B-1,1STACS-6,
neutral,left,"[0.568627451, -0.7882352941, -0.7882352941]", ,9,PECH,21,0,21,0,0,0,0,0,,,,,left,1,0.63308465182,2017_Jun_01_1216,98.8183085567,Stroop,B-1,1STACS-6,
,,,,,,21,0,21,0,,,,,,,,,,,,2017_Jun_01_1216,98.8183085567,Stroop,B-1,1STACS-6,
neutral,down,"[-0.7725490196, 0.0745098039, -1]", ,13,SOLL,22,0,22,0,0,0,0,0,,,,,down,1,0.688046665149,2017_Jun_01_1216,98.8183085567,Stroop,B-1,1STACS-6,
,,,,,,22,0,22,0,,,,,,,,,,,,2017_Jun_01_1216,98.8183085567,Stroop,B-1,1STACS-6,
neutral,right,"[-0.8745098039, -0.2078431373, 0.637254902]", ,14,SOLL,23,0,23,0,0,0,0,0,,,,,right,1,0.387666868275,2017_Jun_01_1216,98.8183085567,Stroop,B-1,1STACS-6,
,,,,,,23,0,23,0,,,,,,,,,,,,2017_Jun_01_1216,98.8183085567,Stroop,B-1,1STACS-6,
neutral,right,"[-0.8745098039, -0.2078431373, 0.637254902]", ,11,PECH,24,0,24,0,0,0,0,0,,,,,right,1,0.623356599791,2017_Jun_01_1216,98.8183085567,Stroop,B-1,1STACS-6,
,,,,,,24,0,24,0,,,,,,,,,,,,2017_Jun_01_1216,98.8183085567,Stroop,B-1,1STACS-6,
neutral,left,"[0.568627451, -0.7882352941, -0.7882352941]", ,12,SOLL,25,0,25,0,0,0,0,0,,,,,left,1,0.505387137192,2017_Jun_01_1216,98.8183085567,Stroop,B-1,1STACS-6,
,,,,,,25,0,25,0,,,,,,,,,,,,2017_Jun_01_1216,98.8183085567,Stroop,B-1,1STACS-6,
neutral,down,"[-0.7725490196, 0.0745098039, -1]", ,13,SOLL,26,0,26,0,0,0,0,0,,,,,down,1,0.547919358466,2017_Jun_01_1216,98.8183085567,Stroop,B-1,1STACS-6,
,,,,,,26,0,26,0,,,,,,,,,,,,2017_Jun_01_1216,98.8183085567,Stroop,B-1,1STACS-6,
congruent,down,"[-0.7725490196, 0.0745098039, -1]", ,4,GRÜN,27,0,27,0,0,0,0,0,,,,,down,1,0.58030894988,2017_Jun_01_1216,98.8183085567,Stroop,B-1,1STACS-6,
,,,,,,27,0,27,0,,,,,,,,,,,,2017_Jun_01_1216,98.8183085567,Stroop,B-1,1STACS-6,
incongruent,down,"[-0.7725490196, 0.0745098039, -1]", ,7,BLAU,28,0,28,0,0,0,0,0,,,,,down,1,0.973191564849,2017_Jun_01_1216,98.8183085567,Stroop,B-1,1STACS-6,
,,,,,,28,0,28,0,,,,,,,,,,,,2017_Jun_01_1216,98.8183085567,Stroop,B-1,1STACS-6,
neutral,right,"[-0.8745098039, -0.2078431373, 0.637254902]", ,11,PECH,29,0,29,0,0,0,0,0,,,,,right,1,0.631500930984,2017_Jun_01_1216,98.8183085567,Stroop,B-1,1STACS-6,
,,,,,,29,0,29,0,,,,,,,,,,,,2017_Jun_01_1216,98.8183085567,Stroop,B-1,1STACS-6,
incongruent,right,"[-0.8745098039, -0.2078431373, 0.637254902]", ,2,ROT,30,0,30,0,0,0,0,0,,,,,right,1,0.834136182113,2017_Jun_01_1216,98.8183085567,Stroop,B-1,1STACS-6,
,,,,,,30,0,30,0,,,,,,,,,,,,2017_Jun_01_1216,98.8183085567,Stroop,B-1,1STACS-6,
congruent,down,"[-0.7725490196, 0.0745098039, -1]", ,4,GRÜN,31,0,31,0,0,0,0,0,,,,,down,1,0.526357120807,2017_Jun_01_1216,98.8183085567,Stroop,B-1,1STACS-6,
,,,,,,31,0,31,0,,,,,,,,,,,,2017_Jun_01_1216,98.8183085567,Stroop,B-1,1STACS-6,
neutral,down,"[-0.7725490196, 0.0745098039, -1]", ,13,SOLL,32,0,32,0,0,0,0,0,,,,,down,1,0.527324841565,2017_Jun_01_1216,98.8183085567,Stroop,B-1,1STACS-6,
,,,,,,32,0,32,0,,,,,,,,,,,,2017_Jun_01_1216,98.8183085567,Stroop,B-1,1STACS-6,
neutralofneutral,left,"[0.568627451, -0.7882352941, -0.7882352941]", ,18,MODE,33,0,33,0,0,0,0,0,,,,,left,1,0.636918379291,2017_Jun_01_1216,98.8183085567,Stroop,B-1,1STACS-6,
,,,,,,33,0,33,0,,,,,,,,,,,,2017_Jun_01_1216,98.8183085567,Stroop,B-1,1STACS-6,
incongruent,down,"[-0.7725490196, 0.0745098039, -1]", ,1,ROT,34,0,34,0,0,0,0,0,,,,,down,1,0.741423560816,2017_Jun_01_1216,98.8183085567,Stroop,B-1,1STACS-6,
,,,,,,34,0,34,0,,,,,,,,,,,,2017_Jun_01_1216,98.8183085567,Stroop,B-1,1STACS-6,
congruent,left,"[0.568627451, -0.7882352941, -0.7882352941]", ,0,ROT,35,0,35,0,0,0,0,0,,,,,left,1,0.633144994685,2017_Jun_01_1216,98.8183085567,Stroop,B-1,1STACS-6,
,,,,,,35,0,35,0,,,,,,,,,,,,2017_Jun_01_1216,98.8183085567,Stroop,B-1,1STACS-6,
neutralofneutral,down,"[-0.7725490196, 0.0745098039, -1]", ,19,MODE,36,0,36,0,0,0,0,0,,,,,down,1,0.618370770587,2017_Jun_01_1216,98.8183085567,Stroop,B-1,1STACS-6,
,,,,,,36,0,36,0,,,,,,,,,,,,2017_Jun_01_1216,98.8183085567,Stroop,B-1,1STACS-6,
incongruent,right,"[-0.8745098039, -0.2078431373, 0.637254902]", ,5,GRÜN,37,0,37,0,0,0,0,0,,,,,right,1,0.655616007062,2017_Jun_01_1216,98.8183085567,Stroop,B-1,1STACS-6,
,,,,,,37,0,37,0,,,,,,,,,,,,2017_Jun_01_1216,98.8183085567,Stroop,B-1,1STACS-6,
congruent,down,"[-0.7725490196, 0.0745098039, -1]", ,4,GRÜN,38,0,38,0,0,0,0,0,,,,,down,1,0.566585697344,2017_Jun_01_1216,98.8183085567,Stroop,B-1,1STACS-6,
,,,,,,38,0,38,0,,,,,,,,,,,,2017_Jun_01_1216,98.8183085567,Stroop,B-1,1STACS-6,
incongruent,left,"[0.568627451, -0.7882352941, -0.7882352941]", ,6,BLAU,39,0,39,0,0,0,0,0,,,,,left,1,1.13452100756,2017_Jun_01_1216,98.8183085567,Stroop,B-1,1STACS-6,
,,,,,,39,0,39,0,,,,,,,,,,,,2017_Jun_01_1216,98.8183085567,Stroop,B-1,1STACS-6,
neutralofneutral,left,"[0.568627451, -0.7882352941, -0.7882352941]", ,18,MODE,40,0,40,0,0,0,0,0,,,,,left,1,0.687459439677,2017_Jun_01_1216,98.8183085567,Stroop,B-1,1STACS-6,
,,,,,,40,0,40,0,,,,,,,,,,,,2017_Jun_01_1216,98.8183085567,Stroop,B-1,1STACS-6,
incongruent,right,"[-0.8745098039, -0.2078431373, 0.637254902]", ,5,GRÜN,41,0,41,0,0,0,0,0,,,,,right,1,0.987749280984,2017_Jun_01_1216,98.8183085567,Stroop,B-1,1STACS-6,
,,,,,,41,0,41,0,,,,,,,,,,,,2017_Jun_01_1216,98.8183085567,Stroop,B-1,1STACS-6,
neutral,down,"[-0.7725490196, 0.0745098039, -1]", ,10,PECH,42,0,42,0,0,0,0,0,,,,,down,1,0.806779911972,2017_Jun_01_1216,98.8183085567,Stroop,B-1,1STACS-6,
,,,,,,42,0,42,0,,,,,,,,,,,,2017_Jun_01_1216,98.8183085567,Stroop,B-1,1STACS-6,
neutral,right,"[-0.8745098039, -0.2078431373, 0.637254902]", ,14,SOLL,43,0,43,0,0,0,0,0,,,,,right,1,0.79554971372,2017_Jun_01_1216,98.8183085567,Stroop,B-1,1STACS-6,
,,,,,,43,0,43,0,,,,,,,,,,,,2017_Jun_01_1216,98.8183085567,Stroop,B-1,1STACS-6,
incongruent,right,"[-0.8745098039, -0.2078431373, 0.637254902]", ,5,GRÜN,44,0,44,0,0,0,0,0,,,,,right,1,1.36903712623,2017_Jun_01_1216,98.8183085567,Stroop,B-1,1STACS-6,
,,,,,,44,0,44,0,,,,,,,,,,,,2017_Jun_01_1216,98.8183085567,Stroop,B-1,1STACS-6,
incongruent,down,"[-0.7725490196, 0.0745098039, -1]", ,7,BLAU,45,0,45,0,0,0,0,0,,,,,down,1,0.924408549131,2017_Jun_01_1216,98.8183085567,Stroop,B-1,1STACS-6,
,,,,,,45,0,45,0,,,,,,,,,,,,2017_Jun_01_1216,98.8183085567,Stroop,B-1,1STACS-6,
neutral,left,"[0.568627451, -0.7882352941, -0.7882352941]", ,12,SOLL,46,0,46,0,0,0,0,0,,,,,left,1,0.68706413804,2017_Jun_01_1216,98.8183085567,Stroop,B-1,1STACS-6,
,,,,,,46,0,46,0,,,,,,,,,,,,2017_Jun_01_1216,98.8183085567,Stroop,B-1,1STACS-6,
neutral,right,"[-0.8745098039, -0.2078431373, 0.637254902]", ,11,PECH,47,0,47,0,0,0,0,0,,,,,right,1,0.751942495484,2017_Jun_01_1216,98.8183085567,Stroop,B-1,1STACS-6,
,,,,,,47,0,47,0,,,,,,,,,,,,2017_Jun_01_1216,98.8183085567,Stroop,B-1,1STACS-6,
neutral,left,"[0.568627451, -0.7882352941, -0.7882352941]", ,12,SOLL,48,0,48,0,0,0,0,0,,,,,left,1,0.719353716744,2017_Jun_01_1216,98.8183085567,Stroop,B-1,1STACS-6,
,,,,,,48,0,48,0,,,,,,,,,,,,2017_Jun_01_1216,98.8183085567,Stroop,B-1,1STACS-6,
neutral,down,"[-0.7725490196, 0.0745098039, -1]", ,10,PECH,49,0,49,0,0,0,0,0,,,,,down,1,0.641877948175,2017_Jun_01_1216,98.8183085567,Stroop,B-1,1STACS-6,
,,,,,,49,0,49,0,,,,,,,,,,,,2017_Jun_01_1216,98.8183085567,Stroop,B-1,1STACS-6,
neutralofneutral,down,"[-0.7725490196, 0.0745098039, -1]", ,16,HALS,50,0,50,0,0,0,0,0,,,,,down,1,0.577576479692,2017_Jun_01_1216,98.8183085567,Stroop,B-1,1STACS-6,
,,,,,,50,0,50,0,,,,,,,,,,,,2017_Jun_01_1216,98.8183085567,Stroop,B-1,1STACS-6,
fix,return,white, ,21,+,,,,,,,,,0,0,0,0,None,0,,2017_Jun_01_1216,98.8183085567,Stroop,B-1,1STACS-6,
fix,return,white, ,21,+,,,,,,,,,0,1,1,1,None,0,,2017_Jun_01_1216,98.8183085567,Stroop,B-1,1STACS-6,
fix,return,white, ,21,+,,,,,,,,,0,2,2,2,None,0,,2017_Jun_01_1216,98.8183085567,Stroop,B-1,1STACS-6,
fix,return,white, ,21,+,,,,,,,,,0,3,3,3,None,0,,2017_Jun_01_1216,98.8183085567,Stroop,B-1,1STACS-6,
fix,return,white, ,21,+,,,,,,,,,0,4,4,4,None,0,,2017_Jun_01_1216,98.8183085567,Stroop,B-1,1STACS-6,
fix,return,white, ,21,+,,,,,,,,,0,5,5,5,None,0,,2017_Jun_01_1216,98.8183085567,Stroop,B-1,1STACS-6,
fix,return,white, ,21,+,,,,,,,,,0,6,6,6,None,0,,2017_Jun_01_1216,98.8183085567,Stroop,B-1,1STACS-6,
fix,return,white, ,21,+,,,,,,,,,0,7,7,7,None,0,,2017_Jun_01_1216,98.8183085567,Stroop,B-1,1STACS-6,
fix,return,white, ,21,+,,,,,,,,,0,8,8,8,None,0,,2017_Jun_01_1216,98.8183085567,Stroop,B-1,1STACS-6,
fix,return,white, ,21,+,,,,,,,,,0,9,9,9,None,0,,2017_Jun_01_1216,98.8183085567,Stroop,B-1,1STACS-6,
fix,return,white, ,21,+,,,,,,,,,0,10,10,10,None,0,,2017_Jun_01_1216,98.8183085567,Stroop,B-1,1STACS-6,
fix,return,white, ,21,+,,,,,,,,,0,11,11,11,None,0,,2017_Jun_01_1216,98.8183085567,Stroop,B-1,1STACS-6,
fix,return,white,+,22,+,,,,,,,,,0,12,12,12,None,0,,2017_Jun_01_1216,98.8183085567,Stroop,B-1,1STACS-6,
neutral,left,"[0.568627451, -0.7882352941, -0.7882352941]", ,9,PECH,,,,,,,,,0,13,13,13,left,1,0.748955523677,2017_Jun_01_1216,98.8183085567,Stroop,B-1,1STACS-6,
congruent,down,"[-0.7725490196, 0.0745098039, -1]", ,4,GRÜN,,,,,,,,,0,14,14,14,down,1,0.641946392628,2017_Jun_01_1216,98.8183085567,Stroop,B-1,1STACS-6,
neutral,down,"[-0.7725490196, 0.0745098039, -1]", ,13,SOLL,,,,,,,,,0,15,15,15,down,1,0.579473089457,2017_Jun_01_1216,98.8183085567,Stroop,B-1,1STACS-6,
congruent,left,"[0.568627451, -0.7882352941, -0.7882352941]", ,0,ROT,,,,,,,,,0,16,16,16,left,1,0.547458685392,2017_Jun_01_1216,98.8183085567,Stroop,B-1,1STACS-6,
neutral,right,"[-0.8745098039, -0.2078431373, 0.637254902]", ,14,SOLL,,,,,,,,,0,17,17,17,right,1,0.579681216468,2017_Jun_01_1216,98.8183085567,Stroop,B-1,1STACS-6,
neutral,left,"[0.568627451, -0.7882352941, -0.7882352941]", ,12,SOLL,,,,,,,,,0,18,18,18,left,1,0.654851664108,2017_Jun_01_1216,98.8183085567,Stroop,B-1,1STACS-6,
congruent,right,"[-0.8745098039, -0.2078431373, 0.637254902]", ,8,BLAU,,,,,,,,,0,19,19,19,right,1,0.590190932088,2017_Jun_01_1216,98.8183085567,Stroop,B-1,1STACS-6,
congruent,down,"[-0.7725490196, 0.0745098039, -1]", ,4,GRÜN,,,,,,,,,0,20,20,20,down,1,0.419556675499,2017_Jun_01_1216,98.8183085567,Stroop,B-1,1STACS-6,
neutral,right,"[-0.8745098039, -0.2078431373, 0.637254902]", ,11,PECH,,,,,,,,,0,21,21,21,right,1,0.751183739833,2017_Jun_01_1216,98.8183085567,Stroop,B-1,1STACS-6,
congruent,right,"[-0.8745098039, -0.2078431373, 0.637254902]", ,8,BLAU,,,,,,,,,0,22,22,22,right,1,0.580563730865,2017_Jun_01_1216,98.8183085567,Stroop,B-1,1STACS-6,
congruent,left,"[0.568627451, -0.7882352941, -0.7882352941]", ,0,ROT,,,,,,,,,0,23,23,23,left,1,0.577323374898,2017_Jun_01_1216,98.8183085567,Stroop,B-1,1STACS-6,
neutral,down,"[-0.7725490196, 0.0745098039, -1]", ,10,PECH,,,,,,,,,0,24,24,24,down,1,0.790767541685,2017_Jun_01_1216,98.8183085567,Stroop,B-1,1STACS-6,
neutralofneutral,right,"[-0.8745098039, -0.2078431373, 0.637254902]", ,17,HALS,,,,,,,,,0,25,25,25,right,1,1.09864996808,2017_Jun_01_1216,98.8183085567,Stroop,B-1,1STACS-6,
neutralofneutral,left,"[0.568627451, -0.7882352941, -0.7882352941]", ,18,MODE,,,,,,,,,0,26,26,26,left,1,0.633101134362,2017_Jun_01_1216,98.8183085567,Stroop,B-1,1STACS-6,
neutral,right,"[-0.8745098039, -0.2078431373, 0.637254902]", ,14,SOLL,,,,,,,,,0,27,27,27,right,1,0.598561549024,2017_Jun_01_1216,98.8183085567,Stroop,B-1,1STACS-6,
neutralofneutral,down,"[-0.7725490196, 0.0745098039, -1]", ,16,HALS,,,,,,,,,0,28,28,28,down,1,0.536084334741,2017_Jun_01_1216,98.8183085567,Stroop,B-1,1STACS-6,
neutralofneutral,left,"[0.568627451, -0.7882352941, -0.7882352941]", ,15,HALS,,,,,,,,,0,29,29,29,left,1,0.867997468952,2017_Jun_01_1216,98.8183085567,Stroop,B-1,1STACS-6,
neutral,down,"[-0.7725490196, 0.0745098039, -1]", ,13,SOLL,,,,,,,,,0,30,30,30,down,1,0.66604526553,2017_Jun_01_1216,98.8183085567,Stroop,B-1,1STACS-6,
neutralofneutral,right,"[-0.8745098039, -0.2078431373, 0.637254902]", ,20,MODE,,,,,,,,,0,31,31,31,right,1,0.581893229447,2017_Jun_01_1216,98.8183085567,Stroop,B-1,1STACS-6,
neutral,left,"[0.568627451, -0.7882352941, -0.7882352941]", ,9,PECH,,,,,,,,,0,32,32,32,left,1,0.656296819847,2017_Jun_01_1216,98.8183085567,Stroop,B-1,1STACS-6,
neutralofneutral,down,"[-0.7725490196, 0.0745098039, -1]", ,19,MODE,,,,,,,,,0,33,33,33,down,1,0.603593473472,2017_Jun_01_1216,98.8183085567,Stroop,B-1,1STACS-6,
neutral,down,"[-0.7725490196, 0.0745098039, -1]", ,10,PECH,,,,,,,,,0,34,34,34,down,1,0.612000687238,2017_Jun_01_1216,98.8183085567,Stroop,B-1,1STACS-6,
neutral,left,"[0.568627451, -0.7882352941, -0.7882352941]", ,12,SOLL,,,,,,,,,0,35,35,35,left,1,0.591081268709,2017_Jun_01_1216,98.8183085567,Stroop,B-1,1STACS-6,
neutral,right,"[-0.8745098039, -0.2078431373, 0.637254902]", ,11,PECH,,,,,,,,,0,36,36,36,right,1,0.55926605197,2017_Jun_01_1216,98.8183085567,Stroop,B-1,1STACS-6,
incongruent,right,"[-0.8745098039, -0.2078431373, 0.637254902]", ,2,ROT,,,,,,,,,0,37,37,37,right,1,0.675243361935,2017_Jun_01_1216,98.8183085567,Stroop,B-1,1STACS-6,
incongruent,down,"[-0.7725490196, 0.0745098039, -1]", ,7,BLAU,,,,,,,,,0,38,38,38,down,1,0.568187018182,2017_Jun_01_1216,98.8183085567,Stroop,B-1,1STACS-6,
neutral,left,"[0.568627451, -0.7882352941, -0.7882352941]", ,12,SOLL,,,,,,,,,0,39,39,39,left,1,0.55511831811,2017_Jun_01_1216,98.8183085567,Stroop,B-1,1STACS-6,
incongruent,left,"[0.568627451, -0.7882352941, -0.7882352941]", ,6,BLAU,,,,,,,,,0,40,40,40,left,1,0.759306280547,2017_Jun_01_1216,98.8183085567,Stroop,B-1,1STACS-6,
incongruent,left,"[0.568627451, -0.7882352941, -0.7882352941]", ,3,GRÜN,,,,,,,,,0,41,41,41,left,1,0.566420871926,2017_Jun_01_1216,98.8183085567,Stroop,B-1,1STACS-6,
neutral,down,"[-0.7725490196, 0.0745098039, -1]", ,10,PECH,,,,,,,,,0,42,42,42,down,1,0.716040446481,2017_Jun_01_1216,98.8183085567,Stroop,B-1,1STACS-6,
incongruent,down,"[-0.7725490196, 0.0745098039, -1]", ,1,ROT,,,,,,,,,0,43,43,43,down,1,0.609859632998,2017_Jun_01_1216,98.8183085567,Stroop,B-1,1STACS-6,
neutral,right,"[-0.8745098039, -0.2078431373, 0.637254902]", ,11,PECH,,,,,,,,,0,44,44,44,right,1,0.620801805816,2017_Jun_01_1216,98.8183085567,Stroop,B-1,1STACS-6,
neutral,right,"[-0.8745098039, -0.2078431373, 0.637254902]", ,14,SOLL,,,,,,,,,0,45,45,45,down,0,0.513042858799,2017_Jun_01_1216,98.8183085567,Stroop,B-1,1STACS-6,
neutral,down,"[-0.7725490196, 0.0745098039, -1]", ,13,SOLL,,,,,,,,,0,46,46,46,down,1,0.619928231102,2017_Jun_01_1216,98.8183085567,Stroop,B-1,1STACS-6,
incongruent,right,"[-0.8745098039, -0.2078431373, 0.637254902]", ,5,GRÜN,,,,,,,,,0,47,47,47,right,1,0.726283089052,2017_Jun_01_1216,98.8183085567,Stroop,B-1,1STACS-6,
neutral,left,"[0.568627451, -0.7882352941, -0.7882352941]", ,9,PECH,,,,,,,,,0,48,48,48,left,1,0.555806953118,2017_Jun_01_1216,98.8183085567,Stroop,B-1,1STACS-6,
fix,return,white, ,21,+,,,,,,,,,0,49,49,49,None,0,,2017_Jun_01_1216,98.8183085567,Stroop,B-1,1STACS-6,
fix,return,white, ,21,+,,,,,,,,,0,50,50,50,None,0,,2017_Jun_01_1216,98.8183085567,Stroop,B-1,1STACS-6,
fix,return,white, ,21,+,,,,,,,,,0,51,51,51,None,0,,2017_Jun_01_1216,98.8183085567,Stroop,B-1,1STACS-6,
fix,return,white, ,21,+,,,,,,,,,0,52,52,52,None,0,,2017_Jun_01_1216,98.8183085567,Stroop,B-1,1STACS-6,
fix,return,white, ,21,+,,,,,,,,,0,53,53,53,None,0,,2017_Jun_01_1216,98.8183085567,Stroop,B-1,1STACS-6,
fix,return,white, ,21,+,,,,,,,,,0,54,54,54,None,0,,2017_Jun_01_1216,98.8183085567,Stroop,B-1,1STACS-6,
fix,return,white, ,21,+,,,,,,,,,0,55,55,55,None,0,,2017_Jun_01_1216,98.8183085567,Stroop,B-1,1STACS-6,
fix,return,white, ,21,+,,,,,,,,,0,56,56,56,None,0,,2017_Jun_01_1216,98.8183085567,Stroop,B-1,1STACS-6,
fix,return,white, ,21,+,,,,,,,,,0,57,57,57,None,0,,2017_Jun_01_1216,98.8183085567,Stroop,B-1,1STACS-6,
fix,return,white, ,21,+,,,,,,,,,0,58,58,58,None,0,,2017_Jun_01_1216,98.8183085567,Stroop,B-1,1STACS-6,
fix,return,white, ,21,+,,,,,,,,,0,59,59,59,None,0,,2017_Jun_01_1216,98.8183085567,Stroop,B-1,1STACS-6,
fix,return,white, ,21,+,,,,,,,,,0,60,60,60,None,0,,2017_Jun_01_1216,98.8183085567,Stroop,B-1,1STACS-6,
fix,return,white,+,22,+,,,,,,,,,0,61,61,61,None,0,,2017_Jun_01_1216,98.8183085567,Stroop,B-1,1STACS-6,
incongruent,right,"[-0.8745098039, -0.2078431373, 0.637254902]", ,5,GRÜN,,,,,,,,,0,62,62,62,down,0,0.720399659733,2017_Jun_01_1216,98.8183085567,Stroop,B-1,1STACS-6,
neutral,down,"[-0.7725490196, 0.0745098039, -1]", ,10,PECH,,,,,,,,,0,63,63,63,down,1,0.558966572567,2017_Jun_01_1216,98.8183085567,Stroop,B-1,1STACS-6,
incongruent,down,"[-0.7725490196, 0.0745098039, -1]", ,7,BLAU,,,,,,,,,0,64,64,64,right,0,0.837977731807,2017_Jun_01_1216,98.8183085567,Stroop,B-1,1STACS-6,
neutral,down,"[-0.7725490196, 0.0745098039, -1]", ,13,SOLL,,,,,,,,,0,65,65,65,down,1,0.62267383145,2017_Jun_01_1216,98.8183085567,Stroop,B-1,1STACS-6,
incongruent,down,"[-0.7725490196, 0.0745098039, -1]", ,1,ROT,,,,,,,,,0,66,66,66,down,1,1.16637421795,2017_Jun_01_1216,98.8183085567,Stroop,B-1,1STACS-6,
neutral,right,"[-0.8745098039, -0.2078431373, 0.637254902]", ,11,PECH,,,,,,,,,0,67,67,67,right,1,0.622257298064,2017_Jun_01_1216,98.8183085567,Stroop,B-1,1STACS-6,
neutral,right,"[-0.8745098039, -0.2078431373, 0.637254902]", ,14,SOLL,,,,,,,,,0,68,68,68,right,1,0.854726787902,2017_Jun_01_1216,98.8183085567,Stroop,B-1,1STACS-6,
neutral,left,"[0.568627451, -0.7882352941, -0.7882352941]", ,12,SOLL,,,,,,,,,0,69,69,69,left,1,0.566531221147,2017_Jun_01_1216,98.8183085567,Stroop,B-1,1STACS-6,
incongruent,right,"[-0.8745098039, -0.2078431373, 0.637254902]", ,2,ROT,,,,,,,,,0,70,70,70,right,1,1.08983739553,2017_Jun_01_1216,98.8183085567,Stroop,B-1,1STACS-6,
neutral,left,"[0.568627451, -0.7882352941, -0.7882352941]", ,9,PECH,,,,,,,,,0,71,71,71,left,1,0.708062337532,2017_Jun_01_1216,98.8183085567,Stroop,B-1,1STACS-6,
incongruent,left,"[0.568627451, -0.7882352941, -0.7882352941]", ,6,BLAU,,,,,,,,,0,72,72,72,left,1,0.781602130997,2017_Jun_01_1216,98.8183085567,Stroop,B-1,1STACS-6,
incongruent,left,"[0.568627451, -0.7882352941, -0.7882352941]", ,3,GRÜN,,,,,,,,,0,73,73,73,left,1,0.611978338029,2017_Jun_01_1216,98.8183085567,Stroop,B-1,1STACS-6,
congruent,down,"[-0.7725490196, 0.0745098039, -1]", ,4,GRÜN,,,,,,,,,0,74,74,74,down,1,0.773090155313,2017_Jun_01_1216,98.8183085567,Stroop,B-1,1STACS-6,
neutral,right,"[-0.8745098039, -0.2078431373, 0.637254902]", ,11,PECH,,,,,,,,,0,75,75,75,right,1,0.472085139312,2017_Jun_01_1216,98.8183085567,Stroop,B-1,1STACS-6,
neutral,down,"[-0.7725490196, 0.0745098039, -1]", ,10,PECH,,,,,,,,,0,76,76,76,down,1,0.622942860056,2017_Jun_01_1216,98.8183085567,Stroop,B-1,1STACS-6,
congruent,down,"[-0.7725490196, 0.0745098039, -1]", ,4,GRÜN,,,,,,,,,0,77,77,77,down,1,0.536620715761,2017_Jun_01_1216,98.8183085567,Stroop,B-1,1STACS-6,
neutral,left,"[0.568627451, -0.7882352941, -0.7882352941]", ,9,PECH,,,,,,,,,0,78,78,78,left,1,0.569428796118,2017_Jun_01_1216,98.8183085567,Stroop,B-1,1STACS-6,
neutral,down,"[-0.7725490196, 0.0745098039, -1]", ,13,SOLL,,,,,,,,,0,79,79,79,left,0,1.14603420267,2017_Jun_01_1216,98.8183085567,Stroop,B-1,1STACS-6,
congruent,right,"[-0.8745098039, -0.2078431373, 0.637254902]", ,8,BLAU,,,,,,,,,0,80,80,80,right,1,0.705719302313,2017_Jun_01_1216,98.8183085567,Stroop,B-1,1STACS-6,
neutral,right,"[-0.8745098039, -0.2078431373, 0.637254902]", ,14,SOLL,,,,,,,,,0,81,81,81,right,1,1.38185467706,2017_Jun_01_1216,98.8183085567,Stroop,B-1,1STACS-6,
congruent,right,"[-0.8745098039, -0.2078431373, 0.637254902]", ,8,BLAU,,,,,,,,,0,82,82,82,right,1,0.833467940758,2017_Jun_01_1216,98.8183085567,Stroop,B-1,1STACS-6,
neutral,left,"[0.568627451, -0.7882352941, -0.7882352941]", ,12,SOLL,,,,,,,,,0,83,83,83,left,1,0.577956136884,2017_Jun_01_1216,98.8183085567,Stroop,B-1,1STACS-6,
congruent,left,"[0.568627451, -0.7882352941, -0.7882352941]", ,0,ROT,,,,,,,,,0,84,84,84,left,1,0.545452285137,2017_Jun_01_1216,98.8183085567,Stroop,B-1,1STACS-6,
congruent,left,"[0.568627451, -0.7882352941, -0.7882352941]", ,0,ROT,,,,,,,,,0,85,85,85,left,1,0.52574335565,2017_Jun_01_1216,98.8183085567,Stroop,B-1,1STACS-6,
neutral,down,"[-0.7725490196, 0.0745098039, -1]", ,10,PECH,,,,,,,,,0,86,86,86,down,1,0.601395987479,2017_Jun_01_1216,98.8183085567,Stroop,B-1,1STACS-6,
neutralofneutral,right,"[-0.8745098039, -0.2078431373, 0.637254902]", ,17,HALS,,,,,,,,,0,87,87,87,right,1,0.783291451847,2017_Jun_01_1216,98.8183085567,Stroop,B-1,1STACS-6,
neutralofneutral,down,"[-0.7725490196, 0.0745098039, -1]", ,19,MODE,,,,,,,,,0,88,88,88,None,0,,2017_Jun_01_1216,98.8183085567,Stroop,B-1,1STACS-6,
neutral,down,"[-0.7725490196, 0.0745098039, -1]", ,13,SOLL,,,,,,,,,0,89,89,89,down,1,0.441143497288,2017_Jun_01_1216,98.8183085567,Stroop,B-1,1STACS-6,
neutral,left,"[0.568627451, -0.7882352941, -0.7882352941]", ,9,PECH,,,,,,,,,0,90,90,90,left,1,0.773366726777,2017_Jun_01_1216,98.8183085567,Stroop,B-1,1STACS-6,
neutral,right,"[-0.8745098039, -0.2078431373, 0.637254902]", ,14,SOLL,,,,,,,,,0,91,91,91,right,1,0.633098061346,2017_Jun_01_1216,98.8183085567,Stroop,B-1,1STACS-6,
neutral,right,"[-0.8745098039, -0.2078431373, 0.637254902]", ,11,PECH,,,,,,,,,0,92,92,92,right,1,0.850192692088,2017_Jun_01_1216,98.8183085567,Stroop,B-1,1STACS-6,
neutralofneutral,down,"[-0.7725490196, 0.0745098039, -1]", ,16,HALS,,,,,,,,,0,93,93,93,down,1,0.847036145655,2017_Jun_01_1216,98.8183085567,Stroop,B-1,1STACS-6,
neutralofneutral,left,"[0.568627451, -0.7882352941, -0.7882352941]", ,15,HALS,,,,,,,,,0,94,94,94,left,1,0.698076710867,2017_Jun_01_1216,98.8183085567,Stroop,B-1,1STACS-6,
neutralofneutral,right,"[-0.8745098039, -0.2078431373, 0.637254902]", ,20,MODE,,,,,,,,,0,95,95,95,right,1,1.17788406068,2017_Jun_01_1216,98.8183085567,Stroop,B-1,1STACS-6,
neutralofneutral,left,"[0.568627451, -0.7882352941, -0.7882352941]", ,18,MODE,,,,,,,,,0,96,96,96,left,1,0.708489766157,2017_Jun_01_1216,98.8183085567,Stroop,B-1,1STACS-6,
neutral,left,"[0.568627451, -0.7882352941, -0.7882352941]", ,12,SOLL,,,,,,,,,0,97,97,97,left,1,0.619951697772,2017_Jun_01_1216,98.8183085567,Stroop,B-1,1STACS-6,
fix,return,white, ,21,+,,,,,,,,,0,98,98,98,None,0,,2017_Jun_01_1216,98.8183085567,Stroop,B-1,1STACS-6,
fix,return,white, ,21,+,,,,,,,,,0,99,99,99,None,0,,2017_Jun_01_1216,98.8183085567,Stroop,B-1,1STACS-6,
fix,return,white, ,21,+,,,,,,,,,0,100,100,100,None,0,,2017_Jun_01_1216,98.8183085567,Stroop,B-1,1STACS-6,
fix,return,white, ,21,+,,,,,,,,,0,101,101,101,None,0,,2017_Jun_01_1216,98.8183085567,Stroop,B-1,1STACS-6,
fix,return,white, ,21,+,,,,,,,,,0,102,102,102,None,0,,2017_Jun_01_1216,98.8183085567,Stroop,B-1,1STACS-6,
fix,return,white, ,21,+,,,,,,,,,0,103,103,103,None,0,,2017_Jun_01_1216,98.8183085567,Stroop,B-1,1STACS-6,
fix,return,white, ,21,+,,,,,,,,,0,104,104,104,None,0,,2017_Jun_01_1216,98.8183085567,Stroop,B-1,1STACS-6,
fix,return,white, ,21,+,,,,,,,,,0,105,105,105,None,0,,2017_Jun_01_1216,98.8183085567,Stroop,B-1,1STACS-6,
fix,return,white, ,21,+,,,,,,,,,0,106,106,106,None,0,,2017_Jun_01_1216,98.8183085567,Stroop,B-1,1STACS-6,
fix,return,white, ,21,+,,,,,,,,,0,107,107,107,None,0,,2017_Jun_01_1216,98.8183085567,Stroop,B-1,1STACS-6,
fix,return,white, ,21,+,,,,,,,,,0,108,108,108,None,0,,2017_Jun_01_1216,98.8183085567,Stroop,B-1,1STACS-6,
fix,return,white, ,21,+,,,,,,,,,0,109,109,109,None,0,,2017_Jun_01_1216,98.8183085567,Stroop,B-1,1STACS-6,
fix,return,white,+,22,+,,,,,,,,,0,110,110,110,None,0,,2017_Jun_01_1216,98.8183085567,Stroop,B-1,1STACS-6,
congruent,down,"[-0.7725490196, 0.0745098039, -1]", ,4,GRÜN,,,,,,,,,0,111,111,111,down,1,0.598597307758,2017_Jun_01_1216,98.8183085567,Stroop,B-1,1STACS-6,
neutral,left,"[0.568627451, -0.7882352941, -0.7882352941]", ,12,SOLL,,,,,,,,,0,112,112,112,left,1,0.470264516859,2017_Jun_01_1216,98.8183085567,Stroop,B-1,1STACS-6,
congruent,down,"[-0.7725490196, 0.0745098039, -1]", ,4,GRÜN,,,,,,,,,0,113,113,113,down,1,0.566249341746,2017_Jun_01_1216,98.8183085567,Stroop,B-1,1STACS-6,
neutral,down,"[-0.7725490196, 0.0745098039, -1]", ,13,SOLL,,,,,,,,,0,114,114,114,down,1,0.504889867288,2017_Jun_01_1216,98.8183085567,Stroop,B-1,1STACS-6,
congruent,right,"[-0.8745098039, -0.2078431373, 0.637254902]", ,8,BLAU,,,,,,,,,0,115,115,115,right,1,0.612278934892,2017_Jun_01_1216,98.8183085567,Stroop,B-1,1STACS-6,
neutral,down,"[-0.7725490196, 0.0745098039, -1]", ,10,PECH,,,,,,,,,0,116,116,116,down,1,0.686920265005,2017_Jun_01_1216,98.8183085567,Stroop,B-1,1STACS-6,
neutral,right,"[-0.8745098039, -0.2078431373, 0.637254902]", ,14,SOLL,,,,,,,,,0,117,117,117,right,1,0.676282600163,2017_Jun_01_1216,98.8183085567,Stroop,B-1,1STACS-6,
neutral,right,"[-0.8745098039, -0.2078431373, 0.637254902]", ,11,PECH,,,,,,,,,0,118,118,118,right,1,0.729971546663,2017_Jun_01_1216,98.8183085567,Stroop,B-1,1STACS-6,
congruent,left,"[0.568627451, -0.7882352941, -0.7882352941]", ,0,ROT,,,,,,,,,0,119,119,119,left,1,0.622820777501,2017_Jun_01_1216,98.8183085567,Stroop,B-1,1STACS-6,
congruent,right,"[-0.8745098039, -0.2078431373, 0.637254902]", ,8,BLAU,,,,,,,,,0,120,120,120,right,1,0.687005750731,2017_Jun_01_1216,98.8183085567,Stroop,B-1,1STACS-6,
congruent,left,"[0.568627451, -0.7882352941, -0.7882352941]", ,0,ROT,,,,,,,,,0,121,121,121,left,1,0.655246965746,2017_Jun_01_1216,98.8183085567,Stroop,B-1,1STACS-6,
neutral,left,"[0.568627451, -0.7882352941, -0.7882352941]", ,9,PECH,,,,,,,,,0,122,122,122,left,1,0.559052058292,2017_Jun_01_1216,98.8183085567,Stroop,B-1,1STACS-6,
neutral,right,"[-0.8745098039, -0.2078431373, 0.637254902]", ,11,PECH,,,,,,,,,0,123,123,123,right,1,0.697439199675,2017_Jun_01_1216,98.8183085567,Stroop,B-1,1STACS-6,
incongruent,down,"[-0.7725490196, 0.0745098039, -1]", ,7,BLAU,,,,,,,,,0,124,124,124,down,1,0.644319319913,2017_Jun_01_1216,98.8183085567,Stroop,B-1,1STACS-6,
neutral,down,"[-0.7725490196, 0.0745098039, -1]", ,10,PECH,,,,,,,,,0,125,125,125,down,1,0.523867977634,2017_Jun_01_1216,98.8183085567,Stroop,B-1,1STACS-6,
neutral,down,"[-0.7725490196, 0.0745098039, -1]", ,13,SOLL,,,,,,,,,0,126,126,126,down,1,0.555812261056,2017_Jun_01_1216,98.8183085567,Stroop,B-1,1STACS-6,
incongruent,left,"[0.568627451, -0.7882352941, -0.7882352941]", ,6,BLAU,,,,,,,,,0,127,127,127,left,1,0.758832197947,2017_Jun_01_1216,98.8183085567,Stroop,B-1,1STACS-6,
incongruent,down,"[-0.7725490196, 0.0745098039, -1]", ,1,ROT,,,,,,,,,0,128,128,128,down,1,1.04003944635,2017_Jun_01_1216,98.8183085567,Stroop,B-1,1STACS-6,
incongruent,left,"[0.568627451, -0.7882352941, -0.7882352941]", ,3,GRÜN,,,,,,,,,0,129,129,129,left,1,0.783459909011,2017_Jun_01_1216,98.8183085567,Stroop,B-1,1STACS-6,
incongruent,right,"[-0.8745098039, -0.2078431373, 0.637254902]", ,2,ROT,,,,,,,,,0,130,130,130,right,1,0.817763151462,2017_Jun_01_1216,98.8183085567,Stroop,B-1,1STACS-6,
neutral,left,"[0.568627451, -0.7882352941, -0.7882352941]", ,12,SOLL,,,,,,,,,0,131,131,131,left,1,0.60166529545,2017_Jun_01_1216,98.8183085567,Stroop,B-1,1STACS-6,
incongruent,right,"[-0.8745098039, -0.2078431373, 0.637254902]", ,5,GRÜN,,,,,,,,,0,132,132,132,right,1,1.17693002882,2017_Jun_01_1216,98.8183085567,Stroop,B-1,1STACS-6,
neutral,right,"[-0.8745098039, -0.2078431373, 0.637254902]", ,14,SOLL,,,,,,,,,0,133,133,133,right,1,0.708444509009,2017_Jun_01_1216,98.8183085567,Stroop,B-1,1STACS-6,
neutral,left,"[0.568627451, -0.7882352941, -0.7882352941]", ,9,PECH,,,,,,,,,0,134,134,134,left,1,0.762199665041,2017_Jun_01_1216,98.8183085567,Stroop,B-1,1STACS-6,
neutral,left,"[0.568627451, -0.7882352941, -0.7882352941]", ,12,SOLL,,,,,,,,,0,135,135,135,left,1,0.526568041469,2017_Jun_01_1216,98.8183085567,Stroop,B-1,1STACS-6,
neutralofneutral,down,"[-0.7725490196, 0.0745098039, -1]", ,16,HALS,,,,,,,,,0,136,136,136,down,1,0.66622992587,2017_Jun_01_1216,98.8183085567,Stroop,B-1,1STACS-6,
neutral,left,"[0.568627451, -0.7882352941, -0.7882352941]", ,9,PECH,,,,,,,,,0,137,137,137,left,1,0.941807408483,2017_Jun_01_1216,98.8183085567,Stroop,B-1,1STACS-6,
neutralofneutral,right,"[-0.8745098039, -0.2078431373, 0.637254902]", ,17,HALS,,,,,,,,,0,138,138,138,right,1,0.941712144979,2017_Jun_01_1216,98.8183085567,Stroop,B-1,1STACS-6,
neutralofneutral,down,"[-0.7725490196, 0.0745098039, -1]", ,19,MODE,,,,,,,,,0,139,139,139,down,1,0.869254332604,2017_Jun_01_1216,98.8183085567,Stroop,B-1,1STACS-6,
neutral,down,"[-0.7725490196, 0.0745098039, -1]", ,10,PECH,,,,,,,,,0,140,140,140,down,1,0.769668770752,2017_Jun_01_1216,98.8183085567,Stroop,B-1,1STACS-6,
neutralofneutral,left,"[0.568627451, -0.7882352941, -0.7882352941]", ,18,MODE,,,,,,,,,0,141,141,141,left,1,0.643857808744,2017_Jun_01_1216,98.8183085567,Stroop,B-1,1STACS-6,
neutral,down,"[-0.7725490196, 0.0745098039, -1]", ,13,SOLL,,,,,,,,,0,142,142,142,down,1,0.645483434347,2017_Jun_01_1216,98.8183085567,Stroop,B-1,1STACS-6,
neutral,right,"[-0.8745098039, -0.2078431373, 0.637254902]", ,11,PECH,,,,,,,,,0,143,143,143,right,1,0.655220146695,2017_Jun_01_1216,98.8183085567,Stroop,B-1,1STACS-6,
neutralofneutral,right,"[-0.8745098039, -0.2078431373, 0.637254902]", ,20,MODE,,,,,,,,,0,144,144,144,right,1,0.841154671893,2017_Jun_01_1216,98.8183085567,Stroop,B-1,1STACS-6,
neutralofneutral,left,"[0.568627451, -0.7882352941, -0.7882352941]", ,15,HALS,,,,,,,,,0,145,145,145,left,1,0.795168659704,2017_Jun_01_1216,98.8183085567,Stroop,B-1,1STACS-6,
neutral,right,"[-0.8745098039, -0.2078431373, 0.637254902]", ,14,SOLL,,,,,,,,,0,146,146,146,right,1,0.654413898973,2017_Jun_01_1216,98.8183085567,Stroop,B-1,1STACS-6,
fix,return,white, ,21,+,,,,,,,,,0,147,147,147,None,0,,2017_Jun_01_1216,98.8183085567,Stroop,B-1,1STACS-6,
fix,return,white, ,21,+,,,,,,,,,0,148,148,148,None,0,,2017_Jun_01_1216,98.8183085567,Stroop,B-1,1STACS-6,
fix,return,white, ,21,+,,,,,,,,,0,149,149,149,None,0,,2017_Jun_01_1216,98.8183085567,Stroop,B-1,1STACS-6,
fix,return,white, ,21,+,,,,,,,,,0,150,150,150,None,0,,2017_Jun_01_1216,98.8183085567,Stroop,B-1,1STACS-6,
fix,return,white, ,21,+,,,,,,,,,0,151,151,151,None,0,,2017_Jun_01_1216,98.8183085567,Stroop,B-1,1STACS-6,
fix,return,white, ,21,+,,,,,,,,,0,152,152,152,None,0,,2017_Jun_01_1216,98.8183085567,Stroop,B-1,1STACS-6,
fix,return,white, ,21,+,,,,,,,,,0,153,153,153,None,0,,2017_Jun_01_1216,98.8183085567,Stroop,B-1,1STACS-6,
fix,return,white, ,21,+,,,,,,,,,0,154,154,154,None,0,,2017_Jun_01_1216,98.8183085567,Stroop,B-1,1STACS-6,
fix,return,white, ,21,+,,,,,,,,,0,155,155,155,None,0,,2017_Jun_01_1216,98.8183085567,Stroop,B-1,1STACS-6,
fix,return,white, ,21,+,,,,,,,,,0,156,156,156,None,0,,2017_Jun_01_1216,98.8183085567,Stroop,B-1,1STACS-6,
fix,return,white, ,21,+,,,,,,,,,0,157,157,157,None,0,,2017_Jun_01_1216,98.8183085567,Stroop,B-1,1STACS-6,
fix,return,white, ,21,+,,,,,,,,,0,158,158,158,None,0,,2017_Jun_01_1216,98.8183085567,Stroop,B-1,1STACS-6,
fix,return,white,+,22,+,,,,,,,,,0,159,159,159,None,0,,2017_Jun_01_1216,98.8183085567,Stroop,B-1,1STACS-6,
neutralofneutral,right,"[-0.8745098039, -0.2078431373, 0.637254902]", ,20,MODE,,,,,,,,,0,160,160,160,right,1,0.809230782125,2017_Jun_01_1216,98.8183085567,Stroop,B-1,1STACS-6,
neutral,left,"[0.568627451, -0.7882352941, -0.7882352941]", ,12,SOLL,,,,,,,,,0,161,161,161,left,1,0.687159401544,2017_Jun_01_1216,98.8183085567,Stroop,B-1,1STACS-6,
neutralofneutral,left,"[0.568627451, -0.7882352941, -0.7882352941]", ,15,HALS,,,,,,,,,0,162,162,162,left,1,0.505367581634,2017_Jun_01_1216,98.8183085567,Stroop,B-1,1STACS-6,
neutral,right,"[-0.8745098039, -0.2078431373, 0.637254902]", ,11,PECH,,,,,,,,,0,163,163,163,right,1,0.610964801392,2017_Jun_01_1216,98.8183085567,Stroop,B-1,1STACS-6,
neutralofneutral,left,"[0.568627451, -0.7882352941, -0.7882352941]", ,18,MODE,,,,,,,,,0,164,164,164,left,1,0.550520247685,2017_Jun_01_1216,98.8183085567,Stroop,B-1,1STACS-6,
neutral,left,"[0.568627451, -0.7882352941, -0.7882352941]", ,9,PECH,,,,,,,,,0,165,165,165,left,1,0.59989076824,2017_Jun_01_1216,98.8183085567,Stroop,B-1,1STACS-6,
neutral,right,"[-0.8745098039, -0.2078431373, 0.637254902]", ,14,SOLL,,,,,,,,,0,166,166,166,right,1,0.726666657355,2017_Jun_01_1216,98.8183085567,Stroop,B-1,1STACS-6,
neutralofneutral,right,"[-0.8745098039, -0.2078431373, 0.637254902]", ,17,HALS,,,,,,,,,0,167,167,167,right,1,0.896798615467,2017_Jun_01_1216,98.8183085567,Stroop,B-1,1STACS-6,
neutralofneutral,down,"[-0.7725490196, 0.0745098039, -1]", ,19,MODE,,,,,,,,,0,168,168,168,down,1,0.590599922616,2017_Jun_01_1216,98.8183085567,Stroop,B-1,1STACS-6,
neutral,down,"[-0.7725490196, 0.0745098039, -1]", ,10,PECH,,,,,,,,,0,169,169,169,down,1,0.512772433368,2017_Jun_01_1216,98.8183085567,Stroop,B-1,1STACS-6,
neutral,down,"[-0.7725490196, 0.0745098039, -1]", ,13,SOLL,,,,,,,,,0,170,170,170,down,1,0.570171348593,2017_Jun_01_1216,98.8183085567,Stroop,B-1,1STACS-6,
neutralofneutral,down,"[-0.7725490196, 0.0745098039, -1]", ,16,HALS,,,,,,,,,0,171,171,171,down,1,0.483980505902,2017_Jun_01_1216,98.8183085567,Stroop,B-1,1STACS-6,
neutral,right,"[-0.8745098039, -0.2078431373, 0.637254902]", ,11,PECH,,,,,,,,,0,172,172,172,right,1,0.742192094247,2017_Jun_01_1216,98.8183085567,Stroop,B-1,1STACS-6,
congruent,left,"[0.568627451, -0.7882352941, -0.7882352941]", ,0,ROT,,,,,,,,,0,173,173,173,left,1,0.643949440502,2017_Jun_01_1216,98.8183085567,Stroop,B-1,1STACS-6,
congruent,right,"[-0.8745098039, -0.2078431373, 0.637254902]", ,8,BLAU,,,,,,,,,0,174,174,174,right,1,1.12473540632,2017_Jun_01_1216,98.8183085567,Stroop,B-1,1STACS-6,
congruent,down,"[-0.7725490196, 0.0745098039, -1]", ,4,GRÜN,,,,,,,,,0,175,175,175,down,1,0.590539859116,2017_Jun_01_1216,98.8183085567,Stroop,B-1,1STACS-6,
neutral,down,"[-0.7725490196, 0.0745098039, -1]", ,10,PECH,,,,,,,,,0,176,176,176,down,1,0.590862525824,2017_Jun_01_1216,98.8183085567,Stroop,B-1,1STACS-6,
neutral,left,"[0.568627451, -0.7882352941, -0.7882352941]", ,9,PECH,,,,,,,,,0,177,177,177,left,1,0.622305069499,2017_Jun_01_1216,98.8183085567,Stroop,B-1,1STACS-6,
neutral,right,"[-0.8745098039, -0.2078431373, 0.637254902]", ,14,SOLL,,,,,,,,,0,178,178,178,right,1,0.590787097243,2017_Jun_01_1216,98.8183085567,Stroop,B-1,1STACS-6,
congruent,down,"[-0.7725490196, 0.0745098039, -1]", ,4,GRÜN,,,,,,,,,0,179,179,179,down,1,0.622430225071,2017_Jun_01_1216,98.8183085567,Stroop,B-1,1STACS-6,
neutral,left,"[0.568627451, -0.7882352941, -0.7882352941]", ,12,SOLL,,,,,,,,,0,180,180,180,left,1,0.558624350302,2017_Jun_01_1216,98.8183085567,Stroop,B-1,1STACS-6,
congruent,right,"[-0.8745098039, -0.2078431373, 0.637254902]", ,8,BLAU,,,,,,,,,0,181,181,181,right,1,0.620597310552,2017_Jun_01_1216,98.8183085567,Stroop,B-1,1STACS-6,
congruent,left,"[0.568627451, -0.7882352941, -0.7882352941]", ,0,ROT,,,,,,,,,0,182,182,182,left,1,0.609240559903,2017_Jun_01_1216,98.8183085567,Stroop,B-1,1STACS-6,
neutral,down,"[-0.7725490196, 0.0745098039, -1]", ,13,SOLL,,,,,,,,,0,183,183,183,down,1,1.00474976568,2017_Jun_01_1216,98.8183085567,Stroop,B-1,1STACS-6,
neutral,down,"[-0.7725490196, 0.0745098039, -1]", ,10,PECH,,,,,,,,,0,184,184,184,down,1,0.622766860034,2017_Jun_01_1216,98.8183085567,Stroop,B-1,1STACS-6,
incongruent,down,"[-0.7725490196, 0.0745098039, -1]", ,7,BLAU,,,,,,,,,0,185,185,185,down,1,1.07168704402,2017_Jun_01_1216,98.8183085567,Stroop,B-1,1STACS-6,
incongruent,left,"[0.568627451, -0.7882352941, -0.7882352941]", ,3,GRÜN,,,,,,,,,0,186,186,186,left,1,0.826802009753,2017_Jun_01_1216,98.8183085567,Stroop,B-1,1STACS-6,
neutral,down,"[-0.7725490196, 0.0745098039, -1]", ,13,SOLL,,,,,,,,,0,187,187,187,down,1,0.880031400639,2017_Jun_01_1216,98.8183085567,Stroop,B-1,1STACS-6,
incongruent,right,"[-0.8745098039, -0.2078431373, 0.637254902]", ,2,ROT,,,,,,,,,0,188,188,188,right,1,0.644056996071,2017_Jun_01_1216,98.8183085567,Stroop,B-1,1STACS-6,
incongruent,left,"[0.568627451, -0.7882352941, -0.7882352941]", ,6,BLAU,,,,,,,,,0,189,189,189,left,1,0.750961923931,2017_Jun_01_1216,98.8183085567,Stroop,B-1,1STACS-6,
incongruent,down,"[-0.7725490196, 0.0745098039, -1]", ,1,ROT,,,,,,,,,0,190,190,190,down,1,0.602018412955,2017_Jun_01_1216,98.8183085567,Stroop,B-1,1STACS-6,
neutral,right,"[-0.8745098039, -0.2078431373, 0.637254902]", ,11,PECH,,,,,,,,,0,191,191,191,right,1,0.601868952618,2017_Jun_01_1216,98.8183085567,Stroop,B-1,1STACS-6,
neutral,right,"[-0.8745098039, -0.2078431373, 0.637254902]", ,14,SOLL,,,,,,,,,0,192,192,192,right,1,0.741663535449,2017_Jun_01_1216,98.8183085567,Stroop,B-1,1STACS-6,
incongruent,right,"[-0.8745098039, -0.2078431373, 0.637254902]", ,5,GRÜN,,,,,,,,,0,193,193,193,right,1,0.622369882205,2017_Jun_01_1216,98.8183085567,Stroop,B-1,1STACS-6,
neutral,left,"[0.568627451, -0.7882352941, -0.7882352941]", ,12,SOLL,,,,,,,,,0,194,194,194,left,1,0.748053733086,2017_Jun_01_1216,98.8183085567,Stroop,B-1,1STACS-6,
neutral,left,"[0.568627451, -0.7882352941, -0.7882352941]", ,9,PECH,,,,,,,,,0,195,195,195,left,1,0.620973056631,2017_Jun_01_1216,98.8183085567,Stroop,B-1,1STACS-6,
fix,return,white, ,21,+,,,,,,,,,0,196,196,196,None,0,,2017_Jun_01_1216,98.8183085567,Stroop,B-1,1STACS-6,
fix,return,white, ,21,+,,,,,,,,,0,197,197,197,None,0,,2017_Jun_01_1216,98.8183085567,Stroop,B-1,1STACS-6,
fix,return,white, ,21,+,,,,,,,,,0,198,198,198,None,0,,2017_Jun_01_1216,98.8183085567,Stroop,B-1,1STACS-6,
fix,return,white, ,21,+,,,,,,,,,0,199,199,199,None,0,,2017_Jun_01_1216,98.8183085567,Stroop,B-1,1STACS-6,
fix,return,white, ,21,+,,,,,,,,,0,200,200,200,None,0,,2017_Jun_01_1216,98.8183085567,Stroop,B-1,1STACS-6,
fix,return,white, ,21,+,,,,,,,,,0,201,201,201,None,0,,2017_Jun_01_1216,98.8183085567,Stroop,B-1,1STACS-6,
fix,return,white, ,21,+,,,,,,,,,0,202,202,202,None,0,,2017_Jun_01_1216,98.8183085567,Stroop,B-1,1STACS-6,
fix,return,white, ,21,+,,,,,,,,,0,203,203,203,None,0,,2017_Jun_01_1216,98.8183085567,Stroop,B-1,1STACS-6,
fix,return,white, ,21,+,,,,,,,,,0,204,204,204,None,0,,2017_Jun_01_1216,98.8183085567,Stroop,B-1,1STACS-6,
fix,return,white, ,21,+,,,,,,,,,0,205,205,205,None,0,,2017_Jun_01_1216,98.8183085567,Stroop,B-1,1STACS-6,
fix,return,white, ,21,+,,,,,,,,,0,206,206,206,None,0,,2017_Jun_01_1216,98.8183085567,Stroop,B-1,1STACS-6,
fix,return,white, ,21,+,,,,,,,,,0,207,207,207,None,0,,2017_Jun_01_1216,98.8183085567,Stroop,B-1,1STACS-6,
fix,return,white,+,22,+,,,,,,,,,0,208,208,208,None,0,,2017_Jun_01_1216,98.8183085567,Stroop,B-1,1STACS-6,
neutralofneutral,right,"[-0.8745098039, -0.2078431373, 0.637254902]", ,20,MODE,,,,,,,,,0,209,209,209,right,1,0.700974565203,2017_Jun_01_1216,98.8183085567,Stroop,B-1,1STACS-6,
neutralofneutral,left,"[0.568627451, -0.7882352941, -0.7882352941]", ,18,MODE,,,,,,,,,0,210,210,210,left,1,0.558658432846,2017_Jun_01_1216,98.8183085567,Stroop,B-1,1STACS-6,
neutral,left,"[0.568627451, -0.7882352941, -0.7882352941]", ,9,PECH,,,,,,,,,0,211,211,211,left,1,0.844513478668,2017_Jun_01_1216,98.8183085567,Stroop,B-1,1STACS-6,
neutral,down,"[-0.7725490196, 0.0745098039, -1]", ,10,PECH,,,,,,,,,0,212,212,212,down,1,0.684702944089,2017_Jun_01_1216,98.8183085567,Stroop,B-1,1STACS-6,
neutralofneutral,down,"[-0.7725490196, 0.0745098039, -1]", ,16,HALS,,,,,,,,,0,213,213,213,down,1,0.50535808322,2017_Jun_01_1216,98.8183085567,Stroop,B-1,1STACS-6,
neutral,right,"[-0.8745098039, -0.2078431373, 0.637254902]", ,11,PECH,,,,,,,,,0,214,214,214,right,1,0.527282936798,2017_Jun_01_1216,98.8183085567,Stroop,B-1,1STACS-6,
neutral,right,"[-0.8745098039, -0.2078431373, 0.637254902]", ,14,SOLL,,,,,,,,,0,215,215,215,right,1,0.451295904927,2017_Jun_01_1216,98.8183085567,Stroop,B-1,1STACS-6,
neutralofneutral,down,"[-0.7725490196, 0.0745098039, -1]", ,19,MODE,,,,,,,,,0,216,216,216,down,1,0.615911240116,2017_Jun_01_1216,98.8183085567,Stroop,B-1,1STACS-6,
neutral,down,"[-0.7725490196, 0.0745098039, -1]", ,13,SOLL,,,,,,,,,0,217,217,217,down,1,0.451095320774,2017_Jun_01_1216,98.8183085567,Stroop,B-1,1STACS-6,
neutral,left,"[0.568627451, -0.7882352941, -0.7882352941]", ,12,SOLL,,,,,,,,,0,218,218,218,left,1,0.494513129462,2017_Jun_01_1216,98.8183085567,Stroop,B-1,1STACS-6,
neutralofneutral,left,"[0.568627451, -0.7882352941, -0.7882352941]", ,15,HALS,,,,,,,,,0,219,219,219,left,1,0.612827607978,2017_Jun_01_1216,98.8183085567,Stroop,B-1,1STACS-6,
neutralofneutral,right,"[-0.8745098039, -0.2078431373, 0.637254902]", ,17,HALS,,,,,,,,,0,220,220,220,down,0,0.484483921839,2017_Jun_01_1216,98.8183085567,Stroop,B-1,1STACS-6,
neutral,left,"[0.568627451, -0.7882352941, -0.7882352941]", ,12,SOLL,,,,,,,,,0,221,221,221,left,1,0.613516801716,2017_Jun_01_1216,98.8183085567,Stroop,B-1,1STACS-6,
incongruent,right,"[-0.8745098039, -0.2078431373, 0.637254902]", ,5,GRÜN,,,,,,,,,0,222,222,222,right,1,0.663692452532,2017_Jun_01_1216,98.8183085567,Stroop,B-1,1STACS-6,
incongruent,left,"[0.568627451, -0.7882352941, -0.7882352941]", ,6,BLAU,,,,,,,,,0,223,223,223,left,1,0.66245905555,2017_Jun_01_1216,98.8183085567,Stroop,B-1,1STACS-6,
incongruent,left,"[0.568627451, -0.7882352941, -0.7882352941]", ,3,GRÜN,,,,,,,,,0,224,224,224,left,1,0.609145017034,2017_Jun_01_1216,98.8183085567,Stroop,B-1,1STACS-6,
incongruent,down,"[-0.7725490196, 0.0745098039, -1]", ,7,BLAU,,,,,,,,,0,225,225,225,down,1,0.684099794807,2017_Jun_01_1216,98.8183085567,Stroop,B-1,1STACS-6,
neutral,left,"[0.568627451, -0.7882352941, -0.7882352941]", ,9,PECH,,,,,,,,,0,226,226,226,left,1,0.706315746834,2017_Jun_01_1216,98.8183085567,Stroop,B-1,1STACS-6,
neutral,down,"[-0.7725490196, 0.0745098039, -1]", ,10,PECH,,,,,,,,,0,227,227,227,down,1,0.55836482011,2017_Jun_01_1216,98.8183085567,Stroop,B-1,1STACS-6,
incongruent,right,"[-0.8745098039, -0.2078431373, 0.637254902]", ,2,ROT,,,,,,,,,0,228,228,228,right,1,0.665828198835,2017_Jun_01_1216,98.8183085567,Stroop,B-1,1STACS-6,
neutral,right,"[-0.8745098039, -0.2078431373, 0.637254902]", ,14,SOLL,,,,,,,,,0,229,229,229,right,1,1.13521662669,2017_Jun_01_1216,98.8183085567,Stroop,B-1,1STACS-6,
neutral,right,"[-0.8745098039, -0.2078431373, 0.637254902]", ,11,PECH,,,,,,,,,0,230,230,230,right,1,0.622889221954,2017_Jun_01_1216,98.8183085567,Stroop,B-1,1STACS-6,
neutral,down,"[-0.7725490196, 0.0745098039, -1]", ,13,SOLL,,,,,,,,,0,231,231,231,down,1,0.665986040125,2017_Jun_01_1216,98.8183085567,Stroop,B-1,1STACS-6,
incongruent,down,"[-0.7725490196, 0.0745098039, -1]", ,1,ROT,,,,,,,,,0,232,232,232,down,1,0.623336485503,2017_Jun_01_1216,98.8183085567,Stroop,B-1,1STACS-6,
congruent,left,"[0.568627451, -0.7882352941, -0.7882352941]", ,0,ROT,,,,,,,,,0,233,233,233,left,1,0.547506177461,2017_Jun_01_1216,98.8183085567,Stroop,B-1,1STACS-6,
neutral,right,"[-0.8745098039, -0.2078431373, 0.637254902]", ,14,SOLL,,,,,,,,,0,234,234,234,right,1,0.838465223932,2017_Jun_01_1216,98.8183085567,Stroop,B-1,1STACS-6,
neutral,left,"[0.568627451, -0.7882352941, -0.7882352941]", ,9,PECH,,,,,,,,,0,235,235,235,left,1,0.677894536875,2017_Jun_01_1216,98.8183085567,Stroop,B-1,1STACS-6,
congruent,right,"[-0.8745098039, -0.2078431373, 0.637254902]", ,8,BLAU,,,,,,,,,0,236,236,236,None,0,,2017_Jun_01_1216,98.8183085567,Stroop,B-1,1STACS-6,
congruent,left,"[0.568627451, -0.7882352941, -0.7882352941]", ,0,ROT,,,,,,,,,0,237,237,237,left,1,0.567382726017,2017_Jun_01_1216,98.8183085567,Stroop,B-1,1STACS-6,
congruent,down,"[-0.7725490196, 0.0745098039, -1]", ,4,GRÜN,,,,,,,,,0,238,238,238,down,1,0.587572722231,2017_Jun_01_1216,98.8183085567,Stroop,B-1,1STACS-6,
neutral,down,"[-0.7725490196, 0.0745098039, -1]", ,13,SOLL,,,,,,,,,0,239,239,239,down,1,0.512549779371,2017_Jun_01_1216,98.8183085567,Stroop,B-1,1STACS-6,
congruent,right,"[-0.8745098039, -0.2078431373, 0.637254902]", ,8,BLAU,,,,,,,,,0,240,240,240,right,1,0.652721505107,2017_Jun_01_1216,98.8183085567,Stroop,B-1,1STACS-6,
neutral,left,"[0.568627451, -0.7882352941, -0.7882352941]", ,12,SOLL,,,,,,,,,0,241,241,241,left,1,0.493416062656,2017_Jun_01_1216,98.8183085567,Stroop,B-1,1STACS-6,
neutral,right,"[-0.8745098039, -0.2078431373, 0.637254902]", ,11,PECH,,,,,,,,,0,242,242,242,right,1,0.826508117651,2017_Jun_01_1216,98.8183085567,Stroop,B-1,1STACS-6,
neutral,down,"[-0.7725490196, 0.0745098039, -1]", ,10,PECH,,,,,,,,,0,243,243,243,down,1,0.591574627501,2017_Jun_01_1216,98.8183085567,Stroop,B-1,1STACS-6,
congruent,down,"[-0.7725490196, 0.0745098039, -1]", ,4,GRÜN,,,,,,,,,0,244,244,244,down,1,0.708494235999,2017_Jun_01_1216,98.8183085567,Stroop,B-1,1STACS-6,
fix,return,white, ,21,+,,,,,,,,,0,245,245,245,None,0,,2017_Jun_01_1216,98.8183085567,Stroop,B-1,1STACS-6,
fix,return,white, ,21,+,,,,,,,,,0,246,246,246,None,0,,2017_Jun_01_1216,98.8183085567,Stroop,B-1,1STACS-6,
fix,return,white, ,21,+,,,,,,,,,0,247,247,247,None,0,,2017_Jun_01_1216,98.8183085567,Stroop,B-1,1STACS-6,
fix,return,white, ,21,+,,,,,,,,,0,248,248,248,None,0,,2017_Jun_01_1216,98.8183085567,Stroop,B-1,1STACS-6,
fix,return,white, ,21,+,,,,,,,,,0,249,249,249,None,0,,2017_Jun_01_1216,98.8183085567,Stroop,B-1,1STACS-6,
fix,return,white, ,21,+,,,,,,,,,0,250,250,250,None,0,,2017_Jun_01_1216,98.8183085567,Stroop,B-1,1STACS-6,
fix,return,white, ,21,+,,,,,,,,,0,251,251,251,None,0,,2017_Jun_01_1216,98.8183085567,Stroop,B-1,1STACS-6,
fix,return,white, ,21,+,,,,,,,,,0,252,252,252,None,0,,2017_Jun_01_1216,98.8183085567,Stroop,B-1,1STACS-6,
fix,return,white, ,21,+,,,,,,,,,0,253,253,253,None,0,,2017_Jun_01_1216,98.8183085567,Stroop,B-1,1STACS-6,
fix,return,white, ,21,+,,,,,,,,,0,254,254,254,None,0,,2017_Jun_01_1216,98.8183085567,Stroop,B-1,1STACS-6,
fix,return,white, ,21,+,,,,,,,,,0,255,255,255,None,0,,2017_Jun_01_1216,98.8183085567,Stroop,B-1,1STACS-6,
fix,return,white, ,21,+,,,,,,,,,0,256,256,256,None,0,,2017_Jun_01_1216,98.8183085567,Stroop,B-1,1STACS-6,
fix,return,white,+,22,+,,,,,,,,,0,257,257,257,None,0,,2017_Jun_01_1216,98.8183085567,Stroop,B-1,1STACS-6,
incongruent,right,"[-0.8745098039, -0.2078431373, 0.637254902]", ,5,GRÜN,,,,,,,,,0,258,258,258,right,1,0.91226678251,2017_Jun_01_1216,98.8183085567,Stroop,B-1,1STACS-6,
neutral,down,"[-0.7725490196, 0.0745098039, -1]", ,10,PECH,,,,,,,,,0,259,259,259,down,1,0.569512046922,2017_Jun_01_1216,98.8183085567,Stroop,B-1,1STACS-6,
incongruent,down,"[-0.7725490196, 0.0745098039, -1]", ,7,BLAU,,,,,,,,,0,260,260,260,down,1,0.536997579301,2017_Jun_01_1216,98.8183085567,Stroop,B-1,1STACS-6,
incongruent,right,"[-0.8745098039, -0.2078431373, 0.637254902]", ,2,ROT,,,,,,,,,0,261,261,261,right,1,0.890527427368,2017_Jun_01_1216,98.8183085567,Stroop,B-1,1STACS-6,
neutral,down,"[-0.7725490196, 0.0745098039, -1]", ,13,SOLL,,,,,,,,,0,262,262,262,down,1,0.718866224618,2017_Jun_01_1216,98.8183085567,Stroop,B-1,1STACS-6,
incongruent,down,"[-0.7725490196, 0.0745098039, -1]", ,1,ROT,,,,,,,,,0,263,263,263,down,1,0.482897407352,2017_Jun_01_1216,98.8183085567,Stroop,B-1,1STACS-6,
neutral,left,"[0.568627451, -0.7882352941, -0.7882352941]", ,12,SOLL,,,,,,,,,0,264,264,264,left,1,0.952503460635,2017_Jun_01_1216,98.8183085567,Stroop,B-1,1STACS-6,
incongruent,left,"[0.568627451, -0.7882352941, -0.7882352941]", ,6,BLAU,,,,,,,,,0,265,265,265,left,1,0.609818566326,2017_Jun_01_1216,98.8183085567,Stroop,B-1,1STACS-6,
incongruent,left,"[0.568627451, -0.7882352941, -0.7882352941]", ,3,GRÜN,,,,,,,,,0,266,266,266,left,1,0.556555372261,2017_Jun_01_1216,98.8183085567,Stroop,B-1,1STACS-6,
neutral,right,"[-0.8745098039, -0.2078431373, 0.637254902]", ,11,PECH,,,,,,,,,0,267,267,267,right,1,0.71640250367,2017_Jun_01_1216,98.8183085567,Stroop,B-1,1STACS-6,
neutral,left,"[0.568627451, -0.7882352941, -0.7882352941]", ,9,PECH,,,,,,,,,0,268,268,268,left,1,0.567302548229,2017_Jun_01_1216,98.8183085567,Stroop,B-1,1STACS-6,
neutral,right,"[-0.8745098039, -0.2078431373, 0.637254902]", ,14,SOLL,,,,,,,,,0,269,269,269,right,1,0.738607281093,2017_Jun_01_1216,98.8183085567,Stroop,B-1,1STACS-6,
neutral,down,"[-0.7725490196, 0.0745098039, -1]", ,13,SOLL,,,,,,,,,0,270,270,270,down,1,0.676856974839,2017_Jun_01_1216,98.8183085567,Stroop,B-1,1STACS-6,
neutralofneutral,down,"[-0.7725490196, 0.0745098039, -1]", ,19,MODE,,,,,,,,,0,271,271,271,down,1,0.507094058044,2017_Jun_01_1216,98.8183085567,Stroop,B-1,1STACS-6,
neutral,left,"[0.568627451, -0.7882352941, -0.7882352941]", ,9,PECH,,,,,,,,,0,272,272,272,left,1,0.634016055113,2017_Jun_01_1216,98.8183085567,Stroop,B-1,1STACS-6,
neutral,right,"[-0.8745098039, -0.2078431373, 0.637254902]", ,14,SOLL,,,,,,,,,0,273,273,273,right,1,0.601164393799,2017_Jun_01_1216,98.8183085567,Stroop,B-1,1STACS-6,
neutral,down,"[-0.7725490196, 0.0745098039, -1]", ,10,PECH,,,,,,,,,0,274,274,274,down,1,0.644339154837,2017_Jun_01_1216,98.8183085567,Stroop,B-1,1STACS-6,
neutralofneutral,right,"[-0.8745098039, -0.2078431373, 0.637254902]", ,17,HALS,,,,,,,,,0,275,275,275,right,1,0.827958581328,2017_Jun_01_1216,98.8183085567,Stroop,B-1,1STACS-6,
neutralofneutral,left,"[0.568627451, -0.7882352941, -0.7882352941]", ,15,HALS,,,,,,,,,0,276,276,276,left,1,0.602257549493,2017_Jun_01_1216,98.8183085567,Stroop,B-1,1STACS-6,
neutral,right,"[-0.8745098039, -0.2078431373, 0.637254902]", ,11,PECH,,,,,,,,,0,277,277,277,right,1,0.686904341194,2017_Jun_01_1216,98.8183085567,Stroop,B-1,1STACS-6,
neutralofneutral,down,"[-0.7725490196, 0.0745098039, -1]", ,16,HALS,,,,,,,,,0,278,278,278,down,1,0.579661102179,2017_Jun_01_1216,98.8183085567,Stroop,B-1,1STACS-6,
neutral,left,"[0.568627451, -0.7882352941, -0.7882352941]", ,12,SOLL,,,,,,,,,0,279,279,279,left,1,0.611601474489,2017_Jun_01_1216,98.8183085567,Stroop,B-1,1STACS-6,
neutralofneutral,left,"[0.568627451, -0.7882352941, -0.7882352941]", ,18,MODE,,,,,,,,,0,280,280,280,left,1,0.690424341642,2017_Jun_01_1216,98.8183085567,Stroop,B-1,1STACS-6,
neutralofneutral,right,"[-0.8745098039, -0.2078431373, 0.637254902]", ,20,MODE,,,,,,,,,0,281,281,281,right,1,1.00877821064,2017_Jun_01_1216,98.8183085567,Stroop,B-1,1STACS-6,
congruent,right,"[-0.8745098039, -0.2078431373, 0.637254902]", ,8,BLAU,,,,,,,,,0,282,282,282,right,1,1.46875287222,2017_Jun_01_1216,98.8183085567,Stroop,B-1,1STACS-6,
neutral,left,"[0.568627451, -0.7882352941, -0.7882352941]", ,12,SOLL,,,,,,,,,0,283,283,283,left,1,1.18604878553,2017_Jun_01_1216,98.8183085567,Stroop,B-1,1STACS-6,
neutral,down,"[-0.7725490196, 0.0745098039, -1]", ,10,PECH,,,,,,,,,0,284,284,284,down,1,0.687708074629,2017_Jun_01_1216,98.8183085567,Stroop,B-1,1STACS-6,
neutral,left,"[0.568627451, -0.7882352941, -0.7882352941]", ,9,PECH,,,,,,,,,0,285,285,285,left,1,0.805413816561,2017_Jun_01_1216,98.8183085567,Stroop,B-1,1STACS-6,
neutral,right,"[-0.8745098039, -0.2078431373, 0.637254902]", ,14,SOLL,,,,,,,,,0,286,286,286,right,1,0.741266836987,2017_Jun_01_1216,98.8183085567,Stroop,B-1,1STACS-6,
neutral,down,"[-0.7725490196, 0.0745098039, -1]", ,13,SOLL,,,,,,,,,0,287,287,287,down,1,0.848069517215,2017_Jun_01_1216,98.8183085567,Stroop,B-1,1STACS-6,
congruent,left,"[0.568627451, -0.7882352941, -0.7882352941]", ,0,ROT,,,,,,,,,0,288,288,288,left,1,0.644478837394,2017_Jun_01_1216,98.8183085567,Stroop,B-1,1STACS-6,
congruent,down,"[-0.7725490196, 0.0745098039, -1]", ,4,GRÜN,,,,,,,,,0,289,289,289,down,1,0.676170854117,2017_Jun_01_1216,98.8183085567,Stroop,B-1,1STACS-6,
congruent,left,"[0.568627451, -0.7882352941, -0.7882352941]", ,0,ROT,,,,,,,,,0,290,290,290,left,1,0.976620771634,2017_Jun_01_1216,98.8183085567,Stroop,B-1,1STACS-6,
congruent,right,"[-0.8745098039, -0.2078431373, 0.637254902]", ,8,BLAU,,,,,,,,,0,291,291,291,right,1,0.687003795175,2017_Jun_01_1216,98.8183085567,Stroop,B-1,1STACS-6,
congruent,down,"[-0.7725490196, 0.0745098039, -1]", ,4,GRÜN,,,,,,,,,0,292,292,292,down,1,0.57957701328,2017_Jun_01_1216,98.8183085567,Stroop,B-1,1STACS-6,
neutral,right,"[-0.8745098039, -0.2078431373, 0.637254902]", ,11,PECH,,,,,,,,,0,293,293,293,right,1,0.705280978448,2017_Jun_01_1216,98.8183085567,Stroop,B-1,1STACS-6,
fix,return,white, ,21,+,,,,,,,,,0,294,294,294,None,0,,2017_Jun_01_1216,98.8183085567,Stroop,B-1,1STACS-6,
fix,return,white, ,21,+,,,,,,,,,0,295,295,295,None,0,,2017_Jun_01_1216,98.8183085567,Stroop,B-1,1STACS-6,
fix,return,white, ,21,+,,,,,,,,,0,296,296,296,None,0,,2017_Jun_01_1216,98.8183085567,Stroop,B-1,1STACS-6,
fix,return,white, ,21,+,,,,,,,,,0,297,297,297,None,0,,2017_Jun_01_1216,98.8183085567,Stroop,B-1,1STACS-6,
fix,return,white, ,21,+,,,,,,,,,0,298,298,298,None,0,,2017_Jun_01_1216,98.8183085567,Stroop,B-1,1STACS-6,
fix,return,white, ,21,+,,,,,,,,,0,299,299,299,None,0,,2017_Jun_01_1216,98.8183085567,Stroop,B-1,1STACS-6,
fix,return,white, ,21,+,,,,,,,,,0,300,300,300,None,0,,2017_Jun_01_1216,98.8183085567,Stroop,B-1,1STACS-6,
fix,return,white, ,21,+,,,,,,,,,0,301,301,301,None,0,,2017_Jun_01_1216,98.8183085567,Stroop,B-1,1STACS-6,
fix,return,white, ,21,+,,,,,,,,,0,302,302,302,None,0,,2017_Jun_01_1216,98.8183085567,Stroop,B-1,1STACS-6,
fix,return,white, ,21,+,,,,,,,,,0,303,303,303,None,0,,2017_Jun_01_1216,98.8183085567,Stroop,B-1,1STACS-6,
fix,return,white, ,21,+,,,,,,,,,0,304,304,304,None,0,,2017_Jun_01_1216,98.8183085567,Stroop,B-1,1STACS-6,
fix,return,white, ,21,+,,,,,,,,,0,305,305,305,None,0,,2017_Jun_01_1216,98.8183085567,Stroop,B-1,1STACS-6,
fix,return,white,+,22,+,,,,,,,,,0,306,306,306,None,0,,2017_Jun_01_1216,98.8183085567,Stroop,B-1,1STACS-6,
