best_paramset_1 = [45.5595199244, 0.60117891031199999, 32.946573159899998, 2.5887196273000002, 171.525393232, 439.95793511800002, 161.422409999]
best_paramset_statistic_1 = 17.4499592937
best_paramset_2 = [44.991276328399998, 0.65287410549500002, 54.262139676700002, 3.4347345231799999, 106.41369064, 443.30352871899998, 164.36312264899999]
best_paramset_statistic_2 = 17.4632657959
ID = "sdlpfc2sham"