filenames.txt
MyConfig10.py
MyConfig11.py
MyConfig12.py
MyConfig13.py
MyConfig14.py
MyConfig15.py
MyConfig16.py
MyConfig17.py
MyConfig18.py
MyConfig1.py
MyConfig2.py
MyConfig3.py
MyConfig4.py
MyConfig5.py
MyConfig6.py
MyConfig7.py
MyConfig8.py
MyConfig9.py
SMRI1_1A_2017_Okt_17_1330.csv
SMRI1_1A_2017_Okt_17_1330.log
SMRI1_1A_2017_Okt_17_1330.psydat
SMRI1_1A_2017_Okt_17_1330.xlsx
SMRI1_B2_2017_Okt_19_1310.csv
SMRI1_B2_2017_Okt_19_1310.log
SMRI1_B2_2017_Okt_19_1310.psydat
SMRI1_B2_2017_Okt_19_1310.xlsx
SMRI2_A2_2017_Okt_23_1216.csv
SMRI2_A2_2017_Okt_23_1216.log
SMRI2_A2_2017_Okt_23_1216.psydat
SMRI2_A2_2017_Okt_23_1216.xlsx
SMRI2_B1_2017_Okt_20_0921.csv
SMRI2_B1_2017_Okt_20_0921.log
SMRI2_B1_2017_Okt_20_0921.psydat
SMRI2_B1_2017_Okt_20_0921.xlsx
SMRI3_A2_2017_Nov_06_1046.csv
SMRI3_A2_2017_Nov_06_1046.log
SMRI3_A2_2017_Nov_06_1046.psydat
SMRI3_A2_2017_Nov_06_1046.xlsx
SMRI3_B1_2017_Nov_01_1546.csv
SMRI3_B1_2017_Nov_01_1546.log
SMRI3_B1_2017_Nov_01_1546.psydat
SMRI3_B1_2017_Nov_01_1546.xlsx
SMRI4_A2_2017_Nov_06_1630.csv
SMRI4_A2_2017_Nov_06_1630.log
SMRI4_A2_2017_Nov_06_1630.psydat
SMRI4_A2_2017_Nov_06_1630.xlsx
SMRI4_B1_2017_Nov_02_1645.csv
SMRI4_B1_2017_Nov_02_1645.log
SMRI4_B1_2017_Nov_02_1645.psydat
SMRI4_B1_2017_Nov_02_1645.xlsx
SMRI5_A1_2017_Nov_09_1717.csv
SMRI5_A1_2017_Nov_09_1717.log
SMRI5_A1_2017_Nov_09_1717.psydat
SMRI5_A1_2017_Nov_09_1717.xlsx
SMRI5_B1_2017_Nov_07_1800.csv
SMRI5_B1_2017_Nov_07_1800.log
SMRI5_B1_2017_Nov_07_1800.psydat
SMRI5_B1_2017_Nov_07_1800.xlsx
SMRI6_A1_2017_Nov_07_1857.csv
SMRI6_A1_2017_Nov_07_1857.log
SMRI6_A1_2017_Nov_07_1857.psydat
SMRI6_A1_2017_Nov_07_1857.xlsx
SMRI6_B2_2017_Nov_09_1451.csv
SMRI6_B2_2017_Nov_09_1451.log
SMRI6_B2_2017_Nov_09_1451.psydat
SMRI6_B2_2017_Nov_09_1451.xlsx
SMRI7_A1-2_2017_Nov_08_1529.csv
SMRI7_A1-2_2017_Nov_08_1529.log
SMRI7_A1-2_2017_Nov_08_1529.psydat
SMRI7_A1-2_2017_Nov_08_1529.xlsx
SMRI7_B2_2017_Nov_10_1210.csv
SMRI7_B2_2017_Nov_10_1210.log
SMRI7_B2_2017_Nov_10_1210.psydat
SMRI7_B2_2017_Nov_10_1210.xlsx
SMRI8_A1_2017_Nov_10_1406.csv
SMRI8_A1_2017_Nov_10_1406.log
SMRI8_A1_2017_Nov_10_1406.psydat
SMRI8_A1_2017_Nov_10_1406.xlsx
SMRI8_B2_2017_Nov_15_1105.csv
SMRI8_B2_2017_Nov_15_1105.log
SMRI8_B2_2017_Nov_15_1105.psydat
SMRI8_B2_2017_Nov_15_1105.xlsx
