best_paramset_1 = [120.96988292499999, 0.49883420013800001, 36.8655963637, 3.3831143990600001, 47.738631986900003, 275.32302742500002, 83.421082869599999]
best_paramset_statistic_1 = 7.07400268058
best_paramset_2 = [121.54131786000001, 0.50149375038999999, 35.681511615799998, 3.63434721506, 46.934827921100002, 271.29880406900003, 79.310547807899994]
best_paramset_statistic_2 = 7.63294939583
ID = "Tarana_propersims_42"