This is BibTeX, Version 0.99d (TeX Live 2015/Debian)
Capacity: max_strings=35307, hash_size=35307, hash_prime=30011
The top-level auxiliary file: conference_poster_4.aux
The style file: unsrt.bst
Database file #1: sample.bib
You've used 1 entry,
            1791 wiz_defined-function locations,
            453 strings with 3826 characters,
and the built_in function-call counts, 305 in all, are:
= -- 23
> -- 20
< -- 0
+ -- 7
- -- 6
* -- 31
:= -- 57
add.period$ -- 3
call.type$ -- 1
change.case$ -- 1
chr.to.int$ -- 0
cite$ -- 1
duplicate$ -- 9
empty$ -- 24
format.name$ -- 6
if$ -- 59
int.to.chr$ -- 0
int.to.str$ -- 1
missing$ -- 1
newline$ -- 8
num.names$ -- 1
pop$ -- 1
preamble$ -- 1
purify$ -- 0
quote$ -- 0
skip$ -- 3
stack$ -- 0
substring$ -- 22
swap$ -- 1
text.length$ -- 0
text.prefix$ -- 0
top$ -- 0
type$ -- 0
warning$ -- 0
while$ -- 3
width$ -- 2
write$ -- 13
