congruent,corrAns,letterColor,signal,selectedrownumber_novariable,Anzeigetext,practice.thisRepN,practice.thisTrialN,practice.thisN,practice.thisIndex,Wrongresponse.thisRepN,Wrongresponse.thisTrialN,Wrongresponse.thisN,Wrongresponse.thisIndex,trials.thisRepN,trials.thisTrialN,trials.thisN,trials.thisIndex,resp.keys,resp.corr,resp.rt,date,frameRate,expName,session,participant,
congruent,down,"[-0.7725490196, 0.0745098039, -1]", ,4,GRÜN,0,0,0,0,0,0,0,0,,,,,None,0,,2017_Apr_26_1509,96.9567160542,Stroop,A-1,2STRNS-6,
,,,,,,0,0,0,0,,,,,,,,,,,,2017_Apr_26_1509,96.9567160542,Stroop,A-1,2STRNS-6,
congruent,down,"[-0.7725490196, 0.0745098039, -1]", ,4,GRÜN,1,0,1,0,0,0,0,0,,,,,down,1,0.748392323605,2017_Apr_26_1509,96.9567160542,Stroop,A-1,2STRNS-6,
,,,,,,1,0,1,0,,,,,,,,,,,,2017_Apr_26_1509,96.9567160542,Stroop,A-1,2STRNS-6,
incongruent,right,"[-0.8745098039, -0.2078431373, 0.637254902]", ,5,GRÜN,2,0,2,0,0,0,0,0,,,,,right,1,0.974447311041,2017_Apr_26_1509,96.9567160542,Stroop,A-1,2STRNS-6,
,,,,,,2,0,2,0,,,,,,,,,,,,2017_Apr_26_1509,96.9567160542,Stroop,A-1,2STRNS-6,
incongruent,left,"[0.568627451, -0.7882352941, -0.7882352941]", ,3,GRÜN,3,0,3,0,0,0,0,0,,,,,left,1,0.973317558517,2017_Apr_26_1509,96.9567160542,Stroop,A-1,2STRNS-6,
,,,,,,3,0,3,0,,,,,,,,,,,,2017_Apr_26_1509,96.9567160542,Stroop,A-1,2STRNS-6,
neutralofneutral,down,"[-0.7725490196, 0.0745098039, -1]", ,16,HALS,4,0,4,0,0,0,0,0,,,,,down,1,1.17292309497,2017_Apr_26_1509,96.9567160542,Stroop,A-1,2STRNS-6,
,,,,,,4,0,4,0,,,,,,,,,,,,2017_Apr_26_1509,96.9567160542,Stroop,A-1,2STRNS-6,
neutral,left,"[0.568627451, -0.7882352941, -0.7882352941]", ,12,SOLL,5,0,5,0,0,0,0,0,,,,,left,1,0.641295192545,2017_Apr_26_1509,96.9567160542,Stroop,A-1,2STRNS-6,
,,,,,,5,0,5,0,,,,,,,,,,,,2017_Apr_26_1509,96.9567160542,Stroop,A-1,2STRNS-6,
neutral,left,"[0.568627451, -0.7882352941, -0.7882352941]", ,9,PECH,6,0,6,0,0,0,0,0,,,,,left,1,0.6311740738,2017_Apr_26_1509,96.9567160542,Stroop,A-1,2STRNS-6,
,,,,,,6,0,6,0,,,,,,,,,,,,2017_Apr_26_1509,96.9567160542,Stroop,A-1,2STRNS-6,
neutralofneutral,down,"[-0.7725490196, 0.0745098039, -1]", ,19,MODE,7,0,7,0,0,0,0,0,,,,,right,0,0.808380953446,2017_Apr_26_1509,96.9567160542,Stroop,A-1,2STRNS-6,
,,,,,,7,0,7,0,,,,,,,,,,,,2017_Apr_26_1509,96.9567160542,Stroop,A-1,2STRNS-6,
neutralofneutral,down,"[-0.7725490196, 0.0745098039, -1]", ,19,MODE,8,0,8,0,0,0,0,0,,,,,down,1,0.616742071967,2017_Apr_26_1509,96.9567160542,Stroop,A-1,2STRNS-6,
,,,,,,8,0,8,0,,,,,,,,,,,,2017_Apr_26_1509,96.9567160542,Stroop,A-1,2STRNS-6,
incongruent,left,"[0.568627451, -0.7882352941, -0.7882352941]", ,3,GRÜN,9,0,9,0,0,0,0,0,,,,,left,1,0.459957899677,2017_Apr_26_1509,96.9567160542,Stroop,A-1,2STRNS-6,
,,,,,,9,0,9,0,,,,,,,,,,,,2017_Apr_26_1509,96.9567160542,Stroop,A-1,2STRNS-6,
neutralofneutral,right,"[-0.8745098039, -0.2078431373, 0.637254902]", ,17,HALS,10,0,10,0,0,0,0,0,,,,,right,1,1.05725839457,2017_Apr_26_1509,96.9567160542,Stroop,A-1,2STRNS-6,
,,,,,,10,0,10,0,,,,,,,,,,,,2017_Apr_26_1509,96.9567160542,Stroop,A-1,2STRNS-6,
incongruent,down,"[-0.7725490196, 0.0745098039, -1]", ,7,BLAU,11,0,11,0,0,0,0,0,,,,,down,1,0.96563892897,2017_Apr_26_1509,96.9567160542,Stroop,A-1,2STRNS-6,
,,,,,,11,0,11,0,,,,,,,,,,,,2017_Apr_26_1509,96.9567160542,Stroop,A-1,2STRNS-6,
congruent,right,"[-0.8745098039, -0.2078431373, 0.637254902]", ,8,BLAU,12,0,12,0,0,0,0,0,,,,,right,1,0.852934381325,2017_Apr_26_1509,96.9567160542,Stroop,A-1,2STRNS-6,
,,,,,,12,0,12,0,,,,,,,,,,,,2017_Apr_26_1509,96.9567160542,Stroop,A-1,2STRNS-6,
incongruent,right,"[-0.8745098039, -0.2078431373, 0.637254902]", ,2,ROT,13,0,13,0,0,0,0,0,,,,,left,0,0.762934115928,2017_Apr_26_1509,96.9567160542,Stroop,A-1,2STRNS-6,
,,,,,,13,0,13,0,,,,,,,,,,,,2017_Apr_26_1509,96.9567160542,Stroop,A-1,2STRNS-6,
incongruent,right,"[-0.8745098039, -0.2078431373, 0.637254902]", ,2,ROT,14,0,14,0,0,0,0,0,,,,,None,0,,2017_Apr_26_1509,96.9567160542,Stroop,A-1,2STRNS-6,
,,,,,,14,0,14,0,,,,,,,,,,,,2017_Apr_26_1509,96.9567160542,Stroop,A-1,2STRNS-6,
incongruent,right,"[-0.8745098039, -0.2078431373, 0.637254902]", ,2,ROT,15,0,15,0,0,0,0,0,,,,,right,1,0.870218980345,2017_Apr_26_1509,96.9567160542,Stroop,A-1,2STRNS-6,
,,,,,,15,0,15,0,,,,,,,,,,,,2017_Apr_26_1509,96.9567160542,Stroop,A-1,2STRNS-6,
neutralofneutral,down,"[-0.7725490196, 0.0745098039, -1]", ,16,HALS,16,0,16,0,0,0,0,0,,,,,down,1,0.865399094018,2017_Apr_26_1509,96.9567160542,Stroop,A-1,2STRNS-6,
,,,,,,16,0,16,0,,,,,,,,,,,,2017_Apr_26_1509,96.9567160542,Stroop,A-1,2STRNS-6,
neutralofneutral,right,"[-0.8745098039, -0.2078431373, 0.637254902]", ,20,MODE,17,0,17,0,0,0,0,0,,,,,right,1,0.659798940927,2017_Apr_26_1509,96.9567160542,Stroop,A-1,2STRNS-6,
,,,,,,17,0,17,0,,,,,,,,,,,,2017_Apr_26_1509,96.9567160542,Stroop,A-1,2STRNS-6,
incongruent,left,"[0.568627451, -0.7882352941, -0.7882352941]", ,6,BLAU,18,0,18,0,0,0,0,0,,,,,left,1,0.708762147145,2017_Apr_26_1509,96.9567160542,Stroop,A-1,2STRNS-6,
,,,,,,18,0,18,0,,,,,,,,,,,,2017_Apr_26_1509,96.9567160542,Stroop,A-1,2STRNS-6,
neutral,right,"[-0.8745098039, -0.2078431373, 0.637254902]", ,14,SOLL,19,0,19,0,0,0,0,0,,,,,right,1,0.931427038911,2017_Apr_26_1509,96.9567160542,Stroop,A-1,2STRNS-6,
,,,,,,19,0,19,0,,,,,,,,,,,,2017_Apr_26_1509,96.9567160542,Stroop,A-1,2STRNS-6,
incongruent,left,"[0.568627451, -0.7882352941, -0.7882352941]", ,6,BLAU,20,0,20,0,0,0,0,0,,,,,left,1,0.91292496672,2017_Apr_26_1509,96.9567160542,Stroop,A-1,2STRNS-6,
,,,,,,20,0,20,0,,,,,,,,,,,,2017_Apr_26_1509,96.9567160542,Stroop,A-1,2STRNS-6,
neutralofneutral,right,"[-0.8745098039, -0.2078431373, 0.637254902]", ,20,MODE,21,0,21,0,0,0,0,0,,,,,right,1,1.0422757641,2017_Apr_26_1509,96.9567160542,Stroop,A-1,2STRNS-6,
,,,,,,21,0,21,0,,,,,,,,,,,,2017_Apr_26_1509,96.9567160542,Stroop,A-1,2STRNS-6,
neutralofneutral,right,"[-0.8745098039, -0.2078431373, 0.637254902]", ,17,HALS,22,0,22,0,0,0,0,0,,,,,right,1,0.909358871029,2017_Apr_26_1509,96.9567160542,Stroop,A-1,2STRNS-6,
,,,,,,22,0,22,0,,,,,,,,,,,,2017_Apr_26_1509,96.9567160542,Stroop,A-1,2STRNS-6,
neutralofneutral,left,"[0.568627451, -0.7882352941, -0.7882352941]", ,15,HALS,23,0,23,0,0,0,0,0,,,,,left,1,0.642797059403,2017_Apr_26_1509,96.9567160542,Stroop,A-1,2STRNS-6,
,,,,,,23,0,23,0,,,,,,,,,,,,2017_Apr_26_1509,96.9567160542,Stroop,A-1,2STRNS-6,
incongruent,left,"[0.568627451, -0.7882352941, -0.7882352941]", ,6,BLAU,24,0,24,0,0,0,0,0,,,,,left,1,0.882860531157,2017_Apr_26_1509,96.9567160542,Stroop,A-1,2STRNS-6,
,,,,,,24,0,24,0,,,,,,,,,,,,2017_Apr_26_1509,96.9567160542,Stroop,A-1,2STRNS-6,
neutralofneutral,left,"[0.568627451, -0.7882352941, -0.7882352941]", ,15,HALS,25,0,25,0,0,0,0,0,,,,,right,0,0.872970726727,2017_Apr_26_1509,96.9567160542,Stroop,A-1,2STRNS-6,
,,,,,,25,0,25,0,,,,,,,,,,,,2017_Apr_26_1509,96.9567160542,Stroop,A-1,2STRNS-6,
neutralofneutral,left,"[0.568627451, -0.7882352941, -0.7882352941]", ,15,HALS,26,0,26,0,0,0,0,0,,,,,left,1,0.663428452499,2017_Apr_26_1509,96.9567160542,Stroop,A-1,2STRNS-6,
,,,,,,26,0,26,0,,,,,,,,,,,,2017_Apr_26_1509,96.9567160542,Stroop,A-1,2STRNS-6,
neutral,right,"[-0.8745098039, -0.2078431373, 0.637254902]", ,11,PECH,27,0,27,0,0,0,0,0,,,,,right,1,0.738948665264,2017_Apr_26_1509,96.9567160542,Stroop,A-1,2STRNS-6,
,,,,,,27,0,27,0,,,,,,,,,,,,2017_Apr_26_1509,96.9567160542,Stroop,A-1,2STRNS-6,
incongruent,down,"[-0.7725490196, 0.0745098039, -1]", ,1,ROT,28,0,28,0,0,0,0,0,,,,,down,1,0.924682047578,2017_Apr_26_1509,96.9567160542,Stroop,A-1,2STRNS-6,
,,,,,,28,0,28,0,,,,,,,,,,,,2017_Apr_26_1509,96.9567160542,Stroop,A-1,2STRNS-6,
neutralofneutral,right,"[-0.8745098039, -0.2078431373, 0.637254902]", ,20,MODE,29,0,29,0,0,0,0,0,,,,,right,1,0.925918796943,2017_Apr_26_1509,96.9567160542,Stroop,A-1,2STRNS-6,
,,,,,,29,0,29,0,,,,,,,,,,,,2017_Apr_26_1509,96.9567160542,Stroop,A-1,2STRNS-6,
neutralofneutral,right,"[-0.8745098039, -0.2078431373, 0.637254902]", ,20,MODE,30,0,30,0,0,0,0,0,,,,,right,1,0.882998537523,2017_Apr_26_1509,96.9567160542,Stroop,A-1,2STRNS-6,
,,,,,,30,0,30,0,,,,,,,,,,,,2017_Apr_26_1509,96.9567160542,Stroop,A-1,2STRNS-6,
neutralofneutral,left,"[0.568627451, -0.7882352941, -0.7882352941]", ,15,HALS,31,0,31,0,0,0,0,0,,,,,left,1,0.609281067845,2017_Apr_26_1509,96.9567160542,Stroop,A-1,2STRNS-6,
,,,,,,31,0,31,0,,,,,,,,,,,,2017_Apr_26_1509,96.9567160542,Stroop,A-1,2STRNS-6,
incongruent,down,"[-0.7725490196, 0.0745098039, -1]", ,7,BLAU,32,0,32,0,0,0,0,0,,,,,left,0,0.806072559501,2017_Apr_26_1509,96.9567160542,Stroop,A-1,2STRNS-6,
,,,,,,32,0,32,0,,,,,,,,,,,,2017_Apr_26_1509,96.9567160542,Stroop,A-1,2STRNS-6,
incongruent,down,"[-0.7725490196, 0.0745098039, -1]", ,7,BLAU,33,0,33,0,0,0,0,0,,,,,down,1,0.966775944988,2017_Apr_26_1509,96.9567160542,Stroop,A-1,2STRNS-6,
,,,,,,33,0,33,0,,,,,,,,,,,,2017_Apr_26_1509,96.9567160542,Stroop,A-1,2STRNS-6,
neutralofneutral,right,"[-0.8745098039, -0.2078431373, 0.637254902]", ,20,MODE,34,0,34,0,0,0,0,0,,,,,right,1,1.2930249515,2017_Apr_26_1509,96.9567160542,Stroop,A-1,2STRNS-6,
,,,,,,34,0,34,0,,,,,,,,,,,,2017_Apr_26_1509,96.9567160542,Stroop,A-1,2STRNS-6,
incongruent,left,"[0.568627451, -0.7882352941, -0.7882352941]", ,3,GRÜN,35,0,35,0,0,0,0,0,,,,,left,1,0.716660637037,2017_Apr_26_1509,96.9567160542,Stroop,A-1,2STRNS-6,
,,,,,,35,0,35,0,,,,,,,,,,,,2017_Apr_26_1509,96.9567160542,Stroop,A-1,2STRNS-6,
neutralofneutral,left,"[0.568627451, -0.7882352941, -0.7882352941]", ,18,MODE,36,0,36,0,0,0,0,0,,,,,left,1,0.882787896227,2017_Apr_26_1509,96.9567160542,Stroop,A-1,2STRNS-6,
,,,,,,36,0,36,0,,,,,,,,,,,,2017_Apr_26_1509,96.9567160542,Stroop,A-1,2STRNS-6,
neutral,left,"[0.568627451, -0.7882352941, -0.7882352941]", ,12,SOLL,37,0,37,0,0,0,0,0,,,,,left,1,0.67687178119,2017_Apr_26_1509,96.9567160542,Stroop,A-1,2STRNS-6,
,,,,,,37,0,37,0,,,,,,,,,,,,2017_Apr_26_1509,96.9567160542,Stroop,A-1,2STRNS-6,
neutralofneutral,right,"[-0.8745098039, -0.2078431373, 0.637254902]", ,20,MODE,38,0,38,0,0,0,0,0,,,,,right,1,0.637894201637,2017_Apr_26_1509,96.9567160542,Stroop,A-1,2STRNS-6,
,,,,,,38,0,38,0,,,,,,,,,,,,2017_Apr_26_1509,96.9567160542,Stroop,A-1,2STRNS-6,
congruent,down,"[-0.7725490196, 0.0745098039, -1]", ,4,GRÜN,39,0,39,0,0,0,0,0,,,,,down,1,0.589993420952,2017_Apr_26_1509,96.9567160542,Stroop,A-1,2STRNS-6,
,,,,,,39,0,39,0,,,,,,,,,,,,2017_Apr_26_1509,96.9567160542,Stroop,A-1,2STRNS-6,
incongruent,right,"[-0.8745098039, -0.2078431373, 0.637254902]", ,2,ROT,40,0,40,0,0,0,0,0,,,,,right,1,0.787573839692,2017_Apr_26_1509,96.9567160542,Stroop,A-1,2STRNS-6,
,,,,,,40,0,40,0,,,,,,,,,,,,2017_Apr_26_1509,96.9567160542,Stroop,A-1,2STRNS-6,
neutralofneutral,right,"[-0.8745098039, -0.2078431373, 0.637254902]", ,17,HALS,41,0,41,0,0,0,0,0,,,,,left,0,0.675809635023,2017_Apr_26_1509,96.9567160542,Stroop,A-1,2STRNS-6,
,,,,,,41,0,41,0,,,,,,,,,,,,2017_Apr_26_1509,96.9567160542,Stroop,A-1,2STRNS-6,
neutralofneutral,right,"[-0.8745098039, -0.2078431373, 0.637254902]", ,17,HALS,42,0,42,0,0,0,0,0,,,,,right,1,0.632543521593,2017_Apr_26_1509,96.9567160542,Stroop,A-1,2STRNS-6,
,,,,,,42,0,42,0,,,,,,,,,,,,2017_Apr_26_1509,96.9567160542,Stroop,A-1,2STRNS-6,
incongruent,left,"[0.568627451, -0.7882352941, -0.7882352941]", ,3,GRÜN,43,0,43,0,0,0,0,0,,,,,down,0,0.972522206034,2017_Apr_26_1509,96.9567160542,Stroop,A-1,2STRNS-6,
,,,,,,43,0,43,0,,,,,,,,,,,,2017_Apr_26_1509,96.9567160542,Stroop,A-1,2STRNS-6,
incongruent,left,"[0.568627451, -0.7882352941, -0.7882352941]", ,3,GRÜN,44,0,44,0,0,0,0,0,,,,,down,0,0.834012423366,2017_Apr_26_1509,96.9567160542,Stroop,A-1,2STRNS-6,
,,,,,,44,0,44,0,,,,,,,,,,,,2017_Apr_26_1509,96.9567160542,Stroop,A-1,2STRNS-6,
incongruent,left,"[0.568627451, -0.7882352941, -0.7882352941]", ,3,GRÜN,45,0,45,0,0,0,0,0,,,,,left,1,0.460212401297,2017_Apr_26_1509,96.9567160542,Stroop,A-1,2STRNS-6,
,,,,,,45,0,45,0,,,,,,,,,,,,2017_Apr_26_1509,96.9567160542,Stroop,A-1,2STRNS-6,
incongruent,down,"[-0.7725490196, 0.0745098039, -1]", ,1,ROT,46,0,46,0,0,0,0,0,,,,,down,1,1.12993969904,2017_Apr_26_1509,96.9567160542,Stroop,A-1,2STRNS-6,
,,,,,,46,0,46,0,,,,,,,,,,,,2017_Apr_26_1509,96.9567160542,Stroop,A-1,2STRNS-6,
incongruent,right,"[-0.8745098039, -0.2078431373, 0.637254902]", ,2,ROT,47,0,47,0,0,0,0,0,,,,,right,1,1.27860328617,2017_Apr_26_1509,96.9567160542,Stroop,A-1,2STRNS-6,
,,,,,,47,0,47,0,,,,,,,,,,,,2017_Apr_26_1509,96.9567160542,Stroop,A-1,2STRNS-6,
congruent,left,"[0.568627451, -0.7882352941, -0.7882352941]", ,0,ROT,48,0,48,0,0,0,0,0,,,,,left,1,0.883918766212,2017_Apr_26_1509,96.9567160542,Stroop,A-1,2STRNS-6,
,,,,,,48,0,48,0,,,,,,,,,,,,2017_Apr_26_1509,96.9567160542,Stroop,A-1,2STRNS-6,
neutralofneutral,down,"[-0.7725490196, 0.0745098039, -1]", ,19,MODE,49,0,49,0,0,0,0,0,,,,,down,1,1.01268094129,2017_Apr_26_1509,96.9567160542,Stroop,A-1,2STRNS-6,
,,,,,,49,0,49,0,,,,,,,,,,,,2017_Apr_26_1509,96.9567160542,Stroop,A-1,2STRNS-6,
incongruent,down,"[-0.7725490196, 0.0745098039, -1]", ,1,ROT,50,0,50,0,0,0,0,0,,,,,down,1,0.955891600748,2017_Apr_26_1509,96.9567160542,Stroop,A-1,2STRNS-6,
,,,,,,50,0,50,0,,,,,,,,,,,,2017_Apr_26_1509,96.9567160542,Stroop,A-1,2STRNS-6,
congruent,down,"[-0.7725490196, 0.0745098039, -1]", ,4,GRÜN,51,0,51,0,0,0,0,0,,,,,left,0,0.833643102685,2017_Apr_26_1509,96.9567160542,Stroop,A-1,2STRNS-6,
,,,,,,51,0,51,0,,,,,,,,,,,,2017_Apr_26_1509,96.9567160542,Stroop,A-1,2STRNS-6,
congruent,down,"[-0.7725490196, 0.0745098039, -1]", ,4,GRÜN,52,0,52,0,0,0,0,0,,,,,down,1,0.483586321725,2017_Apr_26_1509,96.9567160542,Stroop,A-1,2STRNS-6,
,,,,,,52,0,52,0,,,,,,,,,,,,2017_Apr_26_1509,96.9567160542,Stroop,A-1,2STRNS-6,
neutralofneutral,right,"[-0.8745098039, -0.2078431373, 0.637254902]", ,17,HALS,53,0,53,0,0,0,0,0,,,,,right,1,0.797235402823,2017_Apr_26_1509,96.9567160542,Stroop,A-1,2STRNS-6,
,,,,,,53,0,53,0,,,,,,,,,,,,2017_Apr_26_1509,96.9567160542,Stroop,A-1,2STRNS-6,
neutral,right,"[-0.8745098039, -0.2078431373, 0.637254902]", ,11,PECH,54,0,54,0,0,0,0,0,,,,,right,1,0.956227676981,2017_Apr_26_1509,96.9567160542,Stroop,A-1,2STRNS-6,
,,,,,,54,0,54,0,,,,,,,,,,,,2017_Apr_26_1509,96.9567160542,Stroop,A-1,2STRNS-6,
neutralofneutral,right,"[-0.8745098039, -0.2078431373, 0.637254902]", ,20,MODE,55,0,55,0,0,0,0,0,,,,,right,1,0.672862612428,2017_Apr_26_1509,96.9567160542,Stroop,A-1,2STRNS-6,
,,,,,,55,0,55,0,,,,,,,,,,,,2017_Apr_26_1509,96.9567160542,Stroop,A-1,2STRNS-6,
neutralofneutral,down,"[-0.7725490196, 0.0745098039, -1]", ,16,HALS,56,0,56,0,0,0,0,0,,,,,down,1,0.817163075195,2017_Apr_26_1509,96.9567160542,Stroop,A-1,2STRNS-6,
,,,,,,56,0,56,0,,,,,,,,,,,,2017_Apr_26_1509,96.9567160542,Stroop,A-1,2STRNS-6,
neutral,down,"[-0.7725490196, 0.0745098039, -1]", ,10,PECH,57,0,57,0,0,0,0,0,,,,,down,1,0.662913023862,2017_Apr_26_1509,96.9567160542,Stroop,A-1,2STRNS-6,
,,,,,,57,0,57,0,,,,,,,,,,,,2017_Apr_26_1509,96.9567160542,Stroop,A-1,2STRNS-6,
incongruent,down,"[-0.7725490196, 0.0745098039, -1]", ,1,ROT,58,0,58,0,0,0,0,0,,,,,down,1,0.558488578856,2017_Apr_26_1509,96.9567160542,Stroop,A-1,2STRNS-6,
,,,,,,58,0,58,0,,,,,,,,,,,,2017_Apr_26_1509,96.9567160542,Stroop,A-1,2STRNS-6,
neutral,right,"[-0.8745098039, -0.2078431373, 0.637254902]", ,11,PECH,59,0,59,0,0,0,0,0,,,,,right,1,0.745248627968,2017_Apr_26_1509,96.9567160542,Stroop,A-1,2STRNS-6,
,,,,,,59,0,59,0,,,,,,,,,,,,2017_Apr_26_1509,96.9567160542,Stroop,A-1,2STRNS-6,
neutral,right,"[-0.8745098039, -0.2078431373, 0.637254902]", ,14,SOLL,60,0,60,0,0,0,0,0,,,,,right,1,0.740891649637,2017_Apr_26_1509,96.9567160542,Stroop,A-1,2STRNS-6,
,,,,,,60,0,60,0,,,,,,,,,,,,2017_Apr_26_1509,96.9567160542,Stroop,A-1,2STRNS-6,
neutralofneutral,down,"[-0.7725490196, 0.0745098039, -1]", ,16,HALS,61,0,61,0,0,0,0,0,,,,,down,1,0.892884710208,2017_Apr_26_1509,96.9567160542,Stroop,A-1,2STRNS-6,
,,,,,,61,0,61,0,,,,,,,,,,,,2017_Apr_26_1509,96.9567160542,Stroop,A-1,2STRNS-6,
congruent,down,"[-0.7725490196, 0.0745098039, -1]", ,4,GRÜN,62,0,62,0,0,0,0,0,,,,,down,1,0.627200943137,2017_Apr_26_1509,96.9567160542,Stroop,A-1,2STRNS-6,
,,,,,,62,0,62,0,,,,,,,,,,,,2017_Apr_26_1509,96.9567160542,Stroop,A-1,2STRNS-6,
congruent,left,"[0.568627451, -0.7882352941, -0.7882352941]", ,0,ROT,63,0,63,0,0,0,0,0,,,,,right,0,0.891253497301,2017_Apr_26_1509,96.9567160542,Stroop,A-1,2STRNS-6,
,,,,,,63,0,63,0,,,,,,,,,,,,2017_Apr_26_1509,96.9567160542,Stroop,A-1,2STRNS-6,
congruent,left,"[0.568627451, -0.7882352941, -0.7882352941]", ,0,ROT,64,0,64,0,0,0,0,0,,,,,down,0,0.472801152101,2017_Apr_26_1509,96.9567160542,Stroop,A-1,2STRNS-6,
,,,,,,64,0,64,0,,,,,,,,,,,,2017_Apr_26_1509,96.9567160542,Stroop,A-1,2STRNS-6,
congruent,left,"[0.568627451, -0.7882352941, -0.7882352941]", ,0,ROT,65,0,65,0,0,0,0,0,,,,,left,1,0.504947416501,2017_Apr_26_1509,96.9567160542,Stroop,A-1,2STRNS-6,
,,,,,,65,0,65,0,,,,,,,,,,,,2017_Apr_26_1509,96.9567160542,Stroop,A-1,2STRNS-6,
congruent,right,"[-0.8745098039, -0.2078431373, 0.637254902]", ,8,BLAU,66,0,66,0,0,0,0,0,,,,,right,1,0.692227364093,2017_Apr_26_1509,96.9567160542,Stroop,A-1,2STRNS-6,
,,,,,,66,0,66,0,,,,,,,,,,,,2017_Apr_26_1509,96.9567160542,Stroop,A-1,2STRNS-6,
congruent,right,"[-0.8745098039, -0.2078431373, 0.637254902]", ,8,BLAU,67,0,67,0,0,0,0,0,,,,,right,1,0.689340963726,2017_Apr_26_1509,96.9567160542,Stroop,A-1,2STRNS-6,
,,,,,,67,0,67,0,,,,,,,,,,,,2017_Apr_26_1509,96.9567160542,Stroop,A-1,2STRNS-6,
neutral,down,"[-0.7725490196, 0.0745098039, -1]", ,13,SOLL,68,0,68,0,0,0,0,0,,,,,down,1,0.892507567303,2017_Apr_26_1509,96.9567160542,Stroop,A-1,2STRNS-6,
,,,,,,68,0,68,0,,,,,,,,,,,,2017_Apr_26_1509,96.9567160542,Stroop,A-1,2STRNS-6,
congruent,left,"[0.568627451, -0.7882352941, -0.7882352941]", ,0,ROT,69,0,69,0,0,0,0,0,,,,,down,0,0.916813170389,2017_Apr_26_1509,96.9567160542,Stroop,A-1,2STRNS-6,
,,,,,,69,0,69,0,,,,,,,,,,,,2017_Apr_26_1509,96.9567160542,Stroop,A-1,2STRNS-6,
congruent,left,"[0.568627451, -0.7882352941, -0.7882352941]", ,0,ROT,70,0,70,0,0,0,0,0,,,,,left,1,0.377295997117,2017_Apr_26_1509,96.9567160542,Stroop,A-1,2STRNS-6,
,,,,,,70,0,70,0,,,,,,,,,,,,2017_Apr_26_1509,96.9567160542,Stroop,A-1,2STRNS-6,
neutral,down,"[-0.7725490196, 0.0745098039, -1]", ,13,SOLL,71,0,71,0,0,0,0,0,,,,,down,1,0.922087304392,2017_Apr_26_1509,96.9567160542,Stroop,A-1,2STRNS-6,
,,,,,,71,0,71,0,,,,,,,,,,,,2017_Apr_26_1509,96.9567160542,Stroop,A-1,2STRNS-6,
incongruent,left,"[0.568627451, -0.7882352941, -0.7882352941]", ,6,BLAU,72,0,72,0,0,0,0,0,,,,,right,0,0.892845599092,2017_Apr_26_1509,96.9567160542,Stroop,A-1,2STRNS-6,
,,,,,,72,0,72,0,,,,,,,,,,,,2017_Apr_26_1509,96.9567160542,Stroop,A-1,2STRNS-6,
incongruent,left,"[0.568627451, -0.7882352941, -0.7882352941]", ,6,BLAU,73,0,73,0,0,0,0,0,,,,,left,1,0.719593691378,2017_Apr_26_1509,96.9567160542,Stroop,A-1,2STRNS-6,
,,,,,,73,0,73,0,,,,,,,,,,,,2017_Apr_26_1509,96.9567160542,Stroop,A-1,2STRNS-6,
neutral,left,"[0.568627451, -0.7882352941, -0.7882352941]", ,9,PECH,74,0,74,0,0,0,0,0,,,,,left,1,1.18654493797,2017_Apr_26_1509,96.9567160542,Stroop,A-1,2STRNS-6,
,,,,,,74,0,74,0,,,,,,,,,,,,2017_Apr_26_1509,96.9567160542,Stroop,A-1,2STRNS-6,
incongruent,down,"[-0.7725490196, 0.0745098039, -1]", ,1,ROT,75,0,75,0,0,0,0,0,,,,,down,1,0.947201110756,2017_Apr_26_1509,96.9567160542,Stroop,A-1,2STRNS-6,
,,,,,,75,0,75,0,,,,,,,,,,,,2017_Apr_26_1509,96.9567160542,Stroop,A-1,2STRNS-6,
neutralofneutral,right,"[-0.8745098039, -0.2078431373, 0.637254902]", ,20,MODE,76,0,76,0,0,0,0,0,,,,,right,1,0.78763166827,2017_Apr_26_1509,96.9567160542,Stroop,A-1,2STRNS-6,
,,,,,,76,0,76,0,,,,,,,,,,,,2017_Apr_26_1509,96.9567160542,Stroop,A-1,2STRNS-6,
incongruent,down,"[-0.7725490196, 0.0745098039, -1]", ,1,ROT,77,0,77,0,0,0,0,0,,,,,down,1,1.06184333484,2017_Apr_26_1509,96.9567160542,Stroop,A-1,2STRNS-6,
,,,,,,77,0,77,0,,,,,,,,,,,,2017_Apr_26_1509,96.9567160542,Stroop,A-1,2STRNS-6,
neutral,down,"[-0.7725490196, 0.0745098039, -1]", ,13,SOLL,78,0,78,0,0,0,0,0,,,,,down,1,0.889163287513,2017_Apr_26_1509,96.9567160542,Stroop,A-1,2STRNS-6,
,,,,,,78,0,78,0,,,,,,,,,,,,2017_Apr_26_1509,96.9567160542,Stroop,A-1,2STRNS-6,
neutralofneutral,down,"[-0.7725490196, 0.0745098039, -1]", ,19,MODE,79,0,79,0,0,0,0,0,,,,,down,1,0.853094736901,2017_Apr_26_1509,96.9567160542,Stroop,A-1,2STRNS-6,
,,,,,,79,0,79,0,,,,,,,,,,,,2017_Apr_26_1509,96.9567160542,Stroop,A-1,2STRNS-6,
neutral,down,"[-0.7725490196, 0.0745098039, -1]", ,10,PECH,80,0,80,0,0,0,0,0,,,,,down,1,0.684446207549,2017_Apr_26_1509,96.9567160542,Stroop,A-1,2STRNS-6,
,,,,,,80,0,80,0,,,,,,,,,,,,2017_Apr_26_1509,96.9567160542,Stroop,A-1,2STRNS-6,
neutral,down,"[-0.7725490196, 0.0745098039, -1]", ,13,SOLL,81,0,81,0,0,0,0,0,,,,,down,1,0.580971045202,2017_Apr_26_1509,96.9567160542,Stroop,A-1,2STRNS-6,
,,,,,,81,0,81,0,,,,,,,,,,,,2017_Apr_26_1509,96.9567160542,Stroop,A-1,2STRNS-6,
incongruent,down,"[-0.7725490196, 0.0745098039, -1]", ,1,ROT,82,0,82,0,0,0,0,0,,,,,down,1,0.591185471897,2017_Apr_26_1509,96.9567160542,Stroop,A-1,2STRNS-6,
,,,,,,82,0,82,0,,,,,,,,,,,,2017_Apr_26_1509,96.9567160542,Stroop,A-1,2STRNS-6,
neutralofneutral,right,"[-0.8745098039, -0.2078431373, 0.637254902]", ,17,HALS,83,0,83,0,0,0,0,0,,,,,right,1,0.813027074671,2017_Apr_26_1509,96.9567160542,Stroop,A-1,2STRNS-6,
,,,,,,83,0,83,0,,,,,,,,,,,,2017_Apr_26_1509,96.9567160542,Stroop,A-1,2STRNS-6,
neutral,right,"[-0.8745098039, -0.2078431373, 0.637254902]", ,11,PECH,84,0,84,0,0,0,0,0,,,,,right,1,0.96549198292,2017_Apr_26_1509,96.9567160542,Stroop,A-1,2STRNS-6,
,,,,,,84,0,84,0,,,,,,,,,,,,2017_Apr_26_1509,96.9567160542,Stroop,A-1,2STRNS-6,
neutral,left,"[0.568627451, -0.7882352941, -0.7882352941]", ,12,SOLL,85,0,85,0,0,0,0,0,,,,,left,1,0.983490918538,2017_Apr_26_1509,96.9567160542,Stroop,A-1,2STRNS-6,
,,,,,,85,0,85,0,,,,,,,,,,,,2017_Apr_26_1509,96.9567160542,Stroop,A-1,2STRNS-6,
incongruent,right,"[-0.8745098039, -0.2078431373, 0.637254902]", ,2,ROT,86,0,86,0,0,0,0,0,,,,,right,1,1.15670092149,2017_Apr_26_1509,96.9567160542,Stroop,A-1,2STRNS-6,
,,,,,,86,0,86,0,,,,,,,,,,,,2017_Apr_26_1509,96.9567160542,Stroop,A-1,2STRNS-6,
neutral,left,"[0.568627451, -0.7882352941, -0.7882352941]", ,9,PECH,87,0,87,0,0,0,0,0,,,,,left,1,0.856039803942,2017_Apr_26_1509,96.9567160542,Stroop,A-1,2STRNS-6,
,,,,,,87,0,87,0,,,,,,,,,,,,2017_Apr_26_1509,96.9567160542,Stroop,A-1,2STRNS-6,
neutral,left,"[0.568627451, -0.7882352941, -0.7882352941]", ,9,PECH,88,0,88,0,0,0,0,0,,,,,right,0,0.770251247016,2017_Apr_26_1509,96.9567160542,Stroop,A-1,2STRNS-6,
,,,,,,88,0,88,0,,,,,,,,,,,,2017_Apr_26_1509,96.9567160542,Stroop,A-1,2STRNS-6,
neutral,left,"[0.568627451, -0.7882352941, -0.7882352941]", ,9,PECH,89,0,89,0,0,0,0,0,,,,,left,1,0.342721211774,2017_Apr_26_1509,96.9567160542,Stroop,A-1,2STRNS-6,
,,,,,,89,0,89,0,,,,,,,,,,,,2017_Apr_26_1509,96.9567160542,Stroop,A-1,2STRNS-6,
incongruent,down,"[-0.7725490196, 0.0745098039, -1]", ,7,BLAU,90,0,90,0,0,0,0,0,,,,,down,1,0.838694303327,2017_Apr_26_1509,96.9567160542,Stroop,A-1,2STRNS-6,
,,,,,,90,0,90,0,,,,,,,,,,,,2017_Apr_26_1509,96.9567160542,Stroop,A-1,2STRNS-6,
congruent,right,"[-0.8745098039, -0.2078431373, 0.637254902]", ,8,BLAU,91,0,91,0,0,0,0,0,,,,,right,1,0.816567189406,2017_Apr_26_1509,96.9567160542,Stroop,A-1,2STRNS-6,
,,,,,,91,0,91,0,,,,,,,,,,,,2017_Apr_26_1509,96.9567160542,Stroop,A-1,2STRNS-6,
incongruent,left,"[0.568627451, -0.7882352941, -0.7882352941]", ,3,GRÜN,92,0,92,0,0,0,0,0,,,,,down,0,0.791204468724,2017_Apr_26_1509,96.9567160542,Stroop,A-1,2STRNS-6,
,,,,,,92,0,92,0,,,,,,,,,,,,2017_Apr_26_1509,96.9567160542,Stroop,A-1,2STRNS-6,
incongruent,left,"[0.568627451, -0.7882352941, -0.7882352941]", ,3,GRÜN,93,0,93,0,0,0,0,0,,,,,left,1,0.268753430953,2017_Apr_26_1509,96.9567160542,Stroop,A-1,2STRNS-6,
,,,,,,93,0,93,0,,,,,,,,,,,,2017_Apr_26_1509,96.9567160542,Stroop,A-1,2STRNS-6,
neutral,left,"[0.568627451, -0.7882352941, -0.7882352941]", ,12,SOLL,94,0,94,0,0,0,0,0,,,,,left,1,0.7808573436,2017_Apr_26_1509,96.9567160542,Stroop,A-1,2STRNS-6,
,,,,,,94,0,94,0,,,,,,,,,,,,2017_Apr_26_1509,96.9567160542,Stroop,A-1,2STRNS-6,
neutralofneutral,left,"[0.568627451, -0.7882352941, -0.7882352941]", ,15,HALS,95,0,95,0,0,0,0,0,,,,,left,1,0.599189841168,2017_Apr_26_1509,96.9567160542,Stroop,A-1,2STRNS-6,
,,,,,,95,0,95,0,,,,,,,,,,,,2017_Apr_26_1509,96.9567160542,Stroop,A-1,2STRNS-6,
neutral,down,"[-0.7725490196, 0.0745098039, -1]", ,10,PECH,96,0,96,0,0,0,0,0,,,,,down,1,0.769927462848,2017_Apr_26_1509,96.9567160542,Stroop,A-1,2STRNS-6,
,,,,,,96,0,96,0,,,,,,,,,,,,2017_Apr_26_1509,96.9567160542,Stroop,A-1,2STRNS-6,
neutral,right,"[-0.8745098039, -0.2078431373, 0.637254902]", ,11,PECH,97,0,97,0,0,0,0,0,,,,,right,1,0.719461551678,2017_Apr_26_1509,96.9567160542,Stroop,A-1,2STRNS-6,
,,,,,,97,0,97,0,,,,,,,,,,,,2017_Apr_26_1509,96.9567160542,Stroop,A-1,2STRNS-6,
incongruent,right,"[-0.8745098039, -0.2078431373, 0.637254902]", ,5,GRÜN,98,0,98,0,0,0,0,0,,,,,right,1,0.740255814635,2017_Apr_26_1509,96.9567160542,Stroop,A-1,2STRNS-6,
,,,,,,98,0,98,0,,,,,,,,,,,,2017_Apr_26_1509,96.9567160542,Stroop,A-1,2STRNS-6,
incongruent,left,"[0.568627451, -0.7882352941, -0.7882352941]", ,3,GRÜN,99,0,99,0,0,0,0,0,,,,,down,0,0.914228204982,2017_Apr_26_1509,96.9567160542,Stroop,A-1,2STRNS-6,
,,,,,,99,0,99,0,,,,,,,,,,,,2017_Apr_26_1509,96.9567160542,Stroop,A-1,2STRNS-6,
incongruent,left,"[0.568627451, -0.7882352941, -0.7882352941]", ,3,GRÜN,100,0,100,0,0,0,0,0,,,,,left,1,0.496389066207,2017_Apr_26_1509,96.9567160542,Stroop,A-1,2STRNS-6,
,,,,,,100,0,100,0,,,,,,,,,,,,2017_Apr_26_1509,96.9567160542,Stroop,A-1,2STRNS-6,
congruent,down,"[-0.7725490196, 0.0745098039, -1]", ,4,GRÜN,101,0,101,0,0,0,0,0,,,,,None,0,,2017_Apr_26_1509,96.9567160542,Stroop,A-1,2STRNS-6,
,,,,,,101,0,101,0,,,,,,,,,,,,2017_Apr_26_1509,96.9567160542,Stroop,A-1,2STRNS-6,
congruent,down,"[-0.7725490196, 0.0745098039, -1]", ,4,GRÜN,102,0,102,0,0,0,0,0,,,,,down,1,0.8593058615,2017_Apr_26_1509,96.9567160542,Stroop,A-1,2STRNS-6,
,,,,,,102,0,102,0,,,,,,,,,,,,2017_Apr_26_1509,96.9567160542,Stroop,A-1,2STRNS-6,
congruent,right,"[-0.8745098039, -0.2078431373, 0.637254902]", ,8,BLAU,103,0,103,0,0,0,0,0,,,,,right,1,0.71019948066,2017_Apr_26_1509,96.9567160542,Stroop,A-1,2STRNS-6,
,,,,,,103,0,103,0,,,,,,,,,,,,2017_Apr_26_1509,96.9567160542,Stroop,A-1,2STRNS-6,
neutral,left,"[0.568627451, -0.7882352941, -0.7882352941]", ,9,PECH,104,0,104,0,0,0,0,0,,,,,right,0,1.26281803972,2017_Apr_26_1509,96.9567160542,Stroop,A-1,2STRNS-6,
,,,,,,104,0,104,0,,,,,,,,,,,,2017_Apr_26_1509,96.9567160542,Stroop,A-1,2STRNS-6,
neutral,left,"[0.568627451, -0.7882352941, -0.7882352941]", ,9,PECH,105,0,105,0,0,0,0,0,,,,,left,1,0.471393151923,2017_Apr_26_1509,96.9567160542,Stroop,A-1,2STRNS-6,
,,,,,,105,0,105,0,,,,,,,,,,,,2017_Apr_26_1509,96.9567160542,Stroop,A-1,2STRNS-6,
neutral,right,"[-0.8745098039, -0.2078431373, 0.637254902]", ,14,SOLL,106,0,106,0,0,0,0,0,,,,,right,1,0.836511344319,2017_Apr_26_1509,96.9567160542,Stroop,A-1,2STRNS-6,
,,,,,,106,0,106,0,,,,,,,,,,,,2017_Apr_26_1509,96.9567160542,Stroop,A-1,2STRNS-6,
incongruent,left,"[0.568627451, -0.7882352941, -0.7882352941]", ,6,BLAU,107,0,107,0,0,0,0,0,,,,,right,0,0.870872694714,2017_Apr_26_1509,96.9567160542,Stroop,A-1,2STRNS-6,
,,,,,,107,0,107,0,,,,,,,,,,,,2017_Apr_26_1509,96.9567160542,Stroop,A-1,2STRNS-6,
incongruent,left,"[0.568627451, -0.7882352941, -0.7882352941]", ,6,BLAU,108,0,108,0,0,0,0,0,,,,,left,1,0.355966470598,2017_Apr_26_1509,96.9567160542,Stroop,A-1,2STRNS-6,
,,,,,,108,0,108,0,,,,,,,,,,,,2017_Apr_26_1509,96.9567160542,Stroop,A-1,2STRNS-6,
incongruent,right,"[-0.8745098039, -0.2078431373, 0.637254902]", ,2,ROT,109,0,109,0,0,0,0,0,,,,,None,0,,2017_Apr_26_1509,96.9567160542,Stroop,A-1,2STRNS-6,
,,,,,,109,0,109,0,,,,,,,,,,,,2017_Apr_26_1509,96.9567160542,Stroop,A-1,2STRNS-6,
incongruent,right,"[-0.8745098039, -0.2078431373, 0.637254902]", ,2,ROT,110,0,110,0,0,0,0,0,,,,,right,1,0.702882908302,2017_Apr_26_1509,96.9567160542,Stroop,A-1,2STRNS-6,
,,,,,,110,0,110,0,,,,,,,,,,,,2017_Apr_26_1509,96.9567160542,Stroop,A-1,2STRNS-6,
incongruent,down,"[-0.7725490196, 0.0745098039, -1]", ,1,ROT,111,0,111,0,0,0,0,0,,,,,down,1,0.896597751949,2017_Apr_26_1509,96.9567160542,Stroop,A-1,2STRNS-6,
,,,,,,111,0,111,0,,,,,,,,,,,,2017_Apr_26_1509,96.9567160542,Stroop,A-1,2STRNS-6,
congruent,down,"[-0.7725490196, 0.0745098039, -1]", ,4,GRÜN,112,0,112,0,0,0,0,0,,,,,down,1,0.895368824808,2017_Apr_26_1509,96.9567160542,Stroop,A-1,2STRNS-6,
,,,,,,112,0,112,0,,,,,,,,,,,,2017_Apr_26_1509,96.9567160542,Stroop,A-1,2STRNS-6,
neutralofneutral,left,"[0.568627451, -0.7882352941, -0.7882352941]", ,15,HALS,113,0,113,0,0,0,0,0,,,,,left,1,0.871550434483,2017_Apr_26_1509,96.9567160542,Stroop,A-1,2STRNS-6,
,,,,,,113,0,113,0,,,,,,,,,,,,2017_Apr_26_1509,96.9567160542,Stroop,A-1,2STRNS-6,
neutral,right,"[-0.8745098039, -0.2078431373, 0.637254902]", ,11,PECH,114,0,114,0,0,0,0,0,,,,,right,1,0.786132036334,2017_Apr_26_1509,96.9567160542,Stroop,A-1,2STRNS-6,
,,,,,,114,0,114,0,,,,,,,,,,,,2017_Apr_26_1509,96.9567160542,Stroop,A-1,2STRNS-6,
incongruent,left,"[0.568627451, -0.7882352941, -0.7882352941]", ,6,BLAU,115,0,115,0,0,0,0,0,,,,,left,1,0.698894133193,2017_Apr_26_1509,96.9567160542,Stroop,A-1,2STRNS-6,
,,,,,,115,0,115,0,,,,,,,,,,,,2017_Apr_26_1509,96.9567160542,Stroop,A-1,2STRNS-6,
neutral,left,"[0.568627451, -0.7882352941, -0.7882352941]", ,12,SOLL,116,0,116,0,0,0,0,0,,,,,left,1,0.953151867067,2017_Apr_26_1509,96.9567160542,Stroop,A-1,2STRNS-6,
,,,,,,116,0,116,0,,,,,,,,,,,,2017_Apr_26_1509,96.9567160542,Stroop,A-1,2STRNS-6,
incongruent,left,"[0.568627451, -0.7882352941, -0.7882352941]", ,6,BLAU,117,0,117,0,0,0,0,0,,,,,left,1,0.709863125062,2017_Apr_26_1509,96.9567160542,Stroop,A-1,2STRNS-6,
,,,,,,117,0,117,0,,,,,,,,,,,,2017_Apr_26_1509,96.9567160542,Stroop,A-1,2STRNS-6,
neutral,down,"[-0.7725490196, 0.0745098039, -1]", ,10,PECH,118,0,118,0,0,0,0,0,,,,,down,1,0.771895590082,2017_Apr_26_1509,96.9567160542,Stroop,A-1,2STRNS-6,
,,,,,,118,0,118,0,,,,,,,,,,,,2017_Apr_26_1509,96.9567160542,Stroop,A-1,2STRNS-6,
congruent,left,"[0.568627451, -0.7882352941, -0.7882352941]", ,0,ROT,119,0,119,0,0,0,0,0,,,,,left,1,0.674626803127,2017_Apr_26_1509,96.9567160542,Stroop,A-1,2STRNS-6,
,,,,,,119,0,119,0,,,,,,,,,,,,2017_Apr_26_1509,96.9567160542,Stroop,A-1,2STRNS-6,
neutralofneutral,down,"[-0.7725490196, 0.0745098039, -1]", ,16,HALS,120,0,120,0,0,0,0,0,,,,,right,0,0.738823230326,2017_Apr_26_1509,96.9567160542,Stroop,A-1,2STRNS-6,
,,,,,,120,0,120,0,,,,,,,,,,,,2017_Apr_26_1509,96.9567160542,Stroop,A-1,2STRNS-6,
neutralofneutral,down,"[-0.7725490196, 0.0745098039, -1]", ,16,HALS,121,0,121,0,0,0,0,0,,,,,down,1,0.406201626185,2017_Apr_26_1509,96.9567160542,Stroop,A-1,2STRNS-6,
,,,,,,121,0,121,0,,,,,,,,,,,,2017_Apr_26_1509,96.9567160542,Stroop,A-1,2STRNS-6,
neutral,left,"[0.568627451, -0.7882352941, -0.7882352941]", ,9,PECH,122,0,122,0,0,0,0,0,,,,,left,1,0.698689917294,2017_Apr_26_1509,96.9567160542,Stroop,A-1,2STRNS-6,
,,,,,,122,0,122,0,,,,,,,,,,,,2017_Apr_26_1509,96.9567160542,Stroop,A-1,2STRNS-6,
neutralofneutral,left,"[0.568627451, -0.7882352941, -0.7882352941]", ,18,MODE,123,0,123,0,0,0,0,0,,,,,left,1,0.650394673066,2017_Apr_26_1509,96.9567160542,Stroop,A-1,2STRNS-6,
,,,,,,123,0,123,0,,,,,,,,,,,,2017_Apr_26_1509,96.9567160542,Stroop,A-1,2STRNS-6,
incongruent,down,"[-0.7725490196, 0.0745098039, -1]", ,1,ROT,124,0,124,0,0,0,0,0,,,,,down,1,0.788280633433,2017_Apr_26_1509,96.9567160542,Stroop,A-1,2STRNS-6,
,,,,,,124,0,124,0,,,,,,,,,,,,2017_Apr_26_1509,96.9567160542,Stroop,A-1,2STRNS-6,
incongruent,down,"[-0.7725490196, 0.0745098039, -1]", ,1,ROT,125,0,125,0,0,0,0,0,,,,,down,1,0.764888274906,2017_Apr_26_1509,96.9567160542,Stroop,A-1,2STRNS-6,
,,,,,,125,0,125,0,,,,,,,,,,,,2017_Apr_26_1509,96.9567160542,Stroop,A-1,2STRNS-6,
neutralofneutral,left,"[0.568627451, -0.7882352941, -0.7882352941]", ,15,HALS,126,0,126,0,0,0,0,0,,,,,left,1,0.76053045848,2017_Apr_26_1509,96.9567160542,Stroop,A-1,2STRNS-6,
,,,,,,126,0,126,0,,,,,,,,,,,,2017_Apr_26_1509,96.9567160542,Stroop,A-1,2STRNS-6,
incongruent,left,"[0.568627451, -0.7882352941, -0.7882352941]", ,3,GRÜN,127,0,127,0,0,0,0,0,,,,,left,1,0.909684331388,2017_Apr_26_1509,96.9567160542,Stroop,A-1,2STRNS-6,
,,,,,,127,0,127,0,,,,,,,,,,,,2017_Apr_26_1509,96.9567160542,Stroop,A-1,2STRNS-6,
neutralofneutral,down,"[-0.7725490196, 0.0745098039, -1]", ,19,MODE,128,0,128,0,0,0,0,0,,,,,down,1,0.65288325751,2017_Apr_26_1509,96.9567160542,Stroop,A-1,2STRNS-6,
,,,,,,128,0,128,0,,,,,,,,,,,,2017_Apr_26_1509,96.9567160542,Stroop,A-1,2STRNS-6,
neutralofneutral,down,"[-0.7725490196, 0.0745098039, -1]", ,16,HALS,129,0,129,0,0,0,0,0,,,,,down,1,0.733736829681,2017_Apr_26_1509,96.9567160542,Stroop,A-1,2STRNS-6,
,,,,,,129,0,129,0,,,,,,,,,,,,2017_Apr_26_1509,96.9567160542,Stroop,A-1,2STRNS-6,
fix,return,white, ,21,+,,,,,,,,,0,0,0,0,None,0,,2017_Apr_26_1509,96.9567160542,Stroop,A-1,2STRNS-6,
fix,return,white, ,21,+,,,,,,,,,0,1,1,1,None,0,,2017_Apr_26_1509,96.9567160542,Stroop,A-1,2STRNS-6,
fix,return,white, ,21,+,,,,,,,,,0,2,2,2,None,0,,2017_Apr_26_1509,96.9567160542,Stroop,A-1,2STRNS-6,
fix,return,white, ,21,+,,,,,,,,,0,3,3,3,None,0,,2017_Apr_26_1509,96.9567160542,Stroop,A-1,2STRNS-6,
fix,return,white, ,21,+,,,,,,,,,0,4,4,4,None,0,,2017_Apr_26_1509,96.9567160542,Stroop,A-1,2STRNS-6,
fix,return,white, ,21,+,,,,,,,,,0,5,5,5,None,0,,2017_Apr_26_1509,96.9567160542,Stroop,A-1,2STRNS-6,
fix,return,white, ,21,+,,,,,,,,,0,6,6,6,None,0,,2017_Apr_26_1509,96.9567160542,Stroop,A-1,2STRNS-6,
fix,return,white, ,21,+,,,,,,,,,0,7,7,7,None,0,,2017_Apr_26_1509,96.9567160542,Stroop,A-1,2STRNS-6,
fix,return,white, ,21,+,,,,,,,,,0,8,8,8,None,0,,2017_Apr_26_1509,96.9567160542,Stroop,A-1,2STRNS-6,
fix,return,white, ,21,+,,,,,,,,,0,9,9,9,None,0,,2017_Apr_26_1509,96.9567160542,Stroop,A-1,2STRNS-6,
fix,return,white, ,21,+,,,,,,,,,0,10,10,10,None,0,,2017_Apr_26_1509,96.9567160542,Stroop,A-1,2STRNS-6,
fix,return,white, ,21,+,,,,,,,,,0,11,11,11,None,0,,2017_Apr_26_1509,96.9567160542,Stroop,A-1,2STRNS-6,
fix,return,white,+,22,+,,,,,,,,,0,12,12,12,None,0,,2017_Apr_26_1509,96.9567160542,Stroop,A-1,2STRNS-6,
congruent,down,"[-0.7725490196, 0.0745098039, -1]", ,4,GRÜN,,,,,,,,,0,13,13,13,down,1,1.20627426111,2017_Apr_26_1509,96.9567160542,Stroop,A-1,2STRNS-6,
neutral,left,"[0.568627451, -0.7882352941, -0.7882352941]", ,9,PECH,,,,,,,,,0,14,14,14,left,1,1.01675017356,2017_Apr_26_1509,96.9567160542,Stroop,A-1,2STRNS-6,
neutral,down,"[-0.7725490196, 0.0745098039, -1]", ,13,SOLL,,,,,,,,,0,15,15,15,down,1,0.963309023912,2017_Apr_26_1509,96.9567160542,Stroop,A-1,2STRNS-6,
neutral,right,"[-0.8745098039, -0.2078431373, 0.637254902]", ,14,SOLL,,,,,,,,,0,16,16,16,right,1,0.854075587819,2017_Apr_26_1509,96.9567160542,Stroop,A-1,2STRNS-6,
congruent,right,"[-0.8745098039, -0.2078431373, 0.637254902]", ,8,BLAU,,,,,,,,,0,17,17,17,right,1,0.590511922604,2017_Apr_26_1509,96.9567160542,Stroop,A-1,2STRNS-6,
congruent,left,"[0.568627451, -0.7882352941, -0.7882352941]", ,0,ROT,,,,,,,,,0,18,18,18,left,1,0.622491406031,2017_Apr_26_1509,96.9567160542,Stroop,A-1,2STRNS-6,
neutral,right,"[-0.8745098039, -0.2078431373, 0.637254902]", ,11,PECH,,,,,,,,,0,19,19,19,right,1,0.694727402505,2017_Apr_26_1509,96.9567160542,Stroop,A-1,2STRNS-6,
neutral,left,"[0.568627451, -0.7882352941, -0.7882352941]", ,12,SOLL,,,,,,,,,0,20,20,20,left,1,0.633518226478,2017_Apr_26_1509,96.9567160542,Stroop,A-1,2STRNS-6,
neutral,down,"[-0.7725490196, 0.0745098039, -1]", ,10,PECH,,,,,,,,,0,21,21,21,down,1,0.557431461261,2017_Apr_26_1509,96.9567160542,Stroop,A-1,2STRNS-6,
congruent,left,"[0.568627451, -0.7882352941, -0.7882352941]", ,0,ROT,,,,,,,,,0,22,22,22,left,1,0.77697277168,2017_Apr_26_1509,96.9567160542,Stroop,A-1,2STRNS-6,
congruent,down,"[-0.7725490196, 0.0745098039, -1]", ,4,GRÜN,,,,,,,,,0,23,23,23,down,1,0.902494590793,2017_Apr_26_1509,96.9567160542,Stroop,A-1,2STRNS-6,
congruent,right,"[-0.8745098039, -0.2078431373, 0.637254902]", ,8,BLAU,,,,,,,,,0,24,24,24,right,1,0.722475901267,2017_Apr_26_1509,96.9567160542,Stroop,A-1,2STRNS-6,
neutral,left,"[0.568627451, -0.7882352941, -0.7882352941]", ,12,SOLL,,,,,,,,,0,25,25,25,left,1,0.601247923968,2017_Apr_26_1509,96.9567160542,Stroop,A-1,2STRNS-6,
neutral,down,"[-0.7725490196, 0.0745098039, -1]", ,13,SOLL,,,,,,,,,0,26,26,26,down,1,0.697617434618,2017_Apr_26_1509,96.9567160542,Stroop,A-1,2STRNS-6,
neutral,left,"[0.568627451, -0.7882352941, -0.7882352941]", ,9,PECH,,,,,,,,,0,27,27,27,right,0,0.483267845495,2017_Apr_26_1509,96.9567160542,Stroop,A-1,2STRNS-6,
incongruent,left,"[0.568627451, -0.7882352941, -0.7882352941]", ,3,GRÜN,,,,,,,,,0,28,28,28,left,1,0.976143616018,2017_Apr_26_1509,96.9567160542,Stroop,A-1,2STRNS-6,
incongruent,left,"[0.568627451, -0.7882352941, -0.7882352941]", ,6,BLAU,,,,,,,,,0,29,29,29,left,1,1.13985157331,2017_Apr_26_1509,96.9567160542,Stroop,A-1,2STRNS-6,
neutral,right,"[-0.8745098039, -0.2078431373, 0.637254902]", ,14,SOLL,,,,,,,,,0,30,30,30,right,1,1.10827102327,2017_Apr_26_1509,96.9567160542,Stroop,A-1,2STRNS-6,
incongruent,down,"[-0.7725490196, 0.0745098039, -1]", ,7,BLAU,,,,,,,,,0,31,31,31,down,1,0.900937968373,2017_Apr_26_1509,96.9567160542,Stroop,A-1,2STRNS-6,
incongruent,right,"[-0.8745098039, -0.2078431373, 0.637254902]", ,2,ROT,,,,,,,,,0,32,32,32,right,1,0.814784839972,2017_Apr_26_1509,96.9567160542,Stroop,A-1,2STRNS-6,
incongruent,right,"[-0.8745098039, -0.2078431373, 0.637254902]", ,5,GRÜN,,,,,,,,,0,33,33,33,right,1,0.80099565727,2017_Apr_26_1509,96.9567160542,Stroop,A-1,2STRNS-6,
neutral,down,"[-0.7725490196, 0.0745098039, -1]", ,10,PECH,,,,,,,,,0,34,34,34,down,1,0.727271762193,2017_Apr_26_1509,96.9567160542,Stroop,A-1,2STRNS-6,
incongruent,down,"[-0.7725490196, 0.0745098039, -1]", ,1,ROT,,,,,,,,,0,35,35,35,down,1,0.785348417187,2017_Apr_26_1509,96.9567160542,Stroop,A-1,2STRNS-6,
neutral,right,"[-0.8745098039, -0.2078431373, 0.637254902]", ,11,PECH,,,,,,,,,0,36,36,36,right,1,0.740876284556,2017_Apr_26_1509,96.9567160542,Stroop,A-1,2STRNS-6,
neutralofneutral,right,"[-0.8745098039, -0.2078431373, 0.637254902]", ,17,HALS,,,,,,,,,0,37,37,37,right,1,0.719185538945,2017_Apr_26_1509,96.9567160542,Stroop,A-1,2STRNS-6,
neutral,left,"[0.568627451, -0.7882352941, -0.7882352941]", ,12,SOLL,,,,,,,,,0,38,38,38,left,1,0.654737403776,2017_Apr_26_1509,96.9567160542,Stroop,A-1,2STRNS-6,
neutral,down,"[-0.7725490196, 0.0745098039, -1]", ,10,PECH,,,,,,,,,0,39,39,39,down,1,1.1138052462,2017_Apr_26_1509,96.9567160542,Stroop,A-1,2STRNS-6,
neutral,down,"[-0.7725490196, 0.0745098039, -1]", ,13,SOLL,,,,,,,,,0,40,40,40,down,1,0.87965621329,2017_Apr_26_1509,96.9567160542,Stroop,A-1,2STRNS-6,
neutral,left,"[0.568627451, -0.7882352941, -0.7882352941]", ,9,PECH,,,,,,,,,0,41,41,41,left,1,0.740370913063,2017_Apr_26_1509,96.9567160542,Stroop,A-1,2STRNS-6,
neutral,right,"[-0.8745098039, -0.2078431373, 0.637254902]", ,11,PECH,,,,,,,,,0,42,42,42,right,1,1.04034842417,2017_Apr_26_1509,96.9567160542,Stroop,A-1,2STRNS-6,
neutralofneutral,right,"[-0.8745098039, -0.2078431373, 0.637254902]", ,20,MODE,,,,,,,,,0,43,43,43,right,1,0.800021231748,2017_Apr_26_1509,96.9567160542,Stroop,A-1,2STRNS-6,
neutralofneutral,left,"[0.568627451, -0.7882352941, -0.7882352941]", ,18,MODE,,,,,,,,,0,44,44,44,left,1,0.638221338187,2017_Apr_26_1509,96.9567160542,Stroop,A-1,2STRNS-6,
neutralofneutral,left,"[0.568627451, -0.7882352941, -0.7882352941]", ,15,HALS,,,,,,,,,0,45,45,45,left,1,0.716628510048,2017_Apr_26_1509,96.9567160542,Stroop,A-1,2STRNS-6,
neutralofneutral,down,"[-0.7725490196, 0.0745098039, -1]", ,19,MODE,,,,,,,,,0,46,46,46,down,1,0.829406530718,2017_Apr_26_1509,96.9567160542,Stroop,A-1,2STRNS-6,
neutral,right,"[-0.8745098039, -0.2078431373, 0.637254902]", ,14,SOLL,,,,,,,,,0,47,47,47,right,1,0.886625534809,2017_Apr_26_1509,96.9567160542,Stroop,A-1,2STRNS-6,
neutralofneutral,down,"[-0.7725490196, 0.0745098039, -1]", ,16,HALS,,,,,,,,,0,48,48,48,left,0,1.13139379446,2017_Apr_26_1509,96.9567160542,Stroop,A-1,2STRNS-6,
fix,return,white, ,21,+,,,,,,,,,0,49,49,49,None,0,,2017_Apr_26_1509,96.9567160542,Stroop,A-1,2STRNS-6,
fix,return,white, ,21,+,,,,,,,,,0,50,50,50,None,0,,2017_Apr_26_1509,96.9567160542,Stroop,A-1,2STRNS-6,
fix,return,white, ,21,+,,,,,,,,,0,51,51,51,None,0,,2017_Apr_26_1509,96.9567160542,Stroop,A-1,2STRNS-6,
fix,return,white, ,21,+,,,,,,,,,0,52,52,52,None,0,,2017_Apr_26_1509,96.9567160542,Stroop,A-1,2STRNS-6,
fix,return,white, ,21,+,,,,,,,,,0,53,53,53,None,0,,2017_Apr_26_1509,96.9567160542,Stroop,A-1,2STRNS-6,
fix,return,white, ,21,+,,,,,,,,,0,54,54,54,None,0,,2017_Apr_26_1509,96.9567160542,Stroop,A-1,2STRNS-6,
fix,return,white, ,21,+,,,,,,,,,0,55,55,55,None,0,,2017_Apr_26_1509,96.9567160542,Stroop,A-1,2STRNS-6,
fix,return,white, ,21,+,,,,,,,,,0,56,56,56,None,0,,2017_Apr_26_1509,96.9567160542,Stroop,A-1,2STRNS-6,
fix,return,white, ,21,+,,,,,,,,,0,57,57,57,None,0,,2017_Apr_26_1509,96.9567160542,Stroop,A-1,2STRNS-6,
fix,return,white, ,21,+,,,,,,,,,0,58,58,58,None,0,,2017_Apr_26_1509,96.9567160542,Stroop,A-1,2STRNS-6,
fix,return,white, ,21,+,,,,,,,,,0,59,59,59,None,0,,2017_Apr_26_1509,96.9567160542,Stroop,A-1,2STRNS-6,
fix,return,white, ,21,+,,,,,,,,,0,60,60,60,None,0,,2017_Apr_26_1509,96.9567160542,Stroop,A-1,2STRNS-6,
fix,return,white,+,22,+,,,,,,,,,0,61,61,61,None,0,,2017_Apr_26_1509,96.9567160542,Stroop,A-1,2STRNS-6,
congruent,left,"[0.568627451, -0.7882352941, -0.7882352941]", ,0,ROT,,,,,,,,,0,62,62,62,left,1,1.29888323795,2017_Apr_26_1509,96.9567160542,Stroop,A-1,2STRNS-6,
congruent,right,"[-0.8745098039, -0.2078431373, 0.637254902]", ,8,BLAU,,,,,,,,,0,63,63,63,right,1,0.830943876946,2017_Apr_26_1509,96.9567160542,Stroop,A-1,2STRNS-6,
neutral,down,"[-0.7725490196, 0.0745098039, -1]", ,13,SOLL,,,,,,,,,0,64,64,64,down,1,0.525439127039,2017_Apr_26_1509,96.9567160542,Stroop,A-1,2STRNS-6,
congruent,down,"[-0.7725490196, 0.0745098039, -1]", ,4,GRÜN,,,,,,,,,0,65,65,65,down,1,0.60155550496,2017_Apr_26_1509,96.9567160542,Stroop,A-1,2STRNS-6,
neutral,left,"[0.568627451, -0.7882352941, -0.7882352941]", ,12,SOLL,,,,,,,,,0,66,66,66,left,1,0.77332538074,2017_Apr_26_1509,96.9567160542,Stroop,A-1,2STRNS-6,
congruent,down,"[-0.7725490196, 0.0745098039, -1]", ,4,GRÜN,,,,,,,,,0,67,67,67,down,1,0.525298327022,2017_Apr_26_1509,96.9567160542,Stroop,A-1,2STRNS-6,
neutral,right,"[-0.8745098039, -0.2078431373, 0.637254902]", ,14,SOLL,,,,,,,,,0,68,68,68,right,1,0.601147631892,2017_Apr_26_1509,96.9567160542,Stroop,A-1,2STRNS-6,
congruent,right,"[-0.8745098039, -0.2078431373, 0.637254902]", ,8,BLAU,,,,,,,,,0,69,69,69,right,1,1.06634586239,2017_Apr_26_1509,96.9567160542,Stroop,A-1,2STRNS-6,
congruent,left,"[0.568627451, -0.7882352941, -0.7882352941]", ,0,ROT,,,,,,,,,0,70,70,70,left,1,0.507033435813,2017_Apr_26_1509,96.9567160542,Stroop,A-1,2STRNS-6,
neutral,left,"[0.568627451, -0.7882352941, -0.7882352941]", ,9,PECH,,,,,,,,,0,71,71,71,None,0,,2017_Apr_26_1509,96.9567160542,Stroop,A-1,2STRNS-6,
neutral,down,"[-0.7725490196, 0.0745098039, -1]", ,10,PECH,,,,,,,,,0,72,72,72,down,1,1.1399677892,2017_Apr_26_1509,96.9567160542,Stroop,A-1,2STRNS-6,
neutral,right,"[-0.8745098039, -0.2078431373, 0.637254902]", ,11,PECH,,,,,,,,,0,73,73,73,right,1,0.662754344477,2017_Apr_26_1509,96.9567160542,Stroop,A-1,2STRNS-6,
neutralofneutral,down,"[-0.7725490196, 0.0745098039, -1]", ,16,HALS,,,,,,,,,0,74,74,74,down,1,0.811817144358,2017_Apr_26_1509,96.9567160542,Stroop,A-1,2STRNS-6,
neutral,down,"[-0.7725490196, 0.0745098039, -1]", ,13,SOLL,,,,,,,,,0,75,75,75,down,1,0.662876985762,2017_Apr_26_1509,96.9567160542,Stroop,A-1,2STRNS-6,
neutralofneutral,down,"[-0.7725490196, 0.0745098039, -1]", ,19,MODE,,,,,,,,,0,76,76,76,down,1,0.640432792436,2017_Apr_26_1509,96.9567160542,Stroop,A-1,2STRNS-6,
neutral,left,"[0.568627451, -0.7882352941, -0.7882352941]", ,9,PECH,,,,,,,,,0,77,77,77,left,1,1.08263731843,2017_Apr_26_1509,96.9567160542,Stroop,A-1,2STRNS-6,
neutralofneutral,left,"[0.568627451, -0.7882352941, -0.7882352941]", ,18,MODE,,,,,,,,,0,78,78,78,left,1,0.683956480502,2017_Apr_26_1509,96.9567160542,Stroop,A-1,2STRNS-6,
neutralofneutral,right,"[-0.8745098039, -0.2078431373, 0.637254902]", ,20,MODE,,,,,,,,,0,79,79,79,right,1,0.717250656158,2017_Apr_26_1509,96.9567160542,Stroop,A-1,2STRNS-6,
neutralofneutral,left,"[0.568627451, -0.7882352941, -0.7882352941]", ,15,HALS,,,,,,,,,0,80,80,80,down,0,0.665717849615,2017_Apr_26_1509,96.9567160542,Stroop,A-1,2STRNS-6,
neutral,right,"[-0.8745098039, -0.2078431373, 0.637254902]", ,11,PECH,,,,,,,,,0,81,81,81,right,1,0.794446221517,2017_Apr_26_1509,96.9567160542,Stroop,A-1,2STRNS-6,
neutral,left,"[0.568627451, -0.7882352941, -0.7882352941]", ,12,SOLL,,,,,,,,,0,82,82,82,left,1,0.869461900884,2017_Apr_26_1509,96.9567160542,Stroop,A-1,2STRNS-6,
neutral,down,"[-0.7725490196, 0.0745098039, -1]", ,10,PECH,,,,,,,,,0,83,83,83,down,1,0.66567063691,2017_Apr_26_1509,96.9567160542,Stroop,A-1,2STRNS-6,
neutral,right,"[-0.8745098039, -0.2078431373, 0.637254902]", ,14,SOLL,,,,,,,,,0,84,84,84,right,1,0.740547471816,2017_Apr_26_1509,96.9567160542,Stroop,A-1,2STRNS-6,
neutralofneutral,right,"[-0.8745098039, -0.2078431373, 0.637254902]", ,17,HALS,,,,,,,,,0,85,85,85,right,1,0.760764287082,2017_Apr_26_1509,96.9567160542,Stroop,A-1,2STRNS-6,
incongruent,right,"[-0.8745098039, -0.2078431373, 0.637254902]", ,5,GRÜN,,,,,,,,,0,86,86,86,right,1,0.737264093621,2017_Apr_26_1509,96.9567160542,Stroop,A-1,2STRNS-6,
neutral,right,"[-0.8745098039, -0.2078431373, 0.637254902]", ,14,SOLL,,,,,,,,,0,87,87,87,right,1,0.555932946785,2017_Apr_26_1509,96.9567160542,Stroop,A-1,2STRNS-6,
neutral,down,"[-0.7725490196, 0.0745098039, -1]", ,10,PECH,,,,,,,,,0,88,88,88,down,1,0.769145240527,2017_Apr_26_1509,96.9567160542,Stroop,A-1,2STRNS-6,
neutral,left,"[0.568627451, -0.7882352941, -0.7882352941]", ,12,SOLL,,,,,,,,,0,89,89,89,left,1,0.566410814782,2017_Apr_26_1509,96.9567160542,Stroop,A-1,2STRNS-6,
neutral,right,"[-0.8745098039, -0.2078431373, 0.637254902]", ,11,PECH,,,,,,,,,0,90,90,90,right,1,0.71636534811,2017_Apr_26_1509,96.9567160542,Stroop,A-1,2STRNS-6,
incongruent,down,"[-0.7725490196, 0.0745098039, -1]", ,1,ROT,,,,,,,,,0,91,91,91,down,1,0.795346335917,2017_Apr_26_1509,96.9567160542,Stroop,A-1,2STRNS-6,
neutral,down,"[-0.7725490196, 0.0745098039, -1]", ,13,SOLL,,,,,,,,,0,92,92,92,down,1,0.674590206297,2017_Apr_26_1509,96.9567160542,Stroop,A-1,2STRNS-6,
incongruent,down,"[-0.7725490196, 0.0745098039, -1]", ,7,BLAU,,,,,,,,,0,93,93,93,down,1,0.699392799923,2017_Apr_26_1509,96.9567160542,Stroop,A-1,2STRNS-6,
neutral,left,"[0.568627451, -0.7882352941, -0.7882352941]", ,9,PECH,,,,,,,,,0,94,94,94,left,1,0.535300156864,2017_Apr_26_1509,96.9567160542,Stroop,A-1,2STRNS-6,
incongruent,right,"[-0.8745098039, -0.2078431373, 0.637254902]", ,2,ROT,,,,,,,,,0,95,95,95,right,1,1.28532117909,2017_Apr_26_1509,96.9567160542,Stroop,A-1,2STRNS-6,
incongruent,left,"[0.568627451, -0.7882352941, -0.7882352941]", ,6,BLAU,,,,,,,,,0,96,96,96,left,1,1.0336045503,2017_Apr_26_1509,96.9567160542,Stroop,A-1,2STRNS-6,
incongruent,left,"[0.568627451, -0.7882352941, -0.7882352941]", ,3,GRÜN,,,,,,,,,0,97,97,97,left,1,0.933896067796,2017_Apr_26_1509,96.9567160542,Stroop,A-1,2STRNS-6,
fix,return,white, ,21,+,,,,,,,,,0,98,98,98,None,0,,2017_Apr_26_1509,96.9567160542,Stroop,A-1,2STRNS-6,
fix,return,white, ,21,+,,,,,,,,,0,99,99,99,None,0,,2017_Apr_26_1509,96.9567160542,Stroop,A-1,2STRNS-6,
fix,return,white, ,21,+,,,,,,,,,0,100,100,100,None,0,,2017_Apr_26_1509,96.9567160542,Stroop,A-1,2STRNS-6,
fix,return,white, ,21,+,,,,,,,,,0,101,101,101,None,0,,2017_Apr_26_1509,96.9567160542,Stroop,A-1,2STRNS-6,
fix,return,white, ,21,+,,,,,,,,,0,102,102,102,None,0,,2017_Apr_26_1509,96.9567160542,Stroop,A-1,2STRNS-6,
fix,return,white, ,21,+,,,,,,,,,0,103,103,103,None,0,,2017_Apr_26_1509,96.9567160542,Stroop,A-1,2STRNS-6,
fix,return,white, ,21,+,,,,,,,,,0,104,104,104,None,0,,2017_Apr_26_1509,96.9567160542,Stroop,A-1,2STRNS-6,
fix,return,white, ,21,+,,,,,,,,,0,105,105,105,None,0,,2017_Apr_26_1509,96.9567160542,Stroop,A-1,2STRNS-6,
fix,return,white, ,21,+,,,,,,,,,0,106,106,106,None,0,,2017_Apr_26_1509,96.9567160542,Stroop,A-1,2STRNS-6,
fix,return,white, ,21,+,,,,,,,,,0,107,107,107,None,0,,2017_Apr_26_1509,96.9567160542,Stroop,A-1,2STRNS-6,
fix,return,white, ,21,+,,,,,,,,,0,108,108,108,None,0,,2017_Apr_26_1509,96.9567160542,Stroop,A-1,2STRNS-6,
fix,return,white, ,21,+,,,,,,,,,0,109,109,109,None,0,,2017_Apr_26_1509,96.9567160542,Stroop,A-1,2STRNS-6,
fix,return,white,+,22,+,,,,,,,,,0,110,110,110,None,0,,2017_Apr_26_1509,96.9567160542,Stroop,A-1,2STRNS-6,
incongruent,left,"[0.568627451, -0.7882352941, -0.7882352941]", ,6,BLAU,,,,,,,,,0,111,111,111,right,0,0.905971289648,2017_Apr_26_1509,96.9567160542,Stroop,A-1,2STRNS-6,
incongruent,right,"[-0.8745098039, -0.2078431373, 0.637254902]", ,5,GRÜN,,,,,,,,,0,112,112,112,down,0,0.954068184643,2017_Apr_26_1509,96.9567160542,Stroop,A-1,2STRNS-6,
neutral,left,"[0.568627451, -0.7882352941, -0.7882352941]", ,12,SOLL,,,,,,,,,0,113,113,113,left,1,0.933520321717,2017_Apr_26_1509,96.9567160542,Stroop,A-1,2STRNS-6,
neutral,down,"[-0.7725490196, 0.0745098039, -1]", ,13,SOLL,,,,,,,,,0,114,114,114,down,1,0.824939203167,2017_Apr_26_1509,96.9567160542,Stroop,A-1,2STRNS-6,
neutral,right,"[-0.8745098039, -0.2078431373, 0.637254902]", ,14,SOLL,,,,,,,,,0,115,115,115,right,1,0.694810932674,2017_Apr_26_1509,96.9567160542,Stroop,A-1,2STRNS-6,
neutral,down,"[-0.7725490196, 0.0745098039, -1]", ,10,PECH,,,,,,,,,0,116,116,116,down,1,0.673214053742,2017_Apr_26_1509,96.9567160542,Stroop,A-1,2STRNS-6,
incongruent,left,"[0.568627451, -0.7882352941, -0.7882352941]", ,3,GRÜN,,,,,,,,,0,117,117,117,left,1,0.737683700024,2017_Apr_26_1509,96.9567160542,Stroop,A-1,2STRNS-6,
incongruent,down,"[-0.7725490196, 0.0745098039, -1]", ,7,BLAU,,,,,,,,,0,118,118,118,down,1,0.901757904985,2017_Apr_26_1509,96.9567160542,Stroop,A-1,2STRNS-6,
neutral,left,"[0.568627451, -0.7882352941, -0.7882352941]", ,9,PECH,,,,,,,,,0,119,119,119,left,1,1.44114852586,2017_Apr_26_1509,96.9567160542,Stroop,A-1,2STRNS-6,
incongruent,right,"[-0.8745098039, -0.2078431373, 0.637254902]", ,2,ROT,,,,,,,,,0,120,120,120,right,1,0.959745163142,2017_Apr_26_1509,96.9567160542,Stroop,A-1,2STRNS-6,
neutral,right,"[-0.8745098039, -0.2078431373, 0.637254902]", ,11,PECH,,,,,,,,,0,121,121,121,right,1,0.987780569876,2017_Apr_26_1509,96.9567160542,Stroop,A-1,2STRNS-6,
incongruent,down,"[-0.7725490196, 0.0745098039, -1]", ,1,ROT,,,,,,,,,0,122,122,122,down,1,0.603870883032,2017_Apr_26_1509,96.9567160542,Stroop,A-1,2STRNS-6,
neutral,left,"[0.568627451, -0.7882352941, -0.7882352941]", ,12,SOLL,,,,,,,,,0,123,123,123,left,1,0.794838729503,2017_Apr_26_1509,96.9567160542,Stroop,A-1,2STRNS-6,
neutral,right,"[-0.8745098039, -0.2078431373, 0.637254902]", ,11,PECH,,,,,,,,,0,124,124,124,right,1,0.698529841084,2017_Apr_26_1509,96.9567160542,Stroop,A-1,2STRNS-6,
congruent,left,"[0.568627451, -0.7882352941, -0.7882352941]", ,0,ROT,,,,,,,,,0,125,125,125,left,1,0.808857270966,2017_Apr_26_1509,96.9567160542,Stroop,A-1,2STRNS-6,
neutral,right,"[-0.8745098039, -0.2078431373, 0.637254902]", ,14,SOLL,,,,,,,,,0,126,126,126,right,1,0.825810263595,2017_Apr_26_1509,96.9567160542,Stroop,A-1,2STRNS-6,
neutral,left,"[0.568627451, -0.7882352941, -0.7882352941]", ,9,PECH,,,,,,,,,0,127,127,127,left,1,0.644501465968,2017_Apr_26_1509,96.9567160542,Stroop,A-1,2STRNS-6,
congruent,right,"[-0.8745098039, -0.2078431373, 0.637254902]", ,8,BLAU,,,,,,,,,0,128,128,128,right,1,1.10814251532,2017_Apr_26_1509,96.9567160542,Stroop,A-1,2STRNS-6,
congruent,left,"[0.568627451, -0.7882352941, -0.7882352941]", ,0,ROT,,,,,,,,,0,129,129,129,left,1,0.645428678784,2017_Apr_26_1509,96.9567160542,Stroop,A-1,2STRNS-6,
neutral,down,"[-0.7725490196, 0.0745098039, -1]", ,10,PECH,,,,,,,,,0,130,130,130,down,1,0.726960549456,2017_Apr_26_1509,96.9567160542,Stroop,A-1,2STRNS-6,
neutral,down,"[-0.7725490196, 0.0745098039, -1]", ,13,SOLL,,,,,,,,,0,131,131,131,down,1,0.791270398891,2017_Apr_26_1509,96.9567160542,Stroop,A-1,2STRNS-6,
congruent,down,"[-0.7725490196, 0.0745098039, -1]", ,4,GRÜN,,,,,,,,,0,132,132,132,down,1,0.53420867736,2017_Apr_26_1509,96.9567160542,Stroop,A-1,2STRNS-6,
congruent,down,"[-0.7725490196, 0.0745098039, -1]", ,4,GRÜN,,,,,,,,,0,133,133,133,down,1,0.644157288148,2017_Apr_26_1509,96.9567160542,Stroop,A-1,2STRNS-6,
congruent,right,"[-0.8745098039, -0.2078431373, 0.637254902]", ,8,BLAU,,,,,,,,,0,134,134,134,right,1,0.678162448021,2017_Apr_26_1509,96.9567160542,Stroop,A-1,2STRNS-6,
neutral,right,"[-0.8745098039, -0.2078431373, 0.637254902]", ,14,SOLL,,,,,,,,,0,135,135,135,right,1,0.664860478078,2017_Apr_26_1509,96.9567160542,Stroop,A-1,2STRNS-6,
neutral,left,"[0.568627451, -0.7882352941, -0.7882352941]", ,12,SOLL,,,,,,,,,0,136,136,136,left,1,1.0375349381,2017_Apr_26_1509,96.9567160542,Stroop,A-1,2STRNS-6,
neutralofneutral,left,"[0.568627451, -0.7882352941, -0.7882352941]", ,18,MODE,,,,,,,,,0,137,137,137,left,1,0.608037334354,2017_Apr_26_1509,96.9567160542,Stroop,A-1,2STRNS-6,
neutralofneutral,down,"[-0.7725490196, 0.0745098039, -1]", ,19,MODE,,,,,,,,,0,138,138,138,down,1,0.991443046532,2017_Apr_26_1509,96.9567160542,Stroop,A-1,2STRNS-6,
neutral,right,"[-0.8745098039, -0.2078431373, 0.637254902]", ,11,PECH,,,,,,,,,0,139,139,139,right,1,0.845411637512,2017_Apr_26_1509,96.9567160542,Stroop,A-1,2STRNS-6,
neutral,down,"[-0.7725490196, 0.0745098039, -1]", ,13,SOLL,,,,,,,,,0,140,140,140,down,1,0.728587571884,2017_Apr_26_1509,96.9567160542,Stroop,A-1,2STRNS-6,
neutral,left,"[0.568627451, -0.7882352941, -0.7882352941]", ,9,PECH,,,,,,,,,0,141,141,141,left,1,0.578210638503,2017_Apr_26_1509,96.9567160542,Stroop,A-1,2STRNS-6,
neutralofneutral,down,"[-0.7725490196, 0.0745098039, -1]", ,16,HALS,,,,,,,,,0,142,142,142,down,1,0.642920818148,2017_Apr_26_1509,96.9567160542,Stroop,A-1,2STRNS-6,
neutralofneutral,right,"[-0.8745098039, -0.2078431373, 0.637254902]", ,17,HALS,,,,,,,,,0,143,143,143,left,0,0.726946301835,2017_Apr_26_1509,96.9567160542,Stroop,A-1,2STRNS-6,
neutral,down,"[-0.7725490196, 0.0745098039, -1]", ,10,PECH,,,,,,,,,0,144,144,144,down,1,0.843934913515,2017_Apr_26_1509,96.9567160542,Stroop,A-1,2STRNS-6,
neutralofneutral,left,"[0.568627451, -0.7882352941, -0.7882352941]", ,15,HALS,,,,,,,,,0,145,145,145,left,1,0.737550722229,2017_Apr_26_1509,96.9567160542,Stroop,A-1,2STRNS-6,
neutralofneutral,right,"[-0.8745098039, -0.2078431373, 0.637254902]", ,20,MODE,,,,,,,,,0,146,146,146,right,1,0.6062287246,2017_Apr_26_1509,96.9567160542,Stroop,A-1,2STRNS-6,
fix,return,white, ,21,+,,,,,,,,,0,147,147,147,None,0,,2017_Apr_26_1509,96.9567160542,Stroop,A-1,2STRNS-6,
fix,return,white, ,21,+,,,,,,,,,0,148,148,148,None,0,,2017_Apr_26_1509,96.9567160542,Stroop,A-1,2STRNS-6,
fix,return,white, ,21,+,,,,,,,,,0,149,149,149,None,0,,2017_Apr_26_1509,96.9567160542,Stroop,A-1,2STRNS-6,
fix,return,white, ,21,+,,,,,,,,,0,150,150,150,None,0,,2017_Apr_26_1509,96.9567160542,Stroop,A-1,2STRNS-6,
fix,return,white, ,21,+,,,,,,,,,0,151,151,151,None,0,,2017_Apr_26_1509,96.9567160542,Stroop,A-1,2STRNS-6,
fix,return,white, ,21,+,,,,,,,,,0,152,152,152,None,0,,2017_Apr_26_1509,96.9567160542,Stroop,A-1,2STRNS-6,
fix,return,white, ,21,+,,,,,,,,,0,153,153,153,None,0,,2017_Apr_26_1509,96.9567160542,Stroop,A-1,2STRNS-6,
fix,return,white, ,21,+,,,,,,,,,0,154,154,154,None,0,,2017_Apr_26_1509,96.9567160542,Stroop,A-1,2STRNS-6,
fix,return,white, ,21,+,,,,,,,,,0,155,155,155,None,0,,2017_Apr_26_1509,96.9567160542,Stroop,A-1,2STRNS-6,
fix,return,white, ,21,+,,,,,,,,,0,156,156,156,None,0,,2017_Apr_26_1509,96.9567160542,Stroop,A-1,2STRNS-6,
fix,return,white, ,21,+,,,,,,,,,0,157,157,157,None,0,,2017_Apr_26_1509,96.9567160542,Stroop,A-1,2STRNS-6,
fix,return,white, ,21,+,,,,,,,,,0,158,158,158,None,0,,2017_Apr_26_1509,96.9567160542,Stroop,A-1,2STRNS-6,
fix,return,white,+,22,+,,,,,,,,,0,159,159,159,None,0,,2017_Apr_26_1509,96.9567160542,Stroop,A-1,2STRNS-6,
neutral,right,"[-0.8745098039, -0.2078431373, 0.637254902]", ,11,PECH,,,,,,,,,0,160,160,160,right,1,0.854581518042,2017_Apr_26_1509,96.9567160542,Stroop,A-1,2STRNS-6,
neutral,right,"[-0.8745098039, -0.2078431373, 0.637254902]", ,14,SOLL,,,,,,,,,0,161,161,161,right,1,0.608946667803,2017_Apr_26_1509,96.9567160542,Stroop,A-1,2STRNS-6,
neutralofneutral,down,"[-0.7725490196, 0.0745098039, -1]", ,19,MODE,,,,,,,,,0,162,162,162,down,1,0.617147989479,2017_Apr_26_1509,96.9567160542,Stroop,A-1,2STRNS-6,
neutral,left,"[0.568627451, -0.7882352941, -0.7882352941]", ,12,SOLL,,,,,,,,,0,163,163,163,left,1,0.619774580289,2017_Apr_26_1509,96.9567160542,Stroop,A-1,2STRNS-6,
neutralofneutral,right,"[-0.8745098039, -0.2078431373, 0.637254902]", ,17,HALS,,,,,,,,,0,164,164,164,right,1,0.705351657823,2017_Apr_26_1509,96.9567160542,Stroop,A-1,2STRNS-6,
neutralofneutral,left,"[0.568627451, -0.7882352941, -0.7882352941]", ,15,HALS,,,,,,,,,0,165,165,165,left,1,0.555948591232,2017_Apr_26_1509,96.9567160542,Stroop,A-1,2STRNS-6,
neutralofneutral,right,"[-0.8745098039, -0.2078431373, 0.637254902]", ,20,MODE,,,,,,,,,0,166,166,166,right,1,0.574412111037,2017_Apr_26_1509,96.9567160542,Stroop,A-1,2STRNS-6,
neutralofneutral,left,"[0.568627451, -0.7882352941, -0.7882352941]", ,18,MODE,,,,,,,,,0,167,167,167,left,1,0.638160436592,2017_Apr_26_1509,96.9567160542,Stroop,A-1,2STRNS-6,
neutral,left,"[0.568627451, -0.7882352941, -0.7882352941]", ,9,PECH,,,,,,,,,0,168,168,168,left,1,0.78035476576,2017_Apr_26_1509,96.9567160542,Stroop,A-1,2STRNS-6,
neutral,down,"[-0.7725490196, 0.0745098039, -1]", ,10,PECH,,,,,,,,,0,169,169,169,down,1,0.6736356157,2017_Apr_26_1509,96.9567160542,Stroop,A-1,2STRNS-6,
neutral,down,"[-0.7725490196, 0.0745098039, -1]", ,13,SOLL,,,,,,,,,0,170,170,170,down,1,0.57724263838,2017_Apr_26_1509,96.9567160542,Stroop,A-1,2STRNS-6,
neutralofneutral,down,"[-0.7725490196, 0.0745098039, -1]", ,16,HALS,,,,,,,,,0,171,171,171,down,1,0.534424347228,2017_Apr_26_1509,96.9567160542,Stroop,A-1,2STRNS-6,
incongruent,down,"[-0.7725490196, 0.0745098039, -1]", ,1,ROT,,,,,,,,,0,172,172,172,down,1,0.686785890386,2017_Apr_26_1509,96.9567160542,Stroop,A-1,2STRNS-6,
neutral,left,"[0.568627451, -0.7882352941, -0.7882352941]", ,12,SOLL,,,,,,,,,0,173,173,173,left,1,0.876265838256,2017_Apr_26_1509,96.9567160542,Stroop,A-1,2STRNS-6,
incongruent,left,"[0.568627451, -0.7882352941, -0.7882352941]", ,3,GRÜN,,,,,,,,,0,174,174,174,left,1,0.598740622063,2017_Apr_26_1509,96.9567160542,Stroop,A-1,2STRNS-6,
neutral,right,"[-0.8745098039, -0.2078431373, 0.637254902]", ,14,SOLL,,,,,,,,,0,175,175,175,right,1,0.577861432109,2017_Apr_26_1509,96.9567160542,Stroop,A-1,2STRNS-6,
incongruent,down,"[-0.7725490196, 0.0745098039, -1]", ,7,BLAU,,,,,,,,,0,176,176,176,down,1,0.656490978602,2017_Apr_26_1509,96.9567160542,Stroop,A-1,2STRNS-6,
neutral,down,"[-0.7725490196, 0.0745098039, -1]", ,13,SOLL,,,,,,,,,0,177,177,177,down,1,0.578176276594,2017_Apr_26_1509,96.9567160542,Stroop,A-1,2STRNS-6,
incongruent,right,"[-0.8745098039, -0.2078431373, 0.637254902]", ,5,GRÜN,,,,,,,,,0,178,178,178,right,1,0.610469766409,2017_Apr_26_1509,96.9567160542,Stroop,A-1,2STRNS-6,
incongruent,right,"[-0.8745098039, -0.2078431373, 0.637254902]", ,2,ROT,,,,,,,,,0,179,179,179,down,0,0.505827137248,2017_Apr_26_1509,96.9567160542,Stroop,A-1,2STRNS-6,
neutral,right,"[-0.8745098039, -0.2078431373, 0.637254902]", ,11,PECH,,,,,,,,,0,180,180,180,right,1,1.02877125445,2017_Apr_26_1509,96.9567160542,Stroop,A-1,2STRNS-6,
neutral,down,"[-0.7725490196, 0.0745098039, -1]", ,10,PECH,,,,,,,,,0,181,181,181,down,1,0.81513153208,2017_Apr_26_1509,96.9567160542,Stroop,A-1,2STRNS-6,
incongruent,left,"[0.568627451, -0.7882352941, -0.7882352941]", ,6,BLAU,,,,,,,,,0,182,182,182,left,1,0.62468051107,2017_Apr_26_1509,96.9567160542,Stroop,A-1,2STRNS-6,
neutral,left,"[0.568627451, -0.7882352941, -0.7882352941]", ,9,PECH,,,,,,,,,0,183,183,183,left,1,0.57983430855,2017_Apr_26_1509,96.9567160542,Stroop,A-1,2STRNS-6,
congruent,right,"[-0.8745098039, -0.2078431373, 0.637254902]", ,8,BLAU,,,,,,,,,0,184,184,184,right,1,0.884477217077,2017_Apr_26_1509,96.9567160542,Stroop,A-1,2STRNS-6,
neutral,left,"[0.568627451, -0.7882352941, -0.7882352941]", ,12,SOLL,,,,,,,,,0,185,185,185,left,1,0.687156607893,2017_Apr_26_1509,96.9567160542,Stroop,A-1,2STRNS-6,
neutral,down,"[-0.7725490196, 0.0745098039, -1]", ,13,SOLL,,,,,,,,,0,186,186,186,down,1,0.491583148138,2017_Apr_26_1509,96.9567160542,Stroop,A-1,2STRNS-6,
congruent,down,"[-0.7725490196, 0.0745098039, -1]", ,4,GRÜN,,,,,,,,,0,187,187,187,down,1,0.705409486401,2017_Apr_26_1509,96.9567160542,Stroop,A-1,2STRNS-6,
neutral,right,"[-0.8745098039, -0.2078431373, 0.637254902]", ,14,SOLL,,,,,,,,,0,188,188,188,left,0,0.854550508515,2017_Apr_26_1509,96.9567160542,Stroop,A-1,2STRNS-6,
neutral,down,"[-0.7725490196, 0.0745098039, -1]", ,10,PECH,,,,,,,,,0,189,189,189,down,1,0.771451678915,2017_Apr_26_1509,96.9567160542,Stroop,A-1,2STRNS-6,
congruent,right,"[-0.8745098039, -0.2078431373, 0.637254902]", ,8,BLAU,,,,,,,,,0,190,190,190,right,1,0.730364334014,2017_Apr_26_1509,96.9567160542,Stroop,A-1,2STRNS-6,
congruent,left,"[0.568627451, -0.7882352941, -0.7882352941]", ,0,ROT,,,,,,,,,0,191,191,191,left,1,0.68727003013,2017_Apr_26_1509,96.9567160542,Stroop,A-1,2STRNS-6,
neutral,left,"[0.568627451, -0.7882352941, -0.7882352941]", ,9,PECH,,,,,,,,,0,192,192,192,left,1,0.587919973069,2017_Apr_26_1509,96.9567160542,Stroop,A-1,2STRNS-6,
congruent,down,"[-0.7725490196, 0.0745098039, -1]", ,4,GRÜN,,,,,,,,,0,193,193,193,down,1,0.598451758533,2017_Apr_26_1509,96.9567160542,Stroop,A-1,2STRNS-6,
congruent,left,"[0.568627451, -0.7882352941, -0.7882352941]", ,0,ROT,,,,,,,,,0,194,194,194,left,1,0.77600113981,2017_Apr_26_1509,96.9567160542,Stroop,A-1,2STRNS-6,
neutral,right,"[-0.8745098039, -0.2078431373, 0.637254902]", ,11,PECH,,,,,,,,,0,195,195,195,right,1,0.558261734383,2017_Apr_26_1509,96.9567160542,Stroop,A-1,2STRNS-6,
fix,return,white, ,21,+,,,,,,,,,0,196,196,196,None,0,,2017_Apr_26_1509,96.9567160542,Stroop,A-1,2STRNS-6,
fix,return,white, ,21,+,,,,,,,,,0,197,197,197,None,0,,2017_Apr_26_1509,96.9567160542,Stroop,A-1,2STRNS-6,
fix,return,white, ,21,+,,,,,,,,,0,198,198,198,None,0,,2017_Apr_26_1509,96.9567160542,Stroop,A-1,2STRNS-6,
fix,return,white, ,21,+,,,,,,,,,0,199,199,199,None,0,,2017_Apr_26_1509,96.9567160542,Stroop,A-1,2STRNS-6,
fix,return,white, ,21,+,,,,,,,,,0,200,200,200,None,0,,2017_Apr_26_1509,96.9567160542,Stroop,A-1,2STRNS-6,
fix,return,white, ,21,+,,,,,,,,,0,201,201,201,None,0,,2017_Apr_26_1509,96.9567160542,Stroop,A-1,2STRNS-6,
fix,return,white, ,21,+,,,,,,,,,0,202,202,202,None,0,,2017_Apr_26_1509,96.9567160542,Stroop,A-1,2STRNS-6,
fix,return,white, ,21,+,,,,,,,,,0,203,203,203,None,0,,2017_Apr_26_1509,96.9567160542,Stroop,A-1,2STRNS-6,
fix,return,white, ,21,+,,,,,,,,,0,204,204,204,None,0,,2017_Apr_26_1509,96.9567160542,Stroop,A-1,2STRNS-6,
fix,return,white, ,21,+,,,,,,,,,0,205,205,205,None,0,,2017_Apr_26_1509,96.9567160542,Stroop,A-1,2STRNS-6,
fix,return,white, ,21,+,,,,,,,,,0,206,206,206,None,0,,2017_Apr_26_1509,96.9567160542,Stroop,A-1,2STRNS-6,
fix,return,white, ,21,+,,,,,,,,,0,207,207,207,None,0,,2017_Apr_26_1509,96.9567160542,Stroop,A-1,2STRNS-6,
fix,return,white,+,22,+,,,,,,,,,0,208,208,208,None,0,,2017_Apr_26_1509,96.9567160542,Stroop,A-1,2STRNS-6,
incongruent,left,"[0.568627451, -0.7882352941, -0.7882352941]", ,3,GRÜN,,,,,,,,,0,209,209,209,right,0,0.773174244213,2017_Apr_26_1509,96.9567160542,Stroop,A-1,2STRNS-6,
incongruent,right,"[-0.8745098039, -0.2078431373, 0.637254902]", ,2,ROT,,,,,,,,,0,210,210,210,left,0,0.971272605876,2017_Apr_26_1509,96.9567160542,Stroop,A-1,2STRNS-6,
neutral,down,"[-0.7725490196, 0.0745098039, -1]", ,13,SOLL,,,,,,,,,0,211,211,211,down,1,0.698661980782,2017_Apr_26_1509,96.9567160542,Stroop,A-1,2STRNS-6,
incongruent,right,"[-0.8745098039, -0.2078431373, 0.637254902]", ,5,GRÜN,,,,,,,,,0,212,212,212,left,0,1.26133014112,2017_Apr_26_1509,96.9567160542,Stroop,A-1,2STRNS-6,
neutral,down,"[-0.7725490196, 0.0745098039, -1]", ,10,PECH,,,,,,,,,0,213,213,213,down,1,0.869354345315,2017_Apr_26_1509,96.9567160542,Stroop,A-1,2STRNS-6,
incongruent,left,"[0.568627451, -0.7882352941, -0.7882352941]", ,6,BLAU,,,,,,,,,0,214,214,214,left,1,0.938381833445,2017_Apr_26_1509,96.9567160542,Stroop,A-1,2STRNS-6,
neutral,left,"[0.568627451, -0.7882352941, -0.7882352941]", ,9,PECH,,,,,,,,,0,215,215,215,left,1,0.695008723176,2017_Apr_26_1509,96.9567160542,Stroop,A-1,2STRNS-6,
incongruent,down,"[-0.7725490196, 0.0745098039, -1]", ,7,BLAU,,,,,,,,,0,216,216,216,down,1,0.70870292174,2017_Apr_26_1509,96.9567160542,Stroop,A-1,2STRNS-6,
neutral,left,"[0.568627451, -0.7882352941, -0.7882352941]", ,12,SOLL,,,,,,,,,0,217,217,217,left,1,0.736745033238,2017_Apr_26_1509,96.9567160542,Stroop,A-1,2STRNS-6,
incongruent,down,"[-0.7725490196, 0.0745098039, -1]", ,1,ROT,,,,,,,,,0,218,218,218,down,1,0.755720908664,2017_Apr_26_1509,96.9567160542,Stroop,A-1,2STRNS-6,
neutral,right,"[-0.8745098039, -0.2078431373, 0.637254902]", ,14,SOLL,,,,,,,,,0,219,219,219,left,0,1.16660804655,2017_Apr_26_1509,96.9567160542,Stroop,A-1,2STRNS-6,
neutral,right,"[-0.8745098039, -0.2078431373, 0.637254902]", ,11,PECH,,,,,,,,,0,220,220,220,left,0,0.71954089137,2017_Apr_26_1509,96.9567160542,Stroop,A-1,2STRNS-6,
neutral,right,"[-0.8745098039, -0.2078431373, 0.637254902]", ,14,SOLL,,,,,,,,,0,221,221,221,right,1,0.74118945285,2017_Apr_26_1509,96.9567160542,Stroop,A-1,2STRNS-6,
neutralofneutral,right,"[-0.8745098039, -0.2078431373, 0.637254902]", ,17,HALS,,,,,,,,,0,222,222,222,right,1,0.644233554823,2017_Apr_26_1509,96.9567160542,Stroop,A-1,2STRNS-6,
neutral,left,"[0.568627451, -0.7882352941, -0.7882352941]", ,12,SOLL,,,,,,,,,0,223,223,223,left,1,0.644195002437,2017_Apr_26_1509,96.9567160542,Stroop,A-1,2STRNS-6,
neutral,down,"[-0.7725490196, 0.0745098039, -1]", ,13,SOLL,,,,,,,,,0,224,224,224,down,1,0.676297965244,2017_Apr_26_1509,96.9567160542,Stroop,A-1,2STRNS-6,
neutralofneutral,down,"[-0.7725490196, 0.0745098039, -1]", ,16,HALS,,,,,,,,,0,225,225,225,down,1,0.752049492324,2017_Apr_26_1509,96.9567160542,Stroop,A-1,2STRNS-6,
neutral,right,"[-0.8745098039, -0.2078431373, 0.637254902]", ,11,PECH,,,,,,,,,0,226,226,226,right,1,1.18743862698,2017_Apr_26_1509,96.9567160542,Stroop,A-1,2STRNS-6,
neutralofneutral,left,"[0.568627451, -0.7882352941, -0.7882352941]", ,18,MODE,,,,,,,,,0,227,227,227,left,1,0.662534763496,2017_Apr_26_1509,96.9567160542,Stroop,A-1,2STRNS-6,
neutralofneutral,down,"[-0.7725490196, 0.0745098039, -1]", ,19,MODE,,,,,,,,,0,228,228,228,down,1,0.627649324146,2017_Apr_26_1509,96.9567160542,Stroop,A-1,2STRNS-6,
neutral,down,"[-0.7725490196, 0.0745098039, -1]", ,10,PECH,,,,,,,,,0,229,229,229,down,1,0.566571170359,2017_Apr_26_1509,96.9567160542,Stroop,A-1,2STRNS-6,
neutralofneutral,right,"[-0.8745098039, -0.2078431373, 0.637254902]", ,20,MODE,,,,,,,,,0,230,230,230,right,1,0.861613417347,2017_Apr_26_1509,96.9567160542,Stroop,A-1,2STRNS-6,
neutral,left,"[0.568627451, -0.7882352941, -0.7882352941]", ,9,PECH,,,,,,,,,0,231,231,231,left,1,0.609226871013,2017_Apr_26_1509,96.9567160542,Stroop,A-1,2STRNS-6,
neutralofneutral,left,"[0.568627451, -0.7882352941, -0.7882352941]", ,15,HALS,,,,,,,,,0,232,232,232,left,1,0.620282466068,2017_Apr_26_1509,96.9567160542,Stroop,A-1,2STRNS-6,
congruent,down,"[-0.7725490196, 0.0745098039, -1]", ,4,GRÜN,,,,,,,,,0,233,233,233,down,1,0.630827381692,2017_Apr_26_1509,96.9567160542,Stroop,A-1,2STRNS-6,
neutral,right,"[-0.8745098039, -0.2078431373, 0.637254902]", ,14,SOLL,,,,,,,,,0,234,234,234,right,1,0.772881469573,2017_Apr_26_1509,96.9567160542,Stroop,A-1,2STRNS-6,
neutral,down,"[-0.7725490196, 0.0745098039, -1]", ,13,SOLL,,,,,,,,,0,235,235,235,down,1,0.622417653641,2017_Apr_26_1509,96.9567160542,Stroop,A-1,2STRNS-6,
neutral,right,"[-0.8745098039, -0.2078431373, 0.637254902]", ,11,PECH,,,,,,,,,0,236,236,236,right,1,0.483201356597,2017_Apr_26_1509,96.9567160542,Stroop,A-1,2STRNS-6,
congruent,right,"[-0.8745098039, -0.2078431373, 0.637254902]", ,8,BLAU,,,,,,,,,0,237,237,237,right,1,0.679798410133,2017_Apr_26_1509,96.9567160542,Stroop,A-1,2STRNS-6,
congruent,left,"[0.568627451, -0.7882352941, -0.7882352941]", ,0,ROT,,,,,,,,,0,238,238,238,left,1,0.700874552492,2017_Apr_26_1509,96.9567160542,Stroop,A-1,2STRNS-6,
neutral,left,"[0.568627451, -0.7882352941, -0.7882352941]", ,9,PECH,,,,,,,,,0,239,239,239,left,1,0.546903028178,2017_Apr_26_1509,96.9567160542,Stroop,A-1,2STRNS-6,
congruent,down,"[-0.7725490196, 0.0745098039, -1]", ,4,GRÜN,,,,,,,,,0,240,240,240,down,1,0.450731866759,2017_Apr_26_1509,96.9567160542,Stroop,A-1,2STRNS-6,
neutral,down,"[-0.7725490196, 0.0745098039, -1]", ,10,PECH,,,,,,,,,0,241,241,241,down,1,0.654164705291,2017_Apr_26_1509,96.9567160542,Stroop,A-1,2STRNS-6,
congruent,right,"[-0.8745098039, -0.2078431373, 0.637254902]", ,8,BLAU,,,,,,,,,0,242,242,242,None,0,,2017_Apr_26_1509,96.9567160542,Stroop,A-1,2STRNS-6,
neutral,left,"[0.568627451, -0.7882352941, -0.7882352941]", ,12,SOLL,,,,,,,,,0,243,243,243,left,1,1.1414445132,2017_Apr_26_1509,96.9567160542,Stroop,A-1,2STRNS-6,
congruent,left,"[0.568627451, -0.7882352941, -0.7882352941]", ,0,ROT,,,,,,,,,0,244,244,244,left,1,0.698147948971,2017_Apr_26_1509,96.9567160542,Stroop,A-1,2STRNS-6,
fix,return,white, ,21,+,,,,,,,,,0,245,245,245,None,0,,2017_Apr_26_1509,96.9567160542,Stroop,A-1,2STRNS-6,
fix,return,white, ,21,+,,,,,,,,,0,246,246,246,None,0,,2017_Apr_26_1509,96.9567160542,Stroop,A-1,2STRNS-6,
fix,return,white, ,21,+,,,,,,,,,0,247,247,247,None,0,,2017_Apr_26_1509,96.9567160542,Stroop,A-1,2STRNS-6,
fix,return,white, ,21,+,,,,,,,,,0,248,248,248,None,0,,2017_Apr_26_1509,96.9567160542,Stroop,A-1,2STRNS-6,
fix,return,white, ,21,+,,,,,,,,,0,249,249,249,None,0,,2017_Apr_26_1509,96.9567160542,Stroop,A-1,2STRNS-6,
fix,return,white, ,21,+,,,,,,,,,0,250,250,250,None,0,,2017_Apr_26_1509,96.9567160542,Stroop,A-1,2STRNS-6,
fix,return,white, ,21,+,,,,,,,,,0,251,251,251,None,0,,2017_Apr_26_1509,96.9567160542,Stroop,A-1,2STRNS-6,
fix,return,white, ,21,+,,,,,,,,,0,252,252,252,None,0,,2017_Apr_26_1509,96.9567160542,Stroop,A-1,2STRNS-6,
fix,return,white, ,21,+,,,,,,,,,0,253,253,253,None,0,,2017_Apr_26_1509,96.9567160542,Stroop,A-1,2STRNS-6,
fix,return,white, ,21,+,,,,,,,,,0,254,254,254,None,0,,2017_Apr_26_1509,96.9567160542,Stroop,A-1,2STRNS-6,
fix,return,white, ,21,+,,,,,,,,,0,255,255,255,None,0,,2017_Apr_26_1509,96.9567160542,Stroop,A-1,2STRNS-6,
fix,return,white, ,21,+,,,,,,,,,0,256,256,256,None,0,,2017_Apr_26_1509,96.9567160542,Stroop,A-1,2STRNS-6,
fix,return,white,+,22,+,,,,,,,,,0,257,257,257,None,0,,2017_Apr_26_1509,96.9567160542,Stroop,A-1,2STRNS-6,
neutral,left,"[0.568627451, -0.7882352941, -0.7882352941]", ,9,PECH,,,,,,,,,0,258,258,258,left,1,0.705376521318,2017_Apr_26_1509,96.9567160542,Stroop,A-1,2STRNS-6,
neutralofneutral,right,"[-0.8745098039, -0.2078431373, 0.637254902]", ,20,MODE,,,,,,,,,0,259,259,259,right,1,0.510138579066,2017_Apr_26_1509,96.9567160542,Stroop,A-1,2STRNS-6,
neutralofneutral,right,"[-0.8745098039, -0.2078431373, 0.637254902]", ,17,HALS,,,,,,,,,0,260,260,260,right,1,0.748444564882,2017_Apr_26_1509,96.9567160542,Stroop,A-1,2STRNS-6,
neutral,right,"[-0.8745098039, -0.2078431373, 0.637254902]", ,14,SOLL,,,,,,,,,0,261,261,261,right,1,0.599168050688,2017_Apr_26_1509,96.9567160542,Stroop,A-1,2STRNS-6,
neutralofneutral,left,"[0.568627451, -0.7882352941, -0.7882352941]", ,18,MODE,,,,,,,,,0,262,262,262,left,1,0.457620731126,2017_Apr_26_1509,96.9567160542,Stroop,A-1,2STRNS-6,
neutralofneutral,down,"[-0.7725490196, 0.0745098039, -1]", ,16,HALS,,,,,,,,,0,263,263,263,down,1,0.568146510241,2017_Apr_26_1509,96.9567160542,Stroop,A-1,2STRNS-6,
neutral,down,"[-0.7725490196, 0.0745098039, -1]", ,10,PECH,,,,,,,,,0,264,264,264,down,1,0.644234392919,2017_Apr_26_1509,96.9567160542,Stroop,A-1,2STRNS-6,
neutralofneutral,down,"[-0.7725490196, 0.0745098039, -1]", ,19,MODE,,,,,,,,,0,265,265,265,down,1,0.52380986969,2017_Apr_26_1509,96.9567160542,Stroop,A-1,2STRNS-6,
neutral,right,"[-0.8745098039, -0.2078431373, 0.637254902]", ,11,PECH,,,,,,,,,0,266,266,266,right,1,0.741148386177,2017_Apr_26_1509,96.9567160542,Stroop,A-1,2STRNS-6,
neutralofneutral,left,"[0.568627451, -0.7882352941, -0.7882352941]", ,15,HALS,,,,,,,,,0,267,267,267,left,1,0.665837417884,2017_Apr_26_1509,96.9567160542,Stroop,A-1,2STRNS-6,
neutral,down,"[-0.7725490196, 0.0745098039, -1]", ,13,SOLL,,,,,,,,,0,268,268,268,down,1,0.655169860974,2017_Apr_26_1509,96.9567160542,Stroop,A-1,2STRNS-6,
neutral,left,"[0.568627451, -0.7882352941, -0.7882352941]", ,12,SOLL,,,,,,,,,0,269,269,269,left,1,0.719536142164,2017_Apr_26_1509,96.9567160542,Stroop,A-1,2STRNS-6,
neutral,down,"[-0.7725490196, 0.0745098039, -1]", ,13,SOLL,,,,,,,,,0,270,270,270,down,1,0.641658087829,2017_Apr_26_1509,96.9567160542,Stroop,A-1,2STRNS-6,
congruent,right,"[-0.8745098039, -0.2078431373, 0.637254902]", ,8,BLAU,,,,,,,,,0,271,271,271,right,1,0.719204535772,2017_Apr_26_1509,96.9567160542,Stroop,A-1,2STRNS-6,
congruent,left,"[0.568627451, -0.7882352941, -0.7882352941]", ,0,ROT,,,,,,,,,0,272,272,272,left,1,0.493904672241,2017_Apr_26_1509,96.9567160542,Stroop,A-1,2STRNS-6,
neutral,right,"[-0.8745098039, -0.2078431373, 0.637254902]", ,11,PECH,,,,,,,,,0,273,273,273,right,1,0.75926437578,2017_Apr_26_1509,96.9567160542,Stroop,A-1,2STRNS-6,
congruent,down,"[-0.7725490196, 0.0745098039, -1]", ,4,GRÜN,,,,,,,,,0,274,274,274,down,1,0.662038890418,2017_Apr_26_1509,96.9567160542,Stroop,A-1,2STRNS-6,
congruent,down,"[-0.7725490196, 0.0745098039, -1]", ,4,GRÜN,,,,,,,,,0,275,275,275,down,1,0.59839420932,2017_Apr_26_1509,96.9567160542,Stroop,A-1,2STRNS-6,
congruent,right,"[-0.8745098039, -0.2078431373, 0.637254902]", ,8,BLAU,,,,,,,,,0,276,276,276,right,1,0.733261350256,2017_Apr_26_1509,96.9567160542,Stroop,A-1,2STRNS-6,
neutral,right,"[-0.8745098039, -0.2078431373, 0.637254902]", ,14,SOLL,,,,,,,,,0,277,277,277,right,1,0.568794637307,2017_Apr_26_1509,96.9567160542,Stroop,A-1,2STRNS-6,
neutral,down,"[-0.7725490196, 0.0745098039, -1]", ,10,PECH,,,,,,,,,0,278,278,278,down,1,0.740888297256,2017_Apr_26_1509,96.9567160542,Stroop,A-1,2STRNS-6,
neutral,left,"[0.568627451, -0.7882352941, -0.7882352941]", ,9,PECH,,,,,,,,,0,279,279,279,left,1,0.525949527105,2017_Apr_26_1509,96.9567160542,Stroop,A-1,2STRNS-6,
neutral,left,"[0.568627451, -0.7882352941, -0.7882352941]", ,12,SOLL,,,,,,,,,0,280,280,280,left,1,0.515370249571,2017_Apr_26_1509,96.9567160542,Stroop,A-1,2STRNS-6,
congruent,left,"[0.568627451, -0.7882352941, -0.7882352941]", ,0,ROT,,,,,,,,,0,281,281,281,left,1,0.517352065695,2017_Apr_26_1509,96.9567160542,Stroop,A-1,2STRNS-6,
incongruent,down,"[-0.7725490196, 0.0745098039, -1]", ,1,ROT,,,,,,,,,0,282,282,282,down,1,0.571277634448,2017_Apr_26_1509,96.9567160542,Stroop,A-1,2STRNS-6,
neutral,down,"[-0.7725490196, 0.0745098039, -1]", ,10,PECH,,,,,,,,,0,283,283,283,down,1,0.558416502656,2017_Apr_26_1509,96.9567160542,Stroop,A-1,2STRNS-6,
neutral,right,"[-0.8745098039, -0.2078431373, 0.637254902]", ,11,PECH,,,,,,,,,0,284,284,284,right,1,0.644076272264,2017_Apr_26_1509,96.9567160542,Stroop,A-1,2STRNS-6,
neutral,right,"[-0.8745098039, -0.2078431373, 0.637254902]", ,14,SOLL,,,,,,,,,0,285,285,285,right,1,0.470306142261,2017_Apr_26_1509,96.9567160542,Stroop,A-1,2STRNS-6,
neutral,down,"[-0.7725490196, 0.0745098039, -1]", ,13,SOLL,,,,,,,,,0,286,286,286,down,1,0.801023873146,2017_Apr_26_1509,96.9567160542,Stroop,A-1,2STRNS-6,
neutral,left,"[0.568627451, -0.7882352941, -0.7882352941]", ,12,SOLL,,,,,,,,,0,287,287,287,left,1,0.523679964912,2017_Apr_26_1509,96.9567160542,Stroop,A-1,2STRNS-6,
incongruent,left,"[0.568627451, -0.7882352941, -0.7882352941]", ,6,BLAU,,,,,,,,,0,288,288,288,left,1,0.761848782457,2017_Apr_26_1509,96.9567160542,Stroop,A-1,2STRNS-6,
incongruent,down,"[-0.7725490196, 0.0745098039, -1]", ,7,BLAU,,,,,,,,,0,289,289,289,down,1,0.622333844106,2017_Apr_26_1509,96.9567160542,Stroop,A-1,2STRNS-6,
incongruent,right,"[-0.8745098039, -0.2078431373, 0.637254902]", ,5,GRÜN,,,,,,,,,0,290,290,290,right,1,0.739314354199,2017_Apr_26_1509,96.9567160542,Stroop,A-1,2STRNS-6,
incongruent,right,"[-0.8745098039, -0.2078431373, 0.637254902]", ,2,ROT,,,,,,,,,0,291,291,291,down,0,0.485547185466,2017_Apr_26_1509,96.9567160542,Stroop,A-1,2STRNS-6,
neutral,left,"[0.568627451, -0.7882352941, -0.7882352941]", ,9,PECH,,,,,,,,,0,292,292,292,left,1,0.719191126247,2017_Apr_26_1509,96.9567160542,Stroop,A-1,2STRNS-6,
incongruent,left,"[0.568627451, -0.7882352941, -0.7882352941]", ,3,GRÜN,,,,,,,,,0,293,293,293,down,0,0.955583181661,2017_Apr_26_1509,96.9567160542,Stroop,A-1,2STRNS-6,
fix,return,white, ,21,+,,,,,,,,,0,294,294,294,None,0,,2017_Apr_26_1509,96.9567160542,Stroop,A-1,2STRNS-6,
fix,return,white, ,21,+,,,,,,,,,0,295,295,295,None,0,,2017_Apr_26_1509,96.9567160542,Stroop,A-1,2STRNS-6,
fix,return,white, ,21,+,,,,,,,,,0,296,296,296,None,0,,2017_Apr_26_1509,96.9567160542,Stroop,A-1,2STRNS-6,
fix,return,white, ,21,+,,,,,,,,,0,297,297,297,None,0,,2017_Apr_26_1509,96.9567160542,Stroop,A-1,2STRNS-6,
fix,return,white, ,21,+,,,,,,,,,0,298,298,298,None,0,,2017_Apr_26_1509,96.9567160542,Stroop,A-1,2STRNS-6,
fix,return,white, ,21,+,,,,,,,,,0,299,299,299,None,0,,2017_Apr_26_1509,96.9567160542,Stroop,A-1,2STRNS-6,
fix,return,white, ,21,+,,,,,,,,,0,300,300,300,None,0,,2017_Apr_26_1509,96.9567160542,Stroop,A-1,2STRNS-6,
fix,return,white, ,21,+,,,,,,,,,0,301,301,301,None,0,,2017_Apr_26_1509,96.9567160542,Stroop,A-1,2STRNS-6,
fix,return,white, ,21,+,,,,,,,,,0,302,302,302,None,0,,2017_Apr_26_1509,96.9567160542,Stroop,A-1,2STRNS-6,
fix,return,white, ,21,+,,,,,,,,,0,303,303,303,None,0,,2017_Apr_26_1509,96.9567160542,Stroop,A-1,2STRNS-6,
fix,return,white, ,21,+,,,,,,,,,0,304,304,304,None,0,,2017_Apr_26_1509,96.9567160542,Stroop,A-1,2STRNS-6,
fix,return,white, ,21,+,,,,,,,,,0,305,305,305,None,0,,2017_Apr_26_1509,96.9567160542,Stroop,A-1,2STRNS-6,
fix,return,white,+,22,+,,,,,,,,,0,306,306,306,None,0,,2017_Apr_26_1509,96.9567160542,Stroop,A-1,2STRNS-6,
