best_paramset_1 = [139.58749442499999, 0.67166834043000001, 25.927352920699999, 3.3947191969900001, 116.124212543, 293.24153244500002, 95.838701737899996]
best_paramset_statistic_1 = 0.285001584534
best_paramset_2 = [120.83985068699999, 0.64545273865700004, 25.130125323600002, 4.1274924581499999, 71.607676046099996, 313.731423527, 126.443688759]
best_paramset_statistic_2 = 0.718919364005
ID = "Tarana_propersims_36"