best_paramset_1 = [79.045318687000005, 0.35453770969999998, 12.641679096400001, 3.7627761527399999, 148.40892877499999, 379.89895558900002, 259.39193060500003]
best_paramset_statistic_1 = 17.6726073159
best_paramset_2 = [80.628872494399999, 0.36082504286900002, 19.5341003574, 4.3397506013199996, 141.87229670799999, 378.59180839200002, 265.57432951700002]
best_paramset_statistic_2 = 18.5874216874
ID = "SMRI6sham"