congruent,corrAns,letterColor,signal,selectedrownumber_novariable,Anzeigetext,practice.thisRepN,practice.thisTrialN,practice.thisN,practice.thisIndex,Wrongresponse.thisRepN,Wrongresponse.thisTrialN,Wrongresponse.thisN,Wrongresponse.thisIndex,trials.thisRepN,trials.thisTrialN,trials.thisN,trials.thisIndex,resp.keys,resp.corr,resp.rt,date,frameRate,expName,session,participant,
congruent,left,"[0.568627451, -0.7882352941, -0.7882352941]", ,0,ROT,0,0,0,0,0,0,0,0,,,,,None,0,,2017_Mai_30_1336,98.8305861564,Stroop,B-2,1STACS-8,
,,,,,,0,0,0,0,,,,,,,,,,,,2017_Mai_30_1336,98.8305861564,Stroop,B-2,1STACS-8,
congruent,left,"[0.568627451, -0.7882352941, -0.7882352941]", ,0,ROT,1,0,1,0,0,0,0,0,,,,,left,1,0.375371171476,2017_Mai_30_1336,98.8305861564,Stroop,B-2,1STACS-8,
,,,,,,1,0,1,0,,,,,,,,,,,,2017_Mai_30_1336,98.8305861564,Stroop,B-2,1STACS-8,
neutralofneutral,right,"[-0.8745098039, -0.2078431373, 0.637254902]", ,17,HALS,2,0,2,0,0,0,0,0,,,,,right,1,0.567344173631,2017_Mai_30_1336,98.8305861564,Stroop,B-2,1STACS-8,
,,,,,,2,0,2,0,,,,,,,,,,,,2017_Mai_30_1336,98.8305861564,Stroop,B-2,1STACS-8,
neutral,left,"[0.568627451, -0.7882352941, -0.7882352941]", ,9,PECH,3,0,3,0,0,0,0,0,,,,,left,1,0.491267465558,2017_Mai_30_1336,98.8305861564,Stroop,B-2,1STACS-8,
,,,,,,3,0,3,0,,,,,,,,,,,,2017_Mai_30_1336,98.8305861564,Stroop,B-2,1STACS-8,
neutralofneutral,down,"[-0.7725490196, 0.0745098039, -1]", ,19,MODE,4,0,4,0,0,0,0,0,,,,,down,1,0.535407712433,2017_Mai_30_1336,98.8305861564,Stroop,B-2,1STACS-8,
,,,,,,4,0,4,0,,,,,,,,,,,,2017_Mai_30_1336,98.8305861564,Stroop,B-2,1STACS-8,
congruent,down,"[-0.7725490196, 0.0745098039, -1]", ,4,GRÜN,5,0,5,0,0,0,0,0,,,,,down,1,0.441819281501,2017_Mai_30_1336,98.8305861564,Stroop,B-2,1STACS-8,
,,,,,,5,0,5,0,,,,,,,,,,,,2017_Mai_30_1336,98.8305861564,Stroop,B-2,1STACS-8,
incongruent,right,"[-0.8745098039, -0.2078431373, 0.637254902]", ,5,GRÜN,6,0,6,0,0,0,0,0,,,,,right,1,0.581614423062,2017_Mai_30_1336,98.8305861564,Stroop,B-2,1STACS-8,
,,,,,,6,0,6,0,,,,,,,,,,,,2017_Mai_30_1336,98.8305861564,Stroop,B-2,1STACS-8,
neutralofneutral,down,"[-0.7725490196, 0.0745098039, -1]", ,16,HALS,7,0,7,0,0,0,0,0,,,,,down,1,0.547152780591,2017_Mai_30_1336,98.8305861564,Stroop,B-2,1STACS-8,
,,,,,,7,0,7,0,,,,,,,,,,,,2017_Mai_30_1336,98.8305861564,Stroop,B-2,1STACS-8,
incongruent,right,"[-0.8745098039, -0.2078431373, 0.637254902]", ,2,ROT,8,0,8,0,0,0,0,0,,,,,right,1,0.716624598936,2017_Mai_30_1336,98.8305861564,Stroop,B-2,1STACS-8,
,,,,,,8,0,8,0,,,,,,,,,,,,2017_Mai_30_1336,98.8305861564,Stroop,B-2,1STACS-8,
neutral,left,"[0.568627451, -0.7882352941, -0.7882352941]", ,9,PECH,9,0,9,0,0,0,0,0,,,,,left,1,0.524728422188,2017_Mai_30_1336,98.8305861564,Stroop,B-2,1STACS-8,
,,,,,,9,0,9,0,,,,,,,,,,,,2017_Mai_30_1336,98.8305861564,Stroop,B-2,1STACS-8,
neutralofneutral,down,"[-0.7725490196, 0.0745098039, -1]", ,19,MODE,10,0,10,0,0,0,0,0,,,,,down,1,0.578002790858,2017_Mai_30_1336,98.8305861564,Stroop,B-2,1STACS-8,
,,,,,,10,0,10,0,,,,,,,,,,,,2017_Mai_30_1336,98.8305861564,Stroop,B-2,1STACS-8,
neutral,down,"[-0.7725490196, 0.0745098039, -1]", ,13,SOLL,11,0,11,0,0,0,0,0,,,,,down,1,0.528679203642,2017_Mai_30_1336,98.8305861564,Stroop,B-2,1STACS-8,
,,,,,,11,0,11,0,,,,,,,,,,,,2017_Mai_30_1336,98.8305861564,Stroop,B-2,1STACS-8,
neutral,right,"[-0.8745098039, -0.2078431373, 0.637254902]", ,14,SOLL,12,0,12,0,0,0,0,0,,,,,right,1,0.42000896762,2017_Mai_30_1336,98.8305861564,Stroop,B-2,1STACS-8,
,,,,,,12,0,12,0,,,,,,,,,,,,2017_Mai_30_1336,98.8305861564,Stroop,B-2,1STACS-8,
incongruent,left,"[0.568627451, -0.7882352941, -0.7882352941]", ,3,GRÜN,13,0,13,0,0,0,0,0,,,,,left,1,0.355411372116,2017_Mai_30_1336,98.8305861564,Stroop,B-2,1STACS-8,
,,,,,,13,0,13,0,,,,,,,,,,,,2017_Mai_30_1336,98.8305861564,Stroop,B-2,1STACS-8,
neutral,right,"[-0.8745098039, -0.2078431373, 0.637254902]", ,14,SOLL,14,0,14,0,0,0,0,0,,,,,right,1,0.537268284098,2017_Mai_30_1336,98.8305861564,Stroop,B-2,1STACS-8,
,,,,,,14,0,14,0,,,,,,,,,,,,2017_Mai_30_1336,98.8305861564,Stroop,B-2,1STACS-8,
congruent,left,"[0.568627451, -0.7882352941, -0.7882352941]", ,0,ROT,15,0,15,0,0,0,0,0,,,,,left,1,0.588770360479,2017_Mai_30_1336,98.8305861564,Stroop,B-2,1STACS-8,
,,,,,,15,0,15,0,,,,,,,,,,,,2017_Mai_30_1336,98.8305861564,Stroop,B-2,1STACS-8,
neutralofneutral,left,"[0.568627451, -0.7882352941, -0.7882352941]", ,15,HALS,16,0,16,0,0,0,0,0,,,,,left,1,0.525129311128,2017_Mai_30_1336,98.8305861564,Stroop,B-2,1STACS-8,
,,,,,,16,0,16,0,,,,,,,,,,,,2017_Mai_30_1336,98.8305861564,Stroop,B-2,1STACS-8,
neutralofneutral,right,"[-0.8745098039, -0.2078431373, 0.637254902]", ,20,MODE,17,0,17,0,0,0,0,0,,,,,right,1,0.524449057073,2017_Mai_30_1336,98.8305861564,Stroop,B-2,1STACS-8,
,,,,,,17,0,17,0,,,,,,,,,,,,2017_Mai_30_1336,98.8305861564,Stroop,B-2,1STACS-8,
incongruent,right,"[-0.8745098039, -0.2078431373, 0.637254902]", ,5,GRÜN,18,0,18,0,0,0,0,0,,,,,right,1,0.559431156753,2017_Mai_30_1336,98.8305861564,Stroop,B-2,1STACS-8,
,,,,,,18,0,18,0,,,,,,,,,,,,2017_Mai_30_1336,98.8305861564,Stroop,B-2,1STACS-8,
neutralofneutral,down,"[-0.7725490196, 0.0745098039, -1]", ,16,HALS,19,0,19,0,0,0,0,0,,,,,down,1,0.353045987688,2017_Mai_30_1336,98.8305861564,Stroop,B-2,1STACS-8,
,,,,,,19,0,19,0,,,,,,,,,,,,2017_Mai_30_1336,98.8305861564,Stroop,B-2,1STACS-8,
neutral,left,"[0.568627451, -0.7882352941, -0.7882352941]", ,12,SOLL,20,0,20,0,0,0,0,0,,,,,left,1,0.529359178331,2017_Mai_30_1336,98.8305861564,Stroop,B-2,1STACS-8,
,,,,,,20,0,20,0,,,,,,,,,,,,2017_Mai_30_1336,98.8305861564,Stroop,B-2,1STACS-8,
incongruent,down,"[-0.7725490196, 0.0745098039, -1]", ,7,BLAU,21,0,21,0,0,0,0,0,,,,,down,1,0.598931428436,2017_Mai_30_1336,98.8305861564,Stroop,B-2,1STACS-8,
,,,,,,21,0,21,0,,,,,,,,,,,,2017_Mai_30_1336,98.8305861564,Stroop,B-2,1STACS-8,
neutralofneutral,left,"[0.568627451, -0.7882352941, -0.7882352941]", ,18,MODE,22,0,22,0,0,0,0,0,,,,,left,1,0.470703120089,2017_Mai_30_1336,98.8305861564,Stroop,B-2,1STACS-8,
,,,,,,22,0,22,0,,,,,,,,,,,,2017_Mai_30_1336,98.8305861564,Stroop,B-2,1STACS-8,
neutralofneutral,down,"[-0.7725490196, 0.0745098039, -1]", ,19,MODE,23,0,23,0,0,0,0,0,,,,,down,1,0.556331880169,2017_Mai_30_1336,98.8305861564,Stroop,B-2,1STACS-8,
,,,,,,23,0,23,0,,,,,,,,,,,,2017_Mai_30_1336,98.8305861564,Stroop,B-2,1STACS-8,
neutralofneutral,down,"[-0.7725490196, 0.0745098039, -1]", ,16,HALS,24,0,24,0,0,0,0,0,,,,,down,1,0.773832149058,2017_Mai_30_1336,98.8305861564,Stroop,B-2,1STACS-8,
,,,,,,24,0,24,0,,,,,,,,,,,,2017_Mai_30_1336,98.8305861564,Stroop,B-2,1STACS-8,
incongruent,right,"[-0.8745098039, -0.2078431373, 0.637254902]", ,5,GRÜN,25,0,25,0,0,0,0,0,,,,,right,1,1.02340157757,2017_Mai_30_1336,98.8305861564,Stroop,B-2,1STACS-8,
,,,,,,25,0,25,0,,,,,,,,,,,,2017_Mai_30_1336,98.8305861564,Stroop,B-2,1STACS-8,
incongruent,left,"[0.568627451, -0.7882352941, -0.7882352941]", ,3,GRÜN,26,0,26,0,0,0,0,0,,,,,left,1,0.583100645473,2017_Mai_30_1336,98.8305861564,Stroop,B-2,1STACS-8,
,,,,,,26,0,26,0,,,,,,,,,,,,2017_Mai_30_1336,98.8305861564,Stroop,B-2,1STACS-8,
incongruent,left,"[0.568627451, -0.7882352941, -0.7882352941]", ,6,BLAU,27,0,27,0,0,0,0,0,,,,,left,1,0.588199058819,2017_Mai_30_1336,98.8305861564,Stroop,B-2,1STACS-8,
,,,,,,27,0,27,0,,,,,,,,,,,,2017_Mai_30_1336,98.8305861564,Stroop,B-2,1STACS-8,
neutral,left,"[0.568627451, -0.7882352941, -0.7882352941]", ,9,PECH,28,0,28,0,0,0,0,0,,,,,left,1,0.952191409802,2017_Mai_30_1336,98.8305861564,Stroop,B-2,1STACS-8,
,,,,,,28,0,28,0,,,,,,,,,,,,2017_Mai_30_1336,98.8305861564,Stroop,B-2,1STACS-8,
neutralofneutral,right,"[-0.8745098039, -0.2078431373, 0.637254902]", ,20,MODE,29,0,29,0,0,0,0,0,,,,,right,1,0.716854237061,2017_Mai_30_1336,98.8305861564,Stroop,B-2,1STACS-8,
,,,,,,29,0,29,0,,,,,,,,,,,,2017_Mai_30_1336,98.8305861564,Stroop,B-2,1STACS-8,
congruent,down,"[-0.7725490196, 0.0745098039, -1]", ,4,GRÜN,30,0,30,0,0,0,0,0,,,,,down,1,0.344218329425,2017_Mai_30_1336,98.8305861564,Stroop,B-2,1STACS-8,
,,,,,,30,0,30,0,,,,,,,,,,,,2017_Mai_30_1336,98.8305861564,Stroop,B-2,1STACS-8,
neutralofneutral,down,"[-0.7725490196, 0.0745098039, -1]", ,19,MODE,31,0,31,0,0,0,0,0,,,,,down,1,0.503896444939,2017_Mai_30_1336,98.8305861564,Stroop,B-2,1STACS-8,
,,,,,,31,0,31,0,,,,,,,,,,,,2017_Mai_30_1336,98.8305861564,Stroop,B-2,1STACS-8,
incongruent,down,"[-0.7725490196, 0.0745098039, -1]", ,7,BLAU,32,0,32,0,0,0,0,0,,,,,down,1,0.740199382882,2017_Mai_30_1336,98.8305861564,Stroop,B-2,1STACS-8,
,,,,,,32,0,32,0,,,,,,,,,,,,2017_Mai_30_1336,98.8305861564,Stroop,B-2,1STACS-8,
congruent,down,"[-0.7725490196, 0.0745098039, -1]", ,4,GRÜN,33,0,33,0,0,0,0,0,,,,,down,1,0.44555132007,2017_Mai_30_1336,98.8305861564,Stroop,B-2,1STACS-8,
,,,,,,33,0,33,0,,,,,,,,,,,,2017_Mai_30_1336,98.8305861564,Stroop,B-2,1STACS-8,
incongruent,right,"[-0.8745098039, -0.2078431373, 0.637254902]", ,2,ROT,34,0,34,0,0,0,0,0,,,,,right,1,0.619919291418,2017_Mai_30_1336,98.8305861564,Stroop,B-2,1STACS-8,
,,,,,,34,0,34,0,,,,,,,,,,,,2017_Mai_30_1336,98.8305861564,Stroop,B-2,1STACS-8,
congruent,right,"[-0.8745098039, -0.2078431373, 0.637254902]", ,8,BLAU,35,0,35,0,0,0,0,0,,,,,right,1,0.555867295983,2017_Mai_30_1336,98.8305861564,Stroop,B-2,1STACS-8,
,,,,,,35,0,35,0,,,,,,,,,,,,2017_Mai_30_1336,98.8305861564,Stroop,B-2,1STACS-8,
incongruent,right,"[-0.8745098039, -0.2078431373, 0.637254902]", ,5,GRÜN,36,0,36,0,0,0,0,0,,,,,right,1,0.649854380934,2017_Mai_30_1336,98.8305861564,Stroop,B-2,1STACS-8,
,,,,,,36,0,36,0,,,,,,,,,,,,2017_Mai_30_1336,98.8305861564,Stroop,B-2,1STACS-8,
incongruent,down,"[-0.7725490196, 0.0745098039, -1]", ,7,BLAU,37,0,37,0,0,0,0,0,,,,,down,1,0.39790699656,2017_Mai_30_1336,98.8305861564,Stroop,B-2,1STACS-8,
,,,,,,37,0,37,0,,,,,,,,,,,,2017_Mai_30_1336,98.8305861564,Stroop,B-2,1STACS-8,
neutral,right,"[-0.8745098039, -0.2078431373, 0.637254902]", ,14,SOLL,38,0,38,0,0,0,0,0,,,,,right,1,0.625709971519,2017_Mai_30_1336,98.8305861564,Stroop,B-2,1STACS-8,
,,,,,,38,0,38,0,,,,,,,,,,,,2017_Mai_30_1336,98.8305861564,Stroop,B-2,1STACS-8,
incongruent,down,"[-0.7725490196, 0.0745098039, -1]", ,7,BLAU,39,0,39,0,0,0,0,0,,,,,down,1,0.582830220042,2017_Mai_30_1336,98.8305861564,Stroop,B-2,1STACS-8,
,,,,,,39,0,39,0,,,,,,,,,,,,2017_Mai_30_1336,98.8305861564,Stroop,B-2,1STACS-8,
neutral,down,"[-0.7725490196, 0.0745098039, -1]", ,13,SOLL,40,0,40,0,0,0,0,0,,,,,down,1,0.709046820196,2017_Mai_30_1336,98.8305861564,Stroop,B-2,1STACS-8,
,,,,,,40,0,40,0,,,,,,,,,,,,2017_Mai_30_1336,98.8305861564,Stroop,B-2,1STACS-8,
incongruent,left,"[0.568627451, -0.7882352941, -0.7882352941]", ,6,BLAU,41,0,41,0,0,0,0,0,,,,,left,1,0.578123197222,2017_Mai_30_1336,98.8305861564,Stroop,B-2,1STACS-8,
,,,,,,41,0,41,0,,,,,,,,,,,,2017_Mai_30_1336,98.8305861564,Stroop,B-2,1STACS-8,
congruent,right,"[-0.8745098039, -0.2078431373, 0.637254902]", ,8,BLAU,42,0,42,0,0,0,0,0,,,,,right,1,0.598232456918,2017_Mai_30_1336,98.8305861564,Stroop,B-2,1STACS-8,
,,,,,,42,0,42,0,,,,,,,,,,,,2017_Mai_30_1336,98.8305861564,Stroop,B-2,1STACS-8,
incongruent,down,"[-0.7725490196, 0.0745098039, -1]", ,7,BLAU,43,0,43,0,0,0,0,0,,,,,down,1,0.9020132447,2017_Mai_30_1336,98.8305861564,Stroop,B-2,1STACS-8,
,,,,,,43,0,43,0,,,,,,,,,,,,2017_Mai_30_1336,98.8305861564,Stroop,B-2,1STACS-8,
incongruent,right,"[-0.8745098039, -0.2078431373, 0.637254902]", ,5,GRÜN,44,0,44,0,0,0,0,0,,,,,right,1,0.948095917219,2017_Mai_30_1336,98.8305861564,Stroop,B-2,1STACS-8,
,,,,,,44,0,44,0,,,,,,,,,,,,2017_Mai_30_1336,98.8305861564,Stroop,B-2,1STACS-8,
neutralofneutral,left,"[0.568627451, -0.7882352941, -0.7882352941]", ,18,MODE,45,0,45,0,0,0,0,0,,,,,left,1,0.612249880921,2017_Mai_30_1336,98.8305861564,Stroop,B-2,1STACS-8,
,,,,,,45,0,45,0,,,,,,,,,,,,2017_Mai_30_1336,98.8305861564,Stroop,B-2,1STACS-8,
incongruent,left,"[0.568627451, -0.7882352941, -0.7882352941]", ,6,BLAU,46,0,46,0,0,0,0,0,,,,,left,1,0.709267798002,2017_Mai_30_1336,98.8305861564,Stroop,B-2,1STACS-8,
,,,,,,46,0,46,0,,,,,,,,,,,,2017_Mai_30_1336,98.8305861564,Stroop,B-2,1STACS-8,
congruent,down,"[-0.7725490196, 0.0745098039, -1]", ,4,GRÜN,47,0,47,0,0,0,0,0,,,,,down,1,0.558955397963,2017_Mai_30_1336,98.8305861564,Stroop,B-2,1STACS-8,
,,,,,,47,0,47,0,,,,,,,,,,,,2017_Mai_30_1336,98.8305861564,Stroop,B-2,1STACS-8,
neutral,down,"[-0.7725490196, 0.0745098039, -1]", ,13,SOLL,48,0,48,0,0,0,0,0,,,,,down,1,0.570827856613,2017_Mai_30_1336,98.8305861564,Stroop,B-2,1STACS-8,
,,,,,,48,0,48,0,,,,,,,,,,,,2017_Mai_30_1336,98.8305861564,Stroop,B-2,1STACS-8,
incongruent,left,"[0.568627451, -0.7882352941, -0.7882352941]", ,6,BLAU,49,0,49,0,0,0,0,0,,,,,left,1,0.611975265013,2017_Mai_30_1336,98.8305861564,Stroop,B-2,1STACS-8,
,,,,,,49,0,49,0,,,,,,,,,,,,2017_Mai_30_1336,98.8305861564,Stroop,B-2,1STACS-8,
congruent,down,"[-0.7725490196, 0.0745098039, -1]", ,4,GRÜN,50,0,50,0,0,0,0,0,,,,,down,1,0.560186280659,2017_Mai_30_1336,98.8305861564,Stroop,B-2,1STACS-8,
,,,,,,50,0,50,0,,,,,,,,,,,,2017_Mai_30_1336,98.8305861564,Stroop,B-2,1STACS-8,
fix,return,white, ,21,+,,,,,,,,,0,0,0,0,None,0,,2017_Mai_30_1336,98.8305861564,Stroop,B-2,1STACS-8,
fix,return,white, ,21,+,,,,,,,,,0,1,1,1,None,0,,2017_Mai_30_1336,98.8305861564,Stroop,B-2,1STACS-8,
fix,return,white, ,21,+,,,,,,,,,0,2,2,2,None,0,,2017_Mai_30_1336,98.8305861564,Stroop,B-2,1STACS-8,
fix,return,white, ,21,+,,,,,,,,,0,3,3,3,None,0,,2017_Mai_30_1336,98.8305861564,Stroop,B-2,1STACS-8,
fix,return,white, ,21,+,,,,,,,,,0,4,4,4,None,0,,2017_Mai_30_1336,98.8305861564,Stroop,B-2,1STACS-8,
fix,return,white, ,21,+,,,,,,,,,0,5,5,5,None,0,,2017_Mai_30_1336,98.8305861564,Stroop,B-2,1STACS-8,
fix,return,white, ,21,+,,,,,,,,,0,6,6,6,None,0,,2017_Mai_30_1336,98.8305861564,Stroop,B-2,1STACS-8,
fix,return,white, ,21,+,,,,,,,,,0,7,7,7,None,0,,2017_Mai_30_1336,98.8305861564,Stroop,B-2,1STACS-8,
fix,return,white, ,21,+,,,,,,,,,0,8,8,8,None,0,,2017_Mai_30_1336,98.8305861564,Stroop,B-2,1STACS-8,
fix,return,white, ,21,+,,,,,,,,,0,9,9,9,None,0,,2017_Mai_30_1336,98.8305861564,Stroop,B-2,1STACS-8,
fix,return,white, ,21,+,,,,,,,,,0,10,10,10,None,0,,2017_Mai_30_1336,98.8305861564,Stroop,B-2,1STACS-8,
fix,return,white, ,21,+,,,,,,,,,0,11,11,11,None,0,,2017_Mai_30_1336,98.8305861564,Stroop,B-2,1STACS-8,
fix,return,white,+,22,+,,,,,,,,,0,12,12,12,None,0,,2017_Mai_30_1336,98.8305861564,Stroop,B-2,1STACS-8,
incongruent,down,"[-0.7725490196, 0.0745098039, -1]", ,7,BLAU,,,,,,,,,0,13,13,13,down,1,0.960538001338,2017_Mai_30_1336,98.8305861564,Stroop,B-2,1STACS-8,
incongruent,right,"[-0.8745098039, -0.2078431373, 0.637254902]", ,2,ROT,,,,,,,,,0,14,14,14,right,1,0.416515506859,2017_Mai_30_1336,98.8305861564,Stroop,B-2,1STACS-8,
neutral,down,"[-0.7725490196, 0.0745098039, -1]", ,13,SOLL,,,,,,,,,0,15,15,15,down,1,0.52820009247,2017_Mai_30_1336,98.8305861564,Stroop,B-2,1STACS-8,
neutral,right,"[-0.8745098039, -0.2078431373, 0.637254902]", ,14,SOLL,,,,,,,,,0,16,16,16,right,1,0.562688833357,2017_Mai_30_1336,98.8305861564,Stroop,B-2,1STACS-8,
incongruent,right,"[-0.8745098039, -0.2078431373, 0.637254902]", ,5,GRÜN,,,,,,,,,0,17,17,17,right,1,0.498074475946,2017_Mai_30_1336,98.8305861564,Stroop,B-2,1STACS-8,
incongruent,left,"[0.568627451, -0.7882352941, -0.7882352941]", ,3,GRÜN,,,,,,,,,0,18,18,18,left,1,0.584314207532,2017_Mai_30_1336,98.8305861564,Stroop,B-2,1STACS-8,
neutral,left,"[0.568627451, -0.7882352941, -0.7882352941]", ,12,SOLL,,,,,,,,,0,19,19,19,left,1,0.452708654312,2017_Mai_30_1336,98.8305861564,Stroop,B-2,1STACS-8,
neutral,right,"[-0.8745098039, -0.2078431373, 0.637254902]", ,11,PECH,,,,,,,,,0,20,20,20,right,1,0.515077754296,2017_Mai_30_1336,98.8305861564,Stroop,B-2,1STACS-8,
incongruent,left,"[0.568627451, -0.7882352941, -0.7882352941]", ,6,BLAU,,,,,,,,,0,21,21,21,left,1,0.590673675006,2017_Mai_30_1336,98.8305861564,Stroop,B-2,1STACS-8,
neutral,left,"[0.568627451, -0.7882352941, -0.7882352941]", ,9,PECH,,,,,,,,,0,22,22,22,left,1,0.576897343098,2017_Mai_30_1336,98.8305861564,Stroop,B-2,1STACS-8,
incongruent,down,"[-0.7725490196, 0.0745098039, -1]", ,1,ROT,,,,,,,,,0,23,23,23,down,1,0.491245116349,2017_Mai_30_1336,98.8305861564,Stroop,B-2,1STACS-8,
neutral,down,"[-0.7725490196, 0.0745098039, -1]", ,10,PECH,,,,,,,,,0,24,24,24,down,1,0.459562318675,2017_Mai_30_1336,98.8305861564,Stroop,B-2,1STACS-8,
neutral,right,"[-0.8745098039, -0.2078431373, 0.637254902]", ,14,SOLL,,,,,,,,,0,25,25,25,right,1,0.42933836563,2017_Mai_30_1336,98.8305861564,Stroop,B-2,1STACS-8,
congruent,left,"[0.568627451, -0.7882352941, -0.7882352941]", ,0,ROT,,,,,,,,,0,26,26,26,left,1,0.459841963155,2017_Mai_30_1336,98.8305861564,Stroop,B-2,1STACS-8,
neutral,down,"[-0.7725490196, 0.0745098039, -1]", ,13,SOLL,,,,,,,,,0,27,27,27,down,1,0.45117046999,2017_Mai_30_1336,98.8305861564,Stroop,B-2,1STACS-8,
congruent,right,"[-0.8745098039, -0.2078431373, 0.637254902]", ,8,BLAU,,,,,,,,,0,28,28,28,right,1,0.440206227328,2017_Mai_30_1336,98.8305861564,Stroop,B-2,1STACS-8,
neutral,left,"[0.568627451, -0.7882352941, -0.7882352941]", ,12,SOLL,,,,,,,,,0,29,29,29,left,1,0.538667903323,2017_Mai_30_1336,98.8305861564,Stroop,B-2,1STACS-8,
neutral,left,"[0.568627451, -0.7882352941, -0.7882352941]", ,9,PECH,,,,,,,,,0,30,30,30,left,1,0.514763468541,2017_Mai_30_1336,98.8305861564,Stroop,B-2,1STACS-8,
congruent,down,"[-0.7725490196, 0.0745098039, -1]", ,4,GRÜN,,,,,,,,,0,31,31,31,down,1,0.51735011014,2017_Mai_30_1336,98.8305861564,Stroop,B-2,1STACS-8,
congruent,right,"[-0.8745098039, -0.2078431373, 0.637254902]", ,8,BLAU,,,,,,,,,0,32,32,32,right,1,0.536452817327,2017_Mai_30_1336,98.8305861564,Stroop,B-2,1STACS-8,
congruent,down,"[-0.7725490196, 0.0745098039, -1]", ,4,GRÜN,,,,,,,,,0,33,33,33,down,1,0.711252687143,2017_Mai_30_1336,98.8305861564,Stroop,B-2,1STACS-8,
neutral,right,"[-0.8745098039, -0.2078431373, 0.637254902]", ,11,PECH,,,,,,,,,0,34,34,34,right,1,0.544869808872,2017_Mai_30_1336,98.8305861564,Stroop,B-2,1STACS-8,
congruent,left,"[0.568627451, -0.7882352941, -0.7882352941]", ,0,ROT,,,,,,,,,0,35,35,35,left,1,0.480798816609,2017_Mai_30_1336,98.8305861564,Stroop,B-2,1STACS-8,
neutral,down,"[-0.7725490196, 0.0745098039, -1]", ,10,PECH,,,,,,,,,0,36,36,36,down,1,0.459190483707,2017_Mai_30_1336,98.8305861564,Stroop,B-2,1STACS-8,
neutralofneutral,down,"[-0.7725490196, 0.0745098039, -1]", ,16,HALS,,,,,,,,,0,37,37,37,down,1,0.427702962248,2017_Mai_30_1336,98.8305861564,Stroop,B-2,1STACS-8,
neutral,right,"[-0.8745098039, -0.2078431373, 0.637254902]", ,14,SOLL,,,,,,,,,0,38,38,38,right,1,0.485158867957,2017_Mai_30_1336,98.8305861564,Stroop,B-2,1STACS-8,
neutral,down,"[-0.7725490196, 0.0745098039, -1]", ,13,SOLL,,,,,,,,,0,39,39,39,down,1,0.452796374958,2017_Mai_30_1336,98.8305861564,Stroop,B-2,1STACS-8,
neutral,right,"[-0.8745098039, -0.2078431373, 0.637254902]", ,11,PECH,,,,,,,,,0,40,40,40,right,1,0.505603365791,2017_Mai_30_1336,98.8305861564,Stroop,B-2,1STACS-8,
neutralofneutral,right,"[-0.8745098039, -0.2078431373, 0.637254902]", ,20,MODE,,,,,,,,,0,41,41,41,right,1,0.675771362003,2017_Mai_30_1336,98.8305861564,Stroop,B-2,1STACS-8,
neutralofneutral,right,"[-0.8745098039, -0.2078431373, 0.637254902]", ,17,HALS,,,,,,,,,0,42,42,42,right,1,0.429208740217,2017_Mai_30_1336,98.8305861564,Stroop,B-2,1STACS-8,
neutral,left,"[0.568627451, -0.7882352941, -0.7882352941]", ,12,SOLL,,,,,,,,,0,43,43,43,left,1,0.40965765202,2017_Mai_30_1336,98.8305861564,Stroop,B-2,1STACS-8,
neutralofneutral,left,"[0.568627451, -0.7882352941, -0.7882352941]", ,15,HALS,,,,,,,,,0,44,44,44,left,1,0.353721771901,2017_Mai_30_1336,98.8305861564,Stroop,B-2,1STACS-8,
neutral,down,"[-0.7725490196, 0.0745098039, -1]", ,10,PECH,,,,,,,,,0,45,45,45,right,0,0.557369721571,2017_Mai_30_1336,98.8305861564,Stroop,B-2,1STACS-8,
neutralofneutral,left,"[0.568627451, -0.7882352941, -0.7882352941]", ,18,MODE,,,,,,,,,0,46,46,46,left,1,0.576790346259,2017_Mai_30_1336,98.8305861564,Stroop,B-2,1STACS-8,
neutral,left,"[0.568627451, -0.7882352941, -0.7882352941]", ,9,PECH,,,,,,,,,0,47,47,47,left,1,0.619962593011,2017_Mai_30_1336,98.8305861564,Stroop,B-2,1STACS-8,
neutralofneutral,down,"[-0.7725490196, 0.0745098039, -1]", ,19,MODE,,,,,,,,,0,48,48,48,down,1,0.352348412997,2017_Mai_30_1336,98.8305861564,Stroop,B-2,1STACS-8,
fix,return,white, ,21,+,,,,,,,,,0,49,49,49,None,0,,2017_Mai_30_1336,98.8305861564,Stroop,B-2,1STACS-8,
fix,return,white, ,21,+,,,,,,,,,0,50,50,50,None,0,,2017_Mai_30_1336,98.8305861564,Stroop,B-2,1STACS-8,
fix,return,white, ,21,+,,,,,,,,,0,51,51,51,None,0,,2017_Mai_30_1336,98.8305861564,Stroop,B-2,1STACS-8,
fix,return,white, ,21,+,,,,,,,,,0,52,52,52,None,0,,2017_Mai_30_1336,98.8305861564,Stroop,B-2,1STACS-8,
fix,return,white, ,21,+,,,,,,,,,0,53,53,53,None,0,,2017_Mai_30_1336,98.8305861564,Stroop,B-2,1STACS-8,
fix,return,white, ,21,+,,,,,,,,,0,54,54,54,None,0,,2017_Mai_30_1336,98.8305861564,Stroop,B-2,1STACS-8,
fix,return,white, ,21,+,,,,,,,,,0,55,55,55,None,0,,2017_Mai_30_1336,98.8305861564,Stroop,B-2,1STACS-8,
fix,return,white, ,21,+,,,,,,,,,0,56,56,56,None,0,,2017_Mai_30_1336,98.8305861564,Stroop,B-2,1STACS-8,
fix,return,white, ,21,+,,,,,,,,,0,57,57,57,None,0,,2017_Mai_30_1336,98.8305861564,Stroop,B-2,1STACS-8,
fix,return,white, ,21,+,,,,,,,,,0,58,58,58,None,0,,2017_Mai_30_1336,98.8305861564,Stroop,B-2,1STACS-8,
fix,return,white, ,21,+,,,,,,,,,0,59,59,59,None,0,,2017_Mai_30_1336,98.8305861564,Stroop,B-2,1STACS-8,
fix,return,white, ,21,+,,,,,,,,,0,60,60,60,None,0,,2017_Mai_30_1336,98.8305861564,Stroop,B-2,1STACS-8,
fix,return,white,+,22,+,,,,,,,,,0,61,61,61,None,0,,2017_Mai_30_1336,98.8305861564,Stroop,B-2,1STACS-8,
neutral,left,"[0.568627451, -0.7882352941, -0.7882352941]", ,9,PECH,,,,,,,,,0,62,62,62,left,1,0.620596472457,2017_Mai_30_1336,98.8305861564,Stroop,B-2,1STACS-8,
congruent,left,"[0.568627451, -0.7882352941, -0.7882352941]", ,0,ROT,,,,,,,,,0,63,63,63,left,1,0.419322008803,2017_Mai_30_1336,98.8305861564,Stroop,B-2,1STACS-8,
neutral,down,"[-0.7725490196, 0.0745098039, -1]", ,13,SOLL,,,,,,,,,0,64,64,64,down,1,0.549613707887,2017_Mai_30_1336,98.8305861564,Stroop,B-2,1STACS-8,
neutral,down,"[-0.7725490196, 0.0745098039, -1]", ,10,PECH,,,,,,,,,0,65,65,65,down,1,0.38612086173,2017_Mai_30_1336,98.8305861564,Stroop,B-2,1STACS-8,
neutral,right,"[-0.8745098039, -0.2078431373, 0.637254902]", ,14,SOLL,,,,,,,,,0,66,66,66,right,1,0.409684191706,2017_Mai_30_1336,98.8305861564,Stroop,B-2,1STACS-8,
congruent,right,"[-0.8745098039, -0.2078431373, 0.637254902]", ,8,BLAU,,,,,,,,,0,67,67,67,right,1,0.482529483496,2017_Mai_30_1336,98.8305861564,Stroop,B-2,1STACS-8,
congruent,left,"[0.568627451, -0.7882352941, -0.7882352941]", ,0,ROT,,,,,,,,,0,68,68,68,left,1,0.450456412756,2017_Mai_30_1336,98.8305861564,Stroop,B-2,1STACS-8,
congruent,down,"[-0.7725490196, 0.0745098039, -1]", ,4,GRÜN,,,,,,,,,0,69,69,69,down,1,0.593001345143,2017_Mai_30_1336,98.8305861564,Stroop,B-2,1STACS-8,
congruent,down,"[-0.7725490196, 0.0745098039, -1]", ,4,GRÜN,,,,,,,,,0,70,70,70,down,1,0.485084277471,2017_Mai_30_1336,98.8305861564,Stroop,B-2,1STACS-8,
neutral,left,"[0.568627451, -0.7882352941, -0.7882352941]", ,12,SOLL,,,,,,,,,0,71,71,71,left,1,0.58192507707,2017_Mai_30_1336,98.8305861564,Stroop,B-2,1STACS-8,
congruent,right,"[-0.8745098039, -0.2078431373, 0.637254902]", ,8,BLAU,,,,,,,,,0,72,72,72,right,1,0.555417238783,2017_Mai_30_1336,98.8305861564,Stroop,B-2,1STACS-8,
neutral,right,"[-0.8745098039, -0.2078431373, 0.637254902]", ,11,PECH,,,,,,,,,0,73,73,73,right,1,0.491367757634,2017_Mai_30_1336,98.8305861564,Stroop,B-2,1STACS-8,
incongruent,right,"[-0.8745098039, -0.2078431373, 0.637254902]", ,2,ROT,,,,,,,,,0,74,74,74,right,1,0.52338383789,2017_Mai_30_1336,98.8305861564,Stroop,B-2,1STACS-8,
incongruent,left,"[0.568627451, -0.7882352941, -0.7882352941]", ,3,GRÜN,,,,,,,,,0,75,75,75,left,1,0.41830539915,2017_Mai_30_1336,98.8305861564,Stroop,B-2,1STACS-8,
neutral,down,"[-0.7725490196, 0.0745098039, -1]", ,13,SOLL,,,,,,,,,0,76,76,76,down,1,0.506989575491,2017_Mai_30_1336,98.8305861564,Stroop,B-2,1STACS-8,
neutral,right,"[-0.8745098039, -0.2078431373, 0.637254902]", ,11,PECH,,,,,,,,,0,77,77,77,right,1,0.558479359807,2017_Mai_30_1336,98.8305861564,Stroop,B-2,1STACS-8,
neutral,left,"[0.568627451, -0.7882352941, -0.7882352941]", ,9,PECH,,,,,,,,,0,78,78,78,left,1,0.697300634578,2017_Mai_30_1336,98.8305861564,Stroop,B-2,1STACS-8,
incongruent,down,"[-0.7725490196, 0.0745098039, -1]", ,1,ROT,,,,,,,,,0,79,79,79,down,1,0.418448992819,2017_Mai_30_1336,98.8305861564,Stroop,B-2,1STACS-8,
neutral,left,"[0.568627451, -0.7882352941, -0.7882352941]", ,12,SOLL,,,,,,,,,0,80,80,80,left,1,0.420218770821,2017_Mai_30_1336,98.8305861564,Stroop,B-2,1STACS-8,
incongruent,left,"[0.568627451, -0.7882352941, -0.7882352941]", ,6,BLAU,,,,,,,,,0,81,81,81,left,1,0.601100698553,2017_Mai_30_1336,98.8305861564,Stroop,B-2,1STACS-8,
neutral,down,"[-0.7725490196, 0.0745098039, -1]", ,10,PECH,,,,,,,,,0,82,82,82,down,1,0.536530760194,2017_Mai_30_1336,98.8305861564,Stroop,B-2,1STACS-8,
incongruent,down,"[-0.7725490196, 0.0745098039, -1]", ,7,BLAU,,,,,,,,,0,83,83,83,down,1,0.525548638165,2017_Mai_30_1336,98.8305861564,Stroop,B-2,1STACS-8,
neutral,right,"[-0.8745098039, -0.2078431373, 0.637254902]", ,14,SOLL,,,,,,,,,0,84,84,84,right,1,0.366614471951,2017_Mai_30_1336,98.8305861564,Stroop,B-2,1STACS-8,
incongruent,right,"[-0.8745098039, -0.2078431373, 0.637254902]", ,5,GRÜN,,,,,,,,,0,85,85,85,right,1,0.375728479458,2017_Mai_30_1336,98.8305861564,Stroop,B-2,1STACS-8,
neutral,down,"[-0.7725490196, 0.0745098039, -1]", ,13,SOLL,,,,,,,,,0,86,86,86,down,1,0.44013806224,2017_Mai_30_1336,98.8305861564,Stroop,B-2,1STACS-8,
neutralofneutral,left,"[0.568627451, -0.7882352941, -0.7882352941]", ,15,HALS,,,,,,,,,0,87,87,87,left,1,0.470894485193,2017_Mai_30_1336,98.8305861564,Stroop,B-2,1STACS-8,
neutral,left,"[0.568627451, -0.7882352941, -0.7882352941]", ,9,PECH,,,,,,,,,0,88,88,88,left,1,0.449047853847,2017_Mai_30_1336,98.8305861564,Stroop,B-2,1STACS-8,
neutral,down,"[-0.7725490196, 0.0745098039, -1]", ,10,PECH,,,,,,,,,0,89,89,89,down,1,0.821022504257,2017_Mai_30_1336,98.8305861564,Stroop,B-2,1STACS-8,
neutralofneutral,right,"[-0.8745098039, -0.2078431373, 0.637254902]", ,20,MODE,,,,,,,,,0,90,90,90,right,1,0.52676415578,2017_Mai_30_1336,98.8305861564,Stroop,B-2,1STACS-8,
neutral,right,"[-0.8745098039, -0.2078431373, 0.637254902]", ,14,SOLL,,,,,,,,,0,91,91,91,right,1,0.398803758578,2017_Mai_30_1336,98.8305861564,Stroop,B-2,1STACS-8,
neutralofneutral,down,"[-0.7725490196, 0.0745098039, -1]", ,16,HALS,,,,,,,,,0,92,92,92,down,1,0.537917528624,2017_Mai_30_1336,98.8305861564,Stroop,B-2,1STACS-8,
neutralofneutral,right,"[-0.8745098039, -0.2078431373, 0.637254902]", ,17,HALS,,,,,,,,,0,93,93,93,down,0,0.472132631382,2017_Mai_30_1336,98.8305861564,Stroop,B-2,1STACS-8,
neutral,left,"[0.568627451, -0.7882352941, -0.7882352941]", ,12,SOLL,,,,,,,,,0,94,94,94,left,1,0.398852647473,2017_Mai_30_1336,98.8305861564,Stroop,B-2,1STACS-8,
neutralofneutral,left,"[0.568627451, -0.7882352941, -0.7882352941]", ,18,MODE,,,,,,,,,0,95,95,95,left,1,0.54739415205,2017_Mai_30_1336,98.8305861564,Stroop,B-2,1STACS-8,
neutral,right,"[-0.8745098039, -0.2078431373, 0.637254902]", ,11,PECH,,,,,,,,,0,96,96,96,right,1,0.590309103531,2017_Mai_30_1336,98.8305861564,Stroop,B-2,1STACS-8,
neutralofneutral,down,"[-0.7725490196, 0.0745098039, -1]", ,19,MODE,,,,,,,,,0,97,97,97,down,1,0.385590626742,2017_Mai_30_1336,98.8305861564,Stroop,B-2,1STACS-8,
fix,return,white, ,21,+,,,,,,,,,0,98,98,98,None,0,,2017_Mai_30_1336,98.8305861564,Stroop,B-2,1STACS-8,
fix,return,white, ,21,+,,,,,,,,,0,99,99,99,None,0,,2017_Mai_30_1336,98.8305861564,Stroop,B-2,1STACS-8,
fix,return,white, ,21,+,,,,,,,,,0,100,100,100,None,0,,2017_Mai_30_1336,98.8305861564,Stroop,B-2,1STACS-8,
fix,return,white, ,21,+,,,,,,,,,0,101,101,101,None,0,,2017_Mai_30_1336,98.8305861564,Stroop,B-2,1STACS-8,
fix,return,white, ,21,+,,,,,,,,,0,102,102,102,None,0,,2017_Mai_30_1336,98.8305861564,Stroop,B-2,1STACS-8,
fix,return,white, ,21,+,,,,,,,,,0,103,103,103,None,0,,2017_Mai_30_1336,98.8305861564,Stroop,B-2,1STACS-8,
fix,return,white, ,21,+,,,,,,,,,0,104,104,104,None,0,,2017_Mai_30_1336,98.8305861564,Stroop,B-2,1STACS-8,
fix,return,white, ,21,+,,,,,,,,,0,105,105,105,None,0,,2017_Mai_30_1336,98.8305861564,Stroop,B-2,1STACS-8,
fix,return,white, ,21,+,,,,,,,,,0,106,106,106,None,0,,2017_Mai_30_1336,98.8305861564,Stroop,B-2,1STACS-8,
fix,return,white, ,21,+,,,,,,,,,0,107,107,107,None,0,,2017_Mai_30_1336,98.8305861564,Stroop,B-2,1STACS-8,
fix,return,white, ,21,+,,,,,,,,,0,108,108,108,None,0,,2017_Mai_30_1336,98.8305861564,Stroop,B-2,1STACS-8,
fix,return,white, ,21,+,,,,,,,,,0,109,109,109,None,0,,2017_Mai_30_1336,98.8305861564,Stroop,B-2,1STACS-8,
fix,return,white,+,22,+,,,,,,,,,0,110,110,110,None,0,,2017_Mai_30_1336,98.8305861564,Stroop,B-2,1STACS-8,
neutralofneutral,down,"[-0.7725490196, 0.0745098039, -1]", ,16,HALS,,,,,,,,,0,111,111,111,down,1,0.558060312135,2017_Mai_30_1336,98.8305861564,Stroop,B-2,1STACS-8,
neutralofneutral,right,"[-0.8745098039, -0.2078431373, 0.637254902]", ,20,MODE,,,,,,,,,0,112,112,112,right,1,0.375622041349,2017_Mai_30_1336,98.8305861564,Stroop,B-2,1STACS-8,
neutral,left,"[0.568627451, -0.7882352941, -0.7882352941]", ,9,PECH,,,,,,,,,0,113,113,113,left,1,0.427644574939,2017_Mai_30_1336,98.8305861564,Stroop,B-2,1STACS-8,
neutral,right,"[-0.8745098039, -0.2078431373, 0.637254902]", ,14,SOLL,,,,,,,,,0,114,114,114,right,1,0.493645421415,2017_Mai_30_1336,98.8305861564,Stroop,B-2,1STACS-8,
neutralofneutral,down,"[-0.7725490196, 0.0745098039, -1]", ,19,MODE,,,,,,,,,0,115,115,115,down,1,0.37409279671,2017_Mai_30_1336,98.8305861564,Stroop,B-2,1STACS-8,
neutralofneutral,right,"[-0.8745098039, -0.2078431373, 0.637254902]", ,17,HALS,,,,,,,,,0,116,116,116,right,1,0.589437763738,2017_Mai_30_1336,98.8305861564,Stroop,B-2,1STACS-8,
neutral,down,"[-0.7725490196, 0.0745098039, -1]", ,10,PECH,,,,,,,,,0,117,117,117,down,1,0.590527846416,2017_Mai_30_1336,98.8305861564,Stroop,B-2,1STACS-8,
neutral,left,"[0.568627451, -0.7882352941, -0.7882352941]", ,12,SOLL,,,,,,,,,0,118,118,118,left,1,0.39923426022,2017_Mai_30_1336,98.8305861564,Stroop,B-2,1STACS-8,
neutral,down,"[-0.7725490196, 0.0745098039, -1]", ,13,SOLL,,,,,,,,,0,119,119,119,down,1,0.5823396549,2017_Mai_30_1336,98.8305861564,Stroop,B-2,1STACS-8,
neutralofneutral,left,"[0.568627451, -0.7882352941, -0.7882352941]", ,15,HALS,,,,,,,,,0,120,120,120,left,1,0.461617049094,2017_Mai_30_1336,98.8305861564,Stroop,B-2,1STACS-8,
neutralofneutral,left,"[0.568627451, -0.7882352941, -0.7882352941]", ,18,MODE,,,,,,,,,0,121,121,121,left,1,0.633281604226,2017_Mai_30_1336,98.8305861564,Stroop,B-2,1STACS-8,
neutral,right,"[-0.8745098039, -0.2078431373, 0.637254902]", ,11,PECH,,,,,,,,,0,122,122,122,right,1,0.697914399735,2017_Mai_30_1336,98.8305861564,Stroop,B-2,1STACS-8,
incongruent,right,"[-0.8745098039, -0.2078431373, 0.637254902]", ,2,ROT,,,,,,,,,0,123,123,123,right,1,0.514954833645,2017_Mai_30_1336,98.8305861564,Stroop,B-2,1STACS-8,
incongruent,right,"[-0.8745098039, -0.2078431373, 0.637254902]", ,5,GRÜN,,,,,,,,,0,124,124,124,right,1,0.463232058823,2017_Mai_30_1336,98.8305861564,Stroop,B-2,1STACS-8,
incongruent,left,"[0.568627451, -0.7882352941, -0.7882352941]", ,3,GRÜN,,,,,,,,,0,125,125,125,left,1,0.452868451158,2017_Mai_30_1336,98.8305861564,Stroop,B-2,1STACS-8,
neutral,right,"[-0.8745098039, -0.2078431373, 0.637254902]", ,14,SOLL,,,,,,,,,0,126,126,126,right,1,0.560389099732,2017_Mai_30_1336,98.8305861564,Stroop,B-2,1STACS-8,
neutral,down,"[-0.7725490196, 0.0745098039, -1]", ,13,SOLL,,,,,,,,,0,127,127,127,down,1,0.40803928991,2017_Mai_30_1336,98.8305861564,Stroop,B-2,1STACS-8,
neutral,left,"[0.568627451, -0.7882352941, -0.7882352941]", ,9,PECH,,,,,,,,,0,128,128,128,left,1,0.502242324094,2017_Mai_30_1336,98.8305861564,Stroop,B-2,1STACS-8,
incongruent,left,"[0.568627451, -0.7882352941, -0.7882352941]", ,6,BLAU,,,,,,,,,0,129,129,129,left,1,0.683956480502,2017_Mai_30_1336,98.8305861564,Stroop,B-2,1STACS-8,
incongruent,down,"[-0.7725490196, 0.0745098039, -1]", ,1,ROT,,,,,,,,,0,130,130,130,down,1,1.08830004931,2017_Mai_30_1336,98.8305861564,Stroop,B-2,1STACS-8,
neutral,down,"[-0.7725490196, 0.0745098039, -1]", ,10,PECH,,,,,,,,,0,131,131,131,down,1,0.566991335491,2017_Mai_30_1336,98.8305861564,Stroop,B-2,1STACS-8,
neutral,right,"[-0.8745098039, -0.2078431373, 0.637254902]", ,11,PECH,,,,,,,,,0,132,132,132,right,1,0.983822245565,2017_Mai_30_1336,98.8305861564,Stroop,B-2,1STACS-8,
incongruent,down,"[-0.7725490196, 0.0745098039, -1]", ,7,BLAU,,,,,,,,,0,133,133,133,down,1,0.911977918981,2017_Mai_30_1336,98.8305861564,Stroop,B-2,1STACS-8,
neutral,left,"[0.568627451, -0.7882352941, -0.7882352941]", ,12,SOLL,,,,,,,,,0,134,134,134,left,1,0.442031598988,2017_Mai_30_1336,98.8305861564,Stroop,B-2,1STACS-8,
congruent,right,"[-0.8745098039, -0.2078431373, 0.637254902]", ,8,BLAU,,,,,,,,,0,135,135,135,right,1,0.515351811473,2017_Mai_30_1336,98.8305861564,Stroop,B-2,1STACS-8,
congruent,left,"[0.568627451, -0.7882352941, -0.7882352941]", ,0,ROT,,,,,,,,,0,136,136,136,left,1,0.589736125681,2017_Mai_30_1336,98.8305861564,Stroop,B-2,1STACS-8,
neutral,left,"[0.568627451, -0.7882352941, -0.7882352941]", ,9,PECH,,,,,,,,,0,137,137,137,left,1,0.483101064521,2017_Mai_30_1336,98.8305861564,Stroop,B-2,1STACS-8,
neutral,right,"[-0.8745098039, -0.2078431373, 0.637254902]", ,11,PECH,,,,,,,,,0,138,138,138,right,1,0.515336446392,2017_Mai_30_1336,98.8305861564,Stroop,B-2,1STACS-8,
congruent,right,"[-0.8745098039, -0.2078431373, 0.637254902]", ,8,BLAU,,,,,,,,,0,139,139,139,right,1,0.515156535258,2017_Mai_30_1336,98.8305861564,Stroop,B-2,1STACS-8,
neutral,left,"[0.568627451, -0.7882352941, -0.7882352941]", ,12,SOLL,,,,,,,,,0,140,140,140,left,1,0.504175810054,2017_Mai_30_1336,98.8305861564,Stroop,B-2,1STACS-8,
congruent,down,"[-0.7725490196, 0.0745098039, -1]", ,4,GRÜN,,,,,,,,,0,141,141,141,down,1,0.429328867216,2017_Mai_30_1336,98.8305861564,Stroop,B-2,1STACS-8,
neutral,down,"[-0.7725490196, 0.0745098039, -1]", ,10,PECH,,,,,,,,,0,142,142,142,down,1,0.470260047017,2017_Mai_30_1336,98.8305861564,Stroop,B-2,1STACS-8,
neutral,right,"[-0.8745098039, -0.2078431373, 0.637254902]", ,14,SOLL,,,,,,,,,0,143,143,143,right,1,0.504076635438,2017_Mai_30_1336,98.8305861564,Stroop,B-2,1STACS-8,
congruent,left,"[0.568627451, -0.7882352941, -0.7882352941]", ,0,ROT,,,,,,,,,0,144,144,144,left,1,0.427338949503,2017_Mai_30_1336,98.8305861564,Stroop,B-2,1STACS-8,
congruent,down,"[-0.7725490196, 0.0745098039, -1]", ,4,GRÜN,,,,,,,,,0,145,145,145,down,1,0.794631161223,2017_Mai_30_1336,98.8305861564,Stroop,B-2,1STACS-8,
neutral,down,"[-0.7725490196, 0.0745098039, -1]", ,13,SOLL,,,,,,,,,0,146,146,146,down,1,0.526629222429,2017_Mai_30_1336,98.8305861564,Stroop,B-2,1STACS-8,
fix,return,white, ,21,+,,,,,,,,,0,147,147,147,None,0,,2017_Mai_30_1336,98.8305861564,Stroop,B-2,1STACS-8,
fix,return,white, ,21,+,,,,,,,,,0,148,148,148,None,0,,2017_Mai_30_1336,98.8305861564,Stroop,B-2,1STACS-8,
fix,return,white, ,21,+,,,,,,,,,0,149,149,149,None,0,,2017_Mai_30_1336,98.8305861564,Stroop,B-2,1STACS-8,
fix,return,white, ,21,+,,,,,,,,,0,150,150,150,None,0,,2017_Mai_30_1336,98.8305861564,Stroop,B-2,1STACS-8,
fix,return,white, ,21,+,,,,,,,,,0,151,151,151,None,0,,2017_Mai_30_1336,98.8305861564,Stroop,B-2,1STACS-8,
fix,return,white, ,21,+,,,,,,,,,0,152,152,152,None,0,,2017_Mai_30_1336,98.8305861564,Stroop,B-2,1STACS-8,
fix,return,white, ,21,+,,,,,,,,,0,153,153,153,None,0,,2017_Mai_30_1336,98.8305861564,Stroop,B-2,1STACS-8,
fix,return,white, ,21,+,,,,,,,,,0,154,154,154,None,0,,2017_Mai_30_1336,98.8305861564,Stroop,B-2,1STACS-8,
fix,return,white, ,21,+,,,,,,,,,0,155,155,155,None,0,,2017_Mai_30_1336,98.8305861564,Stroop,B-2,1STACS-8,
fix,return,white, ,21,+,,,,,,,,,0,156,156,156,None,0,,2017_Mai_30_1336,98.8305861564,Stroop,B-2,1STACS-8,
fix,return,white, ,21,+,,,,,,,,,0,157,157,157,None,0,,2017_Mai_30_1336,98.8305861564,Stroop,B-2,1STACS-8,
fix,return,white, ,21,+,,,,,,,,,0,158,158,158,None,0,,2017_Mai_30_1336,98.8305861564,Stroop,B-2,1STACS-8,
fix,return,white,+,22,+,,,,,,,,,0,159,159,159,None,0,,2017_Mai_30_1336,98.8305861564,Stroop,B-2,1STACS-8,
congruent,down,"[-0.7725490196, 0.0745098039, -1]", ,4,GRÜN,,,,,,,,,0,160,160,160,down,1,0.819499405651,2017_Mai_30_1336,98.8305861564,Stroop,B-2,1STACS-8,
neutral,down,"[-0.7725490196, 0.0745098039, -1]", ,13,SOLL,,,,,,,,,0,161,161,161,down,1,0.463911474782,2017_Mai_30_1336,98.8305861564,Stroop,B-2,1STACS-8,
neutral,down,"[-0.7725490196, 0.0745098039, -1]", ,10,PECH,,,,,,,,,0,162,162,162,down,1,0.353983257649,2017_Mai_30_1336,98.8305861564,Stroop,B-2,1STACS-8,
neutral,right,"[-0.8745098039, -0.2078431373, 0.637254902]", ,14,SOLL,,,,,,,,,0,163,163,163,right,1,0.679275718003,2017_Mai_30_1336,98.8305861564,Stroop,B-2,1STACS-8,
congruent,down,"[-0.7725490196, 0.0745098039, -1]", ,4,GRÜN,,,,,,,,,0,164,164,164,left,0,0.39899009511,2017_Mai_30_1336,98.8305861564,Stroop,B-2,1STACS-8,
congruent,right,"[-0.8745098039, -0.2078431373, 0.637254902]", ,8,BLAU,,,,,,,,,0,165,165,165,right,1,0.600897600114,2017_Mai_30_1336,98.8305861564,Stroop,B-2,1STACS-8,
congruent,left,"[0.568627451, -0.7882352941, -0.7882352941]", ,0,ROT,,,,,,,,,0,166,166,166,left,1,0.472156656782,2017_Mai_30_1336,98.8305861564,Stroop,B-2,1STACS-8,
neutral,left,"[0.568627451, -0.7882352941, -0.7882352941]", ,12,SOLL,,,,,,,,,0,167,167,167,left,1,0.549936933325,2017_Mai_30_1336,98.8305861564,Stroop,B-2,1STACS-8,
congruent,left,"[0.568627451, -0.7882352941, -0.7882352941]", ,0,ROT,,,,,,,,,0,168,168,168,left,1,0.536158925227,2017_Mai_30_1336,98.8305861564,Stroop,B-2,1STACS-8,
neutral,left,"[0.568627451, -0.7882352941, -0.7882352941]", ,9,PECH,,,,,,,,,0,169,169,169,left,1,0.545048602546,2017_Mai_30_1336,98.8305861564,Stroop,B-2,1STACS-8,
neutral,right,"[-0.8745098039, -0.2078431373, 0.637254902]", ,11,PECH,,,,,,,,,0,170,170,170,right,1,0.587600658743,2017_Mai_30_1336,98.8305861564,Stroop,B-2,1STACS-8,
congruent,right,"[-0.8745098039, -0.2078431373, 0.637254902]", ,8,BLAU,,,,,,,,,0,171,171,171,right,1,0.416459354471,2017_Mai_30_1336,98.8305861564,Stroop,B-2,1STACS-8,
neutralofneutral,right,"[-0.8745098039, -0.2078431373, 0.637254902]", ,17,HALS,,,,,,,,,0,172,172,172,right,1,0.470198866057,2017_Mai_30_1336,98.8305861564,Stroop,B-2,1STACS-8,
neutral,down,"[-0.7725490196, 0.0745098039, -1]", ,13,SOLL,,,,,,,,,0,173,173,173,down,1,0.536686366563,2017_Mai_30_1336,98.8305861564,Stroop,B-2,1STACS-8,
neutral,left,"[0.568627451, -0.7882352941, -0.7882352941]", ,9,PECH,,,,,,,,,0,174,174,174,left,1,0.55841398837,2017_Mai_30_1336,98.8305861564,Stroop,B-2,1STACS-8,
neutralofneutral,left,"[0.568627451, -0.7882352941, -0.7882352941]", ,15,HALS,,,,,,,,,0,175,175,175,left,1,0.440265173367,2017_Mai_30_1336,98.8305861564,Stroop,B-2,1STACS-8,
neutral,right,"[-0.8745098039, -0.2078431373, 0.637254902]", ,11,PECH,,,,,,,,,0,176,176,176,right,1,0.633869947158,2017_Mai_30_1336,98.8305861564,Stroop,B-2,1STACS-8,
neutral,down,"[-0.7725490196, 0.0745098039, -1]", ,10,PECH,,,,,,,,,0,177,177,177,down,1,0.386466157012,2017_Mai_30_1336,98.8305861564,Stroop,B-2,1STACS-8,
neutralofneutral,down,"[-0.7725490196, 0.0745098039, -1]", ,19,MODE,,,,,,,,,0,178,178,178,down,1,0.472268123463,2017_Mai_30_1336,98.8305861564,Stroop,B-2,1STACS-8,
neutralofneutral,left,"[0.568627451, -0.7882352941, -0.7882352941]", ,18,MODE,,,,,,,,,0,179,179,179,left,1,0.472599171124,2017_Mai_30_1336,98.8305861564,Stroop,B-2,1STACS-8,
neutral,left,"[0.568627451, -0.7882352941, -0.7882352941]", ,12,SOLL,,,,,,,,,0,180,180,180,left,1,0.646578266232,2017_Mai_30_1336,98.8305861564,Stroop,B-2,1STACS-8,
neutralofneutral,right,"[-0.8745098039, -0.2078431373, 0.637254902]", ,20,MODE,,,,,,,,,0,181,181,181,right,1,0.375923755673,2017_Mai_30_1336,98.8305861564,Stroop,B-2,1STACS-8,
neutral,right,"[-0.8745098039, -0.2078431373, 0.637254902]", ,14,SOLL,,,,,,,,,0,182,182,182,right,1,0.377496301904,2017_Mai_30_1336,98.8305861564,Stroop,B-2,1STACS-8,
neutralofneutral,down,"[-0.7725490196, 0.0745098039, -1]", ,16,HALS,,,,,,,,,0,183,183,183,down,1,0.363583360455,2017_Mai_30_1336,98.8305861564,Stroop,B-2,1STACS-8,
incongruent,left,"[0.568627451, -0.7882352941, -0.7882352941]", ,3,GRÜN,,,,,,,,,0,184,184,184,left,1,0.53683694436,2017_Mai_30_1336,98.8305861564,Stroop,B-2,1STACS-8,
neutral,down,"[-0.7725490196, 0.0745098039, -1]", ,10,PECH,,,,,,,,,0,185,185,185,down,1,0.630589083249,2017_Mai_30_1336,98.8305861564,Stroop,B-2,1STACS-8,
incongruent,right,"[-0.8745098039, -0.2078431373, 0.637254902]", ,2,ROT,,,,,,,,,0,186,186,186,right,1,0.480806638833,2017_Mai_30_1336,98.8305861564,Stroop,B-2,1STACS-8,
incongruent,down,"[-0.7725490196, 0.0745098039, -1]", ,1,ROT,,,,,,,,,0,187,187,187,down,1,0.609046680514,2017_Mai_30_1336,98.8305861564,Stroop,B-2,1STACS-8,
neutral,left,"[0.568627451, -0.7882352941, -0.7882352941]", ,9,PECH,,,,,,,,,0,188,188,188,left,1,0.429904638718,2017_Mai_30_1336,98.8305861564,Stroop,B-2,1STACS-8,
incongruent,right,"[-0.8745098039, -0.2078431373, 0.637254902]", ,5,GRÜN,,,,,,,,,0,189,189,189,right,1,0.701096647758,2017_Mai_30_1336,98.8305861564,Stroop,B-2,1STACS-8,
neutral,left,"[0.568627451, -0.7882352941, -0.7882352941]", ,12,SOLL,,,,,,,,,0,190,190,190,left,1,0.668866853189,2017_Mai_30_1336,98.8305861564,Stroop,B-2,1STACS-8,
neutral,down,"[-0.7725490196, 0.0745098039, -1]", ,13,SOLL,,,,,,,,,0,191,191,191,down,1,0.506841791345,2017_Mai_30_1336,98.8305861564,Stroop,B-2,1STACS-8,
incongruent,left,"[0.568627451, -0.7882352941, -0.7882352941]", ,6,BLAU,,,,,,,,,0,192,192,192,left,1,0.526056244579,2017_Mai_30_1336,98.8305861564,Stroop,B-2,1STACS-8,
incongruent,down,"[-0.7725490196, 0.0745098039, -1]", ,7,BLAU,,,,,,,,,0,193,193,193,down,1,0.547350291727,2017_Mai_30_1336,98.8305861564,Stroop,B-2,1STACS-8,
neutral,right,"[-0.8745098039, -0.2078431373, 0.637254902]", ,11,PECH,,,,,,,,,0,194,194,194,right,1,0.343857110331,2017_Mai_30_1336,98.8305861564,Stroop,B-2,1STACS-8,
neutral,right,"[-0.8745098039, -0.2078431373, 0.637254902]", ,14,SOLL,,,,,,,,,0,195,195,195,right,1,0.464179944658,2017_Mai_30_1336,98.8305861564,Stroop,B-2,1STACS-8,
fix,return,white, ,21,+,,,,,,,,,0,196,196,196,None,0,,2017_Mai_30_1336,98.8305861564,Stroop,B-2,1STACS-8,
fix,return,white, ,21,+,,,,,,,,,0,197,197,197,None,0,,2017_Mai_30_1336,98.8305861564,Stroop,B-2,1STACS-8,
fix,return,white, ,21,+,,,,,,,,,0,198,198,198,None,0,,2017_Mai_30_1336,98.8305861564,Stroop,B-2,1STACS-8,
fix,return,white, ,21,+,,,,,,,,,0,199,199,199,None,0,,2017_Mai_30_1336,98.8305861564,Stroop,B-2,1STACS-8,
fix,return,white, ,21,+,,,,,,,,,0,200,200,200,None,0,,2017_Mai_30_1336,98.8305861564,Stroop,B-2,1STACS-8,
fix,return,white, ,21,+,,,,,,,,,0,201,201,201,None,0,,2017_Mai_30_1336,98.8305861564,Stroop,B-2,1STACS-8,
fix,return,white, ,21,+,,,,,,,,,0,202,202,202,None,0,,2017_Mai_30_1336,98.8305861564,Stroop,B-2,1STACS-8,
fix,return,white, ,21,+,,,,,,,,,0,203,203,203,None,0,,2017_Mai_30_1336,98.8305861564,Stroop,B-2,1STACS-8,
fix,return,white, ,21,+,,,,,,,,,0,204,204,204,None,0,,2017_Mai_30_1336,98.8305861564,Stroop,B-2,1STACS-8,
fix,return,white, ,21,+,,,,,,,,,0,205,205,205,None,0,,2017_Mai_30_1336,98.8305861564,Stroop,B-2,1STACS-8,
fix,return,white, ,21,+,,,,,,,,,0,206,206,206,None,0,,2017_Mai_30_1336,98.8305861564,Stroop,B-2,1STACS-8,
fix,return,white, ,21,+,,,,,,,,,0,207,207,207,None,0,,2017_Mai_30_1336,98.8305861564,Stroop,B-2,1STACS-8,
fix,return,white,+,22,+,,,,,,,,,0,208,208,208,None,0,,2017_Mai_30_1336,98.8305861564,Stroop,B-2,1STACS-8,
neutral,right,"[-0.8745098039, -0.2078431373, 0.637254902]", ,14,SOLL,,,,,,,,,0,209,209,209,right,1,0.969951208883,2017_Mai_30_1336,98.8305861564,Stroop,B-2,1STACS-8,
incongruent,down,"[-0.7725490196, 0.0745098039, -1]", ,7,BLAU,,,,,,,,,0,210,210,210,down,1,0.397082869471,2017_Mai_30_1336,98.8305861564,Stroop,B-2,1STACS-8,
incongruent,down,"[-0.7725490196, 0.0745098039, -1]", ,1,ROT,,,,,,,,,0,211,211,211,down,1,0.622774682257,2017_Mai_30_1336,98.8305861564,Stroop,B-2,1STACS-8,
incongruent,right,"[-0.8745098039, -0.2078431373, 0.637254902]", ,2,ROT,,,,,,,,,0,212,212,212,right,1,0.514002198604,2017_Mai_30_1336,98.8305861564,Stroop,B-2,1STACS-8,
incongruent,right,"[-0.8745098039, -0.2078431373, 0.637254902]", ,5,GRÜN,,,,,,,,,0,213,213,213,right,1,0.708177715324,2017_Mai_30_1336,98.8305861564,Stroop,B-2,1STACS-8,
neutral,left,"[0.568627451, -0.7882352941, -0.7882352941]", ,12,SOLL,,,,,,,,,0,214,214,214,left,1,0.46163157608,2017_Mai_30_1336,98.8305861564,Stroop,B-2,1STACS-8,
neutral,down,"[-0.7725490196, 0.0745098039, -1]", ,13,SOLL,,,,,,,,,0,215,215,215,down,1,0.525965730281,2017_Mai_30_1336,98.8305861564,Stroop,B-2,1STACS-8,
neutral,left,"[0.568627451, -0.7882352941, -0.7882352941]", ,9,PECH,,,,,,,,,0,216,216,216,left,1,0.64113651316,2017_Mai_30_1336,98.8305861564,Stroop,B-2,1STACS-8,
neutral,right,"[-0.8745098039, -0.2078431373, 0.637254902]", ,11,PECH,,,,,,,,,0,217,217,217,right,1,0.844193326247,2017_Mai_30_1336,98.8305861564,Stroop,B-2,1STACS-8,
incongruent,left,"[0.568627451, -0.7882352941, -0.7882352941]", ,6,BLAU,,,,,,,,,0,218,218,218,left,1,0.536938074532,2017_Mai_30_1336,98.8305861564,Stroop,B-2,1STACS-8,
neutral,down,"[-0.7725490196, 0.0745098039, -1]", ,10,PECH,,,,,,,,,0,219,219,219,down,1,0.494099389727,2017_Mai_30_1336,98.8305861564,Stroop,B-2,1STACS-8,
incongruent,left,"[0.568627451, -0.7882352941, -0.7882352941]", ,3,GRÜN,,,,,,,,,0,220,220,220,left,1,0.506961359614,2017_Mai_30_1336,98.8305861564,Stroop,B-2,1STACS-8,
neutral,down,"[-0.7725490196, 0.0745098039, -1]", ,10,PECH,,,,,,,,,0,221,221,221,down,1,0.364879335223,2017_Mai_30_1336,98.8305861564,Stroop,B-2,1STACS-8,
neutralofneutral,down,"[-0.7725490196, 0.0745098039, -1]", ,16,HALS,,,,,,,,,0,222,222,222,down,1,0.429175495768,2017_Mai_30_1336,98.8305861564,Stroop,B-2,1STACS-8,
neutral,right,"[-0.8745098039, -0.2078431373, 0.637254902]", ,11,PECH,,,,,,,,,0,223,223,223,right,1,0.397499682222,2017_Mai_30_1336,98.8305861564,Stroop,B-2,1STACS-8,
neutralofneutral,right,"[-0.8745098039, -0.2078431373, 0.637254902]", ,20,MODE,,,,,,,,,0,224,224,224,right,1,0.429717184726,2017_Mai_30_1336,98.8305861564,Stroop,B-2,1STACS-8,
neutralofneutral,left,"[0.568627451, -0.7882352941, -0.7882352941]", ,18,MODE,,,,,,,,,0,225,225,225,left,1,0.493903834147,2017_Mai_30_1336,98.8305861564,Stroop,B-2,1STACS-8,
neutral,left,"[0.568627451, -0.7882352941, -0.7882352941]", ,12,SOLL,,,,,,,,,0,226,226,226,left,1,0.431323534136,2017_Mai_30_1336,98.8305861564,Stroop,B-2,1STACS-8,
neutralofneutral,right,"[-0.8745098039, -0.2078431373, 0.637254902]", ,17,HALS,,,,,,,,,0,227,227,227,right,1,0.450946139803,2017_Mai_30_1336,98.8305861564,Stroop,B-2,1STACS-8,
neutralofneutral,down,"[-0.7725490196, 0.0745098039, -1]", ,19,MODE,,,,,,,,,0,228,228,228,down,1,0.363188896913,2017_Mai_30_1336,98.8305861564,Stroop,B-2,1STACS-8,
neutral,down,"[-0.7725490196, 0.0745098039, -1]", ,13,SOLL,,,,,,,,,0,229,229,229,down,1,0.375850841378,2017_Mai_30_1336,98.8305861564,Stroop,B-2,1STACS-8,
neutral,right,"[-0.8745098039, -0.2078431373, 0.637254902]", ,14,SOLL,,,,,,,,,0,230,230,230,right,1,0.44013806224,2017_Mai_30_1336,98.8305861564,Stroop,B-2,1STACS-8,
neutral,left,"[0.568627451, -0.7882352941, -0.7882352941]", ,9,PECH,,,,,,,,,0,231,231,231,left,1,0.41894989447,2017_Mai_30_1336,98.8305861564,Stroop,B-2,1STACS-8,
neutralofneutral,left,"[0.568627451, -0.7882352941, -0.7882352941]", ,15,HALS,,,,,,,,,0,232,232,232,left,1,0.451269085875,2017_Mai_30_1336,98.8305861564,Stroop,B-2,1STACS-8,
congruent,down,"[-0.7725490196, 0.0745098039, -1]", ,4,GRÜN,,,,,,,,,0,233,233,233,down,1,0.420503723239,2017_Mai_30_1336,98.8305861564,Stroop,B-2,1STACS-8,
neutral,left,"[0.568627451, -0.7882352941, -0.7882352941]", ,9,PECH,,,,,,,,,0,234,234,234,down,0,0.440205668598,2017_Mai_30_1336,98.8305861564,Stroop,B-2,1STACS-8,
neutral,left,"[0.568627451, -0.7882352941, -0.7882352941]", ,12,SOLL,,,,,,,,,0,235,235,235,left,1,0.56079809026,2017_Mai_30_1336,98.8305861564,Stroop,B-2,1STACS-8,
congruent,left,"[0.568627451, -0.7882352941, -0.7882352941]", ,0,ROT,,,,,,,,,0,236,236,236,left,1,0.408152991511,2017_Mai_30_1336,98.8305861564,Stroop,B-2,1STACS-8,
neutral,down,"[-0.7725490196, 0.0745098039, -1]", ,10,PECH,,,,,,,,,0,237,237,237,down,1,0.611847036425,2017_Mai_30_1336,98.8305861564,Stroop,B-2,1STACS-8,
congruent,down,"[-0.7725490196, 0.0745098039, -1]", ,4,GRÜN,,,,,,,,,0,238,238,238,down,1,0.45282375274,2017_Mai_30_1336,98.8305861564,Stroop,B-2,1STACS-8,
congruent,left,"[0.568627451, -0.7882352941, -0.7882352941]", ,0,ROT,,,,,,,,,0,239,239,239,left,1,0.536461477646,2017_Mai_30_1336,98.8305861564,Stroop,B-2,1STACS-8,
congruent,right,"[-0.8745098039, -0.2078431373, 0.637254902]", ,8,BLAU,,,,,,,,,0,240,240,240,right,1,0.523162021989,2017_Mai_30_1336,98.8305861564,Stroop,B-2,1STACS-8,
neutral,down,"[-0.7725490196, 0.0745098039, -1]", ,13,SOLL,,,,,,,,,0,241,241,241,down,1,0.633320994707,2017_Mai_30_1336,98.8305861564,Stroop,B-2,1STACS-8,
neutral,right,"[-0.8745098039, -0.2078431373, 0.637254902]", ,14,SOLL,,,,,,,,,0,242,242,242,right,1,0.601371682714,2017_Mai_30_1336,98.8305861564,Stroop,B-2,1STACS-8,
neutral,right,"[-0.8745098039, -0.2078431373, 0.637254902]", ,11,PECH,,,,,,,,,0,243,243,243,right,1,0.480908327734,2017_Mai_30_1336,98.8305861564,Stroop,B-2,1STACS-8,
congruent,right,"[-0.8745098039, -0.2078431373, 0.637254902]", ,8,BLAU,,,,,,,,,0,244,244,244,right,1,0.470284072417,2017_Mai_30_1336,98.8305861564,Stroop,B-2,1STACS-8,
fix,return,white, ,21,+,,,,,,,,,0,245,245,245,None,0,,2017_Mai_30_1336,98.8305861564,Stroop,B-2,1STACS-8,
fix,return,white, ,21,+,,,,,,,,,0,246,246,246,None,0,,2017_Mai_30_1336,98.8305861564,Stroop,B-2,1STACS-8,
fix,return,white, ,21,+,,,,,,,,,0,247,247,247,None,0,,2017_Mai_30_1336,98.8305861564,Stroop,B-2,1STACS-8,
fix,return,white, ,21,+,,,,,,,,,0,248,248,248,None,0,,2017_Mai_30_1336,98.8305861564,Stroop,B-2,1STACS-8,
fix,return,white, ,21,+,,,,,,,,,0,249,249,249,None,0,,2017_Mai_30_1336,98.8305861564,Stroop,B-2,1STACS-8,
fix,return,white, ,21,+,,,,,,,,,0,250,250,250,None,0,,2017_Mai_30_1336,98.8305861564,Stroop,B-2,1STACS-8,
fix,return,white, ,21,+,,,,,,,,,0,251,251,251,None,0,,2017_Mai_30_1336,98.8305861564,Stroop,B-2,1STACS-8,
fix,return,white, ,21,+,,,,,,,,,0,252,252,252,None,0,,2017_Mai_30_1336,98.8305861564,Stroop,B-2,1STACS-8,
fix,return,white, ,21,+,,,,,,,,,0,253,253,253,None,0,,2017_Mai_30_1336,98.8305861564,Stroop,B-2,1STACS-8,
fix,return,white, ,21,+,,,,,,,,,0,254,254,254,None,0,,2017_Mai_30_1336,98.8305861564,Stroop,B-2,1STACS-8,
fix,return,white, ,21,+,,,,,,,,,0,255,255,255,None,0,,2017_Mai_30_1336,98.8305861564,Stroop,B-2,1STACS-8,
fix,return,white, ,21,+,,,,,,,,,0,256,256,256,None,0,,2017_Mai_30_1336,98.8305861564,Stroop,B-2,1STACS-8,
fix,return,white,+,22,+,,,,,,,,,0,257,257,257,None,0,,2017_Mai_30_1336,98.8305861564,Stroop,B-2,1STACS-8,
neutral,left,"[0.568627451, -0.7882352941, -0.7882352941]", ,9,PECH,,,,,,,,,0,258,258,258,left,1,0.576932822468,2017_Mai_30_1336,98.8305861564,Stroop,B-2,1STACS-8,
neutral,left,"[0.568627451, -0.7882352941, -0.7882352941]", ,12,SOLL,,,,,,,,,0,259,259,259,left,1,0.450712869932,2017_Mai_30_1336,98.8305861564,Stroop,B-2,1STACS-8,
neutralofneutral,down,"[-0.7725490196, 0.0745098039, -1]", ,19,MODE,,,,,,,,,0,260,260,260,down,1,0.71581751312,2017_Mai_30_1336,98.8305861564,Stroop,B-2,1STACS-8,
neutralofneutral,right,"[-0.8745098039, -0.2078431373, 0.637254902]", ,17,HALS,,,,,,,,,0,261,261,261,right,1,0.450666215958,2017_Mai_30_1336,98.8305861564,Stroop,B-2,1STACS-8,
neutral,right,"[-0.8745098039, -0.2078431373, 0.637254902]", ,11,PECH,,,,,,,,,0,262,262,262,right,1,0.440266570193,2017_Mai_30_1336,98.8305861564,Stroop,B-2,1STACS-8,
neutralofneutral,left,"[0.568627451, -0.7882352941, -0.7882352941]", ,15,HALS,,,,,,,,,0,263,263,263,left,1,0.515122452714,2017_Mai_30_1336,98.8305861564,Stroop,B-2,1STACS-8,
neutralofneutral,left,"[0.568627451, -0.7882352941, -0.7882352941]", ,18,MODE,,,,,,,,,0,264,264,264,left,1,0.386428442721,2017_Mai_30_1336,98.8305861564,Stroop,B-2,1STACS-8,
neutral,right,"[-0.8745098039, -0.2078431373, 0.637254902]", ,14,SOLL,,,,,,,,,0,265,265,265,right,1,0.560544985466,2017_Mai_30_1336,98.8305861564,Stroop,B-2,1STACS-8,
neutralofneutral,down,"[-0.7725490196, 0.0745098039, -1]", ,16,HALS,,,,,,,,,0,266,266,266,down,1,0.450740806443,2017_Mai_30_1336,98.8305861564,Stroop,B-2,1STACS-8,
neutralofneutral,right,"[-0.8745098039, -0.2078431373, 0.637254902]", ,20,MODE,,,,,,,,,0,267,267,267,right,1,0.440165719386,2017_Mai_30_1336,98.8305861564,Stroop,B-2,1STACS-8,
neutral,down,"[-0.7725490196, 0.0745098039, -1]", ,13,SOLL,,,,,,,,,0,268,268,268,down,1,0.765157582877,2017_Mai_30_1336,98.8305861564,Stroop,B-2,1STACS-8,
neutral,down,"[-0.7725490196, 0.0745098039, -1]", ,10,PECH,,,,,,,,,0,269,269,269,down,1,0.472227336156,2017_Mai_30_1336,98.8305861564,Stroop,B-2,1STACS-8,
congruent,left,"[0.568627451, -0.7882352941, -0.7882352941]", ,0,ROT,,,,,,,,,0,270,270,270,left,1,0.522920091799,2017_Mai_30_1336,98.8305861564,Stroop,B-2,1STACS-8,
congruent,down,"[-0.7725490196, 0.0745098039, -1]", ,4,GRÜN,,,,,,,,,0,271,271,271,down,1,0.558618762999,2017_Mai_30_1336,98.8305861564,Stroop,B-2,1STACS-8,
neutral,down,"[-0.7725490196, 0.0745098039, -1]", ,13,SOLL,,,,,,,,,0,272,272,272,down,1,0.375824581057,2017_Mai_30_1336,98.8305861564,Stroop,B-2,1STACS-8,
congruent,right,"[-0.8745098039, -0.2078431373, 0.637254902]", ,8,BLAU,,,,,,,,,0,273,273,273,right,1,0.448788882386,2017_Mai_30_1336,98.8305861564,Stroop,B-2,1STACS-8,
congruent,right,"[-0.8745098039, -0.2078431373, 0.637254902]", ,8,BLAU,,,,,,,,,0,274,274,274,right,1,0.416703798947,2017_Mai_30_1336,98.8305861564,Stroop,B-2,1STACS-8,
neutral,right,"[-0.8745098039, -0.2078431373, 0.637254902]", ,14,SOLL,,,,,,,,,0,275,275,275,right,1,0.397524825082,2017_Mai_30_1336,98.8305861564,Stroop,B-2,1STACS-8,
neutral,left,"[0.568627451, -0.7882352941, -0.7882352941]", ,12,SOLL,,,,,,,,,0,276,276,276,down,0,0.536805096737,2017_Mai_30_1336,98.8305861564,Stroop,B-2,1STACS-8,
congruent,left,"[0.568627451, -0.7882352941, -0.7882352941]", ,0,ROT,,,,,,,,,0,277,277,277,left,1,0.44854443791,2017_Mai_30_1336,98.8305861564,Stroop,B-2,1STACS-8,
congruent,down,"[-0.7725490196, 0.0745098039, -1]", ,4,GRÜN,,,,,,,,,0,278,278,278,down,1,0.515276662257,2017_Mai_30_1336,98.8305861564,Stroop,B-2,1STACS-8,
neutral,left,"[0.568627451, -0.7882352941, -0.7882352941]", ,9,PECH,,,,,,,,,0,279,279,279,left,1,0.566528706861,2017_Mai_30_1336,98.8305861564,Stroop,B-2,1STACS-8,
neutral,right,"[-0.8745098039, -0.2078431373, 0.637254902]", ,11,PECH,,,,,,,,,0,280,280,280,right,1,0.566251856032,2017_Mai_30_1336,98.8305861564,Stroop,B-2,1STACS-8,
neutral,down,"[-0.7725490196, 0.0745098039, -1]", ,10,PECH,,,,,,,,,0,281,281,281,down,1,0.566370306841,2017_Mai_30_1336,98.8305861564,Stroop,B-2,1STACS-8,
incongruent,right,"[-0.8745098039, -0.2078431373, 0.637254902]", ,5,GRÜN,,,,,,,,,0,282,282,282,right,1,0.71901764051,2017_Mai_30_1336,98.8305861564,Stroop,B-2,1STACS-8,
incongruent,down,"[-0.7725490196, 0.0745098039, -1]", ,1,ROT,,,,,,,,,0,283,283,283,down,1,0.736949807867,2017_Mai_30_1336,98.8305861564,Stroop,B-2,1STACS-8,
neutral,right,"[-0.8745098039, -0.2078431373, 0.637254902]", ,14,SOLL,,,,,,,,,0,284,284,284,right,1,0.579497673587,2017_Mai_30_1336,98.8305861564,Stroop,B-2,1STACS-8,
neutral,down,"[-0.7725490196, 0.0745098039, -1]", ,13,SOLL,,,,,,,,,0,285,285,285,down,1,0.375756136604,2017_Mai_30_1336,98.8305861564,Stroop,B-2,1STACS-8,
neutral,left,"[0.568627451, -0.7882352941, -0.7882352941]", ,12,SOLL,,,,,,,,,0,286,286,286,left,1,0.493684253166,2017_Mai_30_1336,98.8305861564,Stroop,B-2,1STACS-8,
incongruent,right,"[-0.8745098039, -0.2078431373, 0.637254902]", ,2,ROT,,,,,,,,,0,287,287,287,right,1,0.651789822449,2017_Mai_30_1336,98.8305861564,Stroop,B-2,1STACS-8,
incongruent,left,"[0.568627451, -0.7882352941, -0.7882352941]", ,6,BLAU,,,,,,,,,0,288,288,288,left,1,0.491594881472,2017_Mai_30_1336,98.8305861564,Stroop,B-2,1STACS-8,
incongruent,left,"[0.568627451, -0.7882352941, -0.7882352941]", ,3,GRÜN,,,,,,,,,0,289,289,289,left,1,0.720458885138,2017_Mai_30_1336,98.8305861564,Stroop,B-2,1STACS-8,
incongruent,down,"[-0.7725490196, 0.0745098039, -1]", ,7,BLAU,,,,,,,,,0,290,290,290,down,1,0.450231244474,2017_Mai_30_1336,98.8305861564,Stroop,B-2,1STACS-8,
neutral,left,"[0.568627451, -0.7882352941, -0.7882352941]", ,9,PECH,,,,,,,,,0,291,291,291,left,1,0.481964327869,2017_Mai_30_1336,98.8305861564,Stroop,B-2,1STACS-8,
neutral,down,"[-0.7725490196, 0.0745098039, -1]", ,10,PECH,,,,,,,,,0,292,292,292,down,1,0.524995774603,2017_Mai_30_1336,98.8305861564,Stroop,B-2,1STACS-8,
neutral,right,"[-0.8745098039, -0.2078431373, 0.637254902]", ,11,PECH,,,,,,,,,0,293,293,293,right,1,0.546226685235,2017_Mai_30_1336,98.8305861564,Stroop,B-2,1STACS-8,
fix,return,white, ,21,+,,,,,,,,,0,294,294,294,None,0,,2017_Mai_30_1336,98.8305861564,Stroop,B-2,1STACS-8,
fix,return,white, ,21,+,,,,,,,,,0,295,295,295,None,0,,2017_Mai_30_1336,98.8305861564,Stroop,B-2,1STACS-8,
fix,return,white, ,21,+,,,,,,,,,0,296,296,296,None,0,,2017_Mai_30_1336,98.8305861564,Stroop,B-2,1STACS-8,
fix,return,white, ,21,+,,,,,,,,,0,297,297,297,None,0,,2017_Mai_30_1336,98.8305861564,Stroop,B-2,1STACS-8,
fix,return,white, ,21,+,,,,,,,,,0,298,298,298,None,0,,2017_Mai_30_1336,98.8305861564,Stroop,B-2,1STACS-8,
fix,return,white, ,21,+,,,,,,,,,0,299,299,299,None,0,,2017_Mai_30_1336,98.8305861564,Stroop,B-2,1STACS-8,
fix,return,white, ,21,+,,,,,,,,,0,300,300,300,None,0,,2017_Mai_30_1336,98.8305861564,Stroop,B-2,1STACS-8,
fix,return,white, ,21,+,,,,,,,,,0,301,301,301,None,0,,2017_Mai_30_1336,98.8305861564,Stroop,B-2,1STACS-8,
fix,return,white, ,21,+,,,,,,,,,0,302,302,302,None,0,,2017_Mai_30_1336,98.8305861564,Stroop,B-2,1STACS-8,
fix,return,white, ,21,+,,,,,,,,,0,303,303,303,None,0,,2017_Mai_30_1336,98.8305861564,Stroop,B-2,1STACS-8,
fix,return,white, ,21,+,,,,,,,,,0,304,304,304,None,0,,2017_Mai_30_1336,98.8305861564,Stroop,B-2,1STACS-8,
fix,return,white, ,21,+,,,,,,,,,0,305,305,305,None,0,,2017_Mai_30_1336,98.8305861564,Stroop,B-2,1STACS-8,
fix,return,white,+,22,+,,,,,,,,,0,306,306,306,None,0,,2017_Mai_30_1336,98.8305861564,Stroop,B-2,1STACS-8,
