congruent,corrAns,letterColor,signal,selectedrownumber_novariable,Anzeigetext,practice.thisRepN,practice.thisTrialN,practice.thisN,practice.thisIndex,Wrongresponse.thisRepN,Wrongresponse.thisTrialN,Wrongresponse.thisN,Wrongresponse.thisIndex,trials.thisRepN,trials.thisTrialN,trials.thisN,trials.thisIndex,resp.keys,resp.corr,resp.rt,date,frameRate,expName,session,participant,
neutralofneutral,down,"[-0.7725490196, 0.0745098039, -1]", ,16,HALS,0,0,0,0,0,0,0,0,,,,,down,1,1.45434266087,2017_Mai_12_1643,99.024430053,Stroop,A-2,2STRNS-1,
,,,,,,0,0,0,0,,,,,,,,,,,,2017_Mai_12_1643,99.024430053,Stroop,A-2,2STRNS-1,
congruent,left,"[0.568627451, -0.7882352941, -0.7882352941]", ,0,ROT,1,0,1,0,0,0,0,0,,,,,left,1,0.575411679417,2017_Mai_12_1643,99.024430053,Stroop,A-2,2STRNS-1,
,,,,,,1,0,1,0,,,,,,,,,,,,2017_Mai_12_1643,99.024430053,Stroop,A-2,2STRNS-1,
neutralofneutral,left,"[0.568627451, -0.7882352941, -0.7882352941]", ,15,HALS,2,0,2,0,0,0,0,0,,,,,left,1,0.683685496341,2017_Mai_12_1643,99.024430053,Stroop,A-2,2STRNS-1,
,,,,,,2,0,2,0,,,,,,,,,,,,2017_Mai_12_1643,99.024430053,Stroop,A-2,2STRNS-1,
incongruent,left,"[0.568627451, -0.7882352941, -0.7882352941]", ,6,BLAU,3,0,3,0,0,0,0,0,,,,,left,1,0.857460934281,2017_Mai_12_1643,99.024430053,Stroop,A-2,2STRNS-1,
,,,,,,3,0,3,0,,,,,,,,,,,,2017_Mai_12_1643,99.024430053,Stroop,A-2,2STRNS-1,
incongruent,right,"[-0.8745098039, -0.2078431373, 0.637254902]", ,2,ROT,4,0,4,0,0,0,0,0,,,,,right,1,1.01956114534,2017_Mai_12_1643,99.024430053,Stroop,A-2,2STRNS-1,
,,,,,,4,0,4,0,,,,,,,,,,,,2017_Mai_12_1643,99.024430053,Stroop,A-2,2STRNS-1,
incongruent,right,"[-0.8745098039, -0.2078431373, 0.637254902]", ,5,GRÜN,5,0,5,0,0,0,0,0,,,,,right,1,1.00419857831,2017_Mai_12_1643,99.024430053,Stroop,A-2,2STRNS-1,
,,,,,,5,0,5,0,,,,,,,,,,,,2017_Mai_12_1643,99.024430053,Stroop,A-2,2STRNS-1,
neutral,right,"[-0.8745098039, -0.2078431373, 0.637254902]", ,14,SOLL,6,0,6,0,0,0,0,0,,,,,right,1,0.630434314976,2017_Mai_12_1643,99.024430053,Stroop,A-2,2STRNS-1,
,,,,,,6,0,6,0,,,,,,,,,,,,2017_Mai_12_1643,99.024430053,Stroop,A-2,2STRNS-1,
incongruent,down,"[-0.7725490196, 0.0745098039, -1]", ,7,BLAU,7,0,7,0,0,0,0,0,,,,,down,1,0.74059468452,2017_Mai_12_1643,99.024430053,Stroop,A-2,2STRNS-1,
,,,,,,7,0,7,0,,,,,,,,,,,,2017_Mai_12_1643,99.024430053,Stroop,A-2,2STRNS-1,
incongruent,down,"[-0.7725490196, 0.0745098039, -1]", ,7,BLAU,8,0,8,0,0,0,0,0,,,,,down,1,0.741432500499,2017_Mai_12_1643,99.024430053,Stroop,A-2,2STRNS-1,
,,,,,,8,0,8,0,,,,,,,,,,,,2017_Mai_12_1643,99.024430053,Stroop,A-2,2STRNS-1,
incongruent,right,"[-0.8745098039, -0.2078431373, 0.637254902]", ,2,ROT,9,0,9,0,0,0,0,0,,,,,right,1,0.861780757052,2017_Mai_12_1643,99.024430053,Stroop,A-2,2STRNS-1,
,,,,,,9,0,9,0,,,,,,,,,,,,2017_Mai_12_1643,99.024430053,Stroop,A-2,2STRNS-1,
neutral,right,"[-0.8745098039, -0.2078431373, 0.637254902]", ,14,SOLL,10,0,10,0,0,0,0,0,,,,,right,1,0.599307733245,2017_Mai_12_1643,99.024430053,Stroop,A-2,2STRNS-1,
,,,,,,10,0,10,0,,,,,,,,,,,,2017_Mai_12_1643,99.024430053,Stroop,A-2,2STRNS-1,
neutral,right,"[-0.8745098039, -0.2078431373, 0.637254902]", ,14,SOLL,11,0,11,0,0,0,0,0,,,,,right,1,0.470477672442,2017_Mai_12_1643,99.024430053,Stroop,A-2,2STRNS-1,
,,,,,,11,0,11,0,,,,,,,,,,,,2017_Mai_12_1643,99.024430053,Stroop,A-2,2STRNS-1,
incongruent,right,"[-0.8745098039, -0.2078431373, 0.637254902]", ,5,GRÜN,12,0,12,0,0,0,0,0,,,,,right,1,0.80108198109,2017_Mai_12_1643,99.024430053,Stroop,A-2,2STRNS-1,
,,,,,,12,0,12,0,,,,,,,,,,,,2017_Mai_12_1643,99.024430053,Stroop,A-2,2STRNS-1,
neutralofneutral,left,"[0.568627451, -0.7882352941, -0.7882352941]", ,15,HALS,13,0,13,0,0,0,0,0,,,,,left,1,0.662625557159,2017_Mai_12_1643,99.024430053,Stroop,A-2,2STRNS-1,
,,,,,,13,0,13,0,,,,,,,,,,,,2017_Mai_12_1643,99.024430053,Stroop,A-2,2STRNS-1,
incongruent,right,"[-0.8745098039, -0.2078431373, 0.637254902]", ,5,GRÜN,14,0,14,0,0,0,0,0,,,,,right,1,0.779729825997,2017_Mai_12_1643,99.024430053,Stroop,A-2,2STRNS-1,
,,,,,,14,0,14,0,,,,,,,,,,,,2017_Mai_12_1643,99.024430053,Stroop,A-2,2STRNS-1,
neutralofneutral,down,"[-0.7725490196, 0.0745098039, -1]", ,16,HALS,15,0,15,0,0,0,0,0,,,,,down,1,0.673134155319,2017_Mai_12_1643,99.024430053,Stroop,A-2,2STRNS-1,
,,,,,,15,0,15,0,,,,,,,,,,,,2017_Mai_12_1643,99.024430053,Stroop,A-2,2STRNS-1,
congruent,down,"[-0.7725490196, 0.0745098039, -1]", ,4,GRÜN,16,0,16,0,0,0,0,0,,,,,down,1,0.395116697793,2017_Mai_12_1643,99.024430053,Stroop,A-2,2STRNS-1,
,,,,,,16,0,16,0,,,,,,,,,,,,2017_Mai_12_1643,99.024430053,Stroop,A-2,2STRNS-1,
incongruent,left,"[0.568627451, -0.7882352941, -0.7882352941]", ,3,GRÜN,17,0,17,0,0,0,0,0,,,,,left,1,0.706229143648,2017_Mai_12_1643,99.024430053,Stroop,A-2,2STRNS-1,
,,,,,,17,0,17,0,,,,,,,,,,,,2017_Mai_12_1643,99.024430053,Stroop,A-2,2STRNS-1,
neutralofneutral,right,"[-0.8745098039, -0.2078431373, 0.637254902]", ,17,HALS,18,0,18,0,0,0,0,0,,,,,right,1,0.652023930416,2017_Mai_12_1643,99.024430053,Stroop,A-2,2STRNS-1,
,,,,,,18,0,18,0,,,,,,,,,,,,2017_Mai_12_1643,99.024430053,Stroop,A-2,2STRNS-1,
neutralofneutral,left,"[0.568627451, -0.7882352941, -0.7882352941]", ,18,MODE,19,0,19,0,0,0,0,0,,,,,left,1,0.686553737975,2017_Mai_12_1643,99.024430053,Stroop,A-2,2STRNS-1,
,,,,,,19,0,19,0,,,,,,,,,,,,2017_Mai_12_1643,99.024430053,Stroop,A-2,2STRNS-1,
neutral,right,"[-0.8745098039, -0.2078431373, 0.637254902]", ,11,PECH,20,0,20,0,0,0,0,0,,,,,right,1,0.698215555329,2017_Mai_12_1643,99.024430053,Stroop,A-2,2STRNS-1,
,,,,,,20,0,20,0,,,,,,,,,,,,2017_Mai_12_1643,99.024430053,Stroop,A-2,2STRNS-1,
neutralofneutral,left,"[0.568627451, -0.7882352941, -0.7882352941]", ,15,HALS,21,0,21,0,0,0,0,0,,,,,left,1,0.651680311325,2017_Mai_12_1643,99.024430053,Stroop,A-2,2STRNS-1,
,,,,,,21,0,21,0,,,,,,,,,,,,2017_Mai_12_1643,99.024430053,Stroop,A-2,2STRNS-1,
neutralofneutral,left,"[0.568627451, -0.7882352941, -0.7882352941]", ,18,MODE,22,0,22,0,0,0,0,0,,,,,left,1,0.53436651865,2017_Mai_12_1643,99.024430053,Stroop,A-2,2STRNS-1,
,,,,,,22,0,22,0,,,,,,,,,,,,2017_Mai_12_1643,99.024430053,Stroop,A-2,2STRNS-1,
neutral,right,"[-0.8745098039, -0.2078431373, 0.637254902]", ,11,PECH,23,0,23,0,0,0,0,0,,,,,right,1,0.697603745727,2017_Mai_12_1643,99.024430053,Stroop,A-2,2STRNS-1,
,,,,,,23,0,23,0,,,,,,,,,,,,2017_Mai_12_1643,99.024430053,Stroop,A-2,2STRNS-1,
congruent,right,"[-0.8745098039, -0.2078431373, 0.637254902]", ,8,BLAU,24,0,24,0,0,0,0,0,,,,,right,1,0.69779287591,2017_Mai_12_1643,99.024430053,Stroop,A-2,2STRNS-1,
,,,,,,24,0,24,0,,,,,,,,,,,,2017_Mai_12_1643,99.024430053,Stroop,A-2,2STRNS-1,
neutralofneutral,right,"[-0.8745098039, -0.2078431373, 0.637254902]", ,17,HALS,25,0,25,0,0,0,0,0,,,,,right,1,0.481616797666,2017_Mai_12_1643,99.024430053,Stroop,A-2,2STRNS-1,
,,,,,,25,0,25,0,,,,,,,,,,,,2017_Mai_12_1643,99.024430053,Stroop,A-2,2STRNS-1,
neutral,left,"[0.568627451, -0.7882352941, -0.7882352941]", ,12,SOLL,26,0,26,0,0,0,0,0,,,,,left,1,0.630633781668,2017_Mai_12_1643,99.024430053,Stroop,A-2,2STRNS-1,
,,,,,,26,0,26,0,,,,,,,,,,,,2017_Mai_12_1643,99.024430053,Stroop,A-2,2STRNS-1,
neutralofneutral,left,"[0.568627451, -0.7882352941, -0.7882352941]", ,18,MODE,27,0,27,0,0,0,0,0,,,,,left,1,0.609240280538,2017_Mai_12_1643,99.024430053,Stroop,A-2,2STRNS-1,
,,,,,,27,0,27,0,,,,,,,,,,,,2017_Mai_12_1643,99.024430053,Stroop,A-2,2STRNS-1,
incongruent,down,"[-0.7725490196, 0.0745098039, -1]", ,7,BLAU,28,0,28,0,0,0,0,0,,,,,down,1,0.750242000031,2017_Mai_12_1643,99.024430053,Stroop,A-2,2STRNS-1,
,,,,,,28,0,28,0,,,,,,,,,,,,2017_Mai_12_1643,99.024430053,Stroop,A-2,2STRNS-1,
neutralofneutral,down,"[-0.7725490196, 0.0745098039, -1]", ,16,HALS,29,0,29,0,0,0,0,0,,,,,down,1,0.523890326843,2017_Mai_12_1643,99.024430053,Stroop,A-2,2STRNS-1,
,,,,,,29,0,29,0,,,,,,,,,,,,2017_Mai_12_1643,99.024430053,Stroop,A-2,2STRNS-1,
neutral,down,"[-0.7725490196, 0.0745098039, -1]", ,13,SOLL,30,0,30,0,0,0,0,0,,,,,down,1,0.441382354461,2017_Mai_12_1643,99.024430053,Stroop,A-2,2STRNS-1,
,,,,,,30,0,30,0,,,,,,,,,,,,2017_Mai_12_1643,99.024430053,Stroop,A-2,2STRNS-1,
neutralofneutral,right,"[-0.8745098039, -0.2078431373, 0.637254902]", ,17,HALS,31,0,31,0,0,0,0,0,,,,,right,1,0.800059504769,2017_Mai_12_1643,99.024430053,Stroop,A-2,2STRNS-1,
,,,,,,31,0,31,0,,,,,,,,,,,,2017_Mai_12_1643,99.024430053,Stroop,A-2,2STRNS-1,
neutral,down,"[-0.7725490196, 0.0745098039, -1]", ,13,SOLL,32,0,32,0,0,0,0,0,,,,,down,1,0.662244503142,2017_Mai_12_1643,99.024430053,Stroop,A-2,2STRNS-1,
,,,,,,32,0,32,0,,,,,,,,,,,,2017_Mai_12_1643,99.024430053,Stroop,A-2,2STRNS-1,
incongruent,left,"[0.568627451, -0.7882352941, -0.7882352941]", ,3,GRÜN,33,0,33,0,0,0,0,0,,,,,left,1,0.709937715548,2017_Mai_12_1643,99.024430053,Stroop,A-2,2STRNS-1,
,,,,,,33,0,33,0,,,,,,,,,,,,2017_Mai_12_1643,99.024430053,Stroop,A-2,2STRNS-1,
incongruent,right,"[-0.8745098039, -0.2078431373, 0.637254902]", ,5,GRÜN,34,0,34,0,0,0,0,0,,,,,right,1,0.790534551179,2017_Mai_12_1643,99.024430053,Stroop,A-2,2STRNS-1,
,,,,,,34,0,34,0,,,,,,,,,,,,2017_Mai_12_1643,99.024430053,Stroop,A-2,2STRNS-1,
incongruent,down,"[-0.7725490196, 0.0745098039, -1]", ,1,ROT,35,0,35,0,0,0,0,0,,,,,down,1,1.07911173068,2017_Mai_12_1643,99.024430053,Stroop,A-2,2STRNS-1,
,,,,,,35,0,35,0,,,,,,,,,,,,2017_Mai_12_1643,99.024430053,Stroop,A-2,2STRNS-1,
incongruent,right,"[-0.8745098039, -0.2078431373, 0.637254902]", ,2,ROT,36,0,36,0,0,0,0,0,,,,,right,1,0.845487904189,2017_Mai_12_1643,99.024430053,Stroop,A-2,2STRNS-1,
,,,,,,36,0,36,0,,,,,,,,,,,,2017_Mai_12_1643,99.024430053,Stroop,A-2,2STRNS-1,
congruent,left,"[0.568627451, -0.7882352941, -0.7882352941]", ,0,ROT,37,0,37,0,0,0,0,0,,,,,left,1,0.896610044014,2017_Mai_12_1643,99.024430053,Stroop,A-2,2STRNS-1,
,,,,,,37,0,37,0,,,,,,,,,,,,2017_Mai_12_1643,99.024430053,Stroop,A-2,2STRNS-1,
incongruent,right,"[-0.8745098039, -0.2078431373, 0.637254902]", ,5,GRÜN,38,0,38,0,0,0,0,0,,,,,right,1,0.889267211336,2017_Mai_12_1643,99.024430053,Stroop,A-2,2STRNS-1,
,,,,,,38,0,38,0,,,,,,,,,,,,2017_Mai_12_1643,99.024430053,Stroop,A-2,2STRNS-1,
neutral,left,"[0.568627451, -0.7882352941, -0.7882352941]", ,12,SOLL,39,0,39,0,0,0,0,0,,,,,left,1,0.954749276794,2017_Mai_12_1643,99.024430053,Stroop,A-2,2STRNS-1,
,,,,,,39,0,39,0,,,,,,,,,,,,2017_Mai_12_1643,99.024430053,Stroop,A-2,2STRNS-1,
neutralofneutral,down,"[-0.7725490196, 0.0745098039, -1]", ,19,MODE,40,0,40,0,0,0,0,0,,,,,down,1,0.597658640972,2017_Mai_12_1643,99.024430053,Stroop,A-2,2STRNS-1,
,,,,,,40,0,40,0,,,,,,,,,,,,2017_Mai_12_1643,99.024430053,Stroop,A-2,2STRNS-1,
incongruent,left,"[0.568627451, -0.7882352941, -0.7882352941]", ,6,BLAU,41,0,41,0,0,0,0,0,,,,,right,0,0.750718317552,2017_Mai_12_1643,99.024430053,Stroop,A-2,2STRNS-1,
,,,,,,41,0,41,0,,,,,,,,,,,,2017_Mai_12_1643,99.024430053,Stroop,A-2,2STRNS-1,
incongruent,left,"[0.568627451, -0.7882352941, -0.7882352941]", ,6,BLAU,42,0,42,0,0,0,0,0,,,,,left,1,1.11701710692,2017_Mai_12_1643,99.024430053,Stroop,A-2,2STRNS-1,
,,,,,,42,0,42,0,,,,,,,,,,,,2017_Mai_12_1643,99.024430053,Stroop,A-2,2STRNS-1,
incongruent,right,"[-0.8745098039, -0.2078431373, 0.637254902]", ,2,ROT,43,0,43,0,0,0,0,0,,,,,right,1,0.961216299837,2017_Mai_12_1643,99.024430053,Stroop,A-2,2STRNS-1,
,,,,,,43,0,43,0,,,,,,,,,,,,2017_Mai_12_1643,99.024430053,Stroop,A-2,2STRNS-1,
neutralofneutral,right,"[-0.8745098039, -0.2078431373, 0.637254902]", ,17,HALS,44,0,44,0,0,0,0,0,,,,,right,1,0.891026373464,2017_Mai_12_1643,99.024430053,Stroop,A-2,2STRNS-1,
,,,,,,44,0,44,0,,,,,,,,,,,,2017_Mai_12_1643,99.024430053,Stroop,A-2,2STRNS-1,
neutralofneutral,left,"[0.568627451, -0.7882352941, -0.7882352941]", ,18,MODE,45,0,45,0,0,0,0,0,,,,,left,1,0.547037402798,2017_Mai_12_1643,99.024430053,Stroop,A-2,2STRNS-1,
,,,,,,45,0,45,0,,,,,,,,,,,,2017_Mai_12_1643,99.024430053,Stroop,A-2,2STRNS-1,
neutral,left,"[0.568627451, -0.7882352941, -0.7882352941]", ,9,PECH,46,0,46,0,0,0,0,0,,,,,left,1,0.634757490128,2017_Mai_12_1643,99.024430053,Stroop,A-2,2STRNS-1,
,,,,,,46,0,46,0,,,,,,,,,,,,2017_Mai_12_1643,99.024430053,Stroop,A-2,2STRNS-1,
neutralofneutral,down,"[-0.7725490196, 0.0745098039, -1]", ,19,MODE,47,0,47,0,0,0,0,0,,,,,down,1,0.565395043225,2017_Mai_12_1643,99.024430053,Stroop,A-2,2STRNS-1,
,,,,,,47,0,47,0,,,,,,,,,,,,2017_Mai_12_1643,99.024430053,Stroop,A-2,2STRNS-1,
neutral,left,"[0.568627451, -0.7882352941, -0.7882352941]", ,9,PECH,48,0,48,0,0,0,0,0,,,,,left,1,0.632631242239,2017_Mai_12_1643,99.024430053,Stroop,A-2,2STRNS-1,
,,,,,,48,0,48,0,,,,,,,,,,,,2017_Mai_12_1643,99.024430053,Stroop,A-2,2STRNS-1,
neutralofneutral,right,"[-0.8745098039, -0.2078431373, 0.637254902]", ,17,HALS,49,0,49,0,0,0,0,0,,,,,right,1,0.793553649975,2017_Mai_12_1643,99.024430053,Stroop,A-2,2STRNS-1,
,,,,,,49,0,49,0,,,,,,,,,,,,2017_Mai_12_1643,99.024430053,Stroop,A-2,2STRNS-1,
neutralofneutral,left,"[0.568627451, -0.7882352941, -0.7882352941]", ,15,HALS,50,0,50,0,0,0,0,0,,,,,left,1,0.719086364328,2017_Mai_12_1643,99.024430053,Stroop,A-2,2STRNS-1,
,,,,,,50,0,50,0,,,,,,,,,,,,2017_Mai_12_1643,99.024430053,Stroop,A-2,2STRNS-1,
fix,return,white, ,21,+,,,,,,,,,0,0,0,0,None,0,,2017_Mai_12_1643,99.024430053,Stroop,A-2,2STRNS-1,
fix,return,white, ,21,+,,,,,,,,,0,1,1,1,None,0,,2017_Mai_12_1643,99.024430053,Stroop,A-2,2STRNS-1,
fix,return,white, ,21,+,,,,,,,,,0,2,2,2,None,0,,2017_Mai_12_1643,99.024430053,Stroop,A-2,2STRNS-1,
fix,return,white, ,21,+,,,,,,,,,0,3,3,3,None,0,,2017_Mai_12_1643,99.024430053,Stroop,A-2,2STRNS-1,
fix,return,white, ,21,+,,,,,,,,,0,4,4,4,None,0,,2017_Mai_12_1643,99.024430053,Stroop,A-2,2STRNS-1,
fix,return,white, ,21,+,,,,,,,,,0,5,5,5,None,0,,2017_Mai_12_1643,99.024430053,Stroop,A-2,2STRNS-1,
fix,return,white, ,21,+,,,,,,,,,0,6,6,6,None,0,,2017_Mai_12_1643,99.024430053,Stroop,A-2,2STRNS-1,
fix,return,white, ,21,+,,,,,,,,,0,7,7,7,None,0,,2017_Mai_12_1643,99.024430053,Stroop,A-2,2STRNS-1,
fix,return,white, ,21,+,,,,,,,,,0,8,8,8,None,0,,2017_Mai_12_1643,99.024430053,Stroop,A-2,2STRNS-1,
fix,return,white, ,21,+,,,,,,,,,0,9,9,9,None,0,,2017_Mai_12_1643,99.024430053,Stroop,A-2,2STRNS-1,
fix,return,white, ,21,+,,,,,,,,,0,10,10,10,None,0,,2017_Mai_12_1643,99.024430053,Stroop,A-2,2STRNS-1,
fix,return,white, ,21,+,,,,,,,,,0,11,11,11,None,0,,2017_Mai_12_1643,99.024430053,Stroop,A-2,2STRNS-1,
fix,return,white,+,22,+,,,,,,,,,0,12,12,12,None,0,,2017_Mai_12_1643,99.024430053,Stroop,A-2,2STRNS-1,
congruent,left,"[0.568627451, -0.7882352941, -0.7882352941]", ,0,ROT,,,,,,,,,0,13,13,13,left,1,0.805896838844,2017_Mai_12_1643,99.024430053,Stroop,A-2,2STRNS-1,
neutral,down,"[-0.7725490196, 0.0745098039, -1]", ,10,PECH,,,,,,,,,0,14,14,14,down,1,1.01683593865,2017_Mai_12_1643,99.024430053,Stroop,A-2,2STRNS-1,
congruent,right,"[-0.8745098039, -0.2078431373, 0.637254902]", ,8,BLAU,,,,,,,,,0,15,15,15,right,1,0.449830355534,2017_Mai_12_1643,99.024430053,Stroop,A-2,2STRNS-1,
neutral,left,"[0.568627451, -0.7882352941, -0.7882352941]", ,12,SOLL,,,,,,,,,0,16,16,16,left,1,0.525145234939,2017_Mai_12_1643,99.024430053,Stroop,A-2,2STRNS-1,
neutral,down,"[-0.7725490196, 0.0745098039, -1]", ,13,SOLL,,,,,,,,,0,17,17,17,down,1,0.406925461197,2017_Mai_12_1643,99.024430053,Stroop,A-2,2STRNS-1,
neutral,right,"[-0.8745098039, -0.2078431373, 0.637254902]", ,14,SOLL,,,,,,,,,0,18,18,18,right,1,0.375607793728,2017_Mai_12_1643,99.024430053,Stroop,A-2,2STRNS-1,
congruent,left,"[0.568627451, -0.7882352941, -0.7882352941]", ,0,ROT,,,,,,,,,0,19,19,19,left,1,0.490449484501,2017_Mai_12_1643,99.024430053,Stroop,A-2,2STRNS-1,
congruent,right,"[-0.8745098039, -0.2078431373, 0.637254902]", ,8,BLAU,,,,,,,,,0,20,20,20,right,1,0.58130460715,2017_Mai_12_1643,99.024430053,Stroop,A-2,2STRNS-1,
neutral,left,"[0.568627451, -0.7882352941, -0.7882352941]", ,9,PECH,,,,,,,,,0,21,21,21,left,1,0.505605321347,2017_Mai_12_1643,99.024430053,Stroop,A-2,2STRNS-1,
congruent,down,"[-0.7725490196, 0.0745098039, -1]", ,4,GRÜN,,,,,,,,,0,22,22,22,down,1,0.472146320273,2017_Mai_12_1643,99.024430053,Stroop,A-2,2STRNS-1,
congruent,down,"[-0.7725490196, 0.0745098039, -1]", ,4,GRÜN,,,,,,,,,0,23,23,23,down,1,0.458423067736,2017_Mai_12_1643,99.024430053,Stroop,A-2,2STRNS-1,
neutral,right,"[-0.8745098039, -0.2078431373, 0.637254902]", ,11,PECH,,,,,,,,,0,24,24,24,left,0,0.599913396814,2017_Mai_12_1643,99.024430053,Stroop,A-2,2STRNS-1,
neutral,down,"[-0.7725490196, 0.0745098039, -1]", ,10,PECH,,,,,,,,,0,25,25,25,down,1,1.17388746335,2017_Mai_12_1643,99.024430053,Stroop,A-2,2STRNS-1,
neutral,right,"[-0.8745098039, -0.2078431373, 0.637254902]", ,14,SOLL,,,,,,,,,0,26,26,26,right,1,0.705220635583,2017_Mai_12_1643,99.024430053,Stroop,A-2,2STRNS-1,
incongruent,down,"[-0.7725490196, 0.0745098039, -1]", ,1,ROT,,,,,,,,,0,27,27,27,right,0,1.28235013109,2017_Mai_12_1643,99.024430053,Stroop,A-2,2STRNS-1,
incongruent,left,"[0.568627451, -0.7882352941, -0.7882352941]", ,3,GRÜN,,,,,,,,,0,28,28,28,left,1,0.866447551295,2017_Mai_12_1643,99.024430053,Stroop,A-2,2STRNS-1,
incongruent,down,"[-0.7725490196, 0.0745098039, -1]", ,7,BLAU,,,,,,,,,0,29,29,29,down,1,0.945565707373,2017_Mai_12_1643,99.024430053,Stroop,A-2,2STRNS-1,
incongruent,left,"[0.568627451, -0.7882352941, -0.7882352941]", ,6,BLAU,,,,,,,,,0,30,30,30,left,1,0.730812435659,2017_Mai_12_1643,99.024430053,Stroop,A-2,2STRNS-1,
neutral,right,"[-0.8745098039, -0.2078431373, 0.637254902]", ,11,PECH,,,,,,,,,0,31,31,31,right,1,0.665524808321,2017_Mai_12_1643,99.024430053,Stroop,A-2,2STRNS-1,
neutral,left,"[0.568627451, -0.7882352941, -0.7882352941]", ,9,PECH,,,,,,,,,0,32,32,32,left,1,0.729468130726,2017_Mai_12_1643,99.024430053,Stroop,A-2,2STRNS-1,
incongruent,right,"[-0.8745098039, -0.2078431373, 0.637254902]", ,5,GRÜN,,,,,,,,,0,33,33,33,right,1,1.03545059498,2017_Mai_12_1643,99.024430053,Stroop,A-2,2STRNS-1,
neutral,left,"[0.568627451, -0.7882352941, -0.7882352941]", ,12,SOLL,,,,,,,,,0,34,34,34,left,1,0.608945270977,2017_Mai_12_1643,99.024430053,Stroop,A-2,2STRNS-1,
incongruent,right,"[-0.8745098039, -0.2078431373, 0.637254902]", ,2,ROT,,,,,,,,,0,35,35,35,right,1,0.954340844996,2017_Mai_12_1643,99.024430053,Stroop,A-2,2STRNS-1,
neutral,down,"[-0.7725490196, 0.0745098039, -1]", ,13,SOLL,,,,,,,,,0,36,36,36,down,1,0.533465566154,2017_Mai_12_1643,99.024430053,Stroop,A-2,2STRNS-1,
neutralofneutral,left,"[0.568627451, -0.7882352941, -0.7882352941]", ,15,HALS,,,,,,,,,0,37,37,37,left,1,0.671331412233,2017_Mai_12_1643,99.024430053,Stroop,A-2,2STRNS-1,
neutral,left,"[0.568627451, -0.7882352941, -0.7882352941]", ,9,PECH,,,,,,,,,0,38,38,38,left,1,0.463751119206,2017_Mai_12_1643,99.024430053,Stroop,A-2,2STRNS-1,
neutralofneutral,left,"[0.568627451, -0.7882352941, -0.7882352941]", ,18,MODE,,,,,,,,,0,39,39,39,left,1,0.419105500839,2017_Mai_12_1643,99.024430053,Stroop,A-2,2STRNS-1,
neutralofneutral,down,"[-0.7725490196, 0.0745098039, -1]", ,19,MODE,,,,,,,,,0,40,40,40,down,1,0.728067114675,2017_Mai_12_1643,99.024430053,Stroop,A-2,2STRNS-1,
neutral,right,"[-0.8745098039, -0.2078431373, 0.637254902]", ,14,SOLL,,,,,,,,,0,41,41,41,right,1,0.67541126037,2017_Mai_12_1643,99.024430053,Stroop,A-2,2STRNS-1,
neutral,down,"[-0.7725490196, 0.0745098039, -1]", ,10,PECH,,,,,,,,,0,42,42,42,down,1,0.753678749673,2017_Mai_12_1643,99.024430053,Stroop,A-2,2STRNS-1,
neutral,left,"[0.568627451, -0.7882352941, -0.7882352941]", ,12,SOLL,,,,,,,,,0,43,43,43,left,1,0.503283797242,2017_Mai_12_1643,99.024430053,Stroop,A-2,2STRNS-1,
neutral,right,"[-0.8745098039, -0.2078431373, 0.637254902]", ,11,PECH,,,,,,,,,0,44,44,44,right,1,0.634793807593,2017_Mai_12_1643,99.024430053,Stroop,A-2,2STRNS-1,
neutralofneutral,down,"[-0.7725490196, 0.0745098039, -1]", ,16,HALS,,,,,,,,,0,45,45,45,down,1,0.546052082038,2017_Mai_12_1643,99.024430053,Stroop,A-2,2STRNS-1,
neutralofneutral,right,"[-0.8745098039, -0.2078431373, 0.637254902]", ,20,MODE,,,,,,,,,0,46,46,46,right,1,0.768032249909,2017_Mai_12_1643,99.024430053,Stroop,A-2,2STRNS-1,
neutral,down,"[-0.7725490196, 0.0745098039, -1]", ,13,SOLL,,,,,,,,,0,47,47,47,down,1,0.735196233041,2017_Mai_12_1643,99.024430053,Stroop,A-2,2STRNS-1,
neutralofneutral,right,"[-0.8745098039, -0.2078431373, 0.637254902]", ,17,HALS,,,,,,,,,0,48,48,48,right,1,0.640869998841,2017_Mai_12_1643,99.024430053,Stroop,A-2,2STRNS-1,
fix,return,white, ,21,+,,,,,,,,,0,49,49,49,None,0,,2017_Mai_12_1643,99.024430053,Stroop,A-2,2STRNS-1,
fix,return,white, ,21,+,,,,,,,,,0,50,50,50,None,0,,2017_Mai_12_1643,99.024430053,Stroop,A-2,2STRNS-1,
fix,return,white, ,21,+,,,,,,,,,0,51,51,51,None,0,,2017_Mai_12_1643,99.024430053,Stroop,A-2,2STRNS-1,
fix,return,white, ,21,+,,,,,,,,,0,52,52,52,None,0,,2017_Mai_12_1643,99.024430053,Stroop,A-2,2STRNS-1,
fix,return,white, ,21,+,,,,,,,,,0,53,53,53,None,0,,2017_Mai_12_1643,99.024430053,Stroop,A-2,2STRNS-1,
fix,return,white, ,21,+,,,,,,,,,0,54,54,54,None,0,,2017_Mai_12_1643,99.024430053,Stroop,A-2,2STRNS-1,
fix,return,white, ,21,+,,,,,,,,,0,55,55,55,None,0,,2017_Mai_12_1643,99.024430053,Stroop,A-2,2STRNS-1,
fix,return,white, ,21,+,,,,,,,,,0,56,56,56,None,0,,2017_Mai_12_1643,99.024430053,Stroop,A-2,2STRNS-1,
fix,return,white, ,21,+,,,,,,,,,0,57,57,57,None,0,,2017_Mai_12_1643,99.024430053,Stroop,A-2,2STRNS-1,
fix,return,white, ,21,+,,,,,,,,,0,58,58,58,None,0,,2017_Mai_12_1643,99.024430053,Stroop,A-2,2STRNS-1,
fix,return,white, ,21,+,,,,,,,,,0,59,59,59,None,0,,2017_Mai_12_1643,99.024430053,Stroop,A-2,2STRNS-1,
fix,return,white, ,21,+,,,,,,,,,0,60,60,60,None,0,,2017_Mai_12_1643,99.024430053,Stroop,A-2,2STRNS-1,
fix,return,white,+,22,+,,,,,,,,,0,61,61,61,None,0,,2017_Mai_12_1643,99.024430053,Stroop,A-2,2STRNS-1,
neutral,right,"[-0.8745098039, -0.2078431373, 0.637254902]", ,11,PECH,,,,,,,,,0,62,62,62,right,1,0.79700855835,2017_Mai_12_1643,99.024430053,Stroop,A-2,2STRNS-1,
neutral,left,"[0.568627451, -0.7882352941, -0.7882352941]", ,12,SOLL,,,,,,,,,0,63,63,63,left,1,0.503452813137,2017_Mai_12_1643,99.024430053,Stroop,A-2,2STRNS-1,
neutralofneutral,down,"[-0.7725490196, 0.0745098039, -1]", ,19,MODE,,,,,,,,,0,64,64,64,down,1,0.42866984491,2017_Mai_12_1643,99.024430053,Stroop,A-2,2STRNS-1,
neutralofneutral,left,"[0.568627451, -0.7882352941, -0.7882352941]", ,15,HALS,,,,,,,,,0,65,65,65,left,1,0.610002667937,2017_Mai_12_1643,99.024430053,Stroop,A-2,2STRNS-1,
neutral,down,"[-0.7725490196, 0.0745098039, -1]", ,13,SOLL,,,,,,,,,0,66,66,66,down,1,0.471839577376,2017_Mai_12_1643,99.024430053,Stroop,A-2,2STRNS-1,
neutralofneutral,right,"[-0.8745098039, -0.2078431373, 0.637254902]", ,17,HALS,,,,,,,,,0,67,67,67,right,1,0.525533831814,2017_Mai_12_1643,99.024430053,Stroop,A-2,2STRNS-1,
neutralofneutral,left,"[0.568627451, -0.7882352941, -0.7882352941]", ,18,MODE,,,,,,,,,0,68,68,68,left,1,0.856604959569,2017_Mai_12_1643,99.024430053,Stroop,A-2,2STRNS-1,
neutral,down,"[-0.7725490196, 0.0745098039, -1]", ,10,PECH,,,,,,,,,0,69,69,69,down,1,0.506922527863,2017_Mai_12_1643,99.024430053,Stroop,A-2,2STRNS-1,
neutralofneutral,right,"[-0.8745098039, -0.2078431373, 0.637254902]", ,20,MODE,,,,,,,,,0,70,70,70,right,1,0.48022919114,2017_Mai_12_1643,99.024430053,Stroop,A-2,2STRNS-1,
neutralofneutral,down,"[-0.7725490196, 0.0745098039, -1]", ,16,HALS,,,,,,,,,0,71,71,71,down,1,0.458791270958,2017_Mai_12_1643,99.024430053,Stroop,A-2,2STRNS-1,
neutral,left,"[0.568627451, -0.7882352941, -0.7882352941]", ,9,PECH,,,,,,,,,0,72,72,72,left,1,0.556944248501,2017_Mai_12_1643,99.024430053,Stroop,A-2,2STRNS-1,
neutral,right,"[-0.8745098039, -0.2078431373, 0.637254902]", ,14,SOLL,,,,,,,,,0,73,73,73,right,1,0.853872210016,2017_Mai_12_1643,99.024430053,Stroop,A-2,2STRNS-1,
congruent,down,"[-0.7725490196, 0.0745098039, -1]", ,4,GRÜN,,,,,,,,,0,74,74,74,down,1,0.556181302372,2017_Mai_12_1643,99.024430053,Stroop,A-2,2STRNS-1,
neutral,left,"[0.568627451, -0.7882352941, -0.7882352941]", ,9,PECH,,,,,,,,,0,75,75,75,left,1,0.49582279312,2017_Mai_12_1643,99.024430053,Stroop,A-2,2STRNS-1,
congruent,right,"[-0.8745098039, -0.2078431373, 0.637254902]", ,8,BLAU,,,,,,,,,0,76,76,76,right,1,0.808056051817,2017_Mai_12_1643,99.024430053,Stroop,A-2,2STRNS-1,
neutral,down,"[-0.7725490196, 0.0745098039, -1]", ,13,SOLL,,,,,,,,,0,77,77,77,down,1,0.686329687153,2017_Mai_12_1643,99.024430053,Stroop,A-2,2STRNS-1,
neutral,down,"[-0.7725490196, 0.0745098039, -1]", ,10,PECH,,,,,,,,,0,78,78,78,down,1,0.452247422508,2017_Mai_12_1643,99.024430053,Stroop,A-2,2STRNS-1,
neutral,right,"[-0.8745098039, -0.2078431373, 0.637254902]", ,14,SOLL,,,,,,,,,0,79,79,79,right,1,0.653534178227,2017_Mai_12_1643,99.024430053,Stroop,A-2,2STRNS-1,
congruent,down,"[-0.7725490196, 0.0745098039, -1]", ,4,GRÜN,,,,,,,,,0,80,80,80,down,1,0.535971191869,2017_Mai_12_1643,99.024430053,Stroop,A-2,2STRNS-1,
neutral,left,"[0.568627451, -0.7882352941, -0.7882352941]", ,12,SOLL,,,,,,,,,0,81,81,81,left,1,0.599684596785,2017_Mai_12_1643,99.024430053,Stroop,A-2,2STRNS-1,
congruent,left,"[0.568627451, -0.7882352941, -0.7882352941]", ,0,ROT,,,,,,,,,0,82,82,82,left,1,0.660373594968,2017_Mai_12_1643,99.024430053,Stroop,A-2,2STRNS-1,
congruent,left,"[0.568627451, -0.7882352941, -0.7882352941]", ,0,ROT,,,,,,,,,0,83,83,83,left,1,0.446263421748,2017_Mai_12_1643,99.024430053,Stroop,A-2,2STRNS-1,
neutral,right,"[-0.8745098039, -0.2078431373, 0.637254902]", ,11,PECH,,,,,,,,,0,84,84,84,right,1,0.83567408707,2017_Mai_12_1643,99.024430053,Stroop,A-2,2STRNS-1,
congruent,right,"[-0.8745098039, -0.2078431373, 0.637254902]", ,8,BLAU,,,,,,,,,0,85,85,85,right,1,0.56739054824,2017_Mai_12_1643,99.024430053,Stroop,A-2,2STRNS-1,
neutral,left,"[0.568627451, -0.7882352941, -0.7882352941]", ,9,PECH,,,,,,,,,0,86,86,86,left,1,0.717562706992,2017_Mai_12_1643,99.024430053,Stroop,A-2,2STRNS-1,
neutral,right,"[-0.8745098039, -0.2078431373, 0.637254902]", ,14,SOLL,,,,,,,,,0,87,87,87,right,1,0.682328899343,2017_Mai_12_1643,99.024430053,Stroop,A-2,2STRNS-1,
incongruent,right,"[-0.8745098039, -0.2078431373, 0.637254902]", ,2,ROT,,,,,,,,,0,88,88,88,right,1,0.779000683048,2017_Mai_12_1643,99.024430053,Stroop,A-2,2STRNS-1,
neutral,down,"[-0.7725490196, 0.0745098039, -1]", ,10,PECH,,,,,,,,,0,89,89,89,down,1,0.646503675746,2017_Mai_12_1643,99.024430053,Stroop,A-2,2STRNS-1,
neutral,right,"[-0.8745098039, -0.2078431373, 0.637254902]", ,11,PECH,,,,,,,,,0,90,90,90,right,1,0.560320934644,2017_Mai_12_1643,99.024430053,Stroop,A-2,2STRNS-1,
incongruent,right,"[-0.8745098039, -0.2078431373, 0.637254902]", ,5,GRÜN,,,,,,,,,0,91,91,91,right,1,0.471147589987,2017_Mai_12_1643,99.024430053,Stroop,A-2,2STRNS-1,
neutral,left,"[0.568627451, -0.7882352941, -0.7882352941]", ,12,SOLL,,,,,,,,,0,92,92,92,left,1,0.568682053166,2017_Mai_12_1643,99.024430053,Stroop,A-2,2STRNS-1,
incongruent,left,"[0.568627451, -0.7882352941, -0.7882352941]", ,6,BLAU,,,,,,,,,0,93,93,93,left,1,0.398060926738,2017_Mai_12_1643,99.024430053,Stroop,A-2,2STRNS-1,
neutral,down,"[-0.7725490196, 0.0745098039, -1]", ,13,SOLL,,,,,,,,,0,94,94,94,down,1,0.535754963271,2017_Mai_12_1643,99.024430053,Stroop,A-2,2STRNS-1,
incongruent,down,"[-0.7725490196, 0.0745098039, -1]", ,1,ROT,,,,,,,,,0,95,95,95,down,1,0.447372780619,2017_Mai_12_1643,99.024430053,Stroop,A-2,2STRNS-1,
incongruent,left,"[0.568627451, -0.7882352941, -0.7882352941]", ,3,GRÜN,,,,,,,,,0,96,96,96,left,1,0.961355703029,2017_Mai_12_1643,99.024430053,Stroop,A-2,2STRNS-1,
incongruent,down,"[-0.7725490196, 0.0745098039, -1]", ,7,BLAU,,,,,,,,,0,97,97,97,down,1,1.08039736894,2017_Mai_12_1643,99.024430053,Stroop,A-2,2STRNS-1,
fix,return,white, ,21,+,,,,,,,,,0,98,98,98,None,0,,2017_Mai_12_1643,99.024430053,Stroop,A-2,2STRNS-1,
fix,return,white, ,21,+,,,,,,,,,0,99,99,99,None,0,,2017_Mai_12_1643,99.024430053,Stroop,A-2,2STRNS-1,
fix,return,white, ,21,+,,,,,,,,,0,100,100,100,None,0,,2017_Mai_12_1643,99.024430053,Stroop,A-2,2STRNS-1,
fix,return,white, ,21,+,,,,,,,,,0,101,101,101,None,0,,2017_Mai_12_1643,99.024430053,Stroop,A-2,2STRNS-1,
fix,return,white, ,21,+,,,,,,,,,0,102,102,102,None,0,,2017_Mai_12_1643,99.024430053,Stroop,A-2,2STRNS-1,
fix,return,white, ,21,+,,,,,,,,,0,103,103,103,None,0,,2017_Mai_12_1643,99.024430053,Stroop,A-2,2STRNS-1,
fix,return,white, ,21,+,,,,,,,,,0,104,104,104,None,0,,2017_Mai_12_1643,99.024430053,Stroop,A-2,2STRNS-1,
fix,return,white, ,21,+,,,,,,,,,0,105,105,105,None,0,,2017_Mai_12_1643,99.024430053,Stroop,A-2,2STRNS-1,
fix,return,white, ,21,+,,,,,,,,,0,106,106,106,None,0,,2017_Mai_12_1643,99.024430053,Stroop,A-2,2STRNS-1,
fix,return,white, ,21,+,,,,,,,,,0,107,107,107,None,0,,2017_Mai_12_1643,99.024430053,Stroop,A-2,2STRNS-1,
fix,return,white, ,21,+,,,,,,,,,0,108,108,108,None,0,,2017_Mai_12_1643,99.024430053,Stroop,A-2,2STRNS-1,
fix,return,white, ,21,+,,,,,,,,,0,109,109,109,None,0,,2017_Mai_12_1643,99.024430053,Stroop,A-2,2STRNS-1,
fix,return,white,+,22,+,,,,,,,,,0,110,110,110,None,0,,2017_Mai_12_1643,99.024430053,Stroop,A-2,2STRNS-1,
neutral,down,"[-0.7725490196, 0.0745098039, -1]", ,10,PECH,,,,,,,,,0,111,111,111,down,1,0.73170388974,2017_Mai_12_1643,99.024430053,Stroop,A-2,2STRNS-1,
neutral,right,"[-0.8745098039, -0.2078431373, 0.637254902]", ,14,SOLL,,,,,,,,,0,112,112,112,right,1,0.674385152303,2017_Mai_12_1643,99.024430053,Stroop,A-2,2STRNS-1,
incongruent,left,"[0.568627451, -0.7882352941, -0.7882352941]", ,6,BLAU,,,,,,,,,0,113,113,113,left,1,0.824635253922,2017_Mai_12_1643,99.024430053,Stroop,A-2,2STRNS-1,
neutral,left,"[0.568627451, -0.7882352941, -0.7882352941]", ,12,SOLL,,,,,,,,,0,114,114,114,left,1,0.575932974722,2017_Mai_12_1643,99.024430053,Stroop,A-2,2STRNS-1,
incongruent,down,"[-0.7725490196, 0.0745098039, -1]", ,1,ROT,,,,,,,,,0,115,115,115,down,1,0.827778670194,2017_Mai_12_1643,99.024430053,Stroop,A-2,2STRNS-1,
incongruent,right,"[-0.8745098039, -0.2078431373, 0.637254902]", ,2,ROT,,,,,,,,,0,116,116,116,right,1,0.724183101484,2017_Mai_12_1643,99.024430053,Stroop,A-2,2STRNS-1,
incongruent,down,"[-0.7725490196, 0.0745098039, -1]", ,7,BLAU,,,,,,,,,0,117,117,117,down,1,0.710176013991,2017_Mai_12_1643,99.024430053,Stroop,A-2,2STRNS-1,
neutral,left,"[0.568627451, -0.7882352941, -0.7882352941]", ,9,PECH,,,,,,,,,0,118,118,118,left,1,0.537757452414,2017_Mai_12_1643,99.024430053,Stroop,A-2,2STRNS-1,
neutral,right,"[-0.8745098039, -0.2078431373, 0.637254902]", ,11,PECH,,,,,,,,,0,119,119,119,right,1,0.614058490674,2017_Mai_12_1643,99.024430053,Stroop,A-2,2STRNS-1,
incongruent,right,"[-0.8745098039, -0.2078431373, 0.637254902]", ,5,GRÜN,,,,,,,,,0,120,120,120,right,1,0.675319349247,2017_Mai_12_1643,99.024430053,Stroop,A-2,2STRNS-1,
neutral,down,"[-0.7725490196, 0.0745098039, -1]", ,13,SOLL,,,,,,,,,0,121,121,121,down,1,0.632913959735,2017_Mai_12_1643,99.024430053,Stroop,A-2,2STRNS-1,
incongruent,left,"[0.568627451, -0.7882352941, -0.7882352941]", ,3,GRÜN,,,,,,,,,0,122,122,122,left,1,0.814940166976,2017_Mai_12_1643,99.024430053,Stroop,A-2,2STRNS-1,
neutralofneutral,down,"[-0.7725490196, 0.0745098039, -1]", ,19,MODE,,,,,,,,,0,123,123,123,down,1,0.58873767476,2017_Mai_12_1643,99.024430053,Stroop,A-2,2STRNS-1,
neutralofneutral,left,"[0.568627451, -0.7882352941, -0.7882352941]", ,15,HALS,,,,,,,,,0,124,124,124,left,1,0.631887572303,2017_Mai_12_1643,99.024430053,Stroop,A-2,2STRNS-1,
neutral,left,"[0.568627451, -0.7882352941, -0.7882352941]", ,12,SOLL,,,,,,,,,0,125,125,125,left,1,0.692527402226,2017_Mai_12_1643,99.024430053,Stroop,A-2,2STRNS-1,
neutral,left,"[0.568627451, -0.7882352941, -0.7882352941]", ,9,PECH,,,,,,,,,0,126,126,126,left,1,0.375786587402,2017_Mai_12_1643,99.024430053,Stroop,A-2,2STRNS-1,
neutralofneutral,right,"[-0.8745098039, -0.2078431373, 0.637254902]", ,17,HALS,,,,,,,,,0,127,127,127,right,1,0.672279018702,2017_Mai_12_1643,99.024430053,Stroop,A-2,2STRNS-1,
neutralofneutral,right,"[-0.8745098039, -0.2078431373, 0.637254902]", ,20,MODE,,,,,,,,,0,128,128,128,right,1,0.429559622801,2017_Mai_12_1643,99.024430053,Stroop,A-2,2STRNS-1,
neutralofneutral,down,"[-0.7725490196, 0.0745098039, -1]", ,16,HALS,,,,,,,,,0,129,129,129,down,1,0.715583405153,2017_Mai_12_1643,99.024430053,Stroop,A-2,2STRNS-1,
neutral,right,"[-0.8745098039, -0.2078431373, 0.637254902]", ,11,PECH,,,,,,,,,0,130,130,130,right,1,0.678120543253,2017_Mai_12_1643,99.024430053,Stroop,A-2,2STRNS-1,
neutral,down,"[-0.7725490196, 0.0745098039, -1]", ,13,SOLL,,,,,,,,,0,131,131,131,down,1,0.919853780299,2017_Mai_12_1643,99.024430053,Stroop,A-2,2STRNS-1,
neutral,right,"[-0.8745098039, -0.2078431373, 0.637254902]", ,14,SOLL,,,,,,,,,0,132,132,132,right,1,1.00676873737,2017_Mai_12_1643,99.024430053,Stroop,A-2,2STRNS-1,
neutral,down,"[-0.7725490196, 0.0745098039, -1]", ,10,PECH,,,,,,,,,0,133,133,133,down,1,0.656743524666,2017_Mai_12_1643,99.024430053,Stroop,A-2,2STRNS-1,
neutralofneutral,left,"[0.568627451, -0.7882352941, -0.7882352941]", ,18,MODE,,,,,,,,,0,134,134,134,left,1,0.782177064403,2017_Mai_12_1643,99.024430053,Stroop,A-2,2STRNS-1,
neutral,down,"[-0.7725490196, 0.0745098039, -1]", ,10,PECH,,,,,,,,,0,135,135,135,down,1,0.526992955809,2017_Mai_12_1643,99.024430053,Stroop,A-2,2STRNS-1,
congruent,down,"[-0.7725490196, 0.0745098039, -1]", ,4,GRÜN,,,,,,,,,0,136,136,136,down,1,0.493508811874,2017_Mai_12_1643,99.024430053,Stroop,A-2,2STRNS-1,
congruent,right,"[-0.8745098039, -0.2078431373, 0.637254902]", ,8,BLAU,,,,,,,,,0,137,137,137,right,1,0.721524942416,2017_Mai_12_1643,99.024430053,Stroop,A-2,2STRNS-1,
neutral,left,"[0.568627451, -0.7882352941, -0.7882352941]", ,12,SOLL,,,,,,,,,0,138,138,138,left,1,0.695990412189,2017_Mai_12_1643,99.024430053,Stroop,A-2,2STRNS-1,
congruent,left,"[0.568627451, -0.7882352941, -0.7882352941]", ,0,ROT,,,,,,,,,0,139,139,139,left,1,0.678670613165,2017_Mai_12_1643,99.024430053,Stroop,A-2,2STRNS-1,
neutral,down,"[-0.7725490196, 0.0745098039, -1]", ,13,SOLL,,,,,,,,,0,140,140,140,down,1,0.895473866092,2017_Mai_12_1643,99.024430053,Stroop,A-2,2STRNS-1,
neutral,right,"[-0.8745098039, -0.2078431373, 0.637254902]", ,11,PECH,,,,,,,,,0,141,141,141,right,1,0.718820967469,2017_Mai_12_1643,99.024430053,Stroop,A-2,2STRNS-1,
congruent,down,"[-0.7725490196, 0.0745098039, -1]", ,4,GRÜN,,,,,,,,,0,142,142,142,down,1,0.650713428662,2017_Mai_12_1643,99.024430053,Stroop,A-2,2STRNS-1,
congruent,right,"[-0.8745098039, -0.2078431373, 0.637254902]", ,8,BLAU,,,,,,,,,0,143,143,143,right,1,0.63192780088,2017_Mai_12_1643,99.024430053,Stroop,A-2,2STRNS-1,
congruent,left,"[0.568627451, -0.7882352941, -0.7882352941]", ,0,ROT,,,,,,,,,0,144,144,144,left,1,0.946726469426,2017_Mai_12_1643,99.024430053,Stroop,A-2,2STRNS-1,
neutral,left,"[0.568627451, -0.7882352941, -0.7882352941]", ,9,PECH,,,,,,,,,0,145,145,145,left,1,0.796294221752,2017_Mai_12_1643,99.024430053,Stroop,A-2,2STRNS-1,
neutral,right,"[-0.8745098039, -0.2078431373, 0.637254902]", ,14,SOLL,,,,,,,,,0,146,146,146,right,1,0.62066491691,2017_Mai_12_1643,99.024430053,Stroop,A-2,2STRNS-1,
fix,return,white, ,21,+,,,,,,,,,0,147,147,147,None,0,,2017_Mai_12_1643,99.024430053,Stroop,A-2,2STRNS-1,
fix,return,white, ,21,+,,,,,,,,,0,148,148,148,None,0,,2017_Mai_12_1643,99.024430053,Stroop,A-2,2STRNS-1,
fix,return,white, ,21,+,,,,,,,,,0,149,149,149,None,0,,2017_Mai_12_1643,99.024430053,Stroop,A-2,2STRNS-1,
fix,return,white, ,21,+,,,,,,,,,0,150,150,150,None,0,,2017_Mai_12_1643,99.024430053,Stroop,A-2,2STRNS-1,
fix,return,white, ,21,+,,,,,,,,,0,151,151,151,None,0,,2017_Mai_12_1643,99.024430053,Stroop,A-2,2STRNS-1,
fix,return,white, ,21,+,,,,,,,,,0,152,152,152,None,0,,2017_Mai_12_1643,99.024430053,Stroop,A-2,2STRNS-1,
fix,return,white, ,21,+,,,,,,,,,0,153,153,153,None,0,,2017_Mai_12_1643,99.024430053,Stroop,A-2,2STRNS-1,
fix,return,white, ,21,+,,,,,,,,,0,154,154,154,None,0,,2017_Mai_12_1643,99.024430053,Stroop,A-2,2STRNS-1,
fix,return,white, ,21,+,,,,,,,,,0,155,155,155,None,0,,2017_Mai_12_1643,99.024430053,Stroop,A-2,2STRNS-1,
fix,return,white, ,21,+,,,,,,,,,0,156,156,156,None,0,,2017_Mai_12_1643,99.024430053,Stroop,A-2,2STRNS-1,
fix,return,white, ,21,+,,,,,,,,,0,157,157,157,None,0,,2017_Mai_12_1643,99.024430053,Stroop,A-2,2STRNS-1,
fix,return,white, ,21,+,,,,,,,,,0,158,158,158,None,0,,2017_Mai_12_1643,99.024430053,Stroop,A-2,2STRNS-1,
fix,return,white,+,22,+,,,,,,,,,0,159,159,159,None,0,,2017_Mai_12_1643,99.024430053,Stroop,A-2,2STRNS-1,
neutral,down,"[-0.7725490196, 0.0745098039, -1]", ,10,PECH,,,,,,,,,0,160,160,160,down,1,0.645900526463,2017_Mai_12_1643,99.024430053,Stroop,A-2,2STRNS-1,
neutral,left,"[0.568627451, -0.7882352941, -0.7882352941]", ,9,PECH,,,,,,,,,0,161,161,161,left,1,0.580458410217,2017_Mai_12_1643,99.024430053,Stroop,A-2,2STRNS-1,
incongruent,down,"[-0.7725490196, 0.0745098039, -1]", ,7,BLAU,,,,,,,,,0,162,162,162,down,1,0.83914072878,2017_Mai_12_1643,99.024430053,Stroop,A-2,2STRNS-1,
neutral,right,"[-0.8745098039, -0.2078431373, 0.637254902]", ,11,PECH,,,,,,,,,0,163,163,163,right,1,0.688006157207,2017_Mai_12_1643,99.024430053,Stroop,A-2,2STRNS-1,
neutral,left,"[0.568627451, -0.7882352941, -0.7882352941]", ,12,SOLL,,,,,,,,,0,164,164,164,left,1,0.695886767732,2017_Mai_12_1643,99.024430053,Stroop,A-2,2STRNS-1,
incongruent,down,"[-0.7725490196, 0.0745098039, -1]", ,1,ROT,,,,,,,,,0,165,165,165,down,1,0.905846134076,2017_Mai_12_1643,99.024430053,Stroop,A-2,2STRNS-1,
neutral,right,"[-0.8745098039, -0.2078431373, 0.637254902]", ,14,SOLL,,,,,,,,,0,166,166,166,right,1,0.738998671619,2017_Mai_12_1643,99.024430053,Stroop,A-2,2STRNS-1,
incongruent,right,"[-0.8745098039, -0.2078431373, 0.637254902]", ,5,GRÜN,,,,,,,,,0,167,167,167,right,1,0.735696575961,2017_Mai_12_1643,99.024430053,Stroop,A-2,2STRNS-1,
incongruent,right,"[-0.8745098039, -0.2078431373, 0.637254902]", ,2,ROT,,,,,,,,,0,168,168,168,right,1,0.424560663436,2017_Mai_12_1643,99.024430053,Stroop,A-2,2STRNS-1,
neutral,down,"[-0.7725490196, 0.0745098039, -1]", ,13,SOLL,,,,,,,,,0,169,169,169,down,1,0.523227114061,2017_Mai_12_1643,99.024430053,Stroop,A-2,2STRNS-1,
incongruent,left,"[0.568627451, -0.7882352941, -0.7882352941]", ,6,BLAU,,,,,,,,,0,170,170,170,left,1,0.750401517511,2017_Mai_12_1643,99.024430053,Stroop,A-2,2STRNS-1,
incongruent,left,"[0.568627451, -0.7882352941, -0.7882352941]", ,3,GRÜN,,,,,,,,,0,171,171,171,left,1,0.617897246717,2017_Mai_12_1643,99.024430053,Stroop,A-2,2STRNS-1,
neutral,right,"[-0.8745098039, -0.2078431373, 0.637254902]", ,11,PECH,,,,,,,,,0,172,172,172,right,1,0.581223870632,2017_Mai_12_1643,99.024430053,Stroop,A-2,2STRNS-1,
congruent,left,"[0.568627451, -0.7882352941, -0.7882352941]", ,0,ROT,,,,,,,,,0,173,173,173,left,1,0.895976164568,2017_Mai_12_1643,99.024430053,Stroop,A-2,2STRNS-1,
congruent,down,"[-0.7725490196, 0.0745098039, -1]", ,4,GRÜN,,,,,,,,,0,174,174,174,down,1,0.546687358309,2017_Mai_12_1643,99.024430053,Stroop,A-2,2STRNS-1,
neutral,left,"[0.568627451, -0.7882352941, -0.7882352941]", ,12,SOLL,,,,,,,,,0,175,175,175,left,1,0.579096505282,2017_Mai_12_1643,99.024430053,Stroop,A-2,2STRNS-1,
congruent,right,"[-0.8745098039, -0.2078431373, 0.637254902]", ,8,BLAU,,,,,,,,,0,176,176,176,right,1,0.548852158585,2017_Mai_12_1643,99.024430053,Stroop,A-2,2STRNS-1,
congruent,left,"[0.568627451, -0.7882352941, -0.7882352941]", ,0,ROT,,,,,,,,,0,177,177,177,left,1,0.937997147682,2017_Mai_12_1643,99.024430053,Stroop,A-2,2STRNS-1,
neutral,left,"[0.568627451, -0.7882352941, -0.7882352941]", ,9,PECH,,,,,,,,,0,178,178,178,left,1,0.613201677867,2017_Mai_12_1643,99.024430053,Stroop,A-2,2STRNS-1,
neutral,down,"[-0.7725490196, 0.0745098039, -1]", ,10,PECH,,,,,,,,,0,179,179,179,down,1,0.861092960139,2017_Mai_12_1643,99.024430053,Stroop,A-2,2STRNS-1,
neutral,right,"[-0.8745098039, -0.2078431373, 0.637254902]", ,14,SOLL,,,,,,,,,0,180,180,180,right,1,0.652487955871,2017_Mai_12_1643,99.024430053,Stroop,A-2,2STRNS-1,
neutral,down,"[-0.7725490196, 0.0745098039, -1]", ,13,SOLL,,,,,,,,,0,181,181,181,down,1,0.525540815942,2017_Mai_12_1643,99.024430053,Stroop,A-2,2STRNS-1,
congruent,right,"[-0.8745098039, -0.2078431373, 0.637254902]", ,8,BLAU,,,,,,,,,0,182,182,182,right,1,0.729909806973,2017_Mai_12_1643,99.024430053,Stroop,A-2,2STRNS-1,
congruent,down,"[-0.7725490196, 0.0745098039, -1]", ,4,GRÜN,,,,,,,,,0,183,183,183,down,1,0.831544791307,2017_Mai_12_1643,99.024430053,Stroop,A-2,2STRNS-1,
neutralofneutral,right,"[-0.8745098039, -0.2078431373, 0.637254902]", ,20,MODE,,,,,,,,,0,184,184,184,right,1,1.31654777353,2017_Mai_12_1643,99.024430053,Stroop,A-2,2STRNS-1,
neutralofneutral,left,"[0.568627451, -0.7882352941, -0.7882352941]", ,18,MODE,,,,,,,,,0,185,185,185,left,1,0.831734200855,2017_Mai_12_1643,99.024430053,Stroop,A-2,2STRNS-1,
neutralofneutral,right,"[-0.8745098039, -0.2078431373, 0.637254902]", ,17,HALS,,,,,,,,,0,186,186,186,right,1,0.952939270215,2017_Mai_12_1643,99.024430053,Stroop,A-2,2STRNS-1,
neutral,right,"[-0.8745098039, -0.2078431373, 0.637254902]", ,11,PECH,,,,,,,,,0,187,187,187,None,0,,2017_Mai_12_1643,99.024430053,Stroop,A-2,2STRNS-1,
neutral,right,"[-0.8745098039, -0.2078431373, 0.637254902]", ,14,SOLL,,,,,,,,,0,188,188,188,right,1,0.558360350268,2017_Mai_12_1643,99.024430053,Stroop,A-2,2STRNS-1,
neutralofneutral,left,"[0.568627451, -0.7882352941, -0.7882352941]", ,15,HALS,,,,,,,,,0,189,189,189,left,1,0.945745059777,2017_Mai_12_1643,99.024430053,Stroop,A-2,2STRNS-1,
neutral,down,"[-0.7725490196, 0.0745098039, -1]", ,10,PECH,,,,,,,,,0,190,190,190,down,1,1.1395593574,2017_Mai_12_1643,99.024430053,Stroop,A-2,2STRNS-1,
neutral,left,"[0.568627451, -0.7882352941, -0.7882352941]", ,12,SOLL,,,,,,,,,0,191,191,191,left,1,1.0808669817,2017_Mai_12_1643,99.024430053,Stroop,A-2,2STRNS-1,
neutralofneutral,down,"[-0.7725490196, 0.0745098039, -1]", ,19,MODE,,,,,,,,,0,192,192,192,down,1,1.20632929604,2017_Mai_12_1643,99.024430053,Stroop,A-2,2STRNS-1,
neutralofneutral,down,"[-0.7725490196, 0.0745098039, -1]", ,16,HALS,,,,,,,,,0,193,193,193,down,1,0.727866809888,2017_Mai_12_1643,99.024430053,Stroop,A-2,2STRNS-1,
neutral,left,"[0.568627451, -0.7882352941, -0.7882352941]", ,9,PECH,,,,,,,,,0,194,194,194,None,0,,2017_Mai_12_1643,99.024430053,Stroop,A-2,2STRNS-1,
neutral,down,"[-0.7725490196, 0.0745098039, -1]", ,13,SOLL,,,,,,,,,0,195,195,195,down,1,0.683963743995,2017_Mai_12_1643,99.024430053,Stroop,A-2,2STRNS-1,
fix,return,white, ,21,+,,,,,,,,,0,196,196,196,None,0,,2017_Mai_12_1643,99.024430053,Stroop,A-2,2STRNS-1,
fix,return,white, ,21,+,,,,,,,,,0,197,197,197,None,0,,2017_Mai_12_1643,99.024430053,Stroop,A-2,2STRNS-1,
fix,return,white, ,21,+,,,,,,,,,0,198,198,198,None,0,,2017_Mai_12_1643,99.024430053,Stroop,A-2,2STRNS-1,
fix,return,white, ,21,+,,,,,,,,,0,199,199,199,None,0,,2017_Mai_12_1643,99.024430053,Stroop,A-2,2STRNS-1,
fix,return,white, ,21,+,,,,,,,,,0,200,200,200,None,0,,2017_Mai_12_1643,99.024430053,Stroop,A-2,2STRNS-1,
fix,return,white, ,21,+,,,,,,,,,0,201,201,201,None,0,,2017_Mai_12_1643,99.024430053,Stroop,A-2,2STRNS-1,
fix,return,white, ,21,+,,,,,,,,,0,202,202,202,None,0,,2017_Mai_12_1643,99.024430053,Stroop,A-2,2STRNS-1,
fix,return,white, ,21,+,,,,,,,,,0,203,203,203,None,0,,2017_Mai_12_1643,99.024430053,Stroop,A-2,2STRNS-1,
fix,return,white, ,21,+,,,,,,,,,0,204,204,204,None,0,,2017_Mai_12_1643,99.024430053,Stroop,A-2,2STRNS-1,
fix,return,white, ,21,+,,,,,,,,,0,205,205,205,None,0,,2017_Mai_12_1643,99.024430053,Stroop,A-2,2STRNS-1,
fix,return,white, ,21,+,,,,,,,,,0,206,206,206,None,0,,2017_Mai_12_1643,99.024430053,Stroop,A-2,2STRNS-1,
fix,return,white, ,21,+,,,,,,,,,0,207,207,207,None,0,,2017_Mai_12_1643,99.024430053,Stroop,A-2,2STRNS-1,
fix,return,white,+,22,+,,,,,,,,,0,208,208,208,None,0,,2017_Mai_12_1643,99.024430053,Stroop,A-2,2STRNS-1,
neutralofneutral,left,"[0.568627451, -0.7882352941, -0.7882352941]", ,15,HALS,,,,,,,,,0,209,209,209,left,1,0.664013443049,2017_Mai_12_1643,99.024430053,Stroop,A-2,2STRNS-1,
neutral,right,"[-0.8745098039, -0.2078431373, 0.637254902]", ,14,SOLL,,,,,,,,,0,210,210,210,right,1,0.639807852674,2017_Mai_12_1643,99.024430053,Stroop,A-2,2STRNS-1,
neutralofneutral,right,"[-0.8745098039, -0.2078431373, 0.637254902]", ,17,HALS,,,,,,,,,0,211,211,211,right,1,0.511439023675,2017_Mai_12_1643,99.024430053,Stroop,A-2,2STRNS-1,
neutral,down,"[-0.7725490196, 0.0745098039, -1]", ,10,PECH,,,,,,,,,0,212,212,212,down,1,0.953546330609,2017_Mai_12_1643,99.024430053,Stroop,A-2,2STRNS-1,
neutralofneutral,right,"[-0.8745098039, -0.2078431373, 0.637254902]", ,20,MODE,,,,,,,,,0,213,213,213,right,1,0.56520032574,2017_Mai_12_1643,99.024430053,Stroop,A-2,2STRNS-1,
neutral,down,"[-0.7725490196, 0.0745098039, -1]", ,13,SOLL,,,,,,,,,0,214,214,214,down,1,0.643551624578,2017_Mai_12_1643,99.024430053,Stroop,A-2,2STRNS-1,
neutral,right,"[-0.8745098039, -0.2078431373, 0.637254902]", ,11,PECH,,,,,,,,,0,215,215,215,right,1,0.634062429722,2017_Mai_12_1643,99.024430053,Stroop,A-2,2STRNS-1,
neutralofneutral,left,"[0.568627451, -0.7882352941, -0.7882352941]", ,18,MODE,,,,,,,,,0,216,216,216,left,1,0.663403868369,2017_Mai_12_1643,99.024430053,Stroop,A-2,2STRNS-1,
neutralofneutral,down,"[-0.7725490196, 0.0745098039, -1]", ,19,MODE,,,,,,,,,0,217,217,217,right,0,0.684326359915,2017_Mai_12_1643,99.024430053,Stroop,A-2,2STRNS-1,
neutral,left,"[0.568627451, -0.7882352941, -0.7882352941]", ,9,PECH,,,,,,,,,0,218,218,218,left,1,0.62398684749,2017_Mai_12_1643,99.024430053,Stroop,A-2,2STRNS-1,
neutralofneutral,down,"[-0.7725490196, 0.0745098039, -1]", ,16,HALS,,,,,,,,,0,219,219,219,down,1,0.651771104987,2017_Mai_12_1643,99.024430053,Stroop,A-2,2STRNS-1,
neutral,left,"[0.568627451, -0.7882352941, -0.7882352941]", ,12,SOLL,,,,,,,,,0,220,220,220,left,1,0.791962945011,2017_Mai_12_1643,99.024430053,Stroop,A-2,2STRNS-1,
neutral,left,"[0.568627451, -0.7882352941, -0.7882352941]", ,12,SOLL,,,,,,,,,0,221,221,221,left,1,0.598692850628,2017_Mai_12_1643,99.024430053,Stroop,A-2,2STRNS-1,
incongruent,right,"[-0.8745098039, -0.2078431373, 0.637254902]", ,2,ROT,,,,,,,,,0,222,222,222,right,1,0.91567224326,2017_Mai_12_1643,99.024430053,Stroop,A-2,2STRNS-1,
incongruent,right,"[-0.8745098039, -0.2078431373, 0.637254902]", ,5,GRÜN,,,,,,,,,0,223,223,223,right,1,1.285115287,2017_Mai_12_1643,99.024430053,Stroop,A-2,2STRNS-1,
neutral,right,"[-0.8745098039, -0.2078431373, 0.637254902]", ,11,PECH,,,,,,,,,0,224,224,224,right,1,0.557346534266,2017_Mai_12_1643,99.024430053,Stroop,A-2,2STRNS-1,
neutral,down,"[-0.7725490196, 0.0745098039, -1]", ,13,SOLL,,,,,,,,,0,225,225,225,down,1,0.554862419665,2017_Mai_12_1643,99.024430053,Stroop,A-2,2STRNS-1,
incongruent,left,"[0.568627451, -0.7882352941, -0.7882352941]", ,6,BLAU,,,,,,,,,0,226,226,226,left,1,0.964120579571,2017_Mai_12_1643,99.024430053,Stroop,A-2,2STRNS-1,
incongruent,down,"[-0.7725490196, 0.0745098039, -1]", ,7,BLAU,,,,,,,,,0,227,227,227,down,1,0.942660868909,2017_Mai_12_1643,99.024430053,Stroop,A-2,2STRNS-1,
neutral,left,"[0.568627451, -0.7882352941, -0.7882352941]", ,9,PECH,,,,,,,,,0,228,228,228,left,1,0.592759973684,2017_Mai_12_1643,99.024430053,Stroop,A-2,2STRNS-1,
neutral,down,"[-0.7725490196, 0.0745098039, -1]", ,10,PECH,,,,,,,,,0,229,229,229,down,1,0.63361935665,2017_Mai_12_1643,99.024430053,Stroop,A-2,2STRNS-1,
incongruent,down,"[-0.7725490196, 0.0745098039, -1]", ,1,ROT,,,,,,,,,0,230,230,230,down,1,0.71319203977,2017_Mai_12_1643,99.024430053,Stroop,A-2,2STRNS-1,
neutral,right,"[-0.8745098039, -0.2078431373, 0.637254902]", ,14,SOLL,,,,,,,,,0,231,231,231,right,1,0.587498969841,2017_Mai_12_1643,99.024430053,Stroop,A-2,2STRNS-1,
incongruent,left,"[0.568627451, -0.7882352941, -0.7882352941]", ,3,GRÜN,,,,,,,,,0,232,232,232,left,1,0.929992778412,2017_Mai_12_1643,99.024430053,Stroop,A-2,2STRNS-1,
neutral,down,"[-0.7725490196, 0.0745098039, -1]", ,13,SOLL,,,,,,,,,0,233,233,233,down,1,0.598025447368,2017_Mai_12_1643,99.024430053,Stroop,A-2,2STRNS-1,
neutral,left,"[0.568627451, -0.7882352941, -0.7882352941]", ,9,PECH,,,,,,,,,0,234,234,234,left,1,0.699242222126,2017_Mai_12_1643,99.024430053,Stroop,A-2,2STRNS-1,
neutral,right,"[-0.8745098039, -0.2078431373, 0.637254902]", ,11,PECH,,,,,,,,,0,235,235,235,right,1,0.719743710444,2017_Mai_12_1643,99.024430053,Stroop,A-2,2STRNS-1,
congruent,down,"[-0.7725490196, 0.0745098039, -1]", ,4,GRÜN,,,,,,,,,0,236,236,236,down,1,0.630713959456,2017_Mai_12_1643,99.024430053,Stroop,A-2,2STRNS-1,
congruent,left,"[0.568627451, -0.7882352941, -0.7882352941]", ,0,ROT,,,,,,,,,0,237,237,237,left,1,0.606978261203,2017_Mai_12_1643,99.024430053,Stroop,A-2,2STRNS-1,
neutral,down,"[-0.7725490196, 0.0745098039, -1]", ,10,PECH,,,,,,,,,0,238,238,238,down,1,0.620939532818,2017_Mai_12_1643,99.024430053,Stroop,A-2,2STRNS-1,
congruent,down,"[-0.7725490196, 0.0745098039, -1]", ,4,GRÜN,,,,,,,,,0,239,239,239,down,1,0.415991417904,2017_Mai_12_1643,99.024430053,Stroop,A-2,2STRNS-1,
congruent,left,"[0.568627451, -0.7882352941, -0.7882352941]", ,0,ROT,,,,,,,,,0,240,240,240,left,1,0.668486916633,2017_Mai_12_1643,99.024430053,Stroop,A-2,2STRNS-1,
congruent,right,"[-0.8745098039, -0.2078431373, 0.637254902]", ,8,BLAU,,,,,,,,,0,241,241,241,right,1,0.888157852465,2017_Mai_12_1643,99.024430053,Stroop,A-2,2STRNS-1,
neutral,left,"[0.568627451, -0.7882352941, -0.7882352941]", ,12,SOLL,,,,,,,,,0,242,242,242,left,1,0.673342282329,2017_Mai_12_1643,99.024430053,Stroop,A-2,2STRNS-1,
congruent,right,"[-0.8745098039, -0.2078431373, 0.637254902]", ,8,BLAU,,,,,,,,,0,243,243,243,right,1,0.791951491041,2017_Mai_12_1643,99.024430053,Stroop,A-2,2STRNS-1,
neutral,right,"[-0.8745098039, -0.2078431373, 0.637254902]", ,14,SOLL,,,,,,,,,0,244,244,244,right,1,0.459722394885,2017_Mai_12_1643,99.024430053,Stroop,A-2,2STRNS-1,
fix,return,white, ,21,+,,,,,,,,,0,245,245,245,None,0,,2017_Mai_12_1643,99.024430053,Stroop,A-2,2STRNS-1,
fix,return,white, ,21,+,,,,,,,,,0,246,246,246,None,0,,2017_Mai_12_1643,99.024430053,Stroop,A-2,2STRNS-1,
fix,return,white, ,21,+,,,,,,,,,0,247,247,247,None,0,,2017_Mai_12_1643,99.024430053,Stroop,A-2,2STRNS-1,
fix,return,white, ,21,+,,,,,,,,,0,248,248,248,None,0,,2017_Mai_12_1643,99.024430053,Stroop,A-2,2STRNS-1,
fix,return,white, ,21,+,,,,,,,,,0,249,249,249,None,0,,2017_Mai_12_1643,99.024430053,Stroop,A-2,2STRNS-1,
fix,return,white, ,21,+,,,,,,,,,0,250,250,250,None,0,,2017_Mai_12_1643,99.024430053,Stroop,A-2,2STRNS-1,
fix,return,white, ,21,+,,,,,,,,,0,251,251,251,None,0,,2017_Mai_12_1643,99.024430053,Stroop,A-2,2STRNS-1,
fix,return,white, ,21,+,,,,,,,,,0,252,252,252,None,0,,2017_Mai_12_1643,99.024430053,Stroop,A-2,2STRNS-1,
fix,return,white, ,21,+,,,,,,,,,0,253,253,253,None,0,,2017_Mai_12_1643,99.024430053,Stroop,A-2,2STRNS-1,
fix,return,white, ,21,+,,,,,,,,,0,254,254,254,None,0,,2017_Mai_12_1643,99.024430053,Stroop,A-2,2STRNS-1,
fix,return,white, ,21,+,,,,,,,,,0,255,255,255,None,0,,2017_Mai_12_1643,99.024430053,Stroop,A-2,2STRNS-1,
fix,return,white, ,21,+,,,,,,,,,0,256,256,256,None,0,,2017_Mai_12_1643,99.024430053,Stroop,A-2,2STRNS-1,
fix,return,white,+,22,+,,,,,,,,,0,257,257,257,None,0,,2017_Mai_12_1643,99.024430053,Stroop,A-2,2STRNS-1,
congruent,down,"[-0.7725490196, 0.0745098039, -1]", ,4,GRÜN,,,,,,,,,0,258,258,258,down,1,0.664460427233,2017_Mai_12_1643,99.024430053,Stroop,A-2,2STRNS-1,
neutral,down,"[-0.7725490196, 0.0745098039, -1]", ,10,PECH,,,,,,,,,0,259,259,259,down,1,0.430029794289,2017_Mai_12_1643,99.024430053,Stroop,A-2,2STRNS-1,
congruent,left,"[0.568627451, -0.7882352941, -0.7882352941]", ,0,ROT,,,,,,,,,0,260,260,260,left,1,0.586562258611,2017_Mai_12_1643,99.024430053,Stroop,A-2,2STRNS-1,
congruent,right,"[-0.8745098039, -0.2078431373, 0.637254902]", ,8,BLAU,,,,,,,,,0,261,261,261,right,1,0.64629303445,2017_Mai_12_1643,99.024430053,Stroop,A-2,2STRNS-1,
neutral,down,"[-0.7725490196, 0.0745098039, -1]", ,13,SOLL,,,,,,,,,0,262,262,262,down,1,0.633163432783,2017_Mai_12_1643,99.024430053,Stroop,A-2,2STRNS-1,
congruent,right,"[-0.8745098039, -0.2078431373, 0.637254902]", ,8,BLAU,,,,,,,,,0,263,263,263,right,1,0.569694472342,2017_Mai_12_1643,99.024430053,Stroop,A-2,2STRNS-1,
neutral,left,"[0.568627451, -0.7882352941, -0.7882352941]", ,12,SOLL,,,,,,,,,0,264,264,264,left,1,0.621121120142,2017_Mai_12_1643,99.024430053,Stroop,A-2,2STRNS-1,
neutral,left,"[0.568627451, -0.7882352941, -0.7882352941]", ,9,PECH,,,,,,,,,0,265,265,265,left,1,0.430927953134,2017_Mai_12_1643,99.024430053,Stroop,A-2,2STRNS-1,
neutral,right,"[-0.8745098039, -0.2078431373, 0.637254902]", ,11,PECH,,,,,,,,,0,266,266,266,right,1,0.535687356913,2017_Mai_12_1643,99.024430053,Stroop,A-2,2STRNS-1,
congruent,left,"[0.568627451, -0.7882352941, -0.7882352941]", ,0,ROT,,,,,,,,,0,267,267,267,left,1,0.541238900475,2017_Mai_12_1643,99.024430053,Stroop,A-2,2STRNS-1,
congruent,down,"[-0.7725490196, 0.0745098039, -1]", ,4,GRÜN,,,,,,,,,0,268,268,268,down,1,0.566366116364,2017_Mai_12_1643,99.024430053,Stroop,A-2,2STRNS-1,
neutral,right,"[-0.8745098039, -0.2078431373, 0.637254902]", ,14,SOLL,,,,,,,,,0,269,269,269,right,1,0.630028676829,2017_Mai_12_1643,99.024430053,Stroop,A-2,2STRNS-1,
neutralofneutral,left,"[0.568627451, -0.7882352941, -0.7882352941]", ,18,MODE,,,,,,,,,0,270,270,270,left,1,0.650675435006,2017_Mai_12_1643,99.024430053,Stroop,A-2,2STRNS-1,
neutral,down,"[-0.7725490196, 0.0745098039, -1]", ,10,PECH,,,,,,,,,0,271,271,271,down,1,0.632205489804,2017_Mai_12_1643,99.024430053,Stroop,A-2,2STRNS-1,
neutralofneutral,down,"[-0.7725490196, 0.0745098039, -1]", ,19,MODE,,,,,,,,,0,272,272,272,down,1,0.427766098764,2017_Mai_12_1643,99.024430053,Stroop,A-2,2STRNS-1,
neutral,left,"[0.568627451, -0.7882352941, -0.7882352941]", ,12,SOLL,,,,,,,,,0,273,273,273,left,1,0.660829798201,2017_Mai_12_1643,99.024430053,Stroop,A-2,2STRNS-1,
neutralofneutral,right,"[-0.8745098039, -0.2078431373, 0.637254902]", ,20,MODE,,,,,,,,,0,274,274,274,right,1,0.757226965997,2017_Mai_12_1643,99.024430053,Stroop,A-2,2STRNS-1,
neutralofneutral,left,"[0.568627451, -0.7882352941, -0.7882352941]", ,15,HALS,,,,,,,,,0,275,275,275,left,1,0.681891413574,2017_Mai_12_1643,99.024430053,Stroop,A-2,2STRNS-1,
neutralofneutral,right,"[-0.8745098039, -0.2078431373, 0.637254902]", ,17,HALS,,,,,,,,,0,276,276,276,right,1,0.938642201732,2017_Mai_12_1643,99.024430053,Stroop,A-2,2STRNS-1,
neutralofneutral,down,"[-0.7725490196, 0.0745098039, -1]", ,16,HALS,,,,,,,,,0,277,277,277,down,1,0.597058285341,2017_Mai_12_1643,99.024430053,Stroop,A-2,2STRNS-1,
neutral,left,"[0.568627451, -0.7882352941, -0.7882352941]", ,9,PECH,,,,,,,,,0,278,278,278,left,1,0.55704090883,2017_Mai_12_1643,99.024430053,Stroop,A-2,2STRNS-1,
neutral,down,"[-0.7725490196, 0.0745098039, -1]", ,13,SOLL,,,,,,,,,0,279,279,279,down,1,0.544873719984,2017_Mai_12_1643,99.024430053,Stroop,A-2,2STRNS-1,
neutral,right,"[-0.8745098039, -0.2078431373, 0.637254902]", ,14,SOLL,,,,,,,,,0,280,280,280,right,1,0.632150454876,2017_Mai_12_1643,99.024430053,Stroop,A-2,2STRNS-1,
neutral,right,"[-0.8745098039, -0.2078431373, 0.637254902]", ,11,PECH,,,,,,,,,0,281,281,281,right,1,0.449816946008,2017_Mai_12_1643,99.024430053,Stroop,A-2,2STRNS-1,
incongruent,left,"[0.568627451, -0.7882352941, -0.7882352941]", ,3,GRÜN,,,,,,,,,0,282,282,282,left,1,0.895673332784,2017_Mai_12_1643,99.024430053,Stroop,A-2,2STRNS-1,
neutral,left,"[0.568627451, -0.7882352941, -0.7882352941]", ,12,SOLL,,,,,,,,,0,283,283,283,left,1,0.458445975676,2017_Mai_12_1643,99.024430053,Stroop,A-2,2STRNS-1,
incongruent,down,"[-0.7725490196, 0.0745098039, -1]", ,1,ROT,,,,,,,,,0,284,284,284,down,1,0.753529568702,2017_Mai_12_1643,99.024430053,Stroop,A-2,2STRNS-1,
incongruent,right,"[-0.8745098039, -0.2078431373, 0.637254902]", ,5,GRÜN,,,,,,,,,0,285,285,285,right,1,0.879383552937,2017_Mai_12_1643,99.024430053,Stroop,A-2,2STRNS-1,
incongruent,left,"[0.568627451, -0.7882352941, -0.7882352941]", ,6,BLAU,,,,,,,,,0,286,286,286,left,1,0.926868079602,2017_Mai_12_1643,99.024430053,Stroop,A-2,2STRNS-1,
neutral,right,"[-0.8745098039, -0.2078431373, 0.637254902]", ,14,SOLL,,,,,,,,,0,287,287,287,down,0,0.63170989609,2017_Mai_12_1643,99.024430053,Stroop,A-2,2STRNS-1,
neutral,down,"[-0.7725490196, 0.0745098039, -1]", ,13,SOLL,,,,,,,,,0,288,288,288,down,1,0.696762577367,2017_Mai_12_1643,99.024430053,Stroop,A-2,2STRNS-1,
neutral,left,"[0.568627451, -0.7882352941, -0.7882352941]", ,9,PECH,,,,,,,,,0,289,289,289,left,1,1.06347873822,2017_Mai_12_1643,99.024430053,Stroop,A-2,2STRNS-1,
incongruent,right,"[-0.8745098039, -0.2078431373, 0.637254902]", ,2,ROT,,,,,,,,,0,290,290,290,right,1,0.937890709573,2017_Mai_12_1643,99.024430053,Stroop,A-2,2STRNS-1,
neutral,right,"[-0.8745098039, -0.2078431373, 0.637254902]", ,11,PECH,,,,,,,,,0,291,291,291,right,1,0.677471578092,2017_Mai_12_1643,99.024430053,Stroop,A-2,2STRNS-1,
incongruent,down,"[-0.7725490196, 0.0745098039, -1]", ,7,BLAU,,,,,,,,,0,292,292,292,down,1,1.02186870119,2017_Mai_12_1643,99.024430053,Stroop,A-2,2STRNS-1,
neutral,down,"[-0.7725490196, 0.0745098039, -1]", ,10,PECH,,,,,,,,,0,293,293,293,down,1,0.62419329831,2017_Mai_12_1643,99.024430053,Stroop,A-2,2STRNS-1,
fix,return,white, ,21,+,,,,,,,,,0,294,294,294,None,0,,2017_Mai_12_1643,99.024430053,Stroop,A-2,2STRNS-1,
fix,return,white, ,21,+,,,,,,,,,0,295,295,295,None,0,,2017_Mai_12_1643,99.024430053,Stroop,A-2,2STRNS-1,
fix,return,white, ,21,+,,,,,,,,,0,296,296,296,None,0,,2017_Mai_12_1643,99.024430053,Stroop,A-2,2STRNS-1,
fix,return,white, ,21,+,,,,,,,,,0,297,297,297,None,0,,2017_Mai_12_1643,99.024430053,Stroop,A-2,2STRNS-1,
fix,return,white, ,21,+,,,,,,,,,0,298,298,298,None,0,,2017_Mai_12_1643,99.024430053,Stroop,A-2,2STRNS-1,
fix,return,white, ,21,+,,,,,,,,,0,299,299,299,None,0,,2017_Mai_12_1643,99.024430053,Stroop,A-2,2STRNS-1,
fix,return,white, ,21,+,,,,,,,,,0,300,300,300,None,0,,2017_Mai_12_1643,99.024430053,Stroop,A-2,2STRNS-1,
fix,return,white, ,21,+,,,,,,,,,0,301,301,301,None,0,,2017_Mai_12_1643,99.024430053,Stroop,A-2,2STRNS-1,
fix,return,white, ,21,+,,,,,,,,,0,302,302,302,None,0,,2017_Mai_12_1643,99.024430053,Stroop,A-2,2STRNS-1,
fix,return,white, ,21,+,,,,,,,,,0,303,303,303,None,0,,2017_Mai_12_1643,99.024430053,Stroop,A-2,2STRNS-1,
fix,return,white, ,21,+,,,,,,,,,0,304,304,304,None,0,,2017_Mai_12_1643,99.024430053,Stroop,A-2,2STRNS-1,
fix,return,white, ,21,+,,,,,,,,,0,305,305,305,None,0,,2017_Mai_12_1643,99.024430053,Stroop,A-2,2STRNS-1,
fix,return,white,+,22,+,,,,,,,,,0,306,306,306,None,0,,2017_Mai_12_1643,99.024430053,Stroop,A-2,2STRNS-1,
