b_1 = 135.844970861
mu_c = 0.583938761989
A = 19.7598212647
shape = 3.15194476671
tau = 158.255111131
Ter = 316.278325444
s_r = 89.6551502871
Gsquare = 7.19787524305
ID = "Tarana_propersims_48"
best_statisic = 7.19787524305