best_paramset_1 = [40.187590029399999, 0.59574792234499996, 67.823834090099993, 3.5301982913100001, 197.95915339499999, 324.87630449199997, 120.023112813]
best_paramset_statistic_1 = 8.72150576979
best_paramset_2 = [39.437003106200002, 0.60895769798800004, 52.004873142599997, 3.98812048432, 121.666362283, 325.79046863100001, 125.92877050200001]
best_paramset_statistic_2 = 9.11173580109
ID = "Tarana_propersims_5"