congruent,corrAns,letterColor,signal,selectedrownumber_novariable,Anzeigetext,practice.thisRepN,practice.thisTrialN,practice.thisN,practice.thisIndex,Wrongresponse.thisRepN,Wrongresponse.thisTrialN,Wrongresponse.thisN,Wrongresponse.thisIndex,trials.thisRepN,trials.thisTrialN,trials.thisN,trials.thisIndex,resp.keys,resp.corr,resp.rt,date,frameRate,expName,session,participant,
incongruent,down,"[-0.7725490196, 0.0745098039, -1]", ,1,ROT,0,0,0,0,0,0,0,0,,,,,None,0,,2017_Mai_29_1807,98.5343221051,Stroop,B-1,1STACS-8,
,,,,,,0,0,0,0,,,,,,,,,,,,2017_Mai_29_1807,98.5343221051,Stroop,B-1,1STACS-8,
incongruent,down,"[-0.7725490196, 0.0745098039, -1]", ,1,ROT,1,0,1,0,0,0,0,0,,,,,right,0,0.8784901433,2017_Mai_29_1807,98.5343221051,Stroop,B-1,1STACS-8,
,,,,,,1,0,1,0,,,,,,,,,,,,2017_Mai_29_1807,98.5343221051,Stroop,B-1,1STACS-8,
incongruent,down,"[-0.7725490196, 0.0745098039, -1]", ,1,ROT,2,0,2,0,0,0,0,0,,,,,down,1,0.589232151013,2017_Mai_29_1807,98.5343221051,Stroop,B-1,1STACS-8,
,,,,,,2,0,2,0,,,,,,,,,,,,2017_Mai_29_1807,98.5343221051,Stroop,B-1,1STACS-8,
neutral,down,"[-0.7725490196, 0.0745098039, -1]", ,13,SOLL,3,0,3,0,0,0,0,0,,,,,down,1,0.72851577505,2017_Mai_29_1807,98.5343221051,Stroop,B-1,1STACS-8,
,,,,,,3,0,3,0,,,,,,,,,,,,2017_Mai_29_1807,98.5343221051,Stroop,B-1,1STACS-8,
incongruent,right,"[-0.8745098039, -0.2078431373, 0.637254902]", ,2,ROT,4,0,4,0,0,0,0,0,,,,,right,1,1.18524952194,2017_Mai_29_1807,98.5343221051,Stroop,B-1,1STACS-8,
,,,,,,4,0,4,0,,,,,,,,,,,,2017_Mai_29_1807,98.5343221051,Stroop,B-1,1STACS-8,
incongruent,left,"[0.568627451, -0.7882352941, -0.7882352941]", ,6,BLAU,5,0,5,0,0,0,0,0,,,,,left,1,1.22700818121,2017_Mai_29_1807,98.5343221051,Stroop,B-1,1STACS-8,
,,,,,,5,0,5,0,,,,,,,,,,,,2017_Mai_29_1807,98.5343221051,Stroop,B-1,1STACS-8,
neutralofneutral,down,"[-0.7725490196, 0.0745098039, -1]", ,19,MODE,6,0,6,0,0,0,0,0,,,,,down,1,0.835139661605,2017_Mai_29_1807,98.5343221051,Stroop,B-1,1STACS-8,
,,,,,,6,0,6,0,,,,,,,,,,,,2017_Mai_29_1807,98.5343221051,Stroop,B-1,1STACS-8,
neutralofneutral,down,"[-0.7725490196, 0.0745098039, -1]", ,19,MODE,7,0,7,0,0,0,0,0,,,,,down,1,0.740717605171,2017_Mai_29_1807,98.5343221051,Stroop,B-1,1STACS-8,
,,,,,,7,0,7,0,,,,,,,,,,,,2017_Mai_29_1807,98.5343221051,Stroop,B-1,1STACS-8,
neutralofneutral,left,"[0.568627451, -0.7882352941, -0.7882352941]", ,15,HALS,8,0,8,0,0,0,0,0,,,,,left,1,0.495385027985,2017_Mai_29_1807,98.5343221051,Stroop,B-1,1STACS-8,
,,,,,,8,0,8,0,,,,,,,,,,,,2017_Mai_29_1807,98.5343221051,Stroop,B-1,1STACS-8,
neutral,down,"[-0.7725490196, 0.0745098039, -1]", ,10,PECH,9,0,9,0,0,0,0,0,,,,,down,1,0.824540269783,2017_Mai_29_1807,98.5343221051,Stroop,B-1,1STACS-8,
,,,,,,9,0,9,0,,,,,,,,,,,,2017_Mai_29_1807,98.5343221051,Stroop,B-1,1STACS-8,
neutral,down,"[-0.7725490196, 0.0745098039, -1]", ,10,PECH,10,0,10,0,0,0,0,0,,,,,down,1,0.578227121045,2017_Mai_29_1807,98.5343221051,Stroop,B-1,1STACS-8,
,,,,,,10,0,10,0,,,,,,,,,,,,2017_Mai_29_1807,98.5343221051,Stroop,B-1,1STACS-8,
incongruent,down,"[-0.7725490196, 0.0745098039, -1]", ,7,BLAU,11,0,11,0,0,0,0,0,,,,,down,1,0.527387139986,2017_Mai_29_1807,98.5343221051,Stroop,B-1,1STACS-8,
,,,,,,11,0,11,0,,,,,,,,,,,,2017_Mai_29_1807,98.5343221051,Stroop,B-1,1STACS-8,
neutralofneutral,down,"[-0.7725490196, 0.0745098039, -1]", ,19,MODE,12,0,12,0,0,0,0,0,,,,,down,1,0.516891951351,2017_Mai_29_1807,98.5343221051,Stroop,B-1,1STACS-8,
,,,,,,12,0,12,0,,,,,,,,,,,,2017_Mai_29_1807,98.5343221051,Stroop,B-1,1STACS-8,
incongruent,down,"[-0.7725490196, 0.0745098039, -1]", ,1,ROT,13,0,13,0,0,0,0,0,,,,,down,1,0.452070863755,2017_Mai_29_1807,98.5343221051,Stroop,B-1,1STACS-8,
,,,,,,13,0,13,0,,,,,,,,,,,,2017_Mai_29_1807,98.5343221051,Stroop,B-1,1STACS-8,
neutral,right,"[-0.8745098039, -0.2078431373, 0.637254902]", ,14,SOLL,14,0,14,0,0,0,0,0,,,,,right,1,1.30708428026,2017_Mai_29_1807,98.5343221051,Stroop,B-1,1STACS-8,
,,,,,,14,0,14,0,,,,,,,,,,,,2017_Mai_29_1807,98.5343221051,Stroop,B-1,1STACS-8,
incongruent,down,"[-0.7725490196, 0.0745098039, -1]", ,1,ROT,15,0,15,0,0,0,0,0,,,,,down,1,1.0967919107,2017_Mai_29_1807,98.5343221051,Stroop,B-1,1STACS-8,
,,,,,,15,0,15,0,,,,,,,,,,,,2017_Mai_29_1807,98.5343221051,Stroop,B-1,1STACS-8,
incongruent,right,"[-0.8745098039, -0.2078431373, 0.637254902]", ,2,ROT,16,0,16,0,0,0,0,0,,,,,right,1,1.11202596978,2017_Mai_29_1807,98.5343221051,Stroop,B-1,1STACS-8,
,,,,,,16,0,16,0,,,,,,,,,,,,2017_Mai_29_1807,98.5343221051,Stroop,B-1,1STACS-8,
incongruent,left,"[0.568627451, -0.7882352941, -0.7882352941]", ,6,BLAU,17,0,17,0,0,0,0,0,,,,,left,1,0.635153909226,2017_Mai_29_1807,98.5343221051,Stroop,B-1,1STACS-8,
,,,,,,17,0,17,0,,,,,,,,,,,,2017_Mai_29_1807,98.5343221051,Stroop,B-1,1STACS-8,
neutralofneutral,left,"[0.568627451, -0.7882352941, -0.7882352941]", ,18,MODE,18,0,18,0,0,0,0,0,,,,,left,1,0.624830250772,2017_Mai_29_1807,98.5343221051,Stroop,B-1,1STACS-8,
,,,,,,18,0,18,0,,,,,,,,,,,,2017_Mai_29_1807,98.5343221051,Stroop,B-1,1STACS-8,
incongruent,left,"[0.568627451, -0.7882352941, -0.7882352941]", ,6,BLAU,19,0,19,0,0,0,0,0,,,,,left,1,0.452463930472,2017_Mai_29_1807,98.5343221051,Stroop,B-1,1STACS-8,
,,,,,,19,0,19,0,,,,,,,,,,,,2017_Mai_29_1807,98.5343221051,Stroop,B-1,1STACS-8,
neutralofneutral,right,"[-0.8745098039, -0.2078431373, 0.637254902]", ,20,MODE,20,0,20,0,0,0,0,0,,,,,right,1,0.892776316543,2017_Mai_29_1807,98.5343221051,Stroop,B-1,1STACS-8,
,,,,,,20,0,20,0,,,,,,,,,,,,2017_Mai_29_1807,98.5343221051,Stroop,B-1,1STACS-8,
neutral,left,"[0.568627451, -0.7882352941, -0.7882352941]", ,9,PECH,21,0,21,0,0,0,0,0,,,,,left,1,0.749761771398,2017_Mai_29_1807,98.5343221051,Stroop,B-1,1STACS-8,
,,,,,,21,0,21,0,,,,,,,,,,,,2017_Mai_29_1807,98.5343221051,Stroop,B-1,1STACS-8,
neutral,right,"[-0.8745098039, -0.2078431373, 0.637254902]", ,11,PECH,22,0,22,0,0,0,0,0,,,,,right,1,1.11144209669,2017_Mai_29_1807,98.5343221051,Stroop,B-1,1STACS-8,
,,,,,,22,0,22,0,,,,,,,,,,,,2017_Mai_29_1807,98.5343221051,Stroop,B-1,1STACS-8,
neutralofneutral,left,"[0.568627451, -0.7882352941, -0.7882352941]", ,18,MODE,23,0,23,0,0,0,0,0,,,,,left,1,0.668162573735,2017_Mai_29_1807,98.5343221051,Stroop,B-1,1STACS-8,
,,,,,,23,0,23,0,,,,,,,,,,,,2017_Mai_29_1807,98.5343221051,Stroop,B-1,1STACS-8,
neutralofneutral,down,"[-0.7725490196, 0.0745098039, -1]", ,19,MODE,24,0,24,0,0,0,0,0,,,,,down,1,0.665760033747,2017_Mai_29_1807,98.5343221051,Stroop,B-1,1STACS-8,
,,,,,,24,0,24,0,,,,,,,,,,,,2017_Mai_29_1807,98.5343221051,Stroop,B-1,1STACS-8,
neutral,right,"[-0.8745098039, -0.2078431373, 0.637254902]", ,11,PECH,25,0,25,0,0,0,0,0,,,,,left,0,0.873877545889,2017_Mai_29_1807,98.5343221051,Stroop,B-1,1STACS-8,
,,,,,,25,0,25,0,,,,,,,,,,,,2017_Mai_29_1807,98.5343221051,Stroop,B-1,1STACS-8,
neutral,right,"[-0.8745098039, -0.2078431373, 0.637254902]", ,11,PECH,26,0,26,0,0,0,0,0,,,,,right,1,0.672656161607,2017_Mai_29_1807,98.5343221051,Stroop,B-1,1STACS-8,
,,,,,,26,0,26,0,,,,,,,,,,,,2017_Mai_29_1807,98.5343221051,Stroop,B-1,1STACS-8,
neutral,left,"[0.568627451, -0.7882352941, -0.7882352941]", ,9,PECH,27,0,27,0,0,0,0,0,,,,,left,1,1.25353306077,2017_Mai_29_1807,98.5343221051,Stroop,B-1,1STACS-8,
,,,,,,27,0,27,0,,,,,,,,,,,,2017_Mai_29_1807,98.5343221051,Stroop,B-1,1STACS-8,
neutral,down,"[-0.7725490196, 0.0745098039, -1]", ,10,PECH,28,0,28,0,0,0,0,0,,,,,down,1,0.842177148213,2017_Mai_29_1807,98.5343221051,Stroop,B-1,1STACS-8,
,,,,,,28,0,28,0,,,,,,,,,,,,2017_Mai_29_1807,98.5343221051,Stroop,B-1,1STACS-8,
neutral,right,"[-0.8745098039, -0.2078431373, 0.637254902]", ,14,SOLL,29,0,29,0,0,0,0,0,,,,,right,1,0.677754016223,2017_Mai_29_1807,98.5343221051,Stroop,B-1,1STACS-8,
,,,,,,29,0,29,0,,,,,,,,,,,,2017_Mai_29_1807,98.5343221051,Stroop,B-1,1STACS-8,
incongruent,right,"[-0.8745098039, -0.2078431373, 0.637254902]", ,5,GRÜN,30,0,30,0,0,0,0,0,,,,,right,1,0.570561062928,2017_Mai_29_1807,98.5343221051,Stroop,B-1,1STACS-8,
,,,,,,30,0,30,0,,,,,,,,,,,,2017_Mai_29_1807,98.5343221051,Stroop,B-1,1STACS-8,
neutral,left,"[0.568627451, -0.7882352941, -0.7882352941]", ,9,PECH,31,0,31,0,0,0,0,0,,,,,left,1,0.664658217734,2017_Mai_29_1807,98.5343221051,Stroop,B-1,1STACS-8,
,,,,,,31,0,31,0,,,,,,,,,,,,2017_Mai_29_1807,98.5343221051,Stroop,B-1,1STACS-8,
incongruent,left,"[0.568627451, -0.7882352941, -0.7882352941]", ,6,BLAU,32,0,32,0,0,0,0,0,,,,,left,1,0.563067093723,2017_Mai_29_1807,98.5343221051,Stroop,B-1,1STACS-8,
,,,,,,32,0,32,0,,,,,,,,,,,,2017_Mai_29_1807,98.5343221051,Stroop,B-1,1STACS-8,
neutralofneutral,right,"[-0.8745098039, -0.2078431373, 0.637254902]", ,20,MODE,33,0,33,0,0,0,0,0,,,,,down,0,0.753696629041,2017_Mai_29_1807,98.5343221051,Stroop,B-1,1STACS-8,
,,,,,,33,0,33,0,,,,,,,,,,,,2017_Mai_29_1807,98.5343221051,Stroop,B-1,1STACS-8,
neutralofneutral,right,"[-0.8745098039, -0.2078431373, 0.637254902]", ,20,MODE,34,0,34,0,0,0,0,0,,,,,right,1,0.936173731578,2017_Mai_29_1807,98.5343221051,Stroop,B-1,1STACS-8,
,,,,,,34,0,34,0,,,,,,,,,,,,2017_Mai_29_1807,98.5343221051,Stroop,B-1,1STACS-8,
neutralofneutral,down,"[-0.7725490196, 0.0745098039, -1]", ,16,HALS,35,0,35,0,0,0,0,0,,,,,left,0,0.709951963168,2017_Mai_29_1807,98.5343221051,Stroop,B-1,1STACS-8,
,,,,,,35,0,35,0,,,,,,,,,,,,2017_Mai_29_1807,98.5343221051,Stroop,B-1,1STACS-8,
neutralofneutral,down,"[-0.7725490196, 0.0745098039, -1]", ,16,HALS,36,0,36,0,0,0,0,0,,,,,down,1,0.482496518412,2017_Mai_29_1807,98.5343221051,Stroop,B-1,1STACS-8,
,,,,,,36,0,36,0,,,,,,,,,,,,2017_Mai_29_1807,98.5343221051,Stroop,B-1,1STACS-8,
neutralofneutral,down,"[-0.7725490196, 0.0745098039, -1]", ,19,MODE,37,0,37,0,0,0,0,0,,,,,down,1,0.589480785966,2017_Mai_29_1807,98.5343221051,Stroop,B-1,1STACS-8,
,,,,,,37,0,37,0,,,,,,,,,,,,2017_Mai_29_1807,98.5343221051,Stroop,B-1,1STACS-8,
incongruent,left,"[0.568627451, -0.7882352941, -0.7882352941]", ,6,BLAU,38,0,38,0,0,0,0,0,,,,,left,1,1.37086864392,2017_Mai_29_1807,98.5343221051,Stroop,B-1,1STACS-8,
,,,,,,38,0,38,0,,,,,,,,,,,,2017_Mai_29_1807,98.5343221051,Stroop,B-1,1STACS-8,
neutralofneutral,right,"[-0.8745098039, -0.2078431373, 0.637254902]", ,20,MODE,39,0,39,0,0,0,0,0,,,,,right,1,0.667485951427,2017_Mai_29_1807,98.5343221051,Stroop,B-1,1STACS-8,
,,,,,,39,0,39,0,,,,,,,,,,,,2017_Mai_29_1807,98.5343221051,Stroop,B-1,1STACS-8,
incongruent,down,"[-0.7725490196, 0.0745098039, -1]", ,7,BLAU,40,0,40,0,0,0,0,0,,,,,down,1,0.710068458421,2017_Mai_29_1807,98.5343221051,Stroop,B-1,1STACS-8,
,,,,,,40,0,40,0,,,,,,,,,,,,2017_Mai_29_1807,98.5343221051,Stroop,B-1,1STACS-8,
congruent,down,"[-0.7725490196, 0.0745098039, -1]", ,4,GRÜN,41,0,41,0,0,0,0,0,,,,,down,1,0.484158740845,2017_Mai_29_1807,98.5343221051,Stroop,B-1,1STACS-8,
,,,,,,41,0,41,0,,,,,,,,,,,,2017_Mai_29_1807,98.5343221051,Stroop,B-1,1STACS-8,
neutral,left,"[0.568627451, -0.7882352941, -0.7882352941]", ,9,PECH,42,0,42,0,0,0,0,0,,,,,left,1,0.963675550943,2017_Mai_29_1807,98.5343221051,Stroop,B-1,1STACS-8,
,,,,,,42,0,42,0,,,,,,,,,,,,2017_Mai_29_1807,98.5343221051,Stroop,B-1,1STACS-8,
neutralofneutral,down,"[-0.7725490196, 0.0745098039, -1]", ,16,HALS,43,0,43,0,0,0,0,0,,,,,down,1,1.37118181221,2017_Mai_29_1807,98.5343221051,Stroop,B-1,1STACS-8,
,,,,,,43,0,43,0,,,,,,,,,,,,2017_Mai_29_1807,98.5343221051,Stroop,B-1,1STACS-8,
neutralofneutral,right,"[-0.8745098039, -0.2078431373, 0.637254902]", ,20,MODE,44,0,44,0,0,0,0,0,,,,,right,1,0.624698669803,2017_Mai_29_1807,98.5343221051,Stroop,B-1,1STACS-8,
,,,,,,44,0,44,0,,,,,,,,,,,,2017_Mai_29_1807,98.5343221051,Stroop,B-1,1STACS-8,
congruent,left,"[0.568627451, -0.7882352941, -0.7882352941]", ,0,ROT,45,0,45,0,0,0,0,0,,,,,left,1,0.599398526908,2017_Mai_29_1807,98.5343221051,Stroop,B-1,1STACS-8,
,,,,,,45,0,45,0,,,,,,,,,,,,2017_Mai_29_1807,98.5343221051,Stroop,B-1,1STACS-8,
incongruent,right,"[-0.8745098039, -0.2078431373, 0.637254902]", ,2,ROT,46,0,46,0,0,0,0,0,,,,,left,0,0.610348242584,2017_Mai_29_1807,98.5343221051,Stroop,B-1,1STACS-8,
,,,,,,46,0,46,0,,,,,,,,,,,,2017_Mai_29_1807,98.5343221051,Stroop,B-1,1STACS-8,
incongruent,right,"[-0.8745098039, -0.2078431373, 0.637254902]", ,2,ROT,47,0,47,0,0,0,0,0,,,,,right,1,0.610396572749,2017_Mai_29_1807,98.5343221051,Stroop,B-1,1STACS-8,
,,,,,,47,0,47,0,,,,,,,,,,,,2017_Mai_29_1807,98.5343221051,Stroop,B-1,1STACS-8,
neutralofneutral,down,"[-0.7725490196, 0.0745098039, -1]", ,16,HALS,48,0,48,0,0,0,0,0,,,,,down,1,0.657934737516,2017_Mai_29_1807,98.5343221051,Stroop,B-1,1STACS-8,
,,,,,,48,0,48,0,,,,,,,,,,,,2017_Mai_29_1807,98.5343221051,Stroop,B-1,1STACS-8,
incongruent,left,"[0.568627451, -0.7882352941, -0.7882352941]", ,6,BLAU,49,0,49,0,0,0,0,0,,,,,left,1,0.70949324565,2017_Mai_29_1807,98.5343221051,Stroop,B-1,1STACS-8,
,,,,,,49,0,49,0,,,,,,,,,,,,2017_Mai_29_1807,98.5343221051,Stroop,B-1,1STACS-8,
neutral,left,"[0.568627451, -0.7882352941, -0.7882352941]", ,12,SOLL,50,0,50,0,0,0,0,0,,,,,left,1,0.623249044222,2017_Mai_29_1807,98.5343221051,Stroop,B-1,1STACS-8,
,,,,,,50,0,50,0,,,,,,,,,,,,2017_Mai_29_1807,98.5343221051,Stroop,B-1,1STACS-8,
congruent,right,"[-0.8745098039, -0.2078431373, 0.637254902]", ,8,BLAU,51,0,51,0,0,0,0,0,,,,,right,1,0.912705665105,2017_Mai_29_1807,98.5343221051,Stroop,B-1,1STACS-8,
,,,,,,51,0,51,0,,,,,,,,,,,,2017_Mai_29_1807,98.5343221051,Stroop,B-1,1STACS-8,
incongruent,right,"[-0.8745098039, -0.2078431373, 0.637254902]", ,5,GRÜN,52,0,52,0,0,0,0,0,,,,,right,1,0.590544049593,2017_Mai_29_1807,98.5343221051,Stroop,B-1,1STACS-8,
,,,,,,52,0,52,0,,,,,,,,,,,,2017_Mai_29_1807,98.5343221051,Stroop,B-1,1STACS-8,
neutral,down,"[-0.7725490196, 0.0745098039, -1]", ,10,PECH,53,0,53,0,0,0,0,0,,,,,down,1,0.417178160912,2017_Mai_29_1807,98.5343221051,Stroop,B-1,1STACS-8,
,,,,,,53,0,53,0,,,,,,,,,,,,2017_Mai_29_1807,98.5343221051,Stroop,B-1,1STACS-8,
congruent,right,"[-0.8745098039, -0.2078431373, 0.637254902]", ,8,BLAU,54,0,54,0,0,0,0,0,,,,,right,1,0.786377877635,2017_Mai_29_1807,98.5343221051,Stroop,B-1,1STACS-8,
,,,,,,54,0,54,0,,,,,,,,,,,,2017_Mai_29_1807,98.5343221051,Stroop,B-1,1STACS-8,
neutral,down,"[-0.7725490196, 0.0745098039, -1]", ,13,SOLL,55,0,55,0,0,0,0,0,,,,,right,0,0.762162509481,2017_Mai_29_1807,98.5343221051,Stroop,B-1,1STACS-8,
,,,,,,55,0,55,0,,,,,,,,,,,,2017_Mai_29_1807,98.5343221051,Stroop,B-1,1STACS-8,
neutral,down,"[-0.7725490196, 0.0745098039, -1]", ,13,SOLL,56,0,56,0,0,0,0,0,,,,,right,0,0.621782656734,2017_Mai_29_1807,98.5343221051,Stroop,B-1,1STACS-8,
,,,,,,56,0,56,0,,,,,,,,,,,,2017_Mai_29_1807,98.5343221051,Stroop,B-1,1STACS-8,
neutral,down,"[-0.7725490196, 0.0745098039, -1]", ,13,SOLL,57,0,57,0,0,0,0,0,,,,,down,1,0.10915242021,2017_Mai_29_1807,98.5343221051,Stroop,B-1,1STACS-8,
,,,,,,57,0,57,0,,,,,,,,,,,,2017_Mai_29_1807,98.5343221051,Stroop,B-1,1STACS-8,
incongruent,left,"[0.568627451, -0.7882352941, -0.7882352941]", ,6,BLAU,58,0,58,0,0,0,0,0,,,,,left,1,0.73147285479,2017_Mai_29_1807,98.5343221051,Stroop,B-1,1STACS-8,
,,,,,,58,0,58,0,,,,,,,,,,,,2017_Mai_29_1807,98.5343221051,Stroop,B-1,1STACS-8,
neutralofneutral,down,"[-0.7725490196, 0.0745098039, -1]", ,16,HALS,59,0,59,0,0,0,0,0,,,,,right,0,0.775197685739,2017_Mai_29_1807,98.5343221051,Stroop,B-1,1STACS-8,
,,,,,,59,0,59,0,,,,,,,,,,,,2017_Mai_29_1807,98.5343221051,Stroop,B-1,1STACS-8,
neutralofneutral,down,"[-0.7725490196, 0.0745098039, -1]", ,16,HALS,60,0,60,0,0,0,0,0,,,,,down,1,0.249541492005,2017_Mai_29_1807,98.5343221051,Stroop,B-1,1STACS-8,
,,,,,,60,0,60,0,,,,,,,,,,,,2017_Mai_29_1807,98.5343221051,Stroop,B-1,1STACS-8,
neutral,left,"[0.568627451, -0.7882352941, -0.7882352941]", ,12,SOLL,61,0,61,0,0,0,0,0,,,,,left,1,0.950078012708,2017_Mai_29_1807,98.5343221051,Stroop,B-1,1STACS-8,
,,,,,,61,0,61,0,,,,,,,,,,,,2017_Mai_29_1807,98.5343221051,Stroop,B-1,1STACS-8,
neutralofneutral,right,"[-0.8745098039, -0.2078431373, 0.637254902]", ,17,HALS,62,0,62,0,0,0,0,0,,,,,right,1,1.35056187309,2017_Mai_29_1807,98.5343221051,Stroop,B-1,1STACS-8,
,,,,,,62,0,62,0,,,,,,,,,,,,2017_Mai_29_1807,98.5343221051,Stroop,B-1,1STACS-8,
neutralofneutral,right,"[-0.8745098039, -0.2078431373, 0.637254902]", ,20,MODE,63,0,63,0,0,0,0,0,,,,,right,1,0.960785798195,2017_Mai_29_1807,98.5343221051,Stroop,B-1,1STACS-8,
,,,,,,63,0,63,0,,,,,,,,,,,,2017_Mai_29_1807,98.5343221051,Stroop,B-1,1STACS-8,
neutralofneutral,down,"[-0.7725490196, 0.0745098039, -1]", ,16,HALS,64,0,64,0,0,0,0,0,,,,,left,0,0.798011199747,2017_Mai_29_1807,98.5343221051,Stroop,B-1,1STACS-8,
,,,,,,64,0,64,0,,,,,,,,,,,,2017_Mai_29_1807,98.5343221051,Stroop,B-1,1STACS-8,
neutralofneutral,down,"[-0.7725490196, 0.0745098039, -1]", ,16,HALS,65,0,65,0,0,0,0,0,,,,,down,1,0.118306097563,2017_Mai_29_1807,98.5343221051,Stroop,B-1,1STACS-8,
,,,,,,65,0,65,0,,,,,,,,,,,,2017_Mai_29_1807,98.5343221051,Stroop,B-1,1STACS-8,
neutralofneutral,down,"[-0.7725490196, 0.0745098039, -1]", ,19,MODE,66,0,66,0,0,0,0,0,,,,,down,1,0.461388249065,2017_Mai_29_1807,98.5343221051,Stroop,B-1,1STACS-8,
,,,,,,66,0,66,0,,,,,,,,,,,,2017_Mai_29_1807,98.5343221051,Stroop,B-1,1STACS-8,
neutral,right,"[-0.8745098039, -0.2078431373, 0.637254902]", ,14,SOLL,67,0,67,0,0,0,0,0,,,,,right,1,1.34637530748,2017_Mai_29_1807,98.5343221051,Stroop,B-1,1STACS-8,
,,,,,,67,0,67,0,,,,,,,,,,,,2017_Mai_29_1807,98.5343221051,Stroop,B-1,1STACS-8,
incongruent,right,"[-0.8745098039, -0.2078431373, 0.637254902]", ,2,ROT,68,0,68,0,0,0,0,0,,,,,right,1,0.824268168161,2017_Mai_29_1807,98.5343221051,Stroop,B-1,1STACS-8,
,,,,,,68,0,68,0,,,,,,,,,,,,2017_Mai_29_1807,98.5343221051,Stroop,B-1,1STACS-8,
neutral,right,"[-0.8745098039, -0.2078431373, 0.637254902]", ,14,SOLL,69,0,69,0,0,0,0,0,,,,,right,1,0.633722442377,2017_Mai_29_1807,98.5343221051,Stroop,B-1,1STACS-8,
,,,,,,69,0,69,0,,,,,,,,,,,,2017_Mai_29_1807,98.5343221051,Stroop,B-1,1STACS-8,
congruent,left,"[0.568627451, -0.7882352941, -0.7882352941]", ,0,ROT,70,0,70,0,0,0,0,0,,,,,left,1,0.583965839234,2017_Mai_29_1807,98.5343221051,Stroop,B-1,1STACS-8,
,,,,,,70,0,70,0,,,,,,,,,,,,2017_Mai_29_1807,98.5343221051,Stroop,B-1,1STACS-8,
incongruent,right,"[-0.8745098039, -0.2078431373, 0.637254902]", ,5,GRÜN,71,0,71,0,0,0,0,0,,,,,right,1,1.35056215245,2017_Mai_29_1807,98.5343221051,Stroop,B-1,1STACS-8,
,,,,,,71,0,71,0,,,,,,,,,,,,2017_Mai_29_1807,98.5343221051,Stroop,B-1,1STACS-8,
neutral,right,"[-0.8745098039, -0.2078431373, 0.637254902]", ,11,PECH,72,0,72,0,0,0,0,0,,,,,right,1,0.504041994164,2017_Mai_29_1807,98.5343221051,Stroop,B-1,1STACS-8,
,,,,,,72,0,72,0,,,,,,,,,,,,2017_Mai_29_1807,98.5343221051,Stroop,B-1,1STACS-8,
neutral,left,"[0.568627451, -0.7882352941, -0.7882352941]", ,12,SOLL,73,0,73,0,0,0,0,0,,,,,left,1,0.926567203373,2017_Mai_29_1807,98.5343221051,Stroop,B-1,1STACS-8,
,,,,,,73,0,73,0,,,,,,,,,,,,2017_Mai_29_1807,98.5343221051,Stroop,B-1,1STACS-8,
neutral,left,"[0.568627451, -0.7882352941, -0.7882352941]", ,9,PECH,74,0,74,0,0,0,0,0,,,,,left,1,0.568406040432,2017_Mai_29_1807,98.5343221051,Stroop,B-1,1STACS-8,
,,,,,,74,0,74,0,,,,,,,,,,,,2017_Mai_29_1807,98.5343221051,Stroop,B-1,1STACS-8,
neutralofneutral,down,"[-0.7725490196, 0.0745098039, -1]", ,16,HALS,75,0,75,0,0,0,0,0,,,,,down,1,0.742105211696,2017_Mai_29_1807,98.5343221051,Stroop,B-1,1STACS-8,
,,,,,,75,0,75,0,,,,,,,,,,,,2017_Mai_29_1807,98.5343221051,Stroop,B-1,1STACS-8,
neutral,right,"[-0.8745098039, -0.2078431373, 0.637254902]", ,11,PECH,76,0,76,0,0,0,0,0,,,,,right,1,1.28251383905,2017_Mai_29_1807,98.5343221051,Stroop,B-1,1STACS-8,
,,,,,,76,0,76,0,,,,,,,,,,,,2017_Mai_29_1807,98.5343221051,Stroop,B-1,1STACS-8,
neutral,down,"[-0.7725490196, 0.0745098039, -1]", ,10,PECH,77,0,77,0,0,0,0,0,,,,,down,1,1.40689193738,2017_Mai_29_1807,98.5343221051,Stroop,B-1,1STACS-8,
,,,,,,77,0,77,0,,,,,,,,,,,,2017_Mai_29_1807,98.5343221051,Stroop,B-1,1STACS-8,
congruent,right,"[-0.8745098039, -0.2078431373, 0.637254902]", ,8,BLAU,78,0,78,0,0,0,0,0,,,,,right,1,1.10250185429,2017_Mai_29_1807,98.5343221051,Stroop,B-1,1STACS-8,
,,,,,,78,0,78,0,,,,,,,,,,,,2017_Mai_29_1807,98.5343221051,Stroop,B-1,1STACS-8,
incongruent,down,"[-0.7725490196, 0.0745098039, -1]", ,7,BLAU,79,0,79,0,0,0,0,0,,,,,down,1,1.04017829082,2017_Mai_29_1807,98.5343221051,Stroop,B-1,1STACS-8,
,,,,,,79,0,79,0,,,,,,,,,,,,2017_Mai_29_1807,98.5343221051,Stroop,B-1,1STACS-8,
fix,return,white, ,21,+,,,,,,,,,0,0,0,0,None,0,,2017_Mai_29_1807,98.5343221051,Stroop,B-1,1STACS-8,
fix,return,white, ,21,+,,,,,,,,,0,1,1,1,None,0,,2017_Mai_29_1807,98.5343221051,Stroop,B-1,1STACS-8,
fix,return,white, ,21,+,,,,,,,,,0,2,2,2,None,0,,2017_Mai_29_1807,98.5343221051,Stroop,B-1,1STACS-8,
fix,return,white, ,21,+,,,,,,,,,0,3,3,3,None,0,,2017_Mai_29_1807,98.5343221051,Stroop,B-1,1STACS-8,
fix,return,white, ,21,+,,,,,,,,,0,4,4,4,None,0,,2017_Mai_29_1807,98.5343221051,Stroop,B-1,1STACS-8,
fix,return,white, ,21,+,,,,,,,,,0,5,5,5,None,0,,2017_Mai_29_1807,98.5343221051,Stroop,B-1,1STACS-8,
fix,return,white, ,21,+,,,,,,,,,0,6,6,6,None,0,,2017_Mai_29_1807,98.5343221051,Stroop,B-1,1STACS-8,
fix,return,white, ,21,+,,,,,,,,,0,7,7,7,None,0,,2017_Mai_29_1807,98.5343221051,Stroop,B-1,1STACS-8,
fix,return,white, ,21,+,,,,,,,,,0,8,8,8,None,0,,2017_Mai_29_1807,98.5343221051,Stroop,B-1,1STACS-8,
fix,return,white, ,21,+,,,,,,,,,0,9,9,9,None,0,,2017_Mai_29_1807,98.5343221051,Stroop,B-1,1STACS-8,
fix,return,white, ,21,+,,,,,,,,,0,10,10,10,None,0,,2017_Mai_29_1807,98.5343221051,Stroop,B-1,1STACS-8,
fix,return,white, ,21,+,,,,,,,,,0,11,11,11,None,0,,2017_Mai_29_1807,98.5343221051,Stroop,B-1,1STACS-8,
fix,return,white,+,22,+,,,,,,,,,0,12,12,12,None,0,,2017_Mai_29_1807,98.5343221051,Stroop,B-1,1STACS-8,
neutral,down,"[-0.7725490196, 0.0745098039, -1]", ,13,SOLL,,,,,,,,,0,13,13,13,down,1,1.07235416792,2017_Mai_29_1807,98.5343221051,Stroop,B-1,1STACS-8,
congruent,down,"[-0.7725490196, 0.0745098039, -1]", ,4,GRÜN,,,,,,,,,0,14,14,14,down,1,0.525591101662,2017_Mai_29_1807,98.5343221051,Stroop,B-1,1STACS-8,
neutral,right,"[-0.8745098039, -0.2078431373, 0.637254902]", ,11,PECH,,,,,,,,,0,15,15,15,right,1,0.845523104193,2017_Mai_29_1807,98.5343221051,Stroop,B-1,1STACS-8,
congruent,left,"[0.568627451, -0.7882352941, -0.7882352941]", ,0,ROT,,,,,,,,,0,16,16,16,left,1,0.569096910361,2017_Mai_29_1807,98.5343221051,Stroop,B-1,1STACS-8,
neutral,left,"[0.568627451, -0.7882352941, -0.7882352941]", ,12,SOLL,,,,,,,,,0,17,17,17,left,1,0.503952317962,2017_Mai_29_1807,98.5343221051,Stroop,B-1,1STACS-8,
neutral,right,"[-0.8745098039, -0.2078431373, 0.637254902]", ,14,SOLL,,,,,,,,,0,18,18,18,right,1,0.901160063639,2017_Mai_29_1807,98.5343221051,Stroop,B-1,1STACS-8,
congruent,down,"[-0.7725490196, 0.0745098039, -1]", ,4,GRÜN,,,,,,,,,0,19,19,19,down,1,0.739965833646,2017_Mai_29_1807,98.5343221051,Stroop,B-1,1STACS-8,
congruent,left,"[0.568627451, -0.7882352941, -0.7882352941]", ,0,ROT,,,,,,,,,0,20,20,20,left,1,0.621097094742,2017_Mai_29_1807,98.5343221051,Stroop,B-1,1STACS-8,
congruent,right,"[-0.8745098039, -0.2078431373, 0.637254902]", ,8,BLAU,,,,,,,,,0,21,21,21,right,1,1.42815106389,2017_Mai_29_1807,98.5343221051,Stroop,B-1,1STACS-8,
neutral,left,"[0.568627451, -0.7882352941, -0.7882352941]", ,9,PECH,,,,,,,,,0,22,22,22,left,1,1.14927595546,2017_Mai_29_1807,98.5343221051,Stroop,B-1,1STACS-8,
congruent,right,"[-0.8745098039, -0.2078431373, 0.637254902]", ,8,BLAU,,,,,,,,,0,23,23,23,right,1,0.985083579058,2017_Mai_29_1807,98.5343221051,Stroop,B-1,1STACS-8,
neutral,down,"[-0.7725490196, 0.0745098039, -1]", ,10,PECH,,,,,,,,,0,24,24,24,down,1,0.692669040339,2017_Mai_29_1807,98.5343221051,Stroop,B-1,1STACS-8,
neutral,left,"[0.568627451, -0.7882352941, -0.7882352941]", ,12,SOLL,,,,,,,,,0,25,25,25,left,1,0.656609429411,2017_Mai_29_1807,98.5343221051,Stroop,B-1,1STACS-8,
incongruent,left,"[0.568627451, -0.7882352941, -0.7882352941]", ,6,BLAU,,,,,,,,,0,26,26,26,left,1,0.677331336804,2017_Mai_29_1807,98.5343221051,Stroop,B-1,1STACS-8,
neutral,right,"[-0.8745098039, -0.2078431373, 0.637254902]", ,14,SOLL,,,,,,,,,0,27,27,27,right,1,1.45485389903,2017_Mai_29_1807,98.5343221051,Stroop,B-1,1STACS-8,
neutral,left,"[0.568627451, -0.7882352941, -0.7882352941]", ,9,PECH,,,,,,,,,0,28,28,28,left,1,0.909009944001,2017_Mai_29_1807,98.5343221051,Stroop,B-1,1STACS-8,
neutral,right,"[-0.8745098039, -0.2078431373, 0.637254902]", ,11,PECH,,,,,,,,,0,29,29,29,right,1,1.1000752889,2017_Mai_29_1807,98.5343221051,Stroop,B-1,1STACS-8,
neutral,down,"[-0.7725490196, 0.0745098039, -1]", ,10,PECH,,,,,,,,,0,30,30,30,down,1,0.513961970027,2017_Mai_29_1807,98.5343221051,Stroop,B-1,1STACS-8,
neutral,down,"[-0.7725490196, 0.0745098039, -1]", ,13,SOLL,,,,,,,,,0,31,31,31,down,1,0.602857905125,2017_Mai_29_1807,98.5343221051,Stroop,B-1,1STACS-8,
incongruent,right,"[-0.8745098039, -0.2078431373, 0.637254902]", ,5,GRÜN,,,,,,,,,0,32,32,32,left,0,1.15750381683,2017_Mai_29_1807,98.5343221051,Stroop,B-1,1STACS-8,
incongruent,down,"[-0.7725490196, 0.0745098039, -1]", ,7,BLAU,,,,,,,,,0,33,33,33,down,1,1.07365237761,2017_Mai_29_1807,98.5343221051,Stroop,B-1,1STACS-8,
incongruent,left,"[0.568627451, -0.7882352941, -0.7882352941]", ,3,GRÜN,,,,,,,,,0,34,34,34,left,1,1.19808383468,2017_Mai_29_1807,98.5343221051,Stroop,B-1,1STACS-8,
incongruent,right,"[-0.8745098039, -0.2078431373, 0.637254902]", ,2,ROT,,,,,,,,,0,35,35,35,None,0,,2017_Mai_29_1807,98.5343221051,Stroop,B-1,1STACS-8,
incongruent,down,"[-0.7725490196, 0.0745098039, -1]", ,1,ROT,,,,,,,,,0,36,36,36,down,1,1.07896003542,2017_Mai_29_1807,98.5343221051,Stroop,B-1,1STACS-8,
neutralofneutral,right,"[-0.8745098039, -0.2078431373, 0.637254902]", ,20,MODE,,,,,,,,,0,37,37,37,left,0,0.983986791617,2017_Mai_29_1807,98.5343221051,Stroop,B-1,1STACS-8,
neutral,right,"[-0.8745098039, -0.2078431373, 0.637254902]", ,14,SOLL,,,,,,,,,0,38,38,38,right,1,0.684828379026,2017_Mai_29_1807,98.5343221051,Stroop,B-1,1STACS-8,
neutral,left,"[0.568627451, -0.7882352941, -0.7882352941]", ,9,PECH,,,,,,,,,0,39,39,39,left,1,0.695436151801,2017_Mai_29_1807,98.5343221051,Stroop,B-1,1STACS-8,
neutral,down,"[-0.7725490196, 0.0745098039, -1]", ,13,SOLL,,,,,,,,,0,40,40,40,down,1,0.709730147267,2017_Mai_29_1807,98.5343221051,Stroop,B-1,1STACS-8,
neutralofneutral,down,"[-0.7725490196, 0.0745098039, -1]", ,16,HALS,,,,,,,,,0,41,41,41,down,1,0.548714152218,2017_Mai_29_1807,98.5343221051,Stroop,B-1,1STACS-8,
neutralofneutral,left,"[0.568627451, -0.7882352941, -0.7882352941]", ,18,MODE,,,,,,,,,0,42,42,42,left,1,0.92450241581,2017_Mai_29_1807,98.5343221051,Stroop,B-1,1STACS-8,
neutralofneutral,right,"[-0.8745098039, -0.2078431373, 0.637254902]", ,17,HALS,,,,,,,,,0,43,43,43,right,1,0.774140568145,2017_Mai_29_1807,98.5343221051,Stroop,B-1,1STACS-8,
neutral,right,"[-0.8745098039, -0.2078431373, 0.637254902]", ,11,PECH,,,,,,,,,0,44,44,44,right,1,0.609757944096,2017_Mai_29_1807,98.5343221051,Stroop,B-1,1STACS-8,
neutralofneutral,down,"[-0.7725490196, 0.0745098039, -1]", ,19,MODE,,,,,,,,,0,45,45,45,down,1,0.634114950364,2017_Mai_29_1807,98.5343221051,Stroop,B-1,1STACS-8,
neutral,left,"[0.568627451, -0.7882352941, -0.7882352941]", ,12,SOLL,,,,,,,,,0,46,46,46,left,1,0.83858143982,2017_Mai_29_1807,98.5343221051,Stroop,B-1,1STACS-8,
neutralofneutral,left,"[0.568627451, -0.7882352941, -0.7882352941]", ,15,HALS,,,,,,,,,0,47,47,47,left,1,0.677251717746,2017_Mai_29_1807,98.5343221051,Stroop,B-1,1STACS-8,
neutral,down,"[-0.7725490196, 0.0745098039, -1]", ,10,PECH,,,,,,,,,0,48,48,48,down,1,0.798802082388,2017_Mai_29_1807,98.5343221051,Stroop,B-1,1STACS-8,
fix,return,white, ,21,+,,,,,,,,,0,49,49,49,None,0,,2017_Mai_29_1807,98.5343221051,Stroop,B-1,1STACS-8,
fix,return,white, ,21,+,,,,,,,,,0,50,50,50,None,0,,2017_Mai_29_1807,98.5343221051,Stroop,B-1,1STACS-8,
fix,return,white, ,21,+,,,,,,,,,0,51,51,51,None,0,,2017_Mai_29_1807,98.5343221051,Stroop,B-1,1STACS-8,
fix,return,white, ,21,+,,,,,,,,,0,52,52,52,None,0,,2017_Mai_29_1807,98.5343221051,Stroop,B-1,1STACS-8,
fix,return,white, ,21,+,,,,,,,,,0,53,53,53,None,0,,2017_Mai_29_1807,98.5343221051,Stroop,B-1,1STACS-8,
fix,return,white, ,21,+,,,,,,,,,0,54,54,54,None,0,,2017_Mai_29_1807,98.5343221051,Stroop,B-1,1STACS-8,
fix,return,white, ,21,+,,,,,,,,,0,55,55,55,None,0,,2017_Mai_29_1807,98.5343221051,Stroop,B-1,1STACS-8,
fix,return,white, ,21,+,,,,,,,,,0,56,56,56,None,0,,2017_Mai_29_1807,98.5343221051,Stroop,B-1,1STACS-8,
fix,return,white, ,21,+,,,,,,,,,0,57,57,57,None,0,,2017_Mai_29_1807,98.5343221051,Stroop,B-1,1STACS-8,
fix,return,white, ,21,+,,,,,,,,,0,58,58,58,None,0,,2017_Mai_29_1807,98.5343221051,Stroop,B-1,1STACS-8,
fix,return,white, ,21,+,,,,,,,,,0,59,59,59,None,0,,2017_Mai_29_1807,98.5343221051,Stroop,B-1,1STACS-8,
fix,return,white, ,21,+,,,,,,,,,0,60,60,60,None,0,,2017_Mai_29_1807,98.5343221051,Stroop,B-1,1STACS-8,
fix,return,white,+,22,+,,,,,,,,,0,61,61,61,None,0,,2017_Mai_29_1807,98.5343221051,Stroop,B-1,1STACS-8,
neutral,left,"[0.568627451, -0.7882352941, -0.7882352941]", ,12,SOLL,,,,,,,,,0,62,62,62,left,1,0.633862124935,2017_Mai_29_1807,98.5343221051,Stroop,B-1,1STACS-8,
incongruent,down,"[-0.7725490196, 0.0745098039, -1]", ,7,BLAU,,,,,,,,,0,63,63,63,down,1,1.02050148832,2017_Mai_29_1807,98.5343221051,Stroop,B-1,1STACS-8,
incongruent,down,"[-0.7725490196, 0.0745098039, -1]", ,1,ROT,,,,,,,,,0,64,64,64,down,1,0.967141075193,2017_Mai_29_1807,98.5343221051,Stroop,B-1,1STACS-8,
incongruent,right,"[-0.8745098039, -0.2078431373, 0.637254902]", ,2,ROT,,,,,,,,,0,65,65,65,right,1,1.12098269473,2017_Mai_29_1807,98.5343221051,Stroop,B-1,1STACS-8,
neutral,right,"[-0.8745098039, -0.2078431373, 0.637254902]", ,14,SOLL,,,,,,,,,0,66,66,66,right,1,0.695557675627,2017_Mai_29_1807,98.5343221051,Stroop,B-1,1STACS-8,
incongruent,left,"[0.568627451, -0.7882352941, -0.7882352941]", ,6,BLAU,,,,,,,,,0,67,67,67,left,1,0.545628285159,2017_Mai_29_1807,98.5343221051,Stroop,B-1,1STACS-8,
neutral,down,"[-0.7725490196, 0.0745098039, -1]", ,13,SOLL,,,,,,,,,0,68,68,68,down,1,0.54595821536,2017_Mai_29_1807,98.5343221051,Stroop,B-1,1STACS-8,
neutral,right,"[-0.8745098039, -0.2078431373, 0.637254902]", ,11,PECH,,,,,,,,,0,69,69,69,left,0,0.671148986813,2017_Mai_29_1807,98.5343221051,Stroop,B-1,1STACS-8,
incongruent,right,"[-0.8745098039, -0.2078431373, 0.637254902]", ,5,GRÜN,,,,,,,,,0,70,70,70,right,1,0.802903441639,2017_Mai_29_1807,98.5343221051,Stroop,B-1,1STACS-8,
neutral,left,"[0.568627451, -0.7882352941, -0.7882352941]", ,9,PECH,,,,,,,,,0,71,71,71,left,1,0.788286779465,2017_Mai_29_1807,98.5343221051,Stroop,B-1,1STACS-8,
incongruent,left,"[0.568627451, -0.7882352941, -0.7882352941]", ,3,GRÜN,,,,,,,,,0,72,72,72,left,1,0.567103081537,2017_Mai_29_1807,98.5343221051,Stroop,B-1,1STACS-8,
neutral,down,"[-0.7725490196, 0.0745098039, -1]", ,10,PECH,,,,,,,,,0,73,73,73,down,1,0.670798383593,2017_Mai_29_1807,98.5343221051,Stroop,B-1,1STACS-8,
congruent,right,"[-0.8745098039, -0.2078431373, 0.637254902]", ,8,BLAU,,,,,,,,,0,74,74,74,right,1,0.83510278541,2017_Mai_29_1807,98.5343221051,Stroop,B-1,1STACS-8,
congruent,left,"[0.568627451, -0.7882352941, -0.7882352941]", ,0,ROT,,,,,,,,,0,75,75,75,left,1,0.577637660652,2017_Mai_29_1807,98.5343221051,Stroop,B-1,1STACS-8,
neutral,left,"[0.568627451, -0.7882352941, -0.7882352941]", ,12,SOLL,,,,,,,,,0,76,76,76,left,1,1.01632609731,2017_Mai_29_1807,98.5343221051,Stroop,B-1,1STACS-8,
neutral,right,"[-0.8745098039, -0.2078431373, 0.637254902]", ,14,SOLL,,,,,,,,,0,77,77,77,right,1,1.21587995122,2017_Mai_29_1807,98.5343221051,Stroop,B-1,1STACS-8,
neutral,down,"[-0.7725490196, 0.0745098039, -1]", ,13,SOLL,,,,,,,,,0,78,78,78,down,1,0.759746280602,2017_Mai_29_1807,98.5343221051,Stroop,B-1,1STACS-8,
neutral,down,"[-0.7725490196, 0.0745098039, -1]", ,10,PECH,,,,,,,,,0,79,79,79,down,1,0.479429648182,2017_Mai_29_1807,98.5343221051,Stroop,B-1,1STACS-8,
congruent,down,"[-0.7725490196, 0.0745098039, -1]", ,4,GRÜN,,,,,,,,,0,80,80,80,down,1,0.513522249336,2017_Mai_29_1807,98.5343221051,Stroop,B-1,1STACS-8,
neutral,left,"[0.568627451, -0.7882352941, -0.7882352941]", ,9,PECH,,,,,,,,,0,81,81,81,left,1,1.33671262688,2017_Mai_29_1807,98.5343221051,Stroop,B-1,1STACS-8,
neutral,right,"[-0.8745098039, -0.2078431373, 0.637254902]", ,11,PECH,,,,,,,,,0,82,82,82,right,1,0.57506442858,2017_Mai_29_1807,98.5343221051,Stroop,B-1,1STACS-8,
congruent,left,"[0.568627451, -0.7882352941, -0.7882352941]", ,0,ROT,,,,,,,,,0,83,83,83,left,1,0.494620126301,2017_Mai_29_1807,98.5343221051,Stroop,B-1,1STACS-8,
congruent,down,"[-0.7725490196, 0.0745098039, -1]", ,4,GRÜN,,,,,,,,,0,84,84,84,down,1,0.644812119976,2017_Mai_29_1807,98.5343221051,Stroop,B-1,1STACS-8,
congruent,right,"[-0.8745098039, -0.2078431373, 0.637254902]", ,8,BLAU,,,,,,,,,0,85,85,85,left,0,0.860036121909,2017_Mai_29_1807,98.5343221051,Stroop,B-1,1STACS-8,
neutralofneutral,left,"[0.568627451, -0.7882352941, -0.7882352941]", ,15,HALS,,,,,,,,,0,86,86,86,left,1,0.871127475699,2017_Mai_29_1807,98.5343221051,Stroop,B-1,1STACS-8,
neutral,right,"[-0.8745098039, -0.2078431373, 0.637254902]", ,14,SOLL,,,,,,,,,0,87,87,87,left,0,1.17839138773,2017_Mai_29_1807,98.5343221051,Stroop,B-1,1STACS-8,
neutral,left,"[0.568627451, -0.7882352941, -0.7882352941]", ,12,SOLL,,,,,,,,,0,88,88,88,left,1,1.115623075,2017_Mai_29_1807,98.5343221051,Stroop,B-1,1STACS-8,
neutralofneutral,left,"[0.568627451, -0.7882352941, -0.7882352941]", ,18,MODE,,,,,,,,,0,89,89,89,left,1,1.04126250683,2017_Mai_29_1807,98.5343221051,Stroop,B-1,1STACS-8,
neutral,left,"[0.568627451, -0.7882352941, -0.7882352941]", ,9,PECH,,,,,,,,,0,90,90,90,left,1,0.663411969957,2017_Mai_29_1807,98.5343221051,Stroop,B-1,1STACS-8,
neutral,down,"[-0.7725490196, 0.0745098039, -1]", ,10,PECH,,,,,,,,,0,91,91,91,down,1,0.727366466967,2017_Mai_29_1807,98.5343221051,Stroop,B-1,1STACS-8,
neutral,down,"[-0.7725490196, 0.0745098039, -1]", ,13,SOLL,,,,,,,,,0,92,92,92,down,1,0.5683638563,2017_Mai_29_1807,98.5343221051,Stroop,B-1,1STACS-8,
neutralofneutral,right,"[-0.8745098039, -0.2078431373, 0.637254902]", ,17,HALS,,,,,,,,,0,93,93,93,right,1,0.92002531048,2017_Mai_29_1807,98.5343221051,Stroop,B-1,1STACS-8,
neutralofneutral,right,"[-0.8745098039, -0.2078431373, 0.637254902]", ,20,MODE,,,,,,,,,0,94,94,94,right,1,0.470906777258,2017_Mai_29_1807,98.5343221051,Stroop,B-1,1STACS-8,
neutral,right,"[-0.8745098039, -0.2078431373, 0.637254902]", ,11,PECH,,,,,,,,,0,95,95,95,right,1,0.426306416039,2017_Mai_29_1807,98.5343221051,Stroop,B-1,1STACS-8,
neutralofneutral,down,"[-0.7725490196, 0.0745098039, -1]", ,16,HALS,,,,,,,,,0,96,96,96,down,1,0.762404998401,2017_Mai_29_1807,98.5343221051,Stroop,B-1,1STACS-8,
neutralofneutral,down,"[-0.7725490196, 0.0745098039, -1]", ,19,MODE,,,,,,,,,0,97,97,97,down,1,0.64538146608,2017_Mai_29_1807,98.5343221051,Stroop,B-1,1STACS-8,
fix,return,white, ,21,+,,,,,,,,,0,98,98,98,None,0,,2017_Mai_29_1807,98.5343221051,Stroop,B-1,1STACS-8,
fix,return,white, ,21,+,,,,,,,,,0,99,99,99,None,0,,2017_Mai_29_1807,98.5343221051,Stroop,B-1,1STACS-8,
fix,return,white, ,21,+,,,,,,,,,0,100,100,100,None,0,,2017_Mai_29_1807,98.5343221051,Stroop,B-1,1STACS-8,
fix,return,white, ,21,+,,,,,,,,,0,101,101,101,None,0,,2017_Mai_29_1807,98.5343221051,Stroop,B-1,1STACS-8,
fix,return,white, ,21,+,,,,,,,,,0,102,102,102,None,0,,2017_Mai_29_1807,98.5343221051,Stroop,B-1,1STACS-8,
fix,return,white, ,21,+,,,,,,,,,0,103,103,103,None,0,,2017_Mai_29_1807,98.5343221051,Stroop,B-1,1STACS-8,
fix,return,white, ,21,+,,,,,,,,,0,104,104,104,None,0,,2017_Mai_29_1807,98.5343221051,Stroop,B-1,1STACS-8,
fix,return,white, ,21,+,,,,,,,,,0,105,105,105,None,0,,2017_Mai_29_1807,98.5343221051,Stroop,B-1,1STACS-8,
fix,return,white, ,21,+,,,,,,,,,0,106,106,106,None,0,,2017_Mai_29_1807,98.5343221051,Stroop,B-1,1STACS-8,
fix,return,white, ,21,+,,,,,,,,,0,107,107,107,None,0,,2017_Mai_29_1807,98.5343221051,Stroop,B-1,1STACS-8,
fix,return,white, ,21,+,,,,,,,,,0,108,108,108,None,0,,2017_Mai_29_1807,98.5343221051,Stroop,B-1,1STACS-8,
fix,return,white, ,21,+,,,,,,,,,0,109,109,109,None,0,,2017_Mai_29_1807,98.5343221051,Stroop,B-1,1STACS-8,
fix,return,white,+,22,+,,,,,,,,,0,110,110,110,None,0,,2017_Mai_29_1807,98.5343221051,Stroop,B-1,1STACS-8,
neutral,left,"[0.568627451, -0.7882352941, -0.7882352941]", ,12,SOLL,,,,,,,,,0,111,111,111,left,1,0.849369403095,2017_Mai_29_1807,98.5343221051,Stroop,B-1,1STACS-8,
neutral,right,"[-0.8745098039, -0.2078431373, 0.637254902]", ,11,PECH,,,,,,,,,0,112,112,112,right,1,0.567423513324,2017_Mai_29_1807,98.5343221051,Stroop,B-1,1STACS-8,
neutralofneutral,down,"[-0.7725490196, 0.0745098039, -1]", ,19,MODE,,,,,,,,,0,113,113,113,down,1,0.398022094987,2017_Mai_29_1807,98.5343221051,Stroop,B-1,1STACS-8,
neutral,down,"[-0.7725490196, 0.0745098039, -1]", ,10,PECH,,,,,,,,,0,114,114,114,down,1,0.610259963208,2017_Mai_29_1807,98.5343221051,Stroop,B-1,1STACS-8,
neutralofneutral,right,"[-0.8745098039, -0.2078431373, 0.637254902]", ,17,HALS,,,,,,,,,0,115,115,115,right,1,0.924430618975,2017_Mai_29_1807,98.5343221051,Stroop,B-1,1STACS-8,
neutral,right,"[-0.8745098039, -0.2078431373, 0.637254902]", ,14,SOLL,,,,,,,,,0,116,116,116,right,1,0.483952848756,2017_Mai_29_1807,98.5343221051,Stroop,B-1,1STACS-8,
neutral,left,"[0.568627451, -0.7882352941, -0.7882352941]", ,9,PECH,,,,,,,,,0,117,117,117,left,1,0.791293586196,2017_Mai_29_1807,98.5343221051,Stroop,B-1,1STACS-8,
neutralofneutral,left,"[0.568627451, -0.7882352941, -0.7882352941]", ,15,HALS,,,,,,,,,0,118,118,118,left,1,0.526656879576,2017_Mai_29_1807,98.5343221051,Stroop,B-1,1STACS-8,
neutralofneutral,right,"[-0.8745098039, -0.2078431373, 0.637254902]", ,20,MODE,,,,,,,,,0,119,119,119,down,0,0.924238136411,2017_Mai_29_1807,98.5343221051,Stroop,B-1,1STACS-8,
neutral,down,"[-0.7725490196, 0.0745098039, -1]", ,13,SOLL,,,,,,,,,0,120,120,120,down,1,0.438788728735,2017_Mai_29_1807,98.5343221051,Stroop,B-1,1STACS-8,
neutralofneutral,down,"[-0.7725490196, 0.0745098039, -1]", ,16,HALS,,,,,,,,,0,121,121,121,down,1,0.567244440285,2017_Mai_29_1807,98.5343221051,Stroop,B-1,1STACS-8,
neutralofneutral,left,"[0.568627451, -0.7882352941, -0.7882352941]", ,18,MODE,,,,,,,,,0,122,122,122,left,1,1.06849054838,2017_Mai_29_1807,98.5343221051,Stroop,B-1,1STACS-8,
neutral,down,"[-0.7725490196, 0.0745098039, -1]", ,10,PECH,,,,,,,,,0,123,123,123,right,0,0.574791768227,2017_Mai_29_1807,98.5343221051,Stroop,B-1,1STACS-8,
congruent,left,"[0.568627451, -0.7882352941, -0.7882352941]", ,0,ROT,,,,,,,,,0,124,124,124,left,1,1.22889082272,2017_Mai_29_1807,98.5343221051,Stroop,B-1,1STACS-8,
neutral,left,"[0.568627451, -0.7882352941, -0.7882352941]", ,9,PECH,,,,,,,,,0,125,125,125,left,1,0.856260223017,2017_Mai_29_1807,98.5343221051,Stroop,B-1,1STACS-8,
congruent,left,"[0.568627451, -0.7882352941, -0.7882352941]", ,0,ROT,,,,,,,,,0,126,126,126,left,1,0.505532686417,2017_Mai_29_1807,98.5343221051,Stroop,B-1,1STACS-8,
congruent,down,"[-0.7725490196, 0.0745098039, -1]", ,4,GRÜN,,,,,,,,,0,127,127,127,down,1,0.462358763474,2017_Mai_29_1807,98.5343221051,Stroop,B-1,1STACS-8,
neutral,left,"[0.568627451, -0.7882352941, -0.7882352941]", ,12,SOLL,,,,,,,,,0,128,128,128,left,1,0.644732500919,2017_Mai_29_1807,98.5343221051,Stroop,B-1,1STACS-8,
neutral,right,"[-0.8745098039, -0.2078431373, 0.637254902]", ,14,SOLL,,,,,,,,,0,129,129,129,right,1,0.655715181678,2017_Mai_29_1807,98.5343221051,Stroop,B-1,1STACS-8,
neutral,right,"[-0.8745098039, -0.2078431373, 0.637254902]", ,11,PECH,,,,,,,,,0,130,130,130,right,1,0.43862893189,2017_Mai_29_1807,98.5343221051,Stroop,B-1,1STACS-8,
congruent,right,"[-0.8745098039, -0.2078431373, 0.637254902]", ,8,BLAU,,,,,,,,,0,131,131,131,right,1,0.623918682402,2017_Mai_29_1807,98.5343221051,Stroop,B-1,1STACS-8,
neutral,down,"[-0.7725490196, 0.0745098039, -1]", ,13,SOLL,,,,,,,,,0,132,132,132,left,0,0.860100655251,2017_Mai_29_1807,98.5343221051,Stroop,B-1,1STACS-8,
congruent,right,"[-0.8745098039, -0.2078431373, 0.637254902]", ,8,BLAU,,,,,,,,,0,133,133,133,right,1,1.11590914488,2017_Mai_29_1807,98.5343221051,Stroop,B-1,1STACS-8,
congruent,down,"[-0.7725490196, 0.0745098039, -1]", ,4,GRÜN,,,,,,,,,0,134,134,134,down,1,0.677182714563,2017_Mai_29_1807,98.5343221051,Stroop,B-1,1STACS-8,
incongruent,right,"[-0.8745098039, -0.2078431373, 0.637254902]", ,5,GRÜN,,,,,,,,,0,135,135,135,right,1,1.3443314723,2017_Mai_29_1807,98.5343221051,Stroop,B-1,1STACS-8,
neutral,right,"[-0.8745098039, -0.2078431373, 0.637254902]", ,14,SOLL,,,,,,,,,0,136,136,136,right,1,0.524337590392,2017_Mai_29_1807,98.5343221051,Stroop,B-1,1STACS-8,
incongruent,left,"[0.568627451, -0.7882352941, -0.7882352941]", ,6,BLAU,,,,,,,,,0,137,137,137,down,0,1.29991325713,2017_Mai_29_1807,98.5343221051,Stroop,B-1,1STACS-8,
neutral,left,"[0.568627451, -0.7882352941, -0.7882352941]", ,12,SOLL,,,,,,,,,0,138,138,138,left,1,1.4279988099,2017_Mai_29_1807,98.5343221051,Stroop,B-1,1STACS-8,
neutral,right,"[-0.8745098039, -0.2078431373, 0.637254902]", ,11,PECH,,,,,,,,,0,139,139,139,right,1,0.915918084561,2017_Mai_29_1807,98.5343221051,Stroop,B-1,1STACS-8,
incongruent,left,"[0.568627451, -0.7882352941, -0.7882352941]", ,3,GRÜN,,,,,,,,,0,140,140,140,left,1,1.10310109246,2017_Mai_29_1807,98.5343221051,Stroop,B-1,1STACS-8,
incongruent,down,"[-0.7725490196, 0.0745098039, -1]", ,1,ROT,,,,,,,,,0,141,141,141,down,1,0.913631481096,2017_Mai_29_1807,98.5343221051,Stroop,B-1,1STACS-8,
incongruent,right,"[-0.8745098039, -0.2078431373, 0.637254902]", ,2,ROT,,,,,,,,,0,142,142,142,right,1,1.06284513814,2017_Mai_29_1807,98.5343221051,Stroop,B-1,1STACS-8,
incongruent,down,"[-0.7725490196, 0.0745098039, -1]", ,7,BLAU,,,,,,,,,0,143,143,143,down,1,0.828050771816,2017_Mai_29_1807,98.5343221051,Stroop,B-1,1STACS-8,
neutral,down,"[-0.7725490196, 0.0745098039, -1]", ,13,SOLL,,,,,,,,,0,144,144,144,down,1,0.698745510952,2017_Mai_29_1807,98.5343221051,Stroop,B-1,1STACS-8,
neutral,left,"[0.568627451, -0.7882352941, -0.7882352941]", ,9,PECH,,,,,,,,,0,145,145,145,left,1,0.823624231571,2017_Mai_29_1807,98.5343221051,Stroop,B-1,1STACS-8,
neutral,down,"[-0.7725490196, 0.0745098039, -1]", ,10,PECH,,,,,,,,,0,146,146,146,down,1,1.00521826098,2017_Mai_29_1807,98.5343221051,Stroop,B-1,1STACS-8,
fix,return,white, ,21,+,,,,,,,,,0,147,147,147,None,0,,2017_Mai_29_1807,98.5343221051,Stroop,B-1,1STACS-8,
fix,return,white, ,21,+,,,,,,,,,0,148,148,148,None,0,,2017_Mai_29_1807,98.5343221051,Stroop,B-1,1STACS-8,
fix,return,white, ,21,+,,,,,,,,,0,149,149,149,None,0,,2017_Mai_29_1807,98.5343221051,Stroop,B-1,1STACS-8,
fix,return,white, ,21,+,,,,,,,,,0,150,150,150,None,0,,2017_Mai_29_1807,98.5343221051,Stroop,B-1,1STACS-8,
fix,return,white, ,21,+,,,,,,,,,0,151,151,151,None,0,,2017_Mai_29_1807,98.5343221051,Stroop,B-1,1STACS-8,
fix,return,white, ,21,+,,,,,,,,,0,152,152,152,None,0,,2017_Mai_29_1807,98.5343221051,Stroop,B-1,1STACS-8,
fix,return,white, ,21,+,,,,,,,,,0,153,153,153,None,0,,2017_Mai_29_1807,98.5343221051,Stroop,B-1,1STACS-8,
fix,return,white, ,21,+,,,,,,,,,0,154,154,154,None,0,,2017_Mai_29_1807,98.5343221051,Stroop,B-1,1STACS-8,
fix,return,white, ,21,+,,,,,,,,,0,155,155,155,None,0,,2017_Mai_29_1807,98.5343221051,Stroop,B-1,1STACS-8,
fix,return,white, ,21,+,,,,,,,,,0,156,156,156,None,0,,2017_Mai_29_1807,98.5343221051,Stroop,B-1,1STACS-8,
fix,return,white, ,21,+,,,,,,,,,0,157,157,157,None,0,,2017_Mai_29_1807,98.5343221051,Stroop,B-1,1STACS-8,
fix,return,white, ,21,+,,,,,,,,,0,158,158,158,None,0,,2017_Mai_29_1807,98.5343221051,Stroop,B-1,1STACS-8,
fix,return,white,+,22,+,,,,,,,,,0,159,159,159,None,0,,2017_Mai_29_1807,98.5343221051,Stroop,B-1,1STACS-8,
neutralofneutral,left,"[0.568627451, -0.7882352941, -0.7882352941]", ,15,HALS,,,,,,,,,0,160,160,160,left,1,0.558975512251,2017_Mai_29_1807,98.5343221051,Stroop,B-1,1STACS-8,
neutralofneutral,down,"[-0.7725490196, 0.0745098039, -1]", ,16,HALS,,,,,,,,,0,161,161,161,down,1,0.409530540893,2017_Mai_29_1807,98.5343221051,Stroop,B-1,1STACS-8,
neutral,right,"[-0.8745098039, -0.2078431373, 0.637254902]", ,11,PECH,,,,,,,,,0,162,162,162,right,1,0.395807847087,2017_Mai_29_1807,98.5343221051,Stroop,B-1,1STACS-8,
neutralofneutral,down,"[-0.7725490196, 0.0745098039, -1]", ,19,MODE,,,,,,,,,0,163,163,163,left,0,0.515946021073,2017_Mai_29_1807,98.5343221051,Stroop,B-1,1STACS-8,
neutral,right,"[-0.8745098039, -0.2078431373, 0.637254902]", ,14,SOLL,,,,,,,,,0,164,164,164,down,0,1.19557206293,2017_Mai_29_1807,98.5343221051,Stroop,B-1,1STACS-8,
neutral,down,"[-0.7725490196, 0.0745098039, -1]", ,10,PECH,,,,,,,,,0,165,165,165,down,1,0.947198317104,2017_Mai_29_1807,98.5343221051,Stroop,B-1,1STACS-8,
neutral,left,"[0.568627451, -0.7882352941, -0.7882352941]", ,12,SOLL,,,,,,,,,0,166,166,166,left,1,1.01645181161,2017_Mai_29_1807,98.5343221051,Stroop,B-1,1STACS-8,
neutralofneutral,left,"[0.568627451, -0.7882352941, -0.7882352941]", ,18,MODE,,,,,,,,,0,167,167,167,left,1,0.684829217121,2017_Mai_29_1807,98.5343221051,Stroop,B-1,1STACS-8,
neutralofneutral,right,"[-0.8745098039, -0.2078431373, 0.637254902]", ,20,MODE,,,,,,,,,0,168,168,168,right,1,1.14746958063,2017_Mai_29_1807,98.5343221051,Stroop,B-1,1STACS-8,
neutral,down,"[-0.7725490196, 0.0745098039, -1]", ,13,SOLL,,,,,,,,,0,169,169,169,down,1,0.871400694781,2017_Mai_29_1807,98.5343221051,Stroop,B-1,1STACS-8,
neutral,left,"[0.568627451, -0.7882352941, -0.7882352941]", ,9,PECH,,,,,,,,,0,170,170,170,left,1,0.899334971344,2017_Mai_29_1807,98.5343221051,Stroop,B-1,1STACS-8,
neutralofneutral,right,"[-0.8745098039, -0.2078431373, 0.637254902]", ,17,HALS,,,,,,,,,0,171,171,171,down,0,1.04198075454,2017_Mai_29_1807,98.5343221051,Stroop,B-1,1STACS-8,
incongruent,down,"[-0.7725490196, 0.0745098039, -1]", ,1,ROT,,,,,,,,,0,172,172,172,down,1,0.849344539599,2017_Mai_29_1807,98.5343221051,Stroop,B-1,1STACS-8,
neutral,left,"[0.568627451, -0.7882352941, -0.7882352941]", ,9,PECH,,,,,,,,,0,173,173,173,left,1,0.770376961318,2017_Mai_29_1807,98.5343221051,Stroop,B-1,1STACS-8,
neutral,right,"[-0.8745098039, -0.2078431373, 0.637254902]", ,11,PECH,,,,,,,,,0,174,174,174,right,1,1.23633283001,2017_Mai_29_1807,98.5343221051,Stroop,B-1,1STACS-8,
incongruent,down,"[-0.7725490196, 0.0745098039, -1]", ,7,BLAU,,,,,,,,,0,175,175,175,down,1,1.31615750046,2017_Mai_29_1807,98.5343221051,Stroop,B-1,1STACS-8,
incongruent,right,"[-0.8745098039, -0.2078431373, 0.637254902]", ,5,GRÜN,,,,,,,,,0,176,176,176,None,0,,2017_Mai_29_1807,98.5343221051,Stroop,B-1,1STACS-8,
neutral,right,"[-0.8745098039, -0.2078431373, 0.637254902]", ,14,SOLL,,,,,,,,,0,177,177,177,right,1,0.567145545034,2017_Mai_29_1807,98.5343221051,Stroop,B-1,1STACS-8,
incongruent,left,"[0.568627451, -0.7882352941, -0.7882352941]", ,3,GRÜN,,,,,,,,,0,178,178,178,down,0,0.93113091189,2017_Mai_29_1807,98.5343221051,Stroop,B-1,1STACS-8,
incongruent,right,"[-0.8745098039, -0.2078431373, 0.637254902]", ,2,ROT,,,,,,,,,0,179,179,179,left,0,0.962704477804,2017_Mai_29_1807,98.5343221051,Stroop,B-1,1STACS-8,
neutral,down,"[-0.7725490196, 0.0745098039, -1]", ,13,SOLL,,,,,,,,,0,180,180,180,down,1,1.06843551345,2017_Mai_29_1807,98.5343221051,Stroop,B-1,1STACS-8,
incongruent,left,"[0.568627451, -0.7882352941, -0.7882352941]", ,6,BLAU,,,,,,,,,0,181,181,181,None,0,,2017_Mai_29_1807,98.5343221051,Stroop,B-1,1STACS-8,
neutral,left,"[0.568627451, -0.7882352941, -0.7882352941]", ,12,SOLL,,,,,,,,,0,182,182,182,left,1,1.16902008495,2017_Mai_29_1807,98.5343221051,Stroop,B-1,1STACS-8,
neutral,down,"[-0.7725490196, 0.0745098039, -1]", ,10,PECH,,,,,,,,,0,183,183,183,down,1,0.866976668822,2017_Mai_29_1807,98.5343221051,Stroop,B-1,1STACS-8,
congruent,left,"[0.568627451, -0.7882352941, -0.7882352941]", ,0,ROT,,,,,,,,,0,184,184,184,left,1,1.25274608924,2017_Mai_29_1807,98.5343221051,Stroop,B-1,1STACS-8,
neutral,left,"[0.568627451, -0.7882352941, -0.7882352941]", ,9,PECH,,,,,,,,,0,185,185,185,left,1,0.470981367744,2017_Mai_29_1807,98.5343221051,Stroop,B-1,1STACS-8,
congruent,left,"[0.568627451, -0.7882352941, -0.7882352941]", ,0,ROT,,,,,,,,,0,186,186,186,left,1,0.419987456507,2017_Mai_29_1807,98.5343221051,Stroop,B-1,1STACS-8,
neutral,right,"[-0.8745098039, -0.2078431373, 0.637254902]", ,11,PECH,,,,,,,,,0,187,187,187,right,1,0.780960149963,2017_Mai_29_1807,98.5343221051,Stroop,B-1,1STACS-8,
neutral,down,"[-0.7725490196, 0.0745098039, -1]", ,13,SOLL,,,,,,,,,0,188,188,188,down,1,0.66677552594,2017_Mai_29_1807,98.5343221051,Stroop,B-1,1STACS-8,
neutral,down,"[-0.7725490196, 0.0745098039, -1]", ,10,PECH,,,,,,,,,0,189,189,189,down,1,0.631324651597,2017_Mai_29_1807,98.5343221051,Stroop,B-1,1STACS-8,
neutral,right,"[-0.8745098039, -0.2078431373, 0.637254902]", ,14,SOLL,,,,,,,,,0,190,190,190,right,1,1.10512984192,2017_Mai_29_1807,98.5343221051,Stroop,B-1,1STACS-8,
congruent,down,"[-0.7725490196, 0.0745098039, -1]", ,4,GRÜN,,,,,,,,,0,191,191,191,down,1,0.706497334158,2017_Mai_29_1807,98.5343221051,Stroop,B-1,1STACS-8,
congruent,right,"[-0.8745098039, -0.2078431373, 0.637254902]", ,8,BLAU,,,,,,,,,0,192,192,192,down,0,1.40599936584,2017_Mai_29_1807,98.5343221051,Stroop,B-1,1STACS-8,
congruent,right,"[-0.8745098039, -0.2078431373, 0.637254902]", ,8,BLAU,,,,,,,,,0,193,193,193,right,1,0.642762697494,2017_Mai_29_1807,98.5343221051,Stroop,B-1,1STACS-8,
congruent,down,"[-0.7725490196, 0.0745098039, -1]", ,4,GRÜN,,,,,,,,,0,194,194,194,down,1,0.717271049812,2017_Mai_29_1807,98.5343221051,Stroop,B-1,1STACS-8,
neutral,left,"[0.568627451, -0.7882352941, -0.7882352941]", ,12,SOLL,,,,,,,,,0,195,195,195,left,1,0.781154588083,2017_Mai_29_1807,98.5343221051,Stroop,B-1,1STACS-8,
fix,return,white, ,21,+,,,,,,,,,0,196,196,196,None,0,,2017_Mai_29_1807,98.5343221051,Stroop,B-1,1STACS-8,
fix,return,white, ,21,+,,,,,,,,,0,197,197,197,None,0,,2017_Mai_29_1807,98.5343221051,Stroop,B-1,1STACS-8,
fix,return,white, ,21,+,,,,,,,,,0,198,198,198,None,0,,2017_Mai_29_1807,98.5343221051,Stroop,B-1,1STACS-8,
fix,return,white, ,21,+,,,,,,,,,0,199,199,199,None,0,,2017_Mai_29_1807,98.5343221051,Stroop,B-1,1STACS-8,
fix,return,white, ,21,+,,,,,,,,,0,200,200,200,None,0,,2017_Mai_29_1807,98.5343221051,Stroop,B-1,1STACS-8,
fix,return,white, ,21,+,,,,,,,,,0,201,201,201,None,0,,2017_Mai_29_1807,98.5343221051,Stroop,B-1,1STACS-8,
fix,return,white, ,21,+,,,,,,,,,0,202,202,202,None,0,,2017_Mai_29_1807,98.5343221051,Stroop,B-1,1STACS-8,
fix,return,white, ,21,+,,,,,,,,,0,203,203,203,None,0,,2017_Mai_29_1807,98.5343221051,Stroop,B-1,1STACS-8,
fix,return,white, ,21,+,,,,,,,,,0,204,204,204,None,0,,2017_Mai_29_1807,98.5343221051,Stroop,B-1,1STACS-8,
fix,return,white, ,21,+,,,,,,,,,0,205,205,205,None,0,,2017_Mai_29_1807,98.5343221051,Stroop,B-1,1STACS-8,
fix,return,white, ,21,+,,,,,,,,,0,206,206,206,None,0,,2017_Mai_29_1807,98.5343221051,Stroop,B-1,1STACS-8,
fix,return,white, ,21,+,,,,,,,,,0,207,207,207,None,0,,2017_Mai_29_1807,98.5343221051,Stroop,B-1,1STACS-8,
fix,return,white,+,22,+,,,,,,,,,0,208,208,208,None,0,,2017_Mai_29_1807,98.5343221051,Stroop,B-1,1STACS-8,
neutral,down,"[-0.7725490196, 0.0745098039, -1]", ,13,SOLL,,,,,,,,,0,209,209,209,down,1,0.727299139975,2017_Mai_29_1807,98.5343221051,Stroop,B-1,1STACS-8,
neutral,left,"[0.568627451, -0.7882352941, -0.7882352941]", ,12,SOLL,,,,,,,,,0,210,210,210,left,1,0.481361457951,2017_Mai_29_1807,98.5343221051,Stroop,B-1,1STACS-8,
congruent,down,"[-0.7725490196, 0.0745098039, -1]", ,4,GRÜN,,,,,,,,,0,211,211,211,down,1,0.504822540295,2017_Mai_29_1807,98.5343221051,Stroop,B-1,1STACS-8,
congruent,left,"[0.568627451, -0.7882352941, -0.7882352941]", ,0,ROT,,,,,,,,,0,212,212,212,left,1,0.643788526196,2017_Mai_29_1807,98.5343221051,Stroop,B-1,1STACS-8,
congruent,right,"[-0.8745098039, -0.2078431373, 0.637254902]", ,8,BLAU,,,,,,,,,0,213,213,213,down,0,0.815328484486,2017_Mai_29_1807,98.5343221051,Stroop,B-1,1STACS-8,
congruent,right,"[-0.8745098039, -0.2078431373, 0.637254902]", ,8,BLAU,,,,,,,,,0,214,214,214,right,1,0.879735552982,2017_Mai_29_1807,98.5343221051,Stroop,B-1,1STACS-8,
congruent,left,"[0.568627451, -0.7882352941, -0.7882352941]", ,0,ROT,,,,,,,,,0,215,215,215,None,0,,2017_Mai_29_1807,98.5343221051,Stroop,B-1,1STACS-8,
neutral,right,"[-0.8745098039, -0.2078431373, 0.637254902]", ,11,PECH,,,,,,,,,0,216,216,216,right,1,0.876017762034,2017_Mai_29_1807,98.5343221051,Stroop,B-1,1STACS-8,
neutral,right,"[-0.8745098039, -0.2078431373, 0.637254902]", ,14,SOLL,,,,,,,,,0,217,217,217,right,1,0.419402186591,2017_Mai_29_1807,98.5343221051,Stroop,B-1,1STACS-8,
congruent,down,"[-0.7725490196, 0.0745098039, -1]", ,4,GRÜN,,,,,,,,,0,218,218,218,down,1,0.45083020328,2017_Mai_29_1807,98.5343221051,Stroop,B-1,1STACS-8,
neutral,left,"[0.568627451, -0.7882352941, -0.7882352941]", ,9,PECH,,,,,,,,,0,219,219,219,left,1,0.619078681788,2017_Mai_29_1807,98.5343221051,Stroop,B-1,1STACS-8,
neutral,down,"[-0.7725490196, 0.0745098039, -1]", ,10,PECH,,,,,,,,,0,220,220,220,down,1,0.840729198823,2017_Mai_29_1807,98.5343221051,Stroop,B-1,1STACS-8,
neutralofneutral,right,"[-0.8745098039, -0.2078431373, 0.637254902]", ,17,HALS,,,,,,,,,0,221,221,221,right,1,0.984627934556,2017_Mai_29_1807,98.5343221051,Stroop,B-1,1STACS-8,
neutral,right,"[-0.8745098039, -0.2078431373, 0.637254902]", ,11,PECH,,,,,,,,,0,222,222,222,right,1,0.713245398507,2017_Mai_29_1807,98.5343221051,Stroop,B-1,1STACS-8,
neutralofneutral,right,"[-0.8745098039, -0.2078431373, 0.637254902]", ,20,MODE,,,,,,,,,0,223,223,223,right,1,0.535118569539,2017_Mai_29_1807,98.5343221051,Stroop,B-1,1STACS-8,
neutral,down,"[-0.7725490196, 0.0745098039, -1]", ,13,SOLL,,,,,,,,,0,224,224,224,down,1,0.720280370829,2017_Mai_29_1807,98.5343221051,Stroop,B-1,1STACS-8,
neutral,left,"[0.568627451, -0.7882352941, -0.7882352941]", ,12,SOLL,,,,,,,,,0,225,225,225,left,1,0.602388292367,2017_Mai_29_1807,98.5343221051,Stroop,B-1,1STACS-8,
neutralofneutral,down,"[-0.7725490196, 0.0745098039, -1]", ,16,HALS,,,,,,,,,0,226,226,226,down,1,0.645894939161,2017_Mai_29_1807,98.5343221051,Stroop,B-1,1STACS-8,
neutralofneutral,left,"[0.568627451, -0.7882352941, -0.7882352941]", ,18,MODE,,,,,,,,,0,227,227,227,left,1,1.19976561267,2017_Mai_29_1807,98.5343221051,Stroop,B-1,1STACS-8,
neutral,left,"[0.568627451, -0.7882352941, -0.7882352941]", ,9,PECH,,,,,,,,,0,228,228,228,left,1,0.428768460796,2017_Mai_29_1807,98.5343221051,Stroop,B-1,1STACS-8,
neutralofneutral,down,"[-0.7725490196, 0.0745098039, -1]", ,19,MODE,,,,,,,,,0,229,229,229,right,0,0.827443432056,2017_Mai_29_1807,98.5343221051,Stroop,B-1,1STACS-8,
neutral,down,"[-0.7725490196, 0.0745098039, -1]", ,10,PECH,,,,,,,,,0,230,230,230,down,1,0.523898707797,2017_Mai_29_1807,98.5343221051,Stroop,B-1,1STACS-8,
neutralofneutral,left,"[0.568627451, -0.7882352941, -0.7882352941]", ,15,HALS,,,,,,,,,0,231,231,231,left,1,0.709508610731,2017_Mai_29_1807,98.5343221051,Stroop,B-1,1STACS-8,
neutral,right,"[-0.8745098039, -0.2078431373, 0.637254902]", ,14,SOLL,,,,,,,,,0,232,232,232,right,1,0.64472328187,2017_Mai_29_1807,98.5343221051,Stroop,B-1,1STACS-8,
incongruent,left,"[0.568627451, -0.7882352941, -0.7882352941]", ,3,GRÜN,,,,,,,,,0,233,233,233,down,0,0.666142205225,2017_Mai_29_1807,98.5343221051,Stroop,B-1,1STACS-8,
incongruent,down,"[-0.7725490196, 0.0745098039, -1]", ,1,ROT,,,,,,,,,0,234,234,234,down,1,0.837730773045,2017_Mai_29_1807,98.5343221051,Stroop,B-1,1STACS-8,
neutral,down,"[-0.7725490196, 0.0745098039, -1]", ,13,SOLL,,,,,,,,,0,235,235,235,down,1,0.588369471539,2017_Mai_29_1807,98.5343221051,Stroop,B-1,1STACS-8,
neutral,down,"[-0.7725490196, 0.0745098039, -1]", ,10,PECH,,,,,,,,,0,236,236,236,down,1,0.479433559293,2017_Mai_29_1807,98.5343221051,Stroop,B-1,1STACS-8,
neutral,left,"[0.568627451, -0.7882352941, -0.7882352941]", ,9,PECH,,,,,,,,,0,237,237,237,left,1,0.500347669885,2017_Mai_29_1807,98.5343221051,Stroop,B-1,1STACS-8,
incongruent,right,"[-0.8745098039, -0.2078431373, 0.637254902]", ,2,ROT,,,,,,,,,0,238,238,238,right,1,0.989911287608,2017_Mai_29_1807,98.5343221051,Stroop,B-1,1STACS-8,
neutral,right,"[-0.8745098039, -0.2078431373, 0.637254902]", ,11,PECH,,,,,,,,,0,239,239,239,right,1,0.696087631249,2017_Mai_29_1807,98.5343221051,Stroop,B-1,1STACS-8,
incongruent,down,"[-0.7725490196, 0.0745098039, -1]", ,7,BLAU,,,,,,,,,0,240,240,240,down,1,0.634464994853,2017_Mai_29_1807,98.5343221051,Stroop,B-1,1STACS-8,
incongruent,left,"[0.568627451, -0.7882352941, -0.7882352941]", ,6,BLAU,,,,,,,,,0,241,241,241,left,1,0.82785437814,2017_Mai_29_1807,98.5343221051,Stroop,B-1,1STACS-8,
neutral,left,"[0.568627451, -0.7882352941, -0.7882352941]", ,12,SOLL,,,,,,,,,0,242,242,242,left,1,0.494367300872,2017_Mai_29_1807,98.5343221051,Stroop,B-1,1STACS-8,
neutral,right,"[-0.8745098039, -0.2078431373, 0.637254902]", ,14,SOLL,,,,,,,,,0,243,243,243,down,0,0.569718497742,2017_Mai_29_1807,98.5343221051,Stroop,B-1,1STACS-8,
incongruent,right,"[-0.8745098039, -0.2078431373, 0.637254902]", ,5,GRÜN,,,,,,,,,0,244,244,244,right,1,1.26328485883,2017_Mai_29_1807,98.5343221051,Stroop,B-1,1STACS-8,
fix,return,white, ,21,+,,,,,,,,,0,245,245,245,None,0,,2017_Mai_29_1807,98.5343221051,Stroop,B-1,1STACS-8,
fix,return,white, ,21,+,,,,,,,,,0,246,246,246,None,0,,2017_Mai_29_1807,98.5343221051,Stroop,B-1,1STACS-8,
fix,return,white, ,21,+,,,,,,,,,0,247,247,247,None,0,,2017_Mai_29_1807,98.5343221051,Stroop,B-1,1STACS-8,
fix,return,white, ,21,+,,,,,,,,,0,248,248,248,None,0,,2017_Mai_29_1807,98.5343221051,Stroop,B-1,1STACS-8,
fix,return,white, ,21,+,,,,,,,,,0,249,249,249,None,0,,2017_Mai_29_1807,98.5343221051,Stroop,B-1,1STACS-8,
fix,return,white, ,21,+,,,,,,,,,0,250,250,250,None,0,,2017_Mai_29_1807,98.5343221051,Stroop,B-1,1STACS-8,
fix,return,white, ,21,+,,,,,,,,,0,251,251,251,None,0,,2017_Mai_29_1807,98.5343221051,Stroop,B-1,1STACS-8,
fix,return,white, ,21,+,,,,,,,,,0,252,252,252,None,0,,2017_Mai_29_1807,98.5343221051,Stroop,B-1,1STACS-8,
fix,return,white, ,21,+,,,,,,,,,0,253,253,253,None,0,,2017_Mai_29_1807,98.5343221051,Stroop,B-1,1STACS-8,
fix,return,white, ,21,+,,,,,,,,,0,254,254,254,None,0,,2017_Mai_29_1807,98.5343221051,Stroop,B-1,1STACS-8,
fix,return,white, ,21,+,,,,,,,,,0,255,255,255,None,0,,2017_Mai_29_1807,98.5343221051,Stroop,B-1,1STACS-8,
fix,return,white, ,21,+,,,,,,,,,0,256,256,256,None,0,,2017_Mai_29_1807,98.5343221051,Stroop,B-1,1STACS-8,
fix,return,white,+,22,+,,,,,,,,,0,257,257,257,None,0,,2017_Mai_29_1807,98.5343221051,Stroop,B-1,1STACS-8,
incongruent,right,"[-0.8745098039, -0.2078431373, 0.637254902]", ,5,GRÜN,,,,,,,,,0,258,258,258,right,1,0.892161433925,2017_Mai_29_1807,98.5343221051,Stroop,B-1,1STACS-8,
neutral,left,"[0.568627451, -0.7882352941, -0.7882352941]", ,9,PECH,,,,,,,,,0,259,259,259,left,1,0.694925751736,2017_Mai_29_1807,98.5343221051,Stroop,B-1,1STACS-8,
incongruent,down,"[-0.7725490196, 0.0745098039, -1]", ,7,BLAU,,,,,,,,,0,260,260,260,down,1,0.516231811585,2017_Mai_29_1807,98.5343221051,Stroop,B-1,1STACS-8,
incongruent,right,"[-0.8745098039, -0.2078431373, 0.637254902]", ,2,ROT,,,,,,,,,0,261,261,261,right,1,0.997742729872,2017_Mai_29_1807,98.5343221051,Stroop,B-1,1STACS-8,
neutral,down,"[-0.7725490196, 0.0745098039, -1]", ,13,SOLL,,,,,,,,,0,262,262,262,down,1,1.31046739181,2017_Mai_29_1807,98.5343221051,Stroop,B-1,1STACS-8,
incongruent,left,"[0.568627451, -0.7882352941, -0.7882352941]", ,3,GRÜN,,,,,,,,,0,263,263,263,left,1,1.01667586244,2017_Mai_29_1807,98.5343221051,Stroop,B-1,1STACS-8,
incongruent,left,"[0.568627451, -0.7882352941, -0.7882352941]", ,6,BLAU,,,,,,,,,0,264,264,264,left,1,0.481861521506,2017_Mai_29_1807,98.5343221051,Stroop,B-1,1STACS-8,
neutral,down,"[-0.7725490196, 0.0745098039, -1]", ,10,PECH,,,,,,,,,0,265,265,265,down,1,0.926376117635,2017_Mai_29_1807,98.5343221051,Stroop,B-1,1STACS-8,
neutral,right,"[-0.8745098039, -0.2078431373, 0.637254902]", ,14,SOLL,,,,,,,,,0,266,266,266,right,1,0.602222908219,2017_Mai_29_1807,98.5343221051,Stroop,B-1,1STACS-8,
incongruent,down,"[-0.7725490196, 0.0745098039, -1]", ,1,ROT,,,,,,,,,0,267,267,267,right,0,0.795432659737,2017_Mai_29_1807,98.5343221051,Stroop,B-1,1STACS-8,
neutral,left,"[0.568627451, -0.7882352941, -0.7882352941]", ,12,SOLL,,,,,,,,,0,268,268,268,left,1,1.33774096987,2017_Mai_29_1807,98.5343221051,Stroop,B-1,1STACS-8,
neutral,right,"[-0.8745098039, -0.2078431373, 0.637254902]", ,11,PECH,,,,,,,,,0,269,269,269,down,0,0.664569938358,2017_Mai_29_1807,98.5343221051,Stroop,B-1,1STACS-8,
neutral,right,"[-0.8745098039, -0.2078431373, 0.637254902]", ,11,PECH,,,,,,,,,0,270,270,270,right,1,1.29956852058,2017_Mai_29_1807,98.5343221051,Stroop,B-1,1STACS-8,
neutralofneutral,down,"[-0.7725490196, 0.0745098039, -1]", ,19,MODE,,,,,,,,,0,271,271,271,down,1,0.902842959091,2017_Mai_29_1807,98.5343221051,Stroop,B-1,1STACS-8,
neutralofneutral,down,"[-0.7725490196, 0.0745098039, -1]", ,16,HALS,,,,,,,,,0,272,272,272,down,1,0.441177579832,2017_Mai_29_1807,98.5343221051,Stroop,B-1,1STACS-8,
neutral,down,"[-0.7725490196, 0.0745098039, -1]", ,10,PECH,,,,,,,,,0,273,273,273,down,1,0.577663082878,2017_Mai_29_1807,98.5343221051,Stroop,B-1,1STACS-8,
neutralofneutral,left,"[0.568627451, -0.7882352941, -0.7882352941]", ,15,HALS,,,,,,,,,0,274,274,274,left,1,0.559106813855,2017_Mai_29_1807,98.5343221051,Stroop,B-1,1STACS-8,
neutral,down,"[-0.7725490196, 0.0745098039, -1]", ,13,SOLL,,,,,,,,,0,275,275,275,down,1,0.816000636952,2017_Mai_29_1807,98.5343221051,Stroop,B-1,1STACS-8,
neutralofneutral,right,"[-0.8745098039, -0.2078431373, 0.637254902]", ,20,MODE,,,,,,,,,0,276,276,276,right,1,0.69550599308,2017_Mai_29_1807,98.5343221051,Stroop,B-1,1STACS-8,
neutral,right,"[-0.8745098039, -0.2078431373, 0.637254902]", ,14,SOLL,,,,,,,,,0,277,277,277,right,1,0.417382376811,2017_Mai_29_1807,98.5343221051,Stroop,B-1,1STACS-8,
neutralofneutral,left,"[0.568627451, -0.7882352941, -0.7882352941]", ,18,MODE,,,,,,,,,0,278,278,278,left,1,0.984460315487,2017_Mai_29_1807,98.5343221051,Stroop,B-1,1STACS-8,
neutral,left,"[0.568627451, -0.7882352941, -0.7882352941]", ,9,PECH,,,,,,,,,0,279,279,279,left,1,0.660162394941,2017_Mai_29_1807,98.5343221051,Stroop,B-1,1STACS-8,
neutralofneutral,right,"[-0.8745098039, -0.2078431373, 0.637254902]", ,17,HALS,,,,,,,,,0,280,280,280,down,0,0.51558871309,2017_Mai_29_1807,98.5343221051,Stroop,B-1,1STACS-8,
neutral,left,"[0.568627451, -0.7882352941, -0.7882352941]", ,12,SOLL,,,,,,,,,0,281,281,281,left,1,0.967360656173,2017_Mai_29_1807,98.5343221051,Stroop,B-1,1STACS-8,
congruent,right,"[-0.8745098039, -0.2078431373, 0.637254902]", ,8,BLAU,,,,,,,,,0,282,282,282,right,1,0.946452970978,2017_Mai_29_1807,98.5343221051,Stroop,B-1,1STACS-8,
neutral,down,"[-0.7725490196, 0.0745098039, -1]", ,13,SOLL,,,,,,,,,0,283,283,283,down,1,0.913734846189,2017_Mai_29_1807,98.5343221051,Stroop,B-1,1STACS-8,
neutral,left,"[0.568627451, -0.7882352941, -0.7882352941]", ,12,SOLL,,,,,,,,,0,284,284,284,left,1,0.623308269627,2017_Mai_29_1807,98.5343221051,Stroop,B-1,1STACS-8,
neutral,down,"[-0.7725490196, 0.0745098039, -1]", ,10,PECH,,,,,,,,,0,285,285,285,down,1,0.739685630436,2017_Mai_29_1807,98.5343221051,Stroop,B-1,1STACS-8,
neutral,left,"[0.568627451, -0.7882352941, -0.7882352941]", ,9,PECH,,,,,,,,,0,286,286,286,left,1,1.08936945897,2017_Mai_29_1807,98.5343221051,Stroop,B-1,1STACS-8,
neutral,right,"[-0.8745098039, -0.2078431373, 0.637254902]", ,11,PECH,,,,,,,,,0,287,287,287,right,1,1.06800473244,2017_Mai_29_1807,98.5343221051,Stroop,B-1,1STACS-8,
congruent,down,"[-0.7725490196, 0.0745098039, -1]", ,4,GRÜN,,,,,,,,,0,288,288,288,down,1,1.01014598224,2017_Mai_29_1807,98.5343221051,Stroop,B-1,1STACS-8,
neutral,right,"[-0.8745098039, -0.2078431373, 0.637254902]", ,14,SOLL,,,,,,,,,0,289,289,289,right,1,0.870251107333,2017_Mai_29_1807,98.5343221051,Stroop,B-1,1STACS-8,
congruent,left,"[0.568627451, -0.7882352941, -0.7882352941]", ,0,ROT,,,,,,,,,0,290,290,290,left,1,0.652454711423,2017_Mai_29_1807,98.5343221051,Stroop,B-1,1STACS-8,
congruent,right,"[-0.8745098039, -0.2078431373, 0.637254902]", ,8,BLAU,,,,,,,,,0,291,291,291,down,0,0.663690496977,2017_Mai_29_1807,98.5343221051,Stroop,B-1,1STACS-8,
congruent,down,"[-0.7725490196, 0.0745098039, -1]", ,4,GRÜN,,,,,,,,,0,292,292,292,down,1,0.513380052493,2017_Mai_29_1807,98.5343221051,Stroop,B-1,1STACS-8,
congruent,left,"[0.568627451, -0.7882352941, -0.7882352941]", ,0,ROT,,,,,,,,,0,293,293,293,left,1,0.844950126343,2017_Mai_29_1807,98.5343221051,Stroop,B-1,1STACS-8,
fix,return,white, ,21,+,,,,,,,,,0,294,294,294,None,0,,2017_Mai_29_1807,98.5343221051,Stroop,B-1,1STACS-8,
fix,return,white, ,21,+,,,,,,,,,0,295,295,295,None,0,,2017_Mai_29_1807,98.5343221051,Stroop,B-1,1STACS-8,
fix,return,white, ,21,+,,,,,,,,,0,296,296,296,None,0,,2017_Mai_29_1807,98.5343221051,Stroop,B-1,1STACS-8,
fix,return,white, ,21,+,,,,,,,,,0,297,297,297,None,0,,2017_Mai_29_1807,98.5343221051,Stroop,B-1,1STACS-8,
fix,return,white, ,21,+,,,,,,,,,0,298,298,298,None,0,,2017_Mai_29_1807,98.5343221051,Stroop,B-1,1STACS-8,
fix,return,white, ,21,+,,,,,,,,,0,299,299,299,None,0,,2017_Mai_29_1807,98.5343221051,Stroop,B-1,1STACS-8,
fix,return,white, ,21,+,,,,,,,,,0,300,300,300,None,0,,2017_Mai_29_1807,98.5343221051,Stroop,B-1,1STACS-8,
fix,return,white, ,21,+,,,,,,,,,0,301,301,301,None,0,,2017_Mai_29_1807,98.5343221051,Stroop,B-1,1STACS-8,
fix,return,white, ,21,+,,,,,,,,,0,302,302,302,None,0,,2017_Mai_29_1807,98.5343221051,Stroop,B-1,1STACS-8,
fix,return,white, ,21,+,,,,,,,,,0,303,303,303,None,0,,2017_Mai_29_1807,98.5343221051,Stroop,B-1,1STACS-8,
fix,return,white, ,21,+,,,,,,,,,0,304,304,304,None,0,,2017_Mai_29_1807,98.5343221051,Stroop,B-1,1STACS-8,
fix,return,white, ,21,+,,,,,,,,,0,305,305,305,None,0,,2017_Mai_29_1807,98.5343221051,Stroop,B-1,1STACS-8,
fix,return,white,+,22,+,,,,,,,,,0,306,306,306,None,0,,2017_Mai_29_1807,98.5343221051,Stroop,B-1,1STACS-8,
