best_paramset_1 = [96.991714601200002, 0.298897158986, 24.999894031, 4.4170431352500001, 160.550675394, 376.26304648199999, 215.475792372]
best_paramset_statistic_1 = 16.8618678479
best_paramset_2 = [99.872950294600003, 0.28652869564200001, 11.664958604900001, 5.5479215110000002, 116.952491745, 364.33154430000002, 227.92308015099999]
best_paramset_statistic_2 = 18.2949897425
ID = "SMRI5sham"