best_paramset_1 = [153.650832872, 0.72474730829300005, 15.6817920424, 3.3736200255600002, 120.135242885, 335.114153606, 88.637379021399994]
best_paramset_statistic_1 = 1.20597027465
best_paramset_2 = [122.21059425200001, 0.68536080803800004, 15.5064430909, 2.86674990213, 124.293953913, 368.85705098599999, 109.965171105]
best_paramset_statistic_2 = 1.25422598178
ID = "Tarana_propersims_49"