﻿Simulation No.,Parameters,,,,,,,Total RT,,RT Congruent Correct,,RT Incongruent Correct,,Compatibility Effect,Error Rates,,,RT Quantiles Correct,,,,,,,,,,RT Quantiles Incorrect,,,,,,,,,,Accuracy,Congruent Data,,,,,,,,,,,,,,Incongruent Data,,,,,,,,,,,,,,tmax
,b_1,mu_c,A,shape,tau,mu_r,s_r,Mean,SD,Mean,SD,Mean ,SD,,Total,Congruent,Incongruent,[10],[20],[30],[40],[50],[60],[70],[80],[90],[100],[10],[20],[30],[40],[50],[60],[70],[80],[90],[100],,,,,,,,,,,,,,,,,,,,,,,,,,,,,,
0,41,0.5,32,3.8,88,465,87,537.4079778,59.52971583,532.8839223,51.04681751,542.5040403,67.46384762,9.620117972,0.075,0.02,0.13,471.6616126,488.2064371,503.1063744,516.538565,525.1282157,539.5958978,558.0586387,580.8219235,616.2247653,798.3062478,477.226396,497.2439877,511.8270594,525.5754048,550.9731575,558.5583362,571.6503186,582.9761715,610.1021683,706.4782827,0.925,294,0.98,474.6780845,503.3140466,526.017389,552.8869384,592.1123987,6,0.02,469.479946,490.301788,504.5522416,511.9100967,539.9170981,261,0.87,468.3351606,502.4760886,524.2325681,564.996025,633.4381902,39,0.13,479.9872048,520.6393523,554.9310136,580.6934378,617.8573234,246.4
1,124,0.4,15,4.4,78,373,116,682.4016081,180.6777724,653.5082542,180.3536766,711.4888771,176.2831628,57.98062284,0.003333333,0,0.006666667,494.581996,532.8582307,573.9587849,607.6116723,645.4298761,685.8898502,740.9182997,808.151964,909.0461567,1705.191912,588.1807516,588.4502702,588.7197889,588.9893075,589.2588261,589.5283448,589.7978634,590.067382,590.3369007,590.6064193,0.996666667,300,1,482.2578466,545.9563028,606.9703916,687.6742377,866.5476722,0,0,0,0,0,0,0,298,0.993333333,515.3148034,611.0606719,684.7955889,772.5798085,942.6856532,2,0.006666667,588.1807516,588.7197889,589.2588261,589.7978634,590.3369007,265.2
2,87,0.4,33,3,133,496,119,717.8949859,147.8107161,672.0061882,129.8433727,764.8801029,150.3070408,92.87391461,0.011666667,0,0.023333333,561.6535814,595.5187231,624.6001907,654.514146,683.961434,727.0640078,766.7145594,825.3586305,902.5338141,1390.642546,573.7505473,613.9267421,641.566792,656.0753633,664.0181954,705.6669115,733.8395171,735.0599017,764.6815185,808.5037514,0.988333333,300,1,554.0584744,600.3699144,644.1117007,699.135678,823.5661794,0,0,0,0,0,0,0,293,0.976666667,582.7160523,673.1296825,752.5237514,826.4685838,949.8730638,7,0.023333333,573.7505473,641.566792,664.0181954,733.8395171,764.6815185,266
3,93,0.4,33,4.1,90,423,125,671.7122636,156.9792679,617.9573643,132.4450399,726.3813618,161.0484779,108.4239976,0.011666667,0.003333333,0.02,506.2880641,547.6990253,574.2108805,602.0825799,642.4634012,679.5314737,716.9611847,781.6162666,862.0296379,1435.829803,543.111986,546.2756919,547.5886036,556.1225678,568.2670583,570.4323879,579.2073337,601.2015121,644.1136628,697.4847997,0.988333333,299,0.996666667,494.1597102,550.7148539,589.395464,644.9518924,746.2160586,1,0.003333333,697.4847997,697.4847997,697.4847997,697.4847997,697.4847997,294,0.98,532.6390944,639.0565793,707.1508456,787.1470062,926.0396276,6,0.02,542.4304689,546.9321478,558.1466496,570.0714996,590.2044229,279
4,140,0.4,30,4.1,130,464,93,818.2307462,185.6670818,765.4640607,159.490827,870.9974317,194.7782341,105.533371,0,0,0,626.6863079,660.4634792,695.7370747,731.9541336,780.6716418,825.4625465,877.1742445,936.0016892,1074.626131,1680.269142,0,0,0,0,0,0,0,0,0,0,1,300,1,617.4696706,669.8485918,723.4641174,816.343759,929.3014094,0,0,0,0,0,0,0,300,1,644.2214957,747.3183771,836.1682882,948.6469801,1152.21289,0,0,0,0,0,0,0,403
5,40,0.6,23,4.3,64,325,124,391.607253,59.62534773,384.7263702,50.12920305,398.6589379,67.26849516,13.93256769,0.048333333,0.036666667,0.06,320.7018124,341.2370048,358.3809706,372.1957226,386.5637482,398.7269274,412.5558375,434.1570919,462.9181811,689.922644,336.8118551,363.880553,375.7563221,395.412907,404.7214366,409.9786841,437.0193605,476.5129141,516.9975301,604.9621342,0.951666667,289,0.963333333,320.7641398,355.1558895,381.2620042,410.4971754,450.5922864,11,0.036666667,337.1961551,371.0903366,396.2544819,404.7214366,441.5438513,282,0.94,318.5559034,361.3139001,390.3887925,415.8704504,478.6366451,18,0.06,343.9295968,383.2832234,409.054279,469.3923756,561.2521905,211.2
6,125,0.8,29,3.5,99,429,109,589.0225153,76.04583136,566.8937541,66.45303543,611.1512764,78.55295585,44.25752236,0,0,0,501.0559838,524.4534052,543.0203774,560.4738556,581.5297441,598.5099475,618.0934544,644.4563908,691.9991085,875.8902616,0,0,0,0,0,0,0,0,0,0,1,300,1,494.5930544,530.6086116,555.3938966,593.7536636,655.9468471,0,0,0,0,0,0,0,300,1,518.6437789,569.5280525,607.7773959,641.3958463,709.7579767,0,0,0,0,0,0,0,247.5
7,44,0.4,32,2.8,53,353,111,437.4416007,76.5251831,410.4424455,61.16424062,475.898934,79.69606658,65.45648842,0.171666667,0.026666667,0.316666667,355.735925,378.2977196,396.0448024,410.8321861,424.0232367,439.230663,461.8121897,484.8469469,526.4018974,998.3439446,355.8716377,371.9028815,385.2574358,397.758268,409.5324689,423.9787021,435.9828718,454.3750202,503.739667,658.2888274,0.828333333,292,0.973333333,348.3368476,378.3232481,405.2335695,426.7870047,470.9067488,8,0.026666667,396.5886116,426.4519105,485.0474658,591.8795613,632.26175,205,0.683333333,394.7261735,431.3338897,468.9202567,502.2255397,561.8618078,95,0.316666667,355.5133597,381.2287855,406.5806465,431.2186944,492.98087,95.4
8,119,0.7,26,3.9,88,412,76,589.8787814,84.27272997,562.5113361,66.14328501,617.3377566,91.2825001,54.82642051,0.001666667,0,0.003333333,498.1596435,518.6342633,540.5340651,552.3719748,574.3463893,595.9152082,619.6316875,659.0662966,703.9379992,963.2280172,636.7647533,636.7647533,636.7647533,636.7647533,636.7647533,636.7647533,636.7647533,636.7647533,636.7647533,636.7647533,0.998333333,300,1,491.7727402,523.2462887,549.1347223,583.0287434,643.7322607,0,0,0,0,0,0,0,299,0.996666667,506.0539035,561.0147702,601.8648545,663.5433667,735.88118,1,0.003333333,636.7647533,636.7647533,636.7647533,636.7647533,636.7647533,255.2
9,99,0.3,34,4.1,84,266,78,580.7251889,214.663793,505.784985,176.4192988,659.1200832,222.9487092,153.3350982,0.035117057,0.013377926,0.056856187,374.2929393,408.4472076,441.3266151,472.5947821,523.1228752,579.1952944,635.4072677,716.7797036,854.5816045,1618.99325,369.8139775,394.7101807,404.0104515,433.3663993,443.2260481,506.3570774,600.8145252,678.4487821,722.3103788,1199.273542,0.964882943,295,0.986622074,360.5179461,402.7784679,446.3870891,513.2231045,724.7535655,4,0.013377926,459.5607887,684.774723,727.8754424,780.0238097,1059.523631,282,0.943143813,427.9586499,536.9881197,611.6768178,717.2361187,932.0246695,17,0.056856187,372.3371491,403.6379278,436.6445781,508.6718484,644.1783307,260.4
10,102,0.7,40,4.2,103,424,76,575.7647941,75.8989113,552.1741942,53.8095299,599.3553941,86.67635869,47.18119986,0,0,0,490.8767214,515.3991719,530.2280647,545.2850851,566.021942,580.929671,596.3380225,626.9515427,689.0024133,862.1077365,0,0,0,0,0,0,0,0,0,0,1,300,1,487.2434673,521.7911748,549.6344153,577.8030927,611.8844618,0,0,0,0,0,0,0,300,1,497.298651,541.3287765,583.4332432,642.1030349,713.3317508,0,0,0,0,0,0,0,329.6
11,90,0.7,32,2.9,133,478,129,613.4228117,81.41057408,587.0380507,64.52653898,639.895816,87.75321011,52.85776538,0.001666667,0,0.003333333,518.5945692,542.980424,564.8590314,582.410851,603.0588607,622.2722936,644.3350415,675.8307602,723.6350706,1084.414165,627.9076763,627.9076763,627.9076763,627.9076763,627.9076763,627.9076763,627.9076763,627.9076763,627.9076763,627.9076763,0.998333333,300,1,512.5986089,549.0191064,579.4339024,615.7042491,670.1928211,0,0,0,0,0,0,0,299,0.996666667,528.1209931,590.3866751,631.3780281,680.5908999,750.8432664,1,0.003333333,627.9076763,627.9076763,627.9076763,627.9076763,627.9076763,252.7
12,75,0.3,28,3.5,111,361,79,592.8170597,170.2413681,539.81302,134.4673117,648.500004,185.4230671,108.686984,0.053333333,0.03,0.076666667,430.5243511,453.5420725,479.2657234,511.3963277,548.0776845,585.7994896,644.8415196,699.0905211,819.6713659,1374.26158,436.6133105,460.7050311,496.0016866,528.8962205,554.8087324,576.7256577,611.309034,628.9898375,838.8590814,1830.105114,0.946666667,291,0.97,420.7101878,460.7302624,505.0474586,564.7080373,699.8280736,9,0.03,528.2444147,556.9975276,624.1177334,815.2318786,1648.15824,277,0.923333333,445.5946608,534.0882215,630.9113428,701.2041183,894.3370358,23,0.076666667,434.8792174,470.8276351,526.347129,587.5506322,628.7180976,277.5
13,62,0.2,23,3.6,67,468,48,669.9984711,156.347131,641.4705193,155.2286446,702.5100559,151.1856146,61.03953652,0.208333333,0.156666667,0.26,527.8010954,549.2675931,572.6514033,598.6819379,625.4582815,658.5882539,701.6182806,755.4935098,867.5208239,1409.126769,522.663505,541.3872038,570.2213438,598.7013927,631.1076103,663.8932681,702.3978315,759.222069,861.4030158,1368.715591,0.791666667,253,0.843333333,524.7050423,561.9886479,593.9909804,640.3156141,839.7227425,47,0.156666667,518.2509268,641.300409,718.5208454,827.3849528,1090.539403,222,0.74,532.1531931,613.9621904,680.7241328,751.8498987,906.3247054,78,0.26,528.3720242,561.3098419,600.7004631,653.9930359,738.3521017,174.2
14,98,0.4,40,3.7,51,291,55,523.9215684,157.0305782,480.2795164,172.4690896,568.4573143,124.6610756,88.17779784,0.013333333,0.003333333,0.023333333,372.5808982,395.9941375,422.8657934,460.6066686,487.9664548,525.4397984,565.0929727,621.1821861,713.9922127,1761.815234,368.8549045,381.5186231,400.8195187,404.8371067,410.1376562,417.8787295,430.4381505,446.9980553,491.6384876,572.8306268,0.986666667,299,0.996666667,359.253678,387.8427465,413.0078506,473.4310219,699.5550665,1,0.003333333,572.8306268,572.8306268,572.8306268,572.8306268,572.8306268,293,0.976666667,444.7497017,498.7436478,541.7462331,598.2805286,715.8304112,7,0.023333333,368.7952104,394.0032594,405.984989,417.8787295,442.0761547,137.7
15,48,0.7,30,2.9,99,318,77,389.7310864,55.3301725,371.0830026,36.96698831,409.0266731,63.89837255,37.94367048,0.023333333,0.006666667,0.04,332.9781689,345.1011027,357.4396936,368.7012577,379.4900601,391.1719836,404.254168,423.762914,460.4993587,659.3614599,345.7116288,355.2860229,386.4133478,391.4673072,398.2442185,403.2455468,409.8721619,416.4177742,456.9327867,475.6160616,0.976666667,298,0.993333333,329.6511769,350.5782894,367.1785991,385.0513029,414.466852,2,0.006666667,404.556661,405.5932158,406.6297705,407.6663253,408.70288,288,0.96,338.0011619,371.3777147,397.4364332,436.2551993,486.58577,12,0.04,343.0666427,365.8026612,393.3224061,411.0341016,468.2142596,188.1
16,54,0.6,33,4.4,70,345,50,438.9040415,70.45873746,426.3600443,55.20034081,451.7928908,81.28161192,25.43284644,0.016666667,0.003333333,0.03,375.5892366,388.7854449,397.1300409,408.5646724,419.3331416,432.469102,451.2278399,476.05435,525.3574061,808.8857435,392.6560995,400.8913552,404.179894,406.8789492,408.5971111,413.5323137,421.5041047,425.5824981,433.8014136,455.0682408,0.983333333,299,0.996666667,377.9095543,396.0909467,416.7567613,438.4219179,478.2873307,1,0.003333333,380.3701272,380.3701272,380.3701272,380.3701272,380.3701272,291,0.97,373.0368922,398.2089225,423.2835977,472.6831149,576.3381961,9,0.03,400.8913552,406.203693,408.9647606,422.624566,436.1643944,238
17,119,0.5,29,2.7,92,267,115,506.3383225,132.310451,468.8121339,134.6227427,543.9900166,118.5588001,75.17788269,0.001666667,0,0.003333333,369.0047397,392.96629,427.631605,450.8219227,482.0259715,511.3310234,548.5212828,596.9576298,677.1271757,1182.411461,380.3875223,380.3875223,380.3875223,380.3875223,380.3875223,380.3875223,380.3875223,380.3875223,380.3875223,380.3875223,0.998333333,300,1,345.6994723,391.525075,438.5596487,488.2557917,629.1651802,0,0,0,0,0,0,0,299,0.996666667,409.1986722,476.7083322,525.427865,585.0056342,700.8665735,1,0.003333333,380.3875223,380.3875223,380.3875223,380.3875223,380.3875223,156.4
18,97,0.8,23,3.3,124,327,87,451.1663529,62.33494633,437.2901865,51.86572796,465.0425193,68.52839807,27.75233283,0,0,0,382.2416714,399.8552062,413.3613376,428.733301,443.2353577,458.3285805,472.9890602,495.5206283,526.9017212,798.270605,0,0,0,0,0,0,0,0,0,0,1,300,1,377.2027281,405.521658,437.3484204,458.5765755,502.0818528,0,0,0,0,0,0,0,300,1,391.2426945,422.7583579,455.3138687,487.8063485,553.8364084,0,0,0,0,0,0,0,285.2
19,111,0.5,19,3.9,106,325,123,548.4806392,120.7861726,521.9113999,104.6234145,575.1387388,129.7142443,53.22733898,0.001666667,0,0.003333333,424.3115766,456.2159674,477.5782879,498.3063972,522.1256462,550.7948432,587.3911493,626.1686064,705.9417639,1201.554868,646.7285024,646.7285024,646.7285024,646.7285024,646.7285024,646.7285024,646.7285024,646.7285024,646.7285024,646.7285024,0.998333333,300,1,416.6928853,466.7016586,496.9868901,544.6759567,650.4026595,0,0,0,0,0,0,0,299,0.996666667,432.2988449,502.3228543,560.5827566,613.5655829,759.8039808,1,0.003333333,646.7285024,646.7285024,646.7285024,646.7285024,646.7285024,307.4
20,74,0.5,23,2.6,75,365,37,514.6796384,93.55509053,482.5081511,83.40758511,548.2009783,91.76883123,65.69282719,0.026666667,0.006666667,0.046666667,417.5717264,434.0828616,454.014489,469.1350756,492.2361145,516.2566011,544.7541839,589.9291618,647.5984845,961.6875738,439.2348384,443.784929,450.0670577,451.2059114,462.7535578,473.5132969,499.7254286,512.5909989,582.5746302,685.5271377,0.973333333,298,0.993333333,411.013035,430.9617476,458.2813344,495.6955446,599.0457696,2,0.006666667,625.6417464,638.9496111,652.2574758,665.5653406,678.8732053,286,0.953333333,444.6621794,492.2361145,532.5147863,586.9525994,665.9083735,14,0.046666667,438.2987915,448.4906916,455.0445713,475.6076243,510.3119851,120
21,67,0.6,21,3.9,101,456,32,565.1856724,65.22929606,556.3067571,54.72797596,574.0645877,73.19084986,17.75783052,0.01,0.01,0.01,501.8169971,514.4949637,527.1327849,539.4216685,549.7602087,562.4009377,580.3673986,608.1547954,648.3362063,900.3560855,506.1555455,523.020416,523.549316,524.0782159,541.9435105,559.808805,572.6543661,585.4999273,603.9069486,622.3139699,0.99,297,0.99,500.8244297,521.8858342,543.916101,571.8861328,635.9503999,3,0.01,496.2481831,510.1631995,524.0782159,538.3704516,552.6626872,297,0.99,502.1249441,532.8343772,554.8670553,590.7131084,664.9964204,3,0.01,535.5163182,560.5081228,585.4999273,600.2255443,614.9511614,292.9
22,142,0.7,36,4,95,423,94,637.2262377,94.67173032,599.8436412,65.39699157,674.6088342,104.1815219,74.76519296,0,0,0,537.4361505,561.1028478,579.6958757,597.24382,615.7634543,643.5146222,673.7821481,707.6162428,765.2589886,1028.866103,0,0,0,0,0,0,0,0,0,0,1,300,1,529.913338,566.5198932,591.2513143,618.4122372,678.4608386,0,0,0,0,0,0,0,300,1,548.2353641,610.4260327,667.5982102,718.8203279,818.4411414,0,0,0,0,0,0,0,285
23,120,0.3,17,2.6,62,408,85,815.0234157,252.2006885,802.2783912,276.182223,827.9436295,224.5617424,25.66523821,0.01512605,0.010067114,0.02020202,565.654338,617.5031255,662.2227675,695.2368597,747.4677241,804.6692991,884.050665,972.464188,1144.870611,1904.647687,688.3888333,745.3703095,768.3215232,784.3045168,819.9405136,839.9518413,845.4973571,863.192187,904.5480319,965.9731684,0.98487395,295,0.989932886,530.4747414,629.9751879,722.2941056,852.1818931,1198.07503,3,0.010067114,752.2523363,820.722042,889.1917478,919.904316,950.6168843,291,0.97979798,607.3365148,675.185102,769.1536844,904.7902493,1116.571493,6,0.02020202,666.7398796,769.5005222,797.6680156,832.4475934,845.4069098,99.2
24,147,0.7,23,3.5,83,427,117,645.1323654,90.84674061,625.3770724,89.11930778,664.8876583,88.22395559,39.51058594,0,0,0,546.0732756,568.9208434,587.6384931,609.238478,626.3911016,652.9489871,676.8618591,719.8783297,766.9369216,1040.722542,0,0,0,0,0,0,0,0,0,0,1,300,1,537.1519603,573.7721215,603.9787926,647.5822948,749.778972,0,0,0,0,0,0,0,300,1,560.2030651,612.2111826,657.2864495,707.2422773,777.6896681,0,0,0,0,0,0,0,207.5
25,46,0.2,31,3.2,137,280,110,403.9126336,100.8869438,394.3830067,82.5806397,415.7158264,118.6856646,21.33281973,0.265,0.186666667,0.343333333,310.1219365,328.3144285,346.0973687,361.0685644,379.3558572,396.4833664,415.8690935,460.4643966,546.5389721,932.7714319,304.4068128,331.6906999,344.3439664,361.9986047,379.537029,398.56841,427.1852464,451.6576897,536.7411643,955.6129159,0.735,244,0.813333333,310.996155,346.0138533,376.1555066,410.5837978,503.8569636,56,0.186666667,296.3623275,334.0146376,362.3606444,398.5750256,557.848961,197,0.656666667,307.2352103,347.6206396,382.3923034,425.0975462,589.1913275,103,0.343333333,314.368783,355.057345,394.0366042,428.1301375,517.5269611,301.4
26,46,0.7,37,4.3,69,416,47,483.0597715,47.71433755,473.3182001,35.35824874,493.2815612,56.12173147,19.96336108,0.03,0.006666667,0.053333333,435.879333,445.6934863,455.3382556,463.9644917,472.9408931,481.5667576,496.1163708,511.1701124,540.3379972,733.8168955,452.0131032,466.3464083,477.6525969,490.8167371,523.4177169,532.9206126,543.2021597,560.5401416,570.5229177,591.6678935,0.97,298,0.993333333,434.6411115,452.7188669,469.6000236,483.8129379,521.5152202,2,0.006666667,445.1522212,450.0662242,454.9802273,459.8942304,464.8082334,284,0.946666667,437.692881,459.5587716,479.0996085,504.9801672,573.083364,16,0.053333333,460.8701695,486.8719858,527.9836214,546.3652265,570.5435193,227.7
27,124,0.7,40,3.3,83,381,43,565.6680055,85.61106607,519.0025654,65.19721534,612.3334456,77.79785198,93.33088027,0,0,0,468.753935,487.2204596,508.6636012,531.7647837,553.2676641,574.5890947,601.4995432,632.8891616,686.8813581,906.6460164,0,0,0,0,0,0,0,0,0,0,1,300,1,454.6999096,482.5554135,506.0978799,538.9473881,589.3326188,0,0,0,0,0,0,0,300,1,522.2545499,569.1562859,604.3892398,647.1770317,716.6049662,0,0,0,0,0,0,0,190.9
28,118,0.8,19,4.1,76,459,67,607.8564518,65.19733064,591.8835932,54.08394516,623.8293104,71.17616382,31.9457172,0,0,0,535.563874,557.6013359,569.8799255,582.4256725,595.5012586,611.6296973,629.5222212,652.357896,690.1311037,976.1038696,0,0,0,0,0,0,0,0,0,0,1,300,1,530.0749677,561.6573199,585.1462563,610.988223,664.1927199,0,0,0,0,0,0,0,300,1,546.978747,580.036387,613.9137725,644.4897703,717.6653513,0,0,0,0,0,0,0,235.6
29,140,0.3,29,3.9,90,420,99,870.7386689,261.4915116,819.1752367,276.6365326,921.7777272,234.6784961,102.6024905,0.005084746,0.006802721,0.003378378,601.5193709,647.0077714,697.7598236,750.3804578,812.1792438,873.2222895,951.3830843,1058.101782,1238.368272,1868.491237,814.9764613,828.3975439,841.8186265,855.239709,868.6607916,886.1509098,903.641028,921.1311463,938.6212645,956.1113827,0.994915254,292,0.993197279,572.4169494,641.150114,722.9864176,861.3181592,1239.727374,2,0.006802721,877.4058507,894.8959689,912.3860872,929.8762054,947.3663236,295,0.996621622,661.9794348,781.2939408,882.2949687,992.7786274,1231.096386,1,0.003378378,801.5553788,801.5553788,801.5553788,801.5553788,801.5553788,261
30,117,0.4,31,3.3,111,375,108,676.9134332,178.7658262,621.2551757,167.5966647,733.5150511,171.864126,112.2598755,0.008333333,0,0.016666667,495.5454766,532.0944488,563.9076245,598.1972323,638.5329201,682.0793414,732.8679903,795.6956811,917.6878538,1780.730181,547.8780924,551.8365618,554.8082901,556.7932774,558.7782647,567.914993,577.0517212,622.8884408,705.425152,787.9618631,0.991666667,300,1,479.560114,527.4230475,576.4525347,651.828245,791.4899577,0,0,0,0,0,0,0,295,0.983333333,542.0709526,634.3998532,710.1257079,797.5465955,966.6935734,5,0.016666667,547.8780924,554.8082901,558.7782647,577.0517212,705.425152,255.3
31,82,0.6,15,2.8,150,320,83,455.1267454,80.65879722,442.0043354,77.59094256,468.2491553,81.52872799,26.24481988,0,0,0,365.1164511,392.1764536,407.3501167,421.7251939,438.7440617,462.1487461,482.5472154,511.2140486,565.323491,988.8213163,0,0,0,0,0,0,0,0,0,0,1,300,1,362.2296978,397.5756836,423.1612816,464.4891488,541.3069547,0,0,0,0,0,0,0,300,1,371.8951162,416.7140819,460.3859322,499.1889863,584.7860605,0,0,0,0,0,0,0,270
32,122,0.3,34,3.8,128,379,114,787.2741787,247.7511245,714.5796287,228.7008055,859.9687286,244.7206279,145.3890999,0.008375209,0.010033445,0.006711409,529.7785544,576.7060776,633.8133154,665.3944205,723.9265074,795.1277624,870.9291448,966.1465307,1134.785456,1780.439362,582.9907467,671.3764794,727.1941775,750.4438408,773.6935042,855.9077973,938.1220904,991.0889016,1014.808231,1038.52756,0.991624791,296,0.989966555,513.6262381,584.1713591,651.9138635,731.3440683,1045.469833,3,0.010033445,538.7978804,627.1836131,715.5693458,821.0333022,926.4972587,296,0.993288591,557.3090198,716.1216104,830.5374164,952.9816895,1182.29313,2,0.006711409,800.1769098,853.1437211,906.1105323,959.0773436,1012.044155,358.4
33,139,0.5,19,4,84,393,123,684.0252233,144.0473841,652.2109753,135.3997451,715.8394712,145.4025929,63.62849586,0,0,0,535.4123461,566.6401424,599.9180755,628.1194627,656.6090192,689.1190106,730.7160389,790.0144709,867.8399328,1449.641823,0,0,0,0,0,0,0,0,0,0,1,300,1,519.7274341,575.3018753,622.4620971,685.4052906,817.6365894,0,0,0,0,0,0,0,300,1,548.2541083,634.2060289,692.6659405,779.4335343,916.9880157,0,0,0,0,0,0,0,252
34,138,0.5,39,3.2,88,460,86,731.588874,131.6954142,681.4827438,123.626052,781.8625832,119.8515216,100.3798394,0.001666667,0,0.003333333,580.8632075,613.6386284,648.6484581,681.2696439,715.3346251,750.867438,782.8100273,839.2865897,908.1580712,1297.172181,551.1042918,551.1042918,551.1042918,551.1042918,551.1042918,551.1042918,551.1042918,551.1042918,551.1042918,551.1042918,0.998333333,300,1,556.0839705,603.8350593,647.281825,722.0064499,850.3831277,0,0,0,0,0,0,0,299,0.996666667,652.6190887,714.5007909,764.0284818,829.7712899,942.8858981,1,0.003333333,551.1042918,551.1042918,551.1042918,551.1042918,551.1042918,193.6
35,84,0.6,22,3.6,69,354,125,506.9798215,96.23319233,479.0269218,89.28654744,534.9327211,94.79893387,55.90579928,0,0,0,397.4318191,426.8961433,449.8009811,467.9046654,488.4104291,512.5764782,541.2503228,578.6465516,643.3193346,940.0260892,0,0,0,0,0,0,0,0,0,0,1,300,1,389.4931085,431.9952496,463.997268,502.8658586,577.7866053,0,0,0,0,0,0,0,300,1,419.907132,477.3942394,524.6427769,579.8316309,665.2436632,0,0,0,0,0,0,0,179.4
36,132,0.6,34,3.7,59,324,116,550.2363807,121.5726154,502.7198674,112.3986483,597.752894,111.4033547,95.03302656,0,0,0,417.7131372,453.5269259,477.9201837,502.0583479,524.1332249,553.6760358,594.8635853,633.7391696,703.6316432,1200.818538,0,0,0,0,0,0,0,0,0,0,1,300,1,395.2223472,448.4390168,476.9169788,519.1845318,630.4152241,0,0,0,0,0,0,0,300,1,479.2819704,535.1435494,578.1639591,634.3314835,738.1329919,0,0,0,0,0,0,0,159.3
37,115,0.6,16,4.3,94,269,86,462.2181073,99.84874819,443.3380487,93.80807512,481.098166,102.1111005,37.76011732,0,0,0,356.5080076,380.7968311,403.2093368,420.395411,439.182759,461.3831179,493.6540982,533.3536839,595.2269557,928.7903975,0,0,0,0,0,0,0,0,0,0,1,300,1,348.3494498,392.4018061,423.0936302,461.5662437,556.9432219,0,0,0,0,0,0,0,300,1,364.6063746,414.6638599,460.7378391,520.4397166,620.4238211,0,0,0,0,0,0,0,310.2
38,107,0.4,27,3.1,143,458,100,742.3544195,169.7127609,696.8879394,152.4511722,788.748787,173.8250491,91.86084764,0.01,0,0.02,577.0898575,605.9215434,635.1643878,671.7417727,699.3625772,739.5921864,779.3735396,843.9772624,969.0991322,1571.358104,576.2428552,578.0866462,602.1966758,626.3067054,654.9493918,683.5920781,700.1990062,716.8059343,775.254367,833.7027998,0.99,300,1,566.6177718,609.9124225,655.5827838,718.9981468,849.7246333,0,0,0,0,0,0,0,294,0.98,598.6336786,694.6675961,754.1626724,835.3399337,1009.971924,6,0.02,576.2428552,602.1966758,654.9493918,700.1990062,775.254367,300.3
39,73,0.3,19,3.9,126,313,34,539.8796547,174.3613261,520.0095252,166.7998668,560.4803036,179.5624272,40.47077847,0.076666667,0.06,0.093333333,386.2408748,408.5672182,431.289563,455.6073746,483.4093838,521.4440135,565.1170993,645.2673642,766.3267326,1598.018799,389.8482983,405.3548384,429.7386606,449.7083142,499.4381227,532.7280044,570.2270576,591.6189775,711.0818576,1105.568394,0.923333333,282,0.94,386.6035539,429.0384358,467.2603094,533.394028,696.567473,18,0.06,391.0982389,419.9906192,458.3128719,554.1229131,701.905738,272,0.906666667,385.6670288,442.0690958,505.839701,622.9023572,811.6260333,28,0.093333333,390.5969304,431.1654872,515.8914779,582.4162378,705.9855801,365.4
40,96,0.4,31,2.7,76,257,51,488.6493853,149.3473626,455.5752086,167.7725586,522.8719709,118.1341906,67.29676229,0.023333333,0.006666667,0.04,338.6562754,362.396074,394.5254632,423.3428946,459.2763625,496.2724626,537.1206296,588.9356195,674.6714925,1756.030203,334.6578478,352.8111498,358.1968298,362.7176506,372.852538,398.3943052,408.9133087,477.0403621,576.5523463,886.8294511,0.976666667,298,0.993333333,323.9252118,353.9983843,395.7448515,480.367078,661.0086317,2,0.006666667,493.5704213,580.9613168,668.3522123,755.7431078,843.1340033,288,0.96,395.032267,450.9265267,503.6493479,561.6630213,693.263567,12,0.04,330.0714144,355.5400587,365.2116895,395.6370989,506.4458017,129.2
41,123,0.5,40,2.7,58,280,56,510.8927445,129.2811855,470.729296,128.17646,551.0561929,117.3534821,80.32689688,0,0,0,369.3626325,405.7439137,429.6857897,464.243459,486.1498569,519.3949196,560.3219824,602.7890147,681.1582605,1413.761835,0,0,0,0,0,0,0,0,0,0,1,300,1,345.7662421,390.2823613,425.5462576,504.1762328,663.5552354,0,0,0,0,0,0,0,300,1,437.1328853,480.0555357,531.0734407,583.7240391,696.8138583,0,0,0,0,0,0,0,98.6
42,63,0.6,32,4.4,65,478,90,585.4380553,71.80701851,567.5817287,51.66855981,603.5356837,83.81990952,35.95395503,0.006666667,0,0.013333333,507.6514319,525.1464497,543.2854936,558.3885963,572.6889485,586.7468975,603.7625925,632.4594413,689.0140031,941.8190118,561.7177094,568.5531847,575.3886601,578.3554983,579.388018,580.4205377,583.9778656,592.58481,601.1917544,609.7986988,0.993333333,300,1,505.7427603,540.3196376,565.623373,587.5473856,630.9401742,0,0,0,0,0,0,0,296,0.986666667,511.6111023,549.030767,584.4661969,634.656389,730.2671061,4,0.013333333,561.7177094,575.3886601,579.388018,583.9778656,601.1917544,221
43,85,0.8,31,3.1,71,263,44,377.6165649,62.64851406,350.5760125,45.96991133,404.747554,65.36643831,54.17154147,0.001666667,0,0.003333333,314.3332337,325.6793244,337.3809911,348.595053,361.0643604,376.8904956,400.8446439,430.0236767,461.8822008,671.8442914,333.1847463,333.1847463,333.1847463,333.1847463,333.1847463,333.1847463,333.1847463,333.1847463,333.1847463,333.1847463,0.998333333,300,1,304.6983229,325.24041,342.44308,363.1423958,403.0145406,0,0,0,0,0,0,0,299,0.996666667,327.697868,358.3656506,397.6389198,435.0115786,488.0484869,1,0.003333333,333.1847463,333.1847463,333.1847463,333.1847463,333.1847463,149.1
44,145,0.6,25,3.5,81,269,41,514.9071019,110.3589613,483.1878724,111.1525293,546.6263315,99.95547444,63.43845909,0,0,0,390.1223662,427.5797732,450.297409,471.8342172,494.5145149,518.2960535,554.7120472,592.107419,650.8045352,1063.027167,0,0,0,0,0,0,0,0,0,0,1,300,1,377.382005,424.2354336,458.0209358,500.5171307,627.2792899,0,0,0,0,0,0,0,300,1,432.4015235,486.3137355,533.413476,584.8181478,671.0431722,0,0,0,0,0,0,0,202.5
45,137,0.5,23,3.2,131,269,39,553.0410887,134.8861711,508.5030912,118.0649939,597.5790861,135.9483324,89.07599488,0,0,0,411.3903949,438.9875662,464.4905682,489.0522689,519.0832878,558.9815095,604.2836544,663.5664232,744.5940899,1066.858407,0,0,0,0,0,0,0,0,0,0,1,300,1,397.3844807,439.0535177,472.7166364,535.3981674,674.862612,0,0,0,0,0,0,0,300,1,439.0198301,508.7034351,576.932551,654.8825422,809.6838582,0,0,0,0,0,0,0,288.2
46,142,0.6,29,4.1,138,303,112,552.9120221,109.7913633,527.5059623,95.57722879,578.318082,116.9715541,50.81211967,0,0,0,433.2377524,461.2224577,481.3748385,508.8877897,535.8851088,563.5632098,599.6571426,640.6019994,695.882352,1020.058336,0,0,0,0,0,0,0,0,0,0,1,300,1,424.4618576,468.8650268,512.0967797,559.5347414,647.0165757,0,0,0,0,0,0,0,300,1,449.6487389,501.2136167,566.4669004,635.7224036,726.5545481,0,0,0,0,0,0,0,427.8
47,123,0.7,18,3.9,112,368,102,549.7232147,83.20409516,531.8329085,72.2311451,567.6135209,89.37772914,35.78061247,0,0,0,452.2848425,479.0142351,500.1471702,517.9800289,533.8742731,560.2708847,586.3060296,612.8995044,658.4725891,897.4880646,0,0,0,0,0,0,0,0,0,0,1,300,1,444.3337208,487.7844639,521.1141258,561.8098183,626.759231,0,0,0,0,0,0,0,300,1,466.5520001,514.5110511,559.0522406,607.5101443,685.6477279,0,0,0,0,0,0,0,324.8
