congruent,corrAns,letterColor,signal,selectedrownumber_novariable,Anzeigetext,practice.thisRepN,practice.thisTrialN,practice.thisN,practice.thisIndex,Wrongresponse.thisRepN,Wrongresponse.thisTrialN,Wrongresponse.thisN,Wrongresponse.thisIndex,trials.thisRepN,trials.thisTrialN,trials.thisN,trials.thisIndex,resp.keys,resp.corr,resp.rt,date,frameRate,expName,session,participant,
neutralofneutral,left,"[0.568627451, -0.7882352941, -0.7882352941]", ,15,HALS,0,0,0,0,0,0,0,0,,,,,left,1,0.852781847972,2017_Apr_22_1056,97.6915393286,Stroop,A2,2STRNS-2,
,,,,,,0,0,0,0,,,,,,,,,,,,2017_Apr_22_1056,97.6915393286,Stroop,A2,2STRNS-2,
neutralofneutral,down,"[-0.7725490196, 0.0745098039, -1]", ,16,HALS,1,0,1,0,0,0,0,0,,,,,down,1,0.810837131535,2017_Apr_22_1056,97.6915393286,Stroop,A2,2STRNS-2,
,,,,,,1,0,1,0,,,,,,,,,,,,2017_Apr_22_1056,97.6915393286,Stroop,A2,2STRNS-2,
incongruent,left,"[0.568627451, -0.7882352941, -0.7882352941]", ,6,BLAU,2,0,2,0,0,0,0,0,,,,,left,1,0.438833985884,2017_Apr_22_1056,97.6915393286,Stroop,A2,2STRNS-2,
,,,,,,2,0,2,0,,,,,,,,,,,,2017_Apr_22_1056,97.6915393286,Stroop,A2,2STRNS-2,
neutralofneutral,down,"[-0.7725490196, 0.0745098039, -1]", ,16,HALS,3,0,3,0,0,0,0,0,,,,,down,1,0.640926430594,2017_Apr_22_1056,97.6915393286,Stroop,A2,2STRNS-2,
,,,,,,3,0,3,0,,,,,,,,,,,,2017_Apr_22_1056,97.6915393286,Stroop,A2,2STRNS-2,
incongruent,right,"[-0.8745098039, -0.2078431373, 0.637254902]", ,2,ROT,4,0,4,0,0,0,0,0,,,,,right,1,0.449803536483,2017_Apr_22_1056,97.6915393286,Stroop,A2,2STRNS-2,
,,,,,,4,0,4,0,,,,,,,,,,,,2017_Apr_22_1056,97.6915393286,Stroop,A2,2STRNS-2,
congruent,down,"[-0.7725490196, 0.0745098039, -1]", ,4,GRÜN,5,0,5,0,0,0,0,0,,,,,down,1,0.52419762847,2017_Apr_22_1056,97.6915393286,Stroop,A2,2STRNS-2,
,,,,,,5,0,5,0,,,,,,,,,,,,2017_Apr_22_1056,97.6915393286,Stroop,A2,2STRNS-2,
congruent,right,"[-0.8745098039, -0.2078431373, 0.637254902]", ,8,BLAU,6,0,6,0,0,0,0,0,,,,,right,1,0.534148334495,2017_Apr_22_1056,97.6915393286,Stroop,A2,2STRNS-2,
,,,,,,6,0,6,0,,,,,,,,,,,,2017_Apr_22_1056,97.6915393286,Stroop,A2,2STRNS-2,
incongruent,left,"[0.568627451, -0.7882352941, -0.7882352941]", ,6,BLAU,7,0,7,0,0,0,0,0,,,,,left,1,0.374678066626,2017_Apr_22_1056,97.6915393286,Stroop,A2,2STRNS-2,
,,,,,,7,0,7,0,,,,,,,,,,,,2017_Apr_22_1056,97.6915393286,Stroop,A2,2STRNS-2,
neutralofneutral,right,"[-0.8745098039, -0.2078431373, 0.637254902]", ,17,HALS,8,0,8,0,0,0,0,0,,,,,down,0,0.865211640027,2017_Apr_22_1056,97.6915393286,Stroop,A2,2STRNS-2,
,,,,,,8,0,8,0,,,,,,,,,,,,2017_Apr_22_1056,97.6915393286,Stroop,A2,2STRNS-2,
neutralofneutral,right,"[-0.8745098039, -0.2078431373, 0.637254902]", ,17,HALS,9,0,9,0,0,0,0,0,,,,,right,1,1.14317881183,2017_Apr_22_1056,97.6915393286,Stroop,A2,2STRNS-2,
,,,,,,9,0,9,0,,,,,,,,,,,,2017_Apr_22_1056,97.6915393286,Stroop,A2,2STRNS-2,
incongruent,right,"[-0.8745098039, -0.2078431373, 0.637254902]", ,2,ROT,10,0,10,0,0,0,0,0,,,,,right,1,0.578201698819,2017_Apr_22_1056,97.6915393286,Stroop,A2,2STRNS-2,
,,,,,,10,0,10,0,,,,,,,,,,,,2017_Apr_22_1056,97.6915393286,Stroop,A2,2STRNS-2,
neutral,right,"[-0.8745098039, -0.2078431373, 0.637254902]", ,11,PECH,11,0,11,0,0,0,0,0,,,,,right,1,0.651696235136,2017_Apr_22_1056,97.6915393286,Stroop,A2,2STRNS-2,
,,,,,,11,0,11,0,,,,,,,,,,,,2017_Apr_22_1056,97.6915393286,Stroop,A2,2STRNS-2,
neutral,right,"[-0.8745098039, -0.2078431373, 0.637254902]", ,14,SOLL,12,0,12,0,0,0,0,0,,,,,right,1,0.780225140346,2017_Apr_22_1056,97.6915393286,Stroop,A2,2STRNS-2,
,,,,,,12,0,12,0,,,,,,,,,,,,2017_Apr_22_1056,97.6915393286,Stroop,A2,2STRNS-2,
incongruent,right,"[-0.8745098039, -0.2078431373, 0.637254902]", ,2,ROT,13,0,13,0,0,0,0,0,,,,,right,1,0.544901656495,2017_Apr_22_1056,97.6915393286,Stroop,A2,2STRNS-2,
,,,,,,13,0,13,0,,,,,,,,,,,,2017_Apr_22_1056,97.6915393286,Stroop,A2,2STRNS-2,
neutralofneutral,right,"[-0.8745098039, -0.2078431373, 0.637254902]", ,17,HALS,14,0,14,0,0,0,0,0,,,,,right,1,0.642020145018,2017_Apr_22_1056,97.6915393286,Stroop,A2,2STRNS-2,
,,,,,,14,0,14,0,,,,,,,,,,,,2017_Apr_22_1056,97.6915393286,Stroop,A2,2STRNS-2,
congruent,left,"[0.568627451, -0.7882352941, -0.7882352941]", ,0,ROT,15,0,15,0,0,0,0,0,,,,,left,1,0.619409170719,2017_Apr_22_1056,97.6915393286,Stroop,A2,2STRNS-2,
,,,,,,15,0,15,0,,,,,,,,,,,,2017_Apr_22_1056,97.6915393286,Stroop,A2,2STRNS-2,
neutralofneutral,right,"[-0.8745098039, -0.2078431373, 0.637254902]", ,20,MODE,16,0,16,0,0,0,0,0,,,,,right,1,0.622685564785,2017_Apr_22_1056,97.6915393286,Stroop,A2,2STRNS-2,
,,,,,,16,0,16,0,,,,,,,,,,,,2017_Apr_22_1056,97.6915393286,Stroop,A2,2STRNS-2,
neutralofneutral,left,"[0.568627451, -0.7882352941, -0.7882352941]", ,15,HALS,17,0,17,0,0,0,0,0,,,,,left,1,0.512091620583,2017_Apr_22_1056,97.6915393286,Stroop,A2,2STRNS-2,
,,,,,,17,0,17,0,,,,,,,,,,,,2017_Apr_22_1056,97.6915393286,Stroop,A2,2STRNS-2,
incongruent,down,"[-0.7725490196, 0.0745098039, -1]", ,7,BLAU,18,0,18,0,0,0,0,0,,,,,down,1,0.586927388816,2017_Apr_22_1056,97.6915393286,Stroop,A2,2STRNS-2,
,,,,,,18,0,18,0,,,,,,,,,,,,2017_Apr_22_1056,97.6915393286,Stroop,A2,2STRNS-2,
neutral,right,"[-0.8745098039, -0.2078431373, 0.637254902]", ,11,PECH,19,0,19,0,0,0,0,0,,,,,right,1,0.545216221615,2017_Apr_22_1056,97.6915393286,Stroop,A2,2STRNS-2,
,,,,,,19,0,19,0,,,,,,,,,,,,2017_Apr_22_1056,97.6915393286,Stroop,A2,2STRNS-2,
neutralofneutral,left,"[0.568627451, -0.7882352941, -0.7882352941]", ,18,MODE,20,0,20,0,0,0,0,0,,,,,left,1,0.686973065012,2017_Apr_22_1056,97.6915393286,Stroop,A2,2STRNS-2,
,,,,,,20,0,20,0,,,,,,,,,,,,2017_Apr_22_1056,97.6915393286,Stroop,A2,2STRNS-2,
neutral,left,"[0.568627451, -0.7882352941, -0.7882352941]", ,12,SOLL,21,0,21,0,0,0,0,0,,,,,left,1,0.821593526552,2017_Apr_22_1056,97.6915393286,Stroop,A2,2STRNS-2,
,,,,,,21,0,21,0,,,,,,,,,,,,2017_Apr_22_1056,97.6915393286,Stroop,A2,2STRNS-2,
incongruent,left,"[0.568627451, -0.7882352941, -0.7882352941]", ,6,BLAU,22,0,22,0,0,0,0,0,,,,,left,1,0.5128266302,2017_Apr_22_1056,97.6915393286,Stroop,A2,2STRNS-2,
,,,,,,22,0,22,0,,,,,,,,,,,,2017_Apr_22_1056,97.6915393286,Stroop,A2,2STRNS-2,
congruent,down,"[-0.7725490196, 0.0745098039, -1]", ,4,GRÜN,23,0,23,0,0,0,0,0,,,,,down,1,0.640116551126,2017_Apr_22_1056,97.6915393286,Stroop,A2,2STRNS-2,
,,,,,,23,0,23,0,,,,,,,,,,,,2017_Apr_22_1056,97.6915393286,Stroop,A2,2STRNS-2,
incongruent,down,"[-0.7725490196, 0.0745098039, -1]", ,1,ROT,24,0,24,0,0,0,0,0,,,,,down,1,0.779864200618,2017_Apr_22_1056,97.6915393286,Stroop,A2,2STRNS-2,
,,,,,,24,0,24,0,,,,,,,,,,,,2017_Apr_22_1056,97.6915393286,Stroop,A2,2STRNS-2,
neutralofneutral,right,"[-0.8745098039, -0.2078431373, 0.637254902]", ,20,MODE,25,0,25,0,0,0,0,0,,,,,right,1,0.621642136082,2017_Apr_22_1056,97.6915393286,Stroop,A2,2STRNS-2,
,,,,,,25,0,25,0,,,,,,,,,,,,2017_Apr_22_1056,97.6915393286,Stroop,A2,2STRNS-2,
neutral,right,"[-0.8745098039, -0.2078431373, 0.637254902]", ,11,PECH,26,0,26,0,0,0,0,0,,,,,right,1,0.556700642121,2017_Apr_22_1056,97.6915393286,Stroop,A2,2STRNS-2,
,,,,,,26,0,26,0,,,,,,,,,,,,2017_Apr_22_1056,97.6915393286,Stroop,A2,2STRNS-2,
neutralofneutral,right,"[-0.8745098039, -0.2078431373, 0.637254902]", ,17,HALS,27,0,27,0,0,0,0,0,,,,,right,1,0.986049623625,2017_Apr_22_1056,97.6915393286,Stroop,A2,2STRNS-2,
,,,,,,27,0,27,0,,,,,,,,,,,,2017_Apr_22_1056,97.6915393286,Stroop,A2,2STRNS-2,
neutralofneutral,right,"[-0.8745098039, -0.2078431373, 0.637254902]", ,20,MODE,28,0,28,0,0,0,0,0,,,,,right,1,0.450874901698,2017_Apr_22_1056,97.6915393286,Stroop,A2,2STRNS-2,
,,,,,,28,0,28,0,,,,,,,,,,,,2017_Apr_22_1056,97.6915393286,Stroop,A2,2STRNS-2,
neutral,down,"[-0.7725490196, 0.0745098039, -1]", ,13,SOLL,29,0,29,0,0,0,0,0,,,,,down,1,0.545683040722,2017_Apr_22_1056,97.6915393286,Stroop,A2,2STRNS-2,
,,,,,,29,0,29,0,,,,,,,,,,,,2017_Apr_22_1056,97.6915393286,Stroop,A2,2STRNS-2,
neutralofneutral,down,"[-0.7725490196, 0.0745098039, -1]", ,16,HALS,30,0,30,0,0,0,0,0,,,,,down,1,0.493167986434,2017_Apr_22_1056,97.6915393286,Stroop,A2,2STRNS-2,
,,,,,,30,0,30,0,,,,,,,,,,,,2017_Apr_22_1056,97.6915393286,Stroop,A2,2STRNS-2,
neutralofneutral,right,"[-0.8745098039, -0.2078431373, 0.637254902]", ,17,HALS,31,0,31,0,0,0,0,0,,,,,right,1,0.577160225671,2017_Apr_22_1056,97.6915393286,Stroop,A2,2STRNS-2,
,,,,,,31,0,31,0,,,,,,,,,,,,2017_Apr_22_1056,97.6915393286,Stroop,A2,2STRNS-2,
neutralofneutral,right,"[-0.8745098039, -0.2078431373, 0.637254902]", ,17,HALS,32,0,32,0,0,0,0,0,,,,,right,1,0.491052075054,2017_Apr_22_1056,97.6915393286,Stroop,A2,2STRNS-2,
,,,,,,32,0,32,0,,,,,,,,,,,,2017_Apr_22_1056,97.6915393286,Stroop,A2,2STRNS-2,
incongruent,down,"[-0.7725490196, 0.0745098039, -1]", ,7,BLAU,33,0,33,0,0,0,0,0,,,,,down,1,0.640265452732,2017_Apr_22_1056,97.6915393286,Stroop,A2,2STRNS-2,
,,,,,,33,0,33,0,,,,,,,,,,,,2017_Apr_22_1056,97.6915393286,Stroop,A2,2STRNS-2,
neutralofneutral,left,"[0.568627451, -0.7882352941, -0.7882352941]", ,15,HALS,34,0,34,0,0,0,0,0,,,,,left,1,0.481095502361,2017_Apr_22_1056,97.6915393286,Stroop,A2,2STRNS-2,
,,,,,,34,0,34,0,,,,,,,,,,,,2017_Apr_22_1056,97.6915393286,Stroop,A2,2STRNS-2,
neutral,down,"[-0.7725490196, 0.0745098039, -1]", ,13,SOLL,35,0,35,0,0,0,0,0,,,,,down,1,0.682630613667,2017_Apr_22_1056,97.6915393286,Stroop,A2,2STRNS-2,
,,,,,,35,0,35,0,,,,,,,,,,,,2017_Apr_22_1056,97.6915393286,Stroop,A2,2STRNS-2,
neutralofneutral,down,"[-0.7725490196, 0.0745098039, -1]", ,19,MODE,36,0,36,0,0,0,0,0,,,,,down,1,0.568296529307,2017_Apr_22_1056,97.6915393286,Stroop,A2,2STRNS-2,
,,,,,,36,0,36,0,,,,,,,,,,,,2017_Apr_22_1056,97.6915393286,Stroop,A2,2STRNS-2,
neutralofneutral,left,"[0.568627451, -0.7882352941, -0.7882352941]", ,15,HALS,37,0,37,0,0,0,0,0,,,,,left,1,0.469785405687,2017_Apr_22_1056,97.6915393286,Stroop,A2,2STRNS-2,
,,,,,,37,0,37,0,,,,,,,,,,,,2017_Apr_22_1056,97.6915393286,Stroop,A2,2STRNS-2,
neutral,right,"[-0.8745098039, -0.2078431373, 0.637254902]", ,11,PECH,38,0,38,0,0,0,0,0,,,,,right,1,0.608827658264,2017_Apr_22_1056,97.6915393286,Stroop,A2,2STRNS-2,
,,,,,,38,0,38,0,,,,,,,,,,,,2017_Apr_22_1056,97.6915393286,Stroop,A2,2STRNS-2,
incongruent,left,"[0.568627451, -0.7882352941, -0.7882352941]", ,3,GRÜN,39,0,39,0,0,0,0,0,,,,,left,1,0.534542518672,2017_Apr_22_1056,97.6915393286,Stroop,A2,2STRNS-2,
,,,,,,39,0,39,0,,,,,,,,,,,,2017_Apr_22_1056,97.6915393286,Stroop,A2,2STRNS-2,
congruent,right,"[-0.8745098039, -0.2078431373, 0.637254902]", ,8,BLAU,40,0,40,0,0,0,0,0,,,,,right,1,0.63325450581,2017_Apr_22_1056,97.6915393286,Stroop,A2,2STRNS-2,
,,,,,,40,0,40,0,,,,,,,,,,,,2017_Apr_22_1056,97.6915393286,Stroop,A2,2STRNS-2,
neutralofneutral,right,"[-0.8745098039, -0.2078431373, 0.637254902]", ,20,MODE,41,0,41,0,0,0,0,0,,,,,right,1,0.482886791478,2017_Apr_22_1056,97.6915393286,Stroop,A2,2STRNS-2,
,,,,,,41,0,41,0,,,,,,,,,,,,2017_Apr_22_1056,97.6915393286,Stroop,A2,2STRNS-2,
incongruent,right,"[-0.8745098039, -0.2078431373, 0.637254902]", ,2,ROT,42,0,42,0,0,0,0,0,,,,,right,1,0.7792613307,2017_Apr_22_1056,97.6915393286,Stroop,A2,2STRNS-2,
,,,,,,42,0,42,0,,,,,,,,,,,,2017_Apr_22_1056,97.6915393286,Stroop,A2,2STRNS-2,
neutralofneutral,right,"[-0.8745098039, -0.2078431373, 0.637254902]", ,17,HALS,43,0,43,0,0,0,0,0,,,,,right,1,0.49534815179,2017_Apr_22_1056,97.6915393286,Stroop,A2,2STRNS-2,
,,,,,,43,0,43,0,,,,,,,,,,,,2017_Apr_22_1056,97.6915393286,Stroop,A2,2STRNS-2,
neutralofneutral,left,"[0.568627451, -0.7882352941, -0.7882352941]", ,18,MODE,44,0,44,0,0,0,0,0,,,,,left,1,0.515398465447,2017_Apr_22_1056,97.6915393286,Stroop,A2,2STRNS-2,
,,,,,,44,0,44,0,,,,,,,,,,,,2017_Apr_22_1056,97.6915393286,Stroop,A2,2STRNS-2,
neutral,left,"[0.568627451, -0.7882352941, -0.7882352941]", ,9,PECH,45,0,45,0,0,0,0,0,,,,,left,1,0.405889575351,2017_Apr_22_1056,97.6915393286,Stroop,A2,2STRNS-2,
,,,,,,45,0,45,0,,,,,,,,,,,,2017_Apr_22_1056,97.6915393286,Stroop,A2,2STRNS-2,
neutral,right,"[-0.8745098039, -0.2078431373, 0.637254902]", ,14,SOLL,46,0,46,0,0,0,0,0,,,,,right,1,0.694863173951,2017_Apr_22_1056,97.6915393286,Stroop,A2,2STRNS-2,
,,,,,,46,0,46,0,,,,,,,,,,,,2017_Apr_22_1056,97.6915393286,Stroop,A2,2STRNS-2,
neutralofneutral,down,"[-0.7725490196, 0.0745098039, -1]", ,16,HALS,47,0,47,0,0,0,0,0,,,,,down,1,0.780043553021,2017_Apr_22_1056,97.6915393286,Stroop,A2,2STRNS-2,
,,,,,,47,0,47,0,,,,,,,,,,,,2017_Apr_22_1056,97.6915393286,Stroop,A2,2STRNS-2,
neutral,left,"[0.568627451, -0.7882352941, -0.7882352941]", ,9,PECH,48,0,48,0,0,0,0,0,,,,,left,1,0.779861406967,2017_Apr_22_1056,97.6915393286,Stroop,A2,2STRNS-2,
,,,,,,48,0,48,0,,,,,,,,,,,,2017_Apr_22_1056,97.6915393286,Stroop,A2,2STRNS-2,
neutralofneutral,right,"[-0.8745098039, -0.2078431373, 0.637254902]", ,17,HALS,49,0,49,0,0,0,0,0,,,,,right,1,0.492461472059,2017_Apr_22_1056,97.6915393286,Stroop,A2,2STRNS-2,
,,,,,,49,0,49,0,,,,,,,,,,,,2017_Apr_22_1056,97.6915393286,Stroop,A2,2STRNS-2,
neutral,down,"[-0.7725490196, 0.0745098039, -1]", ,10,PECH,50,0,50,0,0,0,0,0,,,,,down,1,0.471371640809,2017_Apr_22_1056,97.6915393286,Stroop,A2,2STRNS-2,
,,,,,,50,0,50,0,,,,,,,,,,,,2017_Apr_22_1056,97.6915393286,Stroop,A2,2STRNS-2,
fix,return,white, ,21,+,,,,,,,,,0,0,0,0,None,0,,2017_Apr_22_1056,97.6915393286,Stroop,A2,2STRNS-2,
fix,return,white, ,21,+,,,,,,,,,0,1,1,1,None,0,,2017_Apr_22_1056,97.6915393286,Stroop,A2,2STRNS-2,
fix,return,white, ,21,+,,,,,,,,,0,2,2,2,None,0,,2017_Apr_22_1056,97.6915393286,Stroop,A2,2STRNS-2,
fix,return,white, ,21,+,,,,,,,,,0,3,3,3,None,0,,2017_Apr_22_1056,97.6915393286,Stroop,A2,2STRNS-2,
fix,return,white, ,21,+,,,,,,,,,0,4,4,4,None,0,,2017_Apr_22_1056,97.6915393286,Stroop,A2,2STRNS-2,
fix,return,white, ,21,+,,,,,,,,,0,5,5,5,None,0,,2017_Apr_22_1056,97.6915393286,Stroop,A2,2STRNS-2,
fix,return,white, ,21,+,,,,,,,,,0,6,6,6,None,0,,2017_Apr_22_1056,97.6915393286,Stroop,A2,2STRNS-2,
fix,return,white, ,21,+,,,,,,,,,0,7,7,7,None,0,,2017_Apr_22_1056,97.6915393286,Stroop,A2,2STRNS-2,
fix,return,white, ,21,+,,,,,,,,,0,8,8,8,None,0,,2017_Apr_22_1056,97.6915393286,Stroop,A2,2STRNS-2,
fix,return,white, ,21,+,,,,,,,,,0,9,9,9,None,0,,2017_Apr_22_1056,97.6915393286,Stroop,A2,2STRNS-2,
fix,return,white, ,21,+,,,,,,,,,0,10,10,10,None,0,,2017_Apr_22_1056,97.6915393286,Stroop,A2,2STRNS-2,
fix,return,white, ,21,+,,,,,,,,,0,11,11,11,None,0,,2017_Apr_22_1056,97.6915393286,Stroop,A2,2STRNS-2,
fix,return,white,+,22,+,,,,,,,,,0,12,12,12,None,0,,2017_Apr_22_1056,97.6915393286,Stroop,A2,2STRNS-2,
incongruent,right,"[-0.8745098039, -0.2078431373, 0.637254902]", ,5,GRÜN,,,,,,,,,0,13,13,13,right,1,0.853944844945,2017_Apr_22_1056,97.6915393286,Stroop,A2,2STRNS-2,
neutral,left,"[0.568627451, -0.7882352941, -0.7882352941]", ,9,PECH,,,,,,,,,0,14,14,14,left,1,0.512420433323,2017_Apr_22_1056,97.6915393286,Stroop,A2,2STRNS-2,
neutral,right,"[-0.8745098039, -0.2078431373, 0.637254902]", ,11,PECH,,,,,,,,,0,15,15,15,right,1,0.502086158995,2017_Apr_22_1056,97.6915393286,Stroop,A2,2STRNS-2,
neutral,down,"[-0.7725490196, 0.0745098039, -1]", ,10,PECH,,,,,,,,,0,16,16,16,down,1,0.373450256946,2017_Apr_22_1056,97.6915393286,Stroop,A2,2STRNS-2,
incongruent,down,"[-0.7725490196, 0.0745098039, -1]", ,7,BLAU,,,,,,,,,0,17,17,17,down,1,0.640482798791,2017_Apr_22_1056,97.6915393286,Stroop,A2,2STRNS-2,
incongruent,left,"[0.568627451, -0.7882352941, -0.7882352941]", ,6,BLAU,,,,,,,,,0,18,18,18,left,1,0.427028574861,2017_Apr_22_1056,97.6915393286,Stroop,A2,2STRNS-2,
incongruent,down,"[-0.7725490196, 0.0745098039, -1]", ,1,ROT,,,,,,,,,0,19,19,19,down,1,0.640615497221,2017_Apr_22_1056,97.6915393286,Stroop,A2,2STRNS-2,
neutral,down,"[-0.7725490196, 0.0745098039, -1]", ,13,SOLL,,,,,,,,,0,20,20,20,down,1,0.565270167018,2017_Apr_22_1056,97.6915393286,Stroop,A2,2STRNS-2,
neutral,right,"[-0.8745098039, -0.2078431373, 0.637254902]", ,14,SOLL,,,,,,,,,0,21,21,21,right,1,0.35202742248,2017_Apr_22_1056,97.6915393286,Stroop,A2,2STRNS-2,
incongruent,left,"[0.568627451, -0.7882352941, -0.7882352941]", ,3,GRÜN,,,,,,,,,0,22,22,22,left,1,0.566967589456,2017_Apr_22_1056,97.6915393286,Stroop,A2,2STRNS-2,
neutral,left,"[0.568627451, -0.7882352941, -0.7882352941]", ,12,SOLL,,,,,,,,,0,23,23,23,left,1,0.385738690253,2017_Apr_22_1056,97.6915393286,Stroop,A2,2STRNS-2,
incongruent,right,"[-0.8745098039, -0.2078431373, 0.637254902]", ,2,ROT,,,,,,,,,0,24,24,24,right,1,0.770095081917,2017_Apr_22_1056,97.6915393286,Stroop,A2,2STRNS-2,
neutral,down,"[-0.7725490196, 0.0745098039, -1]", ,13,SOLL,,,,,,,,,0,25,25,25,down,1,0.49178317356,2017_Apr_22_1056,97.6915393286,Stroop,A2,2STRNS-2,
neutralofneutral,down,"[-0.7725490196, 0.0745098039, -1]", ,16,HALS,,,,,,,,,0,26,26,26,down,1,0.4067868961,2017_Apr_22_1056,97.6915393286,Stroop,A2,2STRNS-2,
neutral,right,"[-0.8745098039, -0.2078431373, 0.637254902]", ,11,PECH,,,,,,,,,0,27,27,27,left,0,0.78018714669,2017_Apr_22_1056,97.6915393286,Stroop,A2,2STRNS-2,
neutralofneutral,right,"[-0.8745098039, -0.2078431373, 0.637254902]", ,17,HALS,,,,,,,,,0,28,28,28,right,1,0.543567129342,2017_Apr_22_1056,97.6915393286,Stroop,A2,2STRNS-2,
neutral,left,"[0.568627451, -0.7882352941, -0.7882352941]", ,9,PECH,,,,,,,,,0,29,29,29,left,1,0.469327526264,2017_Apr_22_1056,97.6915393286,Stroop,A2,2STRNS-2,
neutral,right,"[-0.8745098039, -0.2078431373, 0.637254902]", ,14,SOLL,,,,,,,,,0,30,30,30,right,1,0.426902301829,2017_Apr_22_1056,97.6915393286,Stroop,A2,2STRNS-2,
neutralofneutral,left,"[0.568627451, -0.7882352941, -0.7882352941]", ,18,MODE,,,,,,,,,0,31,31,31,left,1,0.557878445445,2017_Apr_22_1056,97.6915393286,Stroop,A2,2STRNS-2,
neutral,down,"[-0.7725490196, 0.0745098039, -1]", ,10,PECH,,,,,,,,,0,32,32,32,down,1,0.374020999876,2017_Apr_22_1056,97.6915393286,Stroop,A2,2STRNS-2,
neutralofneutral,down,"[-0.7725490196, 0.0745098039, -1]", ,19,MODE,,,,,,,,,0,33,33,33,down,1,0.697310412357,2017_Apr_22_1056,97.6915393286,Stroop,A2,2STRNS-2,
neutral,left,"[0.568627451, -0.7882352941, -0.7882352941]", ,12,SOLL,,,,,,,,,0,34,34,34,left,1,0.608360839157,2017_Apr_22_1056,97.6915393286,Stroop,A2,2STRNS-2,
neutralofneutral,left,"[0.568627451, -0.7882352941, -0.7882352941]", ,15,HALS,,,,,,,,,0,35,35,35,left,1,0.438210442947,2017_Apr_22_1056,97.6915393286,Stroop,A2,2STRNS-2,
neutralofneutral,right,"[-0.8745098039, -0.2078431373, 0.637254902]", ,20,MODE,,,,,,,,,0,36,36,36,right,1,0.558507296318,2017_Apr_22_1056,97.6915393286,Stroop,A2,2STRNS-2,
neutral,down,"[-0.7725490196, 0.0745098039, -1]", ,10,PECH,,,,,,,,,0,37,37,37,down,1,0.502806082896,2017_Apr_22_1056,97.6915393286,Stroop,A2,2STRNS-2,
congruent,down,"[-0.7725490196, 0.0745098039, -1]", ,4,GRÜN,,,,,,,,,0,38,38,38,down,1,0.406430426213,2017_Apr_22_1056,97.6915393286,Stroop,A2,2STRNS-2,
neutral,right,"[-0.8745098039, -0.2078431373, 0.637254902]", ,11,PECH,,,,,,,,,0,39,39,39,right,1,0.672711196535,2017_Apr_22_1056,97.6915393286,Stroop,A2,2STRNS-2,
congruent,left,"[0.568627451, -0.7882352941, -0.7882352941]", ,0,ROT,,,,,,,,,0,40,40,40,left,1,0.53308954071,2017_Apr_22_1056,97.6915393286,Stroop,A2,2STRNS-2,
neutral,left,"[0.568627451, -0.7882352941, -0.7882352941]", ,9,PECH,,,,,,,,,0,41,41,41,left,1,0.459004705905,2017_Apr_22_1056,97.6915393286,Stroop,A2,2STRNS-2,
congruent,down,"[-0.7725490196, 0.0745098039, -1]", ,4,GRÜN,,,,,,,,,0,42,42,42,down,1,0.842749567333,2017_Apr_22_1056,97.6915393286,Stroop,A2,2STRNS-2,
congruent,right,"[-0.8745098039, -0.2078431373, 0.637254902]", ,8,BLAU,,,,,,,,,0,43,43,43,right,1,0.695358767665,2017_Apr_22_1056,97.6915393286,Stroop,A2,2STRNS-2,
neutral,left,"[0.568627451, -0.7882352941, -0.7882352941]", ,12,SOLL,,,,,,,,,0,44,44,44,left,1,0.427704079708,2017_Apr_22_1056,97.6915393286,Stroop,A2,2STRNS-2,
neutral,right,"[-0.8745098039, -0.2078431373, 0.637254902]", ,14,SOLL,,,,,,,,,0,45,45,45,right,1,0.566496859238,2017_Apr_22_1056,97.6915393286,Stroop,A2,2STRNS-2,
neutral,down,"[-0.7725490196, 0.0745098039, -1]", ,13,SOLL,,,,,,,,,0,46,46,46,down,1,0.587938411167,2017_Apr_22_1056,97.6915393286,Stroop,A2,2STRNS-2,
congruent,right,"[-0.8745098039, -0.2078431373, 0.637254902]", ,8,BLAU,,,,,,,,,0,47,47,47,right,1,0.672928263229,2017_Apr_22_1056,97.6915393286,Stroop,A2,2STRNS-2,
congruent,left,"[0.568627451, -0.7882352941, -0.7882352941]", ,0,ROT,,,,,,,,,0,48,48,48,left,1,0.36365627475,2017_Apr_22_1056,97.6915393286,Stroop,A2,2STRNS-2,
fix,return,white, ,21,+,,,,,,,,,0,49,49,49,None,0,,2017_Apr_22_1056,97.6915393286,Stroop,A2,2STRNS-2,
fix,return,white, ,21,+,,,,,,,,,0,50,50,50,None,0,,2017_Apr_22_1056,97.6915393286,Stroop,A2,2STRNS-2,
fix,return,white, ,21,+,,,,,,,,,0,51,51,51,None,0,,2017_Apr_22_1056,97.6915393286,Stroop,A2,2STRNS-2,
fix,return,white, ,21,+,,,,,,,,,0,52,52,52,None,0,,2017_Apr_22_1056,97.6915393286,Stroop,A2,2STRNS-2,
fix,return,white, ,21,+,,,,,,,,,0,53,53,53,None,0,,2017_Apr_22_1056,97.6915393286,Stroop,A2,2STRNS-2,
fix,return,white, ,21,+,,,,,,,,,0,54,54,54,None,0,,2017_Apr_22_1056,97.6915393286,Stroop,A2,2STRNS-2,
fix,return,white, ,21,+,,,,,,,,,0,55,55,55,None,0,,2017_Apr_22_1056,97.6915393286,Stroop,A2,2STRNS-2,
fix,return,white, ,21,+,,,,,,,,,0,56,56,56,None,0,,2017_Apr_22_1056,97.6915393286,Stroop,A2,2STRNS-2,
fix,return,white, ,21,+,,,,,,,,,0,57,57,57,None,0,,2017_Apr_22_1056,97.6915393286,Stroop,A2,2STRNS-2,
fix,return,white, ,21,+,,,,,,,,,0,58,58,58,None,0,,2017_Apr_22_1056,97.6915393286,Stroop,A2,2STRNS-2,
fix,return,white, ,21,+,,,,,,,,,0,59,59,59,None,0,,2017_Apr_22_1056,97.6915393286,Stroop,A2,2STRNS-2,
fix,return,white, ,21,+,,,,,,,,,0,60,60,60,None,0,,2017_Apr_22_1056,97.6915393286,Stroop,A2,2STRNS-2,
fix,return,white,+,22,+,,,,,,,,,0,61,61,61,None,0,,2017_Apr_22_1056,97.6915393286,Stroop,A2,2STRNS-2,
congruent,right,"[-0.8745098039, -0.2078431373, 0.637254902]", ,8,BLAU,,,,,,,,,0,62,62,62,right,1,0.639586316138,2017_Apr_22_1056,97.6915393286,Stroop,A2,2STRNS-2,
congruent,left,"[0.568627451, -0.7882352941, -0.7882352941]", ,0,ROT,,,,,,,,,0,63,63,63,left,1,0.535908055353,2017_Apr_22_1056,97.6915393286,Stroop,A2,2STRNS-2,
neutral,down,"[-0.7725490196, 0.0745098039, -1]", ,10,PECH,,,,,,,,,0,64,64,64,down,1,0.364346027219,2017_Apr_22_1056,97.6915393286,Stroop,A2,2STRNS-2,
congruent,down,"[-0.7725490196, 0.0745098039, -1]", ,4,GRÜN,,,,,,,,,0,65,65,65,left,0,0.418236395967,2017_Apr_22_1056,97.6915393286,Stroop,A2,2STRNS-2,
congruent,down,"[-0.7725490196, 0.0745098039, -1]", ,4,GRÜN,,,,,,,,,0,66,66,66,down,1,0.450338241313,2017_Apr_22_1056,97.6915393286,Stroop,A2,2STRNS-2,
neutral,left,"[0.568627451, -0.7882352941, -0.7882352941]", ,12,SOLL,,,,,,,,,0,67,67,67,left,1,0.503893930653,2017_Apr_22_1056,97.6915393286,Stroop,A2,2STRNS-2,
neutral,right,"[-0.8745098039, -0.2078431373, 0.637254902]", ,11,PECH,,,,,,,,,0,68,68,68,right,1,0.514653678051,2017_Apr_22_1056,97.6915393286,Stroop,A2,2STRNS-2,
congruent,left,"[0.568627451, -0.7882352941, -0.7882352941]", ,0,ROT,,,,,,,,,0,69,69,69,left,1,0.525436054024,2017_Apr_22_1056,97.6915393286,Stroop,A2,2STRNS-2,
neutral,down,"[-0.7725490196, 0.0745098039, -1]", ,13,SOLL,,,,,,,,,0,70,70,70,down,1,0.364219474822,2017_Apr_22_1056,97.6915393286,Stroop,A2,2STRNS-2,
neutral,right,"[-0.8745098039, -0.2078431373, 0.637254902]", ,14,SOLL,,,,,,,,,0,71,71,71,right,1,0.576033546163,2017_Apr_22_1056,97.6915393286,Stroop,A2,2STRNS-2,
congruent,right,"[-0.8745098039, -0.2078431373, 0.637254902]", ,8,BLAU,,,,,,,,,0,72,72,72,right,1,0.415987506792,2017_Apr_22_1056,97.6915393286,Stroop,A2,2STRNS-2,
neutral,left,"[0.568627451, -0.7882352941, -0.7882352941]", ,9,PECH,,,,,,,,,0,73,73,73,left,1,0.576357889061,2017_Apr_22_1056,97.6915393286,Stroop,A2,2STRNS-2,
neutral,left,"[0.568627451, -0.7882352941, -0.7882352941]", ,12,SOLL,,,,,,,,,0,74,74,74,left,1,0.427749895587,2017_Apr_22_1056,97.6915393286,Stroop,A2,2STRNS-2,
incongruent,left,"[0.568627451, -0.7882352941, -0.7882352941]", ,3,GRÜN,,,,,,,,,0,75,75,75,left,1,0.492193281548,2017_Apr_22_1056,97.6915393286,Stroop,A2,2STRNS-2,
neutral,right,"[-0.8745098039, -0.2078431373, 0.637254902]", ,14,SOLL,,,,,,,,,0,76,76,76,right,1,0.586477331616,2017_Apr_22_1056,97.6915393286,Stroop,A2,2STRNS-2,
incongruent,right,"[-0.8745098039, -0.2078431373, 0.637254902]", ,2,ROT,,,,,,,,,0,77,77,77,right,1,0.437297198387,2017_Apr_22_1056,97.6915393286,Stroop,A2,2STRNS-2,
incongruent,right,"[-0.8745098039, -0.2078431373, 0.637254902]", ,5,GRÜN,,,,,,,,,0,78,78,78,right,1,0.460876452175,2017_Apr_22_1056,97.6915393286,Stroop,A2,2STRNS-2,
neutral,down,"[-0.7725490196, 0.0745098039, -1]", ,10,PECH,,,,,,,,,0,79,79,79,down,1,0.492151097416,2017_Apr_22_1056,97.6915393286,Stroop,A2,2STRNS-2,
incongruent,down,"[-0.7725490196, 0.0745098039, -1]", ,1,ROT,,,,,,,,,0,80,80,80,down,1,0.654536540259,2017_Apr_22_1056,97.6915393286,Stroop,A2,2STRNS-2,
incongruent,left,"[0.568627451, -0.7882352941, -0.7882352941]", ,6,BLAU,,,,,,,,,0,81,81,81,left,1,0.546306583658,2017_Apr_22_1056,97.6915393286,Stroop,A2,2STRNS-2,
incongruent,down,"[-0.7725490196, 0.0745098039, -1]", ,7,BLAU,,,,,,,,,0,82,82,82,down,1,0.896258043969,2017_Apr_22_1056,97.6915393286,Stroop,A2,2STRNS-2,
neutral,down,"[-0.7725490196, 0.0745098039, -1]", ,13,SOLL,,,,,,,,,0,83,83,83,down,1,0.42702633994,2017_Apr_22_1056,97.6915393286,Stroop,A2,2STRNS-2,
neutral,right,"[-0.8745098039, -0.2078431373, 0.637254902]", ,11,PECH,,,,,,,,,0,84,84,84,right,1,0.586590474488,2017_Apr_22_1056,97.6915393286,Stroop,A2,2STRNS-2,
neutral,left,"[0.568627451, -0.7882352941, -0.7882352941]", ,9,PECH,,,,,,,,,0,85,85,85,left,1,0.491076379819,2017_Apr_22_1056,97.6915393286,Stroop,A2,2STRNS-2,
neutral,left,"[0.568627451, -0.7882352941, -0.7882352941]", ,9,PECH,,,,,,,,,0,86,86,86,left,1,0.416460471931,2017_Apr_22_1056,97.6915393286,Stroop,A2,2STRNS-2,
neutralofneutral,down,"[-0.7725490196, 0.0745098039, -1]", ,19,MODE,,,,,,,,,0,87,87,87,down,1,0.548305441055,2017_Apr_22_1056,97.6915393286,Stroop,A2,2STRNS-2,
neutral,right,"[-0.8745098039, -0.2078431373, 0.637254902]", ,14,SOLL,,,,,,,,,0,88,88,88,right,1,0.480389826081,2017_Apr_22_1056,97.6915393286,Stroop,A2,2STRNS-2,
neutral,down,"[-0.7725490196, 0.0745098039, -1]", ,10,PECH,,,,,,,,,0,89,89,89,down,1,0.42663802243,2017_Apr_22_1056,97.6915393286,Stroop,A2,2STRNS-2,
neutral,down,"[-0.7725490196, 0.0745098039, -1]", ,13,SOLL,,,,,,,,,0,90,90,90,down,1,0.447946596565,2017_Apr_22_1056,97.6915393286,Stroop,A2,2STRNS-2,
neutralofneutral,right,"[-0.8745098039, -0.2078431373, 0.637254902]", ,20,MODE,,,,,,,,,0,91,91,91,right,1,0.899979466664,2017_Apr_22_1056,97.6915393286,Stroop,A2,2STRNS-2,
neutralofneutral,left,"[0.568627451, -0.7882352941, -0.7882352941]", ,15,HALS,,,,,,,,,0,92,92,92,left,1,0.458607728077,2017_Apr_22_1056,97.6915393286,Stroop,A2,2STRNS-2,
neutral,right,"[-0.8745098039, -0.2078431373, 0.637254902]", ,11,PECH,,,,,,,,,0,93,93,93,right,1,0.853654584591,2017_Apr_22_1056,97.6915393286,Stroop,A2,2STRNS-2,
neutralofneutral,down,"[-0.7725490196, 0.0745098039, -1]", ,16,HALS,,,,,,,,,0,94,94,94,down,1,0.607626947,2017_Apr_22_1056,97.6915393286,Stroop,A2,2STRNS-2,
neutralofneutral,left,"[0.568627451, -0.7882352941, -0.7882352941]", ,18,MODE,,,,,,,,,0,95,95,95,left,1,0.514504217715,2017_Apr_22_1056,97.6915393286,Stroop,A2,2STRNS-2,
neutralofneutral,right,"[-0.8745098039, -0.2078431373, 0.637254902]", ,17,HALS,,,,,,,,,0,96,96,96,right,1,0.544661681862,2017_Apr_22_1056,97.6915393286,Stroop,A2,2STRNS-2,
neutral,left,"[0.568627451, -0.7882352941, -0.7882352941]", ,12,SOLL,,,,,,,,,0,97,97,97,left,1,0.619004650032,2017_Apr_22_1056,97.6915393286,Stroop,A2,2STRNS-2,
fix,return,white, ,21,+,,,,,,,,,0,98,98,98,None,0,,2017_Apr_22_1056,97.6915393286,Stroop,A2,2STRNS-2,
fix,return,white, ,21,+,,,,,,,,,0,99,99,99,None,0,,2017_Apr_22_1056,97.6915393286,Stroop,A2,2STRNS-2,
fix,return,white, ,21,+,,,,,,,,,0,100,100,100,None,0,,2017_Apr_22_1056,97.6915393286,Stroop,A2,2STRNS-2,
fix,return,white, ,21,+,,,,,,,,,0,101,101,101,None,0,,2017_Apr_22_1056,97.6915393286,Stroop,A2,2STRNS-2,
fix,return,white, ,21,+,,,,,,,,,0,102,102,102,None,0,,2017_Apr_22_1056,97.6915393286,Stroop,A2,2STRNS-2,
fix,return,white, ,21,+,,,,,,,,,0,103,103,103,None,0,,2017_Apr_22_1056,97.6915393286,Stroop,A2,2STRNS-2,
fix,return,white, ,21,+,,,,,,,,,0,104,104,104,None,0,,2017_Apr_22_1056,97.6915393286,Stroop,A2,2STRNS-2,
fix,return,white, ,21,+,,,,,,,,,0,105,105,105,None,0,,2017_Apr_22_1056,97.6915393286,Stroop,A2,2STRNS-2,
fix,return,white, ,21,+,,,,,,,,,0,106,106,106,None,0,,2017_Apr_22_1056,97.6915393286,Stroop,A2,2STRNS-2,
fix,return,white, ,21,+,,,,,,,,,0,107,107,107,None,0,,2017_Apr_22_1056,97.6915393286,Stroop,A2,2STRNS-2,
fix,return,white, ,21,+,,,,,,,,,0,108,108,108,None,0,,2017_Apr_22_1056,97.6915393286,Stroop,A2,2STRNS-2,
fix,return,white, ,21,+,,,,,,,,,0,109,109,109,None,0,,2017_Apr_22_1056,97.6915393286,Stroop,A2,2STRNS-2,
fix,return,white,+,22,+,,,,,,,,,0,110,110,110,None,0,,2017_Apr_22_1056,97.6915393286,Stroop,A2,2STRNS-2,
incongruent,down,"[-0.7725490196, 0.0745098039, -1]", ,7,BLAU,,,,,,,,,0,111,111,111,down,1,0.629562975183,2017_Apr_22_1056,97.6915393286,Stroop,A2,2STRNS-2,
neutral,right,"[-0.8745098039, -0.2078431373, 0.637254902]", ,11,PECH,,,,,,,,,0,112,112,112,right,1,0.522648269543,2017_Apr_22_1056,97.6915393286,Stroop,A2,2STRNS-2,
neutral,left,"[0.568627451, -0.7882352941, -0.7882352941]", ,12,SOLL,,,,,,,,,0,113,113,113,left,1,0.504649892654,2017_Apr_22_1056,97.6915393286,Stroop,A2,2STRNS-2,
incongruent,left,"[0.568627451, -0.7882352941, -0.7882352941]", ,6,BLAU,,,,,,,,,0,114,114,114,left,1,0.397095999631,2017_Apr_22_1056,97.6915393286,Stroop,A2,2STRNS-2,
incongruent,left,"[0.568627451, -0.7882352941, -0.7882352941]", ,3,GRÜN,,,,,,,,,0,115,115,115,left,1,0.41787992608,2017_Apr_22_1056,97.6915393286,Stroop,A2,2STRNS-2,
neutral,down,"[-0.7725490196, 0.0745098039, -1]", ,10,PECH,,,,,,,,,0,116,116,116,down,1,0.396474132886,2017_Apr_22_1056,97.6915393286,Stroop,A2,2STRNS-2,
neutral,left,"[0.568627451, -0.7882352941, -0.7882352941]", ,9,PECH,,,,,,,,,0,117,117,117,left,1,0.525795038196,2017_Apr_22_1056,97.6915393286,Stroop,A2,2STRNS-2,
incongruent,right,"[-0.8745098039, -0.2078431373, 0.637254902]", ,2,ROT,,,,,,,,,0,118,118,118,right,1,0.578381609953,2017_Apr_22_1056,97.6915393286,Stroop,A2,2STRNS-2,
incongruent,right,"[-0.8745098039, -0.2078431373, 0.637254902]", ,5,GRÜN,,,,,,,,,0,119,119,119,right,1,0.557022191368,2017_Apr_22_1056,97.6915393286,Stroop,A2,2STRNS-2,
incongruent,down,"[-0.7725490196, 0.0745098039, -1]", ,1,ROT,,,,,,,,,0,120,120,120,down,1,0.386428163356,2017_Apr_22_1056,97.6915393286,Stroop,A2,2STRNS-2,
neutral,down,"[-0.7725490196, 0.0745098039, -1]", ,13,SOLL,,,,,,,,,0,121,121,121,down,1,0.523393056939,2017_Apr_22_1056,97.6915393286,Stroop,A2,2STRNS-2,
neutral,right,"[-0.8745098039, -0.2078431373, 0.637254902]", ,14,SOLL,,,,,,,,,0,122,122,122,right,1,0.512165372973,2017_Apr_22_1056,97.6915393286,Stroop,A2,2STRNS-2,
neutral,left,"[0.568627451, -0.7882352941, -0.7882352941]", ,12,SOLL,,,,,,,,,0,123,123,123,left,1,0.405149537162,2017_Apr_22_1056,97.6915393286,Stroop,A2,2STRNS-2,
congruent,down,"[-0.7725490196, 0.0745098039, -1]", ,4,GRÜN,,,,,,,,,0,124,124,124,down,1,0.629599013282,2017_Apr_22_1056,97.6915393286,Stroop,A2,2STRNS-2,
neutral,left,"[0.568627451, -0.7882352941, -0.7882352941]", ,9,PECH,,,,,,,,,0,125,125,125,left,1,0.543699269041,2017_Apr_22_1056,97.6915393286,Stroop,A2,2STRNS-2,
neutral,down,"[-0.7725490196, 0.0745098039, -1]", ,10,PECH,,,,,,,,,0,126,126,126,down,1,0.6208227582,2017_Apr_22_1056,97.6915393286,Stroop,A2,2STRNS-2,
neutral,right,"[-0.8745098039, -0.2078431373, 0.637254902]", ,14,SOLL,,,,,,,,,0,127,127,127,right,1,0.589054754166,2017_Apr_22_1056,97.6915393286,Stroop,A2,2STRNS-2,
congruent,right,"[-0.8745098039, -0.2078431373, 0.637254902]", ,8,BLAU,,,,,,,,,0,128,128,128,right,1,0.386104379188,2017_Apr_22_1056,97.6915393286,Stroop,A2,2STRNS-2,
congruent,down,"[-0.7725490196, 0.0745098039, -1]", ,4,GRÜN,,,,,,,,,0,129,129,129,down,1,0.514323747851,2017_Apr_22_1056,97.6915393286,Stroop,A2,2STRNS-2,
neutral,down,"[-0.7725490196, 0.0745098039, -1]", ,13,SOLL,,,,,,,,,0,130,130,130,down,1,0.407262654891,2017_Apr_22_1056,97.6915393286,Stroop,A2,2STRNS-2,
congruent,left,"[0.568627451, -0.7882352941, -0.7882352941]", ,0,ROT,,,,,,,,,0,131,131,131,left,1,0.364505824064,2017_Apr_22_1056,97.6915393286,Stroop,A2,2STRNS-2,
congruent,left,"[0.568627451, -0.7882352941, -0.7882352941]", ,0,ROT,,,,,,,,,0,132,132,132,left,1,0.363993189078,2017_Apr_22_1056,97.6915393286,Stroop,A2,2STRNS-2,
neutral,right,"[-0.8745098039, -0.2078431373, 0.637254902]", ,11,PECH,,,,,,,,,0,133,133,133,right,1,0.600226285743,2017_Apr_22_1056,97.6915393286,Stroop,A2,2STRNS-2,
congruent,right,"[-0.8745098039, -0.2078431373, 0.637254902]", ,8,BLAU,,,,,,,,,0,134,134,134,right,1,0.513292890577,2017_Apr_22_1056,97.6915393286,Stroop,A2,2STRNS-2,
neutral,down,"[-0.7725490196, 0.0745098039, -1]", ,10,PECH,,,,,,,,,0,135,135,135,down,1,0.610009652065,2017_Apr_22_1056,97.6915393286,Stroop,A2,2STRNS-2,
neutral,right,"[-0.8745098039, -0.2078431373, 0.637254902]", ,11,PECH,,,,,,,,,0,136,136,136,right,1,0.565516287685,2017_Apr_22_1056,97.6915393286,Stroop,A2,2STRNS-2,
neutralofneutral,left,"[0.568627451, -0.7882352941, -0.7882352941]", ,15,HALS,,,,,,,,,0,137,137,137,left,1,0.491137840144,2017_Apr_22_1056,97.6915393286,Stroop,A2,2STRNS-2,
neutralofneutral,right,"[-0.8745098039, -0.2078431373, 0.637254902]", ,17,HALS,,,,,,,,,0,138,138,138,right,1,0.971016986796,2017_Apr_22_1056,97.6915393286,Stroop,A2,2STRNS-2,
neutral,right,"[-0.8745098039, -0.2078431373, 0.637254902]", ,14,SOLL,,,,,,,,,0,139,139,139,right,1,0.469746294571,2017_Apr_22_1056,97.6915393286,Stroop,A2,2STRNS-2,
neutral,down,"[-0.7725490196, 0.0745098039, -1]", ,13,SOLL,,,,,,,,,0,140,140,140,down,1,0.514988357459,2017_Apr_22_1056,97.6915393286,Stroop,A2,2STRNS-2,
neutralofneutral,right,"[-0.8745098039, -0.2078431373, 0.637254902]", ,20,MODE,,,,,,,,,0,141,141,141,right,1,0.549074812581,2017_Apr_22_1056,97.6915393286,Stroop,A2,2STRNS-2,
neutral,left,"[0.568627451, -0.7882352941, -0.7882352941]", ,9,PECH,,,,,,,,,0,142,142,142,left,1,0.50440991802,2017_Apr_22_1056,97.6915393286,Stroop,A2,2STRNS-2,
neutralofneutral,down,"[-0.7725490196, 0.0745098039, -1]", ,19,MODE,,,,,,,,,0,143,143,143,down,1,0.593995605587,2017_Apr_22_1056,97.6915393286,Stroop,A2,2STRNS-2,
neutral,left,"[0.568627451, -0.7882352941, -0.7882352941]", ,12,SOLL,,,,,,,,,0,144,144,144,left,1,0.525251952413,2017_Apr_22_1056,97.6915393286,Stroop,A2,2STRNS-2,
neutralofneutral,down,"[-0.7725490196, 0.0745098039, -1]", ,16,HALS,,,,,,,,,0,145,145,145,down,1,1.15384553065,2017_Apr_22_1056,97.6915393286,Stroop,A2,2STRNS-2,
neutralofneutral,left,"[0.568627451, -0.7882352941, -0.7882352941]", ,18,MODE,,,,,,,,,0,146,146,146,left,1,0.763886471605,2017_Apr_22_1056,97.6915393286,Stroop,A2,2STRNS-2,
fix,return,white, ,21,+,,,,,,,,,0,147,147,147,None,0,,2017_Apr_22_1056,97.6915393286,Stroop,A2,2STRNS-2,
fix,return,white, ,21,+,,,,,,,,,0,148,148,148,None,0,,2017_Apr_22_1056,97.6915393286,Stroop,A2,2STRNS-2,
fix,return,white, ,21,+,,,,,,,,,0,149,149,149,None,0,,2017_Apr_22_1056,97.6915393286,Stroop,A2,2STRNS-2,
fix,return,white, ,21,+,,,,,,,,,0,150,150,150,None,0,,2017_Apr_22_1056,97.6915393286,Stroop,A2,2STRNS-2,
fix,return,white, ,21,+,,,,,,,,,0,151,151,151,None,0,,2017_Apr_22_1056,97.6915393286,Stroop,A2,2STRNS-2,
fix,return,white, ,21,+,,,,,,,,,0,152,152,152,None,0,,2017_Apr_22_1056,97.6915393286,Stroop,A2,2STRNS-2,
fix,return,white, ,21,+,,,,,,,,,0,153,153,153,None,0,,2017_Apr_22_1056,97.6915393286,Stroop,A2,2STRNS-2,
fix,return,white, ,21,+,,,,,,,,,0,154,154,154,None,0,,2017_Apr_22_1056,97.6915393286,Stroop,A2,2STRNS-2,
fix,return,white, ,21,+,,,,,,,,,0,155,155,155,None,0,,2017_Apr_22_1056,97.6915393286,Stroop,A2,2STRNS-2,
fix,return,white, ,21,+,,,,,,,,,0,156,156,156,None,0,,2017_Apr_22_1056,97.6915393286,Stroop,A2,2STRNS-2,
fix,return,white, ,21,+,,,,,,,,,0,157,157,157,None,0,,2017_Apr_22_1056,97.6915393286,Stroop,A2,2STRNS-2,
fix,return,white, ,21,+,,,,,,,,,0,158,158,158,None,0,,2017_Apr_22_1056,97.6915393286,Stroop,A2,2STRNS-2,
fix,return,white,+,22,+,,,,,,,,,0,159,159,159,None,0,,2017_Apr_22_1056,97.6915393286,Stroop,A2,2STRNS-2,
neutral,right,"[-0.8745098039, -0.2078431373, 0.637254902]", ,11,PECH,,,,,,,,,0,160,160,160,right,1,0.578063413087,2017_Apr_22_1056,97.6915393286,Stroop,A2,2STRNS-2,
neutralofneutral,right,"[-0.8745098039, -0.2078431373, 0.637254902]", ,17,HALS,,,,,,,,,0,161,161,161,right,1,0.492970475298,2017_Apr_22_1056,97.6915393286,Stroop,A2,2STRNS-2,
neutral,down,"[-0.7725490196, 0.0745098039, -1]", ,10,PECH,,,,,,,,,0,162,162,162,down,1,0.492596964139,2017_Apr_22_1056,97.6915393286,Stroop,A2,2STRNS-2,
neutral,down,"[-0.7725490196, 0.0745098039, -1]", ,13,SOLL,,,,,,,,,0,163,163,163,down,1,0.609574959946,2017_Apr_22_1056,97.6915393286,Stroop,A2,2STRNS-2,
neutralofneutral,left,"[0.568627451, -0.7882352941, -0.7882352941]", ,15,HALS,,,,,,,,,0,164,164,164,left,1,0.458552134419,2017_Apr_22_1056,97.6915393286,Stroop,A2,2STRNS-2,
neutral,left,"[0.568627451, -0.7882352941, -0.7882352941]", ,9,PECH,,,,,,,,,0,165,165,165,left,1,0.576775539908,2017_Apr_22_1056,97.6915393286,Stroop,A2,2STRNS-2,
neutral,right,"[-0.8745098039, -0.2078431373, 0.637254902]", ,14,SOLL,,,,,,,,,0,166,166,166,right,1,0.576423819228,2017_Apr_22_1056,97.6915393286,Stroop,A2,2STRNS-2,
neutralofneutral,down,"[-0.7725490196, 0.0745098039, -1]", ,16,HALS,,,,,,,,,0,167,167,167,down,1,0.469878993001,2017_Apr_22_1056,97.6915393286,Stroop,A2,2STRNS-2,
neutral,left,"[0.568627451, -0.7882352941, -0.7882352941]", ,12,SOLL,,,,,,,,,0,168,168,168,left,1,0.50202469867,2017_Apr_22_1056,97.6915393286,Stroop,A2,2STRNS-2,
neutralofneutral,down,"[-0.7725490196, 0.0745098039, -1]", ,19,MODE,,,,,,,,,0,169,169,169,down,1,0.569379627858,2017_Apr_22_1056,97.6915393286,Stroop,A2,2STRNS-2,
neutralofneutral,right,"[-0.8745098039, -0.2078431373, 0.637254902]", ,20,MODE,,,,,,,,,0,170,170,170,right,1,0.376067349342,2017_Apr_22_1056,97.6915393286,Stroop,A2,2STRNS-2,
neutralofneutral,left,"[0.568627451, -0.7882352941, -0.7882352941]", ,18,MODE,,,,,,,,,0,171,171,171,left,1,0.522755266382,2017_Apr_22_1056,97.6915393286,Stroop,A2,2STRNS-2,
congruent,down,"[-0.7725490196, 0.0745098039, -1]", ,4,GRÜN,,,,,,,,,0,172,172,172,down,1,0.522954174343,2017_Apr_22_1056,97.6915393286,Stroop,A2,2STRNS-2,
neutral,right,"[-0.8745098039, -0.2078431373, 0.637254902]", ,11,PECH,,,,,,,,,0,173,173,173,right,1,0.449045898292,2017_Apr_22_1056,97.6915393286,Stroop,A2,2STRNS-2,
congruent,left,"[0.568627451, -0.7882352941, -0.7882352941]", ,0,ROT,,,,,,,,,0,174,174,174,left,1,0.47022959622,2017_Apr_22_1056,97.6915393286,Stroop,A2,2STRNS-2,
congruent,down,"[-0.7725490196, 0.0745098039, -1]", ,4,GRÜN,,,,,,,,,0,175,175,175,down,1,0.640918608371,2017_Apr_22_1056,97.6915393286,Stroop,A2,2STRNS-2,
neutral,right,"[-0.8745098039, -0.2078431373, 0.637254902]", ,14,SOLL,,,,,,,,,0,176,176,176,right,1,0.4703891137,2017_Apr_22_1056,97.6915393286,Stroop,A2,2STRNS-2,
neutral,down,"[-0.7725490196, 0.0745098039, -1]", ,10,PECH,,,,,,,,,0,177,177,177,down,1,0.587083553915,2017_Apr_22_1056,97.6915393286,Stroop,A2,2STRNS-2,
congruent,right,"[-0.8745098039, -0.2078431373, 0.637254902]", ,8,BLAU,,,,,,,,,0,178,178,178,right,1,0.618910783354,2017_Apr_22_1056,97.6915393286,Stroop,A2,2STRNS-2,
congruent,right,"[-0.8745098039, -0.2078431373, 0.637254902]", ,8,BLAU,,,,,,,,,0,179,179,179,right,1,0.640202874946,2017_Apr_22_1056,97.6915393286,Stroop,A2,2STRNS-2,
neutral,left,"[0.568627451, -0.7882352941, -0.7882352941]", ,9,PECH,,,,,,,,,0,180,180,180,left,1,0.437817096866,2017_Apr_22_1056,97.6915393286,Stroop,A2,2STRNS-2,
congruent,left,"[0.568627451, -0.7882352941, -0.7882352941]", ,0,ROT,,,,,,,,,0,181,181,181,left,1,0.38499027111,2017_Apr_22_1056,97.6915393286,Stroop,A2,2STRNS-2,
neutral,down,"[-0.7725490196, 0.0745098039, -1]", ,13,SOLL,,,,,,,,,0,182,182,182,down,1,0.491366081443,2017_Apr_22_1056,97.6915393286,Stroop,A2,2STRNS-2,
neutral,left,"[0.568627451, -0.7882352941, -0.7882352941]", ,12,SOLL,,,,,,,,,0,183,183,183,left,1,0.608742172539,2017_Apr_22_1056,97.6915393286,Stroop,A2,2STRNS-2,
neutral,left,"[0.568627451, -0.7882352941, -0.7882352941]", ,9,PECH,,,,,,,,,0,184,184,184,left,1,0.363284998512,2017_Apr_22_1056,97.6915393286,Stroop,A2,2STRNS-2,
incongruent,left,"[0.568627451, -0.7882352941, -0.7882352941]", ,3,GRÜN,,,,,,,,,0,185,185,185,left,1,0.352054800261,2017_Apr_22_1056,97.6915393286,Stroop,A2,2STRNS-2,
incongruent,down,"[-0.7725490196, 0.0745098039, -1]", ,7,BLAU,,,,,,,,,0,186,186,186,down,1,0.693445675358,2017_Apr_22_1056,97.6915393286,Stroop,A2,2STRNS-2,
incongruent,right,"[-0.8745098039, -0.2078431373, 0.637254902]", ,2,ROT,,,,,,,,,0,187,187,187,right,1,0.522584853662,2017_Apr_22_1056,97.6915393286,Stroop,A2,2STRNS-2,
neutral,down,"[-0.7725490196, 0.0745098039, -1]", ,13,SOLL,,,,,,,,,0,188,188,188,down,1,0.41603108775,2017_Apr_22_1056,97.6915393286,Stroop,A2,2STRNS-2,
neutral,down,"[-0.7725490196, 0.0745098039, -1]", ,10,PECH,,,,,,,,,0,189,189,189,down,1,0.416112103633,2017_Apr_22_1056,97.6915393286,Stroop,A2,2STRNS-2,
incongruent,right,"[-0.8745098039, -0.2078431373, 0.637254902]", ,5,GRÜN,,,,,,,,,0,190,190,190,right,1,0.555317226072,2017_Apr_22_1056,97.6915393286,Stroop,A2,2STRNS-2,
incongruent,left,"[0.568627451, -0.7882352941, -0.7882352941]", ,6,BLAU,,,,,,,,,0,191,191,191,left,1,0.480838765821,2017_Apr_22_1056,97.6915393286,Stroop,A2,2STRNS-2,
neutral,right,"[-0.8745098039, -0.2078431373, 0.637254902]", ,14,SOLL,,,,,,,,,0,192,192,192,right,1,0.62909475925,2017_Apr_22_1056,97.6915393286,Stroop,A2,2STRNS-2,
neutral,left,"[0.568627451, -0.7882352941, -0.7882352941]", ,12,SOLL,,,,,,,,,0,193,193,193,left,1,0.523862669697,2017_Apr_22_1056,97.6915393286,Stroop,A2,2STRNS-2,
incongruent,down,"[-0.7725490196, 0.0745098039, -1]", ,1,ROT,,,,,,,,,0,194,194,194,down,1,0.459149417035,2017_Apr_22_1056,97.6915393286,Stroop,A2,2STRNS-2,
neutral,right,"[-0.8745098039, -0.2078431373, 0.637254902]", ,11,PECH,,,,,,,,,0,195,195,195,right,1,0.427009578033,2017_Apr_22_1056,97.6915393286,Stroop,A2,2STRNS-2,
fix,return,white, ,21,+,,,,,,,,,0,196,196,196,None,0,,2017_Apr_22_1056,97.6915393286,Stroop,A2,2STRNS-2,
fix,return,white, ,21,+,,,,,,,,,0,197,197,197,None,0,,2017_Apr_22_1056,97.6915393286,Stroop,A2,2STRNS-2,
fix,return,white, ,21,+,,,,,,,,,0,198,198,198,None,0,,2017_Apr_22_1056,97.6915393286,Stroop,A2,2STRNS-2,
fix,return,white, ,21,+,,,,,,,,,0,199,199,199,None,0,,2017_Apr_22_1056,97.6915393286,Stroop,A2,2STRNS-2,
fix,return,white, ,21,+,,,,,,,,,0,200,200,200,None,0,,2017_Apr_22_1056,97.6915393286,Stroop,A2,2STRNS-2,
fix,return,white, ,21,+,,,,,,,,,0,201,201,201,None,0,,2017_Apr_22_1056,97.6915393286,Stroop,A2,2STRNS-2,
fix,return,white, ,21,+,,,,,,,,,0,202,202,202,None,0,,2017_Apr_22_1056,97.6915393286,Stroop,A2,2STRNS-2,
fix,return,white, ,21,+,,,,,,,,,0,203,203,203,None,0,,2017_Apr_22_1056,97.6915393286,Stroop,A2,2STRNS-2,
fix,return,white, ,21,+,,,,,,,,,0,204,204,204,None,0,,2017_Apr_22_1056,97.6915393286,Stroop,A2,2STRNS-2,
fix,return,white, ,21,+,,,,,,,,,0,205,205,205,None,0,,2017_Apr_22_1056,97.6915393286,Stroop,A2,2STRNS-2,
fix,return,white, ,21,+,,,,,,,,,0,206,206,206,None,0,,2017_Apr_22_1056,97.6915393286,Stroop,A2,2STRNS-2,
fix,return,white, ,21,+,,,,,,,,,0,207,207,207,None,0,,2017_Apr_22_1056,97.6915393286,Stroop,A2,2STRNS-2,
fix,return,white,+,22,+,,,,,,,,,0,208,208,208,None,0,,2017_Apr_22_1056,97.6915393286,Stroop,A2,2STRNS-2,
neutral,right,"[-0.8745098039, -0.2078431373, 0.637254902]", ,14,SOLL,,,,,,,,,0,209,209,209,right,1,0.53395305828,2017_Apr_22_1056,97.6915393286,Stroop,A2,2STRNS-2,
neutralofneutral,left,"[0.568627451, -0.7882352941, -0.7882352941]", ,18,MODE,,,,,,,,,0,210,210,210,left,1,0.503432419483,2017_Apr_22_1056,97.6915393286,Stroop,A2,2STRNS-2,
neutral,down,"[-0.7725490196, 0.0745098039, -1]", ,10,PECH,,,,,,,,,0,211,211,211,down,1,0.373547196641,2017_Apr_22_1056,97.6915393286,Stroop,A2,2STRNS-2,
neutral,left,"[0.568627451, -0.7882352941, -0.7882352941]", ,12,SOLL,,,,,,,,,0,212,212,212,left,1,0.426877158969,2017_Apr_22_1056,97.6915393286,Stroop,A2,2STRNS-2,
neutral,down,"[-0.7725490196, 0.0745098039, -1]", ,13,SOLL,,,,,,,,,0,213,213,213,down,1,0.619641881859,2017_Apr_22_1056,97.6915393286,Stroop,A2,2STRNS-2,
neutralofneutral,right,"[-0.8745098039, -0.2078431373, 0.637254902]", ,20,MODE,,,,,,,,,0,214,214,214,right,1,0.355143740336,2017_Apr_22_1056,97.6915393286,Stroop,A2,2STRNS-2,
neutralofneutral,right,"[-0.8745098039, -0.2078431373, 0.637254902]", ,17,HALS,,,,,,,,,0,215,215,215,right,1,0.525810962008,2017_Apr_22_1056,97.6915393286,Stroop,A2,2STRNS-2,
neutral,left,"[0.568627451, -0.7882352941, -0.7882352941]", ,9,PECH,,,,,,,,,0,216,216,216,left,1,0.471721685298,2017_Apr_22_1056,97.6915393286,Stroop,A2,2STRNS-2,
neutral,right,"[-0.8745098039, -0.2078431373, 0.637254902]", ,11,PECH,,,,,,,,,0,217,217,217,right,1,0.557974267679,2017_Apr_22_1056,97.6915393286,Stroop,A2,2STRNS-2,
neutralofneutral,left,"[0.568627451, -0.7882352941, -0.7882352941]", ,15,HALS,,,,,,,,,0,218,218,218,left,1,0.642457351423,2017_Apr_22_1056,97.6915393286,Stroop,A2,2STRNS-2,
neutralofneutral,down,"[-0.7725490196, 0.0745098039, -1]", ,16,HALS,,,,,,,,,0,219,219,219,down,1,0.375169190498,2017_Apr_22_1056,97.6915393286,Stroop,A2,2STRNS-2,
neutralofneutral,down,"[-0.7725490196, 0.0745098039, -1]", ,19,MODE,,,,,,,,,0,220,220,220,down,1,0.409432483737,2017_Apr_22_1056,97.6915393286,Stroop,A2,2STRNS-2,
neutral,down,"[-0.7725490196, 0.0745098039, -1]", ,13,SOLL,,,,,,,,,0,221,221,221,down,1,0.501910997068,2017_Apr_22_1056,97.6915393286,Stroop,A2,2STRNS-2,
neutral,left,"[0.568627451, -0.7882352941, -0.7882352941]", ,9,PECH,,,,,,,,,0,222,222,222,left,1,0.522922047355,2017_Apr_22_1056,97.6915393286,Stroop,A2,2STRNS-2,
incongruent,down,"[-0.7725490196, 0.0745098039, -1]", ,7,BLAU,,,,,,,,,0,223,223,223,right,0,0.640933135357,2017_Apr_22_1056,97.6915393286,Stroop,A2,2STRNS-2,
incongruent,right,"[-0.8745098039, -0.2078431373, 0.637254902]", ,5,GRÜN,,,,,,,,,0,224,224,224,right,1,0.544574240581,2017_Apr_22_1056,97.6915393286,Stroop,A2,2STRNS-2,
neutral,down,"[-0.7725490196, 0.0745098039, -1]", ,10,PECH,,,,,,,,,0,225,225,225,down,1,0.600587225471,2017_Apr_22_1056,97.6915393286,Stroop,A2,2STRNS-2,
incongruent,down,"[-0.7725490196, 0.0745098039, -1]", ,1,ROT,,,,,,,,,0,226,226,226,down,1,0.396645383701,2017_Apr_22_1056,97.6915393286,Stroop,A2,2STRNS-2,
incongruent,left,"[0.568627451, -0.7882352941, -0.7882352941]", ,6,BLAU,,,,,,,,,0,227,227,227,left,1,0.728933984627,2017_Apr_22_1056,97.6915393286,Stroop,A2,2STRNS-2,
incongruent,right,"[-0.8745098039, -0.2078431373, 0.637254902]", ,2,ROT,,,,,,,,,0,228,228,228,right,1,0.674785203147,2017_Apr_22_1056,97.6915393286,Stroop,A2,2STRNS-2,
incongruent,left,"[0.568627451, -0.7882352941, -0.7882352941]", ,3,GRÜN,,,,,,,,,0,229,229,229,left,1,0.43952960502,2017_Apr_22_1056,97.6915393286,Stroop,A2,2STRNS-2,
neutral,left,"[0.568627451, -0.7882352941, -0.7882352941]", ,12,SOLL,,,,,,,,,0,230,230,230,left,1,0.397608075887,2017_Apr_22_1056,97.6915393286,Stroop,A2,2STRNS-2,
neutral,right,"[-0.8745098039, -0.2078431373, 0.637254902]", ,11,PECH,,,,,,,,,0,231,231,231,right,1,0.664923055863,2017_Apr_22_1056,97.6915393286,Stroop,A2,2STRNS-2,
neutral,right,"[-0.8745098039, -0.2078431373, 0.637254902]", ,14,SOLL,,,,,,,,,0,232,232,232,right,1,0.568394027733,2017_Apr_22_1056,97.6915393286,Stroop,A2,2STRNS-2,
neutral,down,"[-0.7725490196, 0.0745098039, -1]", ,10,PECH,,,,,,,,,0,233,233,233,down,1,0.450754215969,2017_Apr_22_1056,97.6915393286,Stroop,A2,2STRNS-2,
neutral,right,"[-0.8745098039, -0.2078431373, 0.637254902]", ,14,SOLL,,,,,,,,,0,234,234,234,right,1,0.607737854951,2017_Apr_22_1056,97.6915393286,Stroop,A2,2STRNS-2,
congruent,right,"[-0.8745098039, -0.2078431373, 0.637254902]", ,8,BLAU,,,,,,,,,0,235,235,235,right,1,0.512320979342,2017_Apr_22_1056,97.6915393286,Stroop,A2,2STRNS-2,
congruent,left,"[0.568627451, -0.7882352941, -0.7882352941]", ,0,ROT,,,,,,,,,0,236,236,236,left,1,0.469312999278,2017_Apr_22_1056,97.6915393286,Stroop,A2,2STRNS-2,
neutral,right,"[-0.8745098039, -0.2078431373, 0.637254902]", ,11,PECH,,,,,,,,,0,237,237,237,right,1,0.543786989687,2017_Apr_22_1056,97.6915393286,Stroop,A2,2STRNS-2,
congruent,left,"[0.568627451, -0.7882352941, -0.7882352941]", ,0,ROT,,,,,,,,,0,238,238,238,left,1,0.426494708126,2017_Apr_22_1056,97.6915393286,Stroop,A2,2STRNS-2,
congruent,down,"[-0.7725490196, 0.0745098039, -1]", ,4,GRÜN,,,,,,,,,0,239,239,239,down,1,0.405864991221,2017_Apr_22_1056,97.6915393286,Stroop,A2,2STRNS-2,
neutral,left,"[0.568627451, -0.7882352941, -0.7882352941]", ,9,PECH,,,,,,,,,0,240,240,240,left,1,0.654127270365,2017_Apr_22_1056,97.6915393286,Stroop,A2,2STRNS-2,
congruent,down,"[-0.7725490196, 0.0745098039, -1]", ,4,GRÜN,,,,,,,,,0,241,241,241,down,1,0.50220656536,2017_Apr_22_1056,97.6915393286,Stroop,A2,2STRNS-2,
neutral,down,"[-0.7725490196, 0.0745098039, -1]", ,13,SOLL,,,,,,,,,0,242,242,242,down,1,0.480415807037,2017_Apr_22_1056,97.6915393286,Stroop,A2,2STRNS-2,
neutral,left,"[0.568627451, -0.7882352941, -0.7882352941]", ,12,SOLL,,,,,,,,,0,243,243,243,left,1,0.482028581845,2017_Apr_22_1056,97.6915393286,Stroop,A2,2STRNS-2,
congruent,right,"[-0.8745098039, -0.2078431373, 0.637254902]", ,8,BLAU,,,,,,,,,0,244,244,244,right,1,0.461220629996,2017_Apr_22_1056,97.6915393286,Stroop,A2,2STRNS-2,
fix,return,white, ,21,+,,,,,,,,,0,245,245,245,None,0,,2017_Apr_22_1056,97.6915393286,Stroop,A2,2STRNS-2,
fix,return,white, ,21,+,,,,,,,,,0,246,246,246,None,0,,2017_Apr_22_1056,97.6915393286,Stroop,A2,2STRNS-2,
fix,return,white, ,21,+,,,,,,,,,0,247,247,247,None,0,,2017_Apr_22_1056,97.6915393286,Stroop,A2,2STRNS-2,
fix,return,white, ,21,+,,,,,,,,,0,248,248,248,None,0,,2017_Apr_22_1056,97.6915393286,Stroop,A2,2STRNS-2,
fix,return,white, ,21,+,,,,,,,,,0,249,249,249,None,0,,2017_Apr_22_1056,97.6915393286,Stroop,A2,2STRNS-2,
fix,return,white, ,21,+,,,,,,,,,0,250,250,250,None,0,,2017_Apr_22_1056,97.6915393286,Stroop,A2,2STRNS-2,
fix,return,white, ,21,+,,,,,,,,,0,251,251,251,None,0,,2017_Apr_22_1056,97.6915393286,Stroop,A2,2STRNS-2,
fix,return,white, ,21,+,,,,,,,,,0,252,252,252,None,0,,2017_Apr_22_1056,97.6915393286,Stroop,A2,2STRNS-2,
fix,return,white, ,21,+,,,,,,,,,0,253,253,253,None,0,,2017_Apr_22_1056,97.6915393286,Stroop,A2,2STRNS-2,
fix,return,white, ,21,+,,,,,,,,,0,254,254,254,None,0,,2017_Apr_22_1056,97.6915393286,Stroop,A2,2STRNS-2,
fix,return,white, ,21,+,,,,,,,,,0,255,255,255,None,0,,2017_Apr_22_1056,97.6915393286,Stroop,A2,2STRNS-2,
fix,return,white, ,21,+,,,,,,,,,0,256,256,256,None,0,,2017_Apr_22_1056,97.6915393286,Stroop,A2,2STRNS-2,
fix,return,white,+,22,+,,,,,,,,,0,257,257,257,None,0,,2017_Apr_22_1056,97.6915393286,Stroop,A2,2STRNS-2,
congruent,right,"[-0.8745098039, -0.2078431373, 0.637254902]", ,8,BLAU,,,,,,,,,0,258,258,258,right,1,0.535613045792,2017_Apr_22_1056,97.6915393286,Stroop,A2,2STRNS-2,
neutral,down,"[-0.7725490196, 0.0745098039, -1]", ,13,SOLL,,,,,,,,,0,259,259,259,down,1,0.439368690714,2017_Apr_22_1056,97.6915393286,Stroop,A2,2STRNS-2,
neutral,left,"[0.568627451, -0.7882352941, -0.7882352941]", ,9,PECH,,,,,,,,,0,260,260,260,left,1,0.386793852291,2017_Apr_22_1056,97.6915393286,Stroop,A2,2STRNS-2,
congruent,down,"[-0.7725490196, 0.0745098039, -1]", ,4,GRÜN,,,,,,,,,0,261,261,261,down,1,0.653275206765,2017_Apr_22_1056,97.6915393286,Stroop,A2,2STRNS-2,
neutral,right,"[-0.8745098039, -0.2078431373, 0.637254902]", ,14,SOLL,,,,,,,,,0,262,262,262,right,1,0.384397737701,2017_Apr_22_1056,97.6915393286,Stroop,A2,2STRNS-2,
neutral,down,"[-0.7725490196, 0.0745098039, -1]", ,10,PECH,,,,,,,,,0,263,263,263,down,1,0.416276929051,2017_Apr_22_1056,97.6915393286,Stroop,A2,2STRNS-2,
neutral,right,"[-0.8745098039, -0.2078431373, 0.637254902]", ,11,PECH,,,,,,,,,0,264,264,264,right,1,0.639612297094,2017_Apr_22_1056,97.6915393286,Stroop,A2,2STRNS-2,
congruent,down,"[-0.7725490196, 0.0745098039, -1]", ,4,GRÜN,,,,,,,,,0,265,265,265,down,1,0.512672141292,2017_Apr_22_1056,97.6915393286,Stroop,A2,2STRNS-2,
congruent,left,"[0.568627451, -0.7882352941, -0.7882352941]", ,0,ROT,,,,,,,,,0,266,266,266,left,1,0.404969067298,2017_Apr_22_1056,97.6915393286,Stroop,A2,2STRNS-2,
congruent,right,"[-0.8745098039, -0.2078431373, 0.637254902]", ,8,BLAU,,,,,,,,,0,267,267,267,right,1,0.480871451539,2017_Apr_22_1056,97.6915393286,Stroop,A2,2STRNS-2,
neutral,left,"[0.568627451, -0.7882352941, -0.7882352941]", ,12,SOLL,,,,,,,,,0,268,268,268,left,1,0.726159889036,2017_Apr_22_1056,97.6915393286,Stroop,A2,2STRNS-2,
congruent,left,"[0.568627451, -0.7882352941, -0.7882352941]", ,0,ROT,,,,,,,,,0,269,269,269,left,1,0.534009210668,2017_Apr_22_1056,97.6915393286,Stroop,A2,2STRNS-2,
neutral,left,"[0.568627451, -0.7882352941, -0.7882352941]", ,9,PECH,,,,,,,,,0,270,270,270,left,1,0.482226372346,2017_Apr_22_1056,97.6915393286,Stroop,A2,2STRNS-2,
neutralofneutral,left,"[0.568627451, -0.7882352941, -0.7882352941]", ,15,HALS,,,,,,,,,0,271,271,271,left,1,0.449974787298,2017_Apr_22_1056,97.6915393286,Stroop,A2,2STRNS-2,
neutral,right,"[-0.8745098039, -0.2078431373, 0.637254902]", ,11,PECH,,,,,,,,,0,272,272,272,right,1,0.889646309796,2017_Apr_22_1056,97.6915393286,Stroop,A2,2STRNS-2,
neutralofneutral,left,"[0.568627451, -0.7882352941, -0.7882352941]", ,18,MODE,,,,,,,,,0,273,273,273,left,1,0.51709449106,2017_Apr_22_1056,97.6915393286,Stroop,A2,2STRNS-2,
neutralofneutral,down,"[-0.7725490196, 0.0745098039, -1]", ,16,HALS,,,,,,,,,0,274,274,274,down,1,0.546291777307,2017_Apr_22_1056,97.6915393286,Stroop,A2,2STRNS-2,
neutral,down,"[-0.7725490196, 0.0745098039, -1]", ,10,PECH,,,,,,,,,0,275,275,275,down,1,0.804433803738,2017_Apr_22_1056,97.6915393286,Stroop,A2,2STRNS-2,
neutral,left,"[0.568627451, -0.7882352941, -0.7882352941]", ,12,SOLL,,,,,,,,,0,276,276,276,left,1,0.450120336523,2017_Apr_22_1056,97.6915393286,Stroop,A2,2STRNS-2,
neutralofneutral,right,"[-0.8745098039, -0.2078431373, 0.637254902]", ,17,HALS,,,,,,,,,0,277,277,277,right,1,0.480551857848,2017_Apr_22_1056,97.6915393286,Stroop,A2,2STRNS-2,
neutral,down,"[-0.7725490196, 0.0745098039, -1]", ,13,SOLL,,,,,,,,,0,278,278,278,down,1,0.607752940667,2017_Apr_22_1056,97.6915393286,Stroop,A2,2STRNS-2,
neutral,right,"[-0.8745098039, -0.2078431373, 0.637254902]", ,14,SOLL,,,,,,,,,0,279,279,279,right,1,0.693156532464,2017_Apr_22_1056,97.6915393286,Stroop,A2,2STRNS-2,
neutralofneutral,down,"[-0.7725490196, 0.0745098039, -1]", ,19,MODE,,,,,,,,,0,280,280,280,down,1,0.793469561076,2017_Apr_22_1056,97.6915393286,Stroop,A2,2STRNS-2,
neutralofneutral,right,"[-0.8745098039, -0.2078431373, 0.637254902]", ,20,MODE,,,,,,,,,0,281,281,281,right,1,0.408831569375,2017_Apr_22_1056,97.6915393286,Stroop,A2,2STRNS-2,
neutral,down,"[-0.7725490196, 0.0745098039, -1]", ,13,SOLL,,,,,,,,,0,282,282,282,down,1,0.514075392264,2017_Apr_22_1056,97.6915393286,Stroop,A2,2STRNS-2,
neutral,right,"[-0.8745098039, -0.2078431373, 0.637254902]", ,11,PECH,,,,,,,,,0,283,283,283,right,1,0.492849230838,2017_Apr_22_1056,97.6915393286,Stroop,A2,2STRNS-2,
incongruent,left,"[0.568627451, -0.7882352941, -0.7882352941]", ,6,BLAU,,,,,,,,,0,284,284,284,left,1,0.46036605211,2017_Apr_22_1056,97.6915393286,Stroop,A2,2STRNS-2,
incongruent,down,"[-0.7725490196, 0.0745098039, -1]", ,7,BLAU,,,,,,,,,0,285,285,285,down,1,0.673508783938,2017_Apr_22_1056,97.6915393286,Stroop,A2,2STRNS-2,
incongruent,right,"[-0.8745098039, -0.2078431373, 0.637254902]", ,2,ROT,,,,,,,,,0,286,286,286,right,1,0.619834643789,2017_Apr_22_1056,97.6915393286,Stroop,A2,2STRNS-2,
neutral,down,"[-0.7725490196, 0.0745098039, -1]", ,10,PECH,,,,,,,,,0,287,287,287,down,1,0.652040692323,2017_Apr_22_1056,97.6915393286,Stroop,A2,2STRNS-2,
neutral,left,"[0.568627451, -0.7882352941, -0.7882352941]", ,12,SOLL,,,,,,,,,0,288,288,288,left,1,0.395656431195,2017_Apr_22_1056,97.6915393286,Stroop,A2,2STRNS-2,
incongruent,down,"[-0.7725490196, 0.0745098039, -1]", ,1,ROT,,,,,,,,,0,289,289,289,down,1,0.684167121799,2017_Apr_22_1056,97.6915393286,Stroop,A2,2STRNS-2,
neutral,right,"[-0.8745098039, -0.2078431373, 0.637254902]", ,14,SOLL,,,,,,,,,0,290,290,290,right,1,0.449701847581,2017_Apr_22_1056,97.6915393286,Stroop,A2,2STRNS-2,
incongruent,left,"[0.568627451, -0.7882352941, -0.7882352941]", ,3,GRÜN,,,,,,,,,0,291,291,291,left,1,0.363599842997,2017_Apr_22_1056,97.6915393286,Stroop,A2,2STRNS-2,
neutral,left,"[0.568627451, -0.7882352941, -0.7882352941]", ,9,PECH,,,,,,,,,0,292,292,292,left,1,0.426755355778,2017_Apr_22_1056,97.6915393286,Stroop,A2,2STRNS-2,
incongruent,right,"[-0.8745098039, -0.2078431373, 0.637254902]", ,5,GRÜN,,,,,,,,,0,293,293,293,right,1,0.8766538764,2017_Apr_22_1056,97.6915393286,Stroop,A2,2STRNS-2,
fix,return,white, ,21,+,,,,,,,,,0,294,294,294,None,0,,2017_Apr_22_1056,97.6915393286,Stroop,A2,2STRNS-2,
fix,return,white, ,21,+,,,,,,,,,0,295,295,295,None,0,,2017_Apr_22_1056,97.6915393286,Stroop,A2,2STRNS-2,
fix,return,white, ,21,+,,,,,,,,,0,296,296,296,None,0,,2017_Apr_22_1056,97.6915393286,Stroop,A2,2STRNS-2,
fix,return,white, ,21,+,,,,,,,,,0,297,297,297,None,0,,2017_Apr_22_1056,97.6915393286,Stroop,A2,2STRNS-2,
fix,return,white, ,21,+,,,,,,,,,0,298,298,298,None,0,,2017_Apr_22_1056,97.6915393286,Stroop,A2,2STRNS-2,
fix,return,white, ,21,+,,,,,,,,,0,299,299,299,None,0,,2017_Apr_22_1056,97.6915393286,Stroop,A2,2STRNS-2,
fix,return,white, ,21,+,,,,,,,,,0,300,300,300,None,0,,2017_Apr_22_1056,97.6915393286,Stroop,A2,2STRNS-2,
fix,return,white, ,21,+,,,,,,,,,0,301,301,301,None,0,,2017_Apr_22_1056,97.6915393286,Stroop,A2,2STRNS-2,
fix,return,white, ,21,+,,,,,,,,,0,302,302,302,None,0,,2017_Apr_22_1056,97.6915393286,Stroop,A2,2STRNS-2,
fix,return,white, ,21,+,,,,,,,,,0,303,303,303,None,0,,2017_Apr_22_1056,97.6915393286,Stroop,A2,2STRNS-2,
fix,return,white, ,21,+,,,,,,,,,0,304,304,304,None,0,,2017_Apr_22_1056,97.6915393286,Stroop,A2,2STRNS-2,
fix,return,white, ,21,+,,,,,,,,,0,305,305,305,None,0,,2017_Apr_22_1056,97.6915393286,Stroop,A2,2STRNS-2,
fix,return,white,+,22,+,,,,,,,,,0,306,306,306,None,0,,2017_Apr_22_1056,97.6915393286,Stroop,A2,2STRNS-2,
