congruent,corrAns,letterColor,signal,selectedrownumber_novariable,Anzeigetext,practice.thisRepN,practice.thisTrialN,practice.thisN,practice.thisIndex,Wrongresponse.thisRepN,Wrongresponse.thisTrialN,Wrongresponse.thisN,Wrongresponse.thisIndex,trials.thisRepN,trials.thisTrialN,trials.thisN,trials.thisIndex,resp.keys,resp.corr,resp.rt,date,frameRate,expName,session,participant,
neutralofneutral,right,"[-0.8745098039, -0.2078431373, 0.637254902]", ,17,HALS,0,0,0,0,0,0,0,0,,,,,down,0,0.799619225348,2017_Jun_07_1615,99.0197732767,Stroop,A-2,1STACS-8,
,,,,,,0,0,0,0,,,,,,,,,,,,2017_Jun_07_1615,99.0197732767,Stroop,A-2,1STACS-8,
neutralofneutral,right,"[-0.8745098039, -0.2078431373, 0.637254902]", ,17,HALS,1,0,1,0,0,0,0,0,,,,,right,1,0.309533474226,2017_Jun_07_1615,99.0197732767,Stroop,A-2,1STACS-8,
,,,,,,1,0,1,0,,,,,,,,,,,,2017_Jun_07_1615,99.0197732767,Stroop,A-2,1STACS-8,
neutralofneutral,right,"[-0.8745098039, -0.2078431373, 0.637254902]", ,17,HALS,2,0,2,0,0,0,0,0,,,,,right,1,0.470139361288,2017_Jun_07_1615,99.0197732767,Stroop,A-2,1STACS-8,
,,,,,,2,0,2,0,,,,,,,,,,,,2017_Jun_07_1615,99.0197732767,Stroop,A-2,1STACS-8,
neutralofneutral,down,"[-0.7725490196, 0.0745098039, -1]", ,19,MODE,3,0,3,0,0,0,0,0,,,,,down,1,0.59757874255,2017_Jun_07_1615,99.0197732767,Stroop,A-2,1STACS-8,
,,,,,,3,0,3,0,,,,,,,,,,,,2017_Jun_07_1615,99.0197732767,Stroop,A-2,1STACS-8,
neutral,left,"[0.568627451, -0.7882352941, -0.7882352941]", ,9,PECH,4,0,4,0,0,0,0,0,,,,,left,1,0.479626600587,2017_Jun_07_1615,99.0197732767,Stroop,A-2,1STACS-8,
,,,,,,4,0,4,0,,,,,,,,,,,,2017_Jun_07_1615,99.0197732767,Stroop,A-2,1STACS-8,
neutralofneutral,left,"[0.568627451, -0.7882352941, -0.7882352941]", ,15,HALS,5,0,5,0,0,0,0,0,,,,,left,1,0.384142397986,2017_Jun_07_1615,99.0197732767,Stroop,A-2,1STACS-8,
,,,,,,5,0,5,0,,,,,,,,,,,,2017_Jun_07_1615,99.0197732767,Stroop,A-2,1STACS-8,
neutralofneutral,down,"[-0.7725490196, 0.0745098039, -1]", ,19,MODE,6,0,6,0,0,0,0,0,,,,,down,1,0.415579633724,2017_Jun_07_1615,99.0197732767,Stroop,A-2,1STACS-8,
,,,,,,6,0,6,0,,,,,,,,,,,,2017_Jun_07_1615,99.0197732767,Stroop,A-2,1STACS-8,
neutralofneutral,right,"[-0.8745098039, -0.2078431373, 0.637254902]", ,17,HALS,7,0,7,0,0,0,0,0,,,,,right,1,0.480885419795,2017_Jun_07_1615,99.0197732767,Stroop,A-2,1STACS-8,
,,,,,,7,0,7,0,,,,,,,,,,,,2017_Jun_07_1615,99.0197732767,Stroop,A-2,1STACS-8,
neutral,down,"[-0.7725490196, 0.0745098039, -1]", ,10,PECH,8,0,8,0,0,0,0,0,,,,,left,0,0.566260795716,2017_Jun_07_1615,99.0197732767,Stroop,A-2,1STACS-8,
,,,,,,8,0,8,0,,,,,,,,,,,,2017_Jun_07_1615,99.0197732767,Stroop,A-2,1STACS-8,
neutral,down,"[-0.7725490196, 0.0745098039, -1]", ,10,PECH,9,0,9,0,0,0,0,0,,,,,down,1,0.278408848052,2017_Jun_07_1615,99.0197732767,Stroop,A-2,1STACS-8,
,,,,,,9,0,9,0,,,,,,,,,,,,2017_Jun_07_1615,99.0197732767,Stroop,A-2,1STACS-8,
incongruent,right,"[-0.8745098039, -0.2078431373, 0.637254902]", ,5,GRÜN,10,0,10,0,0,0,0,0,,,,,right,1,0.744361084998,2017_Jun_07_1615,99.0197732767,Stroop,A-2,1STACS-8,
,,,,,,10,0,10,0,,,,,,,,,,,,2017_Jun_07_1615,99.0197732767,Stroop,A-2,1STACS-8,
neutral,left,"[0.568627451, -0.7882352941, -0.7882352941]", ,9,PECH,11,0,11,0,0,0,0,0,,,,,left,1,0.747393872685,2017_Jun_07_1615,99.0197732767,Stroop,A-2,1STACS-8,
,,,,,,11,0,11,0,,,,,,,,,,,,2017_Jun_07_1615,99.0197732767,Stroop,A-2,1STACS-8,
incongruent,right,"[-0.8745098039, -0.2078431373, 0.637254902]", ,2,ROT,12,0,12,0,0,0,0,0,,,,,down,0,0.630333184804,2017_Jun_07_1615,99.0197732767,Stroop,A-2,1STACS-8,
,,,,,,12,0,12,0,,,,,,,,,,,,2017_Jun_07_1615,99.0197732767,Stroop,A-2,1STACS-8,
incongruent,right,"[-0.8745098039, -0.2078431373, 0.637254902]", ,2,ROT,13,0,13,0,0,0,0,0,,,,,right,1,0.277877216238,2017_Jun_07_1615,99.0197732767,Stroop,A-2,1STACS-8,
,,,,,,13,0,13,0,,,,,,,,,,,,2017_Jun_07_1615,99.0197732767,Stroop,A-2,1STACS-8,
congruent,down,"[-0.7725490196, 0.0745098039, -1]", ,4,GRÜN,14,0,14,0,0,0,0,0,,,,,down,1,0.479015349716,2017_Jun_07_1615,99.0197732767,Stroop,A-2,1STACS-8,
,,,,,,14,0,14,0,,,,,,,,,,,,2017_Jun_07_1615,99.0197732767,Stroop,A-2,1STACS-8,
congruent,down,"[-0.7725490196, 0.0745098039, -1]", ,4,GRÜN,15,0,15,0,0,0,0,0,,,,,down,1,0.425929273134,2017_Jun_07_1615,99.0197732767,Stroop,A-2,1STACS-8,
,,,,,,15,0,15,0,,,,,,,,,,,,2017_Jun_07_1615,99.0197732767,Stroop,A-2,1STACS-8,
neutralofneutral,down,"[-0.7725490196, 0.0745098039, -1]", ,19,MODE,16,0,16,0,0,0,0,0,,,,,down,1,0.417154135512,2017_Jun_07_1615,99.0197732767,Stroop,A-2,1STACS-8,
,,,,,,16,0,16,0,,,,,,,,,,,,2017_Jun_07_1615,99.0197732767,Stroop,A-2,1STACS-8,
congruent,down,"[-0.7725490196, 0.0745098039, -1]", ,4,GRÜN,17,0,17,0,0,0,0,0,,,,,down,1,0.425762212795,2017_Jun_07_1615,99.0197732767,Stroop,A-2,1STACS-8,
,,,,,,17,0,17,0,,,,,,,,,,,,2017_Jun_07_1615,99.0197732767,Stroop,A-2,1STACS-8,
neutral,right,"[-0.8745098039, -0.2078431373, 0.637254902]", ,14,SOLL,18,0,18,0,0,0,0,0,,,,,left,0,0.535706912471,2017_Jun_07_1615,99.0197732767,Stroop,A-2,1STACS-8,
,,,,,,18,0,18,0,,,,,,,,,,,,2017_Jun_07_1615,99.0197732767,Stroop,A-2,1STACS-8,
neutral,right,"[-0.8745098039, -0.2078431373, 0.637254902]", ,14,SOLL,19,0,19,0,0,0,0,0,,,,,right,1,0.384958982217,2017_Jun_07_1615,99.0197732767,Stroop,A-2,1STACS-8,
,,,,,,19,0,19,0,,,,,,,,,,,,2017_Jun_07_1615,99.0197732767,Stroop,A-2,1STACS-8,
neutralofneutral,down,"[-0.7725490196, 0.0745098039, -1]", ,19,MODE,20,0,20,0,0,0,0,0,,,,,down,1,0.491753281492,2017_Jun_07_1615,99.0197732767,Stroop,A-2,1STACS-8,
,,,,,,20,0,20,0,,,,,,,,,,,,2017_Jun_07_1615,99.0197732767,Stroop,A-2,1STACS-8,
incongruent,left,"[0.568627451, -0.7882352941, -0.7882352941]", ,6,BLAU,21,0,21,0,0,0,0,0,,,,,left,1,0.459444985326,2017_Jun_07_1615,99.0197732767,Stroop,A-2,1STACS-8,
,,,,,,21,0,21,0,,,,,,,,,,,,2017_Jun_07_1615,99.0197732767,Stroop,A-2,1STACS-8,
incongruent,left,"[0.568627451, -0.7882352941, -0.7882352941]", ,3,GRÜN,22,0,22,0,0,0,0,0,,,,,left,1,0.467394319669,2017_Jun_07_1615,99.0197732767,Stroop,A-2,1STACS-8,
,,,,,,22,0,22,0,,,,,,,,,,,,2017_Jun_07_1615,99.0197732767,Stroop,A-2,1STACS-8,
incongruent,right,"[-0.8745098039, -0.2078431373, 0.637254902]", ,2,ROT,23,0,23,0,0,0,0,0,,,,,right,1,0.683040162926,2017_Jun_07_1615,99.0197732767,Stroop,A-2,1STACS-8,
,,,,,,23,0,23,0,,,,,,,,,,,,2017_Jun_07_1615,99.0197732767,Stroop,A-2,1STACS-8,
incongruent,down,"[-0.7725490196, 0.0745098039, -1]", ,1,ROT,24,0,24,0,0,0,0,0,,,,,down,1,0.89673492022,2017_Jun_07_1615,99.0197732767,Stroop,A-2,1STACS-8,
,,,,,,24,0,24,0,,,,,,,,,,,,2017_Jun_07_1615,99.0197732767,Stroop,A-2,1STACS-8,
congruent,right,"[-0.8745098039, -0.2078431373, 0.637254902]", ,8,BLAU,25,0,25,0,0,0,0,0,,,,,right,1,1.08715912218,2017_Jun_07_1615,99.0197732767,Stroop,A-2,1STACS-8,
,,,,,,25,0,25,0,,,,,,,,,,,,2017_Jun_07_1615,99.0197732767,Stroop,A-2,1STACS-8,
incongruent,left,"[0.568627451, -0.7882352941, -0.7882352941]", ,6,BLAU,26,0,26,0,0,0,0,0,,,,,left,1,1.24436318024,2017_Jun_07_1615,99.0197732767,Stroop,A-2,1STACS-8,
,,,,,,26,0,26,0,,,,,,,,,,,,2017_Jun_07_1615,99.0197732767,Stroop,A-2,1STACS-8,
neutral,down,"[-0.7725490196, 0.0745098039, -1]", ,10,PECH,27,0,27,0,0,0,0,0,,,,,down,1,0.597290717116,2017_Jun_07_1615,99.0197732767,Stroop,A-2,1STACS-8,
,,,,,,27,0,27,0,,,,,,,,,,,,2017_Jun_07_1615,99.0197732767,Stroop,A-2,1STACS-8,
neutralofneutral,down,"[-0.7725490196, 0.0745098039, -1]", ,16,HALS,28,0,28,0,0,0,0,0,,,,,left,0,0.587336379344,2017_Jun_07_1615,99.0197732767,Stroop,A-2,1STACS-8,
,,,,,,28,0,28,0,,,,,,,,,,,,2017_Jun_07_1615,99.0197732767,Stroop,A-2,1STACS-8,
neutralofneutral,down,"[-0.7725490196, 0.0745098039, -1]", ,16,HALS,29,0,29,0,0,0,0,0,,,,,down,1,0.310249487016,2017_Jun_07_1615,99.0197732767,Stroop,A-2,1STACS-8,
,,,,,,29,0,29,0,,,,,,,,,,,,2017_Jun_07_1615,99.0197732767,Stroop,A-2,1STACS-8,
congruent,right,"[-0.8745098039, -0.2078431373, 0.637254902]", ,8,BLAU,30,0,30,0,0,0,0,0,,,,,right,1,0.885018906034,2017_Jun_07_1615,99.0197732767,Stroop,A-2,1STACS-8,
,,,,,,30,0,30,0,,,,,,,,,,,,2017_Jun_07_1615,99.0197732767,Stroop,A-2,1STACS-8,
neutralofneutral,right,"[-0.8745098039, -0.2078431373, 0.637254902]", ,20,MODE,31,0,31,0,0,0,0,0,,,,,right,1,0.474482091998,2017_Jun_07_1615,99.0197732767,Stroop,A-2,1STACS-8,
,,,,,,31,0,31,0,,,,,,,,,,,,2017_Jun_07_1615,99.0197732767,Stroop,A-2,1STACS-8,
neutral,left,"[0.568627451, -0.7882352941, -0.7882352941]", ,12,SOLL,32,0,32,0,0,0,0,0,,,,,left,1,0.789670754244,2017_Jun_07_1615,99.0197732767,Stroop,A-2,1STACS-8,
,,,,,,32,0,32,0,,,,,,,,,,,,2017_Jun_07_1615,99.0197732767,Stroop,A-2,1STACS-8,
incongruent,down,"[-0.7725490196, 0.0745098039, -1]", ,1,ROT,33,0,33,0,0,0,0,0,,,,,down,1,0.779259375144,2017_Jun_07_1615,99.0197732767,Stroop,A-2,1STACS-8,
,,,,,,33,0,33,0,,,,,,,,,,,,2017_Jun_07_1615,99.0197732767,Stroop,A-2,1STACS-8,
congruent,down,"[-0.7725490196, 0.0745098039, -1]", ,4,GRÜN,34,0,34,0,0,0,0,0,,,,,down,1,0.500554679436,2017_Jun_07_1615,99.0197732767,Stroop,A-2,1STACS-8,
,,,,,,34,0,34,0,,,,,,,,,,,,2017_Jun_07_1615,99.0197732767,Stroop,A-2,1STACS-8,
neutralofneutral,down,"[-0.7725490196, 0.0745098039, -1]", ,16,HALS,35,0,35,0,0,0,0,0,,,,,down,1,0.447827307661,2017_Jun_07_1615,99.0197732767,Stroop,A-2,1STACS-8,
,,,,,,35,0,35,0,,,,,,,,,,,,2017_Jun_07_1615,99.0197732767,Stroop,A-2,1STACS-8,
incongruent,right,"[-0.8745098039, -0.2078431373, 0.637254902]", ,2,ROT,36,0,36,0,0,0,0,0,,,,,right,1,0.993158907068,2017_Jun_07_1615,99.0197732767,Stroop,A-2,1STACS-8,
,,,,,,36,0,36,0,,,,,,,,,,,,2017_Jun_07_1615,99.0197732767,Stroop,A-2,1STACS-8,
neutral,left,"[0.568627451, -0.7882352941, -0.7882352941]", ,9,PECH,37,0,37,0,0,0,0,0,,,,,left,1,0.705343835599,2017_Jun_07_1615,99.0197732767,Stroop,A-2,1STACS-8,
,,,,,,37,0,37,0,,,,,,,,,,,,2017_Jun_07_1615,99.0197732767,Stroop,A-2,1STACS-8,
neutralofneutral,down,"[-0.7725490196, 0.0745098039, -1]", ,16,HALS,38,0,38,0,0,0,0,0,,,,,down,1,0.598239441046,2017_Jun_07_1615,99.0197732767,Stroop,A-2,1STACS-8,
,,,,,,38,0,38,0,,,,,,,,,,,,2017_Jun_07_1615,99.0197732767,Stroop,A-2,1STACS-8,
neutralofneutral,down,"[-0.7725490196, 0.0745098039, -1]", ,16,HALS,39,0,39,0,0,0,0,0,,,,,down,1,0.532624956524,2017_Jun_07_1615,99.0197732767,Stroop,A-2,1STACS-8,
,,,,,,39,0,39,0,,,,,,,,,,,,2017_Jun_07_1615,99.0197732767,Stroop,A-2,1STACS-8,
incongruent,left,"[0.568627451, -0.7882352941, -0.7882352941]", ,3,GRÜN,40,0,40,0,0,0,0,0,,,,,right,0,0.754818279977,2017_Jun_07_1615,99.0197732767,Stroop,A-2,1STACS-8,
,,,,,,40,0,40,0,,,,,,,,,,,,2017_Jun_07_1615,99.0197732767,Stroop,A-2,1STACS-8,
incongruent,left,"[0.568627451, -0.7882352941, -0.7882352941]", ,3,GRÜN,41,0,41,0,0,0,0,0,,,,,down,0,0.403566095691,2017_Jun_07_1615,99.0197732767,Stroop,A-2,1STACS-8,
,,,,,,41,0,41,0,,,,,,,,,,,,2017_Jun_07_1615,99.0197732767,Stroop,A-2,1STACS-8,
incongruent,left,"[0.568627451, -0.7882352941, -0.7882352941]", ,3,GRÜN,42,0,42,0,0,0,0,0,,,,,left,1,0.340249389238,2017_Jun_07_1615,99.0197732767,Stroop,A-2,1STACS-8,
,,,,,,42,0,42,0,,,,,,,,,,,,2017_Jun_07_1615,99.0197732767,Stroop,A-2,1STACS-8,
neutralofneutral,down,"[-0.7725490196, 0.0745098039, -1]", ,19,MODE,43,0,43,0,0,0,0,0,,,,,down,1,0.640291713053,2017_Jun_07_1615,99.0197732767,Stroop,A-2,1STACS-8,
,,,,,,43,0,43,0,,,,,,,,,,,,2017_Jun_07_1615,99.0197732767,Stroop,A-2,1STACS-8,
neutralofneutral,left,"[0.568627451, -0.7882352941, -0.7882352941]", ,18,MODE,44,0,44,0,0,0,0,0,,,,,left,1,0.64022494479,2017_Jun_07_1615,99.0197732767,Stroop,A-2,1STACS-8,
,,,,,,44,0,44,0,,,,,,,,,,,,2017_Jun_07_1615,99.0197732767,Stroop,A-2,1STACS-8,
neutral,down,"[-0.7725490196, 0.0745098039, -1]", ,10,PECH,45,0,45,0,0,0,0,0,,,,,down,1,0.61887725954,2017_Jun_07_1615,99.0197732767,Stroop,A-2,1STACS-8,
,,,,,,45,0,45,0,,,,,,,,,,,,2017_Jun_07_1615,99.0197732767,Stroop,A-2,1STACS-8,
congruent,left,"[0.568627451, -0.7882352941, -0.7882352941]", ,0,ROT,46,0,46,0,0,0,0,0,,,,,left,1,0.598139428335,2017_Jun_07_1615,99.0197732767,Stroop,A-2,1STACS-8,
,,,,,,46,0,46,0,,,,,,,,,,,,2017_Jun_07_1615,99.0197732767,Stroop,A-2,1STACS-8,
neutral,right,"[-0.8745098039, -0.2078431373, 0.637254902]", ,11,PECH,47,0,47,0,0,0,0,0,,,,,right,1,0.555977924569,2017_Jun_07_1615,99.0197732767,Stroop,A-2,1STACS-8,
,,,,,,47,0,47,0,,,,,,,,,,,,2017_Jun_07_1615,99.0197732767,Stroop,A-2,1STACS-8,
neutralofneutral,right,"[-0.8745098039, -0.2078431373, 0.637254902]", ,17,HALS,48,0,48,0,0,0,0,0,,,,,right,1,0.793770716669,2017_Jun_07_1615,99.0197732767,Stroop,A-2,1STACS-8,
,,,,,,48,0,48,0,,,,,,,,,,,,2017_Jun_07_1615,99.0197732767,Stroop,A-2,1STACS-8,
incongruent,down,"[-0.7725490196, 0.0745098039, -1]", ,7,BLAU,49,0,49,0,0,0,0,0,,,,,down,1,1.13259143271,2017_Jun_07_1615,99.0197732767,Stroop,A-2,1STACS-8,
,,,,,,49,0,49,0,,,,,,,,,,,,2017_Jun_07_1615,99.0197732767,Stroop,A-2,1STACS-8,
neutralofneutral,right,"[-0.8745098039, -0.2078431373, 0.637254902]", ,20,MODE,50,0,50,0,0,0,0,0,,,,,right,1,0.81768604669,2017_Jun_07_1615,99.0197732767,Stroop,A-2,1STACS-8,
,,,,,,50,0,50,0,,,,,,,,,,,,2017_Jun_07_1615,99.0197732767,Stroop,A-2,1STACS-8,
congruent,right,"[-0.8745098039, -0.2078431373, 0.637254902]", ,8,BLAU,51,0,51,0,0,0,0,0,,,,,right,1,0.428454733772,2017_Jun_07_1615,99.0197732767,Stroop,A-2,1STACS-8,
,,,,,,51,0,51,0,,,,,,,,,,,,2017_Jun_07_1615,99.0197732767,Stroop,A-2,1STACS-8,
neutralofneutral,left,"[0.568627451, -0.7882352941, -0.7882352941]", ,18,MODE,52,0,52,0,0,0,0,0,,,,,left,1,0.694100786552,2017_Jun_07_1615,99.0197732767,Stroop,A-2,1STACS-8,
,,,,,,52,0,52,0,,,,,,,,,,,,2017_Jun_07_1615,99.0197732767,Stroop,A-2,1STACS-8,
neutralofneutral,left,"[0.568627451, -0.7882352941, -0.7882352941]", ,18,MODE,53,0,53,0,0,0,0,0,,,,,left,1,0.45977128378,2017_Jun_07_1615,99.0197732767,Stroop,A-2,1STACS-8,
,,,,,,53,0,53,0,,,,,,,,,,,,2017_Jun_07_1615,99.0197732767,Stroop,A-2,1STACS-8,
incongruent,down,"[-0.7725490196, 0.0745098039, -1]", ,1,ROT,54,0,54,0,0,0,0,0,,,,,down,1,0.631914391354,2017_Jun_07_1615,99.0197732767,Stroop,A-2,1STACS-8,
,,,,,,54,0,54,0,,,,,,,,,,,,2017_Jun_07_1615,99.0197732767,Stroop,A-2,1STACS-8,
incongruent,left,"[0.568627451, -0.7882352941, -0.7882352941]", ,6,BLAU,55,0,55,0,0,0,0,0,,,,,left,1,1.21722621171,2017_Jun_07_1615,99.0197732767,Stroop,A-2,1STACS-8,
,,,,,,55,0,55,0,,,,,,,,,,,,2017_Jun_07_1615,99.0197732767,Stroop,A-2,1STACS-8,
neutral,down,"[-0.7725490196, 0.0745098039, -1]", ,10,PECH,56,0,56,0,0,0,0,0,,,,,down,1,0.674504441207,2017_Jun_07_1615,99.0197732767,Stroop,A-2,1STACS-8,
,,,,,,56,0,56,0,,,,,,,,,,,,2017_Jun_07_1615,99.0197732767,Stroop,A-2,1STACS-8,
congruent,left,"[0.568627451, -0.7882352941, -0.7882352941]", ,0,ROT,57,0,57,0,0,0,0,0,,,,,left,1,0.643912284941,2017_Jun_07_1615,99.0197732767,Stroop,A-2,1STACS-8,
,,,,,,57,0,57,0,,,,,,,,,,,,2017_Jun_07_1615,99.0197732767,Stroop,A-2,1STACS-8,
neutral,left,"[0.568627451, -0.7882352941, -0.7882352941]", ,12,SOLL,58,0,58,0,0,0,0,0,,,,,left,1,0.442343370456,2017_Jun_07_1615,99.0197732767,Stroop,A-2,1STACS-8,
,,,,,,58,0,58,0,,,,,,,,,,,,2017_Jun_07_1615,99.0197732767,Stroop,A-2,1STACS-8,
incongruent,down,"[-0.7725490196, 0.0745098039, -1]", ,7,BLAU,59,0,59,0,0,0,0,0,,,,,right,0,0.800185498436,2017_Jun_07_1615,99.0197732767,Stroop,A-2,1STACS-8,
,,,,,,59,0,59,0,,,,,,,,,,,,2017_Jun_07_1615,99.0197732767,Stroop,A-2,1STACS-8,
incongruent,down,"[-0.7725490196, 0.0745098039, -1]", ,7,BLAU,60,0,60,0,0,0,0,0,,,,,down,1,0.320275062892,2017_Jun_07_1615,99.0197732767,Stroop,A-2,1STACS-8,
,,,,,,60,0,60,0,,,,,,,,,,,,2017_Jun_07_1615,99.0197732767,Stroop,A-2,1STACS-8,
neutralofneutral,down,"[-0.7725490196, 0.0745098039, -1]", ,19,MODE,61,0,61,0,0,0,0,0,,,,,down,1,0.565706535328,2017_Jun_07_1615,99.0197732767,Stroop,A-2,1STACS-8,
,,,,,,61,0,61,0,,,,,,,,,,,,2017_Jun_07_1615,99.0197732767,Stroop,A-2,1STACS-8,
fix,return,white, ,21,+,,,,,,,,,0,0,0,0,None,0,,2017_Jun_07_1615,99.0197732767,Stroop,A-2,1STACS-8,
fix,return,white, ,21,+,,,,,,,,,0,1,1,1,None,0,,2017_Jun_07_1615,99.0197732767,Stroop,A-2,1STACS-8,
fix,return,white, ,21,+,,,,,,,,,0,2,2,2,None,0,,2017_Jun_07_1615,99.0197732767,Stroop,A-2,1STACS-8,
fix,return,white, ,21,+,,,,,,,,,0,3,3,3,None,0,,2017_Jun_07_1615,99.0197732767,Stroop,A-2,1STACS-8,
fix,return,white, ,21,+,,,,,,,,,0,4,4,4,None,0,,2017_Jun_07_1615,99.0197732767,Stroop,A-2,1STACS-8,
fix,return,white, ,21,+,,,,,,,,,0,5,5,5,None,0,,2017_Jun_07_1615,99.0197732767,Stroop,A-2,1STACS-8,
fix,return,white, ,21,+,,,,,,,,,0,6,6,6,None,0,,2017_Jun_07_1615,99.0197732767,Stroop,A-2,1STACS-8,
fix,return,white, ,21,+,,,,,,,,,0,7,7,7,None,0,,2017_Jun_07_1615,99.0197732767,Stroop,A-2,1STACS-8,
fix,return,white, ,21,+,,,,,,,,,0,8,8,8,None,0,,2017_Jun_07_1615,99.0197732767,Stroop,A-2,1STACS-8,
fix,return,white, ,21,+,,,,,,,,,0,9,9,9,None,0,,2017_Jun_07_1615,99.0197732767,Stroop,A-2,1STACS-8,
fix,return,white, ,21,+,,,,,,,,,0,10,10,10,None,0,,2017_Jun_07_1615,99.0197732767,Stroop,A-2,1STACS-8,
fix,return,white, ,21,+,,,,,,,,,0,11,11,11,None,0,,2017_Jun_07_1615,99.0197732767,Stroop,A-2,1STACS-8,
fix,return,white,+,22,+,,,,,,,,,0,12,12,12,None,0,,2017_Jun_07_1615,99.0197732767,Stroop,A-2,1STACS-8,
congruent,down,"[-0.7725490196, 0.0745098039, -1]", ,4,GRÜN,,,,,,,,,0,13,13,13,down,1,0.426696968469,2017_Jun_07_1615,99.0197732767,Stroop,A-2,1STACS-8,
congruent,right,"[-0.8745098039, -0.2078431373, 0.637254902]", ,8,BLAU,,,,,,,,,0,14,14,14,right,1,0.727009717716,2017_Jun_07_1615,99.0197732767,Stroop,A-2,1STACS-8,
neutral,left,"[0.568627451, -0.7882352941, -0.7882352941]", ,9,PECH,,,,,,,,,0,15,15,15,left,1,0.554811854579,2017_Jun_07_1615,99.0197732767,Stroop,A-2,1STACS-8,
neutral,right,"[-0.8745098039, -0.2078431373, 0.637254902]", ,11,PECH,,,,,,,,,0,16,16,16,right,1,0.533480651871,2017_Jun_07_1615,99.0197732767,Stroop,A-2,1STACS-8,
neutral,down,"[-0.7725490196, 0.0745098039, -1]", ,10,PECH,,,,,,,,,0,17,17,17,down,1,0.428838302075,2017_Jun_07_1615,99.0197732767,Stroop,A-2,1STACS-8,
congruent,down,"[-0.7725490196, 0.0745098039, -1]", ,4,GRÜN,,,,,,,,,0,18,18,18,down,1,0.446192183643,2017_Jun_07_1615,99.0197732767,Stroop,A-2,1STACS-8,
neutral,right,"[-0.8745098039, -0.2078431373, 0.637254902]", ,14,SOLL,,,,,,,,,0,19,19,19,right,1,0.565956008375,2017_Jun_07_1615,99.0197732767,Stroop,A-2,1STACS-8,
neutral,down,"[-0.7725490196, 0.0745098039, -1]", ,13,SOLL,,,,,,,,,0,20,20,20,down,1,0.639553909785,2017_Jun_07_1615,99.0197732767,Stroop,A-2,1STACS-8,
neutral,left,"[0.568627451, -0.7882352941, -0.7882352941]", ,12,SOLL,,,,,,,,,0,21,21,21,left,1,0.586763960224,2017_Jun_07_1615,99.0197732767,Stroop,A-2,1STACS-8,
congruent,left,"[0.568627451, -0.7882352941, -0.7882352941]", ,0,ROT,,,,,,,,,0,22,22,22,down,0,0.427717209869,2017_Jun_07_1615,99.0197732767,Stroop,A-2,1STACS-8,
congruent,right,"[-0.8745098039, -0.2078431373, 0.637254902]", ,8,BLAU,,,,,,,,,0,23,23,23,right,1,0.832095419949,2017_Jun_07_1615,99.0197732767,Stroop,A-2,1STACS-8,
congruent,left,"[0.568627451, -0.7882352941, -0.7882352941]", ,0,ROT,,,,,,,,,0,24,24,24,left,1,0.703090197218,2017_Jun_07_1615,99.0197732767,Stroop,A-2,1STACS-8,
incongruent,down,"[-0.7725490196, 0.0745098039, -1]", ,7,BLAU,,,,,,,,,0,25,25,25,down,1,0.672274828225,2017_Jun_07_1615,99.0197732767,Stroop,A-2,1STACS-8,
neutral,right,"[-0.8745098039, -0.2078431373, 0.637254902]", ,14,SOLL,,,,,,,,,0,26,26,26,left,0,0.607829486709,2017_Jun_07_1615,99.0197732767,Stroop,A-2,1STACS-8,
neutral,right,"[-0.8745098039, -0.2078431373, 0.637254902]", ,11,PECH,,,,,,,,,0,27,27,27,right,1,0.896618424967,2017_Jun_07_1615,99.0197732767,Stroop,A-2,1STACS-8,
incongruent,right,"[-0.8745098039, -0.2078431373, 0.637254902]", ,5,GRÜN,,,,,,,,,0,28,28,28,right,1,0.42650476527,2017_Jun_07_1615,99.0197732767,Stroop,A-2,1STACS-8,
incongruent,left,"[0.568627451, -0.7882352941, -0.7882352941]", ,3,GRÜN,,,,,,,,,0,29,29,29,left,1,0.970381710525,2017_Jun_07_1615,99.0197732767,Stroop,A-2,1STACS-8,
neutral,down,"[-0.7725490196, 0.0745098039, -1]", ,13,SOLL,,,,,,,,,0,30,30,30,down,1,0.535698810882,2017_Jun_07_1615,99.0197732767,Stroop,A-2,1STACS-8,
incongruent,right,"[-0.8745098039, -0.2078431373, 0.637254902]", ,2,ROT,,,,,,,,,0,31,31,31,right,1,0.792335338709,2017_Jun_07_1615,99.0197732767,Stroop,A-2,1STACS-8,
incongruent,down,"[-0.7725490196, 0.0745098039, -1]", ,1,ROT,,,,,,,,,0,32,32,32,down,1,0.450895015987,2017_Jun_07_1615,99.0197732767,Stroop,A-2,1STACS-8,
neutral,left,"[0.568627451, -0.7882352941, -0.7882352941]", ,9,PECH,,,,,,,,,0,33,33,33,left,1,0.847298469498,2017_Jun_07_1615,99.0197732767,Stroop,A-2,1STACS-8,
neutral,left,"[0.568627451, -0.7882352941, -0.7882352941]", ,12,SOLL,,,,,,,,,0,34,34,34,left,1,0.460400693384,2017_Jun_07_1615,99.0197732767,Stroop,A-2,1STACS-8,
neutral,down,"[-0.7725490196, 0.0745098039, -1]", ,10,PECH,,,,,,,,,0,35,35,35,down,1,0.67200579962,2017_Jun_07_1615,99.0197732767,Stroop,A-2,1STACS-8,
incongruent,left,"[0.568627451, -0.7882352941, -0.7882352941]", ,6,BLAU,,,,,,,,,0,36,36,36,left,1,0.714282960544,2017_Jun_07_1615,99.0197732767,Stroop,A-2,1STACS-8,
neutralofneutral,down,"[-0.7725490196, 0.0745098039, -1]", ,19,MODE,,,,,,,,,0,37,37,37,down,1,0.58728972537,2017_Jun_07_1615,99.0197732767,Stroop,A-2,1STACS-8,
neutral,down,"[-0.7725490196, 0.0745098039, -1]", ,13,SOLL,,,,,,,,,0,38,38,38,down,1,0.437489401586,2017_Jun_07_1615,99.0197732767,Stroop,A-2,1STACS-8,
neutralofneutral,left,"[0.568627451, -0.7882352941, -0.7882352941]", ,15,HALS,,,,,,,,,0,39,39,39,left,1,0.544540996132,2017_Jun_07_1615,99.0197732767,Stroop,A-2,1STACS-8,
neutral,left,"[0.568627451, -0.7882352941, -0.7882352941]", ,12,SOLL,,,,,,,,,0,40,40,40,left,1,0.384197153549,2017_Jun_07_1615,99.0197732767,Stroop,A-2,1STACS-8,
neutralofneutral,down,"[-0.7725490196, 0.0745098039, -1]", ,16,HALS,,,,,,,,,0,41,41,41,down,1,0.459200261486,2017_Jun_07_1615,99.0197732767,Stroop,A-2,1STACS-8,
neutralofneutral,right,"[-0.8745098039, -0.2078431373, 0.637254902]", ,17,HALS,,,,,,,,,0,42,42,42,right,1,0.554491143427,2017_Jun_07_1615,99.0197732767,Stroop,A-2,1STACS-8,
neutral,right,"[-0.8745098039, -0.2078431373, 0.637254902]", ,11,PECH,,,,,,,,,0,43,43,43,right,1,0.405548749911,2017_Jun_07_1615,99.0197732767,Stroop,A-2,1STACS-8,
neutralofneutral,right,"[-0.8745098039, -0.2078431373, 0.637254902]", ,20,MODE,,,,,,,,,0,44,44,44,right,1,0.437123712651,2017_Jun_07_1615,99.0197732767,Stroop,A-2,1STACS-8,
neutral,down,"[-0.7725490196, 0.0745098039, -1]", ,10,PECH,,,,,,,,,0,45,45,45,down,1,0.511834045947,2017_Jun_07_1615,99.0197732767,Stroop,A-2,1STACS-8,
neutral,right,"[-0.8745098039, -0.2078431373, 0.637254902]", ,14,SOLL,,,,,,,,,0,46,46,46,right,1,0.756997607238,2017_Jun_07_1615,99.0197732767,Stroop,A-2,1STACS-8,
neutralofneutral,left,"[0.568627451, -0.7882352941, -0.7882352941]", ,18,MODE,,,,,,,,,0,47,47,47,left,1,0.587610157157,2017_Jun_07_1615,99.0197732767,Stroop,A-2,1STACS-8,
neutral,left,"[0.568627451, -0.7882352941, -0.7882352941]", ,9,PECH,,,,,,,,,0,48,48,48,left,1,0.479795057752,2017_Jun_07_1615,99.0197732767,Stroop,A-2,1STACS-8,
fix,return,white, ,21,+,,,,,,,,,0,49,49,49,None,0,,2017_Jun_07_1615,99.0197732767,Stroop,A-2,1STACS-8,
fix,return,white, ,21,+,,,,,,,,,0,50,50,50,None,0,,2017_Jun_07_1615,99.0197732767,Stroop,A-2,1STACS-8,
fix,return,white, ,21,+,,,,,,,,,0,51,51,51,None,0,,2017_Jun_07_1615,99.0197732767,Stroop,A-2,1STACS-8,
fix,return,white, ,21,+,,,,,,,,,0,52,52,52,None,0,,2017_Jun_07_1615,99.0197732767,Stroop,A-2,1STACS-8,
fix,return,white, ,21,+,,,,,,,,,0,53,53,53,None,0,,2017_Jun_07_1615,99.0197732767,Stroop,A-2,1STACS-8,
fix,return,white, ,21,+,,,,,,,,,0,54,54,54,None,0,,2017_Jun_07_1615,99.0197732767,Stroop,A-2,1STACS-8,
fix,return,white, ,21,+,,,,,,,,,0,55,55,55,None,0,,2017_Jun_07_1615,99.0197732767,Stroop,A-2,1STACS-8,
fix,return,white, ,21,+,,,,,,,,,0,56,56,56,None,0,,2017_Jun_07_1615,99.0197732767,Stroop,A-2,1STACS-8,
fix,return,white, ,21,+,,,,,,,,,0,57,57,57,None,0,,2017_Jun_07_1615,99.0197732767,Stroop,A-2,1STACS-8,
fix,return,white, ,21,+,,,,,,,,,0,58,58,58,None,0,,2017_Jun_07_1615,99.0197732767,Stroop,A-2,1STACS-8,
fix,return,white, ,21,+,,,,,,,,,0,59,59,59,None,0,,2017_Jun_07_1615,99.0197732767,Stroop,A-2,1STACS-8,
fix,return,white, ,21,+,,,,,,,,,0,60,60,60,None,0,,2017_Jun_07_1615,99.0197732767,Stroop,A-2,1STACS-8,
fix,return,white,+,22,+,,,,,,,,,0,61,61,61,None,0,,2017_Jun_07_1615,99.0197732767,Stroop,A-2,1STACS-8,
neutral,right,"[-0.8745098039, -0.2078431373, 0.637254902]", ,11,PECH,,,,,,,,,0,62,62,62,right,1,0.835814048992,2017_Jun_07_1615,99.0197732767,Stroop,A-2,1STACS-8,
neutral,down,"[-0.7725490196, 0.0745098039, -1]", ,13,SOLL,,,,,,,,,0,63,63,63,down,1,0.460603791823,2017_Jun_07_1615,99.0197732767,Stroop,A-2,1STACS-8,
neutralofneutral,left,"[0.568627451, -0.7882352941, -0.7882352941]", ,18,MODE,,,,,,,,,0,64,64,64,left,1,0.450529327051,2017_Jun_07_1615,99.0197732767,Stroop,A-2,1STACS-8,
neutralofneutral,down,"[-0.7725490196, 0.0745098039, -1]", ,16,HALS,,,,,,,,,0,65,65,65,down,1,0.417712865741,2017_Jun_07_1615,99.0197732767,Stroop,A-2,1STACS-8,
neutralofneutral,right,"[-0.8745098039, -0.2078431373, 0.637254902]", ,17,HALS,,,,,,,,,0,66,66,66,right,1,0.653565467119,2017_Jun_07_1615,99.0197732767,Stroop,A-2,1STACS-8,
neutral,down,"[-0.7725490196, 0.0745098039, -1]", ,10,PECH,,,,,,,,,0,67,67,67,down,1,0.439841655853,2017_Jun_07_1615,99.0197732767,Stroop,A-2,1STACS-8,
neutralofneutral,right,"[-0.8745098039, -0.2078431373, 0.637254902]", ,20,MODE,,,,,,,,,0,68,68,68,right,1,0.493433103928,2017_Jun_07_1615,99.0197732767,Stroop,A-2,1STACS-8,
neutralofneutral,left,"[0.568627451, -0.7882352941, -0.7882352941]", ,15,HALS,,,,,,,,,0,69,69,69,left,1,0.664497303428,2017_Jun_07_1615,99.0197732767,Stroop,A-2,1STACS-8,
neutralofneutral,down,"[-0.7725490196, 0.0745098039, -1]", ,19,MODE,,,,,,,,,0,70,70,70,down,1,0.341108716331,2017_Jun_07_1615,99.0197732767,Stroop,A-2,1STACS-8,
neutral,left,"[0.568627451, -0.7882352941, -0.7882352941]", ,12,SOLL,,,,,,,,,0,71,71,71,right,0,0.437265909494,2017_Jun_07_1615,99.0197732767,Stroop,A-2,1STACS-8,
neutral,right,"[-0.8745098039, -0.2078431373, 0.637254902]", ,14,SOLL,,,,,,,,,0,72,72,72,down,0,0.501025409654,2017_Jun_07_1615,99.0197732767,Stroop,A-2,1STACS-8,
neutral,left,"[0.568627451, -0.7882352941, -0.7882352941]", ,9,PECH,,,,,,,,,0,73,73,73,left,1,0.907202172343,2017_Jun_07_1615,99.0197732767,Stroop,A-2,1STACS-8,
incongruent,down,"[-0.7725490196, 0.0745098039, -1]", ,1,ROT,,,,,,,,,0,74,74,74,down,1,0.534507318668,2017_Jun_07_1615,99.0197732767,Stroop,A-2,1STACS-8,
neutral,down,"[-0.7725490196, 0.0745098039, -1]", ,13,SOLL,,,,,,,,,0,75,75,75,down,1,0.405706311836,2017_Jun_07_1615,99.0197732767,Stroop,A-2,1STACS-8,
incongruent,down,"[-0.7725490196, 0.0745098039, -1]", ,7,BLAU,,,,,,,,,0,76,76,76,down,1,0.406849753251,2017_Jun_07_1615,99.0197732767,Stroop,A-2,1STACS-8,
incongruent,right,"[-0.8745098039, -0.2078431373, 0.637254902]", ,5,GRÜN,,,,,,,,,0,77,77,77,right,1,0.501581904963,2017_Jun_07_1615,99.0197732767,Stroop,A-2,1STACS-8,
incongruent,right,"[-0.8745098039, -0.2078431373, 0.637254902]", ,2,ROT,,,,,,,,,0,78,78,78,right,1,0.43908066528,2017_Jun_07_1615,99.0197732767,Stroop,A-2,1STACS-8,
neutral,right,"[-0.8745098039, -0.2078431373, 0.637254902]", ,14,SOLL,,,,,,,,,0,79,79,79,right,1,0.407861054966,2017_Jun_07_1615,99.0197732767,Stroop,A-2,1STACS-8,
neutral,down,"[-0.7725490196, 0.0745098039, -1]", ,10,PECH,,,,,,,,,0,80,80,80,down,1,0.407015416764,2017_Jun_07_1615,99.0197732767,Stroop,A-2,1STACS-8,
neutral,left,"[0.568627451, -0.7882352941, -0.7882352941]", ,9,PECH,,,,,,,,,0,81,81,81,left,1,0.524845755536,2017_Jun_07_1615,99.0197732767,Stroop,A-2,1STACS-8,
incongruent,left,"[0.568627451, -0.7882352941, -0.7882352941]", ,6,BLAU,,,,,,,,,0,82,82,82,left,1,0.480234219712,2017_Jun_07_1615,99.0197732767,Stroop,A-2,1STACS-8,
incongruent,left,"[0.568627451, -0.7882352941, -0.7882352941]", ,3,GRÜN,,,,,,,,,0,83,83,83,left,1,0.393678805546,2017_Jun_07_1615,99.0197732767,Stroop,A-2,1STACS-8,
neutral,right,"[-0.8745098039, -0.2078431373, 0.637254902]", ,11,PECH,,,,,,,,,0,84,84,84,down,0,0.447791269561,2017_Jun_07_1615,99.0197732767,Stroop,A-2,1STACS-8,
neutral,left,"[0.568627451, -0.7882352941, -0.7882352941]", ,12,SOLL,,,,,,,,,0,85,85,85,down,0,0.512026528511,2017_Jun_07_1615,99.0197732767,Stroop,A-2,1STACS-8,
neutral,left,"[0.568627451, -0.7882352941, -0.7882352941]", ,12,SOLL,,,,,,,,,0,86,86,86,left,1,0.810902502972,2017_Jun_07_1615,99.0197732767,Stroop,A-2,1STACS-8,
neutral,down,"[-0.7725490196, 0.0745098039, -1]", ,13,SOLL,,,,,,,,,0,87,87,87,down,1,0.600263441303,2017_Jun_07_1615,99.0197732767,Stroop,A-2,1STACS-8,
congruent,right,"[-0.8745098039, -0.2078431373, 0.637254902]", ,8,BLAU,,,,,,,,,0,88,88,88,right,1,0.653223244854,2017_Jun_07_1615,99.0197732767,Stroop,A-2,1STACS-8,
neutral,left,"[0.568627451, -0.7882352941, -0.7882352941]", ,9,PECH,,,,,,,,,0,89,89,89,left,1,0.621884066271,2017_Jun_07_1615,99.0197732767,Stroop,A-2,1STACS-8,
congruent,down,"[-0.7725490196, 0.0745098039, -1]", ,4,GRÜN,,,,,,,,,0,90,90,90,down,1,0.596943186913,2017_Jun_07_1615,99.0197732767,Stroop,A-2,1STACS-8,
congruent,down,"[-0.7725490196, 0.0745098039, -1]", ,4,GRÜN,,,,,,,,,0,91,91,91,down,1,0.533207432788,2017_Jun_07_1615,99.0197732767,Stroop,A-2,1STACS-8,
congruent,left,"[0.568627451, -0.7882352941, -0.7882352941]", ,0,ROT,,,,,,,,,0,92,92,92,left,1,0.611227683965,2017_Jun_07_1615,99.0197732767,Stroop,A-2,1STACS-8,
neutral,right,"[-0.8745098039, -0.2078431373, 0.637254902]", ,11,PECH,,,,,,,,,0,93,93,93,right,1,0.460625023571,2017_Jun_07_1615,99.0197732767,Stroop,A-2,1STACS-8,
neutral,right,"[-0.8745098039, -0.2078431373, 0.637254902]", ,14,SOLL,,,,,,,,,0,94,94,94,right,1,0.685099083822,2017_Jun_07_1615,99.0197732767,Stroop,A-2,1STACS-8,
congruent,right,"[-0.8745098039, -0.2078431373, 0.637254902]", ,8,BLAU,,,,,,,,,0,95,95,95,right,1,0.56824093565,2017_Jun_07_1615,99.0197732767,Stroop,A-2,1STACS-8,
congruent,left,"[0.568627451, -0.7882352941, -0.7882352941]", ,0,ROT,,,,,,,,,0,96,96,96,left,1,0.671763590065,2017_Jun_07_1615,99.0197732767,Stroop,A-2,1STACS-8,
neutral,down,"[-0.7725490196, 0.0745098039, -1]", ,10,PECH,,,,,,,,,0,97,97,97,down,1,0.575599133409,2017_Jun_07_1615,99.0197732767,Stroop,A-2,1STACS-8,
fix,return,white, ,21,+,,,,,,,,,0,98,98,98,None,0,,2017_Jun_07_1615,99.0197732767,Stroop,A-2,1STACS-8,
fix,return,white, ,21,+,,,,,,,,,0,99,99,99,None,0,,2017_Jun_07_1615,99.0197732767,Stroop,A-2,1STACS-8,
fix,return,white, ,21,+,,,,,,,,,0,100,100,100,None,0,,2017_Jun_07_1615,99.0197732767,Stroop,A-2,1STACS-8,
fix,return,white, ,21,+,,,,,,,,,0,101,101,101,None,0,,2017_Jun_07_1615,99.0197732767,Stroop,A-2,1STACS-8,
fix,return,white, ,21,+,,,,,,,,,0,102,102,102,None,0,,2017_Jun_07_1615,99.0197732767,Stroop,A-2,1STACS-8,
fix,return,white, ,21,+,,,,,,,,,0,103,103,103,None,0,,2017_Jun_07_1615,99.0197732767,Stroop,A-2,1STACS-8,
fix,return,white, ,21,+,,,,,,,,,0,104,104,104,None,0,,2017_Jun_07_1615,99.0197732767,Stroop,A-2,1STACS-8,
fix,return,white, ,21,+,,,,,,,,,0,105,105,105,None,0,,2017_Jun_07_1615,99.0197732767,Stroop,A-2,1STACS-8,
fix,return,white, ,21,+,,,,,,,,,0,106,106,106,None,0,,2017_Jun_07_1615,99.0197732767,Stroop,A-2,1STACS-8,
fix,return,white, ,21,+,,,,,,,,,0,107,107,107,None,0,,2017_Jun_07_1615,99.0197732767,Stroop,A-2,1STACS-8,
fix,return,white, ,21,+,,,,,,,,,0,108,108,108,None,0,,2017_Jun_07_1615,99.0197732767,Stroop,A-2,1STACS-8,
fix,return,white, ,21,+,,,,,,,,,0,109,109,109,None,0,,2017_Jun_07_1615,99.0197732767,Stroop,A-2,1STACS-8,
fix,return,white,+,22,+,,,,,,,,,0,110,110,110,None,0,,2017_Jun_07_1615,99.0197732767,Stroop,A-2,1STACS-8,
neutral,down,"[-0.7725490196, 0.0745098039, -1]", ,10,PECH,,,,,,,,,0,111,111,111,down,1,0.554852362521,2017_Jun_07_1615,99.0197732767,Stroop,A-2,1STACS-8,
congruent,right,"[-0.8745098039, -0.2078431373, 0.637254902]", ,8,BLAU,,,,,,,,,0,112,112,112,right,1,0.726234758887,2017_Jun_07_1615,99.0197732767,Stroop,A-2,1STACS-8,
congruent,right,"[-0.8745098039, -0.2078431373, 0.637254902]", ,8,BLAU,,,,,,,,,0,113,113,113,right,1,0.438295090577,2017_Jun_07_1615,99.0197732767,Stroop,A-2,1STACS-8,
congruent,left,"[0.568627451, -0.7882352941, -0.7882352941]", ,0,ROT,,,,,,,,,0,114,114,114,left,1,0.554635295827,2017_Jun_07_1615,99.0197732767,Stroop,A-2,1STACS-8,
congruent,down,"[-0.7725490196, 0.0745098039, -1]", ,4,GRÜN,,,,,,,,,0,115,115,115,down,1,0.435520715622,2017_Jun_07_1615,99.0197732767,Stroop,A-2,1STACS-8,
neutral,left,"[0.568627451, -0.7882352941, -0.7882352941]", ,9,PECH,,,,,,,,,0,116,116,116,left,1,0.503332406772,2017_Jun_07_1615,99.0197732767,Stroop,A-2,1STACS-8,
neutral,right,"[-0.8745098039, -0.2078431373, 0.637254902]", ,11,PECH,,,,,,,,,0,117,117,117,right,1,0.492572100644,2017_Jun_07_1615,99.0197732767,Stroop,A-2,1STACS-8,
neutral,left,"[0.568627451, -0.7882352941, -0.7882352941]", ,12,SOLL,,,,,,,,,0,118,118,118,left,1,0.546035040766,2017_Jun_07_1615,99.0197732767,Stroop,A-2,1STACS-8,
neutral,down,"[-0.7725490196, 0.0745098039, -1]", ,13,SOLL,,,,,,,,,0,119,119,119,down,1,0.418302884864,2017_Jun_07_1615,99.0197732767,Stroop,A-2,1STACS-8,
congruent,left,"[0.568627451, -0.7882352941, -0.7882352941]", ,0,ROT,,,,,,,,,0,120,120,120,left,1,0.395758120096,2017_Jun_07_1615,99.0197732767,Stroop,A-2,1STACS-8,
congruent,down,"[-0.7725490196, 0.0745098039, -1]", ,4,GRÜN,,,,,,,,,0,121,121,121,down,1,0.586855591982,2017_Jun_07_1615,99.0197732767,Stroop,A-2,1STACS-8,
neutral,right,"[-0.8745098039, -0.2078431373, 0.637254902]", ,14,SOLL,,,,,,,,,0,122,122,122,right,1,0.535409947354,2017_Jun_07_1615,99.0197732767,Stroop,A-2,1STACS-8,
neutral,left,"[0.568627451, -0.7882352941, -0.7882352941]", ,9,PECH,,,,,,,,,0,123,123,123,left,1,0.842190837104,2017_Jun_07_1615,99.0197732767,Stroop,A-2,1STACS-8,
neutralofneutral,down,"[-0.7725490196, 0.0745098039, -1]", ,19,MODE,,,,,,,,,0,124,124,124,down,1,0.681999527873,2017_Jun_07_1615,99.0197732767,Stroop,A-2,1STACS-8,
neutral,left,"[0.568627451, -0.7882352941, -0.7882352941]", ,12,SOLL,,,,,,,,,0,125,125,125,left,1,0.479903451416,2017_Jun_07_1615,99.0197732767,Stroop,A-2,1STACS-8,
neutralofneutral,right,"[-0.8745098039, -0.2078431373, 0.637254902]", ,20,MODE,,,,,,,,,0,126,126,126,right,1,0.53302947721,2017_Jun_07_1615,99.0197732767,Stroop,A-2,1STACS-8,
neutral,down,"[-0.7725490196, 0.0745098039, -1]", ,13,SOLL,,,,,,,,,0,127,127,127,down,1,0.48009593398,2017_Jun_07_1615,99.0197732767,Stroop,A-2,1STACS-8,
neutralofneutral,right,"[-0.8745098039, -0.2078431373, 0.637254902]", ,17,HALS,,,,,,,,,0,128,128,128,left,0,0.54407389766,2017_Jun_07_1615,99.0197732767,Stroop,A-2,1STACS-8,
neutralofneutral,down,"[-0.7725490196, 0.0745098039, -1]", ,16,HALS,,,,,,,,,0,129,129,129,down,1,0.578407590909,2017_Jun_07_1615,99.0197732767,Stroop,A-2,1STACS-8,
neutralofneutral,left,"[0.568627451, -0.7882352941, -0.7882352941]", ,15,HALS,,,,,,,,,0,130,130,130,left,1,0.652699993994,2017_Jun_07_1615,99.0197732767,Stroop,A-2,1STACS-8,
neutral,down,"[-0.7725490196, 0.0745098039, -1]", ,10,PECH,,,,,,,,,0,131,131,131,right,0,0.631658492909,2017_Jun_07_1615,99.0197732767,Stroop,A-2,1STACS-8,
neutral,right,"[-0.8745098039, -0.2078431373, 0.637254902]", ,14,SOLL,,,,,,,,,0,132,132,132,right,1,0.963569392199,2017_Jun_07_1615,99.0197732767,Stroop,A-2,1STACS-8,
neutralofneutral,left,"[0.568627451, -0.7882352941, -0.7882352941]", ,18,MODE,,,,,,,,,0,133,133,133,left,1,0.664619665349,2017_Jun_07_1615,99.0197732767,Stroop,A-2,1STACS-8,
neutral,right,"[-0.8745098039, -0.2078431373, 0.637254902]", ,11,PECH,,,,,,,,,0,134,134,134,down,0,0.471290904291,2017_Jun_07_1615,99.0197732767,Stroop,A-2,1STACS-8,
incongruent,right,"[-0.8745098039, -0.2078431373, 0.637254902]", ,2,ROT,,,,,,,,,0,135,135,135,right,1,0.72829898772,2017_Jun_07_1615,99.0197732767,Stroop,A-2,1STACS-8,
incongruent,down,"[-0.7725490196, 0.0745098039, -1]", ,1,ROT,,,,,,,,,0,136,136,136,down,1,0.524682326944,2017_Jun_07_1615,99.0197732767,Stroop,A-2,1STACS-8,
neutral,down,"[-0.7725490196, 0.0745098039, -1]", ,10,PECH,,,,,,,,,0,137,137,137,down,1,0.492178475197,2017_Jun_07_1615,99.0197732767,Stroop,A-2,1STACS-8,
neutral,left,"[0.568627451, -0.7882352941, -0.7882352941]", ,12,SOLL,,,,,,,,,0,138,138,138,left,1,0.532893147034,2017_Jun_07_1615,99.0197732767,Stroop,A-2,1STACS-8,
incongruent,left,"[0.568627451, -0.7882352941, -0.7882352941]", ,3,GRÜN,,,,,,,,,0,139,139,139,left,1,0.446469034472,2017_Jun_07_1615,99.0197732767,Stroop,A-2,1STACS-8,
neutral,down,"[-0.7725490196, 0.0745098039, -1]", ,13,SOLL,,,,,,,,,0,140,140,140,down,1,0.522126694873,2017_Jun_07_1615,99.0197732767,Stroop,A-2,1STACS-8,
neutral,right,"[-0.8745098039, -0.2078431373, 0.637254902]", ,11,PECH,,,,,,,,,0,141,141,141,right,1,0.405449575295,2017_Jun_07_1615,99.0197732767,Stroop,A-2,1STACS-8,
incongruent,right,"[-0.8745098039, -0.2078431373, 0.637254902]", ,5,GRÜN,,,,,,,,,0,142,142,142,right,1,0.394771961241,2017_Jun_07_1615,99.0197732767,Stroop,A-2,1STACS-8,
neutral,left,"[0.568627451, -0.7882352941, -0.7882352941]", ,9,PECH,,,,,,,,,0,143,143,143,down,0,0.428064181341,2017_Jun_07_1615,99.0197732767,Stroop,A-2,1STACS-8,
incongruent,left,"[0.568627451, -0.7882352941, -0.7882352941]", ,6,BLAU,,,,,,,,,0,144,144,144,left,1,0.705441892755,2017_Jun_07_1615,99.0197732767,Stroop,A-2,1STACS-8,
neutral,right,"[-0.8745098039, -0.2078431373, 0.637254902]", ,14,SOLL,,,,,,,,,0,145,145,145,down,0,1.02774682257,2017_Jun_07_1615,99.0197732767,Stroop,A-2,1STACS-8,
incongruent,down,"[-0.7725490196, 0.0745098039, -1]", ,7,BLAU,,,,,,,,,0,146,146,146,down,1,0.40717577234,2017_Jun_07_1615,99.0197732767,Stroop,A-2,1STACS-8,
fix,return,white, ,21,+,,,,,,,,,0,147,147,147,None,0,,2017_Jun_07_1615,99.0197732767,Stroop,A-2,1STACS-8,
fix,return,white, ,21,+,,,,,,,,,0,148,148,148,None,0,,2017_Jun_07_1615,99.0197732767,Stroop,A-2,1STACS-8,
fix,return,white, ,21,+,,,,,,,,,0,149,149,149,None,0,,2017_Jun_07_1615,99.0197732767,Stroop,A-2,1STACS-8,
fix,return,white, ,21,+,,,,,,,,,0,150,150,150,None,0,,2017_Jun_07_1615,99.0197732767,Stroop,A-2,1STACS-8,
fix,return,white, ,21,+,,,,,,,,,0,151,151,151,None,0,,2017_Jun_07_1615,99.0197732767,Stroop,A-2,1STACS-8,
fix,return,white, ,21,+,,,,,,,,,0,152,152,152,None,0,,2017_Jun_07_1615,99.0197732767,Stroop,A-2,1STACS-8,
fix,return,white, ,21,+,,,,,,,,,0,153,153,153,None,0,,2017_Jun_07_1615,99.0197732767,Stroop,A-2,1STACS-8,
fix,return,white, ,21,+,,,,,,,,,0,154,154,154,None,0,,2017_Jun_07_1615,99.0197732767,Stroop,A-2,1STACS-8,
fix,return,white, ,21,+,,,,,,,,,0,155,155,155,None,0,,2017_Jun_07_1615,99.0197732767,Stroop,A-2,1STACS-8,
fix,return,white, ,21,+,,,,,,,,,0,156,156,156,None,0,,2017_Jun_07_1615,99.0197732767,Stroop,A-2,1STACS-8,
fix,return,white, ,21,+,,,,,,,,,0,157,157,157,None,0,,2017_Jun_07_1615,99.0197732767,Stroop,A-2,1STACS-8,
fix,return,white, ,21,+,,,,,,,,,0,158,158,158,None,0,,2017_Jun_07_1615,99.0197732767,Stroop,A-2,1STACS-8,
fix,return,white,+,22,+,,,,,,,,,0,159,159,159,None,0,,2017_Jun_07_1615,99.0197732767,Stroop,A-2,1STACS-8,
neutral,right,"[-0.8745098039, -0.2078431373, 0.637254902]", ,14,SOLL,,,,,,,,,0,160,160,160,right,1,0.767581075248,2017_Jun_07_1615,99.0197732767,Stroop,A-2,1STACS-8,
incongruent,down,"[-0.7725490196, 0.0745098039, -1]", ,7,BLAU,,,,,,,,,0,161,161,161,down,1,0.565350624172,2017_Jun_07_1615,99.0197732767,Stroop,A-2,1STACS-8,
neutral,down,"[-0.7725490196, 0.0745098039, -1]", ,13,SOLL,,,,,,,,,0,162,162,162,down,1,0.491093979821,2017_Jun_07_1615,99.0197732767,Stroop,A-2,1STACS-8,
incongruent,left,"[0.568627451, -0.7882352941, -0.7882352941]", ,3,GRÜN,,,,,,,,,0,163,163,163,left,1,0.626700600216,2017_Jun_07_1615,99.0197732767,Stroop,A-2,1STACS-8,
neutral,right,"[-0.8745098039, -0.2078431373, 0.637254902]", ,11,PECH,,,,,,,,,0,164,164,164,right,1,0.596722767838,2017_Jun_07_1615,99.0197732767,Stroop,A-2,1STACS-8,
neutral,down,"[-0.7725490196, 0.0745098039, -1]", ,10,PECH,,,,,,,,,0,165,165,165,down,1,0.640316017818,2017_Jun_07_1615,99.0197732767,Stroop,A-2,1STACS-8,
incongruent,right,"[-0.8745098039, -0.2078431373, 0.637254902]", ,5,GRÜN,,,,,,,,,0,166,166,166,right,1,0.785683096595,2017_Jun_07_1615,99.0197732767,Stroop,A-2,1STACS-8,
neutral,left,"[0.568627451, -0.7882352941, -0.7882352941]", ,12,SOLL,,,,,,,,,0,167,167,167,left,1,0.725550314356,2017_Jun_07_1615,99.0197732767,Stroop,A-2,1STACS-8,
incongruent,left,"[0.568627451, -0.7882352941, -0.7882352941]", ,6,BLAU,,,,,,,,,0,168,168,168,left,1,0.405339226075,2017_Jun_07_1615,99.0197732767,Stroop,A-2,1STACS-8,
neutral,left,"[0.568627451, -0.7882352941, -0.7882352941]", ,9,PECH,,,,,,,,,0,169,169,169,left,1,0.501403111289,2017_Jun_07_1615,99.0197732767,Stroop,A-2,1STACS-8,
incongruent,down,"[-0.7725490196, 0.0745098039, -1]", ,1,ROT,,,,,,,,,0,170,170,170,down,1,0.469749926317,2017_Jun_07_1615,99.0197732767,Stroop,A-2,1STACS-8,
incongruent,right,"[-0.8745098039, -0.2078431373, 0.637254902]", ,2,ROT,,,,,,,,,0,171,171,171,right,1,0.502819213056,2017_Jun_07_1615,99.0197732767,Stroop,A-2,1STACS-8,
neutral,down,"[-0.7725490196, 0.0745098039, -1]", ,13,SOLL,,,,,,,,,0,172,172,172,right,0,0.470759831208,2017_Jun_07_1615,99.0197732767,Stroop,A-2,1STACS-8,
congruent,left,"[0.568627451, -0.7882352941, -0.7882352941]", ,0,ROT,,,,,,,,,0,173,173,173,left,1,0.600615161983,2017_Jun_07_1615,99.0197732767,Stroop,A-2,1STACS-8,
neutral,right,"[-0.8745098039, -0.2078431373, 0.637254902]", ,11,PECH,,,,,,,,,0,174,174,174,right,1,0.696238488411,2017_Jun_07_1615,99.0197732767,Stroop,A-2,1STACS-8,
neutral,right,"[-0.8745098039, -0.2078431373, 0.637254902]", ,14,SOLL,,,,,,,,,0,175,175,175,right,1,0.579522816447,2017_Jun_07_1615,99.0197732767,Stroop,A-2,1STACS-8,
congruent,left,"[0.568627451, -0.7882352941, -0.7882352941]", ,0,ROT,,,,,,,,,0,176,176,176,left,1,0.674137355446,2017_Jun_07_1615,99.0197732767,Stroop,A-2,1STACS-8,
neutral,down,"[-0.7725490196, 0.0745098039, -1]", ,10,PECH,,,,,,,,,0,177,177,177,down,1,0.525105285728,2017_Jun_07_1615,99.0197732767,Stroop,A-2,1STACS-8,
congruent,right,"[-0.8745098039, -0.2078431373, 0.637254902]", ,8,BLAU,,,,,,,,,0,178,178,178,right,1,0.535554937848,2017_Jun_07_1615,99.0197732767,Stroop,A-2,1STACS-8,
neutral,left,"[0.568627451, -0.7882352941, -0.7882352941]", ,9,PECH,,,,,,,,,0,179,179,179,left,1,0.621426466213,2017_Jun_07_1615,99.0197732767,Stroop,A-2,1STACS-8,
congruent,right,"[-0.8745098039, -0.2078431373, 0.637254902]", ,8,BLAU,,,,,,,,,0,180,180,180,left,0,0.706746248476,2017_Jun_07_1615,99.0197732767,Stroop,A-2,1STACS-8,
neutral,left,"[0.568627451, -0.7882352941, -0.7882352941]", ,12,SOLL,,,,,,,,,0,181,181,181,left,1,1.09864214586,2017_Jun_07_1615,99.0197732767,Stroop,A-2,1STACS-8,
congruent,down,"[-0.7725490196, 0.0745098039, -1]", ,4,GRÜN,,,,,,,,,0,182,182,182,down,1,0.689973725711,2017_Jun_07_1615,99.0197732767,Stroop,A-2,1STACS-8,
congruent,down,"[-0.7725490196, 0.0745098039, -1]", ,4,GRÜN,,,,,,,,,0,183,183,183,down,1,0.457405619988,2017_Jun_07_1615,99.0197732767,Stroop,A-2,1STACS-8,
neutralofneutral,right,"[-0.8745098039, -0.2078431373, 0.637254902]", ,17,HALS,,,,,,,,,0,184,184,184,right,1,0.683068937533,2017_Jun_07_1615,99.0197732767,Stroop,A-2,1STACS-8,
neutralofneutral,down,"[-0.7725490196, 0.0745098039, -1]", ,19,MODE,,,,,,,,,0,185,185,185,down,1,0.548043675942,2017_Jun_07_1615,99.0197732767,Stroop,A-2,1STACS-8,
neutral,right,"[-0.8745098039, -0.2078431373, 0.637254902]", ,11,PECH,,,,,,,,,0,186,186,186,right,1,0.471597367822,2017_Jun_07_1615,99.0197732767,Stroop,A-2,1STACS-8,
neutralofneutral,left,"[0.568627451, -0.7882352941, -0.7882352941]", ,15,HALS,,,,,,,,,0,187,187,187,down,0,0.675760187398,2017_Jun_07_1615,99.0197732767,Stroop,A-2,1STACS-8,
neutralofneutral,left,"[0.568627451, -0.7882352941, -0.7882352941]", ,18,MODE,,,,,,,,,0,188,188,188,left,1,0.664210395455,2017_Jun_07_1615,99.0197732767,Stroop,A-2,1STACS-8,
neutral,down,"[-0.7725490196, 0.0745098039, -1]", ,10,PECH,,,,,,,,,0,189,189,189,down,1,0.567302548229,2017_Jun_07_1615,99.0197732767,Stroop,A-2,1STACS-8,
neutralofneutral,down,"[-0.7725490196, 0.0745098039, -1]", ,16,HALS,,,,,,,,,0,190,190,190,left,0,0.492942259421,2017_Jun_07_1615,99.0197732767,Stroop,A-2,1STACS-8,
neutral,down,"[-0.7725490196, 0.0745098039, -1]", ,13,SOLL,,,,,,,,,0,191,191,191,down,1,0.417650846686,2017_Jun_07_1615,99.0197732767,Stroop,A-2,1STACS-8,
neutralofneutral,right,"[-0.8745098039, -0.2078431373, 0.637254902]", ,20,MODE,,,,,,,,,0,192,192,192,right,1,0.67510703176,2017_Jun_07_1615,99.0197732767,Stroop,A-2,1STACS-8,
neutral,left,"[0.568627451, -0.7882352941, -0.7882352941]", ,12,SOLL,,,,,,,,,0,193,193,193,left,1,0.89937408246,2017_Jun_07_1615,99.0197732767,Stroop,A-2,1STACS-8,
neutral,left,"[0.568627451, -0.7882352941, -0.7882352941]", ,9,PECH,,,,,,,,,0,194,194,194,left,1,0.525189933358,2017_Jun_07_1615,99.0197732767,Stroop,A-2,1STACS-8,
neutral,right,"[-0.8745098039, -0.2078431373, 0.637254902]", ,14,SOLL,,,,,,,,,0,195,195,195,right,1,0.608528458226,2017_Jun_07_1615,99.0197732767,Stroop,A-2,1STACS-8,
fix,return,white, ,21,+,,,,,,,,,0,196,196,196,None,0,,2017_Jun_07_1615,99.0197732767,Stroop,A-2,1STACS-8,
fix,return,white, ,21,+,,,,,,,,,0,197,197,197,None,0,,2017_Jun_07_1615,99.0197732767,Stroop,A-2,1STACS-8,
fix,return,white, ,21,+,,,,,,,,,0,198,198,198,None,0,,2017_Jun_07_1615,99.0197732767,Stroop,A-2,1STACS-8,
fix,return,white, ,21,+,,,,,,,,,0,199,199,199,None,0,,2017_Jun_07_1615,99.0197732767,Stroop,A-2,1STACS-8,
fix,return,white, ,21,+,,,,,,,,,0,200,200,200,None,0,,2017_Jun_07_1615,99.0197732767,Stroop,A-2,1STACS-8,
fix,return,white, ,21,+,,,,,,,,,0,201,201,201,None,0,,2017_Jun_07_1615,99.0197732767,Stroop,A-2,1STACS-8,
fix,return,white, ,21,+,,,,,,,,,0,202,202,202,None,0,,2017_Jun_07_1615,99.0197732767,Stroop,A-2,1STACS-8,
fix,return,white, ,21,+,,,,,,,,,0,203,203,203,None,0,,2017_Jun_07_1615,99.0197732767,Stroop,A-2,1STACS-8,
fix,return,white, ,21,+,,,,,,,,,0,204,204,204,None,0,,2017_Jun_07_1615,99.0197732767,Stroop,A-2,1STACS-8,
fix,return,white, ,21,+,,,,,,,,,0,205,205,205,None,0,,2017_Jun_07_1615,99.0197732767,Stroop,A-2,1STACS-8,
fix,return,white, ,21,+,,,,,,,,,0,206,206,206,None,0,,2017_Jun_07_1615,99.0197732767,Stroop,A-2,1STACS-8,
fix,return,white, ,21,+,,,,,,,,,0,207,207,207,None,0,,2017_Jun_07_1615,99.0197732767,Stroop,A-2,1STACS-8,
fix,return,white,+,22,+,,,,,,,,,0,208,208,208,None,0,,2017_Jun_07_1615,99.0197732767,Stroop,A-2,1STACS-8,
neutralofneutral,left,"[0.568627451, -0.7882352941, -0.7882352941]", ,18,MODE,,,,,,,,,0,209,209,209,left,1,0.716759811652,2017_Jun_07_1615,99.0197732767,Stroop,A-2,1STACS-8,
neutral,left,"[0.568627451, -0.7882352941, -0.7882352941]", ,9,PECH,,,,,,,,,0,210,210,210,left,1,0.458743220158,2017_Jun_07_1615,99.0197732767,Stroop,A-2,1STACS-8,
neutral,down,"[-0.7725490196, 0.0745098039, -1]", ,13,SOLL,,,,,,,,,0,211,211,211,down,1,0.853325771851,2017_Jun_07_1615,99.0197732767,Stroop,A-2,1STACS-8,
neutralofneutral,right,"[-0.8745098039, -0.2078431373, 0.637254902]", ,20,MODE,,,,,,,,,0,212,212,212,right,1,0.630507508636,2017_Jun_07_1615,99.0197732767,Stroop,A-2,1STACS-8,
neutralofneutral,left,"[0.568627451, -0.7882352941, -0.7882352941]", ,15,HALS,,,,,,,,,0,213,213,213,left,1,0.768785697624,2017_Jun_07_1615,99.0197732767,Stroop,A-2,1STACS-8,
neutralofneutral,right,"[-0.8745098039, -0.2078431373, 0.637254902]", ,17,HALS,,,,,,,,,0,214,214,214,down,0,0.464447017708,2017_Jun_07_1615,99.0197732767,Stroop,A-2,1STACS-8,
neutral,left,"[0.568627451, -0.7882352941, -0.7882352941]", ,12,SOLL,,,,,,,,,0,215,215,215,right,0,0.582567337469,2017_Jun_07_1615,99.0197732767,Stroop,A-2,1STACS-8,
neutral,right,"[-0.8745098039, -0.2078431373, 0.637254902]", ,11,PECH,,,,,,,,,0,216,216,216,None,0,,2017_Jun_07_1615,99.0197732767,Stroop,A-2,1STACS-8,
neutral,down,"[-0.7725490196, 0.0745098039, -1]", ,10,PECH,,,,,,,,,0,217,217,217,down,1,0.538779928734,2017_Jun_07_1615,99.0197732767,Stroop,A-2,1STACS-8,
neutralofneutral,down,"[-0.7725490196, 0.0745098039, -1]", ,16,HALS,,,,,,,,,0,218,218,218,down,1,0.686263198256,2017_Jun_07_1615,99.0197732767,Stroop,A-2,1STACS-8,
neutral,right,"[-0.8745098039, -0.2078431373, 0.637254902]", ,14,SOLL,,,,,,,,,0,219,219,219,right,1,0.770896580431,2017_Jun_07_1615,99.0197732767,Stroop,A-2,1STACS-8,
neutralofneutral,down,"[-0.7725490196, 0.0745098039, -1]", ,19,MODE,,,,,,,,,0,220,220,220,down,1,0.750676133419,2017_Jun_07_1615,99.0197732767,Stroop,A-2,1STACS-8,
neutral,right,"[-0.8745098039, -0.2078431373, 0.637254902]", ,11,PECH,,,,,,,,,0,221,221,221,right,1,0.610842160107,2017_Jun_07_1615,99.0197732767,Stroop,A-2,1STACS-8,
neutral,left,"[0.568627451, -0.7882352941, -0.7882352941]", ,12,SOLL,,,,,,,,,0,222,222,222,left,1,0.482233915204,2017_Jun_07_1615,99.0197732767,Stroop,A-2,1STACS-8,
congruent,down,"[-0.7725490196, 0.0745098039, -1]", ,4,GRÜN,,,,,,,,,0,223,223,223,down,1,0.478561940135,2017_Jun_07_1615,99.0197732767,Stroop,A-2,1STACS-8,
neutral,right,"[-0.8745098039, -0.2078431373, 0.637254902]", ,14,SOLL,,,,,,,,,0,224,224,224,right,1,0.629042238609,2017_Jun_07_1615,99.0197732767,Stroop,A-2,1STACS-8,
congruent,right,"[-0.8745098039, -0.2078431373, 0.637254902]", ,8,BLAU,,,,,,,,,0,225,225,225,right,1,0.523094415631,2017_Jun_07_1615,99.0197732767,Stroop,A-2,1STACS-8,
congruent,down,"[-0.7725490196, 0.0745098039, -1]", ,4,GRÜN,,,,,,,,,0,226,226,226,down,1,0.658086432773,2017_Jun_07_1615,99.0197732767,Stroop,A-2,1STACS-8,
neutral,left,"[0.568627451, -0.7882352941, -0.7882352941]", ,9,PECH,,,,,,,,,0,227,227,227,left,1,0.736267877621,2017_Jun_07_1615,99.0197732767,Stroop,A-2,1STACS-8,
neutral,down,"[-0.7725490196, 0.0745098039, -1]", ,10,PECH,,,,,,,,,0,228,228,228,down,1,0.599800533308,2017_Jun_07_1615,99.0197732767,Stroop,A-2,1STACS-8,
congruent,right,"[-0.8745098039, -0.2078431373, 0.637254902]", ,8,BLAU,,,,,,,,,0,229,229,229,right,1,0.686076023629,2017_Jun_07_1615,99.0197732767,Stroop,A-2,1STACS-8,
congruent,left,"[0.568627451, -0.7882352941, -0.7882352941]", ,0,ROT,,,,,,,,,0,230,230,230,left,1,0.578359540109,2017_Jun_07_1615,99.0197732767,Stroop,A-2,1STACS-8,
neutral,down,"[-0.7725490196, 0.0745098039, -1]", ,13,SOLL,,,,,,,,,0,231,231,231,down,1,0.417753932413,2017_Jun_07_1615,99.0197732767,Stroop,A-2,1STACS-8,
congruent,left,"[0.568627451, -0.7882352941, -0.7882352941]", ,0,ROT,,,,,,,,,0,232,232,232,left,1,0.674811463468,2017_Jun_07_1615,99.0197732767,Stroop,A-2,1STACS-8,
incongruent,left,"[0.568627451, -0.7882352941, -0.7882352941]", ,3,GRÜN,,,,,,,,,0,233,233,233,left,1,0.618955202407,2017_Jun_07_1615,99.0197732767,Stroop,A-2,1STACS-8,
incongruent,right,"[-0.8745098039, -0.2078431373, 0.637254902]", ,2,ROT,,,,,,,,,0,234,234,234,right,1,0.642650113352,2017_Jun_07_1615,99.0197732767,Stroop,A-2,1STACS-8,
neutral,down,"[-0.7725490196, 0.0745098039, -1]", ,10,PECH,,,,,,,,,0,235,235,235,down,1,0.588996366857,2017_Jun_07_1615,99.0197732767,Stroop,A-2,1STACS-8,
neutral,right,"[-0.8745098039, -0.2078431373, 0.637254902]", ,14,SOLL,,,,,,,,,0,236,236,236,right,1,0.781931223102,2017_Jun_07_1615,99.0197732767,Stroop,A-2,1STACS-8,
incongruent,left,"[0.568627451, -0.7882352941, -0.7882352941]", ,6,BLAU,,,,,,,,,0,237,237,237,left,1,0.718608370617,2017_Jun_07_1615,99.0197732767,Stroop,A-2,1STACS-8,
neutral,down,"[-0.7725490196, 0.0745098039, -1]", ,13,SOLL,,,,,,,,,0,238,238,238,down,1,0.639874900302,2017_Jun_07_1615,99.0197732767,Stroop,A-2,1STACS-8,
neutral,left,"[0.568627451, -0.7882352941, -0.7882352941]", ,12,SOLL,,,,,,,,,0,239,239,239,right,0,0.927745565428,2017_Jun_07_1615,99.0197732767,Stroop,A-2,1STACS-8,
incongruent,right,"[-0.8745098039, -0.2078431373, 0.637254902]", ,5,GRÜN,,,,,,,,,0,240,240,240,down,0,0.722244028221,2017_Jun_07_1615,99.0197732767,Stroop,A-2,1STACS-8,
incongruent,down,"[-0.7725490196, 0.0745098039, -1]", ,1,ROT,,,,,,,,,0,241,241,241,down,1,0.832797743847,2017_Jun_07_1615,99.0197732767,Stroop,A-2,1STACS-8,
incongruent,down,"[-0.7725490196, 0.0745098039, -1]", ,7,BLAU,,,,,,,,,0,242,242,242,right,0,0.942325072041,2017_Jun_07_1615,99.0197732767,Stroop,A-2,1STACS-8,
neutral,right,"[-0.8745098039, -0.2078431373, 0.637254902]", ,11,PECH,,,,,,,,,0,243,243,243,right,1,1.24962809519,2017_Jun_07_1615,99.0197732767,Stroop,A-2,1STACS-8,
neutral,left,"[0.568627451, -0.7882352941, -0.7882352941]", ,9,PECH,,,,,,,,,0,244,244,244,left,1,0.771238523332,2017_Jun_07_1615,99.0197732767,Stroop,A-2,1STACS-8,
fix,return,white, ,21,+,,,,,,,,,0,245,245,245,None,0,,2017_Jun_07_1615,99.0197732767,Stroop,A-2,1STACS-8,
fix,return,white, ,21,+,,,,,,,,,0,246,246,246,None,0,,2017_Jun_07_1615,99.0197732767,Stroop,A-2,1STACS-8,
fix,return,white, ,21,+,,,,,,,,,0,247,247,247,None,0,,2017_Jun_07_1615,99.0197732767,Stroop,A-2,1STACS-8,
fix,return,white, ,21,+,,,,,,,,,0,248,248,248,None,0,,2017_Jun_07_1615,99.0197732767,Stroop,A-2,1STACS-8,
fix,return,white, ,21,+,,,,,,,,,0,249,249,249,None,0,,2017_Jun_07_1615,99.0197732767,Stroop,A-2,1STACS-8,
fix,return,white, ,21,+,,,,,,,,,0,250,250,250,None,0,,2017_Jun_07_1615,99.0197732767,Stroop,A-2,1STACS-8,
fix,return,white, ,21,+,,,,,,,,,0,251,251,251,None,0,,2017_Jun_07_1615,99.0197732767,Stroop,A-2,1STACS-8,
fix,return,white, ,21,+,,,,,,,,,0,252,252,252,None,0,,2017_Jun_07_1615,99.0197732767,Stroop,A-2,1STACS-8,
fix,return,white, ,21,+,,,,,,,,,0,253,253,253,None,0,,2017_Jun_07_1615,99.0197732767,Stroop,A-2,1STACS-8,
fix,return,white, ,21,+,,,,,,,,,0,254,254,254,None,0,,2017_Jun_07_1615,99.0197732767,Stroop,A-2,1STACS-8,
fix,return,white, ,21,+,,,,,,,,,0,255,255,255,None,0,,2017_Jun_07_1615,99.0197732767,Stroop,A-2,1STACS-8,
fix,return,white, ,21,+,,,,,,,,,0,256,256,256,None,0,,2017_Jun_07_1615,99.0197732767,Stroop,A-2,1STACS-8,
fix,return,white,+,22,+,,,,,,,,,0,257,257,257,None,0,,2017_Jun_07_1615,99.0197732767,Stroop,A-2,1STACS-8,
incongruent,right,"[-0.8745098039, -0.2078431373, 0.637254902]", ,5,GRÜN,,,,,,,,,0,258,258,258,right,1,0.917919735609,2017_Jun_07_1615,99.0197732767,Stroop,A-2,1STACS-8,
neutral,down,"[-0.7725490196, 0.0745098039, -1]", ,10,PECH,,,,,,,,,0,259,259,259,down,1,0.418212649932,2017_Jun_07_1615,99.0197732767,Stroop,A-2,1STACS-8,
neutral,left,"[0.568627451, -0.7882352941, -0.7882352941]", ,12,SOLL,,,,,,,,,0,260,260,260,left,1,0.706904648496,2017_Jun_07_1615,99.0197732767,Stroop,A-2,1STACS-8,
incongruent,down,"[-0.7725490196, 0.0745098039, -1]", ,7,BLAU,,,,,,,,,0,261,261,261,right,0,0.64173184022,2017_Jun_07_1615,99.0197732767,Stroop,A-2,1STACS-8,
incongruent,down,"[-0.7725490196, 0.0745098039, -1]", ,1,ROT,,,,,,,,,0,262,262,262,down,1,0.556961289773,2017_Jun_07_1615,99.0197732767,Stroop,A-2,1STACS-8,
incongruent,left,"[0.568627451, -0.7882352941, -0.7882352941]", ,6,BLAU,,,,,,,,,0,263,263,263,right,0,0.83663538243,2017_Jun_07_1615,99.0197732767,Stroop,A-2,1STACS-8,
neutral,right,"[-0.8745098039, -0.2078431373, 0.637254902]", ,11,PECH,,,,,,,,,0,264,264,264,right,1,0.621491558285,2017_Jun_07_1615,99.0197732767,Stroop,A-2,1STACS-8,
incongruent,right,"[-0.8745098039, -0.2078431373, 0.637254902]", ,2,ROT,,,,,,,,,0,265,265,265,right,1,0.481581038931,2017_Jun_07_1615,99.0197732767,Stroop,A-2,1STACS-8,
incongruent,left,"[0.568627451, -0.7882352941, -0.7882352941]", ,3,GRÜN,,,,,,,,,0,266,266,266,down,0,0.70055328261,2017_Jun_07_1615,99.0197732767,Stroop,A-2,1STACS-8,
neutral,down,"[-0.7725490196, 0.0745098039, -1]", ,13,SOLL,,,,,,,,,0,267,267,267,down,1,0.554376045,2017_Jun_07_1615,99.0197732767,Stroop,A-2,1STACS-8,
neutral,right,"[-0.8745098039, -0.2078431373, 0.637254902]", ,14,SOLL,,,,,,,,,0,268,268,268,left,0,0.660694585485,2017_Jun_07_1615,99.0197732767,Stroop,A-2,1STACS-8,
neutral,left,"[0.568627451, -0.7882352941, -0.7882352941]", ,9,PECH,,,,,,,,,0,269,269,269,left,1,0.864700122502,2017_Jun_07_1615,99.0197732767,Stroop,A-2,1STACS-8,
neutral,left,"[0.568627451, -0.7882352941, -0.7882352941]", ,12,SOLL,,,,,,,,,0,270,270,270,left,1,0.480339819726,2017_Jun_07_1615,99.0197732767,Stroop,A-2,1STACS-8,
neutralofneutral,left,"[0.568627451, -0.7882352941, -0.7882352941]", ,18,MODE,,,,,,,,,0,271,271,271,left,1,0.502992978158,2017_Jun_07_1615,99.0197732767,Stroop,A-2,1STACS-8,
neutral,right,"[-0.8745098039, -0.2078431373, 0.637254902]", ,11,PECH,,,,,,,,,0,272,272,272,right,1,0.793025370543,2017_Jun_07_1615,99.0197732767,Stroop,A-2,1STACS-8,
neutralofneutral,right,"[-0.8745098039, -0.2078431373, 0.637254902]", ,20,MODE,,,,,,,,,0,273,273,273,right,1,0.557026940575,2017_Jun_07_1615,99.0197732767,Stroop,A-2,1STACS-8,
neutralofneutral,down,"[-0.7725490196, 0.0745098039, -1]", ,16,HALS,,,,,,,,,0,274,274,274,down,1,0.62100630108,2017_Jun_07_1615,99.0197732767,Stroop,A-2,1STACS-8,
neutral,down,"[-0.7725490196, 0.0745098039, -1]", ,10,PECH,,,,,,,,,0,275,275,275,down,1,0.385888709319,2017_Jun_07_1615,99.0197732767,Stroop,A-2,1STACS-8,
neutralofneutral,left,"[0.568627451, -0.7882352941, -0.7882352941]", ,15,HALS,,,,,,,,,0,276,276,276,left,1,0.460568871183,2017_Jun_07_1615,99.0197732767,Stroop,A-2,1STACS-8,
neutralofneutral,down,"[-0.7725490196, 0.0745098039, -1]", ,19,MODE,,,,,,,,,0,277,277,277,left,0,0.524616676142,2017_Jun_07_1615,99.0197732767,Stroop,A-2,1STACS-8,
neutral,left,"[0.568627451, -0.7882352941, -0.7882352941]", ,9,PECH,,,,,,,,,0,278,278,278,left,1,0.749585492011,2017_Jun_07_1615,99.0197732767,Stroop,A-2,1STACS-8,
neutral,down,"[-0.7725490196, 0.0745098039, -1]", ,13,SOLL,,,,,,,,,0,279,279,279,down,1,0.535696296596,2017_Jun_07_1615,99.0197732767,Stroop,A-2,1STACS-8,
neutral,right,"[-0.8745098039, -0.2078431373, 0.637254902]", ,14,SOLL,,,,,,,,,0,280,280,280,right,1,0.619537399306,2017_Jun_07_1615,99.0197732767,Stroop,A-2,1STACS-8,
neutralofneutral,right,"[-0.8745098039, -0.2078431373, 0.637254902]", ,17,HALS,,,,,,,,,0,281,281,281,right,1,0.490792544863,2017_Jun_07_1615,99.0197732767,Stroop,A-2,1STACS-8,
neutral,left,"[0.568627451, -0.7882352941, -0.7882352941]", ,12,SOLL,,,,,,,,,0,282,282,282,left,1,0.61878059921,2017_Jun_07_1615,99.0197732767,Stroop,A-2,1STACS-8,
congruent,down,"[-0.7725490196, 0.0745098039, -1]", ,4,GRÜN,,,,,,,,,0,283,283,283,down,1,0.509512801208,2017_Jun_07_1615,99.0197732767,Stroop,A-2,1STACS-8,
neutral,right,"[-0.8745098039, -0.2078431373, 0.637254902]", ,14,SOLL,,,,,,,,,0,284,284,284,right,1,0.939127738302,2017_Jun_07_1615,99.0197732767,Stroop,A-2,1STACS-8,
congruent,right,"[-0.8745098039, -0.2078431373, 0.637254902]", ,8,BLAU,,,,,,,,,0,285,285,285,right,1,0.374988720633,2017_Jun_07_1615,99.0197732767,Stroop,A-2,1STACS-8,
neutral,down,"[-0.7725490196, 0.0745098039, -1]", ,13,SOLL,,,,,,,,,0,286,286,286,down,1,0.503098578171,2017_Jun_07_1615,99.0197732767,Stroop,A-2,1STACS-8,
neutral,down,"[-0.7725490196, 0.0745098039, -1]", ,10,PECH,,,,,,,,,0,287,287,287,down,1,0.41793943085,2017_Jun_07_1615,99.0197732767,Stroop,A-2,1STACS-8,
congruent,right,"[-0.8745098039, -0.2078431373, 0.637254902]", ,8,BLAU,,,,,,,,,0,288,288,288,right,1,0.578084924201,2017_Jun_07_1615,99.0197732767,Stroop,A-2,1STACS-8,
congruent,down,"[-0.7725490196, 0.0745098039, -1]", ,4,GRÜN,,,,,,,,,0,289,289,289,down,1,0.511517804637,2017_Jun_07_1615,99.0197732767,Stroop,A-2,1STACS-8,
congruent,left,"[0.568627451, -0.7882352941, -0.7882352941]", ,0,ROT,,,,,,,,,0,290,290,290,left,1,0.417909818147,2017_Jun_07_1615,99.0197732767,Stroop,A-2,1STACS-8,
neutral,right,"[-0.8745098039, -0.2078431373, 0.637254902]", ,11,PECH,,,,,,,,,0,291,291,291,right,1,0.503141879764,2017_Jun_07_1615,99.0197732767,Stroop,A-2,1STACS-8,
congruent,left,"[0.568627451, -0.7882352941, -0.7882352941]", ,0,ROT,,,,,,,,,0,292,292,292,down,0,0.42924002911,2017_Jun_07_1615,99.0197732767,Stroop,A-2,1STACS-8,
neutral,left,"[0.568627451, -0.7882352941, -0.7882352941]", ,9,PECH,,,,,,,,,0,293,293,293,left,1,0.569071208771,2017_Jun_07_1615,99.0197732767,Stroop,A-2,1STACS-8,
fix,return,white, ,21,+,,,,,,,,,0,294,294,294,None,0,,2017_Jun_07_1615,99.0197732767,Stroop,A-2,1STACS-8,
fix,return,white, ,21,+,,,,,,,,,0,295,295,295,None,0,,2017_Jun_07_1615,99.0197732767,Stroop,A-2,1STACS-8,
fix,return,white, ,21,+,,,,,,,,,0,296,296,296,None,0,,2017_Jun_07_1615,99.0197732767,Stroop,A-2,1STACS-8,
fix,return,white, ,21,+,,,,,,,,,0,297,297,297,None,0,,2017_Jun_07_1615,99.0197732767,Stroop,A-2,1STACS-8,
fix,return,white, ,21,+,,,,,,,,,0,298,298,298,None,0,,2017_Jun_07_1615,99.0197732767,Stroop,A-2,1STACS-8,
fix,return,white, ,21,+,,,,,,,,,0,299,299,299,None,0,,2017_Jun_07_1615,99.0197732767,Stroop,A-2,1STACS-8,
fix,return,white, ,21,+,,,,,,,,,0,300,300,300,None,0,,2017_Jun_07_1615,99.0197732767,Stroop,A-2,1STACS-8,
fix,return,white, ,21,+,,,,,,,,,0,301,301,301,None,0,,2017_Jun_07_1615,99.0197732767,Stroop,A-2,1STACS-8,
fix,return,white, ,21,+,,,,,,,,,0,302,302,302,None,0,,2017_Jun_07_1615,99.0197732767,Stroop,A-2,1STACS-8,
fix,return,white, ,21,+,,,,,,,,,0,303,303,303,None,0,,2017_Jun_07_1615,99.0197732767,Stroop,A-2,1STACS-8,
fix,return,white, ,21,+,,,,,,,,,0,304,304,304,None,0,,2017_Jun_07_1615,99.0197732767,Stroop,A-2,1STACS-8,
fix,return,white, ,21,+,,,,,,,,,0,305,305,305,None,0,,2017_Jun_07_1615,99.0197732767,Stroop,A-2,1STACS-8,
fix,return,white,+,22,+,,,,,,,,,0,306,306,306,None,0,,2017_Jun_07_1615,99.0197732767,Stroop,A-2,1STACS-8,
