congruent,corrAns,letterColor,signal,selectedrownumber_novariable,Anzeigetext,practice.thisRepN,practice.thisTrialN,practice.thisN,practice.thisIndex,Wrongresponse.thisRepN,Wrongresponse.thisTrialN,Wrongresponse.thisN,Wrongresponse.thisIndex,trials.thisRepN,trials.thisTrialN,trials.thisN,trials.thisIndex,resp.keys,resp.corr,resp.rt,date,frameRate,expName,session,participant,
neutralofneutral,left,"[0.568627451, -0.7882352941, -0.7882352941]", ,15,HALS,0,0,0,0,0,0,0,0,,,,,left,1,0.640809655975,2017_Mai_30_1609,98.8117617499,Stroop,B-2,1STACs-8,
,,,,,,0,0,0,0,,,,,,,,,,,,2017_Mai_30_1609,98.8117617499,Stroop,B-2,1STACs-8,
neutralofneutral,down,"[-0.7725490196, 0.0745098039, -1]", ,19,MODE,1,0,1,0,0,0,0,0,,,,,down,1,0.542767865747,2017_Mai_30_1609,98.8117617499,Stroop,B-2,1STACs-8,
,,,,,,1,0,1,0,,,,,,,,,,,,2017_Mai_30_1609,98.8117617499,Stroop,B-2,1STACs-8,
neutral,down,"[-0.7725490196, 0.0745098039, -1]", ,10,PECH,2,0,2,0,0,0,0,0,,,,,down,1,0.429247013237,2017_Mai_30_1609,98.8117617499,Stroop,B-2,1STACs-8,
,,,,,,2,0,2,0,,,,,,,,,,,,2017_Mai_30_1609,98.8117617499,Stroop,B-2,1STACs-8,
congruent,right,"[-0.8745098039, -0.2078431373, 0.637254902]", ,8,BLAU,3,0,3,0,0,0,0,0,,,,,right,1,0.523783888733,2017_Mai_30_1609,98.8117617499,Stroop,B-2,1STACs-8,
,,,,,,3,0,3,0,,,,,,,,,,,,2017_Mai_30_1609,98.8117617499,Stroop,B-2,1STACs-8,
neutral,down,"[-0.7725490196, 0.0745098039, -1]", ,10,PECH,4,0,4,0,0,0,0,0,,,,,left,0,0.740719001997,2017_Mai_30_1609,98.8117617499,Stroop,B-2,1STACs-8,
,,,,,,4,0,4,0,,,,,,,,,,,,2017_Mai_30_1609,98.8117617499,Stroop,B-2,1STACs-8,
neutral,down,"[-0.7725490196, 0.0745098039, -1]", ,10,PECH,5,0,5,0,0,0,0,0,,,,,down,1,0.47268521558,2017_Mai_30_1609,98.8117617499,Stroop,B-2,1STACs-8,
,,,,,,5,0,5,0,,,,,,,,,,,,2017_Mai_30_1609,98.8117617499,Stroop,B-2,1STACs-8,
incongruent,left,"[0.568627451, -0.7882352941, -0.7882352941]", ,6,BLAU,6,0,6,0,0,0,0,0,,,,,left,1,0.470759831207,2017_Mai_30_1609,98.8117617499,Stroop,B-2,1STACs-8,
,,,,,,6,0,6,0,,,,,,,,,,,,2017_Mai_30_1609,98.8117617499,Stroop,B-2,1STACs-8,
neutral,left,"[0.568627451, -0.7882352941, -0.7882352941]", ,9,PECH,7,0,7,0,0,0,0,0,,,,,down,0,0.408371455032,2017_Mai_30_1609,98.8117617499,Stroop,B-2,1STACs-8,
,,,,,,7,0,7,0,,,,,,,,,,,,2017_Mai_30_1609,98.8117617499,Stroop,B-2,1STACs-8,
neutral,left,"[0.568627451, -0.7882352941, -0.7882352941]", ,9,PECH,8,0,8,0,0,0,0,0,,,,,down,0,0.548128323573,2017_Mai_30_1609,98.8117617499,Stroop,B-2,1STACs-8,
,,,,,,8,0,8,0,,,,,,,,,,,,2017_Mai_30_1609,98.8117617499,Stroop,B-2,1STACs-8,
neutral,left,"[0.568627451, -0.7882352941, -0.7882352941]", ,9,PECH,9,0,9,0,0,0,0,0,,,,,left,1,0.397560863183,2017_Mai_30_1609,98.8117617499,Stroop,B-2,1STACs-8,
,,,,,,9,0,9,0,,,,,,,,,,,,2017_Mai_30_1609,98.8117617499,Stroop,B-2,1STACs-8,
incongruent,left,"[0.568627451, -0.7882352941, -0.7882352941]", ,3,GRÜN,10,0,10,0,0,0,0,0,,,,,left,1,0.538649465225,2017_Mai_30_1609,98.8117617499,Stroop,B-2,1STACs-8,
,,,,,,10,0,10,0,,,,,,,,,,,,2017_Mai_30_1609,98.8117617499,Stroop,B-2,1STACs-8,
neutral,down,"[-0.7725490196, 0.0745098039, -1]", ,10,PECH,11,0,11,0,0,0,0,0,,,,,down,1,0.76127273159,2017_Mai_30_1609,98.8117617499,Stroop,B-2,1STACs-8,
,,,,,,11,0,11,0,,,,,,,,,,,,2017_Mai_30_1609,98.8117617499,Stroop,B-2,1STACs-8,
neutralofneutral,right,"[-0.8745098039, -0.2078431373, 0.637254902]", ,17,HALS,12,0,12,0,0,0,0,0,,,,,right,1,0.737556868262,2017_Mai_30_1609,98.8117617499,Stroop,B-2,1STACs-8,
,,,,,,12,0,12,0,,,,,,,,,,,,2017_Mai_30_1609,98.8117617499,Stroop,B-2,1STACs-8,
neutralofneutral,right,"[-0.8745098039, -0.2078431373, 0.637254902]", ,20,MODE,13,0,13,0,0,0,0,0,,,,,right,1,0.426465654153,2017_Mai_30_1609,98.8117617499,Stroop,B-2,1STACs-8,
,,,,,,13,0,13,0,,,,,,,,,,,,2017_Mai_30_1609,98.8117617499,Stroop,B-2,1STACs-8,
neutral,left,"[0.568627451, -0.7882352941, -0.7882352941]", ,12,SOLL,14,0,14,0,0,0,0,0,,,,,down,0,0.417258059335,2017_Mai_30_1609,98.8117617499,Stroop,B-2,1STACs-8,
,,,,,,14,0,14,0,,,,,,,,,,,,2017_Mai_30_1609,98.8117617499,Stroop,B-2,1STACs-8,
neutral,left,"[0.568627451, -0.7882352941, -0.7882352941]", ,12,SOLL,15,0,15,0,0,0,0,0,,,,,left,1,0.470311729563,2017_Mai_30_1609,98.8117617499,Stroop,B-2,1STACs-8,
,,,,,,15,0,15,0,,,,,,,,,,,,2017_Mai_30_1609,98.8117617499,Stroop,B-2,1STACs-8,
neutral,down,"[-0.7725490196, 0.0745098039, -1]", ,10,PECH,16,0,16,0,0,0,0,0,,,,,down,1,0.494288240543,2017_Mai_30_1609,98.8117617499,Stroop,B-2,1STACs-8,
,,,,,,16,0,16,0,,,,,,,,,,,,2017_Mai_30_1609,98.8117617499,Stroop,B-2,1STACs-8,
neutralofneutral,down,"[-0.7725490196, 0.0745098039, -1]", ,19,MODE,17,0,17,0,0,0,0,0,,,,,down,1,0.404321778327,2017_Mai_30_1609,98.8117617499,Stroop,B-2,1STACs-8,
,,,,,,17,0,17,0,,,,,,,,,,,,2017_Mai_30_1609,98.8117617499,Stroop,B-2,1STACs-8,
incongruent,left,"[0.568627451, -0.7882352941, -0.7882352941]", ,6,BLAU,18,0,18,0,0,0,0,0,,,,,left,1,0.448537733148,2017_Mai_30_1609,98.8117617499,Stroop,B-2,1STACs-8,
,,,,,,18,0,18,0,,,,,,,,,,,,2017_Mai_30_1609,98.8117617499,Stroop,B-2,1STACs-8,
incongruent,left,"[0.568627451, -0.7882352941, -0.7882352941]", ,3,GRÜN,19,0,19,0,0,0,0,0,,,,,left,1,0.385066258421,2017_Mai_30_1609,98.8117617499,Stroop,B-2,1STACs-8,
,,,,,,19,0,19,0,,,,,,,,,,,,2017_Mai_30_1609,98.8117617499,Stroop,B-2,1STACs-8,
incongruent,down,"[-0.7725490196, 0.0745098039, -1]", ,1,ROT,20,0,20,0,0,0,0,0,,,,,right,0,0.614431443104,2017_Mai_30_1609,98.8117617499,Stroop,B-2,1STACs-8,
,,,,,,20,0,20,0,,,,,,,,,,,,2017_Mai_30_1609,98.8117617499,Stroop,B-2,1STACs-8,
incongruent,down,"[-0.7725490196, 0.0745098039, -1]", ,1,ROT,21,0,21,0,0,0,0,0,,,,,down,1,0.377544352705,2017_Mai_30_1609,98.8117617499,Stroop,B-2,1STACs-8,
,,,,,,21,0,21,0,,,,,,,,,,,,2017_Mai_30_1609,98.8117617499,Stroop,B-2,1STACs-8,
neutral,down,"[-0.7725490196, 0.0745098039, -1]", ,10,PECH,22,0,22,0,0,0,0,0,,,,,down,1,0.376174625546,2017_Mai_30_1609,98.8117617499,Stroop,B-2,1STACs-8,
,,,,,,22,0,22,0,,,,,,,,,,,,2017_Mai_30_1609,98.8117617499,Stroop,B-2,1STACs-8,
congruent,right,"[-0.8745098039, -0.2078431373, 0.637254902]", ,8,BLAU,23,0,23,0,0,0,0,0,,,,,left,0,0.587918855608,2017_Mai_30_1609,98.8117617499,Stroop,B-2,1STACs-8,
,,,,,,23,0,23,0,,,,,,,,,,,,2017_Mai_30_1609,98.8117617499,Stroop,B-2,1STACs-8,
congruent,right,"[-0.8745098039, -0.2078431373, 0.637254902]", ,8,BLAU,24,0,24,0,0,0,0,0,,,,,right,1,0.812247366634,2017_Mai_30_1609,98.8117617499,Stroop,B-2,1STACs-8,
,,,,,,24,0,24,0,,,,,,,,,,,,2017_Mai_30_1609,98.8117617499,Stroop,B-2,1STACs-8,
neutralofneutral,left,"[0.568627451, -0.7882352941, -0.7882352941]", ,18,MODE,25,0,25,0,0,0,0,0,,,,,left,1,0.619921246973,2017_Mai_30_1609,98.8117617499,Stroop,B-2,1STACs-8,
,,,,,,25,0,25,0,,,,,,,,,,,,2017_Mai_30_1609,98.8117617499,Stroop,B-2,1STACs-8,
incongruent,left,"[0.568627451, -0.7882352941, -0.7882352941]", ,6,BLAU,26,0,26,0,0,0,0,0,,,,,left,1,0.451168514433,2017_Mai_30_1609,98.8117617499,Stroop,B-2,1STACs-8,
,,,,,,26,0,26,0,,,,,,,,,,,,2017_Mai_30_1609,98.8117617499,Stroop,B-2,1STACs-8,
incongruent,left,"[0.568627451, -0.7882352941, -0.7882352941]", ,6,BLAU,27,0,27,0,0,0,0,0,,,,,left,1,0.483617889982,2017_Mai_30_1609,98.8117617499,Stroop,B-2,1STACs-8,
,,,,,,27,0,27,0,,,,,,,,,,,,2017_Mai_30_1609,98.8117617499,Stroop,B-2,1STACs-8,
neutralofneutral,right,"[-0.8745098039, -0.2078431373, 0.637254902]", ,20,MODE,28,0,28,0,0,0,0,0,,,,,right,1,0.747964056884,2017_Mai_30_1609,98.8117617499,Stroop,B-2,1STACs-8,
,,,,,,28,0,28,0,,,,,,,,,,,,2017_Mai_30_1609,98.8117617499,Stroop,B-2,1STACs-8,
neutral,right,"[-0.8745098039, -0.2078431373, 0.637254902]", ,14,SOLL,29,0,29,0,0,0,0,0,,,,,right,1,0.512638338112,2017_Mai_30_1609,98.8117617499,Stroop,B-2,1STACs-8,
,,,,,,29,0,29,0,,,,,,,,,,,,2017_Mai_30_1609,98.8117617499,Stroop,B-2,1STACs-8,
neutralofneutral,right,"[-0.8745098039, -0.2078431373, 0.637254902]", ,20,MODE,30,0,30,0,0,0,0,0,,,,,right,1,0.468051665785,2017_Mai_30_1609,98.8117617499,Stroop,B-2,1STACs-8,
,,,,,,30,0,30,0,,,,,,,,,,,,2017_Mai_30_1609,98.8117617499,Stroop,B-2,1STACs-8,
neutral,down,"[-0.7725490196, 0.0745098039, -1]", ,10,PECH,31,0,31,0,0,0,0,0,,,,,down,1,0.680086994298,2017_Mai_30_1609,98.8117617499,Stroop,B-2,1STACs-8,
,,,,,,31,0,31,0,,,,,,,,,,,,2017_Mai_30_1609,98.8117617499,Stroop,B-2,1STACs-8,
neutralofneutral,left,"[0.568627451, -0.7882352941, -0.7882352941]", ,18,MODE,32,0,32,0,0,0,0,0,,,,,left,1,0.715548484513,2017_Mai_30_1609,98.8117617499,Stroop,B-2,1STACs-8,
,,,,,,32,0,32,0,,,,,,,,,,,,2017_Mai_30_1609,98.8117617499,Stroop,B-2,1STACs-8,
neutralofneutral,down,"[-0.7725490196, 0.0745098039, -1]", ,19,MODE,33,0,33,0,0,0,0,0,,,,,down,1,0.619524269146,2017_Mai_30_1609,98.8117617499,Stroop,B-2,1STACs-8,
,,,,,,33,0,33,0,,,,,,,,,,,,2017_Mai_30_1609,98.8117617499,Stroop,B-2,1STACs-8,
incongruent,left,"[0.568627451, -0.7882352941, -0.7882352941]", ,3,GRÜN,34,0,34,0,0,0,0,0,,,,,left,1,0.891911402148,2017_Mai_30_1609,98.8117617499,Stroop,B-2,1STACs-8,
,,,,,,34,0,34,0,,,,,,,,,,,,2017_Mai_30_1609,98.8117617499,Stroop,B-2,1STACs-8,
neutral,right,"[-0.8745098039, -0.2078431373, 0.637254902]", ,14,SOLL,35,0,35,0,0,0,0,0,,,,,right,1,0.773286548987,2017_Mai_30_1609,98.8117617499,Stroop,B-2,1STACs-8,
,,,,,,35,0,35,0,,,,,,,,,,,,2017_Mai_30_1609,98.8117617499,Stroop,B-2,1STACs-8,
neutral,left,"[0.568627451, -0.7882352941, -0.7882352941]", ,9,PECH,36,0,36,0,0,0,0,0,,,,,left,1,0.741233871902,2017_Mai_30_1609,98.8117617499,Stroop,B-2,1STACs-8,
,,,,,,36,0,36,0,,,,,,,,,,,,2017_Mai_30_1609,98.8117617499,Stroop,B-2,1STACs-8,
neutralofneutral,left,"[0.568627451, -0.7882352941, -0.7882352941]", ,15,HALS,37,0,37,0,0,0,0,0,,,,,left,1,0.663732122379,2017_Mai_30_1609,98.8117617499,Stroop,B-2,1STACs-8,
,,,,,,37,0,37,0,,,,,,,,,,,,2017_Mai_30_1609,98.8117617499,Stroop,B-2,1STACs-8,
incongruent,down,"[-0.7725490196, 0.0745098039, -1]", ,1,ROT,38,0,38,0,0,0,0,0,,,,,down,1,0.799091225283,2017_Mai_30_1609,98.8117617499,Stroop,B-2,1STACs-8,
,,,,,,38,0,38,0,,,,,,,,,,,,2017_Mai_30_1609,98.8117617499,Stroop,B-2,1STACs-8,
incongruent,down,"[-0.7725490196, 0.0745098039, -1]", ,1,ROT,39,0,39,0,0,0,0,0,,,,,down,1,0.463737150951,2017_Mai_30_1609,98.8117617499,Stroop,B-2,1STACs-8,
,,,,,,39,0,39,0,,,,,,,,,,,,2017_Mai_30_1609,98.8117617499,Stroop,B-2,1STACs-8,
neutral,left,"[0.568627451, -0.7882352941, -0.7882352941]", ,9,PECH,40,0,40,0,0,0,0,0,,,,,left,1,0.767162865672,2017_Mai_30_1609,98.8117617499,Stroop,B-2,1STACs-8,
,,,,,,40,0,40,0,,,,,,,,,,,,2017_Mai_30_1609,98.8117617499,Stroop,B-2,1STACs-8,
incongruent,down,"[-0.7725490196, 0.0745098039, -1]", ,7,BLAU,41,0,41,0,0,0,0,0,,,,,right,0,0.601438450976,2017_Mai_30_1609,98.8117617499,Stroop,B-2,1STACs-8,
,,,,,,41,0,41,0,,,,,,,,,,,,2017_Mai_30_1609,98.8117617499,Stroop,B-2,1STACs-8,
incongruent,down,"[-0.7725490196, 0.0745098039, -1]", ,7,BLAU,42,0,42,0,0,0,0,0,,,,,down,1,0.419648865987,2017_Mai_30_1609,98.8117617499,Stroop,B-2,1STACs-8,
,,,,,,42,0,42,0,,,,,,,,,,,,2017_Mai_30_1609,98.8117617499,Stroop,B-2,1STACs-8,
neutralofneutral,left,"[0.568627451, -0.7882352941, -0.7882352941]", ,15,HALS,43,0,43,0,0,0,0,0,,,,,left,1,0.609626642494,2017_Mai_30_1609,98.8117617499,Stroop,B-2,1STACs-8,
,,,,,,43,0,43,0,,,,,,,,,,,,2017_Mai_30_1609,98.8117617499,Stroop,B-2,1STACs-8,
neutralofneutral,down,"[-0.7725490196, 0.0745098039, -1]", ,16,HALS,44,0,44,0,0,0,0,0,,,,,down,1,0.919258453239,2017_Mai_30_1609,98.8117617499,Stroop,B-2,1STACs-8,
,,,,,,44,0,44,0,,,,,,,,,,,,2017_Mai_30_1609,98.8117617499,Stroop,B-2,1STACs-8,
congruent,down,"[-0.7725490196, 0.0745098039, -1]", ,4,GRÜN,45,0,45,0,0,0,0,0,,,,,down,1,0.464328846263,2017_Mai_30_1609,98.8117617499,Stroop,B-2,1STACs-8,
,,,,,,45,0,45,0,,,,,,,,,,,,2017_Mai_30_1609,98.8117617499,Stroop,B-2,1STACs-8,
neutral,right,"[-0.8745098039, -0.2078431373, 0.637254902]", ,11,PECH,46,0,46,0,0,0,0,0,,,,,left,0,0.991992557714,2017_Mai_30_1609,98.8117617499,Stroop,B-2,1STACs-8,
,,,,,,46,0,46,0,,,,,,,,,,,,2017_Mai_30_1609,98.8117617499,Stroop,B-2,1STACs-8,
neutral,right,"[-0.8745098039, -0.2078431373, 0.637254902]", ,11,PECH,47,0,47,0,0,0,0,0,,,,,right,1,0.464189163706,2017_Mai_30_1609,98.8117617499,Stroop,B-2,1STACs-8,
,,,,,,47,0,47,0,,,,,,,,,,,,2017_Mai_30_1609,98.8117617499,Stroop,B-2,1STACs-8,
incongruent,right,"[-0.8745098039, -0.2078431373, 0.637254902]", ,5,GRÜN,48,0,48,0,0,0,0,0,,,,,down,0,0.63759779525,2017_Mai_30_1609,98.8117617499,Stroop,B-2,1STACs-8,
,,,,,,48,0,48,0,,,,,,,,,,,,2017_Mai_30_1609,98.8117617499,Stroop,B-2,1STACs-8,
incongruent,right,"[-0.8745098039, -0.2078431373, 0.637254902]", ,5,GRÜN,49,0,49,0,0,0,0,0,,,,,down,0,0.598609320457,2017_Mai_30_1609,98.8117617499,Stroop,B-2,1STACs-8,
,,,,,,49,0,49,0,,,,,,,,,,,,2017_Mai_30_1609,98.8117617499,Stroop,B-2,1STACs-8,
incongruent,right,"[-0.8745098039, -0.2078431373, 0.637254902]", ,5,GRÜN,50,0,50,0,0,0,0,0,,,,,right,1,0.0432094023126,2017_Mai_30_1609,98.8117617499,Stroop,B-2,1STACs-8,
,,,,,,50,0,50,0,,,,,,,,,,,,2017_Mai_30_1609,98.8117617499,Stroop,B-2,1STACs-8,
neutralofneutral,right,"[-0.8745098039, -0.2078431373, 0.637254902]", ,17,HALS,51,0,51,0,0,0,0,0,,,,,right,1,0.523945361771,2017_Mai_30_1609,98.8117617499,Stroop,B-2,1STACs-8,
,,,,,,51,0,51,0,,,,,,,,,,,,2017_Mai_30_1609,98.8117617499,Stroop,B-2,1STACs-8,
neutral,right,"[-0.8745098039, -0.2078431373, 0.637254902]", ,11,PECH,52,0,52,0,0,0,0,0,,,,,right,1,0.484884810779,2017_Mai_30_1609,98.8117617499,Stroop,B-2,1STACs-8,
,,,,,,52,0,52,0,,,,,,,,,,,,2017_Mai_30_1609,98.8117617499,Stroop,B-2,1STACs-8,
congruent,left,"[0.568627451, -0.7882352941, -0.7882352941]", ,0,ROT,53,0,53,0,0,0,0,0,,,,,left,1,0.773290460102,2017_Mai_30_1609,98.8117617499,Stroop,B-2,1STACs-8,
,,,,,,53,0,53,0,,,,,,,,,,,,2017_Mai_30_1609,98.8117617499,Stroop,B-2,1STACs-8,
congruent,down,"[-0.7725490196, 0.0745098039, -1]", ,4,GRÜN,54,0,54,0,0,0,0,0,,,,,down,1,0.52657195258,2017_Mai_30_1609,98.8117617499,Stroop,B-2,1STACs-8,
,,,,,,54,0,54,0,,,,,,,,,,,,2017_Mai_30_1609,98.8117617499,Stroop,B-2,1STACs-8,
incongruent,down,"[-0.7725490196, 0.0745098039, -1]", ,1,ROT,55,0,55,0,0,0,0,0,,,,,down,1,0.516001335365,2017_Mai_30_1609,98.8117617499,Stroop,B-2,1STACs-8,
,,,,,,55,0,55,0,,,,,,,,,,,,2017_Mai_30_1609,98.8117617499,Stroop,B-2,1STACs-8,
neutralofneutral,right,"[-0.8745098039, -0.2078431373, 0.637254902]", ,17,HALS,56,0,56,0,0,0,0,0,,,,,right,1,0.694441332627,2017_Mai_30_1609,98.8117617499,Stroop,B-2,1STACs-8,
,,,,,,56,0,56,0,,,,,,,,,,,,2017_Mai_30_1609,98.8117617499,Stroop,B-2,1STACs-8,
neutral,right,"[-0.8745098039, -0.2078431373, 0.637254902]", ,14,SOLL,57,0,57,0,0,0,0,0,,,,,right,1,0.438539814417,2017_Mai_30_1609,98.8117617499,Stroop,B-2,1STACs-8,
,,,,,,57,0,57,0,,,,,,,,,,,,2017_Mai_30_1609,98.8117617499,Stroop,B-2,1STACs-8,
congruent,right,"[-0.8745098039, -0.2078431373, 0.637254902]", ,8,BLAU,58,0,58,0,0,0,0,0,,,,,right,1,0.439649452654,2017_Mai_30_1609,98.8117617499,Stroop,B-2,1STACs-8,
,,,,,,58,0,58,0,,,,,,,,,,,,2017_Mai_30_1609,98.8117617499,Stroop,B-2,1STACs-8,
incongruent,down,"[-0.7725490196, 0.0745098039, -1]", ,1,ROT,59,0,59,0,0,0,0,0,,,,,down,1,0.440935370278,2017_Mai_30_1609,98.8117617499,Stroop,B-2,1STACs-8,
,,,,,,59,0,59,0,,,,,,,,,,,,2017_Mai_30_1609,98.8117617499,Stroop,B-2,1STACs-8,
neutralofneutral,down,"[-0.7725490196, 0.0745098039, -1]", ,19,MODE,60,0,60,0,0,0,0,0,,,,,down,1,0.428626543318,2017_Mai_30_1609,98.8117617499,Stroop,B-2,1STACs-8,
,,,,,,60,0,60,0,,,,,,,,,,,,2017_Mai_30_1609,98.8117617499,Stroop,B-2,1STACs-8,
incongruent,left,"[0.568627451, -0.7882352941, -0.7882352941]", ,6,BLAU,61,0,61,0,0,0,0,0,,,,,left,1,0.505973803934,2017_Mai_30_1609,98.8117617499,Stroop,B-2,1STACs-8,
,,,,,,61,0,61,0,,,,,,,,,,,,2017_Mai_30_1609,98.8117617499,Stroop,B-2,1STACs-8,
neutralofneutral,left,"[0.568627451, -0.7882352941, -0.7882352941]", ,15,HALS,62,0,62,0,0,0,0,0,,,,,left,1,0.408663950306,2017_Mai_30_1609,98.8117617499,Stroop,B-2,1STACs-8,
,,,,,,62,0,62,0,,,,,,,,,,,,2017_Mai_30_1609,98.8117617499,Stroop,B-2,1STACs-8,
neutral,down,"[-0.7725490196, 0.0745098039, -1]", ,10,PECH,63,0,63,0,0,0,0,0,,,,,right,0,0.700767835018,2017_Mai_30_1609,98.8117617499,Stroop,B-2,1STACs-8,
,,,,,,63,0,63,0,,,,,,,,,,,,2017_Mai_30_1609,98.8117617499,Stroop,B-2,1STACs-8,
neutral,down,"[-0.7725490196, 0.0745098039, -1]", ,10,PECH,64,0,64,0,0,0,0,0,,,,,down,1,0.475944568374,2017_Mai_30_1609,98.8117617499,Stroop,B-2,1STACs-8,
,,,,,,64,0,64,0,,,,,,,,,,,,2017_Mai_30_1609,98.8117617499,Stroop,B-2,1STACs-8,
neutralofneutral,down,"[-0.7725490196, 0.0745098039, -1]", ,16,HALS,65,0,65,0,0,0,0,0,,,,,down,1,0.419470072313,2017_Mai_30_1609,98.8117617499,Stroop,B-2,1STACs-8,
,,,,,,65,0,65,0,,,,,,,,,,,,2017_Mai_30_1609,98.8117617499,Stroop,B-2,1STACs-8,
congruent,down,"[-0.7725490196, 0.0745098039, -1]", ,4,GRÜN,66,0,66,0,0,0,0,0,,,,,down,1,0.406640788146,2017_Mai_30_1609,98.8117617499,Stroop,B-2,1STACs-8,
,,,,,,66,0,66,0,,,,,,,,,,,,2017_Mai_30_1609,98.8117617499,Stroop,B-2,1STACs-8,
incongruent,left,"[0.568627451, -0.7882352941, -0.7882352941]", ,3,GRÜN,67,0,67,0,0,0,0,0,,,,,left,1,0.856154064273,2017_Mai_30_1609,98.8117617499,Stroop,B-2,1STACs-8,
,,,,,,67,0,67,0,,,,,,,,,,,,2017_Mai_30_1609,98.8117617499,Stroop,B-2,1STACs-8,
congruent,down,"[-0.7725490196, 0.0745098039, -1]", ,4,GRÜN,68,0,68,0,0,0,0,0,,,,,down,1,0.631985908823,2017_Mai_30_1609,98.8117617499,Stroop,B-2,1STACs-8,
,,,,,,68,0,68,0,,,,,,,,,,,,2017_Mai_30_1609,98.8117617499,Stroop,B-2,1STACs-8,
congruent,right,"[-0.8745098039, -0.2078431373, 0.637254902]", ,8,BLAU,69,0,69,0,0,0,0,0,,,,,right,1,1.01565897342,2017_Mai_30_1609,98.8117617499,Stroop,B-2,1STACs-8,
,,,,,,69,0,69,0,,,,,,,,,,,,2017_Mai_30_1609,98.8117617499,Stroop,B-2,1STACs-8,
fix,return,white, ,21,+,,,,,,,,,0,0,0,0,None,0,,2017_Mai_30_1609,98.8117617499,Stroop,B-2,1STACs-8,
fix,return,white, ,21,+,,,,,,,,,0,1,1,1,None,0,,2017_Mai_30_1609,98.8117617499,Stroop,B-2,1STACs-8,
fix,return,white, ,21,+,,,,,,,,,0,2,2,2,None,0,,2017_Mai_30_1609,98.8117617499,Stroop,B-2,1STACs-8,
fix,return,white, ,21,+,,,,,,,,,0,3,3,3,None,0,,2017_Mai_30_1609,98.8117617499,Stroop,B-2,1STACs-8,
fix,return,white, ,21,+,,,,,,,,,0,4,4,4,None,0,,2017_Mai_30_1609,98.8117617499,Stroop,B-2,1STACs-8,
fix,return,white, ,21,+,,,,,,,,,0,5,5,5,None,0,,2017_Mai_30_1609,98.8117617499,Stroop,B-2,1STACs-8,
fix,return,white, ,21,+,,,,,,,,,0,6,6,6,None,0,,2017_Mai_30_1609,98.8117617499,Stroop,B-2,1STACs-8,
fix,return,white, ,21,+,,,,,,,,,0,7,7,7,None,0,,2017_Mai_30_1609,98.8117617499,Stroop,B-2,1STACs-8,
fix,return,white, ,21,+,,,,,,,,,0,8,8,8,None,0,,2017_Mai_30_1609,98.8117617499,Stroop,B-2,1STACs-8,
fix,return,white, ,21,+,,,,,,,,,0,9,9,9,None,0,,2017_Mai_30_1609,98.8117617499,Stroop,B-2,1STACs-8,
fix,return,white, ,21,+,,,,,,,,,0,10,10,10,None,0,,2017_Mai_30_1609,98.8117617499,Stroop,B-2,1STACs-8,
fix,return,white, ,21,+,,,,,,,,,0,11,11,11,None,0,,2017_Mai_30_1609,98.8117617499,Stroop,B-2,1STACs-8,
fix,return,white,+,22,+,,,,,,,,,0,12,12,12,None,0,,2017_Mai_30_1609,98.8117617499,Stroop,B-2,1STACs-8,
incongruent,down,"[-0.7725490196, 0.0745098039, -1]", ,7,BLAU,,,,,,,,,0,13,13,13,down,1,0.632852778775,2017_Mai_30_1609,98.8117617499,Stroop,B-2,1STACs-8,
incongruent,down,"[-0.7725490196, 0.0745098039, -1]", ,1,ROT,,,,,,,,,0,14,14,14,down,1,0.504051771943,2017_Mai_30_1609,98.8117617499,Stroop,B-2,1STACs-8,
neutral,left,"[0.568627451, -0.7882352941, -0.7882352941]", ,12,SOLL,,,,,,,,,0,15,15,15,left,1,0.608537397909,2017_Mai_30_1609,98.8117617499,Stroop,B-2,1STACs-8,
incongruent,left,"[0.568627451, -0.7882352941, -0.7882352941]", ,3,GRÜN,,,,,,,,,0,16,16,16,left,1,0.502118006618,2017_Mai_30_1609,98.8117617499,Stroop,B-2,1STACs-8,
incongruent,right,"[-0.8745098039, -0.2078431373, 0.637254902]", ,2,ROT,,,,,,,,,0,17,17,17,right,1,0.592813891151,2017_Mai_30_1609,98.8117617499,Stroop,B-2,1STACs-8,
neutral,left,"[0.568627451, -0.7882352941, -0.7882352941]", ,9,PECH,,,,,,,,,0,18,18,18,left,1,0.635828855344,2017_Mai_30_1609,98.8117617499,Stroop,B-2,1STACs-8,
incongruent,left,"[0.568627451, -0.7882352941, -0.7882352941]", ,6,BLAU,,,,,,,,,0,19,19,19,left,1,0.589837255851,2017_Mai_30_1609,98.8117617499,Stroop,B-2,1STACs-8,
neutral,down,"[-0.7725490196, 0.0745098039, -1]", ,10,PECH,,,,,,,,,0,20,20,20,down,1,0.700612787379,2017_Mai_30_1609,98.8117617499,Stroop,B-2,1STACs-8,
neutral,down,"[-0.7725490196, 0.0745098039, -1]", ,13,SOLL,,,,,,,,,0,21,21,21,down,1,0.407649575574,2017_Mai_30_1609,98.8117617499,Stroop,B-2,1STACs-8,
incongruent,right,"[-0.8745098039, -0.2078431373, 0.637254902]", ,5,GRÜN,,,,,,,,,0,22,22,22,right,1,0.718647761098,2017_Mai_30_1609,98.8117617499,Stroop,B-2,1STACs-8,
neutral,right,"[-0.8745098039, -0.2078431373, 0.637254902]", ,14,SOLL,,,,,,,,,0,23,23,23,right,1,0.472145482177,2017_Mai_30_1609,98.8117617499,Stroop,B-2,1STACs-8,
neutral,right,"[-0.8745098039, -0.2078431373, 0.637254902]", ,11,PECH,,,,,,,,,0,24,24,24,right,1,0.429234441808,2017_Mai_30_1609,98.8117617499,Stroop,B-2,1STACs-8,
neutral,down,"[-0.7725490196, 0.0745098039, -1]", ,10,PECH,,,,,,,,,0,25,25,25,down,1,0.461503347493,2017_Mai_30_1609,98.8117617499,Stroop,B-2,1STACs-8,
congruent,left,"[0.568627451, -0.7882352941, -0.7882352941]", ,0,ROT,,,,,,,,,0,26,26,26,left,1,0.514694465359,2017_Mai_30_1609,98.8117617499,Stroop,B-2,1STACs-8,
congruent,right,"[-0.8745098039, -0.2078431373, 0.637254902]", ,8,BLAU,,,,,,,,,0,27,27,27,right,1,1.01330169058,2017_Mai_30_1609,98.8117617499,Stroop,B-2,1STACs-8,
neutral,right,"[-0.8745098039, -0.2078431373, 0.637254902]", ,11,PECH,,,,,,,,,0,28,28,28,right,1,0.547070926612,2017_Mai_30_1609,98.8117617499,Stroop,B-2,1STACs-8,
congruent,right,"[-0.8745098039, -0.2078431373, 0.637254902]", ,8,BLAU,,,,,,,,,0,29,29,29,right,1,0.472253037748,2017_Mai_30_1609,98.8117617499,Stroop,B-2,1STACs-8,
neutral,left,"[0.568627451, -0.7882352941, -0.7882352941]", ,9,PECH,,,,,,,,,0,30,30,30,left,1,0.636316068103,2017_Mai_30_1609,98.8117617499,Stroop,B-2,1STACs-8,
congruent,down,"[-0.7725490196, 0.0745098039, -1]", ,4,GRÜN,,,,,,,,,0,31,31,31,down,1,0.44229224664,2017_Mai_30_1609,98.8117617499,Stroop,B-2,1STACs-8,
neutral,left,"[0.568627451, -0.7882352941, -0.7882352941]", ,12,SOLL,,,,,,,,,0,32,32,32,left,1,0.485265306066,2017_Mai_30_1609,98.8117617499,Stroop,B-2,1STACs-8,
congruent,left,"[0.568627451, -0.7882352941, -0.7882352941]", ,0,ROT,,,,,,,,,0,33,33,33,left,1,0.678763641748,2017_Mai_30_1609,98.8117617499,Stroop,B-2,1STACs-8,
congruent,down,"[-0.7725490196, 0.0745098039, -1]", ,4,GRÜN,,,,,,,,,0,34,34,34,down,1,0.472195767898,2017_Mai_30_1609,98.8117617499,Stroop,B-2,1STACs-8,
neutral,down,"[-0.7725490196, 0.0745098039, -1]", ,13,SOLL,,,,,,,,,0,35,35,35,down,1,0.418114034046,2017_Mai_30_1609,98.8117617499,Stroop,B-2,1STACs-8,
neutral,right,"[-0.8745098039, -0.2078431373, 0.637254902]", ,14,SOLL,,,,,,,,,0,36,36,36,right,1,0.718677094435,2017_Mai_30_1609,98.8117617499,Stroop,B-2,1STACs-8,
neutralofneutral,left,"[0.568627451, -0.7882352941, -0.7882352941]", ,18,MODE,,,,,,,,,0,37,37,37,left,1,0.966877075158,2017_Mai_30_1609,98.8117617499,Stroop,B-2,1STACs-8,
neutralofneutral,left,"[0.568627451, -0.7882352941, -0.7882352941]", ,15,HALS,,,,,,,,,0,38,38,38,left,1,0.427392587606,2017_Mai_30_1609,98.8117617499,Stroop,B-2,1STACs-8,
neutral,left,"[0.568627451, -0.7882352941, -0.7882352941]", ,12,SOLL,,,,,,,,,0,39,39,39,left,1,0.384317001184,2017_Mai_30_1609,98.8117617499,Stroop,B-2,1STACs-8,
neutralofneutral,right,"[-0.8745098039, -0.2078431373, 0.637254902]", ,17,HALS,,,,,,,,,0,40,40,40,right,1,0.694494691365,2017_Mai_30_1609,98.8117617499,Stroop,B-2,1STACs-8,
neutralofneutral,right,"[-0.8745098039, -0.2078431373, 0.637254902]", ,20,MODE,,,,,,,,,0,41,41,41,right,1,0.531489896062,2017_Mai_30_1609,98.8117617499,Stroop,B-2,1STACs-8,
neutral,right,"[-0.8745098039, -0.2078431373, 0.637254902]", ,14,SOLL,,,,,,,,,0,42,42,42,right,1,0.429280537051,2017_Mai_30_1609,98.8117617499,Stroop,B-2,1STACs-8,
neutral,down,"[-0.7725490196, 0.0745098039, -1]", ,13,SOLL,,,,,,,,,0,43,43,43,down,1,0.397413358402,2017_Mai_30_1609,98.8117617499,Stroop,B-2,1STACs-8,
neutral,left,"[0.568627451, -0.7882352941, -0.7882352941]", ,9,PECH,,,,,,,,,0,44,44,44,left,1,0.442057300579,2017_Mai_30_1609,98.8117617499,Stroop,B-2,1STACs-8,
neutralofneutral,down,"[-0.7725490196, 0.0745098039, -1]", ,16,HALS,,,,,,,,,0,45,45,45,down,1,0.590093154298,2017_Mai_30_1609,98.8117617499,Stroop,B-2,1STACs-8,
neutral,down,"[-0.7725490196, 0.0745098039, -1]", ,10,PECH,,,,,,,,,0,46,46,46,down,1,0.474270333241,2017_Mai_30_1609,98.8117617499,Stroop,B-2,1STACs-8,
neutral,right,"[-0.8745098039, -0.2078431373, 0.637254902]", ,11,PECH,,,,,,,,,0,47,47,47,left,0,0.539022697019,2017_Mai_30_1609,98.8117617499,Stroop,B-2,1STACs-8,
neutralofneutral,down,"[-0.7725490196, 0.0745098039, -1]", ,19,MODE,,,,,,,,,0,48,48,48,down,1,0.544446291358,2017_Mai_30_1609,98.8117617499,Stroop,B-2,1STACs-8,
fix,return,white, ,21,+,,,,,,,,,0,49,49,49,None,0,,2017_Mai_30_1609,98.8117617499,Stroop,B-2,1STACs-8,
fix,return,white, ,21,+,,,,,,,,,0,50,50,50,None,0,,2017_Mai_30_1609,98.8117617499,Stroop,B-2,1STACs-8,
fix,return,white, ,21,+,,,,,,,,,0,51,51,51,None,0,,2017_Mai_30_1609,98.8117617499,Stroop,B-2,1STACs-8,
fix,return,white, ,21,+,,,,,,,,,0,52,52,52,None,0,,2017_Mai_30_1609,98.8117617499,Stroop,B-2,1STACs-8,
fix,return,white, ,21,+,,,,,,,,,0,53,53,53,None,0,,2017_Mai_30_1609,98.8117617499,Stroop,B-2,1STACs-8,
fix,return,white, ,21,+,,,,,,,,,0,54,54,54,None,0,,2017_Mai_30_1609,98.8117617499,Stroop,B-2,1STACs-8,
fix,return,white, ,21,+,,,,,,,,,0,55,55,55,None,0,,2017_Mai_30_1609,98.8117617499,Stroop,B-2,1STACs-8,
fix,return,white, ,21,+,,,,,,,,,0,56,56,56,None,0,,2017_Mai_30_1609,98.8117617499,Stroop,B-2,1STACs-8,
fix,return,white, ,21,+,,,,,,,,,0,57,57,57,None,0,,2017_Mai_30_1609,98.8117617499,Stroop,B-2,1STACs-8,
fix,return,white, ,21,+,,,,,,,,,0,58,58,58,None,0,,2017_Mai_30_1609,98.8117617499,Stroop,B-2,1STACs-8,
fix,return,white, ,21,+,,,,,,,,,0,59,59,59,None,0,,2017_Mai_30_1609,98.8117617499,Stroop,B-2,1STACs-8,
fix,return,white, ,21,+,,,,,,,,,0,60,60,60,None,0,,2017_Mai_30_1609,98.8117617499,Stroop,B-2,1STACs-8,
fix,return,white,+,22,+,,,,,,,,,0,61,61,61,None,0,,2017_Mai_30_1609,98.8117617499,Stroop,B-2,1STACs-8,
neutralofneutral,down,"[-0.7725490196, 0.0745098039, -1]", ,16,HALS,,,,,,,,,0,62,62,62,down,1,0.439867916175,2017_Mai_30_1609,98.8117617499,Stroop,B-2,1STACs-8,
neutral,left,"[0.568627451, -0.7882352941, -0.7882352941]", ,12,SOLL,,,,,,,,,0,63,63,63,left,1,0.600380495287,2017_Mai_30_1609,98.8117617499,Stroop,B-2,1STACs-8,
neutralofneutral,left,"[0.568627451, -0.7882352941, -0.7882352941]", ,15,HALS,,,,,,,,,0,64,64,64,left,1,0.406784381814,2017_Mai_30_1609,98.8117617499,Stroop,B-2,1STACs-8,
neutral,down,"[-0.7725490196, 0.0745098039, -1]", ,13,SOLL,,,,,,,,,0,65,65,65,down,1,0.480748530888,2017_Mai_30_1609,98.8117617499,Stroop,B-2,1STACs-8,
neutral,right,"[-0.8745098039, -0.2078431373, 0.637254902]", ,11,PECH,,,,,,,,,0,66,66,66,right,1,0.718810910326,2017_Mai_30_1609,98.8117617499,Stroop,B-2,1STACs-8,
neutralofneutral,left,"[0.568627451, -0.7882352941, -0.7882352941]", ,18,MODE,,,,,,,,,0,67,67,67,left,1,0.605660495958,2017_Mai_30_1609,98.8117617499,Stroop,B-2,1STACs-8,
neutral,right,"[-0.8745098039, -0.2078431373, 0.637254902]", ,14,SOLL,,,,,,,,,0,68,68,68,right,1,0.693870030967,2017_Mai_30_1609,98.8117617499,Stroop,B-2,1STACs-8,
neutral,left,"[0.568627451, -0.7882352941, -0.7882352941]", ,9,PECH,,,,,,,,,0,69,69,69,left,1,0.625229742885,2017_Mai_30_1609,98.8117617499,Stroop,B-2,1STACs-8,
neutralofneutral,right,"[-0.8745098039, -0.2078431373, 0.637254902]", ,17,HALS,,,,,,,,,0,70,70,70,right,1,0.783563274104,2017_Mai_30_1609,98.8117617499,Stroop,B-2,1STACs-8,
neutralofneutral,right,"[-0.8745098039, -0.2078431373, 0.637254902]", ,20,MODE,,,,,,,,,0,71,71,71,right,1,0.501949549454,2017_Mai_30_1609,98.8117617499,Stroop,B-2,1STACs-8,
neutralofneutral,down,"[-0.7725490196, 0.0745098039, -1]", ,19,MODE,,,,,,,,,0,72,72,72,down,1,0.395124520017,2017_Mai_30_1609,98.8117617499,Stroop,B-2,1STACs-8,
neutral,down,"[-0.7725490196, 0.0745098039, -1]", ,10,PECH,,,,,,,,,0,73,73,73,down,1,0.366629278302,2017_Mai_30_1609,98.8117617499,Stroop,B-2,1STACs-8,
neutral,left,"[0.568627451, -0.7882352941, -0.7882352941]", ,12,SOLL,,,,,,,,,0,74,74,74,left,1,0.397161650433,2017_Mai_30_1609,98.8117617499,Stroop,B-2,1STACs-8,
incongruent,down,"[-0.7725490196, 0.0745098039, -1]", ,1,ROT,,,,,,,,,0,75,75,75,down,1,0.840756297239,2017_Mai_30_1609,98.8117617499,Stroop,B-2,1STACs-8,
neutral,right,"[-0.8745098039, -0.2078431373, 0.637254902]", ,11,PECH,,,,,,,,,0,76,76,76,right,1,0.73300489308,2017_Mai_30_1609,98.8117617499,Stroop,B-2,1STACs-8,
incongruent,right,"[-0.8745098039, -0.2078431373, 0.637254902]", ,2,ROT,,,,,,,,,0,77,77,77,right,1,0.387362080935,2017_Mai_30_1609,98.8117617499,Stroop,B-2,1STACs-8,
incongruent,left,"[0.568627451, -0.7882352941, -0.7882352941]", ,3,GRÜN,,,,,,,,,0,78,78,78,left,1,1.04523926924,2017_Mai_30_1609,98.8117617499,Stroop,B-2,1STACs-8,
neutral,right,"[-0.8745098039, -0.2078431373, 0.637254902]", ,14,SOLL,,,,,,,,,0,79,79,79,right,1,0.842555967307,2017_Mai_30_1609,98.8117617499,Stroop,B-2,1STACs-8,
neutral,down,"[-0.7725490196, 0.0745098039, -1]", ,10,PECH,,,,,,,,,0,80,80,80,down,1,0.536347496678,2017_Mai_30_1609,98.8117617499,Stroop,B-2,1STACs-8,
incongruent,right,"[-0.8745098039, -0.2078431373, 0.637254902]", ,5,GRÜN,,,,,,,,,0,81,81,81,left,0,0.587157585671,2017_Mai_30_1609,98.8117617499,Stroop,B-2,1STACs-8,
incongruent,down,"[-0.7725490196, 0.0745098039, -1]", ,7,BLAU,,,,,,,,,0,82,82,82,left,0,0.918099646744,2017_Mai_30_1609,98.8117617499,Stroop,B-2,1STACs-8,
incongruent,left,"[0.568627451, -0.7882352941, -0.7882352941]", ,6,BLAU,,,,,,,,,0,83,83,83,right,0,1.08739155396,2017_Mai_30_1609,98.8117617499,Stroop,B-2,1STACs-8,
neutral,down,"[-0.7725490196, 0.0745098039, -1]", ,13,SOLL,,,,,,,,,0,84,84,84,down,1,0.865223093995,2017_Mai_30_1609,98.8117617499,Stroop,B-2,1STACs-8,
neutral,left,"[0.568627451, -0.7882352941, -0.7882352941]", ,9,PECH,,,,,,,,,0,85,85,85,left,1,0.643817580167,2017_Mai_30_1609,98.8117617499,Stroop,B-2,1STACs-8,
congruent,right,"[-0.8745098039, -0.2078431373, 0.637254902]", ,8,BLAU,,,,,,,,,0,86,86,86,right,1,1.05586771503,2017_Mai_30_1609,98.8117617499,Stroop,B-2,1STACs-8,
neutral,left,"[0.568627451, -0.7882352941, -0.7882352941]", ,12,SOLL,,,,,,,,,0,87,87,87,left,1,0.704841257759,2017_Mai_30_1609,98.8117617499,Stroop,B-2,1STACs-8,
congruent,down,"[-0.7725490196, 0.0745098039, -1]", ,4,GRÜN,,,,,,,,,0,88,88,88,down,1,0.39530834226,2017_Mai_30_1609,98.8117617499,Stroop,B-2,1STACs-8,
neutral,down,"[-0.7725490196, 0.0745098039, -1]", ,13,SOLL,,,,,,,,,0,89,89,89,down,1,0.374025749083,2017_Mai_30_1609,98.8117617499,Stroop,B-2,1STACs-8,
congruent,down,"[-0.7725490196, 0.0745098039, -1]", ,4,GRÜN,,,,,,,,,0,90,90,90,down,1,0.416760510065,2017_Mai_30_1609,98.8117617499,Stroop,B-2,1STACs-8,
neutral,right,"[-0.8745098039, -0.2078431373, 0.637254902]", ,11,PECH,,,,,,,,,0,91,91,91,left,0,0.46131309985,2017_Mai_30_1609,98.8117617499,Stroop,B-2,1STACs-8,
congruent,left,"[0.568627451, -0.7882352941, -0.7882352941]", ,0,ROT,,,,,,,,,0,92,92,92,left,1,0.525663177863,2017_Mai_30_1609,98.8117617499,Stroop,B-2,1STACs-8,
congruent,left,"[0.568627451, -0.7882352941, -0.7882352941]", ,0,ROT,,,,,,,,,0,93,93,93,left,1,0.439782709813,2017_Mai_30_1609,98.8117617499,Stroop,B-2,1STACs-8,
neutral,right,"[-0.8745098039, -0.2078431373, 0.637254902]", ,14,SOLL,,,,,,,,,0,94,94,94,right,1,0.70465073075,2017_Mai_30_1609,98.8117617499,Stroop,B-2,1STACs-8,
congruent,right,"[-0.8745098039, -0.2078431373, 0.637254902]", ,8,BLAU,,,,,,,,,0,95,95,95,right,1,0.406058311881,2017_Mai_30_1609,98.8117617499,Stroop,B-2,1STACs-8,
neutral,down,"[-0.7725490196, 0.0745098039, -1]", ,10,PECH,,,,,,,,,0,96,96,96,left,0,0.397306920293,2017_Mai_30_1609,98.8117617499,Stroop,B-2,1STACs-8,
neutral,left,"[0.568627451, -0.7882352941, -0.7882352941]", ,9,PECH,,,,,,,,,0,97,97,97,down,0,0.52888174335,2017_Mai_30_1609,98.8117617499,Stroop,B-2,1STACs-8,
fix,return,white, ,21,+,,,,,,,,,0,98,98,98,None,0,,2017_Mai_30_1609,98.8117617499,Stroop,B-2,1STACs-8,
fix,return,white, ,21,+,,,,,,,,,0,99,99,99,None,0,,2017_Mai_30_1609,98.8117617499,Stroop,B-2,1STACs-8,
fix,return,white, ,21,+,,,,,,,,,0,100,100,100,None,0,,2017_Mai_30_1609,98.8117617499,Stroop,B-2,1STACs-8,
fix,return,white, ,21,+,,,,,,,,,0,101,101,101,None,0,,2017_Mai_30_1609,98.8117617499,Stroop,B-2,1STACs-8,
fix,return,white, ,21,+,,,,,,,,,0,102,102,102,None,0,,2017_Mai_30_1609,98.8117617499,Stroop,B-2,1STACs-8,
fix,return,white, ,21,+,,,,,,,,,0,103,103,103,None,0,,2017_Mai_30_1609,98.8117617499,Stroop,B-2,1STACs-8,
fix,return,white, ,21,+,,,,,,,,,0,104,104,104,None,0,,2017_Mai_30_1609,98.8117617499,Stroop,B-2,1STACs-8,
fix,return,white, ,21,+,,,,,,,,,0,105,105,105,None,0,,2017_Mai_30_1609,98.8117617499,Stroop,B-2,1STACs-8,
fix,return,white, ,21,+,,,,,,,,,0,106,106,106,None,0,,2017_Mai_30_1609,98.8117617499,Stroop,B-2,1STACs-8,
fix,return,white, ,21,+,,,,,,,,,0,107,107,107,None,0,,2017_Mai_30_1609,98.8117617499,Stroop,B-2,1STACs-8,
fix,return,white, ,21,+,,,,,,,,,0,108,108,108,None,0,,2017_Mai_30_1609,98.8117617499,Stroop,B-2,1STACs-8,
fix,return,white, ,21,+,,,,,,,,,0,109,109,109,None,0,,2017_Mai_30_1609,98.8117617499,Stroop,B-2,1STACs-8,
fix,return,white,+,22,+,,,,,,,,,0,110,110,110,None,0,,2017_Mai_30_1609,98.8117617499,Stroop,B-2,1STACs-8,
neutral,right,"[-0.8745098039, -0.2078431373, 0.637254902]", ,14,SOLL,,,,,,,,,0,111,111,111,right,1,0.672906752116,2017_Mai_30_1609,98.8117617499,Stroop,B-2,1STACs-8,
neutralofneutral,left,"[0.568627451, -0.7882352941, -0.7882352941]", ,18,MODE,,,,,,,,,0,112,112,112,down,0,0.490759859145,2017_Mai_30_1609,98.8117617499,Stroop,B-2,1STACs-8,
neutralofneutral,right,"[-0.8745098039, -0.2078431373, 0.637254902]", ,17,HALS,,,,,,,,,0,113,113,113,down,0,0.708281359783,2017_Mai_30_1609,98.8117617499,Stroop,B-2,1STACs-8,
neutral,down,"[-0.7725490196, 0.0745098039, -1]", ,10,PECH,,,,,,,,,0,114,114,114,down,1,0.420143621606,2017_Mai_30_1609,98.8117617499,Stroop,B-2,1STACs-8,
neutral,left,"[0.568627451, -0.7882352941, -0.7882352941]", ,12,SOLL,,,,,,,,,0,115,115,115,left,1,0.665227563839,2017_Mai_30_1609,98.8117617499,Stroop,B-2,1STACs-8,
neutral,down,"[-0.7725490196, 0.0745098039, -1]", ,13,SOLL,,,,,,,,,0,116,116,116,right,0,0.613416789005,2017_Mai_30_1609,98.8117617499,Stroop,B-2,1STACs-8,
neutralofneutral,down,"[-0.7725490196, 0.0745098039, -1]", ,19,MODE,,,,,,,,,0,117,117,117,down,1,0.747676310817,2017_Mai_30_1609,98.8117617499,Stroop,B-2,1STACs-8,
neutralofneutral,left,"[0.568627451, -0.7882352941, -0.7882352941]", ,15,HALS,,,,,,,,,0,118,118,118,left,1,0.525837781059,2017_Mai_30_1609,98.8117617499,Stroop,B-2,1STACs-8,
neutral,left,"[0.568627451, -0.7882352941, -0.7882352941]", ,9,PECH,,,,,,,,,0,119,119,119,left,1,0.571551132896,2017_Mai_30_1609,98.8117617499,Stroop,B-2,1STACs-8,
neutralofneutral,right,"[-0.8745098039, -0.2078431373, 0.637254902]", ,20,MODE,,,,,,,,,0,120,120,120,right,1,0.67268800923,2017_Mai_30_1609,98.8117617499,Stroop,B-2,1STACs-8,
neutral,right,"[-0.8745098039, -0.2078431373, 0.637254902]", ,11,PECH,,,,,,,,,0,121,121,121,down,0,0.743587243631,2017_Mai_30_1609,98.8117617499,Stroop,B-2,1STACs-8,
neutralofneutral,down,"[-0.7725490196, 0.0745098039, -1]", ,16,HALS,,,,,,,,,0,122,122,122,down,1,0.578729978251,2017_Mai_30_1609,98.8117617499,Stroop,B-2,1STACs-8,
congruent,right,"[-0.8745098039, -0.2078431373, 0.637254902]", ,8,BLAU,,,,,,,,,0,123,123,123,right,1,0.619523710417,2017_Mai_30_1609,98.8117617499,Stroop,B-2,1STACs-8,
neutral,down,"[-0.7725490196, 0.0745098039, -1]", ,10,PECH,,,,,,,,,0,124,124,124,left,0,0.504138095763,2017_Mai_30_1609,98.8117617499,Stroop,B-2,1STACs-8,
congruent,down,"[-0.7725490196, 0.0745098039, -1]", ,4,GRÜN,,,,,,,,,0,125,125,125,down,1,0.395518983558,2017_Mai_30_1609,98.8117617499,Stroop,B-2,1STACs-8,
congruent,right,"[-0.8745098039, -0.2078431373, 0.637254902]", ,8,BLAU,,,,,,,,,0,126,126,126,right,1,0.880844353122,2017_Mai_30_1609,98.8117617499,Stroop,B-2,1STACs-8,
neutral,down,"[-0.7725490196, 0.0745098039, -1]", ,13,SOLL,,,,,,,,,0,127,127,127,down,1,0.579820899024,2017_Mai_30_1609,98.8117617499,Stroop,B-2,1STACs-8,
congruent,left,"[0.568627451, -0.7882352941, -0.7882352941]", ,0,ROT,,,,,,,,,0,128,128,128,left,1,0.53774851273,2017_Mai_30_1609,98.8117617499,Stroop,B-2,1STACs-8,
neutral,right,"[-0.8745098039, -0.2078431373, 0.637254902]", ,14,SOLL,,,,,,,,,0,129,129,129,right,1,0.793885815096,2017_Mai_30_1609,98.8117617499,Stroop,B-2,1STACs-8,
neutral,right,"[-0.8745098039, -0.2078431373, 0.637254902]", ,11,PECH,,,,,,,,,0,130,130,130,right,1,0.635993960126,2017_Mai_30_1609,98.8117617499,Stroop,B-2,1STACs-8,
congruent,down,"[-0.7725490196, 0.0745098039, -1]", ,4,GRÜN,,,,,,,,,0,131,131,131,down,1,0.515215201933,2017_Mai_30_1609,98.8117617499,Stroop,B-2,1STACs-8,
congruent,left,"[0.568627451, -0.7882352941, -0.7882352941]", ,0,ROT,,,,,,,,,0,132,132,132,left,1,0.517148687892,2017_Mai_30_1609,98.8117617499,Stroop,B-2,1STACs-8,
neutral,left,"[0.568627451, -0.7882352941, -0.7882352941]", ,9,PECH,,,,,,,,,0,133,133,133,left,1,0.517554046673,2017_Mai_30_1609,98.8117617499,Stroop,B-2,1STACs-8,
neutral,left,"[0.568627451, -0.7882352941, -0.7882352941]", ,12,SOLL,,,,,,,,,0,134,134,134,left,1,0.515016014604,2017_Mai_30_1609,98.8117617499,Stroop,B-2,1STACs-8,
incongruent,down,"[-0.7725490196, 0.0745098039, -1]", ,7,BLAU,,,,,,,,,0,135,135,135,down,1,0.493712469042,2017_Mai_30_1609,98.8117617499,Stroop,B-2,1STACs-8,
incongruent,left,"[0.568627451, -0.7882352941, -0.7882352941]", ,3,GRÜN,,,,,,,,,0,136,136,136,left,1,0.609021817017,2017_Mai_30_1609,98.8117617499,Stroop,B-2,1STACs-8,
incongruent,right,"[-0.8745098039, -0.2078431373, 0.637254902]", ,5,GRÜN,,,,,,,,,0,137,137,137,down,0,0.736869350712,2017_Mai_30_1609,98.8117617499,Stroop,B-2,1STACs-8,
neutral,right,"[-0.8745098039, -0.2078431373, 0.637254902]", ,11,PECH,,,,,,,,,0,138,138,138,right,1,1.04008246858,2017_Mai_30_1609,98.8117617499,Stroop,B-2,1STACs-8,
neutral,down,"[-0.7725490196, 0.0745098039, -1]", ,13,SOLL,,,,,,,,,0,139,139,139,right,0,0.91842454837,2017_Mai_30_1609,98.8117617499,Stroop,B-2,1STACs-8,
neutral,left,"[0.568627451, -0.7882352941, -0.7882352941]", ,9,PECH,,,,,,,,,0,140,140,140,left,1,0.852073098677,2017_Mai_30_1609,98.8117617499,Stroop,B-2,1STACs-8,
incongruent,left,"[0.568627451, -0.7882352941, -0.7882352941]", ,6,BLAU,,,,,,,,,0,141,141,141,right,0,1.05097686997,2017_Mai_30_1609,98.8117617499,Stroop,B-2,1STACs-8,
incongruent,down,"[-0.7725490196, 0.0745098039, -1]", ,1,ROT,,,,,,,,,0,142,142,142,left,0,1.39392213256,2017_Mai_30_1609,98.8117617499,Stroop,B-2,1STACs-8,
incongruent,right,"[-0.8745098039, -0.2078431373, 0.637254902]", ,2,ROT,,,,,,,,,0,143,143,143,None,0,,2017_Mai_30_1609,98.8117617499,Stroop,B-2,1STACs-8,
neutral,down,"[-0.7725490196, 0.0745098039, -1]", ,10,PECH,,,,,,,,,0,144,144,144,left,0,0.786726245933,2017_Mai_30_1609,98.8117617499,Stroop,B-2,1STACs-8,
neutral,left,"[0.568627451, -0.7882352941, -0.7882352941]", ,12,SOLL,,,,,,,,,0,145,145,145,left,1,0.719199786565,2017_Mai_30_1609,98.8117617499,Stroop,B-2,1STACs-8,
neutral,right,"[-0.8745098039, -0.2078431373, 0.637254902]", ,14,SOLL,,,,,,,,,0,146,146,146,right,1,0.740203852725,2017_Mai_30_1609,98.8117617499,Stroop,B-2,1STACs-8,
fix,return,white, ,21,+,,,,,,,,,0,147,147,147,None,0,,2017_Mai_30_1609,98.8117617499,Stroop,B-2,1STACs-8,
fix,return,white, ,21,+,,,,,,,,,0,148,148,148,None,0,,2017_Mai_30_1609,98.8117617499,Stroop,B-2,1STACs-8,
fix,return,white, ,21,+,,,,,,,,,0,149,149,149,None,0,,2017_Mai_30_1609,98.8117617499,Stroop,B-2,1STACs-8,
fix,return,white, ,21,+,,,,,,,,,0,150,150,150,None,0,,2017_Mai_30_1609,98.8117617499,Stroop,B-2,1STACs-8,
fix,return,white, ,21,+,,,,,,,,,0,151,151,151,None,0,,2017_Mai_30_1609,98.8117617499,Stroop,B-2,1STACs-8,
fix,return,white, ,21,+,,,,,,,,,0,152,152,152,None,0,,2017_Mai_30_1609,98.8117617499,Stroop,B-2,1STACs-8,
fix,return,white, ,21,+,,,,,,,,,0,153,153,153,None,0,,2017_Mai_30_1609,98.8117617499,Stroop,B-2,1STACs-8,
fix,return,white, ,21,+,,,,,,,,,0,154,154,154,None,0,,2017_Mai_30_1609,98.8117617499,Stroop,B-2,1STACs-8,
fix,return,white, ,21,+,,,,,,,,,0,155,155,155,left,0,0.860228045742,2017_Mai_30_1609,98.8117617499,Stroop,B-2,1STACs-8,
fix,return,white, ,21,+,,,,,,,,,0,156,156,156,None,0,,2017_Mai_30_1609,98.8117617499,Stroop,B-2,1STACs-8,
fix,return,white, ,21,+,,,,,,,,,0,157,157,157,None,0,,2017_Mai_30_1609,98.8117617499,Stroop,B-2,1STACs-8,
fix,return,white, ,21,+,,,,,,,,,0,158,158,158,None,0,,2017_Mai_30_1609,98.8117617499,Stroop,B-2,1STACs-8,
fix,return,white,+,22,+,,,,,,,,,0,159,159,159,None,0,,2017_Mai_30_1609,98.8117617499,Stroop,B-2,1STACs-8,
congruent,left,"[0.568627451, -0.7882352941, -0.7882352941]", ,0,ROT,,,,,,,,,0,160,160,160,left,1,0.504459365646,2017_Mai_30_1609,98.8117617499,Stroop,B-2,1STACs-8,
neutral,down,"[-0.7725490196, 0.0745098039, -1]", ,10,PECH,,,,,,,,,0,161,161,161,down,1,0.408353855029,2017_Mai_30_1609,98.8117617499,Stroop,B-2,1STACs-8,
neutral,down,"[-0.7725490196, 0.0745098039, -1]", ,13,SOLL,,,,,,,,,0,162,162,162,down,1,0.416621386237,2017_Mai_30_1609,98.8117617499,Stroop,B-2,1STACs-8,
neutral,right,"[-0.8745098039, -0.2078431373, 0.637254902]", ,14,SOLL,,,,,,,,,0,163,163,163,right,1,0.608382629636,2017_Mai_30_1609,98.8117617499,Stroop,B-2,1STACs-8,
congruent,right,"[-0.8745098039, -0.2078431373, 0.637254902]", ,8,BLAU,,,,,,,,,0,164,164,164,right,1,0.469884300937,2017_Mai_30_1609,98.8117617499,Stroop,B-2,1STACs-8,
neutral,left,"[0.568627451, -0.7882352941, -0.7882352941]", ,9,PECH,,,,,,,,,0,165,165,165,left,1,0.493583122996,2017_Mai_30_1609,98.8117617499,Stroop,B-2,1STACs-8,
neutral,left,"[0.568627451, -0.7882352941, -0.7882352941]", ,12,SOLL,,,,,,,,,0,166,166,166,left,1,0.437859839729,2017_Mai_30_1609,98.8117617499,Stroop,B-2,1STACs-8,
congruent,down,"[-0.7725490196, 0.0745098039, -1]", ,4,GRÜN,,,,,,,,,0,167,167,167,down,1,0.416710503709,2017_Mai_30_1609,98.8117617499,Stroop,B-2,1STACs-8,
congruent,right,"[-0.8745098039, -0.2078431373, 0.637254902]", ,8,BLAU,,,,,,,,,0,168,168,168,right,1,0.629798200609,2017_Mai_30_1609,98.8117617499,Stroop,B-2,1STACs-8,
neutral,right,"[-0.8745098039, -0.2078431373, 0.637254902]", ,11,PECH,,,,,,,,,0,169,169,169,right,1,0.537859979411,2017_Mai_30_1609,98.8117617499,Stroop,B-2,1STACs-8,
congruent,left,"[0.568627451, -0.7882352941, -0.7882352941]", ,0,ROT,,,,,,,,,0,170,170,170,left,1,0.516133754429,2017_Mai_30_1609,98.8117617499,Stroop,B-2,1STACs-8,
congruent,down,"[-0.7725490196, 0.0745098039, -1]", ,4,GRÜN,,,,,,,,,0,171,171,171,down,1,0.493875618271,2017_Mai_30_1609,98.8117617499,Stroop,B-2,1STACs-8,
incongruent,down,"[-0.7725490196, 0.0745098039, -1]", ,1,ROT,,,,,,,,,0,172,172,172,down,1,0.657226826313,2017_Mai_30_1609,98.8117617499,Stroop,B-2,1STACs-8,
incongruent,left,"[0.568627451, -0.7882352941, -0.7882352941]", ,3,GRÜN,,,,,,,,,0,173,173,173,left,1,0.912030998354,2017_Mai_30_1609,98.8117617499,Stroop,B-2,1STACs-8,
neutral,left,"[0.568627451, -0.7882352941, -0.7882352941]", ,12,SOLL,,,,,,,,,0,174,174,174,left,1,0.439501947872,2017_Mai_30_1609,98.8117617499,Stroop,B-2,1STACs-8,
neutral,down,"[-0.7725490196, 0.0745098039, -1]", ,10,PECH,,,,,,,,,0,175,175,175,right,0,0.571413685258,2017_Mai_30_1609,98.8117617499,Stroop,B-2,1STACs-8,
incongruent,left,"[0.568627451, -0.7882352941, -0.7882352941]", ,6,BLAU,,,,,,,,,0,176,176,176,left,1,1.09098418933,2017_Mai_30_1609,98.8117617499,Stroop,B-2,1STACs-8,
incongruent,right,"[-0.8745098039, -0.2078431373, 0.637254902]", ,5,GRÜN,,,,,,,,,0,177,177,177,right,1,0.987152836464,2017_Mai_30_1609,98.8117617499,Stroop,B-2,1STACs-8,
incongruent,right,"[-0.8745098039, -0.2078431373, 0.637254902]", ,2,ROT,,,,,,,,,0,178,178,178,right,1,0.46316249691,2017_Mai_30_1609,98.8117617499,Stroop,B-2,1STACs-8,
neutral,down,"[-0.7725490196, 0.0745098039, -1]", ,13,SOLL,,,,,,,,,0,179,179,179,down,1,0.544486799301,2017_Mai_30_1609,98.8117617499,Stroop,B-2,1STACs-8,
incongruent,down,"[-0.7725490196, 0.0745098039, -1]", ,7,BLAU,,,,,,,,,0,180,180,180,down,1,0.608967340822,2017_Mai_30_1609,98.8117617499,Stroop,B-2,1STACs-8,
neutral,left,"[0.568627451, -0.7882352941, -0.7882352941]", ,9,PECH,,,,,,,,,0,181,181,181,left,1,0.707905054971,2017_Mai_30_1609,98.8117617499,Stroop,B-2,1STACs-8,
neutral,right,"[-0.8745098039, -0.2078431373, 0.637254902]", ,14,SOLL,,,,,,,,,0,182,182,182,right,1,0.693818348422,2017_Mai_30_1609,98.8117617499,Stroop,B-2,1STACs-8,
neutral,right,"[-0.8745098039, -0.2078431373, 0.637254902]", ,11,PECH,,,,,,,,,0,183,183,183,right,1,0.42914225132,2017_Mai_30_1609,98.8117617499,Stroop,B-2,1STACs-8,
neutral,right,"[-0.8745098039, -0.2078431373, 0.637254902]", ,14,SOLL,,,,,,,,,0,184,184,184,right,1,0.43878956683,2017_Mai_30_1609,98.8117617499,Stroop,B-2,1STACs-8,
neutralofneutral,left,"[0.568627451, -0.7882352941, -0.7882352941]", ,15,HALS,,,,,,,,,0,185,185,185,left,1,0.568952757962,2017_Mai_30_1609,98.8117617499,Stroop,B-2,1STACs-8,
neutral,down,"[-0.7725490196, 0.0745098039, -1]", ,10,PECH,,,,,,,,,0,186,186,186,down,1,0.474551933277,2017_Mai_30_1609,98.8117617499,Stroop,B-2,1STACs-8,
neutral,left,"[0.568627451, -0.7882352941, -0.7882352941]", ,12,SOLL,,,,,,,,,0,187,187,187,left,1,0.525634961985,2017_Mai_30_1609,98.8117617499,Stroop,B-2,1STACs-8,
neutral,left,"[0.568627451, -0.7882352941, -0.7882352941]", ,9,PECH,,,,,,,,,0,188,188,188,left,1,0.387899300051,2017_Mai_30_1609,98.8117617499,Stroop,B-2,1STACs-8,
neutralofneutral,down,"[-0.7725490196, 0.0745098039, -1]", ,16,HALS,,,,,,,,,0,189,189,189,down,1,0.568403805511,2017_Mai_30_1609,98.8117617499,Stroop,B-2,1STACs-8,
neutralofneutral,down,"[-0.7725490196, 0.0745098039, -1]", ,19,MODE,,,,,,,,,0,190,190,190,left,0,0.416555456071,2017_Mai_30_1609,98.8117617499,Stroop,B-2,1STACs-8,
neutralofneutral,right,"[-0.8745098039, -0.2078431373, 0.637254902]", ,20,MODE,,,,,,,,,0,191,191,191,right,1,0.672403894909,2017_Mai_30_1609,98.8117617499,Stroop,B-2,1STACs-8,
neutral,down,"[-0.7725490196, 0.0745098039, -1]", ,13,SOLL,,,,,,,,,0,192,192,192,down,1,0.536443598279,2017_Mai_30_1609,98.8117617499,Stroop,B-2,1STACs-8,
neutralofneutral,right,"[-0.8745098039, -0.2078431373, 0.637254902]", ,17,HALS,,,,,,,,,0,193,193,193,left,0,0.675676657229,2017_Mai_30_1609,98.8117617499,Stroop,B-2,1STACs-8,
neutral,right,"[-0.8745098039, -0.2078431373, 0.637254902]", ,11,PECH,,,,,,,,,0,194,194,194,right,1,0.54725754251,2017_Mai_30_1609,98.8117617499,Stroop,B-2,1STACs-8,
neutralofneutral,left,"[0.568627451, -0.7882352941, -0.7882352941]", ,18,MODE,,,,,,,,,0,195,195,195,left,1,0.78607169347,2017_Mai_30_1609,98.8117617499,Stroop,B-2,1STACs-8,
fix,return,white, ,21,+,,,,,,,,,0,196,196,196,None,0,,2017_Mai_30_1609,98.8117617499,Stroop,B-2,1STACs-8,
fix,return,white, ,21,+,,,,,,,,,0,197,197,197,None,0,,2017_Mai_30_1609,98.8117617499,Stroop,B-2,1STACs-8,
fix,return,white, ,21,+,,,,,,,,,0,198,198,198,None,0,,2017_Mai_30_1609,98.8117617499,Stroop,B-2,1STACs-8,
fix,return,white, ,21,+,,,,,,,,,0,199,199,199,None,0,,2017_Mai_30_1609,98.8117617499,Stroop,B-2,1STACs-8,
fix,return,white, ,21,+,,,,,,,,,0,200,200,200,None,0,,2017_Mai_30_1609,98.8117617499,Stroop,B-2,1STACs-8,
fix,return,white, ,21,+,,,,,,,,,0,201,201,201,None,0,,2017_Mai_30_1609,98.8117617499,Stroop,B-2,1STACs-8,
fix,return,white, ,21,+,,,,,,,,,0,202,202,202,None,0,,2017_Mai_30_1609,98.8117617499,Stroop,B-2,1STACs-8,
fix,return,white, ,21,+,,,,,,,,,0,203,203,203,None,0,,2017_Mai_30_1609,98.8117617499,Stroop,B-2,1STACs-8,
fix,return,white, ,21,+,,,,,,,,,0,204,204,204,None,0,,2017_Mai_30_1609,98.8117617499,Stroop,B-2,1STACs-8,
fix,return,white, ,21,+,,,,,,,,,0,205,205,205,None,0,,2017_Mai_30_1609,98.8117617499,Stroop,B-2,1STACs-8,
fix,return,white, ,21,+,,,,,,,,,0,206,206,206,None,0,,2017_Mai_30_1609,98.8117617499,Stroop,B-2,1STACs-8,
fix,return,white, ,21,+,,,,,,,,,0,207,207,207,None,0,,2017_Mai_30_1609,98.8117617499,Stroop,B-2,1STACs-8,
fix,return,white,+,22,+,,,,,,,,,0,208,208,208,None,0,,2017_Mai_30_1609,98.8117617499,Stroop,B-2,1STACs-8,
congruent,left,"[0.568627451, -0.7882352941, -0.7882352941]", ,0,ROT,,,,,,,,,0,209,209,209,left,1,0.836419991927,2017_Mai_30_1609,98.8117617499,Stroop,B-2,1STACs-8,
congruent,left,"[0.568627451, -0.7882352941, -0.7882352941]", ,0,ROT,,,,,,,,,0,210,210,210,left,1,0.440081630488,2017_Mai_30_1609,98.8117617499,Stroop,B-2,1STACs-8,
neutral,down,"[-0.7725490196, 0.0745098039, -1]", ,13,SOLL,,,,,,,,,0,211,211,211,down,1,0.640599852773,2017_Mai_30_1609,98.8117617499,Stroop,B-2,1STACs-8,
congruent,down,"[-0.7725490196, 0.0745098039, -1]", ,4,GRÜN,,,,,,,,,0,212,212,212,down,1,0.386427045896,2017_Mai_30_1609,98.8117617499,Stroop,B-2,1STACs-8,
neutral,right,"[-0.8745098039, -0.2078431373, 0.637254902]", ,11,PECH,,,,,,,,,0,213,213,213,right,1,0.42070961533,2017_Mai_30_1609,98.8117617499,Stroop,B-2,1STACs-8,
neutral,right,"[-0.8745098039, -0.2078431373, 0.637254902]", ,14,SOLL,,,,,,,,,0,214,214,214,right,1,0.450471777838,2017_Mai_30_1609,98.8117617499,Stroop,B-2,1STACs-8,
neutral,left,"[0.568627451, -0.7882352941, -0.7882352941]", ,9,PECH,,,,,,,,,0,215,215,215,left,1,0.56044581085,2017_Mai_30_1609,98.8117617499,Stroop,B-2,1STACs-8,
congruent,down,"[-0.7725490196, 0.0745098039, -1]", ,4,GRÜN,,,,,,,,,0,216,216,216,down,1,0.461857303093,2017_Mai_30_1609,98.8117617499,Stroop,B-2,1STACs-8,
congruent,right,"[-0.8745098039, -0.2078431373, 0.637254902]", ,8,BLAU,,,,,,,,,0,217,217,217,right,1,0.611449220502,2017_Mai_30_1609,98.8117617499,Stroop,B-2,1STACs-8,
neutral,down,"[-0.7725490196, 0.0745098039, -1]", ,10,PECH,,,,,,,,,0,218,218,218,left,0,0.861708122122,2017_Mai_30_1609,98.8117617499,Stroop,B-2,1STACs-8,
neutral,left,"[0.568627451, -0.7882352941, -0.7882352941]", ,12,SOLL,,,,,,,,,0,219,219,219,left,1,0.954543384703,2017_Mai_30_1609,98.8117617499,Stroop,B-2,1STACs-8,
congruent,right,"[-0.8745098039, -0.2078431373, 0.637254902]", ,8,BLAU,,,,,,,,,0,220,220,220,right,1,0.836742937998,2017_Mai_30_1609,98.8117617499,Stroop,B-2,1STACs-8,
neutralofneutral,right,"[-0.8745098039, -0.2078431373, 0.637254902]", ,17,HALS,,,,,,,,,0,221,221,221,right,1,0.557925378784,2017_Mai_30_1609,98.8117617499,Stroop,B-2,1STACs-8,
neutralofneutral,right,"[-0.8745098039, -0.2078431373, 0.637254902]", ,20,MODE,,,,,,,,,0,222,222,222,right,1,0.405967238854,2017_Mai_30_1609,98.8117617499,Stroop,B-2,1STACs-8,
neutral,right,"[-0.8745098039, -0.2078431373, 0.637254902]", ,14,SOLL,,,,,,,,,0,223,223,223,right,1,0.437929681008,2017_Mai_30_1609,98.8117617499,Stroop,B-2,1STACs-8,
neutral,down,"[-0.7725490196, 0.0745098039, -1]", ,10,PECH,,,,,,,,,0,224,224,224,down,1,0.868922726213,2017_Mai_30_1609,98.8117617499,Stroop,B-2,1STACs-8,
neutralofneutral,down,"[-0.7725490196, 0.0745098039, -1]", ,19,MODE,,,,,,,,,0,225,225,225,down,1,0.340387674969,2017_Mai_30_1609,98.8117617499,Stroop,B-2,1STACs-8,
neutralofneutral,left,"[0.568627451, -0.7882352941, -0.7882352941]", ,15,HALS,,,,,,,,,0,226,226,226,left,1,0.547001364699,2017_Mai_30_1609,98.8117617499,Stroop,B-2,1STACs-8,
neutralofneutral,left,"[0.568627451, -0.7882352941, -0.7882352941]", ,18,MODE,,,,,,,,,0,227,227,227,left,1,0.502231428854,2017_Mai_30_1609,98.8117617499,Stroop,B-2,1STACs-8,
neutral,down,"[-0.7725490196, 0.0745098039, -1]", ,13,SOLL,,,,,,,,,0,228,228,228,down,1,0.611949284057,2017_Mai_30_1609,98.8117617499,Stroop,B-2,1STACs-8,
neutral,left,"[0.568627451, -0.7882352941, -0.7882352941]", ,12,SOLL,,,,,,,,,0,229,229,229,left,1,0.67603452394,2017_Mai_30_1609,98.8117617499,Stroop,B-2,1STACs-8,
neutralofneutral,down,"[-0.7725490196, 0.0745098039, -1]", ,16,HALS,,,,,,,,,0,230,230,230,left,0,0.461539944323,2017_Mai_30_1609,98.8117617499,Stroop,B-2,1STACs-8,
neutral,left,"[0.568627451, -0.7882352941, -0.7882352941]", ,9,PECH,,,,,,,,,0,231,231,231,left,1,0.549754228539,2017_Mai_30_1609,98.8117617499,Stroop,B-2,1STACs-8,
neutral,right,"[-0.8745098039, -0.2078431373, 0.637254902]", ,11,PECH,,,,,,,,,0,232,232,232,right,1,0.591555351308,2017_Mai_30_1609,98.8117617499,Stroop,B-2,1STACs-8,
incongruent,down,"[-0.7725490196, 0.0745098039, -1]", ,7,BLAU,,,,,,,,,0,233,233,233,down,1,0.429374403731,2017_Mai_30_1609,98.8117617499,Stroop,B-2,1STACs-8,
neutral,right,"[-0.8745098039, -0.2078431373, 0.637254902]", ,14,SOLL,,,,,,,,,0,234,234,234,right,1,0.654439321199,2017_Mai_30_1609,98.8117617499,Stroop,B-2,1STACs-8,
incongruent,right,"[-0.8745098039, -0.2078431373, 0.637254902]", ,5,GRÜN,,,,,,,,,0,235,235,235,right,1,0.386740493554,2017_Mai_30_1609,98.8117617499,Stroop,B-2,1STACs-8,
neutral,left,"[0.568627451, -0.7882352941, -0.7882352941]", ,12,SOLL,,,,,,,,,0,236,236,236,left,1,0.512834452424,2017_Mai_30_1609,98.8117617499,Stroop,B-2,1STACs-8,
incongruent,down,"[-0.7725490196, 0.0745098039, -1]", ,1,ROT,,,,,,,,,0,237,237,237,left,0,0.761620261792,2017_Mai_30_1609,98.8117617499,Stroop,B-2,1STACs-8,
neutral,left,"[0.568627451, -0.7882352941, -0.7882352941]", ,9,PECH,,,,,,,,,0,238,238,238,left,1,0.729446340247,2017_Mai_30_1609,98.8117617499,Stroop,B-2,1STACs-8,
neutral,down,"[-0.7725490196, 0.0745098039, -1]", ,10,PECH,,,,,,,,,0,239,239,239,down,1,0.611560128453,2017_Mai_30_1609,98.8117617499,Stroop,B-2,1STACs-8,
incongruent,right,"[-0.8745098039, -0.2078431373, 0.637254902]", ,2,ROT,,,,,,,,,0,240,240,240,right,1,0.848477390284,2017_Mai_30_1609,98.8117617499,Stroop,B-2,1STACs-8,
neutral,right,"[-0.8745098039, -0.2078431373, 0.637254902]", ,11,PECH,,,,,,,,,0,241,241,241,right,1,0.622631367953,2017_Mai_30_1609,98.8117617499,Stroop,B-2,1STACs-8,
incongruent,left,"[0.568627451, -0.7882352941, -0.7882352941]", ,3,GRÜN,,,,,,,,,0,242,242,242,left,1,0.801269435082,2017_Mai_30_1609,98.8117617499,Stroop,B-2,1STACs-8,
incongruent,left,"[0.568627451, -0.7882352941, -0.7882352941]", ,6,BLAU,,,,,,,,,0,243,243,243,left,1,0.523672142688,2017_Mai_30_1609,98.8117617499,Stroop,B-2,1STACs-8,
neutral,down,"[-0.7725490196, 0.0745098039, -1]", ,13,SOLL,,,,,,,,,0,244,244,244,down,1,0.512786960353,2017_Mai_30_1609,98.8117617499,Stroop,B-2,1STACs-8,
fix,return,white, ,21,+,,,,,,,,,0,245,245,245,None,0,,2017_Mai_30_1609,98.8117617499,Stroop,B-2,1STACs-8,
fix,return,white, ,21,+,,,,,,,,,0,246,246,246,None,0,,2017_Mai_30_1609,98.8117617499,Stroop,B-2,1STACs-8,
fix,return,white, ,21,+,,,,,,,,,0,247,247,247,None,0,,2017_Mai_30_1609,98.8117617499,Stroop,B-2,1STACs-8,
fix,return,white, ,21,+,,,,,,,,,0,248,248,248,None,0,,2017_Mai_30_1609,98.8117617499,Stroop,B-2,1STACs-8,
fix,return,white, ,21,+,,,,,,,,,0,249,249,249,None,0,,2017_Mai_30_1609,98.8117617499,Stroop,B-2,1STACs-8,
fix,return,white, ,21,+,,,,,,,,,0,250,250,250,None,0,,2017_Mai_30_1609,98.8117617499,Stroop,B-2,1STACs-8,
fix,return,white, ,21,+,,,,,,,,,0,251,251,251,None,0,,2017_Mai_30_1609,98.8117617499,Stroop,B-2,1STACs-8,
fix,return,white, ,21,+,,,,,,,,,0,252,252,252,None,0,,2017_Mai_30_1609,98.8117617499,Stroop,B-2,1STACs-8,
fix,return,white, ,21,+,,,,,,,,,0,253,253,253,None,0,,2017_Mai_30_1609,98.8117617499,Stroop,B-2,1STACs-8,
fix,return,white, ,21,+,,,,,,,,,0,254,254,254,None,0,,2017_Mai_30_1609,98.8117617499,Stroop,B-2,1STACs-8,
fix,return,white, ,21,+,,,,,,,,,0,255,255,255,None,0,,2017_Mai_30_1609,98.8117617499,Stroop,B-2,1STACs-8,
fix,return,white, ,21,+,,,,,,,,,0,256,256,256,None,0,,2017_Mai_30_1609,98.8117617499,Stroop,B-2,1STACs-8,
fix,return,white,+,22,+,,,,,,,,,0,257,257,257,None,0,,2017_Mai_30_1609,98.8117617499,Stroop,B-2,1STACs-8,
incongruent,right,"[-0.8745098039, -0.2078431373, 0.637254902]", ,2,ROT,,,,,,,,,0,258,258,258,down,0,0.625189234945,2017_Mai_30_1609,98.8117617499,Stroop,B-2,1STACs-8,
incongruent,down,"[-0.7725490196, 0.0745098039, -1]", ,7,BLAU,,,,,,,,,0,259,259,259,down,1,0.471962218662,2017_Mai_30_1609,98.8117617499,Stroop,B-2,1STACs-8,
neutral,right,"[-0.8745098039, -0.2078431373, 0.637254902]", ,14,SOLL,,,,,,,,,0,260,260,260,right,1,0.719036637338,2017_Mai_30_1609,98.8117617499,Stroop,B-2,1STACs-8,
neutral,left,"[0.568627451, -0.7882352941, -0.7882352941]", ,12,SOLL,,,,,,,,,0,261,261,261,left,1,0.739921414593,2017_Mai_30_1609,98.8117617499,Stroop,B-2,1STACs-8,
neutral,down,"[-0.7725490196, 0.0745098039, -1]", ,10,PECH,,,,,,,,,0,262,262,262,down,1,0.635718226758,2017_Mai_30_1609,98.8117617499,Stroop,B-2,1STACs-8,
neutral,down,"[-0.7725490196, 0.0745098039, -1]", ,13,SOLL,,,,,,,,,0,263,263,263,down,1,0.737230011076,2017_Mai_30_1609,98.8117617499,Stroop,B-2,1STACs-8,
incongruent,left,"[0.568627451, -0.7882352941, -0.7882352941]", ,6,BLAU,,,,,,,,,0,264,264,264,left,1,0.907634629542,2017_Mai_30_1609,98.8117617499,Stroop,B-2,1STACs-8,
incongruent,right,"[-0.8745098039, -0.2078431373, 0.637254902]", ,5,GRÜN,,,,,,,,,0,265,265,265,right,1,0.928797933815,2017_Mai_30_1609,98.8117617499,Stroop,B-2,1STACs-8,
neutral,left,"[0.568627451, -0.7882352941, -0.7882352941]", ,9,PECH,,,,,,,,,0,266,266,266,left,1,0.643658900781,2017_Mai_30_1609,98.8117617499,Stroop,B-2,1STACs-8,
incongruent,left,"[0.568627451, -0.7882352941, -0.7882352941]", ,3,GRÜN,,,,,,,,,0,267,267,267,left,1,0.523449488692,2017_Mai_30_1609,98.8117617499,Stroop,B-2,1STACs-8,
neutral,right,"[-0.8745098039, -0.2078431373, 0.637254902]", ,11,PECH,,,,,,,,,0,268,268,268,down,0,0.46136115065,2017_Mai_30_1609,98.8117617499,Stroop,B-2,1STACs-8,
incongruent,down,"[-0.7725490196, 0.0745098039, -1]", ,1,ROT,,,,,,,,,0,269,269,269,down,1,0.536824093566,2017_Mai_30_1609,98.8117617499,Stroop,B-2,1STACs-8,
neutralofneutral,left,"[0.568627451, -0.7882352941, -0.7882352941]", ,18,MODE,,,,,,,,,0,270,270,270,left,1,0.694055529404,2017_Mai_30_1609,98.8117617499,Stroop,B-2,1STACs-8,
neutralofneutral,left,"[0.568627451, -0.7882352941, -0.7882352941]", ,15,HALS,,,,,,,,,0,271,271,271,left,1,0.482952721644,2017_Mai_30_1609,98.8117617499,Stroop,B-2,1STACs-8,
neutral,left,"[0.568627451, -0.7882352941, -0.7882352941]", ,9,PECH,,,,,,,,,0,272,272,272,left,1,0.409859353633,2017_Mai_30_1609,98.8117617499,Stroop,B-2,1STACs-8,
neutralofneutral,down,"[-0.7725490196, 0.0745098039, -1]", ,16,HALS,,,,,,,,,0,273,273,273,down,1,0.686709623709,2017_Mai_30_1609,98.8117617499,Stroop,B-2,1STACs-8,
neutral,right,"[-0.8745098039, -0.2078431373, 0.637254902]", ,11,PECH,,,,,,,,,0,274,274,274,right,1,0.54949693327,2017_Mai_30_1609,98.8117617499,Stroop,B-2,1STACs-8,
neutral,down,"[-0.7725490196, 0.0745098039, -1]", ,13,SOLL,,,,,,,,,0,275,275,275,down,1,0.590415821005,2017_Mai_30_1609,98.8117617499,Stroop,B-2,1STACs-8,
neutralofneutral,right,"[-0.8745098039, -0.2078431373, 0.637254902]", ,17,HALS,,,,,,,,,0,276,276,276,right,1,0.901683035134,2017_Mai_30_1609,98.8117617499,Stroop,B-2,1STACs-8,
neutral,right,"[-0.8745098039, -0.2078431373, 0.637254902]", ,14,SOLL,,,,,,,,,0,277,277,277,right,1,0.418773894447,2017_Mai_30_1609,98.8117617499,Stroop,B-2,1STACs-8,
neutralofneutral,right,"[-0.8745098039, -0.2078431373, 0.637254902]", ,20,MODE,,,,,,,,,0,278,278,278,right,1,0.555259118128,2017_Mai_30_1609,98.8117617499,Stroop,B-2,1STACs-8,
neutral,left,"[0.568627451, -0.7882352941, -0.7882352941]", ,12,SOLL,,,,,,,,,0,279,279,279,left,1,0.886315160167,2017_Mai_30_1609,98.8117617499,Stroop,B-2,1STACs-8,
neutralofneutral,down,"[-0.7725490196, 0.0745098039, -1]", ,19,MODE,,,,,,,,,0,280,280,280,down,1,0.680429495927,2017_Mai_30_1609,98.8117617499,Stroop,B-2,1STACs-8,
neutral,down,"[-0.7725490196, 0.0745098039, -1]", ,10,PECH,,,,,,,,,0,281,281,281,down,1,0.450688844532,2017_Mai_30_1609,98.8117617499,Stroop,B-2,1STACs-8,
congruent,right,"[-0.8745098039, -0.2078431373, 0.637254902]", ,8,BLAU,,,,,,,,,0,282,282,282,right,1,0.758216197868,2017_Mai_30_1609,98.8117617499,Stroop,B-2,1STACs-8,
neutral,left,"[0.568627451, -0.7882352941, -0.7882352941]", ,12,SOLL,,,,,,,,,0,283,283,283,left,1,0.587514614288,2017_Mai_30_1609,98.8117617499,Stroop,B-2,1STACs-8,
congruent,left,"[0.568627451, -0.7882352941, -0.7882352941]", ,0,ROT,,,,,,,,,0,284,284,284,left,1,0.50679234372,2017_Mai_30_1609,98.8117617499,Stroop,B-2,1STACs-8,
congruent,left,"[0.568627451, -0.7882352941, -0.7882352941]", ,0,ROT,,,,,,,,,0,285,285,285,left,1,0.495980913774,2017_Mai_30_1609,98.8117617499,Stroop,B-2,1STACs-8,
neutral,left,"[0.568627451, -0.7882352941, -0.7882352941]", ,9,PECH,,,,,,,,,0,286,286,286,left,1,0.496050196325,2017_Mai_30_1609,98.8117617499,Stroop,B-2,1STACs-8,
neutral,down,"[-0.7725490196, 0.0745098039, -1]", ,13,SOLL,,,,,,,,,0,287,287,287,down,1,0.482948251803,2017_Mai_30_1609,98.8117617499,Stroop,B-2,1STACs-8,
congruent,down,"[-0.7725490196, 0.0745098039, -1]", ,4,GRÜN,,,,,,,,,0,288,288,288,down,1,0.40784541052,2017_Mai_30_1609,98.8117617499,Stroop,B-2,1STACs-8,
neutral,right,"[-0.8745098039, -0.2078431373, 0.637254902]", ,11,PECH,,,,,,,,,0,289,289,289,right,1,0.582084315185,2017_Mai_30_1609,98.8117617499,Stroop,B-2,1STACs-8,
neutral,right,"[-0.8745098039, -0.2078431373, 0.637254902]", ,14,SOLL,,,,,,,,,0,290,290,290,right,1,0.407526096193,2017_Mai_30_1609,98.8117617499,Stroop,B-2,1STACs-8,
congruent,right,"[-0.8745098039, -0.2078431373, 0.637254902]", ,8,BLAU,,,,,,,,,0,291,291,291,right,1,0.482850474013,2017_Mai_30_1609,98.8117617499,Stroop,B-2,1STACs-8,
congruent,down,"[-0.7725490196, 0.0745098039, -1]", ,4,GRÜN,,,,,,,,,0,292,292,292,down,1,0.522513056827,2017_Mai_30_1609,98.8117617499,Stroop,B-2,1STACs-8,
neutral,down,"[-0.7725490196, 0.0745098039, -1]", ,10,PECH,,,,,,,,,0,293,293,293,down,1,0.514879125698,2017_Mai_30_1609,98.8117617499,Stroop,B-2,1STACs-8,
fix,return,white, ,21,+,,,,,,,,,0,294,294,294,None,0,,2017_Mai_30_1609,98.8117617499,Stroop,B-2,1STACs-8,
fix,return,white, ,21,+,,,,,,,,,0,295,295,295,None,0,,2017_Mai_30_1609,98.8117617499,Stroop,B-2,1STACs-8,
fix,return,white, ,21,+,,,,,,,,,0,296,296,296,None,0,,2017_Mai_30_1609,98.8117617499,Stroop,B-2,1STACs-8,
fix,return,white, ,21,+,,,,,,,,,0,297,297,297,None,0,,2017_Mai_30_1609,98.8117617499,Stroop,B-2,1STACs-8,
fix,return,white, ,21,+,,,,,,,,,0,298,298,298,None,0,,2017_Mai_30_1609,98.8117617499,Stroop,B-2,1STACs-8,
fix,return,white, ,21,+,,,,,,,,,0,299,299,299,None,0,,2017_Mai_30_1609,98.8117617499,Stroop,B-2,1STACs-8,
fix,return,white, ,21,+,,,,,,,,,0,300,300,300,None,0,,2017_Mai_30_1609,98.8117617499,Stroop,B-2,1STACs-8,
fix,return,white, ,21,+,,,,,,,,,0,301,301,301,None,0,,2017_Mai_30_1609,98.8117617499,Stroop,B-2,1STACs-8,
fix,return,white, ,21,+,,,,,,,,,0,302,302,302,None,0,,2017_Mai_30_1609,98.8117617499,Stroop,B-2,1STACs-8,
fix,return,white, ,21,+,,,,,,,,,0,303,303,303,None,0,,2017_Mai_30_1609,98.8117617499,Stroop,B-2,1STACs-8,
fix,return,white, ,21,+,,,,,,,,,0,304,304,304,None,0,,2017_Mai_30_1609,98.8117617499,Stroop,B-2,1STACs-8,
fix,return,white, ,21,+,,,,,,,,,0,305,305,305,None,0,,2017_Mai_30_1609,98.8117617499,Stroop,B-2,1STACs-8,
fix,return,white,+,22,+,,,,,,,,,0,306,306,306,None,0,,2017_Mai_30_1609,98.8117617499,Stroop,B-2,1STACs-8,
