congruent,corrAns,letterColor,signal,selectedrownumber_novariable,Anzeigetext,practice.thisRepN,practice.thisTrialN,practice.thisN,practice.thisIndex,Wrongresponse.thisRepN,Wrongresponse.thisTrialN,Wrongresponse.thisN,Wrongresponse.thisIndex,trials.thisRepN,trials.thisTrialN,trials.thisN,trials.thisIndex,resp.keys,resp.corr,resp.rt,date,frameRate,expName,session,participant,
congruent,down,"[-0.7725490196, 0.0745098039, -1]", ,4,GRÜN,0,0,0,0,0,0,0,0,,,,,down,1,0.608787988418,2017_Jun_02_1010,98.8559695331,Stroop,B-2,1STACS-6,
,,,,,,0,0,0,0,,,,,,,,,,,,2017_Jun_02_1010,98.8559695331,Stroop,B-2,1STACS-6,
neutral,right,"[-0.8745098039, -0.2078431373, 0.637254902]", ,14,SOLL,1,0,1,0,0,0,0,0,,,,,right,1,0.575342955599,2017_Jun_02_1010,98.8559695331,Stroop,B-2,1STACS-6,
,,,,,,1,0,1,0,,,,,,,,,,,,2017_Jun_02_1010,98.8559695331,Stroop,B-2,1STACS-6,
neutral,down,"[-0.7725490196, 0.0745098039, -1]", ,10,PECH,2,0,2,0,0,0,0,0,,,,,down,1,0.524871457126,2017_Jun_02_1010,98.8559695331,Stroop,B-2,1STACS-6,
,,,,,,2,0,2,0,,,,,,,,,,,,2017_Jun_02_1010,98.8559695331,Stroop,B-2,1STACS-6,
neutralofneutral,down,"[-0.7725490196, 0.0745098039, -1]", ,16,HALS,3,0,3,0,0,0,0,0,,,,,down,1,0.470417329577,2017_Jun_02_1010,98.8559695331,Stroop,B-2,1STACS-6,
,,,,,,3,0,3,0,,,,,,,,,,,,2017_Jun_02_1010,98.8559695331,Stroop,B-2,1STACS-6,
neutral,left,"[0.568627451, -0.7882352941, -0.7882352941]", ,12,SOLL,4,0,4,0,0,0,0,0,,,,,left,1,0.59554803753,2017_Jun_02_1010,98.8559695331,Stroop,B-2,1STACS-6,
,,,,,,4,0,4,0,,,,,,,,,,,,2017_Jun_02_1010,98.8559695331,Stroop,B-2,1STACS-6,
neutralofneutral,left,"[0.568627451, -0.7882352941, -0.7882352941]", ,15,HALS,5,0,5,0,0,0,0,0,,,,,left,1,0.599556368198,2017_Jun_02_1010,98.8559695331,Stroop,B-2,1STACS-6,
,,,,,,5,0,5,0,,,,,,,,,,,,2017_Jun_02_1010,98.8559695331,Stroop,B-2,1STACS-6,
congruent,down,"[-0.7725490196, 0.0745098039, -1]", ,4,GRÜN,6,0,6,0,0,0,0,0,,,,,down,1,0.502445981263,2017_Jun_02_1010,98.8559695331,Stroop,B-2,1STACS-6,
,,,,,,6,0,6,0,,,,,,,,,,,,2017_Jun_02_1010,98.8559695331,Stroop,B-2,1STACS-6,
neutral,right,"[-0.8745098039, -0.2078431373, 0.637254902]", ,11,PECH,7,0,7,0,0,0,0,0,,,,,right,1,0.609647315511,2017_Jun_02_1010,98.8559695331,Stroop,B-2,1STACS-6,
,,,,,,7,0,7,0,,,,,,,,,,,,2017_Jun_02_1010,98.8559695331,Stroop,B-2,1STACS-6,
incongruent,down,"[-0.7725490196, 0.0745098039, -1]", ,7,BLAU,8,0,8,0,0,0,0,0,,,,,down,1,0.685513941017,2017_Jun_02_1010,98.8559695331,Stroop,B-2,1STACS-6,
,,,,,,8,0,8,0,,,,,,,,,,,,2017_Jun_02_1010,98.8559695331,Stroop,B-2,1STACS-6,
neutral,left,"[0.568627451, -0.7882352941, -0.7882352941]", ,9,PECH,9,0,9,0,0,0,0,0,,,,,left,1,0.545602862934,2017_Jun_02_1010,98.8559695331,Stroop,B-2,1STACS-6,
,,,,,,9,0,9,0,,,,,,,,,,,,2017_Jun_02_1010,98.8559695331,Stroop,B-2,1STACS-6,
neutral,down,"[-0.7725490196, 0.0745098039, -1]", ,10,PECH,10,0,10,0,0,0,0,0,,,,,down,1,0.460319677501,2017_Jun_02_1010,98.8559695331,Stroop,B-2,1STACS-6,
,,,,,,10,0,10,0,,,,,,,,,,,,2017_Jun_02_1010,98.8559695331,Stroop,B-2,1STACS-6,
incongruent,left,"[0.568627451, -0.7882352941, -0.7882352941]", ,6,BLAU,11,0,11,0,0,0,0,0,,,,,left,1,0.706019619812,2017_Jun_02_1010,98.8559695331,Stroop,B-2,1STACS-6,
,,,,,,11,0,11,0,,,,,,,,,,,,2017_Jun_02_1010,98.8559695331,Stroop,B-2,1STACS-6,
neutral,left,"[0.568627451, -0.7882352941, -0.7882352941]", ,9,PECH,12,0,12,0,0,0,0,0,,,,,down,0,0.428206378185,2017_Jun_02_1010,98.8559695331,Stroop,B-2,1STACS-6,
,,,,,,12,0,12,0,,,,,,,,,,,,2017_Jun_02_1010,98.8559695331,Stroop,B-2,1STACS-6,
neutral,left,"[0.568627451, -0.7882352941, -0.7882352941]", ,9,PECH,13,0,13,0,0,0,0,0,,,,,left,1,0.439280690702,2017_Jun_02_1010,98.8559695331,Stroop,B-2,1STACS-6,
,,,,,,13,0,13,0,,,,,,,,,,,,2017_Jun_02_1010,98.8559695331,Stroop,B-2,1STACS-6,
neutral,left,"[0.568627451, -0.7882352941, -0.7882352941]", ,9,PECH,14,0,14,0,0,0,0,0,,,,,left,1,0.502631200334,2017_Jun_02_1010,98.8559695331,Stroop,B-2,1STACS-6,
,,,,,,14,0,14,0,,,,,,,,,,,,2017_Jun_02_1010,98.8559695331,Stroop,B-2,1STACS-6,
incongruent,right,"[-0.8745098039, -0.2078431373, 0.637254902]", ,2,ROT,15,0,15,0,0,0,0,0,,,,,right,1,0.548018533082,2017_Jun_02_1010,98.8559695331,Stroop,B-2,1STACS-6,
,,,,,,15,0,15,0,,,,,,,,,,,,2017_Jun_02_1010,98.8559695331,Stroop,B-2,1STACS-6,
neutral,down,"[-0.7725490196, 0.0745098039, -1]", ,10,PECH,16,0,16,0,0,0,0,0,,,,,down,1,0.70618444523,2017_Jun_02_1010,98.8559695331,Stroop,B-2,1STACS-6,
,,,,,,16,0,16,0,,,,,,,,,,,,2017_Jun_02_1010,98.8559695331,Stroop,B-2,1STACS-6,
congruent,left,"[0.568627451, -0.7882352941, -0.7882352941]", ,0,ROT,17,0,17,0,0,0,0,0,,,,,left,1,0.419620650111,2017_Jun_02_1010,98.8559695331,Stroop,B-2,1STACS-6,
,,,,,,17,0,17,0,,,,,,,,,,,,2017_Jun_02_1010,98.8559695331,Stroop,B-2,1STACS-6,
neutralofneutral,right,"[-0.8745098039, -0.2078431373, 0.637254902]", ,17,HALS,18,0,18,0,0,0,0,0,,,,,right,1,0.920247964476,2017_Jun_02_1010,98.8559695331,Stroop,B-2,1STACS-6,
,,,,,,18,0,18,0,,,,,,,,,,,,2017_Jun_02_1010,98.8559695331,Stroop,B-2,1STACS-6,
neutral,down,"[-0.7725490196, 0.0745098039, -1]", ,10,PECH,19,0,19,0,0,0,0,0,,,,,down,1,0.609921093323,2017_Jun_02_1010,98.8559695331,Stroop,B-2,1STACS-6,
,,,,,,19,0,19,0,,,,,,,,,,,,2017_Jun_02_1010,98.8559695331,Stroop,B-2,1STACS-6,
neutralofneutral,left,"[0.568627451, -0.7882352941, -0.7882352941]", ,15,HALS,20,0,20,0,0,0,0,0,,,,,left,1,0.684675845673,2017_Jun_02_1010,98.8559695331,Stroop,B-2,1STACS-6,
,,,,,,20,0,20,0,,,,,,,,,,,,2017_Jun_02_1010,98.8559695331,Stroop,B-2,1STACS-6,
incongruent,left,"[0.568627451, -0.7882352941, -0.7882352941]", ,3,GRÜN,21,0,21,0,0,0,0,0,,,,,left,1,0.459791956799,2017_Jun_02_1010,98.8559695331,Stroop,B-2,1STACS-6,
,,,,,,21,0,21,0,,,,,,,,,,,,2017_Jun_02_1010,98.8559695331,Stroop,B-2,1STACS-6,
neutral,down,"[-0.7725490196, 0.0745098039, -1]", ,13,SOLL,22,0,22,0,0,0,0,0,,,,,down,1,0.564922078085,2017_Jun_02_1010,98.8559695331,Stroop,B-2,1STACS-6,
,,,,,,22,0,22,0,,,,,,,,,,,,2017_Jun_02_1010,98.8559695331,Stroop,B-2,1STACS-6,
neutralofneutral,right,"[-0.8745098039, -0.2078431373, 0.637254902]", ,20,MODE,23,0,23,0,0,0,0,0,,,,,right,1,0.698401891861,2017_Jun_02_1010,98.8559695331,Stroop,B-2,1STACS-6,
,,,,,,23,0,23,0,,,,,,,,,,,,2017_Jun_02_1010,98.8559695331,Stroop,B-2,1STACS-6,
neutralofneutral,left,"[0.568627451, -0.7882352941, -0.7882352941]", ,15,HALS,24,0,24,0,0,0,0,0,,,,,left,1,0.566995525968,2017_Jun_02_1010,98.8559695331,Stroop,B-2,1STACS-6,
,,,,,,24,0,24,0,,,,,,,,,,,,2017_Jun_02_1010,98.8559695331,Stroop,B-2,1STACS-6,
congruent,down,"[-0.7725490196, 0.0745098039, -1]", ,4,GRÜN,25,0,25,0,0,0,0,0,,,,,down,1,0.567319589501,2017_Jun_02_1010,98.8559695331,Stroop,B-2,1STACS-6,
,,,,,,25,0,25,0,,,,,,,,,,,,2017_Jun_02_1010,98.8559695331,Stroop,B-2,1STACS-6,
neutral,left,"[0.568627451, -0.7882352941, -0.7882352941]", ,12,SOLL,26,0,26,0,0,0,0,0,,,,,left,1,0.531623991317,2017_Jun_02_1010,98.8559695331,Stroop,B-2,1STACS-6,
,,,,,,26,0,26,0,,,,,,,,,,,,2017_Jun_02_1010,98.8559695331,Stroop,B-2,1STACS-6,
neutral,right,"[-0.8745098039, -0.2078431373, 0.637254902]", ,14,SOLL,27,0,27,0,0,0,0,0,,,,,right,1,0.521941196437,2017_Jun_02_1010,98.8559695331,Stroop,B-2,1STACS-6,
,,,,,,27,0,27,0,,,,,,,,,,,,2017_Jun_02_1010,98.8559695331,Stroop,B-2,1STACS-6,
incongruent,right,"[-0.8745098039, -0.2078431373, 0.637254902]", ,2,ROT,28,0,28,0,0,0,0,0,,,,,left,0,0.74224964346,2017_Jun_02_1010,98.8559695331,Stroop,B-2,1STACS-6,
,,,,,,28,0,28,0,,,,,,,,,,,,2017_Jun_02_1010,98.8559695331,Stroop,B-2,1STACS-6,
incongruent,right,"[-0.8745098039, -0.2078431373, 0.637254902]", ,2,ROT,29,0,29,0,0,0,0,0,,,,,right,1,0.838265477875,2017_Jun_02_1010,98.8559695331,Stroop,B-2,1STACS-6,
,,,,,,29,0,29,0,,,,,,,,,,,,2017_Jun_02_1010,98.8559695331,Stroop,B-2,1STACS-6,
neutral,right,"[-0.8745098039, -0.2078431373, 0.637254902]", ,11,PECH,30,0,30,0,0,0,0,0,,,,,right,1,0.620281907337,2017_Jun_02_1010,98.8559695331,Stroop,B-2,1STACS-6,
,,,,,,30,0,30,0,,,,,,,,,,,,2017_Jun_02_1010,98.8559695331,Stroop,B-2,1STACS-6,
neutralofneutral,right,"[-0.8745098039, -0.2078431373, 0.637254902]", ,17,HALS,31,0,31,0,0,0,0,0,,,,,right,1,1.02586418106,2017_Jun_02_1010,98.8559695331,Stroop,B-2,1STACS-6,
,,,,,,31,0,31,0,,,,,,,,,,,,2017_Jun_02_1010,98.8559695331,Stroop,B-2,1STACS-6,
incongruent,left,"[0.568627451, -0.7882352941, -0.7882352941]", ,6,BLAU,32,0,32,0,0,0,0,0,,,,,left,1,0.994067402421,2017_Jun_02_1010,98.8559695331,Stroop,B-2,1STACS-6,
,,,,,,32,0,32,0,,,,,,,,,,,,2017_Jun_02_1010,98.8559695331,Stroop,B-2,1STACS-6,
incongruent,right,"[-0.8745098039, -0.2078431373, 0.637254902]", ,5,GRÜN,33,0,33,0,0,0,0,0,,,,,right,1,0.791430475102,2017_Jun_02_1010,98.8559695331,Stroop,B-2,1STACS-6,
,,,,,,33,0,33,0,,,,,,,,,,,,2017_Jun_02_1010,98.8559695331,Stroop,B-2,1STACS-6,
neutralofneutral,right,"[-0.8745098039, -0.2078431373, 0.637254902]", ,20,MODE,34,0,34,0,0,0,0,0,,,,,right,1,0.635054455245,2017_Jun_02_1010,98.8559695331,Stroop,B-2,1STACS-6,
,,,,,,34,0,34,0,,,,,,,,,,,,2017_Jun_02_1010,98.8559695331,Stroop,B-2,1STACS-6,
neutral,right,"[-0.8745098039, -0.2078431373, 0.637254902]", ,11,PECH,35,0,35,0,0,0,0,0,,,,,right,1,0.545537212132,2017_Jun_02_1010,98.8559695331,Stroop,B-2,1STACS-6,
,,,,,,35,0,35,0,,,,,,,,,,,,2017_Jun_02_1010,98.8559695331,Stroop,B-2,1STACS-6,
neutral,left,"[0.568627451, -0.7882352941, -0.7882352941]", ,12,SOLL,36,0,36,0,0,0,0,0,,,,,left,1,0.553385416303,2017_Jun_02_1010,98.8559695331,Stroop,B-2,1STACS-6,
,,,,,,36,0,36,0,,,,,,,,,,,,2017_Jun_02_1010,98.8559695331,Stroop,B-2,1STACS-6,
neutralofneutral,left,"[0.568627451, -0.7882352941, -0.7882352941]", ,18,MODE,37,0,37,0,0,0,0,0,,,,,left,1,0.55873078841,2017_Jun_02_1010,98.8559695331,Stroop,B-2,1STACS-6,
,,,,,,37,0,37,0,,,,,,,,,,,,2017_Jun_02_1010,98.8559695331,Stroop,B-2,1STACS-6,
incongruent,left,"[0.568627451, -0.7882352941, -0.7882352941]", ,3,GRÜN,38,0,38,0,0,0,0,0,,,,,left,1,0.598229383902,2017_Jun_02_1010,98.8559695331,Stroop,B-2,1STACS-6,
,,,,,,38,0,38,0,,,,,,,,,,,,2017_Jun_02_1010,98.8559695331,Stroop,B-2,1STACS-6,
incongruent,down,"[-0.7725490196, 0.0745098039, -1]", ,7,BLAU,39,0,39,0,0,0,0,0,,,,,down,1,0.695362399411,2017_Jun_02_1010,98.8559695331,Stroop,B-2,1STACS-6,
,,,,,,39,0,39,0,,,,,,,,,,,,2017_Jun_02_1010,98.8559695331,Stroop,B-2,1STACS-6,
incongruent,left,"[0.568627451, -0.7882352941, -0.7882352941]", ,3,GRÜN,40,0,40,0,0,0,0,0,,,,,left,1,0.524038110989,2017_Jun_02_1010,98.8559695331,Stroop,B-2,1STACS-6,
,,,,,,40,0,40,0,,,,,,,,,,,,2017_Jun_02_1010,98.8559695331,Stroop,B-2,1STACS-6,
neutral,left,"[0.568627451, -0.7882352941, -0.7882352941]", ,12,SOLL,41,0,41,0,0,0,0,0,,,,,left,1,0.744686265992,2017_Jun_02_1010,98.8559695331,Stroop,B-2,1STACS-6,
,,,,,,41,0,41,0,,,,,,,,,,,,2017_Jun_02_1010,98.8559695331,Stroop,B-2,1STACS-6,
neutralofneutral,left,"[0.568627451, -0.7882352941, -0.7882352941]", ,15,HALS,42,0,42,0,0,0,0,0,,,,,left,1,0.556900108813,2017_Jun_02_1010,98.8559695331,Stroop,B-2,1STACS-6,
,,,,,,42,0,42,0,,,,,,,,,,,,2017_Jun_02_1010,98.8559695331,Stroop,B-2,1STACS-6,
congruent,left,"[0.568627451, -0.7882352941, -0.7882352941]", ,0,ROT,43,0,43,0,0,0,0,0,,,,,left,1,0.52613334935,2017_Jun_02_1010,98.8559695331,Stroop,B-2,1STACS-6,
,,,,,,43,0,43,0,,,,,,,,,,,,2017_Jun_02_1010,98.8559695331,Stroop,B-2,1STACS-6,
neutral,left,"[0.568627451, -0.7882352941, -0.7882352941]", ,9,PECH,44,0,44,0,0,0,0,0,,,,,left,1,0.53654361099,2017_Jun_02_1010,98.8559695331,Stroop,B-2,1STACS-6,
,,,,,,44,0,44,0,,,,,,,,,,,,2017_Jun_02_1010,98.8559695331,Stroop,B-2,1STACS-6,
neutralofneutral,right,"[-0.8745098039, -0.2078431373, 0.637254902]", ,17,HALS,45,0,45,0,0,0,0,0,,,,,right,1,0.823846885568,2017_Jun_02_1010,98.8559695331,Stroop,B-2,1STACS-6,
,,,,,,45,0,45,0,,,,,,,,,,,,2017_Jun_02_1010,98.8559695331,Stroop,B-2,1STACS-6,
incongruent,left,"[0.568627451, -0.7882352941, -0.7882352941]", ,3,GRÜN,46,0,46,0,0,0,0,0,,,,,left,1,0.577254930445,2017_Jun_02_1010,98.8559695331,Stroop,B-2,1STACS-6,
,,,,,,46,0,46,0,,,,,,,,,,,,2017_Jun_02_1010,98.8559695331,Stroop,B-2,1STACS-6,
neutral,down,"[-0.7725490196, 0.0745098039, -1]", ,13,SOLL,47,0,47,0,0,0,0,0,,,,,down,1,0.747232120283,2017_Jun_02_1010,98.8559695331,Stroop,B-2,1STACS-6,
,,,,,,47,0,47,0,,,,,,,,,,,,2017_Jun_02_1010,98.8559695331,Stroop,B-2,1STACS-6,
neutralofneutral,right,"[-0.8745098039, -0.2078431373, 0.637254902]", ,17,HALS,48,0,48,0,0,0,0,0,,,,,right,1,0.503800063975,2017_Jun_02_1010,98.8559695331,Stroop,B-2,1STACS-6,
,,,,,,48,0,48,0,,,,,,,,,,,,2017_Jun_02_1010,98.8559695331,Stroop,B-2,1STACS-6,
incongruent,right,"[-0.8745098039, -0.2078431373, 0.637254902]", ,2,ROT,49,0,49,0,0,0,0,0,,,,,right,1,0.741331370328,2017_Jun_02_1010,98.8559695331,Stroop,B-2,1STACS-6,
,,,,,,49,0,49,0,,,,,,,,,,,,2017_Jun_02_1010,98.8559695331,Stroop,B-2,1STACS-6,
neutral,left,"[0.568627451, -0.7882352941, -0.7882352941]", ,9,PECH,50,0,50,0,0,0,0,0,,,,,left,1,0.463779893813,2017_Jun_02_1010,98.8559695331,Stroop,B-2,1STACS-6,
,,,,,,50,0,50,0,,,,,,,,,,,,2017_Jun_02_1010,98.8559695331,Stroop,B-2,1STACS-6,
neutral,right,"[-0.8745098039, -0.2078431373, 0.637254902]", ,11,PECH,51,0,51,0,0,0,0,0,,,,,right,1,0.62090852329,2017_Jun_02_1010,98.8559695331,Stroop,B-2,1STACS-6,
,,,,,,51,0,51,0,,,,,,,,,,,,2017_Jun_02_1010,98.8559695331,Stroop,B-2,1STACS-6,
fix,return,white, ,21,+,,,,,,,,,0,0,0,0,None,0,,2017_Jun_02_1010,98.8559695331,Stroop,B-2,1STACS-6,
fix,return,white, ,21,+,,,,,,,,,0,1,1,1,None,0,,2017_Jun_02_1010,98.8559695331,Stroop,B-2,1STACS-6,
fix,return,white, ,21,+,,,,,,,,,0,2,2,2,None,0,,2017_Jun_02_1010,98.8559695331,Stroop,B-2,1STACS-6,
fix,return,white, ,21,+,,,,,,,,,0,3,3,3,None,0,,2017_Jun_02_1010,98.8559695331,Stroop,B-2,1STACS-6,
fix,return,white, ,21,+,,,,,,,,,0,4,4,4,None,0,,2017_Jun_02_1010,98.8559695331,Stroop,B-2,1STACS-6,
fix,return,white, ,21,+,,,,,,,,,0,5,5,5,None,0,,2017_Jun_02_1010,98.8559695331,Stroop,B-2,1STACS-6,
fix,return,white, ,21,+,,,,,,,,,0,6,6,6,None,0,,2017_Jun_02_1010,98.8559695331,Stroop,B-2,1STACS-6,
fix,return,white, ,21,+,,,,,,,,,0,7,7,7,None,0,,2017_Jun_02_1010,98.8559695331,Stroop,B-2,1STACS-6,
fix,return,white, ,21,+,,,,,,,,,0,8,8,8,None,0,,2017_Jun_02_1010,98.8559695331,Stroop,B-2,1STACS-6,
fix,return,white, ,21,+,,,,,,,,,0,9,9,9,None,0,,2017_Jun_02_1010,98.8559695331,Stroop,B-2,1STACS-6,
fix,return,white, ,21,+,,,,,,,,,0,10,10,10,None,0,,2017_Jun_02_1010,98.8559695331,Stroop,B-2,1STACS-6,
fix,return,white, ,21,+,,,,,,,,,0,11,11,11,None,0,,2017_Jun_02_1010,98.8559695331,Stroop,B-2,1STACS-6,
fix,return,white,+,22,+,,,,,,,,,0,12,12,12,None,0,,2017_Jun_02_1010,98.8559695331,Stroop,B-2,1STACS-6,
neutralofneutral,left,"[0.568627451, -0.7882352941, -0.7882352941]", ,18,MODE,,,,,,,,,0,13,13,13,left,1,0.622340548869,2017_Jun_02_1010,98.8559695331,Stroop,B-2,1STACS-6,
neutralofneutral,right,"[-0.8745098039, -0.2078431373, 0.637254902]", ,20,MODE,,,,,,,,,0,14,14,14,right,1,0.632825959724,2017_Jun_02_1010,98.8559695331,Stroop,B-2,1STACS-6,
neutral,right,"[-0.8745098039, -0.2078431373, 0.637254902]", ,11,PECH,,,,,,,,,0,15,15,15,left,0,0.502391505066,2017_Jun_02_1010,98.8559695331,Stroop,B-2,1STACS-6,
neutral,down,"[-0.7725490196, 0.0745098039, -1]", ,13,SOLL,,,,,,,,,0,16,16,16,down,1,0.586121141095,2017_Jun_02_1010,98.8559695331,Stroop,B-2,1STACS-6,
neutralofneutral,right,"[-0.8745098039, -0.2078431373, 0.637254902]", ,17,HALS,,,,,,,,,0,17,17,17,right,1,0.622260091716,2017_Jun_02_1010,98.8559695331,Stroop,B-2,1STACS-6,
neutralofneutral,left,"[0.568627451, -0.7882352941, -0.7882352941]", ,15,HALS,,,,,,,,,0,18,18,18,left,1,0.451031066798,2017_Jun_02_1010,98.8559695331,Stroop,B-2,1STACS-6,
neutral,left,"[0.568627451, -0.7882352941, -0.7882352941]", ,9,PECH,,,,,,,,,0,19,19,19,left,1,0.72961200376,2017_Jun_02_1010,98.8559695331,Stroop,B-2,1STACS-6,
neutralofneutral,down,"[-0.7725490196, 0.0745098039, -1]", ,19,MODE,,,,,,,,,0,20,20,20,down,1,0.654704997423,2017_Jun_02_1010,98.8559695331,Stroop,B-2,1STACS-6,
neutral,down,"[-0.7725490196, 0.0745098039, -1]", ,10,PECH,,,,,,,,,0,21,21,21,down,1,0.982500569206,2017_Jun_02_1010,98.8559695331,Stroop,B-2,1STACS-6,
neutralofneutral,down,"[-0.7725490196, 0.0745098039, -1]", ,16,HALS,,,,,,,,,0,22,22,22,down,1,0.715822821057,2017_Jun_02_1010,98.8559695331,Stroop,B-2,1STACS-6,
neutral,right,"[-0.8745098039, -0.2078431373, 0.637254902]", ,14,SOLL,,,,,,,,,0,23,23,23,right,1,0.616590097345,2017_Jun_02_1010,98.8559695331,Stroop,B-2,1STACS-6,
neutral,left,"[0.568627451, -0.7882352941, -0.7882352941]", ,12,SOLL,,,,,,,,,0,24,24,24,left,1,0.568658027766,2017_Jun_02_1010,98.8559695331,Stroop,B-2,1STACS-6,
incongruent,down,"[-0.7725490196, 0.0745098039, -1]", ,7,BLAU,,,,,,,,,0,25,25,25,down,1,0.722165247259,2017_Jun_02_1010,98.8559695331,Stroop,B-2,1STACS-6,
neutral,down,"[-0.7725490196, 0.0745098039, -1]", ,10,PECH,,,,,,,,,0,26,26,26,down,1,0.571438548754,2017_Jun_02_1010,98.8559695331,Stroop,B-2,1STACS-6,
neutral,left,"[0.568627451, -0.7882352941, -0.7882352941]", ,9,PECH,,,,,,,,,0,27,27,27,left,1,0.800190527008,2017_Jun_02_1010,98.8559695331,Stroop,B-2,1STACS-6,
incongruent,left,"[0.568627451, -0.7882352941, -0.7882352941]", ,3,GRÜN,,,,,,,,,0,28,28,28,left,1,0.594381129445,2017_Jun_02_1010,98.8559695331,Stroop,B-2,1STACS-6,
incongruent,right,"[-0.8745098039, -0.2078431373, 0.637254902]", ,2,ROT,,,,,,,,,0,29,29,29,right,1,0.803642921097,2017_Jun_02_1010,98.8559695331,Stroop,B-2,1STACS-6,
neutral,down,"[-0.7725490196, 0.0745098039, -1]", ,13,SOLL,,,,,,,,,0,30,30,30,down,1,0.674884936493,2017_Jun_02_1010,98.8559695331,Stroop,B-2,1STACS-6,
neutral,right,"[-0.8745098039, -0.2078431373, 0.637254902]", ,11,PECH,,,,,,,,,0,31,31,31,right,1,1.37131059953,2017_Jun_02_1010,98.8559695331,Stroop,B-2,1STACS-6,
incongruent,right,"[-0.8745098039, -0.2078431373, 0.637254902]", ,5,GRÜN,,,,,,,,,0,32,32,32,right,1,0.662284452354,2017_Jun_02_1010,98.8559695331,Stroop,B-2,1STACS-6,
neutral,left,"[0.568627451, -0.7882352941, -0.7882352941]", ,12,SOLL,,,,,,,,,0,33,33,33,left,1,0.648366482332,2017_Jun_02_1010,98.8559695331,Stroop,B-2,1STACS-6,
incongruent,left,"[0.568627451, -0.7882352941, -0.7882352941]", ,6,BLAU,,,,,,,,,0,34,34,34,left,1,0.686902665004,2017_Jun_02_1010,98.8559695331,Stroop,B-2,1STACS-6,
incongruent,down,"[-0.7725490196, 0.0745098039, -1]", ,1,ROT,,,,,,,,,0,35,35,35,down,1,0.776260670001,2017_Jun_02_1010,98.8559695331,Stroop,B-2,1STACS-6,
neutral,right,"[-0.8745098039, -0.2078431373, 0.637254902]", ,14,SOLL,,,,,,,,,0,36,36,36,right,1,0.746904145639,2017_Jun_02_1010,98.8559695331,Stroop,B-2,1STACS-6,
congruent,down,"[-0.7725490196, 0.0745098039, -1]", ,4,GRÜN,,,,,,,,,0,37,37,37,down,1,0.611114820459,2017_Jun_02_1010,98.8559695331,Stroop,B-2,1STACS-6,
neutral,down,"[-0.7725490196, 0.0745098039, -1]", ,10,PECH,,,,,,,,,0,38,38,38,down,1,0.547296094895,2017_Jun_02_1010,98.8559695331,Stroop,B-2,1STACS-6,
neutral,down,"[-0.7725490196, 0.0745098039, -1]", ,13,SOLL,,,,,,,,,0,39,39,39,down,1,0.469540123116,2017_Jun_02_1010,98.8559695331,Stroop,B-2,1STACS-6,
congruent,right,"[-0.8745098039, -0.2078431373, 0.637254902]", ,8,BLAU,,,,,,,,,0,40,40,40,right,1,0.632638226367,2017_Jun_02_1010,98.8559695331,Stroop,B-2,1STACS-6,
congruent,right,"[-0.8745098039, -0.2078431373, 0.637254902]", ,8,BLAU,,,,,,,,,0,41,41,41,right,1,0.534189401167,2017_Jun_02_1010,98.8559695331,Stroop,B-2,1STACS-6,
neutral,right,"[-0.8745098039, -0.2078431373, 0.637254902]", ,11,PECH,,,,,,,,,0,42,42,42,right,1,0.513095379441,2017_Jun_02_1010,98.8559695331,Stroop,B-2,1STACS-6,
congruent,left,"[0.568627451, -0.7882352941, -0.7882352941]", ,0,ROT,,,,,,,,,0,43,43,43,left,1,0.590777878194,2017_Jun_02_1010,98.8559695331,Stroop,B-2,1STACS-6,
congruent,down,"[-0.7725490196, 0.0745098039, -1]", ,4,GRÜN,,,,,,,,,0,44,44,44,down,1,0.448996450666,2017_Jun_02_1010,98.8559695331,Stroop,B-2,1STACS-6,
neutral,right,"[-0.8745098039, -0.2078431373, 0.637254902]", ,14,SOLL,,,,,,,,,0,45,45,45,right,1,0.619746085047,2017_Jun_02_1010,98.8559695331,Stroop,B-2,1STACS-6,
congruent,left,"[0.568627451, -0.7882352941, -0.7882352941]", ,0,ROT,,,,,,,,,0,46,46,46,left,1,0.506520242098,2017_Jun_02_1010,98.8559695331,Stroop,B-2,1STACS-6,
neutral,left,"[0.568627451, -0.7882352941, -0.7882352941]", ,12,SOLL,,,,,,,,,0,47,47,47,left,1,0.619552205657,2017_Jun_02_1010,98.8559695331,Stroop,B-2,1STACS-6,
neutral,left,"[0.568627451, -0.7882352941, -0.7882352941]", ,9,PECH,,,,,,,,,0,48,48,48,left,1,0.50427610213,2017_Jun_02_1010,98.8559695331,Stroop,B-2,1STACS-6,
fix,return,white, ,21,+,,,,,,,,,0,49,49,49,None,0,,2017_Jun_02_1010,98.8559695331,Stroop,B-2,1STACS-6,
fix,return,white, ,21,+,,,,,,,,,0,50,50,50,None,0,,2017_Jun_02_1010,98.8559695331,Stroop,B-2,1STACS-6,
fix,return,white, ,21,+,,,,,,,,,0,51,51,51,None,0,,2017_Jun_02_1010,98.8559695331,Stroop,B-2,1STACS-6,
fix,return,white, ,21,+,,,,,,,,,0,52,52,52,None,0,,2017_Jun_02_1010,98.8559695331,Stroop,B-2,1STACS-6,
fix,return,white, ,21,+,,,,,,,,,0,53,53,53,None,0,,2017_Jun_02_1010,98.8559695331,Stroop,B-2,1STACS-6,
fix,return,white, ,21,+,,,,,,,,,0,54,54,54,None,0,,2017_Jun_02_1010,98.8559695331,Stroop,B-2,1STACS-6,
fix,return,white, ,21,+,,,,,,,,,0,55,55,55,None,0,,2017_Jun_02_1010,98.8559695331,Stroop,B-2,1STACS-6,
fix,return,white, ,21,+,,,,,,,,,0,56,56,56,None,0,,2017_Jun_02_1010,98.8559695331,Stroop,B-2,1STACS-6,
fix,return,white, ,21,+,,,,,,,,,0,57,57,57,None,0,,2017_Jun_02_1010,98.8559695331,Stroop,B-2,1STACS-6,
fix,return,white, ,21,+,,,,,,,,,0,58,58,58,None,0,,2017_Jun_02_1010,98.8559695331,Stroop,B-2,1STACS-6,
fix,return,white, ,21,+,,,,,,,,,0,59,59,59,None,0,,2017_Jun_02_1010,98.8559695331,Stroop,B-2,1STACS-6,
fix,return,white, ,21,+,,,,,,,,,0,60,60,60,None,0,,2017_Jun_02_1010,98.8559695331,Stroop,B-2,1STACS-6,
fix,return,white,+,22,+,,,,,,,,,0,61,61,61,None,0,,2017_Jun_02_1010,98.8559695331,Stroop,B-2,1STACS-6,
neutral,right,"[-0.8745098039, -0.2078431373, 0.637254902]", ,11,PECH,,,,,,,,,0,62,62,62,right,1,0.70867777888,2017_Jun_02_1010,98.8559695331,Stroop,B-2,1STACS-6,
congruent,right,"[-0.8745098039, -0.2078431373, 0.637254902]", ,8,BLAU,,,,,,,,,0,63,63,63,right,1,0.483348861378,2017_Jun_02_1010,98.8559695331,Stroop,B-2,1STACS-6,
congruent,right,"[-0.8745098039, -0.2078431373, 0.637254902]", ,8,BLAU,,,,,,,,,0,64,64,64,right,1,0.673579463312,2017_Jun_02_1010,98.8559695331,Stroop,B-2,1STACS-6,
congruent,down,"[-0.7725490196, 0.0745098039, -1]", ,4,GRÜN,,,,,,,,,0,65,65,65,down,1,0.641117795697,2017_Jun_02_1010,98.8559695331,Stroop,B-2,1STACS-6,
neutral,down,"[-0.7725490196, 0.0745098039, -1]", ,13,SOLL,,,,,,,,,0,66,66,66,down,1,0.553417263926,2017_Jun_02_1010,98.8559695331,Stroop,B-2,1STACS-6,
congruent,left,"[0.568627451, -0.7882352941, -0.7882352941]", ,0,ROT,,,,,,,,,0,67,67,67,left,1,0.570139221605,2017_Jun_02_1010,98.8559695331,Stroop,B-2,1STACS-6,
neutral,right,"[-0.8745098039, -0.2078431373, 0.637254902]", ,14,SOLL,,,,,,,,,0,68,68,68,right,1,0.6488103935,2017_Jun_02_1010,98.8559695331,Stroop,B-2,1STACS-6,
neutral,left,"[0.568627451, -0.7882352941, -0.7882352941]", ,9,PECH,,,,,,,,,0,69,69,69,left,1,0.545397250209,2017_Jun_02_1010,98.8559695331,Stroop,B-2,1STACS-6,
congruent,down,"[-0.7725490196, 0.0745098039, -1]", ,4,GRÜN,,,,,,,,,0,70,70,70,down,1,0.579901635543,2017_Jun_02_1010,98.8559695331,Stroop,B-2,1STACS-6,
congruent,left,"[0.568627451, -0.7882352941, -0.7882352941]", ,0,ROT,,,,,,,,,0,71,71,71,left,1,0.635652296591,2017_Jun_02_1010,98.8559695331,Stroop,B-2,1STACS-6,
neutral,left,"[0.568627451, -0.7882352941, -0.7882352941]", ,12,SOLL,,,,,,,,,0,72,72,72,left,1,0.5233220982,2017_Jun_02_1010,98.8559695331,Stroop,B-2,1STACS-6,
neutral,down,"[-0.7725490196, 0.0745098039, -1]", ,10,PECH,,,,,,,,,0,73,73,73,down,1,0.611586668138,2017_Jun_02_1010,98.8559695331,Stroop,B-2,1STACS-6,
neutral,left,"[0.568627451, -0.7882352941, -0.7882352941]", ,12,SOLL,,,,,,,,,0,74,74,74,left,1,0.597868164809,2017_Jun_02_1010,98.8559695331,Stroop,B-2,1STACS-6,
neutralofneutral,down,"[-0.7725490196, 0.0745098039, -1]", ,16,HALS,,,,,,,,,0,75,75,75,down,1,0.963159842941,2017_Jun_02_1010,98.8559695331,Stroop,B-2,1STACS-6,
neutral,down,"[-0.7725490196, 0.0745098039, -1]", ,10,PECH,,,,,,,,,0,76,76,76,down,1,0.545257847017,2017_Jun_02_1010,98.8559695331,Stroop,B-2,1STACS-6,
neutral,left,"[0.568627451, -0.7882352941, -0.7882352941]", ,9,PECH,,,,,,,,,0,77,77,77,left,1,0.587954614343,2017_Jun_02_1010,98.8559695331,Stroop,B-2,1STACS-6,
neutral,right,"[-0.8745098039, -0.2078431373, 0.637254902]", ,14,SOLL,,,,,,,,,0,78,78,78,right,1,0.776406219226,2017_Jun_02_1010,98.8559695331,Stroop,B-2,1STACS-6,
neutralofneutral,left,"[0.568627451, -0.7882352941, -0.7882352941]", ,18,MODE,,,,,,,,,0,79,79,79,left,1,0.593305573753,2017_Jun_02_1010,98.8559695331,Stroop,B-2,1STACS-6,
neutral,right,"[-0.8745098039, -0.2078431373, 0.637254902]", ,11,PECH,,,,,,,,,0,80,80,80,right,1,0.868985583364,2017_Jun_02_1010,98.8559695331,Stroop,B-2,1STACS-6,
neutralofneutral,down,"[-0.7725490196, 0.0745098039, -1]", ,19,MODE,,,,,,,,,0,81,81,81,down,1,0.658249582,2017_Jun_02_1010,98.8559695331,Stroop,B-2,1STACS-6,
neutral,down,"[-0.7725490196, 0.0745098039, -1]", ,13,SOLL,,,,,,,,,0,82,82,82,down,1,0.555398241955,2017_Jun_02_1010,98.8559695331,Stroop,B-2,1STACS-6,
neutralofneutral,right,"[-0.8745098039, -0.2078431373, 0.637254902]", ,20,MODE,,,,,,,,,0,83,83,83,right,1,0.83012813081,2017_Jun_02_1010,98.8559695331,Stroop,B-2,1STACS-6,
neutralofneutral,left,"[0.568627451, -0.7882352941, -0.7882352941]", ,15,HALS,,,,,,,,,0,84,84,84,left,1,0.569017291304,2017_Jun_02_1010,98.8559695331,Stroop,B-2,1STACS-6,
neutralofneutral,right,"[-0.8745098039, -0.2078431373, 0.637254902]", ,17,HALS,,,,,,,,,0,85,85,85,right,1,1.01871047857,2017_Jun_02_1010,98.8559695331,Stroop,B-2,1STACS-6,
neutral,down,"[-0.7725490196, 0.0745098039, -1]", ,13,SOLL,,,,,,,,,0,86,86,86,down,1,0.747627980651,2017_Jun_02_1010,98.8559695331,Stroop,B-2,1STACS-6,
incongruent,down,"[-0.7725490196, 0.0745098039, -1]", ,7,BLAU,,,,,,,,,0,87,87,87,down,1,0.654355511664,2017_Jun_02_1010,98.8559695331,Stroop,B-2,1STACS-6,
neutral,left,"[0.568627451, -0.7882352941, -0.7882352941]", ,9,PECH,,,,,,,,,0,88,88,88,left,1,0.715285043211,2017_Jun_02_1010,98.8559695331,Stroop,B-2,1STACS-6,
neutral,right,"[-0.8745098039, -0.2078431373, 0.637254902]", ,14,SOLL,,,,,,,,,0,89,89,89,right,1,0.510175734626,2017_Jun_02_1010,98.8559695331,Stroop,B-2,1STACS-6,
incongruent,right,"[-0.8745098039, -0.2078431373, 0.637254902]", ,2,ROT,,,,,,,,,0,90,90,90,right,1,0.826607850998,2017_Jun_02_1010,98.8559695331,Stroop,B-2,1STACS-6,
incongruent,right,"[-0.8745098039, -0.2078431373, 0.637254902]", ,5,GRÜN,,,,,,,,,0,91,91,91,down,0,0.983663845544,2017_Jun_02_1010,98.8559695331,Stroop,B-2,1STACS-6,
incongruent,left,"[0.568627451, -0.7882352941, -0.7882352941]", ,6,BLAU,,,,,,,,,0,92,92,92,left,1,1.04655284401,2017_Jun_02_1010,98.8559695331,Stroop,B-2,1STACS-6,
neutral,left,"[0.568627451, -0.7882352941, -0.7882352941]", ,12,SOLL,,,,,,,,,0,93,93,93,left,1,1.0216739837,2017_Jun_02_1010,98.8559695331,Stroop,B-2,1STACS-6,
incongruent,left,"[0.568627451, -0.7882352941, -0.7882352941]", ,3,GRÜN,,,,,,,,,0,94,94,94,left,1,1.2617899761,2017_Jun_02_1010,98.8559695331,Stroop,B-2,1STACS-6,
neutral,right,"[-0.8745098039, -0.2078431373, 0.637254902]", ,11,PECH,,,,,,,,,0,95,95,95,right,1,0.869571970739,2017_Jun_02_1010,98.8559695331,Stroop,B-2,1STACS-6,
neutral,down,"[-0.7725490196, 0.0745098039, -1]", ,10,PECH,,,,,,,,,0,96,96,96,down,1,0.687001001524,2017_Jun_02_1010,98.8559695331,Stroop,B-2,1STACS-6,
incongruent,down,"[-0.7725490196, 0.0745098039, -1]", ,1,ROT,,,,,,,,,0,97,97,97,down,1,0.678773419527,2017_Jun_02_1010,98.8559695331,Stroop,B-2,1STACS-6,
fix,return,white, ,21,+,,,,,,,,,0,98,98,98,None,0,,2017_Jun_02_1010,98.8559695331,Stroop,B-2,1STACS-6,
fix,return,white, ,21,+,,,,,,,,,0,99,99,99,None,0,,2017_Jun_02_1010,98.8559695331,Stroop,B-2,1STACS-6,
fix,return,white, ,21,+,,,,,,,,,0,100,100,100,None,0,,2017_Jun_02_1010,98.8559695331,Stroop,B-2,1STACS-6,
fix,return,white, ,21,+,,,,,,,,,0,101,101,101,None,0,,2017_Jun_02_1010,98.8559695331,Stroop,B-2,1STACS-6,
fix,return,white, ,21,+,,,,,,,,,0,102,102,102,None,0,,2017_Jun_02_1010,98.8559695331,Stroop,B-2,1STACS-6,
fix,return,white, ,21,+,,,,,,,,,0,103,103,103,None,0,,2017_Jun_02_1010,98.8559695331,Stroop,B-2,1STACS-6,
fix,return,white, ,21,+,,,,,,,,,0,104,104,104,None,0,,2017_Jun_02_1010,98.8559695331,Stroop,B-2,1STACS-6,
fix,return,white, ,21,+,,,,,,,,,0,105,105,105,None,0,,2017_Jun_02_1010,98.8559695331,Stroop,B-2,1STACS-6,
fix,return,white, ,21,+,,,,,,,,,0,106,106,106,None,0,,2017_Jun_02_1010,98.8559695331,Stroop,B-2,1STACS-6,
fix,return,white, ,21,+,,,,,,,,,0,107,107,107,None,0,,2017_Jun_02_1010,98.8559695331,Stroop,B-2,1STACS-6,
fix,return,white, ,21,+,,,,,,,,,0,108,108,108,None,0,,2017_Jun_02_1010,98.8559695331,Stroop,B-2,1STACS-6,
fix,return,white, ,21,+,,,,,,,,,0,109,109,109,None,0,,2017_Jun_02_1010,98.8559695331,Stroop,B-2,1STACS-6,
fix,return,white,+,22,+,,,,,,,,,0,110,110,110,None,0,,2017_Jun_02_1010,98.8559695331,Stroop,B-2,1STACS-6,
neutralofneutral,down,"[-0.7725490196, 0.0745098039, -1]", ,16,HALS,,,,,,,,,0,111,111,111,down,1,0.933446010597,2017_Jun_02_1010,98.8559695331,Stroop,B-2,1STACS-6,
neutral,down,"[-0.7725490196, 0.0745098039, -1]", ,13,SOLL,,,,,,,,,0,112,112,112,down,1,0.587750119079,2017_Jun_02_1010,98.8559695331,Stroop,B-2,1STACS-6,
neutralofneutral,right,"[-0.8745098039, -0.2078431373, 0.637254902]", ,20,MODE,,,,,,,,,0,113,113,113,right,1,0.6013982224,2017_Jun_02_1010,98.8559695331,Stroop,B-2,1STACS-6,
neutralofneutral,down,"[-0.7725490196, 0.0745098039, -1]", ,19,MODE,,,,,,,,,0,114,114,114,down,1,0.45143810177,2017_Jun_02_1010,98.8559695331,Stroop,B-2,1STACS-6,
neutral,right,"[-0.8745098039, -0.2078431373, 0.637254902]", ,14,SOLL,,,,,,,,,0,115,115,115,right,1,0.606059988071,2017_Jun_02_1010,98.8559695331,Stroop,B-2,1STACS-6,
neutralofneutral,right,"[-0.8745098039, -0.2078431373, 0.637254902]", ,17,HALS,,,,,,,,,0,116,116,116,right,1,0.513102642934,2017_Jun_02_1010,98.8559695331,Stroop,B-2,1STACS-6,
neutralofneutral,left,"[0.568627451, -0.7882352941, -0.7882352941]", ,18,MODE,,,,,,,,,0,117,117,117,left,1,0.537092842805,2017_Jun_02_1010,98.8559695331,Stroop,B-2,1STACS-6,
neutral,down,"[-0.7725490196, 0.0745098039, -1]", ,10,PECH,,,,,,,,,0,118,118,118,down,1,0.556242762697,2017_Jun_02_1010,98.8559695331,Stroop,B-2,1STACS-6,
neutral,left,"[0.568627451, -0.7882352941, -0.7882352941]", ,9,PECH,,,,,,,,,0,119,119,119,left,1,0.534876359985,2017_Jun_02_1010,98.8559695331,Stroop,B-2,1STACS-6,
neutral,left,"[0.568627451, -0.7882352941, -0.7882352941]", ,12,SOLL,,,,,,,,,0,120,120,120,left,1,0.510476331489,2017_Jun_02_1010,98.8559695331,Stroop,B-2,1STACS-6,
neutral,right,"[-0.8745098039, -0.2078431373, 0.637254902]", ,11,PECH,,,,,,,,,0,121,121,121,right,1,0.577454676502,2017_Jun_02_1010,98.8559695331,Stroop,B-2,1STACS-6,
neutralofneutral,left,"[0.568627451, -0.7882352941, -0.7882352941]", ,15,HALS,,,,,,,,,0,122,122,122,left,1,0.609381080556,2017_Jun_02_1010,98.8559695331,Stroop,B-2,1STACS-6,
neutral,left,"[0.568627451, -0.7882352941, -0.7882352941]", ,9,PECH,,,,,,,,,0,123,123,123,left,1,0.56679354499,2017_Jun_02_1010,98.8559695331,Stroop,B-2,1STACS-6,
neutral,right,"[-0.8745098039, -0.2078431373, 0.637254902]", ,14,SOLL,,,,,,,,,0,124,124,124,right,1,0.658765010637,2017_Jun_02_1010,98.8559695331,Stroop,B-2,1STACS-6,
congruent,left,"[0.568627451, -0.7882352941, -0.7882352941]", ,0,ROT,,,,,,,,,0,125,125,125,left,1,0.579470854536,2017_Jun_02_1010,98.8559695331,Stroop,B-2,1STACS-6,
congruent,right,"[-0.8745098039, -0.2078431373, 0.637254902]", ,8,BLAU,,,,,,,,,0,126,126,126,right,1,0.56627252905,2017_Jun_02_1010,98.8559695331,Stroop,B-2,1STACS-6,
congruent,left,"[0.568627451, -0.7882352941, -0.7882352941]", ,0,ROT,,,,,,,,,0,127,127,127,left,1,0.450666774688,2017_Jun_02_1010,98.8559695331,Stroop,B-2,1STACS-6,
neutral,left,"[0.568627451, -0.7882352941, -0.7882352941]", ,12,SOLL,,,,,,,,,0,128,128,128,left,1,0.499604279315,2017_Jun_02_1010,98.8559695331,Stroop,B-2,1STACS-6,
neutral,right,"[-0.8745098039, -0.2078431373, 0.637254902]", ,11,PECH,,,,,,,,,0,129,129,129,right,1,0.641071979819,2017_Jun_02_1010,98.8559695331,Stroop,B-2,1STACS-6,
congruent,down,"[-0.7725490196, 0.0745098039, -1]", ,4,GRÜN,,,,,,,,,0,130,130,130,down,1,0.566593240203,2017_Jun_02_1010,98.8559695331,Stroop,B-2,1STACS-6,
congruent,down,"[-0.7725490196, 0.0745098039, -1]", ,4,GRÜN,,,,,,,,,0,131,131,131,down,1,0.545429377197,2017_Jun_02_1010,98.8559695331,Stroop,B-2,1STACS-6,
neutral,down,"[-0.7725490196, 0.0745098039, -1]", ,13,SOLL,,,,,,,,,0,132,132,132,down,1,0.683693318564,2017_Jun_02_1010,98.8559695331,Stroop,B-2,1STACS-6,
congruent,right,"[-0.8745098039, -0.2078431373, 0.637254902]", ,8,BLAU,,,,,,,,,0,133,133,133,right,1,0.655108680014,2017_Jun_02_1010,98.8559695331,Stroop,B-2,1STACS-6,
neutral,down,"[-0.7725490196, 0.0745098039, -1]", ,10,PECH,,,,,,,,,0,134,134,134,down,1,0.708647607447,2017_Jun_02_1010,98.8559695331,Stroop,B-2,1STACS-6,
incongruent,left,"[0.568627451, -0.7882352941, -0.7882352941]", ,3,GRÜN,,,,,,,,,0,135,135,135,left,1,0.665647170241,2017_Jun_02_1010,98.8559695331,Stroop,B-2,1STACS-6,
neutral,down,"[-0.7725490196, 0.0745098039, -1]", ,13,SOLL,,,,,,,,,0,136,136,136,down,1,0.715076636835,2017_Jun_02_1010,98.8559695331,Stroop,B-2,1STACS-6,
neutral,right,"[-0.8745098039, -0.2078431373, 0.637254902]", ,11,PECH,,,,,,,,,0,137,137,137,right,1,0.794282234194,2017_Jun_02_1010,98.8559695331,Stroop,B-2,1STACS-6,
neutral,right,"[-0.8745098039, -0.2078431373, 0.637254902]", ,14,SOLL,,,,,,,,,0,138,138,138,right,1,0.854218622758,2017_Jun_02_1010,98.8559695331,Stroop,B-2,1STACS-6,
incongruent,down,"[-0.7725490196, 0.0745098039, -1]", ,7,BLAU,,,,,,,,,0,139,139,139,down,1,0.643939662722,2017_Jun_02_1010,98.8559695331,Stroop,B-2,1STACS-6,
neutral,left,"[0.568627451, -0.7882352941, -0.7882352941]", ,12,SOLL,,,,,,,,,0,140,140,140,left,1,0.44833686963,2017_Jun_02_1010,98.8559695331,Stroop,B-2,1STACS-6,
neutral,down,"[-0.7725490196, 0.0745098039, -1]", ,10,PECH,,,,,,,,,0,141,141,141,down,1,0.600735009617,2017_Jun_02_1010,98.8559695331,Stroop,B-2,1STACS-6,
incongruent,right,"[-0.8745098039, -0.2078431373, 0.637254902]", ,5,GRÜN,,,,,,,,,0,142,142,142,right,1,0.630679318182,2017_Jun_02_1010,98.8559695331,Stroop,B-2,1STACS-6,
incongruent,down,"[-0.7725490196, 0.0745098039, -1]", ,1,ROT,,,,,,,,,0,143,143,143,down,1,0.697223529806,2017_Jun_02_1010,98.8559695331,Stroop,B-2,1STACS-6,
neutral,left,"[0.568627451, -0.7882352941, -0.7882352941]", ,9,PECH,,,,,,,,,0,144,144,144,left,1,0.587840633376,2017_Jun_02_1010,98.8559695331,Stroop,B-2,1STACS-6,
incongruent,left,"[0.568627451, -0.7882352941, -0.7882352941]", ,6,BLAU,,,,,,,,,0,145,145,145,left,1,0.449233072919,2017_Jun_02_1010,98.8559695331,Stroop,B-2,1STACS-6,
incongruent,right,"[-0.8745098039, -0.2078431373, 0.637254902]", ,2,ROT,,,,,,,,,0,146,146,146,right,1,1.02363233316,2017_Jun_02_1010,98.8559695331,Stroop,B-2,1STACS-6,
fix,return,white, ,21,+,,,,,,,,,0,147,147,147,None,0,,2017_Jun_02_1010,98.8559695331,Stroop,B-2,1STACS-6,
fix,return,white, ,21,+,,,,,,,,,0,148,148,148,None,0,,2017_Jun_02_1010,98.8559695331,Stroop,B-2,1STACS-6,
fix,return,white, ,21,+,,,,,,,,,0,149,149,149,None,0,,2017_Jun_02_1010,98.8559695331,Stroop,B-2,1STACS-6,
fix,return,white, ,21,+,,,,,,,,,0,150,150,150,None,0,,2017_Jun_02_1010,98.8559695331,Stroop,B-2,1STACS-6,
fix,return,white, ,21,+,,,,,,,,,0,151,151,151,None,0,,2017_Jun_02_1010,98.8559695331,Stroop,B-2,1STACS-6,
fix,return,white, ,21,+,,,,,,,,,0,152,152,152,None,0,,2017_Jun_02_1010,98.8559695331,Stroop,B-2,1STACS-6,
fix,return,white, ,21,+,,,,,,,,,0,153,153,153,None,0,,2017_Jun_02_1010,98.8559695331,Stroop,B-2,1STACS-6,
fix,return,white, ,21,+,,,,,,,,,0,154,154,154,None,0,,2017_Jun_02_1010,98.8559695331,Stroop,B-2,1STACS-6,
fix,return,white, ,21,+,,,,,,,,,0,155,155,155,None,0,,2017_Jun_02_1010,98.8559695331,Stroop,B-2,1STACS-6,
fix,return,white, ,21,+,,,,,,,,,0,156,156,156,None,0,,2017_Jun_02_1010,98.8559695331,Stroop,B-2,1STACS-6,
fix,return,white, ,21,+,,,,,,,,,0,157,157,157,None,0,,2017_Jun_02_1010,98.8559695331,Stroop,B-2,1STACS-6,
fix,return,white, ,21,+,,,,,,,,,0,158,158,158,None,0,,2017_Jun_02_1010,98.8559695331,Stroop,B-2,1STACS-6,
fix,return,white,+,22,+,,,,,,,,,0,159,159,159,None,0,,2017_Jun_02_1010,98.8559695331,Stroop,B-2,1STACS-6,
neutral,left,"[0.568627451, -0.7882352941, -0.7882352941]", ,12,SOLL,,,,,,,,,0,160,160,160,left,1,0.595491605777,2017_Jun_02_1010,98.8559695331,Stroop,B-2,1STACS-6,
neutral,left,"[0.568627451, -0.7882352941, -0.7882352941]", ,9,PECH,,,,,,,,,0,161,161,161,left,1,0.438552944579,2017_Jun_02_1010,98.8559695331,Stroop,B-2,1STACS-6,
incongruent,right,"[-0.8745098039, -0.2078431373, 0.637254902]", ,2,ROT,,,,,,,,,0,162,162,162,right,1,0.70821682644,2017_Jun_02_1010,98.8559695331,Stroop,B-2,1STACS-6,
neutral,right,"[-0.8745098039, -0.2078431373, 0.637254902]", ,14,SOLL,,,,,,,,,0,163,163,163,right,1,0.722992447364,2017_Jun_02_1010,98.8559695331,Stroop,B-2,1STACS-6,
incongruent,left,"[0.568627451, -0.7882352941, -0.7882352941]", ,3,GRÜN,,,,,,,,,0,164,164,164,None,0,,2017_Jun_02_1010,98.8559695331,Stroop,B-2,1STACS-6,
neutral,down,"[-0.7725490196, 0.0745098039, -1]", ,10,PECH,,,,,,,,,0,165,165,165,down,1,1.00807532801,2017_Jun_02_1010,98.8559695331,Stroop,B-2,1STACS-6,
incongruent,right,"[-0.8745098039, -0.2078431373, 0.637254902]", ,5,GRÜN,,,,,,,,,0,166,166,166,right,1,0.611566833215,2017_Jun_02_1010,98.8559695331,Stroop,B-2,1STACS-6,
incongruent,down,"[-0.7725490196, 0.0745098039, -1]", ,1,ROT,,,,,,,,,0,167,167,167,down,1,0.635478810854,2017_Jun_02_1010,98.8559695331,Stroop,B-2,1STACS-6,
incongruent,left,"[0.568627451, -0.7882352941, -0.7882352941]", ,6,BLAU,,,,,,,,,0,168,168,168,left,1,0.729572333914,2017_Jun_02_1010,98.8559695331,Stroop,B-2,1STACS-6,
incongruent,down,"[-0.7725490196, 0.0745098039, -1]", ,7,BLAU,,,,,,,,,0,169,169,169,down,1,0.558307829626,2017_Jun_02_1010,98.8559695331,Stroop,B-2,1STACS-6,
neutral,right,"[-0.8745098039, -0.2078431373, 0.637254902]", ,11,PECH,,,,,,,,,0,170,170,170,right,1,0.547152221861,2017_Jun_02_1010,98.8559695331,Stroop,B-2,1STACS-6,
neutral,down,"[-0.7725490196, 0.0745098039, -1]", ,13,SOLL,,,,,,,,,0,171,171,171,down,1,0.531823178644,2017_Jun_02_1010,98.8559695331,Stroop,B-2,1STACS-6,
neutral,left,"[0.568627451, -0.7882352941, -0.7882352941]", ,12,SOLL,,,,,,,,,0,172,172,172,left,1,0.458291766132,2017_Jun_02_1010,98.8559695331,Stroop,B-2,1STACS-6,
neutralofneutral,right,"[-0.8745098039, -0.2078431373, 0.637254902]", ,17,HALS,,,,,,,,,0,173,173,173,down,0,0.71645223066,2017_Jun_02_1010,98.8559695331,Stroop,B-2,1STACS-6,
neutralofneutral,down,"[-0.7725490196, 0.0745098039, -1]", ,19,MODE,,,,,,,,,0,174,174,174,down,1,0.655217073679,2017_Jun_02_1010,98.8559695331,Stroop,B-2,1STACS-6,
neutral,down,"[-0.7725490196, 0.0745098039, -1]", ,13,SOLL,,,,,,,,,0,175,175,175,down,1,0.619248535777,2017_Jun_02_1010,98.8559695331,Stroop,B-2,1STACS-6,
neutral,down,"[-0.7725490196, 0.0745098039, -1]", ,10,PECH,,,,,,,,,0,176,176,176,down,1,0.56878877064,2017_Jun_02_1010,98.8559695331,Stroop,B-2,1STACS-6,
neutral,left,"[0.568627451, -0.7882352941, -0.7882352941]", ,9,PECH,,,,,,,,,0,177,177,177,left,1,0.633429388372,2017_Jun_02_1010,98.8559695331,Stroop,B-2,1STACS-6,
neutralofneutral,down,"[-0.7725490196, 0.0745098039, -1]", ,16,HALS,,,,,,,,,0,178,178,178,down,1,0.515098986044,2017_Jun_02_1010,98.8559695331,Stroop,B-2,1STACS-6,
neutralofneutral,left,"[0.568627451, -0.7882352941, -0.7882352941]", ,18,MODE,,,,,,,,,0,179,179,179,left,1,0.582271489812,2017_Jun_02_1010,98.8559695331,Stroop,B-2,1STACS-6,
neutral,right,"[-0.8745098039, -0.2078431373, 0.637254902]", ,11,PECH,,,,,,,,,0,180,180,180,right,1,0.622763787018,2017_Jun_02_1010,98.8559695331,Stroop,B-2,1STACS-6,
neutralofneutral,right,"[-0.8745098039, -0.2078431373, 0.637254902]", ,20,MODE,,,,,,,,,0,181,181,181,right,1,0.949184044341,2017_Jun_02_1010,98.8559695331,Stroop,B-2,1STACS-6,
neutral,right,"[-0.8745098039, -0.2078431373, 0.637254902]", ,14,SOLL,,,,,,,,,0,182,182,182,right,1,0.864832262201,2017_Jun_02_1010,98.8559695331,Stroop,B-2,1STACS-6,
neutralofneutral,left,"[0.568627451, -0.7882352941, -0.7882352941]", ,15,HALS,,,,,,,,,0,183,183,183,left,1,0.697510437779,2017_Jun_02_1010,98.8559695331,Stroop,B-2,1STACS-6,
neutral,right,"[-0.8745098039, -0.2078431373, 0.637254902]", ,11,PECH,,,,,,,,,0,184,184,184,right,1,0.770011831113,2017_Jun_02_1010,98.8559695331,Stroop,B-2,1STACS-6,
congruent,left,"[0.568627451, -0.7882352941, -0.7882352941]", ,0,ROT,,,,,,,,,0,185,185,185,left,1,0.504306832293,2017_Jun_02_1010,98.8559695331,Stroop,B-2,1STACS-6,
neutral,left,"[0.568627451, -0.7882352941, -0.7882352941]", ,9,PECH,,,,,,,,,0,186,186,186,left,1,0.715992116316,2017_Jun_02_1010,98.8559695331,Stroop,B-2,1STACS-6,
neutral,down,"[-0.7725490196, 0.0745098039, -1]", ,13,SOLL,,,,,,,,,0,187,187,187,down,1,0.616650440209,2017_Jun_02_1010,98.8559695331,Stroop,B-2,1STACS-6,
neutral,left,"[0.568627451, -0.7882352941, -0.7882352941]", ,12,SOLL,,,,,,,,,0,188,188,188,left,1,0.595254983525,2017_Jun_02_1010,98.8559695331,Stroop,B-2,1STACS-6,
congruent,down,"[-0.7725490196, 0.0745098039, -1]", ,4,GRÜN,,,,,,,,,0,189,189,189,down,1,0.556267626192,2017_Jun_02_1010,98.8559695331,Stroop,B-2,1STACS-6,
congruent,down,"[-0.7725490196, 0.0745098039, -1]", ,4,GRÜN,,,,,,,,,0,190,190,190,down,1,0.686561839564,2017_Jun_02_1010,98.8559695331,Stroop,B-2,1STACS-6,
congruent,left,"[0.568627451, -0.7882352941, -0.7882352941]", ,0,ROT,,,,,,,,,0,191,191,191,left,1,0.517443138723,2017_Jun_02_1010,98.8559695331,Stroop,B-2,1STACS-6,
neutral,down,"[-0.7725490196, 0.0745098039, -1]", ,10,PECH,,,,,,,,,0,192,192,192,down,1,0.472503069524,2017_Jun_02_1010,98.8559695331,Stroop,B-2,1STACS-6,
congruent,right,"[-0.8745098039, -0.2078431373, 0.637254902]", ,8,BLAU,,,,,,,,,0,193,193,193,right,1,0.654930724435,2017_Jun_02_1010,98.8559695331,Stroop,B-2,1STACS-6,
neutral,right,"[-0.8745098039, -0.2078431373, 0.637254902]", ,14,SOLL,,,,,,,,,0,194,194,194,right,1,0.768927335737,2017_Jun_02_1010,98.8559695331,Stroop,B-2,1STACS-6,
congruent,right,"[-0.8745098039, -0.2078431373, 0.637254902]", ,8,BLAU,,,,,,,,,0,195,195,195,right,1,0.526268003336,2017_Jun_02_1010,98.8559695331,Stroop,B-2,1STACS-6,
fix,return,white, ,21,+,,,,,,,,,0,196,196,196,None,0,,2017_Jun_02_1010,98.8559695331,Stroop,B-2,1STACS-6,
fix,return,white, ,21,+,,,,,,,,,0,197,197,197,None,0,,2017_Jun_02_1010,98.8559695331,Stroop,B-2,1STACS-6,
fix,return,white, ,21,+,,,,,,,,,0,198,198,198,None,0,,2017_Jun_02_1010,98.8559695331,Stroop,B-2,1STACS-6,
fix,return,white, ,21,+,,,,,,,,,0,199,199,199,None,0,,2017_Jun_02_1010,98.8559695331,Stroop,B-2,1STACS-6,
fix,return,white, ,21,+,,,,,,,,,0,200,200,200,None,0,,2017_Jun_02_1010,98.8559695331,Stroop,B-2,1STACS-6,
fix,return,white, ,21,+,,,,,,,,,0,201,201,201,None,0,,2017_Jun_02_1010,98.8559695331,Stroop,B-2,1STACS-6,
fix,return,white, ,21,+,,,,,,,,,0,202,202,202,None,0,,2017_Jun_02_1010,98.8559695331,Stroop,B-2,1STACS-6,
fix,return,white, ,21,+,,,,,,,,,0,203,203,203,None,0,,2017_Jun_02_1010,98.8559695331,Stroop,B-2,1STACS-6,
fix,return,white, ,21,+,,,,,,,,,0,204,204,204,None,0,,2017_Jun_02_1010,98.8559695331,Stroop,B-2,1STACS-6,
fix,return,white, ,21,+,,,,,,,,,0,205,205,205,None,0,,2017_Jun_02_1010,98.8559695331,Stroop,B-2,1STACS-6,
fix,return,white, ,21,+,,,,,,,,,0,206,206,206,None,0,,2017_Jun_02_1010,98.8559695331,Stroop,B-2,1STACS-6,
fix,return,white, ,21,+,,,,,,,,,0,207,207,207,None,0,,2017_Jun_02_1010,98.8559695331,Stroop,B-2,1STACS-6,
fix,return,white,+,22,+,,,,,,,,,0,208,208,208,None,0,,2017_Jun_02_1010,98.8559695331,Stroop,B-2,1STACS-6,
congruent,left,"[0.568627451, -0.7882352941, -0.7882352941]", ,0,ROT,,,,,,,,,0,209,209,209,left,1,0.592933738785,2017_Jun_02_1010,98.8559695331,Stroop,B-2,1STACS-6,
neutral,left,"[0.568627451, -0.7882352941, -0.7882352941]", ,9,PECH,,,,,,,,,0,210,210,210,left,1,0.493389243605,2017_Jun_02_1010,98.8559695331,Stroop,B-2,1STACS-6,
neutral,left,"[0.568627451, -0.7882352941, -0.7882352941]", ,12,SOLL,,,,,,,,,0,211,211,211,left,1,0.448693618882,2017_Jun_02_1010,98.8559695331,Stroop,B-2,1STACS-6,
congruent,down,"[-0.7725490196, 0.0745098039, -1]", ,4,GRÜN,,,,,,,,,0,212,212,212,down,1,0.515309627341,2017_Jun_02_1010,98.8559695331,Stroop,B-2,1STACS-6,
congruent,left,"[0.568627451, -0.7882352941, -0.7882352941]", ,0,ROT,,,,,,,,,0,213,213,213,left,1,0.549670977736,2017_Jun_02_1010,98.8559695331,Stroop,B-2,1STACS-6,
congruent,right,"[-0.8745098039, -0.2078431373, 0.637254902]", ,8,BLAU,,,,,,,,,0,214,214,214,right,1,0.534730252029,2017_Jun_02_1010,98.8559695331,Stroop,B-2,1STACS-6,
neutral,down,"[-0.7725490196, 0.0745098039, -1]", ,13,SOLL,,,,,,,,,0,215,215,215,down,1,1.01077120137,2017_Jun_02_1010,98.8559695331,Stroop,B-2,1STACS-6,
neutral,right,"[-0.8745098039, -0.2078431373, 0.637254902]", ,14,SOLL,,,,,,,,,0,216,216,216,right,1,0.86095048393,2017_Jun_02_1010,98.8559695331,Stroop,B-2,1STACS-6,
neutral,right,"[-0.8745098039, -0.2078431373, 0.637254902]", ,11,PECH,,,,,,,,,0,217,217,217,right,1,0.514069246231,2017_Jun_02_1010,98.8559695331,Stroop,B-2,1STACS-6,
congruent,down,"[-0.7725490196, 0.0745098039, -1]", ,4,GRÜN,,,,,,,,,0,218,218,218,down,1,0.867351018077,2017_Jun_02_1010,98.8559695331,Stroop,B-2,1STACS-6,
neutral,down,"[-0.7725490196, 0.0745098039, -1]", ,10,PECH,,,,,,,,,0,219,219,219,down,1,0.612449068248,2017_Jun_02_1010,98.8559695331,Stroop,B-2,1STACS-6,
congruent,right,"[-0.8745098039, -0.2078431373, 0.637254902]", ,8,BLAU,,,,,,,,,0,220,220,220,left,0,1.0823364422,2017_Jun_02_1010,98.8559695331,Stroop,B-2,1STACS-6,
neutral,left,"[0.568627451, -0.7882352941, -0.7882352941]", ,12,SOLL,,,,,,,,,0,221,221,221,left,1,0.992672811768,2017_Jun_02_1010,98.8559695331,Stroop,B-2,1STACS-6,
incongruent,right,"[-0.8745098039, -0.2078431373, 0.637254902]", ,2,ROT,,,,,,,,,0,222,222,222,right,1,0.80773673749,2017_Jun_02_1010,98.8559695331,Stroop,B-2,1STACS-6,
neutral,left,"[0.568627451, -0.7882352941, -0.7882352941]", ,9,PECH,,,,,,,,,0,223,223,223,left,1,0.611154490306,2017_Jun_02_1010,98.8559695331,Stroop,B-2,1STACS-6,
neutral,down,"[-0.7725490196, 0.0745098039, -1]", ,10,PECH,,,,,,,,,0,224,224,224,down,1,0.579656073607,2017_Jun_02_1010,98.8559695331,Stroop,B-2,1STACS-6,
neutral,right,"[-0.8745098039, -0.2078431373, 0.637254902]", ,11,PECH,,,,,,,,,0,225,225,225,right,1,0.633060905785,2017_Jun_02_1010,98.8559695331,Stroop,B-2,1STACS-6,
incongruent,down,"[-0.7725490196, 0.0745098039, -1]", ,7,BLAU,,,,,,,,,0,226,226,226,down,1,0.622727190188,2017_Jun_02_1010,98.8559695331,Stroop,B-2,1STACS-6,
incongruent,left,"[0.568627451, -0.7882352941, -0.7882352941]", ,3,GRÜN,,,,,,,,,0,227,227,227,left,1,0.481241330951,2017_Jun_02_1010,98.8559695331,Stroop,B-2,1STACS-6,
neutral,down,"[-0.7725490196, 0.0745098039, -1]", ,13,SOLL,,,,,,,,,0,228,228,228,down,1,0.457481048569,2017_Jun_02_1010,98.8559695331,Stroop,B-2,1STACS-6,
incongruent,down,"[-0.7725490196, 0.0745098039, -1]", ,1,ROT,,,,,,,,,0,229,229,229,down,1,0.429288918005,2017_Jun_02_1010,98.8559695331,Stroop,B-2,1STACS-6,
incongruent,right,"[-0.8745098039, -0.2078431373, 0.637254902]", ,5,GRÜN,,,,,,,,,0,230,230,230,right,1,0.608699150311,2017_Jun_02_1010,98.8559695331,Stroop,B-2,1STACS-6,
neutral,right,"[-0.8745098039, -0.2078431373, 0.637254902]", ,14,SOLL,,,,,,,,,0,231,231,231,down,0,0.584656709163,2017_Jun_02_1010,98.8559695331,Stroop,B-2,1STACS-6,
incongruent,left,"[0.568627451, -0.7882352941, -0.7882352941]", ,6,BLAU,,,,,,,,,0,232,232,232,left,1,0.78460139487,2017_Jun_02_1010,98.8559695331,Stroop,B-2,1STACS-6,
neutral,down,"[-0.7725490196, 0.0745098039, -1]", ,10,PECH,,,,,,,,,0,233,233,233,down,1,0.676548835118,2017_Jun_02_1010,98.8559695331,Stroop,B-2,1STACS-6,
neutralofneutral,down,"[-0.7725490196, 0.0745098039, -1]", ,16,HALS,,,,,,,,,0,234,234,234,down,1,0.579544048196,2017_Jun_02_1010,98.8559695331,Stroop,B-2,1STACS-6,
neutralofneutral,left,"[0.568627451, -0.7882352941, -0.7882352941]", ,15,HALS,,,,,,,,,0,235,235,235,left,1,0.558114229602,2017_Jun_02_1010,98.8559695331,Stroop,B-2,1STACS-6,
neutral,right,"[-0.8745098039, -0.2078431373, 0.637254902]", ,14,SOLL,,,,,,,,,0,236,236,236,right,1,0.672437977452,2017_Jun_02_1010,98.8559695331,Stroop,B-2,1STACS-6,
neutralofneutral,down,"[-0.7725490196, 0.0745098039, -1]", ,19,MODE,,,,,,,,,0,237,237,237,down,1,0.582293839022,2017_Jun_02_1010,98.8559695331,Stroop,B-2,1STACS-6,
neutralofneutral,right,"[-0.8745098039, -0.2078431373, 0.637254902]", ,20,MODE,,,,,,,,,0,238,238,238,right,1,0.700812812802,2017_Jun_02_1010,98.8559695331,Stroop,B-2,1STACS-6,
neutralofneutral,right,"[-0.8745098039, -0.2078431373, 0.637254902]", ,17,HALS,,,,,,,,,0,239,239,239,right,1,0.729788562513,2017_Jun_02_1010,98.8559695331,Stroop,B-2,1STACS-6,
neutralofneutral,left,"[0.568627451, -0.7882352941, -0.7882352941]", ,18,MODE,,,,,,,,,0,240,240,240,left,1,0.572034993274,2017_Jun_02_1010,98.8559695331,Stroop,B-2,1STACS-6,
neutral,right,"[-0.8745098039, -0.2078431373, 0.637254902]", ,11,PECH,,,,,,,,,0,241,241,241,right,1,0.772718879075,2017_Jun_02_1010,98.8559695331,Stroop,B-2,1STACS-6,
neutral,down,"[-0.7725490196, 0.0745098039, -1]", ,13,SOLL,,,,,,,,,0,242,242,242,down,1,0.605967518218,2017_Jun_02_1010,98.8559695331,Stroop,B-2,1STACS-6,
neutral,left,"[0.568627451, -0.7882352941, -0.7882352941]", ,9,PECH,,,,,,,,,0,243,243,243,left,1,0.513006541334,2017_Jun_02_1010,98.8559695331,Stroop,B-2,1STACS-6,
neutral,left,"[0.568627451, -0.7882352941, -0.7882352941]", ,12,SOLL,,,,,,,,,0,244,244,244,left,1,0.6484444252,2017_Jun_02_1010,98.8559695331,Stroop,B-2,1STACS-6,
fix,return,white, ,21,+,,,,,,,,,0,245,245,245,None,0,,2017_Jun_02_1010,98.8559695331,Stroop,B-2,1STACS-6,
fix,return,white, ,21,+,,,,,,,,,0,246,246,246,None,0,,2017_Jun_02_1010,98.8559695331,Stroop,B-2,1STACS-6,
fix,return,white, ,21,+,,,,,,,,,0,247,247,247,None,0,,2017_Jun_02_1010,98.8559695331,Stroop,B-2,1STACS-6,
fix,return,white, ,21,+,,,,,,,,,0,248,248,248,None,0,,2017_Jun_02_1010,98.8559695331,Stroop,B-2,1STACS-6,
fix,return,white, ,21,+,,,,,,,,,0,249,249,249,None,0,,2017_Jun_02_1010,98.8559695331,Stroop,B-2,1STACS-6,
fix,return,white, ,21,+,,,,,,,,,0,250,250,250,None,0,,2017_Jun_02_1010,98.8559695331,Stroop,B-2,1STACS-6,
fix,return,white, ,21,+,,,,,,,,,0,251,251,251,None,0,,2017_Jun_02_1010,98.8559695331,Stroop,B-2,1STACS-6,
fix,return,white, ,21,+,,,,,,,,,0,252,252,252,None,0,,2017_Jun_02_1010,98.8559695331,Stroop,B-2,1STACS-6,
fix,return,white, ,21,+,,,,,,,,,0,253,253,253,None,0,,2017_Jun_02_1010,98.8559695331,Stroop,B-2,1STACS-6,
fix,return,white, ,21,+,,,,,,,,,0,254,254,254,None,0,,2017_Jun_02_1010,98.8559695331,Stroop,B-2,1STACS-6,
fix,return,white, ,21,+,,,,,,,,,0,255,255,255,None,0,,2017_Jun_02_1010,98.8559695331,Stroop,B-2,1STACS-6,
fix,return,white, ,21,+,,,,,,,,,0,256,256,256,None,0,,2017_Jun_02_1010,98.8559695331,Stroop,B-2,1STACS-6,
fix,return,white,+,22,+,,,,,,,,,0,257,257,257,None,0,,2017_Jun_02_1010,98.8559695331,Stroop,B-2,1STACS-6,
incongruent,right,"[-0.8745098039, -0.2078431373, 0.637254902]", ,2,ROT,,,,,,,,,0,258,258,258,right,1,0.987027960257,2017_Jun_02_1010,98.8559695331,Stroop,B-2,1STACS-6,
neutral,down,"[-0.7725490196, 0.0745098039, -1]", ,10,PECH,,,,,,,,,0,259,259,259,down,1,0.480759426128,2017_Jun_02_1010,98.8559695331,Stroop,B-2,1STACS-6,
neutral,left,"[0.568627451, -0.7882352941, -0.7882352941]", ,12,SOLL,,,,,,,,,0,260,260,260,left,1,0.510425487038,2017_Jun_02_1010,98.8559695331,Stroop,B-2,1STACS-6,
neutral,right,"[-0.8745098039, -0.2078431373, 0.637254902]", ,11,PECH,,,,,,,,,0,261,261,261,right,1,0.966323932231,2017_Jun_02_1010,98.8559695331,Stroop,B-2,1STACS-6,
incongruent,right,"[-0.8745098039, -0.2078431373, 0.637254902]", ,5,GRÜN,,,,,,,,,0,262,262,262,down,0,1.27286065687,2017_Jun_02_1010,98.8559695331,Stroop,B-2,1STACS-6,
neutral,down,"[-0.7725490196, 0.0745098039, -1]", ,13,SOLL,,,,,,,,,0,263,263,263,down,1,0.78970986536,2017_Jun_02_1010,98.8559695331,Stroop,B-2,1STACS-6,
neutral,right,"[-0.8745098039, -0.2078431373, 0.637254902]", ,14,SOLL,,,,,,,,,0,264,264,264,right,1,0.683881331287,2017_Jun_02_1010,98.8559695331,Stroop,B-2,1STACS-6,
incongruent,left,"[0.568627451, -0.7882352941, -0.7882352941]", ,6,BLAU,,,,,,,,,0,265,265,265,left,1,0.761954661835,2017_Jun_02_1010,98.8559695331,Stroop,B-2,1STACS-6,
incongruent,left,"[0.568627451, -0.7882352941, -0.7882352941]", ,3,GRÜN,,,,,,,,,0,266,266,266,left,1,1.13378571858,2017_Jun_02_1010,98.8559695331,Stroop,B-2,1STACS-6,
neutral,left,"[0.568627451, -0.7882352941, -0.7882352941]", ,9,PECH,,,,,,,,,0,267,267,267,left,1,0.997602209219,2017_Jun_02_1010,98.8559695331,Stroop,B-2,1STACS-6,
incongruent,down,"[-0.7725490196, 0.0745098039, -1]", ,1,ROT,,,,,,,,,0,268,268,268,down,1,1.01217920155,2017_Jun_02_1010,98.8559695331,Stroop,B-2,1STACS-6,
incongruent,down,"[-0.7725490196, 0.0745098039, -1]", ,7,BLAU,,,,,,,,,0,269,269,269,down,1,0.547238825046,2017_Jun_02_1010,98.8559695331,Stroop,B-2,1STACS-6,
neutral,down,"[-0.7725490196, 0.0745098039, -1]", ,13,SOLL,,,,,,,,,0,270,270,270,down,1,0.480523083241,2017_Jun_02_1010,98.8559695331,Stroop,B-2,1STACS-6,
neutral,right,"[-0.8745098039, -0.2078431373, 0.637254902]", ,11,PECH,,,,,,,,,0,271,271,271,right,1,0.641718430694,2017_Jun_02_1010,98.8559695331,Stroop,B-2,1STACS-6,
congruent,right,"[-0.8745098039, -0.2078431373, 0.637254902]", ,8,BLAU,,,,,,,,,0,272,272,272,right,1,0.662169912656,2017_Jun_02_1010,98.8559695331,Stroop,B-2,1STACS-6,
neutral,left,"[0.568627451, -0.7882352941, -0.7882352941]", ,12,SOLL,,,,,,,,,0,273,273,273,left,1,0.54194429739,2017_Jun_02_1010,98.8559695331,Stroop,B-2,1STACS-6,
neutral,right,"[-0.8745098039, -0.2078431373, 0.637254902]", ,14,SOLL,,,,,,,,,0,274,274,274,right,1,0.595757561366,2017_Jun_02_1010,98.8559695331,Stroop,B-2,1STACS-6,
neutral,left,"[0.568627451, -0.7882352941, -0.7882352941]", ,9,PECH,,,,,,,,,0,275,275,275,left,1,0.791007795684,2017_Jun_02_1010,98.8559695331,Stroop,B-2,1STACS-6,
congruent,left,"[0.568627451, -0.7882352941, -0.7882352941]", ,0,ROT,,,,,,,,,0,276,276,276,down,0,0.494495250095,2017_Jun_02_1010,98.8559695331,Stroop,B-2,1STACS-6,
congruent,down,"[-0.7725490196, 0.0745098039, -1]", ,4,GRÜN,,,,,,,,,0,277,277,277,down,1,0.726722809743,2017_Jun_02_1010,98.8559695331,Stroop,B-2,1STACS-6,
neutral,down,"[-0.7725490196, 0.0745098039, -1]", ,10,PECH,,,,,,,,,0,278,278,278,down,1,0.53447519168,2017_Jun_02_1010,98.8559695331,Stroop,B-2,1STACS-6,
congruent,left,"[0.568627451, -0.7882352941, -0.7882352941]", ,0,ROT,,,,,,,,,0,279,279,279,left,1,0.601183669992,2017_Jun_02_1010,98.8559695331,Stroop,B-2,1STACS-6,
congruent,right,"[-0.8745098039, -0.2078431373, 0.637254902]", ,8,BLAU,,,,,,,,,0,280,280,280,right,1,0.705621524523,2017_Jun_02_1010,98.8559695331,Stroop,B-2,1STACS-6,
congruent,down,"[-0.7725490196, 0.0745098039, -1]", ,4,GRÜN,,,,,,,,,0,281,281,281,down,1,0.673485596633,2017_Jun_02_1010,98.8559695331,Stroop,B-2,1STACS-6,
neutralofneutral,left,"[0.568627451, -0.7882352941, -0.7882352941]", ,18,MODE,,,,,,,,,0,282,282,282,left,1,0.697791199719,2017_Jun_02_1010,98.8559695331,Stroop,B-2,1STACS-6,
neutralofneutral,right,"[-0.8745098039, -0.2078431373, 0.637254902]", ,20,MODE,,,,,,,,,0,283,283,283,right,1,0.719240853237,2017_Jun_02_1010,98.8559695331,Stroop,B-2,1STACS-6,
neutral,left,"[0.568627451, -0.7882352941, -0.7882352941]", ,9,PECH,,,,,,,,,0,284,284,284,left,1,0.609390299605,2017_Jun_02_1010,98.8559695331,Stroop,B-2,1STACS-6,
neutral,down,"[-0.7725490196, 0.0745098039, -1]", ,13,SOLL,,,,,,,,,0,285,285,285,down,1,0.606435734151,2017_Jun_02_1010,98.8559695331,Stroop,B-2,1STACS-6,
neutralofneutral,right,"[-0.8745098039, -0.2078431373, 0.637254902]", ,17,HALS,,,,,,,,,0,286,286,286,right,1,1.23535616957,2017_Jun_02_1010,98.8559695331,Stroop,B-2,1STACS-6,
neutral,right,"[-0.8745098039, -0.2078431373, 0.637254902]", ,14,SOLL,,,,,,,,,0,287,287,287,right,1,0.765511817843,2017_Jun_02_1010,98.8559695331,Stroop,B-2,1STACS-6,
neutral,right,"[-0.8745098039, -0.2078431373, 0.637254902]", ,11,PECH,,,,,,,,,0,288,288,288,right,1,0.651868044682,2017_Jun_02_1010,98.8559695331,Stroop,B-2,1STACS-6,
neutral,left,"[0.568627451, -0.7882352941, -0.7882352941]", ,12,SOLL,,,,,,,,,0,289,289,289,left,1,1.36585348138,2017_Jun_02_1010,98.8559695331,Stroop,B-2,1STACS-6,
neutral,down,"[-0.7725490196, 0.0745098039, -1]", ,10,PECH,,,,,,,,,0,290,290,290,down,1,0.643956703995,2017_Jun_02_1010,98.8559695331,Stroop,B-2,1STACS-6,
neutralofneutral,down,"[-0.7725490196, 0.0745098039, -1]", ,19,MODE,,,,,,,,,0,291,291,291,down,1,0.474995844444,2017_Jun_02_1010,98.8559695331,Stroop,B-2,1STACS-6,
neutralofneutral,down,"[-0.7725490196, 0.0745098039, -1]", ,16,HALS,,,,,,,,,0,292,292,292,down,1,0.569891424748,2017_Jun_02_1010,98.8559695331,Stroop,B-2,1STACS-6,
neutralofneutral,left,"[0.568627451, -0.7882352941, -0.7882352941]", ,15,HALS,,,,,,,,,0,293,293,293,left,1,0.633120410555,2017_Jun_02_1010,98.8559695331,Stroop,B-2,1STACS-6,
fix,return,white, ,21,+,,,,,,,,,0,294,294,294,None,0,,2017_Jun_02_1010,98.8559695331,Stroop,B-2,1STACS-6,
fix,return,white, ,21,+,,,,,,,,,0,295,295,295,None,0,,2017_Jun_02_1010,98.8559695331,Stroop,B-2,1STACS-6,
fix,return,white, ,21,+,,,,,,,,,0,296,296,296,None,0,,2017_Jun_02_1010,98.8559695331,Stroop,B-2,1STACS-6,
fix,return,white, ,21,+,,,,,,,,,0,297,297,297,None,0,,2017_Jun_02_1010,98.8559695331,Stroop,B-2,1STACS-6,
fix,return,white, ,21,+,,,,,,,,,0,298,298,298,None,0,,2017_Jun_02_1010,98.8559695331,Stroop,B-2,1STACS-6,
fix,return,white, ,21,+,,,,,,,,,0,299,299,299,None,0,,2017_Jun_02_1010,98.8559695331,Stroop,B-2,1STACS-6,
fix,return,white, ,21,+,,,,,,,,,0,300,300,300,None,0,,2017_Jun_02_1010,98.8559695331,Stroop,B-2,1STACS-6,
fix,return,white, ,21,+,,,,,,,,,0,301,301,301,None,0,,2017_Jun_02_1010,98.8559695331,Stroop,B-2,1STACS-6,
fix,return,white, ,21,+,,,,,,,,,0,302,302,302,None,0,,2017_Jun_02_1010,98.8559695331,Stroop,B-2,1STACS-6,
fix,return,white, ,21,+,,,,,,,,,0,303,303,303,None,0,,2017_Jun_02_1010,98.8559695331,Stroop,B-2,1STACS-6,
fix,return,white, ,21,+,,,,,,,,,0,304,304,304,None,0,,2017_Jun_02_1010,98.8559695331,Stroop,B-2,1STACS-6,
fix,return,white, ,21,+,,,,,,,,,0,305,305,305,None,0,,2017_Jun_02_1010,98.8559695331,Stroop,B-2,1STACS-6,
fix,return,white,+,22,+,,,,,,,,,0,306,306,306,None,0,,2017_Jun_02_1010,98.8559695331,Stroop,B-2,1STACS-6,
