congruent,corrAns,letterColor,signal,selectedrownumber_novariable,Anzeigetext,practice.thisRepN,practice.thisTrialN,practice.thisN,practice.thisIndex,Wrongresponse.thisRepN,Wrongresponse.thisTrialN,Wrongresponse.thisN,Wrongresponse.thisIndex,trials.thisRepN,trials.thisTrialN,trials.thisN,trials.thisIndex,resp.keys,resp.corr,resp.rt,date,frameRate,expName,session,participant,
neutralofneutral,right,"[-0.8745098039, -0.2078431373, 0.637254902]", ,20,MODE,0,0,0,0,0,0,0,0,,,,,right,1,1.12613223189,2017_Mrz_14_1738,170.234839802,Stroop,,7,
,,,,,,0,0,0,0,,,,,,,,,,,,2017_Mrz_14_1738,170.234839802,Stroop,,7,
incongruent,right,"[-0.8745098039, -0.2078431373, 0.637254902]", ,5,GRÜN,1,0,1,0,0,0,0,0,,,,,right,1,0.871784542449,2017_Mrz_14_1738,170.234839802,Stroop,,7,
,,,,,,1,0,1,0,,,,,,,,,,,,2017_Mrz_14_1738,170.234839802,Stroop,,7,
incongruent,down,"[-0.7725490196, 0.0745098039, -1]", ,1,ROT,2,0,2,0,0,0,0,0,,,,,down,1,0.802088533599,2017_Mrz_14_1738,170.234839802,Stroop,,7,
,,,,,,2,0,2,0,,,,,,,,,,,,2017_Mrz_14_1738,170.234839802,Stroop,,7,
congruent,right,"[-0.8745098039, -0.2078431373, 0.637254902]", ,8,BLAU,3,0,3,0,0,0,0,0,,,,,right,1,0.50035996195,2017_Mrz_14_1738,170.234839802,Stroop,,7,
,,,,,,3,0,3,0,,,,,,,,,,,,2017_Mrz_14_1738,170.234839802,Stroop,,7,
congruent,left,"[0.568627451, -0.7882352941, -0.7882352941]", ,0,ROT,4,0,4,0,0,0,0,0,,,,,left,1,0.428824613184,2017_Mrz_14_1738,170.234839802,Stroop,,7,
,,,,,,4,0,4,0,,,,,,,,,,,,2017_Mrz_14_1738,170.234839802,Stroop,,7,
neutralofneutral,right,"[-0.8745098039, -0.2078431373, 0.637254902]", ,17,HALS,5,0,5,0,0,0,0,0,,,,,right,1,0.50035828576,2017_Mrz_14_1738,170.234839802,Stroop,,7,
,,,,,,5,0,5,0,,,,,,,,,,,,2017_Mrz_14_1738,170.234839802,Stroop,,7,
neutral,left,"[0.568627451, -0.7882352941, -0.7882352941]", ,12,SOLL,6,0,6,0,0,0,0,0,,,,,left,1,0.522889082272,2017_Mrz_14_1738,170.234839802,Stroop,,7,
,,,,,,6,0,6,0,,,,,,,,,,,,2017_Mrz_14_1738,170.234839802,Stroop,,7,
incongruent,down,"[-0.7725490196, 0.0745098039, -1]", ,7,BLAU,7,0,7,0,0,0,0,0,,,,,down,1,0.42559096198,2017_Mrz_14_1738,170.234839802,Stroop,,7,
,,,,,,7,0,7,0,,,,,,,,,,,,2017_Mrz_14_1738,170.234839802,Stroop,,7,
neutral,right,"[-0.8745098039, -0.2078431373, 0.637254902]", ,14,SOLL,8,0,8,0,0,0,0,0,,,,,right,1,0.345150291448,2017_Mrz_14_1738,170.234839802,Stroop,,7,
,,,,,,8,0,8,0,,,,,,,,,,,,2017_Mrz_14_1738,170.234839802,Stroop,,7,
neutralofneutral,left,"[0.568627451, -0.7882352941, -0.7882352941]", ,18,MODE,9,0,9,0,0,0,0,0,,,,,left,1,0.442697326057,2017_Mrz_14_1738,170.234839802,Stroop,,7,
,,,,,,9,0,9,0,,,,,,,,,,,,2017_Mrz_14_1738,170.234839802,Stroop,,7,
neutral,left,"[0.568627451, -0.7882352941, -0.7882352941]", ,12,SOLL,10,0,10,0,0,0,0,0,,,,,left,1,0.50382381001,2017_Mrz_14_1738,170.234839802,Stroop,,7,
,,,,,,10,0,10,0,,,,,,,,,,,,2017_Mrz_14_1738,170.234839802,Stroop,,7,
incongruent,left,"[0.568627451, -0.7882352941, -0.7882352941]", ,6,BLAU,11,0,11,0,0,0,0,0,,,,,left,1,0.537412995227,2017_Mrz_14_1738,170.234839802,Stroop,,7,
,,,,,,11,0,11,0,,,,,,,,,,,,2017_Mrz_14_1738,170.234839802,Stroop,,7,
neutral,left,"[0.568627451, -0.7882352941, -0.7882352941]", ,12,SOLL,12,0,12,0,0,0,0,0,,,,,left,1,0.423673120466,2017_Mrz_14_1738,170.234839802,Stroop,,7,
,,,,,,12,0,12,0,,,,,,,,,,,,2017_Mrz_14_1738,170.234839802,Stroop,,7,
neutralofneutral,left,"[0.568627451, -0.7882352941, -0.7882352941]", ,18,MODE,13,0,13,0,0,0,0,0,,,,,left,1,0.409596191695,2017_Mrz_14_1738,170.234839802,Stroop,,7,
,,,,,,13,0,13,0,,,,,,,,,,,,2017_Mrz_14_1738,170.234839802,Stroop,,7,
neutral,left,"[0.568627451, -0.7882352941, -0.7882352941]", ,9,PECH,14,0,14,0,0,0,0,0,,,,,left,1,0.481399730972,2017_Mrz_14_1738,170.234839802,Stroop,,7,
,,,,,,14,0,14,0,,,,,,,,,,,,2017_Mrz_14_1738,170.234839802,Stroop,,7,
incongruent,down,"[-0.7725490196, 0.0745098039, -1]", ,7,BLAU,15,0,15,0,0,0,0,0,,,,,down,1,0.592504075239,2017_Mrz_14_1738,170.234839802,Stroop,,7,
,,,,,,15,0,15,0,,,,,,,,,,,,2017_Mrz_14_1738,170.234839802,Stroop,,7,
incongruent,down,"[-0.7725490196, 0.0745098039, -1]", ,1,ROT,16,0,16,0,0,0,0,0,,,,,down,1,0.457419308878,2017_Mrz_14_1738,170.234839802,Stroop,,7,
,,,,,,16,0,16,0,,,,,,,,,,,,2017_Mrz_14_1738,170.234839802,Stroop,,7,
incongruent,down,"[-0.7725490196, 0.0745098039, -1]", ,7,BLAU,17,0,17,0,0,0,0,0,,,,,down,1,0.361098966489,2017_Mrz_14_1738,170.234839802,Stroop,,7,
,,,,,,17,0,17,0,,,,,,,,,,,,2017_Mrz_14_1738,170.234839802,Stroop,,7,
fix,return,white, ,21,+,,,,,,,,,0,0,0,0,None,0,,2017_Mrz_14_1738,170.234839802,Stroop,,7,
fix,return,white, ,21,+,,,,,,,,,0,1,1,1,None,0,,2017_Mrz_14_1738,170.234839802,Stroop,,7,
fix,return,white, ,21,+,,,,,,,,,0,2,2,2,None,0,,2017_Mrz_14_1738,170.234839802,Stroop,,7,
fix,return,white, ,21,+,,,,,,,,,0,3,3,3,None,0,,2017_Mrz_14_1738,170.234839802,Stroop,,7,
fix,return,white, ,21,+,,,,,,,,,0,4,4,4,None,0,,2017_Mrz_14_1738,170.234839802,Stroop,,7,
fix,return,white, ,21,+,,,,,,,,,0,5,5,5,None,0,,2017_Mrz_14_1738,170.234839802,Stroop,,7,
fix,return,white, ,21,+,,,,,,,,,0,6,6,6,None,0,,2017_Mrz_14_1738,170.234839802,Stroop,,7,
fix,return,white, ,21,+,,,,,,,,,0,7,7,7,None,0,,2017_Mrz_14_1738,170.234839802,Stroop,,7,
fix,return,white, ,21,+,,,,,,,,,0,8,8,8,None,0,,2017_Mrz_14_1738,170.234839802,Stroop,,7,
fix,return,white, ,21,+,,,,,,,,,0,9,9,9,None,0,,2017_Mrz_14_1738,170.234839802,Stroop,,7,
fix,return,white, ,21,+,,,,,,,,,0,10,10,10,None,0,,2017_Mrz_14_1738,170.234839802,Stroop,,7,
fix,return,white, ,21,+,,,,,,,,,0,11,11,11,None,0,,2017_Mrz_14_1738,170.234839802,Stroop,,7,
fix,return,white,+,22,+,,,,,,,,,0,12,12,12,None,0,,2017_Mrz_14_1738,170.234839802,Stroop,,7,
neutral,left,"[0.568627451, -0.7882352941, -0.7882352941]", ,9,PECH,,,,,,,,,0,13,13,13,left,1,0.601028901718,2017_Mrz_14_1738,170.234839802,Stroop,,7,
neutral,right,"[-0.8745098039, -0.2078431373, 0.637254902]", ,11,PECH,,,,,,,,,0,14,14,14,right,1,0.683346905822,2017_Mrz_14_1738,170.234839802,Stroop,,7,
incongruent,left,"[0.568627451, -0.7882352941, -0.7882352941]", ,3,GRÜN,,,,,,,,,0,15,15,15,left,1,0.53766163018,2017_Mrz_14_1738,170.234839802,Stroop,,7,
neutral,right,"[-0.8745098039, -0.2078431373, 0.637254902]", ,14,SOLL,,,,,,,,,0,16,16,16,right,1,0.402429917769,2017_Mrz_14_1738,170.234839802,Stroop,,7,
neutral,down,"[-0.7725490196, 0.0745098039, -1]", ,13,SOLL,,,,,,,,,0,17,17,17,down,1,0.40322471152,2017_Mrz_14_1738,170.234839802,Stroop,,7,
incongruent,left,"[0.568627451, -0.7882352941, -0.7882352941]", ,6,BLAU,,,,,,,,,0,18,18,18,left,1,0.39891801891,2017_Mrz_14_1738,170.234839802,Stroop,,7,
neutral,left,"[0.568627451, -0.7882352941, -0.7882352941]", ,12,SOLL,,,,,,,,,0,19,19,19,left,1,0.497310412357,2017_Mrz_14_1738,170.234839802,Stroop,,7,
incongruent,down,"[-0.7725490196, 0.0745098039, -1]", ,7,BLAU,,,,,,,,,0,20,20,20,down,1,0.423524498226,2017_Mrz_14_1738,170.234839802,Stroop,,7,
incongruent,right,"[-0.8745098039, -0.2078431373, 0.637254902]", ,2,ROT,,,,,,,,,0,21,21,21,right,1,0.38693688723,2017_Mrz_14_1738,170.234839802,Stroop,,7,
incongruent,down,"[-0.7725490196, 0.0745098039, -1]", ,1,ROT,,,,,,,,,0,22,22,22,down,1,0.502822844804,2017_Mrz_14_1738,170.234839802,Stroop,,7,
incongruent,right,"[-0.8745098039, -0.2078431373, 0.637254902]", ,5,GRÜN,,,,,,,,,0,23,23,23,right,1,0.54370960555,2017_Mrz_14_1738,170.234839802,Stroop,,7,
neutral,down,"[-0.7725490196, 0.0745098039, -1]", ,10,PECH,,,,,,,,,0,24,24,24,down,1,0.562569265088,2017_Mrz_14_1738,170.234839802,Stroop,,7,
congruent,down,"[-0.7725490196, 0.0745098039, -1]", ,4,GRÜN,,,,,,,,,0,25,25,25,down,1,0.438023827051,2017_Mrz_14_1738,170.234839802,Stroop,,7,
neutral,right,"[-0.8745098039, -0.2078431373, 0.637254902]", ,14,SOLL,,,,,,,,,0,26,26,26,right,1,0.503585790932,2017_Mrz_14_1738,170.234839802,Stroop,,7,
congruent,down,"[-0.7725490196, 0.0745098039, -1]", ,4,GRÜN,,,,,,,,,0,27,27,27,down,1,0.412776204797,2017_Mrz_14_1738,170.234839802,Stroop,,7,
neutral,down,"[-0.7725490196, 0.0745098039, -1]", ,10,PECH,,,,,,,,,0,28,28,28,down,1,0.445470024822,2017_Mrz_14_1738,170.234839802,Stroop,,7,
congruent,left,"[0.568627451, -0.7882352941, -0.7882352941]", ,0,ROT,,,,,,,,,0,29,29,29,left,1,0.522334821884,2017_Mrz_14_1738,170.234839802,Stroop,,7,
neutral,left,"[0.568627451, -0.7882352941, -0.7882352941]", ,12,SOLL,,,,,,,,,0,30,30,30,down,0,0.597908393384,2017_Mrz_14_1738,170.234839802,Stroop,,7,
neutral,down,"[-0.7725490196, 0.0745098039, -1]", ,13,SOLL,,,,,,,,,0,31,31,31,down,1,0.448127066428,2017_Mrz_14_1738,170.234839802,Stroop,,7,
congruent,right,"[-0.8745098039, -0.2078431373, 0.637254902]", ,8,BLAU,,,,,,,,,0,32,32,32,right,1,0.348650736337,2017_Mrz_14_1738,170.234839802,Stroop,,7,
neutral,right,"[-0.8745098039, -0.2078431373, 0.637254902]", ,11,PECH,,,,,,,,,0,33,33,33,right,1,0.538475979489,2017_Mrz_14_1738,170.234839802,Stroop,,7,
neutral,left,"[0.568627451, -0.7882352941, -0.7882352941]", ,9,PECH,,,,,,,,,0,34,34,34,left,1,0.487633204779,2017_Mrz_14_1738,170.234839802,Stroop,,7,
congruent,left,"[0.568627451, -0.7882352941, -0.7882352941]", ,0,ROT,,,,,,,,,0,35,35,35,left,1,0.435848690266,2017_Mrz_14_1738,170.234839802,Stroop,,7,
congruent,right,"[-0.8745098039, -0.2078431373, 0.637254902]", ,8,BLAU,,,,,,,,,0,36,36,36,right,1,0.506908838972,2017_Mrz_14_1738,170.234839802,Stroop,,7,
neutral,left,"[0.568627451, -0.7882352941, -0.7882352941]", ,9,PECH,,,,,,,,,0,37,37,37,left,1,0.55735379776,2017_Mrz_14_1738,170.234839802,Stroop,,7,
neutral,down,"[-0.7725490196, 0.0745098039, -1]", ,10,PECH,,,,,,,,,0,38,38,38,right,0,0.512987265141,2017_Mrz_14_1738,170.234839802,Stroop,,7,
neutral,left,"[0.568627451, -0.7882352941, -0.7882352941]", ,12,SOLL,,,,,,,,,0,39,39,39,left,1,0.607002007238,2017_Mrz_14_1738,170.234839802,Stroop,,7,
neutral,right,"[-0.8745098039, -0.2078431373, 0.637254902]", ,11,PECH,,,,,,,,,0,40,40,40,right,1,0.480220530821,2017_Mrz_14_1738,170.234839802,Stroop,,7,
neutralofneutral,down,"[-0.7725490196, 0.0745098039, -1]", ,19,MODE,,,,,,,,,0,41,41,41,down,1,0.374000885588,2017_Mrz_14_1738,170.234839802,Stroop,,7,
neutralofneutral,right,"[-0.8745098039, -0.2078431373, 0.637254902]", ,20,MODE,,,,,,,,,0,42,42,42,right,1,0.406490489713,2017_Mrz_14_1738,170.234839802,Stroop,,7,
neutralofneutral,left,"[0.568627451, -0.7882352941, -0.7882352941]", ,18,MODE,,,,,,,,,0,43,43,43,left,1,0.600598679441,2017_Mrz_14_1738,170.234839802,Stroop,,7,
neutral,right,"[-0.8745098039, -0.2078431373, 0.637254902]", ,14,SOLL,,,,,,,,,0,44,44,44,right,1,0.474596072965,2017_Mrz_14_1738,170.234839802,Stroop,,7,
neutralofneutral,right,"[-0.8745098039, -0.2078431373, 0.637254902]", ,17,HALS,,,,,,,,,0,45,45,45,right,1,0.477308428864,2017_Mrz_14_1738,170.234839802,Stroop,,7,
neutral,down,"[-0.7725490196, 0.0745098039, -1]", ,13,SOLL,,,,,,,,,0,46,46,46,down,1,0.416228598887,2017_Mrz_14_1738,170.234839802,Stroop,,7,
neutralofneutral,left,"[0.568627451, -0.7882352941, -0.7882352941]", ,15,HALS,,,,,,,,,0,47,47,47,left,1,0.555394330843,2017_Mrz_14_1738,170.234839802,Stroop,,7,
neutralofneutral,down,"[-0.7725490196, 0.0745098039, -1]", ,16,HALS,,,,,,,,,0,48,48,48,down,1,0.653390584557,2017_Mrz_14_1738,170.234839802,Stroop,,7,
fix,return,white, ,21,+,,,,,,,,,0,49,49,49,None,0,,2017_Mrz_14_1738,170.234839802,Stroop,,7,
fix,return,white, ,21,+,,,,,,,,,0,50,50,50,None,0,,2017_Mrz_14_1738,170.234839802,Stroop,,7,
fix,return,white, ,21,+,,,,,,,,,0,51,51,51,None,0,,2017_Mrz_14_1738,170.234839802,Stroop,,7,
fix,return,white, ,21,+,,,,,,,,,0,52,52,52,None,0,,2017_Mrz_14_1738,170.234839802,Stroop,,7,
fix,return,white, ,21,+,,,,,,,,,0,53,53,53,None,0,,2017_Mrz_14_1738,170.234839802,Stroop,,7,
fix,return,white, ,21,+,,,,,,,,,0,54,54,54,None,0,,2017_Mrz_14_1738,170.234839802,Stroop,,7,
fix,return,white, ,21,+,,,,,,,,,0,55,55,55,None,0,,2017_Mrz_14_1738,170.234839802,Stroop,,7,
fix,return,white, ,21,+,,,,,,,,,0,56,56,56,None,0,,2017_Mrz_14_1738,170.234839802,Stroop,,7,
fix,return,white, ,21,+,,,,,,,,,0,57,57,57,None,0,,2017_Mrz_14_1738,170.234839802,Stroop,,7,
fix,return,white, ,21,+,,,,,,,,,0,58,58,58,None,0,,2017_Mrz_14_1738,170.234839802,Stroop,,7,
fix,return,white, ,21,+,,,,,,,,,0,59,59,59,None,0,,2017_Mrz_14_1738,170.234839802,Stroop,,7,
fix,return,white, ,21,+,,,,,,,,,0,60,60,60,None,0,,2017_Mrz_14_1738,170.234839802,Stroop,,7,
fix,return,white,+,22,+,,,,,,,,,0,61,61,61,None,0,,2017_Mrz_14_1738,170.234839802,Stroop,,7,
neutralofneutral,right,"[-0.8745098039, -0.2078431373, 0.637254902]", ,20,MODE,,,,,,,,,0,62,62,62,right,1,0.811450896692,2017_Mrz_14_1738,170.234839802,Stroop,,7,
neutralofneutral,right,"[-0.8745098039, -0.2078431373, 0.637254902]", ,17,HALS,,,,,,,,,0,63,63,63,right,1,0.439291306577,2017_Mrz_14_1738,170.234839802,Stroop,,7,
neutral,right,"[-0.8745098039, -0.2078431373, 0.637254902]", ,11,PECH,,,,,,,,,0,64,64,64,right,1,0.486279680797,2017_Mrz_14_1738,170.234839802,Stroop,,7,
neutralofneutral,left,"[0.568627451, -0.7882352941, -0.7882352941]", ,15,HALS,,,,,,,,,0,65,65,65,left,1,0.391731910061,2017_Mrz_14_1738,170.234839802,Stroop,,7,
neutralofneutral,left,"[0.568627451, -0.7882352941, -0.7882352941]", ,18,MODE,,,,,,,,,0,66,66,66,left,1,0.368407995988,2017_Mrz_14_1738,170.234839802,Stroop,,7,
neutralofneutral,down,"[-0.7725490196, 0.0745098039, -1]", ,19,MODE,,,,,,,,,0,67,67,67,down,1,0.465235386061,2017_Mrz_14_1738,170.234839802,Stroop,,7,
neutralofneutral,down,"[-0.7725490196, 0.0745098039, -1]", ,16,HALS,,,,,,,,,0,68,68,68,down,1,0.463155512782,2017_Mrz_14_1738,170.234839802,Stroop,,7,
neutral,left,"[0.568627451, -0.7882352941, -0.7882352941]", ,9,PECH,,,,,,,,,0,69,69,69,left,1,0.431616867507,2017_Mrz_14_1738,170.234839802,Stroop,,7,
neutral,down,"[-0.7725490196, 0.0745098039, -1]", ,10,PECH,,,,,,,,,0,70,70,70,down,1,0.527260866954,2017_Mrz_14_1738,170.234839802,Stroop,,7,
neutral,right,"[-0.8745098039, -0.2078431373, 0.637254902]", ,14,SOLL,,,,,,,,,0,71,71,71,right,1,0.608894426526,2017_Mrz_14_1738,170.234839802,Stroop,,7,
neutral,left,"[0.568627451, -0.7882352941, -0.7882352941]", ,12,SOLL,,,,,,,,,0,72,72,72,left,1,0.582385750145,2017_Mrz_14_1738,170.234839802,Stroop,,7,
neutral,down,"[-0.7725490196, 0.0745098039, -1]", ,13,SOLL,,,,,,,,,0,73,73,73,down,1,0.509316686897,2017_Mrz_14_1738,170.234839802,Stroop,,7,
incongruent,left,"[0.568627451, -0.7882352941, -0.7882352941]", ,6,BLAU,,,,,,,,,0,74,74,74,right,0,0.620797615339,2017_Mrz_14_1738,170.234839802,Stroop,,7,
neutral,right,"[-0.8745098039, -0.2078431373, 0.637254902]", ,14,SOLL,,,,,,,,,0,75,75,75,right,1,0.464762700288,2017_Mrz_14_1738,170.234839802,Stroop,,7,
incongruent,down,"[-0.7725490196, 0.0745098039, -1]", ,1,ROT,,,,,,,,,0,76,76,76,down,1,0.384270347209,2017_Mrz_14_1738,170.234839802,Stroop,,7,
neutral,left,"[0.568627451, -0.7882352941, -0.7882352941]", ,9,PECH,,,,,,,,,0,77,77,77,left,1,0.557853302585,2017_Mrz_14_1738,170.234839802,Stroop,,7,
incongruent,right,"[-0.8745098039, -0.2078431373, 0.637254902]", ,2,ROT,,,,,,,,,0,78,78,78,right,1,0.499924711101,2017_Mrz_14_1738,170.234839802,Stroop,,7,
neutral,down,"[-0.7725490196, 0.0745098039, -1]", ,13,SOLL,,,,,,,,,0,79,79,79,down,1,0.393414805513,2017_Mrz_14_1738,170.234839802,Stroop,,7,
incongruent,left,"[0.568627451, -0.7882352941, -0.7882352941]", ,3,GRÜN,,,,,,,,,0,80,80,80,left,1,0.456816718326,2017_Mrz_14_1738,170.234839802,Stroop,,7,
neutral,right,"[-0.8745098039, -0.2078431373, 0.637254902]", ,11,PECH,,,,,,,,,0,81,81,81,right,1,0.423636244271,2017_Mrz_14_1738,170.234839802,Stroop,,7,
neutral,down,"[-0.7725490196, 0.0745098039, -1]", ,10,PECH,,,,,,,,,0,82,82,82,down,1,0.460776718829,2017_Mrz_14_1738,170.234839802,Stroop,,7,
incongruent,down,"[-0.7725490196, 0.0745098039, -1]", ,7,BLAU,,,,,,,,,0,83,83,83,down,1,0.494026475432,2017_Mrz_14_1738,170.234839802,Stroop,,7,
incongruent,right,"[-0.8745098039, -0.2078431373, 0.637254902]", ,5,GRÜN,,,,,,,,,0,84,84,84,right,1,0.452452755867,2017_Mrz_14_1738,170.234839802,Stroop,,7,
neutral,left,"[0.568627451, -0.7882352941, -0.7882352941]", ,12,SOLL,,,,,,,,,0,85,85,85,left,1,0.389873852682,2017_Mrz_14_1738,170.234839802,Stroop,,7,
congruent,down,"[-0.7725490196, 0.0745098039, -1]", ,4,GRÜN,,,,,,,,,0,86,86,86,down,1,0.390099300331,2017_Mrz_14_1738,170.234839802,Stroop,,7,
neutral,down,"[-0.7725490196, 0.0745098039, -1]", ,10,PECH,,,,,,,,,0,87,87,87,down,1,0.360580744201,2017_Mrz_14_1738,170.234839802,Stroop,,7,
neutral,down,"[-0.7725490196, 0.0745098039, -1]", ,13,SOLL,,,,,,,,,0,88,88,88,down,1,0.350445936565,2017_Mrz_14_1738,170.234839802,Stroop,,7,
congruent,down,"[-0.7725490196, 0.0745098039, -1]", ,4,GRÜN,,,,,,,,,0,89,89,89,down,1,0.355989099174,2017_Mrz_14_1738,170.234839802,Stroop,,7,
neutral,right,"[-0.8745098039, -0.2078431373, 0.637254902]", ,14,SOLL,,,,,,,,,0,90,90,90,right,1,0.451597619251,2017_Mrz_14_1738,170.234839802,Stroop,,7,
congruent,right,"[-0.8745098039, -0.2078431373, 0.637254902]", ,8,BLAU,,,,,,,,,0,91,91,91,right,1,0.346911967862,2017_Mrz_14_1738,170.234839802,Stroop,,7,
neutral,left,"[0.568627451, -0.7882352941, -0.7882352941]", ,12,SOLL,,,,,,,,,0,92,92,92,left,1,0.396596215442,2017_Mrz_14_1738,170.234839802,Stroop,,7,
neutral,right,"[-0.8745098039, -0.2078431373, 0.637254902]", ,11,PECH,,,,,,,,,0,93,93,93,right,1,0.360539118798,2017_Mrz_14_1738,170.234839802,Stroop,,7,
congruent,left,"[0.568627451, -0.7882352941, -0.7882352941]", ,0,ROT,,,,,,,,,0,94,94,94,left,1,0.430034543497,2017_Mrz_14_1738,170.234839802,Stroop,,7,
congruent,left,"[0.568627451, -0.7882352941, -0.7882352941]", ,0,ROT,,,,,,,,,0,95,95,95,left,1,0.359418026593,2017_Mrz_14_1738,170.234839802,Stroop,,7,
neutral,left,"[0.568627451, -0.7882352941, -0.7882352941]", ,9,PECH,,,,,,,,,0,96,96,96,left,1,0.354283295782,2017_Mrz_14_1738,170.234839802,Stroop,,7,
congruent,right,"[-0.8745098039, -0.2078431373, 0.637254902]", ,8,BLAU,,,,,,,,,0,97,97,97,down,0,0.404783568862,2017_Mrz_14_1738,170.234839802,Stroop,,7,
fix,return,white, ,21,+,,,,,,,,,0,98,98,98,None,0,,2017_Mrz_14_1738,170.234839802,Stroop,,7,
fix,return,white, ,21,+,,,,,,,,,0,99,99,99,None,0,,2017_Mrz_14_1738,170.234839802,Stroop,,7,
fix,return,white, ,21,+,,,,,,,,,0,100,100,100,None,0,,2017_Mrz_14_1738,170.234839802,Stroop,,7,
fix,return,white, ,21,+,,,,,,,,,0,101,101,101,None,0,,2017_Mrz_14_1738,170.234839802,Stroop,,7,
fix,return,white, ,21,+,,,,,,,,,0,102,102,102,None,0,,2017_Mrz_14_1738,170.234839802,Stroop,,7,
fix,return,white, ,21,+,,,,,,,,,0,103,103,103,None,0,,2017_Mrz_14_1738,170.234839802,Stroop,,7,
fix,return,white, ,21,+,,,,,,,,,0,104,104,104,None,0,,2017_Mrz_14_1738,170.234839802,Stroop,,7,
fix,return,white, ,21,+,,,,,,,,,0,105,105,105,None,0,,2017_Mrz_14_1738,170.234839802,Stroop,,7,
fix,return,white, ,21,+,,,,,,,,,0,106,106,106,None,0,,2017_Mrz_14_1738,170.234839802,Stroop,,7,
fix,return,white, ,21,+,,,,,,,,,0,107,107,107,None,0,,2017_Mrz_14_1738,170.234839802,Stroop,,7,
fix,return,white, ,21,+,,,,,,,,,0,108,108,108,None,0,,2017_Mrz_14_1738,170.234839802,Stroop,,7,
fix,return,white, ,21,+,,,,,,,,,0,109,109,109,None,0,,2017_Mrz_14_1738,170.234839802,Stroop,,7,
fix,return,white,+,22,+,,,,,,,,,0,110,110,110,None,0,,2017_Mrz_14_1738,170.234839802,Stroop,,7,
neutral,down,"[-0.7725490196, 0.0745098039, -1]", ,10,PECH,,,,,,,,,0,111,111,111,down,1,0.82967807361,2017_Mrz_14_1738,170.234839802,Stroop,,7,
incongruent,right,"[-0.8745098039, -0.2078431373, 0.637254902]", ,5,GRÜN,,,,,,,,,0,112,112,112,right,1,0.445712234377,2017_Mrz_14_1738,170.234839802,Stroop,,7,
neutral,down,"[-0.7725490196, 0.0745098039, -1]", ,13,SOLL,,,,,,,,,0,113,113,113,down,1,0.382208073932,2017_Mrz_14_1738,170.234839802,Stroop,,7,
neutral,right,"[-0.8745098039, -0.2078431373, 0.637254902]", ,11,PECH,,,,,,,,,0,114,114,114,right,1,0.571960682154,2017_Mrz_14_1738,170.234839802,Stroop,,7,
incongruent,left,"[0.568627451, -0.7882352941, -0.7882352941]", ,3,GRÜN,,,,,,,,,0,115,115,115,left,1,0.57270714574,2017_Mrz_14_1738,170.234839802,Stroop,,7,
incongruent,down,"[-0.7725490196, 0.0745098039, -1]", ,1,ROT,,,,,,,,,0,116,116,116,down,1,0.416271621114,2017_Mrz_14_1738,170.234839802,Stroop,,7,
incongruent,down,"[-0.7725490196, 0.0745098039, -1]", ,7,BLAU,,,,,,,,,0,117,117,117,down,1,0.475222409552,2017_Mrz_14_1738,170.234839802,Stroop,,7,
incongruent,left,"[0.568627451, -0.7882352941, -0.7882352941]", ,6,BLAU,,,,,,,,,0,118,118,118,left,1,0.542083141851,2017_Mrz_14_1738,170.234839802,Stroop,,7,
neutral,right,"[-0.8745098039, -0.2078431373, 0.637254902]", ,14,SOLL,,,,,,,,,0,119,119,119,right,1,0.416549310038,2017_Mrz_14_1738,170.234839802,Stroop,,7,
neutral,left,"[0.568627451, -0.7882352941, -0.7882352941]", ,12,SOLL,,,,,,,,,0,120,120,120,left,1,0.454858927601,2017_Mrz_14_1738,170.234839802,Stroop,,7,
incongruent,right,"[-0.8745098039, -0.2078431373, 0.637254902]", ,2,ROT,,,,,,,,,0,121,121,121,right,1,0.432811153373,2017_Mrz_14_1738,170.234839802,Stroop,,7,
neutral,left,"[0.568627451, -0.7882352941, -0.7882352941]", ,9,PECH,,,,,,,,,0,122,122,122,left,1,0.432485413649,2017_Mrz_14_1738,170.234839802,Stroop,,7,
neutral,right,"[-0.8745098039, -0.2078431373, 0.637254902]", ,14,SOLL,,,,,,,,,0,123,123,123,right,1,0.402732749553,2017_Mrz_14_1738,170.234839802,Stroop,,7,
neutralofneutral,right,"[-0.8745098039, -0.2078431373, 0.637254902]", ,20,MODE,,,,,,,,,0,124,124,124,right,1,0.453215981361,2017_Mrz_14_1738,170.234839802,Stroop,,7,
neutralofneutral,down,"[-0.7725490196, 0.0745098039, -1]", ,16,HALS,,,,,,,,,0,125,125,125,left,0,0.41003228064,2017_Mrz_14_1738,170.234839802,Stroop,,7,
neutralofneutral,down,"[-0.7725490196, 0.0745098039, -1]", ,19,MODE,,,,,,,,,0,126,126,126,down,1,0.414599620901,2017_Mrz_14_1738,170.234839802,Stroop,,7,
neutralofneutral,right,"[-0.8745098039, -0.2078431373, 0.637254902]", ,17,HALS,,,,,,,,,0,127,127,127,right,1,0.490541116259,2017_Mrz_14_1738,170.234839802,Stroop,,7,
neutral,down,"[-0.7725490196, 0.0745098039, -1]", ,10,PECH,,,,,,,,,0,128,128,128,down,1,0.632778188289,2017_Mrz_14_1738,170.234839802,Stroop,,7,
neutralofneutral,left,"[0.568627451, -0.7882352941, -0.7882352941]", ,15,HALS,,,,,,,,,0,129,129,129,left,1,0.394433650086,2017_Mrz_14_1738,170.234839802,Stroop,,7,
neutral,left,"[0.568627451, -0.7882352941, -0.7882352941]", ,12,SOLL,,,,,,,,,0,130,130,130,left,1,0.545820208993,2017_Mrz_14_1738,170.234839802,Stroop,,7,
neutralofneutral,left,"[0.568627451, -0.7882352941, -0.7882352941]", ,18,MODE,,,,,,,,,0,131,131,131,left,1,0.691528392575,2017_Mrz_14_1738,170.234839802,Stroop,,7,
neutral,down,"[-0.7725490196, 0.0745098039, -1]", ,13,SOLL,,,,,,,,,0,132,132,132,down,1,0.464769125684,2017_Mrz_14_1738,170.234839802,Stroop,,7,
neutral,left,"[0.568627451, -0.7882352941, -0.7882352941]", ,9,PECH,,,,,,,,,0,133,133,133,left,1,0.69925116181,2017_Mrz_14_1738,170.234839802,Stroop,,7,
neutral,right,"[-0.8745098039, -0.2078431373, 0.637254902]", ,11,PECH,,,,,,,,,0,134,134,134,right,1,0.442393656177,2017_Mrz_14_1738,170.234839802,Stroop,,7,
neutral,right,"[-0.8745098039, -0.2078431373, 0.637254902]", ,11,PECH,,,,,,,,,0,135,135,135,right,1,0.516313386198,2017_Mrz_14_1738,170.234839802,Stroop,,7,
neutral,left,"[0.568627451, -0.7882352941, -0.7882352941]", ,9,PECH,,,,,,,,,0,136,136,136,left,1,0.562185696785,2017_Mrz_14_1738,170.234839802,Stroop,,7,
neutral,right,"[-0.8745098039, -0.2078431373, 0.637254902]", ,14,SOLL,,,,,,,,,0,137,137,137,right,1,0.449022990352,2017_Mrz_14_1738,170.234839802,Stroop,,7,
congruent,down,"[-0.7725490196, 0.0745098039, -1]", ,4,GRÜN,,,,,,,,,0,138,138,138,down,1,0.391504506858,2017_Mrz_14_1738,170.234839802,Stroop,,7,
neutral,left,"[0.568627451, -0.7882352941, -0.7882352941]", ,12,SOLL,,,,,,,,,0,139,139,139,left,1,0.468437189643,2017_Mrz_14_1738,170.234839802,Stroop,,7,
congruent,down,"[-0.7725490196, 0.0745098039, -1]", ,4,GRÜN,,,,,,,,,0,140,140,140,down,1,0.622481348886,2017_Mrz_14_1738,170.234839802,Stroop,,7,
congruent,left,"[0.568627451, -0.7882352941, -0.7882352941]", ,0,ROT,,,,,,,,,0,141,141,141,left,1,0.704231683077,2017_Mrz_14_1738,170.234839802,Stroop,,7,
neutral,down,"[-0.7725490196, 0.0745098039, -1]", ,10,PECH,,,,,,,,,0,142,142,142,down,1,0.518414491227,2017_Mrz_14_1738,170.234839802,Stroop,,7,
congruent,left,"[0.568627451, -0.7882352941, -0.7882352941]", ,0,ROT,,,,,,,,,0,143,143,143,left,1,0.443185097548,2017_Mrz_14_1738,170.234839802,Stroop,,7,
congruent,right,"[-0.8745098039, -0.2078431373, 0.637254902]", ,8,BLAU,,,,,,,,,0,144,144,144,right,1,0.455472134028,2017_Mrz_14_1738,170.234839802,Stroop,,7,
neutral,down,"[-0.7725490196, 0.0745098039, -1]", ,13,SOLL,,,,,,,,,0,145,145,145,down,1,0.380853153124,2017_Mrz_14_1738,170.234839802,Stroop,,7,
congruent,right,"[-0.8745098039, -0.2078431373, 0.637254902]", ,8,BLAU,,,,,,,,,0,146,146,146,down,0,0.396991517078,2017_Mrz_14_1738,170.234839802,Stroop,,7,
fix,return,white, ,21,+,,,,,,,,,0,147,147,147,None,0,,2017_Mrz_14_1738,170.234839802,Stroop,,7,
fix,return,white, ,21,+,,,,,,,,,0,148,148,148,None,0,,2017_Mrz_14_1738,170.234839802,Stroop,,7,
fix,return,white, ,21,+,,,,,,,,,0,149,149,149,None,0,,2017_Mrz_14_1738,170.234839802,Stroop,,7,
fix,return,white, ,21,+,,,,,,,,,0,150,150,150,None,0,,2017_Mrz_14_1738,170.234839802,Stroop,,7,
fix,return,white, ,21,+,,,,,,,,,0,151,151,151,None,0,,2017_Mrz_14_1738,170.234839802,Stroop,,7,
fix,return,white, ,21,+,,,,,,,,,0,152,152,152,None,0,,2017_Mrz_14_1738,170.234839802,Stroop,,7,
fix,return,white, ,21,+,,,,,,,,,0,153,153,153,None,0,,2017_Mrz_14_1738,170.234839802,Stroop,,7,
fix,return,white, ,21,+,,,,,,,,,0,154,154,154,None,0,,2017_Mrz_14_1738,170.234839802,Stroop,,7,
fix,return,white, ,21,+,,,,,,,,,0,155,155,155,None,0,,2017_Mrz_14_1738,170.234839802,Stroop,,7,
fix,return,white, ,21,+,,,,,,,,,0,156,156,156,None,0,,2017_Mrz_14_1738,170.234839802,Stroop,,7,
fix,return,white, ,21,+,,,,,,,,,0,157,157,157,None,0,,2017_Mrz_14_1738,170.234839802,Stroop,,7,
fix,return,white, ,21,+,,,,,,,,,0,158,158,158,None,0,,2017_Mrz_14_1738,170.234839802,Stroop,,7,
fix,return,white,+,22,+,,,,,,,,,0,159,159,159,None,0,,2017_Mrz_14_1738,170.234839802,Stroop,,7,
neutral,down,"[-0.7725490196, 0.0745098039, -1]", ,10,PECH,,,,,,,,,0,160,160,160,down,1,0.839633249477,2017_Mrz_14_1738,170.234839802,Stroop,,7,
neutral,right,"[-0.8745098039, -0.2078431373, 0.637254902]", ,11,PECH,,,,,,,,,0,161,161,161,right,1,0.541447027485,2017_Mrz_14_1738,170.234839802,Stroop,,7,
congruent,down,"[-0.7725490196, 0.0745098039, -1]", ,4,GRÜN,,,,,,,,,0,162,162,162,down,1,0.491839046583,2017_Mrz_14_1738,170.234839802,Stroop,,7,
neutral,down,"[-0.7725490196, 0.0745098039, -1]", ,13,SOLL,,,,,,,,,0,163,163,163,down,1,0.428700016343,2017_Mrz_14_1738,170.234839802,Stroop,,7,
neutral,left,"[0.568627451, -0.7882352941, -0.7882352941]", ,9,PECH,,,,,,,,,0,164,164,164,left,1,0.554816603786,2017_Mrz_14_1738,170.234839802,Stroop,,7,
neutral,right,"[-0.8745098039, -0.2078431373, 0.637254902]", ,14,SOLL,,,,,,,,,0,165,165,165,right,1,0.543752348413,2017_Mrz_14_1738,170.234839802,Stroop,,7,
congruent,left,"[0.568627451, -0.7882352941, -0.7882352941]", ,0,ROT,,,,,,,,,0,166,166,166,left,1,0.473372733127,2017_Mrz_14_1738,170.234839802,Stroop,,7,
congruent,right,"[-0.8745098039, -0.2078431373, 0.637254902]", ,8,BLAU,,,,,,,,,0,167,167,167,right,1,0.436681198308,2017_Mrz_14_1738,170.234839802,Stroop,,7,
congruent,left,"[0.568627451, -0.7882352941, -0.7882352941]", ,0,ROT,,,,,,,,,0,168,168,168,left,1,0.475982282665,2017_Mrz_14_1738,170.234839802,Stroop,,7,
congruent,down,"[-0.7725490196, 0.0745098039, -1]", ,4,GRÜN,,,,,,,,,0,169,169,169,down,1,0.384982169521,2017_Mrz_14_1738,170.234839802,Stroop,,7,
congruent,right,"[-0.8745098039, -0.2078431373, 0.637254902]", ,8,BLAU,,,,,,,,,0,170,170,170,right,1,0.490177662245,2017_Mrz_14_1738,170.234839802,Stroop,,7,
neutral,left,"[0.568627451, -0.7882352941, -0.7882352941]", ,12,SOLL,,,,,,,,,0,171,171,171,left,1,0.455375473698,2017_Mrz_14_1738,170.234839802,Stroop,,7,
neutral,right,"[-0.8745098039, -0.2078431373, 0.637254902]", ,14,SOLL,,,,,,,,,0,172,172,172,right,1,0.52069550739,2017_Mrz_14_1738,170.234839802,Stroop,,7,
neutral,left,"[0.568627451, -0.7882352941, -0.7882352941]", ,12,SOLL,,,,,,,,,0,173,173,173,left,1,0.47378200302,2017_Mrz_14_1738,170.234839802,Stroop,,7,
incongruent,down,"[-0.7725490196, 0.0745098039, -1]", ,7,BLAU,,,,,,,,,0,174,174,174,down,1,0.423600485537,2017_Mrz_14_1738,170.234839802,Stroop,,7,
incongruent,down,"[-0.7725490196, 0.0745098039, -1]", ,1,ROT,,,,,,,,,0,175,175,175,down,1,0.505101626045,2017_Mrz_14_1738,170.234839802,Stroop,,7,
incongruent,left,"[0.568627451, -0.7882352941, -0.7882352941]", ,6,BLAU,,,,,,,,,0,176,176,176,left,1,0.519307900864,2017_Mrz_14_1738,170.234839802,Stroop,,7,
neutral,right,"[-0.8745098039, -0.2078431373, 0.637254902]", ,11,PECH,,,,,,,,,0,177,177,177,right,1,0.380678549928,2017_Mrz_14_1738,170.234839802,Stroop,,7,
neutral,left,"[0.568627451, -0.7882352941, -0.7882352941]", ,9,PECH,,,,,,,,,0,178,178,178,left,1,0.47774731146,2017_Mrz_14_1738,170.234839802,Stroop,,7,
incongruent,left,"[0.568627451, -0.7882352941, -0.7882352941]", ,3,GRÜN,,,,,,,,,0,179,179,179,left,1,0.429476930727,2017_Mrz_14_1738,170.234839802,Stroop,,7,
incongruent,right,"[-0.8745098039, -0.2078431373, 0.637254902]", ,2,ROT,,,,,,,,,0,180,180,180,right,1,0.413197208025,2017_Mrz_14_1738,170.234839802,Stroop,,7,
neutral,down,"[-0.7725490196, 0.0745098039, -1]", ,13,SOLL,,,,,,,,,0,181,181,181,down,1,0.462130522175,2017_Mrz_14_1738,170.234839802,Stroop,,7,
neutral,down,"[-0.7725490196, 0.0745098039, -1]", ,10,PECH,,,,,,,,,0,182,182,182,down,1,0.443307180102,2017_Mrz_14_1738,170.234839802,Stroop,,7,
incongruent,right,"[-0.8745098039, -0.2078431373, 0.637254902]", ,5,GRÜN,,,,,,,,,0,183,183,183,right,1,0.545913796307,2017_Mrz_14_1738,170.234839802,Stroop,,7,
neutralofneutral,left,"[0.568627451, -0.7882352941, -0.7882352941]", ,15,HALS,,,,,,,,,0,184,184,184,left,1,0.493949370661,2017_Mrz_14_1738,170.234839802,Stroop,,7,
neutral,right,"[-0.8745098039, -0.2078431373, 0.637254902]", ,11,PECH,,,,,,,,,0,185,185,185,right,1,0.736029020448,2017_Mrz_14_1738,170.234839802,Stroop,,7,
neutralofneutral,down,"[-0.7725490196, 0.0745098039, -1]", ,19,MODE,,,,,,,,,0,186,186,186,down,1,0.467691843516,2017_Mrz_14_1738,170.234839802,Stroop,,7,
neutral,right,"[-0.8745098039, -0.2078431373, 0.637254902]", ,14,SOLL,,,,,,,,,0,187,187,187,right,1,0.436511064953,2017_Mrz_14_1738,170.234839802,Stroop,,7,
neutralofneutral,left,"[0.568627451, -0.7882352941, -0.7882352941]", ,18,MODE,,,,,,,,,0,188,188,188,left,1,0.455616565792,2017_Mrz_14_1738,170.234839802,Stroop,,7,
neutral,left,"[0.568627451, -0.7882352941, -0.7882352941]", ,12,SOLL,,,,,,,,,0,189,189,189,left,1,0.378905978273,2017_Mrz_14_1738,170.234839802,Stroop,,7,
neutral,down,"[-0.7725490196, 0.0745098039, -1]", ,10,PECH,,,,,,,,,0,190,190,190,down,1,0.451733949427,2017_Mrz_14_1738,170.234839802,Stroop,,7,
neutralofneutral,down,"[-0.7725490196, 0.0745098039, -1]", ,16,HALS,,,,,,,,,0,191,191,191,down,1,0.423511926795,2017_Mrz_14_1738,170.234839802,Stroop,,7,
neutral,down,"[-0.7725490196, 0.0745098039, -1]", ,13,SOLL,,,,,,,,,0,192,192,192,down,1,0.457872997826,2017_Mrz_14_1738,170.234839802,Stroop,,7,
neutralofneutral,right,"[-0.8745098039, -0.2078431373, 0.637254902]", ,20,MODE,,,,,,,,,0,193,193,193,right,1,0.521250326508,2017_Mrz_14_1738,170.234839802,Stroop,,7,
neutral,left,"[0.568627451, -0.7882352941, -0.7882352941]", ,9,PECH,,,,,,,,,0,194,194,194,left,1,0.775149914305,2017_Mrz_14_1738,170.234839802,Stroop,,7,
neutralofneutral,right,"[-0.8745098039, -0.2078431373, 0.637254902]", ,17,HALS,,,,,,,,,0,195,195,195,right,1,0.467538751433,2017_Mrz_14_1738,170.234839802,Stroop,,7,
fix,return,white, ,21,+,,,,,,,,,0,196,196,196,None,0,,2017_Mrz_14_1738,170.234839802,Stroop,,7,
fix,return,white, ,21,+,,,,,,,,,0,197,197,197,None,0,,2017_Mrz_14_1738,170.234839802,Stroop,,7,
fix,return,white, ,21,+,,,,,,,,,0,198,198,198,None,0,,2017_Mrz_14_1738,170.234839802,Stroop,,7,
fix,return,white, ,21,+,,,,,,,,,0,199,199,199,None,0,,2017_Mrz_14_1738,170.234839802,Stroop,,7,
fix,return,white, ,21,+,,,,,,,,,0,200,200,200,None,0,,2017_Mrz_14_1738,170.234839802,Stroop,,7,
fix,return,white, ,21,+,,,,,,,,,0,201,201,201,None,0,,2017_Mrz_14_1738,170.234839802,Stroop,,7,
fix,return,white, ,21,+,,,,,,,,,0,202,202,202,None,0,,2017_Mrz_14_1738,170.234839802,Stroop,,7,
fix,return,white, ,21,+,,,,,,,,,0,203,203,203,None,0,,2017_Mrz_14_1738,170.234839802,Stroop,,7,
fix,return,white, ,21,+,,,,,,,,,0,204,204,204,None,0,,2017_Mrz_14_1738,170.234839802,Stroop,,7,
fix,return,white, ,21,+,,,,,,,,,0,205,205,205,None,0,,2017_Mrz_14_1738,170.234839802,Stroop,,7,
fix,return,white, ,21,+,,,,,,,,,0,206,206,206,None,0,,2017_Mrz_14_1738,170.234839802,Stroop,,7,
fix,return,white, ,21,+,,,,,,,,,0,207,207,207,None,0,,2017_Mrz_14_1738,170.234839802,Stroop,,7,
fix,return,white,+,22,+,,,,,,,,,0,208,208,208,None,0,,2017_Mrz_14_1738,170.234839802,Stroop,,7,
neutral,left,"[0.568627451, -0.7882352941, -0.7882352941]", ,12,SOLL,,,,,,,,,0,209,209,209,left,1,0.594552100895,2017_Mrz_14_1738,170.234839802,Stroop,,7,
congruent,left,"[0.568627451, -0.7882352941, -0.7882352941]", ,0,ROT,,,,,,,,,0,210,210,210,left,1,0.40430501642,2017_Mrz_14_1738,170.234839802,Stroop,,7,
congruent,right,"[-0.8745098039, -0.2078431373, 0.637254902]", ,8,BLAU,,,,,,,,,0,211,211,211,right,1,0.463999474794,2017_Mrz_14_1738,170.234839802,Stroop,,7,
neutral,right,"[-0.8745098039, -0.2078431373, 0.637254902]", ,14,SOLL,,,,,,,,,0,212,212,212,right,1,0.430328714962,2017_Mrz_14_1738,170.234839802,Stroop,,7,
congruent,down,"[-0.7725490196, 0.0745098039, -1]", ,4,GRÜN,,,,,,,,,0,213,213,213,down,1,0.429209578312,2017_Mrz_14_1738,170.234839802,Stroop,,7,
congruent,down,"[-0.7725490196, 0.0745098039, -1]", ,4,GRÜN,,,,,,,,,0,214,214,214,down,1,0.338773782702,2017_Mrz_14_1738,170.234839802,Stroop,,7,
neutral,down,"[-0.7725490196, 0.0745098039, -1]", ,13,SOLL,,,,,,,,,0,215,215,215,down,1,0.482063781849,2017_Mrz_14_1738,170.234839802,Stroop,,7,
neutral,left,"[0.568627451, -0.7882352941, -0.7882352941]", ,9,PECH,,,,,,,,,0,216,216,216,left,1,0.465611970237,2017_Mrz_14_1738,170.234839802,Stroop,,7,
neutral,right,"[-0.8745098039, -0.2078431373, 0.637254902]", ,11,PECH,,,,,,,,,0,217,217,217,right,1,0.379100137028,2017_Mrz_14_1738,170.234839802,Stroop,,7,
congruent,right,"[-0.8745098039, -0.2078431373, 0.637254902]", ,8,BLAU,,,,,,,,,0,218,218,218,right,1,0.328323571851,2017_Mrz_14_1738,170.234839802,Stroop,,7,
neutral,down,"[-0.7725490196, 0.0745098039, -1]", ,10,PECH,,,,,,,,,0,219,219,219,down,1,0.3973356949,2017_Mrz_14_1738,170.234839802,Stroop,,7,
congruent,left,"[0.568627451, -0.7882352941, -0.7882352941]", ,0,ROT,,,,,,,,,0,220,220,220,left,1,0.553235676602,2017_Mrz_14_1738,170.234839802,Stroop,,7,
neutralofneutral,left,"[0.568627451, -0.7882352941, -0.7882352941]", ,18,MODE,,,,,,,,,0,221,221,221,left,1,0.352371041571,2017_Mrz_14_1738,170.234839802,Stroop,,7,
neutralofneutral,right,"[-0.8745098039, -0.2078431373, 0.637254902]", ,17,HALS,,,,,,,,,0,222,222,222,down,0,0.394788723148,2017_Mrz_14_1738,170.234839802,Stroop,,7,
neutralofneutral,right,"[-0.8745098039, -0.2078431373, 0.637254902]", ,20,MODE,,,,,,,,,0,223,223,223,right,1,0.397610590173,2017_Mrz_14_1738,170.234839802,Stroop,,7,
neutral,left,"[0.568627451, -0.7882352941, -0.7882352941]", ,12,SOLL,,,,,,,,,0,224,224,224,left,1,0.598464888694,2017_Mrz_14_1738,170.234839802,Stroop,,7,
neutral,right,"[-0.8745098039, -0.2078431373, 0.637254902]", ,14,SOLL,,,,,,,,,0,225,225,225,right,1,0.481903146909,2017_Mrz_14_1738,170.234839802,Stroop,,7,
neutralofneutral,down,"[-0.7725490196, 0.0745098039, -1]", ,16,HALS,,,,,,,,,0,226,226,226,down,1,0.489636252652,2017_Mrz_14_1738,170.234839802,Stroop,,7,
neutral,left,"[0.568627451, -0.7882352941, -0.7882352941]", ,9,PECH,,,,,,,,,0,227,227,227,left,1,0.51999038984,2017_Mrz_14_1738,170.234839802,Stroop,,7,
neutralofneutral,left,"[0.568627451, -0.7882352941, -0.7882352941]", ,15,HALS,,,,,,,,,0,228,228,228,left,1,0.368693786501,2017_Mrz_14_1738,170.234839802,Stroop,,7,
neutral,down,"[-0.7725490196, 0.0745098039, -1]", ,10,PECH,,,,,,,,,0,229,229,229,down,1,0.489821471723,2017_Mrz_14_1738,170.234839802,Stroop,,7,
neutral,right,"[-0.8745098039, -0.2078431373, 0.637254902]", ,11,PECH,,,,,,,,,0,230,230,230,right,1,0.368360783285,2017_Mrz_14_1738,170.234839802,Stroop,,7,
neutralofneutral,down,"[-0.7725490196, 0.0745098039, -1]", ,19,MODE,,,,,,,,,0,231,231,231,down,1,0.40868434396,2017_Mrz_14_1738,170.234839802,Stroop,,7,
neutral,down,"[-0.7725490196, 0.0745098039, -1]", ,13,SOLL,,,,,,,,,0,232,232,232,down,1,0.508573016961,2017_Mrz_14_1738,170.234839802,Stroop,,7,
neutral,right,"[-0.8745098039, -0.2078431373, 0.637254902]", ,11,PECH,,,,,,,,,0,233,233,233,right,1,0.489470868504,2017_Mrz_14_1738,170.234839802,Stroop,,7,
incongruent,left,"[0.568627451, -0.7882352941, -0.7882352941]", ,6,BLAU,,,,,,,,,0,234,234,234,left,1,0.589520455813,2017_Mrz_14_1738,170.234839802,Stroop,,7,
neutral,down,"[-0.7725490196, 0.0745098039, -1]", ,10,PECH,,,,,,,,,0,235,235,235,down,1,0.44116165602,2017_Mrz_14_1738,170.234839802,Stroop,,7,
neutral,left,"[0.568627451, -0.7882352941, -0.7882352941]", ,12,SOLL,,,,,,,,,0,236,236,236,left,1,0.484627515508,2017_Mrz_14_1738,170.234839802,Stroop,,7,
incongruent,down,"[-0.7725490196, 0.0745098039, -1]", ,1,ROT,,,,,,,,,0,237,237,237,down,1,0.388295439783,2017_Mrz_14_1738,170.234839802,Stroop,,7,
neutral,down,"[-0.7725490196, 0.0745098039, -1]", ,13,SOLL,,,,,,,,,0,238,238,238,down,1,0.41719883393,2017_Mrz_14_1738,170.234839802,Stroop,,7,
neutral,right,"[-0.8745098039, -0.2078431373, 0.637254902]", ,14,SOLL,,,,,,,,,0,239,239,239,right,1,0.565090814614,2017_Mrz_14_1738,170.234839802,Stroop,,7,
incongruent,right,"[-0.8745098039, -0.2078431373, 0.637254902]", ,5,GRÜN,,,,,,,,,0,240,240,240,right,1,0.371647234495,2017_Mrz_14_1738,170.234839802,Stroop,,7,
incongruent,down,"[-0.7725490196, 0.0745098039, -1]", ,7,BLAU,,,,,,,,,0,241,241,241,down,1,0.541292817942,2017_Mrz_14_1738,170.234839802,Stroop,,7,
incongruent,left,"[0.568627451, -0.7882352941, -0.7882352941]", ,3,GRÜN,,,,,,,,,0,242,242,242,left,1,0.416484217966,2017_Mrz_14_1738,170.234839802,Stroop,,7,
incongruent,right,"[-0.8745098039, -0.2078431373, 0.637254902]", ,2,ROT,,,,,,,,,0,243,243,243,right,1,0.479877191096,2017_Mrz_14_1738,170.234839802,Stroop,,7,
neutral,left,"[0.568627451, -0.7882352941, -0.7882352941]", ,9,PECH,,,,,,,,,0,244,244,244,left,1,0.404436597389,2017_Mrz_14_1738,170.234839802,Stroop,,7,
fix,return,white, ,21,+,,,,,,,,,0,245,245,245,None,0,,2017_Mrz_14_1738,170.234839802,Stroop,,7,
fix,return,white, ,21,+,,,,,,,,,0,246,246,246,None,0,,2017_Mrz_14_1738,170.234839802,Stroop,,7,
fix,return,white, ,21,+,,,,,,,,,0,247,247,247,None,0,,2017_Mrz_14_1738,170.234839802,Stroop,,7,
fix,return,white, ,21,+,,,,,,,,,0,248,248,248,None,0,,2017_Mrz_14_1738,170.234839802,Stroop,,7,
fix,return,white, ,21,+,,,,,,,,,0,249,249,249,None,0,,2017_Mrz_14_1738,170.234839802,Stroop,,7,
fix,return,white, ,21,+,,,,,,,,,0,250,250,250,None,0,,2017_Mrz_14_1738,170.234839802,Stroop,,7,
fix,return,white, ,21,+,,,,,,,,,0,251,251,251,None,0,,2017_Mrz_14_1738,170.234839802,Stroop,,7,
fix,return,white, ,21,+,,,,,,,,,0,252,252,252,None,0,,2017_Mrz_14_1738,170.234839802,Stroop,,7,
fix,return,white, ,21,+,,,,,,,,,0,253,253,253,None,0,,2017_Mrz_14_1738,170.234839802,Stroop,,7,
fix,return,white, ,21,+,,,,,,,,,0,254,254,254,None,0,,2017_Mrz_14_1738,170.234839802,Stroop,,7,
fix,return,white, ,21,+,,,,,,,,,0,255,255,255,None,0,,2017_Mrz_14_1738,170.234839802,Stroop,,7,
fix,return,white, ,21,+,,,,,,,,,0,256,256,256,None,0,,2017_Mrz_14_1738,170.234839802,Stroop,,7,
fix,return,white,+,22,+,,,,,,,,,0,257,257,257,None,0,,2017_Mrz_14_1738,170.234839802,Stroop,,7,
neutral,down,"[-0.7725490196, 0.0745098039, -1]", ,10,PECH,,,,,,,,,0,258,258,258,left,0,0.509586274234,2017_Mrz_14_1738,170.234839802,Stroop,,7,
neutral,right,"[-0.8745098039, -0.2078431373, 0.637254902]", ,11,PECH,,,,,,,,,0,259,259,259,right,1,0.583195908977,2017_Mrz_14_1738,170.234839802,Stroop,,7,
neutralofneutral,right,"[-0.8745098039, -0.2078431373, 0.637254902]", ,17,HALS,,,,,,,,,0,260,260,260,right,1,0.442373262524,2017_Mrz_14_1738,170.234839802,Stroop,,7,
neutral,right,"[-0.8745098039, -0.2078431373, 0.637254902]", ,14,SOLL,,,,,,,,,0,261,261,261,right,1,0.380863210269,2017_Mrz_14_1738,170.234839802,Stroop,,7,
neutral,down,"[-0.7725490196, 0.0745098039, -1]", ,13,SOLL,,,,,,,,,0,262,262,262,down,1,0.400249193682,2017_Mrz_14_1738,170.234839802,Stroop,,7,
neutralofneutral,down,"[-0.7725490196, 0.0745098039, -1]", ,16,HALS,,,,,,,,,0,263,263,263,down,1,0.321058402674,2017_Mrz_14_1738,170.234839802,Stroop,,7,
neutralofneutral,left,"[0.568627451, -0.7882352941, -0.7882352941]", ,18,MODE,,,,,,,,,0,264,264,264,left,1,0.356436921452,2017_Mrz_14_1738,170.234839802,Stroop,,7,
neutral,left,"[0.568627451, -0.7882352941, -0.7882352941]", ,12,SOLL,,,,,,,,,0,265,265,265,left,1,0.374999895239,2017_Mrz_14_1738,170.234839802,Stroop,,7,
neutralofneutral,down,"[-0.7725490196, 0.0745098039, -1]", ,19,MODE,,,,,,,,,0,266,266,266,down,1,0.375315857183,2017_Mrz_14_1738,170.234839802,Stroop,,7,
neutral,left,"[0.568627451, -0.7882352941, -0.7882352941]", ,9,PECH,,,,,,,,,0,267,267,267,left,1,0.442185249802,2017_Mrz_14_1738,170.234839802,Stroop,,7,
neutralofneutral,left,"[0.568627451, -0.7882352941, -0.7882352941]", ,15,HALS,,,,,,,,,0,268,268,268,down,0,0.391190500468,2017_Mrz_14_1738,170.234839802,Stroop,,7,
neutralofneutral,right,"[-0.8745098039, -0.2078431373, 0.637254902]", ,20,MODE,,,,,,,,,0,269,269,269,right,1,0.476619235126,2017_Mrz_14_1738,170.234839802,Stroop,,7,
congruent,right,"[-0.8745098039, -0.2078431373, 0.637254902]", ,8,BLAU,,,,,,,,,0,270,270,270,right,1,0.46351645251,2017_Mrz_14_1738,170.234839802,Stroop,,7,
neutral,left,"[0.568627451, -0.7882352941, -0.7882352941]", ,12,SOLL,,,,,,,,,0,271,271,271,left,1,0.670554218483,2017_Mrz_14_1738,170.234839802,Stroop,,7,
neutral,right,"[-0.8745098039, -0.2078431373, 0.637254902]", ,14,SOLL,,,,,,,,,0,272,272,272,right,1,0.645042316831,2017_Mrz_14_1738,170.234839802,Stroop,,7,
neutral,down,"[-0.7725490196, 0.0745098039, -1]", ,13,SOLL,,,,,,,,,0,273,273,273,down,1,0.455400616559,2017_Mrz_14_1738,170.234839802,Stroop,,7,
neutral,down,"[-0.7725490196, 0.0745098039, -1]", ,10,PECH,,,,,,,,,0,274,274,274,down,1,0.401039796958,2017_Mrz_14_1738,170.234839802,Stroop,,7,
congruent,left,"[0.568627451, -0.7882352941, -0.7882352941]", ,0,ROT,,,,,,,,,0,275,275,275,left,1,0.490812379785,2017_Mrz_14_1738,170.234839802,Stroop,,7,
congruent,left,"[0.568627451, -0.7882352941, -0.7882352941]", ,0,ROT,,,,,,,,,0,276,276,276,left,1,0.448341339472,2017_Mrz_14_1738,170.234839802,Stroop,,7,
congruent,down,"[-0.7725490196, 0.0745098039, -1]", ,4,GRÜN,,,,,,,,,0,277,277,277,down,1,0.622555939372,2017_Mrz_14_1738,170.234839802,Stroop,,7,
neutral,right,"[-0.8745098039, -0.2078431373, 0.637254902]", ,11,PECH,,,,,,,,,0,278,278,278,right,1,0.450058596833,2017_Mrz_14_1738,170.234839802,Stroop,,7,
congruent,right,"[-0.8745098039, -0.2078431373, 0.637254902]", ,8,BLAU,,,,,,,,,0,279,279,279,right,1,0.463858954141,2017_Mrz_14_1738,170.234839802,Stroop,,7,
congruent,down,"[-0.7725490196, 0.0745098039, -1]", ,4,GRÜN,,,,,,,,,0,280,280,280,down,1,0.481337153186,2017_Mrz_14_1738,170.234839802,Stroop,,7,
neutral,left,"[0.568627451, -0.7882352941, -0.7882352941]", ,9,PECH,,,,,,,,,0,281,281,281,left,1,0.669690421548,2017_Mrz_14_1738,170.234839802,Stroop,,7,
incongruent,left,"[0.568627451, -0.7882352941, -0.7882352941]", ,3,GRÜN,,,,,,,,,0,282,282,282,left,1,0.468703424598,2017_Mrz_14_1738,170.234839802,Stroop,,7,
incongruent,left,"[0.568627451, -0.7882352941, -0.7882352941]", ,6,BLAU,,,,,,,,,0,283,283,283,left,1,0.354391130716,2017_Mrz_14_1738,170.234839802,Stroop,,7,
neutral,down,"[-0.7725490196, 0.0745098039, -1]", ,13,SOLL,,,,,,,,,0,284,284,284,down,1,0.435916855355,2017_Mrz_14_1738,170.234839802,Stroop,,7,
incongruent,down,"[-0.7725490196, 0.0745098039, -1]", ,1,ROT,,,,,,,,,0,285,285,285,down,1,0.419871240619,2017_Mrz_14_1738,170.234839802,Stroop,,7,
incongruent,right,"[-0.8745098039, -0.2078431373, 0.637254902]", ,2,ROT,,,,,,,,,0,286,286,286,right,1,0.352083854233,2017_Mrz_14_1738,170.234839802,Stroop,,7,
neutral,right,"[-0.8745098039, -0.2078431373, 0.637254902]", ,14,SOLL,,,,,,,,,0,287,287,287,right,1,0.362108312648,2017_Mrz_14_1738,170.234839802,Stroop,,7,
neutral,right,"[-0.8745098039, -0.2078431373, 0.637254902]", ,11,PECH,,,,,,,,,0,288,288,288,right,1,0.394749612032,2017_Mrz_14_1738,170.234839802,Stroop,,7,
incongruent,down,"[-0.7725490196, 0.0745098039, -1]", ,7,BLAU,,,,,,,,,0,289,289,289,down,1,0.864783093941,2017_Mrz_14_1738,170.234839802,Stroop,,7,
incongruent,right,"[-0.8745098039, -0.2078431373, 0.637254902]", ,5,GRÜN,,,,,,,,,0,290,290,290,right,1,0.473798206196,2017_Mrz_14_1738,170.234839802,Stroop,,7,
neutral,left,"[0.568627451, -0.7882352941, -0.7882352941]", ,9,PECH,,,,,,,,,0,291,291,291,left,1,0.470647526432,2017_Mrz_14_1738,170.234839802,Stroop,,7,
neutral,left,"[0.568627451, -0.7882352941, -0.7882352941]", ,12,SOLL,,,,,,,,,0,292,292,292,left,1,0.4432775674,2017_Mrz_14_1738,170.234839802,Stroop,,7,
neutral,down,"[-0.7725490196, 0.0745098039, -1]", ,10,PECH,,,,,,,,,0,293,293,293,down,1,0.409628598048,2017_Mrz_14_1738,170.234839802,Stroop,,7,
fix,return,white, ,21,+,,,,,,,,,0,294,294,294,None,0,,2017_Mrz_14_1738,170.234839802,Stroop,,7,
fix,return,white, ,21,+,,,,,,,,,0,295,295,295,None,0,,2017_Mrz_14_1738,170.234839802,Stroop,,7,
fix,return,white, ,21,+,,,,,,,,,0,296,296,296,None,0,,2017_Mrz_14_1738,170.234839802,Stroop,,7,
fix,return,white, ,21,+,,,,,,,,,0,297,297,297,None,0,,2017_Mrz_14_1738,170.234839802,Stroop,,7,
fix,return,white, ,21,+,,,,,,,,,0,298,298,298,None,0,,2017_Mrz_14_1738,170.234839802,Stroop,,7,
fix,return,white, ,21,+,,,,,,,,,0,299,299,299,None,0,,2017_Mrz_14_1738,170.234839802,Stroop,,7,
fix,return,white, ,21,+,,,,,,,,,0,300,300,300,None,0,,2017_Mrz_14_1738,170.234839802,Stroop,,7,
fix,return,white, ,21,+,,,,,,,,,0,301,301,301,None,0,,2017_Mrz_14_1738,170.234839802,Stroop,,7,
fix,return,white, ,21,+,,,,,,,,,0,302,302,302,None,0,,2017_Mrz_14_1738,170.234839802,Stroop,,7,
fix,return,white, ,21,+,,,,,,,,,0,303,303,303,None,0,,2017_Mrz_14_1738,170.234839802,Stroop,,7,
fix,return,white, ,21,+,,,,,,,,,0,304,304,304,None,0,,2017_Mrz_14_1738,170.234839802,Stroop,,7,
fix,return,white, ,21,+,,,,,,,,,0,305,305,305,None,0,,2017_Mrz_14_1738,170.234839802,Stroop,,7,
fix,return,white,+,22,+,,,,,,,,,0,306,306,306,None,0,,2017_Mrz_14_1738,170.234839802,Stroop,,7,
