ID,Boundary,ControlledDriftRate,PeakAmplitude,Shape,Tau,NonDecisionTime,VariabilityofNondecisionTime,Gscore,t90,tmax,ShamOrVerum
SMRI1verum,104.558213732,0.265526685448,17.9077411239,3.94266675865,112.070747387,422.061647394,294.445560655,23.9095876897,740.1498694031535,329.78686295278624,verum
SMRI1sham,96.7370205398,0.255883311769,18.379649245,5.1196927102,111.995195939,440.610309959,323.617869639,21.1295307576,912.58183811542267,461.3857922873189,sham
SMRI2verum,81.3908266128,0.284047220359,4.70989995999,3.67313909551,129.649141254,342.271418775,193.080243665,20.0673279452,809.36425611949653,346.5701881853658,verum
SMRI2sham,81.4599879241,0.320459144016,10.5252245756,4.61583070182,75.6121124365,314.583676917,191.093421688,6.80539643303,566.60566682729655,273.40059757736253,sham
SMRI3verum,63.2709462198,0.295436379806,18.2074557243,4.24761295286,139.379722235,370.993648787,138.714025662,32.8453749117,976.97063941225565,452.65139129641494,verum
SMRI3sham,63.9769792925,0.340423308189,11.5829367222,4.0910246962,77.7200653579,361.439235741,125.471627936,21.0102248878,528.64381700322463,240.23464141154696,sham
SMRI4verum,95.0233593426,0.299827538,14.645983765,3.69116422072,102.260835809,388.227396425,236.74784402,26.5608667221,640.87072678768516,275.2007025101034,verum
SMRI4sham,80.3603105974,0.340037763502,9.97181320487,3.80590425919,105.665524146,411.174278997,106.312312126,26.2703539532,678.50747665039887,296.48734425080517,sham
SMRI5verum,109.191314656,0.241036289504,15.4691779229,3.97017050629,138.906661664,328.850932551,273.291101666,19.365366295,922.48102458326093,412.5764696016167,verum
SMRI5sham,96.9917146012,0.298897158986,24.999894031,4.41704313525,160.550675394,376.263046482,215.475792372,16.8618678479,1161.2371845636903,548.6085832148189,sham
SMRI6verum,74.1270818386,0.427002318884,19.4509959385,4.79230905616,120.691046351,395.696252976,232.362273488,17.6147844208,932.20385890362888,457.69774807432356,verum
SMRI6sham,79.045318687,0.3545377097,12.6416790964,3.76277615274,148.408928775,379.898955589,259.391930605,17.6726073159,944.38108639705001,410.02064927325915,sham
SMRI7verum,51.5847641524,0.491545052675,-6.27579411808,3.01518509338,33.2811936062,393.331012902,187.822488917,22.9848930935,177.83472447364628,67.067765245108,verum
SMRI7sham,57.5187864391,0.412121745224,13.7240793229,4.53051153741,127.086015798,358.990237977,186.123823627,30.3557384478,938.12992448834734,448.67864501830854,sham
SMRI8verum,67.5534437303,0.471192625403,14.6814137933,5.19347560277,110.972942983,364.148244213,136.871209887,6.57270906588,914.81846943646997,465.3623289667968,verum
SMRI8sham,89.3385270068,0.429277439132,3.94883096074,2.97749501838,137.704148498,367.257138881,143.075525002,4.71532470626,728.59945458813536,272.30926766505473,sham
