best_paramset_1 = [63.580280452499998, 0.33572371099199999, 5.7463875606499997, 3.41672718492, 63.176738847000003, 494.78308420100001, 187.39291208099999]
best_paramset_statistic_1 = 30.3483816457
best_paramset_2 = [63.234102963600002, 0.34200183635699999, 5.4516524074700001, 3.5916643116400002, 70.562932660399994, 496.35516644299997, 184.34743608599999]
best_paramset_statistic_2 = 31.4883745549
ID = "sdlpfc6sham"