congruent,corrAns,letterColor,signal,selectedrownumber_novariable,Anzeigetext,practice.thisRepN,practice.thisTrialN,practice.thisN,practice.thisIndex,Wrongresponse.thisRepN,Wrongresponse.thisTrialN,Wrongresponse.thisN,Wrongresponse.thisIndex,trials.thisRepN,trials.thisTrialN,trials.thisN,trials.thisIndex,ITI,resp.keys,resp.rt,date,frameRate,expName,session,participant,
incongruent,3.0,"[-0.6443487062397026, -0.04593565844132552, 0.6810053835620706]", ,1.0,ROT,0,0,0,0,0,0,0,0,,,,,18,3,0.785681979134,2017_Okt_06_1602,98.1934767103,Stroop,11,11,
,,,,,,0,0,0,0,,,,,,,,,,,,2017_Okt_06_1602,98.1934767103,Stroop,11,11,
congruent,2.0,"[0.5904624419653648, -0.35540782668412696, -0.39327822393077794]", ,0.0,ROT,,,,,,,,,0,0,0,0,10.0,2,0.375391565129,2017_Okt_06_1602,98.1934767103,Stroop,11,11,
congruent,2.0,"[0.5904624419653648, -0.35540782668412696, -0.39327822393077794]", ,0.0,ROT,,,,,,,,,0,1,1,1,0.60295,2,0.400382171477,2017_Okt_06_1602,98.1934767103,Stroop,11,11,
incongruent,3.0,"[-0.6443487062397026, -0.04593565844132552, 0.6810053835620706]", ,1.0,ROT,,,,,,,,,0,2,2,2,0.65782,3,0.425839317567,2017_Okt_06_1602,98.1934767103,Stroop,11,11,
congruent,2.0,"[0.5904624419653648, -0.35540782668412696, -0.39327822393077794]", ,0.0,ROT,,,,,,,,,0,3,3,3,0.37575,2,0.387490030158,2017_Okt_06_1602,98.1934767103,Stroop,11,11,
incongruent,3.0,"[-0.6443487062397026, -0.04593565844132552, 0.6810053835620706]", ,1.0,ROT,,,,,,,,,0,4,4,4,0.59359,3,0.314501982794,2017_Okt_06_1602,98.1934767103,Stroop,11,11,
incongruent,3.0,"[-0.6443487062397026, -0.04593565844132552, 0.6810053835620706]", ,1.0,ROT,,,,,,,,,0,5,5,5,0.69992,3,0.32638896843,2017_Okt_06_1602,98.1934767103,Stroop,11,11,
incongruent,3.0,"[-0.6443487062397026, -0.04593565844132552, 0.6810053835620706]", ,1.0,ROT,,,,,,,,,0,6,6,6,0.64979,3,0.399849422203,2017_Okt_06_1602,98.1934767103,Stroop,11,11,
incongruent,2.0,"[0.5904624419653648, -0.35540782668412696, -0.39327822393077794]", ,2.0,BLAU,,,,,,,,,0,7,7,7,0.39149,2,0.487732100029,2017_Okt_06_1602,98.1934767103,Stroop,11,11,
incongruent,2.0,"[0.5904624419653648, -0.35540782668412696, -0.39327822393077794]", ,2.0,BLAU,,,,,,,,,0,8,8,8,0.30145,2,0.413648382686,2017_Okt_06_1602,98.1934767103,Stroop,11,11,
incongruent,3.0,"[-0.6443487062397026, -0.04593565844132552, 0.6810053835620706]", ,1.0,ROT,,,,,,,,,0,9,9,9,0.31533,3,0.499861853951,2017_Okt_06_1602,98.1934767103,Stroop,11,11,
congruent,2.0,"[0.5904624419653648, -0.35540782668412696, -0.39327822393077794]", ,0.0,ROT,,,,,,,,,0,10,10,10,0.41019,2,0.523864625253,2017_Okt_06_1602,98.1934767103,Stroop,11,11,
incongruent,3.0,"[-0.6443487062397026, -0.04593565844132552, 0.6810053835620706]", ,1.0,ROT,,,,,,,,,0,11,11,11,0.38112,3,0.524083368138,2017_Okt_06_1602,98.1934767103,Stroop,11,11,
incongruent,3.0,"[-0.6443487062397026, -0.04593565844132552, 0.6810053835620706]", ,1.0,ROT,,,,,,,,,0,12,12,12,0.58408,3,0.473825304613,2017_Okt_06_1602,98.1934767103,Stroop,11,11,
incongruent,3.0,"[-0.6443487062397026, -0.04593565844132552, 0.6810053835620706]", ,1.0,ROT,,,,,,,,,0,13,13,13,0.39149,3,0.400434412754,2017_Okt_06_1602,98.1934767103,Stroop,11,11,
incongruent,3.0,"[-0.6443487062397026, -0.04593565844132552, 0.6810053835620706]", ,1.0,ROT,,,,,,,,,0,14,14,14,0.311,3,0.389224608155,2017_Okt_06_1602,98.1934767103,Stroop,11,11,
incongruent,2.0,"[0.5904624419653648, -0.35540782668412696, -0.39327822393077794]", ,2.0,BLAU,,,,,,,,,0,15,15,15,0.55602,2,0.710367658459,2017_Okt_06_1602,98.1934767103,Stroop,11,11,
incongruent,3.0,"[-0.6443487062397026, -0.04593565844132552, 0.6810053835620706]", ,1.0,ROT,,,,,,,,,0,16,16,16,0.41606,3,0.74718658377,2017_Okt_06_1602,98.1934767103,Stroop,11,11,
congruent,3.0,"[-0.6443487062397026, -0.04593565844132552, 0.6810053835620706]", ,3.0,BLAU,,,,,,,,,0,17,17,17,0.39149,3,0.623094275948,2017_Okt_06_1602,98.1934767103,Stroop,11,11,
congruent,2.0,"[0.5904624419653648, -0.35540782668412696, -0.39327822393077794]", ,0.0,ROT,,,,,,,,,0,18,18,18,0.45577,2,0.463954217645,2017_Okt_06_1602,98.1934767103,Stroop,11,11,
congruent,3.0,"[-0.6443487062397026, -0.04593565844132552, 0.6810053835620706]", ,3.0,BLAU,,,,,,,,,0,19,19,19,0.31482,3,0.426253616032,2017_Okt_06_1602,98.1934767103,Stroop,11,11,
incongruent,2.0,"[0.5904624419653648, -0.35540782668412696, -0.39327822393077794]", ,2.0,BLAU,,,,,,,,,0,20,20,20,0.31533,2,0.31417512561,2017_Okt_06_1602,98.1934767103,Stroop,11,11,
incongruent,3.0,"[-0.6443487062397026, -0.04593565844132552, 0.6810053835620706]", ,1.0,ROT,,,,,,,,,0,21,21,21,0.30145,3,0.450425403229,2017_Okt_06_1602,98.1934767103,Stroop,11,11,
congruent,2.0,"[0.5904624419653648, -0.35540782668412696, -0.39327822393077794]", ,0.0,ROT,,,,,,,,,0,22,22,22,0.55167,2,0.330673032466,2017_Okt_06_1602,98.1934767103,Stroop,11,11,
congruent,3.0,"[-0.6443487062397026, -0.04593565844132552, 0.6810053835620706]", ,3.0,BLAU,,,,,,,,,0,23,23,23,0.67007,3,0.465783500417,2017_Okt_06_1602,98.1934767103,Stroop,11,11,
incongruent,3.0,"[-0.6443487062397026, -0.04593565844132552, 0.6810053835620706]", ,1.0,ROT,,,,,,,,,0,24,24,24,0.37249,3,0.414270808161,2017_Okt_06_1602,98.1934767103,Stroop,11,11,
incongruent,2.0,"[0.5904624419653648, -0.35540782668412696, -0.39327822393077794]", ,2.0,BLAU,,,,,,,,,0,25,25,25,0.34332,2,0.314980814601,2017_Okt_06_1602,98.1934767103,Stroop,11,11,
incongruent,2.0,"[0.5904624419653648, -0.35540782668412696, -0.39327822393077794]", ,2.0,BLAU,,,,,,,,,0,26,26,26,0.31482,2,0.339013757335,2017_Okt_06_1602,98.1934767103,Stroop,11,11,
congruent,2.0,"[0.5904624419653648, -0.35540782668412696, -0.39327822393077794]", ,0.0,ROT,,,,,,,,,0,27,27,27,0.60055,2,0.400846755663,2017_Okt_06_1602,98.1934767103,Stroop,11,11,
incongruent,2.0,"[0.5904624419653648, -0.35540782668412696, -0.39327822393077794]", ,2.0,BLAU,,,,,,,,,0,28,28,28,0.55602,2,0.463642446177,2017_Okt_06_1602,98.1934767103,Stroop,11,11,
congruent,3.0,"[-0.6443487062397026, -0.04593565844132552, 0.6810053835620706]", ,3.0,BLAU,,,,,,,,,0,29,29,29,0.43134,3,0.326100384267,2017_Okt_06_1602,98.1934767103,Stroop,11,11,
incongruent,3.0,"[-0.6443487062397026, -0.04593565844132552, 0.6810053835620706]", ,1.0,ROT,,,,,,,,,0,30,30,30,0.59133,3,0.499885041255,2017_Okt_06_1602,98.1934767103,Stroop,11,11,
incongruent,3.0,"[-0.6443487062397026, -0.04593565844132552, 0.6810053835620706]", ,1.0,ROT,,,,,,,,,0,31,31,31,0.43173,3,0.486704874502,2017_Okt_06_1602,98.1934767103,Stroop,11,11,
congruent,3.0,"[-0.6443487062397026, -0.04593565844132552, 0.6810053835620706]", ,3.0,BLAU,,,,,,,,,0,32,32,32,0.31533,3,0.40136106684,2017_Okt_06_1602,98.1934767103,Stroop,11,11,
congruent,3.0,"[-0.6443487062397026, -0.04593565844132552, 0.6810053835620706]", ,3.0,BLAU,,,,,,,,,0,33,33,33,0.41606,3,0.475679730245,2017_Okt_06_1602,98.1934767103,Stroop,11,11,
congruent,2.0,"[0.5904624419653648, -0.35540782668412696, -0.39327822393077794]", ,0.0,ROT,,,,,,,,,0,34,34,34,0.37249,2,0.376615463697,2017_Okt_06_1602,98.1934767103,Stroop,11,11,
incongruent,2.0,"[0.5904624419653648, -0.35540782668412696, -0.39327822393077794]", ,2.0,BLAU,,,,,,,,,0,35,35,35,0.52033,2,0.353516438542,2017_Okt_06_1602,98.1934767103,Stroop,11,11,
incongruent,3.0,"[-0.6443487062397026, -0.04593565844132552, 0.6810053835620706]", ,1.0,ROT,,,,,,,,,0,36,36,36,0.39599,3,0.451258190636,2017_Okt_06_1602,98.1934767103,Stroop,11,11,
incongruent,2.0,"[0.5904624419653648, -0.35540782668412696, -0.39327822393077794]", ,2.0,BLAU,,,,,,,,,0,37,37,37,0.3709,2,0.30267031145,2017_Okt_06_1602,98.1934767103,Stroop,11,11,
incongruent,3.0,"[-0.6443487062397026, -0.04593565844132552, 0.6810053835620706]", ,1.0,ROT,,,,,,,,,0,38,38,38,0.66879,3,0.3642773034,2017_Okt_06_1602,98.1934767103,Stroop,11,11,
incongruent,3.0,"[-0.6443487062397026, -0.04593565844132552, 0.6810053835620706]", ,1.0,ROT,,,,,,,,,0,39,39,39,0.48307,3,0.476335679535,2017_Okt_06_1602,98.1934767103,Stroop,11,11,
incongruent,3.0,"[-0.6443487062397026, -0.04593565844132552, 0.6810053835620706]", ,1.0,ROT,,,,,,,,,0,40,40,40,0.55167,3,0.450898368368,2017_Okt_06_1602,98.1934767103,Stroop,11,11,
congruent,3.0,"[-0.6443487062397026, -0.04593565844132552, 0.6810053835620706]", ,3.0,BLAU,,,,,,,,,0,41,41,41,0.38368,3,0.40212960027,2017_Okt_06_1602,98.1934767103,Stroop,11,11,
incongruent,3.0,"[-0.6443487062397026, -0.04593565844132552, 0.6810053835620706]", ,1.0,ROT,,,,,,,,,0,42,42,42,0.36382,3,0.475386955605,2017_Okt_06_1602,98.1934767103,Stroop,11,11,
incongruent,2.0,"[0.5904624419653648, -0.35540782668412696, -0.39327822393077794]", ,2.0,BLAU,,,,,,,,,0,43,43,43,0.38577,2,0.477524378098,2017_Okt_06_1602,98.1934767103,Stroop,11,11,
congruent,3.0,"[-0.6443487062397026, -0.04593565844132552, 0.6810053835620706]", ,3.0,BLAU,,,,,,,,,0,44,44,44,0.59359,3,0.364243220856,2017_Okt_06_1602,98.1934767103,Stroop,11,11,
incongruent,2.0,"[0.5904624419653648, -0.35540782668412696, -0.39327822393077794]", ,2.0,BLAU,,,,,,,,,0,45,45,45,0.31613,2,0.364968452694,2017_Okt_06_1602,98.1934767103,Stroop,11,11,
incongruent,3.0,"[-0.6443487062397026, -0.04593565844132552, 0.6810053835620706]", ,1.0,ROT,,,,,,,,,0,46,46,46,0.69844,3,0.389090792266,2017_Okt_06_1602,98.1934767103,Stroop,11,11,
congruent,3.0,"[-0.6443487062397026, -0.04593565844132552, 0.6810053835620706]", ,3.0,BLAU,,,,,,,,,0,47,47,47,0.32045,3,0.48695546501,2017_Okt_06_1602,98.1934767103,Stroop,11,11,
congruent,2.0,"[0.5904624419653648, -0.35540782668412696, -0.39327822393077794]", ,0.0,ROT,,,,,,,,,0,48,48,48,0.33166,2,0.376722181171,2017_Okt_06_1602,98.1934767103,Stroop,11,11,
congruent,3.0,"[-0.6443487062397026, -0.04593565844132552, 0.6810053835620706]", ,3.0,BLAU,,,,,,,,,0,49,49,49,0.52129,3,0.452206914566,2017_Okt_06_1602,98.1934767103,Stroop,11,11,
congruent,3.0,"[-0.6443487062397026, -0.04593565844132552, 0.6810053835620706]", ,3.0,BLAU,,,,,,,,,0,50,50,50,0.31613,3,0.426608130363,2017_Okt_06_1602,98.1934767103,Stroop,11,11,
congruent,2.0,"[0.5904624419653648, -0.35540782668412696, -0.39327822393077794]", ,0.0,ROT,,,,,,,,,0,51,51,51,0.52553,2,0.37712027646,2017_Okt_06_1602,98.1934767103,Stroop,11,11,
congruent,3.0,"[-0.6443487062397026, -0.04593565844132552, 0.6810053835620706]", ,3.0,BLAU,,,,,,,,,0,52,52,52,0.60405,3,0.425666669926,2017_Okt_06_1602,98.1934767103,Stroop,11,11,
incongruent,3.0,"[-0.6443487062397026, -0.04593565844132552, 0.6810053835620706]", ,1.0,ROT,,,,,,,,,0,53,53,53,0.50404,3,0.401014654097,2017_Okt_06_1602,98.1934767103,Stroop,11,11,
incongruent,2.0,"[0.5904624419653648, -0.35540782668412696, -0.39327822393077794]", ,2.0,BLAU,,,,,,,,,0,54,54,54,0.46005,2,0.377201851073,2017_Okt_06_1602,98.1934767103,Stroop,11,11,
incongruent,3.0,"[-0.6443487062397026, -0.04593565844132552, 0.6810053835620706]", ,1.0,ROT,,,,,,,,,0,55,55,55,0.53163,3,0.449668044402,2017_Okt_06_1602,98.1934767103,Stroop,11,11,
incongruent,3.0,"[-0.6443487062397026, -0.04593565844132552, 0.6810053835620706]", ,1.0,ROT,,,,,,,,,0,56,56,56,0.51807,2,0.500076406359,2017_Okt_06_1602,98.1934767103,Stroop,11,11,
congruent,2.0,"[0.5904624419653648, -0.35540782668412696, -0.39327822393077794]", ,0.0,ROT,,,,,,,,,0,57,57,57,0.69844,2,0.451052857276,2017_Okt_06_1602,98.1934767103,Stroop,11,11,
incongruent,3.0,"[-0.6443487062397026, -0.04593565844132552, 0.6810053835620706]", ,1.0,ROT,,,,,,,,,0,58,58,58,0.47688,3,0.43945641136,2017_Okt_06_1602,98.1934767103,Stroop,11,11,
incongruent,3.0,"[-0.6443487062397026, -0.04593565844132552, 0.6810053835620706]", ,1.0,ROT,,,,,,,,,0,59,59,59,0.33166,3,0.377323654263,2017_Okt_06_1602,98.1934767103,Stroop,11,11,
incongruent,2.0,"[0.5904624419653648, -0.35540782668412696, -0.39327822393077794]", ,2.0,BLAU,,,,,,,,,0,60,60,60,0.48307,2,0.437867661951,2017_Okt_06_1602,98.1934767103,Stroop,11,11,
incongruent,3.0,"[-0.6443487062397026, -0.04593565844132552, 0.6810053835620706]", ,1.0,ROT,,,,,,,,,0,61,61,61,0.41606,3,0.477217635202,2017_Okt_06_1602,98.1934767103,Stroop,11,11,
incongruent,2.0,"[0.5904624419653648, -0.35540782668412696, -0.39327822393077794]", ,2.0,BLAU,,,,,,,,,0,62,62,62,0.50404,2,0.439562570103,2017_Okt_06_1602,98.1934767103,Stroop,11,11,
incongruent,2.0,"[0.5904624419653648, -0.35540782668412696, -0.39327822393077794]", ,2.0,BLAU,,,,,,,,,0,63,63,63,0.34332,2,0.414261309747,2017_Okt_06_1602,98.1934767103,Stroop,11,11,
congruent,3.0,"[-0.6443487062397026, -0.04593565844132552, 0.6810053835620706]", ,3.0,BLAU,,,,,,,,,0,64,64,64,0.39599,3,0.412836827027,2017_Okt_06_1602,98.1934767103,Stroop,11,11,
congruent,3.0,"[-0.6443487062397026, -0.04593565844132552, 0.6810053835620706]", ,3.0,BLAU,,,,,,,,,0,65,65,65,0.39599,3,0.46234758887,2017_Okt_06_1602,98.1934767103,Stroop,11,11,
incongruent,2.0,"[0.5904624419653648, -0.35540782668412696, -0.39327822393077794]", ,2.0,BLAU,,,,,,,,,0,66,66,66,0.64979,2,0.548969771298,2017_Okt_06_1602,98.1934767103,Stroop,11,11,
incongruent,2.0,"[0.5904624419653648, -0.35540782668412696, -0.39327822393077794]", ,2.0,BLAU,,,,,,,,,0,67,67,67,0.3732,2,0.514002757334,2017_Okt_06_1602,98.1934767103,Stroop,11,11,
incongruent,3.0,"[-0.6443487062397026, -0.04593565844132552, 0.6810053835620706]", ,1.0,ROT,,,,,,,,,0,68,68,68,0.31482,3,0.450863447729,2017_Okt_06_1602,98.1934767103,Stroop,11,11,
incongruent,2.0,"[0.5904624419653648, -0.35540782668412696, -0.39327822393077794]", ,2.0,BLAU,,,,,,,,,0,69,69,69,0.50559,2,0.501266781113,2017_Okt_06_1602,98.1934767103,Stroop,11,11,
congruent,3.0,"[-0.6443487062397026, -0.04593565844132552, 0.6810053835620706]", ,3.0,BLAU,,,,,,,,,0,70,70,70,0.42979,3,0.43819312231,2017_Okt_06_1602,98.1934767103,Stroop,11,11,
congruent,3.0,"[-0.6443487062397026, -0.04593565844132552, 0.6810053835620706]", ,3.0,BLAU,,,,,,,,,0,71,71,71,0.60055,3,0.500345155599,2017_Okt_06_1602,98.1934767103,Stroop,11,11,
congruent,3.0,"[-0.6443487062397026, -0.04593565844132552, 0.6810053835620706]", ,3.0,BLAU,,,,,,,,,0,72,72,72,0.43171,3,0.525218149234,2017_Okt_06_1602,98.1934767103,Stroop,11,11,
congruent,3.0,"[-0.6443487062397026, -0.04593565844132552, 0.6810053835620706]", ,3.0,BLAU,,,,,,,,,0,73,73,73,0.34289,3,0.561683398309,2017_Okt_06_1602,98.1934767103,Stroop,11,11,
congruent,3.0,"[-0.6443487062397026, -0.04593565844132552, 0.6810053835620706]", ,3.0,BLAU,,,,,,,,,0,74,74,74,0.56121,3,0.451125492206,2017_Okt_06_1602,98.1934767103,Stroop,11,11,
incongruent,2.0,"[0.5904624419653648, -0.35540782668412696, -0.39327822393077794]", ,2.0,BLAU,,,,,,,,,0,75,75,75,0.46005,2,0.438691509675,2017_Okt_06_1602,98.1934767103,Stroop,11,11,
incongruent,3.0,"[-0.6443487062397026, -0.04593565844132552, 0.6810053835620706]", ,1.0,ROT,,,,,,,,,0,76,76,76,0.31613,3,0.69799932673,2017_Okt_06_1602,98.1934767103,Stroop,11,11,
congruent,3.0,"[-0.6443487062397026, -0.04593565844132552, 0.6810053835620706]", ,3.0,BLAU,,,,,,,,,0,77,77,77,0.67007,3,0.438272462003,2017_Okt_06_1602,98.1934767103,Stroop,11,11,
incongruent,2.0,"[0.5904624419653648, -0.35540782668412696, -0.39327822393077794]", ,2.0,BLAU,,,,,,,,,0,78,78,78,0.61872,2,0.461869315793,2017_Okt_06_1602,98.1934767103,Stroop,11,11,
incongruent,3.0,"[-0.6443487062397026, -0.04593565844132552, 0.6810053835620706]", ,1.0,ROT,,,,,,,,,0,79,79,79,0.52033,3,0.376812695468,2017_Okt_06_1602,98.1934767103,Stroop,11,11,
incongruent,3.0,"[-0.6443487062397026, -0.04593565844132552, 0.6810053835620706]", ,1.0,ROT,,,,,,,,,0,80,80,80,0.51462,3,0.462188071389,2017_Okt_06_1602,98.1934767103,Stroop,11,11,
incongruent,2.0,"[0.5904624419653648, -0.35540782668412696, -0.39327822393077794]", ,2.0,BLAU,,,,,,,,,0,81,81,81,0.31343,2,0.362971550853,2017_Okt_06_1602,98.1934767103,Stroop,11,11,
congruent,2.0,"[0.5904624419653648, -0.35540782668412696, -0.39327822393077794]", ,0.0,ROT,,,,,,,,,0,82,82,82,0.53517,2,0.475706269931,2017_Okt_06_1602,98.1934767103,Stroop,11,11,
congruent,2.0,"[0.5904624419653648, -0.35540782668412696, -0.39327822393077794]", ,0.0,ROT,,,,,,,,,0,83,83,83,0.59359,2,0.36456951931,2017_Okt_06_1602,98.1934767103,Stroop,11,11,
congruent,3.0,"[-0.6443487062397026, -0.04593565844132552, 0.6810053835620706]", ,3.0,BLAU,,,,,,,,,0,84,84,84,0.63528,3,0.464190001802,2017_Okt_06_1602,98.1934767103,Stroop,11,11,
congruent,2.0,"[0.5904624419653648, -0.35540782668412696, -0.39327822393077794]", ,0.0,ROT,,,,,,,,,0,85,85,85,0.51484,2,0.403821156041,2017_Okt_06_1602,98.1934767103,Stroop,11,11,
incongruent,3.0,"[-0.6443487062397026, -0.04593565844132552, 0.6810053835620706]", ,1.0,ROT,,,,,,,,,0,86,86,86,0.311,3,0.414339252614,2017_Okt_06_1602,98.1934767103,Stroop,11,11,
congruent,3.0,"[-0.6443487062397026, -0.04593565844132552, 0.6810053835620706]", ,3.0,BLAU,,,,,,,,,0,87,87,87,0.60055,3,0.487957827042,2017_Okt_06_1602,98.1934767103,Stroop,11,11,
incongruent,3.0,"[-0.6443487062397026, -0.04593565844132552, 0.6810053835620706]", ,1.0,ROT,,,,,,,,,0,88,88,88,0.43173,3,0.413273474701,2017_Okt_06_1602,98.1934767103,Stroop,11,11,
incongruent,3.0,"[-0.6443487062397026, -0.04593565844132552, 0.6810053835620706]", ,1.0,ROT,,,,,,,,,0,89,89,89,0.311,3,0.463060808008,2017_Okt_06_1602,98.1934767103,Stroop,11,11,
congruent,2.0,"[0.5904624419653648, -0.35540782668412696, -0.39327822393077794]", ,0.0,ROT,,,,,,,,,0,90,90,90,0.52129,2,0.339934265388,2017_Okt_06_1602,98.1934767103,Stroop,11,11,
congruent,3.0,"[-0.6443487062397026, -0.04593565844132552, 0.6810053835620706]", ,3.0,BLAU,,,,,,,,,0,91,91,91,0.56121,3,0.426797539911,2017_Okt_06_1602,98.1934767103,Stroop,11,11,
congruent,3.0,"[-0.6443487062397026, -0.04593565844132552, 0.6810053835620706]", ,3.0,BLAU,,,,,,,,,0,92,92,92,0.41019,3,0.501471276377,2017_Okt_06_1602,98.1934767103,Stroop,11,11,
incongruent,3.0,"[-0.6443487062397026, -0.04593565844132552, 0.6810053835620706]", ,1.0,ROT,,,,,,,,,0,93,93,93,0.60295,3,0.500289282576,2017_Okt_06_1602,98.1934767103,Stroop,11,11,
incongruent,2.0,"[0.5904624419653648, -0.35540782668412696, -0.39327822393077794]", ,2.0,BLAU,,,,,,,,,0,94,94,94,0.43493,2,0.511841588805,2017_Okt_06_1602,98.1934767103,Stroop,11,11,
incongruent,3.0,"[-0.6443487062397026, -0.04593565844132552, 0.6810053835620706]", ,1.0,ROT,,,,,,,,,0,95,95,95,0.36382,3,0.476645216082,2017_Okt_06_1602,98.1934767103,Stroop,11,11,
incongruent,2.0,"[0.5904624419653648, -0.35540782668412696, -0.39327822393077794]", ,2.0,BLAU,,,,,,,,,0,96,96,96,0.38368,2,0.512202528534,2017_Okt_06_1602,98.1934767103,Stroop,11,11,
congruent,2.0,"[0.5904624419653648, -0.35540782668412696, -0.39327822393077794]", ,0.0,ROT,,,,,,,,,0,97,97,97,0.43493,2,0.811527163369,2017_Okt_06_1602,98.1934767103,Stroop,11,11,
congruent,2.0,"[0.5904624419653648, -0.35540782668412696, -0.39327822393077794]", ,0.0,ROT,,,,,,,,,0,98,98,98,0.53163,2,0.464925290784,2017_Okt_06_1602,98.1934767103,Stroop,11,11,
incongruent,2.0,"[0.5904624419653648, -0.35540782668412696, -0.39327822393077794]", ,2.0,BLAU,,,,,,,,,0,99,99,99,0.56121,2,0.524391787224,2017_Okt_06_1602,98.1934767103,Stroop,11,11,
