best_paramset_1 = [80.644581176299994, 0.813818606833, 25.4570876899, 3.18726527897, 135.90011605500001, 346.87329675000001, 102.775572626]
best_paramset_statistic_1 = 9.31649079678
best_paramset_2 = [86.110506704499997, 0.85837373541999995, 41.909329365300003, 3.6581355272699998, 134.45758453799999, 345.11647863600001, 105.25230852999999]
best_paramset_statistic_2 = 9.90800849745
ID = "Tarana_propersims_19"