congruent,corrAns,letterColor,signal,selectedrownumber_novariable,Anzeigetext,practice.thisRepN,practice.thisTrialN,practice.thisN,practice.thisIndex,Wrongresponse.thisRepN,Wrongresponse.thisTrialN,Wrongresponse.thisN,Wrongresponse.thisIndex,trials.thisRepN,trials.thisTrialN,trials.thisN,trials.thisIndex,resp.keys,resp.corr,resp.rt,date,frameRate,expName,session,participant,
neutral,down,"[-0.7725490196, 0.0745098039, -1]", ,13,SOLL,0,0,0,0,0,0,0,0,,,,,down,1,1.44501661524,2017_Mai_15_1648,98.8843706924,Stroop,B-1,1STACS-3,
,,,,,,0,0,0,0,,,,,,,,,,,,2017_Mai_15_1648,98.8843706924,Stroop,B-1,1STACS-3,
neutral,right,"[-0.8745098039, -0.2078431373, 0.637254902]", ,11,PECH,1,0,1,0,0,0,0,0,,,,,right,1,1.18309310262,2017_Mai_15_1648,98.8843706924,Stroop,B-1,1STACS-3,
,,,,,,1,0,1,0,,,,,,,,,,,,2017_Mai_15_1648,98.8843706924,Stroop,B-1,1STACS-3,
neutral,down,"[-0.7725490196, 0.0745098039, -1]", ,10,PECH,2,0,2,0,0,0,0,0,,,,,down,1,0.886904341194,2017_Mai_15_1648,98.8843706924,Stroop,B-1,1STACS-3,
,,,,,,2,0,2,0,,,,,,,,,,,,2017_Mai_15_1648,98.8843706924,Stroop,B-1,1STACS-3,
incongruent,left,"[0.568627451, -0.7882352941, -0.7882352941]", ,6,BLAU,3,0,3,0,0,0,0,0,,,,,left,1,0.928698479835,2017_Mai_15_1648,98.8843706924,Stroop,B-1,1STACS-3,
,,,,,,3,0,3,0,,,,,,,,,,,,2017_Mai_15_1648,98.8843706924,Stroop,B-1,1STACS-3,
incongruent,left,"[0.568627451, -0.7882352941, -0.7882352941]", ,3,GRÜN,4,0,4,0,0,0,0,0,,,,,left,1,0.630858670585,2017_Mai_15_1648,98.8843706924,Stroop,B-1,1STACS-3,
,,,,,,4,0,4,0,,,,,,,,,,,,2017_Mai_15_1648,98.8843706924,Stroop,B-1,1STACS-3,
incongruent,down,"[-0.7725490196, 0.0745098039, -1]", ,1,ROT,5,0,5,0,0,0,0,0,,,,,down,1,1.00469361329,2017_Mai_15_1648,98.8843706924,Stroop,B-1,1STACS-3,
,,,,,,5,0,5,0,,,,,,,,,,,,2017_Mai_15_1648,98.8843706924,Stroop,B-1,1STACS-3,
incongruent,down,"[-0.7725490196, 0.0745098039, -1]", ,1,ROT,6,0,6,0,0,0,0,0,,,,,down,1,0.588595757283,2017_Mai_15_1648,98.8843706924,Stroop,B-1,1STACS-3,
,,,,,,6,0,6,0,,,,,,,,,,,,2017_Mai_15_1648,98.8843706924,Stroop,B-1,1STACS-3,
incongruent,left,"[0.568627451, -0.7882352941, -0.7882352941]", ,3,GRÜN,7,0,7,0,0,0,0,0,,,,,left,1,0.734684156785,2017_Mai_15_1648,98.8843706924,Stroop,B-1,1STACS-3,
,,,,,,7,0,7,0,,,,,,,,,,,,2017_Mai_15_1648,98.8843706924,Stroop,B-1,1STACS-3,
neutral,down,"[-0.7725490196, 0.0745098039, -1]", ,10,PECH,8,0,8,0,0,0,0,0,,,,,down,1,0.663329836613,2017_Mai_15_1648,98.8843706924,Stroop,B-1,1STACS-3,
,,,,,,8,0,8,0,,,,,,,,,,,,2017_Mai_15_1648,98.8843706924,Stroop,B-1,1STACS-3,
neutralofneutral,down,"[-0.7725490196, 0.0745098039, -1]", ,16,HALS,9,0,9,0,0,0,0,0,,,,,down,1,0.626638022431,2017_Mai_15_1648,98.8843706924,Stroop,B-1,1STACS-3,
,,,,,,9,0,9,0,,,,,,,,,,,,2017_Mai_15_1648,98.8843706924,Stroop,B-1,1STACS-3,
incongruent,right,"[-0.8745098039, -0.2078431373, 0.637254902]", ,5,GRÜN,10,0,10,0,0,0,0,0,,,,,right,1,0.641822075152,2017_Mai_15_1648,98.8843706924,Stroop,B-1,1STACS-3,
,,,,,,10,0,10,0,,,,,,,,,,,,2017_Mai_15_1648,98.8843706924,Stroop,B-1,1STACS-3,
neutral,right,"[-0.8745098039, -0.2078431373, 0.637254902]", ,11,PECH,11,0,11,0,0,0,0,0,,,,,right,1,0.545239688285,2017_Mai_15_1648,98.8843706924,Stroop,B-1,1STACS-3,
,,,,,,11,0,11,0,,,,,,,,,,,,2017_Mai_15_1648,98.8843706924,Stroop,B-1,1STACS-3,
incongruent,down,"[-0.7725490196, 0.0745098039, -1]", ,7,BLAU,12,0,12,0,0,0,0,0,,,,,down,1,0.833728309046,2017_Mai_15_1648,98.8843706924,Stroop,B-1,1STACS-3,
,,,,,,12,0,12,0,,,,,,,,,,,,2017_Mai_15_1648,98.8843706924,Stroop,B-1,1STACS-3,
neutralofneutral,left,"[0.568627451, -0.7882352941, -0.7882352941]", ,15,HALS,13,0,13,0,0,0,0,0,,,,,left,1,0.659060020198,2017_Mai_15_1648,98.8843706924,Stroop,B-1,1STACS-3,
,,,,,,13,0,13,0,,,,,,,,,,,,2017_Mai_15_1648,98.8843706924,Stroop,B-1,1STACS-3,
congruent,down,"[-0.7725490196, 0.0745098039, -1]", ,4,GRÜN,14,0,14,0,0,0,0,0,,,,,down,1,0.894903402528,2017_Mai_15_1648,98.8843706924,Stroop,B-1,1STACS-3,
,,,,,,14,0,14,0,,,,,,,,,,,,2017_Mai_15_1648,98.8843706924,Stroop,B-1,1STACS-3,
neutralofneutral,right,"[-0.8745098039, -0.2078431373, 0.637254902]", ,20,MODE,15,0,15,0,0,0,0,0,,,,,right,1,0.605272457811,2017_Mai_15_1648,98.8843706924,Stroop,B-1,1STACS-3,
,,,,,,15,0,15,0,,,,,,,,,,,,2017_Mai_15_1648,98.8843706924,Stroop,B-1,1STACS-3,
congruent,right,"[-0.8745098039, -0.2078431373, 0.637254902]", ,8,BLAU,16,0,16,0,0,0,0,0,,,,,right,1,0.526611343061,2017_Mai_15_1648,98.8843706924,Stroop,B-1,1STACS-3,
,,,,,,16,0,16,0,,,,,,,,,,,,2017_Mai_15_1648,98.8843706924,Stroop,B-1,1STACS-3,
incongruent,right,"[-0.8745098039, -0.2078431373, 0.637254902]", ,5,GRÜN,17,0,17,0,0,0,0,0,,,,,right,1,0.724640980907,2017_Mai_15_1648,98.8843706924,Stroop,B-1,1STACS-3,
,,,,,,17,0,17,0,,,,,,,,,,,,2017_Mai_15_1648,98.8843706924,Stroop,B-1,1STACS-3,
congruent,down,"[-0.7725490196, 0.0745098039, -1]", ,4,GRÜN,18,0,18,0,0,0,0,0,,,,,down,1,0.866916884686,2017_Mai_15_1648,98.8843706924,Stroop,B-1,1STACS-3,
,,,,,,18,0,18,0,,,,,,,,,,,,2017_Mai_15_1648,98.8843706924,Stroop,B-1,1STACS-3,
incongruent,down,"[-0.7725490196, 0.0745098039, -1]", ,1,ROT,19,0,19,0,0,0,0,0,,,,,down,1,0.645430354974,2017_Mai_15_1648,98.8843706924,Stroop,B-1,1STACS-3,
,,,,,,19,0,19,0,,,,,,,,,,,,2017_Mai_15_1648,98.8843706924,Stroop,B-1,1STACS-3,
neutral,left,"[0.568627451, -0.7882352941, -0.7882352941]", ,12,SOLL,20,0,20,0,0,0,0,0,,,,,left,1,0.491949395802,2017_Mai_15_1648,98.8843706924,Stroop,B-1,1STACS-3,
,,,,,,20,0,20,0,,,,,,,,,,,,2017_Mai_15_1648,98.8843706924,Stroop,B-1,1STACS-3,
incongruent,right,"[-0.8745098039, -0.2078431373, 0.637254902]", ,2,ROT,21,0,21,0,0,0,0,0,,,,,right,1,0.709832953631,2017_Mai_15_1648,98.8843706924,Stroop,B-1,1STACS-3,
,,,,,,21,0,21,0,,,,,,,,,,,,2017_Mai_15_1648,98.8843706924,Stroop,B-1,1STACS-3,
congruent,left,"[0.568627451, -0.7882352941, -0.7882352941]", ,0,ROT,22,0,22,0,0,0,0,0,,,,,left,1,0.69832534582,2017_Mai_15_1648,98.8843706924,Stroop,B-1,1STACS-3,
,,,,,,22,0,22,0,,,,,,,,,,,,2017_Mai_15_1648,98.8843706924,Stroop,B-1,1STACS-3,
neutralofneutral,down,"[-0.7725490196, 0.0745098039, -1]", ,16,HALS,23,0,23,0,0,0,0,0,,,,,down,1,0.64761973938,2017_Mai_15_1648,98.8843706924,Stroop,B-1,1STACS-3,
,,,,,,23,0,23,0,,,,,,,,,,,,2017_Mai_15_1648,98.8843706924,Stroop,B-1,1STACS-3,
congruent,left,"[0.568627451, -0.7882352941, -0.7882352941]", ,0,ROT,24,0,24,0,0,0,0,0,,,,,left,1,0.602144406623,2017_Mai_15_1648,98.8843706924,Stroop,B-1,1STACS-3,
,,,,,,24,0,24,0,,,,,,,,,,,,2017_Mai_15_1648,98.8843706924,Stroop,B-1,1STACS-3,
congruent,left,"[0.568627451, -0.7882352941, -0.7882352941]", ,0,ROT,25,0,25,0,0,0,0,0,,,,,left,1,0.588968989076,2017_Mai_15_1648,98.8843706924,Stroop,B-1,1STACS-3,
,,,,,,25,0,25,0,,,,,,,,,,,,2017_Mai_15_1648,98.8843706924,Stroop,B-1,1STACS-3,
congruent,left,"[0.568627451, -0.7882352941, -0.7882352941]", ,0,ROT,26,0,26,0,0,0,0,0,,,,,left,1,0.663905328751,2017_Mai_15_1648,98.8843706924,Stroop,B-1,1STACS-3,
,,,,,,26,0,26,0,,,,,,,,,,,,2017_Mai_15_1648,98.8843706924,Stroop,B-1,1STACS-3,
incongruent,right,"[-0.8745098039, -0.2078431373, 0.637254902]", ,5,GRÜN,27,0,27,0,0,0,0,0,,,,,right,1,0.95118848904,2017_Mai_15_1648,98.8843706924,Stroop,B-1,1STACS-3,
,,,,,,27,0,27,0,,,,,,,,,,,,2017_Mai_15_1648,98.8843706924,Stroop,B-1,1STACS-3,
congruent,left,"[0.568627451, -0.7882352941, -0.7882352941]", ,0,ROT,28,0,28,0,0,0,0,0,,,,,left,1,0.572762460033,2017_Mai_15_1648,98.8843706924,Stroop,B-1,1STACS-3,
,,,,,,28,0,28,0,,,,,,,,,,,,2017_Mai_15_1648,98.8843706924,Stroop,B-1,1STACS-3,
incongruent,down,"[-0.7725490196, 0.0745098039, -1]", ,1,ROT,29,0,29,0,0,0,0,0,,,,,down,1,0.677939235293,2017_Mai_15_1648,98.8843706924,Stroop,B-1,1STACS-3,
,,,,,,29,0,29,0,,,,,,,,,,,,2017_Mai_15_1648,98.8843706924,Stroop,B-1,1STACS-3,
congruent,down,"[-0.7725490196, 0.0745098039, -1]", ,4,GRÜN,30,0,30,0,0,0,0,0,,,,,down,1,0.587903211162,2017_Mai_15_1648,98.8843706924,Stroop,B-1,1STACS-3,
,,,,,,30,0,30,0,,,,,,,,,,,,2017_Mai_15_1648,98.8843706924,Stroop,B-1,1STACS-3,
neutralofneutral,right,"[-0.8745098039, -0.2078431373, 0.637254902]", ,17,HALS,31,0,31,0,0,0,0,0,,,,,right,1,0.44490682475,2017_Mai_15_1648,98.8843706924,Stroop,B-1,1STACS-3,
,,,,,,31,0,31,0,,,,,,,,,,,,2017_Mai_15_1648,98.8843706924,Stroop,B-1,1STACS-3,
congruent,right,"[-0.8745098039, -0.2078431373, 0.637254902]", ,8,BLAU,32,0,32,0,0,0,0,0,,,,,right,1,0.572013202795,2017_Mai_15_1648,98.8843706924,Stroop,B-1,1STACS-3,
,,,,,,32,0,32,0,,,,,,,,,,,,2017_Mai_15_1648,98.8843706924,Stroop,B-1,1STACS-3,
incongruent,right,"[-0.8745098039, -0.2078431373, 0.637254902]", ,2,ROT,33,0,33,0,0,0,0,0,,,,,right,1,0.419748878698,2017_Mai_15_1648,98.8843706924,Stroop,B-1,1STACS-3,
,,,,,,33,0,33,0,,,,,,,,,,,,2017_Mai_15_1648,98.8843706924,Stroop,B-1,1STACS-3,
neutralofneutral,left,"[0.568627451, -0.7882352941, -0.7882352941]", ,18,MODE,34,0,34,0,0,0,0,0,,,,,left,1,0.583533940768,2017_Mai_15_1648,98.8843706924,Stroop,B-1,1STACS-3,
,,,,,,34,0,34,0,,,,,,,,,,,,2017_Mai_15_1648,98.8843706924,Stroop,B-1,1STACS-3,
incongruent,down,"[-0.7725490196, 0.0745098039, -1]", ,1,ROT,35,0,35,0,0,0,0,0,,,,,down,1,1.0898080622,2017_Mai_15_1648,98.8843706924,Stroop,B-1,1STACS-3,
,,,,,,35,0,35,0,,,,,,,,,,,,2017_Mai_15_1648,98.8843706924,Stroop,B-1,1STACS-3,
congruent,down,"[-0.7725490196, 0.0745098039, -1]", ,4,GRÜN,36,0,36,0,0,0,0,0,,,,,down,1,0.575161368275,2017_Mai_15_1648,98.8843706924,Stroop,B-1,1STACS-3,
,,,,,,36,0,36,0,,,,,,,,,,,,2017_Mai_15_1648,98.8843706924,Stroop,B-1,1STACS-3,
incongruent,down,"[-0.7725490196, 0.0745098039, -1]", ,7,BLAU,37,0,37,0,0,0,0,0,,,,,down,1,0.497861320362,2017_Mai_15_1648,98.8843706924,Stroop,B-1,1STACS-3,
,,,,,,37,0,37,0,,,,,,,,,,,,2017_Mai_15_1648,98.8843706924,Stroop,B-1,1STACS-3,
neutral,left,"[0.568627451, -0.7882352941, -0.7882352941]", ,9,PECH,38,0,38,0,0,0,0,0,,,,,left,1,0.685168645736,2017_Mai_15_1648,98.8843706924,Stroop,B-1,1STACS-3,
,,,,,,38,0,38,0,,,,,,,,,,,,2017_Mai_15_1648,98.8843706924,Stroop,B-1,1STACS-3,
neutralofneutral,left,"[0.568627451, -0.7882352941, -0.7882352941]", ,18,MODE,39,0,39,0,0,0,0,0,,,,,left,1,0.510790617243,2017_Mai_15_1648,98.8843706924,Stroop,B-1,1STACS-3,
,,,,,,39,0,39,0,,,,,,,,,,,,2017_Mai_15_1648,98.8843706924,Stroop,B-1,1STACS-3,
neutralofneutral,left,"[0.568627451, -0.7882352941, -0.7882352941]", ,18,MODE,40,0,40,0,0,0,0,0,,,,,left,1,0.868510103937,2017_Mai_15_1648,98.8843706924,Stroop,B-1,1STACS-3,
,,,,,,40,0,40,0,,,,,,,,,,,,2017_Mai_15_1648,98.8843706924,Stroop,B-1,1STACS-3,
neutralofneutral,right,"[-0.8745098039, -0.2078431373, 0.637254902]", ,17,HALS,41,0,41,0,0,0,0,0,,,,,right,1,0.660020198096,2017_Mai_15_1648,98.8843706924,Stroop,B-1,1STACS-3,
,,,,,,41,0,41,0,,,,,,,,,,,,2017_Mai_15_1648,98.8843706924,Stroop,B-1,1STACS-3,
neutralofneutral,right,"[-0.8745098039, -0.2078431373, 0.637254902]", ,20,MODE,42,0,42,0,0,0,0,0,,,,,right,1,0.564648579639,2017_Mai_15_1648,98.8843706924,Stroop,B-1,1STACS-3,
,,,,,,42,0,42,0,,,,,,,,,,,,2017_Mai_15_1648,98.8843706924,Stroop,B-1,1STACS-3,
neutral,down,"[-0.7725490196, 0.0745098039, -1]", ,13,SOLL,43,0,43,0,0,0,0,0,,,,,left,0,0.716045195688,2017_Mai_15_1648,98.8843706924,Stroop,B-1,1STACS-3,
,,,,,,43,0,43,0,,,,,,,,,,,,2017_Mai_15_1648,98.8843706924,Stroop,B-1,1STACS-3,
neutral,down,"[-0.7725490196, 0.0745098039, -1]", ,13,SOLL,44,0,44,0,0,0,0,0,,,,,down,1,0.880319984803,2017_Mai_15_1648,98.8843706924,Stroop,B-1,1STACS-3,
,,,,,,44,0,44,0,,,,,,,,,,,,2017_Mai_15_1648,98.8843706924,Stroop,B-1,1STACS-3,
neutral,down,"[-0.7725490196, 0.0745098039, -1]", ,10,PECH,45,0,45,0,0,0,0,0,,,,,down,1,0.553796921118,2017_Mai_15_1648,98.8843706924,Stroop,B-1,1STACS-3,
,,,,,,45,0,45,0,,,,,,,,,,,,2017_Mai_15_1648,98.8843706924,Stroop,B-1,1STACS-3,
neutral,down,"[-0.7725490196, 0.0745098039, -1]", ,13,SOLL,46,0,46,0,0,0,0,0,,,,,down,1,0.659179588467,2017_Mai_15_1648,98.8843706924,Stroop,B-1,1STACS-3,
,,,,,,46,0,46,0,,,,,,,,,,,,2017_Mai_15_1648,98.8843706924,Stroop,B-1,1STACS-3,
congruent,right,"[-0.8745098039, -0.2078431373, 0.637254902]", ,8,BLAU,47,0,47,0,0,0,0,0,,,,,right,1,0.595540494673,2017_Mai_15_1648,98.8843706924,Stroop,B-1,1STACS-3,
,,,,,,47,0,47,0,,,,,,,,,,,,2017_Mai_15_1648,98.8843706924,Stroop,B-1,1STACS-3,
incongruent,left,"[0.568627451, -0.7882352941, -0.7882352941]", ,3,GRÜN,48,0,48,0,0,0,0,0,,,,,left,1,0.845232005744,2017_Mai_15_1648,98.8843706924,Stroop,B-1,1STACS-3,
,,,,,,48,0,48,0,,,,,,,,,,,,2017_Mai_15_1648,98.8843706924,Stroop,B-1,1STACS-3,
neutralofneutral,right,"[-0.8745098039, -0.2078431373, 0.637254902]", ,20,MODE,49,0,49,0,0,0,0,0,,,,,right,1,0.62930400372,2017_Mai_15_1648,98.8843706924,Stroop,B-1,1STACS-3,
,,,,,,49,0,49,0,,,,,,,,,,,,2017_Mai_15_1648,98.8843706924,Stroop,B-1,1STACS-3,
incongruent,right,"[-0.8745098039, -0.2078431373, 0.637254902]", ,2,ROT,50,0,50,0,0,0,0,0,,,,,right,1,0.98249917238,2017_Mai_15_1648,98.8843706924,Stroop,B-1,1STACS-3,
,,,,,,50,0,50,0,,,,,,,,,,,,2017_Mai_15_1648,98.8843706924,Stroop,B-1,1STACS-3,
fix,return,white, ,21,+,,,,,,,,,0,0,0,0,None,0,,2017_Mai_15_1648,98.8843706924,Stroop,B-1,1STACS-3,
fix,return,white, ,21,+,,,,,,,,,0,1,1,1,None,0,,2017_Mai_15_1648,98.8843706924,Stroop,B-1,1STACS-3,
fix,return,white, ,21,+,,,,,,,,,0,2,2,2,None,0,,2017_Mai_15_1648,98.8843706924,Stroop,B-1,1STACS-3,
fix,return,white, ,21,+,,,,,,,,,0,3,3,3,None,0,,2017_Mai_15_1648,98.8843706924,Stroop,B-1,1STACS-3,
fix,return,white, ,21,+,,,,,,,,,0,4,4,4,None,0,,2017_Mai_15_1648,98.8843706924,Stroop,B-1,1STACS-3,
fix,return,white, ,21,+,,,,,,,,,0,5,5,5,None,0,,2017_Mai_15_1648,98.8843706924,Stroop,B-1,1STACS-3,
fix,return,white, ,21,+,,,,,,,,,0,6,6,6,None,0,,2017_Mai_15_1648,98.8843706924,Stroop,B-1,1STACS-3,
fix,return,white, ,21,+,,,,,,,,,0,7,7,7,None,0,,2017_Mai_15_1648,98.8843706924,Stroop,B-1,1STACS-3,
fix,return,white, ,21,+,,,,,,,,,0,8,8,8,None,0,,2017_Mai_15_1648,98.8843706924,Stroop,B-1,1STACS-3,
fix,return,white, ,21,+,,,,,,,,,0,9,9,9,None,0,,2017_Mai_15_1648,98.8843706924,Stroop,B-1,1STACS-3,
fix,return,white, ,21,+,,,,,,,,,0,10,10,10,None,0,,2017_Mai_15_1648,98.8843706924,Stroop,B-1,1STACS-3,
fix,return,white, ,21,+,,,,,,,,,0,11,11,11,None,0,,2017_Mai_15_1648,98.8843706924,Stroop,B-1,1STACS-3,
fix,return,white,+,22,+,,,,,,,,,0,12,12,12,None,0,,2017_Mai_15_1648,98.8843706924,Stroop,B-1,1STACS-3,
congruent,right,"[-0.8745098039, -0.2078431373, 0.637254902]", ,8,BLAU,,,,,,,,,0,13,13,13,right,1,0.798245307713,2017_Mai_15_1648,98.8843706924,Stroop,B-1,1STACS-3,
neutral,left,"[0.568627451, -0.7882352941, -0.7882352941]", ,9,PECH,,,,,,,,,0,14,14,14,left,1,0.758657315386,2017_Mai_15_1648,98.8843706924,Stroop,B-1,1STACS-3,
congruent,down,"[-0.7725490196, 0.0745098039, -1]", ,4,GRÜN,,,,,,,,,0,15,15,15,down,1,0.694295224672,2017_Mai_15_1648,98.8843706924,Stroop,B-1,1STACS-3,
congruent,right,"[-0.8745098039, -0.2078431373, 0.637254902]", ,8,BLAU,,,,,,,,,0,16,16,16,right,1,0.526487584317,2017_Mai_15_1648,98.8843706924,Stroop,B-1,1STACS-3,
neutral,right,"[-0.8745098039, -0.2078431373, 0.637254902]", ,14,SOLL,,,,,,,,,0,17,17,17,right,1,0.637617071443,2017_Mai_15_1648,98.8843706924,Stroop,B-1,1STACS-3,
neutral,down,"[-0.7725490196, 0.0745098039, -1]", ,10,PECH,,,,,,,,,0,18,18,18,down,1,0.638466620758,2017_Mai_15_1648,98.8843706924,Stroop,B-1,1STACS-3,
neutral,down,"[-0.7725490196, 0.0745098039, -1]", ,13,SOLL,,,,,,,,,0,19,19,19,down,1,0.521350339219,2017_Mai_15_1648,98.8843706924,Stroop,B-1,1STACS-3,
congruent,left,"[0.568627451, -0.7882352941, -0.7882352941]", ,0,ROT,,,,,,,,,0,20,20,20,left,1,0.579215235457,2017_Mai_15_1648,98.8843706924,Stroop,B-1,1STACS-3,
congruent,left,"[0.568627451, -0.7882352941, -0.7882352941]", ,0,ROT,,,,,,,,,0,21,21,21,left,1,0.428060828961,2017_Mai_15_1648,98.8843706924,Stroop,B-1,1STACS-3,
neutral,right,"[-0.8745098039, -0.2078431373, 0.637254902]", ,11,PECH,,,,,,,,,0,22,22,22,right,1,0.598215136282,2017_Mai_15_1648,98.8843706924,Stroop,B-1,1STACS-3,
congruent,down,"[-0.7725490196, 0.0745098039, -1]", ,4,GRÜN,,,,,,,,,0,23,23,23,down,1,0.566217773488,2017_Mai_15_1648,98.8843706924,Stroop,B-1,1STACS-3,
neutral,left,"[0.568627451, -0.7882352941, -0.7882352941]", ,12,SOLL,,,,,,,,,0,24,24,24,left,1,0.619178135768,2017_Mai_15_1648,98.8843706924,Stroop,B-1,1STACS-3,
neutral,right,"[-0.8745098039, -0.2078431373, 0.637254902]", ,14,SOLL,,,,,,,,,0,25,25,25,right,1,0.619598859632,2017_Mai_15_1648,98.8843706924,Stroop,B-1,1STACS-3,
neutral,left,"[0.568627451, -0.7882352941, -0.7882352941]", ,12,SOLL,,,,,,,,,0,26,26,26,left,1,0.651657962115,2017_Mai_15_1648,98.8843706924,Stroop,B-1,1STACS-3,
neutralofneutral,right,"[-0.8745098039, -0.2078431373, 0.637254902]", ,20,MODE,,,,,,,,,0,27,27,27,right,1,0.563602357282,2017_Mai_15_1648,98.8843706924,Stroop,B-1,1STACS-3,
neutral,down,"[-0.7725490196, 0.0745098039, -1]", ,13,SOLL,,,,,,,,,0,28,28,28,down,1,0.544601059632,2017_Mai_15_1648,98.8843706924,Stroop,B-1,1STACS-3,
neutral,right,"[-0.8745098039, -0.2078431373, 0.637254902]", ,11,PECH,,,,,,,,,0,29,29,29,right,1,0.680193991137,2017_Mai_15_1648,98.8843706924,Stroop,B-1,1STACS-3,
neutralofneutral,down,"[-0.7725490196, 0.0745098039, -1]", ,19,MODE,,,,,,,,,0,30,30,30,down,1,0.829537552956,2017_Mai_15_1648,98.8843706924,Stroop,B-1,1STACS-3,
neutralofneutral,right,"[-0.8745098039, -0.2078431373, 0.637254902]", ,17,HALS,,,,,,,,,0,31,31,31,right,1,0.64379858334,2017_Mai_15_1648,98.8843706924,Stroop,B-1,1STACS-3,
neutralofneutral,down,"[-0.7725490196, 0.0745098039, -1]", ,16,HALS,,,,,,,,,0,32,32,32,down,1,0.83675550943,2017_Mai_15_1648,98.8843706924,Stroop,B-1,1STACS-3,
neutralofneutral,left,"[0.568627451, -0.7882352941, -0.7882352941]", ,18,MODE,,,,,,,,,0,33,33,33,left,1,0.539007611302,2017_Mai_15_1648,98.8843706924,Stroop,B-1,1STACS-3,
neutral,left,"[0.568627451, -0.7882352941, -0.7882352941]", ,9,PECH,,,,,,,,,0,34,34,34,left,1,0.468440262661,2017_Mai_15_1648,98.8843706924,Stroop,B-1,1STACS-3,
neutralofneutral,left,"[0.568627451, -0.7882352941, -0.7882352941]", ,15,HALS,,,,,,,,,0,35,35,35,left,1,0.397925155292,2017_Mai_15_1648,98.8843706924,Stroop,B-1,1STACS-3,
neutral,down,"[-0.7725490196, 0.0745098039, -1]", ,10,PECH,,,,,,,,,0,36,36,36,down,1,0.638793757307,2017_Mai_15_1648,98.8843706924,Stroop,B-1,1STACS-3,
incongruent,left,"[0.568627451, -0.7882352941, -0.7882352941]", ,6,BLAU,,,,,,,,,0,37,37,37,left,1,0.880415807036,2017_Mai_15_1648,98.8843706924,Stroop,B-1,1STACS-3,
incongruent,left,"[0.568627451, -0.7882352941, -0.7882352941]", ,3,GRÜN,,,,,,,,,0,38,38,38,down,0,0.723026809272,2017_Mai_15_1648,98.8843706924,Stroop,B-1,1STACS-3,
neutral,right,"[-0.8745098039, -0.2078431373, 0.637254902]", ,14,SOLL,,,,,,,,,0,39,39,39,right,1,1.16606970998,2017_Mai_15_1648,98.8843706924,Stroop,B-1,1STACS-3,
neutral,left,"[0.568627451, -0.7882352941, -0.7882352941]", ,12,SOLL,,,,,,,,,0,40,40,40,left,1,0.701716000218,2017_Mai_15_1648,98.8843706924,Stroop,B-1,1STACS-3,
incongruent,right,"[-0.8745098039, -0.2078431373, 0.637254902]", ,2,ROT,,,,,,,,,0,41,41,41,right,1,0.982551693023,2017_Mai_15_1648,98.8843706924,Stroop,B-1,1STACS-3,
incongruent,down,"[-0.7725490196, 0.0745098039, -1]", ,7,BLAU,,,,,,,,,0,42,42,42,down,1,0.932755140668,2017_Mai_15_1648,98.8843706924,Stroop,B-1,1STACS-3,
incongruent,down,"[-0.7725490196, 0.0745098039, -1]", ,1,ROT,,,,,,,,,0,43,43,43,down,1,0.908248674064,2017_Mai_15_1648,98.8843706924,Stroop,B-1,1STACS-3,
neutral,right,"[-0.8745098039, -0.2078431373, 0.637254902]", ,11,PECH,,,,,,,,,0,44,44,44,right,1,0.648807599848,2017_Mai_15_1648,98.8843706924,Stroop,B-1,1STACS-3,
neutral,down,"[-0.7725490196, 0.0745098039, -1]", ,13,SOLL,,,,,,,,,0,45,45,45,down,1,0.958085734359,2017_Mai_15_1648,98.8843706924,Stroop,B-1,1STACS-3,
neutral,left,"[0.568627451, -0.7882352941, -0.7882352941]", ,9,PECH,,,,,,,,,0,46,46,46,left,1,0.521503990032,2017_Mai_15_1648,98.8843706924,Stroop,B-1,1STACS-3,
incongruent,right,"[-0.8745098039, -0.2078431373, 0.637254902]", ,5,GRÜN,,,,,,,,,0,47,47,47,right,1,1.09300036737,2017_Mai_15_1648,98.8843706924,Stroop,B-1,1STACS-3,
neutral,down,"[-0.7725490196, 0.0745098039, -1]", ,10,PECH,,,,,,,,,0,48,48,48,down,1,0.833467661394,2017_Mai_15_1648,98.8843706924,Stroop,B-1,1STACS-3,
fix,return,white, ,21,+,,,,,,,,,0,49,49,49,None,0,,2017_Mai_15_1648,98.8843706924,Stroop,B-1,1STACS-3,
fix,return,white, ,21,+,,,,,,,,,0,50,50,50,None,0,,2017_Mai_15_1648,98.8843706924,Stroop,B-1,1STACS-3,
fix,return,white, ,21,+,,,,,,,,,0,51,51,51,None,0,,2017_Mai_15_1648,98.8843706924,Stroop,B-1,1STACS-3,
fix,return,white, ,21,+,,,,,,,,,0,52,52,52,None,0,,2017_Mai_15_1648,98.8843706924,Stroop,B-1,1STACS-3,
fix,return,white, ,21,+,,,,,,,,,0,53,53,53,None,0,,2017_Mai_15_1648,98.8843706924,Stroop,B-1,1STACS-3,
fix,return,white, ,21,+,,,,,,,,,0,54,54,54,None,0,,2017_Mai_15_1648,98.8843706924,Stroop,B-1,1STACS-3,
fix,return,white, ,21,+,,,,,,,,,0,55,55,55,None,0,,2017_Mai_15_1648,98.8843706924,Stroop,B-1,1STACS-3,
fix,return,white, ,21,+,,,,,,,,,0,56,56,56,None,0,,2017_Mai_15_1648,98.8843706924,Stroop,B-1,1STACS-3,
fix,return,white, ,21,+,,,,,,,,,0,57,57,57,None,0,,2017_Mai_15_1648,98.8843706924,Stroop,B-1,1STACS-3,
fix,return,white, ,21,+,,,,,,,,,0,58,58,58,None,0,,2017_Mai_15_1648,98.8843706924,Stroop,B-1,1STACS-3,
fix,return,white, ,21,+,,,,,,,,,0,59,59,59,None,0,,2017_Mai_15_1648,98.8843706924,Stroop,B-1,1STACS-3,
fix,return,white, ,21,+,,,,,,,,,0,60,60,60,None,0,,2017_Mai_15_1648,98.8843706924,Stroop,B-1,1STACS-3,
fix,return,white,+,22,+,,,,,,,,,0,61,61,61,None,0,,2017_Mai_15_1648,98.8843706924,Stroop,B-1,1STACS-3,
incongruent,down,"[-0.7725490196, 0.0745098039, -1]", ,1,ROT,,,,,,,,,0,62,62,62,down,1,1.23414959164,2017_Mai_15_1648,98.8843706924,Stroop,B-1,1STACS-3,
neutral,left,"[0.568627451, -0.7882352941, -0.7882352941]", ,12,SOLL,,,,,,,,,0,63,63,63,left,1,0.58188568659,2017_Mai_15_1648,98.8843706924,Stroop,B-1,1STACS-3,
neutral,down,"[-0.7725490196, 0.0745098039, -1]", ,13,SOLL,,,,,,,,,0,64,64,64,down,1,0.523392777573,2017_Mai_15_1648,98.8843706924,Stroop,B-1,1STACS-3,
incongruent,left,"[0.568627451, -0.7882352941, -0.7882352941]", ,6,BLAU,,,,,,,,,0,65,65,65,left,1,1.04452996121,2017_Mai_15_1648,98.8843706924,Stroop,B-1,1STACS-3,
neutral,down,"[-0.7725490196, 0.0745098039, -1]", ,10,PECH,,,,,,,,,0,66,66,66,down,1,0.81205153169,2017_Mai_15_1648,98.8843706924,Stroop,B-1,1STACS-3,
incongruent,down,"[-0.7725490196, 0.0745098039, -1]", ,7,BLAU,,,,,,,,,0,67,67,67,down,1,0.733770912226,2017_Mai_15_1648,98.8843706924,Stroop,B-1,1STACS-3,
incongruent,left,"[0.568627451, -0.7882352941, -0.7882352941]", ,3,GRÜN,,,,,,,,,0,68,68,68,left,1,0.672929380689,2017_Mai_15_1648,98.8843706924,Stroop,B-1,1STACS-3,
neutral,right,"[-0.8745098039, -0.2078431373, 0.637254902]", ,11,PECH,,,,,,,,,0,69,69,69,right,1,0.576778892289,2017_Mai_15_1648,98.8843706924,Stroop,B-1,1STACS-3,
incongruent,right,"[-0.8745098039, -0.2078431373, 0.637254902]", ,2,ROT,,,,,,,,,0,70,70,70,right,1,1.0073995438,2017_Mai_15_1648,98.8843706924,Stroop,B-1,1STACS-3,
neutral,right,"[-0.8745098039, -0.2078431373, 0.637254902]", ,14,SOLL,,,,,,,,,0,71,71,71,right,1,0.49130629731,2017_Mai_15_1648,98.8843706924,Stroop,B-1,1STACS-3,
neutral,left,"[0.568627451, -0.7882352941, -0.7882352941]", ,9,PECH,,,,,,,,,0,72,72,72,left,1,0.74404651988,2017_Mai_15_1648,98.8843706924,Stroop,B-1,1STACS-3,
incongruent,right,"[-0.8745098039, -0.2078431373, 0.637254902]", ,5,GRÜN,,,,,,,,,0,73,73,73,right,1,0.851449276375,2017_Mai_15_1648,98.8843706924,Stroop,B-1,1STACS-3,
neutral,right,"[-0.8745098039, -0.2078431373, 0.637254902]", ,11,PECH,,,,,,,,,0,74,74,74,right,1,0.43589702043,2017_Mai_15_1648,98.8843706924,Stroop,B-1,1STACS-3,
neutralofneutral,down,"[-0.7725490196, 0.0745098039, -1]", ,19,MODE,,,,,,,,,0,75,75,75,down,1,0.765870802015,2017_Mai_15_1648,98.8843706924,Stroop,B-1,1STACS-3,
neutralofneutral,left,"[0.568627451, -0.7882352941, -0.7882352941]", ,18,MODE,,,,,,,,,0,76,76,76,left,1,0.636809426896,2017_Mai_15_1648,98.8843706924,Stroop,B-1,1STACS-3,
neutral,right,"[-0.8745098039, -0.2078431373, 0.637254902]", ,14,SOLL,,,,,,,,,0,77,77,77,right,1,0.693324710262,2017_Mai_15_1648,98.8843706924,Stroop,B-1,1STACS-3,
neutralofneutral,down,"[-0.7725490196, 0.0745098039, -1]", ,16,HALS,,,,,,,,,0,78,78,78,down,1,0.604424305324,2017_Mai_15_1648,98.8843706924,Stroop,B-1,1STACS-3,
neutral,left,"[0.568627451, -0.7882352941, -0.7882352941]", ,12,SOLL,,,,,,,,,0,79,79,79,left,1,1.04461768186,2017_Mai_15_1648,98.8843706924,Stroop,B-1,1STACS-3,
neutral,down,"[-0.7725490196, 0.0745098039, -1]", ,13,SOLL,,,,,,,,,0,80,80,80,down,1,1.01277676353,2017_Mai_15_1648,98.8843706924,Stroop,B-1,1STACS-3,
neutral,left,"[0.568627451, -0.7882352941, -0.7882352941]", ,9,PECH,,,,,,,,,0,81,81,81,left,1,0.619581259629,2017_Mai_15_1648,98.8843706924,Stroop,B-1,1STACS-3,
neutralofneutral,right,"[-0.8745098039, -0.2078431373, 0.637254902]", ,17,HALS,,,,,,,,,0,82,82,82,right,1,0.539435319293,2017_Mai_15_1648,98.8843706924,Stroop,B-1,1STACS-3,
neutralofneutral,right,"[-0.8745098039, -0.2078431373, 0.637254902]", ,20,MODE,,,,,,,,,0,83,83,83,right,1,0.520106605727,2017_Mai_15_1648,98.8843706924,Stroop,B-1,1STACS-3,
neutralofneutral,left,"[0.568627451, -0.7882352941, -0.7882352941]", ,15,HALS,,,,,,,,,0,84,84,84,left,1,1.04473138346,2017_Mai_15_1648,98.8843706924,Stroop,B-1,1STACS-3,
neutral,down,"[-0.7725490196, 0.0745098039, -1]", ,10,PECH,,,,,,,,,0,85,85,85,down,1,0.512750084159,2017_Mai_15_1648,98.8843706924,Stroop,B-1,1STACS-3,
congruent,down,"[-0.7725490196, 0.0745098039, -1]", ,4,GRÜN,,,,,,,,,0,86,86,86,down,1,0.566014675051,2017_Mai_15_1648,98.8843706924,Stroop,B-1,1STACS-3,
congruent,down,"[-0.7725490196, 0.0745098039, -1]", ,4,GRÜN,,,,,,,,,0,87,87,87,down,1,0.438002036572,2017_Mai_15_1648,98.8843706924,Stroop,B-1,1STACS-3,
neutral,left,"[0.568627451, -0.7882352941, -0.7882352941]", ,9,PECH,,,,,,,,,0,88,88,88,left,1,0.60615217856,2017_Mai_15_1648,98.8843706924,Stroop,B-1,1STACS-3,
neutral,left,"[0.568627451, -0.7882352941, -0.7882352941]", ,12,SOLL,,,,,,,,,0,89,89,89,left,1,0.478681508403,2017_Mai_15_1648,98.8843706924,Stroop,B-1,1STACS-3,
congruent,left,"[0.568627451, -0.7882352941, -0.7882352941]", ,0,ROT,,,,,,,,,0,90,90,90,left,1,0.481469572249,2017_Mai_15_1648,98.8843706924,Stroop,B-1,1STACS-3,
congruent,right,"[-0.8745098039, -0.2078431373, 0.637254902]", ,8,BLAU,,,,,,,,,0,91,91,91,right,1,0.5947850914,2017_Mai_15_1648,98.8843706924,Stroop,B-1,1STACS-3,
neutral,down,"[-0.7725490196, 0.0745098039, -1]", ,10,PECH,,,,,,,,,0,92,92,92,down,1,0.940979649647,2017_Mai_15_1648,98.8843706924,Stroop,B-1,1STACS-3,
neutral,down,"[-0.7725490196, 0.0745098039, -1]", ,13,SOLL,,,,,,,,,0,93,93,93,down,1,0.373800301435,2017_Mai_15_1648,98.8843706924,Stroop,B-1,1STACS-3,
neutral,right,"[-0.8745098039, -0.2078431373, 0.637254902]", ,14,SOLL,,,,,,,,,0,94,94,94,right,1,0.608572318548,2017_Mai_15_1648,98.8843706924,Stroop,B-1,1STACS-3,
neutral,right,"[-0.8745098039, -0.2078431373, 0.637254902]", ,11,PECH,,,,,,,,,0,95,95,95,right,1,0.448561758549,2017_Mai_15_1648,98.8843706924,Stroop,B-1,1STACS-3,
congruent,right,"[-0.8745098039, -0.2078431373, 0.637254902]", ,8,BLAU,,,,,,,,,0,96,96,96,right,1,0.473938726849,2017_Mai_15_1648,98.8843706924,Stroop,B-1,1STACS-3,
congruent,left,"[0.568627451, -0.7882352941, -0.7882352941]", ,0,ROT,,,,,,,,,0,97,97,97,left,1,0.633516550288,2017_Mai_15_1648,98.8843706924,Stroop,B-1,1STACS-3,
fix,return,white, ,21,+,,,,,,,,,0,98,98,98,None,0,,2017_Mai_15_1648,98.8843706924,Stroop,B-1,1STACS-3,
fix,return,white, ,21,+,,,,,,,,,0,99,99,99,None,0,,2017_Mai_15_1648,98.8843706924,Stroop,B-1,1STACS-3,
fix,return,white, ,21,+,,,,,,,,,0,100,100,100,None,0,,2017_Mai_15_1648,98.8843706924,Stroop,B-1,1STACS-3,
fix,return,white, ,21,+,,,,,,,,,0,101,101,101,None,0,,2017_Mai_15_1648,98.8843706924,Stroop,B-1,1STACS-3,
fix,return,white, ,21,+,,,,,,,,,0,102,102,102,None,0,,2017_Mai_15_1648,98.8843706924,Stroop,B-1,1STACS-3,
fix,return,white, ,21,+,,,,,,,,,0,103,103,103,None,0,,2017_Mai_15_1648,98.8843706924,Stroop,B-1,1STACS-3,
fix,return,white, ,21,+,,,,,,,,,0,104,104,104,None,0,,2017_Mai_15_1648,98.8843706924,Stroop,B-1,1STACS-3,
fix,return,white, ,21,+,,,,,,,,,0,105,105,105,None,0,,2017_Mai_15_1648,98.8843706924,Stroop,B-1,1STACS-3,
fix,return,white, ,21,+,,,,,,,,,0,106,106,106,None,0,,2017_Mai_15_1648,98.8843706924,Stroop,B-1,1STACS-3,
fix,return,white, ,21,+,,,,,,,,,0,107,107,107,None,0,,2017_Mai_15_1648,98.8843706924,Stroop,B-1,1STACS-3,
fix,return,white, ,21,+,,,,,,,,,0,108,108,108,None,0,,2017_Mai_15_1648,98.8843706924,Stroop,B-1,1STACS-3,
fix,return,white, ,21,+,,,,,,,,,0,109,109,109,None,0,,2017_Mai_15_1648,98.8843706924,Stroop,B-1,1STACS-3,
fix,return,white,+,22,+,,,,,,,,,0,110,110,110,None,0,,2017_Mai_15_1648,98.8843706924,Stroop,B-1,1STACS-3,
neutral,right,"[-0.8745098039, -0.2078431373, 0.637254902]", ,11,PECH,,,,,,,,,0,111,111,111,right,1,0.83354672172,2017_Mai_15_1648,98.8843706924,Stroop,B-1,1STACS-3,
incongruent,right,"[-0.8745098039, -0.2078431373, 0.637254902]", ,2,ROT,,,,,,,,,0,112,112,112,right,1,0.514959024122,2017_Mai_15_1648,98.8843706924,Stroop,B-1,1STACS-3,
incongruent,left,"[0.568627451, -0.7882352941, -0.7882352941]", ,6,BLAU,,,,,,,,,0,113,113,113,left,1,0.712223201552,2017_Mai_15_1648,98.8843706924,Stroop,B-1,1STACS-3,
neutral,down,"[-0.7725490196, 0.0745098039, -1]", ,10,PECH,,,,,,,,,0,114,114,114,down,1,0.480869495983,2017_Mai_15_1648,98.8843706924,Stroop,B-1,1STACS-3,
neutral,left,"[0.568627451, -0.7882352941, -0.7882352941]", ,9,PECH,,,,,,,,,0,115,115,115,left,1,0.999033955433,2017_Mai_15_1648,98.8843706924,Stroop,B-1,1STACS-3,
incongruent,down,"[-0.7725490196, 0.0745098039, -1]", ,1,ROT,,,,,,,,,0,116,116,116,down,1,0.822858491791,2017_Mai_15_1648,98.8843706924,Stroop,B-1,1STACS-3,
incongruent,right,"[-0.8745098039, -0.2078431373, 0.637254902]", ,5,GRÜN,,,,,,,,,0,117,117,117,right,1,0.925046898419,2017_Mai_15_1648,98.8843706924,Stroop,B-1,1STACS-3,
incongruent,left,"[0.568627451, -0.7882352941, -0.7882352941]", ,3,GRÜN,,,,,,,,,0,118,118,118,left,1,0.755411372116,2017_Mai_15_1648,98.8843706924,Stroop,B-1,1STACS-3,
incongruent,down,"[-0.7725490196, 0.0745098039, -1]", ,7,BLAU,,,,,,,,,0,119,119,119,down,1,0.815913195673,2017_Mai_15_1648,98.8843706924,Stroop,B-1,1STACS-3,
neutral,left,"[0.568627451, -0.7882352941, -0.7882352941]", ,12,SOLL,,,,,,,,,0,120,120,120,left,1,0.754761010128,2017_Mai_15_1648,98.8843706924,Stroop,B-1,1STACS-3,
neutral,down,"[-0.7725490196, 0.0745098039, -1]", ,13,SOLL,,,,,,,,,0,121,121,121,down,1,1.05486227998,2017_Mai_15_1648,98.8843706924,Stroop,B-1,1STACS-3,
neutral,right,"[-0.8745098039, -0.2078431373, 0.637254902]", ,14,SOLL,,,,,,,,,0,122,122,122,right,1,0.554785594259,2017_Mai_15_1648,98.8843706924,Stroop,B-1,1STACS-3,
neutral,left,"[0.568627451, -0.7882352941, -0.7882352941]", ,12,SOLL,,,,,,,,,0,123,123,123,left,1,0.650363942903,2017_Mai_15_1648,98.8843706924,Stroop,B-1,1STACS-3,
neutral,right,"[-0.8745098039, -0.2078431373, 0.637254902]", ,14,SOLL,,,,,,,,,0,124,124,124,right,1,0.639206938313,2017_Mai_15_1648,98.8843706924,Stroop,B-1,1STACS-3,
congruent,down,"[-0.7725490196, 0.0745098039, -1]", ,4,GRÜN,,,,,,,,,0,125,125,125,down,1,0.809763531397,2017_Mai_15_1648,98.8843706924,Stroop,B-1,1STACS-3,
neutral,down,"[-0.7725490196, 0.0745098039, -1]", ,10,PECH,,,,,,,,,0,126,126,126,down,1,0.404893359351,2017_Mai_15_1648,98.8843706924,Stroop,B-1,1STACS-3,
congruent,right,"[-0.8745098039, -0.2078431373, 0.637254902]", ,8,BLAU,,,,,,,,,0,127,127,127,right,1,0.625065476199,2017_Mai_15_1648,98.8843706924,Stroop,B-1,1STACS-3,
congruent,left,"[0.568627451, -0.7882352941, -0.7882352941]", ,0,ROT,,,,,,,,,0,128,128,128,left,1,0.567719919711,2017_Mai_15_1648,98.8843706924,Stroop,B-1,1STACS-3,
neutral,left,"[0.568627451, -0.7882352941, -0.7882352941]", ,9,PECH,,,,,,,,,0,129,129,129,left,1,0.607368813635,2017_Mai_15_1648,98.8843706924,Stroop,B-1,1STACS-3,
congruent,left,"[0.568627451, -0.7882352941, -0.7882352941]", ,0,ROT,,,,,,,,,0,130,130,130,left,1,0.631986467555,2017_Mai_15_1648,98.8843706924,Stroop,B-1,1STACS-3,
neutral,down,"[-0.7725490196, 0.0745098039, -1]", ,13,SOLL,,,,,,,,,0,131,131,131,down,1,0.713366084237,2017_Mai_15_1648,98.8843706924,Stroop,B-1,1STACS-3,
congruent,down,"[-0.7725490196, 0.0745098039, -1]", ,4,GRÜN,,,,,,,,,0,132,132,132,down,1,0.489136189097,2017_Mai_15_1648,98.8843706924,Stroop,B-1,1STACS-3,
neutral,right,"[-0.8745098039, -0.2078431373, 0.637254902]", ,11,PECH,,,,,,,,,0,133,133,133,right,1,0.457892553382,2017_Mai_15_1648,98.8843706924,Stroop,B-1,1STACS-3,
congruent,right,"[-0.8745098039, -0.2078431373, 0.637254902]", ,8,BLAU,,,,,,,,,0,134,134,134,right,1,0.441075890931,2017_Mai_15_1648,98.8843706924,Stroop,B-1,1STACS-3,
neutralofneutral,down,"[-0.7725490196, 0.0745098039, -1]", ,19,MODE,,,,,,,,,0,135,135,135,down,1,0.574126599889,2017_Mai_15_1648,98.8843706924,Stroop,B-1,1STACS-3,
neutralofneutral,right,"[-0.8745098039, -0.2078431373, 0.637254902]", ,17,HALS,,,,,,,,,0,136,136,136,right,1,0.594014602415,2017_Mai_15_1648,98.8843706924,Stroop,B-1,1STACS-3,
neutralofneutral,left,"[0.568627451, -0.7882352941, -0.7882352941]", ,18,MODE,,,,,,,,,0,137,137,137,left,1,0.60679946753,2017_Mai_15_1648,98.8843706924,Stroop,B-1,1STACS-3,
neutral,down,"[-0.7725490196, 0.0745098039, -1]", ,13,SOLL,,,,,,,,,0,138,138,138,down,1,1.10863168364,2017_Mai_15_1648,98.8843706924,Stroop,B-1,1STACS-3,
neutral,down,"[-0.7725490196, 0.0745098039, -1]", ,10,PECH,,,,,,,,,0,139,139,139,down,1,0.470055272388,2017_Mai_15_1648,98.8843706924,Stroop,B-1,1STACS-3,
neutralofneutral,left,"[0.568627451, -0.7882352941, -0.7882352941]", ,15,HALS,,,,,,,,,0,140,140,140,left,1,0.679610676776,2017_Mai_15_1648,98.8843706924,Stroop,B-1,1STACS-3,
neutral,right,"[-0.8745098039, -0.2078431373, 0.637254902]", ,11,PECH,,,,,,,,,0,141,141,141,right,1,0.769398624685,2017_Mai_15_1648,98.8843706924,Stroop,B-1,1STACS-3,
neutral,left,"[0.568627451, -0.7882352941, -0.7882352941]", ,12,SOLL,,,,,,,,,0,142,142,142,left,1,1.0129379572,2017_Mai_15_1648,98.8843706924,Stroop,B-1,1STACS-3,
neutral,right,"[-0.8745098039, -0.2078431373, 0.637254902]", ,14,SOLL,,,,,,,,,0,143,143,143,right,1,0.712704547645,2017_Mai_15_1648,98.8843706924,Stroop,B-1,1STACS-3,
neutral,left,"[0.568627451, -0.7882352941, -0.7882352941]", ,9,PECH,,,,,,,,,0,144,144,144,left,1,0.840719421045,2017_Mai_15_1648,98.8843706924,Stroop,B-1,1STACS-3,
neutralofneutral,right,"[-0.8745098039, -0.2078431373, 0.637254902]", ,20,MODE,,,,,,,,,0,145,145,145,right,1,0.754810178389,2017_Mai_15_1648,98.8843706924,Stroop,B-1,1STACS-3,
neutralofneutral,down,"[-0.7725490196, 0.0745098039, -1]", ,16,HALS,,,,,,,,,0,146,146,146,down,1,0.697454006026,2017_Mai_15_1648,98.8843706924,Stroop,B-1,1STACS-3,
fix,return,white, ,21,+,,,,,,,,,0,147,147,147,None,0,,2017_Mai_15_1648,98.8843706924,Stroop,B-1,1STACS-3,
fix,return,white, ,21,+,,,,,,,,,0,148,148,148,None,0,,2017_Mai_15_1648,98.8843706924,Stroop,B-1,1STACS-3,
fix,return,white, ,21,+,,,,,,,,,0,149,149,149,None,0,,2017_Mai_15_1648,98.8843706924,Stroop,B-1,1STACS-3,
fix,return,white, ,21,+,,,,,,,,,0,150,150,150,None,0,,2017_Mai_15_1648,98.8843706924,Stroop,B-1,1STACS-3,
fix,return,white, ,21,+,,,,,,,,,0,151,151,151,None,0,,2017_Mai_15_1648,98.8843706924,Stroop,B-1,1STACS-3,
fix,return,white, ,21,+,,,,,,,,,0,152,152,152,None,0,,2017_Mai_15_1648,98.8843706924,Stroop,B-1,1STACS-3,
fix,return,white, ,21,+,,,,,,,,,0,153,153,153,None,0,,2017_Mai_15_1648,98.8843706924,Stroop,B-1,1STACS-3,
fix,return,white, ,21,+,,,,,,,,,0,154,154,154,None,0,,2017_Mai_15_1648,98.8843706924,Stroop,B-1,1STACS-3,
fix,return,white, ,21,+,,,,,,,,,0,155,155,155,None,0,,2017_Mai_15_1648,98.8843706924,Stroop,B-1,1STACS-3,
fix,return,white, ,21,+,,,,,,,,,0,156,156,156,None,0,,2017_Mai_15_1648,98.8843706924,Stroop,B-1,1STACS-3,
fix,return,white, ,21,+,,,,,,,,,0,157,157,157,None,0,,2017_Mai_15_1648,98.8843706924,Stroop,B-1,1STACS-3,
fix,return,white, ,21,+,,,,,,,,,0,158,158,158,None,0,,2017_Mai_15_1648,98.8843706924,Stroop,B-1,1STACS-3,
fix,return,white,+,22,+,,,,,,,,,0,159,159,159,None,0,,2017_Mai_15_1648,98.8843706924,Stroop,B-1,1STACS-3,
neutral,left,"[0.568627451, -0.7882352941, -0.7882352941]", ,9,PECH,,,,,,,,,0,160,160,160,left,1,0.979659705354,2017_Mai_15_1648,98.8843706924,Stroop,B-1,1STACS-3,
congruent,right,"[-0.8745098039, -0.2078431373, 0.637254902]", ,8,BLAU,,,,,,,,,0,161,161,161,right,1,0.622771329876,2017_Mai_15_1648,98.8843706924,Stroop,B-1,1STACS-3,
congruent,right,"[-0.8745098039, -0.2078431373, 0.637254902]", ,8,BLAU,,,,,,,,,0,162,162,162,right,1,0.504232521173,2017_Mai_15_1648,98.8843706924,Stroop,B-1,1STACS-3,
congruent,down,"[-0.7725490196, 0.0745098039, -1]", ,4,GRÜN,,,,,,,,,0,163,163,163,down,1,0.55277137178,2017_Mai_15_1648,98.8843706924,Stroop,B-1,1STACS-3,
neutral,right,"[-0.8745098039, -0.2078431373, 0.637254902]", ,11,PECH,,,,,,,,,0,164,164,164,right,1,0.701952901834,2017_Mai_15_1648,98.8843706924,Stroop,B-1,1STACS-3,
neutral,down,"[-0.7725490196, 0.0745098039, -1]", ,13,SOLL,,,,,,,,,0,165,165,165,down,1,0.923870491921,2017_Mai_15_1648,98.8843706924,Stroop,B-1,1STACS-3,
congruent,down,"[-0.7725490196, 0.0745098039, -1]", ,4,GRÜN,,,,,,,,,0,166,166,166,down,1,0.595749180413,2017_Mai_15_1648,98.8843706924,Stroop,B-1,1STACS-3,
congruent,left,"[0.568627451, -0.7882352941, -0.7882352941]", ,0,ROT,,,,,,,,,0,167,167,167,left,1,0.65186245738,2017_Mai_15_1648,98.8843706924,Stroop,B-1,1STACS-3,
neutral,left,"[0.568627451, -0.7882352941, -0.7882352941]", ,12,SOLL,,,,,,,,,0,168,168,168,left,1,0.489527300258,2017_Mai_15_1648,98.8843706924,Stroop,B-1,1STACS-3,
neutral,down,"[-0.7725490196, 0.0745098039, -1]", ,10,PECH,,,,,,,,,0,169,169,169,down,1,0.702442628881,2017_Mai_15_1648,98.8843706924,Stroop,B-1,1STACS-3,
congruent,left,"[0.568627451, -0.7882352941, -0.7882352941]", ,0,ROT,,,,,,,,,0,170,170,170,left,1,0.620488358158,2017_Mai_15_1648,98.8843706924,Stroop,B-1,1STACS-3,
neutral,right,"[-0.8745098039, -0.2078431373, 0.637254902]", ,14,SOLL,,,,,,,,,0,171,171,171,right,1,0.649365212617,2017_Mai_15_1648,98.8843706924,Stroop,B-1,1STACS-3,
neutral,down,"[-0.7725490196, 0.0745098039, -1]", ,10,PECH,,,,,,,,,0,172,172,172,down,1,0.693742081745,2017_Mai_15_1648,98.8843706924,Stroop,B-1,1STACS-3,
incongruent,down,"[-0.7725490196, 0.0745098039, -1]", ,1,ROT,,,,,,,,,0,173,173,173,down,1,1.00308921944,2017_Mai_15_1648,98.8843706924,Stroop,B-1,1STACS-3,
incongruent,left,"[0.568627451, -0.7882352941, -0.7882352941]", ,3,GRÜN,,,,,,,,,0,174,174,174,None,0,,2017_Mai_15_1648,98.8843706924,Stroop,B-1,1STACS-3,
incongruent,right,"[-0.8745098039, -0.2078431373, 0.637254902]", ,2,ROT,,,,,,,,,0,175,175,175,right,1,0.834223902759,2017_Mai_15_1648,98.8843706924,Stroop,B-1,1STACS-3,
neutral,down,"[-0.7725490196, 0.0745098039, -1]", ,13,SOLL,,,,,,,,,0,176,176,176,down,1,0.79037782735,2017_Mai_15_1648,98.8843706924,Stroop,B-1,1STACS-3,
incongruent,down,"[-0.7725490196, 0.0745098039, -1]", ,7,BLAU,,,,,,,,,0,177,177,177,down,1,0.820618262935,2017_Mai_15_1648,98.8843706924,Stroop,B-1,1STACS-3,
incongruent,right,"[-0.8745098039, -0.2078431373, 0.637254902]", ,5,GRÜN,,,,,,,,,0,178,178,178,right,1,1.07789314005,2017_Mai_15_1648,98.8843706924,Stroop,B-1,1STACS-3,
neutral,right,"[-0.8745098039, -0.2078431373, 0.637254902]", ,14,SOLL,,,,,,,,,0,179,179,179,right,1,0.630086226043,2017_Mai_15_1648,98.8843706924,Stroop,B-1,1STACS-3,
neutral,right,"[-0.8745098039, -0.2078431373, 0.637254902]", ,11,PECH,,,,,,,,,0,180,180,180,right,1,0.534700639326,2017_Mai_15_1648,98.8843706924,Stroop,B-1,1STACS-3,
neutral,left,"[0.568627451, -0.7882352941, -0.7882352941]", ,12,SOLL,,,,,,,,,0,181,181,181,left,1,0.694464519931,2017_Mai_15_1648,98.8843706924,Stroop,B-1,1STACS-3,
incongruent,left,"[0.568627451, -0.7882352941, -0.7882352941]", ,6,BLAU,,,,,,,,,0,182,182,182,left,1,0.658285061369,2017_Mai_15_1648,98.8843706924,Stroop,B-1,1STACS-3,
neutral,left,"[0.568627451, -0.7882352941, -0.7882352941]", ,9,PECH,,,,,,,,,0,183,183,183,left,1,0.875079933343,2017_Mai_15_1648,98.8843706924,Stroop,B-1,1STACS-3,
neutralofneutral,down,"[-0.7725490196, 0.0745098039, -1]", ,16,HALS,,,,,,,,,0,184,184,184,down,1,1.29699668533,2017_Mai_15_1648,98.8843706924,Stroop,B-1,1STACS-3,
neutral,left,"[0.568627451, -0.7882352941, -0.7882352941]", ,12,SOLL,,,,,,,,,0,185,185,185,left,1,0.606123683317,2017_Mai_15_1648,98.8843706924,Stroop,B-1,1STACS-3,
neutral,down,"[-0.7725490196, 0.0745098039, -1]", ,13,SOLL,,,,,,,,,0,186,186,186,down,1,0.499546450736,2017_Mai_15_1648,98.8843706924,Stroop,B-1,1STACS-3,
neutralofneutral,right,"[-0.8745098039, -0.2078431373, 0.637254902]", ,20,MODE,,,,,,,,,0,187,187,187,right,1,0.529167813229,2017_Mai_15_1648,98.8843706924,Stroop,B-1,1STACS-3,
neutral,right,"[-0.8745098039, -0.2078431373, 0.637254902]", ,14,SOLL,,,,,,,,,0,188,188,188,right,1,0.53176562943,2017_Mai_15_1648,98.8843706924,Stroop,B-1,1STACS-3,
neutralofneutral,left,"[0.568627451, -0.7882352941, -0.7882352941]", ,18,MODE,,,,,,,,,0,189,189,189,left,1,0.744555243753,2017_Mai_15_1648,98.8843706924,Stroop,B-1,1STACS-3,
neutral,right,"[-0.8745098039, -0.2078431373, 0.637254902]", ,11,PECH,,,,,,,,,0,190,190,190,right,1,0.576895108177,2017_Mai_15_1648,98.8843706924,Stroop,B-1,1STACS-3,
neutralofneutral,right,"[-0.8745098039, -0.2078431373, 0.637254902]", ,17,HALS,,,,,,,,,0,191,191,191,right,1,0.464070712898,2017_Mai_15_1648,98.8843706924,Stroop,B-1,1STACS-3,
neutralofneutral,left,"[0.568627451, -0.7882352941, -0.7882352941]", ,15,HALS,,,,,,,,,0,192,192,192,left,1,0.72298350768,2017_Mai_15_1648,98.8843706924,Stroop,B-1,1STACS-3,
neutralofneutral,down,"[-0.7725490196, 0.0745098039, -1]", ,19,MODE,,,,,,,,,0,193,193,193,down,1,0.83462982027,2017_Mai_15_1648,98.8843706924,Stroop,B-1,1STACS-3,
neutral,left,"[0.568627451, -0.7882352941, -0.7882352941]", ,9,PECH,,,,,,,,,0,194,194,194,left,1,0.566711132282,2017_Mai_15_1648,98.8843706924,Stroop,B-1,1STACS-3,
neutral,down,"[-0.7725490196, 0.0745098039, -1]", ,10,PECH,,,,,,,,,0,195,195,195,down,1,0.406389918271,2017_Mai_15_1648,98.8843706924,Stroop,B-1,1STACS-3,
fix,return,white, ,21,+,,,,,,,,,0,196,196,196,None,0,,2017_Mai_15_1648,98.8843706924,Stroop,B-1,1STACS-3,
fix,return,white, ,21,+,,,,,,,,,0,197,197,197,None,0,,2017_Mai_15_1648,98.8843706924,Stroop,B-1,1STACS-3,
fix,return,white, ,21,+,,,,,,,,,0,198,198,198,None,0,,2017_Mai_15_1648,98.8843706924,Stroop,B-1,1STACS-3,
fix,return,white, ,21,+,,,,,,,,,0,199,199,199,None,0,,2017_Mai_15_1648,98.8843706924,Stroop,B-1,1STACS-3,
fix,return,white, ,21,+,,,,,,,,,0,200,200,200,None,0,,2017_Mai_15_1648,98.8843706924,Stroop,B-1,1STACS-3,
fix,return,white, ,21,+,,,,,,,,,0,201,201,201,None,0,,2017_Mai_15_1648,98.8843706924,Stroop,B-1,1STACS-3,
fix,return,white, ,21,+,,,,,,,,,0,202,202,202,None,0,,2017_Mai_15_1648,98.8843706924,Stroop,B-1,1STACS-3,
fix,return,white, ,21,+,,,,,,,,,0,203,203,203,None,0,,2017_Mai_15_1648,98.8843706924,Stroop,B-1,1STACS-3,
fix,return,white, ,21,+,,,,,,,,,0,204,204,204,None,0,,2017_Mai_15_1648,98.8843706924,Stroop,B-1,1STACS-3,
fix,return,white, ,21,+,,,,,,,,,0,205,205,205,None,0,,2017_Mai_15_1648,98.8843706924,Stroop,B-1,1STACS-3,
fix,return,white, ,21,+,,,,,,,,,0,206,206,206,None,0,,2017_Mai_15_1648,98.8843706924,Stroop,B-1,1STACS-3,
fix,return,white, ,21,+,,,,,,,,,0,207,207,207,None,0,,2017_Mai_15_1648,98.8843706924,Stroop,B-1,1STACS-3,
fix,return,white,+,22,+,,,,,,,,,0,208,208,208,None,0,,2017_Mai_15_1648,98.8843706924,Stroop,B-1,1STACS-3,
neutral,down,"[-0.7725490196, 0.0745098039, -1]", ,10,PECH,,,,,,,,,0,209,209,209,down,1,0.682799629561,2017_Mai_15_1648,98.8843706924,Stroop,B-1,1STACS-3,
neutralofneutral,left,"[0.568627451, -0.7882352941, -0.7882352941]", ,15,HALS,,,,,,,,,0,210,210,210,left,1,0.571034866163,2017_Mai_15_1648,98.8843706924,Stroop,B-1,1STACS-3,
neutral,right,"[-0.8745098039, -0.2078431373, 0.637254902]", ,14,SOLL,,,,,,,,,0,211,211,211,right,1,0.405300114959,2017_Mai_15_1648,98.8843706924,Stroop,B-1,1STACS-3,
neutral,left,"[0.568627451, -0.7882352941, -0.7882352941]", ,12,SOLL,,,,,,,,,0,212,212,212,left,1,0.629388371986,2017_Mai_15_1648,98.8843706924,Stroop,B-1,1STACS-3,
neutralofneutral,down,"[-0.7725490196, 0.0745098039, -1]", ,19,MODE,,,,,,,,,0,213,213,213,down,1,0.594799339024,2017_Mai_15_1648,98.8843706924,Stroop,B-1,1STACS-3,
neutral,down,"[-0.7725490196, 0.0745098039, -1]", ,13,SOLL,,,,,,,,,0,214,214,214,down,1,0.361637303065,2017_Mai_15_1648,98.8843706924,Stroop,B-1,1STACS-3,
neutralofneutral,right,"[-0.8745098039, -0.2078431373, 0.637254902]", ,20,MODE,,,,,,,,,0,215,215,215,right,1,0.614733436792,2017_Mai_15_1648,98.8843706924,Stroop,B-1,1STACS-3,
neutral,right,"[-0.8745098039, -0.2078431373, 0.637254902]", ,11,PECH,,,,,,,,,0,216,216,216,right,1,0.446988653586,2017_Mai_15_1648,98.8843706924,Stroop,B-1,1STACS-3,
neutralofneutral,right,"[-0.8745098039, -0.2078431373, 0.637254902]", ,17,HALS,,,,,,,,,0,217,217,217,right,1,0.408490743936,2017_Mai_15_1648,98.8843706924,Stroop,B-1,1STACS-3,
neutralofneutral,down,"[-0.7725490196, 0.0745098039, -1]", ,16,HALS,,,,,,,,,0,218,218,218,down,1,0.637542201594,2017_Mai_15_1648,98.8843706924,Stroop,B-1,1STACS-3,
neutral,left,"[0.568627451, -0.7882352941, -0.7882352941]", ,9,PECH,,,,,,,,,0,219,219,219,left,1,0.630280664162,2017_Mai_15_1648,98.8843706924,Stroop,B-1,1STACS-3,
neutralofneutral,left,"[0.568627451, -0.7882352941, -0.7882352941]", ,18,MODE,,,,,,,,,0,220,220,220,left,1,0.639511166923,2017_Mai_15_1648,98.8843706924,Stroop,B-1,1STACS-3,
neutral,left,"[0.568627451, -0.7882352941, -0.7882352941]", ,9,PECH,,,,,,,,,0,221,221,221,left,1,0.608848051917,2017_Mai_15_1648,98.8843706924,Stroop,B-1,1STACS-3,
incongruent,left,"[0.568627451, -0.7882352941, -0.7882352941]", ,6,BLAU,,,,,,,,,0,222,222,222,left,1,0.948800196673,2017_Mai_15_1648,98.8843706924,Stroop,B-1,1STACS-3,
neutral,down,"[-0.7725490196, 0.0745098039, -1]", ,13,SOLL,,,,,,,,,0,223,223,223,down,1,0.630412803863,2017_Mai_15_1648,98.8843706924,Stroop,B-1,1STACS-3,
neutral,left,"[0.568627451, -0.7882352941, -0.7882352941]", ,12,SOLL,,,,,,,,,0,224,224,224,left,1,0.68445877898,2017_Mai_15_1648,98.8843706924,Stroop,B-1,1STACS-3,
neutral,right,"[-0.8745098039, -0.2078431373, 0.637254902]", ,14,SOLL,,,,,,,,,0,225,225,225,right,1,0.672368694904,2017_Mai_15_1648,98.8843706924,Stroop,B-1,1STACS-3,
incongruent,left,"[0.568627451, -0.7882352941, -0.7882352941]", ,3,GRÜN,,,,,,,,,0,226,226,226,left,1,1.2354519918,2017_Mai_15_1648,98.8843706924,Stroop,B-1,1STACS-3,
incongruent,down,"[-0.7725490196, 0.0745098039, -1]", ,7,BLAU,,,,,,,,,0,227,227,227,down,1,0.442631116524,2017_Mai_15_1648,98.8843706924,Stroop,B-1,1STACS-3,
incongruent,down,"[-0.7725490196, 0.0745098039, -1]", ,1,ROT,,,,,,,,,0,228,228,228,down,1,0.46204280153,2017_Mai_15_1648,98.8843706924,Stroop,B-1,1STACS-3,
incongruent,right,"[-0.8745098039, -0.2078431373, 0.637254902]", ,5,GRÜN,,,,,,,,,0,229,229,229,right,1,0.776420187482,2017_Mai_15_1648,98.8843706924,Stroop,B-1,1STACS-3,
neutral,right,"[-0.8745098039, -0.2078431373, 0.637254902]", ,11,PECH,,,,,,,,,0,230,230,230,right,1,0.67014438986,2017_Mai_15_1648,98.8843706924,Stroop,B-1,1STACS-3,
incongruent,right,"[-0.8745098039, -0.2078431373, 0.637254902]", ,2,ROT,,,,,,,,,0,231,231,231,right,1,0.459950915551,2017_Mai_15_1648,98.8843706924,Stroop,B-1,1STACS-3,
neutral,down,"[-0.7725490196, 0.0745098039, -1]", ,10,PECH,,,,,,,,,0,232,232,232,down,1,0.777365838396,2017_Mai_15_1648,98.8843706924,Stroop,B-1,1STACS-3,
neutral,left,"[0.568627451, -0.7882352941, -0.7882352941]", ,9,PECH,,,,,,,,,0,233,233,233,left,1,0.606893613573,2017_Mai_15_1648,98.8843706924,Stroop,B-1,1STACS-3,
congruent,down,"[-0.7725490196, 0.0745098039, -1]", ,4,GRÜN,,,,,,,,,0,234,234,234,down,1,1.09583312963,2017_Mai_15_1648,98.8843706924,Stroop,B-1,1STACS-3,
neutral,down,"[-0.7725490196, 0.0745098039, -1]", ,13,SOLL,,,,,,,,,0,235,235,235,down,1,0.43720724282,2017_Mai_15_1648,98.8843706924,Stroop,B-1,1STACS-3,
congruent,left,"[0.568627451, -0.7882352941, -0.7882352941]", ,0,ROT,,,,,,,,,0,236,236,236,left,1,0.578228238504,2017_Mai_15_1648,98.8843706924,Stroop,B-1,1STACS-3,
neutral,right,"[-0.8745098039, -0.2078431373, 0.637254902]", ,11,PECH,,,,,,,,,0,237,237,237,right,1,0.51190081421,2017_Mai_15_1648,98.8843706924,Stroop,B-1,1STACS-3,
neutral,left,"[0.568627451, -0.7882352941, -0.7882352941]", ,12,SOLL,,,,,,,,,0,238,238,238,left,1,0.874379565001,2017_Mai_15_1648,98.8843706924,Stroop,B-1,1STACS-3,
congruent,down,"[-0.7725490196, 0.0745098039, -1]", ,4,GRÜN,,,,,,,,,0,239,239,239,down,1,0.853595638551,2017_Mai_15_1648,98.8843706924,Stroop,B-1,1STACS-3,
congruent,right,"[-0.8745098039, -0.2078431373, 0.637254902]", ,8,BLAU,,,,,,,,,0,240,240,240,right,1,0.53887742716,2017_Mai_15_1648,98.8843706924,Stroop,B-1,1STACS-3,
congruent,right,"[-0.8745098039, -0.2078431373, 0.637254902]", ,8,BLAU,,,,,,,,,0,241,241,241,right,1,0.44181704658,2017_Mai_15_1648,98.8843706924,Stroop,B-1,1STACS-3,
neutral,right,"[-0.8745098039, -0.2078431373, 0.637254902]", ,14,SOLL,,,,,,,,,0,242,242,242,right,1,0.436518328448,2017_Mai_15_1648,98.8843706924,Stroop,B-1,1STACS-3,
neutral,down,"[-0.7725490196, 0.0745098039, -1]", ,10,PECH,,,,,,,,,0,243,243,243,down,1,0.904406845004,2017_Mai_15_1648,98.8843706924,Stroop,B-1,1STACS-3,
congruent,left,"[0.568627451, -0.7882352941, -0.7882352941]", ,0,ROT,,,,,,,,,0,244,244,244,left,1,0.608984940824,2017_Mai_15_1648,98.8843706924,Stroop,B-1,1STACS-3,
fix,return,white, ,21,+,,,,,,,,,0,245,245,245,None,0,,2017_Mai_15_1648,98.8843706924,Stroop,B-1,1STACS-3,
fix,return,white, ,21,+,,,,,,,,,0,246,246,246,None,0,,2017_Mai_15_1648,98.8843706924,Stroop,B-1,1STACS-3,
fix,return,white, ,21,+,,,,,,,,,0,247,247,247,None,0,,2017_Mai_15_1648,98.8843706924,Stroop,B-1,1STACS-3,
fix,return,white, ,21,+,,,,,,,,,0,248,248,248,None,0,,2017_Mai_15_1648,98.8843706924,Stroop,B-1,1STACS-3,
fix,return,white, ,21,+,,,,,,,,,0,249,249,249,None,0,,2017_Mai_15_1648,98.8843706924,Stroop,B-1,1STACS-3,
fix,return,white, ,21,+,,,,,,,,,0,250,250,250,None,0,,2017_Mai_15_1648,98.8843706924,Stroop,B-1,1STACS-3,
fix,return,white, ,21,+,,,,,,,,,0,251,251,251,None,0,,2017_Mai_15_1648,98.8843706924,Stroop,B-1,1STACS-3,
fix,return,white, ,21,+,,,,,,,,,0,252,252,252,None,0,,2017_Mai_15_1648,98.8843706924,Stroop,B-1,1STACS-3,
fix,return,white, ,21,+,,,,,,,,,0,253,253,253,None,0,,2017_Mai_15_1648,98.8843706924,Stroop,B-1,1STACS-3,
fix,return,white, ,21,+,,,,,,,,,0,254,254,254,None,0,,2017_Mai_15_1648,98.8843706924,Stroop,B-1,1STACS-3,
fix,return,white, ,21,+,,,,,,,,,0,255,255,255,None,0,,2017_Mai_15_1648,98.8843706924,Stroop,B-1,1STACS-3,
fix,return,white, ,21,+,,,,,,,,,0,256,256,256,None,0,,2017_Mai_15_1648,98.8843706924,Stroop,B-1,1STACS-3,
fix,return,white,+,22,+,,,,,,,,,0,257,257,257,None,0,,2017_Mai_15_1648,98.8843706924,Stroop,B-1,1STACS-3,
neutral,down,"[-0.7725490196, 0.0745098039, -1]", ,13,SOLL,,,,,,,,,0,258,258,258,down,1,0.882717775583,2017_Mai_15_1648,98.8843706924,Stroop,B-1,1STACS-3,
neutralofneutral,down,"[-0.7725490196, 0.0745098039, -1]", ,16,HALS,,,,,,,,,0,259,259,259,down,1,0.397428723483,2017_Mai_15_1648,98.8843706924,Stroop,B-1,1STACS-3,
neutral,left,"[0.568627451, -0.7882352941, -0.7882352941]", ,9,PECH,,,,,,,,,0,260,260,260,left,1,0.619965666026,2017_Mai_15_1648,98.8843706924,Stroop,B-1,1STACS-3,
neutral,right,"[-0.8745098039, -0.2078431373, 0.637254902]", ,11,PECH,,,,,,,,,0,261,261,261,right,1,0.500244025428,2017_Mai_15_1648,98.8843706924,Stroop,B-1,1STACS-3,
neutral,down,"[-0.7725490196, 0.0745098039, -1]", ,10,PECH,,,,,,,,,0,262,262,262,down,1,0.779029737019,2017_Mai_15_1648,98.8843706924,Stroop,B-1,1STACS-3,
neutralofneutral,left,"[0.568627451, -0.7882352941, -0.7882352941]", ,18,MODE,,,,,,,,,0,263,263,263,left,1,0.541880881508,2017_Mai_15_1648,98.8843706924,Stroop,B-1,1STACS-3,
neutralofneutral,left,"[0.568627451, -0.7882352941, -0.7882352941]", ,15,HALS,,,,,,,,,0,264,264,264,left,1,0.399068876071,2017_Mai_15_1648,98.8843706924,Stroop,B-1,1STACS-3,
neutralofneutral,right,"[-0.8745098039, -0.2078431373, 0.637254902]", ,17,HALS,,,,,,,,,0,265,265,265,right,1,0.732673845419,2017_Mai_15_1648,98.8843706924,Stroop,B-1,1STACS-3,
neutral,right,"[-0.8745098039, -0.2078431373, 0.637254902]", ,14,SOLL,,,,,,,,,0,266,266,266,right,1,0.42762222573,2017_Mai_15_1648,98.8843706924,Stroop,B-1,1STACS-3,
neutralofneutral,down,"[-0.7725490196, 0.0745098039, -1]", ,19,MODE,,,,,,,,,0,267,267,267,down,1,0.716290757626,2017_Mai_15_1648,98.8843706924,Stroop,B-1,1STACS-3,
neutralofneutral,right,"[-0.8745098039, -0.2078431373, 0.637254902]", ,20,MODE,,,,,,,,,0,268,268,268,right,1,0.531821502453,2017_Mai_15_1648,98.8843706924,Stroop,B-1,1STACS-3,
neutral,left,"[0.568627451, -0.7882352941, -0.7882352941]", ,12,SOLL,,,,,,,,,0,269,269,269,left,1,0.716540230671,2017_Mai_15_1648,98.8843706924,Stroop,B-1,1STACS-3,
congruent,right,"[-0.8745098039, -0.2078431373, 0.637254902]", ,8,BLAU,,,,,,,,,0,270,270,270,right,1,0.626457552566,2017_Mai_15_1648,98.8843706924,Stroop,B-1,1STACS-3,
congruent,left,"[0.568627451, -0.7882352941, -0.7882352941]", ,0,ROT,,,,,,,,,0,271,271,271,left,1,0.620396447035,2017_Mai_15_1648,98.8843706924,Stroop,B-1,1STACS-3,
congruent,right,"[-0.8745098039, -0.2078431373, 0.637254902]", ,8,BLAU,,,,,,,,,0,272,272,272,right,1,0.60184492722,2017_Mai_15_1648,98.8843706924,Stroop,B-1,1STACS-3,
congruent,down,"[-0.7725490196, 0.0745098039, -1]", ,4,GRÜN,,,,,,,,,0,273,273,273,down,1,0.436800487214,2017_Mai_15_1648,98.8843706924,Stroop,B-1,1STACS-3,
neutral,right,"[-0.8745098039, -0.2078431373, 0.637254902]", ,11,PECH,,,,,,,,,0,274,274,274,right,1,0.510426883864,2017_Mai_15_1648,98.8843706924,Stroop,B-1,1STACS-3,
neutral,down,"[-0.7725490196, 0.0745098039, -1]", ,10,PECH,,,,,,,,,0,275,275,275,down,1,0.681965445328,2017_Mai_15_1648,98.8843706924,Stroop,B-1,1STACS-3,
neutral,right,"[-0.8745098039, -0.2078431373, 0.637254902]", ,14,SOLL,,,,,,,,,0,276,276,276,right,1,0.576133000144,2017_Mai_15_1648,98.8843706924,Stroop,B-1,1STACS-3,
neutral,left,"[0.568627451, -0.7882352941, -0.7882352941]", ,12,SOLL,,,,,,,,,0,277,277,277,left,1,0.695220481934,2017_Mai_15_1648,98.8843706924,Stroop,B-1,1STACS-3,
neutral,left,"[0.568627451, -0.7882352941, -0.7882352941]", ,9,PECH,,,,,,,,,0,278,278,278,left,1,0.502340101884,2017_Mai_15_1648,98.8843706924,Stroop,B-1,1STACS-3,
congruent,left,"[0.568627451, -0.7882352941, -0.7882352941]", ,0,ROT,,,,,,,,,0,279,279,279,left,1,0.418460446788,2017_Mai_15_1648,98.8843706924,Stroop,B-1,1STACS-3,
congruent,down,"[-0.7725490196, 0.0745098039, -1]", ,4,GRÜN,,,,,,,,,0,280,280,280,down,1,0.545159231131,2017_Mai_15_1648,98.8843706924,Stroop,B-1,1STACS-3,
neutral,down,"[-0.7725490196, 0.0745098039, -1]", ,13,SOLL,,,,,,,,,0,281,281,281,down,1,0.534186048786,2017_Mai_15_1648,98.8843706924,Stroop,B-1,1STACS-3,
incongruent,right,"[-0.8745098039, -0.2078431373, 0.637254902]", ,5,GRÜN,,,,,,,,,0,282,282,282,right,1,0.545006977145,2017_Mai_15_1648,98.8843706924,Stroop,B-1,1STACS-3,
neutral,down,"[-0.7725490196, 0.0745098039, -1]", ,10,PECH,,,,,,,,,0,283,283,283,down,1,1.12008146287,2017_Mai_15_1648,98.8843706924,Stroop,B-1,1STACS-3,
neutral,down,"[-0.7725490196, 0.0745098039, -1]", ,13,SOLL,,,,,,,,,0,284,284,284,down,1,0.458145658178,2017_Mai_15_1648,98.8843706924,Stroop,B-1,1STACS-3,
incongruent,left,"[0.568627451, -0.7882352941, -0.7882352941]", ,3,GRÜN,,,,,,,,,0,285,285,285,left,1,0.86235149998,2017_Mai_15_1648,98.8843706924,Stroop,B-1,1STACS-3,
neutral,left,"[0.568627451, -0.7882352941, -0.7882352941]", ,12,SOLL,,,,,,,,,0,286,286,286,left,1,0.511166363323,2017_Mai_15_1648,98.8843706924,Stroop,B-1,1STACS-3,
neutral,right,"[-0.8745098039, -0.2078431373, 0.637254902]", ,14,SOLL,,,,,,,,,0,287,287,287,right,1,0.552714660662,2017_Mai_15_1648,98.8843706924,Stroop,B-1,1STACS-3,
incongruent,down,"[-0.7725490196, 0.0745098039, -1]", ,7,BLAU,,,,,,,,,0,288,288,288,down,1,0.601654679574,2017_Mai_15_1648,98.8843706924,Stroop,B-1,1STACS-3,
incongruent,left,"[0.568627451, -0.7882352941, -0.7882352941]", ,6,BLAU,,,,,,,,,0,289,289,289,left,1,0.923745056984,2017_Mai_15_1648,98.8843706924,Stroop,B-1,1STACS-3,
incongruent,down,"[-0.7725490196, 0.0745098039, -1]", ,1,ROT,,,,,,,,,0,290,290,290,down,1,0.41918260561,2017_Mai_15_1648,98.8843706924,Stroop,B-1,1STACS-3,
neutral,right,"[-0.8745098039, -0.2078431373, 0.637254902]", ,11,PECH,,,,,,,,,0,291,291,291,right,1,0.470453647042,2017_Mai_15_1648,98.8843706924,Stroop,B-1,1STACS-3,
incongruent,right,"[-0.8745098039, -0.2078431373, 0.637254902]", ,2,ROT,,,,,,,,,0,292,292,292,right,1,0.354587245027,2017_Mai_15_1648,98.8843706924,Stroop,B-1,1STACS-3,
neutral,left,"[0.568627451, -0.7882352941, -0.7882352941]", ,9,PECH,,,,,,,,,0,293,293,293,left,1,0.822267075842,2017_Mai_15_1648,98.8843706924,Stroop,B-1,1STACS-3,
fix,return,white, ,21,+,,,,,,,,,0,294,294,294,None,0,,2017_Mai_15_1648,98.8843706924,Stroop,B-1,1STACS-3,
fix,return,white, ,21,+,,,,,,,,,0,295,295,295,None,0,,2017_Mai_15_1648,98.8843706924,Stroop,B-1,1STACS-3,
fix,return,white, ,21,+,,,,,,,,,0,296,296,296,None,0,,2017_Mai_15_1648,98.8843706924,Stroop,B-1,1STACS-3,
fix,return,white, ,21,+,,,,,,,,,0,297,297,297,None,0,,2017_Mai_15_1648,98.8843706924,Stroop,B-1,1STACS-3,
fix,return,white, ,21,+,,,,,,,,,0,298,298,298,None,0,,2017_Mai_15_1648,98.8843706924,Stroop,B-1,1STACS-3,
fix,return,white, ,21,+,,,,,,,,,0,299,299,299,None,0,,2017_Mai_15_1648,98.8843706924,Stroop,B-1,1STACS-3,
fix,return,white, ,21,+,,,,,,,,,0,300,300,300,None,0,,2017_Mai_15_1648,98.8843706924,Stroop,B-1,1STACS-3,
fix,return,white, ,21,+,,,,,,,,,0,301,301,301,None,0,,2017_Mai_15_1648,98.8843706924,Stroop,B-1,1STACS-3,
fix,return,white, ,21,+,,,,,,,,,0,302,302,302,None,0,,2017_Mai_15_1648,98.8843706924,Stroop,B-1,1STACS-3,
fix,return,white, ,21,+,,,,,,,,,0,303,303,303,None,0,,2017_Mai_15_1648,98.8843706924,Stroop,B-1,1STACS-3,
fix,return,white, ,21,+,,,,,,,,,0,304,304,304,None,0,,2017_Mai_15_1648,98.8843706924,Stroop,B-1,1STACS-3,
fix,return,white, ,21,+,,,,,,,,,0,305,305,305,None,0,,2017_Mai_15_1648,98.8843706924,Stroop,B-1,1STACS-3,
fix,return,white,+,22,+,,,,,,,,,0,306,306,306,None,0,,2017_Mai_15_1648,98.8843706924,Stroop,B-1,1STACS-3,
