best_paramset_1 = [83.941703553400004, 0.37330636034999998, 15.122640604000001, 4.0669584570400001, 80.573149785300004, 416.01535581399997, 200.06241620200001]
best_paramset_statistic_1 = 11.7983082883
best_paramset_2 = [83.837090512700001, 0.38819844491299998, 16.5977472348, 4.3642260048899999, 91.621765950799997, 422.96896337800001, 222.528504312]
best_paramset_statistic_2 = 12.6430219993
ID = "sdlpfc10verum"