congruent,corrAns,letterColor,signal,selectedrownumber_novariable,Anzeigetext,practice.thisRepN,practice.thisTrialN,practice.thisN,practice.thisIndex,Wrongresponse.thisRepN,Wrongresponse.thisTrialN,Wrongresponse.thisN,Wrongresponse.thisIndex,trials.thisRepN,trials.thisTrialN,trials.thisN,trials.thisIndex,resp.keys,resp.corr,resp.rt,date,frameRate,expName,session,participant,
incongruent,down,"[-0.7725490196, 0.0745098039, -1]", ,1,ROT,0,0,0,0,0,0,0,0,,,,,down,1,0.771627958302,2017_Apr_25_1018,98.7779504005,Stroop,A-1,2STRNS-5,
,,,,,,0,0,0,0,,,,,,,,,,,,2017_Apr_25_1018,98.7779504005,Stroop,A-1,2STRNS-5,
neutralofneutral,left,"[0.568627451, -0.7882352941, -0.7882352941]", ,18,MODE,1,0,1,0,0,0,0,0,,,,,right,0,0.633516829653,2017_Apr_25_1018,98.7779504005,Stroop,A-1,2STRNS-5,
,,,,,,1,0,1,0,,,,,,,,,,,,2017_Apr_25_1018,98.7779504005,Stroop,A-1,2STRNS-5,
neutralofneutral,left,"[0.568627451, -0.7882352941, -0.7882352941]", ,18,MODE,2,0,2,0,0,0,0,0,,,,,left,1,0.580032937147,2017_Apr_25_1018,98.7779504005,Stroop,A-1,2STRNS-5,
,,,,,,2,0,2,0,,,,,,,,,,,,2017_Apr_25_1018,98.7779504005,Stroop,A-1,2STRNS-5,
neutralofneutral,down,"[-0.7725490196, 0.0745098039, -1]", ,19,MODE,3,0,3,0,0,0,0,0,,,,,down,1,0.611509563366,2017_Apr_25_1018,98.7779504005,Stroop,A-1,2STRNS-5,
,,,,,,3,0,3,0,,,,,,,,,,,,2017_Apr_25_1018,98.7779504005,Stroop,A-1,2STRNS-5,
incongruent,right,"[-0.8745098039, -0.2078431373, 0.637254902]", ,2,ROT,4,0,4,0,0,0,0,0,,,,,right,1,0.458562750294,2017_Apr_25_1018,98.7779504005,Stroop,A-1,2STRNS-5,
,,,,,,4,0,4,0,,,,,,,,,,,,2017_Apr_25_1018,98.7779504005,Stroop,A-1,2STRNS-5,
neutral,left,"[0.568627451, -0.7882352941, -0.7882352941]", ,12,SOLL,5,0,5,0,0,0,0,0,,,,,left,1,0.68302563594,2017_Apr_25_1018,98.7779504005,Stroop,A-1,2STRNS-5,
,,,,,,5,0,5,0,,,,,,,,,,,,2017_Apr_25_1018,98.7779504005,Stroop,A-1,2STRNS-5,
neutral,right,"[-0.8745098039, -0.2078431373, 0.637254902]", ,14,SOLL,6,0,6,0,0,0,0,0,,,,,down,0,0.503743911587,2017_Apr_25_1018,98.7779504005,Stroop,A-1,2STRNS-5,
,,,,,,6,0,6,0,,,,,,,,,,,,2017_Apr_25_1018,98.7779504005,Stroop,A-1,2STRNS-5,
neutral,right,"[-0.8745098039, -0.2078431373, 0.637254902]", ,14,SOLL,7,0,7,0,0,0,0,0,,,,,right,1,0.407469385076,2017_Apr_25_1018,98.7779504005,Stroop,A-1,2STRNS-5,
,,,,,,7,0,7,0,,,,,,,,,,,,2017_Apr_25_1018,98.7779504005,Stroop,A-1,2STRNS-5,
incongruent,left,"[0.568627451, -0.7882352941, -0.7882352941]", ,3,GRÜN,8,0,8,0,0,0,0,0,,,,,left,1,0.719063177024,2017_Apr_25_1018,98.7779504005,Stroop,A-1,2STRNS-5,
,,,,,,8,0,8,0,,,,,,,,,,,,2017_Apr_25_1018,98.7779504005,Stroop,A-1,2STRNS-5,
neutralofneutral,right,"[-0.8745098039, -0.2078431373, 0.637254902]", ,17,HALS,9,0,9,0,0,0,0,0,,,,,right,1,0.778296403593,2017_Apr_25_1018,98.7779504005,Stroop,A-1,2STRNS-5,
,,,,,,9,0,9,0,,,,,,,,,,,,2017_Apr_25_1018,98.7779504005,Stroop,A-1,2STRNS-5,
neutral,left,"[0.568627451, -0.7882352941, -0.7882352941]", ,9,PECH,10,0,10,0,0,0,0,0,,,,,left,1,0.722099875822,2017_Apr_25_1018,98.7779504005,Stroop,A-1,2STRNS-5,
,,,,,,10,0,10,0,,,,,,,,,,,,2017_Apr_25_1018,98.7779504005,Stroop,A-1,2STRNS-5,
neutralofneutral,right,"[-0.8745098039, -0.2078431373, 0.637254902]", ,17,HALS,11,0,11,0,0,0,0,0,,,,,right,1,1.12895493701,2017_Apr_25_1018,98.7779504005,Stroop,A-1,2STRNS-5,
,,,,,,11,0,11,0,,,,,,,,,,,,2017_Apr_25_1018,98.7779504005,Stroop,A-1,2STRNS-5,
congruent,left,"[0.568627451, -0.7882352941, -0.7882352941]", ,0,ROT,12,0,12,0,0,0,0,0,,,,,left,1,0.619513932637,2017_Apr_25_1018,98.7779504005,Stroop,A-1,2STRNS-5,
,,,,,,12,0,12,0,,,,,,,,,,,,2017_Apr_25_1018,98.7779504005,Stroop,A-1,2STRNS-5,
incongruent,left,"[0.568627451, -0.7882352941, -0.7882352941]", ,6,BLAU,13,0,13,0,0,0,0,0,,,,,left,1,0.534126823381,2017_Apr_25_1018,98.7779504005,Stroop,A-1,2STRNS-5,
,,,,,,13,0,13,0,,,,,,,,,,,,2017_Apr_25_1018,98.7779504005,Stroop,A-1,2STRNS-5,
neutral,right,"[-0.8745098039, -0.2078431373, 0.637254902]", ,14,SOLL,14,0,14,0,0,0,0,0,,,,,right,1,0.714805373309,2017_Apr_25_1018,98.7779504005,Stroop,A-1,2STRNS-5,
,,,,,,14,0,14,0,,,,,,,,,,,,2017_Apr_25_1018,98.7779504005,Stroop,A-1,2STRNS-5,
incongruent,right,"[-0.8745098039, -0.2078431373, 0.637254902]", ,5,GRÜN,15,0,15,0,0,0,0,0,,,,,right,1,0.565789786132,2017_Apr_25_1018,98.7779504005,Stroop,A-1,2STRNS-5,
,,,,,,15,0,15,0,,,,,,,,,,,,2017_Apr_25_1018,98.7779504005,Stroop,A-1,2STRNS-5,
neutral,down,"[-0.7725490196, 0.0745098039, -1]", ,13,SOLL,16,0,16,0,0,0,0,0,,,,,down,1,0.779734016474,2017_Apr_25_1018,98.7779504005,Stroop,A-1,2STRNS-5,
,,,,,,16,0,16,0,,,,,,,,,,,,2017_Apr_25_1018,98.7779504005,Stroop,A-1,2STRNS-5,
neutral,left,"[0.568627451, -0.7882352941, -0.7882352941]", ,9,PECH,17,0,17,0,0,0,0,0,,,,,left,1,0.633214277233,2017_Apr_25_1018,98.7779504005,Stroop,A-1,2STRNS-5,
,,,,,,17,0,17,0,,,,,,,,,,,,2017_Apr_25_1018,98.7779504005,Stroop,A-1,2STRNS-5,
neutral,right,"[-0.8745098039, -0.2078431373, 0.637254902]", ,11,PECH,18,0,18,0,0,0,0,0,,,,,right,1,1.17901437194,2017_Apr_25_1018,98.7779504005,Stroop,A-1,2STRNS-5,
,,,,,,18,0,18,0,,,,,,,,,,,,2017_Apr_25_1018,98.7779504005,Stroop,A-1,2STRNS-5,
incongruent,left,"[0.568627451, -0.7882352941, -0.7882352941]", ,6,BLAU,19,0,19,0,0,0,0,0,,,,,left,1,0.598628596651,2017_Apr_25_1018,98.7779504005,Stroop,A-1,2STRNS-5,
,,,,,,19,0,19,0,,,,,,,,,,,,2017_Apr_25_1018,98.7779504005,Stroop,A-1,2STRNS-5,
neutralofneutral,down,"[-0.7725490196, 0.0745098039, -1]", ,16,HALS,20,0,20,0,0,0,0,0,,,,,down,1,0.552343105059,2017_Apr_25_1018,98.7779504005,Stroop,A-1,2STRNS-5,
,,,,,,20,0,20,0,,,,,,,,,,,,2017_Apr_25_1018,98.7779504005,Stroop,A-1,2STRNS-5,
incongruent,right,"[-0.8745098039, -0.2078431373, 0.637254902]", ,2,ROT,21,0,21,0,0,0,0,0,,,,,right,1,0.874877952366,2017_Apr_25_1018,98.7779504005,Stroop,A-1,2STRNS-5,
,,,,,,21,0,21,0,,,,,,,,,,,,2017_Apr_25_1018,98.7779504005,Stroop,A-1,2STRNS-5,
neutralofneutral,down,"[-0.7725490196, 0.0745098039, -1]", ,16,HALS,22,0,22,0,0,0,0,0,,,,,down,1,0.765076008264,2017_Apr_25_1018,98.7779504005,Stroop,A-1,2STRNS-5,
,,,,,,22,0,22,0,,,,,,,,,,,,2017_Apr_25_1018,98.7779504005,Stroop,A-1,2STRNS-5,
neutral,down,"[-0.7725490196, 0.0745098039, -1]", ,10,PECH,23,0,23,0,0,0,0,0,,,,,right,0,0.708595366171,2017_Apr_25_1018,98.7779504005,Stroop,A-1,2STRNS-5,
,,,,,,23,0,23,0,,,,,,,,,,,,2017_Apr_25_1018,98.7779504005,Stroop,A-1,2STRNS-5,
neutral,down,"[-0.7725490196, 0.0745098039, -1]", ,10,PECH,24,0,24,0,0,0,0,0,,,,,down,1,0.0218823900805,2017_Apr_25_1018,98.7779504005,Stroop,A-1,2STRNS-5,
,,,,,,24,0,24,0,,,,,,,,,,,,2017_Apr_25_1018,98.7779504005,Stroop,A-1,2STRNS-5,
neutralofneutral,right,"[-0.8745098039, -0.2078431373, 0.637254902]", ,17,HALS,25,0,25,0,0,0,0,0,,,,,right,1,0.775348822266,2017_Apr_25_1018,98.7779504005,Stroop,A-1,2STRNS-5,
,,,,,,25,0,25,0,,,,,,,,,,,,2017_Apr_25_1018,98.7779504005,Stroop,A-1,2STRNS-5,
neutral,left,"[0.568627451, -0.7882352941, -0.7882352941]", ,9,PECH,26,0,26,0,0,0,0,0,,,,,left,1,0.594173002435,2017_Apr_25_1018,98.7779504005,Stroop,A-1,2STRNS-5,
,,,,,,26,0,26,0,,,,,,,,,,,,2017_Apr_25_1018,98.7779504005,Stroop,A-1,2STRNS-5,
congruent,right,"[-0.8745098039, -0.2078431373, 0.637254902]", ,8,BLAU,27,0,27,0,0,0,0,0,,,,,right,1,0.762347728552,2017_Apr_25_1018,98.7779504005,Stroop,A-1,2STRNS-5,
,,,,,,27,0,27,0,,,,,,,,,,,,2017_Apr_25_1018,98.7779504005,Stroop,A-1,2STRNS-5,
incongruent,down,"[-0.7725490196, 0.0745098039, -1]", ,7,BLAU,28,0,28,0,0,0,0,0,,,,,down,1,0.546755802763,2017_Apr_25_1018,98.7779504005,Stroop,A-1,2STRNS-5,
,,,,,,28,0,28,0,,,,,,,,,,,,2017_Apr_25_1018,98.7779504005,Stroop,A-1,2STRNS-5,
congruent,down,"[-0.7725490196, 0.0745098039, -1]", ,4,GRÜN,29,0,29,0,0,0,0,0,,,,,down,1,0.997303009181,2017_Apr_25_1018,98.7779504005,Stroop,A-1,2STRNS-5,
,,,,,,29,0,29,0,,,,,,,,,,,,2017_Apr_25_1018,98.7779504005,Stroop,A-1,2STRNS-5,
incongruent,left,"[0.568627451, -0.7882352941, -0.7882352941]", ,6,BLAU,30,0,30,0,0,0,0,0,,,,,left,1,0.773458637899,2017_Apr_25_1018,98.7779504005,Stroop,A-1,2STRNS-5,
,,,,,,30,0,30,0,,,,,,,,,,,,2017_Apr_25_1018,98.7779504005,Stroop,A-1,2STRNS-5,
congruent,left,"[0.568627451, -0.7882352941, -0.7882352941]", ,0,ROT,31,0,31,0,0,0,0,0,,,,,left,1,0.728547622673,2017_Apr_25_1018,98.7779504005,Stroop,A-1,2STRNS-5,
,,,,,,31,0,31,0,,,,,,,,,,,,2017_Apr_25_1018,98.7779504005,Stroop,A-1,2STRNS-5,
neutralofneutral,right,"[-0.8745098039, -0.2078431373, 0.637254902]", ,20,MODE,32,0,32,0,0,0,0,0,,,,,right,1,0.770793494704,2017_Apr_25_1018,98.7779504005,Stroop,A-1,2STRNS-5,
,,,,,,32,0,32,0,,,,,,,,,,,,2017_Apr_25_1018,98.7779504005,Stroop,A-1,2STRNS-5,
neutral,right,"[-0.8745098039, -0.2078431373, 0.637254902]", ,14,SOLL,33,0,33,0,0,0,0,0,,,,,right,1,0.586890791986,2017_Apr_25_1018,98.7779504005,Stroop,A-1,2STRNS-5,
,,,,,,33,0,33,0,,,,,,,,,,,,2017_Apr_25_1018,98.7779504005,Stroop,A-1,2STRNS-5,
neutral,left,"[0.568627451, -0.7882352941, -0.7882352941]", ,9,PECH,34,0,34,0,0,0,0,0,,,,,left,1,0.665077265407,2017_Apr_25_1018,98.7779504005,Stroop,A-1,2STRNS-5,
,,,,,,34,0,34,0,,,,,,,,,,,,2017_Apr_25_1018,98.7779504005,Stroop,A-1,2STRNS-5,
incongruent,left,"[0.568627451, -0.7882352941, -0.7882352941]", ,6,BLAU,35,0,35,0,0,0,0,0,,,,,left,1,0.619542148513,2017_Apr_25_1018,98.7779504005,Stroop,A-1,2STRNS-5,
,,,,,,35,0,35,0,,,,,,,,,,,,2017_Apr_25_1018,98.7779504005,Stroop,A-1,2STRNS-5,
congruent,right,"[-0.8745098039, -0.2078431373, 0.637254902]", ,8,BLAU,36,0,36,0,0,0,0,0,,,,,right,1,0.772829228296,2017_Apr_25_1018,98.7779504005,Stroop,A-1,2STRNS-5,
,,,,,,36,0,36,0,,,,,,,,,,,,2017_Apr_25_1018,98.7779504005,Stroop,A-1,2STRNS-5,
neutralofneutral,right,"[-0.8745098039, -0.2078431373, 0.637254902]", ,20,MODE,37,0,37,0,0,0,0,0,,,,,right,1,0.61240548729,2017_Apr_25_1018,98.7779504005,Stroop,A-1,2STRNS-5,
,,,,,,37,0,37,0,,,,,,,,,,,,2017_Apr_25_1018,98.7779504005,Stroop,A-1,2STRNS-5,
incongruent,down,"[-0.7725490196, 0.0745098039, -1]", ,1,ROT,38,0,38,0,0,0,0,0,,,,,down,1,0.591117027443,2017_Apr_25_1018,98.7779504005,Stroop,A-1,2STRNS-5,
,,,,,,38,0,38,0,,,,,,,,,,,,2017_Apr_25_1018,98.7779504005,Stroop,A-1,2STRNS-5,
neutral,right,"[-0.8745098039, -0.2078431373, 0.637254902]", ,11,PECH,39,0,39,0,0,0,0,0,,,,,right,1,0.980463997519,2017_Apr_25_1018,98.7779504005,Stroop,A-1,2STRNS-5,
,,,,,,39,0,39,0,,,,,,,,,,,,2017_Apr_25_1018,98.7779504005,Stroop,A-1,2STRNS-5,
neutralofneutral,left,"[0.568627451, -0.7882352941, -0.7882352941]", ,15,HALS,40,0,40,0,0,0,0,0,,,,,left,1,0.682794880355,2017_Apr_25_1018,98.7779504005,Stroop,A-1,2STRNS-5,
,,,,,,40,0,40,0,,,,,,,,,,,,2017_Apr_25_1018,98.7779504005,Stroop,A-1,2STRNS-5,
neutral,right,"[-0.8745098039, -0.2078431373, 0.637254902]", ,14,SOLL,41,0,41,0,0,0,0,0,,,,,down,0,0.690356455918,2017_Apr_25_1018,98.7779504005,Stroop,A-1,2STRNS-5,
,,,,,,41,0,41,0,,,,,,,,,,,,2017_Apr_25_1018,98.7779504005,Stroop,A-1,2STRNS-5,
neutral,right,"[-0.8745098039, -0.2078431373, 0.637254902]", ,14,SOLL,42,0,42,0,0,0,0,0,,,,,right,1,0.0432406912053,2017_Apr_25_1018,98.7779504005,Stroop,A-1,2STRNS-5,
,,,,,,42,0,42,0,,,,,,,,,,,,2017_Apr_25_1018,98.7779504005,Stroop,A-1,2STRNS-5,
neutral,down,"[-0.7725490196, 0.0745098039, -1]", ,13,SOLL,43,0,43,0,0,0,0,0,,,,,down,1,0.760536045782,2017_Apr_25_1018,98.7779504005,Stroop,A-1,2STRNS-5,
,,,,,,43,0,43,0,,,,,,,,,,,,2017_Apr_25_1018,98.7779504005,Stroop,A-1,2STRNS-5,
incongruent,left,"[0.568627451, -0.7882352941, -0.7882352941]", ,6,BLAU,44,0,44,0,0,0,0,0,,,,,left,1,0.751702800216,2017_Apr_25_1018,98.7779504005,Stroop,A-1,2STRNS-5,
,,,,,,44,0,44,0,,,,,,,,,,,,2017_Apr_25_1018,98.7779504005,Stroop,A-1,2STRNS-5,
congruent,left,"[0.568627451, -0.7882352941, -0.7882352941]", ,0,ROT,45,0,45,0,0,0,0,0,,,,,left,1,0.672597215568,2017_Apr_25_1018,98.7779504005,Stroop,A-1,2STRNS-5,
,,,,,,45,0,45,0,,,,,,,,,,,,2017_Apr_25_1018,98.7779504005,Stroop,A-1,2STRNS-5,
congruent,right,"[-0.8745098039, -0.2078431373, 0.637254902]", ,8,BLAU,46,0,46,0,0,0,0,0,,,,,right,1,0.812257703144,2017_Apr_25_1018,98.7779504005,Stroop,A-1,2STRNS-5,
,,,,,,46,0,46,0,,,,,,,,,,,,2017_Apr_25_1018,98.7779504005,Stroop,A-1,2STRNS-5,
congruent,left,"[0.568627451, -0.7882352941, -0.7882352941]", ,0,ROT,47,0,47,0,0,0,0,0,,,,,left,1,0.623106009283,2017_Apr_25_1018,98.7779504005,Stroop,A-1,2STRNS-5,
,,,,,,47,0,47,0,,,,,,,,,,,,2017_Apr_25_1018,98.7779504005,Stroop,A-1,2STRNS-5,
neutral,down,"[-0.7725490196, 0.0745098039, -1]", ,13,SOLL,48,0,48,0,0,0,0,0,,,,,down,1,0.546773402765,2017_Apr_25_1018,98.7779504005,Stroop,A-1,2STRNS-5,
,,,,,,48,0,48,0,,,,,,,,,,,,2017_Apr_25_1018,98.7779504005,Stroop,A-1,2STRNS-5,
neutralofneutral,left,"[0.568627451, -0.7882352941, -0.7882352941]", ,18,MODE,49,0,49,0,0,0,0,0,,,,,left,1,0.644239142126,2017_Apr_25_1018,98.7779504005,Stroop,A-1,2STRNS-5,
,,,,,,49,0,49,0,,,,,,,,,,,,2017_Apr_25_1018,98.7779504005,Stroop,A-1,2STRNS-5,
incongruent,right,"[-0.8745098039, -0.2078431373, 0.637254902]", ,5,GRÜN,50,0,50,0,0,0,0,0,,,,,right,1,0.67677344467,2017_Apr_25_1018,98.7779504005,Stroop,A-1,2STRNS-5,
,,,,,,50,0,50,0,,,,,,,,,,,,2017_Apr_25_1018,98.7779504005,Stroop,A-1,2STRNS-5,
neutral,left,"[0.568627451, -0.7882352941, -0.7882352941]", ,9,PECH,51,0,51,0,0,0,0,0,,,,,left,1,0.646162850307,2017_Apr_25_1018,98.7779504005,Stroop,A-1,2STRNS-5,
,,,,,,51,0,51,0,,,,,,,,,,,,2017_Apr_25_1018,98.7779504005,Stroop,A-1,2STRNS-5,
neutral,left,"[0.568627451, -0.7882352941, -0.7882352941]", ,9,PECH,52,0,52,0,0,0,0,0,,,,,left,1,0.710936166468,2017_Apr_25_1018,98.7779504005,Stroop,A-1,2STRNS-5,
,,,,,,52,0,52,0,,,,,,,,,,,,2017_Apr_25_1018,98.7779504005,Stroop,A-1,2STRNS-5,
congruent,down,"[-0.7725490196, 0.0745098039, -1]", ,4,GRÜN,53,0,53,0,0,0,0,0,,,,,down,1,0.630089857789,2017_Apr_25_1018,98.7779504005,Stroop,A-1,2STRNS-5,
,,,,,,53,0,53,0,,,,,,,,,,,,2017_Apr_25_1018,98.7779504005,Stroop,A-1,2STRNS-5,
fix,return,white, ,21,+,,,,,,,,,0,0,0,0,None,0,,2017_Apr_25_1018,98.7779504005,Stroop,A-1,2STRNS-5,
fix,return,white, ,21,+,,,,,,,,,0,1,1,1,None,0,,2017_Apr_25_1018,98.7779504005,Stroop,A-1,2STRNS-5,
fix,return,white, ,21,+,,,,,,,,,0,2,2,2,None,0,,2017_Apr_25_1018,98.7779504005,Stroop,A-1,2STRNS-5,
fix,return,white, ,21,+,,,,,,,,,0,3,3,3,None,0,,2017_Apr_25_1018,98.7779504005,Stroop,A-1,2STRNS-5,
fix,return,white, ,21,+,,,,,,,,,0,4,4,4,None,0,,2017_Apr_25_1018,98.7779504005,Stroop,A-1,2STRNS-5,
fix,return,white, ,21,+,,,,,,,,,0,5,5,5,None,0,,2017_Apr_25_1018,98.7779504005,Stroop,A-1,2STRNS-5,
fix,return,white, ,21,+,,,,,,,,,0,6,6,6,None,0,,2017_Apr_25_1018,98.7779504005,Stroop,A-1,2STRNS-5,
fix,return,white, ,21,+,,,,,,,,,0,7,7,7,None,0,,2017_Apr_25_1018,98.7779504005,Stroop,A-1,2STRNS-5,
fix,return,white, ,21,+,,,,,,,,,0,8,8,8,None,0,,2017_Apr_25_1018,98.7779504005,Stroop,A-1,2STRNS-5,
fix,return,white, ,21,+,,,,,,,,,0,9,9,9,None,0,,2017_Apr_25_1018,98.7779504005,Stroop,A-1,2STRNS-5,
fix,return,white, ,21,+,,,,,,,,,0,10,10,10,None,0,,2017_Apr_25_1018,98.7779504005,Stroop,A-1,2STRNS-5,
fix,return,white, ,21,+,,,,,,,,,0,11,11,11,None,0,,2017_Apr_25_1018,98.7779504005,Stroop,A-1,2STRNS-5,
fix,return,white,+,22,+,,,,,,,,,0,12,12,12,None,0,,2017_Apr_25_1018,98.7779504005,Stroop,A-1,2STRNS-5,
neutral,down,"[-0.7725490196, 0.0745098039, -1]", ,13,SOLL,,,,,,,,,0,13,13,13,down,1,1.01633056715,2017_Apr_25_1018,98.7779504005,Stroop,A-1,2STRNS-5,
incongruent,left,"[0.568627451, -0.7882352941, -0.7882352941]", ,3,GRÜN,,,,,,,,,0,14,14,14,left,1,0.546205174121,2017_Apr_25_1018,98.7779504005,Stroop,A-1,2STRNS-5,
incongruent,right,"[-0.8745098039, -0.2078431373, 0.637254902]", ,5,GRÜN,,,,,,,,,0,15,15,15,right,1,0.558022318479,2017_Apr_25_1018,98.7779504005,Stroop,A-1,2STRNS-5,
neutral,right,"[-0.8745098039, -0.2078431373, 0.637254902]", ,14,SOLL,,,,,,,,,0,16,16,16,right,1,0.717286414893,2017_Apr_25_1018,98.7779504005,Stroop,A-1,2STRNS-5,
incongruent,left,"[0.568627451, -0.7882352941, -0.7882352941]", ,6,BLAU,,,,,,,,,0,17,17,17,left,1,0.707070870739,2017_Apr_25_1018,98.7779504005,Stroop,A-1,2STRNS-5,
incongruent,down,"[-0.7725490196, 0.0745098039, -1]", ,7,BLAU,,,,,,,,,0,18,18,18,down,1,0.652381238398,2017_Apr_25_1018,98.7779504005,Stroop,A-1,2STRNS-5,
incongruent,right,"[-0.8745098039, -0.2078431373, 0.637254902]", ,2,ROT,,,,,,,,,0,19,19,19,right,1,0.927403343162,2017_Apr_25_1018,98.7779504005,Stroop,A-1,2STRNS-5,
incongruent,down,"[-0.7725490196, 0.0745098039, -1]", ,1,ROT,,,,,,,,,0,20,20,20,down,1,0.715000370159,2017_Apr_25_1018,98.7779504005,Stroop,A-1,2STRNS-5,
neutral,right,"[-0.8745098039, -0.2078431373, 0.637254902]", ,11,PECH,,,,,,,,,0,21,21,21,right,1,0.601831238328,2017_Apr_25_1018,98.7779504005,Stroop,A-1,2STRNS-5,
neutral,left,"[0.568627451, -0.7882352941, -0.7882352941]", ,9,PECH,,,,,,,,,0,22,22,22,left,1,0.578964644948,2017_Apr_25_1018,98.7779504005,Stroop,A-1,2STRNS-5,
neutral,down,"[-0.7725490196, 0.0745098039, -1]", ,10,PECH,,,,,,,,,0,23,23,23,down,1,0.547217313932,2017_Apr_25_1018,98.7779504005,Stroop,A-1,2STRNS-5,
neutral,left,"[0.568627451, -0.7882352941, -0.7882352941]", ,12,SOLL,,,,,,,,,0,24,24,24,left,1,0.629816638707,2017_Apr_25_1018,98.7779504005,Stroop,A-1,2STRNS-5,
neutralofneutral,left,"[0.568627451, -0.7882352941, -0.7882352941]", ,18,MODE,,,,,,,,,0,25,25,25,left,1,0.62931322277,2017_Apr_25_1018,98.7779504005,Stroop,A-1,2STRNS-5,
neutral,left,"[0.568627451, -0.7882352941, -0.7882352941]", ,12,SOLL,,,,,,,,,0,26,26,26,left,1,0.629531965655,2017_Apr_25_1018,98.7779504005,Stroop,A-1,2STRNS-5,
neutralofneutral,right,"[-0.8745098039, -0.2078431373, 0.637254902]", ,17,HALS,,,,,,,,,0,27,27,27,right,1,0.742848881632,2017_Apr_25_1018,98.7779504005,Stroop,A-1,2STRNS-5,
neutralofneutral,down,"[-0.7725490196, 0.0745098039, -1]", ,19,MODE,,,,,,,,,0,28,28,28,down,1,0.565759894065,2017_Apr_25_1018,98.7779504005,Stroop,A-1,2STRNS-5,
neutralofneutral,down,"[-0.7725490196, 0.0745098039, -1]", ,16,HALS,,,,,,,,,0,29,29,29,down,1,0.604899505384,2017_Apr_25_1018,98.7779504005,Stroop,A-1,2STRNS-5,
neutral,right,"[-0.8745098039, -0.2078431373, 0.637254902]", ,11,PECH,,,,,,,,,0,30,30,30,right,1,0.803827581439,2017_Apr_25_1018,98.7779504005,Stroop,A-1,2STRNS-5,
neutral,right,"[-0.8745098039, -0.2078431373, 0.637254902]", ,14,SOLL,,,,,,,,,0,31,31,31,right,1,0.576250612857,2017_Apr_25_1018,98.7779504005,Stroop,A-1,2STRNS-5,
neutralofneutral,left,"[0.568627451, -0.7882352941, -0.7882352941]", ,15,HALS,,,,,,,,,0,32,32,32,left,1,0.605468851488,2017_Apr_25_1018,98.7779504005,Stroop,A-1,2STRNS-5,
neutralofneutral,right,"[-0.8745098039, -0.2078431373, 0.637254902]", ,20,MODE,,,,,,,,,0,33,33,33,right,1,0.885494664825,2017_Apr_25_1018,98.7779504005,Stroop,A-1,2STRNS-5,
neutral,down,"[-0.7725490196, 0.0745098039, -1]", ,10,PECH,,,,,,,,,0,34,34,34,down,1,0.493375554714,2017_Apr_25_1018,98.7779504005,Stroop,A-1,2STRNS-5,
neutral,down,"[-0.7725490196, 0.0745098039, -1]", ,13,SOLL,,,,,,,,,0,35,35,35,down,1,0.577898028939,2017_Apr_25_1018,98.7779504005,Stroop,A-1,2STRNS-5,
neutral,left,"[0.568627451, -0.7882352941, -0.7882352941]", ,9,PECH,,,,,,,,,0,36,36,36,left,1,0.70010210795,2017_Apr_25_1018,98.7779504005,Stroop,A-1,2STRNS-5,
congruent,left,"[0.568627451, -0.7882352941, -0.7882352941]", ,0,ROT,,,,,,,,,0,37,37,37,left,1,0.803263263907,2017_Apr_25_1018,98.7779504005,Stroop,A-1,2STRNS-5,
congruent,right,"[-0.8745098039, -0.2078431373, 0.637254902]", ,8,BLAU,,,,,,,,,0,38,38,38,right,1,0.718131215001,2017_Apr_25_1018,98.7779504005,Stroop,A-1,2STRNS-5,
neutral,down,"[-0.7725490196, 0.0745098039, -1]", ,13,SOLL,,,,,,,,,0,39,39,39,down,1,0.535341223535,2017_Apr_25_1018,98.7779504005,Stroop,A-1,2STRNS-5,
neutral,right,"[-0.8745098039, -0.2078431373, 0.637254902]", ,11,PECH,,,,,,,,,0,40,40,40,right,1,0.58169515958,2017_Apr_25_1018,98.7779504005,Stroop,A-1,2STRNS-5,
neutral,left,"[0.568627451, -0.7882352941, -0.7882352941]", ,12,SOLL,,,,,,,,,0,41,41,41,left,1,0.717362402205,2017_Apr_25_1018,98.7779504005,Stroop,A-1,2STRNS-5,
congruent,left,"[0.568627451, -0.7882352941, -0.7882352941]", ,0,ROT,,,,,,,,,0,42,42,42,left,1,0.514014770034,2017_Apr_25_1018,98.7779504005,Stroop,A-1,2STRNS-5,
congruent,right,"[-0.8745098039, -0.2078431373, 0.637254902]", ,8,BLAU,,,,,,,,,0,43,43,43,right,1,0.868495856317,2017_Apr_25_1018,98.7779504005,Stroop,A-1,2STRNS-5,
congruent,down,"[-0.7725490196, 0.0745098039, -1]", ,4,GRÜN,,,,,,,,,0,44,44,44,down,1,0.557220819965,2017_Apr_25_1018,98.7779504005,Stroop,A-1,2STRNS-5,
neutral,right,"[-0.8745098039, -0.2078431373, 0.637254902]", ,14,SOLL,,,,,,,,,0,45,45,45,right,1,0.654790762513,2017_Apr_25_1018,98.7779504005,Stroop,A-1,2STRNS-5,
congruent,down,"[-0.7725490196, 0.0745098039, -1]", ,4,GRÜN,,,,,,,,,0,46,46,46,down,1,0.704935403801,2017_Apr_25_1018,98.7779504005,Stroop,A-1,2STRNS-5,
neutral,down,"[-0.7725490196, 0.0745098039, -1]", ,10,PECH,,,,,,,,,0,47,47,47,down,1,0.54657812655,2017_Apr_25_1018,98.7779504005,Stroop,A-1,2STRNS-5,
neutral,left,"[0.568627451, -0.7882352941, -0.7882352941]", ,9,PECH,,,,,,,,,0,48,48,48,left,1,0.643168894371,2017_Apr_25_1018,98.7779504005,Stroop,A-1,2STRNS-5,
fix,return,white, ,21,+,,,,,,,,,0,49,49,49,None,0,,2017_Apr_25_1018,98.7779504005,Stroop,A-1,2STRNS-5,
fix,return,white, ,21,+,,,,,,,,,0,50,50,50,None,0,,2017_Apr_25_1018,98.7779504005,Stroop,A-1,2STRNS-5,
fix,return,white, ,21,+,,,,,,,,,0,51,51,51,None,0,,2017_Apr_25_1018,98.7779504005,Stroop,A-1,2STRNS-5,
fix,return,white, ,21,+,,,,,,,,,0,52,52,52,None,0,,2017_Apr_25_1018,98.7779504005,Stroop,A-1,2STRNS-5,
fix,return,white, ,21,+,,,,,,,,,0,53,53,53,None,0,,2017_Apr_25_1018,98.7779504005,Stroop,A-1,2STRNS-5,
fix,return,white, ,21,+,,,,,,,,,0,54,54,54,None,0,,2017_Apr_25_1018,98.7779504005,Stroop,A-1,2STRNS-5,
fix,return,white, ,21,+,,,,,,,,,0,55,55,55,None,0,,2017_Apr_25_1018,98.7779504005,Stroop,A-1,2STRNS-5,
fix,return,white, ,21,+,,,,,,,,,0,56,56,56,None,0,,2017_Apr_25_1018,98.7779504005,Stroop,A-1,2STRNS-5,
fix,return,white, ,21,+,,,,,,,,,0,57,57,57,None,0,,2017_Apr_25_1018,98.7779504005,Stroop,A-1,2STRNS-5,
fix,return,white, ,21,+,,,,,,,,,0,58,58,58,None,0,,2017_Apr_25_1018,98.7779504005,Stroop,A-1,2STRNS-5,
fix,return,white, ,21,+,,,,,,,,,0,59,59,59,None,0,,2017_Apr_25_1018,98.7779504005,Stroop,A-1,2STRNS-5,
fix,return,white, ,21,+,,,,,,,,,0,60,60,60,None,0,,2017_Apr_25_1018,98.7779504005,Stroop,A-1,2STRNS-5,
fix,return,white,+,22,+,,,,,,,,,0,61,61,61,None,0,,2017_Apr_25_1018,98.7779504005,Stroop,A-1,2STRNS-5,
neutral,right,"[-0.8745098039, -0.2078431373, 0.637254902]", ,11,PECH,,,,,,,,,0,62,62,62,right,1,0.793103592775,2017_Apr_25_1018,98.7779504005,Stroop,A-1,2STRNS-5,
congruent,down,"[-0.7725490196, 0.0745098039, -1]", ,4,GRÜN,,,,,,,,,0,63,63,63,down,1,0.811045537911,2017_Apr_25_1018,98.7779504005,Stroop,A-1,2STRNS-5,
neutral,right,"[-0.8745098039, -0.2078431373, 0.637254902]", ,14,SOLL,,,,,,,,,0,64,64,64,right,1,0.739296474831,2017_Apr_25_1018,98.7779504005,Stroop,A-1,2STRNS-5,
congruent,down,"[-0.7725490196, 0.0745098039, -1]", ,4,GRÜN,,,,,,,,,0,65,65,65,down,1,0.685679883896,2017_Apr_25_1018,98.7779504005,Stroop,A-1,2STRNS-5,
congruent,left,"[0.568627451, -0.7882352941, -0.7882352941]", ,0,ROT,,,,,,,,,0,66,66,66,left,1,0.43939802405,2017_Apr_25_1018,98.7779504005,Stroop,A-1,2STRNS-5,
neutral,left,"[0.568627451, -0.7882352941, -0.7882352941]", ,12,SOLL,,,,,,,,,0,67,67,67,left,1,0.535782061687,2017_Apr_25_1018,98.7779504005,Stroop,A-1,2STRNS-5,
congruent,right,"[-0.8745098039, -0.2078431373, 0.637254902]", ,8,BLAU,,,,,,,,,0,68,68,68,right,1,0.740734925808,2017_Apr_25_1018,98.7779504005,Stroop,A-1,2STRNS-5,
congruent,right,"[-0.8745098039, -0.2078431373, 0.637254902]", ,8,BLAU,,,,,,,,,0,69,69,69,right,1,0.578826359216,2017_Apr_25_1018,98.7779504005,Stroop,A-1,2STRNS-5,
neutral,left,"[0.568627451, -0.7882352941, -0.7882352941]", ,9,PECH,,,,,,,,,0,70,70,70,left,1,0.581407692877,2017_Apr_25_1018,98.7779504005,Stroop,A-1,2STRNS-5,
neutral,down,"[-0.7725490196, 0.0745098039, -1]", ,13,SOLL,,,,,,,,,0,71,71,71,down,1,0.546380336048,2017_Apr_25_1018,98.7779504005,Stroop,A-1,2STRNS-5,
neutral,down,"[-0.7725490196, 0.0745098039, -1]", ,10,PECH,,,,,,,,,0,72,72,72,down,1,0.549246063396,2017_Apr_25_1018,98.7779504005,Stroop,A-1,2STRNS-5,
congruent,left,"[0.568627451, -0.7882352941, -0.7882352941]", ,0,ROT,,,,,,,,,0,73,73,73,left,1,0.514419011355,2017_Apr_25_1018,98.7779504005,Stroop,A-1,2STRNS-5,
neutral,right,"[-0.8745098039, -0.2078431373, 0.637254902]", ,11,PECH,,,,,,,,,0,74,74,74,right,1,0.579085051312,2017_Apr_25_1018,98.7779504005,Stroop,A-1,2STRNS-5,
incongruent,left,"[0.568627451, -0.7882352941, -0.7882352941]", ,3,GRÜN,,,,,,,,,0,75,75,75,left,1,0.74777045686,2017_Apr_25_1018,98.7779504005,Stroop,A-1,2STRNS-5,
neutral,down,"[-0.7725490196, 0.0745098039, -1]", ,10,PECH,,,,,,,,,0,76,76,76,down,1,0.621796904355,2017_Apr_25_1018,98.7779504005,Stroop,A-1,2STRNS-5,
neutral,left,"[0.568627451, -0.7882352941, -0.7882352941]", ,12,SOLL,,,,,,,,,0,77,77,77,left,1,0.735617515634,2017_Apr_25_1018,98.7779504005,Stroop,A-1,2STRNS-5,
neutral,down,"[-0.7725490196, 0.0745098039, -1]", ,13,SOLL,,,,,,,,,0,78,78,78,down,1,0.492299440292,2017_Apr_25_1018,98.7779504005,Stroop,A-1,2STRNS-5,
incongruent,down,"[-0.7725490196, 0.0745098039, -1]", ,7,BLAU,,,,,,,,,0,79,79,79,down,1,1.06603716394,2017_Apr_25_1018,98.7779504005,Stroop,A-1,2STRNS-5,
neutral,left,"[0.568627451, -0.7882352941, -0.7882352941]", ,9,PECH,,,,,,,,,0,80,80,80,left,1,0.51749761492,2017_Apr_25_1018,98.7779504005,Stroop,A-1,2STRNS-5,
incongruent,down,"[-0.7725490196, 0.0745098039, -1]", ,1,ROT,,,,,,,,,0,81,81,81,down,1,0.750367434967,2017_Apr_25_1018,98.7779504005,Stroop,A-1,2STRNS-5,
incongruent,right,"[-0.8745098039, -0.2078431373, 0.637254902]", ,5,GRÜN,,,,,,,,,0,82,82,82,right,1,0.955173632403,2017_Apr_25_1018,98.7779504005,Stroop,A-1,2STRNS-5,
neutral,right,"[-0.8745098039, -0.2078431373, 0.637254902]", ,14,SOLL,,,,,,,,,0,83,83,83,right,1,0.867656922877,2017_Apr_25_1018,98.7779504005,Stroop,A-1,2STRNS-5,
incongruent,left,"[0.568627451, -0.7882352941, -0.7882352941]", ,6,BLAU,,,,,,,,,0,84,84,84,left,1,0.653645644907,2017_Apr_25_1018,98.7779504005,Stroop,A-1,2STRNS-5,
incongruent,right,"[-0.8745098039, -0.2078431373, 0.637254902]", ,2,ROT,,,,,,,,,0,85,85,85,right,1,1.19637412017,2017_Apr_25_1018,98.7779504005,Stroop,A-1,2STRNS-5,
neutral,left,"[0.568627451, -0.7882352941, -0.7882352941]", ,9,PECH,,,,,,,,,0,86,86,86,left,1,0.721281336036,2017_Apr_25_1018,98.7779504005,Stroop,A-1,2STRNS-5,
neutral,left,"[0.568627451, -0.7882352941, -0.7882352941]", ,12,SOLL,,,,,,,,,0,87,87,87,left,1,0.760763448986,2017_Apr_25_1018,98.7779504005,Stroop,A-1,2STRNS-5,
neutral,down,"[-0.7725490196, 0.0745098039, -1]", ,13,SOLL,,,,,,,,,0,88,88,88,down,1,0.608551366165,2017_Apr_25_1018,98.7779504005,Stroop,A-1,2STRNS-5,
neutralofneutral,right,"[-0.8745098039, -0.2078431373, 0.637254902]", ,20,MODE,,,,,,,,,0,89,89,89,right,1,0.448155561671,2017_Apr_25_1018,98.7779504005,Stroop,A-1,2STRNS-5,
neutralofneutral,right,"[-0.8745098039, -0.2078431373, 0.637254902]", ,17,HALS,,,,,,,,,0,90,90,90,right,1,0.456739892919,2017_Apr_25_1018,98.7779504005,Stroop,A-1,2STRNS-5,
neutralofneutral,down,"[-0.7725490196, 0.0745098039, -1]", ,16,HALS,,,,,,,,,0,91,91,91,down,1,0.637244677745,2017_Apr_25_1018,98.7779504005,Stroop,A-1,2STRNS-5,
neutral,right,"[-0.8745098039, -0.2078431373, 0.637254902]", ,14,SOLL,,,,,,,,,0,92,92,92,right,1,0.608763404287,2017_Apr_25_1018,98.7779504005,Stroop,A-1,2STRNS-5,
neutral,right,"[-0.8745098039, -0.2078431373, 0.637254902]", ,11,PECH,,,,,,,,,0,93,93,93,right,1,0.536707877677,2017_Apr_25_1018,98.7779504005,Stroop,A-1,2STRNS-5,
neutral,down,"[-0.7725490196, 0.0745098039, -1]", ,10,PECH,,,,,,,,,0,94,94,94,down,1,0.537066023755,2017_Apr_25_1018,98.7779504005,Stroop,A-1,2STRNS-5,
neutralofneutral,left,"[0.568627451, -0.7882352941, -0.7882352941]", ,15,HALS,,,,,,,,,0,95,95,95,left,1,0.384002715429,2017_Apr_25_1018,98.7779504005,Stroop,A-1,2STRNS-5,
neutralofneutral,down,"[-0.7725490196, 0.0745098039, -1]", ,19,MODE,,,,,,,,,0,96,96,96,down,1,0.60061991119,2017_Apr_25_1018,98.7779504005,Stroop,A-1,2STRNS-5,
neutralofneutral,left,"[0.568627451, -0.7882352941, -0.7882352941]", ,18,MODE,,,,,,,,,0,97,97,97,left,1,0.760438547357,2017_Apr_25_1018,98.7779504005,Stroop,A-1,2STRNS-5,
fix,return,white, ,21,+,,,,,,,,,0,98,98,98,None,0,,2017_Apr_25_1018,98.7779504005,Stroop,A-1,2STRNS-5,
fix,return,white, ,21,+,,,,,,,,,0,99,99,99,None,0,,2017_Apr_25_1018,98.7779504005,Stroop,A-1,2STRNS-5,
fix,return,white, ,21,+,,,,,,,,,0,100,100,100,None,0,,2017_Apr_25_1018,98.7779504005,Stroop,A-1,2STRNS-5,
fix,return,white, ,21,+,,,,,,,,,0,101,101,101,None,0,,2017_Apr_25_1018,98.7779504005,Stroop,A-1,2STRNS-5,
fix,return,white, ,21,+,,,,,,,,,0,102,102,102,None,0,,2017_Apr_25_1018,98.7779504005,Stroop,A-1,2STRNS-5,
fix,return,white, ,21,+,,,,,,,,,0,103,103,103,None,0,,2017_Apr_25_1018,98.7779504005,Stroop,A-1,2STRNS-5,
fix,return,white, ,21,+,,,,,,,,,0,104,104,104,None,0,,2017_Apr_25_1018,98.7779504005,Stroop,A-1,2STRNS-5,
fix,return,white, ,21,+,,,,,,,,,0,105,105,105,None,0,,2017_Apr_25_1018,98.7779504005,Stroop,A-1,2STRNS-5,
fix,return,white, ,21,+,,,,,,,,,0,106,106,106,None,0,,2017_Apr_25_1018,98.7779504005,Stroop,A-1,2STRNS-5,
fix,return,white, ,21,+,,,,,,,,,0,107,107,107,None,0,,2017_Apr_25_1018,98.7779504005,Stroop,A-1,2STRNS-5,
fix,return,white, ,21,+,,,,,,,,,0,108,108,108,None,0,,2017_Apr_25_1018,98.7779504005,Stroop,A-1,2STRNS-5,
fix,return,white, ,21,+,,,,,,,,,0,109,109,109,None,0,,2017_Apr_25_1018,98.7779504005,Stroop,A-1,2STRNS-5,
fix,return,white,+,22,+,,,,,,,,,0,110,110,110,None,0,,2017_Apr_25_1018,98.7779504005,Stroop,A-1,2STRNS-5,
neutral,right,"[-0.8745098039, -0.2078431373, 0.637254902]", ,14,SOLL,,,,,,,,,0,111,111,111,right,1,0.69606472331,2017_Apr_25_1018,98.7779504005,Stroop,A-1,2STRNS-5,
neutral,left,"[0.568627451, -0.7882352941, -0.7882352941]", ,12,SOLL,,,,,,,,,0,112,112,112,left,1,0.610771760098,2017_Apr_25_1018,98.7779504005,Stroop,A-1,2STRNS-5,
congruent,right,"[-0.8745098039, -0.2078431373, 0.637254902]", ,8,BLAU,,,,,,,,,0,113,113,113,right,1,0.728957730661,2017_Apr_25_1018,98.7779504005,Stroop,A-1,2STRNS-5,
neutral,down,"[-0.7725490196, 0.0745098039, -1]", ,10,PECH,,,,,,,,,0,114,114,114,down,1,0.441373135413,2017_Apr_25_1018,98.7779504005,Stroop,A-1,2STRNS-5,
neutral,left,"[0.568627451, -0.7882352941, -0.7882352941]", ,9,PECH,,,,,,,,,0,115,115,115,left,1,0.430632105477,2017_Apr_25_1018,98.7779504005,Stroop,A-1,2STRNS-5,
congruent,right,"[-0.8745098039, -0.2078431373, 0.637254902]", ,8,BLAU,,,,,,,,,0,116,116,116,right,1,0.536157249036,2017_Apr_25_1018,98.7779504005,Stroop,A-1,2STRNS-5,
neutral,down,"[-0.7725490196, 0.0745098039, -1]", ,13,SOLL,,,,,,,,,0,117,117,117,down,1,0.479963794281,2017_Apr_25_1018,98.7779504005,Stroop,A-1,2STRNS-5,
congruent,down,"[-0.7725490196, 0.0745098039, -1]", ,4,GRÜN,,,,,,,,,0,118,118,118,down,1,0.534503686921,2017_Apr_25_1018,98.7779504005,Stroop,A-1,2STRNS-5,
congruent,down,"[-0.7725490196, 0.0745098039, -1]", ,4,GRÜN,,,,,,,,,0,119,119,119,down,1,0.49093166869,2017_Apr_25_1018,98.7779504005,Stroop,A-1,2STRNS-5,
congruent,left,"[0.568627451, -0.7882352941, -0.7882352941]", ,0,ROT,,,,,,,,,0,120,120,120,left,1,0.533546023308,2017_Apr_25_1018,98.7779504005,Stroop,A-1,2STRNS-5,
congruent,left,"[0.568627451, -0.7882352941, -0.7882352941]", ,0,ROT,,,,,,,,,0,121,121,121,left,1,0.525056396833,2017_Apr_25_1018,98.7779504005,Stroop,A-1,2STRNS-5,
neutral,right,"[-0.8745098039, -0.2078431373, 0.637254902]", ,11,PECH,,,,,,,,,0,122,122,122,right,1,0.786031744258,2017_Apr_25_1018,98.7779504005,Stroop,A-1,2STRNS-5,
neutralofneutral,down,"[-0.7725490196, 0.0745098039, -1]", ,16,HALS,,,,,,,,,0,123,123,123,down,1,0.480088670487,2017_Apr_25_1018,98.7779504005,Stroop,A-1,2STRNS-5,
neutral,down,"[-0.7725490196, 0.0745098039, -1]", ,10,PECH,,,,,,,,,0,124,124,124,down,1,0.53825863343,2017_Apr_25_1018,98.7779504005,Stroop,A-1,2STRNS-5,
neutralofneutral,right,"[-0.8745098039, -0.2078431373, 0.637254902]", ,20,MODE,,,,,,,,,0,125,125,125,right,1,0.493024392765,2017_Apr_25_1018,98.7779504005,Stroop,A-1,2STRNS-5,
neutralofneutral,left,"[0.568627451, -0.7882352941, -0.7882352941]", ,15,HALS,,,,,,,,,0,126,126,126,left,1,0.639841935218,2017_Apr_25_1018,98.7779504005,Stroop,A-1,2STRNS-5,
neutral,right,"[-0.8745098039, -0.2078431373, 0.637254902]", ,11,PECH,,,,,,,,,0,127,127,127,right,1,0.527881336874,2017_Apr_25_1018,98.7779504005,Stroop,A-1,2STRNS-5,
neutralofneutral,right,"[-0.8745098039, -0.2078431373, 0.637254902]", ,17,HALS,,,,,,,,,0,128,128,128,right,1,0.448380171223,2017_Apr_25_1018,98.7779504005,Stroop,A-1,2STRNS-5,
neutralofneutral,left,"[0.568627451, -0.7882352941, -0.7882352941]", ,18,MODE,,,,,,,,,0,129,129,129,left,1,0.803335619471,2017_Apr_25_1018,98.7779504005,Stroop,A-1,2STRNS-5,
neutral,left,"[0.568627451, -0.7882352941, -0.7882352941]", ,12,SOLL,,,,,,,,,0,130,130,130,left,1,0.502013524065,2017_Apr_25_1018,98.7779504005,Stroop,A-1,2STRNS-5,
neutral,left,"[0.568627451, -0.7882352941, -0.7882352941]", ,9,PECH,,,,,,,,,0,131,131,131,left,1,0.65438149262,2017_Apr_25_1018,98.7779504005,Stroop,A-1,2STRNS-5,
neutral,down,"[-0.7725490196, 0.0745098039, -1]", ,13,SOLL,,,,,,,,,0,132,132,132,down,1,0.427121044714,2017_Apr_25_1018,98.7779504005,Stroop,A-1,2STRNS-5,
neutralofneutral,down,"[-0.7725490196, 0.0745098039, -1]", ,19,MODE,,,,,,,,,0,133,133,133,down,1,0.394843758075,2017_Apr_25_1018,98.7779504005,Stroop,A-1,2STRNS-5,
neutral,right,"[-0.8745098039, -0.2078431373, 0.637254902]", ,14,SOLL,,,,,,,,,0,134,134,134,right,1,0.58703410629,2017_Apr_25_1018,98.7779504005,Stroop,A-1,2STRNS-5,
incongruent,right,"[-0.8745098039, -0.2078431373, 0.637254902]", ,2,ROT,,,,,,,,,0,135,135,135,right,1,0.428845286203,2017_Apr_25_1018,98.7779504005,Stroop,A-1,2STRNS-5,
neutral,right,"[-0.8745098039, -0.2078431373, 0.637254902]", ,11,PECH,,,,,,,,,0,136,136,136,right,1,0.504911099036,2017_Apr_25_1018,98.7779504005,Stroop,A-1,2STRNS-5,
incongruent,down,"[-0.7725490196, 0.0745098039, -1]", ,7,BLAU,,,,,,,,,0,137,137,137,left,0,0.652861187665,2017_Apr_25_1018,98.7779504005,Stroop,A-1,2STRNS-5,
neutral,right,"[-0.8745098039, -0.2078431373, 0.637254902]", ,14,SOLL,,,,,,,,,0,138,138,138,right,1,0.953368654396,2017_Apr_25_1018,98.7779504005,Stroop,A-1,2STRNS-5,
incongruent,left,"[0.568627451, -0.7882352941, -0.7882352941]", ,6,BLAU,,,,,,,,,0,139,139,139,left,1,0.72739887332,2017_Apr_25_1018,98.7779504005,Stroop,A-1,2STRNS-5,
neutral,down,"[-0.7725490196, 0.0745098039, -1]", ,13,SOLL,,,,,,,,,0,140,140,140,down,1,0.577828467026,2017_Apr_25_1018,98.7779504005,Stroop,A-1,2STRNS-5,
incongruent,left,"[0.568627451, -0.7882352941, -0.7882352941]", ,3,GRÜN,,,,,,,,,0,141,141,141,left,1,0.780580213407,2017_Apr_25_1018,98.7779504005,Stroop,A-1,2STRNS-5,
incongruent,right,"[-0.8745098039, -0.2078431373, 0.637254902]", ,5,GRÜN,,,,,,,,,0,142,142,142,right,1,1.13089931821,2017_Apr_25_1018,98.7779504005,Stroop,A-1,2STRNS-5,
neutral,left,"[0.568627451, -0.7882352941, -0.7882352941]", ,12,SOLL,,,,,,,,,0,143,143,143,left,1,0.70599112457,2017_Apr_25_1018,98.7779504005,Stroop,A-1,2STRNS-5,
neutral,down,"[-0.7725490196, 0.0745098039, -1]", ,10,PECH,,,,,,,,,0,144,144,144,down,1,0.590979300442,2017_Apr_25_1018,98.7779504005,Stroop,A-1,2STRNS-5,
incongruent,down,"[-0.7725490196, 0.0745098039, -1]", ,1,ROT,,,,,,,,,0,145,145,145,down,1,0.865686840087,2017_Apr_25_1018,98.7779504005,Stroop,A-1,2STRNS-5,
neutral,left,"[0.568627451, -0.7882352941, -0.7882352941]", ,9,PECH,,,,,,,,,0,146,146,146,left,1,0.676006587429,2017_Apr_25_1018,98.7779504005,Stroop,A-1,2STRNS-5,
fix,return,white, ,21,+,,,,,,,,,0,147,147,147,None,0,,2017_Apr_25_1018,98.7779504005,Stroop,A-1,2STRNS-5,
fix,return,white, ,21,+,,,,,,,,,0,148,148,148,None,0,,2017_Apr_25_1018,98.7779504005,Stroop,A-1,2STRNS-5,
fix,return,white, ,21,+,,,,,,,,,0,149,149,149,None,0,,2017_Apr_25_1018,98.7779504005,Stroop,A-1,2STRNS-5,
fix,return,white, ,21,+,,,,,,,,,0,150,150,150,None,0,,2017_Apr_25_1018,98.7779504005,Stroop,A-1,2STRNS-5,
fix,return,white, ,21,+,,,,,,,,,0,151,151,151,None,0,,2017_Apr_25_1018,98.7779504005,Stroop,A-1,2STRNS-5,
fix,return,white, ,21,+,,,,,,,,,0,152,152,152,None,0,,2017_Apr_25_1018,98.7779504005,Stroop,A-1,2STRNS-5,
fix,return,white, ,21,+,,,,,,,,,0,153,153,153,None,0,,2017_Apr_25_1018,98.7779504005,Stroop,A-1,2STRNS-5,
fix,return,white, ,21,+,,,,,,,,,0,154,154,154,None,0,,2017_Apr_25_1018,98.7779504005,Stroop,A-1,2STRNS-5,
fix,return,white, ,21,+,,,,,,,,,0,155,155,155,None,0,,2017_Apr_25_1018,98.7779504005,Stroop,A-1,2STRNS-5,
fix,return,white, ,21,+,,,,,,,,,0,156,156,156,None,0,,2017_Apr_25_1018,98.7779504005,Stroop,A-1,2STRNS-5,
fix,return,white, ,21,+,,,,,,,,,0,157,157,157,None,0,,2017_Apr_25_1018,98.7779504005,Stroop,A-1,2STRNS-5,
fix,return,white, ,21,+,,,,,,,,,0,158,158,158,None,0,,2017_Apr_25_1018,98.7779504005,Stroop,A-1,2STRNS-5,
fix,return,white,+,22,+,,,,,,,,,0,159,159,159,None,0,,2017_Apr_25_1018,98.7779504005,Stroop,A-1,2STRNS-5,
incongruent,right,"[-0.8745098039, -0.2078431373, 0.637254902]", ,2,ROT,,,,,,,,,0,160,160,160,right,1,0.875969431869,2017_Apr_25_1018,98.7779504005,Stroop,A-1,2STRNS-5,
neutral,left,"[0.568627451, -0.7882352941, -0.7882352941]", ,9,PECH,,,,,,,,,0,161,161,161,left,1,0.493394551542,2017_Apr_25_1018,98.7779504005,Stroop,A-1,2STRNS-5,
neutral,down,"[-0.7725490196, 0.0745098039, -1]", ,13,SOLL,,,,,,,,,0,162,162,162,down,1,0.417085970424,2017_Apr_25_1018,98.7779504005,Stroop,A-1,2STRNS-5,
neutral,left,"[0.568627451, -0.7882352941, -0.7882352941]", ,12,SOLL,,,,,,,,,0,163,163,163,left,1,0.790001243175,2017_Apr_25_1018,98.7779504005,Stroop,A-1,2STRNS-5,
incongruent,down,"[-0.7725490196, 0.0745098039, -1]", ,1,ROT,,,,,,,,,0,164,164,164,down,1,0.364426484372,2017_Apr_25_1018,98.7779504005,Stroop,A-1,2STRNS-5,
neutral,right,"[-0.8745098039, -0.2078431373, 0.637254902]", ,11,PECH,,,,,,,,,0,165,165,165,right,1,0.453267384542,2017_Apr_25_1018,98.7779504005,Stroop,A-1,2STRNS-5,
incongruent,down,"[-0.7725490196, 0.0745098039, -1]", ,7,BLAU,,,,,,,,,0,166,166,166,down,1,0.590040354291,2017_Apr_25_1018,98.7779504005,Stroop,A-1,2STRNS-5,
incongruent,left,"[0.568627451, -0.7882352941, -0.7882352941]", ,6,BLAU,,,,,,,,,0,167,167,167,left,1,0.78220583901,2017_Apr_25_1018,98.7779504005,Stroop,A-1,2STRNS-5,
neutral,down,"[-0.7725490196, 0.0745098039, -1]", ,10,PECH,,,,,,,,,0,168,168,168,down,1,0.678887679859,2017_Apr_25_1018,98.7779504005,Stroop,A-1,2STRNS-5,
neutral,right,"[-0.8745098039, -0.2078431373, 0.637254902]", ,14,SOLL,,,,,,,,,0,169,169,169,right,1,0.653244197237,2017_Apr_25_1018,98.7779504005,Stroop,A-1,2STRNS-5,
incongruent,left,"[0.568627451, -0.7882352941, -0.7882352941]", ,3,GRÜN,,,,,,,,,0,170,170,170,left,1,0.814402109765,2017_Apr_25_1018,98.7779504005,Stroop,A-1,2STRNS-5,
incongruent,right,"[-0.8745098039, -0.2078431373, 0.637254902]", ,5,GRÜN,,,,,,,,,0,171,171,171,right,1,0.868585532519,2017_Apr_25_1018,98.7779504005,Stroop,A-1,2STRNS-5,
neutral,right,"[-0.8745098039, -0.2078431373, 0.637254902]", ,11,PECH,,,,,,,,,0,172,172,172,right,1,0.87217621234,2017_Apr_25_1018,98.7779504005,Stroop,A-1,2STRNS-5,
congruent,right,"[-0.8745098039, -0.2078431373, 0.637254902]", ,8,BLAU,,,,,,,,,0,173,173,173,right,1,0.932151712019,2017_Apr_25_1018,98.7779504005,Stroop,A-1,2STRNS-5,
neutral,left,"[0.568627451, -0.7882352941, -0.7882352941]", ,12,SOLL,,,,,,,,,0,174,174,174,left,1,0.610869817253,2017_Apr_25_1018,98.7779504005,Stroop,A-1,2STRNS-5,
congruent,left,"[0.568627451, -0.7882352941, -0.7882352941]", ,0,ROT,,,,,,,,,0,175,175,175,left,1,0.565322408295,2017_Apr_25_1018,98.7779504005,Stroop,A-1,2STRNS-5,
congruent,down,"[-0.7725490196, 0.0745098039, -1]", ,4,GRÜN,,,,,,,,,0,176,176,176,down,1,0.597732952093,2017_Apr_25_1018,98.7779504005,Stroop,A-1,2STRNS-5,
congruent,left,"[0.568627451, -0.7882352941, -0.7882352941]", ,0,ROT,,,,,,,,,0,177,177,177,left,1,0.640358760681,2017_Apr_25_1018,98.7779504005,Stroop,A-1,2STRNS-5,
congruent,right,"[-0.8745098039, -0.2078431373, 0.637254902]", ,8,BLAU,,,,,,,,,0,178,178,178,right,1,0.609821359977,2017_Apr_25_1018,98.7779504005,Stroop,A-1,2STRNS-5,
neutral,down,"[-0.7725490196, 0.0745098039, -1]", ,13,SOLL,,,,,,,,,0,179,179,179,down,1,0.621526478924,2017_Apr_25_1018,98.7779504005,Stroop,A-1,2STRNS-5,
congruent,down,"[-0.7725490196, 0.0745098039, -1]", ,4,GRÜN,,,,,,,,,0,180,180,180,down,1,0.718649437289,2017_Apr_25_1018,98.7779504005,Stroop,A-1,2STRNS-5,
neutral,right,"[-0.8745098039, -0.2078431373, 0.637254902]", ,14,SOLL,,,,,,,,,0,181,181,181,right,1,0.546540691624,2017_Apr_25_1018,98.7779504005,Stroop,A-1,2STRNS-5,
neutral,down,"[-0.7725490196, 0.0745098039, -1]", ,10,PECH,,,,,,,,,0,182,182,182,right,0,0.679378803731,2017_Apr_25_1018,98.7779504005,Stroop,A-1,2STRNS-5,
neutral,left,"[0.568627451, -0.7882352941, -0.7882352941]", ,9,PECH,,,,,,,,,0,183,183,183,left,1,0.969194688152,2017_Apr_25_1018,98.7779504005,Stroop,A-1,2STRNS-5,
neutralofneutral,down,"[-0.7725490196, 0.0745098039, -1]", ,16,HALS,,,,,,,,,0,184,184,184,down,1,0.576462650979,2017_Apr_25_1018,98.7779504005,Stroop,A-1,2STRNS-5,
neutralofneutral,down,"[-0.7725490196, 0.0745098039, -1]", ,19,MODE,,,,,,,,,0,185,185,185,down,1,0.911561944325,2017_Apr_25_1018,98.7779504005,Stroop,A-1,2STRNS-5,
neutral,right,"[-0.8745098039, -0.2078431373, 0.637254902]", ,11,PECH,,,,,,,,,0,186,186,186,right,1,0.915454897201,2017_Apr_25_1018,98.7779504005,Stroop,A-1,2STRNS-5,
neutral,right,"[-0.8745098039, -0.2078431373, 0.637254902]", ,14,SOLL,,,,,,,,,0,187,187,187,right,1,0.780677991197,2017_Apr_25_1018,98.7779504005,Stroop,A-1,2STRNS-5,
neutral,down,"[-0.7725490196, 0.0745098039, -1]", ,13,SOLL,,,,,,,,,0,188,188,188,down,1,0.587139426938,2017_Apr_25_1018,98.7779504005,Stroop,A-1,2STRNS-5,
neutralofneutral,right,"[-0.8745098039, -0.2078431373, 0.637254902]", ,20,MODE,,,,,,,,,0,189,189,189,right,1,0.651400108114,2017_Apr_25_1018,98.7779504005,Stroop,A-1,2STRNS-5,
neutral,left,"[0.568627451, -0.7882352941, -0.7882352941]", ,9,PECH,,,,,,,,,0,190,190,190,left,1,0.955328680042,2017_Apr_25_1018,98.7779504005,Stroop,A-1,2STRNS-5,
neutral,left,"[0.568627451, -0.7882352941, -0.7882352941]", ,12,SOLL,,,,,,,,,0,191,191,191,left,1,0.511921207863,2017_Apr_25_1018,98.7779504005,Stroop,A-1,2STRNS-5,
neutralofneutral,right,"[-0.8745098039, -0.2078431373, 0.637254902]", ,17,HALS,,,,,,,,,0,192,192,192,right,1,0.840043078101,2017_Apr_25_1018,98.7779504005,Stroop,A-1,2STRNS-5,
neutralofneutral,left,"[0.568627451, -0.7882352941, -0.7882352941]", ,18,MODE,,,,,,,,,0,193,193,193,left,1,0.641592437028,2017_Apr_25_1018,98.7779504005,Stroop,A-1,2STRNS-5,
neutralofneutral,left,"[0.568627451, -0.7882352941, -0.7882352941]", ,15,HALS,,,,,,,,,0,194,194,194,left,1,0.778368479793,2017_Apr_25_1018,98.7779504005,Stroop,A-1,2STRNS-5,
neutral,down,"[-0.7725490196, 0.0745098039, -1]", ,10,PECH,,,,,,,,,0,195,195,195,down,1,0.689761128858,2017_Apr_25_1018,98.7779504005,Stroop,A-1,2STRNS-5,
fix,return,white, ,21,+,,,,,,,,,0,196,196,196,None,0,,2017_Apr_25_1018,98.7779504005,Stroop,A-1,2STRNS-5,
fix,return,white, ,21,+,,,,,,,,,0,197,197,197,None,0,,2017_Apr_25_1018,98.7779504005,Stroop,A-1,2STRNS-5,
fix,return,white, ,21,+,,,,,,,,,0,198,198,198,None,0,,2017_Apr_25_1018,98.7779504005,Stroop,A-1,2STRNS-5,
fix,return,white, ,21,+,,,,,,,,,0,199,199,199,None,0,,2017_Apr_25_1018,98.7779504005,Stroop,A-1,2STRNS-5,
fix,return,white, ,21,+,,,,,,,,,0,200,200,200,None,0,,2017_Apr_25_1018,98.7779504005,Stroop,A-1,2STRNS-5,
fix,return,white, ,21,+,,,,,,,,,0,201,201,201,None,0,,2017_Apr_25_1018,98.7779504005,Stroop,A-1,2STRNS-5,
fix,return,white, ,21,+,,,,,,,,,0,202,202,202,None,0,,2017_Apr_25_1018,98.7779504005,Stroop,A-1,2STRNS-5,
fix,return,white, ,21,+,,,,,,,,,0,203,203,203,None,0,,2017_Apr_25_1018,98.7779504005,Stroop,A-1,2STRNS-5,
fix,return,white, ,21,+,,,,,,,,,0,204,204,204,None,0,,2017_Apr_25_1018,98.7779504005,Stroop,A-1,2STRNS-5,
fix,return,white, ,21,+,,,,,,,,,0,205,205,205,None,0,,2017_Apr_25_1018,98.7779504005,Stroop,A-1,2STRNS-5,
fix,return,white, ,21,+,,,,,,,,,0,206,206,206,None,0,,2017_Apr_25_1018,98.7779504005,Stroop,A-1,2STRNS-5,
fix,return,white, ,21,+,,,,,,,,,0,207,207,207,None,0,,2017_Apr_25_1018,98.7779504005,Stroop,A-1,2STRNS-5,
fix,return,white,+,22,+,,,,,,,,,0,208,208,208,None,0,,2017_Apr_25_1018,98.7779504005,Stroop,A-1,2STRNS-5,
neutral,right,"[-0.8745098039, -0.2078431373, 0.637254902]", ,14,SOLL,,,,,,,,,0,209,209,209,right,1,0.685755871207,2017_Apr_25_1018,98.7779504005,Stroop,A-1,2STRNS-5,
neutralofneutral,left,"[0.568627451, -0.7882352941, -0.7882352941]", ,15,HALS,,,,,,,,,0,210,210,210,left,1,0.565176579705,2017_Apr_25_1018,98.7779504005,Stroop,A-1,2STRNS-5,
neutral,right,"[-0.8745098039, -0.2078431373, 0.637254902]", ,11,PECH,,,,,,,,,0,211,211,211,right,1,0.58113475316,2017_Apr_25_1018,98.7779504005,Stroop,A-1,2STRNS-5,
neutral,left,"[0.568627451, -0.7882352941, -0.7882352941]", ,9,PECH,,,,,,,,,0,212,212,212,left,1,0.613640001732,2017_Apr_25_1018,98.7779504005,Stroop,A-1,2STRNS-5,
neutralofneutral,right,"[-0.8745098039, -0.2078431373, 0.637254902]", ,20,MODE,,,,,,,,,0,213,213,213,right,1,0.600279365115,2017_Apr_25_1018,98.7779504005,Stroop,A-1,2STRNS-5,
neutral,down,"[-0.7725490196, 0.0745098039, -1]", ,10,PECH,,,,,,,,,0,214,214,214,down,1,0.57073482803,2017_Apr_25_1018,98.7779504005,Stroop,A-1,2STRNS-5,
neutral,left,"[0.568627451, -0.7882352941, -0.7882352941]", ,12,SOLL,,,,,,,,,0,215,215,215,left,1,0.567550624451,2017_Apr_25_1018,98.7779504005,Stroop,A-1,2STRNS-5,
neutralofneutral,right,"[-0.8745098039, -0.2078431373, 0.637254902]", ,17,HALS,,,,,,,,,0,216,216,216,right,1,0.914019798606,2017_Apr_25_1018,98.7779504005,Stroop,A-1,2STRNS-5,
neutralofneutral,down,"[-0.7725490196, 0.0745098039, -1]", ,16,HALS,,,,,,,,,0,217,217,217,down,1,0.47857590839,2017_Apr_25_1018,98.7779504005,Stroop,A-1,2STRNS-5,
neutralofneutral,down,"[-0.7725490196, 0.0745098039, -1]", ,19,MODE,,,,,,,,,0,218,218,218,down,1,0.577490435237,2017_Apr_25_1018,98.7779504005,Stroop,A-1,2STRNS-5,
neutral,down,"[-0.7725490196, 0.0745098039, -1]", ,13,SOLL,,,,,,,,,0,219,219,219,down,1,0.437394138082,2017_Apr_25_1018,98.7779504005,Stroop,A-1,2STRNS-5,
neutralofneutral,left,"[0.568627451, -0.7882352941, -0.7882352941]", ,18,MODE,,,,,,,,,0,220,220,220,left,1,0.469642091383,2017_Apr_25_1018,98.7779504005,Stroop,A-1,2STRNS-5,
congruent,left,"[0.568627451, -0.7882352941, -0.7882352941]", ,0,ROT,,,,,,,,,0,221,221,221,left,1,0.789376024048,2017_Apr_25_1018,98.7779504005,Stroop,A-1,2STRNS-5,
neutral,right,"[-0.8745098039, -0.2078431373, 0.637254902]", ,14,SOLL,,,,,,,,,0,222,222,222,right,1,0.651700704978,2017_Apr_25_1018,98.7779504005,Stroop,A-1,2STRNS-5,
congruent,down,"[-0.7725490196, 0.0745098039, -1]", ,4,GRÜN,,,,,,,,,0,223,223,223,down,1,0.480279197496,2017_Apr_25_1018,98.7779504005,Stroop,A-1,2STRNS-5,
neutral,left,"[0.568627451, -0.7882352941, -0.7882352941]", ,9,PECH,,,,,,,,,0,224,224,224,left,1,0.557789048608,2017_Apr_25_1018,98.7779504005,Stroop,A-1,2STRNS-5,
congruent,right,"[-0.8745098039, -0.2078431373, 0.637254902]", ,8,BLAU,,,,,,,,,0,225,225,225,right,1,0.865422840054,2017_Apr_25_1018,98.7779504005,Stroop,A-1,2STRNS-5,
neutral,down,"[-0.7725490196, 0.0745098039, -1]", ,13,SOLL,,,,,,,,,0,226,226,226,down,1,0.501629397032,2017_Apr_25_1018,98.7779504005,Stroop,A-1,2STRNS-5,
congruent,right,"[-0.8745098039, -0.2078431373, 0.637254902]", ,8,BLAU,,,,,,,,,0,227,227,227,right,1,0.618547329339,2017_Apr_25_1018,98.7779504005,Stroop,A-1,2STRNS-5,
neutral,left,"[0.568627451, -0.7882352941, -0.7882352941]", ,12,SOLL,,,,,,,,,0,228,228,228,left,1,0.650958711233,2017_Apr_25_1018,98.7779504005,Stroop,A-1,2STRNS-5,
neutral,right,"[-0.8745098039, -0.2078431373, 0.637254902]", ,11,PECH,,,,,,,,,0,229,229,229,right,1,0.600041904767,2017_Apr_25_1018,98.7779504005,Stroop,A-1,2STRNS-5,
neutral,down,"[-0.7725490196, 0.0745098039, -1]", ,10,PECH,,,,,,,,,0,230,230,230,down,1,0.557544604133,2017_Apr_25_1018,98.7779504005,Stroop,A-1,2STRNS-5,
congruent,left,"[0.568627451, -0.7882352941, -0.7882352941]", ,0,ROT,,,,,,,,,0,231,231,231,left,1,0.607843454964,2017_Apr_25_1018,98.7779504005,Stroop,A-1,2STRNS-5,
congruent,down,"[-0.7725490196, 0.0745098039, -1]", ,4,GRÜN,,,,,,,,,0,232,232,232,down,1,1.0650901162,2017_Apr_25_1018,98.7779504005,Stroop,A-1,2STRNS-5,
neutral,down,"[-0.7725490196, 0.0745098039, -1]", ,10,PECH,,,,,,,,,0,233,233,233,down,1,0.59025602416,2017_Apr_25_1018,98.7779504005,Stroop,A-1,2STRNS-5,
incongruent,down,"[-0.7725490196, 0.0745098039, -1]", ,7,BLAU,,,,,,,,,0,234,234,234,down,1,0.811767138002,2017_Apr_25_1018,98.7779504005,Stroop,A-1,2STRNS-5,
incongruent,left,"[0.568627451, -0.7882352941, -0.7882352941]", ,3,GRÜN,,,,,,,,,0,235,235,235,left,1,0.651403460496,2017_Apr_25_1018,98.7779504005,Stroop,A-1,2STRNS-5,
neutral,down,"[-0.7725490196, 0.0745098039, -1]", ,13,SOLL,,,,,,,,,0,236,236,236,down,1,0.747419853641,2017_Apr_25_1018,98.7779504005,Stroop,A-1,2STRNS-5,
neutral,left,"[0.568627451, -0.7882352941, -0.7882352941]", ,12,SOLL,,,,,,,,,0,237,237,237,left,1,0.789159516084,2017_Apr_25_1018,98.7779504005,Stroop,A-1,2STRNS-5,
incongruent,right,"[-0.8745098039, -0.2078431373, 0.637254902]", ,5,GRÜN,,,,,,,,,0,238,238,238,right,1,0.586879617382,2017_Apr_25_1018,98.7779504005,Stroop,A-1,2STRNS-5,
neutral,right,"[-0.8745098039, -0.2078431373, 0.637254902]", ,14,SOLL,,,,,,,,,0,239,239,239,right,1,0.618989564316,2017_Apr_25_1018,98.7779504005,Stroop,A-1,2STRNS-5,
incongruent,right,"[-0.8745098039, -0.2078431373, 0.637254902]", ,2,ROT,,,,,,,,,0,240,240,240,right,1,0.757126394556,2017_Apr_25_1018,98.7779504005,Stroop,A-1,2STRNS-5,
incongruent,left,"[0.568627451, -0.7882352941, -0.7882352941]", ,6,BLAU,,,,,,,,,0,241,241,241,left,1,0.746546278926,2017_Apr_25_1018,98.7779504005,Stroop,A-1,2STRNS-5,
incongruent,down,"[-0.7725490196, 0.0745098039, -1]", ,1,ROT,,,,,,,,,0,242,242,242,down,1,0.6293858577,2017_Apr_25_1018,98.7779504005,Stroop,A-1,2STRNS-5,
neutral,left,"[0.568627451, -0.7882352941, -0.7882352941]", ,9,PECH,,,,,,,,,0,243,243,243,right,0,0.557425035863,2017_Apr_25_1018,98.7779504005,Stroop,A-1,2STRNS-5,
neutral,right,"[-0.8745098039, -0.2078431373, 0.637254902]", ,11,PECH,,,,,,,,,0,244,244,244,right,1,0.782457826344,2017_Apr_25_1018,98.7779504005,Stroop,A-1,2STRNS-5,
fix,return,white, ,21,+,,,,,,,,,0,245,245,245,None,0,,2017_Apr_25_1018,98.7779504005,Stroop,A-1,2STRNS-5,
fix,return,white, ,21,+,,,,,,,,,0,246,246,246,None,0,,2017_Apr_25_1018,98.7779504005,Stroop,A-1,2STRNS-5,
fix,return,white, ,21,+,,,,,,,,,0,247,247,247,None,0,,2017_Apr_25_1018,98.7779504005,Stroop,A-1,2STRNS-5,
fix,return,white, ,21,+,,,,,,,,,0,248,248,248,None,0,,2017_Apr_25_1018,98.7779504005,Stroop,A-1,2STRNS-5,
fix,return,white, ,21,+,,,,,,,,,0,249,249,249,None,0,,2017_Apr_25_1018,98.7779504005,Stroop,A-1,2STRNS-5,
fix,return,white, ,21,+,,,,,,,,,0,250,250,250,None,0,,2017_Apr_25_1018,98.7779504005,Stroop,A-1,2STRNS-5,
fix,return,white, ,21,+,,,,,,,,,0,251,251,251,None,0,,2017_Apr_25_1018,98.7779504005,Stroop,A-1,2STRNS-5,
fix,return,white, ,21,+,,,,,,,,,0,252,252,252,None,0,,2017_Apr_25_1018,98.7779504005,Stroop,A-1,2STRNS-5,
fix,return,white, ,21,+,,,,,,,,,0,253,253,253,None,0,,2017_Apr_25_1018,98.7779504005,Stroop,A-1,2STRNS-5,
fix,return,white, ,21,+,,,,,,,,,0,254,254,254,None,0,,2017_Apr_25_1018,98.7779504005,Stroop,A-1,2STRNS-5,
fix,return,white, ,21,+,,,,,,,,,0,255,255,255,None,0,,2017_Apr_25_1018,98.7779504005,Stroop,A-1,2STRNS-5,
fix,return,white, ,21,+,,,,,,,,,0,256,256,256,None,0,,2017_Apr_25_1018,98.7779504005,Stroop,A-1,2STRNS-5,
fix,return,white,+,22,+,,,,,,,,,0,257,257,257,None,0,,2017_Apr_25_1018,98.7779504005,Stroop,A-1,2STRNS-5,
neutral,left,"[0.568627451, -0.7882352941, -0.7882352941]", ,12,SOLL,,,,,,,,,0,258,258,258,left,1,0.843021668955,2017_Apr_25_1018,98.7779504005,Stroop,A-1,2STRNS-5,
neutralofneutral,right,"[-0.8745098039, -0.2078431373, 0.637254902]", ,20,MODE,,,,,,,,,0,259,259,259,right,1,0.575747476285,2017_Apr_25_1018,98.7779504005,Stroop,A-1,2STRNS-5,
neutral,down,"[-0.7725490196, 0.0745098039, -1]", ,13,SOLL,,,,,,,,,0,260,260,260,down,1,0.608498845524,2017_Apr_25_1018,98.7779504005,Stroop,A-1,2STRNS-5,
neutralofneutral,right,"[-0.8745098039, -0.2078431373, 0.637254902]", ,17,HALS,,,,,,,,,0,261,261,261,right,1,0.807664940656,2017_Apr_25_1018,98.7779504005,Stroop,A-1,2STRNS-5,
neutral,right,"[-0.8745098039, -0.2078431373, 0.637254902]", ,14,SOLL,,,,,,,,,0,262,262,262,right,1,0.57691326691,2017_Apr_25_1018,98.7779504005,Stroop,A-1,2STRNS-5,
neutralofneutral,left,"[0.568627451, -0.7882352941, -0.7882352941]", ,15,HALS,,,,,,,,,0,263,263,263,left,1,0.807063188199,2017_Apr_25_1018,98.7779504005,Stroop,A-1,2STRNS-5,
neutral,right,"[-0.8745098039, -0.2078431373, 0.637254902]", ,11,PECH,,,,,,,,,0,264,264,264,right,1,0.581495134158,2017_Apr_25_1018,98.7779504005,Stroop,A-1,2STRNS-5,
neutralofneutral,down,"[-0.7725490196, 0.0745098039, -1]", ,16,HALS,,,,,,,,,0,265,265,265,down,1,0.586719820536,2017_Apr_25_1018,98.7779504005,Stroop,A-1,2STRNS-5,
neutralofneutral,left,"[0.568627451, -0.7882352941, -0.7882352941]", ,18,MODE,,,,,,,,,0,266,266,266,left,1,0.578846473504,2017_Apr_25_1018,98.7779504005,Stroop,A-1,2STRNS-5,
neutralofneutral,down,"[-0.7725490196, 0.0745098039, -1]", ,19,MODE,,,,,,,,,0,267,267,267,down,1,0.738954531931,2017_Apr_25_1018,98.7779504005,Stroop,A-1,2STRNS-5,
neutral,down,"[-0.7725490196, 0.0745098039, -1]", ,10,PECH,,,,,,,,,0,268,268,268,down,1,0.571517050352,2017_Apr_25_1018,98.7779504005,Stroop,A-1,2STRNS-5,
neutral,left,"[0.568627451, -0.7882352941, -0.7882352941]", ,9,PECH,,,,,,,,,0,269,269,269,left,1,0.689342081186,2017_Apr_25_1018,98.7779504005,Stroop,A-1,2STRNS-5,
neutral,left,"[0.568627451, -0.7882352941, -0.7882352941]", ,9,PECH,,,,,,,,,0,270,270,270,left,1,0.721110923316,2017_Apr_25_1018,98.7779504005,Stroop,A-1,2STRNS-5,
incongruent,right,"[-0.8745098039, -0.2078431373, 0.637254902]", ,2,ROT,,,,,,,,,0,271,271,271,right,1,0.792028037083,2017_Apr_25_1018,98.7779504005,Stroop,A-1,2STRNS-5,
incongruent,left,"[0.568627451, -0.7882352941, -0.7882352941]", ,3,GRÜN,,,,,,,,,0,272,272,272,left,1,1.13263696922,2017_Apr_25_1018,98.7779504005,Stroop,A-1,2STRNS-5,
incongruent,right,"[-0.8745098039, -0.2078431373, 0.637254902]", ,5,GRÜN,,,,,,,,,0,273,273,273,right,1,1.11851506267,2017_Apr_25_1018,98.7779504005,Stroop,A-1,2STRNS-5,
neutral,down,"[-0.7725490196, 0.0745098039, -1]", ,13,SOLL,,,,,,,,,0,274,274,274,down,1,0.682851032743,2017_Apr_25_1018,98.7779504005,Stroop,A-1,2STRNS-5,
neutral,left,"[0.568627451, -0.7882352941, -0.7882352941]", ,12,SOLL,,,,,,,,,0,275,275,275,left,1,0.671842371028,2017_Apr_25_1018,98.7779504005,Stroop,A-1,2STRNS-5,
neutral,right,"[-0.8745098039, -0.2078431373, 0.637254902]", ,14,SOLL,,,,,,,,,0,276,276,276,right,1,0.661382661763,2017_Apr_25_1018,98.7779504005,Stroop,A-1,2STRNS-5,
incongruent,down,"[-0.7725490196, 0.0745098039, -1]", ,7,BLAU,,,,,,,,,0,277,277,277,down,1,0.759167994815,2017_Apr_25_1018,98.7779504005,Stroop,A-1,2STRNS-5,
incongruent,left,"[0.568627451, -0.7882352941, -0.7882352941]", ,6,BLAU,,,,,,,,,0,278,278,278,left,1,0.96528609083,2017_Apr_25_1018,98.7779504005,Stroop,A-1,2STRNS-5,
neutral,down,"[-0.7725490196, 0.0745098039, -1]", ,10,PECH,,,,,,,,,0,279,279,279,down,1,0.463318382644,2017_Apr_25_1018,98.7779504005,Stroop,A-1,2STRNS-5,
incongruent,down,"[-0.7725490196, 0.0745098039, -1]", ,1,ROT,,,,,,,,,0,280,280,280,down,1,0.70735219141,2017_Apr_25_1018,98.7779504005,Stroop,A-1,2STRNS-5,
neutral,right,"[-0.8745098039, -0.2078431373, 0.637254902]", ,11,PECH,,,,,,,,,0,281,281,281,right,1,0.689019973209,2017_Apr_25_1018,98.7779504005,Stroop,A-1,2STRNS-5,
neutral,left,"[0.568627451, -0.7882352941, -0.7882352941]", ,12,SOLL,,,,,,,,,0,282,282,282,left,1,0.578545317911,2017_Apr_25_1018,98.7779504005,Stroop,A-1,2STRNS-5,
congruent,right,"[-0.8745098039, -0.2078431373, 0.637254902]", ,8,BLAU,,,,,,,,,0,283,283,283,right,1,0.611698134819,2017_Apr_25_1018,98.7779504005,Stroop,A-1,2STRNS-5,
congruent,left,"[0.568627451, -0.7882352941, -0.7882352941]", ,0,ROT,,,,,,,,,0,284,284,284,left,1,0.599862831729,2017_Apr_25_1018,98.7779504005,Stroop,A-1,2STRNS-5,
neutral,down,"[-0.7725490196, 0.0745098039, -1]", ,10,PECH,,,,,,,,,0,285,285,285,down,1,0.665732935331,2017_Apr_25_1018,98.7779504005,Stroop,A-1,2STRNS-5,
neutral,right,"[-0.8745098039, -0.2078431373, 0.637254902]", ,11,PECH,,,,,,,,,0,286,286,286,right,1,0.568117735634,2017_Apr_25_1018,98.7779504005,Stroop,A-1,2STRNS-5,
congruent,down,"[-0.7725490196, 0.0745098039, -1]", ,4,GRÜN,,,,,,,,,0,287,287,287,down,1,0.501780254194,2017_Apr_25_1018,98.7779504005,Stroop,A-1,2STRNS-5,
congruent,left,"[0.568627451, -0.7882352941, -0.7882352941]", ,0,ROT,,,,,,,,,0,288,288,288,left,1,0.437316195215,2017_Apr_25_1018,98.7779504005,Stroop,A-1,2STRNS-5,
congruent,right,"[-0.8745098039, -0.2078431373, 0.637254902]", ,8,BLAU,,,,,,,,,0,289,289,289,right,1,0.480503807048,2017_Apr_25_1018,98.7779504005,Stroop,A-1,2STRNS-5,
neutral,down,"[-0.7725490196, 0.0745098039, -1]", ,13,SOLL,,,,,,,,,0,290,290,290,down,1,0.523022898162,2017_Apr_25_1018,98.7779504005,Stroop,A-1,2STRNS-5,
neutral,right,"[-0.8745098039, -0.2078431373, 0.637254902]", ,14,SOLL,,,,,,,,,0,291,291,291,right,1,0.599635707891,2017_Apr_25_1018,98.7779504005,Stroop,A-1,2STRNS-5,
neutral,left,"[0.568627451, -0.7882352941, -0.7882352941]", ,9,PECH,,,,,,,,,0,292,292,292,left,1,0.636059610928,2017_Apr_25_1018,98.7779504005,Stroop,A-1,2STRNS-5,
congruent,down,"[-0.7725490196, 0.0745098039, -1]", ,4,GRÜN,,,,,,,,,0,293,293,293,down,1,0.460837620424,2017_Apr_25_1018,98.7779504005,Stroop,A-1,2STRNS-5,
fix,return,white, ,21,+,,,,,,,,,0,294,294,294,None,0,,2017_Apr_25_1018,98.7779504005,Stroop,A-1,2STRNS-5,
fix,return,white, ,21,+,,,,,,,,,0,295,295,295,None,0,,2017_Apr_25_1018,98.7779504005,Stroop,A-1,2STRNS-5,
fix,return,white, ,21,+,,,,,,,,,0,296,296,296,None,0,,2017_Apr_25_1018,98.7779504005,Stroop,A-1,2STRNS-5,
fix,return,white, ,21,+,,,,,,,,,0,297,297,297,None,0,,2017_Apr_25_1018,98.7779504005,Stroop,A-1,2STRNS-5,
fix,return,white, ,21,+,,,,,,,,,0,298,298,298,None,0,,2017_Apr_25_1018,98.7779504005,Stroop,A-1,2STRNS-5,
fix,return,white, ,21,+,,,,,,,,,0,299,299,299,None,0,,2017_Apr_25_1018,98.7779504005,Stroop,A-1,2STRNS-5,
fix,return,white, ,21,+,,,,,,,,,0,300,300,300,None,0,,2017_Apr_25_1018,98.7779504005,Stroop,A-1,2STRNS-5,
fix,return,white, ,21,+,,,,,,,,,0,301,301,301,None,0,,2017_Apr_25_1018,98.7779504005,Stroop,A-1,2STRNS-5,
fix,return,white, ,21,+,,,,,,,,,0,302,302,302,None,0,,2017_Apr_25_1018,98.7779504005,Stroop,A-1,2STRNS-5,
fix,return,white, ,21,+,,,,,,,,,0,303,303,303,None,0,,2017_Apr_25_1018,98.7779504005,Stroop,A-1,2STRNS-5,
fix,return,white, ,21,+,,,,,,,,,0,304,304,304,None,0,,2017_Apr_25_1018,98.7779504005,Stroop,A-1,2STRNS-5,
fix,return,white, ,21,+,,,,,,,,,0,305,305,305,None,0,,2017_Apr_25_1018,98.7779504005,Stroop,A-1,2STRNS-5,
fix,return,white,+,22,+,,,,,,,,,0,306,306,306,None,0,,2017_Apr_25_1018,98.7779504005,Stroop,A-1,2STRNS-5,
