best_paramset_1 = [133.132680343, 0.58006311708699998, 19.134512365300001, 3.0125881590299999, 154.03530696799999, 318.86764593499998, 100.606442696]
best_paramset_statistic_1 = 7.44689410615
best_paramset_2 = [113.688650958, 0.57411910789800003, 22.274875869799999, 3.1447599401600002, 153.12967777099999, 349.24738727499999, 136.17044540200001]
best_paramset_statistic_2 = 8.83383130075
ID = "Tarana_propersims_48"