best_paramset_1 = [80.187481153099995, 0.30696786197999998, 28.146876277499999, 3.3594546117199999, 112.189279704, 350.18600607399998, 72.472127777200001]
best_paramset_statistic_1 = 15.2502722844
best_paramset_2 = [80.961199441299996, 0.303375831865, 28.136796738200001, 3.4614017062900002, 101.916895173, 350.08365252499999, 74.359181371299996]
best_paramset_statistic_2 = 15.472914585
ID = "Tarana_propersims_12"