best_paramset_1 = [96.116311004300002, 0.40433615990799998, 30.5004312704, 4.8797146041400001, 65.186854818900002, 477.97799093600003, 121.768267939]
best_paramset_statistic_1 = 4.27666512359
best_paramset_2 = [92.365896470099997, 0.39408517003900001, 29.120736832199999, 3.8001805900700001, 89.543749546000001, 482.26340628200001, 108.354218296]
best_paramset_statistic_2 = 5.93036062814
ID = "Tarana_propersims_2"