congruent,corrAns,letterColor,signal,selectedrownumber_novariable,Anzeigetext,practice.thisRepN,practice.thisTrialN,practice.thisN,practice.thisIndex,Wrongresponse.thisRepN,Wrongresponse.thisTrialN,Wrongresponse.thisN,Wrongresponse.thisIndex,trials.thisRepN,trials.thisTrialN,trials.thisN,trials.thisIndex,resp.keys,resp.corr,resp.rt,date,frameRate,expName,session,participant,
incongruent,right,"[-0.8745098039, -0.2078431373, 0.637254902]", ,5,GRÜN,0,0,0,0,0,0,0,0,,,,,right,1,0.933450201073,2017_Mai_15_1220,98.8024885935,Stroop,B-1,2STRNS-8,
,,,,,,0,0,0,0,,,,,,,,,,,,2017_Mai_15_1220,98.8024885935,Stroop,B-1,2STRNS-8,
neutralofneutral,left,"[0.568627451, -0.7882352941, -0.7882352941]", ,15,HALS,1,0,1,0,0,0,0,0,,,,,left,1,0.908773601114,2017_Mai_15_1220,98.8024885935,Stroop,B-1,2STRNS-8,
,,,,,,1,0,1,0,,,,,,,,,,,,2017_Mai_15_1220,98.8024885935,Stroop,B-1,2STRNS-8,
neutral,down,"[-0.7725490196, 0.0745098039, -1]", ,10,PECH,2,0,2,0,0,0,0,0,,,,,down,1,0.493950767486,2017_Mai_15_1220,98.8024885935,Stroop,B-1,2STRNS-8,
,,,,,,2,0,2,0,,,,,,,,,,,,2017_Mai_15_1220,98.8024885935,Stroop,B-1,2STRNS-8,
neutralofneutral,left,"[0.568627451, -0.7882352941, -0.7882352941]", ,15,HALS,3,0,3,0,0,0,0,0,,,,,left,1,0.695571923247,2017_Mai_15_1220,98.8024885935,Stroop,B-1,2STRNS-8,
,,,,,,3,0,3,0,,,,,,,,,,,,2017_Mai_15_1220,98.8024885935,Stroop,B-1,2STRNS-8,
neutral,left,"[0.568627451, -0.7882352941, -0.7882352941]", ,12,SOLL,4,0,4,0,0,0,0,0,,,,,left,1,0.408865931285,2017_Mai_15_1220,98.8024885935,Stroop,B-1,2STRNS-8,
,,,,,,4,0,4,0,,,,,,,,,,,,2017_Mai_15_1220,98.8024885935,Stroop,B-1,2STRNS-8,
neutral,down,"[-0.7725490196, 0.0745098039, -1]", ,10,PECH,5,0,5,0,0,0,0,0,,,,,down,1,0.470402523226,2017_Mai_15_1220,98.8024885935,Stroop,B-1,2STRNS-8,
,,,,,,5,0,5,0,,,,,,,,,,,,2017_Mai_15_1220,98.8024885935,Stroop,B-1,2STRNS-8,
neutralofneutral,right,"[-0.8745098039, -0.2078431373, 0.637254902]", ,17,HALS,6,0,6,0,0,0,0,0,,,,,right,1,0.543750951588,2017_Mai_15_1220,98.8024885935,Stroop,B-1,2STRNS-8,
,,,,,,6,0,6,0,,,,,,,,,,,,2017_Mai_15_1220,98.8024885935,Stroop,B-1,2STRNS-8,
neutralofneutral,right,"[-0.8745098039, -0.2078431373, 0.637254902]", ,17,HALS,7,0,7,0,0,0,0,0,,,,,right,1,0.543786430957,2017_Mai_15_1220,98.8024885935,Stroop,B-1,2STRNS-8,
,,,,,,7,0,7,0,,,,,,,,,,,,2017_Mai_15_1220,98.8024885935,Stroop,B-1,2STRNS-8,
neutralofneutral,left,"[0.568627451, -0.7882352941, -0.7882352941]", ,15,HALS,8,0,8,0,0,0,0,0,,,,,left,1,0.616996014857,2017_Mai_15_1220,98.8024885935,Stroop,B-1,2STRNS-8,
,,,,,,8,0,8,0,,,,,,,,,,,,2017_Mai_15_1220,98.8024885935,Stroop,B-1,2STRNS-8,
incongruent,left,"[0.568627451, -0.7882352941, -0.7882352941]", ,3,GRÜN,9,0,9,0,0,0,0,0,,,,,left,1,0.8560353341,2017_Mai_15_1220,98.8024885935,Stroop,B-1,2STRNS-8,
,,,,,,9,0,9,0,,,,,,,,,,,,2017_Mai_15_1220,98.8024885935,Stroop,B-1,2STRNS-8,
neutralofneutral,down,"[-0.7725490196, 0.0745098039, -1]", ,16,HALS,10,0,10,0,0,0,0,0,,,,,down,1,1.06396036368,2017_Mai_15_1220,98.8024885935,Stroop,B-1,2STRNS-8,
,,,,,,10,0,10,0,,,,,,,,,,,,2017_Mai_15_1220,98.8024885935,Stroop,B-1,2STRNS-8,
neutralofneutral,down,"[-0.7725490196, 0.0745098039, -1]", ,19,MODE,11,0,11,0,0,0,0,0,,,,,down,1,0.415541640069,2017_Mai_15_1220,98.8024885935,Stroop,B-1,2STRNS-8,
,,,,,,11,0,11,0,,,,,,,,,,,,2017_Mai_15_1220,98.8024885935,Stroop,B-1,2STRNS-8,
incongruent,left,"[0.568627451, -0.7882352941, -0.7882352941]", ,6,BLAU,12,0,12,0,0,0,0,0,,,,,left,1,0.727430162213,2017_Mai_15_1220,98.8024885935,Stroop,B-1,2STRNS-8,
,,,,,,12,0,12,0,,,,,,,,,,,,2017_Mai_15_1220,98.8024885935,Stroop,B-1,2STRNS-8,
neutralofneutral,left,"[0.568627451, -0.7882352941, -0.7882352941]", ,15,HALS,13,0,13,0,0,0,0,0,,,,,left,1,0.530882556303,2017_Mai_15_1220,98.8024885935,Stroop,B-1,2STRNS-8,
,,,,,,13,0,13,0,,,,,,,,,,,,2017_Mai_15_1220,98.8024885935,Stroop,B-1,2STRNS-8,
neutral,left,"[0.568627451, -0.7882352941, -0.7882352941]", ,12,SOLL,14,0,14,0,0,0,0,0,,,,,left,1,0.556218457933,2017_Mai_15_1220,98.8024885935,Stroop,B-1,2STRNS-8,
,,,,,,14,0,14,0,,,,,,,,,,,,2017_Mai_15_1220,98.8024885935,Stroop,B-1,2STRNS-8,
neutralofneutral,down,"[-0.7725490196, 0.0745098039, -1]", ,19,MODE,15,0,15,0,0,0,0,0,,,,,down,1,0.883579616962,2017_Mai_15_1220,98.8024885935,Stroop,B-1,2STRNS-8,
,,,,,,15,0,15,0,,,,,,,,,,,,2017_Mai_15_1220,98.8024885935,Stroop,B-1,2STRNS-8,
congruent,left,"[0.568627451, -0.7882352941, -0.7882352941]", ,0,ROT,16,0,16,0,0,0,0,0,,,,,left,1,0.493875338905,2017_Mai_15_1220,98.8024885935,Stroop,B-1,2STRNS-8,
,,,,,,16,0,16,0,,,,,,,,,,,,2017_Mai_15_1220,98.8024885935,Stroop,B-1,2STRNS-8,
neutralofneutral,left,"[0.568627451, -0.7882352941, -0.7882352941]", ,15,HALS,17,0,17,0,0,0,0,0,,,,,left,1,0.436837363408,2017_Mai_15_1220,98.8024885935,Stroop,B-1,2STRNS-8,
,,,,,,17,0,17,0,,,,,,,,,,,,2017_Mai_15_1220,98.8024885935,Stroop,B-1,2STRNS-8,
incongruent,right,"[-0.8745098039, -0.2078431373, 0.637254902]", ,2,ROT,18,0,18,0,0,0,0,0,,,,,right,1,0.665893849637,2017_Mai_15_1220,98.8024885935,Stroop,B-1,2STRNS-8,
,,,,,,18,0,18,0,,,,,,,,,,,,2017_Mai_15_1220,98.8024885935,Stroop,B-1,2STRNS-8,
incongruent,right,"[-0.8745098039, -0.2078431373, 0.637254902]", ,5,GRÜN,19,0,19,0,0,0,0,0,,,,,right,1,0.525826606454,2017_Mai_15_1220,98.8024885935,Stroop,B-1,2STRNS-8,
,,,,,,19,0,19,0,,,,,,,,,,,,2017_Mai_15_1220,98.8024885935,Stroop,B-1,2STRNS-8,
incongruent,right,"[-0.8745098039, -0.2078431373, 0.637254902]", ,5,GRÜN,20,0,20,0,0,0,0,0,,,,,right,1,0.471716936091,2017_Mai_15_1220,98.8024885935,Stroop,B-1,2STRNS-8,
,,,,,,20,0,20,0,,,,,,,,,,,,2017_Mai_15_1220,98.8024885935,Stroop,B-1,2STRNS-8,
neutralofneutral,right,"[-0.8745098039, -0.2078431373, 0.637254902]", ,20,MODE,21,0,21,0,0,0,0,0,,,,,right,1,0.501383555731,2017_Mai_15_1220,98.8024885935,Stroop,B-1,2STRNS-8,
,,,,,,21,0,21,0,,,,,,,,,,,,2017_Mai_15_1220,98.8024885935,Stroop,B-1,2STRNS-8,
neutralofneutral,down,"[-0.7725490196, 0.0745098039, -1]", ,19,MODE,22,0,22,0,0,0,0,0,,,,,down,1,0.640143370177,2017_Mai_15_1220,98.8024885935,Stroop,B-1,2STRNS-8,
,,,,,,22,0,22,0,,,,,,,,,,,,2017_Mai_15_1220,98.8024885935,Stroop,B-1,2STRNS-8,
neutralofneutral,left,"[0.568627451, -0.7882352941, -0.7882352941]", ,18,MODE,23,0,23,0,0,0,0,0,,,,,left,1,0.597656685417,2017_Mai_15_1220,98.8024885935,Stroop,B-1,2STRNS-8,
,,,,,,23,0,23,0,,,,,,,,,,,,2017_Mai_15_1220,98.8024885935,Stroop,B-1,2STRNS-8,
congruent,left,"[0.568627451, -0.7882352941, -0.7882352941]", ,0,ROT,24,0,24,0,0,0,0,0,,,,,left,1,0.387980036569,2017_Mai_15_1220,98.8024885935,Stroop,B-1,2STRNS-8,
,,,,,,24,0,24,0,,,,,,,,,,,,2017_Mai_15_1220,98.8024885935,Stroop,B-1,2STRNS-8,
neutralofneutral,left,"[0.568627451, -0.7882352941, -0.7882352941]", ,18,MODE,25,0,25,0,0,0,0,0,,,,,left,1,0.544085630995,2017_Mai_15_1220,98.8024885935,Stroop,B-1,2STRNS-8,
,,,,,,25,0,25,0,,,,,,,,,,,,2017_Mai_15_1220,98.8024885935,Stroop,B-1,2STRNS-8,
neutral,left,"[0.568627451, -0.7882352941, -0.7882352941]", ,9,PECH,26,0,26,0,0,0,0,0,,,,,left,1,0.534851775854,2017_Mai_15_1220,98.8024885935,Stroop,B-1,2STRNS-8,
,,,,,,26,0,26,0,,,,,,,,,,,,2017_Mai_15_1220,98.8024885935,Stroop,B-1,2STRNS-8,
neutralofneutral,left,"[0.568627451, -0.7882352941, -0.7882352941]", ,15,HALS,27,0,27,0,0,0,0,0,,,,,left,1,0.468569329342,2017_Mai_15_1220,98.8024885935,Stroop,B-1,2STRNS-8,
,,,,,,27,0,27,0,,,,,,,,,,,,2017_Mai_15_1220,98.8024885935,Stroop,B-1,2STRNS-8,
neutralofneutral,left,"[0.568627451, -0.7882352941, -0.7882352941]", ,18,MODE,28,0,28,0,0,0,0,0,,,,,left,1,0.44743787269,2017_Mai_15_1220,98.8024885935,Stroop,B-1,2STRNS-8,
,,,,,,28,0,28,0,,,,,,,,,,,,2017_Mai_15_1220,98.8024885935,Stroop,B-1,2STRNS-8,
neutral,left,"[0.568627451, -0.7882352941, -0.7882352941]", ,12,SOLL,29,0,29,0,0,0,0,0,,,,,left,1,0.537738176221,2017_Mai_15_1220,98.8024885935,Stroop,B-1,2STRNS-8,
,,,,,,29,0,29,0,,,,,,,,,,,,2017_Mai_15_1220,98.8024885935,Stroop,B-1,2STRNS-8,
neutral,right,"[-0.8745098039, -0.2078431373, 0.637254902]", ,11,PECH,30,0,30,0,0,0,0,0,,,,,right,1,0.644925542213,2017_Mai_15_1220,98.8024885935,Stroop,B-1,2STRNS-8,
,,,,,,30,0,30,0,,,,,,,,,,,,2017_Mai_15_1220,98.8024885935,Stroop,B-1,2STRNS-8,
congruent,left,"[0.568627451, -0.7882352941, -0.7882352941]", ,0,ROT,31,0,31,0,0,0,0,0,,,,,left,1,0.607130515191,2017_Mai_15_1220,98.8024885935,Stroop,B-1,2STRNS-8,
,,,,,,31,0,31,0,,,,,,,,,,,,2017_Mai_15_1220,98.8024885935,Stroop,B-1,2STRNS-8,
neutral,right,"[-0.8745098039, -0.2078431373, 0.637254902]", ,11,PECH,32,0,32,0,0,0,0,0,,,,,right,1,0.729804206959,2017_Mai_15_1220,98.8024885935,Stroop,B-1,2STRNS-8,
,,,,,,32,0,32,0,,,,,,,,,,,,2017_Mai_15_1220,98.8024885935,Stroop,B-1,2STRNS-8,
neutral,down,"[-0.7725490196, 0.0745098039, -1]", ,13,SOLL,33,0,33,0,0,0,0,0,,,,,down,1,0.397377320302,2017_Mai_15_1220,98.8024885935,Stroop,B-1,2STRNS-8,
,,,,,,33,0,33,0,,,,,,,,,,,,2017_Mai_15_1220,98.8024885935,Stroop,B-1,2STRNS-8,
incongruent,right,"[-0.8745098039, -0.2078431373, 0.637254902]", ,2,ROT,34,0,34,0,0,0,0,0,,,,,right,1,0.916472624314,2017_Mai_15_1220,98.8024885935,Stroop,B-1,2STRNS-8,
,,,,,,34,0,34,0,,,,,,,,,,,,2017_Mai_15_1220,98.8024885935,Stroop,B-1,2STRNS-8,
congruent,left,"[0.568627451, -0.7882352941, -0.7882352941]", ,0,ROT,35,0,35,0,0,0,0,0,,,,,left,1,0.635910709322,2017_Mai_15_1220,98.8024885935,Stroop,B-1,2STRNS-8,
,,,,,,35,0,35,0,,,,,,,,,,,,2017_Mai_15_1220,98.8024885935,Stroop,B-1,2STRNS-8,
congruent,left,"[0.568627451, -0.7882352941, -0.7882352941]", ,0,ROT,36,0,36,0,0,0,0,0,,,,,left,1,0.41891273891,2017_Mai_15_1220,98.8024885935,Stroop,B-1,2STRNS-8,
,,,,,,36,0,36,0,,,,,,,,,,,,2017_Mai_15_1220,98.8024885935,Stroop,B-1,2STRNS-8,
neutral,right,"[-0.8745098039, -0.2078431373, 0.637254902]", ,11,PECH,37,0,37,0,0,0,0,0,,,,,right,1,0.89543335815,2017_Mai_15_1220,98.8024885935,Stroop,B-1,2STRNS-8,
,,,,,,37,0,37,0,,,,,,,,,,,,2017_Mai_15_1220,98.8024885935,Stroop,B-1,2STRNS-8,
incongruent,left,"[0.568627451, -0.7882352941, -0.7882352941]", ,6,BLAU,38,0,38,0,0,0,0,0,,,,,left,1,1.20860947411,2017_Mai_15_1220,98.8024885935,Stroop,B-1,2STRNS-8,
,,,,,,38,0,38,0,,,,,,,,,,,,2017_Mai_15_1220,98.8024885935,Stroop,B-1,2STRNS-8,
congruent,right,"[-0.8745098039, -0.2078431373, 0.637254902]", ,8,BLAU,39,0,39,0,0,0,0,0,,,,,right,1,0.665411386084,2017_Mai_15_1220,98.8024885935,Stroop,B-1,2STRNS-8,
,,,,,,39,0,39,0,,,,,,,,,,,,2017_Mai_15_1220,98.8024885935,Stroop,B-1,2STRNS-8,
incongruent,right,"[-0.8745098039, -0.2078431373, 0.637254902]", ,2,ROT,40,0,40,0,0,0,0,0,,,,,right,1,0.820014275557,2017_Mai_15_1220,98.8024885935,Stroop,B-1,2STRNS-8,
,,,,,,40,0,40,0,,,,,,,,,,,,2017_Mai_15_1220,98.8024885935,Stroop,B-1,2STRNS-8,
neutral,down,"[-0.7725490196, 0.0745098039, -1]", ,10,PECH,41,0,41,0,0,0,0,0,,,,,down,1,0.644816589818,2017_Mai_15_1220,98.8024885935,Stroop,B-1,2STRNS-8,
,,,,,,41,0,41,0,,,,,,,,,,,,2017_Mai_15_1220,98.8024885935,Stroop,B-1,2STRNS-8,
neutralofneutral,down,"[-0.7725490196, 0.0745098039, -1]", ,19,MODE,42,0,42,0,0,0,0,0,,,,,down,1,0.49203823391,2017_Mai_15_1220,98.8024885935,Stroop,B-1,2STRNS-8,
,,,,,,42,0,42,0,,,,,,,,,,,,2017_Mai_15_1220,98.8024885935,Stroop,B-1,2STRNS-8,
neutralofneutral,left,"[0.568627451, -0.7882352941, -0.7882352941]", ,15,HALS,43,0,43,0,0,0,0,0,,,,,left,1,0.566510548128,2017_Mai_15_1220,98.8024885935,Stroop,B-1,2STRNS-8,
,,,,,,43,0,43,0,,,,,,,,,,,,2017_Mai_15_1220,98.8024885935,Stroop,B-1,2STRNS-8,
incongruent,right,"[-0.8745098039, -0.2078431373, 0.637254902]", ,5,GRÜN,44,0,44,0,0,0,0,0,,,,,right,1,0.933452994724,2017_Mai_15_1220,98.8024885935,Stroop,B-1,2STRNS-8,
,,,,,,44,0,44,0,,,,,,,,,,,,2017_Mai_15_1220,98.8024885935,Stroop,B-1,2STRNS-8,
neutralofneutral,right,"[-0.8745098039, -0.2078431373, 0.637254902]", ,20,MODE,45,0,45,0,0,0,0,0,,,,,right,1,0.543444767422,2017_Mai_15_1220,98.8024885935,Stroop,B-1,2STRNS-8,
,,,,,,45,0,45,0,,,,,,,,,,,,2017_Mai_15_1220,98.8024885935,Stroop,B-1,2STRNS-8,
neutralofneutral,left,"[0.568627451, -0.7882352941, -0.7882352941]", ,15,HALS,46,0,46,0,0,0,0,0,,,,,left,1,0.680838207091,2017_Mai_15_1220,98.8024885935,Stroop,B-1,2STRNS-8,
,,,,,,46,0,46,0,,,,,,,,,,,,2017_Mai_15_1220,98.8024885935,Stroop,B-1,2STRNS-8,
neutralofneutral,down,"[-0.7725490196, 0.0745098039, -1]", ,16,HALS,47,0,47,0,0,0,0,0,,,,,down,1,0.620243634316,2017_Mai_15_1220,98.8024885935,Stroop,B-1,2STRNS-8,
,,,,,,47,0,47,0,,,,,,,,,,,,2017_Mai_15_1220,98.8024885935,Stroop,B-1,2STRNS-8,
neutralofneutral,down,"[-0.7725490196, 0.0745098039, -1]", ,16,HALS,48,0,48,0,0,0,0,0,,,,,down,1,0.510038566354,2017_Mai_15_1220,98.8024885935,Stroop,B-1,2STRNS-8,
,,,,,,48,0,48,0,,,,,,,,,,,,2017_Mai_15_1220,98.8024885935,Stroop,B-1,2STRNS-8,
neutral,down,"[-0.7725490196, 0.0745098039, -1]", ,13,SOLL,49,0,49,0,0,0,0,0,,,,,down,1,0.429587000583,2017_Mai_15_1220,98.8024885935,Stroop,B-1,2STRNS-8,
,,,,,,49,0,49,0,,,,,,,,,,,,2017_Mai_15_1220,98.8024885935,Stroop,B-1,2STRNS-8,
fix,return,white, ,21,+,,,,,,,,,0,0,0,0,None,0,,2017_Mai_15_1220,98.8024885935,Stroop,B-1,2STRNS-8,
fix,return,white, ,21,+,,,,,,,,,0,1,1,1,None,0,,2017_Mai_15_1220,98.8024885935,Stroop,B-1,2STRNS-8,
fix,return,white, ,21,+,,,,,,,,,0,2,2,2,None,0,,2017_Mai_15_1220,98.8024885935,Stroop,B-1,2STRNS-8,
fix,return,white, ,21,+,,,,,,,,,0,3,3,3,None,0,,2017_Mai_15_1220,98.8024885935,Stroop,B-1,2STRNS-8,
fix,return,white, ,21,+,,,,,,,,,0,4,4,4,None,0,,2017_Mai_15_1220,98.8024885935,Stroop,B-1,2STRNS-8,
fix,return,white, ,21,+,,,,,,,,,0,5,5,5,None,0,,2017_Mai_15_1220,98.8024885935,Stroop,B-1,2STRNS-8,
fix,return,white, ,21,+,,,,,,,,,0,6,6,6,None,0,,2017_Mai_15_1220,98.8024885935,Stroop,B-1,2STRNS-8,
fix,return,white, ,21,+,,,,,,,,,0,7,7,7,None,0,,2017_Mai_15_1220,98.8024885935,Stroop,B-1,2STRNS-8,
fix,return,white, ,21,+,,,,,,,,,0,8,8,8,None,0,,2017_Mai_15_1220,98.8024885935,Stroop,B-1,2STRNS-8,
fix,return,white, ,21,+,,,,,,,,,0,9,9,9,None,0,,2017_Mai_15_1220,98.8024885935,Stroop,B-1,2STRNS-8,
fix,return,white, ,21,+,,,,,,,,,0,10,10,10,None,0,,2017_Mai_15_1220,98.8024885935,Stroop,B-1,2STRNS-8,
fix,return,white, ,21,+,,,,,,,,,0,11,11,11,None,0,,2017_Mai_15_1220,98.8024885935,Stroop,B-1,2STRNS-8,
fix,return,white,+,22,+,,,,,,,,,0,12,12,12,None,0,,2017_Mai_15_1220,98.8024885935,Stroop,B-1,2STRNS-8,
neutralofneutral,down,"[-0.7725490196, 0.0745098039, -1]", ,16,HALS,,,,,,,,,0,13,13,13,down,1,1.11599127822,2017_Mai_15_1220,98.8024885935,Stroop,B-1,2STRNS-8,
neutralofneutral,left,"[0.568627451, -0.7882352941, -0.7882352941]", ,18,MODE,,,,,,,,,0,14,14,14,left,1,0.618311265817,2017_Mai_15_1220,98.8024885935,Stroop,B-1,2STRNS-8,
neutral,down,"[-0.7725490196, 0.0745098039, -1]", ,10,PECH,,,,,,,,,0,15,15,15,down,1,0.589073471628,2017_Mai_15_1220,98.8024885935,Stroop,B-1,2STRNS-8,
neutral,right,"[-0.8745098039, -0.2078431373, 0.637254902]", ,14,SOLL,,,,,,,,,0,16,16,16,right,1,0.589067884326,2017_Mai_15_1220,98.8024885935,Stroop,B-1,2STRNS-8,
neutralofneutral,right,"[-0.8745098039, -0.2078431373, 0.637254902]", ,17,HALS,,,,,,,,,0,17,17,17,right,1,0.437210595201,2017_Mai_15_1220,98.8024885935,Stroop,B-1,2STRNS-8,
neutralofneutral,right,"[-0.8745098039, -0.2078431373, 0.637254902]", ,20,MODE,,,,,,,,,0,18,18,18,right,1,0.501098882679,2017_Mai_15_1220,98.8024885935,Stroop,B-1,2STRNS-8,
neutral,left,"[0.568627451, -0.7882352941, -0.7882352941]", ,12,SOLL,,,,,,,,,0,19,19,19,left,1,0.70642749288,2017_Mai_15_1220,98.8024885935,Stroop,B-1,2STRNS-8,
neutralofneutral,down,"[-0.7725490196, 0.0745098039, -1]", ,19,MODE,,,,,,,,,0,20,20,20,down,1,0.479810981563,2017_Mai_15_1220,98.8024885935,Stroop,B-1,2STRNS-8,
neutral,down,"[-0.7725490196, 0.0745098039, -1]", ,13,SOLL,,,,,,,,,0,21,21,21,down,1,0.405944610279,2017_Mai_15_1220,98.8024885935,Stroop,B-1,2STRNS-8,
neutralofneutral,left,"[0.568627451, -0.7882352941, -0.7882352941]", ,15,HALS,,,,,,,,,0,22,22,22,left,1,0.595276494638,2017_Mai_15_1220,98.8024885935,Stroop,B-1,2STRNS-8,
neutral,right,"[-0.8745098039, -0.2078431373, 0.637254902]", ,11,PECH,,,,,,,,,0,23,23,23,right,1,0.672806739404,2017_Mai_15_1220,98.8024885935,Stroop,B-1,2STRNS-8,
neutral,left,"[0.568627451, -0.7882352941, -0.7882352941]", ,9,PECH,,,,,,,,,0,24,24,24,left,1,0.534072626549,2017_Mai_15_1220,98.8024885935,Stroop,B-1,2STRNS-8,
neutral,down,"[-0.7725490196, 0.0745098039, -1]", ,10,PECH,,,,,,,,,0,25,25,25,down,1,0.534555928198,2017_Mai_15_1220,98.8024885935,Stroop,B-1,2STRNS-8,
congruent,right,"[-0.8745098039, -0.2078431373, 0.637254902]", ,8,BLAU,,,,,,,,,0,26,26,26,right,1,0.792512176827,2017_Mai_15_1220,98.8024885935,Stroop,B-1,2STRNS-8,
congruent,right,"[-0.8745098039, -0.2078431373, 0.637254902]", ,8,BLAU,,,,,,,,,0,27,27,27,right,1,0.385695109295,2017_Mai_15_1220,98.8024885935,Stroop,B-1,2STRNS-8,
neutral,right,"[-0.8745098039, -0.2078431373, 0.637254902]", ,11,PECH,,,,,,,,,0,28,28,28,right,1,0.450087092074,2017_Mai_15_1220,98.8024885935,Stroop,B-1,2STRNS-8,
neutral,right,"[-0.8745098039, -0.2078431373, 0.637254902]", ,14,SOLL,,,,,,,,,0,29,29,29,right,1,0.483001331175,2017_Mai_15_1220,98.8024885935,Stroop,B-1,2STRNS-8,
congruent,left,"[0.568627451, -0.7882352941, -0.7882352941]", ,0,ROT,,,,,,,,,0,30,30,30,left,1,0.539101198616,2017_Mai_15_1220,98.8024885935,Stroop,B-1,2STRNS-8,
neutral,left,"[0.568627451, -0.7882352941, -0.7882352941]", ,12,SOLL,,,,,,,,,0,31,31,31,left,1,0.397410285386,2017_Mai_15_1220,98.8024885935,Stroop,B-1,2STRNS-8,
congruent,down,"[-0.7725490196, 0.0745098039, -1]", ,4,GRÜN,,,,,,,,,0,32,32,32,down,1,0.494136824652,2017_Mai_15_1220,98.8024885935,Stroop,B-1,2STRNS-8,
neutral,down,"[-0.7725490196, 0.0745098039, -1]", ,13,SOLL,,,,,,,,,0,33,33,33,down,1,0.386494652253,2017_Mai_15_1220,98.8024885935,Stroop,B-1,2STRNS-8,
congruent,down,"[-0.7725490196, 0.0745098039, -1]", ,4,GRÜN,,,,,,,,,0,34,34,34,down,1,0.429181641801,2017_Mai_15_1220,98.8024885935,Stroop,B-1,2STRNS-8,
neutral,left,"[0.568627451, -0.7882352941, -0.7882352941]", ,9,PECH,,,,,,,,,0,35,35,35,left,1,0.44866512364,2017_Mai_15_1220,98.8024885935,Stroop,B-1,2STRNS-8,
congruent,left,"[0.568627451, -0.7882352941, -0.7882352941]", ,0,ROT,,,,,,,,,0,36,36,36,left,1,0.343519357907,2017_Mai_15_1220,98.8024885935,Stroop,B-1,2STRNS-8,
incongruent,right,"[-0.8745098039, -0.2078431373, 0.637254902]", ,2,ROT,,,,,,,,,0,37,37,37,right,1,0.536460918916,2017_Mai_15_1220,98.8024885935,Stroop,B-1,2STRNS-8,
incongruent,left,"[0.568627451, -0.7882352941, -0.7882352941]", ,3,GRÜN,,,,,,,,,0,38,38,38,left,1,0.566593798933,2017_Mai_15_1220,98.8024885935,Stroop,B-1,2STRNS-8,
neutral,down,"[-0.7725490196, 0.0745098039, -1]", ,13,SOLL,,,,,,,,,0,39,39,39,down,1,0.448588856964,2017_Mai_15_1220,98.8024885935,Stroop,B-1,2STRNS-8,
incongruent,right,"[-0.8745098039, -0.2078431373, 0.637254902]", ,5,GRÜN,,,,,,,,,0,40,40,40,right,1,0.611830553883,2017_Mai_15_1220,98.8024885935,Stroop,B-1,2STRNS-8,
neutral,right,"[-0.8745098039, -0.2078431373, 0.637254902]", ,11,PECH,,,,,,,,,0,41,41,41,right,1,0.674678206308,2017_Mai_15_1220,98.8024885935,Stroop,B-1,2STRNS-8,
incongruent,left,"[0.568627451, -0.7882352941, -0.7882352941]", ,6,BLAU,,,,,,,,,0,42,42,42,left,1,0.773112783887,2017_Mai_15_1220,98.8024885935,Stroop,B-1,2STRNS-8,
neutral,right,"[-0.8745098039, -0.2078431373, 0.637254902]", ,14,SOLL,,,,,,,,,0,43,43,43,right,1,0.589585268519,2017_Mai_15_1220,98.8024885935,Stroop,B-1,2STRNS-8,
incongruent,down,"[-0.7725490196, 0.0745098039, -1]", ,1,ROT,,,,,,,,,0,44,44,44,down,1,0.6789161751,2017_Mai_15_1220,98.8024885935,Stroop,B-1,2STRNS-8,
incongruent,down,"[-0.7725490196, 0.0745098039, -1]", ,7,BLAU,,,,,,,,,0,45,45,45,down,1,0.386558347499,2017_Mai_15_1220,98.8024885935,Stroop,B-1,2STRNS-8,
neutral,left,"[0.568627451, -0.7882352941, -0.7882352941]", ,9,PECH,,,,,,,,,0,46,46,46,left,1,0.526058479499,2017_Mai_15_1220,98.8024885935,Stroop,B-1,2STRNS-8,
neutral,left,"[0.568627451, -0.7882352941, -0.7882352941]", ,12,SOLL,,,,,,,,,0,47,47,47,left,1,0.386425369705,2017_Mai_15_1220,98.8024885935,Stroop,B-1,2STRNS-8,
neutral,down,"[-0.7725490196, 0.0745098039, -1]", ,10,PECH,,,,,,,,,0,48,48,48,down,1,1.01541173529,2017_Mai_15_1220,98.8024885935,Stroop,B-1,2STRNS-8,
fix,return,white, ,21,+,,,,,,,,,0,49,49,49,None,0,,2017_Mai_15_1220,98.8024885935,Stroop,B-1,2STRNS-8,
fix,return,white, ,21,+,,,,,,,,,0,50,50,50,None,0,,2017_Mai_15_1220,98.8024885935,Stroop,B-1,2STRNS-8,
fix,return,white, ,21,+,,,,,,,,,0,51,51,51,None,0,,2017_Mai_15_1220,98.8024885935,Stroop,B-1,2STRNS-8,
fix,return,white, ,21,+,,,,,,,,,0,52,52,52,None,0,,2017_Mai_15_1220,98.8024885935,Stroop,B-1,2STRNS-8,
fix,return,white, ,21,+,,,,,,,,,0,53,53,53,None,0,,2017_Mai_15_1220,98.8024885935,Stroop,B-1,2STRNS-8,
fix,return,white, ,21,+,,,,,,,,,0,54,54,54,None,0,,2017_Mai_15_1220,98.8024885935,Stroop,B-1,2STRNS-8,
fix,return,white, ,21,+,,,,,,,,,0,55,55,55,None,0,,2017_Mai_15_1220,98.8024885935,Stroop,B-1,2STRNS-8,
fix,return,white, ,21,+,,,,,,,,,0,56,56,56,None,0,,2017_Mai_15_1220,98.8024885935,Stroop,B-1,2STRNS-8,
fix,return,white, ,21,+,,,,,,,,,0,57,57,57,None,0,,2017_Mai_15_1220,98.8024885935,Stroop,B-1,2STRNS-8,
fix,return,white, ,21,+,,,,,,,,,0,58,58,58,None,0,,2017_Mai_15_1220,98.8024885935,Stroop,B-1,2STRNS-8,
fix,return,white, ,21,+,,,,,,,,,0,59,59,59,None,0,,2017_Mai_15_1220,98.8024885935,Stroop,B-1,2STRNS-8,
fix,return,white, ,21,+,,,,,,,,,0,60,60,60,None,0,,2017_Mai_15_1220,98.8024885935,Stroop,B-1,2STRNS-8,
fix,return,white,+,22,+,,,,,,,,,0,61,61,61,None,0,,2017_Mai_15_1220,98.8024885935,Stroop,B-1,2STRNS-8,
neutralofneutral,right,"[-0.8745098039, -0.2078431373, 0.637254902]", ,20,MODE,,,,,,,,,0,62,62,62,right,1,1.14057680515,2017_Mai_15_1220,98.8024885935,Stroop,B-1,2STRNS-8,
neutralofneutral,down,"[-0.7725490196, 0.0745098039, -1]", ,16,HALS,,,,,,,,,0,63,63,63,down,1,0.661952287232,2017_Mai_15_1220,98.8024885935,Stroop,B-1,2STRNS-8,
neutralofneutral,down,"[-0.7725490196, 0.0745098039, -1]", ,19,MODE,,,,,,,,,0,64,64,64,down,1,0.531563369088,2017_Mai_15_1220,98.8024885935,Stroop,B-1,2STRNS-8,
neutral,right,"[-0.8745098039, -0.2078431373, 0.637254902]", ,14,SOLL,,,,,,,,,0,65,65,65,right,1,0.513014642923,2017_Mai_15_1220,98.8024885935,Stroop,B-1,2STRNS-8,
neutral,down,"[-0.7725490196, 0.0745098039, -1]", ,10,PECH,,,,,,,,,0,66,66,66,down,1,0.54483963744,2017_Mai_15_1220,98.8024885935,Stroop,B-1,2STRNS-8,
neutralofneutral,right,"[-0.8745098039, -0.2078431373, 0.637254902]", ,17,HALS,,,,,,,,,0,67,67,67,right,1,0.40402481321,2017_Mai_15_1220,98.8024885935,Stroop,B-1,2STRNS-8,
neutralofneutral,left,"[0.568627451, -0.7882352941, -0.7882352941]", ,15,HALS,,,,,,,,,0,68,68,68,left,1,0.502064368516,2017_Mai_15_1220,98.8024885935,Stroop,B-1,2STRNS-8,
neutral,left,"[0.568627451, -0.7882352941, -0.7882352941]", ,12,SOLL,,,,,,,,,0,69,69,69,left,1,0.365171271768,2017_Mai_15_1220,98.8024885935,Stroop,B-1,2STRNS-8,
neutralofneutral,left,"[0.568627451, -0.7882352941, -0.7882352941]", ,18,MODE,,,,,,,,,0,70,70,70,left,1,0.373882155413,2017_Mai_15_1220,98.8024885935,Stroop,B-1,2STRNS-8,
neutral,left,"[0.568627451, -0.7882352941, -0.7882352941]", ,9,PECH,,,,,,,,,0,71,71,71,left,1,0.440321884485,2017_Mai_15_1220,98.8024885935,Stroop,B-1,2STRNS-8,
neutral,down,"[-0.7725490196, 0.0745098039, -1]", ,13,SOLL,,,,,,,,,0,72,72,72,down,1,0.493882602398,2017_Mai_15_1220,98.8024885935,Stroop,B-1,2STRNS-8,
neutral,right,"[-0.8745098039, -0.2078431373, 0.637254902]", ,11,PECH,,,,,,,,,0,73,73,73,right,1,0.450437974659,2017_Mai_15_1220,98.8024885935,Stroop,B-1,2STRNS-8,
neutral,right,"[-0.8745098039, -0.2078431373, 0.637254902]", ,14,SOLL,,,,,,,,,0,74,74,74,right,1,0.547509529843,2017_Mai_15_1220,98.8024885935,Stroop,B-1,2STRNS-8,
incongruent,down,"[-0.7725490196, 0.0745098039, -1]", ,7,BLAU,,,,,,,,,0,75,75,75,down,1,0.365090255885,2017_Mai_15_1220,98.8024885935,Stroop,B-1,2STRNS-8,
incongruent,down,"[-0.7725490196, 0.0745098039, -1]", ,1,ROT,,,,,,,,,0,76,76,76,down,1,0.495989015364,2017_Mai_15_1220,98.8024885935,Stroop,B-1,2STRNS-8,
incongruent,right,"[-0.8745098039, -0.2078431373, 0.637254902]", ,5,GRÜN,,,,,,,,,0,77,77,77,right,1,0.643673148403,2017_Mai_15_1220,98.8024885935,Stroop,B-1,2STRNS-8,
incongruent,left,"[0.568627451, -0.7882352941, -0.7882352941]", ,3,GRÜN,,,,,,,,,0,78,78,78,left,1,0.569109481792,2017_Mai_15_1220,98.8024885935,Stroop,B-1,2STRNS-8,
incongruent,left,"[0.568627451, -0.7882352941, -0.7882352941]", ,6,BLAU,,,,,,,,,0,79,79,79,left,1,0.448705631582,2017_Mai_15_1220,98.8024885935,Stroop,B-1,2STRNS-8,
incongruent,right,"[-0.8745098039, -0.2078431373, 0.637254902]", ,2,ROT,,,,,,,,,0,80,80,80,right,1,0.633305908991,2017_Mai_15_1220,98.8024885935,Stroop,B-1,2STRNS-8,
neutral,left,"[0.568627451, -0.7882352941, -0.7882352941]", ,12,SOLL,,,,,,,,,0,81,81,81,left,1,0.576649266876,2017_Mai_15_1220,98.8024885935,Stroop,B-1,2STRNS-8,
neutral,down,"[-0.7725490196, 0.0745098039, -1]", ,13,SOLL,,,,,,,,,0,82,82,82,down,1,0.492204456153,2017_Mai_15_1220,98.8024885935,Stroop,B-1,2STRNS-8,
neutral,right,"[-0.8745098039, -0.2078431373, 0.637254902]", ,11,PECH,,,,,,,,,0,83,83,83,right,1,0.86574215438,2017_Mai_15_1220,98.8024885935,Stroop,B-1,2STRNS-8,
neutral,left,"[0.568627451, -0.7882352941, -0.7882352941]", ,9,PECH,,,,,,,,,0,84,84,84,left,1,0.687114982491,2017_Mai_15_1220,98.8024885935,Stroop,B-1,2STRNS-8,
neutral,down,"[-0.7725490196, 0.0745098039, -1]", ,10,PECH,,,,,,,,,0,85,85,85,down,1,0.718369513444,2017_Mai_15_1220,98.8024885935,Stroop,B-1,2STRNS-8,
neutral,left,"[0.568627451, -0.7882352941, -0.7882352941]", ,12,SOLL,,,,,,,,,0,86,86,86,left,1,0.568577849978,2017_Mai_15_1220,98.8024885935,Stroop,B-1,2STRNS-8,
congruent,right,"[-0.8745098039, -0.2078431373, 0.637254902]", ,8,BLAU,,,,,,,,,0,87,87,87,right,1,0.61188279516,2017_Mai_15_1220,98.8024885935,Stroop,B-1,2STRNS-8,
neutral,down,"[-0.7725490196, 0.0745098039, -1]", ,13,SOLL,,,,,,,,,0,88,88,88,down,1,0.375487387363,2017_Mai_15_1220,98.8024885935,Stroop,B-1,2STRNS-8,
neutral,right,"[-0.8745098039, -0.2078431373, 0.637254902]", ,11,PECH,,,,,,,,,0,89,89,89,right,1,0.526209336661,2017_Mai_15_1220,98.8024885935,Stroop,B-1,2STRNS-8,
congruent,right,"[-0.8745098039, -0.2078431373, 0.637254902]", ,8,BLAU,,,,,,,,,0,90,90,90,right,1,0.42958141328,2017_Mai_15_1220,98.8024885935,Stroop,B-1,2STRNS-8,
congruent,left,"[0.568627451, -0.7882352941, -0.7882352941]", ,0,ROT,,,,,,,,,0,91,91,91,left,1,0.549242711015,2017_Mai_15_1220,98.8024885935,Stroop,B-1,2STRNS-8,
congruent,down,"[-0.7725490196, 0.0745098039, -1]", ,4,GRÜN,,,,,,,,,0,92,92,92,down,1,0.470387158144,2017_Mai_15_1220,98.8024885935,Stroop,B-1,2STRNS-8,
congruent,left,"[0.568627451, -0.7882352941, -0.7882352941]", ,0,ROT,,,,,,,,,0,93,93,93,left,1,0.536790011021,2017_Mai_15_1220,98.8024885935,Stroop,B-1,2STRNS-8,
neutral,down,"[-0.7725490196, 0.0745098039, -1]", ,10,PECH,,,,,,,,,0,94,94,94,down,1,0.566832097375,2017_Mai_15_1220,98.8024885935,Stroop,B-1,2STRNS-8,
congruent,down,"[-0.7725490196, 0.0745098039, -1]", ,4,GRÜN,,,,,,,,,0,95,95,95,down,1,0.577202689169,2017_Mai_15_1220,98.8024885935,Stroop,B-1,2STRNS-8,
neutral,left,"[0.568627451, -0.7882352941, -0.7882352941]", ,9,PECH,,,,,,,,,0,96,96,96,left,1,0.440155662242,2017_Mai_15_1220,98.8024885935,Stroop,B-1,2STRNS-8,
neutral,right,"[-0.8745098039, -0.2078431373, 0.637254902]", ,14,SOLL,,,,,,,,,0,97,97,97,right,1,0.547020640891,2017_Mai_15_1220,98.8024885935,Stroop,B-1,2STRNS-8,
fix,return,white, ,21,+,,,,,,,,,0,98,98,98,None,0,,2017_Mai_15_1220,98.8024885935,Stroop,B-1,2STRNS-8,
fix,return,white, ,21,+,,,,,,,,,0,99,99,99,None,0,,2017_Mai_15_1220,98.8024885935,Stroop,B-1,2STRNS-8,
fix,return,white, ,21,+,,,,,,,,,0,100,100,100,None,0,,2017_Mai_15_1220,98.8024885935,Stroop,B-1,2STRNS-8,
fix,return,white, ,21,+,,,,,,,,,0,101,101,101,None,0,,2017_Mai_15_1220,98.8024885935,Stroop,B-1,2STRNS-8,
fix,return,white, ,21,+,,,,,,,,,0,102,102,102,None,0,,2017_Mai_15_1220,98.8024885935,Stroop,B-1,2STRNS-8,
fix,return,white, ,21,+,,,,,,,,,0,103,103,103,None,0,,2017_Mai_15_1220,98.8024885935,Stroop,B-1,2STRNS-8,
fix,return,white, ,21,+,,,,,,,,,0,104,104,104,None,0,,2017_Mai_15_1220,98.8024885935,Stroop,B-1,2STRNS-8,
fix,return,white, ,21,+,,,,,,,,,0,105,105,105,None,0,,2017_Mai_15_1220,98.8024885935,Stroop,B-1,2STRNS-8,
fix,return,white, ,21,+,,,,,,,,,0,106,106,106,None,0,,2017_Mai_15_1220,98.8024885935,Stroop,B-1,2STRNS-8,
fix,return,white, ,21,+,,,,,,,,,0,107,107,107,None,0,,2017_Mai_15_1220,98.8024885935,Stroop,B-1,2STRNS-8,
fix,return,white, ,21,+,,,,,,,,,0,108,108,108,None,0,,2017_Mai_15_1220,98.8024885935,Stroop,B-1,2STRNS-8,
fix,return,white, ,21,+,,,,,,,,,0,109,109,109,None,0,,2017_Mai_15_1220,98.8024885935,Stroop,B-1,2STRNS-8,
fix,return,white,+,22,+,,,,,,,,,0,110,110,110,None,0,,2017_Mai_15_1220,98.8024885935,Stroop,B-1,2STRNS-8,
neutral,down,"[-0.7725490196, 0.0745098039, -1]", ,13,SOLL,,,,,,,,,0,111,111,111,down,1,0.653493670285,2017_Mai_15_1220,98.8024885935,Stroop,B-1,2STRNS-8,
neutral,down,"[-0.7725490196, 0.0745098039, -1]", ,10,PECH,,,,,,,,,0,112,112,112,down,1,0.385727795013,2017_Mai_15_1220,98.8024885935,Stroop,B-1,2STRNS-8,
incongruent,down,"[-0.7725490196, 0.0745098039, -1]", ,1,ROT,,,,,,,,,0,113,113,113,down,1,0.549153034813,2017_Mai_15_1220,98.8024885935,Stroop,B-1,2STRNS-8,
neutral,left,"[0.568627451, -0.7882352941, -0.7882352941]", ,9,PECH,,,,,,,,,0,114,114,114,left,1,0.526143127129,2017_Mai_15_1220,98.8024885935,Stroop,B-1,2STRNS-8,
incongruent,left,"[0.568627451, -0.7882352941, -0.7882352941]", ,6,BLAU,,,,,,,,,0,115,115,115,left,1,0.418703773804,2017_Mai_15_1220,98.8024885935,Stroop,B-1,2STRNS-8,
neutral,left,"[0.568627451, -0.7882352941, -0.7882352941]", ,12,SOLL,,,,,,,,,0,116,116,116,left,1,0.386411122084,2017_Mai_15_1220,98.8024885935,Stroop,B-1,2STRNS-8,
incongruent,right,"[-0.8745098039, -0.2078431373, 0.637254902]", ,2,ROT,,,,,,,,,0,117,117,117,right,1,0.668175983261,2017_Mai_15_1220,98.8024885935,Stroop,B-1,2STRNS-8,
incongruent,down,"[-0.7725490196, 0.0745098039, -1]", ,7,BLAU,,,,,,,,,0,118,118,118,down,1,0.783137521668,2017_Mai_15_1220,98.8024885935,Stroop,B-1,2STRNS-8,
incongruent,left,"[0.568627451, -0.7882352941, -0.7882352941]", ,3,GRÜN,,,,,,,,,0,119,119,119,left,1,0.491437878278,2017_Mai_15_1220,98.8024885935,Stroop,B-1,2STRNS-8,
neutral,right,"[-0.8745098039, -0.2078431373, 0.637254902]", ,11,PECH,,,,,,,,,0,120,120,120,right,1,0.555668388021,2017_Mai_15_1220,98.8024885935,Stroop,B-1,2STRNS-8,
incongruent,right,"[-0.8745098039, -0.2078431373, 0.637254902]", ,5,GRÜN,,,,,,,,,0,121,121,121,right,1,0.5232620347,2017_Mai_15_1220,98.8024885935,Stroop,B-1,2STRNS-8,
neutral,right,"[-0.8745098039, -0.2078431373, 0.637254902]", ,14,SOLL,,,,,,,,,0,122,122,122,right,1,0.502513866986,2017_Mai_15_1220,98.8024885935,Stroop,B-1,2STRNS-8,
neutral,right,"[-0.8745098039, -0.2078431373, 0.637254902]", ,14,SOLL,,,,,,,,,0,123,123,123,right,1,0.47006030096,2017_Mai_15_1220,98.8024885935,Stroop,B-1,2STRNS-8,
neutralofneutral,left,"[0.568627451, -0.7882352941, -0.7882352941]", ,15,HALS,,,,,,,,,0,124,124,124,left,1,0.609685309166,2017_Mai_15_1220,98.8024885935,Stroop,B-1,2STRNS-8,
neutral,left,"[0.568627451, -0.7882352941, -0.7882352941]", ,9,PECH,,,,,,,,,0,125,125,125,left,1,0.461738014189,2017_Mai_15_1220,98.8024885935,Stroop,B-1,2STRNS-8,
neutral,right,"[-0.8745098039, -0.2078431373, 0.637254902]", ,11,PECH,,,,,,,,,0,126,126,126,right,1,0.515491494031,2017_Mai_15_1220,98.8024885935,Stroop,B-1,2STRNS-8,
neutralofneutral,down,"[-0.7725490196, 0.0745098039, -1]", ,16,HALS,,,,,,,,,0,127,127,127,down,1,0.448727422061,2017_Mai_15_1220,98.8024885935,Stroop,B-1,2STRNS-8,
neutralofneutral,right,"[-0.8745098039, -0.2078431373, 0.637254902]", ,20,MODE,,,,,,,,,0,128,128,128,right,1,0.651729479585,2017_Mai_15_1220,98.8024885935,Stroop,B-1,2STRNS-8,
neutral,left,"[0.568627451, -0.7882352941, -0.7882352941]", ,12,SOLL,,,,,,,,,0,129,129,129,left,1,0.547079586931,2017_Mai_15_1220,98.8024885935,Stroop,B-1,2STRNS-8,
neutralofneutral,left,"[0.568627451, -0.7882352941, -0.7882352941]", ,18,MODE,,,,,,,,,0,130,130,130,left,1,0.513268865177,2017_Mai_15_1220,98.8024885935,Stroop,B-1,2STRNS-8,
neutral,down,"[-0.7725490196, 0.0745098039, -1]", ,13,SOLL,,,,,,,,,0,131,131,131,down,1,0.643923180181,2017_Mai_15_1220,98.8024885935,Stroop,B-1,2STRNS-8,
neutralofneutral,right,"[-0.8745098039, -0.2078431373, 0.637254902]", ,17,HALS,,,,,,,,,0,132,132,132,right,1,0.927869603539,2017_Mai_15_1220,98.8024885935,Stroop,B-1,2STRNS-8,
neutral,down,"[-0.7725490196, 0.0745098039, -1]", ,10,PECH,,,,,,,,,0,133,133,133,down,1,0.697254259969,2017_Mai_15_1220,98.8024885935,Stroop,B-1,2STRNS-8,
neutralofneutral,down,"[-0.7725490196, 0.0745098039, -1]", ,19,MODE,,,,,,,,,0,134,134,134,down,1,0.480540124513,2017_Mai_15_1220,98.8024885935,Stroop,B-1,2STRNS-8,
congruent,left,"[0.568627451, -0.7882352941, -0.7882352941]", ,0,ROT,,,,,,,,,0,135,135,135,left,1,0.450856463601,2017_Mai_15_1220,98.8024885935,Stroop,B-1,2STRNS-8,
neutral,down,"[-0.7725490196, 0.0745098039, -1]", ,10,PECH,,,,,,,,,0,136,136,136,down,1,0.523689742691,2017_Mai_15_1220,98.8024885935,Stroop,B-1,2STRNS-8,
congruent,right,"[-0.8745098039, -0.2078431373, 0.637254902]", ,8,BLAU,,,,,,,,,0,137,137,137,right,1,0.534286061497,2017_Mai_15_1220,98.8024885935,Stroop,B-1,2STRNS-8,
congruent,left,"[0.568627451, -0.7882352941, -0.7882352941]", ,0,ROT,,,,,,,,,0,138,138,138,left,1,0.539590646297,2017_Mai_15_1220,98.8024885935,Stroop,B-1,2STRNS-8,
congruent,down,"[-0.7725490196, 0.0745098039, -1]", ,4,GRÜN,,,,,,,,,0,139,139,139,down,1,0.49360798649,2017_Mai_15_1220,98.8024885935,Stroop,B-1,2STRNS-8,
congruent,right,"[-0.8745098039, -0.2078431373, 0.637254902]", ,8,BLAU,,,,,,,,,0,140,140,140,right,1,0.525998695365,2017_Mai_15_1220,98.8024885935,Stroop,B-1,2STRNS-8,
neutral,right,"[-0.8745098039, -0.2078431373, 0.637254902]", ,11,PECH,,,,,,,,,0,141,141,141,right,1,0.461563969722,2017_Mai_15_1220,98.8024885935,Stroop,B-1,2STRNS-8,
neutral,right,"[-0.8745098039, -0.2078431373, 0.637254902]", ,14,SOLL,,,,,,,,,0,142,142,142,right,1,0.526092282678,2017_Mai_15_1220,98.8024885935,Stroop,B-1,2STRNS-8,
neutral,left,"[0.568627451, -0.7882352941, -0.7882352941]", ,12,SOLL,,,,,,,,,0,143,143,143,left,1,0.62248972984,2017_Mai_15_1220,98.8024885935,Stroop,B-1,2STRNS-8,
neutral,left,"[0.568627451, -0.7882352941, -0.7882352941]", ,9,PECH,,,,,,,,,0,144,144,144,left,1,0.482958867677,2017_Mai_15_1220,98.8024885935,Stroop,B-1,2STRNS-8,
congruent,down,"[-0.7725490196, 0.0745098039, -1]", ,4,GRÜN,,,,,,,,,0,145,145,145,down,1,0.375108568268,2017_Mai_15_1220,98.8024885935,Stroop,B-1,2STRNS-8,
neutral,down,"[-0.7725490196, 0.0745098039, -1]", ,13,SOLL,,,,,,,,,0,146,146,146,down,1,0.364922078085,2017_Mai_15_1220,98.8024885935,Stroop,B-1,2STRNS-8,
fix,return,white, ,21,+,,,,,,,,,0,147,147,147,None,0,,2017_Mai_15_1220,98.8024885935,Stroop,B-1,2STRNS-8,
fix,return,white, ,21,+,,,,,,,,,0,148,148,148,None,0,,2017_Mai_15_1220,98.8024885935,Stroop,B-1,2STRNS-8,
fix,return,white, ,21,+,,,,,,,,,0,149,149,149,None,0,,2017_Mai_15_1220,98.8024885935,Stroop,B-1,2STRNS-8,
fix,return,white, ,21,+,,,,,,,,,0,150,150,150,None,0,,2017_Mai_15_1220,98.8024885935,Stroop,B-1,2STRNS-8,
fix,return,white, ,21,+,,,,,,,,,0,151,151,151,None,0,,2017_Mai_15_1220,98.8024885935,Stroop,B-1,2STRNS-8,
fix,return,white, ,21,+,,,,,,,,,0,152,152,152,None,0,,2017_Mai_15_1220,98.8024885935,Stroop,B-1,2STRNS-8,
fix,return,white, ,21,+,,,,,,,,,0,153,153,153,None,0,,2017_Mai_15_1220,98.8024885935,Stroop,B-1,2STRNS-8,
fix,return,white, ,21,+,,,,,,,,,0,154,154,154,None,0,,2017_Mai_15_1220,98.8024885935,Stroop,B-1,2STRNS-8,
fix,return,white, ,21,+,,,,,,,,,0,155,155,155,None,0,,2017_Mai_15_1220,98.8024885935,Stroop,B-1,2STRNS-8,
fix,return,white, ,21,+,,,,,,,,,0,156,156,156,None,0,,2017_Mai_15_1220,98.8024885935,Stroop,B-1,2STRNS-8,
fix,return,white, ,21,+,,,,,,,,,0,157,157,157,None,0,,2017_Mai_15_1220,98.8024885935,Stroop,B-1,2STRNS-8,
fix,return,white, ,21,+,,,,,,,,,0,158,158,158,None,0,,2017_Mai_15_1220,98.8024885935,Stroop,B-1,2STRNS-8,
fix,return,white,+,22,+,,,,,,,,,0,159,159,159,None,0,,2017_Mai_15_1220,98.8024885935,Stroop,B-1,2STRNS-8,
neutral,right,"[-0.8745098039, -0.2078431373, 0.637254902]", ,14,SOLL,,,,,,,,,0,160,160,160,right,1,0.987523833336,2017_Mai_15_1220,98.8024885935,Stroop,B-1,2STRNS-8,
incongruent,left,"[0.568627451, -0.7882352941, -0.7882352941]", ,3,GRÜN,,,,,,,,,0,161,161,161,left,1,0.804948953009,2017_Mai_15_1220,98.8024885935,Stroop,B-1,2STRNS-8,
neutral,left,"[0.568627451, -0.7882352941, -0.7882352941]", ,9,PECH,,,,,,,,,0,162,162,162,left,1,0.459444426596,2017_Mai_15_1220,98.8024885935,Stroop,B-1,2STRNS-8,
incongruent,left,"[0.568627451, -0.7882352941, -0.7882352941]", ,6,BLAU,,,,,,,,,0,163,163,163,left,1,0.384510601208,2017_Mai_15_1220,98.8024885935,Stroop,B-1,2STRNS-8,
incongruent,down,"[-0.7725490196, 0.0745098039, -1]", ,1,ROT,,,,,,,,,0,164,164,164,down,1,0.675511831811,2017_Mai_15_1220,98.8024885935,Stroop,B-1,2STRNS-8,
incongruent,right,"[-0.8745098039, -0.2078431373, 0.637254902]", ,5,GRÜN,,,,,,,,,0,165,165,165,right,1,0.663220046123,2017_Mai_15_1220,98.8024885935,Stroop,B-1,2STRNS-8,
incongruent,right,"[-0.8745098039, -0.2078431373, 0.637254902]", ,2,ROT,,,,,,,,,0,166,166,166,left,0,0.622105044077,2017_Mai_15_1220,98.8024885935,Stroop,B-1,2STRNS-8,
neutral,right,"[-0.8745098039, -0.2078431373, 0.637254902]", ,11,PECH,,,,,,,,,0,167,167,167,right,1,0.654645213288,2017_Mai_15_1220,98.8024885935,Stroop,B-1,2STRNS-8,
neutral,left,"[0.568627451, -0.7882352941, -0.7882352941]", ,12,SOLL,,,,,,,,,0,168,168,168,left,1,0.547918241005,2017_Mai_15_1220,98.8024885935,Stroop,B-1,2STRNS-8,
incongruent,down,"[-0.7725490196, 0.0745098039, -1]", ,7,BLAU,,,,,,,,,0,169,169,169,down,1,0.622839494964,2017_Mai_15_1220,98.8024885935,Stroop,B-1,2STRNS-8,
neutral,down,"[-0.7725490196, 0.0745098039, -1]", ,13,SOLL,,,,,,,,,0,170,170,170,down,1,0.461676553864,2017_Mai_15_1220,98.8024885935,Stroop,B-1,2STRNS-8,
neutral,down,"[-0.7725490196, 0.0745098039, -1]", ,10,PECH,,,,,,,,,0,171,171,171,down,1,0.440109008268,2017_Mai_15_1220,98.8024885935,Stroop,B-1,2STRNS-8,
congruent,down,"[-0.7725490196, 0.0745098039, -1]", ,4,GRÜN,,,,,,,,,0,172,172,172,down,1,0.450605034998,2017_Mai_15_1220,98.8024885935,Stroop,B-1,2STRNS-8,
congruent,down,"[-0.7725490196, 0.0745098039, -1]", ,4,GRÜN,,,,,,,,,0,173,173,173,down,1,0.407496204127,2017_Mai_15_1220,98.8024885935,Stroop,B-1,2STRNS-8,
neutral,left,"[0.568627451, -0.7882352941, -0.7882352941]", ,12,SOLL,,,,,,,,,0,174,174,174,left,1,0.601389282716,2017_Mai_15_1220,98.8024885935,Stroop,B-1,2STRNS-8,
neutral,right,"[-0.8745098039, -0.2078431373, 0.637254902]", ,14,SOLL,,,,,,,,,0,175,175,175,right,1,0.53694505866,2017_Mai_15_1220,98.8024885935,Stroop,B-1,2STRNS-8,
neutral,left,"[0.568627451, -0.7882352941, -0.7882352941]", ,9,PECH,,,,,,,,,0,176,176,176,left,1,0.450590787377,2017_Mai_15_1220,98.8024885935,Stroop,B-1,2STRNS-8,
congruent,left,"[0.568627451, -0.7882352941, -0.7882352941]", ,0,ROT,,,,,,,,,0,177,177,177,left,1,0.525967685837,2017_Mai_15_1220,98.8024885935,Stroop,B-1,2STRNS-8,
congruent,left,"[0.568627451, -0.7882352941, -0.7882352941]", ,0,ROT,,,,,,,,,0,178,178,178,left,1,0.364928503483,2017_Mai_15_1220,98.8024885935,Stroop,B-1,2STRNS-8,
congruent,right,"[-0.8745098039, -0.2078431373, 0.637254902]", ,8,BLAU,,,,,,,,,0,179,179,179,right,1,0.566142344907,2017_Mai_15_1220,98.8024885935,Stroop,B-1,2STRNS-8,
neutral,down,"[-0.7725490196, 0.0745098039, -1]", ,13,SOLL,,,,,,,,,0,180,180,180,down,1,0.35274678765,2017_Mai_15_1220,98.8024885935,Stroop,B-1,2STRNS-8,
neutral,down,"[-0.7725490196, 0.0745098039, -1]", ,10,PECH,,,,,,,,,0,181,181,181,down,1,0.364665900275,2017_Mai_15_1220,98.8024885935,Stroop,B-1,2STRNS-8,
congruent,right,"[-0.8745098039, -0.2078431373, 0.637254902]", ,8,BLAU,,,,,,,,,0,182,182,182,right,1,0.492864316554,2017_Mai_15_1220,98.8024885935,Stroop,B-1,2STRNS-8,
neutral,right,"[-0.8745098039, -0.2078431373, 0.637254902]", ,11,PECH,,,,,,,,,0,183,183,183,right,1,0.535376144175,2017_Mai_15_1220,98.8024885935,Stroop,B-1,2STRNS-8,
neutralofneutral,right,"[-0.8745098039, -0.2078431373, 0.637254902]", ,17,HALS,,,,,,,,,0,184,184,184,right,1,0.426446098596,2017_Mai_15_1220,98.8024885935,Stroop,B-1,2STRNS-8,
neutralofneutral,left,"[0.568627451, -0.7882352941, -0.7882352941]", ,15,HALS,,,,,,,,,0,185,185,185,left,1,0.555031156194,2017_Mai_15_1220,98.8024885935,Stroop,B-1,2STRNS-8,
neutral,right,"[-0.8745098039, -0.2078431373, 0.637254902]", ,11,PECH,,,,,,,,,0,186,186,186,right,1,0.579858613316,2017_Mai_15_1220,98.8024885935,Stroop,B-1,2STRNS-8,
neutral,left,"[0.568627451, -0.7882352941, -0.7882352941]", ,9,PECH,,,,,,,,,0,187,187,187,left,1,0.418508497588,2017_Mai_15_1220,98.8024885935,Stroop,B-1,2STRNS-8,
neutralofneutral,down,"[-0.7725490196, 0.0745098039, -1]", ,19,MODE,,,,,,,,,0,188,188,188,down,1,0.512918261958,2017_Mai_15_1220,98.8024885935,Stroop,B-1,2STRNS-8,
neutralofneutral,down,"[-0.7725490196, 0.0745098039, -1]", ,16,HALS,,,,,,,,,0,189,189,189,down,1,0.395579605788,2017_Mai_15_1220,98.8024885935,Stroop,B-1,2STRNS-8,
neutral,left,"[0.568627451, -0.7882352941, -0.7882352941]", ,12,SOLL,,,,,,,,,0,190,190,190,left,1,0.74960672376,2017_Mai_15_1220,98.8024885935,Stroop,B-1,2STRNS-8,
neutralofneutral,left,"[0.568627451, -0.7882352941, -0.7882352941]", ,18,MODE,,,,,,,,,0,191,191,191,left,1,0.414823671724,2017_Mai_15_1220,98.8024885935,Stroop,B-1,2STRNS-8,
neutralofneutral,right,"[-0.8745098039, -0.2078431373, 0.637254902]", ,20,MODE,,,,,,,,,0,192,192,192,right,1,0.457448642216,2017_Mai_15_1220,98.8024885935,Stroop,B-1,2STRNS-8,
neutral,down,"[-0.7725490196, 0.0745098039, -1]", ,13,SOLL,,,,,,,,,0,193,193,193,down,1,0.416699329105,2017_Mai_15_1220,98.8024885935,Stroop,B-1,2STRNS-8,
neutral,down,"[-0.7725490196, 0.0745098039, -1]", ,10,PECH,,,,,,,,,0,194,194,194,down,1,0.395411986719,2017_Mai_15_1220,98.8024885935,Stroop,B-1,2STRNS-8,
neutral,right,"[-0.8745098039, -0.2078431373, 0.637254902]", ,14,SOLL,,,,,,,,,0,195,195,195,right,1,0.783114334364,2017_Mai_15_1220,98.8024885935,Stroop,B-1,2STRNS-8,
fix,return,white, ,21,+,,,,,,,,,0,196,196,196,None,0,,2017_Mai_15_1220,98.8024885935,Stroop,B-1,2STRNS-8,
fix,return,white, ,21,+,,,,,,,,,0,197,197,197,None,0,,2017_Mai_15_1220,98.8024885935,Stroop,B-1,2STRNS-8,
fix,return,white, ,21,+,,,,,,,,,0,198,198,198,None,0,,2017_Mai_15_1220,98.8024885935,Stroop,B-1,2STRNS-8,
fix,return,white, ,21,+,,,,,,,,,0,199,199,199,None,0,,2017_Mai_15_1220,98.8024885935,Stroop,B-1,2STRNS-8,
fix,return,white, ,21,+,,,,,,,,,0,200,200,200,None,0,,2017_Mai_15_1220,98.8024885935,Stroop,B-1,2STRNS-8,
fix,return,white, ,21,+,,,,,,,,,0,201,201,201,None,0,,2017_Mai_15_1220,98.8024885935,Stroop,B-1,2STRNS-8,
fix,return,white, ,21,+,,,,,,,,,0,202,202,202,None,0,,2017_Mai_15_1220,98.8024885935,Stroop,B-1,2STRNS-8,
fix,return,white, ,21,+,,,,,,,,,0,203,203,203,None,0,,2017_Mai_15_1220,98.8024885935,Stroop,B-1,2STRNS-8,
fix,return,white, ,21,+,,,,,,,,,0,204,204,204,None,0,,2017_Mai_15_1220,98.8024885935,Stroop,B-1,2STRNS-8,
fix,return,white, ,21,+,,,,,,,,,0,205,205,205,None,0,,2017_Mai_15_1220,98.8024885935,Stroop,B-1,2STRNS-8,
fix,return,white, ,21,+,,,,,,,,,0,206,206,206,None,0,,2017_Mai_15_1220,98.8024885935,Stroop,B-1,2STRNS-8,
fix,return,white, ,21,+,,,,,,,,,0,207,207,207,None,0,,2017_Mai_15_1220,98.8024885935,Stroop,B-1,2STRNS-8,
fix,return,white,+,22,+,,,,,,,,,0,208,208,208,None,0,,2017_Mai_15_1220,98.8024885935,Stroop,B-1,2STRNS-8,
neutral,down,"[-0.7725490196, 0.0745098039, -1]", ,10,PECH,,,,,,,,,0,209,209,209,down,1,0.822566555247,2017_Mai_15_1220,98.8024885935,Stroop,B-1,2STRNS-8,
congruent,left,"[0.568627451, -0.7882352941, -0.7882352941]", ,0,ROT,,,,,,,,,0,210,210,210,left,1,0.558146635955,2017_Mai_15_1220,98.8024885935,Stroop,B-1,2STRNS-8,
congruent,left,"[0.568627451, -0.7882352941, -0.7882352941]", ,0,ROT,,,,,,,,,0,211,211,211,left,1,0.451933695484,2017_Mai_15_1220,98.8024885935,Stroop,B-1,2STRNS-8,
congruent,down,"[-0.7725490196, 0.0745098039, -1]", ,4,GRÜN,,,,,,,,,0,212,212,212,down,1,0.610932395039,2017_Mai_15_1220,98.8024885935,Stroop,B-1,2STRNS-8,
neutral,right,"[-0.8745098039, -0.2078431373, 0.637254902]", ,11,PECH,,,,,,,,,0,213,213,213,right,1,0.547782748925,2017_Mai_15_1220,98.8024885935,Stroop,B-1,2STRNS-8,
neutral,down,"[-0.7725490196, 0.0745098039, -1]", ,13,SOLL,,,,,,,,,0,214,214,214,down,1,0.728208473423,2017_Mai_15_1220,98.8024885935,Stroop,B-1,2STRNS-8,
neutral,left,"[0.568627451, -0.7882352941, -0.7882352941]", ,12,SOLL,,,,,,,,,0,215,215,215,left,1,0.52483122855,2017_Mai_15_1220,98.8024885935,Stroop,B-1,2STRNS-8,
congruent,right,"[-0.8745098039, -0.2078431373, 0.637254902]", ,8,BLAU,,,,,,,,,0,216,216,216,right,1,0.631452321454,2017_Mai_15_1220,98.8024885935,Stroop,B-1,2STRNS-8,
neutral,left,"[0.568627451, -0.7882352941, -0.7882352941]", ,9,PECH,,,,,,,,,0,217,217,217,left,1,0.760459779106,2017_Mai_15_1220,98.8024885935,Stroop,B-1,2STRNS-8,
neutral,right,"[-0.8745098039, -0.2078431373, 0.637254902]", ,14,SOLL,,,,,,,,,0,218,218,218,right,1,0.685335426709,2017_Mai_15_1220,98.8024885935,Stroop,B-1,2STRNS-8,
congruent,right,"[-0.8745098039, -0.2078431373, 0.637254902]", ,8,BLAU,,,,,,,,,0,219,219,219,right,1,0.43909323671,2017_Mai_15_1220,98.8024885935,Stroop,B-1,2STRNS-8,
congruent,down,"[-0.7725490196, 0.0745098039, -1]", ,4,GRÜN,,,,,,,,,0,220,220,220,down,1,0.492129865667,2017_Mai_15_1220,98.8024885935,Stroop,B-1,2STRNS-8,
neutral,down,"[-0.7725490196, 0.0745098039, -1]", ,10,PECH,,,,,,,,,0,221,221,221,down,1,0.4167121799,2017_Mai_15_1220,98.8024885935,Stroop,B-1,2STRNS-8,
neutralofneutral,down,"[-0.7725490196, 0.0745098039, -1]", ,19,MODE,,,,,,,,,0,222,222,222,down,1,0.446272640796,2017_Mai_15_1220,98.8024885935,Stroop,B-1,2STRNS-8,
neutralofneutral,right,"[-0.8745098039, -0.2078431373, 0.637254902]", ,17,HALS,,,,,,,,,0,223,223,223,right,1,0.595118932713,2017_Mai_15_1220,98.8024885935,Stroop,B-1,2STRNS-8,
neutralofneutral,left,"[0.568627451, -0.7882352941, -0.7882352941]", ,18,MODE,,,,,,,,,0,224,224,224,left,1,0.513010173081,2017_Mai_15_1220,98.8024885935,Stroop,B-1,2STRNS-8,
neutral,left,"[0.568627451, -0.7882352941, -0.7882352941]", ,9,PECH,,,,,,,,,0,225,225,225,left,1,0.440136944779,2017_Mai_15_1220,98.8024885935,Stroop,B-1,2STRNS-8,
neutralofneutral,right,"[-0.8745098039, -0.2078431373, 0.637254902]", ,20,MODE,,,,,,,,,0,226,226,226,right,1,0.673376085508,2017_Mai_15_1220,98.8024885935,Stroop,B-1,2STRNS-8,
neutral,right,"[-0.8745098039, -0.2078431373, 0.637254902]", ,14,SOLL,,,,,,,,,0,227,227,227,right,1,0.472185990119,2017_Mai_15_1220,98.8024885935,Stroop,B-1,2STRNS-8,
neutralofneutral,down,"[-0.7725490196, 0.0745098039, -1]", ,16,HALS,,,,,,,,,0,228,228,228,down,1,0.768989354792,2017_Mai_15_1220,98.8024885935,Stroop,B-1,2STRNS-8,
neutral,left,"[0.568627451, -0.7882352941, -0.7882352941]", ,12,SOLL,,,,,,,,,0,229,229,229,left,1,0.482805216864,2017_Mai_15_1220,98.8024885935,Stroop,B-1,2STRNS-8,
neutral,right,"[-0.8745098039, -0.2078431373, 0.637254902]", ,11,PECH,,,,,,,,,0,230,230,230,right,1,0.644319878644,2017_Mai_15_1220,98.8024885935,Stroop,B-1,2STRNS-8,
neutralofneutral,left,"[0.568627451, -0.7882352941, -0.7882352941]", ,15,HALS,,,,,,,,,0,231,231,231,left,1,0.459099131314,2017_Mai_15_1220,98.8024885935,Stroop,B-1,2STRNS-8,
neutral,down,"[-0.7725490196, 0.0745098039, -1]", ,13,SOLL,,,,,,,,,0,232,232,232,down,1,0.504573346612,2017_Mai_15_1220,98.8024885935,Stroop,B-1,2STRNS-8,
neutral,right,"[-0.8745098039, -0.2078431373, 0.637254902]", ,14,SOLL,,,,,,,,,0,233,233,233,right,1,0.568846878584,2017_Mai_15_1220,98.8024885935,Stroop,B-1,2STRNS-8,
incongruent,left,"[0.568627451, -0.7882352941, -0.7882352941]", ,6,BLAU,,,,,,,,,0,234,234,234,left,1,0.460966407742,2017_Mai_15_1220,98.8024885935,Stroop,B-1,2STRNS-8,
incongruent,left,"[0.568627451, -0.7882352941, -0.7882352941]", ,3,GRÜN,,,,,,,,,0,235,235,235,left,1,0.459752566318,2017_Mai_15_1220,98.8024885935,Stroop,B-1,2STRNS-8,
incongruent,down,"[-0.7725490196, 0.0745098039, -1]", ,7,BLAU,,,,,,,,,0,236,236,236,down,1,0.908003950223,2017_Mai_15_1220,98.8024885935,Stroop,B-1,2STRNS-8,
incongruent,right,"[-0.8745098039, -0.2078431373, 0.637254902]", ,5,GRÜN,,,,,,,,,0,237,237,237,right,1,0.437907890528,2017_Mai_15_1220,98.8024885935,Stroop,B-1,2STRNS-8,
incongruent,right,"[-0.8745098039, -0.2078431373, 0.637254902]", ,2,ROT,,,,,,,,,0,238,238,238,right,1,0.785738690253,2017_Mai_15_1220,98.8024885935,Stroop,B-1,2STRNS-8,
neutral,left,"[0.568627451, -0.7882352941, -0.7882352941]", ,12,SOLL,,,,,,,,,0,239,239,239,left,1,0.461845290393,2017_Mai_15_1220,98.8024885935,Stroop,B-1,2STRNS-8,
neutral,down,"[-0.7725490196, 0.0745098039, -1]", ,13,SOLL,,,,,,,,,0,240,240,240,down,1,0.558360908998,2017_Mai_15_1220,98.8024885935,Stroop,B-1,2STRNS-8,
neutral,down,"[-0.7725490196, 0.0745098039, -1]", ,10,PECH,,,,,,,,,0,241,241,241,down,1,0.375946663612,2017_Mai_15_1220,98.8024885935,Stroop,B-1,2STRNS-8,
incongruent,down,"[-0.7725490196, 0.0745098039, -1]", ,1,ROT,,,,,,,,,0,242,242,242,down,1,0.388001268318,2017_Mai_15_1220,98.8024885935,Stroop,B-1,2STRNS-8,
neutral,left,"[0.568627451, -0.7882352941, -0.7882352941]", ,9,PECH,,,,,,,,,0,243,243,243,right,0,0.504593181535,2017_Mai_15_1220,98.8024885935,Stroop,B-1,2STRNS-8,
neutral,right,"[-0.8745098039, -0.2078431373, 0.637254902]", ,11,PECH,,,,,,,,,0,244,244,244,right,1,0.708185816913,2017_Mai_15_1220,98.8024885935,Stroop,B-1,2STRNS-8,
fix,return,white, ,21,+,,,,,,,,,0,245,245,245,None,0,,2017_Mai_15_1220,98.8024885935,Stroop,B-1,2STRNS-8,
fix,return,white, ,21,+,,,,,,,,,0,246,246,246,None,0,,2017_Mai_15_1220,98.8024885935,Stroop,B-1,2STRNS-8,
fix,return,white, ,21,+,,,,,,,,,0,247,247,247,None,0,,2017_Mai_15_1220,98.8024885935,Stroop,B-1,2STRNS-8,
fix,return,white, ,21,+,,,,,,,,,0,248,248,248,None,0,,2017_Mai_15_1220,98.8024885935,Stroop,B-1,2STRNS-8,
fix,return,white, ,21,+,,,,,,,,,0,249,249,249,None,0,,2017_Mai_15_1220,98.8024885935,Stroop,B-1,2STRNS-8,
fix,return,white, ,21,+,,,,,,,,,0,250,250,250,None,0,,2017_Mai_15_1220,98.8024885935,Stroop,B-1,2STRNS-8,
fix,return,white, ,21,+,,,,,,,,,0,251,251,251,None,0,,2017_Mai_15_1220,98.8024885935,Stroop,B-1,2STRNS-8,
fix,return,white, ,21,+,,,,,,,,,0,252,252,252,None,0,,2017_Mai_15_1220,98.8024885935,Stroop,B-1,2STRNS-8,
fix,return,white, ,21,+,,,,,,,,,0,253,253,253,None,0,,2017_Mai_15_1220,98.8024885935,Stroop,B-1,2STRNS-8,
fix,return,white, ,21,+,,,,,,,,,0,254,254,254,None,0,,2017_Mai_15_1220,98.8024885935,Stroop,B-1,2STRNS-8,
fix,return,white, ,21,+,,,,,,,,,0,255,255,255,None,0,,2017_Mai_15_1220,98.8024885935,Stroop,B-1,2STRNS-8,
fix,return,white, ,21,+,,,,,,,,,0,256,256,256,None,0,,2017_Mai_15_1220,98.8024885935,Stroop,B-1,2STRNS-8,
fix,return,white,+,22,+,,,,,,,,,0,257,257,257,None,0,,2017_Mai_15_1220,98.8024885935,Stroop,B-1,2STRNS-8,
neutral,down,"[-0.7725490196, 0.0745098039, -1]", ,13,SOLL,,,,,,,,,0,258,258,258,down,1,0.686932277706,2017_Mai_15_1220,98.8024885935,Stroop,B-1,2STRNS-8,
neutral,right,"[-0.8745098039, -0.2078431373, 0.637254902]", ,11,PECH,,,,,,,,,0,259,259,259,right,1,0.729363648173,2017_Mai_15_1220,98.8024885935,Stroop,B-1,2STRNS-8,
congruent,left,"[0.568627451, -0.7882352941, -0.7882352941]", ,0,ROT,,,,,,,,,0,260,260,260,left,1,0.517380840302,2017_Mai_15_1220,98.8024885935,Stroop,B-1,2STRNS-8,
neutral,left,"[0.568627451, -0.7882352941, -0.7882352941]", ,12,SOLL,,,,,,,,,0,261,261,261,left,1,0.396685891643,2017_Mai_15_1220,98.8024885935,Stroop,B-1,2STRNS-8,
neutral,down,"[-0.7725490196, 0.0745098039, -1]", ,10,PECH,,,,,,,,,0,262,262,262,down,1,0.491517217971,2017_Mai_15_1220,98.8024885935,Stroop,B-1,2STRNS-8,
congruent,down,"[-0.7725490196, 0.0745098039, -1]", ,4,GRÜN,,,,,,,,,0,263,263,263,down,1,0.60977833775,2017_Mai_15_1220,98.8024885935,Stroop,B-1,2STRNS-8,
neutral,right,"[-0.8745098039, -0.2078431373, 0.637254902]", ,14,SOLL,,,,,,,,,0,264,264,264,right,1,0.576805990706,2017_Mai_15_1220,98.8024885935,Stroop,B-1,2STRNS-8,
congruent,left,"[0.568627451, -0.7882352941, -0.7882352941]", ,0,ROT,,,,,,,,,0,265,265,265,left,1,0.515159887639,2017_Mai_15_1220,98.8024885935,Stroop,B-1,2STRNS-8,
congruent,right,"[-0.8745098039, -0.2078431373, 0.637254902]", ,8,BLAU,,,,,,,,,0,266,266,266,right,1,0.822941742596,2017_Mai_15_1220,98.8024885935,Stroop,B-1,2STRNS-8,
congruent,right,"[-0.8745098039, -0.2078431373, 0.637254902]", ,8,BLAU,,,,,,,,,0,267,267,267,right,1,0.523534695052,2017_Mai_15_1220,98.8024885935,Stroop,B-1,2STRNS-8,
neutral,left,"[0.568627451, -0.7882352941, -0.7882352941]", ,9,PECH,,,,,,,,,0,268,268,268,left,1,0.598957409391,2017_Mai_15_1220,98.8024885935,Stroop,B-1,2STRNS-8,
congruent,down,"[-0.7725490196, 0.0745098039, -1]", ,4,GRÜN,,,,,,,,,0,269,269,269,down,1,0.482656315258,2017_Mai_15_1220,98.8024885935,Stroop,B-1,2STRNS-8,
incongruent,down,"[-0.7725490196, 0.0745098039, -1]", ,7,BLAU,,,,,,,,,0,270,270,270,down,1,0.38505033461,2017_Mai_15_1220,98.8024885935,Stroop,B-1,2STRNS-8,
neutral,right,"[-0.8745098039, -0.2078431373, 0.637254902]", ,14,SOLL,,,,,,,,,0,271,271,271,right,1,0.619893031097,2017_Mai_15_1220,98.8024885935,Stroop,B-1,2STRNS-8,
neutral,right,"[-0.8745098039, -0.2078431373, 0.637254902]", ,11,PECH,,,,,,,,,0,272,272,272,right,1,0.694967377139,2017_Mai_15_1220,98.8024885935,Stroop,B-1,2STRNS-8,
incongruent,right,"[-0.8745098039, -0.2078431373, 0.637254902]", ,5,GRÜN,,,,,,,,,0,273,273,273,right,1,0.438124957222,2017_Mai_15_1220,98.8024885935,Stroop,B-1,2STRNS-8,
incongruent,left,"[0.568627451, -0.7882352941, -0.7882352941]", ,6,BLAU,,,,,,,,,0,274,274,274,left,1,0.512781373052,2017_Mai_15_1220,98.8024885935,Stroop,B-1,2STRNS-8,
neutral,left,"[0.568627451, -0.7882352941, -0.7882352941]", ,12,SOLL,,,,,,,,,0,275,275,275,left,1,0.448900628432,2017_Mai_15_1220,98.8024885935,Stroop,B-1,2STRNS-8,
incongruent,down,"[-0.7725490196, 0.0745098039, -1]", ,1,ROT,,,,,,,,,0,276,276,276,down,1,0.461265887145,2017_Mai_15_1220,98.8024885935,Stroop,B-1,2STRNS-8,
neutral,down,"[-0.7725490196, 0.0745098039, -1]", ,13,SOLL,,,,,,,,,0,277,277,277,down,1,0.3743347269,2017_Mai_15_1220,98.8024885935,Stroop,B-1,2STRNS-8,
incongruent,right,"[-0.8745098039, -0.2078431373, 0.637254902]", ,2,ROT,,,,,,,,,0,278,278,278,right,1,0.44005453207,2017_Mai_15_1220,98.8024885935,Stroop,B-1,2STRNS-8,
neutral,down,"[-0.7725490196, 0.0745098039, -1]", ,10,PECH,,,,,,,,,0,279,279,279,down,1,0.587809903214,2017_Mai_15_1220,98.8024885935,Stroop,B-1,2STRNS-8,
neutral,left,"[0.568627451, -0.7882352941, -0.7882352941]", ,9,PECH,,,,,,,,,0,280,280,280,left,1,0.427852981315,2017_Mai_15_1220,98.8024885935,Stroop,B-1,2STRNS-8,
incongruent,left,"[0.568627451, -0.7882352941, -0.7882352941]", ,3,GRÜN,,,,,,,,,0,281,281,281,left,1,0.440031344766,2017_Mai_15_1220,98.8024885935,Stroop,B-1,2STRNS-8,
neutralofneutral,down,"[-0.7725490196, 0.0745098039, -1]", ,16,HALS,,,,,,,,,0,282,282,282,down,1,0.609078528137,2017_Mai_15_1220,98.8024885935,Stroop,B-1,2STRNS-8,
neutral,down,"[-0.7725490196, 0.0745098039, -1]", ,13,SOLL,,,,,,,,,0,283,283,283,down,1,0.397552202864,2017_Mai_15_1220,98.8024885935,Stroop,B-1,2STRNS-8,
neutralofneutral,down,"[-0.7725490196, 0.0745098039, -1]", ,19,MODE,,,,,,,,,0,284,284,284,down,1,0.40620414047,2017_Mai_15_1220,98.8024885935,Stroop,B-1,2STRNS-8,
neutralofneutral,left,"[0.568627451, -0.7882352941, -0.7882352941]", ,18,MODE,,,,,,,,,0,285,285,285,left,1,0.576936454214,2017_Mai_15_1220,98.8024885935,Stroop,B-1,2STRNS-8,
neutral,left,"[0.568627451, -0.7882352941, -0.7882352941]", ,9,PECH,,,,,,,,,0,286,286,286,left,1,0.461666217355,2017_Mai_15_1220,98.8024885935,Stroop,B-1,2STRNS-8,
neutral,right,"[-0.8745098039, -0.2078431373, 0.637254902]", ,14,SOLL,,,,,,,,,0,287,287,287,right,1,0.536868233253,2017_Mai_15_1220,98.8024885935,Stroop,B-1,2STRNS-8,
neutralofneutral,right,"[-0.8745098039, -0.2078431373, 0.637254902]", ,17,HALS,,,,,,,,,0,288,288,288,right,1,0.651594546234,2017_Mai_15_1220,98.8024885935,Stroop,B-1,2STRNS-8,
neutral,left,"[0.568627451, -0.7882352941, -0.7882352941]", ,12,SOLL,,,,,,,,,0,289,289,289,left,1,0.450171739705,2017_Mai_15_1220,98.8024885935,Stroop,B-1,2STRNS-8,
neutral,down,"[-0.7725490196, 0.0745098039, -1]", ,10,PECH,,,,,,,,,0,290,290,290,down,1,0.469843513631,2017_Mai_15_1220,98.8024885935,Stroop,B-1,2STRNS-8,
neutralofneutral,left,"[0.568627451, -0.7882352941, -0.7882352941]", ,15,HALS,,,,,,,,,0,291,291,291,left,1,0.510407048941,2017_Mai_15_1220,98.8024885935,Stroop,B-1,2STRNS-8,
neutralofneutral,right,"[-0.8745098039, -0.2078431373, 0.637254902]", ,20,MODE,,,,,,,,,0,292,292,292,right,1,0.531691038945,2017_Mai_15_1220,98.8024885935,Stroop,B-1,2STRNS-8,
neutral,right,"[-0.8745098039, -0.2078431373, 0.637254902]", ,11,PECH,,,,,,,,,0,293,293,293,right,1,0.427236981236,2017_Mai_15_1220,98.8024885935,Stroop,B-1,2STRNS-8,
fix,return,white, ,21,+,,,,,,,,,0,294,294,294,None,0,,2017_Mai_15_1220,98.8024885935,Stroop,B-1,2STRNS-8,
fix,return,white, ,21,+,,,,,,,,,0,295,295,295,None,0,,2017_Mai_15_1220,98.8024885935,Stroop,B-1,2STRNS-8,
fix,return,white, ,21,+,,,,,,,,,0,296,296,296,None,0,,2017_Mai_15_1220,98.8024885935,Stroop,B-1,2STRNS-8,
fix,return,white, ,21,+,,,,,,,,,0,297,297,297,None,0,,2017_Mai_15_1220,98.8024885935,Stroop,B-1,2STRNS-8,
fix,return,white, ,21,+,,,,,,,,,0,298,298,298,None,0,,2017_Mai_15_1220,98.8024885935,Stroop,B-1,2STRNS-8,
fix,return,white, ,21,+,,,,,,,,,0,299,299,299,None,0,,2017_Mai_15_1220,98.8024885935,Stroop,B-1,2STRNS-8,
fix,return,white, ,21,+,,,,,,,,,0,300,300,300,None,0,,2017_Mai_15_1220,98.8024885935,Stroop,B-1,2STRNS-8,
fix,return,white, ,21,+,,,,,,,,,0,301,301,301,None,0,,2017_Mai_15_1220,98.8024885935,Stroop,B-1,2STRNS-8,
fix,return,white, ,21,+,,,,,,,,,0,302,302,302,None,0,,2017_Mai_15_1220,98.8024885935,Stroop,B-1,2STRNS-8,
fix,return,white, ,21,+,,,,,,,,,0,303,303,303,None,0,,2017_Mai_15_1220,98.8024885935,Stroop,B-1,2STRNS-8,
fix,return,white, ,21,+,,,,,,,,,0,304,304,304,None,0,,2017_Mai_15_1220,98.8024885935,Stroop,B-1,2STRNS-8,
fix,return,white, ,21,+,,,,,,,,,0,305,305,305,None,0,,2017_Mai_15_1220,98.8024885935,Stroop,B-1,2STRNS-8,
fix,return,white,+,22,+,,,,,,,,,0,306,306,306,None,0,,2017_Mai_15_1220,98.8024885935,Stroop,B-1,2STRNS-8,
