best_paramset_1 = [67.553443730300003, 0.471192625403, 14.681413793300001, 5.1934756027700004, 110.972942983, 364.148244213, 136.87120988699999]
best_paramset_statistic_1 = 6.57270906588
best_paramset_2 = [68.106937817900004, 0.48041725022100001, 14.139575042000001, 4.4764813451799998, 165.58665439800001, 363.69362306800002, 134.09560899600001]
best_paramset_statistic_2 = 7.09941830239
ID = "SMRI8verum"