best_paramset_1 = [55.891810291399999, 0.41163826174700002, 17.429852945499999, 3.5181963223300001, 76.476841044099999, 397.41352219800001, 69.418106831700001]
best_paramset_statistic_1 = 38.6963236283
best_paramset_2 = [54.881779702099998, 0.42672461709999998, 25.842875187800001, 3.41813372901, 105.078718271, 403.89380612000002, 87.9377336469]
best_paramset_statistic_2 = 39.9637190019
ID = "sdlpfc2verum"