best_paramset_1 = [80.601528776400002, 0.22752264028300001, 5.33565956194, 2.7638156133799998, 108.64643464, 398.630133323, 216.31638782499999]
best_paramset_statistic_1 = 34.2994948958
best_paramset_2 = [78.552043943000001, 0.21538478085500001, 7.9242843000300001, 3.0092070749099999, 161.66767651699999, 401.04428235900002, 203.426722609]
best_paramset_statistic_2 = 35.1871242744
ID = "sdlpfc8sham"