best_paramset_1 = [82.022208979200002, 0.29607399826199998, 12.9910496174, 3.91375402256, 158.38353544099999, 349.34133767499998, 159.76226225900001]
best_paramset_statistic_1 = 21.4705065453
best_paramset_2 = [82.815830942299996, 0.30077581084799998, 14.4438392945, 4.10832519557, 137.67046205400001, 349.62177271199999, 167.06701261399999]
best_paramset_statistic_2 = 21.890948823
ID = "sdlpfc11sham"