best_paramset_1 = [116.341907518, 0.40166982140599999, 18.298464768999999, 4.4979907049500003, 65.760535647500006, 387.23792877300002, 192.908333392]
best_paramset_statistic_1 = 2.20728425714
best_paramset_2 = [113.25438691799999, 0.38608478778400002, 18.176133824099999, 3.6402313391700001, 85.700697432499993, 383.17799977700003, 160.00211732400001]
best_paramset_statistic_2 = 2.46325734834
ID = "Tarana_propersims_1"