b_1 = 87.4142142965
mu_c = 0.380466234432
A = 29.1475293949
shape = 1.80230379876
tau = 105.264077727
Ter = 271.464112828
s_r = 20.0776607409
Gsquare = 4.69480092623
ID = "Tarana_propersims_41"
best_statisic = 4.69480092623