best_paramset_1 = [105.29226368800001, 0.40779939422599998, 27.787867448299998, 3.2649472740899999, 120.00882688900001, 473.50682005800002, 75.858501105100004]
best_paramset_statistic_1 = 9.28004676208
best_paramset_2 = [105.089663427, 0.39138705008399999, 27.3257141817, 3.3306325762400002, 121.285964693, 470.06351054800001, -57.6070045998]
best_paramset_statistic_2 = 9.41684722245
ID = "Tarana_propersims_39"