[{
  "structure" : "C10H6Cl4O4",
  "SMILES" : "ClC1=C(C(OC([H])([H])[H])=O)C(Cl)=C(C(C(OC([H])([H])[H])=O)=C1Cl)Cl",
  "strength type" : "strong hit",
  "name" : "Dacthal",
  "PubChem" : "https://pubchem.ncbi.nlm.nih.gov/compound/2943",
  "reference" : "Carlile, G. W., Robert, R., Zhang, D., Teske, K. A., Luo, Y., Hanrahan, J. W. and Thomas, D. Y. (2007), Correctors of Protein Trafficking Defects Identified by a Novel High-Throughput Screening Assay. ChemBioChem, 8: 1012-1020. doi:10.1002/cbic.200700027"
}, {
  "structure" : "C42H62O16",
  "SMILES" : "O=C1[C@@]([C@](C([H])([H])C2([H])[H])(C([H])([H])[H])[C@]3([H])C(C([H])([H])[H])(C([H])([H])[H])[C@@]2([H])O[C@@]([C@]([C@@]4([H])O[H])([H])O[C@]([C@]([C@@]5([H])O[H])([H])O[H])([H])O[C@@](C(O[H])=O)([H])[C@@]5([H])O[H])([H])O[C@@](C(O[H])=O)([H])[C@@]4([H])O[H])([H])[C@](C([H])([H])C3([H])[H])(C([H])([H])[H])[C@@]6(C([H])([H])[H])C([C@@](C([H])([H])[C@@](C([H])([H])[H])(C(O[H])=O)C([H])([H])C7([H])[H])([H])[C@@]7(C([H])([H])[H])C([H])([H])C6([H])[H])=C1[H]",
  "strength type" : "strong hit",
  "name" : "Glycyrrhizic acid",
  "PubChem" : "https://pubchem.ncbi.nlm.nih.gov/compound/2943",
  "reference" : "Carlile, G. W., Robert, R., Zhang, D., Teske, K. A., Luo, Y., Hanrahan, J. W. and Thomas, D. Y. (2007), Correctors of Protein Trafficking Defects Identified by a Novel High-Throughput Screening Assay. ChemBioChem, 8: 1012-1020. doi:10.1002/cbic.200700027"
}, {
  "structure" : "C6H12N2O4Pt",
  "SMILES" : "O=C(C1(C(O[H])=O)C([H])([H])C([H])([H])C1([H])[H])O[H].[H][N-][H].[H][N-][H].[Pt+2]",
  "strength type" : "strong hit",
  "name" : "carboplatin",
  "PubChem" : "https://pubchem.ncbi.nlm.nih.gov/compound/426756",
  "reference" : "Carlile, G. W., Robert, R., Zhang, D., Teske, K. A., Luo, Y., Hanrahan, J. W. and Thomas, D. Y. (2007), Correctors of Protein Trafficking Defects Identified by a Novel High-Throughput Screening Assay. ChemBioChem, 8: 1012-1020. doi:10.1002/cbic.200700027"
}, {
  "structure" : "C7H4ClNO2",
  "SMILES" : "ClC1=C([H])C(N2[H])=C(C([H])=C1[H])OC2=O",
  "strength type" : "strong hit",
  "name" : "Chlorzoxazone",
  "PubChem" : "https://pubchem.ncbi.nlm.nih.gov/compound/2733",
  "reference" : "Carlile, G. W., Robert, R., Zhang, D., Teske, K. A., Luo, Y., Hanrahan, J. W. and Thomas, D. Y. (2007), Correctors of Protein Trafficking Defects Identified by a Novel High-Throughput Screening Assay. ChemBioChem, 8: 1012-1020. doi:10.1002/cbic.200700027"
}, {
  "structure" : "C11H12Cl2N2O5",
  "SMILES" : "ClC(C(N([H])[C@@](C([H])([H])O[H])([H])[C@](C(C([H])=C1[H])=C([H])C([H])=C1[N+]([O-])=O)([H])O[H])=O)([H])Cl",
  "strength type" : "strong hit",
  "name" : "chloramphenicol",
  "PubChem" : "https://pubchem.ncbi.nlm.nih.gov/compound/5959",
  "reference" : "Carlile, G. W., Robert, R., Zhang, D., Teske, K. A., Luo, Y., Hanrahan, J. W. and Thomas, D. Y. (2007), Correctors of Protein Trafficking Defects Identified by a Novel High-Throughput Screening Assay. ChemBioChem, 8: 1012-1020. doi:10.1002/cbic.200700027"
}, {
  "structure" : "C15H12I3NO4",
  "SMILES" : "IC1=C([H])C(C([H])([H])[C@](C(O[H])=O)([H])N([H])[H])=C([H])C(I)=C1OC(C([H])=C2[H])=C([H])C(I)=C2O[H]",
  "strength type" : "medium hit",
  "name" : "Liothyronine",
  "PubChem" : "https://pubchem.ncbi.nlm.nih.gov/compound/5920",
  "reference" : "Carlile, G. W., Robert, R., Zhang, D., Teske, K. A., Luo, Y., Hanrahan, J. W. and Thomas, D. Y. (2007), Correctors of Protein Trafficking Defects Identified by a Novel High-Throughput Screening Assay. ChemBioChem, 8: 1012-1020. doi:10.1002/cbic.200700027"
}, {
  "structure" : "C12H15NO3",
  "SMILES" : "O=C(N([H])C([H])([H])[H])OC1=C([H])C([H])=C([H])C2=C1OC(C([H])([H])[H])(C([H])([H])[H])C2([H])[H]",
  "strength type" : "medium hit",
  "name" : "Carbofuran",
  "PubChem" : "https://pubchem.ncbi.nlm.nih.gov/compound/2566",
  "reference" : "Carlile, G. W., Robert, R., Zhang, D., Teske, K. A., Luo, Y., Hanrahan, J. W. and Thomas, D. Y. (2007), Correctors of Protein Trafficking Defects Identified by a Novel High-Throughput Screening Assay. ChemBioChem, 8: 1012-1020. doi:10.1002/cbic.200700027"
}, {
  "structure" : "C25H34O7",
  "SMILES" : "O[C@@]12[C@@](CC[C@H]3[C@H]2CC[C@]4(O)C[C@@H](OC(C)=O)CC[C@]34C=O)(C)[C@@H](C5=CC(OC5)=O)CC1",
  "strength type" : "medium hit",
  "name" : "strophandon acetate",
  "reference" : "Carlile, G. W., Robert, R., Zhang, D., Teske, K. A., Luo, Y., Hanrahan, J. W. and Thomas, D. Y. (2007), Correctors of Protein Trafficking Defects Identified by a Novel High-Throughput Screening Assay. ChemBioChem, 8: 1012-1020. doi:10.1002/cbic.200700027"
}, {
  "structure" : "C15H10O4",
  "SMILES" : "O=C1C(C([H])=C([H])C(O[H])=C2[H])=C2OC([H])=C1C(C([H])=C3[H])=C([H])C([H])=C3O[H]",
  "strength type" : "medium hit",
  "name" : "Daidzein",
  "PubChem" : "https://pubchem.ncbi.nlm.nih.gov/compound/5281708",
  "reference" : "Carlile, G. W., Robert, R., Zhang, D., Teske, K. A., Luo, Y., Hanrahan, J. W. and Thomas, D. Y. (2007), Correctors of Protein Trafficking Defects Identified by a Novel High-Throughput Screening Assay. ChemBioChem, 8: 1012-1020. doi:10.1002/cbic.200700027"
}, {
  "structure" : "C22H30N6O4S",
  "SMILES" : "O=S(N1C([H])([H])C([H])([H])N(C([H])([H])[H])C([H])([H])C1([H])[H])(C(C([H])=C2[H])=C([H])C(C(N([H])C3=C4N(C([H])([H])[H])N=C3C([H])([H])C([H])([H])C([H])([H])[H])=NC4=O)=C2OC([H])([H])C([H])([H])[H])=O",
  "strength type" : "medium hit",
  "name" : "Sildenafil",
  "PubChem" : "https://pubchem.ncbi.nlm.nih.gov/compound/5212",
  "reference" : "Carlile, G. W., Robert, R., Zhang, D., Teske, K. A., Luo, Y., Hanrahan, J. W. and Thomas, D. Y. (2007), Correctors of Protein Trafficking Defects Identified by a Novel High-Throughput Screening Assay. ChemBioChem, 8: 1012-1020. doi:10.1002/cbic.200700027"
}, {
  "structure" : "C14H20Br2N2",
  "SMILES" : "BrC1=C([H])C(Br)=C([H])C(C([H])([H])N(C([H])([H])[H])C2([H])C([H])([H])C([H])([H])C([H])([H])C([H])([H])C2([H])[H])=C1N([H])[H]",
  "strength type" : "medium hit",
  "name" : "Bromhexine",
  "PubChem" : "https://pubchem.ncbi.nlm.nih.gov/compound/2442",
  "reference" : "Carlile, G. W., Robert, R., Zhang, D., Teske, K. A., Luo, Y., Hanrahan, J. W. and Thomas, D. Y. (2007), Correctors of Protein Trafficking Defects Identified by a Novel High-Throughput Screening Assay. ChemBioChem, 8: 1012-1020. doi:10.1002/cbic.200700027"
}, {
  "structure" : "C16H12O4",
  "SMILES" : "COC1=CC=CC=C1C2=COC(C=C(O)C=C3)=C3C2=O",
  "strength type" : "weak hit",
  "name" : "7-hydroxy-2-methoxylisoflavone",
  "reference" : "Carlile, G. W., Robert, R., Zhang, D., Teske, K. A., Luo, Y., Hanrahan, J. W. and Thomas, D. Y. (2007), Correctors of Protein Trafficking Defects Identified by a Novel High-Throughput Screening Assay. ChemBioChem, 8: 1012-1020. doi:10.1002/cbic.200700027"
}, {
  "structure" : "C8H15NO",
  "SMILES" : "O=C(C([H])([H])[H])C([H])([H])[C@@]1([H])N([H])C([H])([H])C([H])([H])C([H])([H])C1([H])[H]",
  "strength type" : "weak hit",
  "name" : "pelletierin hydrochloride",
  "PubChem" : "https://pubchem.ncbi.nlm.nih.gov/compound/16667749",
  "reference" : "Carlile, G. W., Robert, R., Zhang, D., Teske, K. A., Luo, Y., Hanrahan, J. W. and Thomas, D. Y. (2007), Correctors of Protein Trafficking Defects Identified by a Novel High-Throughput Screening Assay. ChemBioChem, 8: 1012-1020. doi:10.1002/cbic.200700027"
}, {
  "structure" : "C6H5N5O3",
  "SMILES" : "O=C1N=C(N([H])[H])N([H])C(N([H])C2=O)=C1N([H])C2=O",
  "strength type" : "weak hit",
  "name" : "leucopterin",
  "PubChem" : "https://pubchem.ncbi.nlm.nih.gov/compound/10291",
  "reference" : "Carlile, G. W., Robert, R., Zhang, D., Teske, K. A., Luo, Y., Hanrahan, J. W. and Thomas, D. Y. (2007), Correctors of Protein Trafficking Defects Identified by a Novel High-Throughput Screening Assay. ChemBioChem, 8: 1012-1020. doi:10.1002/cbic.200700027"
}, {
  "structure" : "C32H42O10",
  "SMILES" : "O=C1O[C@](C2=C([H])OC([H])=C2[H])([H])[C@@]3(C([H])([H])[H])[C@]4([C@@]5(C([H])([H])[H])[C@@](C([H])([H])C3([H])[H])([H])[C@]([C@@](C6([H])[H])([H])OC(C([H])([H])[H])=O)(C([H])([H])[H])[C@@](C(C([H])([H])[H])(C([H])([H])[H])[C@]6([H])OC(C([H])([H])[H])=O)([H])C([H])([H])[C@@]5([H])OC(C([H])([H])[H])=O)O[C@@]41[H]",
  "strength type" : "weak hit",
  "name" : "khivorin",
  "PubChem" : "https://pubchem.ncbi.nlm.nih.gov/compound/21596331",
  "reference" : "Carlile, G. W., Robert, R., Zhang, D., Teske, K. A., Luo, Y., Hanrahan, J. W. and Thomas, D. Y. (2007), Correctors of Protein Trafficking Defects Identified by a Novel High-Throughput Screening Assay. ChemBioChem, 8: 1012-1020. doi:10.1002/cbic.200700027"
}, {
  "structure" : "C26H34O7",
  "SMILES" : "O=C1[C@@]2(C)C(C[C@@H](O)[C@]3(C)C2CC[C@]4(C)C3(O5)C5C(O[C@H]4C6=CC=CO6)=O)C(C)(C)[C@H](O)C1",
  "strength type" : "weak hit",
  "name" : "1-deacetoxy-1-oxo-3,7-dideacetylkhivorin",
  "reference" : "Carlile, G. W., Robert, R., Zhang, D., Teske, K. A., Luo, Y., Hanrahan, J. W. and Thomas, D. Y. (2007), Correctors of Protein Trafficking Defects Identified by a Novel High-Throughput Screening Assay. ChemBioChem, 8: 1012-1020. doi:10.1002/cbic.200700027"
}, {
  "structure" : "C26H32O6",
  "SMILES" : "O=C1O[C@]2(C([H])([H])[H])[C@@](C([H])([H])C([H])([H])[C@]3(C([H])([H])[H])C2=C([H])C(O[C@@]3([H])C4=C([H])OC([H])=C4[H])=O)([H])[C@](C([H])=C5[H])(C([H])([H])[H])[C@](C1([H])[H])([H])C(C([H])([H])[H])(C([H])([H])[H])[C@]5([H])O[H]",
  "strength type" : "weak hit",
  "name" : "deoxyandriirobin lactone; typo in paper DEOXYANDIROBIN LACTONE",
  "PubChem" : "https://pubchem.ncbi.nlm.nih.gov/compound/6708582",
  "reference" : "Carlile, G. W., Robert, R., Zhang, D., Teske, K. A., Luo, Y., Hanrahan, J. W. and Thomas, D. Y. (2007), Correctors of Protein Trafficking Defects Identified by a Novel High-Throughput Screening Assay. ChemBioChem, 8: 1012-1020. doi:10.1002/cbic.200700027"
}, {
  "structure" : "C11H17NO",
  "SMILES" : "CC1=C(OCC(C)N)C(C)=CC=C1",
  "strength type" : "weak hit",
  "name" : "mandletine",
  "reference" : "Carlile, G. W., Robert, R., Zhang, D., Teske, K. A., Luo, Y., Hanrahan, J. W. and Thomas, D. Y. (2007), Correctors of Protein Trafficking Defects Identified by a Novel High-Throughput Screening Assay. ChemBioChem, 8: 1012-1020. doi:10.1002/cbic.200700027"
}, {
  "structure" : "C38H50O16",
  "SMILES" : "O=C1C2([C@@]([C@@](C3=C([H])OC([H])=C3[H])([H])C1([H])[H])(C([H])([H])[H])[C@@]([C@](C(C2=C([H])[H])([H])[C@]([C@@](C4([H])[H])([H])OC(C([H])([H])[H])=O)(C([H])([H])[H])C(C([H])([H])C(OC([H])([H])[H])=O)([H])[C@](C([H])([H])OC(C([H])([H])[H])=O)(C([H])([H])[H])OC4=O)([H])OC([H])=O)([H])OC(C(C(C([H])([H])[H])([H])C([H])([H])C([H])([H])[H])([H])O[H])=O)O[H]",
  "strength type" : "weak hit",
  "name" : "prieuranin; possible typo and draw error of prieurianin",
  "PubChem" : "https://pubchem.ncbi.nlm.nih.gov/compounds/6708588",
  "reference" : "Carlile, G. W., Robert, R., Zhang, D., Teske, K. A., Luo, Y., Hanrahan, J. W. and Thomas, D. Y. (2007), Correctors of Protein Trafficking Defects Identified by a Novel High-Throughput Screening Assay. ChemBioChem, 8: 1012-1020. doi:10.1002/cbic.200700027"
}, {
  "structure" : "C19H29ClO2",
  "SMILES" : "O=C1CC[C@@]2([H])[C@]3([H])CCC4C[C@](Cl)(O)CC[C@]4(C)[C@@]3([H])CC[C@@]21C",
  "strength type" : "weak hit",
  "name" : "3-beta-chloroandrosterone",
  "reference" : "Carlile, G. W., Robert, R., Zhang, D., Teske, K. A., Luo, Y., Hanrahan, J. W. and Thomas, D. Y. (2007), Correctors of Protein Trafficking Defects Identified by a Novel High-Throughput Screening Assay. ChemBioChem, 8: 1012-1020. doi:10.1002/cbic.200700027"
}, {
  "structure" : "C23H24O6",
  "SMILES" : "O=C1[C@](C2=C([H])C(OC([H])([H])[H])=C3OC([H])([H])[H])([H])[C@](C([H])([H])OC2=C3[H])([H])OC4=C1C([H])=C([H])C5=C4C([H])([H])[C@@](C(C([H])([H])[H])([H])C([H])([H])[H])([H])O5",
  "strength type" : "weak hit",
  "name" : "dihydrorotenone",
  "PubChem" : "https://pubchem.ncbi.nlm.nih.gov/compound/243725",
  "reference" : "Carlile, G. W., Robert, R., Zhang, D., Teske, K. A., Luo, Y., Hanrahan, J. W. and Thomas, D. Y. (2007), Correctors of Protein Trafficking Defects Identified by a Novel High-Throughput Screening Assay. ChemBioChem, 8: 1012-1020. doi:10.1002/cbic.200700027"
}, {
  "structure" : "C19H30O2",
  "SMILES" : "CC12C(CCC2=O)C3CCC4C[C@@H](O)CCC4(C)C3CC1",
  "strength type" : "weak hit",
  "name" : "epandiosterone",
  "reference" : "Carlile, G. W., Robert, R., Zhang, D., Teske, K. A., Luo, Y., Hanrahan, J. W. and Thomas, D. Y. (2007), Correctors of Protein Trafficking Defects Identified by a Novel High-Throughput Screening Assay. ChemBioChem, 8: 1012-1020. doi:10.1002/cbic.200700027"
}, {
  "structure" : "C10H13N5O4",
  "SMILES" : "O=C(N([H])C1=O)N(C([H])=C1C([H])([H])[H])[C@]2([H])O[C@@](C([H])([H])O[H])([H])[C@@](C2([H])[H])([H])N=[N+]=[N-]",
  "strength type" : "weak hit",
  "name" : "zidovudine",
  "PubChem" : "https://pubchem.ncbi.nlm.nih.gov/compound/35370",
  "reference" : "Carlile, G. W., Robert, R., Zhang, D., Teske, K. A., Luo, Y., Hanrahan, J. W. and Thomas, D. Y. (2007), Correctors of Protein Trafficking Defects Identified by a Novel High-Throughput Screening Assay. ChemBioChem, 8: 1012-1020. doi:10.1002/cbic.200700027"
}, {
  "structure" : "C8H10AsNO5",
  "SMILES" : "O=[As](O[H])(C(C([H])=C1[H])=C([H])C(N([H])C(C([H])([H])[H])=O)=C1O[H])O[H]",
  "strength type" : "weak hit",
  "name" : "acetarsol",
  "PubChem" : "https://pubchem.ncbi.nlm.nih.gov/compound/1985",
  "reference" : "Carlile, G. W., Robert, R., Zhang, D., Teske, K. A., Luo, Y., Hanrahan, J. W. and Thomas, D. Y. (2007), Correctors of Protein Trafficking Defects Identified by a Novel High-Throughput Screening Assay. ChemBioChem, 8: 1012-1020. doi:10.1002/cbic.200700027"
}, {
  "structure" : "C12H24O11",
  "SMILES" : "O[C@@H](CO)[C@@H]([C@H](O)[C@H](O)CO)O[C@@H]1[C@@H](O)[C@H](O)[C@@H](O)[C@H](CO)O1",
  "strength type" : "weak hit",
  "name" : "glucitol-4-pyanoside",
  "reference" : "Carlile, G. W., Robert, R., Zhang, D., Teske, K. A., Luo, Y., Hanrahan, J. W. and Thomas, D. Y. (2007), Correctors of Protein Trafficking Defects Identified by a Novel High-Throughput Screening Assay. ChemBioChem, 8: 1012-1020. doi:10.1002/cbic.200700027"
} ]

