id,('photographic_sensitivity', 'shutter_speed_value', 'aperture_value'),name
1,100,5.906,3.61,DJI_0152.JPG,
2,100,6.321,3.61,DJI_0153.JPG,
3,100,6.321,3.61,DJI_0154.JPG,
4,100,6.321,3.61,DJI_0155.JPG,
5,100,6.321,3.61,DJI_0156.JPG,
6,100,6.321,3.61,DJI_0157.JPG,
7,100,6.321,3.61,DJI_0158.JPG,
8,100,6.321,3.61,DJI_0159.JPG,
9,100,5.906,3.61,DJI_0160.JPG,
10,100,5.906,3.61,DJI_0161.JPG,
11,100,6.321,3.61,DJI_0162.JPG,
12,100,6.321,3.61,DJI_0163.JPG,
13,100,6.321,3.61,DJI_0164.JPG,
14,100,6.321,3.61,DJI_0165.JPG,
15,100,5.906,3.61,DJI_0166.JPG,
16,100,5.906,3.61,DJI_0167.JPG,
17,100,6.321,3.61,DJI_0168.JPG,
18,100,6.321,3.61,DJI_0169.JPG,
19,100,6.321,3.61,DJI_0170.JPG,
20,100,6.321,3.61,DJI_0171.JPG,
21,100,6.321,3.61,DJI_0172.JPG,
22,100,6.321,3.61,DJI_0173.JPG,
23,100,6.321,3.61,DJI_0174.JPG,
24,100,5.906,3.61,DJI_0175.JPG,
25,100,5.906,3.61,DJI_0176.JPG,
26,100,6.321,3.61,DJI_0177.JPG,
27,100,6.321,3.61,DJI_0178.JPG,
28,100,6.321,3.61,DJI_0179.JPG,
29,100,6.321,3.61,DJI_0180.JPG,
30,100,6.321,3.61,DJI_0181.JPG,
31,100,5.906,3.61,DJI_0182.JPG,
32,100,5.643,3.61,DJI_0183.JPG,
33,100,5.906,3.61,DJI_0184.JPG,
34,100,5.906,3.61,DJI_0185.JPG,
35,100,5.906,3.61,DJI_0186.JPG,
36,100,5.906,3.61,DJI_0187.JPG,
37,100,5.906,3.61,DJI_0188.JPG,
38,100,5.906,3.61,DJI_0189.JPG,
39,100,5.643,3.61,DJI_0190.JPG,
40,100,5.643,3.61,DJI_0191.JPG,
41,100,5.906,3.61,DJI_0192.JPG,
42,100,5.906,3.61,DJI_0193.JPG,
43,100,5.906,3.61,DJI_0194.JPG,
44,100,5.906,3.61,DJI_0195.JPG,
45,100,6.321,3.61,DJI_0196.JPG,
46,100,6.321,3.61,DJI_0197.JPG,
47,100,6.321,3.61,DJI_0198.JPG,
48,100,6.321,3.61,DJI_0199.JPG,
49,100,5.906,3.61,DJI_0200.JPG,
50,100,6.321,3.61,DJI_0201.JPG,
51,100,5.906,3.61,DJI_0202.JPG,
52,100,5.643,3.61,DJI_0203.JPG,
53,100,5.906,3.61,DJI_0204.JPG,
54,100,5.906,3.61,DJI_0205.JPG,
55,100,6.321,3.61,DJI_0206.JPG,
56,100,6.321,3.61,DJI_0207.JPG,
57,100,6.321,3.61,DJI_0208.JPG,
58,100,5.906,3.61,DJI_0209.JPG,
59,100,5.906,3.61,DJI_0210.JPG,
60,100,6.321,3.61,DJI_0211.JPG,
61,100,6.321,3.61,DJI_0212.JPG,
62,100,5.906,3.61,DJI_0213.JPG,
63,100,6.321,3.61,DJI_0214.JPG,
64,100,6.321,3.61,DJI_0215.JPG,
65,100,6.321,3.61,DJI_0216.JPG,
66,100,6.321,3.61,DJI_0217.JPG,
67,100,6.321,3.61,DJI_0218.JPG,
68,100,6.321,3.61,DJI_0219.JPG,
69,100,6.321,3.61,DJI_0220.JPG,
70,100,6.321,3.61,DJI_0221.JPG,
71,100,5.906,3.61,DJI_0222.JPG,
72,100,5.643,3.61,DJI_0223.JPG,
73,100,5.906,3.61,DJI_0224.JPG,
74,100,5.643,3.61,DJI_0225.JPG,
75,100,5.906,3.61,DJI_0226.JPG,
76,100,6.321,3.61,DJI_0227.JPG,
77,100,6.321,3.61,DJI_0228.JPG,
78,100,6.321,3.61,DJI_0229.JPG,
79,100,5.906,3.61,DJI_0230.JPG,
80,100,5.906,3.61,DJI_0231.JPG,
81,100,5.906,3.61,DJI_0232.JPG,
82,100,6.321,3.61,DJI_0233.JPG,
83,100,5.906,3.61,DJI_0234.JPG,
84,100,5.906,3.61,DJI_0235.JPG,
85,100,6.321,3.61,DJI_0236.JPG,
86,100,5.906,3.61,DJI_0237.JPG,
87,100,6.321,3.61,DJI_0238.JPG,
88,100,6.321,3.61,DJI_0239.JPG,
89,100,6.321,3.61,DJI_0240.JPG,
90,100,5.906,3.61,DJI_0241.JPG,
91,100,6.321,3.61,DJI_0242.JPG,
92,100,5.906,3.61,DJI_0243.JPG,
93,100,6.321,3.61,DJI_0244.JPG,
94,100,6.321,3.61,DJI_0245.JPG,
95,100,6.321,3.61,DJI_0246.JPG,
96,100,6.321,3.61,DJI_0247.JPG,
97,100,5.906,3.61,DJI_0248.JPG,
98,100,5.643,3.61,DJI_0249.JPG,
99,100,5.906,3.61,DJI_0250.JPG,
100,100,5.906,3.61,DJI_0251.JPG,
101,100,6.321,3.61,DJI_0252.JPG,
102,100,6.321,3.61,DJI_0253.JPG,
103,100,5.906,3.61,DJI_0254.JPG,
104,100,6.321,3.61,DJI_0255.JPG,
105,100,6.321,3.61,DJI_0256.JPG,
106,100,6.321,3.61,DJI_0257.JPG,
107,100,5.906,3.61,DJI_0258.JPG,
108,100,5.906,3.61,DJI_0259.JPG,
109,100,6.321,3.61,DJI_0260.JPG,
110,100,5.906,3.61,DJI_0261.JPG,
111,100,5.906,3.61,DJI_0262.JPG,
112,100,5.906,3.61,DJI_0263.JPG,
