fid,quadrant_id,tree_id,tree_x,tree_y,tree_theight,tree_dbh,Geoid_hight1,tree_hight_AMSL,tree_dbh_*3[m],hight_buffer_max,divergence_hight,hight_polygon_max,divergence_hight_2
"1",AA1,"101",566745.7158,5713232.772,14.7,18,300.380004882812,315.1,0.54,333.413848876953,-18.3,,
"2",AA1,"7",566745.8691,5713248.116,27.3,43.7,300.75,328.1,1.31,334.574829101562,-6.5,334.574829101562,6.5
"3",AA1,"1",566747.8946,5713232.439,32,87,300.429992675781,332.4,2.61,334.573760986328,-2.2,334.618072509766,2.2
"4",AA1,"2",566748.4314,5713236.188,21.4,33,300.450012207031,321.9,0.99,334.607147216797,-12.7,,
"5",AA1,"3",566750.5997,5713239.13,7,11.5,300.559997558594,307.6,0.35,332.306396484375,-24.7,,
"6",AA1,"4",566752.4294,5713233.334,17,23.3,300.660003662109,317.7,0.7,334.294189453125,-16.6,,
"7",AA1,"6",566760.2415,5713242.787,10,15,300.950012207031,311,0.45,311.988861083984,-1,,
"8",AA1,"5",566816.0833,5713254.023,31,44.7,303.670013427734,334.7,1.34,336.239288330078,-1.5,,
"9",AA2,"8",566748.081,5713269.659,31,65,301.480010986328,332.5,1.95,336.724914550781,-4.2,339.596740722656,7.1
"10",AA2,"7",566749.336,5713265.491,20,23.5,301.440002441406,321.4,0.71,335.052795410156,-13.7,,
"11",AA2,"101",566762.5533,5713265.824,14,11.5,302.239990234375,316.2,0.35,334.418121337891,-18.2,,
"12",AA2,"6",566762.5535,5713264.993,34.2,51.3,302.25,336.5,1.54,336.492309570312,0,336.972106933594,0.5
"13",AA2,"5",566763.9993,5713259.538,29.3,50.4,301.859985351562,331.2,1.51,336.91552734375,-5.7,336.91552734375,5.7
"14",AA2,"4",566766.6274,5713256.748,12.8,19.2,301.809997558594,314.6,0.58,334.580810546875,-20,,
"15",AA2,"3",566821.6184,5713279.546,18.9,28.2,304.290008544922,323.2,0.85,338.430023193359,-15.2,,
"16",AA3,"6",566749.0305,5713282.079,21.3,29.6,301.529998779297,322.8,0.89,337.318939208984,-14.5,,
"17",AA3,"8",566750.6172,5713288.509,15.1,65,301.739990234375,316.8,1.95,331.289916992188,-14.5,,
"18",AA3,"5",566751.1078,5713278.083,39,80.2,301.700012207031,340.7,2.41,338.974334716797,1.7,339.784027099609,-0.9
"19",AA3,"7",566752.3976,5713282.486,21.9,37.1,301.690002441406,323.6,1.11,337.83154296875,-14.2,,
"20",AA3,"3",566753.2275,5713272.873,13.7,18.8,301.600006103516,315.3,0.56,335.258392333984,-20,,
"21",AA3,"9",566753.7165,5713289.319,12.7,12,301.869995117188,314.6,0.36,331.460540771484,-16.9,,
"22",AA3,"2",566756.0137,5713271.608,21.5,26.1,301.739990234375,323.2,0.78,334.781219482422,-11.6,,
"23",AA3,"10",566758.9072,5713287.371,31.9,59.5,302.100006103516,334,1.79,335.76904296875,-1.8,335.76904296875,1.8
"24",AA3,"11",566765.0609,5713280.551,10.6,19,302.209991455078,312.8,0.57,333.7294921875,-20.9,,
"25",AA3,"1",566766.0519,5713272.738,32.5,60.6,302.209991455078,334.7,1.82,336.249114990234,-1.5,336.249114990234,1.5
"26",AA4,"3",566747.0927,5713306.307,32.5,60,301.559997558594,334.1,1.8,334.378784179688,-0.3,334.842529296875,0.7
"27",AA4,"100",566754.1884,5713289.025,9.4,12,301.869995117188,311.3,0.36,331.647705078125,-20.3,,
"28",AA4,"7",566756.9548,5713298.301,36.7,56.4,302.130004882812,338.8,1.69,334.983032226562,3.8,335.330261230469,-3.5
"29",AA4,"6",566757.2213,5713296.272,23.6,34.3,302.070007324219,325.7,1.03,332.067077636719,-6.4,,
"30",AA4,"1",566760.1508,5713290.149,12.2,21.1,302.190002441406,314.4,0.63,334.192321777344,-19.8,,
"31",AA4,"5",566765.0972,5713295.33,36.6,70.1,302.429992675781,339,2.1,336.62939453125,2.4,336.62939453125,-2.4
"32",AA5,"102",566749.493,5713321.944,10.6,10.8,301.709991455078,312.3,0.32,314.111938476562,-1.8,,
"33",AA5,"7",566756.6663,5713325.555,16.6,13.6,302.25,318.9,0.41,312.012725830078,6.9,,
"34",AA5,"103",566757.0801,5713323.16,12.6,11,302.299987792969,314.9,0.33,311.700286865234,3.2,,
"35",AA5,"104",566758.633,5713321.57,9.2,12,302.369995117188,311.6,0.36,312.931243896484,-1.3,,
"36",AA5,"101",566763.62,5713319.199,14,12.5,302.5,316.5,0.38,315.360900878906,1.1,,
"37",AA6,"7",566746.4578,5713337.949,29.4,54.2,301.570007324219,331,1.63,335.077270507812,-4.1,339.388610839844,8.4
"38",AA6,"8",566746.7672,5713340.892,21.1,33.4,301.769989013672,322.9,1,334.323150634766,-11.4,,
"39",AA6,"3",566758.5636,5713330.443,30.4,58,302.410003662109,332.8,1.74,332.290985107422,0.5,332.543579101562,-0.3
"40",AA6,"101",566764.3378,5713330.209,9,11.9,302.630004882812,311.6,0.36,330.011322021484,-18.4,,
"41",AB1,"1",566769.3483,5713246.388,35.4,53.7,301.420013427734,336.8,1.61,334.979705810547,1.8,335.127655029297,-1.7
"42",AB1,"2",566771.2185,5713241.108,34.7,69.2,301.329986572266,336,2.08,334.498809814453,1.5,334.498809814453,-1.5
"43",AB1,"3",566771.6672,5713239.478,22.2,32.5,301.260009765625,323.5,0.98,334.438323974609,-10.9,,
"44",AB1,"5",566774.0224,5713234.756,12.3,19.5,300.980010986328,313.3,0.59,330.951263427734,-17.7,,
"45",AB1,"4",566776.1258,5713239.996,13.5,19,301.480010986328,315,0.57,330.188781738281,-15.2,,
"46",AB1,"6",566783.2694,5713232.535,34,78.7,301.470001220703,335.5,2.36,334.321807861328,1.2,334.321807861328,-1.2
"47",AB2,"2",566770.8951,5713257.67,31.3,63.9,302.079986572266,333.4,1.92,336.340881347656,-2.9,336.340881347656,2.9
"48",AB2,"1",566771.5277,5713251.534,29.3,65.3,301.850006103516,331.2,1.96,335.352386474609,-4.2,335.384002685547,4.2
"49",AB2,"3",566773.2332,5713255.904,16.1,19.1,301.899993896484,318,0.57,334.328460693359,-16.3,,
"50",AB2,"4",566779.2467,5713250.926,34,59.8,301.959991455078,336,1.79,334.891754150391,1.1,335.149078369141,-0.9
"51",AB2,"8",566782.273,5713269.233,37.7,78.8,302.910003662109,340.6,2.36,340.683441162109,-0.1,340.683441162109,0.1
"52",AB2,"5",566783.2649,5713261.475,16.4,20.7,302.410003662109,318.8,0.62,338.264831542969,-19.5,,
"53",AB2,"7",566784.5954,5713270.251,25.2,25,302.790008544922,328,0.75,340.139129638672,-12.1,,
"54",AB2,"6",566786.2675,5713266.42,20.9,24.9,302.720001220703,323.6,0.75,338.955871582031,-15.4,,
"55",AB2,"10",566788.4638,5713257.067,35,62.7,302.470001220703,337.5,1.88,336.065643310547,1.4,336.065643310547,-1.4
"56",AB2,"9",566788.5065,5713252.093,10.8,16.7,302.230010986328,313,0.5,329.508758544922,-16.5,,
"57",AB3,"1",566769.3132,5713276.735,32,60.2,302.420013427734,334.4,1.81,337.341430664062,-2.9,337.341430664062,2.9
"58",AB3,"3",566769.9971,5713283.292,17.4,21.2,302.440002441406,319.8,0.64,334.491943359375,-14.7,,
"59",AB3,"4",566770.3989,5713289.365,33.8,60.6,302.640014648438,336.4,1.82,337.368133544922,-1,337.368133544922,1
"60",AB3,"2",566773.757,5713274.777,30,58,302.660003662109,332.7,1.74,336.353271484375,-3.7,336.714660644531,4
"61",AB3,"5",566777.8743,5713286.401,31,53.2,302.829986572266,333.8,1.6,336.796630859375,-3,,
"62",AB3,"6",566778.7497,5713285.324,10.4,18.3,302.869995117188,313.3,0.55,336.09375,-22.8,,
"63",AB3,"7",566781.751,5713285.323,27,55.7,303.010009765625,330,1.67,337.194061279297,-7.2,,
"64",AB4,"3",566771.389,5713291.653,20.2,27.8,302.679992675781,322.9,0.83,336.458374023438,-13.6,,
"65",AB4,"4",566771.9093,5713295.716,26,40.8,302.790008544922,328.8,1.22,334.328216552734,-5.5,,
"66",AB4,"1",566772.6722,5713290.396,4.9,12.4,302.799987792969,307.7,0.37,335.832550048828,-28.1,,
"67",AB4,"9",566775.421,5713300.922,20.2,28.1,302.910003662109,323.1,0.84,334.8076171875,-11.7,335.731384277344,12.6
"68",AB4,"2",566778.492,5713290.552,22.1,26.5,302.970001220703,325.1,0.8,335.657897949219,-10.6,,
"69",AB4,"10",566782.5977,5713290.582,28.5,66.5,303.079986572266,331.6,2,333.915710449219,-2.3,,
"70",AB4,"11",566786.0235,5713293.659,13.1,18.9,303.260009765625,316.4,0.57,332.139495849609,-15.7,,
"71",AB5,"107",566771.4714,5713320.457,9.5,11.4,302.920013427734,312.4,0.34,330.284820556641,-17.9,,
"72",AB5,"103",566772.4339,5713321.117,11,12.3,303.040008544922,314,0.37,330.569305419922,-16.6,,
"73",AB5,"105",566773.734,5713317.878,10,12.3,303.049987792969,313,0.37,332.198150634766,-19.2,,
"74",AB5,"106",566776.2602,5713320.423,9.6,10.4,303.220001220703,312.8,0.31,332.089996337891,-19.3,,
"75",AB5,"101",566776.8195,5713324.632,12,12.5,303.309997558594,315.3,0.38,317.382415771484,-2.1,,
"76",AB5,"102",566777.8736,5713324.027,11,10.8,303.350006103516,314.4,0.32,317.480194091797,-3.1,,
"77",AB5,"1",566784.5601,5713314.99,29,71.9,303.609985351562,332.6,2.16,336.227935791016,-3.6,336.2470703125,3.6
"78",AB6,"1",566770.3076,5713349.76,31.5,58.6,303.309997558594,334.8,1.76,334.238739013672,0.6,335.984130859375,1.2
"79",AB6,"10",566772.6099,5713337.209,13.4,18.4,303.359985351562,316.8,0.55,317.342803955078,-0.5,,
"80",AB6,"103",566775.9735,5713331.473,8.6,11.3,303.320007324219,311.9,0.34,328.283172607422,-16.4,,
"81",AB6,"5",566777.8386,5713346.659,32.7,56.4,303.760009765625,336.5,1.69,337.916076660156,-1.4,,
"82",AB6,"102",566778.5469,5713334.219,8,10.8,303.589996337891,311.6,0.32,333.62353515625,-22,,
"83",AB6,"2",566778.9616,5713349.848,10,18.8,303.820007324219,313.8,0.56,339.580078125,-25.8,,
"84",AB6,"101",566780.8006,5713334.732,8.5,10.5,303.700012207031,312.2,0.32,333.392425537109,-21.2,,
"85",AB6,"3",566781.424,5713349.86,29.5,29.4,303.929992675781,333.4,0.88,339.483551025391,-6.1,,
"86",AB6,"9",566782.1563,5713336.968,33.1,49.3,303.899993896484,337,1.48,335.282104492188,1.7,,
"87",AB6,"6",566785.5644,5713339.265,9.3,15.6,304.049987792969,313.3,0.47,312.703582763672,0.6,,
"88",AB6,"8",566785.6395,5713333.238,29.9,48.3,304.119995117188,334,1.45,334.766662597656,-0.8,335.358612060547,1.4
"89",AC1,"2",566790.7685,5713246.038,26,65.2,302.179992675781,328.2,1.96,334.251617431641,-6.1,334.251617431641,6.1
"90",AC1,"4",566795.1827,5713250.286,22,37.7,302.450012207031,324.5,1.13,331.292510986328,-6.8,331.292510986328,6.8
"91",AC1,"101",566804.8186,5713244.869,9.1,14.2,302.679992675781,311.8,0.43,332.681762695312,-20.9,,
"92",AC1,"3",566809.182,5713247.049,25,51.8,303.010009765625,328,1.55,331.750640869141,-3.8,,
"93",AC2,"6",566796.1573,5713264.85,26.5,32.3,303.010009765625,329.5,0.97,325.830200195312,3.7,,
"94",AC2,"4",566802.5704,5713264.933,13.3,17.6,303.350006103516,316.7,0.53,338.428314208984,-21.7,,
"95",AC2,"2",566804.9097,5713257.987,32,65.4,303.269989013672,335.3,1.96,337.047302246094,-1.7,,
"96",AC2,"3",566806.8139,5713267.105,27.4,36.1,303.559997558594,331,1.08,340.196197509766,-9.2,,
"97",AC2,"5",566808.0129,5713259.503,41.7,56.9,303.429992675781,345.1,1.71,338.292022705078,6.8,,
"98",AC2,"1",566808.3942,5713256.793,14,22.7,303.339996337891,317.3,0.68,336.342864990234,-19,,
"99",AC3,"1",566789.4713,5713278.147,33.8,53.2,303.260009765625,337.1,1.6,337.167175292969,-0.1,337.167175292969,0.1
"100",AC3,"5",566792.2533,5713290.493,39.2,60.7,303.589996337891,342.8,1.82,334.61083984375,8.2,336.011260986328,-6.8
"101",AC3,"101",566794.5713,5713288.757,9.8,10.1,303.570007324219,313.4,0.3,332.253570556641,-18.9,,
"102",AC3,"2",566794.9782,5713275.687,38.3,55.1,303.25,341.6,1.65,336.558502197266,5,336.794830322266,-4.8
"103",AC3,"3",566804.9172,5713276.39,30.6,85.9,303.380004882812,334,2.58,339.270751953125,-5.3,340.340026855469,6.3
"104",AC3,"4",566830.4551,5713294.318,15.5,26.8,305.109985351562,320.6,0.8,340.813720703125,-20.2,,
"105",AC4,"1",566788.7633,5713296.8,20.6,24,303.429992675781,324,0.72,334.468719482422,-10.5,,
"106",AC4,"6",566790.2611,5713312.311,29.3,61,303.790008544922,333.1,1.83,334.577392578125,-1.5,,
"107",AC4,"2",566793.5155,5713297.61,39.7,55.5,303.739990234375,343.4,1.67,335.003784179688,8.4,335.036865234375,-8.4
"108",AC5,"4",566788.9263,5713330.805,12,10.1,304.019989013672,316,0.3,332.30712890625,-16.3,,
"109",AC5,"103",566790.2954,5713312.626,28.2,61.4,303.850006103516,332.1,1.84,334.545349121094,-2.4,,
"110",AC5,"6",566790.9899,5713323.687,35.8,57.1,304.029998779297,339.8,1.71,333.234771728516,6.6,333.777038574219,-6
"111",AC5,"5",566792.8559,5713316.985,21,27.8,304.010009765625,325,0.83,323.426788330078,1.6,,
"112",AC5,"3",566793.8537,5713313.811,15.1,24.4,304.019989013672,319.1,0.73,332.132263183594,-13,,
"113",AC5,"11",566795.7172,5713325.33,20.4,28.6,304.339996337891,324.7,0.86,333.182006835938,-8.5,,
"114",AC5,"10",566798.1781,5713327.151,21.2,19.8,304.440002441406,325.6,0.59,335.913024902344,-10.3,,
"115",AC5,"101",566798.6504,5713331.418,9,15.5,304.540008544922,313.5,0.47,334.849304199219,-21.3,,
"116",AC5,"8",566802.2572,5713327.426,30,43.3,304.619995117188,334.6,1.3,335.104431152344,-0.5,,
"117",AC5,"102",566802.5187,5713313.637,33.2,68.3,304.480010986328,337.7,2.05,337.18505859375,0.5,337.242156982422,-0.5
"118",AC5,"9",566805.5544,5713324.448,33.4,55.5,304.730010986328,338.1,1.67,334.917266845703,3.2,,
"119",AC5,"1",566807.368,5713314.572,9.2,17.1,304.630004882812,313.8,0.51,334.199859619141,-20.4,,
"120",AC6,"7",566791.3015,5713348.995,17.8,22.9,304.359985351562,322.2,0.69,327.77001953125,-5.6,,
"121",AC6,"1",566794.4942,5713333.118,31,56.1,304.380004882812,335.4,1.68,335.423583984375,0,,
"122",AC6,"3",566796.3053,5713339.139,23.7,17.5,304.5,328.2,0.53,337.992462158203,-9.8,,
"123",AC6,"2",566797.3722,5713336.02,14.7,21.6,304.489990234375,319.2,0.65,336.668823242188,-17.5,,
"124",AC6,"11",566799.5245,5713341.393,37,56.9,304.720001220703,341.7,1.71,337.977386474609,3.7,338.582153320312,-3.1
"125",AC6,"10",566804.6624,5713336.805,36,57,304.779998779297,340.8,1.71,338.218902587891,2.6,338.251525878906,-2.5
"126",AC6,"101",566805.9411,5713342.181,6.7,10.9,304.890014648438,311.6,0.33,336.919769287109,-25.3,,
"127",AD1,"101",566814.4724,5713244.395,7.2,11.5,303.079986572266,310.3,0.35,333.602478027344,-23.3,,
"128",AD1,"4",566820.8772,5713244.477,12.8,20.5,303.450012207031,316.3,0.62,338.148254394531,-21.8,,
"129",AD1,"5",566821.5185,5713246.529,24.7,30,303.679992675781,328.4,0.9,337.524658203125,-9.1,,
"130",AD1,"6",566822.2851,5713249.811,32.5,54.7,303.910003662109,336.4,1.64,337.637115478516,-1.2,,
"131",AD1,"2",566822.4649,5713235.704,41.2,60.3,303.220001220703,344.4,1.81,337.977203369141,6.4,,
"132",AD1,"3",566823.7922,5713240.946,38,73.6,303.540008544922,341.5,2.21,338.358825683594,3.1,,
"133",AD1,"7",566823.9737,5713251.88,20.7,27.1,303.940002441406,324.6,0.81,334.177124023438,-9.6,,
"134",AD1,"1",566825.1541,5713232.322,20.8,26.6,303.109985351562,323.9,0.8,336.184112548828,-12.3,,
"135",AD1,"8",566829.3588,5713243.955,33,68.5,303.829986572266,336.8,2.06,339.672210693359,-2.9,,
"136",AD1,"9",566829.7705,5713233.789,23.4,27.2,303.190002441406,326.6,0.82,335.062469482422,-8.5,,
"137",AD2,"4",566813.2361,5713260.271,5.3,11.9,303.730010986328,309,0.36,334.512420654297,-25.5,,
"138",AD2,"1",566813.5896,5713255.505,27,64.7,303.670013427734,330.7,1.94,337.319763183594,-6.6,,
"139",AD2,"3",566817.009,5713258.184,11,18.9,303.859985351562,314.9,0.57,335.873931884766,-21,,
"140",AD2,"11",566819.3564,5713262.087,21,48.8,304.089996337891,325.1,1.46,336.742340087891,-11.6,,
"141",AD2,"2",566820.6264,5713256.302,26,55.1,304.010009765625,330,1.65,336.40234375,-6.4,,
"142",AD2,"8",566827.3303,5713269.122,12.3,64.3,304.470001220703,316.8,1.93,335.719177246094,-18.9,317.175628662109,0.4
"143",AD2,"9",566828.7872,5713265.986,27,67.8,304.529998779297,331.5,2.03,338.209625244141,-6.7,338.838806152344,7.3
"144",AD2,"10",566828.9471,5713263.21,10,25.2,304.339996337891,314.3,0.76,337.396942138672,-23.1,,
"145",AD3,"9",566811.4232,5713278.079,34,40.8,303.609985351562,337.6,1.22,337.22509765625,0.4,,
"146",AD3,"1",566812.982,5713292.092,38,51,304.25,342.3,1.53,339.114929199219,3.2,,
"147",AD3,"2",566813.7205,5713292.279,13.6,20,304.309997558594,317.9,0.6,339.114929199219,-21.2,,
"148",AD3,"6",566817.6534,5713284.762,19.2,25.6,304.220001220703,323.4,0.77,339.869567871094,-16.5,,
"149",AD3,"3",566819.5922,5713291.61,35.4,62.5,304.679992675781,340.1,1.88,342.022033691406,-1.9,,
"150",AD3,"5",566820.2,5713284.28,38.4,62.2,304.369995117188,342.8,1.87,340.149597167969,2.7,,
"151",AD3,"4",566822.0356,5713293.708,35.2,57,304.779998779297,340,1.71,341.241577148438,-1.2,,
"152",AD3,"10",566826.9402,5713277.812,14.8,23.1,304.489990234375,319.3,0.69,338.625854492188,-19.3,,
"153",AD4,"102",566808.7668,5713291.438,14,12.5,303.980010986328,318,0.38,337.807037353516,-19.8,,
"154",AD4,"101",566813.0254,5713295.157,12.2,16.3,304.429992675781,316.6,0.49,335.441009521484,-18.8,,
"155",AD4,"103",566814.9913,5713299.493,11.8,14.6,304.640014648438,316.4,0.44,314.771606445312,1.6,,
"156",AD4,"2",566817.2239,5713295.978,18,26.4,304.609985351562,322.6,0.79,337.033020019531,-14.4,,
"157",AD4,"104",566819.0798,5713300.518,10,11.2,304.850006103516,314.9,0.34,338.615203857422,-23.7,,
"158",AD4,"3",566820.6346,5713298.274,24,26.2,304.820007324219,328.8,0.79,339.689788818359,-10.9,,
"159",AD4,"1",566823.2158,5713296.841,30.4,53,304.910003662109,335.3,1.59,340.189147949219,-4.9,,
"160",AD5,"3",566805.4969,5713329.343,30.4,52.2,304.820007324219,335.2,1.57,337.331939697266,-2.1,,
"161",AD5,"4",566807.077,5713327.882,7.8,10.9,304.829986572266,312.6,0.33,337.541900634766,-24.9,,
"162",AD5,"102",566808.3596,5713323.485,11,12.4,304.769989013672,315.8,0.37,338.619079589844,-22.8,,
"163",AD5,"2",566809.0809,5713323.934,31,43.6,304.839996337891,335.8,1.31,340.327056884766,-4.5,,
"164",AD5,"5",566809.7507,5713311.658,30.6,55.9,304.799987792969,335.4,1.68,335.640319824219,-0.2,,
"165",AD5,"1",566814.4227,5713328.587,35.8,78.1,305.119995117188,340.9,2.34,342.489593505859,-1.6,342.785400390625,1.9
"166",AD5,"101",566817.7639,5713322.742,12.4,11.8,305.070007324219,317.5,0.35,341.481048583984,-24,,
"167",AD5,"6",566819.6135,5713317.67,30.8,74.8,305.170013427734,336,2.24,344.221801757812,-8.2,345.518920898438,9.5
"168",AD6,"1",566806.8525,5713334.22,13.1,16.3,304.859985351562,318,0.49,336.235656738281,-18.2,,
"169",AD6,"3",566807.9003,5713348.943,25.8,33.3,304.970001220703,330.8,1,339.636810302734,-8.8,,
"170",AD6,"2",566810.3025,5713341.815,31.6,60.7,305.010009765625,336.6,1.82,337.661346435547,-1.1,,
"171",AD6,"5",566815.1423,5713344.374,26,35.1,305.140014648438,331.1,1.05,338.571044921875,-7.5,,
"172",AD6,"4",566815.4512,5713351.091,19.4,23.2,305.200012207031,324.6,0.7,341.924896240234,-17.3,,
"173",AD6,"7",566817.5877,5713333.356,8,11.4,305.140014648438,313.1,0.34,340.767211914062,-27.7,,
"174",AD6,"6",566821.6964,5713342.066,28.9,69.9,305.279998779297,334.2,2.1,340.833557128906,-6.6,340.833557128906,6.6
"175",AD6,"8",566822.5127,5713334.252,5,11.8,305.309997558594,310.3,0.35,326.972045898438,-16.7,,
"176",AE1,"8",566815.9943,5713241.865,32.2,68.9,303.029998779297,335.2,2.07,337.014129638672,-1.8,,
"177",AE1,"3",566832.1386,5713244.109,21.6,20.6,303.730010986328,325.3,0.62,336.852447509766,-11.6,,
"178",AE1,"1",566834.2546,5713233.473,15.6,22.1,303.160003662109,318.8,0.66,338.932891845703,-20.1,,
"179",AE1,"4",566835.2809,5713245.943,13.6,20.7,303.880004882812,317.5,0.62,336.078338623047,-18.6,,
"180",AE1,"2",566835.5328,5713239.993,31.2,54.8,303.579986572266,334.8,1.64,337.887969970703,-3.1,,
"181",AE1,"5",566840.3693,5713245.239,19.2,23,303.899993896484,323.1,0.69,332.806549072266,-9.7,,
"182",AE1,"6",566844.2424,5713242.568,14.2,22.2,303.850006103516,318.1,0.67,337.281311035156,-19.2,,
"183",AE1,"7",566851.3723,5713239.196,28.6,62.3,303.779998779297,332.4,1.87,337.601196289062,-5.2,,
"184",AE2,"101",566834.4026,5713257.657,7.6,12.5,304.220001220703,311.8,0.38,335.285186767578,-23.5,,
"185",AE2,"2",566835.2444,5713259.222,9.6,18,304.369995117188,314,0.54,334.610321044922,-20.6,,
"186",AE2,"1",566836.867,5713252.346,29.3,54.9,304.160003662109,333.5,1.65,337.978118896484,-4.5,337.978118896484,4.5
"187",AE2,"103",566837.2609,5713252.86,13.6,12,304.359985351562,318,0.36,337.978118896484,-20,,
"188",AE2,"3",566838.2631,5713261.646,9.6,10.6,304.489990234375,314.1,0.32,321.824401855469,-7.7,,
"189",AE2,"4",566838.7237,5713261.441,11.8,13.3,304.570007324219,316.4,0.4,321.824401855469,-5.4,,
"190",AE2,"102",566840.7329,5713261.342,8.5,11.2,304.470001220703,313,0.34,321.5908203125,-8.6,,
"191",AE2,"104",566842.054,5713252.428,14.9,10.9,304.200012207031,319.1,0.33,322.926208496094,-3.8,,
"192",AE2,"5",566847.0819,5713261.551,20.9,33.8,304.720001220703,325.6,1.01,326.677124023438,-1.1,327.170776367188,1.6
"193",AE3,"6",566831.4336,5713281.394,10.4,14.2,304.769989013672,315.2,0.43,339.529510498047,-24.3,,
"194",AE3,"5",566832.4828,5713278.618,33.2,66.5,304.850006103516,338.1,2,340.127227783203,-2,340.127227783203,2
"195",AE3,"7",566836.1845,5713281.173,26.8,29.2,304.989990234375,331.8,0.88,339.328277587891,-7.5,,
"196",AE3,"4",566837.1612,5713276.102,8.1,27.9,305.049987792969,313.1,0.84,341.003234863281,-27.9,,
"197",AE3,"2",566840.9466,5713275.538,27.6,52.5,305.230010986328,332.8,1.58,339.769439697266,-7,341.272613525391,8.5
"198",AE3,"3",566842.0055,5713276.944,11,15.5,305.209991455078,316.2,0.47,338.720092773438,-22.5,,
"199",AE3,"1",566843.0777,5713273.236,8.6,23.8,305.119995117188,313.7,0.71,337.081970214844,-23.4,,
"200",AE4,"1",566828.3603,5713304.832,26.4,56.6,305.190002441406,331.6,1.7,335.986419677734,-4.4,336.054473876953,4.5
"201",AE4,"2",566829.8838,5713301.278,9,12.6,305.170013427734,314.2,0.38,335.155822753906,-21,,
"202",AE4,"3",566831.5035,5713294.015,28.8,45.2,305.149993896484,333.9,1.36,340.813720703125,-6.9,,
"203",AE4,"4",566837.1378,5713293.451,32,67,305.359985351562,337.4,2.01,341.123291015625,-3.7,,
"204",AE4,"7",566838.9427,5713308.132,27.2,56.6,305.75,333,1.7,341.8818359375,-8.9,341.951171875,9
"205",AE4,"5",566840.2157,5713294.954,32.8,59.8,305.529998779297,338.3,1.79,340.475219726562,-2.2,,
"206",AE4,"8",566841.5454,5713311.326,26.8,41,305.940002441406,332.7,1.23,340.804870605469,-8.1,,
"207",AE4,"6",566847.8579,5713294.256,23,51,305.829986572266,328.8,1.53,342.519714355469,-13.7,341.87939453125,13.1
"208",AE5,"2",566829.5211,5713332.19,15.4,19.3,305.410003662109,320.8,0.58,332.891571044922,-12.1,,
"209",AE5,"1",566830.5534,5713323.997,31.8,64.3,305.489990234375,337.3,1.93,340.179962158203,-2.9,340.179962158203,2.9
"210",AE5,"6",566834.6858,5713318.508,19.6,25.9,305.570007324219,325.2,0.78,339.795318603516,-14.6,,
"211",AE5,"3",566835.4655,5713327.644,18.4,31,305.510009765625,323.9,0.93,339.913696289062,-16,,
"212",AE5,"5",566836.0042,5713328.023,22.4,71,305.549987792969,327.9,2.13,339.913696289062,-12,,
"213",AE5,"4",566837.0335,5713323.697,16,19,305.670013427734,321.7,0.57,340.463439941406,-18.8,,
"214",AE5,"8",566842.6649,5713313.631,28.4,41,305.959991455078,334.4,1.23,341.312774658203,-6.9,,
"215",AE5,"7",566847.8778,5713313.206,31,51.8,306.209991455078,337.2,1.55,342.579956054688,-5.4,,
"216",AE6,"1",566830.827,5713342.16,29.1,57.1,305.529998779297,334.6,1.71,338.993530273438,-4.4,339.330261230469,4.7
"217",AE6,"2",566831.0197,5713348.75,23.4,29.4,305.5,328.9,0.88,339.728637695312,-10.8,,
"218",AE6,"101",566832.0153,5713340.576,11.1,11.7,305.480010986328,316.6,0.35,332.633026123047,-16,,
"219",AE6,"9",566834.754,5713350.848,10.6,32.1,305.709991455078,316.3,0.96,340.202880859375,-23.9,,
"220",AE6,"3",566837.701,5713347.71,31.4,51.2,305.739990234375,337.1,1.54,340.669006347656,-3.6,340.904144287109,3.8
"221",AE6,"8",566842.5275,5713330.922,25,33.9,305.779998779297,330.8,1.02,337.284942626953,-6.5,,
"222",AF1,"101",566855.3689,5713234.48,8.2,13.3,303.609985351562,311.8,0.4,335.236267089844,-23.4,,
"223",AF1,"2",566855.492,5713243.378,32.4,50.9,303.989990234375,336.4,1.53,337.010223388672,-0.6,,
"224",AF1,"3",566861.0977,5713236.586,19,23.3,303.820007324219,322.8,0.7,332.956939697266,-10.2,,
"225",AF1,"4",566865.1859,5713239.562,30.8,68,303.890014648438,334.7,2.04,336.688629150391,-2,,
"226",AF2,"4",566854.0699,5713272.541,41.8,61.4,305.320007324219,347.1,1.84,338.041351318359,9.1,,
"227",AF2,"103",566859.5837,5713255.358,13.2,11.6,304.540008544922,317.7,0.35,317.827117919922,-0.1,,
"228",AF2,"5",566861.6054,5713270.004,30.1,48.9,305.380004882812,335.5,1.47,335.162841796875,0.3,337.236724853516,1.7
"229",AF2,"101",566861.8039,5713258.332,11.6,11,304.779998779297,316.4,0.33,316.726226806641,-0.3,,
"230",AF2,"6",566863.6256,5713270.993,22.2,31.5,305.440002441406,327.6,0.95,333.400604248047,-5.8,,
"231",AF2,"2",566866.8083,5713254.829,6.5,17.5,304.670013427734,311.2,0.53,337.953033447266,-26.8,,
"232",AF3,"1",566852.5242,5713273.231,46.4,63.7,305.329986572266,351.7,1.91,338.041351318359,13.7,,
"233",AF3,"3",566853.9178,5713282.814,31.6,54.3,305.670013427734,337.3,1.63,341.018432617188,-3.7,,
"234",AF3,"4",566854.716,5713285.425,9.4,18.9,305.75,315.2,0.57,340.838165283203,-25.6,,
"235",AF3,"102",566857.6034,5713279.732,7.4,11.5,305.720001220703,313.1,0.35,334.751861572266,-21.7,,
"236",AF3,"5",566864.1859,5713275.731,10.8,17,305.670013427734,316.5,0.51,333.918670654297,-17.4,,
"237",AF3,"101",566867.2763,5713269.095,8,11.9,305.339996337891,313.3,0.36,326.668853759766,-13.4,,
"238",AF4,"3",566851.1649,5713304.494,18.8,30.3,306.420013427734,325.2,0.91,341.365081787109,-16.2,,
"239",AF4,"2",566852.0801,5713296.678,34.8,70.7,306.260009765625,341.1,2.12,343.033172607422,-1.9,344.095306396484,3
"240",AF4,"4",566855.9815,5713304.376,28.6,59.5,306.5,335.1,1.79,341.709991455078,-6.6,342.280181884766,7.2
"241",AF4,"5",566860.1752,5713310.833,11.4,16,306.640014648438,318,0.48,341.98486328125,-24,,
"242",AF4,"1",566861.1679,5713297.934,24.2,52,306.589996337891,330.8,1.56,341.334655761719,-10.5,341.802551269531,11
"243",AF5,"3",566847.5678,5713315.08,19.1,24.4,306.130004882812,325.2,0.73,341.695434570312,-16.5,,
"244",AF5,"2",566849.6167,5713313.705,7,11.6,306.190002441406,313.2,0.35,342.554107666016,-29.4,,
"245",AF5,"9",566849.7526,5713331.461,29.6,51,306.040008544922,335.6,1.53,342.904632568359,-7.3,,
"246",AF5,"8",566849.7558,5713326.049,12.7,22,305.970001220703,318.7,0.66,342.635040283203,-23.9,,
"247",AF5,"7",566850.1347,5713324.777,30.3,50.6,305.989990234375,336.3,1.52,342.517425537109,-6.2,342.635101318359,6.3
"248",AF5,"1",566852.7286,5713313.762,30.7,57.4,306.309997558594,337,1.72,342.417877197266,-5.4,,
"249",AF5,"4",566854.0603,5713318.08,31,60.8,306.230010986328,337.2,1.82,342.602111816406,-5.4,,
"250",AF5,"6",566855.0657,5713321.485,9,13.8,306.079986572266,315.1,0.41,342.351806640625,-27.3,,
"251",AF5,"10",566861.9203,5713324.691,28,70.5,306.170013427734,334.2,2.12,344.365264892578,-10.2,344.748870849609,10.5
"252",AF5,"5",566864.1818,5713314.809,33,62.3,306.690002441406,339.7,1.87,343.416717529297,-3.7,343.872802734375,4.2
"253",AF6,"4",566853.0783,5713333.401,28.6,60.3,306.130004882812,334.7,1.81,343.724548339844,-9,,
"254",AF6,"3",566855.4306,5713337.156,28.4,53.3,306.190002441406,334.6,1.6,343.573272705078,-9,343.755493164062,9.2
"255",AF6,"1",566863.0656,5713334.342,7.6,17.9,306.380004882812,314,0.54,343.257354736328,-29.3,,
"256",AF6,"5",566871.2571,5713359.64,30.4,59.4,308.619995117188,339,1.78,342.695190429688,-3.7,,
