<?xml version="1.0" encoding="iso-8859-1"?>
<!-- Generator: Adobe Illustrator 18.0.0, SVG Export Plug-In . SVG Version: 6.00 Build 0)  -->
<!DOCTYPE svg PUBLIC "-//W3C//DTD SVG 1.1//EN" "http://www.w3.org/Graphics/SVG/1.1/DTD/svg11.dtd">
<svg version="1.1" id="Capa_1" xmlns="http://www.w3.org/2000/svg" xmlns:xlink="http://www.w3.org/1999/xlink" x="0px" y="0px"
	 viewBox="0 0 59 59" style="enable-background:new 0 0 59 59;" xml:space="preserve">
<g>
	<path d="M58.953,43.6c-0.116-0.367-0.434-0.634-0.814-0.688l-7.777-1.089l-3.472-6.78c-0.342-0.668-1.438-0.668-1.779,0
		l-3.472,6.78l-7.777,1.089c-0.381,0.054-0.698,0.32-0.814,0.688s-0.012,0.768,0.269,1.031l5.605,5.267L37.6,57.325
		c-0.066,0.373,0.084,0.752,0.388,0.978c0.305,0.226,0.711,0.262,1.049,0.089L46,54.863l6.964,3.528
		c0.143,0.073,0.298,0.108,0.452,0.108c0.211,0,0.421-0.066,0.597-0.197c0.304-0.226,0.454-0.604,0.388-0.978l-1.321-7.427
		l5.605-5.267C58.965,44.368,59.069,43.968,58.953,43.6z M51.315,48.811c-0.246,0.231-0.359,0.571-0.3,0.903l1.064,5.987
		l-5.628-2.852c-0.143-0.072-0.297-0.108-0.452-0.108s-0.31,0.036-0.452,0.108l-5.628,2.852l1.064-5.987
		c0.06-0.332-0.054-0.672-0.3-0.903l-4.479-4.207l6.225-0.872c0.322-0.045,0.603-0.244,0.751-0.534L46,37.694l2.818,5.504
		c0.148,0.29,0.429,0.489,0.751,0.534l6.225,0.872L51.315,48.811z"/>
	<path d="M26,47.5H2v-45h54v31c0,0.553,0.447,1,1,1s1-0.447,1-1v-32c0-0.553-0.447-1-1-1H1c-0.553,0-1,0.447-1,1v47
		c0,0.553,0.447,1,1,1h25c0.553,0,1-0.447,1-1S26.553,47.5,26,47.5z"/>
	<path d="M31.019,31.226c0-2.06,1.94-3.735,4.326-3.735c1.121,0,2.19,0.38,3.012,1.07c0.424,0.358,1.055,0.302,1.408-0.121
		c0.19-0.225,0.255-0.509,0.217-0.78C39.985,27.629,40,27.602,40,27.57v-12v-1.449V10.57c0-0.288-0.124-0.562-0.341-0.752
		s-0.499-0.279-0.79-0.239l-18,2.367C20.372,12.012,20,12.435,20,12.937v3.551v1.449v14.434c-1.169-1.019-2.754-1.649-4.5-1.649
		c-3.584,0-6.5,2.642-6.5,5.889s2.916,5.889,6.5,5.889s6.5-2.642,6.5-5.889V18.814l16-2.104v9.341
		c-0.829-0.353-1.726-0.56-2.655-0.56c-3.488,0-6.326,2.573-6.326,5.735c0,1.552,0.672,3.005,1.892,4.091
		c0.19,0.17,0.428,0.253,0.665,0.253c0.275,0,0.549-0.113,0.747-0.335c0.367-0.412,0.33-1.045-0.082-1.412
		C31.452,33.122,31.019,32.2,31.019,31.226z M15.5,40.5c-2.481,0-4.5-1.744-4.5-3.889s2.019-3.889,4.5-3.889s4.5,1.744,4.5,3.889
		S17.981,40.5,15.5,40.5z M22,16.798v-0.31v-2.674l16-2.104v2.411v0.572L22,16.798z"/>
</g>
<g>
</g>
<g>
</g>
<g>
</g>
<g>
</g>
<g>
</g>
<g>
</g>
<g>
</g>
<g>
</g>
<g>
</g>
<g>
</g>
<g>
</g>
<g>
</g>
<g>
</g>
<g>
</g>
<g>
</g>
</svg>
