<?xml version="1.0" encoding="iso-8859-1"?>
<!-- Generator: Adobe Illustrator 18.0.0, SVG Export Plug-In . SVG Version: 6.00 Build 0)  -->
<!DOCTYPE svg PUBLIC "-//W3C//DTD SVG 1.1//EN" "http://www.w3.org/Graphics/SVG/1.1/DTD/svg11.dtd">
<svg version="1.1" id="Capa_1" xmlns="http://www.w3.org/2000/svg" xmlns:xlink="http://www.w3.org/1999/xlink" x="0px" y="0px"
	 viewBox="0 0 60 60" style="enable-background:new 0 0 60 60;" xml:space="preserve">
<g>
	<path d="M35,36v24h24V36H35z M57,58H37V38h9v12.586l-4.293-4.293l-1.414,1.414L47,54.414l6.707-6.707l-1.414-1.414L48,50.586V38h9
		V58z"/>
	<path d="M22.504,18h10.991C35.428,18,37,16.428,37,14.495V13c0-0.553-0.448-1-1-1s-1,0.447-1,1v1.495
		C35,15.325,34.325,16,33.495,16H22.504C21.675,16,21,15.325,21,14.495V13c0-0.553-0.448-1-1-1s-1,0.447-1,1v1.495
		C19,16.428,20.572,18,22.504,18z"/>
	<path d="M30,45h-7.496C21.675,45,21,44.325,21,43.495V42c0-0.553-0.448-1-1-1s-1,0.447-1,1v1.495C19,45.428,20.572,47,22.504,47H30
		c0.552,0,1-0.447,1-1S30.552,45,30,45z"/>
	<path d="M29,58H3.832C3.373,58,3,57.627,3,57.168V31h50v2c0,0.553,0.447,1,1,1s1-0.447,1-1V2.832C55,1.271,53.729,0,52.168,0H3.832
		C2.271,0,1,1.271,1,2.832v54.336C1,58.729,2.271,60,3.832,60H29c0.552,0,1-0.447,1-1S29.552,58,29,58z M3.832,2h48.336
		C52.627,2,53,2.373,53,2.832V29H3V2.832C3,2.373,3.373,2,3.832,2z"/>
</g>
<g>
</g>
<g>
</g>
<g>
</g>
<g>
</g>
<g>
</g>
<g>
</g>
<g>
</g>
<g>
</g>
<g>
</g>
<g>
</g>
<g>
</g>
<g>
</g>
<g>
</g>
<g>
</g>
<g>
</g>
</svg>
