<?xml version="1.0" encoding="iso-8859-1"?>
<!-- Generator: Adobe Illustrator 18.0.0, SVG Export Plug-In . SVG Version: 6.00 Build 0)  -->
<!DOCTYPE svg PUBLIC "-//W3C//DTD SVG 1.1//EN" "http://www.w3.org/Graphics/SVG/1.1/DTD/svg11.dtd">
<svg version="1.1" id="Capa_1" xmlns="http://www.w3.org/2000/svg" xmlns:xlink="http://www.w3.org/1999/xlink" x="0px" y="0px"
	 viewBox="0 0 57.414 57.414" style="enable-background:new 0 0 57.414 57.414;" xml:space="preserve">
<g>
	<path d="M53.414,31.839c-0.43-4.107-3.853-7.332-7.954-7.332c-2.563,0-4.983,1.287-6.479,3.402
		c-0.292-0.051-0.587-0.076-0.883-0.076c-2.321,0-4.382,1.577-5.066,3.813c-1.908,1.131-3.117,3.241-3.117,5.503
		c0,3.506,2.785,6.358,6.208,6.358h10.774c0.063,0,0.126-0.004,0.173-0.008c0.063,0.004,0.124,0.008,0.187,0.008h4.31
		c3.225,0,5.849-2.687,5.849-5.989C57.414,34.918,55.772,32.645,53.414,31.839z M51.565,41.507l-4.351-0.003l-0.188-0.006
		l-10.905,0.009c-2.32,0-4.208-1.955-4.208-4.358c0-1.666,0.949-3.21,2.418-3.934L34.767,33l0.102-0.475
		c0.331-1.561,1.689-2.692,3.229-2.692c0.343,0,0.686,0.057,1.018,0.169l0.777,0.261l0.409-0.711
		c1.097-1.906,3.024-3.045,5.158-3.045c3.265,0,5.955,2.747,5.999,6.123l0.011,0.813l0.799,0.155
		c1.822,0.354,3.146,2.002,3.146,3.919C55.414,39.717,53.688,41.507,51.565,41.507z"/>
	<path d="M38.494,13.443c0,2.17,1.766,3.935,3.936,3.935s3.935-1.765,3.935-3.935S44.6,9.507,42.43,9.507
		S38.494,11.273,38.494,13.443z M44.364,13.443c0,1.066-0.868,1.935-1.935,1.935c-1.067,0-1.936-0.868-1.936-1.935
		c0-1.067,0.868-1.936,1.936-1.936C43.496,11.507,44.364,12.375,44.364,13.443z"/>
	<path d="M32.121,2.507h12.352l9.941,9.919v12.896h2V11.596L45.299,0.507H31.295l-25.3,25.217l0.009,0.008L0,31.72l25.133,25.187
		l7.714-7.387L8.84,25.728L32.121,2.507z M29.981,49.495l-4.817,4.613L2.828,31.724l4.596-4.584L29.981,49.495z"/>
</g>
<g>
</g>
<g>
</g>
<g>
</g>
<g>
</g>
<g>
</g>
<g>
</g>
<g>
</g>
<g>
</g>
<g>
</g>
<g>
</g>
<g>
</g>
<g>
</g>
<g>
</g>
<g>
</g>
<g>
</g>
</svg>
