<?xml version="1.0" encoding="iso-8859-1"?>
<!-- Generator: Adobe Illustrator 18.0.0, SVG Export Plug-In . SVG Version: 6.00 Build 0)  -->
<!DOCTYPE svg PUBLIC "-//W3C//DTD SVG 1.1//EN" "http://www.w3.org/Graphics/SVG/1.1/DTD/svg11.dtd">
<svg version="1.1" id="Capa_1" xmlns="http://www.w3.org/2000/svg" xmlns:xlink="http://www.w3.org/1999/xlink" x="0px" y="0px"
	 viewBox="0 0 58 58" style="enable-background:new 0 0 58 58;" xml:space="preserve">
<g>
	<path d="M43.585,35.042c-0.27-0.032-0.543-0.053-0.821-0.053c-0.491,0-0.969,0.053-1.431,0.151
		c-4.595,0.594-8.827,3.552-12.062,8.492l-0.466,0.711l0.359,0.548c3.635,5.552,8.529,8.609,13.783,8.609
		c5.254,0,10.148-3.058,13.783-8.609l0.466-0.711l-0.359-0.548C53.325,38.268,48.636,35.241,43.585,35.042z M47.673,41.897
		c0,2.707-2.202,4.909-4.909,4.909s-4.909-2.202-4.909-4.909c0-2.343,1.652-4.302,3.852-4.788c0.446-0.053,0.895-0.087,1.348-0.087
		c0.025,0,0.05,0.002,0.075,0.003C45.663,37.216,47.673,39.315,47.673,41.897z M42.946,51.5c-4.387,0-8.537-2.537-11.743-7.161
		c1.559-2.286,3.348-4.069,5.28-5.304c-0.4,0.874-0.629,1.841-0.629,2.863c0,3.81,3.1,6.909,6.909,6.909s6.909-3.1,6.909-6.909
		c0-1.216-0.318-2.357-0.872-3.351c2.204,1.207,4.242,3.107,5.996,5.637C51.577,48.906,47.383,51.5,42.946,51.5z"/>
	<path d="M37,27.5c0-0.342-0.175-0.66-0.463-0.844l-11-7c-0.309-0.195-0.698-0.208-1.019-0.033C24.199,19.799,24,20.135,24,20.5v14
		c0,0.365,0.199,0.701,0.519,0.877C24.669,35.459,24.834,35.5,25,35.5c0.187,0,0.374-0.053,0.537-0.156l11-7
		C36.825,28.16,37,27.842,37,27.5z M26,32.679V22.321l8.137,5.179L26,32.679z"/>
	<path d="M57,4.5H47H11H1c-0.552,0-1,0.447-1,1v11v11v11v11c0,0.553,0.448,1,1,1h10h15c0.552,0,1-0.447,1-1s-0.448-1-1-1H12v-10v-11
		v-11v-10h34v10v11c0,0.553,0.448,1,1,1h9v8c0,0.553,0.448,1,1,1s1-0.447,1-1v-9v-11v-11C58,4.947,57.552,4.5,57,4.5z M2,28.5h8v9H2
		V28.5z M10,26.5H2v-9h8V26.5z M2,48.5v-9h8v9H2z M10,15.5H2v-9h8V15.5z M56,6.5v9h-8v-9H56z M48,26.5v-9h8v9H48z"/>
</g>
<g>
</g>
<g>
</g>
<g>
</g>
<g>
</g>
<g>
</g>
<g>
</g>
<g>
</g>
<g>
</g>
<g>
</g>
<g>
</g>
<g>
</g>
<g>
</g>
<g>
</g>
<g>
</g>
<g>
</g>
</svg>
