<?xml version="1.0" encoding="iso-8859-1"?>
<!-- Generator: Adobe Illustrator 18.0.0, SVG Export Plug-In . SVG Version: 6.00 Build 0)  -->
<!DOCTYPE svg PUBLIC "-//W3C//DTD SVG 1.1//EN" "http://www.w3.org/Graphics/SVG/1.1/DTD/svg11.dtd">
<svg version="1.1" id="Capa_1" xmlns="http://www.w3.org/2000/svg" xmlns:xlink="http://www.w3.org/1999/xlink" x="0px" y="0px"
	 viewBox="0 0 60 60" style="enable-background:new 0 0 60 60;" xml:space="preserve">
<g>
	<path d="M55,34.86V32.5h1c0.553,0,1-0.447,1-1s-0.447-1-1-1h-1h-1H40h-1h-1c-0.553,0-1,0.447-1,1s0.447,1,1,1h1v2.36
		c0,3.535,1.845,6.748,4.827,8.64C40.845,45.392,39,48.605,39,52.14v2.36h-1c-0.553,0-1,0.447-1,1s0.447,1,1,1h1h1h14h1h1
		c0.553,0,1-0.447,1-1s-0.447-1-1-1h-1v-2.36c0-3.535-1.845-6.748-4.827-8.64C53.155,41.608,55,38.395,55,34.86z M53,52.14v2.36H41
		v-2.36c0-3.319,2.033-6.298,5.197-7.64h1.605C50.967,45.842,53,48.82,53,52.14z M47.803,42.5h-1.605
		C43.033,41.158,41,38.18,41,34.86V32.5h12v2.36C53,38.18,50.967,41.158,47.803,42.5z"/>
	<path d="M26.525,10.5l-4.712-6.582l-0.001-0.001L21.515,3.5H0v53h31v-2H2v-49h18.485l5,7h0.012l4.69,6.551
		c0.195,0.272,0.502,0.417,0.813,0.418V19.5h27v8h2v-17H26.525z M31.537,17.5l-3.579-5H58v5H31.537z"/>
</g>
<g>
</g>
<g>
</g>
<g>
</g>
<g>
</g>
<g>
</g>
<g>
</g>
<g>
</g>
<g>
</g>
<g>
</g>
<g>
</g>
<g>
</g>
<g>
</g>
<g>
</g>
<g>
</g>
<g>
</g>
</svg>
