<?xml version="1.0" encoding="iso-8859-1"?>
<!-- Generator: Adobe Illustrator 18.0.0, SVG Export Plug-In . SVG Version: 6.00 Build 0)  -->
<!DOCTYPE svg PUBLIC "-//W3C//DTD SVG 1.1//EN" "http://www.w3.org/Graphics/SVG/1.1/DTD/svg11.dtd">
<svg version="1.1" id="Capa_1" xmlns="http://www.w3.org/2000/svg" xmlns:xlink="http://www.w3.org/1999/xlink" x="0px" y="0px"
	 viewBox="0 0 58 58" style="enable-background:new 0 0 58 58;" xml:space="preserve">
<g>
	<path d="M52,37c0-3.859-3.14-7-7-7s-7,3.141-7,7v1h-4v18h22V38h-4V37z M40,37c0-2.757,2.243-5,5-5s5,2.243,5,5v1H40V37z M54,40v14
		H36V40h2h14H54z"/>
	<path d="M44,49.858V51c0,0.553,0.448,1,1,1s1-0.447,1-1v-1.142c1.72-0.447,3-1.999,3-3.858c0-2.206-1.794-4-4-4s-4,1.794-4,4
		C41,47.859,42.28,49.411,44,49.858z M45,44c1.103,0,2,0.897,2,2s-0.897,2-2,2s-2-0.897-2-2S43.897,44,45,44z"/>
	<path d="M21.569,15.569C21.569,12.498,19.071,10,16,10s-5.569,2.498-5.569,5.569c0,3.07,2.498,5.568,5.569,5.568
		S21.569,18.64,21.569,15.569z M12.431,15.569C12.431,13.602,14.032,12,16,12s3.569,1.602,3.569,3.569S17.968,19.138,16,19.138
		S12.431,17.537,12.431,15.569z"/>
	<path d="M6.25,38.661C6.447,38.886,6.723,39,7,39c0.234,0,0.47-0.082,0.66-0.249l16.313-14.362l10.302,10.301
		c0.391,0.391,1.023,0.391,1.414,0s0.391-1.023,0-1.414l-4.807-4.807l9.181-10.054l11.261,10.323
		c0.407,0.373,1.04,0.345,1.413-0.062c0.373-0.407,0.346-1.04-0.062-1.413l-12-11c-0.196-0.179-0.451-0.271-0.72-0.262
		c-0.265,0.012-0.515,0.129-0.694,0.325l-9.794,10.727l-4.743-4.743c-0.374-0.373-0.972-0.391-1.368-0.044L6.339,37.249
		C5.925,37.614,5.884,38.246,6.25,38.661z"/>
	<path d="M57,2H1C0.448,2,0,2.447,0,3v44c0,0.553,0.448,1,1,1h27c0.552,0,1-0.447,1-1s-0.448-1-1-1H2V4h54v28c0,0.553,0.448,1,1,1
		s1-0.447,1-1V3C58,2.447,57.552,2,57,2z"/>
</g>
<g>
</g>
<g>
</g>
<g>
</g>
<g>
</g>
<g>
</g>
<g>
</g>
<g>
</g>
<g>
</g>
<g>
</g>
<g>
</g>
<g>
</g>
<g>
</g>
<g>
</g>
<g>
</g>
<g>
</g>
</svg>
