<?xml version="1.0" encoding="iso-8859-1"?>
<!-- Generator: Adobe Illustrator 18.0.0, SVG Export Plug-In . SVG Version: 6.00 Build 0)  -->
<!DOCTYPE svg PUBLIC "-//W3C//DTD SVG 1.1//EN" "http://www.w3.org/Graphics/SVG/1.1/DTD/svg11.dtd">
<svg version="1.1" id="Capa_1" xmlns="http://www.w3.org/2000/svg" xmlns:xlink="http://www.w3.org/1999/xlink" x="0px" y="0px"
	 viewBox="0 0 58 58" style="enable-background:new 0 0 58 58;" xml:space="preserve">
<g>
	<path d="M55.371,41.943c-0.398-4.089-3.45-7.052-7.271-7.052c-2.396,0-4.407,1.448-5.684,3.212
		c-1.276-1.764-3.288-3.213-5.684-3.213c-3.819,0-6.871,2.963-7.27,7.051c-0.042,0.269-0.145,1.222,0.225,2.711
		c0.545,2.196,1.8,4.19,3.631,5.77l8.335,7.133c0.222,0.187,0.492,0.28,0.763,0.28c0.273,0,0.546-0.096,0.769-0.285l8.331-7.13
		c1.829-1.576,3.084-3.57,3.63-5.768C55.515,43.164,55.413,42.212,55.371,41.943z M53.205,44.17
		c-0.445,1.794-1.48,3.431-2.991,4.732l-7.797,6.673l-7.794-6.671c-1.514-1.304-2.549-2.941-2.993-4.734
		c-0.302-1.214-0.193-1.897-0.194-1.897l0.017-0.106c0.244-2.621,2.137-5.275,5.281-5.275c2.189,0,3.974,1.811,4.77,3.605
		l0.914,2.061l0.914-2.061c0.796-1.794,2.579-3.604,4.77-3.604c3.146,0,5.038,2.654,5.296,5.367
		C53.397,42.266,53.508,42.95,53.205,44.17z"/>
	<path d="M9.417,18h13c0.553,0,1-0.447,1-1s-0.447-1-1-1h-13c-0.553,0-1,0.447-1,1S8.864,18,9.417,18z"/>
	<path d="M9.417,46c-0.553,0-1,0.447-1,1s0.447,1,1,1h11c0.553,0,1-0.447,1-1s-0.447-1-1-1H9.417z"/>
	<path d="M38.417,22h-29c-0.553,0-1,0.447-1,1s0.447,1,1,1h29c0.553,0,1-0.447,1-1S38.969,22,38.417,22z"/>
	<path d="M27.417,35c0-0.553-0.447-1-1-1h-17c-0.553,0-1,0.447-1,1s0.447,1,1,1h17C26.969,36,27.417,35.553,27.417,35z"/>
	<path d="M24.417,41c0-0.553-0.447-1-1-1h-14c-0.553,0-1,0.447-1,1s0.447,1,1,1h14C23.969,42,24.417,41.553,24.417,41z"/>
	<path d="M9.417,30h14c0.553,0,1-0.447,1-1s-0.447-1-1-1h-14c-0.553,0-1,0.447-1,1S8.864,30,9.417,30z"/>
	<path d="M38.417,28h-7c-0.553,0-1,0.447-1,1s0.447,1,1,1h7c0.553,0,1-0.447,1-1S38.969,28,38.417,28z"/>
	<path d="M28.414,29c0-0.261-0.101-0.521-0.29-0.71c-0.37-0.37-1.05-0.37-1.41,0c-0.19,0.189-0.3,0.449-0.3,0.71
		c0,0.26,0.109,0.52,0.3,0.71c0.18,0.189,0.439,0.29,0.7,0.29c0.26,0,0.52-0.101,0.71-0.29C28.313,29.52,28.414,29.26,28.414,29z"/>
	<path d="M30.584,56h-26V8h7v2c0,0.553,0.447,1,1,1h23c0.553,0,1-0.447,1-1V8h7v21c0,0.553,0.447,1,1,1s1-0.447,1-1V7
		c0-0.553-0.447-1-1-1h-8V4c0-0.553-0.447-1-1-1h-6V1c0-0.553-0.447-1-1-1h-9c-0.553,0-1,0.447-1,1v2h-6c-0.553,0-1,0.447-1,1v2h-8
		c-0.553,0-1,0.447-1,1v50c0,0.553,0.447,1,1,1h27c0.553,0,1-0.447,1-1S31.136,56,30.584,56z M20.584,2h7v2v2h-7V4V2z M13.584,5h5v2
		c0,0.553,0.447,1,1,1h9c0.553,0,1-0.447,1-1V5h5v2v2h-21V7V5z"/>
</g>
<g>
</g>
<g>
</g>
<g>
</g>
<g>
</g>
<g>
</g>
<g>
</g>
<g>
</g>
<g>
</g>
<g>
</g>
<g>
</g>
<g>
</g>
<g>
</g>
<g>
</g>
<g>
</g>
<g>
</g>
</svg>
