<?xml version="1.0" encoding="iso-8859-1"?>
<!-- Generator: Adobe Illustrator 18.0.0, SVG Export Plug-In . SVG Version: 6.00 Build 0)  -->
<!DOCTYPE svg PUBLIC "-//W3C//DTD SVG 1.1//EN" "http://www.w3.org/Graphics/SVG/1.1/DTD/svg11.dtd">
<svg version="1.1" id="Capa_1" xmlns="http://www.w3.org/2000/svg" xmlns:xlink="http://www.w3.org/1999/xlink" x="0px" y="0px"
	 viewBox="0 0 55 55" style="enable-background:new 0 0 55 55;" xml:space="preserve">
<g>
	<path d="M42,31c-6.617,0-12,5.383-12,12s5.383,12,12,12s12-5.383,12-12S48.617,31,42,31z M42,53c-5.514,0-10-4.486-10-10
		s4.486-10,10-10s10,4.486,10,10S47.514,53,42,53z"/>
	<path d="M48,42h-5v-5c0-0.553-0.447-1-1-1s-1,0.447-1,1v6c0,0.553,0.447,1,1,1h6c0.553,0,1-0.447,1-1S48.553,42,48,42z"/>
	<path d="M20.354,12c-3.859,0-7,3.141-7,7s3.141,7,7,7s7-3.141,7-7S24.213,12,20.354,12z M20.354,24c-2.757,0-5-2.243-5-5
		s2.243-5,5-5s5,2.243,5,5S23.111,24,20.354,24z"/>
	<path d="M23.206,47.393l-2.989,3.909L6.436,31.4C1.236,24.468,1.982,13.08,8.031,7.031C11.276,3.787,15.589,2,20.177,2
		s8.901,1.787,12.146,5.031c5.377,5.377,6.619,15.474,2.768,22.508c-0.266,0.484-0.088,1.093,0.396,1.357
		c0.485,0.268,1.093,0.088,1.357-0.396c4.32-7.892,2.955-18.821-3.107-24.883C30.115,1.995,25.3,0,20.177,0
		c-5.122,0-9.938,1.995-13.56,5.617c-6.703,6.702-7.536,19.312-1.804,26.952l15.323,22.129l4.657-6.091
		c0.336-0.438,0.252-1.066-0.187-1.401S23.541,46.954,23.206,47.393z"/>
</g>
<g>
</g>
<g>
</g>
<g>
</g>
<g>
</g>
<g>
</g>
<g>
</g>
<g>
</g>
<g>
</g>
<g>
</g>
<g>
</g>
<g>
</g>
<g>
</g>
<g>
</g>
<g>
</g>
<g>
</g>
</svg>
