<?xml version="1.0" encoding="iso-8859-1"?>
<!-- Generator: Adobe Illustrator 18.0.0, SVG Export Plug-In . SVG Version: 6.00 Build 0)  -->
<!DOCTYPE svg PUBLIC "-//W3C//DTD SVG 1.1//EN" "http://www.w3.org/Graphics/SVG/1.1/DTD/svg11.dtd">
<svg version="1.1" id="Capa_1" xmlns="http://www.w3.org/2000/svg" xmlns:xlink="http://www.w3.org/1999/xlink" x="0px" y="0px"
	 viewBox="0 0 60 60" style="enable-background:new 0 0 60 60;" xml:space="preserve">
<g>
	<path d="M53,46h-5v-5c0-0.553-0.448-1-1-1s-1,0.447-1,1v5h-5c-0.552,0-1,0.447-1,1s0.448,1,1,1h5v5c0,0.553,0.448,1,1,1
		s1-0.447,1-1v-5h5c0.552,0,1-0.447,1-1S53.552,46,53,46z"/>
	<path d="M31,26.021V15.879c0-0.553-0.448-1-1-1s-1,0.447-1,1v10.142c-1.44,0.374-2.567,1.521-2.896,2.979H19c-0.552,0-1,0.447-1,1
		s0.448,1,1,1h7.18c0.488,1.658,2.006,2.879,3.82,2.879c2.206,0,4-1.794,4-4C34,28.02,32.72,26.468,31,26.021z M30,31.879
		c-1.103,0-2-0.897-2-2s0.897-2,2-2s2,0.897,2,2S31.103,31.879,30,31.879z"/>
	<path d="M30,9.879c0.552,0,1-0.447,1-1v-1c0-0.553-0.448-1-1-1s-1,0.447-1,1v1C29,9.432,29.448,9.879,30,9.879z"/>
	<path d="M30,49.879c-0.552,0-1,0.447-1,1v1c0,0.553,0.448,1,1,1s1-0.447,1-1v-1C31,50.326,30.552,49.879,30,49.879z"/>
	<path d="M51,30.879h1c0.552,0,1-0.447,1-1s-0.448-1-1-1h-1c-0.552,0-1,0.447-1,1S50.448,30.879,51,30.879z"/>
	<path d="M9,28.879H8c-0.552,0-1,0.447-1,1s0.448,1,1,1h1c0.552,0,1-0.447,1-1S9.552,28.879,9,28.879z"/>
	<path d="M44.849,16.029c0.256,0,0.512-0.098,0.707-0.293l0.707-0.707c0.391-0.391,0.391-1.023,0-1.414s-1.023-0.391-1.414,0
		l-0.707,0.707c-0.391,0.391-0.391,1.023,0,1.414C44.337,15.932,44.593,16.029,44.849,16.029z"/>
	<path d="M14.444,44.021l-0.707,0.707c-0.391,0.391-0.391,1.023,0,1.414c0.195,0.195,0.451,0.293,0.707,0.293
		s0.512-0.098,0.707-0.293l0.707-0.707c0.391-0.391,0.391-1.023,0-1.414S14.834,43.63,14.444,44.021z"/>
	<path d="M15.151,13.615c-0.391-0.391-1.023-0.391-1.414,0s-0.391,1.023,0,1.414l0.707,0.707c0.195,0.195,0.451,0.293,0.707,0.293
		s0.512-0.098,0.707-0.293c0.391-0.391,0.391-1.023,0-1.414L15.151,13.615z"/>
	<path d="M60,30C60,13.458,46.542,0,30,0S0,13.458,0,30s13.458,30,30,30c3.55,0,7.028-0.627,10.35-1.85
		C42.299,59.316,44.568,60,47,60c7.168,0,13-5.832,13-13c0-2.432-0.683-4.701-1.85-6.65C59.373,37.028,60,33.55,60,30z
		 M38.375,56.719C35.667,57.569,32.858,58,30,58C14.561,58,2,45.439,2,30S14.561,2,30,2s28,12.561,28,28
		c0,2.857-0.43,5.667-1.281,8.375c-0.078-0.088-0.167-0.165-0.247-0.251c-0.164-0.175-0.331-0.347-0.505-0.513
		c-0.157-0.15-0.317-0.294-0.48-0.436c-0.159-0.138-0.321-0.271-0.487-0.4c-0.183-0.143-0.367-0.283-0.557-0.417
		c-0.163-0.114-0.33-0.221-0.499-0.328c-0.199-0.126-0.398-0.252-0.604-0.367c-0.178-0.1-0.361-0.19-0.544-0.281
		c-0.204-0.102-0.407-0.206-0.616-0.297c-0.205-0.09-0.417-0.166-0.628-0.245c-0.197-0.074-0.391-0.153-0.591-0.217
		c-0.243-0.078-0.494-0.139-0.743-0.203c-0.178-0.045-0.352-0.099-0.532-0.137c-0.296-0.063-0.599-0.104-0.902-0.146
		c-0.141-0.02-0.28-0.049-0.422-0.064C47.915,34.026,47.461,34,47,34c-7.168,0-13,5.832-13,13c0,0.46,0.026,0.915,0.073,1.363
		c0.015,0.144,0.045,0.284,0.065,0.426c0.042,0.301,0.083,0.603,0.145,0.897c0.038,0.182,0.093,0.358,0.139,0.538
		c0.063,0.247,0.123,0.495,0.201,0.736c0.065,0.203,0.145,0.399,0.219,0.598c0.078,0.208,0.153,0.417,0.242,0.62
		c0.092,0.211,0.197,0.417,0.301,0.623c0.09,0.181,0.179,0.361,0.277,0.537c0.117,0.208,0.244,0.41,0.372,0.611
		c0.105,0.165,0.21,0.33,0.323,0.49c0.135,0.193,0.277,0.379,0.423,0.565c0.128,0.163,0.258,0.322,0.393,0.478
		c0.144,0.166,0.291,0.329,0.443,0.488c0.163,0.17,0.332,0.334,0.504,0.496C38.206,56.548,38.284,56.639,38.375,56.719z M47,58
		c-2.226,0-4.296-0.669-6.029-1.81c-0.366-0.24-0.713-0.5-1.044-0.777c-0.06-0.051-0.116-0.107-0.175-0.159
		c-0.249-0.218-0.487-0.447-0.714-0.685c-0.1-0.105-0.197-0.212-0.292-0.322c-0.18-0.205-0.351-0.417-0.515-0.633
		c-0.089-0.118-0.181-0.233-0.265-0.354c-0.205-0.294-0.395-0.598-0.569-0.91c-0.045-0.082-0.089-0.164-0.133-0.246
		c-0.166-0.315-0.317-0.638-0.451-0.969c-0.052-0.129-0.096-0.262-0.144-0.393c-0.095-0.263-0.183-0.53-0.258-0.8
		c-0.039-0.141-0.076-0.282-0.109-0.425c-0.067-0.284-0.12-0.572-0.164-0.863c-0.019-0.127-0.044-0.254-0.059-0.383
		C36.031,47.852,36,47.428,36,47c0-6.065,4.935-11,11-11c0.428,0,0.852,0.031,1.271,0.08c0.129,0.015,0.255,0.039,0.383,0.059
		c0.29,0.044,0.578,0.097,0.862,0.164c0.143,0.034,0.285,0.07,0.426,0.11c0.27,0.075,0.536,0.162,0.799,0.257
		c0.132,0.048,0.265,0.092,0.394,0.145c0.329,0.134,0.651,0.284,0.965,0.449c0.085,0.044,0.169,0.089,0.252,0.136
		c0.311,0.174,0.614,0.363,0.907,0.567c0.122,0.084,0.237,0.176,0.355,0.266c0.217,0.164,0.429,0.334,0.633,0.515
		c0.109,0.096,0.217,0.193,0.322,0.292c0.238,0.227,0.466,0.465,0.685,0.714c0.052,0.06,0.108,0.115,0.159,0.175
		c0.277,0.33,0.536,0.677,0.776,1.042C57.331,42.704,58,44.774,58,47C58,53.065,53.065,58,47,58z"/>
</g>
<g>
</g>
<g>
</g>
<g>
</g>
<g>
</g>
<g>
</g>
<g>
</g>
<g>
</g>
<g>
</g>
<g>
</g>
<g>
</g>
<g>
</g>
<g>
</g>
<g>
</g>
<g>
</g>
<g>
</g>
</svg>
