<?xml version="1.0" encoding="iso-8859-1"?>
<!-- Generator: Adobe Illustrator 18.0.0, SVG Export Plug-In . SVG Version: 6.00 Build 0)  -->
<!DOCTYPE svg PUBLIC "-//W3C//DTD SVG 1.1//EN" "http://www.w3.org/Graphics/SVG/1.1/DTD/svg11.dtd">
<svg version="1.1" id="Capa_1" xmlns="http://www.w3.org/2000/svg" xmlns:xlink="http://www.w3.org/1999/xlink" x="0px" y="0px"
	 viewBox="0 0 56.005 56.005" style="enable-background:new 0 0 56.005 56.005;" xml:space="preserve">
<g>
	<path d="M12,31.005c-6.617,0-12,5.383-12,12s5.383,12,12,12s12-5.383,12-12S18.617,31.005,12,31.005z M12,53.005
		c-5.514,0-10-4.486-10-10s4.486-10,10-10s10,4.486,10,10S17.514,53.005,12,53.005z"/>
	<path d="M18,42.005h-5v-5c0-0.553-0.447-1-1-1s-1,0.447-1,1v6c0,0.553,0.447,1,1,1h6c0.553,0,1-0.447,1-1S18.553,42.005,18,42.005z
		"/>
	<path d="M55.427,41.91c-2.008-3.796-8.98-7.912-9.287-8.092c-1.278-0.727-2.6-0.957-3.723-0.646
		c-0.844,0.233-1.531,0.767-1.994,1.545c-1.02,1.22-2.285,2.646-2.592,2.867c-2.371,1.604-4.253,1.414-6.295-0.629L20.05,25.469
		c-2.045-2.045-2.233-3.928-0.631-6.292c0.224-0.31,1.649-1.575,2.869-2.595c0.778-0.464,1.312-1.151,1.546-1.996
		c0.311-1.123,0.081-2.444-0.653-3.731c-0.173-0.296-4.289-7.269-8.085-9.276C13.173,0.56,10.842,0.908,9.3,2.451L6.764,4.987
		C0.73,11.02,0.532,18.39,6.19,26.301c0.321,0.449,0.945,0.552,1.396,0.231c0.449-0.321,0.553-0.946,0.231-1.396
		c-5.156-7.209-5.038-13.338,0.36-18.736l2.536-2.536c0.918-0.916,2.304-1.123,3.446-0.519c3.294,1.743,7.256,8.453,7.289,8.51
		c0.449,0.787,0.62,1.608,0.457,2.196c-0.1,0.36-0.323,0.634-0.684,0.836l-0.15,0.104c-0.853,0.712-2.883,2.434-3.308,3.062
		c-0.612,0.904-1.018,1.793-1.23,2.666c-0.711-1.418-1.286-3.061-1.475-4.881c-0.058-0.548-0.537-0.947-1.099-0.892
		c-0.549,0.058-0.948,0.549-0.892,1.099c0.722,6.953,6.13,11.479,6.359,11.668c0.026,0.021,0.056,0.029,0.083,0.047l10.61,10.61
		c0.044,0.044,0.089,0.083,0.134,0.125c0.036,0.053,0.059,0.111,0.106,0.158c0.189,0.187,4.704,4.567,11.599,5.283
		c0.035,0.003,0.07,0.005,0.104,0.005c0.506,0,0.94-0.383,0.994-0.896c0.057-0.55-0.343-1.041-0.892-1.099
		c-2.115-0.219-3.989-0.84-5.55-1.559c0.766-0.23,1.544-0.612,2.334-1.146c0.628-0.425,2.35-2.455,3.062-3.308l0.104-0.151
		c0.202-0.359,0.475-0.583,0.835-0.683c0.587-0.164,1.409,0.008,2.187,0.45c1.879,1.102,7.072,4.559,8.521,7.296
		c0.605,1.145,0.397,2.529-0.519,3.445l-2.537,2.537c-5.393,5.392-11.791,5.446-19.016,0.159c-0.447-0.329-1.072-0.23-1.397,0.216
		c-0.326,0.446-0.229,1.071,0.216,1.397c3.935,2.88,7.733,4.317,11.306,4.317c3.718,0,7.189-1.56,10.306-4.676l2.537-2.537
		C56.096,46.164,56.446,43.835,55.427,41.91z"/>
</g>
<g>
</g>
<g>
</g>
<g>
</g>
<g>
</g>
<g>
</g>
<g>
</g>
<g>
</g>
<g>
</g>
<g>
</g>
<g>
</g>
<g>
</g>
<g>
</g>
<g>
</g>
<g>
</g>
<g>
</g>
</svg>
