<?xml version="1.0" encoding="iso-8859-1"?>
<!-- Generator: Adobe Illustrator 18.0.0, SVG Export Plug-In . SVG Version: 6.00 Build 0)  -->
<!DOCTYPE svg PUBLIC "-//W3C//DTD SVG 1.1//EN" "http://www.w3.org/Graphics/SVG/1.1/DTD/svg11.dtd">
<svg version="1.1" id="Capa_1" xmlns="http://www.w3.org/2000/svg" xmlns:xlink="http://www.w3.org/1999/xlink" x="0px" y="0px"
	 viewBox="0 0 59.018 59.018" style="enable-background:new 0 0 59.018 59.018;" xml:space="preserve">
<g>
	<path d="M58.741,54.809l-5.969-6.244c1.746-1.919,2.82-4.458,2.82-7.25c0-5.953-4.843-10.796-10.796-10.796S34,35.361,34,41.314
		S38.843,52.11,44.796,52.11c2.441,0,4.688-0.824,6.499-2.196l6.001,6.277c0.196,0.205,0.459,0.309,0.723,0.309
		c0.249,0,0.497-0.092,0.691-0.277C59.108,55.841,59.123,55.208,58.741,54.809z M36,41.314c0-4.85,3.946-8.796,8.796-8.796
		s8.796,3.946,8.796,8.796s-3.946,8.796-8.796,8.796S36,46.164,36,41.314z"/>
	<path d="M25.537,17.675c-0.31-0.195-0.697-0.208-1.019-0.033C24.199,17.817,24,18.153,24,18.518v14
		c0,0.365,0.199,0.701,0.519,0.877c0.15,0.082,0.316,0.123,0.481,0.123c0.187,0,0.373-0.053,0.537-0.156l11-7
		C36.825,26.179,37,25.86,37,25.518s-0.175-0.66-0.463-0.844L25.537,17.675z M26,30.697V20.34l8.138,5.179L26,30.697z"/>
	<path d="M30,46.518H12v-10v-11v-11v-10h34v10v11c0,0.553,0.447,1,1,1h9v7c0,0.553,0.447,1,1,1s1-0.447,1-1v-8v-11v-11
		c0-0.553-0.447-1-1-1H47H11H1c-0.553,0-1,0.447-1,1v11v11v11v11c0,0.553,0.447,1,1,1h10h19c0.553,0,1-0.447,1-1
		S30.553,46.518,30,46.518z M10,24.518H2v-9h8V24.518z M2,26.518h8v9H2V26.518z M48,24.518v-9h8v9H48z M56,4.518v9h-8v-9H56z
		 M2,4.518h8v9H2V4.518z M2,46.518v-9h8v9H2z"/>
</g>
<g>
</g>
<g>
</g>
<g>
</g>
<g>
</g>
<g>
</g>
<g>
</g>
<g>
</g>
<g>
</g>
<g>
</g>
<g>
</g>
<g>
</g>
<g>
</g>
<g>
</g>
<g>
</g>
<g>
</g>
</svg>
