<?xml version="1.0" encoding="iso-8859-1"?>
<!-- Generator: Adobe Illustrator 18.0.0, SVG Export Plug-In . SVG Version: 6.00 Build 0)  -->
<!DOCTYPE svg PUBLIC "-//W3C//DTD SVG 1.1//EN" "http://www.w3.org/Graphics/SVG/1.1/DTD/svg11.dtd">
<svg version="1.1" id="Capa_1" xmlns="http://www.w3.org/2000/svg" xmlns:xlink="http://www.w3.org/1999/xlink" x="0px" y="0px"
	 viewBox="0 0 60 60" style="enable-background:new 0 0 60 60;" xml:space="preserve">
<g>
	<path d="M57.199,48.02c-0.549-0.105-1.069,0.24-1.18,0.781C54.903,54.303,50.574,58,45.249,58c-5.028,0-9.446-3.3-10.948-8H39v-2
		h-8v8h2v-3.848C35.169,56.833,39.915,60,45.249,60c6.304,0,11.42-4.341,12.731-10.801C58.09,48.657,57.74,48.13,57.199,48.02z"/>
	<path d="M57,36v4.308C54.75,35.855,50.296,33,45.249,33c-6.109,0-11.541,3.997-13.209,9.721c-0.154,0.53,0.15,1.085,0.681,1.239
		c0.531,0.156,1.086-0.151,1.239-0.681C35.358,38.482,40.105,35,45.249,35c4.565,0,8.562,2.766,10.33,7H51v2h8v-8H57z"/>
	<path d="M11,2h34v26h2V0H11H1v60h10h16v-2H11V2z M3,58V2h6v56H3z"/>
	<path d="M40,24V10H16v14H40z M18,12h20v10H18V12z"/>
	<rect x="21" y="14" width="14" height="2"/>
	<rect x="21" y="18" width="14" height="2"/>
</g>
<g>
</g>
<g>
</g>
<g>
</g>
<g>
</g>
<g>
</g>
<g>
</g>
<g>
</g>
<g>
</g>
<g>
</g>
<g>
</g>
<g>
</g>
<g>
</g>
<g>
</g>
<g>
</g>
<g>
</g>
</svg>
