<?xml version="1.0" encoding="iso-8859-1"?>
<!-- Generator: Adobe Illustrator 18.0.0, SVG Export Plug-In . SVG Version: 6.00 Build 0)  -->
<!DOCTYPE svg PUBLIC "-//W3C//DTD SVG 1.1//EN" "http://www.w3.org/Graphics/SVG/1.1/DTD/svg11.dtd">
<svg version="1.1" id="Capa_1" xmlns="http://www.w3.org/2000/svg" xmlns:xlink="http://www.w3.org/1999/xlink" x="0px" y="0px"
	 viewBox="0 0 58 58" style="enable-background:new 0 0 58 58;" xml:space="preserve">
<g>
	<path d="M52.199,44.02c-0.547-0.104-1.069,0.241-1.18,0.781C49.903,50.303,45.574,54,40.249,54c-5.028,0-9.446-3.3-10.948-8H34v-2
		h-8v8h2v-3.848C30.169,52.833,34.915,56,40.249,56c6.304,0,11.42-4.341,12.731-10.801C53.09,44.657,52.74,44.13,52.199,44.02z"/>
	<path d="M52,36.308C49.75,31.855,45.296,29,40.249,29c-6.109,0-11.541,3.997-13.209,9.721c-0.154,0.53,0.15,1.085,0.681,1.239
		c0.531,0.156,1.085-0.151,1.239-0.681C30.358,34.482,35.105,31,40.249,31c4.565,0,8.562,2.766,10.33,7H46v2h8v-8h-2V36.308z"/>
	<path d="M37,25c0-0.342-0.175-0.66-0.463-0.844l-11-7c-0.31-0.195-0.697-0.208-1.019-0.033C24.199,17.299,24,17.635,24,18v14
		c0,0.365,0.199,0.701,0.519,0.877C24.669,32.959,24.835,33,25,33c0.187,0,0.373-0.053,0.537-0.156l11-7
		C36.825,25.66,37,25.342,37,25z M26,30.179V19.821L34.138,25L26,30.179z"/>
	<path d="M57,2H47H11H1C0.447,2,0,2.447,0,3v11v11v11v11c0,0.553,0.447,1,1,1h10h11c0.553,0,1-0.447,1-1s-0.447-1-1-1H12V36V25V14V4
		h34v10v11c0,0.553,0.447,1,1,1h9v8c0,0.553,0.447,1,1,1s1-0.447,1-1v-9V14V3C58,2.447,57.553,2,57,2z M2,26h8v9H2V26z M10,24H2v-9
		h8V24z M2,46v-9h8v9H2z M10,13H2V4h8V13z M56,4v9h-8V4H56z M48,24v-9h8v9H48z"/>
</g>
<g>
</g>
<g>
</g>
<g>
</g>
<g>
</g>
<g>
</g>
<g>
</g>
<g>
</g>
<g>
</g>
<g>
</g>
<g>
</g>
<g>
</g>
<g>
</g>
<g>
</g>
<g>
</g>
<g>
</g>
</svg>
