<?xml version="1.0" encoding="iso-8859-1"?>
<!-- Generator: Adobe Illustrator 18.0.0, SVG Export Plug-In . SVG Version: 6.00 Build 0)  -->
<!DOCTYPE svg PUBLIC "-//W3C//DTD SVG 1.1//EN" "http://www.w3.org/Graphics/SVG/1.1/DTD/svg11.dtd">
<svg version="1.1" id="Capa_1" xmlns="http://www.w3.org/2000/svg" xmlns:xlink="http://www.w3.org/1999/xlink" x="0px" y="0px"
	 viewBox="0 0 55.999 55.999" style="enable-background:new 0 0 55.999 55.999;" xml:space="preserve">
<g>
	<path d="M53.454,40.053C53.055,35.964,50.002,33,46.183,33c-2.396,0-4.407,1.449-5.684,3.213C39.224,34.449,37.212,33,34.816,33
		c-3.818,0-6.871,2.963-7.271,7.052c-0.042,0.268-0.145,1.22,0.226,2.709c0.545,2.197,1.8,4.191,3.631,5.771l8.329,7.126
		c0.222,0.19,0.494,0.286,0.768,0.286c0.271,0,0.545-0.095,0.77-0.284l8.331-7.13c1.828-1.575,3.083-3.57,3.629-5.768
		C53.598,41.271,53.496,40.319,53.454,40.053z M51.287,42.279c-0.445,1.794-1.479,3.432-2.99,4.732l-7.796,6.672l-7.795-6.67
		c-1.514-1.305-2.549-2.941-2.993-4.735c-0.302-1.213-0.194-1.897-0.194-1.897l0.016-0.105C29.779,37.654,31.672,35,34.816,35
		c2.189,0,3.974,1.811,4.77,3.605l0.914,2.061l0.914-2.061C42.21,36.811,43.994,35,46.183,35c3.145,0,5.037,2.654,5.295,5.367
		C51.48,40.374,51.591,41.058,51.287,42.279z"/>
	<path d="M19.5,38.37l-15,15V13h30v14c0,0.553,0.447,1,1,1s1-0.447,1-1V13V0h-34v13v41.443c0,0.631,0.376,1.194,0.959,1.437
		c0.193,0.08,0.396,0.119,0.598,0.119c0.403,0,0.8-0.157,1.099-0.456L19.5,41.198l3.401,3.4c0.391,0.391,1.023,0.391,1.414,0
		s0.391-1.023,0-1.414L19.5,38.37z M4.5,2h30v9h-30V2z"/>
</g>
<g>
</g>
<g>
</g>
<g>
</g>
<g>
</g>
<g>
</g>
<g>
</g>
<g>
</g>
<g>
</g>
<g>
</g>
<g>
</g>
<g>
</g>
<g>
</g>
<g>
</g>
<g>
</g>
<g>
</g>
</svg>
