<?xml version="1.0" encoding="iso-8859-1"?>
<!-- Generator: Adobe Illustrator 18.0.0, SVG Export Plug-In . SVG Version: 6.00 Build 0)  -->
<!DOCTYPE svg PUBLIC "-//W3C//DTD SVG 1.1//EN" "http://www.w3.org/Graphics/SVG/1.1/DTD/svg11.dtd">
<svg version="1.1" id="Capa_1" xmlns="http://www.w3.org/2000/svg" xmlns:xlink="http://www.w3.org/1999/xlink" x="0px" y="0px"
	 viewBox="0 0 57 57" style="enable-background:new 0 0 57 57;" xml:space="preserve">
<g>
	<path d="M30.5,57h24V33h-24V57z M32.5,35h20v20h-9V42.414l4.293,4.293l1.414-1.414L42.5,38.586l-6.707,6.707l1.414,1.414
		l4.293-4.293V55h-9V35z"/>
	<path d="M28.5,14h18c0.552,0,1-0.447,1-1s-0.448-1-1-1h-18c-0.552,0-1,0.447-1,1S27.948,14,28.5,14z"/>
	<path d="M47.5,27c0-0.553-0.448-1-1-1h-18c-0.552,0-1,0.447-1,1s0.448,1,1,1h18C47.052,28,47.5,27.553,47.5,27z"/>
	<path d="M22.08,7.241c-0.418-0.36-1.051-0.313-1.41,0.108l-6.248,7.288L10.6,11.771c-0.442-0.33-1.068-0.242-1.4,0.2
		c-0.332,0.441-0.242,1.068,0.2,1.399l4.571,3.429c0.18,0.135,0.39,0.2,0.6,0.2c0.283,0,0.563-0.119,0.76-0.35l6.857-8
		C22.547,8.231,22.499,7.601,22.08,7.241z"/>
	<path d="M22.08,21.241c-0.418-0.36-1.051-0.313-1.41,0.108l-6.248,7.288L10.6,25.771c-0.442-0.331-1.068-0.241-1.4,0.2
		s-0.242,1.068,0.2,1.399l4.571,3.429c0.18,0.135,0.39,0.2,0.6,0.2c0.283,0,0.563-0.119,0.76-0.35l6.857-8
		C22.547,22.231,22.499,21.601,22.08,21.241z"/>
	<path d="M20.669,36.35l-6.248,7.287L10.6,40.771c-0.442-0.331-1.068-0.241-1.4,0.2s-0.242,1.068,0.2,1.399l4.571,3.429
		c0.18,0.135,0.39,0.2,0.6,0.2c0.283,0,0.563-0.119,0.76-0.35l6.857-7.999c0.359-0.419,0.311-1.05-0.108-1.409
		C21.661,35.882,21.029,35.93,20.669,36.35z"/>
	<path d="M43.324,0H13.676C6.962,0,1.5,5.462,1.5,12.176v29.648C1.5,48.538,6.962,54,13.676,54H22.5c0.552,0,1-0.447,1-1
		s-0.448-1-1-1h-8.824C8.065,52,3.5,47.436,3.5,41.824V12.176C3.5,6.564,8.065,2,13.676,2h29.648C48.935,2,53.5,6.564,53.5,12.176
		V30c0,0.553,0.448,1,1,1s1-0.447,1-1V12.176C55.5,5.462,50.038,0,43.324,0z"/>
</g>
<g>
</g>
<g>
</g>
<g>
</g>
<g>
</g>
<g>
</g>
<g>
</g>
<g>
</g>
<g>
</g>
<g>
</g>
<g>
</g>
<g>
</g>
<g>
</g>
<g>
</g>
<g>
</g>
<g>
</g>
</svg>
