<?xml version="1.0" encoding="iso-8859-1"?>
<!-- Generator: Adobe Illustrator 18.0.0, SVG Export Plug-In . SVG Version: 6.00 Build 0)  -->
<!DOCTYPE svg PUBLIC "-//W3C//DTD SVG 1.1//EN" "http://www.w3.org/Graphics/SVG/1.1/DTD/svg11.dtd">
<svg version="1.1" id="Capa_1" xmlns="http://www.w3.org/2000/svg" xmlns:xlink="http://www.w3.org/1999/xlink" x="0px" y="0px"
	 viewBox="0 0 60 60" style="enable-background:new 0 0 60 60;" xml:space="preserve">
<g>
	<path d="M36,36v24h24V36H36z M58,58h-9V45.414l4.293,4.293l1.414-1.414L48,41.586l-6.707,6.707l1.414,1.414L47,45.414V58h-9V38h20
		V58z"/>
	<polygon points="18.058,40.078 18.058,17 16.058,17 11,20 11,22 16.058,19 16.058,40.078 	"/>
	<path d="M36.058,24.339c0-2.042-0.712-3.773-2.134-5.196c-1.423-1.423-3.149-2.134-5.18-2.134s-3.757,0.711-5.179,2.134
		c-1.423,1.423-2.134,3.148-2.134,5.179s0.711,3.757,2.134,5.18c1.422,1.423,3.183,2.134,5.282,2.134s3.871-0.78,5.316-2.341v2.148
		c0,2.157-0.631,3.791-1.893,4.904c-1.262,1.112-2.753,1.669-4.474,1.669h-0.74v1.893h0.603c1.537,0,2.879-0.27,4.026-0.809
		s2.019-1.233,2.615-2.082c1.171-1.652,1.756-3.43,1.756-5.334V24.339z M32.599,28.176c-1.044,1.044-2.323,1.565-3.837,1.565
		c-1.515,0-2.8-0.521-3.854-1.565c-1.056-1.044-1.583-2.323-1.583-3.837c0-1.515,0.527-2.799,1.583-3.854
		c1.055-1.055,2.334-1.583,3.837-1.583s2.782,0.511,3.837,1.531c1.056,1.021,1.583,2.306,1.583,3.854S33.643,27.132,32.599,28.176z"
		/>
	<path d="M30,45H2V12h15h2h14h2h14v18c0,0.553,0.448,1,1,1s1-0.447,1-1V12v-1V0H35h-2H19h-2H0v11v1v34c0,0.553,0.448,1,1,1h29
		c0.552,0,1-0.447,1-1S30.552,45,30,45z M35,2h14v8H35V2z M19,2h14v8H19V2z M2,2h15v8H2V2z"/>
</g>
<g>
</g>
<g>
</g>
<g>
</g>
<g>
</g>
<g>
</g>
<g>
</g>
<g>
</g>
<g>
</g>
<g>
</g>
<g>
</g>
<g>
</g>
<g>
</g>
<g>
</g>
<g>
</g>
<g>
</g>
</svg>
