<?xml version="1.0" encoding="iso-8859-1"?>
<!-- Generator: Adobe Illustrator 18.0.0, SVG Export Plug-In . SVG Version: 6.00 Build 0)  -->
<!DOCTYPE svg PUBLIC "-//W3C//DTD SVG 1.1//EN" "http://www.w3.org/Graphics/SVG/1.1/DTD/svg11.dtd">
<svg version="1.1" id="Capa_1" xmlns="http://www.w3.org/2000/svg" xmlns:xlink="http://www.w3.org/1999/xlink" x="0px" y="0px"
	 viewBox="0 0 60.111 60.111" style="enable-background:new 0 0 60.111 60.111;" xml:space="preserve">
<g>
	<path d="M52.589,37.171c-2.396,0-4.407,1.448-5.684,3.212c-1.276-1.764-3.288-3.213-5.684-3.213c-3.818,0-6.871,2.964-7.271,7.053
		c-0.042,0.267-0.145,1.219,0.225,2.709c0.546,2.197,1.801,4.191,3.632,5.77l8.323,7.123c0.221,0.191,0.497,0.287,0.774,0.287
		c0.274,0,0.549-0.094,0.769-0.282l8.332-7.129c1.828-1.577,3.082-3.571,3.628-5.769c0.369-1.488,0.267-2.44,0.225-2.709
		C59.46,40.134,56.408,37.171,52.589,37.171z M57.692,46.449c-0.445,1.794-1.479,3.432-2.99,4.733l-7.797,6.672l-7.795-6.671
		c-1.513-1.304-2.548-2.94-2.993-4.733c-0.301-1.215-0.193-1.898-0.193-1.898l0.016-0.105c0.245-2.622,2.138-5.276,5.282-5.276
		c2.189,0,3.974,1.811,4.77,3.605l0.914,2.061l0.914-2.061c0.796-1.794,2.579-3.604,4.77-3.604c3.145,0,5.037,2.654,5.295,5.367
		C57.885,44.545,57.996,45.229,57.692,46.449z"/>
	<path d="M10.556,6c-2.481,0-4.5,2.019-4.5,4.5s2.019,4.5,4.5,4.5s4.5-2.019,4.5-4.5S13.037,6,10.556,6z M10.556,13
		c-1.379,0-2.5-1.121-2.5-2.5S9.177,8,10.556,8s2.5,1.121,2.5,2.5S11.935,13,10.556,13z"/>
	<circle cx="50.056" cy="9" r="1"/>
	<circle cx="46.056" cy="9" r="1"/>
	<circle cx="52.056" cy="12" r="1"/>
	<circle cx="48.056" cy="12" r="1"/>
	<circle cx="42.056" cy="9" r="1"/>
	<circle cx="44.056" cy="12" r="1"/>
	<circle cx="38.056" cy="9" r="1"/>
	<circle cx="40.056" cy="12" r="1"/>
	<circle cx="34.056" cy="9" r="1"/>
	<circle cx="36.056" cy="12" r="1"/>
	<path d="M60.056,16.392V4.608C60.056,2.067,57.988,0,55.447,0H4.664C2.123,0,0.056,2.067,0.056,4.608v11.783
		c0,1.469,0.703,2.764,1.777,3.608c-1.073,0.845-1.777,2.14-1.777,3.608v11.783c0,1.469,0.703,2.764,1.777,3.608
		c-1.073,0.845-1.777,2.14-1.777,3.608v11.783C0.056,56.933,2.123,59,4.664,59h33.392v-2H4.664c-1.438,0-2.608-1.17-2.608-2.608
		V42.608C2.056,41.17,3.226,40,4.664,40h23.392v-2H4.664c-1.438,0-2.608-1.17-2.608-2.608V23.608C2.056,22.17,3.226,21,4.664,21
		h50.783c1.438,0,2.608,1.17,2.608,2.608V36h2V23.608c0-1.469-0.703-2.764-1.777-3.608C59.352,19.155,60.056,17.86,60.056,16.392z
		 M4.664,19c-1.438,0-2.608-1.17-2.608-2.608V4.608C2.056,3.17,3.226,2,4.664,2h50.783c1.438,0,2.608,1.17,2.608,2.608v11.783
		c0,1.438-1.17,2.608-2.608,2.608H4.664z"/>
	<path d="M6.056,29.5c0,2.481,2.019,4.5,4.5,4.5s4.5-2.019,4.5-4.5s-2.019-4.5-4.5-4.5S6.056,27.019,6.056,29.5z M13.056,29.5
		c0,1.379-1.121,2.5-2.5,2.5s-2.5-1.121-2.5-2.5s1.121-2.5,2.5-2.5S13.056,28.121,13.056,29.5z"/>
	<circle cx="50.056" cy="28" r="1"/>
	<circle cx="46.056" cy="28" r="1"/>
	<circle cx="52.056" cy="31" r="1"/>
	<circle cx="48.056" cy="31" r="1"/>
	<circle cx="42.056" cy="28" r="1"/>
	<circle cx="44.056" cy="31" r="1"/>
	<circle cx="38.056" cy="28" r="1"/>
	<circle cx="40.056" cy="31" r="1"/>
	<circle cx="34.056" cy="28" r="1"/>
	<circle cx="36.056" cy="31" r="1"/>
	<path d="M6.056,48.5c0,2.481,2.019,4.5,4.5,4.5s4.5-2.019,4.5-4.5s-2.019-4.5-4.5-4.5S6.056,46.019,6.056,48.5z M13.056,48.5
		c0,1.379-1.121,2.5-2.5,2.5s-2.5-1.121-2.5-2.5s1.121-2.5,2.5-2.5S13.056,47.121,13.056,48.5z"/>
</g>
<g>
</g>
<g>
</g>
<g>
</g>
<g>
</g>
<g>
</g>
<g>
</g>
<g>
</g>
<g>
</g>
<g>
</g>
<g>
</g>
<g>
</g>
<g>
</g>
<g>
</g>
<g>
</g>
<g>
</g>
</svg>
