<?xml version="1.0" encoding="iso-8859-1"?>
<!-- Generator: Adobe Illustrator 18.0.0, SVG Export Plug-In . SVG Version: 6.00 Build 0)  -->
<!DOCTYPE svg PUBLIC "-//W3C//DTD SVG 1.1//EN" "http://www.w3.org/Graphics/SVG/1.1/DTD/svg11.dtd">
<svg version="1.1" id="Capa_1" xmlns="http://www.w3.org/2000/svg" xmlns:xlink="http://www.w3.org/1999/xlink" x="0px" y="0px"
	 viewBox="0 0 56.006 56.006" style="enable-background:new 0 0 56.006 56.006;" xml:space="preserve">
<g>
	<path d="M25.189,40.87l-1.444-0.277c-0.677-0.13-1.21-0.573-1.462-1.216c-0.253-0.642-0.163-1.329,0.245-1.885l0.907-1.236
		c0.292-0.398,0.25-0.95-0.1-1.299l-1.959-1.958c-0.339-0.339-0.871-0.389-1.268-0.121l-1.217,0.824
		c-0.571,0.388-1.261,0.452-1.895,0.175c-0.632-0.275-1.055-0.825-1.16-1.508l-0.233-1.515c-0.075-0.487-0.495-0.848-0.988-0.848
		h-2.77c-0.479,0-0.892,0.341-0.982,0.812l-0.358,1.865c-0.127,0.662-0.558,1.19-1.181,1.448c-0.624,0.261-1.301,0.189-1.86-0.189
		l-1.572-1.064c-0.396-0.268-0.928-0.218-1.268,0.121l-1.959,1.958c-0.35,0.349-0.392,0.9-0.1,1.299l0.907,1.236
		c0.408,0.556,0.498,1.243,0.245,1.885c-0.252,0.643-0.785,1.086-1.462,1.216L0.812,40.87C0.341,40.96,0,41.373,0,41.852v2.77
		c0,0.493,0.36,0.913,0.848,0.988l1.515,0.233c0.683,0.105,1.232,0.528,1.508,1.16c0.276,0.633,0.212,1.323-0.175,1.895
		l-0.824,1.217c-0.269,0.396-0.218,0.929,0.121,1.268l1.958,1.959c0.348,0.348,0.899,0.391,1.299,0.1l1.236-0.907
		c0.555-0.408,1.244-0.497,1.885-0.245c0.643,0.252,1.086,0.785,1.216,1.462l0.277,1.444c0.091,0.471,0.503,0.812,0.982,0.812h2.77
		c0.493,0,0.913-0.36,0.988-0.848l0.164-1.065c0.105-0.688,0.552-1.256,1.193-1.522c0.644-0.266,1.361-0.179,1.921,0.232
		l0.869,0.638c0.399,0.293,0.951,0.25,1.299-0.1l1.958-1.959c0.339-0.339,0.39-0.871,0.121-1.268l-0.824-1.217
		c-0.387-0.571-0.451-1.262-0.175-1.895c0.275-0.632,0.825-1.055,1.508-1.16l1.515-0.233C25.64,45.535,26,45.115,26,44.622v-2.77
		C26,41.373,25.66,40.96,25.189,40.87z M24,43.764l-0.667,0.103c-1.354,0.208-2.489,1.082-3.036,2.337
		c-0.548,1.256-0.416,2.682,0.352,3.815l0.361,0.533l-0.768,0.768l-0.177-0.13c-1.129-0.827-2.575-1-3.869-0.467
		c-1.294,0.536-2.192,1.682-2.405,3.065l-0.033,0.218h-1.086l-0.121-0.633c-0.259-1.346-1.175-2.447-2.449-2.947
		c-1.276-0.5-2.696-0.314-3.8,0.494L5.758,51.32l-0.768-0.768l0.361-0.533c0.768-1.134,0.899-2.56,0.352-3.815
		c-0.547-1.255-1.683-2.129-3.036-2.337L2,43.764v-1.086l0.633-0.121c1.346-0.259,2.447-1.175,2.947-2.449
		c0.5-1.275,0.315-2.695-0.494-3.8l-0.399-0.544l0.768-0.768l0.889,0.602c1.108,0.753,2.511,0.892,3.747,0.381
		c1.237-0.513,2.127-1.604,2.38-2.919l0.202-1.054h1.086l0.103,0.667c0.208,1.354,1.082,2.489,2.337,3.036
		c1.255,0.549,2.682,0.415,3.815-0.352l0.533-0.361l0.768,0.768l-0.399,0.544c-0.81,1.104-0.994,2.524-0.494,3.8
		c0.5,1.274,1.602,2.19,2.947,2.449L24,42.678V43.764z"/>
	<path d="M13,38.006c-2.757,0-5,2.243-5,5s2.243,5,5,5s5-2.243,5-5S15.757,38.006,13,38.006z M13,46.006c-1.654,0-3-1.346-3-3
		s1.346-3,3-3s3,1.346,3,3S14.655,46.006,13,46.006z"/>
	<path d="M55.427,40.911c-2.008-3.796-8.98-7.912-9.287-8.092c-1.278-0.728-2.6-0.957-3.723-0.646
		c-0.844,0.233-1.531,0.767-1.994,1.545c-1.02,1.22-2.285,2.646-2.592,2.867c-2.371,1.604-4.252,1.414-6.295-0.629L20.05,24.47
		c-2.045-2.045-2.233-3.928-0.631-6.292c0.224-0.31,1.649-1.575,2.869-2.595c0.778-0.463,1.312-1.15,1.546-1.995
		c0.307-1.106,0.071-2.463-0.653-3.732c-0.173-0.296-4.289-7.269-8.085-9.276C13.17-0.441,10.841-0.091,9.3,1.452L6.764,3.989
		c-6.033,6.032-6.231,13.402-0.573,21.314c0.321,0.448,0.945,0.553,1.396,0.231c0.449-0.321,0.553-0.946,0.231-1.396
		C2.662,16.929,2.78,10.8,8.178,5.403l2.536-2.537c0.918-0.916,2.304-1.125,3.446-0.519c3.294,1.743,7.256,8.453,7.289,8.51
		c0.449,0.788,0.62,1.609,0.457,2.197c-0.1,0.36-0.323,0.633-0.683,0.835l-0.151,0.104c-0.853,0.712-2.883,2.434-3.308,3.062
		c-0.612,0.904-1.018,1.793-1.23,2.666c-0.711-1.418-1.286-3.061-1.475-4.881c-0.058-0.548-0.54-0.944-1.099-0.892
		c-0.549,0.058-0.948,0.549-0.892,1.099c0.722,6.953,6.13,11.479,6.359,11.668c0.026,0.021,0.056,0.029,0.083,0.047l10.61,10.61
		c0.044,0.044,0.089,0.083,0.134,0.126c0.036,0.052,0.059,0.111,0.106,0.157c0.189,0.187,4.704,4.567,11.599,5.283
		c0.035,0.003,0.07,0.005,0.104,0.005c0.506,0,0.94-0.383,0.994-0.896c0.057-0.55-0.343-1.041-0.892-1.099
		c-2.115-0.219-3.988-0.839-5.55-1.559c0.766-0.229,1.544-0.612,2.334-1.146c0.628-0.425,2.35-2.455,3.062-3.308l0.104-0.151
		c0.202-0.359,0.475-0.583,0.835-0.683c0.587-0.164,1.409,0.008,2.187,0.45c1.879,1.102,7.072,4.559,8.521,7.296
		c0.605,1.145,0.397,2.529-0.519,3.445l-2.537,2.537c-5.394,5.393-11.791,5.446-19.016,0.159c-0.447-0.327-1.072-0.229-1.397,0.216
		c-0.326,0.446-0.229,1.071,0.216,1.397c3.935,2.88,7.733,4.317,11.306,4.317c3.718,0,7.189-1.56,10.306-4.676l2.537-2.537
		C56.096,45.165,56.447,42.835,55.427,40.911z"/>
</g>
<g>
</g>
<g>
</g>
<g>
</g>
<g>
</g>
<g>
</g>
<g>
</g>
<g>
</g>
<g>
</g>
<g>
</g>
<g>
</g>
<g>
</g>
<g>
</g>
<g>
</g>
<g>
</g>
<g>
</g>
</svg>
