<?xml version="1.0" encoding="iso-8859-1"?>
<!-- Generator: Adobe Illustrator 18.0.0, SVG Export Plug-In . SVG Version: 6.00 Build 0)  -->
<!DOCTYPE svg PUBLIC "-//W3C//DTD SVG 1.1//EN" "http://www.w3.org/Graphics/SVG/1.1/DTD/svg11.dtd">
<svg version="1.1" id="Capa_1" xmlns="http://www.w3.org/2000/svg" xmlns:xlink="http://www.w3.org/1999/xlink" x="0px" y="0px"
	 viewBox="0 0 54.698 54.698" style="enable-background:new 0 0 54.698 54.698;" xml:space="preserve">
<g>
	<path d="M46.835,48.293l-6.798-6.798l6.483-3.242l-17.637-6.498l6.498,17.638l3.242-6.484l6.797,6.797
		C45.616,49.902,45.872,50,46.128,50s0.512-0.098,0.707-0.293C47.225,49.316,47.225,48.684,46.835,48.293z M32.258,35.131
		l9.232,3.402l-3.887,1.943l-1.943,3.888L32.258,35.131z"/>
	<path d="M19.924,19c0,3.859,3.141,7,7,7s7-3.141,7-7s-3.141-7-7-7S19.924,15.141,19.924,19z M31.924,19c0,2.757-2.243,5-5,5
		s-5-2.243-5-5s2.243-5,5-5S31.924,16.243,31.924,19z"/>
	<path d="M29.777,47.393l-2.989,3.909L13.007,31.4c-5.199-6.933-4.454-18.32,1.596-24.369C17.846,3.787,22.16,2,26.748,2
		s8.901,1.787,12.146,5.031c5.377,5.377,6.619,15.474,2.768,22.508c-0.266,0.484-0.088,1.093,0.396,1.357
		c0.483,0.268,1.093,0.088,1.357-0.396c4.32-7.892,2.955-18.821-3.107-24.883C36.686,1.995,31.871,0,26.748,0
		c-5.122,0-9.938,1.995-13.56,5.617c-6.703,6.702-7.536,19.312-1.804,26.952l15.323,22.129l4.657-6.091
		c0.336-0.438,0.252-1.066-0.187-1.401S30.112,46.954,29.777,47.393z"/>
</g>
<g>
</g>
<g>
</g>
<g>
</g>
<g>
</g>
<g>
</g>
<g>
</g>
<g>
</g>
<g>
</g>
<g>
</g>
<g>
</g>
<g>
</g>
<g>
</g>
<g>
</g>
<g>
</g>
<g>
</g>
</svg>
