<?xml version="1.0" encoding="iso-8859-1"?>
<!-- Generator: Adobe Illustrator 18.0.0, SVG Export Plug-In . SVG Version: 6.00 Build 0)  -->
<!DOCTYPE svg PUBLIC "-//W3C//DTD SVG 1.1//EN" "http://www.w3.org/Graphics/SVG/1.1/DTD/svg11.dtd">
<svg version="1.1" id="Capa_1" xmlns="http://www.w3.org/2000/svg" xmlns:xlink="http://www.w3.org/1999/xlink" x="0px" y="0px"
	 viewBox="0 0 57.111 57.111" style="enable-background:new 0 0 57.111 57.111;" xml:space="preserve">
<g>
	<path d="M55.934,41.223c-0.398-4.089-3.45-7.052-7.27-7.052c-2.396,0-4.407,1.448-5.684,3.212
		c-1.276-1.764-3.288-3.213-5.684-3.213c-3.818,0-6.871,2.964-7.271,7.053c-0.042,0.267-0.145,1.219,0.225,2.709
		c0.546,2.197,1.801,4.191,3.632,5.77l8.323,7.123c0.221,0.191,0.497,0.287,0.774,0.287c0.274,0,0.549-0.094,0.769-0.282
		l8.332-7.129c1.828-1.577,3.082-3.571,3.628-5.769C56.079,42.443,55.976,41.491,55.934,41.223z M53.768,43.449
		c-0.445,1.794-1.479,3.432-2.99,4.733l-7.797,6.672l-7.795-6.671c-1.513-1.304-2.548-2.94-2.993-4.733
		C31.892,42.235,32,41.552,32,41.552l0.016-0.105c0.245-2.622,2.138-5.276,5.282-5.276c2.189,0,3.974,1.811,4.77,3.605l0.914,2.061
		l0.914-2.061c0.796-1.794,2.579-3.604,4.77-3.604c3.145,0,5.037,2.654,5.295,5.367C53.961,41.545,54.072,42.229,53.768,43.449z"/>
	<path d="M26.132,41c-0.827,0-1.637-0.016-2.432-0.044c-0.486-0.018-0.955-0.049-1.429-0.077c-0.293-0.017-0.595-0.028-0.883-0.049
		c-0.63-0.045-1.242-0.104-1.847-0.167c-0.114-0.012-0.233-0.02-0.346-0.032c-0.693-0.076-1.368-0.163-2.026-0.259
		c-0.017-0.002-0.034-0.004-0.051-0.007c-3.385-0.5-6.29-1.263-8.561-2.169c-0.012-0.004-0.024-0.009-0.036-0.014
		c-0.419-0.168-0.812-0.342-1.186-0.519c-0.043-0.021-0.089-0.041-0.132-0.062c-0.336-0.162-0.647-0.328-0.945-0.497
		c-0.07-0.04-0.144-0.079-0.212-0.12c-0.259-0.152-0.495-0.307-0.721-0.463c-0.086-0.06-0.175-0.12-0.257-0.18
		c-0.191-0.141-0.362-0.283-0.526-0.426c-0.089-0.079-0.179-0.157-0.26-0.236c-0.134-0.13-0.252-0.261-0.363-0.392
		c-0.078-0.092-0.153-0.185-0.219-0.277c-0.088-0.123-0.163-0.246-0.231-0.369c-0.054-0.099-0.102-0.198-0.143-0.297
		c-0.049-0.121-0.088-0.242-0.116-0.362c-0.038-0.162-0.079-0.325-0.079-0.485v-8.207c0.028,0.026,0.063,0.051,0.092,0.077
		c0.218,0.191,0.44,0.382,0.69,0.566C7.68,28.786,15.214,31,26.132,31c10.872,0,18.386-2.196,22.169-5.028
		c0.302-0.22,0.574-0.447,0.83-0.678l0.001,0V29c0,0.553,0.447,1,1,1s1-0.447,1-1v-7v-0.5v-12V9c0-0.182-0.062-0.343-0.146-0.49
		C49.828,4.22,41.209,0,26.132,0C11.054,0,2.435,4.22,1.278,8.51C1.193,8.657,1.132,8.818,1.132,9v0.5v12V22v11.5V34v12
		c0,0.161,0.042,0.313,0.115,0.448c1.139,4.833,10.691,7.68,19.81,8.364c0.025,0.002,0.051,0.003,0.076,0.003
		c0.519,0,0.957-0.399,0.996-0.925c0.041-0.551-0.371-1.031-0.922-1.072C10.092,51.984,3.616,48.6,3.164,45.838
		c-0.008-0.045-0.019-0.088-0.032-0.131v-8.414c0.028,0.026,0.063,0.051,0.092,0.077c0.218,0.191,0.44,0.382,0.69,0.566
		C7.68,40.786,15.214,43,26.132,43c0.553,0,1-0.447,1-1S26.684,41,26.132,41z M3.733,13.797c0.3,0.236,0.624,0.469,0.975,0.696
		c0.073,0.047,0.155,0.093,0.231,0.14c0.294,0.183,0.605,0.362,0.932,0.538c0.121,0.065,0.242,0.129,0.367,0.193
		c0.365,0.186,0.748,0.366,1.151,0.542c0.066,0.029,0.126,0.059,0.193,0.087c0.469,0.199,0.967,0.389,1.485,0.572
		c0.143,0.051,0.293,0.099,0.44,0.149c0.412,0.139,0.838,0.272,1.279,0.401c0.159,0.046,0.315,0.094,0.478,0.139
		c0.585,0.162,1.189,0.316,1.823,0.458c0.087,0.02,0.181,0.037,0.269,0.056c0.559,0.122,1.139,0.235,1.735,0.34
		c0.202,0.036,0.407,0.07,0.613,0.104c0.567,0.093,1.151,0.179,1.75,0.257c0.154,0.02,0.301,0.042,0.457,0.062
		c0.744,0.09,1.514,0.167,2.305,0.233c0.195,0.016,0.398,0.028,0.596,0.042c0.633,0.046,1.28,0.084,1.942,0.114
		c0.241,0.011,0.481,0.022,0.727,0.03c0.863,0.03,1.741,0.05,2.65,0.05s1.788-0.021,2.65-0.05c0.245-0.008,0.485-0.02,0.727-0.03
		c0.662-0.03,1.309-0.068,1.942-0.114c0.198-0.015,0.4-0.026,0.596-0.042c0.791-0.065,1.561-0.143,2.305-0.233
		c0.156-0.019,0.303-0.042,0.457-0.062c0.599-0.078,1.182-0.164,1.75-0.257c0.206-0.034,0.411-0.068,0.613-0.104
		c0.596-0.105,1.176-0.218,1.735-0.34c0.088-0.019,0.182-0.036,0.269-0.056c0.634-0.142,1.238-0.296,1.823-0.458
		c0.163-0.045,0.319-0.092,0.478-0.139c0.441-0.128,0.867-0.262,1.279-0.401c0.147-0.05,0.297-0.098,0.44-0.149
		c0.518-0.184,1.017-0.374,1.485-0.572c0.067-0.028,0.127-0.059,0.193-0.087c0.403-0.176,0.786-0.356,1.151-0.542
		c0.125-0.064,0.247-0.128,0.367-0.193c0.327-0.175,0.638-0.354,0.932-0.538c0.076-0.047,0.158-0.093,0.231-0.14
		c0.351-0.227,0.675-0.459,0.975-0.696c0.075-0.06,0.142-0.12,0.215-0.18c0.13-0.108,0.267-0.215,0.387-0.324V21.5
		c0,0.161-0.041,0.323-0.079,0.485c-0.028,0.121-0.067,0.241-0.116,0.362c-0.04,0.099-0.089,0.198-0.143,0.297
		c-0.067,0.123-0.142,0.246-0.231,0.369c-0.066,0.092-0.141,0.185-0.219,0.277c-0.111,0.131-0.229,0.262-0.363,0.392
		c-0.081,0.079-0.17,0.157-0.26,0.236c-0.164,0.143-0.335,0.285-0.526,0.426c-0.082,0.061-0.17,0.12-0.257,0.18
		c-0.226,0.156-0.462,0.311-0.721,0.463c-0.068,0.041-0.141,0.08-0.212,0.12c-0.298,0.168-0.609,0.334-0.945,0.497
		c-0.043,0.021-0.088,0.041-0.132,0.062c-0.375,0.177-0.767,0.351-1.186,0.519c-0.012,0.005-0.024,0.009-0.036,0.014
		c-2.271,0.907-5.176,1.67-8.561,2.169c-0.017,0.002-0.034,0.004-0.051,0.007c-0.658,0.097-1.333,0.184-2.026,0.259
		c-0.113,0.012-0.232,0.02-0.346,0.032c-0.605,0.063-1.217,0.121-1.847,0.167c-0.288,0.021-0.59,0.032-0.883,0.049
		c-0.474,0.028-0.943,0.059-1.429,0.077C27.769,28.984,26.958,29,26.132,29s-1.637-0.016-2.432-0.044
		c-0.486-0.018-0.955-0.049-1.429-0.077c-0.293-0.017-0.595-0.028-0.883-0.049c-0.63-0.045-1.242-0.104-1.847-0.167
		c-0.114-0.012-0.233-0.02-0.346-0.032c-0.693-0.076-1.368-0.163-2.026-0.259c-0.017-0.002-0.034-0.004-0.051-0.007
		c-3.385-0.5-6.29-1.263-8.561-2.169c-0.012-0.004-0.024-0.009-0.036-0.014c-0.419-0.168-0.812-0.342-1.186-0.519
		c-0.043-0.021-0.089-0.041-0.132-0.062c-0.336-0.162-0.647-0.328-0.945-0.497c-0.07-0.04-0.144-0.079-0.212-0.12
		c-0.259-0.152-0.495-0.307-0.721-0.463c-0.086-0.06-0.175-0.12-0.257-0.18c-0.191-0.141-0.362-0.283-0.526-0.426
		c-0.089-0.079-0.179-0.157-0.26-0.236c-0.134-0.13-0.252-0.261-0.363-0.392c-0.078-0.092-0.153-0.185-0.219-0.277
		c-0.088-0.123-0.163-0.246-0.231-0.369c-0.054-0.099-0.102-0.198-0.143-0.297c-0.049-0.121-0.088-0.242-0.116-0.362
		c-0.038-0.162-0.079-0.325-0.079-0.485v-8.207c0.12,0.109,0.257,0.216,0.387,0.324C3.591,13.677,3.658,13.737,3.733,13.797z
		 M26.132,2c13.555,0,23,3.952,23,7.5s-9.445,7.5-23,7.5s-23-3.952-23-7.5S12.577,2,26.132,2z"/>
</g>
<g>
</g>
<g>
</g>
<g>
</g>
<g>
</g>
<g>
</g>
<g>
</g>
<g>
</g>
<g>
</g>
<g>
</g>
<g>
</g>
<g>
</g>
<g>
</g>
<g>
</g>
<g>
</g>
<g>
</g>
</svg>
