<?xml version="1.0" encoding="iso-8859-1"?>
<!-- Generator: Adobe Illustrator 18.0.0, SVG Export Plug-In . SVG Version: 6.00 Build 0)  -->
<!DOCTYPE svg PUBLIC "-//W3C//DTD SVG 1.1//EN" "http://www.w3.org/Graphics/SVG/1.1/DTD/svg11.dtd">
<svg version="1.1" id="Capa_1" xmlns="http://www.w3.org/2000/svg" xmlns:xlink="http://www.w3.org/1999/xlink" x="0px" y="0px"
	 viewBox="0 0 60 60" style="enable-background:new 0 0 60 60;" xml:space="preserve">
<g>
	<path d="M58.223,58.309l-5.969-6.244c1.746-1.918,2.82-4.458,2.82-7.25c0-5.953-4.843-10.796-10.796-10.796
		s-10.796,4.843-10.796,10.796S38.324,55.61,44.277,55.61c2.441,0,4.688-0.824,6.499-2.196l6.001,6.277
		C56.974,59.896,57.236,60,57.5,60c0.249,0,0.497-0.092,0.691-0.277C58.59,59.341,58.605,58.708,58.223,58.309z M35.482,44.814
		c0-4.85,3.946-8.796,8.796-8.796s8.796,3.946,8.796,8.796s-3.946,8.796-8.796,8.796S35.482,49.664,35.482,44.814z"/>
	<path d="M23.005,18h10.99c1.933,0,3.505-1.572,3.505-3.505V13c0-0.553-0.447-1-1-1s-1,0.447-1,1v1.495
		c0,0.83-0.675,1.505-1.505,1.505h-10.99c-0.83,0-1.505-0.675-1.505-1.505V13c0-0.553-0.447-1-1-1s-1,0.447-1,1v1.495
		C19.5,16.428,21.072,18,23.005,18z"/>
	<path d="M20.5,41c-0.553,0-1,0.447-1,1v1.495c0,1.933,1.572,3.505,3.505,3.505H30.5c0.553,0,1-0.447,1-1s-0.447-1-1-1h-7.495
		c-0.83,0-1.505-0.675-1.505-1.505V42C21.5,41.447,21.053,41,20.5,41z"/>
	<path d="M33.5,58H4.332C3.873,58,3.5,57.627,3.5,57.168V31h50v5c0,0.553,0.447,1,1,1s1-0.447,1-1V2.832
		C55.5,1.271,54.23,0,52.668,0H4.332C2.771,0,1.5,1.271,1.5,2.832v54.336C1.5,58.729,2.771,60,4.332,60H33.5c0.553,0,1-0.447,1-1
		S34.053,58,33.5,58z M4.332,2h48.336C53.127,2,53.5,2.373,53.5,2.832V29h-50V2.832C3.5,2.373,3.873,2,4.332,2z"/>
</g>
<g>
</g>
<g>
</g>
<g>
</g>
<g>
</g>
<g>
</g>
<g>
</g>
<g>
</g>
<g>
</g>
<g>
</g>
<g>
</g>
<g>
</g>
<g>
</g>
<g>
</g>
<g>
</g>
<g>
</g>
</svg>
