SOP class is "1.2.840.10008.5.1.4.1.1.2" (CT Image IOD)

SOP class is "1.2.840.10008.5.1.4.1.1.128" (Positron Emission Tomography Image IOD)

SOP class is "1.2.840.10008.5.1.4.1.1.4" (MR Image IOD)

SOP class is "1.2.840.10008.5.1.4.1.1.4" (MR Image IOD)

SOP class is "1.2.840.10008.5.1.4.1.1.4" (MR Image IOD)

SOP class is "1.2.840.10008.5.1.4.1.1.4" (MR Image IOD)

SOP class is "1.2.840.10008.5.1.4.1.1.2" (CT Image IOD)

SOP class is "1.2.840.10008.5.1.4.1.1.4" (MR Image IOD)

SOP class is "1.2.840.10008.5.1.4.1.1.1.2" (Digital Mammography X-Ray Image IOD)

SOP class is "1.2.840.10008.5.1.4.1.1.2" (CT Image IOD)

SOP class is "1.2.840.10008.5.1.4.1.1.2" (CT Image IOD)

SOP class is "1.2.840.10008.5.1.4.1.1.4" (MR Image IOD)

SOP class is "1.2.840.10008.5.1.4.1.1.2" (CT Image IOD)

