[
    {
	"description": "Show all best-practice rules.",
	"query": "FIND RECORD Rule"
    },
    {
	"description": "Show glossary of all rule categories.",
	"query": "SELECT name, description FROM RECORDTYPE Rule"
    },
    {
	"description": "Show all rules in category: {keyword}.",
	"query": "FIND RECORD {keyword}"
    },
    {
	"description": "Show all rules that stem from a publication with citation index greater than {numcitations}.",
	"query": "FIND Rule WHICH IS REFERENCED BY A RulesFromPublication WITH A Publication.NumberOfCitations > {numcitations}"
    },
    {
	"description": "Create a table with all rule texts from category {keyword}, and the date on which they were last edited.",
	"query": "SELECT RuleText, EditedOn FROM RECORD {keyword}"
    }
]
