<?xml version="1.0" encoding="UTF-8" standalone="no"?>
<svg
   xmlns:dc="http://purl.org/dc/elements/1.1/"
   xmlns:cc="http://creativecommons.org/ns#"
   xmlns:rdf="http://www.w3.org/1999/02/22-rdf-syntax-ns#"
   xmlns:svg="http://www.w3.org/2000/svg"
   xmlns="http://www.w3.org/2000/svg"
   viewBox="0 0 196.17 58.78125"
   height="58.78125"
   width="196.17"
   xml:space="preserve"
   version="1.1"
   id="svg2"><metadata
     id="metadata8"><rdf:RDF><cc:Work
         rdf:about=""><dc:format>image/svg+xml</dc:format><dc:type
           rdf:resource="http://purl.org/dc/dcmitype/StillImage" /></cc:Work></rdf:RDF></metadata><defs
     id="defs6" /><g
     transform="matrix(1.25,0,0,-1.25,0,58.78125)"
     id="g10"><g
       transform="translate(1.101,38.457)"
       id="g12"><g
         id="g14"><g
           id="g16"><g
             id="g18"><g
               id="g20"><g
                 id="g22"><g
                   id="g24"><g
                     transform="translate(2.14474,-2.14474)"
                     id="g26"><path
                       id="path28"
                       style="fill:#808080;fill-opacity:0.15;fill-rule:nonzero;stroke:none"
                       d="m 11.86998,7.97023 7.97067,0 c 4.40213,-4.40211 4.40213,-11.53918 0,-15.94131 l -15.94133,8.5e-4 c -4.40211,4.40211 -4.40211,11.53918 0,15.94131 l 7.97066,-8.5e-4 z" /></g></g></g><g
                 id="g30"><path
                   id="path32"
                   style="fill:#e7ebcc;fill-opacity:1;fill-rule:nonzero;stroke:#586e75;stroke-width:1.19553006;stroke-linecap:butt;stroke-linejoin:miter;stroke-miterlimit:10;stroke-dasharray:none;stroke-opacity:1"
                   d="m 11.86998,7.97023 7.97067,0 c 4.40213,-4.40211 4.40213,-11.53918 0,-15.94131 l -15.94133,8.5e-4 c -4.40211,4.40211 -4.40211,11.53918 0,15.94131 l 7.97066,-8.5e-4 z" /></g><g
                 transform="translate(9.516,-2.69)"
                 id="g34"><g
                   id="g36"><g
                     transform="translate(-10.617,-35.767)"
                     id="g38"><g
                       id="text40"
                       style="font-variant:normal;font-weight:normal;font-size:8.96640015px;font-family:LMMono9;-inkscape-font-specification:LMMono9-Regular;writing-mode:lr-tb;fill:#000000;fill-opacity:1;fill-rule:nonzero;stroke:none"
                       transform="matrix(1,0,0,-1,10.617,35.767)"><path
                         id="path217"
                         style=""
                         d="m 4.4563009,-0.268992 c 0,-0.11656321 -0.044832,-0.20622721 -0.1524288,-0.25105921 -0.053798,-0.0268992 -0.2510592,-0.0268992 -0.3855552,-0.0268992 L 2.8333824,-5.2363777 c -0.080698,-0.3407232 -0.2062272,-0.3496896 -0.4841856,-0.3496896 -0.2600256,0 -0.403488,0 -0.4841856,0.3407232 l -1.08493439,4.69839369 c -0.1255296,0 -0.3317568,0 -0.3855552,0.0179328 C 0.2958912,-0.47521921 0.2420928,-0.38555521 0.2420928,-0.268992 0.2420928,0 0.47521921,0 0.62764801,0 L 1.5422208,0 c 0.1613952,0 0.3765888,0 0.3765888,-0.268992 0,-0.27795841 -0.179328,-0.27795841 -0.5021184,-0.27795841 l 0.2062272,-0.93250559 1.4525569,0 0.2062272,0.93250559 c -0.3227905,0 -0.5021185,0 -0.5021185,0.27795841 C 2.779584,0 2.9947776,0 3.1561729,0 l 0.9145728,0 c 0.1524288,0 0.3855552,0 0.3855552,-0.268992 z m -1.5153217,-1.7574144 -1.1835648,0 0.5917824,-2.8154497 0.5917824,2.8154497 z" /></g><g
                       transform="translate(10.617,35.767)"
                       id="g44" /></g></g><g
                   transform="translate(-9.516,2.69)"
                   id="g46" /></g></g><g
               id="g48"><g
                 id="g50"><g
                   id="g52"><g
                     transform="translate(2.14474,-2.14474)"
                     id="g54"><path
                       id="path56"
                       style="fill:#808080;fill-opacity:0.15;fill-rule:nonzero;stroke:none"
                       d="m 55.53554,7.97023 7.97067,0 c 4.40213,-4.40211 4.40213,-11.53918 0,-15.94131 l -15.94134,8.5e-4 c -4.40214,4.40211 -4.40214,11.53918 0,15.94131 l 7.97067,-8.5e-4 z" /></g></g></g><g
                 id="g58"><path
                   id="path60"
                   style="fill:#e7ebcc;fill-opacity:1;fill-rule:nonzero;stroke:#586e75;stroke-width:1.19553006;stroke-linecap:butt;stroke-linejoin:miter;stroke-miterlimit:10;stroke-dasharray:none;stroke-opacity:1"
                   d="m 55.53554,7.97023 7.97067,0 c 4.40213,-4.40211 4.40213,-11.53918 0,-15.94131 l -15.94134,8.5e-4 c -4.40214,4.40211 -4.40214,11.53918 0,15.94131 l 7.97067,-8.5e-4 z" /></g><g
                 transform="translate(53.181,-2.69)"
                 id="g62"><g
                   id="g64"><g
                     transform="translate(-54.282,-35.767)"
                     id="g66"><g
                       id="text68"
                       style="font-variant:normal;font-weight:normal;font-size:8.96640015px;font-family:LMMono9;-inkscape-font-specification:LMMono9-Regular;writing-mode:lr-tb;fill:#000000;fill-opacity:1;fill-rule:nonzero;stroke:none"
                       transform="matrix(1,0,0,-1,54.282,35.767)"><path
                         id="path220"
                         style=""
                         d="m 4.3218049,-1.4973888 c 0,-0.6186816 -0.4303872,-1.2014976 -1.1566656,-1.3718592 0.5738496,-0.1972609 0.9683712,-0.6635137 0.9683712,-1.2194305 0,-0.6545472 -0.5469504,-1.389792 -1.5422209,-1.389792 l -2.02640639,0 c -0.1255296,0 -0.35865601,0 -0.35865601,0.268992 0,0.2779584 0.22416001,0.2779584 0.36762241,0.2779584 l 0.2420928,0 0,4.38456969 -0.2420928,0 c -0.1434624,0 -0.36762241,0 -0.36762241,0.27795841 C 0.2062272,0 0.43935361,0 0.56488321,0 L 2.7706176,0 c 1.0132033,0 1.5511873,-0.79800961 1.5511873,-1.4973888 z m -0.806976,-2.5823233 c 0,0.3676224 -0.2869248,0.9594048 -1.1566657,0.9594048 l -0.9235392,0 0,-1.8112128 1.1208,0 c 0.7621441,0 0.9594049,0.5559168 0.9594049,0.851808 z m 0.1882944,2.5643905 c 0,0.4393536 -0.3496896,0.96837119 -1.1297665,0.96837119 l -1.1387328,0 0,-2.02640639 1.2373632,0 c 0.7621441,0 1.0311361,0.6545472 1.0311361,1.0580352 z" /></g><g
                       transform="translate(54.282,35.767)"
                       id="g72" /></g></g><g
                   transform="translate(-53.181,2.69)"
                   id="g74" /></g></g><g
               id="g76"><g
                 id="g78"><path
                   id="path80"
                   style="fill:none;stroke:#808080;stroke-width:0.59776002;stroke-linecap:butt;stroke-linejoin:miter;stroke-miterlimit:10;stroke-dasharray:none;stroke-opacity:1"
                   d="M 29.11972,4.4e-4 43.66554,0" /><g
                   id="g82"><g
                     transform="matrix(-1,2e-5,-2e-5,-1,29.11972,4.4e-4)"
                     id="g84"><g
                       id="g86"><path
                         id="path88"
                         style="fill:#808080;fill-opacity:1;fill-rule:nonzero;stroke:#808080;stroke-width:0.59776002;stroke-linecap:butt;stroke-linejoin:miter;stroke-miterlimit:10;stroke-dasharray:none;stroke-opacity:1"
                         d="M 4.1476,0 C 3.63824,0.12543 1.39934,0.8362 0,1.60966 L 0,-1.60966 C 1.39934,-0.8362 3.63824,-0.12543 4.1476,0 Z" /></g></g></g></g></g><g
               id="g90"><g
                 id="g92"><g
                   id="g94"><g
                     transform="translate(2.14474,-2.14474)"
                     id="g96"><path
                       id="path98"
                       style="fill:#808080;fill-opacity:0.15;fill-rule:nonzero;stroke:none"
                       d="m 99.2011,7.97023 7.97067,0 c 4.40213,-4.40211 4.40213,-11.53918 0,-15.94131 l -15.94135,8.5e-4 c -4.40212,4.40211 -4.40212,11.53918 0,15.94131 l 7.97068,-8.5e-4 z" /></g></g></g><g
                 id="g100"><path
                   id="path102"
                   style="fill:#e7ebcc;fill-opacity:1;fill-rule:nonzero;stroke:#586e75;stroke-width:1.19553006;stroke-linecap:butt;stroke-linejoin:miter;stroke-miterlimit:10;stroke-dasharray:none;stroke-opacity:1"
                   d="m 99.2011,7.97023 7.97067,0 c 4.40213,-4.40211 4.40213,-11.53918 0,-15.94131 l -15.94135,8.5e-4 c -4.40212,4.40211 -4.40212,11.53918 0,15.94131 l 7.97068,-8.5e-4 z" /></g><g
                 transform="translate(96.846,-2.69)"
                 id="g104"><g
                   id="g106"><g
                     transform="translate(-97.947,-35.767)"
                     id="g108"><g
                       id="text110"
                       style="font-variant:normal;font-weight:normal;font-size:8.96640015px;font-family:LMMono9;-inkscape-font-specification:LMMono9-Regular;writing-mode:lr-tb;fill:#000000;fill-opacity:1;fill-rule:nonzero;stroke:none"
                       transform="matrix(1,0,0,-1,97.947,35.767)"><path
                         id="path223"
                         style=""
                         d="m 4.3397377,-1.5063552 c 0,-0.2958912 -0.2151936,-0.2958912 -0.313824,-0.2958912 -0.080698,0 -0.2869248,0 -0.3048576,0.2600256 -0.062765,0.87870719 -0.7890433,1.09390079 -1.1566657,1.09390079 -0.8159424,0 -1.58705278,-0.95043839 -1.58705278,-2.29539839 0,-1.3359937 0.78007678,-2.2864321 1.57808638,-2.2864321 0.5379841,0 1.0311361,0.4124544 1.1566657,1.1387328 0.026899,0.1524288 0.044832,0.2958912 0.313824,0.2958912 0.313824,0 0.313824,-0.1882944 0.313824,-0.3676224 l 0,-1.2463296 c 0,-0.1434624 0,-0.3676224 -0.268992,-0.3676224 -0.1613952,0 -0.2062272,0.089664 -0.2510592,0.1524288 -0.017933,0.035866 -0.017933,0.053798 -0.134496,0.2779584 -0.2958912,-0.2510592 -0.7083457,-0.4303872 -1.1656321,-0.4303872 -1.1566656,0 -2.16090239,1.2014976 -2.16090239,2.8333825 0,1.6408512 1.00423679,2.8423488 2.16986879,2.8423488 1.0401025,0 1.8112129,-0.79800961 1.8112129,-1.6049856 z" /></g><g
                       transform="translate(97.947,35.767)"
                       id="g114" /></g></g><g
                   transform="translate(-96.846,2.69)"
                   id="g116" /></g></g><g
               id="g118"><g
                 id="g120"><g
                   id="g122"><g
                     transform="translate(2.14474,-2.14474)"
                     id="g124"><path
                       id="path126"
                       style="fill:#808080;fill-opacity:0.15;fill-rule:nonzero;stroke:none"
                       d="m 99.2011,-21.91809 7.97067,0 c 4.40213,-4.40213 4.40213,-11.53921 0,-15.94135 l -15.94135,8.6e-4 c -4.40212,4.40211 -4.40212,11.5392 0,15.94133 l 7.97068,-8.4e-4 z" /></g></g></g><g
                 id="g128"><path
                   id="path130"
                   style="fill:#e7ebcc;fill-opacity:1;fill-rule:nonzero;stroke:#586e75;stroke-width:1.19553006;stroke-linecap:butt;stroke-linejoin:miter;stroke-miterlimit:10;stroke-dasharray:none;stroke-opacity:1"
                   d="m 99.2011,-21.91809 7.97067,0 c 4.40213,-4.40213 4.40213,-11.53921 0,-15.94135 l -15.94135,8.6e-4 c -4.40212,4.40211 -4.40212,11.5392 0,15.94133 l 7.97068,-8.4e-4 z" /></g><g
                 transform="translate(96.846,-32.578)"
                 id="g132"><g
                   id="g134"><g
                     transform="translate(-97.947,-5.879)"
                     id="g136"><g
                       id="text138"
                       style="font-variant:normal;font-weight:normal;font-size:8.96640015px;font-family:LMMono9;-inkscape-font-specification:LMMono9-Regular;writing-mode:lr-tb;fill:#000000;fill-opacity:1;fill-rule:nonzero;stroke:none"
                       transform="matrix(1,0,0,-1,97.947,5.879)"><path
                         id="path226"
                         style=""
                         d="m 4.3487041,-2.6988864 c 0,-1.4346241 -0.7711104,-2.7795841 -1.9636417,-2.7795841 l -1.84707839,0 c -0.1434624,0 -0.36762241,0 -0.36762241,0.2779584 0,0.268992 0.23312641,0.268992 0.36762241,0.268992 l 0.1972608,0 0,4.38456969 -0.1972608,0 c -0.1434624,0 -0.36762241,0 -0.36762241,0.27795841 C 0.1703616,0 0.40348801,0 0.53798401,0 L 2.3850624,0 c 1.1745985,0 1.9636417,-1.255296 1.9636417,-2.6988864 z m -0.6186816,0 c 0,1.0490688 -0.5200512,2.15193599 -1.5153217,2.15193599 l -0.8607744,0 0,-4.38456969 0.8607744,0 c 1.0132033,0 1.5153217,1.1925312 1.5153217,2.2326337 z" /></g><g
                       transform="translate(97.947,5.879)"
                       id="g142" /></g></g><g
                   transform="translate(-96.846,32.578)"
                   id="g144" /></g></g><g
               id="g146"><g
                 id="g148"><g
                   id="g150"><g
                     transform="translate(2.14474,-2.14474)"
                     id="g152"><path
                       id="path154"
                       style="fill:#808080;fill-opacity:0.15;fill-rule:nonzero;stroke:none"
                       d="m 142.86665,-21.91809 7.97068,0 c 4.40213,-4.40213 4.40213,-11.53921 0,-15.94135 l -15.94135,8.6e-4 c -4.40213,4.40211 -4.40213,11.5392 0,15.94133 l 7.97067,-8.4e-4 z" /></g></g></g><g
                 id="g156"><path
                   id="path158"
                   style="fill:#e7ebcc;fill-opacity:1;fill-rule:nonzero;stroke:#586e75;stroke-width:1.19553006;stroke-linecap:butt;stroke-linejoin:miter;stroke-miterlimit:10;stroke-dasharray:none;stroke-opacity:1"
                   d="m 142.86665,-21.91809 7.97068,0 c 4.40213,-4.40213 4.40213,-11.53921 0,-15.94135 l -15.94135,8.6e-4 c -4.40213,4.40211 -4.40213,11.5392 0,15.94133 l 7.97067,-8.4e-4 z" /></g><g
                 transform="translate(140.511,-32.578)"
                 id="g160"><g
                   id="g162"><g
                     transform="translate(-141.612,-5.879)"
                     id="g164"><g
                       id="text166"
                       style="font-variant:normal;font-weight:normal;font-size:8.96640015px;font-family:LMMono9;-inkscape-font-specification:LMMono9-Regular;writing-mode:lr-tb;fill:#000000;fill-opacity:1;fill-rule:nonzero;stroke:none"
                       transform="matrix(1,0,0,-1,141.612,5.879)"><path
                         id="path229"
                         style=""
                         d="m 4.5011329,-0.36762241 0,-0.79800959 c 0,-0.1703616 0,-0.3676224 -0.3048576,-0.3676224 -0.313824,0 -0.313824,0.1882944 -0.313824,0.3676224 l 0,0.61868159 -2.3940289,0 0,-2.01743999 1.1745984,0 c 0,0.3676224 0,0.5110848 0.313824,0.5110848 0.3048577,0 0.3048577,-0.1972608 0.3048577,-0.3676224 l 0,-0.8338753 c 0,-0.1703616 0,-0.3676224 -0.3048577,-0.3676224 -0.313824,0 -0.313824,0.1434624 -0.313824,0.5110848 l -1.1745984,0 0,-1.8201792 2.1967681,0 0,0.4752192 c 0,0.1703616 0,0.3676224 0.3048576,0.3676224 0.313824,0 0.313824,-0.1882944 0.313824,-0.3676224 l 0,-0.6545472 c 0,-0.2779584 -0.053798,-0.3676224 -0.358656,-0.3676224 l -3.34446729,0 c -0.134496,0 -0.36762241,0 -0.36762241,0.268992 0,0.2779584 0.23312641,0.2779584 0.36762241,0.2779584 l 0.268992,0 0,4.38456969 -0.268992,0 c -0.1434624,0 -0.36762241,0 -0.36762241,0.27795841 C 0.2331264,0 0.46625281,0 0.60074881,0 L 4.1424769,0 c 0.2958912,0 0.358656,-0.0806976 0.358656,-0.36762241 z" /></g><g
                       transform="translate(141.612,5.879)"
                       id="g170" /></g></g><g
                   transform="translate(-140.511,32.578)"
                   id="g172" /></g></g><g
               id="g174"><g
                 id="g176"><path
                   id="path178"
                   style="fill:none;stroke:#808080;stroke-width:0.59776002;stroke-linecap:butt;stroke-linejoin:miter;stroke-miterlimit:10;stroke-dasharray:none;stroke-opacity:1"
                   d="m 116.45082,-29.8879 14.54584,-4.4e-4" /><g
                   id="g180"><g
                     transform="matrix(-1,2e-5,-2e-5,-1,116.45082,-29.8879)"
                     id="g182"><g
                       id="g184"><path
                         id="path186"
                         style="fill:#808080;fill-opacity:1;fill-rule:nonzero;stroke:#808080;stroke-width:0.59776002;stroke-linecap:butt;stroke-linejoin:miter;stroke-miterlimit:10;stroke-dasharray:none;stroke-opacity:1"
                         d="M 4.1476,0 C 3.63824,0.12543 1.39934,0.8362 0,1.60966 L 0,-1.60966 C 1.39934,-0.8362 3.63824,-0.12543 4.1476,0 Z" /></g></g></g></g></g><g
               id="g188"><g
                 id="g190"><path
                   id="path192"
                   style="fill:none;stroke:#808080;stroke-width:0.59776002;stroke-linecap:butt;stroke-linejoin:miter;stroke-miterlimit:10;stroke-dasharray:none;stroke-opacity:1"
                   d="M 72.78528,4.4e-4 87.3311,0" /><g
                   id="g194"><g
                     transform="matrix(-1,2e-5,-2e-5,-1,72.78528,4.4e-4)"
                     id="g196"><g
                       id="g198"><path
                         id="path200"
                         style="fill:#808080;fill-opacity:1;fill-rule:nonzero;stroke:#808080;stroke-width:0.59776002;stroke-linecap:butt;stroke-linejoin:miter;stroke-miterlimit:10;stroke-dasharray:none;stroke-opacity:1"
                         d="M 4.1476,0 C 3.63824,0.12543 1.39934,0.8362 0,1.60966 L 0,-1.60966 C 1.39934,-0.8362 3.63824,-0.12543 4.1476,0 Z" /></g></g></g></g></g><g
               id="g202"><g
                 id="g204"><path
                   id="path206"
                   style="fill:none;stroke:#808080;stroke-width:0.59776002;stroke-linecap:butt;stroke-linejoin:miter;stroke-miterlimit:10;stroke-dasharray:none;stroke-opacity:1"
                   d="M 69.77899,-9.74953 89.4064,-23.18413" /><g
                   id="g208"><g
                     transform="matrix(-0.82692,0.56606,-0.56606,-0.82692,69.77899,-9.74953)"
                     id="g210"><g
                       id="g212"><path
                         id="path214"
                         style="fill:#808080;fill-opacity:1;fill-rule:nonzero;stroke:#808080;stroke-width:0.59776002;stroke-linecap:butt;stroke-linejoin:miter;stroke-miterlimit:10;stroke-dasharray:none;stroke-opacity:1"
                         d="M 4.1476,0 C 3.63824,0.12543 1.39934,0.8362 0,1.60966 L 0,-1.60966 C 1.39934,-0.8362 3.63824,-0.12543 4.1476,0 Z" /></g></g></g></g></g></g></g></g></g></g></svg>