# tag norm j_0
18.500000 1.00000000000001953993e+00 -2.78588951823911974703e-02
18.500000 1.00000000000001953993e+00 -2.59160548795790389442e-02
18.500000 1.00000000000001953993e+00 4.81871812424435053135e-02
18.500000 1.00000000000001953993e+00 -3.86373026216281717851e-03
18.500000 1.00000000000001953993e+00 -1.69003202212040654073e-02
18.500000 1.00000000000001953993e+00 1.38468750622881310586e-02
18.500000 1.00000000000001953993e+00 -5.07776830365224210451e-02
18.500000 1.00000000000001953993e+00 8.96571521983499097885e-02
18.500000 1.00000000000001953993e+00 6.69231733149034096336e-03
18.500000 1.00000000000001953993e+00 -2.97490419330178404445e-02
18.500000 1.00000000000001953993e+00 5.26273535870834356654e-03
18.500000 1.00000000000001953993e+00 9.01903397762485459221e-02
18.500000 1.00000000000001953993e+00 -5.01519951492464810539e-02
18.500000 1.00000000000001953993e+00 1.25681436920964031273e-02
18.500000 1.00000000000001953993e+00 -1.62786200676158995804e-02
18.500000 1.00000000000001953993e+00 -4.28014255139681342593e-03
18.500000 1.00000000000001953993e+00 4.86574905727070253225e-02
18.500000 1.00000000000001953993e+00 -2.58592093487846445832e-02
18.500000 1.00000000000001953993e+00 -2.83224760575296399812e-02
