# tag norm j_0
25.500000 1.00000000000023359092e+00 -8.59327503923285594169e-05
25.500000 1.00000000000023359092e+00 -1.75815790118670885406e-04
25.500000 1.00000000000023359092e+00 -3.78635255416134527441e-04
25.500000 1.00000000000023359092e+00 -3.94143076762726665436e-04
25.500000 1.00000000000023359092e+00 -6.20064597812932001564e-04
25.500000 1.00000000000023359092e+00 -7.99704457847123209753e-05
25.500000 1.00000000000023359092e+00 2.49960104737807157615e-04
25.500000 1.00000000000023359092e+00 1.17809850818962480326e-04
25.500000 1.00000000000023359092e+00 -5.19284580138359522249e-05
25.500000 1.00000000000023359092e+00 -5.66168625280092085170e-05
25.500000 1.00000000000023359092e+00 -5.66759340287139259007e-05
25.500000 1.00000000000023359092e+00 1.17318627357507865956e-04
25.500000 1.00000000000023359092e+00 2.54013240431061489404e-04
25.500000 1.00000000000023359092e+00 -4.70132374830515060060e-05
25.500000 1.00000000000023359092e+00 -6.06177136726315226797e-04
25.500000 1.00000000000023359092e+00 -4.01780080944180956019e-04
25.500000 1.00000000000023359092e+00 -3.93402411891213301103e-04
25.500000 1.00000000000023359092e+00 -1.85413479376472621488e-04
25.500000 1.00000000000023359092e+00 -1.04072026350427972652e-04
