# tag norm j_0
15.400000 1.00000000000002176037e+00 1.46882948023307081248e-04
15.400000 1.00000000000002176037e+00 -2.56457088834435766728e-03
15.400000 1.00000000000002176037e+00 1.40726284365821734113e-03
15.400000 1.00000000000002176037e+00 -2.55732709610890498672e-03
15.400000 1.00000000000002176037e+00 1.40512462801121551341e-03
15.400000 1.00000000000002176037e+00 -2.58783251420119679229e-03
15.400000 1.00000000000002176037e+00 1.39986007976250579482e-03
15.400000 1.00000000000002176037e+00 -2.60463000486102274830e-03
15.400000 1.00000000000002176037e+00 1.36751589731064714626e-03
15.400000 1.00000000000002176037e+00 -2.61554104739041524963e-03
15.400000 1.00000000000002176037e+00 1.34898293911338870536e-03
15.400000 1.00000000000002176037e+00 -2.61586198045098399650e-03
15.400000 1.00000000000002176037e+00 1.36053351250026394008e-03
15.400000 1.00000000000002176037e+00 -2.59070115869859023475e-03
15.400000 1.00000000000002176037e+00 1.35534418972142441454e-03
15.400000 1.00000000000002176037e+00 -2.55676886267134457695e-03
15.400000 1.00000000000002176037e+00 1.34302019400700609758e-03
15.400000 1.00000000000002176037e+00 -2.56044848744292488987e-03
15.400000 1.00000000000002176037e+00 3.23020366613643706666e-05
