# tag norm H
0.100000 9.99999999999995337063e-01 -2.59432195755649104285e+02
0.200000 9.99999999999994337863e-01 -2.59432195756664270903e+02
0.300000 1.00000000000000532907e+00 -2.59432195477305583609e+02
0.400000 1.00000000000001287859e+00 -2.59432195480938560195e+02
0.500000 1.00000000000000466294e+00 -2.59432195487363571829e+02
0.600000 1.00000000000002975398e+00 -2.59432195819330047470e+02
0.700000 1.00000000000000999201e+00 -2.59432195829543047694e+02
0.800000 1.00000000000001154632e+00 -2.59432195829263150699e+02
0.900000 1.00000000000001887379e+00 -2.59432195460740729231e+02
1.000000 1.00000000000000288658e+00 -2.59432195457757870827e+02
1.100000 9.99999999999989230837e-01 -2.59432195474374680089e+02
1.200000 1.00000000000000843769e+00 -2.59432196006269464306e+02
1.300000 9.99999999999987676524e-01 -2.59432196007363017998e+02
1.400000 9.99999999999992450483e-01 -2.59432196007182255926e+02
1.500000 1.00000000000000088818e+00 -2.59432195506982736788e+02
1.600000 9.99999999999993338662e-01 -2.59432195435147832541e+02
1.700000 1.00000000000000777156e+00 -2.59432195458106946262e+02
1.800000 1.00000000000000488498e+00 -2.59432196135310448426e+02
1.900000 9.99999999999993782751e-01 -2.59432196141400083889e+02
2.000000 1.00000000000001598721e+00 -2.59432196143236751595e+02
2.100000 1.00000000000002464695e+00 -2.59432195538770258736e+02
2.200000 1.00000000000003352874e+00 -2.59432195529250009258e+02
2.300000 1.00000000000005551115e+00 -2.59432195559282945396e+02
2.400000 1.00000000000007327472e+00 -2.59432196272258465797e+02
2.500000 1.00000000000007638334e+00 -2.59432196297875066193e+02
2.600000 1.00000000000008126833e+00 -2.59432196399529686914e+02
2.700000 1.00000000000008393286e+00 -2.59432195803367051212e+02
2.800000 1.00000000000009392487e+00 -2.59432195825861526828e+02
2.900000 1.00000000000009281464e+00 -2.59432195836395123933e+02
3.000000 1.00000000000006350476e+00 -2.59432196406245054732e+02
3.100000 1.00000000000005817569e+00 -2.59432196438931555349e+02
3.200000 1.00000000000006394885e+00 -2.59432196617361455537e+02
3.300000 1.00000000000010325074e+00 -2.59432196145106672702e+02
3.400000 1.00000000000007904788e+00 -2.59432196176650620600e+02
3.500000 1.00000000000006572520e+00 -2.59432196199609336418e+02
3.600000 1.00000000000007105427e+00 -2.59432196541954169788e+02
3.700000 1.00000000000007216450e+00 -2.59432196465867946245e+02
3.800000 1.00000000000009792167e+00 -2.59432196490393096155e+02
3.900000 1.00000000000006905587e+00 -2.59432196187726788139e+02
4.000000 1.00000000000009059420e+00 -2.59432196214789087207e+02
4.100000 1.00000000000009325873e+00 -2.59432196232156343285e+02
4.200000 1.00000000000011013412e+00 -2.59432196428805468713e+02
4.300000 1.00000000000013056223e+00 -2.59432196437456923377e+02
4.400000 1.00000000000017430501e+00 -2.59432196478592857147e+02
4.500000 1.00000000000016986412e+00 -2.59432196280454206772e+02
4.600000 1.00000000000018096635e+00 -2.59432196323222797218e+02
4.700000 1.00000000000013056223e+00 -2.59432196323308744468e+02
4.800000 1.00000000000014055423e+00 -2.59432196410172025480e+02
4.900000 1.00000000000013855583e+00 -2.59432196427450492138e+02
5.000000 1.00000000000017186252e+00 -2.59432196453983010542e+02
5.100000 1.00000000000014521717e+00 -2.59432196258766964547e+02
5.200000 1.00000000000015720758e+00 -2.59432196309401319922e+02
5.300000 1.00000000000012545520e+00 -2.59432196372664407136e+02
5.400000 1.00000000000010214052e+00 -2.59432196521452908655e+02
5.500000 1.00000000000011946000e+00 -2.59432196521425112223e+02
5.600000 1.00000000000014788171e+00 -2.59432196525711901813e+02
5.700000 1.00000000000015587531e+00 -2.59432196240423252220e+02
5.800000 1.00000000000013411494e+00 -2.59432196250211461575e+02
5.900000 1.00000000000012789769e+00 -2.59432196294108564416e+02
6.000000 1.00000000000010769163e+00 -2.59432196516147087095e+02
6.100000 1.00000000000007793766e+00 -2.59432196461381010977e+02
6.200000 1.00000000000008637535e+00 -2.59432196246636806336e+02
6.300000 1.00000000000008548717e+00 -2.59432195440073144255e+02
6.400000 1.00000000000006994405e+00 -2.59432194891162168915e+02
6.500000 1.00000000000006838974e+00 -2.59432194652801570101e+02
6.600000 1.00000000000006972201e+00 -2.59432195239218174265e+02
6.700000 1.00000000000006172840e+00 -2.59432195768561825844e+02
6.800000 1.00000000000006039613e+00 -2.59432194911023259465e+02
6.900000 1.00000000000008748557e+00 -2.59432189941096567054e+02
7.000000 1.00000000000007949197e+00 -2.59432180562878613728e+02
7.100000 1.00000000000009592327e+00 -2.59432169292258151927e+02
7.200000 1.00000000000007815970e+00 -2.59432163237040185777e+02
7.300000 1.00000000000007593925e+00 -2.59432168099233820158e+02
7.400000 1.00000000000006550316e+00 -2.59432180091595284921e+02
7.500000 1.00000000000003863576e+00 -2.59432178398075336645e+02
7.600000 1.00000000000002708944e+00 -2.59432135213580181698e+02
7.700000 1.00000000000002664535e+00 -2.59432038612670567090e+02
7.800000 1.00000000000002042810e+00 -2.59431919942946649371e+02
7.900000 1.00000000000006061818e+00 -2.59431849902591125101e+02
8.000000 1.00000000000005528911e+00 -2.59431889507206790313e+02
8.100000 1.00000000000002775558e+00 -2.59432013648856695909e+02
8.200000 1.00000000000004130030e+00 -2.59432079132988747006e+02
8.300000 1.00000000000005662137e+00 -2.59431894489559169870e+02
8.400000 1.00000000000005684342e+00 -2.59431386716031227024e+02
8.500000 1.00000000000005107026e+00 -2.59430738261522719768e+02
8.600000 1.00000000000007416290e+00 -2.59430338666536897563e+02
8.700000 1.00000000000008082424e+00 -2.59430503940135906760e+02
8.800000 1.00000000000006616929e+00 -2.59431144370054653336e+02
8.900000 1.00000000000002442491e+00 -2.59431682818290028081e+02
9.000000 1.00000000000000133227e+00 -2.59431406178143731722e+02
9.100000 1.00000000000001887379e+00 -2.59430065074742458364e+02
9.200000 1.00000000000001953993e+00 -2.59428242560256421712e+02
9.300000 1.00000000000000066613e+00 -2.59427079959804302689e+02
9.400000 1.00000000000003219647e+00 -2.59427439013473076557e+02
9.500000 9.99999999999996225242e-01 -2.59429114291655821489e+02
9.600000 1.00000000000003153033e+00 -2.59430809324547226424e+02
9.700000 1.00000000000002398082e+00 -2.59431038980111566161e+02
9.800000 1.00000000000002886580e+00 -2.59429320420175486106e+02
9.900000 1.00000000000004729550e+00 -2.59426670486151749628e+02
10.000000 1.00000000000003241851e+00 -2.59424922419984056887e+02
10.100000 1.00000000000003397282e+00 -2.59425337087774892098e+02
10.200000 1.00000000000004773959e+00 -2.59427615550281245760e+02
10.300000 1.00000000000002420286e+00 -2.59430126361915313282e+02
10.400000 1.00000000000002198242e+00 -2.59431164738753921029e+02
10.500000 1.00000000000003774758e+00 -2.59430216998465368761e+02
10.600000 1.00000000000007682743e+00 -2.59428251148700269368e+02
10.700000 1.00000000000009658940e+00 -2.59426875154294918957e+02
10.800000 1.00000000000004907186e+00 -2.59427104705713588828e+02
10.900000 1.00000000000006727952e+00 -2.59428710756348493760e+02
11.000000 1.00000000000006017409e+00 -2.59430567864549686874e+02
11.100000 1.00000000000005684342e+00 -2.59431592895350775052e+02
11.200000 1.00000000000006816769e+00 -2.59431484464375955667e+02
11.300000 1.00000000000009814372e+00 -2.59430756405340105175e+02
11.400000 1.00000000000009747758e+00 -2.59430194330259212165e+02
11.500000 1.00000000000010014212e+00 -2.59430252992656619426e+02
11.600000 1.00000000000012190249e+00 -2.59430841405778835451e+02
11.700000 1.00000000000013544721e+00 -2.59431539390664852363e+02
11.800000 1.00000000000011968204e+00 -2.59431976287841223439e+02
11.900000 1.00000000000009858780e+00 -2.59432056136425273962e+02
12.000000 1.00000000000008881784e+00 -2.59431929317682431702e+02
12.100000 1.00000000000008837375e+00 -2.59431808554735766847e+02
12.200000 1.00000000000013922197e+00 -2.59431811937308964389e+02
12.300000 1.00000000000011546319e+00 -2.59431923303338919595e+02
12.400000 1.00000000000011701751e+00 -2.59432059231157893464e+02
12.500000 1.00000000000011679546e+00 -2.59432149673114111010e+02
12.600000 1.00000000000013455903e+00 -2.59432178782676771789e+02
12.700000 1.00000000000016542323e+00 -2.59432170369337654847e+02
12.800000 1.00000000000013633539e+00 -2.59432157252231263556e+02
12.900000 1.00000000000015076829e+00 -2.59432155622834670794e+02
13.000000 1.00000000000012168044e+00 -2.59432166288866824289e+02
13.100000 1.00000000000014921397e+00 -2.59432179905772500206e+02
13.200000 1.00000000000016853186e+00 -2.59432190044762819525e+02
13.300000 1.00000000000015631940e+00 -2.59432193726724221960e+02
13.400000 1.00000000000013766766e+00 -2.59432193893967792064e+02
13.500000 1.00000000000013433699e+00 -2.59432192434475609844e+02
13.600000 1.00000000000016719959e+00 -2.59432192287231657701e+02
13.700000 1.00000000000018540725e+00 -2.59432192872853875087e+02
13.800000 1.00000000000017097435e+00 -2.59432194280940905173e+02
13.900000 1.00000000000018918200e+00 -2.59432194766257339325e+02
14.000000 1.00000000000020228264e+00 -2.59432195027623151873e+02
14.100000 1.00000000000019140245e+00 -2.59432194321284555372e+02
14.200000 1.00000000000012589929e+00 -2.59432194255120350590e+02
14.300000 1.00000000000014876989e+00 -2.59432194287781157982e+02
14.400000 1.00000000000017807977e+00 -2.59432194995553800254e+02
14.500000 1.00000000000018873791e+00 -2.59432195018141555920e+02
14.600000 1.00000000000019850788e+00 -2.59432195083619546949e+02
14.700000 1.00000000000020583535e+00 -2.59432194336567647497e+02
14.800000 1.00000000000020539126e+00 -2.59432194274891116947e+02
14.900000 1.00000000000024802382e+00 -2.59432194319033271768e+02
15.000000 1.00000000000025801583e+00 -2.59432195015170350416e+02
15.100000 1.00000000000028177460e+00 -2.59432195017807657678e+02
15.200000 1.00000000000031574743e+00 -2.59432195066206020329e+02
15.300000 1.00000000000031952219e+00 -2.59432194312689773597e+02
15.400000 1.00000000000031152858e+00 -2.59432194262092593817e+02
15.500000 1.00000000000031552538e+00 -2.59432194308087957779e+02
15.600000 1.00000000000032773784e+00 -2.59432194993890959722e+02
15.700000 1.00000000000030753178e+00 -2.59432194997302588035e+02
15.800000 1.00000000000025912605e+00 -2.59432195045108642262e+02
15.900000 1.00000000000024713565e+00 -2.59432194303418839354e+02
16.000000 1.00000000000027089442e+00 -2.59432194252114811661e+02
16.100000 1.00000000000033595349e+00 -2.59432194299063780818e+02
16.200000 1.00000000000028310687e+00 -2.59432194960854928922e+02
16.300000 1.00000000000024957814e+00 -2.59432194963462222859e+02
16.400000 1.00000000000027822189e+00 -2.59432195010748728237e+02
16.500000 1.00000000000030486724e+00 -2.59432194293546217523e+02
16.600000 1.00000000000028355096e+00 -2.59432194242846605903e+02
16.700000 1.00000000000029243274e+00 -2.59432194290332574838e+02
16.800000 1.00000000000028688163e+00 -2.59432194919350763485e+02
16.900000 1.00000000000030020431e+00 -2.59432194919700577884e+02
17.000000 1.00000000000025712765e+00 -2.59432194966863164609e+02
17.100000 1.00000000000024114044e+00 -2.59432194286476715206e+02
17.200000 1.00000000000022803981e+00 -2.59432194237498663369e+02
17.300000 1.00000000000024491520e+00 -2.59432194284967636122e+02
17.400000 1.00000000000022470914e+00 -2.59432194859888227256e+02
17.500000 1.00000000000025179858e+00 -2.59432194856833689300e+02
17.600000 1.00000000000026001423e+00 -2.59432194904427547044e+02
17.700000 1.00000000000027422509e+00 -2.59432194271061462132e+02
17.800000 1.00000000000028510527e+00 -2.59432194224714805841e+02
17.900000 1.00000000000025446312e+00 -2.59432194271652576845e+02
18.000000 1.00000000000024380498e+00 -2.59432194787656726476e+02
18.100000 1.00000000000026600944e+00 -2.59432194780554823410e+02
18.200000 1.00000000000031175063e+00 -2.59432194829159982419e+02
18.300000 1.00000000000030531133e+00 -2.59432194185178218504e+02
18.400000 1.00000000000027000624e+00 -2.59432194129244237502e+02
18.500000 1.00000000000032951419e+00 -2.59432194159788252819e+02
18.600000 1.00000000000029620750e+00 -2.59432194678566418133e+02
18.700000 1.00000000000029087843e+00 -2.59432194667311250669e+02
18.800000 1.00000000000028310687e+00 -2.59432194717300717457e+02
18.900000 1.00000000000028088643e+00 -2.59432194112994181978e+02
19.000000 1.00000000000026534330e+00 -2.59432194071914295819e+02
19.100000 1.00000000000029909408e+00 -2.59432194116824291541e+02
19.200000 1.00000000000023092639e+00 -2.59432194589345954228e+02
19.300000 1.00000000000025179858e+00 -2.59432194574421828293e+02
19.400000 1.00000000000023181457e+00 -2.59432194626148088901e+02
19.500000 1.00000000000024558133e+00 -2.59432194089536608317e+02
19.600000 1.00000000000022293278e+00 -2.59432194051345391017e+02
19.700000 1.00000000000023736568e+00 -2.59432194095133581868e+02
19.800000 1.00000000000023403501e+00 -2.59432194495529813594e+02
19.900000 1.00000000000027089442e+00 -2.59432194477802511301e+02
20.000000 1.00000000000025268676e+00 -2.59432194531301320239e+02
20.100000 1.00000000000026556535e+00 -2.59432194057166043422e+02
20.200000 1.00000000000023270275e+00 -2.59432194021205191348e+02
20.300000 1.00000000000022848390e+00 -2.59432194064217526375e+02
20.400000 1.00000000000023159252e+00 -2.59432194401422520968e+02
20.500000 1.00000000000025646152e+00 -2.59432194381876911393e+02
20.600000 1.00000000000019162449e+00 -2.59432194436752581623e+02
20.700000 1.00000000000019251267e+00 -2.59432194015293362099e+02
20.800000 1.00000000000021560531e+00 -2.59432193980682711754e+02
20.900000 1.00000000000022981617e+00 -2.59432194023552824547e+02
21.000000 1.00000000000024069635e+00 -2.59432194310765396494e+02
21.100000 1.00000000000026312286e+00 -2.59432194290437337258e+02
21.200000 1.00000000000031574743e+00 -2.59432194346022129139e+02
21.300000 1.00000000000029931613e+00 -2.59432193963713416451e+02
21.400000 1.00000000000020916602e+00 -2.59432193929574282265e+02
21.500000 1.00000000000022826185e+00 -2.59432193973060293501e+02
21.600000 1.00000000000020827784e+00 -2.59432194226644128321e+02
21.700000 1.00000000000022493118e+00 -2.59432194206496205879e+02
21.800000 1.00000000000020716762e+00 -2.59432194262050416000e+02
21.900000 1.00000000000023248070e+00 -2.59432193902757660453e+02
22.000000 1.00000000000023381297e+00 -2.59432193868316574026e+02
22.100000 1.00000000000019828583e+00 -2.59432193913083381176e+02
22.200000 1.00000000000022781776e+00 -2.59432194149881411249e+02
22.300000 1.00000000000027822189e+00 -2.59432194130730124471e+02
22.400000 1.00000000000028310687e+00 -2.59432194185623586691e+02
22.500000 1.00000000000027666758e+00 -2.59432193831988627153e+02
22.600000 1.00000000000027577940e+00 -2.59432193796646004103e+02
22.700000 1.00000000000022648550e+00 -2.59432193843073775952e+02
22.800000 1.00000000000022981617e+00 -2.59432194083948729713e+02
22.900000 1.00000000000022870594e+00 -2.59432194066421516254e+02
23.000000 1.00000000000022404301e+00 -2.59432194120408723848e+02
23.100000 1.00000000000016719959e+00 -2.59432193753697845295e+02
23.200000 1.00000000000009703349e+00 -2.59432193716988933829e+02
23.300000 1.00000000000008459899e+00 -2.59432193765108991101e+02
23.400000 1.00000000000014299673e+00 -2.59432194025752096422e+02
23.500000 1.00000000000008748557e+00 -2.59432194010230261938e+02
23.600000 1.00000000000004662937e+00 -2.59432194063309168541e+02
23.700000 1.00000000000002842171e+00 -2.59432193671992081363e+02
23.800000 1.00000000000004707346e+00 -2.59432193633772044450e+02
23.900000 1.00000000000008193446e+00 -2.59432193683279194829e+02
24.000000 1.00000000000010569323e+00 -2.59432193977699398602e+02
24.100000 1.00000000000013145041e+00 -2.59432193964288444477e+02
24.200000 1.00000000000012723156e+00 -2.59432194016678067783e+02
24.300000 1.00000000000016187052e+00 -2.59432193587276003655e+02
24.400000 1.00000000000011080026e+00 -2.59432193547498343378e+02
24.500000 1.00000000000009059420e+00 -2.59432193597919365402e+02
24.600000 1.00000000000005684342e+00 -2.59432193936058695272e+02
24.700000 1.00000000000006128431e+00 -2.59432193926065167489e+02
24.800000 1.00000000000008082424e+00 -2.59432193978091959252e+02
24.900000 1.00000000000009059420e+00 -2.59432193503142400459e+02
25.000000 1.00000000000012057022e+00 -2.59432193462015277419e+02
25.100000 1.00000000000011968204e+00 -2.59432193512819594616e+02
25.200000 1.00000000000006572520e+00 -2.59432193899825733752e+02
25.300000 1.00000000000008459899e+00 -2.59432193889888026206e+02
25.400000 1.00000000000014677148e+00 -2.59432193941955631544e+02
25.500000 1.00000000000014122037e+00 -2.59432193419470195295e+02
25.600000 1.00000000000015321078e+00 -2.59432193377382930066e+02
25.700000 1.00000000000020894397e+00 -2.59432193428101811605e+02
25.800000 1.00000000000024624747e+00 -2.59432193863338568462e+02
25.900000 1.00000000000026290081e+00 -2.59432193844513960812e+02
26.000000 1.00000000000028244074e+00 -2.59432193896816841061e+02
26.100000 1.00000000000025845992e+00 -2.59432193329766107581e+02
26.200000 1.00000000000025246472e+00 -2.59432193287284462713e+02
26.300000 1.00000000000024535929e+00 -2.59432193337587420956e+02
26.400000 1.00000000000022959412e+00 -2.59432193815346693100e+02
26.500000 1.00000000000023425706e+00 -2.59432193806487873644e+02
26.600000 1.00000000000023736568e+00 -2.59432193859240555867e+02
26.700000 1.00000000000022382096e+00 -2.59432193255355684869e+02
26.800000 1.00000000000027489122e+00 -2.59432193213086918604e+02
26.900000 1.00000000000029065639e+00 -2.59432193262774035247e+02
27.000000 1.00000000000036326497e+00 -2.59432193772643813645e+02
27.100000 1.00000000000040079051e+00 -2.59432193763249131280e+02
27.200000 1.00000000000041078252e+00 -2.59432193816511869500e+02
27.300000 1.00000000000038102854e+00 -2.59432193187481288987e+02
27.400000 1.00000000000043587356e+00 -2.59432193146019358210e+02
27.500000 1.00000000000038857806e+00 -2.59432193195033562461e+02
27.600000 1.00000000000038102854e+00 -2.59432193723053160284e+02
27.700000 1.00000000000036881609e+00 -2.59432193712547530140e+02
27.800000 1.00000000000043076653e+00 -2.59432193766354203035e+02
27.900000 1.00000000000039013237e+00 -2.59432193126579079490e+02
28.000000 1.00000000000039723780e+00 -2.59432193086395614046e+02
28.100000 1.00000000000041167070e+00 -2.59432193134794772504e+02
28.200000 1.00000000000041500137e+00 -2.59432193664819124024e+02
28.300000 1.00000000000041855408e+00 -2.59432193652843182008e+02
28.400000 1.00000000000044719783e+00 -2.59432193705736949596e+02
28.500000 1.00000000000043876014e+00 -2.59432193070670507495e+02
28.600000 1.00000000000032840397e+00 -2.59432193032040061098e+02
28.700000 1.00000000000033639758e+00 -2.59432193080005617958e+02
28.800000 1.00000000000034217074e+00 -2.59432193595178034684e+02
28.900000 1.00000000000031374903e+00 -2.59432193581636681756e+02
29.000000 1.00000000000034505732e+00 -2.59432193636351655641e+02
29.100000 1.00000000000030420111e+00 -2.59432193022107639990e+02
29.200000 1.00000000000033262282e+00 -2.59432192985086032877e+02
29.300000 1.00000000000032862602e+00 -2.59432193032933753329e+02
29.400000 1.00000000000024580338e+00 -2.59432193517722453180e+02
29.500000 1.00000000000019162449e+00 -2.59432193502769337101e+02
29.600000 1.00000000000017275070e+00 -2.59432193544189431123e+02
29.700000 1.00000000000018118840e+00 -2.59432192964418732117e+02
29.800000 1.00000000000021449509e+00 -2.59432192928868744275e+02
29.900000 1.00000000000020672353e+00 -2.59432192977058832639e+02
30.000000 1.00000000000023048230e+00 -2.59432193418282281527e+02
