# tag norm j_0
19.200000 1.00000000000002953193e+00 -6.17132097244570739653e-04
19.200000 1.00000000000002953193e+00 2.03834376709725959703e-03
19.200000 1.00000000000002953193e+00 -2.32705450130230809963e-03
19.200000 1.00000000000002953193e+00 1.83841215821688771376e-03
19.200000 1.00000000000002953193e+00 -2.25586436146661510616e-03
19.200000 1.00000000000002953193e+00 1.89341158943595209638e-03
19.200000 1.00000000000002953193e+00 -2.19329841023580907403e-03
19.200000 1.00000000000002953193e+00 1.89922128711352629533e-03
19.200000 1.00000000000002953193e+00 -2.18207339358990207515e-03
19.200000 1.00000000000002953193e+00 1.90605799187484404103e-03
19.200000 1.00000000000002953193e+00 -2.17068846167716052176e-03
19.200000 1.00000000000002953193e+00 1.90121582257291358263e-03
19.200000 1.00000000000002953193e+00 -2.17728909120913031311e-03
19.200000 1.00000000000002953193e+00 1.89256481124004715191e-03
19.200000 1.00000000000002953193e+00 -2.23728145851527157606e-03
19.200000 1.00000000000002953193e+00 1.83743036047732391167e-03
19.200000 1.00000000000002953193e+00 -2.29949488605500499197e-03
19.200000 1.00000000000002953193e+00 2.03500586103494808879e-03
19.200000 1.00000000000002953193e+00 -5.35523264385527998990e-04
