# tag norm BO
1 1.00000000000000066613e+00 1.96152041048849911167e-03
2 1.00000000000000333067e+00 -1.72536837212989326018e-02
3 1.00000000000000244249e+00 -6.10448322765874684670e-02
4 1.00000000000000088818e+00 -5.56641708852853925316e-03
5 9.99999999999998778755e-01 -4.68037492814411652548e-04
6 1.00000000000000133227e+00 -1.51221471258917612712e-02
7 9.99999999999998223643e-01 -1.64070122419223939081e-02
8 1.00000000000000155431e+00 -1.29824889113898320203e-02
9 9.99999999999999555911e-01 -2.50821111456844408893e-02
10 1.00000000000000355271e+00 -2.48933777110737254612e-02
11 1.00000000000000444089e+00 -1.62252993595707051266e-02
12 9.99999999999996447286e-01 -2.06909570881475372850e-02
13 9.99999999999997113420e-01 -6.55359243206216860594e-03
14 1.00000000000000333067e+00 -6.46440077779903473493e-03
15 9.99999999999997557509e-01 1.26449413930525660088e-02
16 9.99999999999996558309e-01 2.50908889103856787284e-02
17 1.00000000000000333067e+00 7.92399438072714616677e-03
18 1.00000000000000066613e+00 -4.39640703555993772600e-02
19 9.99999999999997557509e-01 -1.57911811214064903841e-02
20 1.00000000000000421885e+00 4.07181661435237068902e-02
21 1.00000000000000044409e+00 6.04163188846761206596e-02
22 1.00000000000000111022e+00 3.92308889886988226836e-02
23 1.00000000000000155431e+00 -1.52367084809706216861e-03
24 9.99999999999993338662e-01 -4.61013654824799709586e-02
25 9.99999999999996669331e-01 -3.71248309238802823296e-02
26 1.00000000000000333067e+00 4.75043258901571840980e-02
27 1.00000000000000155431e+00 7.99704969933867221288e-02
28 9.99999999999998334665e-01 6.24438758137017824179e-02
29 1.00000000000000399680e+00 2.93707889276837996739e-02
30 9.99999999999999555911e-01 -5.04705306640558654108e-02
31 9.99999999999998112621e-01 -4.71726402628942220741e-02
32 1.00000000000000466294e+00 -2.89402903636990253486e-03
33 1.00000000000000000000e+00 6.74799513013554924656e-02
34 9.99999999999999000799e-01 2.28380569683925366276e-01
35 1.00000000000000111022e+00 2.51320089752645581260e-01
36 9.99999999999998889777e-01 2.53640043380117141680e-01
37 1.00000000000000000000e+00 2.52220035981986334672e-01
38 9.99999999999997557509e-01 2.50580803938897977989e-01
39 1.00000000000000510703e+00 2.50338314642364057061e-01
40 9.99999999999999777955e-01 2.50282477864053776173e-01
41 1.00000000000000310862e+00 2.50273040769525834115e-01
