# tag norm BO
1 9.99999999999999555911e-01 -2.76871472610962163219e-02
2 1.00000000000000555112e+00 2.75608338401590142672e-03
3 9.99999999999997335465e-01 -6.36362663676090989026e-04
4 1.00000000000000710543e+00 -1.07548404894147499322e-02
5 9.99999999999998445688e-01 -1.43526096456639672833e-02
6 1.00000000000000799361e+00 -2.00400421118585268798e-02
7 9.99999999999994670929e-01 -6.00899359462255151787e-03
8 9.99999999999997446487e-01 5.75008008260831978559e-03
9 9.99999999999999777955e-01 1.32218451476762335201e-02
10 9.99999999999999111822e-01 1.73275374333264099713e-02
11 1.00000000000000310862e+00 2.02184074302991061145e-02
12 9.99999999999993116617e-01 1.79901991141207424907e-02
13 1.00000000000000310862e+00 2.51176520522596296442e-03
14 1.00000000000000288658e+00 6.67845321213940152499e-03
15 9.99999999999997890576e-01 8.45132742839284009650e-03
16 9.99999999999995559108e-01 1.06474707943165231711e-02
17 9.99999999999992450483e-01 9.69318582217692722991e-03
18 9.99999999999999888978e-01 -4.77862198537720023195e-03
19 1.00000000000000044409e+00 -8.81333933532673328981e-03
20 9.99999999999996003197e-01 5.03328426140846720352e-04
21 1.00000000000000288658e+00 6.24428439608196075156e-03
22 1.00000000000000177636e+00 8.27778651133950597873e-03
23 1.00000000000000088818e+00 9.60872794114665806919e-03
24 9.99999999999999777955e-01 1.02087197332060217181e-02
25 1.00000000000000000000e+00 1.06669254036036373345e-02
26 1.00000000000000222045e+00 -2.26520506194712598416e-03
27 9.99999999999999000799e-01 -6.72376753248885017378e-03
28 9.99999999999998667732e-01 4.23604834373439605166e-03
29 9.99999999999999555911e-01 1.02124299037270466206e-02
30 1.00000000000000399680e+00 1.45604332600054835190e-02
31 1.00000000000000044409e+00 1.44262945999880601994e-02
32 1.00000000000000266454e+00 4.30824858421545719978e-02
33 1.00000000000000488498e+00 3.72169732415997406294e-02
34 9.99999999999998001599e-01 9.08577660555672829423e-03
35 9.99999999999997668532e-01 -4.94316806747162936636e-03
36 1.00000000000000355271e+00 7.52837144071533126422e-02
37 9.99999999999996003197e-01 1.05871153637286274929e-01
38 1.00000000000000976996e+00 9.06441080824052364262e-02
39 1.00000000000000222045e+00 7.43027856738197323150e-02
40 9.99999999999993560706e-01 5.17519152037054855353e-02
41 1.00000000000000488498e+00 1.61615018677876524922e-02
42 1.00000000000000799361e+00 -3.49795001120791620997e-02
43 9.99999999999998667732e-01 -4.02936066065769787903e-02
44 1.00000000000000399680e+00 -2.66199437759976134665e-02
45 9.99999999999996003197e-01 -3.77866288596017188550e-03
46 1.00000000000000732747e+00 4.31243530572144040391e-02
47 9.99999999999997335465e-01 1.33960646418624207410e-01
48 1.00000000000000666134e+00 2.11657900423585676464e-01
49 1.00000000000000133227e+00 2.25899138627311979466e-01
50 9.99999999999999777955e-01 2.26702483889122452521e-01
51 9.99999999999994448885e-01 2.25122619731328549308e-01
52 1.00000000000000044409e+00 2.23406894404907324647e-01
53 1.00000000000000000000e+00 2.22917608610737449926e-01
54 9.99999999999993782751e-01 2.22785452939855632692e-01
55 9.99999999999994226840e-01 2.22754531458701027224e-01
