# tag norm j_0
2.300000 1.00000000000000488498e+00 2.41383495713231974080e-05
2.300000 1.00000000000000488498e+00 -1.88723794247409258065e-05
2.300000 1.00000000000000488498e+00 5.61432756460919987220e-05
2.300000 1.00000000000000488498e+00 -3.82328685826965872555e-05
2.300000 1.00000000000000488498e+00 6.72580826071116067138e-05
2.300000 1.00000000000000488498e+00 -3.80137370600246504780e-05
2.300000 1.00000000000000488498e+00 6.73314574353525187311e-05
2.300000 1.00000000000000488498e+00 -4.19158104031866428330e-05
2.300000 1.00000000000000488498e+00 4.80936901300701855544e-05
2.300000 1.00000000000000488498e+00 -4.41829816626385993967e-05
2.300000 1.00000000000000488498e+00 4.88418076546684001610e-05
2.300000 1.00000000000000488498e+00 -4.21180682521441290237e-05
2.300000 1.00000000000000488498e+00 6.64103716271669154573e-05
2.300000 1.00000000000000488498e+00 -3.86471944213454622662e-05
2.300000 1.00000000000000488498e+00 6.67590306444033990433e-05
2.300000 1.00000000000000488498e+00 -3.87163862403471734650e-05
2.300000 1.00000000000000488498e+00 5.66502953476412087147e-05
2.300000 1.00000000000000488498e+00 -2.01022669291147013907e-05
2.300000 1.00000000000000488498e+00 2.31737887556008249521e-05
