# tag norm j_0
19.700000 1.00000000000002953193e+00 1.55771491981569905859e-03
19.700000 1.00000000000002953193e+00 -1.69437810758942745785e-03
19.700000 1.00000000000002953193e+00 2.30429538516376463883e-03
19.700000 1.00000000000002953193e+00 -1.59289106380568353492e-03
19.700000 1.00000000000002953193e+00 2.22305002339574743139e-03
19.700000 1.00000000000002953193e+00 -1.67322821920884391364e-03
19.700000 1.00000000000002953193e+00 2.16081296394031018709e-03
19.700000 1.00000000000002953193e+00 -1.69678253459555334996e-03
19.700000 1.00000000000002953193e+00 2.16397712888596839217e-03
19.700000 1.00000000000002953193e+00 -1.70668429647571158123e-03
19.700000 1.00000000000002953193e+00 2.16319008338753185350e-03
19.700000 1.00000000000002953193e+00 -1.70152110620219319988e-03
19.700000 1.00000000000002953193e+00 2.16560070525297770905e-03
19.700000 1.00000000000002953193e+00 -1.68721337504941525966e-03
19.700000 1.00000000000002953193e+00 2.23209457932419105472e-03
19.700000 1.00000000000002953193e+00 -1.61860649457635109166e-03
19.700000 1.00000000000002953193e+00 2.31743932115937613381e-03
19.700000 1.00000000000002953193e+00 -1.73466961820729448189e-03
19.700000 1.00000000000002953193e+00 1.49685092025034455036e-03
