# tag norm j_0
9.700000 1.00000000000004884981e+00 2.22682717162345049366e-02
9.700000 1.00000000000004884981e+00 1.53635421909766884535e-02
9.700000 1.00000000000004884981e+00 2.17019371847972410150e-02
9.700000 1.00000000000004884981e+00 1.53236853067505902903e-02
9.700000 1.00000000000004884981e+00 2.14099451550980347803e-02
9.700000 1.00000000000004884981e+00 1.51291701400843060787e-02
9.700000 1.00000000000004884981e+00 2.10663999939039343900e-02
9.700000 1.00000000000004884981e+00 1.47728095715554483963e-02
9.700000 1.00000000000004884981e+00 2.09541398233368848791e-02
