# tag norm j_0
1.400000 1.00000000000000310862e+00 2.45407167372122770265e-05
1.400000 1.00000000000000310862e+00 7.92385805922025658761e-06
1.400000 1.00000000000000310862e+00 1.15959387585822356259e-05
1.400000 1.00000000000000310862e+00 -2.49144307512063153224e-07
1.400000 1.00000000000000310862e+00 1.55057167661055120180e-05
1.400000 1.00000000000000310862e+00 1.86729500960469629056e-07
1.400000 1.00000000000000310862e+00 1.12744213834406944714e-05
1.400000 1.00000000000000310862e+00 7.44862876881106400386e-06
1.400000 1.00000000000000310862e+00 2.53191105546071959205e-05
