# tag norm j_0
18.600000 1.00000000000001998401e+00 -1.50232803168813145583e-02
18.600000 1.00000000000001998401e+00 -2.40526221458399538933e-02
18.600000 1.00000000000001998401e+00 3.94588241761344507563e-02
18.600000 1.00000000000001998401e+00 1.37815521929589793887e-02
18.600000 1.00000000000001998401e+00 -3.23102531619563135279e-02
18.600000 1.00000000000001998401e+00 3.37938439369575294169e-02
18.600000 1.00000000000001998401e+00 -3.83730656021873464678e-02
18.600000 1.00000000000001998401e+00 8.51884721789554488769e-02
18.600000 1.00000000000001998401e+00 9.98405700634458735665e-03
18.600000 1.00000000000001998401e+00 -2.03818580674151386689e-02
18.600000 1.00000000000001998401e+00 8.70921884759447498259e-03
18.600000 1.00000000000001998401e+00 8.58774163939385742905e-02
18.600000 1.00000000000001998401e+00 -3.80333545157443136953e-02
18.600000 1.00000000000001998401e+00 3.28105557241966383497e-02
18.600000 1.00000000000001998401e+00 -3.20991078612713892637e-02
18.600000 1.00000000000001998401e+00 1.32194475805533402657e-02
18.600000 1.00000000000001998401e+00 4.02537185320396839749e-02
18.600000 1.00000000000001998401e+00 -2.41101851165010025446e-02
18.600000 1.00000000000001998401e+00 -1.58307308602286325727e-02
