# tag norm j_0
0.100000 9.99999999999999888978e-01 -6.58132093518223597897e-07
0.100000 9.99999999999999888978e-01 1.76780614283963245340e-07
0.100000 9.99999999999999888978e-01 5.33370774998336238487e-09
0.100000 9.99999999999999888978e-01 3.26056594405848242102e-09
0.100000 9.99999999999999888978e-01 5.55516226779058773662e-08
0.100000 9.99999999999999888978e-01 -7.62936373697260051885e-08
0.100000 9.99999999999999888978e-01 1.87597737337383078526e-07
0.100000 9.99999999999999888978e-01 -1.36730542049056007284e-07
0.100000 9.99999999999999888978e-01 -5.71090025584607990651e-08
0.100000 9.99999999999999888978e-01 -1.51920180667128990100e-07
0.100000 9.99999999999999888978e-01 -9.59793389483987272782e-08
0.100000 9.99999999999999888978e-01 -1.45237507119364443703e-07
0.100000 9.99999999999999888978e-01 1.64232064271856711728e-07
0.100000 9.99999999999999888978e-01 -7.19547261187440501421e-08
0.100000 9.99999999999999888978e-01 8.34886795022958855511e-08
0.100000 9.99999999999999888978e-01 -1.13817761700944619381e-07
0.100000 9.99999999999999888978e-01 1.58503068659211393451e-07
0.100000 9.99999999999999888978e-01 1.88490579017598510714e-07
0.100000 9.99999999999999888978e-01 -1.05261174367510815211e-06
