# tag norm j_0
9.200000 1.00000000000003774758e+00 -8.17933500780391731233e-02
9.200000 1.00000000000003774758e+00 -9.74950082006147272784e-02
9.200000 1.00000000000003774758e+00 -8.05702684013874514957e-02
9.200000 1.00000000000003774758e+00 -9.77218037135957340311e-02
9.200000 1.00000000000003774758e+00 -8.04691864327686107172e-02
9.200000 1.00000000000003774758e+00 -9.76450539360105840281e-02
9.200000 1.00000000000003774758e+00 -8.03149598567955563810e-02
9.200000 1.00000000000003774758e+00 -9.72683582946991392992e-02
9.200000 1.00000000000003774758e+00 -8.12717549293561075663e-02
