# tag norm n_hub[0] n_hub[1] n_hub[2] n_hub[3] n_hub[4] n_hub[5] n_hub[6] n_hub[7] n_hub[8] n_hub[9] n_hub[10] n_hub[11]
1 1.00000000000000000000e+00 1.22371388317972762394e+00 8.59694745176880270598e-01 8.55227711054511119393e-01 1.15782781973055493019e+00 9.61276739070336616599e-01 1.15051827562809183547e+00 1.05377114047587627788e+00 1.21440256687885050901e+00 8.10192617925484692698e-01 1.08266116450852512010e+00 5.10619812280498908130e-01 1.12009352409066154088e+00
2 1.00000000000000000000e+00 9.99561868020732657847e-01 1.21677767264419744997e+00 7.67058482938672181461e-01 1.12629494573200572560e+00 7.74760815140408176660e-01 1.11831903491451933874e+00 9.87592422858489249471e-01 1.99281810794347991056e+00 9.95350414840218800094e-01 1.00587355059057381723e+00 1.76873047119445320208e-02 9.97905379664783542815e-01
3 1.00000000000000000000e+00 9.08936561581835111845e-01 1.28816658353037150064e+00 7.77934984347356084378e-01 1.21739214030144848877e+00 6.46205233133679723956e-01 1.17736954584714692551e+00 6.83782081903706151493e-01 1.31217101004070668679e+00 8.07013383444179943638e-01 1.31006279099679878719e+00 8.37812401814517437870e-01 1.03315328305819287280e+00
4 1.00000000000000000000e+00 8.87716594072465392529e-01 1.30149864010267068970e+00 7.76734134956867605659e-01 1.26774768479197774695e+00 6.97738872661876285974e-01 1.25835994395719930061e+00 7.07134243923148386735e-01 1.28044406034081403867e+00 7.62255948425431095750e-01 1.24224347394073242334e+00 7.43896939409147361921e-01 1.07422946341764657952e+00
5 1.00000000000000000000e+00 8.52708630326923011644e-01 1.31063775578829422308e+00 7.84425231469145556318e-01 1.30786321258275650692e+00 7.22037666159624835771e-01 1.30416385117340194455e+00 7.00671255204399212602e-01 1.27918933805178158813e+00 6.97574925996514827453e-01 1.22413514155530589456e+00 6.85600781320133578767e-01 1.13099221037170472037e+00
6 1.00000000000000000000e+00 7.83903652033216546968e-01 1.30322607821983815768e+00 7.49786901498699753787e-01 1.29868111722682155751e+00 7.51038584674272535757e-01 1.30583384038415162287e+00 7.19059266541328345745e-01 1.27397483074783957058e+00 6.98889667543400872063e-01 1.23298110405942540346e+00 6.94583656143637706570e-01 1.18804130092735737989e+00
7 1.00000000000000000000e+00 7.44058517089956850121e-01 1.30027627252870847663e+00 7.15605129831612618574e-01 1.30860548167713242051e+00 7.07891746408870203844e-01 1.30179200007444251241e+00 6.97436767276469304910e-01 1.29440637130231928076e+00 6.89956530907323672963e-01 1.28889069310160175874e+00 6.98021681513918190731e-01 1.25305880828762639112e+00
8 1.00000000000000000000e+00 7.24326672916167701999e-01 1.29877470798601768465e+00 6.99308469219459660771e-01 1.29959281370298196379e+00 6.94742777540893086119e-01 1.30981167936049458511e+00 6.91277179680317654942e-01 1.31067584939960424251e+00 6.92400268513521099933e-01 1.30415610690920669157e+00 7.01470710071427139276e-01 1.27346276469990393743e+00
9 1.00000000000000000000e+00 7.21157799270613075748e-01 1.29856450340588525094e+00 6.91962592196055825688e-01 1.30786753147815559828e+00 6.88699548307833864236e-01 1.31070612129420172032e+00 6.88379402958176234151e-01 1.31161107513855723639e+00 6.91833547355063416262e-01 1.30876377510968522344e+00 7.01447895793259834640e-01 1.27900620769252038045e+00
10 1.00000000000000000000e+00 7.20687593349804922482e-01 1.29853609101814515547e+00 6.91463361591035385878e-01 1.30824732065754334442e+00 6.87866277514170842977e-01 1.31160591383223756878e+00 6.88305439062597002042e-01 1.31227581518755931356e+00 6.91600090806015810330e-01 1.30866399813405509533e+00 7.01432850227214688132e-01 1.27931524861961976036e+00
11 1.00000000000000000000e+00 7.20816248120391800391e-01 1.29862066557623578866e+00 6.91528828939294570866e-01 1.30837812143868981174e+00 6.87899715512042653209e-01 1.31176236367993492848e+00 6.88323459137627269300e-01 1.31209145437367014075e+00 6.91750419670684402185e-01 1.30840517408411227684e+00 7.01359633727637099554e-01 1.27906391573969169251e+00
12 1.00000000000000000000e+00 7.20995637515536191842e-01 1.29857405317165541803e+00 6.91576170060353101476e-01 1.30838827341319685615e+00 6.87943172404958169786e-01 1.31168062830995624246e+00 6.88325644064768593644e-01 1.31204634886824678119e+00 6.91619492187558360108e-01 1.30843242582971464039e+00 7.01401908098764126365e-01 1.27901624607530317590e+00
13 1.00000000000000000000e+00 7.20990747287761135631e-01 1.29857950997157689521e+00 6.91575708379991827002e-01 1.30839438448699585393e+00 6.87945572361078228063e-01 1.31168210936813078860e+00 6.88317671629431582225e-01 1.31205418070351242932e+00 6.91605538193070024100e-01 1.30842416272451189663e+00 7.01420681471560336639e-01 1.27900973342239487884e+00
14 1.00000000000000000000e+00 7.20991211484481309135e-01 1.29857942921122226920e+00 6.91576213364690217666e-01 1.30839434209076843629e+00 6.87946142140401062370e-01 1.31168201106138959666e+00 6.88317914513804973708e-01 1.31205389215428702698e+00 6.91605576787905684810e-01 1.30842385324780030587e+00 7.01420581827345568371e-01 1.27900883211587657051e+00
