# tag norm j_0
15.900000 1.00000000000019650948e+00 2.50186157404026516399e-03
15.900000 1.00000000000019650948e+00 2.75357995511579540376e-03
15.900000 1.00000000000019650948e+00 2.44477700045063819911e-03
15.900000 1.00000000000019650948e+00 2.11765201829481946802e-03
15.900000 1.00000000000019650948e+00 2.00929512751373906890e-03
15.900000 1.00000000000019650948e+00 2.07773588975084574221e-03
15.900000 1.00000000000019650948e+00 2.07367216339109788903e-03
15.900000 1.00000000000019650948e+00 2.10351562006556554521e-03
15.900000 1.00000000000019650948e+00 2.07765803000257986977e-03
15.900000 1.00000000000019650948e+00 2.10530055629167727263e-03
15.900000 1.00000000000019650948e+00 2.08081911624305318856e-03
15.900000 1.00000000000019650948e+00 2.10924620124655886472e-03
15.900000 1.00000000000019650948e+00 2.08369973451984170573e-03
15.900000 1.00000000000019650948e+00 2.08702051534426398505e-03
15.900000 1.00000000000019650948e+00 2.02689828231715973503e-03
15.900000 1.00000000000019650948e+00 2.11300329975441618380e-03
15.900000 1.00000000000019650948e+00 2.44776923907380960718e-03
15.900000 1.00000000000019650948e+00 2.77254671348725785507e-03
15.900000 1.00000000000019650948e+00 2.55286520477385420538e-03
