# tag norm n_hub[0] n_hub[1] n_hub[2] n_hub[3] n_hub[4] n_hub[5] n_hub[6] n_hub[7] n_hub[8] n_hub[9] n_hub[10] n_hub[11] n_hub[12] n_hub[13] n_hub[14] n_hub[15] n_hub[16] n_hub[17] n_hub[18] n_hub[19] n_hub[20] n_hub[21] n_hub[22] n_hub[23] n_hub[24] n_hub[25] n_hub[26] n_hub[27] n_hub[28] n_hub[29] n_hub[30] n_hub[31] n_hub[32] n_hub[33] n_hub[34] n_hub[35] n_hub[36] n_hub[37] n_hub[38] n_hub[39] n_hub[40] n_hub[41] n_hub[42] n_hub[43] n_hub[44] n_hub[45] n_hub[46] n_hub[47] n_hub[48] n_hub[49]
1 1.00000000000000000000e+00 3.32753845489512506406e-02 1.97470096258874305839e+00 4.42226112759290745924e-01 1.54119597987137546546e+00 4.69496079748906308682e-02 1.96185504320498238506e+00 2.76413043836939320563e-01 1.75324364084725869972e+00 7.29011539936681773888e-01 1.29261489701567744426e+00 2.40386065899134304669e-01 1.72741154849977940344e+00 6.74441164090623379579e-01 1.30731818047031023156e+00 2.65820367171624105662e-01 1.93369839798133646980e+00 8.74907287851363402176e-01 1.04006938667636350537e+00 9.75421279568417842754e-01 1.04691252924443811700e+00 9.48449889946822111142e-01 1.06562359865370193113e+00 9.60882168904526379194e-01 1.02292852661951405580e+00 9.13886215932300793874e-01 1.03605964806029704484e+00 8.92054682075028804178e-01 1.02109573526333097249e+00 6.05734740964385606765e-02 1.97667620110758313068e+00 9.82163528674625863069e-01 1.43853073405456388656e+00 9.78913934532991136805e-01 1.13160335400535516648e+00 9.61325102734364111967e-01 1.06388015782986244950e+00 9.47535115257894910989e-01 1.04633457883888580930e+00 9.24650611221792373406e-01 1.04572522066254247619e+00 9.18467104922594645977e-01 1.04071506772216859638e+00 9.19335995182859244679e-01 1.04226100227633744488e+00 9.24258404373450970226e-01 1.04858278247643910142e+00 9.43426269747022705481e-01 1.23054930170424325908e+00 5.89504687426334328393e-01 7.86134485657930981439e-01
2 1.00000000000000000000e+00 2.02577128835758901726e-02 1.97609786370293738500e+00 5.64641499955736286820e-02 1.93996017312650081976e+00 2.69688009758637728397e-02 1.97157419430831204465e+00 4.44836429526290835779e-02 1.95555489578410224283e+00 5.03803008657390666292e-02 1.94434316588860500730e+00 3.32338917504840999917e-02 1.96567065311338273759e+00 3.03975669160729405904e-02 1.96452302525239286268e+00 4.05904324276776112823e-02 1.96541212273356324935e+00 5.11711718440586368906e-02 1.94909274943779231570e+00 3.39633095144972127488e-02 1.97511351921369548990e+00 3.05748295688679921911e-02 1.96098115363064740002e+00 3.97979253521343612210e-02 1.96608919925866154621e+00 2.54617205019155440349e-02 1.96893641957787912666e+00 3.07156133463571436037e-02 1.96564466467476139933e+00 3.48644048305560283474e-02 1.96710823150243929724e+00 3.98817738962926188195e-02 1.96248588370252319280e+00 4.40440401220802968396e-02 1.95674325087178013760e+00 3.67864584195201002603e-02 1.96570555896566490084e+00 4.09915303584935108994e-02 1.96607356804227273450e+00 3.46977520673152350916e-02 1.95668324026909590252e+00 4.00166213919148708311e-02 1.96131339374531421527e+00 4.51432208572667970081e-02 1.95427305089227898449e+00 3.50502034372797213746e-02 1.97059167774134214035e+00 4.43205372613530781956e-02 1.96173699367912912628e+00 3.00310708365730955061e-02 1.96800266851148908387e+00
3 1.00000000000000000000e+00 1.84064506256776602711e-02 1.96388152593725462403e+00 3.54428942669918409236e-02 1.96457049809039641097e+00 3.54365269248050271389e-02 1.96451469720315818890e+00 3.54891311516867674625e-02 1.96453010104779868250e+00 3.54560264278781997471e-02 1.96453891285723081239e+00 3.54670853930826243672e-02 1.96453138227982981867e+00 3.54687859839453584199e-02 1.96453252550465062853e+00 3.54695116171257415760e-02 1.96452365518232530128e+00 3.54812444708313481923e-02 1.96452417794478706448e+00 3.54956070288957870051e-02 1.96450608360759471083e+00 3.54536116278050539297e-02 1.96450463593704838239e+00 3.55291723666503536649e-02 1.96451309731013523674e+00 3.54704680924778359419e-02 1.96452838441246568912e+00 3.54671799966359557743e-02 1.96453260131077955819e+00 3.54684041025944071790e-02 1.96453189427254870658e+00 3.54688200507550163709e-02 1.96453168557473767386e+00 3.54634893142524304510e-02 1.96452303929181848474e+00 3.54247865693600033632e-02 1.96459159889448820024e+00 3.54905844402090761558e-02 1.96451701727783722973e+00 3.54788492641008174067e-02 1.96458631104068026652e+00 3.54869767834302476950e-02 1.96451849011402068790e+00 3.53933961619856060632e-02 1.96439982456163142466e+00 3.56020632713752172016e-02 1.96434486443945366396e+00 3.56643130041598699354e-02 1.96455856318129118421e+00 3.61472424672853454020e-02 1.98154181132221030026e+00
4 1.00000000000000000000e+00 1.84026917684921818841e-02 1.96388748589156314495e+00 3.54444505899865133780e-02 1.96453143354006876109e+00 3.54679106122586310090e-02 1.96453206573006644575e+00 3.54679068935171981636e-02 1.96453207380540639804e+00 3.54679065271663457315e-02 1.96453207697649556707e+00 3.54679593306105531147e-02 1.96453207866978085683e+00 3.54679094481064743904e-02 1.96453210926432331185e+00 3.54679346128987244002e-02 1.96453201287561274313e+00 3.54681654181581637597e-02 1.96453174269522334860e+00 3.54682255946476704400e-02 1.96453203584916180624e+00 3.54675071126504051766e-02 1.96453218233796533809e+00 3.54680335918589814681e-02 1.96453222070361888107e+00 3.54678715855934953427e-02 1.96453207149524922137e+00 3.54678879677397945747e-02 1.96453209087528013477e+00 3.54679153632859803236e-02 1.96453207782805239212e+00 3.54679327898559798582e-02 1.96453208447066063336e+00 3.54678275749683927232e-02 1.96453201515601372229e+00 3.54675514564571081610e-02 1.96453252811455025828e+00 3.54679980523015733751e-02 1.96453213115091429586e+00 3.54680044445399439423e-02 1.96453208446683835753e+00 3.54682824548045866342e-02 1.96453196112473693624e+00 3.54683028475624717579e-02 1.96453143107433891856e+00 3.54678854943845933700e-02 1.96453215310615458833e+00 3.54687015922808684953e-02 1.96455562564137165005e+00 3.61131334358501879245e-02 1.98159633059642437125e+00
5 1.00000000000000000000e+00 1.84024797190592524776e-02 1.96388775818088934244e+00 3.54446757615584362444e-02 1.96453115934584254809e+00 3.54678915610465023134e-02 1.96453207235998861258e+00 3.54679262073049061943e-02 1.96453207369396110060e+00 3.54679264359142668028e-02 1.96453207360913673085e+00 3.54679262668670600145e-02 1.96453207380776850854e+00 3.54679262427217908971e-02 1.96453207353385050915e+00 3.54679264579051412021e-02 1.96453207401451490632e+00 3.54679261346116866949e-02 1.96453207349301472995e+00 3.54679253472736655262e-02 1.96453207444322819342e+00 3.54679266729157616211e-02 1.96453207344198554907e+00 3.54679262102812128954e-02 1.96453207377672334211e+00 3.54679264192144516610e-02 1.96453207378364891333e+00 3.54679266082660871184e-02 1.96453207350995118219e+00 3.54679261107944399090e-02 1.96453207398875240308e+00 3.54679263313059794926e-02 1.96453207347299363406e+00 3.54679262486790047859e-02 1.96453207401082230454e+00 3.54679254598365412132e-02 1.96453207400511908887e+00 3.54679325779871795765e-02 1.96453207850008859658e+00 3.54679336596391836522e-02 1.96453206693638482427e+00 3.54679220242035617150e-02 1.96453206838802296730e+00 3.54679338937433780155e-02 1.96453207415448427575e+00 3.54679316437566394260e-02 1.96453210700163793945e+00 3.54688413343592218174e-02 1.96455532425497225724e+00 3.61122527788450622954e-02 1.98159749618472247334e+00
