# tag norm j_0
18.700000 1.00000000000002864375e+00 -5.22216334770090597969e-04
18.700000 1.00000000000002864375e+00 -1.67277621790985937811e-03
18.700000 1.00000000000002864375e+00 1.48029238109687933701e-03
18.700000 1.00000000000002864375e+00 -1.44858571561106677823e-03
18.700000 1.00000000000002864375e+00 1.46181141528584188256e-03
18.700000 1.00000000000002864375e+00 -1.46016353413876663614e-03
18.700000 1.00000000000002864375e+00 1.42786360318676434390e-03
18.700000 1.00000000000002864375e+00 -1.44510378128558970856e-03
18.700000 1.00000000000002864375e+00 1.40694320256156335178e-03
18.700000 1.00000000000002864375e+00 -1.44921859398555036291e-03
18.700000 1.00000000000002864375e+00 1.38918619464607263382e-03
18.700000 1.00000000000002864375e+00 -1.44632204464728618756e-03
18.700000 1.00000000000002864375e+00 1.39424705839383072069e-03
18.700000 1.00000000000002864375e+00 -1.44234440786156019841e-03
18.700000 1.00000000000002864375e+00 1.41997750060010087016e-03
18.700000 1.00000000000002864375e+00 -1.42061365941558771266e-03
18.700000 1.00000000000002864375e+00 1.42059506042642902553e-03
18.700000 1.00000000000002864375e+00 -1.62864483245986325054e-03
18.700000 1.00000000000002864375e+00 -6.02715948714017588604e-04
