# tag norm j_0
26.900000 1.00000000000002908784e+00 -9.87740429572534495151e-02
26.900000 1.00000000000002908784e+00 3.53983905507860852069e-02
26.900000 1.00000000000002908784e+00 -4.62015404967315718165e-02
26.900000 1.00000000000002908784e+00 -4.54230892946554665190e-02
26.900000 1.00000000000002908784e+00 1.98511393020800785969e-01
26.900000 1.00000000000002908784e+00 -4.44880974061305431433e-02
26.900000 1.00000000000002908784e+00 -4.72618311311053668211e-02
26.900000 1.00000000000002908784e+00 3.51572564623817557239e-02
26.900000 1.00000000000002908784e+00 -9.77858909649228086325e-02
