# tag norm j_0
12.800000 1.00000000000001798561e+00 -1.30099044778406031098e-01
12.800000 1.00000000000001798561e+00 1.08213694740831971319e-02
12.800000 1.00000000000001798561e+00 -6.06788258710882627556e-02
12.800000 1.00000000000001798561e+00 -5.88976653789192380883e-02
12.800000 1.00000000000001798561e+00 -3.65764956052799725117e-02
12.800000 1.00000000000001798561e+00 2.07797083702070360667e-02
12.800000 1.00000000000001798561e+00 -7.30241323800380898179e-02
12.800000 1.00000000000001798561e+00 -2.16675210165738034440e-02
12.800000 1.00000000000001798561e+00 -4.70123848049628437207e-02
12.800000 1.00000000000001798561e+00 -4.23372995643454558962e-03
12.800000 1.00000000000001798561e+00 -4.68685874067552438182e-02
12.800000 1.00000000000001798561e+00 -2.13757982657696264661e-02
12.800000 1.00000000000001798561e+00 -7.35254056085319213087e-02
12.800000 1.00000000000001798561e+00 2.05057435938092690042e-02
12.800000 1.00000000000001798561e+00 -3.52825317224053983112e-02
12.800000 1.00000000000001798561e+00 -5.91008970618225534799e-02
12.800000 1.00000000000001798561e+00 -6.28360305918076594844e-02
12.800000 1.00000000000001798561e+00 1.19754161850065560940e-02
12.800000 1.00000000000001798561e+00 -1.26250157077723357268e-01
