# tag norm n_hub[0] n_hub[1] n_hub[2] n_hub[3] n_hub[4] n_hub[5] n_hub[6] n_hub[7] n_hub[8] n_hub[9] n_hub[10] n_hub[11] n_hub[12] n_hub[13] n_hub[14] n_hub[15] n_hub[16] n_hub[17] n_hub[18] n_hub[19] n_hub[20] n_hub[21] n_hub[22] n_hub[23] n_hub[24] n_hub[25] n_hub[26] n_hub[27] n_hub[28] n_hub[29] n_hub[30] n_hub[31] n_hub[32] n_hub[33] n_hub[34] n_hub[35] n_hub[36] n_hub[37] n_hub[38] n_hub[39] n_hub[40] n_hub[41] n_hub[42] n_hub[43] n_hub[44] n_hub[45] n_hub[46] n_hub[47] n_hub[48] n_hub[49] n_hub[50] n_hub[51] n_hub[52] n_hub[53] n_hub[54] n_hub[55] n_hub[56] n_hub[57] n_hub[58] n_hub[59] n_hub[60] n_hub[61] n_hub[62] n_hub[63]
1 1.00000000000000000000e+00 1.47065774530438231338e+00 1.17084111248663713667e+00 1.26553035927519719195e+00 1.43819973930228650616e+00 1.13359511125586331914e+00 1.24407773393668574791e+00 9.74705939009698041353e-01 1.11932380593864522211e+00 8.96170698941792243097e-01 1.19459284036848201183e+00 1.05626128407971919820e+00 1.04206799307892472584e+00 1.53458148611683053986e+00 5.36736730579497223204e-01 9.11990563137498377877e-01 7.18828540442359997797e-01 1.06999668267504643993e+00 8.68871682423146163288e-01 6.33428531604946276623e-01 9.73173799923647830923e-01 8.40957087496602806453e-01 8.89874151607023100574e-01 8.32716603358450213612e-01 1.16295004794254319691e+00 1.16371504205014497657e+00 8.57452448047332116410e-01 7.27252175254232691159e-01 9.63756338269736501090e-01 8.20597417967196762767e-01 1.12542106528129304266e+00 6.65794256022352870517e-01 1.20240363463292543322e+00 1.10530132115098100876e+00 8.83234522685956702226e-01 1.51670267351082777019e+00 1.10574587099491283837e+00 1.02414890956153126211e+00 1.67678531020835963616e+00 1.41179996795336526461e+00 1.51474815026675990737e+00 1.86966755986327881622e+00 5.52064159899160245004e-01 1.00425580824303728456e+00 1.51288277827353079275e+00 1.11649945099542580174e+00 3.87266400189100468143e-01 1.64918340084269132717e+00 1.06975757684445271778e+00 1.28979520979135986458e+00 6.36738613483628035361e-01 7.63483501638179018478e-01 8.83296763331423373522e-01 6.58915185948443782316e-01 1.01325029355058671143e+00 3.58942326778622644579e-01 8.27447012493712219516e-01 8.43512399896537812261e-01 8.83245466288186786841e-01 5.00925532875606038807e-01 5.45912593132302226273e-01 7.75549588351265417607e-01 4.47802066953472688304e-01 5.89081315009540529282e-01 1.07553562118250645163e+00
2 1.00000000000000000000e+00 9.98964952068316813794e-01 1.21978879902767012311e+00 7.72458502609531749705e-01 1.11466751925429230496e+00 8.00892504667531812679e-01 1.17191642898986336796e+00 9.26619880503300352714e-01 1.05008758291156234499e+00 7.20576155503238724442e-01 1.22384600672127752397e+00 9.87370013722723371963e-01 1.01296321133096189904e+00 1.00000196464577517652e+00 1.95368758100780337550e+00 1.18093569691148841949e-01 1.92565509187958605608e+00 1.00453099562254788424e+00 1.61067417098913412410e+00 3.93427013992798113584e-01 9.99066175044435622610e-01 9.99609149593722823290e-01 1.16870372722369486596e+00 8.73907437443492418616e-01 1.03696639701372350650e+00 5.40145903952626516009e-01 1.31819089360000063493e+00 5.98546335095234138812e-02 9.98393672684109279025e-01 8.37374667048304766048e-01 1.23481431987576684151e+00 5.28985680451754869402e-01 1.29655931781409972103e+00 8.69522645010315092806e-02 1.07325784354146325228e+00 4.08023261132433368026e-01 1.25681492695779128965e+00 9.61678746134638662291e-01 1.33852139055171659443e+00 9.80581754971998398318e-01 1.99318484751225066809e+00 1.00463082127197389504e+00 1.99488170042760448730e+00 1.00573211545784402254e+00 1.99430544912440010918e+00 1.00301320950669015097e+00 1.99769125045868700674e+00 9.99799132049577377046e-01 1.79407706305690539672e+00 4.33109616491964943830e-01 1.78475185498358035474e+00 8.23043778323442998257e-01 1.10162186223279867647e+00 6.33797252641279812435e-02 9.98807468238200768518e-01 5.77109755732023270436e-03 9.97574899857143315707e-01 1.00000000000061173289e+00 9.99999995250023254734e-01 9.99881179017549359678e-01 9.97500935901855512178e-01 5.07809549472080287019e-03 9.93981300748273510770e-01 5.99840941786309277128e-03 9.97560084169099914320e-01
3 1.00000000000000000000e+00 9.67042238190019998179e-01 1.25930790850368756750e+00 7.49716818500604120779e-01 1.23875809357169130998e+00 6.96846549270930482045e-01 1.16464416609677945402e+00 8.40471284391792083923e-01 1.14492739474266347344e+00 7.28405500093929680894e-01 1.23485515044756688496e+00 8.41583253114810525553e-01 1.13387212618793009611e+00 9.95710389857185962370e-01 1.63336482273448657665e+00 6.90281408033647014832e-01 1.68860161988726620308e+00 9.57634391742456236862e-01 1.27014164924448769156e+00 7.42625069920850089389e-01 1.02129184036760967125e+00 9.94207854520256284481e-01 1.24740039028737914606e+00 7.42750039108065251980e-01 1.01759792554420891442e+00 4.06837175738999634600e-01 1.28372904775867535676e+00 2.94331670785749122121e-01 1.02282201788587956415e+00 8.81180171312029303365e-01 1.18671743001434104592e+00 5.76175387522556259334e-01 1.18881931739492863187e+00 3.06510578708531489234e-01 1.16131760984238341372e+00 6.06795953421970235553e-01 1.16766237195734978727e+00 8.80122826760267096269e-01 1.34316246073682976636e+00 8.56178122401639485339e-01 1.84191475878843391456e+00 9.97897220769338955115e-01 1.99338455104103795534e+00 1.00485462743851328149e+00 1.99509876281172116030e+00 1.00456241009798219466e+00 1.99099422222978272856e+00 1.00394277598627090775e+00 1.42543470798438542957e+00 6.52588430984910150556e-01 1.36130889087621032019e+00 5.95911660987540003909e-01 1.23077284543834730712e+00 6.04507422064884836210e-01 1.07405264657746557511e+00 6.27326057288658672784e-02 1.00233390898149266057e+00 9.93169463623986503720e-01 9.99203511181104286898e-01 5.11991274614650992980e-01 9.98999990513602664777e-01 2.89811729060859890605e-01 1.06383075554924233508e+00 1.23646090024185237310e-01 1.01265471004309093317e+00
4 1.00000000000000000000e+00 9.43095905579182103295e-01 1.27143072472573881448e+00 7.49011466033039030599e-01 1.22514197224577126022e+00 6.92907256685798000895e-01 1.20238978107050131783e+00 7.95158015906297754860e-01 1.21323659276598916357e+00 6.88954366618686808721e-01 1.24738114413015899196e+00 7.23622893841252778913e-01 1.25936985220051411716e+00 9.71177913547292881447e-01 1.64137551989969088240e+00 7.16303873827725201551e-01 1.66255844982743394844e+00 9.22864893296173161019e-01 1.27393134817577391438e+00 7.55137519320173478121e-01 1.04488660658954701788e+00 9.26694787508449802083e-01 1.27596335356844714504e+00 7.27908945757552716671e-01 1.07660027452562756523e+00 3.47077806795911714133e-01 1.27829537606933163474e+00 3.44078894612451946511e-01 1.03110716949745584436e+00 7.11926437031890513296e-01 1.24456623739601845990e+00 5.32301553044579711660e-01 1.29677863978346463725e+00 4.41306091827762703161e-01 1.32373724545281579168e+00 5.71001553604856160185e-01 1.43754960921883156999e+00 6.88055721094392169768e-01 1.62312437249825980423e+00 7.96740011229923883462e-01 1.51464709415809184456e+00 8.91891421831968678191e-01 1.92175444951557405915e+00 9.99948036148936236778e-01 1.98473723218425535109e+00 9.92205336503429791151e-01 1.94612990870625623963e+00 9.36301279652247298024e-01 1.32102917974302869197e+00 7.69921353977388256418e-01 1.25530384374049797103e+00 6.91901409135759926095e-01 1.16108491886978582031e+00 4.90861103496076978114e-01 1.19550397176637557273e+00 2.42564783314947518544e-01 1.02619488213724685544e+00 9.30996793376457243419e-01 1.00286252006048748342e+00 6.33055369226016434459e-02 1.02093263044235604831e+00 2.61073803307174501231e-01 1.24865802124116997973e+00 4.05547758928438639714e-01 1.04989255403470704842e+00
5 1.00000000000000000000e+00 9.21090916221359523597e-01 1.27569175933570799764e+00 7.60954293087905075943e-01 1.21663821668226002082e+00 6.95638484447563154589e-01 1.22486137015962959218e+00 7.62620227795271721227e-01 1.24801053042412113392e+00 6.93790258233770829044e-01 1.24358452701676291952e+00 7.32943521855820567801e-01 1.29367154779604720538e+00 9.20343336262831046568e-01 1.63268499547599921229e+00 7.19353423788554824370e-01 1.64201483535645631484e+00 8.84609339303662589593e-01 1.29697105774675769396e+00 7.78730468219684612841e-01 1.05880682944532700240e+00 7.89636839559172631908e-01 1.26412300273713396059e+00 6.10876930012800634096e-01 1.22531066316073022904e+00 3.56835347947347003572e-01 1.26733555638243067243e+00 4.33755709102746189743e-01 1.05055017955026341880e+00 6.82450995338025223624e-01 1.28300244315523848115e+00 6.01358100977856913083e-01 1.31658262086629429533e+00 5.81716669494685034714e-01 1.35735824613574163067e+00 6.20529983663551498729e-01 1.41927257081708591002e+00 6.95608210898299494929e-01 1.45291774597884582043e+00 8.39241840082523893329e-01 1.54788173208273360792e+00 8.43735066058285410051e-01 1.80794245824070620721e+00 9.62575791646057998818e-01 1.84614161349238803389e+00 8.91810624477988200809e-01 1.78287900139927968368e+00 8.95128473005579849975e-01 1.50512923090060057874e+00 7.74507133225928456888e-01 1.28944260135363930608e+00 5.94653088273892516114e-01 1.20907643344949700115e+00 3.89176561414673383155e-01 1.21568875201443060696e+00 5.34982120063327681869e-01 1.07704836333508358059e+00 8.49542711456708676820e-01 1.03159833521124433275e+00 1.20633158896099226820e-01 1.04717051459300281024e+00 3.15932288647555181704e-01 1.22803601271789997185e+00 3.47526419913925355143e-01 1.04028791961316580128e+00
6 1.00000000000000000000e+00 8.58067536110186601661e-01 1.29761364675126067425e+00 7.59614103260117023986e-01 1.29829155468496115766e+00 7.17800235481504178559e-01 1.31270272718008618185e+00 7.21177794452289799843e-01 1.29592260517907309492e+00 6.70636624708480844070e-01 1.27836223563239625989e+00 7.14899745600941161072e-01 1.37060695510667529540e+00 7.89098545305652376847e-01 1.60339755437404285487e+00 7.21024484615337746263e-01 1.57926918075884281656e+00 8.66420141272076116401e-01 1.30006821431597741068e+00 7.74064496393594314583e-01 1.08629668668795376085e+00 6.44981452392740961521e-01 1.28393149002120310342e+00 5.02315511735119457626e-01 1.29802075567538266476e+00 4.03024824204050557963e-01 1.25542191512754386373e+00 5.18298087515667749159e-01 1.08195612092841941809e+00 7.00783779368362114148e-01 1.29112485939731125306e+00 6.57646197161490642102e-01 1.31137632605670950703e+00 6.58655374191877696077e-01 1.33205837201078880483e+00 6.74962831361125115137e-01 1.34762857107730482653e+00 7.31995628814705923126e-01 1.37101826772645063457e+00 8.44454672290127827949e-01 1.56223194281636956759e+00 7.96319200340597443954e-01 1.74767600857892779764e+00 9.39902335444487646576e-01 1.59381607051193996405e+00 7.17289468997695744967e-01 1.70564176708415726758e+00 9.01944755540280307393e-01 1.38071186986614602432e+00 7.59569087741861714846e-01 1.35541108495727846694e+00 6.57525614956462889360e-01 1.26391619314238701222e+00 6.43892103746507182827e-01 1.15204663757627279175e+00 7.89492116181082725923e-01 1.13333094626840491514e+00 6.92006969205430588765e-01 1.08344315473742525135e+00 2.28135877407217718682e-01 1.08113139121385759545e+00 3.31379691871214743237e-01 1.22009937564960879719e+00 3.05094836333893282276e-01 1.03300139490334497161e+00
7 1.00000000000000000000e+00 8.21957722337330665141e-01 1.30168719617074124528e+00 7.71768683879727190877e-01 1.32077988990071348852e+00 7.48018711508340206073e-01 1.34174233181106417057e+00 7.20773505635059708041e-01 1.34922135496242789898e+00 6.77538150786692994210e-01 1.39078991259036355288e+00 6.84707100983408145645e-01 1.47731592334811012712e+00 6.97250897775911093746e-01 1.53240690672075730028e+00 7.29274608928612622094e-01 1.46670507615222511788e+00 8.55512280604791675032e-01 1.26751573478337342671e+00 7.58675559523815157270e-01 1.11284748531872246247e+00 5.84469828197156870964e-01 1.27963294134076188691e+00 4.64089849348375493854e-01 1.30417084458989873674e+00 4.39548323772929905306e-01 1.23977227804937251143e+00 5.62598101088953250759e-01 1.11776812731465957640e+00 6.97665264496071801936e-01 1.28391432097456581474e+00 6.83130610095721846342e-01 1.30628107458617059855e+00 6.82870995365251309828e-01 1.31913092182048785617e+00 7.06359605499874199097e-01 1.32628795981009028893e+00 7.66467460962962254811e-01 1.37702466219945507397e+00 8.27478994722040894771e-01 1.60517316406346766122e+00 7.66253979185715805578e-01 1.66887684634347466250e+00 9.10857130105220180738e-01 1.57521956638180404831e+00 7.33751064034883215825e-01 1.68103399729236602234e+00 8.29760744880494782727e-01 1.38338182064387971160e+00 7.89245233663399603508e-01 1.29976998127916099079e+00 7.17295519639777001686e-01 1.22960606065757493965e+00 6.91118050584830889704e-01 1.15976641988542050754e+00 8.46764182040477320079e-01 1.13019861071758320747e+00 5.55773617368275463235e-01 1.13262344117635227470e+00 3.02787745072312763916e-01 1.10144659983900350397e+00 3.40037991709820353048e-01 1.21858704497210390549e+00 3.03485337849140002220e-01 1.03203465265663973938e+00
8 1.00000000000000000000e+00 8.12688043200312848491e-01 1.30407260296349503115e+00 7.75213958877820963345e-01 1.33104005529824376275e+00 7.50730160951857627971e-01 1.35934344764722192522e+00 7.20874681213890644571e-01 1.39545747267876429909e+00 6.78780780986376619524e-01 1.44006439440983569078e+00 6.74454372072860408593e-01 1.48693355627658396756e+00 6.88695445757606439230e-01 1.48539709781438511449e+00 7.43246021416200330911e-01 1.41275276331430577059e+00 8.44257481065409098875e-01 1.25442676954035770009e+00 7.44274799504459960708e-01 1.12863351450170568135e+00 5.67666679081742175939e-01 1.27439888949680946162e+00 4.54249852453351143922e-01 1.30298078371346992554e+00 4.56025274169848393591e-01 1.23791732273980548129e+00 5.77639631064192027310e-01 1.13934680475104976871e+00 6.92741137394440653630e-01 1.27396131206777019074e+00 6.95658408030952690737e-01 1.30172604620952703236e+00 7.00732963045217038811e-01 1.30884056503457224530e+00 7.31083532277069791938e-01 1.31886378391151692924e+00 7.86196636881156152299e-01 1.39739341556000407074e+00 8.03426562505669128456e-01 1.61071708389600409816e+00 7.58610650838703493015e-01 1.61549010817030280762e+00 8.82703581139164250580e-01 1.53815001850872445921e+00 7.45119959125593922522e-01 1.63499073593237276292e+00 7.58449785287532485256e-01 1.45384954687532341744e+00 7.82771842394175076940e-01 1.31259189453581681661e+00 7.28756433146158122405e-01 1.22887398658073143665e+00 6.99105914649379212022e-01 1.20684248610119837508e+00 8.49792443863111035540e-01 1.11498545317082786710e+00 4.89977793246721360365e-01 1.16256364969476400084e+00 3.56589319471418031426e-01 1.10318334858289146538e+00 3.43735005273075655552e-01 1.22197623392227749939e+00 3.14145967563390526855e-01 1.03383973815007901287e+00
9 1.00000000000000000000e+00 8.09507233043736396105e-01 1.30457903888797077663e+00 7.77102391162030503580e-01 1.33288683120323314668e+00 7.52975433098921898001e-01 1.37061555755738107010e+00 7.20845964131930916352e-01 1.41597870102677081405e+00 6.85313337287205448511e-01 1.46136738512897879083e+00 6.77260091035877809240e-01 1.48457543485887866197e+00 6.97098642123010314720e-01 1.45482773910009588469e+00 7.53839118968008148336e-01 1.38196904183560764778e+00 8.33712911725930538864e-01 1.24464864237525407731e+00 7.30471087082734782392e-01 1.14556068360036666931e+00 5.60457006752644759651e-01 1.26953410250822229521e+00 4.54059788891792492915e-01 1.30069045322604415205e+00 4.65832909871343348041e-01 1.24029187305353905124e+00 5.82880669615281843399e-01 1.16105232732502172688e+00 6.90459011996738536432e-01 1.26213915399391418681e+00 7.04902221414596796834e-01 1.29434070553394575676e+00 7.15108892243391580656e-01 1.30322554875454543755e+00 7.50802284989838031315e-01 1.32954028362992171530e+00 7.91877224508402588476e-01 1.43732920065875013904e+00 7.72592239870119712464e-01 1.60233535170637941825e+00 7.48805550753298909683e-01 1.56868289861634302440e+00 8.52222644981470045522e-01 1.49134295293890573042e+00 7.54817077899463950708e-01 1.56930594811504753316e+00 7.14690684523459962563e-01 1.49668000237811438247e+00 7.27101306026137761407e-01 1.36130959657497574433e+00 6.89010716344018558921e-01 1.28654423922429828053e+00 6.54048591715505445165e-01 1.26938275563731273188e+00 7.64108893389099597115e-01 1.11361679539219160517e+00 4.81592552987040511958e-01 1.17185035552547445192e+00 4.37346532523395004066e-01 1.11086983535666550260e+00 3.40849672719947371924e-01 1.23314641602624841532e+00 3.83145529600334211473e-01 1.05494193497309507457e+00
10 1.00000000000000000000e+00 8.09374403884382531693e-01 1.30851366203181429526e+00 7.78544496346124659247e-01 1.34167898657153550346e+00 7.51039968510266664481e-01 1.38971126538629419223e+00 7.16920870478689686855e-01 1.43688470158178427383e+00 6.89473033011439917495e-01 1.46891686480887928568e+00 6.83876433108569381503e-01 1.46925170941593052909e+00 7.07263810355246103079e-01 1.42537178378603934803e+00 7.65211440027753098114e-01 1.35782788723440628331e+00 8.18573177767395687709e-01 1.24046699926132175662e+00 7.21078282146081939175e-01 1.16455981607237979425e+00 5.72132190963197562183e-01 1.26109584684544606681e+00 4.77413195028834502764e-01 1.30027365914283699055e+00 4.76927420268215052079e-01 1.26316318040474739881e+00 5.68971978547438750340e-01 1.21064276575566842631e+00 6.58078476391665723177e-01 1.24044934697667752488e+00 7.07633447651750069340e-01 1.28184409961093970232e+00 7.30395562442262780145e-01 1.30597626347871909047e+00 7.54437190700954385392e-01 1.34063598493440272463e+00 7.73437650071602256219e-01 1.45288313917341804782e+00 7.45994168878018837354e-01 1.57194264279595508071e+00 7.38467131500624596185e-01 1.53478492637926478004e+00 8.20981104537165440327e-01 1.42393512010737310902e+00 7.72997364893167837607e-01 1.43540890069863236178e+00 7.02411097733528944076e-01 1.45620374777813799128e+00 6.62303654375077099914e-01 1.40380872810282997243e+00 6.20029592063845669259e-01 1.35057783492148830717e+00 5.90983540630470094435e-01 1.28447931909857526733e+00 6.36308296618017688040e-01 1.15165832741603724187e+00 5.94191980556825205539e-01 1.18555341589009755054e+00 4.78389338185727874819e-01 1.15215260176035139139e+00 4.11122991551061800486e-01 1.18805300608450270516e+00 5.31564429477997202333e-01 1.13476574778978922531e+00
11 1.00000000000000000000e+00 8.09798895418478492658e-01 1.30912409183271960522e+00 7.78493361856180343672e-01 1.34807079108651706179e+00 7.49762128185853971019e-01 1.39747018481129425815e+00 7.16339520323421963255e-01 1.44558394728437145105e+00 6.92020787690078575949e-01 1.47198891774776274843e+00 6.90106656214694025309e-01 1.45985121569105014139e+00 7.16030662318148491963e-01 1.40884441020536055333e+00 7.70225704328551308286e-01 1.34280259975249105509e+00 8.06656793142569661370e-01 1.23803364189370546100e+00 7.12646924424768513084e-01 1.17959908908848509768e+00 5.86938075693486327467e-01 1.25750917816071994260e+00 5.01901670735725224937e-01 1.29918026461299418450e+00 4.90184221152352550543e-01 1.28096568260595544686e+00 5.58752168304103125074e-01 1.24252358546563490549e+00 6.40921707662683859397e-01 1.24833431187273991014e+00 6.97795388628775326012e-01 1.28365688169333425073e+00 7.26042020541206145623e-01 1.31817431157471620651e+00 7.45004067039987449839e-01 1.37236679591628996100e+00 7.47569441126086475791e-01 1.47344654223771298618e+00 7.22837469461730663944e-01 1.53806136365340906380e+00 7.29988340682996783571e-01 1.49407031280192903466e+00 7.98602734226250388083e-01 1.38687874126243837480e+00 7.78908782521763765061e-01 1.35428170715448392691e+00 7.17036135459218293420e-01 1.36187184735820232540e+00 6.74811868370601808387e-01 1.34149942137432742761e+00 6.47772490907059572685e-01 1.31414737220571731235e+00 6.35836121441480384142e-01 1.25298915221952711363e+00 6.34329858431260995566e-01 1.18164039831920164580e+00 5.35751329500943507256e-01 1.22743315780033590556e+00 3.61029381196205978455e-01 1.22888213409997337777e+00 5.05560221324763303663e-01 1.16730703157296455963e+00 6.87045481477251973601e-01 1.20671050685450342854e+00
12 1.00000000000000000000e+00 8.10362649084468755767e-01 1.31113030783123973855e+00 7.77600925150362054517e-01 1.35175661120175227836e+00 7.48087459838708612736e-01 1.40044243740783613816e+00 7.16376595962922357863e-01 1.44567112052771218345e+00 6.93735827305586028046e-01 1.46593700720985253838e+00 6.93858634438691335156e-01 1.44924792558797266295e+00 7.19354339610697723906e-01 1.40053440015109997852e+00 7.69003090018746560119e-01 1.33803448139082470369e+00 7.96885860550289981674e-01 1.24621911813110042289e+00 7.19466361681518895566e-01 1.19367196919794582577e+00 6.18001292634824728189e-01 1.25167501700696215394e+00 5.44957282113272212243e-01 1.29615840533961468317e+00 5.13376202978944595756e-01 1.29895905874334238739e+00 5.45604966174866090611e-01 1.27994958464188335334e+00 6.08741390146628313929e-01 1.27704719411498857085e+00 6.64857646068350183199e-01 1.29977871143938528142e+00 7.03414570075189704568e-01 1.34098485707526737798e+00 7.20975536907076608450e-01 1.39733083075215458457e+00 7.17703578023823340892e-01 1.47338486066362173155e+00 7.06403728863047253306e-01 1.50413129203183948412e+00 7.26305596283756016440e-01 1.45948178988681931401e+00 7.83682843090232950090e-01 1.37212162702352613586e+00 7.78359796833433481567e-01 1.32885524633464613409e+00 7.32483225911519486573e-01 1.32381400688218575645e+00 6.99587043709518408008e-01 1.31051335989105965929e+00 6.81432094207874428093e-01 1.28039130960808611448e+00 6.74152836661679577546e-01 1.22912607860511258195e+00 6.41888869110172399779e-01 1.19904911323164209414e+00 5.18966443659937493038e-01 1.25118572942520289715e+00 3.94479341263612892643e-01 1.24928789121193584144e+00 5.04476175926704906161e-01 1.17383609357646290228e+00 6.80311997132668655475e-01 1.19539836245802999493e+00
13 1.00000000000000000000e+00 7.90600763904125369841e-01 1.29811961948607823558e+00 7.67073349332088483266e-01 1.31065142728382366677e+00 7.54458150351435374859e-01 1.31538871168065885087e+00 7.37517572080365391152e-01 1.31056031906537273635e+00 7.18425846491845265795e-01 1.29500960865530090338e+00 7.05682942517958822215e-01 1.27562946660415610367e+00 7.04750195399380219285e-01 1.25482087865927982584e+00 7.17845178164029151802e-01 1.25886389151591493452e+00 7.60954331783214477092e-01 1.28023594545078278628e+00 7.73378840954843993494e-01 1.28970342600857756921e+00 7.41369913799393542853e-01 1.29379589285542673238e+00 7.11666470812680640456e-01 1.30111654174734980849e+00 6.92309012019603597921e-01 1.31007296031742126452e+00 6.88437126257274600860e-01 1.32339370202612216509e+00 6.86012955913674060682e-01 1.34720950243066805996e+00 6.90679980816471306149e-01 1.37974017995496667233e+00 6.90358396447021904763e-01 1.41340897391917597048e+00 6.87195256377237995160e-01 1.43170128032274424079e+00 6.87107994028283153298e-01 1.43312285755581481084e+00 7.00171675785306923956e-01 1.40829028641144859968e+00 7.28655803860963402485e-01 1.37261547624499580245e+00 7.57460580623140367074e-01 1.33934568812657506243e+00 7.59479963543778779922e-01 1.31221407858576832872e+00 7.42368913719272494056e-01 1.29523461074723900133e+00 7.22558828488441107218e-01 1.27378572837439851817e+00 7.03099079197971210675e-01 1.24110558484647670596e+00 6.64817982146948094346e-01 1.21734769233319584103e+00 5.83176153597014579333e-01 1.25101796771499240712e+00 4.86810308879792985604e-01 1.28301141651722661052e+00 4.76581809835953440491e-01 1.26688096203647826421e+00 5.52772807542169286599e-01 1.21859826294910478239e+00 6.57617016050080382961e-01 1.15661185885088579894e+00
14 1.00000000000000000000e+00 7.85924104434086778781e-01 1.29463625649662961159e+00 7.64006691929556391862e-01 1.29941923162806149961e+00 7.55075011325430311970e-01 1.29623567302103714916e+00 7.38820195563503312464e-01 1.28265340937756211481e+00 7.22185926521692556079e-01 1.26737118236075851918e+00 7.08810095778630744334e-01 1.25246105691314069119e+00 7.02975044154660388962e-01 1.24616960487062078400e+00 7.14578094375376227099e-01 1.25904720115083801346e+00 7.46567687394277812452e-01 1.28660871689861400213e+00 7.66596980094348845469e-01 1.30580165032065131925e+00 7.56865791695136569395e-01 1.31698990176690000631e+00 7.31669893177069652346e-01 1.32950329803821820640e+00 7.12232113657735421697e-01 1.34779814293626531985e+00 6.96137734261855989359e-01 1.36762155483402203515e+00 6.88224036863780530560e-01 1.38758065952651787889e+00 6.83208659530218143097e-01 1.40382707450230537205e+00 6.81205347032839858556e-01 1.41262237896181797048e+00 6.82618066136356005380e-01 1.41091110307850775563e+00 6.90806400296304912167e-01 1.39780215217825354301e+00 7.07799980587498933637e-01 1.37523718790753690655e+00 7.31618832758362369617e-01 1.35028614622050313621e+00 7.51765910869656939219e-01 1.32682258742487158010e+00 7.54329537876848310596e-01 1.30485905703116533694e+00 7.41385737415577450449e-01 1.28043535113514539425e+00 7.18524438826609546105e-01 1.25409910409597635805e+00 6.84773549794557845338e-01 1.23633135433546970106e+00 6.38305341114202118291e-01 1.24108637874067939677e+00 5.64812758993808006203e-01 1.27532714888366749406e+00 5.02238039241590605855e-01 1.29259725528822189133e+00 5.02053255850299362528e-01 1.26804328825788070745e+00 5.71103973107074058824e-01 1.21484338034129990547e+00 6.59726763956054340632e-01 1.15802551686162669142e+00
15 1.00000000000000000000e+00 7.86132860150659196208e-01 1.29453432867094653247e+00 7.64140208392534381332e-01 1.29924005051434221514e+00 7.54054437692829759854e-01 1.29223725913750508987e+00 7.38401968870057379135e-01 1.27836188691477148360e+00 7.21267231664429964155e-01 1.26142638692604713846e+00 7.07954252288404028981e-01 1.24854631171955343660e+00 7.04164624359820856547e-01 1.24780527471648805538e+00 7.14997393222471910867e-01 1.26370858475338576632e+00 7.37291325439205724734e-01 1.28801449551888635980e+00 7.54091295516164050738e-01 1.30863177585465040309e+00 7.52678186879048527480e-01 1.32533965304373690941e+00 7.35960404395324396809e-01 1.34300928920202755634e+00 7.16671598195857018077e-01 1.36390674797145905472e+00 6.99679786340791753929e-01 1.38546499646014487084e+00 6.88174981997936030531e-01 1.40337484606749507421e+00 6.82393635238569884471e-01 1.41360751012449581410e+00 6.81219403506903242729e-01 1.41336412769318386928e+00 6.86316817365303810661e-01 1.40203139311814428680e+00 6.98260755746940908750e-01 1.38275602574610467776e+00 7.16152435332836567738e-01 1.35947456046675019259e+00 7.36663625539054289781e-01 1.33680447315412642695e+00 7.51420342046323352925e-01 1.31461021311479431262e+00 7.49882902540149887116e-01 1.28960174255549508970e+00 7.31747960719535406326e-01 1.26056115658040179817e+00 6.98722989498788638052e-01 1.23807750215818268558e+00 6.51238498233151941186e-01 1.24299335501723740016e+00 5.89077727921754834561e-01 1.27068085587765433608e+00 5.36621483376770513907e-01 1.29481943726182380239e+00 5.17118060169534876636e-01 1.28992326939228019178e+00 5.48553946857648910829e-01 1.25793454177259755866e+00 6.10336779480583180302e-01 1.21869367256766736318e+00 6.75470937160036033475e-01 1.17360541978843557764e+00
16 1.00000000000000000000e+00 7.88642541675000030565e-01 1.29446767738781431945e+00 7.65452306876749921649e-01 1.29751071231183989774e+00 7.53162417867584421671e-01 1.28769721399972003617e+00 7.36724757368939608959e-01 1.27430060964301961057e+00 7.19920843593213510836e-01 1.26028778686752529481e+00 7.08785430869637744777e-01 1.25132583610017533715e+00 7.06266549868667437018e-01 1.25272412610602557059e+00 7.15186676078855665395e-01 1.26724761539932551102e+00 7.31942594021475101407e-01 1.28870325121096462873e+00 7.46586970696120677538e-01 1.31013818514626834144e+00 7.48529476961586448525e-01 1.33061678673705663378e+00 7.36556577238218657122e-01 1.35216231139363518565e+00 7.19078186726198054224e-01 1.37567209070818430305e+00 7.02383794562551400098e-01 1.39717555506953172717e+00 6.90416420949178877287e-01 1.41234731737501384430e+00 6.84748685112625432581e-01 1.41743217204898108719e+00 6.86462275266885302294e-01 1.40976990155190273768e+00 6.94625831271659111010e-01 1.39216839283084814483e+00 7.09526177947455205519e-01 1.36912701205879883126e+00 7.28177977977222501416e-01 1.34516871533013748774e+00 7.44299175783112221261e-01 1.32290006845742902364e+00 7.50027312076506524896e-01 1.29983116809720677942e+00 7.40178997930732163191e-01 1.27328376141788246478e+00 7.15561104089947108697e-01 1.25014722815010315138e+00 6.79284980616892242189e-01 1.24273014830175743128e+00 6.31750490510267992406e-01 1.25789095241369208722e+00 5.79266907401135955347e-01 1.28326721707726765231e+00 5.37607437640282181945e-01 1.29858974044890707056e+00 5.28997440692391296402e-01 1.28986904716710615304e+00 5.61765421629854433405e-01 1.25836988580535580340e+00 6.20401723796297543956e-01 1.21920043473409012158e+00 6.78447976771677341290e-01 1.17711161678254905283e+00
17 1.00000000000000000000e+00 7.88703360784706264397e-01 1.29445788351856427845e+00 7.65466670364660650705e-01 1.29746374332260994144e+00 7.53064281629208909230e-01 1.28831452792488931891e+00 7.36038467494021020343e-01 1.27362149333986884869e+00 7.19601115357126563943e-01 1.25948055800059943721e+00 7.08989284437544053930e-01 1.25214853912024426386e+00 7.07472097737960048391e-01 1.25557797745716670512e+00 7.15577730298780911866e-01 1.26933826339397315408e+00 7.29547043780612081143e-01 1.28903481440628309151e+00 7.41280051734304556987e-01 1.31020398214733480025e+00 7.44263364579477615379e-01 1.33174199287229622080e+00 7.35914218110620854674e-01 1.35500917490843031388e+00 7.20821462466611051489e-01 1.37965401155424904900e+00 7.04995501470554231105e-01 1.40200353697921387131e+00 6.93544746441328241460e-01 1.41679672972922299223e+00 6.88575373399215817649e-01 1.41942374869118537184e+00 6.91342995876718102721e-01 1.40877561770964643273e+00 7.01922681251632596400e-01 1.38795406805941268225e+00 7.18753882471628080530e-01 1.36258851605148834096e+00 7.36986711348280754130e-01 1.33639976042654606836e+00 7.48260014655751981572e-01 1.31068289140183269481e+00 7.45020931034287792194e-01 1.28208723934654478249e+00 7.23601462024300312592e-01 1.25577616396571856150e+00 6.89199029920723793552e-01 1.24364213706390747127e+00 6.44729709169048925688e-01 1.25451181834145986116e+00 5.96360334065323516306e-01 1.27890811193685061120e+00 5.56877796478550401993e-01 1.29757555410902658544e+00 5.41288070549280186938e-01 1.29948672423794864272e+00 5.59998582373366526888e-01 1.28378689030265480397e+00 5.93940707083401076005e-01 1.25366718710924285318e+00 6.45033349910730136045e-01 1.22445512302383807679e+00 6.87808375938118610193e-01 1.19045181530961308169e+00
18 1.00000000000000000000e+00 7.71851008547865924392e-01 1.29293370818894937102e+00 7.49819822933134316756e-01 1.30008641457358353755e+00 7.45710874097197384813e-01 1.29807592599733867544e+00 7.39554322614047965345e-01 1.29231853661533002686e+00 7.29920680333460580869e-01 1.28422833768186039904e+00 7.18586145570210166333e-01 1.27468143330220717857e+00 7.09721925584996804481e-01 1.26612352446903342340e+00 7.04126499764983870833e-01 1.26001932163708274537e+00 6.98632286016223180702e-01 1.26269900237278198674e+00 7.02597929304291657360e-01 1.26862809695869427351e+00 7.07382759304938879552e-01 1.27908502558956715944e+00 7.14539363372878821856e-01 1.28976369268293966641e+00 7.22063706213959988212e-01 1.29573925923839516905e+00 7.26224677982199695592e-01 1.29906097616697535635e+00 7.25283547224560343203e-01 1.29915199752151178103e+00 7.24869875132127861050e-01 1.29867438350526742674e+00 7.13929609235859685690e-01 1.29637310099670099994e+00 7.17810980245312091341e-01 1.29550232534811105012e+00 7.17517557611097811510e-01 1.29212576847374771560e+00 7.17133912506028758926e-01 1.28549442355519061287e+00 7.10973832642555203520e-01 1.28252825634875899929e+00 7.15588233835968146046e-01 1.27358362664613689041e+00 7.28760231973958561014e-01 1.27829398789906378830e+00 7.46388758516295824919e-01 1.28490157919824121713e+00 7.52782675178849780551e-01 1.29309332236302920727e+00 7.40031972909394264448e-01 1.29269099149721000686e+00 7.19863632082553328573e-01 1.28780118023841638752e+00 6.97376903120219937549e-01 1.27665921807508975228e+00 6.85557922808448627627e-01 1.26370026663576684456e+00 6.84326432091927339130e-01 1.24984239467909685750e+00 6.90135362281167230591e-01 1.23920254368445692528e+00 7.02865737071785678935e-01 1.21500819975081464364e+00
19 1.00000000000000000000e+00 7.71029723956930479467e-01 1.29282142239263486694e+00 7.49042991967241333917e-01 1.29970163050204901012e+00 7.45056959772687821264e-01 1.29887245985793708947e+00 7.38626599353719326402e-01 1.29413787281905801052e+00 7.29507019366671949356e-01 1.28664906035226422887e+00 7.19619711574632670015e-01 1.27800358070205577476e+00 7.10752780899801872572e-01 1.26987424005530025184e+00 7.03958014627688366538e-01 1.26466048855456247857e+00 6.99981389789068875196e-01 1.26365195023562582044e+00 6.99168159617911344483e-01 1.26793205927111318765e+00 7.00599600169173442055e-01 1.27595204915231996701e+00 7.03830879154348831861e-01 1.28485347068021527051e+00 7.07434432371452759369e-01 1.29251387485307422942e+00 7.10012672792857180148e-01 1.29777834951068471447e+00 7.11948652187043173889e-01 1.29895199912701664324e+00 7.11078640460085731334e-01 1.29843224041311056105e+00 7.10387507488555502988e-01 1.29594464892028105041e+00 7.09564914801883883655e-01 1.29312710306398193083e+00 7.08601665477982312069e-01 1.28895293974071556420e+00 7.08539133835591417032e-01 1.28462058218062713522e+00 7.10624600518168225705e-01 1.28234619967280805142e+00 7.19545862520128642892e-01 1.28639335537499621687e+00 7.30956996356808552662e-01 1.29082403140533963359e+00 7.41181683863168405679e-01 1.29656925304393855214e+00 7.46911113350899769081e-01 1.29794305381172159208e+00 7.39775508792607117137e-01 1.29227045089201908468e+00 7.26580046173001092846e-01 1.28148733765154321240e+00 7.13278430586108069811e-01 1.26939170665512612857e+00 7.04613946724683803957e-01 1.25842927815476368636e+00 7.00552505287512450316e-01 1.25193631593814669323e+00 7.00055304395683530849e-01 1.24861498663750047911e+00 7.06727418364618498181e-01 1.22681714177832956736e+00
20 1.00000000000000000000e+00 7.62862759206998863881e-01 1.29192968120594553483e+00 7.40122302043520252646e-01 1.29982859959198870925e+00 7.38591293798324222131e-01 1.30045248733183727019e+00 7.35222147368096545783e-01 1.29937833024648607960e+00 7.29343085646267819122e-01 1.29454522766488699936e+00 7.25455543564568428039e-01 1.29048807060325576579e+00 7.17382971269571734219e-01 1.28423383961431891720e+00 7.10789267348595932283e-01 1.27554038510255418615e+00 7.05047225416700840128e-01 1.26993190117750076595e+00 7.00593041509836034209e-01 1.26704849252733886544e+00 6.97454193412577638789e-01 1.26781708147340466120e+00 6.96679722457860250984e-01 1.27365866501680513601e+00 6.97311351470185192269e-01 1.28109166805320384697e+00 6.98846917790843069618e-01 1.28810645010295865553e+00 7.00120661980997760487e-01 1.29431705583962175510e+00 7.01257303129225295635e-01 1.29708812921467941948e+00 7.01457031582713330664e-01 1.29972344246824556002e+00 7.02247480214716057745e-01 1.29896254146981759980e+00 7.03163718414819727265e-01 1.29918214733568704311e+00 7.08668394902612019948e-01 1.29898198993008584523e+00 7.14571110615740967553e-01 1.29903050380208062720e+00 7.22955830967388579644e-01 1.30104240121588277113e+00 7.31687711729599454813e-01 1.30149766672604250139e+00 7.37326225884208819039e-01 1.30058731288205620125e+00 7.38135262049682494556e-01 1.29736350674477618483e+00 7.32307679214003193202e-01 1.29055077189455613684e+00 7.22482236994576032529e-01 1.28068125484384109924e+00 7.12611736274953444514e-01 1.26996410258027347950e+00 7.04600647055497963933e-01 1.26019940865037405331e+00 7.00082924988652322007e-01 1.25342634910087902256e+00 6.99734966295945226555e-01 1.24942033263484386651e+00 7.06959492883230122828e-01 1.22785796547026482273e+00
21 1.00000000000000000000e+00 7.62017890875959058583e-01 1.29182451657397279199e+00 7.39177767755916037551e-01 1.29949336350396804640e+00 7.37120528857322487859e-01 1.30084998920362027164e+00 7.34588332801478616219e-01 1.29964222027821785233e+00 7.30209311905086533301e-01 1.29664235252873161208e+00 7.24822312089329678919e-01 1.29224553873117065095e+00 7.18422133383631256187e-01 1.28677536158237715291e+00 7.11879403852610059822e-01 1.28102475840952045871e+00 7.06016083210058376096e-01 1.27592364827201976141e+00 7.01501642660681490327e-01 1.27264350026119643644e+00 6.98659183326670540914e-01 1.27201876153476733933e+00 6.97225912373131917477e-01 1.27410221407050983089e+00 6.97407923935939422222e-01 1.27838191035973647303e+00 6.98090404237384887232e-01 1.28364529251557479839e+00 6.99170056414535556755e-01 1.28903433302785197512e+00 7.00246351623386886764e-01 1.29305716883807009232e+00 7.01999070084099896505e-01 1.29572824707671019340e+00 7.05025248681162453046e-01 1.29791379049884336716e+00 7.09125565824744619192e-01 1.29980443875364271022e+00 7.14693941368086949062e-01 1.30113035879563798680e+00 7.21956455230520321997e-01 1.30305503767406261062e+00 7.28643403514738663418e-01 1.30332643705687045710e+00 7.32493291804339086148e-01 1.30165635892284603514e+00 7.32939665771492276924e-01 1.29819544034664047238e+00 7.27877956470850295823e-01 1.29097989100251542283e+00 7.19424379136933467294e-01 1.28225242645553150211e+00 7.13824812691294829925e-01 1.27559715517659610917e+00 7.05801881893360461007e-01 1.26913689609326807428e+00 7.00995967762606864149e-01 1.26479430220908262150e+00 6.97751867434903694232e-01 1.25937070382305904559e+00 6.99614449290481332788e-01 1.25791552661065675345e+00 7.07805288167126844812e-01 1.23530957538310759425e+00
22 1.00000000000000000000e+00 7.52429051020528594229e-01 1.29065072724338181231e+00 7.27815084401681189341e-01 1.29867116641456448178e+00 7.25991252284586940924e-01 1.30094034661837154587e+00 7.27178141387466503431e-01 1.30149598365494267860e+00 7.26587043536152443757e-01 1.30107530177922336989e+00 7.24817350155830264491e-01 1.29998738556075621453e+00 7.22606470947580015185e-01 1.29924638524995050837e+00 7.19951312905914853069e-01 1.29605894330767190681e+00 7.17803751302217962760e-01 1.29262474646214453600e+00 7.10700076774476219299e-01 1.29172028991421417032e+00 7.09391052021614343381e-01 1.28752367797935218796e+00 7.03452324198023393187e-01 1.28316813272407936886e+00 6.99646529965606278623e-01 1.27996806944593655153e+00 6.97786974629770351264e-01 1.27911640482414168396e+00 6.98065244078592161969e-01 1.28077058225702300476e+00 6.99998065666962987486e-01 1.28353865317877668950e+00 7.02829590440000040452e-01 1.28719076186087555413e+00 7.06626289009346764125e-01 1.29053444602725986279e+00 7.10175279999239017492e-01 1.29475326140044666445e+00 7.15083787264840453624e-01 1.29743713293594886693e+00 7.18906542258813230362e-01 1.29937017697118717408e+00 7.22396270484061298056e-01 1.30029624332875415327e+00 7.23174443810343015038e-01 1.29887753559799445924e+00 7.21313223851227536265e-01 1.29527364809052647487e+00 7.17266062417942773521e-01 1.28918256085167937108e+00 7.11978164286038994746e-01 1.28235977987858040805e+00 7.06986756580967101726e-01 1.27533364606694843424e+00 7.02884340351080272313e-01 1.26906078184289228261e+00 7.00005668269382375080e-01 1.26448645270093651405e+00 6.98940245660456982435e-01 1.26165198257295685380e+00 7.00338987983754934774e-01 1.25954608239393217595e+00 7.08040181514216993008e-01 1.23692315140564312870e+00
23 1.00000000000000000000e+00 7.51632699150658001308e-01 1.29059089242174196421e+00 7.26848734096841919694e-01 1.29843103742812115975e+00 7.25399906153272322484e-01 1.30088589749058902711e+00 7.25542726311688146446e-01 1.30168135381591421051e+00 7.25242054461134988408e-01 1.30172444508930640339e+00 7.24067177123372096581e-01 1.30135242083026869686e+00 7.22143814282612428457e-01 1.30067423093472167572e+00 7.19292381710772255055e-01 1.29957984554367111940e+00 7.15921111470040449909e-01 1.29841729623965340679e+00 7.12415214152297915362e-01 1.29734862923653460065e+00 7.08797745652702593233e-01 1.29499740852961009452e+00 7.04802033425633411845e-01 1.29313499104916029836e+00 7.01681980634783708517e-01 1.29188340202397844436e+00 7.00161221595060001555e-01 1.29171163568450331205e+00 7.00132396709821747116e-01 1.29219834959351587145e+00 7.01001596537582871704e-01 1.29356795933836932200e+00 7.02828795287509078271e-01 1.29620287919378895936e+00 7.05529650172878608494e-01 1.29762435425890676477e+00 7.08078216404834925868e-01 1.29957051059092654199e+00 7.10313186577466670890e-01 1.29928296335814219553e+00 7.10903344300214068419e-01 1.29880532158149319955e+00 7.09482341328044885387e-01 1.29272878633748078414e+00 7.07101034038582598740e-01 1.28756143371771281103e+00 7.01837126261996457899e-01 1.28359209678098085128e+00 7.00769012480656372510e-01 1.27959237991192420481e+00 6.99025927008510850058e-01 1.27538555971855571691e+00 6.99564311433007568475e-01 1.27365118066566207489e+00 6.98133259710598252923e-01 1.27278880182317788439e+00 6.98699579216266797310e-01 1.27466056294677532179e+00 6.98055944101697800619e-01 1.27394183314237463556e+00 7.01232199570528624832e-01 1.27257809444782621355e+00 7.09330631058855187732e-01 1.24788609385471249702e+00
24 1.00000000000000000000e+00 7.46276793719170994379e-01 1.28995085106662066288e+00 7.19959831591277299445e-01 1.29781977986199370534e+00 7.18028507340719768237e-01 1.30033588592216742263e+00 7.18220920397360629295e-01 1.30107403148152234174e+00 7.18776883151270973293e-01 1.30250182630399624628e+00 7.18806283517538946448e-01 1.30198290414729833664e+00 7.19216415703187728070e-01 1.30255563948128760821e+00 7.18997609942033322206e-01 1.30184408317373523367e+00 7.18752706733480684065e-01 1.30206176424000852343e+00 7.17051936258249589251e-01 1.30192345425963917904e+00 7.15379402624488069939e-01 1.30223833937625599333e+00 7.13055031050551235694e-01 1.30119055949469819566e+00 7.09969634147861072826e-01 1.30084000527029375327e+00 7.06298012081285286889e-01 1.30018079239394568347e+00 7.02582546008597930154e-01 1.29974655306034159175e+00 7.00075211411493536495e-01 1.30020161620620733345e+00 6.99431865089847115691e-01 1.30040282950126107053e+00 6.99172025054811019373e-01 1.30034716148556572790e+00 6.99399273684496392001e-01 1.30055417132742179298e+00 7.00426962507256223311e-01 1.29914318144368068353e+00 6.99889832625487540163e-01 1.29632946528040249312e+00 7.00071281359889496798e-01 1.29224016275422926014e+00 6.99114157107496358989e-01 1.28719532148305604302e+00 6.98143933279452011398e-01 1.28324310063518498559e+00 6.97979125836469371791e-01 1.27972067331093430909e+00 6.97801577948781170946e-01 1.27712828173681947064e+00 6.97700919637301186782e-01 1.27514932854144591445e+00 6.97699062779521872457e-01 1.27434592581489836149e+00 6.98119875579342852312e-01 1.27445503585824737591e+00 6.99143863207169702356e-01 1.27473282168830537309e+00 7.01597206687084917753e-01 1.27338391737038514329e+00 7.09444500276155909368e-01 1.24859734768952890249e+00
25 1.00000000000000000000e+00 7.45907388591234177255e-01 1.28995884614018785363e+00 7.19527403846041968549e-01 1.29772319275415037865e+00 7.17376535433332462866e-01 1.30024872281200698509e+00 7.17566806450281480245e-01 1.30130087893878743088e+00 7.18116253185496211664e-01 1.30178842390519244887e+00 7.18521741147716497267e-01 1.30203924888050948105e+00 7.18616169019343553614e-01 1.30218707487388618560e+00 7.18267766070034063830e-01 1.30229772032219948130e+00 7.17589712465266149621e-01 1.30238728422218907887e+00 7.16254476200371303918e-01 1.30246000837929609695e+00 7.14535635225217458100e-01 1.30247423879742463271e+00 7.12386888218729863453e-01 1.30244020576863173133e+00 7.09810513149506050468e-01 1.30229241209437396343e+00 7.06889545452561662842e-01 1.30188436837756715825e+00 7.04055054055699347515e-01 1.30159708387705319588e+00 7.01853200702536983435e-01 1.30104560361457477491e+00 7.00558282963219758344e-01 1.30058859471472243463e+00 6.99570005709488129675e-01 1.29937371112087074465e+00 6.98873602308643926406e-01 1.29749860545479323015e+00 6.98552883402109192623e-01 1.29360205182171017491e+00 6.97918176193770722904e-01 1.28973467599322622057e+00 6.97632145687527627231e-01 1.28595079661362055035e+00 6.97093003515090070543e-01 1.28257920447720574764e+00 6.96852970344115196788e-01 1.28102858541173891815e+00 6.96885902039494409266e-01 1.28003815070254978181e+00 6.95956848682792728056e-01 1.28074471725049066073e+00 6.97003117208579214825e-01 1.27975742633786082614e+00 6.96861656192114597985e-01 1.28010467720086551502e+00 6.98859217471139770872e-01 1.27960826242451242152e+00 6.99680449417636629583e-01 1.28119232849856889978e+00 7.02198914681555930173e-01 1.27920320162474809855e+00 7.09938363445930975537e-01 1.25315906811756860861e+00
26 1.00000000000000000000e+00 7.41638015327708233215e-01 1.28950685352676397422e+00 7.13849842041809790061e-01 1.29726414578890736351e+00 7.10734467235688671671e-01 1.29989036391540535575e+00 7.10662468270525704561e-01 1.30074415486495609251e+00 7.11068819792864958984e-01 1.30115984045238186617e+00 7.11527237199153561598e-01 1.30142155440058227001e+00 7.12180218053888758334e-01 1.30167957217878815790e+00 7.12488540624019228709e-01 1.30140165205058488951e+00 7.13750320324069487121e-01 1.30130767066876940063e+00 7.14361095560325898290e-01 1.30145614225747796588e+00 7.15138432085323572096e-01 1.30142020062527974389e+00 7.15306362309505061603e-01 1.30170183988878629400e+00 7.15086492684447350143e-01 1.30233262719525555440e+00 7.14304490785543366727e-01 1.30228136150532192161e+00 7.12677403070221426873e-01 1.30098771776404165124e+00 7.09612302410193906965e-01 1.30038646151823300556e+00 7.06871618549092639583e-01 1.29915714171241680752e+00 7.04300896329485670577e-01 1.29685705734161049740e+00 7.02781092917156069433e-01 1.29426429559870159736e+00 7.01776330061264608240e-01 1.29212628723935485375e+00 7.00050872919327549226e-01 1.28938832871357367260e+00 6.98905483390066750715e-01 1.28642482699860094542e+00 6.98233756967181817821e-01 1.28411657708193405192e+00 6.97984633825454725553e-01 1.28253598793646617082e+00 6.97881073486603553668e-01 1.28154466357708995972e+00 6.97798719231053077294e-01 1.28104785168359924796e+00 6.97874997083150927502e-01 1.28091075894634642829e+00 6.98147680525328828693e-01 1.28128197032598811766e+00 6.98652405060249614976e-01 1.28181373343340521131e+00 6.99715776080480633681e-01 1.28211597238946684030e+00 7.02256552396366862112e-01 1.28005122951603333981e+00 7.10014640788227624491e-01 1.25378812151877450098e+00
27 1.00000000000000000000e+00 7.40911560756754683510e-01 1.28946127199434523725e+00 7.12866809204263152111e-01 1.29715716601326236379e+00 7.09581134268825852729e-01 1.29968076875757376776e+00 7.09044933224776907643e-01 1.30071959581842833131e+00 7.09233136721076795617e-01 1.30115945844923719399e+00 7.09646178132531169069e-01 1.30131560055431294565e+00 7.10118051197519806195e-01 1.30132893873136490370e+00 7.10528381878736237098e-01 1.30128181642826068476e+00 7.10944729722607027256e-01 1.30114933564388368659e+00 7.11254268823749091766e-01 1.30092513446536361954e+00 7.11362126319480925218e-01 1.30078239426467656692e+00 7.11318119977907947771e-01 1.30039439800099487776e+00 7.11074693677306135520e-01 1.29978518229919437488e+00 7.10212310242560040940e-01 1.29860642402945436480e+00 7.08841949603655652190e-01 1.29718808518607531255e+00 7.07214727448242652663e-01 1.29515873566683969997e+00 7.05283006049059357778e-01 1.29247516993084299308e+00 7.03286351264709730380e-01 1.28995038193161271067e+00 7.01315975692482052040e-01 1.28748603740042977250e+00 6.99614495003114789107e-01 1.28552413908547014110e+00 6.99022195655880973497e-01 1.28619221977671172041e+00 6.96996025796961404808e-01 1.28739443131747854920e+00 6.98683495868984150157e-01 1.28846004260851421108e+00 6.98756838957385939537e-01 1.28962466274752340922e+00 6.98247758367577020522e-01 1.29123040172505487710e+00 6.98253414491299184697e-01 1.29267672253275511807e+00 6.98163120191310659912e-01 1.29232520359630487228e+00 6.98056125949687578114e-01 1.29272902885469331835e+00 6.99417717191556320699e-01 1.29333862800425469786e+00 6.99852738993627099262e-01 1.29255077835115494977e+00 7.02829913031380093535e-01 1.28889618465953614823e+00 7.10690974071395031864e-01 1.26042840339777040271e+00
28 1.00000000000000000000e+00 7.36880217685194960353e-01 1.28910274285293136032e+00 7.07354931577095169537e-01 1.29680434566281865827e+00 7.02887500362758266270e-01 1.29942051707443684272e+00 7.01377884891059344419e-01 1.30054465856656720213e+00 7.00678447752747568522e-01 1.30096893527038015570e+00 7.00266269807974128803e-01 1.30142608622986943878e+00 7.00459582051147777726e-01 1.30132420836510509510e+00 7.00800763686378780370e-01 1.30237094516561158208e+00 7.01419370713915468762e-01 1.30109639121304820897e+00 7.01342961585946111924e-01 1.30200674508305147548e+00 7.01616009546512264805e-01 1.30118881047796808303e+00 7.01156176565537747614e-01 1.30147681494156342019e+00 7.01457091913783692405e-01 1.30133522861700390294e+00 7.00602653228714178368e-01 1.30299206137350198631e+00 6.99735011132433415426e-01 1.30013073476038720777e+00 7.02381961958851275263e-01 1.30228515017273571708e+00 7.03622387949606964419e-01 1.30233155960585023081e+00 7.03285614119805946309e-01 1.30085683946659314003e+00 7.02659128713521874410e-01 1.29910367301597529099e+00 7.01653915072164569011e-01 1.29770513096730599756e+00 7.00405844068420657678e-01 1.29710874226359207384e+00 6.99832115401195720139e-01 1.29660070850600983583e+00 6.99571004537618001962e-01 1.29652442913255550039e+00 6.99292074410267971984e-01 1.29634481159853143240e+00 6.99087151782843863046e-01 1.29636306161509451407e+00 6.98910102482067641105e-01 1.29641593265493137999e+00 6.98839944322827366641e-01 1.29634744496751364018e+00 6.98994953820268105638e-01 1.29624766073147990042e+00 6.99454907464424069374e-01 1.29591442266187506505e+00 7.00548835350961796031e-01 1.29476006333774007473e+00 7.03100609222097716611e-01 1.29072395271709328135e+00 7.10783492034058439479e-01 1.26171827571895711628e+00
29 1.00000000000000000000e+00 7.36711468555769521949e-01 1.28910126606953645556e+00 7.07114342304251963789e-01 1.29680636260922077518e+00 7.02579728164141381619e-01 1.29941644557675339833e+00 7.00976458592059037400e-01 1.30056283705810504792e+00 7.00239311784542128869e-01 1.30111701283389424866e+00 6.99852326434133087396e-01 1.30138848128578588081e+00 6.99654099821679698046e-01 1.30152802202040063229e+00 6.99582013439088101769e-01 1.30159136904815220248e+00 6.99542804418578190173e-01 1.30161956652866184214e+00 6.99462778627097381268e-01 1.30161381381765051124e+00 6.99330488785649739825e-01 1.30152033882526185771e+00 6.99105770734603781946e-01 1.30141526083381386947e+00 6.98964102258576858162e-01 1.30133742846408417826e+00 6.98755976900077624414e-01 1.30125925281099452668e+00 6.98377623415819104302e-01 1.30137693927599729093e+00 6.98620145353836097257e-01 1.30161749316142194566e+00 6.98694885104588325753e-01 1.30151991726486038203e+00 6.98567113967296871024e-01 1.30119795909908408937e+00 6.98726872450809888271e-01 1.30059184182372145067e+00 6.98839094631850898942e-01 1.30050925545922524407e+00 6.97535031026639718021e-01 1.30080573528398857341e+00 6.98566078991821326483e-01 1.30085982340094274967e+00 6.98415149394009282524e-01 1.30084830240426208015e+00 6.98668243686610179743e-01 1.30067095257381160067e+00 6.98410948596031588842e-01 1.30047057521987063922e+00 6.98618193529852216095e-01 1.30052522727599240149e+00 6.98483385881088270075e-01 1.30017759184151926455e+00 6.99223586687271358997e-01 1.29985594205607402074e+00 6.99274747017247899628e-01 1.29917977812062623855e+00 7.00417490557985744637e-01 1.29769265123535215700e+00 7.03186282368978954338e-01 1.29301034287038141279e+00 7.10903348162384096653e-01 1.26341232220575760969e+00
30 1.00000000000000000000e+00 7.36535676085288026904e-01 1.28909469110130836533e+00 7.06858717538784819823e-01 1.29681070896285088878e+00 7.02243287445195596419e-01 1.29943851479950756023e+00 7.00564511885924612322e-01 1.30059721690480811773e+00 6.99751084385781596531e-01 1.30116799578509212409e+00 6.99268784132883403082e-01 1.30144626276610053672e+00 6.99005920995922069849e-01 1.30163281450272605433e+00 6.98779698182282138497e-01 1.30170669481051692884e+00 6.98661144757115493142e-01 1.30166223796621882691e+00 6.98531587200069137289e-01 1.30164367086501053805e+00 6.98342171308987902378e-01 1.30177324844873987253e+00 6.98190102124256140037e-01 1.30167754313323369431e+00 6.98021592279625013866e-01 1.30193345513731228991e+00 6.97817522775282195191e-01 1.30169989788521922591e+00 6.97524177175925408356e-01 1.30161310113569039792e+00 6.97707624898207812159e-01 1.30169527064335199817e+00 6.97923499339241582007e-01 1.30159443644136540996e+00 6.97902229876752544513e-01 1.30191230617645814505e+00 6.97906944351586622233e-01 1.30190979156774422343e+00 6.98066852147738226009e-01 1.30198932068374051418e+00 6.98151629826878061813e-01 1.30206211158739937339e+00 6.98175882001862646575e-01 1.30203732049132403503e+00 6.98238481081817852214e-01 1.30195153905034444186e+00 6.98303255352102913989e-01 1.30181000616055086994e+00 6.98296988076655300581e-01 1.30159312932722670553e+00 6.98373872832103836927e-01 1.30133129532021341035e+00 6.98538802559239835333e-01 1.30096495632408792886e+00 6.98824988839144789488e-01 1.30042770852769340451e+00 6.99405013177556766912e-01 1.29958115171673349586e+00 7.00572495714267273748e-01 1.29787195101012353682e+00 7.03197945734770457626e-01 1.29323758238805663900e+00 7.10914173510772129383e-01 1.26353541078589404201e+00
31 1.00000000000000000000e+00 7.36521617299438435822e-01 1.28909460676206233387e+00 7.06840140429263130706e-01 1.29681017421588218319e+00 7.02221953467828452489e-01 1.29943681092312712799e+00 7.00533544301564448098e-01 1.30060356938524335213e+00 6.99709104983376239950e-01 1.30118141458930192123e+00 6.99238433586877761172e-01 1.30147947226788862629e+00 6.98938047953674868040e-01 1.30163182097973617601e+00 6.98727070248186588053e-01 1.30170346824830374111e+00 6.98559797277819249928e-01 1.30172541569238719994e+00 6.98430005677926346586e-01 1.30173356672862072791e+00 6.98319784184687097905e-01 1.30172374337940555122e+00 6.98230979633222892389e-01 1.30170665562042886521e+00 6.98156612829019085353e-01 1.30164381593319222752e+00 6.98095837113852812905e-01 1.30163552494117951142e+00 6.98075224944799233029e-01 1.30158756387494567441e+00 6.98087944569465768119e-01 1.30159358609944564300e+00 6.98136099646818220066e-01 1.30163107885083562110e+00 6.98236119245603692463e-01 1.30172143232992176820e+00 6.98343389632401501110e-01 1.30182296789830420636e+00 6.98480783665044180353e-01 1.30177100303788639835e+00 6.98550195527027240061e-01 1.30181573896143509828e+00 6.98388695428381112151e-01 1.30184133268641644143e+00 6.98180789521170575007e-01 1.30179150504790919207e+00 6.98206811873765431642e-01 1.30149718022609039991e+00 6.98324168174300430323e-01 1.30128046983471334919e+00 6.98443097404318757881e-01 1.30103606309467867419e+00 6.98543450201465465632e-01 1.30079418296096260832e+00 6.98823617179944678313e-01 1.30031213373271414824e+00 6.99407726963942044662e-01 1.29949314278893512942e+00 7.00565318588876717598e-01 1.29780595677007348776e+00 7.03192324785437805623e-01 1.29318261588944616314e+00 7.10908212843389231139e-01 1.26349508706556723503e+00
32 1.00000000000000000000e+00 7.36589493579326015649e-01 1.28909917410650520786e+00 7.06935608748441302041e-01 1.29681430097701144710e+00 7.02343499163823326015e-01 1.29943835729185197536e+00 7.00681285111277141198e-01 1.30060251671045956634e+00 6.99885437483421024574e-01 1.30117620413072421215e+00 6.99444312405945956002e-01 1.30146956115311751567e+00 6.99176897808366115683e-01 1.30161531589451051616e+00 6.99000498878327269914e-01 1.30167955199328200244e+00 6.98878157128804189391e-01 1.30169946638763822655e+00 6.98787655060618351222e-01 1.30168947215467833978e+00 6.98722831210588202211e-01 1.30165760604495317487e+00 6.98662755000806545702e-01 1.30162290104295808035e+00 6.98615473012816345921e-01 1.30157597837906302551e+00 6.98568662901670522913e-01 1.30152588298786930920e+00 6.98554058702798075231e-01 1.30145921271687714516e+00 6.98454795558871688321e-01 1.30150005822986059023e+00 6.98394913591534938213e-01 1.30142468274489297997e+00 6.98425017775424206157e-01 1.30128951605837328565e+00 6.98403093100376071156e-01 1.30125292473982545616e+00 6.98368548259323596028e-01 1.30126693047684249827e+00 6.98348296310792315822e-01 1.30124615000039778323e+00 6.98304398717140228925e-01 1.30127708690048060625e+00 6.98292141578942593405e-01 1.30127938206033366697e+00 6.98284742057340812593e-01 1.30122945494624198126e+00 6.98308773027982665482e-01 1.30112898942332555485e+00 6.98376774004102474080e-01 1.30096309410980048860e+00 6.98528235854530721305e-01 1.30069661886839216258e+00 6.98825011103398563428e-01 1.30025022861211581038e+00 6.99401197930638152123e-01 1.29944316996235231798e+00 7.00566405357971322410e-01 1.29776602872084745322e+00 7.03191789562168656502e-01 1.29315537367974475735e+00 7.10906780938220794752e-01 1.26347726756789957570e+00
33 1.00000000000000000000e+00 7.36595657114638702190e-01 1.28909962775437159088e+00 7.06943933626824394523e-01 1.29681469717492681148e+00 7.02353963293659511180e-01 1.29943852722933250732e+00 7.00693949979045216381e-01 1.30060198145169603201e+00 6.99900162220474464370e-01 1.30117539461173614690e+00 6.99461556896341263290e-01 1.30146812680904000459e+00 6.99195798220205055884e-01 1.30161396101447102147e+00 6.99023528599972632236e-01 1.30167861409292462405e+00 6.98905451320213089161e-01 1.30169690563674578243e+00 6.98820429821350841415e-01 1.30168862853637423704e+00 6.98756310461648988408e-01 1.30166527116516483886e+00 6.98705823559386263177e-01 1.30163378571201748812e+00 6.98664436329294535888e-01 1.30159823571432053946e+00 6.98629086404376598018e-01 1.30156141404103431469e+00 6.98595864621737838718e-01 1.30152342134125964535e+00 6.98563293186828748738e-01 1.30148586339210448060e+00 6.98529407408561509030e-01 1.30144870748789998061e+00 6.98495001534539139421e-01 1.30141643870272183392e+00 6.98457840823226927540e-01 1.30137264516758199839e+00 6.98420826294217644836e-01 1.30132027981339670752e+00 6.98386776523528984839e-01 1.30127163590794348025e+00 6.98345198762503005518e-01 1.30122863796786525370e+00 6.98320253697622628231e-01 1.30116060429973612322e+00 6.98306716035076324722e-01 1.30108045579462339170e+00 6.98320927467741769945e-01 1.30096533014617121715e+00 6.98384168455847720303e-01 1.30079330741715804010e+00 6.98530517162087916105e-01 1.30052945738906955420e+00 6.98823110435808025898e-01 1.30009374027651558592e+00 6.99397056062172839397e-01 1.29930140945938510377e+00 7.00561544311310679944e-01 1.29764229400499742084e+00 7.03185347937498983484e-01 1.29305345727037113157e+00 7.10900255674603243072e-01 1.26340294897437588340e+00
34 1.00000000000000000000e+00 7.36605927529491721906e-01 1.28910046754324292273e+00 7.06958060876984095700e-01 1.29681549866001821769e+00 7.02371283175310723301e-01 1.29943910585436794847e+00 7.00714053133255188044e-01 1.30060254586928647491e+00 6.99923012805129807212e-01 1.30117570015529038230e+00 6.99486802917312133765e-01 1.30146824763584656459e+00 6.99223422290928819933e-01 1.30161374379470551332e+00 6.99052128125931537816e-01 1.30167775153890818984e+00 6.98934331512501394457e-01 1.30169563226227369412e+00 6.98848937715443208063e-01 1.30168662072733054558e+00 6.98783420601667759620e-01 1.30166204669473439814e+00 6.98730047419357624960e-01 1.30162935550454994527e+00 6.98683878039991768105e-01 1.30159230022460503662e+00 6.98641956044094403211e-01 1.30155367626455764629e+00 6.98601992000485227940e-01 1.30151442452821597406e+00 6.98563120138170234874e-01 1.30147473202118679758e+00 6.98525366918917978154e-01 1.30143507104125122353e+00 6.98486576831944261379e-01 1.30139608457859901058e+00 6.98446339716424891009e-01 1.30135707629046337708e+00 6.98407168316888538051e-01 1.30131515905302230784e+00 6.98369970301108700106e-01 1.30126833249780005097e+00 6.98337518880437824187e-01 1.30121490848803555984e+00 6.98313491729828039745e-01 1.30114955159914891247e+00 6.98304446891818475507e-01 1.30106462820015389426e+00 6.98322176456729781791e-01 1.30094783846460670951e+00 6.98386538697962411248e-01 1.30077757166570529002e+00 6.98532136156957306206e-01 1.30051424457581221716e+00 6.98824643239896681202e-01 1.30007840040860811470e+00 6.99397799752749516067e-01 1.29928754120376610537e+00 7.00561028016005948871e-01 1.29763059337605435317e+00 7.03184583002753105241e-01 1.29304379988709250426e+00 7.10899629052794579387e-01 1.26339556110123729660e+00
35 1.00000000000000000000e+00 7.36607525550438624329e-01 1.28910063458621948485e+00 7.06960143094012449794e-01 1.29681564182031161536e+00 7.02373751457175732327e-01 1.29943916383084956401e+00 7.00716958820427726629e-01 1.30060224087586129293e+00 6.99926073302307383273e-01 1.30117527887488781957e+00 6.99489935152491471015e-01 1.30146762296391371727e+00 6.99226147526896490980e-01 1.30161305954445460920e+00 6.99055232760840028483e-01 1.30167724868095868729e+00 6.98937753303771058810e-01 1.30169500818019123756e+00 6.98852324803827307242e-01 1.30168597145823583539e+00 6.98786569476724905847e-01 1.30166157131951853998e+00 6.98732899845300403641e-01 1.30162866742583349655e+00 6.98686563948119232492e-01 1.30159142435017849415e+00 6.98644460905924247207e-01 1.30155231491392342491e+00 6.98604517098188382285e-01 1.30151276683155847635e+00 6.98565438193968102354e-01 1.30147340839103198284e+00 6.98526412290236264901e-01 1.30143435830250298046e+00 6.98487075563761550256e-01 1.30139525084618790096e+00 6.98447569728185557736e-01 1.30135533532542568835e+00 6.98408493797903706657e-01 1.30131327216908698752e+00 6.98371284381376522532e-01 1.30126700184212018563e+00 6.98338429609392852271e-01 1.30121342237823811594e+00 6.98313984141664567673e-01 1.30114770630563292286e+00 6.98304878246501892214e-01 1.30106232486710182705e+00 6.98322559568556822107e-01 1.30094488533829011345e+00 6.98386672284785681164e-01 1.30077394195855911008e+00 6.98532180115602030490e-01 1.30051033039793462187e+00 6.98824573737551690833e-01 1.30007433410454642519e+00 6.99397639321624575715e-01 1.29928353887842384928e+00 7.00560794601796099634e-01 1.29762667795696207129e+00 7.03184383668292389835e-01 1.29304021553950043710e+00 7.10899416201245748503e-01 1.26339273724197198590e+00
