# tag norm j_0
21.800000 1.00000000000002264855e+00 -5.41163690713837505775e-02
21.800000 1.00000000000002264855e+00 7.89012943164361588155e-03
21.800000 1.00000000000002264855e+00 2.81013129647533846378e-02
21.800000 1.00000000000002264855e+00 7.67385462393953832194e-02
21.800000 1.00000000000002264855e+00 -2.15853191476745143174e-01
21.800000 1.00000000000002264855e+00 7.76758225081407849277e-02
21.800000 1.00000000000002264855e+00 2.69499428183770269041e-02
21.800000 1.00000000000002264855e+00 7.37037823827762540729e-03
21.800000 1.00000000000002264855e+00 -5.32183495972163508880e-02
