# tag norm BO
1 1.00000000000000044409e+00 -2.79892600853790321502e-02
2 1.00000000000000066613e+00 4.15715452564945769920e-03
3 9.99999999999993449684e-01 -8.28645972892397622567e-03
4 9.99999999999998556710e-01 -1.14424370888566735022e-02
5 1.00000000000000266454e+00 -9.69275613997976721523e-04
6 9.99999999999994448885e-01 -8.28348715755417540352e-03
7 1.00000000000000044409e+00 -9.49421233747265065628e-03
8 9.99999999999999444888e-01 -1.88743477818343620943e-03
9 9.99999999999999222844e-01 3.14166698245567452968e-03
10 9.99999999999998667732e-01 7.61784911329409231140e-03
11 1.00000000000000044409e+00 1.22891047472233495147e-02
12 9.99999999999995892175e-01 -1.97237736652184367583e-03
13 1.00000000000000066613e+00 6.15138295759405998031e-03
14 1.00000000000000555112e+00 8.51223810109129862267e-03
15 1.00000000000000088818e+00 9.37671690669154671294e-03
16 1.00000000000000799361e+00 8.60044174939050484752e-03
17 1.00000000000000222045e+00 8.71607143329422053013e-03
18 1.00000000000000133227e+00 1.31877599380608202806e-03
19 9.99999999999997335465e-01 -6.42920540148243270517e-03
20 9.99999999999998001599e-01 -1.99848872687235275952e-04
21 9.99999999999998001599e-01 5.58001964140435006978e-03
22 1.00000000000000310862e+00 7.88061191346352447884e-03
23 9.99999999999994670929e-01 9.44024037681431144042e-03
24 1.00000000000000732747e+00 1.01773070637566336732e-02
25 9.99999999999995892175e-01 1.06698490567097206000e-02
26 9.99999999999995003996e-01 3.99264390035184314059e-03
27 9.99999999999998112621e-01 -7.92424422348745986777e-03
28 9.99999999999994892974e-01 -3.31811912070600250127e-04
29 1.00000000000000222045e+00 7.60900689502065109837e-03
30 1.00000000000000133227e+00 1.06629657514952722042e-02
31 1.00000000000000044409e+00 1.28343604476705841488e-02
32 9.99999999999999111822e-01 1.46947039153032706083e-02
33 9.99999999999996447286e-01 1.28914109905584120530e-02
34 1.00000000000000266454e+00 8.43458230605600989271e-03
35 9.99999999999997668532e-01 -1.15853842358375636740e-02
36 1.00000000000000710543e+00 -1.12604298650720371922e-02
37 1.00000000000000066613e+00 6.07466921380684851672e-03
38 1.00000000000001021405e+00 4.62252579213066130959e-02
39 9.99999999999998778755e-01 5.90740991593603978482e-02
40 9.99999999999997668532e-01 5.31552775964424170652e-02
41 1.00000000000000710543e+00 4.07874301806953609706e-02
42 1.00000000000000399680e+00 2.78977887764313148278e-04
43 9.99999999999997002398e-01 -1.83110441662906464622e-02
44 9.99999999999997890576e-01 -2.35582758535033236214e-02
45 9.99999999999996225242e-01 -1.01399684739280106227e-02
46 1.00000000000000666134e+00 2.66910004203683368096e-02
47 1.00000000000000177636e+00 6.37745421741927887016e-02
48 1.00000000000000133227e+00 1.18205578800297736453e-01
49 9.99999999999998001599e-01 1.51065559222271605933e-01
50 9.99999999999997113420e-01 1.70967679191805888017e-01
51 9.99999999999996669331e-01 1.72727256556890473860e-01
52 1.00000000000000288658e+00 1.70310562170358281708e-01
53 9.99999999999998112621e-01 1.67966403995047502962e-01
54 9.99999999999989674926e-01 1.67011305465236487011e-01
55 9.99999999999997557509e-01 1.66846764998819813153e-01
56 1.00000000000000355271e+00 1.66797601376513698890e-01
