# tag norm j_0
12.900000 1.00000000000001310063e+00 -1.50072814421714662014e-01
12.900000 1.00000000000001310063e+00 -3.75310007725680183643e-02
12.900000 1.00000000000001310063e+00 -1.31262976567168739017e-02
12.900000 1.00000000000001310063e+00 -2.20745743206097570777e-02
12.900000 1.00000000000001310063e+00 -4.08093417041331327222e-02
12.900000 1.00000000000001310063e+00 -2.23961873674126711597e-02
12.900000 1.00000000000001310063e+00 -1.39397633119638670457e-02
12.900000 1.00000000000001310063e+00 -3.69829281010950264297e-02
12.900000 1.00000000000001310063e+00 -1.48943839285261808714e-01
