# tag norm j_0
21.700000 1.00000000000002309264e+00 -3.18124329505727609924e-02
21.700000 1.00000000000002309264e+00 -3.59061695934235515504e-03
21.700000 1.00000000000002309264e+00 2.33836566142307869520e-02
21.700000 1.00000000000002309264e+00 5.66651865910139454496e-02
21.700000 1.00000000000002309264e+00 -1.97974716744778428401e-01
21.700000 1.00000000000002309264e+00 5.74403311446056025202e-02
21.700000 1.00000000000002309264e+00 2.22138189436228324081e-02
21.700000 1.00000000000002309264e+00 -3.90829108101633029837e-03
21.700000 1.00000000000002309264e+00 -3.10466732794490371528e-02
