# tag norm j_0
2.000000 1.00000000000000266454e+00 -3.35571983813137472295e-05
2.000000 1.00000000000000266454e+00 3.08460048147814631112e-06
2.000000 1.00000000000000266454e+00 -1.99658494151889253179e-05
2.000000 1.00000000000000266454e+00 -2.22621211196487424420e-06
2.000000 1.00000000000000266454e+00 -2.74349487761372536586e-05
2.000000 1.00000000000000266454e+00 -1.73776743067202527027e-06
2.000000 1.00000000000000266454e+00 -1.84162055049955021742e-05
2.000000 1.00000000000000266454e+00 3.20627079682971541719e-06
2.000000 1.00000000000000266454e+00 -3.21814161942813656953e-05
