# tag norm n_hub[0] n_hub[1] n_hub[2] n_hub[3] n_hub[4] n_hub[5] n_hub[6] n_hub[7] n_hub[8] n_hub[9]
0.100000 1.00000000000000199840e+00 1.84024764309738651791e-02 1.96388775575799878759e+00 3.54446917423197754848e-02 1.96453113961377368035e+00 3.54679123899404799558e-02 1.96453208877197815774e+00 3.54688614365013601959e-02 1.96455530972446457127e+00 3.61122412500776632238e-02 1.98159752288196955305e+00
0.200000 1.00000000000000022204e+00 1.84024695757487727343e-02 1.96388768178715178436e+00 3.54448089311205777330e-02 1.96453098157803229817e+00 3.54680715140173324906e-02 1.96453192865371595310e+00 3.54690136853458362620e-02 1.96455519457378535719e+00 3.61123174941744354283e-02 1.98159753220690459941e+00
0.300000 9.99999999999999666933e-01 1.84024928266888661288e-02 1.96388757609388253655e+00 3.54449509694013953354e-02 1.96453075271325894313e+00 3.54682990786340246459e-02 1.96453169961651097353e+00 3.54692423069595391683e-02 1.96455505370767880002e+00 3.61124215207058729682e-02 1.98159751116628068957e+00
0.400000 1.00000000000000177636e+00 1.84026067564085279993e-02 1.96388727451991274009e+00 3.54454216373369865312e-02 1.96453015980128520290e+00 3.54688854716462415029e-02 1.96453111230305443868e+00 3.54698436951698878317e-02 1.96455457236656316766e+00 3.61127327884619500620e-02 1.98159739066017359654e+00
0.500000 1.00000000000000133227e+00 1.84026252278903755533e-02 1.96388735846989104239e+00 3.54452812487615967485e-02 1.96453034663603109955e+00 3.54686891423293126913e-02 1.96453130970176981229e+00 3.54696622238765621460e-02 1.96455471075157106497e+00 3.61126462272997258984e-02 1.98159737037055450060e+00
0.600000 1.00000000000000288658e+00 1.84025126018860889221e-02 1.96388780309582111627e+00 3.54445991459806514223e-02 1.96453124950227331347e+00 3.54677843966328329439e-02 1.96453221670588806802e+00 3.54687546371601700179e-02 1.96455539689042857354e+00 3.61121981222561616587e-02 1.98159748490163956092e+00
0.700000 1.00000000000000399680e+00 1.84024134814383295844e-02 1.96388817211118626993e+00 3.54440543379146225100e-02 1.96453198790330696433e+00 3.54670639611486329668e-02 1.96453293815672402900e+00 3.54680040961846618219e-02 1.96455595546134520468e+00 3.61118162041592707934e-02 1.98159759428661486069e+00
0.800000 1.00000000000000510703e+00 1.84025222339450240938e-02 1.96388805024008150646e+00 3.54442639550134677706e-02 1.96453171885082000792e+00 3.54673561299627196353e-02 1.96453264553738993214e+00 3.54682661261375778428e-02 1.96455574781216024682e+00 3.61119405544440968958e-02 1.98159748856001249884e+00
0.900000 1.00000000000000599520e+00 1.84028658597080174708e-02 1.96388748297364501560e+00 3.54451064680666450002e-02 1.96453056622713995161e+00 3.54685184113201906753e-02 1.96453147930260985099e+00 3.54694290597929381970e-02 1.96455489582232400991e+00 3.61125154683602928030e-02 1.98159714040703116567e+00
1.000000 1.00000000000000444089e+00 1.84032329839457636789e-02 1.96388684269450419784e+00 3.54460691678914613378e-02 1.96452930209935283656e+00 3.54697475095216985252e-02 1.96453024893905392467e+00 3.54707091128994844720e-02 1.96455391620176200718e+00 3.61131715504715358755e-02 1.98159675974056370684e+00
1.100000 1.00000000000000377476e+00 1.84032230058883555790e-02 1.96388700378659630807e+00 3.54457763398853403780e-02 1.96452967408171885744e+00 3.54693309202225789956e-02 1.96453066640718265745e+00 3.54703453914154004378e-02 1.96455420682319403802e+00 3.61130088754681999319e-02 1.98159676436840359592e+00
1.200000 1.00000000000000577316e+00 1.84027385696625203626e-02 1.96388792542860457502e+00 3.54443674789939669467e-02 1.96453153114644951671e+00 3.54674549689927703922e-02 1.96453254813343725083e+00 3.54684733987827918722e-02 1.96455563197970040079e+00 3.61120758215787360235e-02 1.98159725307376488601e+00
1.300000 1.00000000000000444089e+00 1.84021456927904308865e-02 1.96388859469304066785e+00 3.54434093554265791659e-02 1.96453284185035981224e+00 3.54662033111297694821e-02 1.96453380186837045507e+00 3.54671444184280343359e-02 1.96455661143964221971e+00 3.61113893585517792273e-02 1.98159785801227483759e+00
1.400000 1.00000000000000399680e+00 1.84018080853794140095e-02 1.96388837125373649783e+00 3.54438403861781006765e-02 1.96453230446235393991e+00 3.54668144678394400837e-02 1.96453319231973666525e+00 3.54676721787969759236e-02 1.96455618441184109990e+00 3.61116151284234243590e-02 1.98159819730570951890e+00
1.500000 1.00000000000000399680e+00 1.84018407318350465940e-02 1.96388734310479851075e+00 3.54454094078560030812e-02 1.96453020204267958526e+00 3.54689497217810581486e-02 1.96453104993949168033e+00 3.54697980172657273412e-02 1.96455459260535425514e+00 3.61126606445131420609e-02 1.98159815378447534684e+00
1.600000 1.00000000000000532907e+00 1.84019033189808146889e-02 1.96388647022151574539e+00 3.54466953799503353695e-02 1.96452847932617480353e+00 3.54705841706848962192e-02 1.96452941322972973737e+00 3.54715437944527547942e-02 1.96455328251391203587e+00 3.61135528161885543952e-02 1.98159807522840947236e+00
1.700000 1.00000000000000821565e+00 1.84016094331199003831e-02 1.96388677843108783172e+00 3.54461219260171558898e-02 1.96452918632211681604e+00 3.54697667173300215659e-02 1.96453023040596663762e+00 3.54708435399481228356e-02 1.96455385279285899003e+00 3.61132419709638483041e-02 1.98159836846058001747e+00
1.800000 1.00000000000001088019e+00 1.84009951796393206314e-02 1.96388816101328256281e+00 3.54439944848041130210e-02 1.96453197042677363271e+00 3.54669385762272082463e-02 1.96453306362688628894e+00 3.54680308832537594110e-02 1.96455600722655421286e+00 3.61118360879950292541e-02 1.98159900249459508537e+00
1.900000 1.00000000000000754952e+00 1.84007991933768585979e-02 1.96388900885663320039e+00 3.54428004288379061570e-02 1.96453362427197864015e+00 3.54654026335814234749e-02 1.96453459906783289846e+00 3.54663475195239677462e-02 1.96455722567092982977e+00 3.61109642979890455017e-02 1.98159922805931132395e+00
2.000000 1.00000000000000732747e+00 1.84015796158881091149e-02 1.96388858365403273787e+00 3.54435708696486800884e-02 1.96453268018320859056e+00 3.54664937882382749756e-02 1.96453350534830661900e+00 3.54672799190354007259e-02 1.96455645423490299351e+00 3.61113878715723854440e-02 1.98159846451514742860e+00
2.100000 1.00000000000000643929e+00 1.84034326813806610457e-02 1.96388707548277774428e+00 3.54458268679038804305e-02 1.96452969554443823696e+00 3.54695301953200786693e-02 1.96453045815341886815e+00 3.54702953875646043169e-02 1.96455416025658946566e+00 3.61129193399057774050e-02 1.98159660609070797932e+00
2.200000 1.00000000000000865974e+00 1.84055968949049346406e-02 1.96388601658953332318e+00 3.54472652212079117340e-02 1.96452773629201482564e+00 3.54713318567612886922e-02 1.96452865164107626228e+00 3.54722869049966457733e-02 1.96455269033583812543e+00 3.61139991198388479732e-02 1.98159442514382777567e+00
2.300000 1.00000000000000954792e+00 1.84071934141793354389e-02 1.96388648764903361865e+00 3.54463058812329312453e-02 1.96452891236081894633e+00 3.54699591466621222402e-02 1.96453002855958946959e+00 3.54711152923756697919e-02 1.96455365156040517860e+00 3.61135277590558245731e-02 1.98159281837666179094e+00
2.400000 1.00000000000001176836e+00 1.84076976293039359933e-02 1.96388825908216402283e+00 3.54435422603633157324e-02 1.96453252461661209693e+00 3.54662841782489648979e-02 1.96453371457336212202e+00 3.54674698440650137954e-02 1.96455646040406528563e+00 3.61117300225417409143e-02 1.98159231738928887090e+00
2.500000 1.00000000000000799361e+00 1.84074396082954706844e-02 1.96388920035871206160e+00 3.54422972485071985371e-02 1.96453430307805643196e+00 3.54647097237855077334e-02 1.96453529888637823397e+00 3.54656601223949929924e-02 1.96455774503443958423e+00 3.61107718720293166537e-02 1.98159257406737632223e+00
2.600000 1.00000000000000666134e+00 1.84065517353560366420e-02 1.96388858087312878631e+00 3.54435190804342839521e-02 1.96453282994721112331e+00 3.54664388392160884189e-02 1.96453357548355023177e+00 3.54671373708508597122e-02 1.96455652830547267129e+00 3.61114025211293904194e-02 1.98159343584364178170e+00
2.700000 1.00000000000000843769e+00 1.84048726729991209139e-02 1.96388678786561765577e+00 3.54463539620959930398e-02 1.96452910588803009162e+00 3.54702513308414596471e-02 1.96452976261122547186e+00 3.54709145332175179721e-02 1.96455365251314861830e+00 3.61132404430799733297e-02 1.98159505817971570707e+00
2.800000 1.00000000000000599520e+00 1.84016312666958163635e-02 1.96388581607704715282e+00 3.54477572973497662145e-02 1.96452713903321019018e+00 3.54719838638901385774e-02 1.96452803135657938505e+00 3.54729351448201668529e-02 1.96455221999945650602e+00 3.61142446524879631720e-02 1.98159824130848361001e+00
2.900000 1.00000000000000355271e+00 1.83965523886250870156e-02 1.96388670324424330360e+00 3.54462851469101100643e-02 1.96452891194910028716e+00 3.54699103763037038028e-02 1.96453011696381873996e+00 3.54711632537946242039e-02 1.96455370565944908989e+00 3.61133581185708318895e-02 1.98160329289920134066e+00
3.000000 1.00000000000000444089e+00 1.83903678432780735841e-02 1.96388894563008453709e+00 3.54429851083143745982e-02 1.96453318059826287367e+00 3.54655513987739492987e-02 1.96453448527761675990e+00 3.54668441131299472246e-02 1.96455706197302704119e+00 3.61110726366901044204e-02 1.98160950542080405157e+00
3.100000 1.00000000000000821565e+00 1.83852566489476690337e-02 1.96388996718515373985e+00 3.54418369803403063290e-02 1.96453484726965799112e+00 3.54641688050409339961e-02 1.96453586586440165362e+00 3.54651171501057724256e-02 1.96455824277959667512e+00 3.61100138267337611442e-02 1.98161468349005920331e+00
3.200000 1.00000000000000865974e+00 1.83833324073428144851e-02 1.96388904636395023040e+00 3.54436009039512528451e-02 1.96453269250615236707e+00 3.54666700420204553112e-02 1.96453333781851302575e+00 3.54672602858013344407e-02 1.96455644420803121619e+00 3.61109237275702502079e-02 1.98161669173665644372e+00
3.300000 1.00000000000001643130e+00 1.83860681760012398267e-02 1.96388685086537373436e+00 3.54468709886321120539e-02 1.96452838705740884251e+00 3.54710467252898689616e-02 1.96452891998386802719e+00 3.54715972555954689449e-02 1.96455308278940288247e+00 3.61131398685288484973e-02 1.98161403628991017456e+00
3.400000 1.00000000000001665335e+00 1.83934792972722596649e-02 1.96388568485790737661e+00 3.54480772630906965093e-02 1.96452660927479727526e+00 3.54724453466274888824e-02 1.96452748074194327721e+00 3.54734055186762958778e-02 1.96455180086866776357e+00 3.61143048955512094289e-02 1.98160671193549320357e+00
3.500000 1.00000000000001643130e+00 1.84048217874774114322e-02 1.96388653678578628536e+00 3.54460147130945049665e-02 1.96452908826254812880e+00 3.54695128967657050123e-02 1.96453040346869567401e+00 3.54708818320260896306e-02 1.96455386436442047682e+00 3.61134141577315950777e-02 1.98159546173147149695e+00
3.600000 1.00000000000001931788e+00 1.84188540240276983628e-02 1.96388857068725886101e+00 3.54423834369788567922e-02 1.96453381975773067047e+00 3.54646648469213385257e-02 1.96453525459666900055e+00 3.54660727317962429228e-02 1.96455755548472854599e+00 3.61113106007168380152e-02 1.98158151383316449845e+00
3.700000 1.00000000000001643130e+00 1.84341440366504634440e-02 1.96388902505529472364e+00 3.54415926607640000001e-02 1.96453516583800502637e+00 3.54637346835167191483e-02 1.96453620038148257798e+00 3.54646697522050871609e-02 1.96455839731548431715e+00 3.61108275861625957481e-02 1.98156624269043790676e+00
3.800000 1.00000000000001487699e+00 1.84479034764436951310e-02 1.96388734661157338124e+00 3.54441358796182548474e-02 1.96453221519188381272e+00 3.54671972264533619246e-02 1.96453274716477421791e+00 3.54676686124733159255e-02 1.96455584415818651500e+00 3.61125493825226601130e-02 1.98155239229602586626e+00
3.900000 1.00000000000001509903e+00 1.84560857518335542926e-02 1.96388476924581167893e+00 3.54478641484288689578e-02 1.96452748288586875880e+00 3.54720786542428515031e-02 1.96452789016240791931e+00 3.54725206094204728591e-02 1.96455208354291466222e+00 3.61152362314022049028e-02 1.98154398876768000903e+00
4.000000 1.00000000000001376677e+00 1.84539364158410809647e-02 1.96388392051870352972e+00 3.54488568734279696493e-02 1.96452605594494444929e+00 3.54730945891343490972e-02 1.96452692581052046350e+00 3.54740772423358316501e-02 1.96455111177295949076e+00 3.61161892292745159705e-02 1.98154583160286867916e+00
4.100000 1.00000000000001243450e+00 1.84380491432072288194e-02 1.96388585601004317382e+00 3.54460882771470559005e-02 1.96452939419671390731e+00 3.54692864741614211077e-02 1.96453083502229475243e+00 3.54707826715139618035e-02 1.96455399873387204224e+00 3.61143175548041192591e-02 1.98156139191622648887e+00
4.200000 1.00000000000001509903e+00 1.84081994497793700882e-02 1.96388925670518421640e+00 3.54419879952200950202e-02 1.96453461821434549606e+00 3.54640380719414283206e-02 1.96453618152154030341e+00 3.54655553347119484320e-02 1.96455825411520867974e+00 3.61109308536225540043e-02 1.98159097773844372625e+00
4.300000 1.00000000000002042810e+00 1.83683440327958233396e-02 1.96389102273439619673e+00 3.54412361476359669132e-02 1.96453575915614031544e+00 3.54634942520191884241e-02 1.96453678389970054496e+00 3.54644047611534021791e-02 1.96455909307484732906e+00 3.61091777260428431484e-02 1.98163068421530730312e+00
4.400000 1.00000000000002109424e+00 1.83256275118273519176e-02 1.96389015108881315186e+00 3.54443238730962201233e-02 1.96453198920937799343e+00 3.54678683690248866545e-02 1.96453238906022775723e+00 3.54682056442486431935e-02 1.96455596056433479113e+00 3.61100643347422312068e-02 1.98167342034429805331e+00
4.500000 1.00000000000001820766e+00 1.82890437068877094451e-02 1.96388785728420689480e+00 3.54485379212251816572e-02 1.96452651914355991281e+00 3.54733665518587801269e-02 1.96452679942991959017e+00 3.54736949025962200466e-02 1.96455160563640252036e+00 3.61123503515998825475e-02 1.98171022507173910654e+00
4.600000 1.00000000000002442491e+00 1.82678888148021731364e-02 1.96388655039270365599e+00 3.54498795274524533538e-02 1.96452455601886177838e+00 3.54745883981751955472e-02 1.96452544357971792266e+00 3.54755882989764848023e-02 1.96455011271515345150e+00 3.61135615670259355059e-02 1.98173183068709723997e+00
4.700000 1.00000000000002398082e+00 1.82703809698524129168e-02 1.96388760000109807713e+00 3.54470543137614391149e-02 1.96452779998308124654e+00 3.54705247428608108629e-02 1.96452936299101765805e+00 3.54721446220294459040e-02 1.96455281815838178616e+00 3.61123256753959620546e-02 1.98172998854250592693e+00
4.800000 1.00000000000002620126e+00 1.83024670350461458879e-02 1.96388979857696321929e+00 3.54426461531986147779e-02 1.96453317818700012864e+00 3.54648983980802023908e-02 1.96453483814127882745e+00 3.54665022042734423557e-02 1.96455711735485705205e+00 3.61098881454705936123e-02 1.98169866580377895815e+00
4.900000 1.00000000000002309264e+00 1.83657197508739142289e-02 1.96389043057837175965e+00 3.54410500136791636883e-02 1.96453511141521586225e+00 3.54634915154265831227e-02 1.96453608665941259481e+00 3.54643630478855970134e-02 1.96455856124094863091e+00 3.61090596643629177520e-02 1.98163612611381334538e+00
5.000000 1.00000000000002042810e+00 1.84550951252302510019e-02 1.96388794281971756917e+00 3.54433641829828630088e-02 1.96453228681309366443e+00 3.54668997655345208386e-02 1.96453254876243788019e+00 3.54671030471495896119e-02 1.96455609007391096554e+00 3.61114394114309955608e-02 1.98154722999854393528e+00
5.100000 1.00000000000002198242e+00 1.85574285186974954898e-02 1.96388282166156624697e+00 3.54477640307281141596e-02 1.96452711828536075167e+00 3.54720857786220422625e-02 1.96452730936025110609e+00 3.54723326149589957001e-02 1.96455161454218485417e+00 3.61165609733633957701e-02 1.98144496423430038767e+00
5.200000 1.00000000000002309264e+00 1.86524484936727852347e-02 1.96387655726070153861e+00 3.54518403316583380347e-02 1.96452309825662019271e+00 3.54754371256324335659e-02 1.96452406066991436262e+00 3.54764801352731515283e-02 1.96454767492450188549e+00 3.61229148881440087493e-02 1.98134948791388776357e+00
5.300000 1.00000000000002442491e+00 1.87155431357887633292e-02 1.96387168836638115188e+00 3.54539242773330987024e-02 1.96452209594069149290e+00 3.54759187928413918800e-02 1.96452385587908540110e+00 3.54776794242448872962e-02 1.96454591375097176176e+00 3.61280030847897989932e-02 1.98128537734786003277e+00
5.400000 1.00000000000002309264e+00 1.87236623159179882414e-02 1.96387017416222398047e+00 3.54542028652420834756e-02 1.96452319158452759496e+00 3.54751544243736491313e-02 1.96452502231761427787e+00 3.54768726769656220221e-02 1.96454604459655879367e+00 3.61299021345637266789e-02 1.98127577292200118819e+00
5.500000 1.00000000000002686740e+00 1.86613482221072157774e-02 1.96387392594500487242e+00 3.54526287011850405051e-02 1.96452522529045836563e+00 3.54743837231287842404e-02 1.96452620481846285116e+00 3.54752819664189075755e-02 1.96454794261849707837e+00 3.61266984283564879243e-02 1.98133636028641002547e+00
5.600000 1.00000000000002997602e+00 1.85271789439186880533e-02 1.96388303290297083770e+00 3.54484515821443593730e-02 1.96452878006119990850e+00 3.54720472690794597082e-02 1.96452888678973169867e+00 3.54721963487649172286e-02 1.96455236014558565216e+00 3.61181285853942532493e-02 1.98146893737122242740e+00
5.700000 1.00000000000003219647e+00 1.83371091916088857499e-02 1.96389411987922990477e+00 3.54428635858071577891e-02 1.96453331594165003793e+00 3.54678020493864043505e-02 1.96453333714843791924e+00 3.54680066747087366363e-02 1.96455813325515760148e+00 3.61073206293031148673e-02 1.98165799164473388494e+00
5.800000 1.00000000000003352874e+00 1.81244125873998400411e-02 1.96389885212688897198e+00 3.54421217433153121212e-02 1.96453349656310405358e+00 3.54667611059807652563e-02 1.96453444112657948928e+00 3.54677902645509288138e-02 1.96455910020417845452e+00 3.61023982602316564905e-02 1.98187062601776697868e+00
5.900000 1.00000000000003130829e+00 1.79326294413486055090e-02 1.96389072280312571017e+00 3.54520275932949033293e-02 1.96452363030214627315e+00 3.54755325493823284178e-02 1.96452552872195695954e+00 3.54772551977153988156e-02 1.96454928038324605488e+00 3.61099422933954736226e-02 1.98206345071437550764e+00
6.000000 1.00000000000003086420e+00 1.78061746260271026865e-02 1.96387059842644351448e+00 3.54724753558139996312e-02 1.96450310746281564533e+00 3.54956021618446637689e-02 1.96450506434695260083e+00 3.54971317508667796869e-02 1.96452854687957523261e+00 3.61293794026354975202e-02 1.98219191958702412037e+00
6.100000 1.00000000000002797762e+00 1.77795991217377206961e-02 1.96385165621389790047e+00 3.54910993719087033971e-02 1.96448351011848743042e+00 3.55155186308574524756e-02 1.96448443853761367528e+00 3.55161478786553547193e-02 1.96450901467041405546e+00 3.61478759701186411202e-02 1.98222113948631584179e+00
6.200000 1.00000000000002620126e+00 1.78724300137347927309e-02 1.96385101408109075116e+00 3.54901637423413393591e-02 1.96448285106653575127e+00 3.55163071464309476610e-02 1.96448273705361509123e+00 3.55163283384095640471e-02 1.96450864568617156181e+00 3.61483412747779786489e-02 1.98213118159690893094e+00
6.300000 1.00000000000002176037e+00 1.80871183275121034939e-02 1.96387530959129130714e+00 3.54619083413210273159e-02 1.96450999693662464729e+00 3.54883446400354393702e-02 1.96450980227529758970e+00 3.54887723567278295933e-02 1.96453569746189371514e+00 3.61238257330422293800e-02 1.98191922433625911104e+00
6.400000 1.00000000000002065015e+00 1.84092459633288831056e-02 1.96390649779452930446e+00 3.54243754121582946071e-02 1.96454799058538398526e+00 3.54487309511871823142e-02 1.96454888387842263597e+00 3.54501898129246928448e-02 1.96457286211375969920e+00 3.60919394593788994685e-02 1.98159928402897711486e+00
6.500000 1.00000000000002020606e+00 1.88027689452678198334e-02 1.96391025257660101211e+00 3.54128290143067292473e-02 1.96456166547868305017e+00 3.54338744184223147782e-02 1.96456377423697969853e+00 3.54358801049399207983e-02 1.96458506881087613394e+00 3.60870236225718024614e-02 1.98120686279134305963e+00
6.600000 1.00000000000002176037e+00 1.92057086378630316459e-02 1.96385962241310751963e+00 3.54559584736968066987e-02 1.96452108550569692902e+00 3.54747806909146423671e-02 1.96452346607507721821e+00 3.54761493185231924219e-02 1.96454325429195875152e+00 3.61367173384018539051e-02 1.98080325725475359100e+00
6.700000 1.00000000000002042810e+00 1.95294188127884543738e-02 1.96376707649932136235e+00 3.55425761800135242563e-02 1.96443592622125762226e+00 3.55618065007887035334e-02 1.96443735580103107097e+00 3.55619379095891835485e-02 1.96445770981386114151e+00 3.62296389278285863034e-02 1.98047655333348959772e+00
6.800000 1.00000000000002242651e+00 1.96730667318255197928e-02 1.96368867168383154365e+00 3.56176663927360165340e-02 1.96436077883649540254e+00 3.56392388842260224302e-02 1.96436092655804928064e+00 3.56388164278640534599e-02 1.96438295248069416665e+00 3.63103285588319488197e-02 1.98032755344541078202e+00
6.900000 1.00000000000002486900e+00 1.95534649429996224002e-02 1.96369186953011443109e+00 3.56155842624533355845e-02 1.96436230091884622695e+00 3.56392335006791294294e-02 1.96436194325607260680e+00 3.56397045876402501774e-02 1.96438482894541266432e+00 3.63107282178101176129e-02 1.98044034183796013870e+00
7.000000 1.00000000000002975398e+00 1.91463068145218268112e-02 1.96379674016206240417e+00 3.55192572308011891846e-02 1.96445883814474941964e+00 3.55430575959067782121e-02 1.96445919344249420035e+00 3.55451824647227271337e-02 1.96448140341835464362e+00 3.62089501590559872946e-02 1.98084107056730984731e+00
7.100000 1.00000000000003086420e+00 1.85157848205813151121e-02 1.96394424943531009653e+00 3.53883893307476715684e-02 1.96459106264994409763e+00 3.54106795649419964223e-02 1.96459265822661888201e+00 3.54136093485573205664e-02 1.96461368612550102419e+00 3.60620800516065903585e-02 1.98146780044617742966e+00
7.200000 1.00000000000002686740e+00 1.78101971978447404243e-02 1.96401822394893788015e+00 3.53351680958886929518e-02 1.96464534848893812580e+00 3.53565418180708315732e-02 1.96464757314336457839e+00 3.53583000297933644496e-02 1.96466928946517560561e+00 3.59856083268773122019e-02 1.98217374948511393384e+00
7.300000 1.00000000000002819966e+00 1.72069210043015105582e-02 1.96392926926324773440e+00 3.54396669989941320855e-02 1.96453985288702837053e+00 3.54624668780558691128e-02 1.96454165466371066806e+00 3.54618132991076848159e-02 1.96456664786761092678e+00 3.60704150365618383955e-02 1.98278129210138920335e+00
7.400000 1.00000000000003064216e+00 1.68345859481802938296e-02 1.96369982373503071393e+00 3.56709257015025635318e-02 1.96430467297314037545e+00 3.56973936750745457491e-02 1.96430558419517686808e+00 3.56952795058284103047e-02 1.96433492957922006816e+00 3.62969708868823709436e-02 1.98315983379996341185e+00
7.500000 1.00000000000003463896e+00 1.67291831011673851337e-02 1.96348053372515018999e+00 3.58780602496216391439e-02 1.96409165952629760632e+00 3.59085758885175770905e-02 1.96409213971156848544e+00 3.59076725034596713759e-02 1.96412408916073832899e+00 3.65167954102774069969e-02 1.98327129072319041647e+00
7.600000 1.00000000000003330669e+00 1.68676288230491938647e-02 1.96345191168097610301e+00 3.58909970410555140274e-02 1.96407315358949952078e+00 3.59240139388044693591e-02 1.96407378969224200027e+00 3.59262669894774913648e-02 1.96410541274030436831e+00 3.65486112473333499273e-02 1.98313821425726000136e+00
7.700000 1.00000000000003419487e+00 1.72391879688935587001e-02 1.96367558945764897338e+00 3.56592079059756469905e-02 1.96430275506102192118e+00 3.56915626626331666804e-02 1.96430358382765279934e+00 3.56962162745416491938e-02 1.96433227899894169433e+00 3.63272884660614039931e-02 1.98277232937664327217e+00
7.800000 1.00000000000003530509e+00 1.78724950191455622672e-02 1.96400830349657073981e+00 3.53282534115507279582e-02 1.96463676588809144086e+00 3.53563349479221189497e-02 1.96463735522723292881e+00 3.53602374737744737376e-02 1.96466216474738653019e+00 3.59925347714827453816e-02 1.98214555501684452921e+00
7.900000 1.00000000000003730349e+00 1.87783841254143997468e-02 1.96417461044909358314e+00 3.51634862047207133462e-02 1.96480927818123629613e+00 3.51842405120543141872e-02 1.96480978027120389839e+00 3.51845818117470440778e-02 1.96483061324061769604e+00 3.58194319286224277521e-02 1.98124559327531368780e+00
8.000000 1.00000000000003641532e+00 1.98654849626024102016e-02 1.96396512728123173730e+00 3.53608608942586818968e-02 1.96462012550681031087e+00 3.53745462929139706243e-02 1.96462126075410647985e+00 3.53712071628536142698e-02 1.96463942270110147881e+00 3.60212898335766640301e-02 1.98016067461055333965e+00
8.100000 1.00000000000003996803e+00 2.09057374606562880459e-02 1.96343273646179250491e+00 3.58618364409067358345e-02 1.96412233747095732461e+00 3.58734130367557024766e-02 1.96412464003238729227e+00 3.58693488478208713510e-02 1.96414263682663681188e+00 3.65514393836706558139e-02 1.97911587403842292865e+00
8.200000 1.00000000000003974598e+00 2.15807533366580948930e-02 1.96291386421687352737e+00 3.63407132702157908977e-02 1.96363931168266203642e+00 3.63576674786656589555e-02 1.96364215154556531751e+00 3.63567935390893964831e-02 1.96366289505014268713e+00 3.70773450166289111896e-02 1.97842850486349597361e+00
8.300000 1.00000000000003708145e+00 2.15913847489687046877e-02 1.96280935786100463325e+00 3.64205870825927216505e-02 1.96355323455728347781e+00 3.64458538736944989700e-02 1.96355537312685779483e+00 3.64501356514780328055e-02 1.96357840764026159164e+00 3.71959258194394237762e-02 1.97839973963840165538e+00
8.400000 1.00000000000003752554e+00 2.08008147254916536673e-02 1.96326070459044599303e+00 3.59860260900050563104e-02 1.96398766809779834475e+00 3.60148521916487315830e-02 1.96398815863853393182e+00 3.60224957285674232677e-02 1.96400973506903375743e+00 3.67576953405445230882e-02 1.97917184952792757358e+00
8.500000 1.00000000000003397282e+00 1.93597362756241335446e-02 1.96399543163139522761e+00 3.53154371993414997744e-02 1.96466697977876414427e+00 3.53393340618500945149e-02 1.96466622063366069817e+00 3.53457597474273604865e-02 1.96468287654434892175e+00 3.60264399497903925473e-02 1.98060178417779053639e+00
8.600000 1.00000000000003486100e+00 1.77197666901394053351e-02 1.96447563255542023697e+00 3.49173469080613085858e-02 1.96507548692718359007e+00 3.49330082918434606243e-02 1.96507500916814970005e+00 3.49339635594973704769e-02 1.96508940121256792111e+00 3.55366328501606557055e-02 1.98224375183697887337e+00
8.700000 1.00000000000003397282e+00 1.64389190045654068340e-02 1.96426579294377567919e+00 3.51726148658639548028e-02 1.96482198495964976992e+00 3.51853821376234068841e-02 1.96482373014131272981e+00 3.51802875910425319472e-02 1.96484344171495739495e+00 3.57294101566533253700e-02 1.98353843648457428550e+00
8.800000 1.00000000000003486100e+00 1.58322705080635485475e-02 1.96340177998017018091e+00 3.60109901227475548424e-02 1.96397176453618360625e+00 3.60315822616197253825e-02 1.96397615107883583008e+00 3.60246345270776383019e-02 1.96400803866406525877e+00 3.65815707697861106085e-02 1.98416121755148933126e+00
8.900000 1.00000000000003574918e+00 1.57672274135482182178e-02 1.96247379461274196188e+00 3.68676862058465240612e-02 1.96309403805550863886e+00 3.69046136814255992808e-02 1.96309916015280894186e+00 3.69020504464601106775e-02 1.96314337879281919363e+00 3.75132479291090462081e-02 1.98423480270973162654e+00
9.000000 1.00000000000003752554e+00 1.58892393600320210034e-02 1.96222549762578357679e+00 3.70699245344165706495e-02 1.96287187208196978183e+00 3.71236126310929975824e-02 1.96287434003743088695e+00 3.71285466282237353042e-02 1.96292512644732952687e+00 3.77778107698170939610e-02 1.98411402988387886026e+00
9.100000 1.00000000000004174439e+00 1.60894992525014920992e-02 1.96291883994496485499e+00 3.63992796575022953265e-02 1.96353525353203295367e+00 3.64587108883057814390e-02 1.96353335436227594002e+00 3.64682801838527789751e-02 1.96358109581752171557e+00 3.70981120166224143109e-02 1.98391757434442461694e+00
9.200000 1.00000000000003774758e+00 1.66524827647166404065e-02 1.96406446598632422607e+00 3.53165128467318595318e-02 1.96462943169286119449e+00 3.53636546067491799872e-02 1.96462469729892852399e+00 3.53712490422976311155e-02 1.96465992084548113361e+00 3.59499023418432331334e-02 1.98336768257408446736e+00
9.300000 1.00000000000004285461e+00 1.79008179264419781118e-02 1.96478073215596760193e+00 3.46337304991877342752e-02 1.96533747185033824678e+00 3.46545549665094945735e-02 1.96533418268290893671e+00 3.46548614571853194621e-02 1.96535212673991122045e+00 3.52146906320880970220e-02 1.98213683108945448730e+00
9.400000 1.00000000000004152234e+00 1.97753452532477037862e-02 1.96444926264967945073e+00 3.49266798875731906970e-02 1.96506729253007161873e+00 3.49236937705305755530e-02 1.96506915399322545923e+00 3.49165916331611661527e-02 1.96507573236218524571e+00 3.55234693491219555295e-02 1.98027277857119243798e+00
9.500000 1.00000000000004019007e+00 2.17795122278891806200e-02 1.96319267109620620992e+00 3.60845656633081851572e-02 1.96391228936314710118e+00 3.60784190530357429250e-02 1.96391942808300878909e+00 3.60692812305713483845e-02 1.96392929652804881790e+00 3.67704912527157257163e-02 1.97826404550207124444e+00
9.600000 1.00000000000004285461e+00 2.32362547806773990511e-02 1.96187044414752698174e+00 3.72996445163351203478e-02 1.96267736806908521530e+00 3.73147986499670833438e-02 1.96268552528068851437e+00 3.73115225008217310521e-02 1.96271134485287745974e+00 3.81058958123899754744e-02 1.97678720138958241570e+00
9.700000 1.00000000000004884981e+00 2.35938868096628624749e-02 1.96148408725811829179e+00 3.76311408983593387312e-02 1.96232361495044327349e+00 3.76721590888733776081e-02 1.96232818236698780545e+00 3.76793850391522675003e-02 1.96236588932167155264e+00 3.85219774322159008717e-02 1.97639967683452422165e+00
9.800000 1.00000000000004729550e+00 2.26433524380258710540e-02 1.96236278528046215186e+00 3.67927430079020983955e-02 1.96316410647029604419e+00 3.68371900221551307197e-02 1.96316379804602769710e+00 3.68521489201335955554e-02 1.96319342910231231514e+00 3.76701490450066373006e-02 1.97732029766764738632e+00
9.900000 1.00000000000005218048e+00 2.06432663680735824230e-02 1.96387040420685288211e+00 3.54161208878165170710e-02 1.96457092925825604901e+00 3.54365408291297465104e-02 1.96456822311038847850e+00 3.54499951938048799005e-02 1.96457341619724390469e+00 3.61690077841684207161e-02 1.97930209616427710273e+00
10.000000 1.00000000000004884981e+00 1.83011569501706633512e-02 1.96491109761911175724e+00 3.45280351713550051618e-02 1.96548984485617861395e+00 3.45221091095688770167e-02 1.96548784114722496774e+00 3.45251805651311735601e-02 1.96547748100374586322e+00 3.51108789465047546607e-02 1.98164637463102555337e+00
10.100000 1.00000000000005084821e+00 1.64879225238236323814e-02 1.96472643627693677182e+00 3.47796559511987304902e-02 1.96523887255695450804e+00 3.47730863484639607375e-02 1.96523998327524163088e+00 3.47640094286829903769e-02 1.96524293304608144162e+00 3.52665112448348611052e-02 1.98348058934777782270e+00
10.200000 1.00000000000005440093e+00 1.56976167574513700287e-02 1.96342967642577104215e+00 3.60026806040111072016e-02 1.96398108338937671391e+00 3.60255724571246355170e-02 1.96398604840434054530e+00 3.60124279144368453220e-02 1.96402568656651910217e+00 3.65437788675712429964e-02 1.98429542861339558435e+00
10.300000 1.00000000000005262457e+00 1.56764746286087476579e-02 1.96199408084127324692e+00 3.72960892798032059292e-02 1.96264002527366132611e+00 3.73585833802345460009e-02 1.96264749380191361183e+00 3.73536018572525399528e-02 1.96272115588383089246e+00 3.79853997640239304801e-02 1.98432709528940698362e+00
10.400000 1.00000000000005040413e+00 1.57494752482629299384e-02 1.96157138440626299669e+00 3.76577803547102560322e-02 1.96224862443949232826e+00 3.77438718691517141601e-02 1.96225459147908054547e+00 3.77530496279829333450e-02 1.96233742211181838577e+00 3.84340489115181510593e-02 1.98424975155175009611e+00
10.500000 1.00000000000005151435e+00 1.56455769927605105318e-02 1.96250841103159956447e+00 3.68070647110817009140e-02 1.96310652944717989321e+00 3.68847717637268285307e-02 1.96310690941770871198e+00 3.69012165470995953664e-02 1.96316962514117854255e+00 3.75178965744438486229e-02 1.98435199837322628902e+00
10.600000 1.00000000000005240253e+00 1.58302698933262507575e-02 1.96402151858950868579e+00 3.54328604652415363185e-02 1.96452028432595304785e+00 3.54737149472101748193e-02 1.96451424924288065021e+00 3.54840513329519255392e-02 1.96454041839414061954e+00 3.60003835504585575911e-02 1.98418224925831832017e+00
10.700000 1.00000000000005329071e+00 1.69114585678986455164e-02 1.96491390263213627776e+00 3.45826546463154915756e-02 1.96541481774667881055e+00 3.45817626650571710578e-02 1.96540683202274779617e+00 3.45782362138139648389e-02 1.96540224584308864664e+00 3.50823801107743304950e-02 1.98312570955149158891e+00
10.800000 1.00000000000004796163e+00 1.88870924870759987479e-02 1.96457084779590940293e+00 3.48223978327595953819e-02 1.96519022233941953459e+00 3.48054434199148374218e-02 1.96518697878360826259e+00 3.47926228188172870226e-02 1.96517907604516128828e+00 3.53996827331549412943e-02 1.98116563574417869908e+00
10.900000 1.00000000000004662937e+00 2.10764651186211432465e-02 1.96333555864255093759e+00 3.58881425432690040478e-02 1.96409920816490135564e+00 3.58918745942917935543e-02 1.96410491330427694479e+00 3.58818833244377716207e-02 1.96412283642693008545e+00 3.66280195660152810277e-02 1.97897109831468598351e+00
11.000000 1.00000000000004352074e+00 2.26271955757437991108e-02 1.96216221506499555183e+00 3.69455225325736394404e-02 1.96300263849581124731e+00 3.69836591962981464654e-02 1.96301526696516370762e+00 3.69868510181852391816e-02 1.96306217384215631050e+00 3.78172729477717073365e-02 1.97739720436130927972e+00
11.100000 1.00000000000004241052e+00 2.30180196683906004851e-02 1.96189919512681920644e+00 3.72150504388736938499e-02 1.96272205880829364588e+00 3.72641202540966720580e-02 1.96273516583929841239e+00 3.72806348454868749509e-02 1.96278137921850337477e+00 3.81077167034043623461e-02 1.97697665909686870478e+00
11.200000 1.00000000000004529710e+00 2.22415144317504899496e-02 1.96267778650444224553e+00 3.65509272023054748724e-02 1.96341789912246289518e+00 3.65758028703619050837e-02 1.96342445438343604636e+00 3.65952201133740370742e-02 1.96343791874464512759e+00 3.73494875858942573799e-02 1.97772898904129679210e+00
11.300000 1.00000000000004574119e+00 2.07141545593534613656e-02 1.96385312461868433154e+00 3.55185568308063470688e-02 1.96449535554337195720e+00 3.55114710703376273981e-02 1.96449222996741457159e+00 3.55199785305327989104e-02 1.96447398228992820002e+00 3.61756656060159484389e-02 1.97924548098355046477e+00
11.400000 1.00000000000004685141e+00 1.90399910024267385311e-02 1.96456406254901527753e+00 3.48855013266217012236e-02 1.96514346399857209313e+00 3.48745568431084174144e-02 1.96513328852895718946e+00 3.48669548679034213556e-02 1.96511905158044619668e+00 3.54498910505968711782e-02 1.98092323825235405721e+00
11.500000 1.00000000000004773959e+00 1.77228605617336630595e-02 1.96439838570207925272e+00 3.50190327209795176922e-02 1.96498023470883897978e+00 3.50382870049688183167e-02 1.96497166960006075520e+00 3.50229350590724741732e-02 1.96499621764014564818e+00 3.55977133072426371596e-02 1.98225266369489006024e+00
11.600000 1.00000000000004574119e+00 1.69351202634755240717e-02 1.96363322255253325288e+00 3.56867308272818262171e-02 1.96426326539733064891e+00 3.57431782596705008292e-02 1.96426524044478445497e+00 3.57357891446725001172e-02 1.96433037413647326730e+00 3.63550145879041886054e-02 1.98305206438591219431e+00
11.700000 1.00000000000004551914e+00 1.65125922459047162760e-02 1.96294083707746835898e+00 3.63208621075336024475e-02 1.96359914125336243451e+00 3.63918689871652323298e-02 1.96361247078726508519e+00 3.64004605967766237118e-02 1.96368866451143775365e+00 3.70533077049758283184e-02 1.98347979472808400025e+00
11.800000 1.00000000000004640732e+00 1.62257861816466932015e-02 1.96284160030227972094e+00 3.64659137619073522862e-02 1.96346438686694324538e+00 3.65212779314113833440e-02 1.96347833795130588541e+00 3.65380817095707008391e-02 1.96353222371226476817e+00 3.71641668472945246871e-02 1.98376822473538871883e+00
11.900000 1.00000000000004707346e+00 1.60866040631228793267e-02 1.96332010771074250144e+00 3.60901700011367759791e-02 1.96387990990931604607e+00 3.61145264411074293220e-02 1.96388155833100208625e+00 3.61231343041012384343e-02 1.96389988635530343686e+00 3.66910094757001356558e-02 1.98391309340847898923e+00
12.000000 1.00000000000004463097e+00 1.63397346122643970234e-02 1.96391871114567373446e+00 3.55408779659914103588e-02 1.96446543585115818153e+00 3.55415628790263782300e-02 1.96445265858399942260e+00 3.55342340495785405374e-02 1.96444785505195707032e+00 3.60865798482198005259e-02 1.98367235001213360057e+00
12.100000 1.00000000000004329870e+00 1.71474484020956233210e-02 1.96418522054482802552e+00 3.52167051363927452456e-02 1.96479194969910642143e+00 3.52169712184074862327e-02 1.96477696182948768922e+00 3.52024984913568220191e-02 1.96477558830187315486e+00 3.58091011063744676934e-02 1.98287755527006481771e+00
12.200000 1.00000000000004130030e+00 1.83437572874615602292e-02 1.96402667022045185341e+00 3.52638524688418941722e-02 1.96471161575282349254e+00 3.52850134844102866771e-02 1.96470950130562149738e+00 3.52798350031806734473e-02 1.96473279291043612105e+00 3.59607243753027189248e-02 1.98168623719146697049e+00
12.300000 1.00000000000004196643e+00 1.95199791163765783153e-02 1.96367812248047601820e+00 3.55441592171452727666e-02 1.96439416202136762912e+00 3.55865987449369772233e-02 1.96440912791100497081e+00 3.55981953669720005418e-02 1.96445490231338060205e+00 3.63104372753866311285e-02 1.98050431555296624353e+00
12.400000 1.00000000000004329870e+00 2.03042907952383951120e-02 1.96343218351629911211e+00 3.58107367694996958640e-02 1.96412523359605994955e+00 3.58507725931467916003e-02 1.96414651391116334977e+00 3.58709375005391850610e-02 1.96418879979182747775e+00 3.65627614208594159395e-02 1.97970777010537335450e+00
12.500000 1.00000000000004130030e+00 2.05559160461430655287e-02 1.96342017124299794695e+00 3.58962922238572970657e-02 1.96407798144966472265e+00 3.59101740674669170361e-02 1.96408908301913953665e+00 3.59222458150950385569e-02 1.96410292859820412303e+00 3.65813863405811331986e-02 1.97944382119685902133e+00
12.600000 1.00000000000004107825e+00 2.03577457595765266840e-02 1.96358241877133754549e+00 3.57859676094208697950e-02 1.96423082381029234789e+00 3.57783807503496073532e-02 1.96422279021156365175e+00 3.57721693973031343305e-02 1.96421332905608903019e+00 3.64227389563700210129e-02 1.97963363567772332452e+00
12.700000 1.00000000000004107825e+00 1.98853302791450192721e-02 1.96377270259510994244e+00 3.55823434743382030487e-02 1.96443840971492167391e+00 3.55846119252707301928e-02 1.96441809190194871526e+00 3.55656961712365465855e-02 1.96441783864554819772e+00 3.62330519817210330857e-02 1.98010192331074685868e+00
12.800000 1.00000000000003774758e+00 1.92843398629813089773e-02 1.96388439648407353566e+00 3.54142559123880595884e-02 1.96456846731778700388e+00 3.54497028493614418920e-02 1.96455378676891290191e+00 3.54357966758496178983e-02 1.96458758871422412007e+00 3.61204886117963835934e-02 1.98070117680265322946e+00
12.900000 1.00000000000003352874e+00 1.86364577073959009068e-02 1.96390457979058563609e+00 3.53606511595832631589e-02 1.96458006291805542531e+00 3.54183955926263491221e-02 1.96458526927324528266e+00 3.54238375741448355272e-02 1.96464293714972959570e+00 3.60994133395697233690e-02 1.98134839549506724943e+00
13.000000 1.00000000000003286260e+00 1.80058806451783327829e-02 1.96387859908282980115e+00 3.54202789733537096173e-02 1.96451514813539529491e+00 3.54664879336766755702e-02 1.96453685565746205555e+00 3.54879973926454025945e-02 1.96458435578826540180e+00 3.61244551042421563336e-02 1.98197994128693300020e+00
13.100000 1.00000000000003730349e+00 1.74912243110525965351e-02 1.96384280303195102313e+00 3.55322588322816018680e-02 1.96443839247546891968e+00 3.55455418270074555154e-02 1.96445707845357109278e+00 3.55634955991112194917e-02 1.96447194599184760122e+00 3.61587027490807288999e-02 1.98249855672865926692e+00
13.200000 1.00000000000003375078e+00 1.72107775525199534206e-02 1.96380243759173089835e+00 3.56182199880971592232e-02 1.96439368086660692825e+00 3.56099187298294928006e-02 1.96439145362428746466e+00 3.56066634810414672785e-02 1.96438398558996540899e+00 3.61970379623004906433e-02 1.98278582461365382450e+00
13.300000 1.00000000000003286260e+00 1.72250328150105463942e-02 1.96376554353876353609e+00 3.56250722732284544336e-02 1.96439387303705337295e+00 3.56266288460296287610e-02 1.96437304302763027231e+00 3.56052074242656571568e-02 1.96437407482475334675e+00 3.62327767642196332809e-02 1.98277874744905391324e+00
13.400000 1.00000000000003397282e+00 1.74820636482457929251e-02 1.96376649532705682688e+00 3.55495246791737093406e-02 1.96443370441195219733e+00 3.55821978684119771819e-02 1.96441575864069184476e+00 3.55647532580225383958e-02 1.96444693461422570380e+00 3.62323629462937488177e-02 1.98252620460592821061e+00
13.500000 1.00000000000003397282e+00 1.78513051297885319557e-02 1.96383153665550369560e+00 3.54415955113578720614e-02 1.96449450851968610010e+00 3.54977643286274180401e-02 1.96449914327577901396e+00 3.55039532923729153624e-02 1.96455384322548609610e+00 3.61685842779914251688e-02 1.98215776578341840164e+00
13.600000 1.00000000000003219647e+00 1.82167123886867836358e-02 1.96392725250337218945e+00 3.53743190972633791969e-02 1.96454808330531527361e+00 3.54239333329267117034e-02 1.96457308112342787787e+00 3.54503740902611594321e-02 1.96462238083379769904e+00 3.60728203562162563767e-02 1.98179104296871932966e+00
13.700000 1.00000000000003463896e+00 1.85337455977239579097e-02 1.96397446820460008787e+00 3.53916633777619712986e-02 1.96456598725501652147e+00 3.54093562680835860501e-02 1.96458870570216914686e+00 3.54322535344672173707e-02 1.96460738391550182591e+00 3.60237078182377573610e-02 1.98147272832643861484e+00
13.800000 1.00000000000003308465e+00 1.88071469693996858041e-02 1.96392431878072826201e+00 3.54706547372767161397e-02 1.96453955654745993087e+00 3.54609726490852927849e-02 1.96453835497943796184e+00 3.54584291273128127120e-02 1.96453002141397381486e+00 3.60718937754555268871e-02 1.98119865101985648259e+00
13.900000 1.00000000000003730349e+00 1.90269295303479510362e-02 1.96381604479953764120e+00 3.55384736885312191301e-02 1.96449046597354226584e+00 3.55342393967921013620e-02 1.96446575906524434352e+00 3.55080395821938538115e-02 1.96446194924372030677e+00 3.61805044613935020137e-02 1.98097759425872621541e+00
14.000000 1.00000000000004196643e+00 1.91398891163644634117e-02 1.96374508552418003404e+00 3.55358170903318087985e-02 1.96445878248045313619e+00 3.55663209237060962131e-02 1.96443378995402873066e+00 3.55409610887150104186e-02 1.96446346154369999581e+00 3.62544107892403613680e-02 1.98086148148928087309e+00
14.100000 1.00000000000004196643e+00 1.90845248119628427275e-02 1.96377482453906493376e+00 3.54710968083220626323e-02 1.96446978513780967646e+00 3.55306280140932906342e-02 1.96446947775324254337e+00 3.55315470945961331406e-02 1.96452781829801237379e+00 3.62280615963260013701e-02 1.98091223594658183416e+00
14.200000 1.00000000000003752554e+00 1.88581631576994965260e-02 1.96387715627942083252e+00 3.54086371725150297896e-02 1.96451375040178688458e+00 3.54596903848894834388e-02 1.96454093379532790387e+00 3.54883588562568824676e-02 1.96459160876753036185e+00 3.61269423555182836449e-02 1.98113475882907907888e+00
14.300000 1.00000000000003619327e+00 1.85453704272601667402e-02 1.96396243751047361314e+00 3.54030169224178112297e-02 1.96455603957331947917e+00 3.54145367779107600459e-02 1.96458684727427224104e+00 3.54458935624829205024e-02 1.96459907820519119603e+00 3.60399912967710456257e-02 1.98144678844990895783e+00
14.400000 1.00000000000003419487e+00 1.82757514264484249855e-02 1.96396099442261995449e+00 3.54486080593426899910e-02 1.96456674213329884893e+00 3.54297562647354694065e-02 1.96457212322312235742e+00 3.54341428684250003833e-02 1.96455418713122220709e+00 3.60386749298215111614e-02 1.98171901954095486253e+00
14.500000 1.00000000000003796963e+00 1.81368894253387778759e-02 1.96388537841049770627e+00 3.54920454591493711449e-02 1.96454303823259701645e+00 3.54841882855519499818e-02 1.96451720949907882030e+00 3.54570635182846274902e-02 1.96450949695536292161e+00 3.61129373318033533580e-02 1.98186175288236787750e+00
14.600000 1.00000000000003752554e+00 1.81212966871398054036e-02 1.96381399197766537412e+00 3.54889692743751150594e-02 1.96450814231406667432e+00 3.55239040923222074153e-02 1.96447642023121726851e+00 3.54916120172074356365e-02 1.96451055461825796478e+00 3.61853925694492553622e-02 1.98187971621830660851e+00
14.700000 1.00000000000003885781e+00 1.81522605954954931173e-02 1.96381706625476204486e+00 3.54461952316584769096e-02 1.96449022714258125788e+00 3.55138210764586736978e-02 1.96448540333103438549e+00 3.55098919963210205020e-02 1.96455215403869232205e+00 3.61843397730409327417e-02 1.98184864055995824117e+00
14.800000 1.00000000000004196643e+00 1.81667155508366783001e-02 1.96388859332402576641e+00 3.54103626100194732174e-02 1.96450116892464032858e+00 3.54681544047288910271e-02 1.96453084329045202239e+00 3.54990800654295807215e-02 1.96458856323118435938e+00 3.61134715067613285000e-02 1.98183304709189989090e+00
14.900000 1.00000000000003708145e+00 1.81701003406629368886e-02 1.96395637866141892225e+00 3.54171404752317495190e-02 1.96453081574861698755e+00 3.54314809623942142403e-02 1.96456793997914624939e+00 3.54692752867063615385e-02 1.96458313553600394386e+00 3.60440191310856666851e-02 1.98182971387871509350e+00
15.000000 1.00000000000003907985e+00 1.82167117188525885807e-02 1.96395392942232538402e+00 3.54559475084201269901e-02 1.96455573606920630425e+00 3.54358714401529217852e-02 1.96456421540127057490e+00 3.54435964066352401924e-02 1.96454496452193994038e+00 3.60440530615198373443e-02 1.98178497444968759744e+00
15.100000 1.00000000000003619327e+00 1.83375354743608338925e-02 1.96388702607262732869e+00 3.54830902932860361987e-02 1.96455751998814664994e+00 3.54721076104374741234e-02 1.96452796619476277584e+00 3.54414328815047877108e-02 1.96451694870656390357e+00 3.61100894168570746290e-02 1.98166628336148975542e+00
15.200000 1.00000000000003552714e+00 1.84949071815135555885e-02 1.96382335913805672334e+00 3.54691609127067014606e-02 1.96453596460921309230e+00 3.55027572749995815049e-02 1.96449686730873107621e+00 3.54629987229306206653e-02 1.96452951234010542159e+00 3.61753362620464216648e-02 1.98150913624972369043e+00
15.300000 1.00000000000003530509e+00 1.86055121213717089557e-02 1.96382384751546013035e+00 3.54299030945039311602e-02 1.96450911819669205016e+00 3.54990570702442137518e-02 1.96450002103260912278e+00 3.54906450769256892608e-02 1.96456838120364651878e+00 3.61772400403217522791e-02 1.98139627464824452652e+00
15.400000 1.00000000000003708145e+00 1.86121885699632554079e-02 1.96388219136507879981e+00 3.54090980802453519916e-02 1.96449879899625945434e+00 3.54676869943959527376e-02 1.96453164848359929096e+00 3.55015843220598953378e-02 1.96459040198531531551e+00 3.61199194650776919668e-02 1.98138648173798226360e+00
15.500000 1.00000000000003641532e+00 1.85319206236419335709e-02 1.96393763167028545524e+00 3.54295618186437968888e-02 1.96451479224634950604e+00 3.54399043621365580914e-02 1.96456018560505496495e+00 3.54859661356579439428e-02 1.96457160226691218696e+00 3.60632853614850368285e-02 1.98146514990983635407e+00
15.600000 1.00000000000003552714e+00 1.84395211988079461840e-02 1.96393696113724880448e+00 3.54687758095582478246e-02 1.96454471892851167958e+00 3.54417732576785757259e-02 1.96455918300261878073e+00 3.54556349097940315396e-02 1.96453292906907228677e+00 3.60620661661389188546e-02 1.98155843652058583082e+00
15.700000 1.00000000000003241851e+00 1.84003991011502769648e-02 1.96388600800836199411e+00 3.54834695787959938929e-02 1.96456331073909185037e+00 3.54692385997076517490e-02 1.96453169801188476384e+00 3.54366815664392612040e-02 1.96451715931388881664e+00 3.61123299839973474490e-02 1.98159970509672045402e+00
15.800000 1.00000000000003175238e+00 1.84179213110459601144e-02 1.96383828382442060523e+00 3.54572843618391753129e-02 1.96455259019951888888e+00 3.54950075545259549625e-02 1.96450530597637729180e+00 3.54470766431777273286e-02 1.96454184473882809137e+00 3.61613132396497588550e-02 1.98158337215062507752e+00
15.900000 1.00000000000003508305e+00 1.84394739842273017172e-02 1.96384089316057641739e+00 3.54180366293727205695e-02 1.96452003755435766763e+00 3.54947194587103970198e-02 1.96450474008356801292e+00 3.54799601984710361036e-02 1.96458069288446424139e+00 3.61604710466254392065e-02 1.98156097499961392217e+00
16.000000 1.00000000000003486100e+00 1.84151712688613369839e-02 1.96388845652085786142e+00 3.54079951485172517156e-02 1.96449411287201525234e+00 3.54704316994223431414e-02 1.96452895814892092297e+00 3.55061987898364836425e-02 1.96459180535166955117e+00 3.61134692135937837576e-02 1.98158340098630736392e+00
16.100000 1.00000000000004041212e+00 1.83485469028552838910e-02 1.96393277291312018384e+00 3.54375206974110804059e-02 1.96450124438721096531e+00 3.54453044824284274616e-02 1.96455459554949873890e+00 3.54993568492283431692e-02 1.96456365461049231591e+00 3.60678387403696176783e-02 1.98164916486736863988e+00
16.200000 1.00000000000003907985e+00 1.82936623260657807433e-02 1.96393137738463385844e+00 3.54748536396483904465e-02 1.96453787261996892788e+00 3.54427556402124172008e-02 1.96455790473557967424e+00 3.54623588337767761680e-02 1.96452650436568543313e+00 3.60674570272058458986e-02 1.98170525342720726947e+00
16.300000 1.00000000000003619327e+00 1.83013716837362450107e-02 1.96388861273108217276e+00 3.54801434518124542139e-02 1.96457092341296402083e+00 3.54639779186132972355e-02 1.96453667557781885833e+00 3.54288603234667667796e-02 1.96452000702547158184e+00 3.61095827928614443447e-02 1.98169984508221852515e+00
16.400000 1.00000000000003685940e+00 1.83695704608742849118e-02 1.96384799831104706058e+00 3.54480642041433702261e-02 1.96456666026141379966e+00 3.54888712409199905129e-02 1.96451118497880505842e+00 3.54326660277684696299e-02 1.96455065310658838484e+00 3.61513579146678087906e-02 1.98163297349381961610e+00
16.500000 1.00000000000003463896e+00 1.84435387035015094237e-02 1.96384823188496770996e+00 3.54128390763604194991e-02 1.96452584360992510426e+00 3.54941079173777818134e-02 1.96450510763476882126e+00 3.54737042423923371048e-02 1.96458570901712059609e+00 3.61527293138016181384e-02 1.98155818859978549717e+00
16.600000 1.00000000000002953193e+00 1.84663956773855574001e-02 1.96388582274987122389e+00 3.54121587057653203212e-02 1.96448584381248325670e+00 3.54755612339443179848e-02 1.96452358275717475777e+00 3.55141648511982585545e-02 1.96458758957658585764e+00 3.61156997634085180637e-02 1.98153318087215568610e+00
16.700000 1.00000000000002975398e+00 1.84297141693925692341e-02 1.96392197441117644097e+00 3.54465326914007936021e-02 1.96448770854716170398e+00 3.54501512385742151290e-02 1.96454959327556855087e+00 3.55128332447635988722e-02 1.96455463457985657350e+00 3.60784685496453316755e-02 1.98156838929246648107e+00
16.800000 1.00000000000002731149e+00 1.83781143120307077776e-02 1.96392243670892985286e+00 3.54792546634680322493e-02 1.96453298478245730330e+00 3.54418144259394524154e-02 1.96455883940824005407e+00 3.54674612176800671537e-02 1.96452202778856888088e+00 3.60765728576542404893e-02 1.98162049383501548405e+00
16.900000 1.00000000000002819966e+00 1.83650149464047555969e-02 1.96388952603963806709e+00 3.54755029460503412686e-02 1.96457935538766181871e+00 3.54584147881421285486e-02 1.96454241705029941656e+00 3.54206504432529253878e-02 1.96452462219426582379e+00 3.61090177510061047239e-02 1.98163547845328524843e+00
17.000000 1.00000000000002597922e+00 1.84024979990863382651e-02 1.96385698939505082272e+00 3.54393747001459161194e-02 1.96457950772479539303e+00 3.54849300158604288868e-02 1.96451535266424004433e+00 3.54199521233114628105e-02 1.96455942376400805038e+00 3.61426030567723044484e-02 1.98159936855670526512e+00
17.100000 1.00000000000002353673e+00 1.84521145662312202607e-02 1.96385530389345497326e+00 3.54092778113504619286e-02 1.96453009324694116700e+00 3.54961432749971578238e-02 1.96450324541952148216e+00 3.54694073300914763935e-02 1.96458951443604479259e+00 3.61456351714789583807e-02 1.98154926484986204649e+00
17.200000 1.00000000000002131628e+00 1.84633328528084200704e-02 1.96388355532947223026e+00 3.54172321613864179990e-02 1.96447775834205606849e+00 3.54811192864126004332e-02 1.96451804200693902480e+00 3.55222426390206028057e-02 1.96458274294493118184e+00 3.61178201216742628121e-02 1.98153615431529406266e+00
17.300000 1.00000000000001998401e+00 1.84224814636584285910e-02 1.96391278167729899096e+00 3.54546127328470503381e-02 1.96447608903515913426e+00 3.54530572056018025706e-02 1.96454664905908349404e+00 3.55245176106855006792e-02 1.96454665317998355967e+00 3.60876414268142611808e-02 1.98157551660884934108e+00
17.400000 1.00000000000001909584e+00 1.83651021800841571241e-02 1.96391614042564932596e+00 3.54816236349790661841e-02 1.96452983404511227761e+00 3.54388839564011501326e-02 1.96456174334220357025e+00 3.54708121449929247859e-02 1.96451956172138775258e+00 3.60830629031238109272e-02 1.98163323564603333082e+00
17.500000 1.00000000000001287859e+00 1.83424473563729290015e-02 1.96389267370713938021e+00 3.54698506650772682480e-02 1.96458745880439966669e+00 3.54530657440211144360e-02 1.96454785271210163877e+00 3.54126315470186872614e-02 1.96453016125347423859e+00 3.61061101578469823004e-02 1.98165774805252947743e+00
17.600000 1.00000000000001598721e+00 1.83729911520791912294e-02 1.96386653662241195129e+00 3.54319680766011640971e-02 1.96459014250692276526e+00 3.54830851786761269917e-02 1.96451728066217512492e+00 3.54092794467407850911e-02 1.96456679312672655158e+00 3.61330956182254886544e-02 1.98162882760947134386e+00
17.700000 1.00000000000001798561e+00 1.84264133760637070780e-02 1.96386169107514318988e+00 3.54081028050919760508e-02 1.96453233922438297299e+00 3.54998247795093868628e-02 1.96449958206581443143e+00 3.54669518322403842792e-02 1.96459077495983613915e+00 3.61390370448967518380e-02 1.98157528283703077143e+00
17.800000 1.00000000000001798561e+00 1.84524046602809431439e-02 1.96388087941532618608e+00 3.54232396288399684070e-02 1.96446987223048252780e+00 3.54860149096516558354e-02 1.96451300516732452195e+00 3.55300104402045680008e-02 1.96457678540562263869e+00 3.61202148187185836936e-02 1.98154757332355058175e+00
17.900000 1.00000000000001776357e+00 1.84284471890403742100e-02 1.96390422230791306113e+00 3.54611106677989382230e-02 1.96446656579046474711e+00 3.54536819217323162512e-02 1.96454586614202364458e+00 3.55340223084081655025e-02 1.96454010384603150463e+00 3.60961105230771309160e-02 1.98156986930353240517e+00
18.000000 1.00000000000001842970e+00 1.83791426197665065667e-02 1.96391064444099150421e+00 3.54816010188715239004e-02 1.96452832940457988720e+00 3.54345027009140001173e-02 1.96456603330300549892e+00 3.54724541382059055383e-02 1.96451943046939847548e+00 3.60887079817038824991e-02 1.98161915392255250090e+00
18.100000 1.00000000000001443290e+00 1.83526200336075438757e-02 1.96389552385037946536e+00 3.54635725481169672424e-02 1.96459482942214180845e+00 3.54487452166596037073e-02 1.96455226542144201218e+00 3.54053074940448020413e-02 1.96453635205674848052e+00 3.61034778332218336816e-02 1.98164730612366812856e+00
18.200000 1.00000000000001376677e+00 1.83740553050564629778e-02 1.96387449456116791602e+00 3.54263319020347577926e-02 1.96459837763773181862e+00 3.54837277642016668544e-02 1.96451676788321449862e+00 3.54010216294356472311e-02 1.96457246510559224717e+00 3.61251778442806675828e-02 1.98162758036725827893e+00
18.300000 1.00000000000001465494e+00 1.84232289761601525369e-02 1.96386642277163625536e+00 3.54091416775413753149e-02 1.96453314644347276641e+00 3.55048193138181381046e-02 1.96449466603610489734e+00 3.54660073035427750310e-02 1.96458987109582272623e+00 3.61341380530391664827e-02 1.98157855832886875547e+00
18.400000 1.00000000000001221245e+00 1.84535398481153432859e-02 1.96387775071072390176e+00 3.54295858383341377706e-02 1.96446318727756708000e+00 3.54896078223916403016e-02 1.96450931863300226610e+00 3.55366641877005867700e-02 1.96457051783759140129e+00 3.61231319955249569054e-02 1.98154669584905240853e+00
18.500000 1.00000000000001398881e+00 1.84370742284410242540e-02 1.96389659715662445727e+00 3.54657884940256101780e-02 1.96445969838237033400e+00 3.54517676142327500810e-02 1.96454765624640925736e+00 3.55409320247211529820e-02 1.96453538553208706396e+00 3.61037218215946031918e-02 1.98156137849946012430e+00
18.600000 1.00000000000001465494e+00 1.83895828204157507635e-02 1.96390628965818425655e+00 3.54796147208515239013e-02 1.96452812362750472985e+00 3.54290948218644805023e-02 1.96457137733478925945e+00 3.54728010723536768545e-02 1.96452130330832686056e+00 3.60932535251877045779e-02 1.98160855911051858591e+00
18.700000 1.00000000000001332268e+00 1.83560513262294826287e-02 1.96389852426897038029e+00 3.54572801364190018369e-02 1.96460073221185771430e+00 3.54460363732790745273e-02 1.96455509114266324566e+00 3.53994346715239618928e-02 1.96454260257621160513e+00 3.61006991294439139040e-02 1.98164354816336141241e+00
18.800000 1.00000000000001465494e+00 1.83672092358564270631e-02 1.96388147674006319221e+00 3.54226759332617255338e-02 1.96460390137220186624e+00 3.54868937572715148487e-02 1.96451374817494839320e+00 3.53954643588808362531e-02 1.96457619559207374849e+00 3.61182133655563661345e-02 1.98163422146988810191e+00
18.900000 1.00000000000001687539e+00 1.84118441406086637280e-02 1.96387026475665216196e+00 3.54120583947530251367e-02 1.96453286604690902095e+00 3.55105123881583745193e-02 1.96448904822187619956e+00 3.54661780849459887244e-02 1.96458706935090710033e+00 3.61301184272328282376e-02 1.98159004018794648871e+00
19.000000 1.00000000000001887379e+00 1.84470854666882386197e-02 1.96387491391360535786e+00 3.54357467482847784956e-02 1.96445818771574209904e+00 3.54913375550744703002e-02 1.96450747668139458213e+00 3.55416522372308876787e-02 1.96456439088469814180e+00 3.61257627642951675839e-02 1.98155344603300132000e+00
19.100000 1.00000000000001865175e+00 1.84400832200328317068e-02 1.96389037024248280794e+00 3.54683791183233940170e-02 1.96445551719974464966e+00 3.54474430666144174618e-02 1.96455182769796232733e+00 3.55451548676316009256e-02 1.96453270320950013073e+00 3.61099452027563924683e-02 1.98155857617493214029e+00
19.200000 1.00000000000001620926e+00 1.83977577833078047298e-02 1.96390303529500842572e+00 3.54758350222511772976e-02 1.96452874213485695343e+00 3.54233588507888025321e-02 1.96457703282454509974e+00 3.54722689769229396206e-02 1.96452497268348569293e+00 3.60966837995783870752e-02 1.98160031262927827100e+00
19.300000 1.00000000000001265654e+00 1.83607022277861922643e-02 1.96390124144999922429e+00 3.54513231154559918523e-02 1.96460471357239474521e+00 3.54454204900572569792e-02 1.96455581566360226731e+00 3.53954408702559508715e-02 1.96454853916371696698e+00 3.60981708180909410810e-02 1.98163863262865436177e+00
19.400000 1.00000000000001176836e+00 1.83636329772164479113e-02 1.96388703746873893863e+00 3.54211063334130063507e-02 1.96460677139376982403e+00 3.54923258722893361639e-02 1.96450846822876434850e+00 3.53925417725957786041e-02 1.96457786630402964079e+00 3.61126401884309458645e-02 1.98163760946075617753e+00
19.500000 1.00000000000000865974e+00 1.84035576199142354714e-02 1.96387306509930259502e+00 3.54165657382119469787e-02 1.96453203535085263454e+00 3.55161693384593579736e-02 1.96448346510467963810e+00 3.54669439892075014087e-02 1.96458265425862066422e+00 3.61271418377215741691e-02 1.98159840166302658737e+00
19.600000 1.00000000000000976996e+00 1.84422426315249271545e-02 1.96387243531559807508e+00 3.54413700549592730615e-02 1.96445533018518858626e+00 3.54907841041355379130e-02 1.96450792036382737571e+00 3.55445306321863913057e-02 1.96455877147660151749e+00 3.61280606382799046594e-02 1.98155855459770147142e+00
19.700000 1.00000000000001065814e+00 1.84434743723160578244e-02 1.96388552436327623596e+00 3.54689026821974548453e-02 1.96445392500453630547e+00 3.54410303445871557870e-02 1.96455808104889095844e+00 3.55468034679720101821e-02 1.96453206413410996767e+00 3.61148124129947109551e-02 1.98155538216913096328e+00
19.800000 1.00000000000001354472e+00 1.84063730734378774856e-02 1.96390064123832708276e+00 3.54706887253676550475e-02 1.96452963650915046756e+00 3.54180105342318876649e-02 1.96458230752393703256e+00 3.54714135637792041256e-02 1.96453003843306683862e+00 3.60992525634290656322e-02 1.98159163783526759417e+00
19.900000 1.00000000000001532108e+00 1.83665777195134889699e-02 1.96390339513360245860e+00 3.54460999708082410975e-02 1.96460637550660233153e+00 3.54472267833854104424e-02 1.96455411911966604244e+00 3.53937403447115994659e-02 1.96455377696021438183e+00 3.60961856969862285305e-02 1.98163250276450764176e+00
20.000000 1.00000000000001265654e+00 1.83615359839140387943e-02 1.96389114429458033761e+00 3.54215704263675934538e-02 1.96460716870123230926e+00 3.54996201452649276509e-02 1.96450133631656331801e+00 3.53920867071494532619e-02 1.96457752791617856758e+00 3.61085054818963899215e-02 1.98163950402685307139e+00
20.100000 1.00000000000000976996e+00 1.83957039030275236458e-02 1.96387508357357631894e+00 3.54222293714984287627e-02 1.96453121149555087754e+00 3.55210895865908996005e-02 1.96447861555388114674e+00 3.54677594384591524102e-02 1.96457705538558324854e+00 3.61249561697110851965e-02 1.98160629552214473392e+00
20.200000 1.00000000000000821565e+00 1.84362064055561963860e-02 1.96387064173879477558e+00 3.54461108698263319128e-02 1.96445492643596852922e+00 3.54877257251467459476e-02 1.96451087435084748023e+00 3.55449837721757977427e-02 1.96455400367029242581e+00 3.61296994315654929064e-02 1.98156482759983432196e+00
20.300000 1.00000000000000643929e+00 1.84448254052181348506e-02 1.96388215931200371678e+00 3.54674699911211796510e-02 1.96445464755605470053e+00 3.54330376894654991426e-02 1.96456590882571080492e+00 3.55461417264016227291e-02 1.96453336406177436757e+00 3.61182141230144068689e-02 1.98155423130924090991e+00
20.400000 1.00000000000000532907e+00 1.84136909258212320972e-02 1.96389895122017765772e+00 3.54645956268788559163e-02 1.96453025441544260055e+00 3.54137481309449927980e-02 1.96458650190062922292e+00 3.54707771765739865444e-02 1.96453608104632970743e+00 3.61011070673807402120e-02 1.98158429248981104998e+00
20.500000 1.00000000000000199840e+00 1.83727595670154161822e-02 1.96390477696032905719e+00 3.54418736323665883869e-02 1.96460550208015694018e+00 3.54515765319019793278e-02 1.96454987124715563240e+00 3.53945481114688875746e-02 1.96455804762736407909e+00 3.60949455069276697872e-02 1.98162609873529471649e+00
20.600000 1.00000000000000177636e+00 1.83607649737957054348e-02 1.96389379257238272380e+00 3.54238755795965101769e-02 1.96460545380307172181e+00 3.55081760548440136804e-02 1.96449294460995615985e+00 3.53937418524274127751e-02 1.96457535970692642735e+00 3.61058153481630325632e-02 1.98164007549883480763e+00
20.700000 1.00000000000000111022e+00 1.83887062466097823965e-02 1.96387650731303242679e+00 3.54286183020337541727e-02 1.96453093152912794395e+00 3.55245949672185895585e-02 1.96447517315523478842e+00 3.54680868921419326090e-02 1.96457069910669313018e+00 3.61233756012526371904e-02 1.98161330688663661626e+00
20.800000 9.99999999999999555911e-01 1.84296724149746668497e-02 1.96386971454340875098e+00 3.54497630158877724549e-02 1.96445709872360918524e+00 3.54821432411740814161e-02 1.96451636073250157644e+00 3.55428850748684549421e-02 1.96455029462739494406e+00 3.61304976556939272392e-02 1.98157156997046857150e+00
20.900000 9.99999999999996669331e-01 1.84448335739757704466e-02 1.96388022519409455313e+00 3.54643386260458173820e-02 1.96445725262276726930e+00 3.54241323452868239752e-02 1.96457464913468204948e+00 3.55435945838032743560e-02 1.96453635605585885671e+00 3.61201948197317351807e-02 1.98155442304376405716e+00
21.000000 1.00000000000000022204e+00 1.84202196479883693880e-02 1.96389774849162535020e+00 3.54579939456673431941e-02 1.96453008484050029026e+00 3.54111978196868792956e-02 1.96458899239268047765e+00 3.54708714091768601007e-02 1.96454266454660553265e+00 3.61024620285048114532e-02 1.98157776487757852912e+00
21.100000 1.00000000000000244249e+00 1.83795489757631949623e-02 1.96390521244944893375e+00 3.54387993777851434407e-02 1.96460206041600815574e+00 3.54583775813693616308e-02 1.96454316208796520016e+00 3.53979004003119879229e-02 1.96456119531264206124e+00 3.60946260061672241637e-02 1.98161911739252638576e+00
21.200000 1.00000000000000333067e+00 1.83614751529827986698e-02 1.96389504750735466310e+00 3.54277141500407219410e-02 1.96460211481377888809e+00 3.55172723364542280988e-02 1.96448400971508863044e+00 3.53970282997473698061e-02 1.96457165955894996756e+00 3.61045110706254834820e-02 1.98163916739500534092e+00
21.300000 1.00000000000000621725e+00 1.83826698492968627907e-02 1.96387754042380047181e+00 3.54353057535025245395e-02 1.96453166552687008561e+00 3.55261217618170477284e-02 1.96447370117382513754e+00 3.54674560154686069335e-02 1.96456401238323707936e+00 3.61221990953825081161e-02 1.98161932801680262806e+00
21.400000 1.00000000000000532907e+00 1.84226938938616864594e-02 1.96386979058352340033e+00 3.54522325836379784136e-02 1.96446178634524315498e+00 3.54742396116993000121e-02 1.96452418004972795273e+00 3.55382937497934481286e-02 1.96454774053459613192e+00 3.61303180324699241277e-02 1.98157872461546991083e+00
21.500000 1.00000000000000399680e+00 1.84434661732834175030e-02 1.96387962481552968974e+00 3.54598630569748288210e-02 1.96446120487590603076e+00 3.54150783526581830474e-02 1.96458354467437334989e+00 3.55396880171602869147e-02 1.96454069693301391908e+00 3.61208466925786800261e-02 1.98155598640849128778e+00
21.600000 1.00000000000000222045e+00 1.84257900843488586773e-02 1.96389683764419720191e+00 3.54512924434749188141e-02 1.96452870904740661828e+00 3.54108512420647850161e-02 1.96458928779110642004e+00 3.54721183696142597364e-02 1.96454937924818384687e+00 3.61035110799593494946e-02 1.98157222304966973425e+00
21.700000 9.99999999999999222844e-01 1.83867097496587077188e-02 1.96390460450610238041e+00 3.54369087837010515729e-02 1.96459620562562697899e+00 3.54673194662820517875e-02 1.96453429955811009755e+00 3.54036447159431499898e-02 1.96456318488795100841e+00 3.60953257670620988873e-02 1.98161179693955680214e+00
21.800000 9.99999999999999666933e-01 1.83634772317639305417e-02 1.96389503639261997492e+00 3.54326939142917476944e-02 1.96459772249030395486e+00 3.55261167460780430405e-02 1.96447531756931570435e+00 3.54013848634387034986e-02 1.96456680806189853961e+00 3.61044701601251349921e-02 1.98163697257018767139e+00
21.900000 1.00000000000000022204e+00 1.83775696564006801870e-02 1.96387837293539369021e+00 3.54419104030563453245e-02 1.96453376900042653297e+00 3.55252622401283288389e-02 1.96447460793422146175e+00 3.54655055657242535005e-02 1.96455737833787513757e+00 3.61212377795119068957e-02 1.98162438614724423225e+00
22.000000 1.00000000000000088818e+00 1.84153783299891328495e-02 1.96387093528014111676e+00 3.54535487764152806855e-02 1.96446874243985236674e+00 3.54644255574470546044e-02 1.96453392382658376114e+00 3.55314534614161389725e-02 1.96454631593434836390e+00 3.61290927155202903909e-02 1.98158618367830241525e+00
22.100000 9.99999999999999111822e-01 1.84408497511659823231e-02 1.96388021062256390437e+00 3.54544635907965352550e-02 1.96446591100796030815e+00 3.54066764250309529150e-02 1.96459180114260978378e+00 3.55350053542317079192e-02 1.96454597704696221072e+00 3.61203126017931863689e-02 1.98155879245689670043e+00
22.200000 1.00000000000000133227e+00 1.84304066498469955315e-02 1.96389604332663458841e+00 3.54448404973686653774e-02 1.96452584002530783458e+00 3.54130219867725970495e-02 1.96458707302047241861e+00 3.54748119800298092330e-02 1.96455587279105725607e+00 3.61044287286262505221e-02 1.98156766099388081948e+00
22.300000 1.00000000000000133227e+00 1.83941339646188396773e-02 1.96390292183180381613e+00 3.54361161745468528084e-02 1.96458826844819633983e+00 3.54778963693266752299e-02 1.96452378712211506162e+00 3.54114533884724164148e-02 1.96456409775595286504e+00 3.60970789429432559192e-02 1.98160424600203266543e+00
22.400000 9.99999999999999000799e-01 1.83666583148856706054e-02 1.96389392246403149400e+00 3.54383772781176747957e-02 1.96459287685952310731e+00 3.55339146805317904199e-02 1.96446765612995233319e+00 3.54062208123808383475e-02 1.96456123312443753370e+00 3.61055336585198172195e-02 1.98163360667762011857e+00
22.500000 9.99999999999996447286e-01 1.83734272295772334271e-02 1.96387916472128742917e+00 3.54481221374823643466e-02 1.96453745053042250213e+00 3.55218025625618008534e-02 1.96447810881125217719e+00 3.54620193413267004168e-02 1.96455111076115951363e+00 3.61203321100673907518e-02 1.98162846179487206477e+00
22.600000 9.99999999999997557509e-01 1.84078735138918717085e-02 1.96387314616425090463e+00 3.54538509648804830987e-02 1.96447755683155378392e+00 3.54532917975827616131e-02 1.96454500330305426026e+00 3.55227715940034521891e-02 1.96454588595647594573e+00 3.61268208230707890682e-02 1.98159379905124666266e+00
22.700000 9.99999999999998223643e-01 1.84371367130486095431e-02 1.96388180741520379513e+00 3.54485864695955540937e-02 1.96447077572572248449e+00 3.53996962697097627970e-02 1.96459865524127863523e+00 3.55301332992201818195e-02 1.96455175898033784776e+00 3.61187640042136617891e-02 1.98156268588171569078e+00
22.800000 9.99999999999997779554e-01 1.84340726459623870104e-02 1.96389522451407283476e+00 3.54389060127463864647e-02 1.96452135062083055317e+00 3.54178151942863145285e-02 1.96458224083478505406e+00 3.54790880874257183453e-02 1.96456187327726761183e+00 3.61053560366925221925e-02 1.98156407277597335082e+00
22.900000 9.99999999999997002398e-01 1.84016767347779768016e-02 1.96390019749044775210e+00 3.54362338846856764207e-02 1.96457872866046678872e+00 3.54894408767310876041e-02 1.96451229020712814233e+00 3.54208502341344516617e-02 1.96456411633306204934e+00 3.60998562913498952098e-02 1.98159660928719505435e+00
23.000000 9.99999999999995337063e-01 1.83708555561778973109e-02 1.96389188849635609735e+00 3.54443197522549685585e-02 1.96458815260770514044e+00 3.55399355164325927992e-02 1.96446174991876887361e+00 3.54109691085232880514e-02 1.96455537157592963204e+00 3.61075221592079623201e-02 1.98162923530863532839e+00
23.100000 9.99999999999997335465e-01 1.83702260539723750965e-02 1.96388003786263798389e+00 3.54537202637428341956e-02 1.96454274936683237485e+00 3.55157487158355988921e-02 1.96448420010992053086e+00 3.54569488794254372710e-02 1.96454543485721355722e+00 3.61193594220450345245e-02 1.98163157446837345788e+00
23.200000 9.99999999999998889777e-01 1.84003222610462958964e-02 1.96387636056407188789e+00 3.54533697911584705365e-02 1.96448768809076024233e+00 3.54415668819751533691e-02 1.96455669177364211642e+00 3.55127854898351358326e-02 1.96454622585521310185e+00 3.61235608297316504456e-02 1.98160142846258047200e+00
23.300000 1.00000000000000022204e+00 1.84324925981451150092e-02 1.96388423093654740370e+00 3.54426658209188380488e-02 1.96447525552483748257e+00 3.53948117803852685403e-02 1.96460343856299002319e+00 3.55256090484296072063e-02 1.96455761502872339186e+00 3.61163824158101387507e-02 1.98156749828322653606e+00
23.400000 9.99999999999996447286e-01 1.84368078008989612349e-02 1.96389428106481900294e+00 3.54336606247690963367e-02 1.96451528878648762344e+00 3.54251119286309798517e-02 1.96457490772037091098e+00 3.54849084205064724262e-02 1.96456720418035590825e+00 3.61063941454330197822e-02 1.98156143532775197436e+00
23.500000 9.99999999999995670130e-01 1.84091911483982746678e-02 1.96389651992426572669e+00 3.54369949900993005953e-02 1.96456817607968714512e+00 3.55011752739866279227e-02 1.96450058458296172859e+00 3.54312504805498890148e-02 1.96456350072109509064e+00 3.61035739458439239313e-02 1.98158903285313270359e+00
23.600000 9.99999999999994337863e-01 1.83758950932040865389e-02 1.96388911841707702877e+00 3.54501064265018775434e-02 1.96458404733703040357e+00 3.55435754424027125498e-02 1.96445819775689467512e+00 3.54151371926411592805e-02 1.96454963325952070008e+00 3.61102539476218370451e-02 1.98162403512713680698e+00
23.700000 9.99999999999993449684e-01 1.83679382101855012688e-02 1.96388107070813777710e+00 3.54585830423405981571e-02 1.96454952844290064995e+00 3.55073296483661079992e-02 1.96449265529167549360e+00 3.54504214805853590242e-02 1.96454047751930049870e+00 3.61182397847873565278e-02 1.98163375587169743319e+00
23.800000 9.99999999999995226041e-01 1.83928727796256359650e-02 1.96388046619127942805e+00 3.54524007740132374167e-02 1.96449850839402295755e+00 3.54300598684269621441e-02 1.96456818206735195353e+00 3.55021171753592199027e-02 1.96454704763153631397e+00 3.61194202681435830304e-02 1.98160892485024064946e+00
23.900000 9.99999999999995115019e-01 1.84270959498543489274e-02 1.96388730387430565649e+00 3.54370894357975835254e-02 1.96447890713627781878e+00 3.53925421131006390230e-02 1.96460563621967621017e+00 3.55218724332336879823e-02 1.96456316100949024417e+00 3.61133435196667185174e-02 1.98157304830861646927e+00
24.000000 9.99999999999997113420e-01 1.84386482736099595325e-02 1.96389315669484121329e+00 3.54291757105383159354e-02 1.96450787654963887618e+00 3.54345747057571644478e-02 1.96456540891551645345e+00 3.54920608637713033695e-02 1.96457178857191983035e+00 3.61076012299278506501e-02 1.98155970848450135868e+00
24.100000 9.99999999999993671729e-01 1.84165315637179020924e-02 1.96389202098626403092e+00 3.54380828543827824939e-02 1.96455726238805339356e+00 3.55122724810731649203e-02 1.96448949487219692855e+00 3.54420102463439343210e-02 1.96456255873920571098e+00 3.61081050294386404764e-02 1.98158166083932596457e+00
24.200000 9.99999999999993671729e-01 1.83815957008805104522e-02 1.96388578197417706939e+00 3.54553838240077440203e-02 1.96458093808763667454e+00 3.55444098826256035806e-02 1.96445742066420736549e+00 3.54183500655905134091e-02 1.96454436946320498691e+00 3.61135602209293124498e-02 1.98161819011674533719e+00
24.300000 9.99999999999995226041e-01 1.83665211056601614115e-02 1.96388229668612557255e+00 3.54626879480759577001e-02 1.96455748302567645425e+00 3.54969835878564399234e-02 1.96450303832254680181e+00 3.54427318316627784633e-02 1.96453626713595497222e+00 3.61169374469108364623e-02 1.98163505290953412263e+00
24.400000 9.99999999999998112621e-01 1.83856679293541956655e-02 1.96388531505445906866e+00 3.54512730289251384863e-02 1.96450935486576971911e+00 3.54195962455479268494e-02 1.96457865088906702411e+00 3.54914209484541651185e-02 1.96454803181287362968e+00 3.61145421425338938870e-02 1.98161614708300160004e+00
24.500000 9.99999999999998556710e-01 1.84211279339184172410e-02 1.96389086929700651396e+00 3.54321700521748605972e-02 1.96448142626265864763e+00 3.53932064246295155496e-02 1.96460493137631364569e+00 3.55192277268318937211e-02 1.96456808498931967399e+00 3.61098037933588258963e-02 1.98157915214383462121e+00
24.600000 9.99999999999998223643e-01 1.84396434672169963476e-02 1.96389183903941266784e+00 3.54254270230503834349e-02 1.96449949331794626595e+00 3.54456717891297318213e-02 1.96455427418895212099e+00 3.55001754571111632908e-02 1.96457564497001779813e+00 3.61089924479850651884e-02 1.98155883829919132744e+00
24.700000 9.99999999999994559907e-01 1.84235596637230721051e-02 1.96388686123927502791e+00 3.54391653146673007990e-02 1.96454664507379517246e+00 3.55219251619567355505e-02 1.96447982650106456326e+00 3.54524804063905754625e-02 1.96456161314424582187e+00 3.61132939748389919510e-02 1.98157462952001561796e+00
24.800000 9.99999999999994004796e-01 1.83877765865894000907e-02 1.96388202233674458164e+00 3.54598852596491667666e-02 1.96457904825602369669e+00 3.55422316056276596519e-02 1.96445962447517064042e+00 3.54203825118937359884e-02 1.96453984774057532903e+00 3.61172975638604717985e-02 1.98161188366385498938e+00
24.900000 9.99999999999994448885e-01 1.83659196953815558040e-02 1.96388370638978315696e+00 3.54661019665386892386e-02 1.96456616547977125364e+00 3.54853243553710784308e-02 1.96451473710978175014e+00 3.54343186960064393531e-02 1.96453274218745055357e+00 3.61154587271386648406e-02 1.98163552539276577313e+00
25.000000 9.99999999999995559108e-01 1.83788392131133786200e-02 1.96389073945196046544e+00 3.54503133874234932499e-02 1.96451958622609468286e+00 3.54109490207754409874e-02 1.96458732744728648001e+00 3.54813288034718718467e-02 1.96454886130740735695e+00 3.61090892919738865041e-02 1.98162296585050157205e+00
25.100000 9.99999999999996003197e-01 1.84147663828760077553e-02 1.96389480078294997867e+00 3.54281236282152564576e-02 1.96448267351055827490e+00 3.53968948462240612374e-02 1.96460123453073309818e+00 3.55178178716373735280e-02 1.96457216854092053815e+00 3.61058904029506189115e-02 1.98158562950292771454e+00
25.200000 9.99999999999994226840e-01 1.84398547192329703703e-02 1.96389035612979578893e+00 3.54223080504902643195e-02 1.96449064532397743577e+00 3.54577177183932473747e-02 1.96454218746720354893e+00 3.55087545978651428213e-02 1.96457887423722943332e+00 3.61105432606514398231e-02 1.98155875849517038034e+00
25.300000 9.99999999999993338662e-01 1.84301515466827395273e-02 1.96388121274459215293e+00 3.54399294356144492490e-02 1.96453693432534937102e+00 3.55294107247518392567e-02 1.96447229971646808444e+00 3.54620605635934532662e-02 1.96456096721661621629e+00 3.61189733136331597718e-02 1.98156806041271482677e+00
25.400000 9.99999999999997335465e-01 1.83942639141127795011e-02 1.96387794744552657278e+00 3.54634480013407762944e-02 1.96457842965276663350e+00 3.55370699948711066263e-02 1.96446478003249125344e+00 3.54211774906893206438e-02 1.96453623485753414712e+00 3.61213565199918623660e-02 1.98160529209067615142e+00
25.500000 9.99999999999998001599e-01 1.83660676876325895668e-02 1.96388525355263143801e+00 3.54689652485978765273e-02 1.96457502103862013954e+00 3.54730949672326656419e-02 1.96452700993636231175e+00 3.54257284393466806427e-02 1.96452976823511349380e+00 3.61138462281919703223e-02 1.98163524466627971599e+00
25.600000 9.99999999999998445688e-01 1.83725002489967884078e-02 1.96389656934821577039e+00 3.54498122536389820292e-02 1.96452863522556797626e+00 3.54047754182915050403e-02 1.96459355670334590016e+00 3.54723980789394127688e-02 1.96454925517842604599e+00 3.61032275287370973960e-02 1.98162927001584221465e+00
25.700000 9.99999999999997779554e-01 1.84081801628079300137e-02 1.96389900877629886011e+00 3.54250572741134431287e-02 1.96448268513403578872e+00 3.54034584572089569554e-02 1.96459469361489524886e+00 3.55176134482784247592e-02 1.96457529901072991407e+00 3.61016949271465853455e-02 1.98159230919446316399e+00
25.800000 1.00000000000000022204e+00 1.84393536397399020188e-02 1.96388876905996045963e+00 3.54196506266328051127e-02 1.96448192416513811587e+00 3.54699263599529759916e-02 1.96452993372898010449e+00 3.55172148727613545827e-02 1.96458163876168034889e+00 3.61121964679903609263e-02 1.98155939231718281057e+00
25.900000 9.99999999999998445688e-01 1.84362040583110099734e-02 1.96387524099906607411e+00 3.54401151101021646972e-02 1.96452864250785586009e+00 3.55341518573931910985e-02 1.96446748971558937669e+00 3.54702481525509538685e-02 1.96456087224916986500e+00 3.61249812266662209681e-02 1.98156205412329566862e+00
26.000000 9.99999999999998001599e-01 1.84008954324386443668e-02 1.96387362642682616887e+00 3.54660201832681307166e-02 1.96457895968813933685e+00 3.55291914183591753251e-02 1.96447262277147949305e+00 3.54208493562786358444e-02 1.96453358943644507129e+00 3.61256653793465484781e-02 1.98159857990739984857e+00
26.100000 9.99999999999996780353e-01 1.83668884765412487869e-02 1.96388686485848951158e+00 3.54714668009362896206e-02 1.96458343401877510992e+00 3.54611094814568303391e-02 1.96453904370232623755e+00 3.54175687747227546653e-02 1.96452716208510547169e+00 3.61121693666506121678e-02 1.98163429243501565402e+00
26.200000 9.99999999999995448086e-01 1.83667411700323447710e-02 1.96390264935385383538e+00 3.54499918886989756617e-02 1.96453605524248353653e+00 3.54015612337032770096e-02 1.96459685457337740466e+00 3.54650661894411675656e-02 1.96454899922867398665e+00 3.60971089579406809178e-02 1.98163497216181938576e+00
26.300000 9.99999999999995003996e-01 1.84015250627750717727e-02 1.96390344189534316044e+00 3.54229679435490441008e-02 1.96448166775267241135e+00 3.54125186970815700183e-02 1.96458568467207017605e+00 3.55184172594344566010e-02 1.96457747157765805213e+00 3.60972718031452310949e-02 1.98159903333625697641e+00
26.400000 9.99999999999991673327e-01 1.84382212539339652990e-02 1.96388716054583079007e+00 3.54172522509177203909e-02 1.96447395710055183748e+00 3.54814730396961763859e-02 1.96451833670245901153e+00 3.55249368874826706999e-02 1.96458413529429276601e+00 3.61138733318104934722e-02 1.98156065359303257267e+00
26.500000 9.99999999999991673327e-01 1.84416402125394500444e-02 1.96386908843606611264e+00 3.54395438927319131328e-02 1.96452214242157396917e+00 3.55357659576495052423e-02 1.96446577779110143069e+00 3.54766787908776803917e-02 1.96456149974390159585e+00 3.61311779154349713150e-02 1.98155668483813007796e+00
26.600000 9.99999999999992783550e-01 1.84075236056424687558e-02 1.96386909168105305845e+00 3.54676566144822846827e-02 1.96458035434776756567e+00 3.55190803841557642406e-02 1.96448267124571573916e+00 3.54196718173096780635e-02 1.96453186538938440187e+00 3.61301883077758956286e-02 1.98159189660675627565e+00
26.700000 9.99999999999994559907e-01 1.83682960218196009161e-02 1.96388845280174284547e+00 3.54738149641038308379e-02 1.96459077997179987207e+00 3.54501882202688453627e-02 1.96455001880347457366e+00 3.54104564201028274018e-02 1.96452472126794530638e+00 3.61105117194602670549e-02 1.98163275980931530285e+00
26.800000 9.99999999999999222844e-01 1.83616245207460226929e-02 1.96390885314042518139e+00 3.54509813366338313867e-02 1.96454155628329396599e+00 3.54015785824627129963e-02 1.96459694973266252305e+00 3.54596158753258464125e-02 1.96454796998751257675e+00 3.60908578621139675136e-02 1.98164001267880363066e+00
26.900000 9.99999999999998778755e-01 1.83949411160232965956e-02 1.96390808275900075053e+00 3.54217523238713749567e-02 1.96447997773826776857e+00 3.54234951674787176823e-02 1.96457478467150825630e+00 3.55198836994109687359e-02 1.96457878017440346063e+00 3.60926423083726549690e-02 1.98160566004165761278e+00
27.000000 9.99999999999998445688e-01 1.84365474470206784641e-02 1.96388562066579996923e+00 3.54149069446777486903e-02 1.96446735356994728328e+00 3.54915604479606044963e-02 1.96450819295289091926e+00 3.55313188372968838391e-02 1.96458656413604759727e+00 3.61154875092882451937e-02 1.98156244748910359554e+00
27.100000 9.99999999999997890576e-01 1.84464126237789266538e-02 1.96386286210253468987e+00 3.54381394908979199809e-02 1.96451763791017941507e+00 3.55340991227961755516e-02 1.96446731768649818228e+00 3.54811544287800054165e-02 1.96456292198912807478e+00 3.61374576324153887197e-02 1.98155199701298534443e+00
27.200000 9.99999999999996114219e-01 1.84140170450991860762e-02 1.96386434636384166197e+00 3.54685037063260585888e-02 1.96458219578980108899e+00 3.55074032592850169499e-02 1.96449426289443329630e+00 3.54180516853154284118e-02 1.96453092591278855039e+00 3.61349181917010806031e-02 1.98158537515138899465e+00
27.300000 9.99999999999995670130e-01 1.83701954417708479550e-02 1.96388993009566314996e+00 3.54762059353935510497e-02 1.96459647937980541599e+00 3.54410916189145247523e-02 1.96455917544562197463e+00 3.54049634920684391792e-02 1.96452225516952228013e+00 3.61089570199588927313e-02 1.98163074640130232318e+00
27.400000 9.99999999999995559108e-01 1.83571827586462565929e-02 1.96391509308102696352e+00 3.54528012667355077459e-02 1.96454502681954767951e+00 3.54048606454052117165e-02 1.96459380851602238849e+00 3.54561544695816410755e-02 1.96454614909242497589e+00 3.60845612052375572243e-02 1.98164436214534678271e+00
27.500000 9.99999999999994226840e-01 1.83885513206485350091e-02 1.96391293894106278017e+00 3.54212265705815682049e-02 1.96447808656927214166e+00 3.54356506944827204242e-02 1.96456272667548681454e+00 3.55215522280858050919e-02 1.96457939900960387725e+00 3.60878030699347540633e-02 1.98161206492084462916e+00
27.600000 9.99999999999995115019e-01 1.84344307518004221769e-02 1.96388423182413252022e+00 3.54124360414366928795e-02 1.96446265220314830735e+00 3.54994839588891261672e-02 1.96450020640641453973e+00 3.55358294314779901701e-02 1.96458909858447849928e+00 3.61169597108164652788e-02 1.98156467108738243432e+00
27.700000 9.99999999999994892974e-01 1.84505046682521128831e-02 1.96385662736208521650e+00 3.54359372084215029641e-02 1.96451514945306815463e+00 3.55292422524256523708e-02 1.96447201978756536001e+00 3.54836568692614012788e-02 1.96456510315634047537e+00 3.61437549725878368156e-02 1.98154800427002197871e+00
27.800000 9.99999999999991007194e-01 1.84202609981988681132e-02 1.96385937536407451098e+00 3.54687758203543201940e-02 1.96458397225571523848e+00 3.54949570723402177408e-02 1.96450660485570072211e+00 3.54164902533083483793e-02 1.96453056594308494986e+00 3.61398660511507222037e-02 1.98157913138608021697e+00
27.900000 9.99999999999990452082e-01 1.83724838189228030505e-02 1.96389122346817157627e+00 3.54787943230666300010e-02 1.96460004832706092159e+00 3.54344579894680170029e-02 1.96456587592411180410e+00 3.54015668533262592432e-02 1.96451961437284872147e+00 3.61075756292677518822e-02 1.98162835929375380495e+00
28.000000 9.99999999999989008792e-01 1.83534180647923518548e-02 1.96392132354689907814e+00 3.54553606563890733039e-02 1.96454654049756149981e+00 3.54111948670160908703e-02 1.96458764159255094839e+00 3.54546076768718285144e-02 1.96454362636687540622e+00 3.60782653421623106249e-02 1.98164802138885831617e+00
28.100000 9.99999999999986788346e-01 1.83824615617093310715e-02 1.96391803050027635713e+00 3.54211533478493573179e-02 1.96447653777821829024e+00 3.54481455464665667909e-02 1.96455034612138601524e+00 3.55228892327647191585e-02 1.96457955661844652084e+00 3.60827381464134538946e-02 1.98161814114644307949e+00
28.200000 9.99999999999986233234e-01 1.84319777319477476341e-02 1.96388305515000594070e+00 3.54097154546215570070e-02 1.96446027482271090570e+00 3.55046870134968703403e-02 1.96449493306279254767e+00 3.55380537518019679055e-02 1.96459185787940637802e+00 3.61182310891824259746e-02 1.98156721404404678744e+00
28.300000 9.99999999999985678123e-01 1.84539291246221606735e-02 1.96385040847885417037e+00 3.54330814477573502463e-02 1.96451451510022101488e+00 3.55215280762562896077e-02 1.96447955402043050732e+00 3.54843468094767078291e-02 1.96456790179509721561e+00 3.61500443555282172103e-02 1.98154469079172779189e+00
28.400000 9.99999999999980127008e-01 1.84261572369944191807e-02 1.96385415834880983077e+00 3.54687258649791434251e-02 1.96458512446492128412e+00 3.54826085799870571957e-02 1.96451883450429054534e+00 3.54155378087074104720e-02 1.96453054070406296638e+00 3.61450483052092180758e-02 1.98157326418201784612e+00
28.500000 9.99999999999979793941e-01 1.83750512686670329499e-02 1.96389228570478002744e+00 3.54816686798964872618e-02 1.96460113998128771406e+00 3.54307513685175740070e-02 1.96456965667083705007e+00 3.54006068669670617699e-02 1.96451671480516765200e+00 3.61064128145012624982e-02 1.98162571183939983932e+00
28.600000 9.99999999999982014387e-01 1.83503043624027376013e-02 1.96392753829482580308e+00 3.54584649612241231686e-02 1.96454634609630218733e+00 3.54201359837099105654e-02 1.96457889097059923422e+00 3.54547294429575429731e-02 1.96454059193787666793e+00 3.60719785434965092841e-02 1.98165101940659438284e+00
28.700000 9.99999999999979682919e-01 1.83767613658931266984e-02 1.96392337672823691364e+00 3.54212723064460666134e-02 1.96447589542409706276e+00 3.54601050100633100048e-02 1.96453851353717423578e+00 3.55233388183800666282e-02 1.96457950604065167965e+00 3.60774319558396922014e-02 1.98162379881323191810e+00
28.800000 9.99999999999980127008e-01 1.84293017659487856630e-02 1.96388212050559340938e+00 3.54066963711886020794e-02 1.96446048785769966649e+00 3.55068104464162440093e-02 1.96449273176882299730e+00 3.55377314634627641809e-02 1.96459488667943715789e+00 3.61192732121441081872e-02 1.98156995992928375294e+00
28.900000 9.99999999999978683718e-01 1.84567247352918455128e-02 1.96384419467371218460e+00 3.54298121847447661237e-02 1.96451540840736393889e+00 3.55115083178829948896e-02 1.96448937253733246777e+00 3.54835463847115797908e-02 1.96457108382959644288e+00 3.61563340502902216822e-02 1.98154201487907744017e+00
29.000000 9.99999999999982236432e-01 1.84316234541110068879e-02 1.96384868215961838622e+00 3.54686140580008288370e-02 1.96458509926052693473e+00 3.54712262983870110777e-02 1.96453008732581579920e+00 3.54157403933553285857e-02 1.96453059646001060301e+00 3.61504746375322302820e-02 1.98156785595265816369e+00
29.100000 9.99999999999982458476e-01 1.83777823917661564668e-02 1.96389310411074169416e+00 3.54848346623545321532e-02 1.96459957719420819089e+00 3.54302211382340748180e-02 1.96457026847396032387e+00 3.54022551324877782220e-02 1.96451355452085429931e+00 3.61054802452558804005e-02 1.98162292213012913855e+00
29.200000 9.99999999999983346655e-01 1.83477914877560321916e-02 1.96393376238925787547e+00 3.54618343294744106653e-02 1.96454484225112624429e+00 3.54310384381813989196e-02 1.96456819782687897025e+00 3.54561266083377180092e-02 1.96453731856331836880e+00 3.60656789425530394100e-02 1.98165340916313170716e+00
29.300000 9.99999999999985345056e-01 1.83715250792654133383e-02 1.96392898340563659687e+00 3.54213311490570517681e-02 1.96447669061025176340e+00 3.54706872151658372805e-02 1.96452806679250069344e+00 3.55223762077042301555e-02 1.96457949400935305562e+00 3.60718817169255329125e-02 1.98162896381412534375e+00
29.400000 9.99999999999986899368e-01 1.84265209959564163489e-02 1.96388142004859234113e+00 3.54034179470893023423e-02 1.96446337722463426623e+00 3.55057229633531923341e-02 1.96449373384955872091e+00 3.55347816230715887742e-02 1.96459814255820086615e+00 3.61200944455231862107e-02 1.98157278834400729650e+00
29.500000 9.99999999999982569499e-01 1.84589511413038587229e-02 1.96383795010967276973e+00 3.54264425574742219949e-02 1.96451737020711525439e+00 3.54999124990267311830e-02 1.96450075056760598002e+00 3.54817080718910701775e-02 1.96457434458853441583e+00 3.61626561424811393541e-02 1.98153991411490082442e+00
29.600000 9.99999999999983457677e-01 1.84365923668649810130e-02 1.96384295204373748867e+00 3.54686774758302195143e-02 1.96458340201948988835e+00 3.54616120465282569363e-02 1.96453956526840300967e+00 3.54175873719195025147e-02 1.96453050080232349828e+00 3.61561371580004509152e-02 1.98156297344690246476e+00
29.700000 9.99999999999984123811e-01 1.83805582739967332540e-02 1.96389370547439234826e+00 3.54882067488642427566e-02 1.96459536994216055206e+00 3.54328794955433845626e-02 1.96456769889845772603e+00 3.54064975929992975523e-02 1.96451022143333497993e+00 3.61047512261509773168e-02 1.98162011091408207797e+00
29.800000 9.99999999999984345855e-01 1.83458110712558034039e-02 1.96394004052327164622e+00 3.54651295861476145710e-02 1.96454253956870239506e+00 3.54431048504752210793e-02 1.96455635447063747812e+00 3.54582959803752748029e-02 1.96453413608443616667e+00 3.60593261384156080207e-02 1.98165526172632255886e+00
29.900000 9.99999999999986122212e-01 1.83668131751762303550e-02 1.96393483216547437564e+00 3.54211146800107040677e-02 1.96447937094920388468e+00 3.54791486243220197117e-02 1.96451974573306364924e+00 3.55195583295874819929e-02 1.96457973185959344775e+00 3.60661078638972662502e-02 1.98163357661967665102e+00
30.000000 9.99999999999985345056e-01 1.84237555229550126201e-02 1.96388090605212983775e+00 3.54000110417027336052e-02 1.96446883833914531792e+00 3.55015339775826901936e-02 1.96449783046729864466e+00 3.55293119514940927695e-02 1.96460149282510854185e+00 3.61207420793220393418e-02 1.98157557774325376876e+00
