# tag norm j_0
7.600000 1.00000000000002176037e+00 1.05782848124393896727e-01
7.600000 1.00000000000002176037e+00 1.28452273097494820003e-02
7.600000 1.00000000000002176037e+00 4.00339139030324239754e-02
7.600000 1.00000000000002176037e+00 1.57517712200016986313e-02
7.600000 1.00000000000002176037e+00 4.79540905899632011189e-02
7.600000 1.00000000000002176037e+00 1.50408298408589054251e-02
7.600000 1.00000000000002176037e+00 4.46017826877239467742e-02
7.600000 1.00000000000002176037e+00 1.56573171174540295980e-02
7.600000 1.00000000000002176037e+00 4.45117412047963609267e-02
7.600000 1.00000000000002176037e+00 1.56672772185584771587e-02
7.600000 1.00000000000002176037e+00 4.45255330425443351938e-02
7.600000 1.00000000000002176037e+00 1.56774542952727094502e-02
7.600000 1.00000000000002176037e+00 4.46549735835173877696e-02
7.600000 1.00000000000002176037e+00 1.50655961145286319131e-02
7.600000 1.00000000000002176037e+00 4.79925129057642008146e-02
7.600000 1.00000000000002176037e+00 1.58432009529623218924e-02
7.600000 1.00000000000002176037e+00 4.02762110238932477535e-02
7.600000 1.00000000000002176037e+00 1.26245289391009006541e-02
7.600000 1.00000000000002176037e+00 1.05624036512568589274e-01
