# tag norm j_0
9.200000 1.00000000000002287059e+00 2.24858737620662163526e-01
9.200000 1.00000000000002287059e+00 3.68816462691595944867e-02
9.200000 1.00000000000002287059e+00 5.53060806250690456531e-02
9.200000 1.00000000000002287059e+00 3.42235789679450480572e-02
9.200000 1.00000000000002287059e+00 9.28656820554906586862e-02
9.200000 1.00000000000002287059e+00 3.01553666895797919945e-02
9.200000 1.00000000000002287059e+00 7.98547494194744578166e-02
9.200000 1.00000000000002287059e+00 3.28824830382360225323e-02
9.200000 1.00000000000002287059e+00 8.15435495959518225062e-02
9.200000 1.00000000000002287059e+00 3.21339862105578105700e-02
9.200000 1.00000000000002287059e+00 8.16665508885910662595e-02
9.200000 1.00000000000002287059e+00 3.29844306426177319436e-02
9.200000 1.00000000000002287059e+00 8.03260215197063309756e-02
9.200000 1.00000000000002287059e+00 3.02850176042697878664e-02
9.200000 1.00000000000002287059e+00 9.34207381294870631283e-02
9.200000 1.00000000000002287059e+00 3.46944017347344466073e-02
9.200000 1.00000000000002287059e+00 5.66790499968467531566e-02
9.200000 1.00000000000002287059e+00 3.64843053070463066434e-02
9.200000 1.00000000000002287059e+00 2.26513935248629977304e-01
