# tag norm BO
1 9.99999999999998334665e-01 -3.34064485040240499725e-02
2 1.00000000000000177636e+00 1.47122423370556476563e-02
3 9.99999999999999888978e-01 3.14649426379173535739e-02
4 1.00000000000000643929e+00 2.96893928544725745067e-02
5 9.99999999999998223643e-01 3.15894211772638072722e-02
6 9.99999999999999888978e-01 9.60331177429709151316e-03
7 1.00000000000000621725e+00 -2.88516343685163694638e-03
8 9.99999999999995559108e-01 4.80710176454245390748e-03
9 9.99999999999997779554e-01 1.69292423552223764149e-02
10 1.00000000000000222045e+00 3.12071017561179261945e-02
11 9.99999999999995226041e-01 3.91426429756955018835e-02
12 1.00000000000000599520e+00 3.21250806420015980192e-02
13 9.99999999999999111822e-01 -6.54506309002738945885e-03
14 1.00000000000000932587e+00 -5.36628313002735363169e-02
15 9.99999999999998889777e-01 -6.87297509471468948128e-02
16 1.00000000000000666134e+00 -6.12128716357222060762e-02
17 1.00000000000000777156e+00 -4.97072005551902479370e-02
18 1.00000000000000155431e+00 -3.62644844238411770410e-02
19 1.00000000000000222045e+00 -2.01531874272458909336e-02
20 9.99999999999998667732e-01 -3.42539796961986676635e-03
21 1.00000000000000111022e+00 6.18716071508977269455e-03
22 1.00000000000000421885e+00 5.87783967424701774690e-03
23 9.99999999999996780353e-01 5.79904482435538316115e-03
24 9.99999999999997557509e-01 4.66645457519540562963e-03
25 9.99999999999994892974e-01 3.89583360062418452424e-03
26 9.99999999999998667732e-01 1.09591379826126517072e-02
27 1.00000000000000177636e+00 2.32464439809515859003e-02
28 1.00000000000000599520e+00 1.87449332984182710782e-02
29 9.99999999999999222844e-01 1.21356453920124646162e-02
30 1.00000000000000444089e+00 1.00599595264336226508e-02
31 1.00000000000000000000e+00 9.03858795683993611336e-03
32 1.00000000000000577316e+00 3.66118683293479435514e-02
33 1.00000000000000643929e+00 1.59508175491431605786e-02
34 9.99999999999993560706e-01 -1.92772107971415050665e-02
35 9.99999999999997890576e-01 -3.41768502836460458250e-02
36 1.00000000000000000000e+00 -3.43958566898089485031e-02
37 1.00000000000000066613e+00 -2.73003845634514595575e-02
38 1.00000000000000222045e+00 -8.88470509031464086847e-03
39 1.00000000000000888178e+00 1.21467852832579728539e-02
40 1.00000000000000488498e+00 4.27105123977843392780e-02
41 1.00000000000000022204e+00 4.79041231638397332904e-02
42 9.99999999999997890576e-01 4.30180497519052976174e-02
43 1.00000000000000266454e+00 3.31077510901521057662e-02
44 1.00000000000000732747e+00 4.45484577216904292785e-03
45 9.99999999999996447286e-01 -2.10450820542078254061e-02
46 9.99999999999996891376e-01 -2.93899069715802679914e-02
47 1.00000000000000222045e+00 -2.21473949993936242153e-02
48 1.00000000000000488498e+00 -4.42100315538961844558e-03
49 1.00000000000000088818e+00 2.16492685744017858418e-02
50 1.00000000000000577316e+00 6.09035690162611914600e-02
51 1.00000000000000199840e+00 5.89340405588762855649e-02
52 1.00000000000000777156e+00 4.73673177301744477430e-02
53 9.99999999999999333866e-01 2.91318158331485208001e-02
54 9.99999999999984234833e-01 -2.57490760347720490375e-02
55 1.00000000000000155431e+00 -3.22976915868578989821e-02
56 1.00000000000000710543e+00 -1.93473036013382324039e-02
57 9.99999999999992783550e-01 1.43062357978832716508e-03
58 9.99999999999998445688e-01 1.39091795487779557039e-01
59 9.99999999999992672528e-01 2.16711343801301081768e-01
60 1.00000000000000066613e+00 2.22814137644320536813e-01
61 1.00000000000000044409e+00 2.21729425399720181389e-01
62 1.00000000000000621725e+00 2.20903254204341314981e-01
63 9.99999999999995670130e-01 2.20589130252935500254e-01
64 9.99999999999986233234e-01 2.20488970463762090635e-01
65 9.99999999999998445688e-01 2.20467269353470912696e-01
66 1.00000000000000865974e+00 2.20457466462722406764e-01
67 1.00000000000000111022e+00 2.20453736280248696611e-01
68 9.99999999999985567101e-01 2.20451104586349255765e-01
69 1.00000000000000155431e+00 2.20450055438883490977e-01
70 9.99999999999990674127e-01 2.20449414552783828913e-01
