# tag norm n_hub[0] n_hub[1] n_hub[2] n_hub[3] n_hub[4] n_hub[5] n_hub[6] n_hub[7] n_hub[8] n_hub[9] n_hub[10] n_hub[11] n_hub[12] n_hub[13] n_hub[14] n_hub[15] n_hub[16] n_hub[17] n_hub[18] n_hub[19] n_hub[20] n_hub[21] n_hub[22] n_hub[23] n_hub[24] n_hub[25] n_hub[26] n_hub[27] n_hub[28] n_hub[29] n_hub[30] n_hub[31]
1 1.00000000000000000000e+00 1.55079459420478293907e+00 1.26784969510206635412e+00 1.40943435226833391205e+00 1.53160441780301681547e+00 1.20096313064536408532e+00 1.25142255007845171200e+00 1.00601358415049668693e+00 1.18195627282812076864e+00 9.47428836200003510193e-01 1.26404343388335571596e+00 1.16904910301891673541e+00 1.15085684199632343194e+00 1.24357695126259315543e+00 7.08322329482323875816e-01 1.15006042705378574986e+00 8.61365753621911922622e-01 1.22762623557286665310e+00 1.14024417197135341517e+00 9.41179037253633943294e-01 1.20822495825401077241e+00 1.01234789376520106785e+00 6.71763264968730511306e-01 8.23390038882688690691e-01 8.60366102193872217541e-01 8.67465079079962175790e-01 4.88819625200327734227e-01 9.14138811660615169252e-01 8.14568540626471659927e-01 1.31817322092132871436e-01 9.99027764595161293926e-01 5.51485364303062365610e-03 9.98764026640069690899e-01
2 1.00000000000000000000e+00 9.99406577679493146604e-01 1.19905183501351109143e+00 7.83623774844808052009e-01 1.14262664206500641484e+00 8.34269476905199147687e-01 1.49806867408506549921e+00 7.28310813115087274383e-01 1.81696559687834868768e+00 1.00491506728021162687e+00 1.99100993475689103107e+00 1.00623302236333356241e+00 1.99218917025288178024e+00 1.00325596442488729210e+00 1.00620999780125885970e+00 9.58300393699978658724e-01 1.12780408676506471721e+00 2.30411163991272288643e-01 1.07797963672926155887e+00 8.37625345317874026030e-01 1.53598414585411258138e+00 8.92321577117042186167e-01 1.01932616102812834136e+00 9.64511571146520529929e-01 1.27643764696839978612e+00 9.83019205461723166728e-01 1.07176012888024496661e+00 2.07461477402341269716e-02 9.95180082931504395027e-01 5.16732867248465791571e-03 9.94827685769861913556e-01 4.93052421845554915414e-03 9.97530620241525611824e-01
3 1.00000000000000000000e+00 9.49584673145126956229e-01 1.25939468539347498854e+00 7.72144714900388495771e-01 1.28927695517306850626e+00 7.45499609132143414847e-01 1.50145215122741348956e+00 7.57867951904379832939e-01 1.72730338433941055243e+00 1.00230342671803929200e+00 1.99319435178018156130e+00 1.00388638385176842682e+00 1.99080885612255720218e+00 1.00485352046503617629e+00 1.10699846037900062612e+00 7.46934785460317662853e-01 1.19393103395699284874e+00 9.23043129783351345985e-01 1.23757051434942755286e+00 7.18702038306884061214e-01 1.16225761787179515672e+00 8.78960548497981442040e-01 1.05250949755269407326e+00 8.65100270327814557803e-01 1.02882597202637637857e+00 7.28331497390007687187e-01 1.04265266430491609917e+00 2.32291393939906193333e-01 1.04627124481849742565e+00 3.83665937756211897214e-02 9.96858235179087226463e-01 5.28176514908164362883e-03 9.97542072777248267634e-01
4 1.00000000000000000000e+00 9.24856257319012664553e-01 1.31478260664737933716e+00 7.76372553845354751445e-01 1.41939207460176985975e+00 7.29774918547080542197e-01 1.57017683333800195378e+00 7.35912025283098181205e-01 1.55787244359810062022e+00 9.82479243130803592265e-01 1.98632495892732752196e+00 1.00395836677969607642e+00 1.99089517626847833931e+00 1.00265977191695165871e+00 1.14934355370576479771e+00 7.48868869610228582445e-01 1.24384826859440256186e+00 8.03791875813629208558e-01 1.20945979117132607072e+00 7.47551091243007781451e-01 1.19890119136869044425e+00 8.32882943793827212886e-01 1.06685044505651682734e+00 8.15992580264410682922e-01 1.01187712209197311353e+00 3.10001017253765331905e-01 1.06455171391907588152e+00 3.92161164103449810803e-01 1.15417140335579904153e+00 2.13271852458651628437e-01 1.02232685524725863679e+00 2.05451419840144942908e-02 9.98145888761095445574e-01
5 1.00000000000000000000e+00 9.12488120916647105219e-01 1.33643625687997280593e+00 7.92434235526482844136e-01 1.49244704254616289418e+00 7.30288431619197986322e-01 1.59432855865316880362e+00 7.85463141027986977427e-01 1.54652977741523045552e+00 9.13657492571037788132e-01 1.90068866051459361977e+00 9.83577375967330969075e-01 1.95179069653383319149e+00 9.78685176891654462494e-01 1.21884162334938617178e+00 7.39589994015472762534e-01 1.24365194172485060697e+00 7.53286849621247145414e-01 1.21021276818152023758e+00 7.44065898103998923929e-01 1.21800022075325586890e+00 7.98878526103096398003e-01 1.08341780364826512084e+00 8.25990258883707917370e-01 1.01627926892389885971e+00 2.69466676400257398871e-01 1.07891603903625998839e+00 3.67721809015312983693e-01 1.16316284931002433822e+00 2.61319686443173160306e-01 1.04055785876747530772e+00 4.78630008690311622988e-02 9.99961959786528575833e-01
6 1.00000000000000000000e+00 9.07345607794729835938e-01 1.36010535109892760630e+00 7.90476492216618975561e-01 1.51955637758423556249e+00 7.37352227866782894417e-01 1.56717786597092856304e+00 7.86955319270177366953e-01 1.47591531063933589785e+00 8.88144861866009271978e-01 1.68272419810544682228e+00 7.45071292626035330819e-01 1.55698017002069977188e+00 8.98208946068406399732e-01 1.28179277283196113579e+00 7.92528614306793666167e-01 1.20534895366367122982e+00 7.41405790465139880041e-01 1.10234166402797639783e+00 8.56763333638716595431e-01 1.26611337885777608392e+00 8.37823908403683592638e-01 1.20441820314716574458e+00 7.56383979212149726301e-01 1.06819887858126860714e+00 9.08752248983431876184e-01 1.08498703289644304881e+00 3.85368462101575381951e-01 1.14404166274786911472e+00 2.76428130836409324811e-01 1.07337539916893498493e+00 9.37402841956323923389e-02 1.00417328080512335831e+00
7 1.00000000000000000000e+00 9.05175493785015272685e-01 1.37118908110515391741e+00 7.94759335153498502891e-01 1.53933490242690029781e+00 7.41752425753572475209e-01 1.55653907773765887157e+00 8.01330391962786103832e-01 1.45346945748439626556e+00 8.60813635045219016639e-01 1.59335861253545574279e+00 7.45049713787423129041e-01 1.58842124311983434737e+00 8.25522010759653368517e-01 1.32703548344959298966e+00 7.87046971374103510044e-01 1.22507549623515576975e+00 7.32048548336936222292e-01 1.16597127555791479914e+00 8.46742244673517552300e-01 1.26442010877690691473e+00 8.39724591782527451933e-01 1.20805588861854773519e+00 7.42925758976921590815e-01 1.09168563530732787292e+00 6.04832884484222232935e-01 1.18260974630368975724e+00 3.08329908456358436908e-01 1.06180221054298407068e+00 3.07639524361449090417e-01 1.18406242357294022582e+00 3.15693798341951825659e-01 1.02758212019030858997e+00
8 1.00000000000000000000e+00 9.01499752267450160659e-01 1.38056649167578293635e+00 7.95367444133924572647e-01 1.53714740382684200704e+00 7.45967894567377887149e-01 1.54090171959328281481e+00 7.95135760119134893387e-01 1.44891754108332326823e+00 8.47057660371104637065e-01 1.51678824619714625044e+00 7.52713680969912979357e-01 1.57613590177444362617e+00 7.68701370180671306187e-01 1.40485468220242459836e+00 7.71951354397406031005e-01 1.27740620065090282331e+00 7.43934507412164824913e-01 1.21665114724119605150e+00 8.38099325060995270498e-01 1.26066872292718534787e+00 8.36991347888154324508e-01 1.19758499043088240121e+00 7.07717415245109449096e-01 1.11821358420606831174e+00 4.09277650607424658968e-01 1.23787644627830384358e+00 3.64377753751757293976e-01 1.04705029759189494065e+00 2.69624100038297731530e-01 1.21668225977187782760e+00 4.32581566996934119285e-01 1.04155578054073649774e+00
9 1.00000000000000000000e+00 9.00143399936004562356e-01 1.37685986461672760228e+00 7.96126189285503382820e-01 1.53251733933213696304e+00 7.46714948396035693712e-01 1.54013484694435298650e+00 7.89428476992695138392e-01 1.43971480401200069288e+00 8.35725835001019934367e-01 1.45609342975744171511e+00 7.66260694473003045601e-01 1.52625927566294605775e+00 7.36663840954165372032e-01 1.46205504893094606622e+00 7.39447942616775488744e-01 1.35351092346960388824e+00 7.48995631228123182055e-01 1.28160978808420833452e+00 8.29749054396712315551e-01 1.26810483961883657678e+00 8.25990655627627745616e-01 1.17627245286913240108e+00 6.64946162678058061424e-01 1.14615950548304357248e+00 3.71832164465241865603e-01 1.23592585259397802488e+00 4.02741551262169428238e-01 1.07257208163899897535e+00 3.14567650221667993726e-01 1.22469241385664884270e+00 3.98628569837764956674e-01 1.03955476575645500148e+00
10 1.00000000000000000000e+00 8.93720112662038101980e-01 1.36268454693815455059e+00 7.98889220400355815066e-01 1.50854488979300760398e+00 7.43682829396341116279e-01 1.53359563363421824711e+00 7.71736654021133561265e-01 1.44477823095774704498e+00 8.22596780459282084230e-01 1.41064944188188312602e+00 7.89174926345852956189e-01 1.47710184316173309682e+00 7.33624066466190494218e-01 1.49750108312849028458e+00 7.29619678994479659018e-01 1.42547496625705449880e+00 7.59242266516896302520e-01 1.33482442706668691379e+00 8.30532608928356563815e-01 1.26331410554552570069e+00 8.09502777111158700052e-01 1.15840181512509743378e+00 6.18956905646940946930e-01 1.17288130436389526068e+00 3.66237956470711056856e-01 1.22141426374053962967e+00 4.36699736306815966547e-01 1.09531193337176024905e+00 3.37223483554609571033e-01 1.22265575951265836885e+00 3.90606112004986294473e-01 1.03881964023522077589e+00
11 1.00000000000000000000e+00 8.90748934087366550649e-01 1.35695064127009934474e+00 7.99737248781917542395e-01 1.49633292671875040014e+00 7.47116577142021398572e-01 1.53019787693369102577e+00 7.66702306022240209771e-01 1.44782850843740562574e+00 8.14403969046718523295e-01 1.39826097286495176775e+00 7.95800903826377470374e-01 1.45237953603322833551e+00 7.42293971625285653460e-01 1.49773321206732368260e+00 7.31147404524946087356e-01 1.45082809262896561542e+00 7.64724844498446687524e-01 1.35780278418007438468e+00 8.32299163162326993692e-01 1.25250316204040923473e+00 7.81379414481538137061e-01 1.14606900160199742800e+00 5.49447274495576620801e-01 1.19875696758547878318e+00 3.70918800987038055350e-01 1.19525821292534217832e+00 4.65007565632575503578e-01 1.13214958196591486406e+00 3.56355703315641758611e-01 1.21407082166953772528e+00 4.20197503425467522309e-01 1.04459611602128532581e+00
12 1.00000000000000000000e+00 8.72449122352084049936e-01 1.32172918846101472568e+00 8.05098230949203852447e-01 1.43409617664568522777e+00 7.51983703481969745219e-01 1.49788908376473561823e+00 7.41348988944746101204e-01 1.47001752893452475313e+00 7.67145341430018334883e-01 1.39925865278415750836e+00 8.01417186052036267796e-01 1.34711384684420831803e+00 7.94484603854549220614e-01 1.40685075394670366933e+00 7.55702960225922759641e-01 1.47048541388193920731e+00 7.47446837003191699722e-01 1.40823274625533723103e+00 8.05734580202486005973e-01 1.26624571953872311347e+00 7.78084235741155261223e-01 1.15466143825336708950e+00 6.03911166072281457851e-01 1.20993642703466375288e+00 4.81205475530971260589e-01 1.17564694417836435036e+00 4.99738568601013455339e-01 1.15533660145879690795e+00 3.57545099710468772258e-01 1.22082302589156355133e+00 4.47522062669051590156e-01 1.05085828930505820189e+00
13 1.00000000000000000000e+00 8.55703116501949301309e-01 1.29898173347187473325e+00 8.05824389372935323550e-01 1.37546713571174894497e+00 7.62625615639808462909e-01 1.44804548315606607112e+00 7.36513408446646922201e-01 1.46871614564330776886e+00 7.38525135836844204285e-01 1.42562746777703130974e+00 7.60207269438175736731e-01 1.35347046132845050259e+00 7.76800142511668734180e-01 1.29513152379633056377e+00 7.60633553785366567368e-01 1.25329209211153047576e+00 7.49394249388006805646e-01 1.22581977251688245545e+00 7.48359070000693793467e-01 1.21738289530234133906e+00 8.05422117228513978482e-01 1.23351190950420708248e+00 8.36992915544531257410e-01 1.17374976000635244944e+00 6.83660404271397736942e-01 1.16625147387111560704e+00 4.96802919430969547321e-01 1.23560388343305427306e+00 4.25204553391346828928e-01 1.20642265864591502478e+00 5.91525081474295721939e-01 1.08833166146065729585e+00
14 1.00000000000000000000e+00 8.25168268237154833855e-01 1.26852710799759971216e+00 7.95598079627443555140e-01 1.30322277345521242431e+00 7.82818450606803550862e-01 1.34382256016565815315e+00 7.55577556660716354031e-01 1.38759191939194548304e+00 7.36583046587870327038e-01 1.42038003026156212094e+00 7.26930954797894379737e-01 1.42405606015018482147e+00 7.26609837977642558648e-01 1.39295766452578728689e+00 7.34344101151504724534e-01 1.34625565385240530958e+00 7.39157966564178647850e-01 1.30167415071681280558e+00 7.68732752371005689795e-01 1.27599855693464259154e+00 8.10951760530445153741e-01 1.24293252536541198872e+00 7.80316714383035625602e-01 1.17681307787873890014e+00 6.42423751054255753878e-01 1.19096155686317928257e+00 4.86803827982251746676e-01 1.24279917788104166121e+00 4.56801045211115752664e-01 1.20723828610307504228e+00 6.07817149291848157766e-01 1.09813363542131203765e+00
15 1.00000000000000000000e+00 8.12424318413976109809e-01 1.26124121145716761028e+00 7.88070119001606284037e-01 1.26707833011462689399e+00 7.79908536345890968100e-01 1.27341105274375965273e+00 7.69195207881111620019e-01 1.28068776164931152906e+00 7.55970241004670362450e-01 1.28849692075587718421e+00 7.41822846330731144882e-01 1.29390859327216301011e+00 7.27846393845702932524e-01 1.29219872768390353635e+00 7.12571960703712092844e-01 1.27873444711052308698e+00 7.13223066036391628586e-01 1.27358502722592614731e+00 7.08488720786602632629e-01 1.26415440594453287737e+00 7.16138952322993849187e-01 1.24538931135667363392e+00 7.19443049049060090461e-01 1.22565812751690650373e+00 7.22487368727229073428e-01 1.21622865176561623102e+00 7.29769045702783891727e-01 1.22017704100813695334e+00 7.32339067074704308524e-01 1.23496636387364189247e+00 7.44291252138424508367e-01 1.21009388115563742971e+00
16 1.00000000000000000000e+00 7.97399820862368269303e-01 1.25751024663624710875e+00 7.71534674563537303804e-01 1.25990756888843402628e+00 7.68239040016630014840e-01 1.26207441448140289530e+00 7.75801324815129422774e-01 1.26047023945263436673e+00 7.70428121334088999994e-01 1.25996095117633188920e+00 7.61598703641546026510e-01 1.25911456216733319557e+00 7.53864715982511701675e-01 1.25754005543697044978e+00 7.48068099718819490285e-01 1.25578874189119793492e+00 7.45849120400455367630e-01 1.25198590615287508321e+00 7.44047046777486453806e-01 1.24680543137283939004e+00 7.42579219889581199077e-01 1.23848589683462706468e+00 7.41298422848644000815e-01 1.22936012933860228102e+00 7.39100145168683053676e-01 1.22403814880835892787e+00 7.37858416287632490338e-01 1.22479408814260293248e+00 7.39343067959703170722e-01 1.22689559964109706769e+00 7.42889071589246774430e-01 1.20536900772235400225e+00
17 1.00000000000000000000e+00 7.96174808451611593085e-01 1.25734539017010593653e+00 7.70873245207468027473e-01 1.25902806767599129145e+00 7.68789436720074492726e-01 1.25903887076733567163e+00 7.68460505405028415638e-01 1.25826546352981760712e+00 7.66161438466237632028e-01 1.25714272992659359396e+00 7.61287478778959192383e-01 1.25484377548410730441e+00 7.56234811728803024700e-01 1.25276913503562759011e+00 7.52063675207062964922e-01 1.25067886343872514132e+00 7.49863185567398393694e-01 1.24585760885408292076e+00 7.46593588414683373422e-01 1.24181003510853660288e+00 7.44731884616249950604e-01 1.23687787841446872328e+00 7.42568001751428563573e-01 1.23284530920781709717e+00 7.40711737464981867518e-01 1.23162434632441208926e+00 7.40467405042839810214e-01 1.23369481611066800220e+00 7.40282183014028594137e-01 1.23373001117129610371e+00 7.42793505867429204592e-01 1.20639080707625923061e+00
18 1.00000000000000000000e+00 7.88527139751006966861e-01 1.25538384626874011119e+00 7.61138432833159517266e-01 1.25951839763062634070e+00 7.58925138699724999292e-01 1.25841856135863650046e+00 7.56865234747360449141e-01 1.25710817040788058740e+00 7.57685403330893181284e-01 1.25576134325579968909e+00 7.58503124336620593304e-01 1.25465352529310658625e+00 7.58346614441612221214e-01 1.25409643735787068586e+00 7.56198984481550984249e-01 1.25132459170431120654e+00 7.52871382576198122649e-01 1.24758440527371061712e+00 7.50282671809990198142e-01 1.24463986307929341812e+00 7.47274763571597278045e-01 1.24156284595312826902e+00 7.44673758471562807770e-01 1.23924200170004028543e+00 7.43350085280400918464e-01 1.23784298311266982573e+00 7.42485252231176007243e-01 1.23720681982028080093e+00 7.42078567930493648852e-01 1.23484856805261800083e+00 7.43375471986844504890e-01 1.20822561325125943377e+00
19 1.00000000000000000000e+00 7.87049548513468311128e-01 1.25582118302932310705e+00 7.59183860903519414087e-01 1.25670380777828571972e+00 7.55783760807049009856e-01 1.25590563676583899522e+00 7.54441741957584288691e-01 1.25491357153686888815e+00 7.53670988731351187973e-01 1.25412896607714952069e+00 7.52732359419627350405e-01 1.25286841349579969318e+00 7.51662497967872433868e-01 1.25102955690702577485e+00 7.50023876422861945912e-01 1.24988903721026178850e+00 7.49077259773145209820e-01 1.24756858386557611951e+00 7.46387412479496137330e-01 1.24697749226000520473e+00 7.46651541960800968489e-01 1.24642203983126909073e+00 7.47978594132404972505e-01 1.24670903812378863762e+00 7.44287237964816439373e-01 1.24595227573642830521e+00 7.45037574851909911722e-01 1.24624863991158063570e+00 7.42991213235745795451e-01 1.24327137433356016416e+00 7.44493424540786596921e-01 1.21413748947482602603e+00
20 1.00000000000000000000e+00 7.84633276972909521341e-01 1.25542510192971046301e+00 7.55630190190043848908e-01 1.25608519420057551663e+00 7.52226102317507971939e-01 1.25533918283691692253e+00 7.51495552203376715461e-01 1.25362190427340713939e+00 7.50680997594162402464e-01 1.25359933109815280261e+00 7.50595010066495760270e-01 1.25190223817176793375e+00 7.49307488528660692317e-01 1.25218719208994344605e+00 7.49364186891684824765e-01 1.25123046732660458957e+00 7.48892194203154226706e-01 1.25080220141041231763e+00 7.48438283611613464075e-01 1.25041689492083807345e+00 7.47470647625416151349e-01 1.25032376048685422987e+00 7.46593243777910142711e-01 1.24971265508418594159e+00 7.45681196482375741041e-01 1.24893227217526447959e+00 7.44732195725672063702e-01 1.24758308133822803931e+00 7.43814463639392520200e-01 1.24373941230089624099e+00 7.44484579194828688387e-01 1.21505950133112361478e+00
21 1.00000000000000000000e+00 7.84353269936524544192e-01 1.25542649709933673563e+00 7.55508061629271976400e-01 1.25605699151652494550e+00 7.51463042765201927331e-01 1.25505959627397500888e+00 7.50017516976575704390e-01 1.25410406801657758891e+00 7.49325258323257581416e-01 1.25319062728406005469e+00 7.48835164038858414060e-01 1.25259409982852143450e+00 7.48697974917282293994e-01 1.25212613435232644754e+00 7.48641534972204647502e-01 1.25175659322581744881e+00 7.48306106657518288472e-01 1.25148883489565654337e+00 7.47953337128808515288e-01 1.25195711869112047410e+00 7.47719414878068588948e-01 1.25125186587255932125e+00 7.46259783502681073308e-01 1.25064068653632065597e+00 7.45922628998899051034e-01 1.24969704383164192940e+00 7.44856272619239034860e-01 1.24842159398361252087e+00 7.43749583029098770837e-01 1.24453724657130115894e+00 7.44572146309369298223e-01 1.21550990533794189830e+00
22 1.00000000000000000000e+00 7.84472404020943536729e-01 1.25549745804232371071e+00 7.55629067028888878887e-01 1.25611273279484048082e+00 7.51898824025586276498e-01 1.25500107911652292181e+00 7.50009984560380704721e-01 1.25435979280937859315e+00 7.49534280744948877562e-01 1.25334816682052152537e+00 7.49124937416971392601e-01 1.25239901762267202834e+00 7.48493420124114239300e-01 1.25213222262425682985e+00 7.48308574288858996404e-01 1.25179804004235695203e+00 7.48185645618395400724e-01 1.25152351627876301521e+00 7.47856644747614596191e-01 1.25129991684848862477e+00 7.47356871675689538037e-01 1.25105953379164946959e+00 7.46630260197116202292e-01 1.25050233384935682857e+00 7.45866695176005345402e-01 1.24982146042172437284e+00 7.44907471786354191678e-01 1.24841684124766838515e+00 7.43925457555768776530e-01 1.24441570505332288477e+00 7.44551785667300181082e-01 1.21555985800112331674e+00
23 1.00000000000000000000e+00 7.84520317232104469340e-01 1.25545935067847769240e+00 7.55704383176290850344e-01 1.25609809688631801627e+00 7.51728372153079638096e-01 1.25512781168465492598e+00 7.50338974660773705416e-01 1.25417790385663208141e+00 7.49616484027697538295e-01 1.25341142652815529246e+00 7.49180910153188883704e-01 1.25280098054058353085e+00 7.48861213802633374215e-01 1.25233461280822311323e+00 7.48536299551063266655e-01 1.25190400182370620286e+00 7.48160013106945465111e-01 1.25159645846559897109e+00 7.47719352894884559113e-01 1.25115499490829562568e+00 7.47286759858769911169e-01 1.25072068275452541464e+00 7.46653235192925923691e-01 1.25030506980909894565e+00 7.45820152026185123617e-01 1.24963417254239517185e+00 7.44853775146707475230e-01 1.24820850859462506577e+00 7.43893727311798480528e-01 1.24423551685488908980e+00 7.44528114926058859346e-01 1.21542832604264616769e+00
24 1.00000000000000000000e+00 7.84587240161873422650e-01 1.25547215509642784426e+00 7.55787729755154513711e-01 1.25611507150646684039e+00 7.51812117348368946779e-01 1.25514929563047616945e+00 7.50407252291262372168e-01 1.25420164118238353090e+00 7.49682718430666583664e-01 1.25342577132587451594e+00 7.49202309475917926918e-01 1.25281399688425576500e+00 7.48819059881964954606e-01 1.25231657699158449581e+00 7.48456416382494160722e-01 1.25190523958821597894e+00 7.48093101854856001864e-01 1.25153559750086418312e+00 7.47685775370177663213e-01 1.25117573686971317315e+00 7.47184668509108917966e-01 1.25079608054505775350e+00 7.46572406219628503798e-01 1.25031735000434207628e+00 7.45799219588241912859e-01 1.24959441871295884319e+00 7.44847126892866917558e-01 1.24819442453139894944e+00 7.43885060218065552462e-01 1.24421757680543110247e+00 7.44529221908391547480e-01 1.21541764253552719843e+00
25 1.00000000000000000000e+00 7.84593074740399187839e-01 1.25547243500765337565e+00 7.55792230640994100455e-01 1.25611734451728107587e+00 7.51816110189771791283e-01 1.25515526055617021584e+00 7.50414167659905317898e-01 1.25420281292432211906e+00 7.49688209369720359732e-01 1.25342959229877481953e+00 7.49205238760297764777e-01 1.25281763143671653893e+00 7.48817970758279494170e-01 1.25232418125469413539e+00 7.48459642312803485886e-01 1.25190978739808689291e+00 7.48089867907314798323e-01 1.25153991762301353141e+00 7.47675468948281074510e-01 1.25118159627567160364e+00 7.47182191175755017198e-01 1.25079455535696992818e+00 7.46570105404670836258e-01 1.25031165317324877151e+00 7.45797038739941298147e-01 1.24958604074959223063e+00 7.44844801573432580000e-01 1.24818431047144851043e+00 7.43882921335961677656e-01 1.24420816003148937412e+00 7.44527796396513785737e-01 1.21540788501081409301e+00
26 1.00000000000000000000e+00 7.84594028090199291370e-01 1.25547245501527338085e+00 7.55793433889989541008e-01 1.25611751123006887276e+00 7.51817089949246564196e-01 1.25515551434231387162e+00 7.50415028131710903914e-01 1.25420300697363829023e+00 7.49688952419439225139e-01 1.25342971556987170523e+00 7.49205809104136366550e-01 1.25281767509661912108e+00 7.48818460888283188304e-01 1.25232423635627054814e+00 7.48460064139558567398e-01 1.25190972180694859439e+00 7.48090179274298661127e-01 1.25153986443994558186e+00 7.47675694344387520296e-01 1.25118148250071592464e+00 7.47182310521395609548e-01 1.25079409051661682994e+00 7.46570271900968474021e-01 1.25031099073512330655e+00 7.45797017545662188631e-01 1.24958484118645918315e+00 7.44844594252754510499e-01 1.24818290599757175663e+00 7.43882443688229755274e-01 1.24420677098064857979e+00 7.44527569624656160308e-01 1.21540626948691743436e+00
27 1.00000000000000000000e+00 7.84594281934883119867e-01 1.25547249240835023798e+00 7.55793659509431559052e-01 1.25611760368327929349e+00 7.51817430107329931488e-01 1.25515542903507304473e+00 7.50415344362138969636e-01 1.25420295681781657215e+00 7.49689146943671391732e-01 1.25342968023738099426e+00 7.49206021031560309709e-01 1.25281765184855986561e+00 7.48818615293120992682e-01 1.25232419505773306945e+00 7.48460206724821608404e-01 1.25190969157370979303e+00 7.48090313896975223074e-01 1.25153977649147907236e+00 7.47675801083352187248e-01 1.25118137101330306749e+00 7.47182364872080229112e-01 1.25079397898557820312e+00 7.46570368488488456116e-01 1.25031079769533381985e+00 7.45797038194162098534e-01 1.24958463871165714743e+00 7.44844489001239229431e-01 1.24818258858465269689e+00 7.43882474777039726099e-01 1.24420625380742366772e+00 7.44527545370265775304e-01 1.21540579245802149444e+00
