# tag norm j_0
6.400000 1.00000000000000666134e+00 4.38360034704299988961e-03
6.400000 1.00000000000000666134e+00 4.14938850819198627035e-03
6.400000 1.00000000000000666134e+00 -2.47537170546679834160e-03
6.400000 1.00000000000000666134e+00 -4.62856362316692806791e-06
6.400000 1.00000000000000666134e+00 -6.04535170262122446318e-04
6.400000 1.00000000000000666134e+00 1.19563924286570413938e-05
6.400000 1.00000000000000666134e+00 -2.39432569029045510395e-03
6.400000 1.00000000000000666134e+00 4.14835243277731496869e-03
6.400000 1.00000000000000666134e+00 4.81103937182050973853e-03
