# tag norm j_0
13.800000 1.00000000000001532108e+00 1.68437461577930408518e-01
13.800000 1.00000000000001532108e+00 1.91280023129166039386e-02
13.800000 1.00000000000001532108e+00 1.34300067347975829977e-03
13.800000 1.00000000000001532108e+00 1.09388307357521641361e-02
13.800000 1.00000000000001532108e+00 7.97624600007668937973e-02
13.800000 1.00000000000001532108e+00 -2.55208463495487786199e-02
13.800000 1.00000000000001532108e+00 2.57577772452942908854e-02
13.800000 1.00000000000001532108e+00 4.18451604112921662915e-02
13.800000 1.00000000000001532108e+00 3.83636409922761476010e-02
13.800000 1.00000000000001532108e+00 -8.49971708384962554295e-03
13.800000 1.00000000000001532108e+00 3.77688517364634587792e-02
13.800000 1.00000000000001532108e+00 4.19578880145446350691e-02
13.800000 1.00000000000001532108e+00 2.70461908369721837353e-02
13.800000 1.00000000000001532108e+00 -2.59690817426559625303e-02
13.800000 1.00000000000001532108e+00 7.88137233409665627359e-02
13.800000 1.00000000000001532108e+00 1.25480324098714325631e-02
13.800000 1.00000000000001532108e+00 2.99046311258569126601e-03
13.800000 1.00000000000001532108e+00 1.93160423644999634796e-02
13.800000 1.00000000000001532108e+00 1.67375223961580332777e-01
