# tag norm j_0
27.800000 1.00000000000033129055e+00 -2.77893756293198833721e-04
27.800000 1.00000000000033129055e+00 -2.33953212601259121937e-04
27.800000 1.00000000000033129055e+00 -3.25628275401111915831e-04
27.800000 1.00000000000033129055e+00 3.92310744732468825481e-05
27.800000 1.00000000000033129055e+00 -7.39545733723179850479e-05
27.800000 1.00000000000033129055e+00 6.25128714977069054395e-04
27.800000 1.00000000000033129055e+00 2.34847133086173750875e-04
27.800000 1.00000000000033129055e+00 1.06812044256514123070e-04
27.800000 1.00000000000033129055e+00 -2.55548176541247305804e-04
27.800000 1.00000000000033129055e+00 1.36272534376167473976e-04
27.800000 1.00000000000033129055e+00 -2.65773323487951559051e-04
27.800000 1.00000000000033129055e+00 9.26290116084542257272e-05
27.800000 1.00000000000033129055e+00 2.04454632733822765436e-04
27.800000 1.00000000000033129055e+00 6.32514485358755718276e-04
27.800000 1.00000000000033129055e+00 -5.76534881562556101448e-05
27.800000 1.00000000000033129055e+00 4.33846438665737760320e-05
27.800000 1.00000000000033129055e+00 -3.18008095526223265662e-04
27.800000 1.00000000000033129055e+00 -2.26029056811563903648e-04
27.800000 1.00000000000033129055e+00 -2.76965861727649091846e-04
