# tag norm j_0
2.200000 1.00000000000000865974e+00 -4.33159982184519836410e-05
2.200000 1.00000000000000865974e+00 -3.85469555292266045313e-05
2.200000 1.00000000000000865974e+00 -4.29889431162574424221e-05
2.200000 1.00000000000000865974e+00 -3.64891929642643275027e-05
2.200000 1.00000000000000865974e+00 -4.10670315806976025681e-05
2.200000 1.00000000000000865974e+00 -3.66623562448738465717e-05
2.200000 1.00000000000000865974e+00 -4.35481150557473972382e-05
2.200000 1.00000000000000865974e+00 -3.90294893907365623553e-05
2.200000 1.00000000000000865974e+00 -4.41818859192638413230e-05
