# tag norm j_0
3.100000 1.00000000000000377476e+00 4.96090851240927818711e-04
3.100000 1.00000000000000377476e+00 6.34439510449950715273e-05
3.100000 1.00000000000000377476e+00 2.42937546503792234365e-04
3.100000 1.00000000000000377476e+00 6.63335447961782527027e-05
3.100000 1.00000000000000377476e+00 2.50390237651851126337e-04
3.100000 1.00000000000000377476e+00 6.79008687151857754771e-05
3.100000 1.00000000000000377476e+00 2.28964651833488537459e-04
3.100000 1.00000000000000377476e+00 6.04229446939486835341e-05
3.100000 1.00000000000000377476e+00 2.20690202990291950251e-04
3.100000 1.00000000000000377476e+00 5.69969135997156492804e-05
3.100000 1.00000000000000377476e+00 2.20365386317303215292e-04
3.100000 1.00000000000000377476e+00 6.06463562932489682450e-05
3.100000 1.00000000000000377476e+00 2.27767226798141549527e-04
3.100000 1.00000000000000377476e+00 6.89153843605904337013e-05
3.100000 1.00000000000000377476e+00 2.49240613779238336795e-04
3.100000 1.00000000000000377476e+00 6.68755729884296519190e-05
3.100000 1.00000000000000377476e+00 2.42127282868955060347e-04
3.100000 1.00000000000000377476e+00 6.29472805278488131480e-05
3.100000 1.00000000000000377476e+00 4.94398396977523179111e-04
