# tag norm j_0
16.100000 1.00000000000020361490e+00 4.10874551706762885812e-04
16.100000 1.00000000000020361490e+00 6.48919372669834958710e-04
16.100000 1.00000000000020361490e+00 1.08479617410567373906e-03
16.100000 1.00000000000020361490e+00 1.33977274549039611883e-03
16.100000 1.00000000000020361490e+00 1.09326145203558549798e-03
16.100000 1.00000000000020361490e+00 1.16846622310128283977e-03
16.100000 1.00000000000020361490e+00 1.01130648816670346869e-03
16.100000 1.00000000000020361490e+00 1.16085738448868584609e-03
16.100000 1.00000000000020361490e+00 1.01775050272847450948e-03
16.100000 1.00000000000020361490e+00 1.15929580611379883306e-03
16.100000 1.00000000000020361490e+00 1.02183536374368384540e-03
16.100000 1.00000000000020361490e+00 1.16361532153945262079e-03
16.100000 1.00000000000020361490e+00 1.01669123377540063582e-03
16.100000 1.00000000000020361490e+00 1.17212507958844606645e-03
16.100000 1.00000000000020361490e+00 1.10151534160297351513e-03
16.100000 1.00000000000020361490e+00 1.36210761703922395710e-03
16.100000 1.00000000000020361490e+00 1.12911704434066201275e-03
16.100000 1.00000000000020361490e+00 7.07022654033643183254e-04
16.100000 1.00000000000020361490e+00 4.42996715284447420587e-04
