# tag norm j_0
8.800000 1.00000000000004574119e+00 5.24782361938280067504e-02
8.800000 1.00000000000004574119e+00 3.57387704804232944622e-02
8.800000 1.00000000000004574119e+00 5.11278824904920284333e-02
8.800000 1.00000000000004574119e+00 3.58662382442586705200e-02
8.800000 1.00000000000004574119e+00 5.12979619951296830771e-02
8.800000 1.00000000000004574119e+00 3.60378445810464465016e-02
8.800000 1.00000000000004574119e+00 5.14888720190453189063e-02
8.800000 1.00000000000004574119e+00 3.62160023739147088340e-02
8.800000 1.00000000000004574119e+00 5.16740297341480026017e-02
8.800000 1.00000000000004574119e+00 3.63944918731976402304e-02
8.800000 1.00000000000004574119e+00 5.18607120722891848374e-02
8.800000 1.00000000000004574119e+00 3.65718998954866134077e-02
8.800000 1.00000000000004574119e+00 5.20483806036288673691e-02
8.800000 1.00000000000004574119e+00 3.67450887393882819065e-02
8.800000 1.00000000000004574119e+00 5.22360077545830567280e-02
8.800000 1.00000000000004574119e+00 3.69222889260330811023e-02
8.800000 1.00000000000004574119e+00 5.24406441007194967785e-02
8.800000 1.00000000000004574119e+00 3.71406829967441953766e-02
8.800000 1.00000000000004574119e+00 5.41830895551563759827e-02
