# tag norm j_0
25.100000 1.00000000000003330669e+00 4.58500922706906247073e-04
25.100000 1.00000000000003330669e+00 1.90080678525249031213e-03
25.100000 1.00000000000003330669e+00 -1.91566238638952220791e-03
25.100000 1.00000000000003330669e+00 1.53897994146950023095e-03
25.100000 1.00000000000003330669e+00 -1.83766014416860724856e-03
25.100000 1.00000000000003330669e+00 1.57633429966358190773e-03
25.100000 1.00000000000003330669e+00 -1.78361871985557320607e-03
25.100000 1.00000000000003330669e+00 1.61003776465016993150e-03
25.100000 1.00000000000003330669e+00 -1.77183458070026794533e-03
25.100000 1.00000000000003330669e+00 1.62014219725557947170e-03
25.100000 1.00000000000003330669e+00 -1.76661648732899870251e-03
25.100000 1.00000000000003330669e+00 1.61323770185354425401e-03
25.100000 1.00000000000003330669e+00 -1.77148462371679374372e-03
25.100000 1.00000000000003330669e+00 1.58154121705729954449e-03
25.100000 1.00000000000003330669e+00 -1.82635657102408967452e-03
25.100000 1.00000000000003330669e+00 1.53990291350303417847e-03
25.100000 1.00000000000003330669e+00 -1.90547002588265347936e-03
25.100000 1.00000000000003330669e+00 1.91398794010073382797e-03
25.100000 1.00000000000003330669e+00 5.31719223471573219225e-04
