# tag norm BO
1 1.00000000000000244249e+00 1.24813877818620369564e-01
2 1.00000000000000710543e+00 5.63382486897350057142e-02
3 9.99999999999999777955e-01 4.21886619144532046960e-03
4 1.00000000000000244249e+00 3.93060333426947100532e-03
5 9.99999999999998445688e-01 3.92847901428968176302e-03
