# tag norm j_0
11.600000 1.00000000000001842970e+00 3.02834626119516114873e-02
11.600000 1.00000000000001842970e+00 2.07810525175780129448e-02
11.600000 1.00000000000001842970e+00 2.66123756301657708734e-02
11.600000 1.00000000000001842970e+00 2.23929172533860569583e-02
11.600000 1.00000000000001842970e+00 2.58050305239039476368e-02
11.600000 1.00000000000001842970e+00 2.30274392912809093559e-02
11.600000 1.00000000000001842970e+00 2.54795700786843264118e-02
11.600000 1.00000000000001842970e+00 2.33413827574475776783e-02
11.600000 1.00000000000001842970e+00 2.53947486421336569851e-02
11.600000 1.00000000000001842970e+00 2.34494776378037679543e-02
11.600000 1.00000000000001842970e+00 2.54436011337160310208e-02
11.600000 1.00000000000001842970e+00 2.33888006275908624798e-02
11.600000 1.00000000000001842970e+00 2.56366322931976670096e-02
11.600000 1.00000000000001842970e+00 2.31096270016706052675e-02
11.600000 1.00000000000001842970e+00 2.60705688491078176050e-02
11.600000 1.00000000000001842970e+00 2.25048982939710373596e-02
11.600000 1.00000000000001842970e+00 2.69943953539544811981e-02
11.600000 1.00000000000001842970e+00 2.09197205970659931562e-02
11.600000 1.00000000000001842970e+00 3.08191955051468693960e-02
