# tag norm j_0
7.200000 1.00000000000000954792e+00 3.66347109553935307985e-03
7.200000 1.00000000000000954792e+00 -6.13564724338532159476e-03
7.200000 1.00000000000000954792e+00 1.06429546144841576105e-02
7.200000 1.00000000000000954792e+00 3.64023654014755627603e-03
7.200000 1.00000000000000954792e+00 6.42560055046975577703e-03
7.200000 1.00000000000000954792e+00 3.59467217478762982724e-03
7.200000 1.00000000000000954792e+00 1.05187252111623354839e-02
7.200000 1.00000000000000954792e+00 -6.17984005928269748698e-03
7.200000 1.00000000000000954792e+00 2.78599410139396741135e-03
