# tag norm j_0
18.400000 1.00000000000022581936e+00 1.17958684825106912219e-04
18.400000 1.00000000000022581936e+00 3.01452563840415614042e-04
18.400000 1.00000000000022581936e+00 6.65213154522797879727e-04
18.400000 1.00000000000022581936e+00 2.83897836205373630628e-04
18.400000 1.00000000000022581936e+00 -6.30877545307229639594e-05
18.400000 1.00000000000022581936e+00 -5.64817014328398883227e-05
18.400000 1.00000000000022581936e+00 -1.23269812814842953837e-05
18.400000 1.00000000000022581936e+00 1.18232250993584086856e-05
18.400000 1.00000000000022581936e+00 6.91547929759101964769e-06
18.400000 1.00000000000022581936e+00 6.08669159122783596583e-07
18.400000 1.00000000000022581936e+00 1.01662497247500092657e-05
18.400000 1.00000000000022581936e+00 8.52765480193441492783e-06
18.400000 1.00000000000022581936e+00 -7.63700526595063252939e-06
18.400000 1.00000000000022581936e+00 -6.79775123352360744963e-05
18.400000 1.00000000000022581936e+00 -6.45382255542694598192e-05
18.400000 1.00000000000022581936e+00 2.57250057679693966330e-04
18.400000 1.00000000000022581936e+00 6.74536893715301411230e-04
18.400000 1.00000000000022581936e+00 3.28059354244557527074e-04
18.400000 1.00000000000022581936e+00 1.43567708759250226534e-04
