# tag norm j_0
20.100000 1.00000000000002975398e+00 -1.21415779170673250424e-03
20.100000 1.00000000000002975398e+00 1.76603196135296787277e-03
20.100000 1.00000000000002975398e+00 -2.27780768093836880755e-03
20.100000 1.00000000000002975398e+00 1.56520042788573930832e-03
20.100000 1.00000000000002975398e+00 -2.21956205794583390570e-03
20.100000 1.00000000000002975398e+00 1.61054789226963831691e-03
20.100000 1.00000000000002975398e+00 -2.19161841000726186068e-03
20.100000 1.00000000000002975398e+00 1.65251878381630912251e-03
20.100000 1.00000000000002975398e+00 -2.15313502267240001325e-03
20.100000 1.00000000000002975398e+00 1.66965860116431762464e-03
20.100000 1.00000000000002975398e+00 -2.14968944788025998968e-03
20.100000 1.00000000000002975398e+00 1.66237234141497383470e-03
20.100000 1.00000000000002975398e+00 -2.18727935437312316636e-03
20.100000 1.00000000000002975398e+00 1.62437061929319504806e-03
20.100000 1.00000000000002975398e+00 -2.22429194123377081335e-03
20.100000 1.00000000000002975398e+00 1.58115338390029487245e-03
20.100000 1.00000000000002975398e+00 -2.29076630207373458520e-03
20.100000 1.00000000000002975398e+00 1.79453697788147588550e-03
20.100000 1.00000000000002975398e+00 -1.14914311897441737999e-03
