# tag norm j_0
20.100000 1.00000000000001509903e+00 -8.42560578467648896295e-02
20.100000 1.00000000000001509903e+00 1.12699881053538713410e-02
20.100000 1.00000000000001509903e+00 3.11139015833420753965e-02
20.100000 1.00000000000001509903e+00 6.18873461760897393413e-03
20.100000 1.00000000000001509903e+00 -1.90634842080884298054e-01
20.100000 1.00000000000001509903e+00 6.61440575342101162726e-03
20.100000 1.00000000000001509903e+00 3.05352497645656056902e-02
20.100000 1.00000000000001509903e+00 1.08041075771144988449e-02
20.100000 1.00000000000001509903e+00 -8.36132094484371285459e-02
