# tag norm j_0
10.100000 1.00000000000005084821e+00 9.29871953465173789466e-02
10.100000 1.00000000000005084821e+00 1.06232414292131760458e-01
10.100000 1.00000000000005084821e+00 9.14970506656167942294e-02
10.100000 1.00000000000005084821e+00 1.06446072274309896932e-01
10.100000 1.00000000000005084821e+00 9.16183449560962065439e-02
10.100000 1.00000000000005084821e+00 1.06475682051531295169e-01
10.100000 1.00000000000005084821e+00 9.17747225031629171310e-02
10.100000 1.00000000000005084821e+00 1.06333892015936640196e-01
10.100000 1.00000000000005084821e+00 9.35789078842295257710e-02
