# tag norm n_down_hub[0] n_down_hub[1] n_down_hub[2] n_down_hub[3] n_down_hub[4] n_down_hub[5] n_down_hub[6] n_down_hub[7] n_down_hub[8] n_down_hub[9] n_down_hub[10] n_down_hub[11] n_down_hub[12] n_down_hub[13] n_down_hub[14] n_down_hub[15] n_down_hub[16] n_down_hub[17] n_down_hub[18] n_down_hub[19] n_down_hub[20] n_down_hub[21] n_down_hub[22] n_down_hub[23] n_down_hub[24] n_down_hub[25] n_down_hub[26] n_down_hub[27] n_down_hub[28] n_down_hub[29] n_down_hub[30] n_down_hub[31] n_down_hub[32] n_down_hub[33] n_down_hub[34] n_down_hub[35] n_down_hub[36] n_down_hub[37] n_down_hub[38] n_down_hub[39] n_down_hub[40] n_down_hub[41] n_down_hub[42] n_down_hub[43] n_down_hub[44] n_down_hub[45] n_down_hub[46] n_down_hub[47] n_down_hub[48] n_down_hub[49] n_down_hub[50] n_down_hub[51] n_down_hub[52] n_down_hub[53] n_down_hub[54] n_down_hub[55] n_down_hub[56] n_down_hub[57] n_down_hub[58] n_down_hub[59] n_down_hub[60] n_down_hub[61] n_down_hub[62] n_down_hub[63]
1 1.00000000000000000000e+00 9.74866797264643425436e-01 8.97314296883598316867e-01 7.22256345918872000311e-01 9.63150457192232467563e-01 5.89878767456580188622e-01 6.72461018089435702549e-01 4.52490286041643929860e-01 4.42345515529742716598e-01 2.89024921951853308588e-01 6.06373457153894457328e-01 5.18779283065199159353e-01 3.12045313259368906067e-01 6.56001434966968166584e-01 1.99085453674213569419e-01 4.93577201086187522527e-01 3.77607708371749783982e-01 9.22125780367052172437e-01 4.88471681272408086993e-01 5.57359767512866088879e-01 9.21641801654928705112e-01 8.01148223665006486982e-01 6.91139438018392948671e-01 5.72880850213232206691e-01 6.26783081999852997868e-01 5.80087244367025522962e-01 5.72145541564711201943e-01 3.31718928716844663196e-01 3.89532991486607971243e-01 4.89895611970537214752e-01 4.92337625389284716526e-01 2.07969511553129426940e-01 6.65965394573822089264e-01 4.57804645620551564633e-01 4.47125654638463654322e-01 7.19997084762569738992e-01 4.97961764512936666538e-01 3.67887295654756196761e-01 7.84729612195127046448e-01 5.89831730090083161677e-01 5.40832183888493633894e-01 8.94329860172884738567e-01 2.79727419097123730651e-01 5.99245668389970731482e-01 9.06836300854117038917e-01 4.66999713752847545045e-01 1.55354352594486544437e-01 7.81691421790033591499e-01 6.69050889860097086626e-01 7.58108976968689063369e-01 3.11989892241045896348e-01 3.44978167978449212772e-01 4.12459633328506158900e-01 3.99910536825689943985e-01 3.57517397269834003026e-01 1.59363399146708079046e-01 8.32438367927480216135e-02 8.94938857931573544802e-02 2.15407674401369875206e-01 8.25915548021240869536e-02 1.95840214684102655041e-02 2.49343134147057166050e-01 4.33885885013450212089e-01 9.24255032794895486914e-03 4.35012123388455629325e-01
2 1.00000000000000000000e+00 9.74271924257280819148e-01 9.57891380910975476226e-01 9.33574414828633597496e-02 9.86130068553829564060e-01 2.40329583832657595055e-01 8.84580798328615691695e-01 6.99577342926528289446e-01 1.63856356795465202270e-01 1.45944546774329914074e-01 8.54404892011167649279e-01 9.86817830258081007955e-01 1.29332486315048150738e-02 1.31852957587469616155e-04 9.76445741653251597647e-01 5.55363633523275959658e-02 9.68120644543680075600e-01 9.97027026171604990878e-01 8.27156337959997545184e-01 1.81673097036900210721e-01 9.93864418760007528597e-01 9.95751183255603522504e-01 9.97237745719182000492e-01 5.97594390613016349101e-02 1.32018433809037799564e-01 2.66328264925182689460e-01 6.42829414535564858113e-01 1.57804629576494721832e-02 9.32026677314551132980e-01 7.38162909768999786486e-01 2.92911369345172589718e-01 1.02356813998052478820e-01 9.11029906311081161263e-01 5.08857376107014411359e-02 7.05552930632224684082e-01 2.28320355142483055744e-01 4.75292931781195415741e-01 1.27617765609815358996e-01 4.94425991397225150781e-01 8.33890318218847959031e-01 9.95260863935324979757e-01 5.09040820347417266589e-03 9.95046658240285930574e-01 4.93798405892856371452e-03 9.94840070326199921169e-01 2.86851127004218503166e-03 9.99723028779375244568e-01 9.99840890510997781782e-01 9.99398446710450083508e-01 1.71315194021520761369e-01 8.70477448267066078458e-01 7.55300358183351172592e-01 9.29333340560186793589e-01 2.69603587514991166474e-02 2.46226437273129011851e-01 1.01188731840050143672e-03 1.38564997324906643552e-04 7.32663995272599202699e-13 1.11573120383901938237e-08 1.14537402336594062707e-07 5.52009445472535443053e-06 2.45539245527972779803e-03 9.94003958885534832923e-01 5.97523191334563968935e-03 9.97559770955946722992e-01
3 1.00000000000000000000e+00 9.38563147005488040975e-01 7.12116314908992742438e-01 3.61402057986501878961e-01 8.75378505500261749894e-01 1.33892748041501030709e-01 9.17457864438265935370e-01 6.65865606503326157295e-01 3.92385082227522052900e-01 2.94728030510099159311e-01 7.30919693187143448831e-01 7.66878451155241669390e-01 2.10482791285235143475e-01 1.26596268270521249144e-03 8.34020588946913221662e-01 3.28876202082263202620e-01 8.46582649349794880145e-01 9.43818356212038134245e-01 6.28577625215638202683e-01 4.18321122161676328677e-01 9.98362339819664046381e-01 9.89499765631032812685e-01 8.03687637283713729452e-01 1.87198414739705387699e-01 3.70896571769859725864e-02 2.17708938264576379318e-01 6.58495112496565226934e-01 1.19900648168828116713e-01 9.90140044292012411198e-01 8.94672063968815489687e-01 2.80880988695527300525e-01 3.29232072822013666080e-01 7.82811081974172262576e-01 1.14251731174536907965e-01 8.28633541326230571578e-01 3.34985921607493908336e-01 4.18448498472516583480e-01 1.25413831341623475957e-02 3.14615863284951668977e-01 7.06936804787378969550e-01 9.76055019613903396269e-01 4.75344136112716524056e-03 9.95118939439243010980e-01 4.89243027665126582748e-03 9.95107443983474837523e-01 5.38262947655131912539e-03 9.97163485270377014658e-01 9.99697803996445699681e-01 8.54844136715849467478e-01 1.96361063957633558141e-01 7.65029369732978636875e-01 2.06101058112446056114e-01 7.84482081477634873856e-01 2.00344657887150001674e-01 9.49947748534651248420e-01 2.67431437436999423773e-02 1.49917501088074212739e-02 1.08981738645929780891e-03 2.90620262422621182703e-04 7.01407399356934621809e-06 8.86738060603531314365e-05 7.48766206294804777949e-03 9.87964505761735001244e-01 6.93782739931000490968e-03 9.97492367036881044662e-01
4 1.00000000000000000000e+00 8.78672989344384758326e-01 6.50829534786250718525e-01 4.72041202484016597651e-01 8.21587804396154530728e-01 2.39091065252161921739e-01 8.09244933958881529357e-01 6.30816127611448340673e-01 4.94583080709139644160e-01 3.53466453815872383437e-01 6.77016614171977004766e-01 4.55991033362902642434e-01 5.14204050667241951977e-01 7.66173032457607375983e-03 8.51530039609008859713e-01 3.28653905397677525979e-01 8.27921154930101654834e-01 8.90752171840382911405e-01 6.67333110900535486643e-01 4.34724603967734213317e-01 9.92872250012671098141e-01 8.78212597200257905072e-01 5.49740779602370888135e-01 4.47645864901532797298e-01 1.34937824196481426231e-01 1.87304136457723452436e-01 6.72032626996352355775e-01 1.51310961439014096674e-01 9.71197884404564781846e-01 7.44065059771292336421e-01 3.14588087119622994425e-01 2.41823646173068396159e-01 6.80727767086104718075e-01 1.47506313405121131099e-01 9.13041684631750061207e-01 1.48899752000650531514e-01 7.97603825831429857907e-01 5.49123536399874143110e-02 6.33793632399468620520e-01 4.35875078054079823087e-01 8.93335675972022791314e-01 7.89492130991088607306e-03 9.92151407702816401368e-01 5.19002340282864564613e-03 9.91255415794016214726e-01 1.01747783308831826060e-02 9.75751517685943703384e-01 9.02434746648683061565e-01 7.19314135808206467360e-01 4.10372942584971589497e-01 7.97496467369410044768e-01 2.20780828201230738816e-01 8.86862149721006298719e-01 1.38590057609196903865e-01 7.83345299266563821483e-01 1.14504866949081129945e-01 3.91422291839028102522e-02 4.79973147386628801181e-03 2.26455860223084316785e-03 9.35171109263618926567e-04 1.13786620577898001799e-02 9.99552056849992709431e-02 8.02326316523766847055e-01 1.03220581952764997591e-01 9.82308576200431993186e-01
5 1.00000000000000000000e+00 8.19784582471752454325e-01 6.17136269390688885217e-01 5.35583932819324815000e-01 7.37153640492593242861e-01 3.58819612702685863947e-01 6.88167802145193574503e-01 5.59836556904449333949e-01 6.06783050573062254784e-01 3.32892435611866710499e-01 7.52897773836838091199e-01 2.80193705248737545688e-01 6.88605296540757416679e-01 4.30754790155932557050e-02 8.57897594068582125537e-01 3.45680641663157428578e-01 7.92830860357307543040e-01 8.06986617739755107692e-01 6.95817525717297935550e-01 4.97697875543582746172e-01 9.78488466222728225929e-01 6.09294387344260890416e-01 4.88784678696740471082e-01 4.08031811321110160495e-01 4.36737896467328912120e-01 1.90587790614618696194e-01 7.28924839639101374011e-01 1.76684734896493889078e-01 9.45907896625785782341e-01 5.63324034612429414004e-01 4.24489404002087011847e-01 2.35095029829981400082e-01 6.74153295586153333829e-01 2.09201326550146282646e-01 8.54814829918627006045e-01 1.48144180228757860185e-01 8.55989087219091393521e-01 1.58230369809100629430e-01 7.60025788042448136039e-01 2.62416501249458200551e-01 8.59912001886056653888e-01 3.75578583804601559559e-02 9.65416113028122246931e-01 1.78169980224470517194e-02 9.06968595302903080047e-01 1.95684153651015907416e-01 8.82093606185003653586e-01 8.27173305763399535628e-01 7.37656394000649862086e-01 4.68314534858856712507e-01 7.90265936179297967534e-01 2.39652766077027401526e-01 7.23454120928818777969e-01 2.35237003665503235927e-01 4.48842427253210995985e-01 2.98803478084258222758e-01 1.84461010092790617110e-01 2.64944672662172885091e-02 1.92188841519283434844e-02 1.01768877812068777450e-02 3.89030550575342470854e-02 1.55126570758307824605e-01 7.04980035877532218436e-01 1.18988590302845753666e-01 9.79633603724636481402e-01
6 1.00000000000000000000e+00 7.02567152261610816666e-01 5.64910482870588315230e-01 6.02255714034781730604e-01 6.02441246555648124428e-01 4.89677474612154772782e-01 6.28802212911845681553e-01 4.36463396651161961159e-01 7.48004290475539734828e-01 2.73930944132666442936e-01 8.59163003970769612039e-01 1.67837256177158195003e-01 8.32245914026902844363e-01 1.91057705025387075670e-01 8.11609773093605157968e-01 4.09179959820359206990e-01 7.27235403323690743349e-01 7.68847757268741549552e-01 7.08660618848913959056e-01 5.01463262393263553562e-01 9.60694689964119108438e-01 3.86082554759729634775e-01 6.17739163382704292715e-01 3.05485843922988498100e-01 5.94753619075315542730e-01 1.89954481779686545906e-01 7.78377207077227684096e-01 1.91967732218463665861e-01 9.33182938813422180324e-01 4.98257243790316939336e-01 4.97121155388753011017e-01 3.14588266252255166489e-01 6.38485773282623791935e-01 2.75903693412308581578e-01 7.23487217424016892942e-01 2.60704325473489317844e-01 7.59523827429983922066e-01 2.80145696718622994048e-01 7.30389702346570190983e-01 1.46404274580617943524e-01 8.49295533727789875300e-01 9.17693562040387128542e-02 9.19942525959934642721e-01 5.74100198338155787159e-02 8.65374263152079103989e-01 2.30724416583445085527e-01 8.41982526582914947433e-01 6.74610508962782962072e-01 6.41783469090568159388e-01 6.57880014948885483150e-01 6.14033827152050126763e-01 4.24737443725394736571e-01 5.14876349867823046580e-01 4.02231620440750226031e-01 2.79816772934770807701e-01 2.75825810931632497969e-01 3.41022633457466417539e-01 7.95802572665575830291e-02 8.46006922793013371731e-02 4.98536218884622767122e-02 9.97961032025971028769e-02 1.88317235415408429366e-01 6.13093657658139168376e-01 1.09663085799856882541e-01 9.82175277385424427834e-01
7 1.00000000000000000000e+00 6.57162092907093042804e-01 5.66610361934359763048e-01 6.05270368961040472477e-01 5.94370828925484873118e-01 5.17908802034655835200e-01 6.32746571972159332908e-01 4.39147765191845396160e-01 7.29821692014311573793e-01 3.16801631227886182351e-01 8.04826751683044960828e-01 2.46094135532805208255e-01 7.88927342752820059957e-01 2.95951154883093592307e-01 7.57046940741910701078e-01 4.76117399334007318501e-01 6.70228653649764249955e-01 7.43220804810455382139e-01 7.19587311554013675519e-01 4.70930637739464252878e-01 9.42633560327243769095e-01 2.73306857731803631850e-01 7.04652433380766218818e-01 2.32661300619782296373e-01 6.78173133871040167975e-01 1.90309625530758474987e-01 8.21156533315390513295e-01 1.96354149192681320946e-01 9.18391852009525111455e-01 4.16408701208882847666e-01 5.81550636827977918131e-01 3.43670545657575099430e-01 6.28960562109562526523e-01 3.09016274036582438978e-01 6.87371804665223518072e-01 3.00013222773189314196e-01 7.15737693607515379490e-01 2.76591481852205778313e-01 7.31146453199984724947e-01 9.84859189775799809263e-02 8.51767390199240082005e-01 1.47429331353809561778e-01 8.82868090107278846723e-01 8.26606110316385062076e-02 8.53071602823801455884e-01 1.93056910905103518150e-01 8.31289363873887965362e-01 5.27274631348557565325e-01 6.85565494292970867285e-01 6.59924953717103468520e-01 5.54663016075876091904e-01 5.08446890510329874147e-01 4.49013542974098844862e-01 4.45805154027271888229e-01 3.17603239449903762548e-01 1.69194223706184421196e-01 3.72996150061209008619e-01 1.35159596830845579740e-01 1.62077030996134158203e-01 8.58592956170531190763e-02 1.32701882731194903409e-01 1.98961598717530746550e-01 5.82319740311715738912e-01 1.07793865387329032557e-01 9.83132404204594911867e-01
8 1.00000000000000000000e+00 6.21498062404356677035e-01 5.86304589981719637137e-01 6.04200993982081602240e-01 6.05166917282908278786e-01 5.22450789226670764265e-01 6.56596006862845693597e-01 4.30799858031505056299e-01 7.22103673837484527631e-01 3.45758461837616992707e-01 7.65246847994517920277e-01 3.07369304666475218202e-01 7.52047835226660854602e-01 3.59527143085688172253e-01 7.13439062407337565297e-01 5.30290144068198743277e-01 6.36761953393192081663e-01 7.09560554909821394887e-01 7.38331181129104008320e-01 4.32442426717361216859e-01 9.22174892275393398577e-01 2.27880357598649996298e-01 7.45615189446636184023e-01 2.10330244507379582330e-01 7.09023983683269243272e-01 1.91183482699068374444e-01 8.37277177637135605615e-01 1.96888756147879262492e-01 9.12743356329454025300e-01 3.60681415535145710738e-01 6.40592342260462022097e-01 3.51097034724500156599e-01 6.32580222259521929296e-01 3.19220665693921490380e-01 6.76749700598421655151e-01 3.01803703179001570067e-01 7.06987283775868946556e-01 2.45264902922720962053e-01 7.48005890987412103144e-01 9.15034921599241213297e-02 8.47645792979778822662e-01 1.71466035958347196022e-01 8.62721246957511511688e-01 1.11752919992090027357e-01 8.42632115065404807552e-01 1.51976859108924194919e-01 8.14503537000802579904e-01 3.77110719652846315686e-01 7.50665049902215497646e-01 5.36470510555704827027e-01 6.01389178801158719168e-01 5.12801345572426403585e-01 4.77570400383675153222e-01 4.16083151580585730578e-01 4.59416624417154029203e-01 1.04109961416484306240e-01 3.31738809057275985115e-01 1.74767342624132876461e-01 2.42015171832360542759e-01 1.19216836607220919020e-01 1.55436789574153272353e-01 2.01777281218113752059e-01 5.76993463998555333738e-01 1.09358503838964296606e-01 9.82880450436701358363e-01
9 1.00000000000000000000e+00 6.19274391910054844423e-01 5.85708836673831778619e-01 6.02193459661482299872e-01 6.12738416491758086657e-01 5.21536523375000116154e-01 6.66197169405685851729e-01 4.27953524296345033662e-01 7.21677579052447781827e-01 3.56163212873908174849e-01 7.51255087033547153119e-01 3.37995343729227903928e-01 7.36366985833389220417e-01 4.02911487125786949015e-01 6.86034897979654556543e-01 5.67492269399411886077e-01 6.29004297298578540776e-01 6.71130567005334466302e-01 7.58676008218329589461e-01 3.93202852374409439484e-01 9.02225890811159891847e-01 2.14094441432141596726e-01 7.61968221946489832064e-01 2.01425233597735703350e-01 7.27056733800062637840e-01 1.92923951647937907961e-01 8.40119218167284742549e-01 1.96547652569241781961e-01 9.04209828907874824111e-01 3.02781525098311965483e-01 7.05183024544146164203e-01 3.35863120587193808575e-01 6.56086496550845943432e-01 3.14813395651238281392e-01 6.81671642637059149727e-01 2.84451151070501340179e-01 7.16011835291557874328e-01 2.03766427184185611177e-01 7.73594218022743751462e-01 9.88910648789890767141e-02 8.41775632054025502171e-01 1.93446103246788597696e-01 8.46646617634505882499e-01 1.32546438311914871466e-01 8.35136580433500252951e-01 1.31217483249652488997e-01 8.01342190385523567286e-01 2.97604424327705452402e-01 7.72588510521612370496e-01 4.00169464069348945756e-01 6.80682658369755833050e-01 4.20866739158923919284e-01 5.90719234536349557807e-01 3.24075325765795341226e-01 5.92572977276534018642e-01 1.01488147111131313260e-01 2.61627077301182897617e-01 1.94706312862339137038e-01 3.03758542072846082771e-01 1.49870968094054896058e-01 1.74175572946363516058e-01 2.02518125646649477245e-01 5.92883489991951728726e-01 1.14645968920816895831e-01 9.81737431575913421788e-01
10 1.00000000000000000000e+00 6.24730563098448765658e-01 5.87958137802519709147e-01 6.01816512246452051116e-01 6.20719563929665318902e-01 5.14761839344972438326e-01 6.77584783945227808744e-01 4.21336262226893742966e-01 7.24498388173300034154e-01 3.62964060165797408608e-01 7.43913101467728044014e-01 3.63679421016023074475e-01 7.18588691392083367404e-01 4.39626606653955032122e-01 6.64548837580827278515e-01 5.86465909003364704866e-01 6.33635914382353004903e-01 6.24717975447076523388e-01 7.72578067920160038717e-01 3.67880877892575619548e-01 8.83903967611652352510e-01 2.14275539149916705028e-01 7.72590142122124290402e-01 2.03697970184231524904e-01 7.33954333781477896714e-01 1.97591509776974233459e-01 8.24590959129064660083e-01 1.94879789417090054648e-01 8.94619668662819944593e-01 2.56825456776862914854e-01 7.62839538143076811849e-01 3.04031653994530304264e-01 6.93273473580603982747e-01 2.94536872836882235305e-01 7.02202655064169789512e-01 2.54775987357999500471e-01 7.38221551509838480598e-01 1.71684675183186558067e-01 7.93330925514071916282e-01 1.19704169571107507664e-01 8.31383725082137980955e-01 2.06880156582037594282e-01 8.31265602430556471703e-01 1.60774837241229123785e-01 8.25997784923311217931e-01 1.20538721319228075979e-01 7.88297337427253497211e-01 2.38637537669760313452e-01 7.67243764125625671291e-01 3.12290438792794944334e-01 7.29612804037160223025e-01 3.30842875869626962260e-01 6.78282657991566506617e-01 2.68006358333329142152e-01 6.19342574309011961731e-01 1.82787232133428817482e-01 2.36282555296206647766e-01 1.96292336663770244920e-01 3.40232956464365132732e-01 1.62459940660053731021e-01 1.82007995908224001758e-01 1.98313651143234181973e-01 6.26230150972971966183e-01 1.23091971758009177673e-01 9.79367679807991997620e-01
11 1.00000000000000000000e+00 6.28014245382804703333e-01 5.88367125495728671147e-01 6.01828592075183466115e-01 6.24163504123857904027e-01 5.11753596002056165837e-01 6.81256021191003813264e-01 4.19593696990024356275e-01 7.24814046347765361666e-01 3.69350547037042065135e-01 7.37419660064886461903e-01 3.82516649468619018837e-01 7.10114196265025587884e-01 4.66547407062119334764e-01 6.57286284353970073902e-01 5.88986780606957527340e-01 6.52685262161375789880e-01 5.74554080890216201105e-01 7.86232516453646002041e-01 3.46928682198277271720e-01 8.63547012416069459384e-01 2.22546808656645833668e-01 7.74326892218911599919e-01 2.10963939446249693077e-01 7.38639886986482308018e-01 2.04933308670042446664e-01 8.07766926411633390259e-01 1.97419000352177798074e-01 8.79796524517472144922e-01 2.28390321327785944527e-01 7.96678792255750556350e-01 2.63116521288137505952e-01 7.37634645201051264429e-01 2.56613296079135133620e-01 7.41190980193596415937e-01 2.13710706295592939297e-01 7.71850942068461165491e-01 1.51595127162832604695e-01 8.07868061787471503088e-01 1.51342297222334110085e-01 8.18761829448193090286e-01 2.20812607554455309078e-01 8.15670005524519625695e-01 1.79292937076926117701e-01 8.17138524191271642394e-01 1.27215895560150976662e-01 7.82831242911201541368e-01 2.00240745656940694053e-01 7.41446100065747071284e-01 2.73986970044709676753e-01 7.03832943475633521224e-01 3.02055900435778623692e-01 6.49519683779533951729e-01 3.07672583815373823501e-01 4.88005100051395024341e-01 3.29373685135918192746e-01 2.59756373615341040750e-01 1.55679731018764144768e-01 3.31612666778033804427e-01 1.80475169184414391266e-01 2.46908226641247202648e-01 1.68288443022319822440e-01 7.12265656142327729938e-01 1.49281400635433436630e-01 9.65530693506066128862e-01
12 1.00000000000000000000e+00 5.47341801852836318254e-01 5.96236212232300277769e-01 5.41324728810033128923e-01 6.23007925201551127081e-01 5.29741677356348916739e-01 6.37399814904821671036e-01 4.77414186283135033584e-01 6.65334457288108804818e-01 4.24136400177356209795e-01 6.99733935828746211882e-01 3.70551891673961408813e-01 7.41666168775638845467e-01 3.71479587620290707672e-01 7.46066382988122778208e-01 4.39663138813864151633e-01 7.30809525392585590531e-01 5.50910392738332643781e-01 7.35957995222207950192e-01 4.94135387239287293681e-01 7.74677683721896159774e-01 3.60955464193867425760e-01 7.50230593998047479154e-01 2.84167947928914255140e-01 7.42735659094778677414e-01 2.40616959174902111940e-01 7.88453612508740131481e-01 2.10903668635928714936e-01 8.47518130967850114033e-01 2.11916359907667634088e-01 8.11857030178604777149e-01 2.27494620857578766504e-01 7.78405389425832483496e-01 2.19845936913263317880e-01 7.78056621486642341345e-01 1.91877145666898701881e-01 7.94240165838825729061e-01 1.57891981831176919648e-01 8.07587532840710053961e-01 1.83321824432992719345e-01 8.02586695796973059736e-01 2.32715415573133493909e-01 8.01752989440812302568e-01 1.96703033545524597070e-01 8.06593986591286449261e-01 1.42956410148547902184e-01 7.84255330107682335772e-01 1.76085716314186208065e-01 7.34889618285650247920e-01 2.52478220831444832850e-01 6.76034922918436587125e-01 3.10175411340638695901e-01 5.88163280126227538958e-01 3.62120989017308325675e-01 4.04822090920631094679e-01 3.75872692512659090092e-01 3.11450157477039801801e-01 1.35504433989811240435e-01 3.40154714400574931243e-01 1.96100348726965689750e-01 2.76632680586971657632e-01 1.77237238330011703802e-01 7.20672490046379343731e-01 1.53462609239358005464e-01 9.54912583727425712254e-01
13 1.00000000000000000000e+00 5.14642199617537765555e-01 6.03098652979896954207e-01 5.36212585541289810109e-01 6.00437242394973091919e-01 5.31045247076671556030e-01 6.21365378302615289918e-01 4.87144149989523100874e-01 6.64429539442598082744e-01 4.17758896000141377591e-01 7.30132303561381035273e-01 3.32988294811993490452e-01 7.88521320310298201584e-01 2.83133937501620469579e-01 8.11479081616034103597e-01 3.12119797932252029948e-01 7.74219530397562083479e-01 4.63062846020706908590e-01 6.78891004771326578293e-01 5.72494740221220488330e-01 6.28985536028590863644e-01 5.48751667616781513281e-01 6.50451480650910296433e-01 4.35128409348892519759e-01 7.07755909987686004925e-01 3.35665650516157099137e-01 7.60182570015745073810e-01 2.69325607730225125014e-01 7.88527046373049267380e-01 2.35078148787053881064e-01 7.83411008657634355679e-01 2.26594844043551763013e-01 7.80811252590357662839e-01 2.26261570488008961766e-01 7.77010964383880953221e-01 2.38226691541791324447e-01 7.73674683014065944775e-01 2.51868379087150817686e-01 7.61917192615313210169e-01 2.61291571612915773937e-01 7.58303268509474492909e-01 2.47586043830388513598e-01 7.67126055378857030220e-01 2.03761607182741888433e-01 7.79258803571799996135e-01 1.70511453804756157870e-01 7.70970286941466742547e-01 1.81128905095253395219e-01 7.26035873180828628115e-01 2.37370027238039543738e-01 6.33500630041150092353e-01 3.12891385231310159565e-01 4.85412564921961053876e-01 3.77593011536346445656e-01 3.63861067457207365550e-01 3.39481743729798002285e-01 4.33572445860804622786e-01 2.18320609318627262274e-01 5.07325279176965238115e-01 2.65373603817979031305e-01 3.12056265449807024304e-01 4.49040463060096484149e-01 3.63312295361804482585e-01 3.79790414415207000509e-01 5.52318962307968397418e-01
14 1.00000000000000000000e+00 5.42135357612765433899e-01 5.97616299814724416528e-01 5.56195915208652857942e-01 6.02036593722303225995e-01 5.22741196295338994560e-01 6.38802020212674181998e-01 4.59817074218267951569e-01 6.91631510841739238771e-01 3.83235647317281102886e-01 7.48912088384916629913e-01 3.15230977795185884904e-01 7.92019799920536282656e-01 2.86456963945085185674e-01 7.97623694142818528974e-01 3.25919722726442651073e-01 7.54895852838628256265e-01 4.37359271497437307463e-01 6.79195559731165410255e-01 5.35669879815601768236e-01 6.28799891485629980359e-01 5.47837620196682362206e-01 6.32991389588186237347e-01 4.76747389265549437187e-01 6.71995036028169567821e-01 3.92158664505920073751e-01 7.14809421975398096016e-01 3.24073813046777126079e-01 7.35879471435121890188e-01 2.90131180047549175338e-01 7.42376313981296109823e-01 2.79530561251266573830e-01 7.45825064022650141560e-01 2.78990057646236688793e-01 7.41908593260001580916e-01 2.87227091006861445788e-01 7.37595016038752548937e-01 2.86725536010035975121e-01 7.37053628878573396932e-01 2.70810187232783383671e-01 7.47563091429356507689e-01 2.40735455010954613186e-01 7.60077864410777737092e-01 2.01609389442278158500e-01 7.67259850474837912238e-01 1.79329754738212610032e-01 7.46891585868888929767e-01 1.99105245852917916993e-01 6.73430876591622040728e-01 2.64769308004649150945e-01 5.52125655645588686582e-01 3.41519782970421625912e-01 4.33239748442772021342e-01 3.70568637153429802922e-01 4.17230660759300542306e-01 3.17341319689432466156e-01 5.12695867040564690065e-01 2.45400188658099455141e-01 5.50088137313004210682e-01 2.76946177790124925533e-01 4.21589729990686223893e-01 3.82423902622318900857e-01 3.50987757947825385063e-01 4.00826618381133037428e-01 4.55282040825913447701e-01
15 1.00000000000000000000e+00 5.46926107238204450844e-01 5.96964859501826650146e-01 5.57595337853848738163e-01 6.06979384520075493370e-01 5.22433140491411651674e-01 6.47450110801786160586e-01 4.51996525246560476585e-01 7.04705892952918855343e-01 3.72106010270274178975e-01 7.59649319367965647487e-01 3.12625580993081797487e-01 7.90946262760510832024e-01 2.99709311801211630844e-01 7.83054606027734245721e-01 3.45365116996266485749e-01 7.37054184428108771776e-01 4.32815181525359915504e-01 6.74689885476939754660e-01 5.09012657661544576371e-01 6.32341906216399740615e-01 5.28792277400404908683e-01 6.29959140190629263145e-01 4.85702666988337528053e-01 6.57070662333803401367e-01 4.17734151894552985240e-01 6.91165458413730782183e-01 3.58010322471909947506e-01 7.13879695197188302025e-01 3.21555886414402858353e-01 7.25172677059967241142e-01 3.06286013857201833144e-01 7.29721496517822143524e-01 3.02422707381959310347e-01 7.27966311865325899078e-01 3.01169489714648686007e-01 7.27730112780615057133e-01 2.89425058402507262567e-01 7.32999185362565475188e-01 2.64902011034227558017e-01 7.45098237597592749637e-01 2.30776357138329946128e-01 7.56859050662621490879e-01 1.98488559380112089547e-01 7.53015148640205800312e-01 1.90695097819974235254e-01 7.08427940496627051026e-01 2.25950640937617241999e-01 6.08388159259598104711e-01 2.96048744465738145060e-01 4.90128057304815456519e-01 3.51297167465655368890e-01 4.33633170839034520760e-01 3.46267077535085288087e-01 4.81558464237992978063e-01 2.95277925576307720412e-01 5.65653070819815195769e-01 2.59820862361064885970e-01 5.72847934986170592708e-01 2.92460335282864358764e-01 4.95286494343743277646e-01 3.62539779472552003980e-01 3.95629408875414756430e-01 4.09926008783704276528e-01 3.37839598303503518828e-01
16 1.00000000000000000000e+00 5.55839065662370512833e-01 5.96488185313454488679e-01 5.61948747405096371565e-01 6.11663075260560629154e-01 5.17000732327519085807e-01 6.57596947552272381721e-01 4.40365875956003238745e-01 7.15016894533736402373e-01 3.63602267285294433741e-01 7.61113733610591314260e-01 3.15427211559334008673e-01 7.82901459396349919118e-01 3.10590360858566227886e-01 7.70928242596736978953e-01 3.52050652702628585899e-01 7.30013010778781112897e-01 4.21131271542731167035e-01 6.79655372048770578530e-01 4.82497191026182492557e-01 6.43595466673504201793e-01 5.06786849027422325875e-01 6.35397284126547723382e-01 4.85467962861089563642e-01 6.51719073436308748981e-01 4.35447499840149354622e-01 6.78875405921712138380e-01 3.82783179068370560394e-01 7.02887210071813761658e-01 3.43417336897616165547e-01 7.18234391225200496933e-01 3.21028232422559456349e-01 7.24687765904228231584e-01 3.09008418939977602680e-01 7.27272301530277331949e-01 2.98286285726234279281e-01 7.31088736238883374341e-01 2.78473000662954772721e-01 7.38442599332341576002e-01 2.47514518392187299334e-01 7.49761111288130499553e-01 2.14043033024645057427e-01 7.52437549068527222751e-01 1.95466838455752162096e-01 7.25630846655620720398e-01 2.12021951062813185374e-01 6.50058129722281718976e-01 2.66737638525226805619e-01 5.42828536010397932898e-01 3.29627164295788810389e-01 4.63672885506069165640e-01 3.56076406912342602329e-01 4.63945093172924538649e-01 3.31030659159820772608e-01 5.30434435779534751987e-01 2.86243702169494740328e-01 5.92650740400857412027e-01 2.66507269596462204042e-01 5.84472298267372458724e-01 2.95627473674420826466e-01 5.01632897762321450230e-01 3.59308238606180718744e-01 3.92517137521325776284e-01 4.10432672600788195361e-01 3.40591475044640545899e-01
17 1.00000000000000000000e+00 5.56303645902728405304e-01 5.96411991814541297963e-01 5.61913867567312652618e-01 6.12239552752493199073e-01 5.16647427565463002175e-01 6.58556068696776630844e-01 4.39732810771178039833e-01 7.15726503026854254941e-01 3.63975646170647426647e-01 7.61853752677557172213e-01 3.17635929455588883474e-01 7.80603868955991209155e-01 3.15311156741559184269e-01 7.66701765070845753236e-01 3.53800759495672967336e-01 7.28419886731364485399e-01 4.13202749714267125736e-01 6.83689935515610192063e-01 4.66284330129245250252e-01 6.50786579517239172077e-01 4.90874398425372671095e-01 6.39997673489449026007e-01 4.79374488550065425141e-01 6.50506414583937764284e-01 4.41483251239384699716e-01 6.72794801457646696186e-01 3.96566682184684549117e-01 6.96117364254486337138e-01 3.57623145156353128282e-01 7.13452478589431615674e-01 3.30225293710645462220e-01 7.24283695315035003226e-01 3.10174354225793258433e-01 7.31071814572062939064e-01 2.89663104355388056899e-01 7.38211998676559733035e-01 2.62208120046951154158e-01 7.47807697335528875904e-01 2.28944273177765500460e-01 7.53377553625074969368e-01 2.02621496750183538449e-01 7.35924558269326012372e-01 2.04623061369852976554e-01 6.72740499566348515437e-01 2.46657212098546990697e-01 5.72817791386968200307e-01 3.07017270201502989746e-01 4.87076600031302098248e-01 3.45357306493751348153e-01 4.69135035698935221049e-01 3.38538205770093580949e-01 5.17520882526692704850e-01 3.03011958268437520125e-01 5.82612546139861353645e-01 2.76776989127599015728e-01 6.08104981294314894669e-01 2.80971629482183404836e-01 5.73515157164303790438e-01 3.16112677030494670927e-01 4.95626066627344596949e-01 3.68075162395750388189e-01 4.02857803772778411133e-01 4.10012915513353892738e-01 3.67735361775282265651e-01
18 1.00000000000000000000e+00 5.58866415599548194137e-01 5.96497125336924005623e-01 5.62651933078798460741e-01 6.14242235930820945633e-01 5.14219232169443096758e-01 6.62263464268694312942e-01 4.36198491390952347579e-01 7.18731593949263780630e-01 3.63366777644584248996e-01 7.61193363307677062224e-01 3.23051019120226767800e-01 7.75131065552781550743e-01 3.25461704678315422168e-01 7.59221173206390598232e-01 3.63691034921825084858e-01 7.23139859377498805948e-01 4.16298806913575791810e-01 6.84400762526846673239e-01 4.59943122440947094187e-01 6.57619909554241766081e-01 4.78820557788586176340e-01 6.49328621102768011042e-01 4.68063740868227828873e-01 6.58611228758986366749e-01 4.34835486331339893251e-01 6.78463520313031254183e-01 3.93501763163819739955e-01 6.99651810156170839150e-01 3.55851601157500141426e-01 7.16421024494925173798e-01 3.26204864442913244904e-01 7.27436418737178791538e-01 3.01206366164598282609e-01 7.35420864597390089301e-01 2.74753668986503218896e-01 7.43394711917850448124e-01 2.45110432679199991002e-01 7.49294169030862655667e-01 2.18206898105186841708e-01 7.41296290081779218895e-01 2.09302857832329131105e-01 7.00964778025182866372e-01 2.33168873482087563032e-01 6.22310722994753762194e-01 2.82544262740117679833e-01 5.34451481305084352691e-01 3.29817668574131139803e-01 4.82971418459821166813e-01 3.46906030416970101449e-01 4.93253893499003115419e-01 3.28956753201941398679e-01 5.46615770912665444037e-01 2.96602650593596972595e-01 5.99514581315417571794e-01 2.76635241107606399957e-01 6.12772088902271416799e-01 2.84662970769527179371e-01 5.72990217541604174301e-01 3.21089953195137278730e-01 4.91313322479589420499e-01 3.73347492052601648282e-01 4.03879959802987964501e-01 4.09807043289668215813e-01 3.74056837657516516593e-01
19 1.00000000000000000000e+00 5.40613007161506731180e-01 5.99235637981572200061e-01 5.49405250350338825172e-01 6.09238555505461243378e-01 5.15894540549067581736e-01 6.45469227737804573941e-01 4.52608963141295839172e-01 6.93730706383392847769e-01 3.83784602977041700012e-01 7.38073871772149892045e-01 3.30468574501245226926e-01 7.65873154102996278603e-01 3.04809084394696949705e-01 7.71331009686697322003e-01 3.08512480447383441451e-01 7.56204133866095862260e-01 3.34614020190912853092e-01 7.27661733202046301372e-01 3.71529533516152088435e-01 6.94863584699346392703e-01 4.07464290341400137141e-01 6.65656593316613309774e-01 4.33613351839876259852e-01 6.44966917238262160694e-01 4.44775203402283214604e-01 6.34031604013462701808e-01 4.41129527511168850751e-01 6.30868766364698352334e-01 4.27551872622917217281e-01 6.30730023556298813325e-01 4.09945138095368533104e-01 6.28833972883099057150e-01 3.92966106583196861379e-01 6.19779851318206898014e-01 3.80663926633804217126e-01 6.03245555076838524400e-01 3.75174767905294637149e-01 5.73597676812814150082e-01 3.80595332419683518577e-01 5.36280166741242458883e-01 3.87457158616224983660e-01 5.06604050282480788958e-01 3.76321766519708167387e-01 5.13328753514638802535e-01 3.34180421071915312314e-01 5.68300798215629510146e-01 2.79191180445762854312e-01 6.39464772023894845177e-01 2.30633835043535823095e-01 6.99037709670589424427e-01 2.12137995771051107718e-01 7.09604685163057635755e-01 2.31522627358077826010e-01 6.67786930954924140558e-01 2.70391106312898699127e-01 6.01179386756522937674e-01 3.22607275324156506091e-01 5.31713465981847765995e-01 3.66960264062589636147e-01 4.77456758286846305595e-01 3.97667358075581123256e-01 4.52612056120249128810e-01 4.00488389649039544516e-01 4.67558937935063090308e-01
20 1.00000000000000000000e+00 4.80405557011595374384e-01 6.13042390699245598462e-01 4.95575649301972898098e-01 6.09140727012379423755e-01 4.95926760621337725521e-01 6.17423939584310077500e-01 4.78149659526186709968e-01 6.36699580846666002287e-01 4.44625167934900256128e-01 6.62377410590670456791e-01 4.03610272944804837625e-01 6.93358300252178594292e-01 3.62710101069038726163e-01 7.24844776097993359620e-01 3.17926506901335892419e-01 7.51214610833702778336e-01 2.90115900347578836715e-01 7.72405222026869675567e-01 2.69354042601039622706e-01 7.83746068604430079496e-01 2.64068894409015153535e-01 7.76133060449797573810e-01 2.79747349826250379934e-01 7.49391903718871654760e-01 3.09850318134977875673e-01 7.13226978500879127409e-01 3.40838215022696344736e-01 6.80329611829799674183e-01 3.64698107972845741998e-01 6.55685699688059009382e-01 3.81341067808764699887e-01 6.37325215377843368181e-01 3.89681349701216039882e-01 6.24984995402902865358e-01 3.90547652073284734531e-01 6.16126512718469743213e-01 3.88919391224573696153e-01 6.08427824444816689464e-01 3.82614160635583344661e-01 6.06953970713684398675e-01 3.66818248059183393828e-01 6.14576829515963707351e-01 3.38311837652212676897e-01 6.35772905269177512899e-01 2.97151115902023588156e-01 6.68001329881660277366e-01 2.52348624688771061564e-01 7.03962041229713952895e-01 2.19645059753602017727e-01 7.22945807433172160650e-01 2.12571538759098621618e-01 7.11459474232289834639e-01 2.31737471713503534465e-01 6.68340285806619527342e-01 2.70261674972138155049e-01 6.03701676671961062759e-01 3.20302092618429290471e-01 5.34688835373956283803e-01 3.65357039981779319060e-01 4.79138893253217623691e-01 3.95264237182156086270e-01 4.55126782997033629830e-01 4.00249862715878146346e-01 4.68721409873998240414e-01
21 1.00000000000000000000e+00 4.79337687928602929066e-01 6.13418737421740578597e-01 4.94546163628791612954e-01 6.09365906018411340739e-01 4.95301308868954792697e-01 6.17375279833166867860e-01 4.77179837728703981625e-01 6.35927929680684678182e-01 4.44945551838659969501e-01 6.62092264439115396613e-01 4.04673707258712544999e-01 6.92329497287044404175e-01 3.62347886554915454838e-01 7.22005178538805414412e-01 3.22765956691168476311e-01 7.48007902616002140483e-01 2.92227738333662778736e-01 7.67439745744746382172e-01 2.70742410936433308688e-01 7.77392158680570100060e-01 2.61603628530497733795e-01 7.73763367952030045593e-01 2.66334429269238504023e-01 7.57380270194150218011e-01 2.80123568743097905998e-01 7.34412106032399703004e-01 2.97456674297211176583e-01 7.11442935220626737625e-01 3.12679197579018630648e-01 6.92603776641692037153e-01 3.24461050488616398191e-01 6.79161347599939957398e-01 3.32092482539506961281e-01 6.70526360193088533102e-01 3.33951009670327647605e-01 6.67072325844947244811e-01 3.29719390428665326542e-01 6.69476568681665162863e-01 3.18499637792477696685e-01 6.77261468626088380951e-01 2.98259168306464428344e-01 6.92896361390865855867e-01 2.72187042262009681881e-01 7.11646299775657187325e-01 2.44172494429113623449e-01 7.27640714227885454513e-01 2.23074727710134895764e-01 7.32771517691802820593e-01 2.17215843447676498768e-01 7.18140178352154490149e-01 2.32294214724388686788e-01 6.83407962820229974987e-01 2.63001249860047192630e-01 6.33066181662156113319e-01 3.02171558385813998626e-01 5.74240271299457649690e-01 3.42852053504072551426e-01 5.23030531724871350363e-01 3.74797066089051444937e-01 4.90956537979244211911e-01 3.92303994575873560269e-01 4.81760894764652447542e-01 3.93259741410282193108e-01 4.95408947251886333518e-01
22 1.00000000000000000000e+00 4.54856618669543910638e-01 6.20765090809789477078e-01 4.68008290246719249605e-01 6.15627477358458685686e-01 4.74791078381901154870e-01 6.17730046629464846220e-01 4.69296127696650078320e-01 6.26062048922295444342e-01 4.52807404217129783053e-01 6.40788011316962613506e-01 4.28568657254215279462e-01 6.59304445433920527364e-01 3.99728554518371193005e-01 6.83218214773380849714e-01 3.65057206190060934414e-01 7.07845765179523911392e-01 3.34130493351821655779e-01 7.30321465187979912415e-01 3.06543217267362666512e-01 7.51286149690117643907e-01 2.82524712846944858757e-01 7.68619125293053317982e-01 2.64701875660785013178e-01 7.75739348467932132714e-01 2.58667883961809064175e-01 7.70299103696209908065e-01 2.63785387366515911012e-01 7.55372755687734764862e-01 2.74408835695422737011e-01 7.37077895684230099960e-01 2.86026954400015243074e-01 7.20310392857419934387e-01 2.94249454629451123733e-01 7.09239354665118448828e-01 2.96468694144597588735e-01 7.03877009966398570207e-01 2.92958349085191305239e-01 7.04020279431216255972e-01 2.83396708321607904146e-01 7.10273272240918629450e-01 2.67579177505419540939e-01 7.20531025918275114250e-01 2.48810364517047549748e-01 7.31032813443481699345e-01 2.32562117701867548947e-01 7.35831016611162680441e-01 2.24461632262553945072e-01 7.29367680592910239135e-01 2.28741328501385871030e-01 7.07665319057801833758e-01 2.47354819301142336840e-01 6.70939121815495420620e-01 2.77373038835967755666e-01 6.22940244987368441087e-01 3.13334976277577781367e-01 5.69560321806409586287e-01 3.49543504035615848480e-01 5.22278490371046788532e-01 3.78295763517066341297e-01 4.91859055611295170607e-01 3.93648404427391962468e-01 4.85030883333341322761e-01 3.92130222903121494760e-01 5.00374919467152290409e-01
23 1.00000000000000000000e+00 4.48338429039036756585e-01 6.22802857742200233204e-01 4.60619747854847216839e-01 6.17609617652513320785e-01 4.68547089601356103739e-01 6.18167701012003689698e-01 4.65360551092405150264e-01 6.24534416536938419284e-01 4.52739019023463196145e-01 6.35913641902679960261e-01 4.32767741096032387826e-01 6.51228879489954337600e-01 4.08020000113473946257e-01 6.69285388652698376433e-01 3.80145852747541979078e-01 6.88602581547705372422e-01 3.52417294205362274795e-01 7.07899843314212851020e-01 3.26012383766726865364e-01 7.26348568031751962160e-01 3.02206775600942778581e-01 7.42026039841799045504e-01 2.82256368747145214293e-01 7.53792727909559201471e-01 2.67659546431344042006e-01 7.59957886284368666630e-01 2.58593300458448083212e-01 7.60724331131828690467e-01 2.52742963955966071232e-01 7.60032524856372515565e-01 2.45786580166729079489e-01 7.59363211979613428326e-01 2.38417682509138612046e-01 7.57143237915693267936e-01 2.30362833487693069445e-01 7.56698645795794710978e-01 2.24033333109056209675e-01 7.50517817399390274602e-01 2.28533015906748321333e-01 7.40613520154894233727e-01 2.40178712771704661044e-01 7.21226176967670995488e-01 2.59397678177882728967e-01 6.89174599104339313804e-01 2.83400636649121795418e-01 6.62462261482973713278e-01 3.03675784597297271361e-01 6.30340713575556210735e-01 3.27366767491607368878e-01 6.01894563970318596802e-01 3.45236081575977349356e-01 5.77489832462242280720e-01 3.62808627500406655209e-01 5.54607852480865970435e-01 3.72389450641919750318e-01 5.39536923218863928575e-01 3.80477089926938905062e-01 5.33416766097029815263e-01 3.79045928340144944180e-01 5.42055600706712992221e-01 3.79392436696532331375e-01 5.50072106645922764834e-01 3.74213883802693048075e-01 5.61315577049631642126e-01
24 1.00000000000000000000e+00 4.24286464381517236522e-01 6.30942145206657478695e-01 4.31902363153973178900e-01 6.27462138976684236091e-01 4.41186944725870000550e-01 6.25761937106177335011e-01 4.43815943970981674482e-01 6.26956673235414707612e-01 4.40972694057996217332e-01 6.30374485250103089307e-01 4.34394748252508400288e-01 6.35206027747654111693e-01 4.24339061359940483698e-01 6.41763214641066226385e-01 4.12030522612576222130e-01 6.49432976996614286236e-01 3.97887020646142397506e-01 6.57591392470298852224e-01 3.82886681875177437018e-01 6.67297332722081137923e-01 3.66304278107010938825e-01 6.74247423014157631904e-01 3.54072553470605011494e-01 6.86181907720478490020e-01 3.34155030739660241501e-01 6.99785088839561919549e-01 3.12232622162191553183e-01 7.13399421891431906317e-01 2.94633175329516605601e-01 7.23724387487337028624e-01 2.80864410610813020064e-01 7.28668322427906911543e-01 2.72834384911180893862e-01 7.30179829627611520770e-01 2.69498580890116301578e-01 7.26030374849415571781e-01 2.70328077085754181486e-01 7.17682174551610430058e-01 2.76318943808141537222e-01 7.03377265693255315782e-01 2.85597982295044405809e-01 6.87479671112891876916e-01 2.96631693597656787009e-01 6.63837933758874565449e-01 3.11955689628816812409e-01 6.40164035414134913182e-01 3.26446188153333205495e-01 6.15627053159907733360e-01 3.41665108486588819936e-01 5.92392565158943895653e-01 3.54526477530018979678e-01 5.72568432739527399811e-01 3.65772056923904465009e-01 5.55592332856265636032e-01 3.73784706917931419667e-01 5.44172293828626085777e-01 3.79199424991083111625e-01 5.39380905495856155518e-01 3.80222439436398162993e-01 5.42824450280961157134e-01 3.78466790060504321147e-01 5.53306586448429560399e-01 3.73250160846209044774e-01 5.64125998270615935937e-01
25 1.00000000000000000000e+00 4.24055868772097777075e-01 6.31044776162629994509e-01 4.31710934612436314506e-01 6.27441757243551001544e-01 4.40656722954960777816e-01 6.25986908997140711897e-01 4.43309835767223714420e-01 6.27195194131731748044e-01 4.40536352999299551936e-01 6.30630232661999468036e-01 4.33588666225509511420e-01 6.35747659872456738483e-01 4.23566027556792124020e-01 6.42082852175450136123e-01 4.11361430813719342048e-01 6.49223744800020208245e-01 3.97690104500876828730e-01 6.56876928697883166741e-01 3.83287913653242773293e-01 6.65599789575803901798e-01 3.67865083698258488187e-01 6.73026821935611363479e-01 3.54290470981514338256e-01 6.81530233332909740618e-01 3.38565473003856753920e-01 6.89817273149369691865e-01 3.23502071474992602962e-01 6.97215123701362959885e-01 3.10981295756832920585e-01 7.02516860159525413643e-01 3.02138639246668061489e-01 7.04923583392300878714e-01 2.96542421246745235841e-01 7.04562713496146630909e-01 2.94072999994893502507e-01 7.00415658039886035446e-01 2.95324936018213912714e-01 6.91083023009186336871e-01 3.00507231899186877389e-01 6.77227930463380922710e-01 3.07997852843117314592e-01 6.61009953692282437032e-01 3.17194533665191069627e-01 6.41818759455673348846e-01 3.27967898793934009571e-01 6.23483991986561458809e-01 3.38062795446399444454e-01 6.05593727694658912064e-01 3.48009611725920542380e-01 5.88570426221418974144e-01 3.56952255336399015828e-01 5.74229572203954430343e-01 3.64384890595140509273e-01 5.62977951865747505700e-01 3.70218993560831322043e-01 5.54210315658218433121e-01 3.74333842775001257586e-01 5.50548850830629321607e-01 3.76100999433852611897e-01 5.52009608277221897055e-01 3.74709609038645585777e-01 5.61168161962204981030e-01 3.71083121044036512437e-01 5.69658729717130940529e-01
26 1.00000000000000000000e+00 4.08018907809991726587e-01 6.36619626407509686672e-01 4.11886893682482435608e-01 6.34941402422212308743e-01 4.19793591154145884214e-01 6.33906113483106214979e-01 4.23942577622697658324e-01 6.34005306930271350652e-01 4.23652570488360191714e-01 6.35782628308136477102e-01 4.20961159912547344675e-01 6.38921590031072517135e-01 4.15587269024244754245e-01 6.42751106016362649953e-01 4.09032608279614962044e-01 6.47202228241777866025e-01 4.00732850378449856343e-01 6.51646407137204008997e-01 3.91884022676103560556e-01 6.56377087389605429202e-01 3.82752331887760866014e-01 6.61307303935831147790e-01 3.73014271268347130661e-01 6.65955843081331377853e-01 3.63398333258155126213e-01 6.70727443057566041773e-01 3.53810794588299670771e-01 6.75353990412267513044e-01 3.42662531215509713611e-01 6.79899707265236630249e-01 3.31537848040635463320e-01 6.82722942353197859156e-01 3.23387043176771249442e-01 6.83245530684288726597e-01 3.17769550468700257007e-01 6.80707875030321707399e-01 3.16060801024123594338e-01 6.74055396076910784409e-01 3.17637116172602818054e-01 6.64211757267296865059e-01 3.21111012230355041819e-01 6.51143143801889201505e-01 3.27011363759427409192e-01 6.36277055208253394802e-01 3.34068778092091345222e-01 6.20709174180991030134e-01 3.41698937598071406097e-01 6.04993235123718942070e-01 3.49668408975843447717e-01 5.89780710041890254836e-01 3.57343488592402780402e-01 5.76147110138396145729e-01 3.64208260018224760923e-01 5.65001691216734380774e-01 3.70000386391118374352e-01 5.56543120721597395217e-01 3.74003236706515584942e-01 5.52609262857512217870e-01 3.75632035819823517642e-01 5.54488281388715531506e-01 3.74317286109946578687e-01 5.63288885941390371492e-01 3.70394410534735429863e-01 5.71696366889366980324e-01
27 1.00000000000000000000e+00 4.00442709400811891474e-01 6.39243835624059175693e-01 4.02509458514696605302e-01 6.38385700967861513533e-01 4.09732216952312211511e-01 6.37506856486723005872e-01 4.13496771225619952350e-01 6.37754785197103934991e-01 4.14018730434472792545e-01 6.39088154163966915000e-01 4.11977387401477712636e-01 6.41244434253908757171e-01 4.08023392739115253747e-01 6.43926748382402269755e-01 4.02687232908013503785e-01 6.46937694567794263634e-01 3.96352508832344740952e-01 6.50029593976212849427e-01 3.89584313734614828828e-01 6.52826990775659088406e-01 3.82632962892538341926e-01 6.55252558647664185010e-01 3.75546433084134156921e-01 6.56927183954302829072e-01 3.68746443255822287099e-01 6.57522987713923701136e-01 3.62185818364466449726e-01 6.56702936857372243651e-01 3.56014040375894180723e-01 6.53670890708644591882e-01 3.51175314965055995753e-01 6.48019420700255199819e-01 3.47894483596209280751e-01 6.39058666417486209710e-01 3.47190388182810005802e-01 6.26386417573266296444e-01 3.49132281670066935142e-01 6.12900722574170830903e-01 3.51512243340202756858e-01 6.02956699236367743566e-01 3.53359641067724605801e-01 5.97516303427253925307e-01 3.55290797349291642693e-01 5.95116513477086717110e-01 3.55479349104816155780e-01 5.95045209872337332868e-01 3.53275702418205883593e-01 5.98509691187909309562e-01 3.51678033634590825329e-01 6.00141691998761883653e-01 3.52092188872388744958e-01 6.02305825912854864157e-01 3.53197251986994975592e-01 6.06593331513680555922e-01 3.50726220922316034301e-01 6.10689203974597694113e-01 3.50568210818734293799e-01 6.16297445866960336147e-01 3.51293945581188926663e-01 6.20365246242129075860e-01 3.49619742359831620071e-01 6.27543925178124739617e-01 3.52326804190934761429e-01 6.23769312391306618437e-01
28 1.00000000000000000000e+00 3.29227182765746362314e-01 6.64234972837631332254e-01 3.11184024324191121913e-01 6.74387222180773404645e-01 3.06879035694325508210e-01 6.79897661218932580773e-01 3.05046221819323226665e-01 6.83291207065968686507e-01 3.04000154586024529113e-01 6.85920583095038671750e-01 3.04010977478069766011e-01 6.87578539320549908531e-01 3.02570212607294775076e-01 6.90087632650762450304e-01 3.03675033588502563120e-01 6.91158342294149519169e-01 3.05586825949554885540e-01 6.90978659072485568160e-01 3.07614807159875880416e-01 6.90319447656745577291e-01 3.11042285734224044358e-01 6.89820440000632917332e-01 3.11228499594870811062e-01 6.89048522389849815717e-01 3.12722768281249063893e-01 6.89131001944574106410e-01 3.15887208811353903393e-01 6.86064623215589142191e-01 3.16248378296937526777e-01 6.88319341953406826917e-01 3.20296072952277410817e-01 6.85777064776382894173e-01 3.29487409610079884370e-01 6.80143785493691699351e-01 3.35419915422309977693e-01 6.75259571138154046643e-01 3.41540904967809588744e-01 6.68494869982834805100e-01 3.44203831722517894498e-01 6.64130701673135148688e-01 3.42512897784501668674e-01 6.63889308793036314604e-01 3.38161226882405685501e-01 6.64407550591840312393e-01 3.34227940084686370170e-01 6.66385405490812710028e-01 3.30852215185113263107e-01 6.68476603017131965068e-01 3.27928984401306300445e-01 6.71178642262279745445e-01 3.26039285610983109454e-01 6.73554789365548134406e-01 3.24761701418047221690e-01 6.75889810570941440560e-01 3.24756398591550754507e-01 6.77341919549544702051e-01 3.25529879677842082231e-01 6.78275666530714138602e-01 3.27377730752520634816e-01 6.78395247656956579263e-01 3.30948437202292222725e-01 6.76570445641470508136e-01 3.39053064781495439028e-01 6.61568906829420266824e-01
29 1.00000000000000000000e+00 3.29069446911047447379e-01 6.64262621761184779423e-01 3.10963476851343290086e-01 6.74437611027710048894e-01 3.06650821034070819593e-01 6.79901738795676946481e-01 3.04632964089465885227e-01 6.83516867195055111139e-01 3.03559001448983956095e-01 6.86128745137112860952e-01 3.02985924826659092091e-01 6.88064387603491423029e-01 3.02708806604647884253e-01 6.89725942235412503578e-01 3.02909929431989577431e-01 6.90829613652392926504e-01 3.03300691514571618690e-01 6.91625033715189685424e-01 3.03771918893691539321e-01 6.92128539160398403851e-01 3.04523028072427315305e-01 6.92478293648846054964e-01 3.04986682500344552516e-01 6.92612050246657506847e-01 3.05851010922336297160e-01 6.92816888722148749302e-01 3.06545536630476789242e-01 6.92723441452507526783e-01 3.07190477457163713115e-01 6.92805308275588727085e-01 3.08466411593151801362e-01 6.92225634199238104571e-01 3.10274428073409880291e-01 6.91563520461563774333e-01 3.10827552917521732212e-01 6.90668733054073391564e-01 3.11748526393280267488e-01 6.89659966247657907346e-01 3.12363822807603663811e-01 6.89675702464633944011e-01 3.12078869487338539379e-01 6.89981302570276122665e-01 3.11277450179137493702e-01 6.90677437110962411104e-01 3.10159748689012970679e-01 6.92108611005609608569e-01 3.10222442911068541083e-01 6.93770065619753517616e-01 3.10379528862732512184e-01 6.95170111039568050515e-01 3.10878929089158928534e-01 6.96138540666021099490e-01 3.12466680447359701489e-01 6.96363048524431094144e-01 3.14088979534569379126e-01 6.96227583764355784091e-01 3.16729550087436195760e-01 6.95253704233763314413e-01 3.20142264455394787159e-01 6.93357880758891376161e-01 3.25633515652377858451e-01 6.89018989078329369136e-01 3.35774907156467850022e-01 6.70918761045241951457e-01
30 1.00000000000000000000e+00 3.28871688566092279515e-01 6.64277099317850283633e-01 3.10680072489058156648e-01 6.74473425552702954278e-01 3.06305851309087773249e-01 6.79952318082145179545e-01 3.04247450614334391528e-01 6.83572060542779191827e-01 3.03139409789495883896e-01 6.86180365859022867170e-01 3.02544553070602795231e-01 6.88152712495083362931e-01 3.02258374769367343937e-01 6.89690442512974288825e-01 3.02169348129490533683e-01 6.90917311116954313555e-01 3.02215788134764296036e-01 6.91913652955205127348e-01 3.02354573283630911895e-01 6.92738309171339938786e-01 3.02559036398275971180e-01 6.93426233715427886573e-01 3.02817454432952493093e-01 6.94001578360112780786e-01 3.03116173017929813049e-01 6.94512039045968365691e-01 3.03443914095811229092e-01 6.94918240469865056141e-01 3.03989451995119175365e-01 6.95248438710133642715e-01 3.04322646974163502076e-01 6.95645160586841448946e-01 3.05425640235858886218e-01 6.95603644164625833923e-01 3.06207764874124488408e-01 6.95332175016941889112e-01 3.06889218451858181158e-01 6.95168931135833112478e-01 3.07472318916914011400e-01 6.95201541123187549687e-01 3.07847493013399975403e-01 6.95364697678794163593e-01 3.08070658353346127356e-01 6.95653134900034775256e-01 3.08320303370684445365e-01 6.96138632445219007749e-01 3.08881219235847326310e-01 6.96578107602905283180e-01 3.09572571863990231300e-01 6.97006651251908304623e-01 3.10605809242700259265e-01 6.97140102455094612388e-01 3.12049182802471569698e-01 6.97064685418435692199e-01 3.13967075786315108488e-01 6.96556627391316629527e-01 3.16536235012980726733e-01 6.95518721932238070949e-01 3.20129005029908764168e-01 6.93505748137666078179e-01 3.25583886162168600897e-01 6.89172691194977482532e-01 3.35754832260762914320e-01 6.71025517972714480308e-01
31 1.00000000000000000000e+00 3.28858670543375863904e-01 6.64279861979144015116e-01 3.10662181659269176492e-01 6.74477973508240791212e-01 3.06284068775037221499e-01 6.79958603624498780782e-01 3.04221993537328150303e-01 6.83580560576675932971e-01 3.03112902490884961182e-01 6.86190375522105044936e-01 3.02516424623993696041e-01 6.88162306663710698906e-01 3.02229077432801307435e-01 6.89699371752894752063e-01 3.02139314229578292981e-01 6.90925417822765175480e-01 3.02179893409690869532e-01 6.91922089359778502704e-01 3.02308509053195173522e-01 6.92746001172816039393e-01 3.02498074068496325406e-01 6.93437462774503132756e-01 3.02731331911816614610e-01 6.94026769624978445705e-01 3.02997662859853855721e-01 6.94535939077732922264e-01 3.03290287255732204930e-01 6.94984956540598775021e-01 3.03606903700847696737e-01 6.95384109958305907107e-01 3.03941440560968945128e-01 6.95735085943439135470e-01 3.04306560117092506079e-01 6.96038978891231452373e-01 3.04678706639766039288e-01 6.96351022326187507616e-01 3.05067145300861930490e-01 6.96641207330182976598e-01 3.05493243425127014579e-01 6.96960970150182212990e-01 3.05972582649435387303e-01 6.97250252142982418491e-01 3.06564219642459556692e-01 6.97490761738237430301e-01 3.07262963690610124701e-01 6.97681151048739289777e-01 3.08084883052475888565e-01 6.97813881825046999907e-01 3.09082240756136827908e-01 6.97854921373424752495e-01 3.10309717718040223300e-01 6.97764398177947442470e-01 3.11846586705645245630e-01 6.97477417085756834503e-01 3.13818958028013350603e-01 6.96880665039666391536e-01 3.16428506501654327465e-01 6.95771070939225744212e-01 3.20048985122927398539e-01 6.93709959360118810778e-01 3.25528667624350398491e-01 6.89332339485361322851e-01 3.35724982224071377690e-01 6.71136431872177863234e-01
32 1.00000000000000000000e+00 3.28852386460623813402e-01 6.64281917338091720815e-01 3.10653731160086876706e-01 6.74481340517063321371e-01 3.06273872869020413745e-01 6.79963202877900463328e-01 3.04210218777565322146e-01 6.83586173263131868794e-01 3.03099390505740196033e-01 6.86197069008075422047e-01 3.02500823373960170404e-01 6.88170462672816896088e-01 3.02211081497195610535e-01 6.89709226547040143984e-01 3.02118136243959778398e-01 6.90937619835872318674e-01 3.02154489756549793356e-01 6.91937428603575099828e-01 3.02277422354130131943e-01 6.92765595744327611349e-01 3.02459254235199814786e-01 6.93463071331224201188e-01 3.02682334725615398430e-01 6.94059972503572208957e-01 3.02935649420902841644e-01 6.94579077585453563692e-01 3.03212979469395016441e-01 6.95037640943888535006e-01 3.03511918971815952695e-01 6.95448986381491551789e-01 3.03832488705286563047e-01 6.95823497694235904021e-01 3.04178071297315111288e-01 6.96168403575938454786e-01 3.04553141345449918109e-01 6.96488199115136485950e-01 3.04966009983064612054e-01 6.96786081906338283787e-01 3.05425783506420134295e-01 6.97061674839148492921e-01 3.05945594200584591871e-01 6.97313371954280114551e-01 3.06542357049493452426e-01 6.97535611418768741743e-01 3.07239778284764286642e-01 6.97716274081863652157e-01 3.08067847815165218872e-01 6.97838689583731297539e-01 3.09067599311025620334e-01 6.97875054721871279639e-01 3.10295790498834711535e-01 6.97782478154178154028e-01 3.11834377693659403619e-01 6.97493191697425518605e-01 3.13807549597240775796e-01 6.96895093537541088224e-01 3.16418306409179450611e-01 6.95784548535489988375e-01 3.20040908556584513533e-01 6.93721242497661427784e-01 3.25522133877976627137e-01 6.89341869857694633517e-01 3.35720632829891674209e-01 6.71143870891375171617e-01
33 1.00000000000000000000e+00 3.28851689426766458091e-01 6.64282385561142052488e-01 3.10652882457673862326e-01 6.74481998278290473259e-01 3.06272935994064687826e-01 6.79963934453422735871e-01 3.04209185824323047331e-01 6.83587079605895486800e-01 3.03098311588928859273e-01 6.86198047040222913751e-01 3.02499764055678466157e-01 6.88171427835360671743e-01 3.02209896923606280428e-01 6.89710298745533800790e-01 3.02116831163553090089e-01 6.90938785768969943035e-01 3.02153024204413367393e-01 6.91938768294210970744e-01 3.02275699063837388625e-01 6.92767119544382858898e-01 3.02457235678269320545e-01 6.93464787422358175384e-01 3.02679919141416564621e-01 6.94061953953303722997e-01 3.02932789461685669785e-01 6.94581375070724482690e-01 3.03209691408532044932e-01 6.95040338430395032709e-01 3.03508099622373961335e-01 6.95452108988583006521e-01 3.03828401521272661867e-01 6.95826742901699657473e-01 3.04173343558706676948e-01 6.96171632949343033303e-01 3.04548035970835906383e-01 6.96491828778701971281e-01 3.04959872632756201494e-01 6.96790178430909401541e-01 3.05418927281953189734e-01 6.97067002204962093970e-01 3.05938377885458134831e-01 6.97319773644979101768e-01 3.06535627471542726497e-01 6.97542355398356628271e-01 3.07233343409816450631e-01 6.97723820871927080667e-01 3.08061752564955659839e-01 6.97846448920681594608e-01 3.09061797675525384843e-01 6.97882523658410414136e-01 3.10290396025689141357e-01 6.97789361937490082433e-01 3.11829356750467023840e-01 6.97499462515329127221e-01 3.13802880880744095027e-01 6.96900772894915476741e-01 3.16413906086595475564e-01 6.95789832063022029018e-01 3.20036979878643490505e-01 6.93726073268155385421e-01 3.25518933186114300948e-01 6.89346127482443837842e-01 3.35718387187214195588e-01 6.71147377102389919301e-01
34 1.00000000000000000000e+00 3.28851361686313015120e-01 6.64282566354095882488e-01 3.10652542839639944638e-01 6.74482246759932180247e-01 3.06272571496637613375e-01 6.79964304728930879484e-01 3.04208796136985926140e-01 6.83587464528528920837e-01 3.03097938524296339757e-01 6.86198433360272308512e-01 3.02499302274781833866e-01 6.88171863747897960550e-01 3.02209367437605957996e-01 6.89710785492386735385e-01 3.02116224759840845682e-01 6.90939331034512660423e-01 3.02152338149368149267e-01 6.91939348768108586363e-01 3.02274959855069857984e-01 6.92767751821493749098e-01 3.02456438139818650779e-01 6.93465470002735506760e-01 3.02679082653147746296e-01 6.94062704657103846095e-01 3.02931890385843061164e-01 6.94582195049053385816e-01 3.03208740386652519927e-01 6.95041234421088782724e-01 3.03507121010715141818e-01 6.95453063949563188295e-01 3.03827403170659871012e-01 6.95827721430474777087e-01 3.04172358063505177128e-01 6.96172620285238741289e-01 3.04547058864171438231e-01 6.96492843696363550521e-01 3.04958917634286896803e-01 6.96791179488941869735e-01 3.05417967592922501296e-01 6.97067982096425509120e-01 3.05937467762139647665e-01 6.97320766251937396163e-01 3.06534718174506337629e-01 6.97543372544714768146e-01 3.07232465607165383670e-01 6.97724799371387205404e-01 3.08060894008704844182e-01 6.97847373593210029696e-01 3.09060951130668504216e-01 6.97883462387763886525e-01 3.10289497033250649682e-01 6.97790311713265665183e-01 3.11828426654322199418e-01 6.97500382112984484984e-01 3.13801858663746491285e-01 6.96901780707626095079e-01 3.16412890692419457306e-01 6.95790851352634631688e-01 3.20036085256470537175e-01 6.93727057766763022251e-01 3.25518072930646162888e-01 6.89347078935510726438e-01 3.35717715646365488791e-01 6.71148226966242655855e-01
