# tag norm BO
1 9.99999999999999888978e-01 2.71157419161096480131e-01
2 1.00000000000000532907e+00 1.30577524290961033415e-01
3 1.00000000000000088818e+00 2.07418976790837081281e-02
4 1.00000000000000022204e+00 2.04742299700101278159e-02
5 9.99999999999998889777e-01 2.04691380184872685766e-02
