# tag norm n_hub[0] n_hub[1] n_hub[2] n_hub[3] n_hub[4] n_hub[5] n_hub[6] n_hub[7] n_hub[8] n_hub[9] n_hub[10] n_hub[11] n_hub[12] n_hub[13] n_hub[14] n_hub[15] n_hub[16] n_hub[17] n_hub[18] n_hub[19] n_hub[20] n_hub[21] n_hub[22] n_hub[23] n_hub[24] n_hub[25] n_hub[26] n_hub[27] n_hub[28] n_hub[29] n_hub[30] n_hub[31]
1 1.00000000000000000000e+00 1.55078601360487300376e+00 1.26792362762870580717e+00 1.40943702332535458766e+00 1.53163189678747291289e+00 1.20094594116028585695e+00 1.25139709717677738432e+00 1.00599876177596514459e+00 1.18195127140138955824e+00 9.47419360281604006069e-01 1.26403640081506773996e+00 1.16905087271516072711e+00 1.15085029612529310405e+00 1.24356952243716034623e+00 7.08323256364885800451e-01 1.15005952457753957141e+00 8.61366333950062679214e-01 1.22762406964735770742e+00 1.14024371105870359067e+00 9.41178697971558508861e-01 1.20822475501940318487e+00 1.01234766218170535446e+00 6.71762786866609173941e-01 8.23390249327973333671e-01 8.60365522691863060523e-01 8.67465589132820458218e-01 4.88820891357799824917e-01 9.14139339610552381643e-01 8.14619481960221381023e-01 1.31824923071128752294e-01 9.99044812876009769020e-01 5.45159383054271123176e-03 9.98748713268164944878e-01
2 1.00000000000000000000e+00 9.99512337909388870472e-01 1.20600794792266019506e+00 7.76250756431655752898e-01 1.14894439926997216084e+00 8.27189932896189694667e-01 1.50713488158890296376e+00 7.16969950084161533610e-01 1.82004748253206560804e+00 1.00498589873855737054e+00 1.99118237672477915723e+00 1.00626753458404705199e+00 1.99215440844147773092e+00 1.00328240950561031752e+00 1.00636100244397197478e+00 9.55928588510112642318e-01 1.12915161485326787094e+00 2.15237965954626797593e-01 1.07465718234595919434e+00 8.42509783258251987448e-01 1.54142633775080839520e+00 8.86532577653856512789e-01 1.01989038991190406058e+00 9.60324848340482817299e-01 1.28734624835303290702e+00 9.81160898685135007824e-01 1.08014561543021514467e+00 2.17378157186808446122e-02 9.95184639302490348101e-01 5.16673932491115012189e-03 9.94843669421324516833e-01 4.93280936431299710937e-03 9.97530956747285091346e-01
3 1.00000000000000000000e+00 9.41494004329460953961e-01 1.28172093311280099748e+00 7.63269120229715936077e-01 1.31382204764072918479e+00 7.27718377313765651948e-01 1.49291372939015665189e+00 7.32996953011067375883e-01 1.74856646373123147953e+00 1.00132196206932944094e+00 1.99433118983521362466e+00 1.00439020622011199180e+00 1.98985495654826349821e+00 1.00438265222859923753e+00 1.11719450264542108364e+00 7.27108539522687613577e-01 1.19674780807483660539e+00 9.06410566071464418592e-01 1.23102964553917382240e+00 7.20428026675765220688e-01 1.18580115481019543466e+00 8.63146804386589305835e-01 1.05362503840909993436e+00 8.27704039789994294729e-01 1.03860072784922286004e+00 6.38368721535631067354e-01 1.03706639871880179626e+00 3.53315436042960506757e-01 1.04329122839947441292e+00 6.08410225915841165745e-02 9.98976188533694964278e-01 6.00525628747178470690e-03 9.97556298455412160386e-01
4 1.00000000000000000000e+00 9.19643283351072371445e-01 1.33244020544039254439e+00 7.53739830734194038442e-01 1.41683537626182864955e+00 7.07964221777404256741e-01 1.56931188854620962125e+00 7.04896014471628196141e-01 1.61508174232394674519e+00 9.87474403008849921370e-01 1.99029122893702004049e+00 1.00416484669691463694e+00 1.99127052939651849606e+00 1.00236792538520491647e+00 1.13870624529184527596e+00 7.19240438084189914747e-01 1.24432273200165099958e+00 8.06011949903167712606e-01 1.21456205177298715014e+00 7.37635887830041192537e-01 1.20577106462308081269e+00 8.18101651785082872870e-01 1.08607393931958595701e+00 7.98448259425899475872e-01 1.01036302921204645955e+00 2.72003843581234472371e-01 1.08081033346275878770e+00 3.53526970043309685110e-01 1.16614649698406824818e+00 2.64516241597237578009e-01 1.04822519314832751647e+00 4.05191608492921906404e-02 9.99533014753010373710e-01
5 1.00000000000000000000e+00 9.04370241325475721084e-01 1.35162065268717190847e+00 7.76770472066823480795e-01 1.49942666013362568833e+00 7.15838865895001674744e-01 1.60923478696893584861e+00 7.93625742917816290323e-01 1.53159688768601376374e+00 9.01502026407565715260e-01 1.92112817578163186383e+00 9.96930204652079599015e-01 1.98206082250635740039e+00 9.90533136652700596514e-01 1.20997029962789848234e+00 7.12642596742592115966e-01 1.26148255595069547219e+00 7.42434533131186791266e-01 1.21707656056938695599e+00 7.19688689992041608079e-01 1.23214209071126501449e+00 7.84033206105489766102e-01 1.09460075752732666210e+00 8.16557875196888049985e-01 1.03043510230108292802e+00 2.18934773818140610002e-01 1.06315704569079927388e+00 3.09760589485417014988e-01 1.16529542960700704946e+00 2.83310322747083231931e-01 1.08126160354015765641e+00 7.97932173416263240684e-02 1.00278407423259841025e+00
6 1.00000000000000000000e+00 8.91461803320378942672e-01 1.37026190916177403878e+00 7.81666118590623626439e-01 1.50145738907835202269e+00 7.25789049874278169305e-01 1.60454485306103045161e+00 7.90072958692969895544e-01 1.53431797081789755843e+00 8.95083558555476610508e-01 1.75246603574515846802e+00 8.42319843398239398446e-01 1.79772351894197690569e+00 9.15593644292632680148e-01 1.38994585573542628332e+00 7.73502502710977424272e-01 1.27132121124468411288e+00 7.17429847799345710158e-01 1.16424925623180808287e+00 7.48535416383303453536e-01 1.22655384707842607384e+00 8.16179972893421701308e-01 1.14205163967698042349e+00 6.94125740345476471838e-01 1.10495260432000108608e+00 4.28863675394302756860e-01 1.05156687058540709856e+00 3.35759156325062146919e-01 1.17131409947777331837e+00 3.10675882702123373758e-01 1.11191622140922108386e+00 1.30799871376526072320e-01 1.00749767477894569545e+00
7 1.00000000000000000000e+00 8.85172259134819783277e-01 1.36418233556308221566e+00 7.85724244273793948068e-01 1.49906383982347457540e+00 7.24386215607609407208e-01 1.59236585337180902577e+00 7.63513680516293313794e-01 1.49080495637470900050e+00 8.79469305391840094899e-01 1.57062868714784231727e+00 7.36831618251567399547e-01 1.68011556003950590643e+00 8.49463399323637347038e-01 1.32178501541741799663e+00 7.74316773578333061856e-01 1.22105038169448776308e+00 7.20316728587170329590e-01 1.16132734133335668858e+00 8.27641019523222221110e-01 1.28150115782586371260e+00 8.34730735813391189204e-01 1.17716594082826753187e+00 6.16013986085545028892e-01 1.13577561008583516333e+00 2.43654579194857223712e-01 1.02707577900153768091e+00 4.39281323657920497183e-01 1.28174249924420546876e+00 3.43550122272825275704e-01 1.21202514668838379208e+00 5.04604854781625422611e-01 1.05471904956571238543e+00
8 1.00000000000000000000e+00 8.88742055040175005232e-01 1.38547412008065462530e+00 7.82399076328417764081e-01 1.53172343102924712888e+00 7.25422779518416604994e-01 1.56886002793042744763e+00 7.70551062700800426519e-01 1.47327889722772131798e+00 8.48723514948423352067e-01 1.53491102610167318154e+00 7.44270202027001337441e-01 1.61994154011836855034e+00 7.68288142407568708236e-01 1.40760700139486072402e+00 7.58755693800500341517e-01 1.26838291887510745681e+00 7.26730863793630166292e-01 1.22026501112963425832e+00 8.31672439707265231945e-01 1.27288426682874833418e+00 8.29010531966524522041e-01 1.13673608763544198297e+00 5.27710042636458265264e-01 1.18681294565657280415e+00 2.17693229642667268608e-01 1.05306609316356025730e+00 4.58345758031439398650e-01 1.26191698708962452002e+00 3.34433149894371395394e-01 1.23757999842201416030e+00 5.57072595785016333458e-01 1.07073850908734335974e+00
9 1.00000000000000000000e+00 8.89521908122804738639e-01 1.38777049825797971216e+00 7.84165075134429234716e-01 1.53746718145979133219e+00 7.27182465145801426587e-01 1.55995272168354071063e+00 7.71995881682015383518e-01 1.46226264797775962201e+00 8.34344036604089733800e-01 1.48120299531446386609e+00 7.48893857542550556161e-01 1.56408096799286711054e+00 7.19613131107030623568e-01 1.47049395082453271399e+00 7.23388234236340910144e-01 1.35136342016205235339e+00 7.37616621736716604474e-01 1.28120931680305494282e+00 8.29545167332865873711e-01 1.27275545845895177166e+00 8.07502983882322777909e-01 1.12272225424279037398e+00 4.78633528736279845184e-01 1.20774712675474438228e+00 2.67202998620961085230e-01 1.08308597605164358413e+00 4.66646717430785451519e-01 1.24106078392755181383e+00 3.41092262702184623180e-01 1.24356895677254875032e+00 5.33498816296204658727e-01 1.07241205700234321085e+00
10 1.00000000000000000000e+00 8.84077477006884215882e-01 1.38131134145592460172e+00 7.85114604931072324057e-01 1.52048900780657003651e+00 7.29881588844662143600e-01 1.55106481925612627037e+00 7.61257628985774648100e-01 1.46185152913563554122e+00 8.15883596456454140977e-01 1.43628895484368968027e+00 7.71409609772121585003e-01 1.51281099302260657602e+00 7.10184048305849913163e-01 1.51293111068454599888e+00 7.07206815148944012428e-01 1.42443128866081369921e+00 7.41782770805961111371e-01 1.33419758722828540876e+00 8.35413776950011954803e-01 1.26153558938790721911e+00 7.77730637197750485079e-01 1.12431271153257394957e+00 4.53080339459889347431e-01 1.22002665674292853915e+00 3.07735789354908417792e-01 1.10762111932090112631e+00 4.67061129448160194944e-01 1.22593054965468395423e+00 3.42313610269585899548e-01 1.23771993391626566883e+00 5.25128162372125117940e-01 1.07221522204016372903e+00
11 1.00000000000000000000e+00 8.81706870857171698397e-01 1.37793809733721461797e+00 7.85898327473773417040e-01 1.51351546924155022644e+00 7.29700907861531966603e-01 1.54680202049426940292e+00 7.52671918666607209225e-01 1.46328705523177360348e+00 8.07143403271764370288e-01 1.41816230573415769101e+00 7.80108542248315273149e-01 1.47914779007938368416e+00 7.16707888996517494817e-01 1.51542705159864565800e+00 7.06394953906198330706e-01 1.46074449512394277662e+00 7.49559818633025454204e-01 1.36181916687801973787e+00 8.36500749707141055822e-01 1.23734465241653190937e+00 7.29293521280330869772e-01 1.13714072956284795168e+00 4.29000000002327408488e-01 1.22874288119680197262e+00 3.67293451906542722796e-01 1.13720333946342955223e+00 4.72316933241578973401e-01 1.21507540251784029728e+00 3.52742547676660578304e-01 1.23528899221470767067e+00 5.04841695928926914583e-01 1.07047901925056332395e+00
12 1.00000000000000000000e+00 8.70743197049308470525e-01 1.35670684860857959642e+00 7.91950705209800043249e-01 1.48282962693327280412e+00 7.34311739341232616596e-01 1.53933714999427717629e+00 7.34641925257762173906e-01 1.47612439536788198069e+00 7.87132978656247206395e-01 1.41165474545281854901e+00 7.92158163646595081531e-01 1.43081275619272640931e+00 7.39010806888635185530e-01 1.48235904915915028823e+00 7.13430259833564006655e-01 1.47340137284923189398e+00 7.44098542665191708956e-01 1.38032563640311356501e+00 8.13252531344124451884e-01 1.22891588492654912912e+00 7.09384718828931726264e-01 1.15442364039580036561e+00 4.81324087256385202416e-01 1.22885365812336222469e+00 4.33876562112807284688e-01 1.14702632321361397416e+00 4.75093664675886317994e-01 1.21727837601394273115e+00 3.59520734756386406428e-01 1.23495939815581756704e+00 5.04151953511933093033e-01 1.07090856717498561501e+00
13 1.00000000000000000000e+00 8.58107123689765161068e-01 1.33675037300907617599e+00 7.91278637566610432152e-01 1.43371700292943016208e+00 7.35424079184274326337e-01 1.49957394623420237068e+00 7.16428017861624133467e-01 1.48588233395642177470e+00 7.38973977854935015763e-01 1.41266915638457168924e+00 7.70254621519233073634e-01 1.33672034668372519128e+00 7.67143131933862520988e-01 1.29108663175120086386e+00 7.43183123297480041636e-01 1.25429006561660960628e+00 7.16617018357267210327e-01 1.21574103542589284643e+00 7.27677000257293871144e-01 1.22762739804302989377e+00 8.07209306641239243696e-01 1.24299169162867606531e+00 8.14046871530337501355e-01 1.17935995843610030853e+00 6.37131604693633724068e-01 1.19625850212005202522e+00 4.69023993108709014166e-01 1.25949981637310237659e+00 4.32792891550583425087e-01 1.21827206495606721326e+00 5.84723936071054994912e-01 1.09954434133396761197e+00
14 1.00000000000000000000e+00 8.11416490700841208650e-01 1.29123090003246887569e+00 7.82818171824197883701e-01 1.33867070201493798542e+00 7.61199623347096454573e-01 1.37636803085683112613e+00 7.33647410349036022126e-01 1.41610414631589653922e+00 7.15814683060398859737e-01 1.44798244911623741338e+00 7.05241989893268361733e-01 1.44545913780287005324e+00 7.10704706793918949970e-01 1.40810767364742983609e+00 7.22106652477533472734e-01 1.34605928710749966903e+00 7.22795722416704089497e-01 1.29422970678942039768e+00 7.64320846902673767254e-01 1.28147730072045451521e+00 8.11811924036307863695e-01 1.24866823664234249947e+00 7.64329636292192193814e-01 1.17846296657412041853e+00 6.09038235159123808593e-01 1.21231849571856464820e+00 4.63787129760624916575e-01 1.26657021723614326980e+00 4.49077413005402437118e-01 1.21990987921287841189e+00 5.94783169433111602586e-01 1.10548706475930047510e+00
15 1.00000000000000000000e+00 8.01095265225045372048e-01 1.28785276829121042574e+00 7.76032728997972931495e-01 1.30567045540147197435e+00 7.62511519907972390442e-01 1.32491891375477477411e+00 7.42688039833026780734e-01 1.34500487901594723006e+00 7.21388604464396565596e-01 1.36298879289235363999e+00 7.01767884183363888084e-01 1.37099099839397364775e+00 6.83491595368471593908e-01 1.36254459652133097514e+00 6.59091048317966943237e-01 1.34316147420115106215e+00 6.32075887923838730664e-01 1.31572814975643237467e+00 6.10247862532007245839e-01 1.29322228832874830395e+00 6.39484252238918027267e-01 1.26252851622478101667e+00 6.63848812645289942935e-01 1.22080813109512997805e+00 6.95951503438648422240e-01 1.21587946951281455910e+00 7.09538524499774725385e-01 1.23969496249056687631e+00 7.02806808062989785135e-01 1.26773228193848308543e+00 7.28567493527458975855e-01 1.25068549101359782760e+00
16 1.00000000000000000000e+00 7.77543331007284566070e-01 1.28007813594292074733e+00 7.53831115402475049336e-01 1.28762010336230803276e+00 7.56806412993151100821e-01 1.28644511866862698568e+00 7.55106921915661422062e-01 1.29155446271753526766e+00 7.48289101135916512320e-01 1.29132504315113449955e+00 7.35684235546402831574e-01 1.29165940357069009004e+00 7.26788572195826931832e-01 1.29430599326024520224e+00 7.17309682823659588990e-01 1.29436059127931679669e+00 7.09691302194935036418e-01 1.28852897917935571570e+00 7.03826607406080828611e-01 1.27361745202681686528e+00 7.05155562683823067260e-01 1.25794823503552732902e+00 7.03846380467733956365e-01 1.23920559043312561442e+00 7.05163541866563048366e-01 1.23658911896472556435e+00 7.09943696828905790319e-01 1.24774806691880790765e+00 7.13878745969753536471e-01 1.25485867297295161649e+00 7.22199474233414018265e-01 1.23909034784421656639e+00
17 1.00000000000000000000e+00 7.76039661114101719797e-01 1.28005493602141817711e+00 7.53096902767176890059e-01 1.28580333414160064009e+00 7.51873779902932248831e-01 1.28778239825601481527e+00 7.51079118865411121675e-01 1.28840655584089880392e+00 7.45944555777710127664e-01 1.28756897659446489790e+00 7.38324779598357294752e-01 1.28727008091229833120e+00 7.29895196388424705169e-01 1.28574391496028206383e+00 7.22836618876347314355e-01 1.28262733644653015297e+00 7.16315342239932872914e-01 1.27600796719306841531e+00 7.14102790515320440257e-01 1.26628667953506801602e+00 7.11916372327464852532e-01 1.25668000612179153741e+00 7.10227807770573815738e-01 1.24788059145036100972e+00 7.10157526245866588255e-01 1.24720206158912816363e+00 7.12977886572652375108e-01 1.25388624887323896218e+00 7.16174414852359553230e-01 1.25398605450632261160e+00 7.21074666232906280605e-01 1.23077543750987739024e+00
18 1.00000000000000000000e+00 7.64961683703263672918e-01 1.27812274386338420307e+00 7.39236649837074155656e-01 1.28447427817392467730e+00 7.38888617028956029564e-01 1.28554642184004164207e+00 7.43034568647839455124e-01 1.28609035348484002093e+00 7.42577171420851223083e-01 1.28585202235989437547e+00 7.41201237889995478980e-01 1.28670555814785148030e+00 7.36203327113765904066e-01 1.28217977427094065312e+00 7.31434521365473933052e-01 1.27876676235488617728e+00 7.25767244533591759925e-01 1.27150811349166548148e+00 7.21297689500035477117e-01 1.26599831712543653417e+00 7.17936306225325560071e-01 1.25992478756829773268e+00 7.15007500407136009635e-01 1.25549065306228335714e+00 7.13490473345168463304e-01 1.25409792478851334074e+00 7.13958262260588227832e-01 1.25590021075173585707e+00 7.15549012168939402301e-01 1.25588438874303109927e+00 7.21092357678358553130e-01 1.23182106684675840569e+00
19 1.00000000000000000000e+00 7.63001701608894022932e-01 1.27825539421021328046e+00 7.36830356103234551668e-01 1.28339495050133245435e+00 7.34822036233979569708e-01 1.28483912615191675499e+00 7.34723780962423189678e-01 1.28495069922583060595e+00 7.34746521306478661550e-01 1.28397550705149110506e+00 7.33376512558400750486e-01 1.28212980113306973529e+00 7.31382023026887151396e-01 1.27974682016633689585e+00 7.28329601322322939261e-01 1.27506842749919391267e+00 7.24415239519929810008e-01 1.27164389682560430295e+00 7.19376158320490177722e-01 1.26928595263080512545e+00 7.16971844911382327759e-01 1.26548404971221772897e+00 7.15214256361075273460e-01 1.26459011027599954602e+00 7.14247874627531587066e-01 1.26461978285025411495e+00 7.14702615655286699337e-01 1.26816066646287395336e+00 7.14412097153430125651e-01 1.26655296309291509615e+00 7.22017006071480782481e-01 1.23873222646670222424e+00
20 1.00000000000000000000e+00 7.56372889054971575540e-01 1.27758301460843504138e+00 7.27460736072737423896e-01 1.28399644521883704584e+00 7.24874783046228099437e-01 1.28532043895572778425e+00 7.24513569288533498813e-01 1.28480944841925914801e+00 7.25429940891575641970e-01 1.28443155647577511580e+00 7.24787189075985938125e-01 1.28306070152712470289e+00 7.25691574503843250810e-01 1.28093161245628772704e+00 7.24202550480682716305e-01 1.27952621938109922795e+00 7.21995721505195753309e-01 1.27846318417351501040e+00 7.20190260414577010373e-01 1.27686887134289173140e+00 7.18161434943495824434e-01 1.27457874219475342237e+00 7.17086174915835039556e-01 1.27319630859006083234e+00 7.16230832197536915196e-01 1.27258446664372670831e+00 7.16139335508587770995e-01 1.27193670480244014342e+00 7.17180101158539917705e-01 1.26886455142357834625e+00 7.22240363878994040547e-01 1.24129027684911119600e+00
21 1.00000000000000000000e+00 7.55430367119514833973e-01 1.27742225649735718918e+00 7.26915064686726175580e-01 1.28228179594435176547e+00 7.22979835505018098019e-01 1.28338025087097173937e+00 7.21786072751134932801e-01 1.28343754277247978912e+00 7.21081956723984895952e-01 1.28310024219708229687e+00 7.20433405761472522855e-01 1.28285418404693585259e+00 7.19990249451894381849e-01 1.28174764234973492805e+00 7.19854138611257354796e-01 1.28024559806833404529e+00 7.19664118024764043469e-01 1.28034464890875021581e+00 7.18438190266453169386e-01 1.27961674951746307016e+00 7.17102025344138027663e-01 1.27981557633853570977e+00 7.16176394842321428769e-01 1.27905249822214361899e+00 7.17080606932179898116e-01 1.27714909791794584137e+00 7.16869666460612564585e-01 1.27739420342253451324e+00 7.17281661788122804069e-01 1.27370786625088183719e+00 7.22667977365225477904e-01 1.24469811503957705767e+00
22 1.00000000000000000000e+00 7.54556158024755396774e-01 1.27728760208034985979e+00 7.25219695264590180628e-01 1.28231138655980014818e+00 7.21209013714773639059e-01 1.28306560217458942574e+00 7.20182502689479697722e-01 1.28274453650888253797e+00 7.19510767561990616237e-01 1.28271987235614459699e+00 7.18620355348501327342e-01 1.28284304555471084797e+00 7.18327231430171186943e-01 1.28209813269728223339e+00 7.17980314557305820955e-01 1.28213735260649541736e+00 7.17913831404181301821e-01 1.28191957681468871044e+00 7.17659764161077573519e-01 1.28182777295547190022e+00 7.17322574852990668681e-01 1.28150896486633403271e+00 7.17031968503053396269e-01 1.28107296231431533329e+00 7.16766062463951580952e-01 1.28018810791921366921e+00 7.16823533933438228338e-01 1.27869513211660668084e+00 7.17848806704018849167e-01 1.27449766737191372279e+00 7.22704978794864394409e-01 1.24540472569432347782e+00
23 1.00000000000000000000e+00 7.54416498543671654176e-01 1.27727789135476554883e+00 7.25206656394032589397e-01 1.28212815469520924339e+00 7.20936816443554895351e-01 1.28311783004582080636e+00 7.19442717803785325437e-01 1.28324194041424299861e+00 7.18748323004937073044e-01 1.28307673958816770288e+00 7.18347999618596300131e-01 1.28281619985758132962e+00 7.18173756995118317548e-01 1.28255072494090716084e+00 7.18006625238184481574e-01 1.28245802555271626311e+00 7.17774520333688381690e-01 1.28236299332077208213e+00 7.17560327028975208918e-01 1.28199638986179387246e+00 7.17463257360987927136e-01 1.28166890534543820301e+00 7.16698249315339097620e-01 1.28110620983406020557e+00 7.16961783078913339473e-01 1.28017272411791349640e+00 7.16881880618442379749e-01 1.27885699719157019949e+00 7.17840101898564175720e-01 1.27459078880589182781e+00 7.22708398274665042571e-01 1.24540957312150979419e+00
24 1.00000000000000000000e+00 7.54645232224277595634e-01 1.27731399339251794345e+00 7.25525156364441703438e-01 1.28216923230365731357e+00 7.21297008825712904212e-01 1.28314402368516389252e+00 7.19773575594126802102e-01 1.28325939530691779389e+00 7.19057930030670755528e-01 1.28307971868358206002e+00 7.18559165713978709178e-01 1.28282655358574992910e+00 7.18208015295251578358e-01 1.28250928275749576102e+00 7.17922056755898707614e-01 1.28227949280780761931e+00 7.17668868945493865219e-01 1.28198895125415646135e+00 7.17457355163917287477e-01 1.28172224036257365043e+00 7.17188642238424822750e-01 1.28142558516815130432e+00 7.16907150587190900026e-01 1.28099182958969071144e+00 7.16731172183474596338e-01 1.28026409669843910244e+00 7.16832713223125805868e-01 1.27878035288642166734e+00 7.17834629540522239921e-01 1.27454016512583545584e+00 7.22685952384677254834e-01 1.24541046132069799235e+00
25 1.00000000000000000000e+00 7.54657494130733130788e-01 1.27732051648486533146e+00 7.25542167875088739315e-01 1.28217643690543092738e+00 7.21307197696742785631e-01 1.28317698564154669683e+00 7.19815815386954271915e-01 1.28327668215346069047e+00 7.19079212034175241364e-01 1.28310201256008649118e+00 7.18623696891335983494e-01 1.28284381174895356637e+00 7.18285771851304599700e-01 1.28256530952713854177e+00 7.17994161872980263261e-01 1.28228671974987773474e+00 7.17720453851206308116e-01 1.28200863975122270055e+00 7.17441425853747816177e-01 1.28171708617958524101e+00 7.17158873008628017232e-01 1.28137719785436932085e+00 7.16899644311581263345e-01 1.28091917726568937930e+00 7.16720829106728074542e-01 1.28017941621799913321e+00 7.16824626776534912231e-01 1.27868783010366526831e+00 7.17823282540725138290e-01 1.27445156159328809586e+00 7.22679247583784323261e-01 1.24533671549067870288e+00
26 1.00000000000000000000e+00 7.54669627348633631492e-01 1.27732136536165152840e+00 7.25556381838932007433e-01 1.28217793670400048711e+00 7.21320832908772691106e-01 1.28317861613808892329e+00 7.19827769442085707574e-01 1.28327779965044497246e+00 7.19088360261243231264e-01 1.28310305899501098104e+00 7.18628939952953071924e-01 1.28284387426416057743e+00 7.18286471545848792530e-01 1.28256564999672417748e+00 7.17992059852137320952e-01 1.28228740413085495753e+00 7.17712992801994076331e-01 1.28200832914745155300e+00 7.17434759414889988705e-01 1.28171373440009195299e+00 7.17156448096966436800e-01 1.28137106687927149196e+00 7.16897469767862172141e-01 1.28091147293518625716e+00 7.16722475775628531380e-01 1.28017195421929952381e+00 7.16821377056723219034e-01 1.27867879990674970792e+00 7.17822004432289606513e-01 1.27444294888095699392e+00 7.22678436649205613307e-01 1.24532958124393777766e+00
27 1.00000000000000000000e+00 7.54671461951506583610e-01 1.27732159058064675961e+00 7.25558177909959134411e-01 1.28217816026054931555e+00 7.21322422780941607812e-01 1.28317870160709213145e+00 7.19829249740896570664e-01 1.28327762045507554056e+00 7.19089548759748287132e-01 1.28310259991519259870e+00 7.18629785035064805321e-01 1.28284360899225879926e+00 7.18287048268693939512e-01 1.28256515874405163657e+00 7.17992440176204227420e-01 1.28228676963763832397e+00 7.17713282916642159037e-01 1.28200764444827086663e+00 7.17434879088835297800e-01 1.28171304326660884243e+00 7.17156433641477963903e-01 1.28137026599027725737e+00 7.16897383609580662878e-01 1.28091052128789795184e+00 7.16722408155382906259e-01 1.28017082412677951631e+00 7.16821241731623315374e-01 1.27867754478183148770e+00 7.17821804285130316003e-01 1.27444166694211435953e+00 7.22678400280172050785e-01 1.24532831063181625986e+00
28 1.00000000000000000000e+00 7.54671969820936872075e-01 1.27732160170269604116e+00 7.25558711850428861290e-01 1.28217819842719427115e+00 7.21322843782024936132e-01 1.28317875817598148203e+00 7.19829565498653067834e-01 1.28327754059322463043e+00 7.19089803987828957155e-01 1.28310251872088687541e+00 7.18630039720701163652e-01 1.28284351501715199184e+00 7.18287201284891207997e-01 1.28256503192498572119e+00 7.17992543725808118893e-01 1.28228661390313636304e+00 7.17713410662800477269e-01 1.28200743745794665251e+00 7.17434994876706255695e-01 1.28171278328691418125e+00 7.17156512296244885718e-01 1.28136997573497124492e+00 7.16897526105061744239e-01 1.28091016681671865385e+00 7.16722443841443124235e-01 1.28017043569825172966e+00 7.16821307353701309140e-01 1.27867712288876211879e+00 7.17821797051821364199e-01 1.27444131434648255663e+00 7.22678374982873239496e-01 1.24532793846298250884e+00
