# tag norm j_0
9.900000 1.00000000000001931788e+00 -2.87399906440807983987e-01
9.900000 1.00000000000001931788e+00 -1.87748745451904869297e-02
9.900000 1.00000000000001931788e+00 -5.98990530370507728852e-02
9.900000 1.00000000000001931788e+00 -4.04249438890096277066e-02
9.900000 1.00000000000001931788e+00 -1.08793531463325529596e-01
9.900000 1.00000000000001931788e+00 -2.37643741819050582920e-02
9.900000 1.00000000000001931788e+00 -9.25630937471760839585e-02
9.900000 1.00000000000001931788e+00 -3.18594699080819998560e-02
9.900000 1.00000000000001931788e+00 -9.45628086074754986567e-02
9.900000 1.00000000000001931788e+00 -2.91386657465816795165e-02
9.900000 1.00000000000001931788e+00 -9.46617928658183283019e-02
9.900000 1.00000000000001931788e+00 -3.18390172886060182633e-02
9.900000 1.00000000000001931788e+00 -9.31069776194431292238e-02
9.900000 1.00000000000001931788e+00 -2.36500740927018740511e-02
9.900000 1.00000000000001931788e+00 -1.09100180411011701831e-01
9.900000 1.00000000000001931788e+00 -4.06436911034204761961e-02
9.900000 1.00000000000001931788e+00 -6.18206018271989510282e-02
9.900000 1.00000000000001931788e+00 -1.71829038806021426600e-02
9.900000 1.00000000000001931788e+00 -2.88011607491030552364e-01
