# tag norm j_0
21.500000 1.00000000000027555735e+00 3.37714592518867696177e-05
21.500000 1.00000000000027555735e+00 2.19987063909889986974e-04
21.500000 1.00000000000027555735e+00 2.99828832445956001713e-04
21.500000 1.00000000000027555735e+00 7.51128452871086980600e-04
21.500000 1.00000000000027555735e+00 5.07197756789747801367e-05
21.500000 1.00000000000027555735e+00 3.78803133178304493204e-06
21.500000 1.00000000000027555735e+00 -2.12927237649657971402e-04
21.500000 1.00000000000027555735e+00 1.30755962984014365751e-04
21.500000 1.00000000000027555735e+00 -1.17140732203947694145e-04
21.500000 1.00000000000027555735e+00 1.37223499789178288557e-04
21.500000 1.00000000000027555735e+00 -1.17288911205087192924e-04
21.500000 1.00000000000027555735e+00 1.30791462033528544566e-04
21.500000 1.00000000000027555735e+00 -2.16811133485687694555e-04
21.500000 1.00000000000027555735e+00 -1.32862086939255537858e-05
21.500000 1.00000000000027555735e+00 1.96846955923741224570e-05
21.500000 1.00000000000027555735e+00 7.45623243373315478140e-04
21.500000 1.00000000000027555735e+00 3.25738467770446459091e-04
21.500000 1.00000000000027555735e+00 2.36000295128673578645e-04
21.500000 1.00000000000027555735e+00 5.50507554852774490749e-05
