# tag norm j_0
26.400000 1.00000000000024646951e+00 1.65519472323605938875e-04
26.400000 1.00000000000024646951e+00 2.24900912183558280254e-04
26.400000 1.00000000000024646951e+00 4.56405652445656859727e-04
26.400000 1.00000000000024646951e+00 3.92200488141136878982e-04
26.400000 1.00000000000024646951e+00 5.56208962263545630966e-04
26.400000 1.00000000000024646951e+00 9.43398498628135115385e-05
26.400000 1.00000000000024646951e+00 -3.42141023951492010465e-04
26.400000 1.00000000000024646951e+00 -1.23294541944171128335e-04
26.400000 1.00000000000024646951e+00 3.50805205821113637961e-05
26.400000 1.00000000000024646951e+00 1.04182899905369582400e-04
26.400000 1.00000000000024646951e+00 4.29780260092432490264e-05
26.400000 1.00000000000024646951e+00 -1.21880525053770323780e-04
26.400000 1.00000000000024646951e+00 -3.42630126781208704627e-04
26.400000 1.00000000000024646951e+00 5.87792663383255811370e-05
26.400000 1.00000000000024646951e+00 5.47106180859828743895e-04
26.400000 1.00000000000024646951e+00 3.91585195629525449623e-04
26.400000 1.00000000000024646951e+00 4.69668112900302405117e-04
26.400000 1.00000000000024646951e+00 2.32228769771847460331e-04
26.400000 1.00000000000024646951e+00 1.82611114166005998388e-04
