# tag norm j_0
4.400000 1.00000000000002109424e+00 1.24199905066500076480e-03
4.400000 1.00000000000002109424e+00 1.24596798343512170024e-03
4.400000 1.00000000000002109424e+00 1.20482109505292214746e-03
4.400000 1.00000000000002109424e+00 1.26270225055559849950e-03
4.400000 1.00000000000002109424e+00 1.20558873697221031335e-03
4.400000 1.00000000000002109424e+00 1.26812024067948542379e-03
4.400000 1.00000000000002109424e+00 1.21447067961356924316e-03
4.400000 1.00000000000002109424e+00 1.26184259019518352218e-03
4.400000 1.00000000000002109424e+00 1.26288517053591811852e-03
