# tag norm H
0.100000 1.00000000000000044409e+00 -5.34151448293706820891e+00
0.200000 9.99999999999998223643e-01 -5.34151448475636936308e+00
0.300000 1.00000000000000044409e+00 -5.34151448797199712715e+00
0.400000 9.99999999999999111822e-01 -5.34151448091928759965e+00
0.500000 1.00000000000000088818e+00 -5.34151448246618709703e+00
0.600000 1.00000000000000088818e+00 -5.34151448444129872684e+00
0.700000 9.99999999999999111822e-01 -5.34151448244624393880e+00
0.800000 9.99999999999999555911e-01 -5.34151448642063630956e+00
0.900000 9.99999999999999777955e-01 -5.34151448867840539236e+00
1.000000 1.00000000000000000000e+00 -5.34151449126536892464e+00
1.100000 1.00000000000000333067e+00 -5.34151449390500143721e+00
1.200000 1.00000000000000310862e+00 -5.34151449635673358785e+00
1.300000 1.00000000000000399680e+00 -5.34151449917163922976e+00
1.400000 1.00000000000000355271e+00 -5.34151450007889305738e+00
1.500000 1.00000000000000222045e+00 -5.34151450336416200315e+00
1.600000 1.00000000000000310862e+00 -5.34151450457115473114e+00
1.700000 1.00000000000000444089e+00 -5.34151450538556371583e+00
1.800000 1.00000000000000666134e+00 -5.34151450934391469616e+00
1.900000 1.00000000000000555112e+00 -5.34151449779690778996e+00
2.000000 1.00000000000000510703e+00 -5.34151448719448840308e+00
2.100000 1.00000000000000310862e+00 -5.34151447288424030546e+00
2.200000 1.00000000000000310862e+00 -5.34151445830848103924e+00
2.300000 1.00000000000000333067e+00 -5.34151445896025922622e+00
2.400000 1.00000000000000421885e+00 -5.34151446606492452673e+00
2.500000 1.00000000000000510703e+00 -5.34151445112364697820e+00
2.600000 1.00000000000000643929e+00 -5.34151433691351407163e+00
2.700000 1.00000000000000333067e+00 -5.34151417982873422119e+00
2.800000 1.00000000000000377476e+00 -5.34151392092082222263e+00
2.900000 1.00000000000000355271e+00 -5.34151368309625418362e+00
3.000000 1.00000000000000466294e+00 -5.34151361433861815442e+00
3.100000 1.00000000000000421885e+00 -5.34151366557094231524e+00
3.200000 1.00000000000000355271e+00 -5.34151357610094912332e+00
3.300000 1.00000000000000177636e+00 -5.34151283333154047739e+00
3.400000 1.00000000000000288658e+00 -5.34151127880813625382e+00
3.500000 1.00000000000000333067e+00 -5.34150867778112559137e+00
3.600000 1.00000000000000111022e+00 -5.34150603634586307322e+00
3.700000 1.00000000000000044409e+00 -5.34150459884885897566e+00
3.800000 1.00000000000000288658e+00 -5.34150466342588536861e+00
3.900000 9.99999999999999888978e-01 -5.34150475671404834088e+00
4.000000 1.00000000000000133227e+00 -5.34150118822661568174e+00
4.100000 9.99999999999999777955e-01 -5.34149041028071014381e+00
4.200000 9.99999999999999666933e-01 -5.34147079061466811822e+00
4.300000 1.00000000000000244249e+00 -5.34144797151240169342e+00
4.400000 1.00000000000000088818e+00 -5.34143127475616452671e+00
4.500000 1.00000000000000088818e+00 -5.34142719189359738152e+00
4.600000 1.00000000000000088818e+00 -5.34143076219339540955e+00
4.700000 1.00000000000000044409e+00 -5.34142052489893082168e+00
4.800000 1.00000000000000288658e+00 -5.34136811234655084490e+00
4.900000 1.00000000000000066613e+00 -5.34125636288233440752e+00
5.000000 1.00000000000000333067e+00 -5.34110693727835439404e+00
5.100000 1.00000000000000355271e+00 -5.34097437232303029475e+00
5.200000 1.00000000000000310862e+00 -5.34091431856130327560e+00
5.300000 1.00000000000000111022e+00 -5.34092968950487279045e+00
5.400000 1.00000000000000266454e+00 -5.34092946220237241306e+00
5.500000 1.00000000000000333067e+00 -5.34075790939694261539e+00
5.600000 1.00000000000000066613e+00 -5.34028925015461641834e+00
5.700000 1.00000000000000222045e+00 -5.33956506001619857216e+00
5.800000 1.00000000000000133227e+00 -5.33881678825078243023e+00
5.900000 1.00000000000000111022e+00 -5.33835280478667328907e+00
6.000000 1.00000000000000199840e+00 -5.33831181237899166092e+00
6.100000 9.99999999999999555911e-01 -5.33843368379061100626e+00
6.200000 1.00000000000000000000e+00 -5.33809134386039119136e+00
6.300000 9.99999999999999888978e-01 -5.33664038977918675499e+00
6.400000 1.00000000000000000000e+00 -5.33397064818140709264e+00
6.500000 9.99999999999998667732e-01 -5.33077910868568860536e+00
6.600000 9.99999999999997113420e-01 -5.32831606388718004297e+00
6.700000 9.99999999999998445688e-01 -5.32751115431406319090e+00
6.800000 9.99999999999996558309e-01 -5.32801303145949844975e+00
6.900000 9.99999999999997557509e-01 -5.32797260268203931588e+00
7.000000 9.99999999999998667732e-01 -5.32500456783531816995e+00
7.100000 9.99999999999998667732e-01 -5.31797183695428365979e+00
7.200000 1.00000000000000066613e+00 -5.30825336710664874573e+00
7.300000 9.99999999999998556710e-01 -5.29943231804549608199e+00
7.400000 1.00000000000000199840e+00 -5.29498802432547943653e+00
7.500000 1.00000000000000155431e+00 -5.29539703314076604102e+00
7.600000 1.00000000000000111022e+00 -5.29680120515989116825e+00
7.700000 1.00000000000000133227e+00 -5.29276654502882060171e+00
7.800000 1.00000000000000133227e+00 -5.27860164684313559746e+00
7.900000 1.00000000000000044409e+00 -5.25539579012162416660e+00
8.000000 1.00000000000000133227e+00 -5.23069141006950388828e+00
8.100000 9.99999999999998889777e-01 -5.21422413406837925720e+00
8.200000 9.99999999999998334665e-01 -5.21094296468820150636e+00
8.300000 9.99999999999997557509e-01 -5.21596774685639097413e+00
8.400000 9.99999999999996336264e-01 -5.21621911537613947019e+00
8.500000 9.99999999999998667732e-01 -5.19895400122009210264e+00
8.600000 9.99999999999999777955e-01 -5.16153673788854128190e+00
8.700000 9.99999999999998334665e-01 -5.11498003229511954970e+00
8.800000 9.99999999999997668532e-01 -5.07770775374168081839e+00
8.900000 9.99999999999999444888e-01 -5.06295182338566096547e+00
9.000000 9.99999999999997668532e-01 -5.06813817244806408269e+00
9.100000 9.99999999999997335465e-01 -5.07466376335013436005e+00
9.200000 9.99999999999999000799e-01 -5.05972750576786722831e+00
9.300000 9.99999999999997668532e-01 -5.01233801155636449209e+00
9.400000 9.99999999999997446487e-01 -4.94206801835295550518e+00
9.500000 9.99999999999998112621e-01 -4.87462381685969692313e+00
9.600000 9.99999999999996225242e-01 -4.83601358370768963368e+00
9.700000 9.99999999999996669331e-01 -4.83422197960979715958e+00
9.800000 9.99999999999997779554e-01 -4.85172872685485412347e+00
9.900000 9.99999999999997557509e-01 -4.85636442427486159090e+00
10.000000 9.99999999999998112621e-01 -4.82385587269347393402e+00
10.100000 9.99999999999995892175e-01 -4.75505447993332985845e+00
10.200000 9.99999999999996003197e-01 -4.67565747213820692707e+00
10.300000 9.99999999999997002398e-01 -4.61881742749543722226e+00
10.400000 9.99999999999995226041e-01 -4.60238616296474489786e+00
10.500000 9.99999999999996447286e-01 -4.61655742641561950279e+00
10.600000 9.99999999999994559907e-01 -4.63114834032746536252e+00
10.700000 9.99999999999995003996e-01 -4.61702303608526420931e+00
10.800000 9.99999999999994448885e-01 -4.56529677414650869594e+00
10.900000 9.99999999999997890576e-01 -4.49213230942127061951e+00
11.000000 9.99999999999996780353e-01 -4.42771142852221188946e+00
11.100000 9.99999999999997446487e-01 -4.39661762278408740912e+00
11.200000 9.99999999999998334665e-01 -4.40179614314308587097e+00
11.300000 9.99999999999997890576e-01 -4.42326151584140436768e+00
11.400000 9.99999999999998556710e-01 -4.43283069824916786672e+00
11.500000 1.00000000000000022204e+00 -4.41344081768434737256e+00
11.600000 1.00000000000000044409e+00 -4.36927307650440610587e+00
11.700000 1.00000000000000044409e+00 -4.32077900906752887522e+00
11.800000 1.00000000000000000000e+00 -4.28962749725489622676e+00
11.900000 1.00000000000000111022e+00 -4.28449746704862377555e+00
12.000000 1.00000000000000044409e+00 -4.29703305811700886352e+00
12.100000 1.00000000000000377476e+00 -4.30958905375957446182e+00
12.200000 1.00000000000000710543e+00 -4.30783174240061672577e+00
12.300000 1.00000000000000599520e+00 -4.28915850793523745210e+00
12.400000 1.00000000000000199840e+00 -4.26242090611273471978e+00
12.500000 1.00000000000000155431e+00 -4.24067189558041235387e+00
12.600000 1.00000000000000399680e+00 -4.23233750068986847026e+00
12.700000 1.00000000000000355271e+00 -4.23658519719029502681e+00
12.800000 1.00000000000000355271e+00 -4.24538979952972361787e+00
12.900000 1.00000000000000399680e+00 -4.24989380303065367173e+00
13.000000 1.00000000000000022204e+00 -4.24612321251661661847e+00
13.100000 1.00000000000000333067e+00 -4.23639546925248922093e+00
13.200000 1.00000000000000199840e+00 -4.22643681713094121477e+00
13.300000 1.00000000000000333067e+00 -4.22097750059842535819e+00
13.400000 1.00000000000000421885e+00 -4.22099280112145169852e+00
13.500000 1.00000000000000244249e+00 -4.22401033353599952846e+00
13.600000 1.00000000000000466294e+00 -4.22652687494353163089e+00
13.700000 1.00000000000000355271e+00 -4.22645765986280874671e+00
13.800000 1.00000000000000466294e+00 -4.22403372015769740244e+00
13.900000 1.00000000000000510703e+00 -4.22098848328616327308e+00
14.000000 1.00000000000000643929e+00 -4.21898759029730019421e+00
14.100000 1.00000000000000466294e+00 -4.21853085895594670518e+00
14.200000 1.00000000000000488498e+00 -4.21894334152406269567e+00
14.300000 1.00000000000000310862e+00 -4.21917807960237922771e+00
14.400000 1.00000000000000377476e+00 -4.21867124643016300212e+00
14.500000 1.00000000000000710543e+00 -4.21761302437731089299e+00
14.600000 1.00000000000000821565e+00 -4.21660263244765598500e+00
14.700000 1.00000000000000599520e+00 -4.21607522072427176596e+00
14.800000 1.00000000000000710543e+00 -4.21599029022080973306e+00
14.900000 1.00000000000000555112e+00 -4.21596555277429185793e+00
15.000000 1.00000000000000843769e+00 -4.21564307912956337532e+00
15.100000 1.00000000000000843769e+00 -4.21497358561991752879e+00
15.200000 1.00000000000000954792e+00 -4.21420800188611455184e+00
15.300000 1.00000000000001154632e+00 -4.21366553805014643075e+00
15.400000 1.00000000000001243450e+00 -4.21348493034855398065e+00
15.500000 1.00000000000001065814e+00 -4.21354166784811834390e+00
15.600000 1.00000000000001110223e+00 -4.21356963209654011848e+00
15.700000 1.00000000000001199041e+00 -4.21336288667884595327e+00
15.800000 1.00000000000001176836e+00 -4.21290736681599664593e+00
15.900000 1.00000000000001088019e+00 -4.21236325228356012218e+00
16.000000 1.00000000000001398881e+00 -4.21193421704103432290e+00
16.100000 1.00000000000001221245e+00 -4.21172883018002419675e+00
16.200000 1.00000000000001110223e+00 -4.21170869633639632923e+00
16.300000 1.00000000000001421085e+00 -4.21173944833959090772e+00
16.400000 1.00000000000001065814e+00 -4.21169323336052503493e+00
16.500000 1.00000000000001265654e+00 -4.21152662926978571534e+00
16.600000 1.00000000000001310063e+00 -4.21128856476649726659e+00
16.700000 1.00000000000001310063e+00 -4.21106930978500226814e+00
16.800000 1.00000000000001221245e+00 -4.21093483574824301030e+00
16.900000 1.00000000000001310063e+00 -4.21089180888180614204e+00
17.000000 1.00000000000001354472e+00 -4.21089715242235840265e+00
17.100000 1.00000000000001243450e+00 -4.21089537781029221719e+00
17.200000 1.00000000000001332268e+00 -4.21085426025836273567e+00
17.300000 1.00000000000001265654e+00 -4.21077757240753225432e+00
17.400000 1.00000000000001398881e+00 -4.21069296605519571841e+00
17.500000 1.00000000000001132427e+00 -4.21062892264352672811e+00
17.600000 1.00000000000001065814e+00 -4.21059734741792279777e+00
17.700000 1.00000000000001310063e+00 -4.21059072576373605301e+00
17.800000 1.00000000000001287859e+00 -4.21059177171652354588e+00
17.900000 1.00000000000001554312e+00 -4.21058600650790726405e+00
18.000000 1.00000000000001199041e+00 -4.21056908272623076073e+00
18.100000 1.00000000000001421085e+00 -4.21054594661554659751e+00
18.200000 1.00000000000001465494e+00 -4.21052486420079929985e+00
18.300000 1.00000000000001287859e+00 -4.21051145749667110607e+00
18.400000 1.00000000000001487699e+00 -4.21050615780998782611e+00
18.500000 1.00000000000001532108e+00 -4.21050550447919658126e+00
18.600000 1.00000000000001465494e+00 -4.21050526179860451492e+00
18.700000 1.00000000000001598721e+00 -4.21050295180977229847e+00
18.800000 1.00000000000001532108e+00 -4.21049855394349581417e+00
18.900000 1.00000000000001731948e+00 -4.21049361812580258402e+00
19.000000 1.00000000000001598721e+00 -4.21048977184146622221e+00
19.100000 1.00000000000001576517e+00 -4.21048771626600970563e+00
19.200000 1.00000000000001554312e+00 -4.21048711324280322543e+00
19.300000 1.00000000000001620926e+00 -4.21048710259099667752e+00
19.400000 1.00000000000001754152e+00 -4.21048694917721899600e+00
19.500000 1.00000000000001576517e+00 -4.21048637740326814338e+00
19.600000 1.00000000000001687539e+00 -4.21048553916706147504e+00
19.700000 1.00000000000001643130e+00 -4.21048474729220245649e+00
19.800000 1.00000000000001398881e+00 -4.21048421972348840825e+00
19.900000 1.00000000000001376677e+00 -4.21048399093960235007e+00
20.000000 1.00000000000001687539e+00 -4.21048395411989151427e+00
20.100000 1.00000000000001709743e+00 -4.21048396520808054788e+00
20.200000 1.00000000000001798561e+00 -4.21048393577712332103e+00
20.300000 1.00000000000001776357e+00 -4.21048384972908795731e+00
20.400000 1.00000000000001842970e+00 -4.21048374194043706353e+00
20.500000 1.00000000000001687539e+00 -4.21048365329916762789e+00
20.600000 1.00000000000001731948e+00 -4.21048360368561702671e+00
20.700000 1.00000000000001643130e+00 -4.21048358966766578249e+00
20.800000 1.00000000000001820766e+00 -4.21048359293806395698e+00
20.900000 1.00000000000001754152e+00 -4.21048359681552497591e+00
21.000000 1.00000000000001842970e+00 -4.21048359362332558220e+00
21.100000 1.00000000000001976197e+00 -4.21048358535860955953e+00
21.200000 1.00000000000001976197e+00 -4.21048357690858132685e+00
21.300000 1.00000000000002087219e+00 -4.21048357099788006508e+00
21.400000 1.00000000000002087219e+00 -4.21048357025337605108e+00
21.500000 1.00000000000002109424e+00 -4.21048357113687021780e+00
21.600000 1.00000000000002220446e+00 -4.21048357368151826563e+00
21.700000 1.00000000000002198242e+00 -4.21048357640746218067e+00
21.800000 1.00000000000002464695e+00 -4.21048357796398420305e+00
21.900000 1.00000000000002220446e+00 -4.21048357993320099268e+00
22.000000 1.00000000000002553513e+00 -4.21048358189205274016e+00
22.100000 1.00000000000002331468e+00 -4.21048358341293837981e+00
22.200000 1.00000000000002575717e+00 -4.21048358518546006479e+00
22.300000 1.00000000000002486900e+00 -4.21048358588940008218e+00
22.400000 1.00000000000002575717e+00 -4.21048358831832736371e+00
22.500000 1.00000000000002531308e+00 -4.21048359173722186455e+00
22.600000 1.00000000000002531308e+00 -4.21048359452028364558e+00
22.700000 1.00000000000002509104e+00 -4.21048359863690180305e+00
22.800000 1.00000000000002531308e+00 -4.21048360054119363838e+00
22.900000 1.00000000000002531308e+00 -4.21048360266773968874e+00
23.000000 1.00000000000002486900e+00 -4.21048360563485424279e+00
23.100000 1.00000000000002664535e+00 -4.21048360754446981957e+00
23.200000 1.00000000000002864375e+00 -4.21048360990162251483e+00
23.300000 1.00000000000002775558e+00 -4.21048361214717736800e+00
23.400000 1.00000000000002797762e+00 -4.21048361391793601882e+00
23.500000 1.00000000000002620126e+00 -4.21048361592222430971e+00
23.600000 1.00000000000002819966e+00 -4.21048361901441214883e+00
23.700000 1.00000000000002930989e+00 -4.21048362031100076308e+00
23.800000 1.00000000000003064216e+00 -4.21048362208034987475e+00
23.900000 1.00000000000003086420e+00 -4.21048362559442868047e+00
24.000000 1.00000000000002842171e+00 -4.21048362750381421904e+00
24.100000 1.00000000000002819966e+00 -4.21048363034442640895e+00
24.200000 1.00000000000002886580e+00 -4.21048363199265640588e+00
24.300000 1.00000000000002819966e+00 -4.21048363318643747988e+00
24.400000 1.00000000000002642331e+00 -4.21048363569618189217e+00
24.500000 1.00000000000002775558e+00 -4.21048363699082806022e+00
24.600000 1.00000000000002686740e+00 -4.21048363882341902809e+00
24.700000 1.00000000000002775558e+00 -4.21048364131908581243e+00
24.800000 1.00000000000003064216e+00 -4.21048364322139256899e+00
24.900000 1.00000000000002864375e+00 -4.21048364607044867114e+00
25.000000 1.00000000000002953193e+00 -4.21048364891729409720e+00
25.100000 1.00000000000002908784e+00 -4.21048365161413506996e+00
25.200000 1.00000000000003042011e+00 -4.21048365383506695281e+00
25.300000 1.00000000000002819966e+00 -4.21048365614967767812e+00
25.400000 1.00000000000002819966e+00 -4.21048365905898691608e+00
25.500000 1.00000000000002686740e+00 -4.21048366177827926293e+00
25.600000 1.00000000000002375877e+00 -4.21048366390300810025e+00
25.700000 1.00000000000002553513e+00 -4.21048366537401008713e+00
25.800000 1.00000000000002731149e+00 -4.21048366693141229433e+00
25.900000 1.00000000000002464695e+00 -4.21048366756922387566e+00
26.000000 1.00000000000002642331e+00 -4.21048366869517654010e+00
26.100000 1.00000000000002642331e+00 5.62359633204166442511e+01
26.200000 1.00000000000002620126e+00 5.57923945548943720496e+01
26.300000 1.00000000000002620126e+00 5.56025002364933271792e+01
26.400000 1.00000000000002486900e+00 5.56569799109360872080e+01
26.500000 1.00000000000002731149e+00 5.59061286413556075559e+01
26.600000 1.00000000000002597922e+00 5.62779412380930992299e+01
26.700000 1.00000000000002486900e+00 5.66970123997330688326e+01
26.800000 1.00000000000002575717e+00 5.70988184084494676540e+01
26.900000 1.00000000000002531308e+00 5.74355927027270354301e+01
27.000000 1.00000000000002797762e+00 5.76787776478332077090e+01
27.100000 1.00000000000002708944e+00 5.78180208810603204483e+01
27.200000 1.00000000000002797762e+00 5.78577771574888828354e+01
27.300000 1.00000000000002642331e+00 5.78152503651983522559e+01
27.400000 1.00000000000002442491e+00 5.77152291545806832573e+01
27.500000 1.00000000000002531308e+00 5.75837734364327076264e+01
27.600000 1.00000000000002531308e+00 5.74435538020052547381e+01
27.700000 1.00000000000002486900e+00 5.73084927698363841841e+01
27.800000 1.00000000000002620126e+00 5.71827221588678682451e+01
27.900000 1.00000000000002597922e+00 5.70635412459998860868e+01
28.000000 1.00000000000002664535e+00 5.69457319161569870403e+01
28.100000 1.00000000000002509104e+00 5.68289579320972109144e+01
28.200000 1.00000000000002642331e+00 5.67227676436620242839e+01
28.300000 1.00000000000002642331e+00 5.66474620916004454330e+01
28.400000 1.00000000000002398082e+00 5.66306290257706592683e+01
28.500000 1.00000000000002686740e+00 5.66962312844452043237e+01
28.600000 1.00000000000002575717e+00 5.68524250639849668687e+01
28.700000 1.00000000000002753353e+00 5.70820856241670782083e+01
28.800000 1.00000000000002686740e+00 5.73397206407252184590e+01
28.900000 1.00000000000002731149e+00 5.75616826091867253012e+01
29.000000 1.00000000000002753353e+00 5.76845195500232748032e+01
29.100000 1.00000000000002886580e+00 5.76655558921280828599e+01
29.200000 1.00000000000002908784e+00 5.74996106049229780410e+01
29.300000 1.00000000000002664535e+00 5.72212140785134408816e+01
29.400000 1.00000000000002864375e+00 5.68938694302689427218e+01
29.500000 1.00000000000002775558e+00 5.65919007579144661690e+01
29.600000 1.00000000000002975398e+00 5.63804306241621375761e+01
29.700000 1.00000000000002864375e+00 5.63029609559181523082e+01
29.800000 1.00000000000002842171e+00 5.63766551190121703030e+01
29.900000 1.00000000000002975398e+00 5.65915463481526614942e+01
30.000000 1.00000000000002930989e+00 5.69110022912060031786e+01
