# tag norm j_0
25.300000 1.00000000000003397282e+00 -1.72154560097139406639e-03
25.300000 1.00000000000003397282e+00 -3.62177370349264587078e-04
25.300000 1.00000000000003397282e+00 -4.87765683987097513775e-04
25.300000 1.00000000000003397282e+00 3.48660369978516016844e-05
25.300000 1.00000000000003397282e+00 -6.00343296868266333190e-04
25.300000 1.00000000000003397282e+00 7.08978762428909991709e-05
25.300000 1.00000000000003397282e+00 -5.28832462538794505214e-04
25.300000 1.00000000000003397282e+00 1.07380114446506842165e-04
25.300000 1.00000000000003397282e+00 -5.49200544193048059878e-04
25.300000 1.00000000000003397282e+00 1.27857662242550828777e-04
25.300000 1.00000000000003397282e+00 -5.59107256588724536514e-04
25.300000 1.00000000000003397282e+00 1.09129556750551848275e-04
25.300000 1.00000000000003397282e+00 -5.52917009666501315171e-04
25.300000 1.00000000000003397282e+00 8.34726508481886333860e-05
25.300000 1.00000000000003397282e+00 -6.40953145013671630841e-04
25.300000 1.00000000000003397282e+00 7.25695680863133854620e-05
25.300000 1.00000000000003397282e+00 -5.47316985011198097778e-04
25.300000 1.00000000000003397282e+00 -2.90634293996329786183e-04
25.300000 1.00000000000003397282e+00 -1.69282287111474768690e-03
