# tag norm n_up_hub[0] n_up_hub[1] n_up_hub[2] n_up_hub[3] n_up_hub[4] n_up_hub[5] n_up_hub[6] n_up_hub[7] n_up_hub[8] n_up_hub[9] n_up_hub[10] n_up_hub[11] n_up_hub[12] n_up_hub[13] n_up_hub[14] n_up_hub[15] n_up_hub[16] n_up_hub[17] n_up_hub[18] n_up_hub[19] n_up_hub[20] n_up_hub[21] n_up_hub[22] n_up_hub[23] n_up_hub[24] n_up_hub[25] n_up_hub[26] n_up_hub[27] n_up_hub[28] n_up_hub[29] n_up_hub[30] n_up_hub[31] n_up_hub[32] n_up_hub[33] n_up_hub[34] n_up_hub[35] n_up_hub[36] n_up_hub[37] n_up_hub[38] n_up_hub[39] n_up_hub[40] n_up_hub[41] n_up_hub[42] n_up_hub[43] n_up_hub[44] n_up_hub[45] n_up_hub[46] n_up_hub[47] n_up_hub[48] n_up_hub[49] n_up_hub[50] n_up_hub[51] n_up_hub[52] n_up_hub[53] n_up_hub[54] n_up_hub[55] n_up_hub[56] n_up_hub[57] n_up_hub[58] n_up_hub[59] n_up_hub[60] n_up_hub[61] n_up_hub[62] n_up_hub[63]
1 1.00000000000000000000e+00 4.95408330239796801386e-01 2.73989399083314100203e-01 5.43247307322779371397e-01 4.75055134306173354464e-01 5.43719039984519092457e-01 5.71599745539547732243e-01 5.22202405711962303059e-01 6.76981813693866230075e-01 6.07138704803074080729e-01 5.88211244015072742819e-01 5.37477943285773696047e-01 7.30025904263625569079e-01 8.78570008690697124010e-01 3.37653209177643687244e-01 4.18420241479997012668e-01 3.41209100419955169148e-01 1.47868798876051282809e-01 3.80397623719902655548e-01 7.60680874362089781693e-02 5.15317667778278920565e-02 3.98077677494414750026e-02 1.98734257105838030277e-01 2.59836478167888573765e-01 5.36168520687362426536e-01 5.83630665980012786065e-01 2.85309717651562599894e-01 3.95541858180470773387e-01 5.74226536431039491504e-01 3.30713298745670458700e-01 6.33094560345514478783e-01 4.57836943175205568490e-01 5.36430913858839786279e-01 6.47525852048526751048e-01 4.36113199637223725169e-01 7.96758536592805821641e-01 6.07814841136121941645e-01 6.56251777348652254318e-01 8.92132354072615929574e-01 8.21984371053703921639e-01 9.73913167353059772147e-01 9.75435541713893572435e-01 2.72260378980899941936e-01 4.05045176387236749438e-01 6.06050498570022688760e-01 6.49538945189272798331e-01 2.31809204135787955137e-01 8.67545882652083433229e-01 4.00692494356736650385e-01 5.31696917087719600481e-01 3.24647521705817898585e-01 4.18422677250843588759e-01 4.70614394551090997609e-01 2.58616432327203660257e-01 6.54823399197211775125e-01 1.98283309088084780392e-01 7.43758172150353558116e-01 7.53637659902149592561e-01 6.67451137612707579017e-01 4.19193400349499256663e-01 5.26813824560196874991e-01 5.28117022676897307498e-01 9.54716881070771967999e-03 5.79096544085013098524e-01 6.46300870509117775242e-01
2 1.00000000000000000000e+00 2.26664691164072326646e-02 2.66761716203996634977e-01 6.77452324818029638642e-01 1.29077322967039526125e-01 5.50776971369737133877e-01 2.92152717301653486182e-01 2.21966479851257780798e-01 8.95300161035999297887e-01 5.66531551342885908440e-01 3.76829549020982035312e-01 6.19317184986721992052e-04 9.99980332272540572980e-01 9.99949581641891849237e-01 9.79149198619785110509e-01 5.59436146890774990692e-02 9.62165669014820368332e-01 7.70806355038877906438e-03 7.97372539899704912969e-01 1.97969259097503347267e-01 5.04371696689935415658e-03 3.54824837339992723781e-03 1.73381505956283044068e-01 8.19089917546336421239e-01 9.06018958866901313876e-01 2.56638902987456174465e-01 6.82249428017081882558e-01 4.38013086633266268688e-02 6.75557087916133780503e-02 6.29089939376606954724e-02 9.65040687252489370884e-01 4.18268780166294984468e-01 3.79020246357778700652e-01 4.43679413802325825489e-02 3.78901563887333536762e-01 1.83441029746096523345e-01 7.85112320958222142941e-01 8.23272600497653828100e-01 8.56809559044152235785e-01 1.47700108679530484057e-01 9.97923518942574361290e-01 9.99597781633186133199e-01 9.99937177194004878089e-01 9.99948419257767007196e-01 9.99823122823689236505e-01 9.99886774892672747228e-01 9.98458298687861511844e-01 7.35989461411901461051e-04 8.18819622442475525403e-01 2.24134567897097708444e-01 9.33641567056049725970e-01 3.30821227727435621113e-02 1.74377787478611379068e-01 3.80530973572953054584e-02 7.76747039976154796115e-01 4.83092913162794321963e-03 9.97457815919333357080e-01 9.99999999999526267835e-01 9.99999984437695998984e-01 9.99882689496395138384e-01 9.97495434163629401958e-01 2.62171027244813975576e-03 1.41377288774522871430e-09 7.83903282811783187034e-08 1.01826199991909629929e-07
3 1.00000000000000000000e+00 4.47648103345802631653e-03 5.41388974647123877304e-01 4.20400047078494820685e-01 3.46146061443501906751e-01 5.80281131982132825087e-01 2.34819335570731452245e-01 1.21302439133821632344e-01 8.13354485839549945503e-01 4.01686719805575964681e-01 5.33433736123855029021e-01 1.00499851317332536405e-02 9.93082947115727754372e-01 9.94410778029550912471e-01 8.19580426196373723613e-01 3.42188379467276870827e-01 8.38792409173309994053e-01 8.00905396490440499302e-03 6.58789749657740286715e-01 3.14861928780493238733e-01 2.29897804122407602156e-02 7.20415635770146780929e-04 4.23321724978994617938e-01 5.74841651742246217971e-01 9.91563181507770230461e-01 1.76136482656345710884e-01 6.45479091099743218507e-01 1.65627605279746431544e-01 3.15931138643040093639e-02 1.52667453533648321551e-02 8.86923396711675748882e-01 2.11328603122938246672e-01 3.48649984768640175403e-01 1.68809599959864220509e-01 3.59485970119574504977e-01 2.92822252210409084139e-01 7.49072542976817024041e-01 9.18817934825378213048e-01 8.79843169551171588871e-01 2.02459766202942897939e-01 9.59508840544034624642e-01 9.98010682180510588779e-01 9.99728632089752378143e-01 9.99948169336606351720e-01 9.99995860199843988880e-01 9.99497587327436098903e-01 9.93654138790579843921e-01 4.67572149534151593891e-03 5.82499209070094003948e-01 4.56296806690320022604e-01 6.18488561056644958747e-01 3.63094319001696530513e-01 4.59161227428758533797e-01 3.83331576468273538261e-01 1.19302196795541437524e-01 3.43656314915405172727e-02 9.93141226403723154093e-01 9.92564403326036015507e-01 9.98763657306173335826e-01 4.51178489715355401923e-01 9.98135136066988670756e-01 2.99979932466411913783e-01 1.49226818084007145648e-01 9.26975163238676069799e-02 9.94557718522271969053e-03
4 1.00000000000000000000e+00 2.76244106507933344374e-02 6.24643102097110713977e-01 3.03418181185563406999e-01 3.85015208805848385687e-01 4.53287443683246249471e-01 3.92736311044232344614e-01 7.30354550518495237998e-02 8.10638979799024883555e-01 2.86673819977508570478e-01 6.24954074504262435674e-01 8.18765168475361349021e-02 9.39590236846178705754e-01 9.74705383181371010082e-01 8.07465310887394482897e-01 3.62995086182875958958e-01 8.37176597658899734888e-01 2.60674130886841479149e-02 6.39640310978186299451e-01 3.01901430376726731541e-01 4.66768046851209206238e-02 8.73658216498309284082e-03 6.12172289605579900140e-01 3.86508883118388546496e-01 9.84799442044362205451e-01 1.47215611690970138437e-01 6.21959427646550433444e-01 2.01713700701755010991e-01 3.97811061183802466834e-02 1.01276211054977735571e-02 8.22561262750986177394e-01 2.01876877726325870688e-01 4.13562598502785816468e-01 4.74573970099368525055e-01 4.32484409051662133106e-01 5.28660186077427152185e-01 7.61214183739755245739e-01 8.12169041186318940717e-01 7.41970897190906919505e-01 4.59988292941987841900e-01 8.98857894366626886118e-01 8.26574609623622613697e-01 7.85468837729706104156e-01 8.94003802585952356274e-01 9.36285840861771800903e-01 9.56770602089462074424e-01 9.23182727593984786552e-01 4.47700627359535127670e-02 6.08123129611741086720e-01 4.02734889923935690526e-01 4.86350359117331487724e-01 4.57358079063568512268e-01 2.82718069600878918468e-01 3.33224178822995653615e-01 4.43231205083647550325e-01 1.36593695389257946404e-01 9.72638478121059302239e-01 8.86047961441875364663e-01 9.89594396629492667472e-01 8.47039720944198354369e-02 9.88500339641095293608e-01 1.18395882345219360943e-01 5.23268592725910197672e-01 2.81278615883388649621e-01 7.71253159206837651807e-02
5 1.00000000000000000000e+00 5.26432386321173395594e-02 6.60626454750716241016e-01 2.48267188328409993403e-01 4.17145298403540698562e-01 3.69892130241913030808e-01 4.79587653028706040192e-01 6.96503764354230170408e-02 7.87964755067258271204e-01 2.73293901505025416121e-01 6.29665769978295930542e-01 2.24333207270443313330e-01 8.20695208226226213810e-01 9.32772114094114090932e-01 7.80521019590197040472e-01 3.84542067639975782001e-01 8.39402831293243223421e-01 6.07791949877163895088e-02 6.33320231307191838788e-01 2.65156233524538043067e-01 7.26750076362950164777e-02 7.35079669899281473722e-02 8.09356500049820737352e-01 1.67624415199930126841e-01 8.85763280172626732423e-01 1.37908421271772468897e-01 5.76920613333961829206e-01 2.72330657715528112739e-01 7.44078760204351929985e-02 3.40248056551119837376e-02 7.79329882681277563705e-01 1.89752689005890901042e-01 4.98036953369289547844e-01 5.22878212726706759206e-01 6.77085725096058577144e-01 4.80614105519184764415e-01 8.08237313474221674703e-01 7.92429912363532218400e-01 5.90787475484488622257e-01 6.41910025877207579548e-01 9.72456996428711639702e-01 7.60491047739288772433e-01 6.49779824914777037748e-01 7.19990688056520999893e-01 8.51333100348933169421e-01 6.84123352404279794214e-01 7.94313784792441857086e-01 8.47369157437605491356e-02 7.72461669577289011812e-01 2.49952183545286893418e-01 5.26480420571463492152e-01 3.09308357830227975693e-01 5.01778468055386284163e-01 2.12164728640447552976e-01 7.91873099238432520686e-01 4.08753350449074071005e-01 9.14112334000047210836e-01 7.17862723314409700848e-01 9.56858278042505450145e-01 1.21126026062237934777e-01 9.68727386167029469455e-01 1.14493599394539055658e-01 6.11438996278993784905e-01 2.26412710570458947101e-01 6.31292438851355358631e-02
6 1.00000000000000000000e+00 2.04556176243331055975e-01 7.28172894491098787739e-01 2.16289445419830028694e-01 6.18060231640106483297e-01 1.61636856051543986723e-01 6.55500641483073187565e-01 1.15921586497973808094e-01 5.92946074083001928301e-01 3.53197894512960020030e-01 4.12259447548564694763e-01 4.10883778786083286860e-01 6.62949910821705956643e-01 8.42238479135886231042e-01 7.75554032058711428910e-01 3.74821681351906577095e-01 8.39211281123175001362e-01 7.65148764613566151338e-02 6.26662107080415586857e-01 2.50514426383504518192e-01 9.53178270498893365215e-02 1.54998237051768572581e-01 7.67107005682660658685e-01 1.53435097290142236082e-01 7.90812995063305934629e-01 1.75623736589181261847e-01 5.02851627268662282333e-01 3.23667940904953266301e-01 1.23042592574139020289e-01 6.31460297408771298322e-02 7.62273172399803522481e-01 1.88301193098463964803e-01 6.42275027952397326025e-01 4.12967739030963232327e-01 7.33241031923406061388e-01 4.47608550814875050250e-01 7.53318749451982183629e-01 7.57412549625429476485e-01 6.16452708550352834749e-01 6.28484734650677778767e-01 9.80284001848481967301e-01 7.05852768616739068008e-01 6.15299369611646218559e-01 7.16274453668260702166e-01 8.18106884187885796678e-01 3.74057740523834891810e-01 7.70513029128531368173e-01 5.39400909166665998296e-02 7.90204581840407538351e-01 1.86130563539988358457e-01 7.31559571824806353924e-01 2.64105624597883115179e-01 7.59495922366226428046e-01 2.56868888331876266129e-01 9.31691478613672519060e-01 7.12392966510900893518e-01 8.79262757244390180666e-01 4.27778499745242513086e-01 8.92659095632111099228e-01 1.52487598115951944466e-01 9.38881708534843539837e-01 1.23071668633161435125e-01 6.51187632959762785489e-01 2.03058470478944985693e-01 5.46042646394452532710e-02
7 1.00000000000000000000e+00 2.39919964963603238317e-01 7.13596321928188781492e-01 2.16873572569079686723e-01 6.92873921657464308943e-01 1.37216027878786367422e-01 7.53217905590759295720e-01 1.47072695181388546359e-01 5.60256567444171960091e-01 3.83432178577757687421e-01 3.83856183749167523267e-01 5.41388635044614985325e-01 6.07276162678935582662e-01 6.52978548510596890075e-01 7.80414524685216881572e-01 3.30642555668680504510e-01 8.18239897895945533790e-01 8.88493277094494771084e-02 6.07274256986281679715e-01 2.48174053489430612718e-01 1.27694930172595616513e-01 2.37554623544172227589e-01 6.67242396684530891804e-01 1.81034704174044852598e-01 6.97516219620259891876e-01 2.18772162087953164766e-01 4.46844933049485470988e-01 3.51486064056669211819e-01 1.78735086916739505103e-01 9.13788949091170338290e-02 7.46703261056398504003e-01 1.81744031208692619073e-01 7.08718185446589821197e-01 3.64626259826070053816e-01 7.58914140968716344204e-01 4.42044621947336846546e-01 7.22638840635670520740e-01 7.40151704325257342454e-01 6.41530695173546994248e-01 6.08605033166488285090e-01 9.72821276248087563054e-01 6.87048325431061757129e-01 6.38387357582734793482e-01 6.96984449790355564680e-01 7.88998416590120266179e-01 3.58000531372063002244e-01 8.02254395576676326840e-01 1.17724258465558728748e-01 8.03875820468081703218e-01 1.39556132950608730026e-01 7.68392309775627557755e-01 2.23477999152984108111e-01 8.38372044988117681719e-01 2.45031665069223414388e-01 8.97740420170278663470e-01 7.90087078392929353932e-01 8.92711508397507458312e-01 3.05609126857218027506e-01 8.67997968383927287483e-01 1.78271196917337337862e-01 9.31727109931433705725e-01 1.26777621014848795866e-01 6.59875900897889944297e-01 1.98210211383316070588e-01 5.25767830120506748925e-02
8 1.00000000000000000000e+00 2.47482234253519339795e-01 7.21095766706853158468e-01 1.90985722667851604006e-01 7.54436778280152431364e-01 1.34630298083422500488e-01 7.80231163466070909429e-01 1.77103853554915591229e-01 6.15685119046417650424e-01 3.58456011845688093942e-01 4.83726246950275551306e-01 5.01769761123071478259e-01 6.45655857626370788260e-01 4.83790639876963635135e-01 7.79889618856449917672e-01 2.80087891167467961662e-01 7.99165368598794167987e-01 9.17806799424668584564e-02 5.80360159510886930434e-01 2.58866896392582590547e-01 1.64365888884260652469e-01 2.80720504092669076446e-01 5.99987794739713198311e-01 1.98089512300119618970e-01 6.51287378609631151249e-01 2.40073419708180163523e-01 4.19276253382353247812e-01 3.59914059209293701880e-01 2.19403070191271531986e-01 1.14030033771992847513e-01 7.35078696195477054864e-01 1.74426284154355099032e-01 7.46900340410471375030e-01 3.35696543665085722630e-01 7.68772934075315328428e-01 4.49838302397057798743e-01 7.01424675100163041996e-01 7.32480414527488021825e-01 6.56175679257812505263e-01 5.91051209900796958863e-01 9.61511489400950325468e-01 6.55682180280684812068e-01 6.45379259998802967679e-01 7.01463261368671986418e-01 7.47015933639413209910e-01 3.84885448402539631640e-01 7.97285436213099552027e-01 2.00289837613833260344e-01 8.04850161862726620754e-01 1.44958644050924040370e-01 8.09881581904650760251e-01 1.82886353999896111855e-01 8.63716230694056341655e-01 2.77508678450175405583e-01 8.23550688246148632210e-01 7.96616657325620702856e-01 9.04755298720988254679e-01 2.48945273917385606621e-01 8.52163721785132777242e-01 2.03255873317517793408e-01 9.28366616083875717536e-01 1.29527733057369781600e-01 6.58936103225297276076e-01 1.99506865672499006381e-01 5.28676082440696845643e-02
9 1.00000000000000000000e+00 2.41591153725838309052e-01 7.24523350198084115092e-01 1.84017879102769094102e-01 7.64199020652207794413e-01 1.43761341049792656932e-01 7.72371971847496840979e-01 1.95873199292613348055e-01 6.66690392423018196588e-01 3.34526192331986105266e-01 5.97197837733273062533e-01 4.31319269671491645202e-01 6.98088144620810480134e-01 3.85660531402546136182e-01 7.76660670323406354676e-01 2.44003980712317436463e-01 7.84451704857644038782e-01 9.55452794326673571224e-02 5.54876058478211087177e-01 2.70464022423352101754e-01 1.98104026310920333653e-01 3.02417872360728201553e-01 5.62096779830636106290e-01 2.10258653206573886685e-01 6.23570784188150262217e-01 2.50784683654776852091e-01 4.06720948640342860880e-01 3.55380253086441721955e-01 2.54365738960599663265e-01 1.38316102870188001317e-01 7.19891436463413691982e-01 1.77977925972667982979e-01 7.63238101513712963175e-01 3.21993985320482289936e-01 7.66781577227974131539e-01 4.62435576657005187329e-01 6.84299261228095256904e-01 7.23692685661578183343e-01 6.69932496137064292796e-01 5.72356134408161243421e-01 9.47681527089849540246e-01 6.15257283721427072898e-01 6.53679452820631223808e-01 7.06809781228193156899e-01 6.99349145521012238724e-01 4.29560485814379444669e-01 7.71672638584246728399e-01 2.76021346172208303926e-01 7.89003203082995319129e-01 2.10007925868877981523e-01 8.01430521055045086420e-01 2.15165841424263759585e-01 8.21116315667732465933e-01 3.59756245014729081344e-01 7.43821518653865254578e-01 6.75423648169510837391e-01 9.18588184265636709114e-01 2.25002323944794996313e-01 8.38883014039823904362e-01 2.87143375068447781473e-01 9.26616951184171866451e-01 1.39642728871040955330e-01 6.45708065167320044431e-01 2.11500432465207666155e-01 6.07210211254930465330e-02
10 1.00000000000000000000e+00 2.07136857325488865644e-01 7.37463253410996055770e-01 1.61592877346949048700e-01 7.75598565925977978530e-01 1.75357451086399246387e-01 7.59512821446602481856e-01 2.27392695305168812681e-01 7.08592004339774650390e-01 3.16299675981981776030e-01 6.63809499535513269919e-01 3.77643190384152893646e-01 7.25154663871962701371e-01 3.33796795711587324096e-01 7.67373993892706329767e-01 2.19735332238647607106e-01 7.74871331391310480541e-01 1.02948883094481899447e-01 5.39273496327566825848e-01 2.81120185942459688277e-01 2.25374300643296776592e-01 3.19214777278826356000e-01 5.37129693446740663632e-01 2.22299726192152075077e-01 6.18928925230109561184e-01 2.45839063602333013359e-01 4.32079631175734668602e-01 3.30684031305776837684e-01 2.81881821693662215633e-01 1.85461394340387747404e-01 6.67061093327399268205e-01 2.06679327021330377923e-01 7.40650578032981399268e-01 3.30299830269179417463e-01 7.45143311091139959323e-01 4.79561782251439638891e-01 6.64917061258257335865e-01 7.10669635848937719658e-01 6.76895008270413600648e-01 5.55643180392729418848e-01 9.23811886869235765474e-01 5.33860510014378064625e-01 6.70753914541256435200e-01 7.05981614755163855435e-01 6.16790959424785345533e-01 5.13800163887813687857e-01 6.79395486078234189797e-01 3.84121069035117612689e-01 7.26288390392919036564e-01 3.10458276368502650300e-01 7.33151755882064493086e-01 3.08583853733154556132e-01 7.25307178154567577799e-01 3.74825379818052417669e-01 7.34703697796152854771e-01 4.50212128491330798585e-01 9.01215551982439966316e-01 2.97523809013764573006e-01 8.34748872336002145644e-01 4.31757111676113913834e-01 9.23507378402147360852e-01 1.71810133625476951780e-01 6.41572035842359222890e-01 2.47783928453132989977e-01 1.26947166193359273212e-01
11 1.00000000000000000000e+00 2.00707122513680030762e-01 7.41046092052321081489e-01 1.60885940005157768162e-01 7.72772253437073897153e-01 1.82094358028141334316e-01 7.57407482315323732358e-01 2.37180728554449882228e-01 7.23301416662453844353e-01 3.11883180845242080625e-01 7.00595518463323130298e-01 3.50687498479545056718e-01 7.37765027120494853996e-01 3.06531964618271535183e-01 7.63517091546384474299e-01 2.02182542119710956241e-01 7.67190028394769574227e-01 1.13681322297252848652e-01 5.36349461835449292657e-01 2.92389264073667276556e-01 2.50611148746801515319e-01 3.37544848604924507818e-01 5.25732618957321373721e-01 2.30089154250556232606e-01 6.72058038299916171709e-01 1.99958659904752755754e-01 5.72008267642221235327e-01 2.48052126710384096553e-01 3.45619077829450227490e-01 3.17082798237496799043e-01 4.94725549412233067681e-01 3.78727786797701193588e-01 5.79824889074206595296e-01 4.43010342493373177053e-01 6.11563946501024635616e-01 5.51939850495920092399e-01 5.95483508268049743783e-01 6.60341040078766705612e-01 7.00934787025840000396e-01 4.73050100380277671608e-01 9.04241517994757049159e-01 4.94270790745431176649e-01 6.79180707609020606341e-01 6.85009298864480142832e-01 5.78879150110317985956e-01 5.62510110228602533411e-01 6.18382059340569112393e-01 4.35755068776387533003e-01 6.56432091725724364828e-01 3.62312506559163360897e-01 6.59533061937139897246e-01 3.42645732258871238418e-01 6.77078055287882896174e-01 3.19424941378718074692e-01 7.84104707843928605548e-01 2.50856180388666472059e-01 8.94413780513956369056e-01 2.13744851378200317882e-01 8.12793536427306895220e-01 2.15140382920339739981e-01 8.60536403594430732156e-01 2.05186906332339269454e-01 8.07619154037263919932e-01 3.09501659889421298910e-01 6.23920510782985271447e-01
12 1.00000000000000000000e+00 1.89622329375410680896e-01 7.46251061619928934832e-01 1.60054872451756424745e-01 7.68869249106353014334e-01 1.93858673775482381885e-01 7.56843461990250876426e-01 2.50393722120690553901e-01 7.36742356023889599648e-01 3.06841167196890973745e-01 7.25521770781454855559e-01 3.27584482427917322855e-01 7.44394043791351434081e-01 2.82556202071483242300e-01 7.62170797177989967075e-01 1.86534111097982707728e-01 7.59618752507576933120e-01 1.30118483878767648987e-01 5.45988991557000313826e-01 2.98442327589008626898e-01 2.83605006178267171624e-01 3.61877817594097206388e-01 4.92365879905396541805e-01 2.44630364385910681335e-01 6.84295478792902533982e-01 1.73397195647394836149e-01 6.63788814469742249891e-01 2.06378344863410750909e-01 4.28046945892694652436e-01 3.78235956536916939630e-01 3.92309630619410987240e-01 4.81955017413657482717e-01 4.60681589874052166422e-01 5.30867216696549459876e-01 5.18222371813489957049e-01 5.92464684306272637571e-01 5.61322453026556034139e-01 6.03508116923997861569e-01 7.28239400989605489833e-01 4.05799863487287082453e-01 8.93415634011141213122e-01 4.64615607234804162129e-01 6.89200062925944823000e-01 6.60377075155354487102e-01 5.68816430811516782207e-01 5.82812391783297911729e-01 5.96239288869428119000e-01 4.63680726456052350049e-01 6.34899692568301032836e-01 3.85509321869505761082e-01 6.50454904901243025073e-01 3.54297863332680429416e-01 6.87418789214707004476e-01 3.17780375154651240077e-01 8.09283849221718920575e-01 2.32651258381812608977e-01 8.81599274823248402200e-01 1.84048196779102918308e-01 7.95102372627739306665e-01 1.79492507981683313556e-01 8.23232564536129918231e-01 1.90661672850775371080e-01 8.61964997776319741263e-01 2.74718276115644532975e-01 7.53327858658311311224e-01
13 1.00000000000000000000e+00 1.79841081966648136392e-01 7.50476536264860549785e-01 1.60117916056081721621e-01 7.66488805215717716735e-01 2.04683288517363531911e-01 7.59243787610748621653e-01 2.61347931714075498721e-01 7.51770097298504080818e-01 2.98101320680793924200e-01 7.49925003406193724231e-01 2.94891344427428536701e-01 7.53554548739150398262e-01 2.42604457689525210284e-01 7.62799760817095995336e-01 1.72038626641754732738e-01 7.25329170852391347246e-01 1.78171928176448557402e-01 5.35859163856161613282e-01 3.15584393871584267810e-01 3.58017561465179878777e-01 3.72125131182418078524e-01 4.56494002130084286506e-01 2.76374338954751441744e-01 6.27405842854563911004e-01 1.86591975428138989734e-01 6.85786756866191060666e-01 1.99265232731378499897e-01 6.03848479158900275365e-01 3.19168189102596588924e-01 5.18632669049599370759e-01 4.37528582457959835939e-01 5.13647288997539752664e-01 4.89228767031274047739e-01 5.69264520635354376310e-01 4.71823712175603371399e-01 6.72700639316133330858e-01 3.90494514029855133153e-01 8.10390281104098275655e-01 3.06108896480460135336e-01 8.38873057831160506836e-01 4.13274821331830299886e-01 6.99928879187561414632e-01 5.73506156400982791688e-01 5.79824310748949356409e-01 6.01057517373644545344e-01 5.63781510949612152395e-01 5.31970240203809452417e-01 6.10508576816802150944e-01 4.35646249830493492716e-01 6.80577416957743097647e-01 3.48641593283701756167e-01 7.77739674224919630419e-01 2.65946947648905251960e-01 8.50818810139423509220e-01 2.10192734711159068262e-01 8.11914680339347216709e-01 2.04062198749653284091e-01 7.50732316454153059126e-01 2.05198966749616240612e-01 7.78337814010347517346e-01 2.02527628009012583554e-01 8.45968873982097968600e-01 2.24844793555031896570e-01 8.66397685555336916075e-01
14 1.00000000000000000000e+00 1.71289556740870124729e-01 7.53946676794031489521e-01 1.59414011295518603939e-01 7.68052081751040005564e-01 2.11688016260063893714e-01 7.59660892414658728278e-01 2.66624091527488671360e-01 7.54307215001231989859e-01 2.93639696797051985566e-01 7.52710699131299398879e-01 2.81135982805157114139e-01 7.55325003138106465528e-01 2.32405803802317456608e-01 7.57042412074114046128e-01 1.81925572823810305367e-01 7.13428526623593017852e-01 1.99295045034871276535e-01 5.64786889778515877047e-01 3.04572894782491498944e-01 4.07997860808428924884e-01 3.73135858007717757800e-01 4.33051519150212393949e-01 3.13627916351885860369e-01 5.77944295429969279176e-01 2.19629061631065297666e-01 6.84122855027116005822e-01 1.89299642119723665612e-01 6.89774451052142634211e-01 2.38904109860542168686e-01 6.37133811680367201369e-01 3.28900075367989874753e-01 6.10414713592971502898e-01 3.89232921296056799676e-01 6.52602951204874770497e-01 3.69772311339892134630e-01 7.35185820871295581114e-01 3.13090725707248829224e-01 8.19421999806218992468e-01 2.92528118324776209569e-01 8.14068122476063416038e-01 4.00562626574837266080e-01 7.01857680910123682416e-01 5.41584040141771194676e-01 6.00295758085609421073e-01 5.87588672486791252503e-01 5.87008836728155736218e-01 5.29609342038722230583e-01 6.48258711237915119519e-01 4.18741307339582147229e-01 7.37544617766692889305e-01 3.12248139154865489431e-01 8.14529754347286361060e-01 2.41547865559256225154e-01 8.25724625768919806568e-01 2.18732274187050240721e-01 7.70390091508144969623e-01 2.19622916583609634200e-01 7.33944953037530822826e-01 2.17930139173174580725e-01 7.69493904657484351084e-01 2.13465560584019609092e-01 8.45713303292572660119e-01 2.26113231944995357603e-01 8.66401437208052849215e-01
15 1.00000000000000000000e+00 1.70881679953612447553e-01 7.54162174781744965024e-01 1.59905553452124676861e-01 7.67471013049848660437e-01 2.12608697781561939433e-01 7.60588540495816922693e-01 2.66099979371542672002e-01 7.55503736959832972175e-01 2.89703718346489169644e-01 7.54513043088045787243e-01 2.74116661431505037605e-01 7.56424425999059901748e-01 2.29458932613800625777e-01 7.51779520644648591166e-01 1.91564074894993635612e-01 7.05426442818612553509e-01 2.12331846877631347237e-01 5.86257773159961192988e-01 2.97996721612424630976e-01 4.53575493005127450274e-01 3.70119483452080733077e-01 4.30697735917098478708e-01 3.49574396352053951009e-01 5.27696801552673289137e-01 2.70632521193602537668e-01 6.46524590962001211025e-01 2.07736968860828041805e-01 7.14548371379350788501e-01 2.02813375970777615143e-01 7.27268039525024279079e-01 2.43077434119651630828e-01 7.29970226428012569642e-01 2.73650597076708745892e-01 7.54837353529851484701e-01 2.71835433830990735871e-01 7.92110048395495591755e-01 2.76137749836121992875e-01 7.97317564502553088879e-01 3.28741644624465312319e-01 7.47442243743867473782e-01 4.40180881421990133351e-01 6.59033730436891729276e-01 5.40459632899654263127e-01 6.03355933140368394518e-01 5.64051616819993051344e-01 6.17809653315758433578e-01 4.97687842555246562348e-01 6.96659062016578900511e-01 3.80022596889400099407e-01 7.83007061515822555542e-01 2.80273438618536541167e-01 8.20010259490056681031e-01 2.32391288303862741937e-01 7.87423654563661812311e-01 2.28201862288638479548e-01 7.35501380777630497931e-01 2.32028071814472214296e-01 7.28997483576375615577e-01 2.29385694538424084188e-01 7.74880951255941807787e-01 2.26004138904880913508e-01 8.42157473655642530019e-01 2.35467176215469059519e-01 8.51906503393153657910e-01
16 1.00000000000000000000e+00 1.85554840229251477579e-01 7.47086223676652116943e-01 1.66240117427350619916e-01 7.62535645691512109501e-01 2.06043853854685155014e-01 7.57099066564325129391e-01 2.55683021962335277344e-01 7.50702850726212234100e-01 2.85145007407223594065e-01 7.47763042537200828264e-01 2.87482286885678783861e-01 7.50139963916288010637e-01 2.61107702430591281928e-01 7.51649254961279100762e-01 2.21074849800805744993e-01 7.39522031204304708396e-01 1.98727005292067521180e-01 6.86828541048860263807e-01 2.31151312871480968392e-01 5.79029819176732019059e-01 3.13557393539895257195e-01 4.71906028218478490466e-01 3.81362651060235091638e-01 4.35984629410318846876e-01 3.86738836247494055520e-01 4.97997224699727236708e-01 3.23120036812657274172e-01 6.09061119199328149243e-01 2.51746621229297584676e-01 7.04381829085756305808e-01 2.27790098463935219986e-01 7.50516636729734232247e-01 2.36719696663087036947e-01 7.64371557746727270377e-01 2.57091830923990072311e-01 7.66951208605030410048e-01 3.08607197137813149546e-01 7.37104528895433097624e-01 3.95796352212953006511e-01 6.75549949533619353836e-01 4.94250523911076156125e-01 6.18446681306696777192e-01 5.51022978942559915616e-01 6.08449675445787541150e-01 5.30899673158617413371e-01 6.58035871335148181416e-01 4.43533415181961099272e-01 7.39782837397574777327e-01 3.35374168692760987742e-01 7.99015357814040760864e-01 2.61560162093645021120e-01 8.02579762992834733204e-01 2.36628210037977571023e-01 7.61274005798710518000e-01 2.35964637348849926024e-01 7.23390720079347682159e-01 2.37757444339204787598e-01 7.28405755204172056239e-01 2.33648874607877227172e-01 7.78219146761589097849e-01 2.28030188172544251435e-01 8.43198648920937654516e-01 2.37957970803911705859e-01 8.45651425571654624669e-01
17 1.00000000000000000000e+00 1.87105083534420207902e-01 7.46306781804015884063e-01 1.66702198529180167785e-01 7.62519487583685817711e-01 2.05666220665543270085e-01 7.56483686634955465600e-01 2.54229268443285638668e-01 7.49755380076569721837e-01 2.85634612078085492470e-01 7.46808238898530096783e-01 2.89437229996000688903e-01 7.47456163908337356538e-01 2.66352116987446152496e-01 7.49085571562312257932e-01 2.29053017955821530682e-01 7.41771152176758929997e-01 2.04429143923799988558e-01 7.04212467548209986035e-01 2.22840329107547863163e-01 6.21215187992759765301e-01 2.89837603724840520147e-01 5.17580868634060276001e-01 3.66700065440388134341e-01 4.50630550674652463616e-01 4.05764739047327349653e-01 4.60498847244196540807e-01 3.89210127255793236767e-01 5.29844110131442502798e-01 3.43032475253008339866e-01 6.16040236439120869605e-01 3.19533341101581214172e-01 6.68153481501376322882e-01 3.23797516714232624935e-01 6.83866930637411774008e-01 3.63781079381701455411e-01 6.70153362249452211330e-01 4.49173463806348371996e-01 6.24099377632061469434e-01 5.19822330070485061349e-01 5.94843318530048681403e-01 5.48839928060505855001e-01 6.11551794465864828609e-01 5.11156100860053586032e-01 6.81223806929255104592e-01 4.14074628932565302897e-01 7.59700805284048263921e-01 3.15260657776379127348e-01 7.96859745274959507810e-01 2.61931941032859161300e-01 7.85355758574071582956e-01 2.47392878578032188175e-01 7.48799596937029021682e-01 2.47521765488368711283e-01 7.18025305540663127957e-01 2.48408834467171740767e-01 7.15228525369385303989e-01 2.45989645867379119748e-01 7.46051510766353787041e-01 2.41584028778874304599e-01 7.91396650678396706979e-01 2.37561321804978548000e-01 8.34083241678621578608e-01 2.51375569561735678903e-01 8.17198792415518293630e-01
18 1.00000000000000000000e+00 2.04517859929741141478e-01 7.37682264889032990318e-01 1.76193020048968418401e-01 7.56507683781079909302e-01 2.01217035086787177089e-01 7.52602805801481089532e-01 2.42515365189363729659e-01 7.44935315212498894155e-01 2.77431525954083602059e-01 7.41056994188342588181e-01 2.94728494225748927082e-01 7.39684046226914526656e-01 2.91171459801000287460e-01 7.41428660960468666197e-01 2.67093500659490834526e-01 7.45736935561731040245e-01 2.33530003678870473616e-01 7.42134870126021084502e-01 2.07466739684765949514e-01 7.17870738098180027897e-01 2.14495168921926299133e-01 6.45861827522835718618e-01 2.74237083350840182838e-01 5.42170163350570666339e-01 3.59879623225157097011e-01 4.69053725946975752503e-01 4.15774397392107364357e-01 4.57287714722402705014e-01 4.26307008912840457171e-01 4.97171789498724592260e-01 4.23337766563802175845e-01 5.46965653368805204693e-01 4.25920746126981719648e-01 5.77273669925698618144e-01 4.58028453988349959491e-01 5.81303937523359737227e-01 5.09241985911784156293e-01 5.78864964874997833810e-01 5.36812077406385701472e-01 5.93752289579047687340e-01 5.14633451787024021051e-01 6.45365201987300185493e-01 4.45609262207937451006e-01 7.19531892086376467788e-01 3.55886976259728982086e-01 7.78199164174149138340e-01 2.86324517536158951181e-01 7.94292087539080760017e-01 2.54631637057862347806e-01 7.70696157245746471531e-01 2.49336326427727322796e-01 7.34934893852713377882e-01 2.51630220463360310124e-01 7.11530968308397571143e-01 2.52545033447404532190e-01 7.14716542315367964200e-01 2.49531349655305517699e-01 7.46634922423842883887e-01 2.42856441421068353081e-01 7.94200563104740853149e-01 2.37219227538415594614e-01 8.33634452025224237381e-01 2.53412271989247595005e-01 8.13401071927158825225e-01
19 1.00000000000000000000e+00 2.06696452740346592325e-01 7.36561431003119548855e-01 1.77368989977060631524e-01 7.56062706693789055024e-01 2.00895245777875902649e-01 7.52281479779995043700e-01 2.40739934869447225196e-01 7.44371017632647791196e-01 2.76095694161954119394e-01 7.39298331940784980709e-01 2.95603210598715027135e-01 7.37749665070166704695e-01 2.95016071506686516912e-01 7.39322201650895904912e-01 2.75457417461408171633e-01 7.43088278233045795851e-01 2.44374063793908330444e-01 7.44787497940451626022e-01 2.15242678615706034551e-01 7.34930878712230506444e-01 2.09060188641189331760e-01 6.96719398800940914462e-01 2.44135345457993396812e-01 6.30804432814027871146e-01 3.10482424433864756530e-01 5.63321816480728321253e-01 3.79260996320658572145e-01 5.18169117205948492888e-01 4.32784733304275637256e-01 5.06551606432257939261e-01 4.71763046731532409428e-01 5.20842853504720482150e-01 4.92871105244086726849e-01 5.41064516099147407857e-01 5.02200011182020067402e-01 5.85553183990891845667e-01 4.68589058383731771329e-01 6.52578325148324367433e-01 4.00569810586082930559e-01 7.29893361719111788410e-01 3.25108074831963966833e-01 7.84911243925791146658e-01 2.71477823236463855494e-01 7.95316053707773806813e-01 2.53098366346434289209e-01 7.72156533950904444552e-01 2.53938452411586079727e-01 7.40331225129938319540e-01 2.59652482916886806485e-01 7.12663522148079153773e-01 2.64160445892215489661e-01 7.01769632179244817749e-01 2.64927226581986252629e-01 7.07341388219241418156e-01 2.62599044600383135784e-01 7.30209128222221504068e-01 2.56395666508117625604e-01 7.65695634860400042854e-01 2.49748941781384597993e-01 7.98929393616537031342e-01 2.47753167309975208532e-01 8.16336920311669933525e-01 2.67994593222259935850e-01 7.84326457446720470834e-01
20 1.00000000000000000000e+00 2.29102474357532115423e-01 7.24948198825530965017e-01 1.93531581717733408565e-01 7.47458382224847617259e-01 2.01936713822025132314e-01 7.48081743287476230719e-01 2.28440876864840408667e-01 7.41216080304389235422e-01 2.60137094683580871735e-01 7.34165182409071248593e-01 2.85338314832335182558e-01 7.31166075876413801282e-01 3.00109937545874783105e-01 7.28967525718126618806e-01 3.00983212841129499360e-01 7.31553045757891040601e-01 2.88354620474975564814e-01 7.35550918843334011754e-01 2.61991734380784824232e-01 7.42550849427216053122e-01 2.33023399117303381400e-01 7.48158728726137201015e-01 2.06516100777555750012e-01 7.39134139667496192772e-01 2.07036471945210853729e-01 7.01084975484130068502e-01 2.53384015194999923093e-01 6.44332679491167126251e-01 3.21867105066825531789e-01 5.98542025868675109379e-01 3.82908181792423252254e-01 5.85694215425790365437e-01 4.12289538734710137025e-01 6.00773647565144175431e-01 4.11505759912775159748e-01 6.44808779210354177103e-01 3.80218142891501187375e-01 7.06309409320432957102e-01 3.29769978277093644969e-01 7.61842584626880925391e-01 2.84154077298897189685e-01 7.90804601198659695704e-01 2.58205433487752378241e-01 7.87045638985772955110e-01 2.53124755237216614301e-01 7.60856126750206418485e-01 2.57471759082026296905e-01 7.30510758476500932090e-01 2.63002821578202872210e-01 7.07472931089265566484e-01 2.66264094120791161568e-01 6.99426124646353009062e-01 2.66436046723567021566e-01 7.07800699279632850036e-01 2.63646892898706353137e-01 7.31655203568884582310e-01 2.57244763213903937515e-01 7.66193209140956343894e-01 2.49650141795991431515e-01 7.99572959994727328059e-01 2.47793561341948770371e-01 8.15415616805884035934e-01 2.68945244694509977279e-01 7.82522095297752406928e-01
21 1.00000000000000000000e+00 2.30720919836623516996e-01 7.24094355642538434203e-01 1.94821743688913529002e-01 7.46818153565229292390e-01 2.02316998009090670552e-01 7.47562564904988957615e-01 2.28123888925724965793e-01 7.40768042831486450694e-01 2.58734155449685920836e-01 7.33729059155460272557e-01 2.84544231217489118624e-01 7.29397516695405645493e-01 3.00244855368024976539e-01 7.27639894726565761296e-01 3.03141470079501373913e-01 7.28730633898576396490e-01 2.93599874489236301045e-01 7.32029941395834438111e-01 2.72546077755706439572e-01 7.38555401830844449051e-01 2.45121996028023730885e-01 7.45227817315738061410e-01 2.19059300238210657996e-01 7.46021305159602299284e-01 2.09111723146529482342e-01 7.33871539806573713882e-01 2.26202508838154042747e-01 7.10545825291444277383e-01 2.62310722132408302709e-01 6.91413884034851822236e-01 2.98452972015020967511e-01 6.93831434418050396751e-01 3.11276666876321050914e-01 7.26769075533206465600e-01 2.94628907697388087161e-01 7.72811917957779037636e-01 2.63665572525841496176e-01 7.98382855412253844563e-01 2.48607902417574938569e-01 7.85926672357239786137e-01 2.53644491936920790653e-01 7.59687918330760325603e-01 2.61953298427885616917e-01 7.30069678263932875240e-01 2.67218765537788505160e-01 7.09756367422662237665e-01 2.73631117518701727498e-01 6.96474010903744944478e-01 2.74941193488773105713e-01 6.96823122880455447792e-01 2.74709470121613230642e-01 7.06542898035556476977e-01 2.72638402061136098098e-01 7.25825061742774169105e-01 2.66338149298360138406e-01 7.50086267513454973965e-01 2.59598366333965324682e-01 7.77394105447507643980e-01 2.56382848273588981325e-01 7.92120676183346694721e-01 2.59643233305789311594e-01 7.93911708409857475033e-01 2.82838705552808600263e-01 7.56409764339584511639e-01
22 1.00000000000000000000e+00 2.83164993432091949277e-01 6.94905530150544459289e-01 2.46375938238408698222e-01 7.17693676133882907386e-01 2.32283377400125057299e-01 7.29192573359288220836e-01 2.30847950544349145297e-01 7.30773922672074416340e-01 2.36453622017954029344e-01 7.26779849281409595640e-01 2.49221909490417559141e-01 7.25116953476842573956e-01 2.62267060808341168077e-01 7.18530423443318522203e-01 2.78797427456805302359e-01 7.13797885098801265791e-01 2.94869421704137879559e-01 7.08568208987491954254e-01 3.09760605085075191312e-01 7.06895150183585729842e-01 3.11100223845456602678e-01 7.08532546788911754554e-01 3.11905619730221961294e-01 7.15721779458897477966e-01 3.01056613082282320537e-01 7.27618734005170075818e-01 2.78669357591481037240e-01 7.42651016304118893885e-01 2.48324415923764141301e-01 7.59150212367438070871e-01 2.28546249286309871573e-01 7.68898602234904804398e-01 2.26105863232199444379e-01 7.71188611591010708679e-01 2.32538000494983021493e-01 7.72714987640607309238e-01 2.42083973933033852477e-01 7.64140047380725495607e-01 2.56458398877094873036e-01 7.44148964915168242840e-01 2.68064762912549714446e-01 7.22486342629375721813e-01 2.76751835346446761754e-01 7.04408200238517911984e-01 2.80769359399979823166e-01 6.93589449714114403278e-01 2.83248535733592599062e-01 6.90395233007808917236e-01 2.82822827433082624182e-01 6.96287831787490318902e-01 2.80527432967822509813e-01 7.09595080592871907399e-01 2.75929575911150082312e-01 7.30037752491935143517e-01 2.68927447948220876839e-01 7.53843016342074512259e-01 2.61671252011252686298e-01 7.76729875560865257178e-01 2.57635216265403088620e-01 7.90926585718185193308e-01 2.61951040936342582910e-01 7.88843579176113696150e-01 2.85894456277347108752e-01 7.50812611948401764650e-01
23 1.00000000000000000000e+00 2.88840593741560236474e-01 6.91637275144765140134e-01 2.52520300405323916415e-01 7.14531961346398403201e-01 2.38776613459685399521e-01 7.25355529568580070787e-01 2.34361011167666888344e-01 7.29007668503432015861e-01 2.36830967577969259130e-01 7.27612051899062195481e-01 2.45449862354217979155e-01 7.23494323124886373755e-01 2.56981787448214926695e-01 7.16395306018558719607e-01 2.71012639486434558922e-01 7.08414282815405860205e-01 2.86020671710851437375e-01 6.99957419491570198566e-01 3.01396416910072406647e-01 6.94420798576366515853e-01 3.10527060051523751127e-01 6.87575888611215102486e-01 3.20392882340992501966e-01 6.82981778036826470135e-01 3.24613518110572707442e-01 6.84486528125678894696e-01 3.21122220645157940844e-01 6.84612710296602866578e-01 3.17621357062327525078e-01 6.77864393095453876548e-01 3.18018123627585358459e-01 6.76336826574917449051e-01 3.14892839460726936540e-01 6.61997466492068697974e-01 3.26221714142470420317e-01 6.64218945097616697559e-01 3.25242637670237588754e-01 6.64500007931961511609e-01 3.25697850602318483837e-01 6.75572547037297965744e-01 3.20490508896456860466e-01 6.85267102775263370340e-01 3.12590562066429711319e-01 6.96149631868488105724e-01 3.06432169992023273331e-01 7.12079402335284772363e-01 2.98444775807202078433e-01 7.28813658861814150924e-01 2.87831842213577604461e-01 7.42280062297295706308e-01 2.80904554274554130178e-01 7.52785926625022749903e-01 2.76369016780215859264e-01 7.60270077535359689591e-01 2.76211054723935311994e-01 7.57639640445008866187e-01 2.75631776467620936977e-01 7.55303614740411299877e-01 2.88437871148819247047e-01 7.41095289155616177013e-01 2.97845003836203103820e-01 7.27323565741454292066e-01 3.18557788042368283943e-01 6.93730327604991203749e-01
24 1.00000000000000000000e+00 3.16213436211027043576e-01 6.75433027884675962760e-01 2.85556211902910361822e-01 6.93707301699426515107e-01 2.71354798232356253518e-01 7.05419269049220809542e-01 2.61373847068220088730e-01 7.11973162125822844892e-01 2.56192875111378670638e-01 7.18185437843111618150e-01 2.51983102945532499994e-01 7.18442157965604510927e-01 2.52000893959817562351e-01 7.18925725262046677599e-01 2.52827586411647653453e-01 7.16006970752133486968e-01 2.59059737642393039803e-01 7.10892953281346606786e-01 2.68834121612340049001e-01 7.02097171569106781597e-01 2.81880828536324123945e-01 6.91144972074705266074e-01 2.96252256947107273088e-01 6.81071921685902692545e-01 3.13041163391101384672e-01 6.70459537419684448167e-01 3.27525422483152361952e-01 6.62318625303917718483e-01 3.38737984222823917957e-01 6.57960165196785240482e-01 3.44144746814385615874e-01 6.55107148365841940318e-01 3.45593655573442903872e-01 6.51309789468959787762e-01 3.47653571518146131680e-01 6.59613556320419180956e-01 3.40586680692567922435e-01 6.66395477163743588100e-01 3.34144858134369948655e-01 6.77292856912323881780e-01 3.25575865520466523062e-01 6.89309895778977832492e-01 3.16314203206489175102e-01 7.03146652848194220198e-01 3.05904676920560225639e-01 7.17831982569234083869e-01 2.96852244971141043806e-01 7.32277702366365246256e-01 2.87122809471980766638e-01 7.43722129139498755457e-01 2.80745797731788315765e-01 7.52242638873158897539e-01 2.76618575978455905062e-01 7.57140092250586649314e-01 2.76341638607003781125e-01 7.56010815984859418926e-01 2.78578199235929357958e-01 7.51185511573905673188e-01 2.86824573227588974778e-01 7.41110056758871982296e-01 2.98748322845190705799e-01 7.25838956984577676756e-01 3.19214048171715669699e-01 6.92627602227549599156e-01
25 1.00000000000000000000e+00 3.16779290275824410017e-01 6.75120750094337140901e-01 2.86306292702580011955e-01 6.93380462454378232451e-01 2.72350155614707545304e-01 7.04675089981133262462e-01 2.62860025823466680883e-01 7.12183518730143516606e-01 2.56855730852953489940e-01 7.16852443560941132716e-01 2.53090864251357072767e-01 7.18792347072492288085e-01 2.52690388830113077390e-01 7.18626823392865099471e-01 2.54786513357148580727e-01 7.15978139867956109299e-01 2.60099776188262632459e-01 7.11010041894234667836e-01 2.68281056849888954741e-01 7.03841590075755085820e-01 2.78869084357365515370e-01 6.94918338628363496667e-01 2.91818865940642990786e-01 6.84773024796940132930e-01 3.06265987217448631963e-01 6.74698416074686502242e-01 3.19953684284021377948e-01 6.66403984142936667290e-01 3.31113536673055763870e-01 6.60926148916168632041e-01 3.38154848945064867571e-01 6.58313341744482749540e-01 3.41090476061900182980e-01 6.59974711930728985543e-01 3.40480216871785645871e-01 6.68778626138493703657e-01 3.34139552428533270767e-01 6.81051284614866525580e-01 3.25073041164323950358e-01 6.95132289183237883634e-01 3.14294908961313346207e-01 7.08612289076185231096e-01 3.04535037103192629537e-01 7.21195556979410401510e-01 2.95991710461741441840e-01 7.31032230083277667632e-01 2.89575071340883560822e-01 7.39558200358520267947e-01 2.84744753332765776488e-01 7.44730027322364818154e-01 2.82229512172354590760e-01 7.46180996117482675523e-01 2.81583255483315919587e-01 7.46394715691859111928e-01 2.83427519427712604205e-01 7.43630911673188732536e-01 2.88211958124020783956e-01 7.36613298057350873727e-01 2.96517576841686614220e-01 7.26338391766804369887e-01 3.08240605747550522331e-01 7.12017682404970653209e-01 3.25291995332539551899e-01 6.82561034153799983670e-01
26 1.00000000000000000000e+00 3.32019612606634983987e-01 6.65977744660039006064e-01 3.06238440002552403385e-01 6.80173442393794180916e-01 2.95075050768976443472e-01 6.89357494316171659499e-01 2.86428100766093041152e-01 6.96931316096838782137e-01 2.79358667830218065919e-01 7.02742838357387489268e-01 2.73689852475960171407e-01 7.06748078851651140297e-01 2.69988598007665114853e-01 7.09486261820846175752e-01 2.65717098275373098115e-01 7.12006956379066191509e-01 2.64653668727401925054e-01 7.12153175330401233545e-01 2.65640695960299377809e-01 7.11815326290352157201e-01 2.66013705626224672418e-01 7.11119533138507287084e-01 2.68004961024434329442e-01 7.08388851569028976662e-01 2.71569020828140217372e-01 7.04490440196778422433e-01 2.80009136847088835331e-01 6.98405199748190264053e-01 2.89093477967007905782e-01 6.91342102050469198282e-01 2.99825640925605596543e-01 6.85703210902192883403e-01 3.10408518647495135223e-01 6.83132920731029158468e-01 3.16363018186503475171e-01 6.86322376083568608252e-01 3.16801335049978483038e-01 6.94393406277657332382e-01 3.12554558713771968304e-01 7.04854338670519275922e-01 3.06100281848336597257e-01 7.15599399143382886024e-01 2.98717206980182781173e-01 7.25623015197931375830e-01 2.92379073744957418413e-01 7.33363830758735790738e-01 2.87577560139854360166e-01 7.39342223386481367520e-01 2.84108891313796962930e-01 7.43029147632561448589e-01 2.82548052739602040262e-01 7.44194338647663933273e-01 2.82879382894931863390e-01 7.43176838139080975232e-01 2.85387531359094392958e-01 7.39583610817438841245e-01 2.90296306159000039315e-01 7.33172589355613690820e-01 2.97895816920589195931e-01 7.23799009067644161242e-01 3.08914355213697588987e-01 7.10259862814259457231e-01 3.26483073999318917924e-01 6.80570428624211687385e-01
27 1.00000000000000000000e+00 3.34421435806546041292e-01 6.64538342993650110735e-01 3.09294947472392611765e-01 6.78183142238093061849e-01 2.98643132444754655364e-01 6.87010337690359462748e-01 2.90690746633204710747e-01 6.93801204491816925213e-01 2.84202525342253875529e-01 6.99274321638894247322e-01 2.78858659836039801672e-01 7.03641853447023457591e-01 2.74711863139348644314e-01 7.07004672706616821287e-01 2.71365497055137405713e-01 7.09621602480457358553e-01 2.69336702951433970554e-01 7.11378153428545823012e-01 2.68400193964006716918e-01 7.12663986265076543347e-01 2.68067326909627701159e-01 7.13505987597557345126e-01 2.68658456775772713776e-01 7.14156990531893631768e-01 2.69989476567193409373e-01 7.15025291017284181372e-01 2.72405789497631667384e-01 7.16690167396789035159e-01 2.74567359082215967092e-01 7.19600779314129024300e-01 2.77161899250349508250e-01 7.24271704771064728234e-01 2.78213914630732306321e-01 7.31590078974340252138e-01 2.77645540808373780806e-01 7.41102807743314384581e-01 2.75513315266152025718e-01 7.45790691144613271391e-01 2.77343200508456455555e-01 7.40158538100604279641e-01 2.81603289815347324065e-01 7.33622189536147106814e-01 2.85951698368418660845e-01 7.31980410505786327491e-01 2.88636991195423464607e-01 7.28871296785811195740e-01 2.91349564820940543086e-01 7.26095410081994296903e-01 2.97242795872575293892e-01 7.17872846289382637863e-01 3.01481026988225597751e-01 7.12602557760595889391e-01 3.06931637375342514229e-01 7.06841767918780172764e-01 3.11181092466155995169e-01 7.01002956781943020736e-01 3.17181344095874284683e-01 6.94454768982388337406e-01 3.23163232022533775112e-01 6.87187953513382576709e-01 3.29935314441731297741e-01 6.78758874025050307210e-01 3.40671050224423288544e-01 6.56877292217999730894e-01
28 1.00000000000000000000e+00 3.58965684195536538503e-01 6.49901613454998527963e-01 3.42127453705089956681e-01 6.55948690158153380203e-01 3.37714908104250199905e-01 6.59487469077484789182e-01 3.35297246588432684700e-01 6.61278688869835429287e-01 3.32981734287238873016e-01 6.63465409973533426502e-01 3.29865281015077616011e-01 6.66361568765792333657e-01 3.26875001878474791273e-01 6.68560833452450653525e-01 3.22742002873434519206e-01 6.71945346517576092005e-01 3.18249030034095159447e-01 6.75927463285992402575e-01 3.13971451801173473406e-01 6.79786198648151152035e-01 3.06344889135628406507e-01 6.83795378096296535553e-01 3.00868957927536095909e-01 6.92555860280990809308e-01 2.99195716959938629032e-01 6.94102446358373259550e-01 2.91904734388294118119e-01 7.00538907329055104967e-01 2.79867970416395717148e-01 7.10274082409303564312e-01 2.71807898355618138275e-01 7.18117288775763307207e-01 2.65511178394029490057e-01 7.27275117993996023102e-01 2.64489980946191804989e-01 7.31526170047044232980e-01 2.69699596173506916941e-01 7.30871938524990993891e-01 2.77238240510982447695e-01 7.26967070769010570430e-01 2.84390787659073052129e-01 7.21626841080713066212e-01 2.91280369442825814996e-01 7.16854251694828303876e-01 2.97021461872301550944e-01 7.12040823619547236234e-01 3.01881160650050717198e-01 7.07577107181146414128e-01 3.06913725447064356100e-01 7.02477371383571691510e-01 3.11275863335412961153e-01 6.97870703516074830652e-01 3.15572731627626557049e-01 6.93378866848339714402e-01 3.19721083525583149587e-01 6.88746939753842823961e-01 3.24190997968209937419e-01 6.83849490053182407223e-01 3.28976831405360381488e-01 6.78479756517991194897e-01 3.34796936101131703545e-01 6.71420697042039660296e-01 3.44168959357896209195e-01 6.51079742436358910318e-01
29 1.00000000000000000000e+00 3.60028827968153608552e-01 6.49250248008229502439e-01 3.43481883916234964627e-01 6.55090070249058853413e-01 3.39644501922060970678e-01 6.58013406328575634063e-01 3.37319614332057093886e-01 6.60048561805609113051e-01 3.35277579285111537732e-01 6.61893798206348193958e-01 3.33206207961351863478e-01 6.63741615779890992144e-01 3.30921166802837785070e-01 6.65667162577215698605e-01 3.28363124200324985047e-01 6.67894791601428172712e-01 3.25559841339731870224e-01 6.70431031775911456805e-01 3.22370341321972675441e-01 6.73187560970715415110e-01 3.18748396995686411604e-01 6.76372429482860582084e-01 3.15360641589267298723e-01 6.79974967541252417469e-01 3.11767398669745676720e-01 6.83718206932043437440e-01 3.07536523990236232429e-01 6.88322106044281567527e-01 3.02389954172224306728e-01 6.93808634380524758001e-01 2.99022472586258747373e-01 6.98525845778518061913e-01 2.97532050705687611813e-01 7.01915392187505315924e-01 2.99158939802106782491e-01 7.02779381322774843177e-01 3.04582190280751563538e-01 6.99454390409360748926e-01 3.11304587711863978150e-01 6.93812863879005981005e-01 3.16520793118980625636e-01 6.89061741264805238671e-01 3.21157794874818769415e-01 6.84135823556131561496e-01 3.25039270530504853518e-01 6.80668543274829840328e-01 3.28946666198803139292e-01 6.76015375990489220115e-01 3.33008660152519953002e-01 6.71689792625758785860e-01 3.37368034032182184667e-01 6.67065548916095707455e-01 3.39300531755468814943e-01 6.64123537831239341145e-01 3.39261495739673124561e-01 6.63263507913299910079e-01 3.41170951790555621042e-01 6.61110764004009254791e-01 3.43173523465230834173e-01 6.58906178929665964361e-01 3.45771157215863489398e-01 6.55359400360228550042e-01 3.51251621497404076244e-01 6.39150574146869043801e-01
30 1.00000000000000000000e+00 3.62865148469244780394e-01 6.47648813967647396517e-01 3.47336786379573547734e-01 6.52564169293034179731e-01 3.44477894519252869632e-01 6.54605578830943835023e-01 3.43084581573333269322e-01 6.55856499771306111768e-01 3.42150310261506773735e-01 6.56746890850936404505e-01 3.41390721922134432464e-01 6.57436081950997563972e-01 3.40781519724907777658e-01 6.57959849078167846592e-01 3.39950390068081864658e-01 6.58841030726307952392e-01 3.38992822439969143655e-01 6.59350910022748148975e-01 3.37854785023027681667e-01 6.60157231703857205751e-01 3.37449535202540507051e-01 6.60532931716667826016e-01 3.35653104239998112401e-01 6.61580537540731095092e-01 3.32936553774863641664e-01 6.63813072582444707592e-01 3.30331634207846891460e-01 6.66070755144779536039e-01 3.27413251486831757830e-01 6.69288655374735474979e-01 3.25181919745714143044e-01 6.72122148780777028954e-01 3.23173008091926339258e-01 6.74924259387523983733e-01 3.22264906633574044204e-01 6.77270183649586132724e-01 3.23229513419099334648e-01 6.77827740566487868534e-01 3.25414496007625730911e-01 6.76851664456535107028e-01 3.27764167975173326131e-01 6.75045376910568650786e-01 3.29995797578701288710e-01 6.72857403704424261726e-01 3.32017524202720515358e-01 6.71044683660835139527e-01 3.34219668338785025341e-01 6.68746716275291586129e-01 3.36263577782678790840e-01 6.66705422112929380063e-01 3.38195057517754860132e-01 6.64614376315268318152e-01 3.39720850010470032387e-01 6.62713929703467541366e-01 3.40904960842621562733e-01 6.61224647015754785073e-01 3.42234669734506335992e-01 6.59703455653274373205e-01 3.43852109913258208174e-01 6.57847484401594795322e-01 3.46302891742876539638e-01 6.54513605183364766127e-01 3.51629496172460476178e-01 6.38500238663849972731e-01
31 1.00000000000000000000e+00 3.63139056191227937997e-01 6.47499448393530907531e-01 3.47713943428831051552e-01 6.52320835556734923699e-01 3.44918418238911506091e-01 6.54316983401364904438e-01 3.43640655607559630802e-01 6.55463647973267726776e-01 3.42814415739268574246e-01 6.56254978455363846557e-01 3.42164701930765258187e-01 6.56876055124674840258e-01 3.41583011597462293807e-01 6.57416697316349551983e-01 3.41010073532957591613e-01 6.57929470216521039561e-01 3.40435105391328929336e-01 6.58434482921697483704e-01 3.39862977974391022862e-01 6.58951259122818933101e-01 3.39305260038039790960e-01 6.59416705413965464899e-01 3.38594666804111710245e-01 6.60049597337018512100e-01 3.37847044378457306291e-01 6.60817412017531413682e-01 3.37335961708867093645e-01 6.61517179473707583881e-01 3.37015342891571645367e-01 6.62133017994860018085e-01 3.36988079293183029339e-01 6.62645199755495295513e-01 3.37436999651242575116e-01 6.62818600167340066243e-01 3.38188629789245465140e-01 6.62712393692993506633e-01 3.39159259153341496873e-01 6.62229892709873313450e-01 3.40015115727649863686e-01 6.61578267253314478147e-01 3.40787058112094753959e-01 6.60839470799762573883e-01 3.41610814482799951541e-01 6.59949107242921773064e-01 3.42077133003260536182e-01 6.59043552037776425578e-01 3.42323623565999213270e-01 6.58874266199225511187e-01 3.42829664647011256307e-01 6.58155506666396106219e-01 3.43237011228530453089e-01 6.57622048716646867561e-01 3.43530496864034251558e-01 6.57202920524891265330e-01 3.44121617552612113489e-01 6.56673654796455896765e-01 3.44838760403731958704e-01 6.55929849389765950995e-01 3.45906611104411954027e-01 6.54749446442027260851e-01 3.47821374093178981024e-01 6.52046416295666286800e-01 3.52590850075549577802e-01 6.36687902388567206202e-01
32 1.00000000000000000000e+00 3.63921635454129366316e-01 6.47103137155134455760e-01 3.48787117718297901003e-01 6.51687965830627713437e-01 3.46259100427623756069e-01 6.53467126682505838886e-01 3.45251580301765614855e-01 6.54396932478895521079e-01 3.44717341318927783522e-01 6.54955584292772563515e-01 3.44382435530527275525e-01 6.55321523391394045177e-01 3.44150111371761158185e-01 6.55579391784135379062e-01 3.43979590487680619848e-01 6.55767556268403439823e-01 3.43832742522826917408e-01 6.55918637384326319584e-01 3.43714020879208992376e-01 6.56031970732742664154e-01 3.43635384858152981291e-01 6.56129208141973063739e-01 3.43528217023632065352e-01 6.56190532287949324086e-01 3.43474029440868078300e-01 6.56259666456624479736e-01 3.43356459184131934670e-01 6.56195891867516367668e-01 3.43202541495925550485e-01 6.56277418123435429820e-01 3.43079418315065720613e-01 6.56373588566208643336e-01 3.42972406602492396743e-01 6.56466602828828627025e-01 3.42901732417440319178e-01 6.56728918719811982641e-01 3.42859552543461176821e-01 6.57034008555910986615e-01 3.42885885229768982985e-01 6.57260211472618371964e-01 3.42927005302673615361e-01 6.57386049450883303003e-01 3.43017553413456188771e-01 6.57417272425955157011e-01 3.43133855714961133465e-01 6.57357495770984345818e-01 3.43300195025206533739e-01 6.57223569971334020678e-01 3.43505116860937265155e-01 6.57035407032140805761e-01 3.43774165890263938561e-01 6.56781702153089952390e-01 3.44107585138404836744e-01 6.56460892000333751106e-01 3.44551449875072635098e-01 6.56032853835764706574e-01 3.45186393408016822804e-01 6.55402111773256801364e-01 3.46191150237127209799e-01 6.54300538308922097208e-01 3.48052437006577175538e-01 6.51670078637701433166e-01 3.52732884799799695230e-01 6.36415059821779705018e-01
33 1.00000000000000000000e+00 3.64023177279314769095e-01 6.47051425546241953946e-01 3.48924040650381739326e-01 6.51607149522054562851e-01 3.46429895625800399195e-01 6.53359202799675742313e-01 3.45457965335950412111e-01 6.54259079911132190865e-01 3.44955005312677420726e-01 6.54789916498336066475e-01 3.44654162706979738662e-01 6.55130126976566473651e-01 3.44458432415606585764e-01 6.55360173541149060306e-01 3.44325200904200046104e-01 6.55521087338482910667e-01 3.44233326825409080563e-01 6.55635236388648623418e-01 3.44171397090701713939e-01 6.55716117971702372458e-01 3.44133774874997355742e-01 6.55771323280926798915e-01 3.44116421706504249656e-01 6.55807039795289314910e-01 3.44122541616892874128e-01 6.55826633764132638227e-01 3.44149052174882175148e-01 6.55835067859556364311e-01 3.44189059062486979457e-01 6.55833212418744704308e-01 3.44250687601174776287e-01 6.55819074991379036277e-01 3.44275382685744812949e-01 6.55820039233310447813e-01 3.44266911559249322305e-01 6.55832077616024022859e-01 3.44229766966935246675e-01 6.55836952895683111819e-01 3.44262623140849322034e-01 6.55817973996246417201e-01 3.44279655262722250608e-01 6.55790522567915257213e-01 3.44313310361919866498e-01 6.55754050204074734332e-01 3.44370545462290178484e-01 6.55708558614771064299e-01 3.44448009054994119804e-01 6.55644399570661007282e-01 3.44553770810509696343e-01 6.55556325511966075936e-01 3.44710220912914311331e-01 6.55429580610665696305e-01 3.44930419835396184780e-01 6.55246728418760082668e-01 3.45262416351358125688e-01 6.54956416080210934716e-01 3.45783996126530657200e-01 6.54468005690871268420e-01 3.46677387488217414457e-01 6.53506661747429995479e-01 3.48420043287225700279e-01 6.51025106051583146716e-01 3.52965059178313167454e-01 6.35941072916826777295e-01
34 1.00000000000000000000e+00 3.64127345743261776612e-01 6.47000975848278869762e-01 3.49064323826511424542e-01 6.51528336146180109267e-01 3.46600976652981118686e-01 6.53256074714858248065e-01 3.45656737988234152859e-01 6.54134413020750815626e-01 3.45180537094694539491e-01 6.54644175435746600300e-01 3.44902673402199599906e-01 6.54965614539363416569e-01 3.44727512154463400229e-01 6.55177275301760841941e-01 3.44608882620905165872e-01 6.55323673477071322324e-01 3.44525822919343416295e-01 6.55426690402666101143e-01 3.44466706290589952388e-01 6.55500622474269656337e-01 3.44424207734557452643e-01 6.55553291418213501807e-01 3.44392937766208107053e-01 6.55592228699812151760e-01 3.44370907499086664760e-01 6.55619569885245834229e-01 3.44355935254472056428e-01 6.55637787773133862146e-01 3.44347110832140479442e-01 6.55648099552659791023e-01 3.44344201901107094255e-01 6.55652194863450610285e-01 3.44345350657250137694e-01 6.55650313433504550176e-01 3.44354059335876983017e-01 6.55641070664018887904e-01 3.44369379641075390452e-01 6.55627442200744758871e-01 3.44388636646827728249e-01 6.55611469188734918845e-01 3.44415670643368365678e-01 6.55591604364622493328e-01 3.44451685222050940638e-01 6.55565718677017517102e-01 3.44501437593281389926e-01 6.55529409090331416365e-01 3.44571646571573408924e-01 6.55476841020112499514e-01 3.44671516529553301211e-01 6.55400032422945422184e-01 3.44815446313775975096e-01 6.55285813004449324559e-01 3.45026869658431545318e-01 6.55112211759050322435e-01 3.45347283532551507790e-01 6.54835480880940346005e-01 3.45857285270279479761e-01 6.54358438652613449982e-01 3.46735478932195861912e-01 6.53413880805964297771e-01 3.48464585436746743241e-01 6.50948905816071343722e-01 3.52994124894116467761e-01 6.35883067905857579660e-01
35 1.00000000000000000000e+00 3.64145527531598789395e-01 6.46991897320991382614e-01 3.49087751289388958931e-01 6.51514626155601739299e-01 3.46628741085153013746e-01 6.53238633253268363710e-01 3.45688792144812184759e-01 6.54112735828160207774e-01 3.45214755277383822385e-01 6.54619884697746345914e-01 3.44939464308501753109e-01 6.54938484772912166143e-01 3.44765697957908068272e-01 6.55148982888715258888e-01 3.44649703705380783259e-01 6.55293057996080396954e-01 3.44569215412831808543e-01 6.55393951205744285105e-01 3.44512005594680759124e-01 6.55465541016709396516e-01 3.44470700837662680005e-01 6.55516604561912297200e-01 3.44440584014154504988e-01 6.55552973982624909155e-01 3.44418791562184356536e-01 6.55578384246378709221e-01 3.44403536787561193044e-01 6.55595451580593735486e-01 3.44393775327091478111e-01 6.55605877748704046759e-01 3.44388923637616584106e-01 6.55610727164083084695e-01 3.44388811963126817428e-01 6.55610681386167626350e-01 3.44393728379949581875e-01 6.55605870255206779618e-01 3.44404314007194678471e-01 6.55596092731148827326e-01 3.44421592557674183244e-01 6.55581004126964073109e-01 3.44447024463289119822e-01 6.55559411061916730290e-01 3.44483428452823758903e-01 6.55529388075750785170e-01 3.44534575110103824525e-01 6.55488131184288946862e-01 3.44606071730129637221e-01 6.55430963702860691633e-01 3.44706785287677563989e-01 6.55350622994601783589e-01 3.44850761449294052063e-01 6.55234498951488331109e-01 3.45061060111491346714e-01 6.55061041523776088624e-01 3.45379694489012734060e-01 6.54785886397337146825e-01 3.45886751217863719354e-01 6.54312096031463230617e-01 3.46761149480285246760e-01 6.53371910133838662560e-01 3.48485142522723612135e-01 6.50912794177508691185e-01 3.53007885713865710020e-01 6.35855049435097408050e-01
36 1.00000000000000000000e+00 3.64152724779649661357e-01 6.46988233253010025514e-01 3.49096772851413605920e-01 6.51509269982205707628e-01 3.46638844147124980388e-01 6.53232098878507638773e-01 3.45699619283841130812e-01 6.54105307684687553582e-01 3.45226049918085586832e-01 6.54611828571483367334e-01 3.44951006715079389053e-01 6.54930042305100768019e-01 3.44777270832651083765e-01 6.55140275689326645470e-01 3.44661040627874615261e-01 6.55284211627150225965e-01 3.44580322423482132699e-01 6.55384940927379977538e-01 3.44522724570286154044e-01 6.55456566534123985512e-01 3.44480956732456211622e-01 6.55507755358824883984e-01 3.44450480381268964170e-01 6.55544204607517166927e-01 3.44428449205761433305e-01 6.55569685022682202558e-01 3.44413031098845023870e-01 6.55586751343319895646e-01 3.44403118029013188828e-01 6.55597115416078901617e-01 3.44398133680366091980e-01 6.55601882038127081742e-01 3.44397903790593040707e-01 6.55601667450017577821e-01 3.44402670643658315175e-01 6.55596686229117264766e-01 3.44413060279747995640e-01 6.55586772688267149789e-01 3.44430158348416448622e-01 6.55571371587036155759e-01 3.44455642895787950142e-01 6.55549381741234671317e-01 3.44492056475938057680e-01 6.55518974884228167177e-01 3.44543210843676617205e-01 6.55477326528115189497e-01 3.44614763671026391734e-01 6.55419885340646990457e-01 3.44715497273895388197e-01 6.55339303713622700620e-01 3.44859356517058068814e-01 6.55223311390830343015e-01 3.45069577692923956658e-01 6.55049655543162412386e-01 3.45387728260832305160e-01 6.54774689614570193363e-01 3.45894234817882284538e-01 6.54301143649461569574e-01 3.46767362291818870279e-01 6.53362059750207224695e-01 3.48490190698140245296e-01 6.50904199340540778884e-01 3.53011381168977567135e-01 6.35848060361681399755e-01
