# tag norm n_hub[0] n_hub[1] n_hub[2] n_hub[3] n_hub[4] n_hub[5] n_hub[6] n_hub[7] n_hub[8] n_hub[9] n_hub[10] n_hub[11] n_hub[12] n_hub[13] n_hub[14] n_hub[15] n_hub[16] n_hub[17] n_hub[18] n_hub[19] n_hub[20] n_hub[21] n_hub[22] n_hub[23] n_hub[24] n_hub[25] n_hub[26] n_hub[27] n_hub[28] n_hub[29] n_hub[30] n_hub[31]
1 1.00000000000000000000e+00 1.55077975653403887790e+00 1.26796033111475647814e+00 1.40943741220479434872e+00 1.53164462185152072671e+00 1.20093804906771950414e+00 1.25138548554449768879e+00 1.00599198649917909165e+00 1.18194904371913178664e+00 9.47415041577004846118e-01 1.26403320068414215527e+00 1.16905167992470793159e+00 1.15084731168167775373e+00 1.24356613519553360625e+00 7.08323677500672821417e-01 1.15005911249609438229e+00 8.61366604933929802534e-01 1.22762308393449970367e+00 1.14024350335413426905e+00 9.41178547851433844329e-01 1.20822466400151906640e+00 1.01234755988257263404e+00 6.71762569489649963295e-01 8.23390355261202078196e-01 8.60365247692438273042e-01 8.67465816912031506547e-01 4.88821529358923423381e-01 9.14139574161785151141e-01 8.14644706773626658958e-01 1.31828724559066329247e-01 9.99053462267901259963e-01 5.42021806612084672966e-03 9.98740985903812994451e-01
2 1.00000000000000000000e+00 9.99552340681672091272e-01 1.20962760351247977653e+00 7.72646519849456980822e-01 1.15203190611381933728e+00 8.23448948636818833791e-01 1.51435550743009184060e+00 7.09750109521440020188e-01 1.82034534245155521504e+00 1.00526234450288920463e+00 1.99116212001543346766e+00 1.00539141196772896514e+00 1.99336040535803249441e+00 1.00300744974127775677e+00 1.01035561325454148474e+00 9.73564511440930591135e-01 1.10966771174652123477e+00 1.97703611731659900652e-01 1.07512015249353343194e+00 8.47942943466994392132e-01 1.54545977421014368858e+00 8.83751279879879225732e-01 1.02020542019944526757e+00 9.58313001078910153829e-01 1.29335953479122189869e+00 9.80214043536776546972e-01 1.08450922634776691922e+00 2.22223606314025726172e-02 9.95185378658395403129e-01 5.16700987246872679021e-03 9.94851105149212711076e-01 4.93414918644691051497e-03 9.97531162540923554971e-01
3 1.00000000000000000000e+00 9.37290036799933501399e-01 1.29791117169234593298e+00 7.54816305028112477515e-01 1.32914518997455699534e+00 7.14643239479929803792e-01 1.50798815945152342444e+00 7.31433390871584321324e-01 1.72925822180824839691e+00 1.00078509832820250480e+00 1.99483526453677928458e+00 1.00479691810231108740e+00 1.99019408987230539410e+00 1.00288763810712078239e+00 1.18652183814214362556e+00 7.13519674565371797570e-01 1.15027158583294686345e+00 8.34934579650272401530e-01 1.19565769035445645940e+00 7.25172795378699053259e-01 1.19046803746289753256e+00 8.57898948918767834115e-01 1.05812209026052239658e+00 7.28955829476855443616e-01 1.02555294651690465102e+00 5.93791249545130517262e-01 1.07196707526805368182e+00 5.42776738881798337388e-01 1.06342013667261947596e+00 6.45380641129432858216e-02 9.97512429250367205213e-01 5.39041959695632944688e-03 9.97543146059410634763e-01
4 1.00000000000000000000e+00 9.23447378221656789421e-01 1.35410907608889252707e+00 7.52572519322876165582e-01 1.46880430516625426485e+00 6.89885668811457297700e-01 1.58028988313886165074e+00 7.11005967515184300609e-01 1.56012582666064947290e+00 9.74205905867079113847e-01 1.98339976784097493656e+00 1.00330203171459686473e+00 1.98491524608374114713e+00 9.91557851999309125546e-01 1.18584054888091916524e+00 7.14641479308216198696e-01 1.21214170152247491252e+00 7.50379761872700723480e-01 1.19170367075255900779e+00 7.41580385433237232462e-01 1.21250279834903085252e+00 8.06548728062340680722e-01 1.10067967163465540992e+00 7.53887116818602209811e-01 1.01307953623080515548e+00 3.49607595165916662516e-01 1.10151899674033426635e+00 4.49116342461488182725e-01 1.18526876174376671891e+00 2.15167157447866269626e-01 1.02267967647446678114e+00 1.79992399393407408181e-02 9.98035402729995246851e-01
5 1.00000000000000000000e+00 9.06538736378699638863e-01 1.38466271614088154429e+00 7.66579812920302750001e-01 1.53242161116340502858e+00 7.01575805670313301654e-01 1.59968096597791586966e+00 7.79548010714772199314e-01 1.54657799709464027771e+00 8.86029854052148624355e-01 1.82501100809321292751e+00 8.47475636130612164365e-01 1.66401798130940892229e+00 9.37739066842818935754e-01 1.28738841721646046778e+00 6.82300942381697805850e-01 1.26594783010833178416e+00 6.37250932454119456416e-01 1.11423856422079703421e+00 7.68164293164557809845e-01 1.28158146082183144188e+00 7.77245928487692250286e-01 1.20247662904737073752e+00 7.08776738581855414445e-01 1.05558395271068716781e+00 6.76784318922370675686e-01 1.13944890006995813714e+00 4.13160149186458491855e-01 1.11631052478235814895e+00 2.44831421709812840914e-01 1.11335186317501766418e+00 1.30095592020469247307e-01 1.00720233844903850340e+00
6 1.00000000000000000000e+00 9.00385517570239879426e-01 1.40505079107670693972e+00 7.63670060463637390136e-01 1.55377950578051127195e+00 7.05840934257967012044e-01 1.58150870642076046835e+00 7.76406885802728430335e-01 1.49722187592832978176e+00 8.65250313924647018737e-01 1.67102137661130401014e+00 7.21343725866624208010e-01 1.55514877260132355907e+00 8.60983719071097497455e-01 1.30179977491298259906e+00 7.64959202266155435801e-01 1.24258539441370197132e+00 7.08301027750290690399e-01 1.13982546499073400526e+00 8.25898935549515211818e-01 1.29501433974334001498e+00 8.27905993355601665940e-01 1.21426342875141979327e+00 6.79441314998420531346e-01 1.13077959163377395058e+00 3.68740169829164798898e-01 1.27698766714128697508e+00 3.59715539977957243778e-01 1.04203715251686368504e+00 2.40371678888386230977e-01 1.24927933918842248850e+00 4.28609749454921806766e-01 1.04587204926127119720e+00
7 1.00000000000000000000e+00 8.98525990547330510871e-01 1.40997643786304593938e+00 7.70191908162826011086e-01 1.56599488688574939310e+00 7.14875520387933671707e-01 1.57081891237055049082e+00 7.87445405446070556543e-01 1.47696947474174078430e+00 8.44305339106226182544e-01 1.59741953821388515955e+00 7.11651187213984459667e-01 1.57616682028903554169e+00 7.51767675950716807165e-01 1.38296113124325370514e+00 7.27032155194951901223e-01 1.28315846660109467159e+00 7.10552606479522341765e-01 1.24471630196182303507e+00 8.16471938193534918504e-01 1.29242789267309809986e+00 8.22053317164277208562e-01 1.19440652763906740574e+00 6.46714123306929455914e-01 1.15951551851719791841e+00 3.52597785517952344581e-01 1.26566220966405973414e+00 3.87121619769948133172e-01 1.06581718611192810542e+00 2.97623160829189992160e-01 1.24967672475414537381e+00 3.83555991651862604463e-01 1.04182624554719494014e+00
8 1.00000000000000000000e+00 8.91120593385640313855e-01 1.41168381871996717614e+00 7.72512026236077065100e-01 1.55605117555447858280e+00 7.19798424407690595750e-01 1.55727625982357165135e+00 7.75054680931326900328e-01 1.47042978484629704994e+00 8.29490073125504601137e-01 1.51244770460940780588e+00 7.24507040031112214962e-01 1.56302071035280776279e+00 7.02622558762551419065e-01 1.46198124154385489248e+00 7.08470182511178103724e-01 1.35050999131474336323e+00 7.24014085792127115582e-01 1.30662336717549987242e+00 8.13188574705412725585e-01 1.29408102821221060452e+00 8.04648043459376016706e-01 1.17495294124477589470e+00 6.07561084625875547083e-01 1.18508754215033995649e+00 3.53180083063907357399e-01 1.25213284124512091999e+00 4.11005576554892837482e-01 1.09043496852487442617e+00 3.20263960026357819011e-01 1.24504792916818907145e+00 3.70123602770823401098e-01 1.04067810512399372413e+00
9 1.00000000000000000000e+00 8.88647030687855110642e-01 1.40677172034884456764e+00 7.74695124091857589832e-01 1.54947569190519596205e+00 7.19374103341437032277e-01 1.55635720587984116570e+00 7.65710280035495349793e-01 1.46092411301782743038e+00 8.17415433150325942968e-01 1.45510900441464685606e+00 7.41808318319721826661e-01 1.51866710650555525319e+00 6.90361338559343784560e-01 1.50010213777711354233e+00 6.93259588207387533743e-01 1.42234318830739447925e+00 7.32165358081163231141e-01 1.35948093954277404727e+00 8.13303715468436161373e-01 1.28494659063109062380e+00 7.79242107346504231380e-01 1.16023021234367740284e+00 5.58546476664274482715e-01 1.21049201577196097190e+00 3.50360905964913149635e-01 1.23528413369999001681e+00 4.38142457220315917343e-01 1.11894482938661377069e+00 3.35411450118837495271e-01 1.24305448289293107855e+00 3.76719283261234882954e-01 1.04265365705554091669e+00
10 1.00000000000000000000e+00 8.79860327877817538500e-01 1.39105317033697062357e+00 7.78505134947884980257e-01 1.52622797126645215471e+00 7.21397899084178506612e-01 1.54649521158300795598e+00 7.48028209541320543430e-01 1.47493408284264582164e+00 8.07194703040930106042e-01 1.44059106567945671706e+00 7.63163974979016668243e-01 1.49809810573779178533e+00 7.01231034071100323146e-01 1.51821687405349270428e+00 7.00174619387238017509e-01 1.45410086670728455616e+00 7.48387129708805498574e-01 1.37207014328590370944e+00 8.12252840332860381878e-01 1.26748545634391307502e+00 7.45754068642746514861e-01 1.15832909028442276878e+00 5.17128536576132669111e-01 1.22846821853349874587e+00 3.63651313987500779401e-01 1.21748100113899271335e+00 4.59719010212396195225e-01 1.13934293255730589856e+00 3.38687766052942484940e-01 1.24431739306846855797e+00 3.91537885219977399576e-01 1.04611396291746916454e+00
11 1.00000000000000000000e+00 8.77301804688444764047e-01 1.38814951019156485046e+00 7.78542883622382664299e-01 1.51798564759561371851e+00 7.20253741738249075865e-01 1.54745810404953609840e+00 7.42613365502838629340e-01 1.47460224625524882747e+00 7.95604041243271775663e-01 1.43188178394864129572e+00 7.70193377172574189515e-01 1.47994837257310818401e+00 7.12945197839504385406e-01 1.51251916323936419495e+00 7.09010255016078394519e-01 1.46217041828306881790e+00 7.59982093211782672171e-01 1.36753626270267392151e+00 8.02803137857963311497e-01 1.23363897841487091256e+00 6.89721764769661405126e-01 1.16940924631120135579e+00 4.73887289683816326225e-01 1.24662946072208180581e+00 4.06585499167909036888e-01 1.18903847961888176066e+00 4.72748133008651316711e-01 1.18216696136256427252e+00 3.46999098402888228598e-01 1.24053352564044638839e+00 4.39549502520122148397e-01 1.05759065364514870389e+00
12 1.00000000000000000000e+00 8.39701036733562222736e-01 1.33053299823659143541e+00 7.83803703897728909489e-01 1.42282303677868582348e+00 7.36347346190708518243e-01 1.48907794407678450987e+00 7.04267361825688720245e-01 1.50050674642502701595e+00 7.20803945157200254279e-01 1.44369474007427633921e+00 7.59130369213923406058e-01 1.36993306966171379813e+00 7.73904827654025906369e-01 1.33399785004175952530e+00 7.48467763306950972790e-01 1.31996319458078525955e+00 7.21817087697686154968e-01 1.29071034185826727381e+00 7.22926576574243862083e-01 1.21452102305110365421e+00 7.54538643293123589828e-01 1.21184551358736780635e+00 7.88550803767636088182e-01 1.23601534973449167509e+00 6.92190947091208208519e-01 1.16848147150206038702e+00 5.13436574024589975629e-01 1.22944783495302512044e+00 3.64560466084190348823e-01 1.24184391897226475976e+00 4.99091236385720726787e-01 1.07306627756788519612e+00
13 1.00000000000000000000e+00 8.25672433788724791093e-01 1.32195151807880884043e+00 7.82060375645917793541e-01 1.37934789621826880968e+00 7.40563099054175055791e-01 1.43551483709967597768e+00 7.06784349635463993167e-01 1.46630018463260825001e+00 6.94838703431880366779e-01 1.45774857462749607429e+00 7.05115495567357197793e-01 1.41751732645998718141e+00 7.15986481799311014207e-01 1.36571006814474293911e+00 7.20187137895905493679e-01 1.31755091679997660137e+00 7.11256186707840853956e-01 1.28553712596901315024e+00 7.30632449768211511554e-01 1.27994189225054344483e+00 7.97455880509946202217e-01 1.26465603556953221087e+00 7.96861033208139946105e-01 1.19384811158245440765e+00 6.32109371978968326289e-01 1.19927159072450928434e+00 4.66363493532909789696e-01 1.27158865679533583659e+00 4.19468644485158359547e-01 1.22723586933547235134e+00 5.71233044874178474970e-01 1.09969121382734780212e+00
14 1.00000000000000000000e+00 7.82982236818420940239e-01 1.29609366440981332858e+00 7.58378023660505329318e-01 1.31826715599349419961e+00 7.58554198418753489186e-01 1.33983268611588512975e+00 7.38890866579193783537e-01 1.36260163098591435826e+00 7.17485728868672789638e-01 1.38875037645055510183e+00 6.91771021849033496132e-01 1.41588078894177038514e+00 6.81054302321133397946e-01 1.43192322232396018755e+00 6.76689185673176707425e-01 1.42685234713235331583e+00 6.91335321754517284631e-01 1.38954807081037801098e+00 7.18336025623465879164e-01 1.35647038979232248401e+00 7.43839350359299822379e-01 1.28388614127676081722e+00 7.09166881471163690343e-01 1.22217832900663014861e+00 6.06523968616377806562e-01 1.22676477566682251563e+00 5.11970182719984401309e-01 1.25729770192434564535e+00 5.06982606465599561218e-01 1.23152019984655258789e+00 6.15778921991384509127e-01 1.14239369613170294038e+00
15 1.00000000000000000000e+00 7.75489577897098270043e-01 1.29423435051614044156e+00 7.54364692621814714180e-01 1.30463219279962605590e+00 7.50432154262644313114e-01 1.31073439963144533493e+00 7.40752769701192304019e-01 1.31417034397667298329e+00 7.25778531062287179942e-01 1.31792350872966479436e+00 7.10598111772081431070e-01 1.31971212896378853330e+00 6.97021932815686695584e-01 1.32004136228735413638e+00 6.89345805720842585984e-01 1.32052724430075540951e+00 6.81050508868399018247e-01 1.31595666730837956848e+00 6.76602378648859192900e-01 1.30479021915006776489e+00 6.78120443831542241142e-01 1.28747543446005185963e+00 6.84507951317789076207e-01 1.26595115719239892371e+00 6.82922553158456402400e-01 1.24310138225920119304e+00 6.85582177003639547941e-01 1.24327922182146832775e+00 6.88141902536310690053e-01 1.26396452399500658359e+00 7.08964490341903785797e-01 1.24382988104732250534e+00
16 1.00000000000000000000e+00 7.63018147854833683752e-01 1.29169021491836089055e+00 7.37936955523221360664e-01 1.30363016520923125086e+00 7.44009810788200165454e-01 1.30515423396421481606e+00 7.39106729668451478688e-01 1.30629515290327069543e+00 7.32500591281266988375e-01 1.30549050072923789045e+00 7.23837061524818969893e-01 1.30529672910556771015e+00 7.15027363313122665822e-01 1.30501909488494449718e+00 7.05332985368348319710e-01 1.30245247388252183285e+00 6.99583920398114678108e-01 1.29840336826267988002e+00 6.96678717184048501565e-01 1.29039901953247793109e+00 6.95045282883490544990e-01 1.28009852139996582743e+00 6.94724041230642574973e-01 1.26623027453126835162e+00 6.93853942539405466050e-01 1.25461825576085561629e+00 6.93847000783969880544e-01 1.25190098195488519472e+00 6.97706472003837840923e-01 1.25540748986724004510e+00 7.08066634163574404326e-01 1.23763786658387964223e+00
17 1.00000000000000000000e+00 7.59614678572991142147e-01 1.29152615116205149448e+00 7.36688591117844016054e-01 1.29965651418335825795e+00 7.35756556882551926435e-01 1.30197477606715983356e+00 7.33858019574811670793e-01 1.30217022154623940366e+00 7.29589253616178545769e-01 1.30118530381498365145e+00 7.23796451792811934567e-01 1.29945764308992628422e+00 7.17386750017431129578e-01 1.29606688477498255274e+00 7.11574040981771349657e-01 1.29168666620691507951e+00 7.06508654568177019151e-01 1.28616434080963681907e+00 7.02084444883189662256e-01 1.27820136869148837100e+00 6.98205845677155267914e-01 1.27063413593820562220e+00 6.96604129629161517023e-01 1.26884845770617316063e+00 6.95996457910486254761e-01 1.26703977227627118118e+00 6.96734630270244736927e-01 1.27380059591058403257e+00 7.00053511564184716143e-01 1.27044024260263932469e+00 7.09322474753230403088e-01 1.24737243340710879380e+00
18 1.00000000000000000000e+00 7.40634260440410696624e-01 1.28949967038324309065e+00 7.13422563690097599753e-01 1.30041819746608333652e+00 7.10955547938606158276e-01 1.29893450553089651045e+00 7.10500302897262736579e-01 1.30205177217582890314e+00 7.11975112049786584834e-01 1.30132100028309327655e+00 7.08058688577971828693e-01 1.30277291784049276124e+00 7.13532965610809588597e-01 1.30117473802386185433e+00 7.15406567230633894106e-01 1.29761101349338137112e+00 7.13671294486266871715e-01 1.29339443489975924884e+00 7.09021439608552461742e-01 1.28842268844202179068e+00 7.04771028344780003927e-01 1.28422134203141280473e+00 7.01484559450695210892e-01 1.28239951623949299808e+00 6.99781583059203682318e-01 1.28097776985363398516e+00 6.99888604988321283429e-01 1.28077136543091496534e+00 7.02224818441119724710e-01 1.27848345076384162233e+00 7.09886514763429343766e-01 1.25232976556426534032e+00
19 1.00000000000000000000e+00 7.38452923294228846807e-01 1.28915096997364209130e+00 7.09583178722788310289e-01 1.29684520896934674106e+00 7.05448320285340213509e-01 1.29948660883272881783e+00 7.04013815243909601982e-01 1.30053667469349987229e+00 7.02945751797536488858e-01 1.30073483517390342534e+00 7.02484041039945883433e-01 1.30060713871384980855e+00 7.02500494056368718354e-01 1.30010699447835054166e+00 7.01635223445725153546e-01 1.29935859120691099555e+00 7.00884636996821130950e-01 1.29849899681358227355e+00 7.01648341968109545697e-01 1.29591114555932374053e+00 6.99782334592706334320e-01 1.29571408671312204852e+00 7.00807047606328392675e-01 1.29505129874484747887e+00 6.98129937808900757901e-01 1.29619216971834028129e+00 6.99610992669731035498e-01 1.29721472698324591377e+00 6.99860877681687032492e-01 1.29324305135673345291e+00 7.10948159701434434510e-01 1.26261142515701707545e+00
20 1.00000000000000000000e+00 7.36227898819662551766e-01 1.28909690686253708414e+00 7.06656762914073754978e-01 1.29693173987542853531e+00 7.01932727601122796735e-01 1.29930839065098346907e+00 7.00416399456300520221e-01 1.30082331799967021446e+00 6.99378574787027251780e-01 1.30140187569373089183e+00 6.98863829449828499740e-01 1.30156002807113213571e+00 6.99219910234612274103e-01 1.30122509825597121313e+00 6.98845669260343527185e-01 1.30109546977946077817e+00 6.98959357154727123351e-01 1.30101436367965406227e+00 6.98859428261308424091e-01 1.30117226033463095902e+00 6.98813735661088508699e-01 1.30094083939072358014e+00 6.98998219537596110484e-01 1.30036562648850084756e+00 6.99447386800501558213e-01 1.29943123712461350294e+00 7.00553796695286390417e-01 1.29770088272997075052e+00 7.03209845747202466626e-01 1.29312795218459108959e+00 7.10928327566638151858e-01 1.26349214093112838242e+00
21 1.00000000000000000000e+00 7.36104777020745171257e-01 1.28904420249806483945e+00 7.06294226999884311446e-01 1.29675005989907043968e+00 7.01591920184901907120e-01 1.29938117533624630795e+00 6.99831865343857995043e-01 1.30056894833159675251e+00 6.99004263021107297149e-01 1.30110414143122410380e+00 6.98552701592226710225e-01 1.30133648128240064779e+00 6.98410029859243275396e-01 1.30143916421830385666e+00 6.98542937445824296816e-01 1.30157390942908279818e+00 6.98690504389360644844e-01 1.30166150852681972161e+00 6.98761430618673684556e-01 1.30169166281382531203e+00 6.98838682375983455408e-01 1.30148820947934673598e+00 6.98919395908575991072e-01 1.30085580908308862114e+00 6.99288679394899803654e-01 1.29996153633989663945e+00 7.00628147369033893455e-01 1.29824139286984818753e+00 7.03183285675195057784e-01 1.29354586577951091719e+00 7.10971068635616210152e-01 1.26374201684653031386e+00
22 1.00000000000000000000e+00 7.36331396646074165524e-01 1.28906549887971899615e+00 7.06584841324493062586e-01 1.29677291366963864938e+00 7.01946881106550346630e-01 1.29941699253327791475e+00 7.00257709926377480691e-01 1.30035507349312928760e+00 6.99388984439432648266e-01 1.30120387221966216096e+00 6.98682733405812772531e-01 1.30152588860239726287e+00 6.98442968701280864074e-01 1.30140610388416755328e+00 6.98397466703120084475e-01 1.30139183199578889472e+00 6.98409358523180312517e-01 1.30139952824799398634e+00 6.98523946862443345651e-01 1.30134656371495327498e+00 6.98642231867531604550e-01 1.30117353118605083573e+00 6.98901943632561861719e-01 1.30074463026727560333e+00 6.99441732948415273441e-01 1.29992727328160273537e+00 7.00619007972594354250e-01 1.29820570096883658451e+00 7.03240840718223458872e-01 1.29353709742619815692e+00 7.10944486986978096965e-01 1.26377096786432718822e+00
23 1.00000000000000000000e+00 7.36372664922152031508e-01 1.28907167609282313769e+00 7.06651898901299313493e-01 1.29677706300301087694e+00 7.02012386013981748434e-01 1.29939446098419075781e+00 7.00319972173827909323e-01 1.30054857543470170356e+00 6.99504425151605935262e-01 1.30110182430157417244e+00 6.99056678632066996748e-01 1.30136747665507290783e+00 6.98797341756948631186e-01 1.30145307268852006288e+00 6.98633909515647077981e-01 1.30147877266099776250e+00 6.98556710723420182241e-01 1.30142157856836737650e+00 6.98530001868648331431e-01 1.30123015456319457428e+00 6.98630882522069063256e-01 1.30094682603573263968e+00 6.98897955480107913040e-01 1.30049541686043101940e+00 6.99454378955834621401e-01 1.29965881648800429815e+00 7.00609904544830963680e-01 1.29795767928673888569e+00 7.03219409950346263649e-01 1.29331972187754007386e+00 7.10925397636031353166e-01 1.26360296575031072486e+00
24 1.00000000000000000000e+00 7.36405314126284404885e-01 1.28907559684614758666e+00 7.06691391597217277720e-01 1.29678148373421708861e+00 7.02053459668844359598e-01 1.29939675137872634458e+00 7.00353580298239575264e-01 1.30054905898166373035e+00 6.99527555230333053515e-01 1.30110289492044883808e+00 6.99065267179119431695e-01 1.30136671030536565929e+00 6.98787377914993790284e-01 1.30146753206309151452e+00 6.98620068958737960862e-01 1.30146357462274542272e+00 6.98537027287745027060e-01 1.30138086247422246622e+00 6.98534369141742605969e-01 1.30121247436832021549e+00 6.98635507709835734680e-01 1.30093343492837476560e+00 6.98898303313876811949e-01 1.30047074390549144418e+00 6.99452450820615245775e-01 1.29964482611281195723e+00 7.00603257411285818002e-01 1.29794550126921670596e+00 7.03218352786617262318e-01 1.29330760413129031150e+00 7.10924354972835126354e-01 1.26359331153962584082e+00
25 1.00000000000000000000e+00 7.36410673199599630223e-01 1.28907618461861406267e+00 7.06697726353498922869e-01 1.29678217439117604570e+00 7.02060175309665801535e-01 1.29939711808772218049e+00 7.00360432811857669400e-01 1.30054771582983486056e+00 6.99533531029770228038e-01 1.30110156949124200487e+00 6.99069807063004700076e-01 1.30136436911583741605e+00 6.98790433919793452233e-01 1.30146522036532963362e+00 6.98622536451539044577e-01 1.30146211133915001845e+00 6.98537865803343871463e-01 1.30137748999141567019e+00 6.98534691083570580261e-01 1.30120958718424972744e+00 6.98635605848021867814e-01 1.30093024524220335358e+00 6.98898280538176597254e-01 1.30046658173461393559e+00 6.99452257205871674728e-01 1.29963975329270930992e+00 7.00602889630842495805e-01 1.29793990892392385739e+00 7.03217829258470872311e-01 1.29330225461799330766e+00 7.10923830403288659063e-01 1.26358914986354586851e+00
26 1.00000000000000000000e+00 7.36411711126026546914e-01 1.28907624070635939972e+00 7.06698810300691371289e-01 1.29678224520200102710e+00 7.02061128496267006227e-01 1.29939715184657411662e+00 7.00361181228562168499e-01 1.30054766016034784037e+00 6.99534232741794048671e-01 1.30110144049103482189e+00 6.99070426519073140348e-01 1.30136417031625306606e+00 6.98790972903541862671e-01 1.30146498286053202698e+00 6.98622923155661990080e-01 1.30146177199817492109e+00 6.98538218283206724379e-01 1.30137703845394936408e+00 6.98535038321127843552e-01 1.30120898844724708354e+00 6.98635848213986943023e-01 1.30092956127933301325e+00 6.98898617292872947893e-01 1.30046575643803974387e+00 6.99452407026161737669e-01 1.29963878828013679190e+00 7.00602881035211177974e-01 1.29793887817792374939e+00 7.03217721773699011578e-01 1.29330122748489917406e+00 7.10923692777134186294e-01 1.26358828666212041902e+00
