# tag norm n_hub[0] n_hub[1] n_hub[2] n_hub[3] n_hub[4] n_hub[5] n_hub[6] n_hub[7] n_hub[8] n_hub[9] n_hub[10] n_hub[11] n_hub[12] n_hub[13] n_hub[14] n_hub[15] n_hub[16] n_hub[17] n_hub[18] n_hub[19] n_hub[20] n_hub[21] n_hub[22] n_hub[23] n_hub[24] n_hub[25] n_hub[26] n_hub[27] n_hub[28] n_hub[29] n_hub[30] n_hub[31] n_hub[32] n_hub[33] n_hub[34] n_hub[35] n_hub[36] n_hub[37] n_hub[38] n_hub[39] n_hub[40] n_hub[41] n_hub[42] n_hub[43] n_hub[44] n_hub[45] n_hub[46] n_hub[47] n_hub[48] n_hub[49]
1 1.00000000000000000000e+00 5.50262377966213422215e-03 1.99498880971992464950e+00 5.81951611817834238427e-03 1.99381226419395041205e+00 4.79688280177031356466e-02 1.98282899209153362641e+00 2.29886229792452656540e-01 1.90517607991074200413e+00 8.91172811860365787773e-01 1.35757260592839523738e+00 8.54924902482886550636e-01 1.23555617814767737528e+00 8.24075235358619040404e-01 1.05313575794185410039e+00 8.87245214842488194584e-01 1.06353671487857992517e+00 9.11686511318883785471e-01 1.07519010854927210552e+00 9.15437996113783070129e-01 1.06433149236242252655e+00 9.25888553599442554187e-01 1.04047664760535218953e+00 8.95157216779183029232e-01 1.04983376238043235595e+00 8.50227336437773151268e-01 1.04470448582965258488e+00 8.55339550994776320891e-01 1.03643951227908903689e+00 1.40791379367286480229e-02 1.99507845644775883009e+00 2.65037169185036780572e-01 1.93550232106053377024e+00 8.72531743934737868962e-01 1.46953085466551813809e+00 9.24493367700564006029e-01 1.20853279423711823526e+00 8.91539731085648989861e-01 1.04457992095326712700e+00 9.04666525853008662850e-01 1.06126771202112979431e+00 9.29888499685449287924e-01 1.08246376997718729562e+00 9.44676628665994666534e-01 1.09549559111874583728e+00 9.49829210028931725240e-01 1.09677942657737204080e+00 9.49177241253929437903e-01 1.47235042217593425917e+00 3.30840808814974407515e-01 5.63742727305397872684e-01
2 1.00000000000000000000e+00 4.93110818196982724632e-03 1.99018049415874020980e+00 9.79207156571039807891e-03 1.99021591154460386619e+00 9.78920472822827729409e-03 1.99105128066583869639e+00 9.03855606957118008771e-03 1.99019378293443871542e+00 9.90622538172141776924e-03 1.98976256772488602209e+00 9.89511541022578336446e-03 1.99049169659405245092e+00 9.65931431596087596014e-03 1.99041481430940803143e+00 9.51512143113211923684e-03 1.99058917714182381786e+00 9.59490760063862364870e-03 1.99041609373507322189e+00 9.44441413100569060468e-03 1.99070657022359909227e+00 9.56548828350013181920e-03 1.99049691665692973785e+00 9.45443473469678198617e-03 1.99014735052313840313e+00 9.92315144098275536688e-03 1.98991070146708159960e+00 9.93645365153006908387e-03 1.98997489721751241731e+00 9.90823562005835323241e-03 1.99020547217986165656e+00 9.79588872127380543009e-03 1.99052515701385202007e+00 9.58637647376114204745e-03 1.99054790920728730264e+00 9.28008663248731067996e-03 1.99042238471549404188e+00 9.41595358206688722025e-03 1.99063242621153579925e+00 9.25456113187119421004e-03 1.99089637077126879738e+00 9.49340498203267608990e-03 1.99056873852976212724e+00 9.59109796993864310855e-03 1.99035649948478221560e+00 9.53359938253419032794e-03 1.99040822097273628621e+00 9.31658797088306435408e-03 1.99063865363913339301e+00 9.84146516625081062279e-03 1.99478308781738400413e+00
3 1.00000000000000000000e+00 4.92650424089191574240e-03 1.99018327545029216630e+00 9.78074954758860644344e-03 1.99021894777642827101e+00 9.78105083487419355026e-03 1.99021899035192761929e+00 9.78099518951261286126e-03 1.99021889175583144294e+00 9.78103396221901601193e-03 1.99021907414349485954e+00 9.78104224212418375817e-03 1.99021888225930587701e+00 9.78090431957475726910e-03 1.99021915463721055239e+00 9.78105118458171864104e-03 1.99021893965630147783e+00 9.78106869972325890239e-03 1.99021877726459850422e+00 9.78124767509978496061e-03 1.99021907768133399230e+00 9.78088005974092969397e-03 1.99021894765140494599e+00 9.78103878329344457454e-03 1.99021895011657323771e+00 9.78105327527111628738e-03 1.99021894905232143991e+00 9.78101507526252418601e-03 1.99021898594676360794e+00 9.78103221929195118522e-03 1.99021897915061285467e+00 9.78103789406109883076e-03 1.99021895577931950960e+00 9.78107236867586243845e-03 1.99021893189427112603e+00 9.78105994675110106129e-03 1.99021856260392970839e+00 9.78005040686576523901e-03 1.99021994154694104040e+00 9.78078327849652394421e-03 1.99021962038518829274e+00 9.78107983945724311636e-03 1.99021888749483344405e+00 9.78110426692903323076e-03 1.99021889924892048107e+00 9.78106386075686638770e-03 1.99021876448665624437e+00 9.78128728365674875167e-03 1.99021916859057834692e+00 9.81676431394175146028e-03 1.99507347430682457912e+00
4 1.00000000000000000000e+00 4.92652320313436819371e-03 1.99018323867915136738e+00 9.78076963421405792820e-03 1.99021893823595452666e+00 9.78105935683615604348e-03 1.99021894577960467565e+00 9.78105241795522613313e-03 1.99021893356945756004e+00 9.78105707758562641085e-03 1.99021895623279321264e+00 9.78105834915534745611e-03 1.99021893239220304395e+00 9.78104105890148338431e-03 1.99021896610570192543e+00 9.78105944161252599534e-03 1.99021893963298301955e+00 9.78106140194733020277e-03 1.99021891953356533378e+00 9.78108330284341645489e-03 1.99021895699324291584e+00 9.78103829279949529840e-03 1.99021894031188550933e+00 9.78105783318009534832e-03 1.99021894070236449181e+00 9.78105971270445094523e-03 1.99021894052421521870e+00 9.78105501530283395761e-03 1.99021894504828034123e+00 9.78105721998346819279e-03 1.99021894428892909268e+00 9.78105783033396576631e-03 1.99021894142427391294e+00 9.78106205926948350793e-03 1.99021893854625453457e+00 9.78106018784141544031e-03 1.99021889442680288695e+00 9.78095375882391537825e-03 1.99021904825210937950e+00 9.78103051866543310444e-03 1.99021901422524871705e+00 9.78106360594514431805e-03 1.99021893332466248694e+00 9.78106576932061440310e-03 1.99021893462676535691e+00 9.78106071921549732884e-03 1.99021891805409167908e+00 9.78109026993984748133e-03 1.99021922304001219750e+00 9.81676184179237562577e-03 1.99507347617074715096e+00
5 1.00000000000000000000e+00 4.92652321507625490932e-03 1.99018323868929747356e+00 9.78076988038765159084e-03 1.99021893705999941560e+00 9.78106044806462300578e-03 1.99021894017940459420e+00 9.78105957217684229832e-03 1.99021893866872767731e+00 9.78106018515972029659e-03 1.99021894148641265154e+00 9.78106031467134047486e-03 1.99021893851410203169e+00 9.78105818485374735316e-03 1.99021894272595623043e+00 9.78106046726876128539e-03 1.99021893942241545616e+00 9.78106066350734049131e-03 1.99021893697138563262e+00 9.78106343809697839631e-03 1.99021894157157364091e+00 9.78105783743346036962e-03 1.99021893948668426866e+00 9.78106027585130821667e-03 1.99021893953531692212e+00 9.78106051684163313453e-03 1.99021893950119266314e+00 9.78105994381012200378e-03 1.99021894007241506586e+00 9.78106021085962777650e-03 1.99021893998256604874e+00 9.78106027962426065325e-03 1.99021893963825080576e+00 9.78106079380475744445e-03 1.99021893928205040325e+00 9.78106044937383442561e-03 1.99021893373841707309e+00 9.78104737303069592114e-03 1.99021895292341310935e+00 9.78105695531818891686e-03 1.99021894872200677540e+00 9.78106098707396710845e-03 1.99021893865008170366e+00 9.78106123941317393000e-03 1.99021893880559019863e+00 9.78106056994530563553e-03 1.99021893680986150521e+00 9.78106646221888441362e-03 1.99021922920894445141e+00 9.81676130623661963304e-03 1.99507347678429458604e+00
