# tag norm n_hub[0] n_hub[1] n_hub[2] n_hub[3] n_hub[4] n_hub[5] n_hub[6] n_hub[7] n_hub[8] n_hub[9] n_hub[10] n_hub[11] n_hub[12] n_hub[13] n_hub[14] n_hub[15] n_hub[16] n_hub[17] n_hub[18] n_hub[19] n_hub[20] n_hub[21] n_hub[22] n_hub[23] n_hub[24] n_hub[25] n_hub[26] n_hub[27] n_hub[28] n_hub[29] n_hub[30] n_hub[31] n_hub[32] n_hub[33] n_hub[34] n_hub[35] n_hub[36] n_hub[37] n_hub[38] n_hub[39] n_hub[40] n_hub[41] n_hub[42] n_hub[43] n_hub[44] n_hub[45] n_hub[46] n_hub[47] n_hub[48] n_hub[49] n_hub[50] n_hub[51] n_hub[52] n_hub[53] n_hub[54] n_hub[55] n_hub[56] n_hub[57] n_hub[58] n_hub[59] n_hub[60] n_hub[61] n_hub[62] n_hub[63]
1 1.00000000000000000000e+00 1.47064636336771048519e+00 1.17087980691690440871e+00 1.26552639023220336867e+00 1.43821084803899412741e+00 1.13359110036713661707e+00 1.24407001310770226610e+00 9.74703144850595504245e-01 1.11932316485586524912e+00 8.96168690936300471606e-01 1.19459054406105469326e+00 1.05626076862854456628e+00 1.04206808954806229295e+00 1.53457704049112964029e+00 5.36734120747795473427e-01 9.11994185338493745796e-01 7.18821805647828049324e-01 1.06999618781459537864e+00 8.68868691972944806601e-01 6.33428320446261294840e-01 9.73173773210170733883e-01 8.40956720373807198321e-01 8.89873966961028495248e-01 8.32716588206234176184e-01 1.16295011292798533553e+00 1.16371551461250799520e+00 8.57452799868262283134e-01 7.27255613489033114760e-01 9.63757867478540308781e-01 8.20602026859866162667e-01 1.12542386990971055027e+00 6.65801016704076542574e-01 1.20240440704987827658e+00 1.10531728722951760879e+00 8.83237257497502592507e-01 1.51672193245182684862e+00 1.10575861910727590853e+00 1.02414755723384520714e+00 1.67681380077966046827e+00 1.41181357685993824624e+00 1.51476073573569136599e+00 1.86970392183288836030e+00 5.52027359786424809407e-01 1.00425573364747378058e+00 1.51290779963860022583e+00 1.11652037586682562065e+00 3.87235726899784582500e-01 1.64921669883870158912e+00 1.06975079570166276000e+00 1.28980192493377199270e+00 6.36697903464917502880e-01 7.63469556820725259172e-01 8.83233129165074681843e-01 6.58767473153349492065e-01 1.01315420966127089919e+00 3.58276222800666177548e-01 8.27762114016782790671e-01 8.43821241533646571042e-01 8.83758254440725643519e-01 5.02240288467307061104e-01 5.46739212819542075295e-01 7.75555715871969475472e-01 4.46646972746582548996e-01 5.87416567518688870209e-01 1.07592647845608846424e+00
2 1.00000000000000000000e+00 9.98984009712408194126e-01 1.22233326426874944204e+00 7.69924879780673809826e-01 1.11656720025619593528e+00 7.97603721186180836256e-01 1.17580483880681319064e+00 9.24288625961207088721e-01 1.05149029067407440152e+00 7.16029438132011364360e-01 1.22678812970005846061e+00 9.87038705840525221191e-01 1.01329345881289434317e+00 1.00000572582022928536e+00 1.95382454971952967959e+00 1.17333453932933776120e-01 1.92627739897297223237e+00 1.00454448907127358304e+00 1.61485854451742061322e+00 3.89210294773277509783e-01 9.99060685991617680735e-01 9.99603282341808618838e-01 1.17257740909616336999e+00 8.72009599856421346864e-01 1.03705730777283222643e+00 5.32335180277115682657e-01 1.32337895244168013420e+00 6.04437324090086464112e-02 9.98441744120688978725e-01 8.30323817267054842262e-01 1.25303178084692068417e+00 5.15594241345181392155e-01 1.29310117264960600103e+00 8.51525129648554590656e-02 1.08607400369880791047e+00 4.48506042089837853037e-01 1.24272974066719044117e+00 9.58296941373574129308e-01 1.30420142652372161862e+00 9.86777671939400469192e-01 1.99342401810327407574e+00 1.00405528851452641170e+00 1.99505401668493131950e+00 1.00594188692578656585e+00 1.99381050606521559310e+00 1.00276954031373999321e+00 1.99753768907274142919e+00 9.99945941469519872236e-01 1.79713161928926590249e+00 4.24264439705904050637e-01 1.79195308851245393988e+00 8.15090557685953620570e-01 1.10750195249693428323e+00 6.42721878480463915118e-02 9.98974475465226219306e-01 5.79615996579994040283e-03 9.97578366267721228233e-01 9.99999999999641620008e-01 9.99999995615049264153e-01 9.99884378083582436858e-01 9.97500656595664336734e-01 5.07535331514721681223e-03 9.93987402511418594031e-01 5.99218810057779941586e-03 9.97560025778903902705e-01
3 1.00000000000000000000e+00 9.61864450773219248347e-01 1.27118721885016316975e+00 7.44044683830163533500e-01 1.25065255388694551719e+00 6.79871650328689569598e-01 1.17737201826592863263e+00 8.31440068256118158807e-01 1.15000532994633775097e+00 7.17346446209662702564e-01 1.24006029017183605490e+00 8.52765520486509331910e-01 1.12387503336064242809e+00 9.95888851125423690824e-01 1.64987607644288725162e+00 6.83863364503338955203e-01 1.67790955061929958347e+00 9.41563057573629014207e-01 1.29175401531780598141e+00 7.37614748485209359430e-01 1.02135291024496921430e+00 9.93045162463407904418e-01 1.25627685435305314066e+00 7.34028699902223857876e-01 1.02086112899065306614e+00 3.94451956134966918999e-01 1.29330922879773346779e+00 2.95676172968247996664e-01 1.02063103653912645719e+00 8.27540150195381296605e-01 1.22086111134984753868e+00 5.88667017445299700640e-01 1.20078983115318371766e+00 2.83891874006841404832e-01 1.14854223932954213616e+00 5.91875657808061395038e-01 1.16649741165786879904e+00 9.20739568138025488153e-01 1.19419034683129066110e+00 9.12445847369100060398e-01 1.93420366387304509814e+00 1.00366951587726283002e+00 1.99505404372467887164e+00 1.00488885643009639992e+00 1.99510655540202241909e+00 1.00461882642281596922e+00 1.99148593382940886087e+00 1.00395602563075758695e+00 1.43912208459730139865e+00 6.43801103664082829958e-01 1.37784662121027068338e+00 5.77673512892216245440e-01 1.23879658889588450954e+00 5.91281727011378599457e-01 1.07470342914011984803e+00 6.32622515318607969714e-02 1.00190142117455804893e+00 9.93882467798309687801e-01 9.98891930360239821418e-01 3.85503431276142394246e-01 9.99552623458018096869e-01 4.24265042341458897823e-01 1.07591223565254878736e+00 1.09657717479101746161e-01 1.00633325621386071624e+00
4 1.00000000000000000000e+00 9.28700626414774133011e-01 1.28863891089504378762e+00 7.47374252094288316073e-01 1.24864288477172169500e+00 6.87068815090417728264e-01 1.23128909827007060329e+00 7.57856967959797622747e-01 1.22346533889566466691e+00 6.72907110772282379685e-01 1.24105193831068061350e+00 6.98921436685907893072e-01 1.29731439827171368684e+00 9.40712829994998944727e-01 1.64199385832714384037e+00 7.27950226354956098085e-01 1.66577290427746249613e+00 9.14662427112117315531e-01 1.29159659551277061773e+00 7.53016942131199296107e-01 1.04106532635699755573e+00 8.85780185464980940324e-01 1.27740931660614132070e+00 6.99910027860989658599e-01 1.13824850411271660811e+00 3.43935923482307781551e-01 1.27975976038038607996e+00 3.46985331351069015149e-01 1.03243972114121018713e+00 6.21734624896647214420e-01 1.27396444522227425544e+00 4.71666279954716660683e-01 1.31091028908876161552e+00 4.00475365905647362474e-01 1.21644669606557109809e+00 6.31524401845764971064e-01 1.29874548467157135967e+00 7.88062772766920605072e-01 1.52580160177562795809e+00 7.93853075906701954878e-01 1.69091903232274876068e+00 9.79075481106552958366e-01 1.97953138337337763986e+00 9.71576125757045105935e-01 1.72801168157467777142e+00 7.75199067612217573853e-01 1.62036485444475775175e+00 9.79170862846634904031e-01 1.87710132424009268348e+00 9.13925651954915707620e-01 1.30458003576736847329e+00 7.00455586585088885165e-01 1.18319784401631911130e+00 4.62166727108108077449e-01 1.20301202348185998225e+00 2.78367732959175939733e-01 1.03410265563247061316e+00 8.19962309723690774277e-01 1.00762193458834947712e+00 1.66009547745131574858e-01 1.02278596352109252265e+00 2.77675504380133497673e-01 1.25600750488102730351e+00 3.83345889706181108814e-01 1.04817657767126326540e+00
5 1.00000000000000000000e+00 8.92707443118920473957e-01 1.30056714802793949026e+00 7.61494891811452800923e-01 1.27366932560341084013e+00 6.97610373194251121021e-01 1.29060670022631129861e+00 7.19258851352221451059e-01 1.25673489595804421803e+00 6.78797912054047380970e-01 1.24022435312686130082e+00 7.29175038787186258205e-01 1.34698089057214009934e+00 8.35972226979374566369e-01 1.65029681442248010725e+00 7.11547972354729552080e-01 1.60443143594680859287e+00 8.73715883157206496534e-01 1.31176016253601090966e+00 7.70423992179456007534e-01 1.05795788323033068679e+00 7.60146520458788055308e-01 1.27977203104714543080e+00 5.90722811598640262787e-01 1.24562580490450791615e+00 3.58847564011231190406e-01 1.27218379071803711078e+00 4.30425963536457401037e-01 1.05573723738420421903e+00 5.68928270951824521795e-01 1.30469083199333546474e+00 4.86803248460660642483e-01 1.33600167265485447743e+00 4.93946368562112936296e-01 1.33402770419432359361e+00 6.07215960360032780407e-01 1.42258696054871824899e+00 6.87545764187794450351e-01 1.61240136992566651664e+00 7.81849190544814498516e-01 1.57982967427460896381e+00 8.79257031249255582850e-01 1.87453695118822438737e+00 9.36445816113943507730e-01 1.63936861749060436289e+00 7.51032369135834487750e-01 1.71697578228957747903e+00 9.32807069057331128548e-01 1.57404127402368709809e+00 7.03010054323319755198e-01 1.48421885388931062977e+00 5.26259114881186929047e-01 1.32507257091214958322e+00 4.64639962023796815327e-01 1.14516540271692468522e+00 7.27783870414209999034e-01 1.12882832634870711175e+00 6.94443018893511343492e-01 1.07009601149223176897e+00 2.21198476887665695934e-01 1.05719703491399563688e+00 3.13196200814615743901e-01 1.24190779777806903361e+00 3.39290623514688194362e-01 1.04000483469056570485e+00
6 1.00000000000000000000e+00 8.45494326208723334659e-01 1.31723617753684840714e+00 7.68248307696512533482e-01 1.33148629986044841900e+00 7.17709594557901842116e-01 1.34150695383766427327e+00 7.05354820045096309045e-01 1.33300030303452610170e+00 6.68594873161553526764e-01 1.34746251744733447353e+00 6.86081270058853220917e-01 1.45610721656873587371e+00 6.99891191224701447737e-01 1.58079598392519771188e+00 7.17898869129888983487e-01 1.50046723553108773963e+00 8.59387893834580585128e-01 1.28972089324707428482e+00 7.61192546485462639971e-01 1.09236107882043453898e+00 6.41215568083378095743e-01 1.28376777544652398433e+00 4.93363415598332577527e-01 1.31495944124218255844e+00 3.98813413627855550825e-01 1.25785087339756684877e+00 5.07743999576405813379e-01 1.09128564009747930363e+00 6.34571187744278009113e-01 1.29521318423808495801e+00 5.89076202108252289236e-01 1.34279033615572984672e+00 5.96267041521663765380e-01 1.36540341139481902211e+00 6.22453899110059993838e-01 1.41088213008667051618e+00 6.67317244204132964391e-01 1.45574373756312480666e+00 8.35516934060991700584e-01 1.53168269508298782178e+00 8.16976129088850422377e-01 1.78733912759641788703e+00 9.06217506972169406509e-01 1.59778309453229505621e+00 7.63462395692671824676e-01 1.70582801295253627671e+00 8.46024968060493876010e-01 1.42343581313590994419e+00 7.88027529169811447041e-01 1.35866880895247921224e+00 6.64217359998323098047e-01 1.25935387414096822134e+00 6.47092556094824078450e-01 1.12566708944466897790e+00 8.42924452646247046594e-01 1.14393784852241320316e+00 5.67634138542220445522e-01 1.12673273719718558539e+00 2.80990557210954117195e-01 1.08596641302824270525e+00 3.33721894616888670182e-01 1.22948747355342002940e+00 3.08237091678126462480e-01 1.03435664461894605282e+00
7 1.00000000000000000000e+00 8.25471317012826166781e-01 1.31612357088662323967e+00 7.70866244739019657040e-01 1.33631256741174953007e+00 7.34784670065654399451e-01 1.36304845740028435230e+00 7.05245991468263055957e-01 1.39022113394343427295e+00 6.72127808228593748296e-01 1.43260551110271028286e+00 6.67665406267752836733e-01 1.49616368648720832191e+00 6.77680002543784132385e-01 1.50657752125567956369e+00 7.36667869895350602150e-01 1.42756501301552463090e+00 8.43503843645791007155e-01 1.26608270654355137275e+00 7.43067040490360541938e-01 1.11925759803971658357e+00 5.84573642162939388633e-01 1.28350297622163345146e+00 4.61704488006801805344e-01 1.31453076142574065699e+00 4.32584644858588884819e-01 1.24825585028832919399e+00 5.47168850580855292698e-01 1.12667897225849777953e+00 6.54441521561451411415e-01 1.28856358733527454064e+00 6.36314735846977730382e-01 1.32927510099637147256e+00 6.36749697195267638783e-01 1.35022564641324493984e+00 6.55744981812661276166e-01 1.37076622482117760349e+00 7.05899566368420661178e-01 1.38861222539045559010e+00 8.50080269135657595747e-01 1.55282387050022507857e+00 7.82810267723403452322e-01 1.72580021723492982311e+00 8.77275490163013205169e-01 1.56275923266734340089e+00 7.74915242023494155177e-01 1.66095904750289746765e+00 7.62598271323794762999e-01 1.47522644287784410189e+00 7.96315254033394759325e-01 1.32582401864249987966e+00 7.27269994840247568924e-01 1.23462210294029550717e+00 6.85221731183922710962e-01 1.17584487946918669898e+00 8.60604018196363784732e-01 1.12789647214237698236e+00 4.85762669081995945852e-01 1.15873240962808621290e+00 3.41288827517857329408e-01 1.10008450350772135629e+00 3.40858273853817783650e-01 1.22889837658909684137e+00 3.05535153504740530916e-01 1.03336152972719874654e+00
8 1.00000000000000000000e+00 8.17810018697979423941e-01 1.31918380416217773110e+00 7.71812611143894211629e-01 1.34929362877969838408e+00 7.36062730326796810232e-01 1.39075781867290504401e+00 7.00965455138491289055e-01 1.43096625948005207185e+00 6.76187877658753766497e-01 1.46589666239112470514e+00 6.69121566581465487822e-01 1.48461667334655533779e+00 6.88125624505984578860e-01 1.45548046533600383690e+00 7.53860973678536105957e-01 1.38281113966744673149e+00 8.25090150534973143515e-01 1.25288009193066929292e+00 7.22955015144104762292e-01 1.14596942686125746746e+00 5.62878944780197509878e-01 1.27710144073922204910e+00 4.51870314848280218989e-01 1.31226201761924743394e+00 4.53719813522446557830e-01 1.24971929694191197235e+00 5.61522206141255031397e-01 1.15894371470495083365e+00 6.63408750641378941459e-01 1.26956916535511377120e+00 6.63206873101809812887e-01 1.31384189366430526036e+00 6.64484347690077803428e-01 1.32974664397093489399e+00 6.81008532806195887588e-01 1.34146275042670048983e+00 7.30814139675881935254e-01 1.36408826401534422068e+00 8.44751972200759593257e-01 1.55044554418324653788e+00 7.65956299027975906490e-01 1.68588816372566441260e+00 8.42664656604486639324e-01 1.51926502022236586953e+00 7.91562096827659655851e-01 1.58403083814499123783e+00 7.12598122520334942287e-01 1.53213478163384619890e+00 7.37503501454638943358e-01 1.39211673661994095319e+00 7.11238031662907554953e-01 1.29008073180220272924e+00 6.93293168594987241349e-01 1.24998277487642028838e+00 8.38020448988006982916e-01 1.11669106105903792603e+00 4.54778253424955536399e-01 1.17850005575284755288e+00 3.95471362342880494722e-01 1.10279098229009009380e+00 3.45800123340918696968e-01 1.22991818962182652974e+00 3.10525934958138571940e-01 1.03449404343515349858e+00
9 1.00000000000000000000e+00 8.13509181687295468421e-01 1.32016129751796285063e+00 7.72551971841921925055e-01 1.35664951307250225554e+00 7.37475077378265675421e-01 1.40195750564974952468e+00 7.03037456835325258453e-01 1.44810090050073991819e+00 6.78631274903716330549e-01 1.47706519386745527278e+00 6.75455658761790700417e-01 1.47447343577759681921e+00 7.00731859674703416729e-01 1.43010538032069178804e+00 7.63257178477548037243e-01 1.36207441287900343774e+00 8.10840148529915816233e-01 1.24276274236355033231e+00 7.07293174033629234998e-01 1.16500821948748778389e+00 5.58902788246273485306e-01 1.27286332671338442424e+00 4.55245262780282600179e-01 1.30952596230111950604e+00 4.62596883663167313117e-01 1.25437532837461085400e+00 5.66928041367537494111e-01 1.18238351075263503631e+00 6.61463435456978499083e-01 1.25882247548384751390e+00 6.76401651761894817660e-01 1.30222871416568919400e+00 6.82603411030396123316e-01 1.31582024903276884054e+00 7.03528677205814134688e-01 1.32668188825948241139e+00 7.56340008773384475660e-01 1.37099897319423869035e+00 8.21535896440424129317e-01 1.55118397788704109885e+00 7.47682417186253500674e-01 1.63929316841638228475e+00 8.09476689024591578026e-01 1.48403418499433703559e+00 8.02835779152736184194e-01 1.48409924962507910884e+00 7.04743949502894762027e-01 1.50665605225411303181e+00 6.72813355412071989470e-01 1.43178611506145880838e+00 6.36715506577105849750e-01 1.35909843964434218222e+00 6.22266308734176543105e-01 1.30596707025744485087e+00 6.93797660671767402185e-01 1.13872055326865639913e+00 5.00132485205391441596e-01 1.17286272335645547216e+00 5.42427211821173926865e-01 1.08954315750998520507e+00 3.71834290938519274050e-01 1.25630333184240283728e+00 4.19499292486265440427e-01 1.07583896060451222887e+00
10 1.00000000000000000000e+00 8.10114012758999857411e-01 1.32382859260775331833e+00 7.73373193735760855461e-01 1.36622264518886793461e+00 7.37350937181678212085e-01 1.41692479428504980454e+00 7.01624243217221055247e-01 1.45874933040403864659e+00 6.80338366187533294394e-01 1.47884156830550517192e+00 6.82349177072940515920e-01 1.46073423640220645403e+00 7.11501783454007497021e-01 1.41164117705468328268e+00 7.68961233167493651841e-01 1.34731928160882796774e+00 7.96282501561990208039e-01 1.23987287171628079996e+00 6.98507698140532817810e-01 1.18027609299045299629e+00 5.64743457537371762456e-01 1.26829225908501808107e+00 4.71035693595122095800e-01 1.30812892853067230803e+00 4.69475127084709176195e-01 1.26797079960871839077e+00 5.57960979672470713808e-01 1.20753049643815280056e+00 6.49496886240513382482e-01 1.24626833753957622086e+00 6.81367259803898672743e-01 1.28900296432679684067e+00 6.94857218903120688047e-01 1.30564149203053703197e+00 7.18689277032417472846e-01 1.32073883361656374547e+00 7.65469509344756993130e-01 1.38024555797720682726e+00 7.96866749632544113524e-01 1.53365333529944503077e+00 7.35881546454063451002e-01 1.60367953475374958039e+00 7.76730712186892380267e-01 1.47047580504223862619e+00 8.04279024127202202266e-01 1.39047771871617098505e+00 7.23986010757240339153e-01 1.39929971077230641541e+00 6.68295560843320424205e-01 1.38491123396410809043e+00 6.26415596692965870318e-01 1.34174020862364207218e+00 6.11089713948284485312e-01 1.27294168006587637976e+00 6.31306854249570559290e-01 1.17366241164073192849e+00 5.67106776090662179080e-01 1.20449983910194102776e+00 4.89063700809186596707e-01 1.11370632063854801963e+00 5.07272151600791865178e-01 1.22187687456320848156e+00 5.67707879107800628127e-01 1.17134423490812378255e+00
11 1.00000000000000000000e+00 8.09848101992354907352e-01 1.32376808977079840624e+00 7.73276296234783444561e-01 1.37007667498305063525e+00 7.37177075232570699903e-01 1.42161767035271258131e+00 7.02078066505755771232e-01 1.46427511137111321382e+00 6.82347596880451878754e-01 1.47938547658311359001e+00 6.86960626275423091869e-01 1.45517468656772486213e+00 7.18694078034049055326e-01 1.40273957132438242823e+00 7.71537332674175568847e-01 1.33652085287451360962e+00 7.84663155956567992533e-01 1.23758359020509267623e+00 6.90569855457665138232e-01 1.19400786669080516411e+00 5.73400827834942394823e-01 1.26678118485059010290e+00 4.88804279357107462900e-01 1.30682614277337250108e+00 4.80805695261666776741e-01 1.28207027155481934066e+00 5.50421758532504301620e-01 1.23235887103072694337e+00 6.34836116516326764980e-01 1.24471801102477330758e+00 6.80700219663647021484e-01 1.27993177862565765679e+00 7.00765508453447538706e-01 1.30058636903890412206e+00 7.27147850197434220121e-01 1.32861333904319822707e+00 7.64301396942835720161e-01 1.40014964968259425504e+00 7.68272111797399737121e-01 1.52712175589287491029e+00 7.22060008997334246139e-01 1.56960317903988166854e+00 7.61394910837791427660e-01 1.45774474968818679166e+00 7.97594617318091336777e-01 1.36122307595508540423e+00 7.43395551129985898697e-01 1.34725163697189920242e+00 6.91211311994362032074e-01 1.33736287832636757678e+00 6.61893980249346203237e-01 1.30662969321819377733e+00 6.49909007270241589893e-01 1.24351119119109720934e+00 6.25570423794409746776e-01 1.18477216668859153259e+00 4.76226650877933033179e-01 1.24787776160830254923e+00 3.48122480213799878612e-01 1.20769745612449930228e+00 5.59280173097410515659e-01 1.21446119357644488623e+00 6.81521775197395651702e-01 1.22276921259171045264e+00
12 1.00000000000000000000e+00 8.07085943798692917461e-01 1.32408418256523585654e+00 7.70213305322879460135e-01 1.37056921124155528524e+00 7.38230508641612770404e-01 1.42062833483280526181e+00 7.03642564551414495533e-01 1.45780634241943007900e+00 6.86474856521263054887e-01 1.46838792178163002333e+00 6.91702216463025543192e-01 1.44242227474992246172e+00 7.21318943587936245443e-01 1.39910397112841256018e+00 7.65211060551428623455e-01 1.33503328238254970195e+00 7.74605724877622026092e-01 1.25007112860775415619e+00 7.01026728540082855190e-01 1.20955189778242622189e+00 6.04342507530472694555e-01 1.26063674331057518074e+00 5.30232230249617741968e-01 1.30762779129912121157e+00 5.03465884445982503337e-01 1.30359712896555435258e+00 5.34700225505729265230e-01 1.27317632479710396431e+00 6.00026993302146705034e-01 1.26326775417131176305e+00 6.57672472391033768879e-01 1.28132436111600656048e+00 6.89196126514660223350e-01 1.30282086802754393240e+00 7.20929666219814024863e-01 1.34139626423549818135e+00 7.44544238086476517502e-01 1.41992750813168555624e+00 7.37561577965683223823e-01 1.51540890615847012590e+00 7.11561737521278714347e-01 1.53468316206860477813e+00 7.47644678957392505581e-01 1.44677556676386998014e+00 7.85907399555377472744e-01 1.35681524194184555121e+00 7.52478197990016028918e-01 1.33074001928756113777e+00 7.08101348517651274506e-01 1.31659798314310405587e+00 6.82900424021141150277e-01 1.28688751824812519509e+00 6.67470574438837394027e-01 1.22896601977657637939e+00 6.23736771924955690771e-01 1.20230193563453346961e+00 4.82654319844661061634e-01 1.26213929317877338043e+00 3.87491134878037657430e-01 1.24027351385304451803e+00 5.40396367491067786126e-01 1.19920396685965058303e+00 6.72662888545227599657e-01 1.20258396278654511313e+00
13 1.00000000000000000000e+00 7.75709312072363266211e-01 1.30542282429921097098e+00 7.53724794829537247942e-01 1.31582241986471815132e+00 7.44968536680994275478e-01 1.31521676888429062124e+00 7.32035065328135003959e-01 1.30599045362820409544e+00 7.15247212093838680147e-01 1.28555850960810080785e+00 6.99282694045165076346e-01 1.26077851857916356515e+00 6.92171001722728385097e-01 1.24856022842962577357e+00 7.00112829266409164575e-01 1.26035924076605843069e+00 7.41620429323552987633e-01 1.29056011730838715579e+00 7.65635703923744359578e-01 1.30908735367541795291e+00 7.49420015650960169573e-01 1.31237206655414717638e+00 7.15212101643769693204e-01 1.30902831445431644397e+00 6.95974272411612471245e-01 1.30425614328445105272e+00 6.84553172996474335044e-01 1.31377541814056741920e+00 6.80097677982456794155e-01 1.32710246353188265900e+00 6.86538586849681276014e-01 1.35425618929149282899e+00 6.91856512367105547234e-01 1.39316286948390821721e+00 6.95976461590971373639e-01 1.44182259516283761691e+00 6.86492858488205848211e-01 1.45995829878221505815e+00 6.85218375178678451576e-01 1.44485478592186455948e+00 7.02459367732920947347e-01 1.41623930022499022741e+00 7.34815360989903632039e-01 1.37182416701020670757e+00 7.53961276976993222121e-01 1.34082803686453844172e+00 7.48065868231539643496e-01 1.31429957460035762296e+00 7.26506439267741277455e-01 1.28508060316881267404e+00 6.97253612092808561229e-01 1.24536222336873492189e+00 6.53246548492991907509e-01 1.22184234874604746857e+00 5.68624852645363443315e-01 1.25865645346911314562e+00 4.80393752539649998567e-01 1.29242420580843164757e+00 4.75397183289558988850e-01 1.27860394123931486732e+00 5.54884926698705371884e-01 1.22222641619565908222e+00 6.47753980130170048390e-01 1.15945636611797908699e+00
14 1.00000000000000000000e+00 7.76560920660482434386e-01 1.30432978595773163555e+00 7.55485716689081487907e-01 1.30978749835702412696e+00 7.45359263564370433386e-01 1.30608474670530494421e+00 7.28606655672902503440e-01 1.29272404649228889184e+00 7.13047067007721691034e-01 1.27445318150500996879e+00 6.97994579298994555216e-01 1.25790600124353102451e+00 6.90489367200798231927e-01 1.25193462077859973824e+00 7.00441914829061484937e-01 1.26566243397742494992e+00 7.31124176561283034559e-01 1.29320458608249255761e+00 7.53220387804146573885e-01 1.31735735010236965081e+00 7.50914743103513915301e-01 1.32914793394729247034e+00 7.29538509788901556874e-01 1.33787504018982539300e+00 7.05830693736233305557e-01 1.34993496458692030515e+00 6.87661092707676280256e-01 1.36379375930737012368e+00 6.76678037458485870381e-01 1.38121976538137758439e+00 6.71864737422445679194e-01 1.40008782803138531747e+00 6.67048027906136042908e-01 1.41734117079491950264e+00 6.68778428464861907088e-01 1.42825794858824051126e+00 6.73217129023441107627e-01 1.42548425464460470913e+00 6.86528518300022483345e-01 1.40694828653758818859e+00 7.09172145662444464165e-01 1.37997885599853176153e+00 7.35511266401923324842e-01 1.35169900456888636420e+00 7.49422577617650742532e-01 1.32615960778079888804e+00 7.43424084662900108711e-01 1.29779583476514215334e+00 7.18733854328191257288e-01 1.26334845109610038882e+00 6.82194968963830472575e-01 1.23947882098996053912e+00 6.28832360258614886384e-01 1.24552851734238934078e+00 5.55165559889804427485e-01 1.28166451601295183771e+00 4.96344575129179621520e-01 1.30158821951533720807e+00 4.96969644036561464251e-01 1.27678175987983588691e+00 5.63185428893990480681e-01 1.22173966046206672331e+00 6.49701118120238896303e-01 1.16165399721041429082e+00
15 1.00000000000000000000e+00 7.77487322449375350963e-01 1.30437621179726415122e+00 7.55943760946873655193e-01 1.31036721171576009404e+00 7.45272719873867228735e-01 1.30301703436112337187e+00 7.28904041417648973500e-01 1.28834325416446282553e+00 7.10657654742222089084e-01 1.27037034767120182721e+00 6.96670243161790492259e-01 1.25741426154628332945e+00 6.92480722048303465321e-01 1.25671917788758702450e+00 7.02446717436542744650e-01 1.27214032230060070106e+00 7.23755398373121749955e-01 1.29698928373141675330e+00 7.42583380759929689852e-01 1.31895051879652380755e+00 7.44844745755510961871e-01 1.33602007794571542298e+00 7.30485561669356631143e-01 1.35151355587537591596e+00 7.09400338960451071202e-01 1.36985350131341543367e+00 6.90021273615494923348e-01 1.38859934908480164850e+00 6.76313373857770239184e-01 1.40546965313124117003e+00 6.69045204987705588451e-01 1.41809545507227130479e+00 6.66718919423246236811e-01 1.42348442789829077171e+00 6.69468407879557192430e-01 1.41832476507444038560e+00 6.79928533625650310945e-01 1.40210939312848315019e+00 6.97429018336558792512e-01 1.38097390269632702697e+00 7.19917605827257278683e-01 1.35799125160421030323e+00 7.40450323485261630019e-01 1.33512576517418479760e+00 7.46353817259779450666e-01 1.30745874065849787549e+00 7.32183861763561871783e-01 1.27446040300711116444e+00 6.98280795991257918764e-01 1.24632306064504838616e+00 6.48942439055844699780e-01 1.24602661068581865855e+00 5.88887272227701430438e-01 1.27356373318467896993e+00 5.32509928087698480859e-01 1.30073013135687931552e+00 5.09950508980670513814e-01 1.30104644862819873730e+00 5.33110097270341753983e-01 1.26708552721613187941e+00 5.93876408925184895438e-01 1.22384880384662730890e+00 6.63304516897734508518e-01 1.17558290370662588131e+00
16 1.00000000000000000000e+00 7.79931301991402259333e-01 1.30433950565163736535e+00 7.57524628394837473699e-01 1.30881760387254675315e+00 7.44572402234382479946e-01 1.30004437718226073528e+00 7.26715438772986277449e-01 1.28449318020450631295e+00 7.10011352477109003445e-01 1.26879886035192934735e+00 6.96689020818126780732e-01 1.26066750007971295489e+00 6.94644620745706653508e-01 1.26262747764817828688e+00 7.03032639312620388772e-01 1.27646417201945006070e+00 7.19691141082894780823e-01 1.29778673359962493095e+00 7.34450440997781783814e-01 1.32032511943211461336e+00 7.38869268578641880119e-01 1.34050745357747302933e+00 7.29317530630743338094e-01 1.36102152091271078049e+00 7.11416935243257331223e-01 1.38226231332793703110e+00 6.92661604768420091638e-01 1.40253511664419372451e+00 6.79230012373331137887e-01 1.41769808273026076684e+00 6.71626752385350966890e-01 1.42419409121654161332e+00 6.71468351642525163037e-01 1.41992457298479624050e+00 6.78372630419651678757e-01 1.40709823763492991588e+00 6.92276039284933641937e-01 1.38675150631695776049e+00 7.11792027473719612907e-01 1.36352642316378647180e+00 7.31202337432558691077e-01 1.34197283103056563824e+00 7.42564432606705793205e-01 1.31926312400884926390e+00 7.37909207220214469203e-01 1.29120557001327407320e+00 7.14986750959817229933e-01 1.26216715888858854733e+00 6.78544504546623294949e-01 1.24730948446276035391e+00 6.31247067858384580674e-01 1.25894398958858788617e+00 5.77437896348477752717e-01 1.28670903222189703108e+00 5.31573942939713495193e-01 1.30660669684642916089e+00 5.17233320543991403895e-01 1.30079759046136711476e+00 5.45898200070411343532e-01 1.26819399189449733001e+00 6.03899477321253708162e-01 1.22481701784086416396e+00 6.65782206421620337267e-01 1.17955618029264996949e+00
17 1.00000000000000000000e+00 7.80093950912313038870e-01 1.30434331471502074073e+00 7.57529435161916619990e-01 1.30880565483027511142e+00 7.44616619667130330562e-01 1.29953145938233238788e+00 7.26586442350168226767e-01 1.28401378554852874103e+00 7.09054120003859256194e-01 1.26914726542990496938e+00 6.97764928477086487923e-01 1.26170692294209607631e+00 6.95875665341867954972e-01 1.26517271023051947054e+00 7.03594946761481043751e-01 1.27872568902512950828e+00 7.17189981198129822282e-01 1.29844479291743408744e+00 7.29484695215808831570e-01 1.31954717004039490114e+00 7.33816028247849305721e-01 1.34038950285714997257e+00 7.27491718731119729746e-01 1.36213126701966324994e+00 7.13034918262805517131e-01 1.38486485990317587103e+00 6.96656358616788207172e-01 1.40598130996089154543e+00 6.83320723840681099048e-01 1.42129372295780487256e+00 6.76204785210973047249e-01 1.42695853635194880304e+00 6.76434873183344609338e-01 1.42094410078695343458e+00 6.85388943563979058382e-01 1.40406499558758923740e+00 7.01790858724429478244e-01 1.38133899617302136065e+00 7.22130973765251482632e-01 1.35606959608631671976e+00 7.39023725483575755213e-01 1.32936614015210885498e+00 7.41411085018294224724e-01 1.30030004340409899299e+00 7.23302052488632662985e-01 1.26903870631035142758e+00 6.89029602399200191698e-01 1.25133172996960517764e+00 6.45630755602080719235e-01 1.25737184701535786857e+00 5.98050199531004911258e-01 1.28131924088784376892e+00 5.56196027046297780672e-01 1.30444236233065913311e+00 5.34987589006662767055e-01 1.31089860457944884509e+00 5.40538296601872025882e-01 1.29510931819694885547e+00 5.75579882679434495785e-01 1.26185053105701738829e+00 6.26004296682918681682e-01 1.23007256672271747533e+00 6.74820139832505994093e-01 1.19278863701805137865e+00
18 1.00000000000000000000e+00 7.60894768327919135409e-01 1.30290624174179736627e+00 7.39724502998396649112e-01 1.31223070560402854667e+00 7.35839607996359279518e-01 1.31080958029482963489e+00 7.29776459012728806464e-01 1.30512469841313816232e+00 7.19691339620530334820e-01 1.29761305140404537006e+00 7.09086819769218168474e-01 1.28817308188754386933e+00 6.99782583787484591120e-01 1.27787778824886233409e+00 6.92543266122791267847e-01 1.26985693069402505451e+00 6.88640523770335688525e-01 1.27048626035276623902e+00 6.87555373378822776154e-01 1.27800717863941937225e+00 6.94852354295373175752e-01 1.28807880817697384401e+00 7.02400904295101713437e-01 1.29876595210392897783e+00 7.07340785622669443455e-01 1.30777988986254833925e+00 7.12840199773419613827e-01 1.31407345101597705650e+00 7.14339550354575192337e-01 1.31203256057699957360e+00 7.17883769162596441227e-01 1.31436193130678513619e+00 7.11966375080455682323e-01 1.31826784694713650126e+00 7.10981458833566559719e-01 1.32552272695797812574e+00 7.07424976839959862573e-01 1.32431096231035994037e+00 6.99328238239481092542e-01 1.32119424546459574010e+00 6.98617987914322613463e-01 1.31476562366702065532e+00 7.04254255838419496172e-01 1.30067995907354294616e+00 7.08861246973093939161e-01 1.28244728483753256398e+00 7.20730290352748603766e-01 1.27553370224108375552e+00 7.28110556546532672328e-01 1.28093514414212950037e+00 7.26912807422314899419e-01 1.29143095474056224248e+00 7.17793175464200960967e-01 1.29838235564930815080e+00 6.93130500924014958386e-01 1.29105859723073579381e+00 6.69914311396683337385e-01 1.27503527649824310863e+00 6.63952733540678630142e-01 1.25691459789371817735e+00 6.72057845557051725116e-01 1.24166847327436613568e+00 6.90059337623916024818e-01 1.21638523191213598906e+00
19 1.00000000000000000000e+00 7.59897882038436001118e-01 1.30268355241935962496e+00 7.38692144540321060653e-01 1.31173660910682854386e+00 7.34987874604217772401e-01 1.31192606343168005623e+00 7.28607116264725740429e-01 1.30765807751444218532e+00 7.19381231937288756484e-01 1.30049348785813823071e+00 7.09207911696041914951e-01 1.29171523335291049683e+00 6.99847937023809874013e-01 1.28295019801049359209e+00 6.92364877933901556872e-01 1.27659085525656146309e+00 6.87366175330614836980e-01 1.27464004641549921715e+00 6.85591225878546373096e-01 1.27763696138534665891e+00 6.86735139077469747271e-01 1.28497851046051492219e+00 6.90116316097589499456e-01 1.29440495849451853161e+00 6.93347507348541003402e-01 1.30329324298957605066e+00 6.97041201424845491275e-01 1.30906421237155679016e+00 6.99718046220600076168e-01 1.31270156943319649123e+00 7.01739442050695383379e-01 1.31379013605611527638e+00 7.02525856643488322284e-01 1.31211027979763539264e+00 7.02489765842570612620e-01 1.30837408862420345734e+00 7.00323354039577350427e-01 1.30303812558031295588e+00 6.97513172555528693231e-01 1.29657548984276416171e+00 6.96895912913697346269e-01 1.29094542699430880894e+00 7.02625545659695593947e-01 1.28864395993802216545e+00 7.10733603861581686445e-01 1.29227833639344868999e+00 7.21278035191922684000e-01 1.30040386158716092524e+00 7.33879959933603664979e-01 1.30502932267505933339e+00 7.38086428167679997614e-01 1.30575020517272122333e+00 7.30215984314465105243e-01 1.29620406409818689220e+00 7.14927443394000716737e-01 1.28246644377937979442e+00 6.99549330825679827051e-01 1.26869220173337882152e+00 6.91271563782059894621e-01 1.25773855463818362566e+00 6.88274167090315969197e-01 1.25239264865311006325e+00 6.96459316155077834409e-01 1.23140180609665472744e+00
20 1.00000000000000000000e+00 7.51283912955561183900e-01 1.30180953012835631810e+00 7.29034706088338646524e-01 1.31170916438948470528e+00 7.27390495972473738462e-01 1.31370677240856870149e+00 7.25511183902814105195e-01 1.31274707465986772981e+00 7.20010366820497793583e-01 1.30946058159460920756e+00 7.13132786513401506490e-01 1.30469337043124800068e+00 7.05592331409838569023e-01 1.29839501075136021235e+00 6.97920060746293202669e-01 1.29147645669619115516e+00 6.92699812448030805001e-01 1.28422797194890359052e+00 6.88343200073763372693e-01 1.28054809471008956834e+00 6.84062743584304189248e-01 1.27797553463987667577e+00 6.82998417679557601190e-01 1.28016895583345768905e+00 6.82629278550213269838e-01 1.28913705862023508786e+00 6.82501420462780838960e-01 1.29705411741724319086e+00 6.83845465726919510274e-01 1.30422010625275608398e+00 6.84837673088860676707e-01 1.31062237584021956671e+00 6.85439565789579985378e-01 1.31482818772545217989e+00 6.87402117936419365662e-01 1.31626607231040826385e+00 6.87997852822332167655e-01 1.31473845921083309918e+00 6.91604098661816935056e-01 1.31415741443008449174e+00 6.96180750231309763976e-01 1.31276975059322631445e+00 7.06085642391845680343e-01 1.31209604416454306275e+00 7.15927354847188279763e-01 1.31388030748155926197e+00 7.25185635553913465756e-01 1.31352180443619603878e+00 7.30914671059371578998e-01 1.31142819808165822515e+00 7.29543969716227924671e-01 1.30552553169671603506e+00 7.20532956960856285633e-01 1.29518940764172452162e+00 7.08364552475583941771e-01 1.28260016901761275676e+00 6.96711764639506792030e-01 1.26972332524189623904e+00 6.89569540527124269502e-01 1.25987914835360537147e+00 6.88088077397465025520e-01 1.25419425760751646060e+00 6.96573829552129097920e-01 1.23333350909763916903e+00
21 1.00000000000000000000e+00 7.50321620943188993813e-01 1.30169274295875658787e+00 7.28169207408369434376e-01 1.31158620380997748001e+00 7.26467652839978605961e-01 1.31405045505083672985e+00 7.24088111452631522091e-01 1.31340777388365181899e+00 7.19605347432333841695e-01 1.31065707092297811798e+00 7.13549149188594356019e-01 1.30627575623117730963e+00 7.06664142632270841915e-01 1.30074556742981717328e+00 6.99713890238740976457e-01 1.29487106455232470203e+00 6.93755059035481957963e-01 1.28909860314983659713e+00 6.88695001637951609297e-01 1.28463064980143459870e+00 6.84854934914914559307e-01 1.28231227014978399481e+00 6.82620184864825674254e-01 1.28355818508535901579e+00 6.81509269034362707984e-01 1.28764977495032839627e+00 6.81246161188337917558e-01 1.29352093312858085206e+00 6.81646461202757736331e-01 1.30000237404005436481e+00 6.82101837752330353304e-01 1.30625609302290079938e+00 6.83510745686250364983e-01 1.31099381684799798364e+00 6.85868138822084194572e-01 1.31369495968945604325e+00 6.89676489060989439395e-01 1.31564023268949981116e+00 6.96436626787022672325e-01 1.31767696877023388069e+00 7.04465728487283948667e-01 1.31814932847154819839e+00 7.14345005315564995918e-01 1.31861608804874119727e+00 7.21667420092261036046e-01 1.31778157704546838858e+00 7.24975342331012018171e-01 1.31392057268395778813e+00 7.23604025075536783085e-01 1.30816997422635639126e+00 7.17661328823635424889e-01 1.29872324757069490531e+00 7.07319382785212114051e-01 1.28886828644565265556e+00 6.97458126402729639004e-01 1.27900364183476766833e+00 6.90212976651448428811e-01 1.27313533628484698568e+00 6.84695865375324230762e-01 1.26731059050128558319e+00 6.87480658836900349051e-01 1.26378745160600236552e+00 6.97488132549267003668e-01 1.24233838426625253781e+00
22 1.00000000000000000000e+00 7.38801848147342954398e-01 1.30049050652080677715e+00 7.14557877270994734609e-01 1.31070687075982794667e+00 7.13318571062956041651e-01 1.31422073057293808951e+00 7.13837849400165369573e-01 1.31636513935467647229e+00 7.13612693489786287238e-01 1.31608472113125785086e+00 7.12585139273316237052e-01 1.31598164623961433328e+00 7.10558594305037316552e-01 1.31509183952519381755e+00 7.07069842942248505402e-01 1.31249734551260255344e+00 7.04295568078571521120e-01 1.31001499358216122459e+00 7.00704774138430352970e-01 1.30881566545809757685e+00 6.94584885091402814972e-01 1.30462604319894182048e+00 6.91545124346233164303e-01 1.29906572789603513840e+00 6.87398988502333607720e-01 1.29556619986540311196e+00 6.82366093356837843942e-01 1.29176421758810100471e+00 6.82077422467065708211e-01 1.28795861880921247433e+00 6.83012409627306582571e-01 1.28898167328238466567e+00 6.84884027793780880700e-01 1.29184498754392573794e+00 6.88604123282054114696e-01 1.29928543436844146086e+00 6.93675593801828083151e-01 1.30356591027756274492e+00 6.99770139805645174924e-01 1.30891634103363219133e+00 7.06040469064789122378e-01 1.31245068382543239593e+00 7.11659010777748957111e-01 1.31454002175569573119e+00 7.14778978998146463653e-01 1.31413719216299473835e+00 7.15147553001957203556e-01 1.31100109163968991943e+00 7.11928459277892056178e-01 1.30517278374152523313e+00 7.06374500009389283406e-01 1.29707853546974005710e+00 6.99459931008608704062e-01 1.28788871531968562856e+00 6.93079274901968966915e-01 1.27903523590141499078e+00 6.88479119871064249025e-01 1.27237940612596323042e+00 6.86467247330988183940e-01 1.26810596908257600113e+00 6.88089851221293624661e-01 1.26564232294689782421e+00 6.97723195133789886313e-01 1.24423427272624609330e+00
23 1.00000000000000000000e+00 7.38079453147262642965e-01 1.30041129314122150262e+00 7.13561098221525580421e-01 1.31064423025104903608e+00 7.12333843882249073687e-01 1.31439404186909913896e+00 7.12686389774741524405e-01 1.31604114625261336968e+00 7.12658311906747554687e-01 1.31670161461130486025e+00 7.11807221472613771418e-01 1.31678092838398641540e+00 7.09955245589062866607e-01 1.31641985674377459681e+00 7.07312185494378464767e-01 1.31567212118729015558e+00 7.04071595262293348227e-01 1.31462072040242028415e+00 7.00211970249519310983e-01 1.31337083417328259749e+00 6.96256005979390413252e-01 1.31182656915311079970e+00 6.92387218364025947004e-01 1.30985572023070018233e+00 6.88497121223975105941e-01 1.30844916700183655500e+00 6.85470376919876556165e-01 1.30702225487226986189e+00 6.83966244473571238771e-01 1.30581648861319887800e+00 6.83864965080458908631e-01 1.30675042598306490049e+00 6.85804926569359984967e-01 1.30896175279710536010e+00 6.89147202688563442763e-01 1.31163243383644911866e+00 6.92298242376966910250e-01 1.31471234002029779830e+00 6.95703893546169460649e-01 1.31501676154889657333e+00 6.97175125850301169450e-01 1.31493701312157384997e+00 6.95638572496504736797e-01 1.31161316129618499282e+00 6.92383010562241607566e-01 1.30525899944219170301e+00 6.88380434051650391680e-01 1.29837098304248699243e+00 6.87715961478839399312e-01 1.29165815836138064832e+00 6.86302871702162087253e-01 1.28754839239979057552e+00 6.84052428558777014800e-01 1.28530775807625841090e+00 6.82717760119190053558e-01 1.28367909023608239849e+00 6.81572061800088779826e-01 1.28210704472681280564e+00 6.84727116337664920565e-01 1.28147914964960074613e+00 6.88459772735433350732e-01 1.28081202977043839830e+00 6.99425470586915398741e-01 1.25750342030175343844e+00
24 1.00000000000000000000e+00 7.32196750050907785301e-01 1.29984557457031080219e+00 7.06080780093052973179e-01 1.31018406991171065812e+00 7.04183485462489877627e-01 1.31404711163693010967e+00 7.04495476164867295843e-01 1.31599062077532868997e+00 7.05880720002498796006e-01 1.31692242055978270265e+00 7.06473516854078553706e-01 1.31731029005696465006e+00 7.07322374889210458981e-01 1.31790605749260891777e+00 7.06804171881261544819e-01 1.31793513203484868868e+00 7.05452725547285552921e-01 1.31835573108090642336e+00 7.04338099221267111005e-01 1.31915210731761733953e+00 7.02492857035553974754e-01 1.31946476696100378767e+00 6.98942295622185794102e-01 1.32019910141812801818e+00 6.94954040986108134703e-01 1.31970174145379681718e+00 6.91900945365814035171e-01 1.31952744835456647898e+00 6.88300395881331628090e-01 1.31906739426600361220e+00 6.84483617441995817465e-01 1.31772254682166201079e+00 6.83563170333935654632e-01 1.31731967627634949380e+00 6.81557082505519384874e-01 1.31781165247206444313e+00 6.81543977610146622936e-01 1.31823861812020615147e+00 6.80827196051874472538e-01 1.31650342263885167249e+00 6.81922298230162482469e-01 1.31403748987928481462e+00 6.81507169258391054534e-01 1.30966612398991433253e+00 6.81835729229028464360e-01 1.30422977266554473985e+00 6.81433514828376329930e-01 1.29834673367431041591e+00 6.81447719757431347176e-01 1.29323814212953247527e+00 6.81727853233335290284e-01 1.28867841462884014092e+00 6.81900685424028707438e-01 1.28533936187893416125e+00 6.82380083405582094080e-01 1.28355946415388855186e+00 6.83300378654806528367e-01 1.28289801604249320555e+00 6.85126542231626389778e-01 1.28316373182495402361e+00 6.88943406286394943727e-01 1.28232557138850666867e+00 6.99262225074223642274e-01 1.25873040890986231943e+00
25 1.00000000000000000000e+00 7.31887043052150243483e-01 1.29981938184556211624e+00 7.05650502097776133326e-01 1.31006337072534484456e+00 7.03685460325456313413e-01 1.31398978351142181609e+00 7.04110664316755729963e-01 1.31593899414671633430e+00 7.04879011608874783690e-01 1.31703420851528907320e+00 7.05464815954926272035e-01 1.31773530040465902680e+00 7.05670620224911115947e-01 1.31824462355034754957e+00 7.05418216888021532007e-01 1.31868257326362003923e+00 7.04512080539447915761e-01 1.31908839812591871521e+00 7.03141881060528439740e-01 1.31949343048188327820e+00 7.01087766068964390875e-01 1.31981483540579547231e+00 6.98488009758198025168e-01 1.32007932451351051029e+00 6.95659558755421403298e-01 1.32029368445015760081e+00 6.92553701314008618439e-01 1.32021070109181581920e+00 6.89359707941451849145e-01 1.31980300977651054950e+00 6.86390614651777197786e-01 1.31923869124448800427e+00 6.84021497787983934202e-01 1.31807299757971385645e+00 6.82442746554274504156e-01 1.31607158992872075309e+00 6.81452427719731024247e-01 1.31304112047083654247e+00 6.80763755227109412793e-01 1.30817917518937099075e+00 6.80769170447636629007e-01 1.30305033474876075239e+00 6.79954185209766359677e-01 1.29833959397249554257e+00 6.80089660254140415674e-01 1.29716112553211937453e+00 6.79935266209553690331e-01 1.29514145031985306034e+00 6.80434219743086377008e-01 1.29208932644398633016e+00 6.81239232614615275452e-01 1.29148605986925635314e+00 6.82127446914459922844e-01 1.29123711853512057601e+00 6.82327012699148083286e-01 1.29174673844408305357e+00 6.83880801902061796760e-01 1.29192390434198745020e+00 6.85848044411628166017e-01 1.29281664912786853350e+00 6.89426906115611637382e-01 1.29154920385765037416e+00 7.00035315636579502652e-01 1.26585595657906502254e+00
26 1.00000000000000000000e+00 7.25085147302979682316e-01 1.29925136690893561209e+00 6.96583453703073951502e-01 1.30959516340761772391e+00 6.93153834263119383863e-01 1.31364823770347505238e+00 6.92622755329056261075e-01 1.31584676790324728302e+00 6.92927236428149795344e-01 1.31695983157566942623e+00 6.93752444024005487933e-01 1.31815570726259134737e+00 6.95103105497157813808e-01 1.31830098770695780530e+00 6.96345863526496522411e-01 1.31794345112039823498e+00 6.97846437218558324211e-01 1.31761879308835050395e+00 6.98198873283411125534e-01 1.31838197552769442744e+00 6.98757634759712309425e-01 1.31922167011925894897e+00 6.99547316656937701040e-01 1.31792017159663976678e+00 6.99883519994229930106e-01 1.31812394210252281646e+00 6.98359458326825777164e-01 1.31944610747752899549e+00 6.99190417123736640548e-01 1.31830147544690023942e+00 6.98033658351764119132e-01 1.31671552454834750456e+00 6.97134451405767019416e-01 1.31549615150909171568e+00 6.94912848904980728904e-01 1.31153238095464597102e+00 6.92688638314207238977e-01 1.30978767788193350974e+00 6.89202192968094706771e-01 1.30634816051437696593e+00 6.86495028859926748055e-01 1.30289661974518611309e+00 6.84754301476803717286e-01 1.30003899094392405544e+00 6.83487378152360713912e-01 1.29790650566677356892e+00 6.82932788229016596304e-01 1.29615925831838296745e+00 6.82573445297327441317e-01 1.29465984732497751963e+00 6.82422903401190383832e-01 1.29392532766200551997e+00 6.82679803009735075570e-01 1.29380600048631433374e+00 6.83169899032143312922e-01 1.29402131401342246342e+00 6.84127340728590827013e-01 1.29462974166092248396e+00 6.85995653824571616219e-01 1.29503761262567551604e+00 6.89871184032804007913e-01 1.29318499240069240130e+00 7.00102906790137313742e-01 1.26719632457918129909e+00
27 1.00000000000000000000e+00 7.23452133827104049146e-01 1.29915696464887631123e+00 6.94324448825896278770e-01 1.30947396033858898257e+00 6.90307973550304265764e-01 1.31358852814569515566e+00 6.89308331641845017934e-01 1.31572100579027595479e+00 6.89222364795844422147e-01 1.31696001773627369147e+00 6.89590841212259886284e-01 1.31772374528036828600e+00 6.90094262525904111882e-01 1.31811863882865365483e+00 6.90551802995015062692e-01 1.31826154631268921413e+00 6.90969553650408907508e-01 1.31823762185075810116e+00 6.91286215611115362201e-01 1.31809400661543185684e+00 6.91535173034330097330e-01 1.31770718551145038511e+00 6.91581640251184848189e-01 1.31717302000049385491e+00 6.91609621687658715494e-01 1.31649726310165982035e+00 6.91456626903742987977e-01 1.31503197202989063896e+00 6.89922710846213149694e-01 1.31389139707306235039e+00 6.89263231320566771565e-01 1.31165256577852229469e+00 6.87610900174655759187e-01 1.30932627881402252612e+00 6.85679650280467067880e-01 1.30679291697527277805e+00 6.82818100439550712544e-01 1.30505211866426051870e+00 6.79518575133244095987e-01 1.30368778847916422237e+00 6.76356044043382231834e-01 1.30406263051535176167e+00 6.79867444991436586932e-01 1.30952756647157109171e+00 6.82102242727485319485e-01 1.31424179701899990214e+00 6.78730779055459088056e-01 1.31480841025548511602e+00 6.77662073615634574786e-01 1.31486695144064236196e+00 6.79335987657196271883e-01 1.31457472810123610074e+00 6.80809393122974171320e-01 1.31611864398399203147e+00 6.82169871874702460346e-01 1.31672147328285427115e+00 6.82847060974382191745e-01 1.31456561870727317576e+00 6.86317485771232083103e-01 1.31332832610788341476e+00 6.90318782982516587765e-01 1.30871463608186600069e+00 7.01033882104691752346e-01 1.27866546842852746302e+00
28 1.00000000000000000000e+00 7.19399097779991447688e-01 1.29895261792052507666e+00 6.88692537325430675921e-01 1.30943087907453281638e+00 6.83347305824867912172e-01 1.31382323338684581238e+00 6.81197341058780270195e-01 1.31628218774812100200e+00 6.80019406014362060020e-01 1.31777921583804835670e+00 6.79510535054936637422e-01 1.31864421219123939544e+00 6.79316416685733170944e-01 1.31947161347355268468e+00 6.78894085425355786612e-01 1.32000661650513650969e+00 6.78912058698276532631e-01 1.32043685350713602134e+00 6.78220285570316328005e-01 1.32153029903599117389e+00 6.78451382839897698673e-01 1.32184294663140100567e+00 6.79590744765708798525e-01 1.32110472156315172931e+00 6.78903549310553744434e-01 1.32177949332214517142e+00 6.77892288677962695509e-01 1.32242312758800295569e+00 6.77616169525379397065e-01 1.32191870955757417860e+00 6.78830003459358510831e-01 1.32154863626250729247e+00 6.79729826523723934528e-01 1.32248187112005211041e+00 6.79877854562469408073e-01 1.32244640352227027513e+00 6.79729423141301358768e-01 1.32172391051252979821e+00 6.79260125071455167500e-01 1.32095052739109730666e+00 6.78709942848272351767e-01 1.32077519323982173205e+00 6.78734800808479032952e-01 1.32080198436733220468e+00 6.79502609479701646933e-01 1.32102169229553734198e+00 6.79805019368962204496e-01 1.32077734271734814619e+00 6.80151220355703522991e-01 1.32027930556717598698e+00 6.80673655828534895917e-01 1.31977402900249884965e+00 6.81337739746161519250e-01 1.31929530991749244251e+00 6.82357893459567876882e-01 1.31870967557733820286e+00 6.83868031289887379209e-01 1.31760674610394068473e+00 6.86246772315303954493e-01 1.31557001755258129450e+00 6.90586207586673994641e-01 1.31044113240575055279e+00 7.01036095453724139581e-01 1.27996906924438036413e+00
29 1.00000000000000000000e+00 7.19313798972038287438e-01 1.29895116439875346614e+00 6.88564380208606219291e-01 1.30944127831262036032e+00 6.83190689524326599802e-01 1.31382605676442842935e+00 6.80987098846001281949e-01 1.31626768960479023640e+00 6.79796656186612779926e-01 1.31782648691183323919e+00 6.79058806106923817936e-01 1.31890577474406911485e+00 6.78551932962385473402e-01 1.31970961232036287925e+00 6.78188170125299638613e-01 1.32031491537074385789e+00 6.77933285073880842475e-01 1.32080320081245128350e+00 6.77730967940342932110e-01 1.32118265815445012912e+00 6.77580065884181292901e-01 1.32152832509833273456e+00 6.77377052557037617753e-01 1.32177199095810671281e+00 6.77204243932167937459e-01 1.32195989455646367716e+00 6.77047732892756992662e-01 1.32218420706539951937e+00 6.76922667104059572196e-01 1.32233996060290182051e+00 6.76956365242807223126e-01 1.32249859056915441968e+00 6.77020935886251340463e-01 1.32265376544458623798e+00 6.77072095655055550267e-01 1.32282278571514466670e+00 6.77205350214798662556e-01 1.32301031349792164171e+00 6.77489161780296389459e-01 1.32296248703290908466e+00 6.78058243855776954234e-01 1.32286983750294662165e+00 6.78245125033163365202e-01 1.32305654795629457077e+00 6.78656623023817018314e-01 1.32255980061034783546e+00 6.78981764843799462383e-01 1.32288703156838005626e+00 6.79658553537861309657e-01 1.32234601106624571898e+00 6.79962968659079014522e-01 1.32177399504573100941e+00 6.81088935365196657123e-01 1.32111045514285496694e+00 6.82197481320374610192e-01 1.32041786828028184786e+00 6.83727330300262114982e-01 1.31917083615766350668e+00 6.86147886759226555142e-01 1.31699675566984386599e+00 6.90522787697890993996e-01 1.31157302799246333613e+00 7.01043358663135385278e-01 1.28079415891610337574e+00
30 1.00000000000000000000e+00 7.19293748949471511978e-01 1.29895478520392670951e+00 6.88534326577833755145e-01 1.30944987279732361074e+00 6.83152497200251840326e-01 1.31383991108550834959e+00 6.80942844959178117392e-01 1.31628524866139851035e+00 6.79746609276842939096e-01 1.31784776779194245933e+00 6.79000916548481603385e-01 1.31893358848802488836e+00 6.78498597234596934058e-01 1.31972906765341968516e+00 6.78147936693245134698e-01 1.32032007848803245587e+00 6.77882446514555425665e-01 1.32079512518931330156e+00 6.77660197095645733256e-01 1.32117944693224287356e+00 6.77536961645359925299e-01 1.32148302664013561625e+00 6.77441025982480460321e-01 1.32171551109764506826e+00 6.77335888681099285158e-01 1.32184525007364639393e+00 6.77311513553577437818e-01 1.32199052657058357951e+00 6.77223873344579119227e-01 1.32215089868538804296e+00 6.77193756898220144969e-01 1.32228632747189100982e+00 6.77343173902166473255e-01 1.32238646681140070704e+00 6.77520830317221989247e-01 1.32248582987000529165e+00 6.77643246511213437344e-01 1.32269131503816739226e+00 6.77844372496487324042e-01 1.32264124758578449637e+00 6.78111879691515984092e-01 1.32266108723751218967e+00 6.78426065759895391416e-01 1.32269914537293220569e+00 6.78743055323083988029e-01 1.32262823368167747873e+00 6.79117676649930501753e-01 1.32246846811620444306e+00 6.79591752290484407695e-01 1.32220284958785039287e+00 6.80219479569774909677e-01 1.32179657478812884186e+00 6.81020244319955558865e-01 1.32127875774782332918e+00 6.82119804417004815811e-01 1.32049826479569976101e+00 6.83698375708645667004e-01 1.31926681848114113471e+00 6.86154466311253097288e-01 1.31702027817309619273e+00 6.90552113938801226389e-01 1.31160270778601706354e+00 7.01051567961920585326e-01 1.28080427577132116568e+00
31 1.00000000000000000000e+00 7.19301743923213554588e-01 1.29895502221165570766e+00 6.88546490047137749180e-01 1.30944954272869562573e+00 6.83169057865916751204e-01 1.31383869654827045714e+00 6.80964364851660897138e-01 1.31628318165152524699e+00 6.79774295875441691983e-01 1.31784490328108638835e+00 6.79038510814462981102e-01 1.31892725821953615828e+00 6.78547098182059937876e-01 1.31971864291431018046e+00 6.78204115377636029827e-01 1.32031913563453029425e+00 6.77958800448960174911e-01 1.32078719351974105400e+00 6.77783784267934286127e-01 1.32115786244557043005e+00 6.77658524233669345982e-01 1.32145464402383594482e+00 6.77575200836763369416e-01 1.32169364772808162201e+00 6.77529929176570733240e-01 1.32188836737928383513e+00 6.77523866641115746212e-01 1.32205496053638094089e+00 6.77550007303960311056e-01 1.32217803329974614712e+00 6.77604751909942182309e-01 1.32227744665034419036e+00 6.77696955701781900139e-01 1.32237568807687533301e+00 6.77904145667662216823e-01 1.32238013181500391191e+00 6.78053167047832361369e-01 1.32241874597006603409e+00 6.78182995281260914133e-01 1.32242823268794684743e+00 6.78405609457927050165e-01 1.32234405855547088038e+00 6.78624594844900452806e-01 1.32228520984283304252e+00 6.78885123104884136147e-01 1.32215717557063117127e+00 6.79240786707084653884e-01 1.32200213344947958838e+00 6.79693295527140084467e-01 1.32178161252660753000e+00 6.80294516573840657436e-01 1.32142628030393693983e+00 6.81072506074872019433e-01 1.32094518364761470686e+00 6.82157159515360267399e-01 1.32021304701998865028e+00 6.83717409655333563379e-01 1.31902670081984108030e+00 6.86162614310498408798e-01 1.31682439750862267935e+00 6.90551295252576413652e-01 1.31144919956698791097e+00 7.01045082603110492059e-01 1.28069586478272379182e+00
32 1.00000000000000000000e+00 7.19335286987787925206e-01 1.29895680223806286868e+00 6.88594077388378855709e-01 1.30944980050024839535e+00 6.83229175736347560388e-01 1.31383659241455719169e+00 6.81036364230143576037e-01 1.31627884110597892509e+00 6.79858342690407568831e-01 1.31783704393282952161e+00 6.79134263897332668414e-01 1.31891627306379422002e+00 6.78654796652783720567e-01 1.31970227842462528578e+00 6.78321425772145936151e-01 1.32029794419197310518e+00 6.78086145104432658215e-01 1.32076034588693969063e+00 6.77919296524411851834e-01 1.32112639506234774700e+00 6.77803627077710024729e-01 1.32142006218911189919e+00 6.77727028197694703060e-01 1.32165597639480947301e+00 6.77684551579501026630e-01 1.32184516936425588973e+00 6.77670953591495539570e-01 1.32199522880396180824e+00 6.77685015986410399513e-01 1.32211255150847173390e+00 6.77721188183714629005e-01 1.32219971378668055273e+00 6.77783771256762035406e-01 1.32225531751541369729e+00 6.77879219322616632937e-01 1.32230493497116174950e+00 6.77995649100608166471e-01 1.32229646056409211319e+00 6.78151311100701037482e-01 1.32229589674869751903e+00 6.78339416688481855466e-01 1.32225748261039743880e+00 6.78573372411095387946e-01 1.32218832838401012530e+00 6.78867043809343373439e-01 1.32207950796688411543e+00 6.79234301924298344844e-01 1.32192019904980084810e+00 6.79697797286153870822e-01 1.32169274422273752556e+00 6.80294889450315021229e-01 1.32136651828352147398e+00 6.81083162455519475209e-01 1.32089029149757930526e+00 6.82162589828388399305e-01 1.32016768137329409960e+00 6.83721708174869213792e-01 1.31898896809933363627e+00 6.86163908659927601619e-01 1.31679422818998603795e+00 6.90551168981638929800e-01 1.31142578207212867625e+00 7.01044443222183288889e-01 1.28067934630867208412e+00
33 1.00000000000000000000e+00 7.19339421509866849824e-01 1.29895695136079725174e+00 6.88599541700604556027e-01 1.30944990230116831142e+00 6.83235858477005963962e-01 1.31383639819748387900e+00 6.81044387387039207304e-01 1.31627758949647022391e+00 6.79867111395700329801e-01 1.31783549109641540120e+00 6.79143939559040510368e-01 1.31891347678173165292e+00 6.78664643062255268369e-01 1.31969999902593770891e+00 6.78332859697672096999e-01 1.32029526398614915905e+00 6.78098231959097019761e-01 1.32075748984689966825e+00 6.77931947361594344770e-01 1.32112295291555725818e+00 6.77816675750994690475e-01 1.32141524819108457933e+00 6.77741536809470357383e-01 1.32165049303172588147e+00 6.77699565928741032295e-01 1.32183979917142724325e+00 6.77686362719235990681e-01 1.32199096049355757643e+00 6.77699404918181369517e-01 1.32210957149330354810e+00 6.77737574580632440302e-01 1.32219909407541891255e+00 6.77800834130825702317e-01 1.32226247920589967677e+00 6.77890186233418345907e-01 1.32230043472046254749e+00 6.78008824920635966294e-01 1.32231321701711279637e+00 6.78159427957503280204e-01 1.32229966061363479746e+00 6.78348581887418422554e-01 1.32225777843078340368e+00 6.78583918851846878972e-01 1.32218285048037276219e+00 6.78876224674909933832e-01 1.32206799362727345226e+00 6.79241606134038389264e-01 1.32190206401440590867e+00 6.79703943371876784241e-01 1.32166759366589747771e+00 6.80299427165339420931e-01 1.32133581090978258210e+00 6.81085306733849704663e-01 1.32085736032263389994e+00 6.82163924642953611865e-01 1.32013453405170366750e+00 6.83721786675698828262e-01 1.31895753758895106778e+00 6.86163645196350757693e-01 1.31676592091045141508e+00 6.90550226833555380601e-01 1.31140210028633208417e+00 7.01043086875816956471e-01 1.28066196758629824437e+00
34 1.00000000000000000000e+00 7.19341317338157981709e-01 1.29895711936099433892e+00 6.88602168415802462498e-01 1.30944989879688278300e+00 6.83238854185475918968e-01 1.31383631155942959268e+00 6.81047688526282390953e-01 1.31627745843523991098e+00 6.79870787150206989935e-01 1.31783513864611823152e+00 6.79147776486621279624e-01 1.31891311204030148296e+00 6.78668801904217966481e-01 1.31969935683202099774e+00 6.78336959271976791541e-01 1.32029443614613595237e+00 6.78102260856474181594e-01 1.32075660250208581914e+00 6.77935877738754189004e-01 1.32112193317610993049e+00 6.77820447845392970443e-01 1.32141409703208734250e+00 6.77745021922610435539e-01 1.32164919022501892165e+00 6.77702724720588123297e-01 1.32183832665806533235e+00 6.77689170872946999857e-01 1.32198929054404090699e+00 6.77701860872205963382e-01 1.32210763121380270313e+00 6.77739684341245762766e-01 1.32219711665200945205e+00 6.77802738777177116170e-01 1.32226015618471381963e+00 6.77892250578111754677e-01 1.32229793180563892641e+00 6.78010599627160148728e-01 1.32231057024069031947e+00 6.78161590471109354539e-01 1.32229698879046164706e+00 6.78350697252385059777e-01 1.32225466858350415578e+00 6.78585784118085899586e-01 1.32217927446614580411e+00 6.78877973136519097253e-01 1.32206388105170646874e+00 6.79243291483025091182e-01 1.32189756810234460005e+00 6.79705410582481572845e-01 1.32166300873377107195e+00 6.80300537664419890937e-01 1.32133141950884458460e+00 6.81086920422091068872e-01 1.32085241442297851577e+00 6.82164802470141218294e-01 1.32012954609976951303e+00 6.83722586401059984063e-01 1.31895270973307354723e+00 6.86163698287930889919e-01 1.31676171748179959842e+00 6.90550130140324625039e-01 1.31139851638978699455e+00 7.01043018395998362990e-01 1.28065917632744441512e+00
