# tag norm n_up_hub[0] n_up_hub[1] n_up_hub[2] n_up_hub[3] n_up_hub[4] n_up_hub[5] n_up_hub[6] n_up_hub[7] n_up_hub[8] n_up_hub[9] n_up_hub[10] n_up_hub[11] n_up_hub[12] n_up_hub[13] n_up_hub[14] n_up_hub[15] n_up_hub[16] n_up_hub[17] n_up_hub[18] n_up_hub[19] n_up_hub[20] n_up_hub[21] n_up_hub[22] n_up_hub[23] n_up_hub[24] n_up_hub[25] n_up_hub[26] n_up_hub[27] n_up_hub[28] n_up_hub[29]
1 1.00000000000000000000e+00 4.25134420883340968800e-01 5.26510316293263169740e-01 6.51748350805217702142e-02 3.66309784456456788426e-01 5.57900073888933478727e-01 5.70378719290718705359e-01 2.29248846397290623189e-01 4.75873132058666548083e-01 2.63957990528761399229e-01 2.38869498418608133816e-01 3.89723744353539403029e-01 5.06519220625964994298e-01 5.18103762115829979962e-01 5.15885204200371760841e-01 5.44703670768943548630e-01 3.53535241229556873588e-01 5.57315673783242537809e-01 4.32391485057948055104e-01 4.37332040767401619696e-01 2.62484329106491831585e-01 4.65304289321197661611e-01 4.30755210928700837947e-01 7.24371278424040365707e-01 4.09242339088677298253e-01 8.69445326642151794516e-01 8.24596377542680336603e-01 8.82512630465352776454e-01 9.12778078946506421509e-01 2.46471666568582298273e-01 9.97170812766217218304e-01
2 1.00000000000000000000e+00 3.76430251772919111097e-01 6.01849045741705612755e-01 3.36261372828363450105e-02 5.92211167222733925186e-01 4.28329652209986089240e-01 5.26034066394785670973e-01 6.42646447538914450393e-02 4.02861174919075415435e-01 1.76659075143975677347e-02 1.26968472936137728724e-02 9.26182545659967271234e-01 6.34341890286136966814e-02 1.30100522254829251145e-02 9.60969406068214460070e-01 9.79302068085641241879e-01 8.64049307780222153319e-01 7.16158001829433565888e-01 4.08896304724529313646e-01 1.43045503726790448201e-02 4.06589336134496395769e-02 5.71494758081315556986e-01 3.90625279216487097944e-01 3.28074442954897280145e-02 9.68131345483802308038e-01 7.77708394407455316788e-01 9.95499242081392177184e-01 9.80818896214221469521e-01 8.38296351437471387591e-01 4.06681510041193294835e-01 9.95002524246997643864e-01
3 1.00000000000000000000e+00 2.26877642773652465902e-01 7.43989073357430918954e-01 1.73864877307648352245e-01 8.50746899116853749767e-01 1.27405422689955916127e-01 5.59291827715719502834e-01 1.21215739613209319558e-01 1.88032933632469978491e-01 9.33810150742324200646e-03 1.92100094503495161247e-01 5.65353688936755971461e-01 2.33499704628335941203e-01 4.72696791608088195957e-02 9.77633933670803423333e-01 9.34661603212091796067e-01 5.66035264472238730526e-01 5.47568928166472734809e-01 8.36480284844527521848e-01 9.74561617734134300051e-02 4.17212685760260035273e-02 4.39972716732157265174e-01 5.25845229961188875833e-01 2.58458503644911352648e-01 7.65833824937206086858e-01 6.95178941714541087649e-01 9.80823632886449581214e-01 9.40518145223912416242e-01 9.18323236095019312941e-01 5.57924419663818116355e-01 8.76578219481488951637e-01
4 1.00000000000000000000e+00 2.44304692582954674496e-01 7.31766268536473973860e-01 1.72952592767537383089e-01 8.18458264231612497852e-01 9.29009180088177372037e-02 4.90602596506415300492e-01 1.95298895990406395917e-01 2.32851198421174243602e-01 2.07511575675655840501e-02 1.45438477571121133058e-01 4.12326128853295115206e-01 3.97167928034744377452e-01 8.28122676678084701507e-02 9.82230060380555825006e-01 8.38687672679529483410e-01 4.92328264631118672767e-01 6.32957290794566085346e-01 7.16122443335933334119e-01 2.76642141867355750851e-01 1.46330132322729705718e-01 4.96289358041592076898e-01 4.57926091353474118417e-01 5.61866785890009934334e-01 5.58224484364756801114e-01 8.09685269047627720340e-01 9.80199332678794554852e-01 9.63125024140688346108e-01 8.45901273905795947350e-01 3.69048060141290878988e-01 8.34804927684207775940e-01
5 1.00000000000000000000e+00 2.36449578308472713184e-01 7.33912330150760294778e-01 1.55910436447885936140e-01 7.81959608641437764476e-01 1.16461453702289566281e-01 4.06102446805538919161e-01 2.47806613212274901015e-01 2.84505311113566750070e-01 3.69639857907957530836e-02 2.00859106962217953685e-01 2.83011670357472155946e-01 5.74553974574668946396e-01 1.14510606741053524993e-01 9.38109548589295072496e-01 6.44614148245086449052e-01 5.50505317252227177605e-01 6.23526759764064797409e-01 5.64966339924073968071e-01 4.23646607684177334274e-01 3.45332265657307679874e-01 5.34986440512225436272e-01 4.67011877416029785870e-01 6.04257956934794004944e-01 6.18897595249659149275e-01 5.92539361907510886418e-01 9.12582899359631327663e-01 8.99370762567227033379e-01 7.60127063156838200797e-01 4.54691114835293119789e-01 8.91826818136144061633e-01
6 1.00000000000000000000e+00 1.83864477466019193841e-01 7.33773252701613865057e-01 1.52746590378282087741e-01 6.34933376725414722053e-01 2.63378664660895878136e-01 3.90320284725678756654e-01 2.97800472358122958472e-01 3.33213944196408429210e-01 9.09355682690219796482e-02 6.30865027002192935157e-01 1.85165431740159980301e-01 7.80763724413802040480e-01 1.71018619413265737794e-01 7.55100134316088023034e-01 3.23326760013469882704e-01 6.26307002425330550111e-01 4.33492984759218769053e-01 6.04565428098618351527e-01 3.96722454379066169494e-01 5.50390303203643793672e-01 4.60382340987772142871e-01 6.21356105195786434514e-01 4.57789214315709402925e-01 7.30401170412647515739e-01 4.48392613225844283154e-01 7.72612153486128772073e-01 8.35442351942020211553e-01 7.52175737671969435461e-01 4.60050108096200116581e-01 9.22713703419549280405e-01
7 1.00000000000000000000e+00 1.74006398152797281398e-01 7.34544573018935831321e-01 1.52839303351226113437e-01 6.32664203848938067054e-01 2.62599726593785998130e-01 4.00753557495812096079e-01 3.33542488275273552034e-01 3.44534561887715529149e-01 1.98223602392621572887e-01 7.14713871513486309617e-01 1.74845597772643579493e-01 8.15910116080257874493e-01 2.23562178374760611721e-01 7.11654525326031572874e-01 2.39814021955794542951e-01 7.02969666720016927997e-01 3.20116191695497320779e-01 6.87220387723036507666e-01 3.29611508438920064457e-01 6.77361112283273225643e-01 3.55785235350425999012e-01 7.11731567420847199834e-01 3.76390645553454028516e-01 7.09562491546565476952e-01 5.29786407258189040448e-01 6.25711070093392884850e-01 7.51470237496685289358e-01 7.49923149999170424174e-01 4.18928104958360414400e-01 9.39223497422005948465e-01
8 1.00000000000000000000e+00 1.50965507657211367443e-01 7.30746482660775353857e-01 1.59363424449676466255e-01 6.18558395436192287598e-01 2.77419872573832548834e-01 4.12615966722953142476e-01 3.57352049178094488546e-01 3.61749126489332217815e-01 2.76600427768702250564e-01 6.28907182490125782337e-01 2.22532913814490751481e-01 7.63269507516636247502e-01 2.54520355888574023595e-01 7.20165731003972742208e-01 2.62063635444547915476e-01 7.22895597507602016840e-01 3.10148625384840559427e-01 6.96428065019608855124e-01 3.33903348971325009131e-01 6.77911433136650254383e-01 3.47196315454767368003e-01 6.85972478558934506410e-01 4.02751217642122349982e-01 6.53932130340806772040e-01 5.69214940984651418532e-01 5.94268672102346795505e-01 7.23535117250544090872e-01 7.57423545330950243049e-01 3.91359872975405642670e-01 9.36228060244263859957e-01
9 1.00000000000000000000e+00 1.50259554770567516080e-01 7.31497850378354130818e-01 1.59016446122775045868e-01 6.16837042843190852537e-01 2.77463565050212968011e-01 4.23631599188201424244e-01 3.69917051067179036838e-01 3.71960595344750566404e-01 3.29859911647162495907e-01 5.67308588316558393139e-01 2.76146631965348776649e-01 7.03529923878557506001e-01 2.81436777843719676540e-01 7.07947730870110203405e-01 2.89623923882676603814e-01 7.11848219799744108549e-01 3.26026429870479694806e-01 6.84138877667544109684e-01 3.51534611505473271187e-01 6.61888923007688867450e-01 3.81864625560052517450e-01 6.45736055400166208962e-01 4.68532857627377008480e-01 6.02025424272811027215e-01 6.23723535057749911559e-01 5.90765190181791077784e-01 6.41332748641646799292e-01 7.78516743787938558796e-01 3.49346187481467562730e-01 9.26282376968621479207e-01
10 1.00000000000000000000e+00 1.58865118746315620024e-01 7.32975214899456273265e-01 1.62858278663326999647e-01 6.35100584907203891127e-01 2.61103953827695078882e-01 4.78089253648103451599e-01 3.62386795420611140806e-01 3.84867301599697730907e-01 3.78794779560624406134e-01 4.83614211952064276812e-01 3.33283019883868880662e-01 6.27474037023627695397e-01 3.12004742079554586720e-01 6.74644026104406102640e-01 3.13734910125599952835e-01 6.88199207257578438046e-01 3.43319899006850559608e-01 6.68633792083381028881e-01 3.76939812122852269116e-01 6.43120204848140253340e-01 4.22414805699471984646e-01 6.17561003203027314434e-01 5.15653787802552665553e-01 5.76011294377100191433e-01 6.27869379061907983974e-01 6.00102061157925192880e-01 5.84738586119406877906e-01 7.92886347640046396101e-01 3.24338409765414115160e-01 9.18415181412136072403e-01
11 1.00000000000000000000e+00 1.62731363644652071709e-01 7.32892745906571163594e-01 1.61439716244049763505e-01 6.46682767797840174495e-01 2.55894125105317671309e-01 4.98619877404440470237e-01 3.60979904715734933873e-01 4.03395504609952104680e-01 3.98037848289330142837e-01 4.57133862173351390723e-01 3.72641688215339272894e-01 5.75617412619689239328e-01 3.47950335073408945075e-01 6.33366210186349198885e-01 3.48441087094361390264e-01 6.53096446146837150692e-01 3.73187496266328411210e-01 6.41666219826179218266e-01 4.14000533434906059504e-01 6.16587264422926106811e-01 4.74103795687283002813e-01 5.89325396005517143649e-01 5.59576267501775470592e-01 5.69084815670561017242e-01 6.16658360000807426182e-01 6.58379915013128758083e-01 4.79783329415265469287e-01 8.28487367394510787477e-01 2.81996039157373534767e-01 8.88242304976159413599e-01
12 1.00000000000000000000e+00 1.87011814718513746936e-01 7.35735972821722650217e-01 1.67449050044502750767e-01 6.96176291613282649529e-01 2.18995523108943129786e-01 6.05386578127859231735e-01 3.02431257154924471031e-01 4.68666943040176642299e-01 3.87691831178320955864e-01 4.20127862925466888377e-01 4.21410907046862959202e-01 4.84377540469566603143e-01 4.05849614918283363441e-01 5.56434513940295638612e-01 3.99283780564341661545e-01 5.95781334519131067218e-01 4.16373533733333689444e-01 5.99615879172002985698e-01 4.56360692893803376879e-01 5.85223860403275675246e-01 5.12083298424580335428e-01 5.66813109046989116457e-01 5.67260410977436846380e-01 5.74867804813722016455e-01 5.71506526917395230036e-01 6.79968294124145833379e-01 4.31995406294244155276e-01 8.34415677415672685235e-01 2.72336281669073643208e-01 8.78368407922101468444e-01
13 1.00000000000000000000e+00 2.02336121147617731264e-01 7.32877306484126744834e-01 1.71712970803275660758e-01 7.24396590134775975045e-01 2.05554893208901995338e-01 6.63057350566438108430e-01 2.73758445827104457404e-01 5.77369013368204675452e-01 3.53637834697178021770e-01 5.11300658267642926802e-01 4.21034331890105417706e-01 4.97371461017813543126e-01 4.54786289807699750654e-01 5.13213745728404724389e-01 4.71447720248140023092e-01 5.33004531584921448228e-01 4.86736478356354029806e-01 5.48831831747785381381e-01 4.96621384521185538219e-01 5.69276611802006171636e-01 4.85924831675448531954e-01 6.17184835539977938446e-01 4.44011331244396734164e-01 7.11460174552471791287e-01 3.58386220485250261980e-01 8.08231981422864897979e-01 2.86126606107784065003e-01 8.21914998868792157083e-01 2.60191120595042124641e-01 7.98242328298348513549e-01
14 1.00000000000000000000e+00 2.42189954885171754295e-01 7.18659498928222228997e-01 2.04609260528173880767e-01 7.37085655008278606282e-01 1.97428912531664391139e-01 7.27586744288023723470e-01 2.17201980231258889864e-01 6.93208820587799312563e-01 2.63472455592571097593e-01 6.44468541320706300723e-01 3.24748213154577858308e-01 6.02447467030438832403e-01 3.76995915833494010805e-01 5.89084957726255797894e-01 4.02195033566608739495e-01 5.95111508625086327307e-01 4.08404903337793556695e-01 6.11231162114604820168e-01 4.02925163172222489116e-01 6.39062453570042321438e-01 3.82476347084044043800e-01 6.90463017788088384563e-01 3.38626045094184646711e-01 7.55088121141289869698e-01 2.90715089269115933845e-01 8.09774791199794452545e-01 2.61451806038113743202e-01 8.20659208581957400064e-01 2.68787075696093724630e-01 7.83839896074440600771e-01
15 1.00000000000000000000e+00 2.53851137730081943822e-01 7.12467523707886907225e-01 2.14322758263030765935e-01 7.35436102991390394656e-01 2.04447103489483805738e-01 7.37511377589464722782e-01 2.13688716157813735075e-01 7.24631053108491740566e-01 2.40368643202820808646e-01 7.02097088671835733997e-01 2.75765160618702764861e-01 6.81823361789225201868e-01 3.06601449160480099554e-01 6.76440765879920080650e-01 3.20054368790001098066e-01 6.79954507997158175137e-01 3.24658451881719545273e-01 6.99130623597437605987e-01 3.13313846677217455738e-01 7.28837662708152089763e-01 2.93522386627697751127e-01 7.63932729977731872495e-01 2.69842728507330653631e-01 7.89764650720112593163e-01 2.65112113635710300308e-01 7.93685726851043327201e-01 2.78897691980192707906e-01 7.69382368271083860733e-01 2.92463452179023863930e-01 7.37994447237737327683e-01
16 1.00000000000000000000e+00 3.06868334802191389254e-01 6.81881175818587981219e-01 2.79319244583827341888e-01 6.96531331532657449479e-01 2.51856410662871232908e-01 7.19120438577504850208e-01 2.43945109891414879666e-01 7.26575833007908733485e-01 2.32611307660612942616e-01 7.34292496570279729085e-01 2.31521701628124410011e-01 7.40080588250130455563e-01 2.37925220501449791177e-01 7.43058400704171728712e-01 2.45709428579040156659e-01 7.44074272430891747732e-01 2.54191436396844439027e-01 7.50544617700953708983e-01 2.56772064996482640709e-01 7.60443407964891626705e-01 2.57583801395998068795e-01 7.71409018786795130929e-01 2.58000508181674637065e-01 7.77940526794718811843e-01 2.64921650782412865244e-01 7.74437288920049815566e-01 2.81509306659542379858e-01 7.54923570193011261864e-01 3.04015121850381098145e-01 7.17936384174468256170e-01
17 1.00000000000000000000e+00 3.25477487705680579300e-01 6.69881914295487157496e-01 2.99377639981351695297e-01 6.84830337765503949221e-01 2.83894699886919732457e-01 6.99472019406710776579e-01 2.73107392652681191247e-01 7.10857886111707526489e-01 2.63043943311404349039e-01 7.22588584689896951119e-01 2.57029487994032801446e-01 7.33259166509188653471e-01 2.53768853772989633200e-01 7.42306121634232818352e-01 2.56898425917189587864e-01 7.44795004449874786800e-01 2.62515130993428880135e-01 7.44558807001081790489e-01 2.69846139566306153501e-01 7.41879412555166650733e-01 2.83122786078660482190e-01 7.31692482338699989874e-01 2.95189272950614534086e-01 7.20453859601943968904e-01 3.17626365546499256354e-01 6.97586671865175644847e-01 3.29720754683488603831e-01 6.83735435376323974488e-01 3.36626239931077597678e-01 6.64857675426684946451e-01
18 1.00000000000000000000e+00 3.50381972480974024364e-01 6.54626545495918032991e-01 3.33270118341663423855e-01 6.60864201491051517223e-01 3.28215428476077819564e-01 6.65358229164093040175e-01 3.19706539382721977027e-01 6.72760448604733385380e-01 3.10497056530930348739e-01 6.81230321062465837834e-01 3.03600790530463904293e-01 6.89930767633547881168e-01 2.98144842934349674213e-01 6.97273329516465811828e-01 2.95434668637489405985e-01 7.02689587268589876956e-01 2.96599812719481437107e-01 7.04659577169487461035e-01 2.99888241382262443757e-01 7.04202766181399764100e-01 3.05783217838986320913e-01 7.00746155990653707413e-01 3.13767340903690294951e-01 6.94705515542174967258e-01 3.24281226789494503304e-01 6.85066004801903383203e-01 3.33598919986167474772e-01 6.75104139303549954931e-01 3.42477724765124225126e-01 6.55134509074062232337e-01
19 1.00000000000000000000e+00 3.53346242101896246268e-01 6.52875093457773503225e-01 3.36047909593524651850e-01 6.59812281494670083148e-01 3.31437736244060754398e-01 6.63655484455948352362e-01 3.26775125553286915903e-01 6.68151993817755918137e-01 3.22875369975683446100e-01 6.72629212633625517270e-01 3.20443409999488559858e-01 6.76289186467869396502e-01 3.19044265839970309084e-01 6.79086829202096176061e-01 3.18960609116804572061e-01 6.80828431514852061568e-01 3.20360140543326787910e-01 6.81134681827255894504e-01 3.22796356031493814065e-01 6.80174416739991460901e-01 3.25992418795474581117e-01 6.78176480743391429939e-01 3.30070269220511747221e-01 6.74917088339552218024e-01 3.35226897994848060947e-01 6.70481590925387171964e-01 3.42741954131183967913e-01 6.62136059987131653237e-01 3.47498280476255583249e-01 6.46034182774868792620e-01
20 1.00000000000000000000e+00 3.58823052855124169369e-01 6.49947289360400692892e-01 3.43304779929211434375e-01 6.55296284514612192851e-01 3.40258740289880678986e-01 6.57895075177971078162e-01 3.39330677450987494570e-01 6.58691546228048596667e-01 3.38396213039611981621e-01 6.60055626123332572774e-01 3.37043670975242681820e-01 6.61056360617717997386e-01 3.35693262961793581489e-01 6.62580649562658052787e-01 3.34715793129868488531e-01 6.64057257140371115511e-01 3.34314436238345558117e-01 6.65352894079021428553e-01 3.34489544130273042111e-01 6.66208261373042121001e-01 3.35214560153084872862e-01 6.66416667640087001523e-01 3.36705352424223280927e-01 6.65796033211060067636e-01 3.39273240975285828025e-01 6.63892716606794941470e-01 3.42945469459441876214e-01 6.59836080298299654245e-01 3.48961009198830385269e-01 6.43447454855387568351e-01
21 1.00000000000000000000e+00 3.59258166218378027779e-01 6.49737142344291029872e-01 3.43814488139490115337e-01 6.55093203555926151260e-01 3.41111412280865111679e-01 6.57364413950697668021e-01 3.40066034687452722896e-01 6.58610880947764543158e-01 3.39555770938000933690e-01 6.59415022858214627810e-01 3.39261649458821201719e-01 6.60028964587453970125e-01 3.39190097607686535941e-01 6.60483851116358655631e-01 3.39368084156912275251e-01 6.60730662459027673350e-01 3.39705696738691331760e-01 6.60786736082310199869e-01 3.40218996540297413667e-01 6.60621237116965076552e-01 3.40871351157813806676e-01 6.60206123557154356263e-01 3.41866023439031330167e-01 6.59404086160193081412e-01 3.42844446981352468651e-01 6.58556925590418784644e-01 3.45195394620114726081e-01 6.55773669601472319890e-01 3.50391805061372407781e-01 6.40467662045502761359e-01
22 1.00000000000000000000e+00 3.59749978299274686400e-01 6.49502911249478565026e-01 3.44456186294115007662e-01 6.54738006450421350380e-01 3.41864010827106323820e-01 6.56908095839367711655e-01 3.40878403717445876975e-01 6.58092658712579936520e-01 3.40419380584832897974e-01 6.58822668916801079675e-01 3.40210219203257668852e-01 6.59283799381120028116e-01 3.40156736139251292261e-01 6.59589405430882513848e-01 3.40219012446524526894e-01 6.59766011556172649044e-01 3.40393825666676530517e-01 6.59836475287966961467e-01 3.40698738200665152132e-01 6.59791496006111422012e-01 3.41170645056133481354e-01 6.59593697437037440601e-01 3.41902412146154965900e-01 6.59137843234873455067e-01 3.43086124779448442546e-01 6.58154166905970949841e-01 3.45253756799821287515e-01 6.55564439334870296960e-01 3.50490697635036096980e-01 6.40268196460525906843e-01
23 1.00000000000000000000e+00 3.59811681967220242662e-01 6.49471813993488189531e-01 3.44535683889891086729e-01 6.54690142931471430465e-01 3.41956217781327898031e-01 6.56845596643839679807e-01 3.40975379458484217920e-01 6.58018782519065315029e-01 3.40518596891020430828e-01 6.58738790727420364668e-01 3.40311614470192758120e-01 6.59204134782921835622e-01 3.40257831477106642559e-01 6.59503361481619587714e-01 3.40321010184254368891e-01 6.59677880068942679159e-01 3.40494472570423589719e-01 6.59742295081515939259e-01 3.40793215479700706272e-01 6.59689739945999997772e-01 3.41258060727818834934e-01 6.59483608534398912937e-01 3.41978917024909456757e-01 6.59027328492334030230e-01 3.43153221773113636939e-01 6.58046228982748226954e-01 3.45308958354561268411e-01 6.55466876017868016469e-01 3.50527407713849437076e-01 6.40191150032501155032e-01
24 1.00000000000000000000e+00 3.59823381757316151930e-01 6.49465641870035303995e-01 3.44549790103931663499e-01 6.54681072602678382211e-01 3.41970896807752944291e-01 6.56834996820462646561e-01 3.40989835733969848253e-01 6.58007562726546924026e-01 3.40532952722585269267e-01 6.58727137975445353746e-01 3.40325866464210757822e-01 6.59191997243279037555e-01 3.40272129314624860452e-01 6.59490611078678012902e-01 3.40335501124653660998e-01 6.59664262544917057163e-01 3.40508996683044129483e-01 6.59727838030436775085e-01 3.40807526149388251291e-01 6.59674293133772349229e-01 3.41272244966031534918e-01 6.59467441335885307119e-01 3.41991808301931987657e-01 6.59010716119060258045e-01 3.43164296984268646362e-01 6.58029970497872374047e-01 3.45318260389360642826e-01 6.55451310763759287248e-01 3.50533890639038892001e-01 6.40177769115115591347e-01
25 1.00000000000000000000e+00 3.59827326731599894671e-01 6.49463516310487931626e-01 3.44554236896164545190e-01 6.54678176788657695262e-01 3.41975621294277276618e-01 6.56831556766968138739e-01 3.40994665749602188232e-01 6.58003655215664506883e-01 3.40537630949563130400e-01 6.58723087363667358929e-01 3.40330547139766292908e-01 6.59187788561972798362e-01 3.40276758987676064550e-01 6.59486292074683788655e-01 3.40340103247930847452e-01 6.59659837992803144147e-01 3.40513599420285584252e-01 6.59723227866895634008e-01 3.40812071980671094096e-01 6.59669498683425170604e-01 3.41276727768587972989e-01 6.59462452889151173885e-01 3.41996159942902555606e-01 6.59005510118772508399e-01 3.43168326284796931791e-01 6.58024564627002872541e-01 3.45321747990179839238e-01 6.55445931346740895407e-01 3.50536391210115261252e-01 6.40172987798985793084e-01
