# tag norm BO
0 1.00000000000000000000e+00 2.86317304216062495925e-01
0.050000 1.00000000000000044409e+00 2.53187330260777998525e-01
0.100000 1.00000000000000000000e+00 1.77194052236391563770e-01
0.150000 9.99999999999998556710e-01 6.83860698612036160826e-02
0.200000 9.99999999999997890576e-01 -4.42337525970840222955e-02
0.250000 9.99999999999997446487e-01 -1.23282057638475564532e-01
0.300000 9.99999999999998556710e-01 -1.65643350620893581304e-01
0.350000 1.00000000000000022204e+00 -1.45551907908728461738e-01
0.400000 9.99999999999999111822e-01 -7.77308674004059396712e-02
0.450000 9.99999999999997002398e-01 2.16433630276453257968e-02
0.500000 9.99999999999994781952e-01 1.36891053199544449059e-01
0.550000 9.99999999999995448086e-01 2.22883111025986485609e-01
0.600000 9.99999999999995226041e-01 2.72467686182888191304e-01
0.650000 9.99999999999994892974e-01 2.64151145389385555440e-01
0.700000 9.99999999999996669331e-01 2.02294628325941666658e-01
0.750000 9.99999999999994226840e-01 1.11505106176102222748e-01
0.800000 9.99999999999993005595e-01 6.13985622821643919553e-04
0.850000 9.99999999999994337863e-01 -8.65637907099562897706e-02
0.900000 9.99999999999995448086e-01 -1.40233925465479358774e-01
0.950000 9.99999999999995448086e-01 -1.47150509084094438528e-01
1.000000 9.99999999999992228439e-01 -9.70025565842192044608e-02
1.050000 9.99999999999994226840e-01 -1.71642355405093212373e-02
1.100000 9.99999999999996891376e-01 8.71970169563537761404e-02
1.150000 9.99999999999995781153e-01 1.78727501937809979404e-01
1.200000 9.99999999999996447286e-01 2.35195927458052400638e-01
1.250000 9.99999999999996114219e-01 2.51037880757321751890e-01
1.300000 9.99999999999997002398e-01 2.10436489623040040575e-01
1.350000 9.99999999999999222844e-01 1.40381701991835361465e-01
1.400000 9.99999999999996336264e-01 4.78789025966838074910e-02
1.450000 9.99999999999997002398e-01 -4.15576440601121144258e-02
1.500000 9.99999999999995448086e-01 -9.89714426031363114777e-02
1.550000 9.99999999999991007194e-01 -1.26267833765100701005e-01
1.600000 9.99999999999990452082e-01 -1.01772202569739261824e-01
1.650000 9.99999999999989119814e-01 -4.22887030053113593953e-02
1.700000 9.99999999999987787547e-01 3.83477720343029029881e-02
1.750000 9.99999999999988897770e-01 1.25777418906364346629e-01
1.800000 9.99999999999987676524e-01 1.84143393289868839702e-01
1.850000 9.99999999999991229238e-01 2.14574835724481383092e-01
1.900000 9.99999999999991229238e-01 2.00744021739169331564e-01
1.950000 9.99999999999992783550e-01 1.51194739688082474549e-01
2.000000 9.99999999999992228439e-01 8.51196006879095801168e-02
2.050000 9.99999999999991451283e-01 5.33018212085026310554e-03
2.100000 9.99999999999988897770e-01 -5.34299211930899936585e-02
2.150000 9.99999999999987676524e-01 -8.92811937264061245001e-02
2.200000 9.99999999999986011190e-01 -9.17932989579279684511e-02
2.250000 9.99999999999988453681e-01 -5.42677099921358430112e-02
2.300000 9.99999999999988009591e-01 1.81778160948706138215e-04
2.350000 9.99999999999983790744e-01 7.09232326723331502061e-02
2.400000 9.99999999999985345056e-01 1.28575021326915311937e-01
2.450000 9.99999999999985123011e-01 1.63125716850017171700e-01
2.500000 9.99999999999986899368e-01 1.73165329318047733764e-01
2.550000 9.99999999999989563904e-01 1.46007061492331113861e-01
2.600000 9.99999999999988009591e-01 1.04025643900612738135e-01
2.650000 9.99999999999988231636e-01 4.56627782362288639484e-02
2.700000 9.99999999999986899368e-01 -1.11051449145553246534e-02
2.750000 9.99999999999986788346e-01 -4.77172838947269931098e-02
2.800000 9.99999999999983901766e-01 -6.87288345100492692463e-02
2.850000 9.99999999999983457677e-01 -5.54177723511844119719e-02
2.900000 9.99999999999982902565e-01 -2.29136455708086224370e-02
2.950000 9.99999999999980904164e-01 2.33472951840716126670e-02
3.000000 9.99999999999982014387e-01 7.50811425445497421238e-02
3.050000 9.99999999999983790744e-01 1.08757255412169975828e-01
3.100000 9.99999999999984234833e-01 1.31733760167847407940e-01
3.150000 9.99999999999984456878e-01 1.28235517093225254159e-01
3.200000 9.99999999999983790744e-01 1.04862411899728016906e-01
3.250000 9.99999999999985789145e-01 7.12453498621821446068e-02
3.300000 9.99999999999987565502e-01 2.41163120460301527714e-02
3.350000 9.99999999999983901766e-01 -1.11776293319233166468e-02
3.400000 9.99999999999981126209e-01 -3.83265376847342492672e-02
3.450000 9.99999999999979127807e-01 -4.69639623180436727168e-02
3.500000 9.99999999999979127807e-01 -3.22479779275311670417e-02
3.550000 9.99999999999979793941e-01 -9.03160157915255598637e-03
3.600000 9.99999999999978017584e-01 2.91268381713107316067e-02
3.650000 9.99999999999979127807e-01 6.10212047892097694812e-02
3.700000 9.99999999999979571896e-01 8.56736992005737579836e-02
3.750000 9.99999999999980682119e-01 1.00906098405616095892e-01
3.800000 9.99999999999981126209e-01 9.35388197456947095842e-02
3.850000 9.99999999999980793142e-01 7.89744178655606282602e-02
3.900000 9.99999999999979904963e-01 4.89497992185228339435e-02
3.950000 9.99999999999979238829e-01 1.63943784234373453323e-02
4.000000 9.99999999999978794740e-01 -8.68472214940012830764e-03
4.050000 9.99999999999976796339e-01 -3.03270696264872144376e-02
4.100000 9.99999999999978572696e-01 -3.13222494748142815668e-02
4.150000 9.99999999999976574294e-01 -2.36732359766770109055e-02
4.200000 9.99999999999976352250e-01 -3.78579808482269915271e-03
4.250000 9.99999999999972799536e-01 2.42696355749728413798e-02
4.300000 9.99999999999972577491e-01 4.54775448647586136297e-02
4.350000 9.99999999999971911357e-01 6.84238589223464532818e-02
4.400000 9.99999999999973021581e-01 7.58491068597663548045e-02
4.450000 9.99999999999975242027e-01 7.24377204141382347036e-02
4.500000 9.99999999999971689313e-01 6.04979233928940596243e-02
4.550000 9.99999999999973021581e-01 3.48745161992905366999e-02
4.600000 9.99999999999972577491e-01 1.38770067042899587079e-02
4.650000 9.99999999999974353848e-01 -9.35332016338538685396e-03
4.700000 9.99999999999973909759e-01 -2.29756833429433163229e-02
4.750000 9.99999999999975019982e-01 -2.39754776677444624011e-02
4.800000 9.99999999999976796339e-01 -1.99136654232887032323e-02
4.850000 9.99999999999976352250e-01 -4.92540201495585269406e-04
4.900000 9.99999999999975242027e-01 1.74349009824191283902e-02
4.950000 9.99999999999975019982e-01 3.75057689464600926832e-02
5.000000 9.99999999999975464071e-01 5.50800528010401621581e-02
5.050000 9.99999999999975686116e-01 5.84639362574169915709e-02
5.100000 9.99999999999977906562e-01 5.85833668987242664472e-02
5.150000 9.99999999999977906562e-01 4.45166020460009623227e-02
5.200000 9.99999999999979238829e-01 2.72459906221453641850e-02
5.250000 9.99999999999981015186e-01 1.00168885772790039468e-02
5.300000 9.99999999999981459275e-01 -9.44753013245927704411e-03
5.350000 9.99999999999980571097e-01 -1.60221433480770593383e-02
5.400000 9.99999999999983457677e-01 -2.01239866513455191444e-02
5.450000 9.99999999999983901766e-01 -1.29616995295494513013e-02
5.500000 9.99999999999985234034e-01 1.79444519391637902911e-03
5.550000 9.99999999999983124610e-01 1.46771345807580090581e-02
5.600000 9.99999999999982680521e-01 3.36632354239934997175e-02
5.650000 9.99999999999982569499e-01 4.24772182602829659337e-02
5.700000 9.99999999999982791543e-01 4.69314018641629887574e-02
5.750000 9.99999999999982125409e-01 4.49724966312314775041e-02
5.800000 9.99999999999981126209e-01 3.26246877468783294529e-02
5.850000 9.99999999999981792342e-01 2.26475538652667757189e-02
5.900000 9.99999999999982236432e-01 6.04760278110843315508e-03
5.950000 9.99999999999981792342e-01 -4.76683467967209655719e-03
6.000000 9.99999999999980460075e-01 -1.01552556176179482883e-02
6.050000 9.99999999999980015986e-01 -1.34510069778319800438e-02
6.100000 9.99999999999979016785e-01 -4.50105419269635279034e-03
6.150000 9.99999999999979904963e-01 2.65843517410316873897e-03
6.200000 9.99999999999981237231e-01 1.49943493256597115693e-02
6.250000 9.99999999999983679722e-01 2.68800275278914466148e-02
6.300000 9.99999999999984123811e-01 3.13907592993737591391e-02
6.350000 9.99999999999981015186e-01 3.68806267222449163379e-02
6.400000 9.99999999999983901766e-01 3.20327072112419966587e-02
6.450000 9.99999999999982125409e-01 2.69578889732823047398e-02
6.500000 9.99999999999982569499e-01 1.90210040926787928017e-02
6.550000 9.99999999999983013588e-01 7.17204139480341704843e-03
6.600000 9.99999999999982458476e-01 2.70427394025675622846e-03
6.650000 9.99999999999980904164e-01 -4.63215923511450366340e-03
6.700000 9.99999999999981126209e-01 -4.20247071243825317394e-03
6.750000 9.99999999999981570298e-01 -4.87512750158031454156e-04
6.800000 9.99999999999980015986e-01 2.61211661123195030068e-03
6.850000 9.99999999999980460075e-01 1.26538225388961138307e-02
6.900000 9.99999999999979571896e-01 1.68679810056375396876e-02
6.950000 9.99999999999980015986e-01 2.33612328215193135184e-02
7.000000 9.99999999999980460075e-01 2.68040932993811320539e-02
7.050000 9.99999999999980349052e-01 2.50753969111443264506e-02
7.100000 9.99999999999981237231e-01 2.57144151169646055510e-02
7.150000 9.99999999999981681320e-01 1.81011243023998444346e-02
7.200000 9.99999999999981348253e-01 1.36213791833986828245e-02
7.250000 9.99999999999981348253e-01 8.12971928077282045277e-03
7.300000 9.99999999999981126209e-01 1.15595889490458501349e-03
7.350000 9.99999999999980015986e-01 1.19832056034512761736e-03
7.400000 9.99999999999981348253e-01 -2.10886954826446483893e-03
7.450000 9.99999999999980682119e-01 1.25851926542867604414e-03
7.500000 9.99999999999979904963e-01 5.62307243837319430807e-03
7.550000 9.99999999999977240428e-01 9.36264095371716446869e-03
7.600000 9.99999999999977240428e-01 1.80538633321016307731e-02
7.650000 9.99999999999976463272e-01 2.04840309934103403933e-02
7.700000 9.99999999999978905763e-01 2.55569790008191230490e-02
7.750000 9.99999999999980238030e-01 2.59055916520966357519e-02
7.800000 9.99999999999979904963e-01 2.14153386744098360450e-02
7.850000 9.99999999999977906562e-01 1.91568009686534160285e-02
7.900000 9.99999999999976907361e-01 9.77584540687856558272e-03
7.950000 9.99999999999975464071e-01 4.65862415564149284775e-03
8.000000 9.99999999999975686116e-01 -9.31188586109330342956e-04
8.050000 9.99999999999974464870e-01 -5.38280339823868705929e-03
8.100000 9.99999999999972466469e-01 -2.19434420898534160091e-03
8.150000 9.99999999999970690112e-01 -7.71192031897765541658e-04
8.200000 9.99999999999968469666e-01 7.92590208755320803358e-03
8.250000 9.99999999999970468068e-01 1.55088634078808049882e-02
8.300000 9.99999999999969135800e-01 2.14199223490227873279e-02
8.350000 9.99999999999968691711e-01 2.87189009102248420102e-02
8.400000 9.99999999999968469666e-01 2.66657390979252624519e-02
8.450000 9.99999999999968469666e-01 2.54170918241473989263e-02
8.500000 9.99999999999967914555e-01 1.85622710572619885327e-02
8.550000 9.99999999999969912956e-01 8.74513727132352446103e-03
8.600000 9.99999999999968247621e-01 2.62012379167047334411e-03
8.650000 9.99999999999969579889e-01 -6.41500601876075684377e-03
8.700000 9.99999999999967803532e-01 -6.91604640698383760222e-03
8.750000 9.99999999999967137398e-01 -5.46221491515517815901e-03
8.800000 9.99999999999968025577e-01 -2.77866689752845103141e-04
8.850000 9.99999999999968025577e-01 1.08020775417154452774e-02
8.900000 9.99999999999968247621e-01 1.71932601539388531242e-02
8.950000 9.99999999999969579889e-01 2.66735564995432723745e-02
9.000000 9.99999999999969135800e-01 2.94586286647484894841e-02
9.050000 9.99999999999970246023e-01 2.72865579552495872429e-02
9.100000 9.99999999999968913755e-01 2.41401236916057200521e-02
9.150000 9.99999999999967359443e-01 1.30348250190873791304e-02
9.200000 9.99999999999968247621e-01 5.62563263641336751969e-03
9.250000 9.99999999999970690112e-01 -3.23855687810262367343e-03
9.300000 9.99999999999972022380e-01 -8.36026562141156150132e-03
9.350000 9.99999999999973576692e-01 -5.98858381056801853531e-03
9.400000 9.99999999999973798737e-01 -3.73683038600177135774e-03
9.450000 9.99999999999973132603e-01 6.71177017953521540261e-03
9.500000 9.99999999999974242826e-01 1.49484647292031924692e-02
9.550000 9.99999999999974020781e-01 2.23338165043720782155e-02
9.600000 9.99999999999973798737e-01 2.91433055221571556126e-02
9.650000 9.99999999999976019183e-01 2.67640785883186613225e-02
9.700000 9.99999999999974797937e-01 2.48730460224562202609e-02
9.750000 9.99999999999971578291e-01 1.64729987849383946452e-02
9.800000 9.99999999999972022380e-01 7.16643227442683751482e-03
9.850000 9.99999999999970690112e-01 1.03720685295785293792e-03
9.900000 9.99999999999969912956e-01 -6.32406998598334258582e-03
9.950000 9.99999999999969246822e-01 -4.53982727970841243303e-03
10.000000 9.99999999999968580688e-01 -2.10543088015591271095e-03
