# tag norm j_0
14.100000 1.00000000000001509903e+00 1.22488709329880471333e-01
14.100000 1.00000000000001509903e+00 -5.71057892167060182631e-03
14.100000 1.00000000000001509903e+00 -6.18081374485332096791e-02
14.100000 1.00000000000001509903e+00 -4.70657132610642139903e-02
14.100000 1.00000000000001509903e+00 5.26032656587495997536e-02
14.100000 1.00000000000001509903e+00 2.22226554849824058102e-02
14.100000 1.00000000000001509903e+00 -5.10026578567706265210e-02
14.100000 1.00000000000001509903e+00 1.75519918897637274002e-02
14.100000 1.00000000000001509903e+00 5.57746877316381197559e-03
14.100000 1.00000000000001509903e+00 -6.22254033036003569718e-03
14.100000 1.00000000000001509903e+00 5.12139640074124515706e-03
14.100000 1.00000000000001509903e+00 1.80402085598231134989e-02
14.100000 1.00000000000001509903e+00 -5.04353517549970820077e-02
14.100000 1.00000000000001509903e+00 2.11173945865604020811e-02
14.100000 1.00000000000001509903e+00 5.33143443386547080665e-02
14.100000 1.00000000000001509903e+00 -4.66422710449866592675e-02
14.100000 1.00000000000001509903e+00 -6.15581889112058813773e-02
14.100000 1.00000000000001509903e+00 -5.38358665264292417935e-03
14.100000 1.00000000000001509903e+00 1.24707903524938962248e-01
