# tag norm j_0
27.400000 1.00000000000029398706e+00 6.01073288255082573616e-05
27.400000 1.00000000000029398706e+00 -4.55746411689556946676e-06
27.400000 1.00000000000029398706e+00 -1.39622492734329980675e-04
27.400000 1.00000000000029398706e+00 -3.77984520232612893412e-04
27.400000 1.00000000000029398706e+00 -3.18584830186925942880e-04
27.400000 1.00000000000029398706e+00 -7.47687900818370118974e-04
27.400000 1.00000000000029398706e+00 2.51243825484279083467e-04
27.400000 1.00000000000029398706e+00 -3.95824949272835772978e-06
27.400000 1.00000000000029398706e+00 2.51707686860493877034e-04
27.400000 1.00000000000029398706e+00 -3.30927425246994747019e-04
27.400000 1.00000000000029398706e+00 2.48808918544386379300e-04
27.400000 1.00000000000029398706e+00 4.95487461038993987392e-06
27.400000 1.00000000000029398706e+00 2.75673787763775206706e-04
27.400000 1.00000000000029398706e+00 -7.20338221815066477756e-04
27.400000 1.00000000000029398706e+00 -3.33309144619726516537e-04
27.400000 1.00000000000029398706e+00 -3.74971972614937304382e-04
27.400000 1.00000000000029398706e+00 -1.54809950568964851351e-04
27.400000 1.00000000000029398706e+00 -1.42424476229536315757e-05
27.400000 1.00000000000029398706e+00 4.61121566724313574053e-05
