# tag norm j_0
12.500000 1.00000000000002087219e+00 -1.18873400520089472082e-02
12.500000 1.00000000000002087219e+00 -3.39583721985787980596e-03
12.500000 1.00000000000002087219e+00 -1.15764865779214368158e-02
12.500000 1.00000000000002087219e+00 -3.81210898258414190506e-03
12.500000 1.00000000000002087219e+00 -1.12834975708917106124e-02
12.500000 1.00000000000002087219e+00 -3.96842763261341397590e-03
12.500000 1.00000000000002087219e+00 -1.11738067123273825121e-02
12.500000 1.00000000000002087219e+00 -4.06671985331886337578e-03
12.500000 1.00000000000002087219e+00 -1.11617419287202493394e-02
12.500000 1.00000000000002087219e+00 -4.11914885340951969495e-03
12.500000 1.00000000000002087219e+00 -1.12064263465872886172e-02
12.500000 1.00000000000002087219e+00 -4.14148775432402437013e-03
12.500000 1.00000000000002087219e+00 -1.13102708315580453846e-02
12.500000 1.00000000000002087219e+00 -4.12772956855637831314e-03
12.500000 1.00000000000002087219e+00 -1.15164430052169704244e-02
12.500000 1.00000000000002087219e+00 -4.04799404011536856363e-03
12.500000 1.00000000000002087219e+00 -1.19099342139533399126e-02
12.500000 1.00000000000002087219e+00 -3.68659145136941831730e-03
12.500000 1.00000000000002087219e+00 -1.23530937358904083917e-02
