# tag norm n_hub[0] n_hub[1] n_hub[2] n_hub[3] n_hub[4] n_hub[5]
1 1.00000000000000000000e+00 2.86078572109468409757e-01 1.94571494777746489824e+00 8.57061923183256246794e-01 1.44898171460119518095e+00 5.06980333697555018979e-01 9.55182508631059579152e-01
2 1.00000000000000000000e+00 1.92858303160798293108e-02 1.96976497628253155447e+00 2.65401455002056627097e-02 1.97384482103536118558e+00 4.29888794264180751359e-02 1.96757534743939421773e+00
3 1.00000000000000000000e+00 1.84023417494470799272e-02 1.96388894557571624944e+00 3.54451393882526388790e-02 1.96455377539476327975e+00 3.61115762351612509806e-02 1.98159822165667298677e+00
4 1.00000000000000000000e+00 1.84024712134237336536e-02 1.96388780791046024810e+00 3.54455890571560294777e-02 1.96455442131590718446e+00 3.61121806333671996336e-02 1.98159752986967019339e+00
5 1.00000000000000000000e+00 1.84024747310571820669e-02 1.96388780061025847168e+00 3.54455957498961693464e-02 1.96455440508572043434e+00 3.61122054459786651082e-02 1.98159751837709086075e+00
