# tag norm j_0
10.200000 1.00000000000005440093e+00 6.34474324795178679093e-02
10.200000 1.00000000000005440093e+00 8.80128656979128204396e-02
10.200000 1.00000000000005440093e+00 6.34504361025444024724e-02
10.200000 1.00000000000005440093e+00 8.86567626822354071248e-02
10.200000 1.00000000000005440093e+00 6.36731393159828684691e-02
10.200000 1.00000000000005440093e+00 8.88339849396970471229e-02
10.200000 1.00000000000005440093e+00 6.38232754725431283838e-02
10.200000 1.00000000000005440093e+00 8.85502651062764767342e-02
10.200000 1.00000000000005440093e+00 6.42150419953511492066e-02
