# tag norm j_0
11.500000 1.00000000000001842970e+00 -2.89718864624856575762e-01
11.500000 1.00000000000001842970e+00 -4.07294270195368221521e-02
11.500000 1.00000000000001842970e+00 1.29186167899510203488e-02
11.500000 1.00000000000001842970e+00 -3.95391619281098422034e-02
11.500000 1.00000000000001842970e+00 -9.22015845889989360540e-02
11.500000 1.00000000000001842970e+00 -1.07039039205857541837e-02
11.500000 1.00000000000001842970e+00 -5.26703272483705839391e-02
11.500000 1.00000000000001842970e+00 -3.21395596928945315174e-02
11.500000 1.00000000000001842970e+00 -6.08604159933421109963e-02
11.500000 1.00000000000001842970e+00 -2.02812638371678323479e-02
11.500000 1.00000000000001842970e+00 -6.08515349872556718380e-02
11.500000 1.00000000000001842970e+00 -3.22823689196708729643e-02
11.500000 1.00000000000001842970e+00 -5.35752172798309861390e-02
11.500000 1.00000000000001842970e+00 -1.07368244733742849301e-02
11.500000 1.00000000000001842970e+00 -9.21777131783090286632e-02
11.500000 1.00000000000001842970e+00 -4.07480818919222775865e-02
11.500000 1.00000000000001842970e+00 1.04937747672548733341e-02
11.500000 1.00000000000001842970e+00 -3.94039435373949586960e-02
11.500000 1.00000000000001842970e+00 -2.91642486612084861353e-01
