# tag norm j_0
20.100000 1.00000000000002131628e+00 -2.74493862706029212450e-02
20.100000 1.00000000000002131628e+00 -1.64586377189463173298e-02
20.100000 1.00000000000002131628e+00 2.66665222455839644178e-02
20.100000 1.00000000000002131628e+00 8.30641259538935847195e-03
20.100000 1.00000000000002131628e+00 -1.06960963773102771951e-02
20.100000 1.00000000000002131628e+00 2.06506872126069641882e-02
20.100000 1.00000000000002131628e+00 -3.08827874870262683582e-02
20.100000 1.00000000000002131628e+00 7.63746460212130495737e-02
20.100000 1.00000000000002131628e+00 1.00079206654152663009e-02
20.100000 1.00000000000002131628e+00 -1.04007536396249489208e-02
20.100000 1.00000000000002131628e+00 9.03939126287555891337e-03
20.100000 1.00000000000002131628e+00 7.68205077501407235241e-02
20.100000 1.00000000000002131628e+00 -3.07051639925971370237e-02
20.100000 1.00000000000002131628e+00 1.99705128212926096010e-02
20.100000 1.00000000000002131628e+00 -1.03828825913420599164e-02
20.100000 1.00000000000002131628e+00 8.05474458319286636121e-03
20.100000 1.00000000000002131628e+00 2.65075755670327109503e-02
20.100000 1.00000000000002131628e+00 -1.66290928763983270056e-02
20.100000 1.00000000000002131628e+00 -2.71448715643650313745e-02
