# tag norm j_0
18.400000 1.00000000000002930989e+00 -1.34539863855430799101e-03
18.400000 1.00000000000002930989e+00 1.98020390232723402305e-03
18.400000 1.00000000000002930989e+00 -2.46648389585412981112e-03
18.400000 1.00000000000002930989e+00 1.82708931283256763300e-03
18.400000 1.00000000000002930989e+00 -2.42005559668439888810e-03
18.400000 1.00000000000002930989e+00 1.88577015983373125728e-03
18.400000 1.00000000000002930989e+00 -2.37284347048288303539e-03
18.400000 1.00000000000002930989e+00 1.90730200675195906042e-03
18.400000 1.00000000000002930989e+00 -2.34155071767311101158e-03
18.400000 1.00000000000002930989e+00 1.92358534055693444070e-03
18.400000 1.00000000000002930989e+00 -2.33222805816335086379e-03
18.400000 1.00000000000002930989e+00 1.91554994500654296799e-03
18.400000 1.00000000000002930989e+00 -2.36198259014598578240e-03
18.400000 1.00000000000002930989e+00 1.89242223759159846307e-03
18.400000 1.00000000000002930989e+00 -2.41792530409859138252e-03
18.400000 1.00000000000002930989e+00 1.83842576582372179729e-03
18.400000 1.00000000000002930989e+00 -2.46689346639096963171e-03
18.400000 1.00000000000002930989e+00 1.99592398546058740622e-03
18.400000 1.00000000000002930989e+00 -1.27894040787817340511e-03
