# tag norm n_hub[0] n_hub[1] n_hub[2] n_hub[3] n_hub[4] n_hub[5] n_hub[6] n_hub[7] n_hub[8] n_hub[9] n_hub[10] n_hub[11] n_hub[12] n_hub[13] n_hub[14] n_hub[15] n_hub[16] n_hub[17] n_hub[18] n_hub[19] n_hub[20] n_hub[21] n_hub[22] n_hub[23] n_hub[24] n_hub[25] n_hub[26] n_hub[27] n_hub[28] n_hub[29] n_hub[30] n_hub[31] n_hub[32] n_hub[33] n_hub[34] n_hub[35] n_hub[36] n_hub[37] n_hub[38] n_hub[39] n_hub[40] n_hub[41] n_hub[42] n_hub[43] n_hub[44] n_hub[45] n_hub[46] n_hub[47] n_hub[48] n_hub[49]
1 1.00000000000000000000e+00 4.99404983416471427021e-03 1.99501109021240896624e+00 2.48619836676859358796e-03 1.99953678057213801722e+00 6.24463280729599251595e-02 1.98586619845456846534e+00 2.79326779117245238560e-01 1.86910604846935468615e+00 8.95801735146211197680e-01 1.22349814679095492131e+00 9.12588362619671022991e-01 1.18985382944977002850e+00 9.03430828851849554439e-01 1.07785014911713572516e+00 8.75814381649981710254e-01 1.06902534222768630379e+00 8.87887803499157080012e-01 1.05821440707935732206e+00 8.95289471860226115929e-01 1.06073839592776542062e+00 8.87493139179966084029e-01 1.06638769411054146197e+00 8.96821206240845270052e-01 1.04749526368103063056e+00 8.80860454702666051396e-01 1.05199807072242346173e+00 8.87429390019674246837e-01 1.03075291209188324437e+00 1.36627961377961612555e-02 1.99506890708234951859e+00 2.54949906703539619368e-01 1.93759134926340426119e+00 8.71126635535025006796e-01 1.47639092616662148671e+00 9.10391765877765379855e-01 1.21562649088257002106e+00 8.75333728174536140898e-01 1.04421625331895961963e+00 9.06961587727500018197e-01 1.06725135049810804233e+00 9.35250192780885614141e-01 1.09116807868811238613e+00 9.47782080834764895094e-01 1.10116719514494287857e+00 9.50837984098692357016e-01 1.09787521079865046936e+00 9.48982933289549412947e-01 1.47696654676864480571e+00 3.25120553787706434434e-01 5.58273068371461400616e-01
2 1.00000000000000000000e+00 4.92452453701305858935e-03 1.99018337823292879030e+00 9.79253778351136042191e-03 1.99027834008789583642e+00 9.71122180686202242372e-03 1.99026299969579589799e+00 9.75576367078394464383e-03 1.99029264680193684889e+00 9.69686231481104408958e-03 1.99053033792465150498e+00 9.44491465323879335336e-03 1.99036398941467140844e+00 9.71529987688829477221e-03 1.99035541233199042566e+00 9.20816071829702771645e-03 1.99087017854397063665e+00 9.10664411121691295958e-03 1.99090507317788389940e+00 9.56975076879899334836e-03 1.98997212748108887048e+00 1.00128995347559812679e-02 1.99037683377586782640e+00 9.66351433287236140368e-03 1.99019917359376830035e+00 9.71595450968841013728e-03 1.99021992448784978968e+00 9.79275000268465048436e-03 1.99010043249175305746e+00 9.86678359134554074095e-03 1.99022026908584681593e+00 9.79493203956688721079e-03 1.99065490723743043766e+00 9.30620183500732722770e-03 1.99064086234690518218e+00 9.37084192957557578219e-03 1.99039663060858096344e+00 9.50885426293352452320e-03 1.99049814260985646897e+00 9.46068647045228069969e-03 1.99075958993887125459e+00 9.50945182354765751465e-03 1.99052517282250107655e+00 9.58464363591089198169e-03 1.99034958189548127905e+00 9.52531813446278428914e-03 1.99041895938907731356e+00 9.30785191564868774616e-03 1.99065026647706999618e+00 9.83241798145352563498e-03 1.99479598730517571070e+00
3 1.00000000000000000000e+00 4.92452444377609009629e-03 1.99018326438463910577e+00 9.78073164845056318428e-03 1.99021897530948432831e+00 9.78098054871548612532e-03 1.99021908393899615852e+00 9.78093994291461335533e-03 1.99021879685344638133e+00 9.77558049871024396793e-03 1.99022483232368285755e+00 9.78081971173258915564e-03 1.99021893805823180124e+00 9.78109459002006118022e-03 1.99021841061214632695e+00 9.77939607971857818858e-03 1.99022075137746612405e+00 9.77678216714649231389e-03 1.99022359154993710995e+00 9.78107953744546121388e-03 1.99021891619724722311e+00 9.78103830513416157288e-03 1.99021896668787645623e+00 9.78104545588573404125e-03 1.99021894514407637899e+00 9.78102131383124656638e-03 1.99021897785325374564e+00 9.78105525175517430403e-03 1.99021895206648613552e+00 9.78103819540224357632e-03 1.99021896741833392852e+00 9.78102819830348538255e-03 1.99021896836550737930e+00 9.78106428921749794514e-03 1.99021891212068435806e+00 9.78108019884511327435e-03 1.99021848149261204597e+00 9.78048107161116203612e-03 1.99021987382778631215e+00 9.78058897131048668450e-03 1.99021956468933391982e+00 9.78106144635805009602e-03 1.99021888204792629651e+00 9.78110536232633560882e-03 1.99021889920357031301e+00 9.78106145114178426869e-03 1.99021876427532307119e+00 9.78128819701314967949e-03 1.99021916784077324003e+00 9.81675571521734707803e-03 1.99507547376905436387e+00
4 1.00000000000000000000e+00 4.92452384086046555250e-03 1.99018324717388539469e+00 9.78076822886985407235e-03 1.99021894053077019748e+00 9.78105613701393643289e-03 1.99021894167134405507e+00 9.78104733913814569646e-03 1.99021893237619584838e+00 9.78081781433845845464e-03 1.99021920774826455158e+00 9.78105610462593616505e-03 1.99021893740631594660e+00 9.78106547141325069483e-03 1.99021887741771030811e+00 9.78091259529462186961e-03 1.99021911112213700790e+00 9.78086860165265463418e-03 1.99021916191084646819e+00 9.78106799661171942561e-03 1.99021893769384838890e+00 9.78105879728490522351e-03 1.99021894180047054235e+00 9.78105973525259311807e-03 1.99021893901367574742e+00 9.78105680237311737868e-03 1.99021894303077773181e+00 9.78106109913284664514e-03 1.99021893988926379393e+00 9.78105890779084989617e-03 1.99021894178074565396e+00 9.78105767269269246733e-03 1.99021894191531734108e+00 9.78106213352219859558e-03 1.99021893500824731404e+00 9.78106369950059936769e-03 1.99021888385736667182e+00 9.78099765842112799097e-03 1.99021904407186500663e+00 9.78100795870854265723e-03 1.99021901076905938233e+00 9.78106229056719886361e-03 1.99021893153096485207e+00 9.78106695983277894813e-03 1.99021893356346013526e+00 9.78106147130557157521e-03 1.99021891696673236538e+00 9.78109143660670088405e-03 1.99021922210648782858e+00 9.81675331616519049327e-03 1.99507547557539255401e+00
