# tag norm j_0
26.700000 1.00000000000002953193e+00 -4.30416250956516047155e-02
26.700000 1.00000000000002953193e+00 7.34688412757831671440e-02
26.700000 1.00000000000002953193e+00 -4.36847377316659304936e-02
26.700000 1.00000000000002953193e+00 -2.15210380087964038565e-02
26.700000 1.00000000000002953193e+00 1.66979215582953310903e-01
26.700000 1.00000000000002953193e+00 -2.05484763788325863754e-02
26.700000 1.00000000000002953193e+00 -4.48223735522287683453e-02
26.700000 1.00000000000002953193e+00 7.27717507938648172638e-02
26.700000 1.00000000000002953193e+00 -4.20627463910185211970e-02
