# tag norm j_0
0.300000 1.00000000000000111022e+00 1.02389929125209428887e-06
0.300000 1.00000000000000111022e+00 -1.26758642282561955861e-06
0.300000 1.00000000000000111022e+00 -1.33345110253718161787e-06
0.300000 1.00000000000000111022e+00 -1.18086364865067773872e-07
0.300000 1.00000000000000111022e+00 -6.37635967603599138177e-07
0.300000 1.00000000000000111022e+00 3.43849419614764557360e-07
0.300000 1.00000000000000111022e+00 -5.20914160496955262266e-07
0.300000 1.00000000000000111022e+00 3.95312568093549874396e-07
0.300000 1.00000000000000111022e+00 -4.26340963879197849465e-07
0.300000 1.00000000000000111022e+00 9.99946933046091161191e-08
0.300000 1.00000000000000111022e+00 -5.39609841156076519089e-07
0.300000 1.00000000000000111022e+00 3.67835199485196345958e-07
0.300000 1.00000000000000111022e+00 -6.03768059179197455847e-07
0.300000 1.00000000000000111022e+00 3.44545943805238646252e-07
0.300000 1.00000000000000111022e+00 -6.45414977982067477657e-07
0.300000 1.00000000000000111022e+00 -2.01782153447953320249e-07
0.300000 1.00000000000000111022e+00 -1.16317412662214240832e-06
0.300000 1.00000000000000111022e+00 -1.28248427025744625229e-06
0.300000 1.00000000000000111022e+00 8.11954291024257133687e-07
