# tag norm j
0.100000 9.99999999999999888978e-01 -1.53654789433240358961e-06
0.200000 9.99999999999999555911e-01 -2.01695985443859300126e-06
0.300000 1.00000000000000111022e+00 -5.35285700484185537342e-06
0.400000 9.99999999999999444888e-01 -1.74087351971971549241e-05
0.500000 9.99999999999999888978e-01 -1.98585936916002270248e-05
0.600000 1.00000000000000177636e+00 -2.88675906752617947152e-05
0.700000 1.00000000000000288658e+00 -5.10895792493056441984e-05
0.800000 1.00000000000000155431e+00 -4.38066283431399772783e-05
0.900000 1.00000000000000155431e+00 -4.72967980644041759782e-05
1.000000 1.00000000000000000000e+00 -4.70848319847767861628e-05
1.100000 1.00000000000000022204e+00 6.96001610897243093375e-06
1.200000 1.00000000000000066613e+00 2.60239441913522681767e-05
1.300000 1.00000000000000377476e+00 8.05219741673527528159e-05
1.400000 1.00000000000000177636e+00 1.78107331512705735748e-04
1.500000 1.00000000000000222045e+00 1.79972457463056128343e-04
1.600000 1.00000000000000355271e+00 2.25749409506587463223e-04
1.700000 1.00000000000000133227e+00 2.37442145464574340223e-04
1.800000 1.00000000000000088818e+00 9.84779658169538643555e-05
1.900000 1.00000000000000044409e+00 -9.68815888484906008959e-06
2.000000 9.99999999999997224442e-01 -2.22218154064990575190e-04
2.100000 9.99999999999998334665e-01 -5.05065109014896356648e-04
2.200000 9.99999999999998778755e-01 -6.97871420410022631417e-04
2.300000 9.99999999999999444888e-01 -9.06215281075153206679e-04
2.400000 1.00000000000000022204e+00 -9.03117169936659518192e-04
2.500000 1.00000000000000088818e+00 -6.66815529201636686234e-04
2.600000 9.99999999999999111822e-01 -2.68585158147296369606e-04
2.700000 1.00000000000000088818e+00 5.20506441410274224568e-04
2.800000 1.00000000000000310862e+00 1.43181557415300998552e-03
2.900000 1.00000000000000333067e+00 2.31874207229493993834e-03
3.000000 1.00000000000000244249e+00 3.15860404777941342416e-03
3.100000 1.00000000000000377476e+00 3.44745521398170549562e-03
3.200000 1.00000000000000355271e+00 3.05090134311390096672e-03
3.300000 1.00000000000000333067e+00 1.86036325436506771482e-03
3.400000 1.00000000000000244249e+00 -3.48740153342520916788e-04
3.500000 9.99999999999999333866e-01 -3.22173365208435836041e-03
3.600000 9.99999999999999111822e-01 -6.39697772160861561491e-03
3.700000 9.99999999999999555911e-01 -9.33490854063805629293e-03
3.800000 9.99999999999998001599e-01 -1.10763508067334599805e-02
3.900000 1.00000000000000066613e+00 -1.09234909276631920322e-02
4.000000 1.00000000000000066613e+00 -8.27730054080493687918e-03
4.100000 1.00000000000000199840e+00 -2.78218262764546057572e-03
4.200000 1.00000000000000266454e+00 5.16918658825965462306e-03
4.300000 1.00000000000000288658e+00 1.45861807007106221434e-02
4.400000 1.00000000000000333067e+00 2.38686070399852547086e-02
4.500000 1.00000000000000177636e+00 3.08530782878460446694e-02
4.600000 1.00000000000000244249e+00 3.32644375159177468904e-02
4.700000 1.00000000000000399680e+00 2.92001911938895956922e-02
4.800000 1.00000000000000355271e+00 1.76089663856043507351e-02
4.900000 1.00000000000000177636e+00 -1.12631737039838768569e-03
5.000000 1.00000000000000377476e+00 -2.49296335038794968086e-02
5.100000 1.00000000000000355271e+00 -5.01012495127539508877e-02
5.200000 1.00000000000000377476e+00 -7.15193742851377295411e-02
5.300000 1.00000000000000266454e+00 -8.36671164679358980720e-02
5.400000 1.00000000000000399680e+00 -8.16343548746262942517e-02
5.500000 1.00000000000000244249e+00 -6.20450217891194213959e-02
5.600000 1.00000000000000377476e+00 -2.46730837795632457210e-02
5.700000 1.00000000000000510703e+00 2.70955461555128646056e-02
5.800000 1.00000000000000510703e+00 8.62070981376685668840e-02
5.900000 1.00000000000000643929e+00 1.41873386932906797586e-01
6.000000 1.00000000000000421885e+00 1.81622064025308505020e-01
6.100000 1.00000000000000355271e+00 1.93549148044410479486e-01
6.200000 1.00000000000000488498e+00 1.68759389981191360031e-01
6.300000 1.00000000000000688338e+00 1.04759009351374735020e-01
6.400000 1.00000000000001065814e+00 6.89781208807562461194e-03
6.500000 1.00000000000001287859e+00 -1.11526938700381661462e-01
6.600000 1.00000000000001532108e+00 -2.30433163198963175677e-01
6.700000 1.00000000000001598721e+00 -3.26484328752152552777e-01
6.800000 1.00000000000001532108e+00 -3.76958421943530352927e-01
6.900000 1.00000000000001465494e+00 -3.64018604041409010730e-01
7.000000 1.00000000000001554312e+00 -2.78979269642814942110e-01
7.100000 1.00000000000001798561e+00 -1.24974880690694886698e-01
7.200000 1.00000000000001931788e+00 8.11998229121424774934e-02
7.300000 1.00000000000001842970e+00 3.09147117180079811227e-01
7.400000 1.00000000000001754152e+00 5.17790909851308378542e-01
7.500000 1.00000000000001953993e+00 6.61435099786632951790e-01
7.600000 1.00000000000002176037e+00 7.00130846586683897037e-01
7.700000 1.00000000000002442491e+00 6.11133553224189718378e-01
7.800000 1.00000000000002442491e+00 3.96726233191081412155e-01
7.900000 1.00000000000002531308e+00 8.56997810715830893313e-02
8.000000 1.00000000000002731149e+00 -2.71988322419951300546e-01
8.100000 1.00000000000002486900e+00 -6.14474854576197548894e-01
8.200000 1.00000000000002664535e+00 -8.78479090610622348478e-01
8.300000 1.00000000000002664535e+00 -1.00990488501315955894e+00
8.400000 1.00000000000002486900e+00 -9.73307788027578890677e-01
8.500000 1.00000000000002398082e+00 -7.58188244935373512057e-01
8.600000 1.00000000000002242651e+00 -3.81311058371611444340e-01
8.700000 1.00000000000002109424e+00 1.12323923467843825308e-01
8.800000 1.00000000000002198242e+00 6.49183290780111166285e-01
8.900000 1.00000000000002642331e+00 1.13264297367573307795e+00
9.000000 1.00000000000002597922e+00 1.46000092416304760867e+00
9.100000 1.00000000000002398082e+00 1.55086044795960398268e+00
9.200000 1.00000000000002287059e+00 1.37376031156405664646e+00
9.300000 1.00000000000002065015e+00 9.54924554069866982076e-01
9.400000 1.00000000000002065015e+00 3.68192675109962230806e-01
9.500000 1.00000000000002331468e+00 -2.84358163879741054902e-01
9.600000 1.00000000000001909584e+00 -8.91894923218520596642e-01
9.700000 1.00000000000002198242e+00 -1.35141532180529155838e+00
9.800000 1.00000000000002042810e+00 -1.58391968173516817231e+00
9.900000 1.00000000000001931788e+00 -1.54719756814643893961e+00
10.000000 1.00000000000002020606e+00 -1.23935677338437977291e+00
10.100000 1.00000000000002220446e+00 -6.96448235736734089230e-01
10.200000 1.00000000000002353673e+00 8.51209380479864795299e-03
10.300000 1.00000000000002198242e+00 7.66015415761653994942e-01
10.400000 1.00000000000002242651e+00 1.44050140192079223489e+00
10.500000 1.00000000000002509104e+00 1.89922823552500319444e+00
10.600000 1.00000000000002398082e+00 2.05073492510119992360e+00
10.700000 1.00000000000002353673e+00 1.87111011465813437127e+00
10.800000 1.00000000000002620126e+00 1.40463245918300794202e+00
10.900000 1.00000000000002664535e+00 7.44933684195375644954e-01
11.000000 1.00000000000002686740e+00 1.13564197172534089852e-02
11.100000 1.00000000000002509104e+00 -6.72274102334347478660e-01
11.200000 1.00000000000002398082e+00 -1.19648049752256646627e+00
11.300000 1.00000000000002220446e+00 -1.48273889158053973070e+00
11.400000 1.00000000000002065015e+00 -1.49411908413260152706e+00
11.500000 1.00000000000001842970e+00 -1.23685028817649933508e+00
11.600000 1.00000000000001798561e+00 -7.56582892965549369535e-01
11.700000 1.00000000000002087219e+00 -1.33612852266573711724e-01
11.800000 1.00000000000002065015e+00 5.25618750835837644786e-01
11.900000 1.00000000000001909584e+00 1.10566106599563274138e+00
12.000000 1.00000000000001976197e+00 1.50641890231111608145e+00
12.100000 1.00000000000002042810e+00 1.66617124725888432479e+00
12.200000 1.00000000000001820766e+00 1.57327144449708122842e+00
12.300000 1.00000000000001731948e+00 1.26331704850492831937e+00
12.400000 1.00000000000001709743e+00 8.06402100421198975155e-01
12.500000 1.00000000000001620926e+00 2.90610475911301402441e-01
12.600000 1.00000000000001754152e+00 -1.94531352486567582494e-01
12.700000 1.00000000000001798561e+00 -5.72986731516969771683e-01
12.800000 1.00000000000001798561e+00 -7.93346969903413468117e-01
12.900000 1.00000000000001643130e+00 -8.34379638070714357845e-01
13.000000 1.00000000000001265654e+00 -7.05521731775122784569e-01
13.100000 1.00000000000001310063e+00 -4.42950764031152688371e-01
13.200000 1.00000000000001398881e+00 -1.01923491457633200175e-01
13.300000 1.00000000000001243450e+00 2.53190412633482131444e-01
13.400000 1.00000000000001088019e+00 5.60858332094557821002e-01
13.500000 1.00000000000001287859e+00 7.74012725630202735871e-01
13.600000 1.00000000000001332268e+00 8.67488388010187239097e-01
13.700000 1.00000000000001487699e+00 8.40404772800701471702e-01
13.800000 1.00000000000001532108e+00 7.13403104551138866896e-01
13.900000 1.00000000000001487699e+00 5.21668985767578363699e-01
14.000000 1.00000000000001487699e+00 3.06476880767241666170e-01
14.100000 1.00000000000001509903e+00 1.06916312365027299514e-01
14.200000 1.00000000000001620926e+00 -4.67369490448791627402e-02
14.300000 1.00000000000001598721e+00 -1.36971016514973120692e-01
14.400000 1.00000000000001554312e+00 -1.60214694610940011632e-01
14.500000 1.00000000000001421085e+00 -1.25212555449941781438e-01
14.600000 1.00000000000001421085e+00 -4.97209482291790655362e-02
14.700000 1.00000000000001509903e+00 4.39875854620032577524e-02
14.800000 1.00000000000001643130e+00 1.34271003297711244429e-01
14.900000 1.00000000000001687539e+00 2.04131169449197041876e-01
15.000000 1.00000000000001887379e+00 2.43984663746457330902e-01
15.100000 1.00000000000002020606e+00 2.52704596135329417894e-01
15.200000 1.00000000000002020606e+00 2.36258047919377572876e-01
15.300000 1.00000000000002198242e+00 2.05173579214277618243e-01
15.400000 1.00000000000001820766e+00 1.71296208400530419746e-01
15.500000 1.00000000000001731948e+00 1.44531779899793960675e-01
15.600000 1.00000000000002131628e+00 1.30719670262283926832e-01
15.700000 1.00000000000001998401e+00 1.30595995658772362491e-01
15.800000 1.00000000000002131628e+00 1.40234906031151268513e-01
15.900000 1.00000000000002198242e+00 1.52642913299342708466e-01
16.000000 1.00000000000001976197e+00 1.59731874590960776228e-01
16.100000 1.00000000000001998401e+00 1.54778712954314612293e-01
16.200000 1.00000000000002131628e+00 1.34331371303596347477e-01
16.300000 1.00000000000002020606e+00 9.91280666988172409759e-02
16.400000 1.00000000000001998401e+00 5.43517140173191484753e-02
16.500000 1.00000000000001776357e+00 8.54052800750196641766e-03
16.600000 1.00000000000001820766e+00 -2.83869372717603964118e-02
16.700000 1.00000000000001865175e+00 -4.72944294369190137983e-02
16.800000 1.00000000000001976197e+00 -4.21477343954212158028e-02
16.900000 1.00000000000001820766e+00 -1.16232859705834822017e-02
17.000000 1.00000000000001754152e+00 4.03474897340373589438e-02
17.100000 1.00000000000001776357e+00 1.05040232569788297146e-01
17.200000 1.00000000000001598721e+00 1.70536805642541644534e-01
17.300000 1.00000000000001598721e+00 2.24107097942682298441e-01
17.400000 1.00000000000001532108e+00 2.54664529379022452904e-01
17.500000 1.00000000000001554312e+00 2.54998577665711267937e-01
17.600000 1.00000000000001421085e+00 2.23512857178509188882e-01
17.700000 1.00000000000001376677e+00 1.64602673699288798437e-01
17.800000 1.00000000000001443290e+00 8.79975384273371102895e-02
17.900000 1.00000000000001776357e+00 7.23146712525107437236e-03
18.000000 1.00000000000001820766e+00 -6.28690756836794151230e-02
18.100000 1.00000000000001842970e+00 -1.09114998312373270850e-01
18.200000 1.00000000000002020606e+00 -1.22363052243445583067e-01
18.300000 1.00000000000002065015e+00 -9.93596642043588079707e-02
18.400000 1.00000000000002176037e+00 -4.36386293093926624920e-02
18.500000 1.00000000000001953993e+00 3.51040665448816568972e-02
18.600000 1.00000000000001998401e+00 1.22862648921648151545e-01
18.700000 1.00000000000002065015e+00 2.03741378104397657944e-01
18.800000 1.00000000000001887379e+00 2.62948848653584421609e-01
18.900000 1.00000000000001909584e+00 2.89689312917515817691e-01
19.000000 1.00000000000001798561e+00 2.78957124660883903911e-01
19.100000 1.00000000000001842970e+00 2.32421525156666974876e-01
19.200000 1.00000000000001820766e+00 1.58384209523222851956e-01
19.300000 1.00000000000001754152e+00 6.98974324651863432312e-02
19.400000 1.00000000000001687539e+00 -1.76630090817394939939e-02
19.500000 1.00000000000001842970e+00 -8.87835753292016000016e-02
19.600000 1.00000000000001887379e+00 -1.31443320936000473953e-01
19.700000 1.00000000000001976197e+00 -1.39076653310041514766e-01
19.800000 1.00000000000002153833e+00 -1.10879624026509915335e-01
19.900000 1.00000000000002198242e+00 -5.31668297829939878740e-02
20.000000 1.00000000000002220446e+00 2.23361024256783571862e-02
20.100000 1.00000000000002131628e+00 1.01649248206529416172e-01
20.200000 1.00000000000002264855e+00 1.69642913691883279181e-01
20.300000 1.00000000000002375877e+00 2.13403504893031142897e-01
20.400000 1.00000000000002464695e+00 2.25398110597470696659e-01
20.500000 1.00000000000002420286e+00 2.03377296056006989788e-01
20.600000 1.00000000000002353673e+00 1.51013853483154214530e-01
20.700000 1.00000000000002242651e+00 7.80306653914568937314e-02
20.800000 1.00000000000002331468e+00 -2.91185551729606414278e-03
20.900000 1.00000000000002531308e+00 -7.83595133412415545404e-02
21.000000 1.00000000000002509104e+00 -1.35661895583520403230e-01
21.100000 1.00000000000002398082e+00 -1.65856515588776398662e-01
21.200000 1.00000000000002575717e+00 -1.65573079506709019970e-01
21.300000 1.00000000000002442491e+00 -1.36475658903187496707e-01
21.400000 1.00000000000002420286e+00 -8.50801677727183597311e-02
21.500000 1.00000000000002131628e+00 -2.22554119257086686912e-02
21.600000 1.00000000000002065015e+00 3.98610574162179473467e-02
21.700000 1.00000000000002087219e+00 9.01130836004461061028e-02
21.800000 1.00000000000002087219e+00 1.19279680875449073385e-01
21.900000 1.00000000000001953993e+00 1.22296147811443850495e-01
22.000000 1.00000000000001709743e+00 9.94146341023963570072e-02
22.100000 1.00000000000001709743e+00 5.47646848538675193319e-02
22.200000 1.00000000000001620926e+00 -4.01760609446838098946e-03
22.300000 1.00000000000001842970e+00 -6.66306016725758121222e-02
22.400000 1.00000000000001598721e+00 -1.23042798224000549112e-01
22.500000 1.00000000000001576517e+00 -1.64795434585493727475e-01
22.600000 1.00000000000001576517e+00 -1.85796946950566366219e-01
22.700000 1.00000000000001598721e+00 -1.83978896257606328035e-01
22.800000 1.00000000000001754152e+00 -1.61083223884533915937e-01
22.900000 1.00000000000001820766e+00 -1.22388248429873336409e-01
23.000000 1.00000000000001776357e+00 -7.51020674148256683900e-02
23.100000 1.00000000000001798561e+00 -2.73508888409633756089e-02
23.200000 1.00000000000001665335e+00 1.24107928808259541931e-02
23.300000 1.00000000000001576517e+00 3.86847092195064731768e-02
23.400000 1.00000000000001731948e+00 4.84969594921754731942e-02
23.500000 1.00000000000001709743e+00 4.04842337283456213393e-02
23.600000 1.00000000000001842970e+00 1.75962865603858029107e-02
23.700000 1.00000000000001643130e+00 -1.51451157326280907989e-02
23.800000 1.00000000000001687539e+00 -5.31596156593852273153e-02
23.900000 1.00000000000002153833e+00 -9.00372996691324312124e-02
24.000000 1.00000000000002242651e+00 -1.19848549412272881165e-01
24.100000 1.00000000000002287059e+00 -1.39951116320072732613e-01
24.200000 1.00000000000002420286e+00 -1.47955443098779365618e-01
24.300000 1.00000000000002620126e+00 -1.42997251017035031939e-01
24.400000 1.00000000000002620126e+00 -1.27727058315433183999e-01
24.500000 1.00000000000002731149e+00 -1.05004725637253507053e-01
24.600000 1.00000000000002686740e+00 -7.74533341109046730155e-02
24.700000 1.00000000000002486900e+00 -4.97958705242566926352e-02
24.800000 1.00000000000002553513e+00 -2.54342659362647369181e-02
24.900000 1.00000000000002597922e+00 -5.80130089668949404380e-03
25.000000 1.00000000000002620126e+00 6.65754370077555578111e-03
25.100000 1.00000000000002731149e+00 1.13196549742189938453e-02
25.200000 1.00000000000002731149e+00 9.39960840155345048186e-03
25.300000 1.00000000000002686740e+00 1.04144760908628296152e-03
25.400000 1.00000000000002686740e+00 -1.24264560083673647473e-02
25.500000 1.00000000000002908784e+00 -2.87045217681400864629e-02
25.600000 1.00000000000002953193e+00 -4.65539039006669305709e-02
25.700000 1.00000000000002575717e+00 -6.42386046631427537479e-02
25.800000 1.00000000000002486900e+00 -7.92377706763254113786e-02
25.900000 1.00000000000002597922e+00 -9.00720852060013371654e-02
26.000000 1.00000000000002708944e+00 -9.54857606868769331898e-02
26.100000 1.00000000000002953193e+00 -9.36368652044771154763e-02
26.200000 1.00000000000002886580e+00 -8.40769068453127710328e-02
26.300000 1.00000000000002953193e+00 -6.76177251637633675019e-02
26.400000 1.00000000000002930989e+00 -4.47017290503215689035e-02
26.500000 1.00000000000002930989e+00 -1.74389420944728937291e-02
26.600000 1.00000000000002997602e+00 1.07083717755242727870e-02
26.700000 1.00000000000002953193e+00 3.70802683381241046656e-02
26.800000 1.00000000000003042011e+00 5.81728650227389398886e-02
26.900000 1.00000000000003042011e+00 7.05717613990066855445e-02
27.000000 1.00000000000003064216e+00 7.26876395455694074288e-02
27.100000 1.00000000000003042011e+00 6.38694943456922653580e-02
27.200000 1.00000000000002664535e+00 4.46749533567394538358e-02
27.300000 1.00000000000002797762e+00 1.80402499234967907127e-02
27.400000 1.00000000000003019807e+00 -1.18962247686323890211e-02
27.500000 1.00000000000003042011e+00 -4.08516159014272392525e-02
27.600000 1.00000000000002886580e+00 -6.35783636481500047388e-02
27.700000 1.00000000000002908784e+00 -7.55957156373230215740e-02
27.800000 1.00000000000003108624e+00 -7.47625964657325087215e-02
27.900000 1.00000000000003264056e+00 -5.99168257105014909203e-02
28.000000 1.00000000000003352874e+00 -3.20145379820763811840e-02
28.100000 1.00000000000003375078e+00 4.97916959174073484040e-03
28.200000 1.00000000000003419487e+00 4.61937814508777341849e-02
28.300000 1.00000000000003197442e+00 8.62227546055730764696e-02
28.400000 1.00000000000003330669e+00 1.18954278401522173247e-01
28.500000 1.00000000000003308465e+00 1.39291491237536091408e-01
28.600000 1.00000000000003463896e+00 1.44503151564534138007e-01
28.700000 1.00000000000003530509e+00 1.33876280308974193733e-01
28.800000 1.00000000000003419487e+00 1.08541004331738716315e-01
28.900000 1.00000000000003463896e+00 7.26042453436863133298e-02
29.000000 1.00000000000003552714e+00 3.21078562678605572422e-02
29.100000 1.00000000000003685940e+00 -7.14426972453650801359e-03
29.200000 1.00000000000003597123e+00 -3.89541072528232987238e-02
29.300000 1.00000000000003574918e+00 -5.75439617169749839665e-02
29.400000 1.00000000000003375078e+00 -6.04789706857823683439e-02
29.500000 1.00000000000003352874e+00 -4.72533595359841962491e-02
29.600000 1.00000000000003486100e+00 -1.91346502155059668138e-02
29.700000 1.00000000000003597123e+00 1.90230150491371152732e-02
29.800000 1.00000000000003685940e+00 6.10257766170125282024e-02
29.900000 1.00000000000003552714e+00 1.00861408627780285707e-01
30.000000 1.00000000000003530509e+00 1.31807299282433260101e-01
