# tag norm BO
1 9.99999999999997668532e-01 -2.19295481756653365402e-02
2 9.99999999999994892974e-01 3.76753185005217162626e-04
3 9.99999999999996891376e-01 1.20358819083758120799e-02
4 1.00000000000000066613e+00 3.20557274771642768466e-03
5 9.99999999999996447286e-01 -3.04583654422056673144e-03
6 1.00000000000000133227e+00 1.59357934484608554371e-02
7 1.00000000000000399680e+00 2.54334672999078671707e-02
8 9.99999999999994781952e-01 2.85997397433042123416e-02
9 9.99999999999997446487e-01 2.70390919196627395327e-02
10 1.00000000000000355271e+00 2.23419675749324600500e-02
11 1.00000000000000466294e+00 1.28056064164598706889e-02
12 9.99999999999995003996e-01 -1.27213450867143620417e-03
13 1.00000000000000399680e+00 -2.49810695980960985330e-02
14 1.00000000000000355271e+00 -1.78931828410496818194e-02
15 9.99999999999995003996e-01 -1.57952443778137593955e-02
16 1.00000000000000199840e+00 -1.80588977527984077820e-02
17 1.00000000000000133227e+00 -1.53411119104508893163e-02
18 9.99999999999997002398e-01 -8.95152397848165450045e-03
19 1.00000000000000000000e+00 -4.17714166752297319518e-03
20 9.99999999999997557509e-01 -2.79765148638123418209e-04
21 9.99999999999997002398e-01 1.46640684831124304237e-03
22 9.99999999999996003197e-01 2.13175638214497913114e-03
23 9.99999999999996669331e-01 1.95875854118545376925e-03
24 9.99999999999989341859e-01 6.27605308514793511394e-04
25 1.00000000000000000000e+00 4.83865209833353264977e-04
26 1.00000000000000688338e+00 -7.74703181356209711955e-05
27 1.00000000000000044409e+00 1.49670618696281588003e-03
28 1.00000000000000377476e+00 2.28997940548998244956e-03
29 9.99999999999996003197e-01 2.36442214233470188872e-03
30 9.99999999999999555911e-01 1.32720914890089160092e-03
31 9.99999999999998556710e-01 1.64086056702064252318e-03
32 9.99999999999999333866e-01 1.33475359670402206856e-03
33 9.99999999999999777955e-01 1.53008601521689192870e-03
34 9.99999999999997335465e-01 2.13744163706280606088e-03
35 9.99999999999998112621e-01 1.86495332056944569492e-03
36 1.00000000000000044409e+00 1.05684190946485796758e-02
37 1.00000000000000399680e+00 1.43584907045257881980e-02
38 1.00000000000000643929e+00 6.89518402418739378978e-03
39 9.99999999999999888978e-01 7.94814760312252330254e-03
40 1.00000000000000155431e+00 1.77294327743424857957e-02
41 1.00000000000000133227e+00 2.24423560537748353894e-02
42 1.00000000000000777156e+00 1.73312135282321679031e-02
43 1.00000000000000910383e+00 -1.15799664275808358860e-02
44 9.99999999999996003197e-01 -5.85817007731715463231e-03
45 9.99999999999996336264e-01 -1.32755898515476609099e-03
46 1.00000000000000577316e+00 -4.49540469953919972351e-04
47 9.99999999999997446487e-01 1.00547137934070118098e-03
48 1.00000000000000532907e+00 1.45993007494906660952e-03
49 9.99999999999998445688e-01 4.71957382798139039176e-03
50 9.99999999999998001599e-01 -2.07216410021054909738e-03
51 1.00000000000000000000e+00 -1.05347275685123004108e-02
52 1.00000000000000310862e+00 -3.70740867497605219166e-03
53 1.00000000000000799361e+00 -1.91190966605747202783e-04
54 1.00000000000000000000e+00 -4.67992155473766213714e-04
55 9.99999999999998001599e-01 1.05184938030138553505e-03
56 9.99999999999996447286e-01 3.27463870425309389045e-02
57 1.00000000000000310862e+00 2.41387554634247616936e-02
58 9.99999999999992006394e-01 2.10558092756441168902e-02
59 1.00000000000000333067e+00 1.20366517671460487166e-02
60 1.00000000000000266454e+00 6.34993849694649378779e-03
61 9.99999999999999888978e-01 1.61271780034376484292e-02
62 9.99999999999990674127e-01 1.96194277390382247617e-02
63 9.99999999999998223643e-01 1.92026265526019229712e-02
64 1.00000000000000222045e+00 -2.71445641105779976454e-02
65 1.00000000000000111022e+00 -1.47156574683514982521e-02
66 1.00000000000000710543e+00 -1.16157333254411545415e-02
67 9.99999999999995670130e-01 -1.06256970742381797596e-02
68 1.00000000000000910383e+00 3.22738158667154675929e-02
69 1.00000000000000532907e+00 2.01189142947316018661e-02
70 9.99999999999993116617e-01 1.78797621991426194943e-02
71 9.99999999999995781153e-01 1.74604558213207992912e-02
72 9.99999999999993560706e-01 1.74896147068201515684e-02
73 9.99999999999992894573e-01 1.73069982080889389620e-02
74 1.00000000000000088818e+00 -2.25430183995462135593e-02
75 9.99999999999994004796e-01 -1.38483338747044867900e-02
76 1.00000000000001199041e+00 -1.19558439737824408200e-02
77 1.00000000000000066613e+00 -1.18370898555537409913e-02
78 1.00000000000001154632e+00 -1.18434959940283222185e-02
