# tag norm j_0
16.200000 1.00000000000020294877e+00 2.39072518953413401803e-05
16.200000 1.00000000000020294877e+00 -2.55282473313820225218e-04
16.200000 1.00000000000020294877e+00 2.28266481608919438121e-05
16.200000 1.00000000000020294877e+00 4.11751403782844476505e-04
16.200000 1.00000000000020294877e+00 4.83849166137217598632e-04
16.200000 1.00000000000020294877e+00 4.48027263341591627625e-04
16.200000 1.00000000000020294877e+00 4.12175510119604357386e-04
16.200000 1.00000000000020294877e+00 4.23795614135316525521e-04
16.200000 1.00000000000020294877e+00 4.13294608190352007106e-04
16.200000 1.00000000000020294877e+00 4.27705736185234205136e-04
16.200000 1.00000000000020294877e+00 4.15148889600364568060e-04
16.200000 1.00000000000020294877e+00 4.28377042752557375769e-04
16.200000 1.00000000000020294877e+00 4.17336467263798051568e-04
16.200000 1.00000000000020294877e+00 4.58640131103687923638e-04
16.200000 1.00000000000020294877e+00 4.92084848606428454376e-04
16.200000 1.00000000000020294877e+00 4.47863853844595021653e-04
16.200000 1.00000000000020294877e+00 5.74790178435907167368e-05
16.200000 1.00000000000020294877e+00 -2.33041379251088128476e-04
16.200000 1.00000000000020294877e+00 2.31027766514325138864e-05
