# tag norm j_0
14.600000 1.00000000000001243450e+00 -4.54697872167448557956e-02
14.600000 1.00000000000001243450e+00 -3.00288185030845901358e-02
14.600000 1.00000000000001243450e+00 5.95986462782102169311e-02
14.600000 1.00000000000001243450e+00 6.99246254863746669050e-02
14.600000 1.00000000000001243450e+00 -4.09399009498874130730e-02
14.600000 1.00000000000001243450e+00 6.88853078935939416860e-02
14.600000 1.00000000000001243450e+00 5.94169225600489139816e-02
14.600000 1.00000000000001243450e+00 -2.98955875268842527492e-02
14.600000 1.00000000000001243450e+00 -4.50068001928917924004e-02
