# tag norm j_0
6.500000 1.00000000000000643929e+00 -1.32958859688725294229e-02
6.500000 1.00000000000000643929e+00 3.19152638898938722720e-03
6.500000 1.00000000000000643929e+00 -1.07694759065486891231e-02
6.500000 1.00000000000000643929e+00 -2.03350948823052693828e-03
6.500000 1.00000000000000643929e+00 -9.84521026811844071625e-03
6.500000 1.00000000000000643929e+00 -2.01789227059370529158e-03
6.500000 1.00000000000000643929e+00 -1.06913111997830045929e-02
6.500000 1.00000000000000643929e+00 3.21067865170520999260e-03
6.500000 1.00000000000000643929e+00 -1.27950448759254521713e-02
