# tag norm j_0
28.400000 1.00000000000003308465e+00 -2.23723298668656866983e-02
28.400000 1.00000000000003308465e+00 1.83611062383568363066e-02
28.400000 1.00000000000003308465e+00 -7.50989078296995099526e-02
28.400000 1.00000000000003308465e+00 -2.00671618495002167248e-02
28.400000 1.00000000000003308465e+00 1.75052579339060959684e-01
28.400000 1.00000000000003308465e+00 -1.89606762901800666998e-02
28.400000 1.00000000000003308465e+00 -7.62919255521143369059e-02
28.400000 1.00000000000003308465e+00 1.80118127931472721270e-02
28.400000 1.00000000000003308465e+00 -2.15594546013896208592e-02
