# tag norm j_0
28.700000 1.00000000000003530509e+00 1.91457609351712888801e-02
28.700000 1.00000000000003530509e+00 -2.65458413519110199980e-03
28.700000 1.00000000000003530509e+00 -1.26535328343566916970e-02
28.700000 1.00000000000003530509e+00 1.63436115034585119354e-02
28.700000 1.00000000000003530509e+00 -5.09806556714091814453e-03
28.700000 1.00000000000003530509e+00 1.75934802145949059637e-02
28.700000 1.00000000000003530509e+00 1.51102316833255402584e-02
28.700000 1.00000000000003530509e+00 -9.32272255115809710992e-04
28.700000 1.00000000000003530509e+00 2.88837839833693613145e-02
28.700000 1.00000000000003530509e+00 -1.69209208525108040222e-02
28.700000 1.00000000000003530509e+00 2.85120939598402581283e-02
28.700000 1.00000000000003530509e+00 -7.03468612959133707437e-04
28.700000 1.00000000000003530509e+00 1.46769239871380238055e-02
28.700000 1.00000000000003530509e+00 1.77059177863404283715e-02
28.700000 1.00000000000003530509e+00 -5.00310313524324288409e-03
28.700000 1.00000000000003530509e+00 1.66008071790454680983e-02
28.700000 1.00000000000003530509e+00 -1.34166574225028298328e-02
28.700000 1.00000000000003530509e+00 -3.00478622442548097896e-03
28.700000 1.00000000000003530509e+00 1.96910601161363087164e-02
