# tag norm BO
1 1.00000000000000133227e+00 -2.82158488414364361230e-02
2 9.99999999999995448086e-01 1.28105652698309673519e-03
3 1.00000000000000865974e+00 1.18963811314404411396e-02
4 1.00000000000000088818e+00 6.31380786467300881420e-03
5 1.00000000000000421885e+00 2.65969577238120598317e-03
6 1.00000000000000088818e+00 4.68023394902501721493e-03
7 1.00000000000000577316e+00 2.43652098715611657720e-03
8 9.99999999999997002398e-01 4.10255810123463272865e-03
9 1.00000000000000310862e+00 9.09325309757499922192e-03
10 1.00000000000000355271e+00 1.34767580333097405226e-02
11 1.00000000000000177636e+00 1.70789364801701842866e-02
12 9.99999999999996780353e-01 1.77848704522958010049e-03
13 9.99999999999998112621e-01 1.28966602419214055458e-02
14 9.99999999999993116617e-01 1.44456455986537203595e-02
15 9.99999999999995559108e-01 1.30161843073884671979e-02
16 9.99999999999998889777e-01 1.17121043749049275062e-02
17 9.99999999999999777955e-01 1.02068652274736760416e-02
18 9.99999999999996114219e-01 1.52079607218134921914e-02
19 1.00000000000000466294e+00 -4.91554725027629722811e-03
20 1.00000000000000710543e+00 -1.29662803340746517894e-02
21 1.00000000000000377476e+00 -7.00257297834588812030e-03
22 1.00000000000000510703e+00 2.46108498124098353313e-03
23 1.00000000000000421885e+00 7.60881238102814952406e-03
24 9.99999999999996336264e-01 9.89091171951420218555e-03
25 9.99999999999998223643e-01 1.07537269981141780234e-02
26 1.00000000000000421885e+00 1.06758279864036260270e-02
27 9.99999999999997668532e-01 2.58079047999321305185e-02
28 1.00000000000000177636e+00 5.99102031615837346545e-03
29 9.99999999999997335465e-01 -6.55105899435021090532e-03
30 9.99999999999991118216e-01 -3.68443588036604895153e-03
31 1.00000000000000177636e+00 5.34688243229430350267e-03
32 1.00000000000000466294e+00 9.80726224190004922110e-03
33 1.00000000000000066613e+00 1.25123601097278658312e-02
34 9.99999999999999333866e-01 1.51732052339515512129e-02
35 1.00000000000000177636e+00 1.22701311872974189870e-02
36 9.99999999999995892175e-01 1.29944047248066758132e-02
37 1.00000000000000177636e+00 -5.53306241129199009865e-03
38 1.00000000000000843769e+00 -1.56664707063361337280e-02
39 9.99999999999999888978e-01 -3.34629862671283239209e-03
40 1.00000000000000022204e+00 3.09963648675156480672e-02
41 9.99999999999996891376e-01 4.77781330975566159713e-02
42 9.99999999999996447286e-01 5.09941728096918317492e-02
43 1.00000000000000177636e+00 4.22572640296226542667e-02
44 1.00000000000000532907e+00 5.62425304492997386874e-03
45 9.99999999999993560706e-01 -1.15341032841710638274e-02
46 1.00000000000001221245e+00 -1.80950709847178675682e-02
47 9.99999999999999777955e-01 -2.48821012526343745760e-03
48 1.00000000000000466294e+00 2.71502195718956486348e-02
49 1.00000000000000199840e+00 6.20253534398033518071e-02
50 1.00000000000000022204e+00 1.05084785708375427760e-01
51 1.00000000000000022204e+00 1.26814485490887834951e-01
52 9.99999999999998223643e-01 1.39602096449303769710e-01
53 1.00000000000000222045e+00 1.40177055212726053846e-01
54 9.99999999999998778755e-01 1.37464549187426815502e-01
55 1.00000000000000510703e+00 1.35666893478817746077e-01
56 1.00000000000000310862e+00 1.35032944106090707637e-01
57 9.99999999999995337063e-01 1.34896911273821473731e-01
58 1.00000000000000066613e+00 1.34856433594630953365e-01
