# tag norm j_0
12.000000 1.00000000000001976197e+00 1.68492263396374686302e-01
12.000000 1.00000000000001976197e+00 2.87189518561436658850e-02
12.000000 1.00000000000001976197e+00 8.84833377454268127371e-02
12.000000 1.00000000000001976197e+00 9.94534274851593680378e-02
12.000000 1.00000000000001976197e+00 6.24618263687037184040e-02
12.000000 1.00000000000001976197e+00 3.79600961166688052884e-02
12.000000 1.00000000000001976197e+00 9.74077663673874050154e-02
12.000000 1.00000000000001976197e+00 6.73871477440956684335e-02
12.000000 1.00000000000001976197e+00 7.75424097869082812329e-02
12.000000 1.00000000000001976197e+00 5.66405313748773384108e-02
12.000000 1.00000000000001976197e+00 7.73643187142172561455e-02
12.000000 1.00000000000001976197e+00 6.72339397574929914514e-02
12.000000 1.00000000000001976197e+00 9.74610589196048954230e-02
12.000000 1.00000000000001976197e+00 3.82011459258796842731e-02
12.000000 1.00000000000001976197e+00 6.09909695284639730151e-02
12.000000 1.00000000000001976197e+00 9.95605762346841588473e-02
12.000000 1.00000000000001976197e+00 8.99420473985653862181e-02
12.000000 1.00000000000001976197e+00 2.75297826526132057012e-02
12.000000 1.00000000000001976197e+00 1.63587304937847038966e-01
