# tag norm j_0
5.900000 1.00000000000000910383e+00 2.19460401934155327139e-03
5.900000 1.00000000000000910383e+00 1.31885127185024045998e-03
5.900000 1.00000000000000910383e+00 1.96471573075169755884e-03
5.900000 1.00000000000000910383e+00 1.44239848275767141260e-03
5.900000 1.00000000000000910383e+00 1.91184470150863590303e-03
5.900000 1.00000000000000910383e+00 1.49503939965572939068e-03
5.900000 1.00000000000000910383e+00 1.89419096583006330188e-03
5.900000 1.00000000000000910383e+00 1.51696452767259028736e-03
5.900000 1.00000000000000910383e+00 1.88793141381272109626e-03
5.900000 1.00000000000000910383e+00 1.52945454285578980383e-03
5.900000 1.00000000000000910383e+00 1.90431108103305234136e-03
5.900000 1.00000000000000910383e+00 1.53705666834394721193e-03
5.900000 1.00000000000000910383e+00 1.92874135965350238485e-03
5.900000 1.00000000000000910383e+00 1.52993723919829125932e-03
5.900000 1.00000000000000910383e+00 1.97280387153999248878e-03
5.900000 1.00000000000000910383e+00 1.49938951432064125797e-03
5.900000 1.00000000000000910383e+00 2.05578630184787740712e-03
5.900000 1.00000000000000910383e+00 1.38619127646786265140e-03
5.900000 1.00000000000000910383e+00 2.31785019554032762495e-03
