# tag norm j_0
11.200000 1.00000000000001154632e+00 -1.85116341335805706381e-01
11.200000 1.00000000000001154632e+00 4.70524805151568206729e-02
11.200000 1.00000000000001154632e+00 -1.32821069303737160361e-01
11.200000 1.00000000000001154632e+00 -2.86598065523948342115e-02
11.200000 1.00000000000001154632e+00 -6.22936742707178442435e-02
11.200000 1.00000000000001154632e+00 -2.82414483003405117345e-02
11.200000 1.00000000000001154632e+00 -1.33513729292007415905e-01
11.200000 1.00000000000001154632e+00 4.75747765063341127023e-02
11.200000 1.00000000000001154632e+00 -1.82325609596959981040e-01
