# tag norm n_hub[0] n_hub[1] n_hub[2] n_hub[3] n_hub[4] n_hub[5] n_hub[6] n_hub[7] n_hub[8] n_hub[9] n_hub[10] n_hub[11] n_hub[12] n_hub[13] n_hub[14] n_hub[15] n_hub[16] n_hub[17] n_hub[18] n_hub[19] n_hub[20] n_hub[21] n_hub[22] n_hub[23] n_hub[24] n_hub[25] n_hub[26] n_hub[27] n_hub[28] n_hub[29] n_hub[30] n_hub[31] n_hub[32] n_hub[33] n_hub[34] n_hub[35] n_hub[36] n_hub[37] n_hub[38] n_hub[39] n_hub[40] n_hub[41] n_hub[42] n_hub[43] n_hub[44] n_hub[45] n_hub[46] n_hub[47] n_hub[48] n_hub[49]
1 1.00000000000000000000e+00 1.47335368307976022351e+00 1.17415971954751086059e+00 1.27037296061742077669e+00 1.44138199225501995038e+00 1.13581217512995835683e+00 1.24427880273580737658e+00 9.75712345445875595118e-01 1.12142484979109147147e+00 8.97792266542925321282e-01 1.19658432547495574561e+00 1.05955288120460289214e+00 1.04631228859860425651e+00 1.52440314785004571441e+00 5.43763267354720802871e-01 9.19722846533431281912e-01 7.27974616231132132249e-01 1.07945230479676568258e+00 8.86251444629137519193e-01 6.67909358228861105289e-01 9.71697764634485539048e-01 8.05199202539939928869e-01 9.83840022687640702870e-01 8.95821763229420864327e-01 1.09770610703476845238e+00 1.00032614964046184802e+00 8.07250247761301276128e-01 1.03155635674012446934e+00 9.87400960631389268407e-01 1.43895336724803235562e+00 1.47270263796559319758e+00 1.26706583713434994820e+00 1.32920127355766237720e+00 1.35450562648678651811e+00 1.22545736190673193455e+00 1.02308829570616710569e+00 9.73203752902157104288e-01 1.05447883032040934381e+00 6.11971419971888974665e-01 4.93754936436994029680e-01 5.93841384783048487073e-01 5.98550748613918548457e-01 9.09369299720152790556e-01 9.73688601910619233593e-01 9.30415157120024094439e-01 7.10896595265692599064e-01 8.73416459417031720847e-01 6.82588388928890399399e-01 9.76138532298185923608e-01 4.06613848612218942158e-01 1.13308379274601489506e+00
2 1.00000000000000000000e+00 9.98969202464164762745e-01 1.22290753149585151860e+00 7.70127723224341642627e-01 1.11590581295815272078e+00 7.98258017875629222182e-01 1.17446144404380259374e+00 9.24677488313703666023e-01 1.05312585414912640580e+00 7.21969454961616574629e-01 1.22345369824024663430e+00 9.92001372421991933770e-01 1.01037517235160900775e+00 1.00267477604805099745e+00 1.96700423520038403247e+00 6.89940687093612836644e-02 1.95661075636589365523e+00 1.00572543621125554125e+00 1.57548807409077218367e+00 4.42623277055327613017e-01 1.00475968011392602364e+00 9.91348127298485981562e-01 1.26456074640779148055e+00 8.38812603664965239503e-01 1.10686680103783974261e+00 7.52932979107249766848e-01 1.03734428283828017392e+00 8.64216546172734134679e-01 1.93567519995077974571e+00 1.00132310014145486932e+00 1.82728337235912152714e+00 9.62730957076635474046e-01 1.19598806442904059821e+00 9.07531586623387287460e-01 1.09257918258688735413e+00 9.76234649423315392625e-01 1.10356103261202753707e+00 6.55463974594959641884e-01 1.59765272713167050256e+00 5.76862116856363571493e-01 1.13708234049449852243e+00 1.19541429852337760531e-01 1.03158297648656405165e+00 7.21421452931291229405e-02 1.07720242772030161404e+00 8.36976132919777016106e-01 1.00009253863140035179e+00 9.85576324368459100178e-01 1.00085400158851745012e+00 1.51975771944806506419e-02 1.00467097884227718474e+00
3 1.00000000000000000000e+00 9.44026794009970249277e-01 1.27633397393835634759e+00 7.43042453059582719277e-01 1.24751679513249968956e+00 7.00324591521971351327e-01 1.17072291930734695420e+00 8.34196203666016988798e-01 1.13894064649222048757e+00 7.26132908531070375702e-01 1.24861320549826460002e+00 8.17113764735958536534e-01 1.15540223842156253298e+00 9.95897553738965046755e-01 1.52567934208757560732e+00 6.51584096771656962055e-01 1.82581423574678525235e+00 9.67919395473186061629e-01 1.24050792669906417842e+00 7.55614490210876565968e-01 1.03566827500046265698e+00 9.93858645873427870576e-01 1.25160047121710982232e+00 7.06912219288773124859e-01 1.08518047083429869382e+00 9.32451174335992005737e-01 1.06115736351082445843e+00 7.35072911693183672632e-01 1.29702504701954701716e+00 7.79645015447190559144e-01 1.28724489389005514184e+00 8.92500766717766347291e-01 1.12077347391061699078e+00 8.71366041300499438726e-01 1.19855969850516164144e+00 7.26893966775375544032e-01 1.09559705249374217395e+00 9.93074297811172734818e-01 1.47213255769719641997e+00 5.86028866743687038010e-01 1.67742329631366304810e+00 4.70068896160105498261e-01 1.38208571934880275478e+00 4.49171104157816303282e-01 1.23680259543890835872e+00 6.38329665814394542345e-01 1.05852010446707178737e+00 9.83490229552420047732e-01 1.00429685235660737241e+00 1.40825446667463115985e-02 9.97602246614442744743e-01
4 1.00000000000000000000e+00 9.27094643375769633664e-01 1.28370782791817061863e+00 7.51390462730343822173e-01 1.23157368023381508237e+00 6.89491937558418310772e-01 1.19733639909753186714e+00 7.91429953863132973346e-01 1.21338049534423975118e+00 6.80402600944333468824e-01 1.26284459359352307928e+00 7.24837394706000281985e-01 1.25011196665979595899e+00 9.72900735424711671229e-01 1.58492004573778744181e+00 7.12098113005078747761e-01 1.72302622159508111999e+00 9.34087199656598143882e-01 1.26826246997882274847e+00 7.51864339739010234531e-01 1.04966731555801096043e+00 9.67612864097744163061e-01 1.25006915364085502418e+00 7.04309388960284055159e-01 1.10780016591067731468e+00 9.34115502975406242214e-01 1.12340217683146903482e+00 7.42378061290120405680e-01 1.23043128099250087537e+00 7.94943414847608220697e-01 1.30822194886996934216e+00 8.41118142184613559742e-01 1.25031764676616830023e+00 7.39983412826311970356e-01 1.20150919487044571810e+00 6.95574861359631646529e-01 1.11396494287858072170e+00 9.25228459662990831980e-01 1.32474917732286878724e+00 7.46306692582874520170e-01 1.35053306293981734143e+00 6.71113926909336799831e-01 1.30993586099028758163e+00 6.47809721462715981666e-01 1.19731125032212104564e+00 7.16855873201452276078e-01 1.10787955182968422818e+00 9.17687650673004728930e-01 1.03062165111411085938e+00 4.80436275995295355989e-02 9.99742937366694395251e-01
5 1.00000000000000000000e+00 9.04222769210630383796e-01 1.28675179772202441519e+00 7.62051943247877394683e-01 1.21921958183250445096e+00 6.89251661863551912113e-01 1.22559842415840281049e+00 7.53749389660844704153e-01 1.25412628554678029502e+00 6.88522201088931695701e-01 1.25610590505034092068e+00 7.20169335363196605471e-01 1.27307388978422952874e+00 9.40810867656349247845e-01 1.60539951796210966783e+00 7.20327492225092291811e-01 1.68376379842751844329e+00 8.97251387996846339057e-01 1.29164100372168255682e+00 7.74422635184146002096e-01 1.05836701015712497664e+00 8.63384230982927491915e-01 1.26482275693896406565e+00 7.26482762637491341629e-01 1.17938012795395485988e+00 8.95329502533179111268e-01 1.18243435564569376872e+00 7.43530380550032288234e-01 1.24951799453035383713e+00 7.78518394670090763121e-01 1.30763038330688430300e+00 8.04764847233408575633e-01 1.28022935417478622711e+00 7.08897425923430302142e-01 1.18717003840439971896e+00 6.94274719287242048082e-01 1.14523329815753793781e+00 8.75087992625626753807e-01 1.31833303991450367931e+00 7.61265456869999579403e-01 1.30798476581892164639e+00 7.03760293297934991230e-01 1.27694306471860064001e+00 6.78385258057199402870e-01 1.17978871886022318449e+00 7.70394127650124382889e-01 1.12657150388469040614e+00 7.88891715974919471854e-01 1.07892124272623890491e+00 1.10481452391903586796e-01 1.00676389641900176919e+00
6 1.00000000000000000000e+00 8.26189859970269169231e-01 1.30181306164584853491e+00 7.55527433037544215999e-01 1.26694939231743752828e+00 7.40034851503022061969e-01 1.26910127382673110219e+00 7.51134546216788323569e-01 1.26421776179647804561e+00 6.86420761353277897321e-01 1.23818245774931057213e+00 7.28645736530081022941e-01 1.31478062709575538314e+00 8.56310205836001037127e-01 1.60181594943273197806e+00 7.18266907145067468043e-01 1.65324886884197530534e+00 8.70149972763865631187e-01 1.31284843951142549123e+00 7.90867878954809810921e-01 1.08204569095867153550e+00 7.55386407804470416671e-01 1.27033397261929881239e+00 7.28054217011264714898e-01 1.24942172795861150547e+00 8.26367693439958861390e-01 1.26660712257068963638e+00 7.46401532345270735114e-01 1.28819328787557485505e+00 7.50604385331290480110e-01 1.30532929291888666334e+00 7.52375895082258550062e-01 1.28281300814989029924e+00 7.06294471356304631726e-01 1.19362909267266137370e+00 6.92807866500110614005e-01 1.18037417603126537635e+00 8.22307113691230662234e-01 1.30976357932046982846e+00 7.67862987689652887191e-01 1.29529213819807731412e+00 7.16961864597619680239e-01 1.24799169715893376598e+00 6.91263454663732512806e-01 1.18641614912936010917e+00 8.33468761827722559588e-01 1.13915010960208684665e+00 6.57157205667110888569e-01 1.11455479877661889354e+00 1.78839657764665954653e-01 1.01542465575807483447e+00
7 1.00000000000000000000e+00 7.97656844959875210854e-01 1.30135217652966517221e+00 7.58168227941617312027e-01 1.30285343500489725344e+00 7.54344258559380365092e-01 1.31940397197763426007e+00 7.43700592370956536925e-01 1.29895032879325111885e+00 6.84666356305712486829e-01 1.29585064862645027439e+00 7.04618022681290034903e-01 1.40402249323797323477e+00 7.55443225154678210664e-01 1.58959229179810201948e+00 7.07920960060011372761e-01 1.57014214040422062091e+00 8.50547460195559046348e-01 1.31950829103090083727e+00 7.88321312705987264913e-01 1.11986869408182720953e+00 7.09396546640134850747e-01 1.26086382926016371542e+00 7.08121780917161380842e-01 1.29627703560977858288e+00 7.73887927329581448710e-01 1.30229806588913721299e+00 7.42429903746769648265e-01 1.29998714558509931294e+00 7.41327630575706719718e-01 1.30309768761647637447e+00 7.30244350399110619954e-01 1.27512565492271856549e+00 6.98333853792298175911e-01 1.21507536106198732462e+00 6.91709278186736997718e-01 1.21559421011014179292e+00 7.69764561377784262142e-01 1.30429828378256340571e+00 7.59360583858217808029e-01 1.29114341471619598067e+00 7.16499294679069032021e-01 1.24466987961509745197e+00 7.03841624688742673044e-01 1.22206295228742467529e+00 8.74747780054958901097e-01 1.10727084292230215645e+00 5.22197359345345613058e-01 1.17535639289652182882e+00 2.54138956268196380961e-01 1.02394607944476723205e+00
8 1.00000000000000000000e+00 7.84916571245625860342e-01 1.30778041858177562773e+00 7.60562431371360259114e-01 1.32746014537197321026e+00 7.62040161430249218810e-01 1.34766406009947448119e+00 7.30794533172195115434e-01 1.35820695222749465714e+00 6.80185612276756113026e-01 1.38770624121276986429e+00 6.70211755660006569535e-01 1.46432554700688299931e+00 6.84020433331689159395e-01 1.54590716123632687662e+00 7.12331316034343853261e-01 1.49032486129285124399e+00 8.34822597548862121997e-01 1.31768632731402179914e+00 7.84398890736109799526e-01 1.16047086093446250032e+00 6.93839757555748226636e-01 1.24791033326615696808e+00 7.04677172176675692405e-01 1.29936777305741246735e+00 7.44779659410226613225e-01 1.30715075277971193302e+00 7.35067216726022709672e-01 1.30302520208424654768e+00 7.32270505478517463871e-01 1.30016884293344525680e+00 7.17301847002297709999e-01 1.27699028515530521588e+00 6.94136554101270730754e-01 1.23304127094148374688e+00 6.89945059699245355489e-01 1.23982848343823048864e+00 7.31880064650186290542e-01 1.29962250306314830439e+00 7.29091342227896843653e-01 1.29617104407110494968e+00 7.06772289082543525573e-01 1.26472332224237948850e+00 7.18528129434538809228e-01 1.26138673601390749468e+00 8.85597538560009778230e-01 1.09546955757407360466e+00 4.58214766424841934978e-01 1.19747690887502189483e+00 2.94621341357627408719e-01 1.02912686253172358519e+00
9 1.00000000000000000000e+00 7.84610525122251378782e-01 1.30938649883205249225e+00 7.63546887410329166990e-01 1.33262865819906539677e+00 7.56816524852800376344e-01 1.36141908210379769528e+00 7.26515267072674886251e-01 1.39221487508254160304e+00 6.81443982277905591083e-01 1.43519126037127620066e+00 6.66288179716253758933e-01 1.48790824407138200236e+00 6.77935614872339997738e-01 1.50324749264132950799e+00 7.24075127464600010185e-01 1.43949034110732765335e+00 8.21507712009498347605e-01 1.31302904482585724999e+00 7.76357748134230973847e-01 1.19552564490687207588e+00 6.91743422057403356540e-01 1.24519626260424542963e+00 7.02626736615035496492e-01 1.29532212282960901284e+00 7.27624209870397886668e-01 1.30357840423021564824e+00 7.23029210485679141307e-01 1.30198239765127610212e+00 7.18765008714668307555e-01 1.29686641139633485054e+00 7.06209274164584788203e-01 1.27818205152521269241e+00 6.89751813052470796883e-01 1.25282960813013621859e+00 6.83156671154294570236e-01 1.26162829286781685845e+00 7.03096514752367562906e-01 1.30076408740900850702e+00 7.01978201768540754912e-01 1.30410691937363032444e+00 6.88390145410944342963e-01 1.28940305354530115878e+00 7.21432233670159073213e-01 1.28973556876255002202e+00 8.41870644391498279546e-01 1.07190239446774082666e+00 4.01496379009557202711e-01 1.23363757970827370158e+00 3.87108155258768238394e-01 1.03744751404768709158e+00
10 1.00000000000000000000e+00 7.88972959524199435322e-01 1.31238139729860558980e+00 7.66321258346725264765e-01 1.34174372868587399310e+00 7.50259863864262466215e-01 1.38073577315852835667e+00 7.18250166042706306158e-01 1.41958673049333805594e+00 6.81230686324414969057e-01 1.45788862316701450794e+00 6.67726342771008285482e-01 1.48410349580448919227e+00 6.81672400735111927439e-01 1.46894178170601086286e+00 7.33571882438432409934e-01 1.40782501753134603462e+00 8.07812805005377332357e-01 1.31429384764445633671e+00 7.72774413391807635243e-01 1.22545015133135715146e+00 6.91859459894063832941e-01 1.24881811609147175268e+00 6.96228996575428249471e-01 1.28922844782190604285e+00 7.10554827672274624817e-01 1.29958519897574875657e+00 7.10171092904134715340e-01 1.30035316673000789223e+00 7.06799817396410512416e-01 1.29634947456372295882e+00 6.96803182340395066419e-01 1.28367823171536055149e+00 6.84155625193055616506e-01 1.26899554434480643650e+00 6.76692969639788199920e-01 1.27691186846148929668e+00 6.78580925428786008169e-01 1.30551810638803233999e+00 6.72673274332741155668e-01 1.31269102431825324118e+00 6.66866624943335817299e-01 1.31209645044706690875e+00 7.10495321874079488467e-01 1.29731014735852445696e+00 7.99323507465778293479e-01 1.07688022987543141618e+00 4.60857379783309983878e-01 1.22322981531114605147e+00 4.18012055299966545086e-01 1.04673579158807572576e+00
11 1.00000000000000000000e+00 7.92365599835999523393e-01 1.31436657359487263363e+00 7.68156125365847430864e-01 1.34749862604967041158e+00 7.48130770175742032535e-01 1.38909647321951768006e+00 7.15293535347166109517e-01 1.43391849072905119833e+00 6.83007343478736039799e-01 1.46941422547711297852e+00 6.72937388082397003330e-01 1.47750981725280672308e+00 6.89788667674046562794e-01 1.44738502236509614107e+00 7.40130765567583948084e-01 1.38810389718932891689e+00 7.96637758907350335136e-01 1.31682535341153350572e+00 7.66215951052130583854e-01 1.24969951951223290365e+00 6.96522857429866748546e-01 1.25509508848693007721e+00 6.92373159851494057726e-01 1.28457273823795192769e+00 7.00713858744267836798e-01 1.29506994219205640029e+00 6.98133708955275711361e-01 1.29601249848038824197e+00 6.94065906549774847001e-01 1.29399601615000747756e+00 6.85681298977640074632e-01 1.28580711594174501577e+00 6.73200007065493766234e-01 1.28140991912950741316e+00 6.59350948823204330296e-01 1.29036547228416997868e+00 6.41057422131513399144e-01 1.31052755070809712201e+00 6.19329719563117553349e-01 1.32021318646019070187e+00 6.08570042304743208383e-01 1.31504124427346824611e+00 6.48403081712606521592e-01 1.26938655985845971763e+00 7.02346680467192396868e-01 1.09265085261779271164e+00 5.92347618661636321491e-01 1.23172362979101746028e+00 5.92226796283572332058e-01 1.06732317357842587668e+00
12 1.00000000000000000000e+00 7.99121741203496771533e-01 1.31882683307266002082e+00 7.69764219735712740267e-01 1.35506948540613980647e+00 7.42081537330172125166e-01 1.40214177780928972439e+00 7.09530556628897079996e-01 1.44362837490449269495e+00 6.83571740025606611191e-01 1.47107019391309146172e+00 6.77225190011305877569e-01 1.46698714975324673304e+00 6.96647768899244401730e-01 1.43065290197310379661e+00 7.40498377983723754525e-01 1.37841827006208195172e+00 7.81961472024639059342e-01 1.32283245810091720784e+00 7.60001303016209051044e-01 1.26969622915369129146e+00 7.03078050510399843454e-01 1.25957995726837945760e+00 6.87654352769457410943e-01 1.27949396803583215210e+00 6.88560458106004524836e-01 1.28901076902673872304e+00 6.85469839371942168960e-01 1.29219028380607658946e+00 6.79001612418936195681e-01 1.29330385255087265683e+00 6.66679499086551774489e-01 1.29188165392568410361e+00 6.48980384622543593487e-01 1.29590282492823427596e+00 6.25397504298189521599e-01 1.30697959211364889143e+00 6.00040748447462246595e-01 1.31963095873020352933e+00 5.78854244515976557039e-01 1.32394137483060458926e+00 5.81793262864603644147e-01 1.30817630837829135260e+00 6.27462317796401269909e-01 1.24244463752514899824e+00 6.76614624136822495615e-01 1.12746305468342322698e+00 7.42504714840760970951e-01 1.20962474769614170000e+00 6.64191566652832188211e-01 1.08436525505497782795e+00
13 1.00000000000000000000e+00 8.02085170549742043633e-01 1.32078773769223123402e+00 7.69913246651750649008e-01 1.36279686885045236977e+00 7.39666096342700196686e-01 1.40883033889369335689e+00 7.07220191922428131903e-01 1.44928701092011524842e+00 6.86357637754008376163e-01 1.46869339775722074215e+00 6.83871081979439354726e-01 1.45664255912614115651e+00 7.03195742374827625909e-01 1.41941514367170240618e+00 7.35595500266298718550e-01 1.37278266286227879078e+00 7.58473086242276939295e-01 1.33042129305468459499e+00 7.49907955731202502392e-01 1.29443618473572308325e+00 7.17291453281262314512e-01 1.27544925217842486376e+00 6.89151270684235872643e-01 1.27214704302033521088e+00 6.74947519534585538281e-01 1.27441800582640385464e+00 6.59620316865499822789e-01 1.27971582639516556767e+00 6.41036987524395640570e-01 1.28847711879514181810e+00 6.16788979367840273227e-01 1.30237461933117448787e+00 5.89917273111459361523e-01 1.31344782690552319693e+00 5.66373881950788526929e-01 1.32380921192119638263e+00 5.53401643082429228748e-01 1.32308915859307463236e+00 5.61240466689030270686e-01 1.30579771473922390257e+00 5.92119766240286171666e-01 1.26305551945394611835e+00 6.38051200538095386605e-01 1.20532670654639018082e+00 7.14390004307074222289e-01 1.21834610790830555338e+00 8.52566346836423960553e-01 1.22808930367585245058e+00 7.51958754976275622894e-01 1.08722181234159176455e+00
14 1.00000000000000000000e+00 7.97970300015755862333e-01 1.31922343812277209629e+00 7.66266394052342869614e-01 1.35814111692920391761e+00 7.39417548075678943142e-01 1.40034072529804287655e+00 7.09800322443738807010e-01 1.43503170733671359116e+00 6.90476312488589427652e-01 1.45491199719974639848e+00 6.86177530688003023407e-01 1.44975325708581825879e+00 6.97746598766313508300e-01 1.42414952621763557516e+00 7.20825120133548602475e-01 1.38621982586758485390e+00 7.43087674107627660369e-01 1.34715063896882414340e+00 7.47267359147657628249e-01 1.30936736608899617629e+00 7.29648384240810243817e-01 1.27808897965917878103e+00 6.97328108235334087617e-01 1.26492769001090454850e+00 6.69992656103380435084e-01 1.26706856739169104742e+00 6.45551295517794554435e-01 1.27814217850089950623e+00 6.18510008514864706441e-01 1.29379375075574021281e+00 5.89930035072171898847e-01 1.30965367052972614381e+00 5.66461858269200368987e-01 1.31942683727443244024e+00 5.55542708378417682269e-01 1.31936733159056429621e+00 5.63301580410141222721e-01 1.30494252697298107613e+00 5.90229377605973382082e-01 1.27337024425280476159e+00 6.30352377799507923584e-01 1.23763193644703650698e+00 6.70448475412018018993e-01 1.22182107918377647060e+00 7.48251368476665179585e-01 1.26490129554139274504e+00 8.39935701296714132269e-01 1.23010021938678515419e+00 7.44488955043545508339e-01 1.09346604309083983431e+00
15 1.00000000000000000000e+00 7.81729198755072962612e-01 1.31066580086975648101e+00 7.56211165041211441640e-01 1.33266402227099001188e+00 7.40796373071027525192e-01 1.34969041197035477531e+00 7.22475037573194200924e-01 1.35890921032154055048e+00 7.05769346263519947726e-01 1.35443045199839451342e+00 6.96846528777797069587e-01 1.33505998871893183377e+00 6.97122772116945066401e-01 1.31240449382410151458e+00 7.08597162904346933310e-01 1.29868364732583985166e+00 7.30072204829969373385e-01 1.29558197353944826169e+00 7.43694493777334986184e-01 1.29532097667133783148e+00 7.32808409654730263938e-01 1.29302619910649196910e+00 7.01015545110385440708e-01 1.29481348639147419988e+00 6.73427082621206873903e-01 1.29875643758371817071e+00 6.53251897971038664181e-01 1.30527007617687562657e+00 6.43879553179705133026e-01 1.31015070198470140461e+00 6.46518680630348119287e-01 1.31034691566441208188e+00 6.47808017583060946620e-01 1.30031161051575883114e+00 6.54555494535435933301e-01 1.28949082204926446238e+00 6.58926170310195735702e-01 1.27254686113358572719e+00 6.69718147046734602057e-01 1.25301992686290897261e+00 6.86859642081309673678e-01 1.24792862349692357249e+00 7.29585114477623530860e-01 1.27852626510859224140e+00 8.04579767309241189466e-01 1.27235791299805289789e+00 7.80010445711540323366e-01 1.21974258267187796179e+00 7.12197111258040305160e-01 1.13184523815344517672e+00
16 1.00000000000000000000e+00 7.70665612997212590152e-01 1.30377083908869506601e+00 7.49754762603665358967e-01 1.31081861738402194462e+00 7.41962462238142217430e-01 1.30709722527447635976e+00 7.28879822514383657328e-01 1.29771325892329603136e+00 7.15409893489096115893e-01 1.28368129022360122349e+00 7.02318407593287674651e-01 1.26936719016417387529e+00 6.93031980583748041802e-01 1.26023308921710452957e+00 6.93282561905186556217e-01 1.26315062399133459792e+00 7.04998566966430373348e-01 1.27810035912484187826e+00 7.21357886441718165749e-01 1.29769421960658570825e+00 7.34356991165936667798e-01 1.30876211085503024734e+00 7.34192239882616504154e-01 1.31057513944030779030e+00 7.21508922134623920108e-01 1.30730704583803380991e+00 7.09054558417171798546e-01 1.30345103935926354133e+00 7.00483090962841337124e-01 1.29853362105659630998e+00 6.95482347159076086385e-01 1.29222983399942914495e+00 6.91652657090080835722e-01 1.28603886793989286019e+00 6.88646444974277849305e-01 1.27609391731658017299e+00 6.87618734375633366973e-01 1.26894691007898496871e+00 6.91893051656448099251e-01 1.26927693132387031660e+00 7.10339283873358318111e-01 1.28193132801420195399e+00 7.50866496318811749155e-01 1.29952871028441663270e+00 7.86121622763505389919e-01 1.28132180415419161257e+00 7.55000655684415766800e-01 1.21500554730171184126e+00 7.06101610662307588306e-01 1.14438981558524499604e+00
17 1.00000000000000000000e+00 7.69748231199424148841e-01 1.30365257306592408071e+00 7.48538629745971406670e-01 1.31122172959299820860e+00 7.41186792280176032222e-01 1.30787448096554470567e+00 7.29447617676013737587e-01 1.29865524652648978154e+00 7.15444261987355778487e-01 1.28620123644651251915e+00 7.02580936834759750553e-01 1.27408439275659124412e+00 6.93607251172585148602e-01 1.26616853974342702394e+00 6.90483996720572701378e-01 1.26718369615138359841e+00 6.93287601352165494539e-01 1.27666133074894250221e+00 6.99141954434296164500e-01 1.29020193150620454681e+00 7.05452334918643009232e-01 1.30122027366071635335e+00 7.07679926284442317730e-01 1.30722124652117788202e+00 7.04805686234910910848e-01 1.30798959732850650362e+00 7.01550678724949694498e-01 1.30437657331830925145e+00 6.95110647408517023926e-01 1.30207689007469640252e+00 6.90542819982906674880e-01 1.29914741558188739923e+00 6.89391280274389117722e-01 1.29593767396725301211e+00 6.89867463282284765214e-01 1.29283533529103245030e+00 6.97473298199944080622e-01 1.29401884479433149089e+00 7.13109357257442177946e-01 1.30093555615147216109e+00 7.39528568624678195320e-01 1.30769879571618674596e+00 7.64133261737856894769e-01 1.29975304703301031140e+00 7.49550335521769639513e-01 1.25540907001769763696e+00 7.16285089140606512359e-01 1.21983675364838672905e+00 6.98053604592020038311e-01 1.18363614380238280077e+00
18 1.00000000000000000000e+00 7.52240832280335447457e-01 1.30176714199605192412e+00 7.30440076369969548686e-01 1.31183586587266454160e+00 7.28324855221998523902e-01 1.31306571790974646596e+00 7.26795652434344296999e-01 1.31229296726264621498e+00 7.20792374311425287914e-01 1.30912763234168338933e+00 7.14029769821744597635e-01 1.30233190330359849263e+00 7.06039039084803921043e-01 1.29431938742886765148e+00 6.96862195717800281258e-01 1.28689314527437748126e+00 6.90975696361721625216e-01 1.27884040201004367532e+00 6.83744846765095504182e-01 1.27357071868268567627e+00 6.84542289254035374313e-01 1.27414383324778057727e+00 6.84784370370789763349e-01 1.28541594177854556769e+00 6.86494480304632337386e-01 1.29584887580826002562e+00 6.87128591915349917763e-01 1.30419770576707638732e+00 6.85899014922264904648e-01 1.30980975637192487149e+00 6.86811870403409630015e-01 1.31218118748733703072e+00 6.89764494701519237374e-01 1.31446227665680126506e+00 6.96943284351490000006e-01 1.31427892396561785127e+00 7.09471321768290641430e-01 1.31384646144457106764e+00 7.26116278808354942420e-01 1.31531036674467038949e+00 7.41542898464474964371e-01 1.31089689495709471601e+00 7.45921828264132114050e-01 1.29140986435634075313e+00 7.29790770628690799171e-01 1.25508115377132045687e+00 7.04357064174577884863e-01 1.22230666566357570879e+00 6.95386200059850301258e-01 1.19156511313516610961e+00
19 1.00000000000000000000e+00 7.50850071144462782868e-01 1.30171976290605440063e+00 7.28923879010534014888e-01 1.31157552763594864587e+00 7.27376639074125752593e-01 1.31401985727907888446e+00 7.25057660081789401296e-01 1.31340275236268877457e+00 7.20539926011944054096e-01 1.31065585181465915632e+00 7.14176037900625004795e-01 1.30631110728548116562e+00 7.07068296887143565854e-01 1.30093074307585210292e+00 6.99734426865118552819e-01 1.29531359947771318453e+00 6.93143153214215379521e-01 1.28964210634725273685e+00 6.87802260802609310986e-01 1.28650763878557694575e+00 6.84722423480821351660e-01 1.28637093269616675784e+00 6.84780437052554535882e-01 1.29081392611580958452e+00 6.86519954396474840763e-01 1.29718398692451675203e+00 6.88695133922729518794e-01 1.30338482938518174237e+00 6.91903115364356002814e-01 1.30666545511558429560e+00 6.96339897005815222641e-01 1.31019443395398016428e+00 7.02070424660162784036e-01 1.31203750890877612889e+00 7.10367891881295676626e-01 1.31414849284908430427e+00 7.18572545460747003077e-01 1.31366992354531486598e+00 7.23875891451400743648e-01 1.30613477009152378905e+00 7.22035041084441497894e-01 1.28917492390408217062e+00 7.08111795728106785397e-01 1.26656630649917589793e+00 6.96919691476176383915e-01 1.25449232916509756386e+00 6.81184773159221323979e-01 1.24760509685904752430e+00 6.97059912381511548318e-01 1.22364685751772839239e+00
20 1.00000000000000000000e+00 7.37187319500698823305e-01 1.30028136793285176154e+00 7.12624319434852493416e-01 1.31051457729322073931e+00 7.11546563251011288109e-01 1.31438949861516518602e+00 7.12042889108298604484e-01 1.31685613196867090657e+00 7.12723435115876879919e-01 1.31706649244639106833e+00 7.12414250296179663025e-01 1.31886574406633583223e+00 7.11073890718938672606e-01 1.31826135096510244082e+00 7.09435898732787673104e-01 1.31958314707342050376e+00 7.05068583212127286686e-01 1.31770908860075364188e+00 7.01380907333332692666e-01 1.31764943970894221614e+00 6.95779965117465648561e-01 1.31571981109626356954e+00 6.89503435292491917430e-01 1.31142774853985755179e+00 6.86602442378763666575e-01 1.31159087801761309322e+00 6.81606995045581087744e-01 1.31296032178032318072e+00 6.83558375768365200642e-01 1.31232781840019940844e+00 6.83651574001769013478e-01 1.31435680391509479570e+00 6.85605466877425628880e-01 1.31471523198799111753e+00 6.87637994505794436506e-01 1.31388690330528201677e+00 6.89773324277372146263e-01 1.30798590166491934816e+00 6.91206826833484333505e-01 1.29944802874711107243e+00 6.89372477747504541767e-01 1.28338095426939591270e+00 6.86480118320668686316e-01 1.26737717190164800307e+00 6.84545831058810283487e-01 1.25609928040179830155e+00 6.86407883618478931176e-01 1.25212039222117144099e+00 6.96201102489987122546e-01 1.23199404504197440602e+00
21 1.00000000000000000000e+00 7.36726542619557611680e-01 1.30026848226055902202e+00 7.11936280607333715764e-01 1.31052836711298192895e+00 7.10757007266920370903e-01 1.31441109955262569464e+00 7.11444962392101643012e-01 1.31632877792975633291e+00 7.11885191556805185797e-01 1.31744660922765022271e+00 7.11621159588209040159e-01 1.31822746255569756002e+00 7.10203952660165005462e-01 1.31874843275204045590e+00 7.08143818846798445144e-01 1.31930211432612987110e+00 7.05109341435310454926e-01 1.31971052393020493732e+00 7.01562403027502501374e-01 1.31965682834644049137e+00 6.96871361886522877604e-01 1.31929049830735878324e+00 6.91718087610973975110e-01 1.31889172206768234830e+00 6.87349861924327454332e-01 1.31899966269213297920e+00 6.84008847803036834634e-01 1.31843577026367397842e+00 6.82599135020997560552e-01 1.31804200457635767307e+00 6.81506115278805890689e-01 1.31628449214587139871e+00 6.81530018820362792908e-01 1.31325909553547193198e+00 6.81567786380994244944e-01 1.30800147333675775840e+00 6.81878263677203055870e-01 1.30014590062001489379e+00 6.81410474613310279679e-01 1.28831371817144058056e+00 6.81154149638470762795e-01 1.27739492563805279168e+00 6.81558349724396994596e-01 1.27094093184351053516e+00 6.79908899700198743332e-01 1.26712575790425363564e+00 6.83841822153790523942e-01 1.26996420330627346473e+00 6.97703009867850276748e-01 1.24628430149546720607e+00
22 1.00000000000000000000e+00 7.29026971843044324650e-01 1.29954135669004933185e+00 7.01689012512909493502e-01 1.31004471317679227482e+00 6.99403587358966238874e-01 1.31403290772944991716e+00 6.99593813986893575674e-01 1.31572653479244960906e+00 7.00280921858006832892e-01 1.31703675240601758567e+00 7.02034931262997985435e-01 1.31757356561110583471e+00 7.02227493690328663511e-01 1.31842602899695204854e+00 7.02571152772303086920e-01 1.31952880852401266409e+00 7.02534619835965101764e-01 1.31857618208195925824e+00 7.01464619163816749392e-01 1.31868185739383148025e+00 7.01489911723051751125e-01 1.31914734551963785947e+00 7.02854589266066365205e-01 1.31809488242815686654e+00 7.01513695691244998365e-01 1.31696981708908444908e+00 6.98372856724422952368e-01 1.31540951659123006579e+00 6.93850186765189169691e-01 1.31287995578916549810e+00 6.90473908221242327343e-01 1.30971579270429816511e+00 6.89110011950980871909e-01 1.30630551584579479574e+00 6.87105359369310275675e-01 1.30128149901194745119e+00 6.85400370185664353784e-01 1.29486980891901914958e+00 6.84438634735204165516e-01 1.28756035224153930763e+00 6.83374729195606711585e-01 1.28092139900845092271e+00 6.83126863165267717015e-01 1.27658435473379272551e+00 6.84293734850576540474e-01 1.27420946949658109304e+00 6.87957031657146278469e-01 1.27320091430964810186e+00 6.98352086388131954031e-01 1.25113957473485704064e+00
23 1.00000000000000000000e+00 7.27427669667630172334e-01 1.29943369332925029447e+00 6.99736781287501163895e-01 1.30967915190435113537e+00 6.96808116739134897344e-01 1.31364436601715195430e+00 6.96657103023841983713e-01 1.31561977861404488799e+00 6.97144752197044192954e-01 1.31666313669018708588e+00 6.97808422811316053647e-01 1.31719892477981836976e+00 6.98362636287417126724e-01 1.31739446108804592050e+00 6.98739629190025857142e-01 1.31735138461248868502e+00 6.98787611792923812892e-01 1.31705521525638791225e+00 6.98771836636132626097e-01 1.31656679440336965570e+00 6.98529916013962526300e-01 1.31577831682275592229e+00 6.97618859430771620644e-01 1.31479151430855023541e+00 6.96341664675606319967e-01 1.31258212443555244420e+00 6.94452068440896796986e-01 1.30998045915251815074e+00 6.91321788940155057546e-01 1.30628933203728525569e+00 6.88723073001555219363e-01 1.30365598976087615490e+00 6.86155504999485410522e-01 1.29847366259088814466e+00 6.84126247478439086791e-01 1.29482062519218321661e+00 6.84278461950000416181e-01 1.29309942232884922397e+00 6.81509101196738797945e-01 1.29364794017388362590e+00 6.82008615221766700820e-01 1.29995776062397849770e+00 6.82379559386024792111e-01 1.29937775374417485708e+00 6.86322934333752576741e-01 1.29686307295806302342e+00 6.88047567897396739056e-01 1.29786915640571143271e+00 6.99973514500159099683e-01 1.27017252566982974393e+00
24 1.00000000000000000000e+00 7.19675399634850943009e-01 1.29894985361725656681e+00 6.89117638055085302007e-01 1.30944108135530079551e+00 6.83917243530992036149e-01 1.31382170498896355681e+00 6.81835539565378234705e-01 1.31600372961151657059e+00 6.81435511966143381279e-01 1.31773738044588184515e+00 6.81248361381833422712e-01 1.31853362227828796449e+00 6.79563119269597004646e-01 1.32035167937769837287e+00 6.81055845780886182084e-01 1.31898274838533779985e+00 6.81139881311325967594e-01 1.32011720271996391141e+00 6.82138251718755306285e-01 1.32019398573850610390e+00 6.81847120531726025305e-01 1.31955047260090929662e+00 6.81187124117789699618e-01 1.32087899340383563285e+00 6.82836370156257754793e-01 1.32326460912098253786e+00 6.84690149177231588418e-01 1.32162064158130210245e+00 6.85374136910636866382e-01 1.32129638539316984769e+00 6.86164701619912054120e-01 1.31914268987198046723e+00 6.84933681788726267392e-01 1.31686558495010053171e+00 6.84211207534217047410e-01 1.31540849339093846027e+00 6.83437610863174782594e-01 1.31421626149597670086e+00 6.82673711451075249101e-01 1.31320793806685620631e+00 6.83215854722580284708e-01 1.31262244351452084246e+00 6.84500220957367844221e-01 1.31169915706511708287e+00 6.86457267923862968217e-01 1.31004030356529366230e+00 6.90620251338769364224e-01 1.30557239710739514393e+00 7.00856351182690961998e-01 1.27634808786170417250e+00
25 1.00000000000000000000e+00 7.19484682111114048908e-01 1.29894447353782460652e+00 6.88823463576658356899e-01 1.30941394811627498385e+00 6.83546209242924085459e-01 1.31377339705753715116e+00 6.81450790617086910039e-01 1.31619741864059958125e+00 6.80362606169092831720e-01 1.31773555977978884535e+00 6.79717313575188386565e-01 1.31878225234658064124e+00 6.79317397817683410466e-01 1.31949592793186742945e+00 6.79036751784962588907e-01 1.32002993913392629999e+00 6.78859472919214446129e-01 1.32055364431440391826e+00 6.78772557213534022402e-01 1.32086944462479305429e+00 6.78603173189073483051e-01 1.32106280070837400764e+00 6.78600208606071064743e-01 1.32145346492806559091e+00 6.79175717261189637597e-01 1.32186232798464597948e+00 6.79461939571382012026e-01 1.32189539887443952004e+00 6.79478323046119769835e-01 1.32175307343446912789e+00 6.79700807914388582809e-01 1.32120919512705481402e+00 6.79673924583320543391e-01 1.32087225784438500042e+00 6.80167504266785849509e-01 1.32039201375754422507e+00 6.80384038620126974095e-01 1.31979147204565538942e+00 6.80751575634686023619e-01 1.31957604834972253016e+00 6.81995184002470611340e-01 1.31931144480012618736e+00 6.83569469867266965579e-01 1.31788992419295913905e+00 6.85649924132519905662e-01 1.31750631965650888411e+00 6.89948182102441021080e-01 1.31148162729684192307e+00 7.01073929476001667105e-01 1.28054147821406538732e+00
26 1.00000000000000000000e+00 7.19307994683150542237e-01 1.29895003857846136341e+00 6.88565031334232857674e-01 1.30943906472946469677e+00 6.83199475754567631114e-01 1.31382371897942284988e+00 6.81012200221408070533e-01 1.31625505266849551766e+00 6.79843455942134466952e-01 1.31780686780888878218e+00 6.79120326411208896644e-01 1.31888538063810556444e+00 6.78674340312458546087e-01 1.31961959998218469892e+00 6.78395190116181878714e-01 1.32019932512782145473e+00 6.78142735810928209972e-01 1.32053600567324713744e+00 6.77960123136541636946e-01 1.32104438721258943268e+00 6.77609012992583026325e-01 1.32138615210374399389e+00 6.78042224844684793261e-01 1.32128759297545261830e+00 6.78190488288015314033e-01 1.32144087651188502086e+00 6.78252932642273043129e-01 1.32174026534188726600e+00 6.78583262387494334789e-01 1.32184489545778771635e+00 6.78763707795889459362e-01 1.32206353005034737969e+00 6.79225832279311214634e-01 1.32205933304750677948e+00 6.79720510407393341268e-01 1.32195388662281865244e+00 6.80369853636883292758e-01 1.32160042053078230495e+00 6.81129582891604856698e-01 1.32109022766569195184e+00 6.82151775195693144127e-01 1.32038063703600072607e+00 6.83754033735781585612e-01 1.31919614286294395455e+00 6.86166724002072792032e-01 1.31702822446251222033e+00 6.90566749725366246793e-01 1.31168317745729967605e+00 7.01065209470944750159e-01 1.28087242245549526309e+00
27 1.00000000000000000000e+00 7.19309419632132573952e-01 1.29894997789851740500e+00 6.88568903592638004163e-01 1.30943757918491043846e+00 6.83209043329297549541e-01 1.31381934249564169548e+00 6.81024308470091321865e-01 1.31625514308956637066e+00 6.79856865768092455404e-01 1.31780674320386315124e+00 6.79147643527843958289e-01 1.31887752102927646725e+00 6.78687807138555809772e-01 1.31965524229697894754e+00 6.78383207062008719568e-01 1.32023738276673063829e+00 6.78185561248579316107e-01 1.32068465736028883839e+00 6.78091192168424505837e-01 1.32102148228490534621e+00 6.78054658644615670937e-01 1.32127804358897527059e+00 6.78116272415178911181e-01 1.32147563114616484192e+00 6.78259171511707337210e-01 1.32163458725631355328e+00 6.78485492677459722799e-01 1.32174892539492350174e+00 6.78797313942793856256e-01 1.32178223544392081656e+00 6.79086350461817866986e-01 1.32188354696002097199e+00 6.79470395722737374733e-01 1.32172564322858021590e+00 6.79600905610057814954e-01 1.32173865534945944589e+00 6.80448895676151521705e-01 1.32131200891141764586e+00 6.81148762399042539961e-01 1.32084398019788995526e+00 6.82208589436112289306e-01 1.32015868865662233667e+00 6.83762244899354332262e-01 1.31900258150354110498e+00 6.86195503579747900780e-01 1.31680196194322585157e+00 6.90561755684737876848e-01 1.31144766892269903913e+00 7.01052563484085844436e-01 1.28070794180189917455e+00
28 1.00000000000000000000e+00 7.19380108951085506241e-01 1.29895341517141971188e+00 6.88669216031662423383e-01 1.30943840323371052392e+00 6.83336339585146168574e-01 1.31381503993271886443e+00 6.81178116208429162981e-01 1.31624543627778001209e+00 6.80038640373841651865e-01 1.31778937523743389093e+00 6.79357773306551893100e-01 1.31885098210014595210e+00 6.78928113164574464911e-01 1.31961796819953947058e+00 6.78649026482697981244e-01 1.32018974790568766053e+00 6.78477121761384527332e-01 1.32062246650119230473e+00 6.78384749702672595895e-01 1.32095412946493939721e+00 6.78352545609996693265e-01 1.32120182351532355902e+00 6.78389919982679612254e-01 1.32138061653308080956e+00 6.78457565205745294357e-01 1.32151283203575875547e+00 6.78579246670739766323e-01 1.32158213341534791496e+00 6.78756531754621139640e-01 1.32160638518385908924e+00 6.79029032510180541315e-01 1.32157717874537938840e+00 6.79364925159276378253e-01 1.32149908685050365698e+00 6.79772380428918854278e-01 1.32135966889041167605e+00 6.80384160211057076317e-01 1.32107725724346591889e+00 6.81154894477267736086e-01 1.32065792380039526144e+00 6.82213564074075295984e-01 1.32000035990490816040e+00 6.83755876555388497628e-01 1.31887803085978450035e+00 6.86186221659241257775e-01 1.31672537020229230009e+00 6.90565111299985323612e-01 1.31138828805724161342e+00 7.01050314095662874259e-01 1.28066458547468120521e+00
29 1.00000000000000000000e+00 7.19386987711063463635e-01 1.29895365781912719427e+00 6.88678296372555176497e-01 1.30943849117250366021e+00 6.83347709004069714389e-01 1.31381469082087409816e+00 6.81191891545696481813e-01 1.31624361063377315340e+00 6.80054022428107529663e-01 1.31778698744303079948e+00 6.79374877216134209768e-01 1.31884791288774305684e+00 6.78945204053946094191e-01 1.31961445801092724928e+00 6.78669896025476893087e-01 1.32018604963309993394e+00 6.78499752069460226878e-01 1.32062030761437720905e+00 6.78407792203854609348e-01 1.32095228627516503295e+00 6.78378759205520154296e-01 1.32120444218792076896e+00 6.78404015521360426177e-01 1.32139044006129058317e+00 6.78480265127111681345e-01 1.32151989581845219490e+00 6.78609499679585503884e-01 1.32159682674775580402e+00 6.78796040721188931322e-01 1.32162119790200405234e+00 6.79046431522917548484e-01 1.32159229322714821819e+00 6.79377974443112542247e-01 1.32150039189078483126e+00 6.79812880260624363693e-01 1.32132985652672196863e+00 6.80384112799370721625e-01 1.32105445496826368057e+00 6.81150615518039237450e-01 1.32062548036580418298e+00 6.82210629158963244301e-01 1.31994705133715983791e+00 6.83755139230565744946e-01 1.31880981170225286547e+00 6.86185206219554699736e-01 1.31665416399657431157e+00 6.90561652793854952037e-01 1.31132369720512165223e+00 7.01046460728593001654e-01 1.28061543219166851237e+00
30 1.00000000000000000000e+00 7.19390784892052548294e-01 1.29895387713737475721e+00 6.88683534223067383984e-01 1.30943856694413196529e+00 6.83353682535883466542e-01 1.31381462768724821544e+00 6.81198559143534887461e-01 1.31624350655286503908e+00 6.80061284693769030341e-01 1.31778654116959792475e+00 6.79382259048293857262e-01 1.31884732435280316309e+00 6.78952624770895019068e-01 1.31961341621461025753e+00 6.78676689792826803860e-01 1.32018450447118329549e+00 6.78505698191986472700e-01 1.32061828585437157635e+00 6.78412732248059757723e-01 1.32094982105498592873e+00 6.78382574379483349603e-01 1.32120137669363013622e+00 6.78407267898997190514e-01 1.32138724155362208279e+00 6.78483690779051573649e-01 1.32151614833778774383e+00 6.78612607267936818189e-01 1.32159259720370059199e+00 6.78798521212542804726e-01 1.32161729491807622416e+00 6.79050130133980411884e-01 1.32158708792907386709e+00 6.79381628601958609259e-01 1.32149407685233333254e+00 6.79815370006028540928e-01 1.32132315912242703781e+00 6.80386590115337974716e-01 1.32104736797538135917e+00 6.81152701417191641653e-01 1.32061763298570156167e+00 6.82213395167628799953e-01 1.31993872572147541433e+00 6.83756601300589794690e-01 1.31880147528714752880e+00 6.86185315106037752031e-01 1.31664657140154028880e+00 6.90561376912151025920e-01 1.31131710559821357265e+00 7.01046185538799160319e-01 1.28060986160270351419e+00
