# tag norm j
0 1.00000000000000044409e+00 0.00000000000000000000e+00
0.050000 9.99999999999991784350e-01 1.61777878372257266637e-01
0.100000 9.99999999999982236432e-01 1.73485809471680491045e-01
0.150000 9.99999999999984012788e-01 2.42742327164395185757e-02
0.200000 9.99999999999987565502e-01 -1.47431185443075429831e-01
0.250000 9.99999999999981792342e-01 -1.82359236017791359608e-01
0.300000 9.99999999999990563104e-01 -4.81421605410869146713e-02
0.350000 9.99999999999991340260e-01 1.30687006186083920500e-01
0.400000 9.99999999999990563104e-01 1.88251741543914719035e-01
0.450000 9.99999999999996669331e-01 7.12061040731469252485e-02
0.500000 1.00000000000000244249e+00 -1.11825459338097968343e-01
0.550000 9.99999999999999333866e-01 -1.91065599150686438179e-01
0.600000 1.00000000000000133227e+00 -9.30793829541654155202e-02
0.650000 1.00000000000000666134e+00 9.11659707743013025816e-02
0.700000 1.00000000000000288658e+00 1.90759365469105268698e-01
0.750000 1.00000000000000444089e+00 1.13400252750181507189e-01
0.800000 1.00000000000000466294e+00 -6.90536073001897787726e-02
0.850000 1.00000000000001176836e+00 -1.87339742217540322633e-01
0.900000 1.00000000000001842970e+00 -1.31828262996190992418e-01
0.950000 1.00000000000001687539e+00 4.58638892034914716356e-02
1.000000 1.00000000000001976197e+00 1.80873144090956339269e-01
1.050000 1.00000000000002309264e+00 1.48062813244632995868e-01
1.100000 1.00000000000002264855e+00 -2.19826078546823053261e-02
1.150000 1.00000000000002153833e+00 -1.71469878557278881948e-01
1.200000 1.00000000000001465494e+00 -1.61832819105016678662e-01
1.250000 1.00000000000001576517e+00 -2.18444519447744253324e-03
1.300000 1.00000000000001554312e+00 1.59299549141201951530e-01
1.350000 1.00000000000001110223e+00 1.72919706296618180819e-01
1.400000 1.00000000000001709743e+00 2.62378114601058629041e-02
1.450000 1.00000000000001443290e+00 -1.44567808496672528529e-01
1.500000 1.00000000000001532108e+00 -1.81139932921298651980e-01
1.550000 1.00000000000001598721e+00 -4.97692373203490467937e-02
1.600000 1.00000000000001576517e+00 1.27535732985622568547e-01
1.650000 1.00000000000000777156e+00 1.86372109904873461961e-01
1.700000 1.00000000000000244249e+00 7.23936683842466011107e-02
1.750000 1.00000000000000310862e+00 -1.08489303255273172866e-01
1.800000 1.00000000000000222045e+00 -1.88532133501622234384e-01
1.850000 9.99999999999993005595e-01 -9.37281461925697084725e-02
1.900000 9.99999999999996447286e-01 8.77630385919913047488e-02
1.950000 9.99999999999992450483e-01 1.87604168634850548836e-01
2.000000 9.99999999999979571896e-01 1.13429041519124571002e-01
2.050000 9.99999999999980127008e-01 -6.57025851219648071577e-02
2.100000 9.99999999999986011190e-01 -1.83608331817485953552e-01
2.150000 9.99999999999989452881e-01 -1.31164504149235777719e-01
2.200000 9.99999999999992117417e-01 4.26929204333590661680e-02
2.250000 9.99999999999991673327e-01 1.76635402885466780143e-01
2.300000 9.99999999999993893773e-01 1.46656400685981985754e-01
2.350000 1.00000000000000044409e+00 -1.91144782623299501478e-02
2.400000 9.99999999999995115019e-01 -1.66807022293504331190e-01
2.450000 9.99999999999993116617e-01 -1.59646006557975089768e-01
2.500000 9.99999999999992228439e-01 -4.62363607558455031593e-03
2.550000 9.99999999999983790744e-01 1.54314216263694875542e-01
2.600000 9.99999999999988231636e-01 1.69940112949274524379e-01
2.650000 9.99999999999991562305e-01 2.81334213018073209245e-02
2.700000 9.99999999999989896970e-01 -1.39370324178370863510e-01
2.750000 9.99999999999981903365e-01 -1.77369719814211318498e-01
2.800000 9.99999999999979682919e-01 -5.10094004719467697395e-02
2.850000 9.99999999999983013588e-01 1.22253368892506888987e-01
2.900000 9.99999999999988786747e-01 1.81840022627883513007e-01
2.950000 9.99999999999992339461e-01 7.28837079317850022875e-02
3.000000 9.99999999999988453681e-01 -1.03252055257146591050e-01
3.050000 9.99999999999976019183e-01 -1.83281919944079330076e-01
3.100000 9.99999999999974464870e-01 -9.33817188974553347158e-02
3.150000 9.99999999999974020781e-01 8.27122120980195163487e-02
3.200000 9.99999999999965916153e-01 1.81705498470807413902e-01
3.250000 9.99999999999963473662e-01 1.12181860960979484787e-01
3.300000 9.99999999999965805131e-01 -6.09763419728053326918e-02
3.350000 9.99999999999972355447e-01 -1.77144508305293268968e-01
3.400000 9.99999999999973465670e-01 -1.28965133538505721811e-01
3.450000 9.99999999999976130205e-01 3.84343491487543070795e-02
3.500000 9.99999999999984789945e-01 1.69713129075489077557e-01
3.550000 9.99999999999985900168e-01 1.43478999668703310899e-01
3.600000 9.99999999999987010391e-01 -1.54572974573870172005e-02
3.650000 9.99999999999987454480e-01 -1.59543561815924217484e-01
3.700000 9.99999999999987010391e-01 -1.55480625038927039450e-01
3.750000 9.99999999999990119015e-01 -7.54733948695505713761e-03
3.800000 9.99999999999991673327e-01 1.46846073332867449457e-01
3.850000 9.99999999999993671729e-01 1.64804342373618684103e-01
3.900000 9.99999999999995448086e-01 3.02070952609432390179e-02
3.950000 9.99999999999990785149e-01 -1.31839909689227069434e-01
4.000000 9.99999999999992006394e-01 -1.71298356900979054096e-01
4.050000 9.99999999999991895372e-01 -5.21243210931363748495e-02
4.100000 9.99999999999996558309e-01 1.14816810922729301003e-01
4.150000 9.99999999999996891376e-01 1.74895483489105829644e-01
4.200000 9.99999999999999000799e-01 7.29522011214056714801e-02
4.250000 9.99999999999998001599e-01 -9.60656243796101788623e-02
4.300000 9.99999999999994892974e-01 -1.75543221667975424261e-01
4.350000 9.99999999999992450483e-01 -9.23292348994688982788e-02
4.400000 9.99999999999990563104e-01 7.59394119332221229079e-02
4.450000 9.99999999999990674127e-01 1.73277463334076481383e-01
4.500000 9.99999999999993338662e-01 1.09959296246589816048e-01
4.550000 1.00000000000000355271e+00 -5.47743512040961555432e-02
4.600000 1.00000000000000910383e+00 -1.68146078725182224201e-01
4.650000 1.00000000000000932587e+00 -1.25540467370301334071e-01
4.700000 1.00000000000000910383e+00 3.29606630681812395878e-02
4.750000 1.00000000000001376677e+00 1.60285421337905104044e-01
4.800000 1.00000000000001532108e+00 1.38848515235108466159e-01
4.850000 1.00000000000001776357e+00 -1.08564715800596942041e-02
4.900000 1.00000000000002153833e+00 -1.49837645810165953630e-01
4.950000 1.00000000000002065015e+00 -1.49659986121024601857e-01
5.000000 1.00000000000001354472e+00 -1.11372416579576510171e-02
5.050000 1.00000000000001154632e+00 1.37029949332623857128e-01
5.100000 1.00000000000001376677e+00 1.57838538123442562178e-01
5.150000 1.00000000000001754152e+00 3.26672284590154571315e-02
5.200000 1.00000000000001443290e+00 -1.22085947993840995829e-01
5.250000 1.00000000000001731948e+00 -1.63252136085805299448e-01
5.300000 1.00000000000001731948e+00 -5.33484463344258488804e-02
5.350000 1.00000000000001221245e+00 1.05307906991011016040e-01
5.400000 1.00000000000001709743e+00 1.65861999974797003077e-01
5.450000 1.00000000000002065015e+00 7.28586617297687089145e-02
5.500000 1.00000000000001909584e+00 -8.69823739606212509301e-02
5.550000 1.00000000000001820766e+00 -1.65633650989567310363e-01
5.600000 1.00000000000001754152e+00 -9.08538746307981648354e-02
5.650000 1.00000000000001643130e+00 6.74658724380695212774e-02
5.700000 1.00000000000002553513e+00 1.62628643782031678811e-01
5.750000 1.00000000000002420286e+00 1.07066606048372633953e-01
5.800000 1.00000000000002020606e+00 -4.70851409801483836159e-02
5.850000 1.00000000000002464695e+00 -1.56909218145993428761e-01
5.900000 1.00000000000001643130e+00 -1.21215697516841525161e-01
5.950000 1.00000000000002309264e+00 2.62266345215625036602e-02
6.000000 1.00000000000002220446e+00 1.48632830826111506095e-01
6.050000 1.00000000000002775558e+00 1.33107894688020450547e-01
6.100000 1.00000000000002930989e+00 -5.23194503907980622975e-03
6.150000 1.00000000000003130829e+00 -1.37950656134225663196e-01
6.200000 1.00000000000003375078e+00 -1.42541832512078830986e-01
6.250000 1.00000000000003419487e+00 -1.55085461019884834205e-02
6.300000 1.00000000000003419487e+00 1.25104966867483569093e-01
6.350000 1.00000000000003308465e+00 1.49412494759274622202e-01
6.400000 1.00000000000003730349e+00 3.56644983374576965418e-02
6.450000 1.00000000000004196643e+00 -1.10321829923314768118e-01
6.500000 1.00000000000004130030e+00 -1.53609239996659346916e-01
6.550000 1.00000000000003907985e+00 -5.48674024338383081734e-02
6.600000 1.00000000000003264056e+00 9.39114501025691689184e-02
6.650000 1.00000000000003130829e+00 1.55122842208471695136e-01
6.700000 1.00000000000003219647e+00 7.28231383980151303348e-02
6.750000 1.00000000000002597922e+00 -7.61554861973991747970e-02
6.800000 1.00000000000002819966e+00 -1.53937605506077629380e-01
6.850000 1.00000000000002242651e+00 -8.92088245154841058548e-02
6.900000 1.00000000000002575717e+00 5.74107005374581355617e-02
6.950000 1.00000000000002797762e+00 1.50140729879456175100e-01
7.000000 1.00000000000002797762e+00 1.03788571352875558240e-01
7.050000 1.00000000000002731149e+00 -3.79913893062536200951e-02
7.100000 1.00000000000002664535e+00 -1.43808757972425427241e-01
7.150000 1.00000000000002553513e+00 -1.16305157019493760062e-01
7.200000 1.00000000000002642331e+00 1.82765677308333214512e-02
7.250000 1.00000000000002686740e+00 1.35119145033820164947e-01
7.300000 1.00000000000002287059e+00 1.26598408897475006585e-01
7.350000 1.00000000000002309264e+00 1.41177909769585785589e-03
7.400000 1.00000000000001709743e+00 -1.24231308745441929031e-01
7.450000 1.00000000000002198242e+00 -1.34491698534246167940e-01
7.500000 1.00000000000003441691e+00 -2.06978060000382463324e-02
7.550000 1.00000000000003330669e+00 1.11400480189619038862e-01
7.600000 1.00000000000003552714e+00 1.39912436736384093727e-01
7.650000 1.00000000000003530509e+00 3.92770005569879274154e-02
7.700000 1.00000000000003930190e+00 -9.68537391900029520642e-02
7.750000 1.00000000000004019007e+00 -1.42773350907274526600e-01
7.800000 1.00000000000004174439e+00 -5.68013116874293289005e-02
7.850000 1.00000000000004729550e+00 8.09063227450591559986e-02
7.900000 1.00000000000004440892e+00 1.43094852301887176527e-01
7.950000 1.00000000000003819167e+00 7.30072430164646624107e-02
8.000000 1.00000000000004285461e+00 -6.38330923918605380729e-02
8.050000 1.00000000000004618528e+00 -1.40881134442218891589e-01
8.100000 1.00000000000004418688e+00 -8.75966488015916810994e-02
8.150000 1.00000000000004396483e+00 4.59875646863334569536e-02
8.200000 1.00000000000004596323e+00 1.36244249513186643785e-01
8.250000 1.00000000000004729550e+00 1.00367159098670111206e-01
8.300000 1.00000000000005306866e+00 -2.76694402267149142105e-02
8.350000 1.00000000000005284662e+00 -1.29275274294082781479e-01
8.400000 1.00000000000004307665e+00 -1.11088583938067947399e-01
8.450000 1.00000000000004152234e+00 9.24648401153855062362e-03
8.500000 1.00000000000004884981e+00 1.20170019891008256208e-01
8.550000 1.00000000000005373479e+00 1.19635114515881227359e-01
8.600000 1.00000000000005351275e+00 8.98117130136269134488e-03
8.650000 1.00000000000005173639e+00 -1.09095607035758782044e-01
8.700000 1.00000000000005329071e+00 -1.25857217740888566171e-01
8.750000 1.00000000000004796163e+00 -2.66560391975838688328e-02
8.800000 1.00000000000004063416e+00 9.63178361599674737192e-02
8.850000 1.00000000000003685940e+00 1.29715229451859537235e-01
8.900000 1.00000000000003641532e+00 4.35015301540476878595e-02
8.950000 1.00000000000003530509e+00 -8.20637113684304642103e-02
9.000000 1.00000000000003708145e+00 -1.31146855138457085754e-01
9.050000 1.00000000000002953193e+00 -5.91936997020912902823e-02
9.100000 1.00000000000003130829e+00 6.66504735824405419864e-02
9.150000 1.00000000000003241851e+00 1.30201751371254559331e-01
9.200000 1.00000000000003441691e+00 7.35013376950000851817e-02
9.250000 1.00000000000003863576e+00 -5.03447466082709502166e-02
9.300000 1.00000000000003819167e+00 -1.26904883972096982347e-01
9.350000 1.00000000000003685940e+00 -8.61543167255193476084e-02
9.400000 1.00000000000003841372e+00 3.34933593568563434117e-02
9.450000 1.00000000000003130829e+00 1.21391874486197592908e-01
9.500000 1.00000000000003175238e+00 9.69849457065467962513e-02
9.550000 1.00000000000002287059e+00 -1.63797646799904300652e-02
9.600000 1.00000000000002398082e+00 -1.13768564235247005012e-01
9.650000 1.00000000000002109424e+00 -1.05792786275702099807e-01
9.700000 1.00000000000002797762e+00 -6.43117017786405502366e-04
9.750000 1.00000000000002442491e+00 1.04247033797033122893e-01
9.800000 1.00000000000003352874e+00 1.12486809030449344537e-01
9.850000 1.00000000000003974598e+00 1.72985811930430818939e-02
9.900000 1.00000000000003241851e+00 -9.30017724610231188986e-02
9.950000 1.00000000000003685940e+00 -1.16946699658634245544e-01
10.000000 1.00000000000003974598e+00 -3.32510745699896928529e-02
