# tag norm j_0
13.400000 1.00000000000015298873e+00 -8.18638544028638809325e-03
13.400000 1.00000000000015298873e+00 -7.25429151976477934460e-03
13.400000 1.00000000000015298873e+00 -8.60926272142479957761e-03
13.400000 1.00000000000015298873e+00 -7.72288322648507705170e-03
13.400000 1.00000000000015298873e+00 -8.67383534407632945940e-03
13.400000 1.00000000000015298873e+00 -7.64812245738297809966e-03
13.400000 1.00000000000015298873e+00 -8.58374228074416587009e-03
13.400000 1.00000000000015298873e+00 -7.57801963731739684771e-03
13.400000 1.00000000000015298873e+00 -8.51291022811596909126e-03
13.400000 1.00000000000015298873e+00 -7.50879730686446634352e-03
13.400000 1.00000000000015298873e+00 -8.44417206985478493997e-03
13.400000 1.00000000000015298873e+00 -7.44492280268655489545e-03
13.400000 1.00000000000015298873e+00 -8.37150252818285277312e-03
13.400000 1.00000000000015298873e+00 -7.38143928917192777839e-03
13.400000 1.00000000000015298873e+00 -8.32260845245352300081e-03
13.400000 1.00000000000015298873e+00 -7.33366520221205055174e-03
13.400000 1.00000000000015298873e+00 -8.13065813731668821096e-03
13.400000 1.00000000000015298873e+00 -6.74854024973452464725e-03
13.400000 1.00000000000015298873e+00 -7.53889384967928403297e-03
