# tag norm BO
1 9.99999999999998001599e-01 -1.87661223220544452761e-02
2 1.00000000000000177636e+00 4.15508277165122300034e-03
3 9.99999999999991229238e-01 6.12235162011107170166e-03
4 9.99999999999993560706e-01 4.76293718774638188268e-03
5 9.99999999999994115818e-01 4.33586924397461308950e-03
6 1.00000000000000621725e+00 4.80400205607943876079e-03
7 1.00000000000000777156e+00 4.47154492227016999578e-03
8 1.00000000000000111022e+00 4.96936673200604455553e-03
9 1.00000000000000088818e+00 4.66710499531541953694e-03
10 9.99999999999995448086e-01 4.67116446385120419327e-03
11 1.00000000000000111022e+00 4.35722451113600139916e-03
12 9.99999999999999444888e-01 4.24396158409989614213e-03
13 9.99999999999999888978e-01 2.17091160828166394869e-03
14 1.00000000000001043610e+00 2.17520622652211470874e-03
15 1.00000000000000288658e+00 1.65044878892035363008e-03
16 9.99999999999998334665e-01 2.05192195256844204729e-03
17 1.00000000000000177636e+00 1.82279432951452935452e-03
18 1.00000000000001199041e+00 7.85191501516399668718e-04
19 9.99999999999997779554e-01 4.16399276941990467444e-04
20 1.00000000000000133227e+00 7.29087908972784147759e-05
21 9.99999999999994448885e-01 -4.15630962130317802624e-04
22 1.00000000000000044409e+00 -6.14892613779372291735e-04
23 9.99999999999995115019e-01 -9.18516857085090914284e-04
24 1.00000000000000399680e+00 -1.96815935739935005643e-04
25 9.99999999999994337863e-01 -5.29657545371477688455e-04
26 1.00000000000000155431e+00 5.09199799146931790343e-04
27 1.00000000000000222045e+00 7.18863065701781287463e-04
28 9.99999999999996336264e-01 1.51249727703272837144e-03
29 1.00000000000000088818e+00 1.27261077352706572507e-03
30 1.00000000000000577316e+00 1.99091329663637732483e-03
31 1.00000000000000577316e+00 2.07473292030666304694e-03
32 1.00000000000000888178e+00 2.64516856117736178303e-03
33 1.00000000000000333067e+00 3.03303825925308519901e-03
34 9.99999999999997557509e-01 2.94133847237349399170e-03
35 9.99999999999994337863e-01 2.77069804170487418715e-03
36 1.00000000000000532907e+00 2.26173197868146996434e-03
37 1.00000000000000310862e+00 1.95678865895255972226e-03
38 1.00000000000000732747e+00 1.53150159659518644677e-03
39 9.99999999999999000799e-01 6.66703393052180039863e-03
40 9.99999999999996003197e-01 5.17355483473048820275e-03
41 1.00000000000000244249e+00 3.73969964270146233709e-03
42 1.00000000000000288658e+00 2.86893687112212787335e-03
43 9.99999999999990785149e-01 1.98105189836058010258e-03
44 9.99999999999995670130e-01 1.49441302708633902245e-03
45 9.99999999999999000799e-01 9.37299109104997550668e-04
46 1.00000000000000466294e+00 7.07726967662683915765e-04
47 1.00000000000000577316e+00 4.86781311676620209034e-04
48 1.00000000000000932587e+00 3.07798644596160434535e-04
49 9.99999999999998112621e-01 8.18220219026583733823e-03
50 9.99999999999995337063e-01 8.66515759690900458367e-03
51 1.00000000000000754952e+00 7.05261488903180782523e-03
52 9.99999999999996891376e-01 6.56022057438914157207e-03
53 1.00000000000000488498e+00 6.04540225998456519363e-03
54 9.99999999999992783550e-01 5.20854912344109310246e-03
55 9.99999999999995892175e-01 4.40840727157280204418e-03
56 9.99999999999993893773e-01 3.68393819724095608961e-03
57 1.00000000000000732747e+00 2.76853591799567592263e-03
58 1.00000000000000777156e+00 1.63378226832960079910e-03
59 1.00000000000000199840e+00 -8.53329772912996464742e-05
60 1.00000000000000466294e+00 -8.20724301554104167765e-04
61 1.00000000000000088818e+00 -1.64848676200813693341e-03
62 1.00000000000000555112e+00 -2.14987233215165832872e-03
63 9.99999999999999111822e-01 -2.10361776421900308412e-03
64 1.00000000000000244249e+00 -1.84714798725990462548e-03
65 9.99999999999997557509e-01 -1.69959871721136741678e-03
66 1.00000000000000088818e+00 -3.23155002921871015945e-04
67 1.00000000000000688338e+00 -5.21672331083861405858e-05
68 1.00000000000000155431e+00 2.84071120100545771673e-04
69 1.00000000000000088818e+00 3.00850092653035059570e-04
70 9.99999999999995003996e-01 4.40392684760546136019e-03
71 1.00000000000000377476e+00 8.28421964114391291834e-03
72 1.00000000000000710543e+00 6.32314448858279330723e-03
73 9.99999999999994115818e-01 5.62678736215403100390e-03
74 1.00000000000000621725e+00 3.86026880539406874390e-03
75 9.99999999999989119814e-01 2.66818500725236017190e-03
76 1.00000000000001354472e+00 9.81643742282444853667e-04
77 1.00000000000000666134e+00 2.97991590234624251221e-04
78 1.00000000000000177636e+00 -1.33588558414395974609e-03
79 9.99999999999999777955e-01 -1.61463994751002331077e-03
80 1.00000000000000177636e+00 -1.61566347684262206705e-03
81 9.99999999999987121413e-01 -1.37976603919574792798e-03
82 1.00000000000000288658e+00 -1.09776938204386793527e-04
83 1.00000000000000333067e+00 8.84757452321415253579e-04
84 1.00000000000000488498e+00 1.72046305750255543524e-03
85 9.99999999999999666933e-01 2.12286925097193669362e-03
86 9.99999999999998778755e-01 2.36719286660561122407e-03
87 1.00000000000000222045e+00 2.11202810816271376385e-03
88 9.99999999999993671729e-01 1.13198628940590893290e-03
89 1.00000000000000399680e+00 2.68363979364050013986e-04
90 9.99999999999996891376e-01 -7.70347615942987805349e-04
91 9.99999999999994337863e-01 -1.81854394539552222283e-03
92 1.00000000000000333067e+00 -2.36938115290798645071e-03
93 9.99999999999996669331e-01 -2.95329622589492841664e-03
94 1.00000000000001132427e+00 6.39430893616182386557e-03
95 1.00000000000000244249e+00 7.75598667886446060948e-03
96 1.00000000000000732747e+00 6.13898256123008093099e-03
97 1.00000000000000421885e+00 5.32198664941793599809e-03
98 1.00000000000000932587e+00 4.05874315031174229262e-03
99 9.99999999999999444888e-01 3.39538118628401148699e-03
100 1.00000000000000732747e+00 2.20217228089294699347e-03
