# tag norm j_0
17.900000 1.00000000000024491520e+00 -4.91911368247957884146e-04
17.900000 1.00000000000024491520e+00 -3.05050161783776169633e-04
17.900000 1.00000000000024491520e+00 8.23571311754081798219e-05
17.900000 1.00000000000024491520e+00 4.29865759124566462236e-04
17.900000 1.00000000000024491520e+00 -2.97934102392908216025e-05
17.900000 1.00000000000024491520e+00 7.41697734787352989461e-05
17.900000 1.00000000000024491520e+00 -1.73355532399626320866e-04
17.900000 1.00000000000024491520e+00 7.60292513636774041144e-05
17.900000 1.00000000000024491520e+00 -1.57654966701314556889e-04
17.900000 1.00000000000024491520e+00 7.30521715000091042711e-05
17.900000 1.00000000000024491520e+00 -1.57319987379960754591e-04
17.900000 1.00000000000024491520e+00 7.10774011178550606856e-05
17.900000 1.00000000000024491520e+00 -1.78371884015293235941e-04
17.900000 1.00000000000024491520e+00 5.96010966639505060665e-05
17.900000 1.00000000000024491520e+00 -4.49320819532259533744e-05
17.900000 1.00000000000024491520e+00 4.25241743641267789470e-04
17.900000 1.00000000000024491520e+00 1.12924794694607976168e-04
17.900000 1.00000000000024491520e+00 -2.78901105748007862532e-04
17.900000 1.00000000000024491520e+00 -4.80358573699594785817e-04
