# tag norm j_0
5.500000 1.00000000000000954792e+00 3.79635785674684901603e-03
5.500000 1.00000000000000954792e+00 2.33138596997975759348e-03
5.500000 1.00000000000000954792e+00 3.38107815562026540676e-03
5.500000 1.00000000000000954792e+00 2.53794612328557241468e-03
5.500000 1.00000000000000954792e+00 3.25676833374593209525e-03
5.500000 1.00000000000000954792e+00 2.60496680663267277459e-03
5.500000 1.00000000000000954792e+00 3.20201929318044992839e-03
5.500000 1.00000000000000954792e+00 2.62963295999518861454e-03
5.500000 1.00000000000000954792e+00 3.18872386709982864883e-03
5.500000 1.00000000000000954792e+00 2.63150397433146217979e-03
5.500000 1.00000000000000954792e+00 3.18500995948963827945e-03
5.500000 1.00000000000000954792e+00 2.61990147996372891789e-03
5.500000 1.00000000000000954792e+00 3.18098391341457235187e-03
5.500000 1.00000000000000954792e+00 2.58248843720259874807e-03
5.500000 1.00000000000000954792e+00 3.22443157320212881595e-03
5.500000 1.00000000000000954792e+00 2.51111918065281131129e-03
5.500000 1.00000000000000954792e+00 3.33657234317314343661e-03
5.500000 1.00000000000000954792e+00 2.29582269377240442282e-03
5.500000 1.00000000000000954792e+00 3.72782540691995968249e-03
