# tag norm BO
1 9.99999999999999555911e-01 -3.15241251472169262127e-02
2 1.00000000000000111022e+00 -8.03694798338474153399e-02
3 1.00000000000000022204e+00 -1.05362343689025680926e-01
4 1.00000000000000022204e+00 -9.25286042557504628814e-02
5 9.99999999999998112621e-01 -7.92380787872736802591e-02
6 9.99999999999999555911e-01 -4.02817475144372008633e-02
7 9.99999999999998667732e-01 4.33779026122236947838e-03
8 9.99999999999993893773e-01 2.63994814845797572123e-02
9 9.99999999999998667732e-01 3.04565849258021346946e-02
10 9.99999999999997113420e-01 1.91725099652438543685e-02
11 1.00000000000000177636e+00 7.24967022510364985516e-03
12 9.99999999999999888978e-01 -1.22050052705847469903e-02
13 1.00000000000000066613e+00 -4.27801835766495382879e-03
14 9.99999999999997446487e-01 3.94563217544910693757e-02
15 9.99999999999999111822e-01 -4.36343462320713110225e-02
16 9.99999999999999666933e-01 -5.31817016749025900380e-02
17 9.99999999999998667732e-01 -2.55702716197844376333e-02
18 9.99999999999997668532e-01 5.24721034234709865496e-02
19 1.00000000000000022204e+00 1.32073750998073030649e-01
20 9.99999999999999111822e-01 2.08104183797985453630e-01
21 9.99999999999998556710e-01 2.48733402587654889304e-01
22 1.00000000000000399680e+00 2.64333977088954674706e-01
23 9.99999999999996225242e-01 2.65365245459386944749e-01
24 1.00000000000000000000e+00 2.63153696025051231366e-01
25 1.00000000000000177636e+00 2.62477896595057769158e-01
26 1.00000000000000066613e+00 2.62370333078649486946e-01
27 1.00000000000000066613e+00 2.62356561623929451788e-01
28 1.00000000000000399680e+00 2.62353061464063785913e-01
