# tag norm j_0
22.300000 1.00000000000001842970e+00 -2.08462512888899602348e-02
22.300000 1.00000000000001842970e+00 8.34586460699728548140e-03
22.300000 1.00000000000001842970e+00 2.21637716543398900770e-02
22.300000 1.00000000000001842970e+00 -5.71752502428764068643e-03
22.300000 1.00000000000001842970e+00 -1.71722366698409747987e-02
22.300000 1.00000000000001842970e+00 -1.45236677037541336149e-02
22.300000 1.00000000000001842970e+00 3.03683984242042459556e-02
22.300000 1.00000000000001842970e+00 -3.00667349111135712159e-02
22.300000 1.00000000000001842970e+00 4.28041952210870060846e-03
22.300000 1.00000000000001842970e+00 -2.01456648854798150983e-02
22.300000 1.00000000000001842970e+00 4.61725364919496686356e-03
22.300000 1.00000000000001842970e+00 -3.01989130352288796810e-02
22.300000 1.00000000000001842970e+00 3.03046652832041317482e-02
22.300000 1.00000000000001842970e+00 -1.41279138952026192544e-02
22.300000 1.00000000000001842970e+00 -1.74099667220534541634e-02
22.300000 1.00000000000001842970e+00 -5.72734953932304332452e-03
22.300000 1.00000000000001842970e+00 2.24027226538580405413e-02
22.300000 1.00000000000001842970e+00 8.84518817283924847772e-03
22.300000 1.00000000000001842970e+00 -2.20226619641479687273e-02
