# tag norm j_0
22.500000 9.99999999999996447286e-01 -2.47093794551764105172e-04
22.500000 9.99999999999996447286e-01 -1.21698988102850679492e-04
22.500000 9.99999999999996447286e-01 -2.18880006035788695143e-04
22.500000 9.99999999999996447286e-01 4.75558163146273349224e-04
22.500000 9.99999999999996447286e-01 9.65501277970456125814e-04
22.500000 9.99999999999996447286e-01 4.94430191708220933937e-04
22.500000 9.99999999999996447286e-01 -2.05978008072489073531e-04
22.500000 9.99999999999996447286e-01 -1.10137523539278044072e-04
22.500000 9.99999999999996447286e-01 -2.38637803015832552405e-04
