# tag norm j_0
25.500000 1.00000000000002908784e+00 -2.35267243653633981171e-02
25.500000 1.00000000000002908784e+00 1.70469993527837086755e-03
25.500000 1.00000000000002908784e+00 1.94966047356216580499e-02
25.500000 1.00000000000002908784e+00 -1.76537406919907713387e-02
25.500000 1.00000000000002908784e+00 -1.49503085632775686202e-04
25.500000 1.00000000000002908784e+00 1.60901675910498568982e-03
25.500000 1.00000000000002908784e+00 -6.84100960014533826525e-03
25.500000 1.00000000000002908784e+00 2.55572378301797027700e-02
25.500000 1.00000000000002908784e+00 -1.67467892771594427381e-02
25.500000 1.00000000000002908784e+00 4.93724562573690482770e-03
25.500000 1.00000000000002908784e+00 -1.67996701984138331609e-02
25.500000 1.00000000000002908784e+00 2.55076032233802381388e-02
25.500000 1.00000000000002908784e+00 -6.84744263501923990795e-03
25.500000 1.00000000000002908784e+00 1.37082521596611456131e-03
25.500000 1.00000000000002908784e+00 2.88901284250730095056e-04
25.500000 1.00000000000002908784e+00 -1.77142389966470220619e-02
25.500000 1.00000000000002908784e+00 1.92317775287881888302e-02
25.500000 1.00000000000002908784e+00 1.59857929837764478620e-03
25.500000 1.00000000000002908784e+00 -2.37278943544530045162e-02
