# tag norm j_0
21.600000 1.00000000000002065015e+00 -2.39383552848224838774e-03
21.600000 1.00000000000002065015e+00 -1.51797606469845532129e-02
21.600000 1.00000000000002065015e+00 -8.61838500110309775615e-03
21.600000 1.00000000000002065015e+00 5.87523622559194165504e-03
21.600000 1.00000000000002065015e+00 9.07875483470183854140e-03
21.600000 1.00000000000002065015e+00 1.22051959542856629237e-02
21.600000 1.00000000000002065015e+00 -2.94784807248031459348e-02
21.600000 1.00000000000002065015e+00 4.46714193729325706461e-02
21.600000 1.00000000000002065015e+00 1.52322635616138806272e-03
21.600000 1.00000000000002065015e+00 4.57128628734366094372e-03
21.600000 1.00000000000002065015e+00 1.00240493279079093125e-03
21.600000 1.00000000000002065015e+00 4.49378400474321551550e-02
21.600000 1.00000000000002065015e+00 -2.93975420259168750137e-02
21.600000 1.00000000000002065015e+00 1.17791798341231046532e-02
21.600000 1.00000000000002065015e+00 9.39183288218141225367e-03
21.600000 1.00000000000002065015e+00 5.82427330280321613187e-03
21.600000 1.00000000000002065015e+00 -9.07523361103359897661e-03
21.600000 1.00000000000002065015e+00 -1.55585087284484495374e-02
21.600000 1.00000000000002065015e+00 -1.29784634735796017280e-03
