# tag norm n_hub[0] n_hub[1] n_hub[2] n_hub[3] n_hub[4] n_hub[5] n_hub[6] n_hub[7] n_hub[8] n_hub[9] n_hub[10] n_hub[11] n_hub[12] n_hub[13] n_hub[14] n_hub[15] n_hub[16] n_hub[17] n_hub[18] n_hub[19] n_hub[20] n_hub[21] n_hub[22] n_hub[23] n_hub[24] n_hub[25] n_hub[26] n_hub[27] n_hub[28] n_hub[29] n_hub[30] n_hub[31]
1 1.00000000000000000000e+00 2.00753978603977825679e-02 1.97308663701106290489e+00 1.66307448489700138161e-01 1.97290371987525392505e+00 8.07628223310814963298e-01 1.08405838514675956219e+00 9.84668022681742693969e-01 1.05933068903482441314e+00 7.63567809572798794626e-01 1.20447652557663986705e+00 9.77911108347597757273e-01 1.05394785393079248870e+00 1.99963862343069537220e-01 1.74752068632834078876e+00 6.44947524235407354531e-01 1.86198331172815412238e+00 6.82788178392144895490e-01 1.05690387594549117800e+00 8.78316969668592850695e-01 1.11910717216754251879e+00 9.22743959646537881270e-01 1.11929884436956661453e+00 8.86712510967576306165e-01 1.19531132960536634613e+00 9.37522314740968476521e-01 1.14874582403598290981e+00 9.70003981768940093389e-01 1.12875826316566607588e+00 9.62977465498716656001e-01 1.39054064986250813796e+00 4.40637308492490054057e-01 6.37254146198633741882e-01
2 1.00000000000000000000e+00 1.86328582534628292566e-02 1.96660742589742820741e+00 3.26687276070162235797e-02 1.96820244929712728776e+00 9.02157490010579155015e-02 1.92674590248527088931e+00 2.47599610472338166334e-01 1.78657202070549159245e+00 1.06367838654132185194e-01 1.88240050606627029595e+00 1.68765134672042682595e-01 1.79928963971392485988e+00 2.35621300011195078383e-02 1.97316170501832899298e+00 6.05779778162533338870e-02 1.96477783566883990041e+00 3.27158564121749206866e-02 1.94188757214684426522e+00 4.01643948095612435267e-02 1.95101605075328432548e+00 3.73106118261082170262e-02 1.96732051623747739022e+00 3.49034079925483742279e-02 1.96328705523680668854e+00 3.23552753073812066065e-02 1.97080317883111044708e+00 3.27154088139429768956e-02 1.98213905581978866444e+00 6.06580003021370064986e-02 1.95736064171013079971e+00 2.13874564929179555861e-02 1.95782800597771333706e+00
3 1.00000000000000000000e+00 1.83748783084988279168e-02 1.96388988012865151056e+00 3.54459187239886397425e-02 1.96455184807633709276e+00 3.54627908582724957198e-02 1.96454747525726047819e+00 3.54541193907461915646e-02 1.96452075931781999785e+00 3.54048877102423539820e-02 1.96489735835057288682e+00 3.53428002486546738448e-02 1.96444322653411140855e+00 3.53611215265460659962e-02 1.96500728292700665989e+00 3.47788724050231909390e-02 1.96500500667370792129e+00 3.51556481601691256378e-02 1.96469249557598857336e+00 3.56068052982447674770e-02 1.96428958000964470898e+00 3.54642419862945118547e-02 1.96454555432775079815e+00 3.54574573918698399133e-02 1.96452656342756992736e+00 3.53977912736022012896e-02 1.96449955667436748641e+00 3.54769737351505048961e-02 1.96440322851186865982e+00 3.57085835578788146627e-02 1.96446485037845008925e+00 3.60167401746144255625e-02 1.98180570307904146965e+00
4 1.00000000000000000000e+00 1.83757508418476503409e-02 1.96388834349893204312e+00 3.54446952119605446230e-02 1.96453112169400223586e+00 3.54679467097658782104e-02 1.96453203578129187434e+00 3.54679873182801239095e-02 1.96453195141037384452e+00 3.54676371328918882408e-02 1.96453457830944500095e+00 3.54682339274838970278e-02 1.96453319393122982639e+00 3.54633514948020367452e-02 1.96453852346107793458e+00 3.54608576888992624299e-02 1.96453409819178337337e+00 3.54675279440132620867e-02 1.96453237324682672416e+00 3.54685026424566424152e-02 1.96453173434625716354e+00 3.54675297187891508388e-02 1.96453202733534793012e+00 3.54678192624949886746e-02 1.96453203533261033797e+00 3.54679019992114874515e-02 1.96453193526836900062e+00 3.54678465330313247295e-02 1.96453224106566537444e+00 3.54689643203753360301e-02 1.96455705607385322509e+00 3.61083846782625436656e-02 1.98162581362833645215e+00
5 1.00000000000000000000e+00 1.83757989233288981934e-02 1.96388831489315918155e+00 3.54446732126308880484e-02 1.96453110683324938535e+00 3.54679451580141580358e-02 1.96453201608372252096e+00 3.54679821372489156861e-02 1.96453201691138334972e+00 3.54679777224489387044e-02 1.96453200658855009486e+00 3.54679981576931854792e-02 1.96453202080879774094e+00 3.54679759148989123818e-02 1.96453202339791288544e+00 3.54679793758061051578e-02 1.96453201905548113793e+00 3.54679821492629235302e-02 1.96453202181796715564e+00 3.54679824465325144178e-02 1.96453201471210459061e+00 3.54679819665667112050e-02 1.96453201874465444021e+00 3.54679807191778453945e-02 1.96453201996912651950e+00 3.54679793879769666987e-02 1.96453201683631095698e+00 3.54679837777693157674e-02 1.96453205698138244628e+00 3.54688979350243210886e-02 1.96455533554274741626e+00 3.61115742261049268991e-02 1.98162429761317704369e+00
