# tag norm BO
1 1.00000000000000000000e+00 -3.15177248757292638448e-02
2 1.00000000000000000000e+00 -8.03401464464175291136e-02
3 1.00000000000000000000e+00 -9.02802992172755114364e-02
4 1.00000000000000000000e+00 -5.80354616295716413399e-02
5 1.00000000000000000000e+00 -4.55280536076208622309e-02
6 1.00000000000000000000e+00 5.01282383250989914403e-03
7 1.00000000000000000000e+00 2.20061604256558893122e-02
8 1.00000000000000000000e+00 1.85477437308095259583e-02
9 1.00000000000000000000e+00 3.87063635254275995728e-03
10 1.00000000000000000000e+00 3.37482140944414185646e-04
11 1.00000000000000000000e+00 -3.80540708300035768891e-03
12 1.00000000000000000000e+00 -1.62233730138039052016e-02
13 1.00000000000000000000e+00 4.37832582276782289465e-02
14 1.00000000000000000000e+00 -3.76117956336373335247e-02
15 1.00000000000000000000e+00 -8.10310029528445441294e-02
16 1.00000000000000000000e+00 -4.40054331240436746864e-02
17 1.00000000000000000000e+00 3.98959049942743393391e-02
18 1.00000000000000000000e+00 2.53448784293442530569e-01
19 1.00000000000000000000e+00 2.73625391468534540085e-01
20 1.00000000000000000000e+00 2.72668066554861143747e-01
21 1.00000000000000000000e+00 2.71625906006475403842e-01
22 1.00000000000000000000e+00 2.71284022459807205863e-01
23 1.00000000000000000000e+00 2.71236457426895616329e-01
24 1.00000000000000000000e+00 2.71230323300697295785e-01
