# tag norm j_0
19.700000 1.00000000000001709743e+00 -2.26055158528057874301e-02
19.700000 1.00000000000001709743e+00 3.67069086989976339774e-02
19.700000 1.00000000000001709743e+00 -1.56449133232528805014e-03
19.700000 1.00000000000001709743e+00 -8.73357763116721363961e-02
19.700000 1.00000000000001709743e+00 1.62099502730870426159e-01
19.700000 1.00000000000001709743e+00 -8.77939034923734956672e-02
19.700000 1.00000000000001709743e+00 -1.91981605631594558388e-03
19.700000 1.00000000000001709743e+00 3.74824737286803336134e-02
19.700000 1.00000000000001709743e+00 -2.27397900008597525501e-02
