# tag norm j_0
27.600000 1.00000000000003064216e+00 4.89373065928283973447e-02
27.600000 1.00000000000003064216e+00 -4.38190509143683501470e-02
27.600000 1.00000000000003064216e+00 6.36394794767300014948e-02
27.600000 1.00000000000003064216e+00 3.71741437893340215259e-02
27.600000 1.00000000000003064216e+00 -2.05876336543714150151e-01
27.600000 1.00000000000003064216e+00 3.60271817670295493863e-02
27.600000 1.00000000000003064216e+00 6.48540017935548135375e-02
27.600000 1.00000000000003064216e+00 -4.35388135591067010344e-02
27.600000 1.00000000000003064216e+00 4.79352172600913256639e-02
