# tag norm j_0
17.500000 1.00000000000025535130e+00 1.70506546915644510449e-04
17.500000 1.00000000000025535130e+00 -1.36300951418991231519e-04
17.500000 1.00000000000025535130e+00 -4.52562323762616700116e-04
17.500000 1.00000000000025535130e+00 -1.31235613590947961665e-04
17.500000 1.00000000000025535130e+00 1.74415422648945168949e-04
17.500000 1.00000000000025535130e+00 1.58151087541878894709e-04
17.500000 1.00000000000025535130e+00 1.58984476081505362362e-04
17.500000 1.00000000000025535130e+00 1.17597510015094534603e-04
17.500000 1.00000000000025535130e+00 1.45594247567737877964e-04
17.500000 1.00000000000025535130e+00 1.26434502893936267717e-04
17.500000 1.00000000000025535130e+00 1.43059086532917943517e-04
17.500000 1.00000000000025535130e+00 1.21470647922095520335e-04
17.500000 1.00000000000025535130e+00 1.56775184507042893069e-04
17.500000 1.00000000000025535130e+00 1.70341233756057656469e-04
17.500000 1.00000000000025535130e+00 1.77648658679501164192e-04
17.500000 1.00000000000025535130e+00 -1.06964397087254097624e-04
17.500000 1.00000000000025535130e+00 -4.60885077674123117778e-04
17.500000 1.00000000000025535130e+00 -1.64450746113642886845e-04
17.500000 1.00000000000025535130e+00 1.44582542287819798251e-04
