# tag norm BO
0.050000 9.99999999999998667732e-01 3.26871182201344534501e-01
0.100000 9.99999999999996891376e-01 3.26871140279502536696e-01
0.050000 9.99999999999998667732e-01 3.26871182201344534501e-01
0.100000 9.99999999999996891376e-01 3.26871140279502536696e-01
0.050000 9.99999999999998667732e-01 3.26871182201344534501e-01
0.100000 9.99999999999996891376e-01 3.26871140279502536696e-01
0.150000 9.99999999999996225242e-01 3.26871183232698425680e-01
0.200000 9.99999999999994781952e-01 3.26871206537758363098e-01
0.250000 9.99999999999994781952e-01 3.26871087044933894550e-01
0.300000 9.99999999999995003996e-01 3.26870890942207004137e-01
0.350000 9.99999999999994781952e-01 3.26870596045073680269e-01
0.400000 9.99999999999995670130e-01 3.26870511782245631860e-01
0.450000 9.99999999999995670130e-01 3.26870718538319005031e-01
0.500000 9.99999999999996558309e-01 3.26870728928460974050e-01
0.550000 9.99999999999997002398e-01 3.26870467189468716374e-01
0.600000 9.99999999999996225242e-01 3.26870069931967377475e-01
0.650000 9.99999999999996891376e-01 3.26869878279543779609e-01
0.700000 9.99999999999996447286e-01 3.26870264281215794355e-01
0.750000 9.99999999999996447286e-01 3.26870921582316065201e-01
0.800000 9.99999999999996114219e-01 3.26871284317119981111e-01
0.850000 9.99999999999995226041e-01 3.26871028913776118241e-01
0.900000 9.99999999999994670929e-01 3.26870868317868823461e-01
0.950000 9.99999999999995781153e-01 3.26871626691561389944e-01
1.000000 9.99999999999996003197e-01 3.26872895089485193676e-01
1.050000 9.99999999999996003197e-01 3.26874243216068061102e-01
1.100000 9.99999999999996447286e-01 3.26874707101399653020e-01
1.150000 9.99999999999996447286e-01 3.26874036919545585267e-01
1.200000 9.99999999999996447286e-01 3.26874332524278887746e-01
1.250000 9.99999999999995892175e-01 3.26875684331101645785e-01
1.300000 9.99999999999995337063e-01 3.26876749163356128403e-01
1.350000 9.99999999999994115818e-01 3.26877184508297446985e-01
1.400000 9.99999999999995003996e-01 3.26875460396204520208e-01
1.450000 9.99999999999995003996e-01 3.26872887656774135934e-01
1.500000 9.99999999999995892175e-01 3.26872380368963544317e-01
1.550000 9.99999999999995670130e-01 3.26871999006751290384e-01
1.600000 9.99999999999996336264e-01 3.26870342255035473134e-01
1.650000 9.99999999999996558309e-01 3.26867219435367895031e-01
1.700000 9.99999999999996003197e-01 3.26861625115815568332e-01
1.750000 9.99999999999996669331e-01 3.26857391614700065752e-01
1.800000 9.99999999999997113420e-01 3.26856180070646984426e-01
1.850000 9.99999999999997557509e-01 3.26854070206008429089e-01
1.900000 9.99999999999998001599e-01 3.26850879002579142174e-01
1.950000 9.99999999999998223643e-01 3.26846740464821761130e-01
2.000000 9.99999999999998112621e-01 3.26842580004605143262e-01
2.050000 9.99999999999998334665e-01 3.26843403887524253104e-01
2.100000 9.99999999999998556710e-01 3.26847384902052617850e-01
2.150000 9.99999999999999666933e-01 3.26850205119232073425e-01
2.200000 1.00000000000000044409e+00 3.26853341790881213313e-01
2.250000 1.00000000000000044409e+00 3.26857216838575548312e-01
2.300000 1.00000000000000155431e+00 3.26864517122792685999e-01
2.350000 1.00000000000000177636e+00 3.26877922055161473924e-01
2.400000 1.00000000000000333067e+00 3.26891758077707761387e-01
2.450000 1.00000000000000288658e+00 3.26903195692626824531e-01
2.500000 1.00000000000000155431e+00 3.26914443081393557566e-01
2.550000 1.00000000000000022204e+00 3.26925981226996620332e-01
2.600000 9.99999999999999333866e-01 3.26940064311994238455e-01
2.650000 1.00000000000000155431e+00 3.26954683192250239454e-01
2.700000 1.00000000000000133227e+00 3.26963025642778348789e-01
2.750000 1.00000000000000044409e+00 3.26964815700104050045e-01
2.800000 1.00000000000000310862e+00 3.26962482889512628947e-01
2.850000 9.99999999999999333866e-01 3.26956812427109611008e-01
2.900000 9.99999999999999000799e-01 3.26948046938044856180e-01
2.950000 1.00000000000000111022e+00 3.26931862963087516150e-01
3.000000 1.00000000000000066613e+00 3.26904767077685620702e-01
3.050000 9.99999999999999444888e-01 3.26869869548306324347e-01
3.100000 1.00000000000000111022e+00 3.26831233841948287644e-01
3.150000 1.00000000000000310862e+00 3.26790713615674355275e-01
3.200000 1.00000000000000244249e+00 3.26747837809606422876e-01
3.250000 1.00000000000000177636e+00 3.26701115426365817918e-01
3.300000 1.00000000000000222045e+00 3.26652646576227057018e-01
3.350000 1.00000000000000310862e+00 3.26608813417770760257e-01
3.400000 1.00000000000000222045e+00 3.26575583598125995799e-01
3.450000 1.00000000000000044409e+00 3.26554553080829479406e-01
3.500000 9.99999999999999444888e-01 3.26545487909593146192e-01
3.550000 9.99999999999998112621e-01 3.26550207617489207657e-01
3.600000 9.99999999999996336264e-01 3.26572280558080352275e-01
3.650000 9.99999999999994226840e-01 3.26616923212031173840e-01
3.700000 9.99999999999994226840e-01 3.26686472488445955875e-01
3.750000 9.99999999999995337063e-01 3.26776773543706822167e-01
3.800000 9.99999999999996225242e-01 3.26884222985015404639e-01
3.850000 9.99999999999996447286e-01 3.27007054626312076984e-01
3.900000 9.99999999999995226041e-01 3.27142109794053059790e-01
3.950000 9.99999999999994892974e-01 3.27286670543587066007e-01
4.000000 9.99999999999995781153e-01 3.27433041986753381458e-01
4.050000 9.99999999999995115019e-01 3.27568559775614109864e-01
4.100000 9.99999999999995003996e-01 3.27684741844446014714e-01
4.150000 9.99999999999993227640e-01 3.27774021187246411557e-01
4.200000 9.99999999999994337863e-01 3.27827922624900125470e-01
4.250000 9.99999999999995003996e-01 3.27840214665864992938e-01
4.300000 9.99999999999995226041e-01 3.27801317349900256382e-01
4.350000 9.99999999999994781952e-01 3.27702456271251330033e-01
4.400000 9.99999999999994448885e-01 3.27542834352895939620e-01
4.450000 9.99999999999995115019e-01 3.27323281390590303808e-01
4.500000 9.99999999999997335465e-01 3.27047059714358989702e-01
4.550000 9.99999999999996891376e-01 3.26722281592372487680e-01
4.600000 9.99999999999997779554e-01 3.26356195655776004649e-01
4.650000 9.99999999999997557509e-01 3.25960780427655749669e-01
4.700000 9.99999999999998223643e-01 3.25556053496335096042e-01
4.750000 9.99999999999999111822e-01 3.25162106714069421010e-01
4.800000 9.99999999999998778755e-01 3.24801529786535647659e-01
4.850000 9.99999999999998667732e-01 3.24499478778148442437e-01
4.900000 9.99999999999998223643e-01 3.24276974656077465742e-01
4.950000 9.99999999999998889777e-01 3.24156781736540111627e-01
5.000000 9.99999999999999333866e-01 3.24162923396045632440e-01
5.050000 9.99999999999999000799e-01 3.24311980894884666071e-01
5.100000 9.99999999999999444888e-01 3.24616670760750680724e-01
5.150000 1.00000000000000022204e+00 3.25082687421055782639e-01
5.200000 1.00000000000000066613e+00 3.25702752909792392355e-01
5.250000 1.00000000000000088818e+00 3.26464447341649477430e-01
5.300000 1.00000000000000088818e+00 3.27347305839274793637e-01
5.350000 1.00000000000000155431e+00 3.28317170237559519119e-01
5.400000 1.00000000000000000000e+00 3.29332857605619089281e-01
5.450000 9.99999999999998778755e-01 3.30343142025827096742e-01
5.500000 9.99999999999999888978e-01 3.31287856848067385762e-01
5.550000 9.99999999999999666933e-01 3.32109659786577748886e-01
5.600000 9.99999999999999888978e-01 3.32751727321711654461e-01
5.650000 1.00000000000000044409e+00 3.33158479648556882236e-01
5.700000 1.00000000000000066613e+00 3.33283823032657522401e-01
5.750000 1.00000000000000244249e+00 3.33089178227283899680e-01
5.800000 1.00000000000000177636e+00 3.32549157109199411408e-01
5.850000 1.00000000000000244249e+00 3.31659519750576670116e-01
5.900000 1.00000000000000355271e+00 3.30431036139505529547e-01
5.950000 1.00000000000000377476e+00 3.28889147137829296330e-01
6.000000 1.00000000000000310862e+00 3.27076307188847170693e-01
6.050000 1.00000000000000333067e+00 3.25047899149814245590e-01
6.100000 1.00000000000000199840e+00 3.22875954091402628254e-01
6.150000 1.00000000000000177636e+00 3.20649924428963506440e-01
6.200000 1.00000000000000111022e+00 3.18467721261061154081e-01
6.250000 1.00000000000000266454e+00 3.16434123279914991667e-01
6.300000 1.00000000000000244249e+00 3.14660690931850284269e-01
6.350000 1.00000000000000421885e+00 3.13261222142302397931e-01
6.400000 1.00000000000000310862e+00 3.12350936605232554211e-01
6.450000 1.00000000000000244249e+00 3.12039154855541289724e-01
6.500000 1.00000000000000310862e+00 3.12414693051113023792e-01
6.550000 1.00000000000000244249e+00 3.13539562993650045009e-01
6.600000 1.00000000000000177636e+00 3.15443743744199645018e-01
6.650000 1.00000000000000244249e+00 3.18116000108733087970e-01
6.700000 1.00000000000000244249e+00 3.21499434170870124206e-01
6.750000 1.00000000000000177636e+00 3.25484719827077551013e-01
6.800000 1.00000000000000244249e+00 3.29904986270915023816e-01
6.850000 1.00000000000000066613e+00 3.34545975358762903706e-01
6.900000 1.00000000000000133227e+00 3.39159124037276216157e-01
6.950000 1.00000000000000333067e+00 3.43474105872698554087e-01
7.000000 1.00000000000000310862e+00 3.47218727168247420778e-01
7.050000 1.00000000000000155431e+00 3.50136125784853591281e-01
7.100000 1.00000000000000244249e+00 3.52002870058129524455e-01
7.150000 1.00000000000000266454e+00 3.52652662983667541940e-01
7.200000 1.00000000000000133227e+00 3.51988920931587845331e-01
7.250000 1.00000000000000088818e+00 3.49986948215580462307e-01
7.300000 1.00000000000000088818e+00 3.46692272142344770636e-01
7.350000 1.00000000000000199840e+00 3.42209385497611318083e-01
7.400000 1.00000000000000088818e+00 3.36688983142381270675e-01
7.450000 1.00000000000000133227e+00 3.30318575896791810642e-01
7.500000 1.00000000000000111022e+00 3.23309622792182671525e-01
7.550000 1.00000000000000000000e+00 3.15887449243576812208e-01
7.600000 1.00000000000000044409e+00 3.08290313543058303036e-01
7.650000 1.00000000000000133227e+00 3.00773029349588993941e-01
7.700000 1.00000000000000022204e+00 2.93613249189663527705e-01
7.750000 1.00000000000000000000e+00 2.87117345834135839766e-01
7.800000 9.99999999999999777955e-01 2.81618162249082260029e-01
7.850000 1.00000000000000000000e+00 2.77462690108223553054e-01
7.900000 1.00000000000000022204e+00 2.74994842530573824213e-01
7.950000 1.00000000000000066613e+00 2.74532276203782454882e-01
8.000000 1.00000000000000044409e+00 2.76332872659021955286e-01
8.050000 9.99999999999999444888e-01 2.80559660248306697028e-01
8.100000 9.99999999999998556710e-01 2.87248314027712725593e-01
8.150000 9.99999999999999444888e-01 2.96275464994020409915e-01
8.200000 9.99999999999998223643e-01 3.07343381037015139778e-01
8.250000 9.99999999999998001599e-01 3.19980578814615224115e-01
8.300000 9.99999999999998889777e-01 3.33549877792074789262e-01
8.350000 9.99999999999998889777e-01 3.47281915514463523920e-01
8.400000 9.99999999999996891376e-01 3.60329798092362485473e-01
8.450000 9.99999999999994004796e-01 3.71833233960767284287e-01
8.500000 9.99999999999994892974e-01 3.81001451608753205491e-01
8.550000 9.99999999999996225242e-01 3.87192698182861227973e-01
8.600000 9.99999999999998223643e-01 3.89972250389996721864e-01
8.650000 9.99999999999998445688e-01 3.89155003436237545422e-01
8.700000 9.99999999999997668532e-01 3.84812214401721974788e-01
8.750000 9.99999999999998112621e-01 3.77237957792148526082e-01
8.800000 9.99999999999996336264e-01 3.66893433318588590986e-01
8.850000 9.99999999999997668532e-01 3.54329282444564075405e-01
8.900000 9.99999999999997890576e-01 3.40107102369997971181e-01
8.950000 9.99999999999995448086e-01 3.24748933780096060708e-01
9.000000 9.99999999999995448086e-01 3.08713933034861442994e-01
9.050000 9.99999999999996780353e-01 2.92407345834413079366e-01
9.100000 9.99999999999996225242e-01 2.76219905216949557225e-01
9.150000 9.99999999999995892175e-01 2.60571579383747087277e-01
9.200000 9.99999999999996114219e-01 2.45948732049402041255e-01
9.250000 9.99999999999997446487e-01 2.32924856040322009187e-01
9.300000 9.99999999999997113420e-01 2.22145965982100401792e-01
9.350000 9.99999999999995892175e-01 2.14288687665162486118e-01
9.400000 9.99999999999993338662e-01 2.10002762000579712431e-01
9.450000 9.99999999999993005595e-01 2.09838598284101507385e-01
9.500000 9.99999999999990674127e-01 2.14179050302865270350e-01
9.550000 9.99999999999994226840e-01 2.23183819057778454198e-01
9.600000 9.99999999999993449684e-01 2.36739629792213190917e-01
9.650000 9.99999999999993671729e-01 2.54430933344114096339e-01
9.700000 9.99999999999994337863e-01 2.75534791696516345727e-01
9.750000 9.99999999999996114219e-01 2.99033139185754082146e-01
9.800000 9.99999999999995115019e-01 3.23657811266331085776e-01
9.850000 9.99999999999996003197e-01 3.47968008664249206507e-01
9.900000 9.99999999999996447286e-01 3.70452920646290650986e-01
9.950000 9.99999999999997557509e-01 3.89665717623327689800e-01
10.000000 9.99999999999998001599e-01 4.04368529503888574084e-01
10.050000 9.99999999999994337863e-01 4.13659377970113761869e-01
10.100000 9.99999999999995448086e-01 4.17063455335733856977e-01
10.150000 9.99999999999992672528e-01 4.14564652887021212191e-01
10.200000 9.99999999999993782751e-01 4.06567713999988866735e-01
10.250000 9.99999999999993449684e-01 3.93803999049168962365e-01
10.300000 9.99999999999992783550e-01 3.77199060466727020824e-01
10.350000 9.99999999999993449684e-01 3.57729589972025419087e-01
10.400000 9.99999999999991451283e-01 3.36307273864140832131e-01
10.450000 9.99999999999993227640e-01 3.13717641624042364867e-01
10.500000 9.99999999999992228439e-01 2.90617901416565793671e-01
10.550000 9.99999999999992672528e-01 2.67583975166098109177e-01
10.600000 9.99999999999991229238e-01 2.45182630812784491114e-01
10.650000 9.99999999999993671729e-01 2.24029547077189472581e-01
10.700000 9.99999999999993893773e-01 2.04814818104370910401e-01
10.750000 9.99999999999993893773e-01 1.88295397645394879671e-01
10.800000 9.99999999999993227640e-01 1.75247501773022618110e-01
10.850000 9.99999999999993449684e-01 1.66394991254443957995e-01
10.900000 9.99999999999994559907e-01 1.62338745394217442986e-01
10.950000 9.99999999999991673327e-01 1.63483689797638470642e-01
11.000000 9.99999999999988564703e-01 1.69979067589338866950e-01
11.050000 9.99999999999989008792e-01 1.81692154523873744543e-01
11.100000 9.99999999999988897770e-01 1.98194970130271902464e-01
11.150000 9.99999999999988342658e-01 2.18769097376893678630e-01
11.200000 9.99999999999989230837e-01 2.42439857342479275770e-01
11.250000 9.99999999999988897770e-01 2.68013232311267501906e-01
11.300000 9.99999999999988786747e-01 2.94131509628052068006e-01
11.350000 9.99999999999988564703e-01 3.19364110688401148241e-01
11.400000 9.99999999999988009591e-01 3.42304236330480571304e-01
11.450000 9.99999999999988453681e-01 3.61677148096114287057e-01
11.500000 9.99999999999986788346e-01 3.76453448132744283861e-01
11.550000 9.99999999999987676524e-01 3.85927304583527752690e-01
11.600000 9.99999999999987232435e-01 3.89762807828221535811e-01
11.650000 9.99999999999988120614e-01 3.88004781834119794048e-01
11.700000 9.99999999999988120614e-01 3.81034371836878826834e-01
11.750000 9.99999999999986788346e-01 3.69491890287457047659e-01
11.800000 9.99999999999987676524e-01 3.54186548242708010292e-01
11.850000 9.99999999999988342658e-01 3.36001574119497825599e-01
11.900000 9.99999999999988120614e-01 3.15822591324024126713e-01
11.950000 9.99999999999988564703e-01 2.94500215639478590823e-01
12.000000 9.99999999999991673327e-01 2.72835558987088666605e-01
12.050000 9.99999999999992339461e-01 2.51582615634557915651e-01
12.100000 9.99999999999993893773e-01 2.31459076985683659400e-01
12.150000 9.99999999999992561506e-01 2.13148441026974111434e-01
12.200000 9.99999999999991895372e-01 1.97288576549970173790e-01
12.250000 9.99999999999990230037e-01 1.84454001745084750219e-01
12.300000 9.99999999999992006394e-01 1.75125957465083442743e-01
12.350000 9.99999999999994226840e-01 1.69652725009544508294e-01
12.400000 9.99999999999993449684e-01 1.68221230748116762355e-01
12.450000 9.99999999999993338662e-01 1.70836304075372868994e-01
12.500000 9.99999999999994226840e-01 1.77307382588476308838e-01
12.550000 9.99999999999994670929e-01 1.87260793980803530445e-01
12.600000 9.99999999999996003197e-01 2.00157831709950662091e-01
12.650000 9.99999999999996669331e-01 2.15311858823144269826e-01
12.700000 9.99999999999996336264e-01 2.31928354812134723817e-01
12.750000 9.99999999999997002398e-01 2.49147286278329493925e-01
12.800000 9.99999999999997224442e-01 2.66083535363292711384e-01
12.850000 9.99999999999997002398e-01 2.81887796256130029882e-01
12.900000 9.99999999999995892175e-01 2.95796749095729616386e-01
12.950000 9.99999999999994337863e-01 3.07167263761038977776e-01
13.000000 9.99999999999995226041e-01 3.15520223032267177476e-01
13.050000 9.99999999999994115818e-01 3.20564111741647672638e-01
13.100000 9.99999999999993116617e-01 3.22195891457394023583e-01
13.150000 9.99999999999991895372e-01 3.20504507103339053575e-01
13.200000 9.99999999999992339461e-01 3.15749770570572796391e-01
13.250000 9.99999999999991562305e-01 3.08321293446175315189e-01
13.300000 9.99999999999991007194e-01 2.98710251100890611387e-01
13.350000 9.99999999999989674926e-01 2.87473429028574423150e-01
13.400000 9.99999999999990341060e-01 2.75192786901210961759e-01
13.450000 9.99999999999989008792e-01 2.62455267316248630483e-01
13.500000 9.99999999999988453681e-01 2.49828732662193186975e-01
13.550000 9.99999999999989341859e-01 2.37834265679279122097e-01
13.600000 9.99999999999989563904e-01 2.26936446981697848013e-01
13.650000 9.99999999999989785948e-01 2.17530100721155583710e-01
13.700000 9.99999999999989230837e-01 2.09923685186205244424e-01
13.750000 9.99999999999989119814e-01 2.04336637233881845965e-01
13.800000 9.99999999999989119814e-01 2.00892689498853360686e-01
13.850000 9.99999999999989563904e-01 1.99612493673716834275e-01
13.900000 9.99999999999990007993e-01 2.00419827706605990780e-01
13.950000 9.99999999999988786747e-01 2.03146233567856215885e-01
14.000000 9.99999999999988675725e-01 2.07538439683094599886e-01
14.050000 9.99999999999988564703e-01 2.13276647495461380011e-01
14.100000 9.99999999999988009591e-01 2.19990343141206162736e-01
14.150000 9.99999999999989119814e-01 2.27277257664696641370e-01
14.200000 9.99999999999988564703e-01 2.34727851084008565241e-01
14.250000 9.99999999999989008792e-01 2.41944161890436465479e-01
14.300000 9.99999999999989674926e-01 2.48560020540226411789e-01
14.350000 9.99999999999989452881e-01 2.54261070739345507175e-01
14.400000 9.99999999999991007194e-01 2.58796857767526811145e-01
14.450000 9.99999999999990119015e-01 2.61992875251680301663e-01
14.500000 9.99999999999990119015e-01 2.63757669311875109219e-01
14.550000 9.99999999999990563104e-01 2.64080915389039827534e-01
14.600000 9.99999999999989452881e-01 2.63030039490668388069e-01
14.650000 9.99999999999991007194e-01 2.60741167683978702918e-01
14.700000 9.99999999999991229238e-01 2.57405894126054468618e-01
14.750000 9.99999999999991229238e-01 2.53259057477347893084e-01
14.800000 9.99999999999992117417e-01 2.48563051291346481797e-01
14.850000 9.99999999999991007194e-01 2.43592306287284676714e-01
14.900000 9.99999999999991451283e-01 2.38617587621356486149e-01
14.950000 9.99999999999991895372e-01 2.33889692522815717535e-01
15.000000 9.99999999999993227640e-01 2.29629973625885913657e-01
15.050000 9.99999999999992894573e-01 2.26020682544822548721e-01
15.100000 9.99999999999992561506e-01 2.23197159051621546455e-01
15.150000 9.99999999999991451283e-01 2.21247517110369579241e-01
15.200000 9.99999999999992339461e-01 2.20206679411946604219e-01
15.250000 9.99999999999991007194e-01 2.20054923111268618818e-01
15.300000 9.99999999999991895372e-01 2.20726796460654489662e-01
15.350000 9.99999999999989896970e-01 2.22113341514935169752e-01
15.400000 9.99999999999987787547e-01 2.24069764218692679680e-01
15.450000 9.99999999999987787547e-01 2.26430031309876267365e-01
15.500000 9.99999999999985900168e-01 2.29010061154493627100e-01
15.550000 9.99999999999985789145e-01 2.31617629640913091915e-01
15.600000 9.99999999999986455279e-01 2.34069917255760706620e-01
15.650000 9.99999999999985234034e-01 2.36197971132453332643e-01
15.700000 9.99999999999985123011e-01 2.37857088762960355854e-01
15.750000 9.99999999999985123011e-01 2.38939887375415882520e-01
15.800000 9.99999999999985345056e-01 2.39373270450089215000e-01
15.850000 9.99999999999984900967e-01 2.39123810226188893147e-01
15.900000 9.99999999999984900967e-01 2.38204380716241087557e-01
15.950000 9.99999999999986455279e-01 2.36665241959907790559e-01
16.000000 9.99999999999987343458e-01 2.34593167089668985792e-01
16.050000 9.99999999999987565502e-01 2.32109669121973782868e-01
16.100000 9.99999999999988897770e-01 2.29355540547595687650e-01
16.150000 9.99999999999989341859e-01 2.26486161558213244804e-01
16.200000 9.99999999999988897770e-01 2.23666317250948820661e-01
16.250000 9.99999999999988897770e-01 2.21052845347598059256e-01
16.300000 9.99999999999989341859e-01 2.18789690933217761959e-01
16.350000 9.99999999999989230837e-01 2.17002553402441761277e-01
16.400000 9.99999999999989230837e-01 2.15784947863754655861e-01
16.450000 9.99999999999990119015e-01 2.15198860947180992120e-01
16.500000 9.99999999999990785149e-01 2.15272507761552905903e-01
16.550000 9.99999999999991895372e-01 2.15991962327969633240e-01
16.600000 9.99999999999990785149e-01 2.17307522554569199080e-01
16.650000 9.99999999999991229238e-01 2.19136849031384028930e-01
16.700000 9.99999999999991673327e-01 2.21364810437863379633e-01
16.750000 9.99999999999991673327e-01 2.23856161100873973790e-01
16.800000 9.99999999999990785149e-01 2.26460625425489281426e-01
16.850000 9.99999999999991451283e-01 2.29016738519955354025e-01
16.900000 9.99999999999991451283e-01 2.31366888579914442570e-01
16.950000 9.99999999999992339461e-01 2.33361500468073523873e-01
17.000000 9.99999999999991451283e-01 2.34867992843837747330e-01
17.050000 9.99999999999991340260e-01 2.35781625128295979632e-01
17.100000 9.99999999999991118216e-01 2.36024598051352063610e-01
17.150000 9.99999999999989341859e-01 2.35554560413581914879e-01
17.200000 9.99999999999990007993e-01 2.34366715225650168453e-01
17.250000 9.99999999999990230037e-01 2.32490116592006690333e-01
17.300000 9.99999999999992006394e-01 2.29992430343067960630e-01
17.350000 9.99999999999991118216e-01 2.26974301951967993851e-01
17.400000 9.99999999999991562305e-01 2.23560744166824809653e-01
17.450000 9.99999999999991562305e-01 2.19901634804101742127e-01
17.500000 9.99999999999992006394e-01 2.16160587105986956580e-01
17.550000 9.99999999999991229238e-01 2.12504363231090787068e-01
17.600000 9.99999999999991229238e-01 2.09100804792666516985e-01
17.650000 9.99999999999991229238e-01 2.06106870582410117709e-01
17.700000 9.99999999999991451283e-01 2.03657784750253256778e-01
17.750000 9.99999999999991451283e-01 2.01867457988999521312e-01
17.800000 9.99999999999993449684e-01 2.00818210207400316136e-01
17.850000 9.99999999999993671729e-01 2.00551796831793915921e-01
17.900000 9.99999999999992450483e-01 2.01075644453252933008e-01
17.950000 9.99999999999993116617e-01 2.02357228703950620119e-01
18.000000 9.99999999999992450483e-01 2.04323537338247762651e-01
18.050000 9.99999999999993116617e-01 2.06871029306582104867e-01
18.100000 9.99999999999993782751e-01 2.09864226283756338809e-01
18.150000 9.99999999999994892974e-01 2.13141454741943459084e-01
18.200000 9.99999999999993893773e-01 2.16530429339756413931e-01
18.250000 9.99999999999994115818e-01 2.19848759767512114127e-01
18.300000 9.99999999999994115818e-01 2.22916100856945742503e-01
18.350000 9.99999999999993005595e-01 2.25567891911329782006e-01
18.400000 9.99999999999991340260e-01 2.27654531798546944099e-01
18.450000 9.99999999999990007993e-01 2.29052694126135714114e-01
18.500000 9.99999999999990452082e-01 2.29678308640560546738e-01
18.550000 9.99999999999989785948e-01 2.29478790821064204675e-01
18.600000 9.99999999999988897770e-01 2.28442713394223007040e-01
18.650000 9.99999999999988231636e-01 2.26604120406725950687e-01
18.700000 9.99999999999989563904e-01 2.24028061425296132203e-01
18.750000 9.99999999999989563904e-01 2.20817578812903897445e-01
18.800000 9.99999999999989563904e-01 2.17110979534796494361e-01
18.850000 9.99999999999990674127e-01 2.13064742165358006476e-01
18.900000 9.99999999999989563904e-01 2.08851812998132546628e-01
18.950000 9.99999999999990896171e-01 2.04657436714024809632e-01
19.000000 9.99999999999991784350e-01 2.00659654130853182252e-01
19.050000 9.99999999999992450483e-01 1.97030366612147483929e-01
19.100000 9.99999999999992117417e-01 1.93928076641182750572e-01
19.150000 9.99999999999993227640e-01 1.91480606472887560088e-01
19.200000 9.99999999999993449684e-01 1.89788054103918635285e-01
19.250000 9.99999999999993671729e-01 1.88916835050004894292e-01
19.300000 9.99999999999993671729e-01 1.88888603466681320731e-01
19.350000 9.99999999999993893773e-01 1.89694400960447651094e-01
19.400000 9.99999999999995003996e-01 1.91285546409534101819e-01
19.450000 9.99999999999993893773e-01 1.93568161168728186672e-01
19.500000 9.99999999999994781952e-01 1.96427583566738839238e-01
19.550000 9.99999999999993893773e-01 1.99718411627337999459e-01
19.600000 9.99999999999993449684e-01 2.03266268012807255205e-01
19.650000 9.99999999999992894573e-01 2.06903837193912087944e-01
19.700000 9.99999999999993560706e-01 2.10449687388376549535e-01
19.750000 9.99999999999994670929e-01 2.13719715977634672210e-01
19.800000 9.99999999999995781153e-01 2.16562497965548883538e-01
19.850000 9.99999999999995559108e-01 2.18833616559404420254e-01
19.900000 9.99999999999995781153e-01 2.20413288078484315147e-01
19.950000 9.99999999999996003197e-01 2.21236877984023555532e-01
20.000000 9.99999999999994892974e-01 2.21254363248766627859e-01
