# tag norm j_0
1.700000 1.00000000000000421885e+00 3.05781296925794002510e-05
1.700000 1.00000000000000421885e+00 1.29456249756123970392e-05
1.700000 1.00000000000000421885e+00 1.20766892814361536816e-05
1.700000 1.00000000000000421885e+00 4.04453950994725054750e-06
1.700000 1.00000000000000421885e+00 1.27056477484292160976e-05
1.700000 1.00000000000000421885e+00 3.15266797713264757653e-06
1.700000 1.00000000000000421885e+00 1.43664964825869804436e-05
1.700000 1.00000000000000421885e+00 1.20732258946132882719e-05
1.700000 1.00000000000000421885e+00 3.21618281759963880887e-05
