# tag norm j_0
9.300000 1.00000000000008015810e+00 -1.01900228200104886467e-01
9.300000 1.00000000000008015810e+00 -9.65873301711877435549e-02
9.300000 1.00000000000008015810e+00 -9.91206064302681960632e-02
9.300000 1.00000000000008015810e+00 -9.64419960427018579940e-02
9.300000 1.00000000000008015810e+00 -9.91400388528998477433e-02
9.300000 1.00000000000008015810e+00 -9.63840049484382954681e-02
9.300000 1.00000000000008015810e+00 -9.91906925027961072772e-02
9.300000 1.00000000000008015810e+00 -9.63303231495507145121e-02
9.300000 1.00000000000008015810e+00 -9.92448330641612364023e-02
9.300000 1.00000000000008015810e+00 -9.62746895802587404622e-02
9.300000 1.00000000000008015810e+00 -9.92991279206208860009e-02
9.300000 1.00000000000008015810e+00 -9.62193008316548081815e-02
9.300000 1.00000000000008015810e+00 -9.93507435512746006623e-02
9.300000 1.00000000000008015810e+00 -9.61641530087009727135e-02
9.300000 1.00000000000008015810e+00 -9.94080827490969182181e-02
9.300000 1.00000000000008015810e+00 -9.61166159322170976509e-02
9.300000 1.00000000000008015810e+00 -9.94968217473543720120e-02
9.300000 1.00000000000008015810e+00 -9.61601407377346284466e-02
9.300000 1.00000000000008015810e+00 -1.02424323942655826070e-01
