# tag norm n_down_hub[0] n_down_hub[1] n_down_hub[2] n_down_hub[3] n_down_hub[4] n_down_hub[5] n_down_hub[6] n_down_hub[7] n_down_hub[8] n_down_hub[9]
1 1.00000000000000000000e+00 5.41198100737149578876e-01 4.60604705909301234690e-02 3.18264714387276603791e-01 1.78954965363802565026e-01 2.48485047606156889133e-02 9.10447098660820630656e-01 9.76900861553870014653e-01 9.41882361752545138600e-01 9.72041801901282753740e-02 9.64238742002861082270e-01
2 1.00000000000000000000e+00 4.41706228193464944809e-01 4.27480055621744459149e-01 2.20439183742690475443e-01 8.03894845773037602932e-01 1.68039258685532405524e-01 8.27571520145483741082e-01 3.71201950710771888531e-01 6.48858948113369193855e-01 4.82221364951427755585e-01 6.08586644062481751938e-01
3 1.00000000000000000000e+00 9.46591300202225260918e-01 7.11230157123289519205e-01 3.59532197735181302534e-01 9.03221982897688069336e-01 2.30749839007951235148e-01 8.31845880128131209830e-01 2.24451513170961708399e-01 5.65701627384215255390e-01 1.63269670848880249503e-01 6.34058315014759121819e-02
4 1.00000000000000000000e+00 8.63971993773828272900e-01 6.39696194805381979087e-01 4.85527818067593930351e-01 7.52782587907103395430e-01 2.76845789855068136198e-01 7.28563946621328395459e-01 2.42258823709515569433e-01 4.54773007444855936754e-01 3.65828686909154765505e-01 1.89751150906183468914e-01
5 1.00000000000000000000e+00 6.93378602118227549411e-01 5.76752697145966553016e-01 5.43819047065413396780e-01 5.93061893196521583427e-01 4.28225811569062142503e-01 5.56159702201058703253e-01 3.97804305053937046210e-01 4.39792047393136931177e-01 4.14079840582089464540e-01 3.56926053674607446364e-01
6 1.00000000000000000000e+00 3.92106485475774646510e-01 6.36065047741723232910e-01 3.68378400343116751969e-01 6.59760968079177612111e-01 4.03167086419804587827e-01 6.07834079942523808349e-01 4.03685454708572255544e-01 5.78551690989898670381e-01 3.88816190446672149683e-01 5.61634595852728679688e-01
7 1.00000000000000000000e+00 3.41333972837872590134e-01 6.60122350689671733015e-01 3.27073990479033960277e-01 6.71376192669496885124e-01 3.31009123762149248815e-01 6.67557937381787369624e-01 3.18495872747337538389e-01 6.82009144306558567905e-01 3.33633087451221665987e-01 6.67388327674877546158e-01
8 1.00000000000000000000e+00 3.20645017135502918837e-01 6.72957878772413531365e-01 3.07734238368027823718e-01 6.86035700937287495904e-01 3.12568286767438308082e-01 6.87880083436394507146e-01 3.16147252068496420474e-01 6.90312344935357424802e-01 3.27850598794111158796e-01 6.77868598784999720763e-01
9 1.00000000000000000000e+00 3.16046053147260086469e-01 6.75825016141626710997e-01 3.03107820626610180437e-01 6.88840318558854858288e-01 3.04806169561740336604e-01 6.94918150874290097008e-01 3.10100656703098775946e-01 6.97831992079378293781e-01 3.23313427670760433763e-01 6.85210394636385999867e-01
10 1.00000000000000000000e+00 3.13283854165866237906e-01 6.77642034489845168643e-01 3.00668468153267531839e-01 6.90934005481480206790e-01 3.03021546014151654802e-01 6.97014172439446411111e-01 3.09444264612699970751e-01 6.99020129400180989521e-01 3.22543615092128865829e-01 6.86427910150955278290e-01
11 1.00000000000000000000e+00 3.13184748045793381888e-01 6.77713804353127891034e-01 3.00624357292683164200e-01 6.90885527173320412864e-01 3.02713377730733923521e-01 6.97287945939565334541e-01 3.09122145678100312960e-01 6.99369567168082517661e-01 3.22296204061258140250e-01 6.86802322557328426278e-01
12 1.00000000000000000000e+00 3.13172761386800779793e-01 6.77721172504414437476e-01 3.00609744126102085282e-01 6.90897469408931930168e-01 3.02697946644189697096e-01 6.97302311700101373759e-01 3.09103955095832827471e-01 6.99389215252031237746e-01 3.22281412351558549378e-01 6.86824011530049238772e-01
