# tag norm j_0
7.500000 1.00000000000000976996e+00 -4.15430136303341756426e-03
7.500000 1.00000000000000976996e+00 -3.01217283695471042468e-03
7.500000 1.00000000000000976996e+00 -3.65942326255946784666e-03
7.500000 1.00000000000000976996e+00 -3.24535461841466300187e-03
7.500000 1.00000000000000976996e+00 -3.48582593222067057062e-03
7.500000 1.00000000000000976996e+00 -3.29176369388833140947e-03
7.500000 1.00000000000000976996e+00 -3.38839004255142616298e-03
7.500000 1.00000000000000976996e+00 -3.29533382089373114501e-03
7.500000 1.00000000000000976996e+00 -3.34554491992797992106e-03
7.500000 1.00000000000000976996e+00 -3.26458934256990129796e-03
7.500000 1.00000000000000976996e+00 -3.29782765732498754641e-03
7.500000 1.00000000000000976996e+00 -3.21419793811908655404e-03
7.500000 1.00000000000000976996e+00 -3.24303107482826072708e-03
7.500000 1.00000000000000976996e+00 -3.13876343089571204978e-03
7.500000 1.00000000000000976996e+00 -3.24209937911636852936e-03
7.500000 1.00000000000000976996e+00 -3.02526508102028517111e-03
7.500000 1.00000000000000976996e+00 -3.30676126572995504257e-03
7.500000 1.00000000000000976996e+00 -2.73998521147615550081e-03
7.500000 1.00000000000000976996e+00 -3.64973395148744965064e-03
