# tag norm BO
1 1.00000000000000155431e+00 -1.21296047347806051908e-01
2 1.00000000000000044409e+00 -2.14483929439292855812e-02
3 9.99999999999999111822e-01 2.13373282260806047816e-02
4 9.99999999999999222844e-01 -2.13888745870372598556e-01
5 9.99999999999999555911e-01 9.68094971337569998315e-02
6 1.00000000000000044409e+00 3.94258902331671823305e-01
7 9.99999999999998889777e-01 4.32175110062361089724e-01
8 9.99999999999999777955e-01 4.36789227387656575630e-01
9 9.99999999999999777955e-01 4.37044193685982795827e-01
10 1.00000000000000133227e+00 4.37026255988371359340e-01
11 9.99999999999999888978e-01 4.36991441610497688419e-01
12 9.99999999999998889777e-01 4.36989362554662030824e-01
