# tag norm BO
1 1.00000000000000000000e+00 5.23794715983126515230e-03
2 1.00000000000000000000e+00 1.68541187897188575462e-02
3 1.00000000000000000000e+00 4.18213858013182157580e-02
4 1.00000000000000000000e+00 4.03889414564214330183e-02
5 1.00000000000000000000e+00 3.88960675094237248728e-02
6 1.00000000000000000000e+00 2.70099504312174623633e-02
7 1.00000000000000000000e+00 1.19332643494613026280e-02
8 1.00000000000000000000e+00 2.59134962707494595838e-03
9 1.00000000000000000000e+00 2.90934954796984992717e-03
10 1.00000000000000000000e+00 1.98887130988386826025e-03
11 1.00000000000000000000e+00 -1.80733555804719024651e-03
12 1.00000000000000000000e+00 -4.66603753652503928928e-03
13 1.00000000000000000000e+00 2.73319667588599497787e-02
14 1.00000000000000000000e+00 3.01727775099434256112e-02
15 1.00000000000000000000e+00 5.85251705532356669703e-04
16 1.00000000000000000000e+00 4.34173421472602433235e-02
17 1.00000000000000000000e+00 5.41228725527570023179e-02
18 1.00000000000000000000e+00 4.06563288319729473907e-02
19 1.00000000000000000000e+00 1.76479418207582186562e-02
20 1.00000000000000000000e+00 -3.29745158666670465375e-02
21 1.00000000000000000000e+00 -5.14413258505055093206e-02
22 1.00000000000000000000e+00 -4.24790491446904242001e-02
23 1.00000000000000000000e+00 -2.32523197016669264103e-02
24 1.00000000000000000000e+00 4.14378876481108909813e-02
25 1.00000000000000000000e+00 5.95441790488352995503e-02
26 1.00000000000000000000e+00 5.17337031509341252478e-02
27 1.00000000000000000000e+00 3.46356961807840410539e-02
28 1.00000000000000000000e+00 -1.40109757501112042188e-02
29 1.00000000000000000000e+00 -4.85601818516924951807e-02
30 1.00000000000000000000e+00 -4.39585279565597730755e-02
31 1.00000000000000000000e+00 -2.43784815354659359365e-02
32 1.00000000000000000000e+00 3.35832233249941936037e-02
33 1.00000000000000000000e+00 6.12685575424962228230e-02
34 1.00000000000000000000e+00 5.31080931888629828586e-02
35 1.00000000000000000000e+00 3.86722115413428157993e-02
36 1.00000000000000000000e+00 -2.68719815192696824535e-02
37 1.00000000000000000000e+00 -5.05788462165924698755e-02
38 1.00000000000000000000e+00 -3.98571619308011465543e-02
39 1.00000000000000000000e+00 -2.43447586211262695377e-02
40 1.00000000000000000000e+00 5.81833673837193268708e-02
41 1.00000000000000000000e+00 7.61555705869454147017e-02
42 1.00000000000000000000e+00 6.68569806568613533848e-02
43 1.00000000000000000000e+00 5.42145862964897307101e-02
44 1.00000000000000000000e+00 -5.27933729697881576337e-02
45 1.00000000000000000000e+00 -5.78432939023506911824e-02
46 1.00000000000000000000e+00 -4.94358839752310694204e-02
47 1.00000000000000000000e+00 -3.49633306001881291603e-02
48 1.00000000000000000000e+00 1.55476478895636649469e-01
49 1.00000000000000000000e+00 1.60371031653720935717e-01
50 1.00000000000000000000e+00 1.46718943351891006888e-01
51 1.00000000000000000000e+00 1.43521437620795916379e-01
52 1.00000000000000000000e+00 1.43265294661245018437e-01
53 1.00000000000000000000e+00 1.43253899580991606033e-01
