# tag norm j_0
16.500000 1.00000000000003463896e+00 -1.13638976117640100837e-03
16.500000 1.00000000000003463896e+00 -1.35795366977573515876e-03
16.500000 1.00000000000003463896e+00 -1.13700794070949943830e-03
16.500000 1.00000000000003463896e+00 -6.52098775784189211256e-04
16.500000 1.00000000000003463896e+00 -5.70765610645900044011e-04
16.500000 1.00000000000003463896e+00 -6.45235339890640668611e-04
16.500000 1.00000000000003463896e+00 -1.13457114679825434196e-03
16.500000 1.00000000000003463896e+00 -1.36025748879042081459e-03
16.500000 1.00000000000003463896e+00 -1.15080520124051315610e-03
