# tag norm j_0
22.600000 1.00000000000002953193e+00 -3.84515069190441178149e-04
22.600000 1.00000000000002953193e+00 1.82311943685527764504e-03
22.600000 1.00000000000002953193e+00 -2.11578768110596464672e-03
22.600000 1.00000000000002953193e+00 1.53144108925835778848e-03
22.600000 1.00000000000002953193e+00 -2.05384085790956448861e-03
22.600000 1.00000000000002953193e+00 1.57707027695140459579e-03
22.600000 1.00000000000002953193e+00 -2.01213986285553488031e-03
22.600000 1.00000000000002953193e+00 1.61800535269649228831e-03
22.600000 1.00000000000002953193e+00 -1.98126309799946578177e-03
22.600000 1.00000000000002953193e+00 1.63296283115664932033e-03
22.600000 1.00000000000002953193e+00 -1.97723947015121742990e-03
22.600000 1.00000000000002953193e+00 1.62445854006067961876e-03
22.600000 1.00000000000002953193e+00 -2.00447729817302810335e-03
22.600000 1.00000000000002953193e+00 1.58692781398383142219e-03
22.600000 1.00000000000002953193e+00 -2.05103779585767568086e-03
22.600000 1.00000000000002953193e+00 1.53997303143159304170e-03
22.600000 1.00000000000002953193e+00 -2.11683352227399210546e-03
22.600000 1.00000000000002953193e+00 1.84452550765333046778e-03
22.600000 1.00000000000002953193e+00 -3.08388967389206924020e-04
