# tag norm j_0
9.600000 1.00000000000000577316e+00 -1.32789612885746644011e-01
9.600000 1.00000000000000577316e+00 5.26187083761218352129e-02
9.600000 1.00000000000000577316e+00 -1.12169691066971818905e-01
9.600000 1.00000000000000577316e+00 -4.87798124239596959939e-03
9.600000 1.00000000000000577316e+00 -7.55280768512971850681e-02
9.600000 1.00000000000000577316e+00 -4.63709988672071377752e-03
9.600000 1.00000000000000577316e+00 -1.12170263124825447809e-01
9.600000 1.00000000000000577316e+00 5.27322957127305744218e-02
9.600000 1.00000000000000577316e+00 -1.29937114598595027104e-01
