# tag norm j_0
9.900000 1.00000000000007016610e+00 7.91901156647774606689e-02
9.900000 1.00000000000007016610e+00 1.00407669988421655027e-01
9.900000 1.00000000000007016610e+00 7.83491598425158641827e-02
9.900000 1.00000000000007016610e+00 1.00742178367136669959e-01
9.900000 1.00000000000007016610e+00 7.82307012192865608435e-02
9.900000 1.00000000000007016610e+00 1.00636334013283007538e-01
9.900000 1.00000000000007016610e+00 7.80706826036830503490e-02
9.900000 1.00000000000007016610e+00 1.00525330324880535215e-01
9.900000 1.00000000000007016610e+00 7.79056752013540937396e-02
9.900000 1.00000000000007016610e+00 1.00415161000220284904e-01
9.900000 1.00000000000007016610e+00 7.77398294995962357845e-02
9.900000 1.00000000000007016610e+00 1.00302994400720962842e-01
9.900000 1.00000000000007016610e+00 7.75763813446496280912e-02
9.900000 1.00000000000007016610e+00 1.00188965251538461554e-01
9.900000 1.00000000000007016610e+00 7.74062616754460364188e-02
9.900000 1.00000000000007016610e+00 1.00066414204559570034e-01
9.900000 1.00000000000007016610e+00 7.71964051879988899518e-02
9.900000 1.00000000000007016610e+00 9.95098897015760097684e-02
9.900000 1.00000000000007016610e+00 7.76656254468856693807e-02
