# tag norm j_0
10.700000 1.00000000000001065814e+00 3.13150730509526575851e-01
10.700000 1.00000000000001065814e+00 5.96137719148283132253e-02
10.700000 1.00000000000001065814e+00 4.75480523518834602426e-02
10.700000 1.00000000000001065814e+00 5.32863939580391007822e-02
10.700000 1.00000000000001065814e+00 1.44628041381927252562e-01
10.700000 1.00000000000001065814e+00 5.36651072406334056497e-02
10.700000 1.00000000000001065814e+00 4.83025008676372796801e-02
10.700000 1.00000000000001065814e+00 5.91946332044210252188e-02
10.700000 1.00000000000001065814e+00 3.13674749406257780127e-01
