# tag norm j_0
25.200000 1.00000000000002309264e+00 -1.15233189178676240227e-01
25.200000 1.00000000000002309264e+00 7.39551092061709880454e-02
25.200000 1.00000000000002309264e+00 -2.28147178083849301589e-02
25.200000 1.00000000000002309264e+00 -1.31751529761119437478e-02
25.200000 1.00000000000002309264e+00 1.28927865884027798016e-01
25.200000 1.00000000000002309264e+00 -1.22707803507399997728e-02
25.200000 1.00000000000002309264e+00 -2.35908594258701607982e-02
25.200000 1.00000000000002309264e+00 7.31649554235956345316e-02
25.200000 1.00000000000002309264e+00 -1.13949221411778212065e-01
