# tag norm j_0
23.000000 1.00000000000002242651e+00 1.09538422896312742649e-01
23.000000 1.00000000000002242651e+00 -5.41461031257046560006e-02
23.000000 1.00000000000002242651e+00 -9.11442253245852394838e-03
23.000000 1.00000000000002242651e+00 1.40435474099065600584e-02
23.000000 1.00000000000002242651e+00 -7.39913520828666404494e-02
23.000000 1.00000000000002242651e+00 1.39063061538355677710e-02
23.000000 1.00000000000002242651e+00 -9.41785420349471567858e-03
23.000000 1.00000000000002242651e+00 -5.36155675588577615431e-02
23.000000 1.00000000000002242651e+00 1.09078497579216601721e-01
