# tag norm j_0
21.900000 1.00000000000000022204e+00 -3.11562986711243347301e-04
21.900000 1.00000000000000022204e+00 -1.65012732379191687454e-04
21.900000 1.00000000000000022204e+00 -2.95781162562141705392e-04
21.900000 1.00000000000000022204e+00 4.82526848788969063217e-04
21.900000 1.00000000000000022204e+00 8.56051861690867565285e-04
21.900000 1.00000000000000022204e+00 5.00331144159811384842e-04
21.900000 1.00000000000000022204e+00 -2.82868079432926466509e-04
21.900000 1.00000000000000022204e+00 -1.55400434698651812885e-04
21.900000 1.00000000000000022204e+00 -3.04882091492986444670e-04
