# tag norm j
0.050000 9.99999999999998667732e-01 4.79647746672016259844e-07
0.100000 9.99999999999996891376e-01 1.09775120226491263689e-06
0.150000 9.99999999999996225242e-01 7.15265686931945452267e-07
0.200000 9.99999999999994781952e-01 -2.40329551538139211237e-06
0.250000 9.99999999999994781952e-01 -5.32157259216273419795e-06
0.300000 9.99999999999995003996e-01 -7.31802515746167166026e-06
0.350000 9.99999999999994781952e-01 -7.87929795293669676015e-06
0.400000 9.99999999999995670130e-01 -6.48472564359732159007e-06
0.450000 9.99999999999995670130e-01 -1.11185541302307360010e-05
0.500000 9.99999999999996558309e-01 -2.12058550674164262456e-05
0.550000 9.99999999999997002398e-01 -2.95359100014975307956e-05
0.600000 9.99999999999996225242e-01 -3.34887979878503133755e-05
0.650000 9.99999999999996891376e-01 -3.12741030430793985921e-05
0.700000 9.99999999999996447286e-01 -3.06097161156803566537e-05
0.750000 9.99999999999996447286e-01 -3.80685154599459148325e-05
0.800000 9.99999999999996114219e-01 -5.03932142684259765184e-05
0.850000 9.99999999999995226041e-01 -5.63517625549476698600e-05
0.900000 9.99999999999994670929e-01 -4.44577560461964987415e-05
0.950000 9.99999999999995781153e-01 -2.74211798331133467087e-05
1.000000 9.99999999999996003197e-01 -1.74623657961158841644e-05
1.050000 9.99999999999996003197e-01 -1.36153210101641419474e-05
1.100000 9.99999999999996447286e-01 -1.47841976224104534247e-05
1.150000 9.99999999999996447286e-01 7.03622942304171147549e-06
1.200000 9.99999999999996447286e-01 5.48493198275588352648e-05
1.250000 9.99999999999995892175e-01 9.00789676153586880720e-05
1.300000 9.99999999999995337063e-01 1.12924864578185985865e-04
1.350000 9.99999999999994115818e-01 1.24857714905179245646e-04
1.400000 9.99999999999995003996e-01 1.34244032244230883030e-04
1.450000 9.99999999999995003996e-01 1.82694138115964855185e-04
1.500000 9.99999999999995892175e-01 2.33307236426875318170e-04
1.550000 9.99999999999995670130e-01 2.39356373419836803654e-04
1.600000 9.99999999999996336264e-01 2.25272380904797958493e-04
1.650000 9.99999999999996558309e-01 1.88795846891234153772e-04
1.700000 9.99999999999996003197e-01 1.59300074818172622375e-04
1.750000 9.99999999999996669331e-01 1.63491904267031517520e-04
1.800000 9.99999999999997113420e-01 1.19598636603765798563e-04
1.850000 9.99999999999997557509e-01 1.40247574665360342518e-05
1.900000 9.99999999999998001599e-01 -1.05319028967018005899e-04
1.950000 9.99999999999998223643e-01 -2.37832084014230626685e-04
2.000000 9.99999999999998112621e-01 -3.34206933804895094890e-04
2.050000 9.99999999999998334665e-01 -4.12163830192010572934e-04
2.100000 9.99999999999998556710e-01 -5.58886341679966846749e-04
2.150000 9.99999999999999666933e-01 -7.23692106470952452313e-04
2.200000 1.00000000000000044409e+00 -8.52856650110408358659e-04
2.250000 1.00000000000000044409e+00 -9.36287590856912932402e-04
2.300000 1.00000000000000155431e+00 -9.33011328020852750975e-04
2.350000 1.00000000000000177636e+00 -9.10382598825202043330e-04
2.400000 1.00000000000000333067e+00 -9.09983800073340103748e-04
2.450000 1.00000000000000288658e+00 -8.37991581838020750152e-04
2.500000 1.00000000000000155431e+00 -6.65187177891185532630e-04
2.550000 1.00000000000000022204e+00 -3.89272652748420225789e-04
2.600000 9.99999999999999333866e-01 -2.28052042842496211091e-05
2.650000 1.00000000000000155431e+00 3.41488774242812691967e-04
2.700000 1.00000000000000133227e+00 7.13800236925518703617e-04
2.750000 1.00000000000000044409e+00 1.16793210895359310733e-03
2.800000 1.00000000000000310862e+00 1.68438444882354227544e-03
2.850000 9.99999999999999333866e-01 2.22153095057445832891e-03
2.900000 9.99999999999999000799e-01 2.70346393632005200722e-03
2.950000 1.00000000000000111022e+00 3.05468029569148534150e-03
3.000000 1.00000000000000066613e+00 3.30687986305453797409e-03
3.050000 9.99999999999999444888e-01 3.48651275725360334373e-03
3.100000 1.00000000000000111022e+00 3.54001573830954249789e-03
3.150000 1.00000000000000310862e+00 3.39184810101124173051e-03
3.200000 1.00000000000000244249e+00 2.97731517311635622905e-03
3.250000 1.00000000000000177636e+00 2.29517241497257003247e-03
3.300000 1.00000000000000222045e+00 1.40499340142760751476e-03
3.350000 1.00000000000000310862e+00 3.44718635168778726914e-04
3.400000 1.00000000000000222045e+00 -9.09387313078722451382e-04
3.450000 1.00000000000000044409e+00 -2.38112818223838902665e-03
3.500000 9.99999999999999444888e-01 -4.01390464121902969252e-03
3.550000 9.99999999999998112621e-01 -5.69983699085574620213e-03
3.600000 9.99999999999996336264e-01 -7.31800688755683027831e-03
3.650000 9.99999999999994226840e-01 -8.76600840096207305219e-03
3.700000 9.99999999999994226840e-01 -1.00120246727377626428e-02
3.750000 9.99999999999995337063e-01 -1.09887712963728251953e-02
3.800000 9.99999999999996225242e-01 -1.15416757776997894874e-02
3.850000 9.99999999999996447286e-01 -1.15471529559649944280e-02
3.900000 9.99999999999995226041e-01 -1.09032808307343020982e-02
3.950000 9.99999999999994892974e-01 -9.55692244991114894792e-03
4.000000 9.99999999999995781153e-01 -7.55107630613419383153e-03
4.050000 9.99999999999995115019e-01 -4.87618186275198730456e-03
4.100000 9.99999999999995003996e-01 -1.50662141556216939986e-03
4.150000 9.99999999999993227640e-01 2.47592483618978452184e-03
4.200000 9.99999999999994337863e-01 6.95902687306679430812e-03
4.250000 9.99999999999995003996e-01 1.17507005246150660061e-02
4.300000 9.99999999999995226041e-01 1.65801824695537350363e-02
4.350000 9.99999999999994781952e-01 2.12499909818723506372e-02
4.400000 9.99999999999994448885e-01 2.55350327488795478259e-02
4.450000 9.99999999999995115019e-01 2.91267930721776750758e-02
4.500000 9.99999999999997335465e-01 3.17478407834545020560e-02
4.550000 9.99999999999996891376e-01 3.30897266420152671995e-02
4.600000 9.99999999999997779554e-01 3.28639410328389336424e-02
4.650000 9.99999999999997557509e-01 3.09304062754671739432e-02
4.700000 9.99999999999998223643e-01 2.71705278288593837788e-02
4.750000 9.99999999999999111822e-01 2.14952423815430171405e-02
4.800000 9.99999999999998778755e-01 1.39534966403149617714e-02
4.850000 9.99999999999998667732e-01 4.64264070387975479048e-03
4.900000 9.99999999999998223643e-01 -6.21616275961346578111e-03
4.950000 9.99999999999998889777e-01 -1.81972234907817054239e-02
5.000000 9.99999999999999333866e-01 -3.08368027754216504632e-02
5.050000 9.99999999999999000799e-01 -4.35973030772664055243e-02
5.100000 9.99999999999999444888e-01 -5.58173380257191709131e-02
5.150000 1.00000000000000022204e+00 -6.68476765917945109363e-02
5.200000 1.00000000000000066613e+00 -7.59649275808824825384e-02
5.250000 1.00000000000000088818e+00 -8.23814728505899152022e-02
5.300000 1.00000000000000088818e+00 -8.54529745281782937560e-02
5.350000 1.00000000000000155431e+00 -8.46226760551018197809e-02
5.400000 1.00000000000000000000e+00 -7.94474956010985111643e-02
5.450000 9.99999999999998778755e-01 -6.97243129488094165458e-02
5.500000 9.99999999999999888978e-01 -5.53770173771869073098e-02
5.550000 9.99999999999999666933e-01 -3.65364028109396513089e-02
5.600000 9.99999999999999888978e-01 -1.36851089864528808332e-02
5.650000 1.00000000000000044409e+00 1.24650433452741325052e-02
5.700000 1.00000000000000066613e+00 4.09546234273281475891e-02
5.750000 1.00000000000000244249e+00 7.05748641615610017297e-02
5.800000 1.00000000000000177636e+00 1.00030772149864055631e-01
5.850000 1.00000000000000244249e+00 1.27879920058822149631e-01
5.900000 1.00000000000000355271e+00 1.52530523071320922579e-01
5.950000 1.00000000000000377476e+00 1.72427803508320071080e-01
6.000000 1.00000000000000310862e+00 1.86090057952269571917e-01
6.050000 1.00000000000000333067e+00 1.92203062079791014982e-01
6.100000 1.00000000000000199840e+00 1.89759387369969639847e-01
6.150000 1.00000000000000177636e+00 1.78004210061570189438e-01
6.200000 1.00000000000000111022e+00 1.56490294979122562813e-01
6.250000 1.00000000000000266454e+00 1.25238078344879710802e-01
6.300000 1.00000000000000244249e+00 8.47486330534266418812e-02
6.350000 1.00000000000000421885e+00 3.60435841631458683820e-02
6.400000 1.00000000000000310862e+00 -1.93173696698471127065e-02
6.450000 1.00000000000000244249e+00 -7.93633493625885005907e-02
6.500000 1.00000000000000310862e+00 -1.41716435971936199900e-01
6.550000 1.00000000000000244249e+00 -2.03553639218264359467e-01
6.600000 1.00000000000000177636e+00 -2.61751970230425512476e-01
6.650000 1.00000000000000244249e+00 -3.13031561243885481094e-01
6.700000 1.00000000000000244249e+00 -3.54129447067388247739e-01
6.750000 1.00000000000000177636e+00 -3.82072171542410021772e-01
6.800000 1.00000000000000244249e+00 -3.94295754448335145081e-01
6.850000 1.00000000000000066613e+00 -3.88759256617117576749e-01
6.900000 1.00000000000000133227e+00 -3.64204602078271266752e-01
6.950000 1.00000000000000333067e+00 -3.20298737872573457963e-01
7.000000 1.00000000000000310862e+00 -2.57721549262250326784e-01
7.050000 1.00000000000000155431e+00 -1.78233065363529674663e-01
7.100000 1.00000000000000244249e+00 -8.45279373748787504761e-02
7.150000 1.00000000000000266454e+00 1.98930826025398646562e-02
7.200000 1.00000000000000133227e+00 1.30774944066324561032e-01
7.250000 1.00000000000000088818e+00 2.43303882649347325007e-01
7.300000 1.00000000000000088818e+00 3.52314730936289288721e-01
7.350000 1.00000000000000199840e+00 4.52499515388346318367e-01
7.400000 1.00000000000000088818e+00 5.38712052166825716704e-01
7.450000 1.00000000000000133227e+00 6.06183490974517180661e-01
7.500000 1.00000000000000111022e+00 6.50669646303110860153e-01
7.550000 1.00000000000000000000e+00 6.68674963297681168584e-01
7.600000 1.00000000000000044409e+00 6.57654752763485839218e-01
7.650000 1.00000000000000133227e+00 6.16158299188256597390e-01
7.700000 1.00000000000000022204e+00 5.43953841234499635426e-01
7.750000 1.00000000000000000000e+00 4.42084071405487999407e-01
7.800000 9.99999999999999777955e-01 3.12864599226367445794e-01
7.850000 1.00000000000000000000e+00 1.59924099855134504988e-01
7.900000 1.00000000000000022204e+00 -1.17314843494324728967e-02
7.950000 1.00000000000000066613e+00 -1.95767298410827822464e-01
8.000000 1.00000000000000044409e+00 -3.84649235231848296568e-01
8.050000 9.99999999999999444888e-01 -5.69809452462329502076e-01
8.100000 9.99999999999998556710e-01 -7.42012242486856932189e-01
8.150000 9.99999999999999444888e-01 -8.91826364865336285170e-01
8.200000 9.99999999999998223643e-01 -1.01014103013684808374e+00
8.250000 9.99999999999998001599e-01 -1.08893104669072626756e+00
8.300000 9.99999999999998889777e-01 -1.12197351002953382704e+00
8.350000 9.99999999999998889777e-01 -1.10532460005782762202e+00
8.400000 9.99999999999996891376e-01 -1.03775133008590092487e+00
8.450000 9.99999999999994004796e-01 -9.20827498204607519661e-01
8.500000 9.99999999999994892974e-01 -7.58727283610791003454e-01
8.550000 9.99999999999996225242e-01 -5.58022533928428821071e-01
8.600000 9.99999999999998223643e-01 -3.27220200481698642037e-01
8.650000 9.99999999999998445688e-01 -7.61943779312741070742e-02
8.700000 9.99999999999997668532e-01 1.84217875751341658708e-01
8.750000 9.99999999999998112621e-01 4.42718642359389846774e-01
8.800000 9.99999999999996336264e-01 6.88014622338812276148e-01
8.850000 9.99999999999997668532e-01 9.09157112676952317010e-01
8.900000 9.99999999999997890576e-01 1.09603666217991513321e+00
8.950000 9.99999999999995448086e-01 1.23984264003374855534e+00
9.000000 9.99999999999995448086e-01 1.33338343467641839979e+00
9.050000 9.99999999999996780353e-01 1.37143552439323457293e+00
9.100000 9.99999999999996225242e-01 1.35092418018885940256e+00
9.150000 9.99999999999995892175e-01 1.27092855057897913262e+00
9.200000 9.99999999999996114219e-01 1.13270884139111327471e+00
9.250000 9.99999999999997446487e-01 9.39619701529873618817e-01
9.300000 9.99999999999997113420e-01 6.97007909597668340318e-01
9.350000 9.99999999999995892175e-01 4.12309810662909836942e-01
9.400000 9.99999999999993338662e-01 9.51341014413465968502e-02
9.450000 9.99999999999993005595e-01 -2.42712170980994457192e-01
9.500000 9.99999999999990674127e-01 -5.87258706745104053226e-01
9.550000 9.99999999999994226840e-01 -9.22821349788978229078e-01
9.600000 9.99999999999993449684e-01 -1.23281713991855390589e+00
9.650000 9.99999999999993671729e-01 -1.50077865079783068225e+00
9.700000 9.99999999999994337863e-01 -1.71169415222812482114e+00
9.750000 9.99999999999996114219e-01 -1.85335123894316478044e+00
9.800000 9.99999999999995115019e-01 -1.91737418025880046457e+00
9.850000 9.99999999999996003197e-01 -1.89996434012670456504e+00
9.900000 9.99999999999996447286e-01 -1.80204752586028149608e+00
9.950000 9.99999999999997557509e-01 -1.62884687575848197127e+00
10.000000 9.99999999999998001599e-01 -1.38923996900911506103e+00
10.050000 9.99999999999994337863e-01 -1.09494602343869029681e+00
10.100000 9.99999999999995448086e-01 -7.59693629592423258501e-01
10.150000 9.99999999999992672528e-01 -3.98528726124278587228e-01
10.200000 9.99999999999993782751e-01 -2.71526388798065537733e-02
10.250000 9.99999999999993449684e-01 3.38704477768393075188e-01
10.300000 9.99999999999992783550e-01 6.83807854378663759753e-01
10.350000 9.99999999999993449684e-01 9.93927034460796887672e-01
10.400000 9.99999999999991451283e-01 1.25640438667180021071e+00
10.450000 9.99999999999993227640e-01 1.46069225429142068862e+00
10.500000 9.99999999999992228439e-01 1.59877863942857167956e+00
10.550000 9.99999999999992672528e-01 1.66549909813134222603e+00
10.600000 9.99999999999991229238e-01 1.65857777172091158668e+00
10.650000 9.99999999999993671729e-01 1.57842610198352817363e+00
10.700000 9.99999999999993893773e-01 1.42799691110434490149e+00
10.750000 9.99999999999993893773e-01 1.21265568130365108956e+00
10.800000 9.99999999999993227640e-01 9.40056348206688374702e-01
10.850000 9.99999999999993449684e-01 6.20225252831963724809e-01
10.900000 9.99999999999994559907e-01 2.65542045051659625354e-01
10.950000 9.99999999999991673327e-01 -1.09570711953095159541e-01
11.000000 9.99999999999988564703e-01 -4.88977711902969014446e-01
11.050000 9.99999999999989008792e-01 -8.55504831862245795904e-01
11.100000 9.99999999999988897770e-01 -1.19203826713948113358e+00
11.150000 9.99999999999988342658e-01 -1.48255418003844763319e+00
11.200000 9.99999999999989230837e-01 -1.71329930019211240655e+00
11.250000 9.99999999999988897770e-01 -1.87395164062422492357e+00
11.300000 9.99999999999988786747e-01 -1.95812901818521734043e+00
11.350000 9.99999999999988564703e-01 -1.96362998278694655951e+00
11.400000 9.99999999999988009591e-01 -1.89242149609168874846e+00
11.450000 9.99999999999988453681e-01 -1.75007469849802799189e+00
11.500000 9.99999999999986788346e-01 -1.54521248841292324627e+00
11.550000 9.99999999999987676524e-01 -1.28894340202644830384e+00
11.600000 9.99999999999987232435e-01 -9.94039512610220166167e-01
11.650000 9.99999999999988120614e-01 -6.74314515281036586103e-01
11.700000 9.99999999999988120614e-01 -3.44098566612928480346e-01
11.750000 9.99999999999986788346e-01 -1.75783494540599598277e-02
11.800000 9.99999999999987676524e-01 2.91721353221429113844e-01
11.850000 9.99999999999988342658e-01 5.71423673047477542752e-01
11.900000 9.99999999999988120614e-01 8.10863328245381098647e-01
11.950000 9.99999999999988564703e-01 1.00147241863559099961e+00
12.000000 9.99999999999991673327e-01 1.13698897085956440733e+00
12.050000 9.99999999999992339461e-01 1.21361306406538771441e+00
12.100000 9.99999999999993893773e-01 1.23003035892995193912e+00
12.150000 9.99999999999992561506e-01 1.18730361187473443252e+00
12.200000 9.99999999999991895372e-01 1.08879745830950236396e+00
12.250000 9.99999999999990230037e-01 9.40052589952572570375e-01
12.300000 9.99999999999992006394e-01 7.48479317072691330281e-01
12.350000 9.99999999999994226840e-01 5.23103770056537409339e-01
12.400000 9.99999999999993449684e-01 2.74306940147396871588e-01
12.450000 9.99999999999993338662e-01 1.33328559037930571146e-02
12.500000 9.99999999999994226840e-01 -2.48146866635330476392e-01
12.550000 9.99999999999994670929e-01 -4.98533043294033806347e-01
12.600000 9.99999999999996003197e-01 -7.27084227071716715507e-01
12.650000 9.99999999999996669331e-01 -9.24449689672455221512e-01
12.700000 9.99999999999996336264e-01 -1.08303554538356427983e+00
12.750000 9.99999999999997002398e-01 -1.19748505959044249103e+00
12.800000 9.99999999999997224442e-01 -1.26475949307078217032e+00
12.850000 9.99999999999997002398e-01 -1.28408372453451624651e+00
12.900000 9.99999999999995892175e-01 -1.25706945984632345592e+00
12.950000 9.99999999999994337863e-01 -1.18740717169251142060e+00
13.000000 9.99999999999995226041e-01 -1.08043003000783355283e+00
13.050000 9.99999999999994115818e-01 -9.42908199649546974186e-01
13.100000 9.99999999999993116617e-01 -7.82529210669654640142e-01
13.150000 9.99999999999991895372e-01 -6.07407311101279212551e-01
13.200000 9.99999999999992339461e-01 -4.25911104045724742129e-01
13.250000 9.99999999999991562305e-01 -2.46199289325884557167e-01
13.300000 9.99999999999991007194e-01 -7.57646493333924558877e-02
13.350000 9.99999999999989674926e-01 7.87027011925476305265e-02
13.400000 9.99999999999990341060e-01 2.11645979488536778446e-01
13.450000 9.99999999999989008792e-01 3.18883596736910135405e-01
13.500000 9.99999999999988453681e-01 3.97522014716429339387e-01
13.550000 9.99999999999989341859e-01 4.46060370518249538208e-01
13.600000 9.99999999999989563904e-01 4.64450274482639258178e-01
13.650000 9.99999999999989785948e-01 4.53888693903633122506e-01
13.700000 9.99999999999989230837e-01 4.16766836883851521378e-01
13.750000 9.99999999999989119814e-01 3.56554246898384052944e-01
13.800000 9.99999999999989119814e-01 2.77474491891543828537e-01
13.850000 9.99999999999989563904e-01 1.84336700573728085040e-01
13.900000 9.99999999999990007993e-01 8.23214124931917756722e-02
13.950000 9.99999999999988786747e-01 -2.33593573275666759048e-02
14.000000 9.99999999999988675725e-01 -1.27650085495628423660e-01
14.050000 9.99999999999988564703e-01 -2.25877848394871905136e-01
14.100000 9.99999999999988009591e-01 -3.14016669927306701915e-01
14.150000 9.99999999999989119814e-01 -3.88793555440488547426e-01
14.200000 9.99999999999988564703e-01 -4.47823604267646557808e-01
14.250000 9.99999999999989008792e-01 -4.89705669302114954267e-01
14.300000 9.99999999999989674926e-01 -5.13968676130775570243e-01
14.350000 9.99999999999989452881e-01 -5.21050791969933202452e-01
14.400000 9.99999999999991007194e-01 -5.12206446861777964230e-01
14.450000 9.99999999999990119015e-01 -4.89326318040357310934e-01
14.500000 9.99999999999990119015e-01 -4.54831217774985807623e-01
14.550000 9.99999999999990563104e-01 -4.11502383567800444908e-01
14.600000 9.99999999999989452881e-01 -3.62281706402039271886e-01
14.650000 9.99999999999991007194e-01 -3.10130708139144894986e-01
14.700000 9.99999999999991229238e-01 -2.57840402159405623905e-01
14.750000 9.99999999999991229238e-01 -2.07889764782926866893e-01
14.800000 9.99999999999992117417e-01 -1.62367273307246873237e-01
14.850000 9.99999999999991007194e-01 -1.22893125140090514469e-01
14.900000 9.99999999999991451283e-01 -9.06110736027329888298e-02
14.950000 9.99999999999991895372e-01 -6.61497834857193017788e-02
15.000000 9.99999999999993227640e-01 -4.96003403439812598497e-02
15.050000 9.99999999999992894573e-01 -4.06076625602258475811e-02
15.100000 9.99999999999992561506e-01 -3.83841599957401719001e-02
15.150000 9.99999999999991451283e-01 -4.18212296906362163140e-02
15.200000 9.99999999999992339461e-01 -4.96585177906228511513e-02
15.250000 9.99999999999991007194e-01 -6.04700743162688361676e-02
15.300000 9.99999999999991895372e-01 -7.27725533444956995677e-02
15.350000 9.99999999999989896970e-01 -8.51862984690554686518e-02
15.400000 9.99999999999987787547e-01 -9.64168018976137852771e-02
15.450000 9.99999999999987787547e-01 -1.05401436419173488712e-01
15.500000 9.99999999999985900168e-01 -1.11442563409777956052e-01
15.550000 9.99999999999985789145e-01 -1.14088168758409658210e-01
15.600000 9.99999999999986455279e-01 -1.13200863896391668018e-01
15.650000 9.99999999999985234034e-01 -1.09016393414497370085e-01
15.700000 9.99999999999985123011e-01 -1.01983671013963828056e-01
15.750000 9.99999999999985123011e-01 -9.28216884938179997988e-02
15.800000 9.99999999999985345056e-01 -8.25088094781604997063e-02
15.850000 9.99999999999984900967e-01 -7.20445398772011358357e-02
15.900000 9.99999999999984900967e-01 -6.24809291283326684319e-02
15.950000 9.99999999999986455279e-01 -5.48719074116861965651e-02
16.000000 9.99999999999987343458e-01 -5.00678114406831811789e-02
16.050000 9.99999999999987565502e-01 -4.87703141722032190719e-02
16.100000 9.99999999999988897770e-01 -5.14899048270059528365e-02
16.150000 9.99999999999989341859e-01 -5.83727530123247032035e-02
16.200000 9.99999999999988897770e-01 -6.93125486746619112743e-02
16.250000 9.99999999999988897770e-01 -8.39575025516966916284e-02
16.300000 9.99999999999989341859e-01 -1.01598319736109735101e-01
16.350000 9.99999999999989230837e-01 -1.21337466071860217154e-01
16.400000 9.99999999999989230837e-01 -1.42108033883330542313e-01
16.450000 9.99999999999990119015e-01 -1.62642634090266691160e-01
16.500000 9.99999999999990785149e-01 -1.81689918941496775240e-01
16.550000 9.99999999999991895372e-01 -1.98035083166342162908e-01
16.600000 9.99999999999990785149e-01 -2.10489096569236977530e-01
16.650000 9.99999999999991229238e-01 -2.18083467639695938178e-01
16.700000 9.99999999999991673327e-01 -2.20050994820941314689e-01
16.750000 9.99999999999991673327e-01 -2.15855300921133835823e-01
16.800000 9.99999999999990785149e-01 -2.05354555173195119089e-01
16.850000 9.99999999999991451283e-01 -1.88703154357526825535e-01
16.900000 9.99999999999991451283e-01 -1.66369949426815877391e-01
16.950000 9.99999999999992339461e-01 -1.39186830202949501922e-01
17.000000 9.99999999999991451283e-01 -1.08205327863893918661e-01
17.050000 9.99999999999991340260e-01 -7.47574099951221204829e-02
17.100000 9.99999999999991118216e-01 -4.03703173672291804053e-02
17.150000 9.99999999999989341859e-01 -6.62427624622525558495e-03
17.200000 9.99999999999990007993e-01 2.48179759299941987694e-02
17.250000 9.99999999999990230037e-01 5.23839892072936949563e-02
17.300000 9.99999999999992006394e-01 7.46774222605984389078e-02
17.350000 9.99999999999991118216e-01 9.04604406704520302984e-02
17.400000 9.99999999999991562305e-01 9.88020462765221291201e-02
17.450000 9.99999999999991562305e-01 9.91509017094049788232e-02
17.500000 9.99999999999992006394e-01 9.12542768075798454985e-02
17.550000 9.99999999999991229238e-01 7.52957804099129296427e-02
17.600000 9.99999999999991229238e-01 5.18793370266000669622e-02
17.650000 9.99999999999991229238e-01 2.19199597954872135719e-02
17.700000 9.99999999999991451283e-01 -1.33062042211855025009e-02
17.750000 9.99999999999991451283e-01 -5.21980355497477718774e-02
17.800000 9.99999999999993449684e-01 -9.30728781467785870607e-02
17.850000 9.99999999999993671729e-01 -1.34062848850441951321e-01
17.900000 9.99999999999992450483e-01 -1.73231583462467780832e-01
17.950000 9.99999999999993116617e-01 -2.08791684922147224857e-01
18.000000 9.99999999999992450483e-01 -2.39034014890677826148e-01
18.050000 9.99999999999993116617e-01 -2.62470857119610379016e-01
18.100000 9.99999999999993782751e-01 -2.78016026150590178645e-01
18.150000 9.99999999999994892974e-01 -2.84847059479812481086e-01
18.200000 9.99999999999993893773e-01 -2.82547744514649756820e-01
18.250000 9.99999999999994115818e-01 -2.71182831652013900392e-01
18.300000 9.99999999999994115818e-01 -2.51142121164906695352e-01
18.350000 9.99999999999993005595e-01 -2.23266336301792156505e-01
18.400000 9.99999999999991340260e-01 -1.88828806484455130610e-01
18.450000 9.99999999999990007993e-01 -1.49289205928441554017e-01
18.500000 9.99999999999990452082e-01 -1.06409961516726075947e-01
18.550000 9.99999999999989785948e-01 -6.21697139638432635933e-02
18.600000 9.99999999999988897770e-01 -1.84908535928101427914e-02
18.650000 9.99999999999988231636e-01 2.26069883826464056165e-02
18.700000 9.99999999999989563904e-01 5.92111676167307587892e-02
18.750000 9.99999999999989563904e-01 8.97269429237309013025e-02
18.800000 9.99999999999989563904e-01 1.12754014329799451266e-01
18.850000 9.99999999999990674127e-01 1.27187188425643304956e-01
18.900000 9.99999999999989563904e-01 1.32427018447922872912e-01
18.950000 9.99999999999990896171e-01 1.28226038230817740438e-01
19.000000 9.99999999999991784350e-01 1.14758796740178192763e-01
19.050000 9.99999999999992450483e-01 9.27387441433730475016e-02
19.100000 9.99999999999992117417e-01 6.31890533105070040243e-02
19.150000 9.99999999999993227640e-01 2.74500930122541682288e-02
19.200000 9.99999999999993449684e-01 -1.27442493641415320604e-02
19.250000 9.99999999999993671729e-01 -5.55694362110056988557e-02
19.300000 9.99999999999993671729e-01 -9.90112166373863511470e-02
19.350000 9.99999999999993893773e-01 -1.40965290276971411121e-01
19.400000 9.99999999999995003996e-01 -1.79573940602496012753e-01
19.450000 9.99999999999993893773e-01 -2.13050004698763867372e-01
19.500000 9.99999999999994781952e-01 -2.39742953188919249996e-01
19.550000 9.99999999999993893773e-01 -2.58590615122801570358e-01
19.600000 9.99999999999993449684e-01 -2.68628257104055967464e-01
19.650000 9.99999999999992894573e-01 -2.69303573933829643039e-01
19.700000 9.99999999999993560706e-01 -2.60809233467878598400e-01
19.750000 9.99999999999994670929e-01 -2.43405023976204004654e-01
19.800000 9.99999999999995781153e-01 -2.17825791329625095827e-01
19.850000 9.99999999999995559108e-01 -1.85425890564705181385e-01
19.900000 9.99999999999995781153e-01 -1.47469539262691129444e-01
19.950000 9.99999999999996003197e-01 -1.05633212556738700916e-01
20.000000 9.99999999999994892974e-01 -6.20083506700388059629e-02
