# tag norm j_0
4.000000 1.00000000000000710543e+00 5.89698845439106029455e-04
4.000000 1.00000000000000710543e+00 3.33580226831923240885e-04
4.000000 1.00000000000000710543e+00 5.62176056811607995599e-04
4.000000 1.00000000000000710543e+00 3.45970300873083577795e-04
4.000000 1.00000000000000710543e+00 5.55051046612049488529e-04
4.000000 1.00000000000000710543e+00 3.58908046063643689817e-04
4.000000 1.00000000000000710543e+00 5.45795986880915923872e-04
4.000000 1.00000000000000710543e+00 3.55651006536009974251e-04
4.000000 1.00000000000000710543e+00 5.19551984425705814900e-04
4.000000 1.00000000000000710543e+00 3.53717070238966798355e-04
4.000000 1.00000000000000710543e+00 5.21780264417491274759e-04
4.000000 1.00000000000000710543e+00 3.54285938527237236409e-04
4.000000 1.00000000000000710543e+00 5.39049773640581713838e-04
4.000000 1.00000000000000710543e+00 3.51859827807330489361e-04
4.000000 1.00000000000000710543e+00 5.48734095663414738787e-04
4.000000 1.00000000000000710543e+00 3.42008328317622962121e-04
4.000000 1.00000000000000710543e+00 5.58013140931768857750e-04
4.000000 1.00000000000000710543e+00 3.25379314270945031815e-04
4.000000 1.00000000000000710543e+00 5.76333941454048453990e-04
