# tag norm j_0
2.000000 1.00000000000000732747e+00 -6.48309449752723496911e-05
2.000000 1.00000000000000732747e+00 -5.15958521132322051246e-05
2.000000 1.00000000000000732747e+00 -7.07640473015964797292e-05
2.000000 1.00000000000000732747e+00 -4.60417407118001454085e-05
2.000000 1.00000000000000732747e+00 -7.21086481970776861086e-05
2.000000 1.00000000000000732747e+00 -4.59711956889202454112e-05
2.000000 1.00000000000000732747e+00 -7.08072746253082677473e-05
2.000000 1.00000000000000732747e+00 -5.13750524659771552901e-05
2.000000 1.00000000000000732747e+00 -6.48120633332527069492e-05
