# tag norm j_0
10.200000 1.00000000000002353673e+00 -7.34307929134070808130e-02
10.200000 1.00000000000002353673e+00 -3.68381264651661335940e-02
10.200000 1.00000000000002353673e+00 5.39679176587148784483e-02
10.200000 1.00000000000002353673e+00 2.64361933272054747124e-02
10.200000 1.00000000000002353673e+00 -1.52035161390710743534e-02
10.200000 1.00000000000002353673e+00 1.29238967588347838933e-02
10.200000 1.00000000000002353673e+00 1.36541660025980421400e-02
10.200000 1.00000000000002353673e+00 1.59353643804428304898e-02
10.200000 1.00000000000002353673e+00 5.07163098827987691986e-03
10.200000 1.00000000000002353673e+00 1.59066728605122380269e-02
10.200000 1.00000000000002353673e+00 4.86087761441046910943e-03
10.200000 1.00000000000002353673e+00 1.55767452007322584201e-02
10.200000 1.00000000000002353673e+00 1.29410042350110634363e-02
10.200000 1.00000000000002353673e+00 1.24747744818926795118e-02
10.200000 1.00000000000002353673e+00 -1.64462358308627501491e-02
10.200000 1.00000000000002353673e+00 2.50952491821241525927e-02
10.200000 1.00000000000002353673e+00 5.29743940868358034746e-02
10.200000 1.00000000000002353673e+00 -3.75669885464221114946e-02
10.200000 1.00000000000002353673e+00 -7.98211330778667710328e-02
