# tag norm j_0
21.600000 1.00000000000002886580e+00 1.56838290442298279592e-03
21.600000 1.00000000000002886580e+00 1.27991720724321585145e-03
21.600000 1.00000000000002886580e+00 -6.69135214180401234618e-04
21.600000 1.00000000000002886580e+00 8.74468166941167043479e-04
21.600000 1.00000000000002886580e+00 -6.06860818468758886519e-04
21.600000 1.00000000000002886580e+00 8.40925233120607307398e-04
21.600000 1.00000000000002886580e+00 -6.65446772625617440425e-04
21.600000 1.00000000000002886580e+00 8.44077073209206427129e-04
21.600000 1.00000000000002886580e+00 -6.31887162806922270814e-04
21.600000 1.00000000000002886580e+00 8.36743887292809248625e-04
21.600000 1.00000000000002886580e+00 -6.23467437747440345920e-04
21.600000 1.00000000000002886580e+00 8.45575214720313680580e-04
21.600000 1.00000000000002886580e+00 -6.35865492330516413749e-04
21.600000 1.00000000000002886580e+00 8.29392164748952846233e-04
21.600000 1.00000000000002886580e+00 -5.61778818768989864074e-04
21.600000 1.00000000000002886580e+00 8.36294737431502702325e-04
21.600000 1.00000000000002886580e+00 -6.05821754753675884367e-04
21.600000 1.00000000000002886580e+00 1.22201935259277525911e-03
21.600000 1.00000000000002886580e+00 1.61780779209194343696e-03
