# tag norm j_0
24.600000 9.99999999999998223643e-01 -1.62493812464273888546e-05
24.600000 9.99999999999998223643e-01 1.14246809380794764213e-05
24.600000 9.99999999999998223643e-01 -3.03696205888384765164e-05
24.600000 9.99999999999998223643e-01 -4.18456345428243727327e-04
24.600000 9.99999999999998223643e-01 -1.20529204318044463190e-03
24.600000 9.99999999999998223643e-01 -4.40085631333306216088e-04
24.600000 9.99999999999998223643e-01 -4.21362050869826521276e-05
24.600000 9.99999999999998223643e-01 -4.82213847855216552258e-06
24.600000 9.99999999999998223643e-01 -2.88242298510690290114e-05
