# tag norm j_0
8.500000 1.00000000000002398082e+00 -1.37161498106912221884e-01
8.500000 1.00000000000002398082e+00 -2.47566777776986532422e-02
8.500000 1.00000000000002398082e+00 -2.65141509926963073185e-02
8.500000 1.00000000000002398082e+00 -1.45115954824265366158e-02
8.500000 1.00000000000002398082e+00 -5.03972336342368085194e-02
8.500000 1.00000000000002398082e+00 -1.47979212589233674602e-02
8.500000 1.00000000000002398082e+00 -4.22734827926534578735e-02
8.500000 1.00000000000002398082e+00 -1.53437605716709116882e-02
8.500000 1.00000000000002398082e+00 -4.33790390323135557904e-02
8.500000 1.00000000000002398082e+00 -1.53080400991288251289e-02
8.500000 1.00000000000002398082e+00 -4.35038240700775860614e-02
8.500000 1.00000000000002398082e+00 -1.54351112841123652014e-02
8.500000 1.00000000000002398082e+00 -4.26814741078332740565e-02
8.500000 1.00000000000002398082e+00 -1.49218712722112012425e-02
8.500000 1.00000000000002398082e+00 -5.10099074753373737945e-02
8.500000 1.00000000000002398082e+00 -1.48925095468833666723e-02
8.500000 1.00000000000002398082e+00 -2.75458637388880621388e-02
8.500000 1.00000000000002398082e+00 -2.43744839509979008274e-02
8.500000 1.00000000000002398082e+00 -1.39379799740371235206e-01
