# tag norm j_0
3.900000 1.00000000000000066613e+00 -1.63403888205139089483e-03
3.900000 1.00000000000000066613e+00 -2.05754691246484580983e-04
3.900000 1.00000000000000066613e+00 -7.52946958249287858975e-04
3.900000 1.00000000000000066613e+00 -1.94133238845471374837e-04
3.900000 1.00000000000000066613e+00 -7.53268309871934723700e-04
3.900000 1.00000000000000066613e+00 -2.03243005080453560066e-04
3.900000 1.00000000000000066613e+00 -7.09178607972159465687e-04
3.900000 1.00000000000000066613e+00 -1.97744563980897515272e-04
3.900000 1.00000000000000066613e+00 -7.04357143016835860611e-04
3.900000 1.00000000000000066613e+00 -1.99514040701863240405e-04
3.900000 1.00000000000000066613e+00 -7.04716360019163766057e-04
3.900000 1.00000000000000066613e+00 -1.97809283157827225930e-04
3.900000 1.00000000000000066613e+00 -7.09756488246414299174e-04
3.900000 1.00000000000000066613e+00 -2.05639936387444119924e-04
3.900000 1.00000000000000066613e+00 -7.55209235270455961873e-04
3.900000 1.00000000000000066613e+00 -1.97129658917454550840e-04
3.900000 1.00000000000000066613e+00 -7.56790017996605206101e-04
3.900000 1.00000000000000066613e+00 -2.03456218868624069034e-04
3.900000 1.00000000000000066613e+00 -1.63880428778239817071e-03
