# tag norm BO
1 1.00000000000000244249e+00 -1.21329793546622710654e-01
2 9.99999999999999333866e-01 -2.55607662448093242435e-02
3 1.00000000000000044409e+00 -4.06413445832391473367e-02
4 1.00000000000000199840e+00 -1.92813805481513111939e-01
5 1.00000000000000088818e+00 1.81774275085418934861e-01
6 1.00000000000000177636e+00 4.00637730731130126127e-01
7 1.00000000000000111022e+00 4.31236869085620533326e-01
8 1.00000000000000044409e+00 4.35374823114483278097e-01
9 1.00000000000000044409e+00 4.35088412718550365810e-01
10 1.00000000000000022204e+00 4.34896461974520698313e-01
11 9.99999999999999333866e-01 4.34874413757844524575e-01
12 9.99999999999998223643e-01 4.34873016348881702431e-01
