# tag norm j_0
26.600000 1.00000000000003574918e+00 1.75330853367419801231e-03
26.600000 1.00000000000003574918e+00 8.95691417642884577313e-04
26.600000 1.00000000000003574918e+00 -9.12997171423528746737e-05
26.600000 1.00000000000003574918e+00 3.55941529979583628617e-04
26.600000 1.00000000000003574918e+00 7.96138143431950479892e-05
26.600000 1.00000000000003574918e+00 3.58862388008676885635e-04
26.600000 1.00000000000003574918e+00 2.51254823217494894453e-05
26.600000 1.00000000000003574918e+00 3.56865004387762986202e-04
26.600000 1.00000000000003574918e+00 7.20063756207050463488e-05
26.600000 1.00000000000003574918e+00 3.39498918288968338196e-04
26.600000 1.00000000000003574918e+00 7.66980034650107387380e-05
26.600000 1.00000000000003574918e+00 3.55720323179033897677e-04
26.600000 1.00000000000003574918e+00 4.76130926910126747406e-05
26.600000 1.00000000000003574918e+00 3.49881365738961543164e-04
26.600000 1.00000000000003574918e+00 1.17511316723301198007e-04
26.600000 1.00000000000003574918e+00 3.15648046590185672733e-04
26.600000 1.00000000000003574918e+00 -3.24580708094408302796e-05
26.600000 1.00000000000003574918e+00 8.27369801055926126776e-04
26.600000 1.00000000000003574918e+00 1.74031199007988594298e-03
