# tag norm j_0
16.300000 1.00000000000003619327e+00 -4.26314117995012697906e-04
16.300000 1.00000000000003619327e+00 7.58589313540727802057e-05
16.300000 1.00000000000003619327e+00 2.41927631797135783785e-04
16.300000 1.00000000000003619327e+00 6.40591902393467953246e-05
16.300000 1.00000000000003619327e+00 -2.09811415797553412008e-04
16.300000 1.00000000000003619327e+00 7.06850783976858905487e-05
16.300000 1.00000000000003619327e+00 2.55241619919931866673e-04
16.300000 1.00000000000003619327e+00 1.08724749846643108900e-04
16.300000 1.00000000000003619327e+00 -3.94167450528307974564e-04
