# tag norm j_0
24.100000 1.00000000000002997602e+00 1.84488038317271851180e-03
24.100000 1.00000000000002997602e+00 1.09867942670209875998e-03
24.100000 1.00000000000002997602e+00 -3.52711375038125194131e-04
24.100000 1.00000000000002997602e+00 6.02903222765222945694e-04
24.100000 1.00000000000002997602e+00 -2.52629838927832079624e-04
24.100000 1.00000000000002997602e+00 5.85188642326982234008e-04
24.100000 1.00000000000002997602e+00 -3.17522067104362797334e-04
24.100000 1.00000000000002997602e+00 5.87211405645951534105e-04
24.100000 1.00000000000002997602e+00 -2.73547490363467186384e-04
24.100000 1.00000000000002997602e+00 5.75736491245468651884e-04
24.100000 1.00000000000002997602e+00 -2.66940734135976309900e-04
24.100000 1.00000000000002997602e+00 5.87837514685065091677e-04
24.100000 1.00000000000002997602e+00 -2.91695499544849948595e-04
24.100000 1.00000000000002997602e+00 5.75293773222030507299e-04
24.100000 1.00000000000002997602e+00 -2.11428354018288583958e-04
24.100000 1.00000000000002997602e+00 5.63600427813430336285e-04
24.100000 1.00000000000002997602e+00 -2.91724669909239505122e-04
24.100000 1.00000000000002997602e+00 1.03520923109449948171e-03
24.100000 1.00000000000002997602e+00 1.86333372903800574896e-03
