# tag norm j_0
6.600000 1.00000000000001221245e+00 -1.24559277867557008368e-02
6.600000 1.00000000000001221245e+00 -1.33114484060420385642e-02
6.600000 1.00000000000001221245e+00 -1.22338041302382429659e-02
6.600000 1.00000000000001221245e+00 -1.33770516814629494839e-02
6.600000 1.00000000000001221245e+00 -1.22803332877935190981e-02
6.600000 1.00000000000001221245e+00 -1.34301510113272702662e-02
6.600000 1.00000000000001221245e+00 -1.23375011300490434324e-02
6.600000 1.00000000000001221245e+00 -1.34812108036556788787e-02
6.600000 1.00000000000001221245e+00 -1.23930492583353198816e-02
6.600000 1.00000000000001221245e+00 -1.35333601718914189882e-02
6.600000 1.00000000000001221245e+00 -1.24472380015379184559e-02
6.600000 1.00000000000001221245e+00 -1.35856130957168769885e-02
6.600000 1.00000000000001221245e+00 -1.25012512900104181407e-02
6.600000 1.00000000000001221245e+00 -1.36380244588441383591e-02
6.600000 1.00000000000001221245e+00 -1.25515085600745451844e-02
6.600000 1.00000000000001221245e+00 -1.36892647151641740078e-02
6.600000 1.00000000000001221245e+00 -1.26091476311920303033e-02
6.600000 1.00000000000001221245e+00 -1.37280419341238336950e-02
6.600000 1.00000000000001221245e+00 -1.29516110229408992066e-02
