# tag norm j_0
21.300000 1.00000000000002442491e+00 1.32277228767630570389e-02
21.300000 1.00000000000002442491e+00 -1.34282405707008157397e-02
21.300000 1.00000000000002442491e+00 -4.07839844798749615040e-02
21.300000 1.00000000000002442491e+00 -1.86180653916280976212e-02
21.300000 1.00000000000002442491e+00 1.91901275969954647482e-02
21.300000 1.00000000000002442491e+00 1.33761624500774393282e-03
21.300000 1.00000000000002442491e+00 -4.97710547163534508530e-02
21.300000 1.00000000000002442491e+00 2.62852041983150166993e-02
21.300000 1.00000000000002442491e+00 -2.27887882272317897348e-02
21.300000 1.00000000000002442491e+00 3.37764614549682443134e-02
21.300000 1.00000000000002442491e+00 -2.29906920346531519483e-02
21.300000 1.00000000000002442491e+00 2.61357480256502461291e-02
21.300000 1.00000000000002442491e+00 -4.95143034655060668148e-02
21.300000 1.00000000000002442491e+00 6.73682473291613466426e-04
21.300000 1.00000000000002442491e+00 1.97226400900276481465e-02
21.300000 1.00000000000002442491e+00 -1.85188194413229770263e-02
21.300000 1.00000000000002442491e+00 -4.10070606358247172207e-02
21.300000 1.00000000000002442491e+00 -1.37377708731972001527e-02
21.300000 1.00000000000002442491e+00 1.43339179720870252971e-02
