# tag norm j_0
5.200000 1.00000000000001265654e+00 -1.36104229538466358490e-03
5.200000 1.00000000000001265654e+00 -1.38714988924572529654e-03
5.200000 1.00000000000001265654e+00 -1.36313091324790692550e-03
5.200000 1.00000000000001265654e+00 -1.40376870552792873056e-03
5.200000 1.00000000000001265654e+00 -1.38846749764179148989e-03
5.200000 1.00000000000001265654e+00 -1.42334712940110109936e-03
5.200000 1.00000000000001265654e+00 -1.40519853069566240909e-03
5.200000 1.00000000000001265654e+00 -1.43979191066182302117e-03
5.200000 1.00000000000001265654e+00 -1.42188177132608964404e-03
5.200000 1.00000000000001265654e+00 -1.45597036256254314633e-03
5.200000 1.00000000000001265654e+00 -1.43855816696659760331e-03
5.200000 1.00000000000001265654e+00 -1.47235360573084225061e-03
5.200000 1.00000000000001265654e+00 -1.45484077186463188480e-03
5.200000 1.00000000000001265654e+00 -1.48932553147352176974e-03
5.200000 1.00000000000001265654e+00 -1.47084668706513790187e-03
5.200000 1.00000000000001265654e+00 -1.50464185560377872002e-03
5.200000 1.00000000000001265654e+00 -1.47810518596979442556e-03
5.200000 1.00000000000001265654e+00 -1.52083179663734966922e-03
5.200000 1.00000000000001265654e+00 -1.51304820985059319295e-03
