# tag norm j_0
20.300000 1.00000000000001554312e+00 -5.96648439598117530380e-02
20.300000 1.00000000000001554312e+00 -7.10717633475386849351e-03
20.300000 1.00000000000001554312e+00 3.03113600178818685948e-02
20.300000 1.00000000000001554312e+00 7.18809989496034668077e-02
20.300000 1.00000000000001554312e+00 -2.42368101676305791603e-01
20.300000 1.00000000000001554312e+00 7.25552226622153267899e-02
20.300000 1.00000000000001554312e+00 2.99366709941167839781e-02
20.300000 1.00000000000001554312e+00 -7.84818004812772897216e-03
20.300000 1.00000000000001554312e+00 -5.90529065647313403109e-02
