# tag norm BO
0.100000 1.00000000000000000000e+00 2.86317205087139814434e-01
0.200000 1.00000000000000044409e+00 2.86317344037476995133e-01
0.300000 1.00000000000000111022e+00 2.86317489095877342198e-01
0.400000 9.99999999999999111822e-01 2.86317587577174792468e-01
0.500000 9.99999999999999333866e-01 2.86317895376736075708e-01
0.600000 1.00000000000000199840e+00 2.86317748902497004604e-01
0.700000 1.00000000000000266454e+00 2.86317640515322491268e-01
0.800000 1.00000000000000244249e+00 2.86317329186873581470e-01
0.900000 1.00000000000000288658e+00 2.86315854197150831961e-01
1.000000 1.00000000000000732747e+00 2.86315058956237933341e-01
1.100000 1.00000000000000310862e+00 2.86314077854408932655e-01
1.200000 1.00000000000000155431e+00 2.86312156922733873632e-01
1.300000 1.00000000000000377476e+00 2.86312572453905678227e-01
1.400000 1.00000000000000421885e+00 2.86313240193086904206e-01
1.500000 1.00000000000000488498e+00 2.86314695178691624999e-01
1.600000 1.00000000000000421885e+00 2.86319346587492085110e-01
1.700000 1.00000000000000000000e+00 2.86323272744931967004e-01
1.800000 9.99999999999999777955e-01 2.86329307721879089410e-01
1.900000 1.00000000000000111022e+00 2.86335054929113097533e-01
2.000000 1.00000000000000399680e+00 2.86336080793609004669e-01
2.100000 1.00000000000000444089e+00 2.86337558180658147133e-01
2.200000 1.00000000000000421885e+00 2.86331351690029600743e-01
2.300000 1.00000000000000488498e+00 2.86317004161236010606e-01
2.400000 1.00000000000000754952e+00 2.86302320365354745491e-01
2.500000 1.00000000000000421885e+00 2.86279527270783096249e-01
2.600000 1.00000000000000310862e+00 2.86256840200662110441e-01
2.700000 1.00000000000000288658e+00 2.86244112786197157927e-01
2.800000 1.00000000000000044409e+00 2.86239606224942766399e-01
2.900000 1.00000000000000022204e+00 2.86255607577687087861e-01
3.000000 9.99999999999996669331e-01 2.86295189658100857066e-01
3.100000 9.99999999999994892974e-01 2.86354914882097300044e-01
3.200000 9.99999999999995337063e-01 2.86433959690262973652e-01
3.300000 9.99999999999995337063e-01 2.86514719128383943403e-01
3.400000 9.99999999999994004796e-01 2.86580893960444615942e-01
3.500000 9.99999999999994448885e-01 2.86612843659896421311e-01
3.600000 9.99999999999996003197e-01 2.86583318122689501006e-01
3.700000 1.00000000000000133227e+00 2.86483313688086271842e-01
3.800000 1.00000000000000199840e+00 2.86309794891113078563e-01
3.900000 9.99999999999998445688e-01 2.86073265133910237257e-01
4.000000 9.99999999999996558309e-01 2.85814101169213519160e-01
4.100000 9.99999999999999666933e-01 2.85582319050140753802e-01
4.200000 1.00000000000000066613e+00 2.85439478548272174141e-01
4.300000 1.00000000000000000000e+00 2.85453490062305914599e-01
4.400000 1.00000000000000155431e+00 2.85670994664279198627e-01
4.500000 1.00000000000000177636e+00 2.86106646109872519990e-01
4.600000 1.00000000000000022204e+00 2.86731355728312542475e-01
4.700000 1.00000000000000000000e+00 2.87456195533145830723e-01
4.800000 1.00000000000000244249e+00 2.88140809563938615767e-01
4.900000 9.99999999999999555911e-01 2.88616859622314370082e-01
5.000000 1.00000000000000222045e+00 2.88710896821729456896e-01
5.100000 1.00000000000000155431e+00 2.88294495230830172261e-01
5.200000 1.00000000000000155431e+00 2.87325430855112418094e-01
5.300000 1.00000000000000222045e+00 2.85861427137553858469e-01
5.400000 9.99999999999998223643e-01 2.84087750510266967563e-01
5.500000 9.99999999999998445688e-01 2.82300853496605719251e-01
5.600000 1.00000000000000199840e+00 2.80865813414795384428e-01
5.700000 1.00000000000000000000e+00 2.80187091146953060061e-01
5.800000 1.00000000000000133227e+00 2.80618954684907662145e-01
5.900000 9.99999999999997224442e-01 2.82365442767172070138e-01
6.000000 1.00000000000000044409e+00 2.85392935187963714405e-01
6.100000 9.99999999999998889777e-01 2.89337621486004892279e-01
6.200000 1.00000000000000266454e+00 2.93510176277119727573e-01
6.300000 1.00000000000000155431e+00 2.96996327818391747666e-01
6.400000 9.99999999999997224442e-01 2.98850233592172331853e-01
6.500000 9.99999999999997446487e-01 2.98359404346409506914e-01
6.600000 1.00000000000000000000e+00 2.95233568775918719940e-01
6.700000 9.99999999999998667732e-01 2.89690840614629241401e-01
6.800000 9.99999999999997113420e-01 2.82417373120595449620e-01
6.900000 9.99999999999993338662e-01 2.74424268997698783679e-01
7.000000 9.99999999999992450483e-01 2.66960941013351993334e-01
7.100000 9.99999999999989341859e-01 2.61453774664011262541e-01
7.200000 9.99999999999988342658e-01 2.59370393344825644899e-01
7.300000 9.99999999999985011989e-01 2.61962912440175665907e-01
7.400000 9.99999999999987232435e-01 2.69826541614803017133e-01
7.500000 9.99999999999983901766e-01 2.82410284028009883617e-01
7.600000 9.99999999999981570298e-01 2.97748080093180544914e-01
7.700000 9.99999999999976019183e-01 3.12632789815145695211e-01
7.800000 9.99999999999976685316e-01 3.23355482054480003473e-01
7.900000 9.99999999999977129406e-01 3.26850219996239588216e-01
8.000000 9.99999999999978017584e-01 3.21762196571879099949e-01
8.100000 9.99999999999981792342e-01 3.08817312738351223977e-01
8.200000 9.99999999999983124610e-01 2.90257003006780034404e-01
8.300000 9.99999999999982680521e-01 2.68839215833846123527e-01
8.400000 9.99999999999984234833e-01 2.47217464765448702302e-01
8.500000 9.99999999999985567101e-01 2.28080646173103668284e-01
8.600000 9.99999999999985456078e-01 2.14583089133113080749e-01
8.700000 9.99999999999982014387e-01 2.10217789411834860003e-01
8.800000 9.99999999999986677324e-01 2.17851467269880749722e-01
8.900000 9.99999999999981126209e-01 2.38360186128749512724e-01
9.000000 9.99999999999980460075e-01 2.69515154211519281091e-01
9.100000 9.99999999999974242826e-01 3.05651842452591582244e-01
9.200000 9.99999999999972466469e-01 3.38527054062046861560e-01
9.300000 9.99999999999970468068e-01 3.59605750794117662306e-01
9.400000 9.99999999999966471265e-01 3.63199373587170692979e-01
9.500000 9.99999999999967359443e-01 3.48714432972242471820e-01
9.600000 9.99999999999969135800e-01 3.20331938684524752947e-01
9.700000 9.99999999999968247621e-01 2.84242016870096370074e-01
9.800000 9.99999999999963362640e-01 2.45792550079097282811e-01
9.900000 9.99999999999961031172e-01 2.08941504270798550369e-01
10.000000 9.99999999999960142993e-01 1.77647882792442229904e-01
10.100000 9.99999999999956923347e-01 1.56837423095479849833e-01
10.200000 9.99999999999957589480e-01 1.51566242229232039929e-01
10.300000 9.99999999999959809927e-01 1.64990925431391127765e-01
10.400000 9.99999999999958810726e-01 1.96620180316906090212e-01
10.500000 9.99999999999957922547e-01 2.41675315723475059304e-01
10.600000 9.99999999999965694109e-01 2.91466810514456220460e-01
10.700000 9.99999999999965472064e-01 3.34968297906447054491e-01
10.800000 9.99999999999967692510e-01 3.61900033936982390426e-01
10.900000 9.99999999999970135001e-01 3.66349696034457383842e-01
11.000000 9.99999999999970579090e-01 3.48781167664569680120e-01
11.100000 9.99999999999973243625e-01 3.14882933587535440711e-01
11.200000 9.99999999999970579090e-01 2.72195747015221201082e-01
11.300000 9.99999999999967692510e-01 2.27416995367387381188e-01
11.400000 9.99999999999966138198e-01 1.86049978691377543294e-01
11.500000 9.99999999999967470465e-01 1.53267838560433078410e-01
11.600000 9.99999999999968580688e-01 1.34013574988299549728e-01
11.700000 9.99999999999970357045e-01 1.31823352922371933582e-01
11.800000 9.99999999999971911357e-01 1.47403825781119018901e-01
11.900000 9.99999999999972133402e-01 1.77990670444916565529e-01
12.000000 9.99999999999973465670e-01 2.17677906429741663263e-01
12.100000 9.99999999999975242027e-01 2.58501268075972900906e-01
12.200000 9.99999999999974575893e-01 2.92109168373191674384e-01
12.300000 9.99999999999975464071e-01 3.11818456381874498096e-01
12.400000 9.99999999999975242027e-01 3.14408641347436013103e-01
12.500000 9.99999999999975908160e-01 3.00735840402558851636e-01
12.600000 9.99999999999976574294e-01 2.74872034110882124125e-01
12.700000 9.99999999999975131004e-01 2.42457553821929627791e-01
12.800000 9.99999999999976463272e-01 2.09267079356756424691e-01
12.900000 9.99999999999974242826e-01 1.80420958651475643597e-01
13.000000 9.99999999999970246023e-01 1.59961563558927100104e-01
13.100000 9.99999999999969801934e-01 1.50443766295288383628e-01
13.200000 9.99999999999967581488e-01 1.52536911685931975136e-01
13.300000 9.99999999999967803532e-01 1.64858627200482277253e-01
13.400000 9.99999999999969579889e-01 1.84237572119895998135e-01
13.500000 9.99999999999969579889e-01 2.06370133235291547402e-01
13.600000 9.99999999999967803532e-01 2.26699032989514243086e-01
13.700000 9.99999999999966027175e-01 2.41356036904012333233e-01
13.800000 9.99999999999964694908e-01 2.47936370066350775243e-01
13.900000 9.99999999999963806729e-01 2.45889293583120283060e-01
14.000000 9.99999999999964694908e-01 2.36445553355142112917e-01
14.100000 9.99999999999962474462e-01 2.22129893798360456003e-01
14.200000 9.99999999999965805131e-01 2.06062902805158099095e-01
14.300000 9.99999999999970246023e-01 1.91278936938501703535e-01
14.400000 9.99999999999966693309e-01 1.80184328357034573287e-01
14.500000 9.99999999999967359443e-01 1.74205097505920752932e-01
14.600000 9.99999999999969357845e-01 1.73643319085420633208e-01
14.700000 9.99999999999969135800e-01 1.77736328728593434567e-01
14.800000 9.99999999999966915354e-01 1.84891087050124081070e-01
14.900000 9.99999999999966915354e-01 1.93063683103904454308e-01
15.000000 9.99999999999965361042e-01 2.00222575400607283314e-01
15.100000 9.99999999999961142194e-01 2.04758134190327317770e-01
15.200000 9.99999999999959587882e-01 2.05790218283812748057e-01
15.300000 9.99999999999957811525e-01 2.03306298846087529775e-01
15.400000 9.99999999999955813124e-01 1.98068763396491848150e-01
15.500000 9.99999999999953037566e-01 1.91384966656466426471e-01
15.600000 9.99999999999951483254e-01 1.84785221461878534921e-01
15.700000 9.99999999999951705298e-01 1.79640540933809794710e-01
15.800000 9.99999999999954369834e-01 1.76899629777880817993e-01
15.900000 9.99999999999955480057e-01 1.76927862952688891296e-01
16.000000 9.99999999999957034369e-01 1.79416141686465857585e-01
16.100000 9.99999999999959032770e-01 1.83538785720207320296e-01
16.200000 9.99999999999957700503e-01 1.88145233502578695939e-01
16.300000 9.99999999999954147789e-01 1.91960276417073943955e-01
16.400000 9.99999999999955702101e-01 1.93941611759361060008e-01
16.500000 9.99999999999957922547e-01 1.93478972864365800222e-01
16.600000 9.99999999999957922547e-01 1.90461314740072967799e-01
16.700000 9.99999999999958810726e-01 1.85378098417574244117e-01
16.800000 9.99999999999959920949e-01 1.79179319899987338216e-01
16.900000 9.99999999999960365038e-01 1.73014453986324173718e-01
17.000000 9.99999999999960587083e-01 1.68071431822392258759e-01
17.100000 9.99999999999960031971e-01 1.65291548423778439370e-01
17.200000 9.99999999999959143793e-01 1.65132171814238087881e-01
17.300000 9.99999999999959587882e-01 1.67542389507263522752e-01
17.400000 9.99999999999962696506e-01 1.71960718735546247427e-01
17.500000 9.99999999999961142194e-01 1.77386620232014263765e-01
17.600000 9.99999999999962030373e-01 1.82648783030550238005e-01
17.700000 9.99999999999965361042e-01 1.86605431601199162062e-01
17.800000 9.99999999999965027975e-01 1.88364946300767360787e-01
17.900000 9.99999999999965916153e-01 1.87479368629669740365e-01
18.000000 9.99999999999966360242e-01 1.84024864056318598893e-01
18.100000 9.99999999999966582287e-01 1.78568959728327480985e-01
18.200000 9.99999999999967026376e-01 1.72063026917427308593e-01
18.300000 9.99999999999963473662e-01 1.65668626134307633846e-01
18.400000 9.99999999999965694109e-01 1.60496616040544548554e-01
18.500000 9.99999999999965694109e-01 1.57409679413210934484e-01
18.600000 9.99999999999964583886e-01 1.56905571595533949170e-01
18.700000 9.99999999999965916153e-01 1.58940760338720288303e-01
18.800000 9.99999999999969024778e-01 1.63001944862037007056e-01
18.900000 9.99999999999969690911e-01 1.68259262461527947519e-01
19.000000 9.99999999999968025577e-01 1.73596254136516525701e-01
19.100000 9.99999999999968913755e-01 1.77948453453865645946e-01
19.200000 9.99999999999971800335e-01 1.80503402630763837289e-01
19.300000 9.99999999999971467268e-01 1.80685802074183665678e-01
19.400000 9.99999999999971245224e-01 1.78469746845204141339e-01
19.500000 9.99999999999974131804e-01 1.74327667344368303359e-01
19.600000 9.99999999999975464071e-01 1.68946419186200957885e-01
19.700000 9.99999999999977240428e-01 1.63349602687953482372e-01
19.800000 9.99999999999978350651e-01 1.58586470526692835392e-01
19.900000 9.99999999999982125409e-01 1.55406871422729075949e-01
20.000000 9.99999999999981903365e-01 1.54311266730782659096e-01
20.100000 9.99999999999982791543e-01 1.55443710961065129084e-01
20.200000 9.99999999999987010391e-01 1.58416829134136794011e-01
20.300000 9.99999999999984456878e-01 1.62546285036737209184e-01
20.400000 9.99999999999985567101e-01 1.67048507001224727508e-01
20.500000 9.99999999999986455279e-01 1.70990832124529451574e-01
20.600000 9.99999999999986011190e-01 1.73583897572428008660e-01
20.700000 9.99999999999985678123e-01 1.74422835226624911575e-01
20.800000 9.99999999999984345855e-01 1.73329703396311068930e-01
20.900000 9.99999999999982569499e-01 1.70525867836309463765e-01
21.000000 9.99999999999983235632e-01 1.66614658061889187035e-01
21.100000 9.99999999999983457677e-01 1.62269799548844934067e-01
21.200000 9.99999999999981348253e-01 1.58361547604811414569e-01
21.300000 9.99999999999980015986e-01 1.55579295504227499425e-01
21.400000 9.99999999999978905763e-01 1.54295996384857525552e-01
21.500000 9.99999999999979127807e-01 1.54827897348680687539e-01
21.600000 9.99999999999979127807e-01 1.56892181349019360637e-01
21.700000 9.99999999999982236432e-01 1.59959450411141679282e-01
21.800000 9.99999999999983568699e-01 1.63560220544829687528e-01
21.900000 9.99999999999984456878e-01 1.66849723153034423806e-01
22.000000 9.99999999999985123011e-01 1.69177083520896887059e-01
22.100000 9.99999999999987343458e-01 1.70238345853122197138e-01
22.200000 9.99999999999986011190e-01 1.69764490895590286490e-01
22.300000 9.99999999999985234034e-01 1.67857190712767168073e-01
22.400000 9.99999999999984345855e-01 1.64958831602992433973e-01
22.500000 9.99999999999985900168e-01 1.61580975254532799301e-01
22.600000 9.99999999999986344257e-01 1.58292558772229752240e-01
22.700000 9.99999999999984900967e-01 1.55711660306139337839e-01
22.800000 9.99999999999984900967e-01 1.54289958599999471600e-01
22.900000 9.99999999999984456878e-01 1.54125353206893300761e-01
23.000000 9.99999999999984456878e-01 1.55218397877590730261e-01
23.100000 9.99999999999986677324e-01 1.57366668483450683480e-01
23.200000 9.99999999999983901766e-01 1.59978836078785574548e-01
23.300000 9.99999999999982125409e-01 1.62581895408364318634e-01
23.400000 9.99999999999981792342e-01 1.64805844875500262514e-01
23.500000 9.99999999999980904164e-01 1.66119616498946964800e-01
23.600000 9.99999999999982902565e-01 1.66317291381828658015e-01
23.700000 9.99999999999987343458e-01 1.65543949732845613321e-01
23.800000 9.99999999999989785948e-01 1.63859291242620858098e-01
23.900000 9.99999999999991562305e-01 1.61559092723242370138e-01
24.000000 9.99999999999992006394e-01 1.59184716848560170455e-01
24.100000 9.99999999999987010391e-01 1.57095943272969523763e-01
24.200000 9.99999999999989008792e-01 1.55565876379648915240e-01
24.300000 9.99999999999991229238e-01 1.54920447229808189160e-01
24.400000 9.99999999999988231636e-01 1.55226096859400586325e-01
24.500000 9.99999999999987343458e-01 1.56287970193552477882e-01
24.600000 9.99999999999988675725e-01 1.57951566987772989981e-01
24.700000 9.99999999999986677324e-01 1.59938682680602045627e-01
24.800000 9.99999999999988897770e-01 1.61840448917647150573e-01
24.900000 9.99999999999988453681e-01 1.63388129457429809310e-01
25.000000 9.99999999999992228439e-01 1.64412550580072369666e-01
25.100000 9.99999999999992006394e-01 1.64807491855728155405e-01
25.200000 9.99999999999991340260e-01 1.64549753665343606590e-01
25.300000 9.99999999999989341859e-01 1.63808333664243160888e-01
25.400000 9.99999999999985456078e-01 1.62799048107445165634e-01
25.500000 9.99999999999984123811e-01 1.61703362192668925745e-01
25.600000 9.99999999999983346655e-01 1.60759827247486580815e-01
25.700000 9.99999999999982902565e-01 1.60182598643535123450e-01
25.800000 9.99999999999979238829e-01 1.60065718903378201299e-01
25.900000 9.99999999999983679722e-01 1.60418057042711337257e-01
26.000000 9.99999999999984567900e-01 1.61216157802596626869e-01
26.100000 9.99999999999986566301e-01 1.62375506998603508224e-01
26.200000 9.99999999999986566301e-01 1.63673678740108935470e-01
26.300000 9.99999999999983457677e-01 1.64966672425484683906e-01
26.400000 9.99999999999983235632e-01 1.66211351585428074307e-01
26.500000 9.99999999999983235632e-01 1.67183883614966805053e-01
26.600000 9.99999999999980127008e-01 1.67819160008952361629e-01
26.700000 9.99999999999980571097e-01 1.68274128011716095354e-01
26.800000 9.99999999999978350651e-01 1.68442182223584702161e-01
26.900000 9.99999999999979682919e-01 1.68345404848408236598e-01
27.000000 9.99999999999977018383e-01 1.68292196544690741966e-01
27.100000 9.99999999999974797937e-01 1.68239569171082986587e-01
27.200000 9.99999999999975908160e-01 1.68160286404549136341e-01
27.300000 9.99999999999975575093e-01 1.68363865212382529668e-01
27.400000 9.99999999999976463272e-01 1.68751070794327912017e-01
27.500000 9.99999999999975464071e-01 1.69164780154689914360e-01
27.600000 9.99999999999973909759e-01 1.69788280208758829426e-01
27.700000 9.99999999999973243625e-01 1.70514952199001729172e-01
27.800000 9.99999999999971467268e-01 1.71125028287001768046e-01
27.900000 9.99999999999971467268e-01 1.71745202510704048082e-01
28.000000 9.99999999999971023179e-01 1.72373370858329294508e-01
28.100000 9.99999999999972799536e-01 1.72831019435280175411e-01
28.200000 9.99999999999972133402e-01 1.73244059006466444295e-01
28.300000 9.99999999999969690911e-01 1.73713116762364311318e-01
28.400000 9.99999999999970579090e-01 1.74109447000716621723e-01
28.500000 9.99999999999970579090e-01 1.74503870087797219313e-01
28.600000 9.99999999999972133402e-01 1.75015666348469767222e-01
28.700000 9.99999999999971911357e-01 1.75541033687834718835e-01
28.800000 9.99999999999967581488e-01 1.76020868752190001727e-01
28.900000 9.99999999999965027975e-01 1.76526706602004535007e-01
29.000000 9.99999999999967248421e-01 1.76991601886583055370e-01
29.100000 9.99999999999962585484e-01 1.77257808226950336339e-01
29.200000 9.99999999999961697306e-01 1.77391185518058269732e-01
29.300000 9.99999999999959365837e-01 1.77439596458095649734e-01
29.400000 9.99999999999958477659e-01 1.77300206294157713938e-01
29.500000 9.99999999999959365837e-01 1.77106723593028314578e-01
29.600000 9.99999999999961142194e-01 1.77023059721934716837e-01
29.700000 9.99999999999956479257e-01 1.77012127205386782247e-01
29.800000 9.99999999999955146990e-01 1.77197403748212245489e-01
29.900000 9.99999999999957811525e-01 1.77695236962277985926e-01
30.000000 9.99999999999960476060e-01 1.78387214810898420136e-01
