# tag norm j_0
17.800000 1.00000000000001443290e+00 1.84276113436075282721e-03
17.800000 1.00000000000001443290e+00 3.39481290702244101198e-02
17.800000 1.00000000000001443290e+00 -3.91277784041549475669e-02
17.800000 1.00000000000001443290e+00 9.81946257180226281247e-03
17.800000 1.00000000000001443290e+00 3.55818184677124116355e-02
17.800000 1.00000000000001443290e+00 -1.17756998374249320649e-02
17.800000 1.00000000000001443290e+00 6.04402731159878608969e-02
17.800000 1.00000000000001443290e+00 -7.26782936031489801287e-02
17.800000 1.00000000000001443290e+00 4.05924101771520679655e-03
17.800000 1.00000000000001443290e+00 4.19213242173449365802e-02
17.800000 1.00000000000001443290e+00 5.49440547012646288150e-03
17.800000 1.00000000000001443290e+00 -7.33809900838848783167e-02
17.800000 1.00000000000001443290e+00 5.98299707322411181143e-02
17.800000 1.00000000000001443290e+00 -1.03944340927805585484e-02
17.800000 1.00000000000001443290e+00 3.52768685621458813473e-02
17.800000 1.00000000000001443290e+00 1.03844729229069700910e-02
17.800000 1.00000000000001443290e+00 -4.02491701553550629278e-02
17.800000 1.00000000000001443290e+00 3.39948432953761717212e-02
17.800000 1.00000000000001443290e+00 3.01033402614272636508e-03
