# tag norm BO
1 1.00000000000000000000e+00 -4.52508215483674730573e-03
2 1.00000000000000000000e+00 -2.71144928719095380798e-02
3 1.00000000000000000000e+00 -4.85324765610453262576e-02
4 1.00000000000000000000e+00 1.69947570314303610106e-02
5 1.00000000000000000000e+00 4.02165817403814171427e-02
6 1.00000000000000000000e+00 3.76131042744298968450e-02
7 1.00000000000000000000e+00 2.83274331585904974584e-02
8 1.00000000000000000000e+00 2.95065406294010394717e-02
9 1.00000000000000000000e+00 -5.86101158304401775173e-03
10 1.00000000000000000000e+00 -4.04750919886999876995e-02
11 1.00000000000000000000e+00 -2.37470578513100522011e-02
12 1.00000000000000000000e+00 -1.55758804284644655769e-02
13 1.00000000000000000000e+00 -3.75856990614484021140e-02
14 1.00000000000000000000e+00 -1.85342897470218911926e-02
15 1.00000000000000000000e+00 -3.47202472954883517575e-03
16 1.00000000000000000000e+00 9.04275520709511924228e-04
17 1.00000000000000000000e+00 -4.25557414505127115656e-02
18 1.00000000000000000000e+00 -6.19326079021479715403e-03
19 1.00000000000000000000e+00 3.68038168242057692203e-02
20 1.00000000000000000000e+00 6.79902293079355096728e-02
21 1.00000000000000000000e+00 7.00386693999011100686e-02
22 1.00000000000000000000e+00 4.46218004160686410042e-02
23 1.00000000000000000000e+00 6.82259126485024354480e-03
24 1.00000000000000000000e+00 -3.48629623258740473091e-02
25 1.00000000000000000000e+00 -3.37497279577458203503e-02
26 1.00000000000000000000e+00 2.09004023145969042990e-03
27 1.00000000000000000000e+00 5.05354586627642932140e-02
28 1.00000000000000000000e+00 1.27688109144287048613e-01
29 1.00000000000000000000e+00 1.79530727079137919500e-01
30 1.00000000000000000000e+00 1.98207318875754268106e-01
31 1.00000000000000000000e+00 2.00321084822092043698e-01
32 1.00000000000000000000e+00 1.97199614863298067213e-01
33 1.00000000000000000000e+00 1.94687027207722906930e-01
34 1.00000000000000000000e+00 1.93965853107510466380e-01
35 1.00000000000000000000e+00 1.93850587764674120450e-01
36 1.00000000000000000000e+00 1.93824098192715732480e-01
