# tag norm j_0
8.400000 1.00000000000003619327e+00 5.55237218892729381126e-02
8.400000 1.00000000000003619327e+00 6.65394840072025817168e-02
8.400000 1.00000000000003619327e+00 5.43005920696520358315e-02
8.400000 1.00000000000003619327e+00 6.64950817907125901751e-02
8.400000 1.00000000000003619327e+00 5.41743691793684575830e-02
8.400000 1.00000000000003619327e+00 6.63529457989731480394e-02
8.400000 1.00000000000003619327e+00 5.40447328191079046089e-02
8.400000 1.00000000000003619327e+00 6.62131968342752202927e-02
8.400000 1.00000000000003619327e+00 5.39175924742635107045e-02
8.400000 1.00000000000003619327e+00 6.60714205527205000745e-02
8.400000 1.00000000000003619327e+00 5.37913270305108714986e-02
8.400000 1.00000000000003619327e+00 6.59294346150411936236e-02
8.400000 1.00000000000003619327e+00 5.36636328966007825070e-02
8.400000 1.00000000000003619327e+00 6.57872818524814634289e-02
8.400000 1.00000000000003619327e+00 5.35411641887291872566e-02
8.400000 1.00000000000003619327e+00 6.56488656044492691066e-02
8.400000 1.00000000000003619327e+00 5.34160426019807538234e-02
8.400000 1.00000000000003619327e+00 6.54162961068502635253e-02
8.400000 1.00000000000003619327e+00 5.43816200210763128764e-02
