# tag norm j_0
8.800000 1.00000000000003486100e+00 3.58295388277275334010e-02
8.800000 1.00000000000003486100e+00 5.08377705730587159394e-02
8.800000 1.00000000000003486100e+00 3.57599757134227577704e-02
8.800000 1.00000000000003486100e+00 5.12026474156925190395e-02
8.800000 1.00000000000003486100e+00 3.59560387672756207045e-02
8.800000 1.00000000000003486100e+00 5.13910010573378137066e-02
8.800000 1.00000000000003486100e+00 3.61154406462163776736e-02
8.800000 1.00000000000003486100e+00 5.14064169754809840995e-02
8.800000 1.00000000000003486100e+00 3.65624353452873793180e-02
