# tag norm n_hub[0] n_hub[1] n_hub[2] n_hub[3] n_hub[4] n_hub[5] n_hub[6] n_hub[7] n_hub[8] n_hub[9] n_hub[10] n_hub[11] n_hub[12] n_hub[13] n_hub[14] n_hub[15] n_hub[16] n_hub[17] n_hub[18] n_hub[19] n_hub[20] n_hub[21] n_hub[22] n_hub[23] n_hub[24] n_hub[25] n_hub[26] n_hub[27] n_hub[28] n_hub[29] n_hub[30] n_hub[31] n_hub[32] n_hub[33] n_hub[34] n_hub[35] n_hub[36] n_hub[37] n_hub[38] n_hub[39]
1 1.00000000000000000000e+00 1.53443658844620745008e+00 1.24940970246614391215e+00 1.37768651771397632189e+00 1.51712008454570246307e+00 1.17504382033862841972e+00 1.24138730518878914744e+00 1.00085359535502615991e+00 1.15155698449106957959e+00 9.23224725499209863955e-01 1.19182506002534882583e+00 1.02904093572596977424e+00 1.12701605053252107425e+00 1.45798414905508022521e+00 4.93256943964783145518e-01 1.18513151002587391325e+00 5.78239815594767225804e-01 7.67847031916958022713e-01 1.00019267577091808263e+00 1.29594290377441989648e+00 6.00999424473224186372e-02 1.45197183046547051433e-01 9.82790279367950381229e-01 6.95724774061167838823e-01 9.04509643443388466899e-01 2.98802003268740290487e-01 1.36025780992250555634e+00 5.34965606662528903037e-01 1.22540142425489739786e+00 1.12342017362027779548e+00 7.85148180258984029756e-01 8.50751509206955192077e-01 1.01412668227225344353e+00 7.15592863015956925921e-01 9.17100940350302984427e-01 8.47943339774703153111e-01 9.94654690822369791370e-01 9.39638630111717554350e-01 1.68376780044060470054e+00 1.04127770100350325322e+00 1.58163242221605537807e+00
2 1.00000000000000000000e+00 9.99805674214210626793e-01 1.21317403709764826125e+00 7.53835505072109390845e-01 1.18373463301403392123e+00 8.11494430298122848555e-01 1.44803868314450667754e+00 7.48975340748888829268e-01 1.84574874229532648329e+00 1.00085010395585216614e+00 1.99222258575803334857e+00 1.00497491452580600679e+00 1.99465433461299301854e+00 1.00264615555579661432e+00 1.21948036144538973780e+00 7.80671133555945084836e-01 9.97414329303139335359e-01 5.67603775969263354972e-03 9.94658373265599582425e-01 2.65582291522261815242e-01 9.99391042083494829384e-01 1.46672208134021542225e-01 1.31238035122304430580e+00 2.85051850329426148534e-01 9.94133931579378904431e-01 2.82152411712516260067e-01 1.56067214327484249381e+00 1.83198808783688382729e-01 1.04324249140839242500e+00 9.61612571153340756069e-01 1.00932272506165587878e+00 9.68190153700132283277e-01 1.98358201542004630724e+00 9.23399998083575312968e-01 1.26158524075857880753e+00 8.71065144713599526227e-01 1.57252845424457121659e+00 3.79154397010380062039e-01 1.01947618232093262236e+00 9.12517231108528448225e-01 1.06703298075060004635e+00
3 1.00000000000000000000e+00 9.13203379255758229682e-01 1.31979752004099748497e+00 7.57632121010848647025e-01 1.32698256324954133589e+00 6.98822611199740206800e-01 1.49378074018631790132e+00 7.00944803153776052618e-01 1.79088234312139427118e+00 1.00259100966804148847e+00 1.99378257192464514169e+00 1.00434183876790283918e+00 1.98773740689230216105e+00 1.00341446091430119836e+00 1.22679833248445890881e+00 7.53159232639250331154e-01 1.01813514513070191292e+00 1.00347878571303266576e-02 9.94898593062240044205e-01 1.59771294579955681903e-02 1.00262408024092875003e+00 3.04544877652619117026e-01 1.30824344831888872420e+00 3.56382540300639649722e-01 1.01294693383639433648e+00 4.82881301091794501446e-01 1.26291180404267766590e+00 3.36012723946258307084e-01 1.21184800464054154290e+00 6.31122392548688515568e-01 1.14017977067569997729e+00 9.75040367823083009569e-01 1.64262195162984236951e+00 7.03988391788455292186e-01 1.61583260056280608730e+00 9.03058513260940110001e-01 1.30269382974555125720e+00 7.68083301316568101136e-01 1.17821066928589091027e+00 6.95548905519855820145e-01 1.15230700175461864276e+00
4 1.00000000000000000000e+00 8.90713723245782573734e-01 1.36070593569230435804e+00 7.65405182363411706881e-01 1.45587361283189631322e+00 7.00249398175939119504e-01 1.56795014627362050419e+00 6.95271884787400429317e-01 1.58074213458863210846e+00 9.89852772333548736050e-01 1.99288210588329839368e+00 1.00342521183855959421e+00 1.99168047022606553575e+00 9.98340186221943759470e-01 1.21937954922714242301e+00 6.97062237259730377303e-01 1.05998254388385571012e+00 3.19374867816281660104e-02 9.96054204781351759657e-01 9.62718755038020033987e-03 1.01591934395382654799e+00 3.16880097380245973060e-01 1.28531721392274511651e+00 3.49368921617631167376e-01 1.04091868682721688799e+00 5.71986416416519594108e-01 1.28527867583802390961e+00 5.61019013017103995722e-01 1.19014811051002400433e+00 6.37148924997615662136e-01 1.15180189615909411849e+00 8.69886706493916639360e-01 1.47905502305688996145e+00 7.35511944226755365328e-01 1.51850935403452358408e+00 8.38862816742800720959e-01 1.32586473713371977290e+00 7.83157743054618715739e-01 1.18888150886764121239e+00 6.91458185285917958929e-01 1.15588870651675845735e+00
5 1.00000000000000000000e+00 8.78010065023807739770e-01 1.37121049910065750943e+00 7.75731229761818075197e-01 1.49833041089753193909e+00 6.98861772984436302458e-01 1.59667455517823508870e+00 7.30400371498462264164e-01 1.52817369531523494786e+00 9.51813770844723849862e-01 1.96990359963579519942e+00 1.00367352012674992956e+00 1.98593631814406679226e+00 9.88252693919125735356e-01 1.15459801014861951352e+00 5.98372859023921899180e-01 1.13379402556125019608e+00 1.26363979235768697507e-01 1.00475798599075694106e+00 3.02492269993093476632e-02 1.04759975137364924613e+00 3.67459170240068855318e-01 1.26600618379957507997e+00 3.28993180562342224516e-01 1.16408913560200377724e+00 6.77682009760257941799e-01 1.29515399678124243366e+00 7.93432206570162557036e-01 1.17406784836915445425e+00 6.93838976857832467893e-01 1.18649397446152393698e+00 7.34804748998387435854e-01 1.27848052499054776199e+00 7.66535543849981459985e-01 1.31330943675605515963e+00 8.08060462752820618526e-01 1.28332068320973413655e+00 7.48260204288822339258e-01 1.19842679292832565707e+00 6.94551405120035658669e-01 1.15432517333723327901e+00
6 1.00000000000000000000e+00 8.84376648213762051043e-01 1.40791279060034879578e+00 7.66698752082639378713e-01 1.55346146219721426007e+00 7.02127227066814185719e-01 1.59013678756166920714e+00 7.73327613346342590539e-01 1.49708763269898703641e+00 8.95635219674304816628e-01 1.90731411405628326072e+00 9.94535082281981952512e-01 1.71078843703891836370e+00 9.60928410534345300853e-01 1.19637665017377337051e+00 5.55247265806841139302e-01 1.19691532039403902843e+00 3.29063581357898315982e-01 1.05380585132214776856e+00 1.31383617791035967048e-01 1.13329006537108778474e+00 4.49814503256123265906e-01 1.20352388648651431602e+00 3.69094306080178069518e-01 1.26339262917782346740e+00 5.17392479093186974382e-01 1.29790188656396043854e+00 6.54262717488217404593e-01 1.18996130734675409357e+00 6.76201451503029904444e-01 1.19058723530154964010e+00 7.22587611749693992103e-01 1.27505755298993550539e+00 7.72342098823849632083e-01 1.30813406247294938822e+00 7.97206436303223742179e-01 1.27943417370337253480e+00 7.41034469665843853470e-01 1.20212284201254693272e+00 6.94510122418003694733e-01 1.15502569799264875883e+00
7 1.00000000000000000000e+00 8.87548555662902804997e-01 1.41352733848345324397e+00 7.70133404806850663249e-01 1.57029224670003264563e+00 7.07453188896371210070e-01 1.57821456086168199207e+00 7.84193596053359143205e-01 1.51218715582678919773e+00 8.45066856838945668073e-01 1.76165570062350784752e+00 9.47059654783737658867e-01 1.25103314717654257038e+00 8.96566224540331524473e-01 1.24502793331027317159e+00 8.12009077544082913391e-01 1.17922747595266819154e+00 5.55633290656423639575e-01 1.16897146560706821639e+00 2.49313147577313820591e-01 1.17469711567329571089e+00 4.71541432388444203827e-01 1.18435490608773430488e+00 4.36202651463029777990e-01 1.29030060962070614039e+00 4.48097937139075308544e-01 1.30990232459244237972e+00 5.64517010262082230554e-01 1.21236135864822891506e+00 6.49055742983493444420e-01 1.19599571425053574636e+00 7.15326663470139623158e-01 1.26693964533322800392e+00 7.73046111312960193551e-01 1.30500008911331799588e+00 7.92481129842971254718e-01 1.27253220039886194570e+00 7.37313953858246384776e-01 1.20999954814485088939e+00 6.98246924589514650350e-01 1.15697290892441828625e+00
8 1.00000000000000000000e+00 8.46612326720697971894e-01 1.34128088834650860406e+00 7.78039004725576410770e-01 1.46311432868726654100e+00 7.17827477592888230085e-01 1.49503784283866614224e+00 7.29786423929157823665e-01 1.59797497224365181445e+00 7.76231005976399268675e-01 1.61132819140710803474e+00 9.42413716901730036390e-01 1.62822359180253561917e+00 8.48410313628684575882e-01 1.33643956788941098424e+00 8.52412800878144194527e-01 1.15609716119858862982e+00 5.53046282066187333548e-01 1.19311853066881190522e+00 3.07858468762590709034e-01 1.21031465083243117142e+00 4.69612367277844389157e-01 1.17639486879409504994e+00 4.85063199394556054944e-01 1.27714388025062386411e+00 4.28635078333111041449e-01 1.30820485233472916242e+00 5.09589454814299180896e-01 1.22577073898653288175e+00 6.24300988883260687956e-01 1.19800973566531809844e+00 7.09321094254388828659e-01 1.26112295240796146167e+00 7.73268613761616707691e-01 1.30151879467935338575e+00 7.89805864083714781465e-01 1.27311939720958089417e+00 7.37715088146793207535e-01 1.21006139558914060927e+00 6.97802266050511876827e-01 1.15797182198545711707e+00
9 1.00000000000000000000e+00 8.30442836253782012967e-01 1.33997066952552268404e+00 7.80685948601038015582e-01 1.41568621861785914895e+00 7.30479901435455825087e-01 1.49845446381154290272e+00 7.04194798622292283952e-01 1.59423167735297499625e+00 7.54352504559500980363e-01 1.52800747804090764070e+00 9.15004128608844613524e-01 1.72950400896829403763e+00 7.93672549635510038435e-01 1.47087722463015757590e+00 8.56915073157251128144e-01 1.16530194330651926116e+00 5.71171265434684438667e-01 1.19641118515071109840e+00 3.49057475067085509757e-01 1.23680349232906738877e+00 4.58741058024574765994e-01 1.17897124339564407514e+00 5.16737514672212516764e-01 1.25168861523614149966e+00 4.45390292636844431495e-01 1.30394285479179949938e+00 4.71422165098060175215e-01 1.24745420607651702483e+00 5.88736247151882330364e-01 1.20467472091105709531e+00 6.91482599316703305803e-01 1.24569832250289103115e+00 7.69428447873692245018e-01 1.29235705015647472926e+00 7.89748981580436826277e-01 1.27284781023449400372e+00 7.41297889689437550231e-01 1.21086002773163681212e+00 7.00086539471667990142e-01 1.15720857033887858378e+00
10 1.00000000000000000000e+00 8.44996097081103236803e-01 1.35730625977931440573e+00 7.81956183659838544031e-01 1.45761238255233149808e+00 7.14052078080617880218e-01 1.54217218880353335031e+00 6.96541325013174117409e-01 1.53981039092875149343e+00 7.71486900851984680472e-01 1.49389466953534832960e+00 8.64318815541404328329e-01 1.69029917508029869921e+00 7.75711936354685493988e-01 1.50667979494339121516e+00 8.53888999289977412843e-01 1.18756533559995358651e+00 6.08693338108064252445e-01 1.19405342439147577061e+00 3.96332148706148690298e-01 1.25242732753247132393e+00 4.47221202342886092751e-01 1.19224229593080299772e+00 5.24126225437586690248e-01 1.22931240531473906508e+00 4.61588236328392742536e-01 1.29463011211975453918e+00 4.55931824979959432476e-01 1.25897199909663615180e+00 5.59643747894955190247e-01 1.20738278702474133297e+00 6.76112140585411136584e-01 1.23527677561417092988e+00 7.64262791505218364030e-01 1.28634343930823691338e+00 7.90993471362458899776e-01 1.27318679324609940196e+00 7.44793003776993201015e-01 1.21154104894408587434e+00 7.00723094167763793649e-01 1.15591783318513741108e+00
11 1.00000000000000000000e+00 8.49254667094117010606e-01 1.36127996629671810247e+00 7.81237711894533171098e-01 1.46873492867778443483e+00 7.15876793512069009573e-01 1.54606922929660228760e+00 7.02690971586587331821e-01 1.52370485218175755193e+00 7.65763058926050232955e-01 1.47168041136861083018e+00 8.26842372289032789823e-01 1.49799716731704091188e+00 7.62389078805193909361e-01 1.35832520182545546383e+00 7.77066312800844039010e-01 1.15819169907017971433e+00 6.90187718333976074625e-01 1.23293506839295519129e+00 5.97306224054832912707e-01 1.21531150527038289688e+00 5.49553889100977910331e-01 1.20904947306407284380e+00 5.19178716601899736816e-01 1.26724310829061748152e+00 4.71018547471732329512e-01 1.29635617931825053439e+00 4.96181863307273929298e-01 1.26010178631687286277e+00 5.77464106323621884087e-01 1.21789130944524126576e+00 6.74463098961741946979e-01 1.23938594683887459702e+00 7.57644550374003689086e-01 1.28098497017832091416e+00 7.85752072197713702373e-01 1.27450961509029681018e+00 7.49158191273325058113e-01 1.21340597866390953463e+00 7.03952160029522766571e-01 1.15385949815694455189e+00
12 1.00000000000000000000e+00 8.47302476733248099983e-01 1.35762186958209496446e+00 7.79100260781441678049e-01 1.45561217101788531458e+00 7.15444292486001165443e-01 1.52391292858653981668e+00 6.95357837076766460704e-01 1.51575347697772011557e+00 7.34728154525128185348e-01 1.43484418969200588911e+00 8.21216615995952081697e-01 1.32631992939075105120e+00 7.65002537602126220229e-01 1.21308722716010564113e+00 7.27701031266196118885e-01 1.16956282611989559328e+00 8.35266803964784809722e-01 1.24551110569087519764e+00 7.70051783031392655943e-01 1.19270274934332731753e+00 6.19202585875092470502e-01 1.22890318659269004442e+00 5.22197342313988843721e-01 1.29314716282146258131e+00 4.80162576884196501403e-01 1.29976012020807751846e+00 5.15717080944556816036e-01 1.25814369502618195185e+00 5.94833397599324853466e-01 1.22281683928853435184e+00 6.81373117679379247669e-01 1.24186517860539580305e+00 7.56453007496281970568e-01 1.28065171958562196153e+00 7.84894439257510678765e-01 1.27281638692273824098e+00 7.49376009367869300171e-01 1.21413850372754272833e+00 7.03866747367048128936e-01 1.15358063541230260185e+00
13 1.00000000000000000000e+00 8.46905666788123623334e-01 1.35806993921013985371e+00 7.78817234847455353020e-01 1.45477475198555761260e+00 7.17410525566418488808e-01 1.52298285535757460529e+00 6.96928882774505153996e-01 1.51100470264708119927e+00 7.34339270373768671085e-01 1.42749282842968416851e+00 7.96713443902439255595e-01 1.31795680879931786933e+00 7.70465827822702564731e-01 1.20965896703217135055e+00 7.25196830913901524518e-01 1.19457558482558656721e+00 7.83280070792589544482e-01 1.27502099859952178207e+00 7.96281911643344386675e-01 1.28487965494675759892e+00 7.33104320863008585007e-01 1.27303013196967218512e+00 6.84374058004386220944e-01 1.28297430827451575119e+00 6.77349807115735447205e-01 1.29390832898655849803e+00 6.81168871632156003315e-01 1.26743940265878984874e+00 6.73877532016456060049e-01 1.22137759331005257835e+00 6.32181615150181897000e-01 1.21792355185289369324e+00 5.42932238304089098690e-01 1.27733918490558195913e+00 5.09563551486391763667e-01 1.29141329885477773587e+00 5.44180094160194083308e-01 1.21909884745966889952e+00 6.36449680434915454619e-01 1.13755682530135815433e+00
14 1.00000000000000000000e+00 8.43713289578048364348e-01 1.35586856786655185481e+00 7.77867203055847888926e-01 1.44853346385564418775e+00 7.19332868986140461232e-01 1.51310437755890259126e+00 6.98615881223602186445e-01 1.50348461314209869144e+00 7.27575022050583553046e-01 1.43564782116608458118e+00 7.77300627387720100003e-01 1.34169164547970076740e+00 7.74744984772121281225e-01 1.24397990598752317126e+00 7.22605908106252914358e-01 1.20249447894675554060e+00 7.20745694971172579102e-01 1.25896908627772363687e+00 7.61439730555580562843e-01 1.30406165794147566039e+00 7.57321637016052817692e-01 1.31029968302887422915e+00 7.28894152183991339555e-01 1.30057427987845586337e+00 7.05445460835490534279e-01 1.28050548439743727691e+00 6.87484246836029599947e-01 1.25030544401295595769e+00 6.51578081918367635339e-01 1.23962064389696302591e+00 5.85705281748068351533e-01 1.27215965684487475329e+00 5.01574004740966583604e-01 1.30462131545673032385e+00 4.72931689369992414029e-01 1.28815793792219146496e+00 5.31011835623074412993e-01 1.22035799362240404697e+00 6.34903330282701738874e-01 1.14477101147501381107e+00
15 1.00000000000000000000e+00 8.41808782314591552698e-01 1.35382352294867436271e+00 7.77864526683963442011e-01 1.44292458890519403880e+00 7.20581721656117335506e-01 1.50651245124036159417e+00 6.98684327208981104107e-01 1.50326376579117648724e+00 7.22941880813569914821e-01 1.43949341583542689271e+00 7.66121818470235194098e-01 1.35412774274340530489e+00 7.72869718353068502203e-01 1.27213739015025550927e+00 7.29135886764102125746e-01 1.22014979873285889234e+00 6.94495208880411718511e-01 1.23615706216572829312e+00 6.93654827555211239698e-01 1.28144305863779939259e+00 6.90761858503150749655e-01 1.30205206249344818126e+00 6.66151328413692289665e-01 1.30640170983883385780e+00 6.22914620456842982321e-01 1.30505988068843326033e+00 5.76177639014867293277e-01 1.31402788684170790390e+00 5.35937813236330717892e-01 1.32989947794153851035e+00 5.37413796304327062714e-01 1.31715288815030517888e+00 5.71952639099055137883e-01 1.29666218706651514836e+00 5.95141489734078321661e-01 1.25257342751063682762e+00 6.38786768833784046606e-01 1.22976679234194019585e+00 6.82347883717842385032e-01 1.20062635396147565636e+00
16 1.00000000000000000000e+00 7.19657695174931388848e-01 1.29871365003510952363e+00 6.92660452996534337089e-01 1.30828839330496582427e+00 6.96587057258914010838e-01 1.30703105549997511403e+00 6.97901433166273066355e-01 1.32070549519914481884e+00 7.16785912090318388934e-01 1.32177985383716567469e+00 7.46517316570037836598e-01 1.34520906731011380408e+00 7.61185970974939341005e-01 1.35891562262202247879e+00 7.36491881018647043255e-01 1.37220106443839529042e+00 7.05588141142632907510e-01 1.38919369096725087154e+00 6.72547401187052029670e-01 1.39163783165137422415e+00 6.53877019255430735889e-01 1.38575138047421786425e+00 6.40869945952326713901e-01 1.37230401863599005274e+00 6.23429220126972438720e-01 1.35540113931977512784e+00 6.10135785753969206446e-01 1.34260457187030768367e+00 6.04265048393193948684e-01 1.32886253478176485920e+00 6.08753525535377426614e-01 1.30751880529441510959e+00 6.24416845732465586316e-01 1.28169437801695340617e+00 6.45340995677517015316e-01 1.25399119952921123122e+00 6.65388446377691344935e-01 1.23612224325720299056e+00 6.88273353440088997424e-01 1.21140055612931263340e+00
17 1.00000000000000000000e+00 7.26660859841742112764e-01 1.29888656668655566584e+00 7.01724259425563823278e-01 1.30901604744222499477e+00 7.02675820614291124500e-01 1.31318350556446628019e+00 7.09159286446081282840e-01 1.31647261756593203508e+00 7.21768051652466491319e-01 1.32104811627126572660e+00 7.35574020260932770476e-01 1.32744192067946453761e+00 7.36162498592325742486e-01 1.32893103886178343132e+00 7.20692151537484559931e-01 1.33005820990016343508e+00 7.02368771077501063971e-01 1.33145056593909738574e+00 6.86182115588703567255e-01 1.33105992956472363176e+00 6.75686412009164905079e-01 1.32780715326080933636e+00 6.70955630018650217572e-01 1.32391584350305713258e+00 6.69575721575148219422e-01 1.31691871631448687019e+00 6.70412458170299263571e-01 1.30667805896278776956e+00 6.72628287989221029797e-01 1.29133798542030153733e+00 6.75244590651824072580e-01 1.27563431565013329916e+00 6.78523550278473330799e-01 1.27054678776781271310e+00 6.79159906208663066707e-01 1.25953078052633737904e+00 6.84445917082175614432e-01 1.26177885440047798937e+00 6.97174582669718767569e-01 1.24152809402782215997e+00
18 1.00000000000000000000e+00 7.33852283943522976095e-01 1.29970916832393634799e+00 7.10630599596751566516e-01 1.30756513338910496103e+00 7.08830947920015663755e-01 1.31190533682859844511e+00 7.11456851168469794899e-01 1.31586219398594184149e+00 7.16548730969655767176e-01 1.31860828546565977959e+00 7.20778028247858859601e-01 1.32048065252465862685e+00 7.21028873444081841448e-01 1.32196528563970594483e+00 7.15971665097782983267e-01 1.32110057520440915546e+00 7.07577422614194095907e-01 1.31981492555050583526e+00 6.98339009708602631576e-01 1.31878681672048769791e+00 6.89675229008118506613e-01 1.31705342323345675482e+00 6.84487125199590318303e-01 1.31371678687766424432e+00 6.81937210320701536759e-01 1.30769512428591716535e+00 6.81107528745679480231e-01 1.29983160461710101075e+00 6.80534032225509899483e-01 1.28934164346321233907e+00 6.80347156827786792022e-01 1.27807727723742980963e+00 6.81284974120514363882e-01 1.27090761789698203366e+00 6.83036515311880254586e-01 1.26625690412860536505e+00 6.86845684841682846411e-01 1.26509780883317546341e+00 6.97558312818608472483e-01 1.24439525366250025584e+00
19 1.00000000000000000000e+00 7.33940310869531487015e-01 1.29985129641683094803e+00 7.08867236113171816925e-01 1.31003907542068520620e+00 7.08320566959597996970e-01 1.31402599146234844163e+00 7.10584610885543699332e-01 1.31611969623758584547e+00 7.12686921859512101385e-01 1.31731600541016713457e+00 7.14052205953881191647e-01 1.31773612252408511836e+00 7.13161247371298046005e-01 1.31761755407948655261e+00 7.09973686995189812166e-01 1.31604176329273236945e+00 7.05779049461728313908e-01 1.31396130469211036562e+00 7.00308518604791263584e-01 1.31199925934676642214e+00 6.94078210498154657415e-01 1.30627335523901266789e+00 6.90635034523120583394e-01 1.30047776255983094096e+00 6.87237753202630363702e-01 1.29466016970419062204e+00 6.84643980940937257884e-01 1.28786778150585812242e+00 6.81826187345769163528e-01 1.28348465061785632635e+00 6.80995101671020841572e-01 1.28225860895186927202e+00 6.82004023157650629550e-01 1.28088823138378993249e+00 6.84110747834499322018e-01 1.28974913569240468014e+00 6.87521310147887199093e-01 1.28706276063122504461e+00 6.99596957735838964609e-01 1.26224581269935742789e+00
20 1.00000000000000000000e+00 7.22823730425365740260e-01 1.29896772293061713022e+00 6.93110156693406809225e-01 1.31041599907537276160e+00 6.89996849284117752532e-01 1.31567759778381954128e+00 6.88170735980714765034e-01 1.31633021740325206750e+00 6.88964243796057029812e-01 1.31921108205188475360e+00 6.91309772751779183508e-01 1.31875081368525148839e+00 6.93690908928751182039e-01 1.31957039006239984502e+00 6.96257218759911311601e-01 1.31811495315060756006e+00 6.97019301144239045165e-01 1.31727319000877285404e+00 6.95991868256938261972e-01 1.31463247499005420060e+00 6.94031451358751216851e-01 1.31440319707148667305e+00 6.93697188404299280862e-01 1.31069426969706959163e+00 6.91756336130522120342e-01 1.30687761805860280795e+00 6.89134472898475181069e-01 1.30301644675637473547e+00 6.86284211920028974774e-01 1.30005520391171280892e+00 6.84736160660014747670e-01 1.29830409198990537334e+00 6.84801284769197438074e-01 1.29779633601540322907e+00 6.86181314533187647342e-01 1.29784532505499416999e+00 6.90123015907975645433e-01 1.29522316475289156479e+00 7.00250509895766426460e-01 1.26850917305036303695e+00
21 1.00000000000000000000e+00 7.21053449199243745582e-01 1.29897203261402904850e+00 6.91073831328372634175e-01 1.30936672860246661187e+00 6.86355124705900321302e-01 1.31363797764661183187e+00 6.84673471889010398783e-01 1.31593248678096763626e+00 6.84096070106305798042e-01 1.31725779982591673090e+00 6.83897877904385165237e-01 1.31811502461229856920e+00 6.83735927998028070185e-01 1.31852113932298098398e+00 6.83292344540714968737e-01 1.31871811938067673431e+00 6.83044715806616409282e-01 1.31840393074877759716e+00 6.82439054584993431973e-01 1.31798850204484430115e+00 6.82286838122243333160e-01 1.31716372014611571295e+00 6.82228565685131460583e-01 1.31665173168615368127e+00 6.81164584970941233699e-01 1.31700094834977732283e+00 6.81475144151496903255e-01 1.31588661648176352692e+00 6.80890333249715817843e-01 1.31609425081475395203e+00 6.82420219017609630541e-01 1.31665445042132356335e+00 6.83248646375012036458e-01 1.31755955192205198578e+00 6.85704120287587315374e-01 1.31377022357672190722e+00 6.89643414785692576707e-01 1.30939961629019774314e+00 7.00997353662786149009e-01 1.27918406035984699720e+00
22 1.00000000000000000000e+00 7.19406384751275052025e-01 1.29894448074026502837e+00 6.88754912343410796716e-01 1.30954542389761341425e+00 6.83128691799274045948e-01 1.31404175247422583261e+00 6.81456569810080847738e-01 1.31635299269556593771e+00 6.80651095662589411539e-01 1.31777996795524310336e+00 6.79920673111445550418e-01 1.31862544247055946123e+00 6.79666888958575521329e-01 1.31933495654938592878e+00 6.79137689948389300376e-01 1.32020175137262296694e+00 6.78994769023858024681e-01 1.32010398219299851519e+00 6.79378022292361882783e-01 1.32026382727468094558e+00 6.79169987548142506384e-01 1.32106123443103529169e+00 6.79471444184207240546e-01 1.32095029913996153681e+00 6.79844986496252690067e-01 1.32108972823857873102e+00 6.80366142188992828466e-01 1.32074964742028977405e+00 6.81216280354920766804e-01 1.32033658986880908515e+00 6.82296149046510480574e-01 1.31966467270476250917e+00 6.83779758333393994363e-01 1.31858323143427824675e+00 6.86225276973123521351e-01 1.31640452843358990442e+00 6.90630234816699384304e-01 1.31107442181332478626e+00 7.01106652124017237782e-01 1.28028845912494571024e+00
23 1.00000000000000000000e+00 7.19319765395665444707e-01 1.29893497523067091848e+00 6.88618997403985244610e-01 1.30940338523535548809e+00 6.83276838798203445258e-01 1.31377559260620446757e+00 6.81133889570327610841e-01 1.31618913909470580670e+00 6.79998032593311374505e-01 1.31773045621684814499e+00 6.79355694287681499688e-01 1.31877006427443199676e+00 6.78985840888691405404e-01 1.31951264168118709286e+00 6.78816402085719361459e-01 1.32004904713007764627e+00 6.78874646796317260389e-01 1.32044538591367133229e+00 6.79075212184290788464e-01 1.32074529005908236634e+00 6.79262710027233818089e-01 1.32085499838695574759e+00 6.79675393604141975246e-01 1.32104356195644889738e+00 6.79798476521667360828e-01 1.32123255462840849539e+00 6.80554038038205910688e-01 1.32107059455615205579e+00 6.81263320326687571438e-01 1.32068270687837463484e+00 6.82051444468657508402e-01 1.32015554891950737115e+00 6.83931634773085272982e-01 1.31881010767230177905e+00 6.86249808904947133925e-01 1.31669275489347015196e+00 6.90588066367857966732e-01 1.31135358913266886205e+00 7.01057651798088654616e-01 1.28065974069888310893e+00
24 1.00000000000000000000e+00 7.19456140389086229447e-01 1.29894055592711832325e+00 6.88788973089356937329e-01 1.30941326223815068808e+00 6.83502934366702508129e-01 1.31375647924520300158e+00 6.81400548578117826182e-01 1.31616589794453942019e+00 6.80317896774655594960e-01 1.31768201398932105484e+00 6.79703919683761870196e-01 1.31872189707733644681e+00 6.79347894973334587299e-01 1.31944136367167952351e+00 6.79173018599706024290e-01 1.31996592151888081368e+00 6.79091868431751621848e-01 1.32032116269564281374e+00 6.79204541978122744439e-01 1.32052944312829367846e+00 6.79354797350152472823e-01 1.32075101216569135154e+00 6.79538943940511397379e-01 1.32080613848355654660e+00 6.79968552142105941982e-01 1.32079043638204174371e+00 6.80532530123768131247e-01 1.32065019195504107508e+00 6.81273893416180831295e-01 1.32034689412791550467e+00 6.82314764337937251781e-01 1.31975980324524488907e+00 6.83846916974786167565e-01 1.31869721559856323267e+00 6.86240934963685433878e-01 1.31660312059056305856e+00 6.90596927927236592382e-01 1.31131162585597516035e+00 7.01064311129720563187e-01 1.28062525498870960483e+00
25 1.00000000000000000000e+00 7.19471069952894892729e-01 1.29894331886700764578e+00 6.88811289725066000500e-01 1.30941010933809809380e+00 6.83532708584218773318e-01 1.31376534706924408269e+00 6.81435497745278784265e-01 1.31616992723070347360e+00 6.80364329662048739067e-01 1.31768497140543328072e+00 6.79762635472990317531e-01 1.31871222796744547168e+00 6.79423797030427989441e-01 1.31943729332465387039e+00 6.79255312205869321573e-01 1.31995770770090148361e+00 6.79213852089702418979e-01 1.32032762508213230568e+00 6.79276002010945401111e-01 1.32057320648978948618e+00 6.79421097666772499934e-01 1.32075224796703460939e+00 6.79674378983517679664e-01 1.32079985825931345289e+00 6.80046418275711883616e-01 1.32074961983549843403e+00 6.80566664162427170659e-01 1.32057188087443866387e+00 6.81287692163461744421e-01 1.32023163631048667810e+00 6.82313656149142855334e-01 1.31962803461793343196e+00 6.83826527677932283211e-01 1.31855617852830198089e+00 6.86234833199295124473e-01 1.31645911778710766882e+00 6.90589118149317671147e-01 1.31118221264696654949e+00 7.01055973142673427567e-01 1.28052462464768690431e+00
26 1.00000000000000000000e+00 7.19485666356139419442e-01 1.29894463621875866366e+00 6.88830987791041127188e-01 1.30941132918292413301e+00 6.83555540280559204014e-01 1.31376599307506158887e+00 6.81459334605243993721e-01 1.31617020797938466536e+00 6.80387750991907735987e-01 1.31768424541659978644e+00 6.79783248691629538030e-01 1.31871083213804962675e+00 6.79439812906357132327e-01 1.31943538798156367875e+00 6.79264884042082628390e-01 1.31995637655940867283e+00 6.79214610549760955394e-01 1.32032790818637546515e+00 6.79268357333465244707e-01 1.32058109936613643498e+00 6.79419251884506913974e-01 1.32073197753252902231e+00 6.79672577146265721737e-01 1.32078536835061477461e+00 6.80043957024910827869e-01 1.32073500101290641773e+00 6.80565032203356068408e-01 1.32055995446845497732e+00 6.81289869059110819727e-01 1.32021604375861545400e+00 6.82316172615605287533e-01 1.31961161870492493797e+00 6.83830251860052418245e-01 1.31854001386121510997e+00 6.86234040402347478249e-01 1.31644393398394154993e+00 6.90588582576258436241e-01 1.31116875978867053476e+00 7.01055507620968243465e-01 1.28051387649217374154e+00
27 1.00000000000000000000e+00 7.19487800763132678838e-01 1.29894475750167970318e+00 6.88833484331540124579e-01 1.30941151480253092920e+00 6.83558458250994371852e-01 1.31376595417299113500e+00 6.81462426817542543667e-01 1.31616961502591811595e+00 6.80390585860463525947e-01 1.31768355333793230066e+00 6.79785893609345492905e-01 1.31870972889150217533e+00 6.79441936486873343526e-01 1.31943445753822419242e+00 6.79266882704849916941e-01 1.31995522689610345068e+00 6.79216363015081259213e-01 1.32032664692801549045e+00 6.79269678270265964137e-01 1.32057970001517155367e+00 6.79420430307848155493e-01 1.32073045621218776446e+00 6.79673480596780454910e-01 1.32078372211661076996e+00 6.80044862945713646241e-01 1.32073312496757666601e+00 6.80565608290450430040e-01 1.32055802727578797118e+00 6.81290298496201818246e-01 1.32021404872233261152e+00 6.82316455373332853007e-01 1.31960936350661039995e+00 6.83830293316730286612e-01 1.31853758943065080267e+00 6.86234028443827415167e-01 1.31644150397901404936e+00 6.90588537356243259424e-01 1.31116627279457542699e+00 7.01055181580878317149e-01 1.28051204906630755609e+00
28 1.00000000000000000000e+00 7.19488379495376695338e-01 1.29894480697979886052e+00 6.88834334970783945806e-01 1.30941142061068616087e+00 6.83559156566001857591e-01 1.31376591480873639028e+00 6.81463090054253539662e-01 1.31616956562768505634e+00 6.80391289770424845251e-01 1.31768341672459410319e+00 6.79786534695068112022e-01 1.31870954245671523353e+00 6.79442464810928958840e-01 1.31943420668769251236e+00 6.79267302828112318203e-01 1.31995493543819852889e+00 6.79216716810624676626e-01 1.32032630430683028955e+00 6.79269980872595158239e-01 1.32057928287406212142e+00 6.79420722742948179906e-01 1.32073000692275477341e+00 6.79673722522006529267e-01 1.32078325238330274161e+00 6.80045097359814998406e-01 1.32073266758429030965e+00 6.80565836885115182930e-01 1.32055753946862464154e+00 6.81290497870804867553e-01 1.32021351359780791945e+00 6.82316593919075620178e-01 1.31960874816448603397e+00 6.83830507365384421270e-01 1.31853684501419343711e+00 6.86234103432452169358e-01 1.31644077854412611117e+00 6.90588478503018965426e-01 1.31116573726802054800e+00 7.01055190211172463144e-01 1.28051151285142839065e+00
