# tag norm j_0
20.800000 1.00000000000027156055e+00 3.57120725973949517361e-04
20.800000 1.00000000000027156055e+00 3.67840729851058795882e-04
20.800000 1.00000000000027156055e+00 6.19283641245985659075e-04
20.800000 1.00000000000027156055e+00 3.28535377847073207548e-04
20.800000 1.00000000000027156055e+00 -2.54168928653678461316e-04
20.800000 1.00000000000027156055e+00 -1.39434601101565136538e-04
20.800000 1.00000000000027156055e+00 -5.67829824288433747848e-05
20.800000 1.00000000000027156055e+00 5.07938350111821330891e-05
20.800000 1.00000000000027156055e+00 -2.55441429209681491151e-05
20.800000 1.00000000000027156055e+00 2.38356600935603896835e-05
20.800000 1.00000000000027156055e+00 -2.24984588521197086846e-05
20.800000 1.00000000000027156055e+00 5.03445229218317424533e-05
20.800000 1.00000000000027156055e+00 -4.90056626518290682783e-05
20.800000 1.00000000000027156055e+00 -1.44689910271512337924e-04
20.800000 1.00000000000027156055e+00 -2.60474459472709296819e-04
20.800000 1.00000000000027156055e+00 2.96720191007206462314e-04
20.800000 1.00000000000027156055e+00 6.24981456641347278558e-04
20.800000 1.00000000000027156055e+00 3.80584927229308904711e-04
20.800000 1.00000000000027156055e+00 3.72777417319974447348e-04
