# tag norm H
0.100000 1.00000000000000688338e+00 -1.03660158997642952272e+02
0.200000 9.99999999999999555911e-01 -1.03660158997976012074e+02
0.300000 9.99999999999997890576e-01 -1.03660158902943351222e+02
0.400000 9.99999999999999888978e-01 -1.03660158904037302818e+02
0.500000 1.00000000000000377476e+00 -1.03660158904199889207e+02
0.600000 9.99999999999996891376e-01 -1.03660159025025876645e+02
0.700000 1.00000000000000155431e+00 -1.03660159026461911935e+02
0.800000 1.00000000000000155431e+00 -1.03660159026482162403e+02
0.900000 9.99999999999996891376e-01 -1.03660158895718964800e+02
1.000000 9.99999999999997002398e-01 -1.03660158894418557907e+02
1.100000 1.00000000000000577316e+00 -1.03660158898161199659e+02
1.200000 9.99999999999999555911e-01 -1.03660159086429175090e+02
1.300000 1.00000000000000222045e+00 -1.03660159085106116095e+02
1.400000 9.99999999999996447286e-01 -1.03660159085375028098e+02
1.500000 9.99999999999995781153e-01 -1.03660158902141958492e+02
1.600000 1.00000000000000333067e+00 -1.03660158870253908958e+02
1.700000 1.00000000000000333067e+00 -1.03660158871509878509e+02
1.800000 1.00000000000000177636e+00 -1.03660159087317509830e+02
1.900000 1.00000000000000510703e+00 -1.03660159058842253899e+02
2.000000 1.00000000000000288658e+00 -1.03660159040492970917e+02
2.100000 1.00000000000000000000e+00 -1.03660158822050362915e+02
2.200000 1.00000000000000044409e+00 -1.03660158861946030129e+02
2.300000 9.99999999999997113420e-01 -1.03660158887317763288e+02
2.400000 9.99999999999987787547e-01 -1.03660159055147232721e+02
2.500000 9.99999999999995892175e-01 -1.03660158798244438572e+02
2.600000 9.99999999999992006394e-01 -1.03660158425615321676e+02
2.700000 9.99999999999997779554e-01 -1.03660157829538491114e+02
2.800000 9.99999999999997113420e-01 -1.03660157799680121116e+02
2.900000 9.99999999999996336264e-01 -1.03660158171928088677e+02
3.000000 9.99999999999999000799e-01 -1.03660158752937547888e+02
3.100000 1.00000000000000133227e+00 -1.03660158283281774061e+02
3.200000 9.99999999999992006394e-01 -1.03660156114302594688e+02
3.300000 9.99999999999994892974e-01 -1.03660152017046513606e+02
3.400000 1.00000000000000022204e+00 -1.03660147944241430196e+02
3.500000 9.99999999999993116617e-01 -1.03660146362298704048e+02
3.600000 9.99999999999994781952e-01 -1.03660149057599710432e+02
3.700000 1.00000000000000111022e+00 -1.03660153634800295208e+02
3.800000 1.00000000000000088818e+00 -1.03660153352299332141e+02
3.900000 9.99999999999993005595e-01 -1.03660139690825928938e+02
4.000000 9.99999999999989452881e-01 -1.03660110532244601700e+02
4.100000 9.99999999999993449684e-01 -1.03660075802853043569e+02
4.200000 9.99999999999998445688e-01 -1.03660056031679076227e+02
4.300000 1.00000000000000599520e+00 -1.03660067990315184261e+02
4.400000 1.00000000000000266454e+00 -1.03660104750892870129e+02
4.500000 9.99999999999995892175e-01 -1.03660124974502451778e+02
4.600000 9.99999999999994448885e-01 -1.03660070088447852754e+02
4.700000 9.99999999999994670929e-01 -1.03659909012985991694e+02
4.800000 1.00000000000000444089e+00 -1.03659685617159979643e+02
4.900000 1.00000000000001110223e+00 -1.03659520272300056831e+02
5.000000 1.00000000000000666134e+00 -1.03659536906589252681e+02
5.100000 1.00000000000000555112e+00 -1.03659742037707658824e+02
5.200000 1.00000000000001354472e+00 -1.03659947833931440186e+02
5.300000 1.00000000000000999201e+00 -1.03659836603053307158e+02
5.400000 1.00000000000000244249e+00 -1.03659183479109316295e+02
5.500000 1.00000000000001132427e+00 -1.03658109852233607739e+02
5.600000 1.00000000000001088019e+00 -1.03657146779238530598e+02
5.700000 1.00000000000001376677e+00 -1.03656948111799479761e+02
5.800000 1.00000000000000599520e+00 -1.03657744827959319878e+02
5.900000 1.00000000000001576517e+00 -1.03658917797836934938e+02
6.000000 1.00000000000001665335e+00 -1.03659145979346391186e+02
6.100000 1.00000000000001620926e+00 -1.03657262627980330194e+02
6.200000 1.00000000000002153833e+00 -1.03653356044611996367e+02
6.300000 1.00000000000001287859e+00 -1.03649224300490431006e+02
6.400000 1.00000000000001465494e+00 -1.03647493690795826637e+02
6.500000 1.00000000000001643130e+00 -1.03649634576122466001e+02
6.600000 1.00000000000001176836e+00 -1.03654208680687517585e+02
6.700000 1.00000000000001354472e+00 -1.03657006872124810570e+02
6.800000 1.00000000000001176836e+00 -1.03653631635176395775e+02
6.900000 1.00000000000001909584e+00 -1.03643130263750080644e+02
7.000000 1.00000000000008060219e+00 -1.03629954844031090033e+02
7.100000 1.00000000000007127632e+00 -1.03622043351350143325e+02
7.200000 1.00000000000004596323e+00 -1.03625295135371061406e+02
7.300000 1.00000000000003974598e+00 -1.03637969246545935675e+02
7.400000 1.00000000000004729550e+00 -1.03649836720698388604e+02
7.500000 1.00000000000004618528e+00 -1.03648178462377714482e+02
7.600000 1.00000000000003885781e+00 -1.03627396830702835473e+02
7.700000 1.00000000000004329870e+00 -1.03595490181199721746e+02
7.800000 1.00000000000004418688e+00 -1.03571324430166569641e+02
7.900000 1.00000000000005906386e+00 -1.03571996109503885464e+02
8.000000 1.00000000000005329071e+00 -1.03598206074178577296e+02
8.100000 1.00000000000005351275e+00 -1.03630401119863250869e+02
8.200000 1.00000000000005040413e+00 -1.03640896324335997747e+02
8.300000 1.00000000000004929390e+00 -1.03613498346703750030e+02
8.400000 1.00000000000003552714e+00 -1.03557060754446439432e+02
8.500000 1.00000000000002131628e+00 -1.03503865508470681789e+02
8.600000 1.00000000000003486100e+00 -1.03489948052194932870e+02
8.700000 1.00000000000003463896e+00 -1.03526858428926644251e+02
8.800000 1.00000000000004662937e+00 -1.03588252235442567439e+02
8.900000 1.00000000000005506706e+00 -1.03626470357596105032e+02
9.000000 1.00000000000007371881e+00 -1.03606134229818110271e+02
9.100000 1.00000000000006772360e+00 -1.03530230755040250301e+02
9.200000 1.00000000000007083223e+00 -1.03443501657860792875e+02
9.300000 1.00000000000008060219e+00 -1.03405804324448695297e+02
9.400000 1.00000000000008926193e+00 -1.03445658316415233458e+02
9.500000 1.00000000000008593126e+00 -1.03533899542989573206e+02
9.600000 1.00000000000007838175e+00 -1.03606530991292856925e+02
9.700000 1.00000000000008104628e+00 -1.03612229561303863079e+02
9.800000 1.00000000000007260859e+00 -1.03543283333186863615e+02
9.900000 1.00000000000007061018e+00 -1.03440738936148633798e+02
10.000000 1.00000000000005684342e+00 -1.03373882501370715659e+02
10.100000 1.00000000000003641532e+00 -1.03391993987918880293e+02
10.200000 1.00000000000004862777e+00 -1.03481965877440060808e+02
10.300000 1.00000000000005107026e+00 -1.03578438989469958642e+02
10.400000 1.00000000000006639134e+00 -1.03616115337221657455e+02
10.500000 1.00000000000008260059e+00 -1.03573445683670797735e+02
10.600000 1.00000000000009281464e+00 -1.03483364577102491921e+02
10.700000 1.00000000000009481305e+00 -1.03412049224679492454e+02
10.800000 1.00000000000006350476e+00 -1.03412085920475533385e+02
10.900000 1.00000000000005351275e+00 -1.03481973080454210390e+02
11.000000 1.00000000000004862777e+00 -1.03571502335479863177e+02
11.100000 1.00000000000003774758e+00 -1.03624389861134361013e+02
11.200000 1.00000000000004729550e+00 -1.03614886771135104482e+02
11.300000 1.00000000000005462297e+00 -1.03558223411103924150e+02
11.400000 1.00000000000005706546e+00 -1.03498989315044184423e+02
11.500000 1.00000000000007061018e+00 -1.03481412928482527036e+02
11.600000 1.00000000000007172041e+00 -1.03517427655692543453e+02
11.700000 1.00000000000008637535e+00 -1.03580287990012863020e+02
11.800000 1.00000000000007949197e+00 -1.03628957604915754587e+02
11.900000 1.00000000000006417089e+00 -1.03638562761702800685e+02
12.000000 1.00000000000005306866e+00 -1.03613588408856500678e+02
12.100000 1.00000000000005018208e+00 -1.03579808024770656516e+02
12.200000 1.00000000000004396483e+00 -1.03564189311360323131e+02
12.300000 1.00000000000004729550e+00 -1.03577103522443366046e+02
12.400000 1.00000000000010391688e+00 -1.03608482981933732958e+02
12.500000 1.00000000000011279866e+00 -1.03638185177798050063e+02
12.600000 1.00000000000013455903e+00 -1.03650751272088655242e+02
12.700000 1.00000000000013500312e+00 -1.03644293341036060951e+02
12.800000 1.00000000000014765966e+00 -1.03629242102868502684e+02
12.900000 1.00000000000015276669e+00 -1.03619315724426087399e+02
13.000000 1.00000000000014788171e+00 -1.03621812715485049239e+02
13.100000 1.00000000000014899193e+00 -1.03634153762836263013e+02
13.200000 1.00000000000014899193e+00 -1.03647946170775284713e+02
13.300000 1.00000000000015987212e+00 -1.03655872515760023589e+02
13.400000 1.00000000000015432100e+00 -1.03655952535310149187e+02
13.500000 1.00000000000013788970e+00 -1.03651316681464876979e+02
13.600000 1.00000000000012279067e+00 -1.03647030125292786806e+02
13.700000 1.00000000000011679546e+00 -1.03646560788879781967e+02
13.800000 1.00000000000009858780e+00 -1.03649999586333791513e+02
13.900000 1.00000000000010036416e+00 -1.03654827611993880510e+02
14.000000 1.00000000000009481305e+00 -1.03658255408011328313e+02
14.100000 1.00000000000010902390e+00 -1.03659140757503791974e+02
14.200000 1.00000000000011834977e+00 -1.03658219606895471543e+02
14.300000 1.00000000000011635137e+00 -1.03657009247477546410e+02
14.400000 1.00000000000011124435e+00 -1.03656612896667553514e+02
14.500000 1.00000000000011679546e+00 -1.03657237938430299096e+02
14.600000 1.00000000000012745360e+00 -1.03658401657965583809e+02
14.700000 1.00000000000014055423e+00 -1.03659422505415065530e+02
14.800000 1.00000000000014632739e+00 -1.03659871751709260934e+02
14.900000 1.00000000000015920598e+00 -1.03659780318598308213e+02
15.000000 1.00000000000015853985e+00 -1.03659503306097192876e+02
15.100000 1.00000000000016320278e+00 -1.03659380607909227479e+02
15.200000 1.00000000000015965007e+00 -1.03659503209726764794e+02
15.300000 1.00000000000016675550e+00 -1.03659750313611425554e+02
15.400000 1.00000000000016875390e+00 -1.03659968416326393026e+02
15.500000 1.00000000000018762769e+00 -1.03660083150306334687e+02
15.600000 1.00000000000019961810e+00 -1.03660097119264918319e+02
15.700000 1.00000000000020983215e+00 -1.03660053143063223047e+02
15.800000 1.00000000000021094237e+00 -1.03660008511113133522e+02
15.900000 1.00000000000019761970e+00 -1.03660005911053914929e+02
16.000000 1.00000000000019850788e+00 -1.03660046210404175326e+02
16.100000 1.00000000000020139446e+00 -1.03660095853500237695e+02
16.200000 1.00000000000020561330e+00 -1.03660125065732870553e+02
16.300000 1.00000000000020605739e+00 -1.03660131744519063091e+02
16.400000 1.00000000000020028423e+00 -1.03660129525436929043e+02
16.500000 1.00000000000020516921e+00 -1.03660126897173512361e+02
16.600000 1.00000000000021027624e+00 -1.03660124538433734642e+02
16.700000 1.00000000000021826985e+00 -1.03660123404699163530e+02
16.800000 1.00000000000022049029e+00 -1.03660125695585520589e+02
16.900000 1.00000000000022382096e+00 -1.03660130151882526661e+02
17.000000 1.00000000000022359892e+00 -1.03660132877609456159e+02
17.100000 1.00000000000024047431e+00 -1.03660132779817075743e+02
17.200000 1.00000000000023869795e+00 -1.03660132406331527477e+02
17.300000 1.00000000000025268676e+00 -1.03660133528169779993e+02
17.400000 1.00000000000025712765e+00 -1.03660135030345614382e+02
17.500000 1.00000000000025690561e+00 -1.03660135421803673239e+02
17.600000 1.00000000000026334490e+00 -1.03660134998980879573e+02
17.700000 1.00000000000024735769e+00 -1.03660134765019108727e+02
17.800000 1.00000000000023492319e+00 -1.03660134807331317575e+02
17.900000 1.00000000000024713565e+00 -1.03660134623294140965e+02
18.000000 1.00000000000024780178e+00 -1.03660134278151289777e+02
18.100000 1.00000000000024646951e+00 -1.03660134252592996518e+02
18.200000 1.00000000000024624747e+00 -1.03660134591962034278e+02
18.300000 1.00000000000024291680e+00 -1.03660134885715336850e+02
18.400000 1.00000000000022559732e+00 -1.03660134941271991238e+02
18.500000 1.00000000000023225866e+00 -1.03660134906834656476e+02
18.600000 1.00000000000024114044e+00 -1.03660134929837965956e+02
18.700000 1.00000000000023603342e+00 -1.03660134948446540193e+02
18.800000 1.00000000000024380498e+00 -1.03660134871025732650e+02
18.900000 1.00000000000024802382e+00 -1.03660134758292883816e+02
19.000000 1.00000000000024047431e+00 -1.03660134734995182271e+02
19.100000 1.00000000000023403501e+00 -1.03660134775270179830e+02
19.200000 1.00000000000022937208e+00 -1.03660134801603874166e+02
19.300000 1.00000000000023625546e+00 -1.03660134805398712388e+02
19.400000 1.00000000000024025226e+00 -1.03660134798266810208e+02
19.500000 1.00000000000023270275e+00 -1.03660134795109826200e+02
19.600000 1.00000000000023403501e+00 -1.03660134804975712086e+02
19.700000 1.00000000000024846791e+00 -1.03660134801857765297e+02
19.800000 1.00000000000024313884e+00 -1.03660134793683837984e+02
19.900000 1.00000000000024025226e+00 -1.03660134794796931601e+02
20.000000 1.00000000000025690561e+00 -1.03660134776703429793e+02
20.100000 1.00000000000024868996e+00 -1.03660134749791467357e+02
20.200000 1.00000000000025890401e+00 -1.03660134746149751095e+02
20.300000 1.00000000000025757174e+00 -1.03660134753200168234e+02
20.400000 1.00000000000026534330e+00 -1.03660134763362265176e+02
20.500000 1.00000000000025868196e+00 -1.03660134768321142928e+02
20.600000 1.00000000000025646152e+00 -1.03660134746084381163e+02
20.700000 1.00000000000026356695e+00 -1.03660134719191347585e+02
20.800000 1.00000000000027022828e+00 -1.03660134718211111249e+02
20.900000 1.00000000000027822189e+00 -1.03660134726476343303e+02
21.000000 1.00000000000027666758e+00 -1.03660134734355679598e+02
21.100000 1.00000000000027045033e+00 -1.03660134736177070636e+02
21.200000 1.00000000000027222669e+00 -1.03660134713930190742e+02
21.300000 1.00000000000027999825e+00 -1.03660134691088615000e+02
21.400000 1.00000000000027244873e+00 -1.03660134690398635371e+02
21.500000 1.00000000000027888802e+00 -1.03660134702436948828e+02
21.600000 1.00000000000027267077e+00 -1.03660134712376262200e+02
21.700000 1.00000000000028022029e+00 -1.03660134715851469878e+02
21.800000 1.00000000000028466118e+00 -1.03660134691441101040e+02
21.900000 1.00000000000028288483e+00 -1.03660134676605153459e+02
22.000000 1.00000000000026845193e+00 -1.03660134676551209054e+02
22.100000 1.00000000000026045832e+00 -1.03660134689880706560e+02
22.200000 1.00000000000024558133e+00 -1.03660134701308649596e+02
22.300000 1.00000000000025490721e+00 -1.03660134705613543815e+02
22.400000 1.00000000000026223468e+00 -1.03660134687454302593e+02
22.500000 1.00000000000027022828e+00 -1.03660134684536117788e+02
22.600000 1.00000000000026134650e+00 -1.03660134686711870700e+02
22.700000 1.00000000000025801583e+00 -1.03660134700549207309e+02
22.800000 1.00000000000025113245e+00 -1.03660134713983637766e+02
22.900000 1.00000000000025957014e+00 -1.03660134718043792645e+02
23.000000 1.00000000000025268676e+00 -1.03660134712270576074e+02
23.100000 1.00000000000025823788e+00 -1.03660134717543584770e+02
23.200000 1.00000000000025091040e+00 -1.03660134721904313437e+02
23.300000 1.00000000000024313884e+00 -1.03660134736130885358e+02
23.400000 1.00000000000023936408e+00 -1.03660134751533391295e+02
23.500000 1.00000000000024269475e+00 -1.03660134761908324208e+02
23.600000 1.00000000000022226665e+00 -1.03660134758690759327e+02
23.700000 1.00000000000024291680e+00 -1.03660134768463635169e+02
23.800000 1.00000000000022981617e+00 -1.03660134773329247082e+02
23.900000 1.00000000000023536728e+00 -1.03660134790875957833e+02
24.000000 1.00000000000022937208e+00 -1.03660134806241217120e+02
24.100000 1.00000000000021405100e+00 -1.03660134817640070537e+02
24.200000 1.00000000000020428104e+00 -1.03660134815493705673e+02
24.300000 1.00000000000020383695e+00 -1.03660134827496264620e+02
24.400000 1.00000000000020672353e+00 -1.03660134832873310984e+02
24.500000 1.00000000000019806379e+00 -1.03660134851972443926e+02
24.600000 1.00000000000021249669e+00 -1.03660134865707263430e+02
24.700000 1.00000000000018762769e+00 -1.03660134876517304292e+02
24.800000 1.00000000000020938806e+00 -1.03660134876931962822e+02
24.900000 1.00000000000019806379e+00 -1.03660134889676427861e+02
25.000000 1.00000000000021338487e+00 -1.03660134895615058781e+02
25.100000 1.00000000000020650148e+00 -1.03660134916577277409e+02
25.200000 1.00000000000020206059e+00 -1.03660134929342547139e+02
25.300000 1.00000000000021826985e+00 -1.03660134937537293354e+02
25.400000 1.00000000000021627145e+00 -1.03660134939465564230e+02
25.500000 1.00000000000023336888e+00 -1.03660134953182094364e+02
25.600000 1.00000000000022692959e+00 -1.03660134957861899352e+02
25.700000 1.00000000000023825386e+00 -1.03660134979782142750e+02
25.800000 1.00000000000024247271e+00 -1.03660134992226232953e+02
25.900000 1.00000000000023669955e+00 -1.03660135000425384533e+02
26.000000 1.00000000000025135449e+00 -1.03660135004812843817e+02
26.100000 1.00000000000024713565e+00 -1.03660135017798708645e+02
26.200000 1.00000000000024158453e+00 -1.03660135022764194446e+02
26.300000 1.00000000000026023628e+00 -1.03660135045277741028e+02
26.400000 1.00000000000024624747e+00 -1.03660135055962953743e+02
26.500000 1.00000000000024313884e+00 -1.03660135062408812701e+02
26.600000 1.00000000000024047431e+00 -1.03660135068931865021e+02
26.700000 1.00000000000024868996e+00 -1.03660135081759406717e+02
26.800000 1.00000000000025313085e+00 -1.03660135087035683910e+02
26.900000 1.00000000000026467717e+00 -1.03660135110282212167e+02
27.000000 1.00000000000025579538e+00 -1.03660135120694647526e+02
27.100000 1.00000000000027555735e+00 -1.03660135128295991080e+02
27.200000 1.00000000000027311486e+00 -1.03660135131896026905e+02
27.300000 1.00000000000028332892e+00 -1.03660135143823083581e+02
27.400000 1.00000000000029309888e+00 -1.03660135152699922401e+02
27.500000 1.00000000000030597747e+00 -1.03660135176413774616e+02
27.600000 1.00000000000031019631e+00 -1.03660135188202744416e+02
27.700000 1.00000000000031707970e+00 -1.03660135193195742431e+02
27.800000 1.00000000000032995828e+00 -1.03660135194879018172e+02
27.900000 1.00000000000032973624e+00 -1.03660135207296107751e+02
28.000000 1.00000000000033129055e+00 -1.03660135218303565807e+02
28.100000 1.00000000000031241676e+00 -1.03660135239098110560e+02
28.200000 1.00000000000031996628e+00 -1.03660135249897265908e+02
28.300000 1.00000000000032329694e+00 -1.03660135254631128987e+02
28.400000 1.00000000000032684966e+00 -1.03660135258735124353e+02
28.500000 1.00000000000033950620e+00 -1.03660135271184458361e+02
28.600000 1.00000000000032751579e+00 -1.03660135283695296948e+02
28.700000 1.00000000000031841196e+00 -1.03660135303994010769e+02
28.800000 1.00000000000031619152e+00 -1.03660135312360480953e+02
28.900000 1.00000000000031730174e+00 -1.03660135316785030568e+02
29.000000 1.00000000000029443115e+00 -1.03660135321544899512e+02
29.100000 1.00000000000030064840e+00 -1.03660135334413098462e+02
29.200000 1.00000000000029576341e+00 -1.03660135347434035680e+02
29.300000 1.00000000000028821390e+00 -1.03660135367134643047e+02
29.400000 1.00000000000029665159e+00 -1.03660135374867351743e+02
29.500000 1.00000000000029998226e+00 -1.03660135377925783473e+02
29.600000 1.00000000000029931613e+00 -1.03660135383493809513e+02
29.700000 1.00000000000028332892e+00 -1.03660135395901150446e+02
29.800000 1.00000000000028155256e+00 -1.03660135409662586881e+02
29.900000 1.00000000000027000624e+00 -1.03660135427103924144e+02
30.000000 1.00000000000025290881e+00 -1.03660135433938421556e+02
