# tag norm j_0
29.800000 1.00000000000028133051e+00 -1.31444779629033895157e-04
29.800000 1.00000000000028133051e+00 -2.09656019208441382964e-04
29.800000 1.00000000000028133051e+00 -3.06851918240295181307e-04
29.800000 1.00000000000028133051e+00 -5.97206834287365945051e-04
29.800000 1.00000000000028133051e+00 -2.11617309013574104917e-04
29.800000 1.00000000000028133051e+00 -6.53402121272895998125e-04
29.800000 1.00000000000028133051e+00 3.14028710281548525344e-04
29.800000 1.00000000000028133051e+00 1.57049527984281736158e-04
29.800000 1.00000000000028133051e+00 2.77288230704532347084e-04
29.800000 1.00000000000028133051e+00 -4.22031680165224556012e-04
29.800000 1.00000000000028133051e+00 2.72764762784976613676e-04
29.800000 1.00000000000028133051e+00 1.61764412878747011358e-04
29.800000 1.00000000000028133051e+00 3.49875679090047792333e-04
29.800000 1.00000000000028133051e+00 -6.20205092170938716671e-04
29.800000 1.00000000000028133051e+00 -2.10802222464687275027e-04
29.800000 1.00000000000028133051e+00 -5.80144515794045055775e-04
29.800000 1.00000000000028133051e+00 -3.15949054880043211490e-04
29.800000 1.00000000000028133051e+00 -2.18390080120713043826e-04
29.800000 1.00000000000028133051e+00 -1.45826479006069017856e-04
