# tag norm j_0
0.100000 1.00000000000000510703e+00 4.04347051635095854760e-08
0.100000 1.00000000000000510703e+00 -1.13686199556401871330e-07
0.100000 1.00000000000000510703e+00 1.76123494795064842393e-07
0.100000 1.00000000000000510703e+00 -2.23279789754562996139e-07
0.100000 1.00000000000000510703e+00 2.47145453307137491123e-07
0.100000 1.00000000000000510703e+00 -2.41271116505681489446e-07
0.100000 1.00000000000000510703e+00 2.54311641945706279429e-07
0.100000 1.00000000000000510703e+00 -2.40356294784905058679e-07
0.100000 1.00000000000000510703e+00 2.51924210992950751190e-07
0.100000 1.00000000000000510703e+00 -2.41332936619506411862e-07
0.100000 1.00000000000000510703e+00 2.53292470288265985018e-07
0.100000 1.00000000000000510703e+00 -2.40461750762140200912e-07
0.100000 1.00000000000000510703e+00 2.54306916376069593949e-07
0.100000 1.00000000000000510703e+00 -2.39200792843299846924e-07
0.100000 1.00000000000000510703e+00 2.57822632672203262837e-07
0.100000 1.00000000000000510703e+00 -2.42036681730011209281e-07
0.100000 1.00000000000000510703e+00 2.49300161943530690042e-07
0.100000 1.00000000000000510703e+00 -6.74843140775702960918e-08
0.100000 1.00000000000000510703e+00 1.93322122457253168667e-07
