# tag norm j_0
19.700000 1.00000000000001065814e+00 2.12491682561914170665e-04
19.700000 1.00000000000001065814e+00 4.65076541773787037362e-05
19.700000 1.00000000000001065814e+00 -1.31245711858198277561e-04
19.700000 1.00000000000001065814e+00 -5.81009653354299759713e-04
19.700000 1.00000000000001065814e+00 -1.35373816970847600559e-04
19.700000 1.00000000000001065814e+00 -5.90154414778266381454e-04
19.700000 1.00000000000001065814e+00 -1.47722420021242917265e-04
19.700000 1.00000000000001065814e+00 2.55417164541314971446e-05
19.700000 1.00000000000001065814e+00 1.95744038857444580155e-04
