# tag norm j_0
16.900000 1.00000000000002464695e+00 -1.97207737874403833331e-03
16.900000 1.00000000000002464695e+00 -6.19919646479688157028e-06
16.900000 1.00000000000002464695e+00 -8.43572473014033330681e-04
16.900000 1.00000000000002464695e+00 9.17670050139089970177e-05
16.900000 1.00000000000002464695e+00 -8.20549668847136157504e-04
16.900000 1.00000000000002464695e+00 1.72541567936369361026e-04
16.900000 1.00000000000002464695e+00 -7.81871972379271674980e-04
16.900000 1.00000000000002464695e+00 1.94806216415505773594e-04
16.900000 1.00000000000002464695e+00 -7.89432708999500453231e-04
16.900000 1.00000000000002464695e+00 2.06860279159258895554e-04
16.900000 1.00000000000002464695e+00 -7.99629570001782153874e-04
16.900000 1.00000000000002464695e+00 2.00953003173678088674e-04
16.900000 1.00000000000002464695e+00 -8.17137898921834978684e-04
16.900000 1.00000000000002464695e+00 1.98615749323062008858e-04
16.900000 1.00000000000002464695e+00 -8.77092963112785918393e-04
16.900000 1.00000000000002464695e+00 1.41755754621095808989e-04
16.900000 1.00000000000002464695e+00 -9.20563474086100565555e-04
16.900000 1.00000000000002464695e+00 6.39786069853686274441e-05
16.900000 1.00000000000002464695e+00 -2.02195234201309973626e-03
