# tag norm n_up_hub[0] n_up_hub[1] n_up_hub[2] n_up_hub[3] n_up_hub[4] n_up_hub[5] n_up_hub[6] n_up_hub[7]
1 1.00000000000000000000e+00 4.20447298368126387569e-01 5.44733589326319433965e-01 2.00332847611948750011e-01 8.19666241611481272145e-01 8.17475500730276194439e-01 8.29576766735039772271e-01 2.50718508082227509171e-01 1.17049247534574338281e-01
2 1.00000000000000000000e+00 3.78556330896766712879e-01 5.97995562394112778470e-01 2.81585007328305873819e-02 8.69488236079225873532e-01 8.97207896298687912484e-01 9.96884471503862612529e-01 2.13527283957756386368e-01 1.81817181367613135701e-02
3 1.00000000000000000000e+00 2.05806100296611060863e-01 7.51708515743787164531e-01 1.55954295065618697702e-01 8.48595334572834092413e-01 3.63713028867125920396e-01 6.87695647046448144124e-01 5.91076324077463022277e-01 3.95450754330113951607e-01
4 1.00000000000000000000e+00 2.69422501352948484676e-01 7.12604550907481426592e-01 2.62576343833041792042e-01 7.40846941980129347627e-01 3.40145547591613750527e-01 6.86007001203931543465e-01 4.18798454944974585246e-01 5.69598658185885842187e-01
5 1.00000000000000000000e+00 3.10936864422677927688e-01 6.84052881342124718955e-01 3.11238329278639813680e-01 6.94080095065563007495e-01 3.46517355058158893488e-01 6.62229675117664617900e-01 3.62393546870455662834e-01 6.28551252844710695022e-01
6 1.00000000000000000000e+00 3.57278526186864842096e-01 6.51224486335539309856e-01 3.40407896808091525731e-01 6.58868538771043454894e-01 3.46302135296684410193e-01 6.55732764708421567157e-01 3.55415387496098356124e-01 6.34770264397254369015e-01
7 1.00000000000000000000e+00 3.59698542612398697305e-01 6.49822323765660736505e-01 3.46086955790558259416e-01 6.54457460745360708465e-01 3.46625473290218866218e-01 6.53233770985812700616e-01 3.50905424363897266993e-01 6.39170048446088046035e-01
8 1.00000000000000000000e+00 3.60942074986378313994e-01 6.49096164746390980049e-01 3.46996553567292864706e-01 6.53327460333452236796e-01 3.46646342176194222073e-01 6.53021669820106231974e-01 3.50942694484734807325e-01 6.39027039885438408184e-01
9 1.00000000000000000000e+00 3.61087609788058205851e-01 6.48996201035075492847e-01 3.47125186574570976372e-01 6.53229623671885639702e-01 3.46759290676361131567e-01 6.52881300290668820097e-01 3.50993236511459250071e-01 6.38927551451921482695e-01
10 1.00000000000000000000e+00 3.61093370624382070666e-01 6.48993314871930460086e-01 3.47134338810164588818e-01 6.53223788136755190159e-01 3.46771573491625850760e-01 6.52868342452707417500e-01 3.51001473816546782913e-01 6.38913797795897409060e-01
