# tag norm BO
1 1.00000000000000000000e+00 -3.15219425761117319484e-02
2 1.00000000000000000000e+00 -8.24639563130789704504e-02
3 1.00000000000000000000e+00 -1.15690676156886496084e-01
4 1.00000000000000000000e+00 -8.62427583807293396401e-02
5 1.00000000000000000000e+00 -4.92883565814227764257e-02
6 1.00000000000000000000e+00 -8.73976242190841606794e-03
7 1.00000000000000000000e+00 2.53859120141184044228e-02
8 1.00000000000000000000e+00 2.45809075016204629793e-02
9 1.00000000000000000000e+00 1.27823959049492355544e-02
10 1.00000000000000000000e+00 1.79580126401449480938e-03
11 1.00000000000000000000e+00 -3.42253205768069043713e-02
12 1.00000000000000000000e+00 -2.32590890910453727825e-02
13 1.00000000000000000000e+00 5.17260485425101723678e-02
14 1.00000000000000000000e+00 -1.12106523818591347075e-01
15 1.00000000000000000000e+00 -8.28292507265156185969e-02
16 1.00000000000000000000e+00 -6.66229039811432142276e-03
17 1.00000000000000000000e+00 1.32909533832358400796e-01
18 1.00000000000000000000e+00 2.50937448507671412301e-01
19 1.00000000000000000000e+00 2.83428402504009302465e-01
20 1.00000000000000000000e+00 2.89420138562761275480e-01
21 1.00000000000000000000e+00 2.88315894083301660356e-01
22 1.00000000000000000000e+00 2.86689506876218858089e-01
23 1.00000000000000000000e+00 2.86376715937689263480e-01
24 1.00000000000000000000e+00 2.86325282900024735699e-01
25 1.00000000000000000000e+00 2.86318127620401818856e-01
26 1.00000000000000000000e+00 2.86316339254661655911e-01
