# tag norm j_0
13.300000 1.00000000000001221245e+00 -1.28971460712194507803e-01
13.300000 1.00000000000001221245e+00 5.72315525206945098502e-03
13.300000 1.00000000000001221245e+00 1.28319623251015368925e-01
13.300000 1.00000000000001221245e+00 6.94891524166925539374e-02
13.300000 1.00000000000001221245e+00 -1.28306590024467759292e-01
13.300000 1.00000000000001221245e+00 6.86102641365990001399e-02
13.300000 1.00000000000001221245e+00 1.28477139693051911618e-01
13.300000 1.00000000000001221245e+00 5.67140106955843319170e-03
13.300000 1.00000000000001221245e+00 -1.30883771075641891501e-01
