# tag norm j_0
27.000000 1.00000000000002819966e+00 -1.03943928157843576421e-01
27.000000 1.00000000000002819966e+00 3.80747224912627918111e-03
27.000000 1.00000000000002819966e+00 -3.56469959157549587392e-02
27.000000 1.00000000000002819966e+00 -4.27364055956780397594e-02
27.000000 1.00000000000002819966e+00 1.61975336386562779323e-01
27.000000 1.00000000000002819966e+00 -4.20454350749680169641e-02
27.000000 1.00000000000002819966e+00 -3.64165632398612965082e-02
27.000000 1.00000000000002819966e+00 3.83914973861198671051e-03
27.000000 1.00000000000002819966e+00 -1.03162658462276110583e-01
