# tag norm j_0
9.200000 1.00000000000000799361e+00 2.26256361542249984087e-01
9.200000 1.00000000000000799361e+00 3.82641270549747697372e-02
9.200000 1.00000000000000799361e+00 5.50324954232212365524e-02
9.200000 1.00000000000000799361e+00 3.25172096910497643307e-02
9.200000 1.00000000000000799361e+00 1.06145343069883532627e-01
9.200000 1.00000000000000799361e+00 3.27060091947025746717e-02
9.200000 1.00000000000000799361e+00 5.54956837230367039382e-02
9.200000 1.00000000000000799361e+00 3.80004027570954514004e-02
9.200000 1.00000000000000799361e+00 2.27040689348792040780e-01
