# tag norm H
0.100000 9.99999999999993893773e-01 -1.65968973701081409899e+02
0.200000 9.99999999999990785149e-01 -1.65968973701677953159e+02
0.300000 9.99999999999988120614e-01 -1.65968973530698150398e+02
0.400000 9.99999999999988342658e-01 -1.65968973532698981899e+02
0.500000 9.99999999999981903365e-01 -1.65968973536740833197e+02
0.600000 9.99999999999994670929e-01 -1.65968973740408841877e+02
0.700000 9.99999999999996114219e-01 -1.65968973746629700372e+02
0.800000 9.99999999999975131004e-01 -1.65968973746591444751e+02
0.900000 9.99999999999979127807e-01 -1.65968973519334667799e+02
1.000000 9.99999999999974575893e-01 -1.65968973514101776345e+02
1.100000 9.99999999999990230037e-01 -1.65968973531406561506e+02
1.200000 9.99999999999985789145e-01 -1.65968973855510199655e+02
1.300000 9.99999999999978572696e-01 -1.65968973854503360599e+02
1.400000 9.99999999999961919350e-01 -1.65968973855927941941e+02
1.500000 9.99999999999960142993e-01 -1.65968973543398533366e+02
1.600000 9.99999999999945266005e-01 -1.65968973514935385083e+02
1.700000 9.99999999999914179760e-01 -1.65968973509846421166e+02
1.800000 9.99999999999912403403e-01 -1.65968973891537956433e+02
1.900000 9.99999999999913624649e-01 -1.65968973845653891885e+02
2.000000 9.99999999999917066340e-01 -1.65968973808828820893e+02
2.100000 9.99999999999918731675e-01 -1.65968973437433390927e+02
2.200000 9.99999999999914068738e-01 -1.65968973475458398070e+02
2.300000 9.99999999999909738868e-01 -1.65968973519577787101e+02
2.400000 9.99999999999908739667e-01 -1.65968973809011004050e+02
2.500000 9.99999999999901856285e-01 -1.65968973391129424044e+02
2.600000 9.99999999999885202939e-01 -1.65968972798568529470e+02
2.700000 9.99999999999891420188e-01 -1.65968971848302970784e+02
2.800000 9.99999999999892752456e-01 -1.65968971784574222283e+02
2.900000 9.99999999999895194946e-01 -1.65968972355622071291e+02
3.000000 9.99999999999903521619e-01 -1.65968973320080522171e+02
3.100000 9.99999999999925615057e-01 -1.65968972579679132195e+02
3.200000 9.99999999999931721284e-01 -1.65968969120685471808e+02
3.300000 9.99999999999938049555e-01 -1.65968962387255714930e+02
3.400000 9.99999999999935273998e-01 -1.65968955681064159080e+02
3.500000 9.99999999999948263607e-01 -1.65968953075576223455e+02
3.600000 9.99999999999952260410e-01 -1.65968957487870540035e+02
3.700000 9.99999999999952260410e-01 -1.65968965007664195355e+02
3.800000 9.99999999999958033570e-01 -1.65968964805588115041e+02
3.900000 9.99999999999948929741e-01 -1.65968943099651539796e+02
4.000000 9.99999999999952260410e-01 -1.65968896054181072941e+02
4.100000 9.99999999999947708496e-01 -1.65968839143160124650e+02
4.200000 9.99999999999955146990e-01 -1.65968805767210596969e+02
4.300000 9.99999999999966915354e-01 -1.65968824062801758146e+02
4.400000 9.99999999999960476060e-01 -1.65968883858453153834e+02
4.500000 9.99999999999962252417e-01 -1.65968918250232462697e+02
4.600000 9.99999999999956035168e-01 -1.65968831542505313337e+02
4.700000 9.99999999999948707696e-01 -1.65968572261966016868e+02
4.800000 9.99999999999952482455e-01 -1.65968209705979205637e+02
4.900000 9.99999999999969357845e-01 -1.65967937401367350958e+02
5.000000 9.99999999999964028774e-01 -1.65967957563315366087e+02
5.100000 9.99999999999960809127e-01 -1.65968286549938568442e+02
5.200000 9.99999999999955369034e-01 -1.65968625646106517024e+02
5.300000 9.99999999999967026376e-01 -1.65968457611433962029e+02
5.400000 9.99999999999987343458e-01 -1.65967406630476887130e+02
5.500000 9.99999999999975131004e-01 -1.65965658813597428889e+02
5.600000 9.99999999999972355447e-01 -1.65964075273022444890e+02
5.700000 9.99999999999966915354e-01 -1.65963728471027394562e+02
5.800000 9.99999999999976130205e-01 -1.65965009780973787201e+02
5.900000 9.99999999999963251618e-01 -1.65966929346277566992e+02
6.000000 1.00000000000000222045e+00 -1.65967347902668080906e+02
6.100000 9.99999999999985011989e-01 -1.65964353872642561782e+02
6.200000 1.00000000000000000000e+00 -1.65958044862643760098e+02
6.300000 9.99999999999999888978e-01 -1.65951289153673457122e+02
6.400000 1.00000000000004019007e+00 -1.65948348265490636777e+02
6.500000 1.00000000000005817569e+00 -1.65951691354831922354e+02
6.600000 1.00000000000003419487e+00 -1.65959103572640515267e+02
6.700000 1.00000000000004951595e+00 -1.65963788706795611461e+02
6.800000 1.00000000000007038814e+00 -1.65958484157745346010e+02
6.900000 1.00000000000008748557e+00 -1.65941448733411760941e+02
7.000000 1.00000000000008570922e+00 -1.65919847232291260752e+02
7.100000 1.00000000000008015810e+00 -1.65906722610712051846e+02
7.200000 1.00000000000008304468e+00 -1.65911871622168490603e+02
7.300000 1.00000000000008837375e+00 -1.65932549657811932775e+02
7.400000 1.00000000000010325074e+00 -1.65952123212697131294e+02
7.500000 1.00000000000007327472e+00 -1.65949957177968798305e+02
7.600000 1.00000000000006350476e+00 -1.65916890612334157140e+02
7.700000 1.00000000000001976197e+00 -1.65865430340891549577e+02
7.800000 1.00000000000003841372e+00 -1.65825545261408421993e+02
7.900000 1.00000000000005528911e+00 -1.65825075054705479261e+02
8.000000 1.00000000000007593925e+00 -1.65866378352712985134e+02
8.100000 1.00000000000009037215e+00 -1.65918857580147118824e+02
8.200000 1.00000000000006972201e+00 -1.65937044675849307396e+02
8.300000 1.00000000000010413892e+00 -1.65892882925862465981e+02
8.400000 1.00000000000011657342e+00 -1.65800054277798750491e+02
8.500000 1.00000000000016076029e+00 -1.65712415969438069396e+02
8.600000 1.00000000000016942003e+00 -1.65690144506881097186e+02
8.700000 1.00000000000015765167e+00 -1.65751635718562937427e+02
8.800000 1.00000000000013500312e+00 -1.65852574668477245723e+02
8.900000 1.00000000000010214052e+00 -1.65915637324272665865e+02
9.000000 1.00000000000014188650e+00 -1.65884944373721424427e+02
9.100000 1.00000000000015387691e+00 -1.65764714809907616200e+02
9.200000 1.00000000000019761970e+00 -1.65623658295882080438e+02
9.300000 1.00000000000020072832e+00 -1.65556764964979748811e+02
9.400000 1.00000000000019539925e+00 -1.65614339881541525301e+02
9.500000 1.00000000000016919799e+00 -1.65755284243506451958e+02
9.600000 1.00000000000017097435e+00 -1.65876183174678089927e+02
9.700000 1.00000000000017164048e+00 -1.65888037769759932871e+02
9.800000 1.00000000000017208457e+00 -1.65774819192908211107e+02
9.900000 1.00000000000016142643e+00 -1.65606481738624722766e+02
10.000000 1.00000000000017030821e+00 -1.65499964424996932166e+02
10.100000 1.00000000000020561330e+00 -1.65534053596090529936e+02
10.200000 1.00000000000024980018e+00 -1.65682757097567190385e+02
10.300000 1.00000000000023692159e+00 -1.65839137893779280830e+02
10.400000 1.00000000000022071234e+00 -1.65901209891909644512e+02
10.500000 1.00000000000022559732e+00 -1.65835400704068092637e+02
10.600000 1.00000000000030153657e+00 -1.65690095843601255865e+02
10.700000 1.00000000000028466118e+00 -1.65568312606864651571e+02
10.800000 1.00000000000036082248e+00 -1.65559311868625059105e+02
10.900000 1.00000000000035127456e+00 -1.65668674972020966152e+02
11.000000 1.00000000000035793590e+00 -1.65816860312667330390e+02
11.100000 1.00000000000037125858e+00 -1.65907038562713580632e+02
11.200000 1.00000000000038080650e+00 -1.65893029669668550241e+02
11.300000 1.00000000000042055248e+00 -1.65801215590690361523e+02
11.400000 1.00000000000033817393e+00 -1.65706889634867280847e+02
11.500000 1.00000000000028754776e+00 -1.65680773466883209721e+02
11.600000 1.00000000000029309888e+00 -1.65739481068246334416e+02
11.700000 1.00000000000031841196e+00 -1.65839940409082345241e+02
11.800000 1.00000000000031419312e+00 -1.65918320034666038509e+02
11.900000 1.00000000000035815795e+00 -1.65934949761530930346e+02
12.000000 1.00000000000035305092e+00 -1.65894809350123352942e+02
12.100000 1.00000000000038880010e+00 -1.65838246214535956824e+02
12.200000 1.00000000000041944226e+00 -1.65810640434381070918e+02
12.300000 1.00000000000037259085e+00 -1.65831057806533038956e+02
12.400000 1.00000000000039257486e+00 -1.65883118760869592734e+02
12.500000 1.00000000000039102055e+00 -1.65932599949701909736e+02
12.600000 1.00000000000033506531e+00 -1.65953722495094325495e+02
12.700000 1.00000000000034172665e+00 -1.65943740451891045495e+02
12.800000 1.00000000000033884007e+00 -1.65919564775463442174e+02
12.900000 1.00000000000037969627e+00 -1.65903039798034484420e+02
13.000000 1.00000000000037547743e+00 -1.65906228785982193585e+02
13.100000 1.00000000000044275694e+00 -1.65925778632088565701e+02
13.200000 1.00000000000044875215e+00 -1.65948397412735914713e+02
13.300000 1.00000000000040656367e+00 -1.65961709636971818327e+02
13.400000 1.00000000000039546144e+00 -1.65962046203679136624e+02
13.500000 1.00000000000031952219e+00 -1.65954609782007878493e+02
13.600000 1.00000000000023581137e+00 -1.65947824137696500202e+02
13.700000 1.00000000000022870594e+00 -1.65947159225012313755e+02
13.800000 1.00000000000022049029e+00 -1.65952587826987041808e+02
13.900000 1.00000000000019206858e+00 -1.65960207994177153523e+02
14.000000 1.00000000000019428903e+00 -1.65965747447565576067e+02
14.100000 1.00000000000017519319e+00 -1.65967272169291021555e+02
14.200000 1.00000000000024291680e+00 -1.65965744473110277113e+02
14.300000 1.00000000000024868996e+00 -1.65963649609726388690e+02
14.400000 1.00000000000027466918e+00 -1.65962994202364768626e+02
14.500000 1.00000000000028843594e+00 -1.65964157604967056159e+02
14.600000 1.00000000000026201263e+00 -1.65966181117586756955e+02
14.700000 1.00000000000022959412e+00 -1.65967855237782288214e+02
14.800000 1.00000000000022493118e+00 -1.65968566045354776861e+02
14.900000 1.00000000000024291680e+00 -1.65968437641107811942e+02
15.000000 1.00000000000021271873e+00 -1.65967990381805975630e+02
15.100000 1.00000000000017719159e+00 -1.65967719865206561281e+02
15.200000 1.00000000000017785773e+00 -1.65967834218767848142e+02
15.300000 1.00000000000017297275e+00 -1.65968222378258133176e+02
15.400000 1.00000000000012012613e+00 -1.65968621205847540523e+02
15.500000 1.00000000000008326673e+00 -1.65968839742739845633e+02
15.600000 1.00000000000011368684e+00 -1.65968866175197376833e+02
15.700000 1.00000000000016542323e+00 -1.65968806069349142263e+02
15.800000 1.00000000000016853186e+00 -1.65968760569766999424e+02
15.900000 1.00000000000016275870e+00 -1.65968766737034030712e+02
16.000000 1.00000000000020672353e+00 -1.65968812557525808415e+02
16.100000 1.00000000000020827784e+00 -1.65968869548482786058e+02
16.200000 1.00000000000018118840e+00 -1.65968911407655440371e+02
16.300000 1.00000000000019562130e+00 -1.65968925444368551325e+02
16.400000 1.00000000000015254464e+00 -1.65968918755016431987e+02
16.500000 1.00000000000013522516e+00 -1.65968909907739998744e+02
16.600000 1.00000000000014721557e+00 -1.65968911170317738879e+02
16.700000 1.00000000000013988810e+00 -1.65968920496680112819e+02
16.800000 1.00000000000014432899e+00 -1.65968929703419547650e+02
16.900000 1.00000000000012168044e+00 -1.65968934699374869979e+02
17.000000 1.00000000000013988810e+00 -1.65968936404780805560e+02
17.100000 1.00000000000012922996e+00 -1.65968936346209630983e+02
17.200000 1.00000000000012767565e+00 -1.65968935099228701802e+02
17.300000 1.00000000000010724754e+00 -1.65968933667973999491e+02
17.400000 1.00000000000008304468e+00 -1.65968933506395615041e+02
17.500000 1.00000000000009103829e+00 -1.65968934756887847470e+02
17.600000 1.00000000000006772360e+00 -1.65968936131013776958e+02
17.700000 1.00000000000008504308e+00 -1.65968936700395175876e+02
17.800000 1.00000000000010103030e+00 -1.65968936742332516587e+02
17.900000 1.00000000000009747758e+00 -1.65968936814748161623e+02
18.000000 1.00000000000003752554e+00 -1.65968936965652829940e+02
18.100000 1.00000000000009392487e+00 -1.65968936917894751559e+02
18.200000 1.00000000000011213253e+00 -1.65968936682220714829e+02
18.300000 1.00000000000011124435e+00 -1.65968936541886279201e+02
18.400000 1.00000000000013744561e+00 -1.65968936594718741162e+02
18.500000 1.00000000000010214052e+00 -1.65968936651890601297e+02
18.600000 1.00000000000013189450e+00 -1.65968936643591518987e+02
18.700000 1.00000000000013078427e+00 -1.65968936646052043216e+02
18.800000 1.00000000000012745360e+00 -1.65968936676025350607e+02
18.900000 1.00000000000009348078e+00 -1.65968936706817999038e+02
19.000000 1.00000000000008393286e+00 -1.65968936718151638843e+02
19.100000 1.00000000000006084022e+00 -1.65968936689571535226e+02
19.200000 1.00000000000005684342e+00 -1.65968936673858735276e+02
19.300000 1.00000000000005706546e+00 -1.65968936686888753229e+02
19.400000 1.00000000000003375078e+00 -1.65968936642149031968e+02
19.500000 1.00000000000006750156e+00 -1.65968936583298329879e+02
19.600000 1.00000000000005351275e+00 -1.65968936575447401083e+02
19.700000 1.00000000000008282264e+00 -1.65968936580517578250e+02
19.800000 1.00000000000004107825e+00 -1.65968936592738714353e+02
19.900000 1.00000000000003419487e+00 -1.65968936609707583330e+02
20.000000 1.00000000000006905587e+00 -1.65968936561654572870e+02
20.100000 1.00000000000008726353e+00 -1.65968936517047183088e+02
20.200000 1.00000000000007993606e+00 -1.65968936517534075392e+02
20.300000 1.00000000000010058621e+00 -1.65968936511819890711e+02
20.400000 1.00000000000010191847e+00 -1.65968936514576398622e+02
20.500000 1.00000000000010724754e+00 -1.65968936527326690111e+02
20.600000 1.00000000000011834977e+00 -1.65968936476605563257e+02
20.700000 1.00000000000014566126e+00 -1.65968936429035352376e+02
20.800000 1.00000000000010680345e+00 -1.65968936426987283994e+02
20.900000 1.00000000000013988810e+00 -1.65968936425270669588e+02
21.000000 1.00000000000012856383e+00 -1.65968936434550101922e+02
21.100000 1.00000000000013211654e+00 -1.65968936444896911553e+02
21.200000 1.00000000000012256862e+00 -1.65968936395778143833e+02
21.300000 1.00000000000010724754e+00 -1.65968936355695717566e+02
21.400000 1.00000000000010391688e+00 -1.65968936356706706192e+02
21.500000 1.00000000000012678747e+00 -1.65968936361892531295e+02
21.600000 1.00000000000015498713e+00 -1.65968936375409526818e+02
21.700000 1.00000000000020317081e+00 -1.65968936382098036120e+02
21.800000 1.00000000000022470914e+00 -1.65968936337789415347e+02
21.900000 1.00000000000022093438e+00 -1.65968936306221166888e+02
22.000000 1.00000000000023669955e+00 -1.65968936311144062756e+02
22.100000 1.00000000000020561330e+00 -1.65968936323558978074e+02
22.200000 1.00000000000019206858e+00 -1.65968936338765956862e+02
22.300000 1.00000000000023248070e+00 -1.65968936351858161515e+02
22.400000 1.00000000000023914204e+00 -1.65968936316563230093e+02
22.500000 1.00000000000022559732e+00 -1.65968936289134802564e+02
22.600000 1.00000000000020783375e+00 -1.65968936293687789885e+02
22.700000 1.00000000000017297275e+00 -1.65968936309079850844e+02
22.800000 1.00000000000014832580e+00 -1.65968936329185737577e+02
22.900000 1.00000000000007727152e+00 -1.65968936348914439805e+02
23.000000 1.00000000000009747758e+00 -1.65968936331962680697e+02
23.100000 1.00000000000014654944e+00 -1.65968936322951151396e+02
23.200000 1.00000000000018185453e+00 -1.65968936330717184546e+02
23.300000 1.00000000000013433699e+00 -1.65968936345248607722e+02
23.400000 1.00000000000011124435e+00 -1.65968936369861836511e+02
23.500000 1.00000000000014455104e+00 -1.65968936393276209174e+02
23.600000 1.00000000000014321877e+00 -1.65968936398160479939e+02
23.700000 1.00000000000012834178e+00 -1.65968936400078490578e+02
23.800000 1.00000000000013655743e+00 -1.65968936414451462724e+02
23.900000 1.00000000000012900792e+00 -1.65968936432863870323e+02
24.000000 1.00000000000009392487e+00 -1.65968936460431137903e+02
24.100000 1.00000000000010036416e+00 -1.65968936487073762009e+02
24.200000 1.00000000000006594725e+00 -1.65968936499464149392e+02
24.300000 9.99999999999974908960e-01 -1.65968936513879498307e+02
24.400000 9.99999999999961364239e-01 -1.65968936526959367939e+02
24.500000 9.99999999999975353049e-01 -1.65968936545783918746e+02
24.600000 1.00000000000002242651e+00 -1.65968936572348525260e+02
24.700000 9.99999999999978239629e-01 -1.65968936597364489671e+02
24.800000 9.99999999999991451283e-01 -1.65968936609495699486e+02
24.900000 9.99999999999975242027e-01 -1.65968936621970897249e+02
25.000000 9.99999999999949151785e-01 -1.65968936636719092803e+02
25.100000 9.99999999999953592678e-01 -1.65968936658076017920e+02
25.200000 1.00000000000002176037e+00 -1.65968936683701173251e+02
25.300000 1.00000000000003308465e+00 -1.65968936709809497643e+02
25.400000 1.00000000000005839773e+00 -1.65968936719276200620e+02
25.500000 1.00000000000005351275e+00 -1.65968936731113416272e+02
25.600000 1.00000000000004152234e+00 -1.65968936744035630682e+02
25.700000 1.00000000000005195844e+00 -1.65968936769394844077e+02
25.800000 1.00000000000006727952e+00 -1.65968936793330186674e+02
25.900000 1.00000000000003863576e+00 -1.65968936816043054705e+02
26.000000 1.00000000000005884182e+00 -1.65968936824452924839e+02
26.100000 1.00000000000007793766e+00 -1.65968936837541377827e+02
26.200000 1.00000000000005129230e+00 -1.65968936848198183043e+02
26.300000 1.00000000000007172041e+00 -1.65968936873634362428e+02
26.400000 1.00000000000008837375e+00 -1.65968936898298835558e+02
26.500000 1.00000000000017763568e+00 -1.65968936916667871628e+02
26.600000 1.00000000000015010215e+00 -1.65968936931449405847e+02
26.700000 1.00000000000009725554e+00 -1.65968936944232950736e+02
26.800000 1.00000000000012256862e+00 -1.65968936958379003954e+02
26.900000 1.00000000000007727152e+00 -1.65968936981351731674e+02
27.000000 1.00000000000009059420e+00 -1.65968937005283692088e+02
27.100000 1.00000000000009636736e+00 -1.65968937017812578461e+02
27.200000 1.00000000000009436896e+00 -1.65968937035402319680e+02
27.300000 1.00000000000007860379e+00 -1.65968937048410850821e+02
27.400000 1.00000000000009503509e+00 -1.65968937063378717767e+02
27.500000 1.00000000000015276669e+00 -1.65968937085305839219e+02
27.600000 1.00000000000015276669e+00 -1.65968937109564109278e+02
27.700000 1.00000000000012789769e+00 -1.65968937119282088588e+02
27.800000 1.00000000000016897594e+00 -1.65968937131876202784e+02
27.900000 1.00000000000019984014e+00 -1.65968937144976365516e+02
28.000000 1.00000000000017807977e+00 -1.65968937158904452644e+02
28.100000 1.00000000000017230661e+00 -1.65968937178882072203e+02
28.200000 1.00000000000018984814e+00 -1.65968937200259091469e+02
28.300000 1.00000000000016076029e+00 -1.65968937205949288227e+02
28.400000 1.00000000000017608137e+00 -1.65968937218190575322e+02
28.500000 1.00000000000017075230e+00 -1.65968937231073198291e+02
28.600000 1.00000000000022359892e+00 -1.65968937245980669104e+02
28.700000 1.00000000000020938806e+00 -1.65968937264716657864e+02
28.800000 1.00000000000020339286e+00 -1.65968937283519238690e+02
28.900000 1.00000000000019162449e+00 -1.65968937286434538692e+02
29.000000 1.00000000000021227464e+00 -1.65968937296779188273e+02
29.100000 1.00000000000017785773e+00 -1.65968937310891419656e+02
29.200000 1.00000000000022182256e+00 -1.65968937325121004278e+02
29.300000 1.00000000000019695356e+00 -1.65968937341481364456e+02
29.400000 1.00000000000022182256e+00 -1.65968937358579353258e+02
29.500000 1.00000000000022359892e+00 -1.65968937360425343286e+02
29.600000 1.00000000000021671553e+00 -1.65968937373091023346e+02
29.700000 1.00000000000017874591e+00 -1.65968937387657035742e+02
29.800000 1.00000000000022959412e+00 -1.65968937403107986484e+02
29.900000 1.00000000000022293278e+00 -1.65968937417056167760e+02
30.000000 1.00000000000024824587e+00 -1.65968937434101519557e+02
