# tag norm BO
1 1.00000000000000000000e+00 -3.15117480995918894382e-02
2 1.00000000000000000000e+00 -8.06949504080676505158e-02
3 1.00000000000000000000e+00 -7.52205719029483688143e-02
4 1.00000000000000000000e+00 -3.80616079932608042391e-02
5 1.00000000000000000000e+00 -2.80660140386371943777e-02
6 1.00000000000000000000e+00 1.42909343311848052033e-03
7 1.00000000000000000000e+00 2.84749713712268877341e-02
8 1.00000000000000000000e+00 1.75143065931365263244e-02
9 1.00000000000000000000e+00 3.93914662236361737963e-03
10 1.00000000000000000000e+00 -2.26510182155296915102e-03
11 1.00000000000000000000e+00 -6.54001236224992146123e-03
12 1.00000000000000000000e+00 -1.65669617428383167401e-02
13 1.00000000000000000000e+00 5.03704540200349618062e-02
14 1.00000000000000000000e+00 -6.54035427868083357739e-02
15 1.00000000000000000000e+00 -8.02774188896410861860e-02
16 1.00000000000000000000e+00 -4.06806010657656952345e-02
17 1.00000000000000000000e+00 1.74514922435837022130e-01
18 1.00000000000000000000e+00 2.19163489678734529909e-01
19 1.00000000000000000000e+00 2.14797293977171760426e-01
20 1.00000000000000000000e+00 2.13315939647945485014e-01
21 1.00000000000000000000e+00 2.13210516069590516608e-01
22 1.00000000000000000000e+00 2.13206385342680326822e-01
23 1.00000000000000000000e+00 2.13205944165964556003e-01
