# tag norm j_0
5.400000 1.00000000000002309264e+00 5.54872325198639982508e-03
5.400000 1.00000000000002309264e+00 5.31528628168009397575e-03
5.400000 1.00000000000002309264e+00 5.40904233247717792371e-03
5.400000 1.00000000000002309264e+00 5.29149304940865639751e-03
5.400000 1.00000000000002309264e+00 5.38292615854167252887e-03
5.400000 1.00000000000002309264e+00 5.27029416888617242842e-03
5.400000 1.00000000000002309264e+00 5.36658258702812397678e-03
5.400000 1.00000000000002309264e+00 5.25305922060957317110e-03
5.400000 1.00000000000002309264e+00 5.46198785482981084838e-03
