# tag norm j_0
19.300000 1.00000000000001265654e+00 2.01737879444051365499e-04
19.300000 1.00000000000001265654e+00 2.97938006328841943279e-04
19.300000 1.00000000000001265654e+00 6.32046953678467183374e-04
19.300000 1.00000000000001265654e+00 1.57681504015339240404e-04
19.300000 1.00000000000001265654e+00 -2.58872923754071822353e-04
19.300000 1.00000000000001265654e+00 1.55944773242121492414e-04
19.300000 1.00000000000001265654e+00 6.39979316364073223290e-04
19.300000 1.00000000000001265654e+00 3.16179390183954735823e-04
19.300000 1.00000000000001265654e+00 2.20807852610755274252e-04
