# tag norm j_0
23.400000 1.00000000000024047431e+00 -1.44967117414207964090e-04
23.400000 1.00000000000024047431e+00 2.70749360725191009081e-05
23.400000 1.00000000000024047431e+00 7.07393133382512074876e-05
23.400000 1.00000000000024047431e+00 4.21737049957188496127e-04
23.400000 1.00000000000024047431e+00 5.75149202652129078184e-04
23.400000 1.00000000000024047431e+00 1.09312743398877856068e-04
23.400000 1.00000000000024047431e+00 -1.38359576314489980892e-04
23.400000 1.00000000000024047431e+00 -4.10607524557780412342e-05
23.400000 1.00000000000024047431e+00 1.33004311578354624836e-05
23.400000 1.00000000000024047431e+00 4.68789080028127164807e-05
23.400000 1.00000000000024047431e+00 1.31644569697232831167e-05
23.400000 1.00000000000024047431e+00 -4.19185174515139703918e-05
23.400000 1.00000000000024047431e+00 -1.49034881992860510948e-04
23.400000 1.00000000000024047431e+00 8.67220805644101244312e-05
23.400000 1.00000000000024047431e+00 5.53447332018117631701e-04
23.400000 1.00000000000024047431e+00 4.43276790020429272820e-04
23.400000 1.00000000000024047431e+00 8.89057393579405431027e-05
23.400000 1.00000000000024047431e+00 3.81287028661425646736e-05
23.400000 1.00000000000024047431e+00 -1.28456707394350634231e-04
