# tag norm j_0
11.500000 1.00000000000004773959e+00 7.94402410859795515830e-02
11.500000 1.00000000000004773959e+00 8.49041168654655897807e-02
11.500000 1.00000000000004773959e+00 7.87723588433989901914e-02
11.500000 1.00000000000004773959e+00 8.53721245537131523395e-02
11.500000 1.00000000000004773959e+00 7.88825718826066391021e-02
11.500000 1.00000000000004773959e+00 8.53606758741351917541e-02
11.500000 1.00000000000004773959e+00 7.88806216901467432967e-02
11.500000 1.00000000000004773959e+00 8.48737422365038740590e-02
11.500000 1.00000000000004773959e+00 7.96668790861837228245e-02
