# tag norm j
0.100000 9.99999999999999777955e-01 1.49696197933246261330e-06
0.200000 9.99999999999999444888e-01 -9.05574413551726446802e-07
0.300000 9.99999999999999444888e-01 -3.67452612314685871184e-06
0.400000 9.99999999999999888978e-01 1.22263133564854412560e-06
0.500000 1.00000000000000000000e+00 -1.23503707835747439901e-05
0.600000 9.99999999999999777955e-01 -1.64159523185165300853e-05
0.700000 9.99999999999999555911e-01 -9.60190915319887654212e-06
0.800000 9.99999999999999555911e-01 -3.20665668245847878355e-05
0.900000 9.99999999999999777955e-01 -2.25743862280911126170e-05
1.000000 1.00000000000000066613e+00 -9.33168174931533906118e-06
1.100000 1.00000000000000177636e+00 -2.14611519551619102657e-05
1.200000 1.00000000000000266454e+00 2.64566036850157834139e-05
1.300000 1.00000000000000333067e+00 5.05985921300401827929e-05
1.400000 1.00000000000000355271e+00 5.96669487292773165210e-05
1.500000 1.00000000000000310862e+00 1.30396521432343175193e-04
1.600000 1.00000000000000355271e+00 1.20711499441097545524e-04
1.700000 1.00000000000000355271e+00 1.04764285760813302402e-04
1.800000 1.00000000000000377476e+00 1.00400893810020531830e-04
1.900000 1.00000000000000399680e+00 -3.12787627829684493461e-05
2.000000 1.00000000000000377476e+00 -1.31430437034277182873e-04
2.100000 1.00000000000000310862e+00 -2.67291087843505540279e-04
2.200000 1.00000000000000355271e+00 -4.64572358687800066393e-04
2.300000 1.00000000000000399680e+00 -5.17709943717830321785e-04
2.400000 1.00000000000000355271e+00 -5.68426344880578111353e-04
2.500000 1.00000000000000333067e+00 -4.88267078906361770129e-04
2.600000 1.00000000000000355271e+00 -1.64325863780202200554e-04
2.700000 1.00000000000000377476e+00 1.86490335617914927474e-04
2.800000 1.00000000000000421885e+00 7.36638302785486641898e-04
2.900000 1.00000000000000444089e+00 1.34541893938204927886e-03
3.000000 1.00000000000000310862e+00 1.74225326653250573231e-03
3.100000 1.00000000000000333067e+00 2.03397466688575801266e-03
3.200000 1.00000000000000244249e+00 1.88254101531256799913e-03
3.300000 1.00000000000000222045e+00 1.16590785126491130672e-03
3.400000 1.00000000000000266454e+00 5.68541603094786991181e-05
3.500000 1.00000000000000199840e+00 -1.60874752271156695391e-03
3.600000 1.00000000000000133227e+00 -3.48673430870399207043e-03
3.700000 1.00000000000000133227e+00 -5.13961377216411770957e-03
3.800000 1.00000000000000111022e+00 -6.33674046777601106262e-03
3.900000 1.00000000000000088818e+00 -6.40811580839090958600e-03
4.000000 1.00000000000000044409e+00 -5.02760387659990665848e-03
4.100000 1.00000000000000000000e+00 -2.14236272373775947855e-03
4.200000 1.00000000000000022204e+00 2.31794582226387728754e-03
4.300000 1.00000000000000177636e+00 7.66649847271886047267e-03
4.400000 1.00000000000000133227e+00 1.29985623560369221302e-02
4.500000 1.00000000000000111022e+00 1.72810479395525823376e-02
4.600000 1.00000000000000022204e+00 1.90074291619470973902e-02
4.700000 1.00000000000000177636e+00 1.71579639708559876510e-02
4.800000 1.00000000000000177636e+00 1.11343662111096624451e-02
4.900000 1.00000000000000111022e+00 8.13509020470128000127e-04
5.000000 1.00000000000000133227e+00 -1.25829964414345962798e-02
5.100000 1.00000000000000111022e+00 -2.70840447072065587664e-02
5.200000 1.00000000000000199840e+00 -4.00007850196755776473e-02
5.300000 1.00000000000000155431e+00 -4.78505276496973275258e-02
5.400000 1.00000000000000155431e+00 -4.77775885733998442739e-02
5.500000 1.00000000000000222045e+00 -3.77712576468979058242e-02
5.600000 1.00000000000000244249e+00 -1.72435250993913762041e-02
5.700000 1.00000000000000155431e+00 1.17505747347931618213e-02
5.800000 1.00000000000000111022e+00 4.52445349317889752849e-02
5.900000 1.00000000000000111022e+00 7.74570227149273815570e-02
6.000000 1.00000000000000044409e+00 1.01240802008296437720e-01
6.100000 9.99999999999999333866e-01 1.10126833970020265863e-01
6.200000 9.99999999999999000799e-01 9.90472480914084685288e-02
6.300000 9.99999999999999444888e-01 6.57211623532592270625e-02
6.400000 9.99999999999998889777e-01 1.22471450750704733551e-02
6.500000 9.99999999999998667732e-01 -5.51735750706409469601e-02
6.600000 9.99999999999998223643e-01 -1.25878979038589328132e-01
6.700000 9.99999999999998223643e-01 -1.85926876306036187314e-01
6.800000 9.99999999999997890576e-01 -2.21069774441919719710e-01
6.900000 9.99999999999998778755e-01 -2.19157091447016311170e-01
7.000000 9.99999999999999000799e-01 -1.74056593957473831891e-01
7.100000 9.99999999999998001599e-01 -8.81217765350802983981e-02
7.200000 9.99999999999999111822e-01 2.79521227596016934303e-02
7.300000 9.99999999999999777955e-01 1.55802060260288394167e-01
7.400000 1.00000000000000088818e+00 2.72681570090714975318e-01
7.500000 1.00000000000000133227e+00 3.55448511535671196615e-01
7.600000 1.00000000000000133227e+00 3.84081051636476766831e-01
7.700000 1.00000000000000088818e+00 3.45969087634114935703e-01
7.800000 1.00000000000000199840e+00 2.38489654879492668504e-01
7.900000 1.00000000000000088818e+00 7.05082003019140146627e-02
8.000000 1.00000000000000066613e+00 -1.36338345981212721858e-01
8.100000 9.99999999999999444888e-01 -3.48832432358065380740e-01
8.200000 9.99999999999997002398e-01 -5.25835831634457906425e-01
8.300000 9.99999999999997668532e-01 -6.26508801766420986290e-01
8.400000 9.99999999999997557509e-01 -6.22038010900452520424e-01
8.500000 9.99999999999998667732e-01 -5.04303198949227482473e-01
8.600000 9.99999999999998667732e-01 -2.88498894278284068182e-01
8.700000 9.99999999999998667732e-01 -9.26504414840151335753e-03
8.800000 9.99999999999997446487e-01 2.86882131252398031585e-01
8.900000 9.99999999999997890576e-01 5.49303914870071019472e-01
9.000000 9.99999999999999000799e-01 7.31167786779606254655e-01
9.100000 9.99999999999997446487e-01 7.97273005590212968663e-01
9.200000 9.99999999999997668532e-01 7.29750913691032843111e-01
9.300000 9.99999999999997446487e-01 5.30156576323491779412e-01
9.400000 9.99999999999996780353e-01 2.19479173850169406723e-01
9.500000 9.99999999999997890576e-01 -1.60608236371394846875e-01
9.600000 9.99999999999996780353e-01 -5.48019679714363383560e-01
9.700000 9.99999999999996003197e-01 -8.68875719899703691240e-01
9.800000 9.99999999999996225242e-01 -1.05546212006327522204e+00
9.900000 9.99999999999996669331e-01 -1.06697281100510488194e+00
10.000000 9.99999999999998223643e-01 -9.00843841671794542947e-01
10.100000 9.99999999999995670130e-01 -5.89410733146452425757e-01
10.200000 9.99999999999996336264e-01 -1.88748403201416309338e-01
10.300000 9.99999999999996336264e-01 2.33236922634790233566e-01
10.400000 9.99999999999996003197e-01 6.07273054003966583636e-01
10.500000 9.99999999999996447286e-01 8.73012199031537483584e-01
10.600000 9.99999999999994781952e-01 9.88972483287093195869e-01
10.700000 9.99999999999994559907e-01 9.37832671362515690738e-01
10.800000 9.99999999999994781952e-01 7.26405184427903916067e-01
10.900000 9.99999999999996336264e-01 3.84757652471701461216e-01
11.000000 9.99999999999996336264e-01 -3.45642111321567135906e-02
11.100000 9.99999999999997890576e-01 -4.60595768465789201507e-01
11.200000 9.99999999999997002398e-01 -8.15993961150075497457e-01
11.300000 9.99999999999997890576e-01 -1.03637430438820432599e+00
11.400000 9.99999999999998334665e-01 -1.08664766382349764484e+00
11.500000 1.00000000000000044409e+00 -9.66829259561708065362e-01
11.600000 1.00000000000000066613e+00 -7.07849016635303640577e-01
11.700000 1.00000000000000044409e+00 -3.61471574097606829223e-01
11.800000 1.00000000000000044409e+00 1.05660095957355731899e-02
11.900000 1.00000000000000111022e+00 3.46724468335294577770e-01
12.000000 1.00000000000000133227e+00 5.95604013265891851781e-01
12.100000 1.00000000000000222045e+00 7.23517397932259886950e-01
12.200000 1.00000000000000599520e+00 7.18097481603741538692e-01
12.300000 1.00000000000000577316e+00 5.88450449871634306831e-01
12.400000 1.00000000000000199840e+00 3.62732893122219179904e-01
12.500000 1.00000000000000310862e+00 8.39030790078024446554e-02
12.600000 1.00000000000000355271e+00 -1.97407335352970975118e-01
12.700000 1.00000000000000399680e+00 -4.32808310328746781437e-01
12.800000 1.00000000000000377476e+00 -5.85783903646477477345e-01
12.900000 1.00000000000000444089e+00 -6.38406727617595648461e-01
13.000000 1.00000000000000310862e+00 -5.93171083893934136810e-01
13.100000 1.00000000000000266454e+00 -4.69845192969553959728e-01
13.200000 1.00000000000000177636e+00 -2.99595127534888150400e-01
13.300000 1.00000000000000266454e+00 -1.17846745438282968221e-01
13.400000 1.00000000000000333067e+00 4.28630158442223213600e-02
13.500000 1.00000000000000288658e+00 1.58318385020086965786e-01
13.600000 1.00000000000000333067e+00 2.15860956524392272327e-01
13.700000 1.00000000000000310862e+00 2.15180771630122891214e-01
13.800000 1.00000000000000444089e+00 1.66745783344662279468e-01
13.900000 1.00000000000000444089e+00 8.87519817309961878138e-02
14.000000 1.00000000000000488498e+00 2.82244653657434674265e-03
14.100000 1.00000000000000466294e+00 -7.07237493256693966481e-02
14.200000 1.00000000000000399680e+00 -1.16859130408840383719e-01
14.300000 1.00000000000000288658e+00 -1.28895552293022352952e-01
14.400000 1.00000000000000333067e+00 -1.09389082762600189924e-01
14.500000 1.00000000000000643929e+00 -6.86127302527986537850e-02
14.600000 1.00000000000000621725e+00 -2.18520891007146500495e-02
14.700000 1.00000000000000532907e+00 1.47851922193553697582e-02
14.800000 1.00000000000000577316e+00 2.87393419658660137506e-02
14.900000 1.00000000000000555112e+00 1.36803633439216941470e-02
15.000000 1.00000000000000577316e+00 -2.87821793633182693162e-02
15.100000 1.00000000000000821565e+00 -8.93586100176324560351e-02
15.200000 1.00000000000000888178e+00 -1.53655010892156246305e-01
15.300000 1.00000000000001065814e+00 -2.05149622811219539686e-01
15.400000 1.00000000000001132427e+00 -2.28809201593603850355e-01
15.500000 1.00000000000000976996e+00 -2.14712684390166441695e-01
15.600000 1.00000000000001088019e+00 -1.60200610449140412594e-01
15.700000 1.00000000000001065814e+00 -7.08567282523111935388e-02
15.800000 1.00000000000001043610e+00 4.00983469838224818038e-02
15.900000 1.00000000000001154632e+00 1.54008963211219790379e-01
16.000000 1.00000000000001243450e+00 2.50109314442460262118e-01
16.100000 1.00000000000001376677e+00 3.09609828880895054937e-01
16.200000 1.00000000000001310063e+00 3.19270388631076540431e-01
16.300000 1.00000000000001310063e+00 2.74283850791331273999e-01
16.400000 1.00000000000001110223e+00 1.79799725599597892689e-01
16.500000 1.00000000000001154632e+00 5.00561082704493107154e-02
16.600000 1.00000000000001221245e+00 -9.38483919004048650070e-02
16.700000 1.00000000000001199041e+00 -2.27438989551535797329e-01
16.800000 1.00000000000001265654e+00 -3.27410008036296995559e-01
16.900000 1.00000000000001243450e+00 -3.75657794079742590743e-01
17.000000 1.00000000000001310063e+00 -3.62432342463963774737e-01
17.100000 1.00000000000001265654e+00 -2.88212095791140321399e-01
17.200000 1.00000000000001199041e+00 -1.63809733688307895827e-01
17.300000 1.00000000000001176836e+00 -8.69077383776848365338e-03
17.400000 1.00000000000001199041e+00 1.52314509314405460705e-01
17.500000 1.00000000000001132427e+00 2.92976410092545547226e-01
17.600000 1.00000000000001199041e+00 3.90156086290579628972e-01
17.700000 1.00000000000001243450e+00 4.28029385065765488605e-01
17.800000 1.00000000000001287859e+00 4.00501347224901660393e-01
17.900000 1.00000000000001443290e+00 3.12255584601087932128e-01
18.000000 1.00000000000001310063e+00 1.78031490869367703400e-01
18.100000 1.00000000000001354472e+00 1.96415172105482427334e-02
18.200000 1.00000000000001287859e+00 -1.37714819366574509063e-01
18.300000 1.00000000000001310063e+00 -2.69511585885088889025e-01
18.400000 1.00000000000001376677e+00 -3.55920895173428397662e-01
18.500000 1.00000000000001554312e+00 -3.84714182533726134494e-01
18.600000 1.00000000000001598721e+00 -3.52940019664164550406e-01
18.700000 1.00000000000001465494e+00 -2.67073601349968825502e-01
18.800000 1.00000000000001643130e+00 -1.41885825333804255211e-01
18.900000 1.00000000000001687539e+00 1.96667406270285144432e-03
19.000000 1.00000000000001620926e+00 1.41581552773295094028e-01
19.100000 1.00000000000001643130e+00 2.55317870304416605354e-01
19.200000 1.00000000000001643130e+00 3.26268496706393240636e-01
19.300000 1.00000000000001598721e+00 3.45174379997324420888e-01
19.400000 1.00000000000001643130e+00 3.11317774731402374666e-01
19.500000 1.00000000000001598721e+00 2.32294740284828160615e-01
19.600000 1.00000000000001465494e+00 1.22497557735436954363e-01
19.700000 1.00000000000001443290e+00 6.05153230278168561196e-05
19.800000 1.00000000000001443290e+00 -1.16079889320408122244e-01
19.900000 1.00000000000001532108e+00 -2.09085947740098559988e-01
20.000000 1.00000000000001598721e+00 -2.66792406746878429935e-01
20.100000 1.00000000000001687539e+00 -2.83008109298424737066e-01
20.200000 1.00000000000001776357e+00 -2.58113432638194639779e-01
20.300000 1.00000000000001798561e+00 -1.98660199501228040830e-01
20.400000 1.00000000000001709743e+00 -1.15940108061608523893e-01
20.500000 1.00000000000001709743e+00 -2.41521365079399794040e-02
20.600000 1.00000000000001643130e+00 6.20511513747009912922e-02
20.700000 1.00000000000001687539e+00 1.29940178159269226210e-01
20.800000 1.00000000000001598721e+00 1.70539223819401536408e-01
20.900000 1.00000000000001709743e+00 1.80007929528798710228e-01
21.000000 1.00000000000001709743e+00 1.59770835779929842868e-01
21.100000 1.00000000000001842970e+00 1.15735844939129250974e-01
21.200000 1.00000000000001909584e+00 5.70051396660979439734e-02
21.300000 1.00000000000001976197e+00 -6.15784200753277579515e-03
21.400000 1.00000000000002131628e+00 -6.40355967345576926331e-02
21.500000 1.00000000000002153833e+00 -1.08790816499063192069e-01
21.600000 1.00000000000002109424e+00 -1.35617894413771089557e-01
21.700000 1.00000000000002220446e+00 -1.42892363526520682626e-01
21.800000 1.00000000000002287059e+00 -1.32075944242168702436e-01
21.900000 1.00000000000002331468e+00 -1.07316264261201471664e-01
22.000000 1.00000000000002375877e+00 -7.42564120871986310668e-02
22.100000 1.00000000000002398082e+00 -3.90819037487907944284e-02
22.200000 1.00000000000002464695e+00 -7.34853399001643252386e-03
22.300000 1.00000000000002442491e+00 1.72594665320245227447e-02
22.400000 1.00000000000002420286e+00 3.32421493631829892412e-02
22.500000 1.00000000000002442491e+00 4.13738637508221651640e-02
22.600000 1.00000000000002486900e+00 4.41960769402641173720e-02
22.700000 1.00000000000002420286e+00 4.47662437174290023245e-02
22.800000 1.00000000000002464695e+00 4.56980284078605317188e-02
22.900000 1.00000000000002464695e+00 4.83041748285849420474e-02
23.000000 1.00000000000002486900e+00 5.21663853210288033790e-02
23.100000 1.00000000000002575717e+00 5.53731550034274946914e-02
23.200000 1.00000000000002686740e+00 5.50821578146137719179e-02
23.300000 1.00000000000002686740e+00 4.85043521641911681841e-02
23.400000 1.00000000000002642331e+00 3.36219462946622457689e-02
23.500000 1.00000000000002664535e+00 9.90170248093849569848e-03
23.600000 1.00000000000002797762e+00 -2.09581777683780084987e-02
23.700000 1.00000000000002908784e+00 -5.53020972002422478431e-02
23.800000 1.00000000000002930989e+00 -8.77337128350023226497e-02
23.900000 1.00000000000002886580e+00 -1.11557416489477950750e-01
24.000000 1.00000000000002775558e+00 -1.20466403932571186619e-01
24.100000 1.00000000000002797762e+00 -1.09727002216181646066e-01
24.200000 1.00000000000002686740e+00 -7.72391695157659263771e-02
24.300000 1.00000000000002708944e+00 -2.49374668877680588652e-02
24.400000 1.00000000000002664535e+00 4.12301131492534417289e-02
24.500000 1.00000000000002753353e+00 1.12052261035864270111e-01
24.600000 1.00000000000002775558e+00 1.76173451141763387495e-01
24.700000 1.00000000000002930989e+00 2.22184212917635598439e-01
24.800000 1.00000000000002842171e+00 2.40748735935923718898e-01
24.900000 1.00000000000002908784e+00 2.26480604633579218898e-01
25.000000 1.00000000000002997602e+00 1.79124594140409515441e-01
25.100000 1.00000000000002997602e+00 1.03915670426868403387e-01
25.200000 1.00000000000002886580e+00 1.12542116601027850087e-02
25.300000 1.00000000000002819966e+00 -8.50899660294967136176e-02
25.400000 1.00000000000002797762e+00 -1.70094258856142349634e-01
25.500000 1.00000000000002642331e+00 -2.29628189593303805305e-01
25.600000 1.00000000000002531308e+00 -2.53355279483786277606e-01
25.700000 1.00000000000002553513e+00 -2.36494349865394803967e-01
25.800000 1.00000000000002642331e+00 -1.80573768153047153895e-01
25.900000 1.00000000000002575717e+00 -9.38291394282327884113e-02
26.000000 1.00000000000002597922e+00 1.02310848067258871458e-02
26.100000 1.00000000000002620126e+00 1.15110389393122652946e-01
26.200000 1.00000000000002575717e+00 2.03816383803960693433e-01
26.300000 1.00000000000002531308e+00 2.61936965038026992048e-01
26.400000 1.00000000000002531308e+00 2.80017109298294486486e-01
26.500000 1.00000000000002664535e+00 2.55120020423867388537e-01
26.600000 1.00000000000002620126e+00 1.91385963073760823061e-01
26.700000 1.00000000000002509104e+00 9.91327081497392903486e-02
26.800000 1.00000000000002597922e+00 -6.74262446728595993967e-03
26.900000 1.00000000000002553513e+00 -1.09281710351561520134e-01
27.000000 1.00000000000002575717e+00 -1.92433212979354284489e-01
27.100000 1.00000000000002597922e+00 -2.43461969993803623025e-01
27.200000 1.00000000000002642331e+00 -2.55089244295499339987e-01
27.300000 1.00000000000002620126e+00 -2.26679514369428791731e-01
27.400000 1.00000000000002597922e+00 -1.64007012613846481219e-01
27.500000 1.00000000000002531308e+00 -7.81659024896635135082e-02
27.600000 1.00000000000002553513e+00 1.64468995093798864282e-02
27.700000 1.00000000000002531308e+00 1.04739304805324784375e-01
27.800000 1.00000000000002553513e+00 1.73451302671391832666e-01
27.900000 1.00000000000002553513e+00 2.13194806664449149070e-01
28.000000 1.00000000000002597922e+00 2.19752000350574322463e-01
28.100000 1.00000000000002553513e+00 1.94519791157367005763e-01
28.200000 1.00000000000002620126e+00 1.43863770113485778257e-01
28.300000 1.00000000000002553513e+00 7.77364190237019997420e-02
28.400000 1.00000000000002486900e+00 7.91335462092034036541e-03
28.500000 1.00000000000002597922e+00 -5.41866324720911701762e-02
28.600000 1.00000000000002575717e+00 -9.94639523244778278599e-02
28.700000 1.00000000000002664535e+00 -1.22423701493435899135e-01
28.800000 1.00000000000002708944e+00 -1.21856740919176712024e-01
28.900000 1.00000000000002797762e+00 -1.00709857273741473782e-01
29.000000 1.00000000000002708944e+00 -6.50600751000460497675e-02
29.100000 1.00000000000002731149e+00 -2.26039821173935825960e-02
29.200000 1.00000000000002864375e+00 1.88124231702959769652e-02
29.300000 1.00000000000002775558e+00 5.26218509933425587777e-02
29.400000 1.00000000000002753353e+00 7.47442081899968024938e-02
29.500000 1.00000000000002775558e+00 8.38981746071294637312e-02
29.600000 1.00000000000002819966e+00 8.14636187841100423146e-02
29.700000 1.00000000000002864375e+00 7.11463077044672959071e-02
29.800000 1.00000000000002930989e+00 5.77653068545190481742e-02
29.900000 1.00000000000002908784e+00 4.59095335185613004358e-02
30.000000 1.00000000000002908784e+00 3.89980413366609671155e-02
