# tag norm j_0
17.700000 1.00000000000002864375e+00 -2.13439181945003801297e-03
17.700000 1.00000000000002864375e+00 5.66104138498776032415e-04
17.700000 1.00000000000002864375e+00 -1.37049684675741106042e-03
17.700000 1.00000000000002864375e+00 6.38009030524584849937e-04
17.700000 1.00000000000002864375e+00 -1.29115668147423393215e-03
17.700000 1.00000000000002864375e+00 7.15759169955176399562e-04
17.700000 1.00000000000002864375e+00 -1.25022529798957723196e-03
17.700000 1.00000000000002864375e+00 7.53010220511320820837e-04
17.700000 1.00000000000002864375e+00 -1.26295028902538531909e-03
17.700000 1.00000000000002864375e+00 7.62276882193110437609e-04
17.700000 1.00000000000002864375e+00 -1.27540629425670621992e-03
17.700000 1.00000000000002864375e+00 7.58073776773429165721e-04
17.700000 1.00000000000002864375e+00 -1.28164063955103465012e-03
17.700000 1.00000000000002864375e+00 7.44625560373952922154e-04
17.700000 1.00000000000002864375e+00 -1.33408793444132170621e-03
17.700000 1.00000000000002864375e+00 6.85332233291183006395e-04
17.700000 1.00000000000002864375e+00 -1.42817411179161951780e-03
17.700000 1.00000000000002864375e+00 6.36018322475037905378e-04
17.700000 1.00000000000002864375e+00 -2.14506395801298838794e-03
