# tag norm j_0
1.200000 1.00000000000000577316e+00 1.78354920553640456955e-05
1.200000 1.00000000000000577316e+00 8.18919520886959776253e-06
1.200000 1.00000000000000577316e+00 2.22051171789665675773e-05
1.200000 1.00000000000000577316e+00 3.49391051447973949176e-06
1.200000 1.00000000000000577316e+00 2.19021197461633140553e-05
1.200000 1.00000000000000577316e+00 3.44419647110971575456e-06
1.200000 1.00000000000000577316e+00 2.23328540337296397873e-05
1.200000 1.00000000000000577316e+00 8.11926884251426819110e-06
1.200000 1.00000000000000577316e+00 1.78811641819629540463e-05
