# tag norm j_0
14.500000 1.00000000000001221245e+00 -2.32591011923398904501e-03
14.500000 1.00000000000001221245e+00 -5.05292099109043851834e-02
14.500000 1.00000000000001221245e+00 1.64370081481255113365e-02
14.500000 1.00000000000001221245e+00 5.37194351315975204830e-02
14.500000 1.00000000000001221245e+00 -7.96766650269044827970e-03
14.500000 1.00000000000001221245e+00 5.28935764079208128874e-02
14.500000 1.00000000000001221245e+00 1.63044421455194391002e-02
14.500000 1.00000000000001221245e+00 -5.05081245851732585361e-02
14.500000 1.00000000000001221245e+00 -1.29558264624574266677e-03
