# tag norm n_hub[0] n_hub[1] n_hub[2] n_hub[3] n_hub[4] n_hub[5] n_hub[6] n_hub[7] n_hub[8] n_hub[9]
1 1.00000000000000000000e+00 5.01936364166738965831e-02 1.95933709409499501319e+00 8.43075418251877373166e-01 1.14523745549398192622e+00 2.41465299055292521857e-02 1.98477500923904615071e+00 3.15471463955112274569e-01 1.87610247867938495503e+00 8.07550451285629411480e-01 9.94110462677782469321e-01
2 1.00000000000000000000e+00 1.95582755273600063239e-02 1.97152107012996191671e+00 3.92037960887467451521e-02 1.95950691293475820487e+00 3.02939609144525015538e-02 1.96257758455872033387e+00 3.62002534564267730577e-02 1.96574122994324862468e+00 3.73293727742968414751e-02 1.97806754367205428480e+00
3 1.00000000000000000000e+00 1.84088518687119291617e-02 1.96387429295690196795e+00 3.54445343684995847755e-02 1.96456070899031076671e+00 3.54496912398787680787e-02 1.96452747502799551782e+00 3.54692448849840274994e-02 1.96455557428778515572e+00 3.61120853962232507550e-02 1.98159754097873364032e+00
4 1.00000000000000000000e+00 1.84024980331558216107e-02 1.96388766359836774988e+00 3.54447127828238298108e-02 1.96453118854063246701e+00 3.54679047455617180162e-02 1.96453212361437445921e+00 3.54688232569917299974e-02 1.96455533929576775520e+00 3.61122255934007221900e-02 1.98159752053892312951e+00
5 1.00000000000000000000e+00 1.84024735140030336333e-02 1.96388776451821689406e+00 3.54446759830527105550e-02 1.96453115911580811215e+00 3.54678929024119585223e-02 1.96453210757418061938e+00 3.54688453563497194110e-02 1.96455532096100249362e+00 3.61122397806258044195e-02 1.98159752029436586618e+00
