# tag norm j_0
20.700000 1.00000000000000111022e+00 -4.13563016506809575084e-04
20.700000 1.00000000000000111022e+00 -2.66571699390707789103e-04
20.700000 1.00000000000000111022e+00 -4.28510393937843664987e-04
20.700000 1.00000000000000111022e+00 4.68791990804575731989e-04
20.700000 1.00000000000000111022e+00 6.23776410297881213525e-04
20.700000 1.00000000000000111022e+00 4.84351072835177286387e-04
20.700000 1.00000000000000111022e+00 -4.16571237165773260169e-04
20.700000 1.00000000000000111022e+00 -2.61118465511340266255e-04
20.700000 1.00000000000000111022e+00 -4.11134673477757297665e-04
