# tag norm j_0
29.500000 9.99999999999982569499e-01 -6.31674994789390440234e-05
29.500000 9.99999999999982569499e-01 1.75703773705546009796e-04
29.500000 9.99999999999982569499e-01 -2.18173609943157802626e-04
29.500000 9.99999999999982569499e-01 -9.45457482981910241580e-04
29.500000 9.99999999999982569499e-01 -6.70970850427094747323e-04
29.500000 9.99999999999982569499e-01 -9.55452039725632044399e-04
29.500000 9.99999999999982569499e-01 -2.45106416210947143999e-04
29.500000 9.99999999999982569499e-01 1.62089767891294278665e-04
29.500000 9.99999999999982569499e-01 -6.15117624743755493600e-05
