# tag norm n_hub[0] n_hub[1] n_hub[2] n_hub[3] n_hub[4] n_hub[5] n_hub[6] n_hub[7] n_hub[8] n_hub[9] n_hub[10] n_hub[11] n_hub[12] n_hub[13] n_hub[14] n_hub[15] n_hub[16] n_hub[17] n_hub[18] n_hub[19] n_hub[20] n_hub[21] n_hub[22] n_hub[23] n_hub[24] n_hub[25] n_hub[26] n_hub[27] n_hub[28] n_hub[29] n_hub[30] n_hub[31] n_hub[32] n_hub[33] n_hub[34] n_hub[35] n_hub[36] n_hub[37] n_hub[38] n_hub[39] n_hub[40] n_hub[41] n_hub[42] n_hub[43] n_hub[44] n_hub[45] n_hub[46] n_hub[47] n_hub[48] n_hub[49]
1 1.00000000000000000000e+00 5.69822847288356960221e-03 1.99498906048254465162e+00 6.29176459409994028732e-03 1.99325115343871406282e+00 5.49901353619282329266e-02 1.98562182213763138705e+00 2.46627213597011674118e-01 1.89127170349627293788e+00 8.94175524882542149818e-01 1.28955475344693404338e+00 8.84572136676228248930e-01 1.20728356598769148711e+00 8.76626060218703484495e-01 1.05686762955882329607e+00 8.71956533788309839927e-01 1.06654420061315158286e+00 8.95769791514064550597e-01 1.05954539164143546337e+00 9.02539220456752055988e-01 1.06200467891570093926e+00 8.91688106092710097705e-01 1.06591771754971564867e+00 8.98437789229855510165e-01 1.04657525369725634690e+00 8.86409681648854141933e-01 1.04493045924747818276e+00 8.88418262379635836901e-01 1.02944147956864440197e+00 1.38931397879373998844e-02 1.99507446449235881225e+00 2.63797893560838214722e-01 1.93628653862916766393e+00 8.72792693476045045031e-01 1.48490205499406968670e+00 9.34907593384010970894e-01 1.20096733457712590010e+00 8.89557133020097090537e-01 1.04159793073994944024e+00 8.98692473851611883795e-01 1.05806963868712955446e+00 9.26629543167283520333e-01 1.08040442518056201138e+00 9.45017353475330779133e-01 1.09438474817875475154e+00 9.50099642215041284565e-01 1.09711041206323600683e+00 9.53319359911350305836e-01 1.46633209433072431160e+00 3.33050691919871411084e-01 5.65113521662216955477e-01
2 1.00000000000000000000e+00 4.93392614128027474224e-03 1.99018329650247705054e+00 9.78848547559430480491e-03 1.99023196619901221460e+00 9.76135879350162327661e-03 1.99099375761872177115e+00 9.01152284035399570028e-03 1.99023243803798988161e+00 9.86570316815725892323e-03 1.99043981018500915070e+00 9.41910192082885851239e-03 1.99038765550523244485e+00 9.72095709222552117890e-03 1.99034228189234552175e+00 9.54825548845069510540e-03 1.99047657537422284513e+00 9.63806925719339242786e-03 1.99041992478776474940e+00 9.61040336319372336116e-03 1.98996144621487291992e+00 9.99533450075727573914e-03 1.99019164312198282296e+00 9.77230841917615770942e-03 1.99014847005113670875e+00 9.85440135572440353839e-03 1.99009043942142183070e+00 9.88829531973764962183e-03 1.99011262699157431832e+00 9.86962144480751576991e-03 1.99022068350356251543e+00 9.77839823922898622455e-03 1.99076657088950792485e+00 9.21162986661687097079e-03 1.99068088502762141623e+00 9.30568702918774075250e-03 1.99043891788904914186e+00 9.32246117163670548478e-03 1.99062292788938144383e+00 9.79306398740851895279e-03 1.99038626147074304562e+00 9.60686484173936539044e-03 1.99042558278745995715e+00 9.54305805183652301749e-03 1.99042851257419983746e+00 9.50892336491534866105e-03 1.99051989887329416895e+00 9.22540407291122001310e-03 1.99071154437502095824e+00 9.82400775042043157559e-03 1.99478863985976628825e+00
3 1.00000000000000000000e+00 4.92646234354700025132e-03 1.99018330655576103361e+00 9.78072157183289270233e-03 1.99021899750160691234e+00 9.78108673515823943967e-03 1.99021886973434969370e+00 9.78103535997737298657e-03 1.99021892844410075440e+00 9.78097844418845951964e-03 1.99021913169936959243e+00 9.78100057954124808834e-03 1.99021880663218442287e+00 9.78118519750328062334e-03 1.99021886618764209942e+00 9.78105567318169472069e-03 1.99021897345631360032e+00 9.78094034627511287050e-03 1.99021905260099618573e+00 9.78083725315555610469e-03 1.99021919704171490473e+00 9.78104477063916621926e-03 1.99021894285912970268e+00 9.78105687305725821079e-03 1.99021895236244406036e+00 9.78099636230624763789e-03 1.99021900078898417163e+00 9.78105455088886140136e-03 1.99021895614575861089e+00 9.78102542372250548242e-03 1.99021895807030979597e+00 9.78117633333849996469e-03 1.99021882120230375612e+00 9.78104236862426847099e-03 1.99021893880599032300e+00 9.78105310040578053432e-03 1.99021831046569874779e+00 9.78147251808917685134e-03 1.99021916806290244395e+00 9.78113184602736988882e-03 1.99021894082836703355e+00 9.78105018474001788875e-03 1.99021890362220421622e+00 9.78108729537176431468e-03 1.99021891400888151225e+00 9.78107001752465121669e-03 1.99021872769789243129e+00 9.78131596011292368809e-03 1.99021916756212524646e+00 9.81676454410248394700e-03 1.99507352200943532949e+00
4 1.00000000000000000000e+00 4.92647518793140701959e-03 1.99018323877760416885e+00 9.78077015909716018793e-03 1.99021895111155022740e+00 9.78105790406079075860e-03 1.99021893093038992895e+00 9.78105713288581271603e-03 1.99021893814598138661e+00 9.78105038580719815533e-03 1.99021896335526871091e+00 9.78105305553474656255e-03 1.99021892306387049310e+00 9.78107560702201617175e-03 1.99021893075178080146e+00 9.78105968070103540257e-03 1.99021894384252862054e+00 9.78104551290963873666e-03 1.99021895345567023661e+00 9.78103300276066470187e-03 1.99021897108602296989e+00 9.78105895507812468648e-03 1.99021893982930664357e+00 9.78106011493761438869e-03 1.99021894096614393455e+00 9.78105267136541653428e-03 1.99021894686734768243e+00 9.78106003070320847992e-03 1.99021894144343813871e+00 9.78105626396357126506e-03 1.99021894157206125087e+00 9.78105725564055311638e-03 1.99021894286338030255e+00 9.78104631828467276089e-03 1.99021895101708468090e+00 9.78105929372443012870e-03 1.99021886628282151932e+00 9.78110722518129617475e-03 1.99021896762603778264e+00 9.78106948438391826661e-03 1.99021893986728160009e+00 9.78105916870756000869e-03 1.99021893501236402102e+00 9.78106379665320303796e-03 1.99021893634269386730e+00 9.78106154034019334431e-03 1.99021891350118362851e+00 9.78109372669269325207e-03 1.99021922299547804336e+00 9.81676170196813142887e-03 1.99507352411644722778e+00
