# tag norm j_0
28.600000 9.99999999999982014387e-01 -7.35147200505093445164e-06
28.600000 9.99999999999982014387e-01 -2.01906971740544572249e-04
28.600000 9.99999999999982014387e-01 1.62801219535256254736e-04
28.600000 9.99999999999982014387e-01 9.20446932240148686308e-04
28.600000 9.99999999999982014387e-01 7.36562028791200502399e-04
28.600000 9.99999999999982014387e-01 9.30791355477020580962e-04
28.600000 9.99999999999982014387e-01 1.88508303114994819763e-04
28.600000 9.99999999999982014387e-01 -1.90249442518475422913e-04
28.600000 9.99999999999982014387e-01 -8.59328549244357829185e-06
