# tag norm j_0
19.300000 1.00000000000023403501e+00 -2.44200991248413022423e-04
19.300000 1.00000000000023403501e+00 -3.39087813515474834330e-04
19.300000 1.00000000000023403501e+00 -6.95318851592306762591e-04
19.300000 1.00000000000023403501e+00 -3.14580557044475284806e-04
19.300000 1.00000000000023403501e+00 1.12446130517673126411e-04
19.300000 1.00000000000023403501e+00 7.63065376947835114505e-05
19.300000 1.00000000000023403501e+00 1.50195775610223468172e-05
19.300000 1.00000000000023403501e+00 -2.92271145978924444856e-05
19.300000 1.00000000000023403501e+00 -9.55621895247030510474e-06
19.300000 1.00000000000023403501e+00 -1.41548944920455971834e-05
19.300000 1.00000000000023403501e+00 -1.30431768902784296117e-05
19.300000 1.00000000000023403501e+00 -2.66169273618539283281e-05
19.300000 1.00000000000023403501e+00 8.77147787276551109718e-06
19.300000 1.00000000000023403501e+00 8.64898054467534200705e-05
19.300000 1.00000000000023403501e+00 1.14207081840325883862e-04
19.300000 1.00000000000023403501e+00 -2.84937218360933474000e-04
19.300000 1.00000000000023403501e+00 -7.04064230762524011914e-04
19.300000 1.00000000000023403501e+00 -3.61389264116352749469e-04
19.300000 1.00000000000023403501e+00 -2.66974826926396886870e-04
