# tag norm j_0
0.900000 1.00000000000000155431e+00 -1.06381246012916601626e-05
0.900000 1.00000000000000155431e+00 4.50261251497355104623e-06
0.900000 1.00000000000000155431e+00 -5.28633631792784923530e-06
0.900000 1.00000000000000155431e+00 -7.37415869196392839138e-07
0.900000 1.00000000000000155431e+00 -4.08501753498063474796e-06
0.900000 1.00000000000000155431e+00 -2.22750063223452317115e-07
0.900000 1.00000000000000155431e+00 -3.14252763112281252353e-06
0.900000 1.00000000000000155431e+00 -2.89985420841630121650e-07
0.900000 1.00000000000000155431e+00 -3.61129517317204828437e-06
0.900000 1.00000000000000155431e+00 3.46039317014974712991e-08
0.900000 1.00000000000000155431e+00 -3.61184765337847702766e-06
0.900000 1.00000000000000155431e+00 -4.07043041668394006919e-07
0.900000 1.00000000000000155431e+00 -3.11932475991423110236e-06
0.900000 1.00000000000000155431e+00 -4.90166350411152541178e-07
0.900000 1.00000000000000155431e+00 -3.87328166982664161950e-06
0.900000 1.00000000000000155431e+00 -7.10907388444788070613e-07
0.900000 1.00000000000000155431e+00 -5.32698330351666816414e-06
0.900000 1.00000000000000155431e+00 4.40977855538275125040e-06
0.900000 1.00000000000000155431e+00 -1.06907862875143828946e-05
