# tag norm j_0
15.600000 1.00000000000002309264e+00 2.44157704568653344604e-03
15.600000 1.00000000000002309264e+00 -5.73466703205275166177e-04
15.600000 1.00000000000002309264e+00 1.77254825704549652532e-03
15.600000 1.00000000000002309264e+00 -6.00349947012133989231e-04
15.600000 1.00000000000002309264e+00 1.73146218891806068403e-03
15.600000 1.00000000000002309264e+00 -6.52009826074494559627e-04
15.600000 1.00000000000002309264e+00 1.70914459118312557148e-03
15.600000 1.00000000000002309264e+00 -6.81119239496165082559e-04
15.600000 1.00000000000002309264e+00 1.68798934645030137246e-03
15.600000 1.00000000000002309264e+00 -6.97810950436554317151e-04
15.600000 1.00000000000002309264e+00 1.68862772604893391845e-03
15.600000 1.00000000000002309264e+00 -6.98990077826485626915e-04
15.600000 1.00000000000002309264e+00 1.72250101038694779232e-03
15.600000 1.00000000000002309264e+00 -6.90356626328511666785e-04
15.600000 1.00000000000002309264e+00 1.76496040097904325142e-03
15.600000 1.00000000000002309264e+00 -6.62186911027715010419e-04
15.600000 1.00000000000002309264e+00 1.82606381233109925366e-03
15.600000 1.00000000000002309264e+00 -6.54676999378652835562e-04
15.600000 1.00000000000002309264e+00 2.45244340510771983641e-03
