# tag norm j_0
3.600000 1.00000000000000599520e+00 -2.63160838537315506114e-04
3.600000 1.00000000000000599520e+00 -1.52359010790623571833e-04
3.600000 1.00000000000000599520e+00 -2.28293022064832563760e-04
3.600000 1.00000000000000599520e+00 -1.66470550279960646800e-04
3.600000 1.00000000000000599520e+00 -2.16555664146337483508e-04
3.600000 1.00000000000000599520e+00 -1.68400958992696723115e-04
3.600000 1.00000000000000599520e+00 -2.13971355431133257582e-04
3.600000 1.00000000000000599520e+00 -1.75380099521314086752e-04
3.600000 1.00000000000000599520e+00 -2.21185905258536362819e-04
3.600000 1.00000000000000599520e+00 -1.74421325797630643283e-04
3.600000 1.00000000000000599520e+00 -2.18332722543833774578e-04
3.600000 1.00000000000000599520e+00 -1.75463518506930259665e-04
3.600000 1.00000000000000599520e+00 -2.19342888783865652257e-04
3.600000 1.00000000000000599520e+00 -1.72461871230061294328e-04
3.600000 1.00000000000000599520e+00 -2.18960519090827916092e-04
3.600000 1.00000000000000599520e+00 -1.65298150222517993644e-04
3.600000 1.00000000000000599520e+00 -2.25718969138581285324e-04
3.600000 1.00000000000000599520e+00 -1.55069962799265825609e-04
3.600000 1.00000000000000599520e+00 -2.67639251662828505946e-04
