# tag norm j_0
11.700000 1.00000000000001199041e+00 -1.53285434029621664420e-01
11.700000 1.00000000000001199041e+00 -4.57482673582837034987e-02
11.700000 1.00000000000001199041e+00 1.04639503213889456523e-01
11.700000 1.00000000000001199041e+00 3.34869526436049058660e-02
11.700000 1.00000000000001199041e+00 -1.03956560606060399721e-01
11.700000 1.00000000000001199041e+00 3.27243931234061716240e-02
11.700000 1.00000000000001199041e+00 1.04577354156765528481e-01
11.700000 1.00000000000001199041e+00 -4.57992214869497663021e-02
11.700000 1.00000000000001199041e+00 -1.56075982335593305139e-01
