# tag norm j_0
29.900000 1.00000000000027133851e+00 1.44393065053285496804e-04
29.900000 1.00000000000027133851e+00 7.94095916761833607892e-05
29.900000 1.00000000000027133851e+00 8.03861112053126577190e-05
29.900000 1.00000000000027133851e+00 -2.32855261962884428238e-04
29.900000 1.00000000000027133851e+00 -2.17758384999616359454e-04
29.900000 1.00000000000027133851e+00 -4.93236081942482400102e-04
29.900000 1.00000000000027133851e+00 -3.99043806029920672309e-04
29.900000 1.00000000000027133851e+00 4.36939705865031462867e-05
29.900000 1.00000000000027133851e+00 2.09836786454081845443e-04
29.900000 1.00000000000027133851e+00 1.79938230340893432426e-07
29.900000 1.00000000000027133851e+00 2.24060849991638210647e-04
29.900000 1.00000000000027133851e+00 6.32614487907477587945e-05
29.900000 1.00000000000027133851e+00 -3.53680062596585889113e-04
29.900000 1.00000000000027133851e+00 -4.93355101707370941218e-04
29.900000 1.00000000000027133851e+00 -2.10074423666640650813e-04
29.900000 1.00000000000027133851e+00 -2.39554448168285798182e-04
29.900000 1.00000000000027133851e+00 7.30691194004560762602e-05
29.900000 1.00000000000027133851e+00 6.43503225124970743487e-05
29.900000 1.00000000000027133851e+00 1.35218069323392694114e-04
