# tag norm j_0
3.300000 1.00000000000000333067e+00 3.18014664290321245194e-04
3.300000 1.00000000000000333067e+00 7.18119127652004662389e-05
3.300000 1.00000000000000333067e+00 1.21022970617074948326e-04
3.300000 1.00000000000000333067e+00 1.75011816124713730290e-05
3.300000 1.00000000000000333067e+00 1.28354213882540812985e-04
3.300000 1.00000000000000333067e+00 2.49989499755401065051e-05
3.300000 1.00000000000000333067e+00 1.13849799168715213465e-04
3.300000 1.00000000000000333067e+00 1.62516144649969716742e-05
3.300000 1.00000000000000333067e+00 9.94708178893764864139e-05
3.300000 1.00000000000000333067e+00 1.19961506274142738217e-05
3.300000 1.00000000000000333067e+00 9.99168046078956201403e-05
3.300000 1.00000000000000333067e+00 1.69468137395465743406e-05
3.300000 1.00000000000000333067e+00 1.14227813376124607355e-04
3.300000 1.00000000000000333067e+00 2.80663892613764403118e-05
3.300000 1.00000000000000333067e+00 1.30672811846767924484e-04
3.300000 1.00000000000000333067e+00 1.99463533650847399999e-05
3.300000 1.00000000000000333067e+00 1.25027851145834904660e-04
3.300000 1.00000000000000333067e+00 7.25125249602671641475e-05
3.300000 1.00000000000000333067e+00 3.29773616768338551954e-04
