# tag norm j_0
13.400000 1.00000000000001998401e+00 -6.10021378445686161124e-03
13.400000 1.00000000000001998401e+00 -1.61255087344473654323e-04
13.400000 1.00000000000001998401e+00 -5.99953931012705155706e-03
13.400000 1.00000000000001998401e+00 -2.55602877451335504591e-04
13.400000 1.00000000000001998401e+00 -5.83166004994050291704e-03
13.400000 1.00000000000001998401e+00 -2.50057689021884017259e-04
13.400000 1.00000000000001998401e+00 -5.73970902544086725161e-03
13.400000 1.00000000000001998401e+00 -2.43372172264259145494e-04
13.400000 1.00000000000001998401e+00 -5.67806415447112602241e-03
13.400000 1.00000000000001998401e+00 -2.21406320116996333837e-04
13.400000 1.00000000000001998401e+00 -5.64560609421304194361e-03
13.400000 1.00000000000001998401e+00 -1.90486641872306003637e-04
13.400000 1.00000000000001998401e+00 -5.66121535165033801240e-03
13.400000 1.00000000000001998401e+00 -1.57889026766499206145e-04
13.400000 1.00000000000001998401e+00 -5.71361778876858759924e-03
13.400000 1.00000000000001998401e+00 -1.19780637745090279864e-04
13.400000 1.00000000000001998401e+00 -5.83360158987988441232e-03
13.400000 1.00000000000001998401e+00 5.54534852592705112211e-06
13.400000 1.00000000000001998401e+00 -5.82561493284404659232e-03
