# tag norm j_0
21.200000 1.00000000000000333067e+00 -1.87460488456899064416e-05
21.200000 1.00000000000000333067e+00 1.46337533565293637528e-04
21.200000 1.00000000000000333067e+00 1.65129520631572464804e-04
21.200000 1.00000000000000333067e+00 5.93490948514008775580e-04
21.200000 1.00000000000000333067e+00 1.78307409476588215116e-04
21.200000 1.00000000000000333067e+00 6.04278329584811784402e-04
21.200000 1.00000000000000333067e+00 1.79508788150893578523e-04
21.200000 1.00000000000000333067e+00 1.66134130913627667964e-04
21.200000 1.00000000000000333067e+00 1.26679793664947735365e-06
