# tag norm j_0
22.000000 1.00000000000002309264e+00 -8.22542547075343633001e-02
22.000000 1.00000000000002309264e+00 3.09638690364757718232e-02
22.000000 1.00000000000002309264e+00 2.72982498364359033038e-02
22.000000 1.00000000000002309264e+00 7.09276646410591654623e-02
22.000000 1.00000000000002309264e+00 -1.38721525306846366066e-01
22.000000 1.00000000000002309264e+00 7.17498774922253196307e-02
22.000000 1.00000000000002309264e+00 2.67056807658048768472e-02
22.000000 1.00000000000002309264e+00 3.02767894867948979265e-02
22.000000 1.00000000000002309264e+00 -8.14331663857262300077e-02
