# tag norm n_hub[0] n_hub[1] n_hub[2] n_hub[3] n_hub[4] n_hub[5] n_hub[6] n_hub[7] n_hub[8] n_hub[9] n_hub[10] n_hub[11] n_hub[12] n_hub[13] n_hub[14] n_hub[15] n_hub[16] n_hub[17] n_hub[18] n_hub[19] n_hub[20] n_hub[21] n_hub[22] n_hub[23] n_hub[24] n_hub[25] n_hub[26] n_hub[27] n_hub[28] n_hub[29] n_hub[30] n_hub[31] n_hub[32] n_hub[33] n_hub[34] n_hub[35] n_hub[36] n_hub[37] n_hub[38] n_hub[39] n_hub[40] n_hub[41] n_hub[42] n_hub[43] n_hub[44] n_hub[45] n_hub[46] n_hub[47] n_hub[48] n_hub[49]
1 1.00000000000000000000e+00 1.47334468926367945230e+00 1.17416000362344896679e+00 1.27037338515663034144e+00 1.44137920557537668742e+00 1.13581324429700325496e+00 1.24428128728538056613e+00 9.75713202577190741316e-01 1.12142526883343096600e+00 8.97792907028239550726e-01 1.19658508209707914460e+00 1.05955302920205762796e+00 1.04631226271200827860e+00 1.52440459955799401115e+00 5.43764075523641365884e-01 9.19721680540691255423e-01 7.27976718661497268492e-01 1.07945243535972656979e+00 8.86252392068420991045e-01 6.67909421116844925770e-01 9.71697771534059340226e-01 8.05199389129917397767e-01 9.83839996278728090573e-01 8.95821702105662365234e-01 1.09770620775518690238e+00 1.00032633924520242275e+00 8.07250338013831614248e-01 1.03155657690354130018e+00 9.87401096927404187120e-01 1.43895330951485433957e+00 1.47270292796908286448e+00 1.26706600610412789543e+00 1.32920162228140958938e+00 1.35450611638021389815e+00 1.22545761695768340438e+00 1.02308826342985570435e+00 9.73203718484578206294e-01 1.05447878936527361660e+00 6.11971782078658654846e-01 4.93755572244390206205e-01 5.93843034330204577742e-01 5.98552626378555663322e-01 9.09373433149917254070e-01 9.73692365645867696777e-01 9.30416160858965612945e-01 7.10898977831522338455e-01 8.73418963018225746886e-01 6.82589635807005823409e-01 9.76137595482464703878e-01 4.06601215564846241168e-01 1.13307595874843825001e+00
2 1.00000000000000000000e+00 9.98969361745175699063e-01 1.22289744222847862609e+00 7.70136917568545853463e-01 1.11590743897996480527e+00 7.98262168998860488500e-01 1.17446183026570638575e+00 9.24673013948524080696e-01 1.05312913899195392808e+00 7.21968734413157675611e-01 1.22345181621348175760e+00 9.92001170790885344886e-01 1.01037615358573140689e+00 1.00267512926952928609e+00 1.96700187743123233730e+00 6.89956814593744305331e-02 1.95661026665164183846e+00 1.00572617560401078585e+00 1.57543780028617930178e+00 4.42660233683753678857e-01 1.00475648808180872962e+00 9.91356216342828555632e-01 1.26457093288268151987e+00 8.38809828920465072599e-01 1.10686577114751805162e+00 7.52944187164351075303e-01 1.03734257817227737419e+00 8.64361825326512733803e-01 1.93571177517679449132e+00 1.00132714101366371295e+00 1.82746560148552927849e+00 9.62732367081465145731e-01 1.19601260795109998192e+00 9.07518832986862644674e-01 1.09257823301382384074e+00 9.76262419498364231174e-01 1.10355092818880540229e+00 6.55389090342411884116e-01 1.59756244202453201453e+00 5.76918534826831530538e-01 1.13694496783686194163e+00 1.19409609543625103156e-01 1.03155192975907805675e+00 7.21464847338652154329e-02 1.07720245460971475460e+00 8.36976703447680936421e-01 1.00009251204464977292e+00 9.85579275053408143670e-01 1.00085397261833652927e+00 1.51940399835753733870e-02 1.00466789662460320720e+00
3 1.00000000000000000000e+00 9.44039025678850340917e-01 1.27634132928916965710e+00 7.43068781738464689823e-01 1.24751408194072732627e+00 7.00351281375867440460e-01 1.17070318817817353718e+00 8.34210512020412298106e-01 1.13892410565508361842e+00 7.26151566154275340814e-01 1.24858876780473915247e+00 8.17136577289806487201e-01 1.15537726376694727115e+00 9.95888373478627020319e-01 1.52562122297893143497e+00 6.50989266644738995282e-01 1.82651882680681287852e+00 9.68882862548616330400e-01 1.29838871923503762495e+00 7.13237792918818946930e-01 1.01906328372645571534e+00 9.90170853650922500044e-01 1.24374037348822019666e+00 7.01226324079912144427e-01 1.09440215564369291990e+00 9.25556470977133116662e-01 1.08721888864685811704e+00 7.51785372082136915672e-01 1.24546550415224910324e+00 8.19948614668839947939e-01 1.29231836574603575762e+00 8.86750402916443913881e-01 1.17153369439342869285e+00 8.20389764353441464095e-01 1.21601494040444935152e+00 7.21709462962986547652e-01 1.08995784783614579894e+00 9.86294856764065475119e-01 1.44885401811813552264e+00 5.98706498781172991031e-01 1.67268948159817920640e+00 4.86564160092211817066e-01 1.34019686455998754404e+00 4.71003198335706085853e-01 1.23362681784889716141e+00 6.68508614983206461702e-01 1.03553559513148973892e+00 9.83739312290023759644e-01 1.00584553576985946677e+00 1.16780707740004215112e-02 9.97571109719522008952e-01
4 1.00000000000000000000e+00 9.05699709325361368428e-01 1.28795363044667765529e+00 7.65154524182714457226e-01 1.23819407281325299941e+00 6.74703650023316892081e-01 1.21084930648804345310e+00 7.79934186963577746887e-01 1.22439072929119974198e+00 6.82044231963518265971e-01 1.25978072954462372302e+00 7.16294370580760952905e-01 1.26091029147627686768e+00 9.63588256113348862186e-01 1.59728111132069106048e+00 7.24964974130571593314e-01 1.70666206258832753306e+00 9.32221837875772729731e-01 1.28704517755907299481e+00 7.41557387201128626053e-01 1.04101938581615005575e+00 9.60332179819482045779e-01 1.22388780248002526641e+00 7.27737729392591847777e-01 1.11277804026432680651e+00 9.23013734619916426105e-01 1.14989330797904587556e+00 7.49018914186823314694e-01 1.20264677059370983514e+00 8.03021399139412062063e-01 1.31060410488391787531e+00 8.34650487620571812641e-01 1.27508456555301430413e+00 7.20130704298159951549e-01 1.20015493029440900585e+00 6.95288801067189821126e-01 1.11911657916156115355e+00 9.23435487518556974429e-01 1.33999978299612187982e+00 7.42304832407063464039e-01 1.35694628234996139682e+00 6.61431734755134503878e-01 1.31377174116335160292e+00 6.46880193553816096319e-01 1.21281082028183084809e+00 6.96724545616761670175e-01 1.09829673767876245805e+00 9.17741692646421580726e-01 1.03030211693852802313e+00 5.16312372039646749755e-02 1.00011311783132428310e+00
5 1.00000000000000000000e+00 8.86250748547869227068e-01 1.28920853471012408775e+00 7.70817615825797664009e-01 1.22528007380652348424e+00 6.96077546602858254765e-01 1.23861024135140684876e+00 7.46474222929424890971e-01 1.25420147443678553500e+00 6.88636932860103856413e-01 1.24859213463546092626e+00 7.26877013797742832502e-01 1.28554565467278902879e+00 9.18382596267994122385e-01 1.61818422537820416629e+00 7.22513089095435545595e-01 1.67323374645257105797e+00 9.01988663463243245388e-01 1.28885411296104512857e+00 7.68345514849124611167e-01 1.05367589643890036122e+00 8.96372191477992741326e-01 1.25393738067784865642e+00 7.22352541890263988300e-01 1.16477389501614814193e+00 8.85371369953594666846e-01 1.19149951258738484583e+00 7.45117271667326996898e-01 1.22653569572806464549e+00 7.83977947767405369817e-01 1.30966216833375237449e+00 8.03385864282771144929e-01 1.28583486592883833310e+00 7.08676785177181578490e-01 1.19336490499384040298e+00 6.92216191705935290912e-01 1.15112466559354365003e+00 8.79616439427419849473e-01 1.32872315494376813660e+00 7.58140133803253957190e-01 1.31733142904450972743e+00 6.95277935368151411843e-01 1.28624422448620534531e+00 6.71554147239641130440e-01 1.18669932242658782151e+00 7.55913707834346637604e-01 1.11355818852778298833e+00 8.17441925321252482739e-01 1.06719990022938060470e+00 1.01268568355241797563e-01 1.00507763112741721478e+00
6 1.00000000000000000000e+00 8.21053286947282967567e-01 1.30817581940719995792e+00 7.44507198016556515086e-01 1.29577008320733844116e+00 7.43625378575751394550e-01 1.30754927800562081863e+00 7.33487521771777117863e-01 1.29347324866363977414e+00 6.74427324411619455446e-01 1.26814372593862878524e+00 7.17613338095650088455e-01 1.35924011383572618250e+00 7.89662791551087761555e-01 1.60892826502736663308e+00 7.14807365614957057609e-01 1.60740761588974301333e+00 8.74588526139723265729e-01 1.30517889418721599881e+00 7.76817414655735061224e-01 1.06898564874344748077e+00 8.05395140655978170052e-01 1.26775248223525993652e+00 7.26247160607839892243e-01 1.22580769869236028136e+00 8.37907022165844894701e-01 1.24882198498186181013e+00 7.37499938169837943036e-01 1.26690685433922789471e+00 7.58595351745238843932e-01 1.29856806146789760525e+00 7.66303243702820546801e-01 1.29115210529505497483e+00 7.03684247225290215866e-01 1.19772597383584011865e+00 6.97459016200343895342e-01 1.18113244393083594019e+00 8.37187552528910083893e-01 1.31563815774740544562e+00 7.65704942547958289367e-01 1.29821954097257763472e+00 7.13739698410516321125e-01 1.25451446592302939820e+00 6.90290584489822389713e-01 1.18304712330566030865e+00 8.15028220614343656969e-01 1.12687666054232127344e+00 7.05639461583145388701e-01 1.09704570144764890216e+00 1.60692783475596095988e-01 1.01197354247356829937e+00
7 1.00000000000000000000e+00 7.96168913255271060159e-01 1.30696475600136952089e+00 7.57730646053329182088e-01 1.32434442156394727164e+00 7.51711468337997401612e-01 1.34074220576974934005e+00 7.31706189846237808894e-01 1.34969154843119620857e+00 6.80837995514012472853e-01 1.38861275274619355713e+00 6.78377657393067656777e-01 1.48297255849685849505e+00 6.86529438324520291381e-01 1.55152384979132995646e+00 7.14386138662202352378e-01 1.48424053150137558177e+00 8.53814145761427667480e-01 1.28843713986147867523e+00 7.67352563651669039579e-01 1.10086129837097979056e+00 7.34897566732599205608e-01 1.27609191904038499210e+00 7.14803644295786799745e-01 1.27087709462666609284e+00 7.95783910789818915710e-01 1.28679666064022191208e+00 7.37314389273582726503e-01 1.29243458925337395549e+00 7.40282777330281138717e-01 1.29794180976334616595e+00 7.39934212165570759367e-01 1.28318414248553458457e+00 6.97026118820384898989e-01 1.21549611359366616092e+00 6.97483777772330504341e-01 1.21060373806050769474e+00 7.93696850758138894300e-01 1.30674222520183547225e+00 7.57646127339676067614e-01 1.28974149063335574716e+00 7.15856739933714125712e-01 1.23986331559190854357e+00 7.03976735081343840683e-01 1.21312757099922796655e+00 8.67822245047641604998e-01 1.10778746048033482907e+00 5.52018778517790464910e-01 1.16538471202276094907e+00 2.38016129615975097211e-01 1.02036093479800826778e+00
8 1.00000000000000000000e+00 7.91919959806494655474e-01 1.31072228921576106053e+00 7.63768279036381558811e-01 1.33527462348364478473e+00 7.50768601107999256072e-01 1.36441137421412927999e+00 7.21967892011979861522e-01 1.40244691033361923438e+00 6.75372253756926443913e-01 1.44681102188859211921e+00 6.62969612314488920823e-01 1.49840191957159696301e+00 6.75219073478091180718e-01 1.49839060586497030414e+00 7.29671361638754012446e-01 1.42768459806434711012e+00 8.35574772074206051364e-01 1.28216947394717095676e+00 7.62328525762349440420e-01 1.14361965550954014503e+00 6.93435278159016843524e-01 1.26962730380355348636e+00 7.07872023973994402013e-01 1.28897671960626758469e+00 7.62766887529237047616e-01 1.30198763112478710369e+00 7.34207620600930921384e-01 1.30102467839765578717e+00 7.30910966876363366040e-01 1.29686580348924040962e+00 7.22362372014193065972e-01 1.28007727901554146932e+00 6.96362820583726671586e-01 1.23228861722373195242e+00 6.94886399615109784378e-01 1.23514071713896544935e+00 7.52912387161341567499e-01 1.30260388238496482849e+00 7.35749062861168146021e-01 1.29204488434264908037e+00 7.11633005002492935454e-01 1.24791575150513978087e+00 7.18026030361308298389e-01 1.25305409914882659450e+00 8.82443945344852376245e-01 1.09420047990729751852e+00 4.62484924727804946887e-01 1.19759414505722960875e+00 2.94123351262401022677e-01 1.02692812869920202523e+00
9 1.00000000000000000000e+00 7.92285019410683521990e-01 1.31254556434980340640e+00 7.66242968416602554527e-01 1.34070441738128698361e+00 7.49629603921752596385e-01 1.37668686175202803490e+00 7.18289498716648044940e-01 1.42079836203357068314e+00 6.80600922324201995650e-01 1.46597526978671899300e+00 6.67660347656196972999e-01 1.49259236778856507755e+00 6.83311751479376172647e-01 1.46773596241988357747e+00 7.40124634189936014828e-01 1.40022584258507576394e+00 8.22944239979937708362e-01 1.28433658359146551931e+00 7.56806455074301109853e-01 1.17584849799908486290e+00 6.88449527872610933521e-01 1.25840157016780929133e+00 7.01604921609061515930e-01 1.29378093984406339345e+00 7.38923347695760068810e-01 1.30512774091641703400e+00 7.24755622265142451788e-01 1.30092756552852484297e+00 7.20081811155155016024e-01 1.29561794568988619680e+00 7.10047976007954440014e-01 1.28037971411645634667e+00 6.93517712169346545181e-01 1.25104597108443016396e+00 6.90874565009852115161e-01 1.25797485795537200559e+00 7.20398492644147125930e-01 1.30158614675095440916e+00 7.13129104323436902035e-01 1.29824236931512104753e+00 6.93707810397110158362e-01 1.27165334665769247380e+00 7.27070578418403168364e-01 1.28144055904059595008e+00 8.44506209969101750978e-01 1.08007749895567628506e+00 4.30685403485096318654e-01 1.22555723754086787203e+00 3.52785515552774708858e-01 1.03230276700363488018e+00
10 1.00000000000000000000e+00 7.96644219085954174986e-01 1.31679868703105484862e+00 7.69465279524194634142e-01 1.34979054501129769328e+00 7.43444421782717745906e-01 1.39294520733345628116e+00 7.11797341157443086423e-01 1.43746093731998159093e+00 6.81110828846802962566e-01 1.47155858022942576113e+00 6.72435294677901307381e-01 1.48025984250666686748e+00 6.91999607012833362063e-01 1.44496411266970126164e+00 7.45987061263382655873e-01 1.38238287483746269402e+00 8.09345675573060807650e-01 1.29132477975523496383e+00 7.55067068239856142853e-01 1.20547244462681080179e+00 6.88407525699615940873e-01 1.25555576736610197131e+00 6.96693632484483682532e-01 1.28920741111508974086e+00 7.20825590632348855991e-01 1.29928734531472778180e+00 7.14873358031198447016e-01 1.29888846873299135254e+00 7.09466095242010874600e-01 1.29636174964761252681e+00 6.99949597055937955403e-01 1.28427214391083754919e+00 6.87485450563861233420e-01 1.26902802483823151647e+00 6.82579859759676832454e-01 1.27516235170490199735e+00 6.90007513505820568867e-01 1.30627568787271552964e+00 6.81252467614647860827e-01 1.31062023197741672753e+00 6.72195046911778004706e-01 1.29782853030526657001e+00 7.15863014305867517706e-01 1.29213752755839772490e+00 7.99908711809853345542e-01 1.08466491494586181332e+00 4.45939118764153819008e-01 1.23093530875218393206e+00 4.15870124198054025300e-01 1.03820262089341031064e+00
11 1.00000000000000000000e+00 7.98618905286569202850e-01 1.31753605219354708034e+00 7.69682550096106199433e-01 1.35552753716615526081e+00 7.42602616000572202104e-01 1.40006140179392923883e+00 7.10056800424697653895e-01 1.44497212448088685477e+00 6.82793042600476129955e-01 1.47483248470431682620e+00 6.76858199260586657076e-01 1.47268657070330855063e+00 6.98185798214443376075e-01 1.43221957298689539506e+00 7.48791255476327077822e-01 1.37367449122370066661e+00 7.98484386652029809461e-01 1.29730814276419059716e+00 7.53997071075742431034e-01 1.22990205179301592686e+00 6.91404679407105482447e-01 1.25579060928627095350e+00 6.93138829333475370298e-01 1.28582348642608290668e+00 7.08716230714606876262e-01 1.29477654947947717901e+00 7.04333662421993911273e-01 1.29606600418921202866e+00 6.99265309231516973831e-01 1.29552644195704558250e+00 6.90567727911897466520e-01 1.28715677377098280942e+00 6.78039500048015941758e-01 1.27947091778753074820e+00 6.64187882369326243470e-01 1.28862929947684934362e+00 6.47002887747220256642e-01 1.31207105001233625963e+00 6.15557904528456045767e-01 1.32150681421604021537e+00 5.93707362405072824885e-01 1.31313018871724107584e+00 6.32018422023006620769e-01 1.25875025680997953970e+00 6.77214582206540294251e-01 1.11153073839652982713e+00 5.86524065817874751261e-01 1.22867042202490406311e+00 6.50915672168902781358e-01 1.05971467421668319453e+00
12 1.00000000000000000000e+00 8.02348768729863714988e-01 1.32088903728326401144e+00 7.70496687698286275570e-01 1.36103132721591868481e+00 7.39671780467993200681e-01 1.40944952959689051575e+00 7.07005141001221915076e-01 1.45124149204504737654e+00 6.84005057733258592378e-01 1.47342504019817654992e+00 6.81567996440203494046e-01 1.46287463740568046688e+00 7.03462462092843132666e-01 1.42152298922949138493e+00 7.47324835724183400565e-01 1.36880527401005358534e+00 7.82129747448381484887e-01 1.30814144143842714385e+00 7.53988126464882779665e-01 1.25240604094745222596e+00 6.95977903181654644627e-01 1.25862574235247470789e+00 6.88170208004379002631e-01 1.27995124486516886897e+00 6.95207976389026316433e-01 1.28944005295443231418e+00 6.91700751408051983660e-01 1.29332259629146761881e+00 6.85170003812027306189e-01 1.29456601388740888403e+00 6.73991279631473205747e-01 1.29373096330440495727e+00 6.56121753977127908364e-01 1.29459570755978892187e+00 6.32230060577947172717e-01 1.30647592184671790250e+00 6.01024706125611318797e-01 1.32075158246763058045e+00 5.73113025906273110266e-01 1.32684660789934549818e+00 5.66196684737338196136e-01 1.30961083665136279741e+00 6.10985671480909653397e-01 1.23260803608220825822e+00 6.65365588342717084736e-01 1.14272731367522495383e+00 7.25425213791190182100e-01 1.21998971389802290943e+00 6.99543340518093303970e-01 1.07474608520923409216e+00
13 1.00000000000000000000e+00 8.04043330795858213200e-01 1.32210745697069964599e+00 7.70358652469163684984e-01 1.36594222003892351580e+00 7.38484996973784224572e-01 1.41393894995362434663e+00 7.06206657845177998567e-01 1.45435341283568897452e+00 6.86513406114450996931e-01 1.47077996669645583161e+00 6.86944032342324151230e-01 1.45497158086606659388e+00 7.08216872367265937172e-01 1.41422453498947531259e+00 7.42344627608028773125e-01 1.36556601518234255188e+00 7.64478985732985116819e-01 1.32038666520636360779e+00 7.48558028549467624480e-01 1.28321247366572910309e+00 7.08015920917144936375e-01 1.27030759886814892390e+00 6.86816534263921196768e-01 1.27387991120097621156e+00 6.77925527130259220066e-01 1.27735702290006503112e+00 6.66163660907333143868e-01 1.28299128489194735891e+00 6.49467172396378078503e-01 1.29077576523462855818e+00 6.24664740825842224048e-01 1.30205718530652192477e+00 5.96663298636653127716e-01 1.31250863880480350687e+00 5.66222540237464433410e-01 1.32400807190247249423e+00 5.48123364430717519014e-01 1.32576799049669347141e+00 5.52870861352096620855e-01 1.30948681775032138574e+00 5.83787297112665193310e-01 1.26360429182309741414e+00 6.33917575329857263533e-01 1.19493229361222597085e+00 7.21425227796853474338e-01 1.22230217437071586595e+00 8.38865555896878056785e-01 1.23038864263460423487e+00 7.57127451843519705399e-01 1.08594271392132779575e+00
14 1.00000000000000000000e+00 8.01660058003365594281e-01 1.32116224454775910147e+00 7.68139342244017586658e-01 1.36358193864336096901e+00 7.38525071213907535750e-01 1.40892544823901322282e+00 7.08080727922091202053e-01 1.44614608902449459649e+00 6.88802430181786107255e-01 1.46257118904802729809e+00 6.87520381017644455213e-01 1.45064775505355392227e+00 7.03051583511399957871e-01 1.41789733002978857179e+00 7.29565245897213499049e-01 1.37577510667075553208e+00 7.50751305635746990497e-01 1.33496171010588504657e+00 7.48820129015816404738e-01 1.29501165270601248380e+00 7.18443781512506762787e-01 1.26986670927519895713e+00 6.87989275559977020436e-01 1.26427567777282012784e+00 6.65849403946868534376e-01 1.26965227339631581138e+00 6.44065118012950188486e-01 1.28270529157229007389e+00 6.17869306764076142713e-01 1.29811725114706555395e+00 5.90261952115309629363e-01 1.31223414020425765969e+00 5.66377279676139266940e-01 1.32313058344332579175e+00 5.54064597204347863979e-01 1.32011682126827345485e+00 5.61812756611823060915e-01 1.30742667921771649198e+00 5.88124664275958441984e-01 1.27576137370528153170e+00 6.28975765087191884817e-01 1.23403443079544095085e+00 6.74649986738892870619e-01 1.21720238703422989346e+00 7.58176458859487478747e-01 1.26444574328835512844e+00 8.31527383793836616377e-01 1.22914499618663008995e+00 7.46466293400404379277e-01 1.09563487942114012874e+00
15 1.00000000000000000000e+00 7.99868010241104210323e-01 1.32017730766160346079e+00 7.67360704854662900587e-01 1.36052601371946968456e+00 7.38582792267364118821e-01 1.40340974962905296053e+00 7.09283542285669144078e-01 1.43937100747005319867e+00 6.90304242294731085217e-01 1.45518176982163893740e+00 6.87426425335436297459e-01 1.44584416283859384933e+00 7.00847192867271706618e-01 1.41542064831077030185e+00 7.23185087315675212416e-01 1.37584608006123487733e+00 7.41780619280463460186e-01 1.33641036871844320899e+00 7.43218746789576001355e-01 1.30241047012947785966e+00 7.22045675728673175264e-01 1.27692833918662884685e+00 6.92553553566106039341e-01 1.26500273722443123958e+00 6.63490877564805514588e-01 1.26778261440924722159e+00 6.35038206162776952546e-01 1.28126509672610544577e+00 6.05128420234520181253e-01 1.29884788620744506815e+00 5.77749556993445545494e-01 1.31364654079488651917e+00 5.59303343408819153559e-01 1.31955183483546356626e+00 5.58110421681646373671e-01 1.31181372075907498598e+00 5.76676910048265267683e-01 1.28940555926221178673e+00 6.11038304366691487068e-01 1.25438897318330688790e+00 6.51476417499576632153e-01 1.22866328278800929219e+00 7.07968004183035737320e-01 1.24757636357147783102e+00 7.93707173522266051791e-01 1.27592466916576863234e+00 7.93378892267577406905e-01 1.22118057662015777609e+00 7.21124737110627966885e-01 1.12277636903493860387e+00
16 1.00000000000000000000e+00 7.70034442097110582992e-01 1.30363090947321524915e+00 7.49459594344504487218e-01 1.31006222582545750477e+00 7.42052350576697827833e-01 1.30627900754307502140e+00 7.31694030993047972444e-01 1.29606466354736005187e+00 7.18523778051942341172e-01 1.28534879227221265907e+00 7.05341015443363028581e-01 1.26852099648428184864e+00 6.98503329266089600935e-01 1.25822177263024448379e+00 6.94388262248509691155e-01 1.25849813582454084226e+00 7.06652251539002906888e-01 1.27212229457950676270e+00 7.30459949067629454866e-01 1.29853946330254976793e+00 7.49761762568844525312e-01 1.31210084884558741969e+00 7.43705429013205132627e-01 1.31501571485837920328e+00 7.24136446103098352367e-01 1.31389798906576271698e+00 7.06429188058042445419e-01 1.30811344295109388547e+00 6.95749196673759784382e-01 1.30458051214759152003e+00 6.89850714751044091777e-01 1.29681434690477037641e+00 6.84861146480134186376e-01 1.28595588879503064383e+00 6.82999089164385786432e-01 1.27311275356406117254e+00 6.84643877141124956864e-01 1.26031082139327121894e+00 6.86986032510800592732e-01 1.25911026703086692535e+00 7.04996124939899382333e-01 1.27194721269763411087e+00 7.45705854994629158128e-01 1.29668199069488543351e+00 7.87972709167321649915e-01 1.28375964780466356174e+00 7.62551069813514725837e-01 1.21584931389281614145e+00 7.08968285576794143843e-01 1.13903505728666143426e+00
17 1.00000000000000000000e+00 7.70635763316795729949e-01 1.30373594409588444698e+00 7.49661108083985672224e-01 1.31118524948288350807e+00 7.42180393748858246994e-01 1.30726491153162616143e+00 7.29946589488514763211e-01 1.29687405604591687869e+00 7.15241887526342767778e-01 1.28316756969677125966e+00 7.01943419152890935031e-01 1.26964426203918168135e+00 6.93344900043568523884e-01 1.26182028509188537413e+00 6.92243598020009898164e-01 1.26328313167675942985e+00 6.99675684411398823848e-01 1.27609485673871203559e+00 7.13241721859264488081e-01 1.29377259855720683213e+00 7.25218657935239985335e-01 1.30743816317717276299e+00 7.26302792669864527575e-01 1.31066680224674603217e+00 7.18309679076487905824e-01 1.30661226411593700547e+00 7.08802616189928791357e-01 1.30376256246554489415e+00 7.00056199389839206582e-01 1.29752149187429410837e+00 6.93314423385494649210e-01 1.28950199370183171688e+00 6.89215209893732416724e-01 1.28200020011118387409e+00 6.87088798877228734696e-01 1.27716128835098374772e+00 6.90678161915044053210e-01 1.27795261072975185890e+00 7.04528529974956074788e-01 1.28626061056830942597e+00 7.35918963213224697206e-01 1.29883537435778007030e+00 7.67039437569586812771e-01 1.29862269404869667966e+00 7.64796667053909029477e-01 1.26337598666865535968e+00 7.22301005307492305363e-01 1.22193366626364130489e+00 6.97153607546094344904e-01 1.17267161071284808926e+00
18 1.00000000000000000000e+00 7.57913554550539325660e-01 1.30267367906439823777e+00 7.36060802603320518678e-01 1.31287569725304087420e+00 7.34162854497198313908e-01 1.31313376897594236148e+00 7.27636512819953895637e-01 1.31041677329427819210e+00 7.17768658157771133332e-01 1.30239302972969750449e+00 7.10463276449500802379e-01 1.29266696237791700597e+00 7.02395175912401192875e-01 1.28131383046437630213e+00 6.93499388757384593873e-01 1.27383894287799659395e+00 6.86974802403546802587e-01 1.27143101667984370629e+00 6.83725230673238648649e-01 1.27536134724246896788e+00 6.86326074113515760544e-01 1.28338770283388159399e+00 6.88532529367877232929e-01 1.29807899275335092426e+00 6.90697444886298694833e-01 1.30771319525192808442e+00 6.93031371829357811798e-01 1.31076358821283101008e+00 6.92333114484581235715e-01 1.31125000062137186951e+00 6.89399079299979899993e-01 1.30749882843664111398e+00 6.90058942716669898587e-01 1.30634789151918728756e+00 6.92616610757063377868e-01 1.30544447964917176286e+00 7.02077522327199887719e-01 1.30704683228481011170e+00 7.20010971737349847466e-01 1.31069817741871075256e+00 7.43430909349600987923e-01 1.31127458226900373006e+00 7.56536893984602221153e-01 1.29694546873578309132e+00 7.43551308229428942198e-01 1.25944797224397508906e+00 7.12188517269414567146e-01 1.21860814709063025596e+00 6.96345898940799901133e-01 1.18165164659991073215e+00
19 1.00000000000000000000e+00 7.56010582092787930542e-01 1.30231466451941013673e+00 7.34544292698212308856e-01 1.31189776337764274494e+00 7.31919255820477565599e-01 1.31338269337248747526e+00 7.27357538783842016983e-01 1.31100227132566615751e+00 7.19897955524054888876e-01 1.30602659513905772215e+00 7.11620047530057586727e-01 1.29936060362753669217e+00 7.02841045152887478054e-01 1.29193469613948264119e+00 6.94824076517297273270e-01 1.28570877956620321925e+00 6.88647086029778865424e-01 1.28287256205330613135e+00 6.85199909501307047321e-01 1.28279744208210355616e+00 6.83822834608256657773e-01 1.28721058841591706745e+00 6.84199726608314628962e-01 1.29465540719043703533e+00 6.85746997824710047276e-01 1.30217231233708541360e+00 6.87581975107521170543e-01 1.30582980488545530307e+00 6.88289921070022514549e-01 1.30987374217336260962e+00 6.94036135256451469644e-01 1.30981649314411430218e+00 7.01241449035290287384e-01 1.31152970996588025265e+00 7.10385457771448791675e-01 1.31406428501247973806e+00 7.21138447609455890408e-01 1.31672573141800897112e+00 7.30819372584020854333e-01 1.30983789916903137218e+00 7.29901003091107725140e-01 1.29577847504834675618e+00 7.19539301148039101008e-01 1.27460527125943645643e+00 7.02723190345505122067e-01 1.24894788451607730018e+00 6.85714096893896618568e-01 1.24379616104178269964e+00 6.95376283220756175041e-01 1.21448018139391544779e+00
20 1.00000000000000000000e+00 7.38574340497997416932e-01 1.30046971635259955846e+00 7.14092913774137305616e-01 1.31152579059498397562e+00 7.12674601254948081319e-01 1.31537013386091672373e+00 7.13302952105826393314e-01 1.31675786894376511960e+00 7.15189596698434848498e-01 1.31688540871616788230e+00 7.15331004995605868046e-01 1.31834360694850682982e+00 7.11248650340232768663e-01 1.31692600874681930989e+00 7.09898015205220667134e-01 1.31766169067200156206e+00 7.03715037546395194568e-01 1.31494974806153064328e+00 6.99538299828826093396e-01 1.31391424746746232621e+00 6.93675505923633473060e-01 1.31228440705308480041e+00 6.89371031165814773800e-01 1.31095252685158225603e+00 6.85860016942518857519e-01 1.31185056033285651900e+00 6.80870079921610749096e-01 1.31091416851989484016e+00 6.84218003765891702450e-01 1.31267990390170319337e+00 6.83560568254954925571e-01 1.31347284831605448652e+00 6.85255504719681884929e-01 1.31305372616025906041e+00 6.88582619943622020742e-01 1.31398701708377041442e+00 6.91004483176453243587e-01 1.30986934817165301403e+00 6.93639640955700409464e-01 1.30163431056269152108e+00 6.93803763568013764917e-01 1.28857118684434523992e+00 6.89610031476398210870e-01 1.27033177447550982286e+00 6.86278179388251863280e-01 1.25439272123694989247e+00 6.85972795638346011238e-01 1.24659637271479328824e+00 6.95402623576361178515e-01 1.22593464674515773005e+00
21 1.00000000000000000000e+00 7.37878597076737308136e-01 1.30036493056010327152e+00 7.13455848029451611403e-01 1.31059159889239928987e+00 7.12442914227359835877e-01 1.31443033712103041211e+00 7.13019415312369009285e-01 1.31636834457407081445e+00 7.13482311837656757447e-01 1.31749989472916251287e+00 7.12971072392623694824e-01 1.31820267465706386645e+00 7.11002490330491898618e-01 1.31870633737127218588e+00 7.07902157777000384797e-01 1.31906023151174234265e+00 7.04087120943062139133e-01 1.31935212565889625758e+00 6.99635895300155574716e-01 1.31951573821282486243e+00 6.95185533697020630051e-01 1.31944037055912111178e+00 6.90250577412609978012e-01 1.31959712301982845517e+00 6.85929700242644990738e-01 1.31969569999156988160e+00 6.82736232790592700859e-01 1.31939243424687013828e+00 6.80860687433809119717e-01 1.31851974319055686991e+00 6.80280874088041054293e-01 1.31723085455701616198e+00 6.80394381042238038937e-01 1.31373892169833039745e+00 6.81723285429763015131e-01 1.30916197839929382418e+00 6.82301240507820816461e-01 1.29914350424813451745e+00 6.82094173780425028220e-01 1.28693715174839029558e+00 6.80701115369749643058e-01 1.27426002275161054378e+00 6.80446841597948326452e-01 1.26598126577457237296e+00 6.81576418070964029639e-01 1.27308588587118554081e+00 6.84451383366137200426e-01 1.26932249316998246869e+00 6.98090148156675915914e-01 1.24749992127192865787e+00
22 1.00000000000000000000e+00 7.32951477036986709379e-01 1.29978431188519660822e+00 7.06804883216172297189e-01 1.31062410359291603434e+00 7.04520821035422351031e-01 1.31480883907188039750e+00 7.06288701190407097741e-01 1.31626658794040962697e+00 7.06838069981545746856e-01 1.31745599837044125024e+00 7.07324436425988190003e-01 1.31804163574922394986e+00 7.07253036458066031145e-01 1.31906032608591194943e+00 7.07030625255185896094e-01 1.31895958393262380248e+00 7.05036421362448595396e-01 1.31898419663299937277e+00 7.03725564285983984369e-01 1.31981565015717117184e+00 7.01669694898570450725e-01 1.31983036474153148099e+00 6.98162371408880488843e-01 1.31957699351005097732e+00 6.93220238033266156208e-01 1.31850308827543383217e+00 6.89627869710113361457e-01 1.31731453229286521456e+00 6.86894778083960932946e-01 1.31505807170319655164e+00 6.84357845814254073247e-01 1.31206794825725747700e+00 6.83409112444798294561e-01 1.30830649265876952647e+00 6.82575578783981562481e-01 1.30224059843303097139e+00 6.82597806655221961414e-01 1.29508445175363484658e+00 6.81899704063613665284e-01 1.28626330858610438135e+00 6.81403708878898339840e-01 1.27869055311122248320e+00 6.81856973546884570503e-01 1.27363923366186182484e+00 6.83536553356549392291e-01 1.27285284190294967210e+00 6.87669777213145816397e-01 1.27188827239515678258e+00 6.98209826980620396064e-01 1.25001613917726261960e+00
23 1.00000000000000000000e+00 7.31745068280761135071e-01 1.29980489436580670670e+00 7.05454494620494809709e-01 1.31003929993127909981e+00 7.03412635131604124794e-01 1.31396518009575280495e+00 7.03810897066382334941e-01 1.31583047896761207163e+00 7.04496017315570877138e-01 1.31686890041035109533e+00 7.04953526890006676453e-01 1.31743925931098515569e+00 7.04972606919126554281e-01 1.31773834082208529672e+00 7.04531915118592255709e-01 1.31782142023007575737e+00 7.03691924339328256366e-01 1.31781652116253655826e+00 7.02582316242483795321e-01 1.31746486182441580048e+00 7.00703771150108623011e-01 1.31673319167340130420e+00 6.97980690150249105663e-01 1.31553911976297488451e+00 6.94944424028514085023e-01 1.31360512949475571887e+00 6.92229219057881151045e-01 1.31103143743828431944e+00 6.89424486524120139208e-01 1.30661728757095318976e+00 6.87300241887729645995e-01 1.30239475517132885507e+00 6.84559125549202840411e-01 1.29657504901362008454e+00 6.82655832207547552670e-01 1.29138071498311113317e+00 6.82278173363220385994e-01 1.28906954401122852971e+00 6.80256677514183394351e-01 1.28758018290878784029e+00 6.81147229891411520875e-01 1.29056001189436897469e+00 6.82747967410444411840e-01 1.28951398593459165554e+00 6.86375599352718857027e-01 1.28911496531894642636e+00 6.88711036767949869031e-01 1.28999934094831902875e+00 6.99813201038968824008e-01 1.26471704893593317465e+00
24 1.00000000000000000000e+00 7.20772831216598630633e-01 1.29893914617962513702e+00 6.90804979088297965717e-01 1.30943936995730347839e+00 6.85950652159486251591e-01 1.31384782000021815840e+00 6.84826314835977001394e-01 1.31661188688695518501e+00 6.84649126825459530821e-01 1.31761339918610054234e+00 6.84574427038920685362e-01 1.31903301383904336674e+00 6.84893733945453941914e-01 1.31969218535246168855e+00 6.85287989697668908917e-01 1.31937544482588453576e+00 6.85241241470989859152e-01 1.31893959069367694426e+00 6.87507198702212773966e-01 1.31916822426126545409e+00 6.89986582275818882692e-01 1.31920140772806093743e+00 6.91852530758613748496e-01 1.32042980372776352915e+00 6.94370910563342658151e-01 1.32128748608148050003e+00 6.94641974454606736522e-01 1.31493888795711311168e+00 6.94688763955706001241e-01 1.31538600791756477015e+00 6.93011976719531963553e-01 1.31191377742681392071e+00 6.90791801851530773426e-01 1.30857588532396440506e+00 6.88062903086401389530e-01 1.30558354188114500438e+00 6.85775785539162852089e-01 1.30433237253490519336e+00 6.84619833562249313630e-01 1.30291357713942002050e+00 6.84248526258578904091e-01 1.30214172494525448620e+00 6.84726232784699018197e-01 1.30190961175425901075e+00 6.86344382129195795805e-01 1.30119387570910149954e+00 6.90254357801734830247e-01 1.29823961881067240220e+00 7.00439098566692286418e-01 1.27096818459103078069e+00
25 1.00000000000000000000e+00 7.20078779782601041681e-01 1.29895772059781289265e+00 6.89656601607303021417e-01 1.30940967073984793068e+00 6.84590899829153665124e-01 1.31372869980458273353e+00 6.82664134791915455658e-01 1.31609930222086224383e+00 6.81736873094320405819e-01 1.31752927768060845715e+00 6.81190154956302196254e-01 1.31851872935938607689e+00 6.80777165567269193502e-01 1.31914930730372814693e+00 6.80386075743941387550e-01 1.31955965438225319986e+00 6.80246924834121635683e-01 1.31997535897542395134e+00 6.80420925173507051831e-01 1.32031465004207415603e+00 6.80509020288974086910e-01 1.32071105116653275680e+00 6.80528864913208964005e-01 1.32083217050693857431e+00 6.80314755682155047900e-01 1.32079984546572681836e+00 6.80077479770848425389e-01 1.32047597047378029167e+00 6.80286365254866076668e-01 1.31937113540661621336e+00 6.79433212638005601391e-01 1.31972399543882379369e+00 6.79491821245264748796e-01 1.31868187266270253666e+00 6.79601557876443607142e-01 1.31904607850045940687e+00 6.80862513003519964627e-01 1.31896894266319897326e+00 6.82016543206936609600e-01 1.31929795188680998308e+00 6.82346134394682724000e-01 1.31812034258602772674e+00 6.83234038195371540247e-01 1.31739596131222902464e+00 6.85199684057861357900e-01 1.31584771647486697965e+00 6.90174565816678686758e-01 1.31060285276470445126e+00 7.00970544561676178752e-01 1.28008610529674449197e+00
26 1.00000000000000000000e+00 7.19303004895804898311e-01 1.29894445689337501015e+00 6.88550971571906145208e-01 1.30943304056639364674e+00 6.83196294510048929283e-01 1.31382305875965688102e+00 6.81026079560790531531e-01 1.31623333859420421632e+00 6.79809664327848395260e-01 1.31780641511653362485e+00 6.79124004663702485196e-01 1.31893573973823841072e+00 6.78693114301274991185e-01 1.31972471752729458849e+00 6.78292634461660437495e-01 1.32026961688359745217e+00 6.78017091556395556928e-01 1.32055154275595887370e+00 6.77866882276589644007e-01 1.32115838103825677941e+00 6.77819826611262166161e-01 1.32160347676820078000e+00 6.77713441083692913480e-01 1.32143502741339680107e+00 6.77634712239458592009e-01 1.32171748052794635342e+00 6.78130390519186776466e-01 1.32198871171356824306e+00 6.78381177570991700243e-01 1.32215049996873612592e+00 6.78702820216105617845e-01 1.32237609596892125019e+00 6.79046060495614334229e-01 1.32232660086903175412e+00 6.79627273074320803481e-01 1.32210419333459294755e+00 6.80350328657989833481e-01 1.32179821905219374578e+00 6.81245926677973012708e-01 1.32115322009863689345e+00 6.82264689474391672341e-01 1.32023516486326086827e+00 6.83763655241183432310e-01 1.31896122041427776850e+00 6.86185543495763661248e-01 1.31677117964478451739e+00 6.90579210065139226238e-01 1.31143549555864313838e+00 7.01075378995666520510e-01 1.28066292938554782133e+00
27 1.00000000000000000000e+00 7.19294519408430255147e-01 1.29894549655427127277e+00 6.88542283368163920976e-01 1.30943162650097444377e+00 6.83169559347018839901e-01 1.31381110806495815524e+00 6.80972981238079366761e-01 1.31624830504775025553e+00 6.79785138245596942674e-01 1.31780392831094728123e+00 6.79053172597061993621e-01 1.31888006616309438890e+00 6.78568961442430063080e-01 1.31966123005910795918e+00 6.78228289476377033118e-01 1.32025099729948958149e+00 6.77995786872049088778e-01 1.32070541610958835932e+00 6.77889646958003688759e-01 1.32108124041776830992e+00 6.77823621513846563680e-01 1.32135164770223512143e+00 6.77864410604237410674e-01 1.32156916039027549914e+00 6.78050013129193440697e-01 1.32175504495438755903e+00 6.78335495465086424360e-01 1.32181600535612786551e+00 6.78659910424321499711e-01 1.32192519081182835450e+00 6.78969880264568614869e-01 1.32207323519640818077e+00 6.79479990061667593615e-01 1.32197083039484120093e+00 6.79893990518606217144e-01 1.32182021979407249290e+00 6.80336469509574270909e-01 1.32163637522091947929e+00 6.81073749688346885556e-01 1.32105489172308443457e+00 6.82077766825243569926e-01 1.32036430087782119536e+00 6.83769806258336165783e-01 1.31905734725068035651e+00 6.86259023580914395701e-01 1.31682274540466148771e+00 6.90568022774060263913e-01 1.31150408588862887882e+00 7.01059040942132893903e-01 1.28073797399277955478e+00
28 1.00000000000000000000e+00 7.19387406301315590618e-01 1.29895005588701439869e+00 6.88674702701323138143e-01 1.30943176259010995999e+00 6.83339281954019495124e-01 1.31380582141289692366e+00 6.81178043594934612415e-01 1.31623364680365684265e+00 6.80034851297954046068e-01 1.31777626620999432916e+00 6.79350568377585117830e-01 1.31883600037641435243e+00 6.78915176626634919721e-01 1.31960229133299034032e+00 6.78635763586841522788e-01 1.32016570601635052640e+00 6.78462687368296957224e-01 1.32059582259043062358e+00 6.78361873035606577353e-01 1.32092557653977715759e+00 6.78341778450351040597e-01 1.32115828435209969882e+00 6.78333581361237891727e-01 1.32136019267099658059e+00 6.78441679236112427098e-01 1.32142772363397598134e+00 6.78654532600091564554e-01 1.32144807709850065081e+00 6.78762614576295941760e-01 1.32151283612873360340e+00 6.78973569357181339079e-01 1.32157099628071406094e+00 6.79350104703057011690e-01 1.32149796157713717015e+00 6.79794727195257686425e-01 1.32139233976317549413e+00 6.80374535256136114825e-01 1.32117333760016997246e+00 6.81153458784695131634e-01 1.32077236686792742759e+00 6.82214888197489544019e-01 1.32010029606725565188e+00 6.83764344028850779011e-01 1.31897170260382057272e+00 6.86196780491870383933e-01 1.31680348697113758227e+00 6.90574960839489548903e-01 1.31145039052904444077e+00 7.01059594972435862203e-01 1.28070555320069590088e+00
29 1.00000000000000000000e+00 7.19397721337069806502e-01 1.29895044600806341961e+00 6.88688775550160725558e-01 1.30943181476441661282e+00 6.83357182282837150034e-01 1.31380506194909885131e+00 6.81200180650138653604e-01 1.31623157185614902964e+00 6.80061249005455170646e-01 1.31777299406418402228e+00 6.79381409980690298411e-01 1.31883240221324826713e+00 6.78951875372059032721e-01 1.31959791340249799063e+00 6.78677812484188902609e-01 1.32016893406642954467e+00 6.78510165251644425943e-01 1.32060273228830782344e+00 6.78421846273837614305e-01 1.32093484298645069686e+00 6.78398239321285068115e-01 1.32118649064515936153e+00 6.78430936737145051652e-01 1.32137099028501658893e+00 6.78515494591202528163e-01 1.32149375133440516450e+00 6.78649545034705981017e-01 1.32156802198386968961e+00 6.78821107428680292628e-01 1.32159543163490944551e+00 6.79080456613388894205e-01 1.32156879287569006820e+00 6.79407426362224176053e-01 1.32148348190835052129e+00 6.79839453682116401367e-01 1.32131409543331046486e+00 6.80401412910936920220e-01 1.32103902637631920314e+00 6.81163430387309309921e-01 1.32060941839464773828e+00 6.82224837719118126778e-01 1.31993234547423488046e+00 6.83765708013521877895e-01 1.31879611030803167715e+00 6.86194937266445648127e-01 1.31664051543299964742e+00 6.90568673071487282300e-01 1.31131031685591703528e+00 7.01049576781634709022e-01 1.28060304334894592415e+00
30 1.00000000000000000000e+00 7.19410934103828614283e-01 1.29895123393541700452e+00 6.88707193553458774105e-01 1.30943215722709016546e+00 6.83379630588577313688e-01 1.31380473871318370627e+00 6.81225940459683987349e-01 1.31623073937383039400e+00 6.80089834230052314723e-01 1.31777102995695494236e+00 6.79411618017642382483e-01 1.31882958322834142884e+00 6.78982810599394137618e-01 1.31959298743776498597e+00 6.78706805568221271940e-01 1.32016229407187024592e+00 6.78535785081195164103e-01 1.32059446043424033590e+00 6.78442700427488776249e-01 1.32092436498312837401e+00 6.78412220356233386376e-01 1.32117480417733013098e+00 6.78436463695842206789e-01 1.32135951831002129708e+00 6.78512481843695947070e-01 1.32148725920944354328e+00 6.78640511974392568462e-01 1.32156284306769000736e+00 6.78825396341661058131e-01 1.32158676354318194157e+00 6.79075666600637450898e-01 1.32155624033740992651e+00 6.79405861759364126939e-01 1.32146300187030663054e+00 6.79837693245399221631e-01 1.32129210177479494703e+00 6.80406922150171955543e-01 1.32101697819959817970e+00 6.81170877159026133540e-01 1.32058811345337479004e+00 6.82229196688583172659e-01 1.31991034551316732681e+00 6.83769622162033741120e-01 1.31877464372364294753e+00 6.86195217259346512684e-01 1.31662143156158384372e+00 6.90567766079121736489e-01 1.31129409057140677852e+00 7.01048802543148941169e-01 1.28059032283679208319e+00
31 1.00000000000000000000e+00 7.19412829042080148589e-01 1.29895129355911520541e+00 6.88709516852025860345e-01 1.30943223887145299145e+00 6.83382426078567140060e-01 1.31380466898514769447e+00 6.81229202766947317116e-01 1.31623015832291945237e+00 6.80093136776020013023e-01 1.31777035869576142346e+00 6.79414920155595125628e-01 1.31882840266349909975e+00 6.78985583833671801912e-01 1.31959220357761641829e+00 6.78709879757914746889e-01 1.32016132199392699498e+00 6.78538878125764188809e-01 1.32059320096428489677e+00 6.78445572899012971924e-01 1.32092305850595681527e+00 6.78414921704530105018e-01 1.32117316837732579060e+00 6.78438917122048068542e-01 1.32135778762878919323e+00 6.78514449438265110359e-01 1.32148558715808861486e+00 6.78642299866552556331e-01 1.32156107990820137488e+00 6.78826883958328464175e-01 1.32158501465327749003e+00 6.79076953795115456636e-01 1.32155434187285258929e+00 6.79406770276419158527e-01 1.32146106611186198165e+00 6.79838606833034098109e-01 1.32129005975764357572e+00 6.80407625970649410085e-01 1.32101437519663411635e+00 6.81171381218992011419e-01 1.32058512433355934590e+00 6.82229482863648484248e-01 1.31990701460833670389e+00 6.83769598579985760090e-01 1.31877103879979529211e+00 6.86195126066622251848e-01 1.31661787871296320773e+00 6.90567651359072498529e-01 1.31129073124098627368e+00 7.01048524301889464105e-01 1.28058768585693583120e+00
32 1.00000000000000000000e+00 7.19413367426757432987e-01 1.29895133767239623346e+00 6.88710364367398075736e-01 1.30943218292797514124e+00 6.83383198448098028166e-01 1.31380466436462994828e+00 6.81229986590297320603e-01 1.31623010807891915874e+00 6.80093948776239964893e-01 1.31777020459508320549e+00 6.79415711771268027164e-01 1.31882823956460382142e+00 6.78986323825996662684e-01 1.31959198907591335193e+00 6.78710542602642186161e-01 1.32016101766497984116e+00 6.78539481772380770330e-01 1.32059287760063659434e+00 6.78446162342703162906e-01 1.32092269869639200586e+00 6.78415459524693065241e-01 1.32117274705095333331e+00 6.78439397718700432094e-01 1.32135730275466700689e+00 6.78514861547601544345e-01 1.32148506936807752510e+00 6.78642631012773001054e-01 1.32156054892288032931e+00 6.78827209404003650839e-01 1.32158449779775821753e+00 6.79077293773254320186e-01 1.32155379637748215949e+00 6.79407111512973171941e-01 1.32146046932817551323e+00 6.79838959425249744761e-01 1.32128944081266097577e+00 6.80408021694706599547e-01 1.32101370636056980601e+00 6.81171775534163859156e-01 1.32058433110106965280e+00 6.82229775877562505393e-01 1.31990610587352241723e+00 6.83769926727183063875e-01 1.31877004948268750084e+00 6.86195347613609007986e-01 1.31661685968544817094e+00 6.90567750361710697149e-01 1.31128985683946952534e+00 7.01048651453936022548e-01 1.28058663689704776978e+00
33 1.00000000000000000000e+00 7.19413540779696547567e-01 1.29895133499073600625e+00 6.88710411419846568748e-01 1.30943225767323756514e+00 6.83383415982953157375e-01 1.31380463416137338584e+00 6.81230195618333311813e-01 1.31623001849865683965e+00 6.80094101261294103900e-01 1.31777017496260318019e+00 6.79415875488980414154e-01 1.31882816305066419282e+00 6.78986486761182894689e-01 1.31959190877148224708e+00 6.78710695906202032823e-01 1.32016096677954242189e+00 6.78539659560184804654e-01 1.32059280463943551354e+00 6.78446328020901767708e-01 1.32092261586326853440e+00 6.78415630117471413207e-01 1.32117267932041304590e+00 6.78439570860016494258e-01 1.32135724317392533322e+00 6.78515037243856311555e-01 1.32148500063554052986e+00 6.78642788512185179961e-01 1.32156045384028009160e+00 6.78827335377789387039e-01 1.32158439087582224580e+00 6.79077397565716500694e-01 1.32155367446278826371e+00 6.79407196947601876857e-01 1.32146034994877381585e+00 6.79839050233800423761e-01 1.32128928784926147344e+00 6.80408069348261701492e-01 1.32101350996686206507e+00 6.81171828750969043931e-01 1.32058409296627821128e+00 6.82229843111050726634e-01 1.31990585273135185851e+00 6.83769928777948732268e-01 1.31876981344546106989e+00 6.86195342919773909607e-01 1.31661661849871602925e+00 6.90567815229484405215e-01 1.31128946783996469527e+00 7.01048655508080709176e-01 1.28058648374997452457e+00
