# tag norm n_hub[0] n_hub[1] n_hub[2] n_hub[3] n_hub[4] n_hub[5] n_hub[6] n_hub[7] n_hub[8] n_hub[9] n_hub[10] n_hub[11] n_hub[12] n_hub[13] n_hub[14] n_hub[15] n_hub[16] n_hub[17] n_hub[18] n_hub[19] n_hub[20] n_hub[21] n_hub[22] n_hub[23] n_hub[24] n_hub[25] n_hub[26] n_hub[27] n_hub[28] n_hub[29] n_hub[30] n_hub[31] n_hub[32] n_hub[33] n_hub[34] n_hub[35] n_hub[36] n_hub[37] n_hub[38] n_hub[39] n_hub[40] n_hub[41] n_hub[42] n_hub[43] n_hub[44] n_hub[45] n_hub[46] n_hub[47] n_hub[48] n_hub[49]
1 1.00000000000000000000e+00 1.48121823152686582503e+00 1.17471593930491513547e+00 1.26377665454962095914e+00 1.44173276760293256338e+00 1.13558546580619790234e+00 1.24379748958339764187e+00 9.75542688426425552706e-01 1.12132821905756774328e+00 8.97657901444712469363e-01 1.19642335154896106708e+00 1.05951557192948575548e+00 1.04630966968970273712e+00 1.52414046433581784612e+00 5.43585222190523520425e-01 9.19935841506541840396e-01 7.27547442576760072797e-01 1.07940780714496264991e+00 8.86030326032766102351e-01 6.67846453034422027351e-01 9.71721517049506822161e-01 8.05221343469605388421e-01 9.83706603972654525236e-01 8.95666467765491858266e-01 1.09798541944074412591e+00 1.00101112725235252832e+00 8.07722476359398089407e-01 1.03307508415104676303e+00 9.89110649629234006674e-01 1.43849022353761535342e+00 1.47562684472919447565e+00 1.26886368761470991195e+00 1.33239181998117972583e+00 1.35928039712125015015e+00 1.22787062631621557429e+00 1.02140561274788677082e+00 9.71709452986413757536e-01 1.05232845239533534532e+00 6.07334104171641242509e-01 4.70122821685923342194e-01 5.69961613001951694635e-01 5.85713269153085969165e-01 8.57832457362284972469e-01 1.02238506628072700622e+00 8.92082391961737219965e-01 7.52454531010476768138e-01 1.15253360741606769579e+00 4.00553673829674328211e-01 1.55790398255054296506e+00 1.47923109319054221084e-02 9.97044856831616588266e-01
2 1.00000000000000000000e+00 4.60783829169594427722e-01 1.98574051301729292973e+00 5.48798111238665287104e-01 1.93779782409292455903e+00 1.56106153341815552527e-02 1.96770175268298896931e+00 1.65715213583881408599e-02 1.63742198947903494499e+00 2.26990094518595697526e-02 1.42604774173576975826e+00 2.02993471001479686144e-02 1.97232808246683122277e+00 9.91458941261647686005e-01 1.99117123135726492578e+00 1.08234381299143183480e-02 1.99235078740803572828e+00 1.00485127540227181520e+00 1.99259163690255958201e+00 1.84288832474735798928e-02 1.00941875928112634320e+00 9.90163108864640095774e-01 1.98025128163976860129e+00 1.06099587001322707980e-02 1.85953853701257365572e+00 1.24946629269233073362e-02 1.12147671878255428268e+00 6.34865318847253716494e-03 1.99203934488568634720e+00 8.27227927738836965599e-03 1.99359809677990384991e+00 7.87524102381214285984e-01 1.99710397779233783666e+00 3.39831425837308284676e-02 1.96107181638060512618e+00 1.62073523616922454682e-01 1.98969241529040652416e+00 1.59039475308921623986e-01 1.98596509295618850466e+00 7.93225485470852698100e-01 9.98484818693961995173e-01 8.00950229887360636016e-03 9.97844215969024062041e-01 1.43355989850682319364e-01 1.97758165021060605682e+00 1.56678492133227736938e-02 1.98736915395849966792e+00 9.80929885173336194026e-03 1.98918972515890346564e+00 8.15104305008126396592e-03 9.97169788786813615644e-01
3 1.00000000000000000000e+00 8.89675206597561607502e-02 1.99246419206348290842e+00 9.20776297814721034207e-01 1.98041346219364422510e+00 1.82081734777791888480e-02 1.95825249244905585932e+00 1.69125704384229906541e-02 1.92264626315986286720e+00 2.41503186635335792554e-02 1.96632674782595140428e+00 1.19986979516396072287e-01 1.93593392390492469168e+00 6.77786481909675997404e-02 1.98691446869893995064e+00 9.93226341254328237707e-02 1.98460140567410170398e+00 8.85002259205557750832e-01 1.95963318162100952335e+00 7.88011138564554264319e-02 1.98726035748798723901e+00 8.05775241096478613001e-03 1.99133477618890397665e+00 1.06914564763694267674e-02 1.94497809360561491054e+00 7.63288540446385808252e-03 1.04004593698030434190e+00 8.42733234239131413779e-03 1.98994700603710206188e+00 1.04954976995522333144e-02 1.98896440597628920699e+00 1.70266974881371109529e-02 1.98988622494767608551e+00 1.99316352159260960775e-02 1.98879536540954027224e+00 1.64336220556186601849e-01 1.98740992141155614625e+00 4.26734630617374210981e-01 1.79941665175536846810e+00 7.90574931833215921451e-01 1.76322811256771361244e+00 7.34053285951812885257e-03 9.96602849362371645547e-01 5.88535686538475266705e-02 1.98928291930072775884e+00 7.98439136151816823694e-03 9.99470648526889604568e-01 1.08150117761589073528e-02 1.98483377119416548595e+00 7.32802088476437740727e-03 1.99521974012772806972e+00
4 1.00000000000000000000e+00 4.68500023726716244288e-03 1.99107538590526766953e+00 1.35053320891217937261e-01 1.99152810846406369549e+00 8.79339436873624369362e-01 1.99225848192463450559e+00 1.07589275790194657811e-02 1.99020959456304469271e+00 9.77990641560215305528e-03 1.99021840996153764891e+00 9.79432985017806082007e-03 1.99025532893328804818e+00 9.77349998964171032267e-03 1.99000731848554002212e+00 1.09099790449087505340e-02 1.99136272936964298097e+00 2.46799530618086043754e-01 1.97749271013480165671e+00 7.80442945107679864059e-01 1.18837935843849096251e+00 1.09931469384613612200e-02 1.98632609990541819656e+00 1.21723231737305565003e-02 1.81555950083193651245e+00 9.65434780604402555115e-03 1.96960280054809167005e+00 1.07046133936996336333e-02 1.98976779591346186749e+00 9.79602673878957747045e-03 1.99020756295941603220e+00 9.79250846842805861003e-03 1.99020794730570327324e+00 9.79158447474581111747e-03 1.99020699986536064863e+00 9.79336867876332353711e-03 1.99030826777028790886e+00 9.76082405461962780702e-03 1.99244830543932871514e+00 9.96170882099734589232e-01 1.99200865005201954716e+00 1.02136364133851610669e-02 9.95578178990577433716e-01 1.37735877411469531673e-02 1.98910693634244561956e+00 7.62439437721127311748e-03 1.00057662227706289926e+00 7.60270512745916862002e-03 1.98506031293476126187e+00 9.80332822074682190550e-03 1.99526243836990602176e+00
5 1.00000000000000000000e+00 4.99318581211838016798e-03 1.99019364848841484594e+00 9.93456721491722816175e-03 1.98986903363449552096e+00 1.10796776157326103129e-02 1.99059242315910234211e+00 7.19761055327036491924e-01 1.99178487448226326784e+00 2.93841322898253598517e-01 1.99062598018715553039e+00 1.19718326711389135009e-02 1.99028516945417566220e+00 9.74366022028264749943e-03 1.99024687605055183859e+00 9.79263354611556273432e-03 1.99024472577260236328e+00 2.57767134359126286192e-02 1.98036598120471674100e+00 9.86163850919618556468e-01 1.01095787141493853589e+00 8.86218540624305120557e-03 1.98914818661216985518e+00 9.83516882385612918605e-03 1.98888885771179890760e+00 9.78259141130783001217e-03 1.99016302897514596459e+00 9.79572892497074763918e-03 1.99020761153503467078e+00 9.79252674828191838063e-03 1.99020743081080397907e+00 9.79256316986227594301e-03 1.99020742551194040892e+00 9.79258012096577944161e-03 1.99020743026179203206e+00 9.79807347348309043422e-03 1.99017766637706494670e+00 9.56824935517298913457e-03 1.99110874001251825227e+00 9.64887655462725972455e-03 1.97877772019611208876e+00 7.83863695145099910466e-03 1.00628912533486802872e+00 8.86472610085347820230e-03 1.98851355899789328241e+00 9.53590762411855516478e-03 9.97322519040306221250e-01 9.65494447998902605157e-01 1.99061055005692844055e+00 4.62262165984078446379e-02 1.99531658579389437058e+00
6 1.00000000000000000000e+00 4.73605325641405800613e-03 1.99016769513495095367e+00 9.43144489744831768241e-03 1.98946492789928197631e+00 1.21460540831206317836e-02 1.99206151344512827350e+00 1.32062001952797491988e-01 1.99024311647577678563e+00 7.90380945084895980557e-01 1.99061793534634712266e+00 1.02757947025822624076e-01 1.99036342512067898625e+00 1.02713822746546522280e-02 1.99020398015244692758e+00 9.80626511055574315301e-03 1.99005607860647870666e+00 1.80194487947167719666e-02 1.93198471866714815981e+00 9.83712855686938114630e-01 1.05809095790075446963e+00 2.02770306914533578191e-02 1.98805873852174674887e+00 9.78183508028508154342e-03 1.99016310021757991677e+00 9.84964497865435141544e-03 1.99019875680402202889e+00 9.79312067296866407828e-03 1.99020743305886882446e+00 9.79256744590817525264e-03 1.99020741148778679275e+00 9.79258785082571386882e-03 1.99020741063372419433e+00 9.79259005589169784223e-03 1.99020740933197060052e+00 9.79258317008837794737e-03 1.99020475442973143743e+00 9.72991287613117657174e-03 1.98906108352538013584e+00 9.43228454597848028906e-03 1.88309922498294146642e+00 6.86452439128504288135e-03 1.10582436592553778887e+00 7.28253226324059900476e-03 1.98657091096968496657e+00 8.04320297497333400183e-03 9.96865114857249046132e-01 1.11679070231841953698e-02 1.99226227757748763914e+00 1.00126838034469067829e+00 1.99762255639444652466e+00
7 1.00000000000000000000e+00 4.79387089433554961643e-03 1.99013710971111357217e+00 9.85277758525847195681e-03 1.99017656985381963253e+00 9.84335604165252446573e-03 1.99050656138136550233e+00 9.42050841142626042835e-03 1.99029511141386761253e+00 9.71431232654083355593e-03 1.99032705282115784939e+00 9.51828023086049093693e-03 1.99090468078689286635e+00 1.35196587753396504916e-02 1.99072091273464857331e+00 9.84225142660139051820e-01 1.98443087864352762928e+00 3.55763727736917861888e-02 1.60587898044033439149e+00 9.44171805461798463455e-01 1.38906696831479958831e+00 6.20633728064054548956e-02 1.98943884864367381837e+00 1.01138742294334966348e-02 1.99021131403964135487e+00 9.79265382767058843727e-03 1.99020741082166296998e+00 9.79259090367823152590e-03 1.99020741023383518353e+00 9.79258822434874061369e-03 1.99020740895421766048e+00 9.79259091180838432689e-03 1.99020739372081245655e+00 9.78983952189884688855e-03 1.98904454267521524358e+00 7.44656639931860677567e-03 9.98326393722738458791e-01 7.17883255119890900664e-03 1.98903647589260468287e+00 9.82626592377347680973e-03 1.98935468958290528896e+00 9.77637530529210790897e-03 1.98445125794999310820e+00 7.42809614852341353747e-03 1.00609688729969182219e+00 7.16653908989874771640e-03 1.98496560202341698620e+00 1.39209605874648471857e-02 1.99243991959455946095e+00 1.00121842434448904413e+00 1.99762396280732601461e+00
8 1.00000000000000000000e+00 4.73608492335162670900e-03 1.99017261944215961833e+00 9.79235205928310342705e-03 1.99020738357750914815e+00 9.79253517193520370276e-03 1.99020740587673250488e+00 9.79259452961673410032e-03 1.99020742187789445587e+00 9.79256815516229423002e-03 1.99020759145477055263e+00 9.78992112505350231544e-03 1.99022678996840873822e+00 1.14357218549278397135e-02 1.99241619756947807574e+00 9.36068465494256596315e-01 1.98044483025877360305e+00 7.86356616583946677057e-02 1.84619413579102031875e+00 9.58253928477800255570e-03 1.14784899507514692729e+00 7.75896416686893460740e-03 1.98965167654470609371e+00 9.74506598616511031385e-03 1.99024863974223964469e+00 8.20848961578167675424e-03 1.99641563134858213147e+00 4.74083009306365543711e-03 1.99086338267175211314e+00 9.92439318372313403205e-03 1.99089597985172805927e+00 9.35504095760378122371e-03 1.98977067773275395624e+00 6.12039283331561757145e-03 1.99383318739675696740e+00 7.03874467252581844517e-03 1.99530640580143225904e+00 9.55868172814442786100e-03 1.98088678173452148457e+00 9.68236078181095721762e-03 1.45505267163402907116e+00 7.96081062259620768351e-03 1.54225347950063262914e+00 9.30647019489547894233e-03 1.98848464337111763278e+00 1.03244444718505450770e-02 1.98469923471819731375e+00 1.38321493957569881250e-02 1.99219200251759498421e+00 1.00071426427227305744e+00 1.99762268730863179478e+00
9 1.00000000000000000000e+00 4.73608487448975816470e-03 1.99017261773265508040e+00 9.79228432141408117184e-03 1.99020740402327911411e+00 9.79258414348640505998e-03 1.99020740822539776715e+00 9.79259181568290296149e-03 1.99020741034808712477e+00 9.79258828429220573586e-03 1.99020817999042987090e+00 1.00910453964892701112e-02 1.99011467076313963709e+00 1.18941826733646276171e-02 1.99135004883667598996e+00 8.10133407466500199412e-01 1.66564279200512865842e+00 2.01041737340382803412e-01 1.38410788962118869172e+00 1.02712432789624271562e-02 1.92538855367261452223e+00 1.01646254951357466884e-02 1.98956602726452236318e+00 1.00371939606390507549e-02 1.99019545672170616868e+00 9.79342812174190113783e-03 1.99020705922849949765e+00 9.79248611586977860122e-03 1.99020725919400387482e+00 9.79380678365748998104e-03 1.99020641797010133800e+00 9.79246420021493736707e-03 1.99020721342159534473e+00 9.79308427365395937902e-03 1.99020739146504332950e+00 9.76977657686825713690e-03 1.99026054516398320793e+00 9.28836999156815862344e-03 1.89085730135813556707e+00 1.17236944756626652875e-02 1.18220197225011336428e+00 7.45375002618344720956e-03 1.89849124721559059381e+00 9.88477980201683120720e-03 1.99006894412694412821e+00 9.79588578649509891805e-03 1.99021769994286934491e+00 1.37264944114938083203e-02 1.99245155211872382317e+00 1.00127539969506473838e+00 1.99762394802819609474e+00
10 1.00000000000000000000e+00 2.37457833825576933307e-03 9.97543418183635677288e-01 5.95093134323979554290e-03 1.98930452332014140460e+00 6.42883477999920890933e-03 1.99348585213662610194e+00 8.71843512754590967140e-03 1.99569983953917096109e+00 5.16694095512047670699e-03 1.99531317359973092707e+00 1.63096107128631842738e-03 1.99954929102919765072e+00 5.37783791175026025522e-03 1.99259352334386607986e+00 9.85155417911528274999e-01 1.98518658386776492009e+00 3.61663505308336477584e-02 1.98917143817953001594e+00 1.00789062832828332783e-02 1.99001659258001484254e+00 9.79281644994407611537e-03 1.99021604628521719960e+00 9.78523999959716485331e-03 1.98981870559685125599e+00 9.65396722861623646228e-03 1.92776452176129931004e+00 1.39766915727084894278e-02 1.05131018588356850429e+00 6.69529355473966452522e-03 1.99365232422543336988e+00 7.94532053567568313790e-03 1.99143976519327448038e+00 1.69506984472386906804e-02 1.98489326241288210895e+00 1.50123644899186770713e-02 1.98539406752751923513e+00 1.30721955941359678499e-02 1.98540914164948589793e+00 8.96271197650680591373e-03 1.98807976322588109142e+00 9.38535479304812569890e-03 1.99069405248008424181e+00 9.73050637530518264251e-03 1.99036719170949494284e+00 9.79643002320425282381e-03 1.99021050515831188221e+00 1.37275964432969320439e-02 1.99245148148719719572e+00 1.00127443260789994461e+00 1.99762393527899950740e+00
11 1.00000000000000000000e+00 2.37450292438739747961e-03 9.98074056822864208449e-01 7.51731900732822283517e-03 1.98697447202389976262e+00 9.78247971848955795438e-03 1.99018474875660200674e+00 9.79890980221067263434e-03 1.99019939552117675063e+00 9.84283328916775619721e-03 1.99020033149800656957e+00 9.82388314824487150767e-03 1.99017668913392231644e+00 1.10549036700301923919e-02 1.99227844419845201429e+00 8.93547874954127463454e-01 1.98896025427479128389e+00 1.23200591142007598311e-01 1.98963070395990504480e+00 1.10629743267802015810e-02 1.99021992413373527420e+00 9.78804409207090220235e-03 1.98699082406490923347e+00 9.79163494086936897487e-03 1.98362713836082260599e+00 9.03919364784550732894e-03 1.55582277190329687500e+00 1.38538416975058052694e-02 1.43331021392175017581e+00 9.00275177114161218039e-03 1.98929164423341364731e+00 9.18905019086794887240e-03 1.99030609880230335840e+00 9.78649329509079582423e-03 1.99020383830676172998e+00 9.79733668885067292276e-03 1.99020248066947291754e+00 9.79234202572106145201e-03 1.99020740109974414445e+00 9.79258056049175755475e-03 1.99020741901279674124e+00 9.79258301583032543525e-03 1.99020740465366507976e+00 9.79259320276566237740e-03 1.99020746677672222269e+00 9.79633640494266197396e-03 1.99021776161744723410e+00 1.37290252232562682427e-02 1.99245149006800881253e+00 1.00127300755945980448e+00 1.99762393988606090645e+00
12 1.00000000000000000000e+00 2.37598508026181558586e-03 9.98711988471014500135e-01 7.54832942873990414556e-03 1.98628632244391734041e+00 9.78220300405077854144e-03 1.99020355831510986633e+00 9.79258185114965061524e-03 1.99020743287375201369e+00 9.79256171617667696416e-03 1.99020745149903821591e+00 9.79254863603670928918e-03 1.99020745422427935978e+00 9.79255815952448371853e-03 1.99020742026536612279e+00 9.79269120633035304591e-03 1.99022350115676172067e+00 9.78702294544892860417e-03 1.99023088055628849524e+00 9.75048191679755461847e-03 1.99021796368722192483e+00 9.78554434426792685287e-03 1.99037467038550563991e+00 9.61478238624947911806e-03 1.99023642988395010889e+00 9.86996526608262605973e-03 1.99044274806933940702e+00 1.01498299932479794927e-02 1.99037773311247634389e+00 8.28682009877004452369e-03 1.99131594920503096624e+00 9.45234664113250334927e-03 1.99010150617572523224e+00 9.79647647663104206850e-03 1.99019270498202005548e+00 9.79253513684822871066e-03 1.99020742447142762188e+00 9.79257151597952811561e-03 1.99020740930502526567e+00 9.79258988729211389546e-03 1.99020740990736455522e+00 9.79259033982340584834e-03 1.99020740803538176422e+00 9.79259191444662065174e-03 1.99020742572874542731e+00 9.79636911199032942021e-03 1.99021776510045267372e+00 1.37291670661743147458e-02 1.99245143579205707951e+00 1.00127292936938228074e+00 1.99762393286003114845e+00
13 1.00000000000000000000e+00 2.37609271320520388376e-03 9.98716544150622498321e-01 7.54814313917328248704e-03 1.98628185489887076898e+00 9.78226762051938834863e-03 1.99020349169893617791e+00 9.79257950326957449239e-03 1.99020741220682562123e+00 9.79258774478071990222e-03 1.99020741396848710458e+00 9.79258605478916868692e-03 1.99020741433421499700e+00 9.79258711856326007072e-03 1.99020740885225855266e+00 9.79258286738217929857e-03 1.99020742406136785796e+00 9.79258617793961512465e-03 1.99020743767659213930e+00 9.79256030117680968672e-03 1.99020742972624242739e+00 9.79256674595363127422e-03 1.99020740430698861445e+00 9.79259498573182944614e-03 1.99020742212027279550e+00 9.79258512702282923890e-03 1.99020741641526721644e+00 9.79258045517943792602e-03 1.99020740817177554938e+00 9.79259410503489913236e-03 1.99020741396287914604e+00 9.79258401150885637865e-03 1.99020738192535096012e+00 9.79261554719804486191e-03 1.99020741335510131798e+00 9.79258957815148239900e-03 1.99020741068108319993e+00 9.79258882032430465203e-03 1.99020740868847179073e+00 9.79259121063762345838e-03 1.99020740876214863313e+00 9.79259126882416064408e-03 1.99020740850621868923e+00 9.79259167342696849878e-03 1.99020742073257661531e+00 9.79637648148886340527e-03 1.99021776252664972517e+00 1.37295324731275293628e-02 1.99245143693491155723e+00 1.00127256334807435145e+00 1.99762393226330692286e+00
14 1.00000000000000000000e+00 2.37579549608096839489e-03 9.98724574453770275184e-01 7.54817382240106568569e-03 1.98627407393627009036e+00 9.78225533231383455324e-03 1.99020352233595665403e+00 9.79257966837410002980e-03 1.99020740890497660480e+00 9.79259094975314624276e-03 1.99020740927151318367e+00 9.79259073302559714114e-03 1.99020740931779327454e+00 9.79259085518181804364e-03 1.99020740862363210155e+00 9.79259040635227159810e-03 1.99020741047788707334e+00 9.79259085189240242875e-03 1.99020741227320230315e+00 9.79258739934968890084e-03 1.99020741136681955652e+00 9.79258818914258838406e-03 1.99020740800133322246e+00 9.79259187730869250232e-03 1.99020741032037729035e+00 9.79259057305770057311e-03 1.99020740963937692314e+00 9.79258998212524656157e-03 1.99020740853104594059e+00 9.79259173403744347108e-03 1.99020740927900985362e+00 9.79259048689081791628e-03 1.99020740499886117369e+00 9.79259458080584434259e-03 1.99020740897732006935e+00 9.79259149973582369852e-03 1.99020740885923097530e+00 9.79259106645714340333e-03 1.99020740860770439795e+00 9.79259137809633875560e-03 1.99020740861785516707e+00 9.79259138584724631027e-03 1.99020740858548328411e+00 9.79259161570248011508e-03 1.99020742010488693730e+00 9.79637163470464811255e-03 1.99021776632687763531e+00 1.37295685236722107836e-02 1.99245141997658192778e+00 1.00127254615697802720e+00 1.99762393201294430334e+00
