# tag norm j_0
13.800000 1.00000000000003308465e+00 -1.97301278696773094157e-02
13.800000 1.00000000000003308465e+00 -1.80121983208901929874e-02
13.800000 1.00000000000003308465e+00 -1.93369163790534787095e-02
13.800000 1.00000000000003308465e+00 -1.84637362996656929914e-02
13.800000 1.00000000000003308465e+00 -1.96545353857553832533e-02
13.800000 1.00000000000003308465e+00 -1.84968482814195089858e-02
13.800000 1.00000000000003308465e+00 -1.93947525772534892785e-02
13.800000 1.00000000000003308465e+00 -1.81016580455430897700e-02
13.800000 1.00000000000003308465e+00 -1.98322794353108858290e-02
