# tag norm j_0
27.100000 1.00000000000002864375e+00 -9.35472842076304489378e-02
27.100000 1.00000000000002864375e+00 -2.89405525409385626368e-02
27.100000 1.00000000000002864375e+00 -1.86813698908639795604e-02
27.100000 1.00000000000002864375e+00 -3.04060872322108634302e-02
27.100000 1.00000000000002864375e+00 9.64789125030336841560e-02
27.100000 1.00000000000002864375e+00 -3.00740599341852293813e-02
27.100000 1.00000000000002864375e+00 -1.90343385531031514257e-02
27.100000 1.00000000000002864375e+00 -2.86718303806242080789e-02
27.100000 1.00000000000002864375e+00 -9.30729607322925700519e-02
