# tag norm j_0
16.700000 1.00000000000001354472e+00 -1.54483799169654684169e-01
16.700000 1.00000000000001354472e+00 9.19217352592717057425e-02
16.700000 1.00000000000001354472e+00 4.47673588246669459934e-02
16.700000 1.00000000000001354472e+00 -9.28589411012771814846e-02
16.700000 1.00000000000001354472e+00 -2.21414156908836881610e-02
16.700000 1.00000000000001354472e+00 -9.25436181460326107162e-02
16.700000 1.00000000000001354472e+00 4.38943064159166007610e-02
16.700000 1.00000000000001354472e+00 9.25303048077563139451e-02
16.700000 1.00000000000001354472e+00 -1.55370472893483019261e-01
