# tag norm j_0
10.400000 1.00000000000000888178e+00 1.54703684442179384417e-01
10.400000 1.00000000000000888178e+00 1.69342405373351968800e-02
10.400000 1.00000000000000888178e+00 9.94435974195246874530e-02
10.400000 1.00000000000000888178e+00 7.00261270782919498235e-02
10.400000 1.00000000000000888178e+00 5.89837313360545567598e-02
10.400000 1.00000000000000888178e+00 6.98480788510262434743e-02
10.400000 1.00000000000000888178e+00 9.97244646890121100302e-02
10.400000 1.00000000000000888178e+00 1.63984438135030829997e-02
10.400000 1.00000000000000888178e+00 1.51735797810913897177e-01
