# tag norm j_0
15.900000 1.00000000000001376677e+00 1.48473970028702439983e-01
15.900000 1.00000000000001376677e+00 -8.98380170452952042659e-02
15.900000 1.00000000000001376677e+00 -6.31095649119046836484e-02
15.900000 1.00000000000001376677e+00 7.07334180028600378876e-02
15.900000 1.00000000000001376677e+00 3.72600731798751541590e-02
15.900000 1.00000000000001376677e+00 7.02960652503949873227e-02
15.900000 1.00000000000001376677e+00 -6.24206018942632806512e-02
15.900000 1.00000000000001376677e+00 -9.04652419441270977396e-02
15.900000 1.00000000000001376677e+00 1.49654383325464324095e-01
