# tag norm j_0
18.300000 1.00000000000024491520e+00 4.64853251211555127884e-04
18.300000 1.00000000000024491520e+00 4.80381825351946774392e-04
18.300000 1.00000000000024491520e+00 4.81194524328920831321e-04
18.300000 1.00000000000024491520e+00 -2.67273413743961455423e-04
18.300000 1.00000000000024491520e+00 -9.66525835749420955895e-05
18.300000 1.00000000000024491520e+00 -2.02843978264150237795e-04
18.300000 1.00000000000024491520e+00 1.05642991451053609719e-04
18.300000 1.00000000000024491520e+00 -1.46022508193259411809e-04
18.300000 1.00000000000024491520e+00 1.03270411538944068951e-04
18.300000 1.00000000000024491520e+00 -1.54335115931819095341e-04
18.300000 1.00000000000024491520e+00 1.06032148754727073158e-04
18.300000 1.00000000000024491520e+00 -1.44710167042284046065e-04
18.300000 1.00000000000024491520e+00 1.14753550711685947433e-04
18.300000 1.00000000000024491520e+00 -1.96781626441122159486e-04
18.300000 1.00000000000024491520e+00 -8.46895331191298034613e-05
18.300000 1.00000000000024491520e+00 -2.88926962227786603664e-04
18.300000 1.00000000000024491520e+00 4.63404987573590989788e-04
18.300000 1.00000000000024491520e+00 4.81815079277791329711e-04
18.300000 1.00000000000024491520e+00 4.77972447676507745593e-04
