# tag norm n_down_hub[0] n_down_hub[1] n_down_hub[2] n_down_hub[3] n_down_hub[4] n_down_hub[5] n_down_hub[6] n_down_hub[7] n_down_hub[8] n_down_hub[9] n_down_hub[10] n_down_hub[11] n_down_hub[12] n_down_hub[13] n_down_hub[14] n_down_hub[15] n_down_hub[16] n_down_hub[17] n_down_hub[18] n_down_hub[19] n_down_hub[20] n_down_hub[21] n_down_hub[22] n_down_hub[23] n_down_hub[24] n_down_hub[25] n_down_hub[26] n_down_hub[27] n_down_hub[28] n_down_hub[29] n_down_hub[30] n_down_hub[31] n_down_hub[32] n_down_hub[33] n_down_hub[34] n_down_hub[35] n_down_hub[36] n_down_hub[37] n_down_hub[38] n_down_hub[39] n_down_hub[40] n_down_hub[41] n_down_hub[42] n_down_hub[43] n_down_hub[44] n_down_hub[45] n_down_hub[46] n_down_hub[47] n_down_hub[48] n_down_hub[49]
1 1.00000000000000000000e+00 9.76296612149921583246e-01 8.98015042937109653209e-01 7.25756449293362360109e-01 9.63772839350963028693e-01 5.91696387544731750019e-01 6.72690215188017859305e-01 4.51717636937087552162e-01 4.44632755005326063547e-01 2.90691866734794635008e-01 6.06576033379259138556e-01 5.19030972050262162654e-01 3.17758629641189560555e-01 6.54858004684155448061e-01 2.10622790510863050484e-01 4.89389815860706345330e-01 3.87525619429362533364e-01 9.10629013483166827037e-01 5.03502376603928603060e-01 5.64094388870807206260e-01 8.88103838333480055667e-01 7.37599967606827777722e-01 7.30806050507959437113e-01 5.42309948265171759552e-01 5.74805784728064983469e-01 3.58384056316848942370e-01 3.45969561608019782195e-01 5.14492651963759595191e-01 4.68337514688141665076e-01 5.68657876251850380456e-01 6.06471800639839853098e-01 5.34229669269958629130e-01 6.74732052063509279982e-01 5.45587371925086439539e-01 7.10810409963670619682e-01 6.98508527438276627386e-01 5.44940825775329207303e-01 5.06898236494030651755e-01 1.85369659884174614595e-01 2.45946037783479315442e-01 1.43885035306987929538e-01 2.89600604970314756681e-01 3.65485649932587086663e-01 2.94894183255891340067e-01 4.69032541327269458797e-01 2.88323116793054223805e-01 4.14600504797916491473e-01 3.15036406202047813974e-01 2.21829057294441911452e-01 5.85732584984725640140e-04 3.45078763720203032794e-02
2 1.00000000000000000000e+00 9.79404818292675227731e-01 9.47483533128833488313e-01 9.63342437061070894222e-02 9.88004007516948390411e-01 2.70645381584949551446e-01 8.71973678182910050261e-01 7.09286234260823822417e-01 1.36924479555819822441e-01 1.44523018152720839069e-01 8.55985805692624057706e-01 9.91203554597106628599e-01 8.61149807690971512419e-03 2.17139142072321532709e-03 9.75020791888616567000e-01 6.00683540743962851582e-02 9.63213009477635218047e-01 9.97968703709018467585e-01 8.75304690852915734389e-01 1.38349501758003284868e-01 9.87551896110552385188e-01 9.89809583213495769449e-01 9.96049721236132223900e-01 9.95258527529155057056e-02 3.06286107687712305658e-01 3.32436539192961566513e-01 5.69937876223999939640e-01 6.98003182138611011354e-01 9.61177188704188667501e-01 5.16245776186643762912e-03 9.94381984904400884062e-01 4.53136378435641494489e-03 9.60222944955593238348e-01 4.52518727887036911750e-02 9.91396486905301577153e-01 9.67447119793197085613e-01 9.89754971560977914180e-01 5.62062960709485276434e-02 9.78316896400505786602e-01 1.91115318412243377633e-02 9.94332997970421517131e-01 3.02535832018583639158e-02 4.72025007038024968509e-02 2.73816629027980179556e-02 4.94720837963586873576e-02 6.30832977098962466300e-01 1.29016979093119488198e-01 8.85000562065389323463e-02 3.13182764821644532560e-02 6.13522039631534711612e-03 5.15092190257851554464e-04
3 1.00000000000000000000e+00 9.85048073052707029440e-01 7.61341515064031915117e-01 2.62962566998862945500e-01 9.20952019112020514591e-01 8.19454833151611466979e-02 9.61748139431538806576e-01 7.98175898448709730815e-01 2.38620320820410902751e-01 3.21378920002112433707e-01 6.88540916449372875086e-01 8.03986111415114224066e-01 1.75024870578432495405e-01 2.21192415574705640580e-03 7.94093823970955625668e-01 3.64665318075068134451e-01 8.51928744926907954849e-01 9.51815679486434196299e-01 5.99508945882058275068e-01 4.36760925619460393943e-01 9.99239571024184258796e-01 9.93521957719708304069e-01 8.88321714035887888272e-01 1.29809507582861333175e-01 4.91668856444606283684e-01 4.00226706139812871132e-01 6.48476617602719351829e-01 4.76208964486280306172e-01 9.66020018281574466279e-01 4.49232748432371216396e-03 9.31941009629151828619e-01 1.19976846202390435847e-01 9.29732509448670918495e-01 3.86111136615132979899e-02 9.81761732394526021039e-01 9.87684802419552365649e-01 8.98983188468155169915e-01 1.17577780279261759344e-01 8.96965680911093521388e-01 1.42406201399633836058e-01 8.75171394827198523281e-01 7.51643387985410221797e-02 1.11375933415777381152e-01 1.22188649968986387528e-01 1.65128033880336949624e-01 4.53452173702035221670e-01 4.82624029255374759062e-02 3.72129628512586352329e-02 4.79220946499773897687e-02 1.82513039124415840653e-02 1.53340864689866093404e-03
4 1.00000000000000000000e+00 8.94206279876166409970e-01 6.37184308092560880432e-01 4.65342633394576710160e-01 8.58746118302140981626e-01 1.79225400772301340924e-01 9.04498859721598269523e-01 8.18974676642697740903e-01 2.80642501466550675637e-01 4.42016054864076635145e-01 5.52696717172788121175e-01 6.33493493013754571663e-01 3.31193938773494733763e-01 9.35945591847692388854e-03 8.24951825795964155397e-01 3.68875250520917574715e-01 8.10953449460401931681e-01 9.04691851545815328706e-01 6.18250092661170258523e-01 4.68762428685125409622e-01 9.95980411487565331363e-01 9.78752706855693488386e-01 8.35349481775327973310e-01 2.18732795028217047451e-01 7.03651178739676419482e-01 3.60064340641283786582e-01 6.15111357125206925645e-01 3.25368456947884465702e-01 9.57112449503351170321e-01 6.83014209322731821045e-03 8.48234671187703681561e-01 2.57870902264074441934e-01 8.53538590948121900226e-01 1.46214050455507976745e-01 8.98203132936754800042e-01 9.54761950574365636513e-01 8.09390599379575359507e-01 2.43907759124155576469e-01 9.23139849082171171091e-01 1.50162872869758295957e-01 7.34856189893804634394e-01 1.63896162562550407049e-01 1.22380422345961123454e-01 1.76922442143200436826e-01 2.50508026665844818481e-01 2.69043386902526160398e-01 4.22062139351741874571e-02 2.44758953127060252530e-02 8.09197982339550231368e-02 4.17679217539956362804e-02 6.58050455018828559656e-03
5 1.00000000000000000000e+00 8.64775323765035852652e-01 6.02201761859531781163e-01 5.28659412321288657566e-01 8.18198189527444275093e-01 2.90317425503751613824e-01 8.07994704257074758402e-01 7.86834169654271775585e-01 3.42545281878098795136e-01 4.92395219007060847005e-01 5.07590422108754824038e-01 4.44108408659926456874e-01 4.99788688991971818965e-01 3.59818743548911343377e-02 8.33643937909153476262e-01 3.71790023111910394871e-01 7.81634327895098346417e-01 8.45080251493395606666e-01 6.38110204441570960654e-01 5.28587649056786124113e-01 9.80662651022351283814e-01 9.57936390757292421938e-01 7.92464322028589740476e-01 3.10683680896095604229e-01 8.04915975544282180643e-01 3.72565547806232300054e-01 6.24318416646590601538e-01 1.88009642417872296916e-01 9.36395927948927342399e-01 2.29177476320410085375e-02 8.12922557561238767754e-01 2.72238967463634295996e-01 8.28887071875530345721e-01 3.06170115178994117766e-01 7.90558392239633533904e-01 9.13159114940117588866e-01 7.85654339407843460563e-01 3.09506571240704464465e-01 9.05807103991512985175e-01 1.56178454210399830782e-01 6.47954165410217663990e-01 2.10156783015520792768e-01 1.45998610696491670780e-01 1.91828281972307279624e-01 2.94815885729299786977e-01 2.16143003520592930089e-01 5.20806059102280546891e-02 2.57697945197415262397e-02 7.75168981698049902596e-02 3.88747875012444912834e-02 6.67091694780047594904e-03
6 1.00000000000000000000e+00 6.94767451755202714025e-01 5.34507017731269851168e-01 5.75797660063397498398e-01 7.01791692656965837571e-01 5.32102835353868819368e-01 6.81311850943319252671e-01 7.49126090639528174897e-01 4.68586755204727423152e-01 4.41478395599018857975e-01 6.24386942965797331340e-01 2.82162182553623019921e-01 6.69371907622039463703e-01 9.03576866708004911022e-02 8.21269750689509026031e-01 3.89198908474454263740e-01 7.56831839597267297393e-01 8.13282649955412662024e-01 6.59020683510539884153e-01 5.50023429344942083041e-01 9.66798704719071144709e-01 9.19690607018815553531e-01 7.40440560795463942334e-01 3.94851852956705884345e-01 7.99299841289886847662e-01 4.06742912500409670162e-01 6.67773873494672098872e-01 1.38592758430815976567e-01 9.02514213052082459043e-01 5.56957988744683912818e-02 8.14290032505967320553e-01 2.42542479280612122139e-01 8.20813345142957673239e-01 3.90650712361279572882e-01 7.39395492921290475863e-01 8.89209813670856830115e-01 7.90821129727879656990e-01 3.33434271739150356328e-01 8.80083301631488845729e-01 1.58337976294622151396e-01 5.69181647748311037027e-01 2.43103422012171194178e-01 1.69187936501284164059e-01 1.92835097601471355810e-01 3.07623470578414215382e-01 1.94874342313999360243e-01 6.66363293111527504875e-02 3.27454054640579500512e-02 8.54984505181498877224e-02 4.30361039422399102583e-02 7.92238426862306756304e-03
7 1.00000000000000000000e+00 6.34436989749806889982e-01 5.28543466530015049187e-01 5.85255232077731224472e-01 5.80915945896269936277e-01 6.07291148757183818496e-01 5.24675450757460581919e-01 7.04139827042013832781e-01 5.88049685964656232429e-01 3.99132543590207555795e-01 7.59880542573247219629e-01 2.15076579873167111900e-01 7.78586494244652094210e-01 2.24904879734848323070e-01 7.81454399360756224446e-01 4.65717961191172369340e-01 6.70878208050953439567e-01 7.96891442715130460250e-01 6.73971739969480232446e-01 5.30348935358646467186e-01 9.52016906235115700774e-01 8.44311256817817157305e-01 6.70584898261793016516e-01 4.94129939405539120312e-01 7.12535252943726660213e-01 4.67984058349982967595e-01 7.27364894881668222482e-01 1.71486832836638486421e-01 8.70813386925535448668e-01 7.61376397933135606877e-02 8.19075392524246215231e-01 2.22240181969970834741e-01 8.19393921874957964491e-01 4.24539496215000922152e-01 7.20499141562492173563e-01 8.71412542564583114668e-01 8.11808160330668493465e-01 3.34478097995351886240e-01 8.36835585038171014816e-01 1.70070865666081066925e-01 4.71691539454027919387e-01 2.71168033130362862160e-01 2.09199168385562128680e-01 1.88671556738010309795e-01 2.97620575530949615928e-01 1.85923331753859361060e-01 8.37611909350362976445e-02 5.09586138044050285245e-02 1.08659453524551571912e-01 5.38645700414493583397e-02 1.06120410717784226240e-02
8 1.00000000000000000000e+00 5.77848872761756338079e-01 5.27274144050353998914e-01 6.00861427222528110548e-01 5.02001803905553933838e-01 6.61172715889535189682e-01 4.79181323196816888466e-01 6.49234350551895489367e-01 6.48431183009003708761e-01 4.12541261165623118767e-01 7.86091936871454399771e-01 2.80911470603545043723e-01 7.70557603402756030597e-01 3.35633732262914541433e-01 7.24306314042122534325e-01 5.28315005628322120756e-01 6.08718681445998055501e-01 7.80257345728032514209e-01 6.83599227393119512897e-01 5.04662932820226672881e-01 9.36271325417631139487e-01 7.33082760023506474489e-01 6.11146605724513736213e-01 5.95928891652320325001e-01 6.53130020526681565052e-01 4.78921934524104975228e-01 7.87905651245036087182e-01 2.23871011858094742797e-01 8.52378192901416587013e-01 1.20026862832488423471e-01 8.13296082431734124185e-01 1.67911497202960363628e-01 7.73727731378389904648e-01 3.18492079202168487662e-01 8.12827842499383779185e-01 6.53987086510170123610e-01 7.76697005971867415752e-01 5.43673953933605402788e-01 6.24454875136633669186e-01 3.57133682326067736224e-01 3.55927595172594868345e-01 3.00933890951042171125e-01 3.34531463124181138724e-01 2.05576642268246900791e-01 2.46308391725825331919e-01 1.74578395075742798248e-01 1.19494543522986343409e-01 8.84585940956227473331e-02 1.74422330457750740518e-01 8.54730922391777753200e-02 1.78286361163967135846e-02
9 1.00000000000000000000e+00 5.70999224148031392367e-01 5.30990408674053115945e-01 6.06522203026666262282e-01 4.96902970904394669649e-01 6.58676990923406813216e-01 5.07603344049727622789e-01 6.12751991092963965713e-01 6.52622054494422010329e-01 4.28022884540162740219e-01 7.60292524115554702036e-01 3.33695431929274866079e-01 7.45655007247977064111e-01 3.90349527256737716119e-01 6.89007222817168640816e-01 5.67370066815591989062e-01 5.81536246902991105223e-01 7.55658306817053038174e-01 6.92896171298386542858e-01 4.86045284782083197861e-01 9.22844356623302441989e-01 6.46072010928604112401e-01 6.00026572015253889525e-01 6.62759414763251397673e-01 6.15937399491671810914e-01 5.03026464930238059736e-01 7.87796763949573097818e-01 2.89651365402287752637e-01 8.24669561320404920224e-01 1.61702329882998374622e-01 8.23338019785923913574e-01 1.30069420045459988033e-01 7.90177767442528655728e-01 2.12502766716741148256e-01 8.64212332712761321929e-01 4.27748926927832506806e-01 7.24885666084268631693e-01 6.13900585389102748657e-01 4.37970506086795274836e-01 4.43404070352622414752e-01 4.10921723688211781855e-01 2.47024973198584685274e-01 4.54532590468491370927e-01 2.87031194616381379880e-01 1.81406724499562216346e-01 1.30685548996009842648e-01 1.39561608027218841954e-01 1.38463274284094023381e-01 2.79818375622337023323e-01 1.48619520169153807032e-01 3.16403037416319588004e-02
10 1.00000000000000000000e+00 5.89376546886545504833e-01 5.32239886726301847375e-01 6.21424500698217086025e-01 5.12118785217659855391e-01 6.29678588695972263345e-01 5.48557019812285440175e-01 5.65210033787706844777e-01 6.58450987467704917933e-01 4.36319549757863356376e-01 7.33432023063244287187e-01 3.81232693126608734868e-01 7.17394989848701203350e-01 4.41719173942947795908e-01 6.50697415997378625363e-01 6.07094316266424072204e-01 5.64504518115949593948e-01 7.19036123268639415507e-01 7.10744835872501701246e-01 4.61491631281871095283e-01 9.01508097353797110962e-01 5.86827467989873174936e-01 6.22057567617503859303e-01 6.88532599703652326006e-01 6.05269109280801353989e-01 5.28771917886492137661e-01 7.60046034260886349543e-01 3.29287497229188264036e-01 7.95613788688163792173e-01 2.06820965561640840447e-01 8.12166963117203932754e-01 1.46043064855482906950e-01 8.12916896882209250030e-01 1.92585294898750425396e-01 8.54865185908285973859e-01 3.57925137101275436802e-01 7.30120629763724382499e-01 4.87147138280703662083e-01 5.03347151948966620161e-01 3.56301891255122016311e-01 5.13363387565069162477e-01 2.29138310038299236604e-01 4.31364373764098862907e-01 3.48077607238452158001e-01 1.78722028541236005461e-01 9.58551666253874418144e-02 1.41528106011582166524e-01 1.64453694746694689677e-01 3.31278601597970068227e-01 1.69616049828827303303e-01 3.77246546242133093396e-02
11 1.00000000000000000000e+00 6.01218814409447466218e-01 5.31421591117872682553e-01 6.27572085388276024176e-01 5.20289742002233324136e-01 6.17840305884235441169e-01 5.68150794048052576457e-01 5.43547242363919713704e-01 6.63315762884206683303e-01 4.38735562964426339949e-01 7.23031859993726100377e-01 4.03587018763647442654e-01 7.02183091404732895313e-01 4.71078354830405721110e-01 6.29171793539871959666e-01 6.26435864149982868376e-01 5.64139370086338076682e-01 6.89373769149960624603e-01 7.24646072515612416076e-01 4.45165970787058828950e-01 8.86574421686151414868e-01 5.60052156191869987545e-01 6.35087347452953698834e-01 6.88550028641591871370e-01 6.01509569194502269340e-01 5.40455489070916006433e-01 7.37151952378771513352e-01 3.48276917064293978221e-01 7.74572007407310025862e-01 2.47470405381217145591e-01 7.90528402320545997561e-01 1.85885127967725438669e-01 8.04247369019660429679e-01 2.06426403133024211067e-01 8.27854588659808543483e-01 3.20193352555216192989e-01 7.18777617354363296265e-01 3.74643326298984835621e-01 5.76922305795484313684e-01 2.84966315475276565916e-01 5.66329382980201745390e-01 2.61613692865168612212e-01 3.67955682552688678744e-01 3.84910620818514126462e-01 2.26796547273701826208e-01 7.09225485817035067315e-02 1.31667245832864043820e-01 1.73422184533942591589e-01 3.84135585518508460012e-01 1.88798084938019611334e-01 4.23982547709289142590e-02
12 1.00000000000000000000e+00 6.39268293947734655980e-01 5.29854595247711168682e-01 6.41634906631965873380e-01 5.40968827077888514410e-01 5.83516266717836185052e-01 6.03860621116950269105e-01 5.01404186761383097171e-01 6.76197839236217346226e-01 4.31779981119993883087e-01 7.10908724136506742219e-01 4.26567801335950846919e-01 6.79575454872510142934e-01 5.03686086062181126444e-01 6.05388382268313485213e-01 6.39393187414521224632e-01 5.68108070439570345123e-01 6.50722898674705674260e-01 7.32478924384349916465e-01 4.31629032539870616247e-01 8.68429863100647181362e-01 5.14609932901285760387e-01 6.58807109435265769726e-01 6.59905636794678729373e-01 5.90800449825233719992e-01 5.50624999771498258028e-01 6.92861905968659486099e-01 3.73597701583358143829e-01 7.36860441621378425836e-01 2.98245065944334530883e-01 7.44321968078676343694e-01 2.58773425003662016497e-01 7.39796226875223617014e-01 2.73916909698945776341e-01 7.70240516176565415130e-01 3.45923151573101494982e-01 6.78287965546547133577e-01 3.43307743600132830863e-01 6.13175691987886573031e-01 2.90475123150065128730e-01 5.61696191476570572121e-01 3.20885959317272706492e-01 3.13295637643136060113e-01 3.97536647395458575538e-01 2.85699608610101685180e-01 6.70270302903093195823e-02 1.30094546503055713549e-01 1.88068917903526700020e-01 3.95001939999095330602e-01 1.95681353461233498159e-01 4.51062587769275810667e-02
13 1.00000000000000000000e+00 6.53134625208942387609e-01 5.27815534448791368050e-01 6.43266147953551414851e-01 5.56363542056184434692e-01 5.71128522427724605315e-01 6.25212215341877097785e-01 4.85476969515565681679e-01 6.86646703099747623966e-01 4.36300256164709188145e-01 7.00256844346370033172e-01 4.58119763302169802355e-01 6.55713939683865931762e-01 5.44761912638090151084e-01 5.89627458933715153933e-01 6.35082338627216302918e-01 5.93202429061203351246e-01 5.85256507480848564562e-01 7.31418997255009251113e-01 4.17288175699112140471e-01 8.20965991148051243975e-01 4.24780595747932587791e-01 7.08338975159071293497e-01 5.34514167452751487453e-01 6.13955301869752445576e-01 5.12396423056261873796e-01 6.38585475027636295664e-01 4.10267565708586134932e-01 6.44839230765194559858e-01 3.61955239559501928959e-01 6.33748586862762697258e-01 3.68168368862696715471e-01 6.08475700994359325335e-01 4.15912443784724750184e-01 6.27057997738167172130e-01 5.02297579361957402533e-01 5.49915560446277429385e-01 4.74129066189787062857e-01 5.00207035441234015849e-01 4.54417879406848357338e-01 3.44857220339386039143e-01 4.22786549211459361519e-01 3.05290759166347347442e-01 2.39216982170757597181e-01 4.08179109057972611119e-01 2.44804626695870941600e-01 2.02013124317002246144e-01 1.73172141419492303660e-01 4.63276549963700656765e-01 2.26002237792049642806e-01 6.93986320377985299590e-02
14 1.00000000000000000000e+00 6.48991224559153478957e-01 5.29452292076478259197e-01 6.36633188521275372729e-01 5.57651205666390481497e-01 5.67237626479913936706e-01 6.18198566492572543218e-01 4.91634733120532907424e-01 6.73613910934690363064e-01 4.45421830535551066532e-01 6.91527988855169972737e-01 4.56052433775751719924e-01 6.60751684373283354468e-01 5.19461630563019971518e-01 6.05550928745726801949e-01 5.93179799323103940090e-01 5.81399192199292813577e-01 5.93356262339782891679e-01 6.38342562354977549610e-01 4.94650539236012209976e-01 7.37165023947599529208e-01 3.84154651291282567271e-01 7.62601590953581265353e-01 3.72713646977569201812e-01 7.16137472471923608452e-01 3.81923053810067525404e-01 6.88373411975692572895e-01 3.69576239487910407355e-01 6.76645646444247739204e-01 3.49181027899513940493e-01 6.75692866664503233309e-01 3.51836471086051594259e-01 6.78066727660876833461e-01 3.93589375981817202188e-01 6.47618223693064654078e-01 5.29465465104297372534e-01 4.98717725954536283961e-01 5.36330706097080445183e-01 4.23997639026610029234e-01 4.87488658551003706254e-01 3.78904568060756674619e-01 3.70350880558857731284e-01 4.51290595489854562405e-01 2.44340758607648866896e-01 4.13359586590064054246e-01 3.18242696004173819535e-01 2.21871471888333088307e-01 1.70800837981636588481e-01 4.65695832600903469878e-01 2.24635454243962806586e-01 7.61240927418923851722e-02
15 1.00000000000000000000e+00 6.43716478498419952814e-01 5.29846956752095366028e-01 6.34926994575786274311e-01 5.52682714102654348842e-01 5.70675301912366039758e-01 6.12494113434617570846e-01 4.94659810093269369791e-01 6.66561529254859452820e-01 4.47313910284388160932e-01 6.86846312018215776618e-01 4.49441899396133548450e-01 6.65393150222203688671e-01 4.98650131403070351332e-01 6.16108437104883388535e-01 5.63617526462771634144e-01 5.76008765992138682677e-01 5.91945351877536163343e-01 5.87764305288327015830e-01 5.42626219374239937565e-01 6.53938661716715996519e-01 4.35588203004937779550e-01 7.25084331880129662196e-01 3.44904999841046111531e-01 7.49334234320319092504e-01 3.07853942883874187597e-01 7.45138982794850801561e-01 3.01571103610944413198e-01 7.34942946296894938918e-01 3.01940353302052544304e-01 7.30782480750913676637e-01 3.15145493037007839998e-01 7.23832433554588705604e-01 3.57527124175556154650e-01 6.76512480054053844114e-01 4.29926328820173009326e-01 5.56701826060390758677e-01 4.10564662303870508975e-01 5.19676165916308607784e-01 3.44387563849607891697e-01 5.31964230451986264114e-01 2.89556884858988394793e-01 5.04423537240167196849e-01 3.47296685833645202290e-01 3.20811392694038022277e-01 3.78933432478063381144e-01 3.35103688762988349836e-01 1.47491616899987021405e-01 4.79238585494870972248e-01 2.70099141233313910782e-01 9.84465778297675259134e-02
16 1.00000000000000000000e+00 6.24532957315411918486e-01 5.32256141543039906772e-01 6.23642349297296560984e-01 5.45944171845986203628e-01 5.74331168270067360382e-01 5.93687620676576099932e-01 5.11643889905102566829e-01 6.46069253441605817478e-01 4.57248027227042441734e-01 6.77046848622979702270e-01 4.42607760859470900083e-01 6.73329532909330286117e-01 4.70944741991293713834e-01 6.38250966143486642146e-01 5.27796377962803320294e-01 5.92444483969583046701e-01 5.76873392842415899651e-01 5.73396864683754836634e-01 5.73250287247344392227e-01 6.07258549708801442790e-01 4.99361135240232012489e-01 6.77223287477797475375e-01 3.93342509720154054342e-01 7.33840037167632464055e-01 3.20015592897139822259e-01 7.57764719128365960010e-01 2.90976740677430900650e-01 7.60154895548131426253e-01 2.85098546330856184028e-01 7.52879804050333500953e-01 2.92205911742192403491e-01 7.35523573997241997269e-01 3.09092178760235758439e-01 6.95820933720166179270e-01 3.29636677932203026042e-01 6.29520612739651541645e-01 3.14934950641997779552e-01 5.97641425764256162267e-01 2.97583120984945492804e-01 5.64962977603312155317e-01 3.25178803366603763614e-01 4.56417842976069187966e-01 4.08737902486647486366e-01 3.02555778548944054318e-01 3.67672965887588354406e-01 4.11475396064029108611e-01 1.34640417388952493560e-01 4.78955866440020416874e-01 2.98360183644134968617e-01 1.15869824609227178858e-01
17 1.00000000000000000000e+00 6.21694312311719454733e-01 5.32719073410643173538e-01 6.22785423675038862790e-01 5.43123109133584969221e-01 5.76414907777574314629e-01 5.90462040765103779449e-01 5.11565370142754827221e-01 6.42263861442646688538e-01 4.58864297311508462229e-01 6.74289929063984994073e-01 4.40678666320623801944e-01 6.73953199884493980854e-01 4.62239191707940533238e-01 6.43141477033108199812e-01 5.12231323686881401258e-01 5.99290626240712498429e-01 5.61726015227362096560e-01 5.72468482293965186258e-01 5.72629131226620513573e-01 5.88407575983672770370e-01 5.23388617089241781066e-01 6.44637622563990597691e-01 4.32614009462915560800e-01 7.09528007870834143134e-01 3.49560426431521520385e-01 7.52201822653655760575e-01 3.02106933562056922948e-01 7.66859247793659770664e-01 2.84416142574088315342e-01 7.57963035907139759395e-01 2.81018464898146802522e-01 7.32074613961953835073e-01 2.84559330995090009608e-01 6.90516127282185143699e-01 2.87611242899536545536e-01 6.42397591442850579568e-01 2.88677074772838770933e-01 5.94877265812119193633e-01 3.18591995912754222253e-01 5.09403754180703494114e-01 3.89000446023179735633e-01 3.69187008261523286201e-01 4.31390943878133370504e-01 3.42640466010898092630e-01 2.71782559128467549048e-01 5.28859580040056731498e-01 1.53077616467702820602e-01 4.43169704115336460237e-01 3.62269980128668067643e-01 1.54670353238817309682e-01
18 1.00000000000000000000e+00 5.87990913037115259243e-01 5.38248325439798502856e-01 6.10158692481906572702e-01 5.25153204908619608560e-01 5.81875805583411787048e-01 5.64646779180528968212e-01 5.14826613407788458154e-01 6.32606205949587940829e-01 4.32577580010854001458e-01 7.01257856533391676912e-01 3.62456756697417392665e-01 7.57553341557929305061e-01 3.31089972734712578717e-01 7.80088687145273018686e-01 3.69603810650293018725e-01 7.02475714383519966866e-01 4.70858199736824856174e-01 6.18533971945814387006e-01 5.61738087549067843796e-01 5.62839623963609314572e-01 6.02235471180263881585e-01 5.45937288742767923289e-01 5.55834127968937830033e-01 5.73997931963502239228e-01 4.81183118964424116903e-01 6.06396826106029185333e-01 4.18656874064606943087e-01 6.24929182161978680199e-01 3.88301628731152481677e-01 6.29028969120151271177e-01 3.76513879123310246655e-01 6.16771016975707242480e-01 3.80115268830355679253e-01 5.96152840626421154369e-01 3.88198086432777200727e-01 5.56896345401247772067e-01 4.11394147873444748775e-01 4.93281012803901020014e-01 4.50371067347019815585e-01 4.11969235944278699968e-01 4.75224368085660875405e-01 3.61248199431953076477e-01 4.07165079702940913009e-01 4.58926516336868040025e-01 2.16617599036324132156e-01 5.98016394907000092829e-01 1.77179745491715001648e-01 4.22590777709844989118e-01 3.90090886800829095282e-01 1.78195969237058271517e-01
19 1.00000000000000000000e+00 5.96408406169423144227e-01 5.35946467226521838789e-01 6.10437785676259947465e-01 5.37357454117120880710e-01 5.76156315129415341758e-01 5.86546965605153070022e-01 4.99237003653872080111e-01 6.63575365583058629504e-01 4.09790606087131525914e-01 7.36906695418981572132e-01 3.41874683871612627950e-01 7.78446330824113963409e-01 3.33436282616567158943e-01 7.63383112830458010478e-01 4.01798395914289951936e-01 6.69542310419639519203e-01 5.07521657052803054633e-01 5.83931450695148734908e-01 5.85667225874475949610e-01 5.27391273839897256615e-01 6.03363081810030288388e-01 5.19883046235637080734e-01 5.52375995385193108156e-01 5.46737132364034428278e-01 4.87866875360629392855e-01 5.74934112896555271632e-01 4.36345718864192766429e-01 5.85219875655918042590e-01 4.15846527995666570554e-01 5.83554289169066486842e-01 4.12614098480628743726e-01 5.69824987503907642861e-01 4.20337992903419943591e-01 5.41714494781950328672e-01 4.36403423336891194140e-01 4.96219374884709241158e-01 4.62263570920696587052e-01 4.34581624870659322113e-01 4.85777726489064254345e-01 3.85567762001152392060e-01 4.57318960333534196838e-01 4.16044078324110833123e-01 3.13693627738293179252e-01 5.65845954495040270871e-01 1.76109867693314436909e-01 5.79675878071427508331e-01 2.49244823748351551629e-01 3.76778763690883644610e-01 4.38492873232596891420e-01 2.30007672156520903695e-01
20 1.00000000000000000000e+00 5.86834226678573434022e-01 5.39553693045391913330e-01 5.98439448202053192460e-01 5.40371091164174477406e-01 5.71857622371902185598e-01 5.81871277374443107711e-01 5.06614823600993746666e-01 6.47736499411360244771e-01 4.28707218576050541614e-01 7.15923854961878158853e-01 3.63271451827412383828e-01 7.57027696485432000095e-01 3.41620221887032948782e-01 7.53826572239929992847e-01 3.73975135065712060989e-01 7.01428239819073873207e-01 4.45291890079233365629e-01 6.30053156494057575721e-01 5.20705600595498530048e-01 5.66008510262253849987e-01 5.67206888856531032950e-01 5.29952531101332557917e-01 5.66407196046282646051e-01 5.26585871070358702006e-01 5.32859137015325723397e-01 5.38543733738025220958e-01 4.89424577881441169591e-01 5.45131289588942302693e-01 4.62634027963936489414e-01 5.39941384547012792616e-01 4.53169526009783607545e-01 5.22543984796000837711e-01 4.61307838428147432008e-01 4.92167177436688918490e-01 4.73780862468857866254e-01 4.54220197030422268014e-01 4.86086329707043685033e-01 4.17776646907064064251e-01 4.78421367637596850475e-01 4.15562788229929813699e-01 4.11806900118681040723e-01 4.92299180976421613121e-01 2.68366893783374416138e-01 6.17437283311027762522e-01 1.77490490443184489866e-01 5.77929200919314101093e-01 2.74738730845532963531e-01 3.68700341861417202338e-01 4.41819547810930302045e-01 2.44569843326787245141e-01
21 1.00000000000000000000e+00 5.82962478887969703933e-01 5.40554205575783042192e-01 5.96697087646995472099e-01 5.37948548544727400689e-01 5.71356005832989621851e-01 5.76741511930147776610e-01 5.10800022502866379881e-01 6.38835365860010218064e-01 4.36216471955646334369e-01 7.02475049169799414805e-01 3.72852668364859085592e-01 7.44360851087782493529e-01 3.43879478844343722255e-01 7.50101517620787916485e-01 3.58229913966867707931e-01 7.16600447760540659736e-01 4.08224344578614339873e-01 6.60006171753858561502e-01 4.72285126886588746409e-01 5.98030969145254109876e-01 5.23905160193330998730e-01 5.50592893307195740960e-01 5.46163312086249019828e-01 5.24063894947934816315e-01 5.40223324957511352729e-01 5.13893454440905617098e-01 5.22877957855043207225e-01 5.06086045892378932898e-01 5.06221922364612719747e-01 4.94768547718990203688e-01 4.99045445656452479888e-01 4.78312551757043513678e-01 4.98776743370545727618e-01 4.53771767618724175541e-01 4.97257969482794048854e-01 4.36141282356860504610e-01 4.79190122462182566121e-01 4.38323913445540169764e-01 4.20879647842883675146e-01 4.96035188986434227854e-01 3.10910588901558426755e-01 5.99928028436547466917e-01 2.06446796969701251712e-01 6.36307240228940584892e-01 2.23390514340148754746e-01 5.20276883215212815337e-01 3.43218750621100854303e-01 3.55242714976376605662e-01 4.65424607976444859592e-01 2.93164489673856110130e-01
22 1.00000000000000000000e+00 5.60667842013985340266e-01 5.46471212974137476870e-01 5.74144436683148406964e-01 5.39630803895104538270e-01 5.68574236082273309911e-01 5.59040969808789256490e-01 5.27069996672161367179e-01 6.03382497466952494314e-01 4.70093323739286084173e-01 6.58701687813912473146e-01 4.09208010090017115790e-01 7.08200078444961800272e-01 3.61521680012364343693e-01 7.38308904896948670071e-01 3.42157133090195963998e-01 7.40053611394425159276e-01 3.53707831219834401004e-01 7.12692302755129847291e-01 3.92424587533601432199e-01 6.66833486415915666079e-01 4.43612802273628148431e-01 6.12206592550483374993e-01 4.85982931115963745494e-01 5.67082076899336873232e-01 5.11325824897016389947e-01 5.33224778913142793968e-01 5.19096008375446005267e-01 5.06889278271287713196e-01 5.17691862732788332657e-01 4.89659511229515453934e-01 5.10167653652560559863e-01 4.73652875602405154520e-01 5.00612985203716442939e-01 4.64605252278133984412e-01 4.77787832400299872226e-01 4.74127144270215516997e-01 4.32326382055304048180e-01 5.09539866373744931849e-01 3.53790559679553584527e-01 5.82574685644750900337e-01 2.59256762025935838523e-01 6.53131174316852414208e-01 2.00875470129987437895e-01 6.38727935928583123726e-01 2.48530860100996203732e-01 5.03225313977893939921e-01 3.72448701261298475984e-01 3.51782996407116466120e-01 4.65359602297255647851e-01 3.07819646131538282585e-01
23 1.00000000000000000000e+00 5.54505954921521770906e-01 5.48791921259569881464e-01 5.71060180034222986123e-01 5.36122855018649646652e-01 5.65504698706710828837e-01 5.52511555987738600670e-01 5.31419642750015741584e-01 5.91503774546222271802e-01 4.79598367407645220784e-01 6.41044984595003475292e-01 4.22712775566288945228e-01 6.89194847783220154724e-01 3.73253831546861536417e-01 7.24438456362214044937e-01 3.42853605937378624890e-01 7.38031415969372828201e-01 3.36856699128116776620e-01 7.28615925690914822965e-01 3.53939391570804617881e-01 6.99994854312200431856e-01 3.86636963921481779938e-01 6.58783052283193115706e-01 4.21610686549492130748e-01 6.17457466540038635294e-01 4.50493948755012307839e-01 5.79339261146240569467e-01 4.68330659199996446329e-01 5.49532177883611527847e-01 4.72366553804014766005e-01 5.30749941143318304526e-01 4.67607536021819591987e-01 5.20866110463743980930e-01 4.48032240809701831630e-01 5.25462117130693462386e-01 4.07673449493290762646e-01 5.54809192831805630952e-01 3.43095678430432982076e-01 6.09154565386342161659e-01 2.65562694550780686864e-01 6.64191982597492236451e-01 2.11906574082822346528e-01 6.58400892423590788916e-01 2.37259750264740387760e-01 5.71661937368045713903e-01 3.27005240451741507890e-01 4.46567409410449811524e-01 4.25338336191593946456e-01 3.68231174215558010321e-01 4.70581172681508952405e-01 3.59335494872813743239e-01
24 1.00000000000000000000e+00 5.22764809247131978509e-01 5.59713831735076605689e-01 5.36883088735406022174e-01 5.42415760918159906012e-01 5.42508209681786923717e-01 5.44116413458950454185e-01 5.39566900540063731917e-01 5.58175542862479723283e-01 5.12666181907397322526e-01 5.87488833398412957365e-01 4.73198936132637637542e-01 6.25789743160957923074e-01 4.29277450447331510031e-01 6.65449442796059331684e-01 3.86399381356974991331e-01 6.96867137070355746609e-01 3.52633443879442509683e-01 7.21756354457501858590e-01 3.30615999918355663034e-01 7.36564362795555038765e-01 3.22991836777831220484e-01 7.31034541760964828860e-01 3.31845614019318890797e-01 7.10565437960365753334e-01 3.48360322313698345109e-01 6.84527473256827168058e-01 3.66767811462281045909e-01 6.54835014469683840410e-01 3.77087665038681796315e-01 6.32614182883759701426e-01 3.77557647044497790567e-01 6.21003202651862484807e-01 3.60909249188670511188e-01 6.25415253098602685888e-01 3.26264506302009482663e-01 6.47860450888284700177e-01 2.78579655301597006734e-01 6.77606774252386356849e-01 2.33858325085617824168e-01 6.92858793737334277552e-01 2.19674627551069340248e-01 6.50764302955228912673e-01 2.67402803540577327368e-01 5.51303476978637130301e-01 3.56656100664358877150e-01 4.36106848443065242549e-01 4.41589649820105956124e-01 3.70131910361122973274e-01 4.68499788404304007283e-01 3.70474909287376807931e-01
25 1.00000000000000000000e+00 5.17493629059445403584e-01 5.61979542999955450355e-01 5.32701213350479707564e-01 5.41754366420348465461e-01 5.41434840589780863596e-01 5.39719295530933340643e-01 5.36640106177644682361e-01 5.50709422845319429562e-01 5.16090243888658317672e-01 5.73773452404106598657e-01 4.84198608330433266644e-01 6.05552900064577848127e-01 4.45898234411632454766e-01 6.40491739929542114318e-01 4.05870758376278395474e-01 6.72360977978608720385e-01 3.70553351849342571533e-01 7.00901703809811538193e-01 3.40056299722211796688e-01 7.23299050169873058991e-01 3.16836956216218434967e-01 7.33054364907810174223e-01 3.04624481503325328369e-01 7.34051652740933202601e-01 2.96929408358569346671e-01 7.28375271423567838269e-01 2.91494701904809583315e-01 7.21401809479542688308e-01 2.84954282131173464165e-01 7.15981933186685792769e-01 2.74641757130146213495e-01 7.16747107884226020147e-01 2.58271065692050938445e-01 7.17080838315724111709e-01 2.40218571236000183466e-01 7.14574931166720439535e-01 2.38364751707361599564e-01 6.88243736853459964209e-01 2.61030992074804291114e-01 6.26416049212738967888e-01 3.18441269290748452114e-01 5.45499304265374074241e-01 3.81205773871070907610e-01 4.72431446238715468944e-01 4.34012042763704863901e-01 4.23286302910570788605e-01 4.56733643789380694411e-01 4.17002856693247658804e-01 4.58350462757267818059e-01 4.28262496385109048269e-01
26 1.00000000000000000000e+00 4.88645122269700526996e-01 5.74097206916850733016e-01 4.98724799626184489565e-01 5.54325499518002473565e-01 5.10936663884830943871e-01 5.46076938010293222447e-01 5.20372734311375095828e-01 5.40273231798570785500e-01 5.17212016534956298131e-01 5.46527620405954928096e-01 5.10502506137139766551e-01 5.57979699071041612690e-01 4.88779998424309192195e-01 5.76166741697174633607e-01 4.71124575894775243778e-01 6.00657184746114736207e-01 4.42354342442267012281e-01 6.29303712858009789421e-01 4.10140741625331539666e-01 6.59325138041673364242e-01 3.75439868250569408481e-01 6.88207618194791481692e-01 3.41939385483325530846e-01 7.09067601897710009240e-01 3.14401387794490227989e-01 7.24033669899974419160e-01 2.93019687198356804103e-01 7.28567011084645943519e-01 2.79347840190401430771e-01 7.30196935113938683237e-01 2.68589874884718471382e-01 7.26216831822228181537e-01 2.63511287917917780277e-01 7.12795133339629072289e-01 2.65715318719348891907e-01 6.87315408432439989284e-01 2.82986192029563987660e-01 6.44824790778599110652e-01 3.16082864374528926810e-01 5.85869743769874218309e-01 3.64476183348167670495e-01 5.18633498597787956363e-01 4.13525656268715180452e-01 4.61370401854746592374e-01 4.51648338114953085132e-01 4.25471320922683582388e-01 4.67516008406567040723e-01 4.21613712343971880347e-01 4.54073020529683624158e-01 4.40016934221416966544e-01
27 1.00000000000000000000e+00 4.85544518236892708174e-01 5.75697112334032090608e-01 4.95428819543980158979e-01 5.55711072813071749188e-01 5.08482743336447606808e-01 5.44519452052339647530e-01 5.15340588769274909886e-01 5.40237348896386304631e-01 5.15274724204936251937e-01 5.42728256917857532216e-01 5.09196956218959551066e-01 5.50737087351539145175e-01 4.95557437017330404405e-01 5.64891742501565707890e-01 4.79620511382047254312e-01 5.83368837739884904536e-01 4.56863377168349238389e-01 6.05113254045304249651e-01 4.30576899781009714285e-01 6.28710830749102722592e-01 4.01577041955996583145e-01 6.51990347275789861037e-01 3.71841428312387922706e-01 6.70466756420710630060e-01 3.46343855784897958205e-01 6.82764774370385518765e-01 3.27208626440846639394e-01 6.86331505254037299579e-01 3.15702444455441877391e-01 6.83567277636862646872e-01 3.10945819954987656697e-01 6.71802524993442506940e-01 3.15188803829043517890e-01 6.46420365186580303529e-01 3.31153681868924854026e-01 6.06961503953464709404e-01 3.60749762715999511276e-01 5.57250460907823041978e-01 3.97421956216463034828e-01 5.05929200370243692397e-01 4.34213031911394820028e-01 4.73924995158639228432e-01 4.56059030311899926691e-01 4.56492832732613318392e-01 4.66864152977133128886e-01 4.46271541965335916125e-01 4.54234701521101680299e-01 4.66899767943144194948e-01 4.40682270507630147183e-01 4.79137966006446092138e-01
28 1.00000000000000000000e+00 4.60830343292954580647e-01 5.87663068961627121922e-01 4.63603226392455047833e-01 5.72716583822085678612e-01 4.76615302097627369093e-01 5.59351052031626383432e-01 4.83997758143620171456e-01 5.52432534346595560670e-01 4.90058034424302790821e-01 5.46689540313649802172e-01 4.94868892321492337416e-01 5.43900081619559716550e-01 4.96811470885886952153e-01 5.44247310786980187380e-01 4.96125682106666687776e-01 5.46288541204932753814e-01 4.91715619381095259133e-01 5.49729342333168502499e-01 4.84740228007813134248e-01 5.55902534871572595598e-01 4.80880437137924332536e-01 5.67594655868616237981e-01 4.65408211499007629097e-01 5.80955754105109689611e-01 4.44707829412010591241e-01 5.94312300958907191450e-01 4.22163367418030177625e-01 6.01372321043994628731e-01 4.06138387562612501736e-01 6.01037360248407259711e-01 3.98084024764540189700e-01 5.92935967306769562413e-01 3.98465952295916914228e-01 5.75154177653138476423e-01 4.07325805779623850711e-01 5.49513287007745154789e-01 4.22426910315470582891e-01 5.19186358051556773319e-01 4.40639451701084539081e-01 4.90539486753442888212e-01 4.57439954602117337945e-01 4.70127522233690253728e-01 4.67471666583011757901e-01 4.60326447161048979417e-01 4.69058302036758190123e-01 4.60455285861776086875e-01 4.57281878944944486509e-01 4.74945705617520308461e-01 4.35434709993790303173e-01 4.90329332735926659570e-01
29 1.00000000000000000000e+00 4.57911477986947645924e-01 5.89151515962161420603e-01 4.60662674427793461529e-01 5.73513509108069863274e-01 4.71317917162588750912e-01 5.61873717605090194915e-01 4.79795487403012810290e-01 5.53557290072872465458e-01 4.86150048458510231075e-01 5.47536735193470680549e-01 4.91043444530580019958e-01 5.43389258358850324448e-01 4.93829247380194014116e-01 5.41552767151487923769e-01 4.94625743625265068548e-01 5.40845916282566507860e-01 4.93464388151234278901e-01 5.41297534479356023951e-01 4.90171426418685829418e-01 5.43296366294499177840e-01 4.86805750113503354903e-01 5.46380171706782769014e-01 4.78689470103162983960e-01 5.49586633849474370805e-01 4.68665363232920462178e-01 5.50852214176408061519e-01 4.59479251228124052631e-01 5.47882599813828585766e-01 4.53899709226495029490e-01 5.40604400095388570868e-01 4.52183070741982162666e-01 5.28564194365668038600e-01 4.56383771271333282815e-01 5.14421850031951288784e-01 4.60559876989337479980e-01 4.98331839597235815020e-01 4.66220432362320191810e-01 4.86589974945447811816e-01 4.68079348913901960305e-01 4.82432535723000432970e-01 4.69261038004275543578e-01 4.80950245668736398041e-01 4.63259967313069620509e-01 4.86871647066786594760e-01 4.52169566950491153001e-01 4.99063858154804751432e-01 4.34565181565478797499e-01 5.18606177023943293314e-01 4.20840045839490584090e-01 5.22813347871377454013e-01
30 1.00000000000000000000e+00 4.34851949540663695881e-01 6.01123255030975411906e-01 4.30409242539642855618e-01 5.91240778271127420673e-01 4.36115358430732735773e-01 5.83539980834961502509e-01 4.43394958504087055573e-01 5.75174632027318999405e-01 4.48503016698141854235e-01 5.70025373371458532468e-01 4.55838068687929642842e-01 5.64211302820064375396e-01 4.59502167520235815790e-01 5.59510876138876400709e-01 4.65745982316718432070e-01 5.53999489971011671585e-01 4.73294524023222307196e-01 5.46937200082902807985e-01 4.78707286957457234244e-01 5.40715493293867144331e-01 4.81621946579297244284e-01 5.36553431347440268340e-01 4.92733149778368184624e-01 5.27992143308047112704e-01 5.00537549724873853663e-01 5.20268364003791061734e-01 5.01927310835235895858e-01 5.14229083528556785154e-01 4.99302254247988686053e-01 5.08214670665915191350e-01 4.95985970928885966380e-01 5.03044491833093743161e-01 4.90815788350754400593e-01 4.98124621322630467546e-01 4.86710337613679600022e-01 4.93485363019425637976e-01 4.81584074705579012754e-01 4.90920011644681686391e-01 4.75315228865205274822e-01 4.91709107755293084452e-01 4.68896927250057771186e-01 4.95010899865642617357e-01 4.59753257329897857542e-01 5.02268154623756402088e-01 4.48174913759610271669e-01 5.13095045371422364688e-01 4.33503596245250311103e-01 5.26988165184124612850e-01 4.15820213208417943651e-01 5.32572990041799809724e-01
31 1.00000000000000000000e+00 4.32364011750879462248e-01 6.02434569801113317666e-01 4.27169260750987322961e-01 5.93100755196412032788e-01 4.32500992550322371777e-01 5.85476849637079133082e-01 4.38106786289223115727e-01 5.78868962264021291730e-01 4.43473968532546058974e-01 5.73107998535778762061e-01 4.48717528903038453958e-01 5.67515531155988961487e-01 4.53491280937756147118e-01 5.62261896862115806428e-01 4.58328314962340610528e-01 5.56857000114765909871e-01 4.63400059058298285919e-01 5.51054046355465843021e-01 4.68340374299035466787e-01 5.44884468928558240997e-01 4.72455013542200319421e-01 5.39065645969913798119e-01 4.78311267966140984953e-01 5.31505729502000479059e-01 4.82208024583604066837e-01 5.24007255517423220503e-01 4.82532029731724154686e-01 5.18248732372803999624e-01 4.79975937911238603739e-01 5.14891081340941081379e-01 4.74362427764548566511e-01 5.15473291301376423945e-01 4.67531401931402856853e-01 5.17905572201063146842e-01 4.60299308832134046465e-01 5.22254299211991068752e-01 4.51653291365162301574e-01 5.28490163076288599342e-01 4.41386502335733454938e-01 5.38454423120305114558e-01 4.31439083436898740409e-01 5.48746764964487154792e-01 4.24429875429229219730e-01 5.54201850060014433730e-01 4.20977012766973968105e-01 5.57893567456631656043e-01 4.08599191843350306730e-01 5.68048725677542942769e-01 4.00058992276574321156e-01 5.63138879624647814559e-01
32 1.00000000000000000000e+00 4.17195029158699770555e-01 6.10675497754716523069e-01 4.06887456431890615072e-01 6.05956080530546947749e-01 4.08646276640129035851e-01 6.01592878092306104776e-01 4.10436853331685891355e-01 5.98655042519105728971e-01 4.13299088976668782536e-01 5.95493885837827918728e-01 4.16248742212224576154e-01 5.91897225697440187986e-01 4.19025365916800340838e-01 5.88658483857396719330e-01 4.21917462640654938877e-01 5.86033439322291460627e-01 4.26600598260797603256e-01 5.81746992511883775911e-01 4.30264451492265054267e-01 5.77920591079508327859e-01 4.34741224088351030375e-01 5.73871301671236788700e-01 4.39786014416834181162e-01 5.68030809268100123077e-01 4.45116773813013011374e-01 5.61477691836631764843e-01 4.48986202273068679691e-01 5.55190427499904881614e-01 4.50721885879040162770e-01 5.50621129548697352263e-01 4.50298009463354909077e-01 5.47813374037177891474e-01 4.47747511047948743013e-01 5.47170218873133884507e-01 4.43263688971281988316e-01 5.48654516557996019266e-01 4.38173893062916541830e-01 5.51237140830485472520e-01 4.31928307064879501986e-01 5.55522381313449442608e-01 4.25171536248527492940e-01 5.60740051784124449163e-01 4.19093224373234762847e-01 5.65503804465221526776e-01 4.13404483581349513344e-01 5.69877116967193231289e-01 4.05668734646085049622e-01 5.75000900714698781613e-01 3.96746100099915510739e-01 5.69290103337573349940e-01
33 1.00000000000000000000e+00 4.15497962521898578370e-01 6.11611246499780158992e-01 4.04750813880386195454e-01 6.07191289742031292676e-01 4.05705469185584532976e-01 6.03523975634556730796e-01 4.07509635621392196647e-01 6.00511575954584375658e-01 4.09514513006428049202e-01 5.97793327193833157196e-01 4.11546883877920877115e-01 5.95174684850745872033e-01 4.13567379808738699865e-01 5.92730576190972580086e-01 4.15618049581681359150e-01 5.90414179571112307521e-01 4.17991950071253226540e-01 5.87694624139260768381e-01 4.20039154518883961487e-01 5.85225136424567304871e-01 4.21980879255872853850e-01 5.82665861772990845147e-01 4.23568337490652591093e-01 5.79759785754928369528e-01 4.24660357976717972583e-01 5.77127869491630196563e-01 4.24491668121443843642e-01 5.75270713871126826433e-01 4.23371005636173136644e-01 5.74571191560551142175e-01 4.21093504388897033053e-01 5.74971086081983995264e-01 4.18219774416971612485e-01 5.76261251152108466833e-01 4.15471700212348304948e-01 5.78236539244065816945e-01 4.11868444908490338729e-01 5.80615755966299107449e-01 4.08782097575176139870e-01 5.82984865194475676553e-01 4.05312986682284992490e-01 5.85751887195253617691e-01 4.01353522646099858395e-01 5.88796101614168398974e-01 3.96249386063501130018e-01 5.93412174274592474355e-01 3.92879654569642300377e-01 5.94326769982470692888e-01 3.89062342000743910386e-01 5.83270056622643084943e-01
34 1.00000000000000000000e+00 4.06745054876744061012e-01 6.16494731953809105285e-01 3.93042102562715545133e-01 6.14828645999376366404e-01 3.91630146569110215715e-01 6.13405823228182822682e-01 3.91811594616460590057e-01 6.12009534501368523962e-01 3.91979033444812330345e-01 6.11113168838795517424e-01 3.92186944301904261145e-01 6.10472375793434496316e-01 3.92347646570393560062e-01 6.09843266230261416005e-01 3.92909909673949120368e-01 6.09258425028176398008e-01 3.93184799467907186710e-01 6.08704630140485036804e-01 3.93724356308422340778e-01 6.08126844582472902978e-01 3.94110405429897725504e-01 6.07795966902351492145e-01 3.94359412062062597570e-01 6.06922688771196483515e-01 3.94606369600763506877e-01 6.06960653253870607848e-01 3.95384900934508509707e-01 6.06087319110236943942e-01 3.96104567340336444214e-01 6.05251547575299309045e-01 3.96335467754987735844e-01 6.03944144333220078735e-01 3.96845425814988994606e-01 6.02280469200268564478e-01 3.97226816006779392954e-01 6.01013561318153755053e-01 3.97073184480170204846e-01 6.00182967614507956178e-01 3.96454200886564245288e-01 5.99873457852285407732e-01 3.95371654401022343261e-01 5.99981037592930532831e-01 3.93802440511920814892e-01 6.00497474513083773218e-01 3.91640985780754902201e-01 6.01233123376329281484e-01 3.89167271110922752264e-01 6.00913207623870126994e-01 3.86115722525162241574e-01 5.88644521632872286254e-01
35 1.00000000000000000000e+00 4.05892376232108553769e-01 6.16964708080424251158e-01 3.91963578961160241665e-01 6.15458367022956753800e-01 3.90392005831925736903e-01 6.14171070841626032255e-01 3.90014359070628147119e-01 6.13252096414362068977e-01 3.89919774414125508422e-01 6.12590657895247581166e-01 3.89909917475361522676e-01 6.12099642482907269070e-01 3.89923400524422703040e-01 6.11727670368432341341e-01 3.89934719022165920954e-01 6.11438964950780872165e-01 3.89921357839855653449e-01 6.11213250695924359412e-01 3.89869743045017258520e-01 6.11041893154919746323e-01 3.89761091554138128235e-01 6.10922575028813419351e-01 3.89594204390378062719e-01 6.10822073087696315596e-01 3.89423642672099334927e-01 6.10737528603362944679e-01 3.89278953405923722197e-01 6.10518990540919626042e-01 3.89162367911940088039e-01 6.10279333744171093024e-01 3.88980342590805494574e-01 6.10069089106255013633e-01 3.88815801566265162315e-01 6.09999952376665155462e-01 3.88511732621170891022e-01 6.09967665731218522396e-01 3.88214803111346151709e-01 6.10044266406911561695e-01 3.87719478043859311356e-01 6.10137877080162760457e-01 3.87289510746775311745e-01 6.10111078209367496683e-01 3.86529503182360567592e-01 6.10074556826115665942e-01 3.85202363975564010534e-01 6.10242862794662999093e-01 3.84178545186638242814e-01 6.08468212261636831606e-01 3.82899168283440893834e-01 5.94342874635081619417e-01
36 1.00000000000000000000e+00 4.04615041358934501847e-01 6.17681985149785894862e-01 3.90272095986994138617e-01 6.16554572970048231362e-01 3.88383642866019840323e-01 6.15566013261835465187e-01 3.87749128572529244696e-01 6.14897656824808125364e-01 3.87435781155554326283e-01 6.14450694083602866336e-01 3.87251549999961364179e-01 6.14145147222718179592e-01 3.87124819102376782620e-01 6.13927478206079402234e-01 3.87041230743882358478e-01 6.13759671486351465752e-01 3.86967529440446933453e-01 6.13633048183064633285e-01 3.86904574728872074907e-01 6.13529146030764915842e-01 3.86851962092247314562e-01 6.13436501721320914804e-01 3.86794684846913594534e-01 6.13359559488742989153e-01 3.86734778074447393958e-01 6.13297300524336175265e-01 3.86674452189205097863e-01 6.13237158928820247361e-01 3.86606304677609091680e-01 6.13187381032726297470e-01 3.86504912256566968143e-01 6.13128184791322472513e-01 3.86389301331387935434e-01 6.13050606306143719415e-01 3.86284583201709108558e-01 6.12932119763189731110e-01 3.86138987000308409048e-01 6.12798574312037769296e-01 3.85936626037043040149e-01 6.12637190564966349626e-01 3.85646939242558939309e-01 6.12421604009846798355e-01 3.85215157314076905859e-01 6.12088271961740981730e-01 3.84552281690100028477e-01 6.11442370969584092499e-01 3.83550590124771273448e-01 6.09566029835908351764e-01 3.82391674786099922123e-01 5.95253103549964412977e-01
37 1.00000000000000000000e+00 4.04451643169808194855e-01 6.17773668968531586287e-01 3.90058337996429138617e-01 6.16692969883766761718e-01 3.88130308274979518579e-01 6.15742805657820246878e-01 3.87462610853550215584e-01 6.15109136195015393511e-01 3.87131264629028748470e-01 6.14689550594183287124e-01 3.86930838333127746775e-01 6.14404060978901211953e-01 3.86793485195142561217e-01 6.14202436856295053147e-01 3.86690699345972277445e-01 6.14054209765390823783e-01 3.86608248599400960988e-01 6.13940644552396497247e-01 3.86538501491823061063e-01 6.13849506085251017673e-01 3.86476367873880732873e-01 6.13772776750302173632e-01 3.86417646928655600380e-01 6.13705685754964425094e-01 3.86359716265835428928e-01 6.13644037803214636995e-01 3.86299294230306067277e-01 6.13584503019300675497e-01 3.86233149253979057836e-01 6.13524024953799762550e-01 3.86157688634643891934e-01 6.13459453132916165963e-01 3.86068295691784080237e-01 6.13386857629960924321e-01 3.85956290526572598498e-01 6.13301825104221598473e-01 3.85808423015909784937e-01 6.13196629119283076470e-01 3.85607257560643124084e-01 6.13056450560121368731e-01 3.85325199838271015285e-01 6.12851987071599157986e-01 3.84905166796677411511e-01 6.12518073917545535778e-01 3.84271166448723389131e-01 6.11849251277484018630e-01 3.83319943491581771600e-01 6.09921672579685325566e-01 3.82236350585951401015e-01 5.95529886755273629717e-01
38 1.00000000000000000000e+00 4.04405954282887836193e-01 6.17799471816871559327e-01 3.89999616153939576702e-01 6.16731564635411899644e-01 3.88062462573168454050e-01 6.15790963237675348374e-01 3.87388776743951612769e-01 6.15164310961509586129e-01 3.87053235990561517177e-01 6.14749910200038329755e-01 3.86850222906577889681e-01 6.14468768479971449992e-01 3.86711686818264233079e-01 6.14269840248931608961e-01 3.86609003119560423745e-01 6.14123418003237886431e-01 3.86526993831785736777e-01 6.14011281822917531770e-01 3.86457700339416121427e-01 6.13921726548488866371e-01 3.86396100820314225555e-01 6.13846448025655133662e-01 3.86338255288788900987e-01 6.13780527804976383521e-01 3.86281077525377658510e-01 6.13720106130128284505e-01 3.86221537154029959105e-01 6.13662045472791906064e-01 3.86156382360998640113e-01 6.13603332103207721460e-01 3.86081663602561464543e-01 6.13540923996774623106e-01 3.85992187783201379236e-01 6.13470947260575716342e-01 3.85880294077782071138e-01 6.13388224181545704816e-01 3.85734279189097972740e-01 6.13284355472022757461e-01 3.85535486707825725272e-01 6.13145148647364024441e-01 3.85254369655257056237e-01 6.12941477584163063597e-01 3.84840541539126335113e-01 6.12605074567956875420e-01 3.84214348215348000526e-01 6.11930251546924153239e-01 3.83273418355600081764e-01 6.09992986910681378454e-01 3.82204528990369718500e-01 5.95586770314361801937e-01
39 1.00000000000000000000e+00 4.04387478240396724960e-01 6.17809902285192169558e-01 3.89975602036377100301e-01 6.16747261703101457009e-01 3.88035071747026449884e-01 6.15810321257658999095e-01 3.87358528115572031680e-01 6.15186904194402583990e-01 3.87021400246634061926e-01 6.14775006283472480462e-01 3.86817534497002124549e-01 6.14495178738540981378e-01 3.86678355631505654699e-01 6.14297648555784170377e-01 3.86574963009646055401e-01 6.14152480548548762584e-01 3.86492736285820093212e-01 6.14041269686311896869e-01 3.86423399945666545818e-01 6.13952384333016021323e-01 3.86361721197948648765e-01 6.13878041115834771624e-01 3.86303866383556293584e-01 6.13813037257126659085e-01 3.86246694513118549175e-01 6.13753489566594367943e-01 3.86187249592909620510e-01 6.13696214266311934615e-01 3.86122332359487896447e-01 6.13638260878045960212e-01 3.86048100543917083183e-01 6.13576504677091572049e-01 3.85959228769694850936e-01 6.13507096721117584082e-01 3.85847989055164763972e-01 6.13424845486554515261e-01 3.85702759158408015061e-01 6.13321359172346536326e-01 3.85505268461650951739e-01 6.13181983905069283303e-01 3.85225839891948418359e-01 6.12977774651284001983e-01 3.84813938896549689872e-01 6.12640361956930945553e-01 3.84190561922672479955e-01 6.11963630604127395429e-01 3.83253828012489694554e-01 6.10022706685553695038e-01 3.82190954434940555196e-01 5.95610932520041824745e-01
40 1.00000000000000000000e+00 4.04377360461391666124e-01 6.17815601320257368201e-01 3.89962971834612481814e-01 6.16755584109895615974e-01 3.88020395412840946037e-01 6.15820770992494326279e-01 3.87342644315923800846e-01 6.15198869995690511558e-01 3.87004701495193392802e-01 6.14788098511763081433e-01 3.86800265307306379015e-01 6.14509273708640724188e-01 3.86660788762521023809e-01 6.14312439902898854704e-01 3.86557263316685884025e-01 6.14167792587153260619e-01 3.86475046858924364823e-01 6.14057024229568537699e-01 3.86405763410182012674e-01 6.13968531769795933251e-01 3.86344220449948316798e-01 6.13894591034944148156e-01 3.86286525003953218338e-01 6.13829909809471274684e-01 3.86229570153268919608e-01 6.13770620318950910210e-01 3.86170411595545992611e-01 6.13713532334600797569e-01 3.86105842957158329476e-01 6.13655717975541969977e-01 3.86031984324033961009e-01 6.13594027430692134928e-01 3.85943513806386973020e-01 6.13524645709705995777e-01 3.85832803279102909411e-01 6.13442275591955299419e-01 3.85688249560673379612e-01 6.13338568031299824490e-01 3.85491454334237204638e-01 6.13198967184570342681e-01 3.85212554554497543791e-01 6.12994445391272013701e-01 3.84801908424881766724e-01 6.12656375563808364149e-01 3.84180103870185973847e-01 6.11978442083034757104e-01 3.83245184871728317155e-01 6.10035865611231131744e-01 3.82185017828524709049e-01 5.95621482611016328512e-01
