# tag norm j_0
21.400000 1.00000000000002997602e+00 1.45309400262200487039e-03
21.400000 1.00000000000002997602e+00 -1.41744118750085617425e-03
21.400000 1.00000000000002997602e+00 2.10625435821483420959e-03
21.400000 1.00000000000002997602e+00 -1.34947069120023698668e-03
21.400000 1.00000000000002997602e+00 2.05072969625970814161e-03
21.400000 1.00000000000002997602e+00 -1.42357354738095612592e-03
21.400000 1.00000000000002997602e+00 1.95955964466812708122e-03
21.400000 1.00000000000002997602e+00 -1.44668294980873288202e-03
21.400000 1.00000000000002997602e+00 1.96052205490784749869e-03
21.400000 1.00000000000002997602e+00 -1.46049473279498561416e-03
21.400000 1.00000000000002997602e+00 1.95709545296104221387e-03
21.400000 1.00000000000002997602e+00 -1.45100190888051809590e-03
21.400000 1.00000000000002997602e+00 1.96525079025225554372e-03
21.400000 1.00000000000002997602e+00 -1.43854890420831108694e-03
21.400000 1.00000000000002997602e+00 2.06682349806573684159e-03
21.400000 1.00000000000002997602e+00 -1.38032947818741025953e-03
21.400000 1.00000000000002997602e+00 2.13276570999829063677e-03
21.400000 1.00000000000002997602e+00 -1.46761015183889177195e-03
21.400000 1.00000000000002997602e+00 1.39651791558957757630e-03
