# tag norm BO
1 9.99999999999994448885e-01 7.90902136545896736197e-03
2 1.00000000000000111022e+00 3.59650275924206300204e-02
3 1.00000000000000532907e+00 -1.48434353626947582172e-02
4 1.00000000000000155431e+00 -3.17794283063802251998e-02
5 9.99999999999996669331e-01 -3.03379177882281830803e-02
6 9.99999999999997002398e-01 -1.91350988062180295268e-02
7 1.00000000000000177636e+00 -1.27665652096893133399e-02
8 9.99999999999994448885e-01 -8.89111501442626551983e-03
9 9.99999999999997557509e-01 7.10963600233018998449e-04
10 1.00000000000001354472e+00 1.01155711901918608092e-02
11 9.99999999999995448086e-01 7.04096292915460785639e-03
12 1.00000000000000066613e+00 1.62752059634868541556e-03
13 1.00000000000000044409e+00 -1.24332391099984135990e-02
14 1.00000000000000466294e+00 -2.95527015239377237321e-02
15 9.99999999999998223643e-01 -3.78837735355713883800e-02
16 1.00000000000000399680e+00 -2.46491790388661535793e-02
17 9.99999999999996447286e-01 -1.60042813302990784285e-02
18 1.00000000000000199840e+00 -1.17673106198155352775e-02
19 1.00000000000000621725e+00 -1.05321831312331810893e-02
20 1.00000000000000066613e+00 2.72864643307247599358e-02
21 9.99999999999998667732e-01 2.59378758004225190570e-02
22 1.00000000000000177636e+00 2.24563195873840812378e-02
23 1.00000000000000865974e+00 2.02609635002318523578e-02
24 9.99999999999999777955e-01 2.29367248749138691322e-02
25 1.00000000000000599520e+00 2.00522841794684852923e-02
26 9.99999999999999111822e-01 1.29193390276577876885e-02
27 9.99999999999999666933e-01 7.97170290616079288415e-03
28 1.00000000000000244249e+00 3.20063885858961954742e-03
29 1.00000000000000377476e+00 2.17835907425823404812e-03
30 9.99999999999990452082e-01 -1.50203886228635879324e-02
31 1.00000000000000266454e+00 -6.57666962950080417893e-03
32 1.00000000000000510703e+00 3.60185496026927710889e-03
33 9.99999999999999444888e-01 1.05453173433673937781e-02
34 9.99999999999992672528e-01 1.61489563859443276128e-02
35 9.99999999999993449684e-01 1.49701226569741822903e-02
36 9.99999999999993116617e-01 2.14637031417725960419e-03
37 1.00000000000000177636e+00 -4.85409465484019139042e-03
38 9.99999999999989896970e-01 -1.11833429706254382924e-02
39 9.99999999999997890576e-01 -1.21988518903475475635e-02
40 1.00000000000000621725e+00 -5.62114393891120691510e-03
41 1.00000000000000044409e+00 2.44710294115812738817e-04
42 9.99999999999993116617e-01 1.23157967267673133793e-02
43 1.00000000000000754952e+00 1.65356431156925241799e-02
44 9.99999999999996669331e-01 1.68288554197573610172e-02
45 9.99999999999993782751e-01 1.39747126641397746705e-02
46 9.99999999999992672528e-01 9.33446897668577246776e-03
47 9.99999999999997668532e-01 6.31732163613141130959e-03
48 9.99999999999986344257e-01 3.25587468660773178900e-03
49 1.00000000000000088818e+00 3.59770215270352987369e-03
50 9.99999999999992006394e-01 1.95273697382963829471e-03
51 9.99999999999997002398e-01 2.89088040529430871650e-03
52 9.99999999999992450483e-01 1.36841250273080361488e-02
53 1.00000000000000799361e+00 1.04766670120576624314e-02
54 9.99999999999995559108e-01 1.65162623733809826865e-02
55 1.00000000000000555112e+00 2.23643176899935985924e-02
56 9.99999999999994115818e-01 3.01250338207856779849e-02
57 1.00000000000000266454e+00 2.97966179255503213485e-02
58 1.00000000000001132427e+00 2.33577375894055173922e-02
59 1.00000000000000488498e+00 1.31355897762198102485e-02
60 1.00000000000000444089e+00 -1.87876484373375928980e-03
61 1.00000000000000133227e+00 -9.95144332103780476784e-03
62 1.00000000000001065814e+00 -1.49080044401141073585e-02
63 9.99999999999993338662e-01 -1.40815822620019934913e-02
64 1.00000000000000355271e+00 -5.99849931307606248909e-03
65 9.99999999999993116617e-01 1.25141162614692295560e-03
66 1.00000000000000222045e+00 1.58685793433739133484e-02
67 9.99999999999997224442e-01 2.28937546794363566693e-02
68 1.00000000000000421885e+00 2.75752472289646777259e-02
69 1.00000000000000288658e+00 2.46153759535034308281e-02
70 9.99999999999981570298e-01 1.34263808390943650828e-02
71 9.99999999999998223643e-01 6.15682205300433459116e-03
72 9.99999999999992450483e-01 -5.85292147962174387488e-03
73 9.99999999999996447286e-01 -9.35343563086598120404e-03
74 1.00000000000000466294e+00 -7.04954801927951905244e-03
75 9.99999999999995781153e-01 -1.88503627948939786116e-03
76 9.99999999999993560706e-01 1.61103815156887972271e-02
77 9.99999999999998778755e-01 2.57475123681633367989e-02
78 9.99999999999998445688e-01 3.47524632582209488940e-02
79 9.99999999999992228439e-01 2.68980163037029727791e-02
80 9.99999999999992894573e-01 5.56671996156374998543e-03
81 1.00000000000000288658e+00 -4.03271288241841864564e-03
82 9.99999999999998001599e-01 -7.69874124027561130418e-03
83 1.00000000000000066613e+00 1.94627712738599861417e-03
84 9.99999999999992006394e-01 2.98386114109250311088e-02
85 9.99999999999998889777e-01 4.76405948915982341285e-02
86 9.99999999999998001599e-01 7.40740874365777568489e-02
87 9.99999999999992894573e-01 8.37309784702550963242e-02
88 9.99999999999983790744e-01 9.20734268936005684214e-02
89 1.00000000000000488498e+00 9.28172093541436704633e-02
90 9.99999999999988009591e-01 9.20386545652903675929e-02
91 1.00000000000000310862e+00 9.10756589606313837759e-02
92 1.00000000000000754952e+00 9.02608053353051581480e-02
93 9.99999999999999111822e-01 9.00390364361226130940e-02
94 1.00000000000000355271e+00 8.99341989716947731726e-02
95 1.00000000000000555112e+00 8.98924041463051298750e-02
96 1.00000000000000843769e+00 8.98737386583763758763e-02
97 9.99999999999996558309e-01 8.98629760361639023936e-02
