# tag norm j_0
0.800000 1.00000000000000111022e+00 5.04917379179368361840e-06
0.800000 1.00000000000000111022e+00 -2.47337703973863066558e-06
0.800000 1.00000000000000111022e+00 7.49864076599482076127e-06
0.800000 1.00000000000000111022e+00 -1.59943524244670911519e-06
0.800000 1.00000000000000111022e+00 4.44694067953233099422e-06
0.800000 1.00000000000000111022e+00 -4.36806814441276784522e-06
0.800000 1.00000000000000111022e+00 4.62636696125638690219e-06
0.800000 1.00000000000000111022e+00 -2.70553291838276482309e-06
0.800000 1.00000000000000111022e+00 6.03744324568271200482e-06
0.800000 1.00000000000000111022e+00 -3.73322329825485116320e-06
0.800000 1.00000000000000111022e+00 3.54849487795726490453e-06
0.800000 1.00000000000000111022e+00 -2.45550747283012408927e-06
0.800000 1.00000000000000111022e+00 9.08759531301888319476e-06
0.800000 1.00000000000000111022e+00 -1.74502233432743746108e-06
0.800000 1.00000000000000111022e+00 4.88075783278516847467e-06
0.800000 1.00000000000000111022e+00 -4.26775100877940348764e-06
0.800000 1.00000000000000111022e+00 1.50724252246620802491e-06
0.800000 1.00000000000000111022e+00 -2.26754848022747915932e-06
0.800000 1.00000000000000111022e+00 4.45507587420410557398e-06
