# tag norm j_0
20.100000 1.00000000000000976996e+00 -4.47362072799704555120e-04
20.100000 1.00000000000000976996e+00 -3.22569589303605948425e-04
20.100000 1.00000000000000976996e+00 -4.75934760743511602217e-04
20.100000 1.00000000000000976996e+00 4.45190676131818595124e-04
20.100000 1.00000000000000976996e+00 5.13941691215625499206e-04
20.100000 1.00000000000000976996e+00 4.59591781427241732449e-04
20.100000 1.00000000000000976996e+00 -4.65047938293175694771e-04
20.100000 1.00000000000000976996e+00 -3.19148511406602559525e-04
20.100000 1.00000000000000976996e+00 -4.47380744471768889044e-04
