# tag norm j_0
15.800000 1.00000000000002420286e+00 2.43326411971806502938e-04
15.800000 1.00000000000002420286e+00 2.41148101256548515192e-03
15.800000 1.00000000000002420286e+00 -1.18764451766637966698e-03
15.800000 1.00000000000002420286e+00 2.37225955226817329310e-03
15.800000 1.00000000000002420286e+00 -1.12734531195751567535e-03
15.800000 1.00000000000002420286e+00 2.40039060932711661653e-03
15.800000 1.00000000000002420286e+00 -1.11468518904832150987e-03
15.800000 1.00000000000002420286e+00 2.42364851468309522309e-03
15.800000 1.00000000000002420286e+00 -1.11210501161420997895e-03
15.800000 1.00000000000002420286e+00 2.42522595296472019341e-03
15.800000 1.00000000000002420286e+00 -1.10795655134619938295e-03
15.800000 1.00000000000002420286e+00 2.42002817941126954424e-03
15.800000 1.00000000000002420286e+00 -1.09512286752192693033e-03
15.800000 1.00000000000002420286e+00 2.38851675268096554777e-03
15.800000 1.00000000000002420286e+00 -1.09282721706193265525e-03
15.800000 1.00000000000002420286e+00 2.34422939263472830673e-03
15.800000 1.00000000000002420286e+00 -1.13526495510394729790e-03
15.800000 1.00000000000002420286e+00 2.37580021803333960723e-03
15.800000 1.00000000000002420286e+00 3.29736497234092132327e-04
