# tag norm BO
1 9.99999999999997113420e-01 1.30309086270561785836e-01
2 1.00000000000000044409e+00 5.23421352696123651227e-02
3 9.99999999999999111822e-01 6.48953574715754096663e-03
4 1.00000000000000000000e+00 6.59130577859290672088e-03
5 1.00000000000000444089e+00 6.59175655881283784759e-03
