# tag norm j_0
5.500000 1.00000000000000821565e+00 8.74419776429285165731e-03
5.500000 1.00000000000000821565e+00 8.67768657931492978785e-03
5.500000 1.00000000000000821565e+00 8.54405748179772571438e-03
5.500000 1.00000000000000821565e+00 8.66526212790273524245e-03
5.500000 1.00000000000000821565e+00 8.53647112632116566999e-03
5.500000 1.00000000000000821565e+00 8.65146893779519809975e-03
5.500000 1.00000000000000821565e+00 8.51982916733220151106e-03
5.500000 1.00000000000000821565e+00 8.63414940065451719242e-03
5.500000 1.00000000000000821565e+00 8.50342065748664957536e-03
5.500000 1.00000000000000821565e+00 8.61652761407913705960e-03
5.500000 1.00000000000000821565e+00 8.48686493089443987070e-03
5.500000 1.00000000000000821565e+00 8.59918893370852262248e-03
5.500000 1.00000000000000821565e+00 8.46981810978147432734e-03
5.500000 1.00000000000000821565e+00 8.58262835055735757994e-03
5.500000 1.00000000000000821565e+00 8.45242905379796002907e-03
5.500000 1.00000000000000821565e+00 8.56424868383469546640e-03
5.500000 1.00000000000000821565e+00 8.42597088755994705345e-03
5.500000 1.00000000000000821565e+00 8.54240824084068380018e-03
5.500000 1.00000000000000821565e+00 8.59004394230979302638e-03
