# tag norm j_0
26.600000 1.00000000000002797762e+00 4.01601445612193160787e-04
26.600000 1.00000000000002797762e+00 7.33299317956127294504e-02
26.600000 1.00000000000002797762e+00 -3.16342892777500273027e-02
26.600000 1.00000000000002797762e+00 3.24350848736839648956e-05
26.600000 1.00000000000002797762e+00 1.05296509996740839110e-01
26.600000 1.00000000000002797762e+00 8.03626999806499302953e-04
26.600000 1.00000000000002797762e+00 -3.25652679991245488922e-02
26.600000 1.00000000000002797762e+00 7.25438101141686747519e-02
26.600000 1.00000000000002797762e+00 1.15495054838046697782e-03
