# tag norm j_0
4.400000 1.00000000000000333067e+00 3.17956121200810293281e-03
4.400000 1.00000000000000333067e+00 2.30038945168812447193e-04
4.400000 1.00000000000000333067e+00 1.68145112732556983176e-03
4.400000 1.00000000000000333067e+00 5.06703063829759135957e-04
4.400000 1.00000000000000333067e+00 1.71221973578343858446e-03
4.400000 1.00000000000000333067e+00 5.17616303540121788264e-04
4.400000 1.00000000000000333067e+00 1.67231328733766487077e-03
4.400000 1.00000000000000333067e+00 5.51327160927379605546e-04
4.400000 1.00000000000000333067e+00 1.67269602291582981587e-03
4.400000 1.00000000000000333067e+00 5.64153223986495764089e-04
4.400000 1.00000000000000333067e+00 1.66947482139966703503e-03
4.400000 1.00000000000000333067e+00 5.50337847918228820904e-04
4.400000 1.00000000000000333067e+00 1.66215994606285898810e-03
4.400000 1.00000000000000333067e+00 5.15194689580316094596e-04
4.400000 1.00000000000000333067e+00 1.69427466915853669471e-03
4.400000 1.00000000000000333067e+00 5.03447805016228556660e-04
4.400000 1.00000000000000333067e+00 1.65941129693663886463e-03
4.400000 1.00000000000000333067e+00 2.21414391917954298623e-04
4.400000 1.00000000000000333067e+00 3.10481148917156248718e-03
