# tag norm n_hub[0] n_hub[1] n_hub[2] n_hub[3] n_hub[4] n_hub[5] n_hub[6] n_hub[7] n_hub[8] n_hub[9] n_hub[10] n_hub[11] n_hub[12] n_hub[13] n_hub[14] n_hub[15] n_hub[16] n_hub[17] n_hub[18] n_hub[19] n_hub[20] n_hub[21] n_hub[22] n_hub[23] n_hub[24] n_hub[25] n_hub[26] n_hub[27] n_hub[28] n_hub[29] n_hub[30] n_hub[31]
1 1.00000000000000000000e+00 1.55198876560847631723e+00 1.26803509073820208641e+00 1.40949360768178477699e+00 1.53208265266043097697e+00 1.20063293260638492832e+00 1.25091319580601090244e+00 1.00572129426513923178e+00 1.18183919772060774811e+00 9.47237379046969585339e-01 1.26389930572013353682e+00 1.16908465215630585909e+00 1.15072519860813260451e+00 1.24342751131570627976e+00 7.08341226397535939086e-01 1.15004234058608822977e+00 8.61374499487119082985e-01 1.22758076483790712352e+00 1.14023425146766332894e+00 9.41168198271049583070e-01 1.20821977855866991014e+00 1.01234247018825773701e+00 6.71756370488839293920e-01 8.23387820425418803794e-01 8.60359788212663678664e-01 8.67465968799785880350e-01 4.88819951638811367456e-01 9.14140116162047267068e-01 8.14648312000204155581e-01 1.31829116413339053615e-01 9.99064998537358750497e-01 5.41388897401179174096e-03 9.98729354618897668949e-01
2 1.00000000000000000000e+00 9.99559728782427936444e-01 1.21316922404689409021e+00 7.68374989636022576178e-01 1.15450763713259374477e+00 8.20382322365452720803e-01 1.51609331087834564578e+00 7.06510946286517671489e-01 1.82304673610138334716e+00 1.00504548104317481538e+00 1.99145968236889414626e+00 1.00535226115205911235e+00 1.99341418735388953287e+00 1.00302515422184246319e+00 1.01034179943253210610e+00 9.73255339770659699816e-01 1.10361448109850845967e+00 1.85667148618431032681e-01 1.07135151448051457734e+00 8.56018488584008863107e-01 1.54729570598030985451e+00 8.79267703276827905512e-01 1.02072047452532066458e+00 9.56395170010221895573e-01 1.30538539868009184630e+00 9.79641901400231551733e-01 1.09028350658911366011e+00 2.31140661187935608778e-02 9.95186755828305402716e-01 5.18526438104294912224e-03 9.94863508742714452993e-01 4.93671339637736898698e-03 9.97533397716574232739e-01
3 1.00000000000000000000e+00 9.33644465458934313951e-01 1.31264552170346471272e+00 7.42786345147628201957e-01 1.35072207785925413326e+00 7.04146228348355607274e-01 1.51426642402972366774e+00 7.04534434904862671978e-01 1.73981172840526387979e+00 1.00074489614001982396e+00 1.99446429741762187859e+00 1.00489321147605803475e+00 1.98451596176559763585e+00 1.00287881909839748928e+00 1.22226214732719684619e+00 6.88758906169010698406e-01 1.13552786505989455890e+00 7.73079510001423275689e-01 1.17743862903172535894e+00 7.20064970448550889515e-01 1.20221001859681497770e+00 8.36037641443535317620e-01 1.07136022811205178229e+00 6.51162371747060042537e-01 1.01328551739465910764e+00 6.03234943724855643410e-01 1.11459040150512689316e+00 5.47721160083665115081e-01 1.05701533481411535931e+00 1.60980364696241495803e-01 1.02318317064454089582e+00 1.42738625635579988865e-02 9.97758544880830933188e-01
4 1.00000000000000000000e+00 9.06900684591937955581e-01 1.38302605793273691859e+00 7.44092517424257748893e-01 1.46883468588049770354e+00 6.81581769534013504064e-01 1.58573129061233553116e+00 6.89895815566645587147e-01 1.57839414986898529669e+00 9.74475240724254732072e-01 1.98436176311511203174e+00 1.00276072879669597704e+00 1.97955617400993588717e+00 9.91651619953484608772e-01 1.21106506074695752240e+00 6.66836915318115286411e-01 1.19998362924785495487e+00 6.25322928694598711985e-01 1.15086069902849064128e+00 7.48003436774167806966e-01 1.23745037306487382089e+00 7.83315889859964920028e-01 1.12680029485908250741e+00 6.87756965692002175672e-01 1.02194419117631452032e+00 5.25632486845445057178e-01 1.09913572553958016620e+00 3.62685146436019401062e-01 1.13891968418931877061e+00 2.67406459543041430393e-01 1.08899645355577079364e+00 8.39318998728981469082e-02 1.00268926154466142542e+00
5 1.00000000000000000000e+00 8.92134000957178097124e-01 1.38409548281456906693e+00 7.69566788412364810590e-01 1.52324083112421493347e+00 6.95074727877981524138e-01 1.59354046049297970455e+00 7.61155574517656696720e-01 1.54357848702598698942e+00 9.09496502134865547617e-01 1.83334581320334533139e+00 8.37687315130393628237e-01 1.62223684707348048128e+00 9.57350834877317424798e-01 1.26083167199305656858e+00 6.21126012850916287000e-01 1.24991625888185220461e+00 6.10805656554277653925e-01 1.07050833897411878937e+00 7.90735750004305293359e-01 1.30685548419838393208e+00 7.80659477395349576945e-01 1.23222147027592043855e+00 6.96536985193429658558e-01 1.08153810299388108973e+00 5.46983809731637182772e-01 1.21707560259399727443e+00 3.23194989447757596857e-01 1.05354162420110530896e+00 2.25360244633631162658e-01 1.25686553286429658627e+00 3.25082279587141198540e-01 1.02765704198259610891e+00
6 1.00000000000000000000e+00 8.88649182804836734739e-01 1.40333040522829377572e+00 7.66227714735595699658e-01 1.54655532829795361316e+00 7.02193623598885374726e-01 1.58799171427274821156e+00 7.62557360505570325238e-01 1.50153816905048542729e+00 8.74861374817612502675e-01 1.67060537112215845568e+00 7.07617782761252200885e-01 1.58346493973188251481e+00 8.72493235520690801899e-01 1.31709152281494490389e+00 7.48335788983425009846e-01 1.23472441396661869462e+00 6.98024726444922194446e-01 1.14604324848756733424e+00 8.29316176779567926225e-01 1.30745577310456706499e+00 8.18492860598479587964e-01 1.21084772967975307090e+00 6.55854200877509563306e-01 1.13970047977935839967e+00 3.51492990612383260363e-01 1.27441343537763263072e+00 3.67580839907900136510e-01 1.05928623905079377643e+00 2.66958723152215360308e-01 1.25313767114541274594e+00 4.08393251061460738072e-01 1.04476372572770337399e+00
7 1.00000000000000000000e+00 8.87781176151089201909e-01 1.40938411417128661718e+00 7.70470238305425603187e-01 1.56347974833069991440e+00 7.07387470089512526705e-01 1.57847790592071057780e+00 7.74075304491607663060e-01 1.48555257835619780593e+00 8.48340354261981621775e-01 1.59897925730519996357e+00 7.01749683311131744468e-01 1.60368630237244791381e+00 7.70125510415531344677e-01 1.36096716460758826450e+00 7.41613990378058307584e-01 1.27797084866051990915e+00 6.90761017786536424268e-01 1.24961629895899029030e+00 8.17552567194074542023e-01 1.30463386086351573745e+00 8.15910838795898207820e-01 1.17598082192117381339e+00 6.02435473506802154908e-01 1.17801481949205943955e+00 3.32718053128346291647e-01 1.25127101649051386545e+00 4.12363954354121597934e-01 1.10125864878691825943e+00 3.15793375167534473569e-01 1.25168134829189114932e+00 3.76367362084842838055e-01 1.04359889604791367113e+00
8 1.00000000000000000000e+00 8.82669855559460092564e-01 1.41036121165091832275e+00 7.69592419553132511822e-01 1.55290362506598067505e+00 7.11338631338711002705e-01 1.56972885827021646499e+00 7.62746501346091232421e-01 1.48279269154870707581e+00 8.32677029884370090151e-01 1.52198882904171117758e+00 7.19766570888127787953e-01 1.58530227452655680942e+00 7.04727095833971084460e-01 1.45535043446936773748e+00 7.05710033635539080166e-01 1.34876769985983835376e+00 7.06988432323061744000e-01 1.30761182508390816359e+00 8.17497277278748657459e-01 1.29831957280655974074e+00 7.98124092773286109015e-01 1.16167814275883185537e+00 5.58485654704094169887e-01 1.20558659601470230527e+00 3.35544988085014872503e-01 1.23330856985214265542e+00 4.32267040238834499011e-01 1.12563974314756642947e+00 3.24239411952108924631e-01 1.24974306224899978091e+00 3.82358674351479077558e-01 1.04618315390783189756e+00
9 1.00000000000000000000e+00 8.80432599022658801680e-01 1.40622901363518315598e+00 7.71466542271379562834e-01 1.54672200347699395628e+00 7.11136628640580692462e-01 1.56623938613256852292e+00 7.53805062064310082981e-01 1.47633537845806550592e+00 8.16242324954693287964e-01 1.46757671547140633450e+00 7.39887193594042869016e-01 1.53706103200182941926e+00 6.81391022663289769312e-01 1.50275575202396627361e+00 6.84166923762537293463e-01 1.42201754145639891469e+00 7.16103739595695731879e-01 1.36425147612555308640e+00 8.16404916304262151527e-01 1.28912245730828911583e+00 7.70362980442222511357e-01 1.15127527078614111389e+00 5.12463052711911948300e-01 1.22800344282765050430e+00 3.44854906511182113249e-01 1.21324335055920218274e+00 4.45617387779205398335e-01 1.15129951161905919044e+00 3.32404270878011720569e-01 1.25014748844132772554e+00 4.00313043241447119591e-01 1.05066758523891801147e+00
10 1.00000000000000000000e+00 8.70640102917839331376e-01 1.39029866829922199578e+00 7.73932206995963101193e-01 1.52438213673808609094e+00 7.15538064928194272873e-01 1.56040087109751035577e+00 7.35693915599419878681e-01 1.48605189664732506571e+00 8.02673840108906411217e-01 1.44223321985189301131e+00 7.63112515596034990395e-01 1.50202842858379437274e+00 6.92087490521353876360e-01 1.52572417595082798769e+00 6.85181361576796654766e-01 1.46779044020054527664e+00 7.30103562718467546944e-01 1.38620267511117334358e+00 8.18801807251840152446e-01 1.27227139744132511368e+00 7.38976313638526449701e-01 1.15248235180968916502e+00 4.79183440015389539024e-01 1.24091605962112061512e+00 3.61085910416091060426e-01 1.20243875006834510799e+00 4.57280680171267606138e-01 1.16595592250372392940e+00 3.36570058097864555080e-01 1.24951677623194190581e+00 4.15541746608788842288e-01 1.05490321268061792992e+00
11 1.00000000000000000000e+00 8.68022545406292755921e-01 1.38840916651314638663e+00 7.75148738169185835822e-01 1.51575417035196946536e+00 7.13667605731263643420e-01 1.55604131947963852944e+00 7.30424648722096114817e-01 1.48687952746433205142e+00 7.91256098397268181621e-01 1.43533212855812020159e+00 7.71672366721616098673e-01 1.48035533488271831004e+00 7.03268670303394349830e-01 1.52034094379293072130e+00 6.91270186809326503408e-01 1.47739930708434386020e+00 7.37377462407045158876e-01 1.38934410836480548568e+00 8.11384225566105010685e-01 1.23808381690479629711e+00 6.84878074303414186019e-01 1.16904786082304923411e+00 4.51974350492376886201e-01 1.25155569280676282062e+00 4.07917859954254113930e-01 1.18582949775032009399e+00 4.68255607990696154364e-01 1.19329833271927787663e+00 3.41502881724716100820e-01 1.25180440529795355964e+00 4.48826826342503537592e-01 1.06367623816427303574e+00
12 1.00000000000000000000e+00 8.30540065548124095685e-01 1.33752257178478139998e+00 7.76525729536192366176e-01 1.42424085658403876131e+00 7.29117044771843914042e-01 1.49368062689560865408e+00 6.89905835361064978528e-01 1.50521334014311092275e+00 7.11558952697926683229e-01 1.45640931744611745735e+00 7.71092559020486456589e-01 1.39696885626334443842e+00 7.73960825097167348652e-01 1.33683243959587660932e+00 7.41032438265132098465e-01 1.34031912885508219802e+00 7.15371482806246627995e-01 1.30121855987458445725e+00 7.20746999680547006939e-01 1.22301949549195487776e+00 7.42231787945660470562e-01 1.21664250322320510733e+00 7.63996510040644727368e-01 1.23309775019585599054e+00 6.73002597126859170018e-01 1.16790502463953327350e+00 4.92528046932295848759e-01 1.24192554798943932681e+00 3.64713970716045832177e-01 1.24641874806808328202e+00 5.03208151457522734340e-01 1.07905223594558541400e+00
13 1.00000000000000000000e+00 8.15336773552539195720e-01 1.32798660224537345975e+00 7.76131050161235291895e-01 1.37992780344070276044e+00 7.34915112182482066494e-01 1.43322567573426429277e+00 6.98327410003487192292e-01 1.46585080758510599708e+00 6.82741569597293262994e-01 1.46417136417800630710e+00 6.85587757314481738291e-01 1.43514501708714115047e+00 6.99266430693326501711e-01 1.38579767753132965247e+00 6.99664413110867133838e-01 1.34144088013378626201e+00 6.93177440270991263027e-01 1.31501827976980401047e+00 6.97226573157603390918e-01 1.30827369761951861626e+00 7.11619126925634337688e-01 1.27053126102394853270e+00 6.16120954354285488286e-01 1.23452576400786306898e+00 4.38553234340268938141e-01 1.27579718769652750154e+00 4.74638637618296888032e-01 1.21318655441694644992e+00 6.67065878022314429074e-01 1.10917920121654201004e+00 7.40409417279732195993e-01 1.20916044772839348376e+00
14 1.00000000000000000000e+00 7.59767519049267758824e-01 1.30296965861726077307e+00 7.41977007288437073740e-01 1.31310242364104690083e+00 7.45364419127712563018e-01 1.32698828733424090132e+00 7.38944507992613131009e-01 1.33125648869647950079e+00 7.22903207905293498925e-01 1.34515845729226457550e+00 7.03058187165316317291e-01 1.35110717485436282459e+00 6.86716917797957071556e-01 1.38737030180270815016e+00 6.66891850981631617579e-01 1.40349309328252780382e+00 6.53220502391165802614e-01 1.39637284397798921987e+00 6.35077684451463841953e-01 1.38164457845568366956e+00 6.17093197001434834448e-01 1.35504459291807655141e+00 5.96463142047579220062e-01 1.33000368061266915909e+00 5.89916543347541511011e-01 1.29538414884430008733e+00 6.10738820057788567297e-01 1.25968411644743061295e+00 6.48916588180214137793e-01 1.20583501362506684274e+00 6.89028133311802126748e-01 1.20850691150057443224e+00
15 1.00000000000000000000e+00 7.56681316464227204932e-01 1.30318072359951253603e+00 7.38179816200533189807e-01 1.31463045713464787845e+00 7.37934147435555187755e-01 1.31943463476367606191e+00 7.34360756199027298052e-01 1.32172606768313682934e+00 7.23430490325015274067e-01 1.32426004049305312549e+00 7.08710426138247751027e-01 1.32838149325573384729e+00 6.94245204401923166060e-01 1.33086357283679435071e+00 6.83630397090051356024e-01 1.33110658431834427695e+00 6.74707316099649845320e-01 1.32739098091639751154e+00 6.70949857496301316218e-01 1.31951613266002021341e+00 6.70045483322900592427e-01 1.30694197863607652899e+00 6.68754234200418906653e-01 1.28651846675170777878e+00 6.69878957021247445347e-01 1.26098628246519250951e+00 6.70504617976708128246e-01 1.24952636540508588148e+00 6.82472650965819105373e-01 1.25798604418951232020e+00 6.98362820951403673320e-01 1.23470168260220658496e+00
16 1.00000000000000000000e+00 7.39364604968182903555e-01 1.30119362795008886025e+00 7.17767084000469623994e-01 1.31177268534930502319e+00 7.19103589502678386403e-01 1.31719712053631288207e+00 7.27710041335684620911e-01 1.31681464262947334198e+00 7.27991168927919152232e-01 1.31849757532433997653e+00 7.21109713696750476153e-01 1.31761245238283830616e+00 7.13815914414891672379e-01 1.31496576355180749829e+00 7.04144502821393958314e-01 1.31360816377213263095e+00 6.94584100351864353051e-01 1.30895719271931021410e+00 6.89006265532446149358e-01 1.30246545059900831198e+00 6.87027604501558086803e-01 1.29261540437302135942e+00 6.85436188202107499201e-01 1.27914498712642021871e+00 6.83249563626539990757e-01 1.26658248913846693817e+00 6.82520775018123582178e-01 1.26054105762686941006e+00 6.85376162155070467463e-01 1.26084180095936981836e+00 6.96609133198145435983e-01 1.24237317370733468813e+00
17 1.00000000000000000000e+00 7.35930245654724424220e-01 1.30090975434863120874e+00 7.12728175915995354472e-01 1.31147896833638233360e+00 7.13339734437986483506e-01 1.31537151130321716686e+00 7.16322554185111926017e-01 1.31627102451983479803e+00 7.17500478959130827405e-01 1.31559732403031004466e+00 7.15510785489841372176e-01 1.31303039366710372349e+00 7.11249016062890593304e-01 1.30882647786106875998e+00 7.05057355798668461411e-01 1.30337151413605623063e+00 6.99018996447534179950e-01 1.29764864873480822993e+00 6.93897653744512732388e-01 1.29142333415062848800e+00 6.88837971991713038378e-01 1.28221945489408595265e+00 6.83404839657211327086e-01 1.27711358344987946367e+00 6.79795859997137208453e-01 1.27861923690708012558e+00 6.85052512270153401985e-01 1.28875634516863923906e+00 6.83002078336140128201e-01 1.29299077219893998603e+00 6.99293825287152781556e-01 1.26642957205732620274e+00
18 1.00000000000000000000e+00 7.16734577993316301914e-01 1.29962248516565503920e+00 6.85625606094111494926e-01 1.31402417357471912318e+00 6.85126780211148367350e-01 1.31646002725992206095e+00 6.83185982335955954703e-01 1.31919798164124424389e+00 6.80199954100640713506e-01 1.32225122056170829588e+00 6.87242448148797535623e-01 1.31949177053105271007e+00 6.87290178447220623248e-01 1.32386908713294193518e+00 6.90656144686739192906e-01 1.32372971066719835598e+00 6.92201056754788046632e-01 1.31837453416315231181e+00 6.92052543585702895079e-01 1.31334305926379024676e+00 6.88749344581577771507e-01 1.30778608472087509718e+00 6.85111682539739086373e-01 1.30508521507821417806e+00 6.83359583899664113638e-01 1.30398311598475902251e+00 6.84612982000398551108e-01 1.30457447793563430238e+00 6.89208856263975211398e-01 1.30206809121659006223e+00 6.99892684220691174701e-01 1.27488855923818134031e+00
19 1.00000000000000000000e+00 7.14899315800638590623e-01 1.29968499554850414057e+00 6.83956839763462665083e-01 1.31121859262279016889e+00 6.78742130590298309301e-01 1.31629220124284729287e+00 6.76482806300098826746e-01 1.31967092437225308466e+00 6.75511044164954554958e-01 1.32202162195965833291e+00 6.75819004515759491625e-01 1.32361647847722263549e+00 6.76225697994968344418e-01 1.32419582886251374632e+00 6.76874758979901014477e-01 1.32457303321423291997e+00 6.77317321002170125155e-01 1.32397304360518508481e+00 6.77618240864105714216e-01 1.32362945980021740056e+00 6.77243121839608108736e-01 1.32250079296458000755e+00 6.78266868966201474933e-01 1.32229311586548203827e+00 6.79937844195108498369e-01 1.32225497131701574816e+00 6.83472181465790584731e-01 1.32067832281611763356e+00 6.86367877900780021250e-01 1.31791895925771540554e+00 7.00685653431360022658e-01 1.28605695029853350775e+00
20 1.00000000000000000000e+00 7.13275512197448890994e-01 1.29979486233741070578e+00 6.81647808928280474206e-01 1.31142465783325024020e+00 6.75746716690570403685e-01 1.31694431277464008012e+00 6.73702196644605177944e-01 1.32006598542594510981e+00 6.72995446744657277449e-01 1.32214723105427056637e+00 6.72040349288643312775e-01 1.32369762277872005107e+00 6.72390407511733956269e-01 1.32531447660084045204e+00 6.73131043033726284008e-01 1.32653302502265968421e+00 6.73940296186072984597e-01 1.32749127081162043851e+00 6.74751507705550479521e-01 1.32775593202025676831e+00 6.76125633944950954479e-01 1.32768089371501574192e+00 6.77751918381291229565e-01 1.32714107988648510883e+00 6.79878970856542363954e-01 1.32605058126563335463e+00 6.83117706719834516527e-01 1.32387622919067893257e+00 6.88603076443681239027e-01 1.31805937762788438761e+00 7.00252906059775970249e-01 1.28667096431730487716e+00
21 1.00000000000000000000e+00 7.13302399100748552030e-01 1.29978162034111699441e+00 6.81664949035010070411e-01 1.31140397859726332008e+00 6.75876294214721173859e-01 1.31679198825757004521e+00 6.73533310043887833984e-01 1.32010654888834610965e+00 6.72374810195354499776e-01 1.32269705601248888094e+00 6.72208991227114749378e-01 1.32411497105338971103e+00 6.72284641443307462438e-01 1.32551958482933240902e+00 6.72792717555394381712e-01 1.32654177102592663040e+00 6.73558282219732906704e-01 1.32725786063413164761e+00 6.74532874284773931173e-01 1.32765932034458455924e+00 6.75759508619721449563e-01 1.32781396245516214449e+00 6.77682100952857302545e-01 1.32732954163899941058e+00 6.79786500876681687444e-01 1.32643940344786170904e+00 6.83323722416227408161e-01 1.32404109825038229786e+00 6.88636415282014247019e-01 1.31825927688721522557e+00 7.00244512927604367825e-01 1.28667998694099106061e+00
22 1.00000000000000000000e+00 7.13412627345603511664e-01 1.29978563287248816138e+00 6.81825632422081162609e-01 1.31140570768783248923e+00 6.76097269381062071503e-01 1.31678223394876403596e+00 6.73845784200752140336e-01 1.32009271780996662038e+00 6.72848347803291058078e-01 1.32239789386843931140e+00 6.72490289814235198129e-01 1.32408450930911536503e+00 6.72575033544502987048e-01 1.32536379815307570063e+00 6.72974896873576144962e-01 1.32630714771180557854e+00 6.73650022142920135160e-01 1.32701016694637541349e+00 6.74606855492974499811e-01 1.32738908849762338171e+00 6.75886553555729796550e-01 1.32749098553998035044e+00 6.77583827358411050490e-01 1.32714715924138326741e+00 6.79900814700787670120e-01 1.32620109991721113474e+00 6.83210143610869624631e-01 1.32395376122099639460e+00 6.88595651372465367146e-01 1.31823395108040952728e+00 7.00217594890387151629e-01 1.28663280168493798783e+00
23 1.00000000000000000000e+00 7.13420451800827803979e-01 1.29978682525856426011e+00 6.81834458497299955582e-01 1.31140437376506935330e+00 6.76106647118513648387e-01 1.31679109543511607683e+00 6.73864757301675609824e-01 1.32009624537366310193e+00 6.72872593680517216974e-01 1.32238990949907120331e+00 6.72530080982654210331e-01 1.32408115158787720311e+00 6.72606336402871818336e-01 1.32536008276234329450e+00 6.73003148450960653193e-01 1.32631968746967410233e+00 6.73679400954721674388e-01 1.32699588148115510400e+00 6.74636338990220907341e-01 1.32739302182869733926e+00 6.75916553618421622751e-01 1.32747035777757615982e+00 6.77607031599130271715e-01 1.32712866791774586339e+00 6.79900543958265934918e-01 1.32613786015300050281e+00 6.83208952029993987765e-01 1.32389642136803420414e+00 6.88595656800339961379e-01 1.31816908206671890014e+00 7.00213198673554249041e-01 1.28658318539576788098e+00
24 1.00000000000000000000e+00 7.13423433942107831918e-01 1.29978718006561555498e+00 6.81838698075426852263e-01 1.31140448203775994429e+00 6.76111543881285581570e-01 1.31679103878868430932e+00 6.73870058947217298595e-01 1.32009579977423507913e+00 6.72878274900710837692e-01 1.32238927765545466464e+00 6.72535578887432206052e-01 1.32408051370367352284e+00 6.72612298799713181907e-01 1.32535869188784571904e+00 6.73008148067203770815e-01 1.32631592141337351087e+00 6.73684057784293188753e-01 1.32699179381714493786e+00 6.74641320897595875294e-01 1.32738759787171645144e+00 6.75919481194578009031e-01 1.32746430225339961950e+00 6.77610985633409157458e-01 1.32712151115916343613e+00 6.79904199662313191155e-01 1.32612970314156553009e+00 6.83208937264757953933e-01 1.32388844321676701909e+00 6.88595461754866411397e-01 1.31816146182646587448e+00 7.00212971779729298483e-01 1.28657682991463606648e+00
25 1.00000000000000000000e+00 7.13424195198744892643e-01 1.29978720611378739669e+00 6.81839582182355297135e-01 1.31140451991392747999e+00 6.76112568240669453701e-01 1.31679089461837528496e+00 6.73871211931419522578e-01 1.32009551302265148998e+00 6.72879340066997344572e-01 1.32238866974565527634e+00 6.72536465191436505506e-01 1.32407999863193404089e+00 6.72613089219759707760e-01 1.32535806954940671432e+00 6.73008832065269513301e-01 1.32631526772825170113e+00 6.73684688023857281003e-01 1.32699113393867240696e+00 6.74641863566529442764e-01 1.32738688433145579637e+00 6.75919915927524317389e-01 1.32746353780768644448e+00 6.77611236954132944987e-01 1.32712071536005682404e+00 6.79904419252344904834e-01 1.32612891322132031569e+00 6.83209060733890094497e-01 1.32388748456061655645e+00 6.88595508944382039829e-01 1.31816045815053661805e+00 7.00212761064356703500e-01 1.28657599474214801027e+00
26 1.00000000000000000000e+00 7.13424325418178795211e-01 1.29978724849661508856e+00 6.81839865771491804303e-01 1.31140446139325406172e+00 6.76112842884354359185e-01 1.31679085468533196845e+00 6.73871409656298103741e-01 1.32009546816033118688e+00 6.72879540747632121089e-01 1.32238859788483953395e+00 6.72536680051843527295e-01 1.32407991173059591539e+00 6.72613288905548278862e-01 1.32535795728639405056e+00 6.73009028605208392548e-01 1.32631513917147070281e+00 6.73684893604983181525e-01 1.32699098202940879432e+00 6.74642061194944298030e-01 1.32738671014550457805e+00 6.75920102182934745549e-01 1.32746329898565029737e+00 6.77611430517929047568e-01 1.32712038989879621553e+00 6.79904552917460103245e-01 1.32612855093010972851e+00 6.83209145093041425589e-01 1.32388717634824137903e+00 6.88595485000842777445e-01 1.31816018308778049040e+00 7.00212787360170785256e-01 1.28657562985278284273e+00
