# tag norm BO
1 1.00000000000000066613e+00 -4.44551463250243954900e-03
2 1.00000000000000066613e+00 -2.71687505753454641710e-02
3 9.99999999999996447286e-01 -4.51009355048709384417e-02
4 1.00000000000000555112e+00 -3.87131157197272215975e-02
5 1.00000000000000199840e+00 -1.32618180617401961591e-02
6 1.00000000000000310862e+00 -1.21919743600975433173e-02
7 1.00000000000000133227e+00 -2.41808595271058336673e-02
8 9.99999999999998223643e-01 -1.74541976831885763122e-02
9 9.99999999999999777955e-01 2.02968621121741655058e-03
10 1.00000000000000022204e+00 3.27155608394117045079e-02
11 9.99999999999999333866e-01 3.56263430273906916979e-02
12 9.99999999999999777955e-01 1.35839280297202951234e-03
13 9.99999999999999000799e-01 -4.79296906333598060623e-02
14 1.00000000000000333067e+00 -4.53853344779809805831e-02
15 1.00000000000000133227e+00 -3.36486794404187300467e-02
16 9.99999999999997779554e-01 -1.07389494646040299652e-02
17 9.99999999999995448086e-01 1.67938720341375587186e-02
18 9.99999999999999333866e-01 3.77543075194071431344e-02
19 1.00000000000000000000e+00 2.89560522919518233131e-02
20 9.99999999999999333866e-01 2.70116244067833194062e-03
21 9.99999999999999888978e-01 -2.09437309415101760579e-02
22 9.99999999999996669331e-01 -2.32092173383184226243e-02
23 9.99999999999998778755e-01 6.27293548645825767285e-03
24 1.00000000000000399680e+00 -7.22315114053848073006e-03
25 9.99999999999997335465e-01 -6.68023473690425306781e-02
26 1.00000000000000399680e+00 -3.99112405864463434813e-02
27 1.00000000000000244249e+00 -1.02012385504342949910e-02
28 1.00000000000000000000e+00 3.26652750523306750763e-02
29 9.99999999999999777955e-01 7.30019315435424392957e-02
30 9.99999999999998556710e-01 1.13018107285937211004e-01
31 1.00000000000000288658e+00 1.41244330379489801963e-01
32 1.00000000000000111022e+00 1.55576526366759698705e-01
33 1.00000000000000177636e+00 1.58041544001020994870e-01
34 9.99999999999996336264e-01 1.55066164767469788499e-01
35 1.00000000000000333067e+00 1.53018153098212011942e-01
36 9.99999999999990563104e-01 1.52289574849450715099e-01
37 9.99999999999996003197e-01 1.52158966403391437971e-01
38 1.00000000000000199840e+00 1.52125953130012064873e-01
