# tag norm j_0
9.600000 1.00000000000008038015e+00 -1.71147244480116533794e-02
9.600000 1.00000000000008038015e+00 -3.08362834877315486470e-02
9.600000 1.00000000000008038015e+00 -1.78667265925785655190e-02
9.600000 1.00000000000008038015e+00 -3.14521806892597358130e-02
9.600000 1.00000000000008038015e+00 -1.81108552799020550150e-02
9.600000 1.00000000000008038015e+00 -3.17532532342857110041e-02
9.600000 1.00000000000008038015e+00 -1.83145405445904810304e-02
9.600000 1.00000000000008038015e+00 -3.20487128301386731133e-02
9.600000 1.00000000000008038015e+00 -1.85138759576097197690e-02
9.600000 1.00000000000008038015e+00 -3.23453652624876714095e-02
9.600000 1.00000000000008038015e+00 -1.87126331658489970799e-02
9.600000 1.00000000000008038015e+00 -3.26407076859448960771e-02
9.600000 1.00000000000008038015e+00 -1.89136380894025790678e-02
9.600000 1.00000000000008038015e+00 -3.29346132929467030892e-02
9.600000 1.00000000000008038015e+00 -1.91080232754062898093e-02
9.600000 1.00000000000008038015e+00 -3.32197048829785124280e-02
9.600000 1.00000000000008038015e+00 -1.92638727535545326019e-02
9.600000 1.00000000000008038015e+00 -3.31874666367838466741e-02
9.600000 1.00000000000008038015e+00 -1.89239894904900847472e-02
