# tag norm j_0
22.400000 1.00000000000026090241e+00 -1.26434909666134088482e-04
22.400000 1.00000000000026090241e+00 -3.03070879288382675001e-04
22.400000 1.00000000000026090241e+00 -3.40697606910174237687e-04
22.400000 1.00000000000026090241e+00 -7.17137751395843835514e-04
22.400000 1.00000000000026090241e+00 -8.84935364546899499993e-05
22.400000 1.00000000000026090241e+00 9.85109779564936899202e-05
22.400000 1.00000000000026090241e+00 2.01857944669846879658e-04
22.400000 1.00000000000026090241e+00 -8.31696634094653995325e-05
22.400000 1.00000000000026090241e+00 6.89662415659731878716e-05
22.400000 1.00000000000026090241e+00 -9.05208203297373060299e-05
22.400000 1.00000000000026090241e+00 6.86974757912759353235e-05
22.400000 1.00000000000026090241e+00 -8.50261429591388391818e-05
22.400000 1.00000000000026090241e+00 2.04044620090287995729e-04
22.400000 1.00000000000026090241e+00 1.14927021274069250016e-04
22.400000 1.00000000000026090241e+00 -5.44704411681259822965e-05
22.400000 1.00000000000026090241e+00 -7.12268501562587745546e-04
22.400000 1.00000000000026090241e+00 -3.61060047601275313674e-04
22.400000 1.00000000000026090241e+00 -3.16514554587820381819e-04
22.400000 1.00000000000026090241e+00 -1.46766963314076128670e-04
