# tag norm j_0
0.100000 1.00000000000000199840e+00 -1.06275255410144247631e-07
0.100000 1.00000000000000199840e+00 1.03960792965728852233e-07
0.100000 1.00000000000000199840e+00 -2.54473608084800902311e-07
0.100000 1.00000000000000199840e+00 2.46734307336437403286e-07
0.100000 1.00000000000000199840e+00 -2.44040113938874128864e-07
0.100000 1.00000000000000199840e+00 2.54848330516892392501e-07
0.100000 1.00000000000000199840e+00 -1.75092340432673223685e-07
0.100000 1.00000000000000199840e+00 1.24436387026531365808e-07
0.100000 1.00000000000000199840e+00 -4.75117780662294177194e-08
