# tag norm j_0
6.800000 1.00000000000002242651e+00 1.12990498424515826981e-02
6.800000 1.00000000000002242651e+00 1.07578649179916382289e-02
6.800000 1.00000000000002242651e+00 1.09934907026226057897e-02
6.800000 1.00000000000002242651e+00 1.07075957076406720614e-02
6.800000 1.00000000000002242651e+00 1.09055994096601358706e-02
6.800000 1.00000000000002242651e+00 1.06338493965506958316e-02
6.800000 1.00000000000002242651e+00 1.08257455232538633144e-02
6.800000 1.00000000000002242651e+00 1.05363633023849070230e-02
6.800000 1.00000000000002242651e+00 1.09586703464833474381e-02
