# tag norm j_0
9.200000 1.00000000000001132427e+00 -3.96976706221420089227e-02
9.200000 1.00000000000001132427e+00 -2.39308022799974290384e-02
9.200000 1.00000000000001132427e+00 -3.56976290466691353886e-02
9.200000 1.00000000000001132427e+00 -2.58461155996025822301e-02
9.200000 1.00000000000001132427e+00 -3.45057633352842743624e-02
9.200000 1.00000000000001132427e+00 -2.65695358064380222907e-02
9.200000 1.00000000000001132427e+00 -3.39591748746989122165e-02
9.200000 1.00000000000001132427e+00 -2.68951141554023692715e-02
9.200000 1.00000000000001132427e+00 -3.37313077432273220047e-02
9.200000 1.00000000000001132427e+00 -2.69693355230342136919e-02
9.200000 1.00000000000001132427e+00 -3.36763240286317225292e-02
9.200000 1.00000000000001132427e+00 -2.68443165814305044481e-02
9.200000 1.00000000000001132427e+00 -3.38083143102365091259e-02
9.200000 1.00000000000001132427e+00 -2.64773451992932964960e-02
9.200000 1.00000000000001132427e+00 -3.42564947885162229824e-02
9.200000 1.00000000000001132427e+00 -2.57122017458729264228e-02
9.200000 1.00000000000001132427e+00 -3.53377169866301923951e-02
9.200000 1.00000000000001132427e+00 -2.37686781259056970073e-02
9.200000 1.00000000000001132427e+00 -3.91935236596578778778e-02
