# tag norm n_hub[0] n_hub[1] n_hub[2] n_hub[3] n_hub[4] n_hub[5] n_hub[6] n_hub[7] n_hub[8] n_hub[9] n_hub[10] n_hub[11] n_hub[12] n_hub[13] n_hub[14] n_hub[15] n_hub[16] n_hub[17] n_hub[18] n_hub[19]
1 1.00000000000000000000e+00 3.31995951570576777745e-02 1.97462219318626086562e+00 4.44657562655495219861e-01 1.53901596806128382333e+00 4.68875858266082704007e-02 1.96183444676591522970e+00 2.95514103426997520874e-01 1.75079888181903875477e+00 7.96391910044065509666e-01 1.29525786152140409691e+00 8.71443870823840782691e-01 1.27503375206674007813e+00 9.75360907711372959739e-01 1.18489941699797185493e+00 9.08773779604255538267e-01 1.15765041657116229956e+00 8.82889515875564079295e-01 1.26298074653010283797e+00 6.01320043151110761315e-01 7.41467442203761817332e-01
2 1.00000000000000000000e+00 2.02116182758113362150e-02 1.97581146466040702414e+00 5.04883873192729093482e-02 1.94537575882183721987e+00 2.76462553719982115363e-02 1.97001093915882719010e+00 4.33547977733018397029e-02 1.95816994034236468991e+00 5.30759135436906989702e-02 1.94681891697898468152e+00 6.65780673997156263733e-02 1.93929998973451822586e+00 1.09326482600768645770e-01 1.88317029639891053705e+00 3.13908662872399088495e-02 1.96631853759802011083e+00 3.93421174604280804443e-02 1.96864852430022252427e+00 4.04749117198563851394e-02 1.96448621425402936147e+00
3 1.00000000000000000000e+00 1.83975432281495258902e-02 1.96352049793275718059e+00 3.58046637333886350052e-02 1.96454560144745493666e+00 3.54568261169455334336e-02 1.96452597068302758920e+00 3.54832976287842299934e-02 1.96452266228292704575e+00 3.55184198940904360953e-02 1.96467560127820672911e+00 3.53774675393167953308e-02 1.96473136180030794051e+00 3.55394446019837925710e-02 1.96420633467624883295e+00 3.54087853335762203777e-02 1.96449150149140394639e+00 3.54070475676897811201e-02 1.96470671146547770647e+00 3.61370648576593636592e-02 1.98154319644064913497e+00
4 1.00000000000000000000e+00 1.84024363370328611356e-02 1.96388778409643172118e+00 3.54442911396341056585e-02 1.96453145486778746331e+00 3.54679731107037793381e-02 1.96453207607693380865e+00 3.54678092466638381075e-02 1.96453204523039071105e+00 3.54681130850285214473e-02 1.96453411421267087889e+00 3.54675239576780071404e-02 1.96453354077974129410e+00 3.54686234510054806957e-02 1.96452950372768442300e+00 3.54667741719365131603e-02 1.96453111524496581985e+00 3.54666908844293790604e-02 1.96455842576524708498e+00 3.61144943584053926267e-02 1.98159521025562934682e+00
5 1.00000000000000000000e+00 1.84024721961280404714e-02 1.96388776300841927380e+00 3.54446781550052797405e-02 1.96453115871769412593e+00 3.54678919364544917303e-02 1.96453207268549023823e+00 3.54679266632872830511e-02 1.96453207518494310513e+00 3.54679224124411149321e-02 1.96453207347427327711e+00 3.54679256567203213257e-02 1.96453207923519457268e+00 3.54679252987926962870e-02 1.96453207259237938587e+00 3.54679252028309577316e-02 1.96453211067849142779e+00 3.54688469038786993726e-02 1.96455532342095251508e+00 3.61122558034337737265e-02 1.98159750077313634442e+00
