# tag norm j_0
2.800000 1.00000000000000333067e+00 1.75073655452986519290e-04
2.800000 1.00000000000000333067e+00 1.51620435170976824296e-05
2.800000 1.00000000000000333067e+00 1.13424814955700921934e-04
2.800000 1.00000000000000333067e+00 3.44202206010904945051e-05
2.800000 1.00000000000000333067e+00 1.28332113670108797707e-04
2.800000 1.00000000000000333067e+00 3.42762600272442316822e-05
2.800000 1.00000000000000333067e+00 1.10064382697434650390e-04
2.800000 1.00000000000000333067e+00 1.47781159591343284036e-05
2.800000 1.00000000000000333067e+00 1.70440785779474583868e-04
