# tag norm BO
1 1.00000000000000288658e+00 7.93429040452691032581e-03
2 9.99999999999997113420e-01 3.62325743529546828725e-02
3 9.99999999999999777955e-01 -1.68014956906394515024e-02
4 9.99999999999990230037e-01 -3.62918957047563411900e-02
5 9.99999999999996669331e-01 -3.64266082843939034697e-02
6 1.00000000000000599520e+00 -3.29590858665866695554e-02
7 1.00000000000000177636e+00 -2.73949051420861698636e-02
8 9.99999999999999333866e-01 -2.19861009034060111977e-02
9 1.00000000000000333067e+00 -2.24237000875571156067e-02
10 1.00000000000000155431e+00 -2.62852095522216992751e-02
11 1.00000000000000843769e+00 -2.81366957086116170617e-02
12 9.99999999999995781153e-01 -2.66222199197467500331e-02
13 9.99999999999994448885e-01 -1.71391885470096698441e-02
14 9.99999999999999111822e-01 -5.92250764330660636747e-03
15 1.00000000000000177636e+00 -1.12583595276005872521e-02
16 9.99999999999996003197e-01 -1.46569931308411244980e-02
17 1.00000000000000888178e+00 -1.18529036252836318666e-02
18 9.99999999999998445688e-01 2.73639414007290689840e-04
19 1.00000000000000155431e+00 1.38354604355813716986e-03
20 1.00000000000000399680e+00 8.86809337891280094479e-03
21 1.00000000000000044409e+00 1.53555982745660086347e-02
22 9.99999999999996003197e-01 7.67082964248956816061e-04
23 9.99999999999997779554e-01 9.85735671837171048559e-03
24 1.00000000000000022204e+00 5.85331869850683802342e-03
25 1.00000000000000488498e+00 3.45578725881973743833e-03
26 1.00000000000000022204e+00 1.68547094439250137732e-03
27 9.99999999999997779554e-01 1.60030368292271617595e-03
28 9.99999999999991007194e-01 9.32317862709628451291e-04
29 9.99999999999993671729e-01 -4.67488483106285994135e-04
30 9.99999999999999888978e-01 2.04177567274162335975e-02
31 1.00000000000000710543e+00 1.74691587133705833468e-02
32 9.99999999999991673327e-01 1.57777604762519389758e-02
33 1.00000000000000355271e+00 1.83498252654425257624e-02
34 1.00000000000000688338e+00 -1.00672931103558127575e-02
35 9.99999999999998667732e-01 -8.85795610715866751916e-03
36 1.00000000000000000000e+00 -9.70128200655208557113e-03
37 9.99999999999994559907e-01 -9.94234884025075628389e-03
38 1.00000000000000532907e+00 2.19103011891420701440e-02
39 1.00000000000000555112e+00 1.76095255881224578565e-02
40 1.00000000000000111022e+00 1.58391003294676251112e-02
41 9.99999999999998001599e-01 1.47638831998201571633e-02
42 1.00000000000001065814e+00 -2.36158071038993951085e-02
43 9.99999999999998001599e-01 -1.65598714541155961344e-02
44 1.00000000000000510703e+00 -1.27365075451024382241e-02
45 9.99999999999999777955e-01 -1.11125026208486656770e-02
46 1.00000000000000066613e+00 2.95048209512081237305e-02
47 9.99999999999996891376e-01 1.83571812882695160896e-02
48 9.99999999999999444888e-01 1.55271993699480602424e-02
49 1.00000000000000266454e+00 1.43430537965117000515e-02
50 1.00000000000001265654e+00 1.28869334398640875833e-02
51 1.00000000000000066613e+00 -1.96317498702724205217e-02
52 1.00000000000001310063e+00 -1.19744481291164713704e-02
53 1.00000000000000044409e+00 -9.64604820516991139090e-03
54 9.99999999999991784350e-01 -8.88984756784967806997e-03
55 1.00000000000000133227e+00 -8.12124331433809916458e-03
56 1.00000000000000266454e+00 1.80323950829522246242e-02
57 9.99999999999996003197e-01 1.72174814456617399083e-02
58 1.00000000000001021405e+00 1.42723004828098753299e-02
59 1.00000000000000555112e+00 1.32270589075228605508e-02
60 1.00000000000001132427e+00 1.28000190164372848467e-02
61 1.00000000000000466294e+00 1.24007718872915107672e-02
62 1.00000000000000222045e+00 1.20318826359825589711e-02
63 1.00000000000000377476e+00 1.20841192072353234566e-02
64 9.99999999999992339461e-01 -1.63983152854206802596e-02
65 9.99999999999993782751e-01 -7.85622899864187734797e-03
66 1.00000000000000177636e+00 -6.85709653174274361143e-03
67 9.99999999999995670130e-01 -6.73312100841659284117e-03
68 1.00000000000000976996e+00 -6.75244109515138034999e-03
69 1.00000000000000310862e+00 -6.71270071063458442784e-03
70 1.00000000000001021405e+00 -6.72599704098661866497e-03
