# tag norm n_up_hub[0] n_up_hub[1] n_up_hub[2] n_up_hub[3] n_up_hub[4] n_up_hub[5] n_up_hub[6] n_up_hub[7] n_up_hub[8] n_up_hub[9] n_up_hub[10] n_up_hub[11] n_up_hub[12] n_up_hub[13] n_up_hub[14] n_up_hub[15] n_up_hub[16] n_up_hub[17]
1 1.00000000000000000000e+00 3.23205670927135313431e-01 1.66933852181336744858e-01 4.26039271694976962035e-01 2.61577735545528100580e-01 5.19340409995616592020e-01 5.63150473908495818876e-01 4.06691298788826427479e-01 6.60364622211044860478e-01 3.55496579152427660819e-01 3.02266476881418000300e-01 2.99745923734862862453e-01 5.75697602670684704940e-01 6.70271627778745382464e-01 7.51034151066075517100e-01 4.52304601157661745336e-01 9.73366076584070261113e-01 2.95655339354717605627e-01 9.96858286366398393952e-01
2 1.00000000000000000000e+00 2.70886795743755619259e-02 2.80024856948856426531e-01 6.61782192862288121127e-01 1.33050767012287157742e-01 5.31112297531729393718e-01 2.99192403314794408420e-01 2.08350980885141867649e-01 8.73985214849383185154e-01 8.72495670264585715392e-02 2.56522508505454494010e-01 1.27470024919630574300e-02 7.16830746426227349843e-01 9.16068124808248729352e-01 9.92929818839231481675e-01 9.96140803787218920284e-01 9.97123127990765745210e-01 1.22770711285662623147e-02 9.97523836016978582286e-01
3 1.00000000000000000000e+00 3.58893201202258255514e-03 4.63116217854547762567e-01 4.89643879185668928766e-01 3.69972344577102929541e-01 5.79764997176497431930e-01 2.78923383242739242327e-01 1.46895410979857754530e-01 7.99072407831405318035e-01 1.20198474933631754835e-01 7.13511928537361117542e-01 1.20340642969963454445e-01 4.34110894692809279327e-01 5.92683813739806275578e-01 9.04909151174774106785e-01 3.34986818754207660298e-01 7.97428338889652033039e-01 8.51709542180937972944e-01 9.99142821267036573829e-01
4 1.00000000000000000000e+00 2.02710852412936355649e-02 7.09748824569544800589e-01 2.60389678909331234724e-01 5.52053181526121705680e-01 4.13901445332980677527e-01 5.15088334201171504922e-01 3.26964396602182960638e-01 6.74786155052800928900e-01 3.09125852029173420199e-01 3.88751229104633166944e-01 5.02885807560040865027e-01 4.82611065708020703369e-01 6.76608356103708064033e-01 6.14059195574044536237e-01 4.39403242623971956871e-01 6.96690724436701214195e-01 4.30224883342715802570e-01 9.86436542081590372888e-01
5 1.00000000000000000000e+00 5.84655684604838063456e-02 7.69244615521639252265e-01 1.85025203649119673877e-01 6.87469671193117082275e-01 2.95982210816948310139e-01 6.28520762648939856909e-01 3.40731295265292111196e-01 6.16746476460897308236e-01 3.55832749528492142677e-01 4.97527448310219500005e-01 4.81836569762142952200e-01 5.46589037177088843400e-01 5.27844176681535048878e-01 6.19324316280115527711e-01 3.86992413755823327914e-01 7.50222932714040613433e-01 2.82085742677010198332e-01 9.69558809097058604820e-01
6 1.00000000000000000000e+00 1.50092023363192605956e-01 7.75892557345265410085e-01 1.38473109132766808438e-01 7.52209607723777762267e-01 2.02249098631960971817e-01 6.98155685474442955218e-01 2.88936435689582216124e-01 6.60301858224920601437e-01 3.28980250069422219816e-01 6.10322664725960972731e-01 3.83459763606532999525e-01 6.21466077012945539160e-01 3.93100279170357447267e-01 6.79870169585651384914e-01 3.27577771700614472916e-01 7.99242266174769677711e-01 2.37755677925104963455e-01 9.51914704442726855582e-01
7 1.00000000000000000000e+00 1.57078076298326818616e-01 7.71317572492426495323e-01 1.44061092550255925859e-01 7.66017754877402312630e-01 1.92135551290714717831e-01 7.27157925020981976694e-01 2.61824864941991530820e-01 6.92515395687347878884e-01 3.00937567064924749172e-01 6.65620271299813270893e-01 3.31169202075030755239e-01 6.78900090035205794337e-01 3.23277455699098881237e-01 7.62672180793778520247e-01 2.68019491600698822609e-01 8.57649441846583426852e-01 2.14049641799580053769e-01 8.85596424625815115128e-01
8 1.00000000000000000000e+00 2.14549732957284605694e-01 7.42338583195251811020e-01 1.90549507283689995019e-01 7.58219198311883113561e-01 1.72738621627083949184e-01 7.69121689764917793042e-01 2.00439493670007934378e-01 7.49372288519836726728e-01 2.32532429534498541468e-01 7.34899235342760692724e-01 2.58533633207956803357e-01 7.45349057814371329656e-01 2.58868473733068593656e-01 7.97503540972466895553e-01 2.36026480702632490694e-01 8.54981474040861999519e-01 2.19989025085459088960e-01 8.63987534235975296326e-01
9 1.00000000000000000000e+00 2.35495326416087696897e-01 7.29154392529658190725e-01 2.06179648732885745233e-01 7.54084778702919678040e-01 1.88483644900708763315e-01 7.73949350658773571610e-01 1.95990757407913884780e-01 7.77675499036881712200e-01 2.04706185586614741734e-01 7.86517975572673999629e-01 2.09984438041323717705e-01 8.10810596854711018722e-01 2.16916209644249791122e-01 8.25489678731982423621e-01 2.40408773151473492691e-01 8.07027458827464405644e-01 2.55576070706835412061e-01 7.81549214496842781230e-01
10 1.00000000000000000000e+00 2.93389031227504037957e-01 6.89822266755016677564e-01 2.83365209994733302512e-01 6.91036232503452363396e-01 2.45100502762144845104e-01 7.35848695108912598251e-01 2.35456561577450540490e-01 7.51545447237983665900e-01 2.21761644342971075972e-01 7.73567983500027422927e-01 2.14559907845510350333e-01 7.90851803252866636385e-01 2.27866065439509823953e-01 7.90477862913557371982e-01 2.63837307905708862155e-01 7.65149325736178553825e-01 2.83470402051635761431e-01 7.42893749844809048177e-01
11 1.00000000000000000000e+00 3.02022664461251144630e-01 6.81339343294667609818e-01 2.88149858823325222268e-01 6.89745910448695154216e-01 2.64501732356568708404e-01 7.19429184664312382225e-01 2.57589519558328372550e-01 7.34245434276972308574e-01 2.51807294675410409113e-01 7.46859625948561811626e-01 2.55913288092186441691e-01 7.51606639904811690833e-01 2.77852833135712351531e-01 7.38076046398164598017e-01 2.99370577146588046080e-01 7.23571049999100934791e-01 3.12457155441188572098e-01 7.05461841374156795048e-01
12 1.00000000000000000000e+00 3.02911089886454765185e-01 6.79863983113765613098e-01 2.86588733164375109030e-01 6.93105063796028653123e-01 2.76742376669162626346e-01 7.08763223824811605667e-01 2.74748364560550351055e-01 7.18129637360157779824e-01 2.71628604151350150353e-01 7.27365552850733787515e-01 2.73466930316085099495e-01 7.32816087557406681263e-01 2.86986513673136822700e-01 7.27930307230710282873e-01 3.03753211284305546513e-01 7.16756908001449644097e-01 3.17429991302932812403e-01 7.01013421256593605158e-01
13 1.00000000000000000000e+00 3.04993795370990028459e-01 6.78322048427215218425e-01 2.88674768485389088291e-01 6.92926422056871715860e-01 2.86369318009626505628e-01 7.01325890938024221199e-01 2.86833511152543685352e-01 7.07151541922450332933e-01 2.89775033915770807713e-01 7.10497596689507293632e-01 2.93962947161306498156e-01 7.12433462924744298483e-01 2.99664144920616715151e-01 7.12642768273966553672e-01 3.07596647565382408374e-01 7.10624494711768139865e-01 3.21486520232300121425e-01 6.94719087241525645737e-01
14 1.00000000000000000000e+00 3.05681187974497559079e-01 6.78313921217485016335e-01 2.89729769021323246836e-01 6.92337672091915545813e-01 2.88152452137110270947e-01 6.99940402971671482568e-01 2.89146805730087719244e-01 7.04956464062233889578e-01 2.91464881011787746434e-01 7.08502154346177581701e-01 2.94934409665866703598e-01 7.10892611976139954244e-01 2.99910137148281297215e-01 7.11990984106698920897e-01 3.07546594072338808079e-01 7.10431295256221173595e-01 3.21639363321943816398e-01 6.94428893888182741101e-01
15 1.00000000000000000000e+00 3.05729643820095153828e-01 6.78290533015170948872e-01 2.89766617551811322961e-01 6.92347866799734368293e-01 2.88239349246749099187e-01 6.99922035196327119166e-01 2.89347942892839771201e-01 7.04840077726959224336e-01 2.91710676682187308728e-01 7.08286942017847920283e-01 2.95152570300256877900e-01 7.10655382637425225845e-01 3.00070322376522868879e-01 7.11767657055008329259e-01 3.07644908946463235822e-01 7.10242654631354941586e-01 3.21702777680023754847e-01 6.94282041423230800170e-01
16 1.00000000000000000000e+00 3.05739714141904594946e-01 6.78286140160217265738e-01 2.89778544191681697306e-01 6.92341403703283675419e-01 2.88252100690230272928e-01 6.99913364199813647915e-01 2.89361228848047491446e-01 7.04829858994769797853e-01 2.91725836980041952629e-01 7.08274065366782945574e-01 2.95169637431341058686e-01 7.10639009711996116891e-01 3.00085511448594688400e-01 7.11748662336107784654e-01 3.07656984120208198963e-01 7.10222995123102496251e-01 3.21711589751190296660e-01 6.94263352800742805648e-01
