# tag norm BO
1 1.00000000000000000000e+00 -1.52195505777918318330e-02
2 1.00000000000000000000e+00 -6.97586057120015701205e-02
3 1.00000000000000000000e+00 -4.75728866374803549544e-02
4 1.00000000000000000000e+00 -6.62785485465454491522e-03
5 1.00000000000000000000e+00 -1.24134902475019721566e-03
6 1.00000000000000000000e+00 -4.60876972481761171957e-03
7 1.00000000000000000000e+00 -6.20760431064258655365e-07
8 1.00000000000000000000e+00 3.81163182556622844727e-03
9 1.00000000000000000000e+00 9.50589731604111615182e-03
10 1.00000000000000000000e+00 1.02709818913353581604e-02
11 1.00000000000000000000e+00 1.03634335671050140104e-02
12 1.00000000000000000000e+00 1.37609920238814242843e-02
13 1.00000000000000000000e+00 -8.81848063346516233829e-03
14 1.00000000000000000000e+00 -2.01968344776162246623e-02
15 1.00000000000000000000e+00 3.84941977914834074226e-02
16 1.00000000000000000000e+00 3.11209387307117557597e-02
17 1.00000000000000000000e+00 -4.15856968471876586868e-02
18 1.00000000000000000000e+00 1.37843340769419533259e-02
19 1.00000000000000000000e+00 6.36398143000987265294e-02
20 1.00000000000000000000e+00 1.05978403029776013788e-01
21 1.00000000000000000000e+00 1.66465348754059383474e-01
22 1.00000000000000000000e+00 2.11476368897093647270e-01
23 1.00000000000000000000e+00 2.29960705045806068636e-01
24 1.00000000000000000000e+00 2.32485421417489346307e-01
25 1.00000000000000000000e+00 2.29936784660377757650e-01
26 1.00000000000000000000e+00 2.28440061459377730113e-01
27 1.00000000000000000000e+00 2.28146999263300842564e-01
28 1.00000000000000000000e+00 2.28107024843546696280e-01
