# tag norm j_0
13.400000 1.00000000000001176836e+00 -7.90617007936146309888e-02
13.400000 1.00000000000001176836e+00 3.50516620571084402957e-02
13.400000 1.00000000000001176836e+00 1.18180700942645919294e-01
13.400000 1.00000000000001176836e+00 6.93368569216654823117e-02
13.400000 1.00000000000001176836e+00 -1.04987618965498477608e-01
13.400000 1.00000000000001176836e+00 6.87660222609687565853e-02
13.400000 1.00000000000001176836e+00 1.18518255219019832958e-01
13.400000 1.00000000000001176836e+00 3.49167614673342521781e-02
13.400000 1.00000000000001176836e+00 -8.11724109407304383890e-02
