# tag norm BO
1 1.00000000000000177636e+00 1.73592679790009890572e-01
2 9.99999999999998223643e-01 -1.77927791017455753930e-02
3 9.99999999999999555911e-01 3.57737890676273484480e-02
4 9.99999999999999444888e-01 3.53673783580333092602e-02
5 1.00000000000000088818e+00 3.53557733861307038614e-02
