# tag norm j_0
15.400000 1.00000000000016919799e+00 -2.64796319557731880262e-03
15.400000 1.00000000000016919799e+00 -1.93059399445590215358e-03
15.400000 1.00000000000016919799e+00 -1.91129788686252152438e-03
15.400000 1.00000000000016919799e+00 -1.88110780580366871752e-03
15.400000 1.00000000000016919799e+00 -2.27090274154713098187e-03
15.400000 1.00000000000016919799e+00 -2.06352652578953299489e-03
15.400000 1.00000000000016919799e+00 -2.30319889074518920416e-03
15.400000 1.00000000000016919799e+00 -2.06610982448673669715e-03
15.400000 1.00000000000016919799e+00 -2.31055997319461192685e-03
15.400000 1.00000000000016919799e+00 -2.08028780745981266287e-03
15.400000 1.00000000000016919799e+00 -2.31908487091728654148e-03
15.400000 1.00000000000016919799e+00 -2.08750564717744566470e-03
15.400000 1.00000000000016919799e+00 -2.33383072982311931889e-03
15.400000 1.00000000000016919799e+00 -2.10891846002684603401e-03
15.400000 1.00000000000016919799e+00 -2.32470275662731689498e-03
15.400000 1.00000000000016919799e+00 -1.95284871545683275107e-03
15.400000 1.00000000000016919799e+00 -1.96749209376160041907e-03
15.400000 1.00000000000016919799e+00 -1.97644141172799306730e-03
15.400000 1.00000000000016919799e+00 -2.70471758031103591546e-03
