# tag norm j_0
28.200000 1.00000000000003419487e+00 9.44628362006064321854e-03
28.200000 1.00000000000003419487e+00 4.27311359503962026607e-03
28.200000 1.00000000000003419487e+00 -2.22215793333109569441e-02
28.200000 1.00000000000003419487e+00 -1.59672244608227188734e-02
28.200000 1.00000000000003419487e+00 3.45981846702645978731e-02
28.200000 1.00000000000003419487e+00 -1.88778774303851003269e-02
28.200000 1.00000000000003419487e+00 -9.67297026836387081232e-05
28.200000 1.00000000000003419487e+00 2.29162095275167558561e-02
28.200000 1.00000000000003419487e+00 -1.30916055899903960302e-02
28.200000 1.00000000000003419487e+00 4.36802073499072199270e-02
28.200000 1.00000000000003419487e+00 -1.26660411085061097580e-02
28.200000 1.00000000000003419487e+00 2.26447191483252242838e-02
28.200000 1.00000000000003419487e+00 2.12410046112146010285e-04
28.200000 1.00000000000003419487e+00 -1.91177264908310058644e-02
28.200000 1.00000000000003419487e+00 3.46551456906966093285e-02
28.200000 1.00000000000003419487e+00 -1.63927195795667141054e-02
28.200000 1.00000000000003419487e+00 -2.18195830562825411614e-02
28.200000 1.00000000000003419487e+00 4.51325379404221311425e-03
28.200000 1.00000000000003419487e+00 9.50534076129202522287e-03
