# tag norm j_0
28.900000 1.00000000000003597123e+00 -9.94158890721260181736e-04
28.900000 1.00000000000003597123e+00 -1.86420070028183284053e-03
28.900000 1.00000000000003597123e+00 1.66739321641736263323e-03
28.900000 1.00000000000003597123e+00 -1.59127268219707283282e-03
28.900000 1.00000000000003597123e+00 1.66666791337793636710e-03
28.900000 1.00000000000003597123e+00 -1.55707234413916839090e-03
28.900000 1.00000000000003597123e+00 1.62454803701010978487e-03
28.900000 1.00000000000003597123e+00 -1.55705095566215936075e-03
28.900000 1.00000000000003597123e+00 1.65584090130676837155e-03
28.900000 1.00000000000003597123e+00 -1.56766215578688582720e-03
28.900000 1.00000000000003597123e+00 1.64314051782010598669e-03
28.900000 1.00000000000003597123e+00 -1.55879236184680797575e-03
28.900000 1.00000000000003597123e+00 1.60922663689860726347e-03
28.900000 1.00000000000003597123e+00 -1.55939113738955028969e-03
28.900000 1.00000000000003597123e+00 1.65253917805295428602e-03
28.900000 1.00000000000003597123e+00 -1.59995711709735866091e-03
28.900000 1.00000000000003597123e+00 1.66777368765617809224e-03
28.900000 1.00000000000003597123e+00 -1.89231527929889899522e-03
28.900000 1.00000000000003597123e+00 -1.04755443783417301687e-03
