# tag norm j_0
11.200000 1.00000000000004529710e+00 3.68151276524846179927e-02
11.200000 1.00000000000004529710e+00 2.10151231684109693343e-02
11.200000 1.00000000000004529710e+00 3.46392305892029919723e-02
11.200000 1.00000000000004529710e+00 2.04165627969881413595e-02
11.200000 1.00000000000004529710e+00 3.43273555844257061143e-02
11.200000 1.00000000000004529710e+00 2.02292104559802544961e-02
11.200000 1.00000000000004529710e+00 3.41628360594376997983e-02
11.200000 1.00000000000004529710e+00 2.04524354878620785725e-02
11.200000 1.00000000000004529710e+00 3.58413677700702981710e-02
