# tag norm j_0
18.800000 1.00000000000024424907e+00 3.26889092770148842731e-04
18.800000 1.00000000000024424907e+00 1.48348911406217718288e-04
18.800000 1.00000000000024424907e+00 -1.66316065299588366393e-04
18.800000 1.00000000000024424907e+00 -5.77079644982718474415e-04
18.800000 1.00000000000024424907e+00 -2.03718617385130229173e-06
18.800000 1.00000000000024424907e+00 -1.19243054771473296289e-04
18.800000 1.00000000000024424907e+00 1.72300828579150184031e-04
18.800000 1.00000000000024424907e+00 -1.38022864575736836775e-04
18.800000 1.00000000000024424907e+00 1.44900197206693546288e-04
18.800000 1.00000000000024424907e+00 -1.37193046279910729713e-04
18.800000 1.00000000000024424907e+00 1.44823295344952303592e-04
18.800000 1.00000000000024424907e+00 -1.33528193884144930981e-04
18.800000 1.00000000000024424907e+00 1.77584676596677907721e-04
18.800000 1.00000000000024424907e+00 -1.03103634921306074393e-04
18.800000 1.00000000000024424907e+00 1.75215035774992806408e-05
18.800000 1.00000000000024424907e+00 -5.70637106076382410666e-04
18.800000 1.00000000000024424907e+00 -1.98718935982479690244e-04
18.800000 1.00000000000024424907e+00 1.25382844894451358055e-04
18.800000 1.00000000000024424907e+00 3.11583133926533100214e-04
