# tag norm BO
1 9.99999999999999555911e-01 1.24688691585007310758e-01
2 1.00000000000000266454e+00 6.91058054938124000088e-02
3 9.99999999999999444888e-01 5.74185247470162564432e-03
4 1.00000000000000288658e+00 4.93044821024447334212e-03
5 9.99999999999997224442e-01 4.92304459810769673433e-03
