# tag norm j_0
11.300000 1.00000000000005218048e+00 5.09581883647589953257e-02
11.300000 1.00000000000005218048e+00 6.62375824256240947063e-02
11.300000 1.00000000000005218048e+00 5.05681276446324420859e-02
11.300000 1.00000000000005218048e+00 6.66023106778750179080e-02
11.300000 1.00000000000005218048e+00 5.05271162967205478278e-02
11.300000 1.00000000000005218048e+00 6.64801158868527503065e-02
11.300000 1.00000000000005218048e+00 5.03569035217041882646e-02
11.300000 1.00000000000005218048e+00 6.63406104933513263155e-02
11.300000 1.00000000000005218048e+00 5.01864561296581079830e-02
11.300000 1.00000000000005218048e+00 6.61976676056447582708e-02
11.300000 1.00000000000005218048e+00 5.00184504780612423924e-02
11.300000 1.00000000000005218048e+00 6.60559648547150851661e-02
11.300000 1.00000000000005218048e+00 4.98485022324110516045e-02
11.300000 1.00000000000005218048e+00 6.59110818722062202779e-02
11.300000 1.00000000000005218048e+00 4.96823802672158310045e-02
11.300000 1.00000000000005218048e+00 6.57488065073352501155e-02
11.300000 1.00000000000005218048e+00 4.93923849803802814118e-02
11.300000 1.00000000000005218048e+00 6.50916364796700480655e-02
11.300000 1.00000000000005218048e+00 4.93616332336617447130e-02
