# tag norm j_0
8.200000 1.00000000000003974598e+00 2.49204432217555891735e-03
8.200000 1.00000000000003974598e+00 5.11698432812333296044e-03
8.200000 1.00000000000003974598e+00 2.56553586216772596534e-03
8.200000 1.00000000000003974598e+00 5.04499490893027102006e-03
8.200000 1.00000000000003974598e+00 2.38644025250596154147e-03
8.200000 1.00000000000003974598e+00 4.88885913332548494026e-03
8.200000 1.00000000000003974598e+00 2.16019542246915618317e-03
8.200000 1.00000000000003974598e+00 4.65119309285072328464e-03
8.200000 1.00000000000003974598e+00 1.66304539506265461335e-03
