# tag norm j_0
28.200000 1.00000000000032307490e+00 2.65920150509224605725e-04
28.200000 1.00000000000032307490e+00 2.90280551748071404244e-04
28.200000 1.00000000000032307490e+00 4.88514890538869106691e-04
28.200000 1.00000000000032307490e+00 3.97639097588689278268e-04
28.200000 1.00000000000032307490e+00 3.00860286849172523741e-04
28.200000 1.00000000000032307490e+00 1.43318165184039920858e-04
28.200000 1.00000000000032307490e+00 -5.58977469788112923260e-04
28.200000 1.00000000000032307490e+00 -1.09536951003647335060e-04
28.200000 1.00000000000032307490e+00 -2.97750390675039573914e-05
28.200000 1.00000000000032307490e+00 2.59817201569998725529e-04
28.200000 1.00000000000032307490e+00 -1.57395923269268187363e-05
28.200000 1.00000000000032307490e+00 -1.03555358980356312319e-04
28.200000 1.00000000000032307490e+00 -5.53081179551007063797e-04
28.200000 1.00000000000032307490e+00 1.07294125464786095636e-04
28.200000 1.00000000000032307490e+00 3.00908971646512773349e-04
28.200000 1.00000000000032307490e+00 3.80377400579766725142e-04
28.200000 1.00000000000032307490e+00 4.97804927808362168359e-04
28.200000 1.00000000000032307490e+00 2.91159563853855460867e-04
28.200000 1.00000000000032307490e+00 2.78158070484982897046e-04
