# tag norm BO
1 9.99999999999999333866e-01 -2.75613012072776324135e-02
2 1.00000000000000133227e+00 3.68543638950170155885e-03
3 1.00000000000000421885e+00 -7.65536312171687279016e-03
4 9.99999999999998334665e-01 -1.31334557213971647033e-02
5 9.99999999999999888978e-01 -1.78732661684646611244e-02
6 1.00000000000000932587e+00 -2.58044999273626118885e-02
7 1.00000000000000599520e+00 -1.56356351140285593226e-02
8 9.99999999999993782751e-01 -4.39739926665814670481e-03
9 1.00000000000000088818e+00 5.81435134392682510807e-03
10 9.99999999999995448086e-01 1.49028057277698303823e-02
11 1.00000000000000000000e+00 1.92593779616610782934e-02
12 9.99999999999995781153e-01 7.76136803867981568683e-03
13 1.00000000000000266454e+00 1.02089527090655687175e-02
14 9.99999999999995670130e-01 1.18150746991297021099e-02
15 9.99999999999995226041e-01 1.15884225816158103334e-02
16 9.99999999999992672528e-01 1.05957059665924661906e-02
17 1.00000000000000133227e+00 9.60508490828740346679e-03
18 1.00000000000000488498e+00 -8.16338464528812424170e-03
19 9.99999999999995003996e-01 -4.56952214852987016747e-03
20 1.00000000000000177636e+00 4.18339554797403975067e-03
21 1.00000000000000088818e+00 8.35549363177020762428e-03
22 1.00000000000000044409e+00 9.82714737337989086008e-03
23 1.00000000000000399680e+00 1.02987126440414883399e-02
24 9.99999999999989674926e-01 9.93733702485577637120e-03
25 1.00000000000000310862e+00 1.07430877867089255573e-02
26 1.00000000000000355271e+00 9.46248290529978991828e-04
27 1.00000000000000222045e+00 -4.13720008694381732872e-03
28 9.99999999999994892974e-01 5.64597416543780733500e-03
29 9.99999999999999555911e-01 1.06005208649385361530e-02
30 9.99999999999996669331e-01 1.23188582200399396327e-02
31 9.99999999999999666933e-01 1.28113150670394505826e-02
32 1.00000000000000555112e+00 3.66794733340879489103e-02
33 9.99999999999999111822e-01 3.30816802054724745652e-02
34 9.99999999999994559907e-01 4.61226354906953042029e-03
35 1.00000000000000000000e+00 1.15699576931799566482e-02
36 9.99999999999995892175e-01 8.24342423331963503053e-02
37 1.00000000000000288658e+00 9.75803279807329060347e-02
38 9.99999999999996891376e-01 8.84006336072055698416e-02
39 9.99999999999999111822e-01 7.47498674856678924083e-02
40 9.99999999999995670130e-01 5.18596854443273344581e-02
41 9.99999999999997224442e-01 2.28095097263287527323e-02
42 9.99999999999996447286e-01 -3.44535683782083920756e-02
43 9.99999999999996003197e-01 -4.82321304443347961821e-02
44 1.00000000000000199840e+00 -3.67408828837304038406e-02
45 1.00000000000000199840e+00 -1.47380370658510458093e-02
46 1.00000000000000066613e+00 4.71988002502225362234e-02
47 1.00000000000000177636e+00 1.64626057714846896207e-01
48 1.00000000000000510703e+00 2.31159466345399633447e-01
49 9.99999999999999777955e-01 2.34181216267297820366e-01
50 9.99999999999988342658e-01 2.33088634532149674428e-01
51 9.99999999999999111822e-01 2.31527775521686296489e-01
52 1.00000000000000355271e+00 2.30977331725372797555e-01
53 1.00000000000000199840e+00 2.30854880541731838361e-01
54 1.00000000000000000000e+00 2.30825470437009044877e-01
55 1.00000000000000199840e+00 2.30817435507098212000e-01
