# tag norm n_down_hub[0] n_down_hub[1] n_down_hub[2] n_down_hub[3] n_down_hub[4] n_down_hub[5] n_down_hub[6] n_down_hub[7] n_down_hub[8] n_down_hub[9] n_down_hub[10] n_down_hub[11] n_down_hub[12] n_down_hub[13] n_down_hub[14] n_down_hub[15] n_down_hub[16] n_down_hub[17] n_down_hub[18] n_down_hub[19] n_down_hub[20] n_down_hub[21] n_down_hub[22] n_down_hub[23] n_down_hub[24] n_down_hub[25] n_down_hub[26] n_down_hub[27] n_down_hub[28] n_down_hub[29] n_down_hub[30] n_down_hub[31] n_down_hub[32] n_down_hub[33] n_down_hub[34] n_down_hub[35] n_down_hub[36] n_down_hub[37] n_down_hub[38] n_down_hub[39] n_down_hub[40] n_down_hub[41] n_down_hub[42] n_down_hub[43] n_down_hub[44] n_down_hub[45] n_down_hub[46] n_down_hub[47] n_down_hub[48] n_down_hub[49]
1 1.00000000000000000000e+00 9.75703630186161907645e-01 8.98814717492565140589e-01 7.25690257280818040719e-01 9.63771932050982438334e-01 5.91713722156216537229e-01 6.72651770964634798666e-01 4.51681177604728201214e-01 4.44646806117628967669e-01 2.90677198754385024415e-01 6.06555874311151210776e-01 5.19020767570215868503e-01 3.17779901841836021070e-01 6.54832399117934893518e-01 2.10656496872201864923e-01 4.89395492870333903568e-01 3.87520413440170186092e-01 9.10596942745248605355e-01 5.03518206173170113082e-01 5.64094902747820814426e-01 8.88002154962259981907e-01 7.37462437873410925349e-01 7.30858969478711095746e-01 5.42163997179070489274e-01 5.74616372572319455969e-01 3.57853932002634711473e-01 3.45876104064696987539e-01 5.13694068951699223113e-01 4.68289902351555598070e-01 5.69943801229728541635e-01 6.04825509903867297723e-01 5.34231081755815906398e-01 6.73255091439111441609e-01 5.44898806234515808988e-01 7.09894348062457658521e-01 6.95882243828004454222e-01 5.45660887447431686148e-01 5.05502634542180806498e-01 1.84147207020089270779e-01 2.42979747038946924942e-01 1.33104968958038638593e-01 2.76120266836571870428e-01 3.43261392836235856851e-01 2.72513108804313397560e-01 4.90052146327012494442e-01 2.51799963383499636471e-01 3.84038872363672068033e-01 3.09521035978612968353e-01 2.43588651051532850689e-01 7.27003896663942338757e-03 1.39367646257135796573e-01
2 1.00000000000000000000e+00 9.76277970199343037017e-01 9.54309317967773296232e-01 9.46901270245445181306e-02 9.86529651405187779645e-01 2.50997558299050849140e-01 8.79870904432957900987e-01 7.02521457052113440511e-01 1.54579978863145783841e-01 1.35022819609223909687e-01 8.66538493948027621627e-01 9.90597980310289116801e-01 9.21208821529071082701e-03 3.11700265556456336535e-03 9.80274876530961680743e-01 4.14608240940126451801e-02 9.76349694124035272225e-01 9.96568223968411714964e-01 8.38580017168463198729e-01 1.76401859424852008873e-01 9.87344941915633822482e-01 9.86183097182726231544e-01 9.95624869943693480145e-01 1.30243105326955543877e-01 3.27698425075400978645e-01 2.98802127987809473808e-01 5.45063283104708862226e-01 6.31020130559009295723e-01 9.42981386829491174950e-01 6.86314411157497826499e-03 9.92438078411410740109e-01 6.45913176118946986276e-03 8.75932390703040852920e-01 1.35347642164802078879e-01 9.73647788724742557775e-01 9.02175650139564355712e-01 9.91574489585736240649e-01 1.42062554835973742229e-01 9.80992078519119736768e-01 1.73373138407117641235e-02 9.95664765168336129975e-01 9.42830236071023342070e-02 6.91424677810834609204e-02 3.20606157652991372031e-02 8.20986483650192888639e-02 6.43196240605824587355e-01 1.20176279121827531138e-01 6.71446931537930807865e-02 5.45131726406650543582e-03 4.51270679848875323520e-05 7.04434608307906526964e-03
3 1.00000000000000000000e+00 9.39481689490176630208e-01 7.00362323144120169083e-01 3.69782761573935969679e-01 8.96406998920692976718e-01 1.25565064004822368737e-01 9.27501920010342928435e-01 7.44634764502044244061e-01 3.05197494360146703851e-01 3.27599502107612960966e-01 6.98815379327623054095e-01 8.18909107038513162102e-01 1.46990942298622057072e-01 1.70612347107928271489e-03 7.76010418089818077014e-01 3.31910883146527502241e-01 8.94785632920119144984e-01 9.61777005997380141089e-01 6.36277940724200408162e-01 3.97915144389011044002e-01 9.98321185931427601545e-01 9.93671515292630980198e-01 9.16072841074886623502e-01 1.13845709174020703891e-01 4.15653439560294379884e-01 2.59377903448347491011e-01 5.10363080251782674779e-01 9.00517211596887356961e-02 7.11436181826824109997e-01 3.63047871681748055006e-02 9.60351408987830779118e-01 6.87200254028054371286e-03 1.45388128718220766000e-01 8.33598192858465036892e-01 7.92667688073502074708e-01 2.69491341348340573969e-01 9.68468849912569762495e-01 9.67170157872578206693e-01 6.52917003674005291813e-01 4.07513409948445537445e-01 8.09346075081157079190e-01 2.91664037524138775037e-01 6.33923633265837227491e-01 2.53284534315478981892e-01 3.21461253381266076623e-01 5.46354551586620718062e-01 6.39022938115806904413e-02 1.45891721874783480278e-02 1.30297272970700036415e-02 1.25440595123366919333e-03 2.26712589016111791486e-05
4 1.00000000000000000000e+00 9.01735019015005523357e-01 6.61502924597830332942e-01 4.50035721384275555490e-01 8.57407169073093888834e-01 2.57778014474631889108e-01 8.17658451414160269977e-01 7.44150567454658906641e-01 3.47343375653496599931e-01 4.21306485445282097313e-01 5.87332514497790336705e-01 6.09605709525997685461e-01 3.43399321568143178762e-01 7.36422949037636789815e-03 8.17231861088170141727e-01 3.42070149300488124400e-01 8.43136322574272512043e-01 9.10141066962929734530e-01 6.43774750403868334381e-01 4.41060987994637665466e-01 9.95974258511162946483e-01 9.75266580039921060497e-01 8.41807704787778665612e-01 1.93470269789755455747e-01 4.76065652477045908597e-01 1.66402105855217224972e-01 5.34862625290540405487e-01 1.43125952220088004108e-01 6.58431177446427984279e-01 6.65268562257863155240e-02 9.02225911780991651767e-01 4.45270176782512142055e-02 2.89131504458551624737e-01 6.87831580726923630387e-01 7.88794314440033228486e-01 2.96853047703265704449e-01 9.41947031758410324720e-01 9.02281659886879694454e-01 5.68958342729752875044e-01 5.13759486482217253567e-01 6.44724555426530843150e-01 3.62674771622108871316e-01 5.79665983459148548285e-01 3.78129056091729698341e-01 3.34993376402162257310e-01 4.38366350930906645278e-01 1.40944288088675678816e-01 1.96821785341047099382e-02 7.24687049538656202774e-02 3.23673492148070438001e-02 3.70566306769198709758e-03
5 1.00000000000000000000e+00 8.58212366238779722494e-01 6.40410275386610550186e-01 5.04519311542212300914e-01 8.38197006604882610681e-01 3.35738549049516388223e-01 7.51224935200646926070e-01 7.10831002244799337042e-01 3.99779629827030691391e-01 4.38528535668526842084e-01 5.64854114158640396859e-01 4.48924315006459573318e-01 5.03917658372976196013e-01 1.92334532552661148508e-02 8.34736732622723298647e-01 3.36052214440996976919e-01 8.22808018458270673534e-01 8.50740356916489859351e-01 6.62710624964612748933e-01 4.89594835864652300206e-01 9.89153558970872870404e-01 9.21213868835107363431e-01 7.17122174642627174812e-01 3.29862105960552765005e-01 5.02847783174302120912e-01 7.86448506968665944639e-02 6.12469619386624475332e-01 1.68817551030918139299e-01 6.52830859597194779198e-01 9.17885108473869837376e-02 8.45132447894604843519e-01 8.19247366658683168206e-02 4.57723779346433878867e-01 5.21814254374888042420e-01 8.11412592051054426534e-01 3.17892314381179597049e-01 9.03686312628645072031e-01 8.19860575807439539986e-01 5.51755793274712136309e-01 5.70263220800487413698e-01 5.85028837464609985375e-01 4.21149101533978886813e-01 5.03668756775444426133e-01 4.15180466178015905587e-01 2.92093448235644259636e-01 3.01645280803672810599e-01 1.97257710316068035628e-01 4.96466705723400542061e-02 1.81705603586914399283e-01 7.80510984911074318093e-02 1.73421798501581549135e-02
6 1.00000000000000000000e+00 7.96546964963919967850e-01 6.15629855235797385227e-01 5.39874457817235309243e-01 7.75105765173660588019e-01 4.14287587390166189838e-01 6.93370855988876710896e-01 6.60469254347516465664e-01 4.88525723473460571356e-01 4.06138066872455294476e-01 6.29695281361955516708e-01 2.96352266189322366419e-01 6.62879683152889698228e-01 4.84533244554966879836e-02 8.37588808104211657302e-01 3.36358951243793002917e-01 8.04959874878967696077e-01 8.03884401834620954119e-01 6.81726241480434924647e-01 5.30771298361050525294e-01 9.77327239967594407766e-01 7.80636458699906388148e-01 6.19084524500728594631e-01 4.67458381899608532706e-01 4.56645145108126593314e-01 2.70119959122984004685e-02 7.35756408986104837311e-01 1.69355531795893937685e-01 7.11754821260170977837e-01 1.15147925169980985816e-01 8.11259074264957247280e-01 1.13204252257497611778e-01 6.13787046206122233194e-01 3.74634836867351439516e-01 8.35797729438179537453e-01 3.14282249591374629460e-01 8.73939051984017334362e-01 7.08146805275474799934e-01 5.46632245363871449584e-01 6.10720066824022467245e-01 5.21567499916375076907e-01 4.82742032943517862531e-01 4.13459165290137486970e-01 4.38554585763003657028e-01 3.32562796003527005873e-01 1.92789534714205929022e-01 2.30987710914663163519e-01 9.80548002608821467341e-02 2.52123367139970244732e-01 1.23226110566232116561e-01 2.87319427886073702760e-02
7 1.00000000000000000000e+00 7.33268703656115294898e-01 5.82454049100575854681e-01 5.64163728033769573678e-01 6.64351385050103826480e-01 4.95317194400541227495e-01 5.98062934657459410737e-01 6.16555018556246392514e-01 5.95771982221654616829e-01 3.65530733642710714548e-01 7.45125357857502002012e-01 2.00494674989785015562e-01 7.82632588151275454535e-01 1.33506412763314152858e-01 8.19598525390445087346e-01 3.82267329305417180585e-01 7.48649011869774172467e-01 7.69596686018274578345e-01 6.84315691356705668724e-01 5.49936122387810422119e-01 9.63657170987934907913e-01 5.89514073984966913144e-01 5.89803529486406574733e-01 5.00236012341992219987e-01 4.57771468360808064801e-01 3.15022464602567331404e-02 8.34204403714926212565e-01 1.52952909162151123867e-01 7.93755136189890686538e-01 1.29733237662578715366e-01 8.06835762787080246206e-01 1.35288272070089171661e-01 7.32049536302651238096e-01 2.71462204772051352020e-01 8.58011871808145087925e-01 2.98230712470166192674e-01 8.38846465529268114913e-01 5.82488363713735690652e-01 5.63290339050278476840e-01 6.04005710597596556788e-01 4.72243640649123441744e-01 5.12473842919140332164e-01 4.06463552440960551593e-01 3.94828940887212542776e-01 4.54819318770450731204e-01 1.04659657877202466603e-01 1.88559914151303520402e-01 1.31797022759182508311e-01 3.59972961987422013230e-01 1.66504875668784496634e-01 4.24387150266539309174e-02
8 1.00000000000000000000e+00 5.94677714733524376278e-01 5.49489888949290294917e-01 6.02646570057356889549e-01 5.52827555817845150976e-01 6.01701817509075587154e-01 5.57945651544885401485e-01 5.61469696964990605537e-01 6.78517252594178388314e-01 3.70487745242845445404e-01 7.98507452850243937270e-01 2.49130130011636863330e-01 7.96248300361366179168e-01 2.71126299792617653228e-01 7.56629704053779494899e-01 4.56457606752189104515e-01 6.71454466420876139310e-01 7.52484258916615633694e-01 6.86413563794853409661e-01 5.27539182011982576981e-01 9.47067760283757942297e-01 4.40831942929855835622e-01 6.48618729942437743929e-01 4.51672161687624529325e-01 5.19452797618321748807e-01 7.81452478459966765056e-02 8.34455374853953046888e-01 1.53645840796822558127e-01 8.18800558661704203089e-01 1.45267296976092863403e-01 8.05386432092012549688e-01 1.52128278540528377727e-01 7.81852619184142172415e-01 2.31054042358761646536e-01 8.57414603621411863799e-01 2.83592420876505657557e-01 8.21229061586993047683e-01 4.83791692113556159871e-01 5.97240089608990998293e-01 5.36906537686924645314e-01 4.97480072677979445750e-01 4.73469508481474954387e-01 4.68719789066005587674e-01 3.16041150386034808140e-01 5.73521682877220273511e-01 8.40034042956925575130e-02 1.57531091085436253385e-01 1.61826536349781613389e-01 3.96728118561060716374e-01 1.95033763853516201037e-01 5.13365347191965110119e-02
9 1.00000000000000000000e+00 5.84016873385129309248e-01 5.53226732390470488099e-01 6.04262706576470853825e-01 5.51670408342510909527e-01 5.99312612497317376281e-01 5.80846825001572142355e-01 5.30181089984690934180e-01 6.86875840553380356823e-01 3.81978219613493541473e-01 7.73090686003440774599e-01 2.99422161658984276045e-01 7.69154338372114665390e-01 3.30366171096105387672e-01 7.24601732074614868218e-01 4.99469228410762078330e-01 6.37570451191197373753e-01 7.33608298042962236885e-01 6.83344057573306407072e-01 5.12580347260367386042e-01 9.28107529786780904857e-01 3.45456087323727512040e-01 7.12894836141785392947e-01 3.71153167399584649200e-01 6.08445406869386862247e-01 1.29364262584556105606e-01 8.12193086238268802113e-01 1.64150320248467179729e-01 8.14403111611815999638e-01 1.67450776045252297530e-01 8.02295436913891157893e-01 1.72686785848078339090e-01 8.10357994524659508428e-01 2.17031356306558953495e-01 8.35240550374581447457e-01 2.75652664083222809221e-01 7.92590925696640913323e-01 3.98334094098222679659e-01 6.41125548806624756537e-01 4.39871922850686325468e-01 5.61335576983962969422e-01 3.81297661638700491338e-01 5.66383129672423657475e-01 2.23300521198343177032e-01 5.98484154736247386808e-01 1.45147173315808092342e-01 1.39343582213464683983e-01 1.47715269513525232492e-01 4.60551813371814333653e-01 2.32472413148167439401e-01 6.95840604258955025552e-02
10 1.00000000000000000000e+00 5.95315396457169798694e-01 5.66574407542529190351e-01 6.10384067879411573720e-01 5.64943518069553674010e-01 5.72254205536088966788e-01 6.14449624480840173035e-01 4.91027010424109400244e-01 6.92938212551067911349e-01 3.90562113906528451945e-01 7.46526182608255206574e-01 3.44584284053890965716e-01 7.38667837193334175794e-01 3.88285859553150036749e-01 6.85863551772409096863e-01 5.39329080121844550710e-01 6.08969041647094755376e-01 7.03331925184631945314e-01 6.77900597928837722606e-01 4.97460084000565183615e-01 8.93163149997483807319e-01 2.92738358133338705258e-01 7.78516326814735371009e-01 3.14875672981726417721e-01 6.75237824896462224267e-01 1.64337028878653534925e-01 7.93333806934917951104e-01 1.80687438377749393092e-01 8.03706994488573300828e-01 1.86541564233856010935e-01 7.96857258056082318198e-01 1.91710624891572922746e-01 8.06021052108892077648e-01 2.23301522081245401585e-01 8.06576237244043592334e-01 2.65769146978719394969e-01 7.69334853639095150868e-01 3.25022382179510793687e-01 6.79875152636429280761e-01 3.40330143435906062876e-01 6.33657537778118506999e-01 2.91415090624156047916e-01 6.38708049266286992385e-01 2.12545379870157258306e-01 5.44999873540242485426e-01 2.29846623038034630904e-01 1.87737643973287238186e-01 1.37530353098422791769e-01 4.54549564521792792693e-01 2.59107719428260385719e-01 9.25986249608824057988e-02
11 1.00000000000000000000e+00 6.02011594587432030679e-01 5.66605500214738655451e-01 6.09938675198257285182e-01 5.74968396058359587641e-01 5.63006486803586558842e-01 6.27160513631151661507e-01 4.78221825415101609025e-01 6.95540308943950580378e-01 3.92440795302907596831e-01 7.37849482259159139552e-01 3.61328437132583946134e-01 7.27018076915442845731e-01 4.11533211000675358537e-01 6.71097502349975894020e-01 5.54061606732023093080e-01 6.03079866749813064963e-01 6.79836336321558931672e-01 6.69373251244037459351e-01 4.95830816385551376158e-01 8.61640196305223482476e-01 2.73958524477362463934e-01 8.09975882772813848831e-01 2.68319588992958379947e-01 7.31637948520244218997e-01 1.88900556213253301152e-01 7.84212955956184787354e-01 2.04726970067354407945e-01 7.86865386286511481195e-01 2.12719685806532304850e-01 7.81011005833774474283e-01 2.16367226589283978555e-01 7.84132073600738443986e-01 2.37302959067165253337e-01 7.72049507104661913992e-01 2.56342396331050659253e-01 7.38357378837039335373e-01 2.75359155330201887946e-01 6.85200606534127287794e-01 2.72886650306685962786e-01 6.48775864419993131271e-01 2.69761355295734417403e-01 5.86707259830190563932e-01 3.04902207608057029820e-01 3.50787864029328544380e-01 3.22235271538455547713e-01 3.41727263778084378032e-01 1.12280937118640442018e-01 4.79958384323294462437e-01 2.90894577019154110253e-01 1.29099676859591394606e-01
12 1.00000000000000000000e+00 6.22304674333509777462e-01 5.67306925941063022734e-01 6.11905482571649561585e-01 5.93066979029695628967e-01 5.39755280670672576981e-01 6.49545976335441865857e-01 4.53784588995886528640e-01 7.03213981861148362817e-01 3.93099807440592030616e-01 7.27922219716428009484e-01 3.82593913815282460344e-01 7.08860641214487552375e-01 4.43470556071346333482e-01 6.52195187420583355475e-01 5.62051814210536848648e-01 6.02705274773721266790e-01 6.32744400930003281225e-01 6.54474361680162930455e-01 5.01115249773517512644e-01 8.06867094410279039884e-01 2.98064340011960193788e-01 8.27951334075872291685e-01 2.51967142639194563447e-01 7.66030924351449482579e-01 2.10791040280777969285e-01 7.78253555381201223007e-01 2.27828570851246026141e-01 7.69471615276958620377e-01 2.39814202550360594524e-01 7.53231223169180008625e-01 2.45350206754255312225e-01 7.43143956151296913859e-01 2.57983277716729353379e-01 7.21434667004022700532e-01 2.66965655069478335903e-01 6.93817972959167361680e-01 2.73519783346602818330e-01 6.61217605770298200163e-01 2.81645052948086671574e-01 6.16838688830119941109e-01 3.13779975196675497973e-01 5.17303180519606664589e-01 3.79032996470728744676e-01 3.21882895856626827236e-01 3.37103896559339144545e-01 4.01559963499554639643e-01 1.13079963549257603295e-01 4.79259577862891583688e-01 3.03603309565764867273e-01 1.39089014585442399818e-01
13 1.00000000000000000000e+00 6.28071247100244201000e-01 5.67573647545445370000e-01 6.11855325309972664094e-01 5.96893483544205127878e-01 5.35270747860006945729e-01 6.53910399036127021333e-01 4.50044111074331398825e-01 7.01995527357261783763e-01 3.98160351794642208834e-01 7.19806026579034252677e-01 4.01631685960557427428e-01 6.98695025121656265732e-01 4.63600465141417672488e-01 6.49206970665375915353e-01 5.49002031291041636685e-01 6.11854827276583801421e-01 5.83394150207250827833e-01 6.38334647518118525333e-01 5.02601382141577679441e-01 7.25761049660186285948e-01 3.59254040807725438800e-01 7.91520122935281511545e-01 2.67824151874535565376e-01 7.89496752907008714217e-01 2.46599056096422575290e-01 7.79691085405988859591e-01 2.50689491299411648662e-01 7.56901373926669562842e-01 2.58655935436912953751e-01 7.30978676962189655164e-01 2.64341143369507480809e-01 7.06753539853708256935e-01 2.69799130655270558155e-01 6.82389962307817898868e-01 2.76394254142175666011e-01 6.55433518865985442758e-01 2.90431949455702220764e-01 6.09791863392123545395e-01 3.23902086508151887401e-01 5.22177568610790454606e-01 3.82368013911942694616e-01 3.96235131027995179931e-01 3.99949951675185599864e-01 3.76315749130044674420e-01 2.34936905200680196115e-01 5.62446831673090952286e-01 1.46408826935396668700e-01 4.49835203540233818931e-01 3.49875105501969652089e-01 1.80939474405128891688e-01
14 1.00000000000000000000e+00 6.12104006219703844494e-01 5.69582737079502576805e-01 6.01395668931449689509e-01 5.92852593581871478712e-01 5.37187591771722705580e-01 6.40680024773411682659e-01 4.63613693733866127911e-01 6.85587929350841118747e-01 4.11350525465808081194e-01 7.07356674096354165471e-01 4.02404445560536117021e-01 6.99677927942523703031e-01 4.37833653354928298285e-01 6.69747371178782024970e-01 5.02031128184255992508e-01 6.36209405811931971719e-01 5.52846214095272237010e-01 6.35203994739546251580e-01 5.32971229992472261827e-01 6.88516916212465024394e-01 4.28912055564207028713e-01 7.62251553082788357862e-01 3.11346872747609082488e-01 7.89495462943779036102e-01 2.61256990854203841046e-01 7.80729746992860462740e-01 2.55022411313107155717e-01 7.50812841994333290963e-01 2.60242242848692906243e-01 7.17011006199901101965e-01 2.66863418361360904552e-01 6.84992157503325760359e-01 2.75956962391966154069e-01 6.51784010407540304044e-01 2.92381694924610913144e-01 6.05397310903961760609e-01 3.24786695423012250483e-01 5.35594921856169303709e-01 3.71436175964484194267e-01 4.49825634154966680356e-01 4.06311270204299468389e-01 4.01656321468211952030e-01 3.51416821861152139927e-01 4.99241428922200913831e-01 1.89539018783159929349e-01 6.19231607607366729695e-01 1.74394807048429190122e-01 4.31771232397457127572e-01 3.67743331620242086544e-01 2.03440261577530312476e-01
15 1.00000000000000000000e+00 5.41948890530877802618e-01 5.77681892436183841433e-01 5.60340846179238072367e-01 5.69915675900191209813e-01 5.49643235114035566546e-01 5.91130413177337499242e-01 5.06450266765257284263e-01 6.41125364789015939060e-01 4.34358799050800548081e-01 7.17309597992351166695e-01 3.49445505599089323301e-01 7.81260787350778973526e-01 3.04297808922274981569e-01 7.96189134534708298219e-01 3.37866129334803644291e-01 7.51579913057516701969e-01 4.51516572505756663691e-01 6.61824609579457989739e-01 5.62270378558089922727e-01 5.83979124928932780136e-01 5.67129503625275144252e-01 5.61383058912838794896e-01 5.04649545038376001749e-01 5.73045435249315282533e-01 4.48909789744112108778e-01 5.93645723766187294324e-01 4.18883346711635407011e-01 5.93889222928202675789e-01 4.02127573774589186506e-01 5.80228351067137548824e-01 4.06245120814371474260e-01 5.58523192728829553921e-01 4.11914941008097057473e-01 5.28446723575499488490e-01 4.22214009382263499859e-01 4.90069788771795300519e-01 4.30600848773676103676e-01 4.61973239253708312102e-01 4.19737203770435329808e-01 4.67882445708290961583e-01 3.55637197214092981579e-01 5.47832324016930494182e-01 2.29503404635458096994e-01 6.53667664825474781232e-01 1.68121152605635759691e-01 5.85375198889124481738e-01 2.62250860617708303479e-01 3.90456344852864511985e-01 4.17361170623014809955e-01 2.78160670808180354729e-01
16 1.00000000000000000000e+00 5.42310326751338944717e-01 5.79999824891805570992e-01 5.58740688101976412661e-01 5.77681966774634014783e-01 5.40434181054375128994e-01 6.05713271483950266294e-01 4.89981281821720904279e-01 6.56147152408285916358e-01 4.19742426041131766468e-01 7.16144746786407493389e-01 3.48954763998100048195e-01 7.65422995932618088766e-01 3.10012114180070186276e-01 7.88436217829436403193e-01 3.16670946247069984292e-01 7.60799880077776324860e-01 3.78094418697274503582e-01 6.98824964506143730958e-01 4.65423222728490515454e-01 6.23799909158669674270e-01 5.20966039782626455512e-01 5.70862582781489380501e-01 5.21953421006416284911e-01 5.49134441608152168435e-01 4.92036871207550130514e-01 5.46637014389433018025e-01 4.66656935073944179049e-01 5.44168664339343521874e-01 4.50301431872635493647e-01 5.31094274436560653818e-01 4.42310121757513663443e-01 5.17484195458870588347e-01 4.36101085972394497681e-01 5.06207785474318550101e-01 4.28398106492759001007e-01 5.01673013765510988904e-01 4.03192622792573951429e-01 5.22731898401220473893e-01 3.53356901010681179187e-01 5.77663804921341950127e-01 2.77226498690042844064e-01 6.53236014461531011577e-01 1.96705233869739287700e-01 6.83902718052966873685e-01 1.92146164170483246814e-01 5.63306266055744964127e-01 3.03665732991724723888e-01 3.80706983044995228571e-01 4.21074028494487606622e-01 3.01763848151653357732e-01
17 1.00000000000000000000e+00 5.39244448613950044802e-01 5.80715265138200487094e-01 5.55535394858507447502e-01 5.77862206618524165691e-01 5.39410743662765423956e-01 6.04088613659130135858e-01 4.90991553548666581630e-01 6.50789134990492290633e-01 4.24873176821774667378e-01 7.04704113981894475494e-01 3.59894250381394387173e-01 7.51436649557273628197e-01 3.14897353644646604831e-01 7.76681254242111540620e-01 3.02174570445960855025e-01 7.67859359121398354908e-01 3.24938100865336865208e-01 7.30594169921318759009e-01 3.71966668315164450398e-01 6.77035606143830737125e-01 4.18445762244839203348e-01 6.23351244502845625028e-01 4.42441706430075465395e-01 5.84621917977377392184e-01 4.46657337441910939901e-01 5.64506467008193735246e-01 4.39095072404630692997e-01 5.59539521001608197714e-01 4.28741911457794055984e-01 5.57508015059944517233e-01 4.13116224157234701586e-01 5.64147398360782648119e-01 3.88177121232703203901e-01 5.81797704630481193888e-01 3.52639454416335040854e-01 6.12404863945736122055e-01 3.02119521083624331670e-01 6.56268273793914058700e-01 2.42778611826336615520e-01 7.00926699533771069284e-01 1.97866656969414800304e-01 6.99094747116462578163e-01 2.12584074105662435006e-01 6.06822290252462370752e-01 2.95490718394377294143e-01 4.77863388211018924601e-01 3.77097676212516719207e-01 3.94495784166196461484e-01 4.33645935439836038849e-01 3.80061266089624205655e-01
18 1.00000000000000000000e+00 5.02905602077774349645e-01 5.90849933800695170660e-01 5.20090326132480185173e-01 5.80866166316092447097e-01 5.22953742063585247379e-01 5.88333518711518066446e-01 5.05711013776841911138e-01 6.10785098624910038900e-01 4.68712895435574816716e-01 6.44466741598758052767e-01 4.18918127007337826040e-01 6.88282027144616948000e-01 3.70922375338171517178e-01 7.29468508058468967370e-01 3.26590444196805718136e-01 7.61433113005813178020e-01 2.94994788353087622479e-01 7.72637260628402322560e-01 2.91460161404577033917e-01 7.58666140630129604006e-01 3.08035153384155935274e-01 7.26606227909334267956e-01 3.34214350434445528482e-01 6.90070286858103787431e-01 3.56455042404725030991e-01 6.57541167889358124654e-01 3.63530268617556273636e-01 6.40498029703925664258e-01 3.59440801206043436533e-01 6.35903139939463679653e-01 3.44493584535511931932e-01 6.44872231749527347056e-01 3.17948093197941483723e-01 6.64083833365595510578e-01 2.83256037510107472333e-01 6.89635969462574549560e-01 2.44863168853298146521e-01 7.14170166187948929348e-01 2.14510216826064553652e-01 7.20074498480685720736e-01 2.11256021209881572620e-01 6.77439093817666537767e-01 2.52484183499737169232e-01 5.78977332497771057795e-01 3.28517638100043085636e-01 4.65194588816159049216e-01 4.01966929686776885955e-01 3.97020602882156681268e-01 4.30424041906831145177e-01 3.97469314761210279485e-01
19 1.00000000000000000000e+00 4.97536546854399297501e-01 5.92542145691016153286e-01 5.15057141382794680950e-01 5.81038249577777277111e-01 5.19834313683046778110e-01 5.85776592395270134794e-01 5.04551667525237390599e-01 6.04750593014513837531e-01 4.72518399541068667702e-01 6.34634751357012638628e-01 4.29853473799360452645e-01 6.72771662914367296615e-01 3.83005223212864009952e-01 7.10085550047384828076e-01 3.38641269854633109038e-01 7.41153321935839937140e-01 3.03863734796552042994e-01 7.59963923517803285890e-01 2.84896871902495962825e-01 7.63509362824517312518e-01 2.79698587182539204488e-01 7.53935876015246253523e-01 2.83401378948838267302e-01 7.38379693649035995229e-01 2.86413201182852461546e-01 7.24720111173027814466e-01 2.83912009722182778759e-01 7.17010490631874830569e-01 2.74003340254152960576e-01 7.17602022693738961223e-01 2.58667358242430145410e-01 7.24187612447836692731e-01 2.38985864911285039724e-01 7.32209192867148694894e-01 2.23519669637271656271e-01 7.31947479453420757345e-01 2.20900282710229156624e-01 7.05178704098274655721e-01 2.45931038888525299591e-01 6.48194607590511284734e-01 2.93819043088036024880e-01 5.67453608557765054599e-01 3.51905627237840967769e-01 4.93829706209569951891e-01 3.95350951681399775950e-01 4.59086765490478165841e-01 4.18471761545016085471e-01 4.50536328975750854919e-01 4.19259319487496062706e-01 4.65503569598464894685e-01
20 1.00000000000000000000e+00 4.48977410029371082345e-01 6.09705575141889943858e-01 4.59927244325237349898e-01 5.97372433523930990162e-01 4.74499124366067503988e-01 5.89493638393005503495e-01 4.84495853777169249721e-01 5.86908310700243740499e-01 4.83032378408125184777e-01 5.92111416658723688222e-01 4.74690781126424932168e-01 5.99430084112854810741e-01 4.59327954892684131583e-01 6.16019076068143545122e-01 4.37119186040308804753e-01 6.36606881107078859117e-01 4.10764060624612015182e-01 6.59221914416366572276e-01 3.78372258248488912979e-01 6.95973829796285858862e-01 3.35102499535965714372e-01 7.20395395752999601058e-01 3.01829777893376560716e-01 7.44131968772303364901e-01 2.75826819258154054548e-01 7.52117713667115106446e-01 2.60081436231810514403e-01 7.53555199205045989075e-01 2.51711448283092054101e-01 7.48980769426866532790e-01 2.47865786146956840197e-01 7.37990509025188257120e-01 2.50198534397383598460e-01 7.23090432025198848187e-01 2.56614404526227302128e-01 6.99075749782735345050e-01 2.73731962882686030714e-01 6.58754686644810183438e-01 3.04197319125210641211e-01 6.03463033686129746158e-01 3.43708300193263482925e-01 5.40142151122810054709e-01 3.83578387785538599264e-01 4.87262423731478766520e-01 4.12954566317370763695e-01 4.59670098279734651303e-01 4.25603096185504181648e-01 4.59712933764542752701e-01 4.15321715227847054752e-01 4.79281469365691104034e-01
21 1.00000000000000000000e+00 4.45721074999928246196e-01 6.10969430782760225540e-01 4.56070438777916753459e-01 5.98681298723213739521e-01 4.70238525776495885911e-01 5.90444051318016804863e-01 4.78909925441349415554e-01 5.86751774368786782610e-01 4.80579319592939424588e-01 5.88272749381563708759e-01 4.75514200355928340347e-01 5.93961863291845526547e-01 4.63685664460337210180e-01 6.05246643674459461337e-01 4.46386731920822288355e-01 6.20134024732772459743e-01 4.22818816804772013018e-01 6.38103361815997249806e-01 3.96530675420232570083e-01 6.59434107379148315431e-01 3.66653639063091840722e-01 6.78268043562131661695e-01 3.39469687381233620194e-01 6.92032302897210294113e-01 3.18496443239033200090e-01 6.99755675389667874953e-01 3.04296346176547993778e-01 6.99335106895316749309e-01 2.99540405522083386103e-01 6.91499033947821639678e-01 3.02061565380963570338e-01 6.75926322301794391123e-01 3.10358432029052278001e-01 6.49759425469135565301e-01 3.28665131326706383419e-01 6.14574594291373399457e-01 3.52150909744942508528e-01 5.72711270995445276277e-01 3.78244648763092994326e-01 5.35397303162256532616e-01 4.00471214195499969346e-01 5.05371838885492974391e-01 4.15527937761351495727e-01 4.88311111309356227217e-01 4.17351889307312484689e-01 4.90398694456849248979e-01 4.09552449125013651177e-01 5.10910887404417479729e-01 4.01646930353017905801e-01 5.22806080643524184737e-01
22 1.00000000000000000000e+00 4.17512999930791439684e-01 6.22663697062016741057e-01 4.19954250140894158605e-01 6.15086740843310608717e-01 4.32254291345251284717e-01 6.06309338088623195340e-01 4.40682154244493695661e-01 6.02592923692243820355e-01 4.48096772585244884635e-01 5.97709057853784142544e-01 4.56436141661120953206e-01 5.94937148822912598156e-01 4.59731917703453230040e-01 5.93027168643810331794e-01 4.59130384858710660634e-01 5.95204528364318474765e-01 4.53382630355970372982e-01 5.99444774302429705948e-01 4.46079562889522440727e-01 6.05284902109528455405e-01 4.35685395876049430530e-01 6.14679006319148624193e-01 4.19338877994349989997e-01 6.25828622773267007062e-01 3.97336346719616373413e-01 6.34986750447722569923e-01 3.77900138976248356482e-01 6.37704289045018968274e-01 3.66160592381190141964e-01 6.33871680893825839576e-01 3.61439896395417903374e-01 6.22390432748461286394e-01 3.64492803792702935173e-01 6.02957207485837143324e-01 3.74087800443294316022e-01 5.78110516881203850836e-01 3.87933377759074271562e-01 5.50040370242929288480e-01 4.02051298287177449886e-01 5.25469355620734934753e-01 4.13496376662192743900e-01 5.07724777811216720913e-01 4.20232878660234843160e-01 4.99179741420821443398e-01 4.19071871003619644824e-01 5.02669205271907726384e-01 4.10574544600364077507e-01 5.18613757665595809243e-01 3.97435692894707481848e-01 5.33015007427646958504e-01
23 1.00000000000000000000e+00 4.13666673334736667567e-01 6.24322970774297214547e-01 4.15288274945652957637e-01 6.16942673521947426707e-01 4.25790663641800515293e-01 6.09643735028420397093e-01 4.35184626540556451779e-01 6.03594343485268969296e-01 4.42806426158249777369e-01 5.98794419862737958837e-01 4.48871202903469379564e-01 5.95256378478638881191e-01 4.52316159783780036285e-01 5.92812150464845699638e-01 4.52890834364171768200e-01 5.92075567616729081521e-01 4.50653991907966178232e-01 5.92331042803752372272e-01 4.46917031120027563595e-01 5.92915592787996770241e-01 4.40965543120765579577e-01 5.93784228271832303925e-01 4.31810337780691777532e-01 5.93355003517587742401e-01 4.22005165494921175018e-01 5.90732068507415997161e-01 4.13528660162069738870e-01 5.83293690067996473125e-01 4.09700820483955896467e-01 5.72713787076151614741e-01 4.08908164940370966178e-01 5.60499812390262808215e-01 4.11269473994840983888e-01 5.46706498250893346835e-01 4.14070357319396731288e-01 5.36583591458319464351e-01 4.14189295145217739602e-01 5.31831032801773906371e-01 4.11775082330459951674e-01 5.33443010184614374580e-01 4.08932872426135129995e-01 5.38810636593520686510e-01 4.00888446111337171107e-01 5.54387419016832083685e-01 3.98201416682299913496e-01 5.56432971870409187609e-01 3.81569319300255893612e-01 5.78602293602690109786e-01 3.78543733454333730659e-01 5.79390508117633928897e-01
24 1.00000000000000000000e+00 3.75420574820788277570e-01 6.41291073016849844102e-01 3.63815567464857436697e-01 6.43624710573396985325e-01 3.64379732813277124048e-01 6.44059779597959458641e-01 3.69353838631207798127e-01 6.40282886256009264869e-01 3.74930461263990821852e-01 6.35250837102524390509e-01 3.80513485366686221578e-01 6.31906816612658239762e-01 3.85318807143777641855e-01 6.27768248752025193049e-01 3.90074482369572483886e-01 6.21409714365037113559e-01 3.97246561608591730597e-01 6.18305630396580374608e-01 4.06789485242816162280e-01 6.10047356151985908923e-01 4.21495133387529474778e-01 5.99667333168854455039e-01 4.35311797679350853674e-01 5.89218224311446880925e-01 4.42083549594303404362e-01 5.80519965222826006546e-01 4.43138966919140731004e-01 5.72607676912827878724e-01 4.40636335116327937378e-01 5.67253245690427010395e-01 4.34499543899146634107e-01 5.63632159874692617585e-01 4.27927506479489239144e-01 5.62382161765326737957e-01 4.20518143681194667138e-01 5.62462448665889791499e-01 4.13225468769525705603e-01 5.64266689587153646990e-01 4.05599282980259712161e-01 5.68241531052416481984e-01 3.98240716011243334194e-01 5.74257853138742557775e-01 3.90350668774159748065e-01 5.82943445500319401553e-01 3.84378308491818421189e-01 5.89537816637239475703e-01 3.76264129323320151155e-01 5.99153027771432644677e-01 3.71097753455969958658e-01 5.97299066587120730532e-01
25 1.00000000000000000000e+00 3.72056372020149239699e-01 6.42963334118291651720e-01 3.59922465928410317826e-01 6.45143462065816741813e-01 3.60197545215664827190e-01 6.44738596953124076805e-01 3.62377972637041634307e-01 6.43013723268399783883e-01 3.65153332999974378215e-01 6.40577176233685596785e-01 3.68227569821114097959e-01 6.37923740884810408502e-01 3.71599202776241976931e-01 6.34957867929116348549e-01 3.75055218144572655170e-01 6.31250902115451983931e-01 3.79018488523829133463e-01 6.27871647674257404859e-01 3.84742916041163451890e-01 6.22207465205793397445e-01 3.91595768449875536454e-01 6.15633011878648384041e-01 3.96625581496019397054e-01 6.09173393940910856692e-01 3.99026499889684860278e-01 6.03905859802698508076e-01 3.98207327359702545344e-01 6.01178049325571395300e-01 3.95002140133493828689e-01 6.01208571965403337778e-01 3.89948940587053372031e-01 6.03884299662889589833e-01 3.83604188325188222297e-01 6.08702466727769619936e-01 3.77230712615706231805e-01 6.14655465325135375032e-01 3.71127818190797986730e-01 6.21963246843868389213e-01 3.67070433194754630613e-01 6.27091260362545144247e-01 3.64490791739618846812e-01 6.27752745879683327068e-01 3.61370643608300123883e-01 6.31056376246862948953e-01 3.57670398494897678887e-01 6.34684142601973144693e-01 3.53624942049634349850e-01 6.39338894788083478282e-01 3.57884481714434488087e-01 6.26292546241800751616e-01
26 1.00000000000000000000e+00 3.66166512979320846188e-01 6.45886746171612791123e-01 3.51791372125844326035e-01 6.49829849304460860360e-01 3.49855651327279137952e-01 6.51228121901208933942e-01 3.50304400826214945575e-01 6.50733336006550255881e-01 3.50363560830025011494e-01 6.50938674240354453460e-01 3.51549191431352936466e-01 6.50077140632609684623e-01 3.51924952575841443192e-01 6.49721991669275134029e-01 3.53555715509326184964e-01 6.49226496992816315412e-01 3.56114061775230306139e-01 6.47038410484332859873e-01 3.58830079093508669263e-01 6.44386005003871109587e-01 3.62012867953255546016e-01 6.41339206485085133735e-01 3.65721305788435091522e-01 6.38166718228429630244e-01 3.68600964536169639629e-01 6.34070077332864912023e-01 3.70429146320266244885e-01 6.31090268716892000000e-01 3.70698601987636933153e-01 6.29503488575530623095e-01 3.69402241409303111475e-01 6.29449090409317180139e-01 3.67003566460443686470e-01 6.30839195087995685540e-01 3.64277069846583034796e-01 6.32872874106732763444e-01 3.61421104624228217705e-01 6.35477311030891001131e-01 3.59082980953408514857e-01 6.37835517468498869320e-01 3.57650220628156267910e-01 6.38954599223998331858e-01 3.55863534428588312863e-01 6.40565713742748954473e-01 3.54221792873175678196e-01 6.42108680200495385293e-01 3.53516540067998374930e-01 6.42407483841300086524e-01 3.56233765619591136176e-01 6.29661801170692259078e-01
27 1.00000000000000000000e+00 3.65641407559414988171e-01 6.46147292624629221436e-01 3.51120467288900617309e-01 6.50186293202392739943e-01 3.49161312786035293865e-01 6.51461688390837290186e-01 3.48720969684560011537e-01 6.51880105276716137475e-01 3.48758280835151979193e-01 6.51934479775945097124e-01 3.49051965811750963820e-01 6.51706844013234531943e-01 3.49446494744848956682e-01 6.51468278550706214602e-01 3.50113430389448698765e-01 6.51025572075806024941e-01 3.50827525295018149976e-01 6.50326439944117429270e-01 3.51550707287812402857e-01 6.49453688785265548233e-01 3.51959756237622378716e-01 6.48801330394954800518e-01 3.52279748896857480833e-01 6.48087245594579419716e-01 3.52023271050308006469e-01 6.47837790293042115053e-01 3.51165041822101731128e-01 6.48060687853136307979e-01 3.50527297617097721716e-01 6.48612195954954784405e-01 3.49373979246567767376e-01 6.49375010370523697567e-01 3.48185107701741991537e-01 6.50433918640922370535e-01 3.47429791116865227529e-01 6.51347144499140107143e-01 3.47129619520621102158e-01 6.52005837333263338351e-01 3.47561373733783873785e-01 6.51902863097171381135e-01 3.47259128845176401335e-01 6.52213596281682295164e-01 3.47523691865720796290e-01 6.52039715991614032831e-01 3.47719081831532328408e-01 6.51827256892162698598e-01 3.49313575326281489097e-01 6.49590937286207870116e-01 3.53576817595136705386e-01 6.34853942786587133185e-01
28 1.00000000000000000000e+00 3.64372560007065471321e-01 6.46857442462768217339e-01 3.49390888964465629041e-01 6.51307207559506440298e-01 3.46998194961564643268e-01 6.52967109862787942198e-01 3.46108306081130745468e-01 6.53790920398516828271e-01 3.45678124715150192348e-01 6.54253456960625201511e-01 3.45455744843015277734e-01 6.54524750948217493018e-01 3.45323628244367075713e-01 6.54694112848595799470e-01 3.45251678201412393054e-01 6.54832488884061092449e-01 3.45218263435372818559e-01 6.54804123487626954514e-01 3.45192157609307492816e-01 6.54932350076903646574e-01 3.45256542910696018200e-01 6.54992922018888146241e-01 3.45338075157936907900e-01 6.54955096396381608592e-01 3.45481572927885616231e-01 6.54840281790463052403e-01 3.45622811013438002714e-01 6.54613672302244875567e-01 3.45751759521993273783e-01 6.54376285027688631146e-01 3.45845018744240562114e-01 6.54156317999348591030e-01 3.45853478213285159271e-01 6.54055050632103562869e-01 3.45865057045873003361e-01 6.53964909655272652600e-01 3.45944731801728355691e-01 6.53874944773311872481e-01 3.46092932973898259608e-01 6.53753982904120345410e-01 3.46327186261398467515e-01 6.53558396213756886972e-01 3.46710732635939711255e-01 6.53204512706212714335e-01 3.47453975881550802818e-01 6.52404707454472987394e-01 3.49023709987586250314e-01 6.50112980482645430591e-01 3.53356325355276612576e-01 6.35258518657927595541e-01
29 1.00000000000000000000e+00 3.64251423607936664073e-01 6.46925131795833885384e-01 3.49226425318654165597e-01 6.51414010089074291265e-01 3.46792850557157528169e-01 6.53111730309477889200e-01 3.45873392286422220998e-01 6.53964324800149543471e-01 3.45415007314489541645e-01 6.54454530047785754121e-01 3.45151104023897481454e-01 6.54760226479469298333e-01 3.44984874892945103664e-01 6.54961267456802720410e-01 3.44873650240857254623e-01 6.55097720344346989840e-01 3.44795499207710687273e-01 6.55191223149503398915e-01 3.44743128409000898493e-01 6.55254185287028834139e-01 3.44706195937764525716e-01 6.55287826794610284153e-01 3.44677351723583380583e-01 6.55313282976939026625e-01 3.44655059692387299997e-01 6.55324067742724669650e-01 3.44648453911634233826e-01 6.55325216362808493642e-01 3.44671209985327353653e-01 6.55310298080021502720e-01 3.44729291191169406883e-01 6.55275995519550735757e-01 3.44784649803071330254e-01 6.55229565664788959900e-01 3.44883003490840112093e-01 6.55156699710498391376e-01 3.45019106455468738126e-01 6.55048266109677257418e-01 3.45221998182156375456e-01 6.54880270270190911752e-01 3.45526684861151955896e-01 6.54616711222433478312e-01 3.46020969622753193917e-01 6.54149911782991977383e-01 3.46872499469577544318e-01 6.53229523358302976987e-01 3.48572814363628469270e-01 6.50792699006289554475e-01 3.53066174352023587346e-01 6.35762496736997584357e-01
30 1.00000000000000000000e+00 3.64171145217797198601e-01 6.46972092535108900258e-01 3.49119864377270716638e-01 6.51485666772377625122e-01 3.46665481129711239294e-01 6.53202977621169078581e-01 3.45729671073495170575e-01 6.54070967263485458787e-01 3.45258314597842674853e-01 6.54573579180076414730e-01 3.44986268199524381828e-01 6.54887907449532846726e-01 3.44815921765717514624e-01 6.55094446659638007802e-01 3.44704454082972955309e-01 6.55233487897793009935e-01 3.44629557000801223232e-01 6.55328845752832567229e-01 3.44580202325260542828e-01 6.55392809544624088680e-01 3.44549032409023292534e-01 6.55434826187298535949e-01 3.44532592968269046896e-01 6.55459862232375289892e-01 3.44529116452224226652e-01 6.55471029131091564857e-01 3.44538591475799238495e-01 6.55469300451069769586e-01 3.44562438831132300532e-01 6.55454107457716261820e-01 3.44603757085605699739e-01 6.55423593156180372965e-01 3.44668003211842211009e-01 6.55374235250889558557e-01 3.44763085352787157500e-01 6.55299377288524609320e-01 3.44902304214598443011e-01 6.55187398433573653378e-01 3.45109347194179405527e-01 6.55016238223608993074e-01 3.45424670818054224686e-01 6.54742990003206459804e-01 3.45928679741972167072e-01 6.54270545836353578650e-01 3.46798071124015505617e-01 6.53333206849327496890e-01 3.48515624706782378706e-01 6.50878324757005244372e-01 3.53029122334885814283e-01 6.35826866373303878355e-01
31 1.00000000000000000000e+00 3.64157917492659466419e-01 6.46979842774727642585e-01 3.49103129342359597143e-01 6.51497122065182621142e-01 3.46646472380187642415e-01 6.53216951273625001662e-01 3.45708869342605529251e-01 6.54087268070446148371e-01 3.45236922605379747964e-01 6.54591193830017625821e-01 3.44964374289091657566e-01 6.54906399765220581521e-01 3.44793848161895066795e-01 6.55113326362497971900e-01 3.44682271240826509917e-01 6.55252940386874316303e-01 3.44607731556029250886e-01 6.55348328073350305800e-01 3.44558473507138918190e-01 6.55412981928028215428e-01 3.44527607845898142802e-01 6.55455324288707563696e-01 3.44511604679411442831e-01 6.55480429599336722468e-01 3.44508832796667996412e-01 6.55491141713682501369e-01 3.44519251070234344692e-01 6.55488678819376113793e-01 3.44544088664754166729e-01 6.55472908205738336029e-01 3.44586328545887776720e-01 6.55442240343711457484e-01 3.44650996276609389302e-01 6.55392982121915101956e-01 3.44746396559400591908e-01 6.55318409917347910465e-01 3.44886011086388999392e-01 6.55206839760881565304e-01 3.45093014768119932256e-01 6.55036280345587029750e-01 3.45408345294787477719e-01 6.54763582564101720429e-01 3.45912397904618973410e-01 6.54291494906657167263e-01 3.46782752926628801138e-01 6.53353762882301736248e-01 3.48502754658632007967e-01 6.50896979354084859182e-01 3.53020073245288945607e-01 6.35842124405106345897e-01
32 1.00000000000000000000e+00 3.64152715478687549755e-01 6.46982902017406380502e-01 3.49096966554493959300e-01 6.51501455789190719869e-01 3.46639739023905768533e-01 6.53222063740022784728e-01 3.45701856403053120470e-01 6.54092837075716526662e-01 3.45229903102085622368e-01 6.54596978741627588683e-01 3.44957439484676775532e-01 6.54912340265942249928e-01 3.44787072975214159420e-01 6.55119268159803813667e-01 3.44675601276548559948e-01 6.55258900763546980883e-01 3.44601127215906188894e-01 6.55354334842706887088e-01 3.44551926595074831106e-01 6.55419055535568784165e-01 3.44521283756975826851e-01 6.55461402102123447122e-01 3.44505512429154614473e-01 6.55486431010089631854e-01 3.44502974543701601107e-01 6.55497058678552679822e-01 3.44513568731867669825e-01 6.55494556115013393693e-01 3.44538600130976369051e-01 6.55478787872438295459e-01 3.44580967439790386564e-01 6.55448115249449902997e-01 3.44645726863514634264e-01 6.55398878644583238184e-01 3.44741145225470613234e-01 6.55324411182445443202e-01 3.44880815646472327352e-01 6.55212914856152961462e-01 3.45087721890383503087e-01 6.55042547882672576698e-01 3.45403098220641524563e-01 6.54770009260417285013e-01 3.45907297048822170993e-01 6.54297949615560203718e-01 3.46778180766028121251e-01 6.53359933207631082830e-01 3.48498775451381748169e-01 6.50902689578650606173e-01 3.53017340266484180855e-01 6.35846821291421004929e-01
33 1.00000000000000000000e+00 3.64151117427668924442e-01 6.46983852031333017685e-01 3.49095031323435722737e-01 6.51502761515883155319e-01 3.46637675271726730664e-01 6.53223570820322563257e-01 3.45699707022978641735e-01 6.54094576177882136570e-01 3.45227762419525852078e-01 6.54598798964319272820e-01 3.44955239204842056822e-01 6.54914221178118260980e-01 3.44784901736268134531e-01 6.55121156184008457402e-01 3.44673427795402997909e-01 6.55260813019652887945e-01 3.44599010200600963660e-01 6.55356238126569512481e-01 3.44549791532826832352e-01 6.55421000150834043296e-01 3.44519167807074644383e-01 6.55463375248452106980e-01 3.44503424529933099940e-01 6.55488437939114154673e-01 3.44500929430769209372e-01 6.55499073252268638079e-01 3.44511557364637954759e-01 6.55496580643447623871e-01 3.44536603221833159783e-01 6.55480831818668119304e-01 3.44578985494826239844e-01 6.55450183537543473733e-01 3.44643744406691932003e-01 6.55401001357378776291e-01 3.44739193931919596370e-01 6.55326560639029276345e-01 3.44878899529596882889e-01 6.55215084843813078130e-01 3.45085824078927183578e-01 6.55044754351290392513e-01 3.45401246339557765896e-01 6.54772253060969533500e-01 3.45905444321948252195e-01 6.54300302931116961602e-01 3.46776431108557048333e-01 6.53362283721789616209e-01 3.48497317657269101154e-01 6.50904857403544534478e-01 3.53016195186970360709e-01 6.35848802736640794642e-01
