# tag norm n_hub[0] n_hub[1] n_hub[2] n_hub[3] n_hub[4] n_hub[5] n_hub[6] n_hub[7] n_hub[8] n_hub[9] n_hub[10] n_hub[11] n_hub[12] n_hub[13] n_hub[14] n_hub[15] n_hub[16] n_hub[17] n_hub[18] n_hub[19] n_hub[20] n_hub[21] n_hub[22] n_hub[23] n_hub[24] n_hub[25] n_hub[26] n_hub[27] n_hub[28] n_hub[29] n_hub[30] n_hub[31] n_hub[32] n_hub[33] n_hub[34] n_hub[35] n_hub[36] n_hub[37] n_hub[38] n_hub[39] n_hub[40] n_hub[41] n_hub[42] n_hub[43] n_hub[44] n_hub[45] n_hub[46] n_hub[47] n_hub[48] n_hub[49]
1 1.00000000000000000000e+00 5.46801189618245381957e-03 1.99498883056647358103e+00 5.86375647627187124994e-03 1.99381837418218488267e+00 4.31974753808207906358e-02 1.98701274141525074945e+00 2.22592519060223370531e-01 1.90918148018442201952e+00 8.91990496516018582795e-01 1.33106198136022535472e+00 8.51827560452560916815e-01 1.23054438481624717205e+00 8.41711611406205095776e-01 1.04389957621128681708e+00 8.77420833493584573226e-01 1.06953361908361155308e+00 9.07638870883552995039e-01 1.06486029795715153590e+00 9.09376756791067997199e-01 1.06523669716285529496e+00 8.94147050435242229938e-01 1.06598354606893308549e+00 8.98311227416226376619e-01 1.04551051875490652598e+00 8.85454132534186144632e-01 1.04417551273965147907e+00 8.88680447291852915193e-01 1.02850531781407839027e+00 1.40354392408573828976e-02 1.99507675869622835840e+00 2.67493725448587182925e-01 1.93541155830882138922e+00 8.73210807934222676963e-01 1.47964810146609671015e+00 9.37829759680059660276e-01 1.20004931512828361129e+00 8.95022050900382226679e-01 1.04179899005607845552e+00 8.98640423757432360574e-01 1.05639400409494643718e+00 9.24996303977191236534e-01 1.07778067501050744958e+00 9.43790567018901405127e-01 1.09253990767082065361e+00 9.49705453020619150273e-01 1.09662076061064861499e+00 9.53508382649256081010e-01 1.46341640420085461471e+00 3.36727080373963982840e-01 5.68309902403746902699e-01
2 1.00000000000000000000e+00 4.93023699547710889807e-03 1.99018032257276078489e+00 9.79265803354003629144e-03 1.99020727954764398149e+00 9.79890341842673366635e-03 1.99093453045384616296e+00 9.06696935380670726579e-03 1.99042648441008696025e+00 9.55232401555540684701e-03 1.99053115536163827137e+00 9.47656409416149612956e-03 1.99034028346069913340e+00 9.69409349132740148780e-03 1.99037801805481562312e+00 9.55171039604660494782e-03 1.99050733237721133584e+00 9.60667110989288017264e-03 1.99043196344430795008e+00 9.56745995676541900743e-03 1.98998905403524450897e+00 9.99670735113226786861e-03 1.99019106620013674913e+00 9.76718008541033189118e-03 1.99015568978543933021e+00 9.85472633546843022889e-03 1.99008441605684560649e+00 9.89427954978876200709e-03 1.99010931645389188560e+00 9.87263294578195199636e-03 1.99022089782369193678e+00 9.76902125979503370423e-03 1.99078349911474927758e+00 9.21226511646498769093e-03 1.99068801872719736146e+00 9.28276260751693775564e-03 1.99044287001220121525e+00 9.31909465239363042632e-03 1.99063708135190275961e+00 9.80117706884754517904e-03 1.99035966500319827510e+00 9.61241948300885044876e-03 1.99042964049250525882e+00 9.54815123709079789649e-03 1.99042620287889349129e+00 9.50435223223911225532e-03 1.99052506091066994109e+00 9.22481770224214438214e-03 1.99071071606977501034e+00 9.82390497525180775296e-03 1.99478835193302383999e+00
3 1.00000000000000000000e+00 4.92653158628141279313e-03 1.99018327680960527282e+00 9.78075210978192680078e-03 1.99021896421975208469e+00 9.78115620800119010825e-03 1.99021884833673778914e+00 9.78105645339874194000e-03 1.99021892796550581295e+00 9.78108872143869725879e-03 1.99021900534126694460e+00 9.78100084480214466975e-03 1.99021882407068506637e+00 9.78116672956285716778e-03 1.99021888818792058728e+00 9.78105057059898939931e-03 1.99021893749727030176e+00 9.78094430810465091664e-03 1.99021907050400437278e+00 9.78082203834445933210e-03 1.99021919985094375427e+00 9.78104511705617934991e-03 1.99021893909908786924e+00 9.78105824988547908894e-03 1.99021895391538783393e+00 9.78099333105508263186e-03 1.99021900385799921374e+00 9.78105466957545320594e-03 1.99021895749485921989e+00 9.78102365931028672197e-03 1.99021894599814119786e+00 9.78119944904486636472e-03 1.99021881259155675181e+00 9.78104511829889881891e-03 1.99021895424061012747e+00 9.78101546301417788809e-03 1.99021835791299062102e+00 9.78161337795788871086e-03 1.99021898311972988971e+00 9.78111117125595244670e-03 1.99021899481941755283e+00 9.78103205379830635546e-03 1.99021890228433928627e+00 9.78108748977962738635e-03 1.99021891334821643404e+00 9.78107119526295740175e-03 1.99021872641888886157e+00 9.78131710478801277842e-03 1.99021916719204527979e+00 9.81676495001369484039e-03 1.99507344295261734857e+00
4 1.00000000000000000000e+00 4.92655421989517117165e-03 1.99018323851880785114e+00 9.78076970275213418426e-03 1.99021894033987112316e+00 9.78107237487516913144e-03 1.99021892843114400762e+00 9.78105970310185618422e-03 1.99021893821499640254e+00 9.78106394055218777983e-03 1.99021894772786200889e+00 9.78105303601679507142e-03 1.99021892522938914638e+00 9.78107334136388111012e-03 1.99021893343005840116e+00 9.78105908753768189812e-03 1.99021893936149796289e+00 9.78104596536845220800e-03 1.99021895567717521658e+00 9.78103114802217690760e-03 1.99021897141133452536e+00 9.78105898902867712530e-03 1.99021893934386717717e+00 9.78106029884291509890e-03 1.99021894116488295978e+00 9.78105229534645924383e-03 1.99021894724586490000e+00 9.78106004996747921409e-03 1.99021894161130363798e+00 9.78105603911520564420e-03 1.99021894006974742197e+00 9.78105877705785255183e-03 1.99021894291319312309e+00 9.78104630810815861564e-03 1.99021895352684241587e+00 9.78105467096742134392e-03 1.99021887160126609295e+00 9.78112403288385751088e-03 1.99021894611282790244e+00 9.78106666558044811344e-03 1.99021894654900743937e+00 9.78105696438336634502e-03 1.99021893482699163691e+00 9.78106381694027714191e-03 1.99021893626085799589e+00 9.78106168488655607074e-03 1.99021891334429446019e+00 9.78109386692645708938e-03 1.99021922294470843262e+00 9.81676208934752388136e-03 1.99507344507312178727e+00
