# tag norm j_0
16.500000 1.00000000000020872193e+00 -3.21597614726216887802e-04
16.500000 1.00000000000020872193e+00 -6.79761698207205023251e-05
16.500000 1.00000000000020872193e+00 -3.04265862487625984509e-04
16.500000 1.00000000000020872193e+00 -7.53465462894012437747e-04
16.500000 1.00000000000020872193e+00 -7.80527287847682907547e-04
16.500000 1.00000000000020872193e+00 -7.74921825665841933553e-04
16.500000 1.00000000000020872193e+00 -6.90782245949697702031e-04
16.500000 1.00000000000020872193e+00 -7.42777378145866203074e-04
16.500000 1.00000000000020872193e+00 -6.87495458991434693283e-04
16.500000 1.00000000000020872193e+00 -7.43058371236875658469e-04
16.500000 1.00000000000020872193e+00 -6.84878002537769349500e-04
16.500000 1.00000000000020872193e+00 -7.38847450005333176819e-04
16.500000 1.00000000000020872193e+00 -6.82509273010587424677e-04
16.500000 1.00000000000020872193e+00 -7.67905378215880205645e-04
16.500000 1.00000000000020872193e+00 -7.67019674835473929016e-04
16.500000 1.00000000000020872193e+00 -7.64512894013744397255e-04
16.500000 1.00000000000020872193e+00 -3.10189688523013012110e-04
16.500000 1.00000000000020872193e+00 -5.60689818512814436616e-05
16.500000 1.00000000000020872193e+00 -2.83936220086012010028e-04
