# tag norm j_0
8.300000 1.00000000000004685141e+00 3.20213189168089551462e-02
8.300000 1.00000000000004685141e+00 3.74210693000514710294e-02
8.300000 1.00000000000004685141e+00 3.09567964438520089321e-02
8.300000 1.00000000000004685141e+00 3.72126872558943416758e-02
8.300000 1.00000000000004685141e+00 3.07924859263279809829e-02
8.300000 1.00000000000004685141e+00 3.70047615096227786036e-02
8.300000 1.00000000000004685141e+00 3.06394631301757855435e-02
8.300000 1.00000000000004685141e+00 3.68077046618454292726e-02
8.300000 1.00000000000004685141e+00 3.04875994586285004040e-02
8.300000 1.00000000000004685141e+00 3.66092059196952146483e-02
8.300000 1.00000000000004685141e+00 3.03384098008632092924e-02
8.300000 1.00000000000004685141e+00 3.64094744500215311556e-02
8.300000 1.00000000000004685141e+00 3.01893828329110429365e-02
8.300000 1.00000000000004685141e+00 3.62074288165117053051e-02
8.300000 1.00000000000004685141e+00 3.00455376883464429782e-02
8.300000 1.00000000000004685141e+00 3.60116770650664511089e-02
8.300000 1.00000000000004685141e+00 2.99202490158532521947e-02
8.300000 1.00000000000004685141e+00 3.58256410665481264677e-02
8.300000 1.00000000000004685141e+00 3.06723238986829800645e-02
