# tag norm j_0
1.900000 1.00000000000000421885e+00 -5.59298686134182521622e-05
1.900000 1.00000000000000421885e+00 -5.14880570312306010562e-05
1.900000 1.00000000000000421885e+00 -5.47414981471093674737e-05
1.900000 1.00000000000000421885e+00 -4.94055241443425039111e-05
1.900000 1.00000000000000421885e+00 -5.28892620198851806158e-05
1.900000 1.00000000000000421885e+00 -4.88258499952892968308e-05
1.900000 1.00000000000000421885e+00 -5.27897005392571769472e-05
1.900000 1.00000000000000421885e+00 -4.87245777035178863974e-05
1.900000 1.00000000000000421885e+00 -5.27622930936500654986e-05
1.900000 1.00000000000000421885e+00 -4.86294244287788026446e-05
1.900000 1.00000000000000421885e+00 -5.27019022920561706035e-05
1.900000 1.00000000000000421885e+00 -4.85517404126884795498e-05
1.900000 1.00000000000000421885e+00 -5.26249143210398085194e-05
1.900000 1.00000000000000421885e+00 -4.84723281531412359844e-05
1.900000 1.00000000000000421885e+00 -5.24914175101970448896e-05
1.900000 1.00000000000000421885e+00 -4.88899921777132036456e-05
1.900000 1.00000000000000421885e+00 -5.39983624882232082797e-05
1.900000 1.00000000000000421885e+00 -5.07840771990701483917e-05
1.900000 1.00000000000000421885e+00 -5.49234118469915579431e-05
