# tag norm j_0
4.100000 1.00000000000001243450e+00 1.82514963242972933118e-03
4.100000 1.00000000000001243450e+00 1.75380236188325258281e-03
4.100000 1.00000000000001243450e+00 1.79745971737669749113e-03
4.100000 1.00000000000001243450e+00 1.74339043333191813512e-03
4.100000 1.00000000000001243450e+00 1.79912865787583441980e-03
4.100000 1.00000000000001243450e+00 1.74075394540483064168e-03
4.100000 1.00000000000001243450e+00 1.79340263600143547465e-03
4.100000 1.00000000000001243450e+00 1.74642657380087869788e-03
4.100000 1.00000000000001243450e+00 1.81589360107033723039e-03
