Update action.

9 jobs for a1341745 in 3 minutes and 19 seconds
latest
Name Stage Failure
failed
release_tag Release
  <s:message/>
</d:error>
0 488k 100 182 0 0 1396 0 --:--:-- --:--:-- --:--:-- 1400
Executing "step_release" stage of the job script
$ release-cli create --name "Tagged Release $CI_COMMIT_TAG" --description "Created by gitlab CI" --tag-name "$CI_COMMIT_TAG" --ref "$CI_COMMIT_REF_NAME"
time="2022-05-16T12:13:17Z" level=info msg="Creating Release..." cli=release-cli command=create name="Tagged Release a1341745" project-id=12713 ref=a1341745 server-url="https://gitlab.gwdg.de" tag-name=a1341745 version=0.11.0
time="2022-05-16T12:13:17Z" level=fatal msg="run app" cli=release-cli error="failed to create release: API Error Response status_code: 409 message: Release already exists" version=0.11.0
Cleaning up project directory and file based variables
ERROR: Job failed: exit code 1

failed
release_commit Release
  <s:exception>Sabre\DAV\Exception\Forbidden</s:exception>
<s:message/>
</d:error>
Executing "step_release" stage of the job script
$ release-cli create --name "Nightly Release $CI_COMMIT_SHORT_SHA" --description "Created by gitlab CI" --tag-name "$CI_COMMIT_SHORT_SHA" --ref "$CI_COMMIT_REF_NAME"
time="2022-05-16T12:13:13Z" level=info msg="Creating Release..." cli=release-cli command=create name="Nightly Release a1341745" project-id=12713 ref=a1341745 server-url="https://gitlab.gwdg.de" tag-name=a1341745 version=0.11.0
time="2022-05-16T12:13:13Z" level=fatal msg="run app" cli=release-cli error="failed to create release: API Error Response status_code: 409 message: Release already exists" version=0.11.0
Cleaning up project directory and file based variables
ERROR: Job failed: exit code 1

failed
test:unittest Test
E   ModuleNotFoundError: No module named 'rq'
------------------------------- Captured stdout --------------------------------
/builds/mpievolbio-scicomp/repinpop
=========================== short test summary info ============================
ERROR test_routes.py
!!!!!!!!!!!!!!!!!!!! Interrupted: 1 error during collection !!!!!!!!!!!!!!!!!!!!
=============================== 1 error in 0.06s ===============================
Cleaning up project directory and file based variables
ERROR: Job failed: exit code 1

failed
test:chlororaphis Test
/bin/sh: 1: gradle: not found
CMakeFiles/repin_ecology.dir/build.make:85: recipe for target 'repin_ecology-prefix/src/repin_ecology-stamp/repin_ecology-build' failed
make[2]: *** [repin_ecology-prefix/src/repin_ecology-stamp/repin_ecology-build] Error 127
CMakeFiles/Makefile2:166: recipe for target 'CMakeFiles/repin_ecology.dir/all' failed
make[1]: *** [CMakeFiles/repin_ecology.dir/all] Error 2
Makefile:90: recipe for target 'all' failed
make: *** [all] Error 2
Cleaning up project directory and file based variables
ERROR: Job failed: exit code 1

failed
test:neisseria Test
/bin/sh: 1: gradle: not found
CMakeFiles/repin_ecology.dir/build.make:85: recipe for target 'repin_ecology-prefix/src/repin_ecology-stamp/repin_ecology-build' failed
make[2]: *** [repin_ecology-prefix/src/repin_ecology-stamp/repin_ecology-build] Error 127
CMakeFiles/Makefile2:166: recipe for target 'CMakeFiles/repin_ecology.dir/all' failed
make[1]: *** [CMakeFiles/repin_ecology.dir/all] Error 2
Makefile:90: recipe for target 'all' failed
make: *** [all] Error 2
Cleaning up project directory and file based variables
ERROR: Job failed: exit code 1

failed
test:dokdonia Test
/bin/sh: 1: gradle: not found
CMakeFiles/repin_ecology.dir/build.make:85: recipe for target 'repin_ecology-prefix/src/repin_ecology-stamp/repin_ecology-build' failed
make[2]: *** [repin_ecology-prefix/src/repin_ecology-stamp/repin_ecology-build] Error 127
CMakeFiles/Makefile2:166: recipe for target 'CMakeFiles/repin_ecology.dir/all' failed
make[1]: *** [CMakeFiles/repin_ecology.dir/all] Error 2
make: *** [all] Error 2
Makefile:90: recipe for target 'all' failed
Cleaning up project directory and file based variables
ERROR: Job failed: exit code 1

failed
test:neisseria:small Test
/bin/sh: 1: gradle: not found
CMakeFiles/repin_ecology.dir/build.make:85: recipe for target 'repin_ecology-prefix/src/repin_ecology-stamp/repin_ecology-build' failed
make[2]: *** [repin_ecology-prefix/src/repin_ecology-stamp/repin_ecology-build] Error 127
CMakeFiles/Makefile2:166: recipe for target 'CMakeFiles/repin_ecology.dir/all' failed
make[1]: *** [CMakeFiles/repin_ecology.dir/all] Error 2
Makefile:90: recipe for target 'all' failed
make: *** [all] Error 2
Cleaning up project directory and file based variables
ERROR: Job failed: exit code 1