^D:\ITSIMULATORCOLLECTOR\UCTEXTEDITOR\CDIALOGTEXTEDITOR.RESX|D:\ITSIMULATORCOLLECTOR\UCTEXTEDITOR\CUCTEXTEDITOR.RESX
D:\ITSIMULATORCOLLECTOR\UCTEXTEDITOR\OBJ\RELEASE\UCTEXTEDITOR.CDIALOGTEXTEDITOR.RESOURCES
D:\ITSIMULATORCOLLECTOR\UCTEXTEDITOR\OBJ\RELEASE\UCTEXTEDITOR.CUCTEXTEDITOR.RESOURCES
^E:\FAIMSVIEWER\UCTEXTEDITOR\CDIALOGTEXTEDITOR.RESX|E:\FAIMSVIEWER\UCTEXTEDITOR\CUCTEXTEDITOR.RESX
E:\FAIMSVIEWER\UCTEXTEDITOR\OBJ\RELEASE\UCTEXTEDITOR.CDIALOGTEXTEDITOR.RESOURCES
E:\FAIMSVIEWER\UCTEXTEDITOR\OBJ\RELEASE\UCTEXTEDITOR.CUCTEXTEDITOR.RESOURCES
