^C:\DEVELOPMENTCSHARP\BUBBLEPOINT\BASIC\INITDATA\DIALOGABOUT.RESX|C:\DEVELOPMENTCSHARP\BUBBLEPOINT\BASIC\INITDATA\PROPERTIES\RESOURCES.RESX
C:\DEVELOPMENTCSHARP\BUBBLEPOINT\BASIC\INITDATA\OBJ\RELEASE\INITDATA.DIALOGABOUT.RESOURCES
C:\DEVELOPMENTCSHARP\BUBBLEPOINT\BASIC\INITDATA\OBJ\RELEASE\INITDATA.PROPERTIES.RESOURCES.RESOURCES
