^D:\ITSIMULATORCOLLECTOR\UCTEXTEDITOR\CDIALOGTEXTEDITOR.RESX
^D:\ITSIMULATORCOLLECTOR\UCTEXTEDITOR\CUCTEXTEDITOR.RESX
^E:\FAIMSVIEWER\UCTEXTEDITOR\CDIALOGTEXTEDITOR.RESX
^E:\FAIMSVIEWER\UCTEXTEDITOR\CUCTEXTEDITOR.RESX
