1800 1800 0.01 0 0.001
1800 2000 0.01 1 0.001
1800 2200 0.01 2 0.001
2000 1800 0.01 0 0.001
2000 2000 0.01 1 0.001
2000 2200 0.01 2 0.001
2200 1800 0.01 0 0.001
2200 2000 0.01 1 0.001
2200 2200 0.01 2 0.001
