     4     25 UInt16
  1800  1800   100     1
  1900  1800   100     0
  2000  1800   100     1
  2100  1800   100     0
  2200  1800   100     1
  1800  1800   100     0
  1900  1800   100     1
  2000  1800   100     0
  2100  1800   100     1
  2200  1800   100     0
  1800  1800   100     1
  1900  1800   100     0
  2000  1800   100     1
  2100  1800   100     0
  2200  1800   100     1
  1800  1800   100     0
  1900  1800   100     1
  2000  1800   100     0
  2100  1800   100     1
  2200  1800   100     0
  1800  1800   100     1
  1900  1800   100     0
  2000  1800   100     1
  2100  1800   100     0
  2200  1800   100     1

