  5     5     4    25 UInt16
  1800  1800   123   255
  1900  1800   123     0
  2000  1800   123   255
  2100  1800   123     0
  2200  1800   123   255
  1800  1900   123     0
  1900  1900   123   255
  2000  1900   123     0
  2100  1900   123   255
  2200  1900   123     0
  1800  2000   123   255
  1900  2000   123     0
  2000  2000   123   255
  2100  2000   123     0
  2200  2000   123   255
  1800  2100   123     0
  1900  2100   123   255
  2000  2100   123     0
  2100  2100   123   255
  2200  2100   123     0
  1800  2200   123   255
  1900  2200   123     0
  2000  2200   123   255
  2100  2200   123     0
  2200  2200   123   255

