1234   2345   0.001   1   0.001
1234   2345   0.001   1   0.001
1234   2345   0.001   1   0.001
1234   2345   0.001   1   0.001
1234   2345   0.001   1   0.001
1234   2345   0.001   1   0.001
1234   2345   0.001   1   0.001
1234   2345   0.001   1   0.001
1234   2345   0.001   1   0.001
1234   2345   0.001   1   0.001
1234   2345   0.001   1   0.001
1234   2345   0.001   1   0.001
1234   2345   0.001   1   0.001
1234   2345   0.001   1   0.001
1234   2345   0.001   1   0.001
1234   2345   0.001   1   0.001
1234   2345   0.001   1   0.001
1234   2345   0.001   1   0.001
1234   2345   0.001   1   0.001
1234   2345   0.001   1   0.001
1234   2345   0.001   1   0.001
1234   2345   0.001   1   0.001
1234   2345   0.001   1   0.001
1234   2345   0.001   1   0.001
1234   2345   0.001   1   0.001
1234   2345   0.001   1   0.001
1234   2345   0.001   1   0.001
1234   2345   0.001   1   0.001
1234   2345   0.001   1   0.001
1234   2345   0.001   1   0.001
1234   2345   0.001   1   0.001
1234   2345   0.001   1   0.001
1234   2345   0.001   1   0.001
1234   2345   0.001   1   0.001
1234   2345   0.001   1   0.001
1234   2345   0.001   1   0.001
1234   2345   0.001   1   0.001
1234   2345   0.001   1   0.001
1234   2345   0.001   1   0.001
1234   2345   0.001   1   0.001
1234   2345   0.001   1   0.001
1234   2345   0.001   1   0.001
1234   2345   0.001   1   0.001
1234   2345   0.001   1   0.001
1234   2345   0.001   1   0.001
1234   2345   0.001   1   0.001
1234   2345   0.001   1   0.001
1234   2345   0.001   1   0.001
1234   2345   0.001   1   0.001
1234   2345   0.001   1   0.001
1234   2345   0.001   1   0.001
1234   2345   0.001   1   0.001
1234   2345   0.001   1   0.001
1234   2345   0.001   1   0.001
1234   2345   0.001   1   0.001
1234   2345   0.001   1   0.001
1234   2345   0.001   1   0.001
1234   2345   0.001   1   0.001
1234   2345   0.001   1   0.001
1234   2345   0.001   1   0.001
1234   2345   0.001   1   0.001
1234   2345   0.001   1   0.001
1234   2345   0.001   1   0.001
1234   2345   0.001   1   0.001
1234   2345   0.001   1   0.001
1234   2345   0.001   1   0.001
1234   2345   0.001   1   0.001
1234   2345   0.001   1   0.001
1234   2345   0.001   1   0.001
1234   2345   0.001   1   0.001
1234   2345   0.001   1   0.001
1234   2345   0.001   1   0.001
1234   2345   0.001   1   0.001
1234   2345   0.001   1   0.001
1234   2345   0.001   1   0.001
1234   2345   0.001   1   0.001
1234   2345   0.001   1   0.001
1234   2345   0.001   1   0.001
1234   2345   0.001   1   0.001
1234   2345   0.001   1   0.001
1234   2345   0.001   1   0.001
1234   2345   0.001   1   0.001
1234   2345   0.001   1   0.001
1234   2345   0.001   1   0.001
1234   2345   0.001   1   0.001
1234   2345   0.001   1   0.001
1234   2345   0.001   1   0.001
1234   2345   0.001   1   0.001
1234   2345   0.001   1   0.001
1234   2345   0.001   1   0.001
1234   2345   0.001   1   0.001
1234   2345   0.001   1   0.001
1234   2345   0.001   1   0.001
1234   2345   0.001   1   0.001
1234   2345   0.001   1   0.001
1234   2345   0.001   1   0.001
1234   2345   0.001   1   0.001
1234   2345   0.001   1   0.001
1234   2345   0.001   1   0.001
