^C:\DEVELOPMENTCSHARP\FAIMSVIEWER\INITDATA\DIALOGABOUT.RESX
C:\DEVELOPMENTCSHARP\FAIMSVIEWER\INITDATA\OBJ\DEBUG\INITDATA.DIALOGABOUT.RESOURCES
^C:\DEVELOPMENTCSHARP\TMCLLGMANAGER\BASIC\INITDATA\DIALOGABOUT.RESX
C:\DEVELOPMENTCSHARP\TMCLLGMANAGER\BASIC\INITDATA\OBJ\DEBUG\INITDATA.DIALOGABOUT.RESOURCES
