^E:\FAIMSVIEWER\UCNOTIFIER\CDIALOGAPPLICATIONPRODUCTMANAGER.RESX
^E:\FAIMSVIEWER\UCNOTIFIER\CDIALOGDEVICEPRODUCTMANAGER.RESX
^E:\FAIMSVIEWER\UCNOTIFIER\CDIALOGSAVEPRODUCTCONFIGURATION.RESX
^E:\FAIMSVIEWER\UCNOTIFIER\CUCAPPLICATION.RESX
^E:\FAIMSVIEWER\UCNOTIFIER\CUCAPPLICATIONMANAGER.RESX
^E:\FAIMSVIEWER\UCNOTIFIER\CUCDEVICE.RESX
^E:\FAIMSVIEWER\UCNOTIFIER\CUCDEVICEMANAGER.RESX
^E:\FAIMSVIEWER\UCNOTIFIER\CUCLISTBOX.RESX
^E:\FAIMSVIEWER\UCNOTIFIER\CUCNOTIFIER.RESX
^E:\FAIMSVIEWER\UCNOTIFIER\CUCNOTIFIERBASE.RESX
^E:\FAIMSVIEWER\UCNOTIFIER\CDIALOGEDITPROTOCOLPARAMETER.RESX
