^E:\PVCMANAGER\UCMULTICOLORLIST\CUCMULTICOLORLIST.RESX
E:\PVCMANAGER\UCMULTICOLORLIST\OBJ\DEBUG\UCMULTICOLORLIST.CUCMULTICOLORLIST.RESOURCES
^E:\1203211155_PVCMANAGER_01V0101_DELIVERYCG\UCMULTICOLORLIST\CUCMULTICOLORLIST.RESX
E:\1203211155_PVCMANAGER_01V0101_DELIVERYCG\UCMULTICOLORLIST\OBJ\DEBUG\UCMULTICOLORLIST.CUCMULTICOLORLIST.RESOURCES
