^C:\DEVELOPMENTCSHARP\BUBBLEPOINT\BASIC\UCNOTIFIER\CDIALOGAPPLICATIONPRODUCTMANAGER.RESX|C:\DEVELOPMENTCSHARP\BUBBLEPOINT\BASIC\UCNOTIFIER\CDIALOGDEVICEPRODUCTMANAGER.RESX|C:\DEVELOPMENTCSHARP\BUBBLEPOINT\BASIC\UCNOTIFIER\CDIALOGEDITPROTOCOLPARAMETER.RESX|C:\DEVELOPMENTCSHARP\BUBBLEPOINT\BASIC\UCNOTIFIER\CDIALOGSAVEPRODUCTCONFIGURATION.RESX|C:\DEVELOPMENTCSHARP\BUBBLEPOINT\BASIC\UCNOTIFIER\CUCAPPLICATION.RESX|C:\DEVELOPMENTCSHARP\BUBBLEPOINT\BASIC\UCNOTIFIER\CUCAPPLICATIONMANAGER.RESX|C:\DEVELOPMENTCSHARP\BUBBLEPOINT\BASIC\UCNOTIFIER\CUCDEVICE.RESX|C:\DEVELOPMENTCSHARP\BUBBLEPOINT\BASIC\UCNOTIFIER\CUCDEVICEMANAGER.RESX|C:\DEVELOPMENTCSHARP\BUBBLEPOINT\BASIC\UCNOTIFIER\CUCLISTBOX.RESX|C:\DEVELOPMENTCSHARP\BUBBLEPOINT\BASIC\UCNOTIFIER\CUCNOTIFIER.RESX|C:\DEVELOPMENTCSHARP\BUBBLEPOINT\BASIC\UCNOTIFIER\CUCNOTIFIERBASE.RESX
C:\DEVELOPMENTCSHARP\BUBBLEPOINT\BASIC\UCNOTIFIER\OBJ\RELEASE\UCNOTIFIER.CDIALOGAPPLICATIONPRODUCTMANAGER.RESOURCES
C:\DEVELOPMENTCSHARP\BUBBLEPOINT\BASIC\UCNOTIFIER\OBJ\RELEASE\UCNOTIFIER.CDIALOGDEVICEPRODUCTMANAGER.RESOURCES
C:\DEVELOPMENTCSHARP\BUBBLEPOINT\BASIC\UCNOTIFIER\OBJ\RELEASE\UCNOTIFIER.CDIALOGEDITPROTOCOLPARAMETER.RESOURCES
C:\DEVELOPMENTCSHARP\BUBBLEPOINT\BASIC\UCNOTIFIER\OBJ\RELEASE\UCNOTIFIER.CDIALOGSAVEPRODUCTCONFIGURATION.RESOURCES
C:\DEVELOPMENTCSHARP\BUBBLEPOINT\BASIC\UCNOTIFIER\OBJ\RELEASE\UCNOTIFIER.CUCAPPLICATION.RESOURCES
C:\DEVELOPMENTCSHARP\BUBBLEPOINT\BASIC\UCNOTIFIER\OBJ\RELEASE\UCNOTIFIER.CUCAPPLICATIONMANAGER.RESOURCES
C:\DEVELOPMENTCSHARP\BUBBLEPOINT\BASIC\UCNOTIFIER\OBJ\RELEASE\UCNOTIFIER.CUCDEVICE.RESOURCES
C:\DEVELOPMENTCSHARP\BUBBLEPOINT\BASIC\UCNOTIFIER\OBJ\RELEASE\UCNOTIFIER.CUCDEVICEMANAGER.RESOURCES
C:\DEVELOPMENTCSHARP\BUBBLEPOINT\BASIC\UCNOTIFIER\OBJ\RELEASE\UCNOTIFIER.CUCLISTBOX.RESOURCES
C:\DEVELOPMENTCSHARP\BUBBLEPOINT\BASIC\UCNOTIFIER\OBJ\RELEASE\UCNOTIFIER.CUCNOTIFIER.RESOURCES
C:\DEVELOPMENTCSHARP\BUBBLEPOINT\BASIC\UCNOTIFIER\OBJ\RELEASE\UCNOTIFIER.CUCNOTIFIERBASE.RESOURCES
