^E:\NONLINEARFITMANAGER\INITDATA\DIALOGABOUT.RESX|E:\NONLINEARFITMANAGER\INITDATA\PROPERTIES\RESOURCES.RESX
E:\NONLINEARFITMANAGER\INITDATA\OBJ\DEBUG\INITDATA.DIALOGABOUT.RESOURCES
E:\NONLINEARFITMANAGER\INITDATA\OBJ\DEBUG\INITDATA.PROPERTIES.RESOURCES.RESOURCES
