^E:\PVCMANAGER\UCLEVEL\CUCLEVEL.RESX
E:\PVCMANAGER\UCLEVEL\OBJ\DEBUG\UCLEVEL.CUCLEVEL.RESOURCES
^E:\1203211155_PVCMANAGER_01V0101_DELIVERYCG\UCLEVEL\CUCLEVEL.RESX
E:\1203211155_PVCMANAGER_01V0101_DELIVERYCG\UCLEVEL\OBJ\DEBUG\UCLEVEL.CUCLEVEL.RESOURCES
