^E:\PVCMANAGER\UCLED\CUCLEDBASE.RESX|E:\PVCMANAGER\UCLED\CUCLEDGREEN.RESX|E:\PVCMANAGER\UCLED\CUCLEDRED.RESX|E:\PVCMANAGER\UCLED\CUCLEDYELLOW.RESX
E:\PVCMANAGER\UCLED\OBJ\DEBUG\UCLED.CUCLEDBASE.RESOURCES
E:\PVCMANAGER\UCLED\OBJ\DEBUG\UCLED.CUCLEDGREEN.RESOURCES
E:\PVCMANAGER\UCLED\OBJ\DEBUG\UCLED.CUCLEDRED.RESOURCES
E:\PVCMANAGER\UCLED\OBJ\DEBUG\UCLED.CUCLEDYELLOW.RESOURCES
^E:\1203211155_PVCMANAGER_01V0101_DELIVERYCG\UCLED\CUCLEDBASE.RESX|E:\1203211155_PVCMANAGER_01V0101_DELIVERYCG\UCLED\CUCLEDGREEN.RESX|E:\1203211155_PVCMANAGER_01V0101_DELIVERYCG\UCLED\CUCLEDRED.RESX|E:\1203211155_PVCMANAGER_01V0101_DELIVERYCG\UCLED\CUCLEDYELLOW.RESX
E:\1203211155_PVCMANAGER_01V0101_DELIVERYCG\UCLED\OBJ\DEBUG\UCLED.CUCLEDBASE.RESOURCES
E:\1203211155_PVCMANAGER_01V0101_DELIVERYCG\UCLED\OBJ\DEBUG\UCLED.CUCLEDGREEN.RESOURCES
E:\1203211155_PVCMANAGER_01V0101_DELIVERYCG\UCLED\OBJ\DEBUG\UCLED.CUCLEDRED.RESOURCES
E:\1203211155_PVCMANAGER_01V0101_DELIVERYCG\UCLED\OBJ\DEBUG\UCLED.CUCLEDYELLOW.RESOURCES
