6 6 8766
1800  1800  100  1
1800  2000  100  1
1800  2200  100  1
2000  1800  100  1
2000  2000  100  1
2000  2200  100  1
2200  1800  100  1 3000
2200  2000  100  1
2200  2200  100  1
1800  1800  100  1
1800  2000  100  1
1800  2200  100  1
2000  1800  100  1
2000  2000  100  1
2000  2200  100  1
2200  1800  100  1
2200  2000  100  1
2200  2200  100  1
1800  1800  100  1
1800  2000  100  1
1800  2200  100  1
2000  1800  100  1
2000  2000  100  1
2000  2200  100  1
2200  1800  100  1
2200  2000  100  1
2200  2200  100  1
1800  1800  100  1
1800  2000  100  1
1800  2200  100  1
2000  1800  100  1
2000  2000  100  1
2000  2200  100  1
2200  1800  100  1
2200  2000  100  1
2200  2200  100  1
