6 6 36 4 UInt16
1800  1800  100  1
1800  2000  100  1
1800  2200  100  1
2000  1800  100  1
2000  2000  100  1
2000  2200  100  1
2200  1800  100  1
2200  2000  100  1
2200  2200  100  1
1800  1800  100  1
1800  2000  100  1
1800  2200  100  1
2000  1800  100  1
2000  2000  100  1
2000  2200  100  1
2200  1800  100  1
2200  2000  100  1
2200  2200  100  1
1800  1800  100  1
1800  2000  100  1
1800  2200  100  1
2000  1800  100  1
2000  2000  100  1
2000  2200  100  1
2200  1800  100  1
2200  2000  100  1
2200  2200  100  1
1800  1800  100  1
1800  2000  100  1
1800  2200  100  1
2000  1800  100  1
2000  2000  100  1
2000  2200  100  1
2200  1800  100  1
2200  2000  100  1
2200  2200  100  1
