^E:\PVCMANAGER\PVCMANAGER\FORMMAIN.RESX|E:\PVCMANAGER\PVCMANAGER\PROPERTIES\RESOURCES.RESX
E:\PVCMANAGER\PVCMANAGER\OBJ\X86\DEBUG\PVCMANAGER.FORMMAIN.RESOURCES
E:\PVCMANAGER\PVCMANAGER\OBJ\X86\DEBUG\PVCMANAGER.PROPERTIES.RESOURCES.RESOURCES
^E:\1203211155_PVCMANAGER_01V0101_DELIVERYCG\PVCMANAGER\FORMMAIN.RESX|E:\1203211155_PVCMANAGER_01V0101_DELIVERYCG\PVCMANAGER\PROPERTIES\RESOURCES.RESX
E:\1203211155_PVCMANAGER_01V0101_DELIVERYCG\PVCMANAGER\OBJ\X86\DEBUG\PVCMANAGER.FORMMAIN.RESOURCES
E:\1203211155_PVCMANAGER_01V0101_DELIVERYCG\PVCMANAGER\OBJ\X86\DEBUG\PVCMANAGER.PROPERTIES.RESOURCES.RESOURCES
