^C:\DEVELOPMENTCSHARP\FAIMSVIEWER\UCTEXTEDITOR\CDIALOGTEXTEDITOR.RESX
^C:\DEVELOPMENTCSHARP\FAIMSVIEWER\UCTEXTEDITOR\CUCTEXTEDITOR.RESX
^C:\DEVELOPMENTCSHARP\TMCLLGMANAGER\BASIC\UCTEXTEDITOR\CDIALOGTEXTEDITOR.RESX
^C:\DEVELOPMENTCSHARP\TMCLLGMANAGER\BASIC\UCTEXTEDITOR\CUCTEXTEDITOR.RESX
