^C:\DEVELOPMENTCSHARP\PRODUCTNUMBERMANAGER\BASIC\UCTEXTEDITOR\CDIALOGTEXTEDITOR.RESX|C:\DEVELOPMENTCSHARP\PRODUCTNUMBERMANAGER\BASIC\UCTEXTEDITOR\CUCTEXTEDITOR.RESX
C:\DEVELOPMENTCSHARP\PRODUCTNUMBERMANAGER\BASIC\UCTEXTEDITOR\OBJ\DEBUG\UCTEXTEDITOR.CDIALOGTEXTEDITOR.RESOURCES
C:\DEVELOPMENTCSHARP\PRODUCTNUMBERMANAGER\BASIC\UCTEXTEDITOR\OBJ\DEBUG\UCTEXTEDITOR.CUCEDITTEXTEDITOR.RESOURCES
