    5    5   10  100 LeftRight
 1800 1800  100    1  100
 1900 1800  100    0   10
 2000 1800  100    1   10
 2100 1800  100    0   10
 2200 1800  100    1   10
 1800 1900  100    0  100
 1900 1900  100    1   10
 2000 1900  100    0   10
 2100 1900  100    1   10
 2200 1900  100    0   10
 1800 2000  100    1  100
 1900 2000  100    0   10
 2000 2000  100    1   10
 2100 2000  100    0   10
 2200 2000  100    1   10
 1800 2100  100    0  100
 1900 2100  100    1   10
 2000 2100  100    0   10
 2100 2100  100    1   10
 2200 2100  100    0   10
 1800 2200  100    1  100
 1900 2200  100    0   10
 2000 2200  100    1   10
 2100 2200  100    0   10
 2200 2200  100    1   10

