^C:\DEVELOPMENTCSHARP\FAIMSVIEWER\UCTEXTEDITOR\CDIALOGTEXTEDITOR.RESX|C:\DEVELOPMENTCSHARP\FAIMSVIEWER\UCTEXTEDITOR\CUCTEXTEDITOR.RESX
C:\DEVELOPMENTCSHARP\FAIMSVIEWER\UCTEXTEDITOR\OBJ\DEBUG\UCTEXTEDITOR.CDIALOGTEXTEDITOR.RESOURCES
C:\DEVELOPMENTCSHARP\FAIMSVIEWER\UCTEXTEDITOR\OBJ\DEBUG\UCTEXTEDITOR.CUCEDITTEXTEDITOR.RESOURCES
^C:\DEVELOPMENTCSHARP\TMCLLGMANAGER\BASIC\UCTEXTEDITOR\CDIALOGTEXTEDITOR.RESX|C:\DEVELOPMENTCSHARP\TMCLLGMANAGER\BASIC\UCTEXTEDITOR\CUCTEXTEDITOR.RESX
C:\DEVELOPMENTCSHARP\TMCLLGMANAGER\BASIC\UCTEXTEDITOR\OBJ\DEBUG\UCTEXTEDITOR.CDIALOGTEXTEDITOR.RESOURCES
C:\DEVELOPMENTCSHARP\TMCLLGMANAGER\BASIC\UCTEXTEDITOR\OBJ\DEBUG\UCTEXTEDITOR.CUCEDITTEXTEDITOR.RESOURCES
