^C:\DEVELOPMENTCSHARP\BUBBLEPOINT\BASIC\UCNOTIFIER\CDIALOGAPPLICATIONPRODUCTMANAGER.RESX
^C:\DEVELOPMENTCSHARP\BUBBLEPOINT\BASIC\UCNOTIFIER\CDIALOGDEVICEPRODUCTMANAGER.RESX
^C:\DEVELOPMENTCSHARP\BUBBLEPOINT\BASIC\UCNOTIFIER\CDIALOGEDITPROTOCOLPARAMETER.RESX
^C:\DEVELOPMENTCSHARP\BUBBLEPOINT\BASIC\UCNOTIFIER\CDIALOGSAVEPRODUCTCONFIGURATION.RESX
^C:\DEVELOPMENTCSHARP\BUBBLEPOINT\BASIC\UCNOTIFIER\CUCAPPLICATION.RESX
^C:\DEVELOPMENTCSHARP\BUBBLEPOINT\BASIC\UCNOTIFIER\CUCAPPLICATIONMANAGER.RESX
^C:\DEVELOPMENTCSHARP\BUBBLEPOINT\BASIC\UCNOTIFIER\CUCDEVICE.RESX
^C:\DEVELOPMENTCSHARP\BUBBLEPOINT\BASIC\UCNOTIFIER\CUCDEVICEMANAGER.RESX
^C:\DEVELOPMENTCSHARP\BUBBLEPOINT\BASIC\UCNOTIFIER\CUCLISTBOX.RESX
^C:\DEVELOPMENTCSHARP\BUBBLEPOINT\BASIC\UCNOTIFIER\CUCNOTIFIER.RESX
^C:\DEVELOPMENTCSHARP\BUBBLEPOINT\BASIC\UCNOTIFIER\CUCNOTIFIERBASE.RESX
