^C:\DEVELOPMENTCSHARP\PRODUCTNUMBERMANAGER\BASIC\INITDATA\DIALOGABOUT.RESX|C:\DEVELOPMENTCSHARP\PRODUCTNUMBERMANAGER\BASIC\INITDATA\PROPERTIES\RESOURCES.RESX
C:\DEVELOPMENTCSHARP\PRODUCTNUMBERMANAGER\BASIC\INITDATA\OBJ\DEBUG\INITDATA.DIALOGABOUT.RESOURCES
C:\DEVELOPMENTCSHARP\PRODUCTNUMBERMANAGER\BASIC\INITDATA\OBJ\DEBUG\INITDATA.PROPERTIES.RESOURCES.RESOURCES
