Country,Avg. Possession,Avg. Passes,Avg. Pass Accuracy,Avg. Fouls,Avg. Yellow Cards,Avg. Red Cards
Italy,54.86,592.29,85.57,13.29,1.71,0.00
Wales,37.00,309.75,78.50,9.25,2.25,0.50
Switzerland,55.67,514.67,86.67,11.67,1.67,0.00
Croatia,49.5,489,83.5,13.25,1.75,0
Turkey,49.67,449.33,82.33,16.00,2.33,0.00
Belgium,53.80,573.80,85.60,12.60,0.80,0.00
Denmark,53.33,493.50,81.33,12.33,0.83,0.00
Finland,36.67,380.33,76.67,10.00,1.33,0.00
Russia,42.33,404.00,74.00,12.67,1.67,0.00
Netharlands,54.75,540.00,80.75,10.00,0.75,0.25
Austria,53.50,540.75,81.00,13.75,1.50,0.00
Ukraine,49.00,534.80,84.40,8.80,0.80,0.00
North Mecedonia,41.67,380.33,79.67,11.00,2.67,0.00
England,52.8,521.14,86,9.6,0.8,0
Czech Republic,48.2,410.6,75.6,10.2,1.2,0
Scotland,43.33,382,77.66,9.33,1,0
Sweden,33.25,371.25,68.75,12.75,1.25,0.25
Spain,73.6,816.4,88.6,11.6,1,0
Slovakia,45,455.66,82.33,11.33,2,0
Poland,49.33,410,74.33,15,2,0.33
France,53.25,574.75,88.5,9.25,2,0
Germany,62.75,630.5,88,10.5,1.75,0
Portugal,58.25,597.25,89,12,1.5,0
Hungry,29,286.33,75.33,12.33,2,0