189.514	109.83
189.973	109.83
190.431	109.83
190.889	-57.65
191.348	22.45
191.806	-18.81
192.264	-18.81
192.722	-28.52
193.18	-18.81
193.638	10.32
194.096	-16.38
194.554	-86.77
195.012	17.6
195.47	-11.53
195.928	24.88
196.385	-9.1
196.843	44.3
197.301	7.89
197.758	-26.09
198.216	17.6
198.674	44.3
199.131	49.15
199.589	34.59
200.046	121.97
200.503	107.4
200.961	153.52
201.418	63.71
201.875	124.4
202.332	104.98
202.79	168.09
203.247	148.67
203.704	141.39
204.161	182.65
204.618	160.8
205.075	219.06
205.532	192.36
205.989	211.78
206.445	194.78
206.902	204.49
207.359	214.2
207.816	197.21
208.272	223.91
208.729	170.51
209.185	134.1
209.642	211.78
210.098	177.79
210.555	143.81
211.011	153.52
211.467	175.37
211.924	160.8
212.38	158.38
212.836	148.67
213.292	136.53
213.748	236.05
214.204	175.37
214.66	163.23
215.116	155.95
215.572	197.21
216.028	175.37
216.484	211.78
216.94	180.22
217.396	180.22
217.851	153.52
218.307	172.94
218.763	226.34
219.218	163.23
219.674	141.39
220.129	158.38
220.585	170.51
221.04	187.5
221.496	102.55
221.951	124.4
222.406	165.66
222.861	204.49
223.317	131.68
223.772	143.81
224.227	80.71
224.682	134.1
225.137	168.09
225.592	109.83
226.047	151.09
226.502	129.25
226.957	170.51
227.411	202.07
227.866	228.77
228.321	87.99
228.776	192.36
229.23	206.92
229.685	187.5
230.139	180.22
230.594	194.78
231.048	187.5
231.503	134.1
231.957	104.98
232.411	160.8
232.865	180.22
233.32	160.8
233.774	180.22
234.228	151.09
234.682	148.67
235.136	102.55
235.59	209.35
236.044	148.67
236.498	199.64
236.952	170.51
237.406	165.66
237.86	168.09
238.313	124.4
238.767	238.47
239.221	204.49
239.674	211.78
240.128	170.51
240.581	192.36
241.035	102.55
241.488	90.41
241.942	131.68
242.395	92.84
242.848	168.09
243.301	180.22
243.755	253.04
244.208	192.36
244.661	206.92
245.114	172.94
245.567	151.09
246.02	141.39
246.473	172.94
246.926	187.5
247.379	160.8
247.832	131.68
248.284	228.77
248.737	209.35
249.19	192.36
249.642	209.35
250.095	202.07
250.547	138.96
251	211.78
251.452	219.06
251.905	109.83
252.357	153.52
252.81	182.65
253.262	204.49
253.714	233.62
254.166	175.37
254.618	177.79
255.07	124.4
255.523	163.23
255.975	138.96
256.427	63.71
256.878	146.24
257.33	180.22
257.782	221.48
258.234	231.19
258.686	158.38
259.137	192.36
259.589	170.51
260.041	170.51
260.492	175.37
260.944	165.66
261.395	124.4
261.847	177.79
262.298	189.93
262.749	104.98
263.201	143.81
263.652	143.81
264.103	141.39
264.554	124.4
265.005	124.4
265.457	158.38
265.908	85.56
266.359	180.22
266.809	197.21
267.26	126.82
267.711	78.28
268.162	180.22
268.613	148.67
269.064	226.34
269.514	143.81
269.965	153.52
270.415	146.24
270.866	153.52
271.316	163.23
271.767	112.26
272.217	221.48
272.668	185.08
273.118	192.36
273.568	223.91
274.019	175.37
274.469	148.67
274.919	202.07
275.369	202.07
275.819	214.2
276.269	189.93
276.719	83.13
277.169	177.79
277.619	199.64
278.069	160.8
278.518	148.67
278.968	134.1
279.418	214.2
279.867	177.79
280.317	177.79
280.767	148.67
281.216	189.93
281.666	250.61
282.115	180.22
282.564	129.25
283.014	134.1
283.463	136.53
283.912	221.48
284.361	134.1
284.811	117.11
285.26	185.08
285.709	95.27
286.158	192.36
286.607	180.22
287.056	117.11
287.505	199.64
287.953	172.94
288.402	192.36
288.851	119.54
289.3	124.4
289.748	214.2
290.197	117.11
290.646	202.07
291.094	192.36
291.543	138.96
291.991	126.82
292.439	187.5
292.888	97.7
293.336	187.5
293.784	180.22
294.233	165.66
294.681	168.09
295.129	211.78
295.577	155.95
296.025	165.66
296.473	160.8
296.921	211.78
297.369	148.67
297.817	126.82
298.264	141.39
298.712	126.82
299.16	170.51
299.608	170.51
300.055	131.68
300.503	248.18
300.95	202.07
301.398	165.66
301.845	172.94
302.293	114.69
302.74	170.51
303.187	214.2
303.635	109.83
304.082	141.39
304.529	165.66
304.976	134.1
305.423	165.66
305.87	131.68
306.317	204.49
306.764	143.81
307.211	165.66
307.658	170.51
308.105	194.78
308.552	158.38
308.998	158.38
309.445	121.97
309.892	187.5
310.338	112.26
310.785	228.77
311.231	228.77
311.678	182.65
312.124	100.12
312.571	146.24
313.017	151.09
313.463	211.78
313.909	211.78
314.356	119.54
314.802	177.79
315.248	199.64
315.694	151.09
316.14	158.38
316.586	170.51
317.032	158.38
317.478	187.5
317.923	255.47
318.369	151.09
318.815	141.39
319.261	151.09
319.706	71
320.152	165.66
320.597	155.95
321.043	158.38
321.488	194.78
321.934	189.93
322.379	155.95
322.824	177.79
323.27	129.25
323.715	138.96
324.16	187.5
324.605	151.09
325.05	141.39
325.495	153.52
325.94	211.78
326.385	117.11
326.83	165.66
327.275	73.42
327.72	138.96
328.165	121.97
328.61	287.02
329.054	155.95
329.499	204.49
329.943	221.48
330.388	146.24
330.832	148.67
331.277	134.1
331.721	182.65
332.166	172.94
332.61	102.55
333.054	119.54
333.499	160.8
333.943	175.37
334.387	197.21
334.831	114.69
335.275	170.51
335.719	172.94
336.163	197.21
336.607	206.92
337.051	170.51
337.495	228.77
337.938	95.27
338.382	134.1
338.826	165.66
339.269	197.21
339.713	146.24
340.157	114.69
340.6	228.77
341.044	126.82
341.487	172.94
341.93	206.92
342.374	126.82
342.817	219.06
343.26	134.1
343.703	206.92
344.146	221.48
344.59	204.49
345.033	170.51
345.476	185.08
345.919	236.05
346.361	165.66
346.804	124.4
347.247	182.65
347.69	168.09
348.133	155.95
348.575	158.38
349.018	170.51
349.461	197.21
349.903	202.07
350.346	136.53
350.788	158.38
351.23	160.8
351.673	131.68
352.115	114.69
352.557	85.56
353	236.05
353.442	165.66
353.884	124.4
354.326	189.93
354.768	148.67
355.21	189.93
355.652	134.1
356.094	168.09
356.536	163.23
356.978	165.66
357.419	138.96
357.861	214.2
358.303	160.8
358.744	211.78
359.186	134.1
359.627	209.35
360.069	185.08
360.51	102.55
360.952	221.48
361.393	160.8
361.834	136.53
362.276	168.09
362.717	168.09
363.158	141.39
363.599	192.36
364.04	141.39
364.481	126.82
364.922	129.25
365.363	151.09
365.804	219.06
366.245	163.23
366.686	206.92
367.126	153.52
367.567	211.78
368.008	134.1
368.448	155.95
368.889	124.4
369.33	155.95
369.77	185.08
370.21	194.78
370.651	236.05
371.091	187.5
371.531	165.66
371.972	214.2
372.412	236.05
372.852	131.68
373.292	92.84
373.732	214.2
374.172	197.21
374.612	107.4
375.052	168.09
375.492	172.94
375.932	138.96
376.372	102.55
376.811	172.94
377.251	202.07
377.691	187.5
378.13	197.21
378.57	209.35
379.009	185.08
379.449	206.92
379.888	202.07
380.328	185.08
380.767	214.2
381.206	158.38
381.645	153.52
382.085	199.64
382.524	126.82
382.963	214.2
383.402	226.34
383.841	187.5
384.28	187.5
384.719	177.79
385.158	180.22
385.596	182.65
386.035	165.66
386.474	228.77
386.913	185.08
387.351	172.94
387.79	216.63
388.228	153.52
388.667	153.52
389.105	216.63
389.544	148.67
389.982	126.82
390.42	148.67
390.859	180.22
391.297	143.81
391.735	165.66
392.173	211.78
392.611	151.09
393.049	153.52
393.487	124.4
393.925	209.35
394.363	185.08
394.801	170.51
395.239	182.65
395.676	175.37
396.114	143.81
396.552	124.4
396.989	182.65
397.427	141.39
397.864	129.25
398.302	170.51
398.739	148.67
399.177	124.4
399.614	141.39
400.051	172.94
400.488	192.36
400.926	221.48
401.363	100.12
401.8	168.09
402.237	204.49
402.674	194.78
403.111	163.23
403.548	95.27
403.985	168.09
404.421	114.69
404.858	141.39
405.295	202.07
405.732	141.39
406.168	182.65
406.605	185.08
407.041	160.8
407.478	209.35
407.914	165.66
408.351	119.54
408.787	153.52
409.223	175.37
409.66	187.5
410.096	202.07
410.532	189.93
410.968	165.66
411.404	165.66
411.84	172.94
412.276	248.18
412.712	121.97
413.148	228.77
413.584	143.81
414.02	221.48
414.455	158.38
414.891	177.79
415.327	163.23
415.762	100.12
416.198	160.8
416.633	119.54
417.069	158.38
417.504	236.05
417.94	163.23
418.375	138.96
418.81	206.92
419.245	168.09
419.681	168.09
420.116	117.11
420.551	151.09
420.986	192.36
421.421	180.22
421.856	172.94
422.291	119.54
422.726	124.4
423.16	192.36
423.595	177.79
424.03	182.65
424.464	189.93
424.899	143.81
425.334	163.23
425.768	160.8
426.203	168.09
426.637	233.62
427.071	151.09
427.506	119.54
427.94	131.68
428.374	199.64
428.809	151.09
429.243	185.08
429.677	192.36
430.111	177.79
430.545	155.95
430.979	148.67
431.413	160.8
431.847	236.05
432.28	151.09
432.714	158.38
433.148	102.55
433.582	102.55
434.015	197.21
434.449	143.81
434.882	177.79
435.316	180.22
435.749	209.35
436.183	117.11
436.616	153.52
437.049	170.51
437.483	126.82
437.916	182.65
438.349	202.07
438.782	199.64
439.215	204.49
439.648	175.37
440.081	165.66
440.514	233.62
440.947	209.35
441.38	134.1
441.813	131.68
442.245	172.94
442.678	146.24
443.111	185.08
443.543	155.95
443.976	141.39
444.408	177.79
444.841	160.8
445.273	151.09
445.705	172.94
446.138	182.65
446.57	192.36
447.002	134.1
447.434	257.89
447.867	153.52
448.299	211.78
448.731	168.09
449.163	214.2
449.595	189.93
450.026	163.23
450.458	153.52
450.89	170.51
451.322	231.19
451.754	194.78
452.185	209.35
452.617	202.07
453.048	270.03
453.48	236.05
453.911	260.32
454.343	211.78
454.774	192.36
455.205	236.05
455.637	172.94
456.068	194.78
456.499	243.33
456.93	294.3
457.361	250.61
457.792	192.36
458.223	267.6
458.654	199.64
459.085	185.08
459.516	182.65
459.947	197.21
460.378	163.23
460.808	204.49
461.239	236.05
461.669	155.95
462.1	192.36
462.531	177.79
462.961	158.38
463.391	131.68
463.822	119.54
464.252	238.47
464.682	153.52
465.113	168.09
465.543	155.95
465.973	233.62
466.403	216.63
466.833	206.92
467.263	143.81
467.693	243.33
468.123	170.51
468.553	214.2
468.983	153.52
469.412	240.9
469.842	226.34
470.272	289.45
470.701	189.93
471.131	209.35
471.56	153.52
471.99	219.06
472.419	170.51
472.849	151.09
473.278	172.94
473.707	197.21
474.136	189.93
474.566	255.47
474.995	219.06
475.424	189.93
475.853	158.38
476.282	192.36
476.711	155.95
477.14	158.38
477.569	202.07
477.997	226.34
478.426	148.67
478.855	202.07
479.283	216.63
479.712	243.33
480.141	192.36
480.569	138.96
480.998	146.24
481.426	187.5
481.854	206.92
482.283	248.18
482.711	160.8
483.139	180.22
483.567	170.51
483.995	177.79
484.424	226.34
484.852	102.55
485.28	194.78
485.708	233.62
486.135	240.9
486.563	155.95
486.991	168.09
487.419	155.95
487.847	226.34
488.274	221.48
488.702	197.21
489.129	214.2
489.557	175.37
489.984	243.33
490.412	202.07
490.839	155.95
491.266	226.34
491.694	197.21
492.121	172.94
492.548	172.94
492.975	209.35
493.402	199.64
493.829	192.36
494.256	194.78
494.683	163.23
495.11	236.05
495.537	199.64
495.964	151.09
496.39	206.92
496.817	138.96
497.244	112.26
497.67	155.95
498.097	236.05
498.523	177.79
498.95	170.51
499.376	221.48
499.803	129.25
500.229	163.23
500.655	211.78
501.081	160.8
501.508	214.2
501.934	202.07
502.36	221.48
502.786	160.8
503.212	197.21
503.638	146.24
504.064	209.35
504.489	180.22
504.915	155.95
505.341	143.81
505.767	163.23
506.192	192.36
506.618	192.36
507.043	185.08
507.469	211.78
507.894	199.64
508.32	177.79
508.745	209.35
509.17	192.36
509.596	151.09
510.021	158.38
510.446	141.39
510.871	109.83
511.296	168.09
511.721	163.23
512.146	177.79
512.571	192.36
512.996	216.63
513.421	126.82
513.845	158.38
514.27	170.51
514.695	182.65
515.119	160.8
515.544	189.93
515.969	153.52
516.393	175.37
516.817	117.11
517.242	182.65
517.666	180.22
518.09	187.5
518.515	143.81
518.939	187.5
519.363	340.42
519.787	199.64
520.211	199.64
520.635	182.65
521.059	177.79
521.483	192.36
521.907	126.82
522.331	211.78
522.754	231.19
523.178	155.95
523.602	177.79
524.025	136.53
524.449	233.62
524.872	143.81
525.296	194.78
525.719	185.08
526.143	209.35
526.566	126.82
526.989	163.23
527.412	211.78
527.836	253.04
528.259	197.21
528.682	119.54
529.105	274.88
529.528	197.21
529.951	182.65
530.374	199.64
530.796	216.63
531.219	226.34
531.642	202.07
532.065	146.24
532.487	211.78
532.91	187.5
533.332	185.08
533.755	163.23
534.177	153.52
534.6	180.22
535.022	170.51
535.444	238.47
535.867	214.2
536.289	151.09
536.711	172.94
537.133	163.23
537.555	216.63
537.977	185.08
538.399	177.79
538.821	236.05
539.243	163.23
539.665	248.18
540.086	194.78
540.508	265.17
540.93	282.16
541.351	206.92
541.773	172.94
542.195	211.78
542.616	289.45
543.037	243.33
543.459	231.19
543.88	199.64
544.301	221.48
544.723	231.19
545.144	253.04
545.565	277.31
545.986	248.18
546.407	243.33
546.828	245.76
547.249	240.9
547.67	206.92
548.091	189.93
548.512	243.33
548.932	187.5
549.353	245.76
549.774	189.93
550.194	194.78
550.615	219.06
551.035	211.78
551.456	204.49
551.876	216.63
552.296	214.2
552.717	187.5
553.137	148.67
553.557	202.07
553.977	206.92
554.397	206.92
554.817	199.64
555.237	262.75
555.657	153.52
556.077	148.67
556.497	214.2
556.917	240.9
557.337	199.64
557.756	233.62
558.176	187.5
558.596	194.78
559.015	170.51
559.435	189.93
559.854	202.07
560.274	216.63
560.693	221.48
561.112	180.22
561.532	158.38
561.951	221.48
562.37	185.08
562.789	206.92
563.208	194.78
563.627	253.04
564.046	189.93
564.465	185.08
564.884	117.11
565.303	136.53
565.722	180.22
566.14	233.62
566.559	172.94
566.978	233.62
567.396	270.03
567.815	175.37
568.233	216.63
568.652	158.38
569.07	155.95
569.489	180.22
569.907	185.08
570.325	102.55
570.743	119.54
571.161	160.8
571.58	185.08
571.998	243.33
572.416	214.2
572.833	233.62
573.251	163.23
573.669	197.21
574.087	189.93
574.505	121.97
574.922	192.36
575.34	192.36
575.758	206.92
576.175	177.79
576.593	168.09
577.01	214.2
577.428	182.65
577.845	1830.73
578.262	352.55
578.68	185.08
579.097	90.41
579.514	158.38
579.931	141.39
580.348	214.2
580.765	143.81
581.182	245.76
581.599	182.65
582.016	253.04
582.433	221.48
582.849	148.67
583.266	175.37
583.683	136.53
584.099	211.78
584.516	219.06
584.933	192.36
585.349	223.91
585.765	126.82
586.182	151.09
586.598	151.09
587.014	153.52
587.431	206.92
587.847	160.8
588.263	165.66
588.679	158.38
589.095	107.4
589.511	209.35
589.927	151.09
590.343	146.24
590.759	155.95
591.174	163.23
591.59	209.35
592.006	197.21
592.421	231.19
592.837	151.09
593.252	168.09
593.668	226.34
594.083	187.5
594.499	209.35
594.914	265.17
595.329	165.66
595.745	189.93
596.16	243.33
596.575	192.36
596.99	279.74
597.405	138.96
597.82	185.08
598.235	182.65
598.65	270.03
599.065	165.66
599.479	202.07
599.894	155.95
600.309	209.35
600.724	146.24
601.138	228.77
601.553	204.49
601.967	163.23
602.382	189.93
602.796	155.95
603.21	228.77
603.625	143.81
604.039	182.65
604.453	148.67
604.867	185.08
605.281	170.51
605.695	204.49
606.109	189.93
606.523	214.2
606.937	238.47
607.351	253.04
607.765	177.79
608.178	160.8
608.592	158.38
609.006	189.93
609.419	136.53
609.833	226.34
610.246	187.5
610.66	226.34
611.073	165.66
611.487	233.62
611.9	143.81
612.313	160.8
612.726	211.78
613.139	233.62
613.553	158.38
613.966	199.64
614.379	209.35
614.792	206.92
615.204	265.17
615.617	163.23
616.03	189.93
616.443	165.66
616.856	194.78
617.268	211.78
617.681	146.24
618.093	168.09
618.506	155.95
618.918	180.22
619.331	158.38
619.743	202.07
620.155	126.82
620.568	219.06
620.98	163.23
621.392	172.94
621.804	243.33
622.216	206.92
622.628	153.52
623.04	206.92
623.452	153.52
623.864	187.5
624.276	175.37
624.687	138.96
625.099	158.38
625.511	245.76
625.922	187.5
626.334	146.24
626.745	160.8
627.157	194.78
627.568	136.53
627.979	209.35
628.391	148.67
628.802	68.57
629.213	172.94
629.624	223.91
630.035	192.36
630.446	160.8
630.857	197.21
631.268	214.2
631.679	209.35
632.09	204.49
632.501	194.78
632.912	172.94
633.322	206.92
633.733	168.09
634.144	238.47
634.554	206.92
634.965	117.11
635.375	95.27
635.785	136.53
636.196	168.09
636.606	204.49
637.016	163.23
637.427	143.81
637.837	175.37
638.247	228.77
638.657	197.21
639.067	202.07
639.477	153.52
639.887	172.94
640.297	160.8
640.706	223.91
641.116	131.68
641.526	175.37
641.935	192.36
642.345	124.4
642.755	138.96
643.164	206.92
643.573	296.73
643.983	228.77
644.392	204.49
644.801	185.08
645.211	165.66
645.62	182.65
646.029	148.67
646.438	109.83
646.847	172.94
647.256	95.27
647.665	182.65
648.074	231.19
648.483	129.25
648.892	211.78
649.3	168.09
649.709	197.21
650.118	160.8
650.526	126.82
650.935	187.5
651.343	192.36
651.752	180.22
652.16	114.69
652.568	165.66
652.977	146.24
653.385	146.24
653.793	180.22
654.201	141.39
654.609	192.36
655.017	204.49
655.425	129.25
655.833	153.52
656.241	151.09
656.649	214.2
657.057	148.67
657.464	206.92
657.872	180.22
658.28	168.09
658.687	187.5
659.095	175.37
659.502	168.09
659.91	153.52
660.317	143.81
660.724	175.37
661.132	202.07
661.539	170.51
661.946	143.81
662.353	194.78
662.76	158.38
663.167	209.35
663.574	163.23
663.981	160.8
664.388	102.55
664.795	126.82
665.202	163.23
665.608	170.51
666.015	187.5
666.422	134.1
666.828	138.96
667.235	138.96
667.641	180.22
668.047	148.67
668.454	141.39
668.86	136.53
669.266	187.5
669.673	211.78
670.079	226.34
670.485	129.25
670.891	131.68
671.297	206.92
671.703	172.94
672.109	141.39
672.515	102.55
672.92	182.65
673.326	158.38
673.732	146.24
674.138	153.52
674.543	172.94
674.949	124.4
675.354	126.82
675.76	202.07
676.165	121.97
676.57	158.38
676.976	180.22
677.381	209.35
677.786	175.37
678.191	189.93
678.596	228.77
679.001	138.96
679.406	182.65
679.811	197.21
680.216	114.69
680.621	228.77
681.026	216.63
681.43	168.09
681.835	185.08
682.24	175.37
682.644	158.38
683.049	153.52
683.453	165.66
683.858	158.38
684.262	155.95
684.667	136.53
685.071	168.09
685.475	194.78
685.879	182.65
686.283	209.35
686.687	233.62
687.091	226.34
687.495	107.4
687.899	243.33
688.303	226.34
688.707	180.22
689.111	168.09
689.514	250.61
689.918	134.1
690.322	189.93
690.725	165.66
691.129	199.64
691.532	223.91
691.936	209.35
692.339	185.08
692.742	221.48
693.146	121.97
693.549	214.2
693.952	180.22
694.355	136.53
694.758	165.66
695.161	189.93
695.564	197.21
695.967	206.92
696.37	148.67
696.773	189.93
697.175	163.23
697.578	100.12
697.981	180.22
698.383	146.24
698.786	236.05
699.188	299.16
699.591	160.8
699.993	153.52
700.395	189.93
700.798	223.91
701.2	248.18
701.602	158.38
702.004	238.47
702.406	168.09
702.808	177.79
703.21	216.63
703.612	279.74
704.014	187.5
704.416	240.9
704.818	223.91
705.219	226.34
705.621	211.78
706.023	226.34
706.424	228.77
706.826	236.05
707.227	255.47
707.629	197.21
708.03	260.32
708.431	257.89
708.832	250.61
709.234	172.94
709.635	299.16
710.036	279.74
710.437	250.61
710.838	260.32
711.239	219.06
711.64	248.18
712.041	274.88
712.441	211.78
712.842	311.29
713.243	238.47
713.643	316.15
714.044	250.61
714.445	253.04
714.845	223.91
715.246	255.47
715.646	243.33
716.046	333.14
716.447	313.72
716.847	330.71
717.247	301.58
717.647	345.27
718.047	272.46
718.447	369.54
718.847	248.18
719.247	306.44
719.647	350.13
720.047	388.96
720.446	367.12
720.846	311.29
721.246	374.4
721.645	367.12
722.045	401.1
722.444	374.4
722.844	396.24
723.243	442.36
723.643	425.37
724.042	408.38
724.441	367.12
724.84	393.82
725.24	452.07
725.639	362.26
726.038	503.04
726.437	405.95
726.836	532.17
727.234	473.92
727.633	464.21
728.032	583.14
728.431	517.61
728.83	515.18
729.228	585.57
729.627	706.93
730.025	663.24
730.424	687.51
730.822	738.48
731.22	801.59
731.619	782.17
732.017	748.19
732.415	908.39
732.813	947.22
733.212	1034.6
733.61	1017.61
734.008	1219.07
734.406	1301.6
734.803	1296.74
735.201	1352.57
735.599	1473.93
735.997	1449.66
736.395	1532.18
736.792	1643.84
737.19	1850.15
737.587	1884.13
737.985	1774.91
738.382	1920.54
738.78	2206.95
739.177	2226.37
739.574	2359.87
739.971	2583.17
740.369	2600.16
740.766	2605.02
741.163	2740.94
741.56	2872.01
741.957	2976.38
742.354	3209.39
742.751	3262.79
743.147	3566.2
743.544	3500.66
743.941	3787.07
744.338	3903.58
744.734	4160.87
745.131	4238.54
745.527	4471.55
745.924	4651.16
746.32	5095.35
746.716	5134.18
747.113	5457
747.509	5988.56
747.905	5949.73
748.301	6304.1
748.697	6447.31
749.093	6733.72
749.489	6770.13
749.885	7418.2
750.281	7748.3
750.677	8017.72
751.073	8243.45
751.468	8702.2
751.864	8872.1
752.26	8876.96
752.655	9578.43
753.051	10056.59
753.446	10420.67
753.842	10867.28
754.237	11008.06
754.632	11224.08
755.028	11697.39
755.423	11995.94
755.818	11651.27
756.213	12418.28
756.608	12466.82
757.003	12758.09
757.398	13131.88
757.793	12961.97
758.188	13607.61
758.583	14022.67
758.977	13811.5
759.372	14355.2
759.767	15430.46
760.161	15838.23
760.556	16614.94
760.95	17124.66
761.345	18202.35
761.739	19032.46
762.133	19030.03
762.527	19697.52
762.922	20255.78
763.316	21127.15
763.71	21719.39
764.104	21784.93
764.498	22098.04
764.892	23209.71
765.286	23445.15
765.68	23765.54
766.073	24634.49
766.467	24607.79
766.861	25615.08
767.255	26508.3
767.648	26287.42
768.042	27666.09
768.435	27561.72
768.829	28236.48
769.222	29056.88
769.615	29348.15
770.008	28925.81
770.402	29081.16
770.795	30088.45
771.188	29814.18
771.581	29971.95
771.974	29945.25
772.367	29505.92
772.76	30212.24
773.153	29685.53
773.545	28996.2
773.938	30297.19
774.331	30731.67
774.724	30853.03
775.116	32622.47
775.509	32967.14
775.901	33722.01
776.294	34811.83
776.686	35588.54
777.078	35797.28
777.471	37547.31
777.863	38683.25
778.255	39362.87
778.647	40455.12
779.039	40559.49
779.431	40003.66
779.823	40612.89
780.215	40578.91
780.607	39950.26
780.999	41020.66
781.39	41076.49
781.782	41777.96
782.174	41642.03
782.565	42239.13
782.957	42108.06
783.348	43406.62
783.74	43440.6
784.131	42974.58
784.522	44095.95
784.914	42719.72
785.305	42705.15
785.696	42193.01
786.087	41940.58
786.478	40785.22
786.869	39964.82
787.26	39501.22
787.651	38457.52
788.042	38018.19
788.433	37418.66
788.823	36775.45
789.214	36188.06
789.605	35168.63
789.995	34200.17
790.386	33285.11
790.776	33765.7
791.167	33481.71
791.557	34319.1
791.948	34923.48
792.338	34612.8
792.728	36637.1
793.118	35838.54
793.508	35760.87
793.898	36581.27
794.288	36239.03
794.678	36115.25
795.068	36540.01
795.458	35899.22
795.848	35685.63
796.238	36527.87
796.627	36146.8
797.017	35139.5
797.406	35338.54
797.796	35724.46
798.185	35940.49
798.575	35739.03
798.964	35700.19
799.354	36040
799.743	35838.54
800.132	36394.38
800.521	36248.74
800.91	35656.5
801.299	35134.65
801.688	35253.58
802.077	34576.39
802.466	34777.85
802.855	33908.9
803.244	32942.87
803.633	33171.03
804.021	32501.11
804.41	32345.77
804.799	31340.9
805.187	30564.19
805.576	30022.92
805.964	29146.69
806.352	27940.36
806.741	28573.87
807.129	27289.87
807.517	27450.06
807.905	27018.02
808.293	27343.27
808.681	28212.21
809.069	27687.93
809.457	28251.05
809.845	28437.94
810.233	28746.2
810.621	28639.4
811.009	28501.05
811.396	28428.23
811.784	28452.51
812.171	28001.04
812.559	28076.29
812.946	27195.2
813.334	27090.83
813.721	26549.56
814.108	25175.76
814.496	25105.37
814.883	25047.11
815.27	25758.29
815.657	25098.08
816.044	25238.86
816.431	25340.81
816.818	25085.95
817.205	25110.22
817.592	25083.52
817.979	24221.86
818.365	24124.77
818.752	22554.36
819.139	22081.05
819.525	21687.84
819.912	20784.91
820.298	20736.37
820.685	20559.18
821.071	20216.94
821.457	19670.82
821.843	18702.35
822.23	18243.61
822.616	17321.26
823.002	16826.11
823.388	16551.84
823.774	15796.97
824.16	15549.39
824.546	14738.7
824.931	14362.48
825.317	14025.1
825.703	13828.49
826.089	13782.37
826.474	13794.51
826.86	13449.85
827.245	13204.7
827.631	13005.66
828.016	12920.71
828.401	12488.67
828.787	12357.6
829.172	12194.97
829.557	11872.15
829.942	11539.62
830.327	11085.73
830.712	10947.38
831.097	10806.6
831.482	10556.6
831.867	10330.86
832.252	10345.43
832.636	9940.08
833.021	9663.38
833.406	9532.31
833.79	9321.14
834.175	9156.09
834.559	8927.93
834.944	8794.43
835.328	8544.43
835.713	8126.95
836.097	8003.16
836.481	7558.98
836.865	7444.9
837.249	7214.31
837.633	6806.54
838.017	6862.36
838.401	6488.57
838.785	6389.06
839.169	5954.58
839.553	5927.88
839.937	5821.09
840.32	5440.01
840.704	5357.49
841.087	5112.34
841.471	4791.94
841.854	4779.81
842.238	4757.96
842.621	4425.43
843.004	4214.26
843.388	4165.72
843.771	4262.81
844.154	3944.84
844.537	3961.83
844.92	4151.16
845.303	3947.27
845.686	3906.01
846.069	3818.63
846.452	3855.04
846.834	3546.78
847.217	3539.5
847.6	3355.03
847.982	3398.72
848.365	3187.55
848.748	3156
849.13	3129.3
849.512	3007.94
849.895	3029.78
850.277	2879.29
850.659	2847.74
851.041	2862.3
851.423	2716.67
851.806	2639
852.188	2704.53
852.57	2653.56
852.951	2539.48
853.333	2515.21
853.715	2367.15
854.097	2367.15
854.479	2265.21
854.86	2214.23
855.242	2083.16
855.623	2039.47
856.005	1864.71
856.386	1973.94
856.768	1813.74
857.149	1833.16
857.53	1648.69
857.911	1651.12
858.292	1653.55
858.674	1355
859.055	1488.49
859.436	1405.97
859.817	1345.29
860.197	1274.9
860.578	1277.33
860.959	1189.95
861.34	1131.69
861.72	1204.51
862.101	1228.78
862.482	1049.17
862.862	1029.75
863.243	1061.3
863.623	1056.45
864.003	947.22
864.384	918.1
864.764	964.21
865.144	918.1
865.524	886.54
865.904	806.44
866.284	765.18
866.664	840.43
867.044	772.46
867.424	813.73
867.804	760.33
868.183	760.33
868.563	770.04
868.943	731.2
869.322	711.78
869.702	687.51
870.081	668.09
870.461	663.24
870.84	597.7
871.22	602.56
871.599	604.99
871.978	541.88
872.357	505.47
872.736	503.04
873.115	561.3
873.494	442.36
873.873	478.77
874.252	415.66
874.631	454.5
875.01	476.34
875.388	403.53
875.767	393.82
876.146	323.43
876.524	437.51
876.903	371.97
877.281	337.99
877.66	354.98
878.038	236.05
878.416	313.72
878.794	335.56
879.173	250.61
879.551	277.31
879.929	306.44
880.307	294.3
880.685	352.55
881.063	359.84
881.441	301.58
881.818	325.85
882.196	262.75
882.574	313.72
882.951	328.28
883.329	272.46
883.707	211.78
884.084	233.62
884.461	260.32
884.839	277.31
885.216	267.6
885.593	255.47
885.971	221.48
886.348	238.47
886.725	221.48
887.102	204.49
887.479	243.33
887.856	221.48
888.233	294.3
888.609	197.21
888.986	255.47
889.363	245.76
889.74	209.35
890.116	199.64
890.493	199.64
890.869	194.78
891.246	138.96
891.622	160.8
891.998	206.92
892.375	219.06
892.751	243.33
893.127	168.09
893.503	206.92
893.879	117.11
894.255	304.01
894.631	209.35
895.007	177.79
895.383	187.5
895.759	231.19
896.134	148.67
896.51	182.65
896.886	153.52
897.261	204.49
897.637	185.08
898.012	197.21
898.388	177.79
898.763	185.08
899.138	124.4
899.514	119.54
899.889	163.23
900.264	197.21
900.639	214.2
901.014	153.52
901.389	146.24
901.764	206.92
902.139	131.68
902.513	223.91
902.888	187.5
903.263	189.93
903.638	121.97
904.012	148.67
904.387	172.94
904.761	197.21
905.136	194.78
905.51	204.49
905.884	126.82
906.259	155.95
906.633	92.84
907.007	121.97
907.381	199.64
907.755	102.55
908.129	170.51
908.503	165.66
908.877	109.83
909.251	155.95
909.624	194.78
909.998	155.95
910.372	141.39
910.745	148.67
911.119	199.64
911.492	226.34
911.866	117.11
912.239	185.08
912.612	143.81
912.986	138.96
913.359	134.1
913.732	151.09
914.105	124.4
914.478	180.22
914.851	177.79
915.224	119.54
915.597	180.22
915.97	141.39
916.343	109.83
916.715	192.36
917.088	155.95
917.461	202.07
917.833	197.21
918.206	279.74
918.578	182.65
918.951	151.09
919.323	175.37
919.695	131.68
920.067	211.78
920.44	129.25
920.812	124.4
921.184	180.22
921.556	219.06
921.928	97.7
922.3	134.1
922.672	192.36
923.043	146.24
923.415	124.4
923.787	136.53
924.158	104.98
924.53	170.51
924.901	112.26
925.273	141.39
925.644	187.5
926.016	134.1
926.387	189.93
926.758	187.5
927.129	177.79
927.5	151.09
927.872	221.48
928.243	192.36
928.613	177.79
928.984	119.54
929.355	87.99
929.726	168.09
930.097	189.93
930.467	189.93
930.838	121.97
931.209	131.68
931.579	121.97
931.95	209.35
932.32	165.66
932.69	153.52
933.061	163.23
933.431	223.91
933.801	192.36
934.171	175.37
934.541	151.09
934.911	134.1
935.281	185.08
935.651	192.36
936.021	160.8
936.391	100.12
936.761	104.98
937.13	175.37
937.5	136.53
937.87	223.91
938.239	136.53
938.609	243.33
938.978	257.89
939.347	255.47
939.717	209.35
940.086	170.51
940.455	182.65
940.824	189.93
941.193	194.78
941.562	143.81
941.931	126.82
942.3	206.92
942.669	138.96
943.038	117.11
943.407	119.54
943.775	138.96
944.144	185.08
944.513	204.49
944.881	175.37
945.25	274.88
945.618	187.5
945.986	153.52
946.355	175.37
946.723	180.22
947.091	189.93
947.459	44.3
947.827	124.4
948.195	107.4
948.563	197.21
948.931	114.69
949.299	73.42
949.667	114.69
950.035	131.68
950.402	194.78
950.77	117.11
951.138	117.11
951.505	180.22
951.873	160.8
952.24	163.23
952.607	146.24
952.975	182.65
953.342	146.24
953.709	192.36
954.076	134.1
954.443	146.24
954.81	219.06
955.177	194.78
955.544	223.91
955.911	160.8
956.278	129.25
956.645	189.93
957.012	138.96
957.378	44.3
957.745	68.57
958.111	87.99
958.478	124.4
958.844	204.49
959.211	160.8
959.577	185.08
959.943	165.66
960.309	112.26
960.675	204.49
961.042	151.09
961.408	177.79
961.774	172.94
962.139	131.68
962.505	126.82
962.871	97.7
963.237	134.1
963.603	199.64
963.968	114.69
964.334	124.4
964.699	168.09
965.065	160.8
965.43	192.36
965.796	223.91
966.161	141.39
966.526	131.68
966.891	192.36
967.256	131.68
967.622	199.64
967.987	158.38
968.352	206.92
968.716	90.41
969.081	155.95
969.446	172.94
969.811	158.38
970.176	153.52
970.54	170.51
970.905	197.21
971.269	187.5
971.634	153.52
971.998	83.13
972.363	204.49
972.727	136.53
973.091	146.24
973.455	146.24
973.819	138.96
974.183	148.67
974.547	182.65
974.911	129.25
975.275	197.21
975.639	160.8
976.003	136.53
976.367	109.83
976.73	163.23
977.094	189.93
977.458	172.94
977.821	114.69
978.185	148.67
978.548	168.09
978.911	131.68
979.275	160.8
979.638	126.82
980.001	194.78
980.364	138.96
980.727	170.51
981.09	155.95
981.453	155.95
981.816	97.7
982.179	158.38
982.542	134.1
982.905	231.19
983.267	151.09
983.63	141.39
983.992	177.79
984.355	104.98
984.717	73.42
985.08	158.38
985.442	146.24
985.804	121.97
986.167	214.2
986.529	131.68
986.891	151.09
987.253	141.39
987.615	158.38
987.977	134.1
988.339	131.68
988.701	177.79
989.062	148.67
989.424	124.4
989.786	197.21
990.147	214.2
990.509	177.79
990.87	148.67
991.232	223.91
991.593	155.95
991.955	153.52
992.316	158.38
992.677	126.82
993.038	104.98
993.399	160.8
993.76	129.25
994.121	131.68
994.482	85.56
994.843	107.4
995.204	170.51
995.565	172.94
995.926	202.07
996.286	172.94
996.647	170.51
997.007	138.96
997.368	199.64
997.728	119.54
998.089	189.93
998.449	71
998.809	160.8
999.169	192.36
999.53	204.49
999.89	160.8
1000.25	160.8
1000.61	168.09
1000.97	155.95
1001.329	177.79
1001.689	126.82
1002.049	153.52
1002.409	107.4
1002.768	158.38
1003.128	185.08
1003.487	153.52
1003.847	160.8
1004.206	202.07
1004.566	219.06
1004.925	192.36
1005.284	172.94
1005.643	180.22
1006.003	192.36
1006.362	185.08
1006.721	168.09
1007.08	160.8
1007.438	151.09
1007.797	185.08
1008.156	107.4
1008.515	163.23
1008.874	214.2
1009.232	172.94
1009.591	138.96
1009.949	253.04
1010.308	124.4
1010.666	187.5
1011.024	138.96
1011.383	143.81
1011.741	170.51
1012.099	168.09
1012.457	104.98
1012.815	95.27
1013.173	187.5
1013.531	192.36
1013.889	138.96
1014.247	204.49
1014.605	136.53
1014.962	114.69
1015.32	158.38
1015.678	126.82
1016.035	141.39
1016.393	117.11
1016.75	160.8
1017.107	187.5
1017.465	160.8
1017.822	68.57
1018.179	211.78
1018.536	134.1
1018.894	172.94
1019.251	253.04
1019.608	141.39
1019.964	175.37
1020.321	56.43
1020.678	146.24
1021.035	97.7
1021.392	165.66
1021.748	221.48
1022.105	223.91
1022.461	126.82
1022.818	163.23
1023.174	71
1023.531	143.81
1023.887	138.96
1024.243	92.84
1024.599	117.11
1024.955	158.38
1025.311	56.43
1025.667	126.82
1026.023	83.13
1026.379	170.51
1026.735	138.96
1027.091	163.23
1027.447	170.51
