189.514	19.72
189.973	19.72
190.431	19.72
190.889	-28.82
191.348	10.01
191.806	43.99
192.264	-70.09
192.722	-26.4
193.18	41.57
193.638	-82.22
194.096	39.14
194.554	-14.26
195.012	5.16
195.47	7.59
195.928	-33.68
196.385	31.86
196.843	0.3
197.301	36.71
197.758	39.14
198.216	31.86
198.674	-38.53
199.131	31.86
199.589	94.97
200.046	102.25
200.503	60.98
200.961	87.68
201.418	65.84
201.875	104.67
202.332	158.07
202.79	92.54
203.247	148.36
203.704	155.65
204.161	235.74
204.618	136.23
205.075	150.79
205.532	131.37
205.989	162.93
206.445	170.21
206.902	153.22
207.359	230.89
207.816	136.23
208.272	158.07
208.729	143.51
209.185	199.34
209.642	141.08
210.098	133.8
210.555	172.64
211.011	182.35
211.467	189.63
211.924	131.37
212.38	136.23
212.836	167.78
213.292	133.8
213.748	116.81
214.204	170.21
214.66	136.23
215.116	211.47
215.572	150.79
216.028	158.07
216.484	179.92
216.94	199.34
217.396	230.89
217.851	145.94
218.307	162.93
218.763	177.49
219.218	199.34
219.674	153.22
220.129	116.81
220.585	138.66
221.04	133.8
221.496	187.2
221.951	187.2
222.406	143.51
222.861	175.06
223.317	160.5
223.772	102.25
224.227	85.26
224.682	124.09
225.137	128.95
225.592	136.23
226.047	211.47
226.502	136.23
226.957	204.19
227.411	170.21
227.866	153.22
228.321	206.62
228.776	104.67
229.23	138.66
229.685	124.09
230.139	80.4
230.594	196.91
231.048	153.22
231.503	160.5
231.957	218.75
232.411	153.22
232.865	179.92
233.32	155.65
233.774	160.5
234.228	92.54
234.682	184.77
235.136	128.95
235.59	128.95
236.044	160.5
236.498	194.48
236.952	138.66
237.406	167.78
237.86	148.36
238.313	128.95
238.767	192.05
239.221	153.22
239.674	131.37
240.128	124.09
240.581	175.06
241.035	114.38
241.488	114.38
241.942	87.68
242.395	184.77
242.848	167.78
243.301	19.72
243.755	80.4
244.208	128.95
244.661	94.97
245.114	196.91
245.567	102.25
246.02	119.24
246.473	97.39
246.926	172.64
247.379	138.66
247.832	213.9
248.284	179.92
248.737	158.07
249.19	165.35
249.642	99.82
250.095	124.09
250.547	102.25
251	99.82
251.452	141.08
251.905	119.24
252.357	104.67
252.81	150.79
253.262	111.96
253.714	136.23
254.166	65.84
254.618	148.36
255.07	102.25
255.523	133.8
255.975	145.94
256.427	136.23
256.878	131.37
257.33	184.77
257.782	116.81
258.234	165.35
258.686	155.65
259.137	138.66
259.589	162.93
260.041	124.09
260.492	206.62
260.944	121.66
261.395	145.94
261.847	279.43
262.298	87.68
262.749	97.39
263.201	172.64
263.652	175.06
264.103	150.79
264.554	133.8
265.005	153.22
265.457	160.5
265.908	111.96
266.359	133.8
266.809	153.22
267.26	184.77
267.711	68.27
268.162	90.11
268.613	196.91
269.064	107.1
269.514	150.79
269.965	121.66
270.415	70.69
270.866	194.48
271.316	162.93
271.767	126.52
272.217	99.82
272.668	109.53
273.118	114.38
273.568	196.91
274.019	184.77
274.469	145.94
274.919	131.37
275.369	175.06
275.819	182.35
276.269	209.04
276.719	138.66
277.169	90.11
277.619	175.06
278.069	145.94
278.518	128.95
278.968	177.49
279.418	165.35
279.867	177.49
280.317	199.34
280.767	124.09
281.216	102.25
281.666	92.54
282.115	160.5
282.564	124.09
283.014	124.09
283.463	104.67
283.912	109.53
284.361	187.2
284.811	138.66
285.26	128.95
285.709	179.92
286.158	199.34
286.607	175.06
287.056	204.19
287.505	165.35
287.953	155.65
288.402	43.99
288.851	126.52
289.3	175.06
289.748	179.92
290.197	148.36
290.646	148.36
291.094	87.68
291.543	121.66
291.991	192.05
292.439	179.92
292.888	136.23
293.336	102.25
293.784	126.52
294.233	189.63
294.681	143.51
295.129	143.51
295.577	209.04
296.025	206.62
296.473	97.39
296.921	175.06
297.369	121.66
297.817	131.37
298.264	184.77
298.712	136.23
299.16	153.22
299.608	204.19
300.055	128.95
300.503	111.96
300.95	240.6
301.398	177.49
301.845	136.23
302.293	136.23
302.74	184.77
303.187	119.24
303.635	172.64
304.082	111.96
304.529	145.94
304.976	228.46
305.423	175.06
305.87	114.38
306.317	92.54
306.764	165.35
307.211	150.79
307.658	184.77
308.105	145.94
308.552	167.78
308.998	121.66
309.445	141.08
309.892	141.08
310.338	196.91
310.785	155.65
311.231	175.06
311.678	111.96
312.124	145.94
312.571	196.91
313.017	189.63
313.463	155.65
313.909	80.4
314.356	145.94
314.802	167.78
315.248	111.96
315.694	128.95
316.14	143.51
316.586	211.47
317.032	158.07
317.478	243.03
317.923	230.89
318.369	153.22
318.815	204.19
319.261	196.91
319.706	90.11
320.152	99.82
320.597	143.51
321.043	90.11
321.488	150.79
321.934	170.21
322.379	153.22
322.824	116.81
323.27	255.16
323.715	124.09
324.16	109.53
324.605	114.38
325.05	116.81
325.495	170.21
325.94	211.47
326.385	218.75
326.83	172.64
327.275	177.49
327.72	187.2
328.165	128.95
328.61	153.22
329.054	109.53
329.499	162.93
329.943	187.2
330.388	187.2
330.832	145.94
331.277	121.66
331.721	267.3
332.166	141.08
332.61	133.8
333.054	153.22
333.499	131.37
333.943	114.38
334.387	121.66
334.831	218.75
335.275	104.67
335.719	145.94
336.163	204.19
336.607	85.26
337.051	167.78
337.495	206.62
337.938	192.05
338.382	148.36
338.826	182.35
339.269	148.36
339.713	131.37
340.157	172.64
340.6	179.92
341.044	97.39
341.487	133.8
341.93	158.07
342.374	175.06
342.817	199.34
343.26	121.66
343.703	194.48
344.146	99.82
344.59	187.2
345.033	126.52
345.476	148.36
345.919	148.36
346.361	145.94
346.804	150.79
347.247	158.07
347.69	85.26
348.133	170.21
348.575	192.05
349.018	116.81
349.461	114.38
349.903	201.76
350.346	160.5
350.788	116.81
351.23	111.96
351.673	121.66
352.115	199.34
352.557	136.23
353	82.83
353.442	143.51
353.884	136.23
354.326	165.35
354.768	131.37
355.21	114.38
355.652	238.17
356.094	211.47
356.536	182.35
356.978	216.33
357.419	264.87
357.861	226.04
358.303	182.35
358.744	136.23
359.186	170.21
359.627	133.8
360.069	126.52
360.51	177.49
360.952	126.52
361.393	179.92
361.834	141.08
362.276	80.4
362.717	99.82
363.158	145.94
363.599	223.61
364.04	87.68
364.481	172.64
364.922	175.06
365.363	82.83
365.804	158.07
366.245	153.22
366.686	63.41
367.126	175.06
367.567	223.61
368.008	158.07
368.448	82.83
368.889	136.23
369.33	177.49
369.77	189.63
370.21	160.5
370.651	136.23
371.091	153.22
371.531	124.09
371.972	136.23
372.412	170.21
372.852	133.8
373.292	201.76
373.732	177.49
374.172	104.67
374.612	124.09
375.052	145.94
375.492	245.45
375.932	179.92
376.372	114.38
376.811	133.8
377.251	107.1
377.691	131.37
378.13	128.95
378.57	199.34
379.009	162.93
379.449	109.53
379.888	172.64
380.328	126.52
380.767	221.18
381.206	155.65
381.645	119.24
382.085	165.35
382.524	150.79
382.963	160.5
383.402	233.32
383.841	160.5
384.28	155.65
384.719	177.49
385.158	107.1
385.596	116.81
386.035	165.35
386.474	102.25
386.913	107.1
387.351	160.5
387.79	218.75
388.228	111.96
388.667	160.5
389.105	184.77
389.544	131.37
389.982	68.27
390.42	226.04
390.859	211.47
391.297	104.67
391.735	94.97
392.173	155.65
392.611	218.75
393.049	228.46
393.487	121.66
393.925	131.37
394.363	240.6
394.801	133.8
395.239	141.08
395.676	107.1
396.114	111.96
396.552	131.37
396.989	145.94
397.427	87.68
397.864	148.36
398.302	97.39
398.739	194.48
399.177	158.07
399.614	92.54
400.051	172.64
400.488	119.24
400.926	175.06
401.363	133.8
401.8	160.5
402.237	158.07
402.674	133.8
403.111	184.77
403.548	136.23
403.985	153.22
404.421	145.94
404.858	172.64
405.295	162.93
405.732	82.83
406.168	77.97
406.605	184.77
407.041	126.52
407.478	170.21
407.914	165.35
408.351	172.64
408.787	179.92
409.223	143.51
409.66	107.1
410.096	119.24
410.532	177.49
410.968	182.35
411.404	221.18
411.84	111.96
412.276	121.66
412.712	158.07
413.148	65.84
413.584	87.68
414.02	114.38
414.455	184.77
414.891	155.65
415.327	143.51
415.762	141.08
416.198	145.94
416.633	167.78
417.069	116.81
417.504	82.83
417.94	158.07
418.375	104.67
418.81	119.24
419.245	172.64
419.681	114.38
420.116	162.93
420.551	131.37
420.986	126.52
421.421	204.19
421.856	187.2
422.291	247.88
422.726	160.5
423.16	172.64
423.595	187.2
424.03	170.21
424.464	131.37
424.899	136.23
425.334	136.23
425.768	124.09
426.203	131.37
426.637	121.66
427.071	145.94
427.506	92.54
427.94	138.66
428.374	121.66
428.809	196.91
429.243	179.92
429.677	133.8
430.111	116.81
430.545	167.78
430.979	153.22
431.413	160.5
431.847	141.08
432.28	148.36
432.714	170.21
433.148	128.95
433.582	102.25
434.015	136.23
434.449	153.22
434.882	187.2
435.316	165.35
435.749	240.6
436.183	133.8
436.616	143.51
437.049	124.09
437.483	175.06
437.916	216.33
438.349	192.05
438.782	192.05
439.215	85.26
439.648	150.79
440.081	189.63
440.514	196.91
440.947	148.36
441.38	104.67
441.813	194.48
442.245	243.03
442.678	170.21
443.111	196.91
443.543	223.61
443.976	223.61
444.408	133.8
444.841	177.49
445.273	201.76
445.705	124.09
446.138	189.63
446.57	153.22
447.002	206.62
447.434	262.44
447.867	247.88
448.299	165.35
448.731	187.2
449.163	199.34
449.595	189.63
450.026	264.87
450.458	192.05
450.89	264.87
451.322	165.35
451.754	177.49
452.185	243.03
452.617	201.76
453.048	175.06
453.48	238.17
453.911	277.01
454.343	160.5
454.774	218.75
455.205	230.89
455.637	177.49
456.068	235.74
456.499	264.87
456.93	255.16
457.361	179.92
457.792	177.49
458.223	138.66
458.654	230.89
459.085	170.21
459.516	133.8
459.947	218.75
460.378	182.35
460.808	221.18
461.239	260.02
461.669	269.73
462.1	235.74
462.531	162.93
462.961	179.92
463.391	187.2
463.822	145.94
464.252	199.34
464.682	223.61
465.113	255.16
465.543	247.88
465.973	184.77
466.403	184.77
466.833	245.45
467.263	182.35
467.693	138.66
468.123	223.61
468.553	179.92
468.983	260.02
469.412	148.36
469.842	213.9
470.272	204.19
470.701	211.47
471.131	291.57
471.56	204.19
471.99	158.07
472.419	109.53
472.849	235.74
473.278	184.77
473.707	213.9
474.136	199.34
474.566	165.35
474.995	228.46
475.424	221.18
475.853	201.76
476.282	211.47
476.711	128.95
477.14	167.78
477.569	172.64
477.997	179.92
478.426	160.5
478.855	158.07
479.283	196.91
479.712	194.48
480.141	175.06
480.569	160.5
480.998	194.48
481.426	199.34
481.854	194.48
482.283	223.61
482.711	150.79
483.139	226.04
483.567	172.64
483.995	194.48
484.424	194.48
484.852	126.52
485.28	238.17
485.708	206.62
486.135	187.2
486.563	167.78
486.991	235.74
487.419	133.8
487.847	211.47
488.274	177.49
488.702	204.19
489.129	216.33
489.557	199.34
489.984	228.46
490.412	194.48
490.839	179.92
491.266	133.8
491.694	201.76
492.121	233.32
492.548	192.05
492.975	131.37
493.402	199.34
493.829	145.94
494.256	170.21
494.683	216.33
495.11	153.22
495.537	136.23
495.964	143.51
496.39	184.77
496.817	82.83
497.244	211.47
497.67	240.6
498.097	230.89
498.523	182.35
498.95	70.69
499.376	167.78
499.803	179.92
500.229	133.8
500.655	196.91
501.081	138.66
501.508	192.05
501.934	172.64
502.36	70.69
502.786	187.2
503.212	131.37
503.638	145.94
504.064	211.47
504.489	155.65
504.915	172.64
505.341	167.78
505.767	150.79
506.192	148.36
506.618	153.22
507.043	179.92
507.469	158.07
507.894	155.65
508.32	138.66
508.745	226.04
509.17	269.73
509.596	141.08
510.021	102.25
510.446	204.19
510.871	172.64
511.296	141.08
511.721	109.53
512.146	175.06
512.571	141.08
512.996	228.46
513.421	138.66
513.845	111.96
514.27	177.49
514.695	182.35
515.119	109.53
515.544	177.49
515.969	143.51
516.393	155.65
516.817	175.06
517.242	145.94
517.666	138.66
518.09	194.48
518.515	211.47
518.939	148.36
519.363	357.11
519.787	165.35
520.211	143.51
520.635	172.64
521.059	116.81
521.483	179.92
521.907	192.05
522.331	165.35
522.754	230.89
523.178	167.78
523.602	257.59
524.025	228.46
524.449	126.52
524.872	162.93
525.296	145.94
525.719	160.5
526.143	235.74
526.566	143.51
526.989	153.22
527.412	145.94
527.836	170.21
528.259	165.35
528.682	223.61
529.105	189.63
529.528	167.78
529.951	218.75
530.374	189.63
530.796	175.06
531.219	162.93
531.642	153.22
532.065	233.32
532.487	201.76
532.91	255.16
533.332	206.62
533.755	189.63
534.177	228.46
534.6	167.78
535.022	150.79
535.444	153.22
535.867	143.51
536.289	133.8
536.711	223.61
537.133	187.2
537.555	243.03
537.977	160.5
538.399	99.82
538.821	187.2
539.243	94.97
539.665	221.18
540.086	221.18
540.508	148.36
540.93	199.34
541.351	167.78
541.773	228.46
542.195	143.51
542.616	228.46
543.037	245.45
543.459	194.48
543.88	182.35
544.301	211.47
544.723	228.46
545.144	192.05
545.565	209.04
545.986	184.77
546.407	260.02
546.828	243.03
547.249	211.47
547.67	162.93
548.091	194.48
548.512	211.47
548.932	209.04
549.353	170.21
549.774	216.33
550.194	196.91
550.615	201.76
551.035	136.23
551.456	162.93
551.876	221.18
552.296	121.66
552.717	128.95
553.137	204.19
553.557	165.35
553.977	209.04
554.397	187.2
554.817	201.76
555.237	177.49
555.657	97.39
556.077	177.49
556.497	102.25
556.917	177.49
557.337	145.94
557.756	201.76
558.176	131.37
558.596	107.1
559.015	121.66
559.435	138.66
559.854	192.05
560.274	150.79
560.693	175.06
561.112	238.17
561.532	160.5
561.951	209.04
562.37	114.38
562.789	209.04
563.208	184.77
563.627	111.96
564.046	119.24
564.465	121.66
564.884	153.22
565.303	206.62
565.722	201.76
566.14	184.77
566.559	155.65
566.978	182.35
567.396	218.75
567.815	87.68
568.233	184.77
568.652	213.9
569.07	165.35
569.489	213.9
569.907	148.36
570.325	179.92
570.743	192.05
571.161	153.22
571.58	104.67
571.998	177.49
572.416	94.97
572.833	170.21
573.251	138.66
573.669	153.22
574.087	238.17
574.505	128.95
574.922	182.35
575.34	162.93
575.758	243.03
576.175	223.61
576.593	165.35
577.01	216.33
577.428	250.31
577.845	1497.9
578.262	320.7
578.68	264.87
579.097	184.77
579.514	172.64
579.931	121.66
580.348	187.2
580.765	145.94
581.182	121.66
581.599	162.93
582.016	196.91
582.433	126.52
582.849	165.35
583.266	155.65
583.683	206.62
584.099	172.64
584.516	141.08
584.933	204.19
585.349	184.77
585.765	172.64
586.182	143.51
586.598	160.5
587.014	247.88
587.431	124.09
587.847	192.05
588.263	162.93
588.679	162.93
589.095	177.49
589.511	206.62
589.927	240.6
590.343	204.19
590.759	194.48
591.174	133.8
591.59	218.75
592.006	182.35
592.421	221.18
592.837	92.54
593.252	150.79
593.668	128.95
594.083	250.31
594.499	92.54
594.914	172.64
595.329	192.05
595.745	223.61
596.16	216.33
596.575	223.61
596.99	148.36
597.405	133.8
597.82	177.49
598.235	252.73
598.65	189.63
599.065	213.9
599.479	223.61
599.894	145.94
600.309	150.79
600.724	194.48
601.138	177.49
601.553	150.79
601.967	104.67
602.382	228.46
602.796	143.51
603.21	179.92
603.625	216.33
604.039	175.06
604.453	39.14
604.867	206.62
605.281	196.91
605.695	213.9
606.109	216.33
606.523	150.79
606.937	160.5
607.351	213.9
607.765	153.22
608.178	172.64
608.592	121.66
609.006	136.23
609.419	199.34
609.833	177.49
610.246	223.61
610.66	250.31
611.073	243.03
611.487	223.61
611.9	206.62
612.313	187.2
612.726	216.33
613.139	240.6
613.553	245.45
613.966	218.75
614.379	182.35
614.792	162.93
615.204	177.49
615.617	170.21
616.03	155.65
616.443	153.22
616.856	143.51
617.268	158.07
617.681	126.52
618.093	104.67
618.506	162.93
618.918	177.49
619.331	131.37
619.743	182.35
620.155	170.21
620.568	170.21
620.98	182.35
621.392	109.53
621.804	201.76
622.216	167.78
622.628	189.63
623.04	150.79
623.452	136.23
623.864	184.77
624.276	223.61
624.687	128.95
625.099	77.97
625.511	172.64
625.922	158.07
626.334	165.35
626.745	128.95
627.157	160.5
627.568	128.95
627.979	77.97
628.391	175.06
628.802	184.77
629.213	136.23
629.624	126.52
630.035	221.18
630.446	141.08
630.857	136.23
631.268	109.53
631.679	189.63
632.09	233.32
632.501	194.48
632.912	148.36
633.322	196.91
633.733	114.38
634.144	126.52
634.554	143.51
634.965	245.45
635.375	138.66
635.785	102.25
636.196	155.65
636.606	189.63
637.016	216.33
637.427	128.95
637.837	150.79
638.247	260.02
638.657	209.04
639.067	128.95
639.477	148.36
639.887	182.35
640.297	155.65
640.706	138.66
641.116	90.11
641.526	128.95
641.935	189.63
642.345	155.65
642.755	82.83
643.164	177.49
643.573	170.21
643.983	116.81
644.392	145.94
644.801	121.66
645.211	126.52
645.62	136.23
646.029	182.35
646.438	126.52
646.847	165.35
647.256	114.38
647.665	196.91
648.074	143.51
648.483	153.22
648.892	184.77
649.3	179.92
649.709	90.11
650.118	148.36
650.526	107.1
650.935	133.8
651.343	218.75
651.752	148.36
652.16	141.08
652.568	145.94
652.977	172.64
653.385	121.66
653.793	162.93
654.201	196.91
654.609	162.93
655.017	87.68
655.425	184.77
655.833	230.89
656.241	226.04
656.649	172.64
657.057	121.66
657.464	119.24
657.872	114.38
658.28	155.65
658.687	155.65
659.095	155.65
659.502	189.63
659.91	182.35
660.317	177.49
660.724	209.04
661.132	121.66
661.539	158.07
661.946	150.79
662.353	141.08
662.76	179.92
663.167	104.67
663.574	138.66
663.981	170.21
664.388	97.39
664.795	119.24
665.202	172.64
665.608	228.46
666.015	143.51
666.422	141.08
666.828	128.95
667.235	182.35
667.641	153.22
668.047	165.35
668.454	170.21
668.86	138.66
669.266	177.49
669.673	177.49
670.079	182.35
670.485	206.62
670.891	160.5
671.297	136.23
671.703	167.78
672.109	138.66
672.515	141.08
672.92	160.5
673.326	162.93
673.732	141.08
674.138	82.83
674.543	121.66
674.949	141.08
675.354	167.78
675.76	155.65
676.165	102.25
676.57	177.49
676.976	141.08
677.381	136.23
677.786	196.91
678.191	145.94
678.596	136.23
679.001	109.53
679.406	221.18
679.811	141.08
680.216	170.21
680.621	141.08
681.026	133.8
681.43	121.66
681.835	131.37
682.24	179.92
682.644	114.38
683.049	158.07
683.453	175.06
683.858	184.77
684.262	175.06
684.667	133.8
685.071	179.92
685.475	148.36
685.879	145.94
686.283	126.52
686.687	97.39
687.091	170.21
687.495	221.18
687.899	179.92
688.303	138.66
688.707	192.05
689.111	136.23
689.514	145.94
689.918	170.21
690.322	155.65
690.725	158.07
691.129	141.08
691.532	136.23
691.936	196.91
692.339	155.65
692.742	128.95
693.146	199.34
693.549	136.23
693.952	204.19
694.355	170.21
694.758	170.21
695.161	167.78
695.564	138.66
695.967	158.07
696.37	150.79
696.773	206.62
697.175	121.66
697.578	133.8
697.981	155.65
698.383	194.48
698.786	175.06
699.188	250.31
699.591	155.65
699.993	233.32
700.395	153.22
700.798	177.49
701.2	143.51
701.602	257.59
702.004	196.91
702.406	196.91
702.808	162.93
703.21	124.09
703.612	255.16
704.014	187.2
704.416	267.3
704.818	233.32
705.219	182.35
705.621	274.58
706.023	213.9
706.424	143.51
706.826	218.75
707.227	175.06
707.629	230.89
708.03	274.58
708.431	226.04
708.832	235.74
709.234	148.36
709.635	230.89
710.036	262.44
710.437	138.66
710.838	189.63
711.239	162.93
711.64	206.62
712.041	218.75
712.441	332.83
712.842	318.27
713.243	184.77
713.643	250.31
714.044	226.04
714.445	303.71
714.845	291.57
715.246	230.89
715.646	235.74
716.046	243.03
716.447	264.87
716.847	344.97
717.247	337.69
717.647	378.95
718.047	323.12
718.447	330.41
718.847	291.57
719.247	286.72
719.647	366.81
720.047	301.28
720.446	342.54
720.846	310.99
721.246	480.89
721.645	342.54
722.045	439.63
722.444	395.94
722.844	432.35
723.243	381.38
723.643	395.94
724.042	337.69
724.441	398.37
724.84	429.92
725.24	383.8
725.639	466.33
726.038	488.18
726.437	449.34
726.836	505.17
727.234	527.01
727.633	412.93
728.032	524.58
728.431	497.88
728.83	544
729.228	563.42
729.627	602.25
730.025	582.84
730.424	624.1
730.822	762.45
731.22	772.16
731.619	740.61
732.017	762.45
732.415	912.94
732.813	980.9
733.212	1002.75
733.61	1002.75
734.008	1053.72
734.406	1233.33
734.803	1340.13
735.201	1344.98
735.599	1422.66
735.997	1446.93
736.395	1650.81
736.792	1713.92
737.19	1764.89
737.587	1745.48
737.985	1806.16
738.382	2189.66
738.78	2196.94
739.177	2388.69
739.574	2429.95
739.971	2408.11
740.369	2704.23
740.766	2934.82
741.163	3126.57
741.56	2917.82
741.957	2820.74
742.354	3075.59
742.751	3405.7
743.147	3896
743.544	3660.55
743.941	3650.85
744.338	3815.9
744.734	4250.37
745.131	4699.41
745.527	4803.78
745.924	4689.7
746.32	4624.16
746.716	5184.85
747.113	5752.82
747.509	6272.25
747.905	5888.74
748.301	5813.5
748.697	6143.6
749.093	7180.03
749.489	7740.72
749.885	7444.59
750.281	7087.79
750.677	7466.44
751.073	8692.19
751.468	9410.64
751.864	9590.26
752.26	8519.85
752.655	8796.56
753.051	9837.84
753.446	11456.79
753.842	11835.44
754.237	11083
754.632	10194.64
755.028	10743.19
755.423	12592.73
755.818	13291.77
756.213	12837.88
756.608	11456.79
757.003	11454.37
757.398	12701.96
757.793	13905.86
758.188	14357.32
758.583	13481.1
758.977	12376.71
759.372	13175.27
759.767	15636.47
760.161	17534.56
760.556	17049.11
760.95	15905.89
761.345	15811.23
761.739	18141.36
762.133	19925.37
762.527	21449.67
762.922	20376.83
763.316	18663.22
763.71	19471.48
764.104	21942.39
764.498	24277.38
764.892	24338.06
765.286	22507.94
765.68	21182.67
766.073	22109.87
766.467	25923.04
766.861	27199.76
767.255	26801.69
767.648	24811.37
768.042	24313.79
768.435	27275
768.829	30427.96
769.222	31347.88
769.615	29745.91
770.008	26279.84
770.402	26267.7
770.795	29126.97
771.188	32452.26
771.581	32461.97
771.974	28864.83
772.367	26058.96
772.76	27136.65
773.153	29976.5
773.545	32442.56
773.938	32243.52
774.331	28607.54
774.724	27321.12
775.116	29850.28
775.509	34658.61
775.901	38112.55
776.294	37131.95
776.686	32813.92
777.078	31631.86
777.471	34631.91
777.863	39976.65
778.255	44183.03
778.647	41061.62
779.039	37976.62
779.431	35199.88
779.823	38561.58
780.215	43491.27
780.607	44649.06
780.999	42258.24
781.39	38015.46
781.782	37428.07
782.174	41105.31
782.565	46095.68
782.957	47598.13
783.348	45272.85
783.74	40345.59
784.131	38493.62
784.522	42238.82
784.914	45365.09
785.305	46501.03
785.696	43872.35
786.087	38165.95
786.478	36401.36
786.869	38748.48
787.26	42102.9
787.651	42712.13
788.042	39253.34
788.433	34573.66
788.823	32571.2
789.214	34731.43
789.605	36901.36
789.995	37818.85
790.386	34697.45
790.776	30753.21
791.167	29401.25
791.557	32602.75
791.948	36983.89
792.338	39141.69
792.728	37860.12
793.118	33733.84
793.508	32245.95
793.898	34340.64
794.288	38243.62
794.678	40280.06
795.068	38862.56
795.458	34947.45
795.848	32168.28
796.238	33219.27
796.627	36505.73
797.017	39136.83
797.406	38971.78
797.796	35059.1
798.185	32398.87
798.575	32682.85
798.964	35959.6
799.354	39755.78
799.743	39428.1
800.132	36554.27
800.521	33347.91
800.91	31677.98
801.299	34136.76
801.688	38525.17
802.077	38384.4
802.466	36624.66
802.855	32597.9
803.244	29313.87
803.633	31185.25
804.021	33372.18
804.41	34850.36
804.799	33716.85
805.187	29702.22
805.576	27153.64
805.964	26308.97
806.352	27483.74
806.741	30449.81
807.129	30165.82
807.517	27799.28
807.905	25291.96
808.293	24122.04
808.681	26505.57
809.069	28653.66
809.457	31789.63
809.845	29733.78
810.233	26842.95
810.621	24607.48
811.009	25204.58
811.396	28080.84
811.784	31139.14
812.171	31452.25
812.559	27966.76
812.946	24779.82
813.334	23692.42
813.721	24915.74
814.108	27075.97
814.496	28163.36
814.883	26010.42
815.27	24442.43
815.657	21898.7
816.044	22490.94
816.431	25112.34
816.818	26927.91
817.205	26835.67
817.592	25364.78
817.979	21872
818.365	20643.83
818.752	21250.63
819.139	23032.22
819.525	23685.14
819.912	22828.33
820.298	20352.56
820.685	17981.17
821.071	17143.77
821.457	18442.34
821.843	19789.45
822.23	19825.85
822.616	18388.94
823.002	15752.98
823.388	13927.7
823.774	13769.94
824.16	14655.87
824.546	15954.44
824.931	15920.45
825.317	14211.69
825.703	12337.87
826.089	11818.45
826.474	12279.62
826.86	13597.6
827.245	14211.69
827.631	14265.09
828.016	12871.86
828.401	10983.48
828.787	10731.05
829.172	11417.96
829.557	12228.65
829.942	12806.33
830.327	12257.78
830.712	10612.12
831.097	9107.24
831.482	8966.46
831.867	9413.07
832.252	10260.17
832.636	10765.03
833.021	9937.35
833.406	8920.35
833.79	7828.1
834.175	7677.61
834.559	8279.56
834.944	9085.4
835.328	9609.68
835.713	8990.73
836.097	7430.03
836.481	6721.28
836.865	6517.4
837.249	6937.3
837.633	7422.75
838.017	7638.77
838.401	7133.91
838.785	5862.05
839.169	5102.32
839.553	4903.29
839.937	5247.96
840.32	5764.96
840.704	5859.62
841.087	5296.5
841.471	4670.28
841.854	3961.53
842.238	3898.42
842.621	4204.25
843.004	4573.19
843.388	4791.64
843.771	4602.32
844.154	3915.41
844.537	3480.94
844.92	3335.31
845.303	3546.48
845.686	4024.64
846.069	4107.16
846.452	4107.16
846.834	3500.36
847.217	2956.66
847.6	2837.73
847.982	3019.77
848.365	3340.16
848.748	3609.58
849.13	3485.79
849.512	3119.28
849.895	2517.33
850.277	2408.11
850.659	2485.78
851.041	2893.55
851.423	3102.29
851.806	2944.52
852.188	2551.31
852.57	2349.85
852.951	2080.43
853.333	2041.6
853.715	2318.3
854.097	2473.64
854.479	2621.7
854.86	2342.57
855.242	2000.33
855.623	1740.62
856.005	1619.26
856.386	1784.31
856.768	1849.85
857.149	2017.33
857.53	2012.47
857.911	1716.35
858.292	1388.67
858.674	1184.79
859.055	1340.13
859.436	1459.06
859.817	1478.48
860.197	1578
860.578	1349.84
860.959	1136.24
861.34	1039.15
861.72	1007.6
862.101	1073.14
862.482	1177.51
862.862	1247.9
863.243	1218.77
863.623	1027.02
864.003	888.67
864.384	830.41
864.764	837.7
865.144	980.9
865.524	1051.29
865.904	1070.71
866.284	886.24
866.664	728.47
867.044	687.21
867.424	662.94
867.804	713.91
868.183	813.42
868.563	847.4
868.943	806.14
869.322	716.33
869.702	624.1
870.081	480.89
870.461	560.99
870.84	670.22
871.22	694.49
871.599	682.35
871.978	531.87
872.357	541.57
872.736	471.18
873.115	439.63
873.494	493.03
873.873	490.6
874.252	463.9
874.631	463.9
875.01	417.79
875.388	388.66
875.767	366.81
876.146	344.97
876.524	420.21
876.903	403.22
877.281	391.09
877.66	357.11
878.038	323.12
878.416	262.44
878.794	313.42
879.173	342.54
879.551	264.87
879.929	344.97
880.307	306.13
880.685	267.3
881.063	291.57
881.441	238.17
881.818	315.84
882.196	294
882.574	238.17
882.951	277.01
883.329	298.85
883.707	209.04
884.084	281.86
884.461	294
884.839	262.44
885.216	243.03
885.593	310.99
885.971	247.88
886.348	223.61
886.725	221.18
887.102	269.73
887.479	216.33
887.856	201.76
888.233	187.2
888.609	189.63
888.986	192.05
889.363	196.91
889.74	167.78
890.116	201.76
890.493	172.64
890.869	184.77
891.246	199.34
891.622	143.51
891.998	221.18
892.375	187.2
892.751	277.01
893.127	199.34
893.503	267.3
893.879	160.5
894.255	160.5
894.631	245.45
895.007	131.37
895.383	218.75
895.759	172.64
896.134	209.04
896.51	201.76
896.886	94.97
897.261	138.66
897.637	165.35
898.012	167.78
898.388	199.34
898.763	131.37
899.138	99.82
899.514	82.83
899.889	114.38
900.264	128.95
900.639	116.81
901.014	175.06
901.389	143.51
901.764	121.66
902.139	133.8
902.513	192.05
902.888	138.66
903.263	145.94
903.638	150.79
904.012	107.1
904.387	228.46
904.761	230.89
905.136	73.12
905.51	184.77
905.884	136.23
906.259	124.09
906.633	150.79
907.007	223.61
907.381	199.34
907.755	150.79
908.129	143.51
908.503	141.08
908.877	85.26
909.251	155.65
909.624	167.78
909.998	143.51
910.372	162.93
910.745	116.81
911.119	206.62
911.492	90.11
911.866	160.5
912.239	114.38
912.612	133.8
912.986	184.77
913.359	182.35
913.732	177.49
914.105	153.22
914.478	192.05
914.851	204.19
915.224	126.52
915.597	153.22
915.97	109.53
916.343	141.08
916.715	162.93
917.088	170.21
917.461	87.68
917.833	131.37
918.206	107.1
918.578	158.07
918.951	153.22
919.323	90.11
919.695	158.07
920.067	107.1
920.44	97.39
920.812	143.51
921.184	116.81
921.556	204.19
921.928	128.95
922.3	153.22
922.672	116.81
923.043	172.64
923.415	177.49
923.787	148.36
924.158	121.66
924.53	162.93
924.901	175.06
925.273	68.27
925.644	162.93
926.016	114.38
926.387	153.22
926.758	179.92
927.129	131.37
927.5	160.5
927.872	182.35
928.243	158.07
928.613	131.37
928.984	133.8
929.355	75.55
929.726	107.1
930.097	255.16
930.467	73.12
930.838	170.21
931.209	114.38
931.579	155.65
931.95	77.97
932.32	104.67
932.69	126.52
933.061	138.66
933.431	192.05
933.801	124.09
934.171	68.27
934.541	87.68
934.911	116.81
935.281	175.06
935.651	145.94
936.021	201.76
936.391	155.65
936.761	148.36
937.13	82.83
937.5	162.93
937.87	162.93
938.239	165.35
938.609	116.81
938.978	165.35
939.347	136.23
939.717	126.52
940.086	82.83
940.455	138.66
940.824	155.65
941.193	226.04
941.562	187.2
941.931	114.38
942.3	226.04
942.669	170.21
943.038	107.1
943.407	128.95
943.775	192.05
944.144	182.35
944.513	94.97
944.881	133.8
945.25	141.08
945.618	228.46
945.986	201.76
946.355	155.65
946.723	184.77
947.091	201.76
947.459	94.97
947.827	172.64
948.195	124.09
948.563	107.1
948.931	150.79
949.299	126.52
949.667	155.65
950.035	124.09
950.402	177.49
950.77	114.38
951.138	143.51
951.505	162.93
951.873	167.78
952.24	189.63
952.607	179.92
952.975	143.51
953.342	189.63
953.709	175.06
954.076	150.79
954.443	136.23
954.81	114.38
955.177	153.22
955.544	102.25
955.911	109.53
956.278	172.64
956.645	192.05
957.012	70.69
957.378	94.97
957.745	73.12
958.111	148.36
958.478	136.23
958.844	213.9
959.211	179.92
959.577	177.49
959.943	158.07
960.309	68.27
960.675	148.36
961.042	77.97
961.408	102.25
961.774	114.38
962.139	145.94
962.505	116.81
962.871	104.67
963.237	85.26
963.603	97.39
963.968	138.66
964.334	155.65
964.699	160.5
965.065	158.07
965.43	160.5
965.796	172.64
966.161	148.36
966.526	177.49
966.891	82.83
967.256	126.52
967.622	107.1
967.987	102.25
968.352	109.53
968.716	121.66
969.081	126.52
969.446	107.1
969.811	128.95
970.176	145.94
970.54	141.08
970.905	121.66
971.269	145.94
971.634	143.51
971.998	126.52
972.363	97.39
972.727	138.66
973.091	102.25
973.455	107.1
973.819	121.66
974.183	114.38
974.547	160.5
974.911	155.65
975.275	167.78
975.639	160.5
976.003	143.51
976.367	97.39
976.73	153.22
977.094	80.4
977.458	192.05
977.821	131.37
978.185	172.64
978.548	141.08
978.911	99.82
979.275	124.09
979.638	158.07
980.001	114.38
980.364	136.23
980.727	87.68
981.09	104.67
981.453	97.39
981.816	138.66
982.179	143.51
982.542	153.22
982.905	116.81
983.267	99.82
983.63	209.04
983.992	165.35
984.355	77.97
984.717	114.38
985.08	131.37
985.442	194.48
985.804	165.35
986.167	175.06
986.529	126.52
986.891	116.81
987.253	153.22
987.615	114.38
987.977	51.28
988.339	143.51
988.701	104.67
989.062	138.66
989.424	124.09
989.786	82.83
990.147	196.91
990.509	133.8
990.87	73.12
991.232	179.92
991.593	148.36
991.955	167.78
992.316	136.23
992.677	177.49
993.038	109.53
993.399	213.9
993.76	126.52
994.121	124.09
994.482	82.83
994.843	131.37
995.204	114.38
995.565	170.21
995.926	148.36
996.286	199.34
996.647	65.84
997.007	128.95
997.368	109.53
997.728	145.94
998.089	170.21
998.449	170.21
998.809	141.08
999.169	90.11
999.53	160.5
999.89	138.66
1000.25	148.36
1000.61	162.93
1000.97	143.51
1001.329	104.67
1001.689	104.67
1002.049	102.25
1002.409	128.95
1002.768	77.97
1003.128	143.51
1003.487	170.21
1003.847	148.36
1004.206	126.52
1004.566	158.07
1004.925	170.21
1005.284	111.96
1005.643	145.94
1006.003	141.08
1006.362	109.53
1006.721	162.93
1007.08	141.08
1007.438	143.51
1007.797	170.21
1008.156	107.1
1008.515	165.35
1008.874	116.81
1009.232	124.09
1009.591	114.38
1009.949	145.94
1010.308	128.95
1010.666	155.65
1011.024	141.08
1011.383	175.06
1011.741	138.66
1012.099	85.26
1012.457	145.94
1012.815	116.81
1013.173	82.83
1013.531	99.82
1013.889	73.12
1014.247	160.5
1014.605	165.35
1014.962	162.93
1015.32	143.51
1015.678	58.56
1016.035	92.54
1016.393	82.83
1016.75	56.13
1017.107	131.37
1017.465	177.49
1017.822	121.66
1018.179	141.08
1018.536	150.79
1018.894	138.66
1019.251	121.66
1019.608	150.79
1019.964	145.94
1020.321	153.22
1020.678	150.79
1021.035	194.48
1021.392	104.67
1021.748	167.78
1022.105	126.52
1022.461	126.52
1022.818	153.22
1023.174	170.21
1023.531	111.96
1023.887	119.24
1024.243	131.37
1024.599	99.82
1024.955	114.38
1025.311	126.52
1025.667	97.39
1026.023	82.83
1026.379	162.93
1026.735	194.48
1027.091	102.25
1027.447	126.52
