189.514	72.06
189.973	72.06
190.431	72.06
190.889	18.66
191.348	-37.17
191.806	-3.19
192.264	1.67
192.722	40.5
193.18	-25.03
193.638	-25.03
194.096	-10.47
194.554	-5.61
195.012	-27.46
195.47	8.95
195.928	25.94
196.385	52.64
196.843	-8.04
197.301	-42.02
197.758	4.1
198.216	-34.74
198.674	50.21
199.131	-5.61
199.589	69.63
200.046	67.2
200.503	132.74
200.961	98.76
201.418	42.93
201.875	123.03
202.332	72.06
202.79	127.88
203.247	89.05
203.704	140.02
204.161	123.03
204.618	144.87
205.075	178.86
205.532	120.6
205.989	132.74
206.445	149.73
206.902	96.33
207.359	132.74
207.816	147.3
208.272	166.72
208.729	171.57
209.185	237.11
209.642	207.98
210.098	149.73
210.555	234.68
211.011	166.72
211.467	195.85
211.924	118.18
212.38	217.69
212.836	174
213.292	174
213.748	232.25
214.204	176.43
214.66	166.72
215.116	222.55
215.572	169.15
216.028	183.71
216.484	149.73
216.94	181.28
217.396	132.74
217.851	178.86
218.307	190.99
218.763	157.01
219.218	186.14
219.674	130.31
220.129	186.14
220.585	154.58
221.04	207.98
221.496	203.13
221.951	93.9
222.406	103.61
222.861	169.15
223.317	142.45
223.772	157.01
224.227	93.9
224.682	178.86
225.137	118.18
225.592	140.02
226.047	142.45
226.502	154.58
226.957	198.27
227.411	125.46
227.866	127.88
228.321	171.57
228.776	140.02
229.23	130.31
229.685	125.46
230.139	193.42
230.594	215.26
231.048	200.7
231.503	152.16
231.957	181.28
232.411	130.31
232.865	93.9
233.32	178.86
233.774	84.19
234.228	147.3
234.682	127.88
235.136	127.88
235.59	181.28
236.044	132.74
236.498	144.87
236.952	161.87
237.406	212.84
237.86	142.45
238.313	164.29
238.767	132.74
239.221	239.54
239.674	190.99
240.128	174
240.581	154.58
241.035	137.59
241.488	176.43
241.942	198.27
242.395	106.04
242.848	152.16
243.301	169.15
243.755	152.16
244.208	127.88
244.661	178.86
245.114	210.41
245.567	123.03
246.02	198.27
246.473	164.29
246.926	203.13
247.379	89.05
247.832	220.12
248.284	195.85
248.737	115.75
249.19	144.87
249.642	96.33
250.095	120.6
250.547	130.31
251	113.32
251.452	132.74
251.905	176.43
252.357	106.04
252.81	135.17
253.262	210.41
253.714	227.4
254.166	154.58
254.618	166.72
255.07	174
255.523	127.88
255.975	120.6
256.427	164.29
256.878	125.46
257.33	249.25
257.782	178.86
258.234	140.02
258.686	215.26
259.137	103.61
259.589	144.87
260.041	154.58
260.492	120.6
260.944	101.18
261.395	164.29
261.847	232.25
262.298	152.16
262.749	166.72
263.201	115.75
263.652	186.14
264.103	123.03
264.554	229.83
265.005	113.32
265.457	178.86
265.908	166.72
266.359	203.13
266.809	149.73
267.26	200.7
267.711	144.87
268.162	215.26
268.613	207.98
269.064	181.28
269.514	222.55
269.965	183.71
270.415	178.86
270.866	161.87
271.316	159.44
271.767	140.02
272.217	181.28
272.668	147.3
273.118	164.29
273.568	147.3
274.019	91.48
274.469	93.9
274.919	149.73
275.369	186.14
275.819	183.71
276.269	154.58
276.719	181.28
277.169	222.55
277.619	181.28
278.069	152.16
278.518	181.28
278.968	210.41
279.418	212.84
279.867	188.56
280.317	154.58
280.767	132.74
281.216	205.56
281.666	190.99
282.115	127.88
282.564	149.73
283.014	166.72
283.463	198.27
283.912	161.87
284.361	144.87
284.811	154.58
285.26	154.58
285.709	164.29
286.158	137.59
286.607	130.31
287.056	200.7
287.505	171.57
287.953	110.89
288.402	178.86
288.851	190.99
289.3	166.72
289.748	169.15
290.197	142.45
290.646	205.56
291.094	166.72
291.543	161.87
291.991	169.15
292.439	174
292.888	120.6
293.336	137.59
293.784	106.04
294.233	205.56
294.681	200.7
295.129	164.29
295.577	224.97
296.025	125.46
296.473	166.72
296.921	193.42
297.369	96.33
297.817	130.31
298.264	188.56
298.712	176.43
299.16	38.08
299.608	210.41
300.055	232.25
300.503	106.04
300.95	193.42
301.398	181.28
301.845	149.73
302.293	239.54
302.74	130.31
303.187	142.45
303.635	181.28
304.082	241.96
304.529	147.3
304.976	188.56
305.423	157.01
305.87	232.25
306.317	152.16
306.764	190.99
307.211	241.96
307.658	157.01
308.105	176.43
308.552	154.58
308.998	110.89
309.445	212.84
309.892	132.74
310.338	157.01
310.785	106.04
311.231	74.49
311.678	183.71
312.124	215.26
312.571	176.43
313.017	137.59
313.463	169.15
313.909	106.04
314.356	140.02
314.802	193.42
315.248	205.56
315.694	161.87
316.14	157.01
316.586	123.03
317.032	169.15
317.478	183.71
317.923	188.56
318.369	181.28
318.815	188.56
319.261	176.43
319.706	118.18
320.152	152.16
320.597	159.44
321.043	227.4
321.488	125.46
321.934	106.04
322.379	147.3
322.824	164.29
323.27	222.55
323.715	166.72
324.16	152.16
324.605	220.12
325.05	106.04
325.495	132.74
325.94	224.97
326.385	198.27
326.83	171.57
327.275	164.29
327.72	142.45
328.165	57.49
328.61	154.58
329.054	174
329.499	205.56
329.943	154.58
330.388	125.46
330.832	137.59
331.277	234.68
331.721	164.29
332.166	176.43
332.61	74.49
333.054	81.77
333.499	149.73
333.943	181.28
334.387	110.89
334.831	254.1
335.275	166.72
335.719	205.56
336.163	166.72
336.607	149.73
337.051	142.45
337.495	169.15
337.938	125.46
338.382	198.27
338.826	159.44
339.269	181.28
339.713	215.26
340.157	200.7
340.6	147.3
341.044	176.43
341.487	188.56
341.93	195.85
342.374	118.18
342.817	215.26
343.26	137.59
343.703	147.3
344.146	186.14
344.59	127.88
345.033	140.02
345.476	118.18
345.919	174
346.361	176.43
346.804	140.02
347.247	181.28
347.69	171.57
348.133	237.11
348.575	198.27
349.018	186.14
349.461	67.2
349.903	103.61
350.346	152.16
350.788	207.98
351.23	178.86
351.673	237.11
352.115	96.33
352.557	174
353	154.58
353.442	149.73
353.884	152.16
354.326	246.82
354.768	152.16
355.21	200.7
355.652	113.32
356.094	98.76
356.536	166.72
356.978	210.41
357.419	195.85
357.861	183.71
358.303	207.98
358.744	154.58
359.186	123.03
359.627	183.71
360.069	135.17
360.51	193.42
360.952	203.13
361.393	123.03
361.834	200.7
362.276	147.3
362.717	174
363.158	127.88
363.599	174
364.04	106.04
364.481	159.44
364.922	178.86
365.363	118.18
365.804	190.99
366.245	164.29
366.686	159.44
367.126	159.44
367.567	203.13
368.008	166.72
368.448	171.57
368.889	190.99
369.33	193.42
369.77	171.57
370.21	205.56
370.651	140.02
371.091	176.43
371.531	181.28
371.972	110.89
372.412	166.72
372.852	171.57
373.292	127.88
373.732	198.27
374.172	123.03
374.612	190.99
375.052	222.55
375.492	215.26
375.932	183.71
376.372	157.01
376.811	203.13
377.251	186.14
377.691	144.87
378.13	118.18
378.57	229.83
379.009	198.27
379.449	157.01
379.888	188.56
380.328	169.15
380.767	125.46
381.206	169.15
381.645	188.56
382.085	144.87
382.524	227.4
382.963	205.56
383.402	215.26
383.841	147.3
384.28	89.05
384.719	135.17
385.158	198.27
385.596	171.57
386.035	149.73
386.474	237.11
386.913	217.69
387.351	135.17
387.79	169.15
388.228	174
388.667	164.29
389.105	193.42
389.544	110.89
389.982	169.15
390.42	190.99
390.859	120.6
391.297	229.83
391.735	159.44
392.173	110.89
392.611	130.31
393.049	123.03
393.487	200.7
393.925	166.72
394.363	149.73
394.801	157.01
395.239	130.31
395.676	198.27
396.114	193.42
396.552	76.91
396.989	91.48
397.427	154.58
397.864	118.18
398.302	147.3
398.739	123.03
399.177	171.57
399.614	118.18
400.051	183.71
400.488	152.16
400.926	72.06
401.363	224.97
401.8	241.96
402.237	127.88
402.674	198.27
403.111	144.87
403.548	200.7
403.985	130.31
404.421	183.71
404.858	137.59
405.295	140.02
405.732	171.57
406.168	157.01
406.605	110.89
407.041	106.04
407.478	137.59
407.914	181.28
408.351	169.15
408.787	188.56
409.223	171.57
409.66	159.44
410.096	251.67
410.532	174
410.968	195.85
411.404	198.27
411.84	118.18
412.276	183.71
412.712	149.73
413.148	169.15
413.584	166.72
414.02	103.61
414.455	164.29
414.891	127.88
415.327	125.46
415.762	120.6
416.198	127.88
416.633	195.85
417.069	113.32
417.504	147.3
417.94	161.87
418.375	140.02
418.81	159.44
419.245	203.13
419.681	181.28
420.116	127.88
420.551	164.29
420.986	154.58
421.421	157.01
421.856	210.41
422.291	237.11
422.726	142.45
423.16	246.82
423.595	171.57
424.03	164.29
424.464	147.3
424.899	188.56
425.334	118.18
425.768	149.73
426.203	110.89
426.637	161.87
427.071	222.55
427.506	200.7
427.94	181.28
428.374	130.31
428.809	195.85
429.243	86.62
429.677	183.71
430.111	142.45
430.545	132.74
430.979	149.73
431.413	166.72
431.847	200.7
432.28	164.29
432.714	161.87
433.148	140.02
433.582	161.87
434.015	174
434.449	256.53
434.882	215.26
435.316	166.72
435.749	186.14
436.183	234.68
436.616	157.01
437.049	161.87
437.483	220.12
437.916	290.51
438.349	169.15
438.782	108.47
439.215	127.88
439.648	190.99
440.081	222.55
440.514	198.27
440.947	178.86
441.38	193.42
441.813	159.44
442.245	258.95
442.678	215.26
443.111	229.83
443.543	186.14
443.976	246.82
444.408	157.01
444.841	246.82
445.273	215.26
445.705	241.96
446.138	212.84
446.57	244.39
447.002	234.68
447.434	193.42
447.867	273.52
448.299	215.26
448.731	229.83
449.163	154.58
449.595	261.38
450.026	212.84
450.458	288.08
450.89	263.81
451.322	210.41
451.754	212.84
452.185	227.4
452.617	164.29
453.048	232.25
453.48	207.98
453.911	278.37
454.343	297.79
454.774	217.69
455.205	283.23
455.637	273.52
456.068	302.64
456.499	317.21
456.93	268.66
457.361	295.36
457.792	288.08
458.223	288.08
458.654	234.68
459.085	307.5
459.516	249.25
459.947	263.81
460.378	302.64
460.808	290.51
461.239	224.97
461.669	220.12
462.1	193.42
462.531	251.67
462.961	239.54
463.391	275.94
463.822	302.64
464.252	237.11
464.682	254.1
465.113	246.82
465.543	317.21
465.973	273.52
466.403	251.67
466.833	241.96
467.263	207.98
467.693	210.41
468.123	241.96
468.553	215.26
468.983	207.98
469.412	237.11
469.842	239.54
470.272	215.26
470.701	215.26
471.131	212.84
471.56	251.67
471.99	210.41
472.419	174
472.849	258.95
473.278	183.71
473.707	307.5
474.136	227.4
474.566	169.15
474.995	144.87
475.424	195.85
475.853	227.4
476.282	205.56
476.711	193.42
477.14	234.68
477.569	217.69
477.997	161.87
478.426	239.54
478.855	137.59
479.283	215.26
479.712	220.12
480.141	152.16
480.569	268.66
480.998	169.15
481.426	215.26
481.854	215.26
482.283	174
482.711	132.74
483.139	251.67
483.567	212.84
483.995	169.15
484.424	229.83
484.852	261.38
485.28	190.99
485.708	232.25
486.135	244.39
486.563	263.81
486.991	246.82
487.419	224.97
487.847	190.99
488.274	140.02
488.702	195.85
489.129	193.42
489.557	188.56
489.984	234.68
490.412	178.86
490.839	166.72
491.266	152.16
491.694	200.7
492.121	261.38
492.548	169.15
492.975	241.96
493.402	157.01
493.829	220.12
494.256	171.57
494.683	171.57
495.11	157.01
495.537	249.25
495.964	154.58
496.39	183.71
496.817	232.25
497.244	147.3
497.67	186.14
498.097	125.46
498.523	237.11
498.95	220.12
499.376	215.26
499.803	198.27
500.229	142.45
500.655	159.44
501.081	171.57
501.508	130.31
501.934	171.57
502.36	205.56
502.786	157.01
503.212	174
503.638	181.28
504.064	210.41
504.489	137.59
504.915	183.71
505.341	127.88
505.767	198.27
506.192	176.43
506.618	222.55
507.043	200.7
507.469	193.42
507.894	152.16
508.32	183.71
508.745	161.87
509.17	161.87
509.596	135.17
510.021	198.27
510.446	140.02
510.871	195.85
511.296	203.13
511.721	205.56
512.146	147.3
512.571	76.91
512.996	181.28
513.421	212.84
513.845	200.7
514.27	246.82
514.695	171.57
515.119	152.16
515.544	181.28
515.969	227.4
516.393	142.45
516.817	140.02
517.242	251.67
517.666	176.43
518.09	261.38
518.515	161.87
518.939	200.7
519.363	363.32
519.787	176.43
520.211	181.28
520.635	195.85
521.059	198.27
521.483	205.56
521.907	183.71
522.331	149.73
522.754	195.85
523.178	190.99
523.602	285.65
524.025	205.56
524.449	195.85
524.872	166.72
525.296	176.43
525.719	169.15
526.143	207.98
526.566	176.43
526.989	106.04
527.412	237.11
527.836	217.69
528.259	203.13
528.682	220.12
529.105	142.45
529.528	123.03
529.951	210.41
530.374	159.44
530.796	120.6
531.219	251.67
531.642	164.29
532.065	195.85
532.487	237.11
532.91	237.11
533.332	207.98
533.755	254.1
534.177	186.14
534.6	176.43
535.022	198.27
535.444	212.84
535.867	127.88
536.289	157.01
536.711	198.27
537.133	181.28
537.555	169.15
537.977	183.71
538.399	210.41
538.821	140.02
539.243	157.01
539.665	212.84
540.086	227.4
540.508	149.73
540.93	217.69
541.351	251.67
541.773	215.26
542.195	212.84
542.616	234.68
543.037	258.95
543.459	207.98
543.88	207.98
544.301	229.83
544.723	290.51
545.144	193.42
545.565	258.95
545.986	212.84
546.407	322.06
546.828	198.27
547.249	135.17
547.67	188.56
548.091	224.97
548.512	188.56
548.932	157.01
549.353	176.43
549.774	210.41
550.194	256.53
550.615	140.02
551.035	178.86
551.456	198.27
551.876	183.71
552.296	254.1
552.717	203.13
553.137	239.54
553.557	266.24
553.977	207.98
554.397	186.14
554.817	217.69
555.237	188.56
555.657	229.83
556.077	171.57
556.497	239.54
556.917	224.97
557.337	190.99
557.756	183.71
558.176	108.47
558.596	166.72
559.015	271.09
559.435	161.87
559.854	154.58
560.274	258.95
560.693	195.85
561.112	176.43
561.532	207.98
561.951	183.71
562.37	174
562.789	210.41
563.208	205.56
563.627	239.54
564.046	256.53
564.465	161.87
564.884	188.56
565.303	166.72
565.722	237.11
566.14	181.28
566.559	232.25
566.978	169.15
567.396	254.1
567.815	127.88
568.233	190.99
568.652	212.84
569.07	200.7
569.489	193.42
569.907	190.99
570.325	203.13
570.743	193.42
571.161	220.12
571.58	188.56
571.998	200.7
572.416	195.85
572.833	169.15
573.251	178.86
573.669	130.31
574.087	193.42
574.505	224.97
574.922	161.87
575.34	205.56
575.758	137.59
576.175	164.29
576.593	188.56
577.01	190.99
577.428	161.87
577.845	1487.13
578.262	288.08
578.68	178.86
579.097	161.87
579.514	222.55
579.931	188.56
580.348	149.73
580.765	152.16
581.182	200.7
581.599	178.86
582.016	147.3
582.433	210.41
582.849	149.73
583.266	227.4
583.683	212.84
584.099	169.15
584.516	227.4
584.933	181.28
585.349	142.45
585.765	258.95
586.182	142.45
586.598	190.99
587.014	220.12
587.431	234.68
587.847	207.98
588.263	224.97
588.679	261.38
589.095	178.86
589.511	166.72
589.927	144.87
590.343	186.14
590.759	159.44
591.174	171.57
591.59	224.97
592.006	210.41
592.421	203.13
592.837	127.88
593.252	164.29
593.668	193.42
594.083	183.71
594.499	181.28
594.914	200.7
595.329	232.25
595.745	195.85
596.16	263.81
596.575	181.28
596.99	166.72
597.405	234.68
597.82	234.68
598.235	166.72
598.65	212.84
599.065	183.71
599.479	210.41
599.894	115.75
600.309	203.13
600.724	157.01
601.138	200.7
601.553	120.6
601.967	110.89
602.382	171.57
602.796	140.02
603.21	193.42
603.625	229.83
604.039	166.72
604.453	157.01
604.867	183.71
605.281	215.26
605.695	157.01
606.109	210.41
606.523	198.27
606.937	200.7
607.351	319.63
607.765	171.57
608.178	203.13
608.592	152.16
609.006	115.75
609.419	178.86
609.833	249.25
610.246	132.74
610.66	239.54
611.073	212.84
611.487	186.14
611.9	258.95
612.313	152.16
612.726	220.12
613.139	149.73
613.553	164.29
613.966	203.13
614.379	266.24
614.792	152.16
615.204	212.84
615.617	181.28
616.03	140.02
616.443	183.71
616.856	227.4
617.268	193.42
617.681	207.98
618.093	275.94
618.506	171.57
618.918	217.69
619.331	120.6
619.743	98.76
620.155	178.86
620.568	125.46
620.98	176.43
621.392	190.99
621.804	275.94
622.216	144.87
622.628	174
623.04	227.4
623.452	157.01
623.864	181.28
624.276	239.54
624.687	149.73
625.099	149.73
625.511	118.18
625.922	144.87
626.334	140.02
626.745	140.02
627.157	140.02
627.568	176.43
627.979	195.85
628.391	144.87
628.802	161.87
629.213	154.58
629.624	193.42
630.035	188.56
630.446	178.86
630.857	91.48
631.268	261.38
631.679	241.96
632.09	278.37
632.501	157.01
632.912	169.15
633.322	224.97
633.733	220.12
634.144	183.71
634.554	169.15
634.965	161.87
635.375	132.74
635.785	142.45
636.196	135.17
636.606	123.03
637.016	140.02
637.427	249.25
637.837	164.29
638.247	222.55
638.657	169.15
639.067	174
639.477	190.99
639.887	198.27
640.297	130.31
640.706	198.27
641.116	203.13
641.526	210.41
641.935	135.17
642.345	149.73
642.755	108.47
643.164	164.29
643.573	283.23
643.983	149.73
644.392	222.55
644.801	190.99
645.211	181.28
645.62	118.18
646.029	149.73
646.438	186.14
646.847	188.56
647.256	144.87
647.665	169.15
648.074	135.17
648.483	195.85
648.892	159.44
649.3	181.28
649.709	210.41
650.118	149.73
650.526	147.3
650.935	200.7
651.343	217.69
651.752	186.14
652.16	166.72
652.568	193.42
652.977	203.13
653.385	178.86
653.793	183.71
654.201	159.44
654.609	144.87
655.017	200.7
655.425	229.83
655.833	157.01
656.241	166.72
656.649	144.87
657.057	159.44
657.464	198.27
657.872	142.45
658.28	195.85
658.687	190.99
659.095	98.76
659.502	132.74
659.91	132.74
660.317	212.84
660.724	142.45
661.132	212.84
661.539	174
661.946	178.86
662.353	166.72
662.76	227.4
663.167	198.27
663.574	108.47
663.981	147.3
664.388	198.27
664.795	205.56
665.202	244.39
665.608	140.02
666.015	174
666.422	203.13
666.828	178.86
667.235	130.31
667.641	176.43
668.047	181.28
668.454	132.74
668.86	125.46
669.266	171.57
669.673	127.88
670.079	181.28
670.485	183.71
670.891	198.27
671.297	188.56
671.703	159.44
672.109	154.58
672.515	140.02
672.92	166.72
673.326	275.94
673.732	171.57
674.138	101.18
674.543	193.42
674.949	207.98
675.354	207.98
675.76	234.68
676.165	190.99
676.57	190.99
676.976	178.86
677.381	229.83
677.786	227.4
678.191	186.14
678.596	74.49
679.001	132.74
679.406	171.57
679.811	142.45
680.216	164.29
680.621	181.28
681.026	132.74
681.43	190.99
681.835	115.75
682.24	195.85
682.644	195.85
683.049	174
683.453	183.71
683.858	154.58
684.262	186.14
684.667	207.98
685.071	137.59
685.475	215.26
685.879	157.01
686.283	190.99
686.687	171.57
687.091	149.73
687.495	157.01
687.899	123.03
688.303	222.55
688.707	169.15
689.111	183.71
689.514	200.7
689.918	74.49
690.322	183.71
690.725	120.6
691.129	178.86
691.532	224.97
691.936	123.03
692.339	171.57
692.742	244.39
693.146	171.57
693.549	210.41
693.952	125.46
694.355	193.42
694.758	220.12
695.161	215.26
695.564	140.02
695.967	212.84
696.37	181.28
696.773	212.84
697.175	232.25
697.578	212.84
697.981	237.11
698.383	212.84
698.786	190.99
699.188	130.31
699.591	217.69
699.993	222.55
700.395	215.26
700.798	290.51
701.2	210.41
701.602	234.68
702.004	169.15
702.406	203.13
702.808	241.96
703.21	200.7
703.612	195.85
704.014	237.11
704.416	193.42
704.818	271.09
705.219	200.7
705.621	176.43
706.023	212.84
706.424	152.16
706.826	271.09
707.227	237.11
707.629	224.97
708.03	166.72
708.431	232.25
708.832	278.37
709.234	157.01
709.635	220.12
710.036	363.32
710.437	295.36
710.838	200.7
711.239	295.36
711.64	239.54
712.041	217.69
712.441	312.35
712.842	234.68
713.243	290.51
713.643	261.38
714.044	210.41
714.445	220.12
714.845	373.03
715.246	220.12
715.646	290.51
716.046	283.23
716.447	300.22
716.847	268.66
717.247	326.92
717.647	249.25
718.047	360.9
718.447	329.34
718.847	300.22
719.247	373.03
719.647	329.34
720.047	365.75
720.446	365.75
720.846	322.06
721.246	448.28
721.645	297.79
722.045	305.07
722.444	402.16
722.844	450.7
723.243	402.16
723.643	455.56
724.042	404.59
724.441	414.3
724.84	491.97
725.24	380.32
725.639	482.26
726.038	472.55
726.437	523.52
726.836	457.99
727.234	491.97
727.633	506.53
728.032	513.81
728.431	552.65
728.83	664.3
729.228	671.58
729.627	620.61
730.025	574.49
730.424	712.84
730.822	739.54
731.22	758.96
731.619	841.49
732.017	987.12
732.415	931.29
732.813	885.18
733.212	890.03
733.61	1079.36
734.008	1123.05
734.406	1254.12
734.803	1399.75
735.201	1407.03
735.599	1450.72
735.997	1305.09
736.395	1368.19
736.792	1550.24
737.19	1761.4
737.587	2035.68
737.985	2135.2
738.382	2096.36
738.78	2089.08
739.177	1979.85
739.574	2093.93
739.971	2414.33
740.369	2739.58
740.766	3064.82
741.163	3013.85
741.56	2928.9
741.957	2637.63
742.354	2664.33
742.751	3106.09
743.147	3727.45
743.544	4091.54
743.941	4198.34
744.338	3996.88
744.734	3533.28
745.131	3547.84
745.527	3873.09
745.924	4783.3
746.32	5693.5
746.716	6001.76
747.113	5955.64
747.509	5373.11
747.905	5018.74
748.301	5159.52
748.697	6346.43
749.093	7538.19
749.489	8225.1
749.885	8407.14
750.281	7858.59
750.677	6846.44
751.073	6744.49
751.468	7620.72
751.864	9183.85
752.26	10662.03
752.655	11324.66
753.051	11259.13
753.446	10069.79
753.842	8887.73
754.237	8960.55
754.632	10375.62
755.028	12705.75
755.423	13873.24
755.818	13892.66
756.213	12997.02
756.608	11458.16
757.003	10594.07
757.398	11159.61
757.793	12688.76
758.188	14766.46
758.583	16409.69
758.977	16045.61
759.372	14040.72
759.767	12679.05
760.161	12924.2
760.556	14244.61
760.95	17239.8
761.345	20504.41
761.739	22710.76
762.133	21577.25
762.527	19358.77
762.922	16960.67
763.316	17060.19
763.71	19150.02
764.104	22402.5
764.498	26305.48
764.892	27638.02
765.286	26038.48
765.68	22482.6
766.073	19783.53
766.467	19856.35
766.861	22926.78
767.255	27417.14
767.648	31565.27
768.042	32618.68
768.435	30366.22
768.829	26698.69
769.222	23970.49
769.615	23387.95
770.008	25987.51
770.402	30281.27
770.795	34499.78
771.188	35621.15
771.581	33375.97
771.974	28977.85
772.367	25133.13
772.76	24509.33
773.153	25790.9
773.545	30074.95
773.938	34888.13
774.331	35934.27
774.724	34366.28
775.116	31426.91
775.509	28116.18
775.901	27317.63
776.294	30152.62
776.686	35159.98
777.078	41509.6
777.471	44669.84
777.863	44468.38
778.255	40196.47
778.647	35650.28
779.039	33186.65
779.431	33672.1
779.823	38645.47
780.215	44033.91
780.607	46211.13
780.999	47504.83
781.39	43196.52
781.782	38703.73
782.174	34885.71
782.565	35482.8
782.957	39985.3
783.348	45757.23
783.74	50427.21
784.131	49737.88
784.522	46691.72
784.914	41385.81
785.305	36519.23
785.696	34800.75
786.087	36927
786.478	41104.25
786.869	44507.22
787.26	46482.97
787.651	43895.56
788.042	39626.07
788.433	34106.57
788.823	30324.96
789.214	30206.02
789.605	32844.41
789.995	36609.03
790.386	38742.56
790.776	39793.55
791.167	36332.33
791.557	32888.1
791.948	29276.4
792.338	27989.97
792.728	30798.26
793.118	35973.1
793.508	39910.06
793.898	43155.25
794.288	42116.4
794.678	37934.3
795.068	32776.45
795.458	29786.11
795.848	30067.67
796.238	32487.61
796.627	36376.02
797.017	40987.74
797.406	41762.03
797.796	40145.5
798.185	35936.69
798.575	31817.7
798.964	28281.23
799.354	29286.1
799.743	33227.91
800.132	38575.08
800.521	42291.16
800.91	42626.12
801.299	39305.68
801.688	34868.72
802.077	29922.04
802.466	28067.64
802.855	29125.91
803.244	31215.75
803.633	35084.74
804.021	38257.12
804.41	38684.31
804.799	35164.84
805.187	29939.03
805.576	25798.19
805.964	22994.74
806.352	23341.84
806.741	26912.28
807.129	30186.6
807.517	32565.28
807.905	32742.47
808.293	29795.82
808.681	26108.87
809.069	22703.48
809.457	21596.66
809.845	23038.43
810.233	26606.45
810.621	31655.07
811.009	34021.62
811.396	33885.69
811.784	31324.97
812.171	27006.94
812.559	23242.32
812.946	20912.19
813.334	21778.71
813.721	24798.17
814.108	27756.95
814.496	30405.05
814.883	30516.71
815.27	28951.15
815.657	24968.08
816.044	21154.91
816.431	18934
816.818	19878.19
817.205	22873.38
817.592	26640.43
817.979	29147.75
818.365	29584.65
818.752	26878.3
819.139	22528.72
819.525	19271.39
819.912	16584.45
820.298	16152.41
820.685	17713.11
821.071	20237.42
821.457	22766.59
821.843	22443.77
822.23	22159.78
822.616	19232.55
823.002	15535.89
823.388	13016.43
823.774	11921.76
824.16	12276.13
824.546	14514.03
824.931	16307.75
825.317	17669.42
825.703	17210.67
826.089	15727.64
826.474	13322.26
826.86	10999.41
827.245	9861.05
827.631	10030.95
828.016	11310.1
828.401	13528.58
828.787	15065.01
829.172	15497.06
829.557	14225.19
829.942	12215.45
830.327	10336.78
830.712	8550.35
831.097	7841.6
831.482	8664.42
831.867	9817.36
832.252	11499.42
832.636	12288.27
833.021	12050.4
833.406	10892.61
833.79	9331.91
834.175	7523.63
834.559	6572.16
834.944	6411.96
835.328	7295.47
835.713	8543.06
836.097	9914.44
836.481	9885.32
836.865	9368.32
837.249	8227.52
837.633	6649.83
838.017	5295.44
838.401	4851.26
838.785	4975.05
839.169	5632.82
839.553	6482.35
839.937	6953.23
840.32	7096.44
840.704	6358.56
841.087	5535.74
841.471	4530.87
841.854	3661.92
842.238	3242.01
842.621	3404.63
843.004	3989.59
843.388	4756.6
843.771	5016.31
844.154	5205.63
844.537	4756.6
844.92	4096.39
845.303	3436.19
845.686	2970.16
846.069	2589.09
846.452	2948.32
846.834	3356.09
847.217	3921.63
847.6	4152.22
847.982	4419.21
848.365	3992.02
848.748	3365.8
849.13	2902.2
849.512	2268.69
849.895	2212.87
850.277	2261.41
850.659	2494.43
851.041	3001.72
851.423	3394.93
851.806	3511.43
852.188	3249.29
852.57	2792.97
852.951	2239.57
853.333	1858.49
853.715	1739.56
854.097	1642.47
854.479	1960.44
854.86	2193.45
855.242	2533.26
855.623	2598.8
856.005	2390.06
856.386	2195.88
856.768	1758.98
857.149	1562.37
857.53	1268.68
857.911	1275.96
858.292	1329.36
858.674	1523.54
859.055	1739.56
859.436	1703.15
859.817	1632.76
860.197	1601.21
860.578	1251.69
860.959	1076.93
861.34	970.13
861.72	873.04
862.101	979.84
862.482	1021.1
862.862	1186.15
863.243	1183.73
863.623	1246.83
864.003	1135.18
864.384	1059.94
864.764	914.3
865.144	749.25
865.524	724.98
865.904	671.58
866.284	812.36
866.664	863.33
867.044	865.76
867.424	904.6
867.804	809.93
868.183	858.48
868.563	715.27
868.943	705.56
869.322	584.2
869.702	465.27
870.081	511.39
870.461	572.07
870.84	589.06
871.22	640.03
871.599	691
871.978	620.61
872.357	669.15
872.736	474.98
873.115	479.83
873.494	453.13
873.873	373.03
874.252	387.6
874.631	421.58
875.01	513.81
875.388	441
875.767	399.73
876.146	511.39
876.524	424.01
876.903	283.23
877.281	326.92
877.66	297.79
878.038	353.62
878.416	307.5
878.794	343.91
879.173	309.93
879.551	382.74
879.929	280.8
880.307	351.19
880.685	275.94
881.063	220.12
881.441	280.8
881.818	285.65
882.196	324.49
882.574	249.25
882.951	232.25
883.329	251.67
883.707	271.09
884.084	273.52
884.461	302.64
884.839	280.8
885.216	283.23
885.593	224.97
885.971	207.98
886.348	212.84
886.725	271.09
887.102	198.27
887.479	237.11
887.856	188.56
888.233	326.92
888.609	239.54
888.986	220.12
889.363	193.42
889.74	295.36
890.116	261.38
890.493	224.97
890.869	210.41
891.246	198.27
891.622	152.16
891.998	178.86
892.375	203.13
892.751	176.43
893.127	181.28
893.503	210.41
893.879	198.27
894.255	207.98
894.631	142.45
895.007	183.71
895.383	176.43
895.759	157.01
896.134	169.15
896.51	205.56
896.886	135.17
897.261	144.87
897.637	263.81
898.012	169.15
898.388	205.56
898.763	144.87
899.138	125.46
899.514	157.01
899.889	171.57
900.264	190.99
900.639	239.54
901.014	198.27
901.389	108.47
901.764	144.87
902.139	217.69
902.513	193.42
902.888	169.15
903.263	176.43
903.638	154.58
904.012	135.17
904.387	193.42
904.761	79.34
905.136	110.89
905.51	110.89
905.884	159.44
906.259	207.98
906.633	207.98
907.007	147.3
907.381	142.45
907.755	157.01
908.129	159.44
908.503	152.16
908.877	125.46
909.251	203.13
909.624	144.87
909.998	130.31
910.372	186.14
910.745	157.01
911.119	98.76
911.492	140.02
911.866	144.87
912.239	159.44
912.612	186.14
912.986	169.15
913.359	140.02
913.732	188.56
914.105	174
914.478	103.61
914.851	91.48
915.224	130.31
915.597	157.01
915.97	164.29
916.343	152.16
916.715	159.44
917.088	169.15
917.461	127.88
917.833	178.86
918.206	203.13
918.578	152.16
918.951	144.87
919.323	157.01
919.695	132.74
920.067	169.15
920.44	91.48
920.812	195.85
921.184	149.73
921.556	144.87
921.928	98.76
922.3	110.89
922.672	174
923.043	217.69
923.415	91.48
923.787	178.86
924.158	118.18
924.53	154.58
924.901	198.27
925.273	110.89
925.644	98.76
926.016	149.73
926.387	135.17
926.758	152.16
927.129	154.58
927.5	157.01
927.872	178.86
928.243	147.3
928.613	181.28
928.984	152.16
929.355	215.26
929.726	50.21
930.097	93.9
930.467	137.59
930.838	186.14
931.209	159.44
931.579	154.58
931.95	183.71
932.32	193.42
932.69	125.46
933.061	154.58
933.431	164.29
933.801	178.86
934.171	159.44
934.541	157.01
934.911	142.45
935.281	193.42
935.651	108.47
936.021	127.88
936.391	106.04
936.761	120.6
937.13	86.62
937.5	152.16
937.87	103.61
938.239	149.73
938.609	110.89
938.978	217.69
939.347	241.96
939.717	120.6
940.086	200.7
940.455	181.28
940.824	144.87
941.193	144.87
941.562	166.72
941.931	154.58
942.3	181.28
942.669	181.28
943.038	125.46
943.407	198.27
943.775	76.91
944.144	220.12
944.513	178.86
944.881	149.73
945.25	113.32
945.618	140.02
945.986	186.14
946.355	176.43
946.723	137.59
947.091	181.28
947.459	135.17
947.827	152.16
948.195	149.73
948.563	215.26
948.931	152.16
949.299	166.72
949.667	79.34
950.035	149.73
950.402	181.28
950.77	137.59
951.138	174
951.505	164.29
951.873	132.74
952.24	74.49
952.607	190.99
952.975	181.28
953.342	118.18
953.709	132.74
954.076	217.69
954.443	103.61
954.81	239.54
955.177	188.56
955.544	171.57
955.911	142.45
956.278	176.43
956.645	188.56
957.012	224.97
957.378	152.16
957.745	127.88
958.111	135.17
958.478	171.57
958.844	147.3
959.211	98.76
959.577	89.05
959.943	215.26
960.309	142.45
960.675	195.85
961.042	142.45
961.408	154.58
961.774	118.18
962.139	137.59
962.505	140.02
962.871	142.45
963.237	166.72
963.603	166.72
963.968	171.57
964.334	108.47
964.699	110.89
965.065	125.46
965.43	89.05
965.796	203.13
966.161	135.17
966.526	178.86
966.891	190.99
967.256	237.11
967.622	188.56
967.987	140.02
968.352	188.56
968.716	188.56
969.081	127.88
969.446	127.88
969.811	152.16
970.176	113.32
970.54	161.87
970.905	123.03
971.269	154.58
971.634	166.72
971.998	166.72
972.363	125.46
972.727	207.98
973.091	176.43
973.455	137.59
973.819	193.42
974.183	198.27
974.547	110.89
974.911	110.89
975.275	166.72
975.639	132.74
976.003	161.87
976.367	142.45
976.73	140.02
977.094	164.29
977.458	188.56
977.821	203.13
978.185	137.59
978.548	222.55
978.911	222.55
979.275	106.04
979.638	152.16
980.001	212.84
980.364	147.3
980.727	190.99
981.09	178.86
981.453	169.15
981.816	135.17
982.179	205.56
982.542	195.85
982.905	132.74
983.267	166.72
983.63	174
983.992	176.43
984.355	186.14
984.717	166.72
985.08	149.73
985.442	89.05
985.804	171.57
986.167	183.71
986.529	171.57
986.891	137.59
987.253	142.45
987.615	178.86
987.977	181.28
988.339	132.74
988.701	161.87
989.062	195.85
989.424	101.18
989.786	198.27
990.147	241.96
990.509	198.27
990.87	144.87
991.232	190.99
991.593	152.16
991.955	178.86
992.316	125.46
992.677	161.87
993.038	108.47
993.399	142.45
993.76	103.61
994.121	123.03
994.482	115.75
994.843	130.31
995.204	142.45
995.565	159.44
995.926	222.55
996.286	144.87
996.647	157.01
997.007	142.45
997.368	115.75
997.728	157.01
998.089	174
998.449	132.74
998.809	135.17
999.169	215.26
999.53	174
999.89	137.59
1000.25	195.85
1000.61	149.73
1000.97	113.32
1001.329	137.59
1001.689	125.46
1002.049	157.01
1002.409	140.02
1002.768	157.01
1003.128	142.45
1003.487	161.87
1003.847	152.16
1004.206	183.71
1004.566	169.15
1004.925	171.57
1005.284	164.29
1005.643	183.71
1006.003	115.75
1006.362	76.91
1006.721	89.05
1007.08	258.95
1007.438	96.33
1007.797	171.57
1008.156	198.27
1008.515	152.16
1008.874	115.75
1009.232	190.99
1009.591	130.31
1009.949	222.55
1010.308	195.85
1010.666	125.46
1011.024	113.32
1011.383	57.49
1011.741	220.12
1012.099	113.32
1012.457	220.12
1012.815	166.72
1013.173	154.58
1013.531	166.72
1013.889	166.72
1014.247	135.17
1014.605	96.33
1014.962	152.16
1015.32	140.02
1015.678	127.88
1016.035	188.56
1016.393	186.14
1016.75	183.71
1017.107	115.75
1017.465	152.16
1017.822	140.02
1018.179	140.02
1018.536	142.45
1018.894	123.03
1019.251	152.16
1019.608	171.57
1019.964	101.18
1020.321	174
1020.678	217.69
1021.035	152.16
1021.392	164.29
1021.748	96.33
1022.105	159.44
1022.461	183.71
1022.818	127.88
1023.174	101.18
1023.531	125.46
1023.887	157.01
1024.243	169.15
1024.599	176.43
1024.955	237.11
1025.311	188.56
1025.667	174
1026.023	188.56
1026.379	132.74
1026.735	203.13
1027.091	171.57
1027.447	207.98
