189.514	21.09
189.973	21.09
190.431	21.09
190.889	-15.32
191.348	28.37
191.806	-34.74
192.264	6.52
192.722	-59.01
193.18	-42.02
193.638	-8.04
194.096	-85.71
194.554	-15.32
195.012	4.1
195.47	-8.04
195.928	33.22
196.385	4.1
196.843	55.07
197.301	59.92
197.758	4.1
198.216	4.1
198.674	33.22
199.131	13.8
199.589	40.5
200.046	-15.32
200.503	-22.6
200.961	123.03
201.418	130.31
201.875	55.07
202.332	76.91
202.79	103.61
203.247	40.5
203.704	103.61
204.161	103.61
204.618	164.29
205.075	178.86
205.532	98.76
205.989	154.58
206.445	144.87
206.902	183.71
207.359	152.16
207.816	106.04
208.272	149.73
208.729	79.34
209.185	120.6
209.642	125.46
210.098	127.88
210.555	152.16
211.011	35.65
211.467	101.18
211.924	171.57
212.38	76.91
212.836	108.47
213.292	149.73
213.748	115.75
214.204	123.03
214.66	125.46
215.116	135.17
215.572	103.61
216.028	113.32
216.484	96.33
216.94	171.57
217.396	174
217.851	81.77
218.307	135.17
218.763	142.45
219.218	137.59
219.674	125.46
220.129	101.18
220.585	89.05
221.04	110.89
221.496	120.6
221.951	64.78
222.406	127.88
222.861	183.71
223.317	144.87
223.772	152.16
224.227	120.6
224.682	140.02
225.137	132.74
225.592	67.2
226.047	125.46
226.502	103.61
226.957	149.73
227.411	183.71
227.866	86.62
228.321	130.31
228.776	176.43
229.23	89.05
229.685	149.73
230.139	110.89
230.594	130.31
231.048	166.72
231.503	110.89
231.957	81.77
232.411	103.61
232.865	174
233.32	142.45
233.774	93.9
234.228	91.48
234.682	79.34
235.136	164.29
235.59	142.45
236.044	164.29
236.498	81.77
236.952	72.06
237.406	190.99
237.86	101.18
238.313	101.18
238.767	152.16
239.221	74.49
239.674	132.74
240.128	127.88
240.581	108.47
241.035	123.03
241.488	72.06
241.942	132.74
242.395	159.44
242.848	108.47
243.301	101.18
243.755	125.46
244.208	195.85
244.661	108.47
245.114	147.3
245.567	120.6
246.02	96.33
246.473	200.7
246.926	120.6
247.379	123.03
247.832	198.27
248.284	62.35
248.737	193.42
249.19	193.42
249.642	152.16
250.095	101.18
250.547	86.62
251	166.72
251.452	183.71
251.905	96.33
252.357	120.6
252.81	118.18
253.262	178.86
253.714	120.6
254.166	166.72
254.618	149.73
255.07	96.33
255.523	106.04
255.975	140.02
256.427	118.18
256.878	96.33
257.33	115.75
257.782	147.3
258.234	108.47
258.686	212.84
259.137	93.9
259.589	127.88
260.041	84.19
260.492	89.05
260.944	159.44
261.395	234.68
261.847	200.7
262.298	76.91
262.749	125.46
263.201	120.6
263.652	118.18
264.103	181.28
264.554	137.59
265.005	118.18
265.457	176.43
265.908	193.42
266.359	137.59
266.809	142.45
267.26	205.56
267.711	125.46
268.162	135.17
268.613	195.85
269.064	190.99
269.514	137.59
269.965	123.03
270.415	108.47
270.866	113.32
271.316	35.65
271.767	81.77
272.217	101.18
272.668	127.88
273.118	137.59
273.568	164.29
274.019	42.93
274.469	91.48
274.919	81.77
275.369	178.86
275.819	64.78
276.269	130.31
276.719	52.64
277.169	183.71
277.619	76.91
278.069	86.62
278.518	157.01
278.968	159.44
279.418	108.47
279.867	171.57
280.317	79.34
280.767	174
281.216	159.44
281.666	142.45
282.115	181.28
282.564	152.16
283.014	67.2
283.463	154.58
283.912	98.76
284.361	174
284.811	147.3
285.26	144.87
285.709	115.75
286.158	203.13
286.607	137.59
287.056	181.28
287.505	74.49
287.953	45.36
288.402	135.17
288.851	169.15
289.3	127.88
289.748	183.71
290.197	123.03
290.646	164.29
291.094	154.58
291.543	125.46
291.991	181.28
292.439	176.43
292.888	144.87
293.336	135.17
293.784	176.43
294.233	123.03
294.681	178.86
295.129	149.73
295.577	108.47
296.025	118.18
296.473	166.72
296.921	137.59
297.369	130.31
297.817	72.06
298.264	147.3
298.712	28.37
299.16	89.05
299.608	91.48
300.055	193.42
300.503	169.15
300.95	171.57
301.398	178.86
301.845	137.59
302.293	154.58
302.74	38.08
303.187	115.75
303.635	169.15
304.082	110.89
304.529	154.58
304.976	152.16
305.423	118.18
305.87	108.47
306.317	193.42
306.764	193.42
307.211	130.31
307.658	67.2
308.105	157.01
308.552	125.46
308.998	157.01
309.445	157.01
309.892	164.29
310.338	166.72
310.785	181.28
311.231	186.14
311.678	132.74
312.124	149.73
312.571	118.18
313.017	98.76
313.463	159.44
313.909	93.9
314.356	178.86
314.802	188.56
315.248	130.31
315.694	130.31
316.14	149.73
316.586	166.72
317.032	174
317.478	161.87
317.923	222.55
318.369	193.42
318.815	127.88
319.261	171.57
319.706	166.72
320.152	113.32
320.597	144.87
321.043	176.43
321.488	203.13
321.934	130.31
322.379	144.87
322.824	152.16
323.27	103.61
323.715	161.87
324.16	76.91
324.605	67.2
325.05	93.9
325.495	113.32
325.94	149.73
326.385	161.87
326.83	79.34
327.275	239.54
327.72	84.19
328.165	140.02
328.61	98.76
329.054	164.29
329.499	166.72
329.943	166.72
330.388	178.86
330.832	110.89
331.277	200.7
331.721	166.72
332.166	118.18
332.61	159.44
333.054	127.88
333.499	135.17
333.943	120.6
334.387	183.71
334.831	89.05
335.275	178.86
335.719	106.04
336.163	76.91
336.607	110.89
337.051	118.18
337.495	157.01
337.938	101.18
338.382	59.92
338.826	166.72
339.269	198.27
339.713	108.47
340.157	113.32
340.6	115.75
341.044	161.87
341.487	169.15
341.93	181.28
342.374	137.59
342.817	142.45
343.26	178.86
343.703	140.02
344.146	74.49
344.59	106.04
345.033	137.59
345.476	96.33
345.919	127.88
346.361	96.33
346.804	152.16
347.247	108.47
347.69	178.86
348.133	123.03
348.575	159.44
349.018	132.74
349.461	86.62
349.903	103.61
350.346	76.91
350.788	147.3
351.23	86.62
351.673	120.6
352.115	106.04
352.557	186.14
353	166.72
353.442	118.18
353.884	152.16
354.326	176.43
354.768	127.88
355.21	103.61
355.652	132.74
356.094	171.57
356.536	152.16
356.978	132.74
357.419	147.3
357.861	108.47
358.303	174
358.744	127.88
359.186	144.87
359.627	207.98
360.069	137.59
360.51	142.45
360.952	140.02
361.393	159.44
361.834	171.57
362.276	161.87
362.717	157.01
363.158	79.34
363.599	147.3
364.04	178.86
364.481	96.33
364.922	96.33
365.363	137.59
365.804	137.59
366.245	159.44
366.686	205.56
367.126	132.74
367.567	135.17
368.008	125.46
368.448	159.44
368.889	164.29
369.33	127.88
369.77	144.87
370.21	132.74
370.651	110.89
371.091	120.6
371.531	74.49
371.972	166.72
372.412	159.44
372.852	207.98
373.292	198.27
373.732	130.31
374.172	200.7
374.612	147.3
375.052	140.02
375.492	91.48
375.932	157.01
376.372	157.01
376.811	217.69
377.251	137.59
377.691	93.9
378.13	42.93
378.57	159.44
379.009	188.56
379.449	101.18
379.888	79.34
380.328	108.47
380.767	174
381.206	45.36
381.645	142.45
382.085	103.61
382.524	144.87
382.963	154.58
383.402	101.18
383.841	171.57
384.28	198.27
384.719	149.73
385.158	89.05
385.596	203.13
386.035	142.45
386.474	142.45
386.913	157.01
387.351	149.73
387.79	157.01
388.228	142.45
388.667	64.78
389.105	137.59
389.544	152.16
389.982	132.74
390.42	110.89
390.859	101.18
391.297	86.62
391.735	74.49
392.173	152.16
392.611	113.32
393.049	135.17
393.487	169.15
393.925	76.91
394.363	161.87
394.801	152.16
395.239	106.04
395.676	190.99
396.114	98.76
396.552	135.17
396.989	108.47
397.427	42.93
397.864	98.76
398.302	166.72
398.739	178.86
399.177	96.33
399.614	127.88
400.051	183.71
400.488	101.18
400.926	144.87
401.363	147.3
401.8	147.3
402.237	152.16
402.674	96.33
403.111	113.32
403.548	154.58
403.985	103.61
404.421	84.19
404.858	108.47
405.295	118.18
405.732	132.74
406.168	132.74
406.605	123.03
407.041	212.84
407.478	152.16
407.914	115.75
408.351	113.32
408.787	115.75
409.223	123.03
409.66	118.18
410.096	152.16
410.532	166.72
410.968	149.73
411.404	110.89
411.84	137.59
412.276	169.15
412.712	164.29
413.148	176.43
413.584	101.18
414.02	98.76
414.455	157.01
414.891	140.02
415.327	101.18
415.762	89.05
416.198	113.32
416.633	101.18
417.069	152.16
417.504	96.33
417.94	157.01
418.375	86.62
418.81	159.44
419.245	137.59
419.681	174
420.116	91.48
420.551	171.57
420.986	130.31
421.421	113.32
421.856	140.02
422.291	166.72
422.726	91.48
423.16	120.6
423.595	103.61
424.03	120.6
424.464	108.47
424.899	205.56
425.334	101.18
425.768	115.75
426.203	123.03
426.637	166.72
427.071	140.02
427.506	186.14
427.94	140.02
428.374	132.74
428.809	193.42
429.243	142.45
429.677	200.7
430.111	195.85
430.545	190.99
430.979	178.86
431.413	171.57
431.847	132.74
432.28	103.61
432.714	84.19
433.148	118.18
433.582	157.01
434.015	181.28
434.449	149.73
434.882	176.43
435.316	176.43
435.749	127.88
436.183	152.16
436.616	169.15
437.049	166.72
437.483	159.44
437.916	186.14
438.349	164.29
438.782	186.14
439.215	193.42
439.648	174
440.081	198.27
440.514	69.63
440.947	154.58
441.38	152.16
441.813	142.45
442.245	227.4
442.678	157.01
443.111	137.59
443.543	227.4
443.976	144.87
444.408	174
444.841	224.97
445.273	178.86
445.705	120.6
446.138	157.01
446.57	195.85
447.002	152.16
447.434	215.26
447.867	174
448.299	249.25
448.731	212.84
449.163	215.26
449.595	149.73
450.026	217.69
450.458	183.71
450.89	258.95
451.322	271.09
451.754	285.65
452.185	244.39
452.617	254.1
453.048	271.09
453.48	324.49
453.911	295.36
454.343	263.81
454.774	322.06
455.205	305.07
455.637	241.96
456.068	266.24
456.499	300.22
456.93	249.25
457.361	290.51
457.792	263.81
458.223	234.68
458.654	322.06
459.085	224.97
459.516	251.67
459.947	249.25
460.378	322.06
460.808	254.1
461.239	261.38
461.669	256.53
462.1	285.65
462.531	249.25
462.961	217.69
463.391	266.24
463.822	305.07
464.252	227.4
464.682	232.25
465.113	271.09
465.543	222.55
465.973	290.51
466.403	254.1
466.833	271.09
467.263	285.65
467.693	241.96
468.123	232.25
468.553	273.52
468.983	176.43
469.412	224.97
469.842	178.86
470.272	239.54
470.701	271.09
471.131	244.39
471.56	159.44
471.99	244.39
472.419	140.02
472.849	271.09
473.278	193.42
473.707	190.99
474.136	169.15
474.566	244.39
474.995	258.95
475.424	220.12
475.853	229.83
476.282	220.12
476.711	220.12
477.14	157.01
477.569	183.71
477.997	256.53
478.426	186.14
478.855	215.26
479.283	198.27
479.712	273.52
480.141	244.39
480.569	234.68
480.998	220.12
481.426	118.18
481.854	171.57
482.283	210.41
482.711	154.58
483.139	140.02
483.567	171.57
483.995	132.74
484.424	140.02
484.852	232.25
485.28	190.99
485.708	215.26
486.135	237.11
486.563	120.6
486.991	207.98
487.419	159.44
487.847	152.16
488.274	174
488.702	130.31
489.129	154.58
489.557	154.58
489.984	241.96
490.412	152.16
490.839	190.99
491.266	232.25
491.694	186.14
492.121	186.14
492.548	198.27
492.975	246.82
493.402	239.54
493.829	142.45
494.256	127.88
494.683	164.29
495.11	229.83
495.537	164.29
495.964	127.88
496.39	190.99
496.817	161.87
497.244	205.56
497.67	149.73
498.097	220.12
498.523	140.02
498.95	127.88
499.376	142.45
499.803	178.86
500.229	174
500.655	157.01
501.081	127.88
501.508	229.83
501.934	144.87
502.36	154.58
502.786	157.01
503.212	142.45
503.638	200.7
504.064	169.15
504.489	147.3
504.915	176.43
505.341	200.7
505.767	178.86
506.192	101.18
506.618	115.75
507.043	161.87
507.469	132.74
507.894	154.58
508.32	203.13
508.745	86.62
509.17	118.18
509.596	234.68
510.021	130.31
510.446	169.15
510.871	118.18
511.296	113.32
511.721	244.39
512.146	183.71
512.571	157.01
512.996	183.71
513.421	198.27
513.845	205.56
514.27	178.86
514.695	123.03
515.119	154.58
515.544	200.7
515.969	91.48
516.393	113.32
516.817	164.29
517.242	186.14
517.666	195.85
518.09	69.63
518.515	157.01
518.939	74.49
519.363	394.88
519.787	159.44
520.211	154.58
520.635	183.71
521.059	96.33
521.483	166.72
521.907	159.44
522.331	190.99
522.754	190.99
523.178	164.29
523.602	249.25
524.025	118.18
524.449	258.95
524.872	137.59
525.296	149.73
525.719	174
526.143	207.98
526.566	232.25
526.989	171.57
527.412	166.72
527.836	207.98
528.259	232.25
528.682	164.29
529.105	200.7
529.528	154.58
529.951	154.58
530.374	157.01
530.796	108.47
531.219	123.03
531.642	132.74
532.065	164.29
532.487	183.71
532.91	174
533.332	176.43
533.755	152.16
534.177	164.29
534.6	169.15
535.022	181.28
535.444	147.3
535.867	188.56
536.289	144.87
536.711	176.43
537.133	241.96
537.555	224.97
537.977	205.56
538.399	171.57
538.821	241.96
539.243	198.27
539.665	203.13
540.086	207.98
540.508	198.27
540.93	183.71
541.351	224.97
541.773	149.73
542.195	227.4
542.616	198.27
543.037	222.55
543.459	249.25
543.88	217.69
544.301	244.39
544.723	198.27
545.144	256.53
545.565	195.85
545.986	198.27
546.407	186.14
546.828	159.44
547.249	215.26
547.67	142.45
548.091	229.83
548.512	217.69
548.932	157.01
549.353	118.18
549.774	205.56
550.194	152.16
550.615	210.41
551.035	174
551.456	125.46
551.876	154.58
552.296	154.58
552.717	215.26
553.137	215.26
553.557	229.83
553.977	227.4
554.397	176.43
554.817	178.86
555.237	183.71
555.657	239.54
556.077	171.57
556.497	198.27
556.917	200.7
557.337	152.16
557.756	227.4
558.176	123.03
558.596	157.01
559.015	207.98
559.435	190.99
559.854	176.43
560.274	222.55
560.693	127.88
561.112	110.89
561.532	152.16
561.951	188.56
562.37	178.86
562.789	166.72
563.208	144.87
563.627	142.45
564.046	152.16
564.465	132.74
564.884	166.72
565.303	72.06
565.722	135.17
566.14	190.99
566.559	164.29
566.978	130.31
567.396	171.57
567.815	200.7
568.233	188.56
568.652	188.56
569.07	178.86
569.489	217.69
569.907	159.44
570.325	174
570.743	217.69
571.161	147.3
571.58	195.85
571.998	176.43
572.416	220.12
572.833	113.32
573.251	227.4
573.669	110.89
574.087	227.4
574.505	157.01
574.922	115.75
575.34	220.12
575.758	159.44
576.175	166.72
576.593	222.55
577.01	161.87
577.428	178.86
577.845	1377.9
578.262	280.8
578.68	161.87
579.097	205.56
579.514	227.4
579.931	190.99
580.348	169.15
580.765	203.13
581.182	176.43
581.599	285.65
582.016	137.59
582.433	106.04
582.849	215.26
583.266	198.27
583.683	203.13
584.099	159.44
584.516	103.61
584.933	164.29
585.349	135.17
585.765	207.98
586.182	176.43
586.598	127.88
587.014	149.73
587.431	229.83
587.847	195.85
588.263	190.99
588.679	144.87
589.095	193.42
589.511	212.84
589.927	220.12
590.343	227.4
590.759	137.59
591.174	171.57
591.59	164.29
592.006	149.73
592.421	169.15
592.837	183.71
593.252	205.56
593.668	203.13
594.083	152.16
594.499	210.41
594.914	147.3
595.329	159.44
595.745	89.05
596.16	118.18
596.575	186.14
596.99	140.02
597.405	212.84
597.82	193.42
598.235	193.42
598.65	161.87
599.065	186.14
599.479	144.87
599.894	222.55
600.309	169.15
600.724	161.87
601.138	244.39
601.553	212.84
601.967	205.56
602.382	239.54
602.796	210.41
603.21	171.57
603.625	181.28
604.039	188.56
604.453	222.55
604.867	125.46
605.281	207.98
605.695	137.59
606.109	186.14
606.523	200.7
606.937	159.44
607.351	309.93
607.765	142.45
608.178	164.29
608.592	193.42
609.006	190.99
609.419	152.16
609.833	130.31
610.246	159.44
610.66	200.7
611.073	207.98
611.487	169.15
611.9	130.31
612.313	154.58
612.726	186.14
613.139	195.85
613.553	157.01
613.966	166.72
614.379	200.7
614.792	140.02
615.204	115.75
615.617	127.88
616.03	217.69
616.443	263.81
616.856	166.72
617.268	147.3
617.681	229.83
618.093	149.73
618.506	157.01
618.918	178.86
619.331	171.57
619.743	183.71
620.155	164.29
620.568	137.59
620.98	103.61
621.392	198.27
621.804	207.98
622.216	118.18
622.628	137.59
623.04	232.25
623.452	169.15
623.864	205.56
624.276	106.04
624.687	161.87
625.099	164.29
625.511	106.04
625.922	241.96
626.334	217.69
626.745	101.18
627.157	147.3
627.568	147.3
627.979	166.72
628.391	142.45
628.802	142.45
629.213	132.74
629.624	132.74
630.035	108.47
630.446	91.48
630.857	113.32
631.268	113.32
631.679	125.46
632.09	79.34
632.501	132.74
632.912	130.31
633.322	181.28
633.733	103.61
634.144	152.16
634.554	137.59
634.965	161.87
635.375	152.16
635.785	205.56
636.196	147.3
636.606	195.85
637.016	125.46
637.427	132.74
637.837	190.99
638.247	212.84
638.657	152.16
639.067	212.84
639.477	110.89
639.887	195.85
640.297	176.43
640.706	205.56
641.116	147.3
641.526	123.03
641.935	198.27
642.345	127.88
642.755	186.14
643.164	130.31
643.573	169.15
643.983	130.31
644.392	190.99
644.801	144.87
645.211	188.56
645.62	76.91
646.029	149.73
646.438	157.01
646.847	147.3
647.256	81.77
647.665	171.57
648.074	120.6
648.483	152.16
648.892	115.75
649.3	132.74
649.709	47.79
650.118	186.14
650.526	127.88
650.935	169.15
651.343	93.9
651.752	91.48
652.16	203.13
652.568	171.57
652.977	190.99
653.385	190.99
653.793	161.87
654.201	98.76
654.609	181.28
655.017	137.59
655.425	137.59
655.833	166.72
656.241	152.16
656.649	186.14
657.057	164.29
657.464	67.2
657.872	166.72
658.28	241.96
658.687	174
659.095	47.79
659.502	174
659.91	115.75
660.317	183.71
660.724	108.47
661.132	164.29
661.539	149.73
661.946	89.05
662.353	178.86
662.76	101.18
663.167	106.04
663.574	137.59
663.981	144.87
664.388	169.15
664.795	188.56
665.202	186.14
665.608	123.03
666.015	159.44
666.422	152.16
666.828	157.01
667.235	174
667.641	113.32
668.047	130.31
668.454	130.31
668.86	161.87
669.266	147.3
669.673	120.6
670.079	164.29
670.485	140.02
670.891	164.29
671.297	152.16
671.703	200.7
672.109	120.6
672.515	103.61
672.92	140.02
673.326	159.44
673.732	84.19
674.138	215.26
674.543	130.31
674.949	183.71
675.354	106.04
675.76	86.62
676.165	123.03
676.57	125.46
676.976	101.18
677.381	190.99
677.786	166.72
678.191	125.46
678.596	110.89
679.001	120.6
679.406	178.86
679.811	171.57
680.216	152.16
680.621	207.98
681.026	171.57
681.43	132.74
681.835	120.6
682.24	178.86
682.644	195.85
683.049	93.9
683.453	186.14
683.858	113.32
684.262	193.42
684.667	91.48
685.071	144.87
685.475	86.62
685.879	154.58
686.283	144.87
686.687	161.87
687.091	98.76
687.495	113.32
687.899	178.86
688.303	106.04
688.707	144.87
689.111	108.47
689.514	210.41
689.918	215.26
690.322	115.75
690.725	137.59
691.129	203.13
691.532	164.29
691.936	169.15
692.339	147.3
692.742	200.7
693.146	152.16
693.549	205.56
693.952	193.42
694.355	174
694.758	101.18
695.161	101.18
695.564	195.85
695.967	229.83
696.37	52.64
696.773	106.04
697.175	186.14
697.578	164.29
697.981	147.3
698.383	142.45
698.786	161.87
699.188	215.26
699.591	159.44
699.993	137.59
700.395	161.87
700.798	205.56
701.2	166.72
701.602	144.87
702.004	190.99
702.406	108.47
702.808	203.13
703.21	190.99
703.612	166.72
704.014	200.7
704.416	171.57
704.818	227.4
705.219	203.13
705.621	205.56
706.023	200.7
706.424	241.96
706.826	144.87
707.227	241.96
707.629	152.16
708.03	254.1
708.431	266.24
708.832	234.68
709.234	222.55
709.635	198.27
710.036	241.96
710.437	198.27
710.838	227.4
711.239	244.39
711.64	232.25
712.041	290.51
712.441	278.37
712.842	227.4
713.243	239.54
713.643	169.15
714.044	283.23
714.445	261.38
714.845	283.23
715.246	232.25
715.646	275.94
716.046	307.5
716.447	227.4
716.847	275.94
717.247	222.55
717.647	285.65
718.047	258.95
718.447	295.36
718.847	266.24
719.247	309.93
719.647	336.63
720.047	397.31
720.446	305.07
720.846	324.49
721.246	290.51
721.645	363.32
722.045	329.34
722.444	404.59
722.844	433.71
723.243	348.76
723.643	409.44
724.042	380.32
724.441	392.45
724.84	399.73
725.24	397.31
725.639	346.33
726.038	501.68
726.437	482.26
726.836	525.95
727.234	474.98
727.633	504.1
728.032	518.67
728.431	530.8
728.83	535.66
729.228	574.49
729.627	644.88
730.025	661.87
730.424	640.03
730.822	703.14
731.22	766.24
731.619	775.95
732.017	778.38
732.415	831.78
732.813	928.87
733.212	936.15
733.61	1079.36
734.008	1021.1
734.406	1016.25
734.803	1147.32
735.201	1283.24
735.599	1380.33
735.997	1390.04
736.395	1256.54
736.792	1472.57
737.19	1669.17
737.587	1712.86
737.985	1732.28
738.382	1678.88
738.78	1858.49
739.177	2101.22
739.574	2239.57
739.971	2212.87
740.369	2038.11
740.766	2365.78
741.163	2528.41
741.56	2785.69
741.957	2676.47
742.354	2569.67
742.751	2843.95
743.147	3244.44
743.544	3319.68
743.941	3259
744.338	3198.32
744.734	3419.2
745.131	3671.63
745.527	4234.74
745.924	4300.28
746.32	3933.77
746.716	4191.05
747.113	4783.3
747.509	5246.9
747.905	5441.07
748.301	5188.64
748.697	5096.41
749.093	6098.85
749.489	6623.13
749.885	6688.67
750.281	6259.05
750.677	6385.26
751.073	7103.72
751.468	8142.57
751.864	8409.57
752.26	7727.52
752.655	7523.63
753.051	8363.45
753.446	9902.31
753.842	9992.12
754.237	9759.1
754.632	9021.23
755.028	9380.46
755.423	10916.89
755.818	11492.14
756.213	10878.05
756.608	10130.47
757.003	10443.58
757.398	11086.79
757.793	12220.31
758.188	12234.87
758.583	11353.79
758.977	11055.24
759.372	12504.29
759.767	14154.8
760.161	15307.73
760.556	14480.05
760.95	13698.48
761.345	14649.95
761.739	17528.64
762.133	18917.01
762.527	18921.87
762.922	17057.76
763.316	17116.01
763.71	19261.68
764.104	20960.73
764.498	21669.48
764.892	20385.48
765.286	19417.02
765.68	20198.58
766.073	22936.49
766.467	24492.34
766.861	24404.96
767.255	22264.15
767.648	22684.06
768.042	24492.34
768.435	27771.52
768.829	28579.78
769.222	26171.98
769.615	24055.44
770.008	24829.72
770.402	27577.34
770.795	29875.92
771.188	29118.63
771.581	25977.8
771.974	24684.09
772.367	25919.55
772.76	29159.89
773.153	29494.85
773.545	27303.06
773.938	25468.08
774.331	24691.37
774.724	27939
775.116	32436.64
775.509	33009.46
775.901	30737.58
776.294	29033.67
776.686	29844.37
777.078	34834.73
777.471	37946.43
777.863	37660.02
778.255	34900.27
778.647	33179.37
779.039	35533.77
779.431	39118.78
779.823	41220.76
780.215	39043.54
780.607	34965.8
780.999	35123.57
781.39	37803.23
781.782	42269.32
782.174	43509.63
782.565	40177.05
782.957	36225.53
783.348	35893
783.74	40067.83
784.131	43016.9
784.522	43781.48
784.914	40065.4
785.305	36230.39
785.696	36155.14
786.087	39106.65
786.478	41815.43
786.869	40157.63
787.26	36936.71
787.651	32460.91
788.042	32820.14
788.433	35320.18
788.823	37460.99
789.214	36232.81
789.605	32176.93
789.995	29094.35
790.386	29375.91
790.776	32851.69
791.167	35487.66
791.557	34951.24
791.948	32101.68
792.338	29184.16
792.728	30987.59
793.118	34956.1
793.508	37761.96
793.898	36749.81
794.288	33803.17
794.678	30633.21
795.068	31402.64
795.458	34152.69
795.848	37325.06
796.238	37026.52
796.627	33613.84
797.017	30247.28
797.406	30616.22
797.796	33048.3
798.185	36582.33
798.575	37633.32
798.964	33543.45
799.354	30718.17
799.743	29837.08
800.132	33220.63
800.521	36475.54
800.91	37354.19
801.299	34766.77
801.688	30718.17
802.077	28703.57
802.466	31494.88
802.855	34463.37
803.244	34371.14
803.633	33147.82
804.021	29138.04
804.41	26754.51
804.799	27344.33
805.187	29358.92
805.576	30929.33
805.964	29579.8
806.352	25909.84
806.741	23786.02
807.129	23477.76
807.517	25271.48
807.905	28247.25
808.293	28300.65
808.681	26154.99
809.069	23312.71
809.457	23434.07
809.845	25157.4
810.233	27560.35
810.621	28895.32
811.009	27703.56
811.396	25014.19
811.784	23060.28
812.171	23572.42
812.559	26339.46
812.946	27638.02
813.334	26540.92
813.721	24167.09
814.108	21514.14
814.496	20912.19
814.883	22662.22
815.27	25283.62
815.657	25946.25
816.044	24528.75
816.431	21718.03
816.818	20591.79
817.205	21276.27
817.592	23196.2
817.979	23943.79
818.365	23259.31
818.752	20938.89
819.139	18565.06
819.525	17875.73
819.912	18883.03
820.298	20395.19
820.685	20390.34
821.071	19414.59
821.457	17366.02
821.843	14938.79
822.23	14878.11
822.616	15793.18
823.002	16458.24
823.388	15856.28
823.774	14720.34
824.16	12924.2
824.546	11853.79
824.931	12193.61
825.317	13140.22
825.703	14191.21
826.089	13652.37
826.474	12446.04
826.86	10924.17
827.245	10361.05
827.631	11230
828.016	12293.12
828.401	12652.35
828.787	11948.46
829.172	10356.2
829.557	9283.37
829.942	9018.8
830.327	9742.11
830.712	10426.59
831.097	10492.12
831.482	9924.15
831.867	8521.22
832.252	7555.18
832.636	7836.74
833.021	8395
833.406	9312.49
833.79	9137.73
834.175	8465.39
834.559	7302.75
834.944	6499.34
835.328	6365.85
835.713	7200.81
836.097	7552.76
836.481	7652.27
836.865	6644.98
837.249	5807.58
837.633	5300.29
838.017	5307.58
838.401	5814.87
838.785	6098.85
839.169	6154.68
839.553	5397.38
839.937	4409.5
840.32	3945.9
840.704	3958.04
841.087	4176.49
841.471	4513.87
841.854	4666.79
842.238	4210.47
842.621	3504.15
843.004	3072.1
843.388	3101.23
843.771	3618.23
844.154	3729.88
844.537	3921.63
844.92	3591.53
845.303	3030.84
845.686	2710.45
846.069	2725.01
846.452	3028.41
846.834	3407.06
847.217	3319.68
847.6	3074.53
847.982	2749.28
848.365	2261.41
848.748	2157.04
849.13	2334.23
849.512	2562.39
849.895	2836.66
850.277	2676.47
850.659	2370.64
851.041	2028.4
851.423	1885.19
851.806	1960.44
852.188	2178.89
852.57	2373.06
852.951	2431.32
853.333	2089.08
853.715	1894.9
854.097	1528.39
854.479	1589.07
854.86	1722.57
855.242	2038.11
855.623	1914.32
856.005	1678.88
856.386	1477.42
856.768	1241.98
857.149	1273.53
857.53	1314.8
857.911	1511.4
858.292	1443.44
858.674	1365.77
859.055	1232.27
859.436	950.71
859.817	873.04
860.197	875.47
860.578	1035.67
860.959	1079.36
861.34	1106.05
861.72	1023.53
862.101	873.04
862.482	707.99
862.862	683.72
863.243	826.92
863.623	957.99
864.003	885.18
864.384	953.14
864.764	802.65
865.144	642.46
865.524	630.32
865.904	618.18
866.284	732.26
866.664	734.69
867.044	754.11
867.424	666.73
867.804	686.15
868.183	487.11
868.563	542.94
868.943	564.78
869.322	596.34
869.702	693.43
870.081	618.18
870.461	482.26
870.84	506.53
871.22	494.39
871.599	426.43
871.978	467.7
872.357	530.8
872.736	499.25
873.115	460.41
873.494	363.32
873.873	448.28
874.252	387.6
874.631	368.18
875.01	365.75
875.388	348.76
875.767	377.89
876.146	319.63
876.524	319.63
876.903	280.8
877.281	263.81
877.66	309.93
878.038	365.75
878.416	288.08
878.794	263.81
879.173	322.06
879.551	278.37
879.929	241.96
880.307	271.09
880.685	249.25
881.063	244.39
881.441	285.65
881.818	280.8
882.196	220.12
882.574	178.86
882.951	137.59
883.329	261.38
883.707	203.13
884.084	244.39
884.461	198.27
884.839	222.55
885.216	210.41
885.593	149.73
885.971	239.54
886.348	207.98
886.725	190.99
887.102	203.13
887.479	237.11
887.856	200.7
888.233	222.55
888.609	125.46
888.986	159.44
889.363	157.01
889.74	166.72
890.116	249.25
890.493	239.54
890.869	309.93
891.246	200.7
891.622	200.7
891.998	152.16
892.375	174
892.751	178.86
893.127	215.26
893.503	130.31
893.879	181.28
894.255	135.17
894.631	178.86
895.007	154.58
895.383	176.43
895.759	161.87
896.134	123.03
896.51	130.31
896.886	161.87
897.261	135.17
897.637	142.45
898.012	181.28
898.388	149.73
898.763	130.31
899.138	101.18
899.514	59.92
899.889	181.28
900.264	106.04
900.639	108.47
901.014	181.28
901.389	142.45
901.764	127.88
902.139	171.57
902.513	123.03
902.888	183.71
903.263	157.01
903.638	142.45
904.012	203.13
904.387	149.73
904.761	140.02
905.136	72.06
905.51	115.75
905.884	174
906.259	149.73
906.633	98.76
907.007	159.44
907.381	69.63
907.755	118.18
908.129	142.45
908.503	157.01
908.877	125.46
909.251	154.58
909.624	135.17
909.998	147.3
910.372	91.48
910.745	135.17
911.119	79.34
911.492	154.58
911.866	125.46
912.239	137.59
912.612	127.88
912.986	135.17
913.359	135.17
913.732	96.33
914.105	91.48
914.478	115.75
914.851	142.45
915.224	135.17
915.597	142.45
915.97	81.77
916.343	200.7
916.715	96.33
917.088	149.73
917.461	164.29
917.833	89.05
918.206	210.41
918.578	166.72
918.951	81.77
919.323	142.45
919.695	147.3
920.067	171.57
920.44	176.43
920.812	144.87
921.184	76.91
921.556	161.87
921.928	106.04
922.3	176.43
922.672	108.47
923.043	161.87
923.415	120.6
923.787	125.46
924.158	127.88
924.53	154.58
924.901	188.56
925.273	190.99
925.644	101.18
926.016	79.34
926.387	103.61
926.758	161.87
927.129	89.05
927.5	101.18
927.872	127.88
928.243	171.57
928.613	125.46
928.984	106.04
929.355	137.59
929.726	176.43
930.097	125.46
930.467	137.59
930.838	159.44
931.209	115.75
931.579	110.89
931.95	101.18
932.32	115.75
932.69	93.9
933.061	93.9
933.431	113.32
933.801	130.31
934.171	135.17
934.541	169.15
934.911	130.31
935.281	140.02
935.651	106.04
936.021	144.87
936.391	127.88
936.761	125.46
937.13	108.47
937.5	176.43
937.87	130.31
938.239	149.73
938.609	171.57
938.978	67.2
939.347	137.59
939.717	98.76
940.086	169.15
940.455	38.08
940.824	28.37
941.193	237.11
941.562	203.13
941.931	101.18
942.3	159.44
942.669	193.42
943.038	79.34
943.407	142.45
943.775	227.4
944.144	89.05
944.513	159.44
944.881	110.89
945.25	203.13
945.618	123.03
945.986	186.14
946.355	161.87
946.723	123.03
947.091	190.99
947.459	144.87
947.827	74.49
948.195	84.19
948.563	96.33
948.931	84.19
949.299	91.48
949.667	132.74
950.035	91.48
950.402	135.17
950.77	47.79
951.138	147.3
951.505	118.18
951.873	140.02
952.24	147.3
952.607	96.33
952.975	120.6
953.342	118.18
953.709	76.91
954.076	81.77
954.443	152.16
954.81	174
955.177	113.32
955.544	93.9
955.911	183.71
956.278	132.74
956.645	115.75
957.012	147.3
957.378	147.3
957.745	115.75
958.111	106.04
958.478	140.02
958.844	190.99
959.211	149.73
959.577	93.9
959.943	186.14
960.309	96.33
960.675	98.76
961.042	115.75
961.408	132.74
961.774	149.73
962.139	132.74
962.505	186.14
962.871	93.9
963.237	89.05
963.603	137.59
963.968	30.8
964.334	193.42
964.699	186.14
965.065	159.44
965.43	98.76
965.796	154.58
966.161	74.49
966.526	130.31
966.891	118.18
967.256	125.46
967.622	115.75
967.987	115.75
968.352	101.18
968.716	110.89
969.081	120.6
969.446	91.48
969.811	166.72
970.176	76.91
970.54	183.71
970.905	118.18
971.269	198.27
971.634	110.89
971.998	98.76
972.363	176.43
972.727	200.7
973.091	161.87
973.455	169.15
973.819	103.61
974.183	106.04
974.547	147.3
974.911	183.71
975.275	193.42
975.639	115.75
976.003	178.86
976.367	64.78
976.73	64.78
977.094	174
977.458	149.73
977.821	123.03
978.185	140.02
978.548	161.87
978.911	110.89
979.275	118.18
979.638	198.27
980.001	147.3
980.364	108.47
980.727	171.57
981.09	178.86
981.453	154.58
981.816	157.01
982.179	183.71
982.542	127.88
982.905	118.18
983.267	113.32
983.63	137.59
983.992	249.25
984.355	81.77
984.717	118.18
985.08	137.59
985.442	108.47
985.804	101.18
986.167	166.72
986.529	84.19
986.891	125.46
987.253	183.71
987.615	127.88
987.977	98.76
988.339	89.05
988.701	157.01
989.062	164.29
989.424	157.01
989.786	140.02
990.147	72.06
990.509	154.58
990.87	91.48
991.232	140.02
991.593	164.29
991.955	135.17
992.316	164.29
992.677	86.62
993.038	86.62
993.399	169.15
993.76	86.62
994.121	178.86
994.482	135.17
994.843	113.32
995.204	123.03
995.565	149.73
995.926	164.29
996.286	86.62
996.647	171.57
997.007	174
997.368	142.45
997.728	149.73
998.089	96.33
998.449	147.3
998.809	106.04
999.169	130.31
999.53	205.56
999.89	142.45
1000.25	115.75
1000.61	125.46
1000.97	84.19
1001.329	118.18
1001.689	152.16
1002.049	174
1002.409	91.48
1002.768	186.14
1003.128	144.87
1003.487	108.47
1003.847	115.75
1004.206	164.29
1004.566	106.04
1004.925	113.32
1005.284	108.47
1005.643	79.34
1006.003	149.73
1006.362	86.62
1006.721	106.04
1007.08	103.61
1007.438	144.87
1007.797	106.04
1008.156	135.17
1008.515	118.18
1008.874	64.78
1009.232	59.92
1009.591	154.58
1009.949	115.75
1010.308	142.45
1010.666	186.14
1011.024	149.73
1011.383	159.44
1011.741	149.73
1012.099	72.06
1012.457	120.6
1012.815	164.29
1013.173	108.47
1013.531	142.45
1013.889	203.13
1014.247	229.83
1014.605	113.32
1014.962	123.03
1015.32	96.33
1015.678	76.91
1016.035	93.9
1016.393	132.74
1016.75	96.33
1017.107	127.88
1017.465	147.3
1017.822	166.72
1018.179	198.27
1018.536	186.14
1018.894	157.01
1019.251	57.49
1019.608	120.6
1019.964	93.9
1020.321	125.46
1020.678	149.73
1021.035	135.17
1021.392	171.57
1021.748	118.18
1022.105	171.57
1022.461	120.6
1022.818	135.17
1023.174	89.05
1023.531	127.88
1023.887	152.16
1024.243	140.02
1024.599	174
1024.955	140.02
1025.311	144.87
1025.667	137.59
1026.023	123.03
1026.379	118.18
1026.735	142.45
1027.091	120.6
1027.447	125.46
