189.514	50.36
189.973	50.36
190.431	50.36
190.889	30.95
191.348	1.82
191.806	-37.02
192.264	-3.03
192.722	-5.46
193.18	-0.61
193.638	-39.44
194.096	-12.74
194.554	-37.02
195.012	-29.73
195.47	-37.02
195.928	-29.73
196.385	-22.45
196.843	45.51
197.301	43.08
197.758	23.67
198.216	50.36
198.674	57.65
199.131	-3.03
199.589	38.23
200.046	18.81
200.503	35.8
200.961	13.96
201.418	64.93
201.875	57.65
202.332	89.2
202.79	103.76
203.247	33.37
203.704	154.74
204.161	132.89
204.618	198.43
205.075	176.58
205.532	89.2
205.989	159.59
206.445	79.49
206.902	157.16
207.359	137.74
207.816	108.62
208.272	149.88
208.729	157.16
209.185	96.48
209.642	222.7
210.098	94.05
210.555	191.14
211.011	157.16
211.467	171.73
211.924	147.45
212.38	60.07
212.836	198.43
213.292	91.63
213.748	164.44
214.204	115.9
214.66	188.72
215.116	130.46
215.572	57.65
216.028	193.57
216.484	108.62
216.94	242.12
217.396	154.74
217.851	164.44
218.307	135.32
218.763	196
219.218	157.16
219.674	101.34
220.129	164.44
220.585	108.62
221.04	67.36
221.496	115.9
221.951	154.74
222.406	98.91
222.861	159.59
223.317	111.05
223.772	157.16
224.227	47.94
224.682	69.78
225.137	162.02
225.592	130.46
226.047	193.57
226.502	145.03
226.957	142.6
227.411	145.03
227.866	149.88
228.321	149.88
228.776	145.03
229.23	111.05
229.685	77.06
230.139	142.6
230.594	135.32
231.048	111.05
231.503	140.17
231.957	72.21
232.411	149.88
232.865	198.43
233.32	227.55
233.774	145.03
234.228	101.34
234.682	91.63
235.136	125.61
235.59	115.9
236.044	115.9
236.498	154.74
236.952	152.31
237.406	128.04
237.86	120.75
238.313	193.57
238.767	183.86
239.221	118.33
239.674	162.02
240.128	166.87
240.581	113.47
241.035	103.76
241.488	130.46
241.942	106.19
242.395	162.02
242.848	115.9
243.301	229.98
243.755	130.46
244.208	147.45
244.661	145.03
245.114	176.58
245.567	193.57
246.02	186.29
246.473	123.18
246.926	183.86
247.379	159.59
247.832	137.74
248.284	128.04
248.737	113.47
249.19	96.48
249.642	152.31
250.095	98.91
250.547	154.74
251	135.32
251.452	101.34
251.905	210.56
252.357	125.61
252.81	140.17
253.262	113.47
253.714	125.61
254.166	140.17
254.618	186.29
255.07	183.86
255.523	60.07
255.975	123.18
256.427	147.45
256.878	179.01
257.33	98.91
257.782	142.6
258.234	203.28
258.686	157.16
259.137	86.77
259.589	169.3
260.041	149.88
260.492	147.45
260.944	149.88
261.395	188.72
261.847	132.89
262.298	103.76
262.749	130.46
263.201	149.88
263.652	142.6
264.103	200.85
264.554	145.03
265.005	106.19
265.457	176.58
265.908	145.03
266.359	191.14
266.809	183.86
267.26	91.63
267.711	147.45
268.162	106.19
268.613	94.05
269.064	113.47
269.514	108.62
269.965	98.91
270.415	198.43
270.866	120.75
271.316	101.34
271.767	142.6
272.217	86.77
272.668	123.18
273.118	132.89
273.568	135.32
274.019	186.29
274.469	132.89
274.919	135.32
275.369	140.17
275.819	147.45
276.269	215.42
276.719	137.74
277.169	135.32
277.619	166.87
278.069	130.46
278.518	79.49
278.968	157.16
279.418	89.2
279.867	159.59
280.317	111.05
280.767	176.58
281.216	140.17
281.666	169.3
282.115	157.16
282.564	106.19
283.014	181.43
283.463	132.89
283.912	132.89
284.361	169.3
284.811	145.03
285.26	137.74
285.709	132.89
286.158	89.2
286.607	159.59
287.056	113.47
287.505	205.71
287.953	125.61
288.402	157.16
288.851	111.05
289.3	106.19
289.748	125.61
290.197	152.31
290.646	145.03
291.094	174.15
291.543	120.75
291.991	120.75
292.439	130.46
292.888	145.03
293.336	188.72
293.784	108.62
294.233	135.32
294.681	183.86
295.129	193.57
295.577	125.61
296.025	193.57
296.473	111.05
296.921	198.43
297.369	154.74
297.817	147.45
298.264	166.87
298.712	162.02
299.16	193.57
299.608	113.47
300.055	162.02
300.503	176.58
300.95	147.45
301.398	208.13
301.845	147.45
302.293	157.16
302.74	145.03
303.187	154.74
303.635	115.9
304.082	64.93
304.529	159.59
304.976	154.74
305.423	154.74
305.87	212.99
306.317	67.36
306.764	215.42
307.211	118.33
307.658	212.99
308.105	91.63
308.552	246.97
308.998	181.43
309.445	86.77
309.892	115.9
310.338	140.17
310.785	125.61
311.231	140.17
311.678	154.74
312.124	162.02
312.571	108.62
313.017	103.76
313.463	89.2
313.909	128.04
314.356	176.58
314.802	101.34
315.248	198.43
315.694	176.58
316.14	166.87
316.586	149.88
317.032	210.56
317.478	162.02
317.923	166.87
318.369	157.16
318.815	179.01
319.261	152.31
319.706	162.02
320.152	183.86
320.597	220.27
321.043	176.58
321.488	181.43
321.934	215.42
322.379	176.58
322.824	135.32
323.27	123.18
323.715	145.03
324.16	200.85
324.605	154.74
325.05	103.76
325.495	147.45
325.94	181.43
326.385	103.76
326.83	157.16
327.275	145.03
327.72	183.86
328.165	101.34
328.61	137.74
329.054	106.19
329.499	183.86
329.943	111.05
330.388	193.57
330.832	91.63
331.277	120.75
331.721	205.71
332.166	147.45
332.61	135.32
333.054	125.61
333.499	142.6
333.943	174.15
334.387	147.45
334.831	132.89
335.275	125.61
335.719	149.88
336.163	64.93
336.607	120.75
337.051	142.6
337.495	166.87
337.938	60.07
338.382	212.99
338.826	210.56
339.269	164.44
339.713	152.31
340.157	120.75
340.6	140.17
341.044	181.43
341.487	205.71
341.93	176.58
342.374	203.28
342.817	191.14
343.26	171.73
343.703	149.88
344.146	135.32
344.59	130.46
345.033	120.75
345.476	145.03
345.919	103.76
346.361	74.64
346.804	96.48
347.247	96.48
347.69	137.74
348.133	157.16
348.575	157.16
349.018	174.15
349.461	186.29
349.903	130.46
350.346	263.96
350.788	225.12
351.23	176.58
351.673	118.33
352.115	183.86
352.557	118.33
353	181.43
353.442	145.03
353.884	135.32
354.326	159.59
354.768	106.19
355.21	86.77
355.652	135.32
356.094	181.43
356.536	147.45
356.978	181.43
357.419	140.17
357.861	118.33
358.303	135.32
358.744	140.17
359.186	132.89
359.627	152.31
360.069	166.87
360.51	157.16
360.952	140.17
361.393	106.19
361.834	103.76
362.276	89.2
362.717	159.59
363.158	86.77
363.599	145.03
364.04	135.32
364.481	200.85
364.922	142.6
365.363	106.19
365.804	91.63
366.245	67.36
366.686	142.6
367.126	164.44
367.567	176.58
368.008	171.73
368.448	183.86
368.889	183.86
369.33	166.87
369.77	171.73
370.21	115.9
370.651	106.19
371.091	159.59
371.531	115.9
371.972	86.77
372.412	94.05
372.852	108.62
373.292	115.9
373.732	174.15
374.172	132.89
374.612	166.87
375.052	249.4
375.492	142.6
375.932	106.19
376.372	149.88
376.811	183.86
377.251	96.48
377.691	176.58
378.13	186.29
378.57	183.86
379.009	137.74
379.449	176.58
379.888	103.76
380.328	115.9
380.767	111.05
381.206	123.18
381.645	193.57
382.085	157.16
382.524	113.47
382.963	196
383.402	171.73
383.841	79.49
384.28	96.48
384.719	123.18
385.158	137.74
385.596	113.47
386.035	123.18
386.474	142.6
386.913	79.49
387.351	103.76
387.79	200.85
388.228	84.35
388.667	176.58
389.105	147.45
389.544	186.29
389.982	62.5
390.42	188.72
390.859	128.04
391.297	96.48
391.735	120.75
392.173	120.75
392.611	183.86
393.049	132.89
393.487	132.89
393.925	193.57
394.363	179.01
394.801	145.03
395.239	137.74
395.676	140.17
396.114	77.06
396.552	113.47
396.989	98.91
397.427	113.47
397.864	98.91
398.302	174.15
398.739	174.15
399.177	103.76
399.614	152.31
400.051	118.33
400.488	145.03
400.926	62.5
401.363	118.33
401.8	130.46
402.237	67.36
402.674	140.17
403.111	174.15
403.548	145.03
403.985	181.43
404.421	111.05
404.858	128.04
405.295	130.46
405.732	125.61
406.168	137.74
406.605	137.74
407.041	103.76
407.478	106.19
407.914	152.31
408.351	125.61
408.787	152.31
409.223	162.02
409.66	86.77
410.096	79.49
410.532	186.29
410.968	132.89
411.404	118.33
411.84	176.58
412.276	145.03
412.712	198.43
413.148	208.13
413.584	152.31
414.02	152.31
414.455	169.3
414.891	237.26
415.327	169.3
415.762	203.28
416.198	217.84
416.633	91.63
417.069	154.74
417.504	89.2
417.94	217.84
418.375	106.19
418.81	145.03
419.245	145.03
419.681	132.89
420.116	176.58
420.551	142.6
420.986	123.18
421.421	176.58
421.856	169.3
422.291	118.33
422.726	137.74
423.16	188.72
423.595	64.93
424.03	118.33
424.464	169.3
424.899	125.61
425.334	135.32
425.768	128.04
426.203	125.61
426.637	137.74
427.071	128.04
427.506	106.19
427.94	52.79
428.374	130.46
428.809	135.32
429.243	154.74
429.677	196
430.111	166.87
430.545	128.04
430.979	159.59
431.413	174.15
431.847	176.58
432.28	140.17
432.714	140.17
433.148	113.47
433.582	140.17
434.015	130.46
434.449	94.05
434.882	103.76
435.316	135.32
435.749	91.63
436.183	130.46
436.616	113.47
437.049	164.44
437.483	147.45
437.916	154.74
438.349	94.05
438.782	191.14
439.215	130.46
439.648	145.03
440.081	125.61
440.514	135.32
440.947	84.35
441.38	154.74
441.813	162.02
442.245	115.9
442.678	89.2
443.111	118.33
443.543	132.89
443.976	162.02
444.408	159.59
444.841	164.44
445.273	145.03
445.705	166.87
446.138	198.43
446.57	208.13
447.002	162.02
447.434	113.47
447.867	91.63
448.299	183.86
448.731	135.32
449.163	164.44
449.595	140.17
450.026	145.03
450.458	128.04
450.89	142.6
451.322	152.31
451.754	128.04
452.185	140.17
452.617	77.06
453.048	111.05
453.48	140.17
453.911	159.59
454.343	115.9
454.774	154.74
455.205	191.14
455.637	196
456.068	142.6
456.499	215.42
456.93	81.92
457.361	159.59
457.792	140.17
458.223	181.43
458.654	196
459.085	108.62
459.516	147.45
459.947	132.89
460.378	118.33
460.808	174.15
461.239	111.05
461.669	123.18
462.1	200.85
462.531	169.3
462.961	186.29
463.391	89.2
463.822	142.6
464.252	135.32
464.682	249.4
465.113	188.72
465.543	81.92
465.973	154.74
466.403	186.29
466.833	215.42
467.263	227.55
467.693	152.31
468.123	196
468.553	118.33
468.983	154.74
469.412	145.03
469.842	200.85
470.272	162.02
470.701	191.14
471.131	220.27
471.56	159.59
471.99	169.3
472.419	137.74
472.849	157.16
473.278	174.15
473.707	181.43
474.136	135.32
474.566	200.85
474.995	108.62
475.424	140.17
475.853	103.76
476.282	166.87
476.711	118.33
477.14	137.74
477.569	174.15
477.997	152.31
478.426	183.86
478.855	140.17
479.283	232.41
479.712	212.99
480.141	171.73
480.569	152.31
480.998	128.04
481.426	123.18
481.854	198.43
482.283	159.59
482.711	176.58
483.139	181.43
483.567	157.16
483.995	152.31
484.424	142.6
484.852	38.23
485.28	205.71
485.708	159.59
486.135	113.47
486.563	103.76
486.991	176.58
487.419	159.59
487.847	132.89
488.274	108.62
488.702	79.49
489.129	137.74
489.557	159.59
489.984	132.89
490.412	186.29
490.839	188.72
491.266	174.15
491.694	174.15
492.121	183.86
492.548	142.6
492.975	103.76
493.402	152.31
493.829	130.46
494.256	196
494.683	69.78
495.11	111.05
495.537	159.59
495.964	132.89
496.39	215.42
496.817	149.88
497.244	96.48
497.67	179.01
498.097	162.02
498.523	106.19
498.95	132.89
499.376	154.74
499.803	215.42
500.229	86.77
500.655	132.89
501.081	81.92
501.508	174.15
501.934	96.48
502.36	203.28
502.786	183.86
503.212	203.28
503.638	123.18
504.064	145.03
504.489	98.91
504.915	157.16
505.341	208.13
505.767	123.18
506.192	103.76
506.618	135.32
507.043	152.31
507.469	125.61
507.894	259.11
508.32	113.47
508.745	135.32
509.17	198.43
509.596	128.04
510.021	237.26
510.446	98.91
510.871	137.74
511.296	174.15
511.721	149.88
512.146	142.6
512.571	115.9
512.996	132.89
513.421	115.9
513.845	145.03
514.27	193.57
514.695	98.91
515.119	111.05
515.544	179.01
515.969	239.69
516.393	47.94
516.817	179.01
517.242	132.89
517.666	123.18
518.09	128.04
518.515	159.59
518.939	196
519.363	409.59
519.787	162.02
520.211	171.73
520.635	125.61
521.059	135.32
521.483	166.87
521.907	159.59
522.331	96.48
522.754	186.29
523.178	181.43
523.602	137.74
524.025	147.45
524.449	128.04
524.872	174.15
525.296	125.61
525.719	101.34
526.143	181.43
526.566	188.72
526.989	169.3
527.412	115.9
527.836	91.63
528.259	179.01
528.682	157.16
529.105	91.63
529.528	181.43
529.951	98.91
530.374	108.62
530.796	162.02
531.219	191.14
531.642	135.32
532.065	106.19
532.487	130.46
532.91	108.62
533.332	174.15
533.755	147.45
534.177	132.89
534.6	128.04
535.022	81.92
535.444	188.72
535.867	188.72
536.289	186.29
536.711	198.43
537.133	132.89
537.555	157.16
537.977	169.3
538.399	181.43
538.821	217.84
539.243	147.45
539.665	135.32
540.086	142.6
540.508	171.73
540.93	181.43
541.351	186.29
541.773	162.02
542.195	128.04
542.616	183.86
543.037	137.74
543.459	125.61
543.88	147.45
544.301	183.86
544.723	118.33
545.144	215.42
545.565	154.74
545.986	164.44
546.407	179.01
546.828	135.32
547.249	140.17
547.67	120.75
548.091	169.3
548.512	135.32
548.932	74.64
549.353	89.2
549.774	113.47
550.194	149.88
550.615	191.14
551.035	188.72
551.456	166.87
551.876	147.45
552.296	111.05
552.717	140.17
553.137	179.01
553.557	120.75
553.977	98.91
554.397	152.31
554.817	101.34
555.237	120.75
555.657	191.14
556.077	91.63
556.497	125.61
556.917	179.01
557.337	108.62
557.756	171.73
558.176	106.19
558.596	60.07
559.015	186.29
559.435	174.15
559.854	113.47
560.274	72.21
560.693	125.61
561.112	159.59
561.532	140.17
561.951	179.01
562.37	135.32
562.789	140.17
563.208	108.62
563.627	140.17
564.046	120.75
564.465	137.74
564.884	106.19
565.303	147.45
565.722	166.87
566.14	205.71
566.559	210.56
566.978	140.17
567.396	193.57
567.815	174.15
568.233	142.6
568.652	174.15
569.07	137.74
569.489	157.16
569.907	169.3
570.325	106.19
570.743	166.87
571.161	183.86
571.58	81.92
571.998	162.02
572.416	118.33
572.833	79.49
573.251	191.14
573.669	159.59
574.087	169.3
574.505	125.61
574.922	123.18
575.34	183.86
575.758	106.19
576.175	154.74
576.593	135.32
577.01	147.45
577.428	77.06
577.845	1511.55
578.262	263.96
578.68	152.31
579.097	198.43
579.514	103.76
579.931	120.75
580.348	135.32
580.765	169.3
581.182	232.41
581.599	261.53
582.016	101.34
582.433	164.44
582.849	137.74
583.266	123.18
583.683	157.16
584.099	263.96
584.516	145.03
584.933	106.19
585.349	145.03
585.765	162.02
586.182	186.29
586.598	179.01
587.014	123.18
587.431	174.15
587.847	130.46
588.263	164.44
588.679	157.16
589.095	166.87
589.511	130.46
589.927	212.99
590.343	208.13
590.759	188.72
591.174	166.87
591.59	69.78
592.006	149.88
592.421	118.33
592.837	154.74
593.252	196
593.668	147.45
594.083	157.16
594.499	198.43
594.914	193.57
595.329	142.6
595.745	159.59
596.16	188.72
596.575	183.86
596.99	149.88
597.405	159.59
597.82	98.91
598.235	268.81
598.65	157.16
599.065	140.17
599.479	183.86
599.894	128.04
600.309	135.32
600.724	225.12
601.138	159.59
601.553	115.9
601.967	137.74
602.382	125.61
602.796	111.05
603.21	96.48
603.625	188.72
604.039	125.61
604.453	140.17
604.867	135.32
605.281	140.17
605.695	111.05
606.109	181.43
606.523	140.17
606.937	152.31
607.351	259.11
607.765	94.05
608.178	120.75
608.592	154.74
609.006	142.6
609.419	171.73
609.833	162.02
610.246	137.74
610.66	135.32
611.073	140.17
611.487	135.32
611.9	186.29
612.313	169.3
612.726	115.9
613.139	203.28
613.553	142.6
613.966	142.6
614.379	132.89
614.792	205.71
615.204	154.74
615.617	186.29
616.03	147.45
616.443	181.43
616.856	125.61
617.268	108.62
617.681	171.73
618.093	166.87
618.506	159.59
618.918	94.05
619.331	196
619.743	101.34
620.155	130.46
620.568	164.44
620.98	103.76
621.392	149.88
621.804	183.86
622.216	203.28
622.628	159.59
623.04	179.01
623.452	157.16
623.864	142.6
624.276	140.17
624.687	77.06
625.099	137.74
625.511	103.76
625.922	115.9
626.334	174.15
626.745	108.62
627.157	169.3
627.568	181.43
627.979	135.32
628.391	203.28
628.802	225.12
629.213	120.75
629.624	196
630.035	171.73
630.446	174.15
630.857	181.43
631.268	176.58
631.679	162.02
632.09	159.59
632.501	147.45
632.912	176.58
633.322	225.12
633.733	86.77
634.144	137.74
634.554	147.45
634.965	89.2
635.375	101.34
635.785	118.33
636.196	162.02
636.606	179.01
637.016	152.31
637.427	152.31
637.837	186.29
638.247	210.56
638.657	81.92
639.067	205.71
639.477	123.18
639.887	159.59
640.297	98.91
640.706	123.18
641.116	162.02
641.526	103.76
641.935	171.73
642.345	176.58
642.755	118.33
643.164	205.71
643.573	176.58
643.983	130.46
644.392	108.62
644.801	72.21
645.211	215.42
645.62	179.01
646.029	94.05
646.438	113.47
646.847	128.04
647.256	113.47
647.665	162.02
648.074	149.88
648.483	152.31
648.892	169.3
649.3	181.43
649.709	125.61
650.118	203.28
650.526	220.27
650.935	166.87
651.343	174.15
651.752	103.76
652.16	208.13
652.568	130.46
652.977	181.43
653.385	186.29
653.793	96.48
654.201	203.28
654.609	149.88
655.017	118.33
655.425	188.72
655.833	130.46
656.241	196
656.649	157.16
657.057	147.45
657.464	198.43
657.872	183.86
658.28	91.63
658.687	169.3
659.095	152.31
659.502	191.14
659.91	130.46
660.317	140.17
660.724	159.59
661.132	181.43
661.539	125.61
661.946	79.49
662.353	186.29
662.76	149.88
663.167	157.16
663.574	142.6
663.981	164.44
664.388	171.73
664.795	159.59
665.202	171.73
665.608	152.31
666.015	115.9
666.422	128.04
666.828	89.2
667.235	113.47
667.641	171.73
668.047	176.58
668.454	164.44
668.86	137.74
669.266	162.02
669.673	149.88
670.079	132.89
670.485	176.58
670.891	113.47
671.297	123.18
671.703	137.74
672.109	162.02
672.515	142.6
672.92	128.04
673.326	142.6
673.732	174.15
674.138	220.27
674.543	135.32
674.949	171.73
675.354	120.75
675.76	128.04
676.165	181.43
676.57	147.45
676.976	157.16
677.381	89.2
677.786	152.31
678.191	113.47
678.596	125.61
679.001	162.02
679.406	142.6
679.811	176.58
680.216	198.43
680.621	171.73
681.026	115.9
681.43	145.03
681.835	164.44
682.24	130.46
682.644	179.01
683.049	115.9
683.453	106.19
683.858	154.74
684.262	152.31
684.667	137.74
685.071	222.7
685.475	111.05
685.879	130.46
686.283	113.47
686.687	205.71
687.091	149.88
687.495	135.32
687.899	188.72
688.303	176.58
688.707	142.6
689.111	125.61
689.514	79.49
689.918	91.63
690.322	181.43
690.725	123.18
691.129	149.88
691.532	147.45
691.936	179.01
692.339	125.61
692.742	118.33
693.146	125.61
693.549	164.44
693.952	132.89
694.355	179.01
694.758	120.75
695.161	140.17
695.564	145.03
695.967	132.89
696.37	183.86
696.773	193.57
697.175	132.89
697.578	128.04
697.981	208.13
698.383	222.7
698.786	179.01
699.188	188.72
699.591	135.32
699.993	77.06
700.395	130.46
700.798	162.02
701.2	137.74
701.602	113.47
702.004	147.45
702.406	147.45
702.808	125.61
703.21	169.3
703.612	176.58
704.014	191.14
704.416	111.05
704.818	135.32
705.219	183.86
705.621	225.12
706.023	145.03
706.424	162.02
706.826	128.04
707.227	203.28
707.629	205.71
708.03	169.3
708.431	159.59
708.832	220.27
709.234	130.46
709.635	225.12
710.036	125.61
710.437	135.32
710.838	220.27
711.239	198.43
711.64	171.73
712.041	145.03
712.441	263.96
712.842	140.17
713.243	222.7
713.643	183.86
714.044	72.21
714.445	196
714.845	174.15
715.246	237.26
715.646	220.27
716.046	229.98
716.447	186.29
716.847	162.02
717.247	191.14
717.647	186.29
718.047	244.54
718.447	215.42
718.847	193.57
719.247	239.69
719.647	242.12
720.047	280.95
720.446	159.59
720.846	329.5
721.246	237.26
721.645	244.54
722.045	288.23
722.444	295.51
722.844	222.7
723.243	171.73
723.643	234.83
724.042	212.99
724.441	310.08
724.84	339.2
725.24	249.4
725.639	234.83
726.038	329.5
726.437	295.51
726.836	249.4
727.234	353.77
727.633	363.48
728.032	353.77
728.431	370.76
728.83	353.77
729.228	390.18
729.627	431.44
730.025	472.7
730.424	424.16
730.822	545.52
731.22	562.51
731.619	613.48
732.017	615.91
732.415	720.28
732.813	710.57
733.212	703.29
733.61	751.83
734.008	817.37
734.406	897.47
734.803	1023.68
735.201	989.7
735.599	1026.11
735.997	1210.58
736.395	1154.75
736.792	1290.68
737.19	1385.34
737.587	1458.15
737.985	1492.13
738.382	1671.75
738.78	1742.14
739.177	1649.9
739.574	1834.37
739.971	1885.34
740.369	1972.72
740.766	2060.1
741.163	2098.94
741.56	2120.79
741.957	2341.66
742.354	2331.95
742.751	2334.38
743.147	2540.69
743.544	2683.9
743.941	2844.1
744.338	2958.18
744.734	3125.66
745.131	3196.04
745.527	3497.02
745.924	3647.51
746.32	4130.53
746.716	4295.58
747.113	4458.2
747.509	4625.68
747.905	4800.44
748.301	5098.99
748.697	5494.62
749.093	5623.27
749.489	5688.8
749.885	6006.77
750.281	6596.58
750.677	6853.87
751.073	7210.67
751.468	7327.18
751.864	7509.22
752.26	8089.32
752.655	8499.53
753.051	9082.06
753.446	9176.72
753.842	9142.74
754.237	9451
754.632	9921.88
755.028	9965.57
755.423	10152.46
755.818	9895.18
756.213	10205.86
756.608	10247.13
757.003	10603.93
757.398	10426.74
757.793	9868.48
758.188	9633.04
758.583	10254.41
758.977	10586.94
759.372	10941.31
759.767	11346.66
760.161	11912.2
760.556	12548.13
760.95	13800.58
761.345	14366.12
761.739	15184.1
762.133	15560.31
762.527	16523.92
762.922	17582.19
763.316	19150.18
763.71	18956
764.104	18439
764.498	19273.96
764.892	20125.92
765.286	21298.27
765.68	21905.07
766.073	21892.94
766.467	21679.34
766.861	22990.04
767.255	25259.49
767.648	26084.75
768.042	26145.43
768.435	26351.74
768.829	26007.08
769.222	27390.6
769.615	29191.59
770.008	28742.56
770.402	28191.58
770.795	28038.66
771.188	28092.06
771.581	28677.02
771.974	28982.85
772.367	27499.82
772.76	27594.48
773.153	26028.92
773.545	25948.83
773.938	26992.53
774.331	26764.37
774.724	26788.64
775.116	26669.71
775.509	28019.25
775.901	29990.15
776.294	32016.88
776.686	32987.77
777.078	32657.67
777.471	33580.01
777.863	34342.16
778.255	36614.04
778.647	37199
779.039	37934.45
779.431	35820.34
779.823	35715.97
780.215	37461.14
780.607	38220.86
780.999	39461.17
781.39	38917.47
781.782	38077.66
782.174	37817.94
782.565	39347.09
782.957	40910.22
783.348	42890.84
783.74	41568
784.131	38349.5
784.522	39359.23
784.914	39844.67
785.305	41174.79
785.696	41000.03
786.087	38101.93
786.478	36385.88
786.869	34842.17
787.26	35492.66
787.651	34946.54
788.042	33910.11
788.433	31694.06
788.823	29274.12
789.214	29099.36
789.605	28322.65
789.995	26788.64
790.386	25623.58
790.776	25079.88
791.167	23907.53
791.557	24429.38
791.948	25550.76
792.338	27572.64
792.728	27793.51
793.118	27368.75
793.508	27691.57
793.898	28261.97
794.288	29526.55
794.678	30028.99
795.068	29101.79
795.458	28480.42
795.848	27443.99
796.238	28094.49
796.627	28431.87
797.017	28868.77
797.406	28778.97
797.796	27808.08
798.185	27473.12
798.575	28431.87
798.964	29774.13
799.354	31184.34
799.743	30191.61
800.132	29995.01
800.521	29407.62
800.91	29482.86
801.299	31019.29
801.688	30968.32
802.077	30842.11
802.466	29664.9
802.855	29490.14
803.244	28730.42
803.633	28611.49
804.021	28473.14
804.41	28070.22
804.799	26524.08
805.187	25274.06
805.576	24220.64
805.964	23960.93
806.352	22409.94
806.741	22844.41
807.129	21790.99
807.517	20851.66
807.905	20885.64
808.293	21392.93
808.681	22754.6
809.069	22824.99
809.457	23193.93
809.845	22640.52
810.233	23028.88
810.621	23293.44
811.009	23953.65
811.396	24723.08
811.784	24147.83
812.171	23990.06
812.559	22992.47
812.946	22451.2
813.334	23264.32
813.721	23174.51
814.108	22846.84
814.496	22536.15
814.883	21140.5
815.27	21572.54
815.657	22558
816.044	23327.43
816.431	23281.31
816.818	22994.9
817.205	21803.13
817.592	21706.04
817.979	21686.62
818.365	21795.85
818.752	22041
819.139	21254.58
819.525	20288.54
819.912	19400.18
820.298	18742.4
820.685	18254.53
821.071	18293.37
821.457	18269.09
821.843	16623.44
822.23	15669.54
822.616	14926.81
823.002	13778.73
823.388	13288.43
823.774	13069.98
824.16	12504.44
824.546	11941.33
824.931	11084.52
825.317	10691.31
825.703	10815.1
826.089	11191.31
826.474	11470.45
826.86	11060.24
827.245	11045.68
827.631	10781.11
828.016	10293.24
828.401	10363.63
828.787	10448.58
829.172	10244.7
829.557	9664.59
829.942	9213.13
830.327	8664.58
830.712	8577.2
831.097	8443.7
831.482	8349.04
831.867	8247.09
832.252	8091.75
832.636	7883.01
833.021	7778.64
833.406	7625.73
833.79	7802.91
834.175	8062.63
834.559	7540.77
834.944	7133
835.328	6992.22
835.713	6722.8
836.097	6509.2
836.481	6499.49
836.865	6230.07
837.249	5950.94
837.633	5635.4
838.017	5448.51
838.401	5179.09
838.785	5031.02
839.169	5196.08
839.553	4870.83
839.937	4412.08
840.32	4033.44
840.704	3805.28
841.087	3441.19
841.471	3353.81
841.854	3247.02
842.238	3295.56
842.621	3045.56
843.004	2960.6
843.388	2902.35
843.771	2933.9
844.154	2960.6
844.537	2958.18
844.92	2924.2
845.303	2950.9
845.686	2737.3
846.069	2586.81
846.452	2584.38
846.834	2581.96
847.217	2584.38
847.6	2584.38
847.982	2506.71
848.365	2351.37
848.748	2317.39
849.13	2293.12
849.512	2261.56
849.895	2288.26
850.277	2285.84
850.659	2280.98
851.041	2198.46
851.423	2266.42
851.806	2016.41
852.188	2069.81
852.57	2030.98
852.951	2108.65
853.333	2062.53
853.715	1865.93
854.097	1822.24
854.479	1749.42
854.86	1705.73
855.242	1688.74
855.623	1676.6
856.005	1628.06
856.386	1589.22
856.768	1441.16
857.149	1346.5
857.53	1256.69
857.911	1314.95
858.292	1278.54
858.674	1196.01
859.055	1081.93
859.436	1013.97
859.817	972.71
860.197	868.34
860.578	870.77
860.959	861.06
861.34	882.9
861.72	778.53
862.101	819.79
862.482	761.54
862.862	722.71
863.243	710.57
863.623	744.55
864.003	705.71
864.384	635.33
864.764	666.88
865.144	579.5
865.524	601.34
865.904	603.77
866.284	649.89
866.664	509.11
867.044	606.2
867.424	487.26
867.804	569.79
868.183	501.83
868.563	462.99
868.943	513.96
869.322	446
869.702	455.71
870.081	465.42
870.461	412.02
870.84	382.89
871.22	409.59
871.599	346.49
871.978	390.18
872.357	365.9
872.736	373.19
873.115	295.51
873.494	300.37
873.873	285.81
874.252	251.82
874.631	232.41
875.01	232.41
875.388	259.11
875.767	251.82
876.146	249.4
876.524	254.25
876.903	263.96
877.281	225.12
877.66	288.23
878.038	222.7
878.416	246.97
878.794	188.72
879.173	176.58
879.551	225.12
879.929	259.11
880.307	217.84
880.685	232.41
881.063	145.03
881.441	261.53
881.818	234.83
882.196	225.12
882.574	205.71
882.951	220.27
883.329	186.29
883.707	174.15
884.084	154.74
884.461	191.14
884.839	273.67
885.216	169.3
885.593	45.51
885.971	169.3
886.348	159.59
886.725	171.73
887.102	159.59
887.479	176.58
887.856	166.87
888.233	145.03
888.609	120.75
888.986	193.57
889.363	198.43
889.74	132.89
890.116	149.88
890.493	188.72
890.869	145.03
891.246	128.04
891.622	125.61
891.998	186.29
892.375	62.5
892.751	188.72
893.127	179.01
893.503	125.61
893.879	203.28
894.255	140.17
894.631	164.44
895.007	147.45
895.383	145.03
895.759	111.05
896.134	120.75
896.51	145.03
896.886	125.61
897.261	106.19
897.637	222.7
898.012	137.74
898.388	94.05
898.763	98.91
899.138	98.91
899.514	106.19
899.889	132.89
900.264	84.35
900.639	188.72
901.014	147.45
901.389	152.31
901.764	81.92
902.139	145.03
902.513	152.31
902.888	176.58
903.263	113.47
903.638	174.15
904.012	162.02
904.387	132.89
904.761	9.1
905.136	106.19
905.51	137.74
905.884	140.17
906.259	123.18
906.633	98.91
907.007	176.58
907.381	115.9
907.755	96.48
908.129	84.35
908.503	62.5
908.877	162.02
909.251	103.76
909.624	183.86
909.998	147.45
910.372	26.09
910.745	123.18
911.119	225.12
911.492	169.3
911.866	162.02
912.239	198.43
912.612	115.9
912.986	171.73
913.359	188.72
913.732	108.62
914.105	174.15
914.478	154.74
914.851	120.75
915.224	91.63
915.597	137.74
915.97	123.18
916.343	162.02
916.715	200.85
917.088	137.74
917.461	123.18
917.833	135.32
918.206	193.57
918.578	125.61
918.951	103.76
919.323	154.74
919.695	183.86
920.067	166.87
920.44	162.02
920.812	79.49
921.184	140.17
921.556	108.62
921.928	181.43
922.3	171.73
922.672	140.17
923.043	74.64
923.415	179.01
923.787	147.45
924.158	123.18
924.53	137.74
924.901	183.86
925.273	94.05
925.644	149.88
926.016	91.63
926.387	132.89
926.758	79.49
927.129	137.74
927.5	140.17
927.872	176.58
928.243	164.44
928.613	120.75
928.984	145.03
929.355	113.47
929.726	89.2
930.097	132.89
930.467	132.89
930.838	176.58
931.209	123.18
931.579	113.47
931.95	159.59
932.32	176.58
932.69	142.6
933.061	123.18
933.431	171.73
933.801	113.47
934.171	179.01
934.541	123.18
934.911	135.32
935.281	181.43
935.651	135.32
936.021	101.34
936.391	89.2
936.761	132.89
937.13	86.77
937.5	96.48
937.87	113.47
938.239	164.44
938.609	142.6
938.978	232.41
939.347	120.75
939.717	79.49
940.086	159.59
940.455	67.36
940.824	106.19
941.193	128.04
941.562	84.35
941.931	81.92
942.3	74.64
942.669	176.58
943.038	125.61
943.407	159.59
943.775	111.05
944.144	125.61
944.513	128.04
944.881	125.61
945.25	128.04
945.618	86.77
945.986	89.2
946.355	77.06
946.723	113.47
947.091	74.64
947.459	140.17
947.827	166.87
948.195	108.62
948.563	179.01
948.931	142.6
949.299	111.05
949.667	69.78
950.035	96.48
950.402	64.93
950.77	166.87
951.138	164.44
951.505	98.91
951.873	96.48
952.24	115.9
952.607	149.88
952.975	137.74
953.342	166.87
953.709	145.03
954.076	186.29
954.443	132.89
954.81	188.72
955.177	106.19
955.544	120.75
955.911	67.36
956.278	115.9
956.645	101.34
957.012	137.74
957.378	166.87
957.745	149.88
958.111	125.61
958.478	157.16
958.844	132.89
959.211	234.83
959.577	149.88
959.943	128.04
960.309	176.58
960.675	198.43
961.042	159.59
961.408	79.49
961.774	149.88
962.139	50.36
962.505	135.32
962.871	137.74
963.237	147.45
963.603	212.99
963.968	174.15
964.334	149.88
964.699	159.59
965.065	81.92
965.43	115.9
965.796	120.75
966.161	89.2
966.526	128.04
966.891	128.04
967.256	135.32
967.622	162.02
967.987	132.89
968.352	91.63
968.716	118.33
969.081	157.16
969.446	145.03
969.811	159.59
970.176	115.9
970.54	118.33
970.905	135.32
971.269	159.59
971.634	123.18
971.998	137.74
972.363	132.89
972.727	154.74
973.091	69.78
973.455	159.59
973.819	149.88
974.183	125.61
974.547	171.73
974.911	147.45
975.275	164.44
975.639	137.74
976.003	196
976.367	123.18
976.73	145.03
977.094	169.3
977.458	174.15
977.821	130.46
978.185	159.59
978.548	179.01
978.911	128.04
979.275	132.89
979.638	89.2
980.001	176.58
980.364	210.56
980.727	169.3
981.09	123.18
981.453	169.3
981.816	152.31
982.179	198.43
982.542	176.58
982.905	157.16
983.267	128.04
983.63	140.17
983.992	132.89
984.355	84.35
984.717	130.46
985.08	164.44
985.442	140.17
985.804	69.78
986.167	152.31
986.529	89.2
986.891	169.3
987.253	147.45
987.615	103.76
987.977	145.03
988.339	120.75
988.701	176.58
989.062	157.16
989.424	115.9
989.786	128.04
990.147	169.3
990.509	142.6
990.87	176.58
991.232	176.58
991.593	140.17
991.955	164.44
992.316	220.27
992.677	142.6
993.038	149.88
993.399	159.59
993.76	115.9
994.121	135.32
994.482	86.77
994.843	106.19
995.204	183.86
995.565	106.19
995.926	152.31
996.286	142.6
996.647	77.06
997.007	181.43
997.368	147.45
997.728	198.43
998.089	86.77
998.449	186.29
998.809	98.91
999.169	120.75
999.53	232.41
999.89	208.13
1000.25	140.17
1000.61	188.72
1000.97	118.33
1001.329	174.15
1001.689	113.47
1002.049	130.46
1002.409	149.88
1002.768	26.09
1003.128	142.6
1003.487	118.33
1003.847	142.6
1004.206	188.72
1004.566	77.06
1004.925	103.76
1005.284	123.18
1005.643	72.21
1006.003	154.74
1006.362	132.89
1006.721	101.34
1007.08	125.61
1007.438	135.32
1007.797	191.14
1008.156	162.02
1008.515	157.16
1008.874	98.91
1009.232	120.75
1009.591	128.04
1009.949	149.88
1010.308	183.86
1010.666	145.03
1011.024	101.34
1011.383	140.17
1011.741	111.05
1012.099	140.17
1012.457	159.59
1012.815	79.49
1013.173	77.06
1013.531	113.47
1013.889	101.34
1014.247	159.59
1014.605	145.03
1014.962	79.49
1015.32	208.13
1015.678	67.36
1016.035	142.6
1016.393	115.9
1016.75	145.03
1017.107	169.3
1017.465	128.04
1017.822	145.03
1018.179	94.05
1018.536	106.19
1018.894	98.91
1019.251	154.74
1019.608	186.29
1019.964	120.75
1020.321	72.21
1020.678	128.04
1021.035	135.32
1021.392	174.15
1021.748	137.74
1022.105	30.95
1022.461	98.91
1022.818	171.73
1023.174	154.74
1023.531	183.86
1023.887	181.43
1024.243	137.74
1024.599	154.74
1024.955	147.45
1025.311	130.46
1025.667	120.75
1026.023	191.14
1026.379	98.91
1026.735	191.14
1027.091	84.35
1027.447	159.59
