189.514	25.79
189.973	25.79
190.431	25.79
190.889	18.51
191.348	-17.9
191.806	-30.04
192.264	-27.61
192.722	-25.18
193.18	-54.31
193.638	28.22
194.096	-81.01
194.554	-17.9
195.012	-15.47
195.47	3.94
195.928	23.36
196.385	-10.62
196.843	-13.05
197.301	16.08
197.758	30.64
198.216	1.52
198.674	103.46
199.131	37.93
199.589	45.21
200.046	54.92
200.503	76.76
200.961	98.61
201.418	25.79
201.875	71.91
202.332	74.33
202.79	120.45
203.247	139.87
203.704	161.71
204.161	120.45
204.618	147.15
205.075	149.58
205.532	108.31
205.989	71.91
206.445	108.31
206.902	91.32
207.359	147.15
207.816	142.3
208.272	149.58
208.729	224.82
209.185	113.17
209.642	127.73
210.098	161.71
210.555	171.42
211.011	130.16
211.467	183.56
211.924	115.6
212.38	108.31
212.836	147.15
213.292	147.15
213.748	127.73
214.204	130.16
214.66	142.3
215.116	154.43
215.572	113.17
216.028	142.3
216.484	156.86
216.94	98.61
217.396	195.69
217.851	137.44
218.307	132.59
218.763	173.85
219.218	156.86
219.674	118.02
220.129	122.88
220.585	171.42
221.04	185.99
221.496	115.6
221.951	139.87
222.406	118.02
222.861	164.14
223.317	122.88
223.772	166.57
224.227	147.15
224.682	115.6
225.137	127.73
225.592	169
226.047	178.7
226.502	76.76
226.957	193.27
227.411	173.85
227.866	113.17
228.321	135.01
228.776	86.47
229.23	132.59
229.685	69.48
230.139	118.02
230.594	132.59
231.048	171.42
231.503	108.31
231.957	149.58
232.411	152
232.865	137.44
233.32	76.76
233.774	127.73
234.228	113.17
234.682	169
235.136	86.47
235.59	105.89
236.044	173.85
236.498	164.14
236.952	86.47
237.406	122.88
237.86	159.29
238.313	154.43
238.767	115.6
239.221	74.33
239.674	122.88
240.128	118.02
240.581	164.14
241.035	144.72
241.488	219.97
241.942	113.17
242.395	161.71
242.848	118.02
243.301	137.44
243.755	135.01
244.208	125.31
244.661	166.57
245.114	202.98
245.567	69.48
246.02	105.89
246.473	115.6
246.926	88.9
247.379	91.32
247.832	113.17
248.284	113.17
248.737	135.01
249.19	159.29
249.642	84.04
250.095	115.6
250.547	88.9
251	108.31
251.452	86.47
251.905	154.43
252.357	96.18
252.81	152
253.262	144.72
253.714	130.16
254.166	229.68
254.618	113.17
255.07	144.72
255.523	103.46
255.975	164.14
256.427	127.73
256.878	142.3
257.33	81.62
257.782	161.71
258.234	118.02
258.686	183.56
259.137	166.57
259.589	164.14
260.041	120.45
260.492	120.45
260.944	144.72
261.395	149.58
261.847	166.57
262.298	202.98
262.749	118.02
263.201	224.82
263.652	130.16
264.103	178.7
264.554	125.31
265.005	91.32
265.457	169
265.908	139.87
266.359	135.01
266.809	132.59
267.26	125.31
267.711	132.59
268.162	176.28
268.613	130.16
269.064	147.15
269.514	105.89
269.965	132.59
270.415	149.58
270.866	120.45
271.316	110.74
271.767	96.18
272.217	127.73
272.668	125.31
273.118	152
273.568	154.43
274.019	122.88
274.469	130.16
274.919	147.15
275.369	96.18
275.819	86.47
276.269	193.27
276.719	149.58
277.169	193.27
277.619	93.75
278.069	132.59
278.518	159.29
278.968	132.59
279.418	147.15
279.867	127.73
280.317	118.02
280.767	64.62
281.216	127.73
281.666	215.11
282.115	130.16
282.564	159.29
283.014	118.02
283.463	147.15
283.912	135.01
284.361	91.32
284.811	171.42
285.26	103.46
285.709	81.62
286.158	178.7
286.607	125.31
287.056	127.73
287.505	152
287.953	171.42
288.402	159.29
288.851	103.46
289.3	118.02
289.748	159.29
290.197	132.59
290.646	137.44
291.094	86.47
291.543	147.15
291.991	130.16
292.439	210.26
292.888	93.75
293.336	93.75
293.784	88.9
294.233	205.4
294.681	169
295.129	88.9
295.577	120.45
296.025	105.89
296.473	105.89
296.921	125.31
297.369	67.05
297.817	98.61
298.264	127.73
298.712	161.71
299.16	135.01
299.608	76.76
300.055	86.47
300.503	147.15
300.95	159.29
301.398	159.29
301.845	79.19
302.293	147.15
302.74	147.15
303.187	149.58
303.635	105.89
304.082	132.59
304.529	91.32
304.976	154.43
305.423	195.69
305.87	120.45
306.317	127.73
306.764	164.14
307.211	142.3
307.658	183.56
308.105	91.32
308.552	84.04
308.998	202.98
309.445	190.84
309.892	71.91
310.338	181.13
310.785	96.18
311.231	183.56
311.678	115.6
312.124	159.29
312.571	154.43
313.017	105.89
313.463	135.01
313.909	169
314.356	173.85
314.802	156.86
315.248	125.31
315.694	115.6
316.14	144.72
316.586	147.15
317.032	113.17
317.478	142.3
317.923	166.57
318.369	125.31
318.815	195.69
319.261	103.46
319.706	195.69
320.152	215.11
320.597	171.42
321.043	103.46
321.488	210.26
321.934	176.28
322.379	212.69
322.824	101.03
323.27	222.39
323.715	98.61
324.16	147.15
324.605	120.45
325.05	132.59
325.495	88.9
325.94	79.19
326.385	139.87
326.83	130.16
327.275	135.01
327.72	137.44
328.165	215.11
328.61	156.86
329.054	159.29
329.499	127.73
329.943	105.89
330.388	54.92
330.832	135.01
331.277	217.54
331.721	144.72
332.166	173.85
332.61	169
333.054	144.72
333.499	183.56
333.943	120.45
334.387	110.74
334.831	110.74
335.275	169
335.719	93.75
336.163	108.31
336.607	122.88
337.051	122.88
337.495	125.31
337.938	156.86
338.382	137.44
338.826	166.57
339.269	122.88
339.713	142.3
340.157	110.74
340.6	142.3
341.044	166.57
341.487	144.72
341.93	127.73
342.374	115.6
342.817	149.58
343.26	185.99
343.703	105.89
344.146	105.89
344.59	159.29
345.033	224.82
345.476	103.46
345.919	152
346.361	154.43
346.804	171.42
347.247	105.89
347.69	156.86
348.133	152
348.575	118.02
349.018	152
349.461	166.57
349.903	207.83
350.346	127.73
350.788	156.86
351.23	120.45
351.673	118.02
352.115	118.02
352.557	120.45
353	142.3
353.442	130.16
353.884	132.59
354.326	154.43
354.768	69.48
355.21	147.15
355.652	125.31
356.094	195.69
356.536	139.87
356.978	166.57
357.419	171.42
357.861	122.88
358.303	96.18
358.744	181.13
359.186	86.47
359.627	137.44
360.069	115.6
360.51	74.33
360.952	88.9
361.393	132.59
361.834	156.86
362.276	144.72
362.717	108.31
363.158	93.75
363.599	118.02
364.04	130.16
364.481	86.47
364.922	108.31
365.363	164.14
365.804	120.45
366.245	110.74
366.686	152
367.126	183.56
367.567	239.38
368.008	171.42
368.448	161.71
368.889	113.17
369.33	178.7
369.77	169
370.21	142.3
370.651	91.32
371.091	132.59
371.531	130.16
371.972	88.9
372.412	122.88
372.852	96.18
373.292	161.71
373.732	161.71
374.172	176.28
374.612	96.18
375.052	125.31
375.492	139.87
375.932	147.15
376.372	137.44
376.811	166.57
377.251	171.42
377.691	113.17
378.13	118.02
378.57	181.13
379.009	161.71
379.449	42.78
379.888	159.29
380.328	156.86
380.767	108.31
381.206	236.96
381.645	115.6
382.085	154.43
382.524	74.33
382.963	156.86
383.402	88.9
383.841	62.2
384.28	93.75
384.719	147.15
385.158	69.48
385.596	139.87
386.035	54.92
386.474	113.17
386.913	161.71
387.351	183.56
387.79	185.99
388.228	198.12
388.667	215.11
389.105	166.57
389.544	164.14
389.982	195.69
390.42	142.3
390.859	152
391.297	115.6
391.735	113.17
392.173	147.15
392.611	127.73
393.049	125.31
393.487	169
393.925	181.13
394.363	125.31
394.801	137.44
395.239	190.84
395.676	122.88
396.114	47.63
396.552	154.43
396.989	64.62
397.427	88.9
397.864	137.44
398.302	130.16
398.739	130.16
399.177	176.28
399.614	193.27
400.051	93.75
400.488	171.42
400.926	108.31
401.363	149.58
401.8	166.57
402.237	122.88
402.674	142.3
403.111	81.62
403.548	144.72
403.985	57.34
404.421	159.29
404.858	103.46
405.295	105.89
405.732	219.97
406.168	173.85
406.605	147.15
407.041	93.75
407.478	103.46
407.914	127.73
408.351	130.16
408.787	181.13
409.223	96.18
409.66	118.02
410.096	127.73
410.532	166.57
410.968	122.88
411.404	42.78
411.84	154.43
412.276	101.03
412.712	125.31
413.148	125.31
413.584	98.61
414.02	149.58
414.455	188.41
414.891	139.87
415.327	135.01
415.762	139.87
416.198	122.88
416.633	118.02
417.069	88.9
417.504	113.17
417.94	217.54
418.375	74.33
418.81	190.84
419.245	120.45
419.681	181.13
420.116	127.73
420.551	76.76
420.986	195.69
421.421	149.58
421.856	127.73
422.291	152
422.726	215.11
423.16	118.02
423.595	156.86
424.03	118.02
424.464	152
424.899	205.4
425.334	188.41
425.768	79.19
426.203	120.45
426.637	125.31
427.071	195.69
427.506	105.89
427.94	67.05
428.374	171.42
428.809	103.46
429.243	183.56
429.677	210.26
430.111	173.85
430.545	84.04
430.979	118.02
431.413	125.31
431.847	113.17
432.28	130.16
432.714	118.02
433.148	130.16
433.582	144.72
434.015	130.16
434.449	164.14
434.882	125.31
435.316	122.88
435.749	164.14
436.183	113.17
436.616	120.45
437.049	71.91
437.483	57.34
437.916	139.87
438.349	130.16
438.782	178.7
439.215	86.47
439.648	173.85
440.081	212.69
440.514	110.74
440.947	154.43
441.38	222.39
441.813	190.84
442.245	127.73
442.678	137.44
443.111	108.31
443.543	76.76
443.976	142.3
444.408	190.84
444.841	115.6
445.273	108.31
445.705	105.89
446.138	108.31
446.57	185.99
447.002	122.88
447.434	178.7
447.867	173.85
448.299	81.62
448.731	207.83
449.163	105.89
449.595	120.45
450.026	152
450.458	101.03
450.89	202.98
451.322	122.88
451.754	152
452.185	159.29
452.617	152
453.048	132.59
453.48	147.15
453.911	120.45
454.343	120.45
454.774	127.73
455.205	154.43
455.637	54.92
456.068	166.57
456.499	115.6
456.93	130.16
457.361	164.14
457.792	142.3
458.223	171.42
458.654	190.84
459.085	217.54
459.516	149.58
459.947	205.4
460.378	176.28
460.808	108.31
461.239	183.56
461.669	132.59
462.1	190.84
462.531	200.55
462.961	181.13
463.391	210.26
463.822	161.71
464.252	224.82
464.682	98.61
465.113	130.16
465.543	149.58
465.973	130.16
466.403	207.83
466.833	154.43
467.263	181.13
467.693	132.59
468.123	227.25
468.553	207.83
468.983	137.44
469.412	164.14
469.842	139.87
470.272	142.3
470.701	103.46
471.131	176.28
471.56	125.31
471.99	127.73
472.419	113.17
472.849	110.74
473.278	147.15
473.707	232.1
474.136	125.31
474.566	125.31
474.995	152
475.424	130.16
475.853	130.16
476.282	127.73
476.711	164.14
477.14	156.86
477.569	110.74
477.997	154.43
478.426	152
478.855	127.73
479.283	154.43
479.712	135.01
480.141	212.69
480.569	207.83
480.998	224.82
481.426	149.58
481.854	142.3
482.283	132.59
482.711	144.72
483.139	241.81
483.567	164.14
483.995	93.75
484.424	139.87
484.852	190.84
485.28	166.57
485.708	193.27
486.135	193.27
486.563	159.29
486.991	185.99
487.419	110.74
487.847	139.87
488.274	173.85
488.702	159.29
489.129	101.03
489.557	96.18
489.984	222.39
490.412	139.87
490.839	171.42
491.266	96.18
491.694	152
492.121	202.98
492.548	164.14
492.975	120.45
493.402	144.72
493.829	152
494.256	178.7
494.683	215.11
495.11	144.72
495.537	159.29
495.964	147.15
496.39	169
496.817	130.16
497.244	137.44
497.67	96.18
498.097	195.69
498.523	118.02
498.95	115.6
499.376	142.3
499.803	144.72
500.229	110.74
500.655	171.42
501.081	88.9
501.508	181.13
501.934	137.44
502.36	149.58
502.786	125.31
503.212	125.31
503.638	74.33
504.064	154.43
504.489	110.74
504.915	152
505.341	142.3
505.767	144.72
506.192	178.7
506.618	169
507.043	178.7
507.469	98.61
507.894	161.71
508.32	108.31
508.745	152
509.17	181.13
509.596	139.87
510.021	144.72
510.446	190.84
510.871	142.3
511.296	142.3
511.721	130.16
512.146	152
512.571	164.14
512.996	59.77
513.421	173.85
513.845	108.31
514.27	98.61
514.695	253.95
515.119	132.59
515.544	108.31
515.969	88.9
516.393	212.69
516.817	156.86
517.242	132.59
517.666	171.42
518.09	147.15
518.515	93.75
518.939	98.61
519.363	387.45
519.787	166.57
520.211	161.71
520.635	161.71
521.059	154.43
521.483	149.58
521.907	169
522.331	202.98
522.754	118.02
523.178	159.29
523.602	125.31
524.025	159.29
524.449	93.75
524.872	115.6
525.296	149.58
525.719	200.55
526.143	176.28
526.566	105.89
526.989	207.83
527.412	137.44
527.836	91.32
528.259	161.71
528.682	144.72
529.105	161.71
529.528	122.88
529.951	120.45
530.374	202.98
530.796	195.69
531.219	198.12
531.642	164.14
532.065	108.31
532.487	113.17
532.91	176.28
533.332	161.71
533.755	103.46
534.177	156.86
534.6	154.43
535.022	202.98
535.444	135.01
535.867	152
536.289	142.3
536.711	139.87
537.133	200.55
537.555	144.72
537.977	93.75
538.399	161.71
538.821	110.74
539.243	144.72
539.665	169
540.086	164.14
540.508	127.73
540.93	198.12
541.351	152
541.773	178.7
542.195	229.68
542.616	212.69
543.037	190.84
543.459	164.14
543.88	149.58
544.301	193.27
544.723	142.3
545.144	178.7
545.565	142.3
545.986	149.58
546.407	101.03
546.828	120.45
547.249	139.87
547.67	127.73
548.091	135.01
548.512	135.01
548.932	166.57
549.353	161.71
549.774	125.31
550.194	193.27
550.615	183.56
551.035	127.73
551.456	188.41
551.876	147.15
552.296	169
552.717	81.62
553.137	118.02
553.557	147.15
553.977	84.04
554.397	176.28
554.817	152
555.237	149.58
555.657	166.57
556.077	139.87
556.497	79.19
556.917	113.17
557.337	149.58
557.756	173.85
558.176	105.89
558.596	161.71
559.015	224.82
559.435	142.3
559.854	183.56
560.274	166.57
560.693	152
561.112	190.84
561.532	154.43
561.951	144.72
562.37	147.15
562.789	215.11
563.208	198.12
563.627	178.7
564.046	171.42
564.465	185.99
564.884	62.2
565.303	159.29
565.722	183.56
566.14	178.7
566.559	193.27
566.978	210.26
567.396	181.13
567.815	198.12
568.233	198.12
568.652	159.29
569.07	113.17
569.489	127.73
569.907	139.87
570.325	139.87
570.743	198.12
571.161	120.45
571.58	132.59
571.998	154.43
572.416	152
572.833	171.42
573.251	81.62
573.669	183.56
574.087	120.45
574.505	159.29
574.922	183.56
575.34	171.42
575.758	115.6
576.175	127.73
576.593	159.29
577.01	166.57
577.428	76.76
577.845	1540.38
578.262	287.93
578.68	103.46
579.097	142.3
579.514	185.99
579.931	74.33
580.348	164.14
580.765	200.55
581.182	144.72
581.599	195.69
582.016	152
582.433	159.29
582.849	96.18
583.266	127.73
583.683	154.43
584.099	193.27
584.516	147.15
584.933	137.44
585.349	132.59
585.765	200.55
586.182	169
586.598	130.16
587.014	169
587.431	40.35
587.847	156.86
588.263	113.17
588.679	202.98
589.095	142.3
589.511	161.71
589.927	166.57
590.343	115.6
590.759	154.43
591.174	144.72
591.59	152
592.006	84.04
592.421	96.18
592.837	137.44
593.252	178.7
593.668	152
594.083	149.58
594.499	159.29
594.914	161.71
595.329	195.69
595.745	200.55
596.16	164.14
596.575	130.16
596.99	137.44
597.405	122.88
597.82	84.04
598.235	181.13
598.65	178.7
599.065	142.3
599.479	149.58
599.894	113.17
600.309	188.41
600.724	156.86
601.138	118.02
601.553	164.14
601.967	120.45
602.382	161.71
602.796	152
603.21	120.45
603.625	188.41
604.039	156.86
604.453	135.01
604.867	142.3
605.281	188.41
605.695	115.6
606.109	171.42
606.523	152
606.937	173.85
607.351	295.21
607.765	164.14
608.178	125.31
608.592	166.57
609.006	193.27
609.419	118.02
609.833	166.57
610.246	132.59
610.66	202.98
611.073	125.31
611.487	176.28
611.9	135.01
612.313	137.44
612.726	202.98
613.139	159.29
613.553	144.72
613.966	152
614.379	188.41
614.792	224.82
615.204	173.85
615.617	144.72
616.03	205.4
616.443	164.14
616.856	132.59
617.268	152
617.681	219.97
618.093	159.29
618.506	118.02
618.918	166.57
619.331	173.85
619.743	147.15
620.155	88.9
620.568	152
620.98	93.75
621.392	164.14
621.804	212.69
622.216	173.85
622.628	171.42
623.04	164.14
623.452	152
623.864	185.99
624.276	105.89
624.687	122.88
625.099	122.88
625.511	181.13
625.922	108.31
626.334	195.69
626.745	98.61
627.157	181.13
627.568	130.16
627.979	118.02
628.391	69.48
628.802	183.56
629.213	176.28
629.624	200.55
630.035	161.71
630.446	159.29
630.857	166.57
631.268	137.44
631.679	178.7
632.09	164.14
632.501	171.42
632.912	149.58
633.322	127.73
633.733	152
634.144	125.31
634.554	127.73
634.965	166.57
635.375	161.71
635.785	229.68
636.196	113.17
636.606	147.15
637.016	132.59
637.427	101.03
637.837	159.29
638.247	253.95
638.657	125.31
639.067	149.58
639.477	161.71
639.887	188.41
640.297	132.59
640.706	159.29
641.116	130.16
641.526	108.31
641.935	113.17
642.345	103.46
642.755	144.72
643.164	122.88
643.573	147.15
643.983	188.41
644.392	234.53
644.801	137.44
645.211	147.15
645.62	122.88
646.029	152
646.438	118.02
646.847	176.28
647.256	161.71
647.665	132.59
648.074	130.16
648.483	103.46
648.892	79.19
649.3	156.86
649.709	198.12
650.118	93.75
650.526	159.29
650.935	120.45
651.343	212.69
651.752	142.3
652.16	130.16
652.568	113.17
652.977	35.5
653.385	74.33
653.793	215.11
654.201	154.43
654.609	110.74
655.017	200.55
655.425	139.87
655.833	142.3
656.241	164.14
656.649	98.61
657.057	173.85
657.464	181.13
657.872	105.89
658.28	105.89
658.687	93.75
659.095	105.89
659.502	156.86
659.91	115.6
660.317	108.31
660.724	132.59
661.132	195.69
661.539	176.28
661.946	142.3
662.353	139.87
662.76	154.43
663.167	135.01
663.574	35.5
663.981	130.16
664.388	161.71
664.795	71.91
665.202	132.59
665.608	132.59
666.015	88.9
666.422	125.31
666.828	84.04
667.235	171.42
667.641	198.12
668.047	122.88
668.454	227.25
668.86	159.29
669.266	222.39
669.673	130.16
670.079	181.13
670.485	169
670.891	69.48
671.297	101.03
671.703	96.18
672.109	132.59
672.515	166.57
672.92	118.02
673.326	156.86
673.732	142.3
674.138	76.76
674.543	202.98
674.949	164.14
675.354	205.4
675.76	176.28
676.165	122.88
676.57	144.72
676.976	122.88
677.381	149.58
677.786	110.74
678.191	164.14
678.596	144.72
679.001	98.61
679.406	149.58
679.811	125.31
680.216	110.74
680.621	166.57
681.026	101.03
681.43	178.7
681.835	152
682.24	173.85
682.644	130.16
683.049	50.06
683.453	142.3
683.858	135.01
684.262	161.71
684.667	67.05
685.071	183.56
685.475	152
685.879	135.01
686.283	176.28
686.687	171.42
687.091	244.24
687.495	147.15
687.899	164.14
688.303	139.87
688.707	169
689.111	142.3
689.514	161.71
689.918	156.86
690.322	125.31
690.725	81.62
691.129	183.56
691.532	183.56
691.936	130.16
692.339	149.58
692.742	173.85
693.146	127.73
693.549	105.89
693.952	139.87
694.355	202.98
694.758	202.98
695.161	200.55
695.564	164.14
695.967	120.45
696.37	127.73
696.773	108.31
697.175	181.13
697.578	219.97
697.981	200.55
698.383	139.87
698.786	125.31
699.188	169
699.591	161.71
699.993	173.85
700.395	166.57
700.798	149.58
701.2	205.4
701.602	115.6
702.004	159.29
702.406	142.3
702.808	130.16
703.21	139.87
703.612	159.29
704.014	169
704.416	176.28
704.818	244.24
705.219	173.85
705.621	147.15
706.023	91.32
706.424	224.82
706.826	120.45
707.227	166.57
707.629	239.38
708.03	127.73
708.431	171.42
708.832	178.7
709.234	139.87
709.635	198.12
710.036	227.25
710.437	239.38
710.838	219.97
711.239	202.98
711.64	251.52
712.041	178.7
712.441	244.24
712.842	280.65
713.243	263.66
713.643	215.11
714.044	224.82
714.445	190.84
714.845	200.55
715.246	336.47
715.646	207.83
716.046	292.78
716.447	266.08
716.847	266.08
717.247	302.49
717.647	338.9
718.047	312.2
718.447	268.51
718.847	256.38
719.247	285.5
719.647	314.63
720.047	295.21
720.446	304.92
720.846	287.93
721.246	404.44
721.645	368.03
722.045	404.44
722.444	300.07
722.844	348.61
723.243	414.14
723.643	389.87
724.042	253.95
724.441	392.3
724.84	304.92
725.24	438.42
725.639	394.73
726.038	397.15
726.437	433.56
726.836	394.73
727.234	351.04
727.633	443.27
728.032	462.69
728.431	491.82
728.83	503.95
729.228	596.19
729.627	608.32
730.025	647.16
730.424	637.45
730.822	693.28
731.22	746.67
731.619	814.64
732.017	836.48
732.415	868.04
732.813	977.26
733.212	1030.66
733.61	1054.93
734.008	1050.08
734.406	1064.64
734.803	1261.25
735.201	1295.23
735.599	1472.41
735.997	1421.44
736.395	1622.9
736.792	1695.72
737.19	1773.39
737.587	1841.35
737.985	1863.2
738.382	1950.58
738.78	2035.53
739.177	2188.44
739.574	2253.98
739.971	2443.3
740.369	2661.75
740.766	2596.22
741.163	2652.04
741.56	2902.05
741.957	2953.02
742.354	2945.74
742.751	3086.52
743.147	3348.66
743.544	3295.26
743.941	3467.59
744.338	3746.72
744.734	3831.67
745.131	3926.34
745.527	4079.25
745.924	4331.68
746.32	4615.67
746.716	4751.59
747.113	5021.01
747.509	5348.69
747.905	5530.73
748.301	5695.78
748.697	6001.61
749.093	6280.74
749.489	6120.54
749.885	6690.94
750.281	7329.3
750.677	7319.59
751.073	7652.12
751.468	8127.86
751.864	8404.56
752.26	8178.83
752.655	8700.68
753.051	9222.53
753.446	9479.82
753.842	9686.13
754.237	10377.89
754.632	10683.72
755.028	10589.06
755.423	10615.76
755.818	11152.18
756.213	11409.46
756.608	11322.08
757.003	11909.47
757.398	12149.76
757.793	12222.58
758.188	11873.06
758.583	12683.75
758.977	13123.08
759.372	13528.43
759.767	13817.27
760.161	14581.84
760.556	15671.66
760.95	16047.88
761.345	15960.5
761.739	17577.03
762.133	18001.8
762.527	18572.19
762.922	18484.81
763.316	20052.8
763.71	20402.32
764.104	20103.77
764.498	20778.54
764.892	22346.52
765.286	22264
765.68	22006.71
766.073	23074.69
766.467	23424.21
766.861	24305.29
767.255	24327.14
767.648	25611.14
768.042	26169.4
768.435	25849.01
768.829	25955.8
769.222	27679.13
769.615	29048.09
770.008	27438.84
770.402	27285.92
770.795	28200.98
771.188	28931.58
771.581	27844.18
771.974	27890.3
772.367	28147.59
772.76	28625.75
773.153	27562.63
773.545	28183.99
773.938	29383.04
774.331	29501.98
774.724	28800.51
775.116	30715.59
775.509	32904.94
775.901	32730.18
776.294	32769.02
776.686	33708.35
777.078	36011.79
777.471	35538.48
777.863	35885.57
778.255	38104.05
778.647	40189.04
779.039	38946.3
779.431	37191.42
779.823	38769.11
780.215	39655.05
780.607	38803.09
780.999	39531.26
781.39	40375.93
781.782	40832.25
782.174	40669.63
782.565	40159.91
782.957	41623.52
783.348	42934.22
783.74	41582.26
784.131	39618.64
784.522	41662.36
784.914	42091.98
785.305	40550.69
785.696	39591.94
786.087	40358.94
786.478	40599.24
786.869	38281.24
787.26	37147.73
787.651	37465.69
788.042	37550.64
788.433	35691.39
788.823	34669.53
789.214	34968.08
789.605	35164.69
789.995	33718.06
790.386	32145.22
790.776	32953.49
791.167	33667.09
791.557	32742.32
791.948	32538.43
792.338	34184.09
792.728	36465.68
793.118	35373.43
793.508	34693.8
793.898	35521.49
794.288	36696.26
794.678	35587.02
795.068	34176.81
795.458	34671.96
795.848	35958.39
796.238	35349.15
796.627	33941.37
797.017	34077.29
797.406	35448.67
797.796	35269.06
798.185	34288.46
798.575	33997.19
798.964	35764.21
799.354	35657.41
799.743	34077.29
800.132	33800.59
800.521	35807.9
800.91	36676.84
801.299	34346.71
801.688	33458.35
802.077	33946.22
802.466	35295.76
802.855	33387.96
803.244	30761.7
803.633	31730.17
804.021	32669.5
804.41	31118.51
804.799	28875.75
805.187	28953.42
805.576	29737.42
805.964	28878.18
806.352	26312.61
806.741	26832.03
807.129	27567.48
807.517	27611.17
807.905	26310.18
808.293	25754.34
808.681	27120.87
809.069	27548.06
809.457	27086.89
809.845	26395.13
810.233	27620.88
810.621	28955.85
811.009	27528.64
811.396	26179.11
811.784	27135.43
812.171	28077.2
812.559	27460.68
812.946	25727.65
813.334	25608.71
813.721	26317.46
814.108	25664.54
814.496	24052.86
814.883	23171.78
815.27	24943.65
815.657	25191.23
816.044	24069.85
816.431	23188.77
816.818	24057.72
817.205	24732.48
817.592	23827.13
817.979	21868.36
818.365	21696.03
818.752	22455.75
819.139	21780.98
819.525	20341.64
819.912	19331.91
820.298	20079.5
820.685	20249.4
821.071	18759.09
821.457	17814.9
821.843	17851.31
822.23	17868.3
822.616	16564.88
823.002	15419.23
823.388	15006.6
823.774	15249.33
824.16	14751.75
824.546	13579.4
824.931	12943.47
825.317	13234.73
825.703	13851.25
826.089	13465.32
826.474	12234.72
826.86	12598.8
827.245	13057.55
827.631	12863.37
828.016	11962.87
828.401	11373.05
828.787	11720.15
829.172	11965.3
829.557	11140.04
829.942	10295.37
830.327	10237.11
830.712	10729.84
831.097	10118.18
831.482	9674
831.867	9096.32
832.252	9377.88
832.636	9356.03
833.021	9113.31
833.406	8474.95
833.79	8457.96
834.175	8606.02
834.559	8494.37
834.944	7999.21
835.328	7511.34
835.713	7688.53
836.097	7673.97
836.481	7166.68
836.865	6589
837.249	6416.67
837.633	6579.29
838.017	6652.11
838.401	5991.9
838.785	5618.11
839.169	5555
839.553	5763.74
839.937	5368.11
840.32	4676.35
840.704	4562.27
841.087	4591.39
841.471	4550.13
841.854	4355.95
842.238	3928.76
842.621	3819.54
843.004	4018.57
843.388	4091.39
843.771	3739.44
844.154	3712.74
844.537	3693.32
844.92	3821.96
845.303	3584.1
845.686	3336.52
846.069	3300.11
846.452	3394.77
846.834	3409.34
847.217	3139.92
847.6	2797.68
847.982	2955.45
848.365	2991.85
848.748	2977.29
849.13	2783.11
849.512	2450.58
849.895	2627.77
850.277	2710.3
850.659	2564.66
851.041	2334.08
851.423	2331.65
851.806	2324.37
852.188	2450.58
852.57	2190.87
852.951	2025.82
853.333	2047.67
853.715	2171.45
854.097	2093.78
854.479	2050.09
854.86	1795.23
855.242	1829.22
855.623	1933.59
856.005	1761.25
856.386	1620.47
856.768	1506.39
857.149	1567.08
857.53	1603.48
857.911	1508.82
858.292	1355.91
858.674	1287.94
859.055	1241.83
859.436	1351.05
859.817	1164.16
860.197	1113.18
860.578	1023.38
860.959	1057.36
861.34	1120.47
861.72	1023.38
862.101	940.85
862.482	826.77
862.862	955.42
863.243	1020.95
863.623	855.9
864.003	795.22
864.384	800.07
864.764	804.93
865.144	814.64
865.524	780.66
865.904	722.4
866.284	741.82
866.664	763.66
867.044	700.56
867.424	601.04
867.804	596.19
868.183	664.15
868.563	644.73
868.943	603.47
869.322	569.49
869.702	601.04
870.081	528.22
870.461	605.9
870.84	601.04
871.22	540.36
871.599	452.98
871.978	516.09
872.357	501.52
872.736	499.1
873.115	465.12
873.494	404.44
873.873	360.75
874.252	421.43
874.631	428.71
875.01	411.72
875.388	358.32
875.767	278.22
876.146	348.61
876.524	402.01
876.903	355.89
877.281	268.51
877.66	256.38
878.038	324.34
878.416	326.76
878.794	287.93
879.173	290.36
879.551	270.94
879.929	280.65
880.307	372.88
880.685	234.53
881.063	239.38
881.441	234.53
881.818	283.07
882.196	229.68
882.574	251.52
882.951	217.54
883.329	229.68
883.707	283.07
884.084	249.09
884.461	268.51
884.839	215.11
885.216	173.85
885.593	193.27
885.971	258.8
886.348	224.82
886.725	222.39
887.102	244.24
887.479	173.85
887.856	219.97
888.233	217.54
888.609	176.28
888.986	241.81
889.363	202.98
889.74	217.54
890.116	190.84
890.493	188.41
890.869	164.14
891.246	205.4
891.622	178.7
891.998	190.84
892.375	120.45
892.751	185.99
893.127	202.98
893.503	149.58
893.879	135.01
894.255	132.59
894.631	176.28
895.007	234.53
895.383	54.92
895.759	178.7
896.134	200.55
896.51	147.15
896.886	229.68
897.261	222.39
897.637	125.31
898.012	164.14
898.388	130.16
898.763	125.31
899.138	188.41
899.514	103.46
899.889	205.4
900.264	118.02
900.639	161.71
901.014	108.31
901.389	110.74
901.764	79.19
902.139	98.61
902.513	79.19
902.888	103.46
903.263	166.57
903.638	118.02
904.012	217.54
904.387	147.15
904.761	81.62
905.136	173.85
905.51	130.16
905.884	156.86
906.259	98.61
906.633	88.9
907.007	144.72
907.381	122.88
907.755	98.61
908.129	161.71
908.503	135.01
908.877	154.43
909.251	135.01
909.624	113.17
909.998	93.75
910.372	144.72
910.745	71.91
911.119	122.88
911.492	74.33
911.866	118.02
912.239	122.88
912.612	101.03
912.986	212.69
913.359	103.46
913.732	28.22
914.105	64.62
914.478	154.43
914.851	135.01
915.224	207.83
915.597	118.02
915.97	137.44
916.343	200.55
916.715	156.86
917.088	52.49
917.461	152
917.833	127.73
918.206	159.29
918.578	130.16
918.951	71.91
919.323	190.84
919.695	178.7
920.067	120.45
920.44	115.6
920.812	113.17
921.184	164.14
921.556	93.75
921.928	105.89
922.3	169
922.672	181.13
923.043	137.44
923.415	159.29
923.787	93.75
924.158	120.45
924.53	88.9
924.901	202.98
925.273	105.89
925.644	127.73
926.016	88.9
926.387	76.76
926.758	159.29
927.129	159.29
927.5	103.46
927.872	142.3
928.243	132.59
928.613	139.87
928.984	212.69
929.355	188.41
929.726	54.92
930.097	103.46
930.467	122.88
930.838	176.28
931.209	137.44
931.579	241.81
931.95	125.31
932.32	122.88
932.69	185.99
933.061	108.31
933.431	185.99
933.801	176.28
934.171	86.47
934.541	139.87
934.911	91.32
935.281	115.6
935.651	115.6
936.021	147.15
936.391	171.42
936.761	139.87
937.13	120.45
937.5	135.01
937.87	171.42
938.239	149.58
938.609	142.3
938.978	171.42
939.347	215.11
939.717	91.32
940.086	76.76
940.455	96.18
940.824	166.57
941.193	115.6
941.562	120.45
941.931	127.73
942.3	195.69
942.669	59.77
943.038	64.62
943.407	147.15
943.775	161.71
944.144	193.27
944.513	154.43
944.881	88.9
945.25	166.57
945.618	120.45
945.986	202.98
946.355	76.76
946.723	130.16
947.091	122.88
947.459	181.13
947.827	130.16
948.195	91.32
948.563	101.03
948.931	74.33
949.299	159.29
949.667	115.6
950.035	190.84
950.402	147.15
950.77	132.59
951.138	113.17
951.505	127.73
951.873	142.3
952.24	149.58
952.607	115.6
952.975	98.61
953.342	81.62
953.709	154.43
954.076	88.9
954.443	125.31
954.81	152
955.177	130.16
955.544	101.03
955.911	130.16
956.278	156.86
956.645	185.99
957.012	108.31
957.378	113.17
957.745	103.46
958.111	125.31
958.478	193.27
958.844	193.27
959.211	93.75
959.577	96.18
959.943	118.02
960.309	86.47
960.675	181.13
961.042	142.3
961.408	96.18
961.774	149.58
962.139	115.6
962.505	169
962.871	54.92
963.237	86.47
963.603	156.86
963.968	76.76
964.334	130.16
964.699	169
965.065	149.58
965.43	91.32
965.796	105.89
966.161	64.62
966.526	98.61
966.891	127.73
967.256	178.7
967.622	142.3
967.987	178.7
968.352	183.56
968.716	108.31
969.081	139.87
969.446	118.02
969.811	147.15
970.176	93.75
970.54	185.99
970.905	120.45
971.269	135.01
971.634	98.61
971.998	178.7
972.363	101.03
972.727	110.74
973.091	144.72
973.455	169
973.819	115.6
974.183	173.85
974.547	84.04
974.911	115.6
975.275	91.32
975.639	113.17
976.003	144.72
976.367	139.87
976.73	8.8
977.094	137.44
977.458	122.88
977.821	101.03
978.185	164.14
978.548	178.7
978.911	108.31
979.275	74.33
979.638	137.44
980.001	103.46
980.364	84.04
980.727	137.44
981.09	120.45
981.453	79.19
981.816	139.87
982.179	144.72
982.542	132.59
982.905	152
983.267	137.44
983.63	164.14
983.992	142.3
984.355	152
984.717	142.3
985.08	127.73
985.442	137.44
985.804	52.49
986.167	190.84
986.529	115.6
986.891	142.3
987.253	88.9
987.615	147.15
987.977	193.27
988.339	122.88
988.701	59.77
989.062	147.15
989.424	96.18
989.786	71.91
990.147	101.03
990.509	159.29
990.87	118.02
991.232	188.41
991.593	125.31
991.955	120.45
992.316	132.59
992.677	113.17
993.038	108.31
993.399	159.29
993.76	171.42
994.121	144.72
994.482	159.29
994.843	122.88
995.204	149.58
995.565	67.05
995.926	152
996.286	115.6
996.647	142.3
997.007	115.6
997.368	96.18
997.728	135.01
998.089	139.87
998.449	171.42
998.809	67.05
999.169	84.04
999.53	159.29
999.89	101.03
1000.25	125.31
1000.61	142.3
1000.97	81.62
1001.329	152
1001.689	93.75
1002.049	178.7
1002.409	185.99
1002.768	113.17
1003.128	176.28
1003.487	135.01
1003.847	113.17
1004.206	139.87
1004.566	164.14
1004.925	84.04
1005.284	127.73
1005.643	137.44
1006.003	108.31
1006.362	127.73
1006.721	98.61
1007.08	130.16
1007.438	122.88
1007.797	198.12
1008.156	188.41
1008.515	132.59
1008.874	118.02
1009.232	84.04
1009.591	173.85
1009.949	149.58
1010.308	76.76
1010.666	176.28
1011.024	120.45
1011.383	96.18
1011.741	130.16
1012.099	135.01
1012.457	108.31
1012.815	88.9
1013.173	88.9
1013.531	132.59
1013.889	193.27
1014.247	152
1014.605	120.45
1014.962	76.76
1015.32	103.46
1015.678	118.02
1016.035	205.4
1016.393	103.46
1016.75	28.22
1017.107	173.85
1017.465	135.01
1017.822	122.88
1018.179	137.44
1018.536	144.72
1018.894	81.62
1019.251	181.13
1019.608	113.17
1019.964	122.88
1020.321	98.61
1020.678	142.3
1021.035	115.6
1021.392	103.46
1021.748	166.57
1022.105	166.57
1022.461	178.7
1022.818	64.62
1023.174	132.59
1023.531	98.61
1023.887	67.05
1024.243	139.87
1024.599	86.47
1024.955	161.71
1025.311	105.89
1025.667	171.42
1026.023	69.48
1026.379	86.47
1026.735	173.85
1027.091	96.18
1027.447	127.73
