189.514	34.44
189.973	34.44
190.431	34.44
190.889	0.46
191.348	-48.09
191.806	-33.53
192.264	44.15
192.722	-4.4
193.18	-4.4
193.638	-55.37
194.096	-38.38
194.554	2.88
195.012	-21.39
195.47	-31.1
195.928	-23.82
196.385	-23.82
196.843	-6.83
197.301	15.02
197.758	80.55
198.216	-45.66
198.674	36.86
199.131	75.7
199.589	24.73
200.046	61.14
200.503	90.26
200.961	102.4
201.418	51.43
201.875	80.55
202.332	124.24
202.79	87.84
203.247	90.26
203.704	102.4
204.161	124.24
204.618	104.83
205.075	165.51
205.532	95.12
205.989	175.22
206.445	104.83
206.902	124.24
207.359	136.38
207.816	189.78
208.272	189.78
208.729	170.36
209.185	172.79
209.642	209.2
210.098	126.67
210.555	99.97
211.011	158.22
211.467	136.38
211.924	182.5
212.38	126.67
212.836	148.52
213.292	65.99
213.748	124.24
214.204	153.37
214.66	148.52
215.116	163.08
215.572	163.08
216.028	211.62
216.484	167.93
216.94	136.38
217.396	150.94
217.851	124.24
218.307	107.25
218.763	148.52
219.218	146.09
219.674	131.53
220.129	126.67
220.585	158.22
221.04	192.21
221.496	36.86
221.951	78.13
222.406	99.97
222.861	129.1
223.317	121.82
223.772	95.12
224.227	119.39
224.682	150.94
225.137	206.77
225.592	170.36
226.047	126.67
226.502	87.84
226.957	153.37
227.411	146.09
227.866	119.39
228.321	158.22
228.776	170.36
229.23	184.92
229.685	175.22
230.139	148.52
230.594	82.98
231.048	126.67
231.503	177.64
231.957	126.67
232.411	167.93
232.865	116.96
233.32	192.21
233.774	153.37
234.228	129.1
234.682	187.35
235.136	126.67
235.59	226.19
236.044	143.66
236.498	180.07
236.952	39.29
237.406	194.63
237.86	119.39
238.313	136.38
238.767	182.5
239.221	192.21
239.674	250.46
240.128	138.81
240.581	177.64
241.035	143.66
241.488	92.69
241.942	116.96
242.395	107.25
242.848	146.09
243.301	155.8
243.755	167.93
244.208	211.62
244.661	146.09
245.114	116.96
245.567	114.53
246.02	160.65
246.473	85.41
246.926	177.64
247.379	175.22
247.832	148.52
248.284	160.65
248.737	112.11
249.19	160.65
249.642	107.25
250.095	163.08
250.547	92.69
251	165.51
251.452	187.35
251.905	204.34
252.357	187.35
252.81	150.94
253.262	209.2
253.714	170.36
254.166	126.67
254.618	114.53
255.07	143.66
255.523	116.96
255.975	192.21
256.427	112.11
256.878	109.68
257.33	182.5
257.782	153.37
258.234	107.25
258.686	163.08
259.137	116.96
259.589	143.66
260.041	109.68
260.492	231.04
260.944	129.1
261.395	70.84
261.847	187.35
262.298	114.53
262.749	97.54
263.201	172.79
263.652	209.2
264.103	189.78
264.554	126.67
265.005	116.96
265.457	158.22
265.908	172.79
266.359	112.11
266.809	107.25
267.26	124.24
267.711	189.78
268.162	116.96
268.613	155.8
269.064	187.35
269.514	216.48
269.965	216.48
270.415	143.66
270.866	189.78
271.316	189.78
271.767	158.22
272.217	189.78
272.668	136.38
273.118	192.21
273.568	223.76
274.019	180.07
274.469	121.82
274.919	155.8
275.369	204.34
275.819	180.07
276.269	121.82
276.719	150.94
277.169	153.37
277.619	75.7
278.069	143.66
278.518	141.23
278.968	182.5
279.418	107.25
279.867	138.81
280.317	138.81
280.767	187.35
281.216	124.24
281.666	158.22
282.115	165.51
282.564	163.08
283.014	133.95
283.463	233.47
283.912	199.49
284.361	192.21
284.811	126.67
285.26	177.64
285.709	78.13
286.158	231.04
286.607	160.65
287.056	129.1
287.505	199.49
287.953	63.56
288.402	182.5
288.851	97.54
289.3	121.82
289.748	175.22
290.197	82.98
290.646	158.22
291.094	175.22
291.543	143.66
291.991	143.66
292.439	187.35
292.888	180.07
293.336	160.65
293.784	143.66
294.233	119.39
294.681	158.22
295.129	129.1
295.577	233.47
296.025	177.64
296.473	129.1
296.921	209.2
297.369	182.5
297.817	107.25
298.264	114.53
298.712	158.22
299.16	240.75
299.608	138.81
300.055	143.66
300.503	112.11
300.95	167.93
301.398	226.19
301.845	218.91
302.293	197.06
302.74	163.08
303.187	197.06
303.635	102.4
304.082	116.96
304.529	177.64
304.976	187.35
305.423	221.33
305.87	153.37
306.317	126.67
306.764	143.66
307.211	172.79
307.658	133.95
308.105	136.38
308.552	146.09
308.998	124.24
309.445	211.62
309.892	180.07
310.338	204.34
310.785	150.94
311.231	184.92
311.678	114.53
312.124	184.92
312.571	107.25
313.017	160.65
313.463	172.79
313.909	163.08
314.356	155.8
314.802	119.39
315.248	143.66
315.694	158.22
316.14	218.91
316.586	133.95
317.032	177.64
317.478	206.77
317.923	180.07
318.369	187.35
318.815	119.39
319.261	138.81
319.706	92.69
320.152	138.81
320.597	175.22
321.043	121.82
321.488	250.46
321.934	143.66
322.379	136.38
322.824	155.8
323.27	194.63
323.715	82.98
324.16	133.95
324.605	102.4
325.05	119.39
325.495	167.93
325.94	201.91
326.385	187.35
326.83	90.26
327.275	104.83
327.72	199.49
328.165	104.83
328.61	141.23
329.054	141.23
329.499	238.32
329.943	187.35
330.388	153.37
330.832	175.22
331.277	262.6
331.721	177.64
332.166	153.37
332.61	194.63
333.054	245.6
333.499	187.35
333.943	194.63
334.387	192.21
334.831	114.53
335.275	78.13
335.719	141.23
336.163	138.81
336.607	153.37
337.051	124.24
337.495	129.1
337.938	153.37
338.382	107.25
338.826	121.82
339.269	180.07
339.713	201.91
340.157	99.97
340.6	194.63
341.044	182.5
341.487	129.1
341.93	150.94
342.374	126.67
342.817	99.97
343.26	187.35
343.703	153.37
344.146	99.97
344.59	187.35
345.033	141.23
345.476	109.68
345.919	82.98
346.361	177.64
346.804	180.07
347.247	192.21
347.69	189.78
348.133	112.11
348.575	194.63
349.018	204.34
349.461	206.77
349.903	160.65
350.346	172.79
350.788	153.37
351.23	146.09
351.673	138.81
352.115	124.24
352.557	136.38
353	197.06
353.442	141.23
353.884	129.1
354.326	192.21
354.768	143.66
355.21	148.52
355.652	180.07
356.094	189.78
356.536	177.64
356.978	163.08
357.419	116.96
357.861	136.38
358.303	240.75
358.744	201.91
359.186	192.21
359.627	177.64
360.069	104.83
360.51	160.65
360.952	184.92
361.393	158.22
361.834	163.08
362.276	126.67
362.717	143.66
363.158	124.24
363.599	136.38
364.04	85.41
364.481	177.64
364.922	167.93
365.363	136.38
365.804	155.8
366.245	165.51
366.686	80.55
367.126	160.65
367.567	146.09
368.008	170.36
368.448	150.94
368.889	180.07
369.33	146.09
369.77	136.38
370.21	133.95
370.651	121.82
371.091	158.22
371.531	172.79
371.972	204.34
372.412	180.07
372.852	150.94
373.292	187.35
373.732	233.47
374.172	150.94
374.612	153.37
375.052	209.2
375.492	199.49
375.932	95.12
376.372	129.1
376.811	182.5
377.251	165.51
377.691	165.51
378.13	204.34
378.57	218.91
379.009	189.78
379.449	187.35
379.888	184.92
380.328	209.2
380.767	165.51
381.206	148.52
381.645	102.4
382.085	146.09
382.524	192.21
382.963	99.97
383.402	114.53
383.841	150.94
384.28	114.53
384.719	109.68
385.158	114.53
385.596	95.12
386.035	99.97
386.474	136.38
386.913	126.67
387.351	107.25
387.79	163.08
388.228	70.84
388.667	155.8
389.105	180.07
389.544	153.37
389.982	121.82
390.42	160.65
390.859	204.34
391.297	126.67
391.735	187.35
392.173	99.97
392.611	187.35
393.049	131.53
393.487	214.05
393.925	155.8
394.363	204.34
394.801	184.92
395.239	167.93
395.676	192.21
396.114	131.53
396.552	65.99
396.989	167.93
397.427	189.78
397.864	95.12
398.302	126.67
398.739	119.39
399.177	187.35
399.614	143.66
400.051	175.22
400.488	148.52
400.926	248.03
401.363	155.8
401.8	63.56
402.237	121.82
402.674	131.53
403.111	150.94
403.548	143.66
403.985	133.95
404.421	133.95
404.858	204.34
405.295	192.21
405.732	136.38
406.168	221.33
406.605	138.81
407.041	116.96
407.478	214.05
407.914	175.22
408.351	165.51
408.787	119.39
409.223	131.53
409.66	116.96
410.096	201.91
410.532	204.34
410.968	155.8
411.404	126.67
411.84	182.5
412.276	231.04
412.712	167.93
413.148	165.51
413.584	158.22
414.02	114.53
414.455	223.76
414.891	133.95
415.327	243.18
415.762	180.07
416.198	99.97
416.633	119.39
417.069	136.38
417.504	143.66
417.94	114.53
418.375	194.63
418.81	148.52
419.245	97.54
419.681	194.63
420.116	150.94
420.551	214.05
420.986	184.92
421.421	184.92
421.856	175.22
422.291	184.92
422.726	102.4
423.16	175.22
423.595	148.52
424.03	187.35
424.464	124.24
424.899	138.81
425.334	146.09
425.768	133.95
426.203	136.38
426.637	194.63
427.071	194.63
427.506	165.51
427.94	177.64
428.374	163.08
428.809	170.36
429.243	172.79
429.677	97.54
430.111	153.37
430.545	146.09
430.979	141.23
431.413	150.94
431.847	170.36
432.28	133.95
432.714	153.37
433.148	119.39
433.582	172.79
434.015	187.35
434.449	165.51
434.882	153.37
435.316	131.53
435.749	175.22
436.183	150.94
436.616	124.24
437.049	221.33
437.483	146.09
437.916	233.47
438.349	129.1
438.782	199.49
439.215	209.2
439.648	160.65
440.081	116.96
440.514	150.94
440.947	194.63
441.38	163.08
441.813	199.49
442.245	192.21
442.678	240.75
443.111	153.37
443.543	146.09
443.976	187.35
444.408	201.91
444.841	192.21
445.273	206.77
445.705	231.04
446.138	160.65
446.57	204.34
447.002	231.04
447.434	252.89
447.867	260.17
448.299	233.47
448.731	192.21
449.163	192.21
449.595	165.51
450.026	167.93
450.458	231.04
450.89	248.03
451.322	184.92
451.754	306.29
452.185	172.79
452.617	201.91
453.048	218.91
453.48	279.59
453.911	243.18
454.343	175.22
454.774	194.63
455.205	238.32
455.637	204.34
456.068	325.7
456.499	289.29
456.93	189.78
457.361	277.16
457.792	163.08
458.223	211.62
458.654	197.06
459.085	238.32
459.516	231.04
459.947	218.91
460.378	165.51
460.808	284.44
461.239	260.17
461.669	245.6
462.1	197.06
462.531	255.31
462.961	248.03
463.391	240.75
463.822	267.45
464.252	216.48
464.682	262.6
465.113	228.61
465.543	243.18
465.973	204.34
466.403	226.19
466.833	197.06
467.263	243.18
467.693	175.22
468.123	201.91
468.553	269.88
468.983	245.6
469.412	233.47
469.842	240.75
470.272	286.87
470.701	252.89
471.131	238.32
471.56	184.92
471.99	226.19
472.419	255.31
472.849	201.91
473.278	165.51
473.707	250.46
474.136	204.34
474.566	187.35
474.995	180.07
475.424	165.51
475.853	177.64
476.282	187.35
476.711	240.75
477.14	257.74
477.569	211.62
477.997	194.63
478.426	226.19
478.855	209.2
479.283	216.48
479.712	187.35
480.141	165.51
480.569	146.09
480.998	214.05
481.426	197.06
481.854	180.07
482.283	163.08
482.711	136.38
483.139	146.09
483.567	189.78
483.995	143.66
484.424	240.75
484.852	187.35
485.28	209.2
485.708	231.04
486.135	240.75
486.563	170.36
486.991	165.51
487.419	267.45
487.847	199.49
488.274	170.36
488.702	146.09
489.129	218.91
489.557	197.06
489.984	209.2
490.412	150.94
490.839	189.78
491.266	250.46
491.694	201.91
492.121	184.92
492.548	165.51
492.975	245.6
493.402	170.36
493.829	201.91
494.256	109.68
494.683	209.2
495.11	158.22
495.537	194.63
495.964	187.35
496.39	136.38
496.817	221.33
497.244	257.74
497.67	262.6
498.097	160.65
498.523	99.97
498.95	155.8
499.376	160.65
499.803	211.62
500.229	201.91
500.655	175.22
501.081	155.8
501.508	160.65
501.934	201.91
502.36	167.93
502.786	194.63
503.212	163.08
503.638	211.62
504.064	180.07
504.489	150.94
504.915	138.81
505.341	129.1
505.767	126.67
506.192	218.91
506.618	184.92
507.043	180.07
507.469	97.54
507.894	214.05
508.32	170.36
508.745	223.76
509.17	121.82
509.596	175.22
510.021	136.38
510.446	187.35
510.871	153.37
511.296	138.81
511.721	141.23
512.146	153.37
512.571	170.36
512.996	172.79
513.421	158.22
513.845	209.2
514.27	197.06
514.695	206.77
515.119	175.22
515.544	153.37
515.969	189.78
516.393	109.68
516.817	189.78
517.242	201.91
517.666	114.53
518.09	187.35
518.515	194.63
518.939	279.59
519.363	410.66
519.787	182.5
520.211	119.39
520.635	155.8
521.059	150.94
521.483	238.32
521.907	177.64
522.331	121.82
522.754	136.38
523.178	148.52
523.602	189.78
524.025	192.21
524.449	201.91
524.872	146.09
525.296	150.94
525.719	216.48
526.143	148.52
526.566	238.32
526.989	182.5
527.412	233.47
527.836	177.64
528.259	199.49
528.682	182.5
529.105	180.07
529.528	201.91
529.951	216.48
530.374	180.07
530.796	218.91
531.219	172.79
531.642	187.35
532.065	104.83
532.487	153.37
532.91	223.76
533.332	199.49
533.755	102.4
534.177	165.51
534.6	155.8
535.022	109.68
535.444	163.08
535.867	223.76
536.289	199.49
536.711	165.51
537.133	197.06
537.555	170.36
537.977	189.78
538.399	180.07
538.821	116.96
539.243	192.21
539.665	221.33
540.086	104.83
540.508	143.66
540.93	172.79
541.351	167.93
541.773	184.92
542.195	143.66
542.616	165.51
543.037	218.91
543.459	209.2
543.88	197.06
544.301	187.35
544.723	153.37
545.144	206.77
545.565	223.76
545.986	223.76
546.407	194.63
546.828	182.5
547.249	204.34
547.67	180.07
548.091	160.65
548.512	228.61
548.932	165.51
549.353	197.06
549.774	177.64
550.194	194.63
550.615	163.08
551.035	218.91
551.456	180.07
551.876	235.9
552.296	206.77
552.717	119.39
553.137	187.35
553.557	175.22
553.977	153.37
554.397	187.35
554.817	192.21
555.237	206.77
555.657	265.02
556.077	133.95
556.497	163.08
556.917	165.51
557.337	204.34
557.756	228.61
558.176	141.23
558.596	90.26
559.015	182.5
559.435	228.61
559.854	146.09
560.274	223.76
560.693	177.64
561.112	175.22
561.532	199.49
561.951	155.8
562.37	126.67
562.789	187.35
563.208	204.34
563.627	163.08
564.046	197.06
564.465	158.22
564.884	153.37
565.303	150.94
565.722	112.11
566.14	136.38
566.559	172.79
566.978	146.09
567.396	136.38
567.815	167.93
568.233	187.35
568.652	150.94
569.07	209.2
569.489	121.82
569.907	146.09
570.325	221.33
570.743	119.39
571.161	201.91
571.58	218.91
571.998	167.93
572.416	136.38
572.833	204.34
573.251	160.65
573.669	141.23
574.087	182.5
574.505	158.22
574.922	209.2
575.34	277.16
575.758	233.47
576.175	199.49
576.593	235.9
577.01	165.51
577.428	192.21
577.845	1595.14
578.262	311.14
578.68	141.23
579.097	201.91
579.514	177.64
579.931	226.19
580.348	155.8
580.765	172.79
581.182	201.91
581.599	153.37
582.016	148.52
582.433	165.51
582.849	228.61
583.266	221.33
583.683	138.81
584.099	160.65
584.516	163.08
584.933	209.2
585.349	163.08
585.765	160.65
586.182	148.52
586.598	177.64
587.014	189.78
587.431	155.8
587.847	175.22
588.263	165.51
588.679	119.39
589.095	131.53
589.511	170.36
589.927	197.06
590.343	201.91
590.759	136.38
591.174	146.09
591.59	158.22
592.006	163.08
592.421	170.36
592.837	177.64
593.252	226.19
593.668	184.92
594.083	170.36
594.499	189.78
594.914	165.51
595.329	184.92
595.745	184.92
596.16	223.76
596.575	192.21
596.99	177.64
597.405	143.66
597.82	204.34
598.235	180.07
598.65	192.21
599.065	158.22
599.479	201.91
599.894	187.35
600.309	197.06
600.724	158.22
601.138	146.09
601.553	148.52
601.967	189.78
602.382	180.07
602.796	182.5
603.21	167.93
603.625	209.2
604.039	177.64
604.453	197.06
604.867	206.77
605.281	182.5
605.695	160.65
606.109	187.35
606.523	146.09
606.937	187.35
607.351	284.44
607.765	163.08
608.178	131.53
608.592	126.67
609.006	114.53
609.419	180.07
609.833	252.89
610.246	197.06
610.66	138.81
611.073	121.82
611.487	221.33
611.9	211.62
612.313	204.34
612.726	231.04
613.139	172.79
613.553	197.06
613.966	243.18
614.379	170.36
614.792	192.21
615.204	153.37
615.617	148.52
616.03	95.12
616.443	201.91
616.856	192.21
617.268	138.81
617.681	126.67
618.093	146.09
618.506	136.38
618.918	214.05
619.331	133.95
619.743	170.36
620.155	90.26
620.568	248.03
620.98	197.06
621.392	206.77
621.804	260.17
622.216	221.33
622.628	85.41
623.04	119.39
623.452	184.92
623.864	107.25
624.276	158.22
624.687	201.91
625.099	240.75
625.511	187.35
625.922	315.99
626.334	141.23
626.745	155.8
627.157	136.38
627.568	136.38
627.979	150.94
628.391	197.06
628.802	133.95
629.213	214.05
629.624	182.5
630.035	102.4
630.446	133.95
630.857	175.22
631.268	189.78
631.679	129.1
632.09	218.91
632.501	158.22
632.912	160.65
633.322	155.8
633.733	131.53
634.144	121.82
634.554	182.5
634.965	192.21
635.375	228.61
635.785	82.98
636.196	158.22
636.606	172.79
637.016	87.84
637.427	163.08
637.837	160.65
638.247	146.09
638.657	116.96
639.067	182.5
639.477	180.07
639.887	231.04
640.297	163.08
640.706	170.36
641.116	160.65
641.526	124.24
641.935	109.68
642.345	167.93
642.755	143.66
643.164	158.22
643.573	206.77
643.983	148.52
644.392	158.22
644.801	158.22
645.211	150.94
645.62	148.52
646.029	158.22
646.438	146.09
646.847	184.92
647.256	221.33
647.665	167.93
648.074	141.23
648.483	167.93
648.892	201.91
649.3	201.91
649.709	216.48
650.118	116.96
650.526	175.22
650.935	155.8
651.343	133.95
651.752	252.89
652.16	216.48
652.568	180.07
652.977	133.95
653.385	257.74
653.793	153.37
654.201	192.21
654.609	136.38
655.017	160.65
655.425	141.23
655.833	180.07
656.241	119.39
656.649	177.64
657.057	97.54
657.464	180.07
657.872	233.47
658.28	133.95
658.687	133.95
659.095	150.94
659.502	175.22
659.91	201.91
660.317	197.06
660.724	231.04
661.132	182.5
661.539	187.35
661.946	155.8
662.353	175.22
662.76	104.83
663.167	201.91
663.574	223.76
663.981	206.77
664.388	121.82
664.795	95.12
665.202	102.4
665.608	199.49
666.015	199.49
666.422	163.08
666.828	129.1
667.235	146.09
667.641	201.91
668.047	199.49
668.454	131.53
668.86	180.07
669.266	155.8
669.673	177.64
670.079	129.1
670.485	177.64
670.891	192.21
671.297	160.65
671.703	170.36
672.109	107.25
672.515	150.94
672.92	90.26
673.326	197.06
673.732	192.21
674.138	187.35
674.543	131.53
674.949	184.92
675.354	165.51
675.76	221.33
676.165	163.08
676.57	155.8
676.976	158.22
677.381	172.79
677.786	182.5
678.191	197.06
678.596	177.64
679.001	116.96
679.406	141.23
679.811	201.91
680.216	182.5
680.621	226.19
681.026	175.22
681.43	90.26
681.835	201.91
682.24	167.93
682.644	172.79
683.049	204.34
683.453	150.94
683.858	226.19
684.262	199.49
684.667	214.05
685.071	226.19
685.475	172.79
685.879	167.93
686.283	216.48
686.687	199.49
687.091	180.07
687.495	189.78
687.899	192.21
688.303	129.1
688.707	160.65
689.111	119.39
689.514	197.06
689.918	131.53
690.322	126.67
690.725	187.35
691.129	180.07
691.532	240.75
691.936	175.22
692.339	218.91
692.742	167.93
693.146	170.36
693.549	155.8
693.952	204.34
694.355	233.47
694.758	218.91
695.161	199.49
695.564	170.36
695.967	155.8
696.37	175.22
696.773	136.38
697.175	194.63
697.578	206.77
697.981	170.36
698.383	218.91
698.786	141.23
699.188	150.94
699.591	204.34
699.993	192.21
700.395	150.94
700.798	119.39
701.2	165.51
701.602	170.36
702.004	189.78
702.406	158.22
702.808	153.37
703.21	187.35
703.612	138.81
704.014	146.09
704.416	184.92
704.818	184.92
705.219	177.64
705.621	180.07
706.023	172.79
706.424	199.49
706.826	221.33
707.227	180.07
707.629	126.67
708.03	167.93
708.431	184.92
708.832	172.79
709.234	116.96
709.635	199.49
710.036	189.78
710.437	170.36
710.838	165.51
711.239	163.08
711.64	282.01
712.041	180.07
712.441	211.62
712.842	170.36
713.243	209.2
713.643	250.46
714.044	243.18
714.445	211.62
714.845	189.78
715.246	184.92
715.646	175.22
716.046	235.9
716.447	170.36
716.847	201.91
717.247	209.2
717.647	238.32
718.047	221.33
718.447	294.15
718.847	175.22
719.247	240.75
719.647	204.34
720.047	206.77
720.446	296.58
720.846	199.49
721.246	228.61
721.645	192.21
722.045	201.91
722.444	250.46
722.844	257.74
723.243	291.72
723.643	277.16
724.042	318.42
724.441	250.46
724.84	342.69
725.24	294.15
725.639	328.13
726.038	306.29
726.437	265.02
726.836	354.83
727.234	332.98
727.633	260.17
728.032	330.56
728.431	366.97
728.83	376.67
729.228	422.79
729.627	413.08
730.025	451.92
730.424	391.24
730.822	515.03
731.22	629.11
731.619	517.45
732.017	551.43
732.415	711.63
732.813	672.8
733.212	837.85
733.61	866.97
734.008	816
734.406	888.82
734.803	1019.89
735.201	993.19
735.599	1240.77
735.997	1291.74
736.395	1323.29
736.792	1473.78
737.19	1604.85
737.587	1701.94
737.985	1646.11
738.382	1706.79
738.78	1934.95
739.177	2053.89
739.574	2002.91
739.971	2175.25
740.369	2352.43
740.766	2488.36
741.163	2444.67
741.56	2476.22
741.957	2675.25
742.354	2820.89
742.751	2891.28
743.147	2976.23
743.544	2910.69
743.941	3274.78
744.338	3403.42
744.734	3541.77
745.131	3609.73
745.527	3978.67
745.924	4597.61
746.32	4561.21
746.716	4711.69
747.113	5194.71
747.509	5549.09
747.905	5862.2
748.301	6126.76
748.697	6357.35
749.093	7141.34
749.489	7359.79
749.885	7311.25
750.281	7503
750.677	8032.13
751.073	8986.03
751.468	8699.62
751.864	8830.69
752.26	8990.89
752.655	9942.36
753.051	10199.64
753.446	10192.36
753.842	10537.03
754.237	11444.81
754.632	11573.45
755.028	11248.2
755.423	11109.85
755.818	11760.35
756.213	12114.72
756.608	11685.1
757.003	11313.74
757.398	11821.03
757.793	12226.37
758.188	12134.14
758.583	11956.95
758.977	12503.08
759.372	13558.92
759.767	14165.72
760.161	13998.25
760.556	15791.96
760.95	17556.55
761.345	17864.81
761.739	17219.17
762.133	18073.55
762.527	20328.44
762.922	20224.07
763.316	19796.88
763.71	21437.68
764.104	22617.31
764.498	23219.26
764.892	22804.21
765.286	22721.68
765.68	25080.94
766.073	26347.95
766.467	25321.24
766.861	25539.69
767.255	28148.95
767.648	30100.44
768.042	29707.23
768.435	30182.96
768.829	31124.73
769.222	32724.27
769.615	32896.6
770.008	30673.26
770.402	31879.59
770.795	33527.68
771.188	33241.26
771.581	31238.81
771.974	31539.78
772.367	32612.61
772.76	32042.22
773.153	30134.42
773.545	30648.99
773.938	31367.45
774.331	31073.75
774.724	30590.74
775.116	32607.76
775.509	35515.57
775.901	36525.3
776.294	36612.68
776.686	37078.7
777.078	39673.4
777.471	39719.52
777.863	39263.2
778.255	41855.48
778.647	44945.33
779.039	44535.13
779.431	43098.21
779.823	43107.92
780.215	46183.21
780.607	45064.26
780.999	44401.63
781.39	43935.6
781.782	46486.62
782.174	47268.18
782.565	46100.69
782.957	46314.28
783.348	47904.11
783.74	47508.48
784.131	45760.88
784.522	46459.92
784.914	46828.85
785.305	45287.57
785.696	43462.3
786.087	42816.66
786.478	43445.31
786.869	41561.78
787.26	38035.03
787.651	37935.51
788.042	37661.24
788.433	36270.44
788.823	32753.39
789.214	32966.99
789.605	32129.6
789.995	30496.08
790.386	28903.82
790.776	30248.5
791.167	30496.08
791.557	29920.82
791.948	29355.28
792.338	30185.39
792.728	32619.89
793.118	33542.24
793.508	32928.15
793.898	33721.85
794.288	34168.46
794.678	33801.95
795.068	32792.23
795.458	33187.86
795.848	34292.25
796.238	33333.5
796.627	32328.63
797.017	32578.63
797.406	34119.92
797.796	33149.03
798.185	32384.45
798.575	34209.73
798.964	34624.78
799.354	34780.12
799.743	34226.72
800.132	35321.39
800.521	35702.47
800.91	34751
801.299	33896.61
801.688	35639.36
802.077	34959.74
802.466	34068.95
802.855	33942.73
803.244	33471.85
803.633	33129.61
804.021	32076.2
804.41	31309.19
804.799	31702.4
805.187	30559.18
805.576	28457.21
805.964	27719.33
806.352	27624.67
806.741	27165.93
807.129	25428.04
807.517	25352.79
807.905	25600.37
808.293	25056.67
808.681	24529.96
809.069	25267.84
809.457	27622.24
809.845	27452.34
810.233	27255.73
810.621	28852.85
811.009	29520.33
811.396	28726.63
811.784	27881.96
812.171	28187.79
812.559	28326.14
812.946	27498.46
813.334	27255.73
813.721	27316.41
814.108	26347.95
814.496	25828.53
814.883	25988.72
815.27	26925.63
815.657	27413.5
816.044	26695.05
816.431	26289.7
816.818	26792.13
817.205	25889.21
817.592	25590.66
817.979	25321.24
818.365	25719.3
818.752	24991.14
819.139	23809.08
819.525	23578.49
819.912	23690.14
820.298	22762.95
820.685	21500.79
821.071	21500.79
821.457	20964.37
821.843	19629.4
822.23	18568.71
822.616	17925.49
823.002	16889.07
823.388	15602.64
823.774	14517.67
824.16	14461.85
824.546	14209.41
824.931	13418.14
825.317	13005.51
825.703	13520.08
826.089	13488.53
826.474	12816.19
826.86	12660.85
827.245	12670.56
827.631	12563.76
828.016	12389
828.401	12236.08
828.787	12177.83
829.172	11578.31
829.557	11063.73
829.942	10947.23
830.327	10721.5
830.712	10330.71
831.097	9842.84
831.482	9915.66
831.867	10015.17
832.252	9236.04
832.636	9238.46
833.021	9335.55
833.406	9371.96
833.79	9151.08
834.175	8481.17
834.559	8624.38
834.944	8228.74
835.328	7852.52
835.713	7597.66
836.097	7777.28
836.481	7408.34
836.865	7085.52
837.249	6884.06
837.633	6714.15
838.017	6342.79
838.401	5930.16
838.785	5675.3
839.169	5374.33
839.553	5126.75
839.937	4854.9
840.32	4738.39
840.704	4607.32
841.087	4282.08
841.471	4148.58
841.854	4022.36
842.238	3842.75
842.621	3609.73
843.004	3483.52
843.388	3466.53
843.771	3507.79
844.154	3415.56
844.537	3444.68
844.92	3347.59
845.303	3507.79
845.686	3223.81
846.069	3337.89
846.452	3301.48
846.834	3238.37
847.217	2937.39
847.6	2939.82
847.982	2816.03
848.365	2898.56
848.748	2886.42
849.13	2888.85
849.512	2701.95
849.895	2697.1
850.277	2587.87
850.659	2604.86
851.041	2706.81
851.423	2551.47
851.806	2532.05
852.188	2575.74
852.57	2439.81
852.951	2541.76
853.333	2434.96
853.715	2398.55
854.097	2362.14
854.479	2146.12
854.86	2075.73
855.242	1864.56
855.623	1968.93
856.005	1869.42
856.386	1993.2
856.768	1735.92
857.149	1701.94
857.53	1616.99
857.911	1570.87
858.292	1556.3
858.674	1391.25
859.055	1250.47
859.436	1272.32
859.817	1250.47
860.197	1218.92
860.578	1053.87
860.959	1027.17
861.34	1034.45
861.72	978.63
862.101	1095.13
862.482	983.48
862.862	879.11
863.243	847.56
863.623	845.13
864.003	789.3
864.384	866.97
864.764	738.33
865.144	813.57
865.524	726.19
865.904	697.07
866.284	728.62
866.664	646.1
867.044	609.69
867.424	609.69
867.804	590.27
868.183	624.25
868.563	665.51
868.943	609.69
869.322	519.88
869.702	532.02
870.081	568.43
870.461	517.45
870.84	527.16
871.22	510.17
871.599	451.92
871.978	473.76
872.357	396.09
872.736	478.62
873.115	398.52
873.494	371.82
873.873	413.08
874.252	408.23
874.631	332.98
875.01	345.12
875.388	396.09
875.767	235.9
876.146	340.27
876.524	296.58
876.903	299
877.281	328.13
877.66	296.58
878.038	286.87
878.416	286.87
878.794	272.3
879.173	238.32
879.551	260.17
879.929	177.64
880.307	218.91
880.685	233.47
881.063	197.06
881.441	211.62
881.818	199.49
882.196	209.2
882.574	214.05
882.951	233.47
883.329	143.66
883.707	204.34
884.084	155.8
884.461	177.64
884.839	158.22
885.216	248.03
885.593	182.5
885.971	250.46
886.348	167.93
886.725	163.08
887.102	250.46
887.479	150.94
887.856	199.49
888.233	214.05
888.609	124.24
888.986	223.76
889.363	187.35
889.74	279.59
890.116	175.22
890.493	160.65
890.869	199.49
891.246	143.66
891.622	192.21
891.998	150.94
892.375	136.38
892.751	228.61
893.127	192.21
893.503	155.8
893.879	75.7
894.255	131.53
894.631	248.03
895.007	131.53
895.383	197.06
895.759	97.54
896.134	143.66
896.51	129.1
896.886	133.95
897.261	126.67
897.637	160.65
898.012	228.61
898.388	194.63
898.763	112.11
899.138	153.37
899.514	133.95
899.889	163.08
900.264	199.49
900.639	250.46
901.014	153.37
901.389	170.36
901.764	177.64
902.139	143.66
902.513	124.24
902.888	143.66
903.263	129.1
903.638	146.09
904.012	155.8
904.387	85.41
904.761	129.1
905.136	197.06
905.51	182.5
905.884	175.22
906.259	155.8
906.633	163.08
907.007	170.36
907.381	116.96
907.755	104.83
908.129	216.48
908.503	150.94
908.877	133.95
909.251	211.62
909.624	206.77
909.998	129.1
910.372	216.48
910.745	141.23
911.119	63.56
911.492	121.82
911.866	126.67
912.239	138.81
912.612	131.53
912.986	146.09
913.359	187.35
913.732	129.1
914.105	170.36
914.478	126.67
914.851	126.67
915.224	141.23
915.597	65.99
915.97	104.83
916.343	160.65
916.715	146.09
917.088	19.87
917.461	199.49
917.833	194.63
918.206	119.39
918.578	177.64
918.951	165.51
919.323	121.82
919.695	182.5
920.067	126.67
920.44	163.08
920.812	150.94
921.184	138.81
921.556	150.94
921.928	177.64
922.3	70.84
922.672	197.06
923.043	143.66
923.415	211.62
923.787	175.22
924.158	114.53
924.53	216.48
924.901	197.06
925.273	143.66
925.644	82.98
926.016	143.66
926.387	180.07
926.758	109.68
927.129	165.51
927.5	133.95
927.872	143.66
928.243	177.64
928.613	92.69
928.984	107.25
929.355	187.35
929.726	114.53
930.097	158.22
930.467	194.63
930.838	116.96
931.209	131.53
931.579	167.93
931.95	116.96
932.32	97.54
932.69	138.81
933.061	153.37
933.431	160.65
933.801	87.84
934.171	148.52
934.541	146.09
934.911	170.36
935.281	143.66
935.651	136.38
936.021	143.66
936.391	138.81
936.761	97.54
937.13	126.67
937.5	133.95
937.87	129.1
938.239	121.82
938.609	119.39
938.978	126.67
939.347	153.37
939.717	187.35
940.086	107.25
940.455	90.26
940.824	148.52
941.193	163.08
941.562	153.37
941.931	107.25
942.3	201.91
942.669	129.1
943.038	165.51
943.407	175.22
943.775	165.51
944.144	177.64
944.513	148.52
944.881	187.35
945.25	199.49
945.618	143.66
945.986	252.89
946.355	187.35
946.723	129.1
947.091	121.82
947.459	126.67
947.827	131.53
948.195	194.63
948.563	116.96
948.931	189.78
949.299	121.82
949.667	158.22
950.035	133.95
950.402	141.23
950.77	175.22
951.138	160.65
951.505	121.82
951.873	155.8
952.24	124.24
952.607	99.97
952.975	63.56
953.342	141.23
953.709	107.25
954.076	150.94
954.443	167.93
954.81	124.24
955.177	209.2
955.544	141.23
955.911	107.25
956.278	180.07
956.645	177.64
957.012	146.09
957.378	199.49
957.745	129.1
958.111	104.83
958.478	141.23
958.844	177.64
959.211	192.21
959.577	136.38
959.943	158.22
960.309	231.04
960.675	226.19
961.042	124.24
961.408	131.53
961.774	177.64
962.139	126.67
962.505	136.38
962.871	119.39
963.237	102.4
963.603	184.92
963.968	121.82
964.334	167.93
964.699	138.81
965.065	133.95
965.43	121.82
965.796	218.91
966.161	160.65
966.526	163.08
966.891	150.94
967.256	65.99
967.622	165.51
967.987	182.5
968.352	116.96
968.716	153.37
969.081	160.65
969.446	82.98
969.811	146.09
970.176	95.12
970.54	163.08
970.905	153.37
971.269	172.79
971.634	129.1
971.998	136.38
972.363	136.38
972.727	170.36
973.091	211.62
973.455	172.79
973.819	73.27
974.183	133.95
974.547	131.53
974.911	109.68
975.275	221.33
975.639	187.35
976.003	102.4
976.367	153.37
976.73	231.04
977.094	114.53
977.458	192.21
977.821	119.39
978.185	167.93
978.548	155.8
978.911	143.66
979.275	153.37
979.638	177.64
980.001	133.95
980.364	141.23
980.727	136.38
981.09	129.1
981.453	136.38
981.816	170.36
982.179	184.92
982.542	192.21
982.905	99.97
983.267	189.78
983.63	184.92
983.992	136.38
984.355	167.93
984.717	167.93
985.08	124.24
985.442	187.35
985.804	129.1
986.167	138.81
986.529	133.95
986.891	126.67
987.253	177.64
987.615	201.91
987.977	102.4
988.339	124.24
988.701	80.55
989.062	129.1
989.424	109.68
989.786	160.65
990.147	95.12
990.509	116.96
990.87	126.67
991.232	148.52
991.593	133.95
991.955	141.23
992.316	245.6
992.677	192.21
993.038	175.22
993.399	177.64
993.76	153.37
994.121	172.79
994.482	177.64
994.843	133.95
995.204	136.38
995.565	141.23
995.926	204.34
996.286	170.36
996.647	131.53
997.007	143.66
997.368	160.65
997.728	204.34
998.089	112.11
998.449	102.4
998.809	102.4
999.169	177.64
999.53	146.09
999.89	175.22
1000.25	104.83
1000.61	165.51
1000.97	119.39
1001.329	148.52
1001.689	121.82
1002.049	124.24
1002.409	163.08
1002.768	97.54
1003.128	163.08
1003.487	97.54
1003.847	136.38
1004.206	133.95
1004.566	141.23
1004.925	114.53
1005.284	124.24
1005.643	155.8
1006.003	119.39
1006.362	221.33
1006.721	182.5
1007.08	177.64
1007.438	107.25
1007.797	187.35
1008.156	85.41
1008.515	172.79
1008.874	124.24
1009.232	141.23
1009.591	167.93
1009.949	172.79
1010.308	192.21
1010.666	163.08
1011.024	177.64
1011.383	209.2
1011.741	114.53
1012.099	121.82
1012.457	51.43
1012.815	73.27
1013.173	97.54
1013.531	138.81
1013.889	121.82
1014.247	126.67
1014.605	163.08
1014.962	172.79
1015.32	153.37
1015.678	104.83
1016.035	187.35
1016.393	163.08
1016.75	175.22
1017.107	85.41
1017.465	124.24
1017.822	136.38
1018.179	177.64
1018.536	155.8
1018.894	129.1
1019.251	131.53
1019.608	160.65
1019.964	153.37
1020.321	165.51
1020.678	204.34
1021.035	138.81
1021.392	192.21
1021.748	138.81
1022.105	150.94
1022.461	102.4
1022.818	143.66
1023.174	90.26
1023.531	136.38
1023.887	104.83
1024.243	170.36
1024.599	136.38
1024.955	197.06
1025.311	53.85
1025.667	95.12
1026.023	150.94
1026.379	121.82
1026.735	129.1
1027.091	209.2
1027.447	167.93
