189.514	51.58
189.973	51.58
190.431	51.58
190.889	-1.82
191.348	10.32
191.806	51.58
192.264	-1.82
192.722	-52.79
193.18	-28.52
193.638	-11.53
194.096	10.32
194.554	-33.37
195.012	24.88
195.47	44.3
195.928	44.3
196.385	7.89
196.843	15.17
197.301	-6.67
197.758	17.6
198.216	32.16
198.674	-62.5
199.131	0.61
199.589	121.97
200.046	51.58
200.503	92.84
200.961	155.95
201.418	155.95
201.875	138.96
202.332	158.38
202.79	100.12
203.247	97.7
203.704	102.55
204.161	129.25
204.618	151.09
205.075	197.21
205.532	177.79
205.989	129.25
206.445	121.97
206.902	138.96
207.359	194.78
207.816	194.78
208.272	211.78
208.729	182.65
209.185	153.52
209.642	206.92
210.098	155.95
210.555	163.23
211.011	170.51
211.467	146.24
211.924	143.81
212.38	177.79
212.836	102.55
213.292	134.1
213.748	231.19
214.204	112.26
214.66	187.5
215.116	165.66
215.572	180.22
216.028	214.2
216.484	165.66
216.94	199.64
217.396	102.55
217.851	260.32
218.307	78.28
218.763	175.37
219.218	172.94
219.674	119.54
220.129	141.39
220.585	158.38
221.04	185.08
221.496	153.52
221.951	223.91
222.406	153.52
222.861	185.08
223.317	131.68
223.772	155.95
224.227	126.82
224.682	194.78
225.137	185.08
225.592	189.93
226.047	109.83
226.502	146.24
226.957	121.97
227.411	180.22
227.866	187.5
228.321	146.24
228.776	126.82
229.23	131.68
229.685	158.38
230.139	138.96
230.594	192.36
231.048	168.09
231.503	223.91
231.957	121.97
232.411	165.66
232.865	185.08
233.32	199.64
233.774	129.25
234.228	92.84
234.682	151.09
235.136	151.09
235.59	219.06
236.044	146.24
236.498	170.51
236.952	134.1
237.406	180.22
237.86	180.22
238.313	199.64
238.767	238.47
239.221	146.24
239.674	187.5
240.128	112.26
240.581	129.25
241.035	177.79
241.488	155.95
241.942	158.38
242.395	219.06
242.848	160.8
243.301	182.65
243.755	136.53
244.208	209.35
244.661	257.89
245.114	168.09
245.567	126.82
246.02	146.24
246.473	170.51
246.926	180.22
247.379	172.94
247.832	172.94
248.284	112.26
248.737	209.35
249.19	180.22
249.642	136.53
250.095	192.36
250.547	172.94
251	170.51
251.452	163.23
251.905	182.65
252.357	163.23
252.81	121.97
253.262	136.53
253.714	119.54
254.166	180.22
254.618	124.4
255.07	211.78
255.523	129.25
255.975	143.81
256.427	240.9
256.878	109.83
257.33	117.11
257.782	185.08
258.234	177.79
258.686	163.23
259.137	187.5
259.589	124.4
260.041	177.79
260.492	155.95
260.944	141.39
261.395	180.22
261.847	172.94
262.298	189.93
262.749	185.08
263.201	177.79
263.652	226.34
264.103	141.39
264.554	185.08
265.005	95.27
265.457	168.09
265.908	109.83
266.359	138.96
266.809	185.08
267.26	151.09
267.711	163.23
268.162	109.83
268.613	134.1
269.064	170.51
269.514	148.67
269.965	170.51
270.415	197.21
270.866	182.65
271.316	219.06
271.767	185.08
272.217	204.49
272.668	236.05
273.118	170.51
273.568	219.06
274.019	180.22
274.469	214.2
274.919	182.65
275.369	163.23
275.819	134.1
276.269	163.23
276.719	185.08
277.169	187.5
277.619	138.96
278.069	92.84
278.518	124.4
278.968	192.36
279.418	192.36
279.867	189.93
280.317	180.22
280.767	192.36
281.216	180.22
281.666	163.23
282.115	214.2
282.564	172.94
283.014	155.95
283.463	209.35
283.912	117.11
284.361	146.24
284.811	136.53
285.26	165.66
285.709	221.48
286.158	192.36
286.607	194.78
287.056	197.21
287.505	121.97
287.953	187.5
288.402	189.93
288.851	134.1
289.3	175.37
289.748	131.68
290.197	192.36
290.646	117.11
291.094	219.06
291.543	172.94
291.991	117.11
292.439	182.65
292.888	172.94
293.336	155.95
293.784	160.8
294.233	143.81
294.681	221.48
295.129	158.38
295.577	194.78
296.025	160.8
296.473	155.95
296.921	172.94
297.369	129.25
297.817	129.25
298.264	238.47
298.712	189.93
299.16	204.49
299.608	129.25
300.055	163.23
300.503	177.79
300.95	153.52
301.398	168.09
301.845	114.69
302.293	185.08
302.74	172.94
303.187	109.83
303.635	187.5
304.082	160.8
304.529	131.68
304.976	206.92
305.423	151.09
305.87	153.52
306.317	155.95
306.764	197.21
307.211	107.4
307.658	180.22
308.105	126.82
308.552	121.97
308.998	117.11
309.445	202.07
309.892	160.8
310.338	146.24
310.785	100.12
311.231	138.96
311.678	175.37
312.124	202.07
312.571	294.3
313.017	109.83
313.463	155.95
313.909	168.09
314.356	245.76
314.802	214.2
315.248	209.35
315.694	194.78
316.14	141.39
316.586	80.71
317.032	163.23
317.478	146.24
317.923	138.96
318.369	194.78
318.815	187.5
319.261	170.51
319.706	146.24
320.152	136.53
320.597	104.98
321.043	146.24
321.488	187.5
321.934	131.68
322.379	202.07
322.824	182.65
323.27	165.66
323.715	129.25
324.16	209.35
324.605	151.09
325.05	175.37
325.495	153.52
325.94	199.64
326.385	155.95
326.83	138.96
327.275	199.64
327.72	177.79
328.165	202.07
328.61	168.09
329.054	209.35
329.499	219.06
329.943	153.52
330.388	148.67
330.832	160.8
331.277	182.65
331.721	202.07
332.166	185.08
332.61	194.78
333.054	163.23
333.499	136.53
333.943	68.57
334.387	172.94
334.831	262.75
335.275	192.36
335.719	170.51
336.163	180.22
336.607	172.94
337.051	175.37
337.495	197.21
337.938	187.5
338.382	172.94
338.826	180.22
339.269	187.5
339.713	117.11
340.157	117.11
340.6	245.76
341.044	138.96
341.487	124.4
341.93	180.22
342.374	146.24
342.817	148.67
343.26	158.38
343.703	180.22
344.146	138.96
344.59	189.93
345.033	170.51
345.476	129.25
345.919	119.54
346.361	170.51
346.804	216.63
347.247	168.09
347.69	148.67
348.133	194.78
348.575	180.22
349.018	231.19
349.461	168.09
349.903	187.5
350.346	143.81
350.788	223.91
351.23	172.94
351.673	163.23
352.115	114.69
352.557	134.1
353	185.08
353.442	170.51
353.884	163.23
354.326	177.79
354.768	238.47
355.21	146.24
355.652	206.92
356.094	172.94
356.536	172.94
356.978	175.37
357.419	214.2
357.861	73.42
358.303	138.96
358.744	187.5
359.186	146.24
359.627	197.21
360.069	194.78
360.51	160.8
360.952	192.36
361.393	253.04
361.834	153.52
362.276	187.5
362.717	153.52
363.158	216.63
363.599	168.09
364.04	141.39
364.481	148.67
364.922	172.94
365.363	129.25
365.804	233.62
366.245	109.83
366.686	187.5
367.126	185.08
367.567	194.78
368.008	163.23
368.448	211.78
368.889	134.1
369.33	180.22
369.77	214.2
370.21	136.53
370.651	175.37
371.091	182.65
371.531	199.64
371.972	121.97
372.412	80.71
372.852	182.65
373.292	141.39
373.732	136.53
374.172	172.94
374.612	216.63
375.052	233.62
375.492	146.24
375.932	136.53
376.372	160.8
376.811	199.64
377.251	134.1
377.691	175.37
378.13	158.38
378.57	206.92
379.009	204.49
379.449	151.09
379.888	155.95
380.328	182.65
380.767	168.09
381.206	182.65
381.645	129.25
382.085	146.24
382.524	138.96
382.963	233.62
383.402	177.79
383.841	189.93
384.28	100.12
384.719	192.36
385.158	189.93
385.596	153.52
386.035	158.38
386.474	138.96
386.913	153.52
387.351	148.67
387.79	114.69
388.228	141.39
388.667	87.99
389.105	228.77
389.544	143.81
389.982	102.55
390.42	114.69
390.859	126.82
391.297	175.37
391.735	219.06
392.173	219.06
392.611	143.81
393.049	148.67
393.487	151.09
393.925	170.51
394.363	185.08
394.801	209.35
395.239	97.7
395.676	219.06
396.114	180.22
396.552	175.37
396.989	165.66
397.427	131.68
397.864	177.79
398.302	119.54
398.739	182.65
399.177	143.81
399.614	141.39
400.051	238.47
400.488	163.23
400.926	121.97
401.363	228.77
401.8	170.51
402.237	202.07
402.674	170.51
403.111	155.95
403.548	160.8
403.985	187.5
404.421	189.93
404.858	233.62
405.295	175.37
405.732	194.78
406.168	163.23
406.605	209.35
407.041	170.51
407.478	182.65
407.914	160.8
408.351	129.25
408.787	219.06
409.223	163.23
409.66	199.64
410.096	175.37
410.532	117.11
410.968	134.1
411.404	155.95
411.84	134.1
412.276	265.17
412.712	163.23
413.148	206.92
413.584	109.83
414.02	131.68
414.455	192.36
414.891	155.95
415.327	141.39
415.762	165.66
416.198	209.35
416.633	143.81
417.069	182.65
417.504	129.25
417.94	160.8
418.375	168.09
418.81	243.33
419.245	141.39
419.681	112.26
420.116	155.95
420.551	124.4
420.986	163.23
421.421	216.63
421.856	129.25
422.291	117.11
422.726	148.67
423.16	187.5
423.595	119.54
424.03	151.09
424.464	141.39
424.899	209.35
425.334	231.19
425.768	180.22
426.203	194.78
426.637	223.91
427.071	170.51
427.506	211.78
427.94	104.98
428.374	182.65
428.809	141.39
429.243	199.64
429.677	136.53
430.111	236.05
430.545	202.07
430.979	192.36
431.413	148.67
431.847	192.36
432.28	129.25
432.714	168.09
433.148	180.22
433.582	112.26
434.015	148.67
434.449	146.24
434.882	228.77
435.316	211.78
435.749	214.2
436.183	170.51
436.616	117.11
437.049	168.09
437.483	175.37
437.916	197.21
438.349	214.2
438.782	141.39
439.215	189.93
439.648	221.48
440.081	172.94
440.514	185.08
440.947	240.9
441.38	272.46
441.813	158.38
442.245	267.6
442.678	189.93
443.111	214.2
443.543	209.35
443.976	238.47
444.408	231.19
444.841	243.33
445.273	226.34
445.705	238.47
446.138	238.47
446.57	180.22
447.002	228.77
447.434	223.91
447.867	168.09
448.299	143.81
448.731	236.05
449.163	272.46
449.595	124.4
450.026	255.47
450.458	240.9
450.89	260.32
451.322	248.18
451.754	240.9
452.185	257.89
452.617	204.49
453.048	236.05
453.48	240.9
453.911	206.92
454.343	255.47
454.774	185.08
455.205	253.04
455.637	245.76
456.068	274.88
456.499	236.05
456.93	274.88
457.361	175.37
457.792	211.78
458.223	274.88
458.654	267.6
459.085	245.76
459.516	291.87
459.947	223.91
460.378	228.77
460.808	245.76
461.239	243.33
461.669	257.89
462.1	248.18
462.531	253.04
462.961	236.05
463.391	231.19
463.822	248.18
464.252	231.19
464.682	231.19
465.113	240.9
465.543	221.48
465.973	301.58
466.403	197.21
466.833	248.18
467.263	214.2
467.693	211.78
468.123	231.19
468.553	216.63
468.983	223.91
469.412	168.09
469.842	211.78
470.272	211.78
470.701	187.5
471.131	260.32
471.56	262.75
471.99	236.05
472.419	226.34
472.849	272.46
473.278	192.36
473.707	192.36
474.136	226.34
474.566	204.49
474.995	182.65
475.424	257.89
475.853	202.07
476.282	192.36
476.711	172.94
477.14	240.9
477.569	253.04
477.997	155.95
478.426	253.04
478.855	189.93
479.283	236.05
479.712	209.35
480.141	282.16
480.569	148.67
480.998	153.52
481.426	228.77
481.854	250.61
482.283	211.78
482.711	240.9
483.139	221.48
483.567	197.21
483.995	238.47
484.424	206.92
484.852	194.78
485.28	141.39
485.708	231.19
486.135	214.2
486.563	223.91
486.991	92.84
487.419	209.35
487.847	255.47
488.274	209.35
488.702	165.66
489.129	121.97
489.557	180.22
489.984	223.91
490.412	129.25
490.839	189.93
491.266	177.79
491.694	206.92
492.121	274.88
492.548	168.09
492.975	202.07
493.402	202.07
493.829	136.53
494.256	170.51
494.683	158.38
495.11	245.76
495.537	240.9
495.964	187.5
496.39	243.33
496.817	136.53
497.244	243.33
497.67	151.09
498.097	170.51
498.523	175.37
498.95	170.51
499.376	177.79
499.803	85.56
500.229	163.23
500.655	177.79
501.081	168.09
501.508	250.61
501.934	168.09
502.36	214.2
502.786	124.4
503.212	194.78
503.638	180.22
504.064	170.51
504.489	187.5
504.915	202.07
505.341	153.52
505.767	209.35
506.192	175.37
506.618	194.78
507.043	202.07
507.469	185.08
507.894	211.78
508.32	192.36
508.745	182.65
509.17	192.36
509.596	104.98
510.021	170.51
510.446	163.23
510.871	228.77
511.296	126.82
511.721	180.22
512.146	129.25
512.571	141.39
512.996	211.78
513.421	240.9
513.845	170.51
514.27	165.66
514.695	175.37
515.119	216.63
515.544	214.2
515.969	211.78
516.393	160.8
516.817	255.47
517.242	240.9
517.666	248.18
518.09	117.11
518.515	197.21
518.939	134.1
519.363	379.25
519.787	175.37
520.211	211.78
520.635	238.47
521.059	216.63
521.483	160.8
521.907	209.35
522.331	170.51
522.754	189.93
523.178	214.2
523.602	248.18
524.025	255.47
524.449	257.89
524.872	185.08
525.296	221.48
525.719	199.64
526.143	182.65
526.566	189.93
526.989	175.37
527.412	238.47
527.836	129.25
528.259	194.78
528.682	197.21
529.105	177.79
529.528	134.1
529.951	202.07
530.374	180.22
530.796	260.32
531.219	175.37
531.642	112.26
532.065	141.39
532.487	163.23
532.91	238.47
533.332	248.18
533.755	202.07
534.177	136.53
534.6	277.31
535.022	238.47
535.444	219.06
535.867	146.24
536.289	211.78
536.711	299.16
537.133	194.78
537.555	223.91
537.977	223.91
538.399	228.77
538.821	250.61
539.243	172.94
539.665	226.34
540.086	189.93
540.508	202.07
540.93	172.94
541.351	228.77
541.773	226.34
542.195	199.64
542.616	272.46
543.037	214.2
543.459	197.21
543.88	187.5
544.301	163.23
544.723	270.03
545.144	199.64
545.565	262.75
545.986	211.78
546.407	216.63
546.828	209.35
547.249	163.23
547.67	211.78
548.091	209.35
548.512	151.09
548.932	262.75
549.353	168.09
549.774	202.07
550.194	194.78
550.615	197.21
551.035	189.93
551.456	209.35
551.876	153.52
552.296	211.78
552.717	211.78
553.137	160.8
553.557	126.82
553.977	197.21
554.397	165.66
554.817	182.65
555.237	231.19
555.657	267.6
556.077	136.53
556.497	233.62
556.917	153.52
557.337	175.37
557.756	211.78
558.176	177.79
558.596	163.23
559.015	206.92
559.435	151.09
559.854	187.5
560.274	158.38
560.693	180.22
561.112	240.9
561.532	219.06
561.951	248.18
562.37	211.78
562.789	168.09
563.208	240.9
563.627	170.51
564.046	194.78
564.465	236.05
564.884	189.93
565.303	194.78
565.722	175.37
566.14	211.78
566.559	160.8
566.978	177.79
567.396	209.35
567.815	160.8
568.233	214.2
568.652	270.03
569.07	233.62
569.489	158.38
569.907	243.33
570.325	221.48
570.743	219.06
571.161	209.35
571.58	177.79
571.998	136.53
572.416	182.65
572.833	219.06
573.251	233.62
573.669	197.21
574.087	158.38
574.505	131.68
574.922	236.05
575.34	180.22
575.758	180.22
576.175	199.64
576.593	199.64
577.01	168.09
577.428	219.06
577.845	1828.31
578.262	340.42
578.68	231.19
579.097	177.79
579.514	141.39
579.931	209.35
580.348	199.64
580.765	163.23
581.182	163.23
581.599	236.05
582.016	231.19
582.433	163.23
582.849	180.22
583.266	284.59
583.683	219.06
584.099	192.36
584.516	163.23
584.933	141.39
585.349	155.95
585.765	202.07
586.182	163.23
586.598	187.5
587.014	240.9
587.431	177.79
587.847	153.52
588.263	160.8
588.679	185.08
589.095	199.64
589.511	240.9
589.927	204.49
590.343	262.75
590.759	155.95
591.174	175.37
591.59	202.07
592.006	216.63
592.421	182.65
592.837	146.24
593.252	189.93
593.668	170.51
594.083	233.62
594.499	248.18
594.914	155.95
595.329	253.04
595.745	284.59
596.16	216.63
596.575	131.68
596.99	214.2
597.405	185.08
597.82	238.47
598.235	219.06
598.65	168.09
599.065	250.61
599.479	121.97
599.894	177.79
600.309	143.81
600.724	143.81
601.138	226.34
601.553	131.68
601.967	170.51
602.382	199.64
602.796	265.17
603.21	240.9
603.625	272.46
604.039	158.38
604.453	202.07
604.867	257.89
605.281	306.44
605.695	216.63
606.109	231.19
606.523	199.64
606.937	109.83
607.351	311.29
607.765	134.1
608.178	192.36
608.592	153.52
609.006	209.35
609.419	182.65
609.833	168.09
610.246	160.8
610.66	219.06
611.073	143.81
611.487	211.78
611.9	255.47
612.313	185.08
612.726	219.06
613.139	194.78
613.553	151.09
613.966	233.62
614.379	194.78
614.792	143.81
615.204	202.07
615.617	158.38
616.03	204.49
616.443	214.2
616.856	202.07
617.268	175.37
617.681	170.51
618.093	163.23
618.506	194.78
618.918	180.22
619.331	124.4
619.743	189.93
620.155	216.63
620.568	202.07
620.98	112.26
621.392	170.51
621.804	138.96
622.216	134.1
622.628	163.23
623.04	175.37
623.452	175.37
623.864	129.25
624.276	146.24
624.687	189.93
625.099	192.36
625.511	119.54
625.922	240.9
626.334	107.4
626.745	78.28
627.157	177.79
627.568	172.94
627.979	121.97
628.391	194.78
628.802	238.47
629.213	170.51
629.624	192.36
630.035	146.24
630.446	216.63
630.857	168.09
631.268	165.66
631.679	185.08
632.09	138.96
632.501	121.97
632.912	182.65
633.322	209.35
633.733	177.79
634.144	148.67
634.554	138.96
634.965	219.06
635.375	148.67
635.785	216.63
636.196	265.17
636.606	182.65
637.016	160.8
637.427	107.4
637.837	172.94
638.247	221.48
638.657	216.63
639.067	209.35
639.477	189.93
639.887	187.5
640.297	175.37
640.706	119.54
641.116	240.9
641.526	143.81
641.935	148.67
642.345	172.94
642.755	155.95
643.164	121.97
643.573	153.52
643.983	168.09
644.392	129.25
644.801	216.63
645.211	155.95
645.62	185.08
646.029	187.5
646.438	136.53
646.847	255.47
647.256	160.8
647.665	180.22
648.074	143.81
648.483	168.09
648.892	155.95
649.3	177.79
649.709	175.37
650.118	121.97
650.526	138.96
650.935	126.82
651.343	214.2
651.752	194.78
652.16	148.67
652.568	114.69
652.977	160.8
653.385	168.09
653.793	129.25
654.201	223.91
654.609	187.5
655.017	175.37
655.425	121.97
655.833	221.48
656.241	180.22
656.649	182.65
657.057	199.64
657.464	185.08
657.872	168.09
658.28	143.81
658.687	180.22
659.095	199.64
659.502	158.38
659.91	141.39
660.317	119.54
660.724	155.95
661.132	250.61
661.539	197.21
661.946	199.64
662.353	236.05
662.76	197.21
663.167	163.23
663.574	253.04
663.981	163.23
664.388	199.64
664.795	180.22
665.202	228.77
665.608	160.8
666.015	211.78
666.422	168.09
666.828	168.09
667.235	214.2
667.641	134.1
668.047	138.96
668.454	165.66
668.86	175.37
669.266	126.82
669.673	238.47
670.079	160.8
670.485	233.62
670.891	165.66
671.297	107.4
671.703	209.35
672.109	168.09
672.515	168.09
672.92	107.4
673.326	124.4
673.732	240.9
674.138	194.78
674.543	180.22
674.949	180.22
675.354	187.5
675.76	143.81
676.165	160.8
676.57	175.37
676.976	160.8
677.381	170.51
677.786	165.66
678.191	160.8
678.596	131.68
679.001	248.18
679.406	221.48
679.811	141.39
680.216	95.27
680.621	158.38
681.026	131.68
681.43	202.07
681.835	189.93
682.24	170.51
682.644	155.95
683.049	194.78
683.453	165.66
683.858	143.81
684.262	143.81
684.667	143.81
685.071	163.23
685.475	189.93
685.879	199.64
686.283	202.07
686.687	197.21
687.091	155.95
687.495	168.09
687.899	172.94
688.303	233.62
688.707	146.24
689.111	136.53
689.514	163.23
689.918	163.23
690.322	199.64
690.725	177.79
691.129	80.71
691.532	163.23
691.936	153.52
692.339	197.21
692.742	175.37
693.146	131.68
693.549	143.81
693.952	233.62
694.355	187.5
694.758	187.5
695.161	187.5
695.564	228.77
695.967	199.64
696.37	202.07
696.773	202.07
697.175	185.08
697.578	143.81
697.981	146.24
698.383	158.38
698.786	214.2
699.188	119.54
699.591	155.95
699.993	211.78
700.395	194.78
700.798	187.5
701.2	202.07
701.602	245.76
702.004	231.19
702.406	245.76
702.808	172.94
703.21	255.47
703.612	255.47
704.014	189.93
704.416	177.79
704.818	253.04
705.219	248.18
705.621	211.78
706.023	245.76
706.424	228.77
706.826	221.48
707.227	170.51
707.629	219.06
708.03	228.77
708.431	228.77
708.832	236.05
709.234	126.82
709.635	255.47
710.036	172.94
710.437	209.35
710.838	265.17
711.239	257.89
711.64	272.46
712.041	223.91
712.441	253.04
712.842	311.29
713.243	216.63
713.643	214.2
714.044	313.72
714.445	333.14
714.845	265.17
715.246	272.46
715.646	272.46
716.046	238.47
716.447	304.01
716.847	274.88
717.247	284.59
717.647	304.01
718.047	328.28
718.447	287.02
718.847	240.9
719.247	294.3
719.647	316.15
720.047	333.14
720.446	369.54
720.846	279.74
721.246	381.68
721.645	371.97
722.045	413.23
722.444	367.12
722.844	330.71
723.243	403.53
723.643	371.97
724.042	422.94
724.441	374.4
724.84	408.38
725.24	437.51
725.639	410.81
726.038	515.18
726.437	454.5
726.836	466.63
727.234	464.21
727.633	524.89
728.032	515.18
728.431	515.18
728.83	566.15
729.228	578.29
729.627	634.11
730.025	607.41
730.424	672.95
730.822	757.9
731.22	891.4
731.619	898.68
732.017	988.49
732.415	973.92
732.813	1054.02
733.212	1117.13
733.61	1206.94
734.008	1250.63
734.406	1427.81
734.803	1500.63
735.201	1588.01
735.599	1760.34
735.997	1884.13
736.395	2010.35
736.792	2138.99
737.19	2022.48
737.587	2146.27
737.985	2238.51
738.382	2515.21
738.78	2787.06
739.177	2804.05
739.574	2981.24
739.971	3117.16
740.369	3243.38
740.766	3398.72
741.163	3585.61
741.56	3680.28
741.957	3811.35
742.354	4017.66
742.751	4173
743.147	4401.16
743.544	4486.11
743.941	4617.18
744.338	4881.75
744.734	5180.3
745.131	5680.31
745.527	6107.5
745.924	6190.02
746.32	6277.4
746.716	6498.28
747.113	6818.67
747.509	7304.12
747.905	7573.54
748.301	8396.37
748.697	8716.76
749.093	9187.64
749.489	9241.04
749.885	9573.57
750.281	10015.33
750.677	10277.47
751.073	10772.62
751.468	11525.06
751.864	12736.24
752.26	12602.74
752.655	13187.71
753.051	13202.27
753.446	13573.63
753.842	13945
754.237	14241.12
754.632	14741.13
755.028	15750.85
755.423	16398.92
755.818	16789.7
756.213	17505.73
756.608	16813.98
757.003	16877.08
757.398	16641.64
757.793	16962.04
758.188	17345.54
758.583	18406.23
758.977	19379.55
759.372	20537.33
759.767	21326.18
760.161	21957.26
760.556	22236.39
760.95	22559.21
761.345	22641.74
761.739	23908.75
762.133	25124.78
762.527	27316.57
762.922	28622.41
763.316	30331.18
763.71	31212.26
764.104	31391.87
764.498	30925.85
764.892	30651.57
765.286	30634.58
765.68	30406.42
766.073	31644.3
766.467	33061.8
766.861	35309.41
767.255	37972.07
767.648	39241.51
768.042	40515.8
768.435	40882.31
768.829	40760.95
769.222	39401.71
769.615	39222.09
770.008	37785.18
770.402	38054.6
770.795	39120.15
771.188	41144.45
771.581	42841.08
771.974	44326.54
772.367	44384.79
772.76	44967.33
773.153	44103.23
773.545	42802.24
773.938	41586.21
774.331	39923.56
774.724	39311.9
775.116	41731.84
775.509	43896.92
775.901	46875.12
776.294	49047.49
776.686	52168.89
777.078	53707.75
777.471	54698.06
777.863	55627.69
778.255	55894.68
778.647	55863.13
779.039	54676.21
779.431	52734.44
779.823	50741.69
780.215	51741.7
780.607	52552.4
780.999	54668.93
781.39	56353.43
781.782	58105.88
782.174	59368.04
782.565	60270.96
782.957	60506.4
783.348	61610.79
783.74	60819.51
784.131	59176.28
784.522	57620.44
784.914	56188.37
785.305	54821.85
785.696	53319.4
786.087	53297.55
786.478	53365.51
786.869	53280.56
787.26	54013.58
787.651	54516.02
788.042	55671.38
788.433	56086.43
788.823	55649.53
789.214	54923.79
789.605	53501.44
789.995	51848.5
790.386	48977.1
790.776	47712.51
791.167	45909.09
791.557	46295.02
791.948	46200.35
792.338	45739.18
792.728	47486.78
793.118	48130
793.508	49962.55
793.898	51472.28
794.288	52923.76
794.678	53314.54
795.068	54501.45
795.458	55542.73
795.848	56117.98
796.238	55324.28
796.627	54275.72
797.017	52627.64
797.406	51586.36
797.796	50707.71
798.185	50202.84
798.575	49100.89
798.964	47826.59
799.354	47214.93
799.743	47467.36
800.132	48144.56
800.521	47967.37
800.91	48651.85
801.299	49761.09
801.688	50972.27
802.077	50576.64
802.466	52195.59
802.855	53404.35
803.244	52295.11
803.633	52911.62
804.021	51579.08
804.41	50397.02
804.799	48717.38
805.187	46656.67
805.576	44913.93
805.964	43557.11
806.352	40246.38
806.741	40159
807.129	38328.87
807.517	37309.44
807.905	37222.06
808.293	36421.08
808.681	36654.09
809.069	36455.06
809.457	38265.77
809.845	38690.53
810.233	38877.43
810.621	39510.93
811.009	41360.47
811.396	41639.6
811.784	42566.8
812.171	42853.22
812.559	42950.3
812.946	43455.17
813.334	42685.74
813.721	42353.21
814.108	40476.96
814.496	40807.07
814.883	39166.26
815.27	40010.94
815.657	39037.62
816.044	38714.8
816.431	37311.87
816.818	35802.13
817.205	34816.68
817.592	34925.91
817.979	33178.31
818.365	32171.01
818.752	30263.21
819.139	29377.28
819.525	27831.14
819.912	27377.25
820.298	26930.64
820.685	25991.3
821.071	25748.58
821.457	25406.34
821.843	24394.19
822.23	24039.82
822.616	23576.22
823.002	22510.67
823.388	22093.18
823.774	22588.34
824.16	21908.71
824.546	21573.76
824.931	21581.04
825.317	21556.77
825.703	21418.42
826.089	21340.74
826.474	20865.01
826.86	20976.66
827.245	20940.25
827.631	20527.63
828.016	19872.28
828.401	19915.97
828.787	19182.94
829.172	19097.99
829.557	18039.72
829.942	17547
830.327	16656.21
830.712	16432.9
831.097	15743.57
831.482	15139.19
831.867	14690.16
832.252	14122.19
832.636	13275.09
833.021	12978.96
833.406	12731.39
833.79	12352.74
834.175	11682.83
834.559	11393.99
834.944	10915.83
835.328	10505.62
835.713	10059.02
836.097	9903.67
836.481	9163.37
836.865	8893.95
837.249	8624.53
837.633	7993.45
838.017	8129.37
838.401	7932.77
838.785	7330.82
839.169	7204.6
839.553	6845.37
839.937	6420.61
840.32	6323.52
840.704	6180.31
841.087	5799.24
841.471	5461.86
841.854	5595.35
842.238	5490.98
842.621	5471.57
843.004	5199.72
843.388	5311.37
843.771	5248.26
844.154	4966.7
844.537	5088.06
844.92	5068.65
845.303	4864.76
845.686	4770.1
846.069	4597.77
846.452	4733.69
846.834	4808.93
847.217	4469.12
847.6	4527.38
847.982	4444.85
848.365	4245.82
848.748	4214.26
849.13	4124.46
849.512	4092.9
849.895	3891.44
850.277	3770.08
850.659	3743.38
851.041	3709.4
851.423	3731.25
851.806	3568.62
852.188	3510.37
852.57	3422.99
852.951	3469.11
853.333	3342.89
853.715	3143.86
854.097	3117.16
854.479	2855.02
854.86	2760.36
855.242	2862.3
855.623	2675.41
856.005	2568.61
856.386	2449.67
856.768	2284.62
857.149	2340.45
857.53	2233.65
857.911	2138.99
858.292	2041.9
858.674	1954.52
859.055	1884.13
859.436	1787.04
859.817	1675.39
860.197	1537.04
860.578	1541.89
860.959	1541.89
861.34	1546.75
861.72	1439.95
862.101	1444.8
862.482	1316.16
862.862	1289.46
863.243	1223.93
863.623	1274.9
864.003	1197.23
864.384	1172.96
864.764	1109.85
865.144	1126.84
865.524	1037.03
865.904	976.35
866.284	998.2
866.664	973.92
867.044	1000.62
867.424	879.26
867.804	767.61
868.183	782.17
868.563	789.45
868.943	767.61
869.322	721.49
869.702	740.91
870.081	694.79
870.461	663.24
870.84	566.15
871.22	680.23
871.599	624.4
871.978	607.41
872.357	578.29
872.736	532.17
873.115	486.05
873.494	444.79
873.873	561.3
874.252	461.78
874.631	405.95
875.01	325.85
875.388	408.38
875.767	422.94
876.146	393.82
876.524	418.09
876.903	367.12
877.281	335.56
877.66	342.85
878.038	337.99
878.416	287.02
878.794	272.46
879.173	345.27
879.551	325.85
879.929	265.17
880.307	255.47
880.685	311.29
881.063	294.3
881.441	323.43
881.818	306.44
882.196	287.02
882.574	240.9
882.951	299.16
883.329	260.32
883.707	277.31
884.084	274.88
884.461	272.46
884.839	221.48
885.216	296.73
885.593	262.75
885.971	272.46
886.348	226.34
886.725	255.47
887.102	233.62
887.479	180.22
887.856	199.64
888.233	262.75
888.609	211.78
888.986	233.62
889.363	204.49
889.74	226.34
890.116	226.34
890.493	189.93
890.869	151.09
891.246	163.23
891.622	219.06
891.998	194.78
892.375	228.77
892.751	279.74
893.127	189.93
893.503	155.95
893.879	182.65
894.255	231.19
894.631	211.78
895.007	197.21
895.383	136.53
895.759	197.21
896.134	245.76
896.51	160.8
896.886	204.49
897.261	117.11
897.637	172.94
898.012	197.21
898.388	189.93
898.763	170.51
899.138	68.57
899.514	155.95
899.889	109.83
900.264	163.23
900.639	223.91
901.014	187.5
901.389	160.8
901.764	131.68
902.139	44.3
902.513	83.13
902.888	151.09
903.263	136.53
903.638	131.68
904.012	136.53
904.387	194.78
904.761	168.09
905.136	136.53
905.51	175.37
905.884	170.51
906.259	134.1
906.633	148.67
907.007	194.78
907.381	119.54
907.755	92.84
908.129	151.09
908.503	121.97
908.877	109.83
909.251	143.81
909.624	153.52
909.998	163.23
910.372	117.11
910.745	194.78
911.119	112.26
911.492	187.5
911.866	172.94
912.239	163.23
912.612	202.07
912.986	182.65
913.359	153.52
913.732	151.09
914.105	136.53
914.478	114.69
914.851	51.58
915.224	97.7
915.597	172.94
915.97	160.8
916.343	248.18
916.715	206.92
917.088	185.08
917.461	163.23
917.833	163.23
918.206	204.49
918.578	177.79
918.951	136.53
919.323	78.28
919.695	138.96
920.067	126.82
920.44	146.24
920.812	158.38
921.184	141.39
921.556	182.65
921.928	151.09
922.3	107.4
922.672	121.97
923.043	121.97
923.415	138.96
923.787	236.05
924.158	109.83
924.53	163.23
924.901	214.2
925.273	134.1
925.644	131.68
926.016	231.19
926.387	138.96
926.758	151.09
927.129	245.76
927.5	197.21
927.872	187.5
928.243	131.68
928.613	168.09
928.984	175.37
929.355	223.91
929.726	158.38
930.097	61.29
930.467	129.25
930.838	165.66
931.209	219.06
931.579	189.93
931.95	136.53
932.32	165.66
932.69	160.8
933.061	146.24
933.431	143.81
933.801	204.49
934.171	204.49
934.541	170.51
934.911	129.25
935.281	158.38
935.651	214.2
936.021	80.71
936.391	182.65
936.761	134.1
937.13	109.83
937.5	78.28
937.87	175.37
938.239	155.95
938.609	202.07
938.978	185.08
939.347	85.56
939.717	119.54
940.086	192.36
940.455	168.09
940.824	158.38
941.193	141.39
941.562	216.63
941.931	119.54
942.3	228.77
942.669	155.95
943.038	102.55
943.407	216.63
943.775	197.21
944.144	228.77
944.513	189.93
944.881	194.78
945.25	143.81
945.618	148.67
945.986	138.96
946.355	177.79
946.723	158.38
947.091	87.99
947.459	119.54
947.827	194.78
948.195	114.69
948.563	126.82
948.931	124.4
949.299	160.8
949.667	151.09
950.035	126.82
950.402	158.38
950.77	146.24
951.138	192.36
951.505	175.37
951.873	231.19
952.24	158.38
952.607	168.09
952.975	204.49
953.342	97.7
953.709	185.08
954.076	138.96
954.443	134.1
954.81	192.36
955.177	119.54
955.544	189.93
955.911	180.22
956.278	138.96
956.645	209.35
957.012	136.53
957.378	153.52
957.745	158.38
958.111	121.97
958.478	209.35
958.844	233.62
959.211	168.09
959.577	129.25
959.943	146.24
960.309	206.92
960.675	136.53
961.042	109.83
961.408	58.86
961.774	151.09
962.139	141.39
962.505	143.81
962.871	109.83
963.237	146.24
963.603	165.66
963.968	117.11
964.334	197.21
964.699	136.53
965.065	151.09
965.43	185.08
965.796	189.93
966.161	155.95
966.526	158.38
966.891	136.53
967.256	134.1
967.622	151.09
967.987	92.84
968.352	121.97
968.716	141.39
969.081	199.64
969.446	158.38
969.811	163.23
970.176	172.94
970.54	170.51
970.905	153.52
971.269	148.67
971.634	168.09
971.998	185.08
972.363	143.81
972.727	177.79
973.091	68.57
973.455	92.84
973.819	104.98
974.183	153.52
974.547	155.95
974.911	209.35
975.275	160.8
975.639	117.11
976.003	187.5
976.367	97.7
976.73	211.78
977.094	126.82
977.458	160.8
977.821	124.4
978.185	182.65
978.548	223.91
978.911	63.71
979.275	148.67
979.638	121.97
980.001	160.8
980.364	158.38
980.727	117.11
981.09	180.22
981.453	143.81
981.816	126.82
982.179	168.09
982.542	172.94
982.905	134.1
983.267	228.77
983.63	124.4
983.992	182.65
984.355	141.39
984.717	192.36
985.08	121.97
985.442	124.4
985.804	148.67
986.167	165.66
986.529	197.21
986.891	151.09
987.253	172.94
987.615	138.96
987.977	109.83
988.339	168.09
988.701	148.67
989.062	126.82
989.424	112.26
989.786	121.97
990.147	160.8
990.509	155.95
990.87	202.07
991.232	182.65
991.593	240.9
991.955	119.54
992.316	95.27
992.677	146.24
993.038	124.4
993.399	158.38
993.76	68.57
994.121	148.67
994.482	151.09
994.843	199.64
995.204	158.38
995.565	131.68
995.926	185.08
996.286	199.64
996.647	202.07
997.007	143.81
997.368	138.96
997.728	168.09
998.089	187.5
998.449	165.66
998.809	136.53
999.169	216.63
999.53	170.51
999.89	117.11
1000.25	121.97
1000.61	262.75
1000.97	109.83
1001.329	165.66
1001.689	129.25
1002.049	146.24
1002.409	148.67
1002.768	236.05
1003.128	170.51
1003.487	168.09
1003.847	153.52
1004.206	148.67
1004.566	148.67
1004.925	129.25
1005.284	112.26
1005.643	187.5
1006.003	204.49
1006.362	148.67
1006.721	112.26
1007.08	141.39
1007.438	146.24
1007.797	102.55
1008.156	136.53
1008.515	143.81
1008.874	148.67
1009.232	153.52
1009.591	124.4
1009.949	170.51
1010.308	148.67
1010.666	146.24
1011.024	131.68
1011.383	153.52
1011.741	155.95
1012.099	151.09
1012.457	109.83
1012.815	143.81
1013.173	134.1
1013.531	107.4
1013.889	68.57
1014.247	126.82
1014.605	189.93
1014.962	141.39
1015.32	189.93
1015.678	211.78
1016.035	182.65
1016.393	129.25
1016.75	180.22
1017.107	153.52
1017.465	109.83
1017.822	119.54
1018.179	265.17
1018.536	117.11
1018.894	124.4
1019.251	187.5
1019.608	151.09
1019.964	97.7
1020.321	136.53
1020.678	219.06
1021.035	148.67
1021.392	83.13
1021.748	148.67
1022.105	296.73
1022.461	165.66
1022.818	136.53
1023.174	216.63
1023.531	226.34
1023.887	114.69
1024.243	155.95
1024.599	194.78
1024.955	138.96
1025.311	117.11
1025.667	109.83
1026.023	206.92
1026.379	124.4
1026.735	134.1
1027.091	138.96
1027.447	155.95
