189.514	67.05
189.973	67.05
190.431	67.05
190.889	-66.45
191.348	59.77
191.806	-59.16
192.264	-0.91
192.722	-20.33
193.18	-34.89
193.638	-8.19
194.096	-3.34
194.554	-42.17
195.012	42.78
195.47	8.8
195.928	-34.89
196.385	20.93
196.843	40.35
197.301	-39.75
197.758	-0.91
198.216	3.94
198.674	11.23
199.131	57.34
199.589	25.79
200.046	96.18
200.503	139.87
200.961	84.04
201.418	64.62
201.875	98.61
202.332	23.36
202.79	79.19
203.247	88.9
203.704	149.58
204.161	181.13
204.618	144.72
205.075	178.7
205.532	86.47
205.989	171.42
206.445	115.6
206.902	190.84
207.359	115.6
207.816	195.69
208.272	122.88
208.729	188.41
209.185	169
209.642	188.41
210.098	161.71
210.555	202.98
211.011	178.7
211.467	137.44
211.924	118.02
212.38	166.57
212.836	173.85
213.292	195.69
213.748	135.01
214.204	173.85
214.66	132.59
215.116	193.27
215.572	178.7
216.028	171.42
216.484	125.31
216.94	183.56
217.396	130.16
217.851	193.27
218.307	171.42
218.763	183.56
219.218	149.58
219.674	103.46
220.129	105.89
220.585	105.89
221.04	173.85
221.496	113.17
221.951	202.98
222.406	135.01
222.861	98.61
223.317	137.44
223.772	176.28
224.227	178.7
224.682	147.15
225.137	96.18
225.592	139.87
226.047	115.6
226.502	98.61
226.957	130.16
227.411	188.41
227.866	137.44
228.321	122.88
228.776	227.25
229.23	205.4
229.685	135.01
230.139	115.6
230.594	103.46
231.048	125.31
231.503	137.44
231.957	118.02
232.411	137.44
232.865	156.86
233.32	176.28
233.774	227.25
234.228	101.03
234.682	169
235.136	115.6
235.59	198.12
236.044	159.29
236.498	154.43
236.952	115.6
237.406	144.72
237.86	137.44
238.313	113.17
238.767	229.68
239.221	86.47
239.674	69.48
240.128	166.57
240.581	224.82
241.035	122.88
241.488	149.58
241.942	193.27
242.395	169
242.848	135.01
243.301	159.29
243.755	166.57
244.208	202.98
244.661	173.85
245.114	144.72
245.567	86.47
246.02	130.16
246.473	159.29
246.926	152
247.379	166.57
247.832	207.83
248.284	122.88
248.737	135.01
249.19	181.13
249.642	147.15
250.095	118.02
250.547	118.02
251	152
251.452	84.04
251.905	171.42
252.357	249.09
252.81	59.77
253.262	173.85
253.714	205.4
254.166	173.85
254.618	202.98
255.07	152
255.523	188.41
255.975	103.46
256.427	91.32
256.878	166.57
257.33	135.01
257.782	173.85
258.234	178.7
258.686	188.41
259.137	222.39
259.589	166.57
260.041	181.13
260.492	166.57
260.944	181.13
261.395	105.89
261.847	110.74
262.298	147.15
262.749	127.73
263.201	176.28
263.652	190.84
264.103	166.57
264.554	84.04
265.005	142.3
265.457	122.88
265.908	127.73
266.359	113.17
266.809	91.32
267.26	120.45
267.711	215.11
268.162	181.13
268.613	188.41
269.064	152
269.514	142.3
269.965	193.27
270.415	176.28
270.866	178.7
271.316	110.74
271.767	176.28
272.217	195.69
272.668	181.13
273.118	181.13
273.568	93.75
274.019	144.72
274.469	188.41
274.919	156.86
275.369	127.73
275.819	178.7
276.269	166.57
276.719	81.62
277.169	154.43
277.619	144.72
278.069	122.88
278.518	156.86
278.968	93.75
279.418	159.29
279.867	176.28
280.317	173.85
280.767	139.87
281.216	144.72
281.666	176.28
282.115	135.01
282.564	166.57
283.014	110.74
283.463	105.89
283.912	156.86
284.361	69.48
284.811	147.15
285.26	156.86
285.709	236.96
286.158	185.99
286.607	190.84
287.056	152
287.505	101.03
287.953	137.44
288.402	115.6
288.851	169
289.3	183.56
289.748	215.11
290.197	205.4
290.646	188.41
291.094	98.61
291.543	142.3
291.991	198.12
292.439	142.3
292.888	122.88
293.336	113.17
293.784	181.13
294.233	210.26
294.681	183.56
295.129	147.15
295.577	115.6
296.025	135.01
296.473	190.84
296.921	161.71
297.369	198.12
297.817	159.29
298.264	159.29
298.712	142.3
299.16	122.88
299.608	144.72
300.055	137.44
300.503	183.56
300.95	169
301.398	212.69
301.845	156.86
302.293	125.31
302.74	103.46
303.187	212.69
303.635	132.59
304.082	93.75
304.529	144.72
304.976	152
305.423	108.31
305.87	156.86
306.317	156.86
306.764	139.87
307.211	156.86
307.658	207.83
308.105	202.98
308.552	147.15
308.998	147.15
309.445	193.27
309.892	81.62
310.338	200.55
310.785	135.01
311.231	149.58
311.678	144.72
312.124	115.6
312.571	219.97
313.017	154.43
313.463	166.57
313.909	154.43
314.356	200.55
314.802	164.14
315.248	166.57
315.694	159.29
316.14	164.14
316.586	122.88
317.032	173.85
317.478	166.57
317.923	215.11
318.369	159.29
318.815	147.15
319.261	152
319.706	161.71
320.152	212.69
320.597	120.45
321.043	154.43
321.488	239.38
321.934	156.86
322.379	96.18
322.824	108.31
323.27	166.57
323.715	122.88
324.16	115.6
324.605	113.17
325.05	47.63
325.495	125.31
325.94	103.46
326.385	164.14
326.83	217.54
327.275	195.69
327.72	137.44
328.165	166.57
328.61	166.57
329.054	193.27
329.499	135.01
329.943	205.4
330.388	149.58
330.832	193.27
331.277	132.59
331.721	171.42
332.166	210.26
332.61	176.28
333.054	147.15
333.499	79.19
333.943	88.9
334.387	91.32
334.831	212.69
335.275	125.31
335.719	169
336.163	103.46
336.607	142.3
337.051	193.27
337.495	135.01
337.938	195.69
338.382	188.41
338.826	181.13
339.269	188.41
339.713	195.69
340.157	132.59
340.6	183.56
341.044	156.86
341.487	190.84
341.93	135.01
342.374	152
342.817	108.31
343.26	125.31
343.703	137.44
344.146	219.97
344.59	137.44
345.033	183.56
345.476	166.57
345.919	125.31
346.361	113.17
346.804	161.71
347.247	198.12
347.69	125.31
348.133	115.6
348.575	93.75
349.018	152
349.461	185.99
349.903	178.7
350.346	118.02
350.788	198.12
351.23	108.31
351.673	144.72
352.115	161.71
352.557	207.83
353	142.3
353.442	200.55
353.884	154.43
354.326	161.71
354.768	188.41
355.21	195.69
355.652	149.58
356.094	195.69
356.536	130.16
356.978	164.14
357.419	166.57
357.861	127.73
358.303	120.45
358.744	190.84
359.186	156.86
359.627	110.74
360.069	81.62
360.51	195.69
360.952	176.28
361.393	215.11
361.834	139.87
362.276	135.01
362.717	137.44
363.158	113.17
363.599	159.29
364.04	130.16
364.481	144.72
364.922	93.75
365.363	120.45
365.804	219.97
366.245	154.43
366.686	122.88
367.126	98.61
367.567	132.59
368.008	159.29
368.448	115.6
368.889	171.42
369.33	125.31
369.77	178.7
370.21	144.72
370.651	188.41
371.091	149.58
371.531	118.02
371.972	88.9
372.412	127.73
372.852	135.01
373.292	193.27
373.732	219.97
374.172	207.83
374.612	224.82
375.052	127.73
375.492	152
375.932	166.57
376.372	147.15
376.811	135.01
377.251	132.59
377.691	74.33
378.13	147.15
378.57	169
379.009	169
379.449	120.45
379.888	176.28
380.328	127.73
380.767	135.01
381.206	185.99
381.645	130.16
382.085	156.86
382.524	84.04
382.963	169
383.402	152
383.841	122.88
384.28	137.44
384.719	159.29
385.158	110.74
385.596	139.87
386.035	142.3
386.474	227.25
386.913	173.85
387.351	217.54
387.79	161.71
388.228	159.29
388.667	166.57
389.105	166.57
389.544	135.01
389.982	139.87
390.42	188.41
390.859	86.47
391.297	173.85
391.735	118.02
392.173	202.98
392.611	232.1
393.049	217.54
393.487	130.16
393.925	86.47
394.363	144.72
394.801	147.15
395.239	118.02
395.676	185.99
396.114	217.54
396.552	144.72
396.989	115.6
397.427	115.6
397.864	152
398.302	215.11
398.739	171.42
399.177	127.73
399.614	193.27
400.051	125.31
400.488	147.15
400.926	110.74
401.363	120.45
401.8	132.59
402.237	159.29
402.674	154.43
403.111	185.99
403.548	139.87
403.985	171.42
404.421	125.31
404.858	178.7
405.295	166.57
405.732	88.9
406.168	166.57
406.605	144.72
407.041	183.56
407.478	195.69
407.914	161.71
408.351	185.99
408.787	164.14
409.223	154.43
409.66	176.28
410.096	113.17
410.532	207.83
410.968	120.45
411.404	135.01
411.84	166.57
412.276	171.42
412.712	103.46
413.148	193.27
413.584	118.02
414.02	224.82
414.455	149.58
414.891	169
415.327	164.14
415.762	190.84
416.198	161.71
416.633	169
417.069	132.59
417.504	115.6
417.94	130.16
418.375	185.99
418.81	152
419.245	139.87
419.681	71.91
420.116	173.85
420.551	236.96
420.986	205.4
421.421	176.28
421.856	236.96
422.291	130.16
422.726	173.85
423.16	152
423.595	103.46
424.03	139.87
424.464	207.83
424.899	103.46
425.334	88.9
425.768	154.43
426.203	161.71
426.637	236.96
427.071	183.56
427.506	171.42
427.94	115.6
428.374	164.14
428.809	120.45
429.243	149.58
429.677	118.02
430.111	169
430.545	156.86
430.979	183.56
431.413	127.73
431.847	110.74
432.28	137.44
432.714	137.44
433.148	147.15
433.582	135.01
434.015	234.53
434.449	156.86
434.882	202.98
435.316	135.01
435.749	127.73
436.183	193.27
436.616	118.02
437.049	152
437.483	178.7
437.916	173.85
438.349	169
438.782	205.4
439.215	195.69
439.648	139.87
440.081	166.57
440.514	125.31
440.947	176.28
441.38	169
441.813	125.31
442.245	205.4
442.678	256.38
443.111	156.86
443.543	164.14
443.976	198.12
444.408	161.71
444.841	178.7
445.273	127.73
445.705	147.15
446.138	152
446.57	164.14
447.002	178.7
447.434	181.13
447.867	130.16
448.299	178.7
448.731	149.58
449.163	193.27
449.595	207.83
450.026	103.46
450.458	188.41
450.89	219.97
451.322	139.87
451.754	239.38
452.185	171.42
452.617	241.81
453.048	222.39
453.48	152
453.911	256.38
454.343	188.41
454.774	202.98
455.205	236.96
455.637	224.82
456.068	198.12
456.499	185.99
456.93	125.31
457.361	241.81
457.792	173.85
458.223	159.29
458.654	217.54
459.085	156.86
459.516	198.12
459.947	149.58
460.378	188.41
460.808	125.31
461.239	217.54
461.669	185.99
462.1	229.68
462.531	205.4
462.961	178.7
463.391	227.25
463.822	181.13
464.252	91.32
464.682	91.32
465.113	181.13
465.543	222.39
465.973	152
466.403	169
466.833	169
467.263	139.87
467.693	227.25
468.123	200.55
468.553	169
468.983	169
469.412	154.43
469.842	236.96
470.272	219.97
470.701	154.43
471.131	132.59
471.56	181.13
471.99	212.69
472.419	171.42
472.849	212.69
473.278	205.4
473.707	142.3
474.136	144.72
474.566	127.73
474.995	188.41
475.424	164.14
475.853	185.99
476.282	159.29
476.711	166.57
477.14	96.18
477.569	210.26
477.997	166.57
478.426	236.96
478.855	222.39
479.283	239.38
479.712	190.84
480.141	156.86
480.569	178.7
480.998	96.18
481.426	185.99
481.854	200.55
482.283	249.09
482.711	212.69
483.139	270.94
483.567	190.84
483.995	181.13
484.424	219.97
484.852	207.83
485.28	122.88
485.708	188.41
486.135	188.41
486.563	115.6
486.991	205.4
487.419	178.7
487.847	222.39
488.274	207.83
488.702	195.69
489.129	152
489.557	149.58
489.984	290.36
490.412	190.84
490.839	236.96
491.266	132.59
491.694	207.83
492.121	176.28
492.548	149.58
492.975	212.69
493.402	127.73
493.829	144.72
494.256	135.01
494.683	181.13
495.11	149.58
495.537	190.84
495.964	198.12
496.39	166.57
496.817	198.12
497.244	139.87
497.67	127.73
498.097	212.69
498.523	198.12
498.95	137.44
499.376	193.27
499.803	164.14
500.229	193.27
500.655	152
501.081	137.44
501.508	132.59
501.934	171.42
502.36	190.84
502.786	173.85
503.212	152
503.638	173.85
504.064	115.6
504.489	130.16
504.915	166.57
505.341	122.88
505.767	263.66
506.192	202.98
506.618	147.15
507.043	164.14
507.469	122.88
507.894	246.67
508.32	103.46
508.745	200.55
509.17	207.83
509.596	161.71
510.021	156.86
510.446	122.88
510.871	205.4
511.296	239.38
511.721	164.14
512.146	193.27
512.571	169
512.996	152
513.421	137.44
513.845	125.31
514.27	130.16
514.695	181.13
515.119	156.86
515.544	115.6
515.969	137.44
516.393	178.7
516.817	110.74
517.242	137.44
517.666	118.02
518.09	217.54
518.515	188.41
518.939	188.41
519.363	431.14
519.787	156.86
520.211	169
520.635	210.26
521.059	144.72
521.483	164.14
521.907	234.53
522.331	166.57
522.754	156.86
523.178	144.72
523.602	147.15
524.025	127.73
524.449	198.12
524.872	137.44
525.296	139.87
525.719	198.12
526.143	156.86
526.566	137.44
526.989	188.41
527.412	139.87
527.836	164.14
528.259	166.57
528.682	71.91
529.105	210.26
529.528	120.45
529.951	122.88
530.374	130.16
530.796	154.43
531.219	212.69
531.642	171.42
532.065	108.31
532.487	152
532.91	219.97
533.332	176.28
533.755	173.85
534.177	166.57
534.6	183.56
535.022	171.42
535.444	173.85
535.867	164.14
536.289	193.27
536.711	105.89
537.133	181.13
537.555	190.84
537.977	118.02
538.399	198.12
538.821	164.14
539.243	207.83
539.665	183.56
540.086	212.69
540.508	161.71
540.93	166.57
541.351	234.53
541.773	195.69
542.195	224.82
542.616	171.42
543.037	212.69
543.459	246.67
543.88	244.24
544.301	190.84
544.723	185.99
545.144	219.97
545.565	273.37
545.986	236.96
546.407	253.95
546.828	263.66
547.249	149.58
547.67	236.96
548.091	207.83
548.512	229.68
548.932	166.57
549.353	232.1
549.774	164.14
550.194	173.85
550.615	154.43
551.035	173.85
551.456	142.3
551.876	183.56
552.296	222.39
552.717	232.1
553.137	144.72
553.557	215.11
553.977	198.12
554.397	246.67
554.817	132.59
555.237	118.02
555.657	132.59
556.077	193.27
556.497	205.4
556.917	195.69
557.337	183.56
557.756	132.59
558.176	207.83
558.596	137.44
559.015	198.12
559.435	164.14
559.854	227.25
560.274	96.18
560.693	147.15
561.112	147.15
561.532	135.01
561.951	222.39
562.37	125.31
562.789	137.44
563.208	176.28
563.627	115.6
564.046	236.96
564.465	193.27
564.884	166.57
565.303	232.1
565.722	125.31
566.14	169
566.559	171.42
566.978	130.16
567.396	183.56
567.815	210.26
568.233	183.56
568.652	137.44
569.07	154.43
569.489	185.99
569.907	217.54
570.325	200.55
570.743	190.84
571.161	135.01
571.58	147.15
571.998	173.85
572.416	135.01
572.833	256.38
573.251	205.4
573.669	202.98
574.087	200.55
574.505	190.84
574.922	122.88
575.34	144.72
575.758	181.13
576.175	222.39
576.593	139.87
577.01	125.31
577.428	154.43
577.845	1605.91
578.262	319.48
578.68	232.1
579.097	210.26
579.514	198.12
579.931	105.89
580.348	115.6
580.765	171.42
581.182	135.01
581.599	139.87
582.016	149.58
582.433	156.86
582.849	115.6
583.266	183.56
583.683	229.68
584.099	152
584.516	144.72
584.933	149.58
585.349	159.29
585.765	195.69
586.182	171.42
586.598	169
587.014	241.81
587.431	164.14
587.847	200.55
588.263	144.72
588.679	210.26
589.095	159.29
589.511	159.29
589.927	224.82
590.343	149.58
590.759	149.58
591.174	202.98
591.59	188.41
592.006	137.44
592.421	139.87
592.837	202.98
593.252	205.4
593.668	122.88
594.083	193.27
594.499	127.73
594.914	161.71
595.329	139.87
595.745	137.44
596.16	173.85
596.575	152
596.99	120.45
597.405	171.42
597.82	183.56
598.235	149.58
598.65	215.11
599.065	183.56
599.479	183.56
599.894	135.01
600.309	210.26
600.724	188.41
601.138	258.8
601.553	193.27
601.967	193.27
602.382	195.69
602.796	113.17
603.21	198.12
603.625	130.16
604.039	193.27
604.453	120.45
604.867	169
605.281	144.72
605.695	113.17
606.109	147.15
606.523	144.72
606.937	130.16
607.351	256.38
607.765	193.27
608.178	195.69
608.592	152
609.006	147.15
609.419	198.12
609.833	173.85
610.246	132.59
610.66	251.52
611.073	161.71
611.487	239.38
611.9	263.66
612.313	198.12
612.726	241.81
613.139	234.53
613.553	224.82
613.966	268.51
614.379	210.26
614.792	96.18
615.204	176.28
615.617	188.41
616.03	166.57
616.443	188.41
616.856	154.43
617.268	166.57
617.681	149.58
618.093	98.61
618.506	212.69
618.918	178.7
619.331	139.87
619.743	113.17
620.155	93.75
620.568	142.3
620.98	152
621.392	103.46
621.804	176.28
622.216	173.85
622.628	173.85
623.04	188.41
623.452	159.29
623.864	152
624.276	232.1
624.687	142.3
625.099	169
625.511	207.83
625.922	169
626.334	139.87
626.745	105.89
627.157	164.14
627.568	171.42
627.979	156.86
628.391	156.86
628.802	122.88
629.213	185.99
629.624	139.87
630.035	188.41
630.446	125.31
630.857	178.7
631.268	130.16
631.679	132.59
632.09	108.31
632.501	183.56
632.912	222.39
633.322	147.15
633.733	132.59
634.144	217.54
634.554	178.7
634.965	156.86
635.375	176.28
635.785	217.54
636.196	159.29
636.606	183.56
637.016	156.86
637.427	101.03
637.837	198.12
638.247	195.69
638.657	166.57
639.067	222.39
639.477	173.85
639.887	147.15
640.297	169
640.706	115.6
641.116	190.84
641.526	127.73
641.935	152
642.345	185.99
642.755	96.18
643.164	115.6
643.573	108.31
643.983	302.49
644.392	224.82
644.801	139.87
645.211	193.27
645.62	98.61
646.029	166.57
646.438	113.17
646.847	181.13
647.256	198.12
647.665	147.15
648.074	115.6
648.483	108.31
648.892	147.15
649.3	127.73
649.709	101.03
650.118	171.42
650.526	120.45
650.935	241.81
651.343	227.25
651.752	176.28
652.16	139.87
652.568	159.29
652.977	122.88
653.385	154.43
653.793	125.31
654.201	103.46
654.609	159.29
655.017	120.45
655.425	190.84
655.833	270.94
656.241	181.13
656.649	164.14
657.057	202.98
657.464	156.86
657.872	190.84
658.28	193.27
658.687	173.85
659.095	110.74
659.502	86.47
659.91	181.13
660.317	190.84
660.724	210.26
661.132	161.71
661.539	202.98
661.946	135.01
662.353	229.68
662.76	113.17
663.167	236.96
663.574	161.71
663.981	156.86
664.388	253.95
664.795	251.52
665.202	161.71
665.608	183.56
666.015	132.59
666.422	198.12
666.828	147.15
667.235	164.14
667.641	149.58
668.047	222.39
668.454	144.72
668.86	169
669.266	185.99
669.673	147.15
670.079	200.55
670.485	147.15
670.891	202.98
671.297	166.57
671.703	149.58
672.109	198.12
672.515	132.59
672.92	166.57
673.326	154.43
673.732	200.55
674.138	193.27
674.543	118.02
674.949	135.01
675.354	154.43
675.76	222.39
676.165	169
676.57	108.31
676.976	215.11
677.381	135.01
677.786	212.69
678.191	193.27
678.596	130.16
679.001	135.01
679.406	193.27
679.811	212.69
680.216	135.01
680.621	224.82
681.026	139.87
681.43	74.33
681.835	176.28
682.24	164.14
682.644	152
683.049	105.89
683.453	86.47
683.858	207.83
684.262	152
684.667	120.45
685.071	105.89
685.475	142.3
685.879	98.61
686.283	185.99
686.687	156.86
687.091	202.98
687.495	149.58
687.899	144.72
688.303	120.45
688.707	152
689.111	120.45
689.514	147.15
689.918	239.38
690.322	164.14
690.725	161.71
691.129	139.87
691.532	166.57
691.936	200.55
692.339	137.44
692.742	183.56
693.146	132.59
693.549	152
693.952	210.26
694.355	195.69
694.758	161.71
695.161	190.84
695.564	188.41
695.967	161.71
696.37	156.86
696.773	137.44
697.175	142.3
697.578	176.28
697.981	244.24
698.383	198.12
698.786	202.98
699.188	173.85
699.591	166.57
699.993	139.87
700.395	161.71
700.798	142.3
701.2	181.13
701.602	115.6
702.004	132.59
702.406	198.12
702.808	156.86
703.21	135.01
703.612	169
704.014	144.72
704.416	169
704.818	312.2
705.219	159.29
705.621	149.58
706.023	193.27
706.424	171.42
706.826	241.81
707.227	173.85
707.629	105.89
708.03	202.98
708.431	169
708.832	178.7
709.234	149.58
709.635	188.41
710.036	152
710.437	207.83
710.838	249.09
711.239	232.1
711.64	239.38
712.041	236.96
712.441	149.58
712.842	217.54
713.243	287.93
713.643	222.39
714.044	241.81
714.445	246.67
714.845	256.38
715.246	232.1
715.646	253.95
716.046	270.94
716.447	217.54
716.847	268.51
717.247	207.83
717.647	219.97
718.047	152
718.447	198.12
718.847	178.7
719.247	188.41
719.647	234.53
720.047	188.41
720.446	278.22
720.846	229.68
721.246	268.51
721.645	222.39
722.045	275.79
722.444	309.77
722.844	275.79
723.243	275.79
723.643	229.68
724.042	249.09
724.441	253.95
724.84	261.23
725.24	268.51
725.639	348.61
726.038	329.19
726.437	261.23
726.836	348.61
727.234	360.75
727.633	360.75
728.032	360.75
728.431	336.47
728.83	455.41
729.228	411.72
729.627	448.13
730.025	438.42
730.424	462.69
730.822	525.8
731.22	494.24
731.619	537.93
732.017	681.14
732.415	622.89
732.813	688.42
733.212	831.63
733.61	817.06
734.008	792.79
734.406	923.86
734.803	977.26
735.201	1101.05
735.599	1064.64
735.997	1173.87
736.395	1275.81
736.792	1302.51
737.19	1477.27
737.587	1479.7
737.985	1545.23
738.382	1678.73
738.78	1829.22
739.177	1819.51
739.574	1921.45
739.971	1991.84
740.369	2093.78
740.766	2234.56
741.163	2164.17
741.56	2394.76
741.957	2511.26
742.354	2550.1
742.751	2613.21
743.147	2749.13
743.544	2797.68
743.941	2722.43
744.338	3028.26
744.734	3207.88
745.131	3273.41
745.527	3564.68
745.924	3960.32
746.32	4045.27
746.716	4149.64
747.113	4530.71
747.509	4989.46
747.905	4933.63
748.301	5008.88
748.697	5467.62
749.093	5814.71
749.489	5627.82
749.885	6018.6
750.281	6547.74
750.677	6666.67
751.073	6965.22
751.468	7234.64
751.864	7916.69
752.26	7693.38
752.655	7955.52
753.051	8244.36
753.446	8763.79
753.842	8569.61
754.237	9057.48
754.632	9394.87
755.028	9246.81
755.423	9285.64
755.818	9474.97
756.213	9615.74
756.608	9380.3
757.003	9399.72
757.398	9904.58
757.793	9819.63
758.188	9258.94
758.583	9746.81
758.977	10353.62
759.372	10457.99
759.767	10809.94
760.161	11958.01
760.556	13161.92
760.95	13154.63
761.345	13572.12
761.739	15261.46
762.133	15943.51
762.527	16171.67
762.922	16266.33
763.316	18038.21
763.71	18817.34
764.104	17967.82
764.498	18562.49
764.892	19640.17
765.286	20234.84
765.68	20346.49
766.073	21540.69
766.467	22747.02
766.861	23358.68
767.255	23341.69
767.648	25436.38
768.042	26907.28
768.435	26470.38
768.829	25897.55
769.222	27603.89
769.615	29128.18
770.008	28150.01
770.402	27557.77
770.795	28196.13
771.188	29329.64
771.581	27725.25
771.974	26310.18
772.367	26970.38
772.76	27387.87
773.153	26239.79
773.545	25946.1
773.938	27353.88
774.331	27203.4
774.724	26628.14
775.116	27196.11
775.509	29535.96
775.901	31239.87
776.294	30664.62
776.686	31014.14
777.078	33438.93
777.471	34315.16
777.863	33870.98
778.255	34708.37
778.647	36982.67
779.039	38548.23
779.431	36312.76
779.823	36412.28
780.215	38456
780.607	38451.14
780.999	37536.08
781.39	37400.16
781.782	39756.99
782.174	40839.53
782.565	38776.39
782.957	39026.4
783.348	41524.01
783.74	41601.68
784.131	38720.57
784.522	38844.35
784.914	40436.61
785.305	40096.8
785.696	38346.77
786.087	37349.19
786.478	38383.18
786.869	37043.36
787.26	33482.62
787.651	32099.1
788.042	32611.25
788.433	31982.6
788.823	30198.59
789.214	27734.96
789.605	27327.18
789.995	27955.84
790.386	25518.9
790.776	24441.22
791.167	24829.57
791.557	27120.87
791.948	26327.17
792.338	25967.94
792.728	27717.97
793.118	29885.48
793.508	29217.99
793.898	28290.79
794.288	28577.2
794.678	29827.22
795.068	29659.75
795.458	27742.24
795.848	27683.99
796.238	29494.69
796.627	29938.88
797.017	28065.06
797.406	27849.04
797.796	29339.35
798.185	30650.05
798.575	29756.83
798.964	28222.83
799.354	30215.58
799.743	32082.11
800.132	31861.24
800.521	29836.93
800.91	30135.48
801.299	31674.34
801.688	32353.96
802.077	28953.42
802.466	28802.94
802.855	30802.97
803.244	30383.06
803.633	28946.14
804.021	26832.03
804.41	27972.83
804.799	29373.33
805.187	26895.14
805.576	24048.01
805.964	23611.11
806.352	24305.29
806.741	24220.34
807.129	21759.14
807.517	21186.31
807.905	23142.65
808.293	23671.79
808.681	22669.35
809.069	21885.35
809.457	24210.63
809.845	25759.2
810.233	24832
810.621	23623.24
811.009	24043.15
811.396	26271.34
811.784	26812.61
812.171	24322.28
812.559	23511.59
812.946	24649.96
813.334	25953.38
813.721	23929.07
814.108	21895.06
814.496	22615.95
814.883	23902.37
815.27	25057.73
815.657	22637.79
816.044	21994.58
816.431	23887.81
816.818	25346.57
817.205	23829.56
817.592	22572.26
817.979	22608.66
818.365	23931.5
818.752	22691.19
819.139	20671.74
819.525	20463
819.912	21094.08
820.298	21152.33
820.685	19341.62
821.071	17499.36
821.457	17385.28
821.843	17703.25
822.23	17300.33
822.616	15069.71
823.002	13962.9
823.388	13686.2
823.774	14101.25
824.16	13225.02
824.546	11749.27
824.931	11615.78
825.317	12492
825.703	12407.05
826.089	11511.4
826.474	10557.51
826.86	11127.9
827.245	11788.11
827.631	11183.73
828.016	10574.5
828.401	10113.32
828.787	10394.88
829.172	10545.37
829.557	10072.06
829.942	9205.54
830.327	9317.2
830.712	9618.17
831.097	9368.17
831.482	8615.73
831.867	8021.06
832.252	8227.37
832.636	8521.07
833.021	8244.36
833.406	7399.69
833.79	7312.31
834.175	7938.53
834.559	8351.16
834.944	7703.09
835.328	7207.94
835.713	6996.77
836.097	7307.46
836.481	7004.05
836.865	6438.51
837.249	6050.15
837.633	5906.95
838.017	6159.38
838.401	5965.2
838.785	5127.81
839.169	4812.27
839.553	4703.05
839.937	4836.54
840.32	4428.77
840.704	3974.88
841.087	3754
841.471	3637.5
841.854	3872.94
842.238	3496.72
842.621	3101.08
843.004	3035.54
843.388	3122.92
843.771	3283.12
844.154	3232.15
844.537	2894.77
844.92	2792.82
845.303	2948.16
845.686	3173.9
846.069	2902.05
846.452	2732.14
846.834	2739.42
847.217	2926.32
847.6	3067.1
847.982	2829.23
848.365	2542.82
848.748	2385.05
849.13	2501.56
849.512	2673.89
849.895	2627.77
850.277	2292.81
850.659	2278.25
851.041	2394.76
851.423	2525.83
851.806	2326.8
852.188	1996.69
852.57	2074.36
852.951	2142.33
853.333	2232.13
853.715	2166.6
854.097	1974.85
854.479	1785.53
854.86	1945.72
855.242	1972.42
855.623	1693.29
856.005	1654.46
856.386	1523.39
856.768	1562.22
857.149	1671.45
857.53	1562.22
857.911	1244.25
858.292	1152.02
858.674	1273.38
859.055	1389.89
859.436	1147.17
859.817	1033.09
860.197	899.59
860.578	1059.79
860.959	1186
861.34	1057.36
861.72	843.76
862.101	783.08
862.482	877.74
862.862	952.99
863.243	892.31
863.623	807.35
864.003	756.38
864.384	843.76
864.764	860.75
865.144	846.19
865.524	739.39
865.904	644.73
866.284	705.41
866.664	647.16
867.044	673.86
867.424	639.88
867.804	608.32
868.183	635.02
868.563	567.06
868.943	540.36
869.322	528.22
869.702	484.53
870.081	564.63
870.461	545.21
870.84	610.75
871.22	474.83
871.599	404.44
871.978	397.15
872.357	385.02
872.736	462.69
873.115	409.29
873.494	338.9
873.873	368.03
874.252	351.04
874.631	375.31
875.01	365.6
875.388	241.81
875.767	241.81
876.146	290.36
876.524	324.34
876.903	270.94
877.281	297.64
877.66	244.24
878.038	239.38
878.416	258.8
878.794	321.91
879.173	256.38
879.551	229.68
879.929	178.7
880.307	270.94
880.685	205.4
881.063	212.69
881.441	253.95
881.818	156.86
882.196	198.12
882.574	164.14
882.951	205.4
883.329	193.27
883.707	210.26
884.084	171.42
884.461	253.95
884.839	253.95
885.216	202.98
885.593	147.15
885.971	178.7
886.348	195.69
886.725	185.99
887.102	193.27
887.479	229.68
887.856	198.12
888.233	246.67
888.609	181.13
888.986	161.71
889.363	135.01
889.74	195.69
890.116	190.84
890.493	215.11
890.869	122.88
891.246	181.13
891.622	205.4
891.998	139.87
892.375	244.24
892.751	132.59
893.127	200.55
893.503	178.7
893.879	156.86
894.255	205.4
894.631	135.01
895.007	154.43
895.383	147.15
895.759	195.69
896.134	207.83
896.51	181.13
896.886	127.73
897.261	198.12
897.637	147.15
898.012	169
898.388	173.85
898.763	173.85
899.138	135.01
899.514	149.58
899.889	98.61
900.264	173.85
900.639	105.89
901.014	181.13
901.389	222.39
901.764	115.6
902.139	154.43
902.513	171.42
902.888	142.3
903.263	198.12
903.638	130.16
904.012	120.45
904.387	144.72
904.761	164.14
905.136	207.83
905.51	207.83
905.884	159.29
906.259	132.59
906.633	113.17
907.007	185.99
907.381	176.28
907.755	156.86
908.129	135.01
908.503	193.27
908.877	169
909.251	219.97
909.624	45.21
909.998	147.15
910.372	79.19
910.745	156.86
911.119	188.41
911.492	164.14
911.866	96.18
912.239	127.73
912.612	185.99
912.986	159.29
913.359	159.29
913.732	127.73
914.105	130.16
914.478	198.12
914.851	132.59
915.224	161.71
915.597	108.31
915.97	207.83
916.343	234.53
916.715	166.57
917.088	135.01
917.461	156.86
917.833	103.46
918.206	188.41
918.578	171.42
918.951	173.85
919.323	190.84
919.695	176.28
920.067	171.42
920.44	125.31
920.812	113.17
921.184	181.13
921.556	200.55
921.928	156.86
922.3	127.73
922.672	166.57
923.043	84.04
923.415	120.45
923.787	110.74
924.158	171.42
924.53	154.43
924.901	246.67
925.273	86.47
925.644	147.15
926.016	135.01
926.387	67.05
926.758	161.71
927.129	280.65
927.5	183.56
927.872	88.9
928.243	103.46
928.613	115.6
928.984	93.75
929.355	122.88
929.726	185.99
930.097	45.21
930.467	108.31
930.838	171.42
931.209	178.7
931.579	164.14
931.95	154.43
932.32	130.16
932.69	84.04
933.061	103.46
933.431	183.56
933.801	210.26
934.171	118.02
934.541	185.99
934.911	171.42
935.281	147.15
935.651	161.71
936.021	183.56
936.391	108.31
936.761	115.6
937.13	190.84
937.5	132.59
937.87	115.6
938.239	125.31
938.609	120.45
938.978	173.85
939.347	169
939.717	159.29
940.086	156.86
940.455	135.01
940.824	149.58
941.193	130.16
941.562	202.98
941.931	152
942.3	188.41
942.669	176.28
943.038	149.58
943.407	159.29
943.775	166.57
944.144	91.32
944.513	176.28
944.881	176.28
945.25	132.59
945.618	139.87
945.986	193.27
946.355	171.42
946.723	84.04
947.091	205.4
947.459	137.44
947.827	161.71
948.195	207.83
948.563	154.43
948.931	171.42
949.299	139.87
949.667	110.74
950.035	25.79
950.402	127.73
950.77	125.31
951.138	135.01
951.505	149.58
951.873	164.14
952.24	103.46
952.607	147.15
952.975	132.59
953.342	149.58
953.709	198.12
954.076	200.55
954.443	103.46
954.81	125.31
955.177	152
955.544	152
955.911	169
956.278	125.31
956.645	137.44
957.012	149.58
957.378	161.71
957.745	185.99
958.111	137.44
958.478	156.86
958.844	154.43
959.211	98.61
959.577	149.58
959.943	183.56
960.309	212.69
960.675	181.13
961.042	161.71
961.408	161.71
961.774	159.29
962.139	149.58
962.505	122.88
962.871	152
963.237	195.69
963.603	190.84
963.968	125.31
964.334	156.86
964.699	183.56
965.065	98.61
965.43	132.59
965.796	98.61
966.161	137.44
966.526	166.57
966.891	178.7
967.256	132.59
967.622	188.41
967.987	113.17
968.352	96.18
968.716	173.85
969.081	185.99
969.446	79.19
969.811	181.13
970.176	181.13
970.54	176.28
970.905	188.41
971.269	229.68
971.634	171.42
971.998	135.01
972.363	195.69
972.727	200.55
973.091	183.56
973.455	217.54
973.819	149.58
974.183	161.71
974.547	188.41
974.911	181.13
975.275	190.84
975.639	215.11
976.003	156.86
976.367	152
976.73	169
977.094	110.74
977.458	137.44
977.821	115.6
978.185	127.73
978.548	62.2
978.911	181.13
979.275	227.25
979.638	130.16
980.001	195.69
980.364	185.99
980.727	137.44
981.09	127.73
981.453	110.74
981.816	122.88
982.179	202.98
982.542	67.05
982.905	135.01
983.267	164.14
983.63	169
983.992	222.39
984.355	84.04
984.717	110.74
985.08	219.97
985.442	120.45
985.804	105.89
986.167	176.28
986.529	110.74
986.891	135.01
987.253	91.32
987.615	207.83
987.977	161.71
988.339	212.69
988.701	178.7
989.062	137.44
989.424	93.75
989.786	98.61
990.147	118.02
990.509	139.87
990.87	164.14
991.232	120.45
991.593	115.6
991.955	105.89
992.316	127.73
992.677	132.59
993.038	149.58
993.399	154.43
993.76	171.42
994.121	161.71
994.482	144.72
994.843	166.57
995.204	217.54
995.565	96.18
995.926	181.13
996.286	219.97
996.647	156.86
997.007	122.88
997.368	188.41
997.728	164.14
998.089	144.72
998.449	202.98
998.809	205.4
999.169	173.85
999.53	105.89
999.89	115.6
1000.25	207.83
1000.61	149.58
1000.97	96.18
1001.329	195.69
1001.689	105.89
1002.049	108.31
1002.409	173.85
1002.768	125.31
1003.128	127.73
1003.487	86.47
1003.847	181.13
1004.206	164.14
1004.566	195.69
1004.925	164.14
1005.284	188.41
1005.643	132.59
1006.003	74.33
1006.362	115.6
1006.721	178.7
1007.08	195.69
1007.438	118.02
1007.797	212.69
1008.156	190.84
1008.515	178.7
1008.874	132.59
1009.232	178.7
1009.591	142.3
1009.949	137.44
1010.308	169
1010.666	135.01
1011.024	202.98
1011.383	154.43
1011.741	113.17
1012.099	105.89
1012.457	178.7
1012.815	198.12
1013.173	164.14
1013.531	122.88
1013.889	164.14
1014.247	110.74
1014.605	149.58
1014.962	166.57
1015.32	171.42
1015.678	152
1016.035	154.43
1016.393	118.02
1016.75	173.85
1017.107	115.6
1017.465	137.44
1017.822	118.02
1018.179	205.4
1018.536	173.85
1018.894	108.31
1019.251	222.39
1019.608	193.27
1019.964	105.89
1020.321	171.42
1020.678	181.13
1021.035	127.73
1021.392	127.73
1021.748	178.7
1022.105	118.02
1022.461	166.57
1022.818	161.71
1023.174	98.61
1023.531	130.16
1023.887	122.88
1024.243	183.56
1024.599	115.6
1024.955	118.02
1025.311	171.42
1025.667	154.43
1026.023	164.14
1026.379	137.44
1026.735	198.12
1027.091	127.73
1027.447	130.16
