189.514	145.79
189.973	145.79
190.431	145.79
190.889	5.01
191.348	-7.13
191.806	-33.83
192.264	-19.27
192.722	14.72
193.18	-33.83
193.638	-43.54
194.096	-31.4
194.554	-87.23
195.012	2.58
195.47	9.86
195.928	31.71
196.385	0.15
196.843	-16.84
197.301	2.58
197.758	58.41
198.216	17.14
198.674	-11.98
199.131	106.95
199.589	87.53
200.046	72.97
200.503	-11.98
200.961	97.24
201.418	102.1
201.875	102.1
202.332	131.22
202.79	128.79
203.247	165.2
203.704	126.37
204.161	111.8
204.618	89.96
205.075	68.11
205.532	162.78
205.989	184.62
206.445	150.64
206.902	148.21
207.359	150.64
207.816	58.41
208.272	160.35
208.729	148.21
209.185	145.79
209.642	99.67
210.098	114.23
210.555	184.62
211.011	182.19
211.467	172.48
211.924	121.51
212.38	126.37
212.836	109.38
213.292	145.79
213.748	182.19
214.204	162.78
214.66	99.67
215.116	126.37
215.572	123.94
216.028	177.34
216.484	121.51
216.94	170.06
217.396	102.1
217.851	150.64
218.307	85.1
218.763	102.1
219.218	150.64
219.674	177.34
220.129	191.9
220.585	177.34
221.04	109.38
221.496	201.61
221.951	208.89
222.406	97.24
222.861	150.64
223.317	145.79
223.772	133.65
224.227	140.93
224.682	145.79
225.137	136.08
225.592	199.18
226.047	140.93
226.502	143.36
226.957	82.68
227.411	140.93
227.866	119.09
228.321	170.06
228.776	182.19
229.23	89.96
229.685	133.65
230.139	123.94
230.594	150.64
231.048	131.22
231.503	136.08
231.957	155.49
232.411	89.96
232.865	114.23
233.32	155.49
233.774	121.51
234.228	104.52
234.682	97.24
235.136	89.96
235.59	82.68
236.044	165.2
236.498	218.6
236.952	70.54
237.406	123.94
237.86	148.21
238.313	182.19
238.767	179.77
239.221	133.65
239.674	148.21
240.128	92.39
240.581	116.66
241.035	131.22
241.488	128.79
241.942	143.36
242.395	114.23
242.848	153.07
243.301	87.53
243.755	204.04
244.208	150.64
244.661	143.36
245.114	121.51
245.567	162.78
246.02	136.08
246.473	128.79
246.926	143.36
247.379	126.37
247.832	94.81
248.284	145.79
248.737	165.2
249.19	121.51
249.642	97.24
250.095	51.12
250.547	136.08
251	87.53
251.452	106.95
251.905	136.08
252.357	128.79
252.81	155.49
253.262	111.8
253.714	165.2
254.166	109.38
254.618	201.61
255.07	182.19
255.523	145.79
255.975	128.79
256.427	89.96
256.878	111.8
257.33	114.23
257.782	102.1
258.234	174.91
258.686	194.33
259.137	179.77
259.589	160.35
260.041	138.5
260.492	104.52
260.944	140.93
261.395	116.66
261.847	225.88
262.298	179.77
262.749	157.92
263.201	174.91
263.652	174.91
264.103	157.92
264.554	114.23
265.005	97.24
265.457	106.95
265.908	123.94
266.359	133.65
266.809	133.65
267.26	172.48
267.711	138.5
268.162	116.66
268.613	150.64
269.064	116.66
269.514	94.81
269.965	102.1
270.415	157.92
270.866	170.06
271.316	167.63
271.767	68.11
272.217	119.09
272.668	235.59
273.118	157.92
273.568	140.93
274.019	140.93
274.469	82.68
274.919	177.34
275.369	245.3
275.819	153.07
276.269	136.08
276.719	196.76
277.169	133.65
277.619	153.07
278.069	150.64
278.518	114.23
278.968	138.5
279.418	206.47
279.867	138.5
280.317	172.48
280.767	114.23
281.216	184.62
281.666	218.6
282.115	89.96
282.564	184.62
283.014	160.35
283.463	126.37
283.912	143.36
284.361	131.22
284.811	148.21
285.26	172.48
285.709	126.37
286.158	145.79
286.607	145.79
287.056	160.35
287.505	148.21
287.953	143.36
288.402	221.03
288.851	75.4
289.3	121.51
289.748	126.37
290.197	133.65
290.646	194.33
291.094	133.65
291.543	87.53
291.991	153.07
292.439	177.34
292.888	211.32
293.336	191.9
293.784	230.74
294.233	121.51
294.681	172.48
295.129	102.1
295.577	102.1
296.025	119.09
296.473	174.91
296.921	131.22
297.369	148.21
297.817	104.52
298.264	138.5
298.712	233.17
299.16	140.93
299.608	75.4
300.055	121.51
300.503	230.74
300.95	208.89
301.398	111.8
301.845	89.96
302.293	126.37
302.74	121.51
303.187	157.92
303.635	184.62
304.082	155.49
304.529	138.5
304.976	143.36
305.423	128.79
305.87	162.78
306.317	123.94
306.764	123.94
307.211	119.09
307.658	109.38
308.105	136.08
308.552	160.35
308.998	148.21
309.445	138.5
309.892	114.23
310.338	204.04
310.785	148.21
311.231	131.22
311.678	216.17
312.124	182.19
312.571	92.39
313.017	184.62
313.463	172.48
313.909	89.96
314.356	128.79
314.802	111.8
315.248	155.49
315.694	121.51
316.14	102.1
316.586	148.21
317.032	121.51
317.478	65.69
317.923	162.78
318.369	155.49
318.815	133.65
319.261	119.09
319.706	157.92
320.152	150.64
320.597	143.36
321.043	182.19
321.488	123.94
321.934	165.2
322.379	104.52
322.824	165.2
323.27	160.35
323.715	196.76
324.16	160.35
324.605	43.84
325.05	162.78
325.495	182.19
325.94	128.79
326.385	92.39
326.83	136.08
327.275	194.33
327.72	116.66
328.165	165.2
328.61	177.34
329.054	223.46
329.499	116.66
329.943	123.94
330.388	145.79
330.832	126.37
331.277	106.95
331.721	191.9
332.166	155.49
332.61	97.24
333.054	187.05
333.499	116.66
333.943	160.35
334.387	170.06
334.831	131.22
335.275	162.78
335.719	104.52
336.163	165.2
336.607	80.25
337.051	162.78
337.495	179.77
337.938	143.36
338.382	143.36
338.826	136.08
339.269	111.8
339.713	114.23
340.157	104.52
340.6	150.64
341.044	140.93
341.487	157.92
341.93	109.38
342.374	87.53
342.817	259.86
343.26	165.2
343.703	182.19
344.146	128.79
344.59	211.32
345.033	245.3
345.476	187.05
345.919	126.37
346.361	85.1
346.804	157.92
347.247	170.06
347.69	157.92
348.133	177.34
348.575	119.09
349.018	109.38
349.461	148.21
349.903	170.06
350.346	116.66
350.788	99.67
351.23	136.08
351.673	114.23
352.115	157.92
352.557	138.5
353	92.39
353.442	80.25
353.884	211.32
354.326	138.5
354.768	174.91
355.21	155.49
355.652	153.07
356.094	187.05
356.536	157.92
356.978	145.79
357.419	170.06
357.861	157.92
358.303	204.04
358.744	109.38
359.186	111.8
359.627	121.51
360.069	184.62
360.51	85.1
360.952	177.34
361.393	111.8
361.834	170.06
362.276	167.63
362.717	133.65
363.158	174.91
363.599	148.21
364.04	109.38
364.481	143.36
364.922	177.34
365.363	121.51
365.804	145.79
366.245	208.89
366.686	153.07
367.126	114.23
367.567	123.94
368.008	145.79
368.448	155.49
368.889	184.62
369.33	94.81
369.77	148.21
370.21	143.36
370.651	58.41
371.091	116.66
371.531	240.45
371.972	177.34
372.412	165.2
372.852	123.94
373.292	128.79
373.732	126.37
374.172	133.65
374.612	170.06
375.052	179.77
375.492	131.22
375.932	148.21
376.372	116.66
376.811	150.64
377.251	150.64
377.691	87.53
378.13	194.33
378.57	247.73
379.009	167.63
379.449	184.62
379.888	123.94
380.328	194.33
380.767	150.64
381.206	167.63
381.645	199.18
382.085	157.92
382.524	109.38
382.963	109.38
383.402	150.64
383.841	94.81
384.28	58.41
384.719	119.09
385.158	119.09
385.596	150.64
386.035	136.08
386.474	165.2
386.913	121.51
387.351	165.2
387.79	213.75
388.228	133.65
388.667	187.05
389.105	160.35
389.544	145.79
389.982	182.19
390.42	245.3
390.859	114.23
391.297	111.8
391.735	123.94
392.173	167.63
392.611	157.92
393.049	136.08
393.487	77.82
393.925	114.23
394.363	150.64
394.801	165.2
395.239	131.22
395.676	121.51
396.114	155.49
396.552	177.34
396.989	97.24
397.427	114.23
397.864	167.63
398.302	160.35
398.739	160.35
399.177	65.69
399.614	138.5
400.051	99.67
400.488	143.36
400.926	116.66
401.363	51.12
401.8	174.91
402.237	179.77
402.674	157.92
403.111	174.91
403.548	68.11
403.985	136.08
404.421	150.64
404.858	111.8
405.295	138.5
405.732	116.66
406.168	145.79
406.605	75.4
407.041	145.79
407.478	148.21
407.914	155.49
408.351	114.23
408.787	126.37
409.223	133.65
409.66	114.23
410.096	133.65
410.532	87.53
410.968	138.5
411.404	116.66
411.84	228.31
412.276	150.64
412.712	143.36
413.148	99.67
413.584	53.55
414.02	140.93
414.455	123.94
414.891	177.34
415.327	160.35
415.762	111.8
416.198	172.48
416.633	116.66
417.069	145.79
417.504	148.21
417.94	104.52
418.375	111.8
418.81	138.5
419.245	170.06
419.681	157.92
420.116	155.49
420.551	123.94
420.986	133.65
421.421	131.22
421.856	121.51
422.291	85.1
422.726	170.06
423.16	182.19
423.595	109.38
424.03	162.78
424.464	114.23
424.899	162.78
425.334	68.11
425.768	138.5
426.203	155.49
426.637	68.11
427.071	136.08
427.506	123.94
427.94	116.66
428.374	150.64
428.809	162.78
429.243	187.05
429.677	148.21
430.111	162.78
430.545	153.07
430.979	177.34
431.413	138.5
431.847	182.19
432.28	114.23
432.714	184.62
433.148	123.94
433.582	208.89
434.015	106.95
434.449	111.8
434.882	160.35
435.316	114.23
435.749	204.04
436.183	111.8
436.616	189.48
437.049	138.5
437.483	126.37
437.916	138.5
438.349	104.52
438.782	133.65
439.215	104.52
439.648	75.4
440.081	165.2
440.514	160.35
440.947	196.76
441.38	104.52
441.813	153.07
442.245	196.76
442.678	174.91
443.111	150.64
443.543	252.58
443.976	126.37
444.408	106.95
444.841	172.48
445.273	211.32
445.705	240.45
446.138	208.89
446.57	228.31
447.002	252.58
447.434	157.92
447.867	221.03
448.299	264.72
448.731	284.14
449.163	208.89
449.595	191.9
450.026	250.16
450.458	206.47
450.89	242.87
451.322	208.89
451.754	174.91
452.185	211.32
452.617	259.86
453.048	233.17
453.48	274.43
453.911	250.16
454.343	145.79
454.774	228.31
455.205	206.47
455.637	172.48
456.068	216.17
456.499	286.56
456.93	269.57
457.361	206.47
457.792	276.86
458.223	308.41
458.654	252.58
459.085	259.86
459.516	230.74
459.947	206.47
460.378	191.9
460.808	228.31
461.239	191.9
461.669	238.02
462.1	189.48
462.531	257.44
462.961	174.91
463.391	172.48
463.822	204.04
464.252	218.6
464.682	276.86
465.113	240.45
465.543	174.91
465.973	196.76
466.403	177.34
466.833	235.59
467.263	131.22
467.693	279.28
468.123	199.18
468.553	208.89
468.983	189.48
469.412	174.91
469.842	240.45
470.272	218.6
470.701	170.06
471.131	174.91
471.56	240.45
471.99	255.01
472.419	208.89
472.849	199.18
473.278	160.35
473.707	138.5
474.136	189.48
474.566	179.77
474.995	221.03
475.424	189.48
475.853	228.31
476.282	255.01
476.711	257.44
477.14	196.76
477.569	191.9
477.997	216.17
478.426	148.21
478.855	206.47
479.283	259.86
479.712	189.48
480.141	199.18
480.569	174.91
480.998	216.17
481.426	255.01
481.854	182.19
482.283	250.16
482.711	138.5
483.139	204.04
483.567	172.48
483.995	160.35
484.424	153.07
484.852	179.77
485.28	211.32
485.708	230.74
486.135	208.89
486.563	174.91
486.991	191.9
487.419	145.79
487.847	179.77
488.274	187.05
488.702	182.19
489.129	170.06
489.557	150.64
489.984	177.34
490.412	157.92
490.839	204.04
491.266	182.19
491.694	191.9
492.121	204.04
492.548	133.65
492.975	143.36
493.402	136.08
493.829	182.19
494.256	167.63
494.683	170.06
495.11	131.22
495.537	189.48
495.964	189.48
496.39	262.29
496.817	167.63
497.244	194.33
497.67	179.77
498.097	99.67
498.523	145.79
498.95	97.24
499.376	157.92
499.803	140.93
500.229	136.08
500.655	119.09
501.081	138.5
501.508	165.2
501.934	206.47
502.36	225.88
502.786	138.5
503.212	157.92
503.638	221.03
504.064	191.9
504.489	153.07
504.915	138.5
505.341	160.35
505.767	162.78
506.192	216.17
506.618	145.79
507.043	160.35
507.469	97.24
507.894	155.49
508.32	172.48
508.745	240.45
509.17	121.51
509.596	201.61
510.021	167.63
510.446	94.81
510.871	31.71
511.296	170.06
511.721	194.33
512.146	148.21
512.571	157.92
512.996	148.21
513.421	123.94
513.845	153.07
514.27	162.78
514.695	167.63
515.119	104.52
515.544	102.1
515.969	111.8
516.393	182.19
516.817	199.18
517.242	223.46
517.666	153.07
518.09	172.48
518.515	157.92
518.939	194.33
519.363	395.79
519.787	201.61
520.211	191.9
520.635	201.61
521.059	177.34
521.483	208.89
521.907	148.21
522.331	148.21
522.754	191.9
523.178	228.31
523.602	211.32
524.025	179.77
524.449	138.5
524.872	187.05
525.296	194.33
525.719	157.92
526.143	225.88
526.566	150.64
526.989	184.62
527.412	218.6
527.836	140.93
528.259	187.05
528.682	131.22
529.105	123.94
529.528	145.79
529.951	162.78
530.374	85.1
530.796	167.63
531.219	184.62
531.642	191.9
532.065	184.62
532.487	174.91
532.91	174.91
533.332	167.63
533.755	106.95
534.177	177.34
534.6	145.79
535.022	138.5
535.444	189.48
535.867	187.05
536.289	172.48
536.711	191.9
537.133	189.48
537.555	199.18
537.977	204.04
538.399	155.49
538.821	150.64
539.243	213.75
539.665	208.89
540.086	189.48
540.508	228.31
540.93	182.19
541.351	201.61
541.773	216.17
542.195	284.14
542.616	211.32
543.037	155.49
543.459	187.05
543.88	194.33
544.301	228.31
544.723	267.15
545.144	208.89
545.565	191.9
545.986	174.91
546.407	259.86
546.828	167.63
547.249	255.01
547.67	177.34
548.091	213.75
548.512	136.08
548.932	145.79
549.353	189.48
549.774	194.33
550.194	206.47
550.615	106.95
551.035	191.9
551.456	216.17
551.876	184.62
552.296	228.31
552.717	162.78
553.137	133.65
553.557	172.48
553.977	157.92
554.397	97.24
554.817	167.63
555.237	148.21
555.657	179.77
556.077	182.19
556.497	153.07
556.917	153.07
557.337	208.89
557.756	172.48
558.176	238.02
558.596	131.22
559.015	174.91
559.435	179.77
559.854	131.22
560.274	242.87
560.693	148.21
561.112	114.23
561.532	189.48
561.951	191.9
562.37	211.32
562.789	160.35
563.208	182.19
563.627	165.2
564.046	196.76
564.465	150.64
564.884	138.5
565.303	150.64
565.722	201.61
566.14	172.48
566.559	157.92
566.978	206.47
567.396	221.03
567.815	194.33
568.233	162.78
568.652	174.91
569.07	191.9
569.489	204.04
569.907	199.18
570.325	184.62
570.743	199.18
571.161	87.53
571.58	143.36
571.998	160.35
572.416	170.06
572.833	153.07
573.251	153.07
573.669	225.88
574.087	136.08
574.505	133.65
574.922	165.2
575.34	189.48
575.758	177.34
576.175	187.05
576.593	126.37
577.01	172.48
577.428	106.95
577.845	1509.88
578.262	252.58
578.68	133.65
579.097	201.61
579.514	128.79
579.931	123.94
580.348	157.92
580.765	148.21
581.182	99.67
581.599	138.5
582.016	155.49
582.433	272
582.849	233.17
583.266	162.78
583.683	170.06
584.099	196.76
584.516	145.79
584.933	240.45
585.349	114.23
585.765	206.47
586.182	109.38
586.598	160.35
587.014	143.36
587.431	194.33
587.847	177.34
588.263	148.21
588.679	131.22
589.095	157.92
589.511	189.48
589.927	177.34
590.343	136.08
590.759	170.06
591.174	92.39
591.59	196.76
592.006	167.63
592.421	109.38
592.837	123.94
593.252	189.48
593.668	174.91
594.083	155.49
594.499	150.64
594.914	131.22
595.329	223.46
595.745	250.16
596.16	162.78
596.575	208.89
596.99	218.6
597.405	162.78
597.82	136.08
598.235	77.82
598.65	145.79
599.065	150.64
599.479	170.06
599.894	72.97
600.309	138.5
600.724	182.19
601.138	150.64
601.553	191.9
601.967	216.17
602.382	191.9
602.796	157.92
603.21	230.74
603.625	157.92
604.039	104.52
604.453	133.65
604.867	189.48
605.281	184.62
605.695	162.78
606.109	191.9
606.523	126.37
606.937	213.75
607.351	269.57
607.765	165.2
608.178	155.49
608.592	165.2
609.006	255.01
609.419	160.35
609.833	177.34
610.246	206.47
610.66	194.33
611.073	242.87
611.487	230.74
611.9	204.04
612.313	177.34
612.726	196.76
613.139	157.92
613.553	206.47
613.966	179.77
614.379	80.25
614.792	104.52
615.204	148.21
615.617	211.32
616.03	160.35
616.443	148.21
616.856	170.06
617.268	189.48
617.681	199.18
618.093	123.94
618.506	165.2
618.918	153.07
619.331	102.1
619.743	170.06
620.155	177.34
620.568	126.37
620.98	136.08
621.392	97.24
621.804	104.52
622.216	65.69
622.628	140.93
623.04	191.9
623.452	63.26
623.864	194.33
624.276	218.6
624.687	194.33
625.099	174.91
625.511	102.1
625.922	245.3
626.334	182.19
626.745	138.5
627.157	184.62
627.568	145.79
627.979	182.19
628.391	174.91
628.802	208.89
629.213	167.63
629.624	189.48
630.035	160.35
630.446	187.05
630.857	160.35
631.268	191.9
631.679	148.21
632.09	133.65
632.501	99.67
632.912	204.04
633.322	221.03
633.733	116.66
634.144	148.21
634.554	126.37
634.965	225.88
635.375	106.95
635.785	153.07
636.196	136.08
636.606	140.93
637.016	150.64
637.427	157.92
637.837	189.48
638.247	184.62
638.657	162.78
639.067	143.36
639.477	116.66
639.887	187.05
640.297	189.48
640.706	189.48
641.116	145.79
641.526	184.62
641.935	143.36
642.345	157.92
642.755	121.51
643.164	162.78
643.573	213.75
643.983	167.63
644.392	160.35
644.801	179.77
645.211	150.64
645.62	172.48
646.029	184.62
646.438	184.62
646.847	167.63
647.256	126.37
647.665	148.21
648.074	196.76
648.483	179.77
648.892	262.29
649.3	133.65
649.709	155.49
650.118	218.6
650.526	242.87
650.935	165.2
651.343	119.09
651.752	138.5
652.16	116.66
652.568	123.94
652.977	123.94
653.385	221.03
653.793	167.63
654.201	174.91
654.609	104.52
655.017	128.79
655.425	167.63
655.833	111.8
656.241	187.05
656.649	177.34
657.057	172.48
657.464	182.19
657.872	189.48
658.28	150.64
658.687	184.62
659.095	150.64
659.502	182.19
659.91	170.06
660.317	111.8
660.724	150.64
661.132	131.22
661.539	177.34
661.946	216.17
662.353	150.64
662.76	196.76
663.167	170.06
663.574	182.19
663.981	138.5
664.388	179.77
664.795	155.49
665.202	194.33
665.608	162.78
666.015	70.54
666.422	194.33
666.828	204.04
667.235	157.92
667.641	174.91
668.047	153.07
668.454	140.93
668.86	167.63
669.266	126.37
669.673	128.79
670.079	167.63
670.485	136.08
670.891	162.78
671.297	172.48
671.703	131.22
672.109	230.74
672.515	206.47
672.92	165.2
673.326	155.49
673.732	126.37
674.138	189.48
674.543	138.5
674.949	128.79
675.354	155.49
675.76	153.07
676.165	111.8
676.57	140.93
676.976	157.92
677.381	162.78
677.786	177.34
678.191	116.66
678.596	194.33
679.001	102.1
679.406	157.92
679.811	77.82
680.216	179.77
680.621	235.59
681.026	170.06
681.43	94.81
681.835	114.23
682.24	157.92
682.644	174.91
683.049	123.94
683.453	92.39
683.858	194.33
684.262	179.77
684.667	109.38
685.071	104.52
685.475	153.07
685.879	128.79
686.283	155.49
686.687	140.93
687.091	87.53
687.495	172.48
687.899	155.49
688.303	126.37
688.707	167.63
689.111	80.25
689.514	172.48
689.918	155.49
690.322	206.47
690.725	167.63
691.129	75.4
691.532	145.79
691.936	160.35
692.339	167.63
692.742	225.88
693.146	184.62
693.549	143.36
693.952	182.19
694.355	211.32
694.758	179.77
695.161	126.37
695.564	177.34
695.967	165.2
696.37	104.52
696.773	138.5
697.175	165.2
697.578	126.37
697.981	172.48
698.383	133.65
698.786	201.61
699.188	153.07
699.591	179.77
699.993	177.34
700.395	187.05
700.798	191.9
701.2	170.06
701.602	257.44
702.004	191.9
702.406	194.33
702.808	131.22
703.21	177.34
703.612	245.3
704.014	208.89
704.416	252.58
704.818	196.76
705.219	160.35
705.621	250.16
706.023	170.06
706.424	250.16
706.826	172.48
707.227	123.94
707.629	157.92
708.03	208.89
708.431	206.47
708.832	167.63
709.234	201.61
709.635	174.91
710.036	279.28
710.437	191.9
710.838	213.75
711.239	155.49
711.64	191.9
712.041	172.48
712.441	242.87
712.842	284.14
713.243	279.28
713.643	255.01
714.044	255.01
714.445	233.17
714.845	303.55
715.246	303.55
715.646	228.31
716.046	235.59
716.447	344.82
716.847	371.52
717.247	390.93
717.647	325.4
718.047	284.14
718.447	284.14
718.847	286.56
719.247	269.57
719.647	330.25
720.047	339.96
720.446	327.83
720.846	322.97
721.246	344.82
721.645	310.84
722.045	417.63
722.444	383.65
722.844	359.38
723.243	349.67
723.643	407.93
724.042	466.18
724.441	439.48
724.84	434.62
725.24	437.05
725.639	373.94
726.038	480.74
726.437	424.92
726.836	393.36
727.234	505.01
727.633	502.59
728.032	449.19
728.431	512.3
728.83	483.17
729.228	536.57
729.627	492.88
730.025	628.8
730.424	602.1
730.822	738.03
731.22	665.21
731.619	750.16
732.017	740.45
732.415	871.52
732.813	873.95
733.212	995.31
733.61	1041.43
734.008	1051.14
734.406	1250.17
734.803	1390.95
735.201	1543.87
735.599	1645.81
735.997	1961.35
736.395	1941.93
736.792	2230.77
737.19	2342.42
737.587	2264.75
737.985	2228.34
738.382	2279.31
738.78	2131.25
739.177	2165.23
739.574	2041.45
739.971	1847.27
740.369	1623.96
740.766	1784.16
741.163	1560.86
741.56	1585.13
741.957	1660.37
742.354	1781.73
742.751	2070.57
743.147	2412.81
743.544	2798.74
743.941	3497.78
744.338	3912.83
744.734	4488.09
745.131	5213.83
745.527	6017.24
745.924	6711.42
746.32	7449.3
746.716	7784.25
747.113	8364.36
747.509	8604.65
747.905	8662.91
748.301	8619.22
748.697	8216.3
749.093	7818.23
749.489	7306.09
749.885	6611.91
750.281	6111.9
750.677	5400.72
751.073	4852.17
751.468	4512.36
751.864	4196.82
752.26	4184.68
752.655	4286.63
753.051	4704.11
753.446	5774.51
753.842	6852.2
754.237	8143.48
754.632	9747.88
755.028	11403.24
755.423	13269.78
755.818	15068.35
756.213	16599.92
756.608	17859.65
757.003	19456.77
757.398	20017.45
757.793	20393.67
758.188	20454.35
758.583	20745.62
758.977	20248.04
759.372	19357.25
759.767	18701.9
760.161	17714.02
760.556	16087.78
760.95	14689.7
761.345	12823.17
761.739	11675.09
762.133	10369.25
762.527	9502.73
762.922	9075.54
763.316	9136.22
763.71	10002.73
764.104	11128.97
764.498	13022.2
764.892	15180
765.286	17857.23
765.68	21211.65
766.073	24597.62
766.467	27973.89
766.861	32122.01
767.255	35966.73
767.648	38838.13
768.042	41231.38
768.435	42918.3
768.829	44056.66
769.222	44241.13
769.615	44182.88
770.008	41877.02
770.402	40003.2
770.795	37010.44
771.188	33779.8
771.581	30799.17
771.974	26629.21
772.367	23328.18
772.76	20284.45
773.153	17369.35
773.545	15500.39
773.938	14189.69
774.331	13869.3
774.724	14415.42
775.116	16000.4
775.509	18201.89
775.901	21381.55
776.294	25185.01
776.686	29117.11
777.078	34243.4
777.471	39879.41
777.863	45355.23
778.255	50629.58
778.647	54634.5
779.039	56513.17
779.431	57289.88
779.823	58027.75
780.215	58561.74
780.607	57695.22
780.999	57736.49
781.39	55357.81
781.782	54066.53
782.174	50437.83
782.565	47161.08
782.957	42894.02
783.348	38340.55
783.74	33473.97
784.131	28699.63
784.522	25784.53
784.914	22546.62
785.305	20604.84
785.696	19777.16
786.087	19233.46
786.478	19823.28
786.869	20927.66
787.26	22891.28
787.651	26733.58
788.042	29682.65
788.433	33415.72
788.823	36568.68
789.214	39964.37
789.605	43124.61
789.995	46275.14
790.386	46930.49
790.776	49481.5
791.167	50132
791.557	52127.18
791.948	52583.49
792.338	51588.33
792.728	51525.23
793.118	49163.54
793.508	46088.25
793.898	43476.56
794.288	39685.24
794.678	35879.35
795.068	31796.76
795.458	27626.8
795.848	24218.98
796.238	20811.16
796.627	18772.29
797.017	17063.52
797.406	16010.11
797.796	16391.18
798.185	17099.93
798.575	18650.93
798.964	20653.39
799.354	23939.84
799.743	26949.6
800.132	31221.51
800.521	35325.94
800.91	39384.26
801.299	42032.36
801.688	45551.83
802.077	48622.27
802.466	50911.14
802.855	51233.96
803.244	50391.71
803.633	50525.21
804.021	50243.65
804.41	48544.6
804.799	46241.16
805.187	42583.34
805.576	38559
805.964	35221.57
806.352	30624.41
806.741	27466.6
807.129	23587.9
807.517	20777.17
807.905	18092.67
808.293	15580.49
808.681	13667.84
809.069	12701.81
809.457	12359.57
809.845	12262.48
810.233	13199.39
810.621	14311.05
811.009	15995.55
811.396	18029.56
811.784	20772.32
812.171	23284.49
812.559	26231.14
812.946	28427.78
813.334	32032.2
813.721	33449.7
814.108	35100.21
814.496	36573.54
814.883	38347.84
815.27	40826.03
815.657	40316.31
816.044	40915.84
816.431	39624.55
816.818	37624.52
817.205	35794.4
817.592	33840.48
817.979	30774.9
818.365	27714.18
818.752	24126.74
819.139	20595.13
819.525	18342.67
819.912	15473.69
820.298	13116.86
820.685	11162.95
821.071	9609.52
821.457	8296.4
821.843	7716.29
822.23	7427.45
822.616	7451.72
823.002	7871.63
823.388	8352.22
823.774	9493.02
824.16	10636.24
824.546	11587.71
824.931	13393.56
825.317	14925.14
825.703	16092.64
826.089	17476.15
826.474	18534.42
826.86	19073.26
827.245	20138.81
827.631	20291.73
828.016	20740.77
828.401	20231.05
828.787	20250.47
829.172	19061.13
829.557	17813.54
829.942	16815.95
830.327	15141.16
830.712	13638.71
831.097	12400.83
831.482	11075.57
831.867	9277
832.252	8204.16
832.636	6898.32
833.021	5750.24
833.406	5068.19
833.79	4196.82
834.175	3890.99
834.559	3774.48
834.944	3456.52
835.328	3602.15
835.713	3577.88
836.097	3968.66
836.481	4512.36
836.865	4997.8
837.249	5733.25
837.633	6143.45
838.017	6740.55
838.401	7153.18
838.785	7752.7
839.169	7689.59
839.553	8323.1
839.937	8536.69
840.32	8369.21
840.704	8138.63
841.087	8029.4
841.471	7602.21
841.854	7366.77
842.238	7034.24
842.621	6616.76
843.004	6012.38
843.388	5539.07
843.771	5138.58
844.154	4624.01
844.537	4039.05
844.92	3587.59
845.303	3075.44
845.686	2633.69
846.069	2252.61
846.452	2102.13
846.834	1767.17
847.217	1563.28
847.6	1500.18
847.982	1364.25
848.365	1444.35
848.748	1548.72
849.13	1606.97
849.512	1740.47
849.895	1946.78
850.277	2150.67
850.659	2400.67
851.041	2602.13
851.423	2937.09
851.806	2988.06
852.188	3211.37
852.57	3245.35
852.951	3509.92
853.333	3638.56
853.715	3713.8
854.097	3466.23
854.479	3548.75
854.86	3330.3
855.242	3167.68
855.623	2932.24
856.005	2718.64
856.386	2621.55
856.768	2339.99
857.149	2036.59
857.53	1830.28
857.911	1796.3
858.292	1437.07
858.674	1264.73
859.055	1128.81
859.436	1046.28
859.817	835.12
860.197	679.77
860.578	614.24
860.959	621.52
861.34	650.65
861.72	636.08
862.101	582.69
862.482	633.66
862.862	660.36
863.243	750.16
863.623	869.1
864.003	924.92
864.384	871.52
864.764	971.04
865.144	971.04
865.524	1012.3
865.904	1116.67
866.284	1121.53
866.664	1143.37
867.044	1085.12
867.424	1026.87
867.804	1126.38
868.183	1121.53
868.563	922.5
868.943	966.19
869.322	854.53
869.702	854.53
870.081	779.29
870.461	706.47
870.84	708.9
871.22	531.71
871.599	490.45
871.978	529.29
872.357	386.08
872.736	441.91
873.115	352.1
873.494	308.41
873.873	349.67
874.252	305.98
874.631	371.52
875.01	342.39
875.388	293.85
875.767	267.15
876.146	301.13
876.524	359.38
876.903	383.65
877.281	320.55
877.66	369.09
878.038	403.07
878.416	320.55
878.794	240.45
879.173	313.26
879.551	298.7
879.929	313.26
880.307	322.97
880.685	320.55
881.063	276.86
881.441	320.55
881.818	284.14
882.196	272
882.574	267.15
882.951	284.14
883.329	238.02
883.707	242.87
884.084	250.16
884.461	279.28
884.839	267.15
885.216	293.85
885.593	167.63
885.971	177.34
886.348	131.22
886.725	206.47
887.102	155.49
887.479	208.89
887.856	187.05
888.233	128.79
888.609	128.79
888.986	143.36
889.363	221.03
889.74	165.2
890.116	145.79
890.493	235.59
890.869	167.63
891.246	230.74
891.622	150.64
891.998	143.36
892.375	177.34
892.751	204.04
893.127	184.62
893.503	201.61
893.879	242.87
894.255	148.21
894.631	123.94
895.007	191.9
895.383	89.96
895.759	136.08
896.134	123.94
896.51	157.92
896.886	189.48
897.261	128.79
897.637	167.63
898.012	126.37
898.388	148.21
898.763	114.23
899.138	184.62
899.514	165.2
899.889	133.65
900.264	172.48
900.639	228.31
901.014	153.07
901.389	167.63
901.764	114.23
902.139	170.06
902.513	199.18
902.888	114.23
903.263	191.9
903.638	145.79
904.012	138.5
904.387	148.21
904.761	157.92
905.136	51.12
905.51	131.22
905.884	153.07
906.259	194.33
906.633	128.79
907.007	119.09
907.381	191.9
907.755	150.64
908.129	167.63
908.503	104.52
908.877	189.48
909.251	126.37
909.624	138.5
909.998	116.66
910.372	119.09
910.745	136.08
911.119	138.5
911.492	97.24
911.866	72.97
912.239	211.32
912.612	162.78
912.986	174.91
913.359	172.48
913.732	189.48
914.105	189.48
914.478	119.09
914.851	82.68
915.224	133.65
915.597	94.81
915.97	111.8
916.343	99.67
916.715	143.36
917.088	136.08
917.461	140.93
917.833	187.05
918.206	143.36
918.578	77.82
918.951	157.92
919.323	165.2
919.695	187.05
920.067	201.61
920.44	43.84
920.812	177.34
921.184	133.65
921.556	126.37
921.928	55.98
922.3	157.92
922.672	196.76
923.043	194.33
923.415	206.47
923.787	123.94
924.158	138.5
924.53	157.92
924.901	204.04
925.273	53.55
925.644	85.1
926.016	167.63
926.387	121.51
926.758	218.6
927.129	191.9
927.5	123.94
927.872	206.47
928.243	104.52
928.613	51.12
928.984	177.34
929.355	92.39
929.726	123.94
930.097	106.95
930.467	145.79
930.838	114.23
931.209	121.51
931.579	106.95
931.95	150.64
932.32	157.92
932.69	250.16
933.061	170.06
933.431	119.09
933.801	177.34
934.171	160.35
934.541	89.96
934.911	172.48
935.281	109.38
935.651	126.37
936.021	170.06
936.391	116.66
936.761	136.08
937.13	102.1
937.5	177.34
937.87	170.06
938.239	99.67
938.609	182.19
938.978	133.65
939.347	211.32
939.717	148.21
940.086	109.38
940.455	128.79
940.824	102.1
941.193	63.26
941.562	206.47
941.931	109.38
942.3	157.92
942.669	75.4
943.038	58.41
943.407	63.26
943.775	153.07
944.144	182.19
944.513	119.09
944.881	150.64
945.25	174.91
945.618	111.8
945.986	123.94
946.355	155.49
946.723	157.92
947.091	123.94
947.459	116.66
947.827	128.79
948.195	106.95
948.563	140.93
948.931	172.48
949.299	109.38
949.667	184.62
950.035	126.37
950.402	119.09
950.77	116.66
951.138	114.23
951.505	191.9
951.873	99.67
952.24	128.79
952.607	201.61
952.975	106.95
953.342	145.79
953.709	150.64
954.076	119.09
954.443	70.54
954.81	179.77
955.177	131.22
955.544	75.4
955.911	126.37
956.278	92.39
956.645	182.19
957.012	174.91
957.378	208.89
957.745	121.51
958.111	155.49
958.478	194.33
958.844	143.36
959.211	119.09
959.577	160.35
959.943	189.48
960.309	218.6
960.675	99.67
961.042	182.19
961.408	85.1
961.774	148.21
962.139	138.5
962.505	189.48
962.871	247.73
963.237	148.21
963.603	174.91
963.968	111.8
964.334	187.05
964.699	143.36
965.065	109.38
965.43	140.93
965.796	128.79
966.161	167.63
966.526	68.11
966.891	143.36
967.256	126.37
967.622	136.08
967.987	196.76
968.352	128.79
968.716	150.64
969.081	119.09
969.446	140.93
969.811	119.09
970.176	102.1
970.54	167.63
970.905	26.85
971.269	87.53
971.634	150.64
971.998	160.35
972.363	136.08
972.727	104.52
973.091	116.66
973.455	145.79
973.819	48.7
974.183	160.35
974.547	165.2
974.911	174.91
975.275	179.77
975.639	150.64
976.003	153.07
976.367	34.13
976.73	153.07
977.094	123.94
977.458	216.17
977.821	189.48
978.185	97.24
978.548	157.92
978.911	133.65
979.275	116.66
979.638	145.79
980.001	138.5
980.364	155.49
980.727	145.79
981.09	138.5
981.453	172.48
981.816	116.66
982.179	235.59
982.542	114.23
982.905	167.63
983.267	109.38
983.63	199.18
983.992	111.8
984.355	109.38
984.717	143.36
985.08	92.39
985.442	123.94
985.804	123.94
986.167	182.19
986.529	143.36
986.891	114.23
987.253	121.51
987.615	184.62
987.977	109.38
988.339	80.25
988.701	162.78
989.062	136.08
989.424	208.89
989.786	167.63
990.147	206.47
990.509	138.5
990.87	182.19
991.232	172.48
991.593	111.8
991.955	116.66
992.316	126.37
992.677	126.37
993.038	194.33
993.399	89.96
993.76	155.49
994.121	119.09
994.482	121.51
994.843	143.36
995.204	138.5
995.565	126.37
995.926	148.21
996.286	128.79
996.647	119.09
997.007	145.79
997.368	150.64
997.728	121.51
998.089	162.78
998.449	136.08
998.809	136.08
999.169	114.23
999.53	111.8
999.89	119.09
1000.25	109.38
1000.61	136.08
1000.97	116.66
1001.329	155.49
1001.689	133.65
1002.049	157.92
1002.409	119.09
1002.768	150.64
1003.128	165.2
1003.487	143.36
1003.847	143.36
1004.206	26.85
1004.566	70.54
1004.925	140.93
1005.284	114.23
1005.643	85.1
1006.003	138.5
1006.362	157.92
1006.721	160.35
1007.08	143.36
1007.438	123.94
1007.797	126.37
1008.156	102.1
1008.515	131.22
1008.874	143.36
1009.232	133.65
1009.591	155.49
1009.949	211.32
1010.308	131.22
1010.666	155.49
1011.024	111.8
1011.383	126.37
1011.741	60.83
1012.099	121.51
1012.457	77.82
1012.815	128.79
1013.173	143.36
1013.531	150.64
1013.889	153.07
1014.247	191.9
1014.605	140.93
1014.962	102.1
1015.32	162.78
1015.678	94.81
1016.035	138.5
1016.393	123.94
1016.75	172.48
1017.107	131.22
1017.465	143.36
1017.822	167.63
1018.179	85.1
1018.536	162.78
1018.894	99.67
1019.251	104.52
1019.608	221.03
1019.964	148.21
1020.321	157.92
1020.678	133.65
1021.035	121.51
1021.392	150.64
1021.748	94.81
1022.105	97.24
1022.461	89.96
1022.818	138.5
1023.174	174.91
1023.531	179.77
1023.887	116.66
1024.243	131.22
1024.599	145.79
1024.955	111.8
1025.311	92.39
1025.667	94.81
1026.023	94.81
1026.379	80.25
1026.735	133.65
1027.091	179.77
1027.447	179.77
