189.514	119.24
189.973	119.24
190.431	119.24
190.889	36.71
191.348	-31.25
191.806	-67.66
192.264	41.57
192.722	43.99
193.18	-21.54
193.638	-55.52
194.096	-23.97
194.554	-53.1
195.012	-70.09
195.47	36.71
195.928	-40.96
196.385	31.86
196.843	17.29
197.301	12.44
197.758	7.59
198.216	-57.95
198.674	39.14
199.131	92.54
199.589	99.82
200.046	-4.55
200.503	70.69
200.961	73.12
201.418	126.52
201.875	46.42
202.332	56.13
202.79	119.24
203.247	104.67
203.704	167.78
204.161	116.81
204.618	148.36
205.075	167.78
205.532	187.2
205.989	133.8
206.445	94.97
206.902	124.09
207.359	201.76
207.816	133.8
208.272	150.79
208.729	189.63
209.185	94.97
209.642	213.9
210.098	109.53
210.555	114.38
211.011	177.49
211.467	153.22
211.924	141.08
212.38	153.22
212.836	155.65
213.292	167.78
213.748	145.94
214.204	111.96
214.66	133.8
215.116	165.35
215.572	99.82
216.028	116.81
216.484	150.79
216.94	128.95
217.396	114.38
217.851	119.24
218.307	104.67
218.763	128.95
219.218	162.93
219.674	213.9
220.129	158.07
220.585	192.05
221.04	97.39
221.496	119.24
221.951	114.38
222.406	109.53
222.861	63.41
223.317	109.53
223.772	92.54
224.227	148.36
224.682	128.95
225.137	175.06
225.592	99.82
226.047	102.25
226.502	189.63
226.957	116.81
227.411	124.09
227.866	68.27
228.321	153.22
228.776	119.24
229.23	90.11
229.685	165.35
230.139	80.4
230.594	90.11
231.048	102.25
231.503	172.64
231.957	155.65
232.411	128.95
232.865	136.23
233.32	170.21
233.774	160.5
234.228	70.69
234.682	158.07
235.136	141.08
235.59	150.79
236.044	116.81
236.498	158.07
236.952	138.66
237.406	75.55
237.86	126.52
238.313	150.79
238.767	97.39
239.221	99.82
239.674	87.68
240.128	121.66
240.581	87.68
241.035	206.62
241.488	175.06
241.942	158.07
242.395	111.96
242.848	155.65
243.301	119.24
243.755	189.63
244.208	145.94
244.661	126.52
245.114	128.95
245.567	143.51
246.02	128.95
246.473	124.09
246.926	192.05
247.379	116.81
247.832	104.67
248.284	172.64
248.737	158.07
249.19	124.09
249.642	99.82
250.095	75.55
250.547	131.37
251	107.1
251.452	63.41
251.905	109.53
252.357	216.33
252.81	126.52
253.262	114.38
253.714	133.8
254.166	114.38
254.618	138.66
255.07	97.39
255.523	99.82
255.975	133.8
256.427	138.66
256.878	204.19
257.33	138.66
257.782	167.78
258.234	165.35
258.686	131.37
259.137	116.81
259.589	192.05
260.041	158.07
260.492	155.65
260.944	126.52
261.395	143.51
261.847	94.97
262.298	141.08
262.749	148.36
263.201	213.9
263.652	124.09
264.103	48.85
264.554	111.96
265.005	119.24
265.457	184.77
265.908	119.24
266.359	109.53
266.809	182.35
267.26	141.08
267.711	162.93
268.162	111.96
268.613	138.66
269.064	102.25
269.514	148.36
269.965	104.67
270.415	111.96
270.866	133.8
271.316	82.83
271.767	162.93
272.217	99.82
272.668	99.82
273.118	167.78
273.568	104.67
274.019	136.23
274.469	162.93
274.919	143.51
275.369	92.54
275.819	116.81
276.269	143.51
276.719	170.21
277.169	182.35
277.619	153.22
278.069	153.22
278.518	145.94
278.968	121.66
279.418	160.5
279.867	116.81
280.317	138.66
280.767	145.94
281.216	160.5
281.666	121.66
282.115	201.76
282.564	192.05
283.014	109.53
283.463	223.61
283.912	165.35
284.361	189.63
284.811	175.06
285.26	155.65
285.709	126.52
286.158	90.11
286.607	85.26
287.056	87.68
287.505	213.9
287.953	126.52
288.402	179.92
288.851	73.12
289.3	143.51
289.748	148.36
290.197	107.1
290.646	194.48
291.094	128.95
291.543	158.07
291.991	124.09
292.439	80.4
292.888	97.39
293.336	126.52
293.784	162.93
294.233	107.1
294.681	184.77
295.129	104.67
295.577	138.66
296.025	80.4
296.473	148.36
296.921	213.9
297.369	177.49
297.817	145.94
298.264	107.1
298.712	87.68
299.16	92.54
299.608	143.51
300.055	111.96
300.503	182.35
300.95	150.79
301.398	126.52
301.845	170.21
302.293	116.81
302.74	109.53
303.187	111.96
303.635	138.66
304.082	155.65
304.529	184.77
304.976	143.51
305.423	184.77
305.87	155.65
306.317	90.11
306.764	94.97
307.211	167.78
307.658	160.5
308.105	126.52
308.552	153.22
308.998	141.08
309.445	116.81
309.892	187.2
310.338	138.66
310.785	116.81
311.231	70.69
311.678	141.08
312.124	126.52
312.571	192.05
313.017	141.08
313.463	87.68
313.909	116.81
314.356	187.2
314.802	102.25
315.248	172.64
315.694	170.21
316.14	114.38
316.586	148.36
317.032	160.5
317.478	128.95
317.923	119.24
318.369	158.07
318.815	126.52
319.261	104.67
319.706	201.76
320.152	128.95
320.597	133.8
321.043	148.36
321.488	184.77
321.934	213.9
322.379	128.95
322.824	99.82
323.27	116.81
323.715	92.54
324.16	116.81
324.605	102.25
325.05	116.81
325.495	119.24
325.94	99.82
326.385	153.22
326.83	85.26
327.275	58.56
327.72	172.64
328.165	107.1
328.61	75.55
329.054	121.66
329.499	116.81
329.943	107.1
330.388	126.52
330.832	85.26
331.277	189.63
331.721	201.76
332.166	226.04
332.61	175.06
333.054	143.51
333.499	97.39
333.943	150.79
334.387	160.5
334.831	155.65
335.275	104.67
335.719	189.63
336.163	124.09
336.607	170.21
337.051	165.35
337.495	111.96
337.938	175.06
338.382	160.5
338.826	155.65
339.269	131.37
339.713	143.51
340.157	136.23
340.6	124.09
341.044	133.8
341.487	92.54
341.93	114.38
342.374	153.22
342.817	194.48
343.26	162.93
343.703	187.2
344.146	104.67
344.59	104.67
345.033	223.61
345.476	87.68
345.919	107.1
346.361	136.23
346.804	162.93
347.247	104.67
347.69	170.21
348.133	68.27
348.575	121.66
349.018	177.49
349.461	143.51
349.903	104.67
350.346	92.54
350.788	167.78
351.23	148.36
351.673	141.08
352.115	143.51
352.557	194.48
353	199.34
353.442	201.76
353.884	170.21
354.326	124.09
354.768	48.85
355.21	121.66
355.652	153.22
356.094	90.11
356.536	63.41
356.978	153.22
357.419	165.35
357.861	145.94
358.303	194.48
358.744	184.77
359.186	145.94
359.627	107.1
360.069	126.52
360.51	170.21
360.952	97.39
361.393	109.53
361.834	160.5
362.276	189.63
362.717	155.65
363.158	109.53
363.599	148.36
364.04	175.06
364.481	97.39
364.922	116.81
365.363	126.52
365.804	136.23
366.245	177.49
366.686	155.65
367.126	211.47
367.567	160.5
368.008	143.51
368.448	128.95
368.889	141.08
369.33	160.5
369.77	119.24
370.21	82.83
370.651	192.05
371.091	216.33
371.531	155.65
371.972	153.22
372.412	153.22
372.852	167.78
373.292	128.95
373.732	109.53
374.172	160.5
374.612	141.08
375.052	99.82
375.492	131.37
375.932	109.53
376.372	145.94
376.811	172.64
377.251	145.94
377.691	158.07
378.13	153.22
378.57	155.65
379.009	184.77
379.449	189.63
379.888	138.66
380.328	160.5
380.767	107.1
381.206	131.37
381.645	182.35
382.085	73.12
382.524	119.24
382.963	201.76
383.402	182.35
383.841	182.35
384.28	136.23
384.719	155.65
385.158	121.66
385.596	104.67
386.035	165.35
386.474	158.07
386.913	150.79
387.351	162.93
387.79	77.97
388.228	77.97
388.667	179.92
389.105	184.77
389.544	136.23
389.982	158.07
390.42	102.25
390.859	116.81
391.297	170.21
391.735	109.53
392.173	153.22
392.611	126.52
393.049	213.9
393.487	97.39
393.925	170.21
394.363	167.78
394.801	172.64
395.239	124.09
395.676	65.84
396.114	131.37
396.552	114.38
396.989	165.35
397.427	124.09
397.864	213.9
398.302	162.93
398.739	182.35
399.177	85.26
399.614	126.52
400.051	143.51
400.488	158.07
400.926	77.97
401.363	114.38
401.8	48.85
402.237	124.09
402.674	143.51
403.111	148.36
403.548	153.22
403.985	150.79
404.421	172.64
404.858	148.36
405.295	167.78
405.732	114.38
406.168	133.8
406.605	109.53
407.041	148.36
407.478	165.35
407.914	143.51
408.351	162.93
408.787	216.33
409.223	109.53
409.66	175.06
410.096	182.35
410.532	192.05
410.968	126.52
411.404	133.8
411.84	184.77
412.276	143.51
412.712	153.22
413.148	179.92
413.584	121.66
414.02	126.52
414.455	102.25
414.891	97.39
415.327	131.37
415.762	150.79
416.198	184.77
416.633	213.9
417.069	141.08
417.504	138.66
417.94	107.1
418.375	131.37
418.81	90.11
419.245	131.37
419.681	102.25
420.116	158.07
420.551	97.39
420.986	63.41
421.421	107.1
421.856	138.66
422.291	102.25
422.726	82.83
423.16	128.95
423.595	109.53
424.03	170.21
424.464	119.24
424.899	87.68
425.334	85.26
425.768	119.24
426.203	141.08
426.637	226.04
427.071	133.8
427.506	131.37
427.94	97.39
428.374	107.1
428.809	92.54
429.243	133.8
429.677	155.65
430.111	162.93
430.545	138.66
430.979	116.81
431.413	116.81
431.847	141.08
432.28	131.37
432.714	114.38
433.148	121.66
433.582	213.9
434.015	114.38
434.449	170.21
434.882	77.97
435.316	162.93
435.749	189.63
436.183	155.65
436.616	136.23
437.049	128.95
437.483	143.51
437.916	143.51
438.349	138.66
438.782	187.2
439.215	155.65
439.648	167.78
440.081	175.06
440.514	177.49
440.947	211.47
441.38	148.36
441.813	167.78
442.245	184.77
442.678	187.2
443.111	204.19
443.543	165.35
443.976	165.35
444.408	162.93
444.841	211.47
445.273	138.66
445.705	199.34
446.138	145.94
446.57	221.18
447.002	126.52
447.434	238.17
447.867	102.25
448.299	141.08
448.731	184.77
449.163	230.89
449.595	199.34
450.026	192.05
450.458	155.65
450.89	238.17
451.322	262.44
451.754	211.47
452.185	162.93
452.617	226.04
453.048	281.86
453.48	179.92
453.911	296.42
454.343	204.19
454.774	175.06
455.205	228.46
455.637	209.04
456.068	189.63
456.499	230.89
456.93	165.35
457.361	218.75
457.792	172.64
458.223	279.43
458.654	218.75
459.085	184.77
459.516	158.07
459.947	155.65
460.378	201.76
460.808	182.35
461.239	255.16
461.669	182.35
462.1	155.65
462.531	250.31
462.961	196.91
463.391	211.47
463.822	211.47
464.252	189.63
464.682	213.9
465.113	170.21
465.543	196.91
465.973	240.6
466.403	184.77
466.833	175.06
467.263	175.06
467.693	252.73
468.123	206.62
468.553	240.6
468.983	182.35
469.412	153.22
469.842	184.77
470.272	116.81
470.701	133.8
471.131	160.5
471.56	211.47
471.99	155.65
472.419	172.64
472.849	141.08
473.278	155.65
473.707	170.21
474.136	192.05
474.566	213.9
474.995	192.05
475.424	182.35
475.853	126.52
476.282	143.51
476.711	196.91
477.14	199.34
477.569	160.5
477.997	201.76
478.426	148.36
478.855	184.77
479.283	150.79
479.712	167.78
480.141	187.2
480.569	194.48
480.998	211.47
481.426	209.04
481.854	184.77
482.283	194.48
482.711	107.1
483.139	238.17
483.567	199.34
483.995	111.96
484.424	274.58
484.852	116.81
485.28	165.35
485.708	182.35
486.135	158.07
486.563	121.66
486.991	213.9
487.419	170.21
487.847	199.34
488.274	194.48
488.702	204.19
489.129	189.63
489.557	99.82
489.984	158.07
490.412	196.91
490.839	77.97
491.266	107.1
491.694	153.22
492.121	221.18
492.548	223.61
492.975	238.17
493.402	245.45
493.829	141.08
494.256	201.76
494.683	138.66
495.11	211.47
495.537	233.32
495.964	160.5
496.39	116.81
496.817	138.66
497.244	204.19
497.67	99.82
498.097	148.36
498.523	172.64
498.95	131.37
499.376	109.53
499.803	107.1
500.229	165.35
500.655	150.79
501.081	126.52
501.508	165.35
501.934	167.78
502.36	87.68
502.786	187.2
503.212	221.18
503.638	175.06
504.064	153.22
504.489	160.5
504.915	111.96
505.341	138.66
505.767	167.78
506.192	143.51
506.618	143.51
507.043	126.52
507.469	175.06
507.894	189.63
508.32	199.34
508.745	196.91
509.17	136.23
509.596	182.35
510.021	128.95
510.446	165.35
510.871	119.24
511.296	170.21
511.721	162.93
512.146	107.1
512.571	90.11
512.996	145.94
513.421	213.9
513.845	77.97
514.27	175.06
514.695	68.27
515.119	192.05
515.544	104.67
515.969	201.76
516.393	165.35
516.817	145.94
517.242	233.32
517.666	136.23
518.09	167.78
518.515	126.52
518.939	138.66
519.363	408.08
519.787	184.77
520.211	158.07
520.635	148.36
521.059	107.1
521.483	126.52
521.907	131.37
522.331	102.25
522.754	204.19
523.178	196.91
523.602	194.48
524.025	114.38
524.449	145.94
524.872	87.68
525.296	121.66
525.719	143.51
526.143	204.19
526.566	165.35
526.989	133.8
527.412	172.64
527.836	136.23
528.259	114.38
528.682	148.36
529.105	145.94
529.528	102.25
529.951	80.4
530.374	189.63
530.796	165.35
531.219	175.06
531.642	145.94
532.065	145.94
532.487	162.93
532.91	172.64
533.332	192.05
533.755	167.78
534.177	119.24
534.6	170.21
535.022	213.9
535.444	128.95
535.867	206.62
536.289	189.63
536.711	160.5
537.133	201.76
537.555	192.05
537.977	162.93
538.399	233.32
538.821	165.35
539.243	206.62
539.665	131.37
540.086	211.47
540.508	189.63
540.93	182.35
541.351	141.08
541.773	187.2
542.195	162.93
542.616	218.75
543.037	194.48
543.459	230.89
543.88	124.09
544.301	196.91
544.723	230.89
545.144	247.88
545.565	267.3
545.986	206.62
546.407	201.76
546.828	153.22
547.249	165.35
547.67	124.09
548.091	114.38
548.512	189.63
548.932	211.47
549.353	216.33
549.774	218.75
550.194	116.81
550.615	131.37
551.035	187.2
551.456	272.15
551.876	184.77
552.296	165.35
552.717	175.06
553.137	107.1
553.557	138.66
553.977	85.26
554.397	182.35
554.817	114.38
555.237	187.2
555.657	104.67
556.077	184.77
556.497	184.77
556.917	216.33
557.337	175.06
557.756	165.35
558.176	138.66
558.596	153.22
559.015	211.47
559.435	155.65
559.854	107.1
560.274	189.63
560.693	196.91
561.112	136.23
561.532	145.94
561.951	184.77
562.37	194.48
562.789	143.51
563.208	148.36
563.627	133.8
564.046	102.25
564.465	182.35
564.884	199.34
565.303	170.21
565.722	128.95
566.14	177.49
566.559	82.83
566.978	187.2
567.396	199.34
567.815	213.9
568.233	192.05
568.652	162.93
569.07	172.64
569.489	187.2
569.907	153.22
570.325	111.96
570.743	141.08
571.161	138.66
571.58	87.68
571.998	211.47
572.416	141.08
572.833	182.35
573.251	177.49
573.669	128.95
574.087	172.64
574.505	172.64
574.922	162.93
575.34	250.31
575.758	90.11
576.175	167.78
576.593	179.92
577.01	175.06
577.428	170.21
577.845	1500.33
578.262	252.73
578.68	153.22
579.097	201.76
579.514	155.65
579.931	206.62
580.348	80.4
580.765	133.8
581.182	211.47
581.599	133.8
582.016	126.52
582.433	228.46
582.849	201.76
583.266	162.93
583.683	165.35
584.099	187.2
584.516	182.35
584.933	128.95
585.349	158.07
585.765	160.5
586.182	143.51
586.598	155.65
587.014	192.05
587.431	131.37
587.847	175.06
588.263	153.22
588.679	148.36
589.095	131.37
589.511	138.66
589.927	121.66
590.343	126.52
590.759	153.22
591.174	138.66
591.59	138.66
592.006	235.74
592.421	194.48
592.837	177.49
593.252	136.23
593.668	99.82
594.083	204.19
594.499	138.66
594.914	153.22
595.329	119.24
595.745	177.49
596.16	228.46
596.575	228.46
596.99	177.49
597.405	102.25
597.82	175.06
598.235	158.07
598.65	162.93
599.065	141.08
599.479	128.95
599.894	155.65
600.309	153.22
600.724	136.23
601.138	126.52
601.553	60.98
601.967	107.1
602.382	104.67
602.796	141.08
603.21	119.24
603.625	82.83
604.039	116.81
604.453	111.96
604.867	179.92
605.281	128.95
605.695	136.23
606.109	187.2
606.523	228.46
606.937	177.49
607.351	306.13
607.765	175.06
608.178	155.65
608.592	179.92
609.006	228.46
609.419	155.65
609.833	150.79
610.246	160.5
610.66	162.93
611.073	182.35
611.487	199.34
611.9	162.93
612.313	133.8
612.726	201.76
613.139	179.92
613.553	153.22
613.966	172.64
614.379	206.62
614.792	77.97
615.204	196.91
615.617	138.66
616.03	187.2
616.443	204.19
616.856	138.66
617.268	136.23
617.681	170.21
618.093	211.47
618.506	194.48
618.918	102.25
619.331	175.06
619.743	235.74
620.155	177.49
620.568	167.78
620.98	150.79
621.392	206.62
621.804	226.04
622.216	184.77
622.628	104.67
623.04	167.78
623.452	158.07
623.864	194.48
624.276	150.79
624.687	150.79
625.099	136.23
625.511	160.5
625.922	170.21
626.334	209.04
626.745	187.2
627.157	150.79
627.568	155.65
627.979	107.1
628.391	114.38
628.802	170.21
629.213	133.8
629.624	199.34
630.035	155.65
630.446	267.3
630.857	133.8
631.268	162.93
631.679	141.08
632.09	211.47
632.501	143.51
632.912	145.94
633.322	201.76
633.733	143.51
634.144	141.08
634.554	121.66
634.965	187.2
635.375	199.34
635.785	170.21
636.196	153.22
636.606	126.52
637.016	131.37
637.427	150.79
637.837	175.06
638.247	243.03
638.657	121.66
639.067	119.24
639.477	102.25
639.887	124.09
640.297	196.91
640.706	158.07
641.116	177.49
641.526	104.67
641.935	141.08
642.345	150.79
642.755	160.5
643.164	158.07
643.573	182.35
643.983	199.34
644.392	221.18
644.801	233.32
645.211	114.38
645.62	167.78
646.029	192.05
646.438	58.56
646.847	162.93
647.256	155.65
647.665	167.78
648.074	160.5
648.483	158.07
648.892	153.22
649.3	145.94
649.709	160.5
650.118	162.93
650.526	172.64
650.935	150.79
651.343	155.65
651.752	160.5
652.16	170.21
652.568	172.64
652.977	133.8
653.385	247.88
653.793	102.25
654.201	136.23
654.609	167.78
655.017	155.65
655.425	107.1
655.833	167.78
656.241	82.83
656.649	121.66
657.057	136.23
657.464	170.21
657.872	131.37
658.28	153.22
658.687	189.63
659.095	209.04
659.502	121.66
659.91	145.94
660.317	155.65
660.724	97.39
661.132	124.09
661.539	155.65
661.946	150.79
662.353	238.17
662.76	216.33
663.167	133.8
663.574	143.51
663.981	150.79
664.388	167.78
664.795	170.21
665.202	145.94
665.608	179.92
666.015	194.48
666.422	158.07
666.828	107.1
667.235	133.8
667.641	155.65
668.047	167.78
668.454	145.94
668.86	153.22
669.266	150.79
669.673	111.96
670.079	170.21
670.485	109.53
670.891	124.09
671.297	136.23
671.703	131.37
672.109	162.93
672.515	196.91
672.92	148.36
673.326	133.8
673.732	179.92
674.138	70.69
674.543	187.2
674.949	102.25
675.354	126.52
675.76	162.93
676.165	167.78
676.57	162.93
676.976	90.11
677.381	170.21
677.786	204.19
678.191	104.67
678.596	70.69
679.001	184.77
679.406	172.64
679.811	77.97
680.216	184.77
680.621	133.8
681.026	124.09
681.43	133.8
681.835	187.2
682.24	175.06
682.644	141.08
683.049	155.65
683.453	150.79
683.858	150.79
684.262	138.66
684.667	196.91
685.071	204.19
685.475	138.66
685.879	128.95
686.283	247.88
686.687	182.35
687.091	194.48
687.495	165.35
687.899	196.91
688.303	145.94
688.707	196.91
689.111	104.67
689.514	150.79
689.918	175.06
690.322	150.79
690.725	109.53
691.129	184.77
691.532	189.63
691.936	109.53
692.339	131.37
692.742	94.97
693.146	143.51
693.549	133.8
693.952	206.62
694.355	196.91
694.758	102.25
695.161	204.19
695.564	153.22
695.967	104.67
696.37	153.22
696.773	189.63
697.175	189.63
697.578	104.67
697.981	240.6
698.383	177.49
698.786	153.22
699.188	109.53
699.591	177.49
699.993	206.62
700.395	204.19
700.798	158.07
701.2	138.66
701.602	136.23
702.004	160.5
702.406	155.65
702.808	124.09
703.21	148.36
703.612	177.49
704.014	201.76
704.416	121.66
704.818	158.07
705.219	179.92
705.621	206.62
706.023	213.9
706.424	228.46
706.826	131.37
707.227	267.3
707.629	221.18
708.03	262.44
708.431	291.57
708.832	260.02
709.234	233.32
709.635	252.73
710.036	209.04
710.437	189.63
710.838	184.77
711.239	272.15
711.64	223.61
712.041	213.9
712.441	272.15
712.842	284.29
713.243	235.74
713.643	228.46
714.044	269.73
714.445	357.11
714.845	291.57
715.246	260.02
715.646	318.27
716.046	243.03
716.447	301.28
716.847	257.59
717.247	313.42
717.647	323.12
718.047	294
718.447	342.54
718.847	325.55
719.247	325.55
719.647	327.98
720.047	313.42
720.446	352.25
720.846	371.67
721.246	354.68
721.645	352.25
722.045	391.09
722.444	330.41
722.844	463.9
723.243	410.5
723.643	427.49
724.042	473.61
724.441	461.48
724.84	337.69
725.24	400.8
725.639	417.79
726.038	519.73
726.437	422.64
726.836	473.61
727.234	524.58
727.633	497.88
728.032	466.33
728.431	427.49
728.83	497.88
729.228	553.71
729.627	507.59
730.025	539.15
730.424	563.42
730.822	621.67
731.22	704.2
731.619	670.22
732.017	733.32
732.415	755.17
732.813	730.9
733.212	859.54
733.61	796.43
734.008	874.1
734.406	980.9
734.803	900.8
735.201	1048.86
735.599	1131.39
735.997	1179.93
736.395	1145.95
736.792	1294.01
737.19	1298.87
737.587	1422.66
737.985	1393.53
738.382	1578
738.78	1633.82
739.177	1747.9
739.574	1713.92
739.971	1883.83
740.369	1929.95
740.766	1959.07
741.163	1971.21
741.56	1917.81
741.957	2063.44
742.354	2148.4
742.751	2216.36
743.147	2303.74
743.544	2427.53
743.941	2517.33
744.338	2483.35
744.734	2541.61
745.131	2684.81
745.527	2726.07
745.924	2823.16
746.32	3000.35
746.716	3075.59
747.113	3128.99
747.509	3216.37
747.905	3352.3
748.301	3425.11
748.697	3483.37
749.093	3735.8
749.489	3784.34
749.885	3966.38
750.281	4053.76
750.677	4320.76
751.073	4386.29
751.468	4437.27
751.864	4597.46
752.26	4587.75
752.655	4677.56
753.051	4956.69
753.446	4983.39
753.842	5150.87
754.237	5247.96
754.632	5476.12
755.028	5473.69
755.423	5546.51
755.818	5524.66
756.213	5803.79
756.608	5699.42
757.003	5723.69
757.398	5723.69
757.793	6126.61
758.188	5828.06
758.583	6136.32
758.977	6090.2
759.372	6296.52
759.767	6636.33
760.161	6881.48
760.556	7090.22
760.95	7388.77
761.345	7653.34
761.739	8012.56
762.133	8371.79
762.527	8631.51
762.922	8738.3
763.316	9010.15
763.71	9146.08
764.104	9306.27
764.498	9582.98
764.892	9818.42
765.286	10267.45
765.68	10138.81
766.073	10527.17
766.467	10648.53
766.861	10985.91
767.255	11323.3
767.648	11471.36
768.042	11510.19
768.435	11842.72
768.829	11947.09
769.222	11976.22
769.615	12388.85
770.008	12301.47
770.402	12240.79
770.795	12466.52
771.188	12687.39
771.581	12728.66
771.974	12663.12
772.367	12646.13
772.76	12774.77
773.153	12267.48
773.545	12648.56
773.938	12854.87
774.331	13434.98
774.724	13214.1
775.116	13580.61
775.509	14201.98
775.901	15036.95
776.294	15437.44
776.686	15403.46
777.078	15536.95
777.471	16063.66
777.863	16925.32
778.255	17534.56
778.647	17952.04
779.039	18294.28
779.431	18160.78
779.823	18121.94
780.215	18410.78
780.607	17981.17
780.999	18694.77
781.39	18575.84
781.782	19022.44
782.174	18845.26
782.565	19274.88
782.957	19335.56
783.348	19524.88
783.74	19374.39
784.131	19216.62
784.522	19655.95
784.914	19408.37
785.305	19007.88
785.696	19066.13
786.087	18879.24
786.478	18677.78
786.869	17905.92
787.26	17736.02
787.651	17702.04
788.042	17473.88
788.433	16791.83
788.823	16534.54
789.214	16452.02
789.605	15867.06
789.995	15468.99
790.386	15163.16
790.776	15291.8
791.167	15274.81
791.557	15658.31
791.948	16107.35
792.338	16044.24
792.728	16447.16
793.118	16864.64
793.508	16779.69
793.898	16971.44
794.288	17134.07
794.678	16833.09
795.068	16803.96
795.458	16806.39
795.848	16333.08
796.238	16617.07
796.627	16566.1
797.017	16124.34
797.406	16386.48
797.796	16257.84
798.185	16529.69
798.575	16306.38
798.964	16553.96
799.354	16648.62
799.743	16646.19
800.132	16626.78
800.521	16459.3
800.91	16269.97
801.299	16376.77
801.688	16097.64
802.077	15842.78
802.466	15643.75
802.855	15381.61
803.244	14842.77
803.633	14777.23
804.021	14551.5
804.41	14333.05
804.799	13816.05
805.187	13522.36
805.576	13502.94
805.964	13240.8
806.352	12587.88
806.741	12301.47
807.129	12374.28
807.517	12449.53
807.905	12422.83
808.293	12218.94
808.681	11988.35
809.069	12109.72
809.457	12515.06
809.845	12403.41
810.233	12291.76
810.621	12199.52
811.009	12383.99
811.396	12403.41
811.784	12587.88
812.171	12595.16
812.559	12461.66
812.946	12228.65
813.334	11667.96
813.721	11498.06
814.108	11473.78
814.496	11209.22
814.883	11051.45
815.27	11165.53
815.657	11233.49
816.044	11143.68
816.431	10883.97
816.818	10818.43
817.205	10833
817.592	10677.65
817.979	10597.56
818.365	10437.36
818.752	9891.23
819.139	9604.82
819.525	9495.6
819.912	9272.29
820.298	8939.76
820.685	8784.42
821.071	8498.01
821.457	8340.24
821.843	7973.73
822.23	7597.51
822.616	7493.14
823.002	7061.09
823.388	6857.21
823.774	6735.85
824.16	6493.12
824.546	6466.42
824.931	6199.43
825.317	6085.35
825.703	6000.4
826.089	5966.42
826.474	5988.26
826.86	5660.59
827.245	5893.6
827.631	5859.62
828.016	5663.01
828.401	5449.42
828.787	5405.73
829.172	5257.67
829.557	5124.17
829.942	5058.63
830.327	4871.74
830.712	4738.24
831.097	4650.86
831.482	4629.02
831.867	4565.91
832.252	4381.44
832.636	4213.96
833.021	4240.66
833.406	4194.54
833.79	4112.02
834.175	4131.44
834.559	3908.13
834.944	3786.77
835.328	3779.49
835.713	3624.15
836.097	3544.05
836.481	3315.89
836.865	3335.31
837.249	3204.24
837.633	3209.09
838.017	2925.11
838.401	2908.12
838.785	2730.93
839.169	2747.92
839.553	2611.99
839.937	2604.71
840.32	2444.52
840.704	2444.52
841.087	2284.32
841.471	2238.2
841.854	2269.76
842.238	2116.84
842.621	2136.26
843.004	2184.8
843.388	2039.17
843.771	2014.9
844.154	1927.52
844.537	1959.07
844.92	2019.75
845.303	1895.96
845.686	1852.27
846.069	1755.19
846.452	1772.18
846.834	1733.34
847.217	1699.36
847.6	1760.04
847.982	1667.81
848.365	1551.3
848.748	1604.7
849.13	1531.88
849.512	1517.32
849.895	1522.17
850.277	1497.9
850.659	1449.36
851.041	1415.37
851.423	1466.35
851.806	1364.4
852.188	1318.29
852.57	1369.26
852.951	1337.7
853.333	1272.17
853.715	1284.3
854.097	1119.25
854.479	1179.93
854.86	1167.8
855.242	1216.34
855.623	1029.45
856.005	1036.73
856.386	1048.86
856.768	1010.03
857.149	1077.99
857.53	980.9
857.911	968.77
858.292	1031.87
858.674	920.22
859.055	946.92
859.436	954.2
859.817	893.52
860.197	847.4
860.578	813.42
860.959	740.61
861.34	769.73
861.72	789.15
862.101	747.89
862.482	740.61
862.862	755.17
863.243	813.42
863.623	723.62
864.003	711.48
864.384	694.49
864.764	786.72
865.144	653.23
865.524	641.09
865.904	541.57
866.284	689.63
866.664	597.4
867.044	611.96
867.424	602.25
867.804	524.58
868.183	607.11
868.563	534.29
868.943	483.32
869.322	480.89
869.702	502.74
870.081	449.34
870.461	466.33
870.84	478.47
871.22	403.22
871.599	456.62
871.978	459.05
872.357	412.93
872.736	478.47
873.115	446.91
873.494	398.37
873.873	395.94
874.252	408.08
874.631	364.39
875.01	366.81
875.388	340.11
875.767	281.86
876.146	320.7
876.524	369.24
876.903	313.42
877.281	313.42
877.66	332.83
878.038	298.85
878.416	277.01
878.794	274.58
879.173	274.58
879.551	245.45
879.929	315.84
880.307	267.3
880.685	209.04
881.063	277.01
881.441	310.99
881.818	235.74
882.196	230.89
882.574	260.02
882.951	238.17
883.329	204.19
883.707	182.35
884.084	182.35
884.461	221.18
884.839	243.03
885.216	213.9
885.593	228.46
885.971	233.32
886.348	243.03
886.725	206.62
887.102	216.33
887.479	145.94
887.856	153.22
888.233	243.03
888.609	218.75
888.986	177.49
889.363	223.61
889.74	255.16
890.116	250.31
890.493	201.76
890.869	148.36
891.246	97.39
891.622	133.8
891.998	196.91
892.375	260.02
892.751	179.92
893.127	184.77
893.503	114.38
893.879	138.66
894.255	145.94
894.631	228.46
895.007	162.93
895.383	194.48
895.759	177.49
896.134	92.54
896.51	170.21
896.886	250.31
897.261	170.21
897.637	206.62
898.012	165.35
898.388	160.5
898.763	143.51
899.138	102.25
899.514	119.24
899.889	170.21
900.264	196.91
900.639	153.22
901.014	94.97
901.389	172.64
901.764	116.81
902.139	138.66
902.513	187.2
902.888	160.5
903.263	82.83
903.638	97.39
904.012	148.36
904.387	187.2
904.761	124.09
905.136	189.63
905.51	184.77
905.884	167.78
906.259	121.66
906.633	218.75
907.007	184.77
907.381	194.48
907.755	138.66
908.129	184.77
908.503	226.04
908.877	201.76
909.251	109.53
909.624	124.09
909.998	107.1
910.372	201.76
910.745	160.5
911.119	141.08
911.492	136.23
911.866	170.21
912.239	150.79
912.612	162.93
912.986	167.78
913.359	141.08
913.732	172.64
914.105	179.92
914.478	170.21
914.851	114.38
915.224	162.93
915.597	192.05
915.97	145.94
916.343	209.04
916.715	121.66
917.088	165.35
917.461	138.66
917.833	184.77
918.206	104.67
918.578	204.19
918.951	119.24
919.323	165.35
919.695	192.05
920.067	148.36
920.44	94.97
920.812	75.55
921.184	94.97
921.556	209.04
921.928	87.68
922.3	143.51
922.672	170.21
923.043	92.54
923.415	133.8
923.787	175.06
924.158	187.2
924.53	223.61
924.901	216.33
925.273	150.79
925.644	131.37
926.016	165.35
926.387	114.38
926.758	170.21
927.129	196.91
927.5	128.95
927.872	184.77
928.243	177.49
928.613	143.51
928.984	177.49
929.355	126.52
929.726	92.54
930.097	80.4
930.467	133.8
930.838	221.18
931.209	109.53
931.579	175.06
931.95	182.35
932.32	128.95
932.69	107.1
933.061	165.35
933.431	218.75
933.801	128.95
934.171	63.41
934.541	167.78
934.911	136.23
935.281	143.51
935.651	133.8
936.021	167.78
936.391	126.52
936.761	158.07
937.13	97.39
937.5	177.49
937.87	153.22
938.239	126.52
938.609	175.06
938.978	138.66
939.347	153.22
939.717	53.7
940.086	124.09
940.455	111.96
940.824	109.53
941.193	126.52
941.562	165.35
941.931	116.81
942.3	184.77
942.669	196.91
943.038	160.5
943.407	121.66
943.775	128.95
944.144	114.38
944.513	158.07
944.881	153.22
945.25	136.23
945.618	167.78
945.986	175.06
946.355	109.53
946.723	104.67
947.091	158.07
947.459	99.82
947.827	99.82
948.195	114.38
948.563	209.04
948.931	179.92
949.299	160.5
949.667	172.64
950.035	162.93
950.402	145.94
950.77	148.36
951.138	138.66
951.505	170.21
951.873	65.84
952.24	131.37
952.607	143.51
952.975	87.68
953.342	138.66
953.709	119.24
954.076	85.26
954.443	211.47
954.81	170.21
955.177	145.94
955.544	126.52
955.911	145.94
956.278	233.32
956.645	189.63
957.012	136.23
957.378	162.93
957.745	136.23
958.111	143.51
958.478	196.91
958.844	204.19
959.211	99.82
959.577	102.25
959.943	184.77
960.309	177.49
960.675	194.48
961.042	116.81
961.408	148.36
961.774	175.06
962.139	131.37
962.505	97.39
962.871	126.52
963.237	160.5
963.603	155.65
963.968	182.35
964.334	213.9
964.699	114.38
965.065	153.22
965.43	170.21
965.796	92.54
966.161	109.53
966.526	160.5
966.891	133.8
967.256	192.05
967.622	143.51
967.987	107.1
968.352	165.35
968.716	145.94
969.081	114.38
969.446	70.69
969.811	177.49
970.176	213.9
970.54	209.04
970.905	153.22
971.269	213.9
971.634	153.22
971.998	136.23
972.363	167.78
972.727	133.8
973.091	102.25
973.455	116.81
973.819	172.64
974.183	162.93
974.547	138.66
974.911	58.56
975.275	80.4
975.639	145.94
976.003	189.63
976.367	172.64
976.73	177.49
977.094	148.36
977.458	141.08
977.821	109.53
978.185	97.39
978.548	121.66
978.911	175.06
979.275	121.66
979.638	143.51
980.001	114.38
980.364	94.97
980.727	119.24
981.09	150.79
981.453	99.82
981.816	116.81
982.179	247.88
982.542	167.78
982.905	172.64
983.267	128.95
983.63	209.04
983.992	172.64
984.355	85.26
984.717	172.64
985.08	114.38
985.442	153.22
985.804	211.47
986.167	204.19
986.529	141.08
986.891	162.93
987.253	160.5
987.615	128.95
987.977	155.65
988.339	99.82
988.701	114.38
989.062	85.26
989.424	94.97
989.786	27
990.147	165.35
990.509	136.23
990.87	138.66
991.232	179.92
991.593	124.09
991.955	70.69
992.316	60.98
992.677	175.06
993.038	111.96
993.399	204.19
993.76	119.24
994.121	92.54
994.482	75.55
994.843	158.07
995.204	133.8
995.565	92.54
995.926	116.81
996.286	104.67
996.647	104.67
997.007	102.25
997.368	131.37
997.728	119.24
998.089	182.35
998.449	148.36
998.809	145.94
999.169	162.93
999.53	104.67
999.89	124.09
1000.25	155.65
1000.61	141.08
1000.97	119.24
1001.329	60.98
1001.689	107.1
1002.049	165.35
1002.409	141.08
1002.768	128.95
1003.128	128.95
1003.487	167.78
1003.847	150.79
1004.206	177.49
1004.566	153.22
1004.925	143.51
1005.284	56.13
1005.643	148.36
1006.003	201.76
1006.362	77.97
1006.721	150.79
1007.08	124.09
1007.438	201.76
1007.797	143.51
1008.156	189.63
1008.515	150.79
1008.874	104.67
1009.232	99.82
1009.591	158.07
1009.949	126.52
1010.308	131.37
1010.666	158.07
1011.024	119.24
1011.383	170.21
1011.741	128.95
1012.099	150.79
1012.457	199.34
1012.815	158.07
1013.173	111.96
1013.531	153.22
1013.889	170.21
1014.247	94.97
1014.605	143.51
1014.962	199.34
1015.32	75.55
1015.678	116.81
1016.035	99.82
1016.393	162.93
1016.75	158.07
1017.107	177.49
1017.465	109.53
1017.822	51.28
1018.179	109.53
1018.536	150.79
1018.894	179.92
1019.251	68.27
1019.608	128.95
1019.964	116.81
1020.321	126.52
1020.678	111.96
1021.035	131.37
1021.392	136.23
1021.748	160.5
1022.105	133.8
1022.461	85.26
1022.818	138.66
1023.174	124.09
1023.531	170.21
1023.887	189.63
1024.243	43.99
1024.599	94.97
1024.955	119.24
1025.311	138.66
1025.667	97.39
1026.023	94.97
1026.379	99.82
1026.735	189.63
1027.091	126.52
1027.447	189.63
