189.514	94.05
189.973	94.05
190.431	94.05
190.889	43.08
191.348	-29.73
191.806	-24.88
192.264	-15.17
192.722	16.38
193.18	-32.16
193.638	26.09
194.096	23.67
194.554	-41.87
195.012	-20.02
195.47	-12.74
195.928	-41.87
196.385	-41.87
196.843	9.1
197.301	-39.44
197.758	47.94
198.216	50.36
198.674	38.23
199.131	33.37
199.589	-29.73
200.046	43.08
200.503	79.49
200.961	60.07
201.418	125.61
201.875	98.91
202.332	96.48
202.79	162.02
203.247	111.05
203.704	152.31
204.161	69.78
204.618	164.44
205.075	111.05
205.532	135.32
205.989	125.61
206.445	43.08
206.902	166.87
207.359	154.74
207.816	157.16
208.272	135.32
208.729	198.43
209.185	162.02
209.642	108.62
210.098	147.45
210.555	166.87
211.011	115.9
211.467	125.61
211.924	108.62
212.38	149.88
212.836	200.85
213.292	128.04
213.748	132.89
214.204	176.58
214.66	200.85
215.116	145.03
215.572	212.99
216.028	215.42
216.484	118.33
216.94	186.29
217.396	125.61
217.851	125.61
218.307	77.06
218.763	193.57
219.218	137.74
219.674	142.6
220.129	186.29
220.585	203.28
221.04	132.89
221.496	149.88
221.951	191.14
222.406	111.05
222.861	132.89
223.317	120.75
223.772	166.87
224.227	181.43
224.682	186.29
225.137	179.01
225.592	154.74
226.047	145.03
226.502	152.31
226.957	101.34
227.411	186.29
227.866	118.33
228.321	113.47
228.776	157.16
229.23	171.73
229.685	159.59
230.139	169.3
230.594	142.6
231.048	137.74
231.503	179.01
231.957	125.61
232.411	128.04
232.865	98.91
233.32	91.63
233.774	98.91
234.228	111.05
234.682	137.74
235.136	106.19
235.59	154.74
236.044	132.89
236.498	149.88
236.952	181.43
237.406	101.34
237.86	113.47
238.313	176.58
238.767	186.29
239.221	135.32
239.674	166.87
240.128	159.59
240.581	69.78
241.035	137.74
241.488	79.49
241.942	149.88
242.395	191.14
242.848	188.72
243.301	98.91
243.755	183.86
244.208	215.42
244.661	103.76
245.114	162.02
245.567	128.04
246.02	123.18
246.473	179.01
246.926	118.33
247.379	115.9
247.832	154.74
248.284	142.6
248.737	84.35
249.19	164.44
249.642	86.77
250.095	125.61
250.547	132.89
251	130.46
251.452	118.33
251.905	123.18
252.357	147.45
252.81	84.35
253.262	152.31
253.714	186.29
254.166	159.59
254.618	55.22
255.07	152.31
255.523	162.02
255.975	91.63
256.427	152.31
256.878	246.97
257.33	176.58
257.782	162.02
258.234	98.91
258.686	135.32
259.137	176.58
259.589	162.02
260.041	147.45
260.492	164.44
260.944	113.47
261.395	120.75
261.847	142.6
262.298	120.75
262.749	130.46
263.201	181.43
263.652	176.58
264.103	186.29
264.554	103.76
265.005	135.32
265.457	229.98
265.908	222.7
266.359	128.04
266.809	222.7
267.26	115.9
267.711	203.28
268.162	79.49
268.613	179.01
269.064	147.45
269.514	103.76
269.965	130.46
270.415	179.01
270.866	140.17
271.316	215.42
271.767	179.01
272.217	137.74
272.668	188.72
273.118	222.7
273.568	152.31
274.019	128.04
274.469	152.31
274.919	159.59
275.369	183.86
275.819	159.59
276.269	149.88
276.719	162.02
277.169	108.62
277.619	149.88
278.069	140.17
278.518	183.86
278.968	98.91
279.418	135.32
279.867	149.88
280.317	149.88
280.767	169.3
281.216	142.6
281.666	132.89
282.115	123.18
282.564	205.71
283.014	101.34
283.463	196
283.912	149.88
284.361	174.15
284.811	181.43
285.26	225.12
285.709	130.46
286.158	193.57
286.607	164.44
287.056	188.72
287.505	225.12
287.953	149.88
288.402	128.04
288.851	140.17
289.3	171.73
289.748	130.46
290.197	183.86
290.646	166.87
291.094	130.46
291.543	149.88
291.991	125.61
292.439	152.31
292.888	149.88
293.336	164.44
293.784	157.16
294.233	108.62
294.681	128.04
295.129	152.31
295.577	174.15
296.025	113.47
296.473	157.16
296.921	145.03
297.369	193.57
297.817	118.33
298.264	196
298.712	212.99
299.16	212.99
299.608	118.33
300.055	152.31
300.503	159.59
300.95	261.53
301.398	145.03
301.845	120.75
302.293	162.02
302.74	52.79
303.187	181.43
303.635	145.03
304.082	176.58
304.529	130.46
304.976	101.34
305.423	174.15
305.87	188.72
306.317	159.59
306.764	164.44
307.211	115.9
307.658	33.37
308.105	164.44
308.552	145.03
308.998	113.47
309.445	130.46
309.892	181.43
310.338	98.91
310.785	135.32
311.231	179.01
311.678	147.45
312.124	145.03
312.571	147.45
313.017	212.99
313.463	183.86
313.909	210.56
314.356	103.76
314.802	123.18
315.248	176.58
315.694	120.75
316.14	179.01
316.586	125.61
317.032	186.29
317.478	164.44
317.923	162.02
318.369	142.6
318.815	111.05
319.261	118.33
319.706	135.32
320.152	188.72
320.597	176.58
321.043	118.33
321.488	232.41
321.934	176.58
322.379	157.16
322.824	98.91
323.27	210.56
323.715	205.71
324.16	157.16
324.605	89.2
325.05	101.34
325.495	86.77
325.94	183.86
326.385	174.15
326.83	186.29
327.275	147.45
327.72	157.16
328.165	145.03
328.61	125.61
329.054	128.04
329.499	33.37
329.943	123.18
330.388	198.43
330.832	162.02
331.277	169.3
331.721	120.75
332.166	176.58
332.61	183.86
333.054	140.17
333.499	89.2
333.943	103.76
334.387	164.44
334.831	57.65
335.275	183.86
335.719	159.59
336.163	162.02
336.607	152.31
337.051	183.86
337.495	103.76
337.938	123.18
338.382	145.03
338.826	196
339.269	191.14
339.713	142.6
340.157	128.04
340.6	166.87
341.044	181.43
341.487	106.19
341.93	166.87
342.374	98.91
342.817	203.28
343.26	157.16
343.703	200.85
344.146	188.72
344.59	208.13
345.033	113.47
345.476	174.15
345.919	128.04
346.361	86.77
346.804	149.88
347.247	237.26
347.69	123.18
348.133	152.31
348.575	142.6
349.018	191.14
349.461	193.57
349.903	140.17
350.346	137.74
350.788	205.71
351.23	179.01
351.673	128.04
352.115	135.32
352.557	149.88
353	145.03
353.442	229.98
353.884	212.99
354.326	162.02
354.768	86.77
355.21	120.75
355.652	108.62
356.094	111.05
356.536	142.6
356.978	169.3
357.419	147.45
357.861	128.04
358.303	118.33
358.744	81.92
359.186	137.74
359.627	154.74
360.069	229.98
360.51	79.49
360.952	179.01
361.393	140.17
361.834	166.87
362.276	130.46
362.717	137.74
363.158	123.18
363.599	108.62
364.04	91.63
364.481	130.46
364.922	181.43
365.363	166.87
365.804	111.05
366.245	176.58
366.686	174.15
367.126	183.86
367.567	193.57
368.008	193.57
368.448	69.78
368.889	208.13
369.33	215.42
369.77	137.74
370.21	198.43
370.651	166.87
371.091	171.73
371.531	125.61
371.972	128.04
372.412	64.93
372.852	137.74
373.292	123.18
373.732	183.86
374.172	179.01
374.612	132.89
375.052	120.75
375.492	162.02
375.932	179.01
376.372	118.33
376.811	210.56
377.251	196
377.691	166.87
378.13	128.04
378.57	159.59
379.009	89.2
379.449	164.44
379.888	118.33
380.328	164.44
380.767	113.47
381.206	113.47
381.645	193.57
382.085	157.16
382.524	60.07
382.963	145.03
383.402	210.56
383.841	91.63
384.28	113.47
384.719	159.59
385.158	171.73
385.596	113.47
386.035	118.33
386.474	191.14
386.913	166.87
387.351	140.17
387.79	115.9
388.228	145.03
388.667	164.44
389.105	154.74
389.544	188.72
389.982	106.19
390.42	171.73
390.859	106.19
391.297	98.91
391.735	179.01
392.173	145.03
392.611	157.16
393.049	157.16
393.487	159.59
393.925	159.59
394.363	91.63
394.801	132.89
395.239	84.35
395.676	106.19
396.114	188.72
396.552	72.21
396.989	164.44
397.427	106.19
397.864	84.35
398.302	72.21
398.739	188.72
399.177	40.66
399.614	162.02
400.051	98.91
400.488	205.71
400.926	111.05
401.363	154.74
401.8	147.45
402.237	154.74
402.674	164.44
403.111	166.87
403.548	106.19
403.985	101.34
404.421	166.87
404.858	128.04
405.295	142.6
405.732	162.02
406.168	103.76
406.605	198.43
407.041	45.51
407.478	106.19
407.914	198.43
408.351	137.74
408.787	81.92
409.223	159.59
409.66	154.74
410.096	142.6
410.532	132.89
410.968	106.19
411.404	159.59
411.84	106.19
412.276	164.44
412.712	89.2
413.148	227.55
413.584	106.19
414.02	140.17
414.455	135.32
414.891	125.61
415.327	101.34
415.762	128.04
416.198	164.44
416.633	103.76
417.069	147.45
417.504	159.59
417.94	171.73
418.375	183.86
418.81	164.44
419.245	176.58
419.681	123.18
420.116	174.15
420.551	205.71
420.986	166.87
421.421	176.58
421.856	145.03
422.291	179.01
422.726	137.74
423.16	166.87
423.595	137.74
424.03	125.61
424.464	98.91
424.899	94.05
425.334	128.04
425.768	154.74
426.203	91.63
426.637	210.56
427.071	154.74
427.506	96.48
427.94	188.72
428.374	128.04
428.809	171.73
429.243	125.61
429.677	169.3
430.111	108.62
430.545	164.44
430.979	176.58
431.413	120.75
431.847	145.03
432.28	98.91
432.714	188.72
433.148	169.3
433.582	203.28
434.015	152.31
434.449	152.31
434.882	108.62
435.316	198.43
435.749	220.27
436.183	130.46
436.616	115.9
437.049	188.72
437.483	198.43
437.916	242.12
438.349	89.2
438.782	225.12
439.215	120.75
439.648	140.17
440.081	145.03
440.514	162.02
440.947	162.02
441.38	159.59
441.813	154.74
442.245	157.16
442.678	174.15
443.111	203.28
443.543	222.7
443.976	166.87
444.408	128.04
444.841	154.74
445.273	145.03
445.705	174.15
446.138	215.42
446.57	140.17
447.002	130.46
447.434	181.43
447.867	193.57
448.299	259.11
448.731	212.99
449.163	225.12
449.595	169.3
450.026	203.28
450.458	210.56
450.89	215.42
451.322	166.87
451.754	181.43
452.185	198.43
452.617	166.87
453.048	246.97
453.48	205.71
453.911	251.82
454.343	191.14
454.774	242.12
455.205	246.97
455.637	217.84
456.068	310.08
456.499	188.72
456.93	251.82
457.361	118.33
457.792	159.59
458.223	203.28
458.654	288.23
459.085	283.38
459.516	203.28
459.947	186.29
460.378	210.56
460.808	229.98
461.239	244.54
461.669	222.7
462.1	256.68
462.531	249.4
462.961	225.12
463.391	249.4
463.822	162.02
464.252	237.26
464.682	254.25
465.113	222.7
465.543	188.72
465.973	222.7
466.403	183.86
466.833	198.43
467.263	249.4
467.693	169.3
468.123	188.72
468.553	154.74
468.983	203.28
469.412	171.73
469.842	205.71
470.272	220.27
470.701	188.72
471.131	147.45
471.56	220.27
471.99	205.71
472.419	145.03
472.849	208.13
473.278	212.99
473.707	191.14
474.136	191.14
474.566	171.73
474.995	181.43
475.424	149.88
475.853	239.69
476.282	217.84
476.711	166.87
477.14	208.13
477.569	157.16
477.997	140.17
478.426	157.16
478.855	145.03
479.283	179.01
479.712	203.28
480.141	176.58
480.569	191.14
480.998	135.32
481.426	123.18
481.854	232.41
482.283	227.55
482.711	152.31
483.139	152.31
483.567	111.05
483.995	179.01
484.424	251.82
484.852	203.28
485.28	159.59
485.708	140.17
486.135	164.44
486.563	106.19
486.991	263.96
487.419	171.73
487.847	210.56
488.274	181.43
488.702	113.47
489.129	162.02
489.557	145.03
489.984	234.83
490.412	244.54
490.839	196
491.266	152.31
491.694	186.29
492.121	162.02
492.548	256.68
492.975	140.17
493.402	166.87
493.829	135.32
494.256	152.31
494.683	125.61
495.11	157.16
495.537	181.43
495.964	208.13
496.39	198.43
496.817	193.57
497.244	232.41
497.67	203.28
498.097	205.71
498.523	169.3
498.95	157.16
499.376	205.71
499.803	123.18
500.229	145.03
500.655	159.59
501.081	169.3
501.508	186.29
501.934	132.89
502.36	162.02
502.786	212.99
503.212	145.03
503.638	140.17
504.064	188.72
504.489	183.86
504.915	154.74
505.341	215.42
505.767	171.73
506.192	186.29
506.618	159.59
507.043	120.75
507.469	149.88
507.894	142.6
508.32	222.7
508.745	183.86
509.17	125.61
509.596	120.75
510.021	183.86
510.446	154.74
510.871	183.86
511.296	101.34
511.721	166.87
512.146	181.43
512.571	246.97
512.996	212.99
513.421	137.74
513.845	130.46
514.27	181.43
514.695	154.74
515.119	145.03
515.544	181.43
515.969	147.45
516.393	140.17
516.817	198.43
517.242	159.59
517.666	205.71
518.09	159.59
518.515	154.74
518.939	176.58
519.363	382.89
519.787	200.85
520.211	171.73
520.635	179.01
521.059	111.05
521.483	200.85
521.907	174.15
522.331	188.72
522.754	106.19
523.178	130.46
523.602	154.74
524.025	171.73
524.449	159.59
524.872	142.6
525.296	98.91
525.719	86.77
526.143	164.44
526.566	84.35
526.989	193.57
527.412	130.46
527.836	98.91
528.259	166.87
528.682	159.59
529.105	227.55
529.528	135.32
529.951	220.27
530.374	217.84
530.796	140.17
531.219	179.01
531.642	181.43
532.065	128.04
532.487	210.56
532.91	154.74
533.332	212.99
533.755	164.44
534.177	113.47
534.6	179.01
535.022	159.59
535.444	210.56
535.867	186.29
536.289	174.15
536.711	137.74
537.133	181.43
537.555	191.14
537.977	181.43
538.399	169.3
538.821	188.72
539.243	164.44
539.665	234.83
540.086	205.71
540.508	174.15
540.93	208.13
541.351	174.15
541.773	130.46
542.195	222.7
542.616	203.28
543.037	191.14
543.459	101.34
543.88	157.16
544.301	242.12
544.723	164.44
545.144	242.12
545.565	293.09
545.986	239.69
546.407	196
546.828	203.28
547.249	171.73
547.67	186.29
548.091	154.74
548.512	147.45
548.932	198.43
549.353	229.98
549.774	191.14
550.194	186.29
550.615	227.55
551.035	188.72
551.456	186.29
551.876	198.43
552.296	203.28
552.717	174.15
553.137	140.17
553.557	196
553.977	205.71
554.397	154.74
554.817	200.85
555.237	147.45
555.657	171.73
556.077	220.27
556.497	169.3
556.917	205.71
557.337	200.85
557.756	188.72
558.176	157.16
558.596	140.17
559.015	128.04
559.435	217.84
559.854	191.14
560.274	135.32
560.693	162.02
561.112	149.88
561.532	118.33
561.951	154.74
562.37	174.15
562.789	145.03
563.208	234.83
563.627	186.29
564.046	120.75
564.465	186.29
564.884	118.33
565.303	130.46
565.722	118.33
566.14	244.54
566.559	125.61
566.978	200.85
567.396	108.62
567.815	225.12
568.233	225.12
568.652	188.72
569.07	152.31
569.489	115.9
569.907	162.02
570.325	120.75
570.743	135.32
571.161	132.89
571.58	94.05
571.998	162.02
572.416	208.13
572.833	169.3
573.251	200.85
573.669	149.88
574.087	159.59
574.505	179.01
574.922	227.55
575.34	106.19
575.758	149.88
576.175	193.57
576.593	174.15
577.01	113.47
577.428	186.29
577.845	1555.24
578.262	307.65
578.68	145.03
579.097	147.45
579.514	154.74
579.931	210.56
580.348	203.28
580.765	149.88
581.182	249.4
581.599	142.6
582.016	147.45
582.433	181.43
582.849	174.15
583.266	186.29
583.683	191.14
584.099	166.87
584.516	142.6
584.933	164.44
585.349	212.99
585.765	254.25
586.182	239.69
586.598	176.58
587.014	137.74
587.431	154.74
587.847	86.77
588.263	135.32
588.679	176.58
589.095	169.3
589.511	159.59
589.927	205.71
590.343	181.43
590.759	179.01
591.174	159.59
591.59	142.6
592.006	115.9
592.421	191.14
592.837	176.58
593.252	103.76
593.668	142.6
594.083	200.85
594.499	147.45
594.914	154.74
595.329	115.9
595.745	101.34
596.16	179.01
596.575	176.58
596.99	149.88
597.405	140.17
597.82	176.58
598.235	191.14
598.65	115.9
599.065	149.88
599.479	186.29
599.894	234.83
600.309	94.05
600.724	120.75
601.138	232.41
601.553	123.18
601.967	215.42
602.382	162.02
602.796	72.21
603.21	145.03
603.625	115.9
604.039	142.6
604.453	98.91
604.867	225.12
605.281	169.3
605.695	171.73
606.109	154.74
606.523	174.15
606.937	208.13
607.351	278.52
607.765	157.16
608.178	166.87
608.592	176.58
609.006	106.19
609.419	200.85
609.833	106.19
610.246	113.47
610.66	227.55
611.073	140.17
611.487	249.4
611.9	171.73
612.313	251.82
612.726	217.84
613.139	210.56
613.553	159.59
613.966	244.54
614.379	152.31
614.792	154.74
615.204	179.01
615.617	130.46
616.03	164.44
616.443	174.15
616.856	186.29
617.268	166.87
617.681	149.88
618.093	147.45
618.506	164.44
618.918	181.43
619.331	183.86
619.743	203.28
620.155	135.32
620.568	208.13
620.98	142.6
621.392	94.05
621.804	171.73
622.216	149.88
622.628	212.99
623.04	140.17
623.452	137.74
623.864	164.44
624.276	159.59
624.687	166.87
625.099	188.72
625.511	164.44
625.922	125.61
626.334	193.57
626.745	186.29
627.157	113.47
627.568	188.72
627.979	98.91
628.391	193.57
628.802	176.58
629.213	198.43
629.624	147.45
630.035	101.34
630.446	132.89
630.857	149.88
631.268	198.43
631.679	74.64
632.09	208.13
632.501	217.84
632.912	193.57
633.322	181.43
633.733	166.87
634.144	205.71
634.554	196
634.965	164.44
635.375	200.85
635.785	181.43
636.196	162.02
636.606	188.72
637.016	181.43
637.427	164.44
637.837	154.74
638.247	111.05
638.657	174.15
639.067	169.3
639.477	234.83
639.887	188.72
640.297	123.18
640.706	198.43
641.116	94.05
641.526	120.75
641.935	142.6
642.345	149.88
642.755	108.62
643.164	103.76
643.573	164.44
643.983	149.88
644.392	225.12
644.801	162.02
645.211	125.61
645.62	94.05
646.029	103.76
646.438	81.92
646.847	120.75
647.256	162.02
647.665	147.45
648.074	125.61
648.483	157.16
648.892	169.3
649.3	135.32
649.709	183.86
650.118	145.03
650.526	179.01
650.935	157.16
651.343	145.03
651.752	166.87
652.16	171.73
652.568	118.33
652.977	135.32
653.385	222.7
653.793	196
654.201	169.3
654.609	171.73
655.017	113.47
655.425	157.16
655.833	188.72
656.241	179.01
656.649	149.88
657.057	140.17
657.464	137.74
657.872	140.17
658.28	188.72
658.687	164.44
659.095	174.15
659.502	169.3
659.91	188.72
660.317	159.59
660.724	135.32
661.132	130.46
661.539	164.44
661.946	111.05
662.353	149.88
662.76	244.54
663.167	108.62
663.574	162.02
663.981	215.42
664.388	135.32
664.795	283.38
665.202	191.14
665.608	210.56
666.015	159.59
666.422	183.86
666.828	203.28
667.235	162.02
667.641	217.84
668.047	164.44
668.454	128.04
668.86	162.02
669.266	200.85
669.673	147.45
670.079	205.71
670.485	145.03
670.891	113.47
671.297	140.17
671.703	135.32
672.109	164.44
672.515	132.89
672.92	135.32
673.326	174.15
673.732	152.31
674.138	210.56
674.543	171.73
674.949	159.59
675.354	166.87
675.76	217.84
676.165	145.03
676.57	164.44
676.976	159.59
677.381	132.89
677.786	149.88
678.191	176.58
678.596	210.56
679.001	137.74
679.406	94.05
679.811	149.88
680.216	234.83
680.621	222.7
681.026	113.47
681.43	176.58
681.835	157.16
682.24	157.16
682.644	123.18
683.049	159.59
683.453	103.76
683.858	159.59
684.262	94.05
684.667	157.16
685.071	125.61
685.475	135.32
685.879	145.03
686.283	132.89
686.687	164.44
687.091	171.73
687.495	147.45
687.899	137.74
688.303	101.34
688.707	142.6
689.111	181.43
689.514	147.45
689.918	137.74
690.322	171.73
690.725	125.61
691.129	188.72
691.532	220.27
691.936	130.46
692.339	183.86
692.742	157.16
693.146	154.74
693.549	171.73
693.952	166.87
694.355	91.63
694.758	222.7
695.161	130.46
695.564	164.44
695.967	227.55
696.37	176.58
696.773	145.03
697.175	164.44
697.578	169.3
697.981	222.7
698.383	174.15
698.786	132.89
699.188	96.48
699.591	152.31
699.993	186.29
700.395	217.84
700.798	171.73
701.2	188.72
701.602	162.02
702.004	186.29
702.406	164.44
702.808	244.54
703.21	159.59
703.612	251.82
704.014	186.29
704.416	164.44
704.818	229.98
705.219	154.74
705.621	300.37
706.023	159.59
706.424	205.71
706.826	232.41
707.227	217.84
707.629	188.72
708.03	215.42
708.431	227.55
708.832	271.24
709.234	198.43
709.635	271.24
710.036	249.4
710.437	198.43
710.838	188.72
711.239	234.83
711.64	232.41
712.041	234.83
712.441	222.7
712.842	222.7
713.243	268.81
713.643	179.01
714.044	183.86
714.445	271.24
714.845	324.64
715.246	312.5
715.646	242.12
716.046	217.84
716.447	239.69
716.847	239.69
717.247	273.67
717.647	297.94
718.047	254.25
718.447	242.12
718.847	297.94
719.247	288.23
719.647	327.07
720.047	329.5
720.446	390.18
720.846	346.49
721.246	409.59
721.645	336.78
722.045	409.59
722.444	348.91
722.844	426.58
723.243	443.57
723.643	380.47
724.042	387.75
724.441	438.72
724.84	475.13
725.24	540.66
725.639	467.85
726.038	506.68
726.437	528.53
726.836	504.26
727.234	521.25
727.633	516.39
728.032	540.66
728.431	509.11
728.83	472.7
729.228	528.53
729.627	516.39
730.025	572.22
730.424	603.77
730.822	584.35
731.22	567.36
731.619	683.87
732.017	683.87
732.415	744.55
732.813	713
733.212	810.09
733.61	717.85
734.008	868.34
734.406	797.95
734.803	926.59
735.201	950.86
735.599	1057.66
735.997	904.75
736.395	938.73
736.792	1079.51
737.19	1120.77
737.587	1329.51
737.985	1300.38
738.382	1448.44
738.78	1611.07
739.177	1637.77
739.574	1739.71
739.971	1941.17
740.369	2055.25
740.766	2295.55
741.163	2509.14
741.56	2899.92
741.957	2989.73
742.354	3208.18
742.751	3713.04
743.147	3989.75
743.544	4346.55
743.941	4674.22
744.338	5179.09
744.734	5390.25
745.131	6106.28
745.527	6480.08
745.924	7099.02
746.32	7518.93
746.716	7977.67
747.113	8526.22
747.509	9009.24
747.905	9781.1
748.301	10137.9
748.697	10579.65
749.093	11247.14
749.489	11616.08
749.885	11647.63
750.281	12550.56
750.677	13069.98
751.073	13247.17
751.468	13761.74
751.864	13747.18
752.26	13567.57
752.655	13822.42
753.051	14006.89
753.446	14009.32
753.842	13958.35
754.237	14062.72
754.632	13669.51
755.028	13210.76
755.423	12878.23
755.818	12390.36
756.213	12118.51
756.608	11402.48
757.003	11033.55
757.398	10472.86
757.793	9878.19
758.188	9380.61
758.583	9128.18
758.977	8453.41
759.372	8016.51
759.767	7771.36
760.161	7844.18
760.556	7628.15
760.95	7543.2
761.345	7203.39
761.739	7208.24
762.133	7113.58
762.527	7213.1
762.922	7215.52
763.316	7407.28
763.71	7511.65
764.104	7793.2
764.498	8186.41
764.892	8472.83
765.286	9118.47
765.68	9557.79
766.073	10361.2
766.467	11079.66
766.861	12264.15
767.255	13373.39
767.648	14766.61
768.042	15992.36
768.435	17371.02
768.829	19072.51
769.222	20521.56
769.615	22150.22
770.008	23470.63
770.402	25191.53
770.795	26783.79
771.188	28582.36
771.581	30106.66
771.974	31106.67
772.367	32538.73
772.76	34560.61
773.153	35121.3
773.545	36764.53
773.938	38058.24
774.331	40376.23
774.724	41939.37
775.116	45446.7
775.509	47568.09
775.901	50136.1
776.294	51934.67
776.686	52815.75
777.078	54303.64
777.471	55679.87
777.863	57262.42
778.255	58723.61
778.647	59706.63
779.039	60238.19
779.431	60175.09
779.823	59711.49
780.215	60243.05
780.607	60073.14
780.999	61012.48
781.39	60461.5
781.782	60626.55
782.174	60568.3
782.565	60230.91
782.957	60313.44
783.348	59866.83
783.74	58859.53
784.131	57235.72
784.522	57109.5
784.914	55172.58
785.305	54184.7
785.696	52607.01
786.087	50451.63
786.478	48068.1
786.869	45504.96
787.26	43381.14
787.651	40526.72
788.042	37985.42
788.433	35982.96
788.823	33538.75
789.214	31519.3
789.605	28713.43
789.995	26640.58
790.386	24912.4
790.776	23965.79
791.167	22305.57
791.557	21613.81
791.948	21087.1
792.338	19485.13
792.728	19147.75
793.118	18133.17
793.508	17536.07
793.898	16737.52
794.288	16135.57
794.678	15688.96
795.068	14968.07
795.458	14657.39
795.848	14344.28
796.238	13873.4
796.627	13686.5
797.017	14016.6
797.406	14154.95
797.796	14273.89
798.185	14727.78
798.575	14912.25
798.964	15587.01
799.354	16412.27
799.743	16858.88
800.132	17888.02
800.521	19310.37
800.91	20038.54
801.299	20866.22
801.688	22065.27
802.077	22892.95
802.466	24271.62
802.855	24895.41
803.244	25487.65
803.633	26640.58
804.021	27281.37
804.41	28349.35
804.799	28531.39
805.187	29718.3
805.576	30072.68
805.964	30638.22
806.352	30456.18
806.741	32339.7
807.129	32592.13
807.517	33626.13
807.905	34922.27
808.293	35283.92
808.681	36657.73
809.069	37718.43
809.457	39742.73
809.845	40716.05
810.233	41405.38
810.621	41919.95
811.009	42568.02
811.396	42919.96
811.784	44366.59
812.171	44036.49
812.559	44767.08
812.946	43793.76
813.334	43502.5
813.721	43335.02
814.108	41706.35
814.496	41313.14
814.883	41070.42
815.27	41650.53
815.657	40944.2
816.044	40592.26
816.431	40781.58
816.818	39225.73
817.205	38186.88
817.592	38279.11
817.979	36752.39
818.365	35963.54
818.752	33776.62
819.139	31762.02
819.525	30723.17
819.912	29133.34
820.298	27946.43
820.685	25900.28
821.071	24861.43
821.457	23468.2
821.843	21912.36
822.23	20735.15
822.616	18936.58
823.002	17596.75
823.388	16519.07
823.774	15502.06
824.16	13917.09
824.546	13208.34
824.931	12295.7
825.317	11623.36
825.703	10751.99
826.089	10305.38
826.474	9509.25
826.86	8873.32
827.245	8431.56
827.631	7987.38
828.016	7310.19
828.401	6705.81
828.787	6293.18
829.172	5849
829.557	5336.85
829.942	4950.93
830.327	4620.82
830.712	4375.67
831.097	4074.7
831.482	3967.9
831.867	3737.32
832.252	3482.46
832.636	3455.76
833.021	3358.67
833.406	3276.14
833.79	3319.83
834.175	3140.22
834.559	3322.26
834.944	3118.37
835.328	3198.47
835.713	3164.49
836.097	3222.74
836.481	3365.95
836.865	3526.15
837.249	3463.04
837.633	3310.12
838.017	3487.31
838.401	3683.92
838.785	3581.97
839.169	3722.75
839.553	3727.61
839.937	3679.06
840.32	3717.9
840.704	3768.87
841.087	3831.98
841.471	3861.1
841.854	4057.71
842.238	3948.48
842.621	4033.44
843.004	4115.96
843.388	4055.28
843.771	4079.55
844.154	4346.55
844.537	4412.08
844.92	4555.29
845.303	4649.95
845.686	4776.17
846.069	4494.61
846.452	4606.26
846.834	4649.95
847.217	4518.88
847.6	4679.08
847.982	4615.97
848.365	4679.08
848.748	4594.12
849.13	4378.1
849.512	4511.6
849.895	4414.51
850.277	4319.85
850.659	4302.86
851.041	4222.76
851.423	4433.93
851.806	4084.41
852.188	4113.53
852.57	4009.16
852.951	3907.22
853.333	3744.6
853.715	3688.77
854.097	3632.94
854.479	3365.95
854.86	3426.63
855.242	3271.29
855.623	3198.47
856.005	3084.39
856.386	2938.76
856.768	2720.31
857.149	2713.03
857.53	2499.43
857.911	2450.89
858.292	2317.39
858.674	2213.02
859.055	2103.79
859.436	1914.47
859.817	1875.64
860.197	1790.68
860.578	1679.03
860.959	1746.99
861.34	1518.83
861.72	1361.06
862.101	1319.8
862.482	1385.34
862.862	1295.53
863.243	1147.47
863.623	1183.88
864.003	1142.61
864.384	1108.63
864.764	1016.4
865.144	1011.54
865.524	885.33
865.904	776.1
866.284	703.29
866.664	739.7
867.044	722.71
867.424	700.86
867.804	613.48
868.183	688.72
868.563	666.88
868.943	562.51
869.322	470.27
869.702	530.95
870.081	487.26
870.461	504.26
870.84	387.75
871.22	399.88
871.599	429.01
871.978	479.98
872.357	431.44
872.736	390.18
873.115	387.75
873.494	380.47
873.873	256.68
874.252	307.65
874.631	271.24
875.01	307.65
875.388	322.21
875.767	271.24
876.146	370.76
876.524	305.22
876.903	268.81
877.281	293.09
877.66	283.38
878.038	263.96
878.416	259.11
878.794	268.81
879.173	237.26
879.551	271.24
879.929	242.12
880.307	271.24
880.685	227.55
881.063	227.55
881.441	232.41
881.818	229.98
882.196	329.5
882.574	266.39
882.951	176.58
883.329	183.86
883.707	239.69
884.084	188.72
884.461	314.93
884.839	215.42
885.216	183.86
885.593	183.86
885.971	200.85
886.348	276.1
886.725	208.13
887.102	183.86
887.479	259.11
887.856	208.13
888.233	193.57
888.609	278.52
888.986	234.83
889.363	234.83
889.74	244.54
890.116	103.76
890.493	193.57
890.869	254.25
891.246	166.87
891.622	145.03
891.998	242.12
892.375	179.01
892.751	191.14
893.127	188.72
893.503	254.25
893.879	108.62
894.255	183.86
894.631	186.29
895.007	123.18
895.383	137.74
895.759	135.32
896.134	154.74
896.51	210.56
896.886	162.02
897.261	132.89
897.637	196
898.012	208.13
898.388	120.75
898.763	188.72
899.138	181.43
899.514	188.72
899.889	142.6
900.264	96.48
900.639	215.42
901.014	210.56
901.389	128.04
901.764	135.32
902.139	125.61
902.513	179.01
902.888	174.15
903.263	115.9
903.638	183.86
904.012	132.89
904.387	169.3
904.761	137.74
905.136	157.16
905.51	111.05
905.884	162.02
906.259	125.61
906.633	152.31
907.007	181.43
907.381	130.46
907.755	128.04
908.129	74.64
908.503	125.61
908.877	188.72
909.251	145.03
909.624	108.62
909.998	169.3
910.372	181.43
910.745	162.02
911.119	222.7
911.492	98.91
911.866	137.74
912.239	106.19
912.612	157.16
912.986	140.17
913.359	145.03
913.732	242.12
914.105	142.6
914.478	135.32
914.851	57.65
915.224	89.2
915.597	135.32
915.97	140.17
916.343	103.76
916.715	188.72
917.088	147.45
917.461	45.51
917.833	145.03
918.206	181.43
918.578	183.86
918.951	135.32
919.323	183.86
919.695	164.44
920.067	162.02
920.44	115.9
920.812	106.19
921.184	113.47
921.556	132.89
921.928	79.49
922.3	111.05
922.672	128.04
923.043	135.32
923.415	193.57
923.787	79.49
924.158	135.32
924.53	149.88
924.901	198.43
925.273	91.63
925.644	123.18
926.016	108.62
926.387	79.49
926.758	101.34
927.129	145.03
927.5	149.88
927.872	157.16
928.243	132.89
928.613	147.45
928.984	77.06
929.355	142.6
929.726	108.62
930.097	159.59
930.467	103.76
930.838	69.78
931.209	142.6
931.579	132.89
931.95	118.33
932.32	145.03
932.69	123.18
933.061	35.8
933.431	111.05
933.801	205.71
934.171	147.45
934.541	91.63
934.911	118.33
935.281	108.62
935.651	149.88
936.021	147.45
936.391	166.87
936.761	137.74
937.13	86.77
937.5	140.17
937.87	132.89
938.239	140.17
938.609	91.63
938.978	118.33
939.347	196
939.717	186.29
940.086	111.05
940.455	108.62
940.824	149.88
941.193	176.58
941.562	186.29
941.931	140.17
942.3	215.42
942.669	125.61
943.038	152.31
943.407	145.03
943.775	81.92
944.144	164.44
944.513	128.04
944.881	212.99
945.25	166.87
945.618	130.46
945.986	203.28
946.355	128.04
946.723	106.19
947.091	125.61
947.459	74.64
947.827	108.62
948.195	147.45
948.563	147.45
948.931	106.19
949.299	159.59
949.667	198.43
950.035	140.17
950.402	135.32
950.77	232.41
951.138	200.85
951.505	57.65
951.873	179.01
952.24	103.76
952.607	152.31
952.975	147.45
953.342	169.3
953.709	215.42
954.076	81.92
954.443	142.6
954.81	142.6
955.177	106.19
955.544	118.33
955.911	130.46
956.278	128.04
956.645	154.74
957.012	140.17
957.378	142.6
957.745	123.18
958.111	84.35
958.478	166.87
958.844	135.32
959.211	142.6
959.577	140.17
959.943	157.16
960.309	145.03
960.675	132.89
961.042	115.9
961.408	128.04
961.774	120.75
962.139	162.02
962.505	125.61
962.871	98.91
963.237	128.04
963.603	145.03
963.968	227.55
964.334	164.44
964.699	132.89
965.065	140.17
965.43	164.44
965.796	196
966.161	130.46
966.526	174.15
966.891	145.03
967.256	157.16
967.622	137.74
967.987	135.32
968.352	142.6
968.716	96.48
969.081	181.43
969.446	215.42
969.811	179.01
970.176	135.32
970.54	181.43
970.905	120.75
971.269	108.62
971.634	145.03
971.998	162.02
972.363	188.72
972.727	111.05
973.091	174.15
973.455	149.88
973.819	152.31
974.183	145.03
974.547	152.31
974.911	234.83
975.275	222.7
975.639	125.61
976.003	176.58
976.367	157.16
976.73	140.17
977.094	162.02
977.458	147.45
977.821	120.75
978.185	203.28
978.548	174.15
978.911	200.85
979.275	186.29
979.638	152.31
980.001	98.91
980.364	152.31
980.727	145.03
981.09	203.28
981.453	60.07
981.816	113.47
982.179	200.85
982.542	222.7
982.905	140.17
983.267	145.03
983.63	181.43
983.992	140.17
984.355	113.47
984.717	147.45
985.08	118.33
985.442	79.49
985.804	86.77
986.167	145.03
986.529	157.16
986.891	137.74
987.253	113.47
987.615	171.73
987.977	145.03
988.339	166.87
988.701	130.46
989.062	147.45
989.424	89.2
989.786	157.16
990.147	142.6
990.509	169.3
990.87	96.48
991.232	181.43
991.593	188.72
991.955	140.17
992.316	91.63
992.677	171.73
993.038	145.03
993.399	69.78
993.76	147.45
994.121	130.46
994.482	130.46
994.843	84.35
995.204	123.18
995.565	171.73
995.926	147.45
996.286	171.73
996.647	128.04
997.007	113.47
997.368	123.18
997.728	118.33
998.089	145.03
998.449	108.62
998.809	91.63
999.169	91.63
999.53	147.45
999.89	162.02
1000.25	125.61
1000.61	145.03
1000.97	96.48
1001.329	108.62
1001.689	140.17
1002.049	125.61
1002.409	120.75
1002.768	111.05
1003.128	191.14
1003.487	40.66
1003.847	94.05
1004.206	149.88
1004.566	113.47
1004.925	157.16
1005.284	162.02
1005.643	86.77
1006.003	125.61
1006.362	193.57
1006.721	128.04
1007.08	193.57
1007.438	142.6
1007.797	137.74
1008.156	123.18
1008.515	171.73
1008.874	132.89
1009.232	200.85
1009.591	152.31
1009.949	140.17
1010.308	137.74
1010.666	137.74
1011.024	98.91
1011.383	108.62
1011.741	164.44
1012.099	132.89
1012.457	137.74
1012.815	132.89
1013.173	135.32
1013.531	91.63
1013.889	217.84
1014.247	152.31
1014.605	96.48
1014.962	132.89
1015.32	125.61
1015.678	159.59
1016.035	166.87
1016.393	111.05
1016.75	159.59
1017.107	149.88
1017.465	135.32
1017.822	96.48
1018.179	120.75
1018.536	120.75
1018.894	176.58
1019.251	157.16
1019.608	176.58
1019.964	130.46
1020.321	118.33
1020.678	157.16
1021.035	149.88
1021.392	142.6
1021.748	162.02
1022.105	120.75
1022.461	111.05
1022.818	152.31
1023.174	137.74
1023.531	137.74
1023.887	210.56
1024.243	147.45
1024.599	125.61
1024.955	79.49
1025.311	183.86
1025.667	142.6
1026.023	186.29
1026.379	91.63
1026.735	130.46
1027.091	154.74
1027.447	118.33
