189.514	113.78
189.973	113.78
190.431	113.78
190.889	62.8
191.348	23.97
191.806	62.8
192.264	4.55
192.722	11.83
193.18	-17.29
193.638	-34.28
194.096	-10.01
194.554	-2.73
195.012	14.26
195.47	-97.39
195.928	-43.99
196.385	31.25
196.843	-41.57
197.301	16.69
197.758	91.93
198.216	62.8
198.674	-34.28
199.131	48.24
199.589	31.25
200.046	45.81
200.503	2.12
200.961	79.79
201.418	82.22
201.875	45.81
202.332	111.35
202.79	57.95
203.247	91.93
203.704	155.04
204.161	150.18
204.618	169.6
205.075	135.62
205.532	174.46
205.989	142.9
206.445	157.47
206.902	225.43
207.359	172.03
207.816	152.61
208.272	118.63
208.729	111.35
209.185	189.02
209.642	162.32
210.098	155.04
210.555	157.47
211.011	184.17
211.467	125.91
211.924	220.57
212.38	128.34
212.836	167.17
213.292	174.46
213.748	116.2
214.204	198.73
214.66	123.48
215.116	201.16
215.572	94.36
216.028	133.19
216.484	203.58
216.94	298.24
217.396	162.32
217.851	201.16
218.307	198.73
218.763	138.05
219.218	193.87
219.674	118.63
220.129	125.91
220.585	130.77
221.04	189.02
221.496	179.31
221.951	157.47
222.406	159.89
222.861	164.75
223.317	210.86
223.772	111.35
224.227	155.04
224.682	147.76
225.137	91.93
225.592	123.48
226.047	70.09
226.502	179.31
226.957	82.22
227.411	179.31
227.866	230.28
228.321	191.45
228.776	167.17
229.23	101.64
229.685	198.73
230.139	150.18
230.594	184.17
231.048	159.89
231.503	150.18
231.957	159.89
232.411	162.32
232.865	198.73
233.32	179.31
233.774	213.29
234.228	111.35
234.682	159.89
235.136	142.9
235.59	118.63
236.044	147.76
236.498	157.47
236.952	40.96
237.406	145.33
237.86	203.58
238.313	104.07
238.767	164.75
239.221	106.49
239.674	191.45
240.128	138.05
240.581	201.16
241.035	261.84
241.488	206.01
241.942	150.18
242.395	152.61
242.848	138.05
243.301	247.27
243.755	203.58
244.208	147.76
244.661	176.88
245.114	140.48
245.567	213.29
246.02	176.88
246.473	220.57
246.926	201.16
247.379	164.75
247.832	162.32
248.284	133.19
248.737	162.32
249.19	152.61
249.642	145.33
250.095	94.36
250.547	189.02
251	142.9
251.452	167.17
251.905	167.17
252.357	196.3
252.81	164.75
253.262	130.77
253.714	130.77
254.166	162.32
254.618	196.3
255.07	169.6
255.523	176.88
255.975	218.15
256.427	167.17
256.878	169.6
257.33	179.31
257.782	247.27
258.234	203.58
258.686	235.14
259.137	174.46
259.589	157.47
260.041	145.33
260.492	162.32
260.944	218.15
261.395	147.76
261.847	203.58
262.298	125.91
262.749	138.05
263.201	230.28
263.652	169.6
264.103	169.6
264.554	130.77
265.005	169.6
265.457	169.6
265.908	113.78
266.359	87.08
266.809	198.73
267.26	111.35
267.711	172.03
268.162	157.47
268.613	113.78
269.064	121.06
269.514	118.63
269.965	223
270.415	118.63
270.866	223
271.316	184.17
271.767	145.33
272.217	106.49
272.668	235.14
273.118	176.88
273.568	179.31
274.019	130.77
274.469	145.33
274.919	133.19
275.369	174.46
275.819	77.37
276.269	142.9
276.719	99.21
277.169	157.47
277.619	172.03
278.069	121.06
278.518	181.74
278.968	206.01
279.418	118.63
279.867	145.33
280.317	167.17
280.767	135.62
281.216	203.58
281.666	167.17
282.115	162.32
282.564	237.56
283.014	111.35
283.463	179.31
283.912	155.04
284.361	181.74
284.811	218.15
285.26	179.31
285.709	169.6
286.158	186.59
286.607	203.58
287.056	101.64
287.505	237.56
287.953	206.01
288.402	159.89
288.851	155.04
289.3	172.03
289.748	172.03
290.197	193.87
290.646	174.46
291.094	196.3
291.543	218.15
291.991	179.31
292.439	179.31
292.888	138.05
293.336	145.33
293.784	167.17
294.233	232.71
294.681	167.17
295.129	164.75
295.577	184.17
296.025	155.04
296.473	254.55
296.921	276.4
297.369	174.46
297.817	89.5
298.264	138.05
298.712	189.02
299.16	159.89
299.608	159.89
300.055	162.32
300.503	181.74
300.95	116.2
301.398	116.2
301.845	140.48
302.293	94.36
302.74	198.73
303.187	237.56
303.635	203.58
304.082	140.48
304.529	206.01
304.976	237.56
305.423	152.61
305.87	206.01
306.317	113.78
306.764	227.86
307.211	223
307.658	123.48
308.105	169.6
308.552	210.86
308.998	227.86
309.445	167.17
309.892	162.32
310.338	150.18
310.785	106.49
311.231	218.15
311.678	162.32
312.124	159.89
312.571	179.31
313.017	135.62
313.463	191.45
313.909	172.03
314.356	172.03
314.802	123.48
315.248	189.02
315.694	181.74
316.14	196.3
316.586	169.6
317.032	159.89
317.478	172.03
317.923	191.45
318.369	138.05
318.815	157.47
319.261	162.32
319.706	155.04
320.152	164.75
320.597	223
321.043	181.74
321.488	155.04
321.934	157.47
322.379	169.6
322.824	242.42
323.27	237.56
323.715	159.89
324.16	179.31
324.605	164.75
325.05	213.29
325.495	239.99
325.94	133.19
326.385	181.74
326.83	162.32
327.275	164.75
327.72	189.02
328.165	133.19
328.61	181.74
329.054	159.89
329.499	181.74
329.943	181.74
330.388	106.49
330.832	206.01
331.277	145.33
331.721	159.89
332.166	208.44
332.61	167.17
333.054	162.32
333.499	181.74
333.943	142.9
334.387	167.17
334.831	152.61
335.275	128.34
335.719	118.63
336.163	172.03
336.607	89.5
337.051	167.17
337.495	239.99
337.938	145.33
338.382	169.6
338.826	206.01
339.269	142.9
339.713	111.35
340.157	91.93
340.6	147.76
341.044	152.61
341.487	174.46
341.93	213.29
342.374	167.17
342.817	237.56
343.26	155.04
343.703	176.88
344.146	167.17
344.59	159.89
345.033	193.87
345.476	140.48
345.919	157.47
346.361	57.95
346.804	111.35
347.247	108.92
347.69	128.34
348.133	135.62
348.575	140.48
349.018	203.58
349.461	242.42
349.903	169.6
350.346	140.48
350.788	191.45
351.23	184.17
351.673	121.06
352.115	176.88
352.557	162.32
353	152.61
353.442	99.21
353.884	123.48
354.326	191.45
354.768	179.31
355.21	133.19
355.652	125.91
356.094	118.63
356.536	128.34
356.978	213.29
357.419	121.06
357.861	172.03
358.303	227.86
358.744	133.19
359.186	140.48
359.627	174.46
360.069	159.89
360.51	116.2
360.952	220.57
361.393	210.86
361.834	176.88
362.276	130.77
362.717	147.76
363.158	193.87
363.599	198.73
364.04	145.33
364.481	150.18
364.922	210.86
365.363	138.05
365.804	191.45
366.245	218.15
366.686	133.19
367.126	196.3
367.567	307.95
368.008	125.91
368.448	101.64
368.889	162.32
369.33	108.92
369.77	172.03
370.21	174.46
370.651	138.05
371.091	193.87
371.531	140.48
371.972	179.31
372.412	172.03
372.852	206.01
373.292	106.49
373.732	215.72
374.172	169.6
374.612	169.6
375.052	230.28
375.492	235.14
375.932	142.9
376.372	118.63
376.811	206.01
377.251	167.17
377.691	130.77
378.13	142.9
378.57	169.6
379.009	191.45
379.449	138.05
379.888	181.74
380.328	167.17
380.767	152.61
381.206	191.45
381.645	193.87
382.085	147.76
382.524	184.17
382.963	176.88
383.402	159.89
383.841	210.86
384.28	138.05
384.719	159.89
385.158	167.17
385.596	159.89
386.035	184.17
386.474	123.48
386.913	142.9
387.351	106.49
387.79	155.04
388.228	152.61
388.667	196.3
389.105	203.58
389.544	133.19
389.982	181.74
390.42	172.03
390.859	155.04
391.297	125.91
391.735	155.04
392.173	67.66
392.611	172.03
393.049	181.74
393.487	196.3
393.925	140.48
394.363	174.46
394.801	206.01
395.239	125.91
395.676	157.47
396.114	208.44
396.552	155.04
396.989	198.73
397.427	135.62
397.864	198.73
398.302	244.85
398.739	152.61
399.177	147.76
399.614	198.73
400.051	150.18
400.488	162.32
400.926	193.87
401.363	111.35
401.8	87.08
402.237	198.73
402.674	167.17
403.111	135.62
403.548	174.46
403.985	172.03
404.421	99.21
404.858	140.48
405.295	203.58
405.732	210.86
406.168	201.16
406.605	189.02
407.041	140.48
407.478	145.33
407.914	206.01
408.351	181.74
408.787	140.48
409.223	111.35
409.66	74.94
410.096	210.86
410.532	193.87
410.968	167.17
411.404	227.86
411.84	176.88
412.276	145.33
412.712	230.28
413.148	223
413.584	167.17
414.02	96.79
414.455	155.04
414.891	152.61
415.327	201.16
415.762	150.18
416.198	162.32
416.633	193.87
417.069	74.94
417.504	179.31
417.94	152.61
418.375	191.45
418.81	147.76
419.245	159.89
419.681	172.03
420.116	157.47
420.551	145.33
420.986	138.05
421.421	239.99
421.856	230.28
422.291	210.86
422.726	140.48
423.16	218.15
423.595	147.76
424.03	152.61
424.464	147.76
424.899	181.74
425.334	133.19
425.768	164.75
426.203	203.58
426.637	227.86
427.071	121.06
427.506	104.07
427.94	121.06
428.374	150.18
428.809	186.59
429.243	189.02
429.677	111.35
430.111	157.47
430.545	162.32
430.979	169.6
431.413	172.03
431.847	157.47
432.28	186.59
432.714	247.27
433.148	167.17
433.582	133.19
434.015	133.19
434.449	186.59
434.882	225.43
435.316	152.61
435.749	213.29
436.183	206.01
436.616	174.46
437.049	186.59
437.483	203.58
437.916	252.13
438.349	206.01
438.782	206.01
439.215	261.84
439.648	276.4
440.081	201.16
440.514	201.16
440.947	210.86
441.38	208.44
441.813	181.74
442.245	227.86
442.678	191.45
443.111	230.28
443.543	145.33
443.976	198.73
444.408	206.01
444.841	191.45
445.273	239.99
445.705	181.74
446.138	155.04
446.57	196.3
447.002	252.13
447.434	249.7
447.867	237.56
448.299	261.84
448.731	223
449.163	140.48
449.595	215.72
450.026	254.55
450.458	235.14
450.89	218.15
451.322	281.25
451.754	176.88
452.185	220.57
452.617	315.24
453.048	264.26
453.48	230.28
453.911	254.55
454.343	286.11
454.774	269.12
455.205	295.82
455.637	239.99
456.068	201.16
456.499	244.85
456.93	276.4
457.361	261.84
457.792	198.73
458.223	271.55
458.654	266.69
459.085	332.23
459.516	225.43
459.947	249.7
460.378	179.31
460.808	261.84
461.239	298.24
461.669	213.29
462.1	256.98
462.531	256.98
462.961	203.58
463.391	244.85
463.822	193.87
464.252	244.85
464.682	208.44
465.113	237.56
465.543	218.15
465.973	339.51
466.403	213.29
466.833	264.26
467.263	213.29
467.693	220.57
468.123	293.39
468.553	164.75
468.983	210.86
469.412	191.45
469.842	198.73
470.272	322.52
470.701	237.56
471.131	193.87
471.56	215.72
471.99	203.58
472.419	252.13
472.849	278.83
473.278	225.43
473.707	198.73
474.136	249.7
474.566	259.41
474.995	317.66
475.424	213.29
475.853	174.46
476.282	191.45
476.711	150.18
477.14	140.48
477.569	186.59
477.997	247.27
478.426	218.15
478.855	174.46
479.283	191.45
479.712	125.91
480.141	230.28
480.569	196.3
480.998	196.3
481.426	191.45
481.854	203.58
482.283	256.98
482.711	223
483.139	215.72
483.567	184.17
483.995	220.57
484.424	174.46
484.852	206.01
485.28	184.17
485.708	247.27
486.135	223
486.563	203.58
486.991	191.45
487.419	193.87
487.847	198.73
488.274	218.15
488.702	201.16
489.129	186.59
489.557	167.17
489.984	198.73
490.412	218.15
490.839	232.71
491.266	235.14
491.694	295.82
492.121	220.57
492.548	227.86
492.975	269.12
493.402	220.57
493.829	276.4
494.256	186.59
494.683	162.32
495.11	150.18
495.537	186.59
495.964	147.76
496.39	210.86
496.817	184.17
497.244	179.31
497.67	261.84
498.097	159.89
498.523	186.59
498.95	140.48
499.376	162.32
499.803	128.34
500.229	184.17
500.655	213.29
501.081	235.14
501.508	138.05
501.934	196.3
502.36	176.88
502.786	186.59
503.212	237.56
503.638	201.16
504.064	198.73
504.489	196.3
504.915	191.45
505.341	201.16
505.767	196.3
506.192	138.05
506.618	152.61
507.043	147.76
507.469	176.88
507.894	159.89
508.32	259.41
508.745	230.28
509.17	150.18
509.596	172.03
510.021	135.62
510.446	198.73
510.871	179.31
511.296	210.86
511.721	220.57
512.146	213.29
512.571	123.48
512.996	157.47
513.421	225.43
513.845	254.55
514.27	264.26
514.695	176.88
515.119	138.05
515.544	157.47
515.969	249.7
516.393	247.27
516.817	179.31
517.242	201.16
517.666	201.16
518.09	261.84
518.515	198.73
518.939	152.61
519.363	458.44
519.787	213.29
520.211	164.75
520.635	189.02
521.059	157.47
521.483	193.87
521.907	203.58
522.331	198.73
522.754	164.75
523.178	181.74
523.602	196.3
524.025	191.45
524.449	208.44
524.872	206.01
525.296	254.55
525.719	181.74
526.143	237.56
526.566	215.72
526.989	184.17
527.412	223
527.836	159.89
528.259	147.76
528.682	174.46
529.105	193.87
529.528	203.58
529.951	159.89
530.374	172.03
530.796	230.28
531.219	210.86
531.642	254.55
532.065	210.86
532.487	206.01
532.91	203.58
533.332	203.58
533.755	169.6
534.177	133.19
534.6	147.76
535.022	235.14
535.444	213.29
535.867	232.71
536.289	167.17
536.711	184.17
537.133	254.55
537.555	150.18
537.977	242.42
538.399	220.57
538.821	181.74
539.243	179.31
539.665	179.31
540.086	198.73
540.508	230.28
540.93	210.86
541.351	125.91
541.773	206.01
542.195	130.77
542.616	159.89
543.037	193.87
543.459	230.28
543.88	290.96
544.301	261.84
544.723	193.87
545.144	254.55
545.565	232.71
545.986	232.71
546.407	310.38
546.828	193.87
547.249	125.91
547.67	125.91
548.091	249.7
548.512	213.29
548.932	150.18
549.353	271.55
549.774	218.15
550.194	150.18
550.615	244.85
551.035	196.3
551.456	198.73
551.876	203.58
552.296	208.44
552.717	181.74
553.137	142.9
553.557	159.89
553.977	167.17
554.397	130.77
554.817	232.71
555.237	232.71
555.657	242.42
556.077	193.87
556.497	208.44
556.917	191.45
557.337	172.03
557.756	201.16
558.176	259.41
558.596	174.46
559.015	150.18
559.435	123.48
559.854	266.69
560.274	256.98
560.693	169.6
561.112	225.43
561.532	176.88
561.951	239.99
562.37	193.87
562.789	179.31
563.208	191.45
563.627	152.61
564.046	179.31
564.465	281.25
564.884	210.86
565.303	186.59
565.722	201.16
566.14	208.44
566.559	232.71
566.978	242.42
567.396	206.01
567.815	254.55
568.233	206.01
568.652	244.85
569.07	215.72
569.489	266.69
569.907	162.32
570.325	218.15
570.743	201.16
571.161	227.86
571.58	179.31
571.998	215.72
572.416	184.17
572.833	210.86
573.251	138.05
573.669	189.02
574.087	244.85
574.505	169.6
574.922	203.58
575.34	138.05
575.758	181.74
576.175	176.88
576.593	181.74
577.01	215.72
577.428	196.3
577.845	1655.06
578.262	341.93
578.68	176.88
579.097	242.42
579.514	172.03
579.931	164.75
580.348	147.76
580.765	176.88
581.182	128.34
581.599	169.6
582.016	239.99
582.433	193.87
582.849	198.73
583.266	237.56
583.683	201.16
584.099	203.58
584.516	159.89
584.933	307.95
585.349	198.73
585.765	167.17
586.182	256.98
586.598	203.58
587.014	196.3
587.431	142.9
587.847	184.17
588.263	162.32
588.679	189.02
589.095	223
589.511	184.17
589.927	235.14
590.343	203.58
590.759	256.98
591.174	203.58
591.59	179.31
592.006	210.86
592.421	157.47
592.837	203.58
593.252	242.42
593.668	164.75
594.083	225.43
594.499	193.87
594.914	138.05
595.329	213.29
595.745	164.75
596.16	215.72
596.575	235.14
596.99	186.59
597.405	174.46
597.82	206.01
598.235	193.87
598.65	189.02
599.065	206.01
599.479	135.62
599.894	196.3
600.309	220.57
600.724	169.6
601.138	179.31
601.553	208.44
601.967	206.01
602.382	164.75
602.796	169.6
603.21	145.33
603.625	259.41
604.039	198.73
604.453	135.62
604.867	215.72
605.281	295.82
605.695	189.02
606.109	218.15
606.523	198.73
606.937	191.45
607.351	351.64
607.765	227.86
608.178	269.12
608.592	206.01
609.006	174.46
609.419	213.29
609.833	162.32
610.246	172.03
610.66	147.76
611.073	215.72
611.487	196.3
611.9	193.87
612.313	186.59
612.726	259.41
613.139	159.89
613.553	133.19
613.966	145.33
614.379	203.58
614.792	191.45
615.204	176.88
615.617	155.04
616.03	215.72
616.443	186.59
616.856	225.43
617.268	184.17
617.681	174.46
618.093	193.87
618.506	244.85
618.918	244.85
619.331	152.61
619.743	138.05
620.155	230.28
620.568	244.85
620.98	172.03
621.392	152.61
621.804	239.99
622.216	244.85
622.628	254.55
623.04	174.46
623.452	159.89
623.864	138.05
624.276	218.15
624.687	167.17
625.099	206.01
625.511	152.61
625.922	138.05
626.334	244.85
626.745	118.63
627.157	157.47
627.568	159.89
627.979	186.59
628.391	218.15
628.802	181.74
629.213	191.45
629.624	230.28
630.035	142.9
630.446	256.98
630.857	203.58
631.268	162.32
631.679	145.33
632.09	147.76
632.501	218.15
632.912	286.11
633.322	191.45
633.733	261.84
634.144	210.86
634.554	176.88
634.965	198.73
635.375	145.33
635.785	140.48
636.196	235.14
636.606	172.03
637.016	196.3
637.427	67.66
637.837	135.62
638.247	155.04
638.657	130.77
639.067	184.17
639.477	201.16
639.887	191.45
640.297	206.01
640.706	189.02
641.116	237.56
641.526	169.6
641.935	145.33
642.345	67.66
642.755	128.34
643.164	174.46
643.573	208.44
643.983	232.71
644.392	239.99
644.801	256.98
645.211	172.03
645.62	147.76
646.029	176.88
646.438	169.6
646.847	184.17
647.256	111.35
647.665	186.59
648.074	193.87
648.483	174.46
648.892	155.04
649.3	198.73
649.709	176.88
650.118	174.46
650.526	220.57
650.935	164.75
651.343	196.3
651.752	210.86
652.16	225.43
652.568	142.9
652.977	104.07
653.385	196.3
653.793	186.59
654.201	218.15
654.609	174.46
655.017	203.58
655.425	179.31
655.833	172.03
656.241	213.29
656.649	189.02
657.057	184.17
657.464	181.74
657.872	147.76
658.28	193.87
658.687	193.87
659.095	172.03
659.502	210.86
659.91	147.76
660.317	201.16
660.724	193.87
661.132	242.42
661.539	206.01
661.946	174.46
662.353	179.31
662.76	99.21
663.167	147.76
663.574	196.3
663.981	210.86
664.388	118.63
664.795	210.86
665.202	116.2
665.608	220.57
666.015	145.33
666.422	150.18
666.828	179.31
667.235	198.73
667.641	172.03
668.047	147.76
668.454	135.62
668.86	208.44
669.266	135.62
669.673	157.47
670.079	295.82
670.485	123.48
670.891	172.03
671.297	130.77
671.703	218.15
672.109	208.44
672.515	179.31
672.92	223
673.326	193.87
673.732	169.6
674.138	220.57
674.543	206.01
674.949	152.61
675.354	198.73
675.76	201.16
676.165	230.28
676.57	181.74
676.976	179.31
677.381	164.75
677.786	147.76
678.191	203.58
678.596	179.31
679.001	155.04
679.406	174.46
679.811	174.46
680.216	218.15
680.621	152.61
681.026	191.45
681.43	208.44
681.835	210.86
682.24	196.3
682.644	193.87
683.049	167.17
683.453	184.17
683.858	118.63
684.262	150.18
684.667	157.47
685.071	116.2
685.475	94.36
685.879	172.03
686.283	167.17
686.687	172.03
687.091	147.76
687.495	232.71
687.899	201.16
688.303	159.89
688.707	142.9
689.111	169.6
689.514	167.17
689.918	155.04
690.322	223
690.725	210.86
691.129	135.62
691.532	203.58
691.936	176.88
692.339	169.6
692.742	220.57
693.146	213.29
693.549	215.72
693.952	239.99
694.355	206.01
694.758	225.43
695.161	179.31
695.564	169.6
695.967	191.45
696.37	157.47
696.773	181.74
697.175	142.9
697.578	218.15
697.981	193.87
698.383	206.01
698.786	181.74
699.188	174.46
699.591	225.43
699.993	164.75
700.395	201.16
700.798	174.46
701.2	172.03
701.602	210.86
702.004	135.62
702.406	186.59
702.808	91.93
703.21	215.72
703.612	191.45
704.014	239.99
704.416	191.45
704.818	162.32
705.219	196.3
705.621	244.85
706.023	162.32
706.424	186.59
706.826	179.31
707.227	201.16
707.629	111.35
708.03	210.86
708.431	256.98
708.832	239.99
709.234	164.75
709.635	208.44
710.036	300.67
710.437	269.12
710.838	191.45
711.239	237.56
711.64	218.15
712.041	179.31
712.441	227.86
712.842	242.42
713.243	254.55
713.643	179.31
714.044	206.01
714.445	247.27
714.845	230.28
715.246	242.42
715.646	288.54
716.046	259.41
716.447	295.82
716.847	310.38
717.247	278.83
717.647	310.38
718.047	307.95
718.447	339.51
718.847	320.09
719.247	380.77
719.647	383.2
720.047	305.53
720.446	317.66
720.846	390.48
721.246	366.21
721.645	332.23
722.045	276.4
722.444	392.91
722.844	412.32
723.243	441.45
723.643	385.62
724.042	402.62
724.441	375.92
724.84	388.05
725.24	422.03
725.639	468.15
726.038	441.45
726.437	499.7
726.836	453.59
727.234	487.57
727.633	509.41
728.032	550.68
728.431	587.08
728.83	543.39
729.228	606.5
729.627	742.43
730.025	698.74
730.424	693.88
730.822	718.15
731.22	754.56
731.619	926.9
732.017	837.09
732.415	1070.1
732.813	1104.08
733.212	1096.8
733.61	1184.18
734.008	1322.53
734.406	1378.36
734.803	1497.29
735.201	1625.94
735.599	1854.09
735.997	1822.54
736.395	1875.94
736.792	2009.44
737.19	2169.63
737.587	2240.02
737.985	2390.51
738.382	2439.05
738.78	2805.57
739.177	2834.69
739.574	2968.19
739.971	3055.57
740.369	3181.78
740.766	3371.11
741.163	3538.59
741.56	3701.21
741.957	3900.24
742.354	4014.32
742.751	4138.11
743.147	4356.56
743.544	4550.74
743.941	4732.78
744.338	5140.55
744.734	5419.68
745.131	5560.46
745.527	5832.31
745.924	6169.7
746.32	6361.45
746.716	6592.03
747.113	7193.98
747.509	7470.69
747.905	7548.36
748.301	7883.31
748.697	8405.17
749.093	8895.47
749.489	9211
749.885	9737.71
750.281	10179.47
750.677	10558.11
751.073	11305.7
751.468	11618.81
751.864	11946.48
752.26	12186.78
752.655	13007.18
753.051	13533.89
753.446	14349.43
753.842	14429.53
754.237	14456.23
754.632	14931.97
755.028	15771.79
755.423	16201.4
755.818	16546.07
756.213	16643.16
756.608	16635.88
757.003	17247.54
757.398	17980.56
757.793	18208.72
758.188	18155.32
758.583	18567.95
758.977	18441.73
759.372	19439.32
759.767	20878.66
760.161	22089.85
760.556	22531.6
760.95	22997.63
761.345	23742.78
761.739	25378.73
762.133	26638.46
762.527	28325.38
762.922	28325.38
763.316	28415.19
763.71	28395.77
764.104	29847.25
764.498	31160.38
764.892	32541.46
765.286	33058.46
765.68	32551.17
766.073	32607
766.467	33488.08
766.861	35466.27
767.255	37143.48
767.648	38082.81
768.042	37815.82
768.435	37832.81
768.829	38827.97
769.222	40476.05
769.615	42781.92
770.008	40939.65
770.402	41031.89
770.795	40551.3
771.188	40660.52
771.581	41170.24
771.974	42667.84
772.367	43349.89
772.76	43446.97
773.153	41272.18
773.545	40706.64
773.938	41478.5
774.331	42517.35
774.724	44114.46
775.116	45922.74
775.509	47388.78
775.901	48000.44
776.294	47320.82
776.686	48376.66
777.078	49968.92
777.471	52286.92
777.863	54209.28
778.255	55075.8
778.647	54876.76
779.039	54233.55
779.431	53498.1
779.823	54168.01
780.215	56803.98
780.607	57512.73
780.999	58299.15
781.39	56296.69
781.782	55915.61
782.174	55867.07
782.565	56913.2
782.957	58250.6
783.348	60182.67
783.74	60357.43
784.131	59024.89
784.522	57762.73
784.914	56335.52
785.305	57005.44
785.696	57524.86
786.087	58350.12
786.478	57413.21
786.869	56374.36
787.26	55316.09
787.651	53223.83
788.042	52051.48
788.433	51286.9
788.823	51609.72
789.214	52852.46
789.605	51592.73
789.995	51218.94
790.386	49386.39
790.776	47187.32
791.167	46464.01
791.557	47689.76
791.948	49578.14
792.338	50942.24
792.728	53090.33
793.118	52978.68
793.508	53160.72
793.898	51359.72
794.288	50631.55
794.678	49837.85
795.068	50262.61
795.458	51563.61
795.848	53197.13
796.238	53197.13
796.627	52512.65
797.017	51714.09
797.406	50558.74
797.796	50068.44
798.185	49939.79
798.575	50711.65
798.964	51808.75
799.354	53141.3
799.743	53738.4
800.132	53505.38
800.521	52701.97
800.91	51250.49
801.299	49177.65
801.688	49034.44
802.077	48512.59
802.466	50592.72
802.855	51735.94
803.244	50510.19
803.633	50638.83
804.021	49206.77
804.41	47524.71
804.799	45349.92
805.187	43129.01
805.576	42087.73
805.964	42075.59
806.352	41561.02
806.741	42381.42
807.129	41845.01
807.517	42128.99
807.905	40755.18
808.293	40269.74
808.681	39374.1
809.069	38165.34
809.457	39827.99
809.845	40337.7
810.233	41565.88
810.621	42534.34
811.009	43311.05
811.396	43012.5
811.784	43187.26
812.171	40611.98
812.559	40126.53
812.946	37801.26
813.334	37726.01
813.721	38034.27
814.108	36859.49
814.496	37769.7
814.883	38332.82
815.27	39827.99
815.657	38667.77
816.044	38260
816.431	36492.98
816.818	34997.81
817.205	33587.6
817.592	34073.04
817.979	33124
818.365	33679.83
818.752	33043.9
819.139	32735.64
819.525	32728.36
819.912	32640.98
820.298	31597.28
820.685	30250.17
821.071	28116.64
821.457	26810.79
821.843	24737.95
822.23	24293.76
822.616	23551.03
823.002	23199.09
823.388	23519.48
823.774	23463.65
824.16	23279.18
824.546	22487.91
824.931	21342.26
825.317	20429.63
825.703	19497.57
826.089	18604.35
826.474	17898.03
826.86	17655.31
827.245	18094.64
827.631	18339.79
828.016	18580.08
828.401	18713.58
828.787	18825.23
829.172	18199.01
829.557	17703.86
829.942	16541.22
830.327	15715.96
830.712	14623.71
831.097	13893.12
831.482	13776.61
831.867	13041.16
832.252	13172.23
832.636	13645.54
833.021	13582.43
833.406	13980.5
833.79	14055.74
834.175	13616.41
834.559	13303.3
834.944	12393.09
835.328	11832.4
835.713	11048.41
836.097	10647.92
836.481	9548.39
836.865	9203.72
837.249	9220.71
837.633	8977.99
838.017	9325.08
838.401	9223.14
838.785	9143.04
839.169	8888.18
839.553	8429.44
839.937	8257.11
840.32	7672.15
840.704	7286.22
841.087	6565.33
841.471	5958.53
841.854	5667.26
842.238	5485.22
842.621	5553.18
843.004	5261.91
843.388	5531.34
843.771	5657.55
844.154	5710.95
844.537	5774.06
844.92	5781.34
845.303	5764.35
845.686	5407.55
846.069	5164.83
846.452	5109
846.834	4684.24
847.217	4252.19
847.6	4041.02
847.982	3856.55
848.365	3822.57
848.748	3783.74
849.13	3732.76
849.512	3791.02
849.895	3720.63
850.277	4007.04
850.659	3888.11
851.041	3803.15
851.423	3776.45
851.806	3888.11
852.188	3555.58
852.57	3468.2
852.951	3295.86
853.333	3121.1
853.715	2900.23
854.097	2718.19
854.479	2652.65
854.86	2538.57
855.242	2237.6
855.623	2288.57
856.005	2354.1
856.386	2237.6
856.768	2220.6
857.149	2240.02
857.53	2278.86
857.911	2157.5
858.292	2198.76
858.674	2028.85
859.055	1941.47
859.436	1701.18
859.817	1749.72
860.197	1698.75
860.578	1533.7
860.959	1358.94
861.34	1235.15
861.72	1254.57
862.101	1130.78
862.482	1230.3
862.862	1179.33
863.243	1157.48
863.623	1125.93
864.003	1172.04
864.384	1074.96
864.764	1036.12
865.144	1172.04
865.524	1028.84
865.904	1004.57
866.284	1087.09
866.664	1074.96
867.044	936.6
867.424	987.58
867.804	873.5
868.183	863.79
868.563	851.65
868.943	788.54
869.322	645.34
869.702	713.3
870.081	577.38
870.461	667.18
870.84	689.03
871.22	642.91
871.599	533.69
871.978	616.21
872.357	567.67
872.736	565.24
873.115	497.28
873.494	604.07
873.873	608.93
874.252	487.57
874.631	456.01
875.01	473
875.388	485.14
875.767	502.13
876.146	436.6
876.524	448.73
876.903	373.49
877.281	434.17
877.66	346.79
878.038	310.38
878.416	358.93
878.794	334.65
879.173	402.62
879.551	310.38
879.929	334.65
880.307	339.51
880.685	307.95
881.063	317.66
881.441	256.98
881.818	283.68
882.196	239.99
882.574	293.39
882.951	283.68
883.329	242.42
883.707	298.24
884.084	242.42
884.461	283.68
884.839	242.42
885.216	179.31
885.593	278.83
885.971	247.27
886.348	300.67
886.725	215.72
887.102	341.93
887.479	264.26
887.856	244.85
888.233	235.14
888.609	249.7
888.986	213.29
889.363	223
889.74	249.7
890.116	191.45
890.493	201.16
890.869	164.75
891.246	174.46
891.622	249.7
891.998	174.46
892.375	215.72
892.751	232.71
893.127	196.3
893.503	138.05
893.879	208.44
894.255	264.26
894.631	189.02
895.007	162.32
895.383	239.99
895.759	215.72
896.134	157.47
896.51	152.61
896.886	235.14
897.261	164.75
897.637	203.58
898.012	140.48
898.388	123.48
898.763	130.77
899.138	176.88
899.514	147.76
899.889	135.62
900.264	145.33
900.639	181.74
901.014	162.32
901.389	215.72
901.764	184.17
902.139	111.35
902.513	159.89
902.888	164.75
903.263	181.74
903.638	167.17
904.012	201.16
904.387	133.19
904.761	256.98
905.136	152.61
905.51	159.89
905.884	140.48
906.259	123.48
906.633	150.18
907.007	167.17
907.381	220.57
907.755	164.75
908.129	113.78
908.503	70.09
908.877	198.73
909.251	123.48
909.624	142.9
909.998	125.91
910.372	116.2
910.745	140.48
911.119	157.47
911.492	172.03
911.866	174.46
912.239	108.92
912.612	142.9
912.986	201.16
913.359	159.89
913.732	147.76
914.105	186.59
914.478	225.43
914.851	189.02
915.224	133.19
915.597	118.63
915.97	162.32
916.343	169.6
916.715	169.6
917.088	206.01
917.461	159.89
917.833	189.02
918.206	155.04
918.578	155.04
918.951	242.42
919.323	176.88
919.695	123.48
920.067	184.17
920.44	121.06
920.812	159.89
921.184	140.48
921.556	201.16
921.928	104.07
922.3	116.2
922.672	142.9
923.043	130.77
923.415	133.19
923.787	152.61
924.158	133.19
924.53	208.44
924.901	147.76
925.273	159.89
925.644	189.02
926.016	196.3
926.387	184.17
926.758	121.06
927.129	130.77
927.5	118.63
927.872	152.61
928.243	99.21
928.613	145.33
928.984	145.33
929.355	138.05
929.726	138.05
930.097	125.91
930.467	196.3
930.838	208.44
931.209	159.89
931.579	184.17
931.95	164.75
932.32	196.3
932.69	215.72
933.061	172.03
933.431	247.27
933.801	155.04
934.171	111.35
934.541	145.33
934.911	174.46
935.281	142.9
935.651	152.61
936.021	157.47
936.391	206.01
936.761	130.77
937.13	157.47
937.5	121.06
937.87	152.61
938.239	101.64
938.609	206.01
938.978	181.74
939.347	193.87
939.717	104.07
940.086	218.15
940.455	169.6
940.824	169.6
941.193	201.16
941.562	191.45
941.931	70.09
942.3	208.44
942.669	196.3
943.038	159.89
943.407	237.56
943.775	162.32
944.144	179.31
944.513	179.31
944.881	140.48
945.25	213.29
945.618	145.33
945.986	138.05
946.355	159.89
946.723	140.48
947.091	152.61
947.459	191.45
947.827	220.57
948.195	111.35
948.563	123.48
948.931	138.05
949.299	116.2
949.667	181.74
950.035	106.49
950.402	147.76
950.77	116.2
951.138	169.6
951.505	140.48
951.873	174.46
952.24	155.04
952.607	223
952.975	138.05
953.342	186.59
953.709	191.45
954.076	181.74
954.443	135.62
954.81	179.31
955.177	239.99
955.544	111.35
955.911	223
956.278	150.18
956.645	167.17
957.012	159.89
957.378	142.9
957.745	118.63
958.111	116.2
958.478	198.73
958.844	201.16
959.211	155.04
959.577	130.77
959.943	138.05
960.309	172.03
960.675	172.03
961.042	99.21
961.408	162.32
961.774	135.62
962.139	172.03
962.505	237.56
962.871	142.9
963.237	128.34
963.603	172.03
963.968	82.22
964.334	157.47
964.699	206.01
965.065	113.78
965.43	193.87
965.796	150.18
966.161	147.76
966.526	123.48
966.891	106.49
967.256	125.91
967.622	196.3
967.987	130.77
968.352	227.86
968.716	142.9
969.081	145.33
969.446	208.44
969.811	220.57
970.176	108.92
970.54	235.14
970.905	155.04
971.269	169.6
971.634	53.1
971.998	169.6
972.363	186.59
972.727	157.47
973.091	123.48
973.455	135.62
973.819	164.75
974.183	155.04
974.547	106.49
974.911	196.3
975.275	140.48
975.639	142.9
976.003	164.75
976.367	133.19
976.73	72.51
977.094	96.79
977.458	167.17
977.821	138.05
978.185	213.29
978.548	164.75
978.911	145.33
979.275	179.31
979.638	125.91
980.001	164.75
980.364	159.89
980.727	121.06
981.09	191.45
981.453	140.48
981.816	181.74
982.179	167.17
982.542	128.34
982.905	157.47
983.267	150.18
983.63	181.74
983.992	142.9
984.355	150.18
984.717	152.61
985.08	108.92
985.442	196.3
985.804	108.92
986.167	130.77
986.529	145.33
986.891	176.88
987.253	164.75
987.615	198.73
987.977	130.77
988.339	94.36
988.701	91.93
989.062	179.31
989.424	169.6
989.786	118.63
990.147	172.03
990.509	130.77
990.87	189.02
991.232	271.55
991.593	111.35
991.955	118.63
992.316	196.3
992.677	164.75
993.038	104.07
993.399	206.01
993.76	176.88
994.121	167.17
994.482	169.6
994.843	189.02
995.204	184.17
995.565	118.63
995.926	186.59
996.286	201.16
996.647	167.17
997.007	82.22
997.368	133.19
997.728	157.47
998.089	150.18
998.449	169.6
998.809	203.58
999.169	164.75
999.53	150.18
999.89	196.3
1000.25	155.04
1000.61	99.21
1000.97	123.48
1001.329	77.37
1001.689	94.36
1002.049	176.88
1002.409	213.29
1002.768	157.47
1003.128	121.06
1003.487	181.74
1003.847	198.73
1004.206	94.36
1004.566	164.75
1004.925	123.48
1005.284	150.18
1005.643	147.76
1006.003	215.72
1006.362	155.04
1006.721	145.33
1007.08	142.9
1007.438	130.77
1007.797	155.04
1008.156	116.2
1008.515	125.91
1008.874	157.47
1009.232	145.33
1009.591	147.76
1009.949	138.05
1010.308	201.16
1010.666	191.45
1011.024	138.05
1011.383	206.01
1011.741	159.89
1012.099	138.05
1012.457	147.76
1012.815	155.04
1013.173	133.19
1013.531	220.57
1013.889	215.72
1014.247	118.63
1014.605	145.33
1014.962	201.16
1015.32	191.45
1015.678	179.31
1016.035	186.59
1016.393	157.47
1016.75	104.07
1017.107	145.33
1017.465	128.34
1017.822	157.47
1018.179	123.48
1018.536	145.33
1018.894	128.34
1019.251	104.07
1019.608	121.06
1019.964	179.31
1020.321	157.47
1020.678	111.35
1021.035	121.06
1021.392	237.56
1021.748	67.66
1022.105	130.77
1022.461	140.48
1022.818	186.59
1023.174	125.91
1023.531	167.17
1023.887	138.05
1024.243	142.9
1024.599	189.02
1024.955	125.91
1025.311	104.07
1025.667	152.61
1026.023	174.46
1026.379	142.9
1026.735	218.15
1027.091	130.77
1027.447	118.63
