189.514	82.22
189.973	82.22
190.431	82.22
190.889	28.82
191.348	-12.44
191.806	-34.28
192.264	48.24
192.722	14.26
193.18	-14.87
193.638	-36.71
194.096	31.25
194.554	-17.29
195.012	9.41
195.47	-51.28
195.928	-63.41
196.385	-2.73
196.843	-27
197.301	-2.73
197.758	-48.85
198.216	43.39
198.674	21.54
199.131	96.79
199.589	118.63
200.046	38.53
200.503	43.39
200.961	94.36
201.418	62.8
201.875	72.51
202.332	130.77
202.79	118.63
203.247	138.05
203.704	138.05
204.161	167.17
204.618	193.87
205.075	179.31
205.532	203.58
205.989	106.49
206.445	130.77
206.902	172.03
207.359	152.61
207.816	167.17
208.272	135.62
208.729	101.64
209.185	133.19
209.642	191.45
210.098	198.73
210.555	184.17
211.011	176.88
211.467	70.09
211.924	147.76
212.38	87.08
212.836	150.18
213.292	196.3
213.748	237.56
214.204	159.89
214.66	155.04
215.116	142.9
215.572	113.78
216.028	157.47
216.484	193.87
216.94	179.31
217.396	138.05
217.851	193.87
218.307	191.45
218.763	70.09
219.218	201.16
219.674	189.02
220.129	172.03
220.585	123.48
221.04	135.62
221.496	142.9
221.951	159.89
222.406	186.59
222.861	138.05
223.317	179.31
223.772	159.89
224.227	172.03
224.682	215.72
225.137	72.51
225.592	162.32
226.047	125.91
226.502	167.17
226.957	193.87
227.411	167.17
227.866	186.59
228.321	181.74
228.776	89.5
229.23	145.33
229.685	101.64
230.139	133.19
230.594	167.17
231.048	179.31
231.503	65.23
231.957	138.05
232.411	106.49
232.865	116.2
233.32	113.78
233.774	140.48
234.228	150.18
234.682	210.86
235.136	74.94
235.59	189.02
236.044	193.87
236.498	116.2
236.952	111.35
237.406	128.34
237.86	169.6
238.313	152.61
238.767	152.61
239.221	135.62
239.674	184.17
240.128	142.9
240.581	128.34
241.035	193.87
241.488	191.45
241.942	121.06
242.395	155.04
242.848	133.19
243.301	152.61
243.755	169.6
244.208	106.49
244.661	106.49
245.114	164.75
245.567	181.74
246.02	159.89
246.473	159.89
246.926	206.01
247.379	138.05
247.832	176.88
248.284	155.04
248.737	118.63
249.19	138.05
249.642	133.19
250.095	130.77
250.547	142.9
251	162.32
251.452	140.48
251.905	43.39
252.357	142.9
252.81	150.18
253.262	91.93
253.714	121.06
254.166	62.8
254.618	106.49
255.07	167.17
255.523	193.87
255.975	113.78
256.427	133.19
256.878	147.76
257.33	162.32
257.782	106.49
258.234	193.87
258.686	138.05
259.137	215.72
259.589	191.45
260.041	125.91
260.492	142.9
260.944	198.73
261.395	140.48
261.847	150.18
262.298	145.33
262.749	186.59
263.201	196.3
263.652	91.93
264.103	174.46
264.554	116.2
265.005	167.17
265.457	206.01
265.908	125.91
266.359	159.89
266.809	184.17
267.26	147.76
267.711	135.62
268.162	111.35
268.613	179.31
269.064	201.16
269.514	125.91
269.965	140.48
270.415	167.17
270.866	116.2
271.316	133.19
271.767	133.19
272.217	94.36
272.668	210.86
273.118	164.75
273.568	159.89
274.019	106.49
274.469	145.33
274.919	176.88
275.369	155.04
275.819	176.88
276.269	150.18
276.719	167.17
277.169	155.04
277.619	113.78
278.069	140.48
278.518	174.46
278.968	133.19
279.418	116.2
279.867	162.32
280.317	162.32
280.767	123.48
281.216	184.17
281.666	147.76
282.115	101.64
282.564	133.19
283.014	62.8
283.463	155.04
283.912	159.89
284.361	147.76
284.811	155.04
285.26	220.57
285.709	125.91
286.158	140.48
286.607	130.77
287.056	167.17
287.505	152.61
287.953	113.78
288.402	164.75
288.851	108.92
289.3	130.77
289.748	111.35
290.197	232.71
290.646	174.46
291.094	123.48
291.543	116.2
291.991	157.47
292.439	152.61
292.888	138.05
293.336	172.03
293.784	172.03
294.233	201.16
294.681	145.33
295.129	135.62
295.577	128.34
296.025	152.61
296.473	198.73
296.921	201.16
297.369	150.18
297.817	172.03
298.264	179.31
298.712	130.77
299.16	140.48
299.608	96.79
300.055	203.58
300.503	193.87
300.95	176.88
301.398	150.18
301.845	113.78
302.293	99.21
302.74	155.04
303.187	157.47
303.635	181.74
304.082	150.18
304.529	123.48
304.976	142.9
305.423	159.89
305.87	198.73
306.317	181.74
306.764	172.03
307.211	135.62
307.658	172.03
308.105	193.87
308.552	196.3
308.998	184.17
309.445	138.05
309.892	138.05
310.338	125.91
310.785	164.75
311.231	89.5
311.678	157.47
312.124	164.75
312.571	181.74
313.017	184.17
313.463	230.28
313.909	155.04
314.356	215.72
314.802	133.19
315.248	169.6
315.694	138.05
316.14	164.75
316.586	152.61
317.032	147.76
317.478	138.05
317.923	99.21
318.369	133.19
318.815	125.91
319.261	104.07
319.706	162.32
320.152	135.62
320.597	203.58
321.043	130.77
321.488	198.73
321.934	150.18
322.379	87.08
322.824	196.3
323.27	210.86
323.715	111.35
324.16	191.45
324.605	152.61
325.05	152.61
325.495	172.03
325.94	116.2
326.385	213.29
326.83	172.03
327.275	164.75
327.72	155.04
328.165	189.02
328.61	111.35
329.054	172.03
329.499	259.41
329.943	235.14
330.388	167.17
330.832	196.3
331.277	196.3
331.721	113.78
332.166	138.05
332.61	172.03
333.054	106.49
333.499	125.91
333.943	96.79
334.387	130.77
334.831	157.47
335.275	172.03
335.719	167.17
336.163	111.35
336.607	104.07
337.051	152.61
337.495	155.04
337.938	91.93
338.382	111.35
338.826	172.03
339.269	174.46
339.713	116.2
340.157	169.6
340.6	101.64
341.044	150.18
341.487	118.63
341.93	201.16
342.374	230.28
342.817	142.9
343.26	191.45
343.703	162.32
344.146	108.92
344.59	152.61
345.033	167.17
345.476	174.46
345.919	84.65
346.361	152.61
346.804	181.74
347.247	162.32
347.69	145.33
348.133	138.05
348.575	210.86
349.018	138.05
349.461	116.2
349.903	142.9
350.346	138.05
350.788	164.75
351.23	135.62
351.673	179.31
352.115	210.86
352.557	118.63
353	116.2
353.442	213.29
353.884	152.61
354.326	135.62
354.768	164.75
355.21	77.37
355.652	121.06
356.094	113.78
356.536	176.88
356.978	147.76
357.419	186.59
357.861	145.33
358.303	172.03
358.744	145.33
359.186	232.71
359.627	189.02
360.069	191.45
360.51	172.03
360.952	121.06
361.393	159.89
361.834	203.58
362.276	191.45
362.717	172.03
363.158	152.61
363.599	172.03
364.04	123.48
364.481	142.9
364.922	172.03
365.363	82.22
365.804	133.19
366.245	215.72
366.686	152.61
367.126	198.73
367.567	201.16
368.008	152.61
368.448	150.18
368.889	152.61
369.33	101.64
369.77	174.46
370.21	157.47
370.651	128.34
371.091	140.48
371.531	184.17
371.972	152.61
372.412	206.01
372.852	186.59
373.292	157.47
373.732	125.91
374.172	193.87
374.612	181.74
375.052	164.75
375.492	142.9
375.932	181.74
376.372	172.03
376.811	133.19
377.251	174.46
377.691	176.88
378.13	164.75
378.57	157.47
379.009	176.88
379.449	96.79
379.888	87.08
380.328	138.05
380.767	99.21
381.206	138.05
381.645	140.48
382.085	111.35
382.524	164.75
382.963	159.89
383.402	140.48
383.841	133.19
384.28	113.78
384.719	157.47
385.158	96.79
385.596	138.05
386.035	106.49
386.474	77.37
386.913	181.74
387.351	184.17
387.79	152.61
388.228	150.18
388.667	138.05
389.105	152.61
389.544	140.48
389.982	138.05
390.42	181.74
390.859	116.2
391.297	101.64
391.735	189.02
392.173	101.64
392.611	191.45
393.049	203.58
393.487	118.63
393.925	104.07
394.363	172.03
394.801	164.75
395.239	167.17
395.676	140.48
396.114	111.35
396.552	133.19
396.989	138.05
397.427	104.07
397.864	193.87
398.302	198.73
398.739	106.49
399.177	152.61
399.614	135.62
400.051	138.05
400.488	208.44
400.926	176.88
401.363	189.02
401.8	84.65
402.237	111.35
402.674	196.3
403.111	169.6
403.548	123.48
403.985	164.75
404.421	157.47
404.858	70.09
405.295	111.35
405.732	125.91
406.168	128.34
406.605	186.59
407.041	128.34
407.478	145.33
407.914	157.47
408.351	181.74
408.787	147.76
409.223	130.77
409.66	184.17
410.096	140.48
410.532	206.01
410.968	159.89
411.404	162.32
411.84	145.33
412.276	147.76
412.712	164.75
413.148	167.17
413.584	133.19
414.02	203.58
414.455	118.63
414.891	145.33
415.327	108.92
415.762	79.79
416.198	111.35
416.633	128.34
417.069	123.48
417.504	140.48
417.94	150.18
418.375	167.17
418.81	174.46
419.245	159.89
419.681	191.45
420.116	157.47
420.551	184.17
420.986	133.19
421.421	167.17
421.856	184.17
422.291	128.34
422.726	145.33
423.16	130.77
423.595	152.61
424.03	116.2
424.464	145.33
424.899	230.28
425.334	191.45
425.768	159.89
426.203	111.35
426.637	147.76
427.071	82.22
427.506	147.76
427.94	159.89
428.374	94.36
428.809	172.03
429.243	169.6
429.677	213.29
430.111	174.46
430.545	147.76
430.979	169.6
431.413	198.73
431.847	206.01
432.28	128.34
432.714	142.9
433.148	140.48
433.582	169.6
434.015	184.17
434.449	174.46
434.882	140.48
435.316	155.04
435.749	125.91
436.183	179.31
436.616	181.74
437.049	191.45
437.483	155.04
437.916	123.48
438.349	152.61
438.782	210.86
439.215	174.46
439.648	220.57
440.081	162.32
440.514	128.34
440.947	72.51
441.38	181.74
441.813	138.05
442.245	213.29
442.678	176.88
443.111	206.01
443.543	184.17
443.976	152.61
444.408	138.05
444.841	191.45
445.273	191.45
445.705	203.58
446.138	201.16
446.57	159.89
447.002	140.48
447.434	223
447.867	206.01
448.299	181.74
448.731	213.29
449.163	203.58
449.595	232.71
450.026	266.69
450.458	210.86
450.89	210.86
451.322	198.73
451.754	266.69
452.185	184.17
452.617	181.74
453.048	215.72
453.48	215.72
453.911	232.71
454.343	208.44
454.774	181.74
455.205	244.85
455.637	213.29
456.068	254.55
456.499	237.56
456.93	254.55
457.361	259.41
457.792	227.86
458.223	252.13
458.654	235.14
459.085	230.28
459.516	286.11
459.947	290.96
460.378	286.11
460.808	208.44
461.239	278.83
461.669	244.85
462.1	271.55
462.531	261.84
462.961	271.55
463.391	215.72
463.822	269.12
464.252	215.72
464.682	189.02
465.113	281.25
465.543	239.99
465.973	320.09
466.403	227.86
466.833	227.86
467.263	201.16
467.693	169.6
468.123	215.72
468.553	220.57
468.983	210.86
469.412	142.9
469.842	218.15
470.272	286.11
470.701	223
471.131	239.99
471.56	193.87
471.99	133.19
472.419	235.14
472.849	235.14
473.278	225.43
473.707	206.01
474.136	261.84
474.566	225.43
474.995	230.28
475.424	281.25
475.853	232.71
476.282	179.31
476.711	193.87
477.14	142.9
477.569	179.31
477.997	186.59
478.426	208.44
478.855	145.33
479.283	320.09
479.712	232.71
480.141	254.55
480.569	184.17
480.998	196.3
481.426	184.17
481.854	128.34
482.283	220.57
482.711	189.02
483.139	235.14
483.567	193.87
483.995	206.01
484.424	191.45
484.852	133.19
485.28	179.31
485.708	172.03
486.135	162.32
486.563	215.72
486.991	210.86
487.419	128.34
487.847	203.58
488.274	174.46
488.702	191.45
489.129	218.15
489.557	189.02
489.984	147.76
490.412	157.47
490.839	162.32
491.266	256.98
491.694	179.31
492.121	230.28
492.548	155.04
492.975	147.76
493.402	162.32
493.829	232.71
494.256	198.73
494.683	174.46
495.11	215.72
495.537	142.9
495.964	152.61
496.39	157.47
496.817	169.6
497.244	150.18
497.67	198.73
498.097	181.74
498.523	152.61
498.95	133.19
499.376	116.2
499.803	196.3
500.229	147.76
500.655	186.59
501.081	189.02
501.508	167.17
501.934	215.72
502.36	130.77
502.786	271.55
503.212	193.87
503.638	142.9
504.064	227.86
504.489	135.62
504.915	159.89
505.341	159.89
505.767	218.15
506.192	186.59
506.618	223
507.043	181.74
507.469	220.57
507.894	108.92
508.32	140.48
508.745	176.88
509.17	176.88
509.596	123.48
510.021	169.6
510.446	206.01
510.871	186.59
511.296	133.19
511.721	164.75
512.146	225.43
512.571	189.02
512.996	172.03
513.421	210.86
513.845	159.89
514.27	193.87
514.695	150.18
515.119	169.6
515.544	157.47
515.969	239.99
516.393	111.35
516.817	172.03
517.242	147.76
517.666	196.3
518.09	111.35
518.515	172.03
518.939	172.03
519.363	317.66
519.787	232.71
520.211	157.47
520.635	169.6
521.059	239.99
521.483	159.89
521.907	210.86
522.331	125.91
522.754	193.87
523.178	191.45
523.602	225.43
524.025	230.28
524.449	232.71
524.872	133.19
525.296	135.62
525.719	169.6
526.143	223
526.566	167.17
526.989	167.17
527.412	169.6
527.836	191.45
528.259	169.6
528.682	138.05
529.105	157.47
529.528	135.62
529.951	96.79
530.374	118.63
530.796	157.47
531.219	172.03
531.642	179.31
532.065	130.77
532.487	106.49
532.91	198.73
533.332	123.48
533.755	121.06
534.177	201.16
534.6	201.16
535.022	220.57
535.444	150.18
535.867	169.6
536.289	172.03
536.711	232.71
537.133	223
537.555	196.3
537.977	189.02
538.399	145.33
538.821	254.55
539.243	201.16
539.665	225.43
540.086	60.38
540.508	208.44
540.93	206.01
541.351	193.87
541.773	155.04
542.195	203.58
542.616	193.87
543.037	230.28
543.459	196.3
543.88	162.32
544.301	147.76
544.723	232.71
545.144	159.89
545.565	176.88
545.986	176.88
546.407	174.46
546.828	181.74
547.249	213.29
547.67	179.31
548.091	181.74
548.512	193.87
548.932	193.87
549.353	252.13
549.774	142.9
550.194	210.86
550.615	196.3
551.035	210.86
551.456	133.19
551.876	118.63
552.296	145.33
552.717	159.89
553.137	130.77
553.557	201.16
553.977	94.36
554.397	196.3
554.817	121.06
555.237	223
555.657	281.25
556.077	147.76
556.497	172.03
556.917	223
557.337	157.47
557.756	225.43
558.176	162.32
558.596	159.89
559.015	184.17
559.435	179.31
559.854	128.34
560.274	164.75
560.693	256.98
561.112	206.01
561.532	174.46
561.951	169.6
562.37	193.87
562.789	135.62
563.208	169.6
563.627	135.62
564.046	244.85
564.465	174.46
564.884	157.47
565.303	201.16
565.722	220.57
566.14	186.59
566.559	101.64
566.978	235.14
567.396	203.58
567.815	181.74
568.233	201.16
568.652	128.34
569.07	206.01
569.489	147.76
569.907	196.3
570.325	142.9
570.743	157.47
571.161	128.34
571.58	147.76
571.998	203.58
572.416	186.59
572.833	184.17
573.251	210.86
573.669	142.9
574.087	184.17
574.505	155.04
574.922	157.47
575.34	123.48
575.758	206.01
576.175	159.89
576.593	196.3
577.01	176.88
577.428	184.17
577.845	1939.05
578.262	276.4
578.68	223
579.097	135.62
579.514	159.89
579.931	116.2
580.348	181.74
580.765	208.44
581.182	159.89
581.599	220.57
582.016	172.03
582.433	225.43
582.849	179.31
583.266	138.05
583.683	181.74
584.099	157.47
584.516	208.44
584.933	159.89
585.349	203.58
585.765	201.16
586.182	181.74
586.598	191.45
587.014	213.29
587.431	191.45
587.847	269.12
588.263	123.48
588.679	227.86
589.095	172.03
589.511	113.78
589.927	174.46
590.343	184.17
590.759	140.48
591.174	203.58
591.59	184.17
592.006	162.32
592.421	89.5
592.837	179.31
593.252	203.58
593.668	210.86
594.083	191.45
594.499	169.6
594.914	237.56
595.329	198.73
595.745	193.87
596.16	138.05
596.575	230.28
596.99	184.17
597.405	157.47
597.82	159.89
598.235	203.58
598.65	104.07
599.065	278.83
599.479	176.88
599.894	162.32
600.309	172.03
600.724	179.31
601.138	135.62
601.553	128.34
601.967	174.46
602.382	196.3
602.796	179.31
603.21	169.6
603.625	176.88
604.039	181.74
604.453	176.88
604.867	128.34
605.281	203.58
605.695	155.04
606.109	176.88
606.523	142.9
606.937	169.6
607.351	303.1
607.765	174.46
608.178	142.9
608.592	179.31
609.006	135.62
609.419	208.44
609.833	145.33
610.246	225.43
610.66	111.35
611.073	164.75
611.487	247.27
611.9	215.72
612.313	150.18
612.726	152.61
613.139	150.18
613.553	196.3
613.966	193.87
614.379	191.45
614.792	179.31
615.204	172.03
615.617	179.31
616.03	159.89
616.443	230.28
616.856	213.29
617.268	147.76
617.681	206.01
618.093	230.28
618.506	179.31
618.918	101.64
619.331	145.33
619.743	130.77
620.155	203.58
620.568	155.04
620.98	130.77
621.392	184.17
621.804	232.71
622.216	152.61
622.628	172.03
623.04	130.77
623.452	79.79
623.864	159.89
624.276	162.32
624.687	145.33
625.099	186.59
625.511	184.17
625.922	138.05
626.334	225.43
626.745	145.33
627.157	172.03
627.568	108.92
627.979	118.63
628.391	184.17
628.802	140.48
629.213	201.16
629.624	196.3
630.035	164.75
630.446	157.47
630.857	249.7
631.268	128.34
631.679	152.61
632.09	203.58
632.501	176.88
632.912	179.31
633.322	203.58
633.733	198.73
634.144	159.89
634.554	174.46
634.965	152.61
635.375	135.62
635.785	176.88
636.196	181.74
636.606	176.88
637.016	191.45
637.427	87.08
637.837	191.45
638.247	191.45
638.657	176.88
639.067	155.04
639.477	138.05
639.887	159.89
640.297	269.12
640.706	155.04
641.116	65.23
641.526	230.28
641.935	196.3
642.345	159.89
642.755	157.47
643.164	169.6
643.573	184.17
643.983	179.31
644.392	138.05
644.801	145.33
645.211	140.48
645.62	147.76
646.029	147.76
646.438	176.88
646.847	167.17
647.256	184.17
647.665	157.47
648.074	91.93
648.483	206.01
648.892	130.77
649.3	189.02
649.709	142.9
650.118	198.73
650.526	169.6
650.935	121.06
651.343	281.25
651.752	142.9
652.16	164.75
652.568	218.15
652.977	174.46
653.385	140.48
653.793	113.78
654.201	99.21
654.609	162.32
655.017	125.91
655.425	121.06
655.833	198.73
656.241	125.91
656.649	121.06
657.057	150.18
657.464	191.45
657.872	157.47
658.28	157.47
658.687	176.88
659.095	189.02
659.502	145.33
659.91	121.06
660.317	142.9
660.724	179.31
661.132	150.18
661.539	198.73
661.946	186.59
662.353	167.17
662.76	152.61
663.167	125.91
663.574	123.48
663.981	162.32
664.388	181.74
664.795	128.34
665.202	140.48
665.608	169.6
666.015	167.17
666.422	215.72
666.828	111.35
667.235	135.62
667.641	176.88
668.047	104.07
668.454	164.75
668.86	111.35
669.266	215.72
669.673	121.06
670.079	210.86
670.485	118.63
670.891	191.45
671.297	227.86
671.703	150.18
672.109	140.48
672.515	174.46
672.92	164.75
673.326	157.47
673.732	201.16
674.138	232.71
674.543	218.15
674.949	150.18
675.354	91.93
675.76	220.57
676.165	142.9
676.57	196.3
676.976	172.03
677.381	130.77
677.786	198.73
678.191	150.18
678.596	179.31
679.001	118.63
679.406	210.86
679.811	203.58
680.216	150.18
680.621	252.13
681.026	118.63
681.43	72.51
681.835	108.92
682.24	162.32
682.644	167.17
683.049	208.44
683.453	159.89
683.858	193.87
684.262	135.62
684.667	186.59
685.071	70.09
685.475	89.5
685.879	193.87
686.283	147.76
686.687	193.87
687.091	150.18
687.495	140.48
687.899	196.3
688.303	145.33
688.707	164.75
689.111	179.31
689.514	150.18
689.918	145.33
690.322	125.91
690.725	157.47
691.129	213.29
691.532	133.19
691.936	215.72
692.339	218.15
692.742	159.89
693.146	213.29
693.549	196.3
693.952	164.75
694.355	121.06
694.758	164.75
695.161	198.73
695.564	147.76
695.967	189.02
696.37	232.71
696.773	145.33
697.175	181.74
697.578	172.03
697.981	155.04
698.383	206.01
698.786	116.2
699.188	123.48
699.591	157.47
699.993	155.04
700.395	150.18
700.798	128.34
701.2	172.03
701.602	157.47
702.004	162.32
702.406	198.73
702.808	201.16
703.21	167.17
703.612	203.58
704.014	140.48
704.416	169.6
704.818	138.05
705.219	191.45
705.621	176.88
706.023	167.17
706.424	181.74
706.826	184.17
707.227	208.44
707.629	208.44
708.03	201.16
708.431	264.26
708.832	150.18
709.234	184.17
709.635	186.59
710.036	208.44
710.437	184.17
710.838	213.29
711.239	232.71
711.64	193.87
712.041	223
712.441	227.86
712.842	198.73
713.243	256.98
713.643	261.84
714.044	206.01
714.445	242.42
714.845	256.98
715.246	230.28
715.646	290.96
716.046	140.48
716.447	210.86
716.847	213.29
717.247	155.04
717.647	220.57
718.047	232.71
718.447	230.28
718.847	220.57
719.247	300.67
719.647	232.71
720.047	201.16
720.446	184.17
720.846	261.84
721.246	290.96
721.645	230.28
722.045	298.24
722.444	247.27
722.844	290.96
723.243	264.26
723.643	264.26
724.042	230.28
724.441	300.67
724.84	286.11
725.24	283.68
725.639	278.83
726.038	337.08
726.437	218.15
726.836	324.94
727.234	368.63
727.633	346.79
728.032	361.35
728.431	312.81
728.83	414.75
729.228	465.72
729.627	354.07
730.025	429.31
730.424	424.46
730.822	429.31
731.22	606.5
731.619	655.05
732.017	599.22
732.415	696.31
732.813	674.46
733.212	635.63
733.61	793.4
734.008	888.06
734.406	866.21
734.803	1113.79
735.201	1283.7
735.599	1349.23
735.997	1373.5
736.395	1257
736.792	1307.97
737.19	1286.12
737.587	1414.77
737.985	1696.32
738.382	1725.45
738.78	2220.6
739.177	2298.28
739.574	2504.59
739.971	2511.87
740.369	2315.27
740.766	2159.92
741.163	1943.9
741.56	2096.82
741.957	2252.16
742.354	2545.85
742.751	3070.13
743.147	3490.04
743.544	3664.8
743.941	3871.12
744.338	3776.45
744.734	3553.15
745.131	3176.93
745.527	2905.08
745.924	3101.69
746.32	3436.64
746.716	4106.56
747.113	5293.47
747.509	6422.13
747.905	7431.85
748.301	8014.38
748.697	8177.01
749.093	7866.32
749.489	6856.6
749.885	6070.18
750.281	5667.26
750.677	5274.05
751.073	5951.25
751.468	6970.68
751.864	8444
752.26	10342.09
752.655	11871.24
753.051	13293.59
753.446	13813.02
753.842	14009.62
754.237	13366.41
754.632	11958.62
755.028	10582.39
755.423	8834.79
755.818	7854.19
756.213	7761.95
756.608	7912.44
757.003	8781.39
757.398	10698.89
757.793	12305.71
758.188	13953.8
758.583	15944.12
758.977	17140.74
759.372	17640.75
759.767	18247.55
760.161	17563.08
760.556	15842.18
760.95	14235.35
761.345	12776.59
761.739	11715.9
762.133	11672.21
762.527	11931.92
762.922	13779.04
763.316	16330.05
763.71	19410.19
764.104	22652.96
764.498	26672.44
764.892	29704.04
765.286	32849.72
765.68	34359.45
766.073	35366.75
766.467	34369.16
766.861	33182.25
767.255	31983.2
767.648	29007.43
768.042	25788.93
768.435	23230.64
768.829	20902.93
769.222	19541.26
769.615	18847.08
770.008	19310.68
770.402	20803.42
770.795	23427.25
771.188	27301.09
771.581	30755.03
771.974	33526.92
772.367	36308.51
772.76	40209.06
773.153	41699.37
773.545	44082.91
773.938	43774.65
774.331	43272.21
774.724	42352.3
775.116	41645.98
775.509	40910.53
775.901	38854.67
776.294	36189.58
776.686	32357
777.078	29378.79
777.471	27143.32
777.863	25512.23
778.255	24665.13
778.647	23832.59
779.039	24473.38
779.431	25546.21
779.823	28145.77
780.215	31111.83
780.607	34051.2
780.999	38480.88
781.39	42595.02
781.782	47464.03
782.174	51587.88
782.565	55364.64
782.957	57927.78
783.348	59575.87
783.74	60532.19
784.131	60454.52
784.522	61112.3
784.914	60971.52
785.305	60148.69
785.696	58621.97
786.087	57012.72
786.478	54670.45
786.869	51209.23
787.26	47721.31
787.651	43980.96
788.042	39990.61
788.433	36170.16
788.823	31199.21
789.214	27786.54
789.605	24636
789.995	22225.77
790.386	20024.28
790.776	18495.13
791.167	17252.39
791.557	16990.25
791.948	17031.51
792.338	17121.32
792.728	17966
793.118	18478.14
793.508	19182.03
793.898	19541.26
794.288	20808.27
794.678	21572.85
795.068	23213.65
795.458	24344.74
795.848	25572.91
796.238	27237.98
796.627	28060.81
797.017	29830.26
797.406	31587.57
797.796	32721.08
798.185	34475.96
798.575	36480.85
798.964	37881.35
799.354	39939.64
799.743	41153.25
800.132	43010.07
800.521	43563.48
800.91	43595.03
801.299	44425.14
801.688	45881.48
802.077	45908.18
802.466	46813.53
802.855	47092.66
803.244	46206.73
803.633	45762.54
804.021	46294.11
804.41	45099.91
804.799	44274.66
805.187	42053.75
805.576	41461.51
805.964	41192.08
806.352	39777.01
806.741	39318.27
807.129	38415.34
807.517	37699.31
807.905	36374.05
808.293	37381.35
808.681	37718.73
809.069	38158.06
809.457	40158.09
809.845	40871.69
810.233	40679.94
810.621	41772.19
811.009	41267.33
811.396	41648.4
811.784	40582.85
812.171	41041.6
812.559	40541.59
812.946	39655.65
813.334	39903.23
813.721	39609.54
814.108	37827.95
814.496	38408.06
814.883	37912.91
815.27	39604.68
815.657	40318.28
816.044	40247.9
816.431	39303.71
816.818	39051.27
817.205	39568.27
817.592	39073.12
817.979	38738.16
818.365	38182.33
818.752	36631.33
819.139	35539.08
819.525	35233.25
819.912	33978.38
820.298	33475.95
820.685	31747.76
821.071	30289
821.457	29199.18
821.843	28014.7
822.23	27065.65
822.616	25446.69
823.002	23082.58
823.388	21854.41
823.774	20495.16
824.16	19223.3
824.546	18254.83
824.931	17376.18
825.317	16999.96
825.703	16694.13
826.089	16138.3
826.474	15546.05
826.86	14978.08
827.245	14291.18
827.631	13720.78
828.016	13390.68
828.401	12405.23
828.787	11985.32
829.172	11133.36
829.557	10070.24
829.942	9548.39
830.327	8817.79
830.712	8303.22
831.097	7626.03
831.482	7096.89
831.867	6710.97
832.252	6159.99
832.636	5698.81
833.021	5511.92
833.406	5164.83
833.79	5116.28
834.175	4822.59
834.559	4725.5
834.944	4732.78
835.328	4548.31
835.713	4487.63
836.097	4635.69
836.481	4604.14
836.865	4905.11
837.249	4941.52
837.633	5142.98
838.017	5055.6
838.401	5096.86
838.785	4994.92
839.169	5334.73
839.553	5145.41
839.937	5213.37
840.32	5276.48
840.704	5322.59
841.087	5308.03
841.471	5359
841.854	5499.78
842.238	5278.9
842.621	5560.46
843.004	5208.52
843.388	5053.17
843.771	5050.75
844.154	5036.18
844.537	4946.38
844.92	4747.34
845.303	4492.48
845.686	4308.02
846.069	4082.28
846.452	3800.73
846.834	3635.68
847.217	3305.57
847.6	3004.6
847.982	2686.63
848.365	2533.72
848.748	2179.34
849.13	1975.46
849.512	1766.71
849.895	1633.22
850.277	1616.23
850.659	1482.73
851.041	1456.03
851.423	1533.7
851.806	1696.32
852.188	1674.48
852.57	1807.98
852.951	1924.48
853.333	2072.54
853.715	2198.76
854.097	2380.8
854.479	2422.06
854.86	2543.43
855.242	2494.88
855.623	2621.1
856.005	2601.68
856.386	2582.26
856.768	2463.33
857.149	2271.58
857.53	2186.62
857.911	2036.14
858.292	1982.74
858.674	1817.69
859.055	1662.34
859.436	1317.68
859.817	1179.33
860.197	1094.37
860.578	939.03
860.959	839.52
861.34	732.72
861.72	706.02
862.101	679.32
862.482	647.76
862.862	596.79
863.243	628.35
863.623	630.77
864.003	630.77
864.384	727.86
864.764	684.17
865.144	803.11
865.524	788.54
865.904	817.67
866.284	897.77
866.664	851.65
867.044	858.93
867.424	759.42
867.804	798.25
868.183	684.17
868.563	642.91
868.943	650.19
869.322	652.62
869.702	550.68
870.081	521.55
870.461	397.76
870.84	439.02
871.22	429.31
871.599	334.65
871.978	354.07
872.357	337.08
872.736	317.66
873.115	397.76
873.494	249.7
873.873	385.62
874.252	261.84
874.631	341.93
875.01	307.95
875.388	317.66
875.767	273.97
876.146	354.07
876.524	339.51
876.903	266.69
877.281	373.49
877.66	286.11
878.038	261.84
878.416	295.82
878.794	201.16
879.173	167.17
879.551	249.7
879.929	186.59
880.307	310.38
880.685	191.45
881.063	169.6
881.441	249.7
881.818	208.44
882.196	172.03
882.574	174.46
882.951	193.87
883.329	232.71
883.707	220.57
884.084	201.16
884.461	225.43
884.839	191.45
885.216	140.48
885.593	232.71
885.971	167.17
886.348	157.47
886.725	223
887.102	206.01
887.479	225.43
887.856	138.05
888.233	111.35
888.609	181.74
888.986	125.91
889.363	167.17
889.74	159.89
890.116	159.89
890.493	193.87
890.869	167.17
891.246	181.74
891.622	159.89
891.998	169.6
892.375	145.33
892.751	152.61
893.127	111.35
893.503	203.58
893.879	174.46
894.255	104.07
894.631	237.56
895.007	147.76
895.383	118.63
895.759	179.31
896.134	189.02
896.51	101.64
896.886	193.87
897.261	159.89
897.637	164.75
898.012	169.6
898.388	159.89
898.763	174.46
899.138	130.77
899.514	123.48
899.889	186.59
900.264	121.06
900.639	191.45
901.014	125.91
901.389	116.2
901.764	77.37
902.139	174.46
902.513	172.03
902.888	72.51
903.263	223
903.638	108.92
904.012	133.19
904.387	169.6
904.761	157.47
905.136	193.87
905.51	152.61
905.884	164.75
906.259	65.23
906.633	169.6
907.007	108.92
907.381	164.75
907.755	104.07
908.129	157.47
908.503	140.48
908.877	203.58
909.251	152.61
909.624	101.64
909.998	106.49
910.372	130.77
910.745	89.5
911.119	111.35
911.492	121.06
911.866	150.18
912.239	181.74
912.612	176.88
912.986	138.05
913.359	142.9
913.732	167.17
914.105	210.86
914.478	121.06
914.851	99.21
915.224	135.62
915.597	130.77
915.97	152.61
916.343	159.89
916.715	176.88
917.088	118.63
917.461	111.35
917.833	159.89
918.206	123.48
918.578	113.78
918.951	125.91
919.323	142.9
919.695	62.8
920.067	130.77
920.44	150.18
920.812	116.2
921.184	147.76
921.556	196.3
921.928	167.17
922.3	218.15
922.672	111.35
923.043	113.78
923.415	106.49
923.787	220.57
924.158	167.17
924.53	252.13
924.901	145.33
925.273	125.91
925.644	164.75
926.016	206.01
926.387	164.75
926.758	133.19
927.129	172.03
927.5	96.79
927.872	174.46
928.243	123.48
928.613	138.05
928.984	155.04
929.355	159.89
929.726	133.19
930.097	65.23
930.467	101.64
930.838	176.88
931.209	142.9
931.579	135.62
931.95	138.05
932.32	150.18
932.69	118.63
933.061	130.77
933.431	99.21
933.801	133.19
934.171	104.07
934.541	133.19
934.911	155.04
935.281	198.73
935.651	133.19
936.021	128.34
936.391	213.29
936.761	162.32
937.13	118.63
937.5	210.86
937.87	213.29
938.239	169.6
938.609	155.04
938.978	111.35
939.347	203.58
939.717	108.92
940.086	60.38
940.455	186.59
940.824	210.86
941.193	235.14
941.562	91.93
941.931	147.76
942.3	179.31
942.669	128.34
943.038	172.03
943.407	111.35
943.775	135.62
944.144	167.17
944.513	133.19
944.881	106.49
945.25	108.92
945.618	130.77
945.986	111.35
946.355	176.88
946.723	145.33
947.091	121.06
947.459	167.17
947.827	84.65
948.195	167.17
948.563	145.33
948.931	181.74
949.299	155.04
949.667	167.17
950.035	172.03
950.402	130.77
950.77	145.33
951.138	121.06
951.505	152.61
951.873	159.89
952.24	96.79
952.607	157.47
952.975	157.47
953.342	157.47
953.709	128.34
954.076	172.03
954.443	135.62
954.81	128.34
955.177	138.05
955.544	196.3
955.911	174.46
956.278	145.33
956.645	150.18
957.012	157.47
957.378	157.47
957.745	104.07
958.111	157.47
958.478	159.89
958.844	215.72
959.211	145.33
959.577	167.17
959.943	145.33
960.309	203.58
960.675	196.3
961.042	99.21
961.408	121.06
961.774	196.3
962.139	159.89
962.505	155.04
962.871	72.51
963.237	72.51
963.603	150.18
963.968	181.74
964.334	164.75
964.699	179.31
965.065	121.06
965.43	138.05
965.796	164.75
966.161	89.5
966.526	147.76
966.891	116.2
967.256	101.64
967.622	145.33
967.987	91.93
968.352	174.46
968.716	159.89
969.081	113.78
969.446	128.34
969.811	179.31
970.176	99.21
970.54	128.34
970.905	227.86
971.269	196.3
971.634	123.48
971.998	172.03
972.363	140.48
972.727	155.04
973.091	164.75
973.455	140.48
973.819	164.75
974.183	223
974.547	116.2
974.911	172.03
975.275	157.47
975.639	186.59
976.003	157.47
976.367	159.89
976.73	147.76
977.094	162.32
977.458	196.3
977.821	174.46
978.185	198.73
978.548	123.48
978.911	99.21
979.275	174.46
979.638	220.57
980.001	162.32
980.364	225.43
980.727	155.04
981.09	169.6
981.453	111.35
981.816	74.94
982.179	116.2
982.542	145.33
982.905	121.06
983.267	191.45
983.63	130.77
983.992	213.29
984.355	108.92
984.717	87.08
985.08	91.93
985.442	162.32
985.804	169.6
986.167	167.17
986.529	101.64
986.891	189.02
987.253	162.32
987.615	198.73
987.977	152.61
988.339	116.2
988.701	94.36
989.062	118.63
989.424	150.18
989.786	152.61
990.147	225.43
990.509	203.58
990.87	123.48
991.232	162.32
991.593	138.05
991.955	179.31
992.316	123.48
992.677	123.48
993.038	138.05
993.399	159.89
993.76	176.88
994.121	164.75
994.482	99.21
994.843	87.08
995.204	94.36
995.565	227.86
995.926	159.89
996.286	89.5
996.647	125.91
997.007	128.34
997.368	96.79
997.728	232.71
998.089	94.36
998.449	147.76
998.809	133.19
999.169	167.17
999.53	159.89
999.89	193.87
1000.25	223
1000.61	91.93
1000.97	89.5
1001.329	123.48
1001.689	174.46
1002.049	142.9
1002.409	162.32
1002.768	87.08
1003.128	113.78
1003.487	157.47
1003.847	169.6
1004.206	121.06
1004.566	87.08
1004.925	244.85
1005.284	155.04
1005.643	155.04
1006.003	96.79
1006.362	145.33
1006.721	186.59
1007.08	113.78
1007.438	142.9
1007.797	159.89
1008.156	133.19
1008.515	104.07
1008.874	130.77
1009.232	147.76
1009.591	108.92
1009.949	145.33
1010.308	191.45
1010.666	111.35
1011.024	130.77
1011.383	172.03
1011.741	106.49
1012.099	121.06
1012.457	101.64
1012.815	172.03
1013.173	164.75
1013.531	128.34
1013.889	130.77
1014.247	142.9
1014.605	121.06
1014.962	164.75
1015.32	184.17
1015.678	193.87
1016.035	113.78
1016.393	130.77
1016.75	179.31
1017.107	106.49
1017.465	130.77
1017.822	72.51
1018.179	176.88
1018.536	152.61
1018.894	203.58
1019.251	133.19
1019.608	125.91
1019.964	142.9
1020.321	155.04
1020.678	225.43
1021.035	130.77
1021.392	176.88
1021.748	128.34
1022.105	145.33
1022.461	118.63
1022.818	133.19
1023.174	106.49
1023.531	118.63
1023.887	159.89
1024.243	87.08
1024.599	138.05
1024.955	128.34
1025.311	140.48
1025.667	135.62
1026.023	184.17
1026.379	179.31
1026.735	169.6
1027.091	84.65
1027.447	152.61
