189.514	97.09
189.973	97.09
190.431	97.09
190.889	-82.53
191.348	-38.84
191.806	-2.43
192.264	-16.99
192.722	-21.85
193.18	-43.69
193.638	-24.27
194.096	26.7
194.554	-48.54
195.012	-24.27
195.47	4.85
195.928	-9.71
196.385	-21.85
196.843	24.27
197.301	-16.99
197.758	21.84
198.216	31.55
198.674	65.53
199.131	53.4
199.589	50.97
200.046	31.55
200.503	21.84
200.961	43.69
201.418	67.96
201.875	46.12
202.332	152.91
202.79	70.39
203.247	87.38
203.704	145.63
204.161	150.49
204.618	106.8
205.075	84.95
205.532	145.63
205.989	126.22
206.445	148.06
206.902	167.48
207.359	106.8
207.816	169.91
208.272	191.75
208.729	128.64
209.185	140.78
209.642	145.63
210.098	104.37
210.555	157.77
211.011	101.94
211.467	123.79
211.924	116.51
212.38	225.73
212.836	228.16
213.292	75.24
213.748	123.79
214.204	111.65
214.66	133.5
215.116	106.8
215.572	135.92
216.028	194.18
216.484	121.36
216.94	155.34
217.396	145.63
217.851	121.36
218.307	138.35
218.763	82.53
219.218	174.76
219.674	106.8
220.129	128.64
220.585	41.26
221.04	75.24
221.496	106.8
221.951	111.65
222.406	157.77
222.861	111.65
223.317	128.64
223.772	157.77
224.227	121.36
224.682	97.09
225.137	140.78
225.592	94.66
226.047	89.81
226.502	203.89
226.957	172.33
227.411	55.83
227.866	72.82
228.321	203.89
228.776	101.94
229.23	99.52
229.685	48.54
230.139	213.6
230.594	104.37
231.048	114.08
231.503	50.97
231.957	152.91
232.411	152.91
232.865	114.08
233.32	160.2
233.774	109.22
234.228	97.09
234.682	184.47
235.136	75.24
235.59	50.97
236.044	157.77
236.498	87.38
236.952	148.06
237.406	116.51
237.86	58.25
238.313	140.78
238.767	121.36
239.221	206.31
239.674	116.51
240.128	152.91
240.581	97.09
241.035	131.07
241.488	160.2
241.942	77.67
242.395	101.94
242.848	140.78
243.301	77.67
243.755	123.79
244.208	121.36
244.661	99.52
245.114	101.94
245.567	116.51
246.02	99.52
246.473	145.63
246.926	128.64
247.379	104.37
247.832	114.08
248.284	162.62
248.737	169.91
249.19	162.62
249.642	114.08
250.095	135.92
250.547	111.65
251	99.52
251.452	94.66
251.905	89.81
252.357	77.67
252.81	92.23
253.262	128.64
253.714	177.19
254.166	123.79
254.618	80.1
255.07	172.33
255.523	106.8
255.975	111.65
256.427	101.94
256.878	184.47
257.33	114.08
257.782	162.62
258.234	152.91
258.686	38.84
259.137	128.64
259.589	138.35
260.041	97.09
260.492	150.49
260.944	89.81
261.395	101.94
261.847	184.47
262.298	155.34
262.749	50.97
263.201	128.64
263.652	121.36
264.103	208.74
264.554	150.49
265.005	89.81
265.457	138.35
265.908	111.65
266.359	99.52
266.809	143.21
267.26	143.21
267.711	157.77
268.162	94.66
268.613	155.34
269.064	138.35
269.514	152.91
269.965	201.46
270.415	140.78
270.866	213.6
271.316	155.34
271.767	99.52
272.217	157.77
272.668	194.18
273.118	118.93
273.568	143.21
274.019	92.23
274.469	101.94
274.919	60.68
275.369	143.21
275.819	84.95
276.269	157.77
276.719	155.34
277.169	116.51
277.619	111.65
278.069	155.34
278.518	165.05
278.968	121.36
279.418	89.81
279.867	114.08
280.317	169.91
280.767	126.22
281.216	140.78
281.666	60.68
282.115	128.64
282.564	145.63
283.014	111.65
283.463	104.37
283.912	182.04
284.361	126.22
284.811	97.09
285.26	126.22
285.709	116.51
286.158	94.66
286.607	128.64
287.056	172.33
287.505	174.76
287.953	80.1
288.402	160.2
288.851	162.62
289.3	169.91
289.748	203.89
290.197	177.19
290.646	133.5
291.094	128.64
291.543	160.2
291.991	84.95
292.439	106.8
292.888	179.61
293.336	138.35
293.784	135.92
294.233	191.75
294.681	196.6
295.129	233.01
295.577	150.49
296.025	131.07
296.473	143.21
296.921	140.78
297.369	116.51
297.817	167.48
298.264	152.91
298.712	92.23
299.16	80.1
299.608	143.21
300.055	89.81
300.503	177.19
300.95	143.21
301.398	148.06
301.845	84.95
302.293	77.67
302.74	138.35
303.187	152.91
303.635	80.1
304.082	60.68
304.529	133.5
304.976	155.34
305.423	99.52
305.87	106.8
306.317	9.71
306.764	101.94
307.211	84.95
307.658	162.62
308.105	77.67
308.552	162.62
308.998	118.93
309.445	203.89
309.892	133.5
310.338	67.96
310.785	111.65
311.231	145.63
311.678	135.92
312.124	152.91
312.571	179.61
313.017	101.94
313.463	145.63
313.909	135.92
314.356	128.64
314.802	128.64
315.248	150.49
315.694	203.89
316.14	162.62
316.586	150.49
317.032	104.37
317.478	172.33
317.923	118.93
318.369	152.91
318.815	194.18
319.261	77.67
319.706	172.33
320.152	203.89
320.597	97.09
321.043	123.79
321.488	109.22
321.934	140.78
322.379	126.22
322.824	101.94
323.27	123.79
323.715	38.84
324.16	121.36
324.605	186.9
325.05	162.62
325.495	116.51
325.94	162.62
326.385	172.33
326.83	162.62
327.275	143.21
327.72	148.06
328.165	131.07
328.61	106.8
329.054	157.77
329.499	126.22
329.943	152.91
330.388	118.93
330.832	169.91
331.277	152.91
331.721	174.76
332.166	220.88
332.61	155.34
333.054	135.92
333.499	97.09
333.943	72.82
334.387	111.65
334.831	114.08
335.275	138.35
335.719	123.79
336.163	189.32
336.607	123.79
337.051	133.5
337.495	65.53
337.938	138.35
338.382	97.09
338.826	70.39
339.269	143.21
339.713	92.23
340.157	148.06
340.6	184.47
341.044	196.6
341.487	82.53
341.93	128.64
342.374	94.66
342.817	121.36
343.26	131.07
343.703	104.37
344.146	138.35
344.59	223.3
345.033	186.9
345.476	160.2
345.919	121.36
346.361	184.47
346.804	165.05
347.247	155.34
347.69	150.49
348.133	116.51
348.575	111.65
349.018	140.78
349.461	172.33
349.903	75.24
350.346	38.84
350.788	167.48
351.23	186.9
351.673	177.19
352.115	87.38
352.557	216.02
353	152.91
353.442	84.95
353.884	135.92
354.326	160.2
354.768	155.34
355.21	162.62
355.652	77.67
356.094	199.03
356.536	128.64
356.978	135.92
357.419	152.91
357.861	128.64
358.303	206.31
358.744	162.62
359.186	121.36
359.627	123.79
360.069	157.77
360.51	135.92
360.952	114.08
361.393	135.92
361.834	123.79
362.276	121.36
362.717	145.63
363.158	116.51
363.599	104.37
364.04	152.91
364.481	92.23
364.922	116.51
365.363	109.22
365.804	106.8
366.245	128.64
366.686	152.91
367.126	148.06
367.567	109.22
368.008	196.6
368.448	182.04
368.889	199.03
369.33	89.81
369.77	196.6
370.21	191.75
370.651	109.22
371.091	167.48
371.531	148.06
371.972	150.49
372.412	162.62
372.852	266.99
373.292	116.51
373.732	114.08
374.172	131.07
374.612	116.51
375.052	104.37
375.492	186.9
375.932	101.94
376.372	50.97
376.811	167.48
377.251	145.63
377.691	135.92
378.13	167.48
378.57	174.76
379.009	237.87
379.449	131.07
379.888	123.79
380.328	143.21
380.767	165.05
381.206	177.19
381.645	111.65
382.085	138.35
382.524	157.77
382.963	133.5
383.402	114.08
383.841	165.05
384.28	131.07
384.719	169.91
385.158	111.65
385.596	165.05
386.035	148.06
386.474	111.65
386.913	145.63
387.351	184.47
387.79	150.49
388.228	109.22
388.667	148.06
389.105	203.89
389.544	182.04
389.982	157.77
390.42	213.6
390.859	182.04
391.297	152.91
391.735	87.38
392.173	206.31
392.611	87.38
393.049	172.33
393.487	106.8
393.925	99.52
394.363	123.79
394.801	104.37
395.239	99.52
395.676	150.49
396.114	179.61
396.552	48.54
396.989	92.23
397.427	101.94
397.864	46.12
398.302	150.49
398.739	106.8
399.177	80.1
399.614	252.43
400.051	157.77
400.488	111.65
400.926	60.68
401.363	70.39
401.8	135.92
402.237	135.92
402.674	143.21
403.111	174.76
403.548	160.2
403.985	211.17
404.421	155.34
404.858	174.76
405.295	104.37
405.732	114.08
406.168	126.22
406.605	179.61
407.041	87.38
407.478	138.35
407.914	111.65
408.351	106.8
408.787	172.33
409.223	131.07
409.66	121.36
410.096	148.06
410.532	157.77
410.968	157.77
411.404	118.93
411.84	138.35
412.276	143.21
412.712	116.51
413.148	138.35
413.584	201.46
414.02	165.05
414.455	60.68
414.891	143.21
415.327	179.61
415.762	194.18
416.198	77.67
416.633	89.81
417.069	82.53
417.504	155.34
417.94	148.06
418.375	101.94
418.81	184.47
419.245	174.76
419.681	155.34
420.116	169.91
420.551	131.07
420.986	118.93
421.421	162.62
421.856	145.63
422.291	55.83
422.726	84.95
423.16	184.47
423.595	148.06
424.03	77.67
424.464	116.51
424.899	206.31
425.334	126.22
425.768	97.09
426.203	150.49
426.637	116.51
427.071	199.03
427.506	172.33
427.94	162.62
428.374	128.64
428.809	184.47
429.243	101.94
429.677	162.62
430.111	186.9
430.545	138.35
430.979	118.93
431.413	97.09
431.847	186.9
432.28	101.94
432.714	109.22
433.148	169.91
433.582	133.5
434.015	65.53
434.449	225.73
434.882	106.8
435.316	148.06
435.749	203.89
436.183	101.94
436.616	152.91
437.049	160.2
437.483	220.88
437.916	211.17
438.349	199.03
438.782	191.75
439.215	72.82
439.648	121.36
440.081	123.79
440.514	167.48
440.947	162.62
441.38	118.93
441.813	203.89
442.245	213.6
442.678	213.6
443.111	199.03
443.543	230.59
443.976	106.8
444.408	160.2
444.841	160.2
445.273	157.77
445.705	213.6
446.138	165.05
446.57	157.77
447.002	172.33
447.434	225.73
447.867	199.03
448.299	155.34
448.731	245.15
449.163	233.01
449.595	135.92
450.026	250
450.458	203.89
450.89	305.83
451.322	191.75
451.754	223.3
452.185	250
452.617	305.83
453.048	225.73
453.48	252.43
453.911	230.59
454.343	218.45
454.774	177.19
455.205	271.85
455.637	220.88
456.068	179.61
456.499	286.41
456.93	286.41
457.361	206.31
457.792	228.16
458.223	245.15
458.654	293.69
459.085	264.57
459.516	286.41
459.947	225.73
460.378	242.72
460.808	317.97
461.239	266.99
461.669	203.89
462.1	305.83
462.531	225.73
462.961	237.87
463.391	262.14
463.822	203.89
464.252	155.34
464.682	194.18
465.113	208.74
465.543	237.87
465.973	293.69
466.403	167.48
466.833	237.87
467.263	266.99
467.693	184.47
468.123	186.9
468.553	162.62
468.983	213.6
469.412	206.31
469.842	237.87
470.272	240.29
470.701	199.03
471.131	242.72
471.56	143.21
471.99	135.92
472.419	177.19
472.849	189.32
473.278	220.88
473.707	271.85
474.136	259.71
474.566	199.03
474.995	298.55
475.424	160.2
475.853	245.15
476.282	208.74
476.711	228.16
477.14	172.33
477.569	213.6
477.997	169.91
478.426	135.92
478.855	218.45
479.283	257.29
479.712	242.72
480.141	252.43
480.569	162.62
480.998	206.31
481.426	169.91
481.854	216.02
482.283	172.33
482.711	162.62
483.139	220.88
483.567	155.34
483.995	242.72
484.424	118.93
484.852	140.78
485.28	140.78
485.708	169.91
486.135	228.16
486.563	167.48
486.991	140.78
487.419	201.46
487.847	213.6
488.274	126.22
488.702	152.91
489.129	128.64
489.557	138.35
489.984	179.61
490.412	182.04
490.839	138.35
491.266	135.92
491.694	225.73
492.121	160.2
492.548	143.21
492.975	191.75
493.402	150.49
493.829	208.74
494.256	179.61
494.683	186.9
495.11	208.74
495.537	145.63
495.964	206.31
496.39	92.23
496.817	131.07
497.244	162.62
497.67	72.82
498.097	225.73
498.523	225.73
498.95	186.9
499.376	172.33
499.803	77.67
500.229	169.91
500.655	104.37
501.081	167.48
501.508	189.32
501.934	155.34
502.36	165.05
502.786	179.61
503.212	196.6
503.638	123.79
504.064	155.34
504.489	174.76
504.915	114.08
505.341	216.02
505.767	133.5
506.192	114.08
506.618	135.92
507.043	201.46
507.469	179.61
507.894	135.92
508.32	213.6
508.745	208.74
509.17	135.92
509.596	118.93
510.021	123.79
510.446	140.78
510.871	165.05
511.296	131.07
511.721	148.06
512.146	194.18
512.571	131.07
512.996	177.19
513.421	174.76
513.845	203.89
514.27	131.07
514.695	131.07
515.119	135.92
515.544	208.74
515.969	155.34
516.393	189.32
516.817	182.04
517.242	179.61
517.666	203.89
518.09	128.64
518.515	283.98
518.939	114.08
519.363	296.12
519.787	206.31
520.211	143.21
520.635	179.61
521.059	131.07
521.483	138.35
521.907	179.61
522.331	128.64
522.754	150.49
523.178	199.03
523.602	157.77
524.025	143.21
524.449	250
524.872	233.01
525.296	194.18
525.719	133.5
526.143	225.73
526.566	186.9
526.989	150.49
527.412	162.62
527.836	182.04
528.259	177.19
528.682	162.62
529.105	211.17
529.528	109.22
529.951	223.3
530.374	133.5
530.796	199.03
531.219	150.49
531.642	140.78
532.065	148.06
532.487	106.8
532.91	179.61
533.332	143.21
533.755	177.19
534.177	172.33
534.6	109.22
535.022	169.91
535.444	254.86
535.867	143.21
536.289	206.31
536.711	201.46
537.133	140.78
537.555	191.75
537.977	211.17
538.399	225.73
538.821	220.88
539.243	218.45
539.665	223.3
540.086	184.47
540.508	143.21
540.93	174.76
541.351	179.61
541.773	206.31
542.195	194.18
542.616	184.47
543.037	211.17
543.459	148.06
543.88	233.01
544.301	177.19
544.723	216.02
545.144	208.74
545.565	167.48
545.986	218.45
546.407	191.75
546.828	150.49
547.249	152.91
547.67	140.78
548.091	128.64
548.512	167.48
548.932	148.06
549.353	191.75
549.774	152.91
550.194	182.04
550.615	123.79
551.035	123.79
551.456	184.47
551.876	116.51
552.296	194.18
552.717	186.9
553.137	199.03
553.557	223.3
553.977	109.22
554.397	167.48
554.817	189.32
555.237	140.78
555.657	206.31
556.077	145.63
556.497	155.34
556.917	218.45
557.337	189.32
557.756	257.29
558.176	165.05
558.596	155.34
559.015	206.31
559.435	72.82
559.854	247.58
560.274	199.03
560.693	162.62
561.112	169.91
561.532	191.75
561.951	169.91
562.37	184.47
562.789	199.03
563.208	174.76
563.627	138.35
564.046	152.91
564.465	194.18
564.884	165.05
565.303	213.6
565.722	157.77
566.14	128.64
566.559	177.19
566.978	182.04
567.396	228.16
567.815	174.76
568.233	213.6
568.652	152.91
569.07	140.78
569.489	208.74
569.907	220.88
570.325	220.88
570.743	165.05
571.161	223.3
571.58	165.05
571.998	186.9
572.416	138.35
572.833	247.58
573.251	186.9
573.669	208.74
574.087	133.5
574.505	128.64
574.922	152.91
575.34	131.07
575.758	138.35
576.175	186.9
576.593	184.47
577.01	269.42
577.428	152.91
577.845	1507.3
578.262	310.68
578.68	216.02
579.097	160.2
579.514	160.2
579.931	118.93
580.348	250
580.765	138.35
581.182	152.91
581.599	218.45
582.016	169.91
582.433	162.62
582.849	116.51
583.266	157.77
583.683	179.61
584.099	250
584.516	116.51
584.933	184.47
585.349	138.35
585.765	179.61
586.182	169.91
586.598	169.91
587.014	133.5
587.431	162.62
587.847	167.48
588.263	135.92
588.679	199.03
589.095	196.6
589.511	228.16
589.927	213.6
590.343	165.05
590.759	203.89
591.174	140.78
591.59	174.76
592.006	155.34
592.421	162.62
592.837	145.63
593.252	111.65
593.668	152.91
594.083	148.06
594.499	121.36
594.914	128.64
595.329	123.79
595.745	160.2
596.16	184.47
596.575	186.9
596.99	116.51
597.405	235.44
597.82	177.19
598.235	184.47
598.65	131.07
599.065	182.04
599.479	111.65
599.894	131.07
600.309	184.47
600.724	165.05
601.138	167.48
601.553	109.22
601.967	169.91
602.382	213.6
602.796	140.78
603.21	109.22
603.625	77.67
604.039	114.08
604.453	126.22
604.867	121.36
605.281	194.18
605.695	121.36
606.109	165.05
606.523	97.09
606.937	208.74
607.351	368.94
607.765	133.5
608.178	184.47
608.592	155.34
609.006	172.33
609.419	213.6
609.833	150.49
610.246	104.37
610.66	189.32
611.073	182.04
611.487	186.9
611.9	189.32
612.313	143.21
612.726	169.91
613.139	157.77
613.553	123.79
613.966	157.77
614.379	182.04
614.792	160.2
615.204	123.79
615.617	118.93
616.03	191.75
616.443	160.2
616.856	196.6
617.268	109.22
617.681	167.48
618.093	167.48
618.506	169.91
618.918	133.5
619.331	216.02
619.743	194.18
620.155	160.2
620.568	87.38
620.98	121.36
621.392	148.06
621.804	104.37
622.216	123.79
622.628	177.19
623.04	118.93
623.452	155.34
623.864	152.91
624.276	126.22
624.687	123.79
625.099	128.64
625.511	199.03
625.922	237.87
626.334	109.22
626.745	199.03
627.157	162.62
627.568	150.49
627.979	177.19
628.391	84.95
628.802	128.64
629.213	150.49
629.624	104.37
630.035	140.78
630.446	63.11
630.857	152.91
631.268	196.6
631.679	150.49
632.09	145.63
632.501	131.07
632.912	116.51
633.322	189.32
633.733	150.49
634.144	182.04
634.554	145.63
634.965	131.07
635.375	150.49
635.785	126.22
636.196	160.2
636.606	111.65
637.016	131.07
637.427	97.09
637.837	128.64
638.247	196.6
638.657	174.76
639.067	140.78
639.477	167.48
639.887	242.72
640.297	155.34
640.706	133.5
641.116	196.6
641.526	179.61
641.935	167.48
642.345	133.5
642.755	162.62
643.164	121.36
643.573	106.8
643.983	135.92
644.392	182.04
644.801	109.22
645.211	162.62
645.62	121.36
646.029	150.49
646.438	135.92
646.847	123.79
647.256	94.66
647.665	94.66
648.074	87.38
648.483	92.23
648.892	152.91
649.3	155.34
649.709	106.8
650.118	196.6
650.526	157.77
650.935	140.78
651.343	211.17
651.752	118.93
652.16	186.9
652.568	162.62
652.977	126.22
653.385	148.06
653.793	148.06
654.201	182.04
654.609	126.22
655.017	133.5
655.425	89.81
655.833	179.61
656.241	140.78
656.649	148.06
657.057	111.65
657.464	145.63
657.872	165.05
658.28	126.22
658.687	135.92
659.095	104.37
659.502	145.63
659.91	114.08
660.317	208.74
660.724	179.61
661.132	165.05
661.539	174.76
661.946	94.66
662.353	101.94
662.76	128.64
663.167	199.03
663.574	157.77
663.981	169.91
664.388	191.75
664.795	101.94
665.202	174.76
665.608	128.64
666.015	162.62
666.422	179.61
666.828	133.5
667.235	145.63
667.641	94.66
668.047	123.79
668.454	152.91
668.86	165.05
669.266	160.2
669.673	87.38
670.079	172.33
670.485	186.9
670.891	135.92
671.297	206.31
671.703	87.38
672.109	82.53
672.515	143.21
672.92	101.94
673.326	111.65
673.732	194.18
674.138	133.5
674.543	228.16
674.949	199.03
675.354	133.5
675.76	155.34
676.165	167.48
676.57	133.5
676.976	155.34
677.381	82.53
677.786	184.47
678.191	70.39
678.596	174.76
679.001	104.37
679.406	138.35
679.811	111.65
680.216	126.22
680.621	237.87
681.026	194.18
681.43	165.05
681.835	97.09
682.24	191.75
682.644	53.4
683.049	177.19
683.453	128.64
683.858	126.22
684.262	106.8
684.667	104.37
685.071	77.67
685.475	145.63
685.879	152.91
686.283	101.94
686.687	152.91
687.091	182.04
687.495	206.31
687.899	169.91
688.303	155.34
688.707	155.34
689.111	99.52
689.514	184.47
689.918	186.9
690.322	82.53
690.725	116.51
691.129	184.47
691.532	169.91
691.936	177.19
692.339	174.76
692.742	196.6
693.146	135.92
693.549	225.73
693.952	123.79
694.355	148.06
694.758	131.07
695.161	155.34
695.564	143.21
695.967	50.97
696.37	160.2
696.773	118.93
697.175	201.46
697.578	174.76
697.981	123.79
698.383	155.34
698.786	167.48
699.188	150.49
699.591	140.78
699.993	155.34
700.395	145.63
700.798	145.63
701.2	203.89
701.602	118.93
702.004	157.77
702.406	189.32
702.808	148.06
703.21	152.91
703.612	237.87
704.014	191.75
704.416	169.91
704.818	172.33
705.219	179.61
705.621	199.03
706.023	126.22
706.424	157.77
706.826	184.47
707.227	194.18
707.629	99.52
708.03	148.06
708.431	123.79
708.832	157.77
709.234	199.03
709.635	160.2
710.036	155.34
710.437	216.02
710.838	111.65
711.239	99.52
711.64	191.75
712.041	225.73
712.441	167.48
712.842	199.03
713.243	211.17
713.643	186.9
714.044	184.47
714.445	230.59
714.845	206.31
715.246	252.43
715.646	216.02
716.046	165.05
716.447	126.22
716.847	109.22
717.247	240.29
717.647	177.19
718.047	218.45
718.447	262.14
718.847	203.89
719.247	233.01
719.647	235.44
720.047	262.14
720.446	274.28
720.846	208.74
721.246	313.11
721.645	254.86
722.045	274.28
722.444	177.19
722.844	247.58
723.243	317.97
723.643	203.89
724.042	237.87
724.441	281.56
724.84	247.58
725.24	279.13
725.639	373.79
726.038	320.39
726.437	259.71
726.836	271.85
727.234	283.98
727.633	264.57
728.032	339.81
728.431	313.11
728.83	342.24
729.228	368.94
729.627	373.79
730.025	415.05
730.424	446.61
730.822	381.07
731.22	458.74
731.619	368.94
732.017	419.91
732.415	492.73
732.813	512.14
733.212	550.98
733.61	640.79
734.008	597.1
734.406	723.31
734.803	684.48
735.201	740.3
735.599	803.41
735.997	832.54
736.395	917.49
736.792	849.53
737.19	1099.53
737.587	1000.02
737.985	1077.69
738.382	1106.81
738.78	1138.37
739.177	1089.82
739.574	1320.41
739.971	1439.34
740.369	1393.23
740.766	1492.74
741.163	1351.96
741.56	1604.39
741.957	1684.49
742.354	1716.05
742.751	1737.89
743.147	1638.38
743.544	1876.24
743.941	2099.55
744.338	2099.55
744.734	2143.24
745.131	1970.9
745.527	2240.33
745.924	2492.76
746.32	2793.73
746.716	2784.02
747.113	2713.63
747.509	2876.26
747.905	3179.66
748.301	3434.52
748.697	3492.77
749.093	3432.09
749.489	3383.55
749.885	3655.4
750.281	4313.17
750.677	4451.53
751.073	4291.33
751.468	3970.94
751.864	4478.22
752.26	4856.87
752.655	5424.84
753.051	5199.11
753.446	5082.6
753.842	5094.74
754.237	5560.77
754.632	6218.54
755.028	6371.46
755.423	5973.39
755.818	5735.53
756.213	6077.76
756.608	6905.45
757.003	7133.61
757.398	6953.99
757.793	6487.96
758.188	6313.2
758.583	7014.67
758.977	7881.19
759.372	8216.15
759.767	7876.34
760.161	7551.09
760.556	8099.64
760.95	9267.13
761.345	10272
761.739	10138.51
762.133	9437.04
762.527	9653.06
762.922	10359.38
763.316	11878.83
763.71	12060.87
764.104	11386.1
764.498	10577.83
764.892	11128.81
765.286	12405.53
765.68	13439.53
766.073	13417.68
766.467	12458.93
766.861	12313.3
767.255	12881.27
767.648	14636.15
768.042	15490.53
768.435	14944.41
768.829	13847.3
769.222	13560.89
769.615	14648.29
770.008	16170.15
770.402	16706.57
770.795	15791.51
771.188	14619.16
771.581	14497.8
771.974	15344.9
772.367	16709
772.76	17046.38
773.153	15364.32
773.545	14325.47
773.938	14735.67
774.331	16167.73
774.724	17808.53
775.116	18211.45
775.509	16910.46
775.901	16456.57
776.294	16621.62
776.686	18888.64
777.078	20679.93
777.471	20558.57
777.863	19993.03
778.255	18864.37
778.647	19655.65
779.039	22128.98
779.431	23051.33
779.823	22772.2
780.215	21201.79
780.607	19648.36
780.999	20946.93
781.39	22772.2
781.782	24121.73
782.174	23541.63
782.565	22138.69
782.957	20337.69
783.348	21272.18
783.74	23565.9
784.131	24898.45
784.522	24422.71
784.914	21772.18
785.305	20260.02
785.696	21068.29
786.087	22874.14
786.478	23383.86
786.869	22978.51
787.26	20395.95
787.651	18422.62
788.042	18427.47
788.433	20005.17
788.823	20835.28
789.214	20393.52
789.605	18541.55
789.995	16543.95
790.386	16699.29
790.776	18378.93
791.167	19228.45
791.557	19781.86
791.948	18577.96
792.338	16927.45
792.728	17184.73
793.118	18628.93
793.508	20349.83
793.898	20815.86
794.288	19939.63
794.678	17951.74
795.068	17386.19
795.458	18526.99
795.848	20291.58
796.238	20655.66
796.627	19386.22
797.017	18126.5
797.406	17500.27
797.796	17638.62
798.185	19473.6
798.575	20915.37
798.964	20434.78
799.354	19104.67
799.743	17167.74
800.132	17565.81
800.521	18716.31
800.91	20318.28
801.299	20291.58
801.688	19315.83
802.077	17114.34
802.466	16898.32
802.855	17218.71
803.244	18119.21
803.633	19073.11
804.021	18005.13
804.41	16485.69
804.799	15143.44
805.187	14509.93
805.576	15415.29
805.964	16631.33
806.352	16124.04
806.741	14985.67
807.129	13604.58
807.517	13128.85
807.905	13823.03
808.293	15250.24
808.681	16196.85
809.069	15403.15
809.457	14670.13
809.845	13308.46
810.233	13534.19
810.621	14769.65
811.009	16111.9
811.396	16136.17
811.784	15196.84
812.171	13626.43
812.559	12956.51
812.946	13415.26
813.334	14446.83
813.721	14716.25
814.108	14291.48
814.496	13400.69
814.883	11939.51
815.27	12157.96
815.657	12475.92
816.044	14075.46
816.431	14376.44
816.818	13738.08
817.205	12347.28
817.592	11344.84
817.979	11206.49
818.365	11854.55
818.752	12422.52
819.139	12534.18
819.525	11711.35
819.912	10320.55
820.298	9548.69
820.685	9650.64
821.071	10269.58
821.457	10706.48
821.843	10531.72
822.23	9517.14
822.616	8271.97
823.002	7655.46
823.388	7529.24
823.774	8085.08
824.16	8230.71
824.546	8332.65
824.931	7529.24
825.317	6752.53
825.703	6262.23
826.089	6781.66
826.474	7364.19
826.86	7541.38
827.245	7303.51
827.631	6672.43
828.016	6153.01
828.401	5774.36
828.787	5839.9
829.172	6403.01
829.557	6636.03
829.942	6420
830.327	5720.96
830.712	5220.95
831.097	4784.05
831.482	4915.12
831.867	5194.26
832.252	5500.09
832.636	5313.19
833.021	4864.15
833.406	4223.37
833.79	4038.9
834.175	4126.28
834.559	4536.48
834.944	4825.32
835.328	4752.5
835.713	4247.64
836.097	3682.1
836.481	3434.52
836.865	3407.82
837.249	3536.46
837.633	3876.27
838.017	3907.83
838.401	3485.49
838.785	3007.33
839.169	2648.1
839.553	2606.84
839.937	2796.16
840.32	2927.23
840.704	2917.52
841.087	2708.78
841.471	2228.19
841.854	1985.47
842.238	1956.34
842.621	2034.01
843.004	2344.7
843.388	2364.11
843.771	2206.35
844.154	1949.06
844.537	1699.06
844.92	1648.08
845.303	1754.88
845.686	1866.53
846.069	2043.72
846.452	2133.53
846.834	1883.52
847.217	1524.3
847.6	1422.35
847.982	1502.45
848.365	1606.82
848.748	1720.9
849.13	1784.01
849.512	1703.91
849.895	1395.65
850.277	1172.35
850.659	1087.4
851.041	1245.16
851.423	1417.5
851.806	1541.29
852.188	1349.54
852.57	1262.16
852.951	1126.23
853.333	1019.43
853.715	1012.15
854.097	1114.09
854.479	1220.89
854.86	1237.88
855.242	1155.36
855.623	963.61
856.005	798.56
856.386	861.66
856.768	890.79
857.149	859.24
857.53	968.46
857.911	1009.72
858.292	837.39
858.674	682.05
859.055	669.91
859.436	616.51
859.817	604.38
860.197	701.47
860.578	737.88
860.959	769.43
861.34	577.68
861.72	550.98
862.101	497.58
862.482	500.01
862.862	461.17
863.243	640.79
863.623	582.53
864.003	517
864.384	555.83
864.764	444.18
865.144	398.06
865.524	383.5
865.904	424.76
866.284	483.02
866.664	444.18
867.044	492.73
867.424	337.38
867.804	315.54
868.183	356.8
868.563	351.95
868.943	371.36
869.322	439.33
869.702	410.2
870.081	303.4
870.461	317.97
870.84	334.96
871.22	320.39
871.599	317.97
871.978	327.67
872.357	264.57
872.736	322.82
873.115	315.54
873.494	276.7
873.873	313.11
874.252	211.17
874.631	233.01
875.01	237.87
875.388	245.15
875.767	283.98
876.146	235.44
876.524	242.72
876.903	254.86
877.281	184.47
877.66	225.73
878.038	266.99
878.416	179.61
878.794	293.69
879.173	152.91
879.551	189.32
879.929	223.3
880.307	286.41
880.685	167.48
881.063	213.6
881.441	237.87
881.818	201.46
882.196	155.34
882.574	199.03
882.951	138.35
883.329	138.35
883.707	172.33
884.084	169.91
884.461	184.47
884.839	206.31
885.216	145.63
885.593	172.33
885.971	208.74
886.348	121.36
886.725	140.78
887.102	131.07
887.479	123.79
887.856	135.92
888.233	194.18
888.609	131.07
888.986	247.58
889.363	162.62
889.74	194.18
890.116	179.61
890.493	148.06
890.869	172.33
891.246	135.92
891.622	235.44
891.998	218.45
892.375	135.92
892.751	123.79
893.127	191.75
893.503	121.36
893.879	167.48
894.255	186.9
894.631	138.35
895.007	179.61
895.383	213.6
895.759	150.49
896.134	165.05
896.51	177.19
896.886	128.64
897.261	94.66
897.637	184.47
898.012	118.93
898.388	135.92
898.763	167.48
899.138	77.67
899.514	155.34
899.889	89.81
900.264	165.05
900.639	233.01
901.014	189.32
901.389	157.77
901.764	116.51
902.139	148.06
902.513	140.78
902.888	101.94
903.263	123.79
903.638	131.07
904.012	135.92
904.387	92.23
904.761	131.07
905.136	186.9
905.51	184.47
905.884	123.79
906.259	143.21
906.633	179.61
907.007	138.35
907.381	114.08
907.755	196.6
908.129	114.08
908.503	55.83
908.877	58.25
909.251	138.35
909.624	184.47
909.998	128.64
910.372	92.23
910.745	77.67
911.119	157.77
911.492	143.21
911.866	152.91
912.239	67.96
912.612	167.48
912.986	104.37
913.359	92.23
913.732	106.8
914.105	111.65
914.478	148.06
914.851	155.34
915.224	145.63
915.597	201.46
915.97	148.06
916.343	208.74
916.715	143.21
917.088	131.07
917.461	114.08
917.833	65.53
918.206	87.38
918.578	126.22
918.951	150.49
919.323	152.91
919.695	169.91
920.067	199.03
920.44	150.49
920.812	99.52
921.184	118.93
921.556	160.2
921.928	131.07
922.3	121.36
922.672	172.33
923.043	157.77
923.415	94.66
923.787	65.53
924.158	77.67
924.53	48.54
924.901	114.08
925.273	138.35
925.644	133.5
926.016	118.93
926.387	63.11
926.758	123.79
927.129	82.53
927.5	92.23
927.872	196.6
928.243	145.63
928.613	128.64
928.984	169.91
929.355	155.34
929.726	162.62
930.097	106.8
930.467	143.21
930.838	133.5
931.209	94.66
931.579	63.11
931.95	148.06
932.32	121.36
932.69	184.47
933.061	82.53
933.431	186.9
933.801	199.03
934.171	77.67
934.541	123.79
934.911	274.28
935.281	118.93
935.651	150.49
936.021	118.93
936.391	196.6
936.761	106.8
937.13	109.22
937.5	92.23
937.87	82.53
938.239	94.66
938.609	148.06
938.978	165.05
939.347	118.93
939.717	72.82
940.086	162.62
940.455	131.07
940.824	70.39
941.193	99.52
941.562	150.49
941.931	155.34
942.3	138.35
942.669	109.22
943.038	172.33
943.407	148.06
943.775	162.62
944.144	201.46
944.513	155.34
944.881	194.18
945.25	135.92
945.618	126.22
945.986	172.33
946.355	121.36
946.723	162.62
947.091	114.08
947.459	182.04
947.827	114.08
948.195	167.48
948.563	138.35
948.931	145.63
949.299	194.18
949.667	123.79
950.035	84.95
950.402	140.78
950.77	94.66
951.138	92.23
951.505	131.07
951.873	116.51
952.24	111.65
952.607	72.82
952.975	167.48
953.342	145.63
953.709	172.33
954.076	89.81
954.443	101.94
954.81	189.32
955.177	206.31
955.544	216.02
955.911	165.05
956.278	121.36
956.645	157.77
957.012	135.92
957.378	143.21
957.745	140.78
958.111	133.5
958.478	172.33
958.844	155.34
959.211	152.91
959.577	94.66
959.943	131.07
960.309	182.04
960.675	172.33
961.042	65.53
961.408	131.07
961.774	106.8
962.139	101.94
962.505	131.07
962.871	118.93
963.237	106.8
963.603	150.49
963.968	189.32
964.334	101.94
964.699	126.22
965.065	58.25
965.43	128.64
965.796	82.53
966.161	31.55
966.526	109.22
966.891	77.67
967.256	135.92
967.622	148.06
967.987	114.08
968.352	109.22
968.716	131.07
969.081	72.82
969.446	111.65
969.811	111.65
970.176	145.63
970.54	116.51
970.905	99.52
971.269	213.6
971.634	140.78
971.998	109.22
972.363	174.76
972.727	104.37
973.091	126.22
973.455	128.64
973.819	189.32
974.183	106.8
974.547	118.93
974.911	138.35
975.275	123.79
975.639	177.19
976.003	177.19
976.367	148.06
976.73	114.08
977.094	131.07
977.458	116.51
977.821	99.52
978.185	111.65
978.548	41.26
978.911	155.34
979.275	196.6
979.638	167.48
980.001	123.79
980.364	155.34
980.727	126.22
981.09	104.37
981.453	131.07
981.816	135.92
982.179	228.16
982.542	145.63
982.905	140.78
983.267	101.94
983.63	126.22
983.992	165.05
984.355	148.06
984.717	160.2
985.08	131.07
985.442	65.53
985.804	94.66
986.167	191.75
986.529	133.5
986.891	46.12
987.253	218.45
987.615	155.34
987.977	138.35
988.339	191.75
988.701	123.79
989.062	165.05
989.424	70.39
989.786	155.34
990.147	148.06
990.509	179.61
990.87	174.76
991.232	135.92
991.593	186.9
991.955	150.49
992.316	126.22
992.677	135.92
993.038	67.96
993.399	128.64
993.76	111.65
994.121	128.64
994.482	167.48
994.843	133.5
995.204	72.82
995.565	152.91
995.926	191.75
996.286	169.91
996.647	152.91
997.007	111.65
997.368	111.65
997.728	128.64
998.089	118.93
998.449	145.63
998.809	179.61
999.169	145.63
999.53	131.07
999.89	48.54
1000.25	155.34
1000.61	118.93
1000.97	116.51
1001.329	114.08
1001.689	138.35
1002.049	196.6
1002.409	191.75
1002.768	116.51
1003.128	72.82
1003.487	167.48
1003.847	92.23
1004.206	46.12
1004.566	160.2
1004.925	155.34
1005.284	135.92
1005.643	104.37
1006.003	138.35
1006.362	157.77
1006.721	143.21
1007.08	179.61
1007.438	106.8
1007.797	152.91
1008.156	155.34
1008.515	155.34
1008.874	82.53
1009.232	118.93
1009.591	14.56
1009.949	140.78
1010.308	145.63
1010.666	131.07
1011.024	126.22
1011.383	131.07
1011.741	126.22
1012.099	89.81
1012.457	77.67
1012.815	135.92
1013.173	162.62
1013.531	148.06
1013.889	140.78
1014.247	189.32
1014.605	121.36
1014.962	114.08
1015.32	152.91
1015.678	106.8
1016.035	89.81
1016.393	99.52
1016.75	84.95
1017.107	131.07
1017.465	99.52
1017.822	131.07
1018.179	203.89
1018.536	186.9
1018.894	177.19
1019.251	138.35
1019.608	75.24
1019.964	67.96
1020.321	150.49
1020.678	77.67
1021.035	104.37
1021.392	203.89
1021.748	63.11
1022.105	118.93
1022.461	169.91
1022.818	169.91
1023.174	160.2
1023.531	172.33
1023.887	240.29
1024.243	101.94
1024.599	143.21
1024.955	67.96
1025.311	162.62
1025.667	116.51
1026.023	67.96
1026.379	101.94
1026.735	162.62
1027.091	157.77
1027.447	179.61
