189.514	106.04
189.973	106.04
190.431	106.04
190.889	23.51
191.348	-22.6
191.806	-22.6
192.264	-34.74
192.722	-49.3
193.18	-27.46
193.638	-80.86
194.096	-76
194.554	-25.03
195.012	35.65
195.47	62.35
195.928	6.52
196.385	-15.32
196.843	33.22
197.301	23.51
197.758	21.09
198.216	55.07
198.674	25.94
199.131	45.36
199.589	40.5
200.046	38.08
200.503	72.06
200.961	55.07
201.418	57.49
201.875	125.46
202.332	159.44
202.79	154.58
203.247	152.16
203.704	161.87
204.161	161.87
204.618	147.3
205.075	161.87
205.532	101.18
205.989	152.16
206.445	161.87
206.902	135.17
207.359	115.75
207.816	130.31
208.272	149.73
208.729	147.3
209.185	181.28
209.642	176.43
210.098	174
210.555	164.29
211.011	186.14
211.467	178.86
211.924	147.3
212.38	113.32
212.836	93.9
213.292	120.6
213.748	178.86
214.204	115.75
214.66	120.6
215.116	198.27
215.572	181.28
216.028	210.41
216.484	113.32
216.94	113.32
217.396	147.3
217.851	207.98
218.307	171.57
218.763	147.3
219.218	118.18
219.674	154.58
220.129	186.14
220.585	181.28
221.04	125.46
221.496	183.71
221.951	207.98
222.406	89.05
222.861	207.98
223.317	130.31
223.772	154.58
224.227	140.02
224.682	193.42
225.137	30.8
225.592	91.48
226.047	149.73
226.502	149.73
226.957	212.84
227.411	69.63
227.866	137.59
228.321	132.74
228.776	120.6
229.23	120.6
229.685	52.64
230.139	183.71
230.594	190.99
231.048	140.02
231.503	154.58
231.957	147.3
232.411	164.29
232.865	239.54
233.32	152.16
233.774	181.28
234.228	84.19
234.682	125.46
235.136	89.05
235.59	161.87
236.044	144.87
236.498	159.44
236.952	147.3
237.406	171.57
237.86	154.58
238.313	93.9
238.767	147.3
239.221	74.49
239.674	161.87
240.128	130.31
240.581	159.44
241.035	69.63
241.488	164.29
241.942	198.27
242.395	186.14
242.848	142.45
243.301	108.47
243.755	237.11
244.208	166.72
244.661	132.74
245.114	174
245.567	161.87
246.02	161.87
246.473	152.16
246.926	215.26
247.379	130.31
247.832	159.44
248.284	205.56
248.737	123.03
249.19	127.88
249.642	157.01
250.095	135.17
250.547	159.44
251	178.86
251.452	115.75
251.905	149.73
252.357	157.01
252.81	246.82
253.262	212.84
253.714	164.29
254.166	200.7
254.618	188.56
255.07	181.28
255.523	157.01
255.975	142.45
256.427	159.44
256.878	166.72
257.33	174
257.782	108.47
258.234	157.01
258.686	166.72
259.137	183.71
259.589	152.16
260.041	205.56
260.492	108.47
260.944	140.02
261.395	123.03
261.847	207.98
262.298	164.29
262.749	186.14
263.201	149.73
263.652	195.85
264.103	161.87
264.554	98.76
265.005	93.9
265.457	81.77
265.908	147.3
266.359	183.71
266.809	132.74
267.26	161.87
267.711	176.43
268.162	147.3
268.613	159.44
269.064	159.44
269.514	195.85
269.965	193.42
270.415	176.43
270.866	50.21
271.316	188.56
271.767	152.16
272.217	222.55
272.668	181.28
273.118	123.03
273.568	108.47
274.019	125.46
274.469	174
274.919	220.12
275.369	176.43
275.819	127.88
276.269	152.16
276.719	234.68
277.169	188.56
277.619	147.3
278.069	174
278.518	178.86
278.968	79.34
279.418	186.14
279.867	190.99
280.317	149.73
280.767	108.47
281.216	183.71
281.666	183.71
282.115	144.87
282.564	125.46
283.014	164.29
283.463	123.03
283.912	113.32
284.361	108.47
284.811	132.74
285.26	186.14
285.709	159.44
286.158	166.72
286.607	144.87
287.056	169.15
287.505	200.7
287.953	115.75
288.402	154.58
288.851	127.88
289.3	169.15
289.748	210.41
290.197	120.6
290.646	157.01
291.094	130.31
291.543	178.86
291.991	174
292.439	118.18
292.888	188.56
293.336	205.56
293.784	149.73
294.233	120.6
294.681	171.57
295.129	154.58
295.577	120.6
296.025	123.03
296.473	149.73
296.921	137.59
297.369	144.87
297.817	154.58
298.264	115.75
298.712	159.44
299.16	125.46
299.608	195.85
300.055	152.16
300.503	169.15
300.95	154.58
301.398	137.59
301.845	161.87
302.293	91.48
302.74	101.18
303.187	198.27
303.635	108.47
304.082	224.97
304.529	169.15
304.976	203.13
305.423	198.27
305.87	188.56
306.317	210.41
306.764	227.4
307.211	147.3
307.658	137.59
308.105	159.44
308.552	142.45
308.998	135.17
309.445	159.44
309.892	140.02
310.338	84.19
310.785	203.13
311.231	174
311.678	52.64
312.124	183.71
312.571	166.72
313.017	120.6
313.463	164.29
313.909	118.18
314.356	110.89
314.802	137.59
315.248	140.02
315.694	188.56
316.14	152.16
316.586	125.46
317.032	181.28
317.478	283.23
317.923	147.3
318.369	176.43
318.815	137.59
319.261	195.85
319.706	137.59
320.152	188.56
320.597	174
321.043	203.13
321.488	183.71
321.934	106.04
322.379	98.76
322.824	166.72
323.27	76.91
323.715	166.72
324.16	149.73
324.605	203.13
325.05	135.17
325.495	198.27
325.94	169.15
326.385	98.76
326.83	110.89
327.275	132.74
327.72	154.58
328.165	115.75
328.61	137.59
329.054	205.56
329.499	113.32
329.943	210.41
330.388	174
330.832	161.87
331.277	176.43
331.721	210.41
332.166	205.56
332.61	106.04
333.054	164.29
333.499	215.26
333.943	198.27
334.387	144.87
334.831	149.73
335.275	217.69
335.719	123.03
336.163	132.74
336.607	181.28
337.051	118.18
337.495	120.6
337.938	144.87
338.382	195.85
338.826	169.15
339.269	188.56
339.713	181.28
340.157	157.01
340.6	125.46
341.044	161.87
341.487	166.72
341.93	217.69
342.374	135.17
342.817	132.74
343.26	161.87
343.703	237.11
344.146	176.43
344.59	171.57
345.033	147.3
345.476	174
345.919	103.61
346.361	149.73
346.804	186.14
347.247	140.02
347.69	127.88
348.133	127.88
348.575	147.3
349.018	169.15
349.461	190.99
349.903	166.72
350.346	166.72
350.788	200.7
351.23	190.99
351.673	154.58
352.115	142.45
352.557	174
353	171.57
353.442	135.17
353.884	157.01
354.326	152.16
354.768	147.3
355.21	164.29
355.652	154.58
356.094	132.74
356.536	147.3
356.978	171.57
357.419	178.86
357.861	181.28
358.303	190.99
358.744	154.58
359.186	103.61
359.627	220.12
360.069	89.05
360.51	123.03
360.952	115.75
361.393	149.73
361.834	157.01
362.276	132.74
362.717	101.18
363.158	123.03
363.599	178.86
364.04	137.59
364.481	28.37
364.922	171.57
365.363	186.14
365.804	171.57
366.245	123.03
366.686	91.48
367.126	193.42
367.567	205.56
368.008	188.56
368.448	147.3
368.889	125.46
369.33	149.73
369.77	120.6
370.21	183.71
370.651	178.86
371.091	178.86
371.531	169.15
371.972	149.73
372.412	195.85
372.852	169.15
373.292	161.87
373.732	161.87
374.172	171.57
374.612	140.02
375.052	93.9
375.492	154.58
375.932	178.86
376.372	169.15
376.811	101.18
377.251	161.87
377.691	237.11
378.13	144.87
378.57	137.59
379.009	217.69
379.449	183.71
379.888	169.15
380.328	152.16
380.767	91.48
381.206	186.14
381.645	174
382.085	159.44
382.524	217.69
382.963	135.17
383.402	93.9
383.841	188.56
384.28	181.28
384.719	174
385.158	154.58
385.596	169.15
386.035	147.3
386.474	127.88
386.913	106.04
387.351	159.44
387.79	195.85
388.228	161.87
388.667	140.02
389.105	181.28
389.544	149.73
389.982	132.74
390.42	176.43
390.859	118.18
391.297	140.02
391.735	157.01
392.173	188.56
392.611	108.47
393.049	186.14
393.487	142.45
393.925	190.99
394.363	159.44
394.801	149.73
395.239	164.29
395.676	169.15
396.114	212.84
396.552	178.86
396.989	113.32
397.427	217.69
397.864	159.44
398.302	154.58
398.739	118.18
399.177	174
399.614	144.87
400.051	186.14
400.488	190.99
400.926	120.6
401.363	89.05
401.8	186.14
402.237	130.31
402.674	166.72
403.111	147.3
403.548	159.44
403.985	127.88
404.421	166.72
404.858	113.32
405.295	198.27
405.732	115.75
406.168	125.46
406.605	130.31
407.041	217.69
407.478	152.16
407.914	176.43
408.351	144.87
408.787	154.58
409.223	152.16
409.66	183.71
410.096	174
410.532	195.85
410.968	171.57
411.404	137.59
411.84	181.28
412.276	190.99
412.712	47.79
413.148	110.89
413.584	164.29
414.02	127.88
414.455	241.96
414.891	178.86
415.327	123.03
415.762	166.72
416.198	229.83
416.633	123.03
417.069	108.47
417.504	149.73
417.94	164.29
418.375	125.46
418.81	220.12
419.245	125.46
419.681	118.18
420.116	154.58
420.551	149.73
420.986	229.83
421.421	159.44
421.856	142.45
422.291	142.45
422.726	96.33
423.16	183.71
423.595	217.69
424.03	135.17
424.464	144.87
424.899	108.47
425.334	110.89
425.768	149.73
426.203	159.44
426.637	200.7
427.071	171.57
427.506	125.46
427.94	106.04
428.374	174
428.809	130.31
429.243	144.87
429.677	193.42
430.111	144.87
430.545	203.13
430.979	110.89
431.413	246.82
431.847	120.6
432.28	198.27
432.714	137.59
433.148	220.12
433.582	171.57
434.015	171.57
434.449	210.41
434.882	222.55
435.316	152.16
435.749	106.04
436.183	106.04
436.616	178.86
437.049	132.74
437.483	142.45
437.916	193.42
438.349	130.31
438.782	200.7
439.215	161.87
439.648	140.02
440.081	161.87
440.514	157.01
440.947	195.85
441.38	171.57
441.813	205.56
442.245	210.41
442.678	93.9
443.111	176.43
443.543	200.7
443.976	195.85
444.408	144.87
444.841	195.85
445.273	161.87
445.705	222.55
446.138	157.01
446.57	152.16
447.002	154.58
447.434	183.71
447.867	190.99
448.299	171.57
448.731	200.7
449.163	258.95
449.595	190.99
450.026	210.41
450.458	246.82
450.89	207.98
451.322	164.29
451.754	140.02
452.185	244.39
452.617	207.98
453.048	275.94
453.48	251.67
453.911	217.69
454.343	227.4
454.774	195.85
455.205	224.97
455.637	195.85
456.068	234.68
456.499	271.09
456.93	215.26
457.361	200.7
457.792	254.1
458.223	239.54
458.654	203.13
459.085	181.28
459.516	266.24
459.947	207.98
460.378	271.09
460.808	241.96
461.239	198.27
461.669	239.54
462.1	186.14
462.531	137.59
462.961	239.54
463.391	254.1
463.822	161.87
464.252	166.72
464.682	217.69
465.113	178.86
465.543	181.28
465.973	256.53
466.403	227.4
466.833	186.14
467.263	190.99
467.693	127.88
468.123	188.56
468.553	149.73
468.983	142.45
469.412	198.27
469.842	200.7
470.272	183.71
470.701	295.36
471.131	210.41
471.56	207.98
471.99	161.87
472.419	176.43
472.849	229.83
473.278	125.46
473.707	174
474.136	195.85
474.566	217.69
474.995	212.84
475.424	200.7
475.853	169.15
476.282	217.69
476.711	186.14
477.14	210.41
477.569	222.55
477.997	140.02
478.426	137.59
478.855	210.41
479.283	176.43
479.712	224.97
480.141	188.56
480.569	161.87
480.998	205.56
481.426	203.13
481.854	181.28
482.283	181.28
482.711	198.27
483.139	207.98
483.567	137.59
483.995	169.15
484.424	174
484.852	198.27
485.28	178.86
485.708	212.84
486.135	256.53
486.563	212.84
486.991	142.45
487.419	166.72
487.847	178.86
488.274	106.04
488.702	142.45
489.129	193.42
489.557	152.16
489.984	190.99
490.412	74.49
490.839	161.87
491.266	200.7
491.694	130.31
492.121	171.57
492.548	178.86
492.975	229.83
493.402	207.98
493.829	159.44
494.256	207.98
494.683	142.45
495.11	164.29
495.537	74.49
495.964	144.87
496.39	183.71
496.817	176.43
497.244	176.43
497.67	239.54
498.097	222.55
498.523	198.27
498.95	232.25
499.376	195.85
499.803	251.67
500.229	186.14
500.655	198.27
501.081	190.99
501.508	198.27
501.934	256.53
502.36	183.71
502.786	193.42
503.212	205.56
503.638	140.02
504.064	110.89
504.489	215.26
504.915	98.76
505.341	115.75
505.767	215.26
506.192	159.44
506.618	205.56
507.043	178.86
507.469	113.32
507.894	140.02
508.32	118.18
508.745	200.7
509.17	198.27
509.596	149.73
510.021	144.87
510.446	171.57
510.871	176.43
511.296	147.3
511.721	183.71
512.146	200.7
512.571	154.58
512.996	280.8
513.421	198.27
513.845	84.19
514.27	125.46
514.695	91.48
515.119	123.03
515.544	157.01
515.969	183.71
516.393	115.75
516.817	147.3
517.242	171.57
517.666	130.31
518.09	183.71
518.515	149.73
518.939	127.88
519.363	365.75
519.787	149.73
520.211	149.73
520.635	210.41
521.059	130.31
521.483	159.44
521.907	195.85
522.331	166.72
522.754	157.01
523.178	149.73
523.602	178.86
524.025	263.81
524.449	190.99
524.872	203.13
525.296	178.86
525.719	217.69
526.143	159.44
526.566	142.45
526.989	169.15
527.412	176.43
527.836	176.43
528.259	224.97
528.682	200.7
529.105	246.82
529.528	241.96
529.951	190.99
530.374	212.84
530.796	188.56
531.219	113.32
531.642	103.61
532.065	188.56
532.487	123.03
532.91	207.98
533.332	178.86
533.755	171.57
534.177	198.27
534.6	166.72
535.022	207.98
535.444	166.72
535.867	147.3
536.289	212.84
536.711	171.57
537.133	154.58
537.555	181.28
537.977	212.84
538.399	190.99
538.821	159.44
539.243	186.14
539.665	239.54
540.086	127.88
540.508	127.88
540.93	190.99
541.351	186.14
541.773	193.42
542.195	190.99
542.616	152.16
543.037	186.14
543.459	220.12
543.88	176.43
544.301	188.56
544.723	130.31
545.144	152.16
545.565	212.84
545.986	164.29
546.407	258.95
546.828	190.99
547.249	176.43
547.67	110.89
548.091	176.43
548.512	215.26
548.932	130.31
549.353	169.15
549.774	125.46
550.194	239.54
550.615	113.32
551.035	166.72
551.456	200.7
551.876	232.25
552.296	188.56
552.717	118.18
553.137	181.28
553.557	159.44
553.977	181.28
554.397	149.73
554.817	183.71
555.237	190.99
555.657	137.59
556.077	161.87
556.497	195.85
556.917	125.46
557.337	224.97
557.756	188.56
558.176	239.54
558.596	159.44
559.015	190.99
559.435	254.1
559.854	140.02
560.274	190.99
560.693	205.56
561.112	169.15
561.532	256.53
561.951	227.4
562.37	266.24
562.789	166.72
563.208	164.29
563.627	159.44
564.046	200.7
564.465	98.76
564.884	183.71
565.303	161.87
565.722	183.71
566.14	157.01
566.559	142.45
566.978	188.56
567.396	171.57
567.815	183.71
568.233	188.56
568.652	212.84
569.07	232.25
569.489	171.57
569.907	86.62
570.325	205.56
570.743	157.01
571.161	166.72
571.58	144.87
571.998	220.12
572.416	263.81
572.833	132.74
573.251	123.03
573.669	161.87
574.087	178.86
574.505	161.87
574.922	215.26
575.34	164.29
575.758	207.98
576.175	164.29
576.593	190.99
577.01	130.31
577.428	203.13
577.845	1504.12
578.262	273.52
578.68	130.31
579.097	169.15
579.514	217.69
579.931	152.16
580.348	144.87
580.765	193.42
581.182	161.87
581.599	193.42
582.016	188.56
582.433	149.73
582.849	152.16
583.266	106.04
583.683	237.11
584.099	266.24
584.516	193.42
584.933	144.87
585.349	164.29
585.765	174
586.182	203.13
586.598	174
587.014	198.27
587.431	159.44
587.847	174
588.263	198.27
588.679	234.68
589.095	140.02
589.511	198.27
589.927	183.71
590.343	188.56
590.759	241.96
591.174	166.72
591.59	237.11
592.006	207.98
592.421	224.97
592.837	166.72
593.252	232.25
593.668	118.18
594.083	157.01
594.499	157.01
594.914	159.44
595.329	149.73
595.745	193.42
596.16	130.31
596.575	215.26
596.99	127.88
597.405	147.3
597.82	237.11
598.235	212.84
598.65	154.58
599.065	174
599.479	227.4
599.894	186.14
600.309	171.57
600.724	159.44
601.138	210.41
601.553	174
601.967	188.56
602.382	164.29
602.796	171.57
603.21	149.73
603.625	205.56
604.039	147.3
604.453	217.69
604.867	224.97
605.281	249.25
605.695	174
606.109	125.46
606.523	130.31
606.937	137.59
607.351	268.66
607.765	234.68
608.178	232.25
608.592	188.56
609.006	171.57
609.419	137.59
609.833	137.59
610.246	152.16
610.66	200.7
611.073	159.44
611.487	220.12
611.9	227.4
612.313	183.71
612.726	142.45
613.139	157.01
613.553	198.27
613.966	190.99
614.379	224.97
614.792	142.45
615.204	135.17
615.617	140.02
616.03	174
616.443	140.02
616.856	273.52
617.268	169.15
617.681	142.45
618.093	147.3
618.506	84.19
618.918	157.01
619.331	110.89
619.743	166.72
620.155	205.56
620.568	115.75
620.98	154.58
621.392	161.87
621.804	239.54
622.216	108.47
622.628	137.59
623.04	130.31
623.452	72.06
623.864	169.15
624.276	195.85
624.687	132.74
625.099	195.85
625.511	195.85
625.922	210.41
626.334	96.33
626.745	176.43
627.157	159.44
627.568	135.17
627.979	147.3
628.391	157.01
628.802	188.56
629.213	152.16
629.624	169.15
630.035	115.75
630.446	152.16
630.857	127.88
631.268	135.17
631.679	227.4
632.09	178.86
632.501	144.87
632.912	210.41
633.322	224.97
633.733	169.15
634.144	140.02
634.554	212.84
634.965	207.98
635.375	207.98
635.785	169.15
636.196	188.56
636.606	154.58
637.016	171.57
637.427	195.85
637.837	130.31
638.247	110.89
638.657	174
639.067	203.13
639.477	237.11
639.887	183.71
640.297	159.44
640.706	232.25
641.116	123.03
641.526	137.59
641.935	110.89
642.345	140.02
642.755	137.59
643.164	91.48
643.573	169.15
643.983	254.1
644.392	174
644.801	140.02
645.211	188.56
645.62	176.43
646.029	157.01
646.438	132.74
646.847	198.27
647.256	140.02
647.665	108.47
648.074	161.87
648.483	178.86
648.892	154.58
649.3	178.86
649.709	110.89
650.118	190.99
650.526	161.87
650.935	152.16
651.343	229.83
651.752	193.42
652.16	203.13
652.568	166.72
652.977	132.74
653.385	186.14
653.793	239.54
654.201	161.87
654.609	178.86
655.017	188.56
655.425	207.98
655.833	205.56
656.241	193.42
656.649	190.99
657.057	130.31
657.464	169.15
657.872	176.43
658.28	215.26
658.687	127.88
659.095	183.71
659.502	169.15
659.91	161.87
660.317	181.28
660.724	142.45
661.132	217.69
661.539	137.59
661.946	188.56
662.353	132.74
662.76	118.18
663.167	198.27
663.574	169.15
663.981	135.17
664.388	110.89
664.795	147.3
665.202	210.41
665.608	142.45
666.015	108.47
666.422	169.15
666.828	169.15
667.235	212.84
667.641	108.47
668.047	135.17
668.454	207.98
668.86	147.3
669.266	130.31
669.673	67.2
670.079	195.85
670.485	93.9
670.891	113.32
671.297	244.39
671.703	171.57
672.109	220.12
672.515	142.45
672.92	171.57
673.326	190.99
673.732	176.43
674.138	86.62
674.543	169.15
674.949	106.04
675.354	205.56
675.76	181.28
676.165	110.89
676.57	93.9
676.976	181.28
677.381	186.14
677.786	200.7
678.191	142.45
678.596	176.43
679.001	183.71
679.406	149.73
679.811	120.6
680.216	166.72
680.621	210.41
681.026	115.75
681.43	154.58
681.835	198.27
682.24	149.73
682.644	161.87
683.049	142.45
683.453	174
683.858	159.44
684.262	108.47
684.667	188.56
685.071	227.4
685.475	169.15
685.879	157.01
686.283	195.85
686.687	135.17
687.091	195.85
687.495	140.02
687.899	198.27
688.303	205.56
688.707	67.2
689.111	140.02
689.514	132.74
689.918	171.57
690.322	178.86
690.725	147.3
691.129	183.71
691.532	152.16
691.936	113.32
692.339	176.43
692.742	176.43
693.146	164.29
693.549	169.15
693.952	135.17
694.355	232.25
694.758	166.72
695.161	174
695.564	164.29
695.967	178.86
696.37	161.87
696.773	164.29
697.175	198.27
697.578	203.13
697.981	205.56
698.383	188.56
698.786	205.56
699.188	254.1
699.591	132.74
699.993	239.54
700.395	210.41
700.798	110.89
701.2	149.73
701.602	81.77
702.004	144.87
702.406	154.58
702.808	203.13
703.21	176.43
703.612	186.14
704.014	207.98
704.416	137.59
704.818	190.99
705.219	237.11
705.621	283.23
706.023	181.28
706.424	258.95
706.826	258.95
707.227	169.15
707.629	290.51
708.03	232.25
708.431	224.97
708.832	241.96
709.234	171.57
709.635	178.86
710.036	198.27
710.437	292.94
710.838	261.38
711.239	278.37
711.64	215.26
712.041	203.13
712.441	278.37
712.842	292.94
713.243	261.38
713.643	249.25
714.044	227.4
714.445	152.16
714.845	275.94
715.246	254.1
715.646	244.39
716.046	268.66
716.447	302.64
716.847	275.94
717.247	309.93
717.647	300.22
718.047	295.36
718.447	334.2
718.847	336.63
719.247	404.59
719.647	390.02
720.047	407.01
720.446	292.94
720.846	331.77
721.246	397.31
721.645	370.61
722.045	360.9
722.444	421.58
722.844	460.41
723.243	453.13
723.643	387.6
724.042	433.71
724.441	496.82
724.84	521.09
725.24	482.26
725.639	474.98
726.038	457.99
726.437	465.27
726.836	508.96
727.234	562.36
727.633	559.93
728.032	606.05
728.431	559.93
728.83	581.77
729.228	669.15
729.627	676.44
730.025	712.84
730.424	737.12
730.822	802.65
731.22	812.36
731.619	819.64
732.017	957.99
732.415	970.13
732.813	999.26
733.212	1205.57
733.61	1159.45
734.008	1278.39
734.406	1448.29
734.803	1453.15
735.201	1562.37
735.599	1635.19
735.997	1720.14
736.395	1817.23
736.792	1933.74
737.19	2023.54
737.587	2084.23
737.985	2220.15
738.382	2258.99
738.78	2530.83
739.177	2606.08
739.574	2727.44
739.971	2943.46
740.369	2948.32
740.766	3144.92
741.163	3169.19
741.56	3341.53
741.957	3453.18
742.354	3603.67
742.751	3751.73
743.147	4110.96
743.544	4057.56
743.941	4343.97
744.338	4492.03
744.734	4839.12
745.131	4902.23
745.527	5249.32
745.924	5424.08
746.32	5661.95
746.716	5982.34
747.113	6373.13
747.509	6521.19
747.905	6844.01
748.301	7346.44
748.697	7547.9
749.093	7982.38
749.489	8106.16
749.885	8841.61
750.281	8914.43
750.677	9363.46
751.073	9720.27
751.468	9948.43
751.864	10334.35
752.26	10819.8
752.655	11244.56
753.051	11530.97
753.446	11948.46
753.842	12378.07
754.237	12950.9
754.632	13317.41
755.028	13365.95
755.423	13698.48
755.818	13814.99
756.213	14579.57
756.608	14356.26
757.003	14722.77
757.398	14856.27
757.793	15266.47
758.188	15045.59
758.583	15941.24
758.977	16101.43
759.372	16633
759.767	17191.26
760.161	18499.53
760.556	19086.92
760.95	19715.57
761.345	20596.65
761.739	21904.92
762.133	22266.58
762.527	23266.59
762.922	23764.17
763.316	24506.9
763.71	24926.81
764.104	25878.28
764.498	26555.48
764.892	26409.85
765.286	27320.05
765.68	28290.94
766.073	27953.56
766.467	28946.29
766.861	29793.39
767.255	30557.97
767.648	31400.22
768.042	31606.53
768.435	32504.6
768.829	33264.32
769.222	33601.71
769.615	34545.9
770.008	34419.68
770.402	34123.56
770.795	34077.44
771.188	35759.51
771.581	34868.72
771.974	34914.83
772.367	34941.53
772.76	35315.32
773.153	33885.69
773.545	34344.44
773.938	35907.57
774.331	35334.74
774.724	35545.91
775.116	37766.82
775.509	39278.98
775.901	39880.93
776.294	40757.16
776.686	41473.19
777.078	42672.24
777.471	42708.64
777.863	43982.94
778.255	46012.09
778.647	46235.4
779.039	46315.5
779.431	45696.55
779.823	47553.38
780.215	47458.72
780.607	46133.45
780.999	48196.59
781.39	48558.25
781.782	48720.87
782.174	48533.98
782.565	48980.59
782.957	50288.86
783.348	50199.05
783.74	49449.04
784.131	49621.37
784.522	51186.93
784.914	49890.79
785.305	49424.77
785.696	49167.48
786.087	49771.86
786.478	48237.86
786.869	46043.65
787.26	45371.31
787.651	45849.47
788.042	45247.52
788.433	43196.52
788.823	42558.16
789.214	42626.12
789.605	41485.32
789.995	39320.24
790.386	38992.57
790.776	39992.58
791.167	39427.04
791.557	39349.37
791.948	40237.73
792.338	41776.59
792.728	43635.84
793.118	41339.69
793.508	41266.87
793.898	42342.13
794.288	43567.88
794.678	42177.08
795.068	41266.87
795.458	42529.03
795.848	43349.43
796.238	43303.31
796.627	41300.85
797.017	41429.5
797.406	42580
797.796	42465.92
798.185	41834.84
798.575	41113.96
798.964	42640.68
799.354	43725.65
799.743	42135.82
800.132	40825.12
800.521	41890.67
800.91	43635.84
801.299	43708.66
801.688	41402.8
802.077	39808.11
802.466	41662.51
802.855	42480.48
803.244	39672.19
803.633	37912.45
804.021	38252.26
804.41	38863.92
804.799	38689.16
805.187	36072.62
805.576	34402.69
805.964	34992.5
806.352	34524.05
806.741	33371.12
807.129	31288.56
807.517	31829.83
807.905	33045.87
808.293	34344.44
808.681	32074.98
809.069	31050.7
809.457	33016.75
809.845	34761.92
810.233	34538.61
810.621	33261.89
811.009	31866.24
811.396	32625.96
811.784	34759.49
812.171	33880.84
812.559	31429.34
812.946	30502.14
813.334	31771.58
813.721	32431.78
814.108	30951.18
814.496	29133.19
814.883	28465.7
815.27	30839.53
815.657	31271.57
816.044	30441.46
816.431	28310.36
816.818	28152.59
817.205	29368.63
817.592	30715.74
817.979	29189.02
818.365	26803.06
818.752	26101.59
819.139	26067.61
819.525	26506.94
819.912	26096.73
820.298	24060.3
820.685	22946.2
821.071	23400.09
821.457	23929.23
821.843	22783.58
822.23	21288.41
822.616	19667.02
823.002	19033.52
823.388	19356.34
823.774	19099.05
824.16	17696.12
824.546	16511.63
824.931	16443.67
825.317	16941.25
825.703	17327.18
826.089	16868.44
826.474	15669.39
826.86	14897.53
827.245	15271.32
827.631	16472.8
828.016	16043.18
828.401	14543.16
828.787	13790.72
829.172	13489.74
829.557	14489.76
829.942	14169.36
830.327	13589.26
830.712	12494.58
831.097	11810.1
831.482	12283.41
831.867	12936.34
832.252	12647.5
832.636	11564.96
833.021	10810.09
833.406	10334.35
833.79	11089.22
834.175	11234.85
834.559	10771.25
834.944	9887.74
835.328	9132.88
835.713	9212.98
836.097	9613.47
836.481	9929.01
836.865	9215.4
837.249	8215.39
837.633	7725.09
838.017	7914.41
838.401	8055.19
838.785	7996.94
839.169	7339.16
839.553	6674.1
839.937	6047.88
840.32	6186.23
840.704	6360.99
841.087	6227.49
841.471	5640.11
841.854	5006.6
842.238	4851.26
842.621	4945.92
843.004	5132.82
843.388	5276.02
843.771	5055.15
844.154	4550.28
844.537	4251.73
844.92	4380.38
845.303	4727.47
845.686	4732.32
846.069	4613.39
846.452	4227.46
846.834	3860.95
847.217	3809.98
847.6	3948.33
847.982	4178.92
848.365	4074.55
848.748	3625.51
849.13	3251.72
849.512	3057.54
849.895	3312.4
850.277	3683.76
850.659	3620.66
851.041	3302.69
851.423	2960.45
851.806	2805.11
852.188	2892.49
852.57	3042.98
852.951	3200.75
853.333	3135.21
853.715	2797.83
854.097	2394.91
854.479	2409.47
854.86	2513.84
855.242	2579.38
855.623	2562.39
856.005	2348.79
856.386	1991.99
856.768	1780.82
857.149	1880.34
857.53	2072.09
857.911	2059.95
858.292	1977.43
858.674	1720.14
859.055	1550.24
859.436	1470.14
859.817	1489.56
860.197	1579.36
860.578	1589.07
860.959	1499.26
861.34	1343.92
861.72	1154.6
862.101	1091.49
862.482	1127.9
862.862	1285.67
863.243	1375.48
863.623	1334.21
864.003	1123.05
864.384	1018.67
864.764	960.42
865.144	945.86
865.524	1040.52
865.904	1132.75
866.284	1030.81
866.664	885.18
867.044	831.78
867.424	729.84
867.804	783.23
868.183	890.03
868.563	933.72
868.943	856.05
869.322	729.84
869.702	615.76
870.081	625.46
870.461	598.77
870.84	737.12
871.22	795.37
871.599	649.74
871.978	654.59
872.357	542.94
872.736	564.78
873.115	491.97
873.494	487.11
873.873	499.25
874.252	501.68
874.631	518.67
875.01	482.26
875.388	351.19
875.767	341.48
876.146	353.62
876.524	477.4
876.903	462.84
877.281	387.6
877.66	411.87
878.038	339.05
878.416	314.78
878.794	290.51
879.173	370.61
879.551	348.76
879.929	334.2
880.307	295.36
880.685	280.8
881.063	275.94
881.441	254.1
881.818	319.63
882.196	229.83
882.574	215.26
882.951	278.37
883.329	343.91
883.707	280.8
884.084	280.8
884.461	241.96
884.839	176.43
885.216	268.66
885.593	222.55
885.971	273.52
886.348	290.51
886.725	314.78
887.102	181.28
887.479	244.39
887.856	232.25
888.233	178.86
888.609	249.25
888.986	193.42
889.363	222.55
889.74	229.83
890.116	205.56
890.493	147.3
890.869	174
891.246	181.28
891.622	224.97
891.998	222.55
892.375	200.7
892.751	176.43
893.127	188.56
893.503	176.43
893.879	147.3
894.255	135.17
894.631	171.57
895.007	207.98
895.383	176.43
895.759	140.02
896.134	220.12
896.51	212.84
896.886	246.82
897.261	154.58
897.637	157.01
898.012	183.71
898.388	120.6
898.763	190.99
899.138	103.61
899.514	81.77
899.889	110.89
900.264	125.46
900.639	171.57
901.014	234.68
901.389	130.31
901.764	130.31
902.139	181.28
902.513	142.45
902.888	144.87
903.263	198.27
903.638	195.85
904.012	149.73
904.387	91.48
904.761	127.88
905.136	118.18
905.51	176.43
905.884	190.99
906.259	149.73
906.633	127.88
907.007	110.89
907.381	110.89
907.755	169.15
908.129	103.61
908.503	120.6
908.877	142.45
909.251	154.58
909.624	188.56
909.998	137.59
910.372	135.17
910.745	183.71
911.119	91.48
911.492	132.74
911.866	174
912.239	193.42
912.612	120.6
912.986	178.86
913.359	157.01
913.732	130.31
914.105	147.3
914.478	108.47
914.851	113.32
915.224	161.87
915.597	152.16
915.97	123.03
916.343	195.85
916.715	110.89
917.088	72.06
917.461	135.17
917.833	144.87
918.206	98.76
918.578	149.73
918.951	135.17
919.323	183.71
919.695	171.57
920.067	147.3
920.44	144.87
920.812	132.74
921.184	176.43
921.556	125.46
921.928	76.91
922.3	69.63
922.672	166.72
923.043	81.77
923.415	198.27
923.787	101.18
924.158	86.62
924.53	217.69
924.901	154.58
925.273	93.9
925.644	123.03
926.016	115.75
926.387	190.99
926.758	135.17
927.129	203.13
927.5	205.56
927.872	118.18
928.243	157.01
928.613	190.99
928.984	147.3
929.355	157.01
929.726	67.2
930.097	118.18
930.467	91.48
930.838	142.45
931.209	113.32
931.579	113.32
931.95	115.75
932.32	169.15
932.69	135.17
933.061	159.44
933.431	142.45
933.801	166.72
934.171	89.05
934.541	154.58
934.911	84.19
935.281	130.31
935.651	205.56
936.021	152.16
936.391	123.03
936.761	144.87
937.13	127.88
937.5	186.14
937.87	103.61
938.239	171.57
938.609	161.87
938.978	115.75
939.347	166.72
939.717	52.64
940.086	135.17
940.455	174
940.824	210.41
941.193	164.29
941.562	130.31
941.931	171.57
942.3	215.26
942.669	171.57
943.038	144.87
943.407	178.86
943.775	130.31
944.144	142.45
944.513	93.9
944.881	159.44
945.25	140.02
945.618	181.28
945.986	140.02
946.355	108.47
946.723	132.74
947.091	200.7
947.459	147.3
947.827	159.44
948.195	169.15
948.563	140.02
948.931	135.17
949.299	110.89
949.667	161.87
950.035	166.72
950.402	186.14
950.77	183.71
951.138	115.75
951.505	210.41
951.873	169.15
952.24	127.88
952.607	106.04
952.975	154.58
953.342	125.46
953.709	106.04
954.076	52.64
954.443	178.86
954.81	118.18
955.177	166.72
955.544	147.3
955.911	212.84
956.278	125.46
956.645	115.75
957.012	123.03
957.378	142.45
957.745	67.2
958.111	183.71
958.478	186.14
958.844	149.73
959.211	166.72
959.577	142.45
959.943	130.31
960.309	176.43
960.675	256.53
961.042	93.9
961.408	140.02
961.774	224.97
962.139	147.3
962.505	106.04
962.871	200.7
963.237	149.73
963.603	142.45
963.968	67.2
964.334	132.74
964.699	152.16
965.065	64.78
965.43	174
965.796	86.62
966.161	198.27
966.526	188.56
966.891	154.58
967.256	64.78
967.622	113.32
967.987	171.57
968.352	149.73
968.716	125.46
969.081	171.57
969.446	157.01
969.811	183.71
970.176	198.27
970.54	149.73
970.905	183.71
971.269	142.45
971.634	113.32
971.998	144.87
972.363	127.88
972.727	81.77
973.091	176.43
973.455	186.14
973.819	135.17
974.183	169.15
974.547	123.03
974.911	166.72
975.275	176.43
975.639	161.87
976.003	154.58
976.367	147.3
976.73	181.28
977.094	152.16
977.458	118.18
977.821	127.88
978.185	183.71
978.548	144.87
978.911	140.02
979.275	181.28
979.638	181.28
980.001	205.56
980.364	186.14
980.727	195.85
981.09	203.13
981.453	161.87
981.816	76.91
982.179	183.71
982.542	123.03
982.905	174
983.267	193.42
983.63	215.26
983.992	176.43
984.355	149.73
984.717	106.04
985.08	33.22
985.442	103.61
985.804	144.87
986.167	200.7
986.529	125.46
986.891	103.61
987.253	106.04
987.615	164.29
987.977	123.03
988.339	130.31
988.701	86.62
989.062	132.74
989.424	91.48
989.786	123.03
990.147	171.57
990.509	207.98
990.87	222.55
991.232	137.59
991.593	147.3
991.955	137.59
992.316	186.14
992.677	81.77
993.038	154.58
993.399	127.88
993.76	108.47
994.121	174
994.482	91.48
994.843	161.87
995.204	246.82
995.565	142.45
995.926	157.01
996.286	149.73
996.647	147.3
997.007	101.18
997.368	132.74
997.728	205.56
998.089	152.16
998.449	115.75
998.809	178.86
999.169	200.7
999.53	178.86
999.89	103.61
1000.25	127.88
1000.61	171.57
1000.97	154.58
1001.329	178.86
1001.689	157.01
1002.049	159.44
1002.409	157.01
1002.768	174
1003.128	132.74
1003.487	103.61
1003.847	110.89
1004.206	79.34
1004.566	120.6
1004.925	101.18
1005.284	118.18
1005.643	106.04
1006.003	96.33
1006.362	135.17
1006.721	171.57
1007.08	169.15
1007.438	164.29
1007.797	127.88
1008.156	195.85
1008.515	149.73
1008.874	212.84
1009.232	125.46
1009.591	152.16
1009.949	154.58
1010.308	169.15
1010.666	123.03
1011.024	149.73
1011.383	149.73
1011.741	140.02
1012.099	96.33
1012.457	166.72
1012.815	212.84
1013.173	132.74
1013.531	91.48
1013.889	159.44
1014.247	169.15
1014.605	57.49
1014.962	144.87
1015.32	147.3
1015.678	125.46
1016.035	154.58
1016.393	125.46
1016.75	127.88
1017.107	79.34
1017.465	132.74
1017.822	132.74
1018.179	176.43
1018.536	135.17
1018.894	186.14
1019.251	101.18
1019.608	178.86
1019.964	137.59
1020.321	147.3
1020.678	198.27
1021.035	186.14
1021.392	142.45
1021.748	120.6
1022.105	186.14
1022.461	220.12
1022.818	127.88
1023.174	207.98
1023.531	84.19
1023.887	159.44
1024.243	132.74
1024.599	166.72
1024.955	135.17
1025.311	210.41
1025.667	137.59
1026.023	164.29
1026.379	152.16
1026.735	127.88
1027.091	93.9
1027.447	118.18
