189.514	107.56
189.973	107.56
190.431	107.56
190.889	-55.07
191.348	-59.92
191.806	-40.5
192.264	-42.93
192.722	-11.38
193.18	-55.07
193.638	20.18
194.096	-8.95
194.554	-64.78
195.012	-1.67
195.47	-8.95
195.928	25.03
196.385	-40.5
196.843	37.17
197.301	-28.37
197.758	-16.23
198.216	54.16
198.674	80.86
199.131	61.44
199.589	100.27
200.046	71.15
200.503	100.27
200.961	88.14
201.418	90.57
201.875	126.97
202.332	80.86
202.79	15.32
203.247	141.54
203.704	105.13
204.161	109.98
204.618	119.69
205.075	117.27
205.532	153.67
205.989	129.4
206.445	61.44
206.902	109.98
207.359	177.95
207.816	185.23
208.272	124.55
208.729	114.84
209.185	192.51
209.642	134.26
210.098	255.62
210.555	190.08
211.011	180.37
211.467	151.25
211.924	129.4
212.38	134.26
212.836	126.97
213.292	158.53
213.748	194.94
214.204	170.66
214.66	175.52
215.116	231.34
215.572	182.8
216.028	129.4
216.484	182.8
216.94	177.95
217.396	126.97
217.851	180.37
218.307	168.24
218.763	122.12
219.218	204.65
219.674	112.41
220.129	163.38
220.585	180.37
221.04	187.65
221.496	153.67
221.951	165.81
222.406	112.41
222.861	136.68
223.317	100.27
223.772	139.11
224.227	143.96
224.682	216.78
225.137	114.84
225.592	156.1
226.047	61.44
226.502	124.55
226.957	122.12
227.411	153.67
227.866	175.52
228.321	151.25
228.776	139.11
229.23	156.1
229.685	146.39
230.139	105.13
230.594	180.37
231.048	182.8
231.503	136.68
231.957	153.67
232.411	190.08
232.865	134.26
233.32	153.67
233.774	192.51
234.228	100.27
234.682	136.68
235.136	90.57
235.59	148.82
236.044	151.25
236.498	202.22
236.952	141.54
237.406	160.96
237.86	146.39
238.313	175.52
238.767	158.53
239.221	90.57
239.674	209.5
240.128	153.67
240.581	209.5
241.035	105.13
241.488	97.85
241.942	170.66
242.395	192.51
242.848	100.27
243.301	68.72
243.755	207.07
244.208	151.25
244.661	170.66
245.114	136.68
245.567	165.81
246.02	143.96
246.473	160.96
246.926	122.12
247.379	134.26
247.832	80.86
248.284	158.53
248.737	160.96
249.19	83.28
249.642	119.69
250.095	146.39
250.547	78.43
251	114.84
251.452	136.68
251.905	214.35
252.357	124.55
252.81	156.1
253.262	182.8
253.714	131.83
254.166	156.1
254.618	192.51
255.07	175.52
255.523	204.65
255.975	175.52
256.427	97.85
256.878	95.42
257.33	192.51
257.782	112.41
258.234	158.53
258.686	143.96
259.137	131.83
259.589	224.06
260.041	199.79
260.492	160.96
260.944	129.4
261.395	100.27
261.847	109.98
262.298	170.66
262.749	173.09
263.201	107.56
263.652	182.8
264.103	204.65
264.554	180.37
265.005	100.27
265.457	95.42
265.908	151.25
266.359	119.69
266.809	146.39
267.26	126.97
267.711	173.09
268.162	139.11
268.613	100.27
269.064	141.54
269.514	197.36
269.965	175.52
270.415	187.65
270.866	180.37
271.316	160.96
271.767	143.96
272.217	170.66
272.668	141.54
273.118	148.82
273.568	119.69
274.019	109.98
274.469	173.09
274.919	170.66
275.369	224.06
275.819	153.67
276.269	175.52
276.719	141.54
277.169	102.7
277.619	141.54
278.069	88.14
278.518	209.5
278.968	83.28
279.418	194.94
279.867	139.11
280.317	134.26
280.767	177.95
281.216	211.93
281.666	182.8
282.115	119.69
282.564	158.53
283.014	114.84
283.463	119.69
283.912	126.97
284.361	105.13
284.811	71.15
285.26	175.52
285.709	173.09
286.158	148.82
286.607	100.27
287.056	129.4
287.505	221.64
287.953	192.51
288.402	136.68
288.851	92.99
289.3	95.42
289.748	160.96
290.197	165.81
290.646	180.37
291.094	92.99
291.543	114.84
291.991	143.96
292.439	168.24
292.888	204.65
293.336	109.98
293.784	143.96
294.233	85.71
294.681	180.37
295.129	119.69
295.577	170.66
296.025	114.84
296.473	80.86
296.921	204.65
297.369	124.55
297.817	85.71
298.264	95.42
298.712	126.97
299.16	216.78
299.608	148.82
300.055	185.23
300.503	109.98
300.95	185.23
301.398	177.95
301.845	175.52
302.293	124.55
302.74	83.28
303.187	211.93
303.635	114.84
304.082	148.82
304.529	160.96
304.976	199.79
305.423	272.61
305.87	160.96
306.317	105.13
306.764	224.06
307.211	83.28
307.658	153.67
308.105	185.23
308.552	163.38
308.998	139.11
309.445	224.06
309.892	194.94
310.338	112.41
310.785	165.81
311.231	126.97
311.678	158.53
312.124	207.07
312.571	119.69
313.017	192.51
313.463	129.4
313.909	168.24
314.356	148.82
314.802	126.97
315.248	90.57
315.694	146.39
316.14	153.67
316.586	117.27
317.032	187.65
317.478	139.11
317.923	148.82
318.369	112.41
318.815	175.52
319.261	177.95
319.706	131.83
320.152	180.37
320.597	146.39
321.043	160.96
321.488	185.23
321.934	165.81
322.379	173.09
322.824	173.09
323.27	202.22
323.715	146.39
324.16	71.15
324.605	80.86
325.05	139.11
325.495	112.41
325.94	76
326.385	102.7
326.83	119.69
327.275	151.25
327.72	207.07
328.165	243.48
328.61	177.95
329.054	139.11
329.499	180.37
329.943	170.66
330.388	85.71
330.832	194.94
331.277	177.95
331.721	124.55
332.166	221.64
332.61	151.25
333.054	168.24
333.499	109.98
333.943	156.1
334.387	85.71
334.831	126.97
335.275	122.12
335.719	182.8
336.163	143.96
336.607	136.68
337.051	122.12
337.495	182.8
337.938	231.34
338.382	136.68
338.826	177.95
339.269	190.08
339.713	136.68
340.157	136.68
340.6	126.97
341.044	117.27
341.487	131.83
341.93	114.84
342.374	165.81
342.817	97.85
343.26	180.37
343.703	170.66
344.146	78.43
344.59	105.13
345.033	180.37
345.476	151.25
345.919	102.7
346.361	190.08
346.804	177.95
347.247	148.82
347.69	153.67
348.133	131.83
348.575	143.96
349.018	158.53
349.461	56.58
349.903	170.66
350.346	78.43
350.788	182.8
351.23	148.82
351.673	109.98
352.115	158.53
352.557	124.55
353	151.25
353.442	100.27
353.884	126.97
354.326	197.36
354.768	114.84
355.21	187.65
355.652	105.13
356.094	158.53
356.536	141.54
356.978	90.57
357.419	224.06
357.861	134.26
358.303	187.65
358.744	131.83
359.186	163.38
359.627	131.83
360.069	112.41
360.51	129.4
360.952	114.84
361.393	148.82
361.834	219.21
362.276	112.41
362.717	141.54
363.158	204.65
363.599	180.37
364.04	199.79
364.481	151.25
364.922	163.38
365.363	100.27
365.804	131.83
366.245	143.96
366.686	131.83
367.126	107.56
367.567	117.27
368.008	204.65
368.448	231.34
368.889	219.21
369.33	231.34
369.77	153.67
370.21	160.96
370.651	170.66
371.091	156.1
371.531	158.53
371.972	187.65
372.412	231.34
372.852	100.27
373.292	148.82
373.732	163.38
374.172	141.54
374.612	170.66
375.052	107.56
375.492	168.24
375.932	182.8
376.372	151.25
376.811	136.68
377.251	173.09
377.691	143.96
378.13	156.1
378.57	199.79
379.009	165.81
379.449	168.24
379.888	124.55
380.328	146.39
380.767	153.67
381.206	85.71
381.645	117.27
382.085	143.96
382.524	148.82
382.963	163.38
383.402	114.84
383.841	175.52
384.28	151.25
384.719	173.09
385.158	122.12
385.596	139.11
386.035	185.23
386.474	168.24
386.913	185.23
387.351	124.55
387.79	173.09
388.228	187.65
388.667	129.4
389.105	177.95
389.544	168.24
389.982	168.24
390.42	143.96
390.859	124.55
391.297	241.05
391.735	187.65
392.173	153.67
392.611	199.79
393.049	107.56
393.487	221.64
393.925	126.97
394.363	139.11
394.801	175.52
395.239	158.53
395.676	170.66
396.114	190.08
396.552	219.21
396.989	102.7
397.427	92.99
397.864	168.24
398.302	107.56
398.739	168.24
399.177	129.4
399.614	95.42
400.051	185.23
400.488	163.38
400.926	170.66
401.363	194.94
401.8	148.82
402.237	97.85
402.674	163.38
403.111	153.67
403.548	224.06
403.985	153.67
404.421	102.7
404.858	158.53
405.295	182.8
405.732	163.38
406.168	124.55
406.605	165.81
407.041	182.8
407.478	141.54
407.914	112.41
408.351	139.11
408.787	71.15
409.223	209.5
409.66	141.54
410.096	139.11
410.532	209.5
410.968	124.55
411.404	192.51
411.84	56.58
412.276	165.81
412.712	204.65
413.148	177.95
413.584	153.67
414.02	143.96
414.455	168.24
414.891	160.96
415.327	124.55
415.762	117.27
416.198	119.69
416.633	134.26
417.069	187.65
417.504	156.1
417.94	156.1
418.375	168.24
418.81	129.4
419.245	182.8
419.681	177.95
420.116	194.94
420.551	139.11
420.986	197.36
421.421	85.71
421.856	141.54
422.291	209.5
422.726	136.68
423.16	88.14
423.595	143.96
424.03	141.54
424.464	124.55
424.899	197.36
425.334	112.41
425.768	90.57
426.203	180.37
426.637	190.08
427.071	199.79
427.506	153.67
427.94	248.34
428.374	177.95
428.809	197.36
429.243	134.26
429.677	177.95
430.111	68.72
430.545	209.5
430.979	107.56
431.413	177.95
431.847	168.24
432.28	122.12
432.714	102.7
433.148	114.84
433.582	202.22
434.015	153.67
434.449	80.86
434.882	158.53
435.316	126.97
435.749	185.23
436.183	122.12
436.616	112.41
437.049	187.65
437.483	194.94
437.916	126.97
438.349	146.39
438.782	168.24
439.215	122.12
439.648	78.43
440.081	163.38
440.514	199.79
440.947	204.65
441.38	105.13
441.813	136.68
442.245	243.48
442.678	105.13
443.111	90.57
443.543	131.83
443.976	197.36
444.408	187.65
444.841	187.65
445.273	124.55
445.705	78.43
446.138	136.68
446.57	122.12
447.002	146.39
447.434	177.95
447.867	112.41
448.299	148.82
448.731	209.5
449.163	211.93
449.595	122.12
450.026	126.97
450.458	129.4
450.89	211.93
451.322	100.27
451.754	187.65
452.185	112.41
452.617	151.25
453.048	182.8
453.48	170.66
453.911	197.36
454.343	139.11
454.774	151.25
455.205	236.2
455.637	236.2
456.068	192.51
456.499	129.4
456.93	202.22
457.361	190.08
457.792	204.65
458.223	170.66
458.654	182.8
459.085	202.22
459.516	136.68
459.947	131.83
460.378	207.07
460.808	126.97
461.239	173.09
461.669	163.38
462.1	146.39
462.531	182.8
462.961	216.78
463.391	182.8
463.822	165.81
464.252	160.96
464.682	71.15
465.113	214.35
465.543	199.79
465.973	158.53
466.403	228.92
466.833	143.96
467.263	177.95
467.693	112.41
468.123	141.54
468.553	204.65
468.983	153.67
469.412	119.69
469.842	238.63
470.272	168.24
470.701	85.71
471.131	187.65
471.56	136.68
471.99	190.08
472.419	180.37
472.849	158.53
473.278	124.55
473.707	197.36
474.136	153.67
474.566	236.2
474.995	170.66
475.424	170.66
475.853	153.67
476.282	122.12
476.711	105.13
477.14	163.38
477.569	158.53
477.997	143.96
478.426	107.56
478.855	90.57
479.283	134.26
479.712	139.11
480.141	105.13
480.569	197.36
480.998	146.39
481.426	134.26
481.854	136.68
482.283	148.82
482.711	199.79
483.139	170.66
483.567	158.53
483.995	168.24
484.424	182.8
484.852	177.95
485.28	139.11
485.708	182.8
486.135	202.22
486.563	204.65
486.991	182.8
487.419	209.5
487.847	173.09
488.274	131.83
488.702	190.08
489.129	143.96
489.557	119.69
489.984	265.33
490.412	173.09
490.839	185.23
491.266	160.96
491.694	219.21
492.121	214.35
492.548	182.8
492.975	112.41
493.402	136.68
493.829	209.5
494.256	141.54
494.683	146.39
495.11	42.02
495.537	107.56
495.964	204.65
496.39	187.65
496.817	182.8
497.244	211.93
497.67	95.42
498.097	136.68
498.523	216.78
498.95	153.67
499.376	163.38
499.803	109.98
500.229	126.97
500.655	114.84
501.081	165.81
501.508	109.98
501.934	207.07
502.36	173.09
502.786	199.79
503.212	284.74
503.638	114.84
504.064	187.65
504.489	148.82
504.915	143.96
505.341	216.78
505.767	185.23
506.192	122.12
506.618	194.94
507.043	151.25
507.469	153.67
507.894	124.55
508.32	148.82
508.745	194.94
509.17	173.09
509.596	187.65
510.021	180.37
510.446	173.09
510.871	139.11
511.296	221.64
511.721	226.49
512.146	151.25
512.571	148.82
512.996	180.37
513.421	185.23
513.845	112.41
514.27	190.08
514.695	168.24
515.119	76
515.544	202.22
515.969	143.96
516.393	122.12
516.817	122.12
517.242	112.41
517.666	190.08
518.09	207.07
518.515	216.78
518.939	156.1
519.363	374.55
519.787	182.8
520.211	71.15
520.635	185.23
521.059	131.83
521.483	141.54
521.907	139.11
522.331	156.1
522.754	119.69
523.178	199.79
523.602	100.27
524.025	153.67
524.449	187.65
524.872	129.4
525.296	141.54
525.719	151.25
526.143	214.35
526.566	136.68
526.989	80.86
527.412	129.4
527.836	163.38
528.259	156.1
528.682	90.57
529.105	148.82
529.528	182.8
529.951	141.54
530.374	160.96
530.796	136.68
531.219	173.09
531.642	158.53
532.065	117.27
532.487	168.24
532.91	165.81
533.332	156.1
533.755	141.54
534.177	122.12
534.6	97.85
535.022	202.22
535.444	124.55
535.867	131.83
536.289	170.66
536.711	139.11
537.133	190.08
537.555	129.4
537.977	197.36
538.399	182.8
538.821	139.11
539.243	160.96
539.665	192.51
540.086	148.82
540.508	163.38
540.93	117.27
541.351	131.83
541.773	129.4
542.195	228.92
542.616	146.39
543.037	197.36
543.459	136.68
543.88	199.79
544.301	170.66
544.723	185.23
545.144	194.94
545.565	177.95
545.986	165.81
546.407	124.55
546.828	199.79
547.249	126.97
547.67	97.85
548.091	207.07
548.512	141.54
548.932	168.24
549.353	194.94
549.774	129.4
550.194	180.37
550.615	134.26
551.035	163.38
551.456	221.64
551.876	190.08
552.296	168.24
552.717	114.84
553.137	119.69
553.557	134.26
553.977	117.27
554.397	185.23
554.817	192.51
555.237	126.97
555.657	114.84
556.077	143.96
556.497	129.4
556.917	136.68
557.337	197.36
557.756	182.8
558.176	160.96
558.596	95.42
559.015	146.39
559.435	163.38
559.854	197.36
560.274	173.09
560.693	187.65
561.112	126.97
561.532	158.53
561.951	168.24
562.37	182.8
562.789	194.94
563.208	192.51
563.627	117.27
564.046	114.84
564.465	151.25
564.884	148.82
565.303	226.49
565.722	175.52
566.14	180.37
566.559	156.1
566.978	160.96
567.396	148.82
567.815	173.09
568.233	134.26
568.652	231.34
569.07	148.82
569.489	185.23
569.907	153.67
570.325	139.11
570.743	126.97
571.161	139.11
571.58	114.84
571.998	170.66
572.416	139.11
572.833	158.53
573.251	148.82
573.669	177.95
574.087	296.88
574.505	158.53
574.922	136.68
575.34	160.96
575.758	105.13
576.175	185.23
576.593	131.83
577.01	148.82
577.428	129.4
577.845	1471.66
578.262	316.3
578.68	175.52
579.097	207.07
579.514	182.8
579.931	177.95
580.348	141.54
580.765	129.4
581.182	202.22
581.599	185.23
582.016	141.54
582.433	148.82
582.849	102.7
583.266	199.79
583.683	129.4
584.099	202.22
584.516	238.63
584.933	148.82
585.349	175.52
585.765	173.09
586.182	168.24
586.598	122.12
587.014	153.67
587.431	131.83
587.847	56.58
588.263	66.29
588.679	105.13
589.095	173.09
589.511	90.57
589.927	136.68
590.343	177.95
590.759	92.99
591.174	139.11
591.59	190.08
592.006	214.35
592.421	160.96
592.837	136.68
593.252	168.24
593.668	148.82
594.083	126.97
594.499	163.38
594.914	124.55
595.329	107.56
595.745	139.11
596.16	197.36
596.575	100.27
596.99	92.99
597.405	100.27
597.82	194.94
598.235	199.79
598.65	165.81
599.065	180.37
599.479	139.11
599.894	100.27
600.309	76
600.724	173.09
601.138	160.96
601.553	228.92
601.967	126.97
602.382	151.25
602.796	165.81
603.21	175.52
603.625	129.4
604.039	190.08
604.453	153.67
604.867	153.67
605.281	253.19
605.695	136.68
606.109	185.23
606.523	177.95
606.937	199.79
607.351	284.74
607.765	192.51
608.178	177.95
608.592	173.09
609.006	117.27
609.419	180.37
609.833	146.39
610.246	214.35
610.66	197.36
611.073	192.51
611.487	197.36
611.9	182.8
612.313	177.95
612.726	139.11
613.139	170.66
613.553	139.11
613.966	182.8
614.379	124.55
614.792	168.24
615.204	163.38
615.617	131.83
616.03	114.84
616.443	153.67
616.856	207.07
617.268	156.1
617.681	131.83
618.093	153.67
618.506	158.53
618.918	156.1
619.331	136.68
619.743	148.82
620.155	221.64
620.568	136.68
620.98	168.24
621.392	177.95
621.804	148.82
622.216	146.39
622.628	156.1
623.04	134.26
623.452	153.67
623.864	158.53
624.276	117.27
624.687	141.54
625.099	117.27
625.511	122.12
625.922	163.38
626.334	141.54
626.745	129.4
627.157	233.77
627.568	165.81
627.979	134.26
628.391	92.99
628.802	156.1
629.213	182.8
629.624	122.12
630.035	231.34
630.446	185.23
630.857	173.09
631.268	202.22
631.679	165.81
632.09	148.82
632.501	202.22
632.912	168.24
633.322	226.49
633.733	131.83
634.144	175.52
634.554	170.66
634.965	175.52
635.375	224.06
635.785	112.41
636.196	197.36
636.606	114.84
637.016	158.53
637.427	126.97
637.837	187.65
638.247	163.38
638.657	119.69
639.067	151.25
639.477	139.11
639.887	131.83
640.297	129.4
640.706	146.39
641.116	168.24
641.526	182.8
641.935	129.4
642.345	187.65
642.755	129.4
643.164	187.65
643.573	180.37
643.983	136.68
644.392	214.35
644.801	160.96
645.211	163.38
645.62	102.7
646.029	119.69
646.438	139.11
646.847	209.5
647.256	139.11
647.665	165.81
648.074	192.51
648.483	185.23
648.892	190.08
649.3	117.27
649.709	109.98
650.118	187.65
650.526	170.66
650.935	139.11
651.343	199.79
651.752	158.53
652.16	109.98
652.568	199.79
652.977	22.6
653.385	173.09
653.793	177.95
654.201	202.22
654.609	177.95
655.017	168.24
655.425	131.83
655.833	197.36
656.241	129.4
656.649	134.26
657.057	173.09
657.464	131.83
657.872	177.95
658.28	190.08
658.687	153.67
659.095	148.82
659.502	119.69
659.91	151.25
660.317	194.94
660.724	199.79
661.132	139.11
661.539	168.24
661.946	192.51
662.353	190.08
662.76	168.24
663.167	131.83
663.574	122.12
663.981	114.84
664.388	163.38
664.795	151.25
665.202	141.54
665.608	100.27
666.015	134.26
666.422	221.64
666.828	231.34
667.235	131.83
667.641	80.86
668.047	148.82
668.454	173.09
668.86	180.37
669.266	122.12
669.673	148.82
670.079	165.81
670.485	156.1
670.891	168.24
671.297	173.09
671.703	151.25
672.109	158.53
672.515	202.22
672.92	180.37
673.326	228.92
673.732	109.98
674.138	54.16
674.543	139.11
674.949	153.67
675.354	136.68
675.76	231.34
676.165	129.4
676.57	107.56
676.976	119.69
677.381	163.38
677.786	160.96
678.191	182.8
678.596	160.96
679.001	126.97
679.406	160.96
679.811	136.68
680.216	148.82
680.621	165.81
681.026	185.23
681.43	136.68
681.835	182.8
682.24	243.48
682.644	173.09
683.049	143.96
683.453	148.82
683.858	124.55
684.262	170.66
684.667	187.65
685.071	97.85
685.475	129.4
685.879	165.81
686.283	163.38
686.687	160.96
687.091	168.24
687.495	153.67
687.899	153.67
688.303	187.65
688.707	61.44
689.111	126.97
689.514	199.79
689.918	197.36
690.322	163.38
690.725	146.39
691.129	173.09
691.532	190.08
691.936	124.55
692.339	165.81
692.742	236.2
693.146	175.52
693.549	131.83
693.952	129.4
694.355	204.65
694.758	197.36
695.161	163.38
695.564	158.53
695.967	209.5
696.37	151.25
696.773	117.27
697.175	146.39
697.578	194.94
697.981	170.66
698.383	180.37
698.786	117.27
699.188	192.51
699.591	224.06
699.993	156.1
700.395	194.94
700.798	165.81
701.2	114.84
701.602	177.95
702.004	245.91
702.406	190.08
702.808	204.65
703.21	163.38
703.612	219.21
704.014	177.95
704.416	207.07
704.818	236.2
705.219	236.2
705.621	158.53
706.023	146.39
706.424	241.05
706.826	202.22
707.227	224.06
707.629	143.96
708.03	151.25
708.431	219.21
708.832	211.93
709.234	124.55
709.635	270.18
710.036	194.94
710.437	301.73
710.838	267.75
711.239	275.03
711.64	258.04
712.041	219.21
712.441	330.86
712.842	214.35
713.243	306.59
713.643	272.61
714.044	204.65
714.445	224.06
714.845	262.9
715.246	313.87
715.646	328.43
716.046	287.17
716.447	309.02
716.847	306.59
717.247	335.72
717.647	311.44
718.047	306.59
718.447	338.14
718.847	284.74
719.247	321.15
719.647	345.42
720.047	309.02
720.446	367.27
720.846	296.88
721.246	357.56
721.645	311.44
722.045	352.71
722.444	359.99
722.844	321.15
723.243	413.39
723.643	376.98
724.042	330.86
724.441	277.46
724.84	413.39
725.24	328.43
725.639	364.84
726.038	386.69
726.437	374.55
726.836	408.53
727.234	452.22
727.633	449.79
728.032	483.78
728.431	449.79
728.83	449.79
729.228	495.91
729.627	580.86
730.025	639.12
730.424	626.98
730.822	665.82
731.22	724.07
731.619	775.04
732.017	908.54
732.415	940.09
732.813	1066.31
733.212	1192.52
733.61	1296.9
734.008	1406.12
734.406	1544.47
734.803	1612.43
735.201	1765.35
735.599	2015.35
735.997	2139.14
736.395	2304.19
736.792	2364.87
737.19	2398.85
737.587	2546.91
737.985	2826.05
738.382	2901.29
738.78	2915.85
739.177	2947.41
739.574	3025.08
739.971	3071.19
740.369	2961.97
740.766	3110.03
741.163	2838.18
741.56	2845.46
741.957	2697.4
742.354	2508.08
742.751	2430.41
743.147	2350.31
743.544	2236.23
743.941	2073.61
744.338	1726.51
744.734	1789.62
745.131	1629.42
745.527	1561.46
745.924	1452.24
746.32	1437.67
746.716	1406.12
747.113	1617.29
747.509	1668.26
747.905	1852.73
748.301	2192.54
748.697	2554.2
749.093	3003.23
749.489	3386.73
749.885	4032.37
750.281	4964.43
750.677	5546.96
751.073	6520.28
751.468	7321.26
751.864	8464.48
752.26	9199.93
752.655	10547.04
753.051	11527.64
753.446	13047.08
753.842	14144.18
754.237	15238.86
754.632	16661.21
755.028	17161.22
755.423	17889.39
755.818	18712.21
756.213	19454.94
756.608	20217.09
757.003	20877.3
757.398	20947.69
757.793	21107.88
758.188	21433.13
758.583	21687.99
758.977	21170.99
759.372	21401.58
759.767	21704.98
760.161	21639.44
760.556	21571.48
760.95	21214.68
761.345	20751.08
761.739	20729.24
762.133	19862.72
762.527	19103
762.922	17996.18
763.316	17610.26
763.71	16059.26
764.104	14663.61
764.498	13433.01
764.892	12658.72
765.286	11699.97
765.68	10661.12
766.073	10202.37
766.467	9270.32
766.861	8867.4
767.255	8238.75
767.648	8078.55
768.042	7911.08
768.435	8114.96
768.829	8340.69
769.222	8801.87
769.615	9289.74
770.008	10107.71
770.402	10932.97
770.795	11852.88
771.188	13253.39
771.581	14750.99
771.974	16369.95
772.367	17816.57
772.76	19636.99
773.153	20896.71
773.545	22940.44
773.938	25212.32
774.331	27838.57
774.724	30054.62
775.116	33981.87
775.509	37557.17
775.901	40724.69
776.294	43656.78
776.686	45824.29
777.078	48710.25
777.471	51127.77
777.863	54030.73
778.255	56445.81
778.647	58050.21
779.039	58591.48
779.431	59108.47
779.823	59166.73
780.215	60268.69
780.607	60001.69
780.999	60943.45
781.39	60683.74
781.782	60780.83
782.174	60875.49
782.565	61081.81
782.957	60805.1
783.348	60110.92
783.74	59987.13
784.131	58428.85
784.522	57115.72
784.914	56013.77
785.305	54278.3
785.696	52020.99
786.087	49984.55
786.478	46814.59
786.869	43316.97
787.26	41195.57
787.651	37870.28
788.042	34525.57
788.433	32697.87
788.823	29656.56
789.214	26649.23
789.605	24408.91
789.995	22454.99
790.386	20777.78
790.776	18675.81
791.167	17367.53
791.557	16413.64
791.948	15246.14
792.338	14500.98
792.728	13940.3
793.118	13520.39
793.508	12789.79
793.898	12326.19
794.288	12246.09
794.678	12005.8
795.068	11915.99
795.458	12243.67
795.848	12767.95
796.238	13083.49
796.627	13767.96
797.017	14175.74
797.406	15408.77
797.796	16311.69
798.185	17197.63
798.575	19132.12
798.964	20396.71
799.354	21622.45
799.743	23629.77
800.132	24870.08
800.521	26811.86
800.91	28913.83
801.299	29554.62
801.688	31299.79
802.077	33389.63
802.466	34821.69
802.855	36023.16
803.244	36593.56
803.633	37661.54
804.021	38467.38
804.41	40054.78
804.799	40244.1
805.187	40945.57
805.576	41236.84
805.964	41319.36
806.352	40637.31
806.741	41778.11
807.129	41816.94
807.517	43336.38
807.905	43246.58
808.293	43625.22
808.681	44418.93
809.069	45491.76
809.457	46491.77
809.845	46620.42
810.233	46086.43
810.621	47200.52
811.009	46030.6
811.396	45756.32
811.784	45715.06
812.171	44370.38
812.559	43562.12
812.946	42503.85
813.334	41190.72
813.721	38921.27
814.108	37748.92
814.496	36460.06
814.883	35086.26
815.27	34535.28
815.657	33491.57
816.044	32433.3
816.431	31088.62
816.818	29362.87
817.205	27273.03
817.592	26688.07
817.979	24972.02
818.365	23399.18
818.752	21755.95
819.139	19799.61
819.525	18161.24
819.912	17068.99
820.298	15974.31
820.685	14576.23
821.071	13527.67
821.457	12343.18
821.843	10915.98
822.23	10350.43
822.616	9066.43
823.002	8403.8
823.388	7447.48
823.774	6826.11
824.16	6114.93
824.546	5726.58
824.931	5347.93
825.317	4930.45
825.703	4614.91
826.089	4464.42
826.474	4173.15
826.86	3930.43
827.245	3915.87
827.631	3775.09
828.016	3673.15
828.401	3687.71
828.787	3741.11
829.172	3716.84
829.557	3719.26
829.942	3644.02
830.327	3857.61
830.712	3889.17
831.097	3855.19
831.482	4008.1
831.867	4219.27
832.252	4461.99
832.636	4639.18
833.021	4787.24
833.406	4976.56
833.79	5088.22
834.175	5328.51
834.559	5469.29
834.944	5779.97
835.328	5945.03
835.713	5894.05
836.097	6202.31
836.481	6241.15
836.865	6311.54
837.249	6367.36
837.633	6386.78
838.017	6513
838.401	6539.7
838.785	6513
839.169	6522.7
839.553	6454.74
839.937	6207.17
840.32	6229.01
840.704	6153.77
841.087	6241.15
841.471	5925.61
841.854	5947.45
842.238	5891.63
842.621	5945.03
843.004	5750.85
843.388	5852.79
843.771	5937.74
844.154	5840.66
844.537	5867.35
844.92	5945.03
845.303	5833.37
845.686	5760.56
846.069	5695.02
846.452	5622.21
846.834	5539.68
847.217	5316.38
847.6	5355.21
847.982	5127.05
848.365	4942.58
848.748	4891.61
849.13	4690.15
849.512	4731.41
849.895	4491.12
850.277	4299.37
850.659	4219.27
851.041	4260.53
851.423	4122.18
851.806	3920.72
852.188	3629.46
852.57	3602.76
852.951	3454.7
853.333	3306.64
853.715	3221.68
854.097	3046.92
854.479	2787.21
854.86	2770.22
855.242	2580.9
855.623	2430.41
856.005	2236.23
856.386	2255.65
856.768	2059.04
857.149	1913.41
857.53	1792.05
857.911	1813.89
858.292	1704.67
858.674	1483.79
859.055	1495.93
859.436	1262.91
859.817	1245.92
860.197	1170.68
860.578	1100.29
860.959	1022.62
861.34	1063.88
861.72	925.53
862.101	855.14
862.482	772.62
862.862	682.81
863.243	775.04
863.623	682.81
864.003	631.84
864.384	663.39
864.764	609.99
865.144	508.05
865.524	476.49
865.904	510.48
866.284	447.37
866.664	493.48
867.044	464.36
867.424	338.14
867.804	340.57
868.183	393.97
868.563	330.86
868.943	449.79
869.322	326.01
869.702	359.99
870.081	352.71
870.461	321.15
870.84	376.98
871.22	318.72
871.599	294.45
871.978	262.9
872.357	277.46
872.736	338.14
873.115	284.74
873.494	275.03
873.873	270.18
874.252	326.01
874.631	224.06
875.01	277.46
875.388	245.91
875.767	221.64
876.146	236.2
876.524	318.72
876.903	321.15
877.281	199.79
877.66	258.04
878.038	255.62
878.416	287.17
878.794	292.03
879.173	326.01
879.551	272.61
879.929	182.8
880.307	275.03
880.685	267.75
881.063	243.48
881.441	258.04
881.818	284.74
882.196	238.63
882.574	216.78
882.951	250.76
883.329	245.91
883.707	238.63
884.084	287.17
884.461	275.03
884.839	207.07
885.216	270.18
885.593	292.03
885.971	311.44
886.348	231.34
886.725	228.92
887.102	275.03
887.479	228.92
887.856	233.77
888.233	267.75
888.609	241.05
888.986	228.92
889.363	180.37
889.74	224.06
890.116	248.34
890.493	173.09
890.869	163.38
891.246	202.22
891.622	202.22
891.998	226.49
892.375	192.51
892.751	211.93
893.127	204.65
893.503	165.81
893.879	194.94
894.255	199.79
894.631	260.47
895.007	170.66
895.383	262.9
895.759	175.52
896.134	233.77
896.51	214.35
896.886	204.65
897.261	241.05
897.637	153.67
898.012	211.93
898.388	126.97
898.763	153.67
899.138	173.09
899.514	117.27
899.889	224.06
900.264	185.23
900.639	226.49
901.014	216.78
901.389	165.81
901.764	153.67
902.139	63.87
902.513	180.37
902.888	134.26
903.263	92.99
903.638	182.8
904.012	156.1
904.387	124.55
904.761	134.26
905.136	180.37
905.51	168.24
905.884	80.86
906.259	139.11
906.633	124.55
907.007	129.4
907.381	182.8
907.755	158.53
908.129	141.54
908.503	248.34
908.877	129.4
909.251	117.27
909.624	112.41
909.998	141.54
910.372	76
910.745	119.69
911.119	122.12
911.492	134.26
911.866	194.94
912.239	238.63
912.612	100.27
912.986	151.25
913.359	124.55
913.732	117.27
914.105	66.29
914.478	126.97
914.851	185.23
915.224	131.83
915.597	160.96
915.97	141.54
916.343	95.42
916.715	141.54
917.088	136.68
917.461	165.81
917.833	156.1
918.206	78.43
918.578	124.55
918.951	44.45
919.323	177.95
919.695	187.65
920.067	180.37
920.44	163.38
920.812	78.43
921.184	134.26
921.556	160.96
921.928	190.08
922.3	168.24
922.672	175.52
923.043	156.1
923.415	143.96
923.787	151.25
924.158	173.09
924.53	122.12
924.901	170.66
925.273	165.81
925.644	78.43
926.016	90.57
926.387	90.57
926.758	146.39
927.129	117.27
927.5	44.45
927.872	182.8
928.243	160.96
928.613	119.69
928.984	170.66
929.355	117.27
929.726	124.55
930.097	112.41
930.467	163.38
930.838	175.52
931.209	109.98
931.579	151.25
931.95	139.11
932.32	100.27
932.69	190.08
933.061	119.69
933.431	209.5
933.801	156.1
934.171	122.12
934.541	192.51
934.911	163.38
935.281	146.39
935.651	175.52
936.021	119.69
936.391	163.38
936.761	126.97
937.13	97.85
937.5	136.68
937.87	146.39
938.239	185.23
938.609	170.66
938.978	194.94
939.347	143.96
939.717	182.8
940.086	182.8
940.455	95.42
940.824	168.24
941.193	219.21
941.562	209.5
941.931	148.82
942.3	139.11
942.669	107.56
943.038	211.93
943.407	124.55
943.775	143.96
944.144	117.27
944.513	182.8
944.881	175.52
945.25	134.26
945.618	241.05
945.986	148.82
946.355	175.52
946.723	141.54
947.091	122.12
947.459	163.38
947.827	124.55
948.195	136.68
948.563	163.38
948.931	112.41
949.299	100.27
949.667	160.96
950.035	160.96
950.402	136.68
950.77	122.12
951.138	180.37
951.505	148.82
951.873	143.96
952.24	190.08
952.607	163.38
952.975	185.23
953.342	131.83
953.709	119.69
954.076	119.69
954.443	153.67
954.81	207.07
955.177	180.37
955.544	102.7
955.911	192.51
956.278	131.83
956.645	129.4
957.012	160.96
957.378	168.24
957.745	112.41
958.111	97.85
958.478	173.09
958.844	165.81
959.211	190.08
959.577	204.65
959.943	156.1
960.309	192.51
960.675	63.87
961.042	134.26
961.408	107.56
961.774	42.02
962.139	95.42
962.505	143.96
962.871	204.65
963.237	90.57
963.603	95.42
963.968	156.1
964.334	158.53
964.699	68.72
965.065	105.13
965.43	88.14
965.796	194.94
966.161	146.39
966.526	143.96
966.891	126.97
967.256	61.44
967.622	105.13
967.987	105.13
968.352	170.66
968.716	107.56
969.081	148.82
969.446	100.27
969.811	177.95
970.176	124.55
970.54	148.82
970.905	88.14
971.269	168.24
971.634	151.25
971.998	199.79
972.363	151.25
972.727	100.27
973.091	199.79
973.455	126.97
973.819	112.41
974.183	146.39
974.547	97.85
974.911	168.24
975.275	129.4
975.639	165.81
976.003	192.51
976.367	102.7
976.73	126.97
977.094	151.25
977.458	216.78
977.821	146.39
978.185	78.43
978.548	119.69
978.911	170.66
979.275	100.27
979.638	180.37
980.001	158.53
980.364	136.68
980.727	151.25
981.09	224.06
981.453	204.65
981.816	168.24
982.179	214.35
982.542	97.85
982.905	117.27
983.267	163.38
983.63	226.49
983.992	148.82
984.355	109.98
984.717	129.4
985.08	160.96
985.442	160.96
985.804	119.69
986.167	156.1
986.529	63.87
986.891	46.88
987.253	109.98
987.615	139.11
987.977	180.37
988.339	204.65
988.701	170.66
989.062	233.77
989.424	129.4
989.786	92.99
990.147	117.27
990.509	236.2
990.87	42.02
991.232	185.23
991.593	158.53
991.955	165.81
992.316	180.37
992.677	80.86
993.038	143.96
993.399	199.79
993.76	190.08
994.121	148.82
994.482	129.4
994.843	194.94
995.204	109.98
995.565	175.52
995.926	136.68
996.286	175.52
996.647	124.55
997.007	148.82
997.368	139.11
997.728	199.79
998.089	124.55
998.449	85.71
998.809	153.67
999.169	177.95
999.53	90.57
999.89	88.14
1000.25	83.28
1000.61	126.97
1000.97	143.96
1001.329	177.95
1001.689	233.77
1002.049	139.11
1002.409	163.38
1002.768	177.95
1003.128	158.53
1003.487	175.52
1003.847	185.23
1004.206	165.81
1004.566	119.69
1004.925	156.1
1005.284	170.66
1005.643	88.14
1006.003	141.54
1006.362	122.12
1006.721	134.26
1007.08	146.39
1007.438	119.69
1007.797	156.1
1008.156	136.68
1008.515	221.64
1008.874	122.12
1009.232	158.53
1009.591	163.38
1009.949	59.01
1010.308	170.66
1010.666	146.39
1011.024	163.38
1011.383	168.24
1011.741	109.98
1012.099	78.43
1012.457	129.4
1012.815	109.98
1013.173	139.11
1013.531	170.66
1013.889	83.28
1014.247	185.23
1014.605	114.84
1014.962	153.67
1015.32	129.4
1015.678	92.99
1016.035	131.83
1016.393	131.83
1016.75	190.08
1017.107	231.34
1017.465	182.8
1017.822	139.11
1018.179	126.97
1018.536	180.37
1018.894	141.54
1019.251	143.96
1019.608	173.09
1019.964	143.96
1020.321	168.24
1020.678	112.41
1021.035	168.24
1021.392	175.52
1021.748	124.55
1022.105	146.39
1022.461	114.84
1022.818	129.4
1023.174	126.97
1023.531	160.96
1023.887	107.56
1024.243	197.36
1024.599	68.72
1024.955	165.81
1025.311	185.23
1025.667	117.27
1026.023	173.09
1026.379	182.8
1026.735	112.41
1027.091	139.11
1027.447	32.31
