189.514	69.78
189.973	69.78
190.431	69.78
190.889	57.65
191.348	-22.45
191.806	-17.6
192.264	43.08
192.722	-29.73
193.18	-37.02
193.638	-15.17
194.096	-61.29
194.554	6.67
195.012	-56.43
195.47	-7.89
195.928	-85.56
196.385	-34.59
196.843	1.82
197.301	47.94
197.758	52.79
198.216	52.79
198.674	64.93
199.131	57.65
199.589	45.51
200.046	60.07
200.503	67.36
200.961	52.79
201.418	135.32
201.875	137.74
202.332	103.76
202.79	94.05
203.247	113.47
203.704	91.63
204.161	103.76
204.618	111.05
205.075	140.17
205.532	125.61
205.989	147.45
206.445	159.59
206.902	225.12
207.359	174.15
207.816	125.61
208.272	183.86
208.729	149.88
209.185	135.32
209.642	145.03
210.098	154.74
210.555	147.45
211.011	125.61
211.467	164.44
211.924	147.45
212.38	132.89
212.836	113.47
213.292	191.14
213.748	147.45
214.204	113.47
214.66	205.71
215.116	191.14
215.572	115.9
216.028	166.87
216.484	140.17
216.94	246.97
217.396	108.62
217.851	135.32
218.307	149.88
218.763	171.73
219.218	196
219.674	154.74
220.129	183.86
220.585	69.78
221.04	186.29
221.496	142.6
221.951	174.15
222.406	135.32
222.861	149.88
223.317	128.04
223.772	50.36
224.227	89.2
224.682	154.74
225.137	220.27
225.592	135.32
226.047	162.02
226.502	149.88
226.957	154.74
227.411	142.6
227.866	115.9
228.321	115.9
228.776	137.74
229.23	176.58
229.685	191.14
230.139	108.62
230.594	106.19
231.048	98.91
231.503	176.58
231.957	89.2
232.411	74.64
232.865	108.62
233.32	115.9
233.774	183.86
234.228	103.76
234.682	57.65
235.136	52.79
235.59	145.03
236.044	149.88
236.498	198.43
236.952	142.6
237.406	120.75
237.86	137.74
238.313	96.48
238.767	132.89
239.221	140.17
239.674	130.46
240.128	147.45
240.581	225.12
241.035	145.03
241.488	232.41
241.942	106.19
242.395	115.9
242.848	135.32
243.301	157.16
243.755	198.43
244.208	147.45
244.661	157.16
245.114	162.02
245.567	164.44
246.02	135.32
246.473	108.62
246.926	188.72
247.379	69.78
247.832	152.31
248.284	135.32
248.737	137.74
249.19	135.32
249.642	145.03
250.095	113.47
250.547	64.93
251	176.58
251.452	171.73
251.905	115.9
252.357	159.59
252.81	113.47
253.262	115.9
253.714	142.6
254.166	98.91
254.618	111.05
255.07	67.36
255.523	98.91
255.975	135.32
256.427	108.62
256.878	128.04
257.33	181.43
257.782	145.03
258.234	157.16
258.686	196
259.137	135.32
259.589	132.89
260.041	203.28
260.492	115.9
260.944	186.29
261.395	123.18
261.847	183.86
262.298	152.31
262.749	103.76
263.201	169.3
263.652	108.62
264.103	157.16
264.554	145.03
265.005	132.89
265.457	140.17
265.908	169.3
266.359	130.46
266.809	183.86
267.26	130.46
267.711	118.33
268.162	166.87
268.613	103.76
269.064	149.88
269.514	118.33
269.965	159.59
270.415	147.45
270.866	200.85
271.316	81.92
271.767	152.31
272.217	132.89
272.668	137.74
273.118	74.64
273.568	94.05
274.019	135.32
274.469	108.62
274.919	115.9
275.369	186.29
275.819	113.47
276.269	132.89
276.719	159.59
277.169	81.92
277.619	91.63
278.069	140.17
278.518	179.01
278.968	84.35
279.418	106.19
279.867	154.74
280.317	89.2
280.767	113.47
281.216	196
281.666	157.16
282.115	149.88
282.564	186.29
283.014	142.6
283.463	128.04
283.912	89.2
284.361	130.46
284.811	183.86
285.26	159.59
285.709	113.47
286.158	164.44
286.607	157.16
287.056	147.45
287.505	188.72
287.953	169.3
288.402	157.16
288.851	84.35
289.3	72.21
289.748	118.33
290.197	181.43
290.646	183.86
291.094	101.34
291.543	98.91
291.991	94.05
292.439	179.01
292.888	115.9
293.336	145.03
293.784	152.31
294.233	135.32
294.681	30.95
295.129	123.18
295.577	132.89
296.025	191.14
296.473	113.47
296.921	115.9
297.369	115.9
297.817	106.19
298.264	254.25
298.712	183.86
299.16	142.6
299.608	171.73
300.055	234.83
300.503	145.03
300.95	154.74
301.398	113.47
301.845	159.59
302.293	98.91
302.74	135.32
303.187	222.7
303.635	89.2
304.082	164.44
304.529	118.33
304.976	149.88
305.423	232.41
305.87	149.88
306.317	166.87
306.764	183.86
307.211	106.19
307.658	191.14
308.105	174.15
308.552	181.43
308.998	171.73
309.445	152.31
309.892	145.03
310.338	101.34
310.785	33.37
311.231	60.07
311.678	106.19
312.124	147.45
312.571	130.46
313.017	135.32
313.463	142.6
313.909	140.17
314.356	200.85
314.802	147.45
315.248	91.63
315.694	152.31
316.14	169.3
316.586	142.6
317.032	128.04
317.478	101.34
317.923	162.02
318.369	140.17
318.815	128.04
319.261	174.15
319.706	120.75
320.152	176.58
320.597	118.33
321.043	145.03
321.488	137.74
321.934	166.87
322.379	145.03
322.824	98.91
323.27	174.15
323.715	147.45
324.16	200.85
324.605	106.19
325.05	157.16
325.495	103.76
325.94	101.34
326.385	86.77
326.83	123.18
327.275	137.74
327.72	113.47
328.165	145.03
328.61	89.2
329.054	152.31
329.499	137.74
329.943	149.88
330.388	181.43
330.832	140.17
331.277	135.32
331.721	120.75
332.166	94.05
332.61	152.31
333.054	149.88
333.499	135.32
333.943	162.02
334.387	132.89
334.831	123.18
335.275	72.21
335.719	183.86
336.163	135.32
336.607	111.05
337.051	208.13
337.495	149.88
337.938	111.05
338.382	174.15
338.826	123.18
339.269	171.73
339.713	169.3
340.157	123.18
340.6	154.74
341.044	162.02
341.487	140.17
341.93	96.48
342.374	120.75
342.817	81.92
343.26	125.61
343.703	159.59
344.146	96.48
344.59	118.33
345.033	108.62
345.476	135.32
345.919	212.99
346.361	72.21
346.804	108.62
347.247	96.48
347.69	200.85
348.133	123.18
348.575	157.16
349.018	123.18
349.461	147.45
349.903	217.84
350.346	137.74
350.788	152.31
351.23	166.87
351.673	94.05
352.115	191.14
352.557	106.19
353	164.44
353.442	166.87
353.884	120.75
354.326	157.16
354.768	154.74
355.21	118.33
355.652	79.49
356.094	140.17
356.536	84.35
356.978	113.47
357.419	137.74
357.861	191.14
358.303	181.43
358.744	174.15
359.186	183.86
359.627	191.14
360.069	137.74
360.51	106.19
360.952	101.34
361.393	147.45
361.834	176.58
362.276	174.15
362.717	123.18
363.158	86.77
363.599	142.6
364.04	128.04
364.481	162.02
364.922	120.75
365.363	79.49
365.804	125.61
366.245	179.01
366.686	132.89
367.126	145.03
367.567	147.45
368.008	200.85
368.448	142.6
368.889	179.01
369.33	166.87
369.77	164.44
370.21	128.04
370.651	120.75
371.091	118.33
371.531	135.32
371.972	103.76
372.412	169.3
372.852	186.29
373.292	145.03
373.732	52.79
374.172	45.51
374.612	106.19
375.052	108.62
375.492	149.88
375.932	115.9
376.372	169.3
376.811	103.76
377.251	40.66
377.691	137.74
378.13	132.89
378.57	166.87
379.009	196
379.449	111.05
379.888	120.75
380.328	135.32
380.767	132.89
381.206	77.06
381.645	162.02
382.085	242.12
382.524	159.59
382.963	166.87
383.402	118.33
383.841	135.32
384.28	152.31
384.719	115.9
385.158	91.63
385.596	115.9
386.035	152.31
386.474	120.75
386.913	120.75
387.351	108.62
387.79	103.76
388.228	77.06
388.667	120.75
389.105	137.74
389.544	132.89
389.982	57.65
390.42	166.87
390.859	137.74
391.297	108.62
391.735	123.18
392.173	200.85
392.611	130.46
393.049	130.46
393.487	154.74
393.925	118.33
394.363	96.48
394.801	157.16
395.239	135.32
395.676	106.19
396.114	142.6
396.552	179.01
396.989	106.19
397.427	9.1
397.864	174.15
398.302	103.76
398.739	74.64
399.177	159.59
399.614	215.42
400.051	123.18
400.488	152.31
400.926	179.01
401.363	103.76
401.8	135.32
402.237	130.46
402.674	132.89
403.111	166.87
403.548	115.9
403.985	120.75
404.421	145.03
404.858	169.3
405.295	164.44
405.732	147.45
406.168	171.73
406.605	118.33
407.041	137.74
407.478	72.21
407.914	176.58
408.351	96.48
408.787	101.34
409.223	86.77
409.66	128.04
410.096	115.9
410.532	176.58
410.968	164.44
411.404	106.19
411.84	142.6
412.276	96.48
412.712	164.44
413.148	205.71
413.584	135.32
414.02	142.6
414.455	152.31
414.891	193.57
415.327	74.64
415.762	101.34
416.198	130.46
416.633	147.45
417.069	162.02
417.504	164.44
417.94	111.05
418.375	108.62
418.81	198.43
419.245	200.85
419.681	111.05
420.116	135.32
420.551	123.18
420.986	186.29
421.421	159.59
421.856	162.02
422.291	111.05
422.726	91.63
423.16	128.04
423.595	147.45
424.03	208.13
424.464	137.74
424.899	188.72
425.334	130.46
425.768	130.46
426.203	128.04
426.637	152.31
427.071	149.88
427.506	113.47
427.94	183.86
428.374	179.01
428.809	179.01
429.243	145.03
429.677	203.28
430.111	145.03
430.545	106.19
430.979	103.76
431.413	120.75
431.847	137.74
432.28	232.41
432.714	181.43
433.148	149.88
433.582	215.42
434.015	140.17
434.449	152.31
434.882	179.01
435.316	152.31
435.749	159.59
436.183	166.87
436.616	166.87
437.049	159.59
437.483	125.61
437.916	191.14
438.349	225.12
438.782	108.62
439.215	125.61
439.648	145.03
440.081	174.15
440.514	169.3
440.947	123.18
441.38	174.15
441.813	198.43
442.245	215.42
442.678	132.89
443.111	166.87
443.543	157.16
443.976	130.46
444.408	193.57
444.841	164.44
445.273	135.32
445.705	159.59
446.138	229.98
446.57	210.56
447.002	249.4
447.434	130.46
447.867	188.72
448.299	115.9
448.731	183.86
449.163	186.29
449.595	171.73
450.026	239.69
450.458	203.28
450.89	210.56
451.322	203.28
451.754	111.05
452.185	191.14
452.617	176.58
453.048	293.09
453.48	166.87
453.911	271.24
454.343	183.86
454.774	234.83
455.205	181.43
455.637	188.72
456.068	278.52
456.499	205.71
456.93	208.13
457.361	222.7
457.792	215.42
458.223	229.98
458.654	256.68
459.085	249.4
459.516	162.02
459.947	205.71
460.378	242.12
460.808	222.7
461.239	212.99
461.669	191.14
462.1	208.13
462.531	149.88
462.961	198.43
463.391	154.74
463.822	137.74
464.252	145.03
464.682	261.53
465.113	239.69
465.543	220.27
465.973	237.26
466.403	157.16
466.833	237.26
467.263	220.27
467.693	183.86
468.123	222.7
468.553	242.12
468.983	208.13
469.412	200.85
469.842	154.74
470.272	246.97
470.701	196
471.131	234.83
471.56	157.16
471.99	208.13
472.419	239.69
472.849	147.45
473.278	166.87
473.707	115.9
474.136	220.27
474.566	203.28
474.995	145.03
475.424	196
475.853	164.44
476.282	176.58
476.711	183.86
477.14	200.85
477.569	118.33
477.997	149.88
478.426	140.17
478.855	222.7
479.283	234.83
479.712	162.02
480.141	210.56
480.569	154.74
480.998	142.6
481.426	137.74
481.854	130.46
482.283	186.29
482.711	166.87
483.139	191.14
483.567	171.73
483.995	179.01
484.424	176.58
484.852	106.19
485.28	162.02
485.708	239.69
486.135	237.26
486.563	271.24
486.991	159.59
487.419	249.4
487.847	220.27
488.274	200.85
488.702	137.74
489.129	89.2
489.557	196
489.984	176.58
490.412	176.58
490.839	137.74
491.266	128.04
491.694	171.73
492.121	200.85
492.548	181.43
492.975	166.87
493.402	101.34
493.829	193.57
494.256	128.04
494.683	179.01
495.11	198.43
495.537	220.27
495.964	130.46
496.39	181.43
496.817	89.2
497.244	232.41
497.67	191.14
498.097	242.12
498.523	154.74
498.95	98.91
499.376	212.99
499.803	96.48
500.229	208.13
500.655	198.43
501.081	128.04
501.508	176.58
501.934	137.74
502.36	188.72
502.786	188.72
503.212	191.14
503.638	130.46
504.064	198.43
504.489	159.59
504.915	205.71
505.341	128.04
505.767	227.55
506.192	130.46
506.618	217.84
507.043	69.78
507.469	164.44
507.894	106.19
508.32	118.33
508.745	120.75
509.17	239.69
509.596	159.59
510.021	193.57
510.446	98.91
510.871	154.74
511.296	135.32
511.721	183.86
512.146	220.27
512.571	186.29
512.996	169.3
513.421	200.85
513.845	98.91
514.27	157.16
514.695	140.17
515.119	242.12
515.544	196
515.969	125.61
516.393	140.17
516.817	198.43
517.242	188.72
517.666	157.16
518.09	174.15
518.515	157.16
518.939	108.62
519.363	356.19
519.787	193.57
520.211	67.36
520.635	120.75
521.059	128.04
521.483	196
521.907	174.15
522.331	69.78
522.754	132.89
523.178	111.05
523.602	152.31
524.025	169.3
524.449	123.18
524.872	130.46
525.296	62.5
525.719	227.55
526.143	174.15
526.566	169.3
526.989	130.46
527.412	166.87
527.836	166.87
528.259	140.17
528.682	159.59
529.105	171.73
529.528	217.84
529.951	181.43
530.374	191.14
530.796	234.83
531.219	106.19
531.642	147.45
532.065	142.6
532.487	125.61
532.91	120.75
533.332	123.18
533.755	130.46
534.177	128.04
534.6	120.75
535.022	149.88
535.444	205.71
535.867	203.28
536.289	169.3
536.711	115.9
537.133	159.59
537.555	171.73
537.977	188.72
538.399	208.13
538.821	203.28
539.243	181.43
539.665	169.3
540.086	196
540.508	215.42
540.93	152.31
541.351	222.7
541.773	205.71
542.195	208.13
542.616	234.83
543.037	256.68
543.459	259.11
543.88	244.54
544.301	169.3
544.723	210.56
545.144	256.68
545.565	256.68
545.986	242.12
546.407	237.26
546.828	237.26
547.249	200.85
547.67	179.01
548.091	196
548.512	200.85
548.932	210.56
549.353	261.53
549.774	191.14
550.194	222.7
550.615	183.86
551.035	154.74
551.456	179.01
551.876	174.15
552.296	259.11
552.717	205.71
553.137	142.6
553.557	137.74
553.977	191.14
554.397	147.45
554.817	149.88
555.237	123.18
555.657	94.05
556.077	147.45
556.497	208.13
556.917	220.27
557.337	183.86
557.756	145.03
558.176	193.57
558.596	152.31
559.015	193.57
559.435	157.16
559.854	188.72
560.274	91.63
560.693	181.43
561.112	157.16
561.532	108.62
561.951	120.75
562.37	225.12
562.789	186.29
563.208	125.61
563.627	200.85
564.046	212.99
564.465	164.44
564.884	111.05
565.303	120.75
565.722	140.17
566.14	125.61
566.559	145.03
566.978	159.59
567.396	208.13
567.815	212.99
568.233	212.99
568.652	169.3
569.07	169.3
569.489	113.47
569.907	232.41
570.325	130.46
570.743	159.59
571.161	176.58
571.58	191.14
571.998	135.32
572.416	111.05
572.833	188.72
573.251	181.43
573.669	164.44
574.087	128.04
574.505	128.04
574.922	123.18
575.34	145.03
575.758	149.88
576.175	171.73
576.593	181.43
577.01	183.86
577.428	174.15
577.845	1407.18
578.262	300.37
578.68	203.28
579.097	176.58
579.514	159.59
579.931	145.03
580.348	128.04
580.765	159.59
581.182	135.32
581.599	232.41
582.016	171.73
582.433	159.59
582.849	210.56
583.266	188.72
583.683	157.16
584.099	132.89
584.516	132.89
584.933	123.18
585.349	171.73
585.765	174.15
586.182	157.16
586.598	212.99
587.014	203.28
587.431	164.44
587.847	179.01
588.263	200.85
588.679	193.57
589.095	101.34
589.511	176.58
589.927	174.15
590.343	125.61
590.759	179.01
591.174	186.29
591.59	220.27
592.006	179.01
592.421	174.15
592.837	164.44
593.252	205.71
593.668	101.34
594.083	196
594.499	159.59
594.914	147.45
595.329	137.74
595.745	176.58
596.16	171.73
596.575	98.91
596.99	94.05
597.405	84.35
597.82	166.87
598.235	166.87
598.65	157.16
599.065	159.59
599.479	154.74
599.894	137.74
600.309	193.57
600.724	191.14
601.138	203.28
601.553	142.6
601.967	220.27
602.382	115.9
602.796	191.14
603.21	205.71
603.625	176.58
604.039	159.59
604.453	203.28
604.867	123.18
605.281	196
605.695	98.91
606.109	123.18
606.523	217.84
606.937	149.88
607.351	280.95
607.765	72.21
608.178	181.43
608.592	111.05
609.006	142.6
609.419	217.84
609.833	135.32
610.246	162.02
610.66	217.84
611.073	208.13
611.487	159.59
611.9	259.11
612.313	181.43
612.726	169.3
613.139	203.28
613.553	210.56
613.966	220.27
614.379	203.28
614.792	193.57
615.204	193.57
615.617	208.13
616.03	152.31
616.443	193.57
616.856	193.57
617.268	145.03
617.681	179.01
618.093	176.58
618.506	171.73
618.918	164.44
619.331	77.06
619.743	166.87
620.155	176.58
620.568	154.74
620.98	176.58
621.392	166.87
621.804	244.54
622.216	162.02
622.628	215.42
623.04	98.91
623.452	164.44
623.864	174.15
624.276	169.3
624.687	159.59
625.099	208.13
625.511	137.74
625.922	181.43
626.334	142.6
626.745	96.48
627.157	140.17
627.568	140.17
627.979	183.86
628.391	179.01
628.802	132.89
629.213	169.3
629.624	246.97
630.035	205.71
630.446	200.85
630.857	164.44
631.268	84.35
631.679	128.04
632.09	79.49
632.501	106.19
632.912	135.32
633.322	147.45
633.733	174.15
634.144	120.75
634.554	171.73
634.965	200.85
635.375	193.57
635.785	179.01
636.196	169.3
636.606	162.02
637.016	169.3
637.427	130.46
637.837	171.73
638.247	108.62
638.657	152.31
639.067	137.74
639.477	205.71
639.887	145.03
640.297	186.29
640.706	145.03
641.116	166.87
641.526	152.31
641.935	142.6
642.345	186.29
642.755	142.6
643.164	193.57
643.573	154.74
643.983	140.17
644.392	157.16
644.801	169.3
645.211	215.42
645.62	101.34
646.029	166.87
646.438	152.31
646.847	176.58
647.256	125.61
647.665	64.93
648.074	210.56
648.483	152.31
648.892	145.03
649.3	169.3
649.709	108.62
650.118	142.6
650.526	179.01
650.935	191.14
651.343	174.15
651.752	186.29
652.16	154.74
652.568	154.74
652.977	123.18
653.385	215.42
653.793	113.47
654.201	212.99
654.609	106.19
655.017	171.73
655.425	191.14
655.833	142.6
656.241	164.44
656.649	140.17
657.057	152.31
657.464	188.72
657.872	186.29
658.28	142.6
658.687	145.03
659.095	152.31
659.502	174.15
659.91	142.6
660.317	188.72
660.724	169.3
661.132	137.74
661.539	147.45
661.946	181.43
662.353	111.05
662.76	115.9
663.167	145.03
663.574	171.73
663.981	132.89
664.388	84.35
664.795	164.44
665.202	191.14
665.608	162.02
666.015	179.01
666.422	210.56
666.828	79.49
667.235	162.02
667.641	157.16
668.047	57.65
668.454	98.91
668.86	137.74
669.266	128.04
669.673	164.44
670.079	174.15
670.485	145.03
670.891	166.87
671.297	186.29
671.703	106.19
672.109	157.16
672.515	162.02
672.92	128.04
673.326	142.6
673.732	169.3
674.138	145.03
674.543	157.16
674.949	174.15
675.354	67.36
675.76	186.29
676.165	125.61
676.57	181.43
676.976	171.73
677.381	115.9
677.786	188.72
678.191	135.32
678.596	96.48
679.001	91.63
679.406	162.02
679.811	159.59
680.216	147.45
680.621	183.86
681.026	79.49
681.43	145.03
681.835	123.18
682.24	166.87
682.644	181.43
683.049	137.74
683.453	164.44
683.858	113.47
684.262	142.6
684.667	217.84
685.071	145.03
685.475	125.61
685.879	108.62
686.283	227.55
686.687	205.71
687.091	222.7
687.495	130.46
687.899	217.84
688.303	113.47
688.707	166.87
689.111	120.75
689.514	98.91
689.918	176.58
690.322	115.9
690.725	108.62
691.129	152.31
691.532	164.44
691.936	60.07
692.339	142.6
692.742	113.47
693.146	188.72
693.549	181.43
693.952	205.71
694.355	103.76
694.758	132.89
695.161	106.19
695.564	145.03
695.967	152.31
696.37	147.45
696.773	162.02
697.175	128.04
697.578	125.61
697.981	159.59
698.383	147.45
698.786	147.45
699.188	169.3
699.591	183.86
699.993	115.9
700.395	152.31
700.798	149.88
701.2	174.15
701.602	227.55
702.004	135.32
702.406	147.45
702.808	135.32
703.21	198.43
703.612	215.42
704.014	101.34
704.416	145.03
704.818	166.87
705.219	174.15
705.621	212.99
706.023	254.25
706.424	179.01
706.826	152.31
707.227	181.43
707.629	89.2
708.03	188.72
708.431	174.15
708.832	164.44
709.234	137.74
709.635	220.27
710.036	181.43
710.437	254.25
710.838	128.04
711.239	166.87
711.64	193.57
712.041	293.09
712.441	227.55
712.842	242.12
713.243	237.26
713.643	215.42
714.044	183.86
714.445	135.32
714.845	193.57
715.246	212.99
715.646	154.74
716.046	205.71
716.447	196
716.847	152.31
717.247	222.7
717.647	229.98
718.047	196
718.447	229.98
718.847	205.71
719.247	135.32
719.647	297.94
720.047	278.52
720.446	232.41
720.846	118.33
721.246	186.29
721.645	166.87
722.045	220.27
722.444	278.52
722.844	268.81
723.243	266.39
723.643	278.52
724.042	280.95
724.441	305.22
724.84	266.39
725.24	210.56
725.639	324.64
726.038	329.5
726.437	280.95
726.836	227.55
727.234	446
727.633	324.64
728.032	324.64
728.431	339.2
728.83	334.35
729.228	334.35
729.627	431.44
730.025	513.96
730.424	426.58
730.822	528.53
731.22	543.09
731.619	479.98
732.017	545.52
732.415	625.62
732.813	691.15
733.212	848.92
733.61	921.74
734.008	938.73
734.406	807.66
734.803	822.22
735.201	936.3
735.599	1091.64
735.997	1273.68
736.395	1477.57
736.792	1591.65
737.19	1533.4
737.587	1414.46
737.985	1205.72
738.382	1322.23
738.78	1666.89
739.177	1953.31
739.574	2293.12
739.971	2373.22
740.369	2205.74
740.766	1919.33
741.163	1720.29
741.56	1846.51
741.957	2130.49
742.354	2574.68
742.751	2992.16
743.147	3300.42
743.544	3234.88
743.941	2696.04
744.338	2378.07
744.734	2407.2
745.131	2761.57
745.527	3771.3
745.924	4552.86
746.32	5169.38
746.716	5142.68
747.113	4399.95
747.509	3938.77
747.905	3652.36
748.301	4120.82
748.697	5368.41
749.093	6754.35
749.489	7285.91
749.885	7416.98
750.281	6710.66
750.677	5688.8
751.073	5108.7
751.468	5555.3
751.864	6693.67
752.26	8710.69
752.655	10065.08
753.051	10487.42
753.446	9696.15
753.842	8200.98
754.237	7103.87
754.632	6783.48
755.028	7611.16
755.423	9557.79
755.818	11363.65
756.213	12065.11
756.608	11159.76
757.003	9645.17
757.398	7798.06
757.793	7259.21
758.188	7674.27
758.583	9426.72
758.977	11710.74
759.372	13499.6
759.767	13982.62
760.161	12652.5
760.556	10538.39
760.95	9315.07
761.345	10006.83
761.739	12810.27
762.133	16487.51
762.527	20465.73
762.922	21890.51
763.316	20805.54
763.71	17897.73
764.104	15191.38
764.498	13616.11
764.892	15167.1
765.286	19062.8
765.68	24291.03
766.073	28247.41
766.467	28252.26
766.861	25825.04
767.255	22106.53
767.648	19023.96
768.042	18424.44
768.435	21218.17
768.829	26572.62
769.222	32922.24
769.615	35742.67
770.008	33429.52
770.402	29800.83
770.795	24633.27
771.188	21322.54
771.581	20740.01
771.974	23791.03
772.367	28087.21
772.76	31606.68
773.153	33393.12
773.545	31116.38
773.938	26283.78
774.331	21574.97
774.724	19749.7
775.116	21672.06
775.509	27004.67
775.901	34563.04
776.294	39497.58
776.686	40368.95
777.078	36907.73
777.471	32747.48
777.863	27956.14
778.255	25822.61
778.647	28269.25
779.039	35145.57
779.431	41917.52
779.823	46184.58
780.215	47427.32
780.607	42405.39
780.999	36398.02
781.39	30485.3
781.782	28244.98
782.174	31793.58
782.565	38871.36
782.957	45604.47
783.348	50014.73
783.74	50017.16
784.131	45080.19
784.522	38701.45
784.914	31572.7
785.305	29011.98
785.696	30762.01
786.087	35815.48
786.478	41548.58
786.869	44453.97
787.26	42568.02
787.651	37798.52
788.042	31504.74
788.433	25363.87
788.823	22730.33
789.214	22453.63
789.605	25659.99
789.995	29254.7
790.386	31269.3
790.776	30919.78
791.167	28164.88
791.557	24278.9
791.948	20414.76
792.338	19266.68
792.728	21550.7
793.118	26948.84
793.508	32987.77
793.898	37271.82
794.288	37910.18
794.678	33953.8
795.068	29045.96
795.458	23463.35
795.848	20788.55
796.238	22172.07
796.627	25310.47
797.017	30497.44
797.406	34944.11
797.796	36589.77
798.185	35215.96
798.575	31424.64
798.964	25036.19
799.354	21980.32
799.743	22130.81
800.132	26298.35
800.521	31866.39
800.91	36715.98
801.299	39747.58
801.688	39609.23
802.077	34266.92
802.466	28502.26
802.855	23589.57
803.244	20633.21
803.633	21854.1
804.021	25905.14
804.41	30422.2
804.799	33441.66
805.187	32208.63
805.576	29747.43
805.964	25176.97
806.352	19895.33
806.741	17142.86
807.129	16404.99
807.517	18960.85
807.905	23492.48
808.293	27708.56
808.681	29798.4
809.069	29092.08
809.457	26254.66
809.845	21562.84
810.233	17346.75
810.621	16938.98
811.009	19426.88
811.396	23854.13
811.784	29009.55
812.171	32861.55
812.559	33514.48
812.946	29225.58
813.334	23776.46
813.721	19286.1
814.108	16315.18
814.496	16497.22
814.883	19975.43
815.27	25315.32
815.657	29859.08
816.044	32096.98
816.431	30414.91
816.818	27269.23
817.205	22223.04
817.592	18016.66
817.979	15599.15
818.365	16494.8
818.752	19157.46
819.139	23422.09
819.525	26429.42
819.912	27206.13
820.298	24453.66
820.685	20470.59
821.071	16397.71
821.457	12827.26
821.843	11438.89
822.23	12659.78
822.616	14431.66
823.002	16470.52
823.388	18077.34
823.774	17351.6
824.16	15383.13
824.546	12783.57
824.931	9788.38
825.317	8210.69
825.703	8094.18
826.089	9222.84
826.474	11596.66
826.86	13781.16
827.245	14883.12
827.631	14608.84
828.016	12764.15
828.401	10261.69
828.787	8353.89
829.172	6693.67
829.557	6802.9
829.942	7868.45
830.327	9652.46
830.712	11220.44
831.097	11822.39
831.482	11776.28
831.867	10179.16
832.252	7902.43
832.636	6346.58
833.021	5358.7
833.406	5404.82
833.79	6315.03
834.175	8152.43
834.559	9861.2
834.944	10351.5
835.328	9912.17
835.713	8717.98
836.097	6810.18
836.481	5227.63
836.865	4230.04
837.249	4193.63
837.633	4766.46
838.017	5861.13
838.401	6613.57
838.785	6781.05
839.169	6737.36
839.553	5858.71
839.937	4598.98
840.32	3467.89
840.704	2608.66
841.087	2511.57
841.471	2790.7
841.854	3307.7
842.238	3916.93
842.621	4329.56
843.004	4210.62
843.388	3899.94
843.771	3293.13
844.154	2518.85
844.537	1999.42
844.92	1989.72
845.303	2191.17
845.686	2666.91
846.069	3213.04
846.452	3829.55
846.834	3766.44
847.217	3467.89
847.6	2890.21
847.982	2363.51
848.365	1861.07
848.748	1800.39
849.13	1720.29
849.512	2196.03
849.895	2564.97
850.277	3060.12
850.659	3094.1
851.041	3091.67
851.423	2793.13
851.806	2137.78
852.188	1635.34
852.57	1441.16
852.951	1443.59
853.333	1691.17
853.715	2043.11
854.097	2497
854.479	2564.97
854.86	2598.95
855.242	2288.26
855.623	1824.66
856.005	1506.7
856.386	1149.9
856.768	1033.39
857.149	1047.95
857.53	1251.84
857.911	1443.59
858.292	1713.01
858.674	1727.58
859.055	1545.53
859.436	1351.36
859.817	1084.36
860.197	817.37
860.578	642.61
860.959	683.87
861.34	773.68
861.72	963
862.101	1113.49
862.482	1157.18
862.862	1176.6
863.243	1057.66
863.623	963
864.003	780.96
864.384	567.36
864.764	475.13
865.144	460.57
865.524	662.02
865.904	671.73
866.284	800.38
866.664	899.89
867.044	824.65
867.424	751.83
867.804	652.32
868.183	538.24
868.563	472.7
868.943	429.01
869.322	462.99
869.702	443.57
870.081	453.28
870.461	579.5
870.84	560.08
871.22	637.75
871.599	506.68
871.978	453.28
872.357	375.61
872.736	370.76
873.115	268.81
873.494	300.37
873.873	346.49
874.252	361.05
874.631	375.61
875.01	419.3
875.388	339.2
875.767	280.95
876.146	305.22
876.524	344.06
876.903	227.55
877.281	317.36
877.66	234.83
878.038	249.4
878.416	244.54
878.794	254.25
879.173	339.2
879.551	254.25
879.929	222.7
880.307	232.41
880.685	159.59
881.063	205.71
881.441	208.13
881.818	196
882.196	234.83
882.574	176.58
882.951	115.9
883.329	113.47
883.707	232.41
884.084	200.85
884.461	186.29
884.839	142.6
885.216	220.27
885.593	149.88
885.971	220.27
886.348	215.42
886.725	198.43
887.102	115.9
887.479	227.55
887.856	181.43
888.233	196
888.609	191.14
888.986	179.01
889.363	208.13
889.74	176.58
890.116	208.13
890.493	215.42
890.869	162.02
891.246	103.76
891.622	132.89
891.998	186.29
892.375	164.44
892.751	171.73
893.127	164.44
893.503	108.62
893.879	125.61
894.255	79.49
894.631	181.43
895.007	181.43
895.383	145.03
895.759	169.3
896.134	174.15
896.51	198.43
896.886	208.13
897.261	113.47
897.637	186.29
898.012	111.05
898.388	159.59
898.763	91.63
899.138	84.35
899.514	135.32
899.889	176.58
900.264	179.01
900.639	200.85
901.014	166.87
901.389	186.29
901.764	145.03
902.139	176.58
902.513	147.45
902.888	159.59
903.263	181.43
903.638	157.16
904.012	132.89
904.387	162.02
904.761	40.66
905.136	162.02
905.51	203.28
905.884	159.59
906.259	91.63
906.633	103.76
907.007	145.03
907.381	125.61
907.755	81.92
908.129	171.73
908.503	152.31
908.877	159.59
909.251	154.74
909.624	123.18
909.998	130.46
910.372	106.19
910.745	67.36
911.119	169.3
911.492	142.6
911.866	125.61
912.239	113.47
912.612	125.61
912.986	128.04
913.359	137.74
913.732	145.03
914.105	62.5
914.478	196
914.851	147.45
915.224	154.74
915.597	98.91
915.97	140.17
916.343	62.5
916.715	169.3
917.088	113.47
917.461	77.06
917.833	140.17
918.206	145.03
918.578	96.48
918.951	96.48
919.323	145.03
919.695	111.05
920.067	89.2
920.44	140.17
920.812	45.51
921.184	176.58
921.556	193.57
921.928	137.74
922.3	91.63
922.672	137.74
923.043	113.47
923.415	101.34
923.787	113.47
924.158	215.42
924.53	98.91
924.901	108.62
925.273	130.46
925.644	166.87
926.016	135.32
926.387	125.61
926.758	113.47
927.129	103.76
927.5	166.87
927.872	106.19
928.243	106.19
928.613	123.18
928.984	101.34
929.355	113.47
929.726	152.31
930.097	128.04
930.467	147.45
930.838	152.31
931.209	84.35
931.579	94.05
931.95	115.9
932.32	69.78
932.69	205.71
933.061	79.49
933.431	115.9
933.801	159.59
934.171	152.31
934.541	113.47
934.911	120.75
935.281	128.04
935.651	103.76
936.021	142.6
936.391	101.34
936.761	142.6
937.13	94.05
937.5	115.9
937.87	164.44
938.239	157.16
938.609	154.74
938.978	176.58
939.347	162.02
939.717	149.88
940.086	174.15
940.455	137.74
940.824	164.44
941.193	137.74
941.562	132.89
941.931	128.04
942.3	159.59
942.669	142.6
943.038	157.16
943.407	98.91
943.775	169.3
944.144	210.56
944.513	123.18
944.881	145.03
945.25	159.59
945.618	152.31
945.986	111.05
946.355	137.74
946.723	174.15
947.091	166.87
947.459	98.91
947.827	142.6
948.195	113.47
948.563	132.89
948.931	179.01
949.299	130.46
949.667	125.61
950.035	215.42
950.402	152.31
950.77	154.74
951.138	159.59
951.505	115.9
951.873	77.06
952.24	220.27
952.607	125.61
952.975	120.75
953.342	169.3
953.709	120.75
954.076	113.47
954.443	174.15
954.81	140.17
955.177	135.32
955.544	98.91
955.911	169.3
956.278	193.57
956.645	157.16
957.012	132.89
957.378	125.61
957.745	103.76
958.111	171.73
958.478	113.47
958.844	183.86
959.211	145.03
959.577	111.05
959.943	115.9
960.309	118.33
960.675	103.76
961.042	118.33
961.408	132.89
961.774	94.05
962.139	154.74
962.505	149.88
962.871	149.88
963.237	111.05
963.603	222.7
963.968	113.47
964.334	152.31
964.699	169.3
965.065	140.17
965.43	140.17
965.796	176.58
966.161	162.02
966.526	130.46
966.891	166.87
967.256	142.6
967.622	200.85
967.987	91.63
968.352	183.86
968.716	152.31
969.081	128.04
969.446	96.48
969.811	162.02
970.176	89.2
970.54	164.44
970.905	162.02
971.269	179.01
971.634	166.87
971.998	67.36
972.363	91.63
972.727	115.9
973.091	64.93
973.455	159.59
973.819	183.86
974.183	130.46
974.547	120.75
974.911	179.01
975.275	101.34
975.639	69.78
976.003	125.61
976.367	142.6
976.73	40.66
977.094	120.75
977.458	101.34
977.821	215.42
978.185	159.59
978.548	149.88
978.911	120.75
979.275	145.03
979.638	193.57
980.001	123.18
980.364	152.31
980.727	94.05
981.09	171.73
981.453	174.15
981.816	152.31
982.179	193.57
982.542	145.03
982.905	64.93
983.267	130.46
983.63	176.58
983.992	149.88
984.355	212.99
984.717	77.06
985.08	149.88
985.442	120.75
985.804	77.06
986.167	154.74
986.529	115.9
986.891	164.44
987.253	171.73
987.615	120.75
987.977	72.21
988.339	81.92
988.701	118.33
989.062	142.6
989.424	115.9
989.786	152.31
990.147	179.01
990.509	164.44
990.87	64.93
991.232	232.41
991.593	91.63
991.955	159.59
992.316	196
992.677	191.14
993.038	128.04
993.399	64.93
993.76	96.48
994.121	145.03
994.482	159.59
994.843	120.75
995.204	149.88
995.565	191.14
995.926	169.3
996.286	171.73
996.647	94.05
997.007	120.75
997.368	135.32
997.728	111.05
998.089	120.75
998.449	149.88
998.809	118.33
999.169	120.75
999.53	115.9
999.89	128.04
1000.25	196
1000.61	135.32
1000.97	118.33
1001.329	142.6
1001.689	128.04
1002.049	132.89
1002.409	203.28
1002.768	140.17
1003.128	142.6
1003.487	69.78
1003.847	115.9
1004.206	208.13
1004.566	135.32
1004.925	222.7
1005.284	62.5
1005.643	89.2
1006.003	145.03
1006.362	111.05
1006.721	128.04
1007.08	98.91
1007.438	169.3
1007.797	186.29
1008.156	186.29
1008.515	128.04
1008.874	164.44
1009.232	132.89
1009.591	130.46
1009.949	169.3
1010.308	164.44
1010.666	86.77
1011.024	79.49
1011.383	84.35
1011.741	179.01
1012.099	106.19
1012.457	94.05
1012.815	159.59
1013.173	166.87
1013.531	164.44
1013.889	174.15
1014.247	113.47
1014.605	203.28
1014.962	142.6
1015.32	113.47
1015.678	125.61
1016.035	101.34
1016.393	30.95
1016.75	79.49
1017.107	159.59
1017.465	157.16
1017.822	171.73
1018.179	96.48
1018.536	137.74
1018.894	67.36
1019.251	135.32
1019.608	174.15
1019.964	115.9
1020.321	176.58
1020.678	164.44
1021.035	142.6
1021.392	125.61
1021.748	120.75
1022.105	115.9
1022.461	135.32
1022.818	183.86
1023.174	149.88
1023.531	101.34
1023.887	84.35
1024.243	174.15
1024.599	186.29
1024.955	135.32
1025.311	193.57
1025.667	81.92
1026.023	106.19
1026.379	106.19
1026.735	154.74
1027.091	72.21
1027.447	154.74
