189.514	72.36
189.973	72.36
190.431	72.36
190.889	38.38
191.348	9.25
191.806	1.97
192.264	-87.84
192.722	-27.15
193.18	38.38
193.638	43.23
194.096	-24.73
194.554	-39.29
195.012	-17.45
195.47	-32.01
195.928	-10.16
196.385	28.67
196.843	-15.02
197.301	-36.86
197.758	48.09
198.216	16.54
198.674	82.07
199.131	33.53
199.589	40.81
200.046	72.36
200.503	101.49
200.961	116.05
201.418	52.94
201.875	140.32
202.332	91.78
202.79	135.47
203.247	164.6
203.704	118.48
204.161	133.04
204.618	125.76
205.075	150.03
205.532	130.61
205.989	120.91
206.445	128.19
206.902	150.03
207.359	159.74
207.816	184.01
208.272	201
208.729	128.19
209.185	191.3
209.642	164.6
210.098	176.73
210.555	215.57
211.011	193.72
211.467	128.19
211.924	147.61
212.38	174.3
212.836	140.32
213.292	205.86
213.748	179.16
214.204	201
214.66	239.84
215.116	159.74
215.572	215.57
216.028	133.04
216.484	186.44
216.94	188.87
217.396	103.92
217.851	96.63
218.307	111.2
218.763	128.19
219.218	135.47
219.674	123.33
220.129	176.73
220.585	169.45
221.04	174.3
221.496	106.34
221.951	201
222.406	239.84
222.861	150.03
223.317	147.61
223.772	193.72
224.227	162.17
224.682	174.3
225.137	157.31
225.592	157.31
226.047	201
226.502	159.74
226.957	179.16
227.411	181.59
227.866	184.01
228.321	152.46
228.776	154.89
229.23	147.61
229.685	205.86
230.139	227.7
230.594	135.47
231.048	205.86
231.503	140.32
231.957	188.87
232.411	154.89
232.865	220.42
233.32	152.46
233.774	208.29
234.228	159.74
234.682	191.3
235.136	101.49
235.59	96.63
236.044	188.87
236.498	203.43
236.952	111.2
237.406	222.85
237.86	227.7
238.313	150.03
238.767	242.27
239.221	174.3
239.674	186.44
240.128	251.98
240.581	186.44
241.035	171.88
241.488	167.02
241.942	147.61
242.395	205.86
242.848	137.9
243.301	111.2
243.755	208.29
244.208	203.43
244.661	174.3
245.114	130.61
245.567	162.17
246.02	247.12
246.473	176.73
246.926	188.87
247.379	154.89
247.832	69.93
248.284	147.61
248.737	140.32
249.19	99.06
249.642	123.33
250.095	108.77
250.547	130.61
251	140.32
251.452	208.29
251.905	99.06
252.357	162.17
252.81	184.01
253.262	167.02
253.714	116.05
254.166	152.46
254.618	133.04
255.07	106.34
255.523	142.75
255.975	196.15
256.427	142.75
256.878	213.14
257.33	94.21
257.782	116.05
258.234	213.14
258.686	186.44
259.137	150.03
259.589	130.61
260.041	154.89
260.492	128.19
260.944	137.9
261.395	147.61
261.847	201
262.298	150.03
262.749	188.87
263.201	154.89
263.652	120.91
264.103	174.3
264.554	111.2
265.005	203.43
265.457	171.88
265.908	179.16
266.359	140.32
266.809	128.19
267.26	154.89
267.711	222.85
268.162	137.9
268.613	162.17
269.064	237.41
269.514	137.9
269.965	150.03
270.415	142.75
270.866	135.47
271.316	113.62
271.767	203.43
272.217	203.43
272.668	184.01
273.118	201
273.568	176.73
274.019	130.61
274.469	174.3
274.919	167.02
275.369	186.44
275.819	227.7
276.269	186.44
276.719	215.57
277.169	225.28
277.619	150.03
278.069	159.74
278.518	125.76
278.968	140.32
279.418	150.03
279.867	150.03
280.317	164.6
280.767	198.58
281.216	210.71
281.666	176.73
282.115	162.17
282.564	140.32
283.014	147.61
283.463	179.16
283.912	164.6
284.361	164.6
284.811	205.86
285.26	184.01
285.709	106.34
286.158	186.44
286.607	120.91
287.056	162.17
287.505	154.89
287.953	142.75
288.402	181.59
288.851	133.04
289.3	150.03
289.748	222.85
290.197	130.61
290.646	220.42
291.094	111.2
291.543	159.74
291.991	145.18
292.439	179.16
292.888	164.6
293.336	162.17
293.784	137.9
294.233	79.64
294.681	167.02
295.129	84.5
295.577	239.84
296.025	147.61
296.473	137.9
296.921	118.48
297.369	130.61
297.817	142.75
298.264	162.17
298.712	184.01
299.16	77.22
299.608	176.73
300.055	157.31
300.503	186.44
300.95	225.28
301.398	230.13
301.845	154.89
302.293	152.46
302.74	74.79
303.187	213.14
303.635	220.42
304.082	101.49
304.529	130.61
304.976	108.77
305.423	150.03
305.87	162.17
306.317	135.47
306.764	188.87
307.211	213.14
307.658	193.72
308.105	217.99
308.552	157.31
308.998	103.92
309.445	137.9
309.892	179.16
310.338	140.32
310.785	167.02
311.231	133.04
311.678	198.58
312.124	203.43
312.571	111.2
313.017	145.18
313.463	164.6
313.909	157.31
314.356	77.22
314.802	137.9
315.248	225.28
315.694	164.6
316.14	169.45
316.586	116.05
317.032	198.58
317.478	198.58
317.923	167.02
318.369	135.47
318.815	220.42
319.261	152.46
319.706	188.87
320.152	222.85
320.597	176.73
321.043	159.74
321.488	176.73
321.934	125.76
322.379	154.89
322.824	154.89
323.27	232.56
323.715	179.16
324.16	118.48
324.605	210.71
325.05	191.3
325.495	261.68
325.94	135.47
326.385	215.57
326.83	152.46
327.275	213.14
327.72	140.32
328.165	184.01
328.61	150.03
329.054	188.87
329.499	179.16
329.943	123.33
330.388	169.45
330.832	125.76
331.277	133.04
331.721	244.69
332.166	164.6
332.61	137.9
333.054	184.01
333.499	167.02
333.943	106.34
334.387	86.92
334.831	186.44
335.275	108.77
335.719	125.76
336.163	186.44
336.607	174.3
337.051	145.18
337.495	179.16
337.938	82.07
338.382	193.72
338.826	184.01
339.269	193.72
339.713	152.46
340.157	150.03
340.6	259.26
341.044	167.02
341.487	142.75
341.93	135.47
342.374	113.62
342.817	111.2
343.26	111.2
343.703	120.91
344.146	191.3
344.59	159.74
345.033	111.2
345.476	103.92
345.919	106.34
346.361	191.3
346.804	188.87
347.247	106.34
347.69	186.44
348.133	116.05
348.575	142.75
349.018	137.9
349.461	130.61
349.903	169.45
350.346	130.61
350.788	106.34
351.23	108.77
351.673	108.77
352.115	174.3
352.557	227.7
353	123.33
353.442	113.62
353.884	171.88
354.326	222.85
354.768	184.01
355.21	174.3
355.652	164.6
356.094	176.73
356.536	123.33
356.978	152.46
357.419	196.15
357.861	157.31
358.303	169.45
358.744	171.88
359.186	152.46
359.627	201
360.069	167.02
360.51	116.05
360.952	278.68
361.393	130.61
361.834	193.72
362.276	213.14
362.717	179.16
363.158	179.16
363.599	196.15
364.04	191.3
364.481	89.35
364.922	137.9
365.363	135.47
365.804	232.56
366.245	186.44
366.686	159.74
367.126	135.47
367.567	169.45
368.008	215.57
368.448	159.74
368.889	152.46
369.33	213.14
369.77	164.6
370.21	91.78
370.651	145.18
371.091	169.45
371.531	108.77
371.972	118.48
372.412	140.32
372.852	239.84
373.292	159.74
373.732	169.45
374.172	181.59
374.612	205.86
375.052	162.17
375.492	154.89
375.932	186.44
376.372	116.05
376.811	120.91
377.251	176.73
377.691	150.03
378.13	142.75
378.57	186.44
379.009	171.88
379.449	159.74
379.888	99.06
380.328	84.5
380.767	159.74
381.206	232.56
381.645	169.45
382.085	186.44
382.524	101.49
382.963	128.19
383.402	179.16
383.841	130.61
384.28	198.58
384.719	162.17
385.158	198.58
385.596	201
386.035	205.86
386.474	123.33
386.913	150.03
387.351	201
387.79	181.59
388.228	167.02
388.667	191.3
389.105	203.43
389.544	135.47
389.982	171.88
390.42	196.15
390.859	150.03
391.297	147.61
391.735	137.9
392.173	130.61
392.611	159.74
393.049	171.88
393.487	201
393.925	157.31
394.363	184.01
394.801	184.01
395.239	108.77
395.676	179.16
396.114	123.33
396.552	174.3
396.989	72.36
397.427	130.61
397.864	69.93
398.302	152.46
398.739	191.3
399.177	123.33
399.614	130.61
400.051	181.59
400.488	147.61
400.926	201
401.363	147.61
401.8	162.17
402.237	225.28
402.674	123.33
403.111	232.56
403.548	174.3
403.985	128.19
404.421	135.47
404.858	167.02
405.295	137.9
405.732	179.16
406.168	96.63
406.605	91.78
407.041	82.07
407.478	101.49
407.914	237.41
408.351	188.87
408.787	157.31
409.223	133.04
409.66	196.15
410.096	213.14
410.532	198.58
410.968	140.32
411.404	188.87
411.84	101.49
412.276	128.19
412.712	171.88
413.148	157.31
413.584	130.61
414.02	116.05
414.455	184.01
414.891	140.32
415.327	176.73
415.762	137.9
416.198	133.04
416.633	135.47
417.069	215.57
417.504	94.21
417.94	159.74
418.375	205.86
418.81	111.2
419.245	103.92
419.681	137.9
420.116	174.3
420.551	188.87
420.986	213.14
421.421	157.31
421.856	227.7
422.291	140.32
422.726	94.21
423.16	111.2
423.595	123.33
424.03	174.3
424.464	167.02
424.899	152.46
425.334	174.3
425.768	191.3
426.203	205.86
426.637	188.87
427.071	196.15
427.506	128.19
427.94	128.19
428.374	230.13
428.809	120.91
429.243	169.45
429.677	142.75
430.111	118.48
430.545	171.88
430.979	171.88
431.413	135.47
431.847	120.91
432.28	205.86
432.714	198.58
433.148	140.32
433.582	169.45
434.015	176.73
434.449	135.47
434.882	150.03
435.316	181.59
435.749	164.6
436.183	162.17
436.616	205.86
437.049	227.7
437.483	101.49
437.916	159.74
438.349	201
438.782	164.6
439.215	120.91
439.648	120.91
440.081	181.59
440.514	184.01
440.947	159.74
441.38	210.71
441.813	220.42
442.245	227.7
442.678	154.89
443.111	266.54
443.543	169.45
443.976	130.61
444.408	125.76
444.841	111.2
445.273	179.16
445.705	203.43
446.138	157.31
446.57	118.48
447.002	154.89
447.434	167.02
447.867	191.3
448.299	196.15
448.731	222.85
449.163	130.61
449.595	213.14
450.026	174.3
450.458	169.45
450.89	237.41
451.322	162.17
451.754	196.15
452.185	188.87
452.617	239.84
453.048	213.14
453.48	159.74
453.911	213.14
454.343	201
454.774	203.43
455.205	193.72
455.637	157.31
456.068	205.86
456.499	220.42
456.93	174.3
457.361	164.6
457.792	208.29
458.223	251.98
458.654	203.43
459.085	86.92
459.516	234.99
459.947	196.15
460.378	217.99
460.808	181.59
461.239	191.3
461.669	191.3
462.1	244.69
462.531	222.85
462.961	186.44
463.391	198.58
463.822	215.57
464.252	169.45
464.682	188.87
465.113	201
465.543	242.27
465.973	239.84
466.403	130.61
466.833	273.82
467.263	145.18
467.693	184.01
468.123	201
468.553	251.98
468.983	225.28
469.412	230.13
469.842	196.15
470.272	198.58
470.701	198.58
471.131	162.17
471.56	196.15
471.99	159.74
472.419	169.45
472.849	196.15
473.278	215.57
473.707	123.33
474.136	186.44
474.566	162.17
474.995	171.88
475.424	205.86
475.853	256.83
476.282	193.72
476.711	164.6
477.14	198.58
477.569	162.17
477.997	159.74
478.426	201
478.855	174.3
479.283	232.56
479.712	171.88
480.141	198.58
480.569	191.3
480.998	217.99
481.426	91.78
481.854	205.86
482.283	186.44
482.711	164.6
483.139	196.15
483.567	208.29
483.995	181.59
484.424	154.89
484.852	128.19
485.28	179.16
485.708	171.88
486.135	191.3
486.563	203.43
486.991	181.59
487.419	213.14
487.847	186.44
488.274	142.75
488.702	203.43
489.129	167.02
489.557	116.05
489.984	247.12
490.412	251.98
490.839	193.72
491.266	176.73
491.694	179.16
492.121	181.59
492.548	203.43
492.975	198.58
493.402	201
493.829	140.32
494.256	213.14
494.683	62.65
495.11	142.75
495.537	154.89
495.964	162.17
496.39	152.46
496.817	169.45
497.244	135.47
497.67	150.03
498.097	176.73
498.523	152.46
498.95	167.02
499.376	123.33
499.803	184.01
500.229	162.17
500.655	210.71
501.081	217.99
501.508	201
501.934	176.73
502.36	208.29
502.786	169.45
503.212	210.71
503.638	157.31
504.064	159.74
504.489	186.44
504.915	174.3
505.341	198.58
505.767	179.16
506.192	188.87
506.618	181.59
507.043	193.72
507.469	142.75
507.894	137.9
508.32	147.61
508.745	213.14
509.17	174.3
509.596	135.47
510.021	91.78
510.446	167.02
510.871	203.43
511.296	186.44
511.721	123.33
512.146	184.01
512.571	167.02
512.996	147.61
513.421	181.59
513.845	157.31
514.27	186.44
514.695	133.04
515.119	169.45
515.544	118.48
515.969	198.58
516.393	198.58
516.817	220.42
517.242	176.73
517.666	186.44
518.09	215.57
518.515	154.89
518.939	150.03
519.363	353.92
519.787	191.3
520.211	150.03
520.635	162.17
521.059	174.3
521.483	264.11
521.907	89.35
522.331	176.73
522.754	244.69
523.178	135.47
523.602	208.29
524.025	201
524.449	217.99
524.872	152.46
525.296	162.17
525.719	169.45
526.143	201
526.566	213.14
526.989	125.76
527.412	179.16
527.836	208.29
528.259	162.17
528.682	152.46
529.105	159.74
529.528	191.3
529.951	205.86
530.374	176.73
530.796	106.34
531.219	237.41
531.642	181.59
532.065	176.73
532.487	157.31
532.91	106.34
533.332	203.43
533.755	201
534.177	193.72
534.6	123.33
535.022	137.9
535.444	135.47
535.867	201
536.289	196.15
536.711	164.6
537.133	162.17
537.555	147.61
537.977	171.88
538.399	188.87
538.821	137.9
539.243	220.42
539.665	227.7
540.086	128.19
540.508	237.41
540.93	196.15
541.351	198.58
541.773	179.16
542.195	201
542.616	222.85
543.037	244.69
543.459	259.26
543.88	203.43
544.301	164.6
544.723	208.29
545.144	181.59
545.565	208.29
545.986	208.29
546.407	315.08
546.828	169.45
547.249	179.16
547.67	191.3
548.091	222.85
548.512	176.73
548.932	142.75
549.353	179.16
549.774	135.47
550.194	171.88
550.615	193.72
551.035	133.04
551.456	193.72
551.876	174.3
552.296	176.73
552.717	205.86
553.137	113.62
553.557	157.31
553.977	176.73
554.397	264.11
554.817	159.74
555.237	201
555.657	239.84
556.077	278.68
556.497	198.58
556.917	227.7
557.337	193.72
557.756	159.74
558.176	113.62
558.596	181.59
559.015	208.29
559.435	181.59
559.854	205.86
560.274	162.17
560.693	154.89
561.112	203.43
561.532	174.3
561.951	125.76
562.37	157.31
562.789	193.72
563.208	210.71
563.627	152.46
564.046	154.89
564.465	184.01
564.884	171.88
565.303	137.9
565.722	86.92
566.14	152.46
566.559	169.45
566.978	237.41
567.396	227.7
567.815	191.3
568.233	215.57
568.652	191.3
569.07	130.61
569.489	176.73
569.907	196.15
570.325	225.28
570.743	179.16
571.161	186.44
571.58	181.59
571.998	150.03
572.416	157.31
572.833	237.41
573.251	157.31
573.669	137.9
574.087	135.47
574.505	210.71
574.922	140.32
575.34	167.02
575.758	113.62
576.175	179.16
576.593	227.7
577.01	176.73
577.428	179.16
577.845	1477.72
578.262	324.79
578.68	213.14
579.097	210.71
579.514	191.3
579.931	162.17
580.348	188.87
580.765	150.03
581.182	130.61
581.599	198.58
582.016	179.16
582.433	184.01
582.849	222.85
583.266	208.29
583.683	217.99
584.099	281.1
584.516	193.72
584.933	186.44
585.349	169.45
585.765	150.03
586.182	150.03
586.598	217.99
587.014	169.45
587.431	220.42
587.847	176.73
588.263	157.31
588.679	193.72
589.095	167.02
589.511	169.45
589.927	140.32
590.343	167.02
590.759	213.14
591.174	130.61
591.59	164.6
592.006	184.01
592.421	174.3
592.837	167.02
593.252	147.61
593.668	171.88
594.083	208.29
594.499	179.16
594.914	174.3
595.329	140.32
595.745	239.84
596.16	154.89
596.575	234.99
596.99	176.73
597.405	108.77
597.82	196.15
598.235	217.99
598.65	169.45
599.065	222.85
599.479	108.77
599.894	135.47
600.309	113.62
600.724	142.75
601.138	142.75
601.553	167.02
601.967	179.16
602.382	230.13
602.796	174.3
603.21	237.41
603.625	150.03
604.039	203.43
604.453	147.61
604.867	167.02
605.281	198.58
605.695	118.48
606.109	225.28
606.523	140.32
606.937	213.14
607.351	288.38
607.765	208.29
608.178	157.31
608.592	193.72
609.006	130.61
609.419	86.92
609.833	193.72
610.246	261.68
610.66	179.16
611.073	217.99
611.487	227.7
611.9	196.15
612.313	147.61
612.726	186.44
613.139	188.87
613.553	169.45
613.966	150.03
614.379	217.99
614.792	198.58
615.204	137.9
615.617	201
616.03	247.12
616.443	133.04
616.856	213.14
617.268	186.44
617.681	198.58
618.093	167.02
618.506	164.6
618.918	128.19
619.331	167.02
619.743	154.89
620.155	186.44
620.568	176.73
620.98	162.17
621.392	140.32
621.804	208.29
622.216	106.34
622.628	164.6
623.04	154.89
623.452	179.16
623.864	217.99
624.276	140.32
624.687	106.34
625.099	145.18
625.511	157.31
625.922	205.86
626.334	103.92
626.745	159.74
627.157	152.46
627.568	157.31
627.979	164.6
628.391	164.6
628.802	167.02
629.213	171.88
629.624	147.61
630.035	208.29
630.446	113.62
630.857	147.61
631.268	188.87
631.679	174.3
632.09	176.73
632.501	154.89
632.912	196.15
633.322	106.34
633.733	123.33
634.144	203.43
634.554	140.32
634.965	171.88
635.375	193.72
635.785	154.89
636.196	208.29
636.606	220.42
637.016	171.88
637.427	157.31
637.837	179.16
638.247	179.16
638.657	162.17
639.067	210.71
639.477	174.3
639.887	208.29
640.297	150.03
640.706	203.43
641.116	213.14
641.526	147.61
641.935	120.91
642.345	84.5
642.755	133.04
643.164	196.15
643.573	179.16
643.983	162.17
644.392	222.85
644.801	181.59
645.211	135.47
645.62	152.46
646.029	201
646.438	142.75
646.847	193.72
647.256	157.31
647.665	171.88
648.074	225.28
648.483	254.4
648.892	188.87
649.3	171.88
649.709	99.06
650.118	113.62
650.526	142.75
650.935	213.14
651.343	145.18
651.752	135.47
652.16	167.02
652.568	234.99
652.977	150.03
653.385	193.72
653.793	188.87
654.201	133.04
654.609	157.31
655.017	162.17
655.425	116.05
655.833	150.03
656.241	181.59
656.649	145.18
657.057	186.44
657.464	184.01
657.872	179.16
658.28	113.62
658.687	210.71
659.095	113.62
659.502	203.43
659.91	203.43
660.317	186.44
660.724	179.16
661.132	142.75
661.539	193.72
661.946	162.17
662.353	116.05
662.76	171.88
663.167	154.89
663.574	205.86
663.981	125.76
664.388	222.85
664.795	176.73
665.202	210.71
665.608	157.31
666.015	111.2
666.422	140.32
666.828	130.61
667.235	198.58
667.641	193.72
668.047	171.88
668.454	162.17
668.86	84.5
669.266	169.45
669.673	137.9
670.079	145.18
670.485	205.86
670.891	150.03
671.297	191.3
671.703	186.44
672.109	159.74
672.515	188.87
672.92	188.87
673.326	181.59
673.732	188.87
674.138	169.45
674.543	137.9
674.949	171.88
675.354	167.02
675.76	150.03
676.165	140.32
676.57	142.75
676.976	184.01
677.381	176.73
677.786	145.18
678.191	137.9
678.596	120.91
679.001	157.31
679.406	137.9
679.811	140.32
680.216	222.85
680.621	196.15
681.026	167.02
681.43	234.99
681.835	220.42
682.24	208.29
682.644	150.03
683.049	103.92
683.453	157.31
683.858	210.71
684.262	162.17
684.667	196.15
685.071	181.59
685.475	184.01
685.879	157.31
686.283	251.98
686.687	176.73
687.091	157.31
687.495	125.76
687.899	162.17
688.303	150.03
688.707	157.31
689.111	167.02
689.514	167.02
689.918	213.14
690.322	133.04
690.725	130.61
691.129	232.56
691.532	150.03
691.936	116.05
692.339	157.31
692.742	181.59
693.146	147.61
693.549	242.27
693.952	181.59
694.355	133.04
694.758	232.56
695.161	145.18
695.564	215.57
695.967	210.71
696.37	164.6
696.773	142.75
697.175	142.75
697.578	222.85
697.981	169.45
698.383	222.85
698.786	237.41
699.188	150.03
699.591	230.13
699.993	191.3
700.395	225.28
700.798	145.18
701.2	203.43
701.602	137.9
702.004	198.58
702.406	137.9
702.808	179.16
703.21	123.33
703.612	215.57
704.014	259.26
704.416	220.42
704.818	259.26
705.219	140.32
705.621	302.95
706.023	227.7
706.424	196.15
706.826	264.11
707.227	215.57
707.629	164.6
708.03	234.99
708.431	184.01
708.832	268.97
709.234	239.84
709.635	244.69
710.036	271.39
710.437	215.57
710.838	213.14
711.239	227.7
711.64	232.56
712.041	225.28
712.441	239.84
712.842	259.26
713.243	283.53
713.643	300.52
714.044	237.41
714.445	210.71
714.845	278.68
715.246	329.65
715.646	285.96
716.046	222.85
716.447	298.09
716.847	266.54
717.247	283.53
717.647	310.23
718.047	392.75
718.447	317.51
718.847	290.81
719.247	324.79
719.647	387.9
720.047	370.91
720.446	319.94
720.846	341.78
721.246	341.78
721.645	363.63
722.045	506.83
722.444	329.65
722.844	412.17
723.243	468
723.643	378.19
724.042	387.9
724.441	436.44
724.84	443.73
725.24	453.44
725.639	499.55
726.038	535.96
726.437	458.29
726.836	477.71
727.234	460.72
727.633	514.12
728.032	489.84
728.431	504.41
728.83	504.41
729.228	577.22
729.627	616.06
730.025	637.9
730.424	616.06
730.822	703.44
731.22	754.41
731.619	688.88
732.017	802.96
732.415	822.37
732.813	890.34
733.212	953.44
733.61	1123.35
734.008	1111.21
734.406	1184.03
734.803	1344.23
735.201	1319.95
735.599	1472.87
735.997	1458.31
736.395	1659.76
736.792	1725.3
737.19	1771.42
737.587	1766.56
737.985	1841.81
738.382	1897.63
738.78	2205.89
739.177	2300.55
739.574	2548.13
739.971	2633.08
740.369	2557.84
740.766	2761.72
741.163	2980.17
741.56	3106.39
741.957	2963.18
742.354	3336.98
742.751	3385.52
743.147	3506.88
743.544	3584.55
743.941	3875.82
744.338	4103.98
744.734	4261.75
745.131	4322.43
745.527	4681.66
745.924	4849.13
746.32	5004.48
746.716	5225.35
747.113	5390.41
747.509	5754.49
747.905	6087.02
748.301	6142.84
748.697	6540.91
749.093	6902.56
749.489	7045.77
749.885	7392.86
750.281	7824.91
750.677	7972.97
751.073	8354.04
751.468	8691.43
751.864	9157.45
752.26	9155.03
752.655	9589.5
753.051	9790.96
753.446	10606.51
753.842	10829.81
754.237	11220.59
754.632	11589.53
755.028	11783.71
755.423	11900.22
755.818	11929.34
756.213	12208.47
756.608	12380.81
757.003	12419.64
757.398	12599.26
757.793	13007.03
758.188	13247.32
758.583	13422.08
758.977	13548.3
759.372	13948.79
759.767	14708.51
760.161	15596.87
760.556	16186.69
760.95	16912.43
761.345	17684.29
761.739	18286.24
762.133	19126.06
762.527	19820.24
762.922	20463.46
763.316	20461.03
763.71	21174.63
764.104	21672.21
764.498	22322.71
764.892	22572.71
765.286	23048.45
765.68	23783.9
766.073	24181.96
766.467	24138.27
766.861	25366.44
767.255	25706.26
767.648	26567.92
768.042	26997.54
768.435	27439.29
768.829	27487.84
769.222	28283.97
769.615	28621.35
770.008	28735.43
770.402	29121.36
770.795	29291.26
771.188	29679.62
771.581	29631.07
771.974	29883.5
772.367	29417.48
772.76	29742.73
773.153	29385.92
773.545	29696.61
773.938	29718.45
774.331	30529.15
774.724	31138.38
775.116	31412.65
775.509	32228.2
775.901	33796.19
776.294	34597.17
776.686	34046.19
777.078	36094.77
777.471	37026.82
777.863	37682.17
778.255	39157.92
778.647	40968.63
779.039	40565.71
779.431	39478.31
779.823	39927.35
780.215	40677.36
780.607	40036.58
780.999	41582.72
781.39	41859.42
781.782	42458.94
782.174	41410.38
782.565	41924.95
782.957	43597.31
783.348	43211.38
783.74	42609.43
784.131	42789.05
784.522	43958.97
784.914	42694.38
785.305	42085.15
785.696	43495.37
786.087	42301.17
786.478	40808.43
786.869	39721.04
787.26	40194.34
787.651	38682.19
788.042	38024.41
788.433	37721.01
788.823	36893.32
789.214	35869.03
789.605	34487.95
789.995	34410.27
790.386	33169.96
790.776	33480.65
791.167	33092.29
791.557	34621.44
791.948	34626.3
792.338	34126.29
792.728	36014.67
793.118	36699.14
793.508	35706.41
793.898	35580.2
794.288	37058.37
794.678	36235.55
795.068	35555.92
795.458	35237.96
795.848	36019.52
796.238	35927.29
796.627	35337.47
797.017	35587.48
797.406	36560.79
797.796	35412.72
798.185	35123.88
798.575	36602.06
798.964	36487.98
799.354	36167.58
799.743	36007.39
800.132	36665.16
800.521	36337.49
800.91	35449.13
801.299	34985.53
801.688	36172.44
802.077	34703.97
802.466	34082.6
802.855	34514.64
803.244	33577.74
803.633	32803.45
804.021	31521.88
804.41	31815.57
804.799	31211.2
805.187	29944.19
805.576	29378.64
805.964	29439.32
806.352	27754.83
806.741	27342.2
807.129	28094.64
807.517	28339.79
807.905	26776.66
808.293	26553.36
808.681	27652.89
809.069	27885.9
809.457	27961.14
809.845	27381.04
810.233	28138.33
810.621	28713.58
811.009	27737.84
811.396	27526.67
811.784	28257.27
812.171	28432.03
812.559	27497.55
812.946	26305.78
813.334	26597.05
813.721	26320.34
814.108	25055.76
814.496	24640.7
814.883	25249.94
815.27	25667.42
815.657	24529.05
816.044	24740.22
816.431	25381.01
816.818	24851.87
817.205	23584.86
817.592	23694.09
817.979	24104.29
818.365	23711.08
818.752	21829.98
819.139	21677.07
819.525	22327.56
819.912	21162.5
820.298	19953.74
820.685	19953.74
821.071	20111.51
821.457	19167.32
821.843	18084.78
822.23	17681.86
822.616	17181.85
823.002	16334.75
823.388	15317.74
823.774	15252.21
824.16	15174.54
824.546	14863.85
824.931	13868.69
825.317	14320.16
825.703	14104.13
826.089	13553.15
826.474	13383.25
826.86	13169.65
827.245	13655.1
827.631	13007.03
828.016	12240.03
828.401	12150.22
828.787	12795.86
829.172	11994.88
829.557	11101.66
829.942	10980.3
830.327	11460.89
830.712	11094.38
831.097	10254.56
831.482	10169.61
831.867	10337.08
832.252	9960.86
832.636	9295.81
833.021	9259.4
833.406	9567.65
833.79	9492.41
834.175	8890.46
834.559	8489.97
834.944	8419.58
835.328	8354.04
835.713	8053.07
836.097	7647.72
836.481	7849.18
836.865	7616.17
837.249	7193.83
837.633	6788.49
838.017	6669.55
838.401	6691.4
838.785	6225.37
839.169	5810.31
839.553	5679.24
839.937	5489.92
840.32	5193.8
840.704	4992.34
841.087	4846.71
841.471	4739.91
841.854	4720.49
842.238	4516.61
842.621	4249.61
843.004	4218.06
843.388	4067.57
843.771	4031.16
844.154	3858.83
844.537	3951.06
844.92	4120.97
845.303	3769.02
845.686	3647.66
846.069	3664.65
846.452	3555.43
846.834	3460.76
847.217	3336.98
847.6	3417.07
847.982	3329.69
848.365	3222.9
848.748	3009.3
849.13	2912.21
849.512	3052.99
849.895	3120.95
850.277	2759.3
850.659	2693.76
851.041	2662.21
851.423	2781.14
851.806	2545.7
852.188	2448.61
852.57	2358.8
852.951	2475.31
853.333	2555.41
853.715	2271.42
854.097	2169.48
854.479	2215.6
854.86	2159.77
855.242	2103.95
855.623	2002
856.005	1907.34
856.386	1999.58
856.768	1841.81
857.149	1618.5
857.53	1611.22
857.911	1691.32
858.292	1674.33
858.674	1557.82
859.055	1504.42
859.436	1434.03
859.817	1397.62
860.197	1332.09
860.578	1220.44
860.959	1171.89
861.34	1176.75
861.72	1205.87
862.101	1086.94
862.482	1026.26
862.862	1099.08
863.243	1096.65
863.623	980.14
864.003	902.47
864.384	980.14
864.764	1084.51
865.144	965.58
865.524	909.75
865.904	822.37
866.284	924.32
866.664	902.47
867.044	783.54
867.424	781.11
867.804	800.53
868.183	839.36
868.563	754.41
868.943	640.33
869.322	701.01
869.702	657.32
870.081	659.75
870.461	611.2
870.84	662.18
871.22	582.08
871.599	596.64
871.978	606.35
872.357	548.1
872.736	475.28
873.115	557.81
873.494	494.7
873.873	516.54
874.252	414.6
874.631	455.86
875.01	443.73
875.388	412.17
875.767	458.29
876.146	446.15
876.524	470.43
876.903	409.75
877.281	412.17
877.66	327.22
878.038	390.33
878.416	385.47
878.794	322.37
879.173	244.69
879.551	312.66
879.929	395.18
880.307	356.35
880.685	210.71
881.063	317.51
881.441	329.65
881.818	346.64
882.196	261.68
882.574	256.83
882.951	249.55
883.329	276.25
883.707	336.93
884.084	268.97
884.461	261.68
884.839	215.57
885.216	247.12
885.593	184.01
885.971	213.14
886.348	237.41
886.725	198.58
887.102	276.25
887.479	208.29
887.856	208.29
888.233	210.71
888.609	251.98
888.986	237.41
889.363	205.86
889.74	230.13
890.116	266.54
890.493	247.12
890.869	196.15
891.246	249.55
891.622	201
891.998	227.7
892.375	184.01
892.751	203.43
893.127	215.57
893.503	188.87
893.879	203.43
894.255	264.11
894.631	188.87
895.007	196.15
895.383	184.01
895.759	268.97
896.134	154.89
896.51	164.6
896.886	203.43
897.261	125.76
897.637	227.7
898.012	179.16
898.388	176.73
898.763	213.14
899.138	164.6
899.514	167.02
899.889	154.89
900.264	179.16
900.639	186.44
901.014	176.73
901.389	225.28
901.764	179.16
902.139	108.77
902.513	179.16
902.888	52.94
903.263	123.33
903.638	157.31
904.012	133.04
904.387	111.2
904.761	137.9
905.136	186.44
905.51	169.45
905.884	159.74
906.259	147.61
906.633	205.86
907.007	123.33
907.381	113.62
907.755	157.31
908.129	290.81
908.503	179.16
908.877	140.32
909.251	125.76
909.624	133.04
909.998	186.44
910.372	181.59
910.745	159.74
911.119	167.02
911.492	162.17
911.866	150.03
912.239	205.86
912.612	188.87
912.986	164.6
913.359	116.05
913.732	111.2
914.105	222.85
914.478	164.6
914.851	147.61
915.224	140.32
915.597	154.89
915.97	101.49
916.343	208.29
916.715	137.9
917.088	108.77
917.461	101.49
917.833	164.6
918.206	176.73
918.578	201
918.951	167.02
919.323	125.76
919.695	193.72
920.067	152.46
920.44	169.45
920.812	186.44
921.184	152.46
921.556	186.44
921.928	113.62
922.3	222.85
922.672	111.2
923.043	169.45
923.415	184.01
923.787	184.01
924.158	222.85
924.53	159.74
924.901	220.42
925.273	203.43
925.644	125.76
926.016	96.63
926.387	150.03
926.758	145.18
927.129	210.71
927.5	193.72
927.872	169.45
928.243	133.04
928.613	191.3
928.984	181.59
929.355	181.59
929.726	140.32
930.097	123.33
930.467	108.77
930.838	198.58
931.209	237.41
931.579	193.72
931.95	164.6
932.32	176.73
932.69	128.19
933.061	188.87
933.431	137.9
933.801	171.88
934.171	108.77
934.541	145.18
934.911	43.23
935.281	84.5
935.651	135.47
936.021	157.31
936.391	135.47
936.761	162.17
937.13	198.58
937.5	135.47
937.87	191.3
938.239	113.62
938.609	203.43
938.978	140.32
939.347	213.14
939.717	123.33
940.086	152.46
940.455	169.45
940.824	162.17
941.193	184.01
941.562	222.85
941.931	171.88
942.3	266.54
942.669	205.86
943.038	133.04
943.407	167.02
943.775	128.19
944.144	181.59
944.513	237.41
944.881	147.61
945.25	125.76
945.618	137.9
945.986	140.32
946.355	217.99
946.723	220.42
947.091	169.45
947.459	154.89
947.827	230.13
948.195	179.16
948.563	108.77
948.931	145.18
949.299	140.32
949.667	125.76
950.035	137.9
950.402	118.48
950.77	123.33
951.138	191.3
951.505	154.89
951.873	193.72
952.24	186.44
952.607	181.59
952.975	169.45
953.342	174.3
953.709	171.88
954.076	130.61
954.443	62.65
954.81	193.72
955.177	159.74
955.544	152.46
955.911	159.74
956.278	210.71
956.645	176.73
957.012	140.32
957.378	171.88
957.745	125.76
958.111	162.17
958.478	210.71
958.844	142.75
959.211	140.32
959.577	111.2
959.943	157.31
960.309	176.73
960.675	120.91
961.042	147.61
961.408	198.58
961.774	251.98
962.139	135.47
962.505	145.18
962.871	179.16
963.237	191.3
963.603	140.32
963.968	99.06
964.334	67.51
964.699	174.3
965.065	191.3
965.43	150.03
965.796	140.32
966.161	145.18
966.526	147.61
966.891	193.72
967.256	142.75
967.622	164.6
967.987	154.89
968.352	145.18
968.716	159.74
969.081	181.59
969.446	123.33
969.811	208.29
970.176	171.88
970.54	164.6
970.905	137.9
971.269	106.34
971.634	171.88
971.998	210.71
972.363	208.29
972.727	164.6
973.091	215.57
973.455	99.06
973.819	167.02
974.183	191.3
974.547	145.18
974.911	77.22
975.275	137.9
975.639	169.45
976.003	181.59
976.367	167.02
976.73	123.33
977.094	84.5
977.458	181.59
977.821	157.31
978.185	137.9
978.548	94.21
978.911	120.91
979.275	159.74
979.638	137.9
980.001	111.2
980.364	86.92
980.727	120.91
981.09	191.3
981.453	74.79
981.816	225.28
982.179	186.44
982.542	130.61
982.905	174.3
983.267	162.17
983.63	145.18
983.992	106.34
984.355	162.17
984.717	164.6
985.08	111.2
985.442	145.18
985.804	111.2
986.167	198.58
986.529	133.04
986.891	169.45
987.253	140.32
987.615	174.3
987.977	130.61
988.339	171.88
988.701	179.16
989.062	186.44
989.424	137.9
989.786	176.73
990.147	205.86
990.509	164.6
990.87	164.6
991.232	213.14
991.593	133.04
991.955	169.45
992.316	176.73
992.677	169.45
993.038	174.3
993.399	147.61
993.76	159.74
994.121	159.74
994.482	145.18
994.843	120.91
995.204	201
995.565	118.48
995.926	65.08
996.286	145.18
996.647	154.89
997.007	174.3
997.368	145.18
997.728	86.92
998.089	145.18
998.449	137.9
998.809	159.74
999.169	150.03
999.53	137.9
999.89	77.22
1000.25	89.35
1000.61	205.86
1000.97	130.61
1001.329	123.33
1001.689	150.03
1002.049	123.33
1002.409	176.73
1002.768	128.19
1003.128	179.16
1003.487	184.01
1003.847	220.42
1004.206	210.71
1004.566	140.32
1004.925	193.72
1005.284	167.02
1005.643	89.35
1006.003	198.58
1006.362	186.44
1006.721	174.3
1007.08	116.05
1007.438	118.48
1007.797	65.08
1008.156	157.31
1008.515	249.55
1008.874	234.99
1009.232	208.29
1009.591	193.72
1009.949	191.3
1010.308	135.47
1010.666	89.35
1011.024	251.98
1011.383	179.16
1011.741	130.61
1012.099	147.61
1012.457	128.19
1012.815	169.45
1013.173	123.33
1013.531	152.46
1013.889	162.17
1014.247	77.22
1014.605	137.9
1014.962	184.01
1015.32	147.61
1015.678	154.89
1016.035	118.48
1016.393	169.45
1016.75	116.05
1017.107	125.76
1017.465	142.75
1017.822	176.73
1018.179	193.72
1018.536	167.02
1018.894	196.15
1019.251	113.62
1019.608	130.61
1019.964	118.48
1020.321	157.31
1020.678	164.6
1021.035	120.91
1021.392	145.18
1021.748	145.18
1022.105	106.34
1022.461	142.75
1022.818	171.88
1023.174	103.92
1023.531	162.17
1023.887	123.33
1024.243	208.29
1024.599	181.59
1024.955	215.57
1025.311	113.62
1025.667	96.63
1026.023	128.19
1026.379	82.07
1026.735	137.9
1027.091	133.04
1027.447	232.56
