189.514	17.75
189.973	17.75
190.431	17.75
190.889	27.46
191.348	-1.67
191.806	15.32
192.264	5.61
192.722	8.04
193.18	-21.09
193.638	-23.51
194.096	-8.95
194.554	10.47
195.012	25.03
195.47	-50.21
195.928	59.01
196.385	15.32
196.843	-28.37
197.301	-30.8
197.758	8.04
198.216	10.47
198.674	59.01
199.131	-38.08
199.589	42.02
200.046	56.58
200.503	34.74
200.961	51.73
201.418	66.29
201.875	44.45
202.332	97.85
202.79	49.3
203.247	126.97
203.704	136.68
204.161	129.4
204.618	59.01
205.075	117.27
205.532	102.7
205.989	141.54
206.445	105.13
206.902	180.37
207.359	175.52
207.816	146.39
208.272	102.7
208.729	136.68
209.185	105.13
209.642	107.56
210.098	170.66
210.555	165.81
211.011	124.55
211.467	122.12
211.924	165.81
212.38	119.69
212.836	192.51
213.292	182.8
213.748	122.12
214.204	131.83
214.66	112.41
215.116	177.95
215.572	134.26
216.028	146.39
216.484	182.8
216.94	173.09
217.396	88.14
217.851	124.55
218.307	131.83
218.763	219.21
219.218	146.39
219.674	226.49
220.129	180.37
220.585	95.42
221.04	163.38
221.496	192.51
221.951	143.96
222.406	131.83
222.861	175.52
223.317	51.73
223.772	139.11
224.227	126.97
224.682	114.84
225.137	80.86
225.592	163.38
226.047	185.23
226.502	80.86
226.957	173.09
227.411	163.38
227.866	131.83
228.321	207.07
228.776	131.83
229.23	165.81
229.685	56.58
230.139	156.1
230.594	129.4
231.048	124.55
231.503	112.41
231.957	158.53
232.411	105.13
232.865	131.83
233.32	61.44
233.774	180.37
234.228	126.97
234.682	187.65
235.136	153.67
235.59	141.54
236.044	158.53
236.498	148.82
236.952	141.54
237.406	134.26
237.86	124.55
238.313	134.26
238.767	92.99
239.221	90.57
239.674	80.86
240.128	139.11
240.581	139.11
241.035	141.54
241.488	131.83
241.942	134.26
242.395	136.68
242.848	95.42
243.301	107.56
243.755	146.39
244.208	126.97
244.661	100.27
245.114	78.43
245.567	139.11
246.02	117.27
246.473	107.56
246.926	180.37
247.379	165.81
247.832	124.55
248.284	148.82
248.737	119.69
249.19	211.93
249.642	131.83
250.095	143.96
250.547	105.13
251	51.73
251.452	156.1
251.905	54.16
252.357	129.4
252.81	224.06
253.262	122.12
253.714	97.85
254.166	83.28
254.618	105.13
255.07	129.4
255.523	71.15
255.975	139.11
256.427	146.39
256.878	122.12
257.33	112.41
257.782	112.41
258.234	177.95
258.686	112.41
259.137	134.26
259.589	129.4
260.041	105.13
260.492	119.69
260.944	124.55
261.395	158.53
261.847	151.25
262.298	119.69
262.749	146.39
263.201	197.36
263.652	122.12
264.103	109.98
264.554	158.53
265.005	143.96
265.457	143.96
265.908	78.43
266.359	160.96
266.809	92.99
267.26	173.09
267.711	197.36
268.162	175.52
268.613	182.8
269.064	105.13
269.514	92.99
269.965	136.68
270.415	114.84
270.866	141.54
271.316	153.67
271.767	180.37
272.217	124.55
272.668	163.38
273.118	221.64
273.568	185.23
274.019	158.53
274.469	80.86
274.919	117.27
275.369	129.4
275.819	126.97
276.269	119.69
276.719	119.69
277.169	124.55
277.619	114.84
278.069	117.27
278.518	160.96
278.968	71.15
279.418	211.93
279.867	134.26
280.317	143.96
280.767	124.55
281.216	126.97
281.666	163.38
282.115	168.24
282.564	83.28
283.014	160.96
283.463	126.97
283.912	129.4
284.361	173.09
284.811	139.11
285.26	170.66
285.709	175.52
286.158	146.39
286.607	122.12
287.056	151.25
287.505	158.53
287.953	90.57
288.402	168.24
288.851	112.41
289.3	71.15
289.748	49.3
290.197	153.67
290.646	151.25
291.094	71.15
291.543	165.81
291.991	112.41
292.439	165.81
292.888	146.39
293.336	102.7
293.784	90.57
294.233	170.66
294.681	134.26
295.129	185.23
295.577	158.53
296.025	156.1
296.473	190.08
296.921	165.81
297.369	139.11
297.817	209.5
298.264	211.93
298.712	163.38
299.16	168.24
299.608	160.96
300.055	163.38
300.503	131.83
300.95	114.84
301.398	146.39
301.845	124.55
302.293	163.38
302.74	78.43
303.187	122.12
303.635	170.66
304.082	148.82
304.529	131.83
304.976	177.95
305.423	124.55
305.87	109.98
306.317	124.55
306.764	134.26
307.211	107.56
307.658	122.12
308.105	92.99
308.552	78.43
308.998	153.67
309.445	141.54
309.892	168.24
310.338	158.53
310.785	151.25
311.231	163.38
311.678	105.13
312.124	141.54
312.571	114.84
313.017	126.97
313.463	139.11
313.909	151.25
314.356	187.65
314.802	136.68
315.248	131.83
315.694	160.96
316.14	68.72
316.586	117.27
317.032	85.71
317.478	134.26
317.923	100.27
318.369	73.58
318.815	83.28
319.261	100.27
319.706	187.65
320.152	253.19
320.597	95.42
321.043	141.54
321.488	139.11
321.934	102.7
322.379	146.39
322.824	197.36
323.27	88.14
323.715	102.7
324.16	39.59
324.605	131.83
325.05	80.86
325.495	119.69
325.94	158.53
326.385	136.68
326.83	68.72
327.275	156.1
327.72	114.84
328.165	187.65
328.61	151.25
329.054	209.5
329.499	129.4
329.943	219.21
330.388	83.28
330.832	182.8
331.277	187.65
331.721	107.56
332.166	236.2
332.61	160.96
333.054	109.98
333.499	134.26
333.943	102.7
334.387	117.27
334.831	95.42
335.275	119.69
335.719	165.81
336.163	124.55
336.607	95.42
337.051	66.29
337.495	97.85
337.938	92.99
338.382	124.55
338.826	221.64
339.269	85.71
339.713	97.85
340.157	190.08
340.6	119.69
341.044	177.95
341.487	85.71
341.93	112.41
342.374	68.72
342.817	168.24
343.26	134.26
343.703	122.12
344.146	182.8
344.59	158.53
345.033	141.54
345.476	134.26
345.919	139.11
346.361	90.57
346.804	158.53
347.247	73.58
347.69	49.3
348.133	165.81
348.575	90.57
349.018	197.36
349.461	180.37
349.903	114.84
350.346	102.7
350.788	95.42
351.23	68.72
351.673	146.39
352.115	216.78
352.557	160.96
353	124.55
353.442	139.11
353.884	109.98
354.326	165.81
354.768	180.37
355.21	143.96
355.652	68.72
356.094	85.71
356.536	122.12
356.978	109.98
357.419	80.86
357.861	141.54
358.303	117.27
358.744	119.69
359.186	148.82
359.627	158.53
360.069	105.13
360.51	126.97
360.952	151.25
361.393	100.27
361.834	175.52
362.276	105.13
362.717	129.4
363.158	102.7
363.599	158.53
364.04	141.54
364.481	126.97
364.922	180.37
365.363	119.69
365.804	107.56
366.245	126.97
366.686	90.57
367.126	122.12
367.567	160.96
368.008	194.94
368.448	163.38
368.889	107.56
369.33	92.99
369.77	129.4
370.21	66.29
370.651	112.41
371.091	158.53
371.531	131.83
371.972	136.68
372.412	153.67
372.852	182.8
373.292	105.13
373.732	105.13
374.172	136.68
374.612	146.39
375.052	114.84
375.492	129.4
375.932	141.54
376.372	146.39
376.811	112.41
377.251	105.13
377.691	112.41
378.13	187.65
378.57	219.21
379.009	146.39
379.449	151.25
379.888	71.15
380.328	131.83
380.767	100.27
381.206	209.5
381.645	80.86
382.085	122.12
382.524	119.69
382.963	207.07
383.402	190.08
383.841	122.12
384.28	119.69
384.719	68.72
385.158	124.55
385.596	211.93
386.035	105.13
386.474	143.96
386.913	80.86
387.351	80.86
387.79	197.36
388.228	73.58
388.667	59.01
389.105	134.26
389.544	187.65
389.982	100.27
390.42	124.55
390.859	68.72
391.297	146.39
391.735	80.86
392.173	105.13
392.611	160.96
393.049	151.25
393.487	194.94
393.925	112.41
394.363	158.53
394.801	151.25
395.239	56.58
395.676	151.25
396.114	151.25
396.552	59.01
396.989	105.13
397.427	124.55
397.864	141.54
398.302	153.67
398.739	126.97
399.177	151.25
399.614	117.27
400.051	54.16
400.488	151.25
400.926	136.68
401.363	122.12
401.8	187.65
402.237	165.81
402.674	100.27
403.111	37.17
403.548	122.12
403.985	95.42
404.421	143.96
404.858	90.57
405.295	126.97
405.732	139.11
406.168	97.85
406.605	85.71
407.041	126.97
407.478	139.11
407.914	95.42
408.351	68.72
408.787	97.85
409.223	129.4
409.66	136.68
410.096	119.69
410.532	173.09
410.968	119.69
411.404	105.13
411.84	126.97
412.276	151.25
412.712	119.69
413.148	122.12
413.584	122.12
414.02	105.13
414.455	165.81
414.891	29.89
415.327	143.96
415.762	163.38
416.198	177.95
416.633	151.25
417.069	168.24
417.504	163.38
417.94	165.81
418.375	76
418.81	139.11
419.245	146.39
419.681	117.27
420.116	141.54
420.551	97.85
420.986	148.82
421.421	156.1
421.856	141.54
422.291	160.96
422.726	143.96
423.16	151.25
423.595	42.02
424.03	214.35
424.464	173.09
424.899	112.41
425.334	134.26
425.768	102.7
426.203	124.55
426.637	119.69
427.071	228.92
427.506	114.84
427.94	44.45
428.374	129.4
428.809	61.44
429.243	73.58
429.677	112.41
430.111	97.85
430.545	122.12
430.979	95.42
431.413	90.57
431.847	76
432.28	136.68
432.714	141.54
433.148	107.56
433.582	146.39
434.015	97.85
434.449	214.35
434.882	131.83
435.316	63.87
435.749	129.4
436.183	126.97
436.616	139.11
437.049	177.95
437.483	185.23
437.916	146.39
438.349	151.25
438.782	187.65
439.215	83.28
439.648	112.41
440.081	139.11
440.514	160.96
440.947	148.82
441.38	177.95
441.813	180.37
442.245	236.2
442.678	185.23
443.111	197.36
443.543	119.69
443.976	182.8
444.408	158.53
444.841	117.27
445.273	112.41
445.705	141.54
446.138	151.25
446.57	78.43
447.002	117.27
447.434	182.8
447.867	207.07
448.299	209.5
448.731	202.22
449.163	156.1
449.595	146.39
450.026	175.52
450.458	207.07
450.89	160.96
451.322	146.39
451.754	134.26
452.185	139.11
452.617	173.09
453.048	182.8
453.48	177.95
453.911	182.8
454.343	160.96
454.774	199.79
455.205	151.25
455.637	122.12
456.068	160.96
456.499	158.53
456.93	129.4
457.361	112.41
457.792	153.67
458.223	88.14
458.654	192.51
459.085	54.16
459.516	124.55
459.947	160.96
460.378	114.84
460.808	126.97
461.239	180.37
461.669	109.98
462.1	177.95
462.531	107.56
462.961	143.96
463.391	177.95
463.822	173.09
464.252	139.11
464.682	158.53
465.113	56.58
465.543	165.81
465.973	153.67
466.403	124.55
466.833	143.96
467.263	151.25
467.693	143.96
468.123	197.36
468.553	139.11
468.983	153.67
469.412	95.42
469.842	107.56
470.272	182.8
470.701	168.24
471.131	180.37
471.56	134.26
471.99	158.53
472.419	102.7
472.849	151.25
473.278	194.94
473.707	114.84
474.136	117.27
474.566	187.65
474.995	73.58
475.424	151.25
475.853	95.42
476.282	92.99
476.711	143.96
477.14	168.24
477.569	117.27
477.997	139.11
478.426	131.83
478.855	199.79
479.283	175.52
479.712	151.25
480.141	129.4
480.569	129.4
480.998	139.11
481.426	131.83
481.854	148.82
482.283	131.83
482.711	148.82
483.139	170.66
483.567	139.11
483.995	151.25
484.424	109.98
484.852	194.94
485.28	185.23
485.708	122.12
486.135	136.68
486.563	170.66
486.991	126.97
487.419	117.27
487.847	126.97
488.274	139.11
488.702	180.37
489.129	151.25
489.557	76
489.984	204.65
490.412	117.27
490.839	139.11
491.266	109.98
491.694	105.13
492.121	187.65
492.548	102.7
492.975	119.69
493.402	131.83
493.829	100.27
494.256	192.51
494.683	187.65
495.11	148.82
495.537	175.52
495.964	160.96
496.39	173.09
496.817	160.96
497.244	168.24
497.67	192.51
498.097	95.42
498.523	143.96
498.95	194.94
499.376	90.57
499.803	112.41
500.229	109.98
500.655	114.84
501.081	51.73
501.508	90.57
501.934	202.22
502.36	107.56
502.786	163.38
503.212	219.21
503.638	151.25
504.064	160.96
504.489	124.55
504.915	151.25
505.341	117.27
505.767	85.71
506.192	185.23
506.618	95.42
507.043	170.66
507.469	105.13
507.894	39.59
508.32	143.96
508.745	107.56
509.17	168.24
509.596	126.97
510.021	175.52
510.446	141.54
510.871	126.97
511.296	102.7
511.721	107.56
512.146	78.43
512.571	122.12
512.996	141.54
513.421	151.25
513.845	126.97
514.27	190.08
514.695	143.96
515.119	185.23
515.544	114.84
515.969	97.85
516.393	146.39
516.817	124.55
517.242	119.69
517.666	71.15
518.09	117.27
518.515	187.65
518.939	105.13
519.363	318.72
519.787	175.52
520.211	160.96
520.635	177.95
521.059	114.84
521.483	224.06
521.907	139.11
522.331	97.85
522.754	122.12
523.178	66.29
523.602	122.12
524.025	163.38
524.449	119.69
524.872	177.95
525.296	131.83
525.719	109.98
526.143	156.1
526.566	83.28
526.989	102.7
527.412	158.53
527.836	117.27
528.259	158.53
528.682	126.97
529.105	182.8
529.528	119.69
529.951	95.42
530.374	185.23
530.796	228.92
531.219	165.81
531.642	131.83
532.065	109.98
532.487	131.83
532.91	146.39
533.332	105.13
533.755	61.44
534.177	109.98
534.6	78.43
535.022	175.52
535.444	63.87
535.867	163.38
536.289	177.95
536.711	126.97
537.133	187.65
537.555	141.54
537.977	126.97
538.399	173.09
538.821	163.38
539.243	143.96
539.665	126.97
540.086	102.7
540.508	143.96
540.93	112.41
541.351	90.57
541.773	129.4
542.195	180.37
542.616	143.96
543.037	170.66
543.459	265.33
543.88	136.68
544.301	158.53
544.723	190.08
545.144	165.81
545.565	190.08
545.986	148.82
546.407	105.13
546.828	173.09
547.249	126.97
547.67	107.56
548.091	148.82
548.512	131.83
548.932	85.71
549.353	141.54
549.774	219.21
550.194	180.37
550.615	117.27
551.035	102.7
551.456	163.38
551.876	175.52
552.296	136.68
552.717	102.7
553.137	173.09
553.557	156.1
553.977	143.96
554.397	146.39
554.817	122.12
555.237	109.98
555.657	219.21
556.077	199.79
556.497	126.97
556.917	109.98
557.337	187.65
557.756	119.69
558.176	141.54
558.596	117.27
559.015	160.96
559.435	124.55
559.854	165.81
560.274	190.08
560.693	156.1
561.112	102.7
561.532	68.72
561.951	129.4
562.37	107.56
562.789	146.39
563.208	143.96
563.627	134.26
564.046	202.22
564.465	141.54
564.884	153.67
565.303	146.39
565.722	124.55
566.14	153.67
566.559	168.24
566.978	180.37
567.396	146.39
567.815	156.1
568.233	175.52
568.652	117.27
569.07	156.1
569.489	129.4
569.907	88.14
570.325	170.66
570.743	182.8
571.161	197.36
571.58	131.83
571.998	129.4
572.416	194.94
572.833	141.54
573.251	102.7
573.669	97.85
574.087	158.53
574.505	95.42
574.922	151.25
575.34	146.39
575.758	109.98
576.175	102.7
576.593	105.13
577.01	92.99
577.428	88.14
577.845	1360
578.262	228.92
578.68	173.09
579.097	117.27
579.514	187.65
579.931	126.97
580.348	88.14
580.765	168.24
581.182	126.97
581.599	143.96
582.016	97.85
582.433	197.36
582.849	158.53
583.266	119.69
583.683	109.98
584.099	97.85
584.516	129.4
584.933	146.39
585.349	170.66
585.765	92.99
586.182	105.13
586.598	102.7
587.014	146.39
587.431	119.69
587.847	122.12
588.263	141.54
588.679	173.09
589.095	102.7
589.511	173.09
589.927	109.98
590.343	124.55
590.759	109.98
591.174	143.96
591.59	112.41
592.006	105.13
592.421	122.12
592.837	95.42
593.252	177.95
593.668	136.68
594.083	117.27
594.499	143.96
594.914	173.09
595.329	90.57
595.745	124.55
596.16	66.29
596.575	148.82
596.99	175.52
597.405	102.7
597.82	151.25
598.235	153.67
598.65	160.96
599.065	148.82
599.479	146.39
599.894	112.41
600.309	117.27
600.724	204.65
601.138	129.4
601.553	156.1
601.967	141.54
602.382	88.14
602.796	182.8
603.21	136.68
603.625	136.68
604.039	146.39
604.453	105.13
604.867	187.65
605.281	168.24
605.695	122.12
606.109	168.24
606.523	109.98
606.937	194.94
607.351	294.45
607.765	139.11
608.178	185.23
608.592	66.29
609.006	109.98
609.419	197.36
609.833	102.7
610.246	78.43
610.66	97.85
611.073	168.24
611.487	209.5
611.9	170.66
612.313	136.68
612.726	136.68
613.139	153.67
613.553	131.83
613.966	228.92
614.379	134.26
614.792	141.54
615.204	112.41
615.617	143.96
616.03	141.54
616.443	136.68
616.856	25.03
617.268	136.68
617.681	170.66
618.093	165.81
618.506	224.06
618.918	187.65
619.331	112.41
619.743	160.96
620.155	170.66
620.568	136.68
620.98	192.51
621.392	139.11
621.804	168.24
622.216	163.38
622.628	158.53
623.04	136.68
623.452	112.41
623.864	122.12
624.276	102.7
624.687	134.26
625.099	156.1
625.511	173.09
625.922	124.55
626.334	165.81
626.745	156.1
627.157	124.55
627.568	114.84
627.979	131.83
628.391	97.85
628.802	131.83
629.213	146.39
629.624	143.96
630.035	141.54
630.446	126.97
630.857	143.96
631.268	129.4
631.679	160.96
632.09	102.7
632.501	95.42
632.912	114.84
633.322	170.66
633.733	148.82
634.144	129.4
634.554	139.11
634.965	153.67
635.375	124.55
635.785	168.24
636.196	134.26
636.606	148.82
637.016	100.27
637.427	102.7
637.837	129.4
638.247	126.97
638.657	114.84
639.067	160.96
639.477	192.51
639.887	88.14
640.297	153.67
640.706	148.82
641.116	173.09
641.526	126.97
641.935	211.93
642.345	134.26
642.755	163.38
643.164	136.68
643.573	143.96
643.983	148.82
644.392	185.23
644.801	163.38
645.211	119.69
645.62	78.43
646.029	134.26
646.438	148.82
646.847	173.09
647.256	136.68
647.665	156.1
648.074	97.85
648.483	148.82
648.892	175.52
649.3	124.55
649.709	119.69
650.118	107.56
650.526	158.53
650.935	139.11
651.343	131.83
651.752	117.27
652.16	197.36
652.568	202.22
652.977	156.1
653.385	182.8
653.793	204.65
654.201	151.25
654.609	143.96
655.017	92.99
655.425	88.14
655.833	117.27
656.241	136.68
656.649	151.25
657.057	151.25
657.464	78.43
657.872	175.52
658.28	80.86
658.687	158.53
659.095	153.67
659.502	131.83
659.91	126.97
660.317	129.4
660.724	153.67
661.132	126.97
661.539	192.51
661.946	134.26
662.353	177.95
662.76	134.26
663.167	134.26
663.574	151.25
663.981	114.84
664.388	153.67
664.795	134.26
665.202	95.42
665.608	76
666.015	170.66
666.422	185.23
666.828	63.87
667.235	146.39
667.641	141.54
668.047	143.96
668.454	151.25
668.86	102.7
669.266	197.36
669.673	122.12
670.079	156.1
670.485	124.55
670.891	51.73
671.297	136.68
671.703	100.27
672.109	114.84
672.515	131.83
672.92	122.12
673.326	126.97
673.732	131.83
674.138	139.11
674.543	95.42
674.949	112.41
675.354	180.37
675.76	134.26
676.165	143.96
676.57	177.95
676.976	177.95
677.381	129.4
677.786	173.09
678.191	122.12
678.596	122.12
679.001	187.65
679.406	112.41
679.811	146.39
680.216	124.55
680.621	146.39
681.026	170.66
681.43	112.41
681.835	119.69
682.24	156.1
682.644	170.66
683.049	112.41
683.453	112.41
683.858	151.25
684.262	141.54
684.667	92.99
685.071	158.53
685.475	114.84
685.879	107.56
686.283	165.81
686.687	216.78
687.091	197.36
687.495	134.26
687.899	199.79
688.303	146.39
688.707	160.96
689.111	134.26
689.514	173.09
689.918	158.53
690.322	136.68
690.725	136.68
691.129	151.25
691.532	170.66
691.936	197.36
692.339	158.53
692.742	97.85
693.146	190.08
693.549	192.51
693.952	136.68
694.355	129.4
694.758	117.27
695.161	185.23
695.564	151.25
695.967	185.23
696.37	216.78
696.773	114.84
697.175	170.66
697.578	148.82
697.981	180.37
698.383	224.06
698.786	153.67
699.188	134.26
699.591	141.54
699.993	136.68
700.395	168.24
700.798	122.12
701.2	102.7
701.602	80.86
702.004	109.98
702.406	168.24
702.808	143.96
703.21	180.37
703.612	165.81
704.014	170.66
704.416	102.7
704.818	190.08
705.219	97.85
705.621	180.37
706.023	122.12
706.424	168.24
706.826	241.05
707.227	136.68
707.629	148.82
708.03	224.06
708.431	187.65
708.832	177.95
709.234	143.96
709.635	224.06
710.036	182.8
710.437	202.22
710.838	92.99
711.239	219.21
711.64	185.23
712.041	177.95
712.441	277.46
712.842	143.96
713.243	233.77
713.643	199.79
714.044	207.07
714.445	165.81
714.845	197.36
715.246	214.35
715.646	192.51
716.046	173.09
716.447	233.77
716.847	241.05
717.247	197.36
717.647	194.94
718.047	219.21
718.447	204.65
718.847	214.35
719.247	224.06
719.647	231.34
720.047	185.23
720.446	209.5
720.846	151.25
721.246	245.91
721.645	226.49
722.045	180.37
722.444	253.19
722.844	304.16
723.243	267.75
723.643	219.21
724.042	299.31
724.441	311.44
724.84	279.89
725.24	323.58
725.639	277.46
726.038	211.93
726.437	311.44
726.836	386.69
727.234	306.59
727.633	330.86
728.032	299.31
728.431	352.71
728.83	384.26
729.228	328.43
729.627	457.08
730.025	461.93
730.424	447.37
730.822	481.35
731.22	554.17
731.619	578.44
732.017	663.39
732.415	643.97
732.813	741.06
733.212	750.77
733.61	753.2
734.008	884.27
734.406	930.38
734.803	1042.04
735.201	1061.45
735.599	1153.69
735.997	1119.71
736.395	1185.24
736.792	1284.76
737.19	1330.88
737.587	1461.95
737.985	1410.97
738.382	1505.64
738.78	1702.24
739.177	1755.64
739.574	1823.6
739.971	1860.01
740.369	2020.21
740.766	2059.04
741.163	2025.06
741.56	2236.23
741.957	2372.15
742.354	2326.04
742.751	2476.53
743.147	2600.31
743.544	2617.3
743.941	2799.35
744.338	2891.58
744.734	3148.87
745.131	3192.56
745.527	3539.65
745.924	3811.5
746.32	3976.55
746.716	3954.7
747.113	4282.38
747.509	4736.27
747.905	5037.24
748.301	5197.44
748.697	5403.76
749.093	5500.84
749.489	5913.47
749.885	6301.83
750.281	6733.87
750.677	6850.38
751.073	6979.02
751.468	7073.68
751.864	7884.38
752.26	8253.31
752.655	8491.18
753.051	8653.81
753.446	9042.16
753.842	9204.79
754.237	9940.23
754.632	9974.21
755.028	9702.37
755.423	9767.9
755.818	9966.93
756.213	10265.48
756.608	10588.3
757.003	10044.6
757.398	9855.28
757.793	9818.87
758.188	9998.49
758.583	10549.47
758.977	10590.73
759.372	10680.54
759.767	11248.51
760.161	11998.52
760.556	13192.71
760.95	13632.04
761.345	14248.55
761.739	14930.6
762.133	15493.72
762.527	16704.9
762.922	17724.34
763.316	18678.23
763.71	18183.08
764.104	18231.62
764.498	20110.29
764.892	20615.16
765.286	21491.38
765.68	21469.54
766.073	21374.88
766.467	21348.18
766.861	23627.34
767.255	25467.17
767.648	26044.85
768.042	25554.55
768.435	25887.08
768.829	26661.37
769.222	27775.46
769.615	29328.88
770.008	28379.84
770.402	27379.83
770.795	27309.44
771.188	28661.4
771.581	28777.91
771.974	28217.22
772.367	27207.49
772.76	27411.38
773.153	25967.18
773.545	25913.78
773.938	26967.2
774.331	26573.99
774.724	25828.83
775.116	26440.49
775.509	27739.05
775.901	30282.78
776.294	31610.47
776.686	32637.19
777.078	31855.62
777.471	32399.32
777.863	34814.41
778.255	36244.04
778.647	36899.39
779.039	37620.28
779.431	35821.7
779.823	35892.09
780.215	37088.71
780.607	38474.66
780.999	39746.52
781.39	38537.77
781.782	38125.14
782.174	37644.55
782.565	39770.79
782.957	41528.1
783.348	42217.43
783.74	41244.12
784.131	39122.73
784.522	39933.42
784.914	40431
785.305	41062.08
785.696	40214.98
786.087	38960.1
786.478	36882.4
786.869	34896.93
787.26	35705.2
787.651	35239.17
788.042	33683.32
788.433	30950.27
788.823	29523.06
789.214	28493.92
789.605	28151.68
789.995	26848.26
790.386	25452.61
790.776	24532.69
791.167	23877.34
791.557	24782.7
791.948	26248.74
792.338	27297.3
792.728	27867.7
793.118	27654.1
793.508	27792.45
793.898	28680.82
794.288	30527.93
794.678	29913.85
795.068	29132.28
795.458	27683.23
795.848	27236.62
796.238	27489.05
796.627	28979.36
797.017	29049.75
797.406	28370.13
797.796	28078.87
798.185	28030.32
798.575	28591.01
798.964	29962.39
799.354	30950.27
799.743	30377.44
800.132	29404.13
800.521	29336.17
800.91	29979.38
801.299	31013.38
801.688	31535.23
802.077	30476.96
802.466	29525.49
802.855	28641.98
803.244	28297.32
803.633	28870.14
804.021	28858
804.41	28100.71
804.799	26173.5
805.187	24984.16
805.576	23785.11
805.964	23967.15
806.352	22768.1
806.741	22459.85
807.129	21355.46
807.517	20981.67
807.905	20845.74
808.293	21731.68
808.681	22714.7
809.069	22666.16
809.457	23200.15
809.845	22797.23
810.233	22787.52
810.621	23430.73
811.009	23930.74
811.396	24214.73
811.784	24287.54
812.171	23430.73
812.559	23178.3
812.946	22935.58
813.334	23083.64
813.721	23406.46
814.108	22726.84
814.496	22387.03
814.883	20865.16
815.27	21719.54
815.657	22804.51
816.044	23008.4
816.431	22986.55
816.818	22697.71
817.205	21855.47
817.592	21954.98
817.979	22192.85
818.365	22095.76
818.752	21823.91
819.139	20884.58
819.525	20265.64
819.912	19428.25
820.298	19027.75
820.685	18933.09
821.071	18399.1
821.457	17746.18
821.843	16624.8
822.23	15323.81
822.616	14568.95
823.002	14071.37
823.388	13668.45
823.774	13153.88
824.16	12374.74
824.546	11736.38
824.931	11289.77
825.317	11277.63
825.703	11440.26
826.089	11432.98
826.474	11153.84
826.86	11132
827.245	10799.47
827.631	10384.42
828.016	10685.39
828.401	10527.62
828.787	10369.85
829.172	9979.07
829.557	9483.92
829.942	9238.77
830.327	8935.36
830.712	9061.58
831.097	8544.58
831.482	8362.54
831.867	7988.75
832.252	7787.29
832.636	7665.93
833.021	7864.96
833.406	7971.76
833.79	7801.85
834.175	7231.45
834.559	7287.28
834.944	6954.75
835.328	6940.19
835.713	7141.65
836.097	6942.61
836.481	6590.67
836.865	6083.38
837.249	5724.15
837.633	5389.19
838.017	5437.74
838.401	5095.5
838.785	5085.79
839.169	5088.22
839.553	4775.1
839.937	4364.9
840.32	3937.71
840.704	3799.36
841.087	3580.91
841.471	3449.84
841.854	3301.78
842.238	3049.35
842.621	3073.62
843.004	2828.47
843.388	3119.74
843.771	2935.27
844.154	2845.46
844.537	3027.5
844.92	2850.32
845.303	2617.3
845.686	2694.98
846.069	2687.69
846.452	2600.31
846.834	2685.27
847.217	2644
847.6	2420.7
847.982	2423.13
848.365	2328.46
848.748	2304.19
849.13	2432.84
849.512	2224.09
849.895	2236.23
850.277	2209.53
850.659	2112.44
851.041	2141.57
851.423	2221.67
851.806	2034.77
852.188	2093.02
852.57	2054.19
852.951	1910.98
853.333	1952.25
853.715	1889.14
854.097	1872.15
854.479	1923.12
854.86	1843.02
855.242	1779.91
855.623	1590.59
856.005	1457.09
856.386	1522.63
856.768	1440.1
857.149	1457.09
857.53	1311.46
857.911	1168.25
858.292	1158.54
858.674	1134.27
859.055	1078.45
859.436	1049.32
859.817	1032.33
860.197	957.08
860.578	862.42
860.959	830.87
861.34	813.88
861.72	864.85
862.101	726.5
862.482	792.03
862.862	775.04
863.243	697.37
863.623	755.62
864.003	619.7
864.384	658.54
864.764	626.98
865.144	602.71
865.524	597.86
865.904	595.43
866.284	505.62
866.664	612.42
867.044	573.58
867.424	495.91
867.804	500.77
868.183	464.36
868.563	459.5
868.943	534.75
869.322	430.38
869.702	432.8
870.081	340.57
870.461	430.38
870.84	352.71
871.22	313.87
871.599	364.84
871.978	391.54
872.357	369.7
872.736	352.71
873.115	345.42
873.494	323.58
873.873	364.84
874.252	313.87
874.631	228.92
875.01	282.32
875.388	214.35
875.767	282.32
876.146	211.93
876.524	241.05
876.903	173.09
877.281	185.23
877.66	233.77
878.038	185.23
878.416	224.06
878.794	173.09
879.173	241.05
879.551	258.04
879.929	173.09
880.307	180.37
880.685	180.37
881.063	173.09
881.441	175.52
881.818	177.95
882.196	126.97
882.574	192.51
882.951	139.11
883.329	124.55
883.707	190.08
884.084	194.94
884.461	170.66
884.839	151.25
885.216	143.96
885.593	97.85
885.971	211.93
886.348	231.34
886.725	139.11
887.102	197.36
887.479	165.81
887.856	117.27
888.233	122.12
888.609	194.94
888.986	173.09
889.363	68.72
889.74	185.23
890.116	148.82
890.493	153.67
890.869	143.96
891.246	258.04
891.622	114.84
891.998	109.98
892.375	151.25
892.751	153.67
893.127	160.96
893.503	160.96
893.879	59.01
894.255	177.95
894.631	148.82
895.007	107.56
895.383	134.26
895.759	117.27
896.134	168.24
896.51	216.78
896.886	228.92
897.261	129.4
897.637	194.94
898.012	66.29
898.388	141.54
898.763	141.54
899.138	156.1
899.514	42.02
899.889	192.51
900.264	148.82
900.639	241.05
901.014	85.71
901.389	95.42
901.764	105.13
902.139	134.26
902.513	100.27
902.888	146.39
903.263	151.25
903.638	97.85
904.012	114.84
904.387	97.85
904.761	124.55
905.136	151.25
905.51	109.98
905.884	126.97
906.259	102.7
906.633	109.98
907.007	131.83
907.381	151.25
907.755	148.82
908.129	126.97
908.503	107.56
908.877	100.27
909.251	124.55
909.624	97.85
909.998	126.97
910.372	109.98
910.745	100.27
911.119	124.55
911.492	122.12
911.866	134.26
912.239	197.36
912.612	107.56
912.986	156.1
913.359	80.86
913.732	90.57
914.105	148.82
914.478	59.01
914.851	146.39
915.224	175.52
915.597	122.12
915.97	80.86
916.343	170.66
916.715	156.1
917.088	88.14
917.461	114.84
917.833	102.7
918.206	187.65
918.578	95.42
918.951	151.25
919.323	112.41
919.695	143.96
920.067	97.85
920.44	51.73
920.812	126.97
921.184	168.24
921.556	175.52
921.928	51.73
922.3	109.98
922.672	129.4
923.043	143.96
923.415	141.54
923.787	160.96
924.158	139.11
924.53	158.53
924.901	54.16
925.273	139.11
925.644	153.67
926.016	146.39
926.387	190.08
926.758	139.11
927.129	112.41
927.5	131.83
927.872	83.28
928.243	139.11
928.613	119.69
928.984	143.96
929.355	126.97
929.726	88.14
930.097	85.71
930.467	63.87
930.838	148.82
931.209	76
931.579	194.94
931.95	66.29
932.32	71.15
932.69	151.25
933.061	158.53
933.431	180.37
933.801	158.53
934.171	139.11
934.541	141.54
934.911	204.65
935.281	139.11
935.651	175.52
936.021	105.13
936.391	71.15
936.761	66.29
937.13	107.56
937.5	153.67
937.87	112.41
938.239	177.95
938.609	114.84
938.978	139.11
939.347	202.22
939.717	151.25
940.086	119.69
940.455	187.65
940.824	10.47
941.193	143.96
941.562	177.95
941.931	146.39
942.3	131.83
942.669	119.69
943.038	61.44
943.407	97.85
943.775	117.27
944.144	158.53
944.513	107.56
944.881	148.82
945.25	160.96
945.618	51.73
945.986	117.27
946.355	173.09
946.723	141.54
947.091	163.38
947.459	126.97
947.827	124.55
948.195	141.54
948.563	139.11
948.931	100.27
949.299	134.26
949.667	27.46
950.035	156.1
950.402	151.25
950.77	80.86
951.138	114.84
951.505	122.12
951.873	136.68
952.24	112.41
952.607	63.87
952.975	97.85
953.342	170.66
953.709	126.97
954.076	105.13
954.443	148.82
954.81	168.24
955.177	160.96
955.544	112.41
955.911	117.27
956.278	156.1
956.645	207.07
957.012	95.42
957.378	168.24
957.745	160.96
958.111	68.72
958.478	160.96
958.844	197.36
959.211	211.93
959.577	100.27
959.943	126.97
960.309	216.78
960.675	160.96
961.042	136.68
961.408	88.14
961.774	131.83
962.139	124.55
962.505	95.42
962.871	61.44
963.237	109.98
963.603	102.7
963.968	100.27
964.334	112.41
964.699	114.84
965.065	190.08
965.43	90.57
965.796	92.99
966.161	78.43
966.526	129.4
966.891	177.95
967.256	158.53
967.622	105.13
967.987	226.49
968.352	182.8
968.716	88.14
969.081	90.57
969.446	95.42
969.811	146.39
970.176	156.1
970.54	153.67
970.905	168.24
971.269	146.39
971.634	173.09
971.998	131.83
972.363	114.84
972.727	78.43
973.091	134.26
973.455	126.97
973.819	66.29
974.183	83.28
974.547	97.85
974.911	141.54
975.275	182.8
975.639	143.96
976.003	148.82
976.367	92.99
976.73	158.53
977.094	180.37
977.458	163.38
977.821	134.26
978.185	92.99
978.548	122.12
978.911	85.71
979.275	90.57
979.638	148.82
980.001	163.38
980.364	112.41
980.727	165.81
981.09	46.88
981.453	219.21
981.816	90.57
982.179	88.14
982.542	68.72
982.905	134.26
983.267	76
983.63	160.96
983.992	192.51
984.355	148.82
984.717	156.1
985.08	117.27
985.442	105.13
985.804	146.39
986.167	114.84
986.529	117.27
986.891	129.4
987.253	168.24
987.615	122.12
987.977	39.59
988.339	92.99
988.701	122.12
989.062	90.57
989.424	83.28
989.786	216.78
990.147	160.96
990.509	199.79
990.87	107.56
991.232	141.54
991.593	165.81
991.955	114.84
992.316	80.86
992.677	85.71
993.038	95.42
993.399	134.26
993.76	141.54
994.121	114.84
994.482	146.39
994.843	146.39
995.204	122.12
995.565	146.39
995.926	131.83
996.286	160.96
996.647	129.4
997.007	117.27
997.368	146.39
997.728	78.43
998.089	143.96
998.449	136.68
998.809	241.05
999.169	126.97
999.53	146.39
999.89	175.52
1000.25	122.12
1000.61	160.96
1000.97	102.7
1001.329	85.71
1001.689	139.11
1002.049	76
1002.409	131.83
1002.768	136.68
1003.128	71.15
1003.487	151.25
1003.847	153.67
1004.206	112.41
1004.566	170.66
1004.925	100.27
1005.284	102.7
1005.643	44.45
1006.003	100.27
1006.362	197.36
1006.721	97.85
1007.08	83.28
1007.438	88.14
1007.797	146.39
1008.156	83.28
1008.515	141.54
1008.874	158.53
1009.232	185.23
1009.591	163.38
1009.949	165.81
1010.308	156.1
1010.666	139.11
1011.024	107.56
1011.383	44.45
1011.741	95.42
1012.099	122.12
1012.457	139.11
1012.815	56.58
1013.173	83.28
1013.531	170.66
1013.889	165.81
1014.247	107.56
1014.605	95.42
1014.962	88.14
1015.32	134.26
1015.678	119.69
1016.035	182.8
1016.393	83.28
1016.75	129.4
1017.107	117.27
1017.465	156.1
1017.822	182.8
1018.179	177.95
1018.536	153.67
1018.894	192.51
1019.251	158.53
1019.608	122.12
1019.964	112.41
1020.321	85.71
1020.678	158.53
1021.035	173.09
1021.392	158.53
1021.748	68.72
1022.105	68.72
1022.461	114.84
1022.818	158.53
1023.174	109.98
1023.531	197.36
1023.887	102.7
1024.243	141.54
1024.599	175.52
1024.955	85.71
1025.311	156.1
1025.667	129.4
1026.023	158.53
1026.379	112.41
1026.735	148.82
1027.091	100.27
1027.447	105.13
