189.514	140.17
189.973	140.17
190.431	140.17
190.889	-34.59
191.348	-51.58
191.806	-12.74
192.264	-0.61
192.722	-17.6
193.18	16.38
193.638	-78.28
194.096	-7.89
194.554	-3.03
195.012	33.37
195.47	-7.89
195.928	-32.16
196.385	40.66
196.843	-3.03
197.301	33.37
197.758	1.82
198.216	-95.27
198.674	57.65
199.131	62.5
199.589	74.64
200.046	23.67
200.503	91.63
200.961	128.04
201.418	128.04
201.875	81.92
202.332	169.3
202.79	52.79
203.247	191.14
203.704	203.28
204.161	125.61
204.618	108.62
205.075	169.3
205.532	159.59
205.989	103.76
206.445	94.05
206.902	166.87
207.359	183.86
207.816	220.27
208.272	159.59
208.729	79.49
209.185	239.69
209.642	96.48
210.098	130.46
210.555	212.99
211.011	120.75
211.467	186.29
211.924	154.74
212.38	183.86
212.836	217.84
213.292	159.59
213.748	115.9
214.204	108.62
214.66	154.74
215.116	159.59
215.572	137.74
216.028	193.57
216.484	86.77
216.94	183.86
217.396	140.17
217.851	135.32
218.307	135.32
218.763	268.81
219.218	140.17
219.674	120.75
220.129	113.47
220.585	130.46
221.04	130.46
221.496	149.88
221.951	200.85
222.406	193.57
222.861	130.46
223.317	142.6
223.772	157.16
224.227	113.47
224.682	96.48
225.137	147.45
225.592	188.72
226.047	101.34
226.502	118.33
226.957	120.75
227.411	171.73
227.866	128.04
228.321	164.44
228.776	152.31
229.23	154.74
229.685	166.87
230.139	111.05
230.594	220.27
231.048	98.91
231.503	152.31
231.957	208.13
232.411	159.59
232.865	179.01
233.32	154.74
233.774	188.72
234.228	135.32
234.682	132.89
235.136	106.19
235.59	145.03
236.044	135.32
236.498	159.59
236.952	135.32
237.406	198.43
237.86	128.04
238.313	162.02
238.767	162.02
239.221	125.61
239.674	103.76
240.128	193.57
240.581	128.04
241.035	106.19
241.488	115.9
241.942	159.59
242.395	157.16
242.848	162.02
243.301	149.88
243.755	152.31
244.208	200.85
244.661	149.88
245.114	77.06
245.567	81.92
246.02	113.47
246.473	137.74
246.926	115.9
247.379	111.05
247.832	142.6
248.284	135.32
248.737	137.74
249.19	179.01
249.642	217.84
250.095	115.9
250.547	210.56
251	164.44
251.452	118.33
251.905	186.29
252.357	142.6
252.81	154.74
253.262	157.16
253.714	149.88
254.166	101.34
254.618	212.99
255.07	174.15
255.523	113.47
255.975	128.04
256.427	128.04
256.878	67.36
257.33	196
257.782	164.44
258.234	162.02
258.686	166.87
259.137	164.44
259.589	159.59
260.041	147.45
260.492	137.74
260.944	164.44
261.395	79.49
261.847	140.17
262.298	128.04
262.749	159.59
263.201	171.73
263.652	164.44
264.103	149.88
264.554	149.88
265.005	164.44
265.457	179.01
265.908	125.61
266.359	128.04
266.809	196
267.26	135.32
267.711	188.72
268.162	130.46
268.613	171.73
269.064	147.45
269.514	120.75
269.965	174.15
270.415	169.3
270.866	103.76
271.316	159.59
271.767	118.33
272.217	179.01
272.668	120.75
273.118	130.46
273.568	227.55
274.019	200.85
274.469	169.3
274.919	123.18
275.369	135.32
275.819	164.44
276.269	74.64
276.719	154.74
277.169	179.01
277.619	98.91
278.069	118.33
278.518	205.71
278.968	147.45
279.418	188.72
279.867	123.18
280.317	154.74
280.767	135.32
281.216	198.43
281.666	210.56
282.115	183.86
282.564	157.16
283.014	169.3
283.463	101.34
283.912	111.05
284.361	128.04
284.811	91.63
285.26	135.32
285.709	98.91
286.158	198.43
286.607	159.59
287.056	86.77
287.505	205.71
287.953	137.74
288.402	137.74
288.851	89.2
289.3	120.75
289.748	91.63
290.197	164.44
290.646	135.32
291.094	111.05
291.543	205.71
291.991	179.01
292.439	154.74
292.888	242.12
293.336	220.27
293.784	174.15
294.233	86.77
294.681	186.29
295.129	157.16
295.577	227.55
296.025	106.19
296.473	120.75
296.921	171.73
297.369	157.16
297.817	145.03
298.264	254.25
298.712	191.14
299.16	123.18
299.608	125.61
300.055	159.59
300.503	176.58
300.95	166.87
301.398	229.98
301.845	176.58
302.293	152.31
302.74	149.88
303.187	232.41
303.635	188.72
304.082	193.57
304.529	135.32
304.976	157.16
305.423	159.59
305.87	147.45
306.317	72.21
306.764	140.17
307.211	176.58
307.658	84.35
308.105	137.74
308.552	186.29
308.998	147.45
309.445	123.18
309.892	108.62
310.338	179.01
310.785	145.03
311.231	181.43
311.678	162.02
312.124	181.43
312.571	101.34
313.017	149.88
313.463	123.18
313.909	145.03
314.356	101.34
314.802	142.6
315.248	145.03
315.694	147.45
316.14	186.29
316.586	55.22
317.032	147.45
317.478	171.73
317.923	140.17
318.369	101.34
318.815	140.17
319.261	130.46
319.706	152.31
320.152	142.6
320.597	111.05
321.043	164.44
321.488	244.54
321.934	203.28
322.379	123.18
322.824	171.73
323.27	166.87
323.715	120.75
324.16	132.89
324.605	169.3
325.05	111.05
325.495	108.62
325.94	152.31
326.385	149.88
326.83	191.14
327.275	159.59
327.72	135.32
328.165	120.75
328.61	137.74
329.054	171.73
329.499	181.43
329.943	152.31
330.388	101.34
330.832	135.32
331.277	149.88
331.721	188.72
332.166	132.89
332.61	142.6
333.054	147.45
333.499	193.57
333.943	152.31
334.387	169.3
334.831	193.57
335.275	123.18
335.719	188.72
336.163	164.44
336.607	181.43
337.051	200.85
337.495	188.72
337.938	246.97
338.382	186.29
338.826	81.92
339.269	45.51
339.713	103.76
340.157	154.74
340.6	152.31
341.044	149.88
341.487	149.88
341.93	164.44
342.374	191.14
342.817	232.41
343.26	179.01
343.703	246.97
344.146	193.57
344.59	103.76
345.033	130.46
345.476	242.12
345.919	145.03
346.361	135.32
346.804	130.46
347.247	179.01
347.69	145.03
348.133	149.88
348.575	145.03
349.018	191.14
349.461	203.28
349.903	154.74
350.346	152.31
350.788	118.33
351.23	152.31
351.673	106.19
352.115	135.32
352.557	246.97
353	135.32
353.442	149.88
353.884	106.19
354.326	159.59
354.768	115.9
355.21	232.41
355.652	120.75
356.094	81.92
356.536	164.44
356.978	120.75
357.419	164.44
357.861	98.91
358.303	130.46
358.744	154.74
359.186	149.88
359.627	169.3
360.069	237.26
360.51	115.9
360.952	147.45
361.393	149.88
361.834	157.16
362.276	140.17
362.717	181.43
363.158	140.17
363.599	164.44
364.04	123.18
364.481	147.45
364.922	145.03
365.363	86.77
365.804	169.3
366.245	191.14
366.686	108.62
367.126	191.14
367.567	169.3
368.008	193.57
368.448	193.57
368.889	169.3
369.33	115.9
369.77	169.3
370.21	227.55
370.651	130.46
371.091	123.18
371.531	118.33
371.972	152.31
372.412	145.03
372.852	140.17
373.292	159.59
373.732	108.62
374.172	135.32
374.612	106.19
375.052	171.73
375.492	81.92
375.932	145.03
376.372	157.16
376.811	166.87
377.251	77.06
377.691	149.88
378.13	169.3
378.57	157.16
379.009	242.12
379.449	220.27
379.888	89.2
380.328	142.6
380.767	212.99
381.206	132.89
381.645	123.18
382.085	145.03
382.524	120.75
382.963	164.44
383.402	188.72
383.841	145.03
384.28	62.5
384.719	162.02
385.158	123.18
385.596	154.74
386.035	111.05
386.474	103.76
386.913	196
387.351	152.31
387.79	159.59
388.228	162.02
388.667	215.42
389.105	128.04
389.544	183.86
389.982	130.46
390.42	137.74
390.859	152.31
391.297	91.63
391.735	152.31
392.173	101.34
392.611	96.48
393.049	191.14
393.487	79.49
393.925	174.15
394.363	188.72
394.801	115.9
395.239	142.6
395.676	217.84
396.114	166.87
396.552	261.53
396.989	152.31
397.427	149.88
397.864	108.62
398.302	159.59
398.739	137.74
399.177	142.6
399.614	101.34
400.051	171.73
400.488	103.76
400.926	162.02
401.363	149.88
401.8	147.45
402.237	186.29
402.674	142.6
403.111	176.58
403.548	120.75
403.985	159.59
404.421	137.74
404.858	118.33
405.295	157.16
405.732	147.45
406.168	130.46
406.605	145.03
407.041	191.14
407.478	67.36
407.914	157.16
408.351	181.43
408.787	86.77
409.223	234.83
409.66	159.59
410.096	74.64
410.532	140.17
410.968	162.02
411.404	101.34
411.84	212.99
412.276	203.28
412.712	205.71
413.148	159.59
413.584	159.59
414.02	113.47
414.455	111.05
414.891	217.84
415.327	162.02
415.762	79.49
416.198	154.74
416.633	140.17
417.069	159.59
417.504	154.74
417.94	208.13
418.375	132.89
418.81	152.31
419.245	123.18
419.681	123.18
420.116	212.99
420.551	183.86
420.986	137.74
421.421	84.35
421.856	118.33
422.291	140.17
422.726	147.45
423.16	152.31
423.595	229.98
424.03	115.9
424.464	159.59
424.899	145.03
425.334	125.61
425.768	142.6
426.203	125.61
426.637	84.35
427.071	125.61
427.506	101.34
427.94	91.63
428.374	181.43
428.809	164.44
429.243	135.32
429.677	111.05
430.111	142.6
430.545	210.56
430.979	108.62
431.413	162.02
431.847	86.77
432.28	171.73
432.714	162.02
433.148	118.33
433.582	118.33
434.015	176.58
434.449	191.14
434.882	98.91
435.316	142.6
435.749	118.33
436.183	142.6
436.616	103.76
437.049	186.29
437.483	147.45
437.916	106.19
438.349	162.02
438.782	179.01
439.215	147.45
439.648	169.3
440.081	212.99
440.514	154.74
440.947	208.13
441.38	227.55
441.813	176.58
442.245	147.45
442.678	111.05
443.111	220.27
443.543	152.31
443.976	128.04
444.408	149.88
444.841	205.71
445.273	101.34
445.705	200.85
446.138	181.43
446.57	179.01
447.002	174.15
447.434	239.69
447.867	152.31
448.299	183.86
448.731	120.75
449.163	196
449.595	169.3
450.026	256.68
450.458	191.14
450.89	186.29
451.322	222.7
451.754	198.43
452.185	196
452.617	140.17
453.048	162.02
453.48	179.01
453.911	157.16
454.343	208.13
454.774	191.14
455.205	237.26
455.637	183.86
456.068	130.46
456.499	196
456.93	108.62
457.361	147.45
457.792	217.84
458.223	196
458.654	186.29
459.085	145.03
459.516	225.12
459.947	169.3
460.378	181.43
460.808	188.72
461.239	222.7
461.669	203.28
462.1	285.81
462.531	171.73
462.961	149.88
463.391	198.43
463.822	159.59
464.252	229.98
464.682	157.16
465.113	162.02
465.543	152.31
465.973	174.15
466.403	140.17
466.833	193.57
467.263	188.72
467.693	132.89
468.123	251.82
468.553	179.01
468.983	205.71
469.412	166.87
469.842	74.64
470.272	225.12
470.701	208.13
471.131	215.42
471.56	142.6
471.99	164.44
472.419	132.89
472.849	183.86
473.278	159.59
473.707	57.65
474.136	147.45
474.566	196
474.995	137.74
475.424	196
475.853	169.3
476.282	210.56
476.711	113.47
477.14	251.82
477.569	210.56
477.997	174.15
478.426	140.17
478.855	86.77
479.283	169.3
479.712	193.57
480.141	166.87
480.569	210.56
480.998	89.2
481.426	169.3
481.854	196
482.283	132.89
482.711	242.12
483.139	220.27
483.567	174.15
483.995	149.88
484.424	203.28
484.852	196
485.28	210.56
485.708	174.15
486.135	191.14
486.563	130.46
486.991	89.2
487.419	142.6
487.847	227.55
488.274	179.01
488.702	179.01
489.129	196
489.557	198.43
489.984	181.43
490.412	147.45
490.839	179.01
491.266	128.04
491.694	159.59
492.121	232.41
492.548	208.13
492.975	166.87
493.402	169.3
493.829	91.63
494.256	159.59
494.683	147.45
495.11	164.44
495.537	220.27
495.964	166.87
496.39	166.87
496.817	157.16
497.244	128.04
497.67	91.63
498.097	159.59
498.523	103.76
498.95	149.88
499.376	186.29
499.803	145.03
500.229	179.01
500.655	179.01
501.081	152.31
501.508	145.03
501.934	203.28
502.36	120.75
502.786	154.74
503.212	137.74
503.638	212.99
504.064	157.16
504.489	130.46
504.915	162.02
505.341	212.99
505.767	183.86
506.192	251.82
506.618	217.84
507.043	106.19
507.469	220.27
507.894	166.87
508.32	176.58
508.745	84.35
509.17	157.16
509.596	198.43
510.021	166.87
510.446	147.45
510.871	166.87
511.296	215.42
511.721	154.74
512.146	176.58
512.571	239.69
512.996	215.42
513.421	193.57
513.845	210.56
514.27	225.12
514.695	196
515.119	130.46
515.544	94.05
515.969	145.03
516.393	188.72
516.817	169.3
517.242	229.98
517.666	162.02
518.09	164.44
518.515	147.45
518.939	171.73
519.363	368.33
519.787	229.98
520.211	154.74
520.635	259.11
521.059	164.44
521.483	174.15
521.907	152.31
522.331	137.74
522.754	174.15
523.178	106.19
523.602	188.72
524.025	171.73
524.449	210.56
524.872	162.02
525.296	159.59
525.719	179.01
526.143	217.84
526.566	203.28
526.989	162.02
527.412	157.16
527.836	198.43
528.259	188.72
528.682	140.17
529.105	188.72
529.528	152.31
529.951	171.73
530.374	171.73
530.796	147.45
531.219	186.29
531.642	103.76
532.065	159.59
532.487	169.3
532.91	140.17
533.332	164.44
533.755	135.32
534.177	164.44
534.6	169.3
535.022	222.7
535.444	191.14
535.867	171.73
536.289	164.44
536.711	132.89
537.133	188.72
537.555	212.99
537.977	132.89
538.399	225.12
538.821	186.29
539.243	135.32
539.665	191.14
540.086	159.59
540.508	176.58
540.93	181.43
541.351	217.84
541.773	203.28
542.195	183.86
542.616	210.56
543.037	159.59
543.459	234.83
543.88	152.31
544.301	140.17
544.723	208.13
545.144	164.44
545.565	142.6
545.986	208.13
546.407	203.28
546.828	166.87
547.249	135.32
547.67	232.41
548.091	237.26
548.512	210.56
548.932	217.84
549.353	179.01
549.774	200.85
550.194	132.89
550.615	186.29
551.035	196
551.456	142.6
551.876	164.44
552.296	154.74
552.717	186.29
553.137	137.74
553.557	210.56
553.977	91.63
554.397	149.88
554.817	200.85
555.237	225.12
555.657	162.02
556.077	176.58
556.497	174.15
556.917	152.31
557.337	222.7
557.756	212.99
558.176	179.01
558.596	179.01
559.015	193.57
559.435	152.31
559.854	118.33
560.274	152.31
560.693	234.83
561.112	98.91
561.532	200.85
561.951	198.43
562.37	157.16
562.789	179.01
563.208	125.61
563.627	174.15
564.046	242.12
564.465	196
564.884	154.74
565.303	149.88
565.722	159.59
566.14	142.6
566.559	157.16
566.978	171.73
567.396	198.43
567.815	186.29
568.233	86.77
568.652	210.56
569.07	120.75
569.489	89.2
569.907	171.73
570.325	123.18
570.743	118.33
571.161	130.46
571.58	181.43
571.998	145.03
572.416	174.15
572.833	128.04
573.251	149.88
573.669	251.82
574.087	198.43
574.505	157.16
574.922	140.17
575.34	152.31
575.758	171.73
576.175	142.6
576.593	135.32
577.01	188.72
577.428	162.02
577.845	1290.68
578.262	278.52
578.68	225.12
579.097	140.17
579.514	125.61
579.931	152.31
580.348	174.15
580.765	120.75
581.182	222.7
581.599	174.15
582.016	135.32
582.433	135.32
582.849	135.32
583.266	152.31
583.683	115.9
584.099	145.03
584.516	135.32
584.933	145.03
585.349	198.43
585.765	147.45
586.182	164.44
586.598	186.29
587.014	147.45
587.431	149.88
587.847	98.91
588.263	164.44
588.679	222.7
589.095	142.6
589.511	176.58
589.927	108.62
590.343	140.17
590.759	111.05
591.174	193.57
591.59	169.3
592.006	200.85
592.421	89.2
592.837	98.91
593.252	149.88
593.668	142.6
594.083	132.89
594.499	176.58
594.914	128.04
595.329	166.87
595.745	176.58
596.16	198.43
596.575	196
596.99	271.24
597.405	188.72
597.82	217.84
598.235	210.56
598.65	200.85
599.065	179.01
599.479	217.84
599.894	96.48
600.309	169.3
600.724	108.62
601.138	162.02
601.553	38.23
601.967	174.15
602.382	159.59
602.796	149.88
603.21	132.89
603.625	123.18
604.039	135.32
604.453	106.19
604.867	198.43
605.281	203.28
605.695	183.86
606.109	149.88
606.523	242.12
606.937	86.77
607.351	242.12
607.765	149.88
608.178	174.15
608.592	94.05
609.006	176.58
609.419	147.45
609.833	220.27
610.246	186.29
610.66	239.69
611.073	154.74
611.487	149.88
611.9	147.45
612.313	157.16
612.726	217.84
613.139	130.46
613.553	159.59
613.966	191.14
614.379	147.45
614.792	166.87
615.204	115.9
615.617	198.43
616.03	246.97
616.443	115.9
616.856	174.15
617.268	152.31
617.681	169.3
618.093	152.31
618.506	171.73
618.918	193.57
619.331	152.31
619.743	132.89
620.155	111.05
620.568	96.48
620.98	137.74
621.392	125.61
621.804	188.72
622.216	115.9
622.628	154.74
623.04	149.88
623.452	135.32
623.864	137.74
624.276	57.65
624.687	125.61
625.099	200.85
625.511	157.16
625.922	84.35
626.334	183.86
626.745	130.46
627.157	137.74
627.568	140.17
627.979	196
628.391	188.72
628.802	140.17
629.213	86.77
629.624	140.17
630.035	130.46
630.446	113.47
630.857	196
631.268	159.59
631.679	140.17
632.09	208.13
632.501	169.3
632.912	159.59
633.322	280.95
633.733	171.73
634.144	179.01
634.554	208.13
634.965	205.71
635.375	147.45
635.785	183.86
636.196	142.6
636.606	115.9
637.016	21.24
637.427	142.6
637.837	147.45
638.247	145.03
638.657	132.89
639.067	57.65
639.477	152.31
639.887	162.02
640.297	166.87
640.706	135.32
641.116	196
641.526	154.74
641.935	208.13
642.345	137.74
642.755	140.17
643.164	285.81
643.573	137.74
643.983	227.55
644.392	169.3
644.801	162.02
645.211	125.61
645.62	162.02
646.029	157.16
646.438	166.87
646.847	171.73
647.256	125.61
647.665	162.02
648.074	169.3
648.483	174.15
648.892	203.28
649.3	135.32
649.709	205.71
650.118	152.31
650.526	179.01
650.935	132.89
651.343	188.72
651.752	227.55
652.16	152.31
652.568	215.42
652.977	166.87
653.385	145.03
653.793	159.59
654.201	103.76
654.609	196
655.017	183.86
655.425	142.6
655.833	188.72
656.241	149.88
656.649	149.88
657.057	123.18
657.464	147.45
657.872	74.64
658.28	130.46
658.687	174.15
659.095	128.04
659.502	203.28
659.91	200.85
660.317	98.91
660.724	125.61
661.132	103.76
661.539	210.56
661.946	149.88
662.353	166.87
662.76	118.33
663.167	169.3
663.574	130.46
663.981	183.86
664.388	120.75
664.795	115.9
665.202	176.58
665.608	135.32
666.015	159.59
666.422	94.05
666.828	147.45
667.235	94.05
667.641	137.74
668.047	96.48
668.454	181.43
668.86	186.29
669.266	200.85
669.673	186.29
670.079	181.43
670.485	142.6
670.891	123.18
671.297	169.3
671.703	145.03
672.109	171.73
672.515	203.28
672.92	157.16
673.326	217.84
673.732	196
674.138	225.12
674.543	159.59
674.949	157.16
675.354	130.46
675.76	149.88
676.165	147.45
676.57	137.74
676.976	198.43
677.381	171.73
677.786	227.55
678.191	137.74
678.596	176.58
679.001	205.71
679.406	149.88
679.811	171.73
680.216	188.72
680.621	198.43
681.026	176.58
681.43	147.45
681.835	171.73
682.24	113.47
682.644	98.91
683.049	135.32
683.453	120.75
683.858	166.87
684.262	103.76
684.667	106.19
685.071	181.43
685.475	183.86
685.879	147.45
686.283	152.31
686.687	205.71
687.091	181.43
687.495	140.17
687.899	91.63
688.303	186.29
688.707	222.7
689.111	191.14
689.514	191.14
689.918	154.74
690.322	220.27
690.725	215.42
691.129	169.3
691.532	225.12
691.936	208.13
692.339	225.12
692.742	179.01
693.146	94.05
693.549	198.43
693.952	176.58
694.355	205.71
694.758	215.42
695.161	188.72
695.564	198.43
695.967	137.74
696.37	193.57
696.773	225.12
697.175	179.01
697.578	227.55
697.981	222.7
698.383	162.02
698.786	166.87
699.188	169.3
699.591	171.73
699.993	191.14
700.395	125.61
700.798	125.61
701.2	215.42
701.602	229.98
702.004	208.13
702.406	120.75
702.808	103.76
703.21	125.61
703.612	251.82
704.014	212.99
704.416	208.13
704.818	225.12
705.219	205.71
705.621	166.87
706.023	217.84
706.424	300.37
706.826	157.16
707.227	225.12
707.629	234.83
708.03	295.51
708.431	179.01
708.832	271.24
709.234	210.56
709.635	246.97
710.036	142.6
710.437	293.09
710.838	246.97
711.239	268.81
711.64	256.68
712.041	310.08
712.441	249.4
712.842	319.79
713.243	266.39
713.643	217.84
714.044	314.93
714.445	288.23
714.845	254.25
715.246	302.8
715.646	229.98
716.046	307.65
716.447	300.37
716.847	215.42
717.247	259.11
717.647	293.09
718.047	310.08
718.447	295.51
718.847	300.37
719.247	348.91
719.647	365.9
720.047	392.6
720.446	380.47
720.846	404.74
721.246	407.17
721.645	351.34
722.045	331.92
722.444	448.43
722.844	373.19
723.243	378.04
723.643	378.04
724.042	443.57
724.441	407.17
724.84	431.44
725.24	419.3
725.639	496.97
726.038	513.96
726.437	509.11
726.836	509.11
727.234	506.68
727.633	550.37
728.032	470.27
728.431	552.8
728.83	567.36
729.228	623.19
729.627	686.3
730.025	715.42
730.424	727.56
730.822	882.9
731.22	904.75
731.619	919.31
732.017	953.29
732.415	936.3
732.813	929.02
733.212	979.99
733.61	1120.77
734.008	1227.57
734.406	1443.59
734.803	1652.33
735.201	1841.65
735.599	1776.12
735.997	1666.89
736.395	1722.72
736.792	1623.2
737.19	1671.75
737.587	1754.27
737.985	2142.63
738.382	2419.33
738.78	2771.28
739.177	3225.17
739.574	3331.97
739.971	3254.3
740.369	2994.59
740.766	2912.06
741.163	2768.85
741.56	2664.48
741.957	2958.18
742.354	3613.53
742.751	4251.89
743.147	4761.6
743.544	4972.77
743.941	4790.73
744.338	4557.72
744.734	4050.43
745.131	3674.21
745.527	4006.74
745.924	4848.98
746.32	5688.8
746.716	7035.91
747.113	7511.65
747.509	7977.67
747.905	7545.63
748.301	6844.16
748.697	6157.26
749.093	6251.92
749.489	6739.79
749.885	8188.84
750.281	10038.38
750.677	11327.24
751.073	11836.96
751.468	11123.35
751.864	10339.36
752.26	9271.38
752.655	9179.15
753.051	9688.86
753.446	11511.71
753.842	13625.82
754.237	15363.71
754.632	15715.66
755.028	14980.21
755.423	13417.08
755.818	12164.63
756.213	11737.44
756.608	12392.79
757.003	14696.22
757.398	16788.49
757.793	17861.32
758.188	18174.43
758.583	16739.94
758.977	15179.24
759.372	13887.96
759.767	14540.88
760.161	17096.75
760.556	20747.29
760.95	23179.37
761.345	24514.34
761.739	24193.94
762.133	21769.15
762.527	20334.66
762.922	19742.42
763.316	21914.78
763.71	24980.36
764.104	28839.65
764.498	30572.68
764.892	29944.03
765.286	27291.08
765.68	24701.23
766.073	23825.01
766.467	25407.56
766.861	29786.26
767.255	34138.27
767.648	36351.9
768.042	35116.44
768.435	32645.53
768.829	29215.87
769.222	28499.84
769.615	31075.12
770.008	34584.88
770.402	37582.5
770.795	39759.72
771.188	38349.5
771.581	34303.32
771.974	30876.09
772.367	30181.9
772.76	32393.1
773.153	34990.23
773.545	38194.16
773.938	39233.01
774.331	36978.12
774.724	33485.35
775.116	32842.14
775.509	34393.13
775.901	38249.99
776.294	43347.15
776.686	46815.66
777.078	46407.88
777.471	43652.98
777.863	40468.47
778.255	40077.69
778.647	43038.9
779.039	47089.93
779.431	50626.39
779.823	50973.49
780.215	49182.2
780.607	44449.11
780.999	42849.57
781.39	44279.21
781.782	48788.99
782.174	52371.57
782.565	53958.97
782.957	52162.83
783.348	48961.32
783.74	45594.76
784.131	45398.16
784.522	48997.73
784.914	52517.2
785.305	54126.45
785.696	52407.98
786.087	48264.71
786.478	43771.92
786.869	41638.39
787.26	44434.55
787.651	47621.49
788.042	49111.81
788.433	47383.63
788.823	42890.84
789.214	39007.28
789.605	37320.36
789.995	38499.99
790.386	41572.86
790.776	43682.11
791.167	42128.69
791.557	39703.89
791.948	36609.19
792.338	37114.05
792.728	40786.44
793.118	44143.28
793.508	46157.88
793.898	45342.33
794.288	42169.95
794.678	39145.63
795.068	38890.77
795.458	41094.69
795.848	44701.54
796.238	46271.96
796.627	44373.87
797.017	40546.14
797.406	38701.45
797.796	38611.64
798.185	42111.7
798.575	45495.25
798.964	45895.74
799.354	43786.48
799.743	40543.71
800.132	38946.6
800.521	39915.06
800.91	43621.43
801.299	45136.02
801.688	45094.75
802.077	41752.47
802.466	38123.77
802.855	37303.37
803.244	38208.73
803.633	40696.63
804.021	41725.77
804.41	40368.95
804.799	37817.94
805.187	33825.16
805.576	33317.87
805.964	34087.3
806.352	35580.04
806.741	35252.37
807.129	32730.48
807.517	30371.22
807.905	29759.56
808.293	31130.95
808.681	33495.06
809.069	34912.56
809.457	35553.34
809.845	32728.06
810.233	30655.21
810.621	30970.75
811.009	33429.52
811.396	35980.54
811.784	36516.95
812.171	33757.2
812.559	30706.18
812.946	29123.63
813.334	30604.24
813.721	32752.33
814.108	32880.97
814.496	31177.06
814.883	28846.93
815.27	28213.42
815.657	28021.67
816.044	30346.95
816.431	31747.46
816.818	31910.08
817.205	29184.31
817.592	27351.76
817.979	26655.15
818.365	27788.66
818.752	28669.74
819.139	27963.42
819.525	26890.59
819.912	24460.94
820.298	22861.4
820.685	23053.15
821.071	24227.93
821.457	24334.72
821.843	22875.96
822.23	20868.65
822.616	19072.51
823.002	18368.61
823.388	19096.78
823.774	19895.33
824.16	18931.73
824.546	16885.58
824.931	15713.23
825.317	15516.62
825.703	16589.46
826.089	16856.45
826.474	17315.2
826.86	15684.1
827.245	14701.08
827.631	14446.22
828.016	15293.32
828.401	15681.68
828.787	15528.76
829.172	14188.93
829.557	12938.91
829.942	12150.07
830.327	12795.71
830.712	13586.98
831.097	13616.11
831.482	12747.16
831.867	11392.77
832.252	10761.7
832.636	10856.36
833.021	11713.17
833.406	12269
833.79	11298.11
834.175	10123.34
834.559	9701
834.944	9705.85
835.328	10385.48
835.713	10307.81
836.097	9895.18
836.481	8662.15
836.865	8378.16
837.249	7975.25
837.633	8273.79
838.017	8676.71
838.401	8113.6
838.785	7278.63
839.169	6516.48
839.553	6531.05
839.937	6749.5
840.32	6783.48
840.704	6336.87
841.087	5533.46
841.471	5031.02
841.854	5072.29
842.238	5324.72
842.621	5548.02
843.004	5074.71
843.388	4613.54
843.771	4562.57
844.154	4506.74
844.537	4865.97
844.92	5086.85
845.303	4693.64
845.686	4251.89
846.069	3812.56
846.452	4064.99
846.834	4285.87
847.217	4402.37
847.6	4101.4
847.982	3688.77
848.365	3358.67
848.748	3382.94
849.13	3824.7
849.512	3732.46
849.895	3710.62
850.277	3118.37
850.659	3084.39
851.041	3050.41
851.423	3399.93
851.806	3375.66
852.188	3174.2
852.57	2751.86
852.951	2606.23
853.333	2635.36
853.715	2943.61
854.097	2960.6
854.479	2710.6
854.86	2285.84
855.242	2215.45
855.623	2276.13
856.005	2397.49
856.386	2259.14
856.768	2140.2
857.149	1914.47
857.53	1848.94
857.911	1768.84
858.292	1885.34
858.674	1848.94
859.055	1683.89
859.436	1460.58
859.817	1351.36
860.197	1455.73
860.578	1611.07
860.959	1487.28
861.34	1339.22
861.72	1164.46
862.101	1176.6
862.482	1244.56
862.862	1331.94
863.243	1234.85
863.623	1106.21
864.003	1038.24
864.384	1038.24
864.764	1120.77
865.144	1069.8
865.524	1115.92
865.904	892.61
866.284	895.04
866.664	912.03
867.044	875.62
867.424	890.18
867.804	958.15
868.183	824.65
868.563	700.86
868.943	751.83
869.322	793.09
869.702	810.09
870.081	727.56
870.461	618.33
870.84	696.01
871.22	659.6
871.599	720.28
871.978	603.77
872.357	596.49
872.736	472.7
873.115	380.47
873.494	521.25
873.873	499.4
874.252	523.67
874.631	470.27
875.01	446
875.388	392.6
875.767	426.58
876.146	475.13
876.524	382.89
876.903	324.64
877.281	363.48
877.66	441.15
878.038	365.9
878.416	324.64
878.794	300.37
879.173	324.64
879.551	290.66
879.929	329.5
880.307	402.31
880.685	327.07
881.063	322.21
881.441	358.62
881.818	220.27
882.196	259.11
882.574	232.41
882.951	280.95
883.329	276.1
883.707	327.07
884.084	217.84
884.461	254.25
884.839	179.01
885.216	174.15
885.593	181.43
885.971	246.97
886.348	215.42
886.725	254.25
887.102	268.81
887.479	246.97
887.856	225.12
888.233	171.73
888.609	256.68
888.986	208.13
889.363	234.83
889.74	169.3
890.116	251.82
890.493	176.58
890.869	251.82
891.246	183.86
891.622	220.27
891.998	220.27
892.375	166.87
892.751	118.33
893.127	188.72
893.503	149.88
893.879	203.28
894.255	147.45
894.631	174.15
895.007	188.72
895.383	203.28
895.759	132.89
896.134	174.15
896.51	166.87
896.886	145.03
897.261	123.18
897.637	169.3
898.012	179.01
898.388	113.47
898.763	142.6
899.138	164.44
899.514	174.15
899.889	164.44
900.264	203.28
900.639	200.85
901.014	154.74
901.389	113.47
901.764	157.16
902.139	145.03
902.513	147.45
902.888	128.04
903.263	188.72
903.638	140.17
904.012	222.7
904.387	183.86
904.761	152.31
905.136	162.02
905.51	181.43
905.884	162.02
906.259	154.74
906.633	200.85
907.007	174.15
907.381	193.57
907.755	164.44
908.129	191.14
908.503	191.14
908.877	130.46
909.251	154.74
909.624	188.72
909.998	186.29
910.372	96.48
910.745	113.47
911.119	181.43
911.492	118.33
911.866	123.18
912.239	149.88
912.612	103.76
912.986	147.45
913.359	115.9
913.732	101.34
914.105	106.19
914.478	198.43
914.851	113.47
915.224	125.61
915.597	135.32
915.97	145.03
916.343	135.32
916.715	191.14
917.088	77.06
917.461	135.32
917.833	191.14
918.206	142.6
918.578	132.89
918.951	113.47
919.323	193.57
919.695	183.86
920.067	145.03
920.44	171.73
920.812	118.33
921.184	130.46
921.556	196
921.928	128.04
922.3	57.65
922.672	111.05
923.043	171.73
923.415	135.32
923.787	191.14
924.158	186.29
924.53	140.17
924.901	254.25
925.273	118.33
925.644	94.05
926.016	140.17
926.387	111.05
926.758	147.45
927.129	77.06
927.5	135.32
927.872	140.17
928.243	157.16
928.613	128.04
928.984	103.76
929.355	108.62
929.726	106.19
930.097	176.58
930.467	147.45
930.838	123.18
931.209	67.36
931.579	154.74
931.95	166.87
932.32	130.46
932.69	81.92
933.061	159.59
933.431	142.6
933.801	159.59
934.171	130.46
934.541	52.79
934.911	140.17
935.281	186.29
935.651	186.29
936.021	159.59
936.391	101.34
936.761	142.6
937.13	89.2
937.5	147.45
937.87	108.62
938.239	132.89
938.609	198.43
938.978	145.03
939.347	132.89
939.717	47.94
940.086	84.35
940.455	174.15
940.824	98.91
941.193	132.89
941.562	179.01
941.931	140.17
942.3	159.59
942.669	79.49
943.038	208.13
943.407	108.62
943.775	217.84
944.144	171.73
944.513	120.75
944.881	91.63
945.25	159.59
945.618	149.88
945.986	132.89
946.355	193.57
946.723	106.19
947.091	200.85
947.459	125.61
947.827	145.03
948.195	169.3
948.563	147.45
948.931	154.74
949.299	149.88
949.667	84.35
950.035	225.12
950.402	162.02
950.77	132.89
951.138	132.89
951.505	120.75
951.873	166.87
952.24	142.6
952.607	123.18
952.975	113.47
953.342	157.16
953.709	152.31
954.076	108.62
954.443	232.41
954.81	152.31
955.177	186.29
955.544	198.43
955.911	174.15
956.278	96.48
956.645	147.45
957.012	91.63
957.378	203.28
957.745	157.16
958.111	166.87
958.478	154.74
958.844	154.74
959.211	125.61
959.577	103.76
959.943	123.18
960.309	225.12
960.675	86.77
961.042	164.44
961.408	157.16
961.774	91.63
962.139	77.06
962.505	96.48
962.871	176.58
963.237	186.29
963.603	101.34
963.968	108.62
964.334	188.72
964.699	132.89
965.065	149.88
965.43	33.37
965.796	210.56
966.161	159.59
966.526	115.9
966.891	137.74
967.256	135.32
967.622	91.63
967.987	111.05
968.352	171.73
968.716	137.74
969.081	152.31
969.446	120.75
969.811	188.72
970.176	140.17
970.54	205.71
970.905	142.6
971.269	169.3
971.634	111.05
971.998	91.63
972.363	162.02
972.727	106.19
973.091	169.3
973.455	142.6
973.819	137.74
974.183	166.87
974.547	140.17
974.911	113.47
975.275	145.03
975.639	120.75
976.003	183.86
976.367	98.91
976.73	94.05
977.094	106.19
977.458	166.87
977.821	171.73
978.185	132.89
978.548	130.46
978.911	142.6
979.275	210.56
979.638	94.05
980.001	179.01
980.364	159.59
980.727	96.48
981.09	84.35
981.453	186.29
981.816	132.89
982.179	181.43
982.542	196
982.905	154.74
983.267	191.14
983.63	162.02
983.992	91.63
984.355	84.35
984.717	176.58
985.08	154.74
985.442	147.45
985.804	145.03
986.167	166.87
986.529	106.19
986.891	166.87
987.253	174.15
987.615	145.03
987.977	118.33
988.339	132.89
988.701	86.77
989.062	108.62
989.424	135.32
989.786	188.72
990.147	132.89
990.509	67.36
990.87	179.01
991.232	152.31
991.593	62.5
991.955	115.9
992.316	164.44
992.677	145.03
993.038	96.48
993.399	77.06
993.76	74.64
994.121	159.59
994.482	140.17
994.843	135.32
995.204	128.04
995.565	55.22
995.926	64.93
996.286	128.04
996.647	125.61
997.007	74.64
997.368	111.05
997.728	106.19
998.089	123.18
998.449	125.61
998.809	142.6
999.169	94.05
999.53	137.74
999.89	135.32
1000.25	125.61
1000.61	94.05
1000.97	11.53
1001.329	96.48
1001.689	147.45
1002.049	81.92
1002.409	149.88
1002.768	154.74
1003.128	120.75
1003.487	111.05
1003.847	183.86
1004.206	140.17
1004.566	113.47
1004.925	188.72
1005.284	147.45
1005.643	69.78
1006.003	125.61
1006.362	128.04
1006.721	137.74
1007.08	196
1007.438	171.73
1007.797	96.48
1008.156	130.46
1008.515	164.44
1008.874	111.05
1009.232	64.93
1009.591	81.92
1009.949	186.29
1010.308	149.88
1010.666	181.43
1011.024	69.78
1011.383	81.92
1011.741	94.05
1012.099	135.32
1012.457	120.75
1012.815	171.73
1013.173	94.05
1013.531	128.04
1013.889	128.04
1014.247	125.61
1014.605	128.04
1014.962	166.87
1015.32	128.04
1015.678	125.61
1016.035	154.74
1016.393	145.03
1016.75	98.91
1017.107	149.88
1017.465	137.74
1017.822	137.74
1018.179	128.04
1018.536	135.32
1018.894	120.75
1019.251	123.18
1019.608	145.03
1019.964	57.65
1020.321	166.87
1020.678	145.03
1021.035	142.6
1021.392	162.02
1021.748	132.89
1022.105	94.05
1022.461	113.47
1022.818	227.55
1023.174	135.32
1023.531	147.45
1023.887	169.3
1024.243	106.19
1024.599	145.03
1024.955	101.34
1025.311	89.2
1025.667	108.62
1026.023	147.45
1026.379	169.3
1026.735	162.02
1027.091	118.33
1027.447	130.46
