189.514	69.02
189.973	69.02
190.431	69.02
190.889	3.49
191.348	32.62
191.806	73.88
192.264	-18.36
192.722	-45.06
193.18	-13.5
193.638	-52.34
194.096	10.77
194.554	-32.92
195.012	-32.92
195.47	-45.06
195.928	-25.64
196.385	22.91
196.843	13.2
197.301	88.44
197.758	81.16
198.216	-37.77
198.674	-11.07
199.131	98.15
199.589	76.31
200.046	158.83
200.503	115.14
200.961	25.33
201.418	115.14
201.875	83.59
202.332	88.44
202.79	122.42
203.247	100.58
203.704	127.28
204.161	136.99
204.618	156.4
205.075	192.81
205.532	151.55
205.989	73.88
206.445	61.74
206.902	144.27
207.359	178.25
207.816	124.85
208.272	161.26
208.729	168.54
209.185	161.26
209.642	163.69
210.098	141.84
210.555	207.38
211.011	183.1
211.467	166.11
211.924	146.7
212.38	166.11
212.836	132.13
213.292	195.24
213.748	153.98
214.204	86.01
214.66	166.11
215.116	173.39
215.572	187.96
216.028	161.26
216.484	134.56
216.94	195.24
217.396	146.7
217.851	146.7
218.307	136.99
218.763	124.85
219.218	127.28
219.674	149.12
220.129	129.7
220.585	187.96
221.04	136.99
221.496	156.4
221.951	175.82
222.406	161.26
222.861	127.28
223.317	117.57
223.772	124.85
224.227	149.12
224.682	32.62
225.137	81.16
225.592	112.71
226.047	187.96
226.502	158.83
226.957	81.16
227.411	127.28
227.866	180.68
228.321	158.83
228.776	168.54
229.23	107.86
229.685	158.83
230.139	149.12
230.594	192.81
231.048	98.15
231.503	144.27
231.957	161.26
232.411	156.4
232.865	146.7
233.32	132.13
233.774	141.84
234.228	178.25
234.682	175.82
235.136	180.68
235.59	122.42
236.044	161.26
236.498	153.98
236.952	153.98
237.406	161.26
237.86	127.28
238.313	168.54
238.767	166.11
239.221	95.72
239.674	151.55
240.128	103.01
240.581	204.95
241.035	136.99
241.488	161.26
241.942	95.72
242.395	161.26
242.848	132.13
243.301	183.1
243.755	122.42
244.208	134.56
244.661	173.39
245.114	175.82
245.567	90.87
246.02	129.7
246.473	146.7
246.926	151.55
247.379	93.3
247.832	163.69
248.284	221.94
248.737	156.4
249.19	115.14
249.642	178.25
250.095	98.15
250.547	83.59
251	139.41
251.452	187.96
251.905	90.87
252.357	168.54
252.81	202.52
253.262	238.93
253.714	144.27
254.166	156.4
254.618	139.41
255.07	100.58
255.523	105.43
255.975	158.83
256.427	204.95
256.878	185.53
257.33	141.84
257.782	146.7
258.234	246.21
258.686	107.86
259.137	105.43
259.589	103.01
260.041	44.75
260.492	168.54
260.944	151.55
261.395	105.43
261.847	209.8
262.298	134.56
262.749	158.83
263.201	238.93
263.652	209.8
264.103	178.25
264.554	151.55
265.005	127.28
265.457	180.68
265.908	197.67
266.359	195.24
266.809	161.26
267.26	175.82
267.711	78.73
268.162	190.39
268.613	127.28
269.064	221.94
269.514	170.97
269.965	185.53
270.415	110.29
270.866	103.01
271.316	134.56
271.767	153.98
272.217	185.53
272.668	146.7
273.118	161.26
273.568	141.84
274.019	175.82
274.469	170.97
274.919	151.55
275.369	127.28
275.819	156.4
276.269	178.25
276.719	158.83
277.169	90.87
277.619	149.12
278.069	129.7
278.518	149.12
278.968	166.11
279.418	168.54
279.867	178.25
280.317	168.54
280.767	173.39
281.216	217.08
281.666	144.27
282.115	183.1
282.564	170.97
283.014	115.14
283.463	149.12
283.912	124.85
284.361	168.54
284.811	170.97
285.26	204.95
285.709	170.97
286.158	185.53
286.607	134.56
287.056	204.95
287.505	132.13
287.953	156.4
288.402	202.52
288.851	183.1
289.3	81.16
289.748	153.98
290.197	127.28
290.646	136.99
291.094	183.1
291.543	105.43
291.991	226.79
292.439	110.29
292.888	132.13
293.336	127.28
293.784	132.13
294.233	161.26
294.681	103.01
295.129	170.97
295.577	144.27
296.025	136.99
296.473	146.7
296.921	156.4
297.369	212.23
297.817	141.84
298.264	161.26
298.712	161.26
299.16	156.4
299.608	195.24
300.055	134.56
300.503	139.41
300.95	166.11
301.398	127.28
301.845	134.56
302.293	110.29
302.74	141.84
303.187	153.98
303.635	124.85
304.082	110.29
304.529	144.27
304.976	202.52
305.423	153.98
305.87	170.97
306.317	86.01
306.764	132.13
307.211	110.29
307.658	195.24
308.105	144.27
308.552	173.39
308.998	161.26
309.445	197.67
309.892	207.38
310.338	132.13
310.785	136.99
311.231	183.1
311.678	93.3
312.124	124.85
312.571	156.4
313.017	153.98
313.463	141.84
313.909	166.11
314.356	214.66
314.802	156.4
315.248	129.7
315.694	115.14
316.14	236.5
316.586	166.11
317.032	170.97
317.478	163.69
317.923	192.81
318.369	224.37
318.815	136.99
319.261	170.97
319.706	158.83
320.152	127.28
320.597	158.83
321.043	124.85
321.488	129.7
321.934	158.83
322.379	141.84
322.824	170.97
323.27	127.28
323.715	134.56
324.16	168.54
324.605	112.71
325.05	161.26
325.495	153.98
325.94	221.94
326.385	168.54
326.83	178.25
327.275	149.12
327.72	226.79
328.165	134.56
328.61	183.1
329.054	144.27
329.499	117.57
329.943	110.29
330.388	127.28
330.832	158.83
331.277	151.55
331.721	185.53
332.166	173.39
332.61	37.47
333.054	195.24
333.499	195.24
333.943	122.42
334.387	98.15
334.831	141.84
335.275	146.7
335.719	180.68
336.163	122.42
336.607	166.11
337.051	146.7
337.495	163.69
337.938	163.69
338.382	132.13
338.826	163.69
339.269	151.55
339.713	151.55
340.157	144.27
340.6	134.56
341.044	158.83
341.487	117.57
341.93	197.67
342.374	209.8
342.817	153.98
343.26	156.4
343.703	139.41
344.146	153.98
344.59	141.84
345.033	112.71
345.476	204.95
345.919	132.13
346.361	112.71
346.804	93.3
347.247	166.11
347.69	110.29
348.133	124.85
348.575	195.24
349.018	158.83
349.461	183.1
349.903	170.97
350.346	122.42
350.788	90.87
351.23	190.39
351.673	141.84
352.115	103.01
352.557	173.39
353	161.26
353.442	178.25
353.884	173.39
354.326	253.49
354.768	161.26
355.21	103.01
355.652	100.58
356.094	197.67
356.536	180.68
356.978	136.99
357.419	195.24
357.861	93.3
358.303	158.83
358.744	124.85
359.186	168.54
359.627	139.41
360.069	141.84
360.51	73.88
360.952	200.09
361.393	107.86
361.834	129.7
362.276	112.71
362.717	207.38
363.158	212.23
363.599	183.1
364.04	124.85
364.481	83.59
364.922	129.7
365.363	163.69
365.804	183.1
366.245	146.7
366.686	59.32
367.126	156.4
367.567	163.69
368.008	168.54
368.448	129.7
368.889	207.38
369.33	175.82
369.77	209.8
370.21	156.4
370.651	115.14
371.091	166.11
371.531	178.25
371.972	153.98
372.412	183.1
372.852	132.13
373.292	129.7
373.732	217.08
374.172	204.95
374.612	156.4
375.052	183.1
375.492	134.56
375.932	139.41
376.372	110.29
376.811	219.51
377.251	170.97
377.691	200.09
378.13	212.23
378.57	214.66
379.009	166.11
379.449	107.86
379.888	149.12
380.328	141.84
380.767	146.7
381.206	226.79
381.645	110.29
382.085	146.7
382.524	86.01
382.963	168.54
383.402	103.01
383.841	76.31
384.28	156.4
384.719	146.7
385.158	146.7
385.596	117.57
386.035	127.28
386.474	64.17
386.913	139.41
387.351	170.97
387.79	112.71
388.228	132.13
388.667	120
389.105	195.24
389.544	115.14
389.982	100.58
390.42	139.41
390.859	105.43
391.297	136.99
391.735	115.14
392.173	178.25
392.611	107.86
393.049	112.71
393.487	117.57
393.925	141.84
394.363	168.54
394.801	161.26
395.239	170.97
395.676	122.42
396.114	117.57
396.552	151.55
396.989	166.11
397.427	161.26
397.864	168.54
398.302	187.96
398.739	103.01
399.177	88.44
399.614	173.39
400.051	132.13
400.488	110.29
400.926	88.44
401.363	110.29
401.8	139.41
402.237	132.13
402.674	122.42
403.111	195.24
403.548	134.56
403.985	219.51
404.421	81.16
404.858	151.55
405.295	190.39
405.732	192.81
406.168	115.14
406.605	134.56
407.041	115.14
407.478	98.15
407.914	107.86
408.351	73.88
408.787	136.99
409.223	127.28
409.66	100.58
410.096	144.27
410.532	146.7
410.968	146.7
411.404	132.13
411.84	231.65
412.276	190.39
412.712	183.1
413.148	190.39
413.584	83.59
414.02	132.13
414.455	141.84
414.891	136.99
415.327	136.99
415.762	139.41
416.198	124.85
416.633	52.03
417.069	153.98
417.504	156.4
417.94	117.57
418.375	153.98
418.81	161.26
419.245	197.67
419.681	161.26
420.116	103.01
420.551	156.4
420.986	122.42
421.421	129.7
421.856	183.1
422.291	158.83
422.726	183.1
423.16	151.55
423.595	110.29
424.03	134.56
424.464	207.38
424.899	192.81
425.334	146.7
425.768	146.7
426.203	136.99
426.637	136.99
427.071	173.39
427.506	110.29
427.94	217.08
428.374	115.14
428.809	112.71
429.243	158.83
429.677	185.53
430.111	178.25
430.545	204.95
430.979	146.7
431.413	146.7
431.847	153.98
432.28	107.86
432.714	146.7
433.148	166.11
433.582	217.08
434.015	153.98
434.449	187.96
434.882	170.97
435.316	122.42
435.749	202.52
436.183	180.68
436.616	132.13
437.049	224.37
437.483	231.65
437.916	219.51
438.349	115.14
438.782	173.39
439.215	180.68
439.648	144.27
440.081	124.85
440.514	149.12
440.947	139.41
441.38	236.5
441.813	202.52
442.245	139.41
442.678	166.11
443.111	229.22
443.543	192.81
443.976	175.82
444.408	187.96
444.841	224.37
445.273	251.07
445.705	156.4
446.138	161.26
446.57	275.34
447.002	226.79
447.434	221.94
447.867	195.24
448.299	219.51
448.731	219.51
449.163	236.5
449.595	268.06
450.026	190.39
450.458	229.22
450.89	190.39
451.322	255.92
451.754	132.13
452.185	265.63
452.617	243.78
453.048	255.92
453.48	255.92
453.911	287.47
454.343	285.05
454.774	241.36
455.205	294.76
455.637	258.35
456.068	183.1
456.499	304.46
456.93	299.61
457.361	253.49
457.792	255.92
458.223	255.92
458.654	207.38
459.085	200.09
459.516	328.74
459.947	243.78
460.378	170.97
460.808	241.36
461.239	289.9
461.669	285.05
462.1	226.79
462.531	238.93
462.961	243.78
463.391	246.21
463.822	241.36
464.252	224.37
464.682	214.66
465.113	297.18
465.543	204.95
465.973	195.24
466.403	226.79
466.833	236.5
467.263	204.95
467.693	272.91
468.123	238.93
468.553	231.65
468.983	217.08
469.412	200.09
469.842	217.08
470.272	285.05
470.701	209.8
471.131	214.66
471.56	151.55
471.99	221.94
472.419	202.52
472.849	163.69
473.278	238.93
473.707	224.37
474.136	173.39
474.566	226.79
474.995	212.23
475.424	200.09
475.853	248.64
476.282	163.69
476.711	236.5
477.14	246.21
477.569	163.69
477.997	195.24
478.426	287.47
478.855	234.08
479.283	173.39
479.712	270.48
480.141	258.35
480.569	251.07
480.998	185.53
481.426	168.54
481.854	175.82
482.283	234.08
482.711	202.52
483.139	200.09
483.567	197.67
483.995	200.09
484.424	195.24
484.852	178.25
485.28	219.51
485.708	270.48
486.135	236.5
486.563	207.38
486.991	180.68
487.419	170.97
487.847	134.56
488.274	236.5
488.702	221.94
489.129	214.66
489.557	156.4
489.984	170.97
490.412	192.81
490.839	226.79
491.266	204.95
491.694	185.53
492.121	217.08
492.548	241.36
492.975	185.53
493.402	153.98
493.829	158.83
494.256	166.11
494.683	246.21
495.11	217.08
495.537	156.4
495.964	136.99
496.39	129.7
496.817	122.42
497.244	166.11
497.67	173.39
498.097	200.09
498.523	163.69
498.95	158.83
499.376	197.67
499.803	251.07
500.229	180.68
500.655	144.27
501.081	187.96
501.508	149.12
501.934	64.17
502.36	209.8
502.786	202.52
503.212	253.49
503.638	158.83
504.064	141.84
504.489	178.25
504.915	212.23
505.341	149.12
505.767	214.66
506.192	204.95
506.618	243.78
507.043	192.81
507.469	214.66
507.894	221.94
508.32	163.69
508.745	219.51
509.17	202.52
509.596	224.37
510.021	197.67
510.446	158.83
510.871	185.53
511.296	175.82
511.721	105.43
512.146	151.55
512.571	175.82
512.996	204.95
513.421	100.58
513.845	200.09
514.27	166.11
514.695	217.08
515.119	231.65
515.544	161.26
515.969	153.98
516.393	197.67
516.817	163.69
517.242	190.39
517.666	153.98
518.09	103.01
518.515	190.39
518.939	156.4
519.363	374.85
519.787	146.7
520.211	231.65
520.635	219.51
521.059	139.41
521.483	168.54
521.907	202.52
522.331	183.1
522.754	122.42
523.178	268.06
523.602	212.23
524.025	209.8
524.449	217.08
524.872	161.26
525.296	187.96
525.719	207.38
526.143	268.06
526.566	161.26
526.989	127.28
527.412	158.83
527.836	185.53
528.259	246.21
528.682	185.53
529.105	190.39
529.528	139.41
529.951	234.08
530.374	180.68
530.796	207.38
531.219	209.8
531.642	217.08
532.065	166.11
532.487	183.1
532.91	175.82
533.332	187.96
533.755	153.98
534.177	107.86
534.6	136.99
535.022	192.81
535.444	168.54
535.867	217.08
536.289	153.98
536.711	127.28
537.133	229.22
537.555	197.67
537.977	173.39
538.399	212.23
538.821	204.95
539.243	243.78
539.665	185.53
540.086	136.99
540.508	243.78
540.93	149.12
541.351	158.83
541.773	129.7
542.195	115.14
542.616	112.71
543.037	204.95
543.459	207.38
543.88	144.27
544.301	234.08
544.723	166.11
545.144	234.08
545.565	246.21
545.986	163.69
546.407	136.99
546.828	231.65
547.249	190.39
547.67	149.12
548.091	170.97
548.512	195.24
548.932	195.24
549.353	229.22
549.774	229.22
550.194	209.8
550.615	175.82
551.035	139.41
551.456	200.09
551.876	175.82
552.296	217.08
552.717	166.11
553.137	187.96
553.557	161.26
553.977	183.1
554.397	234.08
554.817	178.25
555.237	144.27
555.657	214.66
556.077	117.57
556.497	212.23
556.917	120
557.337	144.27
557.756	183.1
558.176	187.96
558.596	173.39
559.015	238.93
559.435	170.97
559.854	170.97
560.274	209.8
560.693	195.24
561.112	120
561.532	168.54
561.951	229.22
562.37	187.96
562.789	195.24
563.208	178.25
563.627	236.5
564.046	287.47
564.465	219.51
564.884	127.28
565.303	129.7
565.722	170.97
566.14	192.81
566.559	112.71
566.978	209.8
567.396	187.96
567.815	229.22
568.233	236.5
568.652	221.94
569.07	241.36
569.489	192.81
569.907	234.08
570.325	192.81
570.743	54.46
571.161	209.8
571.58	204.95
571.998	115.14
572.416	190.39
572.833	190.39
573.251	139.41
573.669	175.82
574.087	234.08
574.505	217.08
574.922	129.7
575.34	204.95
575.758	207.38
576.175	246.21
576.593	168.54
577.01	151.55
577.428	236.5
577.845	1865.17
578.262	377.28
578.68	178.25
579.097	243.78
579.514	163.69
579.931	166.11
580.348	156.4
580.765	153.98
581.182	209.8
581.599	214.66
582.016	170.97
582.433	175.82
582.849	217.08
583.266	212.23
583.683	204.95
584.099	212.23
584.516	221.94
584.933	180.68
585.349	139.41
585.765	149.12
586.182	153.98
586.598	173.39
587.014	221.94
587.431	183.1
587.847	175.82
588.263	134.56
588.679	200.09
589.095	226.79
589.511	212.23
589.927	251.07
590.343	153.98
590.759	120
591.174	151.55
591.59	134.56
592.006	190.39
592.421	173.39
592.837	217.08
593.252	90.87
593.668	168.54
594.083	173.39
594.499	170.97
594.914	149.12
595.329	187.96
595.745	195.24
596.16	136.99
596.575	195.24
596.99	161.26
597.405	170.97
597.82	212.23
598.235	180.68
598.65	197.67
599.065	178.25
599.479	170.97
599.894	175.82
600.309	207.38
600.724	156.4
601.138	173.39
601.553	180.68
601.967	204.95
602.382	248.64
602.796	219.51
603.21	192.81
603.625	168.54
604.039	110.29
604.453	158.83
604.867	175.82
605.281	180.68
605.695	127.28
606.109	185.53
606.523	202.52
606.937	166.11
607.351	280.19
607.765	197.67
608.178	195.24
608.592	122.42
609.006	168.54
609.419	207.38
609.833	141.84
610.246	241.36
610.66	214.66
611.073	190.39
611.487	200.09
611.9	190.39
612.313	229.22
612.726	180.68
613.139	156.4
613.553	132.13
613.966	163.69
614.379	163.69
614.792	112.71
615.204	158.83
615.617	217.08
616.03	136.99
616.443	141.84
616.856	175.82
617.268	204.95
617.681	122.42
618.093	120
618.506	170.97
618.918	95.72
619.331	144.27
619.743	153.98
620.155	180.68
620.568	146.7
620.98	173.39
621.392	158.83
621.804	151.55
622.216	178.25
622.628	214.66
623.04	161.26
623.452	229.22
623.864	122.42
624.276	183.1
624.687	149.12
625.099	161.26
625.511	151.55
625.922	151.55
626.334	212.23
626.745	170.97
627.157	166.11
627.568	107.86
627.979	141.84
628.391	158.83
628.802	197.67
629.213	153.98
629.624	234.08
630.035	166.11
630.446	248.64
630.857	134.56
631.268	175.82
631.679	187.96
632.09	168.54
632.501	197.67
632.912	217.08
633.322	246.21
633.733	178.25
634.144	151.55
634.554	132.13
634.965	178.25
635.375	95.72
635.785	149.12
636.196	238.93
636.606	180.68
637.016	202.52
637.427	168.54
637.837	146.7
638.247	156.4
638.657	158.83
639.067	144.27
639.477	178.25
639.887	187.96
640.297	134.56
640.706	163.69
641.116	202.52
641.526	180.68
641.935	144.27
642.345	98.15
642.755	197.67
643.164	161.26
643.573	178.25
643.983	170.97
644.392	134.56
644.801	117.57
645.211	202.52
645.62	153.98
646.029	219.51
646.438	163.69
646.847	224.37
647.256	168.54
647.665	236.5
648.074	217.08
648.483	158.83
648.892	158.83
649.3	132.13
649.709	158.83
650.118	173.39
650.526	98.15
650.935	141.84
651.343	231.65
651.752	195.24
652.16	246.21
652.568	212.23
652.977	122.42
653.385	122.42
653.793	115.14
654.201	187.96
654.609	263.2
655.017	197.67
655.425	185.53
655.833	166.11
656.241	112.71
656.649	197.67
657.057	180.68
657.464	139.41
657.872	134.56
658.28	183.1
658.687	168.54
659.095	103.01
659.502	163.69
659.91	124.85
660.317	161.26
660.724	139.41
661.132	112.71
661.539	158.83
661.946	136.99
662.353	236.5
662.76	156.4
663.167	151.55
663.574	192.81
663.981	185.53
664.388	100.58
664.795	124.85
665.202	141.84
665.608	166.11
666.015	170.97
666.422	134.56
666.828	88.44
667.235	161.26
667.641	151.55
668.047	144.27
668.454	93.3
668.86	163.69
669.266	204.95
669.673	136.99
670.079	163.69
670.485	190.39
670.891	214.66
671.297	221.94
671.703	139.41
672.109	105.43
672.515	161.26
672.92	197.67
673.326	175.82
673.732	190.39
674.138	183.1
674.543	158.83
674.949	156.4
675.354	185.53
675.76	124.85
676.165	168.54
676.57	170.97
676.976	202.52
677.381	175.82
677.786	158.83
678.191	219.51
678.596	173.39
679.001	105.43
679.406	110.29
679.811	136.99
680.216	192.81
680.621	234.08
681.026	136.99
681.43	197.67
681.835	146.7
682.24	122.42
682.644	180.68
683.049	185.53
683.453	136.99
683.858	241.36
684.262	175.82
684.667	120
685.071	73.88
685.475	120
685.879	202.52
686.283	231.65
686.687	204.95
687.091	129.7
687.495	95.72
687.899	166.11
688.303	122.42
688.707	144.27
689.111	161.26
689.514	163.69
689.918	192.81
690.322	163.69
690.725	180.68
691.129	78.73
691.532	76.31
691.936	124.85
692.339	190.39
692.742	168.54
693.146	163.69
693.549	161.26
693.952	195.24
694.355	173.39
694.758	158.83
695.161	185.53
695.564	134.56
695.967	180.68
696.37	127.28
696.773	122.42
697.175	175.82
697.578	146.7
697.981	149.12
698.383	231.65
698.786	139.41
699.188	207.38
699.591	107.86
699.993	197.67
700.395	217.08
700.798	163.69
701.2	217.08
701.602	185.53
702.004	120
702.406	202.52
702.808	217.08
703.21	180.68
703.612	251.07
704.014	226.79
704.416	163.69
704.818	204.95
705.219	187.96
705.621	268.06
706.023	217.08
706.424	187.96
706.826	243.78
707.227	224.37
707.629	156.4
708.03	260.77
708.431	234.08
708.832	255.92
709.234	178.25
709.635	234.08
710.036	280.19
710.437	234.08
710.838	190.39
711.239	129.7
711.64	241.36
712.041	255.92
712.441	251.07
712.842	234.08
713.243	202.52
713.643	212.23
714.044	183.1
714.445	229.22
714.845	263.2
715.246	258.35
715.646	323.88
716.046	234.08
716.447	268.06
716.847	314.17
717.247	270.48
717.647	241.36
718.047	314.17
718.447	299.61
718.847	326.31
719.247	306.89
719.647	425.83
720.047	326.31
720.446	323.88
720.846	277.77
721.246	260.77
721.645	255.92
722.045	336.02
722.444	372.43
722.844	386.99
723.243	408.84
723.643	367.57
724.042	372.43
724.441	401.55
724.84	306.89
725.24	474.37
725.639	340.87
726.038	338.45
726.437	457.38
726.836	425.83
727.234	503.5
727.633	491.36
728.032	586.02
728.431	525.34
728.83	593.3
729.228	539.91
729.627	544.76
730.025	675.83
730.424	658.84
730.822	680.68
731.22	833.6
731.619	843.31
732.017	991.37
732.415	1001.08
732.813	1071.47
733.212	1173.41
733.61	1132.15
734.008	1394.29
734.406	1416.13
734.803	1530.21
735.201	1649.15
735.599	1908.86
735.997	1930.7
736.395	1993.81
736.792	2137.02
737.19	2217.12
737.587	2362.75
737.985	2607.9
738.382	2707.41
738.78	2857.9
739.177	2947.71
739.574	3100.62
739.971	3401.6
740.369	3428.3
740.766	3634.61
741.163	3751.12
741.56	3894.33
741.957	4117.63
742.354	4134.62
742.751	4408.9
743.147	4464.72
743.544	4865.22
743.941	4862.79
744.338	5323.96
744.734	5479.3
745.131	5632.22
745.527	5962.32
745.924	6299.7
746.32	6668.64
746.716	7057
747.113	7236.61
747.509	7906.52
747.905	8069.15
748.301	8527.89
748.697	8785.18
749.093	9105.57
749.489	9605.58
749.885	10234.23
750.281	10853.17
750.677	11054.63
751.073	12049.79
751.468	12265.82
751.864	12998.84
752.26	12911.46
752.655	13913.9
753.051	14421.19
753.446	15350.82
753.842	15365.38
754.237	16127.53
754.632	16491.61
755.028	17079
755.423	17668.81
755.818	17940.66
756.213	18853.3
756.608	18964.95
757.003	19062.04
757.398	19557.19
757.793	19697.97
758.188	19872.73
758.583	20214.97
758.977	20802.36
759.372	21258.67
759.767	22319.37
760.161	22906.76
760.556	23957.75
760.95	24287.85
761.345	25766.03
761.739	26212.63
762.133	26423.8
762.527	26622.84
762.922	26770.9
763.316	27513.63
763.71	27783.05
764.104	27547.61
764.498	27957.81
764.892	28363.15
765.286	28154.41
765.68	28406.84
766.073	29115.59
766.467	29814.63
766.861	30496.68
767.255	31615.63
767.648	32533.12
768.042	33013.71
768.435	34931.22
768.829	35894.82
769.222	36996.78
769.615	39365.75
770.008	38856.04
770.402	40380.33
770.795	42348.81
771.188	44101.26
771.581	45210.5
771.974	45577.01
772.367	45831.87
772.76	47038.2
773.153	46188.67
773.545	47154.71
773.938	47938.7
774.331	47373.16
774.724	47941.13
775.116	48358.61
775.509	49361.05
775.901	49310.08
776.294	48683.86
776.686	47662
777.078	47416.85
777.471	47069.76
777.863	46725.09
778.255	48149.87
778.647	48564.92
779.039	48521.23
779.431	48890.17
779.823	49091.63
780.215	51865.95
780.607	52739.75
780.999	55128.13
781.39	56375.73
781.782	57885.46
782.174	58766.54
782.565	60040.83
782.957	60812.69
783.348	62281.16
783.74	62514.17
784.131	61715.61
784.522	61778.72
784.914	59977.72
785.305	59778.69
785.696	58543.23
786.087	57111.17
786.478	54412.1
786.869	51936.34
787.26	50453.3
787.651	49040.66
788.042	48645.02
788.433	48159.58
788.823	47365.88
789.214	47931.42
789.605	47931.42
789.995	49280.95
790.386	49429.02
790.776	49890.19
791.167	50662.04
791.557	52050.42
791.948	53669.37
792.338	54315.01
792.728	54382.98
793.118	53467.91
793.508	52766.45
793.898	51458.17
794.288	50101.36
794.678	48598.91
795.068	48640.17
795.458	47603.74
795.848	47795.49
796.238	47344.03
796.627	48057.63
797.017	48882.89
797.406	49936.3
797.796	51615.94
798.185	53021.3
798.575	54790.75
798.964	55014.05
799.354	55390.27
799.743	54562.59
800.132	54315.01
800.521	52749.46
800.91	51018.85
801.299	49402.32
801.688	47996.95
802.077	46217.8
802.466	46358.58
802.855	46445.96
803.244	45499.34
803.633	46581.88
804.021	46904.7
804.41	47183.83
804.799	47188.69
805.187	46586.74
805.576	46817.32
805.964	45720.22
806.352	42559.98
806.741	41948.32
807.129	40351.2
807.517	39363.32
807.905	38307.48
808.293	37477.37
808.681	37482.23
809.069	37438.54
809.457	39443.42
809.845	39882.75
810.233	41348.79
810.621	42089.1
811.009	43899.8
811.396	43916.79
811.784	43921.65
812.171	42703.18
812.559	42208.03
812.946	39994.4
813.334	38659.43
813.721	36676.39
814.108	34853.55
814.496	34234.6
814.883	33744.31
815.27	35394.82
815.657	36137.55
816.044	37460.38
816.431	38074.47
816.818	38135.15
817.205	37727.38
817.592	37533.2
817.979	36093.86
818.365	34266.16
818.752	32319.53
819.139	30358.33
819.525	29168.99
819.912	28375.29
820.298	27564.6
820.685	27943.24
821.071	27717.51
821.457	27824.31
821.843	27695.67
822.23	27176.24
822.616	26059.72
823.002	24795.14
823.388	23452.88
823.774	22261.12
824.16	20797.5
824.546	19632.44
824.931	19501.37
825.317	18710.09
825.703	18518.34
826.089	18901.84
826.474	18792.62
826.86	19406.7
827.245	19724.67
827.631	19952.83
828.016	19207.67
828.401	18314.45
828.787	17382.4
829.172	16748.9
829.557	15382.37
829.942	14707.6
830.327	14593.52
830.712	14406.63
831.097	14564.4
831.482	14685.76
831.867	14474.59
832.252	14678.47
832.636	14761
833.021	14115.36
833.406	13627.49
833.79	12841.07
834.175	12037.66
834.559	11634.74
834.944	10896.86
835.328	10583.75
835.713	10853.17
836.097	10610.45
836.481	10608.02
836.865	10467.24
837.249	10476.95
837.633	10032.77
838.017	9962.38
838.401	9139.55
838.785	8345.85
839.169	7729.34
839.553	7171.08
839.937	6984.18
840.32	6751.17
840.704	6775.44
841.087	6520.58
841.471	6576.41
841.854	6506.02
842.238	6294.85
842.621	6185.62
843.004	5874.94
843.388	5649.21
843.771	5246.29
844.154	5039.98
844.537	4768.13
844.92	4853.08
845.303	4969.59
845.686	4928.32
846.069	5078.81
846.452	5071.53
846.834	4986.58
847.217	4772.98
847.6	4559.39
847.982	4129.77
848.365	4115.2
848.748	3896.75
849.13	3697.72
849.512	3685.59
849.895	3707.43
850.277	3853.06
850.659	3651.6
851.041	3785.1
851.423	3894.33
851.806	3345.77
852.188	3297.23
852.57	3163.73
852.951	3071.5
853.333	2804.5
853.715	2799.65
854.097	2855.48
854.479	2704.99
854.86	2578.77
855.242	2726.83
855.623	2704.99
856.005	2518.09
856.386	2326.34
856.768	2241.39
857.149	2166.14
857.53	1911.29
857.911	1870.02
858.292	1833.61
858.674	1804.49
859.055	1765.65
859.436	1707.4
859.817	1712.25
860.197	1637.01
860.578	1680.7
860.959	1423.41
861.34	1391.86
861.72	1289.92
862.101	1224.38
862.482	1304.48
862.862	1258.36
863.243	1243.8
863.623	1265.64
864.003	1175.84
864.384	1149.14
864.764	1127.29
865.144	1010.79
865.524	930.69
865.904	887
866.284	969.52
866.664	981.66
867.044	877.29
867.424	891.85
867.804	945.25
868.183	848.16
868.563	763.21
868.943	792.34
869.322	707.38
869.702	658.84
870.081	588.45
870.461	700.1
870.84	605.44
871.22	556.9
871.599	598.16
871.978	539.91
872.357	610.29
872.736	571.46
873.115	513.21
873.494	581.17
873.873	479.22
874.252	484.08
874.631	447.67
875.01	510.78
875.388	442.82
875.767	389.42
876.146	386.99
876.524	411.26
876.903	379.71
877.281	348.15
877.66	353.01
878.038	321.46
878.416	306.89
878.794	345.73
879.173	331.16
879.551	292.33
879.929	282.62
880.307	321.46
880.685	224.37
881.063	265.63
881.441	294.76
881.818	265.63
882.196	175.82
882.574	277.77
882.951	224.37
883.329	268.06
883.707	282.62
884.084	297.18
884.461	289.9
884.839	243.78
885.216	236.5
885.593	289.9
885.971	243.78
886.348	238.93
886.725	207.38
887.102	180.68
887.479	192.81
887.856	285.05
888.233	246.21
888.609	255.92
888.986	197.67
889.363	236.5
889.74	258.35
890.116	151.55
890.493	158.83
890.869	265.63
891.246	275.34
891.622	170.97
891.998	168.54
892.375	234.08
892.751	163.69
893.127	268.06
893.503	136.99
893.879	122.42
894.255	163.69
894.631	161.26
895.007	204.95
895.383	161.26
895.759	149.12
896.134	166.11
896.51	168.54
896.886	219.51
897.261	195.24
897.637	185.53
898.012	197.67
898.388	100.58
898.763	132.13
899.138	170.97
899.514	139.41
899.889	134.56
900.264	132.13
900.639	170.97
901.014	144.27
901.389	178.25
901.764	132.13
902.139	144.27
902.513	83.59
902.888	149.12
903.263	185.53
903.638	100.58
904.012	127.28
904.387	149.12
904.761	168.54
905.136	226.79
905.51	187.96
905.884	115.14
906.259	64.17
906.633	129.7
907.007	107.86
907.381	190.39
907.755	134.56
908.129	149.12
908.503	120
908.877	124.85
909.251	122.42
909.624	98.15
909.998	120
910.372	212.23
910.745	98.15
911.119	122.42
911.492	120
911.866	81.16
912.239	202.52
912.612	66.6
912.986	204.95
913.359	168.54
913.732	100.58
914.105	134.56
914.478	59.32
914.851	166.11
915.224	98.15
915.597	146.7
915.97	173.39
916.343	234.08
916.715	124.85
917.088	120
917.461	161.26
917.833	117.57
918.206	178.25
918.578	197.67
918.951	175.82
919.323	122.42
919.695	195.24
920.067	105.43
920.44	49.61
920.812	136.99
921.184	124.85
921.556	190.39
921.928	195.24
922.3	190.39
922.672	146.7
923.043	122.42
923.415	136.99
923.787	136.99
924.158	81.16
924.53	187.96
924.901	139.41
925.273	117.57
925.644	88.44
926.016	173.39
926.387	107.86
926.758	151.55
927.129	146.7
927.5	86.01
927.872	166.11
928.243	117.57
928.613	163.69
928.984	144.27
929.355	122.42
929.726	98.15
930.097	134.56
930.467	27.76
930.838	170.97
931.209	100.58
931.579	202.52
931.95	110.29
932.32	107.86
932.69	158.83
933.061	144.27
933.431	132.13
933.801	136.99
934.171	139.41
934.541	47.18
934.911	141.84
935.281	139.41
935.651	144.27
936.021	112.71
936.391	124.85
936.761	107.86
937.13	110.29
937.5	105.43
937.87	115.14
938.239	124.85
938.609	122.42
938.978	158.83
939.347	136.99
939.717	149.12
940.086	161.26
940.455	163.69
940.824	120
941.193	156.4
941.562	163.69
941.931	129.7
942.3	183.1
942.669	124.85
943.038	122.42
943.407	178.25
943.775	175.82
944.144	161.26
944.513	170.97
944.881	132.13
945.25	166.11
945.618	117.57
945.986	187.96
946.355	185.53
946.723	175.82
947.091	144.27
947.459	180.68
947.827	107.86
948.195	209.8
948.563	190.39
948.931	129.7
949.299	103.01
949.667	73.88
950.035	112.71
950.402	146.7
950.77	134.56
951.138	124.85
951.505	197.67
951.873	185.53
952.24	136.99
952.607	141.84
952.975	153.98
953.342	151.55
953.709	185.53
954.076	132.13
954.443	187.96
954.81	185.53
955.177	170.97
955.544	183.1
955.911	120
956.278	132.13
956.645	241.36
957.012	204.95
957.378	73.88
957.745	56.89
958.111	149.12
958.478	202.52
958.844	90.87
959.211	132.13
959.577	61.74
959.943	107.86
960.309	149.12
960.675	139.41
961.042	124.85
961.408	168.54
961.774	124.85
962.139	141.84
962.505	166.11
962.871	134.56
963.237	112.71
963.603	163.69
963.968	221.94
964.334	151.55
964.699	158.83
965.065	105.43
965.43	112.71
965.796	149.12
966.161	185.53
966.526	197.67
966.891	175.82
967.256	110.29
967.622	139.41
967.987	66.6
968.352	139.41
968.716	107.86
969.081	139.41
969.446	132.13
969.811	166.11
970.176	42.32
970.54	141.84
970.905	132.13
971.269	69.02
971.634	163.69
971.998	120
972.363	103.01
972.727	185.53
973.091	209.8
973.455	156.4
973.819	100.58
974.183	120
974.547	156.4
974.911	178.25
975.275	117.57
975.639	158.83
976.003	163.69
976.367	83.59
976.73	175.82
977.094	124.85
977.458	141.84
977.821	207.38
978.185	214.66
978.548	117.57
978.911	190.39
979.275	117.57
979.638	86.01
980.001	195.24
980.364	122.42
980.727	187.96
981.09	158.83
981.453	166.11
981.816	120
982.179	112.71
982.542	149.12
982.905	200.09
983.267	178.25
983.63	209.8
983.992	224.37
984.355	144.27
984.717	88.44
985.08	127.28
985.442	149.12
985.804	86.01
986.167	238.93
986.529	129.7
986.891	115.14
987.253	173.39
987.615	122.42
987.977	153.98
988.339	180.68
988.701	107.86
989.062	158.83
989.424	81.16
989.786	88.44
990.147	185.53
990.509	141.84
990.87	120
991.232	161.26
991.593	141.84
991.955	151.55
992.316	132.13
992.677	107.86
993.038	161.26
993.399	139.41
993.76	175.82
994.121	163.69
994.482	95.72
994.843	195.24
995.204	110.29
995.565	129.7
995.926	136.99
996.286	187.96
996.647	158.83
997.007	69.02
997.368	141.84
997.728	146.7
998.089	110.29
998.449	200.09
998.809	90.87
999.169	151.55
999.53	136.99
999.89	90.87
1000.25	153.98
1000.61	151.55
1000.97	124.85
1001.329	117.57
1001.689	151.55
1002.049	115.14
1002.409	136.99
1002.768	158.83
1003.128	141.84
1003.487	49.61
1003.847	69.02
1004.206	166.11
1004.566	141.84
1004.925	134.56
1005.284	209.8
1005.643	141.84
1006.003	212.23
1006.362	183.1
1006.721	149.12
1007.08	134.56
1007.438	117.57
1007.797	158.83
1008.156	170.97
1008.515	98.15
1008.874	161.26
1009.232	153.98
1009.591	151.55
1009.949	112.71
1010.308	168.54
1010.666	168.54
1011.024	98.15
1011.383	134.56
1011.741	122.42
1012.099	151.55
1012.457	190.39
1012.815	200.09
1013.173	180.68
1013.531	195.24
1013.889	151.55
1014.247	115.14
1014.605	122.42
1014.962	166.11
1015.32	136.99
1015.678	124.85
1016.035	170.97
1016.393	132.13
1016.75	163.69
1017.107	146.7
1017.465	183.1
1017.822	98.15
1018.179	197.67
1018.536	163.69
1018.894	90.87
1019.251	76.31
1019.608	120
1019.964	110.29
1020.321	144.27
1020.678	134.56
1021.035	168.54
1021.392	95.72
1021.748	180.68
1022.105	56.89
1022.461	144.27
1022.818	153.98
1023.174	153.98
1023.531	115.14
1023.887	107.86
1024.243	95.72
1024.599	146.7
1024.955	132.13
1025.311	136.99
1025.667	127.28
1026.023	98.15
1026.379	141.84
1026.735	158.83
1027.091	86.01
1027.447	146.7
