189.514	87.68
189.973	87.68
190.431	87.68
190.889	10.01
191.348	-19.11
191.806	-55.52
192.264	22.15
192.722	-4.55
193.18	34.28
193.638	-26.4
194.096	-21.54
194.554	-43.39
195.012	-9.41
195.47	-11.83
195.928	0.3
196.385	39.14
196.843	-74.94
197.301	22.15
197.758	10.01
198.216	-26.4
198.674	68.27
199.131	22.15
199.589	97.39
200.046	22.15
200.503	92.54
200.961	138.66
201.418	111.96
201.875	128.95
202.332	90.11
202.79	141.08
203.247	48.85
203.704	189.63
204.161	133.8
204.618	162.93
205.075	192.05
205.532	94.97
205.989	153.22
206.445	150.79
206.902	187.2
207.359	211.47
207.816	167.78
208.272	165.35
208.729	204.19
209.185	170.21
209.642	211.47
210.098	114.38
210.555	184.77
211.011	170.21
211.467	206.62
211.924	150.79
212.38	175.06
212.836	189.63
213.292	204.19
213.748	211.47
214.204	187.2
214.66	238.17
215.116	213.9
215.572	124.09
216.028	196.91
216.484	199.34
216.94	209.04
217.396	155.65
217.851	153.22
218.307	170.21
218.763	150.79
219.218	184.77
219.674	172.64
220.129	131.37
220.585	43.99
221.04	162.93
221.496	111.96
221.951	111.96
222.406	201.76
222.861	179.92
223.317	148.36
223.772	177.49
224.227	143.51
224.682	148.36
225.137	107.1
225.592	170.21
226.047	128.95
226.502	31.86
226.957	189.63
227.411	172.64
227.866	182.35
228.321	196.91
228.776	170.21
229.23	107.1
229.685	126.52
230.139	162.93
230.594	187.2
231.048	143.51
231.503	201.76
231.957	92.54
232.411	199.34
232.865	165.35
233.32	189.63
233.774	133.8
234.228	107.1
234.682	148.36
235.136	182.35
235.59	121.66
236.044	177.49
236.498	153.22
236.952	153.22
237.406	184.77
237.86	121.66
238.313	196.91
238.767	170.21
239.221	189.63
239.674	153.22
240.128	158.07
240.581	179.92
241.035	102.25
241.488	124.09
241.942	60.98
242.395	199.34
242.848	204.19
243.301	201.76
243.755	233.32
244.208	124.09
244.661	211.47
245.114	158.07
245.567	172.64
246.02	162.93
246.473	206.62
246.926	216.33
247.379	165.35
247.832	116.81
248.284	192.05
248.737	175.06
249.19	155.65
249.642	184.77
250.095	80.4
250.547	148.36
251	194.48
251.452	148.36
251.905	143.51
252.357	136.23
252.81	177.49
253.262	126.52
253.714	216.33
254.166	211.47
254.618	126.52
255.07	206.62
255.523	172.64
255.975	116.81
256.427	128.95
256.878	170.21
257.33	247.88
257.782	121.66
258.234	143.51
258.686	141.08
259.137	172.64
259.589	281.86
260.041	150.79
260.492	143.51
260.944	182.35
261.395	128.95
261.847	177.49
262.298	133.8
262.749	153.22
263.201	221.18
263.652	124.09
264.103	189.63
264.554	226.04
265.005	189.63
265.457	177.49
265.908	158.07
266.359	131.37
266.809	133.8
267.26	141.08
267.711	75.55
268.162	136.23
268.613	192.05
269.064	184.77
269.514	153.22
269.965	124.09
270.415	194.48
270.866	167.78
271.316	175.06
271.767	162.93
272.217	116.81
272.668	189.63
273.118	179.92
273.568	162.93
274.019	143.51
274.469	82.83
274.919	172.64
275.369	148.36
275.819	213.9
276.269	182.35
276.719	104.67
277.169	109.53
277.619	116.81
278.069	187.2
278.518	199.34
278.968	189.63
279.418	196.91
279.867	201.76
280.317	116.81
280.767	167.78
281.216	148.36
281.666	124.09
282.115	150.79
282.564	235.74
283.014	170.21
283.463	87.68
283.912	141.08
284.361	162.93
284.811	136.23
285.26	221.18
285.709	221.18
286.158	192.05
286.607	196.91
287.056	136.23
287.505	213.9
287.953	172.64
288.402	107.1
288.851	187.2
289.3	114.38
289.748	223.61
290.197	141.08
290.646	233.32
291.094	111.96
291.543	175.06
291.991	126.52
292.439	194.48
292.888	179.92
293.336	179.92
293.784	143.51
294.233	184.77
294.681	196.91
295.129	196.91
295.577	150.79
296.025	102.25
296.473	184.77
296.921	148.36
297.369	116.81
297.817	148.36
298.264	199.34
298.712	201.76
299.16	119.24
299.608	167.78
300.055	124.09
300.503	63.41
300.95	148.36
301.398	192.05
301.845	155.65
302.293	177.49
302.74	182.35
303.187	143.51
303.635	172.64
304.082	209.04
304.529	160.5
304.976	126.52
305.423	145.94
305.87	133.8
306.317	141.08
306.764	143.51
307.211	143.51
307.658	189.63
308.105	192.05
308.552	114.38
308.998	133.8
309.445	153.22
309.892	133.8
310.338	204.19
310.785	170.21
311.231	107.1
311.678	182.35
312.124	177.49
312.571	126.52
313.017	153.22
313.463	133.8
313.909	150.79
314.356	155.65
314.802	221.18
315.248	126.52
315.694	179.92
316.14	209.04
316.586	165.35
317.032	153.22
317.478	94.97
317.923	170.21
318.369	172.64
318.815	141.08
319.261	172.64
319.706	189.63
320.152	194.48
320.597	213.9
321.043	250.31
321.488	187.2
321.934	189.63
322.379	102.25
322.824	179.92
323.27	165.35
323.715	136.23
324.16	199.34
324.605	160.5
325.05	126.52
325.495	260.02
325.94	189.63
326.385	216.33
326.83	141.08
327.275	131.37
327.72	141.08
328.165	73.12
328.61	165.35
329.054	194.48
329.499	194.48
329.943	221.18
330.388	121.66
330.832	138.66
331.277	131.37
331.721	107.1
332.166	196.91
332.61	148.36
333.054	165.35
333.499	165.35
333.943	138.66
334.387	133.8
334.831	175.06
335.275	131.37
335.719	124.09
336.163	145.94
336.607	128.95
337.051	126.52
337.495	250.31
337.938	85.26
338.382	148.36
338.826	87.68
339.269	213.9
339.713	143.51
340.157	187.2
340.6	155.65
341.044	148.36
341.487	175.06
341.93	126.52
342.374	155.65
342.817	184.77
343.26	182.35
343.703	155.65
344.146	121.66
344.59	148.36
345.033	199.34
345.476	223.61
345.919	63.41
346.361	124.09
346.804	99.82
347.247	179.92
347.69	150.79
348.133	119.24
348.575	148.36
349.018	128.95
349.461	143.51
349.903	150.79
350.346	124.09
350.788	160.5
351.23	160.5
351.673	143.51
352.115	162.93
352.557	94.97
353	177.49
353.442	196.91
353.884	131.37
354.326	172.64
354.768	150.79
355.21	170.21
355.652	92.54
356.094	206.62
356.536	170.21
356.978	131.37
357.419	148.36
357.861	116.81
358.303	128.95
358.744	119.24
359.186	187.2
359.627	153.22
360.069	90.11
360.51	111.96
360.952	182.35
361.393	111.96
361.834	175.06
362.276	209.04
362.717	107.1
363.158	194.48
363.599	175.06
364.04	158.07
364.481	138.66
364.922	126.52
365.363	119.24
365.804	133.8
366.245	141.08
366.686	111.96
367.126	116.81
367.567	199.34
368.008	136.23
368.448	206.62
368.889	189.63
369.33	153.22
369.77	148.36
370.21	160.5
370.651	184.77
371.091	192.05
371.531	160.5
371.972	116.81
372.412	170.21
372.852	133.8
373.292	90.11
373.732	194.48
374.172	82.83
374.612	165.35
375.052	238.17
375.492	131.37
375.932	128.95
376.372	111.96
376.811	177.49
377.251	187.2
377.691	216.33
378.13	150.79
378.57	196.91
379.009	201.76
379.449	192.05
379.888	126.52
380.328	138.66
380.767	107.1
381.206	165.35
381.645	218.75
382.085	221.18
382.524	145.94
382.963	107.1
383.402	221.18
383.841	177.49
384.28	109.53
384.719	189.63
385.158	111.96
385.596	155.65
386.035	177.49
386.474	97.39
386.913	131.37
387.351	114.38
387.79	170.21
388.228	90.11
388.667	145.94
389.105	136.23
389.544	201.76
389.982	119.24
390.42	175.06
390.859	160.5
391.297	141.08
391.735	167.78
392.173	143.51
392.611	116.81
393.049	158.07
393.487	138.66
393.925	243.03
394.363	126.52
394.801	133.8
395.239	192.05
395.676	136.23
396.114	102.25
396.552	165.35
396.989	85.26
397.427	136.23
397.864	97.39
398.302	155.65
398.739	121.66
399.177	158.07
399.614	155.65
400.051	128.95
400.488	155.65
400.926	155.65
401.363	160.5
401.8	131.37
402.237	175.06
402.674	187.2
403.111	177.49
403.548	170.21
403.985	233.32
404.421	99.82
404.858	131.37
405.295	131.37
405.732	143.51
406.168	206.62
406.605	209.04
407.041	114.38
407.478	165.35
407.914	148.36
408.351	196.91
408.787	172.64
409.223	184.77
409.66	126.52
410.096	165.35
410.532	211.47
410.968	124.09
411.404	204.19
411.84	201.76
412.276	192.05
412.712	90.11
413.148	131.37
413.584	184.77
414.02	128.95
414.455	194.48
414.891	172.64
415.327	155.65
415.762	187.2
416.198	172.64
416.633	141.08
417.069	184.77
417.504	196.91
417.94	143.51
418.375	68.27
418.81	194.48
419.245	85.26
419.681	192.05
420.116	196.91
420.551	162.93
420.986	213.9
421.421	116.81
421.856	184.77
422.291	97.39
422.726	121.66
423.16	77.97
423.595	131.37
424.03	109.53
424.464	162.93
424.899	162.93
425.334	138.66
425.768	158.07
426.203	167.78
426.637	160.5
427.071	160.5
427.506	165.35
427.94	170.21
428.374	131.37
428.809	170.21
429.243	150.79
429.677	145.94
430.111	121.66
430.545	114.38
430.979	187.2
431.413	104.67
431.847	70.69
432.28	114.38
432.714	124.09
433.148	170.21
433.582	192.05
434.015	184.77
434.449	179.92
434.882	187.2
435.316	165.35
435.749	213.9
436.183	226.04
436.616	119.24
437.049	221.18
437.483	167.78
437.916	128.95
438.349	226.04
438.782	153.22
439.215	170.21
439.648	141.08
440.081	216.33
440.514	179.92
440.947	148.36
441.38	187.2
441.813	206.62
442.245	289.14
442.678	199.34
443.111	206.62
443.543	189.63
443.976	184.77
444.408	211.47
444.841	194.48
445.273	252.73
445.705	228.46
446.138	238.17
446.57	211.47
447.002	167.78
447.434	294
447.867	252.73
448.299	250.31
448.731	257.59
449.163	262.44
449.595	196.91
450.026	201.76
450.458	349.82
450.89	318.27
451.322	228.46
451.754	184.77
452.185	218.75
452.617	182.35
453.048	369.24
453.48	252.73
453.911	310.99
454.343	199.34
454.774	296.42
455.205	262.44
455.637	243.03
456.068	240.6
456.499	286.72
456.93	308.56
457.361	240.6
457.792	279.43
458.223	213.9
458.654	206.62
459.085	335.26
459.516	296.42
459.947	289.14
460.378	267.3
460.808	216.33
461.239	255.16
461.669	184.77
462.1	281.86
462.531	262.44
462.961	277.01
463.391	238.17
463.822	371.67
464.252	320.7
464.682	320.7
465.113	213.9
465.543	243.03
465.973	340.11
466.403	277.01
466.833	301.28
467.263	264.87
467.693	230.89
468.123	238.17
468.553	158.07
468.983	250.31
469.412	213.9
469.842	235.74
470.272	238.17
470.701	284.29
471.131	216.33
471.56	204.19
471.99	179.92
472.419	310.99
472.849	267.3
473.278	245.45
473.707	160.5
474.136	201.76
474.566	245.45
474.995	289.14
475.424	216.33
475.853	260.02
476.282	228.46
476.711	187.2
477.14	260.02
477.569	153.22
477.997	209.04
478.426	206.62
478.855	216.33
479.283	194.48
479.712	281.86
480.141	235.74
480.569	262.44
480.998	165.35
481.426	243.03
481.854	201.76
482.283	179.92
482.711	252.73
483.139	172.64
483.567	189.63
483.995	206.62
484.424	230.89
484.852	218.75
485.28	274.58
485.708	194.48
486.135	204.19
486.563	177.49
486.991	179.92
487.419	177.49
487.847	209.04
488.274	226.04
488.702	133.8
489.129	165.35
489.557	150.79
489.984	201.76
490.412	226.04
490.839	187.2
491.266	216.33
491.694	211.47
492.121	230.89
492.548	216.33
492.975	179.92
493.402	216.33
493.829	204.19
494.256	192.05
494.683	126.52
495.11	194.48
495.537	192.05
495.964	243.03
496.39	162.93
496.817	182.35
497.244	196.91
497.67	170.21
498.097	194.48
498.523	177.49
498.95	226.04
499.376	209.04
499.803	209.04
500.229	133.8
500.655	218.75
501.081	192.05
501.508	170.21
501.934	250.31
502.36	182.35
502.786	194.48
503.212	238.17
503.638	187.2
504.064	158.07
504.489	204.19
504.915	216.33
505.341	102.25
505.767	211.47
506.192	184.77
506.618	148.36
507.043	199.34
507.469	148.36
507.894	167.78
508.32	165.35
508.745	226.04
509.17	165.35
509.596	204.19
510.021	187.2
510.446	155.65
510.871	206.62
511.296	177.49
511.721	209.04
512.146	155.65
512.571	226.04
512.996	238.17
513.421	194.48
513.845	235.74
514.27	211.47
514.695	228.46
515.119	170.21
515.544	206.62
515.969	150.79
516.393	148.36
516.817	211.47
517.242	238.17
517.666	228.46
518.09	189.63
518.515	209.04
518.939	145.94
519.363	417.79
519.787	189.63
520.211	97.39
520.635	240.6
521.059	216.33
521.483	216.33
521.907	277.01
522.331	289.14
522.754	194.48
523.178	177.49
523.602	172.64
524.025	201.76
524.449	192.05
524.872	199.34
525.296	223.61
525.719	196.91
526.143	221.18
526.566	194.48
526.989	245.45
527.412	138.66
527.836	177.49
528.259	196.91
528.682	216.33
529.105	264.87
529.528	167.78
529.951	114.38
530.374	167.78
530.796	221.18
531.219	175.06
531.642	192.05
532.065	201.76
532.487	109.53
532.91	204.19
533.332	262.44
533.755	192.05
534.177	196.91
534.6	131.37
535.022	165.35
535.444	160.5
535.867	192.05
536.289	226.04
536.711	158.07
537.133	238.17
537.555	182.35
537.977	199.34
538.399	201.76
538.821	206.62
539.243	133.8
539.665	145.94
540.086	194.48
540.508	235.74
540.93	250.31
541.351	160.5
541.773	177.49
542.195	247.88
542.616	133.8
543.037	192.05
543.459	274.58
543.88	206.62
544.301	274.58
544.723	187.2
545.144	221.18
545.565	187.2
545.986	204.19
546.407	223.61
546.828	194.48
547.249	281.86
547.67	192.05
548.091	196.91
548.512	189.63
548.932	131.37
549.353	218.75
549.774	216.33
550.194	189.63
550.615	221.18
551.035	177.49
551.456	160.5
551.876	216.33
552.296	250.31
552.717	184.77
553.137	245.45
553.557	162.93
553.977	196.91
554.397	240.6
554.817	179.92
555.237	201.76
555.657	187.2
556.077	167.78
556.497	196.91
556.917	165.35
557.337	133.8
557.756	228.46
558.176	269.73
558.596	206.62
559.015	213.9
559.435	172.64
559.854	252.73
560.274	162.93
560.693	136.23
561.112	153.22
561.532	240.6
561.951	213.9
562.37	192.05
562.789	211.47
563.208	162.93
563.627	194.48
564.046	272.15
564.465	189.63
564.884	209.04
565.303	175.06
565.722	279.43
566.14	170.21
566.559	226.04
566.978	199.34
567.396	281.86
567.815	196.91
568.233	240.6
568.652	194.48
569.07	252.73
569.489	145.94
569.907	175.06
570.325	235.74
570.743	252.73
571.161	243.03
571.58	235.74
571.998	226.04
572.416	194.48
572.833	213.9
573.251	148.36
573.669	226.04
574.087	167.78
574.505	87.68
574.922	184.77
575.34	196.91
575.758	194.48
576.175	153.22
576.593	235.74
577.01	162.93
577.428	240.6
577.845	1786.74
578.262	320.7
578.68	194.48
579.097	175.06
579.514	182.35
579.931	131.37
580.348	170.21
580.765	179.92
581.182	187.2
581.599	233.32
582.016	228.46
582.433	124.09
582.849	228.46
583.266	131.37
583.683	165.35
584.099	260.02
584.516	153.22
584.933	218.75
585.349	194.48
585.765	184.77
586.182	148.36
586.598	167.78
587.014	155.65
587.431	192.05
587.847	192.05
588.263	160.5
588.679	162.93
589.095	145.94
589.511	170.21
589.927	143.51
590.343	167.78
590.759	223.61
591.174	167.78
591.59	194.48
592.006	170.21
592.421	192.05
592.837	192.05
593.252	189.63
593.668	148.36
594.083	228.46
594.499	257.59
594.914	138.66
595.329	233.32
595.745	133.8
596.16	221.18
596.575	182.35
596.99	252.73
597.405	131.37
597.82	238.17
598.235	255.16
598.65	131.37
599.065	141.08
599.479	199.34
599.894	165.35
600.309	148.36
600.724	201.76
601.138	264.87
601.553	201.76
601.967	194.48
602.382	155.65
602.796	216.33
603.21	145.94
603.625	160.5
604.039	216.33
604.453	170.21
604.867	170.21
605.281	165.35
605.695	187.2
606.109	153.22
606.523	238.17
606.937	216.33
607.351	286.72
607.765	213.9
608.178	187.2
608.592	189.63
609.006	221.18
609.419	218.75
609.833	194.48
610.246	221.18
610.66	192.05
611.073	238.17
611.487	189.63
611.9	211.47
612.313	218.75
612.726	204.19
613.139	170.21
613.553	218.75
613.966	121.66
614.379	194.48
614.792	194.48
615.204	179.92
615.617	192.05
616.03	172.64
616.443	199.34
616.856	162.93
617.268	133.8
617.681	245.45
618.093	218.75
618.506	192.05
618.918	192.05
619.331	189.63
619.743	121.66
620.155	267.3
620.568	177.49
620.98	179.92
621.392	209.04
621.804	221.18
622.216	196.91
622.628	223.61
623.04	177.49
623.452	184.77
623.864	213.9
624.276	138.66
624.687	172.64
625.099	172.64
625.511	189.63
625.922	201.76
626.334	179.92
626.745	143.51
627.157	160.5
627.568	148.36
627.979	175.06
628.391	141.08
628.802	114.38
629.213	167.78
629.624	213.9
630.035	206.62
630.446	226.04
630.857	148.36
631.268	99.82
631.679	187.2
632.09	196.91
632.501	213.9
632.912	196.91
633.322	213.9
633.733	221.18
634.144	162.93
634.554	192.05
634.965	177.49
635.375	187.2
635.785	121.66
636.196	260.02
636.606	170.21
637.016	153.22
637.427	104.67
637.837	128.95
638.247	111.96
638.657	194.48
639.067	116.81
639.477	216.33
639.887	141.08
640.297	158.07
640.706	206.62
641.116	189.63
641.526	148.36
641.935	160.5
642.345	192.05
642.755	165.35
643.164	233.32
643.573	218.75
643.983	175.06
644.392	216.33
644.801	94.97
645.211	199.34
645.62	223.61
646.029	221.18
646.438	199.34
646.847	165.35
647.256	192.05
647.665	206.62
648.074	187.2
648.483	177.49
648.892	114.38
649.3	196.91
649.709	211.47
650.118	153.22
650.526	138.66
650.935	187.2
651.343	230.89
651.752	267.3
652.16	211.47
652.568	160.5
652.977	148.36
653.385	196.91
653.793	182.35
654.201	243.03
654.609	165.35
655.017	199.34
655.425	133.8
655.833	213.9
656.241	213.9
656.649	150.79
657.057	131.37
657.464	196.91
657.872	218.75
658.28	128.95
658.687	228.46
659.095	107.1
659.502	170.21
659.91	167.78
660.317	240.6
660.724	177.49
661.132	170.21
661.539	206.62
661.946	158.07
662.353	184.77
662.76	192.05
663.167	213.9
663.574	243.03
663.981	172.64
664.388	160.5
664.795	177.49
665.202	143.51
665.608	160.5
666.015	150.79
666.422	209.04
666.828	121.66
667.235	250.31
667.641	150.79
668.047	201.76
668.454	211.47
668.86	204.19
669.266	192.05
669.673	141.08
670.079	238.17
670.485	238.17
670.891	187.2
671.297	92.54
671.703	179.92
672.109	124.09
672.515	136.23
672.92	177.49
673.326	155.65
673.732	196.91
674.138	104.67
674.543	238.17
674.949	192.05
675.354	145.94
675.76	175.06
676.165	184.77
676.57	199.34
676.976	201.76
677.381	209.04
677.786	177.49
678.191	153.22
678.596	162.93
679.001	170.21
679.406	209.04
679.811	243.03
680.216	211.47
680.621	228.46
681.026	116.81
681.43	133.8
681.835	226.04
682.24	94.97
682.644	182.35
683.049	121.66
683.453	230.89
683.858	155.65
684.262	165.35
684.667	153.22
685.071	172.64
685.475	196.91
685.879	211.47
686.283	165.35
686.687	201.76
687.091	141.08
687.495	192.05
687.899	264.87
688.303	160.5
688.707	109.53
689.111	111.96
689.514	199.34
689.918	226.04
690.322	160.5
690.725	170.21
691.129	184.77
691.532	194.48
691.936	216.33
692.339	172.64
692.742	160.5
693.146	167.78
693.549	177.49
693.952	192.05
694.355	170.21
694.758	167.78
695.161	238.17
695.564	213.9
695.967	240.6
696.37	153.22
696.773	201.76
697.175	221.18
697.578	187.2
697.981	111.96
698.383	199.34
698.786	182.35
699.188	160.5
699.591	175.06
699.993	158.07
700.395	179.92
700.798	221.18
701.2	133.8
701.602	158.07
702.004	170.21
702.406	148.36
702.808	204.19
703.21	160.5
703.612	226.04
704.014	141.08
704.416	158.07
704.818	189.63
705.219	145.94
705.621	240.6
706.023	160.5
706.424	199.34
706.826	138.66
707.227	213.9
707.629	218.75
708.03	213.9
708.431	187.2
708.832	213.9
709.234	243.03
709.635	262.44
710.036	233.32
710.437	196.91
710.838	165.35
711.239	230.89
711.64	187.2
712.041	228.46
712.441	269.73
712.842	230.89
713.243	216.33
713.643	255.16
714.044	201.76
714.445	310.99
714.845	318.27
715.246	315.84
715.646	245.45
716.046	240.6
716.447	315.84
716.847	303.71
717.247	301.28
717.647	289.14
718.047	277.01
718.447	335.26
718.847	279.43
719.247	303.71
719.647	337.69
720.047	289.14
720.446	347.4
720.846	296.42
721.246	335.26
721.645	410.5
722.045	374.1
722.444	325.55
722.844	315.84
723.243	405.65
723.643	429.92
724.042	378.95
724.441	391.09
724.84	408.08
725.24	425.07
725.639	478.47
726.038	476.04
726.437	427.49
726.836	403.22
727.234	437.2
727.633	483.32
728.032	553.71
728.431	531.87
728.83	592.55
729.228	619.25
729.627	616.82
730.025	687.21
730.424	682.35
730.822	728.47
731.22	825.56
731.619	871.68
732.017	893.52
732.415	1024.59
732.813	1172.65
733.212	1194.5
733.61	1274.6
734.008	1315.86
734.406	1342.56
734.803	1546.44
735.201	1502.75
735.599	1662.95
735.997	1767.32
736.395	1767.32
736.792	1917.81
737.19	2104.71
737.587	2262.47
737.985	2432.38
738.382	2578.01
738.78	2706.66
739.177	2786.75
739.574	3048.89
739.971	3172.68
740.369	3187.25
740.766	3294.04
741.163	3318.32
741.56	3580.46
741.957	3575.6
742.354	3859.59
742.751	4306.2
743.147	4432.41
743.544	4696.98
743.941	4842.61
744.338	5213.98
744.734	5357.18
745.131	5403.3
745.527	5631.46
745.924	5818.36
746.32	6090.2
746.716	6391.18
747.113	6781.96
747.509	7580.52
747.905	7908.19
748.301	8422.76
748.697	8745.59
749.093	8915.49
749.489	9034.42
749.885	9459.19
750.281	9551.42
750.677	9990.75
751.073	10515.03
751.468	11116.98
751.864	12172.82
752.26	12408.26
752.655	13371.87
753.051	13512.65
753.446	13993.24
753.842	13993.24
754.237	14019.94
754.632	14568.49
755.028	14925.29
755.423	15296.66
755.818	16090.36
756.213	16930.18
756.608	17592.81
757.003	17971.46
757.398	17585.53
757.793	17634.07
758.188	17158.34
758.583	17333.1
758.977	17852.52
759.372	18925.36
759.767	20706.94
760.161	22374.44
760.556	23864.75
760.95	24466.7
761.345	24932.73
761.739	25219.14
762.133	24808.94
762.527	25507.98
762.922	26335.66
763.316	27643.94
763.71	29559.02
764.104	30779.91
764.498	32051.77
764.892	33003.24
765.286	32799.36
765.68	31944.98
766.073	31828.47
766.467	32156.14
766.861	33719.27
767.255	35614.94
767.648	37617.39
768.042	39607.72
768.435	40348.02
768.829	40292.19
769.222	39381.98
769.615	39078.58
770.008	37937.79
770.402	38867.41
770.795	40411.13
771.188	42602.91
771.581	43406.32
771.974	43493.7
772.367	42724.27
772.76	41423.28
773.153	39782.48
773.545	39182.95
773.938	40367.44
774.331	42061.64
774.724	43615.06
775.116	46061.7
775.509	48365.13
775.901	48906.4
776.294	47619.98
776.686	47144.24
777.078	47396.67
777.471	48420.96
777.863	51600.62
778.255	55544.86
778.647	56569.14
779.039	56489.05
779.431	54321.54
779.823	52976.86
780.215	54030.27
780.607	53641.91
780.999	55802.14
781.39	56770.6
781.782	58416.26
782.174	58324.03
782.565	57612.85
782.957	56959.93
783.348	56928.37
783.74	56731.77
784.131	56874.97
784.522	58217.23
784.914	58537.62
785.305	58870.15
785.696	58316.74
786.087	56758.47
786.478	54246.29
786.869	52916.18
787.26	53314.24
787.651	53680.75
788.042	54224.45
788.433	53916.19
788.823	52518.11
789.214	50542.35
789.605	48552.03
789.995	47755.9
790.386	47243.76
790.776	47343.27
791.167	48493.78
791.557	49615.15
791.948	50098.17
792.338	49653.99
792.728	50234.09
793.118	49093.3
793.508	50738.96
793.898	51571.49
794.288	52848.21
794.678	52268.11
795.068	52200.14
795.458	50848.18
795.848	50423.42
796.238	50083.61
796.627	50139.43
797.017	50503.52
797.406	51401.59
797.796	51814.22
798.185	51617.61
798.575	50595.75
798.964	49918.56
799.354	49991.37
799.743	51515.67
800.132	52649.18
800.521	52406.46
800.91	52139.46
801.299	50617.6
801.688	49782.63
802.077	48321.44
802.466	49018.06
802.855	50052.05
803.244	49180.68
803.633	49202.53
804.021	47578.71
804.41	45561.69
804.799	43721.86
805.187	42445.14
805.576	42561.65
805.964	42823.79
806.352	41377.16
806.741	40872.3
807.129	39547.04
807.517	39110.14
807.905	39408.68
808.293	39530.04
808.681	40758.22
809.069	41049.49
809.457	42267.95
809.845	40850.45
810.233	40047.04
810.621	39898.98
811.009	39814.03
811.396	41000.94
811.784	41983.97
812.171	41163.57
812.559	40680.55
812.946	39008.19
813.334	38231.48
813.721	37539.72
814.108	37047
814.496	37379.53
814.883	37292.15
815.27	36986.32
815.657	36034.84
816.044	35658.63
816.431	35522.7
816.818	35386.78
817.205	35408.62
817.592	35935.33
817.979	34928.03
818.365	33901.32
818.752	32163.43
819.139	31097.87
819.525	30675.54
819.912	30430.39
820.298	30289.61
820.685	28961.92
821.071	27520.15
821.457	26796.84
821.843	25578.37
822.23	25398.76
822.616	24753.12
823.002	23452.12
823.388	22966.68
823.774	22240.94
824.16	21100.15
824.546	20345.28
824.931	20318.58
825.317	20027.31
825.703	20126.83
826.089	19415.65
826.474	19337.98
826.86	18260.3
827.245	17939.9
827.631	18245.73
828.016	18056.41
828.401	17706.89
828.787	17022.41
829.172	16762.7
829.557	16053.95
829.942	15303.94
830.327	15459.28
830.712	15347.63
831.097	15102.48
831.482	14536.94
831.867	14019.94
832.252	13367.02
832.636	13243.23
833.021	13286.92
833.406	13532.07
833.79	12840.31
834.175	12398.55
834.559	12097.58
834.944	11563.59
835.328	11328.15
835.713	11238.34
836.097	11136.4
836.481	10599.98
836.865	10034.44
837.249	9675.21
837.633	8864.52
838.017	8859.66
838.401	8765
838.785	8383.93
839.169	8294.12
839.553	7784.41
839.937	7235.85
840.32	6985.85
840.704	6815.94
841.087	6614.48
841.471	6359.63
841.854	6286.81
842.238	5869.33
842.621	5692.14
843.004	5507.67
843.388	5415.44
843.771	5561.07
844.154	5553.79
844.537	5461.55
844.92	5315.92
845.303	4908.15
845.686	4779.5
846.069	4847.47
846.452	4939.7
846.834	4694.55
847.217	4473.67
847.6	4216.39
847.982	4075.61
848.365	4143.57
848.748	4262.51
849.13	4053.76
849.512	3934.83
849.895	3777.06
850.277	3522.2
850.659	3531.91
851.041	3556.18
851.423	3500.36
851.806	3495.5
852.188	3328.03
852.57	3085.3
852.951	3092.58
853.333	2976.08
853.715	3002.78
854.097	2837.73
854.479	2789.18
854.86	2648.4
855.242	2595
855.623	2357.14
856.005	2405.68
856.386	2330.44
856.768	2177.52
857.149	2245.48
857.53	2087.71
857.911	1961.5
858.292	1946.94
858.674	1886.26
859.055	1718.78
859.436	1791.59
859.817	1536.74
860.197	1590.13
860.578	1473.63
860.959	1400.81
861.34	1429.94
861.72	1371.68
862.101	1420.23
862.482	1223.62
862.862	1235.76
863.243	1155.66
863.623	1167.8
864.003	1155.66
864.384	1085.27
864.764	1099.84
865.144	932.36
865.524	917.79
865.904	985.76
866.284	978.47
866.664	1022.16
867.044	869.25
867.424	874.1
867.804	811
868.183	837.7
868.563	777.01
868.943	733.32
869.322	743.03
869.702	820.7
870.081	645.94
870.461	650.8
870.84	692.06
871.22	594.97
871.599	609.54
871.978	607.11
872.357	563.42
872.736	531.87
873.115	541.57
873.494	599.83
873.873	544
874.252	527.01
874.631	463.9
875.01	410.5
875.388	427.49
875.767	427.49
876.146	395.94
876.524	400.8
876.903	381.38
877.281	417.79
877.66	395.94
878.038	298.85
878.416	274.58
878.794	376.52
879.173	337.69
879.551	313.42
879.929	294
880.307	296.42
880.685	284.29
881.063	318.27
881.441	330.41
881.818	320.7
882.196	340.11
882.574	238.17
882.951	281.86
883.329	252.73
883.707	204.19
884.084	240.6
884.461	264.87
884.839	233.32
885.216	201.76
885.593	267.3
885.971	303.71
886.348	264.87
886.725	228.46
887.102	272.15
887.479	301.28
887.856	230.89
888.233	240.6
888.609	138.66
888.986	128.95
889.363	194.48
889.74	199.34
890.116	192.05
890.493	179.92
890.869	221.18
891.246	187.2
891.622	206.62
891.998	194.48
892.375	158.07
892.751	121.66
893.127	228.46
893.503	121.66
893.879	192.05
894.255	182.35
894.631	179.92
895.007	206.62
895.383	206.62
895.759	175.06
896.134	136.23
896.51	143.51
896.886	211.47
897.261	107.1
897.637	116.81
898.012	162.93
898.388	167.78
898.763	145.94
899.138	184.77
899.514	172.64
899.889	187.2
900.264	194.48
900.639	218.75
901.014	194.48
901.389	158.07
901.764	196.91
902.139	206.62
902.513	162.93
902.888	165.35
903.263	133.8
903.638	138.66
904.012	138.66
904.387	119.24
904.761	196.91
905.136	194.48
905.51	255.16
905.884	162.93
906.259	109.53
906.633	179.92
907.007	187.2
907.381	148.36
907.755	172.64
908.129	143.51
908.503	167.78
908.877	107.1
909.251	111.96
909.624	209.04
909.998	211.47
910.372	155.65
910.745	121.66
911.119	116.81
911.492	162.93
911.866	175.06
912.239	167.78
912.612	177.49
912.986	172.64
913.359	143.51
913.732	177.49
914.105	196.91
914.478	189.63
914.851	189.63
915.224	97.39
915.597	187.2
915.97	177.49
916.343	141.08
916.715	116.81
917.088	128.95
917.461	141.08
917.833	175.06
918.206	177.49
918.578	136.23
918.951	182.35
919.323	177.49
919.695	87.68
920.067	158.07
920.44	119.24
920.812	148.36
921.184	167.78
921.556	167.78
921.928	150.79
922.3	114.38
922.672	136.23
923.043	138.66
923.415	141.08
923.787	177.49
924.158	119.24
924.53	187.2
924.901	119.24
925.273	138.66
925.644	104.67
926.016	235.74
926.387	184.77
926.758	128.95
927.129	133.8
927.5	99.82
927.872	119.24
928.243	209.04
928.613	196.91
928.984	141.08
929.355	184.77
929.726	143.51
930.097	99.82
930.467	131.37
930.838	119.24
931.209	162.93
931.579	155.65
931.95	160.5
932.32	136.23
932.69	189.63
933.061	128.95
933.431	143.51
933.801	211.47
934.171	150.79
934.541	175.06
934.911	124.09
935.281	194.48
935.651	179.92
936.021	128.95
936.391	121.66
936.761	148.36
937.13	162.93
937.5	80.4
937.87	279.43
938.239	143.51
938.609	150.79
938.978	209.04
939.347	82.83
939.717	99.82
940.086	136.23
940.455	160.5
940.824	194.48
941.193	226.04
941.562	187.2
941.931	99.82
942.3	209.04
942.669	133.8
943.038	170.21
943.407	131.37
943.775	104.67
944.144	158.07
944.513	170.21
944.881	184.77
945.25	124.09
945.618	150.79
945.986	109.53
946.355	301.28
946.723	121.66
947.091	107.1
947.459	133.8
947.827	150.79
948.195	172.64
948.563	153.22
948.931	170.21
949.299	189.63
949.667	199.34
950.035	128.95
950.402	141.08
950.77	107.1
951.138	182.35
951.505	133.8
951.873	194.48
952.24	131.37
952.607	194.48
952.975	194.48
953.342	179.92
953.709	136.23
954.076	192.05
954.443	107.1
954.81	170.21
955.177	167.78
955.544	150.79
955.911	221.18
956.278	131.37
956.645	167.78
957.012	175.06
957.378	201.76
957.745	223.61
958.111	201.76
958.478	211.47
958.844	226.04
959.211	170.21
959.577	143.51
959.943	136.23
960.309	201.76
960.675	155.65
961.042	141.08
961.408	121.66
961.774	150.79
962.139	170.21
962.505	116.81
962.871	150.79
963.237	131.37
963.603	158.07
963.968	153.22
964.334	226.04
964.699	182.35
965.065	131.37
965.43	194.48
965.796	82.83
966.161	170.21
966.526	107.1
966.891	155.65
967.256	172.64
967.622	51.28
967.987	138.66
968.352	182.35
968.716	124.09
969.081	211.47
969.446	128.95
969.811	141.08
970.176	153.22
970.54	104.67
970.905	90.11
971.269	162.93
971.634	128.95
971.998	136.23
972.363	104.67
972.727	133.8
973.091	121.66
973.455	170.21
973.819	90.11
974.183	90.11
974.547	155.65
974.911	160.5
975.275	194.48
975.639	160.5
976.003	226.04
976.367	128.95
976.73	107.1
977.094	179.92
977.458	167.78
977.821	121.66
978.185	107.1
978.548	177.49
978.911	153.22
979.275	141.08
979.638	136.23
980.001	133.8
980.364	119.24
980.727	228.46
981.09	264.87
981.453	155.65
981.816	145.94
982.179	165.35
982.542	162.93
982.905	165.35
983.267	167.78
983.63	264.87
983.992	150.79
984.355	138.66
984.717	145.94
985.08	75.55
985.442	116.81
985.804	119.24
986.167	155.65
986.529	119.24
986.891	150.79
987.253	179.92
987.615	99.82
987.977	94.97
988.339	124.09
988.701	167.78
989.062	179.92
989.424	102.25
989.786	114.38
990.147	170.21
990.509	172.64
990.87	148.36
991.232	184.77
991.593	172.64
991.955	175.06
992.316	121.66
992.677	167.78
993.038	209.04
993.399	170.21
993.76	148.36
994.121	133.8
994.482	111.96
994.843	141.08
995.204	182.35
995.565	121.66
995.926	148.36
996.286	124.09
996.647	114.38
997.007	199.34
997.368	155.65
997.728	194.48
998.089	136.23
998.449	128.95
998.809	148.36
999.169	179.92
999.53	182.35
999.89	109.53
1000.25	194.48
1000.61	160.5
1000.97	114.38
1001.329	80.4
1001.689	109.53
1002.049	68.27
1002.409	131.37
1002.768	104.67
1003.128	133.8
1003.487	87.68
1003.847	167.78
1004.206	124.09
1004.566	116.81
1004.925	162.93
1005.284	228.46
1005.643	138.66
1006.003	167.78
1006.362	136.23
1006.721	97.39
1007.08	102.25
1007.438	82.83
1007.797	172.64
1008.156	82.83
1008.515	138.66
1008.874	194.48
1009.232	155.65
1009.591	111.96
1009.949	116.81
1010.308	223.61
1010.666	104.67
1011.024	104.67
1011.383	148.36
1011.741	145.94
1012.099	131.37
1012.457	145.94
1012.815	141.08
1013.173	136.23
1013.531	145.94
1013.889	177.49
1014.247	82.83
1014.605	126.52
1014.962	160.5
1015.32	145.94
1015.678	199.34
1016.035	138.66
1016.393	128.95
1016.75	160.5
1017.107	107.1
1017.465	119.24
1017.822	148.36
1018.179	138.66
1018.536	75.55
1018.894	133.8
1019.251	145.94
1019.608	121.66
1019.964	158.07
1020.321	128.95
1020.678	109.53
1021.035	145.94
1021.392	107.1
1021.748	128.95
1022.105	111.96
1022.461	223.61
1022.818	138.66
1023.174	94.97
1023.531	143.51
1023.887	148.36
1024.243	121.66
1024.599	204.19
1024.955	111.96
1025.311	206.62
1025.667	111.96
1026.023	204.19
1026.379	153.22
1026.735	155.65
1027.091	104.67
1027.447	133.8
