189.514	41.26
189.973	41.26
190.431	41.26
190.889	33.98
191.348	2.43
191.806	-12.14
192.264	24.27
192.722	-2.43
193.18	-29.13
193.638	-4.85
194.096	0
194.554	-41.26
195.012	-21.84
195.47	-48.54
195.928	12.14
196.385	16.99
196.843	-26.7
197.301	-2.43
197.758	-4.85
198.216	-9.71
198.674	48.54
199.131	89.81
199.589	87.38
200.046	67.96
200.503	70.39
200.961	84.95
201.418	84.95
201.875	140.78
202.332	77.67
202.79	65.54
203.247	97.09
203.704	77.67
204.161	92.23
204.618	172.33
205.075	140.78
205.532	128.64
205.989	140.78
206.445	140.78
206.902	106.8
207.359	186.9
207.816	150.49
208.272	179.61
208.729	89.81
209.185	196.61
209.642	118.93
210.098	174.76
210.555	111.65
211.011	94.66
211.467	218.45
211.924	157.77
212.38	121.36
212.836	118.93
213.292	186.9
213.748	99.52
214.204	157.77
214.66	138.35
215.116	184.47
215.572	152.92
216.028	167.48
216.484	111.65
216.94	169.91
217.396	97.09
217.851	169.91
218.307	36.41
218.763	160.2
219.218	138.35
219.674	155.34
220.129	165.05
220.585	155.34
221.04	148.06
221.496	167.48
221.951	152.92
222.406	67.96
222.861	126.22
223.317	182.04
223.772	128.64
224.227	140.78
224.682	118.93
225.137	148.06
225.592	157.77
226.047	99.52
226.502	94.66
226.957	133.5
227.411	199.03
227.866	191.75
228.321	157.77
228.776	131.07
229.23	157.77
229.685	82.53
230.139	114.08
230.594	162.62
231.048	101.94
231.503	169.91
231.957	174.76
232.411	177.19
232.865	208.74
233.32	148.06
233.774	177.19
234.228	133.5
234.682	140.78
235.136	177.19
235.59	101.94
236.044	165.05
236.498	123.79
236.952	72.82
237.406	148.06
237.86	143.21
238.313	162.62
238.767	182.04
239.221	162.62
239.674	177.19
240.128	118.93
240.581	99.52
241.035	135.92
241.488	126.22
241.942	135.92
242.395	104.37
242.848	162.62
243.301	143.21
243.755	155.34
244.208	155.34
244.661	77.67
245.114	128.64
245.567	94.66
246.02	63.11
246.473	106.8
246.926	174.76
247.379	101.94
247.832	186.9
248.284	179.61
248.737	126.22
249.19	118.93
249.642	155.34
250.095	143.21
250.547	165.05
251	84.95
251.452	131.07
251.905	123.79
252.357	126.22
252.81	109.23
253.262	201.46
253.714	157.77
254.166	186.9
254.618	155.34
255.07	60.68
255.523	94.66
255.975	138.35
256.427	116.51
256.878	174.76
257.33	109.23
257.782	97.09
258.234	174.76
258.686	148.06
259.137	143.21
259.589	169.91
260.041	111.65
260.492	123.79
260.944	162.62
261.395	145.63
261.847	208.74
262.298	184.47
262.749	126.22
263.201	145.63
263.652	177.19
264.103	126.22
264.554	174.76
265.005	162.62
265.457	92.23
265.908	145.63
266.359	157.77
266.809	179.61
267.26	97.09
267.711	121.36
268.162	99.52
268.613	121.36
269.064	169.91
269.514	145.63
269.965	150.49
270.415	186.9
270.866	114.08
271.316	116.51
271.767	75.24
272.217	184.47
272.668	126.22
273.118	157.77
273.568	194.18
274.019	140.78
274.469	191.75
274.919	211.17
275.369	135.92
275.819	126.22
276.269	111.65
276.719	101.94
277.169	174.76
277.619	172.33
278.069	135.92
278.518	140.78
278.968	75.24
279.418	123.79
279.867	155.34
280.317	155.34
280.767	143.21
281.216	194.18
281.666	148.06
282.115	191.75
282.564	165.05
283.014	126.22
283.463	169.91
283.912	126.22
284.361	152.92
284.811	133.5
285.26	165.05
285.709	116.51
286.158	172.33
286.607	177.19
287.056	223.3
287.505	140.78
287.953	160.2
288.402	206.31
288.851	114.08
289.3	216.02
289.748	213.6
290.197	106.8
290.646	92.23
291.094	118.93
291.543	174.76
291.991	167.48
292.439	99.52
292.888	148.06
293.336	179.61
293.784	133.5
294.233	157.77
294.681	97.09
295.129	157.77
295.577	242.72
296.025	140.78
296.473	121.36
296.921	123.79
297.369	126.22
297.817	97.09
298.264	169.91
298.712	160.2
299.16	148.06
299.608	172.33
300.055	179.61
300.503	203.89
300.95	172.33
301.398	152.92
301.845	160.2
302.293	206.31
302.74	157.77
303.187	143.21
303.635	182.04
304.082	172.33
304.529	77.67
304.976	140.78
305.423	177.19
305.87	167.48
306.317	174.76
306.764	70.39
307.211	165.05
307.658	162.62
308.105	199.03
308.552	155.34
308.998	169.91
309.445	157.77
309.892	182.04
310.338	216.02
310.785	138.35
311.231	121.36
311.678	240.3
312.124	152.92
312.571	194.18
313.017	160.2
313.463	131.07
313.909	165.05
314.356	186.9
314.802	177.19
315.248	177.19
315.694	135.92
316.14	199.03
316.586	162.62
317.032	245.15
317.478	186.9
317.923	101.94
318.369	104.37
318.815	60.68
319.261	140.78
319.706	126.22
320.152	162.62
320.597	135.92
321.043	165.05
321.488	196.61
321.934	92.23
322.379	138.35
322.824	80.1
323.27	121.36
323.715	123.79
324.16	179.61
324.605	123.79
325.05	99.52
325.495	80.1
325.94	174.76
326.385	126.22
326.83	196.61
327.275	206.31
327.72	148.06
328.165	152.92
328.61	186.9
329.054	128.64
329.499	184.47
329.943	191.75
330.388	148.06
330.832	101.94
331.277	186.9
331.721	174.76
332.166	160.2
332.61	106.8
333.054	114.08
333.499	199.03
333.943	160.2
334.387	152.92
334.831	184.47
335.275	199.03
335.719	131.07
336.163	114.08
336.607	145.63
337.051	145.63
337.495	111.65
337.938	114.08
338.382	104.37
338.826	182.04
339.269	109.23
339.713	155.34
340.157	148.06
340.6	167.48
341.044	106.8
341.487	152.92
341.93	160.2
342.374	174.76
342.817	160.2
343.26	135.92
343.703	155.34
344.146	116.51
344.59	152.92
345.033	165.05
345.476	182.04
345.919	92.23
346.361	196.61
346.804	128.64
347.247	155.34
347.69	182.04
348.133	174.76
348.575	199.03
349.018	92.23
349.461	33.98
349.903	152.92
350.346	157.77
350.788	174.76
351.23	155.34
351.673	194.18
352.115	152.92
352.557	140.78
353	140.78
353.442	150.49
353.884	104.37
354.326	94.66
354.768	77.67
355.21	97.09
355.652	150.49
356.094	126.22
356.536	131.07
356.978	111.65
357.419	206.31
357.861	155.34
358.303	155.34
358.744	160.2
359.186	109.23
359.627	143.21
360.069	225.73
360.51	148.06
360.952	123.79
361.393	150.49
361.834	169.91
362.276	97.09
362.717	131.07
363.158	148.06
363.599	145.63
364.04	67.96
364.481	140.78
364.922	148.06
365.363	101.94
365.804	97.09
366.245	194.18
366.686	133.5
367.126	152.92
367.567	194.18
368.008	179.61
368.448	165.05
368.889	172.33
369.33	126.22
369.77	162.62
370.21	182.04
370.651	167.48
371.091	104.37
371.531	143.21
371.972	182.04
372.412	165.05
372.852	104.37
373.292	140.78
373.732	131.07
374.172	99.52
374.612	131.07
375.052	75.24
375.492	152.92
375.932	116.51
376.372	101.94
376.811	206.31
377.251	186.9
377.691	162.62
378.13	172.33
378.57	225.73
379.009	172.33
379.449	148.06
379.888	174.76
380.328	167.48
380.767	133.5
381.206	174.76
381.645	157.77
382.085	123.79
382.524	160.2
382.963	182.04
383.402	150.49
383.841	131.07
384.28	169.91
384.719	162.62
385.158	101.94
385.596	138.35
386.035	177.19
386.474	165.05
386.913	157.77
387.351	116.51
387.79	184.47
388.228	106.8
388.667	150.49
389.105	160.2
389.544	196.61
389.982	216.02
390.42	167.48
390.859	109.23
391.297	131.07
391.735	155.34
392.173	150.49
392.611	80.1
393.049	143.21
393.487	162.62
393.925	160.2
394.363	148.06
394.801	133.5
395.239	131.07
395.676	123.79
396.114	152.92
396.552	131.07
396.989	92.23
397.427	143.21
397.864	177.19
398.302	123.79
398.739	169.91
399.177	148.06
399.614	118.93
400.051	135.92
400.488	186.9
400.926	135.92
401.363	94.66
401.8	143.21
402.237	206.31
402.674	155.34
403.111	167.48
403.548	140.78
403.985	191.75
404.421	128.64
404.858	123.79
405.295	133.5
405.732	196.61
406.168	135.92
406.605	177.19
407.041	118.93
407.478	128.64
407.914	150.49
408.351	65.54
408.787	182.04
409.223	157.77
409.66	174.76
410.096	145.63
410.532	182.04
410.968	155.34
411.404	199.03
411.84	116.51
412.276	206.31
412.712	109.23
413.148	99.52
413.584	58.25
414.02	184.47
414.455	121.36
414.891	213.6
415.327	177.19
415.762	135.92
416.198	165.05
416.633	135.92
417.069	80.1
417.504	169.91
417.94	118.93
418.375	118.93
418.81	152.92
419.245	152.92
419.681	118.93
420.116	208.74
420.551	148.06
420.986	172.33
421.421	157.77
421.856	152.92
422.291	138.35
422.726	162.62
423.16	157.77
423.595	123.79
424.03	174.76
424.464	84.95
424.899	216.02
425.334	203.89
425.768	211.17
426.203	140.78
426.637	106.8
427.071	99.52
427.506	208.74
427.94	148.06
428.374	140.78
428.809	179.61
429.243	152.92
429.677	162.62
430.111	131.07
430.545	36.41
430.979	116.51
431.413	194.18
431.847	152.92
432.28	140.78
432.714	126.22
433.148	172.33
433.582	133.5
434.015	165.05
434.449	140.78
434.882	143.21
435.316	140.78
435.749	155.34
436.183	131.07
436.616	138.35
437.049	165.05
437.483	230.59
437.916	223.3
438.349	174.76
438.782	160.2
439.215	87.38
439.648	75.24
440.081	143.21
440.514	111.65
440.947	118.93
441.38	101.94
441.813	128.64
442.245	162.62
442.678	82.53
443.111	123.79
443.543	148.06
443.976	67.96
444.408	89.81
444.841	143.21
445.273	213.6
445.705	179.61
446.138	111.65
446.57	150.49
447.002	104.37
447.434	203.89
447.867	121.36
448.299	179.61
448.731	165.05
449.163	109.23
449.595	101.94
450.026	135.92
450.458	174.76
450.89	174.76
451.322	123.79
451.754	179.61
452.185	104.37
452.617	131.07
453.048	123.79
453.48	126.22
453.911	177.19
454.343	172.33
454.774	266.99
455.205	223.3
455.637	126.22
456.068	196.61
456.499	114.08
456.93	118.93
457.361	160.2
457.792	140.78
458.223	186.9
458.654	148.06
459.085	199.03
459.516	194.18
459.947	140.78
460.378	145.63
460.808	140.78
461.239	152.92
461.669	191.75
462.1	162.62
462.531	128.64
462.961	165.05
463.391	182.04
463.822	162.62
464.252	65.54
464.682	172.33
465.113	186.9
465.543	172.33
465.973	177.19
466.403	218.45
466.833	189.32
467.263	118.93
467.693	145.63
468.123	182.04
468.553	87.38
468.983	116.51
469.412	118.93
469.842	199.03
470.272	157.77
470.701	99.52
471.131	211.17
471.56	208.74
471.99	150.49
472.419	167.48
472.849	174.76
473.278	87.38
473.707	155.34
474.136	118.93
474.566	155.34
474.995	167.48
475.424	143.21
475.853	118.93
476.282	150.49
476.711	179.61
477.14	97.09
477.569	160.2
477.997	179.61
478.426	162.62
478.855	131.07
479.283	216.02
479.712	165.05
480.141	213.6
480.569	143.21
480.998	148.06
481.426	257.29
481.854	177.19
482.283	186.9
482.711	145.63
483.139	220.88
483.567	157.77
483.995	155.34
484.424	199.03
484.852	182.04
485.28	97.09
485.708	143.21
486.135	257.29
486.563	133.5
486.991	160.2
487.419	211.17
487.847	220.88
488.274	194.18
488.702	150.49
489.129	182.04
489.557	167.48
489.984	189.32
490.412	194.18
490.839	194.18
491.266	174.76
491.694	206.31
492.121	169.91
492.548	254.86
492.975	182.04
493.402	131.07
493.829	157.77
494.256	160.2
494.683	218.45
495.11	128.64
495.537	138.35
495.964	169.91
496.39	101.94
496.817	184.47
497.244	169.91
497.67	245.15
498.097	206.31
498.523	128.64
498.95	135.92
499.376	216.02
499.803	65.54
500.229	111.65
500.655	92.23
501.081	89.81
501.508	150.49
501.934	206.31
502.36	184.47
502.786	167.48
503.212	138.35
503.638	182.04
504.064	94.66
504.489	126.22
504.915	165.05
505.341	184.47
505.767	264.57
506.192	206.31
506.618	114.08
507.043	131.07
507.469	184.47
507.894	152.92
508.32	169.91
508.745	131.07
509.17	145.63
509.596	94.66
510.021	109.23
510.446	235.44
510.871	123.79
511.296	152.92
511.721	177.19
512.146	143.21
512.571	148.06
512.996	148.06
513.421	160.2
513.845	84.95
514.27	177.19
514.695	143.21
515.119	133.5
515.544	174.76
515.969	203.89
516.393	174.76
516.817	152.92
517.242	138.35
517.666	111.65
518.09	179.61
518.515	65.54
518.939	220.88
519.363	364.08
519.787	126.22
520.211	135.92
520.635	155.34
521.059	133.5
521.483	131.07
521.907	155.34
522.331	160.2
522.754	106.8
523.178	148.06
523.602	99.52
524.025	186.9
524.449	140.78
524.872	174.76
525.296	167.48
525.719	135.92
526.143	174.76
526.566	116.51
526.989	116.51
527.412	128.64
527.836	150.49
528.259	211.17
528.682	89.81
529.105	157.77
529.528	155.34
529.951	174.76
530.374	104.37
530.796	220.88
531.219	225.73
531.642	160.2
532.065	182.04
532.487	131.07
532.91	177.19
533.332	140.78
533.755	131.07
534.177	189.32
534.6	145.63
535.022	133.5
535.444	131.07
535.867	133.5
536.289	65.54
536.711	150.49
537.133	182.04
537.555	133.5
537.977	101.94
538.399	152.92
538.821	172.33
539.243	138.35
539.665	237.87
540.086	150.49
540.508	162.62
540.93	174.76
541.351	126.22
541.773	109.23
542.195	237.87
542.616	162.62
543.037	87.38
543.459	186.9
543.88	186.9
544.301	135.92
544.723	242.72
545.144	233.01
545.565	133.5
545.986	203.89
546.407	140.78
546.828	182.04
547.249	169.91
547.67	191.75
548.091	184.47
548.512	165.05
548.932	123.79
549.353	196.61
549.774	167.48
550.194	201.46
550.615	123.79
551.035	143.21
551.456	169.91
551.876	167.48
552.296	223.3
552.717	172.33
553.137	131.07
553.557	114.08
553.977	135.92
554.397	184.47
554.817	165.05
555.237	145.63
555.657	140.78
556.077	165.05
556.497	114.08
556.917	169.91
557.337	206.31
557.756	157.77
558.176	201.46
558.596	220.88
559.015	157.77
559.435	172.33
559.854	133.5
560.274	145.63
560.693	155.34
561.112	155.34
561.532	150.49
561.951	118.93
562.37	150.49
562.789	148.06
563.208	131.07
563.627	157.77
564.046	133.5
564.465	92.23
564.884	162.62
565.303	133.5
565.722	148.06
566.14	169.91
566.559	131.07
566.978	162.62
567.396	199.03
567.815	208.74
568.233	223.3
568.652	135.92
569.07	121.36
569.489	186.9
569.907	126.22
570.325	218.45
570.743	223.3
571.161	118.93
571.58	140.78
571.998	128.64
572.416	138.35
572.833	150.49
573.251	208.74
573.669	186.9
574.087	101.94
574.505	126.22
574.922	189.32
575.34	179.61
575.758	152.92
576.175	150.49
576.593	138.35
577.01	152.92
577.428	143.21
577.845	1842.26
578.262	293.69
578.68	167.48
579.097	138.35
579.514	145.63
579.931	218.45
580.348	194.18
580.765	199.03
581.182	162.62
581.599	169.91
582.016	160.2
582.433	104.37
582.849	145.63
583.266	182.04
583.683	118.93
584.099	213.6
584.516	179.61
584.933	160.2
585.349	150.49
585.765	169.91
586.182	114.08
586.598	157.77
587.014	167.48
587.431	174.76
587.847	148.06
588.263	179.61
588.679	167.48
589.095	126.22
589.511	128.64
589.927	186.9
590.343	116.51
590.759	184.47
591.174	199.03
591.59	252.43
592.006	157.77
592.421	201.46
592.837	155.34
593.252	67.96
593.668	104.37
594.083	182.04
594.499	216.02
594.914	109.23
595.329	191.75
595.745	203.89
596.16	182.04
596.575	111.65
596.99	121.36
597.405	126.22
597.82	182.04
598.235	162.62
598.65	169.91
599.065	199.03
599.479	177.19
599.894	135.92
600.309	218.45
600.724	133.5
601.138	82.53
601.553	169.91
601.967	162.62
602.382	109.23
602.796	84.95
603.21	133.5
603.625	123.79
604.039	111.65
604.453	162.62
604.867	174.76
605.281	118.93
605.695	109.23
606.109	196.61
606.523	157.77
606.937	145.63
607.351	322.82
607.765	165.05
608.178	99.52
608.592	92.23
609.006	162.62
609.419	138.35
609.833	191.75
610.246	177.19
610.66	148.06
611.073	199.03
611.487	186.9
611.9	167.48
612.313	155.34
612.726	167.48
613.139	194.18
613.553	174.76
613.966	155.34
614.379	109.23
614.792	184.47
615.204	199.03
615.617	104.37
616.03	169.91
616.443	55.83
616.856	162.62
617.268	157.77
617.681	133.5
618.093	143.21
618.506	167.48
618.918	126.22
619.331	121.36
619.743	162.62
620.155	99.52
620.568	191.75
620.98	92.23
621.392	174.76
621.804	211.17
622.216	150.49
622.628	135.92
623.04	148.06
623.452	133.5
623.864	118.93
624.276	135.92
624.687	123.79
625.099	145.63
625.511	174.76
625.922	191.75
626.334	157.77
626.745	148.06
627.157	128.64
627.568	97.09
627.979	133.5
628.391	138.35
628.802	143.21
629.213	177.19
629.624	150.49
630.035	140.78
630.446	169.91
630.857	233.01
631.268	148.06
631.679	126.22
632.09	138.35
632.501	157.77
632.912	174.76
633.322	206.31
633.733	194.18
634.144	160.2
634.554	174.76
634.965	150.49
635.375	126.22
635.785	186.9
636.196	254.86
636.606	155.34
637.016	157.77
637.427	194.18
637.837	201.46
638.247	189.32
638.657	133.5
639.067	145.63
639.477	114.08
639.887	230.59
640.297	148.06
640.706	177.19
641.116	101.94
641.526	167.48
641.935	128.64
642.345	131.07
642.755	172.33
643.164	155.34
643.573	242.72
643.983	148.06
644.392	174.76
644.801	145.63
645.211	174.76
645.62	111.65
646.029	186.9
646.438	223.3
646.847	87.38
647.256	179.61
647.665	194.18
648.074	179.61
648.483	128.64
648.892	138.35
649.3	189.32
649.709	218.45
650.118	184.47
650.526	172.33
650.935	135.92
651.343	104.37
651.752	114.08
652.16	145.63
652.568	82.53
652.977	196.61
653.385	174.76
653.793	201.46
654.201	177.19
654.609	133.5
655.017	133.5
655.425	116.51
655.833	138.35
656.241	203.89
656.649	216.02
657.057	77.67
657.464	203.89
657.872	131.07
658.28	174.76
658.687	123.79
659.095	165.05
659.502	150.49
659.91	109.23
660.317	143.21
660.724	111.65
661.132	131.07
661.539	121.36
661.946	135.92
662.353	155.34
662.76	145.63
663.167	218.45
663.574	182.04
663.981	121.36
664.388	138.35
664.795	114.08
665.202	140.78
665.608	162.62
666.015	36.41
666.422	148.06
666.828	165.05
667.235	133.5
667.641	128.64
668.047	186.9
668.454	150.49
668.86	82.53
669.266	128.64
669.673	150.49
670.079	211.17
670.485	104.37
670.891	184.47
671.297	167.48
671.703	167.48
672.109	89.81
672.515	179.61
672.92	174.76
673.326	167.48
673.732	160.2
674.138	140.78
674.543	162.62
674.949	179.61
675.354	133.5
675.76	174.76
676.165	109.23
676.57	165.05
676.976	152.92
677.381	143.21
677.786	155.34
678.191	179.61
678.596	145.63
679.001	121.36
679.406	194.18
679.811	160.2
680.216	172.33
680.621	162.62
681.026	123.79
681.43	152.92
681.835	162.62
682.24	167.48
682.644	128.64
683.049	167.48
683.453	143.21
683.858	172.33
684.262	116.51
684.667	116.51
685.071	97.09
685.475	135.92
685.879	133.5
686.283	121.36
686.687	106.8
687.091	208.74
687.495	150.49
687.899	150.49
688.303	155.34
688.707	128.64
689.111	123.79
689.514	126.22
689.918	143.21
690.322	138.35
690.725	169.91
691.129	131.07
691.532	123.79
691.936	140.78
692.339	165.05
692.742	182.04
693.146	133.5
693.549	179.61
693.952	208.74
694.355	155.34
694.758	160.2
695.161	182.04
695.564	121.36
695.967	157.77
696.37	140.78
696.773	148.06
697.175	213.6
697.578	189.32
697.981	157.77
698.383	169.91
698.786	155.34
699.188	60.68
699.591	174.76
699.993	157.77
700.395	160.2
700.798	152.92
701.2	218.45
701.602	177.19
702.004	143.21
702.406	174.76
702.808	126.22
703.21	223.3
703.612	194.18
704.014	172.33
704.416	201.46
704.818	148.06
705.219	182.04
705.621	218.45
706.023	179.61
706.424	145.63
706.826	199.03
707.227	191.75
707.629	150.49
708.03	177.19
708.431	143.21
708.832	143.21
709.234	101.94
709.635	283.99
710.036	182.04
710.437	194.18
710.838	167.48
711.239	240.3
711.64	228.16
712.041	211.17
712.441	235.44
712.842	206.31
713.243	172.33
713.643	140.78
714.044	177.19
714.445	140.78
714.845	189.32
715.246	189.32
715.646	160.2
716.046	162.62
716.447	254.86
716.847	172.33
717.247	228.16
717.647	196.61
718.047	211.17
718.447	208.74
718.847	286.41
719.247	211.17
719.647	293.69
720.047	262.14
720.446	172.33
720.846	194.18
721.246	220.88
721.645	182.04
722.045	259.71
722.444	276.7
722.844	322.82
723.243	315.54
723.643	271.85
724.042	269.42
724.441	325.25
724.84	298.55
725.24	288.84
725.639	313.11
726.038	400.49
726.437	349.52
726.836	334.96
727.234	349.52
727.633	305.83
728.032	313.11
728.431	330.1
728.83	410.2
729.228	400.49
729.627	468.45
730.025	434.47
730.424	538.84
730.822	521.85
731.22	529.13
731.619	560.69
732.017	606.81
732.415	703.89
732.813	725.74
733.212	713.6
733.61	796.13
734.008	844.67
734.406	924.77
734.803	910.21
735.201	1007.3
735.599	1036.42
735.997	1216.04
736.395	1330.12
736.792	1344.68
737.19	1419.92
737.587	1492.74
737.985	1592.26
738.382	1592.26
738.78	1757.31
739.177	1667.5
739.574	1888.38
739.971	1786.44
740.369	1924.79
740.766	1883.52
741.163	2077.7
741.56	2201.49
741.957	2330.13
742.354	2444.21
742.751	2495.18
743.147	2708.78
743.544	2820.43
743.941	3007.33
744.338	3111.7
744.734	3068.01
745.131	3233.06
745.527	3456.36
745.924	3541.32
746.32	3713.65
746.716	3844.72
747.113	4140.84
747.509	4512.21
747.905	4771.92
748.301	5335.03
748.697	5570.48
749.093	5944.27
749.489	6536.51
749.885	6849.62
750.281	7279.24
750.677	7235.55
751.073	7204
751.468	7128.75
751.864	7485.55
752.26	7354.48
752.655	7611.77
753.051	7611.77
753.446	8301.1
753.842	8786.54
754.237	9225.87
754.632	10012.29
755.028	10371.52
755.423	10735.6
755.818	11420.08
756.213	11492.9
756.608	11366.68
757.003	10934.64
757.398	10619.1
757.793	10121.52
758.188	9631.22
758.583	9449.18
758.977	9429.76
759.372	9444.32
759.767	10371.52
760.161	11157.94
760.556	12306.02
760.95	13587.59
761.345	14636.15
761.739	16670.16
762.133	17963.87
762.527	19165.35
762.922	19417.78
763.316	20104.68
763.71	19454.19
764.104	18929.91
764.498	18791.55
764.892	18493.01
765.286	18541.55
765.68	18692.04
766.073	19585.26
766.467	20434.78
766.861	22053.74
767.255	24876.6
767.648	26417.89
768.042	27534.41
768.435	29699.49
768.829	30961.65
769.222	31199.51
769.615	30927.67
770.008	29527.16
770.402	28456.75
770.795	27209.16
771.188	27201.88
771.581	25376.61
771.974	24480.96
772.367	23621.73
772.76	24903.3
773.153	24172.71
773.545	24738.25
773.938	26121.77
774.331	27951.89
774.724	29211.62
775.116	30704.36
775.509	32279.63
775.901	33228.67
776.294	33289.35
776.686	33684.99
777.078	33177.7
777.471	32447.11
777.863	31777.19
778.255	31701.95
778.647	31114.56
779.039	32687.4
779.431	32927.7
779.823	34490.83
780.215	37296.7
780.607	38320.98
780.999	41342.88
781.39	42199.69
781.782	43160.87
782.174	43658.45
782.565	43464.27
782.957	42954.55
783.348	42811.35
783.74	41141.42
784.131	38299.14
784.522	36905.91
784.914	34762.68
785.305	34668.01
785.696	34488.4
786.087	35165.6
786.478	35075.79
786.869	35228.7
787.26	35719
787.651	35886.48
788.042	36051.53
788.433	35386.47
788.823	34221.41
789.214	32794.2
789.605	30799.02
789.995	27682.47
790.386	25762.54
790.776	24808.64
791.167	22619.28
791.557	22308.6
791.948	22694.53
792.338	23354.73
792.728	24633.88
793.118	25624.19
793.508	27226.15
793.898	29340.26
794.288	31240.78
794.678	31772.34
795.068	32075.74
795.458	31561.17
795.848	31626.71
796.238	31405.83
796.627	29794.15
797.017	28221.31
797.406	27561.11
797.796	26080.5
798.185	25228.55
798.575	25325.64
798.964	25104.76
799.354	26485.85
799.743	27357.22
800.132	28490.73
800.521	30228.63
800.91	31854.86
801.299	32614.59
801.688	33692.27
802.077	33570.91
802.466	34109.75
802.855	32942.26
803.244	31592.72
803.633	29699.49
804.021	27849.95
804.41	26226.14
804.799	24119.31
805.187	22483.36
805.576	21854.71
805.964	20842.56
806.352	19883.8
806.741	20298.86
807.129	20713.91
807.517	21648.4
807.905	22604.72
808.293	23752.8
808.681	24548.93
809.069	24905.73
809.457	25650.88
809.845	25454.28
810.233	25046.51
810.621	24235.81
811.009	23172.69
811.396	22349.86
811.784	21660.53
812.171	21243.05
812.559	20619.25
812.946	20512.46
813.334	20980.91
813.721	21476.06
814.108	22221.22
814.496	23041.62
814.883	23519.78
815.27	24755.24
815.657	24973.69
816.044	25119.32
816.431	25143.6
816.818	24726.11
817.205	23308.62
817.592	22561.03
817.979	21638.69
818.365	20136.24
818.752	18798.84
819.139	18111.93
819.525	17796.39
819.912	17772.12
820.298	17303.67
820.685	17517.26
821.071	17524.54
821.457	17631.34
821.843	17335.22
822.23	17019.68
822.616	16730.84
823.002	15823.06
823.388	14990.52
823.774	13852.16
824.16	13150.69
824.546	11968.63
824.931	11354.55
825.317	10670.07
825.703	10407.93
826.089	9716.17
826.474	9963.75
826.86	9903.07
827.245	10298.7
827.631	10247.73
828.016	10293.85
828.401	10344.82
828.787	10801.14
829.172	10655.51
829.557	10665.21
829.942	10451.62
830.327	9750.15
830.712	9589.95
831.097	8842.37
831.482	8483.14
831.867	8167.6
832.252	7628.76
832.636	7432.15
833.021	7259.82
833.406	7000.11
833.79	6827.78
834.175	6784.09
834.559	6898.17
834.944	6832.63
835.328	7237.98
835.713	7412.74
836.097	7225.84
836.481	7070.5
836.865	6881.18
837.249	6407.87
837.633	6364.18
838.017	6075.34
838.401	5473.39
838.785	5284.06
839.169	4776.77
839.553	4451.53
839.937	4012.2
840.32	3682.1
840.704	3500.05
841.087	3172.38
841.471	3089.85
841.854	3126.26
842.238	3080.14
842.621	3021.89
843.004	3070.44
843.388	3242.77
843.771	3133.54
844.154	3216.07
844.537	3182.09
844.92	3189.37
845.303	3128.69
845.686	2793.73
846.069	2674.8
846.452	2631.11
846.834	2572.86
847.217	2344.7
847.6	2349.55
847.982	2308.29
848.365	2315.57
848.748	2174.79
849.13	2225.76
849.512	2293.72
849.895	2247.61
850.277	2274.31
850.659	2351.98
851.041	2364.11
851.423	2419.94
851.806	2189.35
852.188	2264.6
852.57	2150.52
852.951	2065.57
853.333	1987.89
853.715	1900.51
854.097	1728.18
854.479	1774.3
854.86	1650.51
855.242	1597.11
855.623	1565.56
856.005	1463.62
856.386	1424.78
856.768	1330.12
857.149	1351.96
857.53	1247.59
857.911	1364.1
858.292	1288.86
858.674	1250.02
859.055	1184.48
859.436	1169.92
859.817	1007.3
860.197	990.31
860.578	968.46
860.959	895.64
861.34	774.28
861.72	793.7
862.101	786.42
862.482	694.19
862.862	733.02
863.243	718.46
863.623	730.59
864.003	623.8
864.384	669.91
864.764	665.06
865.144	640.79
865.524	606.81
865.904	594.67
866.284	672.34
866.664	592.24
867.044	614.09
867.424	497.58
867.804	582.53
868.183	507.29
868.563	470.88
868.943	487.87
869.322	485.44
869.702	480.59
870.081	453.89
870.461	378.65
870.84	444.18
871.22	444.18
871.599	463.6
871.978	390.78
872.357	354.37
872.736	342.24
873.115	354.37
873.494	351.95
873.873	342.24
874.252	320.39
874.631	339.81
875.01	305.83
875.388	317.97
875.767	298.55
876.146	291.27
876.524	233.01
876.903	305.83
877.281	257.29
877.66	211.17
878.038	143.21
878.416	208.74
878.794	189.32
879.173	213.6
879.551	172.33
879.929	247.58
880.307	254.86
880.685	145.63
881.063	218.45
881.441	211.17
881.818	145.63
882.196	206.31
882.574	216.02
882.951	174.76
883.329	213.6
883.707	228.16
884.084	223.3
884.461	201.46
884.839	167.48
885.216	184.47
885.593	206.31
885.971	189.32
886.348	184.47
886.725	179.61
887.102	135.92
887.479	135.92
887.856	199.03
888.233	203.89
888.609	220.88
888.986	140.78
889.363	82.53
889.74	126.22
890.116	145.63
890.493	106.8
890.869	167.48
891.246	114.08
891.622	162.62
891.998	203.89
892.375	77.67
892.751	140.78
893.127	199.03
893.503	143.21
893.879	97.09
894.255	199.03
894.631	155.34
895.007	237.87
895.383	177.19
895.759	138.35
896.134	165.05
896.51	94.66
896.886	148.06
897.261	182.04
897.637	179.61
898.012	179.61
898.388	174.76
898.763	82.53
899.138	138.35
899.514	116.51
899.889	172.33
900.264	101.94
900.639	160.2
901.014	126.22
901.389	121.36
901.764	160.2
902.139	167.48
902.513	196.61
902.888	167.48
903.263	126.22
903.638	160.2
904.012	155.34
904.387	97.09
904.761	131.07
905.136	82.53
905.51	116.51
905.884	133.5
906.259	138.35
906.633	191.75
907.007	186.9
907.381	199.03
907.755	160.2
908.129	189.32
908.503	162.62
908.877	179.61
909.251	104.37
909.624	82.53
909.998	121.36
910.372	131.07
910.745	140.78
911.119	116.51
911.492	135.92
911.866	118.93
912.239	194.18
912.612	211.17
912.986	160.2
913.359	211.17
913.732	191.75
914.105	99.52
914.478	169.91
914.851	118.93
915.224	126.22
915.597	169.91
915.97	174.76
916.343	131.07
916.715	189.32
917.088	182.04
917.461	121.36
917.833	216.02
918.206	131.07
918.578	196.61
918.951	126.22
919.323	191.75
919.695	194.18
920.067	145.63
920.44	99.52
920.812	135.92
921.184	152.92
921.556	237.87
921.928	121.36
922.3	131.07
922.672	199.03
923.043	157.77
923.415	199.03
923.787	160.2
924.158	172.33
924.53	131.07
924.901	75.24
925.273	135.92
925.644	186.9
926.016	133.5
926.387	67.96
926.758	111.65
927.129	155.34
927.5	126.22
927.872	126.22
928.243	160.2
928.613	97.09
928.984	123.79
929.355	148.06
929.726	126.22
930.097	99.52
930.467	138.35
930.838	220.88
931.209	109.23
931.579	143.21
931.95	121.36
932.32	138.35
932.69	114.08
933.061	126.22
933.431	162.62
933.801	80.1
934.171	152.92
934.541	118.93
934.911	92.23
935.281	63.11
935.651	94.66
936.021	58.25
936.391	150.49
936.761	165.05
937.13	182.04
937.5	184.47
937.87	126.22
938.239	138.35
938.609	150.49
938.978	111.65
939.347	145.63
939.717	106.8
940.086	206.31
940.455	128.64
940.824	218.45
941.193	169.91
941.562	133.5
941.931	179.61
942.3	174.76
942.669	126.22
943.038	172.33
943.407	194.18
943.775	131.07
944.144	218.45
944.513	150.49
944.881	123.79
945.25	135.92
945.618	89.81
945.986	182.04
946.355	123.79
946.723	46.12
947.091	140.78
947.459	126.22
947.827	118.93
948.195	131.07
948.563	157.77
948.931	131.07
949.299	211.17
949.667	131.07
950.035	179.61
950.402	118.93
950.77	143.21
951.138	177.19
951.505	138.35
951.873	121.36
952.24	109.23
952.607	116.51
952.975	225.73
953.342	135.92
953.709	211.17
954.076	143.21
954.443	118.93
954.81	131.07
955.177	160.2
955.544	184.47
955.911	189.32
956.278	114.08
956.645	157.77
957.012	152.92
957.378	123.79
957.745	97.09
958.111	143.21
958.478	169.91
958.844	203.89
959.211	189.32
959.577	145.63
959.943	126.22
960.309	97.09
960.675	99.52
961.042	92.23
961.408	140.78
961.774	143.21
962.139	165.05
962.505	101.94
962.871	157.77
963.237	118.93
963.603	196.61
963.968	179.61
964.334	191.75
964.699	201.46
965.065	72.82
965.43	179.61
965.796	169.91
966.161	131.07
966.526	77.67
966.891	179.61
967.256	131.07
967.622	150.49
967.987	169.91
968.352	126.22
968.716	135.92
969.081	143.21
969.446	145.63
969.811	211.17
970.176	211.17
970.54	223.3
970.905	160.2
971.269	199.03
971.634	155.34
971.998	174.76
972.363	138.35
972.727	133.5
973.091	109.23
973.455	140.78
973.819	97.09
974.183	99.52
974.547	179.61
974.911	140.78
975.275	157.77
975.639	140.78
976.003	131.07
976.367	179.61
976.73	111.65
977.094	189.32
977.458	206.31
977.821	167.48
978.185	94.66
978.548	177.19
978.911	208.74
979.275	97.09
979.638	126.22
980.001	135.92
980.364	182.04
980.727	104.37
981.09	208.74
981.453	99.52
981.816	138.35
982.179	206.31
982.542	196.61
982.905	145.63
983.267	148.06
983.63	133.5
983.992	172.33
984.355	135.92
984.717	121.36
985.08	145.63
985.442	184.47
985.804	126.22
986.167	191.75
986.529	114.08
986.891	128.64
987.253	157.77
987.615	116.51
987.977	94.66
988.339	97.09
988.701	148.06
989.062	135.92
989.424	89.81
989.786	143.21
990.147	118.93
990.509	155.34
990.87	165.05
991.232	150.49
991.593	150.49
991.955	169.91
992.316	165.05
992.677	228.16
993.038	145.63
993.399	121.36
993.76	89.81
994.121	182.04
994.482	182.04
994.843	128.64
995.204	121.36
995.565	128.64
995.926	152.92
996.286	135.92
996.647	150.49
997.007	150.49
997.368	199.03
997.728	106.8
998.089	140.78
998.449	165.05
998.809	167.48
999.169	97.09
999.53	160.2
999.89	189.32
1000.25	138.35
1000.61	179.61
1000.97	75.24
1001.329	116.51
1001.689	157.77
1002.049	167.48
1002.409	148.06
1002.768	114.08
1003.128	123.79
1003.487	140.78
1003.847	199.03
1004.206	82.53
1004.566	140.78
1004.925	131.07
1005.284	152.92
1005.643	133.5
1006.003	152.92
1006.362	194.18
1006.721	186.9
1007.08	128.64
1007.438	194.18
1007.797	72.82
1008.156	138.35
1008.515	167.48
1008.874	109.23
1009.232	118.93
1009.591	145.63
1009.949	191.75
1010.308	203.89
1010.666	97.09
1011.024	135.92
1011.383	145.63
1011.741	155.34
1012.099	167.48
1012.457	186.9
1012.815	135.92
1013.173	165.05
1013.531	167.48
1013.889	101.94
1014.247	186.9
1014.605	128.64
1014.962	82.53
1015.32	114.08
1015.678	160.2
1016.035	145.63
1016.393	140.78
1016.75	196.61
1017.107	240.3
1017.465	150.49
1017.822	123.79
1018.179	220.88
1018.536	72.82
1018.894	50.97
1019.251	194.18
1019.608	121.36
1019.964	177.19
1020.321	157.77
1020.678	155.34
1021.035	177.19
1021.392	179.61
1021.748	75.24
1022.105	140.78
1022.461	135.92
1022.818	216.02
1023.174	150.49
1023.531	199.03
1023.887	126.22
1024.243	128.64
1024.599	160.2
1024.955	109.23
1025.311	145.63
1025.667	172.33
1026.023	140.78
1026.379	150.49
1026.735	111.65
1027.091	87.38
1027.447	114.08
