189.514	44.45
189.973	44.45
190.431	44.45
190.889	3.19
191.348	-69.63
191.806	20.18
192.264	-25.94
192.722	-38.08
193.18	10.47
193.638	-52.64
194.096	0.76
194.554	-23.51
195.012	25.03
195.47	25.03
195.928	-45.36
196.385	-8.95
196.843	46.88
197.301	-18.66
197.758	-25.94
198.216	0.76
198.674	0.76
199.131	129.4
199.589	15.32
200.046	34.74
200.503	95.42
200.961	80.86
201.418	134.26
201.875	95.42
202.332	109.98
202.79	97.85
203.247	139.11
203.704	146.39
204.161	114.84
204.618	59.01
205.075	131.83
205.532	136.68
205.989	129.4
206.445	134.26
206.902	148.82
207.359	168.24
207.816	158.53
208.272	158.53
208.729	160.96
209.185	177.95
209.642	197.36
210.098	136.68
210.555	187.65
211.011	156.1
211.467	173.09
211.924	185.23
212.38	88.14
212.836	119.69
213.292	165.81
213.748	185.23
214.204	122.12
214.66	124.55
215.116	168.24
215.572	102.7
216.028	190.08
216.484	109.98
216.94	131.83
217.396	141.54
217.851	146.39
218.307	73.58
218.763	139.11
219.218	78.43
219.674	112.41
220.129	80.86
220.585	124.55
221.04	151.25
221.496	134.26
221.951	160.96
222.406	143.96
222.861	175.52
223.317	153.67
223.772	139.11
224.227	141.54
224.682	148.82
225.137	185.23
225.592	107.56
226.047	124.55
226.502	180.37
226.957	117.27
227.411	158.53
227.866	114.84
228.321	148.82
228.776	194.94
229.23	109.98
229.685	119.69
230.139	126.97
230.594	160.96
231.048	85.71
231.503	90.57
231.957	109.98
232.411	126.97
232.865	88.14
233.32	97.85
233.774	131.83
234.228	148.82
234.682	105.13
235.136	148.82
235.59	122.12
236.044	129.4
236.498	187.65
236.952	88.14
237.406	129.4
237.86	146.39
238.313	105.13
238.767	170.66
239.221	197.36
239.674	170.66
240.128	151.25
240.581	170.66
241.035	61.44
241.488	129.4
241.942	141.54
242.395	71.15
242.848	122.12
243.301	131.83
243.755	170.66
244.208	202.22
244.661	209.5
245.114	122.12
245.567	102.7
246.02	129.4
246.473	143.96
246.926	148.82
247.379	97.85
247.832	153.67
248.284	112.41
248.737	117.27
249.19	148.82
249.642	109.98
250.095	148.82
250.547	202.22
251	143.96
251.452	177.95
251.905	73.58
252.357	221.64
252.81	129.4
253.262	173.09
253.714	185.23
254.166	156.1
254.618	126.97
255.07	238.63
255.523	160.96
255.975	100.27
256.427	180.37
256.878	151.25
257.33	109.98
257.782	156.1
258.234	146.39
258.686	153.67
259.137	160.96
259.589	153.67
260.041	151.25
260.492	211.93
260.944	180.37
261.395	146.39
261.847	197.36
262.298	109.98
262.749	158.53
263.201	153.67
263.652	107.56
264.103	192.51
264.554	151.25
265.005	44.45
265.457	97.85
265.908	85.71
266.359	148.82
266.809	141.54
267.26	129.4
267.711	160.96
268.162	182.8
268.613	151.25
269.064	168.24
269.514	202.22
269.965	141.54
270.415	112.41
270.866	153.67
271.316	95.42
271.767	105.13
272.217	126.97
272.668	131.83
273.118	139.11
273.568	156.1
274.019	146.39
274.469	131.83
274.919	112.41
275.369	180.37
275.819	139.11
276.269	143.96
276.719	143.96
277.169	129.4
277.619	122.12
278.069	168.24
278.518	160.96
278.968	136.68
279.418	124.55
279.867	117.27
280.317	146.39
280.767	163.38
281.216	170.66
281.666	185.23
282.115	76
282.564	117.27
283.014	73.58
283.463	143.96
283.912	134.26
284.361	139.11
284.811	170.66
285.26	117.27
285.709	153.67
286.158	143.96
286.607	136.68
287.056	146.39
287.505	153.67
287.953	182.8
288.402	126.97
288.851	114.84
289.3	126.97
289.748	148.82
290.197	107.56
290.646	136.68
291.094	63.87
291.543	177.95
291.991	122.12
292.439	175.52
292.888	192.51
293.336	146.39
293.784	83.28
294.233	168.24
294.681	114.84
295.129	182.8
295.577	158.53
296.025	160.96
296.473	153.67
296.921	141.54
297.369	199.79
297.817	185.23
298.264	122.12
298.712	153.67
299.16	102.7
299.608	92.99
300.055	119.69
300.503	151.25
300.95	173.09
301.398	119.69
301.845	163.38
302.293	170.66
302.74	114.84
303.187	250.76
303.635	109.98
304.082	153.67
304.529	122.12
304.976	156.1
305.423	139.11
305.87	182.8
306.317	143.96
306.764	192.51
307.211	202.22
307.658	107.56
308.105	131.83
308.552	112.41
308.998	59.01
309.445	170.66
309.892	170.66
310.338	182.8
310.785	102.7
311.231	76
311.678	187.65
312.124	153.67
312.571	151.25
313.017	134.26
313.463	175.52
313.909	199.79
314.356	112.41
314.802	124.55
315.248	156.1
315.694	170.66
316.14	143.96
316.586	129.4
317.032	158.53
317.478	114.84
317.923	180.37
318.369	165.81
318.815	59.01
319.261	180.37
319.706	175.52
320.152	204.65
320.597	163.38
321.043	148.82
321.488	163.38
321.934	109.98
322.379	177.95
322.824	163.38
323.27	136.68
323.715	148.82
324.16	119.69
324.605	158.53
325.05	226.49
325.495	204.65
325.94	141.54
326.385	163.38
326.83	165.81
327.275	180.37
327.72	177.95
328.165	131.83
328.61	151.25
329.054	129.4
329.499	156.1
329.943	54.16
330.388	83.28
330.832	141.54
331.277	105.13
331.721	139.11
332.166	153.67
332.61	119.69
333.054	165.81
333.499	156.1
333.943	107.56
334.387	83.28
334.831	143.96
335.275	66.29
335.719	158.53
336.163	80.86
336.607	185.23
337.051	156.1
337.495	165.81
337.938	114.84
338.382	131.83
338.826	131.83
339.269	129.4
339.713	163.38
340.157	122.12
340.6	194.94
341.044	122.12
341.487	156.1
341.93	148.82
342.374	102.7
342.817	119.69
343.26	107.56
343.703	117.27
344.146	129.4
344.59	97.85
345.033	114.84
345.476	190.08
345.919	114.84
346.361	139.11
346.804	199.79
347.247	160.96
347.69	122.12
348.133	124.55
348.575	112.41
349.018	148.82
349.461	126.97
349.903	114.84
350.346	175.52
350.788	126.97
351.23	160.96
351.673	114.84
352.115	158.53
352.557	66.29
353	141.54
353.442	112.41
353.884	71.15
354.326	185.23
354.768	105.13
355.21	97.85
355.652	163.38
356.094	107.56
356.536	185.23
356.978	187.65
357.419	163.38
357.861	173.09
358.303	141.54
358.744	219.21
359.186	143.96
359.627	153.67
360.069	126.97
360.51	146.39
360.952	175.52
361.393	119.69
361.834	160.96
362.276	90.57
362.717	190.08
363.158	190.08
363.599	185.23
364.04	105.13
364.481	117.27
364.922	160.96
365.363	139.11
365.804	160.96
366.245	124.55
366.686	134.26
367.126	126.97
367.567	221.64
368.008	158.53
368.448	173.09
368.889	73.58
369.33	124.55
369.77	151.25
370.21	146.39
370.651	163.38
371.091	139.11
371.531	148.82
371.972	109.98
372.412	170.66
372.852	151.25
373.292	146.39
373.732	151.25
374.172	59.01
374.612	100.27
375.052	143.96
375.492	46.88
375.932	131.83
376.372	97.85
376.811	197.36
377.251	163.38
377.691	156.1
378.13	139.11
378.57	221.64
379.009	146.39
379.449	163.38
379.888	165.81
380.328	102.7
380.767	170.66
381.206	136.68
381.645	97.85
382.085	131.83
382.524	136.68
382.963	141.54
383.402	117.27
383.841	153.67
384.28	139.11
384.719	158.53
385.158	180.37
385.596	151.25
386.035	107.56
386.474	80.86
386.913	141.54
387.351	151.25
387.79	83.28
388.228	143.96
388.667	109.98
389.105	117.27
389.544	90.57
389.982	61.44
390.42	158.53
390.859	216.78
391.297	197.36
391.735	129.4
392.173	197.36
392.611	165.81
393.049	192.51
393.487	151.25
393.925	204.65
394.363	214.35
394.801	131.83
395.239	163.38
395.676	95.42
396.114	97.85
396.552	100.27
396.989	165.81
397.427	175.52
397.864	119.69
398.302	66.29
398.739	139.11
399.177	139.11
399.614	190.08
400.051	136.68
400.488	90.57
400.926	160.96
401.363	66.29
401.8	141.54
402.237	126.97
402.674	151.25
403.111	68.72
403.548	109.98
403.985	92.99
404.421	136.68
404.858	148.82
405.295	134.26
405.732	129.4
406.168	197.36
406.605	112.41
407.041	61.44
407.478	114.84
407.914	146.39
408.351	168.24
408.787	129.4
409.223	148.82
409.66	141.54
410.096	124.55
410.532	182.8
410.968	114.84
411.404	105.13
411.84	153.67
412.276	199.79
412.712	192.51
413.148	143.96
413.584	97.85
414.02	139.11
414.455	177.95
414.891	109.98
415.327	141.54
415.762	158.53
416.198	100.27
416.633	95.42
417.069	102.7
417.504	109.98
417.94	109.98
418.375	168.24
418.81	207.07
419.245	177.95
419.681	182.8
420.116	158.53
420.551	160.96
420.986	134.26
421.421	139.11
421.856	143.96
422.291	114.84
422.726	182.8
423.16	134.26
423.595	139.11
424.03	100.27
424.464	117.27
424.899	143.96
425.334	117.27
425.768	194.94
426.203	139.11
426.637	153.67
427.071	129.4
427.506	122.12
427.94	126.97
428.374	146.39
428.809	211.93
429.243	131.83
429.677	199.79
430.111	139.11
430.545	177.95
430.979	165.81
431.413	54.16
431.847	143.96
432.28	124.55
432.714	175.52
433.148	139.11
433.582	143.96
434.015	182.8
434.449	119.69
434.882	153.67
435.316	168.24
435.749	156.1
436.183	95.42
436.616	204.65
437.049	151.25
437.483	119.69
437.916	131.83
438.349	112.41
438.782	160.96
439.215	122.12
439.648	141.54
440.081	156.1
440.514	134.26
440.947	168.24
441.38	160.96
441.813	204.65
442.245	190.08
442.678	151.25
443.111	136.68
443.543	85.71
443.976	156.1
444.408	139.11
444.841	219.21
445.273	168.24
445.705	156.1
446.138	146.39
446.57	117.27
447.002	131.83
447.434	134.26
447.867	146.39
448.299	160.96
448.731	114.84
449.163	117.27
449.595	160.96
450.026	241.05
450.458	199.79
450.89	148.82
451.322	124.55
451.754	117.27
452.185	190.08
452.617	122.12
453.048	126.97
453.48	209.5
453.911	236.2
454.343	129.4
454.774	151.25
455.205	156.1
455.637	141.54
456.068	175.52
456.499	185.23
456.93	117.27
457.361	100.27
457.792	182.8
458.223	163.38
458.654	158.53
459.085	258.04
459.516	124.55
459.947	194.94
460.378	141.54
460.808	226.49
461.239	151.25
461.669	107.56
462.1	165.81
462.531	204.65
462.961	109.98
463.391	170.66
463.822	219.21
464.252	139.11
464.682	163.38
465.113	141.54
465.543	141.54
465.973	136.68
466.403	158.53
466.833	153.67
467.263	168.24
467.693	143.96
468.123	182.8
468.553	243.48
468.983	177.95
469.412	143.96
469.842	139.11
470.272	248.34
470.701	156.1
471.131	114.84
471.56	207.07
471.99	100.27
472.419	192.51
472.849	221.64
473.278	190.08
473.707	233.77
474.136	175.52
474.566	151.25
474.995	131.83
475.424	136.68
475.853	163.38
476.282	187.65
476.711	173.09
477.14	219.21
477.569	151.25
477.997	153.67
478.426	185.23
478.855	136.68
479.283	185.23
479.712	248.34
480.141	207.07
480.569	204.65
480.998	170.66
481.426	233.77
481.854	163.38
482.283	175.52
482.711	139.11
483.139	156.1
483.567	182.8
483.995	192.51
484.424	194.94
484.852	185.23
485.28	160.96
485.708	109.98
486.135	219.21
486.563	165.81
486.991	173.09
487.419	126.97
487.847	194.94
488.274	197.36
488.702	170.66
489.129	141.54
489.557	163.38
489.984	211.93
490.412	148.82
490.839	224.06
491.266	173.09
491.694	136.68
492.121	163.38
492.548	199.79
492.975	139.11
493.402	226.49
493.829	253.19
494.256	173.09
494.683	102.7
495.11	177.95
495.537	114.84
495.964	122.12
496.39	177.95
496.817	158.53
497.244	160.96
497.67	131.83
498.097	126.97
498.523	190.08
498.95	131.83
499.376	163.38
499.803	92.99
500.229	160.96
500.655	156.1
501.081	141.54
501.508	117.27
501.934	146.39
502.36	160.96
502.786	199.79
503.212	168.24
503.638	146.39
504.064	168.24
504.489	163.38
504.915	165.81
505.341	129.4
505.767	211.93
506.192	224.06
506.618	187.65
507.043	102.7
507.469	211.93
507.894	102.7
508.32	148.82
508.745	165.81
509.17	173.09
509.596	151.25
510.021	163.38
510.446	156.1
510.871	192.51
511.296	165.81
511.721	134.26
512.146	134.26
512.571	139.11
512.996	141.54
513.421	173.09
513.845	83.28
514.27	180.37
514.695	129.4
515.119	122.12
515.544	117.27
515.969	59.01
516.393	170.66
516.817	143.96
517.242	134.26
517.666	151.25
518.09	141.54
518.515	139.11
518.939	136.68
519.363	335.72
519.787	153.67
520.211	126.97
520.635	165.81
521.059	141.54
521.483	148.82
521.907	143.96
522.331	117.27
522.754	119.69
523.178	143.96
523.602	124.55
524.025	158.53
524.449	187.65
524.872	119.69
525.296	192.51
525.719	221.64
526.143	202.22
526.566	139.11
526.989	165.81
527.412	80.86
527.836	192.51
528.259	126.97
528.682	165.81
529.105	153.67
529.528	141.54
529.951	97.85
530.374	153.67
530.796	102.7
531.219	207.07
531.642	180.37
532.065	153.67
532.487	211.93
532.91	219.21
533.332	129.4
533.755	139.11
534.177	80.86
534.6	199.79
535.022	134.26
535.444	139.11
535.867	114.84
536.289	134.26
536.711	190.08
537.133	173.09
537.555	202.22
537.977	204.65
538.399	119.69
538.821	216.78
539.243	165.81
539.665	255.62
540.086	173.09
540.508	204.65
540.93	216.78
541.351	219.21
541.773	238.63
542.195	224.06
542.616	202.22
543.037	245.91
543.459	323.58
543.88	233.77
544.301	192.51
544.723	294.45
545.144	258.04
545.565	233.77
545.986	216.78
546.407	211.93
546.828	175.52
547.249	192.51
547.67	214.35
548.091	233.77
548.512	187.65
548.932	165.81
549.353	219.21
549.774	192.51
550.194	202.22
550.615	148.82
551.035	165.81
551.456	122.12
551.876	160.96
552.296	173.09
552.717	146.39
553.137	209.5
553.557	180.37
553.977	221.64
554.397	214.35
554.817	214.35
555.237	168.24
555.657	100.27
556.077	117.27
556.497	102.7
556.917	202.22
557.337	207.07
557.756	158.53
558.176	56.58
558.596	126.97
559.015	156.1
559.435	151.25
559.854	175.52
560.274	173.09
560.693	134.26
561.112	126.97
561.532	136.68
561.951	143.96
562.37	131.83
562.789	83.28
563.208	141.54
563.627	95.42
564.046	170.66
564.465	204.65
564.884	66.29
565.303	126.97
565.722	175.52
566.14	122.12
566.559	126.97
566.978	158.53
567.396	224.06
567.815	165.81
568.233	165.81
568.652	129.4
569.07	207.07
569.489	97.85
569.907	160.96
570.325	134.26
570.743	95.42
571.161	129.4
571.58	85.71
571.998	151.25
572.416	136.68
572.833	129.4
573.251	63.87
573.669	134.26
574.087	182.8
574.505	158.53
574.922	151.25
575.34	180.37
575.758	124.55
576.175	131.83
576.593	148.82
577.01	160.96
577.428	117.27
577.845	1556.61
578.262	321.15
578.68	202.22
579.097	180.37
579.514	73.58
579.931	190.08
580.348	185.23
580.765	139.11
581.182	194.94
581.599	136.68
582.016	129.4
582.433	105.13
582.849	129.4
583.266	221.64
583.683	136.68
584.099	92.99
584.516	185.23
584.933	180.37
585.349	173.09
585.765	129.4
586.182	175.52
586.598	165.81
587.014	173.09
587.431	219.21
587.847	170.66
588.263	122.12
588.679	124.55
589.095	124.55
589.511	202.22
589.927	102.7
590.343	168.24
590.759	114.84
591.174	185.23
591.59	129.4
592.006	129.4
592.421	158.53
592.837	126.97
593.252	102.7
593.668	119.69
594.083	165.81
594.499	90.57
594.914	126.97
595.329	224.06
595.745	211.93
596.16	224.06
596.575	148.82
596.99	180.37
597.405	173.09
597.82	216.78
598.235	202.22
598.65	141.54
599.065	134.26
599.479	146.39
599.894	151.25
600.309	117.27
600.724	141.54
601.138	219.21
601.553	146.39
601.967	146.39
602.382	177.95
602.796	143.96
603.21	168.24
603.625	158.53
604.039	124.55
604.453	175.52
604.867	209.5
605.281	207.07
605.695	146.39
606.109	148.82
606.523	119.69
606.937	134.26
607.351	316.3
607.765	119.69
608.178	124.55
608.592	105.13
609.006	192.51
609.419	192.51
609.833	168.24
610.246	153.67
610.66	151.25
611.073	255.62
611.487	143.96
611.9	238.63
612.313	219.21
612.726	153.67
613.139	238.63
613.553	216.78
613.966	192.51
614.379	146.39
614.792	160.96
615.204	97.85
615.617	194.94
616.03	153.67
616.443	173.09
616.856	236.2
617.268	168.24
617.681	158.53
618.093	109.98
618.506	80.86
618.918	175.52
619.331	180.37
619.743	136.68
620.155	151.25
620.568	63.87
620.98	187.65
621.392	156.1
621.804	214.35
622.216	170.66
622.628	190.08
623.04	114.84
623.452	117.27
623.864	241.05
624.276	163.38
624.687	197.36
625.099	163.38
625.511	136.68
625.922	136.68
626.334	177.95
626.745	112.41
627.157	151.25
627.568	141.54
627.979	97.85
628.391	102.7
628.802	160.96
629.213	156.1
629.624	204.65
630.035	187.65
630.446	126.97
630.857	170.66
631.268	168.24
631.679	163.38
632.09	143.96
632.501	92.99
632.912	216.78
633.322	226.49
633.733	187.65
634.144	236.2
634.554	129.4
634.965	192.51
635.375	122.12
635.785	175.52
636.196	122.12
636.606	156.1
637.016	105.13
637.427	173.09
637.837	117.27
638.247	216.78
638.657	109.98
639.067	148.82
639.477	124.55
639.887	131.83
640.297	117.27
640.706	160.96
641.116	151.25
641.526	97.85
641.935	192.51
642.345	109.98
642.755	146.39
643.164	173.09
643.573	207.07
643.983	192.51
644.392	168.24
644.801	122.12
645.211	173.09
645.62	117.27
646.029	209.5
646.438	146.39
646.847	54.16
647.256	95.42
647.665	214.35
648.074	173.09
648.483	148.82
648.892	151.25
649.3	95.42
649.709	187.65
650.118	168.24
650.526	180.37
650.935	80.86
651.343	163.38
651.752	124.55
652.16	122.12
652.568	107.56
652.977	165.81
653.385	158.53
653.793	207.07
654.201	211.93
654.609	141.54
655.017	122.12
655.425	131.83
655.833	148.82
656.241	148.82
656.649	117.27
657.057	146.39
657.464	95.42
657.872	187.65
658.28	177.95
658.687	148.82
659.095	148.82
659.502	146.39
659.91	153.67
660.317	129.4
660.724	117.27
661.132	192.51
661.539	129.4
661.946	129.4
662.353	148.82
662.76	158.53
663.167	114.84
663.574	109.98
663.981	151.25
664.388	109.98
664.795	129.4
665.202	80.86
665.608	146.39
666.015	71.15
666.422	151.25
666.828	158.53
667.235	199.79
667.641	122.12
668.047	68.72
668.454	112.41
668.86	122.12
669.266	109.98
669.673	204.65
670.079	204.65
670.485	199.79
670.891	153.67
671.297	194.94
671.703	153.67
672.109	117.27
672.515	59.01
672.92	168.24
673.326	158.53
673.732	204.65
674.138	160.96
674.543	199.79
674.949	122.12
675.354	160.96
675.76	156.1
676.165	119.69
676.57	143.96
676.976	170.66
677.381	170.66
677.786	73.58
678.191	156.1
678.596	153.67
679.001	180.37
679.406	190.08
679.811	80.86
680.216	156.1
680.621	173.09
681.026	151.25
681.43	129.4
681.835	180.37
682.24	109.98
682.644	134.26
683.049	80.86
683.453	131.83
683.858	126.97
684.262	92.99
684.667	109.98
685.071	219.21
685.475	83.28
685.879	129.4
686.283	192.51
686.687	126.97
687.091	180.37
687.495	204.65
687.899	158.53
688.303	134.26
688.707	170.66
689.111	194.94
689.514	141.54
689.918	160.96
690.322	105.13
690.725	153.67
691.129	134.26
691.532	160.96
691.936	141.54
692.339	95.42
692.742	202.22
693.146	90.57
693.549	158.53
693.952	182.8
694.355	134.26
694.758	151.25
695.161	177.95
695.564	158.53
695.967	136.68
696.37	143.96
696.773	146.39
697.175	126.97
697.578	139.11
697.981	175.52
698.383	129.4
698.786	134.26
699.188	236.2
699.591	126.97
699.993	160.96
700.395	156.1
700.798	175.52
701.2	175.52
701.602	207.07
702.004	158.53
702.406	148.82
702.808	131.83
703.21	202.22
703.612	153.67
704.014	126.97
704.416	160.96
704.818	168.24
705.219	102.7
705.621	211.93
706.023	126.97
706.424	250.76
706.826	199.79
707.227	134.26
707.629	134.26
708.03	160.96
708.431	170.66
708.832	207.07
709.234	170.66
709.635	236.2
710.036	143.96
710.437	175.52
710.838	170.66
711.239	102.7
711.64	194.94
712.041	233.77
712.441	180.37
712.842	168.24
713.243	224.06
713.643	197.36
714.044	238.63
714.445	207.07
714.845	180.37
715.246	228.92
715.646	182.8
716.046	180.37
716.447	255.62
716.847	214.35
717.247	199.79
717.647	262.9
718.047	241.05
718.447	228.92
718.847	233.77
719.247	267.75
719.647	270.18
720.047	224.06
720.446	185.23
720.846	211.93
721.246	238.63
721.645	265.33
722.045	255.62
722.444	282.32
722.844	228.92
723.243	279.89
723.643	313.87
724.042	328.43
724.441	243.48
724.84	304.16
725.24	289.6
725.639	318.72
726.038	262.9
726.437	292.03
726.836	345.42
727.234	359.99
727.633	277.46
728.032	306.59
728.431	357.56
728.83	326.01
729.228	413.39
729.627	476.49
730.025	454.65
730.424	534.75
730.822	476.49
731.22	491.06
731.619	578.44
732.017	561.45
732.415	614.85
732.813	612.42
733.212	736.21
733.61	833.3
734.008	860
734.406	876.99
734.803	1015.34
735.201	1005.63
735.599	1151.26
735.997	1241.07
736.395	1294.47
736.792	1352.72
737.19	1420.68
737.587	1527.48
737.985	1525.05
738.382	1731.37
738.78	1809.04
739.177	1833.31
739.574	1944.96
739.971	1935.25
740.369	2080.89
740.766	2204.68
741.163	2153.7
741.56	2211.96
741.957	2214.39
742.354	2595.46
742.751	2423.13
743.147	2508.08
743.544	2770.22
743.941	2864.88
744.338	2925.56
744.734	3151.29
745.131	3241.1
745.527	3515.38
745.924	3653.73
746.32	3966.84
746.716	4156.16
747.113	4476.56
747.509	4835.79
747.905	4877.05
748.301	5071.23
748.697	5428.03
749.093	5483.85
749.489	5736.28
749.885	5937.74
750.281	6563.97
750.677	6614.94
751.073	7175.63
751.468	7204.75
751.864	7568.84
752.26	7891.66
752.655	8233.9
753.051	8748.47
753.446	8850.41
753.842	8767.89
754.237	9027.6
754.632	9078.57
755.028	9173.23
755.423	9340.71
755.818	9297.02
756.213	9418.38
756.608	9658.68
757.003	9656.25
757.398	9250.9
757.793	9493.62
758.188	9539.74
758.583	9598
758.977	10017.9
759.372	10328.59
759.767	11013.07
760.161	11780.07
760.556	12517.94
760.95	13183
761.345	13867.48
761.739	14925.75
762.133	15636.92
762.527	16059.26
762.922	16498.59
763.316	17615.11
763.71	18268.03
764.104	18185.51
764.498	19241.35
764.892	19821.46
765.286	20535.06
765.68	20928.27
766.073	21695.27
766.467	21935.57
766.861	22166.15
767.255	23586.08
767.648	24984.16
768.042	25044.84
768.435	25634.65
768.829	27367.69
769.222	27481.77
769.615	27345.84
770.008	27950.22
770.402	28882.28
770.795	27853.13
771.188	28015.76
771.581	28023.04
771.974	27933.23
772.367	26236.6
772.76	26612.82
773.153	26246.31
773.545	26491.46
773.938	25831.26
774.331	26401.65
774.724	27229.34
775.116	27226.91
775.509	28345.86
775.901	30425.99
776.294	31294.93
776.686	31008.52
777.078	32926.03
777.471	34428.48
777.863	34316.83
778.255	34593.53
778.647	36676.09
779.039	37511.05
779.431	36411.52
779.823	36753.76
780.215	38241.64
780.607	37292.6
780.999	37773.19
781.39	38598.45
781.782	39202.82
782.174	38960.1
782.565	38807.19
782.957	40457.7
783.348	40916.44
783.74	39239.23
784.131	38630
784.522	41365.48
784.914	39688.27
785.305	39032.92
785.696	38110.57
786.087	38656.7
786.478	37127.55
786.869	35297.42
787.26	34710.04
787.651	34151.78
788.042	32171.16
788.433	30639.58
788.823	30129.87
789.214	29746.37
789.605	27141.96
789.995	26406.51
790.386	26350.68
790.776	25734.17
791.167	24722.02
791.557	25530.28
791.948	26268.16
792.338	26870.11
792.728	27144.38
793.118	28023.04
793.508	29646.85
793.898	29324.03
794.288	28382.27
794.678	29054.61
795.068	29683.26
795.458	28564.31
795.848	28115.27
796.238	29350.73
796.627	28845.87
797.017	27981.78
797.406	28513.34
797.796	29127.43
798.185	29680.83
798.575	28678.39
798.964	29003.64
799.354	31020.66
799.743	30896.87
800.132	30134.72
800.521	30913.86
800.91	31746.4
801.299	31047.36
801.688	30372.59
802.077	29452.67
802.466	30498.81
802.855	31081.34
803.244	28083.72
803.633	28547.32
804.021	28496.35
804.41	27804.59
804.799	26166.21
805.187	25394.36
805.576	26416.22
805.964	25195.33
806.352	23015.68
806.741	22899.17
807.129	23447.73
807.517	22612.76
807.905	21717.12
808.293	22457.42
808.681	24047.25
809.069	23547.24
809.457	22712.28
809.845	23879.77
810.233	25428.34
810.621	24756
811.009	23590.93
811.396	24899.2
811.784	26297.28
812.171	25141.93
812.559	24093.37
812.946	23838.51
813.334	24811.82
813.721	24015.7
814.108	22173.43
814.496	22573.93
814.883	23758.41
815.27	24173.46
815.657	23010.83
816.044	23185.59
816.431	24243.85
816.818	24306.96
817.205	22894.32
817.592	23671.03
817.979	23595.79
818.365	23493.84
818.752	21151.57
819.139	20236.51
819.525	21406.43
819.912	21149.15
820.298	19634.56
820.685	18258.32
821.071	18802.02
821.457	18785.03
821.843	16957.33
822.23	15923.34
822.616	15311.68
823.002	15115.07
823.388	14209.72
823.774	12780.08
824.16	12403.86
824.546	12656.3
824.931	12139.3
825.317	11085.88
825.703	11141.71
826.089	11865.02
826.474	11828.61
826.86	10702.38
827.245	10646.56
827.631	11083.46
828.016	11119.86
828.401	10442.67
828.787	9860.14
829.172	10202.37
829.557	10423.25
829.942	9564.01
830.327	9027.6
830.712	9175.66
831.097	9190.22
831.482	8804.29
831.867	8148.94
832.252	8248.46
832.636	8491.18
833.021	8097.97
833.406	7709.62
833.79	7554.27
834.175	7898.94
834.559	8076.13
834.944	7479.03
835.328	7214.46
835.713	7364.95
836.097	7100.38
836.481	6580.96
836.865	6364.94
837.249	6144.06
837.633	6114.93
838.017	5954.73
838.401	5374.63
838.785	4971.71
839.169	4932.87
839.553	4954.72
839.937	4653.74
840.32	4063.93
840.704	3918.3
841.087	3891.6
841.471	3636.74
841.854	3352.75
842.238	3296.93
842.621	3211.97
843.004	3350.33
843.388	3158.57
843.771	3051.78
844.154	3139.16
844.537	3185.27
844.92	3085.76
845.303	3005.66
845.686	2806.63
846.069	2964.4
846.452	3054.2
846.834	2690.12
847.217	2590.6
847.6	2799.35
847.982	2881.87
848.365	2704.68
848.748	2534.78
849.13	2410.99
849.512	2539.63
849.895	2622.16
850.277	2335.75
850.659	2292.06
851.041	2309.05
851.423	2410.99
851.806	2180.4
852.188	2059.04
852.57	1974.09
852.951	2214.39
853.333	2267.78
853.715	2141.57
854.097	1896.42
854.479	1983.8
854.86	1927.97
855.242	1915.84
855.623	1677.97
856.005	1529.91
856.386	1639.13
856.768	1651.27
857.149	1617.29
857.53	1376.99
857.911	1372.14
858.292	1430.39
858.674	1282.33
859.055	1306.6
859.436	1056.6
859.817	986.21
860.197	1168.25
860.578	1061.45
860.959	971.65
861.34	852.71
861.72	777.47
862.101	884.27
862.482	889.12
862.862	835.72
863.243	745.92
863.623	804.17
864.003	796.89
864.384	748.34
864.764	641.55
865.144	658.54
865.524	784.75
865.904	758.05
866.284	639.12
866.664	626.98
867.044	643.97
867.424	622.13
867.804	573.58
868.183	646.4
868.563	576.01
868.943	515.33
869.322	549.31
869.702	556.59
870.081	440.09
870.461	437.66
870.84	537.17
871.22	493.48
871.599	478.92
871.978	379.41
872.357	403.68
872.736	466.79
873.115	372.12
873.494	389.11
873.873	323.58
874.252	328.43
874.631	357.56
875.01	262.9
875.388	309.02
875.767	270.18
876.146	304.16
876.524	321.15
876.903	275.03
877.281	287.17
877.66	258.04
878.038	202.22
878.416	253.19
878.794	253.19
879.173	192.51
879.551	126.97
879.929	236.2
880.307	245.91
880.685	204.65
881.063	190.08
881.441	224.06
881.818	190.08
882.196	131.83
882.574	216.78
882.951	131.83
883.329	199.79
883.707	163.38
884.084	177.95
884.461	231.34
884.839	221.64
885.216	197.36
885.593	250.76
885.971	156.1
886.348	158.53
886.725	182.8
887.102	124.55
887.479	136.68
887.856	148.82
888.233	211.93
888.609	163.38
888.986	182.8
889.363	131.83
889.74	165.81
890.116	129.4
890.493	114.84
890.869	177.95
891.246	119.69
891.622	119.69
891.998	83.28
892.375	160.96
892.751	180.37
893.127	194.94
893.503	148.82
893.879	156.1
894.255	177.95
894.631	114.84
895.007	139.11
895.383	156.1
895.759	68.72
896.134	139.11
896.51	158.53
896.886	117.27
897.261	112.41
897.637	156.1
898.012	146.39
898.388	122.12
898.763	136.68
899.138	68.72
899.514	136.68
899.889	197.36
900.264	90.57
900.639	160.96
901.014	156.1
901.389	163.38
901.764	136.68
902.139	100.27
902.513	88.14
902.888	163.38
903.263	146.39
903.638	185.23
904.012	160.96
904.387	151.25
904.761	202.22
905.136	136.68
905.51	124.55
905.884	124.55
906.259	97.85
906.633	126.97
907.007	78.43
907.381	76
907.755	134.26
908.129	117.27
908.503	146.39
908.877	187.65
909.251	185.23
909.624	124.55
909.998	126.97
910.372	148.82
910.745	92.99
911.119	122.12
911.492	156.1
911.866	163.38
912.239	109.98
912.612	107.56
912.986	124.55
913.359	112.41
913.732	173.09
914.105	180.37
914.478	182.8
914.851	100.27
915.224	90.57
915.597	168.24
915.97	109.98
916.343	131.83
916.715	131.83
917.088	134.26
917.461	173.09
917.833	192.51
918.206	156.1
918.578	153.67
918.951	180.37
919.323	109.98
919.695	177.95
920.067	129.4
920.44	146.39
920.812	139.11
921.184	131.83
921.556	105.13
921.928	92.99
922.3	168.24
922.672	119.69
923.043	151.25
923.415	168.24
923.787	90.57
924.158	151.25
924.53	80.86
924.901	185.23
925.273	119.69
925.644	109.98
926.016	207.07
926.387	124.55
926.758	114.84
927.129	141.54
927.5	139.11
927.872	153.67
928.243	148.82
928.613	90.57
928.984	112.41
929.355	117.27
929.726	153.67
930.097	129.4
930.467	182.8
930.838	160.96
931.209	139.11
931.579	122.12
931.95	160.96
932.32	182.8
932.69	141.54
933.061	143.96
933.431	143.96
933.801	124.55
934.171	151.25
934.541	158.53
934.911	114.84
935.281	173.09
935.651	151.25
936.021	66.29
936.391	211.93
936.761	160.96
937.13	177.95
937.5	119.69
937.87	83.28
938.239	63.87
938.609	129.4
938.978	141.54
939.347	102.7
939.717	100.27
940.086	136.68
940.455	173.09
940.824	165.81
941.193	136.68
941.562	187.65
941.931	122.12
942.3	175.52
942.669	151.25
943.038	199.79
943.407	148.82
943.775	131.83
944.144	131.83
944.513	182.8
944.881	139.11
945.25	146.39
945.618	170.66
945.986	204.65
946.355	126.97
946.723	136.68
947.091	148.82
947.459	194.94
947.827	207.07
948.195	182.8
948.563	102.7
948.931	143.96
949.299	114.84
949.667	180.37
950.035	124.55
950.402	105.13
950.77	146.39
951.138	122.12
951.505	146.39
951.873	119.69
952.24	107.56
952.607	105.13
952.975	114.84
953.342	163.38
953.709	163.38
954.076	168.24
954.443	141.54
954.81	146.39
955.177	88.14
955.544	141.54
955.911	107.56
956.278	177.95
956.645	226.49
957.012	197.36
957.378	148.82
957.745	124.55
958.111	126.97
958.478	173.09
958.844	124.55
959.211	165.81
959.577	209.5
959.943	139.11
960.309	163.38
960.675	173.09
961.042	146.39
961.408	90.57
961.774	153.67
962.139	156.1
962.505	158.53
962.871	139.11
963.237	95.42
963.603	136.68
963.968	102.7
964.334	107.56
964.699	156.1
965.065	143.96
965.43	119.69
965.796	139.11
966.161	126.97
966.526	163.38
966.891	165.81
967.256	156.1
967.622	207.07
967.987	124.55
968.352	126.97
968.716	141.54
969.081	173.09
969.446	160.96
969.811	143.96
970.176	117.27
970.54	158.53
970.905	117.27
971.269	192.51
971.634	97.85
971.998	126.97
972.363	119.69
972.727	129.4
973.091	173.09
973.455	143.96
973.819	194.94
974.183	151.25
974.547	97.85
974.911	76
975.275	119.69
975.639	124.55
976.003	78.43
976.367	141.54
976.73	131.83
977.094	185.23
977.458	66.29
977.821	185.23
978.185	177.95
978.548	83.28
978.911	95.42
979.275	119.69
979.638	187.65
980.001	117.27
980.364	131.83
980.727	107.56
981.09	173.09
981.453	177.95
981.816	134.26
982.179	187.65
982.542	134.26
982.905	141.54
983.267	190.08
983.63	165.81
983.992	136.68
984.355	153.67
984.717	59.01
985.08	250.76
985.442	126.97
985.804	177.95
986.167	165.81
986.529	100.27
986.891	126.97
987.253	119.69
987.615	134.26
987.977	92.99
988.339	124.55
988.701	85.71
989.062	131.83
989.424	90.57
989.786	148.82
990.147	109.98
990.509	131.83
990.87	126.97
991.232	180.37
991.593	80.86
991.955	139.11
992.316	95.42
992.677	156.1
993.038	109.98
993.399	119.69
993.76	83.28
994.121	151.25
994.482	102.7
994.843	122.12
995.204	122.12
995.565	156.1
995.926	129.4
996.286	187.65
996.647	148.82
997.007	100.27
997.368	151.25
997.728	160.96
998.089	90.57
998.449	97.85
998.809	202.22
999.169	175.52
999.53	165.81
999.89	95.42
1000.25	80.86
1000.61	141.54
1000.97	131.83
1001.329	160.96
1001.689	63.87
1002.049	146.39
1002.409	153.67
1002.768	102.7
1003.128	83.28
1003.487	85.71
1003.847	136.68
1004.206	97.85
1004.566	122.12
1004.925	114.84
1005.284	194.94
1005.643	156.1
1006.003	197.36
1006.362	112.41
1006.721	105.13
1007.08	90.57
1007.438	158.53
1007.797	122.12
1008.156	76
1008.515	190.08
1008.874	143.96
1009.232	100.27
1009.591	119.69
1009.949	141.54
1010.308	173.09
1010.666	136.68
1011.024	141.54
1011.383	146.39
1011.741	59.01
1012.099	141.54
1012.457	160.96
1012.815	163.38
1013.173	168.24
1013.531	136.68
1013.889	139.11
1014.247	160.96
1014.605	134.26
1014.962	160.96
1015.32	153.67
1015.678	117.27
1016.035	182.8
1016.393	173.09
1016.75	173.09
1017.107	139.11
1017.465	100.27
1017.822	95.42
1018.179	112.41
1018.536	97.85
1018.894	73.58
1019.251	143.96
1019.608	66.29
1019.964	105.13
1020.321	156.1
1020.678	202.22
1021.035	160.96
1021.392	109.98
1021.748	63.87
1022.105	102.7
1022.461	90.57
1022.818	199.79
1023.174	146.39
1023.531	131.83
1023.887	148.82
1024.243	71.15
1024.599	139.11
1024.955	177.95
1025.311	122.12
1025.667	119.69
1026.023	141.54
1026.379	107.56
1026.735	112.41
1027.091	192.51
1027.447	187.65
