189.514	87.38
189.973	87.38
190.431	87.38
190.889	-36.41
191.348	14.56
191.806	-19.42
192.264	14.56
192.722	-46.12
193.18	-0
193.638	-50.97
194.096	-19.42
194.554	-29.13
195.012	-4.85
195.47	4.85
195.928	-43.69
196.385	-33.98
196.843	53.4
197.301	7.28
197.758	9.71
198.216	-7.28
198.674	104.37
199.131	41.26
199.589	-31.55
200.046	21.84
200.503	77.67
200.961	87.38
201.418	77.67
201.875	7.28
202.332	60.68
202.79	89.81
203.247	104.37
203.704	123.79
204.161	133.5
204.618	104.37
205.075	138.35
205.532	148.06
205.989	196.61
206.445	148.06
206.902	167.48
207.359	94.66
207.816	169.91
208.272	104.37
208.729	143.21
209.185	194.18
209.642	123.79
210.098	109.23
210.555	118.93
211.011	160.2
211.467	157.77
211.924	152.91
212.38	133.5
212.836	50.97
213.292	143.21
213.748	135.92
214.204	165.05
214.66	116.51
215.116	121.36
215.572	169.91
216.028	194.18
216.484	140.78
216.94	167.48
217.396	126.22
217.851	145.63
218.307	152.91
218.763	155.34
219.218	150.49
219.674	109.23
220.129	80.1
220.585	162.62
221.04	114.08
221.496	138.35
221.951	131.07
222.406	97.09
222.861	114.08
223.317	162.62
223.772	135.92
224.227	140.78
224.682	177.19
225.137	165.05
225.592	133.5
226.047	133.5
226.502	155.34
226.957	167.48
227.411	128.64
227.866	116.51
228.321	84.95
228.776	131.07
229.23	155.34
229.685	92.23
230.139	118.93
230.594	240.29
231.048	150.49
231.503	135.92
231.957	167.48
232.411	174.76
232.865	218.45
233.32	104.37
233.774	84.95
234.228	92.23
234.682	157.77
235.136	111.65
235.59	177.19
236.044	114.08
236.498	70.39
236.952	143.21
237.406	133.5
237.86	148.06
238.313	186.9
238.767	235.44
239.221	186.9
239.674	67.96
240.128	116.51
240.581	169.91
241.035	128.64
241.488	211.17
241.942	135.92
242.395	165.05
242.848	184.47
243.301	174.76
243.755	213.6
244.208	174.76
244.661	131.07
245.114	106.8
245.567	111.65
246.02	177.19
246.473	174.76
246.926	138.35
247.379	191.75
247.832	150.49
248.284	143.21
248.737	191.75
249.19	186.9
249.642	145.63
250.095	138.35
250.547	123.79
251	150.49
251.452	99.52
251.905	196.61
252.357	89.81
252.81	179.61
253.262	152.91
253.714	116.51
254.166	89.81
254.618	196.61
255.07	162.62
255.523	138.35
255.975	213.6
256.427	133.5
256.878	80.1
257.33	169.91
257.782	189.32
258.234	111.65
258.686	199.03
259.137	101.94
259.589	101.94
260.041	177.19
260.492	206.31
260.944	138.35
261.395	172.33
261.847	165.05
262.298	126.22
262.749	184.47
263.201	203.89
263.652	140.78
264.103	148.06
264.554	133.5
265.005	104.37
265.457	169.91
265.908	196.61
266.359	118.93
266.809	133.5
267.26	211.17
267.711	89.81
268.162	67.96
268.613	135.92
269.064	138.35
269.514	118.93
269.965	201.46
270.415	133.5
270.866	97.09
271.316	140.78
271.767	94.66
272.217	126.22
272.668	186.9
273.118	145.63
273.568	140.78
274.019	114.08
274.469	194.18
274.919	157.77
275.369	179.61
275.819	155.34
276.269	186.9
276.719	174.76
277.169	157.77
277.619	128.64
278.069	172.33
278.518	157.77
278.968	138.35
279.418	111.65
279.867	135.92
280.317	128.64
280.767	99.52
281.216	206.31
281.666	140.78
282.115	99.52
282.564	189.32
283.014	155.34
283.463	109.23
283.912	131.07
284.361	213.6
284.811	145.63
285.26	182.04
285.709	157.77
286.158	155.34
286.607	131.07
287.056	155.34
287.505	152.91
287.953	155.34
288.402	150.49
288.851	177.19
289.3	123.79
289.748	303.4
290.197	128.64
290.646	140.78
291.094	150.49
291.543	199.03
291.991	167.48
292.439	109.23
292.888	184.47
293.336	213.6
293.784	148.06
294.233	133.5
294.681	252.43
295.129	138.35
295.577	162.62
296.025	196.61
296.473	135.92
296.921	186.9
297.369	63.11
297.817	118.93
298.264	179.61
298.712	155.34
299.16	131.07
299.608	80.1
300.055	145.63
300.503	135.92
300.95	194.18
301.398	191.75
301.845	138.35
302.293	186.9
302.74	126.22
303.187	186.9
303.635	191.75
304.082	148.06
304.529	167.48
304.976	94.66
305.423	94.66
305.87	191.75
306.317	84.95
306.764	165.05
307.211	157.77
307.658	116.51
308.105	186.9
308.552	186.9
308.998	179.61
309.445	165.05
309.892	152.91
310.338	179.61
310.785	177.19
311.231	196.61
311.678	184.47
312.124	140.78
312.571	143.21
313.017	72.82
313.463	118.93
313.909	150.49
314.356	138.35
314.802	172.33
315.248	121.36
315.694	182.04
316.14	131.07
316.586	196.61
317.032	135.92
317.478	135.92
317.923	201.46
318.369	172.33
318.815	208.74
319.261	199.03
319.706	128.64
320.152	152.91
320.597	206.31
321.043	155.34
321.488	169.91
321.934	172.33
322.379	186.9
322.824	203.89
323.27	162.62
323.715	152.91
324.16	162.62
324.605	97.09
325.05	75.24
325.495	94.66
325.94	101.94
326.385	213.6
326.83	128.64
327.275	121.36
327.72	150.49
328.165	150.49
328.61	89.81
329.054	233.01
329.499	201.46
329.943	194.18
330.388	189.32
330.832	160.2
331.277	177.19
331.721	165.05
332.166	155.34
332.61	191.75
333.054	101.94
333.499	160.2
333.943	111.65
334.387	203.89
334.831	174.76
335.275	172.33
335.719	167.48
336.163	201.46
336.607	128.64
337.051	97.09
337.495	179.61
337.938	174.76
338.382	203.89
338.826	172.33
339.269	206.31
339.713	152.91
340.157	179.61
340.6	145.63
341.044	111.65
341.487	162.62
341.93	143.21
342.374	150.49
342.817	133.5
343.26	186.9
343.703	177.19
344.146	160.2
344.59	165.05
345.033	201.46
345.476	172.33
345.919	174.76
346.361	186.9
346.804	99.52
347.247	230.59
347.69	152.91
348.133	148.06
348.575	143.21
349.018	128.64
349.461	111.65
349.903	131.07
350.346	131.07
350.788	167.48
351.23	84.95
351.673	123.79
352.115	135.92
352.557	179.61
353	114.08
353.442	106.8
353.884	82.53
354.326	203.89
354.768	155.34
355.21	201.46
355.652	116.51
356.094	143.21
356.536	126.22
356.978	109.23
357.419	138.35
357.861	199.03
358.303	216.02
358.744	128.64
359.186	77.67
359.627	140.78
360.069	167.48
360.51	152.91
360.952	155.34
361.393	174.76
361.834	194.18
362.276	138.35
362.717	65.53
363.158	189.32
363.599	121.36
364.04	160.2
364.481	123.79
364.922	174.76
365.363	114.08
365.804	133.5
366.245	174.76
366.686	184.47
367.126	157.77
367.567	148.06
368.008	211.17
368.448	189.32
368.889	82.53
369.33	128.64
369.77	114.08
370.21	145.63
370.651	126.22
371.091	145.63
371.531	84.95
371.972	199.03
372.412	116.51
372.852	162.62
373.292	109.23
373.732	155.34
374.172	182.04
374.612	167.48
375.052	230.59
375.492	167.48
375.932	169.91
376.372	196.61
376.811	99.52
377.251	131.07
377.691	155.34
378.13	152.91
378.57	152.91
379.009	186.9
379.449	140.78
379.888	167.48
380.328	150.49
380.767	131.07
381.206	138.35
381.645	162.62
382.085	155.34
382.524	133.5
382.963	169.91
383.402	128.64
383.841	172.33
384.28	111.65
384.719	126.22
385.158	160.2
385.596	89.81
386.035	169.91
386.474	114.08
386.913	109.23
387.351	152.91
387.79	135.92
388.228	140.78
388.667	143.21
389.105	191.75
389.544	167.48
389.982	138.35
390.42	111.65
390.859	177.19
391.297	172.33
391.735	160.2
392.173	174.76
392.611	123.79
393.049	118.93
393.487	126.22
393.925	135.92
394.363	94.66
394.801	128.64
395.239	109.23
395.676	92.23
396.114	135.92
396.552	155.34
396.989	177.19
397.427	213.6
397.864	131.07
398.302	138.35
398.739	162.62
399.177	82.53
399.614	189.32
400.051	152.91
400.488	167.48
400.926	111.65
401.363	148.06
401.8	145.63
402.237	199.03
402.674	92.23
403.111	182.04
403.548	116.51
403.985	75.24
404.421	177.19
404.858	201.46
405.295	191.75
405.732	143.21
406.168	177.19
406.605	123.79
407.041	135.92
407.478	106.8
407.914	152.91
408.351	184.47
408.787	160.2
409.223	109.23
409.66	179.61
410.096	167.48
410.532	169.91
410.968	165.05
411.404	118.93
411.84	143.21
412.276	126.22
412.712	167.48
413.148	109.23
413.584	162.62
414.02	133.5
414.455	131.07
414.891	133.5
415.327	140.78
415.762	186.9
416.198	143.21
416.633	169.91
417.069	94.66
417.504	133.5
417.94	189.32
418.375	118.93
418.81	179.61
419.245	157.77
419.681	143.21
420.116	143.21
420.551	155.34
420.986	169.91
421.421	150.49
421.856	114.08
422.291	186.9
422.726	121.36
423.16	150.49
423.595	143.21
424.03	157.77
424.464	155.34
424.899	182.04
425.334	99.52
425.768	208.74
426.203	80.1
426.637	118.93
427.071	140.78
427.506	177.19
427.94	82.53
428.374	189.32
428.809	111.65
429.243	104.37
429.677	99.52
430.111	174.76
430.545	126.22
430.979	165.05
431.413	150.49
431.847	152.91
432.28	155.34
432.714	206.31
433.148	157.77
433.582	148.06
434.015	140.78
434.449	133.5
434.882	155.34
435.316	160.2
435.749	218.45
436.183	135.92
436.616	123.79
437.049	82.53
437.483	194.18
437.916	157.77
438.349	155.34
438.782	213.6
439.215	101.94
439.648	174.76
440.081	123.79
440.514	169.91
440.947	121.36
441.38	121.36
441.813	216.02
442.245	148.06
442.678	70.39
443.111	133.5
443.543	169.91
443.976	194.18
444.408	143.21
444.841	92.23
445.273	157.77
445.705	199.03
446.138	150.49
446.57	152.91
447.002	114.08
447.434	169.91
447.867	77.67
448.299	199.03
448.731	172.33
449.163	118.93
449.595	126.22
450.026	152.91
450.458	80.1
450.89	162.62
451.322	223.3
451.754	182.04
452.185	172.33
452.617	167.48
453.048	92.23
453.48	133.5
453.911	199.03
454.343	228.16
454.774	152.91
455.205	123.79
455.637	109.23
456.068	126.22
456.499	152.91
456.93	157.77
457.361	179.61
457.792	126.22
458.223	186.9
458.654	203.89
459.085	121.36
459.516	177.19
459.947	177.19
460.378	155.34
460.808	216.02
461.239	135.92
461.669	206.31
462.1	167.48
462.531	189.32
462.961	145.63
463.391	135.92
463.822	145.63
464.252	155.34
464.682	165.05
465.113	199.03
465.543	121.36
465.973	138.35
466.403	184.47
466.833	211.17
467.263	191.75
467.693	148.06
468.123	194.18
468.553	172.33
468.983	225.73
469.412	133.5
469.842	155.34
470.272	148.06
470.701	138.35
471.131	220.88
471.56	186.9
471.99	184.47
472.419	186.9
472.849	135.92
473.278	131.07
473.707	126.22
474.136	106.8
474.566	184.47
474.995	174.76
475.424	167.48
475.853	247.58
476.282	131.07
476.711	182.04
477.14	135.92
477.569	160.2
477.997	250
478.426	184.47
478.855	228.16
479.283	126.22
479.712	109.23
480.141	191.75
480.569	225.73
480.998	106.8
481.426	196.61
481.854	150.49
482.283	131.07
482.711	191.75
483.139	191.75
483.567	92.23
483.995	184.47
484.424	140.78
484.852	155.34
485.28	150.49
485.708	228.16
486.135	196.61
486.563	177.19
486.991	233.01
487.419	184.47
487.847	155.34
488.274	186.9
488.702	145.63
489.129	157.77
489.557	196.61
489.984	167.48
490.412	140.78
490.839	230.59
491.266	194.18
491.694	191.75
492.121	148.06
492.548	203.89
492.975	135.92
493.402	196.61
493.829	218.45
494.256	201.46
494.683	104.37
495.11	101.94
495.537	148.06
495.964	182.04
496.39	138.35
496.817	94.66
497.244	237.87
497.67	172.33
498.097	167.48
498.523	172.33
498.95	116.51
499.376	97.09
499.803	111.65
500.229	199.03
500.655	179.61
501.081	184.47
501.508	160.2
501.934	179.61
502.36	155.34
502.786	259.71
503.212	162.62
503.638	162.62
504.064	174.76
504.489	150.49
504.915	135.92
505.341	148.06
505.767	123.79
506.192	169.91
506.618	155.34
507.043	118.93
507.469	126.22
507.894	123.79
508.32	138.35
508.745	150.49
509.17	206.31
509.596	152.91
510.021	155.34
510.446	203.89
510.871	184.47
511.296	148.06
511.721	116.51
512.146	135.92
512.571	104.37
512.996	148.06
513.421	150.49
513.845	143.21
514.27	87.38
514.695	191.75
515.119	167.48
515.544	167.48
515.969	118.93
516.393	172.33
516.817	138.35
517.242	116.51
517.666	152.91
518.09	228.16
518.515	87.38
518.939	101.94
519.363	381.07
519.787	145.63
520.211	186.9
520.635	106.8
521.059	165.05
521.483	150.49
521.907	162.62
522.331	75.24
522.754	184.47
523.178	191.75
523.602	177.19
524.025	189.32
524.449	145.63
524.872	174.76
525.296	133.5
525.719	99.52
526.143	177.19
526.566	162.62
526.989	128.64
527.412	220.88
527.836	160.2
528.259	167.48
528.682	160.2
529.105	160.2
529.528	116.51
529.951	99.52
530.374	157.77
530.796	114.08
531.219	155.34
531.642	201.46
532.065	133.5
532.487	182.04
532.91	191.75
533.332	101.94
533.755	162.62
534.177	99.52
534.6	82.53
535.022	220.88
535.444	128.64
535.867	143.21
536.289	148.06
536.711	150.49
537.133	133.5
537.555	199.03
537.977	53.4
538.399	155.34
538.821	213.6
539.243	228.16
539.665	223.3
540.086	157.77
540.508	152.91
540.93	160.2
541.351	179.61
541.773	182.04
542.195	189.32
542.616	230.59
543.037	240.29
543.459	264.57
543.88	281.56
544.301	247.58
544.723	218.45
545.144	206.31
545.565	286.41
545.986	259.71
546.407	315.54
546.828	196.61
547.249	172.33
547.67	237.87
548.091	123.79
548.512	152.91
548.932	157.77
549.353	196.61
549.774	206.31
550.194	165.05
550.615	201.46
551.035	182.04
551.456	189.32
551.876	143.21
552.296	213.6
552.717	172.33
553.137	172.33
553.557	111.65
553.977	169.91
554.397	162.62
554.817	247.58
555.237	140.78
555.657	152.91
556.077	199.03
556.497	106.8
556.917	196.61
557.337	165.05
557.756	199.03
558.176	114.08
558.596	250
559.015	140.78
559.435	121.36
559.854	237.87
560.274	116.51
560.693	140.78
561.112	111.65
561.532	196.61
561.951	138.35
562.37	250
562.789	165.05
563.208	140.78
563.627	152.91
564.046	157.77
564.465	169.91
564.884	145.63
565.303	97.09
565.722	116.51
566.14	140.78
566.559	160.2
566.978	237.87
567.396	169.91
567.815	167.48
568.233	135.92
568.652	203.89
569.07	155.34
569.489	228.16
569.907	184.47
570.325	211.17
570.743	162.62
571.161	145.63
571.58	143.21
571.998	179.61
572.416	150.49
572.833	216.02
573.251	143.21
573.669	145.63
574.087	194.18
574.505	94.66
574.922	196.61
575.34	160.2
575.758	162.62
576.175	123.79
576.593	148.06
577.01	174.76
577.428	211.17
577.845	1859.25
578.262	317.97
578.68	143.21
579.097	106.8
579.514	160.2
579.931	70.39
580.348	131.07
580.765	203.89
581.182	111.65
581.599	160.2
582.016	177.19
582.433	126.22
582.849	126.22
583.266	184.47
583.683	160.2
584.099	194.18
584.516	111.65
584.933	191.75
585.349	206.31
585.765	208.74
586.182	174.76
586.598	165.05
587.014	135.92
587.431	121.36
587.847	157.77
588.263	194.18
588.679	196.61
589.095	131.07
589.511	135.92
589.927	106.8
590.343	199.03
590.759	199.03
591.174	143.21
591.59	114.08
592.006	177.19
592.421	174.76
592.837	182.04
593.252	201.46
593.668	179.61
594.083	206.31
594.499	257.29
594.914	118.93
595.329	135.92
595.745	116.51
596.16	177.19
596.575	160.2
596.99	211.17
597.405	211.17
597.82	211.17
598.235	203.89
598.65	203.89
599.065	165.05
599.479	116.51
599.894	165.05
600.309	111.65
600.724	152.91
601.138	182.04
601.553	225.73
601.967	206.31
602.382	143.21
602.796	118.93
603.21	172.33
603.625	167.48
604.039	128.64
604.453	148.06
604.867	194.18
605.281	191.75
605.695	123.79
606.109	186.9
606.523	70.39
606.937	89.81
607.351	196.61
607.765	126.22
608.178	194.18
608.592	177.19
609.006	155.34
609.419	237.87
609.833	247.58
610.246	140.78
610.66	155.34
611.073	225.73
611.487	220.88
611.9	203.89
612.313	199.03
612.726	206.31
613.139	223.3
613.553	218.45
613.966	184.47
614.379	114.08
614.792	114.08
615.204	162.62
615.617	116.51
616.03	201.46
616.443	155.34
616.856	179.61
617.268	206.31
617.681	162.62
618.093	160.2
618.506	203.89
618.918	177.19
619.331	165.05
619.743	72.82
620.155	216.02
620.568	148.06
620.98	150.49
621.392	169.91
621.804	211.17
622.216	228.16
622.628	203.89
623.04	177.19
623.452	162.62
623.864	220.88
624.276	145.63
624.687	140.78
625.099	162.62
625.511	194.18
625.922	123.79
626.334	196.61
626.745	109.23
627.157	99.52
627.568	92.23
627.979	131.07
628.391	97.09
628.802	174.76
629.213	177.19
629.624	157.77
630.035	109.23
630.446	118.93
630.857	189.32
631.268	179.61
631.679	101.94
632.09	109.23
632.501	208.74
632.912	138.35
633.322	177.19
633.733	150.49
634.144	131.07
634.554	140.78
634.965	162.62
635.375	184.47
635.785	189.32
636.196	245.15
636.606	186.9
637.016	99.52
637.427	186.9
637.837	196.61
638.247	131.07
638.657	179.61
639.067	133.5
639.477	143.21
639.887	140.78
640.297	174.76
640.706	162.62
641.116	194.18
641.526	84.95
641.935	140.78
642.345	121.36
642.755	97.09
643.164	133.5
643.573	145.63
643.983	143.21
644.392	160.2
644.801	184.47
645.211	167.48
645.62	172.33
646.029	165.05
646.438	189.32
646.847	104.37
647.256	126.22
647.665	157.77
648.074	213.6
648.483	186.9
648.892	191.75
649.3	116.51
649.709	155.34
650.118	191.75
650.526	106.8
650.935	148.06
651.343	184.47
651.752	60.68
652.16	155.34
652.568	203.89
652.977	201.46
653.385	104.37
653.793	152.91
654.201	116.51
654.609	203.89
655.017	189.32
655.425	109.23
655.833	148.06
656.241	216.02
656.649	196.61
657.057	162.62
657.464	140.78
657.872	67.96
658.28	109.23
658.687	162.62
659.095	220.88
659.502	274.28
659.91	201.46
660.317	196.61
660.724	94.66
661.132	128.64
661.539	179.61
661.946	177.19
662.353	143.21
662.76	220.88
663.167	203.89
663.574	97.09
663.981	84.95
664.388	194.18
664.795	179.61
665.202	191.75
665.608	109.23
666.015	186.9
666.422	150.49
666.828	87.38
667.235	165.05
667.641	162.62
668.047	135.92
668.454	160.2
668.86	128.64
669.266	109.23
669.673	104.37
670.079	172.33
670.485	89.81
670.891	94.66
671.297	160.2
671.703	228.16
672.109	140.78
672.515	213.6
672.92	237.87
673.326	194.18
673.732	148.06
674.138	152.91
674.543	247.58
674.949	162.62
675.354	89.81
675.76	179.61
676.165	150.49
676.57	160.2
676.976	174.76
677.381	109.23
677.786	167.48
678.191	118.93
678.596	87.38
679.001	152.91
679.406	201.46
679.811	186.9
680.216	126.22
680.621	169.91
681.026	169.91
681.43	216.02
681.835	172.33
682.24	186.9
682.644	155.34
683.049	145.63
683.453	121.36
683.858	186.9
684.262	191.75
684.667	167.48
685.071	143.21
685.475	135.92
685.879	148.06
686.283	279.13
686.687	121.36
687.091	121.36
687.495	155.34
687.899	172.33
688.303	169.91
688.707	140.78
689.111	184.47
689.514	208.74
689.918	191.75
690.322	128.64
690.725	150.49
691.129	121.36
691.532	172.33
691.936	135.92
692.339	162.62
692.742	160.2
693.146	82.53
693.549	194.18
693.952	216.02
694.355	208.74
694.758	211.17
695.161	155.34
695.564	150.49
695.967	211.17
696.37	126.22
696.773	148.06
697.175	184.47
697.578	177.19
697.981	218.45
698.383	140.78
698.786	123.79
699.188	182.04
699.591	179.61
699.993	128.64
700.395	109.23
700.798	167.48
701.2	150.49
701.602	199.03
702.004	177.19
702.406	223.3
702.808	228.16
703.21	201.46
703.612	143.21
704.014	177.19
704.416	186.9
704.818	262.14
705.219	157.77
705.621	233.01
706.023	111.65
706.424	213.6
706.826	240.29
707.227	254.86
707.629	218.45
708.03	196.61
708.431	235.44
708.832	237.87
709.234	194.18
709.635	233.01
710.036	252.43
710.437	220.88
710.838	191.75
711.239	240.29
711.64	220.88
712.041	281.56
712.441	203.89
712.842	194.18
713.243	250
713.643	233.01
714.044	189.32
714.445	240.29
714.845	262.14
715.246	254.86
715.646	223.3
716.046	230.59
716.447	283.99
716.847	300.98
717.247	216.02
717.647	349.52
718.047	288.84
718.447	283.99
718.847	320.39
719.247	337.38
719.647	305.83
720.047	288.84
720.446	330.1
720.846	366.51
721.246	322.82
721.645	327.67
722.045	371.37
722.444	364.08
722.844	371.37
723.243	308.26
723.643	393.21
724.042	398.06
724.441	441.75
724.84	463.6
725.24	381.07
725.639	412.63
726.038	500.01
726.437	495.15
726.836	514.57
727.234	548.55
727.633	555.83
728.032	645.64
728.431	643.21
728.83	665.06
729.228	655.35
729.627	696.61
730.025	827.68
730.424	783.99
730.822	983.02
731.22	922.34
731.619	898.07
732.017	1019.43
732.415	1160.21
732.813	1303.42
733.212	1373.81
733.61	1541.29
734.008	1567.99
734.406	1550.99
734.803	1531.58
735.201	1813.13
735.599	2021.88
735.997	2051
736.395	2131.1
736.792	2286.44
737.19	2252.46
737.587	2453.92
737.985	2601.98
738.382	2643.24
738.78	2696.64
739.177	2944.22
739.574	3063.15
739.971	3201.51
740.369	3247.62
740.766	3441.8
741.163	3565.59
741.56	3818.02
741.957	3893.26
742.354	4191.81
742.751	4327.74
743.147	4677.26
743.544	4910.27
743.941	5356.88
744.338	5703.97
744.734	6099.61
745.131	6322.91
745.527	6720.98
745.924	7187
746.32	7737.98
746.716	7944.3
747.113	8500.13
747.509	8864.22
747.905	9043.83
748.301	9410.34
748.697	9602.09
749.093	10216.18
749.489	10308.41
749.885	10281.71
750.281	10847.26
750.677	10995.32
751.073	11075.41
751.468	11386.1
751.864	12036.59
752.26	12148.25
752.655	12747.77
753.051	13451.67
753.446	13876.43
753.842	14764.79
754.237	15633.74
754.632	16543.95
755.028	17422.6
755.423	17910.47
755.818	18672.62
756.213	19529.43
756.608	20150.8
757.003	20005.17
757.398	20092.55
757.793	20422.65
758.188	20060.99
758.583	20318.28
758.977	19912.93
759.372	20029.44
759.767	20840.13
760.161	21534.32
760.556	22056.17
760.95	22781.91
761.345	24053.77
761.739	25345.05
762.133	26216.43
762.527	27932.47
762.922	28893.65
763.316	30473.77
763.71	31677.68
764.104	32340.31
764.498	33117.02
764.892	33864.6
765.286	34335.49
765.68	34041.79
766.073	34199.56
766.467	34056.35
766.861	34235.97
767.255	34995.69
767.648	35403.46
768.042	35534.53
768.435	36857.37
768.829	38075.83
769.222	39209.35
769.615	40898.69
770.008	41466.66
770.402	42396.29
770.795	43444.85
771.188	44262.82
771.581	43825.92
771.974	42956.98
772.367	42211.82
772.76	40891.41
773.153	39202.07
773.545	37973.89
773.938	37903.5
774.331	37464.18
774.724	38818.57
775.116	40823.45
775.509	42626.88
775.901	46539.56
776.294	48073.56
776.686	50328.45
777.078	51253.22
777.471	52272.66
777.863	52161.01
778.255	51034.77
778.647	50090.58
779.039	48690.08
779.431	47806.57
779.823	47775.01
780.215	49112.41
780.607	51110.02
780.999	53777.54
781.39	55415.91
781.782	56265.44
782.174	56182.91
782.565	56330.97
782.957	55763
783.348	54806.68
783.74	53498.4
784.131	51034.77
784.522	50806.62
784.914	50610.01
785.305	51478.96
785.696	53415.88
786.087	55665.91
786.478	55964.46
786.869	55381.93
787.26	54653.76
787.651	52338.19
788.042	50794.48
788.433	46435.19
788.823	44107.48
789.214	42391.44
789.605	41333.17
789.995	41272.49
790.386	42740.96
790.776	44818.66
791.167	45835.66
791.557	47202.19
791.948	47374.52
792.338	44995.85
792.728	43685.15
793.118	41456.96
793.508	40146.26
793.898	40522.47
794.288	41267.63
794.678	44340.5
795.068	47163.35
795.458	48779.89
795.848	49673.1
796.238	48833.28
796.627	46221.59
797.017	44168.16
797.406	41512.78
797.796	39238.47
798.185	39211.78
798.575	40956.95
798.964	43789.52
799.354	46607.52
799.743	48139.1
800.132	48012.88
800.521	47192.48
800.91	45517.7
801.299	42294.35
801.688	40027.32
802.077	38624.39
802.466	39651.1
802.855	41939.97
803.244	43321.06
803.633	45964.31
804.021	45136.62
804.41	44078.36
804.799	41439.96
805.187	37845.25
805.576	34333.06
805.964	32473.81
806.352	31726.22
806.741	32568.47
807.129	34607.33
807.517	37182.62
807.905	37653.5
808.293	37049.12
808.681	34415.58
809.069	32039.33
809.457	30978.64
809.845	30320.86
810.233	30820.87
810.621	34134.03
811.009	36272.41
811.396	37828.26
811.784	38646.23
812.171	37214.17
812.559	33799.07
812.946	30684.94
813.334	29019.87
813.721	28398.5
814.108	29218.9
814.496	31430.1
814.883	32925.27
815.27	34211.7
815.657	34058.78
816.044	32238.37
816.431	29835.42
816.818	27677.61
817.205	26476.14
817.592	27862.08
817.979	29257.74
818.365	30845.14
818.752	31493.21
819.139	30286.88
819.525	28925.21
819.912	26184.87
820.298	23665.42
820.685	22056.17
821.071	21978.5
821.457	23199.39
821.843	23665.42
822.23	25017.38
822.616	24201.83
823.002	21983.35
823.388	19769.72
823.774	17786.68
824.16	16594.92
824.546	16281.81
824.931	17449.3
825.317	18272.13
825.703	18349.8
826.089	18611.94
826.474	17976.01
826.86	15992.97
827.245	14602.17
827.631	14160.41
828.016	14575.47
828.401	15526.94
828.787	16073.07
829.172	16616.76
829.557	15723.55
829.942	14415.27
830.327	13451.67
830.712	12386.11
831.097	11359.4
831.482	12092.42
831.867	12539.03
832.252	13114.28
832.636	12971.08
833.021	12393.4
833.406	11548.72
833.79	10543.85
834.175	9713.74
834.559	9968.6
834.944	10252.59
835.328	11046.29
835.713	10966.19
836.097	10388.51
836.481	9963.75
836.865	8946.74
837.249	8310.81
837.633	7786.53
838.017	8131.19
838.401	8126.34
838.785	8160.32
839.169	8109.35
839.553	7660.31
839.937	6733.11
840.32	6085.05
840.704	5852.03
841.087	5788.92
841.471	5784.07
841.854	5886.01
842.238	5866.6
842.621	5555.91
843.004	5172.41
843.388	4893.28
843.771	4444.24
844.154	4427.25
844.537	4703.96
844.92	4924.83
845.303	5046.19
845.686	4854.44
846.069	4538.91
846.452	4211.23
846.834	3856.86
847.217	3844.72
847.6	4021.91
847.982	4143.27
848.365	4077.73
848.748	3997.63
849.13	3764.62
849.512	3536.46
849.895	3305.88
850.277	3235.49
850.659	3470.93
851.041	3492.77
851.423	3577.73
851.806	3315.59
852.188	3259.76
852.57	2893.25
852.951	2781.6
853.333	2568
853.715	2818.01
854.097	2694.22
854.479	2776.74
854.86	2662.66
855.242	2456.35
855.623	2359.26
856.005	2104.4
856.386	2213.63
856.768	2097.12
857.149	2106.83
857.53	2043.72
857.911	1990.32
858.292	1786.44
858.674	1623.81
859.055	1580.12
859.436	1487.89
859.817	1609.25
860.197	1575.27
860.578	1500.02
860.959	1378.66
861.34	1250.02
861.72	1216.04
862.101	1211.18
862.482	1245.16
862.862	1087.4
863.243	1184.48
863.623	1101.96
864.003	1077.69
864.384	1043.71
864.764	1034
865.144	953.9
865.524	1026.71
865.904	980.6
866.284	907.78
866.664	895.64
867.044	839.82
867.424	839.82
867.804	776.71
868.183	859.24
868.563	694.19
868.943	733.02
869.322	672.34
869.702	694.19
870.081	609.23
870.461	538.84
870.84	657.78
871.22	604.38
871.599	519.43
871.978	543.7
872.357	529.13
872.736	487.87
873.115	529.13
873.494	500.01
873.873	492.73
874.252	456.32
874.631	368.94
875.01	422.34
875.388	388.36
875.767	361.66
876.146	407.77
876.524	342.24
876.903	344.67
877.281	347.09
877.66	344.67
878.038	354.37
878.416	317.97
878.794	332.53
879.173	322.82
879.551	354.37
879.929	313.11
880.307	281.56
880.685	247.58
881.063	208.74
881.441	237.87
881.818	325.25
882.196	237.87
882.574	242.72
882.951	259.71
883.329	237.87
883.707	233.01
884.084	213.6
884.461	337.38
884.839	242.72
885.216	138.35
885.593	245.15
885.971	271.85
886.348	230.59
886.725	199.03
887.102	206.31
887.479	240.29
887.856	220.88
888.233	240.29
888.609	240.29
888.986	165.05
889.363	262.14
889.74	203.89
890.116	194.18
890.493	194.18
890.869	211.17
891.246	225.73
891.622	111.65
891.998	167.48
892.375	208.74
892.751	101.94
893.127	242.72
893.503	233.01
893.879	150.49
894.255	135.92
894.631	184.47
895.007	160.2
895.383	189.32
895.759	167.48
896.134	148.06
896.51	169.91
896.886	148.06
897.261	186.9
897.637	242.72
898.012	186.9
898.388	140.78
898.763	189.32
899.138	152.91
899.514	177.19
899.889	150.49
900.264	123.79
900.639	199.03
901.014	126.22
901.389	145.63
901.764	169.91
902.139	167.48
902.513	165.05
902.888	133.5
903.263	203.89
903.638	182.04
904.012	157.77
904.387	101.94
904.761	133.5
905.136	206.31
905.51	109.23
905.884	194.18
906.259	94.66
906.633	99.52
907.007	145.63
907.381	162.62
907.755	72.82
908.129	92.23
908.503	135.92
908.877	162.62
909.251	72.82
909.624	152.91
909.998	191.75
910.372	196.61
910.745	165.05
911.119	143.21
911.492	150.49
911.866	82.53
912.239	160.2
912.612	199.03
912.986	114.08
913.359	106.8
913.732	128.64
914.105	118.93
914.478	184.47
914.851	114.08
915.224	101.94
915.597	101.94
915.97	116.51
916.343	143.21
916.715	58.25
917.088	135.92
917.461	109.23
917.833	123.79
918.206	189.32
918.578	97.09
918.951	131.07
919.323	206.31
919.695	109.23
920.067	179.61
920.44	82.53
920.812	133.5
921.184	165.05
921.556	160.2
921.928	182.04
922.3	106.8
922.672	177.19
923.043	101.94
923.415	121.36
923.787	101.94
924.158	133.5
924.53	203.89
924.901	254.86
925.273	157.77
925.644	131.07
926.016	135.92
926.387	131.07
926.758	143.21
927.129	172.33
927.5	126.22
927.872	114.08
928.243	104.37
928.613	75.24
928.984	106.8
929.355	145.63
929.726	143.21
930.097	97.09
930.467	126.22
930.838	196.61
931.209	140.78
931.579	133.5
931.95	143.21
932.32	123.79
932.69	128.64
933.061	177.19
933.431	72.82
933.801	138.35
934.171	106.8
934.541	65.53
934.911	94.66
935.281	140.78
935.651	174.76
936.021	165.05
936.391	162.62
936.761	70.39
937.13	104.37
937.5	104.37
937.87	186.9
938.239	128.64
938.609	247.58
938.978	182.04
939.347	109.23
939.717	177.19
940.086	109.23
940.455	77.67
940.824	262.14
941.193	233.01
941.562	216.02
941.931	116.51
942.3	152.91
942.669	189.32
943.038	101.94
943.407	131.07
943.775	201.46
944.144	186.9
944.513	126.22
944.881	33.98
945.25	143.21
945.618	128.64
945.986	165.05
946.355	104.37
946.723	184.47
947.091	184.47
947.459	155.34
947.827	106.8
948.195	208.74
948.563	162.62
948.931	194.18
949.299	111.65
949.667	143.21
950.035	194.18
950.402	109.23
950.77	172.33
951.138	167.48
951.505	186.9
951.873	97.09
952.24	162.62
952.607	143.21
952.975	223.3
953.342	174.76
953.709	155.34
954.076	84.95
954.443	97.09
954.81	148.06
955.177	160.2
955.544	174.76
955.911	167.48
956.278	174.76
956.645	92.23
957.012	157.77
957.378	220.88
957.745	152.91
958.111	116.51
958.478	128.64
958.844	131.07
959.211	140.78
959.577	123.79
959.943	157.77
960.309	203.89
960.675	118.93
961.042	118.93
961.408	140.78
961.774	148.06
962.139	101.94
962.505	157.77
962.871	126.22
963.237	152.91
963.603	225.73
963.968	87.38
964.334	196.61
964.699	72.82
965.065	165.05
965.43	160.2
965.796	174.76
966.161	111.65
966.526	131.07
966.891	148.06
967.256	114.08
967.622	87.38
967.987	126.22
968.352	143.21
968.716	89.81
969.081	109.23
969.446	138.35
969.811	143.21
970.176	121.36
970.54	148.06
970.905	94.66
971.269	152.91
971.634	101.94
971.998	126.22
972.363	48.54
972.727	97.09
973.091	140.78
973.455	162.62
973.819	152.91
974.183	97.09
974.547	160.2
974.911	94.66
975.275	172.33
975.639	162.62
976.003	174.76
976.367	140.78
976.73	101.94
977.094	58.25
977.458	145.63
977.821	138.35
978.185	138.35
978.548	126.22
978.911	116.51
979.275	135.92
979.638	160.2
980.001	206.31
980.364	184.47
980.727	167.48
981.09	179.61
981.453	128.64
981.816	133.5
982.179	191.75
982.542	89.81
982.905	138.35
983.267	182.04
983.63	199.03
983.992	135.92
984.355	165.05
984.717	162.62
985.08	177.19
985.442	150.49
985.804	138.35
986.167	211.17
986.529	160.2
986.891	109.23
987.253	155.34
987.615	80.1
987.977	101.94
988.339	138.35
988.701	116.51
989.062	114.08
989.424	167.48
989.786	135.92
990.147	135.92
990.509	94.66
990.87	128.64
991.232	228.16
991.593	179.61
991.955	135.92
992.316	167.48
992.677	89.81
993.038	150.49
993.399	194.18
993.76	196.61
994.121	165.05
994.482	160.2
994.843	162.62
995.204	101.94
995.565	121.36
995.926	92.23
996.286	118.93
996.647	128.64
997.007	140.78
997.368	89.81
997.728	140.78
998.089	165.05
998.449	94.66
998.809	160.2
999.169	123.79
999.53	106.8
999.89	191.75
1000.25	145.63
1000.61	128.64
1000.97	143.21
1001.329	89.81
1001.689	101.94
1002.049	87.38
1002.409	184.47
1002.768	121.36
1003.128	150.49
1003.487	82.53
1003.847	155.34
1004.206	89.81
1004.566	131.07
1004.925	145.63
1005.284	152.91
1005.643	111.65
1006.003	152.91
1006.362	167.48
1006.721	114.08
1007.08	165.05
1007.438	70.39
1007.797	109.23
1008.156	169.91
1008.515	165.05
1008.874	101.94
1009.232	109.23
1009.591	152.91
1009.949	162.62
1010.308	138.35
1010.666	167.48
1011.024	123.79
1011.383	138.35
1011.741	128.64
1012.099	97.09
1012.457	152.91
1012.815	123.79
1013.173	167.48
1013.531	199.03
1013.889	104.37
1014.247	114.08
1014.605	111.65
1014.962	140.78
1015.32	143.21
1015.678	189.32
1016.035	179.61
1016.393	157.77
1016.75	63.11
1017.107	97.09
1017.465	145.63
1017.822	179.61
1018.179	111.65
1018.536	128.64
1018.894	140.78
1019.251	89.81
1019.608	63.11
1019.964	82.53
1020.321	213.6
1020.678	174.76
1021.035	135.92
1021.392	116.51
1021.748	155.34
1022.105	111.65
1022.461	135.92
1022.818	152.91
1023.174	186.9
1023.531	186.9
1023.887	218.45
1024.243	135.92
1024.599	148.06
1024.955	118.93
1025.311	162.62
1025.667	97.09
1026.023	160.2
1026.379	157.77
1026.735	150.49
1027.091	116.51
1027.447	99.52
