189.514	10.92
189.973	10.92
190.431	10.92
190.889	44.9
191.348	-52.19
191.806	-44.9
192.264	-8.5
192.722	25.49
193.18	20.63
193.638	1.21
194.096	-37.62
194.554	-20.63
195.012	-18.2
195.47	-49.76
195.928	-25.49
196.385	-13.35
196.843	-66.75
197.301	-15.78
197.758	76.46
198.216	-3.64
198.674	95.88
199.131	40.05
199.589	47.33
200.046	47.33
200.503	27.91
200.961	69.18
201.418	120.15
201.875	103.16
202.332	54.61
202.79	35.19
203.247	71.6
203.704	88.59
204.161	175.97
204.618	112.87
205.075	125
205.532	132.28
205.989	103.16
206.445	166.26
206.902	190.54
207.359	78.88
207.816	163.84
208.272	112.87
208.729	229.37
209.185	108.01
209.642	81.31
210.098	132.28
210.555	190.54
211.011	144.42
211.467	202.67
211.924	139.57
212.38	156.56
212.836	144.42
213.292	163.84
213.748	57.04
214.204	149.27
214.66	103.16
215.116	95.88
215.572	112.87
216.028	144.42
216.484	183.26
216.94	202.67
217.396	180.83
217.851	192.96
218.307	154.13
218.763	137.14
219.218	190.54
219.674	127.43
220.129	100.73
220.585	120.15
221.04	141.99
221.496	93.45
221.951	103.16
222.406	134.71
222.861	129.86
223.317	149.27
223.772	42.48
224.227	149.27
224.682	185.68
225.137	180.83
225.592	139.57
226.047	144.42
226.502	166.26
226.957	158.98
227.411	195.39
227.866	117.72
228.321	234.23
228.776	110.44
229.23	195.39
229.685	93.45
230.139	190.54
230.594	197.82
231.048	171.12
231.503	168.69
231.957	134.71
232.411	91.02
232.865	141.99
233.32	98.3
233.774	146.85
234.228	86.17
234.682	175.97
235.136	156.56
235.59	195.39
236.044	219.66
236.498	161.41
236.952	117.72
237.406	166.26
237.86	180.83
238.313	161.41
238.767	134.71
239.221	132.28
239.674	105.58
240.128	103.16
240.581	183.26
241.035	98.3
241.488	110.44
241.942	125
242.395	137.14
242.848	134.71
243.301	134.71
243.755	64.32
244.208	127.43
244.661	158.98
245.114	129.86
245.567	110.44
246.02	158.98
246.473	91.02
246.926	190.54
247.379	141.99
247.832	112.87
248.284	132.28
248.737	151.7
249.19	166.26
249.642	86.17
250.095	234.23
250.547	137.14
251	129.86
251.452	108.01
251.905	137.14
252.357	110.44
252.81	125
253.262	202.67
253.714	134.71
254.166	132.28
254.618	100.73
255.07	134.71
255.523	132.28
255.975	57.04
256.427	103.16
256.878	144.42
257.33	105.58
257.782	178.4
258.234	149.27
258.686	180.83
259.137	149.27
259.589	146.85
260.041	144.42
260.492	207.53
260.944	127.43
261.395	98.3
261.847	217.24
262.298	200.25
262.749	229.37
263.201	188.11
263.652	156.56
264.103	52.19
264.554	117.72
265.005	137.14
265.457	129.86
265.908	144.42
266.359	188.11
266.809	173.55
267.26	161.41
267.711	188.11
268.162	122.57
268.613	110.44
269.064	132.28
269.514	151.7
269.965	110.44
270.415	105.58
270.866	229.37
271.316	156.56
271.767	117.72
272.217	134.71
272.668	185.68
273.118	158.98
273.568	161.41
274.019	190.54
274.469	122.57
274.919	86.17
275.369	141.99
275.819	86.17
276.269	93.45
276.719	117.72
277.169	149.27
277.619	134.71
278.069	146.85
278.518	151.7
278.968	127.43
279.418	146.85
279.867	202.67
280.317	83.74
280.767	154.13
281.216	93.45
281.666	110.44
282.115	175.97
282.564	127.43
283.014	49.76
283.463	120.15
283.912	168.69
284.361	173.55
284.811	173.55
285.26	166.26
285.709	93.45
286.158	95.88
286.607	195.39
287.056	129.86
287.505	200.25
287.953	246.36
288.402	91.02
288.851	81.31
289.3	139.57
289.748	108.01
290.197	214.81
290.646	171.12
291.094	141.99
291.543	129.86
291.991	163.84
292.439	127.43
292.888	144.42
293.336	91.02
293.784	180.83
294.233	105.58
294.681	110.44
295.129	108.01
295.577	158.98
296.025	166.26
296.473	66.75
296.921	144.42
297.369	146.85
297.817	117.72
298.264	168.69
298.712	158.98
299.16	105.58
299.608	175.97
300.055	86.17
300.503	158.98
300.95	209.95
301.398	74.03
301.845	122.57
302.293	156.56
302.74	98.3
303.187	105.58
303.635	108.01
304.082	146.85
304.529	125
304.976	103.16
305.423	141.99
305.87	212.38
306.317	151.7
306.764	122.57
307.211	103.16
307.658	248.79
308.105	173.55
308.552	115.29
308.998	125
309.445	205.1
309.892	185.68
310.338	151.7
310.785	110.44
311.231	222.09
311.678	156.56
312.124	137.14
312.571	197.82
313.017	122.57
313.463	88.59
313.909	154.13
314.356	158.98
314.802	137.14
315.248	108.01
315.694	146.85
316.14	149.27
316.586	112.87
317.032	127.43
317.478	200.25
317.923	207.53
318.369	125
318.815	59.47
319.261	205.1
319.706	151.7
320.152	134.71
320.597	168.69
321.043	166.26
321.488	168.69
321.934	117.72
322.379	185.68
322.824	95.88
323.27	137.14
323.715	173.55
324.16	132.28
324.605	125
325.05	95.88
325.495	115.29
325.94	161.41
326.385	180.83
326.83	154.13
327.275	117.72
327.72	100.73
328.165	195.39
328.61	139.57
329.054	115.29
329.499	127.43
329.943	229.37
330.388	127.43
330.832	226.95
331.277	183.26
331.721	163.84
332.166	163.84
332.61	110.44
333.054	175.97
333.499	214.81
333.943	168.69
334.387	141.99
334.831	93.45
335.275	137.14
335.719	156.56
336.163	137.14
336.607	151.7
337.051	100.73
337.495	161.41
337.938	141.99
338.382	139.57
338.826	188.11
339.269	139.57
339.713	71.6
340.157	71.6
340.6	137.14
341.044	144.42
341.487	154.13
341.93	91.02
342.374	91.02
342.817	156.56
343.26	93.45
343.703	122.57
344.146	197.82
344.59	163.84
345.033	197.82
345.476	173.55
345.919	158.98
346.361	154.13
346.804	125
347.247	219.66
347.69	117.72
348.133	132.28
348.575	173.55
349.018	134.71
349.461	154.13
349.903	78.88
350.346	171.12
350.788	151.7
351.23	149.27
351.673	139.57
352.115	178.4
352.557	105.58
353	100.73
353.442	154.13
353.884	132.28
354.326	154.13
354.768	146.85
355.21	183.26
355.652	202.67
356.094	200.25
356.536	175.97
356.978	168.69
357.419	180.83
357.861	207.53
358.303	144.42
358.744	125
359.186	112.87
359.627	134.71
360.069	178.4
360.51	183.26
360.952	173.55
361.393	125
361.834	163.84
362.276	178.4
362.717	103.16
363.158	129.86
363.599	149.27
364.04	134.71
364.481	144.42
364.922	222.09
365.363	125
365.804	129.86
366.245	158.98
366.686	137.14
367.126	192.96
367.567	166.26
368.008	173.55
368.448	98.3
368.889	149.27
369.33	188.11
369.77	154.13
370.21	217.24
370.651	127.43
371.091	141.99
371.531	192.96
371.972	122.57
372.412	224.52
372.852	156.56
373.292	95.88
373.732	149.27
374.172	205.1
374.612	115.29
375.052	183.26
375.492	103.16
375.932	173.55
376.372	137.14
376.811	192.96
377.251	173.55
377.691	91.02
378.13	91.02
378.57	163.84
379.009	214.81
379.449	112.87
379.888	115.29
380.328	86.17
380.767	110.44
381.206	175.97
381.645	93.45
382.085	139.57
382.524	88.59
382.963	137.14
383.402	173.55
383.841	209.95
384.28	149.27
384.719	125
385.158	88.59
385.596	212.38
386.035	195.39
386.474	95.88
386.913	139.57
387.351	137.14
387.79	115.29
388.228	117.72
388.667	110.44
389.105	207.53
389.544	127.43
389.982	57.04
390.42	180.83
390.859	151.7
391.297	117.72
391.735	13.35
392.173	59.47
392.611	122.57
393.049	95.88
393.487	141.99
393.925	149.27
394.363	105.58
394.801	132.28
395.239	139.57
395.676	175.97
396.114	173.55
396.552	154.13
396.989	134.71
397.427	168.69
397.864	137.14
398.302	151.7
398.739	156.56
399.177	83.74
399.614	163.84
400.051	185.68
400.488	166.26
400.926	139.57
401.363	125
401.8	154.13
402.237	185.68
402.674	108.01
403.111	122.57
403.548	151.7
403.985	110.44
404.421	161.41
404.858	137.14
405.295	205.1
405.732	185.68
406.168	64.32
406.605	98.3
407.041	141.99
407.478	86.17
407.914	151.7
408.351	76.46
408.787	91.02
409.223	83.74
409.66	156.56
410.096	125
410.532	151.7
410.968	146.85
411.404	120.15
411.84	95.88
412.276	195.39
412.712	141.99
413.148	166.26
413.584	158.98
414.02	154.13
414.455	117.72
414.891	185.68
415.327	134.71
415.762	151.7
416.198	103.16
416.633	163.84
417.069	117.72
417.504	132.28
417.94	168.69
418.375	190.54
418.81	168.69
419.245	156.56
419.681	149.27
420.116	134.71
420.551	190.54
420.986	180.83
421.421	214.81
421.856	144.42
422.291	125
422.726	132.28
423.16	158.98
423.595	64.32
424.03	163.84
424.464	139.57
424.899	183.26
425.334	197.82
425.768	139.57
426.203	158.98
426.637	141.99
427.071	163.84
427.506	207.53
427.94	108.01
428.374	110.44
428.809	115.29
429.243	178.4
429.677	120.15
430.111	110.44
430.545	166.26
430.979	139.57
431.413	168.69
431.847	161.41
432.28	139.57
432.714	144.42
433.148	149.27
433.582	168.69
434.015	93.45
434.449	125
434.882	110.44
435.316	117.72
435.749	132.28
436.183	93.45
436.616	173.55
437.049	134.71
437.483	144.42
437.916	163.84
438.349	78.88
438.782	127.43
439.215	149.27
439.648	156.56
440.081	166.26
440.514	173.55
440.947	190.54
441.38	161.41
441.813	173.55
442.245	185.68
442.678	156.56
443.111	149.27
443.543	112.87
443.976	180.83
444.408	91.02
444.841	25.49
445.273	151.7
445.705	178.4
446.138	134.71
446.57	195.39
447.002	139.57
447.434	139.57
447.867	120.15
448.299	146.85
448.731	151.7
449.163	202.67
449.595	158.98
450.026	205.1
450.458	100.73
450.89	195.39
451.322	219.66
451.754	139.57
452.185	214.81
452.617	144.42
453.048	132.28
453.48	178.4
453.911	226.95
454.343	129.86
454.774	166.26
455.205	192.96
455.637	226.95
456.068	260.93
456.499	251.22
456.93	154.13
457.361	195.39
457.792	178.4
458.223	149.27
458.654	239.08
459.085	217.24
459.516	285.2
459.947	168.69
460.378	175.97
460.808	151.7
461.239	158.98
461.669	241.51
462.1	217.24
462.531	132.28
462.961	180.83
463.391	192.96
463.822	173.55
464.252	205.1
464.682	200.25
465.113	190.54
465.543	156.56
465.973	253.64
466.403	158.98
466.833	239.08
467.263	207.53
467.693	183.26
468.123	168.69
468.553	185.68
468.983	154.13
469.412	110.44
469.842	190.54
470.272	226.95
470.701	202.67
471.131	270.64
471.56	141.99
471.99	200.25
472.419	158.98
472.849	219.66
473.278	163.84
473.707	115.29
474.136	161.41
474.566	171.12
474.995	188.11
475.424	180.83
475.853	292.48
476.282	158.98
476.711	112.87
477.14	168.69
477.569	200.25
477.997	139.57
478.426	163.84
478.855	183.26
479.283	161.41
479.712	161.41
480.141	134.71
480.569	105.58
480.998	158.98
481.426	168.69
481.854	236.65
482.283	146.85
482.711	183.26
483.139	180.83
483.567	120.15
483.995	161.41
484.424	134.71
484.852	129.86
485.28	163.84
485.708	202.67
486.135	163.84
486.563	161.41
486.991	158.98
487.419	217.24
487.847	151.7
488.274	209.95
488.702	234.23
489.129	137.14
489.557	127.43
489.984	146.85
490.412	66.75
490.839	158.98
491.266	134.71
491.694	241.51
492.121	236.65
492.548	175.97
492.975	212.38
493.402	161.41
493.829	74.03
494.256	139.57
494.683	120.15
495.11	125
495.537	137.14
495.964	76.46
496.39	190.54
496.817	146.85
497.244	185.68
497.67	180.83
498.097	175.97
498.523	173.55
498.95	190.54
499.376	151.7
499.803	195.39
500.229	171.12
500.655	158.98
501.081	125
501.508	163.84
501.934	141.99
502.36	173.55
502.786	205.1
503.212	166.26
503.638	154.13
504.064	122.57
504.489	173.55
504.915	144.42
505.341	180.83
505.767	129.86
506.192	212.38
506.618	151.7
507.043	205.1
507.469	234.23
507.894	95.88
508.32	178.4
508.745	205.1
509.17	171.12
509.596	139.57
510.021	180.83
510.446	134.71
510.871	188.11
511.296	173.55
511.721	151.7
512.146	146.85
512.571	117.72
512.996	141.99
513.421	209.95
513.845	141.99
514.27	173.55
514.695	146.85
515.119	207.53
515.544	141.99
515.969	229.37
516.393	61.89
516.817	132.28
517.242	202.67
517.666	98.3
518.09	173.55
518.515	132.28
518.939	161.41
519.363	416.27
519.787	190.54
520.211	139.57
520.635	120.15
521.059	188.11
521.483	127.43
521.907	200.25
522.331	95.88
522.754	163.84
523.178	158.98
523.602	129.86
524.025	190.54
524.449	226.95
524.872	192.96
525.296	132.28
525.719	163.84
526.143	171.12
526.566	154.13
526.989	195.39
527.412	222.09
527.836	125
528.259	154.13
528.682	139.57
529.105	156.56
529.528	120.15
529.951	183.26
530.374	120.15
530.796	151.7
531.219	141.99
531.642	105.58
532.065	132.28
532.487	127.43
532.91	168.69
533.332	139.57
533.755	183.26
534.177	156.56
534.6	190.54
535.022	105.58
535.444	175.97
535.867	236.65
536.289	217.24
536.711	112.87
537.133	222.09
537.555	137.14
537.977	122.57
538.399	207.53
538.821	158.98
539.243	149.27
539.665	241.51
540.086	171.12
540.508	151.7
540.93	180.83
541.351	134.71
541.773	175.97
542.195	134.71
542.616	236.65
543.037	195.39
543.459	224.52
543.88	117.72
544.301	166.26
544.723	222.09
545.144	151.7
545.565	168.69
545.986	197.82
546.407	166.26
546.828	129.86
547.249	125
547.67	222.09
548.091	192.96
548.512	108.01
548.932	139.57
549.353	253.64
549.774	178.4
550.194	219.66
550.615	129.86
551.035	144.42
551.456	171.12
551.876	161.41
552.296	180.83
552.717	195.39
553.137	166.26
553.557	93.45
553.977	129.86
554.397	192.96
554.817	190.54
555.237	134.71
555.657	222.09
556.077	122.57
556.497	105.58
556.917	137.14
557.337	180.83
557.756	112.87
558.176	222.09
558.596	190.54
559.015	59.47
559.435	156.56
559.854	205.1
560.274	173.55
560.693	156.56
561.112	103.16
561.532	166.26
561.951	168.69
562.37	154.13
562.789	66.75
563.208	137.14
563.627	132.28
564.046	222.09
564.465	188.11
564.884	161.41
565.303	139.57
565.722	171.12
566.14	180.83
566.559	129.86
566.978	166.26
567.396	168.69
567.815	127.43
568.233	173.55
568.652	171.12
569.07	149.27
569.489	185.68
569.907	175.97
570.325	202.67
570.743	129.86
571.161	214.81
571.58	217.24
571.998	105.58
572.416	134.71
572.833	168.69
573.251	91.02
573.669	146.85
574.087	188.11
574.505	202.67
574.922	151.7
575.34	146.85
575.758	175.97
576.175	137.14
576.593	151.7
577.01	154.13
577.428	154.13
577.845	1634.73
578.262	273.06
578.68	168.69
579.097	129.86
579.514	214.81
579.931	161.41
580.348	151.7
580.765	103.16
581.182	192.96
581.599	185.68
582.016	134.71
582.433	86.17
582.849	141.99
583.266	134.71
583.683	171.12
584.099	154.13
584.516	158.98
584.933	91.02
585.349	166.26
585.765	158.98
586.182	222.09
586.598	173.55
587.014	129.86
587.431	129.86
587.847	103.16
588.263	192.96
588.679	197.82
589.095	127.43
589.511	125
589.927	214.81
590.343	134.71
590.759	141.99
591.174	192.96
591.59	163.84
592.006	122.57
592.421	91.02
592.837	139.57
593.252	195.39
593.668	166.26
594.083	108.01
594.499	178.4
594.914	95.88
595.329	205.1
595.745	154.13
596.16	137.14
596.575	171.12
596.99	248.79
597.405	141.99
597.82	171.12
598.235	154.13
598.65	161.41
599.065	214.81
599.479	185.68
599.894	103.16
600.309	151.7
600.724	183.26
601.138	149.27
601.553	154.13
601.967	129.86
602.382	149.27
602.796	185.68
603.21	103.16
603.625	110.44
604.039	132.28
604.453	110.44
604.867	151.7
605.281	188.11
605.695	190.54
606.109	188.11
606.523	178.4
606.937	158.98
607.351	319.18
607.765	117.72
608.178	100.73
608.592	161.41
609.006	197.82
609.419	226.95
609.833	226.95
610.246	161.41
610.66	139.57
611.073	190.54
611.487	166.26
611.9	132.28
612.313	105.58
612.726	95.88
613.139	100.73
613.553	168.69
613.966	190.54
614.379	95.88
614.792	192.96
615.204	149.27
615.617	120.15
616.03	127.43
616.443	129.86
616.856	156.56
617.268	141.99
617.681	129.86
618.093	163.84
618.506	178.4
618.918	168.69
619.331	197.82
619.743	149.27
620.155	258.5
620.568	158.98
620.98	134.71
621.392	178.4
621.804	132.28
622.216	134.71
622.628	161.41
623.04	200.25
623.452	161.41
623.864	154.13
624.276	132.28
624.687	180.83
625.099	139.57
625.511	108.01
625.922	127.43
626.334	209.95
626.745	71.6
627.157	117.72
627.568	163.84
627.979	146.85
628.391	134.71
628.802	117.72
629.213	192.96
629.624	122.57
630.035	144.42
630.446	192.96
630.857	200.25
631.268	125
631.679	154.13
632.09	166.26
632.501	156.56
632.912	163.84
633.322	175.97
633.733	209.95
634.144	144.42
634.554	214.81
634.965	180.83
635.375	222.09
635.785	161.41
636.196	129.86
636.606	120.15
637.016	200.25
637.427	91.02
637.837	163.84
638.247	175.97
638.657	122.57
639.067	158.98
639.477	151.7
639.887	239.08
640.297	127.43
640.706	171.12
641.116	168.69
641.526	100.73
641.935	171.12
642.345	127.43
642.755	83.74
643.164	209.95
643.573	156.56
643.983	173.55
644.392	112.87
644.801	93.45
645.211	141.99
645.62	144.42
646.029	125
646.438	110.44
646.847	108.01
647.256	127.43
647.665	125
648.074	171.12
648.483	141.99
648.892	192.96
649.3	105.58
649.709	188.11
650.118	156.56
650.526	209.95
650.935	173.55
651.343	166.26
651.752	132.28
652.16	129.86
652.568	156.56
652.977	137.14
653.385	222.09
653.793	108.01
654.201	117.72
654.609	110.44
655.017	144.42
655.425	88.59
655.833	163.84
656.241	132.28
656.649	161.41
657.057	200.25
657.464	178.4
657.872	195.39
658.28	127.43
658.687	112.87
659.095	105.58
659.502	71.6
659.91	154.13
660.317	168.69
660.724	115.29
661.132	120.15
661.539	132.28
661.946	161.41
662.353	134.71
662.76	137.14
663.167	81.31
663.574	108.01
663.981	207.53
664.388	185.68
664.795	207.53
665.202	125
665.608	141.99
666.015	127.43
666.422	200.25
666.828	175.97
667.235	205.1
667.641	180.83
668.047	86.17
668.454	129.86
668.86	139.57
669.266	168.69
669.673	141.99
670.079	146.85
670.485	154.13
670.891	144.42
671.297	141.99
671.703	105.58
672.109	161.41
672.515	178.4
672.92	229.37
673.326	158.98
673.732	137.14
674.138	178.4
674.543	166.26
674.949	168.69
675.354	156.56
675.76	175.97
676.165	212.38
676.57	151.7
676.976	149.27
677.381	115.29
677.786	158.98
678.191	154.13
678.596	137.14
679.001	137.14
679.406	161.41
679.811	190.54
680.216	95.88
680.621	149.27
681.026	183.26
681.43	132.28
681.835	103.16
682.24	125
682.644	120.15
683.049	161.41
683.453	112.87
683.858	98.3
684.262	108.01
684.667	163.84
685.071	197.82
685.475	110.44
685.879	231.8
686.283	183.26
686.687	166.26
687.091	137.14
687.495	146.85
687.899	251.22
688.303	195.39
688.707	110.44
689.111	127.43
689.514	190.54
689.918	185.68
690.322	197.82
690.725	197.82
691.129	81.31
691.532	171.12
691.936	222.09
692.339	144.42
692.742	115.29
693.146	122.57
693.549	132.28
693.952	197.82
694.355	129.86
694.758	132.28
695.161	144.42
695.564	190.54
695.967	137.14
696.37	154.13
696.773	146.85
697.175	200.25
697.578	103.16
697.981	183.26
698.383	180.83
698.786	163.84
699.188	141.99
699.591	88.59
699.993	139.57
700.395	134.71
700.798	122.57
701.2	183.26
701.602	253.64
702.004	212.38
702.406	151.7
702.808	137.14
703.21	117.72
703.612	149.27
704.014	263.35
704.416	154.13
704.818	120.15
705.219	154.13
705.621	168.69
706.023	241.51
706.424	134.71
706.826	209.95
707.227	207.53
707.629	156.56
708.03	137.14
708.431	195.39
708.832	149.27
709.234	168.69
709.635	146.85
710.036	171.12
710.437	161.41
710.838	236.65
711.239	229.37
711.64	224.52
712.041	171.12
712.441	217.24
712.842	151.7
713.243	175.97
713.643	239.08
714.044	195.39
714.445	294.91
714.845	231.8
715.246	192.96
715.646	212.38
716.046	217.24
716.447	290.05
716.847	214.81
717.247	236.65
717.647	209.95
718.047	273.06
718.447	263.35
718.847	219.66
719.247	185.68
719.647	268.21
720.047	282.77
720.446	328.89
720.846	183.26
721.246	309.47
721.645	146.85
722.045	226.95
722.444	234.23
722.844	229.37
723.243	260.93
723.643	285.2
724.042	246.36
724.441	178.4
724.84	219.66
725.24	246.36
725.639	314.33
726.038	326.46
726.437	260.93
726.836	401.71
727.234	355.59
727.633	345.88
728.032	367.72
728.431	377.43
728.83	321.61
729.228	302.19
729.627	377.43
730.025	375.01
730.424	501.22
730.822	464.81
731.22	547.34
731.619	629.86
732.017	544.91
732.415	634.72
732.813	617.73
733.212	787.63
733.61	860.45
734.008	809.48
734.406	875.01
734.803	1020.65
735.201	1091.04
735.599	1239.1
735.997	1287.64
736.395	1345.89
736.792	1566.77
737.19	1389.58
737.587	1581.34
737.985	1661.43
738.382	1816.78
738.78	1843.48
739.177	1877.46
739.574	1957.55
739.971	2144.45
740.369	2309.5
740.766	2467.27
741.163	2508.53
741.56	2770.67
741.957	2610.48
742.354	2821.65
742.751	2858.05
743.147	2799.8
743.544	3154.18
743.941	3066.8
744.338	3331.36
744.734	3659.04
745.131	3979.43
745.527	4188.17
745.924	4421.19
746.32	4693.03
746.716	4828.96
747.113	5023.14
747.509	5457.61
747.905	5741.59
748.301	6193.06
748.697	6328.98
749.093	6894.52
749.489	6984.33
749.885	7023.17
750.281	7714.93
750.677	7887.26
751.073	8426.1
751.468	8710.09
751.864	9508.64
752.26	9168.83
752.655	9666.41
753.051	10066.9
753.446	10520.79
753.842	10649.44
754.237	10899.44
754.632	11166.44
755.028	11443.14
755.423	11637.32
755.818	11460.13
756.213	11753.82
756.608	11775.67
757.003	11574.21
757.398	12183.44
757.793	11770.81
758.188	12261.11
758.583	12503.84
758.977	12134.9
759.372	12865.49
759.767	14397.07
760.161	14960.18
760.556	16166.51
760.95	16673.8
761.345	17122.84
761.739	17523.33
762.133	18656.84
762.527	19394.72
762.922	20562.21
763.316	21326.79
763.71	21688.44
764.104	22287.97
764.498	23297.69
764.892	23868.09
765.286	24001.59
765.68	24688.49
766.073	25440.93
766.467	25440.93
766.861	26506.48
767.255	28183.69
767.648	29067.2
768.042	29795.37
768.435	30955.58
768.829	31215.29
769.222	31555.1
769.615	33254.16
770.008	31091.5
770.402	31377.92
770.795	32722.6
771.188	33674.07
771.581	32455.6
771.974	31589.08
772.367	31409.47
772.76	30846.35
773.153	30916.74
773.545	30693.44
773.938	31212.86
774.331	30870.63
774.724	30525.96
775.116	32460.46
775.509	34123.1
775.901	35863.42
776.294	36710.52
776.686	37470.24
777.078	38431.42
777.471	39273.67
777.863	40657.19
778.255	42713.04
778.647	43123.24
779.039	43666.94
779.431	43662.09
779.823	43997.04
780.215	43710.63
780.607	43086.84
780.999	45045.6
781.39	44887.83
781.782	45943.68
782.174	46281.06
782.565	46489.8
782.957	45931.54
783.348	46630.58
783.74	47094.18
784.131	46380.58
784.522	46591.74
784.914	45574.74
785.305	44608.7
785.696	44589.29
786.087	43938.79
786.478	42465.47
786.869	40147.47
787.26	40213
787.651	39016.38
788.042	37123.15
788.433	35698.37
788.823	33768.73
789.214	32936.19
789.605	31545.39
789.995	30877.91
790.386	30110.91
790.776	28715.25
791.167	28780.79
791.557	31057.52
791.948	31506.56
792.338	30462.85
792.728	32489.58
793.118	33479.89
793.508	33785.72
793.898	32960.46
794.288	34356.12
794.678	34006.6
795.068	34319.71
795.458	33870.67
795.848	34416.8
796.238	33547.85
796.627	31960.45
797.017	32727.45
797.406	34489.61
797.796	33023.57
798.185	32516.28
798.575	34341.55
798.964	34431.36
799.354	34443.5
799.743	33955.63
800.132	35780.9
800.521	35482.35
800.91	34091.55
801.299	34060
801.688	35778.47
802.077	34586.7
802.466	34215.34
802.855	34305.15
803.244	34273.59
803.633	33215.32
804.021	32290.55
804.41	31542.97
804.799	31783.26
805.187	29518.66
805.576	28086.6
805.964	28028.35
806.352	27530.77
806.741	26788.04
807.129	25258.89
807.517	25872.98
807.905	25729.77
808.293	24688.49
808.681	25135.1
809.069	26285.6
809.457	28727.39
809.845	27846.31
810.233	27178.82
810.621	28698.26
811.009	29188.56
811.396	28540.49
811.784	27261.35
812.171	27656.98
812.559	28741.95
812.946	27244.36
813.334	26266.19
813.721	26297.74
814.108	27011.34
814.496	26152.11
814.883	24972.48
815.27	27013.77
815.657	28472.53
816.044	27661.84
816.431	25598.7
816.818	26055.02
817.205	26955.52
817.592	26974.93
817.979	25656.95
818.365	24618.1
818.752	24746.74
819.139	25067.14
819.525	24045.28
819.912	22256.41
820.298	22249.13
820.685	22686.03
821.071	21394.75
821.457	19664.14
821.843	18766.07
822.23	18943.26
822.616	18164.12
823.002	16059.72
823.388	15139.8
823.774	15098.54
824.16	14877.66
824.546	14018.42
824.931	13416.47
825.317	13460.16
825.703	13884.92
826.089	13630.07
826.474	12455.29
826.86	12511.12
827.245	12967.43
827.631	13161.61
828.016	12547.53
828.401	11846.06
828.787	12079.07
829.172	12299.95
829.557	11659.16
829.942	10758.66
830.327	10528.08
830.712	11040.22
831.097	10952.84
831.482	10214.96
831.867	9413.98
832.252	9282.91
832.636	9433.4
833.021	9484.37
833.406	8853.29
833.79	8659.12
834.175	8547.46
834.559	8753.78
834.944	8508.63
835.328	7870.27
835.713	7591.14
836.097	7688.23
836.481	7668.81
836.865	7345.99
837.249	6591.12
837.633	6392.09
838.017	6341.12
838.401	6387.24
838.785	5833.83
839.169	5345.96
839.553	5173.62
839.937	4928.47
840.32	4850.8
840.704	4333.81
841.087	4078.95
841.471	3933.31
841.854	4154.19
842.238	4040.11
842.621	3930.89
843.004	3535.25
843.388	3389.62
843.771	3673.6
844.154	3712.44
844.537	3506.12
844.92	3338.64
845.303	3125.05
845.686	3341.07
846.069	3455.15
846.452	3256.12
846.834	3095.92
847.217	3025.53
847.6	3027.96
847.982	3256.12
848.365	2938.15
848.748	2773.1
849.13	2617.76
849.512	2595.91
849.895	2848.35
850.277	2782.81
850.659	2576.5
851.041	2423.58
851.423	2540.09
851.806	2644.46
852.188	2804.66
852.57	2459.99
852.951	2290.08
853.333	2200.28
853.715	2506.11
854.097	2438.14
854.479	2241.54
854.86	1945.42
855.242	1809.49
855.623	1841.05
856.005	1923.57
856.386	1916.29
856.768	1731.82
857.149	1501.24
857.53	1503.66
857.911	1666.29
858.292	1588.62
858.674	1401.72
859.055	1287.64
859.436	1195.41
859.817	1122.59
860.197	1166.28
860.578	1144.44
860.959	1129.87
861.34	933.27
861.72	794.92
862.101	879.87
862.482	858.02
862.862	945.4
863.243	841.03
863.623	743.94
864.003	821.61
864.384	824.04
864.764	858.02
865.144	768.22
865.524	634.72
865.904	574.04
866.284	692.97
866.664	729.38
867.044	629.86
867.424	637.15
867.804	540.06
868.183	634.72
868.563	642
868.943	622.58
869.322	595.88
869.702	547.34
870.081	459.96
870.461	394.42
870.84	532.78
871.22	457.53
871.599	559.47
871.978	404.13
872.357	360.44
872.736	425.98
873.115	423.55
873.494	479.38
873.873	360.44
874.252	338.6
874.631	275.49
875.01	365.3
875.388	324.03
875.767	345.88
876.146	336.17
876.524	297.33
876.903	258.5
877.281	207.53
877.66	256.07
878.038	224.52
878.416	321.61
878.794	195.39
879.173	292.48
879.551	229.37
879.929	217.24
880.307	229.37
880.685	178.4
881.063	173.55
881.441	129.86
881.818	241.51
882.196	149.27
882.574	175.97
882.951	188.11
883.329	209.95
883.707	195.39
884.084	180.83
884.461	154.13
884.839	120.15
885.216	129.86
885.593	134.71
885.971	175.97
886.348	158.98
886.725	263.35
887.102	175.97
887.479	158.98
887.856	166.26
888.233	212.38
888.609	183.26
888.986	149.27
889.363	173.55
889.74	100.73
890.116	98.3
890.493	112.87
890.869	173.55
891.246	168.69
891.622	226.95
891.998	180.83
892.375	117.72
892.751	112.87
893.127	197.82
893.503	188.11
893.879	83.74
894.255	212.38
894.631	185.68
895.007	127.43
895.383	120.15
895.759	122.57
896.134	190.54
896.51	192.96
896.886	163.84
897.261	175.97
897.637	151.7
898.012	57.04
898.388	154.13
898.763	110.44
899.138	158.98
899.514	207.53
899.889	134.71
900.264	105.58
900.639	98.3
901.014	108.01
901.389	95.88
901.764	91.02
902.139	112.87
902.513	127.43
902.888	78.88
903.263	144.42
903.638	120.15
904.012	168.69
904.387	122.57
904.761	137.14
905.136	115.29
905.51	188.11
905.884	205.1
906.259	217.24
906.633	173.55
907.007	83.74
907.381	149.27
907.755	137.14
908.129	108.01
908.503	141.99
908.877	161.41
909.251	163.84
909.624	141.99
909.998	144.42
910.372	141.99
910.745	144.42
911.119	171.12
911.492	139.57
911.866	139.57
912.239	156.56
912.612	168.69
912.986	141.99
913.359	122.57
913.732	154.13
914.105	161.41
914.478	88.59
914.851	103.16
915.224	117.72
915.597	100.73
915.97	149.27
916.343	98.3
916.715	185.68
917.088	175.97
917.461	74.03
917.833	76.46
918.206	156.56
918.578	158.98
918.951	185.68
919.323	129.86
919.695	161.41
920.067	149.27
920.44	134.71
920.812	95.88
921.184	112.87
921.556	175.97
921.928	180.83
922.3	122.57
922.672	95.88
923.043	127.43
923.415	137.14
923.787	156.56
924.158	110.44
924.53	219.66
924.901	166.26
925.273	98.3
925.644	122.57
926.016	144.42
926.387	141.99
926.758	88.59
927.129	110.44
927.5	120.15
927.872	108.01
928.243	154.13
928.613	137.14
928.984	158.98
929.355	105.58
929.726	120.15
930.097	122.57
930.467	78.88
930.838	120.15
931.209	125
931.579	144.42
931.95	98.3
932.32	115.29
932.69	71.6
933.061	175.97
933.431	105.58
933.801	127.43
934.171	95.88
934.541	161.41
934.911	154.13
935.281	190.54
935.651	54.61
936.021	163.84
936.391	149.27
936.761	44.9
937.13	88.59
937.5	71.6
937.87	120.15
938.239	74.03
938.609	180.83
938.978	180.83
939.347	117.72
939.717	110.44
940.086	178.4
940.455	117.72
940.824	149.27
941.193	144.42
941.562	69.18
941.931	110.44
942.3	178.4
942.669	120.15
943.038	27.91
943.407	161.41
943.775	83.74
944.144	195.39
944.513	146.85
944.881	120.15
945.25	141.99
945.618	180.83
945.986	149.27
946.355	129.86
946.723	163.84
947.091	144.42
947.459	117.72
947.827	129.86
948.195	163.84
948.563	158.98
948.931	134.71
949.299	144.42
949.667	95.88
950.035	144.42
950.402	120.15
950.77	115.29
951.138	197.82
951.505	151.7
951.873	91.02
952.24	91.02
952.607	103.16
952.975	144.42
953.342	151.7
953.709	209.95
954.076	161.41
954.443	146.85
954.81	154.13
955.177	163.84
955.544	91.02
955.911	178.4
956.278	246.36
956.645	188.11
957.012	139.57
957.378	98.3
957.745	120.15
958.111	180.83
958.478	103.16
958.844	151.7
959.211	154.13
959.577	122.57
959.943	183.26
960.309	154.13
960.675	81.31
961.042	74.03
961.408	110.44
961.774	146.85
962.139	156.56
962.505	93.45
962.871	139.57
963.237	173.55
963.603	141.99
963.968	127.43
964.334	120.15
964.699	154.13
965.065	76.46
965.43	173.55
965.796	88.59
966.161	103.16
966.526	158.98
966.891	151.7
967.256	98.3
967.622	122.57
967.987	108.01
968.352	154.13
968.716	117.72
969.081	110.44
969.446	115.29
969.811	171.12
970.176	91.02
970.54	141.99
970.905	132.28
971.269	108.01
971.634	74.03
971.998	161.41
972.363	168.69
972.727	158.98
973.091	141.99
973.455	154.13
973.819	61.89
974.183	129.86
974.547	146.85
974.911	168.69
975.275	156.56
975.639	149.27
976.003	137.14
976.367	134.71
976.73	134.71
977.094	49.76
977.458	173.55
977.821	125
978.185	42.48
978.548	146.85
978.911	115.29
979.275	183.26
979.638	110.44
980.001	129.86
980.364	83.74
980.727	163.84
981.09	93.45
981.453	180.83
981.816	129.86
982.179	185.68
982.542	190.54
982.905	190.54
983.267	149.27
983.63	161.41
983.992	141.99
984.355	115.29
984.717	192.96
985.08	229.37
985.442	158.98
985.804	149.27
986.167	168.69
986.529	129.86
986.891	151.7
987.253	115.29
987.615	175.97
987.977	100.73
988.339	151.7
988.701	156.56
989.062	161.41
989.424	139.57
989.786	37.62
990.147	88.59
990.509	125
990.87	158.98
991.232	125
991.593	120.15
991.955	100.73
992.316	168.69
992.677	117.72
993.038	125
993.399	137.14
993.76	105.58
994.121	78.88
994.482	110.44
994.843	149.27
995.204	74.03
995.565	103.16
995.926	134.71
996.286	112.87
996.647	154.13
997.007	86.17
997.368	173.55
997.728	125
998.089	188.11
998.449	205.1
998.809	163.84
999.169	139.57
999.53	122.57
999.89	98.3
1000.25	144.42
1000.61	122.57
1000.97	129.86
1001.329	117.72
1001.689	161.41
1002.049	125
1002.409	144.42
1002.768	74.03
1003.128	166.26
1003.487	69.18
1003.847	120.15
1004.206	57.04
1004.566	112.87
1004.925	178.4
1005.284	115.29
1005.643	108.01
1006.003	183.26
1006.362	156.56
1006.721	120.15
1007.08	156.56
1007.438	115.29
1007.797	120.15
1008.156	88.59
1008.515	161.41
1008.874	93.45
1009.232	71.6
1009.591	141.99
1009.949	192.96
1010.308	180.83
1010.666	125
1011.024	105.58
1011.383	168.69
1011.741	100.73
1012.099	108.01
1012.457	132.28
1012.815	163.84
1013.173	66.75
1013.531	141.99
1013.889	134.71
1014.247	115.29
1014.605	224.52
1014.962	163.84
1015.32	120.15
1015.678	190.54
1016.035	163.84
1016.393	149.27
1016.75	139.57
1017.107	134.71
1017.465	144.42
1017.822	125
1018.179	190.54
1018.536	129.86
1018.894	125
1019.251	122.57
1019.608	108.01
1019.964	127.43
1020.321	173.55
1020.678	115.29
1021.035	112.87
1021.392	115.29
1021.748	185.68
1022.105	168.69
1022.461	180.83
1022.818	168.69
1023.174	144.42
1023.531	93.45
1023.887	134.71
1024.243	144.42
1024.599	158.98
1024.955	120.15
1025.311	202.67
1025.667	141.99
1026.023	171.12
1026.379	222.09
1026.735	88.59
1027.091	149.27
1027.447	134.71
