189.514	109.53
189.973	109.53
190.431	109.53
190.889	24.58
191.348	36.71
191.806	17.29
192.264	-48.24
192.722	-23.97
193.18	-55.52
193.638	-36.1
194.096	-28.82
194.554	34.28
195.012	19.72
195.47	53.7
195.928	-60.38
196.385	0.3
196.843	-21.54
197.301	-2.12
197.758	10.01
198.216	29.43
198.674	63.41
199.131	65.84
199.589	107.1
200.046	109.53
200.503	36.71
200.961	97.39
201.418	97.39
201.875	145.94
202.332	128.95
202.79	51.28
203.247	104.67
203.704	99.82
204.161	121.66
204.618	80.4
205.075	162.93
205.532	141.08
205.989	121.66
206.445	92.54
206.902	116.81
207.359	172.64
207.816	126.52
208.272	172.64
208.729	179.92
209.185	126.52
209.642	153.22
210.098	179.92
210.555	272.15
211.011	150.79
211.467	160.5
211.924	111.96
212.38	153.22
212.836	109.53
213.292	162.93
213.748	165.35
214.204	141.08
214.66	182.35
215.116	153.22
215.572	124.09
216.028	196.91
216.484	167.78
216.94	170.21
217.396	119.24
217.851	165.35
218.307	150.79
218.763	153.22
219.218	126.52
219.674	138.66
220.129	131.37
220.585	128.95
221.04	148.36
221.496	109.53
221.951	165.35
222.406	148.36
222.861	145.94
223.317	82.83
223.772	121.66
224.227	179.92
224.682	111.96
225.137	97.39
225.592	162.93
226.047	158.07
226.502	189.63
226.957	143.51
227.411	143.51
227.866	179.92
228.321	150.79
228.776	131.37
229.23	126.52
229.685	75.55
230.139	162.93
230.594	199.34
231.048	143.51
231.503	70.69
231.957	126.52
232.411	148.36
232.865	107.1
233.32	182.35
233.774	216.33
234.228	104.67
234.682	116.81
235.136	167.78
235.59	131.37
236.044	192.05
236.498	218.75
236.952	187.2
237.406	131.37
237.86	136.23
238.313	160.5
238.767	204.19
239.221	167.78
239.674	128.95
240.128	150.79
240.581	124.09
241.035	119.24
241.488	82.83
241.942	124.09
242.395	109.53
242.848	153.22
243.301	75.55
243.755	121.66
244.208	150.79
244.661	194.48
245.114	102.25
245.567	136.23
246.02	153.22
246.473	107.1
246.926	104.67
247.379	121.66
247.832	90.11
248.284	145.94
248.737	172.64
249.19	97.39
249.642	111.96
250.095	90.11
250.547	109.53
251	182.35
251.452	75.55
251.905	126.52
252.357	175.06
252.81	104.67
253.262	201.76
253.714	199.34
254.166	145.94
254.618	92.54
255.07	175.06
255.523	177.49
255.975	162.93
256.427	111.96
256.878	179.92
257.33	138.66
257.782	109.53
258.234	172.64
258.686	216.33
259.137	170.21
259.589	128.95
260.041	153.22
260.492	131.37
260.944	138.66
261.395	121.66
261.847	218.75
262.298	199.34
262.749	167.78
263.201	145.94
263.652	141.08
264.103	165.35
264.554	148.36
265.005	131.37
265.457	126.52
265.908	77.97
266.359	77.97
266.809	119.24
267.26	131.37
267.711	90.11
268.162	165.35
268.613	124.09
269.064	136.23
269.514	172.64
269.965	141.08
270.415	170.21
270.866	155.65
271.316	143.51
271.767	177.49
272.217	107.1
272.668	158.07
273.118	133.8
273.568	155.65
274.019	141.08
274.469	150.79
274.919	170.21
275.369	133.8
275.819	104.67
276.269	250.31
276.719	114.38
277.169	133.8
277.619	172.64
278.069	167.78
278.518	116.81
278.968	172.64
279.418	145.94
279.867	150.79
280.317	102.25
280.767	167.78
281.216	128.95
281.666	114.38
282.115	167.78
282.564	111.96
283.014	189.63
283.463	99.82
283.912	92.54
284.361	116.81
284.811	184.77
285.26	206.62
285.709	126.52
286.158	177.49
286.607	175.06
287.056	116.81
287.505	179.92
287.953	201.76
288.402	187.2
288.851	104.67
289.3	141.08
289.748	121.66
290.197	131.37
290.646	128.95
291.094	143.51
291.543	155.65
291.991	94.97
292.439	131.37
292.888	160.5
293.336	177.49
293.784	114.38
294.233	104.67
294.681	90.11
295.129	70.69
295.577	238.17
296.025	150.79
296.473	148.36
296.921	177.49
297.369	170.21
297.817	148.36
298.264	138.66
298.712	150.79
299.16	138.66
299.608	153.22
300.055	114.38
300.503	109.53
300.95	143.51
301.398	126.52
301.845	104.67
302.293	133.8
302.74	153.22
303.187	165.35
303.635	172.64
304.082	114.38
304.529	111.96
304.976	136.23
305.423	141.08
305.87	165.35
306.317	128.95
306.764	133.8
307.211	82.83
307.658	145.94
308.105	128.95
308.552	235.74
308.998	189.63
309.445	187.2
309.892	148.36
310.338	167.78
310.785	111.96
311.231	167.78
311.678	165.35
312.124	126.52
312.571	148.36
313.017	160.5
313.463	128.95
313.909	184.77
314.356	68.27
314.802	87.68
315.248	160.5
315.694	184.77
316.14	175.06
316.586	136.23
317.032	136.23
317.478	182.35
317.923	128.95
318.369	162.93
318.815	170.21
319.261	124.09
319.706	92.54
320.152	184.77
320.597	165.35
321.043	160.5
321.488	150.79
321.934	124.09
322.379	128.95
322.824	196.91
323.27	143.51
323.715	213.9
324.16	196.91
324.605	114.38
325.05	162.93
325.495	194.48
325.94	131.37
326.385	175.06
326.83	121.66
327.275	77.97
327.72	126.52
328.165	133.8
328.61	68.27
329.054	119.24
329.499	194.48
329.943	145.94
330.388	175.06
330.832	128.95
331.277	138.66
331.721	165.35
332.166	155.65
332.61	124.09
333.054	192.05
333.499	160.5
333.943	82.83
334.387	128.95
334.831	128.95
335.275	145.94
335.719	160.5
336.163	107.1
336.607	167.78
337.051	131.37
337.495	177.49
337.938	121.66
338.382	150.79
338.826	170.21
339.269	82.83
339.713	34.28
340.157	143.51
340.6	155.65
341.044	107.1
341.487	85.26
341.93	73.12
342.374	162.93
342.817	211.47
343.26	153.22
343.703	167.78
344.146	218.75
344.59	153.22
345.033	211.47
345.476	143.51
345.919	82.83
346.361	119.24
346.804	131.37
347.247	162.93
347.69	160.5
348.133	153.22
348.575	92.54
349.018	136.23
349.461	187.2
349.903	126.52
350.346	158.07
350.788	119.24
351.23	92.54
351.673	192.05
352.115	170.21
352.557	99.82
353	126.52
353.442	131.37
353.884	116.81
354.326	170.21
354.768	131.37
355.21	141.08
355.652	184.77
356.094	99.82
356.536	90.11
356.978	107.1
357.419	216.33
357.861	211.47
358.303	121.66
358.744	104.67
359.186	141.08
359.627	196.91
360.069	153.22
360.51	155.65
360.952	187.2
361.393	228.46
361.834	143.51
362.276	184.77
362.717	167.78
363.158	187.2
363.599	175.06
364.04	138.66
364.481	150.79
364.922	150.79
365.363	145.94
365.804	153.22
366.245	194.48
366.686	104.67
367.126	136.23
367.567	153.22
368.008	114.38
368.448	94.97
368.889	196.91
369.33	131.37
369.77	230.89
370.21	194.48
370.651	143.51
371.091	126.52
371.531	85.26
371.972	138.66
372.412	179.92
372.852	162.93
373.292	131.37
373.732	99.82
374.172	170.21
374.612	119.24
375.052	201.76
375.492	114.38
375.932	97.39
376.372	145.94
376.811	209.04
377.251	111.96
377.691	138.66
378.13	119.24
378.57	204.19
379.009	201.76
379.449	199.34
379.888	136.23
380.328	162.93
380.767	85.26
381.206	201.76
381.645	119.24
382.085	141.08
382.524	150.79
382.963	150.79
383.402	141.08
383.841	160.5
384.28	138.66
384.719	177.49
385.158	216.33
385.596	111.96
386.035	167.78
386.474	155.65
386.913	60.98
387.351	133.8
387.79	155.65
388.228	148.36
388.667	189.63
389.105	167.78
389.544	128.95
389.982	172.64
390.42	138.66
390.859	160.5
391.297	150.79
391.735	128.95
392.173	138.66
392.611	119.24
393.049	133.8
393.487	119.24
393.925	109.53
394.363	184.77
394.801	102.25
395.239	90.11
395.676	124.09
396.114	194.48
396.552	124.09
396.989	172.64
397.427	155.65
397.864	148.36
398.302	116.81
398.739	119.24
399.177	141.08
399.614	80.4
400.051	80.4
400.488	121.66
400.926	121.66
401.363	116.81
401.8	104.67
402.237	80.4
402.674	131.37
403.111	136.23
403.548	158.07
403.985	136.23
404.421	126.52
404.858	141.08
405.295	82.83
405.732	128.95
406.168	102.25
406.605	165.35
407.041	124.09
407.478	158.07
407.914	148.36
408.351	90.11
408.787	82.83
409.223	172.64
409.66	179.92
410.096	206.62
410.532	131.37
410.968	128.95
411.404	153.22
411.84	114.38
412.276	150.79
412.712	179.92
413.148	162.93
413.584	145.94
414.02	194.48
414.455	150.79
414.891	126.52
415.327	128.95
415.762	97.39
416.198	172.64
416.633	126.52
417.069	114.38
417.504	131.37
417.94	90.11
418.375	126.52
418.81	162.93
419.245	160.5
419.681	128.95
420.116	97.39
420.551	182.35
420.986	196.91
421.421	148.36
421.856	153.22
422.291	92.54
422.726	167.78
423.16	155.65
423.595	119.24
424.03	187.2
424.464	119.24
424.899	114.38
425.334	121.66
425.768	153.22
426.203	177.49
426.637	213.9
427.071	165.35
427.506	145.94
427.94	116.81
428.374	116.81
428.809	177.49
429.243	148.36
429.677	226.04
430.111	243.03
430.545	182.35
430.979	145.94
431.413	177.49
431.847	124.09
432.28	199.34
432.714	138.66
433.148	167.78
433.582	252.73
434.015	126.52
434.449	121.66
434.882	155.65
435.316	155.65
435.749	162.93
436.183	104.67
436.616	136.23
437.049	179.92
437.483	160.5
437.916	257.59
438.349	201.76
438.782	143.51
439.215	189.63
439.648	184.77
440.081	131.37
440.514	160.5
440.947	138.66
441.38	155.65
441.813	167.78
442.245	150.79
442.678	155.65
443.111	177.49
443.543	121.66
443.976	128.95
444.408	187.2
444.841	145.94
445.273	167.78
445.705	298.85
446.138	199.34
446.57	194.48
447.002	196.91
447.434	243.03
447.867	226.04
448.299	228.46
448.731	201.76
449.163	153.22
449.595	194.48
450.026	162.93
450.458	194.48
450.89	194.48
451.322	250.31
451.754	226.04
452.185	260.02
452.617	257.59
453.048	221.18
453.48	243.03
453.911	291.57
454.343	213.9
454.774	165.35
455.205	165.35
455.637	211.47
456.068	257.59
456.499	223.61
456.93	235.74
457.361	228.46
457.792	204.19
458.223	155.65
458.654	179.92
459.085	182.35
459.516	216.33
459.947	182.35
460.378	177.49
460.808	243.03
461.239	209.04
461.669	238.17
462.1	172.64
462.531	223.61
462.961	206.62
463.391	172.64
463.822	182.35
464.252	158.07
464.682	199.34
465.113	238.17
465.543	206.62
465.973	262.44
466.403	226.04
466.833	211.47
467.263	243.03
467.693	228.46
468.123	221.18
468.553	213.9
468.983	143.51
469.412	175.06
469.842	109.53
470.272	211.47
470.701	199.34
471.131	187.2
471.56	284.29
471.99	199.34
472.419	182.35
472.849	124.09
473.278	194.48
473.707	243.03
474.136	196.91
474.566	141.08
474.995	216.33
475.424	221.18
475.853	116.81
476.282	235.74
476.711	204.19
477.14	170.21
477.569	221.18
477.997	209.04
478.426	102.25
478.855	216.33
479.283	196.91
479.712	218.75
480.141	194.48
480.569	138.66
480.998	199.34
481.426	187.2
481.854	124.09
482.283	184.77
482.711	160.5
483.139	204.19
483.567	131.37
483.995	182.35
484.424	187.2
484.852	145.94
485.28	184.77
485.708	158.07
486.135	194.48
486.563	177.49
486.991	124.09
487.419	228.46
487.847	143.51
488.274	162.93
488.702	145.94
489.129	119.24
489.557	160.5
489.984	199.34
490.412	199.34
490.839	141.08
491.266	179.92
491.694	211.47
492.121	155.65
492.548	162.93
492.975	175.06
493.402	177.49
493.829	111.96
494.256	126.52
494.683	150.79
495.11	97.39
495.537	170.21
495.964	187.2
496.39	150.79
496.817	182.35
497.244	111.96
497.67	196.91
498.097	218.75
498.523	158.07
498.95	184.77
499.376	228.46
499.803	194.48
500.229	213.9
500.655	128.95
501.081	177.49
501.508	148.36
501.934	131.37
502.36	182.35
502.786	226.04
503.212	141.08
503.638	104.67
504.064	102.25
504.489	184.77
504.915	75.55
505.341	221.18
505.767	187.2
506.192	136.23
506.618	170.21
507.043	119.24
507.469	158.07
507.894	116.81
508.32	143.51
508.745	158.07
509.17	177.49
509.596	148.36
510.021	179.92
510.446	196.91
510.871	201.76
511.296	155.65
511.721	196.91
512.146	158.07
512.571	131.37
512.996	189.63
513.421	187.2
513.845	255.16
514.27	143.51
514.695	116.81
515.119	141.08
515.544	126.52
515.969	99.82
516.393	218.75
516.817	179.92
517.242	187.2
517.666	145.94
518.09	204.19
518.515	230.89
518.939	124.09
519.363	478.47
519.787	209.04
520.211	175.06
520.635	177.49
521.059	170.21
521.483	162.93
521.907	182.35
522.331	162.93
522.754	158.07
523.178	148.36
523.602	179.92
524.025	192.05
524.449	175.06
524.872	138.66
525.296	143.51
525.719	194.48
526.143	226.04
526.566	131.37
526.989	245.45
527.412	192.05
527.836	124.09
528.259	167.78
528.682	172.64
529.105	150.79
529.528	167.78
529.951	218.75
530.374	177.49
530.796	204.19
531.219	87.68
531.642	170.21
532.065	136.23
532.487	136.23
532.91	218.75
533.332	87.68
533.755	170.21
534.177	155.65
534.6	141.08
535.022	206.62
535.444	160.5
535.867	172.64
536.289	138.66
536.711	155.65
537.133	221.18
537.555	124.09
537.977	182.35
538.399	201.76
538.821	201.76
539.243	179.92
539.665	153.22
540.086	116.81
540.508	165.35
540.93	187.2
541.351	218.75
541.773	245.45
542.195	143.51
542.616	262.44
543.037	177.49
543.459	221.18
543.88	141.08
544.301	155.65
544.723	255.16
545.144	213.9
545.565	175.06
545.986	213.9
546.407	136.23
546.828	189.63
547.249	177.49
547.67	160.5
548.091	177.49
548.512	179.92
548.932	165.35
549.353	189.63
549.774	218.75
550.194	221.18
550.615	148.36
551.035	177.49
551.456	194.48
551.876	196.91
552.296	238.17
552.717	165.35
553.137	121.66
553.557	124.09
553.977	209.04
554.397	189.63
554.817	109.53
555.237	213.9
555.657	143.51
556.077	189.63
556.497	80.4
556.917	153.22
557.337	128.95
557.756	121.66
558.176	158.07
558.596	235.74
559.015	213.9
559.435	128.95
559.854	165.35
560.274	172.64
560.693	252.73
561.112	167.78
561.532	172.64
561.951	196.91
562.37	138.66
562.789	209.04
563.208	162.93
563.627	162.93
564.046	150.79
564.465	177.49
564.884	109.53
565.303	141.08
565.722	216.33
566.14	192.05
566.559	189.63
566.978	211.47
567.396	153.22
567.815	148.36
568.233	216.33
568.652	182.35
569.07	167.78
569.489	119.24
569.907	184.77
570.325	199.34
570.743	73.12
571.161	170.21
571.58	213.9
571.998	199.34
572.416	172.64
572.833	167.78
573.251	128.95
573.669	189.63
574.087	196.91
574.505	153.22
574.922	114.38
575.34	175.06
575.758	165.35
576.175	141.08
576.593	141.08
577.01	189.63
577.428	213.9
577.845	1764.89
578.262	298.85
578.68	211.47
579.097	162.93
579.514	245.45
579.931	136.23
580.348	204.19
580.765	162.93
581.182	206.62
581.599	167.78
582.016	162.93
582.433	213.9
582.849	170.21
583.266	82.83
583.683	148.36
584.099	150.79
584.516	143.51
584.933	182.35
585.349	213.9
585.765	145.94
586.182	128.95
586.598	179.92
587.014	114.38
587.431	141.08
587.847	194.48
588.263	187.2
588.679	177.49
589.095	131.37
589.511	160.5
589.927	162.93
590.343	182.35
590.759	221.18
591.174	206.62
591.59	218.75
592.006	109.53
592.421	243.03
592.837	184.77
593.252	187.2
593.668	194.48
594.083	201.76
594.499	167.78
594.914	138.66
595.329	172.64
595.745	143.51
596.16	107.1
596.575	226.04
596.99	150.79
597.405	90.11
597.82	167.78
598.235	167.78
598.65	143.51
599.065	109.53
599.479	165.35
599.894	228.46
600.309	116.81
600.724	136.23
601.138	167.78
601.553	226.04
601.967	189.63
602.382	148.36
602.796	136.23
603.21	162.93
603.625	230.89
604.039	175.06
604.453	189.63
604.867	175.06
605.281	206.62
605.695	167.78
606.109	218.75
606.523	111.96
606.937	179.92
607.351	269.73
607.765	145.94
608.178	172.64
608.592	143.51
609.006	150.79
609.419	238.17
609.833	209.04
610.246	175.06
610.66	131.37
611.073	221.18
611.487	167.78
611.9	206.62
612.313	179.92
612.726	235.74
613.139	141.08
613.553	165.35
613.966	187.2
614.379	128.95
614.792	167.78
615.204	141.08
615.617	145.94
616.03	223.61
616.443	133.8
616.856	153.22
617.268	201.76
617.681	177.49
618.093	196.91
618.506	240.6
618.918	148.36
619.331	136.23
619.743	111.96
620.155	184.77
620.568	165.35
620.98	158.07
621.392	148.36
621.804	153.22
622.216	150.79
622.628	128.95
623.04	167.78
623.452	172.64
623.864	179.92
624.276	128.95
624.687	119.24
625.099	150.79
625.511	124.09
625.922	189.63
626.334	158.07
626.745	187.2
627.157	133.8
627.568	165.35
627.979	148.36
628.391	170.21
628.802	194.48
629.213	165.35
629.624	116.81
630.035	97.39
630.446	114.38
630.857	201.76
631.268	175.06
631.679	99.82
632.09	114.38
632.501	153.22
632.912	187.2
633.322	211.47
633.733	155.65
634.144	148.36
634.554	182.35
634.965	138.66
635.375	121.66
635.785	145.94
636.196	153.22
636.606	172.64
637.016	204.19
637.427	177.49
637.837	230.89
638.247	206.62
638.657	133.8
639.067	128.95
639.477	172.64
639.887	184.77
640.297	133.8
640.706	133.8
641.116	160.5
641.526	189.63
641.935	172.64
642.345	170.21
642.755	141.08
643.164	107.1
643.573	175.06
643.983	201.76
644.392	145.94
644.801	179.92
645.211	155.65
645.62	245.45
646.029	175.06
646.438	160.5
646.847	187.2
647.256	175.06
647.665	114.38
648.074	160.5
648.483	145.94
648.892	141.08
649.3	209.04
649.709	201.76
650.118	160.5
650.526	162.93
650.935	136.23
651.343	121.66
651.752	189.63
652.16	51.28
652.568	136.23
652.977	121.66
653.385	206.62
653.793	213.9
654.201	170.21
654.609	138.66
655.017	189.63
655.425	126.52
655.833	150.79
656.241	175.06
656.649	145.94
657.057	107.1
657.464	184.77
657.872	145.94
658.28	119.24
658.687	158.07
659.095	172.64
659.502	85.26
659.91	143.51
660.317	131.37
660.724	99.82
661.132	175.06
661.539	184.77
661.946	48.85
662.353	133.8
662.76	107.1
663.167	228.46
663.574	182.35
663.981	145.94
664.388	148.36
664.795	107.1
665.202	158.07
665.608	179.92
666.015	145.94
666.422	182.35
666.828	124.09
667.235	121.66
667.641	133.8
668.047	165.35
668.454	114.38
668.86	53.7
669.266	143.51
669.673	196.91
670.079	187.2
670.485	162.93
670.891	153.22
671.297	209.04
671.703	196.91
672.109	150.79
672.515	189.63
672.92	158.07
673.326	133.8
673.732	250.31
674.138	206.62
674.543	187.2
674.949	167.78
675.354	160.5
675.76	167.78
676.165	143.51
676.57	145.94
676.976	165.35
677.381	87.68
677.786	124.09
678.191	196.91
678.596	92.54
679.001	153.22
679.406	114.38
679.811	155.65
680.216	160.5
680.621	150.79
681.026	175.06
681.43	165.35
681.835	221.18
682.24	175.06
682.644	92.54
683.049	192.05
683.453	145.94
683.858	160.5
684.262	111.96
684.667	128.95
685.071	158.07
685.475	192.05
685.879	175.06
686.283	153.22
686.687	167.78
687.091	165.35
687.495	177.49
687.899	172.64
688.303	121.66
688.707	128.95
689.111	94.97
689.514	192.05
689.918	177.49
690.322	218.75
690.725	179.92
691.129	179.92
691.532	116.81
691.936	87.68
692.339	150.79
692.742	158.07
693.146	182.35
693.549	216.33
693.952	223.61
694.355	145.94
694.758	194.48
695.161	150.79
695.564	177.49
695.967	211.47
696.37	206.62
696.773	158.07
697.175	170.21
697.578	172.64
697.981	187.2
698.383	148.36
698.786	175.06
699.188	148.36
699.591	165.35
699.993	131.37
700.395	194.48
700.798	170.21
701.2	116.81
701.602	126.52
702.004	153.22
702.406	124.09
702.808	141.08
703.21	133.8
703.612	223.61
704.014	126.52
704.416	133.8
704.818	170.21
705.219	199.34
705.621	165.35
706.023	111.96
706.424	160.5
706.826	221.18
707.227	133.8
707.629	128.95
708.03	92.54
708.431	136.23
708.832	223.61
709.234	189.63
709.635	206.62
710.036	211.47
710.437	196.91
710.838	167.78
711.239	162.93
711.64	165.35
712.041	267.3
712.441	196.91
712.842	206.62
713.243	192.05
713.643	199.34
714.044	196.91
714.445	167.78
714.845	306.13
715.246	226.04
715.646	172.64
716.046	153.22
716.447	264.87
716.847	141.08
717.247	230.89
717.647	155.65
718.047	199.34
718.447	213.9
718.847	179.92
719.247	211.47
719.647	330.41
720.047	279.43
720.446	184.77
720.846	158.07
721.246	260.02
721.645	226.04
722.045	199.34
722.444	221.18
722.844	284.29
723.243	230.89
723.643	298.85
724.042	230.89
724.441	298.85
724.84	192.05
725.24	277.01
725.639	264.87
726.038	243.03
726.437	332.83
726.836	315.84
727.234	279.43
727.633	260.02
728.032	308.56
728.431	332.83
728.83	366.81
729.228	274.58
729.627	289.14
730.025	386.23
730.424	361.96
730.822	415.36
731.22	359.53
731.619	376.52
732.017	446.91
732.415	446.91
732.813	476.04
733.212	517.3
733.61	531.87
734.008	546.43
734.406	580.41
734.803	563.42
735.201	619.25
735.599	599.83
735.997	670.22
736.395	677.5
736.792	764.88
737.19	791.58
737.587	803.71
737.985	777.01
738.382	893.52
738.78	825.56
739.177	929.93
739.574	1102.26
739.971	1024.59
740.369	1143.53
740.766	1080.42
741.163	1141.1
741.56	1221.2
741.957	1289.16
742.354	1306.15
742.751	1313.43
743.147	1534.31
743.544	1495.47
743.941	1471.2
744.338	1527.03
744.734	1650.81
745.131	1718.78
745.527	1760.04
745.924	1844.99
746.32	2002.76
746.716	2082.86
747.113	2192.09
747.509	2230.92
747.905	2420.24
748.301	2412.96
748.697	2456.65
749.093	2682.38
749.489	2684.81
749.885	2820.74
750.281	3133.85
750.677	3162.97
751.073	3260.06
751.468	3415.41
751.864	3541.62
752.26	3624.15
752.655	3881.43
753.051	3939.69
753.446	4019.78
753.842	4129.01
754.237	4386.29
754.632	4427.56
755.028	4585.33
755.423	4561.05
755.818	4677.56
756.213	4764.94
756.608	4915.43
757.003	4968.83
757.398	5116.89
757.793	5163.01
758.188	5163.01
758.583	5488.25
758.977	5473.69
759.372	5539.22
759.767	5896.03
760.161	6211.57
760.556	6461.57
760.95	6733.42
761.345	6985.85
761.739	7250.42
762.133	7410.61
762.527	7716.44
762.922	7847.51
763.316	8112.08
763.71	8410.63
764.104	8434.9
764.498	8660.63
764.892	8961.61
765.286	9146.08
765.68	9483.46
766.073	9549
766.467	9546.57
766.861	10017.45
767.255	10150.95
767.648	10566
768.042	10536.88
768.435	10837.85
768.829	11090.28
769.222	11160.67
769.615	11313.59
770.008	11245.62
770.402	11512.62
770.795	11699.51
771.188	11837.87
771.581	11883.98
771.974	11813.59
772.367	11609.71
772.76	11816.02
773.153	11299.02
773.545	11539.32
773.938	11760.2
774.331	12073.31
774.724	12046.61
775.116	12655.84
775.509	12968.95
775.901	13250.51
776.294	13704.4
776.686	14175.28
777.078	14323.34
777.471	14813.64
777.863	15119.47
778.255	15573.36
778.647	15677.73
779.039	15871.91
779.431	15837.93
779.823	15969
780.215	16121.91
780.607	15828.22
780.999	16694.74
781.39	16541.82
781.782	16784.55
782.174	16568.52
782.565	17102.51
782.957	17168.05
783.348	17529.7
783.74	17187.46
784.131	16774.84
784.522	17386.5
784.914	16925.32
785.305	17000.57
785.696	16862.22
786.087	16578.23
786.478	16410.75
786.869	16277.26
787.26	15711.71
787.651	15337.92
788.042	15410.74
788.433	14820.92
788.823	14728.69
789.214	14888.88
789.605	14218.97
789.995	13862.17
790.386	13728.67
790.776	13485.95
791.167	13354.88
791.557	13495.66
791.948	13915.57
792.338	13961.69
792.728	14369.46
793.118	14449.56
793.508	14604.9
793.898	14903.45
794.288	14646.16
794.678	14551.5
795.068	14427.71
795.458	14663.15
795.848	14694.71
796.238	14527.23
796.627	14515.09
797.017	14216.54
797.406	14357.32
797.796	14507.81
798.185	14733.54
798.575	14369.46
798.964	14226.25
799.354	14498.1
799.743	14408.29
800.132	14527.23
800.521	14609.75
800.91	14731.12
801.299	14250.53
801.688	14158.29
802.077	13901.01
802.466	13884.01
802.855	14015.08
803.244	13410.71
803.633	13410.71
804.021	13100.02
804.41	12884
804.799	12711.67
805.187	12502.93
805.576	11837.87
805.964	11898.55
806.352	11097.56
806.741	11502.91
807.129	11099.99
807.517	11061.16
807.905	10898.53
808.293	11218.92
808.681	11121.84
809.069	10944.65
809.457	11201.93
809.845	11221.35
810.233	11413.1
810.621	11345.14
811.009	11320.87
811.396	11432.52
811.784	11148.54
812.171	11146.11
812.559	10930.09
812.946	10582.99
813.334	10624.26
813.721	10507.75
814.108	10126.67
814.496	10124.25
814.883	9869.39
815.27	10255.32
815.657	9818.42
816.044	10141.24
816.431	9869.39
816.818	10041.72
817.205	9966.48
817.592	9629.09
817.979	9313.56
818.365	9349.96
818.752	9148.5
819.139	8614.52
819.525	8731.02
819.912	8298.98
820.298	8335.38
820.685	7910.62
821.071	7648.48
821.457	7663.04
821.843	7284.4
822.23	7051.38
822.616	7014.98
823.002	6444.58
823.388	6192.15
823.774	6209.14
824.16	6002.82
824.546	5709.13
824.931	5621.75
825.317	5502.82
825.703	5454.27
826.089	5420.29
826.474	5427.57
826.86	5138.73
827.245	5158.15
827.631	5257.67
828.016	4973.68
828.401	4949.41
828.787	4825.62
829.172	4723.68
829.557	4582.9
829.942	4439.69
830.327	4417.85
830.712	4383.87
831.097	4056.19
831.482	4150.85
831.867	3932.4
832.252	3747.93
832.636	3774.63
833.021	3813.47
833.406	3636.28
833.79	3670.26
834.175	3556.18
834.559	3369.29
834.944	3296.47
835.328	3315.89
835.713	3155.69
836.097	3136.27
836.481	2920.25
836.865	2898.41
837.249	2764.91
837.633	2752.77
838.017	2556.17
838.401	2483.35
838.785	2488.21
839.169	2410.54
839.553	2303.74
839.937	2281.89
840.32	2044.02
840.704	1895.96
841.087	1876.55
841.471	1891.11
841.854	1830.43
842.238	1730.91
842.621	1726.06
843.004	1636.25
843.388	1604.7
843.771	1575.57
844.154	1597.42
844.537	1456.64
844.92	1519.74
845.303	1519.74
845.686	1478.48
846.069	1432.36
846.452	1468.77
846.834	1347.41
847.217	1386.25
847.6	1311
847.982	1442.07
848.365	1315.86
848.748	1179.93
849.13	1175.08
849.512	1104.69
849.895	1150.81
850.277	1179.93
850.659	1187.22
851.041	1061
851.423	1056.15
851.806	1041.58
852.188	1029.45
852.57	1051.29
852.951	1007.6
853.333	963.91
853.715	903.23
854.097	997.89
854.479	878.96
854.86	842.55
855.242	905.66
855.623	806.14
856.005	803.71
856.386	735.75
856.768	825.56
857.149	709.05
857.53	653.23
857.911	643.52
858.292	687.21
858.674	624.1
859.055	541.57
859.436	514.87
859.817	626.53
860.197	510.02
860.578	497.88
860.959	408.08
861.34	541.57
861.72	497.88
862.101	483.32
862.482	522.16
862.862	376.52
863.243	337.69
863.623	417.79
864.003	456.62
864.384	398.37
864.764	410.5
865.144	369.24
865.524	415.36
865.904	429.92
866.284	386.23
866.664	364.39
867.044	378.95
867.424	388.66
867.804	374.1
868.183	352.25
868.563	374.1
868.943	318.27
869.322	277.01
869.702	223.61
870.081	277.01
870.461	294
870.84	320.7
871.22	209.04
871.599	308.56
871.978	313.42
872.357	218.75
872.736	199.34
873.115	269.73
873.494	206.62
873.873	245.45
874.252	204.19
874.631	218.75
875.01	213.9
875.388	240.6
875.767	204.19
876.146	204.19
876.524	187.2
876.903	247.88
877.281	267.3
877.66	170.21
878.038	221.18
878.416	240.6
878.794	204.19
879.173	177.49
879.551	150.79
879.929	226.04
880.307	262.44
880.685	213.9
881.063	201.76
881.441	184.77
881.818	201.76
882.196	160.5
882.574	126.52
882.951	114.38
883.329	170.21
883.707	184.77
884.084	221.18
884.461	238.17
884.839	141.08
885.216	131.37
885.593	189.63
885.971	182.35
886.348	148.36
886.725	187.2
887.102	148.36
887.479	211.47
887.856	177.49
888.233	196.91
888.609	155.65
888.986	155.65
889.363	158.07
889.74	235.74
890.116	175.06
890.493	162.93
890.869	126.52
891.246	143.51
891.622	179.92
891.998	143.51
892.375	138.66
892.751	126.52
893.127	119.24
893.503	179.92
893.879	111.96
894.255	216.33
894.631	133.8
895.007	150.79
895.383	206.62
895.759	158.07
896.134	73.12
896.51	119.24
896.886	160.5
897.261	126.52
897.637	177.49
898.012	97.39
898.388	131.37
898.763	201.76
899.138	124.09
899.514	160.5
899.889	162.93
900.264	211.47
900.639	131.37
901.014	175.06
901.389	213.9
901.764	245.45
902.139	128.95
902.513	126.52
902.888	119.24
903.263	34.28
903.638	133.8
904.012	133.8
904.387	104.67
904.761	143.51
905.136	179.92
905.51	175.06
905.884	121.66
906.259	172.64
906.633	97.39
907.007	131.37
907.381	99.82
907.755	145.94
908.129	165.35
908.503	116.81
908.877	111.96
909.251	145.94
909.624	87.68
909.998	90.11
910.372	153.22
910.745	145.94
911.119	148.36
911.492	53.7
911.866	153.22
912.239	177.49
912.612	111.96
912.986	136.23
913.359	148.36
913.732	141.08
914.105	121.66
914.478	124.09
914.851	104.67
915.224	116.81
915.597	119.24
915.97	165.35
916.343	148.36
916.715	155.65
917.088	162.93
917.461	179.92
917.833	131.37
918.206	109.53
918.578	177.49
918.951	165.35
919.323	150.79
919.695	213.9
920.067	116.81
920.44	65.84
920.812	114.38
921.184	158.07
921.556	235.74
921.928	136.23
922.3	126.52
922.672	107.1
923.043	175.06
923.415	141.08
923.787	158.07
924.158	187.2
924.53	177.49
924.901	216.33
925.273	111.96
925.644	160.5
926.016	114.38
926.387	153.22
926.758	90.11
927.129	114.38
927.5	102.25
927.872	192.05
928.243	150.79
928.613	172.64
928.984	199.34
929.355	153.22
929.726	199.34
930.097	165.35
930.467	192.05
930.838	158.07
931.209	116.81
931.579	148.36
931.95	114.38
932.32	114.38
932.69	145.94
933.061	143.51
933.431	97.39
933.801	206.62
934.171	116.81
934.541	87.68
934.911	133.8
935.281	121.66
935.651	128.95
936.021	107.1
936.391	148.36
936.761	128.95
937.13	141.08
937.5	143.51
937.87	99.82
938.239	136.23
938.609	216.33
938.978	128.95
939.347	143.51
939.717	126.52
940.086	257.59
940.455	94.97
940.824	155.65
941.193	199.34
941.562	158.07
941.931	155.65
942.3	230.89
942.669	145.94
943.038	131.37
943.407	158.07
943.775	153.22
944.144	109.53
944.513	155.65
944.881	97.39
945.25	172.64
945.618	121.66
945.986	145.94
946.355	160.5
946.723	119.24
947.091	124.09
947.459	189.63
947.827	109.53
948.195	109.53
948.563	133.8
948.931	90.11
949.299	148.36
949.667	196.91
950.035	141.08
950.402	119.24
950.77	199.34
951.138	141.08
951.505	155.65
951.873	187.2
952.24	162.93
952.607	133.8
952.975	99.82
953.342	167.78
953.709	119.24
954.076	226.04
954.443	194.48
954.81	177.49
955.177	187.2
955.544	158.07
955.911	206.62
956.278	160.5
956.645	153.22
957.012	165.35
957.378	233.32
957.745	133.8
958.111	124.09
958.478	206.62
958.844	160.5
959.211	153.22
959.577	194.48
959.943	192.05
960.309	184.77
960.675	155.65
961.042	97.39
961.408	131.37
961.774	158.07
962.139	165.35
962.505	119.24
962.871	189.63
963.237	92.54
963.603	124.09
963.968	111.96
964.334	145.94
964.699	175.06
965.065	145.94
965.43	51.28
965.796	82.83
966.161	167.78
966.526	165.35
966.891	184.77
967.256	143.51
967.622	56.13
967.987	192.05
968.352	187.2
968.716	116.81
969.081	143.51
969.446	102.25
969.811	187.2
970.176	143.51
970.54	109.53
970.905	141.08
971.269	153.22
971.634	126.52
971.998	179.92
972.363	70.69
972.727	94.97
973.091	75.55
973.455	133.8
973.819	221.18
974.183	80.4
974.547	153.22
974.911	92.54
975.275	128.95
975.639	150.79
976.003	141.08
976.367	136.23
976.73	170.21
977.094	175.06
977.458	211.47
977.821	184.77
978.185	111.96
978.548	143.51
978.911	94.97
979.275	136.23
979.638	136.23
980.001	165.35
980.364	165.35
980.727	82.83
981.09	167.78
981.453	102.25
981.816	133.8
982.179	182.35
982.542	196.91
982.905	119.24
983.267	184.77
983.63	145.94
983.992	170.21
984.355	99.82
984.717	77.97
985.08	109.53
985.442	165.35
985.804	143.51
986.167	126.52
986.529	119.24
986.891	107.1
987.253	158.07
987.615	114.38
987.977	133.8
988.339	109.53
988.701	172.64
989.062	128.95
989.424	107.1
989.786	148.36
990.147	124.09
990.509	124.09
990.87	80.4
991.232	204.19
991.593	218.75
991.955	192.05
992.316	119.24
992.677	165.35
993.038	145.94
993.399	155.65
993.76	158.07
994.121	182.35
994.482	60.98
994.843	90.11
995.204	196.91
995.565	155.65
995.926	114.38
996.286	102.25
996.647	65.84
997.007	104.67
997.368	80.4
997.728	119.24
998.089	131.37
998.449	138.66
998.809	160.5
999.169	119.24
999.53	97.39
999.89	107.1
1000.25	148.36
1000.61	114.38
1000.97	109.53
1001.329	141.08
1001.689	104.67
1002.049	160.5
1002.409	133.8
1002.768	104.67
1003.128	172.64
1003.487	121.66
1003.847	82.83
1004.206	141.08
1004.566	194.48
1004.925	187.2
1005.284	148.36
1005.643	138.66
1006.003	104.67
1006.362	97.39
1006.721	56.13
1007.08	182.35
1007.438	97.39
1007.797	175.06
1008.156	148.36
1008.515	136.23
1008.874	133.8
1009.232	141.08
1009.591	177.49
1009.949	99.82
1010.308	119.24
1010.666	182.35
1011.024	233.32
1011.383	116.81
1011.741	99.82
1012.099	70.69
1012.457	60.98
1012.815	75.55
1013.173	209.04
1013.531	124.09
1013.889	158.07
1014.247	177.49
1014.605	170.21
1014.962	85.26
1015.32	145.94
1015.678	182.35
1016.035	165.35
1016.393	107.1
1016.75	184.77
1017.107	165.35
1017.465	158.07
1017.822	126.52
1018.179	160.5
1018.536	240.6
1018.894	155.65
1019.251	160.5
1019.608	189.63
1019.964	141.08
1020.321	167.78
1020.678	184.77
1021.035	167.78
1021.392	150.79
1021.748	63.41
1022.105	145.94
1022.461	121.66
1022.818	172.64
1023.174	153.22
1023.531	167.78
1023.887	148.36
1024.243	158.07
1024.599	172.64
1024.955	143.51
1025.311	189.63
1025.667	82.83
1026.023	87.68
1026.379	116.81
1026.735	150.79
1027.091	148.36
1027.447	201.76
