189.514	30.49
189.973	30.49
190.431	30.49
190.889	32.92
191.348	32.92
191.806	-30.19
192.264	-44.75
192.722	-27.76
193.18	1.37
193.638	-54.46
194.096	-81.16
194.554	-35.04
195.012	3.79
195.47	-54.46
195.928	23.21
196.385	18.36
196.843	13.5
197.301	28.06
197.758	91.17
198.216	64.47
198.674	13.5
199.131	40.2
199.589	49.91
200.046	98.45
200.503	45.06
200.961	83.89
201.418	88.75
201.875	91.17
202.332	117.87
202.79	62.05
203.247	96.03
203.704	105.74
204.161	93.6
204.618	144.57
205.075	93.6
205.532	127.58
205.989	193.12
206.445	180.98
206.902	88.75
207.359	139.72
207.816	132.44
208.272	178.55
208.729	168.84
209.185	134.86
209.642	147
210.098	154.28
210.555	183.41
211.011	59.62
211.467	154.28
211.924	113.02
212.38	139.72
212.836	96.03
213.292	57.19
213.748	113.02
214.204	93.6
214.66	139.72
215.116	151.85
215.572	154.28
216.028	227.1
216.484	132.44
216.94	190.69
217.396	86.32
217.851	137.29
218.307	76.61
218.763	130.01
219.218	159.13
219.674	176.13
220.129	144.57
220.585	147
221.04	168.84
221.496	132.44
221.951	103.31
222.406	156.71
222.861	139.72
223.317	105.74
223.772	134.86
224.227	142.14
224.682	71.75
225.137	120.3
225.592	142.14
226.047	115.44
226.502	49.91
226.957	173.7
227.411	217.39
227.866	210.11
228.321	151.85
228.776	120.3
229.23	120.3
229.685	183.41
230.139	105.74
230.594	188.26
231.048	171.27
231.503	69.33
231.957	98.45
232.411	151.85
232.865	127.58
233.32	134.86
233.774	127.58
234.228	52.34
234.682	130.01
235.136	214.96
235.59	98.45
236.044	144.57
236.498	149.43
236.952	168.84
237.406	130.01
237.86	81.46
238.313	115.44
238.767	130.01
239.221	154.28
239.674	117.87
240.128	115.44
240.581	168.84
241.035	159.13
241.488	144.57
241.942	197.97
242.395	100.88
242.848	173.7
243.301	156.71
243.755	142.14
244.208	188.26
244.661	117.87
245.114	122.73
245.567	103.31
246.02	200.4
246.473	147
246.926	219.82
247.379	149.43
247.832	120.3
248.284	142.14
248.737	117.87
249.19	139.72
249.642	103.31
250.095	113.02
250.547	83.89
251	163.99
251.452	113.02
251.905	88.75
252.357	207.68
252.81	171.27
253.262	195.54
253.714	142.14
254.166	37.77
254.618	59.62
255.07	113.02
255.523	81.46
255.975	144.57
256.427	134.86
256.878	91.17
257.33	42.63
257.782	159.13
258.234	125.15
258.686	180.98
259.137	66.9
259.589	147
260.041	108.16
260.492	127.58
260.944	168.84
261.395	76.61
261.847	149.43
262.298	154.28
262.749	100.88
263.201	134.86
263.652	117.87
264.103	159.13
264.554	207.68
265.005	161.56
265.457	139.72
265.908	105.74
266.359	144.57
266.809	168.84
267.26	205.25
267.711	180.98
268.162	125.15
268.613	81.46
269.064	188.26
269.514	108.16
269.965	66.9
270.415	168.84
270.866	122.73
271.316	144.57
271.767	117.87
272.217	127.58
272.668	193.12
273.118	134.86
273.568	76.61
274.019	178.55
274.469	79.04
274.919	122.73
275.369	76.61
275.819	74.18
276.269	49.91
276.719	159.13
277.169	139.72
277.619	117.87
278.069	125.15
278.518	180.98
278.968	176.13
279.418	108.16
279.867	96.03
280.317	122.73
280.767	125.15
281.216	161.56
281.666	127.58
282.115	96.03
282.564	98.45
283.014	127.58
283.463	173.7
283.912	139.72
284.361	127.58
284.811	168.84
285.26	214.96
285.709	122.73
286.158	132.44
286.607	147
287.056	219.82
287.505	173.7
287.953	144.57
288.402	166.42
288.851	83.89
289.3	139.72
289.748	185.83
290.197	120.3
290.646	125.15
291.094	163.99
291.543	115.44
291.991	117.87
292.439	161.56
292.888	134.86
293.336	144.57
293.784	115.44
294.233	71.75
294.681	100.88
295.129	163.99
295.577	163.99
296.025	130.01
296.473	151.85
296.921	214.96
297.369	113.02
297.817	113.02
298.264	110.59
298.712	178.55
299.16	127.58
299.608	122.73
300.055	161.56
300.503	105.74
300.95	180.98
301.398	117.87
301.845	127.58
302.293	139.72
302.74	149.43
303.187	130.01
303.635	30.49
304.082	76.61
304.529	130.01
304.976	185.83
305.423	122.73
305.87	171.27
306.317	66.9
306.764	113.02
307.211	144.57
307.658	134.86
308.105	154.28
308.552	120.3
308.998	137.29
309.445	161.56
309.892	154.28
310.338	149.43
310.785	210.11
311.231	115.44
311.678	168.84
312.124	130.01
312.571	134.86
313.017	115.44
313.463	205.25
313.909	110.59
314.356	139.72
314.802	105.74
315.248	176.13
315.694	125.15
316.14	151.85
316.586	130.01
317.032	166.42
317.478	144.57
317.923	113.02
318.369	202.82
318.815	171.27
319.261	151.85
319.706	74.18
320.152	171.27
320.597	144.57
321.043	156.71
321.488	214.96
321.934	180.98
322.379	151.85
322.824	217.39
323.27	200.4
323.715	147
324.16	69.33
324.605	125.15
325.05	166.42
325.495	110.59
325.94	195.54
326.385	64.47
326.83	83.89
327.275	144.57
327.72	173.7
328.165	139.72
328.61	108.16
329.054	137.29
329.499	113.02
329.943	100.88
330.388	125.15
330.832	130.01
331.277	159.13
331.721	132.44
332.166	139.72
332.61	171.27
333.054	122.73
333.499	132.44
333.943	98.45
334.387	134.86
334.831	151.85
335.275	144.57
335.719	132.44
336.163	147
336.607	127.58
337.051	210.11
337.495	195.54
337.938	163.99
338.382	224.67
338.826	161.56
339.269	171.27
339.713	103.31
340.157	120.3
340.6	130.01
341.044	130.01
341.487	98.45
341.93	108.16
342.374	127.58
342.817	163.99
343.26	108.16
343.703	195.54
344.146	176.13
344.59	115.44
345.033	134.86
345.476	159.13
345.919	142.14
346.361	144.57
346.804	156.71
347.247	125.15
347.69	88.75
348.133	166.42
348.575	71.75
349.018	168.84
349.461	122.73
349.903	117.87
350.346	117.87
350.788	200.4
351.23	144.57
351.673	168.84
352.115	166.42
352.557	163.99
353	96.03
353.442	117.87
353.884	127.58
354.326	207.68
354.768	96.03
355.21	139.72
355.652	88.75
356.094	142.14
356.536	115.44
356.978	86.32
357.419	151.85
357.861	178.55
358.303	168.84
358.744	134.86
359.186	180.98
359.627	154.28
360.069	154.28
360.51	154.28
360.952	180.98
361.393	105.74
361.834	178.55
362.276	188.26
362.717	168.84
363.158	137.29
363.599	54.76
364.04	113.02
364.481	210.11
364.922	103.31
365.363	122.73
365.804	144.57
366.245	185.83
366.686	30.49
367.126	127.58
367.567	168.84
368.008	130.01
368.448	54.76
368.889	108.16
369.33	96.03
369.77	105.74
370.21	168.84
370.651	171.27
371.091	120.3
371.531	147
371.972	98.45
372.412	100.88
372.852	115.44
373.292	144.57
373.732	117.87
374.172	88.75
374.612	115.44
375.052	96.03
375.492	115.44
375.932	132.44
376.372	100.88
376.811	273.21
377.251	83.89
377.691	76.61
378.13	88.75
378.57	113.02
379.009	200.4
379.449	176.13
379.888	149.43
380.328	76.61
380.767	139.72
381.206	100.88
381.645	105.74
382.085	103.31
382.524	159.13
382.963	71.75
383.402	127.58
383.841	144.57
384.28	166.42
384.719	178.55
385.158	122.73
385.596	149.43
386.035	178.55
386.474	144.57
386.913	122.73
387.351	59.62
387.79	100.88
388.228	188.26
388.667	132.44
389.105	139.72
389.544	156.71
389.982	149.43
390.42	156.71
390.859	110.59
391.297	125.15
391.735	151.85
392.173	168.84
392.611	147
393.049	98.45
393.487	144.57
393.925	37.77
394.363	190.69
394.801	139.72
395.239	188.26
395.676	127.58
396.114	115.44
396.552	163.99
396.989	122.73
397.427	154.28
397.864	190.69
398.302	76.61
398.739	161.56
399.177	159.13
399.614	161.56
400.051	161.56
400.488	117.87
400.926	42.63
401.363	137.29
401.8	171.27
402.237	115.44
402.674	144.57
403.111	105.74
403.548	156.71
403.985	142.14
404.421	108.16
404.858	197.97
405.295	151.85
405.732	151.85
406.168	71.75
406.605	86.32
407.041	86.32
407.478	147
407.914	74.18
408.351	149.43
408.787	108.16
409.223	62.05
409.66	115.44
410.096	171.27
410.532	154.28
410.968	25.64
411.404	93.6
411.84	166.42
412.276	190.69
412.712	171.27
413.148	183.41
413.584	122.73
414.02	100.88
414.455	149.43
414.891	120.3
415.327	163.99
415.762	96.03
416.198	134.86
416.633	93.6
417.069	207.68
417.504	149.43
417.94	210.11
418.375	98.45
418.81	144.57
419.245	197.97
419.681	173.7
420.116	166.42
420.551	125.15
420.986	125.15
421.421	117.87
421.856	110.59
422.291	115.44
422.726	127.58
423.16	180.98
423.595	127.58
424.03	156.71
424.464	149.43
424.899	83.89
425.334	183.41
425.768	127.58
426.203	127.58
426.637	156.71
427.071	115.44
427.506	81.46
427.94	144.57
428.374	183.41
428.809	149.43
429.243	113.02
429.677	113.02
430.111	149.43
430.545	156.71
430.979	71.75
431.413	154.28
431.847	171.27
432.28	127.58
432.714	139.72
433.148	159.13
433.582	96.03
434.015	147
434.449	222.24
434.882	137.29
435.316	159.13
435.749	229.52
436.183	236.81
436.616	205.25
437.049	166.42
437.483	159.13
437.916	156.71
438.349	178.55
438.782	163.99
439.215	130.01
439.648	130.01
440.081	98.45
440.514	171.27
440.947	83.89
441.38	122.73
441.813	144.57
442.245	183.41
442.678	156.71
443.111	163.99
443.543	161.56
443.976	149.43
444.408	166.42
444.841	130.01
445.273	178.55
445.705	139.72
446.138	212.53
446.57	122.73
447.002	103.31
447.434	163.99
447.867	173.7
448.299	147
448.731	190.69
449.163	244.09
449.595	180.98
450.026	163.99
450.458	205.25
450.89	166.42
451.322	202.82
451.754	127.58
452.185	127.58
452.617	151.85
453.048	197.97
453.48	197.97
453.911	236.81
454.343	176.13
454.774	224.67
455.205	253.8
455.637	212.53
456.068	241.66
456.499	219.82
456.93	202.82
457.361	190.69
457.792	244.09
458.223	207.68
458.654	166.42
459.085	183.41
459.516	287.78
459.947	207.68
460.378	159.13
460.808	156.71
461.239	207.68
461.669	239.23
462.1	222.24
462.531	132.44
462.961	197.97
463.391	144.57
463.822	176.13
464.252	120.3
464.682	251.37
465.113	151.85
465.543	166.42
465.973	149.43
466.403	149.43
466.833	202.82
467.263	190.69
467.693	185.83
468.123	178.55
468.553	144.57
468.983	217.39
469.412	163.99
469.842	224.67
470.272	202.82
470.701	117.87
471.131	176.13
471.56	205.25
471.99	144.57
472.419	202.82
472.849	229.52
473.278	207.68
473.707	275.64
474.136	166.42
474.566	227.1
474.995	156.71
475.424	171.27
475.853	139.72
476.282	229.52
476.711	142.14
477.14	183.41
477.569	132.44
477.997	163.99
478.426	214.96
478.855	176.13
479.283	161.56
479.712	217.39
480.141	115.44
480.569	231.95
480.998	125.15
481.426	185.83
481.854	227.1
482.283	159.13
482.711	214.96
483.139	214.96
483.567	137.29
483.995	176.13
484.424	205.25
484.852	149.43
485.28	190.69
485.708	159.13
486.135	268.36
486.563	212.53
486.991	188.26
487.419	171.27
487.847	154.28
488.274	168.84
488.702	103.31
489.129	171.27
489.557	139.72
489.984	132.44
490.412	139.72
490.839	258.65
491.266	117.87
491.694	195.54
492.121	207.68
492.548	224.67
492.975	130.01
493.402	105.74
493.829	217.39
494.256	253.8
494.683	147
495.11	139.72
495.537	144.57
495.964	202.82
496.39	147
496.817	183.41
497.244	149.43
497.67	166.42
498.097	98.45
498.523	125.15
498.95	151.85
499.376	185.83
499.803	127.58
500.229	144.57
500.655	176.13
501.081	171.27
501.508	154.28
501.934	115.44
502.36	83.89
502.786	161.56
503.212	142.14
503.638	103.31
504.064	156.71
504.489	127.58
504.915	100.88
505.341	142.14
505.767	137.29
506.192	180.98
506.618	190.69
507.043	171.27
507.469	149.43
507.894	180.98
508.32	147
508.745	113.02
509.17	147
509.596	115.44
510.021	122.73
510.446	127.58
510.871	171.27
511.296	180.98
511.721	125.15
512.146	134.86
512.571	110.59
512.996	197.97
513.421	168.84
513.845	149.43
514.27	200.4
514.695	163.99
515.119	139.72
515.544	125.15
515.969	132.44
516.393	190.69
516.817	156.71
517.242	176.13
517.666	149.43
518.09	149.43
518.515	132.44
518.939	79.04
519.363	331.47
519.787	222.24
520.211	134.86
520.635	173.7
521.059	185.83
521.483	159.13
521.907	210.11
522.331	142.14
522.754	195.54
523.178	163.99
523.602	161.56
524.025	144.57
524.449	120.3
524.872	154.28
525.296	147
525.719	173.7
526.143	185.83
526.566	113.02
526.989	147
527.412	142.14
527.836	166.42
528.259	144.57
528.682	176.13
529.105	161.56
529.528	88.75
529.951	144.57
530.374	185.83
530.796	188.26
531.219	197.97
531.642	159.13
532.065	166.42
532.487	110.59
532.91	217.39
533.332	202.82
533.755	149.43
534.177	222.24
534.6	207.68
535.022	234.38
535.444	173.7
535.867	171.27
536.289	159.13
536.711	180.98
537.133	241.66
537.555	217.39
537.977	144.57
538.399	139.72
538.821	197.97
539.243	134.86
539.665	166.42
540.086	113.02
540.508	188.26
540.93	193.12
541.351	190.69
541.773	217.39
542.195	127.58
542.616	222.24
543.037	236.81
543.459	144.57
543.88	180.98
544.301	244.09
544.723	222.24
545.144	185.83
545.565	231.95
545.986	256.22
546.407	214.96
546.828	210.11
547.249	202.82
547.67	98.45
548.091	173.7
548.512	227.1
548.932	210.11
549.353	256.22
549.774	231.95
550.194	219.82
550.615	159.13
551.035	125.15
551.456	193.12
551.876	195.54
552.296	161.56
552.717	96.03
553.137	195.54
553.557	173.7
553.977	122.73
554.397	197.97
554.817	178.55
555.237	137.29
555.657	139.72
556.077	207.68
556.497	120.3
556.917	132.44
557.337	190.69
557.756	178.55
558.176	195.54
558.596	130.01
559.015	176.13
559.435	120.3
559.854	132.44
560.274	227.1
560.693	190.69
561.112	159.13
561.532	154.28
561.951	154.28
562.37	176.13
562.789	156.71
563.208	163.99
563.627	156.71
564.046	197.97
564.465	178.55
564.884	125.15
565.303	173.7
565.722	176.13
566.14	125.15
566.559	151.85
566.978	115.44
567.396	180.98
567.815	163.99
568.233	134.86
568.652	147
569.07	151.85
569.489	132.44
569.907	197.97
570.325	217.39
570.743	161.56
571.161	139.72
571.58	93.6
571.998	166.42
572.416	205.25
572.833	93.6
573.251	130.01
573.669	161.56
574.087	142.14
574.505	180.98
574.922	185.83
575.34	166.42
575.758	173.7
576.175	161.56
576.593	154.28
577.01	113.02
577.428	210.11
577.845	1472.26
578.262	241.66
578.68	193.12
579.097	163.99
579.514	117.87
579.931	163.99
580.348	105.74
580.765	171.27
581.182	125.15
581.599	227.1
582.016	130.01
582.433	125.15
582.849	139.72
583.266	173.7
583.683	154.28
584.099	108.16
584.516	96.03
584.933	96.03
585.349	125.15
585.765	173.7
586.182	147
586.598	166.42
587.014	117.87
587.431	207.68
587.847	130.01
588.263	134.86
588.679	188.26
589.095	171.27
589.511	163.99
589.927	241.66
590.343	159.13
590.759	125.15
591.174	188.26
591.59	144.57
592.006	173.7
592.421	171.27
592.837	122.73
593.252	156.71
593.668	190.69
594.083	147
594.499	205.25
594.914	127.58
595.329	127.58
595.745	130.01
596.16	98.45
596.575	139.72
596.99	244.09
597.405	130.01
597.82	200.4
598.235	144.57
598.65	134.86
599.065	142.14
599.479	144.57
599.894	176.13
600.309	207.68
600.724	156.71
601.138	142.14
601.553	154.28
601.967	151.85
602.382	137.29
602.796	176.13
603.21	110.59
603.625	74.18
604.039	180.98
604.453	253.8
604.867	103.31
605.281	214.96
605.695	193.12
606.109	127.58
606.523	66.9
606.937	122.73
607.351	287.78
607.765	134.86
608.178	144.57
608.592	161.56
609.006	178.55
609.419	188.26
609.833	224.67
610.246	176.13
610.66	183.41
611.073	193.12
611.487	156.71
611.9	151.85
612.313	117.87
612.726	253.8
613.139	222.24
613.553	168.84
613.966	183.41
614.379	178.55
614.792	151.85
615.204	149.43
615.617	134.86
616.03	139.72
616.443	154.28
616.856	108.16
617.268	120.3
617.681	130.01
618.093	159.13
618.506	100.88
618.918	231.95
619.331	190.69
619.743	130.01
620.155	149.43
620.568	103.31
620.98	173.7
621.392	166.42
621.804	120.3
622.216	180.98
622.628	188.26
623.04	197.97
623.452	180.98
623.864	125.15
624.276	142.14
624.687	205.25
625.099	142.14
625.511	156.71
625.922	115.44
626.334	130.01
626.745	137.29
627.157	178.55
627.568	144.57
627.979	185.83
628.391	151.85
628.802	207.68
629.213	193.12
629.624	132.44
630.035	91.17
630.446	173.7
630.857	134.86
631.268	117.87
631.679	142.14
632.09	173.7
632.501	132.44
632.912	151.85
633.322	168.84
633.733	185.83
634.144	163.99
634.554	142.14
634.965	176.13
635.375	88.75
635.785	149.43
636.196	193.12
636.606	159.13
637.016	154.28
637.427	86.32
637.837	147
638.247	156.71
638.657	183.41
639.067	171.27
639.477	205.25
639.887	171.27
640.297	127.58
640.706	144.57
641.116	241.66
641.526	151.85
641.935	214.96
642.345	103.31
642.755	166.42
643.164	159.13
643.573	142.14
643.983	212.53
644.392	217.39
644.801	156.71
645.211	207.68
645.62	96.03
646.029	139.72
646.438	88.75
646.847	130.01
647.256	132.44
647.665	176.13
648.074	202.82
648.483	100.88
648.892	122.73
649.3	74.18
649.709	151.85
650.118	210.11
650.526	113.02
650.935	139.72
651.343	229.52
651.752	113.02
652.16	137.29
652.568	144.57
652.977	100.88
653.385	159.13
653.793	166.42
654.201	222.24
654.609	151.85
655.017	100.88
655.425	130.01
655.833	125.15
656.241	159.13
656.649	212.53
657.057	110.59
657.464	54.76
657.872	127.58
658.28	132.44
658.687	159.13
659.095	168.84
659.502	163.99
659.91	183.41
660.317	163.99
660.724	161.56
661.132	120.3
661.539	110.59
661.946	115.44
662.353	132.44
662.76	151.85
663.167	151.85
663.574	195.54
663.981	149.43
664.388	130.01
664.795	120.3
665.202	139.72
665.608	159.13
666.015	76.61
666.422	171.27
666.828	132.44
667.235	91.17
667.641	168.84
668.047	188.26
668.454	130.01
668.86	183.41
669.266	180.98
669.673	151.85
670.079	166.42
670.485	171.27
670.891	156.71
671.297	166.42
671.703	149.43
672.109	166.42
672.515	93.6
672.92	173.7
673.326	163.99
673.732	168.84
674.138	156.71
674.543	98.45
674.949	151.85
675.354	93.6
675.76	188.26
676.165	103.31
676.57	151.85
676.976	134.86
677.381	161.56
677.786	185.83
678.191	137.29
678.596	176.13
679.001	132.44
679.406	171.27
679.811	144.57
680.216	202.82
680.621	115.44
681.026	127.58
681.43	171.27
681.835	180.98
682.24	166.42
682.644	103.31
683.049	149.43
683.453	193.12
683.858	139.72
684.262	134.86
684.667	185.83
685.071	62.05
685.475	212.53
685.879	156.71
686.283	137.29
686.687	180.98
687.091	144.57
687.495	120.3
687.899	127.58
688.303	183.41
688.707	144.57
689.111	161.56
689.514	159.13
689.918	173.7
690.322	183.41
690.725	151.85
691.129	161.56
691.532	180.98
691.936	100.88
692.339	188.26
692.742	190.69
693.146	127.58
693.549	171.27
693.952	161.56
694.355	120.3
694.758	222.24
695.161	265.93
695.564	173.7
695.967	147
696.37	134.86
696.773	176.13
697.175	159.13
697.578	142.14
697.981	79.04
698.383	154.28
698.786	154.28
699.188	127.58
699.591	105.74
699.993	190.69
700.395	173.7
700.798	115.44
701.2	142.14
701.602	185.83
702.004	195.54
702.406	132.44
702.808	147
703.21	190.69
703.612	224.67
704.014	110.59
704.416	151.85
704.818	231.95
705.219	110.59
705.621	180.98
706.023	270.79
706.424	132.44
706.826	161.56
707.227	180.98
707.629	161.56
708.03	217.39
708.431	168.84
708.832	178.55
709.234	151.85
709.635	273.21
710.036	268.36
710.437	275.64
710.838	197.97
711.239	185.83
711.64	142.14
712.041	212.53
712.441	183.41
712.842	195.54
713.243	197.97
713.643	173.7
714.044	178.55
714.445	219.82
714.845	280.5
715.246	304.77
715.646	282.92
716.046	299.91
716.447	268.36
716.847	326.61
717.247	307.2
717.647	268.36
718.047	270.79
718.447	312.05
718.847	282.92
719.247	321.76
719.647	348.46
720.047	397
720.446	336.32
720.846	326.61
721.246	397
721.645	346.03
722.045	343.6
722.444	348.46
722.844	413.99
723.243	338.75
723.643	261.08
724.042	363.02
724.441	358.17
724.84	353.31
725.24	418.85
725.639	365.45
726.038	445.55
726.437	433.41
726.836	435.84
727.234	508.65
727.633	477.1
728.032	484.38
728.431	518.36
728.83	579.04
729.228	569.34
729.627	576.62
730.025	634.87
730.424	523.22
730.822	613.03
731.22	642.15
731.619	729.53
732.017	795.07
732.415	829.05
732.813	894.58
733.212	1142.16
733.61	1229.54
734.008	1319.35
734.406	1447.99
734.803	1365.46
735.201	1304.78
735.599	1360.61
735.997	1212.55
736.395	1176.14
736.792	1253.81
737.19	1336.34
737.587	1654.3
737.985	1969.84
738.382	2321.79
738.78	2741.7
739.177	2921.31
739.574	2986.85
739.971	2955.29
740.369	3037.82
740.766	2705.29
741.163	2355.77
741.56	2217.42
741.957	2210.14
742.354	2273.25
742.751	2523.25
743.147	2998.98
743.544	3484.43
743.941	4312.11
744.338	5081.54
744.734	5416.5
745.131	5792.72
745.527	6018.45
745.924	5797.57
746.32	5229.6
746.716	4678.62
747.113	4198.03
747.509	3867.93
747.905	3620.35
748.301	4035.41
748.697	4821.83
749.093	5904.37
749.489	7295.17
749.885	8848.59
750.281	10331.62
750.677	11513.68
751.073	11768.54
751.468	11219.99
751.864	10649.59
752.26	9266.07
752.655	8127.71
753.051	7096.14
753.446	6557.29
753.842	6300.01
754.237	7016.04
754.632	8569.46
755.028	10472.4
755.423	12851.08
755.818	14838.97
756.213	16666.67
756.608	17397.27
757.003	17421.54
757.398	16504.05
757.793	15042.86
758.188	12945.74
758.583	11115.62
758.977	9200.54
759.372	8477.23
759.767	8836.45
760.161	10227.25
760.556	12872.92
760.95	16198.22
761.345	19846.33
761.739	23732.32
762.133	26115.85
762.527	28293.07
762.922	27987.24
763.316	27178.97
763.71	24140.09
764.104	21491.99
764.498	17919.12
764.892	15302.57
765.286	13686.04
765.68	13678.76
766.073	15482.19
766.467	18433.69
766.861	23123.08
767.255	28788.22
767.648	33336.84
768.042	37285.93
768.435	38773.81
768.829	39499.55
769.222	37902.44
769.615	34103.84
770.008	29375.61
770.402	24936.22
770.795	21475
771.188	18343.88
771.581	17290.47
771.974	17882.71
772.367	20865.77
772.76	24863.4
773.153	29356.19
773.545	34399.96
773.938	38895.17
774.331	41815.12
774.724	42417.07
775.116	42788.44
775.509	40052.96
775.901	36506.79
776.294	31256.71
776.686	26523.62
777.078	22979.88
777.471	21229.85
777.863	22232.29
778.255	25499.33
778.647	31030.97
779.039	37608.75
779.431	43235.05
779.823	48744.84
780.215	53252.19
780.607	54356.58
780.999	55664.85
781.39	53497.34
781.782	49528.83
782.174	44339.43
782.565	38082.05
782.957	31946.04
783.348	27844.03
783.74	25363.41
784.131	25710.5
784.522	28895.02
784.914	33200.91
785.305	39307.8
785.696	45883.15
786.087	50713.32
786.478	53842.01
786.869	54621.15
787.26	53077.43
787.651	50293.41
788.042	46021.5
788.433	39472.85
788.823	33300.43
789.214	27191.11
789.605	22797.84
789.995	20574.5
790.386	20326.92
790.776	22589.1
791.167	25960.51
791.557	31756.71
791.948	37783.51
792.338	43346.7
792.728	48261.82
793.118	49834.66
793.508	49572.52
793.898	47773.95
794.288	44538.47
794.678	39654.89
795.068	33912.09
795.458	27591.6
795.848	23783.29
796.238	21251.7
796.627	20819.65
797.017	22188.6
797.406	26254.2
797.796	30567.37
798.185	36315.04
798.575	42137.94
798.964	47138.02
799.354	50502.15
799.743	51191.48
800.132	50091.95
800.521	47084.62
800.91	42754.46
801.299	36203.38
801.688	31174.18
802.077	25033.31
802.466	21581.8
802.855	19127.88
803.244	18552.62
803.633	20358.48
804.021	23688.63
804.41	28011.51
804.799	32664.49
805.187	36281.06
805.576	39618.49
805.964	41370.94
806.352	39662.18
806.741	38987.41
807.129	35453.37
807.517	31625.64
807.905	27161.98
808.293	22652.2
808.681	18834.18
809.069	15999.19
809.457	15263.74
809.845	15552.58
810.233	17477.37
810.621	21123.05
811.009	25033.31
811.396	30084.36
811.784	34955.79
812.171	37805.35
812.559	40157.33
812.946	39909.75
813.334	38171.86
813.721	34856.28
814.108	29839.21
814.496	25526.03
814.883	20724.99
815.27	17732.22
815.657	14807.42
816.044	13474.88
816.431	13011.28
816.818	14343.82
817.205	16724.93
817.592	20877.9
817.979	24591.55
818.365	28043.06
818.752	29591.63
819.139	31450.88
819.525	31885.36
819.912	30824.66
820.298	28528.51
820.685	25004.18
821.071	21676.46
821.457	18382.72
821.843	14644.8
822.23	11727.28
822.616	9693.26
823.002	8477.23
823.388	8659.27
823.774	9554.91
824.16	11035.52
824.546	13618.08
824.931	15574.42
825.317	17159.4
825.703	19064.77
826.089	19724.97
826.474	20006.53
826.86	19123.02
827.245	17639.99
827.631	15717.63
828.016	13287.98
828.401	11074.35
828.787	8797.62
829.172	6962.64
829.557	6120.39
829.942	5668.93
830.327	5877.67
830.712	6843.7
831.097	7834.01
831.482	9591.32
831.867	11067.07
832.252	12210.29
832.636	13406.91
833.021	13911.78
833.406	13974.88
833.79	13329.24
834.175	12069.51
834.559	10741.82
834.944	9307.34
835.328	7462.65
835.713	6059.71
836.097	4853.38
836.481	3940.75
836.865	3816.96
837.249	3630.06
837.633	4025.7
838.017	4761.15
838.401	5729.61
838.785	6416.51
839.169	7249.05
839.553	7698.09
839.937	7741.78
840.32	7814.59
840.704	7584.01
841.087	6821.86
841.471	5906.8
841.854	5205.33
842.238	4261.14
842.621	3547.54
843.004	2894.61
843.388	2312.08
843.771	2008.68
844.154	2105.77
844.537	2147.03
844.92	2625.19
845.303	3040.25
845.686	3571.81
846.069	4217.45
846.452	4566.97
846.834	4882.51
847.217	5035.42
847.6	4952.9
847.982	4600.95
848.365	4321.82
848.748	3904.34
849.13	3263.55
849.512	2778.11
849.895	2341.21
850.277	1848.48
850.659	1542.65
851.041	1409.15
851.423	1426.14
851.806	1542.65
852.188	1731.97
852.57	2037.8
852.951	2503.83
853.333	2664.03
853.715	2994.13
854.097	2962.58
854.479	3052.38
854.86	3149.47
855.242	2960.15
855.623	2525.68
856.005	2338.78
856.386	2020.81
856.768	1697.99
857.149	1411.58
857.53	1147.01
857.911	950.41
858.292	967.4
858.674	848.47
859.055	887.3
859.436	996.53
859.817	1113.03
860.197	1387.31
860.578	1406.73
860.959	1450.42
861.34	1518.38
861.72	1484.4
862.101	1518.38
862.482	1387.31
862.862	1394.59
863.243	1316.92
863.623	1045.07
864.003	930.99
864.384	838.76
864.764	697.98
865.144	528.07
865.524	583.9
865.904	523.22
866.284	535.35
866.664	634.87
867.044	695.55
867.424	714.97
867.804	831.48
868.183	938.27
868.563	831.48
868.943	914
869.322	795.07
869.702	884.87
870.081	770.79
870.461	656.72
870.84	627.59
871.22	649.43
871.599	472.25
871.978	460.11
872.357	372.73
872.736	406.71
873.115	324.19
873.494	387.29
873.873	406.71
874.252	365.45
874.631	302.34
875.01	372.73
875.388	411.57
875.767	455.26
876.146	397
876.524	435.84
876.903	370.3
877.281	428.56
877.66	404.28
878.038	394.58
878.416	329.04
878.794	360.59
879.173	256.22
879.551	319.33
879.929	193.12
880.307	244.09
880.685	154.28
881.063	229.52
881.441	205.25
881.818	258.65
882.196	258.65
882.574	275.64
882.951	275.64
883.329	227.1
883.707	312.05
884.084	307.2
884.461	270.79
884.839	214.96
885.216	290.2
885.593	222.24
885.971	261.08
886.348	227.1
886.725	222.24
887.102	251.37
887.479	270.79
887.856	273.21
888.233	265.93
888.609	200.4
888.986	239.23
889.363	188.26
889.74	144.57
890.116	159.13
890.493	88.75
890.869	176.13
891.246	207.68
891.622	207.68
891.998	173.7
892.375	139.72
892.751	217.39
893.127	173.7
893.503	134.86
893.879	210.11
894.255	210.11
894.631	176.13
895.007	117.87
895.383	176.13
895.759	151.85
896.134	144.57
896.51	163.99
896.886	132.44
897.261	142.14
897.637	217.39
898.012	125.15
898.388	125.15
898.763	117.87
899.138	147
899.514	96.03
899.889	156.71
900.264	188.26
900.639	139.72
901.014	205.25
901.389	185.83
901.764	156.71
902.139	195.54
902.513	154.28
902.888	132.44
903.263	137.29
903.638	79.04
904.012	190.69
904.387	100.88
904.761	110.59
905.136	117.87
905.51	200.4
905.884	134.86
906.259	171.27
906.633	110.59
907.007	144.57
907.381	197.97
907.755	122.73
908.129	122.73
908.503	205.25
908.877	147
909.251	183.41
909.624	88.75
909.998	132.44
910.372	180.98
910.745	144.57
911.119	130.01
911.492	188.26
911.866	163.99
912.239	105.74
912.612	144.57
912.986	120.3
913.359	134.86
913.732	127.58
914.105	125.15
914.478	125.15
914.851	183.41
915.224	100.88
915.597	137.29
915.97	57.19
916.343	154.28
916.715	173.7
917.088	117.87
917.461	127.58
917.833	113.02
918.206	151.85
918.578	178.55
918.951	190.69
919.323	149.43
919.695	113.02
920.067	64.47
920.44	45.06
920.812	120.3
921.184	113.02
921.556	161.56
921.928	110.59
922.3	88.75
922.672	93.6
923.043	93.6
923.415	120.3
923.787	161.56
924.158	217.39
924.53	142.14
924.901	217.39
925.273	117.87
925.644	98.45
926.016	113.02
926.387	130.01
926.758	163.99
927.129	134.86
927.5	117.87
927.872	193.12
928.243	168.84
928.613	100.88
928.984	130.01
929.355	147
929.726	163.99
930.097	120.3
930.467	132.44
930.838	193.12
931.209	195.54
931.579	130.01
931.95	74.18
932.32	156.71
932.69	166.42
933.061	81.46
933.431	180.98
933.801	149.43
934.171	139.72
934.541	154.28
934.911	168.84
935.281	139.72
935.651	93.6
936.021	100.88
936.391	125.15
936.761	137.29
937.13	171.27
937.5	66.9
937.87	190.69
938.239	142.14
938.609	173.7
938.978	120.3
939.347	142.14
939.717	149.43
940.086	86.32
940.455	173.7
940.824	132.44
941.193	161.56
941.562	231.95
941.931	127.58
942.3	142.14
942.669	176.13
943.038	113.02
943.407	93.6
943.775	134.86
944.144	132.44
944.513	227.1
944.881	120.3
945.25	103.31
945.618	105.74
945.986	105.74
946.355	115.44
946.723	120.3
947.091	96.03
947.459	98.45
947.827	205.25
948.195	110.59
948.563	122.73
948.931	147
949.299	151.85
949.667	227.1
950.035	139.72
950.402	62.05
950.77	127.58
951.138	117.87
951.505	193.12
951.873	120.3
952.24	139.72
952.607	125.15
952.975	139.72
953.342	71.75
953.709	147
954.076	120.3
954.443	130.01
954.81	142.14
955.177	139.72
955.544	110.59
955.911	183.41
956.278	200.4
956.645	151.85
957.012	108.16
957.378	144.57
957.745	100.88
958.111	132.44
958.478	120.3
958.844	110.59
959.211	171.27
959.577	161.56
959.943	74.18
960.309	98.45
960.675	139.72
961.042	139.72
961.408	178.55
961.774	171.27
962.139	96.03
962.505	139.72
962.871	100.88
963.237	100.88
963.603	149.43
963.968	147
964.334	139.72
964.699	151.85
965.065	149.43
965.43	193.12
965.796	115.44
966.161	132.44
966.526	183.41
966.891	96.03
967.256	149.43
967.622	163.99
967.987	120.3
968.352	142.14
968.716	163.99
969.081	125.15
969.446	127.58
969.811	120.3
970.176	125.15
970.54	134.86
970.905	49.91
971.269	147
971.634	91.17
971.998	108.16
972.363	190.69
972.727	81.46
973.091	156.71
973.455	185.83
973.819	127.58
974.183	103.31
974.547	120.3
974.911	163.99
975.275	110.59
975.639	130.01
976.003	180.98
976.367	142.14
976.73	176.13
977.094	166.42
977.458	132.44
977.821	149.43
978.185	69.33
978.548	93.6
978.911	190.69
979.275	180.98
979.638	159.13
980.001	132.44
980.364	149.43
980.727	149.43
981.09	125.15
981.453	205.25
981.816	100.88
982.179	200.4
982.542	100.88
982.905	42.63
983.267	86.32
983.63	227.1
983.992	144.57
984.355	79.04
984.717	125.15
985.08	154.28
985.442	81.46
985.804	142.14
986.167	149.43
986.529	163.99
986.891	154.28
987.253	183.41
987.615	147
987.977	168.84
988.339	134.86
988.701	190.69
989.062	108.16
989.424	171.27
989.786	45.06
990.147	156.71
990.509	166.42
990.87	202.82
991.232	188.26
991.593	168.84
991.955	168.84
992.316	74.18
992.677	130.01
993.038	91.17
993.399	86.32
993.76	98.45
994.121	134.86
994.482	151.85
994.843	200.4
995.204	142.14
995.565	142.14
995.926	117.87
996.286	115.44
996.647	113.02
997.007	163.99
997.368	120.3
997.728	137.29
998.089	151.85
998.449	173.7
998.809	127.58
999.169	151.85
999.53	115.44
999.89	74.18
1000.25	173.7
1000.61	134.86
1000.97	132.44
1001.329	130.01
1001.689	100.88
1002.049	219.82
1002.409	144.57
1002.768	137.29
1003.128	100.88
1003.487	93.6
1003.847	161.56
1004.206	195.54
1004.566	207.68
1004.925	86.32
1005.284	125.15
1005.643	100.88
1006.003	180.98
1006.362	147
1006.721	176.13
1007.08	127.58
1007.438	115.44
1007.797	137.29
1008.156	144.57
1008.515	110.59
1008.874	117.87
1009.232	120.3
1009.591	113.02
1009.949	86.32
1010.308	171.27
1010.666	163.99
1011.024	117.87
1011.383	197.97
1011.741	93.6
1012.099	117.87
1012.457	117.87
1012.815	212.53
1013.173	127.58
1013.531	168.84
1013.889	115.44
1014.247	127.58
1014.605	100.88
1014.962	149.43
1015.32	132.44
1015.678	137.29
1016.035	110.59
1016.393	139.72
1016.75	178.55
1017.107	103.31
1017.465	23.21
1017.822	122.73
1018.179	120.3
1018.536	105.74
1018.894	105.74
1019.251	117.87
1019.608	127.58
1019.964	86.32
1020.321	96.03
1020.678	149.43
1021.035	207.68
1021.392	149.43
1021.748	202.82
1022.105	159.13
1022.461	93.6
1022.818	117.87
1023.174	127.58
1023.531	180.98
1023.887	127.58
1024.243	110.59
1024.599	134.86
1024.955	163.99
1025.311	154.28
1025.667	86.32
1026.023	100.88
1026.379	125.15
1026.735	88.75
1027.091	156.71
1027.447	125.15
