189.514	73.12
189.973	73.12
190.431	73.12
190.889	19.72
191.348	-65.23
191.806	2.73
192.264	31.86
192.722	5.16
193.18	-55.52
193.638	-45.81
194.096	14.87
194.554	-50.67
195.012	75.55
195.47	-55.52
195.928	5.16
196.385	36.71
196.843	-74.94
197.301	-2.12
197.758	24.58
198.216	39.14
198.674	27
199.131	24.58
199.589	102.25
200.046	41.57
200.503	65.84
200.961	75.55
201.418	51.28
201.875	94.97
202.332	143.51
202.79	160.5
203.247	102.25
203.704	133.8
204.161	60.98
204.618	119.24
205.075	119.24
205.532	102.25
205.989	121.66
206.445	87.68
206.902	114.38
207.359	158.07
207.816	153.22
208.272	158.07
208.729	92.54
209.185	97.39
209.642	150.79
210.098	150.79
210.555	179.92
211.011	184.77
211.467	153.22
211.924	165.35
212.38	155.65
212.836	121.66
213.292	109.53
213.748	53.7
214.204	194.48
214.66	133.8
215.116	204.19
215.572	138.66
216.028	116.81
216.484	194.48
216.94	196.91
217.396	94.97
217.851	116.81
218.307	53.7
218.763	114.38
219.218	143.51
219.674	153.22
220.129	116.81
220.585	92.54
221.04	136.23
221.496	133.8
221.951	128.95
222.406	177.49
222.861	138.66
223.317	167.78
223.772	63.41
224.227	165.35
224.682	111.96
225.137	192.05
225.592	167.78
226.047	150.79
226.502	184.77
226.957	141.08
227.411	179.92
227.866	85.26
228.321	150.79
228.776	179.92
229.23	124.09
229.685	85.26
230.139	133.8
230.594	141.08
231.048	184.77
231.503	143.51
231.957	148.36
232.411	102.25
232.865	111.96
233.32	162.93
233.774	226.04
234.228	126.52
234.682	107.1
235.136	94.97
235.59	109.53
236.044	116.81
236.498	119.24
236.952	87.68
237.406	143.51
237.86	136.23
238.313	126.52
238.767	177.49
239.221	141.08
239.674	136.23
240.128	158.07
240.581	87.68
241.035	179.92
241.488	109.53
241.942	172.64
242.395	80.4
242.848	138.66
243.301	107.1
243.755	121.66
244.208	63.41
244.661	177.49
245.114	70.69
245.567	82.83
246.02	133.8
246.473	143.51
246.926	184.77
247.379	121.66
247.832	177.49
248.284	85.26
248.737	119.24
249.19	82.83
249.642	94.97
250.095	94.97
250.547	182.35
251	175.06
251.452	153.22
251.905	145.94
252.357	97.39
252.81	87.68
253.262	119.24
253.714	170.21
254.166	184.77
254.618	114.38
255.07	126.52
255.523	141.08
255.975	141.08
256.427	97.39
256.878	111.96
257.33	160.5
257.782	114.38
258.234	131.37
258.686	189.63
259.137	158.07
259.589	153.22
260.041	175.06
260.492	124.09
260.944	116.81
261.395	87.68
261.847	175.06
262.298	167.78
262.749	226.04
263.201	150.79
263.652	111.96
264.103	119.24
264.554	131.37
265.005	153.22
265.457	133.8
265.908	114.38
266.359	170.21
266.809	165.35
267.26	124.09
267.711	204.19
268.162	124.09
268.613	172.64
269.064	94.97
269.514	43.99
269.965	189.63
270.415	172.64
270.866	153.22
271.316	172.64
271.767	99.82
272.217	109.53
272.668	175.06
273.118	172.64
273.568	116.81
274.019	128.95
274.469	138.66
274.919	182.35
275.369	116.81
275.819	119.24
276.269	136.23
276.719	73.12
277.169	124.09
277.619	73.12
278.069	119.24
278.518	192.05
278.968	109.53
279.418	184.77
279.867	107.1
280.317	114.38
280.767	131.37
281.216	175.06
281.666	226.04
282.115	136.23
282.564	99.82
283.014	148.36
283.463	94.97
283.912	160.5
284.361	172.64
284.811	158.07
285.26	121.66
285.709	116.81
286.158	150.79
286.607	165.35
287.056	97.39
287.505	240.6
287.953	138.66
288.402	167.78
288.851	153.22
289.3	99.82
289.748	201.76
290.197	175.06
290.646	148.36
291.094	114.38
291.543	177.49
291.991	138.66
292.439	150.79
292.888	124.09
293.336	131.37
293.784	150.79
294.233	150.79
294.681	107.1
295.129	145.94
295.577	172.64
296.025	155.65
296.473	119.24
296.921	167.78
297.369	145.94
297.817	73.12
298.264	136.23
298.712	114.38
299.16	189.63
299.608	189.63
300.055	97.39
300.503	192.05
300.95	182.35
301.398	87.68
301.845	119.24
302.293	141.08
302.74	133.8
303.187	213.9
303.635	172.64
304.082	138.66
304.529	213.9
304.976	114.38
305.423	65.84
305.87	165.35
306.317	141.08
306.764	75.55
307.211	148.36
307.658	175.06
308.105	201.76
308.552	160.5
308.998	158.07
309.445	233.32
309.892	189.63
310.338	119.24
310.785	187.2
311.231	184.77
311.678	175.06
312.124	111.96
312.571	148.36
313.017	133.8
313.463	167.78
313.909	158.07
314.356	148.36
314.802	155.65
315.248	177.49
315.694	141.08
316.14	167.78
316.586	111.96
317.032	184.77
317.478	126.52
317.923	104.67
318.369	85.26
318.815	153.22
319.261	148.36
319.706	99.82
320.152	121.66
320.597	153.22
321.043	158.07
321.488	238.17
321.934	126.52
322.379	128.95
322.824	155.65
323.27	167.78
323.715	153.22
324.16	141.08
324.605	90.11
325.05	114.38
325.495	153.22
325.94	150.79
326.385	165.35
326.83	138.66
327.275	155.65
327.72	165.35
328.165	131.37
328.61	165.35
329.054	170.21
329.499	131.37
329.943	131.37
330.388	165.35
330.832	126.52
331.277	158.07
331.721	128.95
332.166	162.93
332.61	133.8
333.054	126.52
333.499	87.68
333.943	126.52
334.387	141.08
334.831	184.77
335.275	167.78
335.719	116.81
336.163	136.23
336.607	121.66
337.051	141.08
337.495	126.52
337.938	121.66
338.382	192.05
338.826	109.53
339.269	104.67
339.713	148.36
340.157	153.22
340.6	160.5
341.044	138.66
341.487	177.49
341.93	192.05
342.374	209.04
342.817	126.52
343.26	138.66
343.703	170.21
344.146	143.51
344.59	102.25
345.033	73.12
345.476	143.51
345.919	111.96
346.361	184.77
346.804	143.51
347.247	109.53
347.69	124.09
348.133	116.81
348.575	111.96
349.018	143.51
349.461	175.06
349.903	179.92
350.346	114.38
350.788	114.38
351.23	65.84
351.673	131.37
352.115	133.8
352.557	153.22
353	109.53
353.442	116.81
353.884	172.64
354.326	196.91
354.768	182.35
355.21	141.08
355.652	172.64
356.094	162.93
356.536	124.09
356.978	107.1
357.419	150.79
357.861	213.9
358.303	136.23
358.744	104.67
359.186	87.68
359.627	192.05
360.069	196.91
360.51	175.06
360.952	148.36
361.393	121.66
361.834	155.65
362.276	150.79
362.717	131.37
363.158	97.39
363.599	179.92
364.04	77.97
364.481	107.1
364.922	167.78
365.363	175.06
365.804	145.94
366.245	133.8
366.686	126.52
367.126	216.33
367.567	160.5
368.008	141.08
368.448	97.39
368.889	153.22
369.33	107.1
369.77	167.78
370.21	141.08
370.651	177.49
371.091	114.38
371.531	182.35
371.972	148.36
372.412	194.48
372.852	143.51
373.292	92.54
373.732	196.91
374.172	150.79
374.612	143.51
375.052	107.1
375.492	136.23
375.932	131.37
376.372	99.82
376.811	165.35
377.251	136.23
377.691	145.94
378.13	153.22
378.57	179.92
379.009	104.67
379.449	114.38
379.888	182.35
380.328	170.21
380.767	141.08
381.206	126.52
381.645	136.23
382.085	126.52
382.524	192.05
382.963	165.35
383.402	138.66
383.841	184.77
384.28	136.23
384.719	175.06
385.158	116.81
385.596	85.26
386.035	172.64
386.474	104.67
386.913	126.52
387.351	148.36
387.79	68.27
388.228	114.38
388.667	90.11
389.105	187.2
389.544	138.66
389.982	114.38
390.42	94.97
390.859	162.93
391.297	184.77
391.735	85.26
392.173	109.53
392.611	162.93
393.049	58.56
393.487	87.68
393.925	121.66
394.363	82.83
394.801	141.08
395.239	143.51
395.676	73.12
396.114	150.79
396.552	138.66
396.989	172.64
397.427	150.79
397.864	94.97
398.302	153.22
398.739	145.94
399.177	99.82
399.614	170.21
400.051	148.36
400.488	162.93
400.926	170.21
401.363	170.21
401.8	131.37
402.237	179.92
402.674	167.78
403.111	165.35
403.548	148.36
403.985	143.51
404.421	177.49
404.858	111.96
405.295	226.04
405.732	170.21
406.168	145.94
406.605	153.22
407.041	119.24
407.478	138.66
407.914	114.38
408.351	148.36
408.787	153.22
409.223	124.09
409.66	141.08
410.096	97.39
410.532	209.04
410.968	121.66
411.404	182.35
411.84	75.55
412.276	230.89
412.712	126.52
413.148	131.37
413.584	114.38
414.02	99.82
414.455	170.21
414.891	82.83
415.327	75.55
415.762	109.53
416.198	170.21
416.633	162.93
417.069	150.79
417.504	143.51
417.94	155.65
418.375	145.94
418.81	114.38
419.245	124.09
419.681	46.42
420.116	119.24
420.551	56.13
420.986	158.07
421.421	192.05
421.856	192.05
422.291	143.51
422.726	158.07
423.16	165.35
423.595	165.35
424.03	172.64
424.464	94.97
424.899	94.97
425.334	124.09
425.768	201.76
426.203	73.12
426.637	184.77
427.071	155.65
427.506	192.05
427.94	172.64
428.374	192.05
428.809	141.08
429.243	187.2
429.677	92.54
430.111	102.25
430.545	167.78
430.979	70.69
431.413	128.95
431.847	111.96
432.28	167.78
432.714	82.83
433.148	80.4
433.582	102.25
434.015	148.36
434.449	104.67
434.882	124.09
435.316	148.36
435.749	99.82
436.183	119.24
436.616	143.51
437.049	162.93
437.483	97.39
437.916	143.51
438.349	136.23
438.782	189.63
439.215	170.21
439.648	150.79
440.081	172.64
440.514	136.23
440.947	158.07
441.38	136.23
441.813	221.18
442.245	172.64
442.678	162.93
443.111	114.38
443.543	131.37
443.976	145.94
444.408	109.53
444.841	184.77
445.273	136.23
445.705	162.93
446.138	109.53
446.57	150.79
447.002	179.92
447.434	121.66
447.867	131.37
448.299	165.35
448.731	179.92
449.163	213.9
449.595	165.35
450.026	153.22
450.458	192.05
450.89	184.77
451.322	133.8
451.754	133.8
452.185	199.34
452.617	153.22
453.048	150.79
453.48	143.51
453.911	80.4
454.343	155.65
454.774	107.1
455.205	133.8
455.637	201.76
456.068	145.94
456.499	228.46
456.93	153.22
457.361	172.64
457.792	63.41
458.223	150.79
458.654	145.94
459.085	182.35
459.516	141.08
459.947	153.22
460.378	206.62
460.808	150.79
461.239	153.22
461.669	82.83
462.1	160.5
462.531	194.48
462.961	145.94
463.391	184.77
463.822	128.95
464.252	94.97
464.682	204.19
465.113	160.5
465.543	124.09
465.973	209.04
466.403	194.48
466.833	133.8
467.263	165.35
467.693	138.66
468.123	97.39
468.553	177.49
468.983	116.81
469.412	87.68
469.842	182.35
470.272	182.35
470.701	155.65
471.131	121.66
471.56	92.54
471.99	138.66
472.419	167.78
472.849	104.67
473.278	143.51
473.707	204.19
474.136	136.23
474.566	175.06
474.995	189.63
475.424	158.07
475.853	170.21
476.282	136.23
476.711	165.35
477.14	143.51
477.569	165.35
477.997	150.79
478.426	126.52
478.855	194.48
479.283	175.06
479.712	170.21
480.141	165.35
480.569	175.06
480.998	216.33
481.426	155.65
481.854	150.79
482.283	133.8
482.711	165.35
483.139	148.36
483.567	141.08
483.995	155.65
484.424	165.35
484.852	148.36
485.28	116.81
485.708	192.05
486.135	153.22
486.563	80.4
486.991	158.07
487.419	82.83
487.847	175.06
488.274	177.49
488.702	172.64
489.129	153.22
489.557	199.34
489.984	182.35
490.412	138.66
490.839	172.64
491.266	131.37
491.694	121.66
492.121	162.93
492.548	187.2
492.975	158.07
493.402	148.36
493.829	145.94
494.256	194.48
494.683	141.08
495.11	221.18
495.537	141.08
495.964	109.53
496.39	165.35
496.817	114.38
497.244	172.64
497.67	99.82
498.097	172.64
498.523	165.35
498.95	218.75
499.376	199.34
499.803	143.51
500.229	136.23
500.655	126.52
501.081	170.21
501.508	148.36
501.934	196.91
502.36	177.49
502.786	145.94
503.212	116.81
503.638	184.77
504.064	150.79
504.489	182.35
504.915	162.93
505.341	75.55
505.767	121.66
506.192	150.79
506.618	187.2
507.043	187.2
507.469	143.51
507.894	213.9
508.32	143.51
508.745	170.21
509.17	162.93
509.596	126.52
510.021	131.37
510.446	148.36
510.871	114.38
511.296	126.52
511.721	109.53
512.146	148.36
512.571	136.23
512.996	121.66
513.421	158.07
513.845	102.25
514.27	124.09
514.695	158.07
515.119	128.95
515.544	145.94
515.969	177.49
516.393	128.95
516.817	177.49
517.242	136.23
517.666	221.18
518.09	107.1
518.515	158.07
518.939	141.08
519.363	301.28
519.787	111.96
520.211	131.37
520.635	87.68
521.059	80.4
521.483	170.21
521.907	85.26
522.331	175.06
522.754	131.37
523.178	136.23
523.602	194.48
524.025	216.33
524.449	175.06
524.872	131.37
525.296	145.94
525.719	133.8
526.143	124.09
526.566	177.49
526.989	116.81
527.412	155.65
527.836	141.08
528.259	128.95
528.682	143.51
529.105	177.49
529.528	233.32
529.951	94.97
530.374	111.96
530.796	131.37
531.219	165.35
531.642	143.51
532.065	177.49
532.487	143.51
532.91	150.79
533.332	99.82
533.755	80.4
534.177	170.21
534.6	109.53
535.022	233.32
535.444	138.66
535.867	226.04
536.289	153.22
536.711	211.47
537.133	150.79
537.555	199.34
537.977	107.1
538.399	184.77
538.821	143.51
539.243	158.07
539.665	145.94
540.086	167.78
540.508	170.21
540.93	213.9
541.351	153.22
541.773	153.22
542.195	177.49
542.616	182.35
543.037	175.06
543.459	136.23
543.88	150.79
544.301	228.46
544.723	172.64
545.144	187.2
545.565	128.95
545.986	131.37
546.407	111.96
546.828	240.6
547.249	141.08
547.67	170.21
548.091	158.07
548.512	155.65
548.932	99.82
549.353	170.21
549.774	160.5
550.194	233.32
550.615	87.68
551.035	128.95
551.456	194.48
551.876	82.83
552.296	131.37
552.717	99.82
553.137	126.52
553.557	124.09
553.977	70.69
554.397	131.37
554.817	87.68
555.237	136.23
555.657	172.64
556.077	143.51
556.497	138.66
556.917	172.64
557.337	155.65
557.756	165.35
558.176	148.36
558.596	158.07
559.015	133.8
559.435	126.52
559.854	192.05
560.274	165.35
560.693	160.5
561.112	150.79
561.532	128.95
561.951	172.64
562.37	143.51
562.789	136.23
563.208	116.81
563.627	70.69
564.046	150.79
564.465	150.79
564.884	128.95
565.303	111.96
565.722	172.64
566.14	138.66
566.559	131.37
566.978	179.92
567.396	160.5
567.815	148.36
568.233	153.22
568.652	170.21
569.07	141.08
569.489	233.32
569.907	218.75
570.325	94.97
570.743	133.8
571.161	187.2
571.58	148.36
571.998	158.07
572.416	150.79
572.833	126.52
573.251	107.1
573.669	177.49
574.087	182.35
574.505	158.07
574.922	136.23
575.34	131.37
575.758	182.35
576.175	119.24
576.593	175.06
577.01	233.32
577.428	150.79
577.845	1585.28
578.262	313.42
578.68	145.94
579.097	141.08
579.514	182.35
579.931	104.67
580.348	155.65
580.765	121.66
581.182	158.07
581.599	160.5
582.016	153.22
582.433	206.62
582.849	141.08
583.266	192.05
583.683	131.37
584.099	206.62
584.516	179.92
584.933	104.67
585.349	138.66
585.765	148.36
586.182	206.62
586.598	126.52
587.014	211.47
587.431	196.91
587.847	199.34
588.263	165.35
588.679	82.83
589.095	172.64
589.511	218.75
589.927	150.79
590.343	143.51
590.759	179.92
591.174	136.23
591.59	192.05
592.006	109.53
592.421	179.92
592.837	141.08
593.252	141.08
593.668	94.97
594.083	189.63
594.499	121.66
594.914	143.51
595.329	80.4
595.745	170.21
596.16	104.67
596.575	194.48
596.99	204.19
597.405	170.21
597.82	136.23
598.235	73.12
598.65	196.91
599.065	167.78
599.479	206.62
599.894	114.38
600.309	155.65
600.724	133.8
601.138	196.91
601.553	85.26
601.967	192.05
602.382	184.77
602.796	145.94
603.21	184.77
603.625	143.51
604.039	145.94
604.453	102.25
604.867	153.22
605.281	170.21
605.695	68.27
606.109	126.52
606.523	150.79
606.937	128.95
607.351	296.42
607.765	158.07
608.178	80.4
608.592	119.24
609.006	245.45
609.419	170.21
609.833	226.04
610.246	179.92
610.66	121.66
611.073	111.96
611.487	119.24
611.9	102.25
612.313	121.66
612.726	114.38
613.139	150.79
613.553	182.35
613.966	201.76
614.379	119.24
614.792	141.08
615.204	150.79
615.617	182.35
616.03	116.81
616.443	107.1
616.856	165.35
617.268	99.82
617.681	189.63
618.093	155.65
618.506	114.38
618.918	177.49
619.331	216.33
619.743	138.66
620.155	194.48
620.568	182.35
620.98	136.23
621.392	136.23
621.804	218.75
622.216	192.05
622.628	177.49
623.04	92.54
623.452	102.25
623.864	150.79
624.276	121.66
624.687	160.5
625.099	204.19
625.511	175.06
625.922	77.97
626.334	167.78
626.745	138.66
627.157	165.35
627.568	126.52
627.979	182.35
628.391	148.36
628.802	119.24
629.213	97.39
629.624	228.46
630.035	73.12
630.446	155.65
630.857	109.53
631.268	172.64
631.679	87.68
632.09	162.93
632.501	143.51
632.912	172.64
633.322	148.36
633.733	177.49
634.144	121.66
634.554	131.37
634.965	143.51
635.375	111.96
635.785	204.19
636.196	138.66
636.606	162.93
637.016	143.51
637.427	82.83
637.837	31.86
638.247	158.07
638.657	94.97
639.067	114.38
639.477	167.78
639.887	155.65
640.297	109.53
640.706	196.91
641.116	199.34
641.526	150.79
641.935	109.53
642.345	189.63
642.755	116.81
643.164	145.94
643.573	133.8
643.983	82.83
644.392	221.18
644.801	228.46
645.211	165.35
645.62	124.09
646.029	162.93
646.438	102.25
646.847	150.79
647.256	58.56
647.665	145.94
648.074	94.97
648.483	114.38
648.892	167.78
649.3	189.63
649.709	184.77
650.118	92.54
650.526	162.93
650.935	82.83
651.343	175.06
651.752	230.89
652.16	209.04
652.568	82.83
652.977	114.38
653.385	158.07
653.793	136.23
654.201	114.38
654.609	150.79
655.017	124.09
655.425	179.92
655.833	128.95
656.241	179.92
656.649	87.68
657.057	143.51
657.464	162.93
657.872	63.41
658.28	145.94
658.687	87.68
659.095	141.08
659.502	155.65
659.91	201.76
660.317	126.52
660.724	160.5
661.132	150.79
661.539	136.23
661.946	136.23
662.353	172.64
662.76	119.24
663.167	80.4
663.574	145.94
663.981	160.5
664.388	104.67
664.795	175.06
665.202	82.83
665.608	29.43
666.015	199.34
666.422	143.51
666.828	107.1
667.235	143.51
667.641	167.78
668.047	213.9
668.454	141.08
668.86	133.8
669.266	111.96
669.673	31.86
670.079	119.24
670.485	187.2
670.891	128.95
671.297	143.51
671.703	170.21
672.109	97.39
672.515	179.92
672.92	153.22
673.326	170.21
673.732	194.48
674.138	114.38
674.543	165.35
674.949	187.2
675.354	170.21
675.76	109.53
676.165	136.23
676.57	177.49
676.976	148.36
677.381	177.49
677.786	51.28
678.191	102.25
678.596	158.07
679.001	155.65
679.406	165.35
679.811	175.06
680.216	116.81
680.621	216.33
681.026	184.77
681.43	155.65
681.835	131.37
682.24	189.63
682.644	165.35
683.049	189.63
683.453	131.37
683.858	70.69
684.262	119.24
684.667	128.95
685.071	175.06
685.475	162.93
685.879	145.94
686.283	148.36
686.687	128.95
687.091	148.36
687.495	155.65
687.899	153.22
688.303	107.1
688.707	150.79
689.111	126.52
689.514	92.54
689.918	218.75
690.322	136.23
690.725	155.65
691.129	94.97
691.532	141.08
691.936	104.67
692.339	131.37
692.742	162.93
693.146	158.07
693.549	160.5
693.952	162.93
694.355	172.64
694.758	131.37
695.161	150.79
695.564	175.06
695.967	141.08
696.37	148.36
696.773	189.63
697.175	102.25
697.578	182.35
697.981	158.07
698.383	192.05
698.786	148.36
699.188	179.92
699.591	175.06
699.993	126.52
700.395	114.38
700.798	165.35
701.2	165.35
701.602	187.2
702.004	230.89
702.406	141.08
702.808	216.33
703.21	162.93
703.612	182.35
704.014	257.59
704.416	255.16
704.818	216.33
705.219	201.76
705.621	155.65
706.023	196.91
706.424	155.65
706.826	209.04
707.227	158.07
707.629	199.34
708.03	199.34
708.431	184.77
708.832	223.61
709.234	257.59
709.635	247.88
710.036	233.32
710.437	177.49
710.838	277.01
711.239	187.2
711.64	240.6
712.041	223.61
712.441	209.04
712.842	226.04
713.243	201.76
713.643	189.63
714.044	277.01
714.445	320.7
714.845	289.14
715.246	216.33
715.646	262.44
716.046	264.87
716.447	284.29
716.847	291.57
717.247	318.27
717.647	296.42
718.047	284.29
718.447	281.86
718.847	277.01
719.247	289.14
719.647	349.82
720.047	303.71
720.446	354.68
720.846	296.42
721.246	374.1
721.645	325.55
722.045	337.69
722.444	434.78
722.844	408.08
723.243	332.83
723.643	393.51
724.042	422.64
724.441	408.08
724.84	361.96
725.24	381.38
725.639	410.5
726.038	412.93
726.437	473.61
726.836	398.37
727.234	517.3
727.633	471.18
728.032	500.31
728.431	432.35
728.83	580.41
729.228	568.27
729.627	653.23
730.025	573.13
730.424	631.38
730.822	653.23
731.22	750.32
731.619	825.56
732.017	917.79
732.415	861.97
732.813	840.12
733.212	934.78
733.61	966.34
734.008	1041.58
734.406	1245.47
734.803	1252.75
735.201	1235.76
735.599	1298.87
735.997	1279.45
736.395	1250.32
736.792	1565.86
737.19	1750.33
737.587	1915.38
737.985	1777.03
738.382	1786.74
738.78	1658.1
739.177	1772.18
739.574	2099.85
739.971	2488.21
740.369	2692.09
740.766	2733.36
741.163	2381.41
741.56	2182.38
741.957	2192.09
742.354	2624.13
742.751	3070.74
743.147	3616.86
743.544	3629
743.941	3386.28
744.338	3177.54
744.734	2980.93
745.131	3090.16
745.527	3709.1
745.924	4570.76
746.32	5133.88
746.716	5090.19
747.113	4468.82
747.509	4097.45
747.905	4080.46
748.301	4959.12
748.697	5927.58
749.093	6959.15
749.489	6968.86
749.885	6573.22
750.281	5961.56
750.677	5587.77
751.073	6184.87
751.468	7398.48
751.864	9284.43
752.26	9655.79
752.655	9335.4
753.051	8383.93
753.446	7573.24
753.842	7619.35
754.237	8859.66
754.632	10549.01
755.028	11760.2
755.423	12129.13
755.818	11061.16
756.213	9874.24
756.608	8903.35
757.003	9354.82
757.398	10842.71
757.793	12898.56
758.188	14223.83
758.583	13636.44
758.977	11961.65
759.372	10505.32
759.767	10638.82
760.161	12417.97
760.556	15202
760.95	17808.83
761.345	19503.03
761.739	18364.67
762.133	16272.4
762.527	14568.49
762.922	14803.93
763.316	17034.55
763.71	20364.7
764.104	22597.74
764.498	23777.37
764.892	22141.42
765.286	19583.13
765.68	17551.55
766.073	18660.79
766.467	21158.4
766.861	25656.04
767.255	28852.69
767.648	28398.8
768.042	25393.9
768.435	22117.15
768.829	20898.69
769.222	21915.69
769.615	25440.02
770.008	29549.31
770.402	31491.08
770.795	30721.66
771.188	28165.79
771.581	24558.94
771.974	22049.19
772.367	23129.3
772.76	27241.02
773.153	30335.73
773.545	32537.22
773.938	31442.54
774.331	28289.58
774.724	24745.83
775.116	24020.09
775.509	25886.63
775.901	32131.87
776.294	36792.14
776.686	39345.58
777.078	38411.1
777.471	34277.54
777.863	31056.61
778.255	29413.38
778.647	31767.79
779.039	37432.92
779.431	42197.56
779.823	44231.57
780.215	42971.85
780.607	37993.61
780.999	34127.05
781.39	31971.67
781.782	34413.46
782.174	39129.55
782.565	45282.56
782.957	46352.97
783.348	46076.26
783.74	41828.62
784.131	35258.13
784.522	33287.23
784.914	34347.93
785.305	38746.05
785.696	43450.01
786.087	46573.84
786.478	44374.78
786.869	39034.89
787.26	33675.58
787.651	30204.66
788.042	30505.63
788.433	33207.13
788.823	36770.29
789.214	39653.83
789.605	38263.03
789.995	34301.81
790.386	29338.14
790.776	26510.42
791.167	26340.52
791.557	30117.28
791.948	34321.23
792.338	38073.71
792.728	40658.7
793.118	37503.31
793.508	33243.54
793.898	28876.97
794.288	28170.64
794.678	30309.03
795.068	35029.97
795.458	38391.68
795.848	40202.39
796.238	39066.45
796.627	34576.08
797.017	29486.2
797.406	27512.87
797.796	28838.13
798.185	32733.82
798.575	37634.38
798.964	39459.66
799.354	39624.71
799.743	35911.06
800.132	31469.24
800.521	27619.67
800.91	27325.97
801.299	29350.27
801.688	34440.16
802.077	37979.05
802.466	38212.06
802.855	36440.19
803.244	31576.04
803.633	27204.61
804.021	24964.28
804.41	25296.81
804.799	28350.26
805.187	31910.99
805.576	33602.77
805.964	32185.27
806.352	27983.75
806.741	24711.85
807.129	21483.65
807.517	20711.79
807.905	23282.22
808.293	26930.33
808.681	29782.32
809.069	30702.24
809.457	30287.18
809.845	26461.88
810.233	22415.7
810.621	20971.5
811.009	21789.48
811.396	24976.42
811.784	28253.17
812.171	30634.28
812.559	30245.92
812.946	27648.79
813.334	23578.34
813.721	20245.76
814.108	18828.27
814.496	20267.61
814.883	23248.24
815.27	26791.98
815.657	28080.84
816.044	27486.17
816.431	24335.63
816.818	20988.49
817.205	18515.15
817.592	17699.61
817.979	19515.17
818.365	22345.31
818.752	24643.89
819.139	24410.88
819.525	22772.5
819.912	19794.3
820.298	16791.83
820.685	14718.98
821.071	14539.36
821.457	15823.37
821.843	17706.89
822.23	19000.6
822.616	18988.46
823.002	17231.15
823.388	14757.81
823.774	12189.81
824.16	10898.53
824.546	10825.71
824.931	12226.22
825.317	13723.82
825.703	15379.18
826.089	15070.93
826.474	13602.46
826.86	11476.21
827.245	9852.4
827.631	8937.34
828.016	9340.25
828.401	10534.45
828.787	12092.72
829.172	12951.96
829.557	12869.44
829.942	10985.91
830.327	9466.47
830.712	8044.12
831.097	7303.82
831.482	7582.95
831.867	8430.05
832.252	9830.55
832.636	10180.07
833.021	10383.96
833.406	9240.74
833.79	7762.56
834.175	6558.66
834.559	5847.48
834.944	6092.63
835.328	7155.75
835.713	7966.45
836.097	8345.09
836.481	8250.43
836.865	7658.19
837.249	6330.5
837.633	5070.77
838.017	4439.69
838.401	4493.09
838.785	4959.12
839.169	5667.87
839.553	6097.49
839.937	5905.74
840.32	5347.47
840.704	4561.05
841.087	3662.98
841.471	3138.7
841.854	3153.27
842.238	3473.66
842.621	3929.98
843.004	4296.49
843.388	4621.73
843.771	4211.53
844.154	3619.29
844.537	2985.79
844.92	2529.47
845.303	2335.29
845.686	2706.66
846.069	3230.94
846.452	3641.14
846.834	3815.9
847.217	3614.44
847.6	3187.25
847.982	2682.38
848.365	2107.13
848.748	1932.37
849.13	2029.46
849.512	2405.68
849.895	2641.12
850.277	2832.87
850.659	2949.38
851.041	2764.91
851.423	2381.41
851.806	1920.24
852.188	1548.87
852.57	1655.67
852.951	1777.03
853.333	2082.86
853.715	2432.38
854.097	2330.44
854.479	2153.25
854.86	1949.36
855.242	1662.95
855.623	1260.03
856.005	1238.19
856.386	1357.12
856.768	1449.36
857.149	1670.23
857.53	1648.39
857.911	1541.59
858.292	1493.05
858.674	1238.19
859.055	1027.02
859.436	927.5
859.817	869.25
860.197	997.89
860.578	1044.01
860.959	1221.2
861.34	1323.14
861.72	1114.4
862.101	1012.46
862.482	844.98
862.862	723.62
863.243	696.92
863.623	684.78
864.003	779.44
864.384	827.99
864.764	934.78
865.144	859.54
865.524	910.51
865.904	699.34
866.284	577.98
866.664	529.44
867.044	473.61
867.424	546.43
867.804	624.1
868.183	747.89
868.563	823.13
868.943	643.52
869.322	592.55
869.702	568.27
870.081	478.47
870.461	473.61
870.84	425.07
871.22	483.32
871.599	476.04
871.978	531.87
872.357	524.58
872.736	500.31
873.115	456.62
873.494	395.94
873.873	451.77
874.252	342.54
874.631	374.1
875.01	361.96
875.388	301.28
875.767	381.38
876.146	417.79
876.524	388.66
876.903	323.12
877.281	369.24
877.66	228.46
878.038	303.71
878.416	284.29
878.794	342.54
879.173	245.45
879.551	235.74
879.929	318.27
880.307	298.85
880.685	277.01
881.063	216.33
881.441	233.32
881.818	240.6
882.196	221.18
882.574	162.93
882.951	196.91
883.329	301.28
883.707	264.87
884.084	213.9
884.461	298.85
884.839	240.6
885.216	250.31
885.593	218.75
885.971	235.74
886.348	194.48
886.725	274.58
887.102	247.88
887.479	226.04
887.856	162.93
888.233	194.48
888.609	187.2
888.986	111.96
889.363	160.5
889.74	204.19
890.116	216.33
890.493	211.47
890.869	165.35
891.246	196.91
891.622	102.25
891.998	170.21
892.375	213.9
892.751	213.9
893.127	167.78
893.503	233.32
893.879	192.05
894.255	250.31
894.631	189.63
895.007	167.78
895.383	189.63
895.759	192.05
896.134	177.49
896.51	170.21
896.886	121.66
897.261	206.62
897.637	177.49
898.012	194.48
898.388	216.33
898.763	153.22
899.138	155.65
899.514	155.65
899.889	128.95
900.264	109.53
900.639	175.06
901.014	158.07
901.389	141.08
901.764	133.8
902.139	194.48
902.513	150.79
902.888	128.95
903.263	90.11
903.638	124.09
904.012	153.22
904.387	175.06
904.761	111.96
905.136	126.52
905.51	160.5
905.884	213.9
906.259	104.67
906.633	187.2
907.007	92.54
907.381	172.64
907.755	143.51
908.129	43.99
908.503	109.53
908.877	128.95
909.251	172.64
909.624	177.49
909.998	70.69
910.372	150.79
910.745	238.17
911.119	148.36
911.492	121.66
911.866	155.65
912.239	187.2
912.612	182.35
912.986	153.22
913.359	138.66
913.732	87.68
914.105	155.65
914.478	99.82
914.851	75.55
915.224	121.66
915.597	138.66
915.97	107.1
916.343	184.77
916.715	138.66
917.088	153.22
917.461	196.91
917.833	182.35
918.206	172.64
918.578	199.34
918.951	167.78
919.323	104.67
919.695	102.25
920.067	133.8
920.44	111.96
920.812	102.25
921.184	148.36
921.556	209.04
921.928	143.51
922.3	124.09
922.672	189.63
923.043	148.36
923.415	102.25
923.787	153.22
924.158	182.35
924.53	126.52
924.901	201.76
925.273	170.21
925.644	143.51
926.016	150.79
926.387	158.07
926.758	165.35
927.129	114.38
927.5	204.19
927.872	153.22
928.243	150.79
928.613	121.66
928.984	187.2
929.355	167.78
929.726	175.06
930.097	111.96
930.467	160.5
930.838	136.23
931.209	116.81
931.579	170.21
931.95	165.35
932.32	148.36
932.69	177.49
933.061	119.24
933.431	107.1
933.801	182.35
934.171	97.39
934.541	109.53
934.911	109.53
935.281	136.23
935.651	107.1
936.021	131.37
936.391	167.78
936.761	167.78
937.13	194.48
937.5	102.25
937.87	48.85
938.239	97.39
938.609	179.92
938.978	124.09
939.347	138.66
939.717	102.25
940.086	75.55
940.455	187.2
940.824	145.94
941.193	143.51
941.562	184.77
941.931	92.54
942.3	148.36
942.669	150.79
943.038	131.37
943.407	182.35
943.775	119.24
944.144	148.36
944.513	119.24
944.881	128.95
945.25	104.67
945.618	226.04
945.986	184.77
946.355	167.78
946.723	150.79
947.091	85.26
947.459	128.95
947.827	179.92
948.195	131.37
948.563	187.2
948.931	85.26
949.299	167.78
949.667	77.97
950.035	138.66
950.402	102.25
950.77	165.35
951.138	177.49
951.505	155.65
951.873	141.08
952.24	148.36
952.607	124.09
952.975	121.66
953.342	80.4
953.709	131.37
954.076	92.54
954.443	48.85
954.81	153.22
955.177	177.49
955.544	187.2
955.911	128.95
956.278	172.64
956.645	124.09
957.012	114.38
957.378	158.07
957.745	124.09
958.111	116.81
958.478	145.94
958.844	119.24
959.211	97.39
959.577	99.82
959.943	126.52
960.309	128.95
960.675	187.2
961.042	65.84
961.408	99.82
961.774	116.81
962.139	145.94
962.505	148.36
962.871	111.96
963.237	136.23
963.603	114.38
963.968	109.53
964.334	97.39
964.699	148.36
965.065	107.1
965.43	116.81
965.796	7.59
966.161	128.95
966.526	90.11
966.891	131.37
967.256	133.8
967.622	148.36
967.987	126.52
968.352	133.8
968.716	107.1
969.081	68.27
969.446	73.12
969.811	131.37
970.176	162.93
970.54	150.79
970.905	73.12
971.269	131.37
971.634	97.39
971.998	128.95
972.363	155.65
972.727	133.8
973.091	170.21
973.455	107.1
973.819	165.35
974.183	116.81
974.547	121.66
974.911	128.95
975.275	143.51
975.639	145.94
976.003	206.62
976.367	109.53
976.73	165.35
977.094	148.36
977.458	150.79
977.821	77.97
978.185	92.54
978.548	133.8
978.911	218.75
979.275	143.51
979.638	177.49
980.001	99.82
980.364	133.8
980.727	111.96
981.09	121.66
981.453	107.1
981.816	211.47
982.179	150.79
982.542	133.8
982.905	133.8
983.267	155.65
983.63	179.92
983.992	204.19
984.355	104.67
984.717	131.37
985.08	109.53
985.442	114.38
985.804	145.94
986.167	162.93
986.529	223.61
986.891	136.23
987.253	119.24
987.615	153.22
987.977	136.23
988.339	150.79
988.701	192.05
989.062	179.92
989.424	92.54
989.786	196.91
990.147	167.78
990.509	165.35
990.87	73.12
991.232	155.65
991.593	31.86
991.955	90.11
992.316	107.1
992.677	90.11
993.038	133.8
993.399	94.97
993.76	158.07
994.121	143.51
994.482	87.68
994.843	116.81
995.204	114.38
995.565	73.12
995.926	114.38
996.286	158.07
996.647	175.06
997.007	111.96
997.368	184.77
997.728	114.38
998.089	160.5
998.449	211.47
998.809	116.81
999.169	119.24
999.53	160.5
999.89	85.26
1000.25	145.94
1000.61	187.2
1000.97	145.94
1001.329	82.83
1001.689	162.93
1002.049	162.93
1002.409	145.94
1002.768	126.52
1003.128	150.79
1003.487	114.38
1003.847	158.07
1004.206	131.37
1004.566	116.81
1004.925	102.25
1005.284	165.35
1005.643	143.51
1006.003	116.81
1006.362	65.84
1006.721	172.64
1007.08	104.67
1007.438	68.27
1007.797	148.36
1008.156	128.95
1008.515	143.51
1008.874	119.24
1009.232	102.25
1009.591	167.78
1009.949	121.66
1010.308	114.38
1010.666	194.48
1011.024	124.09
1011.383	131.37
1011.741	119.24
1012.099	143.51
1012.457	162.93
1012.815	92.54
1013.173	213.9
1013.531	131.37
1013.889	150.79
1014.247	165.35
1014.605	136.23
1014.962	228.46
1015.32	182.35
1015.678	104.67
1016.035	143.51
1016.393	143.51
1016.75	82.83
1017.107	128.95
1017.465	128.95
1017.822	136.23
1018.179	167.78
1018.536	70.69
1018.894	97.39
1019.251	141.08
1019.608	119.24
1019.964	150.79
1020.321	150.79
1020.678	162.93
1021.035	94.97
1021.392	187.2
1021.748	63.41
1022.105	119.24
1022.461	175.06
1022.818	199.34
1023.174	194.48
1023.531	114.38
1023.887	165.35
1024.243	160.5
1024.599	109.53
1024.955	133.8
1025.311	155.65
1025.667	97.39
1026.023	124.09
1026.379	102.25
1026.735	131.37
1027.091	148.36
1027.447	145.94
