189.514	111.35
189.973	111.35
190.431	111.35
190.889	-85.26
191.348	33.68
191.806	19.11
192.264	-60.98
192.722	-29.43
193.18	-10.01
193.638	-60.98
194.096	38.53
194.554	-27
195.012	-0.3
195.47	23.97
195.928	43.39
196.385	-17.29
196.843	-58.56
197.301	40.96
197.758	38.53
198.216	53.1
198.674	-10.01
199.131	36.1
199.589	72.51
200.046	147.76
200.503	99.21
200.961	89.5
201.418	55.52
201.875	108.92
202.332	77.37
202.79	101.64
203.247	28.82
203.704	181.74
204.161	164.75
204.618	118.63
205.075	142.9
205.532	123.48
205.989	157.47
206.445	94.36
206.902	140.48
207.359	174.46
207.816	176.88
208.272	138.05
208.729	184.17
209.185	164.75
209.642	104.07
210.098	155.04
210.555	181.74
211.011	142.9
211.467	157.47
211.924	84.65
212.38	116.2
212.836	130.77
213.292	162.32
213.748	181.74
214.204	106.49
214.66	162.32
215.116	128.34
215.572	164.75
216.028	162.32
216.484	181.74
216.94	147.76
217.396	142.9
217.851	147.76
218.307	213.29
218.763	104.07
219.218	147.76
219.674	96.79
220.129	169.6
220.585	155.04
221.04	87.08
221.496	96.79
221.951	150.18
222.406	113.78
222.861	77.37
223.317	108.92
223.772	106.49
224.227	174.46
224.682	138.05
225.137	74.94
225.592	133.19
226.047	108.92
226.502	125.91
226.957	79.79
227.411	215.72
227.866	108.92
228.321	167.17
228.776	152.61
229.23	164.75
229.685	106.49
230.139	198.73
230.594	138.05
231.048	186.59
231.503	104.07
231.957	125.91
232.411	167.17
232.865	145.33
233.32	159.89
233.774	140.48
234.228	179.31
234.682	184.17
235.136	91.93
235.59	225.43
236.044	174.46
236.498	254.55
236.952	91.93
237.406	196.3
237.86	82.22
238.313	130.77
238.767	150.18
239.221	125.91
239.674	130.77
240.128	193.87
240.581	133.19
241.035	157.47
241.488	150.18
241.942	174.46
242.395	116.2
242.848	82.22
243.301	99.21
243.755	172.03
244.208	164.75
244.661	142.9
245.114	108.92
245.567	150.18
246.02	130.77
246.473	189.02
246.926	140.48
247.379	133.19
247.832	169.6
248.284	223
248.737	133.19
249.19	118.63
249.642	138.05
250.095	186.59
250.547	164.75
251	138.05
251.452	147.76
251.905	159.89
252.357	128.34
252.81	174.46
253.262	162.32
253.714	193.87
254.166	169.6
254.618	130.77
255.07	176.88
255.523	123.48
255.975	67.66
256.427	106.49
256.878	99.21
257.33	67.66
257.782	189.02
258.234	140.48
258.686	157.47
259.137	191.45
259.589	162.32
260.041	106.49
260.492	96.79
260.944	89.5
261.395	142.9
261.847	206.01
262.298	181.74
262.749	138.05
263.201	142.9
263.652	106.49
264.103	140.48
264.554	145.33
265.005	70.09
265.457	181.74
265.908	128.34
266.359	104.07
266.809	133.19
267.26	130.77
267.711	152.61
268.162	162.32
268.613	196.3
269.064	179.31
269.514	172.03
269.965	159.89
270.415	77.37
270.866	113.78
271.316	91.93
271.767	186.59
272.217	223
272.668	164.75
273.118	82.22
273.568	116.2
274.019	121.06
274.469	174.46
274.919	184.17
275.369	147.76
275.819	96.79
276.269	138.05
276.719	164.75
277.169	147.76
277.619	147.76
278.069	208.44
278.518	135.62
278.968	79.79
279.418	147.76
279.867	145.33
280.317	130.77
280.767	164.75
281.216	181.74
281.666	118.63
282.115	108.92
282.564	184.17
283.014	67.66
283.463	94.36
283.912	206.01
284.361	113.78
284.811	113.78
285.26	142.9
285.709	189.02
286.158	232.71
286.607	123.48
287.056	130.77
287.505	135.62
287.953	174.46
288.402	91.93
288.851	169.6
289.3	138.05
289.748	206.01
290.197	138.05
290.646	191.45
291.094	116.2
291.543	176.88
291.991	111.35
292.439	169.6
292.888	111.35
293.336	72.51
293.784	113.78
294.233	189.02
294.681	123.48
295.129	135.62
295.577	106.49
296.025	167.17
296.473	193.87
296.921	176.88
297.369	150.18
297.817	142.9
298.264	123.48
298.712	140.48
299.16	181.74
299.608	169.6
300.055	157.47
300.503	191.45
300.95	125.91
301.398	104.07
301.845	201.16
302.293	159.89
302.74	79.79
303.187	142.9
303.635	108.92
304.082	116.2
304.529	155.04
304.976	184.17
305.423	130.77
305.87	123.48
306.317	113.78
306.764	101.64
307.211	130.77
307.658	113.78
308.105	113.78
308.552	162.32
308.998	53.1
309.445	189.02
309.892	84.65
310.338	157.47
310.785	84.65
311.231	125.91
311.678	252.13
312.124	189.02
312.571	130.77
313.017	172.03
313.463	118.63
313.909	121.06
314.356	138.05
314.802	138.05
315.248	96.79
315.694	108.92
316.14	196.3
316.586	135.62
317.032	189.02
317.478	159.89
317.923	218.15
318.369	101.64
318.815	169.6
319.261	130.77
319.706	116.2
320.152	70.09
320.597	94.36
321.043	169.6
321.488	191.45
321.934	130.77
322.379	152.61
322.824	172.03
323.27	174.46
323.715	210.86
324.16	152.61
324.605	123.48
325.05	169.6
325.495	155.04
325.94	181.74
326.385	116.2
326.83	121.06
327.275	191.45
327.72	152.61
328.165	193.87
328.61	130.77
329.054	176.88
329.499	91.93
329.943	172.03
330.388	91.93
330.832	179.31
331.277	106.49
331.721	193.87
332.166	140.48
332.61	104.07
333.054	130.77
333.499	193.87
333.943	169.6
334.387	145.33
334.831	232.71
335.275	135.62
335.719	147.76
336.163	201.16
336.607	113.78
337.051	142.9
337.495	191.45
337.938	215.72
338.382	133.19
338.826	128.34
339.269	142.9
339.713	128.34
340.157	147.76
340.6	176.88
341.044	196.3
341.487	145.33
341.93	150.18
342.374	189.02
342.817	159.89
343.26	118.63
343.703	118.63
344.146	74.94
344.59	79.79
345.033	128.34
345.476	206.01
345.919	133.19
346.361	94.36
346.804	155.04
347.247	227.86
347.69	167.17
348.133	174.46
348.575	150.18
349.018	135.62
349.461	167.17
349.903	157.47
350.346	130.77
350.788	111.35
351.23	172.03
351.673	142.9
352.115	104.07
352.557	128.34
353	179.31
353.442	125.91
353.884	164.75
354.326	113.78
354.768	108.92
355.21	99.21
355.652	87.08
356.094	235.14
356.536	159.89
356.978	167.17
357.419	162.32
357.861	157.47
358.303	155.04
358.744	191.45
359.186	184.17
359.627	210.86
360.069	162.32
360.51	118.63
360.952	121.06
361.393	164.75
361.834	167.17
362.276	152.61
362.717	172.03
363.158	218.15
363.599	113.78
364.04	121.06
364.481	142.9
364.922	138.05
365.363	179.31
365.804	135.62
366.245	157.47
366.686	116.2
367.126	145.33
367.567	133.19
368.008	196.3
368.448	232.71
368.889	147.76
369.33	164.75
369.77	239.99
370.21	220.57
370.651	196.3
371.091	145.33
371.531	145.33
371.972	125.91
372.412	123.48
372.852	128.34
373.292	155.04
373.732	84.65
374.172	157.47
374.612	101.64
375.052	123.48
375.492	125.91
375.932	130.77
376.372	176.88
376.811	111.35
377.251	157.47
377.691	118.63
378.13	43.39
378.57	191.45
379.009	164.75
379.449	82.22
379.888	184.17
380.328	169.6
380.767	125.91
381.206	133.19
381.645	123.48
382.085	89.5
382.524	62.8
382.963	111.35
383.402	162.32
383.841	184.17
384.28	164.75
384.719	123.48
385.158	254.55
385.596	133.19
386.035	167.17
386.474	123.48
386.913	104.07
387.351	104.07
387.79	118.63
388.228	169.6
388.667	225.43
389.105	174.46
389.544	155.04
389.982	152.61
390.42	135.62
390.859	130.77
391.297	113.78
391.735	164.75
392.173	60.38
392.611	142.9
393.049	164.75
393.487	123.48
393.925	174.46
394.363	184.17
394.801	125.91
395.239	169.6
395.676	130.77
396.114	155.04
396.552	125.91
396.989	167.17
397.427	155.04
397.864	128.34
398.302	167.17
398.739	138.05
399.177	181.74
399.614	167.17
400.051	172.03
400.488	147.76
400.926	123.48
401.363	111.35
401.8	159.89
402.237	174.46
402.674	116.2
403.111	181.74
403.548	237.56
403.985	108.92
404.421	145.33
404.858	155.04
405.295	206.01
405.732	157.47
406.168	155.04
406.605	123.48
407.041	172.03
407.478	218.15
407.914	162.32
408.351	155.04
408.787	237.56
409.223	147.76
409.66	179.31
410.096	72.51
410.532	91.93
410.968	101.64
411.404	164.75
411.84	218.15
412.276	191.45
412.712	99.21
413.148	206.01
413.584	130.77
414.02	169.6
414.455	77.37
414.891	111.35
415.327	172.03
415.762	96.79
416.198	84.65
416.633	196.3
417.069	145.33
417.504	147.76
417.94	125.91
418.375	121.06
418.81	176.88
419.245	189.02
419.681	169.6
420.116	273.97
420.551	198.73
420.986	142.9
421.421	155.04
421.856	140.48
422.291	172.03
422.726	94.36
423.16	138.05
423.595	167.17
424.03	138.05
424.464	169.6
424.899	135.62
425.334	142.9
425.768	99.21
426.203	106.49
426.637	179.31
427.071	84.65
427.506	155.04
427.94	133.19
428.374	159.89
428.809	145.33
429.243	147.76
429.677	206.01
430.111	133.19
430.545	121.06
430.979	108.92
431.413	179.31
431.847	157.47
432.28	125.91
432.714	213.29
433.148	167.17
433.582	82.22
434.015	239.99
434.449	106.49
434.882	186.59
435.316	218.15
435.749	203.58
436.183	147.76
436.616	193.87
437.049	118.63
437.483	227.86
437.916	113.78
438.349	206.01
438.782	181.74
439.215	121.06
439.648	176.88
440.081	220.57
440.514	147.76
440.947	121.06
441.38	206.01
441.813	210.86
442.245	235.14
442.678	155.04
443.111	164.75
443.543	186.59
443.976	121.06
444.408	138.05
444.841	152.61
445.273	184.17
445.705	135.62
446.138	152.61
446.57	147.76
447.002	201.16
447.434	164.75
447.867	159.89
448.299	269.12
448.731	189.02
449.163	206.01
449.595	201.16
450.026	162.32
450.458	179.31
450.89	181.74
451.322	198.73
451.754	186.59
452.185	147.76
452.617	235.14
453.048	201.16
453.48	176.88
453.911	157.47
454.343	208.44
454.774	159.89
455.205	142.9
455.637	167.17
456.068	208.44
456.499	179.31
456.93	225.43
457.361	162.32
457.792	218.15
458.223	244.85
458.654	269.12
459.085	215.72
459.516	269.12
459.947	164.75
460.378	242.42
460.808	193.87
461.239	157.47
461.669	164.75
462.1	152.61
462.531	184.17
462.961	162.32
463.391	237.56
463.822	167.17
464.252	242.42
464.682	189.02
465.113	203.58
465.543	210.86
465.973	198.73
466.403	106.49
466.833	167.17
467.263	167.17
467.693	210.86
468.123	145.33
468.553	176.88
468.983	174.46
469.412	179.31
469.842	162.32
470.272	172.03
470.701	254.55
471.131	223
471.56	174.46
471.99	108.92
472.419	179.31
472.849	164.75
473.278	94.36
473.707	191.45
474.136	181.74
474.566	155.04
474.995	130.77
475.424	104.07
475.853	249.7
476.282	174.46
476.711	152.61
477.14	167.17
477.569	145.33
477.997	99.21
478.426	140.48
478.855	150.18
479.283	179.31
479.712	201.16
480.141	252.13
480.569	225.43
480.998	181.74
481.426	184.17
481.854	123.48
482.283	145.33
482.711	167.17
483.139	206.01
483.567	106.49
483.995	162.32
484.424	227.86
484.852	140.48
485.28	196.3
485.708	232.71
486.135	193.87
486.563	179.31
486.991	155.04
487.419	237.56
487.847	206.01
488.274	135.62
488.702	145.33
489.129	125.91
489.557	225.43
489.984	203.58
490.412	203.58
490.839	256.98
491.266	196.3
491.694	264.26
492.121	172.03
492.548	150.18
492.975	172.03
493.402	208.44
493.829	208.44
494.256	130.77
494.683	193.87
495.11	106.49
495.537	176.88
495.964	193.87
496.39	223
496.817	174.46
497.244	140.48
497.67	186.59
498.097	167.17
498.523	174.46
498.95	159.89
499.376	157.47
499.803	108.92
500.229	196.3
500.655	164.75
501.081	179.31
501.508	169.6
501.934	121.06
502.36	213.29
502.786	184.17
503.212	179.31
503.638	113.78
504.064	133.19
504.489	111.35
504.915	130.77
505.341	184.17
505.767	159.89
506.192	155.04
506.618	281.25
507.043	142.9
507.469	142.9
507.894	201.16
508.32	79.79
508.745	135.62
509.17	169.6
509.596	172.03
510.021	111.35
510.446	125.91
510.871	196.3
511.296	176.88
511.721	155.04
512.146	172.03
512.571	208.44
512.996	196.3
513.421	242.42
513.845	172.03
514.27	186.59
514.695	94.36
515.119	184.17
515.544	230.28
515.969	164.75
516.393	174.46
516.817	215.72
517.242	196.3
517.666	128.34
518.09	157.47
518.515	201.16
518.939	218.15
519.363	363.78
519.787	172.03
520.211	174.46
520.635	196.3
521.059	162.32
521.483	65.23
521.907	210.86
522.331	150.18
522.754	121.06
523.178	87.08
523.602	162.32
524.025	150.18
524.449	169.6
524.872	203.58
525.296	167.17
525.719	133.19
526.143	259.41
526.566	189.02
526.989	87.08
527.412	174.46
527.836	196.3
528.259	159.89
528.682	121.06
529.105	147.76
529.528	91.93
529.951	140.48
530.374	220.57
530.796	157.47
531.219	196.3
531.642	147.76
532.065	155.04
532.487	111.35
532.91	174.46
533.332	108.92
533.755	193.87
534.177	242.42
534.6	162.32
535.022	138.05
535.444	230.28
535.867	189.02
536.289	142.9
536.711	106.49
537.133	215.72
537.555	189.02
537.977	164.75
538.399	125.91
538.821	113.78
539.243	106.49
539.665	201.16
540.086	203.58
540.508	169.6
540.93	206.01
541.351	164.75
541.773	201.16
542.195	201.16
542.616	184.17
543.037	167.17
543.459	174.46
543.88	138.05
544.301	198.73
544.723	252.13
545.144	174.46
545.565	203.58
545.986	210.86
546.407	152.61
546.828	230.28
547.249	269.12
547.67	203.58
548.091	210.86
548.512	164.75
548.932	159.89
549.353	155.04
549.774	174.46
550.194	266.69
550.615	159.89
551.035	176.88
551.456	167.17
551.876	169.6
552.296	147.76
552.717	164.75
553.137	167.17
553.557	227.86
553.977	140.48
554.397	181.74
554.817	130.77
555.237	159.89
555.657	147.76
556.077	150.18
556.497	167.17
556.917	147.76
557.337	167.17
557.756	210.86
558.176	147.76
558.596	167.17
559.015	174.46
559.435	189.02
559.854	181.74
560.274	169.6
560.693	208.44
561.112	140.48
561.532	193.87
561.951	104.07
562.37	172.03
562.789	191.45
563.208	169.6
563.627	181.74
564.046	191.45
564.465	174.46
564.884	206.01
565.303	181.74
565.722	162.32
566.14	147.76
566.559	121.06
566.978	218.15
567.396	167.17
567.815	164.75
568.233	189.02
568.652	169.6
569.07	94.36
569.489	206.01
569.907	191.45
570.325	174.46
570.743	152.61
571.161	121.06
571.58	125.91
571.998	130.77
572.416	237.56
572.833	159.89
573.251	147.76
573.669	193.87
574.087	121.06
574.505	179.31
574.922	155.04
575.34	225.43
575.758	244.85
576.175	174.46
576.593	138.05
577.01	118.63
577.428	157.47
577.845	1820.11
578.262	346.79
578.68	138.05
579.097	140.48
579.514	174.46
579.931	155.04
580.348	74.94
580.765	150.18
581.182	206.01
581.599	242.42
582.016	249.7
582.433	198.73
582.849	215.72
583.266	138.05
583.683	138.05
584.099	179.31
584.516	138.05
584.933	210.86
585.349	218.15
585.765	189.02
586.182	162.32
586.598	130.77
587.014	99.21
587.431	147.76
587.847	138.05
588.263	198.73
588.679	252.13
589.095	113.78
589.511	155.04
589.927	172.03
590.343	169.6
590.759	191.45
591.174	179.31
591.59	87.08
592.006	172.03
592.421	213.29
592.837	179.31
593.252	218.15
593.668	215.72
594.083	157.47
594.499	121.06
594.914	179.31
595.329	167.17
595.745	162.32
596.16	140.48
596.575	186.59
596.99	186.59
597.405	130.77
597.82	140.48
598.235	193.87
598.65	189.02
599.065	133.19
599.479	133.19
599.894	111.35
600.309	184.17
600.724	108.92
601.138	152.61
601.553	249.7
601.967	181.74
602.382	147.76
602.796	167.17
603.21	174.46
603.625	167.17
604.039	89.5
604.453	230.28
604.867	201.16
605.281	159.89
605.695	135.62
606.109	206.01
606.523	123.48
606.937	244.85
607.351	283.68
607.765	142.9
608.178	106.49
608.592	138.05
609.006	230.28
609.419	186.59
609.833	150.18
610.246	150.18
610.66	172.03
611.073	101.64
611.487	186.59
611.9	152.61
612.313	162.32
612.726	249.7
613.139	164.75
613.553	290.96
613.966	169.6
614.379	164.75
614.792	172.03
615.204	176.88
615.617	208.44
616.03	145.33
616.443	208.44
616.856	218.15
617.268	145.33
617.681	118.63
618.093	196.3
618.506	87.08
618.918	123.48
619.331	145.33
619.743	150.18
620.155	106.49
620.568	169.6
620.98	157.47
621.392	176.88
621.804	186.59
622.216	184.17
622.628	96.79
623.04	256.98
623.452	208.44
623.864	113.78
624.276	113.78
624.687	191.45
625.099	125.91
625.511	159.89
625.922	186.59
626.334	184.17
626.745	150.18
627.157	172.03
627.568	162.32
627.979	167.17
628.391	155.04
628.802	193.87
629.213	162.32
629.624	196.3
630.035	150.18
630.446	174.46
630.857	116.2
631.268	101.64
631.679	108.92
632.09	181.74
632.501	145.33
632.912	118.63
633.322	206.01
633.733	203.58
634.144	150.18
634.554	189.02
634.965	123.48
635.375	198.73
635.785	232.71
636.196	206.01
636.606	152.61
637.016	135.62
637.427	184.17
637.837	174.46
638.247	116.2
638.657	186.59
639.067	133.19
639.477	186.59
639.887	150.18
640.297	135.62
640.706	138.05
641.116	133.19
641.526	203.58
641.935	184.17
642.345	111.35
642.755	74.94
643.164	147.76
643.573	135.62
643.983	133.19
644.392	162.32
644.801	223
645.211	210.86
645.62	159.89
646.029	203.58
646.438	84.65
646.847	142.9
647.256	152.61
647.665	138.05
648.074	142.9
648.483	133.19
648.892	155.04
649.3	169.6
649.709	159.89
650.118	191.45
650.526	70.09
650.935	104.07
651.343	145.33
651.752	118.63
652.16	189.02
652.568	235.14
652.977	174.46
653.385	138.05
653.793	94.36
654.201	155.04
654.609	157.47
655.017	128.34
655.425	174.46
655.833	201.16
656.241	152.61
656.649	145.33
657.057	125.91
657.464	174.46
657.872	218.15
658.28	179.31
658.687	196.3
659.095	96.79
659.502	179.31
659.91	232.71
660.317	104.07
660.724	203.58
661.132	125.91
661.539	242.42
661.946	193.87
662.353	106.49
662.76	145.33
663.167	193.87
663.574	198.73
663.981	176.88
664.388	128.34
664.795	220.57
665.202	174.46
665.608	130.77
666.015	152.61
666.422	150.18
666.828	135.62
667.235	104.07
667.641	181.74
668.047	186.59
668.454	167.17
668.86	176.88
669.266	198.73
669.673	225.43
670.079	184.17
670.485	118.63
670.891	164.75
671.297	172.03
671.703	82.22
672.109	79.79
672.515	108.92
672.92	130.77
673.326	118.63
673.732	242.42
674.138	198.73
674.543	128.34
674.949	198.73
675.354	215.72
675.76	164.75
676.165	174.46
676.57	104.07
676.976	152.61
677.381	152.61
677.786	172.03
678.191	176.88
678.596	104.07
679.001	172.03
679.406	189.02
679.811	174.46
680.216	210.86
680.621	210.86
681.026	186.59
681.43	232.71
681.835	162.32
682.24	244.85
682.644	193.87
683.049	89.5
683.453	181.74
683.858	213.29
684.262	89.5
684.667	155.04
685.071	155.04
685.475	150.18
685.879	72.51
686.283	164.75
686.687	191.45
687.091	201.16
687.495	135.62
687.899	191.45
688.303	184.17
688.707	130.77
689.111	145.33
689.514	108.92
689.918	172.03
690.322	196.3
690.725	196.3
691.129	89.5
691.532	169.6
691.936	159.89
692.339	116.2
692.742	176.88
693.146	150.18
693.549	232.71
693.952	135.62
694.355	206.01
694.758	77.37
695.161	104.07
695.564	150.18
695.967	176.88
696.37	220.57
696.773	193.87
697.175	145.33
697.578	123.48
697.981	159.89
698.383	167.17
698.786	142.9
699.188	147.76
699.591	70.09
699.993	108.92
700.395	99.21
700.798	116.2
701.2	191.45
701.602	208.44
702.004	206.01
702.406	147.76
702.808	135.62
703.21	128.34
703.612	167.17
704.014	230.28
704.416	196.3
704.818	218.15
705.219	172.03
705.621	191.45
706.023	179.31
706.424	249.7
706.826	203.58
707.227	208.44
707.629	266.69
708.03	261.84
708.431	142.9
708.832	237.56
709.234	157.47
709.635	184.17
710.036	184.17
710.437	227.86
710.838	196.3
711.239	147.76
711.64	218.15
712.041	176.88
712.441	232.71
712.842	208.44
713.243	138.05
713.643	261.84
714.044	169.6
714.445	215.72
714.845	133.19
715.246	215.72
715.646	164.75
716.046	189.02
716.447	176.88
716.847	198.73
717.247	174.46
717.647	169.6
718.047	227.86
718.447	230.28
718.847	206.01
719.247	210.86
719.647	244.85
720.047	186.59
720.446	172.03
720.846	193.87
721.246	271.55
721.645	242.42
722.045	169.6
722.444	210.86
722.844	235.14
723.243	264.26
723.643	232.71
724.042	281.25
724.441	269.12
724.84	261.84
725.24	215.72
725.639	230.28
726.038	283.68
726.437	295.82
726.836	281.25
727.234	290.96
727.633	303.1
728.032	317.66
728.431	312.81
728.83	312.81
729.228	303.1
729.627	344.36
730.025	305.53
730.424	337.08
730.822	424.46
731.22	373.49
731.619	422.03
732.017	400.19
732.415	521.55
732.813	475.43
733.212	516.69
733.61	460.87
734.008	528.83
734.406	550.68
734.803	616.21
735.201	497.28
735.599	628.35
735.997	684.17
736.395	723.01
736.792	686.6
737.19	790.97
737.587	824.95
737.985	861.36
738.382	902.62
738.78	931.75
739.177	973.01
739.574	1019.13
739.971	1096.8
740.369	1077.38
740.766	1104.08
741.163	1096.8
741.56	1138.06
741.957	1193.89
742.354	1242.43
742.751	1215.73
743.147	1463.31
743.544	1470.59
743.941	1570.11
744.338	1613.8
744.734	1708.46
745.131	1781.28
745.527	1783.7
745.924	1985.16
746.32	2106.53
746.716	2055.55
747.113	2099.24
747.509	2303.13
747.905	2232.74
748.301	2305.56
748.697	2305.56
749.093	2533.72
749.489	2584.69
749.885	2735.18
750.281	2965.76
750.677	2997.32
751.073	3210.91
751.468	3545.87
751.864	3693.93
752.26	3919.66
752.655	4024.03
753.051	4106.56
753.446	4354.13
753.842	4400.25
754.237	4451.22
754.632	4592
755.028	4664.82
755.423	4640.55
755.818	4567.73
756.213	4647.83
756.608	4715.79
757.003	4531.32
757.398	4686.66
757.793	4868.7
758.188	4693.94
758.583	5004.63
758.977	5053.17
759.372	5395.41
759.767	5817.75
760.161	5992.51
760.556	6589.6
760.95	7189.13
761.345	7380.88
761.739	7754.67
762.133	7994.97
762.527	8492.55
762.922	8754.69
763.316	9116.34
763.71	9274.11
764.104	9126.05
764.498	9504.7
764.892	9463.44
765.286	9645.48
765.68	9662.47
766.073	9871.21
766.467	9478
766.861	9730.43
767.255	9626.06
767.648	10116.36
768.042	9956.16
768.435	9990.14
768.829	9863.93
769.222	10138.2
769.615	10291.12
770.008	10160.05
770.402	9963.44
770.795	10223.16
771.188	10502.29
771.581	10538.7
771.974	10427.04
772.367	10859.09
772.76	11082.39
773.153	10863.94
773.545	10912.49
773.938	11254.73
774.331	11754.73
774.724	12038.72
775.116	12781.45
775.509	13339.71
775.901	14002.34
776.294	14388.27
776.686	14512.06
777.078	15296.05
777.471	15597.03
777.863	16398.01
778.255	17640.75
778.647	17514.53
779.039	18012.11
779.431	17652.88
779.823	17995.12
780.215	18179.59
780.607	17953.86
780.999	18929.6
781.39	18725.72
781.782	18713.58
782.174	19101.94
782.565	19410.19
782.957	19201.45
783.348	19565.53
783.74	19565.53
784.131	18975.72
784.522	19582.53
784.914	19109.22
785.305	18728.14
785.696	18691.73
786.087	18555.81
786.478	18373.77
786.869	17674.73
787.26	17286.37
787.651	16648.01
788.042	17043.65
788.433	16444.13
788.823	15951.4
789.214	15844.6
789.605	15395.57
789.995	15245.08
790.386	15004.78
790.776	14980.51
791.167	14451.38
791.557	14978.08
791.948	14919.83
792.338	15461.1
792.728	15747.51
793.118	15681.98
793.508	15458.67
793.898	15885.87
794.288	15732.95
794.678	15769.36
795.068	16075.19
795.458	15616.44
795.848	15616.44
796.238	15783.92
796.627	15711.11
797.017	15514.5
797.406	15854.31
797.796	15713.53
798.185	15948.97
798.575	15769.36
798.964	15723.24
799.354	15762.08
799.743	16063.05
800.132	16014.51
800.521	15832.47
800.91	15871.3
801.299	15684.41
801.688	15480.52
802.077	15296.05
802.466	15252.36
802.855	15257.22
803.244	14667.4
803.633	14412.54
804.021	13762.05
804.41	13281.46
804.799	13322.72
805.187	12931.94
805.576	12512.03
805.964	12072.7
806.352	11715.9
806.741	11555.7
807.129	11213.46
807.517	11235.31
807.905	11121.23
808.293	10978.02
808.681	10922.2
809.069	10672.19
809.457	11038.7
809.845	10621.22
810.233	10664.91
810.621	10645.49
811.009	10521.7
811.396	10393.06
811.784	10390.63
812.171	10400.34
812.559	10077.52
812.946	10087.23
813.334	9803.25
813.721	9567.81
814.108	9427.03
814.496	9555.67
814.883	9240.13
815.27	9856.65
815.657	9946.45
816.044	9718.29
816.431	9888.2
816.818	9669.75
817.205	9706.16
817.592	10062.96
817.979	9531.4
818.365	9470.72
818.752	9278.97
819.139	9150.32
819.525	9160.03
819.912	9067.8
820.298	8856.63
820.685	8761.97
821.071	8545.95
821.457	8135.75
821.843	7987.68
822.23	7443.99
822.616	7410.01
823.002	6987.67
823.388	6657.57
823.774	6278.92
824.16	5854.16
824.546	5698.81
824.931	5601.73
825.317	5419.68
825.703	5395.41
826.089	5062.88
826.474	5092.01
826.86	4817.73
827.245	4859
827.631	4764.33
828.016	4599.28
828.401	4681.81
828.787	4526.47
829.172	4485.2
829.557	4298.31
829.942	4334.72
830.327	4322.58
830.712	4448.79
831.097	4361.41
831.482	4400.25
831.867	4133.26
832.252	4210.93
832.636	4172.09
833.021	3997.33
833.406	4033.74
833.79	3975.49
834.175	3985.2
834.559	3815.29
834.944	3691.5
835.328	3422.08
835.713	3354.12
836.097	3091.98
836.481	2994.89
836.865	2822.56
837.249	2710.9
837.633	2545.85
838.017	2470.61
838.401	2405.07
838.785	2184.2
839.169	2135.65
839.553	2096.82
839.937	1987.59
840.32	2053.13
840.704	2038.56
841.087	1958.46
841.471	1939.05
841.854	1888.08
842.238	1960.89
842.621	1980.31
843.004	1810.4
843.388	1815.26
843.771	1766.71
844.154	1803.12
844.537	1710.89
844.92	1618.65
845.303	1662.34
845.686	1577.39
846.069	1446.32
846.452	1443.89
846.834	1349.23
847.217	1436.61
847.6	1206.03
847.982	1208.45
848.365	1193.89
848.748	1096.8
849.13	1215.73
849.512	1101.66
849.895	1140.49
850.277	1145.35
850.659	1084.66
851.041	1150.2
851.423	1104.08
851.806	1176.9
852.188	1179.33
852.57	1079.81
852.951	1033.69
853.333	1138.06
853.715	963.3
854.097	909.9
854.479	939.03
854.86	781.26
855.242	788.54
855.623	851.65
856.005	686.6
856.386	681.75
856.768	686.6
857.149	623.49
857.53	647.76
857.911	737.57
858.292	642.91
858.674	698.74
859.055	555.53
859.436	555.53
859.817	550.68
860.197	567.67
860.578	526.4
860.959	540.97
861.34	574.95
861.72	473
862.101	519.12
862.482	414.75
862.862	439.02
863.243	395.33
863.623	456.01
864.003	358.93
864.384	417.18
864.764	373.49
865.144	380.77
865.524	458.44
865.904	405.04
866.284	383.2
866.664	371.06
867.044	256.98
867.424	412.32
867.804	351.64
868.183	371.06
868.563	276.4
868.943	295.82
869.322	344.36
869.702	290.96
870.081	266.69
870.461	375.92
870.84	315.24
871.22	293.39
871.599	341.93
871.978	254.55
872.357	271.55
872.736	337.08
873.115	218.15
873.494	276.4
873.873	269.12
874.252	281.25
874.631	249.7
875.01	184.17
875.388	162.32
875.767	242.42
876.146	288.54
876.524	218.15
876.903	227.86
877.281	227.86
877.66	256.98
878.038	172.03
878.416	111.35
878.794	254.55
879.173	244.85
879.551	174.46
879.929	181.74
880.307	223
880.685	113.78
881.063	213.29
881.441	196.3
881.818	186.59
882.196	191.45
882.574	174.46
882.951	220.57
883.329	206.01
883.707	189.02
884.084	201.16
884.461	220.57
884.839	169.6
885.216	172.03
885.593	196.3
885.971	164.75
886.348	130.77
886.725	167.17
887.102	179.31
887.479	147.76
887.856	244.85
888.233	106.49
888.609	125.91
888.986	99.21
889.363	118.63
889.74	193.87
890.116	157.47
890.493	135.62
890.869	164.75
891.246	189.02
891.622	189.02
891.998	191.45
892.375	94.36
892.751	176.88
893.127	230.28
893.503	184.17
893.879	130.77
894.255	181.74
894.631	172.03
895.007	169.6
895.383	155.04
895.759	150.18
896.134	101.64
896.51	157.47
896.886	138.05
897.261	203.58
897.637	164.75
898.012	142.9
898.388	125.91
898.763	133.19
899.138	128.34
899.514	138.05
899.889	169.6
900.264	147.76
900.639	135.62
901.014	172.03
901.389	142.9
901.764	172.03
902.139	91.93
902.513	142.9
902.888	167.17
903.263	111.35
903.638	169.6
904.012	130.77
904.387	33.68
904.761	152.61
905.136	184.17
905.51	121.06
905.884	118.63
906.259	123.48
906.633	135.62
907.007	176.88
907.381	191.45
907.755	164.75
908.129	106.49
908.503	167.17
908.877	133.19
909.251	164.75
909.624	196.3
909.998	128.34
910.372	135.62
910.745	179.31
911.119	123.48
911.492	196.3
911.866	91.93
912.239	99.21
912.612	162.32
912.986	84.65
913.359	198.73
913.732	269.12
914.105	111.35
914.478	96.79
914.851	142.9
915.224	162.32
915.597	145.33
915.97	167.17
916.343	159.89
916.715	138.05
917.088	111.35
917.461	133.19
917.833	145.33
918.206	193.87
918.578	72.51
918.951	155.04
919.323	72.51
919.695	116.2
920.067	118.63
920.44	57.95
920.812	84.65
921.184	155.04
921.556	201.16
921.928	162.32
922.3	99.21
922.672	152.61
923.043	167.17
923.415	147.76
923.787	201.16
924.158	155.04
924.53	142.9
924.901	213.29
925.273	106.49
925.644	186.59
926.016	150.18
926.387	108.92
926.758	181.74
927.129	193.87
927.5	186.59
927.872	128.34
928.243	77.37
928.613	121.06
928.984	121.06
929.355	135.62
929.726	140.48
930.097	104.07
930.467	128.34
930.838	172.03
931.209	72.51
931.579	155.04
931.95	172.03
932.32	152.61
932.69	142.9
933.061	142.9
933.431	133.19
933.801	181.74
934.171	106.49
934.541	179.31
934.911	94.36
935.281	172.03
935.651	99.21
936.021	164.75
936.391	157.47
936.761	152.61
937.13	147.76
937.5	172.03
937.87	104.07
938.239	145.33
938.609	193.87
938.978	145.33
939.347	176.88
939.717	162.32
940.086	94.36
940.455	155.04
940.824	150.18
941.193	157.47
941.562	186.59
941.931	150.18
942.3	176.88
942.669	152.61
943.038	106.49
943.407	176.88
943.775	172.03
944.144	169.6
944.513	104.07
944.881	111.35
945.25	157.47
945.618	193.87
945.986	128.34
946.355	152.61
946.723	128.34
947.091	167.17
947.459	176.88
947.827	167.17
948.195	113.78
948.563	162.32
948.931	125.91
949.299	135.62
949.667	157.47
950.035	174.46
950.402	130.77
950.77	203.58
951.138	210.86
951.505	196.3
951.873	108.92
952.24	191.45
952.607	184.17
952.975	89.5
953.342	96.79
953.709	179.31
954.076	189.02
954.443	125.91
954.81	140.48
955.177	147.76
955.544	206.01
955.911	135.62
956.278	196.3
956.645	113.78
957.012	155.04
957.378	130.77
957.745	140.48
958.111	142.9
958.478	147.76
958.844	191.45
959.211	140.48
959.577	164.75
959.943	172.03
960.309	159.89
960.675	152.61
961.042	189.02
961.408	152.61
961.774	135.62
962.139	140.48
962.505	108.92
962.871	125.91
963.237	157.47
963.603	91.93
963.968	121.06
964.334	179.31
964.699	147.76
965.065	108.92
965.43	150.18
965.796	169.6
966.161	201.16
966.526	142.9
966.891	155.04
967.256	164.75
967.622	189.02
967.987	198.73
968.352	138.05
968.716	152.61
969.081	150.18
969.446	189.02
969.811	159.89
970.176	130.77
970.54	138.05
970.905	135.62
971.269	147.76
971.634	152.61
971.998	225.43
972.363	191.45
972.727	118.63
973.091	116.2
973.455	111.35
973.819	220.57
974.183	155.04
974.547	91.93
974.911	79.79
975.275	140.48
975.639	147.76
976.003	128.34
976.367	189.02
976.73	147.76
977.094	140.48
977.458	242.42
977.821	174.46
978.185	157.47
978.548	157.47
978.911	218.15
979.275	121.06
979.638	142.9
980.001	176.88
980.364	145.33
980.727	65.23
981.09	189.02
981.453	203.58
981.816	138.05
982.179	218.15
982.542	201.16
982.905	249.7
983.267	106.49
983.63	142.9
983.992	147.76
984.355	167.17
984.717	157.47
985.08	65.23
985.442	174.46
985.804	135.62
986.167	157.47
986.529	198.73
986.891	116.2
987.253	145.33
987.615	128.34
987.977	140.48
988.339	167.17
988.701	159.89
989.062	213.29
989.424	201.16
989.786	89.5
990.147	91.93
990.509	123.48
990.87	150.18
991.232	198.73
991.593	189.02
991.955	72.51
992.316	201.16
992.677	167.17
993.038	140.48
993.399	152.61
993.76	172.03
994.121	157.47
994.482	89.5
994.843	164.75
995.204	145.33
995.565	159.89
995.926	201.16
996.286	208.44
996.647	147.76
997.007	118.63
997.368	179.31
997.728	225.43
998.089	159.89
998.449	113.78
998.809	104.07
999.169	118.63
999.53	125.91
999.89	162.32
1000.25	123.48
1000.61	135.62
1000.97	94.36
1001.329	113.78
1001.689	223
1002.049	152.61
1002.409	125.91
1002.768	84.65
1003.128	169.6
1003.487	138.05
1003.847	167.17
1004.206	167.17
1004.566	150.18
1004.925	130.77
1005.284	159.89
1005.643	113.78
1006.003	65.23
1006.362	162.32
1006.721	164.75
1007.08	169.6
1007.438	140.48
1007.797	201.16
1008.156	223
1008.515	133.19
1008.874	142.9
1009.232	87.08
1009.591	152.61
1009.949	140.48
1010.308	164.75
1010.666	206.01
1011.024	159.89
1011.383	164.75
1011.741	167.17
1012.099	147.76
1012.457	113.78
1012.815	172.03
1013.173	133.19
1013.531	108.92
1013.889	142.9
1014.247	106.49
1014.605	174.46
1014.962	179.31
1015.32	159.89
1015.678	111.35
1016.035	118.63
1016.393	179.31
1016.75	186.59
1017.107	89.5
1017.465	142.9
1017.822	147.76
1018.179	193.87
1018.536	244.85
1018.894	118.63
1019.251	203.58
1019.608	79.79
1019.964	123.48
1020.321	145.33
1020.678	157.47
1021.035	147.76
1021.392	184.17
1021.748	118.63
1022.105	162.32
1022.461	125.91
1022.818	247.27
1023.174	106.49
1023.531	176.88
1023.887	87.08
1024.243	157.47
1024.599	106.49
1024.955	125.91
1025.311	225.43
1025.667	172.03
1026.023	186.59
1026.379	82.22
1026.735	140.48
1027.091	104.07
1027.447	179.31
