189.514	34.44
189.973	34.44
190.431	34.44
190.889	-9.25
191.348	0.46
191.806	-28.67
192.264	5.31
192.722	-21.39
193.18	-48.09
193.638	-52.94
194.096	0.46
194.554	-14.11
195.012	17.45
195.47	15.02
195.928	22.3
196.385	-11.68
196.843	56.28
197.301	-48.09
197.758	-23.82
198.216	41.72
198.674	44.15
199.131	17.45
199.589	73.27
200.046	75.7
200.503	129.1
200.961	116.96
201.418	119.39
201.875	95.12
202.332	95.12
202.79	68.42
203.247	150.94
203.704	92.69
204.161	150.94
204.618	153.37
205.075	175.22
205.532	197.06
205.989	146.09
206.445	87.84
206.902	141.23
207.359	199.49
207.816	153.37
208.272	175.22
208.729	112.11
209.185	192.21
209.642	143.66
210.098	141.23
210.555	146.09
211.011	182.5
211.467	143.66
211.924	180.07
212.38	107.25
212.836	158.22
213.292	172.79
213.748	170.36
214.204	180.07
214.66	165.51
215.116	218.91
215.572	150.94
216.028	197.06
216.484	201.91
216.94	228.61
217.396	114.53
217.851	211.62
218.307	95.12
218.763	170.36
219.218	148.52
219.674	158.22
220.129	175.22
220.585	138.81
221.04	146.09
221.496	211.62
221.951	102.4
222.406	163.08
222.861	221.33
223.317	155.8
223.772	104.83
224.227	141.23
224.682	211.62
225.137	214.05
225.592	158.22
226.047	160.65
226.502	160.65
226.957	124.24
227.411	136.38
227.866	189.78
228.321	206.77
228.776	146.09
229.23	133.95
229.685	102.4
230.139	95.12
230.594	99.97
231.048	206.77
231.503	109.68
231.957	95.12
232.411	165.51
232.865	170.36
233.32	226.19
233.774	155.8
234.228	116.96
234.682	136.38
235.136	53.85
235.59	61.14
236.044	155.8
236.498	150.94
236.952	146.09
237.406	82.98
237.86	104.83
238.313	180.07
238.767	129.1
239.221	163.08
239.674	146.09
240.128	172.79
240.581	133.95
241.035	87.84
241.488	114.53
241.942	172.79
242.395	116.96
242.848	153.37
243.301	163.08
243.755	175.22
244.208	165.51
244.661	243.18
245.114	150.94
245.567	143.66
246.02	216.48
246.473	167.93
246.926	129.1
247.379	141.23
247.832	143.66
248.284	184.92
248.737	192.21
249.19	192.21
249.642	104.83
250.095	158.22
250.547	177.64
251	184.92
251.452	87.84
251.905	114.53
252.357	189.78
252.81	107.25
253.262	150.94
253.714	175.22
254.166	158.22
254.618	158.22
255.07	158.22
255.523	92.69
255.975	121.82
256.427	167.93
256.878	150.94
257.33	119.39
257.782	116.96
258.234	197.06
258.686	189.78
259.137	201.91
259.589	129.1
260.041	141.23
260.492	158.22
260.944	143.66
261.395	160.65
261.847	167.93
262.298	158.22
262.749	201.91
263.201	167.93
263.652	126.67
264.103	187.35
264.554	141.23
265.005	167.93
265.457	141.23
265.908	192.21
266.359	170.36
266.809	133.95
267.26	141.23
267.711	180.07
268.162	180.07
268.613	163.08
269.064	138.81
269.514	133.95
269.965	206.77
270.415	211.62
270.866	211.62
271.316	184.92
271.767	170.36
272.217	192.21
272.668	129.1
273.118	112.11
273.568	112.11
274.019	194.63
274.469	177.64
274.919	129.1
275.369	216.48
275.819	112.11
276.269	141.23
276.719	233.47
277.169	148.52
277.619	170.36
278.069	143.66
278.518	177.64
278.968	109.68
279.418	131.53
279.867	163.08
280.317	160.65
280.767	165.51
281.216	141.23
281.666	131.53
282.115	138.81
282.564	206.77
283.014	272.3
283.463	131.53
283.912	182.5
284.361	182.5
284.811	146.09
285.26	262.6
285.709	216.48
286.158	158.22
286.607	184.92
287.056	129.1
287.505	163.08
287.953	146.09
288.402	158.22
288.851	102.4
289.3	90.26
289.748	95.12
290.197	112.11
290.646	177.64
291.094	75.7
291.543	143.66
291.991	102.4
292.439	163.08
292.888	167.93
293.336	158.22
293.784	133.95
294.233	121.82
294.681	126.67
295.129	187.35
295.577	187.35
296.025	46.57
296.473	153.37
296.921	160.65
297.369	163.08
297.817	143.66
298.264	199.49
298.712	187.35
299.16	167.93
299.608	265.02
300.055	155.8
300.503	209.2
300.95	218.91
301.398	133.95
301.845	163.08
302.293	75.7
302.74	177.64
303.187	138.81
303.635	240.75
304.082	153.37
304.529	172.79
304.976	150.94
305.423	148.52
305.87	165.51
306.317	90.26
306.764	131.53
307.211	163.08
307.658	131.53
308.105	238.32
308.552	206.77
308.998	192.21
309.445	187.35
309.892	133.95
310.338	124.24
310.785	114.53
311.231	109.68
311.678	243.18
312.124	155.8
312.571	143.66
313.017	206.77
313.463	197.06
313.909	153.37
314.356	175.22
314.802	138.81
315.248	160.65
315.694	160.65
316.14	182.5
316.586	177.64
317.032	138.81
317.478	150.94
317.923	209.2
318.369	175.22
318.815	138.81
319.261	143.66
319.706	182.5
320.152	68.42
320.597	146.09
321.043	201.91
321.488	163.08
321.934	116.96
322.379	167.93
322.824	119.39
323.27	146.09
323.715	248.03
324.16	165.51
324.605	114.53
325.05	175.22
325.495	172.79
325.94	175.22
326.385	177.64
326.83	102.4
327.275	165.51
327.72	155.8
328.165	175.22
328.61	153.37
329.054	216.48
329.499	182.5
329.943	197.06
330.388	131.53
330.832	153.37
331.277	182.5
331.721	121.82
332.166	170.36
332.61	146.09
333.054	119.39
333.499	87.84
333.943	153.37
334.387	158.22
334.831	182.5
335.275	153.37
335.719	170.36
336.163	138.81
336.607	148.52
337.051	148.52
337.495	114.53
337.938	112.11
338.382	211.62
338.826	92.69
339.269	155.8
339.713	206.77
340.157	223.76
340.6	177.64
341.044	148.52
341.487	170.36
341.93	160.65
342.374	158.22
342.817	250.46
343.26	189.78
343.703	180.07
344.146	189.78
344.59	192.21
345.033	182.5
345.476	194.63
345.919	182.5
346.361	189.78
346.804	131.53
347.247	150.94
347.69	167.93
348.133	119.39
348.575	102.4
349.018	153.37
349.461	131.53
349.903	107.25
350.346	121.82
350.788	143.66
351.23	158.22
351.673	155.8
352.115	109.68
352.557	180.07
353	172.79
353.442	148.52
353.884	104.83
354.326	163.08
354.768	250.46
355.21	167.93
355.652	143.66
356.094	189.78
356.536	82.98
356.978	163.08
357.419	167.93
357.861	141.23
358.303	180.07
358.744	177.64
359.186	201.91
359.627	199.49
360.069	165.51
360.51	209.2
360.952	194.63
361.393	95.12
361.834	146.09
362.276	143.66
362.717	218.91
363.158	182.5
363.599	153.37
364.04	116.96
364.481	131.53
364.922	109.68
365.363	182.5
365.804	211.62
366.245	197.06
366.686	160.65
367.126	163.08
367.567	175.22
368.008	153.37
368.448	194.63
368.889	182.5
369.33	150.94
369.77	189.78
370.21	199.49
370.651	163.08
371.091	148.52
371.531	187.35
371.972	153.37
372.412	121.82
372.852	160.65
373.292	119.39
373.732	133.95
374.172	155.8
374.612	133.95
375.052	172.79
375.492	136.38
375.932	148.52
376.372	163.08
376.811	201.91
377.251	155.8
377.691	201.91
378.13	175.22
378.57	223.76
379.009	228.61
379.449	187.35
379.888	165.51
380.328	73.27
380.767	85.41
381.206	102.4
381.645	126.67
382.085	131.53
382.524	95.12
382.963	141.23
383.402	141.23
383.841	153.37
384.28	160.65
384.719	119.39
385.158	204.34
385.596	126.67
386.035	175.22
386.474	163.08
386.913	204.34
387.351	167.93
387.79	78.13
388.228	124.24
388.667	165.51
389.105	148.52
389.544	211.62
389.982	92.69
390.42	104.83
390.859	131.53
391.297	158.22
391.735	119.39
392.173	177.64
392.611	114.53
393.049	102.4
393.487	131.53
393.925	167.93
394.363	165.51
394.801	192.21
395.239	172.79
395.676	131.53
396.114	148.52
396.552	167.93
396.989	172.79
397.427	56.28
397.864	197.06
398.302	138.81
398.739	184.92
399.177	189.78
399.614	146.09
400.051	172.79
400.488	187.35
400.926	177.64
401.363	109.68
401.8	129.1
402.237	136.38
402.674	187.35
403.111	167.93
403.548	170.36
403.985	197.06
404.421	68.42
404.858	150.94
405.295	163.08
405.732	104.83
406.168	102.4
406.605	138.81
407.041	138.81
407.478	180.07
407.914	187.35
408.351	184.92
408.787	119.39
409.223	211.62
409.66	167.93
410.096	172.79
410.532	216.48
410.968	165.51
411.404	199.49
411.84	197.06
412.276	167.93
412.712	126.67
413.148	175.22
413.584	192.21
414.02	204.34
414.455	138.81
414.891	192.21
415.327	102.4
415.762	136.38
416.198	141.23
416.633	170.36
417.069	177.64
417.504	146.09
417.94	114.53
418.375	143.66
418.81	211.62
419.245	184.92
419.681	80.55
420.116	160.65
420.551	126.67
420.986	138.81
421.421	99.97
421.856	163.08
422.291	129.1
422.726	172.79
423.16	211.62
423.595	172.79
424.03	233.47
424.464	192.21
424.899	209.2
425.334	192.21
425.768	160.65
426.203	167.93
426.637	170.36
427.071	165.51
427.506	158.22
427.94	104.83
428.374	138.81
428.809	150.94
429.243	194.63
429.677	170.36
430.111	158.22
430.545	199.49
430.979	214.05
431.413	177.64
431.847	124.24
432.28	133.95
432.714	148.52
433.148	177.64
433.582	175.22
434.015	107.25
434.449	184.92
434.882	250.46
435.316	192.21
435.749	148.52
436.183	150.94
436.616	192.21
437.049	138.81
437.483	257.74
437.916	214.05
438.349	192.21
438.782	201.91
439.215	194.63
439.648	131.53
440.081	197.06
440.514	218.91
440.947	211.62
441.38	180.07
441.813	141.23
442.245	231.04
442.678	133.95
443.111	177.64
443.543	245.6
443.976	182.5
444.408	167.93
444.841	170.36
445.273	160.65
445.705	167.93
446.138	216.48
446.57	214.05
447.002	218.91
447.434	167.93
447.867	223.76
448.299	201.91
448.731	260.17
449.163	277.16
449.595	218.91
450.026	221.33
450.458	228.61
450.89	272.3
451.322	189.78
451.754	233.47
452.185	163.08
452.617	223.76
453.048	209.2
453.48	214.05
453.911	218.91
454.343	206.77
454.774	269.88
455.205	112.11
455.637	228.61
456.068	172.79
456.499	248.03
456.93	216.48
457.361	235.9
457.792	180.07
458.223	248.03
458.654	182.5
459.085	187.35
459.516	216.48
459.947	223.76
460.378	194.63
460.808	245.6
461.239	272.3
461.669	238.32
462.1	277.16
462.531	180.07
462.961	265.02
463.391	231.04
463.822	187.35
464.252	160.65
464.682	172.79
465.113	216.48
465.543	216.48
465.973	235.9
466.403	146.09
466.833	311.14
467.263	182.5
467.693	167.93
468.123	223.76
468.553	192.21
468.983	201.91
469.412	216.48
469.842	289.29
470.272	189.78
470.701	201.91
471.131	214.05
471.56	180.07
471.99	194.63
472.419	286.87
472.849	197.06
473.278	192.21
473.707	165.51
474.136	248.03
474.566	184.92
474.995	192.21
475.424	148.52
475.853	182.5
476.282	221.33
476.711	150.94
477.14	211.62
477.569	141.23
477.997	165.51
478.426	180.07
478.855	153.37
479.283	126.67
479.712	197.06
480.141	228.61
480.569	204.34
480.998	177.64
481.426	226.19
481.854	221.33
482.283	199.49
482.711	160.65
483.139	197.06
483.567	204.34
483.995	235.9
484.424	218.91
484.852	99.97
485.28	165.51
485.708	214.05
486.135	150.94
486.563	209.2
486.991	221.33
487.419	194.63
487.847	153.37
488.274	216.48
488.702	194.63
489.129	218.91
489.557	172.79
489.984	187.35
490.412	197.06
490.839	189.78
491.266	163.08
491.694	170.36
492.121	226.19
492.548	146.09
492.975	121.82
493.402	172.79
493.829	116.96
494.256	136.38
494.683	109.68
495.11	155.8
495.537	143.66
495.964	189.78
496.39	192.21
496.817	177.64
497.244	182.5
497.67	175.22
498.097	240.75
498.523	155.8
498.95	216.48
499.376	184.92
499.803	104.83
500.229	158.22
500.655	184.92
501.081	70.84
501.508	182.5
501.934	175.22
502.36	141.23
502.786	146.09
503.212	248.03
503.638	121.82
504.064	153.37
504.489	172.79
504.915	126.67
505.341	129.1
505.767	199.49
506.192	187.35
506.618	155.8
507.043	153.37
507.469	170.36
507.894	148.52
508.32	221.33
508.745	228.61
509.17	114.53
509.596	133.95
510.021	214.05
510.446	153.37
510.871	226.19
511.296	148.52
511.721	163.08
512.146	221.33
512.571	197.06
512.996	180.07
513.421	167.93
513.845	126.67
514.27	177.64
514.695	189.78
515.119	165.51
515.544	192.21
515.969	121.82
516.393	163.08
516.817	206.77
517.242	201.91
517.666	192.21
518.09	175.22
518.515	216.48
518.939	170.36
519.363	427.65
519.787	163.08
520.211	172.79
520.635	211.62
521.059	209.2
521.483	199.49
521.907	201.91
522.331	129.1
522.754	153.37
523.178	221.33
523.602	170.36
524.025	177.64
524.449	231.04
524.872	221.33
525.296	194.63
525.719	167.93
526.143	197.06
526.566	158.22
526.989	99.97
527.412	167.93
527.836	211.62
528.259	177.64
528.682	131.53
529.105	138.81
529.528	119.39
529.951	187.35
530.374	199.49
530.796	194.63
531.219	141.23
531.642	201.91
532.065	126.67
532.487	148.52
532.91	235.9
533.332	129.1
533.755	192.21
534.177	163.08
534.6	158.22
535.022	177.64
535.444	182.5
535.867	182.5
536.289	90.26
536.711	250.46
537.133	214.05
537.555	206.77
537.977	223.76
538.399	221.33
538.821	231.04
539.243	170.36
539.665	235.9
540.086	177.64
540.508	201.91
540.93	243.18
541.351	114.53
541.773	180.07
542.195	160.65
542.616	235.9
543.037	214.05
543.459	197.06
543.88	167.93
544.301	204.34
544.723	155.8
545.144	184.92
545.565	194.63
545.986	231.04
546.407	238.32
546.828	194.63
547.249	143.66
547.67	184.92
548.091	211.62
548.512	177.64
548.932	163.08
549.353	214.05
549.774	148.52
550.194	216.48
550.615	187.35
551.035	150.94
551.456	167.93
551.876	136.38
552.296	238.32
552.717	141.23
553.137	206.77
553.557	192.21
553.977	180.07
554.397	197.06
554.817	163.08
555.237	214.05
555.657	201.91
556.077	197.06
556.497	204.34
556.917	180.07
557.337	167.93
557.756	233.47
558.176	187.35
558.596	150.94
559.015	180.07
559.435	204.34
559.854	192.21
560.274	192.21
560.693	163.08
561.112	201.91
561.532	204.34
561.951	148.52
562.37	165.51
562.789	107.25
563.208	209.2
563.627	223.76
564.046	160.65
564.465	189.78
564.884	197.06
565.303	177.64
565.722	194.63
566.14	180.07
566.559	177.64
566.978	126.67
567.396	235.9
567.815	245.6
568.233	216.48
568.652	184.92
569.07	192.21
569.489	155.8
569.907	131.53
570.325	172.79
570.743	228.61
571.161	180.07
571.58	209.2
571.998	204.34
572.416	182.5
572.833	175.22
573.251	177.64
573.669	211.62
574.087	252.89
574.505	148.52
574.922	146.09
575.34	138.81
575.758	197.06
576.175	226.19
576.593	116.96
577.01	153.37
577.428	167.93
577.845	1556.3
578.262	209.2
578.68	240.75
579.097	180.07
579.514	240.75
579.931	129.1
580.348	148.52
580.765	75.7
581.182	172.79
581.599	218.91
582.016	245.6
582.433	163.08
582.849	90.26
583.266	226.19
583.683	223.76
584.099	189.78
584.516	119.39
584.933	121.82
585.349	112.11
585.765	235.9
586.182	119.39
586.598	126.67
587.014	170.36
587.431	223.76
587.847	138.81
588.263	182.5
588.679	235.9
589.095	194.63
589.511	158.22
589.927	143.66
590.343	209.2
590.759	165.51
591.174	155.8
591.59	163.08
592.006	146.09
592.421	136.38
592.837	209.2
593.252	172.79
593.668	63.56
594.083	129.1
594.499	160.65
594.914	163.08
595.329	189.78
595.745	267.45
596.16	216.48
596.575	175.22
596.99	214.05
597.405	201.91
597.82	131.53
598.235	199.49
598.65	163.08
599.065	143.66
599.479	165.51
599.894	187.35
600.309	182.5
600.724	201.91
601.138	146.09
601.553	184.92
601.967	201.91
602.382	184.92
602.796	214.05
603.21	167.93
603.625	189.78
604.039	197.06
604.453	175.22
604.867	158.22
605.281	231.04
605.695	163.08
606.109	260.17
606.523	150.94
606.937	199.49
607.351	250.46
607.765	141.23
608.178	175.22
608.592	158.22
609.006	231.04
609.419	221.33
609.833	189.78
610.246	175.22
610.66	177.64
611.073	194.63
611.487	216.48
611.9	150.94
612.313	223.76
612.726	155.8
613.139	126.67
613.553	189.78
613.966	204.34
614.379	218.91
614.792	172.79
615.204	172.79
615.617	116.96
616.03	226.19
616.443	141.23
616.856	136.38
617.268	189.78
617.681	167.93
618.093	214.05
618.506	192.21
618.918	194.63
619.331	189.78
619.743	150.94
620.155	114.53
620.568	146.09
620.98	148.52
621.392	155.8
621.804	228.61
622.216	175.22
622.628	238.32
623.04	277.16
623.452	155.8
623.864	216.48
624.276	148.52
624.687	216.48
625.099	158.22
625.511	107.25
625.922	131.53
626.334	189.78
626.745	226.19
627.157	177.64
627.568	177.64
627.979	182.5
628.391	180.07
628.802	126.67
629.213	167.93
629.624	112.11
630.035	194.63
630.446	189.78
630.857	167.93
631.268	180.07
631.679	158.22
632.09	163.08
632.501	129.1
632.912	143.66
633.322	153.37
633.733	182.5
634.144	163.08
634.554	221.33
634.965	255.31
635.375	158.22
635.785	194.63
636.196	163.08
636.606	216.48
637.016	146.09
637.427	172.79
637.837	138.81
638.247	175.22
638.657	180.07
639.067	172.79
639.477	170.36
639.887	211.62
640.297	182.5
640.706	126.67
641.116	153.37
641.526	182.5
641.935	192.21
642.345	121.82
642.755	138.81
643.164	153.37
643.573	194.63
643.983	165.51
644.392	167.93
644.801	172.79
645.211	187.35
645.62	155.8
646.029	182.5
646.438	223.76
646.847	206.77
647.256	131.53
647.665	133.95
648.074	121.82
648.483	155.8
648.892	148.52
649.3	153.37
649.709	180.07
650.118	172.79
650.526	141.23
650.935	167.93
651.343	167.93
651.752	146.09
652.16	201.91
652.568	211.62
652.977	184.92
653.385	158.22
653.793	170.36
654.201	158.22
654.609	223.76
655.017	243.18
655.425	129.1
655.833	85.41
656.241	136.38
656.649	131.53
657.057	265.02
657.464	187.35
657.872	167.93
658.28	233.47
658.687	112.11
659.095	124.24
659.502	150.94
659.91	243.18
660.317	112.11
660.724	204.34
661.132	272.3
661.539	197.06
661.946	107.25
662.353	221.33
662.76	197.06
663.167	199.49
663.574	204.34
663.981	184.92
664.388	204.34
664.795	209.2
665.202	136.38
665.608	95.12
666.015	184.92
666.422	153.37
666.828	216.48
667.235	160.65
667.641	131.53
668.047	155.8
668.454	148.52
668.86	121.82
669.266	119.39
669.673	158.22
670.079	240.75
670.485	235.9
670.891	180.07
671.297	206.77
671.703	160.65
672.109	109.68
672.515	95.12
672.92	121.82
673.326	141.23
673.732	112.11
674.138	206.77
674.543	136.38
674.949	97.54
675.354	124.24
675.76	163.08
676.165	158.22
676.57	170.36
676.976	160.65
677.381	163.08
677.786	160.65
678.191	182.5
678.596	160.65
679.001	153.37
679.406	172.79
679.811	182.5
680.216	201.91
680.621	233.47
681.026	148.52
681.43	204.34
681.835	170.36
682.24	221.33
682.644	141.23
683.049	131.53
683.453	180.07
683.858	167.93
684.262	158.22
684.667	163.08
685.071	160.65
685.475	126.67
685.879	226.19
686.283	214.05
686.687	158.22
687.091	112.11
687.495	138.81
687.899	182.5
688.303	172.79
688.707	238.32
689.111	119.39
689.514	90.26
689.918	182.5
690.322	214.05
690.725	218.91
691.129	250.46
691.532	192.21
691.936	129.1
692.339	155.8
692.742	218.91
693.146	150.94
693.549	209.2
693.952	131.53
694.355	112.11
694.758	182.5
695.161	109.68
695.564	180.07
695.967	95.12
696.37	197.06
696.773	175.22
697.175	126.67
697.578	148.52
697.981	199.49
698.383	150.94
698.786	146.09
699.188	189.78
699.591	209.2
699.993	216.48
700.395	177.64
700.798	150.94
701.2	216.48
701.602	209.2
702.004	180.07
702.406	175.22
702.808	177.64
703.21	211.62
703.612	197.06
704.014	194.63
704.416	192.21
704.818	199.49
705.219	158.22
705.621	223.76
706.023	163.08
706.424	206.77
706.826	197.06
707.227	240.75
707.629	214.05
708.03	211.62
708.431	291.72
708.832	272.3
709.234	255.31
709.635	286.87
710.036	262.6
710.437	257.74
710.838	199.49
711.239	243.18
711.64	265.02
712.041	260.17
712.441	209.2
712.842	272.3
713.243	221.33
713.643	284.44
714.044	214.05
714.445	243.18
714.845	277.16
715.246	374.25
715.646	330.56
716.046	291.72
716.447	284.44
716.847	299
717.247	296.58
717.647	337.84
718.047	291.72
718.447	381.53
718.847	303.86
719.247	313.57
719.647	294.15
720.047	383.96
720.446	313.57
720.846	299
721.246	408.23
721.645	347.55
722.045	386.38
722.444	427.65
722.844	403.37
723.243	454.35
723.643	366.97
724.042	398.52
724.441	386.38
724.84	393.67
725.24	512.6
725.639	495.61
726.038	459.2
726.437	464.05
726.836	478.62
727.234	544.15
727.633	447.06
728.032	529.59
728.431	553.86
728.83	568.43
729.228	517.45
729.627	646.1
730.025	682.5
730.424	723.77
730.822	735.9
731.22	794.16
731.619	701.92
732.017	837.85
732.415	762.6
732.813	706.78
733.212	791.73
733.61	942.22
734.008	1066.01
734.406	1187.37
734.803	1359.7
735.201	1461.64
735.599	1672.81
735.997	1752.91
736.395	1682.52
736.792	1473.78
737.19	1410.67
737.587	1403.39
737.985	1354.85
738.382	1299.02
738.78	1609.7
739.177	1769.9
739.574	2286.9
739.971	2641.27
740.369	2934.97
740.766	3260.21
741.163	3131.57
741.56	2884
741.957	2502.92
742.354	2204.37
742.751	1927.67
743.147	2032.04
743.544	2158.26
743.941	2653.41
744.338	3403.42
744.734	4240.81
745.131	4779.66
745.527	5442.29
745.924	5442.29
746.32	5172.87
746.716	4689.85
747.113	4274.79
747.509	3643.72
747.905	3308.76
748.301	3434.97
748.697	4151.01
749.093	5075.78
749.489	6316.09
749.885	7925.34
750.281	9092.83
750.677	9641.38
751.073	9748.18
751.468	8981.18
751.864	8075.82
752.26	6682.6
752.655	5786.95
753.051	5323.35
753.446	5660.74
753.842	6607.35
754.237	8413.21
754.632	10410.81
755.028	12556.48
755.423	13859.89
755.818	14573.5
756.213	14673.01
756.608	13454.55
757.003	12109.87
757.398	9998.18
757.793	8170.49
758.188	7350.08
758.583	7634.07
758.977	8520.01
759.372	10813.73
759.767	13651.15
760.161	17396.36
760.556	19913.39
760.95	21279.91
761.345	21886.72
761.739	20957.09
762.133	18838.13
762.527	16699.74
762.922	13864.75
763.316	12330.74
763.71	11600.15
764.104	12891.43
764.498	15376.91
764.892	19423.09
765.286	22908.58
765.68	27241.17
766.073	29988.79
766.467	30911.13
766.861	31564.05
767.255	29605.28
767.648	26185.33
768.042	22464.4
768.435	18568.71
768.829	16471.59
769.222	16046.82
769.615	17425.48
770.008	20277.47
770.402	24823.66
770.795	29911.11
771.188	34751
771.581	36957.34
771.974	37673.37
772.367	36707.34
772.76	34457.3
773.153	29491.21
773.545	24928.03
773.938	21117.29
774.331	18306.57
774.724	17607.53
775.116	19034.73
775.509	22925.57
775.901	28724.2
776.294	34731.58
776.686	40726.82
777.078	44845.81
777.471	47802.17
777.863	48379.85
778.255	46763.32
778.647	42078.78
779.039	36775.3
779.431	30136.85
779.823	25743.57
780.215	23219.26
780.607	23095.47
780.999	26151.35
781.39	31794.64
781.782	37717.06
782.174	44685.62
782.565	49894.44
782.957	53302.26
783.348	54763.44
783.74	54105.67
784.131	49496.37
784.522	45306.99
784.914	37554.44
785.305	31284.92
785.696	26151.35
786.087	23646.45
786.478	23180.43
786.869	25590.66
787.26	30323.74
787.651	35221.88
788.042	40110.3
788.433	43603.08
788.823	46530.31
789.214	46770.6
789.605	45243.88
789.995	41421
790.386	35646.64
790.776	30481.51
791.167	24478.99
791.557	20937.67
791.948	19471.63
792.338	19573.58
792.728	22685.27
793.118	27032.43
793.508	32153.87
793.898	37459.78
794.288	42666.17
794.678	46481.76
795.068	48049.75
795.458	47103.13
795.848	44666.2
796.238	40479.24
796.627	34153.9
797.017	28862.55
797.406	23867.33
797.796	20403.69
798.185	19326
798.575	20335.72
798.964	23161.01
799.354	27617.39
799.743	33981.57
800.132	39721.95
800.521	43474.43
800.91	46872.54
801.299	47357.99
801.688	45680.78
802.077	41593.34
802.466	37156.37
802.855	32612.61
803.244	26017.85
803.633	21386.71
804.021	18039.57
804.41	16823.53
804.799	17216.74
805.187	19559.01
805.576	23182.85
805.964	26952.33
806.352	30270.34
806.741	34328.66
807.129	36571.41
807.517	37819
807.905	36192.77
808.293	33539.81
808.681	29974.22
809.069	25173.18
809.457	21894
809.845	18311.42
810.233	15374.48
810.621	14435.15
811.009	14699.71
811.396	16692.46
811.784	20287.18
812.171	24614.92
812.559	28481.48
812.946	31415.99
813.334	34811.68
813.721	35518
814.108	34522.84
814.496	32770.38
814.883	29335.86
815.27	26250.86
815.657	21952.25
816.044	17947.34
816.431	14578.35
816.818	12568.61
817.205	11830.74
817.592	12529.78
817.979	14473.98
818.365	17054.12
818.752	20328.44
819.139	23260.53
819.525	26073.68
819.912	27568.85
820.298	28267.89
820.685	27496.03
821.071	25275.12
821.457	22830.91
821.843	18947.35
822.23	15386.62
822.616	12549.19
823.002	9762.74
823.388	8121.94
823.774	7374.36
824.16	7303.97
824.546	8049.12
824.931	9821
825.317	11823.45
825.703	13893.88
826.089	15685.17
826.474	17221.6
826.86	17614.81
827.245	17639.08
827.631	16908.49
828.016	15277.39
828.401	13260.37
828.787	11058.88
829.172	8869.53
829.557	7240.86
829.942	5779.67
830.327	5075.78
830.712	5095.19
831.097	5374.33
831.482	6381.62
831.867	7430.18
832.252	8760.3
832.636	10066.15
833.021	11296.75
833.406	11966.66
833.79	12279.77
834.175	11876.85
834.559	11041.89
834.944	9922.94
835.328	8546.7
835.713	7141.34
836.097	5718.99
836.481	4595.19
836.865	3888.87
837.249	3243.22
837.633	3097.59
838.017	3444.68
838.401	3898.57
838.785	4473.83
839.169	5189.86
839.553	5714.14
839.937	6401.04
840.32	6634.05
840.704	6854.93
841.087	6335.51
841.471	5884.04
841.854	5435.01
842.238	4716.55
842.621	3842.75
843.004	3153.42
843.388	2650.98
843.771	2170.39
844.154	1774.75
844.537	1687.37
844.92	1782.04
845.303	2002.91
845.686	2350.01
846.069	2803.9
846.452	3226.23
846.834	3558.76
847.217	3930.13
847.6	4058.77
847.982	4277.22
848.365	4165.57
848.748	3782.07
849.13	3595.17
849.512	3010.21
849.895	2553.89
850.277	2044.18
850.659	1626.69
851.041	1464.07
851.423	1209.21
851.806	1167.95
852.188	1194.65
852.57	1274.75
852.951	1515.04
853.333	1699.51
853.715	2032.04
854.097	2092.72
854.479	2417.97
854.86	2515.06
855.242	2580.59
855.623	2590.3
856.005	2350.01
856.386	2206.8
856.768	1874.27
857.149	1641.26
857.53	1335.43
857.911	1138.82
858.292	908.24
858.674	859.69
859.055	699.5
859.436	616.97
859.817	726.19
860.197	709.2
860.578	857.26
860.959	905.81
861.34	1056.3
861.72	1216.49
862.101	1289.31
862.482	1282.03
862.862	1301.45
863.243	1349.99
863.623	1163.09
864.003	1083
864.384	1034.45
864.764	816
865.144	694.64
865.524	694.64
865.904	602.41
866.284	464.05
866.664	498.04
867.044	500.46
867.424	396.09
867.804	481.05
868.183	539.3
868.563	417.94
868.943	561.14
869.322	667.94
869.702	672.8
870.081	728.62
870.461	692.21
870.84	631.53
871.22	667.94
871.599	624.25
871.978	604.83
872.357	527.16
872.736	427.65
873.115	430.07
873.494	381.53
873.873	459.2
874.252	313.57
874.631	359.68
875.01	325.7
875.388	357.26
875.767	299
876.146	374.25
876.524	371.82
876.903	282.01
877.281	325.7
877.66	352.4
878.038	301.43
878.416	308.71
878.794	284.44
879.173	349.98
879.551	354.83
879.929	284.44
880.307	369.39
880.685	221.33
881.063	204.34
881.441	250.46
881.818	226.19
882.196	243.18
882.574	175.22
882.951	240.75
883.329	218.91
883.707	250.46
884.084	211.62
884.461	160.65
884.839	252.89
885.216	158.22
885.593	257.74
885.971	265.02
886.348	231.04
886.725	291.72
887.102	255.31
887.479	296.58
887.856	228.61
888.233	291.72
888.609	240.75
888.986	194.63
889.363	214.05
889.74	201.91
890.116	216.48
890.493	228.61
890.869	243.18
891.246	238.32
891.622	209.2
891.998	175.22
892.375	131.53
892.751	155.8
893.127	226.19
893.503	211.62
893.879	194.63
894.255	187.35
894.631	206.77
895.007	194.63
895.383	206.77
895.759	240.75
896.134	201.91
896.51	197.06
896.886	201.91
897.261	233.47
897.637	248.03
898.012	172.79
898.388	148.52
898.763	131.53
899.138	124.24
899.514	146.09
899.889	158.22
900.264	165.51
900.639	199.49
901.014	138.81
901.389	153.37
901.764	104.83
902.139	114.53
902.513	155.8
902.888	163.08
903.263	119.39
903.638	167.93
904.012	87.84
904.387	163.08
904.761	155.8
905.136	150.94
905.51	163.08
905.884	99.97
906.259	153.37
906.633	87.84
907.007	146.09
907.381	250.46
907.755	172.79
908.129	187.35
908.503	175.22
908.877	216.48
909.251	107.25
909.624	153.37
909.998	170.36
910.372	150.94
910.745	175.22
911.119	136.38
911.492	126.67
911.866	129.1
912.239	141.23
912.612	116.96
912.986	160.65
913.359	184.92
913.732	141.23
914.105	204.34
914.478	158.22
914.851	180.07
915.224	192.21
915.597	167.93
915.97	226.19
916.343	70.84
916.715	143.66
917.088	184.92
917.461	165.51
917.833	114.53
918.206	107.25
918.578	175.22
918.951	133.95
919.323	131.53
919.695	129.1
920.067	204.34
920.44	141.23
920.812	102.4
921.184	187.35
921.556	216.48
921.928	211.62
922.3	165.51
922.672	148.52
923.043	158.22
923.415	97.54
923.787	165.51
924.158	206.77
924.53	189.78
924.901	143.66
925.273	170.36
925.644	182.5
926.016	148.52
926.387	150.94
926.758	119.39
927.129	136.38
927.5	112.11
927.872	121.82
928.243	177.64
928.613	153.37
928.984	209.2
929.355	160.65
929.726	158.22
930.097	206.77
930.467	150.94
930.838	201.91
931.209	165.51
931.579	216.48
931.95	153.37
932.32	131.53
932.69	116.96
933.061	126.67
933.431	138.81
933.801	131.53
934.171	119.39
934.541	138.81
934.911	121.82
935.281	160.65
935.651	102.4
936.021	170.36
936.391	165.51
936.761	172.79
937.13	136.38
937.5	172.79
937.87	136.38
938.239	131.53
938.609	119.39
938.978	206.77
939.347	211.62
939.717	163.08
940.086	138.81
940.455	112.11
940.824	136.38
941.193	165.51
941.562	175.22
941.931	90.26
942.3	209.2
942.669	148.52
943.038	158.22
943.407	136.38
943.775	175.22
944.144	141.23
944.513	109.68
944.881	153.37
945.25	165.51
945.618	133.95
945.986	165.51
946.355	141.23
946.723	197.06
947.091	163.08
947.459	153.37
947.827	131.53
948.195	231.04
948.563	153.37
948.931	150.94
949.299	180.07
949.667	148.52
950.035	102.4
950.402	177.64
950.77	194.63
951.138	201.91
951.505	131.53
951.873	182.5
952.24	112.11
952.607	187.35
952.975	216.48
953.342	116.96
953.709	163.08
954.076	163.08
954.443	150.94
954.81	204.34
955.177	160.65
955.544	175.22
955.911	170.36
956.278	155.8
956.645	148.52
957.012	119.39
957.378	163.08
957.745	112.11
958.111	158.22
958.478	177.64
958.844	165.51
959.211	102.4
959.577	133.95
959.943	209.2
960.309	197.06
960.675	182.5
961.042	216.48
961.408	133.95
961.774	136.38
962.139	199.49
962.505	165.51
962.871	172.79
963.237	138.81
963.603	121.82
963.968	109.68
964.334	146.09
964.699	199.49
965.065	163.08
965.43	92.69
965.796	136.38
966.161	129.1
966.526	104.83
966.891	182.5
967.256	189.78
967.622	133.95
967.987	141.23
968.352	194.63
968.716	153.37
969.081	146.09
969.446	204.34
969.811	201.91
970.176	148.52
970.54	109.68
970.905	165.51
971.269	194.63
971.634	165.51
971.998	104.83
972.363	136.38
972.727	136.38
973.091	175.22
973.455	170.36
973.819	257.74
974.183	180.07
974.547	133.95
974.911	148.52
975.275	153.37
975.639	124.24
976.003	243.18
976.367	133.95
976.73	197.06
977.094	197.06
977.458	189.78
977.821	158.22
978.185	143.66
978.548	109.68
978.911	138.81
979.275	131.53
979.638	170.36
980.001	245.6
980.364	206.77
980.727	209.2
981.09	182.5
981.453	153.37
981.816	172.79
982.179	269.88
982.542	126.67
982.905	150.94
983.267	187.35
983.63	175.22
983.992	163.08
984.355	184.92
984.717	187.35
985.08	133.95
985.442	143.66
985.804	155.8
986.167	194.63
986.529	158.22
986.891	172.79
987.253	141.23
987.615	153.37
987.977	221.33
988.339	175.22
988.701	124.24
989.062	133.95
989.424	41.72
989.786	133.95
990.147	192.21
990.509	170.36
990.87	121.82
991.232	129.1
991.593	124.24
991.955	204.34
992.316	175.22
992.677	211.62
993.038	187.35
993.399	182.5
993.76	131.53
994.121	97.54
994.482	160.65
994.843	177.64
995.204	138.81
995.565	95.12
995.926	153.37
996.286	158.22
996.647	99.97
997.007	165.51
997.368	124.24
997.728	187.35
998.089	170.36
998.449	184.92
998.809	109.68
999.169	141.23
999.53	121.82
999.89	119.39
1000.25	146.09
1000.61	155.8
1000.97	167.93
1001.329	160.65
1001.689	143.66
1002.049	133.95
1002.409	133.95
1002.768	131.53
1003.128	214.05
1003.487	141.23
1003.847	141.23
1004.206	85.41
1004.566	158.22
1004.925	221.33
1005.284	218.91
1005.643	180.07
1006.003	129.1
1006.362	172.79
1006.721	155.8
1007.08	133.95
1007.438	170.36
1007.797	119.39
1008.156	167.93
1008.515	136.38
1008.874	177.64
1009.232	194.63
1009.591	163.08
1009.949	231.04
1010.308	209.2
1010.666	146.09
1011.024	201.91
1011.383	53.85
1011.741	143.66
1012.099	170.36
1012.457	146.09
1012.815	153.37
1013.173	131.53
1013.531	114.53
1013.889	175.22
1014.247	172.79
1014.605	165.51
1014.962	133.95
1015.32	112.11
1015.678	126.67
1016.035	70.84
1016.393	155.8
1016.75	194.63
1017.107	138.81
1017.465	129.1
1017.822	146.09
1018.179	119.39
1018.536	165.51
1018.894	158.22
1019.251	112.11
1019.608	197.06
1019.964	148.52
1020.321	209.2
1020.678	187.35
1021.035	177.64
1021.392	194.63
1021.748	138.81
1022.105	218.91
1022.461	150.94
1022.818	165.51
1023.174	170.36
1023.531	209.2
1023.887	167.93
1024.243	160.65
1024.599	189.78
1024.955	153.37
1025.311	121.82
1025.667	197.06
1026.023	143.66
1026.379	150.94
1026.735	136.38
1027.091	143.66
1027.447	221.33
