189.514	79.95
189.973	79.95
190.431	79.95
190.889	-43.84
191.348	-41.41
191.806	21.69
192.264	70.24
192.722	-22
193.18	-41.41
193.638	-9.86
194.096	7.13
194.554	-5.01
195.012	-17.14
195.47	-38.99
195.928	19.27
196.385	11.98
196.843	-51.12
197.301	-63.26
197.758	4.7
198.216	-19.57
198.674	72.66
199.131	82.37
199.589	109.07
200.046	36.26
200.503	87.23
200.961	70.24
201.418	113.93
201.875	82.37
202.332	21.69
202.79	60.53
203.247	133.35
203.704	43.54
204.161	145.48
204.618	169.75
205.075	145.48
205.532	94.51
205.989	186.74
206.445	174.61
206.902	160.04
207.359	213.44
207.816	145.48
208.272	179.46
208.729	89.66
209.185	121.21
209.642	128.49
210.098	155.19
210.555	247.42
211.011	138.2
211.467	164.9
211.924	152.76
212.38	155.19
212.836	126.06
213.292	89.66
213.748	111.5
214.204	111.5
214.66	203.73
215.116	191.6
215.572	126.06
216.028	89.66
216.484	157.62
216.94	172.18
217.396	181.89
217.851	143.05
218.307	123.64
218.763	186.74
219.218	147.91
219.674	167.33
220.129	123.64
220.585	92.08
221.04	186.74
221.496	172.18
221.951	130.92
222.406	152.76
222.861	189.17
223.317	194.03
223.772	104.22
224.227	147.91
224.682	167.33
225.137	84.8
225.592	111.5
226.047	104.22
226.502	143.05
226.957	169.75
227.411	96.94
227.866	50.82
228.321	116.35
228.776	118.78
229.23	138.2
229.685	72.66
230.139	208.59
230.594	167.33
231.048	133.35
231.503	157.62
231.957	145.48
232.411	145.48
232.865	184.32
233.32	147.91
233.774	181.89
234.228	184.32
234.682	140.63
235.136	152.76
235.59	101.79
236.044	203.73
236.498	152.76
236.952	140.63
237.406	162.47
237.86	101.79
238.313	179.46
238.767	184.32
239.221	135.77
239.674	113.93
240.128	135.77
240.581	201.31
241.035	150.34
241.488	130.92
241.942	228.01
242.395	128.49
242.848	128.49
243.301	186.74
243.755	186.74
244.208	155.19
244.661	155.19
245.114	155.19
245.567	99.36
246.02	145.48
246.473	181.89
246.926	99.36
247.379	111.5
247.832	133.35
248.284	150.34
248.737	133.35
249.19	138.2
249.642	157.62
250.095	60.53
250.547	169.75
251	186.74
251.452	147.91
251.905	150.34
252.357	111.5
252.81	135.77
253.262	116.35
253.714	126.06
254.166	84.8
254.618	130.92
255.07	179.46
255.523	181.89
255.975	113.93
256.427	177.04
256.878	230.43
257.33	162.47
257.782	249.85
258.234	242.57
258.686	167.33
259.137	130.92
259.589	118.78
260.041	143.05
260.492	123.64
260.944	84.8
261.395	133.35
261.847	177.04
262.298	189.17
262.749	150.34
263.201	150.34
263.652	152.76
264.103	157.62
264.554	138.2
265.005	189.17
265.457	111.5
265.908	177.04
266.359	79.95
266.809	138.2
267.26	121.21
267.711	181.89
268.162	232.86
268.613	172.18
269.064	164.9
269.514	101.79
269.965	82.37
270.415	118.78
270.866	167.33
271.316	118.78
271.767	104.22
272.217	162.47
272.668	145.48
273.118	169.75
273.568	155.19
274.019	157.62
274.469	123.64
274.919	126.06
275.369	130.92
275.819	104.22
276.269	126.06
276.719	118.78
277.169	172.18
277.619	211.02
278.069	160.04
278.518	172.18
278.968	147.91
279.418	155.19
279.867	121.21
280.317	123.64
280.767	147.91
281.216	96.94
281.666	167.33
282.115	169.75
282.564	143.05
283.014	121.21
283.463	109.07
283.912	109.07
284.361	184.32
284.811	106.65
285.26	67.81
285.709	147.91
286.158	179.46
286.607	109.07
287.056	160.04
287.505	123.64
287.953	121.21
288.402	128.49
288.851	184.32
289.3	167.33
289.748	133.35
290.197	126.06
290.646	201.31
291.094	143.05
291.543	162.47
291.991	245
292.439	106.65
292.888	133.35
293.336	143.05
293.784	62.96
294.233	169.75
294.681	126.06
295.129	211.02
295.577	191.6
296.025	162.47
296.473	184.32
296.921	179.46
297.369	172.18
297.817	140.63
298.264	145.48
298.712	143.05
299.16	186.74
299.608	126.06
300.055	152.76
300.503	130.92
300.95	191.6
301.398	160.04
301.845	121.21
302.293	138.2
302.74	179.46
303.187	191.6
303.635	150.34
304.082	164.9
304.529	198.88
304.976	157.62
305.423	160.04
305.87	123.64
306.317	167.33
306.764	150.34
307.211	181.89
307.658	123.64
308.105	160.04
308.552	172.18
308.998	155.19
309.445	118.78
309.892	186.74
310.338	191.6
310.785	133.35
311.231	177.04
311.678	184.32
312.124	167.33
312.571	167.33
313.017	118.78
313.463	41.11
313.909	133.35
314.356	79.95
314.802	118.78
315.248	116.35
315.694	130.92
316.14	157.62
316.586	128.49
317.032	126.06
317.478	213.44
317.923	140.63
318.369	140.63
318.815	92.08
319.261	99.36
319.706	147.91
320.152	160.04
320.597	82.37
321.043	143.05
321.488	155.19
321.934	203.73
322.379	138.2
322.824	218.3
323.27	106.65
323.715	191.6
324.16	140.63
324.605	181.89
325.05	160.04
325.495	121.21
325.94	145.48
326.385	167.33
326.83	155.19
327.275	99.36
327.72	135.77
328.165	181.89
328.61	157.62
329.054	126.06
329.499	150.34
329.943	201.31
330.388	113.93
330.832	150.34
331.277	162.47
331.721	184.32
332.166	237.72
332.61	118.78
333.054	133.35
333.499	155.19
333.943	96.94
334.387	111.5
334.831	77.52
335.275	228.01
335.719	196.45
336.163	145.48
336.607	191.6
337.051	150.34
337.495	116.35
337.938	140.63
338.382	172.18
338.826	147.91
339.269	130.92
339.713	145.48
340.157	162.47
340.6	123.64
341.044	128.49
341.487	99.36
341.93	164.9
342.374	140.63
342.817	143.05
343.26	128.49
343.703	75.09
344.146	109.07
344.59	157.62
345.033	155.19
345.476	167.33
345.919	145.48
346.361	164.9
346.804	164.9
347.247	130.92
347.69	143.05
348.133	143.05
348.575	184.32
349.018	118.78
349.461	145.48
349.903	181.89
350.346	118.78
350.788	201.31
351.23	189.17
351.673	140.63
352.115	218.3
352.557	147.91
353	208.59
353.442	116.35
353.884	140.63
354.326	116.35
354.768	118.78
355.21	145.48
355.652	123.64
356.094	179.46
356.536	113.93
356.978	191.6
357.419	215.87
357.861	186.74
358.303	106.65
358.744	53.25
359.186	106.65
359.627	215.87
360.069	133.35
360.51	174.61
360.952	184.32
361.393	121.21
361.834	133.35
362.276	215.87
362.717	152.76
363.158	152.76
363.599	169.75
364.04	147.91
364.481	196.45
364.922	169.75
365.363	128.49
365.804	201.31
366.245	174.61
366.686	203.73
367.126	135.77
367.567	218.3
368.008	169.75
368.448	189.17
368.889	160.04
369.33	240.14
369.77	177.04
370.21	174.61
370.651	138.2
371.091	116.35
371.531	147.91
371.972	174.61
372.412	172.18
372.852	140.63
373.292	167.33
373.732	87.23
374.172	77.52
374.612	152.76
375.052	133.35
375.492	121.21
375.932	126.06
376.372	189.17
376.811	218.3
377.251	96.94
377.691	172.18
378.13	111.5
378.57	167.33
379.009	208.59
379.449	155.19
379.888	157.62
380.328	169.75
380.767	130.92
381.206	111.5
381.645	174.61
382.085	106.65
382.524	133.35
382.963	128.49
383.402	140.63
383.841	164.9
384.28	128.49
384.719	135.77
385.158	196.45
385.596	215.87
386.035	198.88
386.474	174.61
386.913	208.59
387.351	123.64
387.79	157.62
388.228	157.62
388.667	155.19
389.105	128.49
389.544	177.04
389.982	191.6
390.42	189.17
390.859	133.35
391.297	87.23
391.735	196.45
392.173	194.03
392.611	128.49
393.049	172.18
393.487	150.34
393.925	177.04
394.363	121.21
394.801	152.76
395.239	155.19
395.676	179.46
396.114	191.6
396.552	147.91
396.989	145.48
397.427	138.2
397.864	164.9
398.302	121.21
398.739	189.17
399.177	157.62
399.614	150.34
400.051	194.03
400.488	143.05
400.926	189.17
401.363	138.2
401.8	196.45
402.237	116.35
402.674	140.63
403.111	189.17
403.548	143.05
403.985	194.03
404.421	126.06
404.858	135.77
405.295	123.64
405.732	145.48
406.168	172.18
406.605	186.74
407.041	130.92
407.478	164.9
407.914	140.63
408.351	179.46
408.787	140.63
409.223	133.35
409.66	181.89
410.096	220.73
410.532	181.89
410.968	196.45
411.404	208.59
411.84	128.49
412.276	152.76
412.712	147.91
413.148	113.93
413.584	167.33
414.02	147.91
414.455	133.35
414.891	140.63
415.327	126.06
415.762	106.65
416.198	133.35
416.633	177.04
417.069	113.93
417.504	215.87
417.94	138.2
418.375	140.63
418.81	145.48
419.245	135.77
419.681	181.89
420.116	140.63
420.551	162.47
420.986	145.48
421.421	220.73
421.856	135.77
422.291	145.48
422.726	135.77
423.16	101.79
423.595	155.19
424.03	189.17
424.464	220.73
424.899	194.03
425.334	123.64
425.768	157.62
426.203	249.85
426.637	145.48
427.071	138.2
427.506	162.47
427.94	143.05
428.374	172.18
428.809	140.63
429.243	157.62
429.677	196.45
430.111	179.46
430.545	150.34
430.979	140.63
431.413	152.76
431.847	184.32
432.28	130.92
432.714	150.34
433.148	121.21
433.582	111.5
434.015	203.73
434.449	101.79
434.882	145.48
435.316	126.06
435.749	96.94
436.183	145.48
436.616	240.14
437.049	208.59
437.483	162.47
437.916	164.9
438.349	133.35
438.782	179.46
439.215	157.62
439.648	126.06
440.081	135.77
440.514	152.76
440.947	164.9
441.38	169.75
441.813	189.17
442.245	196.45
442.678	143.05
443.111	157.62
443.543	106.65
443.976	194.03
444.408	143.05
444.841	138.2
445.273	247.42
445.705	220.73
446.138	121.21
446.57	177.04
447.002	116.35
447.434	150.34
447.867	213.44
448.299	220.73
448.731	201.31
449.163	162.47
449.595	186.74
450.026	208.59
450.458	164.9
450.89	150.34
451.322	186.74
451.754	196.45
452.185	147.91
452.617	230.43
453.048	201.31
453.48	206.16
453.911	242.57
454.343	191.6
454.774	138.2
455.205	84.8
455.637	184.32
456.068	261.99
456.499	150.34
456.93	138.2
457.361	82.37
457.792	99.36
458.223	145.48
458.654	164.9
459.085	230.43
459.516	235.29
459.947	167.33
460.378	169.75
460.808	194.03
461.239	150.34
461.669	155.19
462.1	179.46
462.531	133.35
462.961	140.63
463.391	126.06
463.822	126.06
464.252	140.63
464.682	211.02
465.113	133.35
465.543	225.58
465.973	167.33
466.403	99.36
466.833	177.04
467.263	128.49
467.693	174.61
468.123	162.47
468.553	123.64
468.983	189.17
469.412	145.48
469.842	138.2
470.272	179.46
470.701	196.45
471.131	121.21
471.56	162.47
471.99	152.76
472.419	87.23
472.849	179.46
473.278	186.74
473.707	101.79
474.136	177.04
474.566	177.04
474.995	208.59
475.424	160.04
475.853	164.9
476.282	186.74
476.711	99.36
477.14	130.92
477.569	155.19
477.997	111.5
478.426	123.64
478.855	211.02
479.283	169.75
479.712	164.9
480.141	128.49
480.569	218.3
480.998	172.18
481.426	167.33
481.854	191.6
482.283	157.62
482.711	104.22
483.139	162.47
483.567	77.52
483.995	126.06
484.424	123.64
484.852	164.9
485.28	150.34
485.708	230.43
486.135	242.57
486.563	157.62
486.991	174.61
487.419	160.04
487.847	133.35
488.274	109.07
488.702	228.01
489.129	145.48
489.557	126.06
489.984	164.9
490.412	113.93
490.839	118.78
491.266	116.35
491.694	218.3
492.121	162.47
492.548	116.35
492.975	160.04
493.402	118.78
493.829	113.93
494.256	152.76
494.683	157.62
495.11	172.18
495.537	167.33
495.964	109.07
496.39	123.64
496.817	211.02
497.244	198.88
497.67	150.34
498.097	133.35
498.523	121.21
498.95	145.48
499.376	152.76
499.803	121.21
500.229	145.48
500.655	181.89
501.081	101.79
501.508	230.43
501.934	33.83
502.36	150.34
502.786	172.18
503.212	130.92
503.638	155.19
504.064	179.46
504.489	169.75
504.915	133.35
505.341	172.18
505.767	152.76
506.192	194.03
506.618	126.06
507.043	184.32
507.469	140.63
507.894	87.23
508.32	126.06
508.745	130.92
509.17	177.04
509.596	167.33
510.021	128.49
510.446	89.66
510.871	164.9
511.296	79.95
511.721	177.04
512.146	186.74
512.571	155.19
512.996	179.46
513.421	116.35
513.845	181.89
514.27	145.48
514.695	191.6
515.119	140.63
515.544	133.35
515.969	145.48
516.393	121.21
516.817	174.61
517.242	208.59
517.666	160.04
518.09	157.62
518.515	140.63
518.939	147.91
519.363	356.65
519.787	215.87
520.211	140.63
520.635	172.18
521.059	179.46
521.483	228.01
521.907	118.78
522.331	116.35
522.754	189.17
523.178	123.64
523.602	223.15
524.025	186.74
524.449	172.18
524.872	181.89
525.296	118.78
525.719	126.06
526.143	174.61
526.566	147.91
526.989	138.2
527.412	113.93
527.836	167.33
528.259	179.46
528.682	111.5
529.105	189.17
529.528	213.44
529.951	109.07
530.374	116.35
530.796	121.21
531.219	152.76
531.642	106.65
532.065	177.04
532.487	152.76
532.91	160.04
533.332	179.46
533.755	164.9
534.177	143.05
534.6	189.17
535.022	135.77
535.444	160.04
535.867	184.32
536.289	164.9
536.711	155.19
537.133	201.31
537.555	194.03
537.977	79.95
538.399	167.33
538.821	140.63
539.243	162.47
539.665	128.49
540.086	155.19
540.508	123.64
540.93	208.59
541.351	172.18
541.773	213.44
542.195	143.05
542.616	172.18
543.037	145.48
543.459	128.49
543.88	169.75
544.301	203.73
544.723	121.21
545.144	150.34
545.565	174.61
545.986	150.34
546.407	138.2
546.828	116.35
547.249	162.47
547.67	225.58
548.091	245
548.512	126.06
548.932	96.94
549.353	118.78
549.774	138.2
550.194	133.35
550.615	96.94
551.035	155.19
551.456	177.04
551.876	109.07
552.296	135.77
552.717	135.77
553.137	94.51
553.557	106.65
553.977	177.04
554.397	140.63
554.817	140.63
555.237	135.77
555.657	140.63
556.077	104.22
556.497	138.2
556.917	140.63
557.337	135.77
557.756	177.04
558.176	169.75
558.596	186.74
559.015	228.01
559.435	198.88
559.854	208.59
560.274	157.62
560.693	87.23
561.112	184.32
561.532	164.9
561.951	145.48
562.37	150.34
562.789	164.9
563.208	164.9
563.627	162.47
564.046	116.35
564.465	150.34
564.884	101.79
565.303	145.48
565.722	143.05
566.14	152.76
566.559	179.46
566.978	133.35
567.396	99.36
567.815	184.32
568.233	211.02
568.652	189.17
569.07	169.75
569.489	167.33
569.907	160.04
570.325	155.19
570.743	198.88
571.161	143.05
571.58	135.77
571.998	164.9
572.416	220.73
572.833	140.63
573.251	130.92
573.669	181.89
574.087	140.63
574.505	167.33
574.922	157.62
575.34	138.2
575.758	140.63
576.175	179.46
576.593	167.33
577.01	172.18
577.428	155.19
577.845	1740.17
578.262	235.29
578.68	184.32
579.097	201.31
579.514	164.9
579.931	174.61
580.348	167.33
580.765	191.6
581.182	104.22
581.599	157.62
582.016	230.43
582.433	106.65
582.849	135.77
583.266	143.05
583.683	162.47
584.099	128.49
584.516	167.33
584.933	189.17
585.349	155.19
585.765	191.6
586.182	150.34
586.598	89.66
587.014	128.49
587.431	225.58
587.847	118.78
588.263	128.49
588.679	198.88
589.095	167.33
589.511	230.43
589.927	172.18
590.343	111.5
590.759	225.58
591.174	155.19
591.59	218.3
592.006	172.18
592.421	155.19
592.837	169.75
593.252	230.43
593.668	164.9
594.083	211.02
594.499	208.59
594.914	174.61
595.329	152.76
595.745	186.74
596.16	240.14
596.575	177.04
596.99	218.3
597.405	167.33
597.82	135.77
598.235	145.48
598.65	225.58
599.065	116.35
599.479	203.73
599.894	133.35
600.309	179.46
600.724	218.3
601.138	198.88
601.553	181.89
601.967	157.62
602.382	94.51
602.796	145.48
603.21	157.62
603.625	169.75
604.039	116.35
604.453	169.75
604.867	169.75
605.281	145.48
605.695	172.18
606.109	215.87
606.523	147.91
606.937	167.33
607.351	329.95
607.765	230.43
608.178	174.61
608.592	87.23
609.006	111.5
609.419	177.04
609.833	109.07
610.246	118.78
610.66	203.73
611.073	189.17
611.487	220.73
611.9	191.6
612.313	215.87
612.726	220.73
613.139	138.2
613.553	157.62
613.966	191.6
614.379	232.86
614.792	254.71
615.204	174.61
615.617	249.85
616.03	223.15
616.443	242.57
616.856	184.32
617.268	174.61
617.681	189.17
618.093	106.65
618.506	162.47
618.918	164.9
619.331	215.87
619.743	235.29
620.155	242.57
620.568	104.22
620.98	189.17
621.392	155.19
621.804	164.9
622.216	179.46
622.628	194.03
623.04	126.06
623.452	121.21
623.864	138.2
624.276	150.34
624.687	145.48
625.099	172.18
625.511	143.05
625.922	133.35
626.334	252.28
626.745	135.77
627.157	184.32
627.568	211.02
627.979	138.2
628.391	160.04
628.802	140.63
629.213	162.47
629.624	116.35
630.035	191.6
630.446	181.89
630.857	198.88
631.268	201.31
631.679	162.47
632.09	116.35
632.501	140.63
632.912	111.5
633.322	213.44
633.733	150.34
634.144	147.91
634.554	206.16
634.965	152.76
635.375	189.17
635.785	140.63
636.196	145.48
636.606	143.05
637.016	198.88
637.427	150.34
637.837	147.91
638.247	184.32
638.657	174.61
639.067	128.49
639.477	269.27
639.887	145.48
640.297	157.62
640.706	247.42
641.116	269.27
641.526	128.49
641.935	225.58
642.345	169.75
642.755	164.9
643.164	211.02
643.573	215.87
643.983	135.77
644.392	213.44
644.801	177.04
645.211	194.03
645.62	145.48
646.029	191.6
646.438	109.07
646.847	179.46
647.256	104.22
647.665	162.47
648.074	228.01
648.483	130.92
648.892	118.78
649.3	150.34
649.709	169.75
650.118	96.94
650.526	179.46
650.935	191.6
651.343	191.6
651.752	206.16
652.16	77.52
652.568	116.35
652.977	147.91
653.385	143.05
653.793	194.03
654.201	179.46
654.609	104.22
655.017	181.89
655.425	186.74
655.833	181.89
656.241	172.18
656.649	162.47
657.057	92.08
657.464	84.8
657.872	150.34
658.28	160.04
658.687	121.21
659.095	201.31
659.502	247.42
659.91	177.04
660.317	218.3
660.724	177.04
661.132	189.17
661.539	208.59
661.946	201.31
662.353	138.2
662.76	177.04
663.167	164.9
663.574	181.89
663.981	172.18
664.388	147.91
664.795	111.5
665.202	155.19
665.608	96.94
666.015	152.76
666.422	79.95
666.828	152.76
667.235	201.31
667.641	126.06
668.047	150.34
668.454	104.22
668.86	203.73
669.266	177.04
669.673	181.89
670.079	201.31
670.485	152.76
670.891	181.89
671.297	143.05
671.703	116.35
672.109	145.48
672.515	143.05
672.92	152.76
673.326	184.32
673.732	177.04
674.138	198.88
674.543	143.05
674.949	126.06
675.354	157.62
675.76	152.76
676.165	179.46
676.57	164.9
676.976	189.17
677.381	194.03
677.786	191.6
678.191	174.61
678.596	147.91
679.001	186.74
679.406	215.87
679.811	211.02
680.216	184.32
680.621	215.87
681.026	133.35
681.43	191.6
681.835	150.34
682.24	179.46
682.644	184.32
683.049	179.46
683.453	169.75
683.858	172.18
684.262	157.62
684.667	150.34
685.071	177.04
685.475	160.04
685.879	92.08
686.283	174.61
686.687	145.48
687.091	99.36
687.495	177.04
687.899	194.03
688.303	189.17
688.707	138.2
689.111	113.93
689.514	167.33
689.918	213.44
690.322	72.66
690.725	203.73
691.129	164.9
691.532	121.21
691.936	201.31
692.339	138.2
692.742	167.33
693.146	169.75
693.549	213.44
693.952	194.03
694.355	196.45
694.758	196.45
695.161	211.02
695.564	116.35
695.967	206.16
696.37	77.52
696.773	179.46
697.175	143.05
697.578	218.3
697.981	198.88
698.383	138.2
698.786	118.78
699.188	164.9
699.591	189.17
699.993	220.73
700.395	189.17
700.798	218.3
701.2	126.06
701.602	228.01
702.004	218.3
702.406	235.29
702.808	186.74
703.21	145.48
703.612	264.42
704.014	189.17
704.416	172.18
704.818	172.18
705.219	179.46
705.621	191.6
706.023	150.34
706.424	213.44
706.826	186.74
707.227	245
707.629	208.59
708.03	208.59
708.431	240.14
708.832	184.32
709.234	191.6
709.635	274.12
710.036	220.73
710.437	206.16
710.838	242.57
711.239	254.71
711.64	186.74
712.041	303.25
712.441	286.26
712.842	278.98
713.243	245
713.643	259.56
714.044	235.29
714.445	312.96
714.845	225.58
715.246	315.39
715.646	220.73
716.046	240.14
716.447	283.83
716.847	278.98
717.247	315.39
717.647	339.66
718.047	286.26
718.447	288.69
718.847	281.41
719.247	344.51
719.647	332.38
720.047	368.79
720.446	283.83
720.846	332.38
721.246	293.54
721.645	371.21
722.045	300.82
722.444	376.07
722.844	419.76
723.243	446.46
723.643	366.36
724.042	468.3
724.441	390.63
724.84	439.18
725.24	412.48
725.639	424.61
726.038	419.76
726.437	366.36
726.836	509.56
727.234	448.88
727.633	478.01
728.032	451.31
728.431	431.89
728.83	570.25
729.228	504.71
729.627	514.42
730.025	526.56
730.424	684.32
730.822	613.94
731.22	701.32
731.619	774.13
732.017	868.79
732.415	931.9
732.813	871.22
733.212	941.61
733.61	1113.94
734.008	1094.53
734.406	1172.2
734.803	1271.71
735.201	1373.66
735.599	1485.31
735.997	1448.9
736.395	1628.51
736.792	1582.4
737.19	1793.57
737.587	1769.29
737.985	1844.54
738.382	1897.94
738.78	2089.69
739.177	2101.82
739.574	2296
739.971	2354.25
740.369	2497.46
740.766	2647.95
741.163	2684.36
741.56	2880.96
741.957	2931.93
742.354	3087.27
742.751	3111.55
743.147	3293.59
743.544	3405.24
743.941	3393.1
744.338	3723.21
744.734	3808.16
745.131	3931.95
745.527	4208.65
745.924	4560.6
746.32	4604.29
746.716	4771.77
747.113	5065.46
747.509	5259.64
747.905	5429.54
748.301	5873.73
748.697	5898
749.093	6495.09
749.489	6298.49
749.885	6754.81
750.281	7067.92
750.677	7448.99
751.073	7514.53
751.468	7868.9
751.864	8216
752.26	8305.8
752.655	8876.2
753.051	9325.24
753.446	9631.07
753.842	9788.84
754.237	10250.01
754.632	10514.57
755.028	10808.27
755.423	10917.49
755.818	10936.91
756.213	11412.65
756.608	11750.03
757.003	11817.99
757.398	12092.27
757.793	12019.45
758.188	12735.48
758.583	12628.69
758.977	12953.93
759.372	13250.05
759.767	14356.87
760.161	14757.36
760.556	15538.92
760.95	15941.84
761.345	16521.95
761.739	17524.39
762.133	18230.71
762.527	18655.48
762.922	19058.4
763.316	20012.3
763.71	19963.75
764.104	20500.17
764.498	20752.6
764.892	21954.07
765.286	21946.79
765.68	23082.73
766.073	22968.65
766.467	23514.78
766.861	23820.61
767.255	24949.27
767.648	25730.83
768.042	25874.04
768.435	26225.98
768.829	26077.92
769.222	27284.25
769.615	27728.43
770.008	27682.32
770.402	27745.43
770.795	29024.57
771.188	28179.9
771.581	28723.6
771.974	28730.88
772.367	28347.38
772.76	28209.02
773.153	28119.22
773.545	28526.99
773.938	28403.2
774.331	29403.22
774.724	29092.53
775.116	31012.47
775.509	31900.83
775.901	33308.62
776.294	33328.04
776.686	34272.23
777.078	34709.13
777.471	35697.01
777.863	37080.52
778.255	37743.15
778.647	38726.18
779.039	38126.65
779.431	38670.35
779.823	38910.65
780.215	39413.08
780.607	38711.62
780.999	40131.54
781.39	40544.17
781.782	39925.23
782.174	41053.88
782.565	41294.18
782.957	41029.61
783.348	41600.01
783.74	42039.34
784.131	41146.12
784.522	41488.36
784.914	42046.62
785.305	40733.49
785.696	41017.48
786.087	40313.58
786.478	39942.22
786.869	38599.96
787.26	38090.25
787.651	37391.21
788.042	37109.65
788.433	36221.29
788.823	35243.11
789.214	35820.79
789.605	34048.92
789.995	33828.04
790.386	33005.22
790.776	32978.52
791.167	32706.67
791.557	32318.31
791.948	34415.43
792.338	33942.12
792.728	35427.58
793.118	34735.83
793.508	35235.83
793.898	35604.77
794.288	35209.13
794.678	36039.24
795.068	34968.84
795.458	35119.33
795.848	34590.19
796.238	34682.43
796.627	35427.58
797.017	34561.07
797.406	34910.59
797.796	34022.22
798.185	35070.78
798.575	34684.85
798.964	34930
799.354	35073.21
799.743	34473.69
800.132	35226.12
800.521	34510.09
800.91	35468.85
801.299	33240.66
801.688	34561.07
802.077	33629.01
802.466	33315.9
802.855	32927.54
803.244	31779.47
803.633	32048.89
804.021	31247.91
804.41	30490.61
804.799	30425.08
805.187	28908.06
805.576	29289.14
805.964	28209.02
806.352	27473.58
806.741	27476
807.129	26376.47
807.517	27133.77
807.905	26917.74
808.293	27124.06
808.681	26971.14
809.069	26713.86
809.457	27784.26
809.845	27153.18
810.233	27357.07
810.621	27422.6
811.009	27643.48
811.396	27704.16
811.784	27102.21
812.171	27165.32
812.559	26381.33
812.946	26757.55
813.334	26182.29
813.721	25560.93
814.108	25255.1
814.496	24548.77
814.883	24119.16
815.27	24633.73
815.657	24257.51
816.044	24548.77
816.431	24060.9
816.818	23713.81
817.205	23298.75
817.592	23781.77
817.979	22866.71
818.365	22133.69
818.752	21808.44
819.139	20844.83
819.525	20505.02
819.912	20102.1
820.298	19628.79
820.685	19645.78
821.071	18907.91
821.457	18907.91
821.843	17517.11
822.23	17063.22
822.616	16679.72
823.002	15907.86
823.388	15347.17
823.774	14815.61
824.16	14092.3
824.546	14177.25
824.931	13638.41
825.317	13279.18
825.703	13555.88
826.089	13101.99
826.474	13223.35
826.86	12597.13
827.245	12575.29
827.631	12737.91
828.016	12196.64
828.401	12029.16
828.787	11669.93
829.172	11225.75
829.557	10924.78
829.942	10798.56
830.327	10832.54
830.712	10283.99
831.097	9774.27
831.482	9888.35
831.867	9368.93
832.252	9288.83
832.636	9055.81
833.021	8939.31
833.406	8951.44
833.79	8594.64
834.175	8354.35
834.559	8383.47
834.944	8036.38
835.328	7742.69
835.713	7463.56
836.097	7390.74
836.481	7084.91
836.865	6915
837.249	6737.82
837.633	6502.38
838.017	6305.77
838.401	6252.37
838.785	5856.74
839.169	5711.1
839.553	5597.02
839.937	5167.4
840.32	5063.03
840.704	4788.76
841.087	4424.67
841.471	4378.56
841.854	4320.3
842.238	4123.7
842.621	3997.48
843.004	3905.25
843.388	3837.29
843.771	3783.89
844.154	3720.78
844.537	3669.81
844.92	3645.54
845.303	3495.05
845.686	3497.48
846.069	3451.36
846.452	3388.25
846.834	3281.45
847.217	3092.13
847.6	3201.35
847.982	3063
848.365	3004.75
848.748	2895.52
849.13	2885.82
849.512	2725.62
849.895	2650.37
850.277	2701.35
850.659	2519.3
851.041	2519.3
851.423	2536.3
851.806	2266.87
852.188	2262.02
852.57	2356.68
852.951	2237.75
853.333	2143.09
853.715	2145.51
854.097	2041.14
854.479	2016.87
854.86	1861.53
855.242	1771.72
855.623	1832.4
856.005	1846.96
856.386	1774.15
856.768	1616.38
857.149	1628.51
857.53	1524.14
857.911	1504.73
858.292	1393.07
858.674	1332.39
859.055	1344.53
859.436	1184.33
859.817	1162.49
860.197	1143.07
860.578	1109.09
860.959	1104.23
861.34	1065.4
861.72	990.15
862.101	1012
862.482	948.89
862.862	924.62
863.243	839.67
863.623	973.16
864.003	880.93
864.384	834.81
864.764	890.64
865.144	834.81
865.524	764.42
865.904	810.54
866.284	791.12
866.664	696.46
867.044	623.64
867.424	577.53
867.804	669.76
868.183	723.16
868.563	594.52
868.943	626.07
869.322	579.95
869.702	645.49
870.081	613.94
870.461	558.11
870.84	594.52
871.22	599.37
871.599	536.26
871.978	473.16
872.357	412.48
872.736	444.03
873.115	359.08
873.494	390.63
873.873	453.74
874.252	390.63
874.631	342.09
875.01	388.2
875.388	395.49
875.767	342.09
876.146	310.53
876.524	444.03
876.903	329.95
877.281	261.99
877.66	325.1
878.038	278.98
878.416	366.36
878.794	378.49
879.173	312.96
879.551	269.27
879.929	189.17
880.307	288.69
880.685	242.57
881.063	320.24
881.441	317.81
881.818	303.25
882.196	286.26
882.574	237.72
882.951	228.01
883.329	235.29
883.707	305.68
884.084	261.99
884.461	342.09
884.839	213.44
885.216	201.31
885.593	257.13
885.971	332.38
886.348	242.57
886.725	203.73
887.102	225.58
887.479	220.73
887.856	213.44
888.233	213.44
888.609	288.69
888.986	283.83
889.363	225.58
889.74	249.85
890.116	252.28
890.493	240.14
890.869	208.59
891.246	261.99
891.622	172.18
891.998	155.19
892.375	164.9
892.751	174.61
893.127	184.32
893.503	196.45
893.879	164.9
894.255	160.04
894.631	184.32
895.007	150.34
895.383	155.19
895.759	157.62
896.134	281.41
896.51	189.17
896.886	177.04
897.261	184.32
897.637	164.9
898.012	189.17
898.388	208.59
898.763	186.74
899.138	164.9
899.514	198.88
899.889	157.62
900.264	206.16
900.639	213.44
901.014	186.74
901.389	104.22
901.764	191.6
902.139	128.49
902.513	92.08
902.888	140.63
903.263	135.77
903.638	228.01
904.012	133.35
904.387	203.73
904.761	191.6
905.136	106.65
905.51	111.5
905.884	118.78
906.259	145.48
906.633	130.92
907.007	123.64
907.381	169.75
907.755	126.06
908.129	143.05
908.503	194.03
908.877	162.47
909.251	235.29
909.624	147.91
909.998	147.91
910.372	169.75
910.745	186.74
911.119	121.21
911.492	147.91
911.866	84.8
912.239	130.92
912.612	145.48
912.986	145.48
913.359	152.76
913.732	116.35
914.105	160.04
914.478	116.35
914.851	213.44
915.224	145.48
915.597	177.04
915.97	116.35
916.343	150.34
916.715	206.16
917.088	145.48
917.461	150.34
917.833	198.88
918.206	208.59
918.578	179.46
918.951	111.5
919.323	174.61
919.695	133.35
920.067	196.45
920.44	87.23
920.812	191.6
921.184	118.78
921.556	189.17
921.928	194.03
922.3	206.16
922.672	145.48
923.043	167.33
923.415	181.89
923.787	174.61
924.158	130.92
924.53	189.17
924.901	191.6
925.273	96.94
925.644	172.18
926.016	196.45
926.387	143.05
926.758	177.04
927.129	140.63
927.5	155.19
927.872	181.89
928.243	179.46
928.613	140.63
928.984	177.04
929.355	186.74
929.726	116.35
930.097	169.75
930.467	140.63
930.838	172.18
931.209	184.32
931.579	82.37
931.95	130.92
932.32	172.18
932.69	186.74
933.061	242.57
933.431	162.47
933.801	184.32
934.171	109.07
934.541	106.65
934.911	104.22
935.281	160.04
935.651	77.52
936.021	164.9
936.391	181.89
936.761	104.22
937.13	215.87
937.5	135.77
937.87	135.77
938.239	162.47
938.609	196.45
938.978	164.9
939.347	206.16
939.717	140.63
940.086	167.33
940.455	167.33
940.824	111.5
941.193	118.78
941.562	203.73
941.931	152.76
942.3	223.15
942.669	133.35
943.038	138.2
943.407	116.35
943.775	106.65
944.144	140.63
944.513	152.76
944.881	145.48
945.25	177.04
945.618	77.52
945.986	157.62
946.355	169.75
946.723	118.78
947.091	113.93
947.459	157.62
947.827	155.19
948.195	172.18
948.563	145.48
948.931	118.78
949.299	184.32
949.667	106.65
950.035	140.63
950.402	201.31
950.77	174.61
951.138	215.87
951.505	164.9
951.873	123.64
952.24	60.53
952.607	206.16
952.975	201.31
953.342	189.17
953.709	106.65
954.076	101.79
954.443	79.95
954.81	140.63
955.177	189.17
955.544	138.2
955.911	189.17
956.278	164.9
956.645	206.16
957.012	160.04
957.378	106.65
957.745	123.64
958.111	147.91
958.478	237.72
958.844	184.32
959.211	160.04
959.577	184.32
959.943	155.19
960.309	179.46
960.675	276.55
961.042	145.48
961.408	143.05
961.774	106.65
962.139	186.74
962.505	96.94
962.871	157.62
963.237	206.16
963.603	206.16
963.968	184.32
964.334	194.03
964.699	123.64
965.065	106.65
965.43	179.46
965.796	106.65
966.161	150.34
966.526	140.63
966.891	157.62
967.256	174.61
967.622	198.88
967.987	62.96
968.352	55.67
968.716	118.78
969.081	218.3
969.446	172.18
969.811	160.04
970.176	172.18
970.54	189.17
970.905	181.89
971.269	172.18
971.634	89.66
971.998	113.93
972.363	150.34
972.727	118.78
973.091	167.33
973.455	89.66
973.819	157.62
974.183	126.06
974.547	147.91
974.911	111.5
975.275	164.9
975.639	162.47
976.003	191.6
976.367	135.77
976.73	147.91
977.094	101.79
977.458	198.88
977.821	172.18
978.185	189.17
978.548	177.04
978.911	104.22
979.275	96.94
979.638	133.35
980.001	123.64
980.364	130.92
980.727	155.19
981.09	211.02
981.453	225.58
981.816	89.66
982.179	211.02
982.542	196.45
982.905	123.64
983.267	181.89
983.63	164.9
983.992	135.77
984.355	111.5
984.717	169.75
985.08	160.04
985.442	104.22
985.804	72.66
986.167	203.73
986.529	177.04
986.891	147.91
987.253	196.45
987.615	162.47
987.977	150.34
988.339	130.92
988.701	152.76
989.062	152.76
989.424	135.77
989.786	177.04
990.147	155.19
990.509	162.47
990.87	169.75
991.232	87.23
991.593	65.38
991.955	65.38
992.316	143.05
992.677	162.47
993.038	167.33
993.399	150.34
993.76	167.33
994.121	118.78
994.482	162.47
994.843	123.64
995.204	147.91
995.565	155.19
995.926	116.35
996.286	133.35
996.647	123.64
997.007	160.04
997.368	143.05
997.728	111.5
998.089	84.8
998.449	79.95
998.809	177.04
999.169	113.93
999.53	155.19
999.89	191.6
1000.25	194.03
1000.61	133.35
1000.97	99.36
1001.329	109.07
1001.689	160.04
1002.049	164.9
1002.409	218.3
1002.768	140.63
1003.128	208.59
1003.487	157.62
1003.847	130.92
1004.206	99.36
1004.566	116.35
1004.925	138.2
1005.284	167.33
1005.643	160.04
1006.003	126.06
1006.362	140.63
1006.721	169.75
1007.08	118.78
1007.438	177.04
1007.797	130.92
1008.156	101.79
1008.515	179.46
1008.874	150.34
1009.232	92.08
1009.591	140.63
1009.949	198.88
1010.308	138.2
1010.666	189.17
1011.024	140.63
1011.383	167.33
1011.741	113.93
1012.099	160.04
1012.457	181.89
1012.815	123.64
1013.173	79.95
1013.531	113.93
1013.889	138.2
1014.247	150.34
1014.605	152.76
1014.962	169.75
1015.32	155.19
1015.678	104.22
1016.035	208.59
1016.393	179.46
1016.75	155.19
1017.107	92.08
1017.465	160.04
1017.822	123.64
1018.179	174.61
1018.536	203.73
1018.894	133.35
1019.251	138.2
1019.608	177.04
1019.964	92.08
1020.321	145.48
1020.678	133.35
1021.035	140.63
1021.392	87.23
1021.748	208.59
1022.105	121.21
1022.461	189.17
1022.818	157.62
1023.174	181.89
1023.531	181.89
1023.887	157.62
1024.243	128.49
1024.599	138.2
1024.955	179.46
1025.311	174.61
1025.667	118.78
1026.023	179.46
1026.379	147.91
1026.735	106.65
1027.091	118.78
1027.447	150.34
