189.514	54.46
189.973	54.46
190.431	54.46
190.889	27.76
191.348	52.03
191.806	27.76
192.264	-25.64
192.722	27.76
193.18	8.34
193.638	-59.62
194.096	-40.2
194.554	-23.21
195.012	1.06
195.47	22.91
195.928	5.92
196.385	-8.65
196.843	37.47
197.301	-25.64
197.758	56.89
198.216	-54.76
198.674	5.92
199.131	71.45
199.589	107.86
200.046	20.48
200.503	100.58
200.961	83.59
201.418	98.15
201.875	117.57
202.332	122.42
202.79	61.74
203.247	202.52
203.704	192.81
204.161	112.71
204.618	122.42
205.075	180.68
205.532	139.41
205.989	178.25
206.445	117.57
206.902	122.42
207.359	156.4
207.816	185.53
208.272	226.79
208.729	153.98
209.185	192.81
209.642	192.81
210.098	192.81
210.555	195.24
211.011	209.8
211.467	90.87
211.924	178.25
212.38	170.97
212.836	166.11
213.292	107.86
213.748	100.58
214.204	170.97
214.66	149.12
215.116	214.66
215.572	180.68
216.028	141.84
216.484	231.65
216.94	170.97
217.396	105.43
217.851	149.12
218.307	173.39
218.763	93.3
219.218	110.29
219.674	98.15
220.129	158.83
220.585	136.99
221.04	156.4
221.496	90.87
221.951	103.01
222.406	192.81
222.861	127.28
223.317	163.69
223.772	161.26
224.227	86.01
224.682	141.84
225.137	129.7
225.592	204.95
226.047	175.82
226.502	175.82
226.957	178.25
227.411	37.47
227.866	195.24
228.321	110.29
228.776	144.27
229.23	161.26
229.685	166.11
230.139	149.12
230.594	163.69
231.048	163.69
231.503	161.26
231.957	110.29
232.411	90.87
232.865	103.01
233.32	95.72
233.774	139.41
234.228	163.69
234.682	127.28
235.136	90.87
235.59	192.81
236.044	163.69
236.498	200.09
236.952	127.28
237.406	136.99
237.86	88.44
238.313	127.28
238.767	141.84
239.221	112.71
239.674	204.95
240.128	100.58
240.581	214.66
241.035	112.71
241.488	146.7
241.942	175.82
242.395	144.27
242.848	95.72
243.301	178.25
243.755	180.68
244.208	204.95
244.661	81.16
245.114	141.84
245.567	178.25
246.02	115.14
246.473	153.98
246.926	161.26
247.379	112.71
247.832	168.54
248.284	129.7
248.737	149.12
249.19	141.84
249.642	209.8
250.095	107.86
250.547	129.7
251	122.42
251.452	153.98
251.905	122.42
252.357	95.72
252.81	209.8
253.262	166.11
253.714	151.55
254.166	144.27
254.618	136.99
255.07	236.5
255.523	149.12
255.975	185.53
256.427	180.68
256.878	200.09
257.33	110.29
257.782	156.4
258.234	204.95
258.686	127.28
259.137	100.58
259.589	151.55
260.041	115.14
260.492	117.57
260.944	146.7
261.395	204.95
261.847	214.66
262.298	149.12
262.749	141.84
263.201	175.82
263.652	144.27
264.103	212.23
264.554	95.72
265.005	100.58
265.457	153.98
265.908	83.59
266.359	185.53
266.809	110.29
267.26	180.68
267.711	110.29
268.162	173.39
268.613	153.98
269.064	178.25
269.514	124.85
269.965	139.41
270.415	86.01
270.866	185.53
271.316	202.52
271.767	124.85
272.217	144.27
272.668	175.82
273.118	107.86
273.568	129.7
274.019	168.54
274.469	207.38
274.919	129.7
275.369	175.82
275.819	146.7
276.269	139.41
276.719	132.13
277.169	173.39
277.619	204.95
278.069	185.53
278.518	190.39
278.968	219.51
279.418	166.11
279.867	52.03
280.317	153.98
280.767	103.01
281.216	112.71
281.666	200.09
282.115	117.57
282.564	183.1
283.014	153.98
283.463	112.71
283.912	129.7
284.361	146.7
284.811	185.53
285.26	66.6
285.709	107.86
286.158	149.12
286.607	183.1
287.056	141.84
287.505	173.39
287.953	175.82
288.402	183.1
288.851	127.28
289.3	151.55
289.748	221.94
290.197	161.26
290.646	190.39
291.094	219.51
291.543	98.15
291.991	141.84
292.439	175.82
292.888	163.69
293.336	153.98
293.784	207.38
294.233	190.39
294.681	170.97
295.129	178.25
295.577	209.8
296.025	112.71
296.473	156.4
296.921	151.55
297.369	139.41
297.817	204.95
298.264	151.55
298.712	149.12
299.16	141.84
299.608	158.83
300.055	168.54
300.503	190.39
300.95	151.55
301.398	110.29
301.845	105.43
302.293	151.55
302.74	103.01
303.187	204.95
303.635	185.53
304.082	151.55
304.529	122.42
304.976	139.41
305.423	214.66
305.87	202.52
306.317	27.76
306.764	112.71
307.211	161.26
307.658	163.69
308.105	117.57
308.552	161.26
308.998	163.69
309.445	134.56
309.892	136.99
310.338	192.81
310.785	166.11
311.231	224.37
311.678	166.11
312.124	170.97
312.571	175.82
313.017	132.13
313.463	98.15
313.909	180.68
314.356	168.54
314.802	175.82
315.248	173.39
315.694	132.13
316.14	178.25
316.586	139.41
317.032	151.55
317.478	204.95
317.923	141.84
318.369	146.7
318.815	153.98
319.261	268.06
319.706	153.98
320.152	156.4
320.597	197.67
321.043	180.68
321.488	144.27
321.934	129.7
322.379	183.1
322.824	243.78
323.27	200.09
323.715	158.83
324.16	153.98
324.605	103.01
325.05	120
325.495	166.11
325.94	90.87
326.385	192.81
326.83	185.53
327.275	146.7
327.72	115.14
328.165	151.55
328.61	146.7
329.054	197.67
329.499	175.82
329.943	248.64
330.388	136.99
330.832	166.11
331.277	168.54
331.721	103.01
332.166	161.26
332.61	204.95
333.054	178.25
333.499	83.59
333.943	170.97
334.387	173.39
334.831	190.39
335.275	214.66
335.719	209.8
336.163	88.44
336.607	204.95
337.051	93.3
337.495	178.25
337.938	175.82
338.382	124.85
338.826	132.13
339.269	170.97
339.713	166.11
340.157	153.98
340.6	173.39
341.044	122.42
341.487	115.14
341.93	117.57
342.374	88.44
342.817	144.27
343.26	173.39
343.703	166.11
344.146	153.98
344.59	151.55
345.033	144.27
345.476	129.7
345.919	158.83
346.361	132.13
346.804	127.28
347.247	190.39
347.69	158.83
348.133	156.4
348.575	192.81
349.018	187.96
349.461	166.11
349.903	95.72
350.346	183.1
350.788	195.24
351.23	192.81
351.673	124.85
352.115	195.24
352.557	110.29
353	197.67
353.442	178.25
353.884	129.7
354.326	20.48
354.768	168.54
355.21	129.7
355.652	144.27
356.094	95.72
356.536	124.85
356.978	197.67
357.419	139.41
357.861	134.56
358.303	241.36
358.744	166.11
359.186	103.01
359.627	204.95
360.069	178.25
360.51	139.41
360.952	166.11
361.393	151.55
361.834	178.25
362.276	127.28
362.717	178.25
363.158	178.25
363.599	200.09
364.04	197.67
364.481	59.32
364.922	120
365.363	127.28
365.804	117.57
366.245	88.44
366.686	161.26
367.126	149.12
367.567	248.64
368.008	151.55
368.448	93.3
368.889	146.7
369.33	117.57
369.77	122.42
370.21	117.57
370.651	139.41
371.091	217.08
371.531	214.66
371.972	195.24
372.412	175.82
372.852	132.13
373.292	124.85
373.732	190.39
374.172	117.57
374.612	110.29
375.052	178.25
375.492	149.12
375.932	136.99
376.372	214.66
376.811	178.25
377.251	146.7
377.691	139.41
378.13	204.95
378.57	158.83
379.009	107.86
379.449	69.02
379.888	173.39
380.328	122.42
380.767	168.54
381.206	153.98
381.645	115.14
382.085	132.13
382.524	120
382.963	139.41
383.402	166.11
383.841	185.53
384.28	166.11
384.719	166.11
385.158	146.7
385.596	185.53
386.035	185.53
386.474	195.24
386.913	219.51
387.351	144.27
387.79	166.11
388.228	110.29
388.667	192.81
389.105	202.52
389.544	149.12
389.982	173.39
390.42	197.67
390.859	231.65
391.297	217.08
391.735	136.99
392.173	117.57
392.611	163.69
393.049	134.56
393.487	173.39
393.925	81.16
394.363	124.85
394.801	156.4
395.239	217.08
395.676	122.42
396.114	178.25
396.552	190.39
396.989	156.4
397.427	136.99
397.864	168.54
398.302	170.97
398.739	129.7
399.177	141.84
399.614	146.7
400.051	134.56
400.488	136.99
400.926	183.1
401.363	158.83
401.8	93.3
402.237	173.39
402.674	149.12
403.111	190.39
403.548	132.13
403.985	144.27
404.421	166.11
404.858	234.08
405.295	134.56
405.732	183.1
406.168	168.54
406.605	149.12
407.041	146.7
407.478	146.7
407.914	166.11
408.351	161.26
408.787	187.96
409.223	190.39
409.66	139.41
410.096	161.26
410.532	168.54
410.968	141.84
411.404	93.3
411.84	161.26
412.276	161.26
412.712	105.43
413.148	168.54
413.584	78.73
414.02	112.71
414.455	187.96
414.891	200.09
415.327	185.53
415.762	122.42
416.198	156.4
416.633	98.15
417.069	156.4
417.504	71.45
417.94	98.15
418.375	124.85
418.81	163.69
419.245	163.69
419.681	149.12
420.116	149.12
420.551	105.43
420.986	168.54
421.421	141.84
421.856	197.67
422.291	117.57
422.726	66.6
423.16	110.29
423.595	115.14
424.03	158.83
424.464	158.83
424.899	202.52
425.334	195.24
425.768	185.53
426.203	115.14
426.637	202.52
427.071	207.38
427.506	134.56
427.94	190.39
428.374	151.55
428.809	224.37
429.243	153.98
429.677	173.39
430.111	146.7
430.545	141.84
430.979	166.11
431.413	124.85
431.847	255.92
432.28	151.55
432.714	141.84
433.148	134.56
433.582	209.8
434.015	151.55
434.449	173.39
434.882	185.53
435.316	163.69
435.749	166.11
436.183	163.69
436.616	166.11
437.049	212.23
437.483	124.85
437.916	166.11
438.349	200.09
438.782	163.69
439.215	180.68
439.648	156.4
440.081	258.35
440.514	202.52
440.947	146.7
441.38	202.52
441.813	260.77
442.245	272.91
442.678	214.66
443.111	192.81
443.543	248.64
443.976	168.54
444.408	231.65
444.841	231.65
445.273	127.28
445.705	221.94
446.138	251.07
446.57	248.64
447.002	246.21
447.434	190.39
447.867	195.24
448.299	319.03
448.731	224.37
449.163	217.08
449.595	173.39
450.026	338.45
450.458	224.37
450.89	255.92
451.322	268.06
451.754	163.69
452.185	221.94
452.617	229.22
453.048	248.64
453.48	275.34
453.911	299.61
454.343	328.74
454.774	314.17
455.205	319.03
455.637	311.75
456.068	311.75
456.499	326.31
456.93	306.89
457.361	306.89
457.792	282.62
458.223	243.78
458.654	272.91
459.085	282.62
459.516	299.61
459.947	275.34
460.378	246.21
460.808	221.94
461.239	319.03
461.669	241.36
462.1	309.32
462.531	309.32
462.961	238.93
463.391	282.62
463.822	241.36
464.252	255.92
464.682	260.77
465.113	268.06
465.543	234.08
465.973	248.64
466.403	246.21
466.833	287.47
467.263	319.03
467.693	258.35
468.123	282.62
468.553	263.2
468.983	282.62
469.412	270.48
469.842	251.07
470.272	258.35
470.701	207.38
471.131	209.8
471.56	204.95
471.99	268.06
472.419	178.25
472.849	238.93
473.278	246.21
473.707	224.37
474.136	204.95
474.566	234.08
474.995	190.39
475.424	258.35
475.853	226.79
476.282	187.96
476.711	294.76
477.14	175.82
477.569	272.91
477.997	226.79
478.426	146.7
478.855	236.5
479.283	268.06
479.712	246.21
480.141	187.96
480.569	238.93
480.998	248.64
481.426	255.92
481.854	144.27
482.283	209.8
482.711	190.39
483.139	139.41
483.567	207.38
483.995	236.5
484.424	180.68
484.852	251.07
485.28	229.22
485.708	229.22
486.135	214.66
486.563	153.98
486.991	207.38
487.419	185.53
487.847	180.68
488.274	139.41
488.702	270.48
489.129	139.41
489.557	151.55
489.984	178.25
490.412	224.37
490.839	153.98
491.266	234.08
491.694	251.07
492.121	175.82
492.548	214.66
492.975	139.41
493.402	229.22
493.829	192.81
494.256	132.13
494.683	200.09
495.11	153.98
495.537	132.13
495.964	195.24
496.39	139.41
496.817	241.36
497.244	175.82
497.67	166.11
498.097	243.78
498.523	183.1
498.95	248.64
499.376	217.08
499.803	178.25
500.229	149.12
500.655	195.24
501.081	168.54
501.508	275.34
501.934	197.67
502.36	195.24
502.786	141.84
503.212	153.98
503.638	258.35
504.064	236.5
504.489	197.67
504.915	161.26
505.341	175.82
505.767	103.01
506.192	217.08
506.618	190.39
507.043	180.68
507.469	200.09
507.894	146.7
508.32	192.81
508.745	175.82
509.17	170.97
509.596	170.97
510.021	144.27
510.446	204.95
510.871	136.99
511.296	117.57
511.721	209.8
512.146	144.27
512.571	229.22
512.996	161.26
513.421	255.92
513.845	246.21
514.27	187.96
514.695	180.68
515.119	136.99
515.544	168.54
515.969	217.08
516.393	212.23
516.817	214.66
517.242	234.08
517.666	180.68
518.09	190.39
518.515	170.97
518.939	180.68
519.363	372.43
519.787	204.95
520.211	202.52
520.635	151.55
521.059	144.27
521.483	219.51
521.907	270.48
522.331	146.7
522.754	231.65
523.178	170.97
523.602	180.68
524.025	229.22
524.449	224.37
524.872	248.64
525.296	173.39
525.719	134.56
526.143	192.81
526.566	185.53
526.989	156.4
527.412	214.66
527.836	243.78
528.259	209.8
528.682	183.1
529.105	229.22
529.528	217.08
529.951	214.66
530.374	204.95
530.796	178.25
531.219	243.78
531.642	246.21
532.065	200.09
532.487	178.25
532.91	168.54
533.332	214.66
533.755	190.39
534.177	255.92
534.6	209.8
535.022	120
535.444	207.38
535.867	197.67
536.289	166.11
536.711	187.96
537.133	253.49
537.555	248.64
537.977	221.94
538.399	224.37
538.821	243.78
539.243	192.81
539.665	265.63
540.086	238.93
540.508	207.38
540.93	204.95
541.351	229.22
541.773	158.83
542.195	275.34
542.616	268.06
543.037	221.94
543.459	195.24
543.88	243.78
544.301	200.09
544.723	149.12
545.144	224.37
545.565	246.21
545.986	166.11
546.407	156.4
546.828	139.41
547.249	204.95
547.67	231.65
548.091	229.22
548.512	221.94
548.932	238.93
549.353	270.48
549.774	212.23
550.194	180.68
550.615	144.27
551.035	197.67
551.456	207.38
551.876	197.67
552.296	166.11
552.717	238.93
553.137	200.09
553.557	139.41
553.977	224.37
554.397	207.38
554.817	263.2
555.237	221.94
555.657	153.98
556.077	185.53
556.497	241.36
556.917	219.51
557.337	175.82
557.756	263.2
558.176	212.23
558.596	185.53
559.015	136.99
559.435	149.12
559.854	166.11
560.274	161.26
560.693	195.24
561.112	144.27
561.532	163.69
561.951	221.94
562.37	187.96
562.789	268.06
563.208	248.64
563.627	214.66
564.046	277.77
564.465	221.94
564.884	229.22
565.303	219.51
565.722	175.82
566.14	195.24
566.559	200.09
566.978	146.7
567.396	129.7
567.815	197.67
568.233	285.05
568.652	207.38
569.07	224.37
569.489	224.37
569.907	221.94
570.325	183.1
570.743	161.26
571.161	187.96
571.58	141.84
571.998	166.11
572.416	170.97
572.833	183.1
573.251	166.11
573.669	231.65
574.087	209.8
574.505	224.37
574.922	207.38
575.34	173.39
575.758	134.56
576.175	195.24
576.593	151.55
577.01	168.54
577.428	204.95
577.845	1751.09
578.262	277.77
578.68	187.96
579.097	103.01
579.514	195.24
579.931	173.39
580.348	226.79
580.765	224.37
581.182	170.97
581.599	258.35
582.016	224.37
582.433	209.8
582.849	151.55
583.266	268.06
583.683	207.38
584.099	149.12
584.516	173.39
584.933	183.1
585.349	163.69
585.765	226.79
586.182	141.84
586.598	180.68
587.014	231.65
587.431	132.13
587.847	212.23
588.263	163.69
588.679	246.21
589.095	236.5
589.511	241.36
589.927	214.66
590.343	209.8
590.759	243.78
591.174	166.11
591.59	93.3
592.006	134.56
592.421	202.52
592.837	161.26
593.252	161.26
593.668	132.13
594.083	209.8
594.499	202.52
594.914	175.82
595.329	248.64
595.745	212.23
596.16	231.65
596.575	212.23
596.99	207.38
597.405	202.52
597.82	253.49
598.235	214.66
598.65	224.37
599.065	183.1
599.479	151.55
599.894	258.35
600.309	134.56
600.724	236.5
601.138	190.39
601.553	260.77
601.967	190.39
602.382	127.28
602.796	161.26
603.21	151.55
603.625	161.26
604.039	173.39
604.453	129.7
604.867	209.8
605.281	243.78
605.695	166.11
606.109	103.01
606.523	158.83
606.937	217.08
607.351	306.89
607.765	224.37
608.178	117.57
608.592	158.83
609.006	229.22
609.419	229.22
609.833	170.97
610.246	151.55
610.66	236.5
611.073	173.39
611.487	136.99
611.9	200.09
612.313	141.84
612.726	146.7
613.139	197.67
613.553	173.39
613.966	231.65
614.379	161.26
614.792	190.39
615.204	185.53
615.617	204.95
616.03	170.97
616.443	168.54
616.856	153.98
617.268	209.8
617.681	202.52
618.093	231.65
618.506	183.1
618.918	209.8
619.331	151.55
619.743	139.41
620.155	187.96
620.568	161.26
620.98	129.7
621.392	141.84
621.804	170.97
622.216	187.96
622.628	243.78
623.04	231.65
623.452	117.57
623.864	190.39
624.276	175.82
624.687	180.68
625.099	265.63
625.511	149.12
625.922	183.1
626.334	187.96
626.745	146.7
627.157	217.08
627.568	187.96
627.979	236.5
628.391	136.99
628.802	158.83
629.213	105.43
629.624	163.69
630.035	192.81
630.446	156.4
630.857	195.24
631.268	178.25
631.679	161.26
632.09	146.7
632.501	168.54
632.912	238.93
633.322	302.04
633.733	110.29
634.144	173.39
634.554	265.63
634.965	197.67
635.375	161.26
635.785	170.97
636.196	200.09
636.606	161.26
637.016	156.4
637.427	224.37
637.837	183.1
638.247	197.67
638.657	204.95
639.067	117.57
639.477	202.52
639.887	149.12
640.297	146.7
640.706	209.8
641.116	190.39
641.526	149.12
641.935	209.8
642.345	144.27
642.755	127.28
643.164	217.08
643.573	175.82
643.983	107.86
644.392	132.13
644.801	105.43
645.211	180.68
645.62	127.28
646.029	214.66
646.438	231.65
646.847	231.65
647.256	183.1
647.665	212.23
648.074	187.96
648.483	180.68
648.892	144.27
649.3	183.1
649.709	224.37
650.118	200.09
650.526	163.69
650.935	158.83
651.343	207.38
651.752	197.67
652.16	231.65
652.568	209.8
652.977	132.13
653.385	187.96
653.793	180.68
654.201	200.09
654.609	73.88
655.017	178.25
655.425	187.96
655.833	192.81
656.241	76.31
656.649	158.83
657.057	105.43
657.464	178.25
657.872	180.68
658.28	144.27
658.687	175.82
659.095	200.09
659.502	117.57
659.91	195.24
660.317	190.39
660.724	153.98
661.132	187.96
661.539	122.42
661.946	163.69
662.353	144.27
662.76	146.7
663.167	212.23
663.574	161.26
663.981	178.25
664.388	236.5
664.795	168.54
665.202	195.24
665.608	153.98
666.015	149.12
666.422	221.94
666.828	178.25
667.235	183.1
667.641	190.39
668.047	185.53
668.454	81.16
668.86	178.25
669.266	144.27
669.673	219.51
670.079	163.69
670.485	161.26
670.891	178.25
671.297	149.12
671.703	197.67
672.109	185.53
672.515	224.37
672.92	178.25
673.326	197.67
673.732	163.69
674.138	204.95
674.543	192.81
674.949	173.39
675.354	134.56
675.76	221.94
676.165	156.4
676.57	200.09
676.976	192.81
677.381	185.53
677.786	234.08
678.191	168.54
678.596	115.14
679.001	144.27
679.406	185.53
679.811	132.13
680.216	229.22
680.621	236.5
681.026	226.79
681.43	185.53
681.835	132.13
682.24	178.25
682.644	120
683.049	103.01
683.453	149.12
683.858	224.37
684.262	129.7
684.667	122.42
685.071	158.83
685.475	221.94
685.879	195.24
686.283	209.8
686.687	217.08
687.091	149.12
687.495	185.53
687.899	197.67
688.303	156.4
688.707	187.96
689.111	226.79
689.514	204.95
689.918	163.69
690.322	183.1
690.725	98.15
691.129	144.27
691.532	153.98
691.936	173.39
692.339	236.5
692.742	146.7
693.146	166.11
693.549	183.1
693.952	258.35
694.355	224.37
694.758	127.28
695.161	168.54
695.564	185.53
695.967	88.44
696.37	170.97
696.773	144.27
697.175	183.1
697.578	224.37
697.981	214.66
698.383	183.1
698.786	153.98
699.188	200.09
699.591	161.26
699.993	214.66
700.395	107.86
700.798	168.54
701.2	202.52
701.602	144.27
702.004	163.69
702.406	197.67
702.808	229.22
703.21	212.23
703.612	221.94
704.014	161.26
704.416	112.71
704.818	200.09
705.219	255.92
705.621	209.8
706.023	217.08
706.424	277.77
706.826	234.08
707.227	192.81
707.629	202.52
708.03	219.51
708.431	185.53
708.832	180.68
709.234	243.78
709.635	258.35
710.036	238.93
710.437	280.19
710.838	285.05
711.239	214.66
711.64	241.36
712.041	253.49
712.441	275.34
712.842	292.33
713.243	258.35
713.643	340.87
714.044	343.3
714.445	340.87
714.845	270.48
715.246	294.76
715.646	236.5
716.046	321.46
716.447	367.57
716.847	333.59
717.247	285.05
717.647	265.63
718.047	350.58
718.447	348.15
718.847	311.75
719.247	289.9
719.647	425.83
720.047	343.3
720.446	326.31
720.846	263.2
721.246	306.89
721.645	377.28
722.045	370
722.444	462.23
722.844	370
723.243	399.13
723.643	452.53
724.042	384.56
724.441	384.56
724.84	384.56
725.24	391.84
725.639	471.94
726.038	420.97
726.437	462.23
726.836	481.65
727.234	450.1
727.633	450.1
728.032	476.8
728.431	559.32
728.83	571.46
729.228	588.45
729.627	632.14
730.025	649.13
730.424	685.54
730.822	670.98
731.22	707.38
731.619	709.81
732.017	874.86
732.415	882.14
732.813	947.68
733.212	920.98
733.61	1001.08
734.008	1042.34
734.406	1156.42
734.803	1212.25
735.201	1246.23
735.599	1399.14
735.997	1384.58
736.395	1496.23
736.792	1535.07
737.19	1654
737.587	1680.7
737.985	1639.44
738.382	1848.18
738.78	2010.8
739.177	2107.89
739.574	2139.44
739.971	2255.95
740.369	2294.79
740.766	2391.88
741.163	2471.97
741.56	2566.64
741.957	2770.52
742.354	2719.55
742.751	2860.33
743.147	2971.98
743.544	3192.86
743.941	3234.12
744.338	3353.06
744.734	3760.83
745.131	3935.59
745.527	3765.68
745.924	4001.12
746.32	4411.32
746.716	4600.65
747.113	4610.36
747.509	4955.02
747.905	5222.02
748.301	5496.29
748.697	5365.22
749.093	5637.07
749.489	6047.27
749.885	6457.47
750.281	6542.43
750.677	6860.39
751.073	7292.44
751.468	7731.76
751.864	7692.93
752.26	7688.07
752.655	8452.65
753.051	8969.65
753.446	8916.25
753.842	9018.19
754.237	9719.66
754.632	10217.24
755.028	10190.54
755.423	9959.95
755.818	10331.32
756.213	11144.44
756.608	10833.75
757.003	10921.13
757.398	11328.91
757.793	11843.48
758.188	11821.63
758.583	11394.44
758.977	12156.59
759.372	13066.8
759.767	13389.62
760.161	13348.36
760.556	14018.27
760.95	15865.39
761.345	15967.33
761.739	15809.56
762.133	16348.4
762.527	18280.47
762.922	18734.36
763.316	18367.85
763.71	18591.16
764.104	19719.82
764.498	21088.77
764.892	20627.6
765.286	20132.44
765.68	21312.07
766.073	22787.82
766.467	22161.6
766.861	21955.29
767.255	22996.57
767.648	25321.84
768.042	25358.25
768.435	24506.3
768.829	24768.44
769.222	26562.15
769.615	27887.42
770.008	25928.65
770.402	25693.21
770.795	27127.7
771.188	28336.45
771.581	27501.49
771.974	25945.64
772.367	26897.11
772.76	28130.14
773.153	27863.15
773.545	26287.88
773.938	26329.14
774.331	28363.15
774.724	29295.21
775.116	29232.1
775.509	28758.79
775.901	31724.86
776.294	33974.89
776.686	32438.46
777.078	32455.45
777.471	33588.96
777.863	37120.57
778.255	38140
778.647	36528.33
779.039	36101.14
779.431	37339.02
779.823	39363.32
780.215	37943.4
780.607	36229.78
780.999	37807.48
781.39	39610.9
781.782	40096.35
782.174	38188.55
782.565	37457.96
782.957	40241.98
783.348	42193.47
783.74	40863.35
784.131	38494.38
784.522	39829.35
784.914	40953.16
785.305	42533.28
785.696	39348.76
786.087	37873.01
786.478	38661.86
786.869	39123.03
787.26	37421.55
787.651	34292.86
788.042	33906.93
788.433	35620.55
788.823	36237.06
789.214	33533.14
789.605	31224.85
789.995	31933.6
790.386	33620.52
790.776	32792.83
791.167	30086.48
791.557	30591.34
791.948	32921.48
792.338	34142.37
792.728	34011.3
793.118	31710.29
793.508	32846.23
793.898	35322
794.288	36052.59
794.678	33249.15
795.068	31858.35
795.458	33207.89
795.848	35450.64
796.238	34838.98
796.627	32101.08
797.017	31414.17
797.406	34166.64
797.796	35161.8
798.185	34234.6
798.575	31741.85
798.964	32270.98
799.354	34931.22
799.743	35353.55
800.132	33739.45
800.521	31178.73
800.91	32710.31
801.299	33950.62
801.688	34462.76
802.077	31584.08
802.466	30139.88
802.855	31377.76
803.244	32618.07
803.633	31851.07
804.021	29792.79
804.41	28513.64
804.799	29829.2
805.187	31098.63
805.576	28780.64
805.964	25819.42
806.352	24377.65
806.741	26520.89
807.129	26702.93
807.517	25967.49
807.905	24139.79
808.293	24450.47
808.681	26183.51
809.069	27057.31
809.457	26761.19
809.845	24523.29
810.233	24753.87
810.621	26921.38
811.009	28093.73
811.396	26331.57
811.784	24867.95
812.171	25382.52
812.559	26404.39
812.946	26780.6
813.334	24564.55
813.721	22819.38
814.108	22865.5
814.496	24564.55
814.883	24552.41
815.27	23246.57
815.657	21831.5
816.044	22217.43
816.431	24100.95
816.818	24753.87
817.205	22705.3
817.592	21147.02
817.979	21282.95
818.365	22103.35
818.752	22142.18
819.139	20304.78
819.525	18671.26
819.912	18491.64
820.298	19377.58
820.685	19639.72
821.071	17994.06
821.457	16280.44
821.843	15889.66
822.23	16438.21
822.616	16807.15
823.002	15212.46
823.388	13564.38
823.774	13023.11
824.16	13571.66
824.546	13627.49
824.931	13341.08
825.317	12156.59
825.703	11702.7
826.089	12132.32
826.474	12787.67
826.86	12176.01
827.245	11513.38
827.631	10821.62
828.016	11020.65
828.401	11826.49
828.787	11433.28
829.172	10416.27
829.557	9540.05
829.942	9680.82
830.327	10134.71
830.712	10205.1
831.097	9479.36
831.482	8624.98
831.867	8620.13
832.252	9047.32
832.636	9180.82
833.021	8615.27
833.406	7923.52
833.79	7598.27
834.175	7782.74
834.559	8098.28
834.944	7894.39
835.328	7197.78
835.713	6690.49
836.097	6765.73
836.481	7241.47
836.865	6731.75
837.249	6418.64
837.633	5746.3
838.017	5634.64
838.401	5712.32
838.785	5729.31
839.169	5248.72
839.553	4826.38
839.937	4486.57
840.32	4629.77
840.704	4624.92
841.087	4316.66
841.471	4056.95
841.854	3731.7
842.238	3624.9
842.621	3705
843.004	3889.47
843.388	3493.83
843.771	3321.5
844.154	3161.31
844.537	3377.33
844.92	3760.83
845.303	3576.36
845.686	3238.98
846.069	2867.61
846.452	2901.59
846.834	3156.45
847.217	3093.34
847.6	2952.56
847.982	2702.56
848.365	2450.13
848.748	2603.04
849.13	2741.4
849.512	2743.82
849.895	2423.43
850.277	2353.04
850.659	2166.14
851.041	2370.03
851.423	2459.84
851.806	2316.63
852.188	1988.96
852.57	1991.38
852.951	1998.67
853.333	2168.57
853.715	2137.02
854.097	1962.26
854.479	1721.96
854.86	1612.74
855.242	1702.54
855.623	1894.3
856.005	1736.53
856.386	1566.62
856.768	1374.87
857.149	1387.01
857.53	1454.97
857.911	1554.48
858.292	1321.47
858.674	1151.57
859.055	1122.44
859.436	1071.47
859.817	1204.96
860.197	1178.26
860.578	1039.91
860.959	1005.93
861.34	903.99
861.72	879.72
862.101	1025.35
862.482	1042.34
862.862	806.9
863.243	833.6
863.623	772.92
864.003	741.36
864.384	857.87
864.764	823.89
865.144	768.06
865.524	661.27
865.904	653.98
866.284	736.51
866.664	751.07
867.044	702.53
867.424	719.52
867.804	658.84
868.183	636.99
868.563	581.17
868.943	629.71
869.322	535.05
869.702	493.79
870.081	564.18
870.461	491.36
870.84	641.85
871.22	510.78
871.599	510.78
871.978	525.34
872.357	447.67
872.736	403.98
873.115	484.08
873.494	430.68
873.873	323.88
874.252	370
874.631	353.01
875.01	389.42
875.388	362.72
875.767	377.28
876.146	314.17
876.524	326.31
876.903	243.78
877.281	238.93
877.66	280.19
878.038	314.17
878.416	268.06
878.794	297.18
879.173	302.04
879.551	294.76
879.929	321.46
880.307	251.07
880.685	275.34
881.063	311.75
881.441	248.64
881.818	297.18
882.196	263.2
882.574	260.77
882.951	255.92
883.329	221.94
883.707	299.61
884.084	258.35
884.461	219.51
884.839	200.09
885.216	231.65
885.593	243.78
885.971	202.52
886.348	246.21
886.725	231.65
887.102	260.77
887.479	192.81
887.856	202.52
888.233	170.97
888.609	214.66
888.986	168.54
889.363	183.1
889.74	275.34
890.116	166.11
890.493	214.66
890.869	197.67
891.246	246.21
891.622	253.49
891.998	248.64
892.375	166.11
892.751	107.86
893.127	229.22
893.503	224.37
893.879	83.59
894.255	168.54
894.631	170.97
895.007	105.43
895.383	195.24
895.759	209.8
896.134	192.81
896.51	180.68
896.886	192.81
897.261	190.39
897.637	163.69
898.012	86.01
898.388	166.11
898.763	173.39
899.138	200.09
899.514	168.54
899.889	156.4
900.264	178.25
900.639	156.4
901.014	183.1
901.389	258.35
901.764	78.73
902.139	115.14
902.513	146.7
902.888	93.3
903.263	173.39
903.638	185.53
904.012	248.64
904.387	64.17
904.761	100.58
905.136	141.84
905.51	122.42
905.884	93.3
906.259	95.72
906.633	83.59
907.007	153.98
907.381	163.69
907.755	110.29
908.129	149.12
908.503	146.7
908.877	98.15
909.251	124.85
909.624	163.69
909.998	146.7
910.372	144.27
910.745	190.39
911.119	202.52
911.492	209.8
911.866	100.58
912.239	76.31
912.612	112.71
912.986	212.23
913.359	124.85
913.732	175.82
914.105	153.98
914.478	158.83
914.851	156.4
915.224	93.3
915.597	207.38
915.97	166.11
916.343	151.55
916.715	107.86
917.088	129.7
917.461	105.43
917.833	185.53
918.206	197.67
918.578	158.83
918.951	170.97
919.323	166.11
919.695	195.24
920.067	209.8
920.44	192.81
920.812	49.61
921.184	149.12
921.556	209.8
921.928	90.87
922.3	115.14
922.672	166.11
923.043	202.52
923.415	192.81
923.787	209.8
924.158	173.39
924.53	168.54
924.901	180.68
925.273	219.51
925.644	163.69
926.016	132.13
926.387	144.27
926.758	168.54
927.129	151.55
927.5	161.26
927.872	166.11
928.243	185.53
928.613	112.71
928.984	129.7
929.355	192.81
929.726	156.4
930.097	161.26
930.467	153.98
930.838	156.4
931.209	187.96
931.579	139.41
931.95	129.7
932.32	110.29
932.69	163.69
933.061	93.3
933.431	209.8
933.801	221.94
934.171	139.41
934.541	144.27
934.911	173.39
935.281	132.13
935.651	122.42
936.021	129.7
936.391	100.58
936.761	134.56
937.13	132.13
937.5	120
937.87	134.56
938.239	151.55
938.609	153.98
938.978	146.7
939.347	149.12
939.717	124.85
940.086	161.26
940.455	127.28
940.824	197.67
941.193	161.26
941.562	263.2
941.931	117.57
942.3	217.08
942.669	153.98
943.038	226.79
943.407	88.44
943.775	214.66
944.144	141.84
944.513	180.68
944.881	180.68
945.25	161.26
945.618	156.4
945.986	166.11
946.355	221.94
946.723	30.19
947.091	146.7
947.459	146.7
947.827	153.98
948.195	144.27
948.563	214.66
948.931	197.67
949.299	110.29
949.667	132.13
950.035	52.03
950.402	173.39
950.77	156.4
951.138	221.94
951.505	168.54
951.873	149.12
952.24	170.97
952.607	149.12
952.975	156.4
953.342	149.12
953.709	158.83
954.076	170.97
954.443	185.53
954.81	156.4
955.177	197.67
955.544	93.3
955.911	185.53
956.278	151.55
956.645	175.82
957.012	231.65
957.378	161.26
957.745	122.42
958.111	105.43
958.478	209.8
958.844	255.92
959.211	117.57
959.577	134.56
959.943	195.24
960.309	207.38
960.675	83.59
961.042	161.26
961.408	66.6
961.774	214.66
962.139	146.7
962.505	234.08
962.871	178.25
963.237	129.7
963.603	129.7
963.968	168.54
964.334	175.82
964.699	127.28
965.065	158.83
965.43	120
965.796	146.7
966.161	183.1
966.526	180.68
966.891	183.1
967.256	93.3
967.622	166.11
967.987	103.01
968.352	183.1
968.716	117.57
969.081	151.55
969.446	151.55
969.811	115.14
970.176	93.3
970.54	170.97
970.905	71.45
971.269	146.7
971.634	134.56
971.998	110.29
972.363	166.11
972.727	166.11
973.091	163.69
973.455	153.98
973.819	139.41
974.183	110.29
974.547	110.29
974.911	224.37
975.275	190.39
975.639	173.39
976.003	217.08
976.367	158.83
976.73	120
977.094	209.8
977.458	200.09
977.821	139.41
978.185	139.41
978.548	139.41
978.911	168.54
979.275	139.41
979.638	146.7
980.001	158.83
980.364	127.28
980.727	158.83
981.09	95.72
981.453	132.13
981.816	117.57
982.179	146.7
982.542	124.85
982.905	180.68
983.267	141.84
983.63	173.39
983.992	88.44
984.355	120
984.717	204.95
985.08	112.71
985.442	204.95
985.804	139.41
986.167	180.68
986.529	156.4
986.891	76.31
987.253	153.98
987.615	134.56
987.977	173.39
988.339	161.26
988.701	190.39
989.062	168.54
989.424	127.28
989.786	127.28
990.147	183.1
990.509	170.97
990.87	146.7
991.232	93.3
991.593	234.08
991.955	100.58
992.316	178.25
992.677	153.98
993.038	110.29
993.399	107.86
993.76	117.57
994.121	146.7
994.482	234.08
994.843	183.1
995.204	76.31
995.565	175.82
995.926	146.7
996.286	144.27
996.647	202.52
997.007	124.85
997.368	115.14
997.728	112.71
998.089	170.97
998.449	124.85
998.809	144.27
999.169	204.95
999.53	136.99
999.89	161.26
1000.25	146.7
1000.61	175.82
1000.97	139.41
1001.329	136.99
1001.689	175.82
1002.049	146.7
1002.409	190.39
1002.768	59.32
1003.128	168.54
1003.487	120
1003.847	173.39
1004.206	86.01
1004.566	178.25
1004.925	112.71
1005.284	166.11
1005.643	129.7
1006.003	185.53
1006.362	197.67
1006.721	110.29
1007.08	149.12
1007.438	136.99
1007.797	100.58
1008.156	149.12
1008.515	149.12
1008.874	161.26
1009.232	144.27
1009.591	139.41
1009.949	117.57
1010.308	90.87
1010.666	221.94
1011.024	173.39
1011.383	122.42
1011.741	100.58
1012.099	69.02
1012.457	202.52
1012.815	158.83
1013.173	88.44
1013.531	107.86
1013.889	115.14
1014.247	197.67
1014.605	192.81
1014.962	115.14
1015.32	151.55
1015.678	149.12
1016.035	107.86
1016.393	98.15
1016.75	202.52
1017.107	105.43
1017.465	175.82
1017.822	170.97
1018.179	139.41
1018.536	141.84
1018.894	120
1019.251	166.11
1019.608	204.95
1019.964	234.08
1020.321	197.67
1020.678	112.71
1021.035	115.14
1021.392	139.41
1021.748	170.97
1022.105	141.84
1022.461	141.84
1022.818	166.11
1023.174	168.54
1023.531	197.67
1023.887	168.54
1024.243	185.53
1024.599	183.1
1024.955	183.1
1025.311	134.56
1025.667	161.26
1026.023	185.53
1026.379	168.54
1026.735	132.13
1027.091	185.53
1027.447	161.26
