189.514	103.01
189.973	103.01
190.431	103.01
190.889	-11.07
191.348	18.05
191.806	-6.22
192.264	-25.64
192.722	22.91
193.18	-52.34
193.638	8.34
194.096	-28.06
194.554	13.2
195.012	-28.06
195.47	10.77
195.928	-15.93
196.385	-20.78
196.843	3.49
197.301	5.92
197.758	10.77
198.216	81.16
198.674	-18.36
199.131	32.62
199.589	73.88
200.046	42.32
200.503	81.16
200.961	76.31
201.418	103.01
201.875	81.16
202.332	151.55
202.79	105.43
203.247	122.42
203.704	146.7
204.161	81.16
204.618	136.99
205.075	129.7
205.532	110.29
205.989	105.43
206.445	69.02
206.902	166.11
207.359	197.67
207.816	185.53
208.272	153.98
208.729	124.85
209.185	136.99
209.642	117.57
210.098	112.71
210.555	187.96
211.011	83.59
211.467	173.39
211.924	115.14
212.38	120
212.836	195.24
213.292	146.7
213.748	180.68
214.204	134.56
214.66	212.23
215.116	275.34
215.572	163.69
216.028	98.15
216.484	200.09
216.94	149.12
217.396	195.24
217.851	197.67
218.307	134.56
218.763	129.7
219.218	183.1
219.674	204.95
220.129	139.41
220.585	100.58
221.04	81.16
221.496	153.98
221.951	129.7
222.406	136.99
222.861	187.96
223.317	168.54
223.772	183.1
224.227	149.12
224.682	132.13
225.137	166.11
225.592	105.43
226.047	105.43
226.502	127.28
226.957	124.85
227.411	158.83
227.866	170.97
228.321	146.7
228.776	100.58
229.23	112.71
229.685	107.86
230.139	153.98
230.594	156.4
231.048	170.97
231.503	124.85
231.957	127.28
232.411	168.54
232.865	136.99
233.32	185.53
233.774	117.57
234.228	103.01
234.682	132.13
235.136	136.99
235.59	103.01
236.044	204.95
236.498	103.01
236.952	110.29
237.406	141.84
237.86	105.43
238.313	163.69
238.767	207.38
239.221	161.26
239.674	95.72
240.128	124.85
240.581	83.59
241.035	115.14
241.488	149.12
241.942	129.7
242.395	212.23
242.848	132.13
243.301	134.56
243.755	141.84
244.208	141.84
244.661	151.55
245.114	124.85
245.567	105.43
246.02	175.82
246.473	78.73
246.926	168.54
247.379	151.55
247.832	161.26
248.284	243.78
248.737	183.1
249.19	144.27
249.642	81.16
250.095	153.98
250.547	212.23
251	120
251.452	168.54
251.905	136.99
252.357	200.09
252.81	178.25
253.262	120
253.714	183.1
254.166	146.7
254.618	141.84
255.07	129.7
255.523	144.27
255.975	175.82
256.427	241.36
256.878	139.41
257.33	129.7
257.782	115.14
258.234	217.08
258.686	100.58
259.137	136.99
259.589	69.02
260.041	185.53
260.492	71.45
260.944	129.7
261.395	100.58
261.847	195.24
262.298	141.84
262.749	195.24
263.201	175.82
263.652	156.4
264.103	103.01
264.554	149.12
265.005	265.63
265.457	134.56
265.908	88.44
266.359	243.78
266.809	66.6
267.26	141.84
267.711	153.98
268.162	120
268.613	115.14
269.064	158.83
269.514	163.69
269.965	229.22
270.415	163.69
270.866	153.98
271.316	127.28
271.767	110.29
272.217	139.41
272.668	180.68
273.118	151.55
273.568	132.13
274.019	153.98
274.469	185.53
274.919	195.24
275.369	183.1
275.819	170.97
276.269	129.7
276.719	83.59
277.169	166.11
277.619	149.12
278.069	129.7
278.518	144.27
278.968	132.13
279.418	200.09
279.867	180.68
280.317	158.83
280.767	49.61
281.216	168.54
281.666	161.26
282.115	112.71
282.564	122.42
283.014	112.71
283.463	185.53
283.912	139.41
284.361	183.1
284.811	120
285.26	129.7
285.709	117.57
286.158	153.98
286.607	122.42
287.056	202.52
287.505	234.08
287.953	93.3
288.402	115.14
288.851	168.54
289.3	241.36
289.748	153.98
290.197	149.12
290.646	158.83
291.094	156.4
291.543	183.1
291.991	66.6
292.439	107.86
292.888	185.53
293.336	153.98
293.784	86.01
294.233	175.82
294.681	166.11
295.129	178.25
295.577	149.12
296.025	110.29
296.473	175.82
296.921	221.94
297.369	151.55
297.817	105.43
298.264	139.41
298.712	158.83
299.16	115.14
299.608	156.4
300.055	115.14
300.503	105.43
300.95	156.4
301.398	110.29
301.845	156.4
302.293	151.55
302.74	163.69
303.187	117.57
303.635	144.27
304.082	127.28
304.529	209.8
304.976	149.12
305.423	173.39
305.87	146.7
306.317	217.08
306.764	103.01
307.211	180.68
307.658	161.26
308.105	115.14
308.552	115.14
308.998	170.97
309.445	170.97
309.892	180.68
310.338	173.39
310.785	136.99
311.231	132.13
311.678	178.25
312.124	98.15
312.571	139.41
313.017	166.11
313.463	107.86
313.909	221.94
314.356	134.56
314.802	132.13
315.248	166.11
315.694	129.7
316.14	161.26
316.586	200.09
317.032	158.83
317.478	151.55
317.923	219.51
318.369	153.98
318.815	178.25
319.261	156.4
319.706	146.7
320.152	219.51
320.597	124.85
321.043	124.85
321.488	178.25
321.934	134.56
322.379	120
322.824	124.85
323.27	110.29
323.715	103.01
324.16	139.41
324.605	93.3
325.05	124.85
325.495	161.26
325.94	105.43
326.385	170.97
326.83	156.4
327.275	180.68
327.72	187.96
328.165	139.41
328.61	144.27
329.054	132.13
329.499	149.12
329.943	149.12
330.388	187.96
330.832	151.55
331.277	226.79
331.721	107.86
332.166	156.4
332.61	95.72
333.054	88.44
333.499	163.69
333.943	173.39
334.387	124.85
334.831	163.69
335.275	163.69
335.719	129.7
336.163	127.28
336.607	153.98
337.051	73.88
337.495	132.13
337.938	161.26
338.382	183.1
338.826	151.55
339.269	136.99
339.713	71.45
340.157	115.14
340.6	146.7
341.044	132.13
341.487	153.98
341.93	156.4
342.374	100.58
342.817	95.72
343.26	202.52
343.703	144.27
344.146	124.85
344.59	88.44
345.033	146.7
345.476	134.56
345.919	190.39
346.361	117.57
346.804	129.7
347.247	209.8
347.69	163.69
348.133	156.4
348.575	187.96
349.018	117.57
349.461	173.39
349.903	151.55
350.346	170.97
350.788	144.27
351.23	149.12
351.673	180.68
352.115	149.12
352.557	149.12
353	166.11
353.442	173.39
353.884	149.12
354.326	110.29
354.768	139.41
355.21	98.15
355.652	127.28
356.094	185.53
356.536	49.61
356.978	163.69
357.419	132.13
357.861	197.67
358.303	153.98
358.744	163.69
359.186	141.84
359.627	90.87
360.069	141.84
360.51	122.42
360.952	136.99
361.393	168.54
361.834	149.12
362.276	141.84
362.717	170.97
363.158	146.7
363.599	168.54
364.04	134.56
364.481	139.41
364.922	61.74
365.363	149.12
365.804	134.56
366.245	124.85
366.686	136.99
367.126	151.55
367.567	98.15
368.008	197.67
368.448	168.54
368.889	214.66
369.33	156.4
369.77	163.69
370.21	146.7
370.651	195.24
371.091	187.96
371.531	144.27
371.972	110.29
372.412	170.97
372.852	170.97
373.292	107.86
373.732	95.72
374.172	115.14
374.612	117.57
375.052	161.26
375.492	202.52
375.932	139.41
376.372	134.56
376.811	124.85
377.251	153.98
377.691	153.98
378.13	107.86
378.57	219.51
379.009	161.26
379.449	105.43
379.888	183.1
380.328	139.41
380.767	151.55
381.206	153.98
381.645	190.39
382.085	180.68
382.524	170.97
382.963	107.86
383.402	129.7
383.841	161.26
384.28	178.25
384.719	139.41
385.158	122.42
385.596	153.98
386.035	144.27
386.474	107.86
386.913	122.42
387.351	153.98
387.79	134.56
388.228	117.57
388.667	139.41
389.105	132.13
389.544	144.27
389.982	161.26
390.42	153.98
390.859	146.7
391.297	156.4
391.735	153.98
392.173	120
392.611	117.57
393.049	93.3
393.487	149.12
393.925	163.69
394.363	175.82
394.801	163.69
395.239	161.26
395.676	161.26
396.114	122.42
396.552	149.12
396.989	173.39
397.427	153.98
397.864	190.39
398.302	180.68
398.739	103.01
399.177	132.13
399.614	226.79
400.051	180.68
400.488	163.69
400.926	81.16
401.363	69.02
401.8	98.15
402.237	122.42
402.674	178.25
403.111	158.83
403.548	122.42
403.985	173.39
404.421	149.12
404.858	183.1
405.295	141.84
405.732	90.87
406.168	139.41
406.605	168.54
407.041	66.6
407.478	139.41
407.914	153.98
408.351	136.99
408.787	229.22
409.223	231.65
409.66	209.8
410.096	146.7
410.532	197.67
410.968	175.82
411.404	129.7
411.84	202.52
412.276	98.15
412.712	161.26
413.148	107.86
413.584	156.4
414.02	117.57
414.455	158.83
414.891	110.29
415.327	103.01
415.762	141.84
416.198	134.56
416.633	151.55
417.069	105.43
417.504	234.08
417.94	124.85
418.375	141.84
418.81	209.8
419.245	163.69
419.681	134.56
420.116	161.26
420.551	78.73
420.986	156.4
421.421	180.68
421.856	107.86
422.291	83.59
422.726	161.26
423.16	166.11
423.595	221.94
424.03	103.01
424.464	112.71
424.899	134.56
425.334	144.27
425.768	44.75
426.203	107.86
426.637	73.88
427.071	187.96
427.506	156.4
427.94	141.84
428.374	178.25
428.809	95.72
429.243	149.12
429.677	156.4
430.111	127.28
430.545	149.12
430.979	105.43
431.413	88.44
431.847	221.94
432.28	117.57
432.714	78.73
433.148	124.85
433.582	178.25
434.015	153.98
434.449	168.54
434.882	163.69
435.316	161.26
435.749	221.94
436.183	146.7
436.616	107.86
437.049	178.25
437.483	253.49
437.916	168.54
438.349	207.38
438.782	149.12
439.215	105.43
439.648	132.13
440.081	192.81
440.514	209.8
440.947	95.72
441.38	153.98
441.813	146.7
442.245	156.4
442.678	190.39
443.111	226.79
443.543	163.69
443.976	212.23
444.408	173.39
444.841	105.43
445.273	170.97
445.705	144.27
446.138	161.26
446.57	124.85
447.002	144.27
447.434	110.29
447.867	168.54
448.299	209.8
448.731	197.67
449.163	224.37
449.595	166.11
450.026	219.51
450.458	183.1
450.89	190.39
451.322	255.92
451.754	204.95
452.185	173.39
452.617	234.08
453.048	246.21
453.48	299.61
453.911	209.8
454.343	306.89
454.774	151.55
455.205	221.94
455.637	161.26
456.068	209.8
456.499	229.22
456.93	263.2
457.361	166.11
457.792	229.22
458.223	132.13
458.654	168.54
459.085	204.95
459.516	221.94
459.947	175.82
460.378	219.51
460.808	132.13
461.239	260.77
461.669	117.57
462.1	168.54
462.531	192.81
462.961	200.09
463.391	178.25
463.822	112.71
464.252	197.67
464.682	175.82
465.113	175.82
465.543	253.49
465.973	161.26
466.403	183.1
466.833	219.51
467.263	229.22
467.693	163.69
468.123	231.65
468.553	183.1
468.983	163.69
469.412	246.21
469.842	204.95
470.272	185.53
470.701	185.53
471.131	204.95
471.56	192.81
471.99	178.25
472.419	136.99
472.849	192.81
473.278	270.48
473.707	200.09
474.136	170.97
474.566	202.52
474.995	166.11
475.424	153.98
475.853	153.98
476.282	202.52
476.711	156.4
477.14	163.69
477.569	212.23
477.997	163.69
478.426	170.97
478.855	122.42
479.283	163.69
479.712	168.54
480.141	180.68
480.569	224.37
480.998	217.08
481.426	190.39
481.854	144.27
482.283	190.39
482.711	175.82
483.139	207.38
483.567	185.53
483.995	149.12
484.424	136.99
484.852	187.96
485.28	175.82
485.708	190.39
486.135	166.11
486.563	124.85
486.991	185.53
487.419	93.3
487.847	134.56
488.274	175.82
488.702	156.4
489.129	88.44
489.557	134.56
489.984	168.54
490.412	156.4
490.839	168.54
491.266	129.7
491.694	153.98
492.121	258.35
492.548	187.96
492.975	146.7
493.402	107.86
493.829	183.1
494.256	183.1
494.683	180.68
495.11	127.28
495.537	178.25
495.964	134.56
496.39	136.99
496.817	178.25
497.244	144.27
497.67	141.84
498.097	107.86
498.523	163.69
498.95	117.57
499.376	168.54
499.803	202.52
500.229	139.41
500.655	178.25
501.081	168.54
501.508	158.83
501.934	175.82
502.36	158.83
502.786	151.55
503.212	190.39
503.638	178.25
504.064	197.67
504.489	173.39
504.915	180.68
505.341	224.37
505.767	88.44
506.192	124.85
506.618	183.1
507.043	178.25
507.469	175.82
507.894	158.83
508.32	221.94
508.745	192.81
509.17	185.53
509.596	124.85
510.021	209.8
510.446	180.68
510.871	178.25
511.296	175.82
511.721	144.27
512.146	214.66
512.571	219.51
512.996	187.96
513.421	207.38
513.845	146.7
514.27	204.95
514.695	217.08
515.119	187.96
515.544	122.42
515.969	120
516.393	95.72
516.817	187.96
517.242	187.96
517.666	132.13
518.09	112.71
518.515	204.95
518.939	178.25
519.363	389.42
519.787	134.56
520.211	115.14
520.635	224.37
521.059	141.84
521.483	224.37
521.907	212.23
522.331	132.13
522.754	173.39
523.178	117.57
523.602	90.87
524.025	163.69
524.449	234.08
524.872	226.79
525.296	146.7
525.719	110.29
526.143	180.68
526.566	224.37
526.989	153.98
527.412	149.12
527.836	153.98
528.259	158.83
528.682	183.1
529.105	170.97
529.528	187.96
529.951	144.27
530.374	156.4
530.796	183.1
531.219	192.81
531.642	66.6
532.065	180.68
532.487	141.84
532.91	146.7
533.332	153.98
533.755	98.15
534.177	163.69
534.6	127.28
535.022	90.87
535.444	124.85
535.867	156.4
536.289	129.7
536.711	187.96
537.133	204.95
537.555	185.53
537.977	180.68
538.399	105.43
538.821	166.11
539.243	185.53
539.665	187.96
540.086	190.39
540.508	202.52
540.93	158.83
541.351	170.97
541.773	153.98
542.195	175.82
542.616	168.54
543.037	226.79
543.459	127.28
543.88	192.81
544.301	202.52
544.723	204.95
545.144	166.11
545.565	217.08
545.986	158.83
546.407	187.96
546.828	170.97
547.249	251.07
547.67	107.86
548.091	166.11
548.512	129.7
548.932	139.41
549.353	180.68
549.774	129.7
550.194	156.4
550.615	127.28
551.035	207.38
551.456	183.1
551.876	158.83
552.296	229.22
552.717	139.41
553.137	149.12
553.557	183.1
553.977	166.11
554.397	132.13
554.817	115.14
555.237	151.55
555.657	115.14
556.077	149.12
556.497	200.09
556.917	226.79
557.337	183.1
557.756	234.08
558.176	219.51
558.596	132.13
559.015	185.53
559.435	158.83
559.854	192.81
560.274	187.96
560.693	127.28
561.112	134.56
561.532	175.82
561.951	166.11
562.37	156.4
562.789	202.52
563.208	127.28
563.627	134.56
564.046	178.25
564.465	90.87
564.884	158.83
565.303	180.68
565.722	224.37
566.14	88.44
566.559	141.84
566.978	202.52
567.396	180.68
567.815	214.66
568.233	183.1
568.652	120
569.07	153.98
569.489	180.68
569.907	129.7
570.325	187.96
570.743	168.54
571.161	195.24
571.58	258.35
571.998	231.65
572.416	105.43
572.833	110.29
573.251	132.13
573.669	105.43
574.087	212.23
574.505	129.7
574.922	168.54
575.34	115.14
575.758	146.7
576.175	173.39
576.593	146.7
577.01	139.41
577.428	141.84
577.845	1554.48
578.262	275.34
578.68	212.23
579.097	139.41
579.514	207.38
579.931	153.98
580.348	175.82
580.765	209.8
581.182	268.06
581.599	175.82
582.016	144.27
582.433	146.7
582.849	180.68
583.266	246.21
583.683	236.5
584.099	236.5
584.516	161.26
584.933	219.51
585.349	192.81
585.765	187.96
586.182	170.97
586.598	158.83
587.014	134.56
587.431	187.96
587.847	141.84
588.263	117.57
588.679	149.12
589.095	175.82
589.511	156.4
589.927	100.58
590.343	158.83
590.759	151.55
591.174	163.69
591.59	166.11
592.006	146.7
592.421	161.26
592.837	115.14
593.252	214.66
593.668	185.53
594.083	209.8
594.499	122.42
594.914	153.98
595.329	187.96
595.745	144.27
596.16	214.66
596.575	221.94
596.99	134.56
597.405	163.69
597.82	170.97
598.235	156.4
598.65	117.57
599.065	146.7
599.479	170.97
599.894	190.39
600.309	134.56
600.724	185.53
601.138	178.25
601.553	163.69
601.967	178.25
602.382	163.69
602.796	187.96
603.21	224.37
603.625	141.84
604.039	168.54
604.453	168.54
604.867	217.08
605.281	212.23
605.695	146.7
606.109	146.7
606.523	175.82
606.937	175.82
607.351	258.35
607.765	139.41
608.178	187.96
608.592	168.54
609.006	221.94
609.419	144.27
609.833	192.81
610.246	197.67
610.66	212.23
611.073	144.27
611.487	190.39
611.9	156.4
612.313	110.29
612.726	149.12
613.139	173.39
613.553	134.56
613.966	185.53
614.379	98.15
614.792	161.26
615.204	190.39
615.617	180.68
616.03	158.83
616.443	192.81
616.856	161.26
617.268	129.7
617.681	141.84
618.093	153.98
618.506	156.4
618.918	124.85
619.331	156.4
619.743	81.16
620.155	190.39
620.568	163.69
620.98	110.29
621.392	200.09
621.804	166.11
622.216	168.54
622.628	149.12
623.04	178.25
623.452	161.26
623.864	144.27
624.276	175.82
624.687	153.98
625.099	166.11
625.511	156.4
625.922	207.38
626.334	156.4
626.745	195.24
627.157	173.39
627.568	158.83
627.979	139.41
628.391	207.38
628.802	238.93
629.213	151.55
629.624	139.41
630.035	190.39
630.446	141.84
630.857	139.41
631.268	161.26
631.679	134.56
632.09	124.85
632.501	158.83
632.912	122.42
633.322	190.39
633.733	127.28
634.144	129.7
634.554	197.67
634.965	166.11
635.375	158.83
635.785	163.69
636.196	204.95
636.606	136.99
637.016	153.98
637.427	103.01
637.837	178.25
638.247	151.55
638.657	129.7
639.067	175.82
639.477	122.42
639.887	166.11
640.297	229.22
640.706	197.67
641.116	185.53
641.526	139.41
641.935	76.31
642.345	202.52
642.755	226.79
643.164	141.84
643.573	134.56
643.983	139.41
644.392	129.7
644.801	185.53
645.211	221.94
645.62	209.8
646.029	170.97
646.438	120
646.847	166.11
647.256	95.72
647.665	183.1
648.074	190.39
648.483	151.55
648.892	144.27
649.3	166.11
649.709	86.01
650.118	153.98
650.526	161.26
650.935	190.39
651.343	98.15
651.752	136.99
652.16	238.93
652.568	231.65
652.977	132.13
653.385	107.86
653.793	103.01
654.201	129.7
654.609	146.7
655.017	173.39
655.425	129.7
655.833	204.95
656.241	120
656.649	161.26
657.057	197.67
657.464	144.27
657.872	158.83
658.28	158.83
658.687	207.38
659.095	183.1
659.502	161.26
659.91	105.43
660.317	141.84
660.724	187.96
661.132	166.11
661.539	156.4
661.946	190.39
662.353	161.26
662.76	221.94
663.167	183.1
663.574	170.97
663.981	151.55
664.388	132.13
664.795	146.7
665.202	153.98
665.608	175.82
666.015	146.7
666.422	195.24
666.828	117.57
667.235	183.1
667.641	158.83
668.047	44.75
668.454	136.99
668.86	209.8
669.266	229.22
669.673	144.27
670.079	98.15
670.485	134.56
670.891	158.83
671.297	146.7
671.703	88.44
672.109	112.71
672.515	166.11
672.92	187.96
673.326	173.39
673.732	178.25
674.138	144.27
674.543	192.81
674.949	229.22
675.354	100.58
675.76	168.54
676.165	136.99
676.57	207.38
676.976	144.27
677.381	132.13
677.786	200.09
678.191	234.08
678.596	173.39
679.001	175.82
679.406	136.99
679.811	214.66
680.216	166.11
680.621	180.68
681.026	197.67
681.43	151.55
681.835	173.39
682.24	260.77
682.644	156.4
683.049	163.69
683.453	161.26
683.858	127.28
684.262	146.7
684.667	166.11
685.071	117.57
685.475	156.4
685.879	129.7
686.283	153.98
686.687	166.11
687.091	151.55
687.495	187.96
687.899	120
688.303	214.66
688.707	197.67
689.111	178.25
689.514	132.13
689.918	129.7
690.322	243.78
690.725	132.13
691.129	187.96
691.532	202.52
691.936	156.4
692.339	166.11
692.742	139.41
693.146	168.54
693.549	200.09
693.952	124.85
694.355	105.43
694.758	115.14
695.161	115.14
695.564	161.26
695.967	81.16
696.37	129.7
696.773	115.14
697.175	158.83
697.578	161.26
697.981	166.11
698.383	185.53
698.786	163.69
699.188	158.83
699.591	78.73
699.993	158.83
700.395	146.7
700.798	168.54
701.2	146.7
701.602	158.83
702.004	132.13
702.406	71.45
702.808	115.14
703.21	156.4
703.612	214.66
704.014	146.7
704.416	219.51
704.818	163.69
705.219	153.98
705.621	185.53
706.023	129.7
706.424	197.67
706.826	243.78
707.227	192.81
707.629	163.69
708.03	231.65
708.431	234.08
708.832	200.09
709.234	144.27
709.635	166.11
710.036	141.84
710.437	141.84
710.838	183.1
711.239	192.81
711.64	207.38
712.041	190.39
712.441	129.7
712.842	151.55
713.243	190.39
713.643	158.83
714.044	212.23
714.445	153.98
714.845	170.97
715.246	175.82
715.646	173.39
716.046	183.1
716.447	166.11
716.847	226.79
717.247	204.95
717.647	151.55
718.047	219.51
718.447	219.51
718.847	163.69
719.247	202.52
719.647	309.32
720.047	224.37
720.446	265.63
720.846	209.8
721.246	229.22
721.645	231.65
722.045	187.96
722.444	268.06
722.844	255.92
723.243	217.08
723.643	246.21
724.042	270.48
724.441	297.18
724.84	243.78
725.24	299.61
725.639	268.06
726.038	260.77
726.437	192.81
726.836	306.89
727.234	326.31
727.633	306.89
728.032	316.6
728.431	316.6
728.83	309.32
729.228	280.19
729.627	272.91
730.025	302.04
730.424	309.32
730.822	362.72
731.22	420.97
731.619	326.31
732.017	360.29
732.415	433.11
732.813	370
733.212	459.81
733.61	459.81
734.008	564.18
734.406	605.44
734.803	624.86
735.201	603.01
735.599	690.39
735.997	680.68
736.395	709.81
736.792	653.98
737.19	704.96
737.587	738.94
737.985	811.75
738.382	823.89
738.78	979.23
739.177	1001.08
739.574	1008.36
739.971	993.8
740.369	906.42
740.766	1132.15
741.163	1144.28
741.56	1202.54
741.957	1236.52
742.354	1275.35
742.751	1260.79
743.147	1518.08
743.544	1420.99
743.941	1573.9
744.338	1654
744.734	1612.74
745.131	1755.94
745.527	1785.07
745.924	1896.72
746.32	2020.51
746.716	1988.96
747.113	2132.16
747.509	2224.4
747.905	2333.62
748.301	2450.13
748.697	2421
749.093	2637.03
749.489	2899.17
749.885	2911.3
750.281	3069.07
750.677	3005.96
751.073	3219.56
751.468	3265.68
751.864	3559.37
752.26	3605.49
752.655	3741.41
753.051	3751.12
753.446	4173.46
753.842	4323.94
754.237	4387.05
754.632	4491.42
755.028	4554.53
755.423	4522.98
755.818	4736.57
756.213	4882.21
756.608	5010.85
757.003	4896.77
757.398	5137.06
757.793	5214.74
758.188	5137.06
758.583	5433.19
758.977	5280.27
759.372	5705.03
759.767	5872.51
760.161	6200.19
760.556	6515.73
760.95	6612.82
761.345	6768.16
761.739	7209.91
762.133	7537.59
762.527	7629.82
762.922	7908.95
763.316	8209.93
763.71	8569.16
764.104	8428.38
764.498	8598.28
764.892	8872.56
765.286	9006.06
765.68	9457.52
766.073	9707.52
766.467	9680.82
766.861	9794.9
767.255	9962.38
767.648	10583.75
768.042	10489.09
768.435	11074.05
768.829	11010.94
769.222	11030.36
769.615	11523.09
770.008	11717.26
770.402	11646.87
770.795	11644.45
771.188	11809.5
771.581	11666.29
771.974	11544.93
772.367	11445.41
772.76	11724.55
773.153	11661.44
773.545	11668.72
773.938	12025.52
774.331	11612.89
774.724	12035.23
775.116	12493.97
775.509	13023.11
775.901	13433.31
776.294	13930.89
776.686	13838.66
777.078	14331.38
777.471	14901.78
777.863	15362.95
778.255	15406.64
778.647	15717.33
779.039	15928.49
779.431	16049.86
779.823	16015.87
780.215	15989.17
780.607	15996.46
780.999	16678.51
781.39	16683.36
781.782	16695.5
782.174	16562
782.565	16741.61
782.957	17268.32
783.348	17612.99
783.74	17404.25
784.131	16831.42
784.522	17443.08
784.914	17183.37
785.305	17159.1
785.696	16921.23
786.087	16763.46
786.478	16455.2
786.869	15872.67
787.26	15722.18
787.651	15176.06
788.042	15365.38
788.433	14909.06
788.823	14875.08
789.214	14561.97
789.605	13998.85
789.995	13928.46
790.386	13544.96
790.776	13838.66
791.167	13433.31
791.557	13651.76
791.948	13569.23
792.338	14260.99
792.728	14828.96
793.118	14299.83
793.508	14292.55
793.898	14663.91
794.288	14734.3
794.678	14608.09
795.068	14576.53
795.458	14452.74
795.848	14231.87
796.238	14753.72
796.627	14241.57
797.017	13986.72
797.406	14098.37
797.796	14544.98
798.185	14578.96
798.575	14401.77
798.964	14316.82
799.354	14399.34
799.743	14790.13
800.132	14700.32
800.521	14484.3
800.91	14826.54
801.299	14394.49
801.688	14498.86
802.077	13884.77
802.466	13986.72
802.855	13938.17
803.244	13710.01
803.633	13297.39
804.021	12853.2
804.41	12831.36
804.799	12343.49
805.187	12020.67
805.576	11882.31
805.964	11770.66
806.352	11302.21
806.741	11676
807.129	11236.67
807.517	10925.99
807.905	11027.93
808.293	10858.03
808.681	11057.06
809.069	10967.25
809.457	11156.58
809.845	11455.12
810.233	11263.37
810.621	11331.34
811.009	11095.89
811.396	11154.15
811.784	11224.54
812.171	11173.57
812.559	10906.57
812.946	10743.95
813.334	10736.67
813.721	10433.26
814.108	10360.45
814.496	10243.94
814.883	10010.93
815.27	9964.81
815.657	10071.61
816.044	10078.89
816.431	10139.57
816.818	9824.03
817.205	9811.89
817.592	9831.31
817.979	9265.77
818.365	9156.54
818.752	8889.55
819.139	8734.21
819.525	8447.8
819.912	8345.85
820.298	8294.88
820.685	8195.36
821.071	7811.86
821.457	7547.3
821.843	7309.43
822.23	7209.91
822.616	6935.64
823.002	6552.13
823.388	6336.11
823.774	6049.7
824.16	6008.44
824.546	5707.46
824.931	5539.98
825.317	5624.94
825.703	5413.77
826.089	5493.87
826.474	5433.19
826.86	5185.61
827.245	5120.07
827.631	5297.26
828.016	5112.79
828.401	5032.69
828.787	4707.45
829.172	4603.08
829.557	4413.75
829.942	4357.93
830.327	4263.26
830.712	4168.6
831.097	4173.46
831.482	4219.57
831.867	4047.24
832.252	3906.46
832.636	3843.35
833.021	3702.58
833.406	3799.66
833.79	3748.69
834.175	3491.41
834.559	3590.92
834.944	3445.29
835.328	3421.02
835.713	3134.61
836.097	3248.69
836.481	3001.11
836.865	2855.48
837.249	2979.26
837.633	2646.73
838.017	2624.89
838.401	2586.05
838.785	2564.21
839.169	2430.71
839.553	2258.38
839.937	2141.87
840.32	2061.77
840.704	2073.91
841.087	1947.69
841.471	1860.31
841.854	1731.67
842.238	1692.84
842.621	1753.52
843.004	1709.83
843.388	1663.71
843.771	1544.78
844.154	1629.73
844.537	1476.81
844.92	1566.62
845.303	1573.9
845.686	1433.12
846.069	1379.72
846.452	1418.56
846.834	1404
847.217	1420.99
847.6	1348.17
847.982	1248.65
848.365	1338.46
848.748	1226.81
849.13	1192.83
849.512	1195.26
849.895	1139.43
850.277	1158.85
850.659	1127.29
851.041	1153.99
851.423	1129.72
851.806	1098.17
852.188	1008.36
852.57	916.12
852.951	969.52
853.333	962.24
853.715	952.53
854.097	850.59
854.479	833.6
854.86	843.31
855.242	729.23
855.623	772.92
856.005	855.44
856.386	748.65
856.768	721.95
857.149	704.96
857.53	646.7
857.911	620
858.292	751.07
858.674	600.59
859.055	588.45
859.436	522.91
859.817	513.21
860.197	532.62
860.578	547.19
860.959	503.5
861.34	454.95
861.72	535.05
862.101	416.12
862.482	440.39
862.862	428.25
863.243	433.11
863.623	430.68
864.003	471.94
864.384	420.97
864.764	435.53
865.144	408.84
865.524	425.83
865.904	433.11
866.284	396.7
866.664	370
867.044	328.74
867.424	323.88
867.804	357.86
868.183	420.97
868.563	379.71
868.943	306.89
869.322	302.04
869.702	299.61
870.081	260.77
870.461	289.9
870.84	333.59
871.22	270.48
871.599	314.17
871.978	243.78
872.357	285.05
872.736	243.78
873.115	280.19
873.494	238.93
873.873	263.2
874.252	192.81
874.631	212.23
875.01	236.5
875.388	263.2
875.767	168.54
876.146	202.52
876.524	285.05
876.903	241.36
877.281	207.38
877.66	180.68
878.038	236.5
878.416	263.2
878.794	192.81
879.173	163.69
879.551	209.8
879.929	224.37
880.307	217.08
880.685	153.98
881.063	187.96
881.441	153.98
881.818	173.39
882.196	180.68
882.574	153.98
882.951	129.7
883.329	136.99
883.707	234.08
884.084	170.97
884.461	158.83
884.839	170.97
885.216	146.7
885.593	168.54
885.971	168.54
886.348	217.08
886.725	195.24
887.102	175.82
887.479	166.11
887.856	139.41
888.233	272.91
888.609	139.41
888.986	178.25
889.363	170.97
889.74	187.96
890.116	149.12
890.493	190.39
890.869	168.54
891.246	134.56
891.622	158.83
891.998	146.7
892.375	144.27
892.751	139.41
893.127	168.54
893.503	149.12
893.879	136.99
894.255	173.39
894.631	212.23
895.007	170.97
895.383	190.39
895.759	170.97
896.134	122.42
896.51	112.71
896.886	110.29
897.261	144.27
897.637	187.96
898.012	175.82
898.388	175.82
898.763	98.15
899.138	158.83
899.514	88.44
899.889	134.56
900.264	156.4
900.639	175.82
901.014	127.28
901.389	183.1
901.764	115.14
902.139	141.84
902.513	168.54
902.888	149.12
903.263	161.26
903.638	86.01
904.012	122.42
904.387	173.39
904.761	136.99
905.136	183.1
905.51	190.39
905.884	153.98
906.259	153.98
906.633	168.54
907.007	76.31
907.381	161.26
907.755	112.71
908.129	156.4
908.503	100.58
908.877	158.83
909.251	146.7
909.624	112.71
909.998	100.58
910.372	197.67
910.745	127.28
911.119	187.96
911.492	115.14
911.866	180.68
912.239	153.98
912.612	217.08
912.986	178.25
913.359	112.71
913.732	129.7
914.105	153.98
914.478	124.85
914.851	66.6
915.224	136.99
915.597	78.73
915.97	149.12
916.343	144.27
916.715	100.58
917.088	124.85
917.461	90.87
917.833	112.71
918.206	190.39
918.578	161.26
918.951	153.98
919.323	139.41
919.695	173.39
920.067	178.25
920.44	49.61
920.812	146.7
921.184	132.13
921.556	202.52
921.928	156.4
922.3	144.27
922.672	183.1
923.043	178.25
923.415	141.84
923.787	187.96
924.158	161.26
924.53	107.86
924.901	136.99
925.273	107.86
925.644	187.96
926.016	120
926.387	100.58
926.758	124.85
927.129	120
927.5	103.01
927.872	144.27
928.243	134.56
928.613	168.54
928.984	180.68
929.355	156.4
929.726	156.4
930.097	100.58
930.467	93.3
930.838	132.13
931.209	149.12
931.579	127.28
931.95	129.7
932.32	175.82
932.69	156.4
933.061	144.27
933.431	124.85
933.801	146.7
934.171	136.99
934.541	151.55
934.911	166.11
935.281	124.85
935.651	207.38
936.021	134.56
936.391	197.67
936.761	129.7
937.13	117.57
937.5	103.01
937.87	134.56
938.239	107.86
938.609	136.99
938.978	153.98
939.347	158.83
939.717	175.82
940.086	178.25
940.455	144.27
940.824	144.27
941.193	149.12
941.562	141.84
941.931	161.26
942.3	117.57
942.669	122.42
943.038	197.67
943.407	170.97
943.775	132.13
944.144	110.29
944.513	151.55
944.881	146.7
945.25	107.86
945.618	103.01
945.986	141.84
946.355	141.84
946.723	156.4
947.091	78.73
947.459	163.69
947.827	161.26
948.195	93.3
948.563	103.01
948.931	88.44
949.299	180.68
949.667	163.69
950.035	98.15
950.402	168.54
950.77	59.32
951.138	117.57
951.505	115.14
951.873	161.26
952.24	221.94
952.607	175.82
952.975	146.7
953.342	149.12
953.709	180.68
954.076	166.11
954.443	88.44
954.81	151.55
955.177	95.72
955.544	166.11
955.911	156.4
956.278	192.81
956.645	134.56
957.012	127.28
957.378	166.11
957.745	149.12
958.111	178.25
958.478	129.7
958.844	163.69
959.211	161.26
959.577	163.69
959.943	168.54
960.309	127.28
960.675	134.56
961.042	110.29
961.408	93.3
961.774	149.12
962.139	175.82
962.505	134.56
962.871	136.99
963.237	134.56
963.603	161.26
963.968	88.44
964.334	190.39
964.699	124.85
965.065	139.41
965.43	158.83
965.796	146.7
966.161	122.42
966.526	134.56
966.891	158.83
967.256	166.11
967.622	144.27
967.987	185.53
968.352	134.56
968.716	153.98
969.081	129.7
969.446	168.54
969.811	141.84
970.176	161.26
970.54	197.67
970.905	178.25
971.269	151.55
971.634	76.31
971.998	149.12
972.363	146.7
972.727	129.7
973.091	197.67
973.455	163.69
973.819	243.78
974.183	71.45
974.547	90.87
974.911	185.53
975.275	183.1
975.639	149.12
976.003	129.7
976.367	93.3
976.73	200.09
977.094	192.81
977.458	173.39
977.821	156.4
978.185	149.12
978.548	151.55
978.911	156.4
979.275	187.96
979.638	185.53
980.001	144.27
980.364	146.7
980.727	183.1
981.09	180.68
981.453	168.54
981.816	156.4
982.179	209.8
982.542	161.26
982.905	185.53
983.267	236.5
983.63	146.7
983.992	202.52
984.355	124.85
984.717	166.11
985.08	168.54
985.442	139.41
985.804	175.82
986.167	127.28
986.529	93.3
986.891	54.46
987.253	76.31
987.615	69.02
987.977	183.1
988.339	105.43
988.701	122.42
989.062	127.28
989.424	180.68
989.786	139.41
990.147	139.41
990.509	153.98
990.87	100.58
991.232	115.14
991.593	144.27
991.955	168.54
992.316	151.55
992.677	149.12
993.038	173.39
993.399	170.97
993.76	134.56
994.121	120
994.482	100.58
994.843	122.42
995.204	183.1
995.565	124.85
995.926	175.82
996.286	132.13
996.647	127.28
997.007	44.75
997.368	73.88
997.728	144.27
998.089	209.8
998.449	139.41
998.809	149.12
999.169	185.53
999.53	166.11
999.89	115.14
1000.25	112.71
1000.61	144.27
1000.97	120
1001.329	105.43
1001.689	144.27
1002.049	146.7
1002.409	98.15
1002.768	117.57
1003.128	120
1003.487	86.01
1003.847	151.55
1004.206	158.83
1004.566	144.27
1004.925	115.14
1005.284	180.68
1005.643	98.15
1006.003	86.01
1006.362	139.41
1006.721	166.11
1007.08	120
1007.438	200.09
1007.797	149.12
1008.156	136.99
1008.515	136.99
1008.874	122.42
1009.232	120
1009.591	120
1009.949	115.14
1010.308	146.7
1010.666	134.56
1011.024	144.27
1011.383	175.82
1011.741	156.4
1012.099	146.7
1012.457	71.45
1012.815	115.14
1013.173	54.46
1013.531	132.13
1013.889	107.86
1014.247	149.12
1014.605	158.83
1014.962	151.55
1015.32	144.27
1015.678	139.41
1016.035	221.94
1016.393	136.99
1016.75	129.7
1017.107	110.29
1017.465	161.26
1017.822	122.42
1018.179	120
1018.536	158.83
1018.894	136.99
1019.251	100.58
1019.608	122.42
1019.964	107.86
1020.321	166.11
1020.678	183.1
1021.035	112.71
1021.392	253.49
1021.748	190.39
1022.105	175.82
1022.461	134.56
1022.818	207.38
1023.174	115.14
1023.531	124.85
1023.887	156.4
1024.243	117.57
1024.599	98.15
1024.955	146.7
1025.311	139.41
1025.667	153.98
1026.023	100.58
1026.379	132.13
1026.735	144.27
1027.091	190.39
1027.447	170.97
