189.514	2.73
189.973	2.73
190.431	2.73
190.889	-21.54
191.348	-4.55
191.806	53.7
192.264	22.15
192.722	27
193.18	56.13
193.638	-16.69
194.096	10.01
194.554	-60.38
195.012	17.29
195.47	-38.53
195.928	27
196.385	14.87
196.843	-2.12
197.301	7.59
197.758	-38.53
198.216	-6.98
198.674	-26.4
199.131	7.59
199.589	39.14
200.046	60.98
200.503	53.7
200.961	53.7
201.418	75.55
201.875	126.52
202.332	68.27
202.79	34.28
203.247	141.08
203.704	77.97
204.161	187.2
204.618	114.38
205.075	133.8
205.532	82.83
205.989	104.67
206.445	128.95
206.902	165.35
207.359	148.36
207.816	196.91
208.272	165.35
208.729	196.91
209.185	182.35
209.642	158.07
210.098	111.96
210.555	184.77
211.011	167.78
211.467	167.78
211.924	170.21
212.38	143.51
212.836	75.55
213.292	90.11
213.748	189.63
214.204	235.74
214.66	107.1
215.116	124.09
215.572	143.51
216.028	124.09
216.484	182.35
216.94	201.76
217.396	109.53
217.851	124.09
218.307	114.38
218.763	138.66
219.218	90.11
219.674	126.52
220.129	148.36
220.585	155.65
221.04	92.54
221.496	150.79
221.951	165.35
222.406	116.81
222.861	124.09
223.317	121.66
223.772	158.07
224.227	104.67
224.682	138.66
225.137	184.77
225.592	172.64
226.047	141.08
226.502	58.56
226.957	138.66
227.411	160.5
227.866	153.22
228.321	143.51
228.776	102.25
229.23	75.55
229.685	131.37
230.139	131.37
230.594	138.66
231.048	155.65
231.503	90.11
231.957	126.52
232.411	116.81
232.865	179.92
233.32	179.92
233.774	148.36
234.228	63.41
234.682	99.82
235.136	143.51
235.59	102.25
236.044	213.9
236.498	167.78
236.952	119.24
237.406	77.97
237.86	189.63
238.313	141.08
238.767	94.97
239.221	150.79
239.674	94.97
240.128	133.8
240.581	167.78
241.035	177.49
241.488	121.66
241.942	192.05
242.395	177.49
242.848	90.11
243.301	199.34
243.755	172.64
244.208	124.09
244.661	102.25
245.114	116.81
245.567	116.81
246.02	213.9
246.473	167.78
246.926	68.27
247.379	109.53
247.832	187.2
248.284	133.8
248.737	172.64
249.19	165.35
249.642	158.07
250.095	162.93
250.547	107.1
251	155.65
251.452	116.81
251.905	221.18
252.357	131.37
252.81	119.24
253.262	111.96
253.714	162.93
254.166	107.1
254.618	99.82
255.07	111.96
255.523	177.49
255.975	172.64
256.427	141.08
256.878	85.26
257.33	111.96
257.782	145.94
258.234	170.21
258.686	221.18
259.137	184.77
259.589	141.08
260.041	82.83
260.492	90.11
260.944	102.25
261.395	87.68
261.847	126.52
262.298	75.55
262.749	162.93
263.201	104.67
263.652	216.33
264.103	165.35
264.554	94.97
265.005	68.27
265.457	189.63
265.908	143.51
266.359	165.35
266.809	114.38
267.26	155.65
267.711	97.39
268.162	92.54
268.613	119.24
269.064	187.2
269.514	192.05
269.965	111.96
270.415	114.38
270.866	228.46
271.316	136.23
271.767	94.97
272.217	92.54
272.668	133.8
273.118	158.07
273.568	179.92
274.019	167.78
274.469	167.78
274.919	131.37
275.369	90.11
275.819	158.07
276.269	235.74
276.719	177.49
277.169	230.89
277.619	121.66
278.069	189.63
278.518	196.91
278.968	133.8
279.418	184.77
279.867	194.48
280.317	199.34
280.767	107.1
281.216	145.94
281.666	121.66
282.115	119.24
282.564	165.35
283.014	136.23
283.463	124.09
283.912	216.33
284.361	201.76
284.811	94.97
285.26	136.23
285.709	162.93
286.158	262.44
286.607	187.2
287.056	143.51
287.505	243.03
287.953	77.97
288.402	158.07
288.851	150.79
289.3	136.23
289.748	97.39
290.197	189.63
290.646	162.93
291.094	102.25
291.543	143.51
291.991	179.92
292.439	192.05
292.888	170.21
293.336	148.36
293.784	80.4
294.233	167.78
294.681	189.63
295.129	124.09
295.577	150.79
296.025	170.21
296.473	128.95
296.921	213.9
297.369	104.67
297.817	94.97
298.264	128.95
298.712	160.5
299.16	194.48
299.608	85.26
300.055	179.92
300.503	138.66
300.95	213.9
301.398	201.76
301.845	155.65
302.293	179.92
302.74	192.05
303.187	148.36
303.635	199.34
304.082	165.35
304.529	109.53
304.976	104.67
305.423	153.22
305.87	94.97
306.317	167.78
306.764	126.52
307.211	199.34
307.658	143.51
308.105	126.52
308.552	187.2
308.998	155.65
309.445	175.06
309.892	189.63
310.338	204.19
310.785	179.92
311.231	114.38
311.678	199.34
312.124	148.36
312.571	158.07
313.017	124.09
313.463	114.38
313.909	133.8
314.356	179.92
314.802	155.65
315.248	119.24
315.694	126.52
316.14	165.35
316.586	92.54
317.032	85.26
317.478	172.64
317.923	170.21
318.369	179.92
318.815	172.64
319.261	162.93
319.706	194.48
320.152	148.36
320.597	172.64
321.043	136.23
321.488	158.07
321.934	206.62
322.379	172.64
322.824	170.21
323.27	218.75
323.715	121.66
324.16	172.64
324.605	170.21
325.05	153.22
325.495	145.94
325.94	172.64
326.385	167.78
326.83	158.07
327.275	165.35
327.72	128.95
328.165	104.67
328.61	155.65
329.054	102.25
329.499	167.78
329.943	172.64
330.388	94.97
330.832	141.08
331.277	143.51
331.721	102.25
332.166	170.21
332.61	204.19
333.054	177.49
333.499	175.06
333.943	138.66
334.387	172.64
334.831	31.86
335.275	104.67
335.719	121.66
336.163	48.85
336.607	162.93
337.051	121.66
337.495	119.24
337.938	177.49
338.382	133.8
338.826	99.82
339.269	121.66
339.713	114.38
340.157	141.08
340.6	143.51
341.044	94.97
341.487	133.8
341.93	133.8
342.374	114.38
342.817	160.5
343.26	153.22
343.703	160.5
344.146	136.23
344.59	153.22
345.033	184.77
345.476	153.22
345.919	39.14
346.361	126.52
346.804	155.65
347.247	148.36
347.69	170.21
348.133	162.93
348.575	128.95
349.018	211.47
349.461	153.22
349.903	119.24
350.346	133.8
350.788	107.1
351.23	124.09
351.673	119.24
352.115	167.78
352.557	68.27
353	170.21
353.442	124.09
353.884	133.8
354.326	102.25
354.768	85.26
355.21	82.83
355.652	167.78
356.094	75.55
356.536	119.24
356.978	167.78
357.419	143.51
357.861	126.52
358.303	192.05
358.744	211.47
359.186	196.91
359.627	211.47
360.069	187.2
360.51	60.98
360.952	143.51
361.393	153.22
361.834	109.53
362.276	104.67
362.717	189.63
363.158	90.11
363.599	167.78
364.04	177.49
364.481	99.82
364.922	187.2
365.363	158.07
365.804	153.22
366.245	158.07
366.686	162.93
367.126	150.79
367.567	196.91
368.008	167.78
368.448	136.23
368.889	121.66
369.33	148.36
369.77	124.09
370.21	153.22
370.651	111.96
371.091	121.66
371.531	184.77
371.972	155.65
372.412	99.82
372.852	162.93
373.292	131.37
373.732	114.38
374.172	128.95
374.612	124.09
375.052	189.63
375.492	116.81
375.932	211.47
376.372	124.09
376.811	167.78
377.251	136.23
377.691	155.65
378.13	150.79
378.57	218.75
379.009	209.04
379.449	116.81
379.888	172.64
380.328	145.94
380.767	153.22
381.206	107.1
381.645	104.67
382.085	153.22
382.524	167.78
382.963	116.81
383.402	199.34
383.841	136.23
384.28	111.96
384.719	148.36
385.158	131.37
385.596	148.36
386.035	201.76
386.474	150.79
386.913	240.6
387.351	184.77
387.79	155.65
388.228	138.66
388.667	189.63
389.105	153.22
389.544	148.36
389.982	104.67
390.42	102.25
390.859	126.52
391.297	107.1
391.735	170.21
392.173	230.89
392.611	192.05
393.049	170.21
393.487	119.24
393.925	121.66
394.363	102.25
394.801	179.92
395.239	77.97
395.676	133.8
396.114	121.66
396.552	92.54
396.989	94.97
397.427	153.22
397.864	153.22
398.302	160.5
398.739	153.22
399.177	153.22
399.614	155.65
400.051	97.39
400.488	145.94
400.926	131.37
401.363	124.09
401.8	162.93
402.237	160.5
402.674	184.77
403.111	121.66
403.548	99.82
403.985	160.5
404.421	85.26
404.858	109.53
405.295	158.07
405.732	102.25
406.168	170.21
406.605	158.07
407.041	126.52
407.478	124.09
407.914	99.82
408.351	133.8
408.787	196.91
409.223	143.51
409.66	114.38
410.096	150.79
410.532	184.77
410.968	150.79
411.404	111.96
411.84	126.52
412.276	252.73
412.712	148.36
413.148	160.5
413.584	133.8
414.02	65.84
414.455	153.22
414.891	182.35
415.327	170.21
415.762	114.38
416.198	119.24
416.633	148.36
417.069	133.8
417.504	128.95
417.94	182.35
418.375	177.49
418.81	211.47
419.245	97.39
419.681	175.06
420.116	87.68
420.551	131.37
420.986	126.52
421.421	209.04
421.856	162.93
422.291	121.66
422.726	97.39
423.16	70.69
423.595	138.66
424.03	158.07
424.464	143.51
424.899	107.1
425.334	209.04
425.768	121.66
426.203	94.97
426.637	187.2
427.071	141.08
427.506	155.65
427.94	179.92
428.374	143.51
428.809	167.78
429.243	158.07
429.677	165.35
430.111	107.1
430.545	128.95
430.979	124.09
431.413	172.64
431.847	99.82
432.28	124.09
432.714	116.81
433.148	145.94
433.582	126.52
434.015	87.68
434.449	141.08
434.882	153.22
435.316	70.69
435.749	153.22
436.183	119.24
436.616	182.35
437.049	170.21
437.483	94.97
437.916	196.91
438.349	184.77
438.782	124.09
439.215	126.52
439.648	131.37
440.081	206.62
440.514	148.36
440.947	194.48
441.38	223.61
441.813	160.5
442.245	167.78
442.678	126.52
443.111	158.07
443.543	279.43
443.976	221.18
444.408	145.94
444.841	209.04
445.273	194.48
445.705	172.64
446.138	189.63
446.57	201.76
447.002	143.51
447.434	97.39
447.867	240.6
448.299	175.06
448.731	155.65
449.163	233.32
449.595	223.61
450.026	194.48
450.458	184.77
450.89	138.66
451.322	218.75
451.754	243.03
452.185	194.48
452.617	199.34
453.048	175.06
453.48	209.04
453.911	211.47
454.343	233.32
454.774	238.17
455.205	172.64
455.637	196.91
456.068	216.33
456.499	226.04
456.93	165.35
457.361	211.47
457.792	247.88
458.223	238.17
458.654	199.34
459.085	218.75
459.516	342.54
459.947	235.74
460.378	192.05
460.808	211.47
461.239	235.74
461.669	148.36
462.1	153.22
462.531	194.48
462.961	250.31
463.391	252.73
463.822	184.77
464.252	281.86
464.682	187.2
465.113	196.91
465.543	226.04
465.973	172.64
466.403	167.78
466.833	243.03
467.263	111.96
467.693	116.81
468.123	240.6
468.553	196.91
468.983	150.79
469.412	194.48
469.842	211.47
470.272	199.34
470.701	172.64
471.131	211.47
471.56	199.34
471.99	170.21
472.419	221.18
472.849	177.49
473.278	162.93
473.707	228.46
474.136	179.92
474.566	196.91
474.995	235.74
475.424	199.34
475.853	250.31
476.282	179.92
476.711	162.93
477.14	199.34
477.569	136.23
477.997	160.5
478.426	145.94
478.855	126.52
479.283	199.34
479.712	148.36
480.141	194.48
480.569	162.93
480.998	167.78
481.426	211.47
481.854	199.34
482.283	162.93
482.711	158.07
483.139	143.51
483.567	204.19
483.995	104.67
484.424	114.38
484.852	141.08
485.28	160.5
485.708	177.49
486.135	216.33
486.563	179.92
486.991	172.64
487.419	116.81
487.847	233.32
488.274	136.23
488.702	184.77
489.129	107.1
489.557	116.81
489.984	260.02
490.412	162.93
490.839	189.63
491.266	194.48
491.694	119.24
492.121	160.5
492.548	209.04
492.975	148.36
493.402	131.37
493.829	150.79
494.256	162.93
494.683	177.49
495.11	162.93
495.537	138.66
495.964	177.49
496.39	165.35
496.817	221.18
497.244	206.62
497.67	136.23
498.097	218.75
498.523	138.66
498.95	155.65
499.376	192.05
499.803	194.48
500.229	177.49
500.655	192.05
501.081	90.11
501.508	199.34
501.934	182.35
502.36	158.07
502.786	206.62
503.212	211.47
503.638	187.2
504.064	148.36
504.489	167.78
504.915	150.79
505.341	228.46
505.767	218.75
506.192	184.77
506.618	126.52
507.043	179.92
507.469	206.62
507.894	223.61
508.32	133.8
508.745	182.35
509.17	196.91
509.596	194.48
510.021	167.78
510.446	165.35
510.871	160.5
511.296	162.93
511.721	170.21
512.146	182.35
512.571	150.79
512.996	177.49
513.421	177.49
513.845	179.92
514.27	167.78
514.695	187.2
515.119	184.77
515.544	194.48
515.969	160.5
516.393	187.2
516.817	187.2
517.242	177.49
517.666	111.96
518.09	116.81
518.515	92.54
518.939	119.24
519.363	374.1
519.787	172.64
520.211	162.93
520.635	175.06
521.059	179.92
521.483	204.19
521.907	133.8
522.331	165.35
522.754	172.64
523.178	162.93
523.602	182.35
524.025	196.91
524.449	143.51
524.872	196.91
525.296	206.62
525.719	124.09
526.143	182.35
526.566	172.64
526.989	143.51
527.412	179.92
527.836	201.76
528.259	138.66
528.682	121.66
529.105	196.91
529.528	131.37
529.951	209.04
530.374	175.06
530.796	131.37
531.219	128.95
531.642	143.51
532.065	153.22
532.487	158.07
532.91	243.03
533.332	160.5
533.755	211.47
534.177	114.38
534.6	124.09
535.022	213.9
535.444	245.45
535.867	162.93
536.289	243.03
536.711	160.5
537.133	228.46
537.555	204.19
537.977	194.48
538.399	206.62
538.821	218.75
539.243	155.65
539.665	209.04
540.086	150.79
540.508	189.63
540.93	75.55
541.351	153.22
541.773	187.2
542.195	121.66
542.616	162.93
543.037	187.2
543.459	228.46
543.88	138.66
544.301	172.64
544.723	245.45
545.144	213.9
545.565	223.61
545.986	201.76
546.407	243.03
546.828	247.88
547.249	189.63
547.67	111.96
548.091	194.48
548.512	199.34
548.932	104.67
549.353	170.21
549.774	187.2
550.194	158.07
550.615	162.93
551.035	150.79
551.456	150.79
551.876	136.23
552.296	160.5
552.717	187.2
553.137	177.49
553.557	179.92
553.977	175.06
554.397	182.35
554.817	133.8
555.237	121.66
555.657	138.66
556.077	162.93
556.497	199.34
556.917	155.65
557.337	228.46
557.756	247.88
558.176	184.77
558.596	165.35
559.015	187.2
559.435	199.34
559.854	128.95
560.274	211.47
560.693	238.17
561.112	165.35
561.532	145.94
561.951	143.51
562.37	187.2
562.789	172.64
563.208	124.09
563.627	124.09
564.046	128.95
564.465	97.39
564.884	162.93
565.303	211.47
565.722	192.05
566.14	167.78
566.559	175.06
566.978	201.76
567.396	150.79
567.815	182.35
568.233	213.9
568.652	150.79
569.07	97.39
569.489	226.04
569.907	172.64
570.325	182.35
570.743	153.22
571.161	194.48
571.58	223.61
571.998	199.34
572.416	240.6
572.833	119.24
573.251	143.51
573.669	170.21
574.087	243.03
574.505	155.65
574.922	150.79
575.34	177.49
575.758	68.27
576.175	128.95
576.593	201.76
577.01	73.12
577.428	230.89
577.845	1507.61
578.262	289.14
578.68	153.22
579.097	230.89
579.514	133.8
579.931	153.22
580.348	206.62
580.765	170.21
581.182	228.46
581.599	145.94
582.016	281.86
582.433	87.68
582.849	179.92
583.266	179.92
583.683	121.66
584.099	175.06
584.516	133.8
584.933	196.91
585.349	150.79
585.765	218.75
586.182	177.49
586.598	213.9
587.014	121.66
587.431	240.6
587.847	114.38
588.263	124.09
588.679	192.05
589.095	172.64
589.511	184.77
589.927	172.64
590.343	158.07
590.759	160.5
591.174	177.49
591.59	73.12
592.006	238.17
592.421	165.35
592.837	155.65
593.252	145.94
593.668	158.07
594.083	201.76
594.499	167.78
594.914	162.93
595.329	148.36
595.745	80.4
596.16	194.48
596.575	131.37
596.99	114.38
597.405	136.23
597.82	102.25
598.235	235.74
598.65	170.21
599.065	73.12
599.479	187.2
599.894	160.5
600.309	141.08
600.724	116.81
601.138	184.77
601.553	136.23
601.967	136.23
602.382	182.35
602.796	199.34
603.21	160.5
603.625	136.23
604.039	187.2
604.453	114.38
604.867	145.94
605.281	223.61
605.695	111.96
606.109	167.78
606.523	172.64
606.937	148.36
607.351	245.45
607.765	150.79
608.178	77.97
608.592	133.8
609.006	196.91
609.419	204.19
609.833	170.21
610.246	153.22
610.66	131.37
611.073	172.64
611.487	177.49
611.9	148.36
612.313	218.75
612.726	160.5
613.139	179.92
613.553	97.39
613.966	199.34
614.379	102.25
614.792	70.69
615.204	167.78
615.617	187.2
616.03	124.09
616.443	145.94
616.856	145.94
617.268	182.35
617.681	175.06
618.093	167.78
618.506	153.22
618.918	194.48
619.331	175.06
619.743	116.81
620.155	145.94
620.568	211.47
620.98	160.5
621.392	196.91
621.804	230.89
622.216	116.81
622.628	131.37
623.04	138.66
623.452	138.66
623.864	155.65
624.276	175.06
624.687	145.94
625.099	194.48
625.511	138.66
625.922	170.21
626.334	175.06
626.745	216.33
627.157	97.39
627.568	230.89
627.979	170.21
628.391	150.79
628.802	243.03
629.213	194.48
629.624	111.96
630.035	126.52
630.446	182.35
630.857	172.64
631.268	170.21
631.679	104.67
632.09	165.35
632.501	128.95
632.912	141.08
633.322	196.91
633.733	189.63
634.144	165.35
634.554	177.49
634.965	216.33
635.375	199.34
635.785	175.06
636.196	124.09
636.606	136.23
637.016	194.48
637.427	160.5
637.837	175.06
638.247	145.94
638.657	138.66
639.067	150.79
639.477	187.2
639.887	150.79
640.297	133.8
640.706	131.37
641.116	150.79
641.526	116.81
641.935	177.49
642.345	165.35
642.755	201.76
643.164	136.23
643.573	158.07
643.983	141.08
644.392	209.04
644.801	165.35
645.211	155.65
645.62	158.07
646.029	179.92
646.438	116.81
646.847	177.49
647.256	182.35
647.665	218.75
648.074	213.9
648.483	182.35
648.892	143.51
649.3	138.66
649.709	145.94
650.118	204.19
650.526	175.06
650.935	138.66
651.343	155.65
651.752	107.1
652.16	182.35
652.568	131.37
652.977	187.2
653.385	199.34
653.793	90.11
654.201	184.77
654.609	172.64
655.017	201.76
655.425	172.64
655.833	182.35
656.241	104.67
656.649	145.94
657.057	99.82
657.464	148.36
657.872	126.52
658.28	153.22
658.687	216.33
659.095	150.79
659.502	206.62
659.91	94.97
660.317	141.08
660.724	58.56
661.132	172.64
661.539	150.79
661.946	201.76
662.353	187.2
662.76	172.64
663.167	160.5
663.574	131.37
663.981	119.24
664.388	143.51
664.795	141.08
665.202	155.65
665.608	155.65
666.015	175.06
666.422	155.65
666.828	177.49
667.235	179.92
667.641	155.65
668.047	121.66
668.454	107.1
668.86	187.2
669.266	102.25
669.673	216.33
670.079	170.21
670.485	141.08
670.891	102.25
671.297	141.08
671.703	177.49
672.109	107.1
672.515	170.21
672.92	158.07
673.326	201.76
673.732	102.25
674.138	184.77
674.543	172.64
674.949	150.79
675.354	107.1
675.76	187.2
676.165	179.92
676.57	167.78
676.976	196.91
677.381	141.08
677.786	155.65
678.191	145.94
678.596	131.37
679.001	184.77
679.406	218.75
679.811	167.78
680.216	279.43
680.621	204.19
681.026	80.4
681.43	196.91
681.835	160.5
682.24	184.77
682.644	162.93
683.049	133.8
683.453	196.91
683.858	150.79
684.262	194.48
684.667	175.06
685.071	194.48
685.475	172.64
685.879	124.09
686.283	192.05
686.687	167.78
687.091	158.07
687.495	141.08
687.899	126.52
688.303	148.36
688.707	116.81
689.111	63.41
689.514	136.23
689.918	228.46
690.322	141.08
690.725	158.07
691.129	192.05
691.532	179.92
691.936	136.23
692.339	102.25
692.742	87.68
693.146	226.04
693.549	192.05
693.952	209.04
694.355	179.92
694.758	141.08
695.161	177.49
695.564	167.78
695.967	94.97
696.37	155.65
696.773	235.74
697.175	150.79
697.578	167.78
697.981	192.05
698.383	136.23
698.786	162.93
699.188	124.09
699.591	131.37
699.993	138.66
700.395	272.15
700.798	160.5
701.2	247.88
701.602	192.05
702.004	201.76
702.406	204.19
702.808	99.82
703.21	184.77
703.612	213.9
704.014	213.9
704.416	201.76
704.818	274.58
705.219	257.59
705.621	264.87
706.023	138.66
706.424	196.91
706.826	126.52
707.227	177.49
707.629	238.17
708.03	243.03
708.431	201.76
708.832	301.28
709.234	184.77
709.635	235.74
710.036	238.17
710.437	177.49
710.838	245.45
711.239	170.21
711.64	167.78
712.041	272.15
712.441	247.88
712.842	226.04
713.243	264.87
713.643	277.01
714.044	179.92
714.445	240.6
714.845	320.7
715.246	255.16
715.646	252.73
716.046	337.69
716.447	279.43
716.847	303.71
717.247	332.83
717.647	291.57
718.047	344.97
718.447	323.12
718.847	313.42
719.247	410.5
719.647	476.04
720.047	349.82
720.446	352.25
720.846	371.67
721.246	359.53
721.645	352.25
722.045	349.82
722.444	354.68
722.844	388.66
723.243	466.33
723.643	410.5
724.042	388.66
724.441	483.32
724.84	388.66
725.24	468.76
725.639	417.79
726.038	434.78
726.437	459.05
726.836	485.75
727.234	497.88
727.633	478.47
728.032	599.83
728.431	556.14
728.83	597.4
729.228	638.66
729.627	667.79
730.025	740.61
730.424	735.75
730.822	779.44
731.22	917.79
731.619	842.55
732.017	861.97
732.415	1012.46
732.813	1034.3
733.212	1148.38
733.61	1211.49
734.008	1327.99
734.406	1429.94
734.803	1359.55
735.201	1497.9
735.599	1609.55
735.997	1677.51
736.395	1735.77
736.792	1842.57
737.19	2104.71
737.587	2073.15
737.985	2141.11
738.382	2269.76
738.78	2378.98
739.177	2497.92
739.574	2711.51
739.971	2774.62
740.369	3090.16
740.766	3196.96
741.163	3209.09
741.56	3463.95
741.957	3427.54
742.354	3563.47
742.751	3723.66
743.147	4051.34
743.544	4056.19
743.941	4330.47
744.338	4607.17
744.734	4726.11
745.131	4859.6
745.527	5187.28
745.924	5410.58
746.32	5752.82
746.716	6044.09
747.113	6294.09
747.509	6624.19
747.905	7024.68
748.301	7167.89
748.697	7536.83
749.093	7626.64
749.489	7849.94
749.885	8313.54
750.281	8638.79
750.677	9121.8
751.073	9832.98
751.468	10022.3
751.864	10459.2
752.26	10735.91
752.655	11490.77
753.051	11354.85
753.446	11806.31
753.842	12255.35
754.237	12937.4
754.632	13155.85
755.028	13204.39
755.423	13750.52
755.818	13976.25
756.213	14439.85
756.608	14847.62
757.003	14850.05
757.398	15187.43
757.793	15070.93
758.188	15369.47
758.583	15910.75
758.977	16163.18
759.372	16488.42
759.767	17456.89
760.161	18369.52
760.556	19015.16
760.95	19952.07
761.345	20522.47
761.739	21425.39
762.133	21483.65
762.527	23092.9
762.922	23291.93
763.316	24532.24
763.71	24949.72
764.104	25325.94
764.498	26406.05
764.892	26796.84
765.286	26915.77
765.68	27799.28
766.073	28471.62
766.467	29003.18
766.861	29008.04
767.255	30452.23
767.648	31063.89
768.042	31250.79
768.435	32464.4
768.829	32983.83
769.222	33493.54
769.615	33471.7
770.008	33911.03
770.402	34508.12
770.795	34037.24
771.188	35000.85
771.581	34061.51
771.974	34338.22
772.367	34289.67
772.76	34945.02
773.153	34408.61
773.545	34156.17
773.938	35185.32
774.331	35243.57
774.724	35483.87
775.116	37379.53
775.509	38168.37
775.901	40583.46
776.294	40333.46
776.686	40350.45
777.078	42233.97
777.471	42627.18
777.863	44287.4
778.255	45484.02
778.647	45416.06
779.039	46476.75
779.431	45595.67
779.823	46525.3
780.215	47508.32
780.607	45940.34
780.999	47207.35
781.39	48013.19
781.782	48566.59
782.174	48673.39
782.565	48088.43
782.957	49093.3
783.348	49717.1
783.74	49911.27
784.131	50018.07
784.522	50214.68
784.914	49894.28
785.305	49503.5
785.696	48102.99
786.087	48241.35
786.478	47962.21
786.869	46493.75
787.26	45869.95
787.651	44794.69
788.042	44831.1
788.433	44083.51
788.823	41993.68
789.214	41811.63
789.605	41017.93
789.995	40170.83
790.386	39474.22
790.776	39425.67
791.167	39432.96
791.557	40299.47
791.948	39966.94
792.338	41297.06
792.728	41935.42
793.118	41430.56
793.508	42110.18
793.898	42527.66
794.288	41765.52
794.678	42102.9
795.068	42231.54
795.458	41801.92
795.848	42593.2
796.238	42610.19
796.627	41707.26
797.017	42005.81
797.406	41246.09
797.796	40707.25
798.185	41843.19
798.575	41857.75
798.964	41483.96
799.354	42265.52
799.743	42231.54
800.132	41566.48
800.521	41925.71
800.91	41974.26
801.299	41872.31
801.688	41590.76
802.077	40204.81
802.466	40891.72
802.855	40697.54
803.244	39236.35
803.633	38988.77
804.021	38481.48
804.41	37607.68
804.799	37175.64
805.187	36423.2
805.576	35311.53
805.964	34173.17
806.352	33279.95
806.741	33105.19
807.129	32192.55
807.517	32296.92
807.905	32503.24
808.293	32486.25
808.681	32457.12
809.069	31634.29
809.457	33394.03
809.845	33173.15
810.233	33129.46
810.621	34037.24
811.009	33401.31
811.396	32906.16
811.784	33692.58
812.171	33442.57
812.559	32765.38
812.946	32648.87
813.334	31860.02
813.721	31003.21
814.108	30046.89
814.496	30214.37
814.883	29869.7
815.27	30437.67
815.657	29927.95
816.044	29090.56
816.431	28656.09
816.818	29279.89
817.205	28517.74
817.592	28862.4
817.979	28410.94
818.365	27923.07
818.752	26840.53
819.139	26357.51
819.525	25224
819.912	25199.72
820.298	24876.9
820.685	23801.64
821.071	23367.17
821.457	22728.81
821.843	21930.26
822.23	21571.03
822.616	20296.74
823.002	19398.66
823.388	18609.82
823.774	18061.26
824.16	17536.98
824.546	17068.53
824.931	16867.07
825.317	16876.78
825.703	16313.66
826.089	16102.5
826.474	16289.39
826.86	15687.44
827.245	15228.7
827.631	15170.44
828.016	15425.3
828.401	14597.62
828.787	14498.1
829.172	14027.22
829.557	13663.14
829.942	13316.04
830.327	13172.84
830.712	12857.3
831.097	12313.6
831.482	12308.75
831.867	11818.45
832.252	11614.56
832.636	11585.44
833.021	11049.02
833.406	11189.8
833.79	10934.94
834.175	10820.86
834.559	10510.18
834.944	10155.8
835.328	9765.02
835.713	9621.81
836.097	9398.51
836.481	9051.42
836.865	8915.49
837.249	8345.09
837.633	8265
838.017	7934.89
838.401	7466.44
838.785	7422.75
839.169	7129.06
839.553	6811.09
839.937	6553.8
840.32	6172.73
840.704	5925.15
841.087	5743.11
841.471	5563.5
841.854	5396.02
842.238	5345.05
842.621	5211.55
843.004	4973.68
843.388	4857.18
843.771	4949.41
844.154	4832.9
844.537	4665.42
844.92	4716.4
845.303	4587.75
845.686	4364.45
846.069	4112.02
846.452	4143.57
846.834	4148.43
847.217	3929.98
847.6	3929.98
847.982	3927.55
848.365	3755.22
848.748	3585.31
849.13	3665.41
849.512	3476.09
849.895	3539.19
850.277	3374.14
850.659	3153.27
851.041	3226.08
851.423	3201.81
851.806	3063.46
852.188	2937.24
852.57	2813.45
852.951	2849.86
853.333	2801.32
853.715	2653.26
854.097	2747.92
854.479	2626.56
854.86	2534.32
855.242	2471.22
855.623	2345
856.005	2211.5
856.386	2162.96
856.768	2085.29
857.149	2029.46
857.53	1912.95
857.911	1932.37
858.292	1859.56
858.674	1779.46
859.055	1677.51
859.436	1478.48
859.817	1473.63
860.197	1473.63
860.578	1408.09
860.959	1281.88
861.34	1250.32
861.72	1257.6
862.101	1296.44
862.482	1269.74
862.862	1148.38
863.243	1250.32
863.623	1196.92
864.003	1087.7
864.384	1039.15
864.764	985.76
865.144	968.77
865.524	1019.74
865.904	929.93
866.284	1056.15
866.664	908.08
867.044	791.58
867.424	854.69
867.804	825.56
868.183	827.99
868.563	755.17
868.943	694.49
869.322	713.91
869.702	713.91
870.081	721.19
870.461	592.55
870.84	626.53
871.22	582.84
871.599	667.79
871.978	624.1
872.357	512.45
872.736	551.28
873.115	582.84
873.494	546.43
873.873	544
874.252	536.72
874.631	456.62
875.01	446.91
875.388	400.8
875.767	330.41
876.146	425.07
876.524	408.08
876.903	420.21
877.281	371.67
877.66	301.28
878.038	303.71
878.416	403.22
878.794	301.28
879.173	298.85
879.551	325.55
879.929	289.14
880.307	323.12
880.685	235.74
881.063	354.68
881.441	272.15
881.818	213.9
882.196	233.32
882.574	264.87
882.951	257.59
883.329	226.04
883.707	303.71
884.084	247.88
884.461	286.72
884.839	228.46
885.216	235.74
885.593	148.36
885.971	228.46
886.348	255.16
886.725	262.44
887.102	211.47
887.479	281.86
887.856	102.25
888.233	252.73
888.609	272.15
888.986	189.63
889.363	201.76
889.74	201.76
890.116	240.6
890.493	245.45
890.869	199.34
891.246	167.78
891.622	233.32
891.998	201.76
892.375	133.8
892.751	192.05
893.127	170.21
893.503	196.91
893.879	216.33
894.255	187.2
894.631	165.35
895.007	155.65
895.383	221.18
895.759	192.05
896.134	68.27
896.51	211.47
896.886	102.25
897.261	172.64
897.637	128.95
898.012	155.65
898.388	192.05
898.763	148.36
899.138	143.51
899.514	179.92
899.889	133.8
900.264	179.92
900.639	216.33
901.014	162.93
901.389	141.08
901.764	155.65
902.139	230.89
902.513	143.51
902.888	138.66
903.263	128.95
903.638	119.24
904.012	150.79
904.387	77.97
904.761	182.35
905.136	128.95
905.51	196.91
905.884	153.22
906.259	126.52
906.633	124.09
907.007	145.94
907.381	160.5
907.755	109.53
908.129	158.07
908.503	97.39
908.877	131.37
909.251	111.96
909.624	128.95
909.998	114.38
910.372	153.22
910.745	145.94
911.119	114.38
911.492	145.94
911.866	97.39
912.239	150.79
912.612	167.78
912.986	104.67
913.359	192.05
913.732	63.41
914.105	172.64
914.478	138.66
914.851	160.5
915.224	131.37
915.597	189.63
915.97	192.05
916.343	77.97
916.715	138.66
917.088	192.05
917.461	177.49
917.833	184.77
918.206	150.79
918.578	138.66
918.951	124.09
919.323	121.66
919.695	150.79
920.067	184.77
920.44	223.61
920.812	148.36
921.184	73.12
921.556	160.5
921.928	124.09
922.3	77.97
922.672	194.48
923.043	141.08
923.415	114.38
923.787	155.65
924.158	99.82
924.53	175.06
924.901	99.82
925.273	107.1
925.644	104.67
926.016	133.8
926.387	172.64
926.758	121.66
927.129	141.08
927.5	167.78
927.872	167.78
928.243	111.96
928.613	131.37
928.984	104.67
929.355	107.1
929.726	167.78
930.097	170.21
930.467	119.24
930.838	109.53
931.209	63.41
931.579	60.98
931.95	141.08
932.32	109.53
932.69	167.78
933.061	138.66
933.431	150.79
933.801	182.35
934.171	104.67
934.541	170.21
934.911	167.78
935.281	206.62
935.651	94.97
936.021	189.63
936.391	114.38
936.761	107.1
937.13	136.23
937.5	124.09
937.87	104.67
938.239	184.77
938.609	184.77
938.978	128.95
939.347	85.26
939.717	109.53
940.086	53.7
940.455	90.11
940.824	209.04
941.193	124.09
941.562	192.05
941.931	170.21
942.3	141.08
942.669	102.25
943.038	189.63
943.407	167.78
943.775	148.36
944.144	116.81
944.513	179.92
944.881	109.53
945.25	192.05
945.618	128.95
945.986	145.94
946.355	160.5
946.723	141.08
947.091	162.93
947.459	160.5
947.827	121.66
948.195	121.66
948.563	187.2
948.931	126.52
949.299	160.5
949.667	150.79
950.035	116.81
950.402	126.52
950.77	63.41
951.138	82.83
951.505	182.35
951.873	133.8
952.24	136.23
952.607	126.52
952.975	136.23
953.342	116.81
953.709	184.77
954.076	119.24
954.443	175.06
954.81	175.06
955.177	155.65
955.544	167.78
955.911	148.36
956.278	145.94
956.645	223.61
957.012	94.97
957.378	150.79
957.745	116.81
958.111	51.28
958.478	121.66
958.844	119.24
959.211	160.5
959.577	126.52
959.943	141.08
960.309	182.35
960.675	167.78
961.042	80.4
961.408	158.07
961.774	109.53
962.139	90.11
962.505	160.5
962.871	172.64
963.237	133.8
963.603	94.97
963.968	133.8
964.334	158.07
964.699	172.64
965.065	170.21
965.43	228.46
965.796	138.66
966.161	143.51
966.526	102.25
966.891	124.09
967.256	131.37
967.622	153.22
967.987	128.95
968.352	97.39
968.716	85.26
969.081	104.67
969.446	177.49
969.811	85.26
970.176	143.51
970.54	192.05
970.905	75.55
971.269	111.96
971.634	77.97
971.998	133.8
972.363	121.66
972.727	175.06
973.091	102.25
973.455	194.48
973.819	141.08
974.183	141.08
974.547	141.08
974.911	141.08
975.275	145.94
975.639	85.26
976.003	136.23
976.367	211.47
976.73	187.2
977.094	150.79
977.458	218.75
977.821	155.65
978.185	160.5
978.548	126.52
978.911	109.53
979.275	167.78
979.638	138.66
980.001	233.32
980.364	111.96
980.727	109.53
981.09	162.93
981.453	131.37
981.816	85.26
982.179	230.89
982.542	102.25
982.905	138.66
983.267	124.09
983.63	136.23
983.992	128.95
984.355	133.8
984.717	102.25
985.08	104.67
985.442	99.82
985.804	46.42
986.167	167.78
986.529	138.66
986.891	131.37
987.253	160.5
987.615	138.66
987.977	92.54
988.339	10.01
988.701	172.64
989.062	99.82
989.424	99.82
989.786	145.94
990.147	158.07
990.509	170.21
990.87	201.76
991.232	124.09
991.593	104.67
991.955	131.37
992.316	189.63
992.677	189.63
993.038	97.39
993.399	119.24
993.76	153.22
994.121	124.09
994.482	175.06
994.843	131.37
995.204	131.37
995.565	175.06
995.926	97.39
996.286	153.22
996.647	121.66
997.007	128.95
997.368	141.08
997.728	162.93
998.089	145.94
998.449	153.22
998.809	138.66
999.169	104.67
999.53	102.25
999.89	233.32
1000.25	143.51
1000.61	90.11
1000.97	143.51
1001.329	102.25
1001.689	97.39
1002.049	162.93
1002.409	150.79
1002.768	131.37
1003.128	90.11
1003.487	104.67
1003.847	148.36
1004.206	109.53
1004.566	133.8
1004.925	153.22
1005.284	131.37
1005.643	94.97
1006.003	175.06
1006.362	194.48
1006.721	141.08
1007.08	107.1
1007.438	148.36
1007.797	119.24
1008.156	75.55
1008.515	184.77
1008.874	131.37
1009.232	94.97
1009.591	109.53
1009.949	111.96
1010.308	211.47
1010.666	218.75
1011.024	179.92
1011.383	179.92
1011.741	148.36
1012.099	150.79
1012.457	111.96
1012.815	75.55
1013.173	145.94
1013.531	153.22
1013.889	97.39
1014.247	148.36
1014.605	111.96
1014.962	179.92
1015.32	126.52
1015.678	121.66
1016.035	116.81
1016.393	97.39
1016.75	145.94
1017.107	131.37
1017.465	109.53
1017.822	150.79
1018.179	175.06
1018.536	182.35
1018.894	109.53
1019.251	165.35
1019.608	196.91
1019.964	196.91
1020.321	107.1
1020.678	141.08
1021.035	124.09
1021.392	155.65
1021.748	145.94
1022.105	126.52
1022.461	184.77
1022.818	184.77
1023.174	121.66
1023.531	104.67
1023.887	143.51
1024.243	119.24
1024.599	77.97
1024.955	153.22
1025.311	177.49
1025.667	131.37
1026.023	133.8
1026.379	116.81
1026.735	124.09
1027.091	138.66
1027.447	121.66
