189.514	35.19
189.973	35.19
190.431	35.19
190.889	27.91
191.348	30.34
191.806	-13.35
192.264	25.49
192.722	-61.89
193.18	-54.61
193.638	40.05
194.096	35.19
194.554	-13.35
195.012	-18.2
195.47	6.07
195.928	-35.19
196.385	-1.21
196.843	27.91
197.301	-49.76
197.758	3.64
198.216	49.76
198.674	49.76
199.131	-3.64
199.589	18.2
200.046	141.99
200.503	86.17
200.961	117.72
201.418	69.18
201.875	129.86
202.332	91.02
202.79	108.01
203.247	129.86
203.704	127.43
204.161	117.72
204.618	166.26
205.075	168.69
205.532	137.14
205.989	144.42
206.445	61.89
206.902	173.55
207.359	125
207.816	144.42
208.272	166.26
208.729	214.81
209.185	151.7
209.642	168.69
210.098	178.4
210.555	146.85
211.011	168.69
211.467	219.66
211.924	149.27
212.38	139.57
212.836	202.67
213.292	146.85
213.748	178.4
214.204	175.97
214.66	144.42
215.116	139.57
215.572	100.73
216.028	71.6
216.484	129.86
216.94	166.26
217.396	171.12
217.851	200.25
218.307	59.47
218.763	146.85
219.218	151.7
219.674	115.29
220.129	161.41
220.585	137.14
221.04	115.29
221.496	91.02
221.951	64.32
222.406	166.26
222.861	112.87
223.317	141.99
223.772	117.72
224.227	93.45
224.682	120.15
225.137	137.14
225.592	197.82
226.047	120.15
226.502	144.42
226.957	168.69
227.411	144.42
227.866	154.13
228.321	88.59
228.776	154.13
229.23	88.59
229.685	117.72
230.139	95.88
230.594	195.39
231.048	105.58
231.503	168.69
231.957	137.14
232.411	132.28
232.865	166.26
233.32	86.17
233.774	158.98
234.228	100.73
234.682	120.15
235.136	125
235.59	71.6
236.044	183.26
236.498	149.27
236.952	195.39
237.406	98.3
237.86	139.57
238.313	166.26
238.767	149.27
239.221	122.57
239.674	129.86
240.128	134.71
240.581	98.3
241.035	100.73
241.488	185.68
241.942	132.28
242.395	161.41
242.848	161.41
243.301	66.75
243.755	129.86
244.208	103.16
244.661	115.29
245.114	115.29
245.567	129.86
246.02	185.68
246.473	173.55
246.926	185.68
247.379	127.43
247.832	127.43
248.284	146.85
248.737	144.42
249.19	134.71
249.642	197.82
250.095	168.69
250.547	149.27
251	105.58
251.452	156.56
251.905	134.71
252.357	139.57
252.81	144.42
253.262	127.43
253.714	185.68
254.166	183.26
254.618	103.16
255.07	117.72
255.523	168.69
255.975	188.11
256.427	98.3
256.878	173.55
257.33	117.72
257.782	171.12
258.234	112.87
258.686	91.02
259.137	120.15
259.589	127.43
260.041	137.14
260.492	74.03
260.944	171.12
261.395	117.72
261.847	146.85
262.298	76.46
262.749	103.16
263.201	173.55
263.652	95.88
264.103	125
264.554	95.88
265.005	149.27
265.457	74.03
265.908	127.43
266.359	69.18
266.809	129.86
267.26	171.12
267.711	207.53
268.162	163.84
268.613	69.18
269.064	146.85
269.514	115.29
269.965	146.85
270.415	207.53
270.866	180.83
271.316	127.43
271.767	178.4
272.217	125
272.668	134.71
273.118	120.15
273.568	149.27
274.019	127.43
274.469	137.14
274.919	137.14
275.369	137.14
275.819	93.45
276.269	166.26
276.719	180.83
277.169	146.85
277.619	173.55
278.069	74.03
278.518	229.37
278.968	120.15
279.418	91.02
279.867	161.41
280.317	127.43
280.767	103.16
281.216	117.72
281.666	163.84
282.115	117.72
282.564	137.14
283.014	93.45
283.463	132.28
283.912	158.98
284.361	112.87
284.811	129.86
285.26	98.3
285.709	108.01
286.158	108.01
286.607	122.57
287.056	129.86
287.505	178.4
287.953	185.68
288.402	205.1
288.851	146.85
289.3	129.86
289.748	166.26
290.197	161.41
290.646	141.99
291.094	95.88
291.543	132.28
291.991	122.57
292.439	129.86
292.888	129.86
293.336	132.28
293.784	137.14
294.233	217.24
294.681	156.56
295.129	144.42
295.577	129.86
296.025	120.15
296.473	117.72
296.921	141.99
297.369	112.87
297.817	175.97
298.264	127.43
298.712	180.83
299.16	110.44
299.608	149.27
300.055	183.26
300.503	183.26
300.95	209.95
301.398	108.01
301.845	154.13
302.293	161.41
302.74	95.88
303.187	175.97
303.635	110.44
304.082	91.02
304.529	93.45
304.976	212.38
305.423	125
305.87	154.13
306.317	120.15
306.764	154.13
307.211	141.99
307.658	122.57
308.105	103.16
308.552	173.55
308.998	168.69
309.445	163.84
309.892	112.87
310.338	103.16
310.785	158.98
311.231	188.11
311.678	171.12
312.124	127.43
312.571	108.01
313.017	129.86
313.463	248.79
313.909	200.25
314.356	125
314.802	129.86
315.248	158.98
315.694	129.86
316.14	81.31
316.586	146.85
317.032	171.12
317.478	171.12
317.923	180.83
318.369	180.83
318.815	122.57
319.261	180.83
319.706	108.01
320.152	112.87
320.597	115.29
321.043	156.56
321.488	188.11
321.934	161.41
322.379	129.86
322.824	117.72
323.27	122.57
323.715	112.87
324.16	156.56
324.605	110.44
325.05	207.53
325.495	158.98
325.94	81.31
326.385	71.6
326.83	117.72
327.275	158.98
327.72	161.41
328.165	154.13
328.61	129.86
329.054	139.57
329.499	125
329.943	156.56
330.388	156.56
330.832	112.87
331.277	166.26
331.721	122.57
332.166	192.96
332.61	129.86
333.054	127.43
333.499	151.7
333.943	122.57
334.387	192.96
334.831	129.86
335.275	117.72
335.719	132.28
336.163	66.75
336.607	185.68
337.051	122.57
337.495	69.18
337.938	127.43
338.382	76.46
338.826	146.85
339.269	149.27
339.713	122.57
340.157	207.53
340.6	137.14
341.044	188.11
341.487	175.97
341.93	188.11
342.374	108.01
342.817	127.43
343.26	217.24
343.703	125
344.146	129.86
344.59	137.14
345.033	112.87
345.476	185.68
345.919	122.57
346.361	158.98
346.804	180.83
347.247	149.27
347.69	117.72
348.133	173.55
348.575	171.12
349.018	163.84
349.461	197.82
349.903	168.69
350.346	110.44
350.788	117.72
351.23	141.99
351.673	156.56
352.115	139.57
352.557	141.99
353	188.11
353.442	166.26
353.884	141.99
354.326	144.42
354.768	125
355.21	137.14
355.652	125
356.094	156.56
356.536	173.55
356.978	98.3
357.419	158.98
357.861	132.28
358.303	158.98
358.744	183.26
359.186	127.43
359.627	185.68
360.069	158.98
360.51	112.87
360.952	173.55
361.393	134.71
361.834	197.82
362.276	117.72
362.717	149.27
363.158	151.7
363.599	120.15
364.04	137.14
364.481	163.84
364.922	76.46
365.363	188.11
365.804	110.44
366.245	129.86
366.686	168.69
367.126	134.71
367.567	161.41
368.008	231.8
368.448	151.7
368.889	212.38
369.33	129.86
369.77	197.82
370.21	112.87
370.651	146.85
371.091	98.3
371.531	103.16
371.972	146.85
372.412	158.98
372.852	156.56
373.292	151.7
373.732	144.42
374.172	100.73
374.612	122.57
375.052	217.24
375.492	108.01
375.932	100.73
376.372	168.69
376.811	166.26
377.251	146.85
377.691	110.44
378.13	132.28
378.57	207.53
379.009	163.84
379.449	180.83
379.888	149.27
380.328	129.86
380.767	149.27
381.206	200.25
381.645	180.83
382.085	122.57
382.524	141.99
382.963	120.15
383.402	175.97
383.841	141.99
384.28	156.56
384.719	103.16
385.158	154.13
385.596	132.28
386.035	190.54
386.474	83.74
386.913	161.41
387.351	100.73
387.79	168.69
388.228	178.4
388.667	86.17
389.105	163.84
389.544	132.28
389.982	141.99
390.42	74.03
390.859	154.13
391.297	180.83
391.735	110.44
392.173	173.55
392.611	200.25
393.049	156.56
393.487	76.46
393.925	168.69
394.363	105.58
394.801	120.15
395.239	202.67
395.676	42.48
396.114	168.69
396.552	125
396.989	154.13
397.427	166.26
397.864	161.41
398.302	91.02
398.739	183.26
399.177	134.71
399.614	137.14
400.051	137.14
400.488	183.26
400.926	139.57
401.363	180.83
401.8	195.39
402.237	129.86
402.674	137.14
403.111	139.57
403.548	144.42
403.985	190.54
404.421	178.4
404.858	129.86
405.295	154.13
405.732	175.97
406.168	161.41
406.605	151.7
407.041	137.14
407.478	125
407.914	156.56
408.351	115.29
408.787	202.67
409.223	192.96
409.66	127.43
410.096	76.46
410.532	134.71
410.968	144.42
411.404	132.28
411.84	158.98
412.276	166.26
412.712	122.57
413.148	146.85
413.584	115.29
414.02	151.7
414.455	158.98
414.891	117.72
415.327	122.57
415.762	156.56
416.198	151.7
416.633	158.98
417.069	149.27
417.504	173.55
417.94	141.99
418.375	156.56
418.81	137.14
419.245	132.28
419.681	134.71
420.116	86.17
420.551	93.45
420.986	129.86
421.421	192.96
421.856	110.44
422.291	120.15
422.726	163.84
423.16	195.39
423.595	188.11
424.03	212.38
424.464	161.41
424.899	134.71
425.334	161.41
425.768	161.41
426.203	156.56
426.637	132.28
427.071	115.29
427.506	93.45
427.94	180.83
428.374	120.15
428.809	151.7
429.243	158.98
429.677	35.19
430.111	132.28
430.545	178.4
430.979	132.28
431.413	120.15
431.847	127.43
432.28	103.16
432.714	117.72
433.148	175.97
433.582	212.38
434.015	144.42
434.449	224.52
434.882	158.98
435.316	74.03
435.749	168.69
436.183	185.68
436.616	161.41
437.049	209.95
437.483	76.46
437.916	171.12
438.349	110.44
438.782	195.39
439.215	125
439.648	205.1
440.081	173.55
440.514	154.13
440.947	178.4
441.38	103.16
441.813	122.57
442.245	141.99
442.678	209.95
443.111	217.24
443.543	185.68
443.976	161.41
444.408	183.26
444.841	175.97
445.273	141.99
445.705	122.57
446.138	183.26
446.57	173.55
447.002	205.1
447.434	188.11
447.867	241.51
448.299	226.95
448.731	200.25
449.163	226.95
449.595	263.35
450.026	256.07
450.458	183.26
450.89	139.57
451.322	253.64
451.754	258.5
452.185	251.22
452.617	214.81
453.048	222.09
453.48	214.81
453.911	217.24
454.343	224.52
454.774	224.52
455.205	248.79
455.637	200.25
456.068	229.37
456.499	229.37
456.93	248.79
457.361	280.34
457.792	304.62
458.223	246.36
458.654	277.92
459.085	234.23
459.516	200.25
459.947	226.95
460.378	234.23
460.808	188.11
461.239	258.5
461.669	241.51
462.1	280.34
462.531	154.13
462.961	217.24
463.391	190.54
463.822	205.1
464.252	236.65
464.682	192.96
465.113	287.63
465.543	209.95
465.973	251.22
466.403	239.08
466.833	219.66
467.263	214.81
467.693	205.1
468.123	251.22
468.553	154.13
468.983	214.81
469.412	192.96
469.842	207.53
470.272	200.25
470.701	239.08
471.131	209.95
471.56	226.95
471.99	185.68
472.419	214.81
472.849	178.4
473.278	197.82
473.707	251.22
474.136	243.94
474.566	248.79
474.995	234.23
475.424	202.67
475.853	234.23
476.282	219.66
476.711	197.82
477.14	129.86
477.569	173.55
477.997	168.69
478.426	76.46
478.855	139.57
479.283	231.8
479.712	139.57
480.141	268.21
480.569	163.84
480.998	207.53
481.426	180.83
481.854	127.43
482.283	190.54
482.711	265.78
483.139	173.55
483.567	163.84
483.995	156.56
484.424	197.82
484.852	161.41
485.28	205.1
485.708	212.38
486.135	209.95
486.563	105.58
486.991	166.26
487.419	127.43
487.847	239.08
488.274	127.43
488.702	173.55
489.129	183.26
489.557	168.69
489.984	168.69
490.412	178.4
490.839	171.12
491.266	166.26
491.694	132.28
492.121	175.97
492.548	161.41
492.975	156.56
493.402	192.96
493.829	156.56
494.256	188.11
494.683	156.56
495.11	192.96
495.537	202.67
495.964	197.82
496.39	180.83
496.817	151.7
497.244	178.4
497.67	212.38
498.097	156.56
498.523	120.15
498.95	129.86
499.376	134.71
499.803	149.27
500.229	137.14
500.655	139.57
501.081	163.84
501.508	112.87
501.934	144.42
502.36	137.14
502.786	146.85
503.212	205.1
503.638	192.96
504.064	171.12
504.489	120.15
504.915	161.41
505.341	127.43
505.767	180.83
506.192	175.97
506.618	212.38
507.043	156.56
507.469	144.42
507.894	154.13
508.32	231.8
508.745	161.41
509.17	168.69
509.596	190.54
510.021	180.83
510.446	156.56
510.871	188.11
511.296	132.28
511.721	195.39
512.146	144.42
512.571	163.84
512.996	188.11
513.421	141.99
513.845	166.26
514.27	205.1
514.695	197.82
515.119	132.28
515.544	129.86
515.969	93.45
516.393	141.99
516.817	188.11
517.242	158.98
517.666	163.84
518.09	112.87
518.515	197.82
518.939	146.85
519.363	394.42
519.787	149.27
520.211	125
520.635	200.25
521.059	178.4
521.483	127.43
521.907	188.11
522.331	154.13
522.754	156.56
523.178	117.72
523.602	139.57
524.025	192.96
524.449	195.39
524.872	144.42
525.296	139.57
525.719	192.96
526.143	149.27
526.566	139.57
526.989	161.41
527.412	168.69
527.836	132.28
528.259	188.11
528.682	115.29
529.105	141.99
529.528	171.12
529.951	207.53
530.374	175.97
530.796	115.29
531.219	188.11
531.642	156.56
532.065	151.7
532.487	214.81
532.91	180.83
533.332	197.82
533.755	209.95
534.177	200.25
534.6	180.83
535.022	209.95
535.444	214.81
535.867	154.13
536.289	125
536.711	156.56
537.133	241.51
537.555	207.53
537.977	158.98
538.399	195.39
538.821	241.51
539.243	188.11
539.665	209.95
540.086	236.65
540.508	129.86
540.93	168.69
541.351	205.1
541.773	161.41
542.195	214.81
542.616	241.51
543.037	231.8
543.459	190.54
543.88	158.98
544.301	236.65
544.723	258.5
545.144	219.66
545.565	285.2
545.986	195.39
546.407	226.95
546.828	214.81
547.249	183.26
547.67	178.4
548.091	151.7
548.512	185.68
548.932	207.53
549.353	175.97
549.774	117.72
550.194	178.4
550.615	146.85
551.035	197.82
551.456	180.83
551.876	202.67
552.296	195.39
552.717	202.67
553.137	156.56
553.557	166.26
553.977	154.13
554.397	122.57
554.817	103.16
555.237	222.09
555.657	171.12
556.077	154.13
556.497	146.85
556.917	236.65
557.337	183.26
557.756	197.82
558.176	205.1
558.596	171.12
559.015	209.95
559.435	168.69
559.854	183.26
560.274	125
560.693	171.12
561.112	185.68
561.532	175.97
561.951	188.11
562.37	154.13
562.789	161.41
563.208	154.13
563.627	243.94
564.046	188.11
564.465	149.27
564.884	137.14
565.303	192.96
565.722	134.71
566.14	163.84
566.559	166.26
566.978	205.1
567.396	226.95
567.815	268.21
568.233	207.53
568.652	241.51
569.07	185.68
569.489	219.66
569.907	190.54
570.325	192.96
570.743	137.14
571.161	209.95
571.58	163.84
571.998	205.1
572.416	190.54
572.833	192.96
573.251	175.97
573.669	161.41
574.087	168.69
574.505	190.54
574.922	146.85
575.34	173.55
575.758	273.06
576.175	175.97
576.593	161.41
577.01	93.45
577.428	132.28
577.845	1926
578.262	328.89
578.68	183.26
579.097	207.53
579.514	137.14
579.931	108.01
580.348	154.13
580.765	161.41
581.182	132.28
581.599	192.96
582.016	171.12
582.433	173.55
582.849	173.55
583.266	192.96
583.683	185.68
584.099	180.83
584.516	178.4
584.933	154.13
585.349	117.72
585.765	256.07
586.182	178.4
586.598	175.97
587.014	168.69
587.431	120.15
587.847	195.39
588.263	137.14
588.679	125
589.095	158.98
589.511	154.13
589.927	207.53
590.343	197.82
590.759	163.84
591.174	236.65
591.59	178.4
592.006	185.68
592.421	175.97
592.837	200.25
593.252	197.82
593.668	185.68
594.083	125
594.499	158.98
594.914	166.26
595.329	234.23
595.745	195.39
596.16	231.8
596.575	120.15
596.99	112.87
597.405	158.98
597.82	188.11
598.235	217.24
598.65	139.57
599.065	171.12
599.479	161.41
599.894	146.85
600.309	166.26
600.724	132.28
601.138	149.27
601.553	226.95
601.967	146.85
602.382	185.68
602.796	141.99
603.21	239.08
603.625	120.15
604.039	207.53
604.453	185.68
604.867	141.99
605.281	175.97
605.695	146.85
606.109	144.42
606.523	188.11
606.937	149.27
607.351	275.49
607.765	137.14
608.178	125
608.592	195.39
609.006	134.71
609.419	171.12
609.833	154.13
610.246	205.1
610.66	205.1
611.073	183.26
611.487	202.67
611.9	161.41
612.313	175.97
612.726	214.81
613.139	217.24
613.553	197.82
613.966	117.72
614.379	197.82
614.792	171.12
615.204	168.69
615.617	137.14
616.03	205.1
616.443	132.28
616.856	129.86
617.268	95.88
617.681	134.71
618.093	180.83
618.506	100.73
618.918	127.43
619.331	156.56
619.743	149.27
620.155	209.95
620.568	161.41
620.98	100.73
621.392	129.86
621.804	222.09
622.216	195.39
622.628	229.37
623.04	88.59
623.452	173.55
623.864	248.79
624.276	260.93
624.687	192.96
625.099	146.85
625.511	132.28
625.922	166.26
626.334	163.84
626.745	108.01
627.157	95.88
627.568	88.59
627.979	185.68
628.391	122.57
628.802	183.26
629.213	185.68
629.624	112.87
630.035	151.7
630.446	129.86
630.857	146.85
631.268	141.99
631.679	151.7
632.09	129.86
632.501	205.1
632.912	137.14
633.322	168.69
633.733	183.26
634.144	229.37
634.554	168.69
634.965	120.15
635.375	76.46
635.785	180.83
636.196	151.7
636.606	175.97
637.016	178.4
637.427	236.65
637.837	120.15
638.247	156.56
638.657	173.55
639.067	168.69
639.477	81.31
639.887	263.35
640.297	178.4
640.706	188.11
641.116	129.86
641.526	175.97
641.935	110.44
642.345	129.86
642.755	214.81
643.164	168.69
643.573	158.98
643.983	171.12
644.392	161.41
644.801	236.65
645.211	183.26
645.62	125
646.029	183.26
646.438	175.97
646.847	180.83
647.256	195.39
647.665	127.43
648.074	171.12
648.483	112.87
648.892	137.14
649.3	183.26
649.709	137.14
650.118	158.98
650.526	168.69
650.935	185.68
651.343	185.68
651.752	93.45
652.16	139.57
652.568	95.88
652.977	93.45
653.385	129.86
653.793	188.11
654.201	197.82
654.609	168.69
655.017	146.85
655.425	151.7
655.833	137.14
656.241	180.83
656.649	168.69
657.057	98.3
657.464	115.29
657.872	129.86
658.28	178.4
658.687	139.57
659.095	71.6
659.502	190.54
659.91	98.3
660.317	122.57
660.724	217.24
661.132	134.71
661.539	195.39
661.946	139.57
662.353	110.44
662.76	151.7
663.167	112.87
663.574	161.41
663.981	197.82
664.388	173.55
664.795	122.57
665.202	129.86
665.608	151.7
666.015	141.99
666.422	88.59
666.828	141.99
667.235	171.12
667.641	156.56
668.047	112.87
668.454	151.7
668.86	149.27
669.266	158.98
669.673	108.01
670.079	156.56
670.485	105.58
670.891	112.87
671.297	195.39
671.703	129.86
672.109	112.87
672.515	158.98
672.92	207.53
673.326	156.56
673.732	195.39
674.138	144.42
674.543	190.54
674.949	95.88
675.354	171.12
675.76	192.96
676.165	141.99
676.57	217.24
676.976	134.71
677.381	88.59
677.786	139.57
678.191	149.27
678.596	115.29
679.001	156.56
679.406	105.58
679.811	127.43
680.216	195.39
680.621	151.7
681.026	125
681.43	139.57
681.835	149.27
682.24	178.4
682.644	127.43
683.049	224.52
683.453	141.99
683.858	166.26
684.262	192.96
684.667	112.87
685.071	168.69
685.475	188.11
685.879	88.59
686.283	139.57
686.687	141.99
687.091	78.88
687.495	185.68
687.899	190.54
688.303	132.28
688.707	175.97
689.111	180.83
689.514	141.99
689.918	197.82
690.322	83.74
690.725	91.02
691.129	161.41
691.532	207.53
691.936	168.69
692.339	188.11
692.742	231.8
693.146	141.99
693.549	171.12
693.952	190.54
694.355	163.84
694.758	195.39
695.161	207.53
695.564	277.92
695.967	149.27
696.37	183.26
696.773	188.11
697.175	151.7
697.578	161.41
697.981	178.4
698.383	258.5
698.786	217.24
699.188	168.69
699.591	156.56
699.993	139.57
700.395	205.1
700.798	151.7
701.2	158.98
701.602	137.14
702.004	236.65
702.406	146.85
702.808	88.59
703.21	117.72
703.612	156.56
704.014	125
704.416	173.55
704.818	149.27
705.219	149.27
705.621	202.67
706.023	178.4
706.424	219.66
706.826	141.99
707.227	168.69
707.629	129.86
708.03	151.7
708.431	185.68
708.832	188.11
709.234	173.55
709.635	207.53
710.036	154.13
710.437	141.99
710.838	190.54
711.239	144.42
711.64	200.25
712.041	190.54
712.441	173.55
712.842	195.39
713.243	260.93
713.643	222.09
714.044	178.4
714.445	202.67
714.845	175.97
715.246	311.9
715.646	209.95
716.046	217.24
716.447	234.23
716.847	243.94
717.247	185.68
717.647	236.65
718.047	229.37
718.447	302.19
718.847	195.39
719.247	236.65
719.647	263.35
720.047	265.78
720.446	263.35
720.846	234.23
721.246	290.05
721.645	241.51
722.045	290.05
722.444	258.5
722.844	280.34
723.243	292.48
723.643	292.48
724.042	292.48
724.441	297.33
724.84	343.45
725.24	268.21
725.639	302.19
726.038	379.86
726.437	263.35
726.836	253.64
727.234	285.2
727.633	241.51
728.032	355.59
728.431	297.33
728.83	413.84
729.228	345.88
729.627	423.55
730.025	399.28
730.424	467.24
730.822	401.71
731.22	425.98
731.619	447.82
732.017	474.52
732.415	532.78
732.813	588.6
733.212	615.3
733.61	595.88
734.008	692.97
734.406	697.83
734.803	770.64
735.201	746.37
735.599	879.87
735.997	862.88
736.395	884.72
736.792	906.57
737.19	928.41
737.587	1083.75
737.985	1030.36
738.382	1037.64
738.78	1239.1
739.177	1195.41
739.574	1200.26
739.971	1260.94
740.369	1409
740.766	1513.37
741.163	1486.67
741.56	1571.63
741.957	1591.04
742.354	1685.71
742.751	1775.51
743.147	1848.33
743.544	1926
743.941	2010.95
744.338	2125.03
744.734	2200.28
745.131	2154.16
745.527	2268.24
745.924	2515.82
746.32	2717.28
746.716	2651.74
747.113	2756.11
747.509	3076.5
747.905	3258.55
748.301	3282.82
748.697	3241.56
749.093	3532.82
749.489	3690.59
749.885	3940.6
750.281	4032.83
750.677	4095.94
751.073	4433.32
751.468	4826.53
751.864	4826.53
752.26	4583.81
752.655	4848.38
753.051	5423.63
753.446	5722.18
753.842	5734.31
754.237	5595.96
754.632	6003.73
755.028	6336.26
755.423	6253.74
755.818	6290.15
756.213	6190.63
756.608	6688.21
757.003	6957.63
757.398	6629.96
757.793	6622.68
758.188	6707.63
758.583	7530.46
758.977	7736.77
759.372	7409.1
759.767	7343.56
760.161	8210.08
760.556	9013.49
760.95	9392.14
761.345	8865.43
761.739	9146.99
762.133	10149.43
762.527	11030.51
762.922	11015.95
763.316	10731.96
763.71	10664
764.104	11712.56
764.498	12409.17
764.892	12280.53
765.286	11698
765.68	12105.77
766.073	13666.47
766.467	13729.58
766.861	13397.05
767.255	13018.41
767.648	13503.85
768.042	14637.36
768.435	15125.24
768.829	14465.03
769.222	14076.68
769.615	14758.72
770.008	15979.62
770.402	16188.36
770.795	15013.58
771.188	14943.19
771.581	15550
771.974	16557.3
772.367	15819.42
772.76	15622.82
773.153	15047.56
773.545	15542.72
773.938	16542.73
774.331	16681.08
774.724	15685.92
775.116	15943.21
775.509	17363.13
775.901	19593.75
776.294	19462.68
776.686	18309.75
777.078	18047.61
777.471	19603.46
777.863	21081.64
778.255	21496.69
778.647	20489.4
779.039	19853.46
779.431	20727.26
779.823	22428.75
780.215	22809.82
780.607	20875.32
780.999	20989.4
781.39	21622.91
781.782	23416.63
782.174	23169.05
782.565	22020.97
782.957	21190.86
783.348	22314.67
783.74	24360.82
784.131	23860.81
784.522	22904.48
784.914	20960.28
785.305	21683.59
785.696	23178.76
786.087	23321.96
786.478	21904.47
786.869	20176.28
787.26	19914.14
787.651	20792.8
788.042	21314.65
788.433	19926.28
788.823	18147.13
789.214	17984.5
789.605	18965.1
789.995	19435.98
790.386	18292.76
790.776	16962.64
791.167	16863.13
791.557	18168.97
791.948	19831.62
792.338	19324.33
792.728	18448.1
793.118	17651.97
793.508	18353.44
793.898	20190.85
794.288	20426.29
794.678	18991.8
795.068	17967.51
795.458	18630.14
795.848	19763.66
796.238	20219.97
796.627	19033.06
797.017	17535.47
797.406	17829.16
797.796	19008.79
798.185	20440.85
798.575	19749.09
798.964	18098.58
799.354	17601
799.743	18671.41
800.132	20520.95
800.521	20334.05
800.91	18889.86
801.299	17086.43
801.688	17644.69
802.077	18775.78
802.466	19681.13
802.855	18761.21
803.244	16554.87
803.633	16198.07
804.021	16877.69
804.41	18256.35
804.799	17790.33
805.187	15887.38
805.576	14729.6
805.964	14741.73
806.352	15300
806.741	15537.86
807.129	14715.03
807.517	13877.64
807.905	13421.33
808.293	14462.6
808.681	15630.1
809.069	15239.31
809.457	14603.38
809.845	13423.75
810.233	13986.87
810.621	15593.69
811.009	16006.32
811.396	15033
811.784	14266
812.171	13460.16
812.559	14190.75
812.946	15035.43
813.334	14846.1
813.721	13571.81
814.108	12455.29
814.496	12688.3
814.883	13292.68
815.27	14316.97
815.657	13982.01
816.044	12778.11
816.431	12181.01
816.818	12528.11
817.205	13147.05
817.592	13552.4
817.979	12644.61
818.365	11416.44
818.752	11086.34
819.139	11469.84
819.525	11974.7
819.912	11632.46
820.298	10812.06
820.685	9875.15
821.071	9520.78
821.457	9741.66
821.843	10028.07
822.23	9506.22
822.616	8807.18
823.002	7909.1
823.388	7882.4
823.774	8120.27
824.16	8176.1
824.546	7853.28
824.931	7117.83
825.317	6768.31
825.703	6943.07
826.089	7261.04
826.474	7421.23
826.86	7125.11
827.245	6535.3
827.631	6275.58
828.016	6440.63
828.401	6649.38
828.787	6787.73
829.172	6263.45
829.557	5778
829.942	5426.06
830.327	5423.63
830.712	5877.52
831.097	5884.8
831.482	5491.59
831.867	4998.86
832.252	4520.7
832.636	4814.4
833.021	5144.5
833.406	5328.97
833.79	4943.04
834.175	4460.02
834.559	4120.21
834.944	4248.85
835.328	4435.75
835.713	4460.02
836.097	4248.85
836.481	3673.6
836.865	3418.74
837.249	3520.69
837.633	3743.99
838.017	3802.24
838.401	3520.69
838.785	2979.42
839.169	2765.82
839.553	2821.65
839.937	2804.66
840.32	2879.9
840.704	2726.98
841.087	2234.26
841.471	2200.28
841.854	2226.98
842.238	2440.57
842.621	2428.44
843.004	2190.57
843.388	2040.08
843.771	1826.48
844.154	1882.31
844.537	2008.53
844.92	2166.3
845.303	2115.32
845.686	1879.88
846.069	1729.4
846.452	1712.41
846.834	1768.23
847.217	1865.32
847.6	1848.33
847.982	1654.15
848.365	1462.4
848.748	1401.72
849.13	1506.09
849.512	1591.04
849.895	1695.41
850.277	1430.85
850.659	1394.44
851.041	1226.96
851.423	1263.37
851.806	1336.19
852.188	1433.27
852.57	1438.13
852.951	1166.28
853.333	1122.59
853.715	1108.03
854.097	1139.58
854.479	1095.89
854.86	1154.14
855.242	991.52
855.623	947.83
856.005	865.3
856.386	938.12
856.768	986.67
857.149	964.82
857.53	845.89
857.911	770.64
858.292	760.93
858.674	739.09
859.055	741.52
859.436	656.56
859.817	724.53
860.197	627.44
860.578	612.87
860.959	608.02
861.34	632.29
861.72	600.74
862.101	661.42
862.482	612.87
862.862	476.95
863.243	498.79
863.623	525.49
864.003	513.36
864.384	532.78
864.764	513.36
865.144	510.93
865.524	425.98
865.904	423.55
866.284	447.82
866.664	464.81
867.044	508.5
867.424	399.28
867.804	382.29
868.183	408.99
868.563	304.62
868.943	353.16
869.322	442.97
869.702	379.86
870.081	447.82
870.461	217.24
870.84	282.77
871.22	345.88
871.599	307.04
871.978	336.17
872.357	355.59
872.736	294.91
873.115	246.36
873.494	229.37
873.873	341.02
874.252	309.47
874.631	348.31
875.01	290.05
875.388	217.24
875.767	316.75
876.146	209.95
876.524	192.96
876.903	231.8
877.281	280.34
877.66	217.24
878.038	224.52
878.416	292.48
878.794	239.08
879.173	185.68
879.551	241.51
879.929	229.37
880.307	282.77
880.685	183.26
881.063	161.41
881.441	217.24
881.818	231.8
882.196	246.36
882.574	137.14
882.951	219.66
883.329	132.28
883.707	192.96
884.084	178.4
884.461	260.93
884.839	178.4
885.216	180.83
885.593	190.54
885.971	205.1
886.348	144.42
886.725	175.97
887.102	178.4
887.479	163.84
887.856	173.55
888.233	158.98
888.609	178.4
888.986	217.24
889.363	188.11
889.74	214.81
890.116	207.53
890.493	217.24
890.869	115.29
891.246	207.53
891.622	163.84
891.998	222.09
892.375	161.41
892.751	214.81
893.127	180.83
893.503	161.41
893.879	175.97
894.255	144.42
894.631	146.85
895.007	122.57
895.383	178.4
895.759	188.11
896.134	141.99
896.51	192.96
896.886	175.97
897.261	139.57
897.637	188.11
898.012	137.14
898.388	134.71
898.763	127.43
899.138	156.56
899.514	229.37
899.889	175.97
900.264	120.15
900.639	156.56
901.014	166.26
901.389	93.45
901.764	110.44
902.139	95.88
902.513	100.73
902.888	100.73
903.263	168.69
903.638	154.13
904.012	154.13
904.387	158.98
904.761	205.1
905.136	190.54
905.51	200.25
905.884	195.39
906.259	139.57
906.633	163.84
907.007	149.27
907.381	175.97
907.755	98.3
908.129	158.98
908.503	137.14
908.877	171.12
909.251	120.15
909.624	195.39
909.998	76.46
910.372	122.57
910.745	95.88
911.119	110.44
911.492	158.98
911.866	183.26
912.239	149.27
912.612	125
912.986	122.57
913.359	141.99
913.732	117.72
914.105	127.43
914.478	108.01
914.851	139.57
915.224	122.57
915.597	149.27
915.97	112.87
916.343	171.12
916.715	78.88
917.088	117.72
917.461	134.71
917.833	180.83
918.206	219.66
918.578	158.98
918.951	93.45
919.323	163.84
919.695	183.26
920.067	158.98
920.44	103.16
920.812	122.57
921.184	180.83
921.556	183.26
921.928	125
922.3	154.13
922.672	192.96
923.043	105.58
923.415	100.73
923.787	125
924.158	175.97
924.53	91.02
924.901	161.41
925.273	134.71
925.644	112.87
926.016	122.57
926.387	120.15
926.758	108.01
927.129	146.85
927.5	59.47
927.872	149.27
928.243	122.57
928.613	110.44
928.984	86.17
929.355	122.57
929.726	141.99
930.097	144.42
930.467	163.84
930.838	141.99
931.209	129.86
931.579	161.41
931.95	95.88
932.32	161.41
932.69	161.41
933.061	108.01
933.431	190.54
933.801	149.27
934.171	117.72
934.541	120.15
934.911	173.55
935.281	146.85
935.651	173.55
936.021	241.51
936.391	100.73
936.761	54.61
937.13	141.99
937.5	141.99
937.87	173.55
938.239	86.17
938.609	154.13
938.978	171.12
939.347	151.7
939.717	149.27
940.086	168.69
940.455	141.99
940.824	178.4
941.193	171.12
941.562	168.69
941.931	224.52
942.3	243.94
942.669	149.27
943.038	120.15
943.407	163.84
943.775	154.13
944.144	95.88
944.513	226.95
944.881	120.15
945.25	192.96
945.618	166.26
945.986	122.57
946.355	158.98
946.723	149.27
947.091	115.29
947.459	190.54
947.827	141.99
948.195	112.87
948.563	129.86
948.931	122.57
949.299	132.28
949.667	149.27
950.035	161.41
950.402	132.28
950.77	127.43
951.138	156.56
951.505	125
951.873	132.28
952.24	100.73
952.607	197.82
952.975	132.28
953.342	95.88
953.709	149.27
954.076	108.01
954.443	134.71
954.81	231.8
955.177	154.13
955.544	151.7
955.911	154.13
956.278	166.26
956.645	239.08
957.012	161.41
957.378	207.53
957.745	108.01
958.111	151.7
958.478	158.98
958.844	137.14
959.211	127.43
959.577	180.83
959.943	144.42
960.309	137.14
960.675	146.85
961.042	103.16
961.408	86.17
961.774	127.43
962.139	117.72
962.505	91.02
962.871	161.41
963.237	127.43
963.603	168.69
963.968	117.72
964.334	149.27
964.699	137.14
965.065	117.72
965.43	105.58
965.796	103.16
966.161	173.55
966.526	161.41
966.891	239.08
967.256	183.26
967.622	127.43
967.987	129.86
968.352	127.43
968.716	180.83
969.081	158.98
969.446	134.71
969.811	134.71
970.176	137.14
970.54	158.98
970.905	180.83
971.269	183.26
971.634	117.72
971.998	195.39
972.363	139.57
972.727	88.59
973.091	180.83
973.455	129.86
973.819	125
974.183	127.43
974.547	76.46
974.911	154.13
975.275	115.29
975.639	112.87
976.003	139.57
976.367	156.56
976.73	195.39
977.094	122.57
977.458	139.57
977.821	141.99
978.185	149.27
978.548	127.43
978.911	83.74
979.275	180.83
979.638	195.39
980.001	171.12
980.364	137.14
980.727	127.43
981.09	144.42
981.453	134.71
981.816	134.71
982.179	173.55
982.542	110.44
982.905	120.15
983.267	129.86
983.63	197.82
983.992	115.29
984.355	120.15
984.717	168.69
985.08	98.3
985.442	200.25
985.804	120.15
986.167	78.88
986.529	110.44
986.891	156.56
987.253	154.13
987.615	166.26
987.977	120.15
988.339	117.72
988.701	103.16
989.062	139.57
989.424	125
989.786	78.88
990.147	86.17
990.509	127.43
990.87	139.57
991.232	129.86
991.593	149.27
991.955	103.16
992.316	122.57
992.677	57.04
993.038	139.57
993.399	154.13
993.76	134.71
994.121	149.27
994.482	91.02
994.843	129.86
995.204	146.85
995.565	129.86
995.926	127.43
996.286	146.85
996.647	129.86
997.007	171.12
997.368	117.72
997.728	151.7
998.089	202.67
998.449	137.14
998.809	129.86
999.169	117.72
999.53	110.44
999.89	156.56
1000.25	120.15
1000.61	139.57
1000.97	168.69
1001.329	209.95
1001.689	166.26
1002.049	185.68
1002.409	229.37
1002.768	161.41
1003.128	183.26
1003.487	161.41
1003.847	168.69
1004.206	156.56
1004.566	127.43
1004.925	103.16
1005.284	151.7
1005.643	103.16
1006.003	146.85
1006.362	200.25
1006.721	188.11
1007.08	139.57
1007.438	112.87
1007.797	76.46
1008.156	127.43
1008.515	129.86
1008.874	139.57
1009.232	139.57
1009.591	146.85
1009.949	146.85
1010.308	154.13
1010.666	132.28
1011.024	129.86
1011.383	132.28
1011.741	185.68
1012.099	100.73
1012.457	129.86
1012.815	173.55
1013.173	180.83
1013.531	129.86
1013.889	132.28
1014.247	168.69
1014.605	86.17
1014.962	132.28
1015.32	134.71
1015.678	110.44
1016.035	151.7
1016.393	141.99
1016.75	137.14
1017.107	127.43
1017.465	168.69
1017.822	212.38
1018.179	224.52
1018.536	166.26
1018.894	146.85
1019.251	195.39
1019.608	141.99
1019.964	129.86
1020.321	149.27
1020.678	137.14
1021.035	95.88
1021.392	239.08
1021.748	141.99
1022.105	166.26
1022.461	66.75
1022.818	158.98
1023.174	141.99
1023.531	163.84
1023.887	178.4
1024.243	144.42
1024.599	137.14
1024.955	120.15
1025.311	154.13
1025.667	192.96
1026.023	129.86
1026.379	146.85
1026.735	260.93
1027.091	144.42
1027.447	154.13
