189.514	94.51
189.973	94.51
190.431	94.51
190.889	-14.72
191.348	-41.41
191.806	14.41
192.264	-0.15
192.722	50.82
193.18	-2.58
193.638	31.4
194.096	-65.69
194.554	-58.41
195.012	-31.71
195.47	-53.55
195.928	-7.43
196.385	-9.86
196.843	-2.58
197.301	21.69
197.758	31.4
198.216	11.98
198.674	55.67
199.131	28.97
199.589	43.54
200.046	67.81
200.503	89.66
200.961	109.07
201.418	99.36
201.875	113.93
202.332	82.37
202.79	41.11
203.247	70.24
203.704	181.89
204.161	128.49
204.618	96.94
205.075	123.64
205.532	109.07
205.989	113.93
206.445	181.89
206.902	133.35
207.359	106.65
207.816	172.18
208.272	198.88
208.729	87.23
209.185	186.74
209.642	89.66
210.098	147.91
210.555	191.6
211.011	150.34
211.467	143.05
211.924	201.31
212.38	118.78
212.836	94.51
213.292	181.89
213.748	128.49
214.204	123.64
214.66	99.36
215.116	130.92
215.572	143.05
216.028	184.32
216.484	179.46
216.94	181.89
217.396	138.2
217.851	150.34
218.307	118.78
218.763	191.6
219.218	155.19
219.674	213.44
220.129	152.76
220.585	184.32
221.04	186.74
221.496	113.93
221.951	79.95
222.406	133.35
222.861	106.65
223.317	181.89
223.772	186.74
224.227	189.17
224.682	174.61
225.137	167.33
225.592	133.35
226.047	128.49
226.502	150.34
226.957	196.45
227.411	143.05
227.866	138.2
228.321	162.47
228.776	145.48
229.23	140.63
229.685	157.62
230.139	172.18
230.594	116.35
231.048	181.89
231.503	162.47
231.957	106.65
232.411	138.2
232.865	138.2
233.32	198.88
233.774	75.09
234.228	96.94
234.682	181.89
235.136	84.8
235.59	126.06
236.044	138.2
236.498	164.9
236.952	106.65
237.406	172.18
237.86	111.5
238.313	123.64
238.767	191.6
239.221	84.8
239.674	150.34
240.128	167.33
240.581	201.31
241.035	230.43
241.488	92.08
241.942	143.05
242.395	128.49
242.848	133.35
243.301	155.19
243.755	196.45
244.208	143.05
244.661	186.74
245.114	126.06
245.567	172.18
246.02	184.32
246.473	196.45
246.926	230.43
247.379	106.65
247.832	116.35
248.284	130.92
248.737	133.35
249.19	140.63
249.642	113.93
250.095	157.62
250.547	145.48
251	155.19
251.452	130.92
251.905	162.47
252.357	167.33
252.81	140.63
253.262	194.03
253.714	123.64
254.166	186.74
254.618	172.18
255.07	143.05
255.523	160.04
255.975	194.03
256.427	191.6
256.878	101.79
257.33	116.35
257.782	133.35
258.234	145.48
258.686	218.3
259.137	99.36
259.589	157.62
260.041	135.77
260.492	109.07
260.944	92.08
261.395	138.2
261.847	155.19
262.298	135.77
262.749	128.49
263.201	160.04
263.652	143.05
264.103	106.65
264.554	189.17
265.005	123.64
265.457	128.49
265.908	128.49
266.359	143.05
266.809	169.75
267.26	150.34
267.711	121.21
268.162	186.74
268.613	123.64
269.064	162.47
269.514	196.45
269.965	150.34
270.415	157.62
270.866	174.61
271.316	257.13
271.767	109.07
272.217	96.94
272.668	203.73
273.118	215.87
273.568	179.46
274.019	143.05
274.469	135.77
274.919	186.74
275.369	194.03
275.819	84.8
276.269	128.49
276.719	109.07
277.169	203.73
277.619	48.39
278.069	121.21
278.518	101.79
278.968	184.32
279.418	177.04
279.867	155.19
280.317	77.52
280.767	99.36
281.216	184.32
281.666	201.31
282.115	169.75
282.564	155.19
283.014	118.78
283.463	169.75
283.912	155.19
284.361	201.31
284.811	140.63
285.26	179.46
285.709	169.75
286.158	169.75
286.607	228.01
287.056	147.91
287.505	174.61
287.953	138.2
288.402	152.76
288.851	174.61
289.3	184.32
289.748	152.76
290.197	135.77
290.646	147.91
291.094	118.78
291.543	155.19
291.991	225.58
292.439	179.46
292.888	160.04
293.336	118.78
293.784	172.18
294.233	169.75
294.681	172.18
295.129	189.17
295.577	179.46
296.025	152.76
296.473	218.3
296.921	145.48
297.369	186.74
297.817	109.07
298.264	145.48
298.712	135.77
299.16	147.91
299.608	138.2
300.055	230.43
300.503	143.05
300.95	128.49
301.398	92.08
301.845	96.94
302.293	164.9
302.74	109.07
303.187	162.47
303.635	201.31
304.082	140.63
304.529	130.92
304.976	252.28
305.423	179.46
305.87	140.63
306.317	133.35
306.764	203.73
307.211	123.64
307.658	118.78
308.105	111.5
308.552	155.19
308.998	126.06
309.445	172.18
309.892	174.61
310.338	184.32
310.785	179.46
311.231	220.73
311.678	174.61
312.124	186.74
312.571	155.19
313.017	79.95
313.463	138.2
313.909	143.05
314.356	179.46
314.802	147.91
315.248	138.2
315.694	160.04
316.14	220.73
316.586	126.06
317.032	179.46
317.478	181.89
317.923	223.15
318.369	135.77
318.815	94.51
319.261	194.03
319.706	130.92
320.152	213.44
320.597	130.92
321.043	213.44
321.488	140.63
321.934	225.58
322.379	118.78
322.824	82.37
323.27	167.33
323.715	177.04
324.16	162.47
324.605	145.48
325.05	169.75
325.495	172.18
325.94	94.51
326.385	150.34
326.83	174.61
327.275	179.46
327.72	126.06
328.165	109.07
328.61	121.21
329.054	111.5
329.499	181.89
329.943	169.75
330.388	211.02
330.832	160.04
331.277	140.63
331.721	201.31
332.166	128.49
332.61	152.76
333.054	126.06
333.499	179.46
333.943	276.55
334.387	186.74
334.831	157.62
335.275	138.2
335.719	140.63
336.163	135.77
336.607	143.05
337.051	184.32
337.495	162.47
337.938	162.47
338.382	191.6
338.826	172.18
339.269	189.17
339.713	123.64
340.157	152.76
340.6	203.73
341.044	186.74
341.487	135.77
341.93	89.66
342.374	194.03
342.817	220.73
343.26	116.35
343.703	123.64
344.146	138.2
344.59	189.17
345.033	143.05
345.476	128.49
345.919	167.33
346.361	128.49
346.804	150.34
347.247	169.75
347.69	194.03
348.133	152.76
348.575	121.21
349.018	118.78
349.461	72.66
349.903	191.6
350.346	133.35
350.788	160.04
351.23	169.75
351.673	198.88
352.115	186.74
352.557	128.49
353	184.32
353.442	152.76
353.884	123.64
354.326	99.36
354.768	128.49
355.21	191.6
355.652	143.05
356.094	189.17
356.536	160.04
356.978	169.75
357.419	135.77
357.861	164.9
358.303	189.17
358.744	208.59
359.186	181.89
359.627	133.35
360.069	164.9
360.51	138.2
360.952	157.62
361.393	179.46
361.834	211.02
362.276	191.6
362.717	162.47
363.158	211.02
363.599	157.62
364.04	150.34
364.481	92.08
364.922	121.21
365.363	104.22
365.804	155.19
366.245	177.04
366.686	128.49
367.126	140.63
367.567	164.9
368.008	181.89
368.448	194.03
368.889	189.17
369.33	162.47
369.77	201.31
370.21	189.17
370.651	113.93
371.091	130.92
371.531	140.63
371.972	194.03
372.412	96.94
372.852	184.32
373.292	167.33
373.732	133.35
374.172	147.91
374.612	194.03
375.052	130.92
375.492	133.35
375.932	194.03
376.372	160.04
376.811	223.15
377.251	189.17
377.691	181.89
378.13	194.03
378.57	211.02
379.009	228.01
379.449	208.59
379.888	150.34
380.328	89.66
380.767	240.14
381.206	169.75
381.645	121.21
382.085	162.47
382.524	152.76
382.963	169.75
383.402	150.34
383.841	147.91
384.28	174.61
384.719	96.94
385.158	179.46
385.596	130.92
386.035	160.04
386.474	160.04
386.913	155.19
387.351	77.52
387.79	109.07
388.228	164.9
388.667	130.92
389.105	152.76
389.544	179.46
389.982	126.06
390.42	206.16
390.859	89.66
391.297	128.49
391.735	198.88
392.173	177.04
392.611	198.88
393.049	167.33
393.487	53.25
393.925	75.09
394.363	169.75
394.801	264.42
395.239	189.17
395.676	143.05
396.114	94.51
396.552	106.65
396.989	160.04
397.427	96.94
397.864	104.22
398.302	101.79
398.739	177.04
399.177	126.06
399.614	82.37
400.051	138.2
400.488	121.21
400.926	167.33
401.363	196.45
401.8	179.46
402.237	179.46
402.674	220.73
403.111	196.45
403.548	133.35
403.985	155.19
404.421	198.88
404.858	123.64
405.295	189.17
405.732	89.66
406.168	160.04
406.605	155.19
407.041	181.89
407.478	174.61
407.914	240.14
408.351	126.06
408.787	133.35
409.223	235.29
409.66	128.49
410.096	162.47
410.532	196.45
410.968	109.07
411.404	130.92
411.84	167.33
412.276	143.05
412.712	203.73
413.148	133.35
413.584	118.78
414.02	223.15
414.455	138.2
414.891	177.04
415.327	133.35
415.762	118.78
416.198	186.74
416.633	147.91
417.069	143.05
417.504	164.9
417.94	96.94
418.375	118.78
418.81	104.22
419.245	196.45
419.681	116.35
420.116	203.73
420.551	41.11
420.986	191.6
421.421	172.18
421.856	186.74
422.291	96.94
422.726	152.76
423.16	155.19
423.595	143.05
424.03	99.36
424.464	169.75
424.899	147.91
425.334	177.04
425.768	96.94
426.203	118.78
426.637	130.92
427.071	164.9
427.506	123.64
427.94	101.79
428.374	147.91
428.809	206.16
429.243	167.33
429.677	143.05
430.111	174.61
430.545	150.34
430.979	133.35
431.413	126.06
431.847	174.61
432.28	208.59
432.714	128.49
433.148	169.75
433.582	79.95
434.015	169.75
434.449	179.46
434.882	155.19
435.316	82.37
435.749	94.51
436.183	174.61
436.616	160.04
437.049	138.2
437.483	186.74
437.916	164.9
438.349	225.58
438.782	186.74
439.215	104.22
439.648	157.62
440.081	164.9
440.514	135.77
440.947	143.05
441.38	186.74
441.813	99.36
442.245	167.33
442.678	89.66
443.111	121.21
443.543	104.22
443.976	101.79
444.408	194.03
444.841	130.92
445.273	196.45
445.705	169.75
446.138	116.35
446.57	179.46
447.002	138.2
447.434	99.36
447.867	128.49
448.299	147.91
448.731	162.47
449.163	172.18
449.595	150.34
450.026	181.89
450.458	147.91
450.89	225.58
451.322	211.02
451.754	160.04
452.185	172.18
452.617	143.05
453.048	128.49
453.48	155.19
453.911	179.46
454.343	242.57
454.774	177.04
455.205	232.86
455.637	72.66
456.068	147.91
456.499	160.04
456.93	138.2
457.361	162.47
457.792	203.73
458.223	116.35
458.654	147.91
459.085	189.17
459.516	225.58
459.947	203.73
460.378	194.03
460.808	145.48
461.239	133.35
461.669	201.31
462.1	181.89
462.531	228.01
462.961	160.04
463.391	150.34
463.822	150.34
464.252	130.92
464.682	191.6
465.113	191.6
465.543	164.9
465.973	152.76
466.403	150.34
466.833	169.75
467.263	130.92
467.693	109.07
468.123	152.76
468.553	223.15
468.983	172.18
469.412	232.86
469.842	152.76
470.272	162.47
470.701	167.33
471.131	155.19
471.56	130.92
471.99	155.19
472.419	184.32
472.849	92.08
473.278	155.19
473.707	232.86
474.136	152.76
474.566	196.45
474.995	138.2
475.424	167.33
475.853	135.77
476.282	160.04
476.711	160.04
477.14	128.49
477.569	150.34
477.997	186.74
478.426	213.44
478.855	116.35
479.283	201.31
479.712	215.87
480.141	162.47
480.569	179.46
480.998	113.93
481.426	213.44
481.854	186.74
482.283	208.59
482.711	145.48
483.139	198.88
483.567	169.75
483.995	167.33
484.424	130.92
484.852	123.64
485.28	220.73
485.708	157.62
486.135	252.28
486.563	162.47
486.991	172.18
487.419	167.33
487.847	206.16
488.274	174.61
488.702	152.76
489.129	191.6
489.557	220.73
489.984	126.06
490.412	230.43
490.839	169.75
491.266	172.18
491.694	152.76
492.121	201.31
492.548	164.9
492.975	181.89
493.402	157.62
493.829	123.64
494.256	126.06
494.683	94.51
495.11	109.07
495.537	99.36
495.964	101.79
496.39	164.9
496.817	164.9
497.244	160.04
497.67	198.88
498.097	140.63
498.523	109.07
498.95	111.5
499.376	177.04
499.803	145.48
500.229	172.18
500.655	130.92
501.081	177.04
501.508	215.87
501.934	164.9
502.36	140.63
502.786	150.34
503.212	145.48
503.638	177.04
504.064	111.5
504.489	218.3
504.915	179.46
505.341	155.19
505.767	174.61
506.192	106.65
506.618	162.47
507.043	189.17
507.469	104.22
507.894	162.47
508.32	162.47
508.745	143.05
509.17	177.04
509.596	143.05
510.021	184.32
510.446	60.53
510.871	191.6
511.296	145.48
511.721	147.91
512.146	225.58
512.571	184.32
512.996	174.61
513.421	147.91
513.845	126.06
514.27	211.02
514.695	113.93
515.119	140.63
515.544	162.47
515.969	184.32
516.393	211.02
516.817	211.02
517.242	157.62
517.666	191.6
518.09	174.61
518.515	223.15
518.939	126.06
519.363	327.52
519.787	164.9
520.211	155.19
520.635	181.89
521.059	218.3
521.483	118.78
521.907	157.62
522.331	169.75
522.754	128.49
523.178	126.06
523.602	143.05
524.025	194.03
524.449	172.18
524.872	177.04
525.296	155.19
525.719	135.77
526.143	167.33
526.566	123.64
526.989	116.35
527.412	135.77
527.836	84.8
528.259	138.2
528.682	143.05
529.105	213.44
529.528	92.08
529.951	123.64
530.374	150.34
530.796	111.5
531.219	118.78
531.642	172.18
532.065	133.35
532.487	123.64
532.91	128.49
533.332	70.24
533.755	143.05
534.177	152.76
534.6	133.35
535.022	145.48
535.444	201.31
535.867	177.04
536.289	101.79
536.711	167.33
537.133	186.74
537.555	181.89
537.977	179.46
538.399	126.06
538.821	186.74
539.243	189.17
539.665	215.87
540.086	179.46
540.508	155.19
540.93	133.35
541.351	160.04
541.773	128.49
542.195	215.87
542.616	215.87
543.037	145.48
543.459	211.02
543.88	223.15
544.301	198.88
544.723	257.13
545.144	181.89
545.565	150.34
545.986	167.33
546.407	152.76
546.828	184.32
547.249	157.62
547.67	198.88
548.091	220.73
548.512	109.07
548.932	172.18
549.353	194.03
549.774	145.48
550.194	181.89
550.615	206.16
551.035	203.73
551.456	155.19
551.876	169.75
552.296	213.44
552.717	174.61
553.137	177.04
553.557	77.52
553.977	172.18
554.397	177.04
554.817	191.6
555.237	230.43
555.657	223.15
556.077	140.63
556.497	106.65
556.917	194.03
557.337	145.48
557.756	220.73
558.176	179.46
558.596	130.92
559.015	223.15
559.435	228.01
559.854	172.18
560.274	252.28
560.693	184.32
561.112	194.03
561.532	116.35
561.951	162.47
562.37	162.47
562.789	113.93
563.208	164.9
563.627	160.04
564.046	194.03
564.465	123.64
564.884	167.33
565.303	147.91
565.722	133.35
566.14	121.21
566.559	126.06
566.978	126.06
567.396	206.16
567.815	177.04
568.233	179.46
568.652	113.93
569.07	128.49
569.489	155.19
569.907	169.75
570.325	84.8
570.743	135.77
571.161	150.34
571.58	172.18
571.998	191.6
572.416	164.9
572.833	135.77
573.251	189.17
573.669	145.48
574.087	82.37
574.505	147.91
574.922	123.64
575.34	196.45
575.758	138.2
576.175	155.19
576.593	194.03
577.01	138.2
577.428	140.63
577.845	1356.67
578.262	283.83
578.68	191.6
579.097	109.07
579.514	252.28
579.931	143.05
580.348	177.04
580.765	143.05
581.182	169.75
581.599	215.87
582.016	160.04
582.433	201.31
582.849	135.77
583.266	211.02
583.683	174.61
584.099	164.9
584.516	143.05
584.933	174.61
585.349	160.04
585.765	160.04
586.182	203.73
586.598	155.19
587.014	206.16
587.431	169.75
587.847	128.49
588.263	201.31
588.679	111.5
589.095	109.07
589.511	75.09
589.927	191.6
590.343	184.32
590.759	181.89
591.174	184.32
591.59	135.77
592.006	201.31
592.421	160.04
592.837	181.89
593.252	128.49
593.668	235.29
594.083	196.45
594.499	184.32
594.914	223.15
595.329	72.66
595.745	198.88
596.16	135.77
596.575	186.74
596.99	138.2
597.405	92.08
597.82	145.48
598.235	150.34
598.65	118.78
599.065	113.93
599.479	191.6
599.894	172.18
600.309	164.9
600.724	181.89
601.138	223.15
601.553	194.03
601.967	164.9
602.382	162.47
602.796	143.05
603.21	189.17
603.625	157.62
604.039	155.19
604.453	152.76
604.867	177.04
605.281	208.59
605.695	155.19
606.109	223.15
606.523	162.47
606.937	177.04
607.351	237.72
607.765	157.62
608.178	133.35
608.592	147.91
609.006	201.31
609.419	118.78
609.833	164.9
610.246	157.62
610.66	135.77
611.073	143.05
611.487	87.23
611.9	167.33
612.313	104.22
612.726	169.75
613.139	167.33
613.553	143.05
613.966	169.75
614.379	106.65
614.792	135.77
615.204	155.19
615.617	191.6
616.03	203.73
616.443	174.61
616.856	213.44
617.268	162.47
617.681	169.75
618.093	138.2
618.506	101.79
618.918	181.89
619.331	111.5
619.743	147.91
620.155	152.76
620.568	138.2
620.98	106.65
621.392	143.05
621.804	261.99
622.216	113.93
622.628	143.05
623.04	186.74
623.452	152.76
623.864	138.2
624.276	249.85
624.687	147.91
625.099	181.89
625.511	237.72
625.922	135.77
626.334	128.49
626.745	167.33
627.157	152.76
627.568	128.49
627.979	220.73
628.391	196.45
628.802	162.47
629.213	181.89
629.624	162.47
630.035	179.46
630.446	130.92
630.857	130.92
631.268	174.61
631.679	99.36
632.09	172.18
632.501	191.6
632.912	186.74
633.322	191.6
633.733	172.18
634.144	87.23
634.554	150.34
634.965	174.61
635.375	133.35
635.785	145.48
636.196	140.63
636.606	211.02
637.016	174.61
637.427	152.76
637.837	104.22
638.247	211.02
638.657	109.07
639.067	96.94
639.477	128.49
639.887	225.58
640.297	160.04
640.706	157.62
641.116	196.45
641.526	160.04
641.935	101.79
642.345	174.61
642.755	145.48
643.164	121.21
643.573	135.77
643.983	203.73
644.392	196.45
644.801	191.6
645.211	140.63
645.62	215.87
646.029	167.33
646.438	157.62
646.847	196.45
647.256	155.19
647.665	138.2
648.074	201.31
648.483	164.9
648.892	208.59
649.3	169.75
649.709	228.01
650.118	181.89
650.526	174.61
650.935	116.35
651.343	121.21
651.752	184.32
652.16	177.04
652.568	196.45
652.977	191.6
653.385	181.89
653.793	242.57
654.201	220.73
654.609	186.74
655.017	232.86
655.425	169.75
655.833	196.45
656.241	177.04
656.649	167.33
657.057	203.73
657.464	126.06
657.872	155.19
658.28	121.21
658.687	126.06
659.095	135.77
659.502	135.77
659.91	135.77
660.317	172.18
660.724	196.45
661.132	179.46
661.539	220.73
661.946	169.75
662.353	203.73
662.76	126.06
663.167	167.33
663.574	152.76
663.981	206.16
664.388	181.89
664.795	167.33
665.202	164.9
665.608	257.13
666.015	186.74
666.422	174.61
666.828	181.89
667.235	172.18
667.641	181.89
668.047	189.17
668.454	133.35
668.86	118.78
669.266	99.36
669.673	101.79
670.079	109.07
670.485	113.93
670.891	126.06
671.297	96.94
671.703	201.31
672.109	143.05
672.515	169.75
672.92	150.34
673.326	143.05
673.732	143.05
674.138	77.52
674.543	160.04
674.949	147.91
675.354	160.04
675.76	118.78
676.165	113.93
676.57	181.89
676.976	179.46
677.381	177.04
677.786	228.01
678.191	181.89
678.596	162.47
679.001	201.31
679.406	196.45
679.811	128.49
680.216	198.88
680.621	160.04
681.026	152.76
681.43	169.75
681.835	184.32
682.24	220.73
682.644	155.19
683.049	179.46
683.453	147.91
683.858	121.21
684.262	143.05
684.667	116.35
685.071	179.46
685.475	201.31
685.879	179.46
686.283	152.76
686.687	169.75
687.091	121.21
687.495	172.18
687.899	196.45
688.303	111.5
688.707	179.46
689.111	121.21
689.514	184.32
689.918	215.87
690.322	184.32
690.725	186.74
691.129	155.19
691.532	196.45
691.936	186.74
692.339	164.9
692.742	179.46
693.146	218.3
693.549	245
693.952	162.47
694.355	189.17
694.758	218.3
695.161	160.04
695.564	208.59
695.967	172.18
696.37	174.61
696.773	162.47
697.175	84.8
697.578	208.59
697.981	191.6
698.383	206.16
698.786	157.62
699.188	94.51
699.591	172.18
699.993	203.73
700.395	257.13
700.798	126.06
701.2	169.75
701.602	191.6
702.004	179.46
702.406	186.74
702.808	113.93
703.21	181.89
703.612	203.73
704.014	181.89
704.416	230.43
704.818	242.57
705.219	208.59
705.621	160.04
706.023	232.86
706.424	198.88
706.826	157.62
707.227	150.34
707.629	208.59
708.03	186.74
708.431	184.32
708.832	225.58
709.234	179.46
709.635	288.69
710.036	298.4
710.437	220.73
710.838	257.13
711.239	240.14
711.64	225.58
712.041	179.46
712.441	298.4
712.842	281.41
713.243	191.6
713.643	288.69
714.044	249.85
714.445	276.55
714.845	249.85
715.246	249.85
715.646	269.27
716.046	247.42
716.447	310.53
716.847	317.81
717.247	235.29
717.647	329.95
718.047	257.13
718.447	332.38
718.847	312.96
719.247	320.24
719.647	310.53
720.047	385.78
720.446	274.12
720.846	337.23
721.246	320.24
721.645	400.34
722.045	310.53
722.444	371.21
722.844	390.63
723.243	456.17
723.643	366.36
724.042	388.2
724.441	320.24
724.84	383.35
725.24	400.34
725.639	429.47
726.038	400.34
726.437	385.78
726.836	495
727.234	439.18
727.633	480.44
728.032	436.75
728.431	480.44
728.83	553.25
729.228	548.4
729.627	570.25
730.025	652.77
730.424	681.9
730.822	669.76
731.22	703.74
731.619	839.67
732.017	820.25
732.415	856.66
732.813	827.53
733.212	1002.29
733.61	1014.43
734.008	1181.91
734.406	1118.8
734.803	1257.15
735.201	1278.99
735.599	1480.45
735.997	1436.76
736.395	1497.44
736.792	1621.23
737.19	1856.67
737.587	1728.03
737.985	1859.1
738.382	1922.21
738.78	2130.95
739.177	2208.62
739.574	2101.82
739.971	2322.7
740.369	2509.6
740.766	2856.69
741.163	2475.61
741.56	2735.33
741.957	2863.97
742.354	3046.01
742.751	2990.19
743.147	3225.63
743.544	3385.82
743.941	3635.83
744.338	3604.27
744.734	3696.51
745.131	3973.21
745.527	4371.28
745.924	4563.03
746.32	4332.44
746.716	4621.28
747.113	5298.47
747.509	5429.54
747.905	5310.61
748.301	5509.64
748.697	6266.94
749.093	6529.08
749.489	6390.72
749.885	6368.88
750.281	7194.13
750.677	7587.34
751.073	7703.85
751.468	7465.98
751.864	8296.09
752.26	8817.95
752.655	9274.26
753.051	8822.8
753.446	9138.34
753.842	10201.46
754.237	10645.64
754.632	10308.26
755.028	9905.34
755.423	10684.48
755.818	11837.41
756.213	11524.3
756.608	11055.85
757.003	11512.16
757.398	12616.55
757.793	12660.24
758.188	11881.1
758.583	12191.79
758.977	13250.05
759.372	14216.09
759.767	14089.87
760.161	13861.71
760.556	15111.73
760.95	17043.8
761.345	17609.35
761.739	16849.62
762.133	17019.53
762.527	18339.94
762.922	20274.44
763.316	20165.21
763.71	19179.76
764.104	19861.81
764.498	21446.78
764.892	22662.82
765.286	21102.12
765.68	21551.15
766.073	23539.05
766.467	25094.9
766.861	24281.78
767.255	23475.94
767.648	24883.73
768.042	26815.8
768.435	27194.45
768.829	25682.29
769.222	25548.79
769.615	28087.66
770.008	29005.15
770.402	28189.61
770.795	26932.31
771.188	27951.74
771.581	29480.89
771.974	29779.44
772.367	27420.18
772.76	26718.71
773.153	28017.27
773.545	30323.14
773.938	29454.19
774.331	27757.56
774.724	28073.1
775.116	31590.15
775.509	33653.28
775.901	32301.32
776.294	31626.55
776.686	33621.73
777.078	36587.8
777.471	36565.95
777.863	35781.96
778.255	35541.66
778.647	39184.92
779.039	41015.05
779.431	38971.33
779.823	36961.59
780.215	37981.02
780.607	40046.59
780.999	42961.68
781.39	39782.02
781.782	38082.96
782.174	39718.91
782.565	43718.97
782.957	43134.01
783.348	40493.2
783.74	39039.29
784.131	40968.93
784.522	44124.32
784.914	42468.96
785.305	39019.87
785.696	38631.52
786.087	41158.26
786.478	41544.18
786.869	38709.19
787.26	35444.57
787.651	35575.64
788.042	38148.5
788.433	37752.86
788.823	34820.78
789.214	32920.26
789.605	33548.91
789.995	34796.51
790.386	34544.07
790.776	31638.69
791.167	30107.11
791.557	33044.05
791.948	35740.7
792.338	34553.78
792.728	32840.16
793.118	32490.64
793.508	35862.06
793.898	37815.97
794.288	36643.62
794.678	33031.92
795.068	33726.1
795.458	35852.35
795.848	37546.55
796.238	35410.59
796.627	32522.2
797.017	33112.01
797.406	36017.4
797.796	36786.83
798.185	35267.39
798.575	32524.63
798.964	33354.74
799.354	36359.64
799.743	37221.3
800.132	34175.14
800.521	32422.68
800.91	33643.58
801.299	35493.12
801.688	36517.41
802.077	33437.26
802.466	31471.21
802.855	32328.02
803.244	33658.14
803.633	33971.25
804.021	30689.65
804.41	28954.18
804.799	29500.31
805.187	31400.82
805.576	30874.11
805.964	27631.35
806.352	25492.96
806.741	26701.72
807.129	28575.54
807.517	28762.43
807.905	26492.98
808.293	24594.89
808.681	26963.86
809.069	28607.09
809.457	28985.74
809.845	26944.44
810.233	25422.57
810.621	26857.06
811.009	29238.17
811.396	29272.15
811.784	27009.98
812.171	24755.09
812.559	26128.9
812.946	27888.63
813.334	27359.5
813.721	24908
814.108	23230.79
814.496	23971.09
814.883	25580.34
815.27	26199.28
815.657	23536.62
816.044	22553.6
816.431	22837.58
816.818	24776.93
817.205	24784.21
817.592	23983.23
817.979	21725.91
818.365	20820.56
818.752	22315.73
819.139	22373.98
819.525	20864.25
819.912	18856.94
820.298	18449.16
820.685	19439.47
821.071	20109.38
821.457	18983.15
821.843	16997.69
822.23	16218.55
822.616	16429.72
823.002	17165.16
823.388	15990.39
823.774	14427.26
824.16	13478.21
824.546	13963.66
824.931	14318.03
825.317	14228.22
825.703	13123.84
826.089	12225.77
826.474	12186.93
826.86	13468.5
827.245	13267.04
827.631	12553.44
828.016	11388.37
828.401	11269.44
828.787	11946.64
829.172	12313.15
829.557	11313.13
829.942	10179.62
830.327	9657.77
830.712	10208.74
831.097	10696.62
831.482	10264.57
831.867	9259.7
832.252	8834.94
832.636	8776.68
833.021	9332.52
833.406	9449.02
833.79	8614.06
834.175	7825.21
834.559	7728.12
834.944	8155.31
835.328	8344.64
835.713	7881.04
836.097	6854.32
836.481	6606.75
836.865	6919.86
837.249	6931.99
837.633	6618.88
838.017	6012.08
838.401	5543.62
838.785	5478.09
839.169	5990.23
839.553	5927.12
839.937	5397.99
840.32	4674.68
840.704	4463.51
841.087	4592.15
841.471	4558.17
841.854	4567.88
842.238	3917.38
842.621	3791.17
843.004	3749.91
843.388	4055.74
843.771	4147.97
844.154	3786.31
844.537	3400.39
844.92	3354.27
845.303	3499.9
845.686	3718.35
846.069	3504.76
846.452	3249.9
846.834	2956.2
847.217	3002.32
847.6	3155.24
847.982	3201.35
848.365	3072.71
848.748	2732.9
849.13	2538.72
849.512	2725.62
849.895	2980.48
850.277	2798.44
850.659	2509.6
851.041	2312.99
851.423	2346.97
851.806	2441.63
852.188	2543.58
852.57	2320.27
852.951	2048.42
853.333	1941.63
853.715	2041.14
854.097	2194.06
854.479	2113.96
854.86	1934.34
855.242	1691.62
855.623	1621.23
856.005	1730.46
856.386	1919.78
856.768	1711.04
857.149	1570.26
857.53	1339.67
857.911	1424.63
858.292	1407.64
858.674	1502.3
859.055	1346.96
859.436	1179.48
859.817	1065.4
860.197	1145.5
860.578	1329.97
860.959	1075.11
861.34	1123.65
861.72	907.63
862.101	890.64
862.482	936.76
862.862	970.74
863.243	927.05
863.623	914.91
864.003	757.14
864.384	844.52
864.764	849.38
865.144	844.52
865.524	837.24
865.904	698.89
866.284	711.02
866.664	745.01
867.044	747.43
867.424	766.85
867.804	630.93
868.183	633.35
868.563	577.53
868.943	543.55
869.322	630.93
869.702	686.75
870.081	645.49
870.461	531.41
870.84	434.32
871.22	567.82
871.599	521.7
871.978	545.97
872.357	509.56
872.736	468.3
873.115	497.43
873.494	453.74
873.873	528.98
874.252	453.74
874.631	393.06
875.01	405.19
875.388	344.51
875.767	327.52
876.146	434.32
876.524	468.3
876.903	346.94
877.281	329.95
877.66	266.84
878.038	356.65
878.416	334.8
878.794	366.36
879.173	281.41
879.551	252.28
879.929	286.26
880.307	327.52
880.685	281.41
881.063	283.83
881.441	295.97
881.818	220.73
882.196	228.01
882.574	242.57
882.951	249.85
883.329	261.99
883.707	315.39
884.084	232.86
884.461	247.42
884.839	252.28
885.216	286.26
885.593	232.86
885.971	218.3
886.348	228.01
886.725	196.45
887.102	208.59
887.479	172.18
887.856	242.57
888.233	269.27
888.609	184.32
888.986	208.59
889.363	245
889.74	232.86
890.116	228.01
890.493	208.59
890.869	184.32
891.246	215.87
891.622	223.15
891.998	249.85
892.375	189.17
892.751	160.04
893.127	152.76
893.503	194.03
893.879	53.25
894.255	138.2
894.631	228.01
895.007	206.16
895.383	223.15
895.759	169.75
896.134	135.77
896.51	164.9
896.886	230.43
897.261	135.77
897.637	128.49
898.012	164.9
898.388	65.38
898.763	128.49
899.138	174.61
899.514	140.63
899.889	162.47
900.264	213.44
900.639	130.92
901.014	123.64
901.389	157.62
901.764	167.33
902.139	232.86
902.513	235.29
902.888	164.9
903.263	150.34
903.638	213.44
904.012	186.74
904.387	133.35
904.761	155.19
905.136	140.63
905.51	174.61
905.884	150.34
906.259	157.62
906.633	116.35
907.007	157.62
907.381	172.18
907.755	186.74
908.129	130.92
908.503	160.04
908.877	106.65
909.251	203.73
909.624	208.59
909.998	138.2
910.372	169.75
910.745	157.62
911.119	164.9
911.492	155.19
911.866	152.76
912.239	147.91
912.612	147.91
912.986	169.75
913.359	143.05
913.732	96.94
914.105	126.06
914.478	138.2
914.851	96.94
915.224	101.79
915.597	135.77
915.97	128.49
916.343	177.04
916.715	130.92
917.088	174.61
917.461	169.75
917.833	164.9
918.206	198.88
918.578	113.93
918.951	147.91
919.323	116.35
919.695	174.61
920.067	155.19
920.44	145.48
920.812	111.5
921.184	133.35
921.556	167.33
921.928	101.79
922.3	109.07
922.672	206.16
923.043	201.31
923.415	138.2
923.787	128.49
924.158	186.74
924.53	150.34
924.901	208.59
925.273	96.94
925.644	196.45
926.016	118.78
926.387	70.24
926.758	177.04
927.129	196.45
927.5	111.5
927.872	133.35
928.243	135.77
928.613	96.94
928.984	126.06
929.355	75.09
929.726	133.35
930.097	94.51
930.467	113.93
930.838	150.34
931.209	138.2
931.579	194.03
931.95	133.35
932.32	155.19
932.69	106.65
933.061	147.91
933.431	138.2
933.801	225.58
934.171	155.19
934.541	121.21
934.911	152.76
935.281	155.19
935.651	167.33
936.021	179.46
936.391	138.2
936.761	181.89
937.13	104.22
937.5	172.18
937.87	177.04
938.239	118.78
938.609	201.31
938.978	266.84
939.347	138.2
939.717	167.33
940.086	143.05
940.455	152.76
940.824	143.05
941.193	121.21
941.562	177.04
941.931	116.35
942.3	249.85
942.669	75.09
943.038	41.11
943.407	101.79
943.775	121.21
944.144	143.05
944.513	155.19
944.881	138.2
945.25	191.6
945.618	181.89
945.986	116.35
946.355	104.22
946.723	143.05
947.091	135.77
947.459	111.5
947.827	99.36
948.195	186.74
948.563	133.35
948.931	145.48
949.299	174.61
949.667	99.36
950.035	104.22
950.402	150.34
950.77	164.9
951.138	162.47
951.505	167.33
951.873	191.6
952.24	116.35
952.607	123.64
952.975	184.32
953.342	164.9
953.709	126.06
954.076	145.48
954.443	152.76
954.81	155.19
955.177	101.79
955.544	147.91
955.911	140.63
956.278	99.36
956.645	135.77
957.012	211.02
957.378	150.34
957.745	157.62
958.111	101.79
958.478	145.48
958.844	121.21
959.211	143.05
959.577	58.1
959.943	194.03
960.309	218.3
960.675	128.49
961.042	55.67
961.408	133.35
961.774	123.64
962.139	155.19
962.505	147.91
962.871	155.19
963.237	138.2
963.603	147.91
963.968	123.64
964.334	157.62
964.699	84.8
965.065	128.49
965.43	126.06
965.796	123.64
966.161	99.36
966.526	179.46
966.891	196.45
967.256	157.62
967.622	133.35
967.987	152.76
968.352	143.05
968.716	118.78
969.081	101.79
969.446	150.34
969.811	237.72
970.176	160.04
970.54	162.47
970.905	157.62
971.269	198.88
971.634	89.66
971.998	135.77
972.363	143.05
972.727	99.36
973.091	184.32
973.455	143.05
973.819	172.18
974.183	164.9
974.547	157.62
974.911	101.79
975.275	169.75
975.639	143.05
976.003	174.61
976.367	152.76
976.73	113.93
977.094	181.89
977.458	167.33
977.821	242.57
978.185	147.91
978.548	94.51
978.911	143.05
979.275	155.19
979.638	196.45
980.001	152.76
980.364	111.5
980.727	116.35
981.09	106.65
981.453	223.15
981.816	211.02
982.179	230.43
982.542	138.2
982.905	130.92
983.267	109.07
983.63	198.88
983.992	162.47
984.355	92.08
984.717	101.79
985.08	140.63
985.442	94.51
985.804	121.21
986.167	152.76
986.529	104.22
986.891	162.47
987.253	191.6
987.615	155.19
987.977	223.15
988.339	150.34
988.701	155.19
989.062	164.9
989.424	152.76
989.786	189.17
990.147	138.2
990.509	177.04
990.87	133.35
991.232	113.93
991.593	143.05
991.955	160.04
992.316	191.6
992.677	138.2
993.038	126.06
993.399	123.64
993.76	118.78
994.121	101.79
994.482	128.49
994.843	169.75
995.204	111.5
995.565	123.64
995.926	126.06
996.286	198.88
996.647	191.6
997.007	191.6
997.368	184.32
997.728	147.91
998.089	152.76
998.449	121.21
998.809	116.35
999.169	145.48
999.53	143.05
999.89	201.31
1000.25	162.47
1000.61	130.92
1000.97	179.46
1001.329	145.48
1001.689	104.22
1002.049	109.07
1002.409	121.21
1002.768	155.19
1003.128	135.77
1003.487	140.63
1003.847	177.04
1004.206	157.62
1004.566	177.04
1004.925	150.34
1005.284	160.04
1005.643	169.75
1006.003	152.76
1006.362	201.31
1006.721	116.35
1007.08	167.33
1007.438	138.2
1007.797	79.95
1008.156	145.48
1008.515	128.49
1008.874	162.47
1009.232	194.03
1009.591	130.92
1009.949	145.48
1010.308	194.03
1010.666	206.16
1011.024	60.53
1011.383	126.06
1011.741	123.64
1012.099	215.87
1012.457	113.93
1012.815	196.45
1013.173	72.66
1013.531	143.05
1013.889	118.78
1014.247	215.87
1014.605	128.49
1014.962	113.93
1015.32	184.32
1015.678	184.32
1016.035	123.64
1016.393	164.9
1016.75	126.06
1017.107	128.49
1017.465	172.18
1017.822	130.92
1018.179	194.03
1018.536	164.9
1018.894	118.78
1019.251	164.9
1019.608	138.2
1019.964	155.19
1020.321	177.04
1020.678	87.23
1021.035	106.65
1021.392	213.44
1021.748	101.79
1022.105	143.05
1022.461	211.02
1022.818	208.59
1023.174	143.05
1023.531	174.61
1023.887	179.46
1024.243	138.2
1024.599	150.34
1024.955	147.91
1025.311	111.5
1025.667	196.45
1026.023	172.18
1026.379	123.64
1026.735	140.63
1027.091	169.75
1027.447	172.18
