189.514	133.19
189.973	133.19
190.431	133.19
190.889	36.1
191.348	-12.44
191.806	36.1
192.264	-43.99
192.722	19.11
193.18	-0.3
193.638	-19.72
194.096	9.41
194.554	-31.86
195.012	28.82
195.47	14.26
195.928	-34.28
196.385	11.83
196.843	-46.42
197.301	28.82
197.758	-17.29
198.216	19.11
198.674	36.1
199.131	26.4
199.589	79.79
200.046	53.1
200.503	70.09
200.961	96.79
201.418	128.34
201.875	45.81
202.332	96.79
202.79	82.22
203.247	116.2
203.704	191.45
204.161	201.16
204.618	133.19
205.075	164.75
205.532	142.9
205.989	196.3
206.445	191.45
206.902	184.17
207.359	142.9
207.816	264.26
208.272	116.2
208.729	140.48
209.185	101.64
209.642	206.01
210.098	169.6
210.555	223
211.011	191.45
211.467	140.48
211.924	138.05
212.38	140.48
212.836	138.05
213.292	203.58
213.748	123.48
214.204	101.64
214.66	176.88
215.116	89.5
215.572	208.44
216.028	167.17
216.484	150.18
216.94	206.01
217.396	184.17
217.851	167.17
218.307	157.47
218.763	159.89
219.218	130.77
219.674	172.03
220.129	121.06
220.585	167.17
221.04	164.75
221.496	169.6
221.951	140.48
222.406	159.89
222.861	164.75
223.317	113.78
223.772	157.47
224.227	121.06
224.682	101.64
225.137	181.74
225.592	106.49
226.047	108.92
226.502	181.74
226.957	140.48
227.411	167.17
227.866	130.77
228.321	108.92
228.776	162.32
229.23	179.31
229.685	101.64
230.139	128.34
230.594	184.17
231.048	104.07
231.503	150.18
231.957	147.76
232.411	147.76
232.865	133.19
233.32	133.19
233.774	108.92
234.228	130.77
234.682	162.32
235.136	155.04
235.59	99.21
236.044	152.61
236.498	108.92
236.952	138.05
237.406	125.91
237.86	252.13
238.313	152.61
238.767	135.62
239.221	179.31
239.674	208.44
240.128	133.19
240.581	159.89
241.035	167.17
241.488	174.46
241.942	155.04
242.395	152.61
242.848	145.33
243.301	118.63
243.755	218.15
244.208	167.17
244.661	101.64
245.114	191.45
245.567	152.61
246.02	116.2
246.473	135.62
246.926	242.42
247.379	123.48
247.832	174.46
248.284	130.77
248.737	191.45
249.19	198.73
249.642	116.2
250.095	82.22
250.547	155.04
251	130.77
251.452	118.63
251.905	145.33
252.357	101.64
252.81	220.57
253.262	201.16
253.714	118.63
254.166	172.03
254.618	181.74
255.07	174.46
255.523	147.76
255.975	116.2
256.427	106.49
256.878	101.64
257.33	128.34
257.782	193.87
258.234	164.75
258.686	159.89
259.137	167.17
259.589	196.3
260.041	172.03
260.492	152.61
260.944	201.16
261.395	176.88
261.847	145.33
262.298	142.9
262.749	172.03
263.201	162.32
263.652	128.34
264.103	116.2
264.554	167.17
265.005	159.89
265.457	157.47
265.908	210.86
266.359	155.04
266.809	150.18
267.26	169.6
267.711	162.32
268.162	155.04
268.613	74.94
269.064	191.45
269.514	87.08
269.965	150.18
270.415	162.32
270.866	108.92
271.316	186.59
271.767	157.47
272.217	133.19
272.668	172.03
273.118	140.48
273.568	239.99
274.019	142.9
274.469	147.76
274.919	227.86
275.369	142.9
275.819	123.48
276.269	113.78
276.719	155.04
277.169	186.59
277.619	157.47
278.069	193.87
278.518	133.19
278.968	118.63
279.418	155.04
279.867	162.32
280.317	145.33
280.767	147.76
281.216	169.6
281.666	181.74
282.115	189.02
282.564	176.88
283.014	189.02
283.463	210.86
283.912	176.88
284.361	116.2
284.811	159.89
285.26	125.91
285.709	162.32
286.158	184.17
286.607	225.43
287.056	108.92
287.505	220.57
287.953	218.15
288.402	196.3
288.851	164.75
289.3	150.18
289.748	189.02
290.197	111.35
290.646	198.73
291.094	169.6
291.543	235.14
291.991	186.59
292.439	159.89
292.888	225.43
293.336	232.71
293.784	198.73
294.233	169.6
294.681	169.6
295.129	169.6
295.577	101.64
296.025	116.2
296.473	193.87
296.921	198.73
297.369	169.6
297.817	196.3
298.264	121.06
298.712	150.18
299.16	167.17
299.608	208.44
300.055	142.9
300.503	150.18
300.95	121.06
301.398	169.6
301.845	162.32
302.293	101.64
302.74	176.88
303.187	130.77
303.635	232.71
304.082	167.17
304.529	169.6
304.976	174.46
305.423	198.73
305.87	145.33
306.317	140.48
306.764	138.05
307.211	162.32
307.658	201.16
308.105	164.75
308.552	189.02
308.998	155.04
309.445	181.74
309.892	186.59
310.338	162.32
310.785	87.08
311.231	176.88
311.678	174.46
312.124	232.71
312.571	145.33
313.017	138.05
313.463	157.47
313.909	176.88
314.356	174.46
314.802	201.16
315.248	169.6
315.694	181.74
316.14	232.71
316.586	225.43
317.032	223
317.478	191.45
317.923	225.43
318.369	232.71
318.815	142.9
319.261	201.16
319.706	169.6
320.152	208.44
320.597	172.03
321.043	220.57
321.488	147.76
321.934	210.86
322.379	181.74
322.824	201.16
323.27	174.46
323.715	198.73
324.16	116.2
324.605	150.18
325.05	172.03
325.495	184.17
325.94	193.87
326.385	138.05
326.83	133.19
327.275	155.04
327.72	123.48
328.165	157.47
328.61	201.16
329.054	210.86
329.499	181.74
329.943	147.76
330.388	169.6
330.832	167.17
331.277	167.17
331.721	150.18
332.166	152.61
332.61	130.77
333.054	150.18
333.499	174.46
333.943	201.16
334.387	206.01
334.831	198.73
335.275	186.59
335.719	152.61
336.163	184.17
336.607	128.34
337.051	157.47
337.495	179.31
337.938	159.89
338.382	189.02
338.826	196.3
339.269	172.03
339.713	147.76
340.157	113.78
340.6	123.48
341.044	184.17
341.487	147.76
341.93	138.05
342.374	118.63
342.817	196.3
343.26	155.04
343.703	138.05
344.146	191.45
344.59	172.03
345.033	176.88
345.476	101.64
345.919	140.48
346.361	181.74
346.804	186.59
347.247	191.45
347.69	99.21
348.133	104.07
348.575	133.19
349.018	162.32
349.461	196.3
349.903	130.77
350.346	174.46
350.788	193.87
351.23	118.63
351.673	210.86
352.115	235.14
352.557	189.02
353	123.48
353.442	235.14
353.884	179.31
354.326	164.75
354.768	128.34
355.21	140.48
355.652	167.17
356.094	101.64
356.536	87.08
356.978	218.15
357.419	213.29
357.861	133.19
358.303	227.86
358.744	133.19
359.186	196.3
359.627	128.34
360.069	193.87
360.51	215.72
360.952	264.26
361.393	184.17
361.834	162.32
362.276	179.31
362.717	99.21
363.158	138.05
363.599	150.18
364.04	142.9
364.481	108.92
364.922	181.74
365.363	101.64
365.804	189.02
366.245	113.78
366.686	130.77
367.126	206.01
367.567	87.08
368.008	118.63
368.448	101.64
368.889	206.01
369.33	150.18
369.77	230.28
370.21	116.2
370.651	159.89
371.091	138.05
371.531	152.61
371.972	101.64
372.412	155.04
372.852	157.47
373.292	191.45
373.732	179.31
374.172	111.35
374.612	152.61
375.052	121.06
375.492	135.62
375.932	227.86
376.372	152.61
376.811	193.87
377.251	201.16
377.691	181.74
378.13	145.33
378.57	176.88
379.009	155.04
379.449	167.17
379.888	116.2
380.328	201.16
380.767	162.32
381.206	169.6
381.645	84.65
382.085	145.33
382.524	196.3
382.963	186.59
383.402	184.17
383.841	140.48
384.28	125.91
384.719	87.08
385.158	172.03
385.596	116.2
386.035	152.61
386.474	210.86
386.913	174.46
387.351	176.88
387.79	123.48
388.228	162.32
388.667	162.32
389.105	223
389.544	196.3
389.982	89.5
390.42	135.62
390.859	123.48
391.297	152.61
391.735	142.9
392.173	145.33
392.611	133.19
393.049	176.88
393.487	150.18
393.925	186.59
394.363	213.29
394.801	140.48
395.239	77.37
395.676	89.5
396.114	164.75
396.552	133.19
396.989	108.92
397.427	176.88
397.864	191.45
398.302	150.18
398.739	191.45
399.177	106.49
399.614	150.18
400.051	181.74
400.488	108.92
400.926	169.6
401.363	174.46
401.8	155.04
402.237	155.04
402.674	176.88
403.111	138.05
403.548	155.04
403.985	159.89
404.421	145.33
404.858	184.17
405.295	167.17
405.732	242.42
406.168	106.49
406.605	208.44
407.041	157.47
407.478	135.62
407.914	201.16
408.351	145.33
408.787	125.91
409.223	128.34
409.66	164.75
410.096	172.03
410.532	196.3
410.968	159.89
411.404	172.03
411.84	223
412.276	138.05
412.712	99.21
413.148	181.74
413.584	150.18
414.02	138.05
414.455	74.94
414.891	155.04
415.327	128.34
415.762	176.88
416.198	96.79
416.633	150.18
417.069	142.9
417.504	101.64
417.94	135.62
418.375	150.18
418.81	157.47
419.245	145.33
419.681	201.16
420.116	203.58
420.551	135.62
420.986	210.86
421.421	186.59
421.856	206.01
422.291	164.75
422.726	159.89
423.16	150.18
423.595	191.45
424.03	176.88
424.464	125.91
424.899	138.05
425.334	181.74
425.768	96.79
426.203	167.17
426.637	159.89
427.071	176.88
427.506	176.88
427.94	179.31
428.374	179.31
428.809	176.88
429.243	164.75
429.677	159.89
430.111	125.91
430.545	184.17
430.979	82.22
431.413	179.31
431.847	150.18
432.28	239.99
432.714	218.15
433.148	155.04
433.582	184.17
434.015	181.74
434.449	189.02
434.882	174.46
435.316	213.29
435.749	133.19
436.183	118.63
436.616	157.47
437.049	133.19
437.483	162.32
437.916	133.19
438.349	220.57
438.782	191.45
439.215	159.89
439.648	104.07
440.081	235.14
440.514	99.21
440.947	147.76
441.38	179.31
441.813	174.46
442.245	225.43
442.678	186.59
443.111	176.88
443.543	179.31
443.976	150.18
444.408	82.22
444.841	159.89
445.273	135.62
445.705	201.16
446.138	133.19
446.57	118.63
447.002	94.36
447.434	138.05
447.867	172.03
448.299	227.86
448.731	256.98
449.163	186.59
449.595	174.46
450.026	167.17
450.458	99.21
450.89	164.75
451.322	159.89
451.754	215.72
452.185	208.44
452.617	159.89
453.048	283.68
453.48	128.34
453.911	215.72
454.343	87.08
454.774	162.32
455.205	125.91
455.637	184.17
456.068	189.02
456.499	218.15
456.93	223
457.361	172.03
457.792	150.18
458.223	162.32
458.654	196.3
459.085	235.14
459.516	193.87
459.947	172.03
460.378	196.3
460.808	235.14
461.239	186.59
461.669	191.45
462.1	169.6
462.531	174.46
462.961	196.3
463.391	244.85
463.822	150.18
464.252	135.62
464.682	164.75
465.113	167.17
465.543	215.72
465.973	242.42
466.403	184.17
466.833	147.76
467.263	193.87
467.693	138.05
468.123	176.88
468.553	172.03
468.983	174.46
469.412	172.03
469.842	101.64
470.272	140.48
470.701	130.77
471.131	162.32
471.56	157.47
471.99	140.48
472.419	218.15
472.849	223
473.278	189.02
473.707	269.12
474.136	227.86
474.566	138.05
474.995	111.35
475.424	196.3
475.853	181.74
476.282	150.18
476.711	152.61
477.14	186.59
477.569	138.05
477.997	181.74
478.426	130.77
478.855	130.77
479.283	196.3
479.712	152.61
480.141	208.44
480.569	193.87
480.998	155.04
481.426	113.78
481.854	157.47
482.283	191.45
482.711	167.17
483.139	213.29
483.567	196.3
483.995	191.45
484.424	215.72
484.852	201.16
485.28	169.6
485.708	150.18
486.135	186.59
486.563	181.74
486.991	167.17
487.419	130.77
487.847	252.13
488.274	232.71
488.702	135.62
489.129	162.32
489.557	147.76
489.984	230.28
490.412	201.16
490.839	181.74
491.266	191.45
491.694	218.15
492.121	206.01
492.548	210.86
492.975	179.31
493.402	142.9
493.829	215.72
494.256	138.05
494.683	172.03
495.11	145.33
495.537	184.17
495.964	172.03
496.39	225.43
496.817	145.33
497.244	218.15
497.67	184.17
498.097	138.05
498.523	140.48
498.95	203.58
499.376	125.91
499.803	121.06
500.229	181.74
500.655	150.18
501.081	99.21
501.508	210.86
501.934	174.46
502.36	150.18
502.786	193.87
503.212	181.74
503.638	121.06
504.064	91.93
504.489	118.63
504.915	162.32
505.341	140.48
505.767	176.88
506.192	181.74
506.618	118.63
507.043	159.89
507.469	196.3
507.894	213.29
508.32	159.89
508.745	172.03
509.17	162.32
509.596	118.63
510.021	147.76
510.446	186.59
510.871	172.03
511.296	206.01
511.721	244.85
512.146	157.47
512.571	140.48
512.996	208.44
513.421	176.88
513.845	184.17
514.27	135.62
514.695	176.88
515.119	116.2
515.544	167.17
515.969	157.47
516.393	116.2
516.817	87.08
517.242	181.74
517.666	125.91
518.09	176.88
518.515	152.61
518.939	133.19
519.363	407.47
519.787	167.17
520.211	113.78
520.635	256.98
521.059	108.92
521.483	232.71
521.907	184.17
522.331	111.35
522.754	155.04
523.178	172.03
523.602	176.88
524.025	213.29
524.449	181.74
524.872	242.42
525.296	164.75
525.719	196.3
526.143	198.73
526.566	123.48
526.989	130.77
527.412	196.3
527.836	223
528.259	169.6
528.682	125.91
529.105	113.78
529.528	186.59
529.951	198.73
530.374	101.64
530.796	121.06
531.219	193.87
531.642	147.76
532.065	128.34
532.487	162.32
532.91	142.9
533.332	133.19
533.755	157.47
534.177	108.92
534.6	179.31
535.022	155.04
535.444	184.17
535.867	198.73
536.289	128.34
536.711	162.32
537.133	181.74
537.555	162.32
537.977	135.62
538.399	201.16
538.821	155.04
539.243	181.74
539.665	198.73
540.086	106.49
540.508	184.17
540.93	179.31
541.351	181.74
541.773	147.76
542.195	201.16
542.616	225.43
543.037	169.6
543.459	193.87
543.88	186.59
544.301	176.88
544.723	172.03
545.144	203.58
545.565	123.48
545.986	162.32
546.407	193.87
546.828	101.64
547.249	150.18
547.67	172.03
548.091	206.01
548.512	121.06
548.932	128.34
549.353	189.02
549.774	225.43
550.194	213.29
550.615	142.9
551.035	206.01
551.456	210.86
551.876	157.47
552.296	206.01
552.717	172.03
553.137	162.32
553.557	150.18
553.977	174.46
554.397	181.74
554.817	152.61
555.237	206.01
555.657	213.29
556.077	189.02
556.497	176.88
556.917	162.32
557.337	145.33
557.756	176.88
558.176	155.04
558.596	220.57
559.015	87.08
559.435	186.59
559.854	203.58
560.274	174.46
560.693	70.09
561.112	118.63
561.532	116.2
561.951	191.45
562.37	167.17
562.789	176.88
563.208	189.02
563.627	133.19
564.046	179.31
564.465	147.76
564.884	189.02
565.303	133.19
565.722	193.87
566.14	121.06
566.559	201.16
566.978	147.76
567.396	176.88
567.815	155.04
568.233	203.58
568.652	225.43
569.07	179.31
569.489	193.87
569.907	179.31
570.325	147.76
570.743	116.2
571.161	152.61
571.58	155.04
571.998	135.62
572.416	218.15
572.833	176.88
573.251	181.74
573.669	208.44
574.087	176.88
574.505	121.06
574.922	198.73
575.34	140.48
575.758	169.6
576.175	147.76
576.593	174.46
577.01	191.45
577.428	169.6
577.845	1635.64
578.262	283.68
578.68	174.46
579.097	223
579.514	172.03
579.931	206.01
580.348	150.18
580.765	181.74
581.182	208.44
581.599	198.73
582.016	179.31
582.433	208.44
582.849	235.14
583.266	249.7
583.683	193.87
584.099	198.73
584.516	227.86
584.933	174.46
585.349	172.03
585.765	278.83
586.182	138.05
586.598	157.47
587.014	249.7
587.431	116.2
587.847	138.05
588.263	172.03
588.679	142.9
589.095	152.61
589.511	223
589.927	239.99
590.343	232.71
590.759	213.29
591.174	186.59
591.59	201.16
592.006	191.45
592.421	186.59
592.837	135.62
593.252	118.63
593.668	193.87
594.083	155.04
594.499	174.46
594.914	121.06
595.329	191.45
595.745	186.59
596.16	155.04
596.575	193.87
596.99	116.2
597.405	174.46
597.82	203.58
598.235	172.03
598.65	189.02
599.065	138.05
599.479	286.11
599.894	239.99
600.309	172.03
600.724	157.47
601.138	140.48
601.553	191.45
601.967	155.04
602.382	189.02
602.796	108.92
603.21	104.07
603.625	145.33
604.039	159.89
604.453	184.17
604.867	189.02
605.281	179.31
605.695	189.02
606.109	147.76
606.523	152.61
606.937	220.57
607.351	293.39
607.765	193.87
608.178	186.59
608.592	164.75
609.006	249.7
609.419	186.59
609.833	140.48
610.246	210.86
610.66	184.17
611.073	138.05
611.487	230.28
611.9	254.55
612.313	142.9
612.726	218.15
613.139	201.16
613.553	152.61
613.966	108.92
614.379	138.05
614.792	210.86
615.204	176.88
615.617	164.75
616.03	181.74
616.443	218.15
616.856	242.42
617.268	191.45
617.681	159.89
618.093	162.32
618.506	147.76
618.918	89.5
619.331	198.73
619.743	130.77
620.155	244.85
620.568	159.89
620.98	232.71
621.392	191.45
621.804	167.17
622.216	239.99
622.628	196.3
623.04	142.9
623.452	213.29
623.864	113.78
624.276	152.61
624.687	123.48
625.099	210.86
625.511	125.91
625.922	198.73
626.334	193.87
626.745	116.2
627.157	152.61
627.568	172.03
627.979	169.6
628.391	159.89
628.802	227.86
629.213	189.02
629.624	157.47
630.035	196.3
630.446	181.74
630.857	264.26
631.268	123.48
631.679	201.16
632.09	167.17
632.501	230.28
632.912	164.75
633.322	208.44
633.733	179.31
634.144	121.06
634.554	140.48
634.965	230.28
635.375	176.88
635.785	128.34
636.196	181.74
636.606	159.89
637.016	174.46
637.427	169.6
637.837	201.16
638.247	210.86
638.657	147.76
639.067	167.17
639.477	181.74
639.887	155.04
640.297	82.22
640.706	176.88
641.116	201.16
641.526	150.18
641.935	179.31
642.345	244.85
642.755	138.05
643.164	121.06
643.573	227.86
643.983	184.17
644.392	162.32
644.801	189.02
645.211	179.31
645.62	155.04
646.029	176.88
646.438	150.18
646.847	164.75
647.256	196.3
647.665	89.5
648.074	125.91
648.483	123.48
648.892	116.2
649.3	213.29
649.709	201.16
650.118	206.01
650.526	147.76
650.935	142.9
651.343	220.57
651.752	193.87
652.16	164.75
652.568	150.18
652.977	206.01
653.385	196.3
653.793	176.88
654.201	157.47
654.609	104.07
655.017	123.48
655.425	152.61
655.833	108.92
656.241	176.88
656.649	123.48
657.057	130.77
657.464	145.33
657.872	198.73
658.28	130.77
658.687	167.17
659.095	186.59
659.502	179.31
659.91	218.15
660.317	167.17
660.724	147.76
661.132	157.47
661.539	157.47
661.946	128.34
662.353	150.18
662.76	176.88
663.167	193.87
663.574	130.77
663.981	164.75
664.388	176.88
664.795	220.57
665.202	196.3
665.608	147.76
666.015	138.05
666.422	130.77
666.828	164.75
667.235	186.59
667.641	150.18
668.047	152.61
668.454	77.37
668.86	133.19
669.266	138.05
669.673	142.9
670.079	169.6
670.485	150.18
670.891	162.32
671.297	147.76
671.703	108.92
672.109	157.47
672.515	186.59
672.92	167.17
673.326	172.03
673.732	116.2
674.138	193.87
674.543	196.3
674.949	125.91
675.354	138.05
675.76	227.86
676.165	181.74
676.57	176.88
676.976	225.43
677.381	116.2
677.786	142.9
678.191	220.57
678.596	218.15
679.001	155.04
679.406	162.32
679.811	203.58
680.216	167.17
680.621	225.43
681.026	169.6
681.43	249.7
681.835	206.01
682.24	186.59
682.644	145.33
683.049	201.16
683.453	189.02
683.858	189.02
684.262	179.31
684.667	174.46
685.071	123.48
685.475	157.47
685.879	116.2
686.283	203.58
686.687	210.86
687.091	104.07
687.495	152.61
687.899	179.31
688.303	181.74
688.707	138.05
689.111	150.18
689.514	176.88
689.918	128.34
690.322	193.87
690.725	155.04
691.129	147.76
691.532	157.47
691.936	162.32
692.339	159.89
692.742	201.16
693.146	201.16
693.549	150.18
693.952	169.6
694.355	152.61
694.758	184.17
695.161	133.19
695.564	210.86
695.967	152.61
696.37	174.46
696.773	201.16
697.175	150.18
697.578	111.35
697.981	220.57
698.383	208.44
698.786	225.43
699.188	128.34
699.591	176.88
699.993	206.01
700.395	138.05
700.798	116.2
701.2	252.13
701.602	230.28
702.004	193.87
702.406	179.31
702.808	155.04
703.21	252.13
703.612	213.29
704.014	167.17
704.416	133.19
704.818	206.01
705.219	157.47
705.621	184.17
706.023	198.73
706.424	128.34
706.826	196.3
707.227	138.05
707.629	138.05
708.03	189.02
708.431	239.99
708.832	218.15
709.234	247.27
709.635	332.23
710.036	174.46
710.437	244.85
710.838	150.18
711.239	164.75
711.64	201.16
712.041	227.86
712.441	225.43
712.842	220.57
713.243	244.85
713.643	223
714.044	266.69
714.445	210.86
714.845	215.72
715.246	249.7
715.646	266.69
716.046	198.73
716.447	232.71
716.847	232.71
717.247	254.55
717.647	259.41
718.047	259.41
718.447	220.57
718.847	235.14
719.247	264.26
719.647	298.24
720.047	259.41
720.446	271.55
720.846	218.15
721.246	210.86
721.645	244.85
722.045	276.4
722.444	293.39
722.844	266.69
723.243	310.38
723.643	310.38
724.042	271.55
724.441	247.27
724.84	261.84
725.24	315.24
725.639	256.98
726.038	373.49
726.437	252.13
726.836	278.83
727.234	354.07
727.633	349.22
728.032	273.97
728.431	341.93
728.83	346.79
729.228	426.89
729.627	434.17
730.025	475.43
730.424	519.12
730.822	557.96
731.22	511.84
731.619	582.23
732.017	630.77
732.415	679.32
732.813	756.99
733.212	841.94
733.61	844.37
734.008	827.38
734.406	939.03
734.803	951.17
735.201	1033.69
735.599	1293.41
735.997	1329.81
736.395	1434.18
736.792	1497.29
737.19	1448.75
737.587	1434.18
737.985	1582.25
738.382	1647.78
738.78	1951.18
739.177	2157.5
739.574	2167.21
739.971	2033.71
740.369	2050.7
740.766	2223.03
741.163	2424.49
741.56	2776.44
741.957	3033.72
742.354	3123.53
742.751	2832.26
743.147	2732.75
743.544	2652.65
743.941	2985.18
744.338	3713.35
744.734	4113.84
745.131	4281.32
745.527	4162.38
745.924	3851.7
746.32	3953.64
746.716	4541.03
747.113	5342.01
747.509	6198.82
747.905	6533.78
748.301	6043.48
748.697	5606.58
749.093	5902.7
749.489	6696.4
749.885	7803.22
750.281	9036.24
750.677	8883.33
751.073	8349.34
751.468	7786.23
751.864	7900.3
752.26	8861.48
752.655	10577.53
753.051	11516.87
753.446	11378.51
753.842	10354.23
754.237	9662.47
754.632	10152.77
755.028	11611.53
755.423	13259.61
755.818	13293.59
756.213	12184.35
756.608	10757.15
757.003	10325.1
757.398	11371.23
757.793	12458.63
758.188	13563.01
758.583	13104.27
758.977	11786.29
759.372	11414.92
759.767	12893.1
760.161	15317.9
760.556	18320.37
760.95	18902.9
761.345	17485.41
761.739	15893.15
762.133	16470.83
762.527	19395.63
762.922	21978.19
763.316	23463.65
763.71	22487.91
764.104	20555.84
764.498	20483.02
764.892	22019.46
765.286	25451.55
765.68	27359.35
766.073	27068.08
766.467	24303.47
766.861	23250.06
767.255	25886.02
767.648	30111.82
768.042	32439.52
768.435	33471.09
768.829	31539.02
769.222	28820.53
769.615	28628.78
770.008	32196.8
770.402	35854.62
770.795	36014.82
771.188	32757.49
771.581	29315.69
771.974	29410.35
772.367	32670.11
772.76	34774.51
773.153	33247.79
773.545	29764.72
773.938	27276.82
774.331	27752.56
774.724	31221.06
775.116	35565.78
775.509	37031.83
775.901	34917.72
776.294	33704.1
776.686	34684.7
777.078	39442.06
777.471	43386.29
777.863	43027.06
778.255	41347.43
778.647	39699.34
779.039	40410.52
779.431	44553.79
779.823	48820.84
780.215	48112.1
780.607	42160.55
780.999	41361.99
781.39	42854.73
781.782	47796.56
782.174	50755.34
782.565	48636.38
782.957	43891.16
783.348	43328.04
783.74	46444.59
784.131	49774.74
784.522	50998.06
784.914	47801.41
785.305	43570.76
785.696	41383.84
786.087	43626.59
786.478	44777.09
786.869	43896.01
787.26	38626.51
787.651	35759.96
788.042	35116.75
788.433	36531.82
788.823	35752.68
789.214	34022.07
789.605	31111.83
789.995	28548.68
790.386	29505.01
790.776	32150.68
791.167	32068.16
791.557	30354.54
791.948	28687.04
792.338	28526.84
792.728	32551.17
793.118	35934.72
793.508	35587.63
793.898	32483.21
794.288	30301.14
794.678	32039.03
795.068	35417.72
795.458	36667.74
795.848	35325.49
796.238	31568.15
796.627	30417.65
797.017	32609.43
797.406	35522.09
797.796	35233.25
798.185	33124
798.575	31451.64
798.964	32145.83
799.354	36119.19
799.743	37526.98
800.132	36121.62
800.521	33238.08
800.91	32191.94
801.299	35029.37
801.688	37548.82
802.077	35776.95
802.466	33694.4
802.855	32109.42
803.244	31869.12
803.633	34048.77
804.021	34551.2
804.41	32279.32
804.799	29514.72
805.187	27944.31
805.576	28485.58
805.964	29468.6
806.352	27876.34
806.741	25854.47
807.129	24026.77
807.517	25116.59
807.905	26582.63
808.293	27080.21
808.681	26087.48
809.069	24259.78
809.457	26021.95
809.845	28684.61
810.233	29900.65
810.621	29490.45
811.009	26555.93
811.396	26089.91
811.784	28560.82
812.171	29772
812.559	29400.64
812.946	26869.05
813.334	25461.26
813.721	26769.53
814.108	27153.03
814.496	27587.5
814.883	25580.19
815.27	25138.44
815.657	25713.69
816.044	27973.43
816.431	28529.27
816.818	26466.13
817.205	24250.07
817.592	24470.95
817.979	25541.36
818.365	27109.34
818.752	26361.76
819.139	23609.29
819.525	22354.41
819.912	22864.13
820.298	24235.51
820.685	23257.34
821.071	20861.67
821.457	19315.53
821.843	18881.06
822.23	19373.78
822.616	18783.97
823.002	16582.48
823.388	14766.92
823.774	14570.31
824.16	14582.45
824.546	14837.31
824.931	14033.9
825.317	12555.72
825.703	12521.74
826.089	13592.14
826.474	14021.76
826.86	13315.44
827.245	12279.01
827.631	12194.06
828.016	12664.94
828.401	12900.38
828.787	12613.97
829.172	11252.3
829.557	10621.22
829.942	10691.61
830.327	11058.12
830.712	10866.37
831.097	9982.86
831.482	9482.85
831.867	9211
832.252	9876.06
832.636	9749.85
833.021	9320.23
833.406	8643.03
833.79	8718.28
834.175	8689.15
834.559	9118.77
834.944	8337.2
835.328	7713.41
835.713	7628.46
836.097	7820.21
836.481	7545.93
836.865	7193.98
837.249	6531.35
837.633	6121.15
838.017	6315.33
838.401	6266.78
838.785	5757.07
839.169	5305.6
839.553	4963.37
839.937	4941.52
840.32	4924.53
840.704	4507.05
841.087	4227.92
841.471	3883.25
841.854	4009.47
842.238	3939.08
842.621	3890.53
843.004	3385.67
843.388	3400.23
843.771	3584.7
844.154	3674.51
844.537	3594.41
844.92	3390.53
845.303	3198.78
845.686	3198.78
846.069	3407.52
846.452	3499.75
846.834	3220.62
847.217	2992.46
847.6	2841.97
847.982	3011.88
848.365	2953.63
848.748	2880.81
849.13	2635.66
849.512	2630.81
849.895	2871.1
850.277	2868.67
850.659	2514.3
851.041	2439.05
851.423	2368.67
851.806	2698.77
852.188	2793.43
852.57	2465.75
852.951	2368.67
853.333	2358.96
853.715	2528.86
854.097	2463.33
854.479	2210.9
854.86	1977.88
855.242	1941.47
855.623	1943.9
856.005	2014.29
856.386	1926.91
856.768	1701.18
857.149	1635.64
857.53	1693.9
857.911	1657.49
858.292	1499.72
858.674	1358.94
859.055	1305.54
859.436	1312.82
859.817	1310.4
860.197	1179.33
860.578	1038.55
860.959	1067.67
861.34	1077.38
861.72	1009.42
862.101	895.34
862.482	871.07
862.862	905.05
863.243	931.75
863.623	892.91
864.003	851.65
864.384	756.99
864.764	786.12
865.144	832.23
865.524	834.66
865.904	756.99
866.284	657.47
866.664	698.74
867.044	652.62
867.424	621.07
867.804	611.36
868.183	616.21
868.563	635.63
868.943	499.7
869.322	540.97
869.702	589.51
870.081	443.88
870.461	434.17
870.84	528.83
871.22	572.52
871.599	390.48
871.978	497.28
872.357	414.75
872.736	451.16
873.115	417.18
873.494	431.74
873.873	363.78
874.252	320.09
874.631	300.67
875.01	290.96
875.388	424.46
875.767	332.23
876.146	276.4
876.524	366.21
876.903	315.24
877.281	339.51
877.66	273.97
878.038	278.83
878.416	239.99
878.794	215.72
879.173	232.71
879.551	227.86
879.929	300.67
880.307	220.57
880.685	252.13
881.063	252.13
881.441	271.55
881.818	189.02
882.196	196.3
882.574	283.68
882.951	196.3
883.329	174.46
883.707	242.42
884.084	261.84
884.461	271.55
884.839	125.91
885.216	206.01
885.593	189.02
885.971	164.75
886.348	184.17
886.725	172.03
887.102	220.57
887.479	198.73
887.856	203.58
888.233	201.16
888.609	152.61
888.986	206.01
889.363	172.03
889.74	167.17
890.116	150.18
890.493	125.91
890.869	206.01
891.246	147.76
891.622	164.75
891.998	181.74
892.375	189.02
892.751	142.9
893.127	227.86
893.503	108.92
893.879	155.04
894.255	198.73
894.631	198.73
895.007	142.9
895.383	147.76
895.759	145.33
896.134	174.46
896.51	184.17
896.886	179.31
897.261	123.48
897.637	125.91
898.012	130.77
898.388	172.03
898.763	159.89
899.138	172.03
899.514	125.91
899.889	142.9
900.264	191.45
900.639	203.58
901.014	123.48
901.389	227.86
901.764	138.05
902.139	179.31
902.513	147.76
902.888	116.2
903.263	152.61
903.638	106.49
904.012	123.48
904.387	208.44
904.761	159.89
905.136	155.04
905.51	157.47
905.884	201.16
906.259	215.72
906.633	135.62
907.007	157.47
907.381	150.18
907.755	125.91
908.129	227.86
908.503	281.25
908.877	269.12
909.251	159.89
909.624	113.78
909.998	193.87
910.372	213.29
910.745	196.3
911.119	191.45
911.492	133.19
911.866	123.48
912.239	113.78
912.612	176.88
912.986	162.32
913.359	208.44
913.732	215.72
914.105	174.46
914.478	133.19
914.851	186.59
915.224	138.05
915.597	89.5
915.97	189.02
916.343	155.04
916.715	172.03
917.088	201.16
917.461	242.42
917.833	89.5
918.206	176.88
918.578	118.63
918.951	123.48
919.323	118.63
919.695	118.63
920.067	191.45
920.44	145.33
920.812	145.33
921.184	150.18
921.556	201.16
921.928	121.06
922.3	130.77
922.672	169.6
923.043	172.03
923.415	104.07
923.787	74.94
924.158	174.46
924.53	111.35
924.901	196.3
925.273	159.89
925.644	155.04
926.016	116.2
926.387	167.17
926.758	84.65
927.129	96.79
927.5	140.48
927.872	130.77
928.243	189.02
928.613	140.48
928.984	169.6
929.355	128.34
929.726	164.75
930.097	189.02
930.467	96.79
930.838	179.31
931.209	145.33
931.579	162.32
931.95	147.76
932.32	162.32
932.69	181.74
933.061	152.61
933.431	128.34
933.801	130.77
934.171	123.48
934.541	179.31
934.911	167.17
935.281	140.48
935.651	155.04
936.021	196.3
936.391	203.58
936.761	179.31
937.13	99.21
937.5	130.77
937.87	162.32
938.239	232.71
938.609	157.47
938.978	159.89
939.347	179.31
939.717	138.05
940.086	133.19
940.455	181.74
940.824	87.08
941.193	125.91
941.562	147.76
941.931	140.48
942.3	181.74
942.669	174.46
943.038	138.05
943.407	135.62
943.775	99.21
944.144	174.46
944.513	184.17
944.881	96.79
945.25	172.03
945.618	116.2
945.986	174.46
946.355	210.86
946.723	145.33
947.091	130.77
947.459	159.89
947.827	142.9
948.195	155.04
948.563	155.04
948.931	155.04
949.299	152.61
949.667	159.89
950.035	184.17
950.402	150.18
950.77	65.23
951.138	189.02
951.505	184.17
951.873	159.89
952.24	140.48
952.607	108.92
952.975	128.34
953.342	128.34
953.709	130.77
954.076	150.18
954.443	121.06
954.81	113.78
955.177	155.04
955.544	70.09
955.911	162.32
956.278	130.77
956.645	169.6
957.012	84.65
957.378	157.47
957.745	89.5
958.111	196.3
958.478	206.01
958.844	125.91
959.211	167.17
959.577	147.76
959.943	179.31
960.309	142.9
960.675	184.17
961.042	113.78
961.408	176.88
961.774	169.6
962.139	138.05
962.505	179.31
962.871	184.17
963.237	116.2
963.603	162.32
963.968	152.61
964.334	186.59
964.699	169.6
965.065	172.03
965.43	167.17
965.796	152.61
966.161	123.48
966.526	145.33
966.891	123.48
967.256	155.04
967.622	157.47
967.987	174.46
968.352	186.59
968.716	145.33
969.081	208.44
969.446	121.06
969.811	96.79
970.176	210.86
970.54	152.61
970.905	135.62
971.269	87.08
971.634	140.48
971.998	111.35
972.363	167.17
972.727	167.17
973.091	174.46
973.455	191.45
973.819	147.76
974.183	135.62
974.547	113.78
974.911	145.33
975.275	191.45
975.639	145.33
976.003	191.45
976.367	142.9
976.73	77.37
977.094	130.77
977.458	116.2
977.821	108.92
978.185	99.21
978.548	89.5
978.911	133.19
979.275	106.49
979.638	96.79
980.001	77.37
980.364	157.47
980.727	150.18
981.09	189.02
981.453	140.48
981.816	111.35
982.179	223
982.542	186.59
982.905	172.03
983.267	167.17
983.63	174.46
983.992	191.45
984.355	135.62
984.717	176.88
985.08	150.18
985.442	140.48
985.804	147.76
986.167	261.84
986.529	201.16
986.891	203.58
987.253	189.02
987.615	215.72
987.977	162.32
988.339	169.6
988.701	116.2
989.062	172.03
989.424	147.76
989.786	142.9
990.147	113.78
990.509	167.17
990.87	206.01
991.232	203.58
991.593	169.6
991.955	169.6
992.316	142.9
992.677	193.87
993.038	142.9
993.399	133.19
993.76	157.47
994.121	133.19
994.482	215.72
994.843	106.49
995.204	150.18
995.565	130.77
995.926	155.04
996.286	169.6
996.647	79.79
997.007	169.6
997.368	99.21
997.728	133.19
998.089	108.92
998.449	174.46
998.809	191.45
999.169	157.47
999.53	172.03
999.89	157.47
1000.25	121.06
1000.61	206.01
1000.97	140.48
1001.329	186.59
1001.689	142.9
1002.049	96.79
1002.409	172.03
1002.768	140.48
1003.128	159.89
1003.487	179.31
1003.847	135.62
1004.206	145.33
1004.566	176.88
1004.925	140.48
1005.284	203.58
1005.643	104.07
1006.003	191.45
1006.362	230.28
1006.721	184.17
1007.08	198.73
1007.438	145.33
1007.797	140.48
1008.156	142.9
1008.515	203.58
1008.874	152.61
1009.232	113.78
1009.591	121.06
1009.949	150.18
1010.308	198.73
1010.666	155.04
1011.024	193.87
1011.383	116.2
1011.741	179.31
1012.099	235.14
1012.457	111.35
1012.815	111.35
1013.173	123.48
1013.531	104.07
1013.889	159.89
1014.247	145.33
1014.605	130.77
1014.962	130.77
1015.32	189.02
1015.678	99.21
1016.035	184.17
1016.393	128.34
1016.75	176.88
1017.107	135.62
1017.465	150.18
1017.822	94.36
1018.179	150.18
1018.536	157.47
1018.894	208.44
1019.251	249.7
1019.608	123.48
1019.964	94.36
1020.321	118.63
1020.678	147.76
1021.035	206.01
1021.392	138.05
1021.748	203.58
1022.105	99.21
1022.461	133.19
1022.818	152.61
1023.174	145.33
1023.531	186.59
1023.887	157.47
1024.243	179.31
1024.599	113.78
1024.955	147.76
1025.311	167.17
1025.667	84.65
1026.023	111.35
1026.379	130.77
1026.735	167.17
1027.091	67.66
1027.447	172.03
