189.514	38.38
189.973	38.38
190.431	38.38
190.889	-0.46
191.348	-17.45
191.806	35.95
192.264	-10.16
192.722	50.52
193.18	-7.74
193.638	-63.56
194.096	-39.29
194.554	-5.31
195.012	-68.42
195.47	-36.86
195.928	6.83
196.385	23.82
196.843	-12.59
197.301	45.66
197.758	43.23
198.216	6.83
198.674	16.54
199.131	50.52
199.589	79.64
200.046	43.23
200.503	77.22
200.961	123.33
201.418	91.78
201.875	84.5
202.332	120.91
202.79	91.78
203.247	96.63
203.704	135.47
204.161	82.07
204.618	120.91
205.075	89.35
205.532	133.04
205.989	103.92
206.445	123.33
206.902	174.3
207.359	118.48
207.816	152.46
208.272	179.16
208.729	128.19
209.185	118.48
209.642	208.29
210.098	162.17
210.555	184.01
211.011	101.49
211.467	162.17
211.924	152.46
212.38	140.32
212.836	174.3
213.292	174.3
213.748	106.34
214.204	128.19
214.66	196.15
215.116	116.05
215.572	162.17
216.028	167.02
216.484	164.6
216.94	225.28
217.396	154.89
217.851	191.3
218.307	171.88
218.763	150.03
219.218	142.75
219.674	106.34
220.129	89.35
220.585	150.03
221.04	120.91
221.496	128.19
221.951	201
222.406	94.21
222.861	169.45
223.317	125.76
223.772	116.05
224.227	147.61
224.682	150.03
225.137	157.31
225.592	145.18
226.047	128.19
226.502	171.88
226.957	147.61
227.411	113.62
227.866	128.19
228.321	203.43
228.776	203.43
229.23	130.61
229.685	99.06
230.139	137.9
230.594	130.61
231.048	176.73
231.503	106.34
231.957	108.77
232.411	125.76
232.865	179.16
233.32	176.73
233.774	164.6
234.228	188.87
234.682	91.78
235.136	116.05
235.59	120.91
236.044	179.16
236.498	154.89
236.952	106.34
237.406	135.47
237.86	50.52
238.313	130.61
238.767	225.28
239.221	142.75
239.674	140.32
240.128	142.75
240.581	171.88
241.035	133.04
241.488	198.58
241.942	150.03
242.395	101.49
242.848	135.47
243.301	113.62
243.755	184.01
244.208	140.32
244.661	145.18
245.114	181.59
245.567	101.49
246.02	176.73
246.473	188.87
246.926	159.74
247.379	159.74
247.832	196.15
248.284	179.16
248.737	101.49
249.19	164.6
249.642	84.5
250.095	140.32
250.547	171.88
251	137.9
251.452	159.74
251.905	159.74
252.357	113.62
252.81	147.61
253.262	116.05
253.714	203.43
254.166	167.02
254.618	145.18
255.07	118.48
255.523	123.33
255.975	147.61
256.427	176.73
256.878	162.17
257.33	152.46
257.782	203.43
258.234	157.31
258.686	135.47
259.137	205.86
259.589	147.61
260.041	142.75
260.492	167.02
260.944	101.49
261.395	125.76
261.847	169.45
262.298	147.61
262.749	169.45
263.201	120.91
263.652	120.91
264.103	111.2
264.554	108.77
265.005	118.48
265.457	213.14
265.908	135.47
266.359	103.92
266.809	222.85
267.26	171.88
267.711	208.29
268.162	137.9
268.613	89.35
269.064	106.34
269.514	101.49
269.965	169.45
270.415	133.04
270.866	162.17
271.316	133.04
271.767	196.15
272.217	108.77
272.668	164.6
273.118	147.61
273.568	152.46
274.019	164.6
274.469	125.76
274.919	201
275.369	137.9
275.819	179.16
276.269	128.19
276.719	60.23
277.169	150.03
277.619	142.75
278.069	147.61
278.518	171.88
278.968	120.91
279.418	184.01
279.867	142.75
280.317	179.16
280.767	171.88
281.216	118.48
281.666	74.79
282.115	152.46
282.564	203.43
283.014	96.63
283.463	157.31
283.912	137.9
284.361	181.59
284.811	106.34
285.26	186.44
285.709	145.18
286.158	130.61
286.607	273.82
287.056	179.16
287.505	176.73
287.953	184.01
288.402	164.6
288.851	137.9
289.3	157.31
289.748	186.44
290.197	111.2
290.646	154.89
291.094	120.91
291.543	128.19
291.991	162.17
292.439	128.19
292.888	159.74
293.336	169.45
293.784	193.72
294.233	205.86
294.681	86.92
295.129	225.28
295.577	222.85
296.025	103.92
296.473	217.99
296.921	247.12
297.369	99.06
297.817	208.29
298.264	198.58
298.712	171.88
299.16	86.92
299.608	234.99
300.055	222.85
300.503	152.46
300.95	239.84
301.398	137.9
301.845	118.48
302.293	135.47
302.74	142.75
303.187	203.43
303.635	217.99
304.082	205.86
304.529	133.04
304.976	198.58
305.423	91.78
305.87	89.35
306.317	99.06
306.764	142.75
307.211	210.71
307.658	234.99
308.105	130.61
308.552	162.17
308.998	150.03
309.445	84.5
309.892	142.75
310.338	142.75
310.785	208.29
311.231	179.16
311.678	215.57
312.124	91.78
312.571	227.7
313.017	171.88
313.463	111.2
313.909	118.48
314.356	179.16
314.802	137.9
315.248	142.75
315.694	159.74
316.14	193.72
316.586	157.31
317.032	145.18
317.478	179.16
317.923	152.46
318.369	145.18
318.815	196.15
319.261	120.91
319.706	89.35
320.152	113.62
320.597	181.59
321.043	111.2
321.488	120.91
321.934	150.03
322.379	196.15
322.824	193.72
323.27	174.3
323.715	111.2
324.16	111.2
324.605	150.03
325.05	108.77
325.495	147.61
325.94	154.89
326.385	130.61
326.83	188.87
327.275	133.04
327.72	193.72
328.165	162.17
328.61	225.28
329.054	116.05
329.499	118.48
329.943	191.3
330.388	232.56
330.832	167.02
331.277	94.21
331.721	150.03
332.166	164.6
332.61	150.03
333.054	137.9
333.499	174.3
333.943	179.16
334.387	251.98
334.831	123.33
335.275	174.3
335.719	222.85
336.163	133.04
336.607	130.61
337.051	164.6
337.495	130.61
337.938	140.32
338.382	62.65
338.826	150.03
339.269	106.34
339.713	79.64
340.157	118.48
340.6	167.02
341.044	220.42
341.487	188.87
341.93	174.3
342.374	198.58
342.817	154.89
343.26	205.86
343.703	213.14
344.146	181.59
344.59	159.74
345.033	140.32
345.476	130.61
345.919	135.47
346.361	103.92
346.804	159.74
347.247	157.31
347.69	184.01
348.133	152.46
348.575	118.48
349.018	106.34
349.461	176.73
349.903	184.01
350.346	145.18
350.788	145.18
351.23	125.76
351.673	150.03
352.115	205.86
352.557	176.73
353	210.71
353.442	256.83
353.884	179.16
354.326	174.3
354.768	133.04
355.21	162.17
355.652	125.76
356.094	171.88
356.536	157.31
356.978	186.44
357.419	154.89
357.861	186.44
358.303	205.86
358.744	130.61
359.186	215.57
359.627	164.6
360.069	60.23
360.51	142.75
360.952	222.85
361.393	196.15
361.834	154.89
362.276	79.64
362.717	193.72
363.158	150.03
363.599	167.02
364.04	157.31
364.481	106.34
364.922	157.31
365.363	116.05
365.804	181.59
366.245	174.3
366.686	101.49
367.126	137.9
367.567	167.02
368.008	167.02
368.448	108.77
368.889	184.01
369.33	140.32
369.77	264.11
370.21	154.89
370.651	159.74
371.091	152.46
371.531	130.61
371.972	208.29
372.412	162.17
372.852	116.05
373.292	120.91
373.732	120.91
374.172	120.91
374.612	162.17
375.052	186.44
375.492	123.33
375.932	193.72
376.372	140.32
376.811	210.71
377.251	181.59
377.691	142.75
378.13	181.59
378.57	208.29
379.009	133.04
379.449	128.19
379.888	94.21
380.328	164.6
380.767	167.02
381.206	154.89
381.645	135.47
382.085	74.79
382.524	239.84
382.963	205.86
383.402	133.04
383.841	159.74
384.28	167.02
384.719	152.46
385.158	167.02
385.596	123.33
386.035	130.61
386.474	135.47
386.913	184.01
387.351	145.18
387.79	213.14
388.228	208.29
388.667	125.76
389.105	157.31
389.544	111.2
389.982	162.17
390.42	147.61
390.859	164.6
391.297	99.06
391.735	152.46
392.173	162.17
392.611	145.18
393.049	181.59
393.487	145.18
393.925	96.63
394.363	230.13
394.801	179.16
395.239	123.33
395.676	130.61
396.114	128.19
396.552	174.3
396.989	108.77
397.427	135.47
397.864	111.2
398.302	99.06
398.739	128.19
399.177	123.33
399.614	171.88
400.051	159.74
400.488	152.46
400.926	181.59
401.363	96.63
401.8	128.19
402.237	164.6
402.674	65.08
403.111	79.64
403.548	145.18
403.985	103.92
404.421	128.19
404.858	196.15
405.295	186.44
405.732	133.04
406.168	164.6
406.605	130.61
407.041	184.01
407.478	147.61
407.914	120.91
408.351	57.8
408.787	193.72
409.223	84.5
409.66	123.33
410.096	186.44
410.532	176.73
410.968	167.02
411.404	147.61
411.84	193.72
412.276	128.19
412.712	186.44
413.148	193.72
413.584	101.49
414.02	152.46
414.455	120.91
414.891	169.45
415.327	108.77
415.762	140.32
416.198	137.9
416.633	201
417.069	152.46
417.504	164.6
417.94	174.3
418.375	179.16
418.81	162.17
419.245	164.6
419.681	191.3
420.116	232.56
420.551	128.19
420.986	213.14
421.421	167.02
421.856	188.87
422.291	159.74
422.726	142.75
423.16	130.61
423.595	232.56
424.03	145.18
424.464	169.45
424.899	157.31
425.334	96.63
425.768	137.9
426.203	181.59
426.637	179.16
427.071	203.43
427.506	198.58
427.94	96.63
428.374	179.16
428.809	188.87
429.243	159.74
429.677	215.57
430.111	193.72
430.545	179.16
430.979	174.3
431.413	147.61
431.847	174.3
432.28	118.48
432.714	133.04
433.148	174.3
433.582	108.77
434.015	106.34
434.449	184.01
434.882	159.74
435.316	179.16
435.749	120.91
436.183	193.72
436.616	254.4
437.049	171.88
437.483	191.3
437.916	94.21
438.349	198.58
438.782	186.44
439.215	128.19
439.648	67.51
440.081	147.61
440.514	150.03
440.947	128.19
441.38	162.17
441.813	201
442.245	179.16
442.678	198.58
443.111	167.02
443.543	154.89
443.976	142.75
444.408	150.03
444.841	167.02
445.273	128.19
445.705	167.02
446.138	164.6
446.57	130.61
447.002	213.14
447.434	215.57
447.867	137.9
448.299	157.31
448.731	159.74
449.163	171.88
449.595	159.74
450.026	169.45
450.458	145.18
450.89	184.01
451.322	152.46
451.754	150.03
452.185	108.77
452.617	227.7
453.048	152.46
453.48	150.03
453.911	259.26
454.343	179.16
454.774	196.15
455.205	176.73
455.637	203.43
456.068	157.31
456.499	188.87
456.93	176.73
457.361	135.47
457.792	215.57
458.223	198.58
458.654	169.45
459.085	196.15
459.516	230.13
459.947	208.29
460.378	171.88
460.808	77.22
461.239	140.32
461.669	140.32
462.1	213.14
462.531	169.45
462.961	176.73
463.391	154.89
463.822	179.16
464.252	174.3
464.682	237.41
465.113	140.32
465.543	116.05
465.973	225.28
466.403	181.59
466.833	203.43
467.263	142.75
467.693	191.3
468.123	154.89
468.553	147.61
468.983	242.27
469.412	191.3
469.842	111.2
470.272	176.73
470.701	186.44
471.131	152.46
471.56	118.48
471.99	162.17
472.419	154.89
472.849	193.72
473.278	191.3
473.707	162.17
474.136	152.46
474.566	210.71
474.995	116.05
475.424	203.43
475.853	150.03
476.282	133.04
476.711	91.78
477.14	152.46
477.569	181.59
477.997	210.71
478.426	171.88
478.855	162.17
479.283	169.45
479.712	186.44
480.141	184.01
480.569	208.29
480.998	130.61
481.426	169.45
481.854	140.32
482.283	186.44
482.711	142.75
483.139	174.3
483.567	220.42
483.995	159.74
484.424	205.86
484.852	140.32
485.28	108.77
485.708	201
486.135	213.14
486.563	217.99
486.991	116.05
487.419	101.49
487.847	196.15
488.274	259.26
488.702	137.9
489.129	174.3
489.557	125.76
489.984	239.84
490.412	111.2
490.839	120.91
491.266	215.57
491.694	196.15
492.121	101.49
492.548	232.56
492.975	225.28
493.402	237.41
493.829	213.14
494.256	171.88
494.683	171.88
495.11	169.45
495.537	213.14
495.964	157.31
496.39	133.04
496.817	116.05
497.244	205.86
497.67	237.41
498.097	201
498.523	125.76
498.95	162.17
499.376	99.06
499.803	142.75
500.229	188.87
500.655	128.19
501.081	188.87
501.508	210.71
501.934	184.01
502.36	159.74
502.786	137.9
503.212	125.76
503.638	176.73
504.064	169.45
504.489	205.86
504.915	154.89
505.341	147.61
505.767	162.17
506.192	140.32
506.618	99.06
507.043	137.9
507.469	142.75
507.894	176.73
508.32	147.61
508.745	169.45
509.17	193.72
509.596	171.88
510.021	171.88
510.446	196.15
510.871	154.89
511.296	152.46
511.721	191.3
512.146	140.32
512.571	181.59
512.996	208.29
513.421	106.34
513.845	181.59
514.27	176.73
514.695	174.3
515.119	171.88
515.544	176.73
515.969	150.03
516.393	174.3
516.817	145.18
517.242	208.29
517.666	150.03
518.09	128.19
518.515	130.61
518.939	116.05
519.363	319.94
519.787	154.89
520.211	130.61
520.635	152.46
521.059	154.89
521.483	164.6
521.907	188.87
522.331	96.63
522.754	205.86
523.178	128.19
523.602	159.74
524.025	142.75
524.449	101.49
524.872	147.61
525.296	140.32
525.719	176.73
526.143	167.02
526.566	135.47
526.989	196.15
527.412	140.32
527.836	215.57
528.259	184.01
528.682	179.16
529.105	198.58
529.528	191.3
529.951	171.88
530.374	38.38
530.796	140.32
531.219	169.45
531.642	120.91
532.065	130.61
532.487	84.5
532.91	230.13
533.332	120.91
533.755	188.87
534.177	123.33
534.6	137.9
535.022	203.43
535.444	176.73
535.867	176.73
536.289	154.89
536.711	150.03
537.133	91.78
537.555	232.56
537.977	203.43
538.399	179.16
538.821	181.59
539.243	295.67
539.665	135.47
540.086	193.72
540.508	169.45
540.93	167.02
541.351	133.04
541.773	135.47
542.195	232.56
542.616	196.15
543.037	159.74
543.459	201
543.88	84.5
544.301	186.44
544.723	225.28
545.144	157.31
545.565	210.71
545.986	159.74
546.407	222.85
546.828	145.18
547.249	157.31
547.67	147.61
548.091	171.88
548.512	205.86
548.932	188.87
549.353	186.44
549.774	171.88
550.194	167.02
550.615	108.77
551.035	123.33
551.456	169.45
551.876	167.02
552.296	140.32
552.717	191.3
553.137	193.72
553.557	171.88
553.977	147.61
554.397	176.73
554.817	118.48
555.237	147.61
555.657	167.02
556.077	103.92
556.497	184.01
556.917	208.29
557.337	150.03
557.756	191.3
558.176	154.89
558.596	174.3
559.015	179.16
559.435	167.02
559.854	147.61
560.274	191.3
560.693	179.16
561.112	174.3
561.532	232.56
561.951	188.87
562.37	150.03
562.789	169.45
563.208	91.78
563.627	135.47
564.046	135.47
564.465	203.43
564.884	116.05
565.303	137.9
565.722	188.87
566.14	125.76
566.559	164.6
566.978	247.12
567.396	150.03
567.815	191.3
568.233	220.42
568.652	196.15
569.07	179.16
569.489	150.03
569.907	220.42
570.325	89.35
570.743	159.74
571.161	111.2
571.58	157.31
571.998	222.85
572.416	191.3
572.833	208.29
573.251	186.44
573.669	116.05
574.087	273.82
574.505	201
574.922	232.56
575.34	171.88
575.758	213.14
576.175	113.62
576.593	118.48
577.01	154.89
577.428	167.02
577.845	1472.87
578.262	317.51
578.68	162.17
579.097	96.63
579.514	128.19
579.931	193.72
580.348	62.65
580.765	171.88
581.182	147.61
581.599	133.04
582.016	198.58
582.433	125.76
582.849	215.57
583.266	147.61
583.683	215.57
584.099	162.17
584.516	130.61
584.933	125.76
585.349	101.49
585.765	171.88
586.182	159.74
586.598	154.89
587.014	116.05
587.431	188.87
587.847	140.32
588.263	152.46
588.679	135.47
589.095	167.02
589.511	150.03
589.927	196.15
590.343	225.28
590.759	128.19
591.174	237.41
591.59	106.34
592.006	142.75
592.421	227.7
592.837	186.44
593.252	140.32
593.668	135.47
594.083	174.3
594.499	176.73
594.914	140.32
595.329	234.99
595.745	133.04
596.16	179.16
596.575	174.3
596.99	174.3
597.405	188.87
597.82	174.3
598.235	118.48
598.65	188.87
599.065	140.32
599.479	147.61
599.894	147.61
600.309	52.94
600.724	222.85
601.138	232.56
601.553	251.98
601.967	176.73
602.382	125.76
602.796	203.43
603.21	169.45
603.625	135.47
604.039	154.89
604.453	179.16
604.867	167.02
605.281	135.47
605.695	128.19
606.109	174.3
606.523	157.31
606.937	184.01
607.351	295.67
607.765	179.16
608.178	103.92
608.592	188.87
609.006	174.3
609.419	152.46
609.833	154.89
610.246	154.89
610.66	152.46
611.073	123.33
611.487	125.76
611.9	193.72
612.313	203.43
612.726	145.18
613.139	198.58
613.553	159.74
613.966	179.16
614.379	181.59
614.792	184.01
615.204	261.68
615.617	120.91
616.03	111.2
616.443	159.74
616.856	232.56
617.268	154.89
617.681	137.9
618.093	169.45
618.506	162.17
618.918	108.77
619.331	176.73
619.743	186.44
620.155	137.9
620.568	133.04
620.98	188.87
621.392	137.9
621.804	205.86
622.216	179.16
622.628	169.45
623.04	162.17
623.452	137.9
623.864	159.74
624.276	196.15
624.687	247.12
625.099	140.32
625.511	140.32
625.922	150.03
626.334	179.16
626.745	171.88
627.157	140.32
627.568	171.88
627.979	171.88
628.391	244.69
628.802	193.72
629.213	198.58
629.624	150.03
630.035	179.16
630.446	135.47
630.857	162.17
631.268	106.34
631.679	157.31
632.09	128.19
632.501	133.04
632.912	152.46
633.322	205.86
633.733	118.48
634.144	154.89
634.554	234.99
634.965	113.62
635.375	135.47
635.785	184.01
636.196	181.59
636.606	145.18
637.016	150.03
637.427	176.73
637.837	179.16
638.247	188.87
638.657	140.32
639.067	96.63
639.477	179.16
639.887	171.88
640.297	179.16
640.706	147.61
641.116	133.04
641.526	196.15
641.935	145.18
642.345	91.78
642.755	125.76
643.164	188.87
643.573	103.92
643.983	179.16
644.392	147.61
644.801	154.89
645.211	142.75
645.62	145.18
646.029	176.73
646.438	106.34
646.847	217.99
647.256	106.34
647.665	135.47
648.074	133.04
648.483	116.05
648.892	157.31
649.3	176.73
649.709	123.33
650.118	147.61
650.526	106.34
650.935	135.47
651.343	186.44
651.752	215.57
652.16	125.76
652.568	135.47
652.977	116.05
653.385	-0.46
653.793	208.29
654.201	164.6
654.609	162.17
655.017	133.04
655.425	120.91
655.833	217.99
656.241	123.33
656.649	174.3
657.057	201
657.464	193.72
657.872	159.74
658.28	164.6
658.687	210.71
659.095	86.92
659.502	101.49
659.91	123.33
660.317	193.72
660.724	147.61
661.132	86.92
661.539	179.16
661.946	142.75
662.353	118.48
662.76	154.89
663.167	198.58
663.574	191.3
663.981	101.49
664.388	123.33
664.795	145.18
665.202	203.43
665.608	179.16
666.015	106.34
666.422	111.2
666.828	157.31
667.235	125.76
667.641	188.87
668.047	147.61
668.454	91.78
668.86	142.75
669.266	111.2
669.673	196.15
670.079	120.91
670.485	198.58
670.891	152.46
671.297	174.3
671.703	169.45
672.109	101.49
672.515	150.03
672.92	157.31
673.326	217.99
673.732	167.02
674.138	150.03
674.543	159.74
674.949	174.3
675.354	164.6
675.76	91.78
676.165	150.03
676.57	99.06
676.976	133.04
677.381	152.46
677.786	162.17
678.191	125.76
678.596	128.19
679.001	203.43
679.406	137.9
679.811	130.61
680.216	225.28
680.621	232.56
681.026	128.19
681.43	140.32
681.835	128.19
682.24	167.02
682.644	96.63
683.049	215.57
683.453	198.58
683.858	86.92
684.262	116.05
684.667	210.71
685.071	174.3
685.475	140.32
685.879	125.76
686.283	176.73
686.687	188.87
687.091	237.41
687.495	145.18
687.899	174.3
688.303	118.48
688.707	176.73
689.111	174.3
689.514	174.3
689.918	133.04
690.322	179.16
690.725	188.87
691.129	186.44
691.532	174.3
691.936	150.03
692.339	128.19
692.742	164.6
693.146	128.19
693.549	208.29
693.952	159.74
694.355	242.27
694.758	167.02
695.161	176.73
695.564	198.58
695.967	125.76
696.37	120.91
696.773	130.61
697.175	232.56
697.578	220.42
697.981	162.17
698.383	157.31
698.786	234.99
699.188	150.03
699.591	169.45
699.993	176.73
700.395	145.18
700.798	142.75
701.2	179.16
701.602	179.16
702.004	205.86
702.406	150.03
702.808	176.73
703.21	135.47
703.612	242.27
704.014	278.68
704.416	201
704.818	176.73
705.219	159.74
705.621	234.99
706.023	230.13
706.424	198.58
706.826	232.56
707.227	220.42
707.629	193.72
708.03	259.26
708.431	181.59
708.832	208.29
709.234	232.56
709.635	266.54
710.036	220.42
710.437	273.82
710.838	220.42
711.239	261.68
711.64	213.14
712.041	201
712.441	222.85
712.842	227.7
713.243	283.53
713.643	225.28
714.044	285.96
714.445	283.53
714.845	344.21
715.246	266.54
715.646	201
716.046	283.53
716.447	332.07
716.847	315.08
717.247	293.24
717.647	327.22
718.047	283.53
718.447	283.53
718.847	385.47
719.247	370.91
719.647	319.94
720.047	349.06
720.446	412.17
720.846	363.63
721.246	395.18
721.645	346.64
722.045	436.44
722.444	451.01
722.844	383.05
723.243	451.01
723.643	395.18
724.042	375.76
724.441	431.59
724.84	392.75
725.24	424.31
725.639	460.72
726.038	448.58
726.437	465.57
726.836	494.7
727.234	528.68
727.633	545.67
728.032	533.53
728.431	501.98
728.83	545.67
729.228	584.51
729.627	681.59
730.025	667.03
730.424	691.3
730.822	756.84
731.22	742.27
731.619	696.16
732.017	754.41
732.415	844.22
732.813	861.21
733.212	917.03
733.61	953.44
734.008	1120.92
734.406	1167.04
734.803	1164.61
735.201	1220.44
735.599	1271.41
735.997	1397.62
736.395	1487.43
736.792	1620.93
737.19	1705.88
737.587	1705.88
737.985	1727.73
738.382	1802.97
738.78	1936.47
739.177	1844.23
739.574	2135.5
739.971	2159.77
740.369	2244.73
740.766	2533.56
741.163	2436.48
741.56	2555.41
741.957	2647.64
742.354	2657.35
742.751	2812.7
743.147	2994.74
743.544	3196.2
743.941	3239.89
744.338	3336.98
744.734	3608.82
745.131	3759.31
745.527	3938.93
745.924	4215.63
746.32	4409.81
746.716	4436.51
747.113	4688.94
747.509	5040.89
747.905	5089.43
748.301	5446.23
748.697	5783.62
749.093	5963.23
749.489	5958.38
749.885	6361.29
750.281	6812.76
750.677	7077.32
751.073	7293.35
751.468	7545.78
751.864	7989.96
752.26	8045.79
752.655	8242.39
753.051	8807.93
753.446	9021.53
753.842	9361.34
754.237	9521.54
754.632	10004.55
755.028	10193.88
755.423	10213.3
755.818	10422.04
756.213	10856.51
756.608	11060.4
757.003	11193.89
757.398	11608.95
757.793	11574.97
758.188	11264.28
758.583	12196.34
758.977	12167.21
759.372	12820.13
759.767	13487.62
760.161	14174.52
760.556	14698.8
760.95	15043.47
761.345	15842.02
761.739	16832.33
762.133	16854.18
762.527	17842.06
762.922	18303.23
763.316	18795.95
763.71	18791.1
764.104	19735.29
764.498	20203.74
764.892	20652.78
765.286	21373.66
765.68	21812.99
766.073	22147.95
766.467	22376.11
766.861	23252.33
767.255	24065.45
767.648	24356.72
768.042	24796.05
768.435	25305.76
768.829	25817.91
769.222	25740.24
769.615	27048.51
770.008	26482.97
770.402	26868.89
770.795	27007.25
771.188	28145.61
771.581	27305.79
771.974	26970.84
772.367	27359.19
772.76	27002.39
773.153	26606.75
773.545	27677.16
773.938	27919.88
774.331	28242.7
774.724	28546.11
775.116	29402.91
775.509	30274.29
775.901	31655.38
776.294	32235.48
776.686	32230.63
777.078	33356.86
777.471	34230.66
777.863	35456.41
778.255	36327.78
778.647	36917.59
779.039	38070.53
779.431	37308.38
779.823	37182.16
780.215	38109.36
780.607	38254.99
780.999	38614.22
781.39	38628.79
781.782	39463.75
782.174	39063.26
782.565	39582.68
782.957	40009.88
783.348	40490.47
783.74	40211.34
784.131	39869.1
784.522	41228.34
784.914	39738.03
785.305	39849.68
785.696	39878.81
786.087	39752.59
786.478	38223.44
786.869	37143.33
787.26	37509.84
787.651	36412.73
788.042	34810.77
788.433	34815.62
788.823	34463.67
789.214	34004.93
789.605	33155.4
789.995	33031.61
790.386	31551.01
790.776	31174.79
791.167	31713.63
791.557	32558.3
791.948	32097.13
792.338	32616.56
792.728	34075.32
793.118	34247.65
793.508	33956.38
793.898	34386
794.288	34191.82
794.678	33643.27
795.068	34140.85
795.458	34182.12
795.848	34240.37
796.238	34109.3
796.627	33519.48
797.017	33587.45
797.406	33791.33
797.796	32657.82
798.185	33429.68
798.575	34077.74
798.964	33757.35
799.354	33453.95
799.743	34203.96
800.132	33635.99
800.521	33487.93
800.91	33881.14
801.299	33757.35
801.688	33366.57
802.077	32298.59
802.466	33024.33
802.855	32691.8
803.244	31577.71
803.633	31034.01
804.021	30834.98
804.41	29793.7
804.799	29373.79
805.187	28199.01
805.576	28300.96
805.964	27225.7
806.352	26060.63
806.741	26839.77
807.129	26291.22
807.517	25662.57
807.905	25701.4
808.293	26063.06
808.681	25764.51
809.069	25053.33
809.457	26065.48
809.845	26553.36
810.233	25839.75
810.621	26084.9
811.009	26223.25
811.396	26507.24
811.784	25861.6
812.171	25742.66
812.559	25856.74
812.946	25245.08
813.334	24330.02
813.721	24024.19
814.108	24092.15
814.496	23514.47
814.883	22970.78
815.27	23541.17
815.657	23446.51
816.044	23397.97
816.431	22883.4
816.818	23242.62
817.205	23145.54
817.592	22558.15
817.979	21225.6
818.365	21402.79
818.752	21128.51
819.139	19895.49
819.525	19213.44
819.912	19795.97
820.298	19655.19
820.685	18482.84
821.071	17693.99
821.457	17596.91
821.843	16808.06
822.23	15749.79
822.616	15626
823.002	15210.95
823.388	14562.88
823.774	14031.32
824.16	13647.82
824.546	13230.33
824.931	13048.29
825.317	12159.93
825.703	12278.86
826.089	12519.16
826.474	12045.85
826.86	11725.46
827.245	11890.51
827.631	12004.59
828.016	11247.29
828.401	10892.92
828.787	10773.98
829.172	11009.42
829.557	10273.98
829.942	10089.51
830.327	9739.99
830.712	9708.43
831.097	9147.75
831.482	9256.97
831.867	8989.98
832.252	8892.89
832.636	8465.7
833.021	8159.87
833.406	8407.44
833.79	8169.57
834.175	7764.23
834.559	7725.39
834.944	7511.8
835.328	7392.86
835.713	7004.51
836.097	6771.49
836.481	6742.37
836.865	6533.63
837.249	6108.86
837.633	5892.84
838.017	6104.01
838.401	5761.77
838.785	5322.44
839.169	5290.89
839.553	5009.33
839.937	4866.13
840.32	4742.34
840.704	4397.67
841.087	4286.02
841.471	4040.87
841.854	3972.91
842.238	3798.15
842.621	3805.43
843.004	3810.28
843.388	3468.05
843.771	3603.97
844.154	3528.73
844.537	3387.95
844.92	3390.37
845.303	3218.04
845.686	3349.11
846.069	3191.34
846.452	3094.25
846.834	2866.09
847.217	2946.19
847.6	2870.95
847.982	2832.11
848.365	2679.2
848.748	2713.18
849.13	2657.35
849.512	2446.18
849.895	2351.52
850.277	2470.46
850.659	2322.4
851.041	2419.49
851.423	2278.71
851.806	2227.73
852.188	2084.53
852.57	2065.11
852.951	2079.67
853.333	1985.01
853.715	2035.98
854.097	1963.17
854.479	1951.03
854.86	1725.3
855.242	1827.24
855.623	1657.34
856.005	1611.22
856.386	1472.87
856.768	1499.57
857.149	1482.58
857.53	1434.03
857.911	1400.05
858.292	1283.55
858.674	1346.65
859.055	1242.28
859.436	1099.08
859.817	1152.48
860.197	1159.76
860.578	1106.36
860.959	970.43
861.34	1062.67
861.72	1040.82
862.101	1021.41
862.482	936.45
862.862	861.21
863.243	902.47
863.623	885.48
864.003	841.79
864.384	870.92
864.764	798.1
865.144	798.1
865.524	662.18
865.904	744.7
866.284	703.44
866.664	693.73
867.044	771.4
867.424	635.48
867.804	625.77
868.183	679.17
868.563	589.36
868.943	611.2
869.322	489.84
869.702	620.91
870.081	582.08
870.461	538.39
870.84	484.99
871.22	509.26
871.599	501.98
871.978	533.53
872.357	448.58
872.736	436.44
873.115	434.02
873.494	363.63
873.873	463.14
874.252	385.47
874.631	373.34
875.01	312.66
875.388	281.1
875.767	319.94
876.146	368.48
876.524	417.03
876.903	397.61
877.281	346.64
877.66	278.68
878.038	288.38
878.416	380.62
878.794	259.26
879.173	244.69
879.551	244.69
879.929	273.82
880.307	324.79
880.685	201
881.063	271.39
881.441	215.57
881.818	293.24
882.196	349.06
882.574	227.7
882.951	278.68
883.329	261.68
883.707	319.94
884.084	302.95
884.461	215.57
884.839	215.57
885.216	210.71
885.593	302.95
885.971	179.16
886.348	191.3
886.725	208.29
887.102	220.42
887.479	196.15
887.856	208.29
888.233	198.58
888.609	244.69
888.986	220.42
889.363	188.87
889.74	154.89
890.116	227.7
890.493	203.43
890.869	193.72
891.246	169.45
891.622	130.61
891.998	147.61
892.375	210.71
892.751	193.72
893.127	186.44
893.503	186.44
893.879	157.31
894.255	230.13
894.631	268.97
895.007	164.6
895.383	203.43
895.759	181.59
896.134	210.71
896.51	261.68
896.886	118.48
897.261	137.9
897.637	264.11
898.012	164.6
898.388	140.32
898.763	159.74
899.138	116.05
899.514	118.48
899.889	164.6
900.264	191.3
900.639	222.85
901.014	186.44
901.389	154.89
901.764	157.31
902.139	135.47
902.513	193.72
902.888	150.03
903.263	205.86
903.638	91.78
904.012	152.46
904.387	220.42
904.761	193.72
905.136	154.89
905.51	50.52
905.884	140.32
906.259	55.37
906.633	55.37
907.007	150.03
907.381	210.71
907.755	133.04
908.129	145.18
908.503	227.7
908.877	174.3
909.251	103.92
909.624	176.73
909.998	147.61
910.372	125.76
910.745	89.35
911.119	133.04
911.492	147.61
911.866	125.76
912.239	164.6
912.612	150.03
912.986	120.91
913.359	193.72
913.732	145.18
914.105	162.17
914.478	137.9
914.851	184.01
915.224	162.17
915.597	113.62
915.97	188.87
916.343	176.73
916.715	145.18
917.088	116.05
917.461	186.44
917.833	113.62
918.206	154.89
918.578	147.61
918.951	188.87
919.323	167.02
919.695	116.05
920.067	171.88
920.44	176.73
920.812	103.92
921.184	179.16
921.556	140.32
921.928	118.48
922.3	116.05
922.672	234.99
923.043	128.19
923.415	171.88
923.787	171.88
924.158	130.61
924.53	145.18
924.901	154.89
925.273	142.75
925.644	86.92
926.016	116.05
926.387	181.59
926.758	179.16
927.129	133.04
927.5	103.92
927.872	198.58
928.243	120.91
928.613	154.89
928.984	167.02
929.355	113.62
929.726	86.92
930.097	140.32
930.467	142.75
930.838	133.04
931.209	167.02
931.579	123.33
931.95	184.01
932.32	116.05
932.69	164.6
933.061	150.03
933.431	162.17
933.801	103.92
934.171	125.76
934.541	184.01
934.911	208.29
935.281	179.16
935.651	184.01
936.021	118.48
936.391	128.19
936.761	169.45
937.13	120.91
937.5	77.22
937.87	164.6
938.239	157.31
938.609	157.31
938.978	125.76
939.347	125.76
939.717	125.76
940.086	188.87
940.455	179.16
940.824	164.6
941.193	174.3
941.562	198.58
941.931	120.91
942.3	125.76
942.669	130.61
943.038	147.61
943.407	147.61
943.775	142.75
944.144	191.3
944.513	184.01
944.881	120.91
945.25	147.61
945.618	145.18
945.986	184.01
946.355	167.02
946.723	142.75
947.091	137.9
947.459	113.62
947.827	162.17
948.195	191.3
948.563	118.48
948.931	101.49
949.299	174.3
949.667	150.03
950.035	89.35
950.402	181.59
950.77	179.16
951.138	106.34
951.505	176.73
951.873	67.51
952.24	201
952.607	135.47
952.975	196.15
953.342	159.74
953.709	147.61
954.076	150.03
954.443	164.6
954.81	239.84
955.177	150.03
955.544	140.32
955.911	79.64
956.278	128.19
956.645	130.61
957.012	130.61
957.378	167.02
957.745	74.79
958.111	116.05
958.478	145.18
958.844	184.01
959.211	162.17
959.577	135.47
959.943	135.47
960.309	171.88
960.675	215.57
961.042	130.61
961.408	164.6
961.774	198.58
962.139	108.77
962.505	137.9
962.871	113.62
963.237	140.32
963.603	106.34
963.968	191.3
964.334	154.89
964.699	91.78
965.065	167.02
965.43	251.98
965.796	145.18
966.161	171.88
966.526	125.76
966.891	150.03
967.256	108.77
967.622	247.12
967.987	125.76
968.352	157.31
968.716	140.32
969.081	181.59
969.446	120.91
969.811	103.92
970.176	176.73
970.54	162.17
970.905	106.34
971.269	118.48
971.634	167.02
971.998	186.44
972.363	147.61
972.727	169.45
973.091	82.07
973.455	208.29
973.819	159.74
974.183	65.08
974.547	137.9
974.911	198.58
975.275	234.99
975.639	152.46
976.003	118.48
976.367	99.06
976.73	137.9
977.094	137.9
977.458	128.19
977.821	171.88
978.185	162.17
978.548	179.16
978.911	157.31
979.275	169.45
979.638	147.61
980.001	111.2
980.364	140.32
980.727	147.61
981.09	125.76
981.453	135.47
981.816	159.74
982.179	123.33
982.542	164.6
982.905	169.45
983.267	169.45
983.63	176.73
983.992	125.76
984.355	159.74
984.717	193.72
985.08	125.76
985.442	91.78
985.804	191.3
986.167	191.3
986.529	133.04
986.891	123.33
987.253	147.61
987.615	176.73
987.977	111.2
988.339	125.76
988.701	91.78
989.062	125.76
989.424	171.88
989.786	145.18
990.147	79.64
990.509	198.58
990.87	179.16
991.232	186.44
991.593	179.16
991.955	167.02
992.316	118.48
992.677	140.32
993.038	147.61
993.399	157.31
993.76	213.14
994.121	193.72
994.482	106.34
994.843	184.01
995.204	125.76
995.565	125.76
995.926	113.62
996.286	208.29
996.647	96.63
997.007	108.77
997.368	137.9
997.728	198.58
998.089	171.88
998.449	186.44
998.809	176.73
999.169	120.91
999.53	179.16
999.89	89.35
1000.25	74.79
1000.61	254.4
1000.97	147.61
1001.329	135.47
1001.689	103.92
1002.049	169.45
1002.409	101.49
1002.768	154.89
1003.128	162.17
1003.487	150.03
1003.847	123.33
1004.206	203.43
1004.566	133.04
1004.925	116.05
1005.284	169.45
1005.643	147.61
1006.003	135.47
1006.362	181.59
1006.721	96.63
1007.08	101.49
1007.438	179.16
1007.797	113.62
1008.156	123.33
1008.515	152.46
1008.874	217.99
1009.232	123.33
1009.591	179.16
1009.949	210.71
1010.308	196.15
1010.666	167.02
1011.024	111.2
1011.383	69.93
1011.741	137.9
1012.099	150.03
1012.457	169.45
1012.815	174.3
1013.173	103.92
1013.531	84.5
1013.889	213.14
1014.247	137.9
1014.605	94.21
1014.962	130.61
1015.32	74.79
1015.678	225.28
1016.035	157.31
1016.393	67.51
1016.75	181.59
1017.107	128.19
1017.465	154.89
1017.822	86.92
1018.179	181.59
1018.536	142.75
1018.894	120.91
1019.251	159.74
1019.608	125.76
1019.964	116.05
1020.321	169.45
1020.678	125.76
1021.035	123.33
1021.392	86.92
1021.748	101.49
1022.105	169.45
1022.461	125.76
1022.818	176.73
1023.174	169.45
1023.531	179.16
1023.887	150.03
1024.243	57.8
1024.599	120.91
1024.955	123.33
1025.311	79.64
1025.667	150.03
1026.023	159.74
1026.379	169.45
1026.735	152.46
1027.091	171.88
1027.447	184.01
