189.514	79.95
189.973	79.95
190.431	79.95
190.889	11.98
191.348	-58.41
191.806	-17.14
192.264	14.41
192.722	-26.85
193.18	-46.27
193.638	-128.79
194.096	-0.15
194.554	28.97
195.012	2.28
195.47	-2.58
195.928	-2.58
196.385	53.25
196.843	-34.13
197.301	-31.71
197.758	60.53
198.216	43.54
198.674	65.38
199.131	4.7
199.589	-14.72
200.046	96.94
200.503	4.7
200.961	19.27
201.418	72.66
201.875	82.37
202.332	99.36
202.79	172.18
203.247	58.1
203.704	87.23
204.161	96.94
204.618	50.82
205.075	21.69
205.532	128.49
205.989	67.81
206.445	92.08
206.902	123.64
207.359	184.32
207.816	133.35
208.272	145.48
208.729	133.35
209.185	164.9
209.642	177.04
210.098	191.6
210.555	172.18
211.011	111.5
211.467	189.17
211.924	111.5
212.38	96.94
212.836	213.44
213.292	155.19
213.748	135.77
214.204	167.33
214.66	75.09
215.116	111.5
215.572	150.34
216.028	184.32
216.484	118.78
216.94	155.19
217.396	177.04
217.851	145.48
218.307	92.08
218.763	189.17
219.218	143.05
219.674	94.51
220.129	121.21
220.585	106.65
221.04	169.75
221.496	164.9
221.951	164.9
222.406	133.35
222.861	164.9
223.317	172.18
223.772	143.05
224.227	113.93
224.682	104.22
225.137	116.35
225.592	82.37
226.047	133.35
226.502	155.19
226.957	111.5
227.411	123.64
227.866	104.22
228.321	109.07
228.776	135.77
229.23	113.93
229.685	106.65
230.139	150.34
230.594	121.21
231.048	160.04
231.503	179.46
231.957	116.35
232.411	174.61
232.865	167.33
233.32	184.32
233.774	164.9
234.228	147.91
234.682	208.59
235.136	99.36
235.59	58.1
236.044	116.35
236.498	106.65
236.952	128.49
237.406	184.32
237.86	84.8
238.313	215.87
238.767	150.34
239.221	99.36
239.674	111.5
240.128	128.49
240.581	167.33
241.035	242.57
241.488	128.49
241.942	84.8
242.395	123.64
242.848	121.21
243.301	121.21
243.755	215.87
244.208	143.05
244.661	174.61
245.114	106.65
245.567	92.08
246.02	162.47
246.473	106.65
246.926	75.09
247.379	189.17
247.832	121.21
248.284	152.76
248.737	133.35
249.19	160.04
249.642	140.63
250.095	196.45
250.547	169.75
251	230.43
251.452	155.19
251.905	99.36
252.357	123.64
252.81	150.34
253.262	135.77
253.714	150.34
254.166	152.76
254.618	58.1
255.07	116.35
255.523	116.35
255.975	143.05
256.427	130.92
256.878	121.21
257.33	99.36
257.782	109.07
258.234	174.61
258.686	152.76
259.137	140.63
259.589	77.52
260.041	77.52
260.492	126.06
260.944	109.07
261.395	152.76
261.847	150.34
262.298	179.46
262.749	162.47
263.201	126.06
263.652	143.05
264.103	118.78
264.554	140.63
265.005	189.17
265.457	174.61
265.908	133.35
266.359	155.19
266.809	157.62
267.26	155.19
267.711	113.93
268.162	94.51
268.613	145.48
269.064	203.73
269.514	113.93
269.965	143.05
270.415	203.73
270.866	126.06
271.316	116.35
271.767	116.35
272.217	172.18
272.668	186.74
273.118	72.66
273.568	186.74
274.019	101.79
274.469	145.48
274.919	143.05
275.369	72.66
275.819	162.47
276.269	164.9
276.719	167.33
277.169	133.35
277.619	208.59
278.069	206.16
278.518	177.04
278.968	121.21
279.418	126.06
279.867	116.35
280.317	157.62
280.767	104.22
281.216	179.46
281.666	147.91
282.115	157.62
282.564	96.94
283.014	130.92
283.463	228.01
283.912	138.2
284.361	254.71
284.811	130.92
285.26	218.3
285.709	65.38
286.158	157.62
286.607	96.94
287.056	130.92
287.505	147.91
287.953	118.78
288.402	179.46
288.851	126.06
289.3	94.51
289.748	135.77
290.197	145.48
290.646	177.04
291.094	157.62
291.543	140.63
291.991	191.6
292.439	225.58
292.888	208.59
293.336	106.65
293.784	145.48
294.233	150.34
294.681	174.61
295.129	94.51
295.577	194.03
296.025	89.66
296.473	167.33
296.921	186.74
297.369	135.77
297.817	111.5
298.264	206.16
298.712	87.23
299.16	128.49
299.608	140.63
300.055	130.92
300.503	138.2
300.95	164.9
301.398	186.74
301.845	181.89
302.293	101.79
302.74	111.5
303.187	130.92
303.635	152.76
304.082	160.04
304.529	213.44
304.976	186.74
305.423	196.45
305.87	191.6
306.317	152.76
306.764	121.21
307.211	147.91
307.658	128.49
308.105	106.65
308.552	96.94
308.998	72.66
309.445	133.35
309.892	162.47
310.338	172.18
310.785	138.2
311.231	121.21
311.678	133.35
312.124	70.24
312.571	89.66
313.017	167.33
313.463	162.47
313.909	133.35
314.356	196.45
314.802	155.19
315.248	135.77
315.694	157.62
316.14	198.88
316.586	109.07
317.032	113.93
317.478	138.2
317.923	203.73
318.369	111.5
318.815	189.17
319.261	109.07
319.706	96.94
320.152	99.36
320.597	138.2
321.043	140.63
321.488	128.49
321.934	82.37
322.379	196.45
322.824	133.35
323.27	123.64
323.715	116.35
324.16	184.32
324.605	101.79
325.05	186.74
325.495	140.63
325.94	194.03
326.385	140.63
326.83	123.64
327.275	223.15
327.72	155.19
328.165	181.89
328.61	123.64
329.054	89.66
329.499	65.38
329.943	198.88
330.388	133.35
330.832	160.04
331.277	215.87
331.721	215.87
332.166	191.6
332.61	118.78
333.054	126.06
333.499	169.75
333.943	181.89
334.387	164.9
334.831	186.74
335.275	191.6
335.719	138.2
336.163	130.92
336.607	140.63
337.051	172.18
337.495	155.19
337.938	118.78
338.382	123.64
338.826	160.04
339.269	111.5
339.713	160.04
340.157	75.09
340.6	189.17
341.044	237.72
341.487	135.77
341.93	89.66
342.374	145.48
342.817	198.88
343.26	111.5
343.703	157.62
344.146	174.61
344.59	99.36
345.033	177.04
345.476	164.9
345.919	155.19
346.361	75.09
346.804	99.36
347.247	172.18
347.69	169.75
348.133	162.47
348.575	99.36
349.018	206.16
349.461	75.09
349.903	160.04
350.346	128.49
350.788	164.9
351.23	128.49
351.673	191.6
352.115	133.35
352.557	113.93
353	130.92
353.442	113.93
353.884	152.76
354.326	167.33
354.768	99.36
355.21	111.5
355.652	162.47
356.094	138.2
356.536	126.06
356.978	130.92
357.419	167.33
357.861	135.77
358.303	215.87
358.744	140.63
359.186	109.07
359.627	106.65
360.069	150.34
360.51	126.06
360.952	201.31
361.393	174.61
361.834	133.35
362.276	167.33
362.717	121.21
363.158	133.35
363.599	194.03
364.04	113.93
364.481	201.31
364.922	167.33
365.363	140.63
365.804	104.22
366.245	155.19
366.686	181.89
367.126	101.79
367.567	116.35
368.008	160.04
368.448	106.65
368.889	177.04
369.33	138.2
369.77	118.78
370.21	126.06
370.651	145.48
371.091	99.36
371.531	140.63
371.972	123.64
372.412	138.2
372.852	72.66
373.292	147.91
373.732	177.04
374.172	111.5
374.612	157.62
375.052	177.04
375.492	186.74
375.932	164.9
376.372	155.19
376.811	143.05
377.251	160.04
377.691	228.01
378.13	138.2
378.57	121.21
379.009	147.91
379.449	111.5
379.888	143.05
380.328	118.78
380.767	84.8
381.206	191.6
381.645	206.16
382.085	121.21
382.524	128.49
382.963	101.79
383.402	106.65
383.841	206.16
384.28	196.45
384.719	150.34
385.158	167.33
385.596	150.34
386.035	138.2
386.474	184.32
386.913	169.75
387.351	174.61
387.79	172.18
388.228	130.92
388.667	169.75
389.105	116.35
389.544	84.8
389.982	223.15
390.42	230.43
390.859	177.04
391.297	106.65
391.735	218.3
392.173	99.36
392.611	118.78
393.049	130.92
393.487	138.2
393.925	123.64
394.363	121.21
394.801	162.47
395.239	118.78
395.676	157.62
396.114	55.67
396.552	138.2
396.989	89.66
397.427	126.06
397.864	162.47
398.302	167.33
398.739	135.77
399.177	135.77
399.614	133.35
400.051	121.21
400.488	196.45
400.926	164.9
401.363	189.17
401.8	111.5
402.237	186.74
402.674	101.79
403.111	235.29
403.548	135.77
403.985	189.17
404.421	177.04
404.858	126.06
405.295	135.77
405.732	111.5
406.168	140.63
406.605	96.94
407.041	140.63
407.478	140.63
407.914	135.77
408.351	145.48
408.787	184.32
409.223	140.63
409.66	128.49
410.096	128.49
410.532	194.03
410.968	206.16
411.404	130.92
411.84	184.32
412.276	160.04
412.712	109.07
413.148	150.34
413.584	138.2
414.02	152.76
414.455	147.91
414.891	133.35
415.327	130.92
415.762	113.93
416.198	84.8
416.633	157.62
417.069	198.88
417.504	140.63
417.94	174.61
418.375	130.92
418.81	101.79
419.245	111.5
419.681	133.35
420.116	152.76
420.551	160.04
420.986	104.22
421.421	169.75
421.856	111.5
422.291	104.22
422.726	128.49
423.16	143.05
423.595	181.89
424.03	130.92
424.464	155.19
424.899	138.2
425.334	215.87
425.768	155.19
426.203	189.17
426.637	174.61
427.071	194.03
427.506	121.21
427.94	121.21
428.374	152.76
428.809	196.45
429.243	133.35
429.677	143.05
430.111	116.35
430.545	116.35
430.979	249.85
431.413	133.35
431.847	157.62
432.28	138.2
432.714	167.33
433.148	160.04
433.582	128.49
434.015	123.64
434.449	164.9
434.882	230.43
435.316	162.47
435.749	208.59
436.183	184.32
436.616	160.04
437.049	181.89
437.483	126.06
437.916	152.76
438.349	208.59
438.782	186.74
439.215	162.47
439.648	194.03
440.081	215.87
440.514	189.17
440.947	138.2
441.38	203.73
441.813	283.83
442.245	208.59
442.678	109.07
443.111	247.42
443.543	179.46
443.976	203.73
444.408	203.73
444.841	181.89
445.273	208.59
445.705	235.29
446.138	206.16
446.57	215.87
447.002	249.85
447.434	215.87
447.867	245
448.299	325.1
448.731	266.84
449.163	269.27
449.595	213.44
450.026	247.42
450.458	228.01
450.89	252.28
451.322	327.52
451.754	208.59
452.185	264.42
452.617	315.39
453.048	293.54
453.48	240.14
453.911	383.35
454.343	283.83
454.774	339.66
455.205	247.42
455.637	315.39
456.068	266.84
456.499	356.65
456.93	327.52
457.361	334.8
457.792	349.37
458.223	303.25
458.654	339.66
459.085	300.82
459.516	274.12
459.947	283.83
460.378	295.97
460.808	298.4
461.239	261.99
461.669	293.54
462.1	281.41
462.531	257.13
462.961	349.37
463.391	247.42
463.822	300.82
464.252	249.85
464.682	245
465.113	198.88
465.543	291.11
465.973	315.39
466.403	247.42
466.833	315.39
467.263	247.42
467.693	286.26
468.123	286.26
468.553	247.42
468.983	230.43
469.412	288.69
469.842	252.28
470.272	286.26
470.701	215.87
471.131	269.27
471.56	181.89
471.99	254.71
472.419	184.32
472.849	293.54
473.278	162.47
473.707	225.58
474.136	276.55
474.566	291.11
474.995	198.88
475.424	247.42
475.853	261.99
476.282	245
476.711	232.86
477.14	208.59
477.569	225.58
477.997	201.31
478.426	252.28
478.855	245
479.283	213.44
479.712	194.03
480.141	179.46
480.569	254.71
480.998	237.72
481.426	215.87
481.854	140.63
482.283	228.01
482.711	201.31
483.139	240.14
483.567	225.58
483.995	179.46
484.424	206.16
484.852	201.31
485.28	252.28
485.708	164.9
486.135	169.75
486.563	147.91
486.991	232.86
487.419	179.46
487.847	172.18
488.274	240.14
488.702	211.02
489.129	198.88
489.557	235.29
489.984	179.46
490.412	169.75
490.839	203.73
491.266	152.76
491.694	220.73
492.121	235.29
492.548	247.42
492.975	143.05
493.402	208.59
493.829	225.58
494.256	186.74
494.683	223.15
495.11	150.34
495.537	206.16
495.964	223.15
496.39	206.16
496.817	196.45
497.244	198.88
497.67	157.62
498.097	155.19
498.523	181.89
498.95	201.31
499.376	150.34
499.803	177.04
500.229	140.63
500.655	230.43
501.081	203.73
501.508	162.47
501.934	184.32
502.36	169.75
502.786	196.45
503.212	128.49
503.638	145.48
504.064	123.64
504.489	150.34
504.915	157.62
505.341	196.45
505.767	201.31
506.192	186.74
506.618	155.19
507.043	116.35
507.469	145.48
507.894	177.04
508.32	203.73
508.745	179.46
509.17	147.91
509.596	198.88
510.021	228.01
510.446	162.47
510.871	174.61
511.296	181.89
511.721	104.22
512.146	179.46
512.571	162.47
512.996	213.44
513.421	215.87
513.845	96.94
514.27	194.03
514.695	99.36
515.119	147.91
515.544	162.47
515.969	162.47
516.393	186.74
516.817	113.93
517.242	228.01
517.666	225.58
518.09	172.18
518.515	126.06
518.939	201.31
519.363	397.91
519.787	198.88
520.211	223.15
520.635	198.88
521.059	162.47
521.483	237.72
521.907	223.15
522.331	181.89
522.754	218.3
523.178	201.31
523.602	130.92
524.025	198.88
524.449	266.84
524.872	101.79
525.296	184.32
525.719	162.47
526.143	211.02
526.566	186.74
526.989	184.32
527.412	266.84
527.836	206.16
528.259	254.71
528.682	242.57
529.105	201.31
529.528	169.75
529.951	157.62
530.374	211.02
530.796	249.85
531.219	186.74
531.642	179.46
532.065	276.55
532.487	169.75
532.91	230.43
533.332	208.59
533.755	206.16
534.177	147.91
534.6	203.73
535.022	208.59
535.444	228.01
535.867	174.61
536.289	186.74
536.711	208.59
537.133	220.73
537.555	201.31
537.977	220.73
538.399	213.44
538.821	196.45
539.243	252.28
539.665	215.87
540.086	225.58
540.508	218.3
540.93	228.01
541.351	101.79
541.773	196.45
542.195	162.47
542.616	169.75
543.037	240.14
543.459	213.44
543.88	218.3
544.301	223.15
544.723	223.15
545.144	228.01
545.565	276.55
545.986	218.3
546.407	208.59
546.828	152.76
547.249	196.45
547.67	179.46
548.091	186.74
548.512	206.16
548.932	198.88
549.353	261.99
549.774	242.57
550.194	213.44
550.615	213.44
551.035	172.18
551.456	237.72
551.876	143.05
552.296	189.17
552.717	194.03
553.137	189.17
553.557	225.58
553.977	220.73
554.397	208.59
554.817	167.33
555.237	254.71
555.657	213.44
556.077	191.6
556.497	160.04
556.917	257.13
557.337	189.17
557.756	257.13
558.176	213.44
558.596	157.62
559.015	181.89
559.435	249.85
559.854	181.89
560.274	189.17
560.693	196.45
561.112	247.42
561.532	198.88
561.951	101.79
562.37	223.15
562.789	181.89
563.208	174.61
563.627	230.43
564.046	220.73
564.465	206.16
564.884	133.35
565.303	247.42
565.722	177.04
566.14	225.58
566.559	172.18
566.978	228.01
567.396	186.74
567.815	261.99
568.233	230.43
568.652	252.28
569.07	211.02
569.489	194.03
569.907	128.49
570.325	201.31
570.743	128.49
571.161	135.77
571.58	167.33
571.998	206.16
572.416	143.05
572.833	215.87
573.251	143.05
573.669	213.44
574.087	230.43
574.505	206.16
574.922	109.07
575.34	198.88
575.758	203.73
576.175	223.15
576.593	223.15
577.01	116.35
577.428	218.3
577.845	1832.4
578.262	322.67
578.68	232.86
579.097	92.08
579.514	179.46
579.931	203.73
580.348	181.89
580.765	140.63
581.182	174.61
581.599	155.19
582.016	242.57
582.433	160.04
582.849	145.48
583.266	167.33
583.683	196.45
584.099	181.89
584.516	186.74
584.933	201.31
585.349	184.32
585.765	198.88
586.182	184.32
586.598	194.03
587.014	252.28
587.431	145.48
587.847	113.93
588.263	186.74
588.679	164.9
589.095	145.48
589.511	194.03
589.927	164.9
590.343	143.05
590.759	203.73
591.174	203.73
591.59	152.76
592.006	177.04
592.421	194.03
592.837	150.34
593.252	232.86
593.668	169.75
594.083	157.62
594.499	213.44
594.914	138.2
595.329	138.2
595.745	152.76
596.16	130.92
596.575	225.58
596.99	181.89
597.405	191.6
597.82	150.34
598.235	203.73
598.65	344.51
599.065	194.03
599.479	208.59
599.894	172.18
600.309	79.95
600.724	245
601.138	257.13
601.553	203.73
601.967	189.17
602.382	225.58
602.796	167.33
603.21	218.3
603.625	228.01
604.039	196.45
604.453	201.31
604.867	208.59
605.281	152.76
605.695	157.62
606.109	225.58
606.523	109.07
606.937	152.76
607.351	283.83
607.765	232.86
608.178	155.19
608.592	121.21
609.006	201.31
609.419	196.45
609.833	157.62
610.246	130.92
610.66	225.58
611.073	160.04
611.487	157.62
611.9	194.03
612.313	167.33
612.726	206.16
613.139	147.91
613.553	160.04
613.966	201.31
614.379	174.61
614.792	211.02
615.204	184.32
615.617	89.66
616.03	128.49
616.443	162.47
616.856	186.74
617.268	116.35
617.681	79.95
618.093	128.49
618.506	198.88
618.918	126.06
619.331	109.07
619.743	126.06
620.155	189.17
620.568	157.62
620.98	203.73
621.392	169.75
621.804	242.57
622.216	196.45
622.628	145.48
623.04	179.46
623.452	109.07
623.864	174.61
624.276	179.46
624.687	206.16
625.099	167.33
625.511	179.46
625.922	157.62
626.334	155.19
626.745	189.17
627.157	218.3
627.568	198.88
627.979	174.61
628.391	121.21
628.802	121.21
629.213	128.49
629.624	184.32
630.035	140.63
630.446	138.2
630.857	123.64
631.268	147.91
631.679	232.86
632.09	206.16
632.501	172.18
632.912	220.73
633.322	259.56
633.733	203.73
634.144	184.32
634.554	157.62
634.965	172.18
635.375	121.21
635.785	75.09
636.196	191.6
636.606	123.64
637.016	157.62
637.427	94.51
637.837	150.34
638.247	174.61
638.657	206.16
639.067	167.33
639.477	128.49
639.887	133.35
640.297	150.34
640.706	164.9
641.116	152.76
641.526	123.64
641.935	235.29
642.345	143.05
642.755	206.16
643.164	155.19
643.573	106.65
643.983	128.49
644.392	220.73
644.801	220.73
645.211	143.05
645.62	191.6
646.029	152.76
646.438	147.91
646.847	201.31
647.256	152.76
647.665	186.74
648.074	130.92
648.483	150.34
648.892	157.62
649.3	123.64
649.709	128.49
650.118	143.05
650.526	228.01
650.935	106.65
651.343	104.22
651.752	155.19
652.16	196.45
652.568	203.73
652.977	145.48
653.385	206.16
653.793	160.04
654.201	155.19
654.609	143.05
655.017	138.2
655.425	123.64
655.833	145.48
656.241	194.03
656.649	181.89
657.057	118.78
657.464	133.35
657.872	138.2
658.28	111.5
658.687	179.46
659.095	179.46
659.502	223.15
659.91	174.61
660.317	174.61
660.724	169.75
661.132	164.9
661.539	135.77
661.946	65.38
662.353	213.44
662.76	184.32
663.167	116.35
663.574	99.36
663.981	152.76
664.388	133.35
664.795	155.19
665.202	181.89
665.608	196.45
666.015	189.17
666.422	172.18
666.828	94.51
667.235	109.07
667.641	184.32
668.047	206.16
668.454	143.05
668.86	147.91
669.266	123.64
669.673	113.93
670.079	150.34
670.485	164.9
670.891	167.33
671.297	162.47
671.703	162.47
672.109	184.32
672.515	160.04
672.92	126.06
673.326	177.04
673.732	94.51
674.138	147.91
674.543	160.04
674.949	89.66
675.354	133.35
675.76	147.91
676.165	211.02
676.57	164.9
676.976	116.35
677.381	123.64
677.786	172.18
678.191	135.77
678.596	157.62
679.001	135.77
679.406	172.18
679.811	89.66
680.216	169.75
680.621	186.74
681.026	259.56
681.43	206.16
681.835	211.02
682.24	162.47
682.644	143.05
683.049	135.77
683.453	104.22
683.858	118.78
684.262	130.92
684.667	198.88
685.071	111.5
685.475	155.19
685.879	186.74
686.283	232.86
686.687	174.61
687.091	145.48
687.495	128.49
687.899	160.04
688.303	206.16
688.707	162.47
689.111	128.49
689.514	79.95
689.918	160.04
690.322	201.31
690.725	116.35
691.129	167.33
691.532	157.62
691.936	181.89
692.339	145.48
692.742	249.85
693.146	130.92
693.549	126.06
693.952	194.03
694.355	155.19
694.758	113.93
695.161	109.07
695.564	184.32
695.967	164.9
696.37	128.49
696.773	169.75
697.175	198.88
697.578	147.91
697.981	230.43
698.383	208.59
698.786	186.74
699.188	113.93
699.591	169.75
699.993	111.5
700.395	111.5
700.798	152.76
701.2	208.59
701.602	172.18
702.004	179.46
702.406	155.19
702.808	104.22
703.21	194.03
703.612	133.35
704.014	203.73
704.416	213.44
704.818	174.61
705.219	157.62
705.621	113.93
706.023	167.33
706.424	237.72
706.826	264.42
707.227	293.54
707.629	206.16
708.03	179.46
708.431	215.87
708.832	271.7
709.234	218.3
709.635	274.12
710.036	237.72
710.437	259.56
710.838	211.02
711.239	228.01
711.64	257.13
712.041	245
712.441	121.21
712.842	278.98
713.243	208.59
713.643	259.56
714.044	235.29
714.445	320.24
714.845	283.83
715.246	298.4
715.646	257.13
716.046	305.68
716.447	232.86
716.847	261.99
717.247	298.4
717.647	303.25
718.047	245
718.447	354.22
718.847	303.25
719.247	310.53
719.647	410.05
720.047	371.21
720.446	337.23
720.846	332.38
721.246	274.12
721.645	354.22
722.045	332.38
722.444	344.51
722.844	414.9
723.243	424.61
723.643	390.63
724.042	407.62
724.441	473.16
724.84	400.34
725.24	417.33
725.639	499.86
726.038	521.7
726.437	528.98
726.836	456.17
727.234	475.58
727.633	451.31
728.032	507.14
728.431	502.28
728.83	441.6
729.228	541.12
729.627	492.57
730.025	592.09
730.424	681.9
730.822	793.55
731.22	837.24
731.619	834.81
732.017	885.78
732.415	912.48
732.813	941.61
733.212	919.77
733.61	980.45
734.008	873.65
734.406	890.64
734.803	936.76
735.201	1036.27
735.599	1079.96
735.997	1262
736.395	1558.12
736.792	1866.38
737.19	2072.7
737.587	2118.81
737.985	2291.15
738.382	2279.01
738.78	2177.07
739.177	1995.02
739.574	1820.26
739.971	1706.19
740.369	1512.01
740.766	1579.97
741.163	1703.76
741.56	2019.3
741.957	2346.97
742.354	2902.81
742.751	3356.7
743.147	3936.8
743.544	4303.31
743.941	4478.07
744.338	4533.9
744.734	4276.61
745.131	3927.09
745.527	3524.17
745.924	3109.12
746.32	2628.53
746.716	2541.15
747.113	2805.72
747.509	3315.43
747.905	4087.29
748.301	5220.8
748.697	6473.25
749.093	7725.7
749.489	8441.73
749.885	9021.83
750.281	9429.61
750.677	8995.13
751.073	8155.31
751.468	7191.71
751.864	6029.07
752.26	5109.15
752.655	4723.22
753.051	4732.93
753.446	5543.62
753.842	6623.74
754.237	8461.14
754.632	10415.06
755.028	12589.85
755.423	14058.32
755.818	14784.06
756.213	15890.87
756.608	15220.96
757.003	14017.06
757.398	12473.34
757.793	10538.85
758.188	8541.24
758.583	7582.49
758.977	6769.37
759.372	7388.31
759.767	8531.53
760.161	11106.82
760.556	14046.18
760.95	17687.02
761.345	20512.3
761.739	23291.47
762.133	25073.05
762.527	25466.26
762.922	24543.92
763.316	22599.71
763.71	19725.88
764.104	16507.39
764.498	13992.78
764.892	12223.34
765.286	11762.17
765.68	12631.11
766.073	15138.43
766.467	18308.39
766.861	22905.54
767.255	27891.06
767.648	32281.9
768.042	34942.14
768.435	36497.99
768.829	36425.17
769.222	34206.69
769.615	31325.58
770.008	26806.09
770.402	22434.66
770.795	19085.1
771.188	16570.49
771.581	15703.98
771.974	16483.11
772.367	18543.83
772.76	22422.53
773.153	26616.77
773.545	31061.01
773.938	35808.66
774.331	38728.61
774.724	39947.07
775.116	40874.27
775.509	39602.41
775.901	36597.5
776.294	32044.04
776.686	26570.65
777.078	23267.2
777.471	20337.54
777.863	20255.02
778.255	21956.5
778.647	25116.74
779.039	30944.5
779.431	36471.29
779.823	42646.14
780.215	48170.5
780.607	51034.62
780.999	53765.25
781.39	52660.86
781.782	50537.04
782.174	46602.51
782.565	40658.25
782.957	34517.38
783.348	29051.27
783.74	25138.59
784.131	22599.71
784.522	23344.87
784.914	26090.06
785.305	30871.69
785.696	37476.16
786.087	43117.02
786.478	47262.72
786.869	49876.84
787.26	51209.38
787.651	50995.79
788.042	48340.41
788.433	43151
788.823	38330.54
789.214	31655.68
789.605	25723.55
789.995	21281.73
790.386	18915.19
790.776	18223.43
791.167	19708.89
791.557	23691.96
791.948	28553.69
792.338	33980.96
792.728	41051.46
793.118	45439.88
793.508	47794.28
793.898	48905.95
794.288	47706.9
794.678	44000.53
795.068	39633.96
795.458	33643.58
795.848	28551.26
796.238	23225.94
796.627	20077.83
797.017	19005
797.406	19791.42
797.796	22366.7
798.185	26412.88
798.575	32364.43
798.964	37672.76
799.354	42575.75
799.743	46473.87
800.132	47760.3
800.521	47240.87
800.91	46197.17
801.299	41784.48
801.688	36374.2
802.077	30641.1
802.466	25495.39
802.855	20733.18
803.244	17769.54
803.633	16456.41
804.021	17468.57
804.41	20097.25
804.799	23840.02
805.187	28267.28
805.576	31505.19
805.964	34801.36
806.352	36235.85
806.741	37883.93
807.129	36896.05
807.517	34740.68
807.905	31626.55
808.293	27286.68
808.681	22738.07
809.069	19014.71
809.457	16344.76
809.845	14252.5
810.233	14318.03
810.621	15298.63
811.009	18043.82
811.396	22097.28
811.784	26296.37
812.171	31145.96
812.559	33696.97
812.946	35874.19
813.334	36226.14
813.721	35417.87
814.108	32689.68
814.496	29291.57
814.883	24505.08
815.27	21005.03
815.657	17029.24
816.044	14369
816.431	12708.78
816.818	11796.15
817.205	12594.7
817.592	14822.89
817.979	17655.46
818.365	20789.01
818.752	23922.55
819.139	26138.6
819.525	28604.66
819.912	29060.98
820.298	28051.26
820.685	26369.19
821.071	22711.37
821.457	19718.6
821.843	15881.16
822.23	12803.45
822.616	10128.65
823.002	8293.67
823.388	7643.17
823.774	7572.78
824.16	8531.53
824.546	9888.35
824.931	11973.34
825.317	14223.37
825.703	16145.73
826.089	17111.76
826.474	17995.27
826.86	17973.43
827.245	17369.05
827.631	15419.99
828.016	13252.48
828.401	11126.23
828.787	9004.84
829.172	7281.51
829.557	6249.95
829.942	5395.56
830.327	5106.72
830.712	5679.55
831.097	6487.81
831.482	7847.06
831.867	9114.07
832.252	10322.82
832.636	11733.04
833.021	12257.32
833.406	12614.12
833.79	11936.93
834.175	11228.18
834.559	9618.93
834.944	8252.4
835.328	7021.8
835.713	5647.99
836.097	4342.15
836.481	3640.68
836.865	3220.77
837.249	3237.76
837.633	3645.54
838.017	4296.03
838.401	4965.94
838.785	5684.4
839.169	6453.83
839.553	6995.1
839.937	7152.87
840.32	7002.38
840.704	6592.18
841.087	5914.99
841.471	5111.58
841.854	4310.59
842.238	3482.91
842.621	2839.7
843.004	2172.21
843.388	1900.36
843.771	1781.43
844.154	1776.57
844.537	1973.18
844.92	2507.17
845.303	2948.92
845.686	3363.98
846.069	3791.17
846.452	4218.36
846.834	4368.85
847.217	4293.6
847.6	4072.73
847.982	3800.88
848.365	3417.38
848.748	2992.61
849.13	2317.85
849.512	1919.78
849.895	1604.24
850.277	1349.38
850.659	1135.79
851.041	1218.31
851.423	1388.22
851.806	1567.83
852.188	1897.94
852.57	2252.31
852.951	2601.83
853.333	2645.52
853.715	2834.84
854.097	2793.58
854.479	2611.54
854.86	2400.37
855.242	2228.04
855.623	1963.47
856.005	1512.01
856.386	1366.37
856.768	1101.81
857.149	837.24
857.53	834.81
857.911	759.57
858.292	759.57
858.674	917.34
859.055	1087.24
859.436	1104.23
859.817	1230.45
860.197	1310.55
860.578	1446.47
860.959	1473.17
861.34	1339.67
861.72	1271.71
862.101	1092.1
862.482	1019.28
862.862	863.94
863.243	798.4
863.623	691.61
864.003	575.1
864.384	555.68
864.764	528.98
865.144	475.58
865.524	558.11
865.904	526.56
866.284	638.21
866.664	730.44
867.044	737.72
867.424	754.71
867.804	919.77
868.183	846.95
868.563	827.53
868.943	681.9
869.322	740.15
869.702	604.23
870.081	611.51
870.461	545.97
870.84	410.05
871.22	349.37
871.599	361.5
871.978	349.37
872.357	317.81
872.736	405.19
873.115	361.5
873.494	444.03
873.873	429.47
874.252	400.34
874.631	414.9
875.01	444.03
875.388	417.33
875.767	431.89
876.146	402.77
876.524	366.36
876.903	385.78
877.281	274.12
877.66	288.69
878.038	339.66
878.416	240.14
878.794	237.72
879.173	237.72
879.551	206.16
879.929	266.84
880.307	252.28
880.685	264.42
881.063	286.26
881.441	245
881.818	274.12
882.196	220.73
882.574	257.13
882.951	298.4
883.329	288.69
883.707	245
884.084	213.44
884.461	232.86
884.839	186.74
885.216	237.72
885.593	230.43
885.971	150.34
886.348	155.19
886.725	189.17
887.102	130.92
887.479	150.34
887.856	203.73
888.233	189.17
888.609	240.14
888.986	140.63
889.363	184.32
889.74	218.3
890.116	252.28
890.493	264.42
890.869	201.31
891.246	242.57
891.622	264.42
891.998	198.88
892.375	211.02
892.751	249.85
893.127	157.62
893.503	198.88
893.879	164.9
894.255	223.15
894.631	147.91
895.007	140.63
895.383	213.44
895.759	228.01
896.134	140.63
896.51	155.19
896.886	155.19
897.261	152.76
897.637	191.6
898.012	130.92
898.388	179.46
898.763	169.75
899.138	150.34
899.514	160.04
899.889	130.92
900.264	179.46
900.639	189.17
901.014	126.06
901.389	164.9
901.764	135.77
902.139	138.2
902.513	194.03
902.888	128.49
903.263	118.78
903.638	123.64
904.012	164.9
904.387	152.76
904.761	128.49
905.136	184.32
905.51	179.46
905.884	194.03
906.259	121.21
906.633	140.63
907.007	101.79
907.381	164.9
907.755	177.04
908.129	133.35
908.503	126.06
908.877	143.05
909.251	101.79
909.624	84.8
909.998	106.65
910.372	31.4
910.745	164.9
911.119	147.91
911.492	123.64
911.866	121.21
912.239	150.34
912.612	181.89
912.986	179.46
913.359	143.05
913.732	118.78
914.105	113.93
914.478	116.35
914.851	143.05
915.224	101.79
915.597	126.06
915.97	147.91
916.343	186.74
916.715	118.78
917.088	133.35
917.461	179.46
917.833	169.75
918.206	118.78
918.578	96.94
918.951	213.44
919.323	126.06
919.695	138.2
920.067	189.17
920.44	172.18
920.812	196.45
921.184	82.37
921.556	179.46
921.928	189.17
922.3	128.49
922.672	101.79
923.043	128.49
923.415	111.5
923.787	177.04
924.158	169.75
924.53	113.93
924.901	157.62
925.273	109.07
925.644	53.25
926.016	162.47
926.387	138.2
926.758	145.48
927.129	160.04
927.5	150.34
927.872	160.04
928.243	194.03
928.613	106.65
928.984	113.93
929.355	89.66
929.726	123.64
930.097	72.66
930.467	150.34
930.838	191.6
931.209	82.37
931.579	198.88
931.95	96.94
932.32	155.19
932.69	174.61
933.061	138.2
933.431	194.03
933.801	138.2
934.171	169.75
934.541	162.47
934.911	89.66
935.281	157.62
935.651	140.63
936.021	172.18
936.391	138.2
936.761	128.49
937.13	106.65
937.5	70.24
937.87	116.35
938.239	109.07
938.609	157.62
938.978	196.45
939.347	194.03
939.717	99.36
940.086	123.64
940.455	138.2
940.824	157.62
941.193	133.35
941.562	160.04
941.931	140.63
942.3	145.48
942.669	89.66
943.038	174.61
943.407	135.77
943.775	135.77
944.144	189.17
944.513	191.6
944.881	167.33
945.25	126.06
945.618	109.07
945.986	87.23
946.355	208.59
946.723	164.9
947.091	99.36
947.459	135.77
947.827	101.79
948.195	169.75
948.563	126.06
948.931	128.49
949.299	75.09
949.667	96.94
950.035	84.8
950.402	113.93
950.77	130.92
951.138	101.79
951.505	145.48
951.873	118.78
952.24	101.79
952.607	126.06
952.975	169.75
953.342	111.5
953.709	167.33
954.076	169.75
954.443	126.06
954.81	133.35
955.177	96.94
955.544	152.76
955.911	106.65
956.278	104.22
956.645	104.22
957.012	184.32
957.378	128.49
957.745	169.75
958.111	58.1
958.478	116.35
958.844	133.35
959.211	67.81
959.577	126.06
959.943	152.76
960.309	164.9
960.675	118.78
961.042	101.79
961.408	152.76
961.774	104.22
962.139	111.5
962.505	126.06
962.871	123.64
963.237	99.36
963.603	157.62
963.968	116.35
964.334	145.48
964.699	87.23
965.065	126.06
965.43	135.77
965.796	157.62
966.161	145.48
966.526	133.35
966.891	130.92
967.256	130.92
967.622	138.2
967.987	138.2
968.352	179.46
968.716	196.45
969.081	111.5
969.446	111.5
969.811	126.06
970.176	160.04
970.54	150.34
970.905	135.77
971.269	123.64
971.634	152.76
971.998	157.62
972.363	147.91
972.727	152.76
973.091	169.75
973.455	104.22
973.819	128.49
974.183	96.94
974.547	138.2
974.911	140.63
975.275	174.61
975.639	126.06
976.003	140.63
976.367	89.66
976.73	106.65
977.094	164.9
977.458	235.29
977.821	92.08
978.185	126.06
978.548	169.75
978.911	84.8
979.275	194.03
979.638	79.95
980.001	147.91
980.364	126.06
980.727	145.48
981.09	225.58
981.453	133.35
981.816	147.91
982.179	157.62
982.542	140.63
982.905	92.08
983.267	135.77
983.63	167.33
983.992	181.89
984.355	145.48
984.717	135.77
985.08	162.47
985.442	84.8
985.804	157.62
986.167	177.04
986.529	77.52
986.891	150.34
987.253	123.64
987.615	133.35
987.977	133.35
988.339	123.64
988.701	143.05
989.062	186.74
989.424	155.19
989.786	99.36
990.147	128.49
990.509	113.93
990.87	181.89
991.232	106.65
991.593	82.37
991.955	169.75
992.316	133.35
992.677	96.94
993.038	130.92
993.399	104.22
993.76	116.35
994.121	174.61
994.482	87.23
994.843	135.77
995.204	181.89
995.565	101.79
995.926	82.37
996.286	84.8
996.647	155.19
997.007	138.2
997.368	111.5
997.728	218.3
998.089	133.35
998.449	118.78
998.809	133.35
999.169	135.77
999.53	140.63
999.89	111.5
1000.25	133.35
1000.61	157.62
1000.97	96.94
1001.329	147.91
1001.689	181.89
1002.049	128.49
1002.409	196.45
1002.768	140.63
1003.128	138.2
1003.487	135.77
1003.847	160.04
1004.206	50.82
1004.566	116.35
1004.925	89.66
1005.284	206.16
1005.643	126.06
1006.003	99.36
1006.362	172.18
1006.721	155.19
1007.08	138.2
1007.438	77.52
1007.797	106.65
1008.156	133.35
1008.515	157.62
1008.874	123.64
1009.232	123.64
1009.591	84.8
1009.949	106.65
1010.308	155.19
1010.666	184.32
1011.024	123.64
1011.383	123.64
1011.741	157.62
1012.099	101.79
1012.457	77.52
1012.815	79.95
1013.173	133.35
1013.531	94.51
1013.889	140.63
1014.247	167.33
1014.605	101.79
1014.962	62.96
1015.32	152.76
1015.678	128.49
1016.035	179.46
1016.393	169.75
1016.75	174.61
1017.107	126.06
1017.465	118.78
1017.822	157.62
1018.179	152.76
1018.536	62.96
1018.894	140.63
1019.251	111.5
1019.608	133.35
1019.964	203.73
1020.321	128.49
1020.678	145.48
1021.035	196.45
1021.392	145.48
1021.748	128.49
1022.105	109.07
1022.461	106.65
1022.818	196.45
1023.174	150.34
1023.531	147.91
1023.887	79.95
1024.243	140.63
1024.599	157.62
1024.955	135.77
1025.311	77.52
1025.667	130.92
1026.023	123.64
1026.379	101.79
1026.735	106.65
1027.091	172.18
1027.447	152.76
