189.514	91.17
189.973	91.17
190.431	91.17
190.889	45.06
191.348	-35.04
191.806	-35.04
192.264	47.48
192.722	-15.63
193.18	-32.62
193.638	-10.77
194.096	-8.34
194.554	1.37
195.012	-56.89
195.47	30.49
195.928	6.22
196.385	25.64
196.843	-27.76
197.301	-15.63
197.758	18.36
198.216	8.65
198.674	6.22
199.131	23.21
199.589	42.63
200.046	76.61
200.503	35.35
200.961	71.75
201.418	103.31
201.875	83.89
202.332	134.86
202.79	86.32
203.247	159.13
203.704	217.39
204.161	127.58
204.618	217.39
205.075	197.97
205.532	86.32
205.989	110.59
206.445	176.13
206.902	183.41
207.359	110.59
207.816	166.42
208.272	178.55
208.729	115.44
209.185	166.42
209.642	113.02
210.098	202.82
210.555	195.54
211.011	139.72
211.467	120.3
211.924	144.57
212.38	127.58
212.836	103.31
213.292	149.43
213.748	98.45
214.204	108.16
214.66	130.01
215.116	190.69
215.572	147
216.028	142.14
216.484	91.17
216.94	171.27
217.396	207.68
217.851	110.59
218.307	115.44
218.763	125.15
219.218	149.43
219.674	154.28
220.129	127.58
220.585	197.97
221.04	137.29
221.496	154.28
221.951	190.69
222.406	108.16
222.861	88.75
223.317	83.89
223.772	115.44
224.227	178.55
224.682	166.42
225.137	47.48
225.592	105.74
226.047	142.14
226.502	127.58
226.957	147
227.411	110.59
227.866	122.73
228.321	166.42
228.776	180.98
229.23	137.29
229.685	130.01
230.139	113.02
230.594	137.29
231.048	210.11
231.503	93.6
231.957	166.42
232.411	120.3
232.865	79.04
233.32	132.44
233.774	79.04
234.228	163.99
234.682	185.83
235.136	154.28
235.59	149.43
236.044	137.29
236.498	113.02
236.952	103.31
237.406	168.84
237.86	127.58
238.313	137.29
238.767	120.3
239.221	117.87
239.674	125.15
240.128	108.16
240.581	171.27
241.035	149.43
241.488	207.68
241.942	117.87
242.395	79.04
242.848	130.01
243.301	134.86
243.755	120.3
244.208	188.26
244.661	151.85
245.114	159.13
245.567	91.17
246.02	127.58
246.473	66.9
246.926	207.68
247.379	168.84
247.832	210.11
248.284	74.18
248.737	176.13
249.19	176.13
249.642	154.28
250.095	103.31
250.547	100.88
251	137.29
251.452	149.43
251.905	163.99
252.357	227.1
252.81	193.12
253.262	171.27
253.714	108.16
254.166	161.56
254.618	139.72
255.07	115.44
255.523	147
255.975	103.31
256.427	163.99
256.878	142.14
257.33	86.32
257.782	156.71
258.234	142.14
258.686	173.7
259.137	125.15
259.589	120.3
260.041	147
260.492	134.86
260.944	185.83
261.395	159.13
261.847	144.57
262.298	163.99
262.749	168.84
263.201	125.15
263.652	151.85
264.103	100.88
264.554	178.55
265.005	137.29
265.457	86.32
265.908	210.11
266.359	110.59
266.809	188.26
267.26	147
267.711	147
268.162	113.02
268.613	195.54
269.064	168.84
269.514	132.44
269.965	154.28
270.415	154.28
270.866	178.55
271.316	161.56
271.767	117.87
272.217	71.75
272.668	159.13
273.118	166.42
273.568	105.74
274.019	130.01
274.469	183.41
274.919	113.02
275.369	149.43
275.819	180.98
276.269	193.12
276.719	185.83
277.169	200.4
277.619	205.25
278.069	130.01
278.518	151.85
278.968	132.44
279.418	151.85
279.867	151.85
280.317	103.31
280.767	151.85
281.216	154.28
281.666	139.72
282.115	142.14
282.564	188.26
283.014	217.39
283.463	125.15
283.912	161.56
284.361	166.42
284.811	159.13
285.26	100.88
285.709	79.04
286.158	161.56
286.607	214.96
287.056	222.24
287.505	202.82
287.953	91.17
288.402	91.17
288.851	91.17
289.3	178.55
289.748	210.11
290.197	159.13
290.646	190.69
291.094	74.18
291.543	76.61
291.991	134.86
292.439	132.44
292.888	171.27
293.336	149.43
293.784	159.13
294.233	125.15
294.681	154.28
295.129	185.83
295.577	144.57
296.025	115.44
296.473	108.16
296.921	207.68
297.369	127.58
297.817	122.73
298.264	200.4
298.712	149.43
299.16	120.3
299.608	200.4
300.055	115.44
300.503	154.28
300.95	205.25
301.398	86.32
301.845	178.55
302.293	151.85
302.74	127.58
303.187	183.41
303.635	88.75
304.082	122.73
304.529	130.01
304.976	144.57
305.423	159.13
305.87	142.14
306.317	190.69
306.764	147
307.211	120.3
307.658	171.27
308.105	200.4
308.552	163.99
308.998	142.14
309.445	268.36
309.892	231.95
310.338	132.44
310.785	173.7
311.231	156.71
311.678	176.13
312.124	137.29
312.571	190.69
313.017	195.54
313.463	144.57
313.909	161.56
314.356	113.02
314.802	149.43
315.248	161.56
315.694	202.82
316.14	197.97
316.586	142.14
317.032	180.98
317.478	188.26
317.923	156.71
318.369	183.41
318.815	176.13
319.261	103.31
319.706	176.13
320.152	151.85
320.597	93.6
321.043	144.57
321.488	197.97
321.934	93.6
322.379	127.58
322.824	183.41
323.27	166.42
323.715	130.01
324.16	137.29
324.605	125.15
325.05	144.57
325.495	110.59
325.94	52.34
326.385	151.85
326.83	154.28
327.275	91.17
327.72	176.13
328.165	202.82
328.61	105.74
329.054	147
329.499	205.25
329.943	190.69
330.388	130.01
330.832	188.26
331.277	190.69
331.721	134.86
332.166	202.82
332.61	139.72
333.054	113.02
333.499	202.82
333.943	163.99
334.387	125.15
334.831	161.56
335.275	134.86
335.719	178.55
336.163	171.27
336.607	168.84
337.051	122.73
337.495	163.99
337.938	185.83
338.382	130.01
338.826	205.25
339.269	183.41
339.713	137.29
340.157	81.46
340.6	142.14
341.044	122.73
341.487	113.02
341.93	117.87
342.374	110.59
342.817	100.88
343.26	185.83
343.703	180.98
344.146	151.85
344.59	125.15
345.033	171.27
345.476	154.28
345.919	139.72
346.361	96.03
346.804	120.3
347.247	132.44
347.69	117.87
348.133	180.98
348.575	139.72
349.018	142.14
349.461	134.86
349.903	166.42
350.346	166.42
350.788	86.32
351.23	134.86
351.673	168.84
352.115	134.86
352.557	188.26
353	144.57
353.442	159.13
353.884	122.73
354.326	161.56
354.768	144.57
355.21	195.54
355.652	139.72
356.094	137.29
356.536	159.13
356.978	134.86
357.419	137.29
357.861	125.15
358.303	229.52
358.744	171.27
359.186	178.55
359.627	144.57
360.069	159.13
360.51	122.73
360.952	197.97
361.393	93.6
361.834	156.71
362.276	149.43
362.717	132.44
363.158	180.98
363.599	100.88
364.04	93.6
364.481	139.72
364.922	122.73
365.363	108.16
365.804	168.84
366.245	202.82
366.686	110.59
367.126	134.86
367.567	188.26
368.008	122.73
368.448	137.29
368.889	122.73
369.33	176.13
369.77	105.74
370.21	178.55
370.651	117.87
371.091	122.73
371.531	144.57
371.972	171.27
372.412	156.71
372.852	188.26
373.292	149.43
373.732	163.99
374.172	173.7
374.612	125.15
375.052	200.4
375.492	132.44
375.932	100.88
376.372	130.01
376.811	188.26
377.251	130.01
377.691	137.29
378.13	168.84
378.57	176.13
379.009	197.97
379.449	147
379.888	127.58
380.328	110.59
380.767	132.44
381.206	120.3
381.645	207.68
382.085	64.47
382.524	173.7
382.963	132.44
383.402	142.14
383.841	122.73
384.28	113.02
384.719	183.41
385.158	103.31
385.596	161.56
386.035	190.69
386.474	202.82
386.913	132.44
387.351	132.44
387.79	163.99
388.228	134.86
388.667	125.15
389.105	171.27
389.544	127.58
389.982	98.45
390.42	66.9
390.859	193.12
391.297	113.02
391.735	154.28
392.173	156.71
392.611	166.42
393.049	202.82
393.487	1.37
393.925	173.7
394.363	96.03
394.801	154.28
395.239	227.1
395.676	193.12
396.114	108.16
396.552	168.84
396.989	79.04
397.427	151.85
397.864	105.74
398.302	127.58
398.739	120.3
399.177	113.02
399.614	168.84
400.051	154.28
400.488	120.3
400.926	212.53
401.363	137.29
401.8	154.28
402.237	149.43
402.674	197.97
403.111	197.97
403.548	120.3
403.985	168.84
404.421	180.98
404.858	168.84
405.295	185.83
405.732	180.98
406.168	108.16
406.605	156.71
407.041	96.03
407.478	122.73
407.914	178.55
408.351	137.29
408.787	108.16
409.223	156.71
409.66	137.29
410.096	190.69
410.532	193.12
410.968	151.85
411.404	117.87
411.84	147
412.276	197.97
412.712	173.7
413.148	100.88
413.584	188.26
414.02	122.73
414.455	210.11
414.891	137.29
415.327	154.28
415.762	178.55
416.198	93.6
416.633	127.58
417.069	176.13
417.504	113.02
417.94	127.58
418.375	168.84
418.81	149.43
419.245	156.71
419.681	151.85
420.116	156.71
420.551	125.15
420.986	122.73
421.421	147
421.856	268.36
422.291	176.13
422.726	144.57
423.16	159.13
423.595	163.99
424.03	180.98
424.464	159.13
424.899	234.38
425.334	166.42
425.768	166.42
426.203	139.72
426.637	168.84
427.071	193.12
427.506	137.29
427.94	59.62
428.374	180.98
428.809	137.29
429.243	154.28
429.677	151.85
430.111	156.71
430.545	156.71
430.979	137.29
431.413	210.11
431.847	127.58
432.28	130.01
432.714	139.72
433.148	197.97
433.582	178.55
434.015	120.3
434.449	122.73
434.882	190.69
435.316	193.12
435.749	200.4
436.183	159.13
436.616	134.86
437.049	183.41
437.483	154.28
437.916	275.64
438.349	180.98
438.782	183.41
439.215	159.13
439.648	219.82
440.081	185.83
440.514	190.69
440.947	173.7
441.38	188.26
441.813	125.15
442.245	248.94
442.678	195.54
443.111	197.97
443.543	212.53
443.976	188.26
444.408	178.55
444.841	178.55
445.273	110.59
445.705	200.4
446.138	275.64
446.57	132.44
447.002	219.82
447.434	241.66
447.867	241.66
448.299	212.53
448.731	239.23
449.163	214.96
449.595	190.69
450.026	195.54
450.458	227.1
450.89	207.68
451.322	229.52
451.754	268.36
452.185	251.37
452.617	258.65
453.048	195.54
453.48	273.21
453.911	270.79
454.343	285.35
454.774	285.35
455.205	217.39
455.637	239.23
456.068	265.93
456.499	261.08
456.93	231.95
457.361	244.09
457.792	166.42
458.223	292.63
458.654	263.51
459.085	253.8
459.516	329.04
459.947	222.24
460.378	265.93
460.808	253.8
461.239	214.96
461.669	236.81
462.1	268.36
462.531	205.25
462.961	219.82
463.391	333.89
463.822	212.53
464.252	227.1
464.682	282.92
465.113	190.69
465.543	219.82
465.973	258.65
466.403	214.96
466.833	253.8
467.263	219.82
467.693	239.23
468.123	316.9
468.553	227.1
468.983	278.07
469.412	227.1
469.842	241.66
470.272	210.11
470.701	210.11
471.131	287.78
471.56	246.51
471.99	171.27
472.419	190.69
472.849	190.69
473.278	188.26
473.707	234.38
474.136	178.55
474.566	222.24
474.995	292.63
475.424	149.43
475.853	176.13
476.282	180.98
476.711	270.79
477.14	178.55
477.569	231.95
477.997	137.29
478.426	171.27
478.855	210.11
479.283	251.37
479.712	222.24
480.141	144.57
480.569	207.68
480.998	205.25
481.426	168.84
481.854	231.95
482.283	246.51
482.711	202.82
483.139	202.82
483.567	205.25
483.995	212.53
484.424	244.09
484.852	217.39
485.28	224.67
485.708	278.07
486.135	251.37
486.563	217.39
486.991	253.8
487.419	130.01
487.847	168.84
488.274	190.69
488.702	202.82
489.129	156.71
489.557	178.55
489.984	142.14
490.412	207.68
490.839	154.28
491.266	193.12
491.694	185.83
492.121	292.63
492.548	236.81
492.975	166.42
493.402	168.84
493.829	214.96
494.256	190.69
494.683	263.51
495.11	98.45
495.537	185.83
495.964	248.94
496.39	156.71
496.817	183.41
497.244	130.01
497.67	193.12
498.097	214.96
498.523	154.28
498.95	195.54
499.376	236.81
499.803	137.29
500.229	76.61
500.655	176.13
501.081	205.25
501.508	130.01
501.934	190.69
502.36	222.24
502.786	188.26
503.212	139.72
503.638	219.82
504.064	159.13
504.489	154.28
504.915	166.42
505.341	173.7
505.767	151.85
506.192	222.24
506.618	176.13
507.043	137.29
507.469	280.5
507.894	156.71
508.32	227.1
508.745	229.52
509.17	166.42
509.596	185.83
510.021	227.1
510.446	212.53
510.871	202.82
511.296	154.28
511.721	197.97
512.146	224.67
512.571	219.82
512.996	227.1
513.421	207.68
513.845	219.82
514.27	195.54
514.695	222.24
515.119	178.55
515.544	127.58
515.969	166.42
516.393	163.99
516.817	168.84
517.242	171.27
517.666	163.99
518.09	197.97
518.515	176.13
518.939	156.71
519.363	418.85
519.787	147
520.211	163.99
520.635	190.69
521.059	173.7
521.483	147
521.907	180.98
522.331	224.67
522.754	185.83
523.178	188.26
523.602	125.15
524.025	125.15
524.449	176.13
524.872	205.25
525.296	227.1
525.719	156.71
526.143	212.53
526.566	241.66
526.989	139.72
527.412	183.41
527.836	210.11
528.259	159.13
528.682	144.57
529.105	137.29
529.528	246.51
529.951	113.02
530.374	132.44
530.796	91.17
531.219	180.98
531.642	166.42
532.065	185.83
532.487	171.27
532.91	161.56
533.332	163.99
533.755	202.82
534.177	178.55
534.6	142.14
535.022	178.55
535.444	173.7
535.867	154.28
536.289	120.3
536.711	205.25
537.133	207.68
537.555	163.99
537.977	222.24
538.399	180.98
538.821	147
539.243	147
539.665	265.93
540.086	178.55
540.508	185.83
540.93	163.99
541.351	163.99
541.773	190.69
542.195	200.4
542.616	202.82
543.037	214.96
543.459	304.77
543.88	149.43
544.301	202.82
544.723	195.54
545.144	326.61
545.565	282.92
545.986	202.82
546.407	229.52
546.828	195.54
547.249	222.24
547.67	188.26
548.091	156.71
548.512	154.28
548.932	176.13
549.353	190.69
549.774	173.7
550.194	229.52
550.615	176.13
551.035	159.13
551.456	142.14
551.876	178.55
552.296	144.57
552.717	173.7
553.137	168.84
553.557	200.4
553.977	188.26
554.397	265.93
554.817	149.43
555.237	142.14
555.657	190.69
556.077	202.82
556.497	205.25
556.917	210.11
557.337	149.43
557.756	236.81
558.176	132.44
558.596	190.69
559.015	168.84
559.435	149.43
559.854	154.28
560.274	185.83
560.693	200.4
561.112	205.25
561.532	161.56
561.951	151.85
562.37	231.95
562.789	180.98
563.208	231.95
563.627	214.96
564.046	151.85
564.465	197.97
564.884	180.98
565.303	144.57
565.722	142.14
566.14	214.96
566.559	130.01
566.978	222.24
567.396	156.71
567.815	185.83
568.233	253.8
568.652	147
569.07	183.41
569.489	205.25
569.907	185.83
570.325	178.55
570.743	222.24
571.161	200.4
571.58	210.11
571.998	229.52
572.416	147
572.833	166.42
573.251	166.42
573.669	132.44
574.087	171.27
574.505	122.73
574.922	168.84
575.34	178.55
575.758	154.28
576.175	144.57
576.593	197.97
577.01	166.42
577.428	117.87
577.845	1564.5
578.262	312.05
578.68	159.13
579.097	195.54
579.514	149.43
579.931	161.56
580.348	159.13
580.765	205.25
581.182	134.86
581.599	185.83
582.016	113.02
582.433	96.03
582.849	113.02
583.266	256.22
583.683	251.37
584.099	234.38
584.516	100.88
584.933	171.27
585.349	127.58
585.765	178.55
586.182	147
586.598	173.7
587.014	190.69
587.431	188.26
587.847	178.55
588.263	171.27
588.679	178.55
589.095	149.43
589.511	197.97
589.927	166.42
590.343	130.01
590.759	166.42
591.174	217.39
591.59	219.82
592.006	161.56
592.421	163.99
592.837	207.68
593.252	176.13
593.668	159.13
594.083	134.86
594.499	159.13
594.914	161.56
595.329	149.43
595.745	178.55
596.16	231.95
596.575	139.72
596.99	147
597.405	178.55
597.82	156.71
598.235	166.42
598.65	185.83
599.065	210.11
599.479	180.98
599.894	151.85
600.309	166.42
600.724	180.98
601.138	224.67
601.553	270.79
601.967	207.68
602.382	214.96
602.796	214.96
603.21	210.11
603.625	137.29
604.039	214.96
604.453	176.13
604.867	185.83
605.281	214.96
605.695	103.31
606.109	214.96
606.523	207.68
606.937	163.99
607.351	341.18
607.765	246.51
608.178	210.11
608.592	151.85
609.006	205.25
609.419	166.42
609.833	159.13
610.246	202.82
610.66	134.86
611.073	256.22
611.487	244.09
611.9	248.94
612.313	188.26
612.726	239.23
613.139	180.98
613.553	147
613.966	159.13
614.379	222.24
614.792	185.83
615.204	168.84
615.617	214.96
616.03	151.85
616.443	156.71
616.856	222.24
617.268	113.02
617.681	168.84
618.093	154.28
618.506	188.26
618.918	168.84
619.331	134.86
619.743	180.98
620.155	161.56
620.568	83.89
620.98	163.99
621.392	163.99
621.804	178.55
622.216	151.85
622.628	163.99
623.04	88.75
623.452	69.33
623.864	183.41
624.276	159.13
624.687	214.96
625.099	62.05
625.511	120.3
625.922	173.7
626.334	210.11
626.745	193.12
627.157	168.84
627.568	168.84
627.979	231.95
628.391	168.84
628.802	173.7
629.213	122.73
629.624	193.12
630.035	207.68
630.446	168.84
630.857	159.13
631.268	176.13
631.679	137.29
632.09	151.85
632.501	202.82
632.912	83.89
633.322	173.7
633.733	137.29
634.144	110.59
634.554	156.71
634.965	185.83
635.375	251.37
635.785	108.16
636.196	166.42
636.606	151.85
637.016	156.71
637.427	96.03
637.837	183.41
638.247	239.23
638.657	229.52
639.067	159.13
639.477	173.7
639.887	108.16
640.297	163.99
640.706	125.15
641.116	127.58
641.526	200.4
641.935	125.15
642.345	151.85
642.755	139.72
643.164	156.71
643.573	207.68
643.983	212.53
644.392	156.71
644.801	173.7
645.211	185.83
645.62	144.57
646.029	180.98
646.438	159.13
646.847	159.13
647.256	185.83
647.665	115.44
648.074	166.42
648.483	224.67
648.892	149.43
649.3	100.88
649.709	173.7
650.118	127.58
650.526	195.54
650.935	197.97
651.343	142.14
651.752	197.97
652.16	183.41
652.568	159.13
652.977	137.29
653.385	168.84
653.793	88.75
654.201	227.1
654.609	163.99
655.017	100.88
655.425	127.58
655.833	159.13
656.241	137.29
656.649	176.13
657.057	122.73
657.464	149.43
657.872	137.29
658.28	122.73
658.687	176.13
659.095	178.55
659.502	108.16
659.91	127.58
660.317	234.38
660.724	96.03
661.132	86.32
661.539	151.85
661.946	103.31
662.353	159.13
662.76	163.99
663.167	159.13
663.574	88.75
663.981	98.45
664.388	139.72
664.795	151.85
665.202	156.71
665.608	122.73
666.015	147
666.422	117.87
666.828	115.44
667.235	222.24
667.641	120.3
668.047	100.88
668.454	212.53
668.86	168.84
669.266	130.01
669.673	202.82
670.079	163.99
670.485	180.98
670.891	115.44
671.297	130.01
671.703	134.86
672.109	130.01
672.515	156.71
672.92	163.99
673.326	193.12
673.732	185.83
674.138	183.41
674.543	142.14
674.949	183.41
675.354	98.45
675.76	120.3
676.165	139.72
676.57	159.13
676.976	117.87
677.381	122.73
677.786	270.79
678.191	183.41
678.596	176.13
679.001	120.3
679.406	154.28
679.811	127.58
680.216	173.7
680.621	151.85
681.026	132.44
681.43	171.27
681.835	163.99
682.24	183.41
682.644	154.28
683.049	125.15
683.453	144.57
683.858	125.15
684.262	159.13
684.667	127.58
685.071	115.44
685.475	197.97
685.879	151.85
686.283	173.7
686.687	142.14
687.091	183.41
687.495	147
687.899	88.75
688.303	202.82
688.707	110.59
689.111	180.98
689.514	183.41
689.918	180.98
690.322	190.69
690.725	217.39
691.129	202.82
691.532	125.15
691.936	207.68
692.339	202.82
692.742	96.03
693.146	202.82
693.549	195.54
693.952	219.82
694.355	185.83
694.758	163.99
695.161	113.02
695.564	168.84
695.967	193.12
696.37	154.28
696.773	258.65
697.175	163.99
697.578	161.56
697.981	188.26
698.383	195.54
698.786	156.71
699.188	110.59
699.591	180.98
699.993	163.99
700.395	125.15
700.798	193.12
701.2	130.01
701.602	159.13
702.004	200.4
702.406	125.15
702.808	144.57
703.21	200.4
703.612	217.39
704.014	147
704.416	159.13
704.818	256.22
705.219	185.83
705.621	219.82
706.023	171.27
706.424	173.7
706.826	210.11
707.227	151.85
707.629	137.29
708.03	207.68
708.431	151.85
708.832	193.12
709.234	234.38
709.635	229.52
710.036	214.96
710.437	263.51
710.838	173.7
711.239	324.19
711.64	183.41
712.041	246.51
712.441	197.97
712.842	147
713.243	251.37
713.643	185.83
714.044	270.79
714.445	263.51
714.845	280.5
715.246	307.2
715.646	265.93
716.046	333.89
716.447	363.02
716.847	355.74
717.247	299.91
717.647	224.67
718.047	329.04
718.447	329.04
718.847	324.19
719.247	331.47
719.647	355.74
720.047	312.05
720.446	292.63
720.846	290.2
721.246	399.43
721.645	314.48
722.045	265.93
722.444	338.75
722.844	460.11
723.243	489.24
723.643	445.55
724.042	348.46
724.441	355.74
724.84	479.53
725.24	363.02
725.639	484.38
726.038	455.26
726.437	382.44
726.836	447.97
727.234	443.12
727.633	532.93
728.032	457.68
728.431	566.91
728.83	528.07
729.228	656.72
729.627	576.62
730.025	579.04
730.424	680.99
730.822	763.51
731.22	758.66
731.619	870.31
732.017	950.41
732.415	819.34
732.813	897.01
733.212	926.14
733.61	928.56
734.008	1057.21
734.406	1268.38
734.803	1477.12
735.201	1542.65
735.599	1508.67
735.997	1452.84
736.395	1414.01
736.792	1363.04
737.19	1496.53
737.587	1761.1
737.985	2108.19
738.382	2397.03
738.78	2431.01
739.177	2343.63
739.574	2304.8
739.971	2117.9
740.369	2035.38
740.766	2178.58
741.163	2695.58
741.56	3178.6
741.957	3392.19
742.354	3736.86
742.751	3649.48
743.147	3404.33
743.544	2998.98
743.941	2943.16
744.338	3205.3
744.734	3647.05
745.131	4457.75
745.527	5421.35
745.924	5899.52
746.32	5821.84
746.716	5358.24
747.113	4763.58
747.509	4389.78
747.905	4443.18
748.301	5074.26
748.697	6258.74
749.093	7758.77
749.489	8710.24
749.885	8736.94
750.281	8634.99
750.677	7795.18
751.073	6705.35
751.468	6382.53
751.864	6979.63
752.26	8159.26
752.655	10283.08
753.051	11877.76
753.446	13402.06
753.842	12885.06
754.237	11870.48
754.632	10304.92
755.028	8909.27
755.423	8894.71
755.818	9664.14
756.213	11853.49
756.608	14462.76
757.003	15729.77
757.398	16096.28
757.793	15008.88
758.188	13093.8
758.583	11453
758.977	10324.34
759.372	10596.19
759.767	13050.11
760.161	16404.53
760.556	19967.7
760.95	21790.54
761.345	22215.3
761.739	21038.1
762.133	18414.27
762.527	16137.54
762.922	14902.08
763.316	16004.04
763.71	19314.77
764.104	22885.22
764.498	26948.39
764.892	28962.98
765.286	28996.96
765.68	26538.19
766.073	23110.95
766.467	19654.58
766.861	18620.59
767.255	20047.79
767.648	24225.04
768.042	28873.17
768.435	33176.64
768.829	35625.71
769.222	35455.8
769.615	32018.85
770.008	27378
770.402	23438.62
770.795	21916.75
771.188	23222.6
771.581	26210.51
771.974	30907.19
772.367	34943.66
772.76	37395.15
773.153	35467.94
773.545	33147.51
773.938	28800.36
774.331	24683.79
774.724	22962.89
775.116	24814.86
775.509	29086.77
775.901	35135.41
776.294	40735.01
776.686	44528.76
777.078	44941.38
777.471	42373.38
777.863	38123.32
778.255	32873.24
778.647	30375.62
779.039	30511.55
779.431	33305.28
779.823	39157.31
780.215	45004.49
780.607	49002.13
780.999	50650.21
781.39	47310.35
781.782	42676.79
782.174	36528.63
782.565	32781
782.957	32006.72
783.348	35239.78
783.74	40225.29
784.131	45623.43
784.522	51451.19
784.914	52846.85
785.305	51196.34
785.696	46822.48
786.087	40380.63
786.478	34385.4
786.869	29766.39
787.26	29761.54
787.651	32873.24
788.042	38150.02
788.433	41846.68
788.823	45016.63
789.214	44698.66
789.605	41205.89
789.995	36577.18
790.386	30302.81
790.776	26331.87
791.167	24606.12
791.557	26729.94
791.948	31601.37
792.338	37137.87
792.728	43208.35
793.118	45645.28
793.508	43861.27
793.898	41295.7
794.288	35795.61
794.678	30317.37
795.068	27052.76
795.458	26562.46
795.848	28987.25
796.238	33361.11
796.627	38625.75
797.017	42812.71
797.406	44778.76
797.796	43329.71
798.185	40045.68
798.575	34227.63
798.964	28763.95
799.354	25967.79
799.743	25992.06
800.132	29492.12
800.521	35004.34
800.91	40062.67
801.299	43565.15
801.688	44929.25
802.077	43111.26
802.466	38599.05
802.855	32802.85
803.244	26887.71
803.633	23242.02
804.021	22720.17
804.41	25780.89
804.799	29594.06
805.187	33967.91
805.576	36771.35
805.964	37577.19
806.352	35351.43
806.741	32290.7
807.129	26632.85
807.517	22411.91
807.905	19904.59
808.293	19106.03
808.681	22157.05
809.069	26302.75
809.457	31916.91
809.845	35375.7
810.233	36926.7
810.621	36118.43
811.009	32606.24
811.396	28021.22
811.784	23217.75
812.171	19640.02
812.559	18919.14
812.946	20275.95
813.334	24212.91
813.721	28222.68
814.108	31324.67
814.496	32963.04
814.883	32713.04
815.27	31465.45
815.657	26448.38
816.044	22496.86
816.431	18732.24
816.818	16795.32
817.205	17525.91
817.592	20805.09
817.979	24528.45
818.365	28147.43
818.752	29662.02
819.139	29712.99
819.525	27761.51
819.912	23899.8
820.298	20069.64
820.685	16091.42
821.071	13506.43
821.457	12732.15
821.843	13778.28
822.23	16307.44
822.616	18851.17
823.002	20865.77
823.388	21351.21
823.774	20654.6
824.16	18550.2
824.546	15484.62
824.931	12584.09
825.317	10278.22
825.703	9159.27
826.089	9448.11
826.474	11062.22
826.86	13091.37
827.245	15351.12
827.631	16737.06
828.016	17528.34
828.401	16649.68
828.787	14584.12
829.172	11875.34
829.557	9717.54
829.942	7751.49
830.327	7465.07
830.712	8003.92
831.097	8977.23
831.482	10875.32
831.867	12334.08
832.252	13135.06
832.636	13246.72
833.021	12263.69
833.406	10829.2
833.79	8863.15
834.175	7030.6
834.559	6079.13
834.944	5506.31
835.328	5901.94
835.713	6926.23
836.097	8185.96
836.481	9020.92
836.865	9834.04
837.249	9858.31
837.633	9069.47
838.017	7894.69
838.401	6414.09
838.785	5018.43
839.169	4151.92
839.553	3870.36
839.937	3906.77
840.32	4537.84
840.704	5312.13
841.087	6066.99
841.471	6266.03
841.854	6360.69
842.238	5894.66
842.621	5207.76
843.004	4222.3
843.388	3326.66
843.771	2935.88
844.154	2540.24
844.537	2642.18
844.92	3292.68
845.303	3744.14
845.686	4265.99
846.069	4736.88
846.452	5115.52
846.834	4785.42
847.217	4268.42
847.6	3576.66
847.982	2897.04
848.365	2380.04
848.748	2091.2
849.13	2040.23
849.512	2299.94
849.895	2736.84
850.277	3321.81
850.659	3715.02
851.041	3761.13
851.423	3736.86
851.806	3350.93
852.188	2906.75
852.57	2353.34
852.951	1897.03
853.333	1603.33
853.715	1489.25
854.097	1530.52
854.479	1799.94
854.86	2127.61
855.242	2474.7
855.623	2557.23
856.005	2676.16
856.386	2462.57
856.768	2244.12
857.149	1952.85
857.53	1447.99
857.911	1253.81
858.292	1098.47
858.674	974.68
859.055	1134.88
859.436	1331.48
859.817	1348.47
860.197	1528.09
860.578	1596.05
860.959	1576.63
861.34	1489.25
861.72	1265.95
862.101	1071.77
862.482	897.01
862.862	792.64
863.243	705.26
863.623	785.36
864.003	829.05
864.384	962.55
864.764	1006.24
865.144	1066.92
865.524	1127.6
865.904	1132.45
866.284	952.84
866.664	865.46
867.044	722.25
867.424	617.88
867.804	591.18
868.183	518.36
868.563	634.87
868.943	603.32
869.322	680.99
869.702	673.71
870.081	765.94
870.461	727.1
870.84	683.41
871.22	751.38
871.599	647.01
871.978	591.18
872.357	462.54
872.736	387.29
873.115	416.42
873.494	355.74
873.873	375.16
874.252	452.83
874.631	423.7
875.01	467.39
875.388	481.96
875.767	501.37
876.146	469.82
876.524	331.47
876.903	380.01
877.281	350.89
877.66	270.79
878.038	222.24
878.416	224.67
878.794	253.8
879.173	307.2
879.551	292.63
879.929	290.2
880.307	299.91
880.685	307.2
881.063	319.33
881.441	295.06
881.818	314.48
882.196	217.39
882.574	183.41
882.951	278.07
883.329	222.24
883.707	234.38
884.084	241.66
884.461	224.67
884.839	231.95
885.216	265.93
885.593	214.96
885.971	212.53
886.348	156.71
886.725	185.83
887.102	253.8
887.479	195.54
887.856	241.66
888.233	147
888.609	190.69
888.986	176.13
889.363	149.43
889.74	154.28
890.116	154.28
890.493	163.99
890.869	207.68
891.246	168.84
891.622	185.83
891.998	151.85
892.375	188.26
892.751	132.44
893.127	147
893.503	210.11
893.879	93.6
894.255	142.14
894.631	180.98
895.007	161.56
895.383	93.6
895.759	185.83
896.134	147
896.51	176.13
896.886	188.26
897.261	161.56
897.637	134.86
898.012	168.84
898.388	154.28
898.763	168.84
899.138	108.16
899.514	137.29
899.889	142.14
900.264	71.75
900.639	144.57
901.014	244.09
901.389	151.85
901.764	163.99
902.139	171.27
902.513	154.28
902.888	110.59
903.263	147
903.638	173.7
904.012	202.82
904.387	120.3
904.761	66.9
905.136	166.42
905.51	173.7
905.884	144.57
906.259	154.28
906.633	161.56
907.007	96.03
907.381	178.55
907.755	173.7
908.129	79.04
908.503	163.99
908.877	127.58
909.251	180.98
909.624	217.39
909.998	66.9
910.372	166.42
910.745	173.7
911.119	166.42
911.492	127.58
911.866	163.99
912.239	159.13
912.612	163.99
912.986	163.99
913.359	188.26
913.732	185.83
914.105	130.01
914.478	127.58
914.851	139.72
915.224	110.59
915.597	132.44
915.97	117.87
916.343	137.29
916.715	139.72
917.088	137.29
917.461	132.44
917.833	173.7
918.206	178.55
918.578	166.42
918.951	117.87
919.323	173.7
919.695	173.7
920.067	127.58
920.44	117.87
920.812	113.02
921.184	57.19
921.556	142.14
921.928	142.14
922.3	139.72
922.672	108.16
923.043	125.15
923.415	132.44
923.787	149.43
924.158	180.98
924.53	137.29
924.901	202.82
925.273	178.55
925.644	130.01
926.016	105.74
926.387	156.71
926.758	110.59
927.129	76.61
927.5	122.73
927.872	188.26
928.243	132.44
928.613	103.31
928.984	144.57
929.355	110.59
929.726	108.16
930.097	49.91
930.467	117.87
930.838	132.44
931.209	156.71
931.579	130.01
931.95	173.7
932.32	173.7
932.69	103.31
933.061	163.99
933.431	93.6
933.801	241.66
934.171	154.28
934.541	142.14
934.911	76.61
935.281	127.58
935.651	149.43
936.021	62.05
936.391	100.88
936.761	127.58
937.13	103.31
937.5	42.63
937.87	173.7
938.239	127.58
938.609	183.41
938.978	134.86
939.347	180.98
939.717	168.84
940.086	149.43
940.455	149.43
940.824	188.26
941.193	180.98
941.562	163.99
941.931	100.88
942.3	159.13
942.669	161.56
943.038	149.43
943.407	200.4
943.775	134.86
944.144	207.68
944.513	125.15
944.881	144.57
945.25	66.9
945.618	224.67
945.986	139.72
946.355	142.14
946.723	125.15
947.091	163.99
947.459	130.01
947.827	103.31
948.195	166.42
948.563	91.17
948.931	105.74
949.299	147
949.667	180.98
950.035	127.58
950.402	159.13
950.77	96.03
951.138	74.18
951.505	110.59
951.873	134.86
952.24	64.47
952.607	125.15
952.975	195.54
953.342	122.73
953.709	105.74
954.076	178.55
954.443	134.86
954.81	229.52
955.177	195.54
955.544	214.96
955.911	180.98
956.278	188.26
956.645	154.28
957.012	117.87
957.378	137.29
957.745	93.6
958.111	163.99
958.478	168.84
958.844	122.73
959.211	168.84
959.577	168.84
959.943	122.73
960.309	178.55
960.675	161.56
961.042	147
961.408	163.99
961.774	210.11
962.139	171.27
962.505	147
962.871	117.87
963.237	66.9
963.603	108.16
963.968	139.72
964.334	127.58
964.699	144.57
965.065	178.55
965.43	173.7
965.796	117.87
966.161	168.84
966.526	69.33
966.891	210.11
967.256	110.59
967.622	113.02
967.987	122.73
968.352	57.19
968.716	103.31
969.081	132.44
969.446	159.13
969.811	130.01
970.176	100.88
970.54	156.71
970.905	28.06
971.269	127.58
971.634	91.17
971.998	45.06
972.363	130.01
972.727	37.77
973.091	132.44
973.455	154.28
973.819	117.87
974.183	149.43
974.547	122.73
974.911	132.44
975.275	188.26
975.639	173.7
976.003	166.42
976.367	113.02
976.73	130.01
977.094	120.3
977.458	156.71
977.821	81.46
978.185	98.45
978.548	178.55
978.911	159.13
979.275	91.17
979.638	103.31
980.001	166.42
980.364	59.62
980.727	132.44
981.09	125.15
981.453	125.15
981.816	212.53
982.179	258.65
982.542	86.32
982.905	120.3
983.267	134.86
983.63	110.59
983.992	156.71
984.355	93.6
984.717	210.11
985.08	197.97
985.442	205.25
985.804	185.83
986.167	188.26
986.529	178.55
986.891	62.05
987.253	108.16
987.615	159.13
987.977	105.74
988.339	139.72
988.701	142.14
989.062	83.89
989.424	154.28
989.786	147
990.147	79.04
990.509	64.47
990.87	188.26
991.232	45.06
991.593	125.15
991.955	127.58
992.316	103.31
992.677	117.87
993.038	139.72
993.399	100.88
993.76	197.97
994.121	151.85
994.482	125.15
994.843	117.87
995.204	66.9
995.565	117.87
995.926	130.01
996.286	93.6
996.647	132.44
997.007	120.3
997.368	134.86
997.728	139.72
998.089	163.99
998.449	161.56
998.809	42.63
999.169	149.43
999.53	188.26
999.89	86.32
1000.25	163.99
1000.61	151.85
1000.97	171.27
1001.329	159.13
1001.689	163.99
1002.049	130.01
1002.409	74.18
1002.768	96.03
1003.128	178.55
1003.487	241.66
1003.847	171.27
1004.206	161.56
1004.566	144.57
1004.925	156.71
1005.284	144.57
1005.643	139.72
1006.003	93.6
1006.362	224.67
1006.721	185.83
1007.08	159.13
1007.438	25.64
1007.797	86.32
1008.156	168.84
1008.515	207.68
1008.874	144.57
1009.232	120.3
1009.591	108.16
1009.949	144.57
1010.308	173.7
1010.666	132.44
1011.024	188.26
1011.383	134.86
1011.741	144.57
1012.099	62.05
1012.457	154.28
1012.815	163.99
1013.173	115.44
1013.531	142.14
1013.889	113.02
1014.247	120.3
1014.605	105.74
1014.962	176.13
1015.32	205.25
1015.678	151.85
1016.035	105.74
1016.393	147
1016.75	132.44
1017.107	137.29
1017.465	151.85
1017.822	180.98
1018.179	200.4
1018.536	176.13
1018.894	212.53
1019.251	110.59
1019.608	100.88
1019.964	96.03
1020.321	156.71
1020.678	149.43
1021.035	74.18
1021.392	98.45
1021.748	149.43
1022.105	188.26
1022.461	156.71
1022.818	151.85
1023.174	74.18
1023.531	202.82
1023.887	197.97
1024.243	127.58
1024.599	156.71
1024.955	127.58
1025.311	178.55
1025.667	103.31
1026.023	110.59
1026.379	127.58
1026.735	139.72
1027.091	83.89
1027.447	166.42
