189.514	43.39
189.973	43.39
190.431	43.39
190.889	50.67
191.348	31.25
191.806	-2.73
192.264	-12.44
192.722	-10.01
193.18	-51.28
193.638	-14.87
194.096	-0.3
194.554	-48.85
195.012	16.69
195.47	2.12
195.928	4.55
196.385	-17.29
196.843	-2.73
197.301	45.81
197.758	-53.7
198.216	99.21
198.674	11.83
199.131	31.25
199.589	11.83
200.046	45.81
200.503	60.38
200.961	62.8
201.418	135.62
201.875	116.2
202.332	53.1
202.79	40.96
203.247	140.48
203.704	150.18
204.161	189.02
204.618	159.89
205.075	147.76
205.532	174.46
205.989	138.05
206.445	145.33
206.902	164.75
207.359	206.01
207.816	186.59
208.272	91.93
208.729	121.06
209.185	189.02
209.642	162.32
210.098	145.33
210.555	181.74
211.011	167.17
211.467	157.47
211.924	150.18
212.38	181.74
212.836	172.03
213.292	133.19
213.748	142.9
214.204	159.89
214.66	116.2
215.116	125.91
215.572	157.47
216.028	242.42
216.484	198.73
216.94	157.47
217.396	113.78
217.851	157.47
218.307	164.75
218.763	118.63
219.218	155.04
219.674	147.76
220.129	169.6
220.585	152.61
221.04	189.02
221.496	184.17
221.951	116.2
222.406	128.34
222.861	116.2
223.317	116.2
223.772	130.77
224.227	155.04
224.682	181.74
225.137	169.6
225.592	118.63
226.047	145.33
226.502	174.46
226.957	140.48
227.411	196.3
227.866	206.01
228.321	147.76
228.776	108.92
229.23	186.59
229.685	162.32
230.139	174.46
230.594	123.48
231.048	130.77
231.503	130.77
231.957	125.91
232.411	159.89
232.865	230.28
233.32	174.46
233.774	145.33
234.228	152.61
234.682	152.61
235.136	184.17
235.59	159.89
236.044	164.75
236.498	186.59
236.952	113.78
237.406	99.21
237.86	174.46
238.313	142.9
238.767	104.07
239.221	172.03
239.674	147.76
240.128	60.38
240.581	125.91
241.035	121.06
241.488	106.49
241.942	130.77
242.395	133.19
242.848	140.48
243.301	145.33
243.755	193.87
244.208	191.45
244.661	189.02
245.114	142.9
245.567	172.03
246.02	104.07
246.473	77.37
246.926	181.74
247.379	155.04
247.832	193.87
248.284	140.48
248.737	130.77
249.19	191.45
249.642	172.03
250.095	157.47
250.547	133.19
251	159.89
251.452	181.74
251.905	169.6
252.357	150.18
252.81	106.49
253.262	125.91
253.714	169.6
254.166	152.61
254.618	223
255.07	101.64
255.523	196.3
255.975	179.31
256.427	172.03
256.878	159.89
257.33	116.2
257.782	172.03
258.234	147.76
258.686	155.04
259.137	172.03
259.589	128.34
260.041	150.18
260.492	201.16
260.944	162.32
261.395	162.32
261.847	123.48
262.298	145.33
262.749	169.6
263.201	162.32
263.652	123.48
264.103	208.44
264.554	140.48
265.005	116.2
265.457	203.58
265.908	147.76
266.359	179.31
266.809	176.88
267.26	145.33
267.711	193.87
268.162	164.75
268.613	164.75
269.064	167.17
269.514	118.63
269.965	162.32
270.415	186.59
270.866	125.91
271.316	159.89
271.767	145.33
272.217	162.32
272.668	118.63
273.118	169.6
273.568	130.77
274.019	108.92
274.469	67.66
274.919	111.35
275.369	111.35
275.819	152.61
276.269	150.18
276.719	198.73
277.169	133.19
277.619	125.91
278.069	179.31
278.518	172.03
278.968	99.21
279.418	77.37
279.867	79.79
280.317	77.37
280.767	140.48
281.216	106.49
281.666	167.17
282.115	130.77
282.564	145.33
283.014	142.9
283.463	167.17
283.912	123.48
284.361	133.19
284.811	142.9
285.26	135.62
285.709	135.62
286.158	130.77
286.607	133.19
287.056	164.75
287.505	218.15
287.953	145.33
288.402	179.31
288.851	123.48
289.3	159.89
289.748	189.02
290.197	147.76
290.646	140.48
291.094	208.44
291.543	130.77
291.991	215.72
292.439	225.43
292.888	128.34
293.336	145.33
293.784	96.79
294.233	121.06
294.681	169.6
295.129	198.73
295.577	181.74
296.025	145.33
296.473	133.19
296.921	133.19
297.369	145.33
297.817	128.34
298.264	225.43
298.712	121.06
299.16	159.89
299.608	191.45
300.055	176.88
300.503	169.6
300.95	169.6
301.398	155.04
301.845	181.74
302.293	179.31
302.74	169.6
303.187	167.17
303.635	140.48
304.082	215.72
304.529	121.06
304.976	235.14
305.423	130.77
305.87	174.46
306.317	184.17
306.764	174.46
307.211	155.04
307.658	186.59
308.105	230.28
308.552	169.6
308.998	164.75
309.445	133.19
309.892	145.33
310.338	118.63
310.785	155.04
311.231	176.88
311.678	223
312.124	155.04
312.571	273.97
313.017	162.32
313.463	138.05
313.909	145.33
314.356	91.93
314.802	130.77
315.248	121.06
315.694	172.03
316.14	150.18
316.586	123.48
317.032	244.85
317.478	130.77
317.923	140.48
318.369	167.17
318.815	133.19
319.261	174.46
319.706	106.49
320.152	184.17
320.597	99.21
321.043	135.62
321.488	220.57
321.934	162.32
322.379	108.92
322.824	172.03
323.27	186.59
323.715	145.33
324.16	121.06
324.605	116.2
325.05	121.06
325.495	220.57
325.94	179.31
326.385	169.6
326.83	116.2
327.275	167.17
327.72	135.62
328.165	128.34
328.61	142.9
329.054	210.86
329.499	223
329.943	152.61
330.388	145.33
330.832	174.46
331.277	142.9
331.721	227.86
332.166	157.47
332.61	67.66
333.054	108.92
333.499	152.61
333.943	159.89
334.387	82.22
334.831	172.03
335.275	164.75
335.719	135.62
336.163	84.65
336.607	203.58
337.051	172.03
337.495	213.29
337.938	167.17
338.382	167.17
338.826	152.61
339.269	152.61
339.713	91.93
340.157	196.3
340.6	164.75
341.044	186.59
341.487	133.19
341.93	130.77
342.374	142.9
342.817	82.22
343.26	172.03
343.703	157.47
344.146	123.48
344.59	140.48
345.033	140.48
345.476	130.77
345.919	186.59
346.361	150.18
346.804	147.76
347.247	111.35
347.69	208.44
348.133	147.76
348.575	55.52
349.018	162.32
349.461	133.19
349.903	164.75
350.346	191.45
350.788	206.01
351.23	181.74
351.673	186.59
352.115	116.2
352.557	128.34
353	230.28
353.442	155.04
353.884	181.74
354.326	91.93
354.768	218.15
355.21	138.05
355.652	138.05
356.094	104.07
356.536	145.33
356.978	152.61
357.419	167.17
357.861	111.35
358.303	201.16
358.744	174.46
359.186	203.58
359.627	140.48
360.069	128.34
360.51	106.49
360.952	172.03
361.393	191.45
361.834	239.99
362.276	184.17
362.717	142.9
363.158	220.57
363.599	193.87
364.04	111.35
364.481	169.6
364.922	164.75
365.363	133.19
365.804	179.31
366.245	225.43
366.686	201.16
367.126	189.02
367.567	130.77
368.008	201.16
368.448	172.03
368.889	196.3
369.33	140.48
369.77	155.04
370.21	128.34
370.651	138.05
371.091	208.44
371.531	159.89
371.972	96.79
372.412	142.9
372.852	159.89
373.292	101.64
373.732	181.74
374.172	215.72
374.612	169.6
375.052	157.47
375.492	184.17
375.932	230.28
376.372	155.04
376.811	152.61
377.251	128.34
377.691	184.17
378.13	206.01
378.57	218.15
379.009	138.05
379.449	198.73
379.888	176.88
380.328	128.34
380.767	133.19
381.206	157.47
381.645	50.67
382.085	111.35
382.524	162.32
382.963	142.9
383.402	130.77
383.841	145.33
384.28	235.14
384.719	242.42
385.158	118.63
385.596	147.76
386.035	101.64
386.474	193.87
386.913	162.32
387.351	196.3
387.79	181.74
388.228	138.05
388.667	133.19
389.105	145.33
389.544	162.32
389.982	152.61
390.42	184.17
390.859	125.91
391.297	155.04
391.735	189.02
392.173	147.76
392.611	193.87
393.049	186.59
393.487	89.5
393.925	84.65
394.363	130.77
394.801	181.74
395.239	155.04
395.676	113.78
396.114	172.03
396.552	157.47
396.989	133.19
397.427	130.77
397.864	123.48
398.302	186.59
398.739	164.75
399.177	152.61
399.614	118.63
400.051	147.76
400.488	206.01
400.926	101.64
401.363	176.88
401.8	138.05
402.237	167.17
402.674	147.76
403.111	99.21
403.548	176.88
403.985	193.87
404.421	106.49
404.858	123.48
405.295	145.33
405.732	128.34
406.168	193.87
406.605	150.18
407.041	159.89
407.478	106.49
407.914	169.6
408.351	155.04
408.787	142.9
409.223	133.19
409.66	157.47
410.096	142.9
410.532	249.7
410.968	106.49
411.404	169.6
411.84	147.76
412.276	215.72
412.712	196.3
413.148	111.35
413.584	121.06
414.02	201.16
414.455	174.46
414.891	186.59
415.327	172.03
415.762	138.05
416.198	135.62
416.633	169.6
417.069	96.79
417.504	101.64
417.94	128.34
418.375	140.48
418.81	135.62
419.245	152.61
419.681	162.32
420.116	155.04
420.551	99.21
420.986	176.88
421.421	193.87
421.856	123.48
422.291	218.15
422.726	91.93
423.16	133.19
423.595	116.2
424.03	133.19
424.464	172.03
424.899	130.77
425.334	196.3
425.768	133.19
426.203	99.21
426.637	167.17
427.071	155.04
427.506	133.19
427.94	181.74
428.374	189.02
428.809	167.17
429.243	172.03
429.677	186.59
430.111	147.76
430.545	193.87
430.979	147.76
431.413	94.36
431.847	230.28
432.28	150.18
432.714	94.36
433.148	89.5
433.582	118.63
434.015	116.2
434.449	210.86
434.882	179.31
435.316	208.44
435.749	181.74
436.183	147.76
436.616	155.04
437.049	174.46
437.483	152.61
437.916	77.37
438.349	189.02
438.782	172.03
439.215	198.73
439.648	150.18
440.081	179.31
440.514	106.49
440.947	155.04
441.38	169.6
441.813	203.58
442.245	128.34
442.678	162.32
443.111	220.57
443.543	142.9
443.976	104.07
444.408	116.2
444.841	155.04
445.273	162.32
445.705	172.03
446.138	167.17
446.57	223
447.002	208.44
447.434	203.58
447.867	235.14
448.299	130.77
448.731	227.86
449.163	210.86
449.595	201.16
450.026	138.05
450.458	203.58
450.89	152.61
451.322	198.73
451.754	213.29
452.185	290.96
452.617	169.6
453.048	237.56
453.48	300.67
453.911	244.85
454.343	242.42
454.774	225.43
455.205	215.72
455.637	225.43
456.068	191.45
456.499	227.86
456.93	290.96
457.361	203.58
457.792	256.98
458.223	259.41
458.654	186.59
459.085	191.45
459.516	254.55
459.947	232.71
460.378	213.29
460.808	191.45
461.239	164.75
461.669	198.73
462.1	184.17
462.531	145.33
462.961	133.19
463.391	181.74
463.822	201.16
464.252	210.86
464.682	142.9
465.113	218.15
465.543	235.14
465.973	193.87
466.403	278.83
466.833	198.73
467.263	227.86
467.693	237.56
468.123	191.45
468.553	179.31
468.983	225.43
469.412	249.7
469.842	186.59
470.272	196.3
470.701	142.9
471.131	232.71
471.56	210.86
471.99	242.42
472.419	230.28
472.849	167.17
473.278	157.47
473.707	230.28
474.136	300.67
474.566	176.88
474.995	203.58
475.424	244.85
475.853	186.59
476.282	155.04
476.711	155.04
477.14	191.45
477.569	206.01
477.997	252.13
478.426	138.05
478.855	210.86
479.283	237.56
479.712	218.15
480.141	213.29
480.569	237.56
480.998	198.73
481.426	157.47
481.854	125.91
482.283	130.77
482.711	184.17
483.139	167.17
483.567	193.87
483.995	198.73
484.424	215.72
484.852	157.47
485.28	147.76
485.708	213.29
486.135	242.42
486.563	249.7
486.991	244.85
487.419	232.71
487.847	203.58
488.274	184.17
488.702	256.98
489.129	203.58
489.557	155.04
489.984	181.74
490.412	169.6
490.839	230.28
491.266	189.02
491.694	213.29
492.121	184.17
492.548	201.16
492.975	176.88
493.402	223
493.829	201.16
494.256	125.91
494.683	181.74
495.11	147.76
495.537	106.49
495.964	162.32
496.39	155.04
496.817	130.77
497.244	145.33
497.67	145.33
498.097	208.44
498.523	179.31
498.95	184.17
499.376	125.91
499.803	172.03
500.229	181.74
500.655	223
501.081	104.07
501.508	172.03
501.934	235.14
502.36	87.08
502.786	227.86
503.212	227.86
503.638	89.5
504.064	189.02
504.489	169.6
504.915	89.5
505.341	152.61
505.767	218.15
506.192	189.02
506.618	184.17
507.043	167.17
507.469	181.74
507.894	142.9
508.32	215.72
508.745	113.78
509.17	179.31
509.596	213.29
510.021	169.6
510.446	220.57
510.871	155.04
511.296	186.59
511.721	147.76
512.146	133.19
512.571	116.2
512.996	201.16
513.421	210.86
513.845	169.6
514.27	164.75
514.695	206.01
515.119	96.79
515.544	193.87
515.969	181.74
516.393	184.17
516.817	172.03
517.242	174.46
517.666	113.78
518.09	193.87
518.515	193.87
518.939	169.6
519.363	320.09
519.787	184.17
520.211	179.31
520.635	176.88
521.059	133.19
521.483	159.89
521.907	113.78
522.331	145.33
522.754	142.9
523.178	286.11
523.602	232.71
524.025	176.88
524.449	230.28
524.872	201.16
525.296	116.2
525.719	191.45
526.143	288.54
526.566	167.17
526.989	104.07
527.412	150.18
527.836	133.19
528.259	198.73
528.682	215.72
529.105	220.57
529.528	169.6
529.951	191.45
530.374	164.75
530.796	121.06
531.219	135.62
531.642	128.34
532.065	181.74
532.487	169.6
532.91	181.74
533.332	140.48
533.755	186.59
534.177	179.31
534.6	130.77
535.022	225.43
535.444	201.16
535.867	174.46
536.289	181.74
536.711	189.02
537.133	174.46
537.555	218.15
537.977	176.88
538.399	172.03
538.821	150.18
539.243	150.18
539.665	227.86
540.086	150.18
540.508	210.86
540.93	155.04
541.351	198.73
541.773	223
542.195	176.88
542.616	232.71
543.037	184.17
543.459	218.15
543.88	104.07
544.301	201.16
544.723	256.98
545.144	215.72
545.565	201.16
545.986	232.71
546.407	179.31
546.828	174.46
547.249	203.58
547.67	303.1
548.091	152.61
548.512	201.16
548.932	186.59
549.353	220.57
549.774	116.2
550.194	269.12
550.615	196.3
551.035	213.29
551.456	164.75
551.876	191.45
552.296	150.18
552.717	155.04
553.137	225.43
553.557	111.35
553.977	174.46
554.397	191.45
554.817	140.48
555.237	155.04
555.657	167.17
556.077	152.61
556.497	157.47
556.917	210.86
557.337	213.29
557.756	210.86
558.176	150.18
558.596	113.78
559.015	150.18
559.435	220.57
559.854	138.05
560.274	206.01
560.693	147.76
561.112	235.14
561.532	155.04
561.951	140.48
562.37	191.45
562.789	169.6
563.208	145.33
563.627	150.18
564.046	172.03
564.465	135.62
564.884	128.34
565.303	111.35
565.722	128.34
566.14	150.18
566.559	108.92
566.978	261.84
567.396	60.38
567.815	215.72
568.233	130.77
568.652	259.41
569.07	121.06
569.489	176.88
569.907	179.31
570.325	162.32
570.743	230.28
571.161	208.44
571.58	213.29
571.998	121.06
572.416	196.3
572.833	150.18
573.251	150.18
573.669	152.61
574.087	196.3
574.505	174.46
574.922	176.88
575.34	157.47
575.758	230.28
576.175	184.17
576.593	159.89
577.01	174.46
577.428	84.65
577.845	1553.12
578.262	303.1
578.68	191.45
579.097	152.61
579.514	121.06
579.931	208.44
580.348	167.17
580.765	242.42
581.182	232.71
581.599	179.31
582.016	208.44
582.433	174.46
582.849	218.15
583.266	220.57
583.683	184.17
584.099	230.28
584.516	208.44
584.933	227.86
585.349	189.02
585.765	145.33
586.182	169.6
586.598	145.33
587.014	152.61
587.431	232.71
587.847	106.49
588.263	169.6
588.679	140.48
589.095	125.91
589.511	159.89
589.927	176.88
590.343	203.58
590.759	155.04
591.174	111.35
591.59	244.85
592.006	155.04
592.421	184.17
592.837	162.32
593.252	254.55
593.668	118.63
594.083	208.44
594.499	206.01
594.914	121.06
595.329	128.34
595.745	113.78
596.16	159.89
596.575	172.03
596.99	201.16
597.405	116.2
597.82	191.45
598.235	191.45
598.65	167.17
599.065	145.33
599.479	210.86
599.894	193.87
600.309	172.03
600.724	232.71
601.138	264.26
601.553	155.04
601.967	157.47
602.382	159.89
602.796	104.07
603.21	142.9
603.625	189.02
604.039	159.89
604.453	164.75
604.867	130.77
605.281	176.88
605.695	150.18
606.109	191.45
606.523	135.62
606.937	116.2
607.351	254.55
607.765	96.79
608.178	193.87
608.592	157.47
609.006	174.46
609.419	196.3
609.833	244.85
610.246	130.77
610.66	213.29
611.073	230.28
611.487	164.75
611.9	176.88
612.313	242.42
612.726	150.18
613.139	111.35
613.553	150.18
613.966	133.19
614.379	150.18
614.792	184.17
615.204	159.89
615.617	203.58
616.03	155.04
616.443	147.76
616.856	186.59
617.268	145.33
617.681	215.72
618.093	157.47
618.506	215.72
618.918	242.42
619.331	162.32
619.743	230.28
620.155	176.88
620.568	208.44
620.98	186.59
621.392	174.46
621.804	159.89
622.216	162.32
622.628	150.18
623.04	140.48
623.452	174.46
623.864	147.76
624.276	121.06
624.687	164.75
625.099	210.86
625.511	142.9
625.922	150.18
626.334	152.61
626.745	179.31
627.157	159.89
627.568	220.57
627.979	189.02
628.391	220.57
628.802	130.77
629.213	218.15
629.624	174.46
630.035	184.17
630.446	162.32
630.857	232.71
631.268	181.74
631.679	227.86
632.09	162.32
632.501	138.05
632.912	94.36
633.322	235.14
633.733	155.04
634.144	159.89
634.554	116.2
634.965	128.34
635.375	218.15
635.785	145.33
636.196	189.02
636.606	176.88
637.016	150.18
637.427	167.17
637.837	140.48
638.247	201.16
638.657	169.6
639.067	225.43
639.477	104.07
639.887	152.61
640.297	118.63
640.706	150.18
641.116	203.58
641.526	193.87
641.935	247.27
642.345	172.03
642.755	155.04
643.164	196.3
643.573	249.7
643.983	181.74
644.392	215.72
644.801	152.61
645.211	215.72
645.62	172.03
646.029	186.59
646.438	191.45
646.847	152.61
647.256	172.03
647.665	213.29
648.074	96.79
648.483	111.35
648.892	145.33
649.3	130.77
649.709	128.34
650.118	176.88
650.526	201.16
650.935	181.74
651.343	227.86
651.752	118.63
652.16	191.45
652.568	201.16
652.977	130.77
653.385	157.47
653.793	162.32
654.201	186.59
654.609	162.32
655.017	181.74
655.425	147.76
655.833	140.48
656.241	181.74
656.649	213.29
657.057	147.76
657.464	152.61
657.872	169.6
658.28	140.48
658.687	123.48
659.095	130.77
659.502	169.6
659.91	152.61
660.317	125.91
660.724	189.02
661.132	210.86
661.539	184.17
661.946	130.77
662.353	218.15
662.76	104.07
663.167	140.48
663.574	133.19
663.981	176.88
664.388	118.63
664.795	172.03
665.202	198.73
665.608	189.02
666.015	99.21
666.422	162.32
666.828	181.74
667.235	150.18
667.641	213.29
668.047	218.15
668.454	155.04
668.86	176.88
669.266	215.72
669.673	150.18
670.079	152.61
670.485	123.48
670.891	87.08
671.297	91.93
671.703	111.35
672.109	135.62
672.515	189.02
672.92	179.31
673.326	152.61
673.732	145.33
674.138	138.05
674.543	191.45
674.949	96.79
675.354	196.3
675.76	113.78
676.165	133.19
676.57	193.87
676.976	106.49
677.381	174.46
677.786	147.76
678.191	125.91
678.596	218.15
679.001	167.17
679.406	191.45
679.811	169.6
680.216	157.47
680.621	91.93
681.026	87.08
681.43	164.75
681.835	157.47
682.24	125.91
682.644	121.06
683.049	116.2
683.453	237.56
683.858	198.73
684.262	181.74
684.667	128.34
685.071	157.47
685.475	138.05
685.879	162.32
686.283	157.47
686.687	157.47
687.091	99.21
687.495	157.47
687.899	218.15
688.303	208.44
688.707	116.2
689.111	174.46
689.514	181.74
689.918	155.04
690.322	123.48
690.725	133.19
691.129	159.89
691.532	164.75
691.936	118.63
692.339	220.57
692.742	189.02
693.146	167.17
693.549	172.03
693.952	198.73
694.355	232.71
694.758	186.59
695.161	191.45
695.564	191.45
695.967	169.6
696.37	94.36
696.773	203.58
697.175	133.19
697.578	174.46
697.981	152.61
698.383	210.86
698.786	235.14
699.188	213.29
699.591	155.04
699.993	99.21
700.395	186.59
700.798	189.02
701.2	196.3
701.602	201.16
702.004	152.61
702.406	239.99
702.808	118.63
703.21	215.72
703.612	213.29
704.014	208.44
704.416	215.72
704.818	213.29
705.219	167.17
705.621	269.12
706.023	210.86
706.424	140.48
706.826	223
707.227	249.7
707.629	227.86
708.03	203.58
708.431	201.16
708.832	256.98
709.234	288.54
709.635	266.69
710.036	249.7
710.437	201.16
710.838	193.87
711.239	249.7
711.64	189.02
712.041	223
712.441	230.28
712.842	244.85
713.243	278.83
713.643	273.97
714.044	247.27
714.445	220.57
714.845	208.44
715.246	254.55
715.646	322.52
716.046	235.14
716.447	288.54
716.847	273.97
717.247	341.93
717.647	373.49
718.047	354.07
718.447	356.5
718.847	298.24
719.247	344.36
719.647	366.21
720.047	371.06
720.446	315.24
720.846	266.69
721.246	392.91
721.645	380.77
722.045	375.92
722.444	315.24
722.844	412.32
723.243	419.61
723.643	390.48
724.042	409.9
724.441	453.59
724.84	429.31
725.24	480.29
725.639	431.74
726.038	426.89
726.437	443.88
726.836	506.99
727.234	468.15
727.633	497.28
728.032	502.13
728.431	536.11
728.83	582.23
729.228	572.52
729.627	604.07
730.025	659.9
730.424	659.9
730.822	744.85
731.22	727.86
731.619	839.52
732.017	868.64
732.415	885.63
732.813	948.74
733.212	1014.28
733.61	1113.79
734.008	1147.77
734.406	1184.18
734.803	1341.95
735.201	1358.94
735.599	1436.61
735.997	1638.07
736.395	1560.4
736.792	1764.29
737.19	1759.43
737.587	1786.13
737.985	2002.15
738.382	2033.71
738.78	2235.17
739.177	2286.14
739.574	2548.28
739.971	2611.39
740.369	2706.05
740.766	2824.98
741.163	2975.47
741.56	3036.15
741.957	3074.99
742.354	3274.02
742.751	3327.42
743.147	3582.28
743.544	3691.5
743.941	3846.84
744.338	3934.22
744.734	4075
745.131	4252.19
745.527	4674.53
745.924	4795.89
746.32	5121.14
746.716	5320.17
747.113	5589.59
747.509	5718.23
747.905	5975.52
748.301	6223.09
748.697	6453.68
749.093	6805.63
749.489	7157.57
749.885	7363.89
750.281	7902.73
750.677	8067.78
751.073	8528.96
751.468	8613.91
751.864	9155.18
752.26	9444.02
752.655	9791.11
753.051	9808.1
753.446	10577.53
753.842	10863.94
754.237	11135.79
754.632	11385.8
755.028	11929.49
755.423	11863.96
755.818	11820.27
756.213	12565.43
756.608	12395.52
757.003	12725.62
757.398	12572.71
757.793	12999.9
758.188	13133.4
758.583	13650.39
758.977	13830.01
759.372	14026.61
759.767	14759.63
760.161	15677.12
760.556	16813.06
760.95	17048.51
761.345	17558.22
761.739	18740.28
762.133	19201.45
762.527	19672.33
762.922	19820.39
763.316	20917.5
763.71	20932.06
764.104	21417.51
764.498	22745.2
764.892	23410.25
765.286	22927.24
765.68	23771.91
766.073	24716.1
766.467	24434.54
766.861	25162.71
767.255	26750.11
767.648	26791.38
768.042	26470.98
768.435	27347.21
768.829	28070.52
769.222	28264.7
769.615	28199.16
770.008	28589.95
770.402	29437.05
770.795	28767.13
771.188	29721.03
771.581	30119.1
771.974	29934.63
772.367	29344.81
772.76	29774.43
773.153	30053.56
773.545	30022.01
773.938	29507.44
774.331	30208.9
774.724	30762.31
775.116	31293.87
775.509	32645.84
775.901	34466.25
776.294	34750.24
776.686	34043.92
777.078	35900.74
777.471	36711.43
777.863	37810.96
778.255	38808.55
778.647	40864.41
779.039	40849.85
779.431	39286.72
779.823	39451.77
780.215	40764.89
780.607	40934.8
780.999	40976.06
781.39	40857.13
781.782	42774.63
782.174	41988.21
782.565	41922.68
782.957	43010.07
783.348	44165.43
783.74	43585.33
784.131	41643.55
784.522	43599.89
784.914	43264.93
785.305	41733.36
785.696	41512.48
786.087	42289.19
786.478	41670.25
786.869	40124.11
787.26	40007.6
787.651	39590.12
788.042	38371.65
788.433	37102.22
788.823	36233.27
789.214	36667.74
789.605	34723.54
789.995	33364.29
790.386	33990.52
790.776	34456.54
791.167	32871.57
791.557	33568.18
791.948	34696.84
792.338	35667.73
792.728	35289.08
793.118	35024.51
793.508	36223.56
793.898	36643.47
794.288	35412.87
794.678	35553.65
795.068	36978.43
795.458	36347.35
795.848	35296.36
796.238	35633.75
796.627	36269.68
797.017	36340.07
797.406	35320.63
797.796	35206.55
798.185	37320.67
798.575	36138.61
798.964	35412.87
799.354	36340.07
799.743	37128.91
800.132	36682.31
800.521	36007.54
800.91	35951.71
801.299	36274.53
801.688	35434.71
802.077	33582.74
802.466	34677.42
802.855	35750.25
803.244	33325.46
803.633	32373.99
804.021	32323.01
804.41	31929.8
804.799	30791.44
805.187	29407.92
805.576	29138.5
805.964	29633.65
806.352	28068.09
806.741	27104.49
807.129	28194.31
807.517	28633.64
807.905	27257.4
808.293	26655.45
808.681	27747.7
809.069	28000.13
809.457	27893.33
809.845	27065.65
810.233	27920.03
810.621	28864.22
811.009	27813.24
811.396	27000.12
811.784	28303.53
812.171	28752.57
812.559	28157.9
812.946	25944.27
813.334	26286.51
813.721	26808.37
814.108	25371.45
814.496	24051.04
814.883	24711.25
815.27	25893.3
815.657	24876.3
816.044	24497.65
816.431	24451.53
816.818	25764.66
817.205	24543.77
817.592	23907.84
817.979	23565.6
818.365	24233.08
818.752	23111.71
819.139	21723.34
819.525	21284.01
819.912	21565.57
820.298	20796.14
820.685	19444.17
821.071	18924.75
821.457	19419.9
821.843	18953.87
822.23	17638.32
822.616	16478.11
823.002	16237.81
823.388	16123.73
823.774	15628.58
824.16	14407.69
824.546	14580.02
824.931	14711.09
825.317	13873.7
825.703	13536.31
826.089	13371.26
826.474	13830.01
826.86	13448.93
827.245	12623.68
827.631	12793.58
828.016	13075.14
828.401	12728.05
828.787	11735.32
829.172	11516.87
829.557	11740.17
829.942	11715.9
830.327	10939.19
830.712	10599.38
831.097	10453.74
831.482	10781.42
831.867	10016.84
832.252	9655.19
832.636	9509.55
833.021	9876.06
833.406	9638.2
833.79	8980.42
834.175	8711
834.559	8948.86
834.944	8774.1
835.328	8244.97
835.713	7905.16
836.097	8033.8
836.481	8084.77
836.865	7516.8
837.249	6943.98
837.633	6800.77
838.017	6907.57
838.401	6621.16
838.785	6038.63
839.169	5854.16
839.553	5638.13
839.937	5730.37
840.32	5189.1
840.704	4951.23
841.087	4820.16
841.471	4752.2
841.854	4701.23
842.238	4351.71
842.621	4181.8
843.004	4349.28
843.388	4308.02
843.771	4203.65
844.154	3880.82
844.537	3956.07
844.92	4138.11
845.303	3812.86
845.686	3591.99
846.069	3630.82
846.452	3757.04
846.834	3560.43
847.217	3363.83
847.6	3278.87
847.982	3324.99
848.365	3315.28
848.748	3072.56
849.13	2973.04
849.512	2786.15
849.895	2873.53
850.277	2939.06
850.659	2545.85
851.041	2693.91
851.423	2776.44
851.806	2693.91
852.188	2528.86
852.57	2473.04
852.951	2414.78
853.333	2490.03
853.715	2414.78
854.097	2152.64
854.479	2164.78
854.86	2106.53
855.242	2193.91
855.623	2060.41
856.005	1883.22
856.386	1863.8
856.768	1919.63
857.149	1909.92
857.53	1698.75
857.911	1577.39
858.292	1516.71
858.674	1548.26
859.055	1480.3
859.436	1475.45
859.817	1346.8
860.197	1298.26
860.578	1339.52
860.959	1215.73
861.34	1096.8
861.72	1118.65
862.101	1116.22
862.482	1167.19
862.862	1077.38
863.243	1040.97
863.623	1070.1
864.003	1033.69
864.384	1079.81
864.764	963.3
865.144	856.51
865.524	890.49
865.904	885.63
866.284	868.64
866.664	795.83
867.044	846.8
867.424	744.85
867.804	834.66
868.183	730.29
868.563	708.45
868.943	672.04
869.322	655.05
869.702	732.72
870.081	596.79
870.461	596.79
870.84	659.9
871.22	640.48
871.599	582.23
871.978	579.8
872.357	463.3
872.736	545.82
873.115	511.84
873.494	497.28
873.873	412.32
874.252	422.03
874.631	446.31
875.01	412.32
875.388	412.32
875.767	373.49
876.146	434.17
876.524	383.2
876.903	395.33
877.281	305.53
877.66	307.95
878.038	327.37
878.416	366.21
878.794	305.53
879.173	380.77
879.551	320.09
879.929	339.51
880.307	378.34
880.685	286.11
881.063	230.28
881.441	261.84
881.818	283.68
882.196	227.86
882.574	235.14
882.951	288.54
883.329	230.28
883.707	307.95
884.084	281.25
884.461	288.54
884.839	235.14
885.216	247.27
885.593	203.58
885.971	239.99
886.348	179.31
886.725	201.16
887.102	193.87
887.479	273.97
887.856	230.28
888.233	220.57
888.609	223
888.986	181.74
889.363	159.89
889.74	167.17
890.116	179.31
890.493	142.9
890.869	210.86
891.246	227.86
891.622	223
891.998	201.16
892.375	135.62
892.751	184.17
893.127	181.74
893.503	164.75
893.879	223
894.255	215.72
894.631	145.33
895.007	181.74
895.383	142.9
895.759	191.45
896.134	118.63
896.51	174.46
896.886	118.63
897.261	118.63
897.637	196.3
898.012	125.91
898.388	181.74
898.763	157.47
899.138	159.89
899.514	133.19
899.889	147.76
900.264	116.2
900.639	179.31
901.014	208.44
901.389	128.34
901.764	123.48
902.139	172.03
902.513	254.55
902.888	242.42
903.263	91.93
903.638	123.48
904.012	169.6
904.387	142.9
904.761	152.61
905.136	203.58
905.51	133.19
905.884	155.04
906.259	237.56
906.633	162.32
907.007	169.6
907.381	147.76
907.755	152.61
908.129	74.94
908.503	145.33
908.877	99.21
909.251	140.48
909.624	162.32
909.998	125.91
910.372	164.75
910.745	140.48
911.119	150.18
911.492	111.35
911.866	106.49
912.239	133.19
912.612	167.17
912.986	201.16
913.359	218.15
913.732	155.04
914.105	172.03
914.478	157.47
914.851	172.03
915.224	210.86
915.597	147.76
915.97	174.46
916.343	169.6
916.715	89.5
917.088	169.6
917.461	101.64
917.833	138.05
918.206	193.87
918.578	130.77
918.951	155.04
919.323	172.03
919.695	128.34
920.067	118.63
920.44	162.32
920.812	201.16
921.184	116.2
921.556	184.17
921.928	159.89
922.3	142.9
922.672	118.63
923.043	232.71
923.415	133.19
923.787	138.05
924.158	145.33
924.53	142.9
924.901	201.16
925.273	159.89
925.644	179.31
926.016	113.78
926.387	167.17
926.758	157.47
927.129	142.9
927.5	133.19
927.872	189.02
928.243	140.48
928.613	135.62
928.984	198.73
929.355	94.36
929.726	164.75
930.097	159.89
930.467	77.37
930.838	215.72
931.209	138.05
931.579	113.78
931.95	155.04
932.32	159.89
932.69	174.46
933.061	157.47
933.431	70.09
933.801	101.64
934.171	118.63
934.541	135.62
934.911	138.05
935.281	135.62
935.651	155.04
936.021	201.16
936.391	162.32
936.761	123.48
937.13	108.92
937.5	169.6
937.87	242.42
938.239	133.19
938.609	196.3
938.978	145.33
939.347	140.48
939.717	33.68
940.086	203.58
940.455	116.2
940.824	179.31
941.193	133.19
941.562	189.02
941.931	106.49
942.3	169.6
942.669	84.65
943.038	118.63
943.407	130.77
943.775	155.04
944.144	164.75
944.513	130.77
944.881	113.78
945.25	184.17
945.618	242.42
945.986	184.17
946.355	104.07
946.723	150.18
947.091	121.06
947.459	113.78
947.827	169.6
948.195	125.91
948.563	162.32
948.931	142.9
949.299	191.45
949.667	181.74
950.035	91.93
950.402	142.9
950.77	150.18
951.138	123.48
951.505	189.02
951.873	152.61
952.24	159.89
952.607	174.46
952.975	106.49
953.342	101.64
953.709	181.74
954.076	138.05
954.443	91.93
954.81	176.88
955.177	121.06
955.544	135.62
955.911	169.6
956.278	91.93
956.645	108.92
957.012	140.48
957.378	74.94
957.745	138.05
958.111	169.6
958.478	239.99
958.844	118.63
959.211	186.59
959.577	130.77
959.943	164.75
960.309	159.89
960.675	130.77
961.042	123.48
961.408	104.07
961.774	181.74
962.139	237.56
962.505	111.35
962.871	150.18
963.237	157.47
963.603	101.64
963.968	133.19
964.334	125.91
964.699	181.74
965.065	23.97
965.43	147.76
965.796	138.05
966.161	176.88
966.526	174.46
966.891	138.05
967.256	79.79
967.622	198.73
967.987	128.34
968.352	164.75
968.716	164.75
969.081	121.06
969.446	189.02
969.811	145.33
970.176	164.75
970.54	193.87
970.905	186.59
971.269	206.01
971.634	142.9
971.998	26.4
972.363	196.3
972.727	244.85
973.091	125.91
973.455	189.02
973.819	191.45
974.183	140.48
974.547	135.62
974.911	196.3
975.275	94.36
975.639	169.6
976.003	191.45
976.367	130.77
976.73	128.34
977.094	111.35
977.458	186.59
977.821	159.89
978.185	159.89
978.548	113.78
978.911	130.77
979.275	159.89
979.638	235.14
980.001	162.32
980.364	94.36
980.727	108.92
981.09	213.29
981.453	125.91
981.816	186.59
982.179	176.88
982.542	140.48
982.905	164.75
983.267	157.47
983.63	201.16
983.992	121.06
984.355	116.2
984.717	99.21
985.08	106.49
985.442	244.85
985.804	104.07
986.167	193.87
986.529	152.61
986.891	130.77
987.253	157.47
987.615	140.48
987.977	174.46
988.339	140.48
988.701	123.48
989.062	174.46
989.424	96.79
989.786	157.47
990.147	181.74
990.509	169.6
990.87	147.76
991.232	130.77
991.593	157.47
991.955	67.66
992.316	123.48
992.677	140.48
993.038	147.76
993.399	189.02
993.76	121.06
994.121	179.31
994.482	162.32
994.843	118.63
995.204	152.61
995.565	140.48
995.926	104.07
996.286	138.05
996.647	118.63
997.007	67.66
997.368	135.62
997.728	152.61
998.089	99.21
998.449	164.75
998.809	135.62
999.169	162.32
999.53	169.6
999.89	196.3
1000.25	147.76
1000.61	174.46
1000.97	130.77
1001.329	172.03
1001.689	138.05
1002.049	116.2
1002.409	155.04
1002.768	242.42
1003.128	145.33
1003.487	106.49
1003.847	133.19
1004.206	111.35
1004.566	203.58
1004.925	140.48
1005.284	118.63
1005.643	108.92
1006.003	140.48
1006.362	227.86
1006.721	135.62
1007.08	176.88
1007.438	181.74
1007.797	162.32
1008.156	108.92
1008.515	159.89
1008.874	94.36
1009.232	111.35
1009.591	79.79
1009.949	181.74
1010.308	130.77
1010.666	96.79
1011.024	123.48
1011.383	198.73
1011.741	130.77
1012.099	157.47
1012.457	104.07
1012.815	210.86
1013.173	159.89
1013.531	113.78
1013.889	104.07
1014.247	123.48
1014.605	147.76
1014.962	152.61
1015.32	167.17
1015.678	157.47
1016.035	142.9
1016.393	133.19
1016.75	147.76
1017.107	82.22
1017.465	116.2
1017.822	130.77
1018.179	130.77
1018.536	99.21
1018.894	155.04
1019.251	167.17
1019.608	181.74
1019.964	82.22
1020.321	135.62
1020.678	164.75
1021.035	128.34
1021.392	133.19
1021.748	179.31
1022.105	186.59
1022.461	147.76
1022.818	172.03
1023.174	125.91
1023.531	133.19
1023.887	89.5
1024.243	210.86
1024.599	133.19
1024.955	169.6
1025.311	116.2
1025.667	157.47
1026.023	79.79
1026.379	176.88
1026.735	118.63
1027.091	70.09
1027.447	198.73
