189.514	38.84
189.973	38.84
190.431	38.84
190.889	33.98
191.348	99.52
191.806	-0
192.264	29.13
192.722	-46.12
193.18	-60.68
193.638	-9.71
194.096	41.26
194.554	53.4
195.012	-29.13
195.47	-133.5
195.928	-2.43
196.385	12.14
196.843	-36.41
197.301	4.85
197.758	41.26
198.216	26.7
198.674	72.82
199.131	36.41
199.589	101.94
200.046	41.26
200.503	99.52
200.961	106.8
201.418	87.38
201.875	152.92
202.332	92.23
202.79	82.53
203.247	169.91
203.704	121.36
204.161	206.31
204.618	133.5
205.075	182.04
205.532	252.43
205.989	216.02
206.445	167.48
206.902	155.34
207.359	233.01
207.816	167.48
208.272	186.9
208.729	99.52
209.185	162.62
209.642	194.18
210.098	194.18
210.555	216.02
211.011	167.48
211.467	148.06
211.924	143.21
212.38	201.46
212.836	169.91
213.292	167.48
213.748	179.61
214.204	123.79
214.66	114.08
215.116	259.71
215.572	104.37
216.028	138.35
216.484	167.48
216.94	245.15
217.396	97.09
217.851	148.06
218.307	169.91
218.763	203.89
219.218	165.05
219.674	189.32
220.129	177.19
220.585	114.08
221.04	194.18
221.496	179.61
221.951	138.35
222.406	116.51
222.861	155.34
223.317	165.05
223.772	150.49
224.227	97.09
224.682	155.34
225.137	233.01
225.592	121.36
226.047	152.92
226.502	145.63
226.957	123.79
227.411	167.48
227.866	194.18
228.321	128.64
228.776	165.05
229.23	152.92
229.685	162.62
230.139	179.61
230.594	162.62
231.048	157.77
231.503	179.61
231.957	194.18
232.411	160.2
232.865	169.91
233.32	218.45
233.774	148.06
234.228	165.05
234.682	191.75
235.136	109.22
235.59	148.06
236.044	70.39
236.498	138.35
236.952	77.67
237.406	230.59
237.86	128.64
238.313	179.61
238.767	162.62
239.221	118.93
239.674	174.76
240.128	143.21
240.581	169.91
241.035	186.9
241.488	167.48
241.942	87.38
242.395	140.78
242.848	165.05
243.301	143.21
243.755	199.03
244.208	250
244.661	133.5
245.114	182.04
245.567	157.77
246.02	133.5
246.473	150.49
246.926	157.77
247.379	114.08
247.832	199.03
248.284	228.16
248.737	225.73
249.19	155.34
249.642	194.18
250.095	169.91
250.547	237.87
251	143.21
251.452	242.72
251.905	194.18
252.357	169.91
252.81	186.9
253.262	128.64
253.714	233.01
254.166	133.5
254.618	201.46
255.07	177.19
255.523	116.51
255.975	148.06
256.427	172.33
256.878	203.89
257.33	133.5
257.782	116.51
258.234	148.06
258.686	128.64
259.137	167.48
259.589	206.31
260.041	169.91
260.492	121.36
260.944	135.92
261.395	208.74
261.847	206.31
262.298	201.46
262.749	140.78
263.201	191.75
263.652	138.35
264.103	208.74
264.554	169.91
265.005	179.61
265.457	203.89
265.908	140.78
266.359	235.44
266.809	186.9
267.26	196.6
267.711	167.48
268.162	160.2
268.613	242.72
269.064	240.3
269.514	131.07
269.965	225.73
270.415	201.46
270.866	211.17
271.316	194.18
271.767	189.32
272.217	206.31
272.668	196.6
273.118	152.92
273.568	194.18
274.019	121.36
274.469	165.05
274.919	162.62
275.369	162.62
275.819	160.2
276.269	257.29
276.719	194.18
277.169	191.75
277.619	167.48
278.069	155.34
278.518	172.33
278.968	169.91
279.418	177.19
279.867	206.31
280.317	172.33
280.767	184.47
281.216	196.6
281.666	213.6
282.115	140.78
282.564	174.76
283.014	145.63
283.463	150.49
283.912	148.06
284.361	121.36
284.811	191.75
285.26	177.19
285.709	186.9
286.158	92.23
286.607	194.18
287.056	143.21
287.505	189.32
287.953	206.31
288.402	194.18
288.851	140.78
289.3	199.03
289.748	252.43
290.197	148.06
290.646	177.19
291.094	220.88
291.543	165.05
291.991	123.79
292.439	138.35
292.888	218.45
293.336	194.18
293.784	247.58
294.233	230.59
294.681	172.33
295.129	165.05
295.577	191.75
296.025	182.04
296.473	157.77
296.921	201.46
297.369	174.76
297.817	169.91
298.264	211.17
298.712	177.19
299.16	145.63
299.608	228.16
300.055	174.76
300.503	230.59
300.95	135.92
301.398	157.77
301.845	184.47
302.293	60.68
302.74	157.77
303.187	184.47
303.635	191.75
304.082	162.62
304.529	177.19
304.976	145.63
305.423	203.89
305.87	240.3
306.317	143.21
306.764	223.3
307.211	172.33
307.658	135.92
308.105	167.48
308.552	148.06
308.998	225.73
309.445	148.06
309.892	155.34
310.338	233.01
310.785	179.61
311.231	184.47
311.678	233.01
312.124	177.19
312.571	203.89
313.017	160.2
313.463	167.48
313.909	177.19
314.356	206.31
314.802	220.88
315.248	201.46
315.694	174.76
316.14	174.76
316.586	223.3
317.032	157.77
317.478	228.16
317.923	172.33
318.369	135.92
318.815	223.3
319.261	155.34
319.706	167.48
320.152	230.59
320.597	165.05
321.043	162.62
321.488	128.64
321.934	116.51
322.379	194.18
322.824	155.34
323.27	216.02
323.715	148.06
324.16	182.04
324.605	135.92
325.05	94.66
325.495	77.67
325.94	118.93
326.385	157.77
326.83	196.6
327.275	177.19
327.72	174.76
328.165	213.6
328.61	123.79
329.054	184.47
329.499	189.32
329.943	182.04
330.388	213.6
330.832	196.6
331.277	208.74
331.721	203.89
332.166	162.62
332.61	179.61
333.054	126.22
333.499	199.03
333.943	189.32
334.387	172.33
334.831	70.39
335.275	145.63
335.719	182.04
336.163	208.74
336.607	213.6
337.051	128.64
337.495	155.34
337.938	152.92
338.382	118.93
338.826	104.37
339.269	216.02
339.713	177.19
340.157	174.76
340.6	150.49
341.044	174.76
341.487	169.91
341.93	126.22
342.374	208.74
342.817	177.19
343.26	157.77
343.703	118.93
344.146	216.02
344.59	133.5
345.033	186.9
345.476	172.33
345.919	169.91
346.361	135.92
346.804	208.74
347.247	167.48
347.69	218.45
348.133	191.75
348.575	186.9
349.018	186.9
349.461	145.63
349.903	160.2
350.346	206.31
350.788	172.33
351.23	174.76
351.673	89.81
352.115	104.37
352.557	191.75
353	133.5
353.442	160.2
353.884	138.35
354.326	179.61
354.768	196.6
355.21	150.49
355.652	55.83
356.094	126.22
356.536	152.92
356.978	126.22
357.419	179.61
357.861	233.01
358.303	160.2
358.744	208.74
359.186	191.75
359.627	203.89
360.069	199.03
360.51	138.35
360.952	167.48
361.393	167.48
361.834	213.6
362.276	172.33
362.717	155.34
363.158	196.6
363.599	179.61
364.04	60.68
364.481	101.94
364.922	177.19
365.363	218.45
365.804	128.64
366.245	186.9
366.686	218.45
367.126	135.92
367.567	216.02
368.008	220.88
368.448	101.94
368.889	114.08
369.33	186.9
369.77	186.9
370.21	165.05
370.651	174.76
371.091	189.32
371.531	201.46
371.972	184.47
372.412	167.48
372.852	203.89
373.292	235.44
373.732	150.49
374.172	138.35
374.612	135.92
375.052	211.17
375.492	169.91
375.932	118.93
376.372	145.63
376.811	257.29
377.251	201.46
377.691	160.2
378.13	162.62
378.57	201.46
379.009	109.22
379.449	152.92
379.888	123.79
380.328	291.27
380.767	230.59
381.206	174.76
381.645	133.5
382.085	121.36
382.524	191.75
382.963	165.05
383.402	152.92
383.841	211.17
384.28	152.92
384.719	199.03
385.158	167.48
385.596	138.35
386.035	182.04
386.474	186.9
386.913	150.49
387.351	157.77
387.79	211.17
388.228	126.22
388.667	75.24
389.105	182.04
389.544	182.04
389.982	128.64
390.42	172.33
390.859	228.16
391.297	152.92
391.735	87.38
392.173	150.49
392.611	203.89
393.049	223.3
393.487	104.37
393.925	230.59
394.363	128.64
394.801	199.03
395.239	109.22
395.676	138.35
396.114	211.17
396.552	186.9
396.989	148.06
397.427	167.48
397.864	167.48
398.302	211.17
398.739	138.35
399.177	72.82
399.614	169.91
400.051	182.04
400.488	150.49
400.926	216.02
401.363	177.19
401.8	186.9
402.237	165.05
402.674	131.07
403.111	157.77
403.548	189.32
403.985	186.9
404.421	128.64
404.858	167.48
405.295	189.32
405.732	177.19
406.168	128.64
406.605	160.2
407.041	223.3
407.478	213.6
407.914	199.03
408.351	203.89
408.787	174.76
409.223	123.79
409.66	131.07
410.096	196.6
410.532	169.91
410.968	201.46
411.404	150.49
411.84	155.34
412.276	177.19
412.712	162.62
413.148	211.17
413.584	150.49
414.02	194.18
414.455	245.15
414.891	155.34
415.327	191.75
415.762	191.75
416.198	223.3
416.633	191.75
417.069	196.6
417.504	128.64
417.94	152.92
418.375	92.23
418.81	220.88
419.245	150.49
419.681	242.72
420.116	208.74
420.551	162.62
420.986	225.73
421.421	162.62
421.856	150.49
422.291	179.61
422.726	240.3
423.16	220.88
423.595	131.07
424.03	179.61
424.464	143.21
424.899	135.92
425.334	72.82
425.768	179.61
426.203	114.08
426.637	208.74
427.071	179.61
427.506	140.78
427.94	196.6
428.374	206.31
428.809	237.87
429.243	186.9
429.677	160.2
430.111	186.9
430.545	201.46
430.979	114.08
431.413	135.92
431.847	162.62
432.28	233.01
432.714	167.48
433.148	140.78
433.582	160.2
434.015	114.08
434.449	279.13
434.882	208.74
435.316	150.49
435.749	145.63
436.183	184.47
436.616	162.62
437.049	152.92
437.483	206.31
437.916	211.17
438.349	230.59
438.782	203.89
439.215	203.89
439.648	213.6
440.081	99.52
440.514	189.32
440.947	269.42
441.38	182.04
441.813	208.74
442.245	116.51
442.678	184.47
443.111	194.18
443.543	196.6
443.976	254.86
444.408	162.62
444.841	174.76
445.273	225.73
445.705	184.47
446.138	211.17
446.57	211.17
447.002	228.16
447.434	123.79
447.867	230.59
448.299	264.57
448.731	203.89
449.163	165.05
449.595	186.9
450.026	233.01
450.458	191.75
450.89	259.71
451.322	220.88
451.754	189.32
452.185	203.89
452.617	240.3
453.048	218.45
453.48	250
453.911	259.71
454.343	250
454.774	247.58
455.205	196.6
455.637	271.85
456.068	269.42
456.499	252.43
456.93	196.6
457.361	257.29
457.792	165.05
458.223	235.44
458.654	257.29
459.085	254.86
459.516	279.13
459.947	167.48
460.378	276.7
460.808	254.86
461.239	254.86
461.669	276.7
462.1	286.41
462.531	276.7
462.961	213.6
463.391	179.61
463.822	310.68
464.252	247.58
464.682	213.6
465.113	211.17
465.543	247.58
465.973	230.59
466.403	235.44
466.833	274.28
467.263	257.29
467.693	206.31
468.123	218.45
468.553	240.3
468.983	286.41
469.412	218.45
469.842	228.16
470.272	250
470.701	237.87
471.131	230.59
471.56	257.29
471.99	203.89
472.419	167.48
472.849	235.44
473.278	216.02
473.707	300.98
474.136	262.14
474.566	233.01
474.995	203.89
475.424	199.03
475.853	169.91
476.282	223.3
476.711	184.47
477.14	218.45
477.569	242.72
477.997	140.78
478.426	199.03
478.855	247.58
479.283	225.73
479.712	235.44
480.141	259.71
480.569	218.45
480.998	252.43
481.426	199.03
481.854	179.61
482.283	177.19
482.711	242.72
483.139	174.76
483.567	203.89
483.995	203.89
484.424	208.74
484.852	216.02
485.28	213.6
485.708	245.15
486.135	194.18
486.563	208.74
486.991	213.6
487.419	167.48
487.847	225.73
488.274	155.34
488.702	162.62
489.129	184.47
489.557	233.01
489.984	211.17
490.412	182.04
490.839	157.77
491.266	189.32
491.694	199.03
492.121	230.59
492.548	184.47
492.975	235.44
493.402	191.75
493.829	201.46
494.256	172.33
494.683	257.29
495.11	177.19
495.537	262.14
495.964	174.76
496.39	223.3
496.817	179.61
497.244	230.59
497.67	203.89
498.097	194.18
498.523	182.04
498.95	157.77
499.376	189.32
499.803	199.03
500.229	274.28
500.655	245.15
501.081	133.5
501.508	211.17
501.934	237.87
502.36	128.64
502.786	213.6
503.212	140.78
503.638	186.9
504.064	131.07
504.489	220.88
504.915	150.49
505.341	189.32
505.767	245.15
506.192	199.03
506.618	216.02
507.043	177.19
507.469	179.61
507.894	131.07
508.32	179.61
508.745	123.79
509.17	223.3
509.596	208.74
510.021	131.07
510.446	135.92
510.871	177.19
511.296	199.03
511.721	189.32
512.146	206.31
512.571	155.34
512.996	218.45
513.421	237.87
513.845	150.49
514.27	138.35
514.695	182.04
515.119	162.62
515.544	225.73
515.969	220.88
516.393	165.05
516.817	216.02
517.242	189.32
517.666	237.87
518.09	182.04
518.515	194.18
518.939	165.05
519.363	422.34
519.787	245.15
520.211	235.44
520.635	184.47
521.059	145.63
521.483	220.88
521.907	172.33
522.331	184.47
522.754	252.43
523.178	189.32
523.602	223.3
524.025	155.34
524.449	228.16
524.872	196.6
525.296	165.05
525.719	252.43
526.143	303.4
526.566	160.2
526.989	223.3
527.412	133.5
527.836	138.35
528.259	271.85
528.682	206.31
529.105	242.72
529.528	106.8
529.951	157.77
530.374	152.92
530.796	179.61
531.219	179.61
531.642	203.89
532.065	233.01
532.487	177.19
532.91	160.2
533.332	155.34
533.755	228.16
534.177	135.92
534.6	213.6
535.022	184.47
535.444	165.05
535.867	206.31
536.289	225.73
536.711	291.27
537.133	216.02
537.555	213.6
537.977	169.91
538.399	189.32
538.821	216.02
539.243	211.17
539.665	225.73
540.086	216.02
540.508	182.04
540.93	201.46
541.351	230.59
541.773	254.86
542.195	291.27
542.616	182.04
543.037	247.58
543.459	223.3
543.88	186.9
544.301	228.16
544.723	211.17
545.144	191.75
545.565	225.73
545.986	247.58
546.407	257.29
546.828	199.03
547.249	257.29
547.67	148.06
548.091	230.59
548.512	128.64
548.932	182.04
549.353	252.43
549.774	262.14
550.194	220.88
550.615	230.59
551.035	211.17
551.456	191.75
551.876	199.03
552.296	228.16
552.717	148.06
553.137	191.75
553.557	172.33
553.977	189.32
554.397	269.42
554.817	245.15
555.237	211.17
555.657	245.15
556.077	220.88
556.497	191.75
556.917	194.18
557.337	145.63
557.756	213.6
558.176	126.22
558.596	167.48
559.015	169.91
559.435	189.32
559.854	196.6
560.274	237.87
560.693	218.45
561.112	160.2
561.532	140.78
561.951	228.16
562.37	191.75
562.789	245.15
563.208	218.45
563.627	140.78
564.046	177.19
564.465	228.16
564.884	179.61
565.303	213.6
565.722	169.91
566.14	126.22
566.559	240.3
566.978	201.46
567.396	220.88
567.815	240.3
568.233	160.2
568.652	235.44
569.07	196.6
569.489	174.76
569.907	177.19
570.325	201.46
570.743	160.2
571.161	228.16
571.58	160.2
571.998	235.44
572.416	216.02
572.833	211.17
573.251	157.77
573.669	240.3
574.087	228.16
574.505	274.28
574.922	254.86
575.34	223.3
575.758	220.88
576.175	216.02
576.593	211.17
577.01	257.29
577.428	191.75
577.845	1847.12
578.262	405.35
578.68	184.47
579.097	169.91
579.514	252.43
579.931	118.93
580.348	196.6
580.765	203.89
581.182	172.33
581.599	194.18
582.016	218.45
582.433	145.63
582.849	101.94
583.266	240.3
583.683	216.02
584.099	225.73
584.516	157.77
584.933	208.74
585.349	179.61
585.765	162.62
586.182	186.9
586.598	106.8
587.014	174.76
587.431	230.59
587.847	220.88
588.263	182.04
588.679	271.85
589.095	111.65
589.511	259.71
589.927	213.6
590.343	220.88
590.759	211.17
591.174	184.47
591.59	104.37
592.006	182.04
592.421	157.77
592.837	186.9
593.252	211.17
593.668	184.47
594.083	201.46
594.499	220.88
594.914	155.34
595.329	152.92
595.745	211.17
596.16	194.18
596.575	133.5
596.99	257.29
597.405	184.47
597.82	160.2
598.235	177.19
598.65	220.88
599.065	218.45
599.479	152.92
599.894	140.78
600.309	182.04
600.724	172.33
601.138	162.62
601.553	201.46
601.967	155.34
602.382	257.29
602.796	97.09
603.21	152.92
603.625	196.6
604.039	225.73
604.453	203.89
604.867	155.34
605.281	143.21
605.695	199.03
606.109	257.29
606.523	167.48
606.937	230.59
607.351	308.26
607.765	157.77
608.178	206.31
608.592	167.48
609.006	165.05
609.419	230.59
609.833	189.32
610.246	216.02
610.66	211.17
611.073	182.04
611.487	148.06
611.9	177.19
612.313	213.6
612.726	237.87
613.139	211.17
613.553	216.02
613.966	182.04
614.379	206.31
614.792	237.87
615.204	257.29
615.617	203.89
616.03	177.19
616.443	177.19
616.856	235.44
617.268	186.9
617.681	145.63
618.093	165.05
618.506	174.76
618.918	131.07
619.331	230.59
619.743	177.19
620.155	230.59
620.568	106.8
620.98	162.62
621.392	160.2
621.804	223.3
622.216	148.06
622.628	279.13
623.04	211.17
623.452	201.46
623.864	186.9
624.276	216.02
624.687	165.05
625.099	174.76
625.511	123.79
625.922	254.86
626.334	213.6
626.745	126.22
627.157	223.3
627.568	126.22
627.979	155.34
628.391	174.76
628.802	254.86
629.213	177.19
629.624	177.19
630.035	203.89
630.446	276.7
630.857	250
631.268	245.15
631.679	165.05
632.09	182.04
632.501	252.43
632.912	225.73
633.322	276.7
633.733	152.92
634.144	233.01
634.554	109.22
634.965	206.31
635.375	218.45
635.785	208.74
636.196	152.92
636.606	131.07
637.016	131.07
637.427	281.56
637.837	179.61
638.247	208.74
638.657	211.17
639.067	140.78
639.477	123.79
639.887	233.01
640.297	252.43
640.706	177.19
641.116	174.76
641.526	87.38
641.935	143.21
642.345	111.65
642.755	191.75
643.164	252.43
643.573	135.92
643.983	162.62
644.392	140.78
644.801	191.75
645.211	186.9
645.62	179.61
646.029	182.04
646.438	174.76
646.847	274.28
647.256	116.51
647.665	191.75
648.074	203.89
648.483	172.33
648.892	89.81
649.3	242.72
649.709	191.75
650.118	167.48
650.526	184.47
650.935	99.52
651.343	174.76
651.752	177.19
652.16	126.22
652.568	150.49
652.977	191.75
653.385	211.17
653.793	167.48
654.201	157.77
654.609	186.9
655.017	114.08
655.425	152.92
655.833	182.04
656.241	121.36
656.649	182.04
657.057	199.03
657.464	177.19
657.872	235.44
658.28	109.22
658.687	216.02
659.095	167.48
659.502	213.6
659.91	252.43
660.317	199.03
660.724	211.17
661.132	128.64
661.539	155.34
661.946	148.06
662.353	157.77
662.76	225.73
663.167	167.48
663.574	186.9
663.981	206.31
664.388	152.92
664.795	189.32
665.202	174.76
665.608	191.75
666.015	169.91
666.422	167.48
666.828	155.34
667.235	194.18
667.641	177.19
668.047	174.76
668.454	208.74
668.86	145.63
669.266	157.77
669.673	211.17
670.079	296.12
670.485	155.34
670.891	131.07
671.297	225.73
671.703	233.01
672.109	177.19
672.515	233.01
672.92	189.32
673.326	252.43
673.732	201.46
674.138	182.04
674.543	162.62
674.949	186.9
675.354	194.18
675.76	179.61
676.165	245.15
676.57	201.46
676.976	252.43
677.381	211.17
677.786	165.05
678.191	106.8
678.596	155.34
679.001	116.51
679.406	182.04
679.811	172.33
680.216	109.22
680.621	165.05
681.026	191.75
681.43	240.3
681.835	131.07
682.24	216.02
682.644	162.62
683.049	157.77
683.453	152.92
683.858	235.44
684.262	196.6
684.667	140.78
685.071	133.5
685.475	155.34
685.879	186.9
686.283	179.61
686.687	240.3
687.091	109.22
687.495	233.01
687.899	218.45
688.303	123.79
688.707	191.75
689.111	184.47
689.514	199.03
689.918	157.77
690.322	162.62
690.725	237.87
691.129	247.58
691.532	186.9
691.936	213.6
692.339	211.17
692.742	230.59
693.146	199.03
693.549	245.15
693.952	252.43
694.355	201.46
694.758	225.73
695.161	118.93
695.564	247.58
695.967	257.29
696.37	203.89
696.773	225.73
697.175	259.71
697.578	211.17
697.981	179.61
698.383	218.45
698.786	235.44
699.188	162.62
699.591	194.18
699.993	138.35
700.395	216.02
700.798	167.48
701.2	206.31
701.602	165.05
702.004	196.6
702.406	203.89
702.808	240.3
703.21	216.02
703.612	235.44
704.014	223.3
704.416	191.75
704.818	220.88
705.219	155.34
705.621	320.39
706.023	172.33
706.424	165.05
706.826	213.6
707.227	135.92
707.629	189.32
708.03	208.74
708.431	286.41
708.832	225.73
709.234	201.46
709.635	281.56
710.036	225.73
710.437	203.89
710.838	235.44
711.239	218.45
711.64	298.55
712.041	320.39
712.441	271.85
712.842	286.41
713.243	242.72
713.643	245.15
714.044	220.88
714.445	305.83
714.845	230.59
715.246	317.97
715.646	320.39
716.046	281.56
716.447	300.98
716.847	320.39
717.247	254.86
717.647	337.38
718.047	322.82
718.447	395.64
718.847	240.3
719.247	344.67
719.647	376.22
720.047	402.92
720.446	356.8
720.846	393.21
721.246	429.62
721.645	402.92
722.045	390.78
722.444	322.82
722.844	398.06
723.243	439.33
723.643	378.65
724.042	402.92
724.441	398.06
724.84	407.77
725.24	412.63
725.639	424.76
726.038	468.45
726.437	485.44
726.836	456.32
727.234	470.88
727.633	514.57
728.032	536.42
728.431	466.03
728.83	558.26
729.228	592.24
729.627	684.48
730.025	669.91
730.424	730.59
730.822	796.13
731.22	856.81
731.619	881.08
732.017	864.09
732.415	992.73
732.813	1087.4
733.212	1150.5
733.61	1177.2
734.008	1366.53
734.406	1376.23
734.803	1575.27
735.201	1626.24
735.599	1762.16
735.997	1834.98
736.395	1861.68
736.792	2024.3
737.19	2162.66
737.587	2318
737.985	2473.34
738.382	2594.7
738.78	2665.09
739.177	2912.67
739.574	2878.69
739.971	3101.99
740.369	3228.21
740.766	3468.5
741.163	3657.82
741.56	3706.37
741.957	3866.57
742.354	4109.29
742.751	4252.49
743.147	4318.03
743.544	4604.44
743.941	4703.96
744.338	5089.88
744.734	5194.26
745.131	5548.63
745.527	6012.23
745.924	6034.07
746.32	6519.52
746.716	6687
747.113	7019.53
747.509	7585.07
747.905	7825.36
748.301	8252.56
748.697	8572.95
749.093	8912.76
749.489	9167.62
749.885	9575.39
750.281	10247.73
750.677	10478.32
751.073	11060.85
751.468	11441.93
751.864	12014.75
752.26	12393.4
752.655	12963.79
753.051	13485.65
753.446	13784.19
753.842	14507.51
754.237	14990.52
754.632	15485.68
755.028	15691.99
755.423	15934.71
755.818	15859.47
756.213	16534.24
756.608	16864.34
757.003	17286.68
757.398	17354.64
757.793	17650.76
758.188	18289.12
758.583	18539.12
758.977	19077.97
759.372	19354.67
759.767	20611.97
760.161	21048.87
760.556	22342.58
760.95	23262.5
761.345	24413
761.739	25692.15
762.133	26464
762.527	27917.91
762.922	28366.95
763.316	28835.4
763.71	29721.34
764.104	30041.73
764.498	30481.06
764.892	31539.33
765.286	32680.12
765.68	33243.24
766.073	33529.65
766.467	33864.6
766.861	34318.49
767.255	36131.63
767.648	36961.74
768.042	37893.79
768.435	38874.39
768.829	39090.41
769.222	40607.43
769.615	41090.44
770.008	39522.46
770.402	40408.4
770.795	41367.15
771.188	41590.45
771.581	41296.76
771.974	41034.62
772.367	42277.36
772.76	42209.39
773.153	40680.24
773.545	41719.1
773.938	43177.86
774.331	43039.5
774.724	43012.81
775.116	44697.3
775.509	46262.86
775.901	48352.69
776.294	48830.86
776.686	50559.04
777.078	51029.92
777.471	51335.75
777.863	52537.22
778.255	54661.04
778.647	55233.87
779.039	55114.93
779.431	54498.42
779.823	54534.83
780.215	55520.28
780.607	55326.1
780.999	56726.61
781.39	56886.81
781.782	56957.2
782.174	56901.37
782.565	57644.1
782.957	57780.03
783.348	58949.95
783.74	58736.35
784.131	58195.08
784.522	59013.05
784.914	57986.34
785.305	58066.44
785.696	57513.03
786.087	57881.97
786.478	56542.14
786.869	54959.59
787.26	54474.15
787.651	53945.01
788.042	54367.35
788.433	52330.91
788.823	51136.72
789.214	50944.97
789.605	49898.83
789.995	50231.36
790.386	47940.07
790.776	48207.06
791.167	48469.2
791.557	49109.99
791.948	49270.18
792.338	50364.86
792.728	51886.73
793.118	51753.23
793.508	52051.78
793.898	51394
794.288	51884.3
794.678	51634.3
795.068	51583.33
795.458	51561.48
795.848	51813.91
796.238	52279.94
796.627	51809.06
797.017	50944.97
797.406	50631.86
797.796	50826.03
798.185	52296.93
798.575	52197.41
798.964	51549.35
799.354	51544.49
799.743	51949.84
800.132	52202.27
800.521	51843.04
800.91	50988.66
801.299	50440.1
801.688	50855.16
802.077	50025.05
802.466	49410.96
802.855	49876.99
803.244	48845.42
803.633	48707.07
804.021	48037.15
804.41	45903.63
804.799	44580.79
805.187	44109.91
805.576	44039.52
805.964	43362.32
806.352	40799.18
806.741	40498.2
807.129	40626.85
807.517	40046.74
807.905	39947.22
808.293	39549.16
808.681	40185.09
809.069	40685.1
809.457	42214.25
809.845	40578.3
810.233	40347.71
810.621	41806.48
811.009	41607.44
811.396	41794.34
811.784	40486.07
812.171	39221.48
812.559	40260.33
812.946	39995.77
813.334	39223.91
813.721	38063.7
814.108	37240.87
814.496	36738.44
814.883	36772.42
815.27	37221.45
815.657	36546.68
816.044	36015.12
816.431	35825.8
816.818	35796.67
817.205	35665.6
817.592	35663.18
817.979	34381.6
818.365	33949.56
818.752	32539.34
819.139	31993.22
819.525	31068.44
819.912	29981.05
820.298	29723.76
820.685	29087.83
821.071	28782
821.457	28107.23
821.843	26876.63
822.23	25806.23
822.616	25226.12
823.002	23434.83
823.388	23189.68
823.774	22723.65
824.16	21468.78
824.546	21211.5
824.931	20655.66
825.317	20854.69
825.703	20211.48
826.089	19439.62
826.474	19211.46
826.86	18461.45
827.245	18922.62
827.631	18764.86
828.016	18228.44
828.401	17585.23
828.787	16990.56
829.172	17240.56
829.557	16638.61
829.942	16388.6
830.327	15621.6
830.712	15104.6
831.097	14594.89
831.482	14524.5
831.867	14667.7
832.252	13793.9
832.636	13323.02
833.021	12951.66
833.406	12677.38
833.79	12985.64
834.175	12672.53
834.559	12602.14
834.944	11888.53
835.328	11650.67
835.713	11286.58
836.097	11352.12
836.481	10876.38
836.865	10444.34
837.249	9738.02
837.633	9325.39
838.017	9325.39
838.401	9109.36
838.785	8793.83
839.169	8369.06
839.553	7815.66
839.937	7337.49
840.32	7119.04
840.704	6910.3
841.087	6801.08
841.471	6429.71
841.854	6267.09
842.238	5876.3
842.621	5769.51
843.004	5786.5
843.388	5463.68
843.771	5869.02
844.154	5405.42
844.537	5114.16
844.92	5259.79
845.303	4936.97
845.686	5119.01
846.069	4835.03
846.452	5038.91
846.834	4631.14
847.217	4558.32
847.6	4303.46
847.982	4463.66
848.365	4347.15
848.748	4235.5
849.13	4109.29
849.512	3696.66
849.895	3757.34
850.277	3764.62
850.659	3618.99
851.041	3665.11
851.423	3602
851.806	3364.13
852.188	3242.77
852.57	3218.5
852.951	3184.52
853.333	3262.19
853.715	3106.84
854.097	2888.39
854.479	2781.6
854.86	2572.86
855.242	2601.98
855.623	2606.84
856.005	2453.92
856.386	2417.51
856.768	2184.5
857.149	2109.26
857.53	2046.15
857.911	2014.59
858.292	1995.18
858.674	2014.59
859.055	1713.62
859.436	1679.64
859.817	1509.73
860.197	1456.33
860.578	1495.17
860.959	1483.03
861.34	1344.68
861.72	1351.96
862.101	1339.83
862.482	1262.16
862.862	1233.03
863.243	1252.45
863.623	1250.02
864.003	1257.3
864.384	1184.48
864.764	1121.38
865.144	1046.13
865.524	1063.12
865.904	1050.99
866.284	963.61
866.664	917.49
867.044	822.83
867.424	844.67
867.804	805.84
868.183	830.11
868.563	815.55
868.943	786.42
869.322	740.3
869.702	728.17
870.081	689.33
870.461	643.21
870.84	616.51
871.22	747.58
871.599	582.53
871.978	538.84
872.357	575.25
872.736	531.56
873.115	524.28
873.494	550.98
873.873	553.41
874.252	546.12
874.631	439.33
875.01	453.89
875.388	458.74
875.767	407.77
876.146	463.6
876.524	381.07
876.903	342.24
877.281	388.36
877.66	405.35
878.038	320.39
878.416	378.65
878.794	322.82
879.173	303.4
879.551	366.51
879.929	320.39
880.307	373.79
880.685	334.96
881.063	334.96
881.441	356.8
881.818	325.25
882.196	317.97
882.574	298.55
882.951	310.68
883.329	313.11
883.707	315.54
884.084	264.57
884.461	250
884.839	235.44
885.216	237.87
885.593	305.83
885.971	240.3
886.348	276.7
886.725	240.3
887.102	203.89
887.479	264.57
887.856	218.45
888.233	228.16
888.609	208.74
888.986	138.35
889.363	145.63
889.74	211.17
890.116	184.47
890.493	186.9
890.869	169.91
891.246	233.01
891.622	225.73
891.998	247.58
892.375	252.43
892.751	174.76
893.127	182.04
893.503	233.01
893.879	145.63
894.255	182.04
894.631	182.04
895.007	184.47
895.383	254.86
895.759	184.47
896.134	225.73
896.51	184.47
896.886	245.15
897.261	126.22
897.637	145.63
898.012	240.3
898.388	199.03
898.763	167.48
899.138	128.64
899.514	223.3
899.889	131.07
900.264	140.78
900.639	228.16
901.014	235.44
901.389	228.16
901.764	262.14
902.139	167.48
902.513	89.81
902.888	152.92
903.263	199.03
903.638	128.64
904.012	165.05
904.387	131.07
904.761	140.78
905.136	194.18
905.51	169.91
905.884	148.06
906.259	75.24
906.633	121.36
907.007	143.21
907.381	155.34
907.755	140.78
908.129	174.76
908.503	121.36
908.877	157.77
909.251	150.49
909.624	167.48
909.998	106.8
910.372	182.04
910.745	165.05
911.119	172.33
911.492	191.75
911.866	216.02
912.239	169.91
912.612	162.62
912.986	109.22
913.359	245.15
913.732	213.6
914.105	106.8
914.478	152.92
914.851	143.21
915.224	196.6
915.597	111.65
915.97	101.94
916.343	184.47
916.715	213.6
917.088	179.61
917.461	150.49
917.833	152.92
918.206	131.07
918.578	116.51
918.951	75.24
919.323	128.64
919.695	135.92
920.067	199.03
920.44	211.17
920.812	140.78
921.184	145.63
921.556	257.29
921.928	160.2
922.3	165.05
922.672	145.63
923.043	230.59
923.415	196.6
923.787	225.73
924.158	194.18
924.53	179.61
924.901	240.3
925.273	131.07
925.644	148.06
926.016	148.06
926.387	184.47
926.758	128.64
927.129	92.23
927.5	135.92
927.872	189.32
928.243	157.77
928.613	126.22
928.984	199.03
929.355	128.64
929.726	177.19
930.097	148.06
930.467	150.49
930.838	169.91
931.209	97.09
931.579	118.93
931.95	135.92
932.32	201.46
932.69	133.5
933.061	131.07
933.431	177.19
933.801	160.2
934.171	182.04
934.541	184.47
934.911	177.19
935.281	114.08
935.651	135.92
936.021	194.18
936.391	131.07
936.761	162.62
937.13	118.93
937.5	128.64
937.87	157.77
938.239	184.47
938.609	184.47
938.978	179.61
939.347	118.93
939.717	155.34
940.086	194.18
940.455	114.08
940.824	160.2
941.193	148.06
941.562	167.48
941.931	186.9
942.3	286.41
942.669	104.37
943.038	160.2
943.407	233.01
943.775	169.91
944.144	157.77
944.513	182.04
944.881	199.03
945.25	155.34
945.618	116.51
945.986	194.18
946.355	194.18
946.723	138.35
947.091	123.79
947.459	123.79
947.827	165.05
948.195	218.45
948.563	131.07
948.931	162.62
949.299	145.63
949.667	92.23
950.035	128.64
950.402	101.94
950.77	121.36
951.138	72.82
951.505	213.6
951.873	211.17
952.24	203.89
952.607	167.48
952.975	179.61
953.342	148.06
953.709	118.93
954.076	118.93
954.443	131.07
954.81	140.78
955.177	167.48
955.544	160.2
955.911	157.77
956.278	174.76
956.645	179.61
957.012	167.48
957.378	216.02
957.745	208.74
958.111	167.48
958.478	220.88
958.844	155.34
959.211	189.32
959.577	140.78
959.943	123.79
960.309	194.18
960.675	162.62
961.042	150.49
961.408	143.21
961.774	182.04
962.139	152.92
962.505	199.03
962.871	118.93
963.237	160.2
963.603	182.04
963.968	165.05
964.334	211.17
964.699	128.64
965.065	133.5
965.43	186.9
965.796	186.9
966.161	160.2
966.526	216.02
966.891	174.76
967.256	135.92
967.622	116.51
967.987	155.34
968.352	148.06
968.716	99.52
969.081	186.9
969.446	128.64
969.811	89.81
970.176	216.02
970.54	201.46
970.905	218.45
971.269	172.33
971.634	140.78
971.998	206.31
972.363	172.33
972.727	101.94
973.091	111.65
973.455	191.75
973.819	235.44
974.183	140.78
974.547	148.06
974.911	109.22
975.275	194.18
975.639	206.31
976.003	199.03
976.367	101.94
976.73	196.6
977.094	152.92
977.458	199.03
977.821	157.77
978.185	97.09
978.548	150.49
978.911	145.63
979.275	189.32
979.638	160.2
980.001	145.63
980.364	199.03
980.727	184.47
981.09	206.31
981.453	128.64
981.816	199.03
982.179	191.75
982.542	228.16
982.905	162.62
983.267	160.2
983.63	92.23
983.992	104.37
984.355	152.92
984.717	167.48
985.08	126.22
985.442	269.42
985.804	155.34
986.167	216.02
986.529	126.22
986.891	182.04
987.253	160.2
987.615	143.21
987.977	201.46
988.339	155.34
988.701	211.17
989.062	128.64
989.424	140.78
989.786	97.09
990.147	104.37
990.509	167.48
990.87	199.03
991.232	162.62
991.593	189.32
991.955	109.22
992.316	220.88
992.677	165.05
993.038	184.47
993.399	131.07
993.76	196.6
994.121	199.03
994.482	148.06
994.843	140.78
995.204	145.63
995.565	155.34
995.926	150.49
996.286	148.06
996.647	184.47
997.007	186.9
997.368	182.04
997.728	208.74
998.089	230.59
998.449	174.76
998.809	169.91
999.169	143.21
999.53	82.53
999.89	97.09
1000.25	101.94
1000.61	131.07
1000.97	121.36
1001.329	216.02
1001.689	160.2
1002.049	189.32
1002.409	116.51
1002.768	177.19
1003.128	186.9
1003.487	167.48
1003.847	242.72
1004.206	182.04
1004.566	213.6
1004.925	160.2
1005.284	165.05
1005.643	189.32
1006.003	177.19
1006.362	150.49
1006.721	182.04
1007.08	138.35
1007.438	169.91
1007.797	206.31
1008.156	225.73
1008.515	150.49
1008.874	111.65
1009.232	118.93
1009.591	148.06
1009.949	150.49
1010.308	143.21
1010.666	211.17
1011.024	179.61
1011.383	213.6
1011.741	150.49
1012.099	157.77
1012.457	157.77
1012.815	203.89
1013.173	172.33
1013.531	143.21
1013.889	150.49
1014.247	148.06
1014.605	189.32
1014.962	165.05
1015.32	206.31
1015.678	126.22
1016.035	67.96
1016.393	150.49
1016.75	55.83
1017.107	242.72
1017.465	148.06
1017.822	196.6
1018.179	191.75
1018.536	184.47
1018.894	213.6
1019.251	143.21
1019.608	184.47
1019.964	165.05
1020.321	87.38
1020.678	169.91
1021.035	118.93
1021.392	145.63
1021.748	123.79
1022.105	140.78
1022.461	92.23
1022.818	220.88
1023.174	80.1
1023.531	174.76
1023.887	208.74
1024.243	131.07
1024.599	223.3
1024.955	203.89
1025.311	169.91
1025.667	128.64
1026.023	182.04
1026.379	242.72
1026.735	116.51
1027.091	174.76
1027.447	155.34
