189.514	110.74
189.973	110.74
190.431	110.74
190.889	50.06
191.348	-34.89
191.806	-22.76
192.264	-44.6
192.722	-17.9
193.18	1.52
193.638	20.93
194.096	-95.57
194.554	-51.88
195.012	13.65
195.47	67.05
195.928	16.08
196.385	8.8
196.843	8.8
197.301	-5.76
197.758	47.63
198.216	64.62
198.674	-64.02
199.131	30.64
199.589	40.35
200.046	64.62
200.503	103.46
200.961	69.48
201.418	159.29
201.875	88.9
202.332	93.75
202.79	118.02
203.247	110.74
203.704	149.58
204.161	52.49
204.618	137.44
205.075	79.19
205.532	115.6
205.989	154.43
206.445	127.73
206.902	171.42
207.359	161.71
207.816	166.57
208.272	122.88
208.729	173.85
209.185	113.17
209.642	144.72
210.098	190.84
210.555	164.14
211.011	154.43
211.467	125.31
211.924	171.42
212.38	154.43
212.836	110.74
213.292	161.71
213.748	154.43
214.204	142.3
214.66	144.72
215.116	144.72
215.572	159.29
216.028	166.57
216.484	110.74
216.94	156.86
217.396	149.58
217.851	154.43
218.307	135.01
218.763	147.15
219.218	190.84
219.674	156.86
220.129	181.13
220.585	118.02
221.04	103.46
221.496	135.01
221.951	101.03
222.406	130.16
222.861	166.57
223.317	139.87
223.772	105.89
224.227	98.61
224.682	142.3
225.137	156.86
225.592	176.28
226.047	159.29
226.502	135.01
226.957	224.82
227.411	156.86
227.866	103.46
228.321	93.75
228.776	118.02
229.23	113.17
229.685	178.7
230.139	101.03
230.594	139.87
231.048	125.31
231.503	69.48
231.957	108.31
232.411	113.17
232.865	266.08
233.32	147.15
233.774	149.58
234.228	152
234.682	113.17
235.136	76.76
235.59	42.78
236.044	108.31
236.498	166.57
236.952	127.73
237.406	127.73
237.86	166.57
238.313	159.29
238.767	154.43
239.221	171.42
239.674	195.69
240.128	156.86
240.581	127.73
241.035	169
241.488	229.68
241.942	127.73
242.395	159.29
242.848	132.59
243.301	103.46
243.755	200.55
244.208	173.85
244.661	137.44
245.114	171.42
245.567	144.72
246.02	171.42
246.473	169
246.926	185.99
247.379	101.03
247.832	222.39
248.284	115.6
248.737	195.69
249.19	115.6
249.642	154.43
250.095	108.31
250.547	202.98
251	79.19
251.452	98.61
251.905	137.44
252.357	205.4
252.81	176.28
253.262	164.14
253.714	142.3
254.166	190.84
254.618	205.4
255.07	173.85
255.523	84.04
255.975	173.85
256.427	156.86
256.878	105.89
257.33	142.3
257.782	183.56
258.234	200.55
258.686	236.96
259.137	171.42
259.589	147.15
260.041	161.71
260.492	139.87
260.944	147.15
261.395	171.42
261.847	156.86
262.298	108.31
262.749	118.02
263.201	147.15
263.652	79.19
264.103	132.59
264.554	154.43
265.005	181.13
265.457	110.74
265.908	169
266.359	115.6
266.809	108.31
267.26	113.17
267.711	169
268.162	149.58
268.613	178.7
269.064	195.69
269.514	149.58
269.965	207.83
270.415	156.86
270.866	205.4
271.316	101.03
271.767	164.14
272.217	132.59
272.668	159.29
273.118	152
273.568	166.57
274.019	149.58
274.469	137.44
274.919	178.7
275.369	147.15
275.819	178.7
276.269	164.14
276.719	137.44
277.169	144.72
277.619	171.42
278.069	188.41
278.518	207.83
278.968	159.29
279.418	127.73
279.867	164.14
280.317	137.44
280.767	195.69
281.216	185.99
281.666	149.58
282.115	127.73
282.564	193.27
283.014	190.84
283.463	154.43
283.912	183.56
284.361	62.2
284.811	115.6
285.26	101.03
285.709	135.01
286.158	164.14
286.607	149.58
287.056	149.58
287.505	139.87
287.953	139.87
288.402	183.56
288.851	212.69
289.3	113.17
289.748	130.16
290.197	181.13
290.646	176.28
291.094	190.84
291.543	169
291.991	120.45
292.439	76.76
292.888	122.88
293.336	183.56
293.784	188.41
294.233	147.15
294.681	224.82
295.129	173.85
295.577	132.59
296.025	139.87
296.473	198.12
296.921	115.6
297.369	144.72
297.817	98.61
298.264	169
298.712	152
299.16	178.7
299.608	173.85
300.055	164.14
300.503	152
300.95	219.97
301.398	152
301.845	183.56
302.293	207.83
302.74	154.43
303.187	195.69
303.635	178.7
304.082	76.76
304.529	115.6
304.976	142.3
305.423	137.44
305.87	224.82
306.317	137.44
306.764	164.14
307.211	79.19
307.658	164.14
308.105	207.83
308.552	185.99
308.998	142.3
309.445	57.34
309.892	122.88
310.338	159.29
310.785	173.85
311.231	127.73
311.678	181.13
312.124	227.25
312.571	166.57
313.017	98.61
313.463	154.43
313.909	183.56
314.356	62.2
314.802	210.26
315.248	88.9
315.694	120.45
316.14	202.98
316.586	176.28
317.032	110.74
317.478	144.72
317.923	86.47
318.369	135.01
318.815	142.3
319.261	169
319.706	169
320.152	193.27
320.597	110.74
321.043	164.14
321.488	200.55
321.934	147.15
322.379	202.98
322.824	156.86
323.27	171.42
323.715	93.75
324.16	118.02
324.605	125.31
325.05	173.85
325.495	84.04
325.94	118.02
326.385	164.14
326.83	147.15
327.275	108.31
327.72	190.84
328.165	147.15
328.61	183.56
329.054	130.16
329.499	88.9
329.943	185.99
330.388	144.72
330.832	132.59
331.277	103.46
331.721	81.62
332.166	183.56
332.61	103.46
333.054	118.02
333.499	110.74
333.943	122.88
334.387	122.88
334.831	135.01
335.275	105.89
335.719	122.88
336.163	147.15
336.607	139.87
337.051	132.59
337.495	125.31
337.938	195.69
338.382	84.04
338.826	166.57
339.269	198.12
339.713	86.47
340.157	130.16
340.6	132.59
341.044	137.44
341.487	137.44
341.93	185.99
342.374	210.26
342.817	166.57
343.26	156.86
343.703	159.29
344.146	110.74
344.59	110.74
345.033	147.15
345.476	173.85
345.919	86.47
346.361	127.73
346.804	86.47
347.247	81.62
347.69	195.69
348.133	178.7
348.575	64.62
349.018	105.89
349.461	62.2
349.903	142.3
350.346	132.59
350.788	147.15
351.23	178.7
351.673	130.16
352.115	159.29
352.557	152
353	147.15
353.442	159.29
353.884	215.11
354.326	156.86
354.768	122.88
355.21	86.47
355.652	118.02
356.094	110.74
356.536	93.75
356.978	98.61
357.419	139.87
357.861	113.17
358.303	120.45
358.744	137.44
359.186	154.43
359.627	173.85
360.069	188.41
360.51	67.05
360.952	222.39
361.393	81.62
361.834	215.11
362.276	229.68
362.717	147.15
363.158	137.44
363.599	132.59
364.04	84.04
364.481	139.87
364.922	171.42
365.363	103.46
365.804	118.02
366.245	178.7
366.686	125.31
367.126	205.4
367.567	125.31
368.008	113.17
368.448	181.13
368.889	178.7
369.33	156.86
369.77	130.16
370.21	195.69
370.651	101.03
371.091	193.27
371.531	198.12
371.972	96.18
372.412	132.59
372.852	178.7
373.292	236.96
373.732	120.45
374.172	108.31
374.612	132.59
375.052	185.99
375.492	115.6
375.932	178.7
376.372	171.42
376.811	181.13
377.251	173.85
377.691	152
378.13	222.39
378.57	202.98
379.009	202.98
379.449	171.42
379.888	154.43
380.328	178.7
380.767	190.84
381.206	142.3
381.645	139.87
382.085	178.7
382.524	188.41
382.963	164.14
383.402	188.41
383.841	178.7
384.28	120.45
384.719	96.18
385.158	54.92
385.596	166.57
386.035	156.86
386.474	152
386.913	144.72
387.351	232.1
387.79	132.59
388.228	173.85
388.667	212.69
389.105	246.67
389.544	181.13
389.982	169
390.42	96.18
390.859	164.14
391.297	122.88
391.735	108.31
392.173	127.73
392.611	127.73
393.049	125.31
393.487	169
393.925	171.42
394.363	149.58
394.801	91.32
395.239	205.4
395.676	176.28
396.114	105.89
396.552	217.54
396.989	113.17
397.427	166.57
397.864	178.7
398.302	93.75
398.739	120.45
399.177	108.31
399.614	152
400.051	200.55
400.488	132.59
400.926	142.3
401.363	178.7
401.8	122.88
402.237	147.15
402.674	135.01
403.111	185.99
403.548	118.02
403.985	135.01
404.421	144.72
404.858	125.31
405.295	173.85
405.732	164.14
406.168	71.91
406.605	139.87
407.041	183.56
407.478	159.29
407.914	142.3
408.351	156.86
408.787	159.29
409.223	161.71
409.66	195.69
410.096	181.13
410.532	195.69
410.968	130.16
411.404	142.3
411.84	154.43
412.276	137.44
412.712	198.12
413.148	161.71
413.584	108.31
414.02	120.45
414.455	105.89
414.891	149.58
415.327	132.59
415.762	108.31
416.198	93.75
416.633	125.31
417.069	164.14
417.504	130.16
417.94	101.03
418.375	173.85
418.81	159.29
419.245	161.71
419.681	202.98
420.116	166.57
420.551	219.97
420.986	149.58
421.421	183.56
421.856	135.01
422.291	139.87
422.726	152
423.16	207.83
423.595	130.16
424.03	147.15
424.464	195.69
424.899	193.27
425.334	156.86
425.768	159.29
426.203	135.01
426.637	169
427.071	229.68
427.506	152
427.94	113.17
428.374	188.41
428.809	142.3
429.243	101.03
429.677	125.31
430.111	173.85
430.545	215.11
430.979	181.13
431.413	171.42
431.847	149.58
432.28	178.7
432.714	91.32
433.148	132.59
433.582	137.44
434.015	178.7
434.449	159.29
434.882	181.13
435.316	234.53
435.749	173.85
436.183	115.6
436.616	142.3
437.049	135.01
437.483	147.15
437.916	127.73
438.349	256.38
438.782	156.86
439.215	195.69
439.648	159.29
440.081	115.6
440.514	125.31
440.947	135.01
441.38	195.69
441.813	127.73
442.245	219.97
442.678	188.41
443.111	188.41
443.543	212.69
443.976	64.62
444.408	142.3
444.841	244.24
445.273	181.13
445.705	171.42
446.138	207.83
446.57	130.16
447.002	173.85
447.434	215.11
447.867	135.01
448.299	183.56
448.731	142.3
449.163	181.13
449.595	215.11
450.026	198.12
450.458	232.1
450.89	161.71
451.322	188.41
451.754	103.46
452.185	173.85
452.617	156.86
453.048	181.13
453.48	224.82
453.911	200.55
454.343	185.99
454.774	166.57
455.205	176.28
455.637	171.42
456.068	241.81
456.499	258.8
456.93	217.54
457.361	181.13
457.792	188.41
458.223	181.13
458.654	164.14
459.085	217.54
459.516	232.1
459.947	195.69
460.378	161.71
460.808	169
461.239	183.56
461.669	195.69
462.1	176.28
462.531	215.11
462.961	183.56
463.391	200.55
463.822	239.38
464.252	185.99
464.682	159.29
465.113	217.54
465.543	166.57
465.973	149.58
466.403	198.12
466.833	224.82
467.263	202.98
467.693	166.57
468.123	246.67
468.553	176.28
468.983	236.96
469.412	190.84
469.842	241.81
470.272	234.53
470.701	156.86
471.131	273.37
471.56	176.28
471.99	217.54
472.419	263.66
472.849	156.86
473.278	195.69
473.707	159.29
474.136	164.14
474.566	173.85
474.995	154.43
475.424	181.13
475.853	181.13
476.282	164.14
476.711	144.72
477.14	125.31
477.569	132.59
477.997	166.57
478.426	224.82
478.855	164.14
479.283	185.99
479.712	219.97
480.141	232.1
480.569	227.25
480.998	169
481.426	210.26
481.854	195.69
482.283	198.12
482.711	193.27
483.139	222.39
483.567	164.14
483.995	193.27
484.424	190.84
484.852	190.84
485.28	183.56
485.708	188.41
486.135	236.96
486.563	159.29
486.991	185.99
487.419	171.42
487.847	166.57
488.274	178.7
488.702	159.29
489.129	202.98
489.557	161.71
489.984	253.95
490.412	278.22
490.839	166.57
491.266	169
491.694	222.39
492.121	164.14
492.548	115.6
492.975	185.99
493.402	154.43
493.829	185.99
494.256	118.02
494.683	195.69
495.11	210.26
495.537	152
495.964	169
496.39	236.96
496.817	176.28
497.244	161.71
497.67	125.31
498.097	113.17
498.523	142.3
498.95	239.38
499.376	118.02
499.803	181.13
500.229	164.14
500.655	139.87
501.081	236.96
501.508	137.44
501.934	198.12
502.36	188.41
502.786	193.27
503.212	137.44
503.638	118.02
504.064	147.15
504.489	164.14
504.915	149.58
505.341	154.43
505.767	173.85
506.192	193.27
506.618	149.58
507.043	169
507.469	166.57
507.894	144.72
508.32	130.16
508.745	193.27
509.17	171.42
509.596	198.12
510.021	135.01
510.446	152
510.871	161.71
511.296	135.01
511.721	161.71
512.146	79.19
512.571	115.6
512.996	183.56
513.421	103.46
513.845	183.56
514.27	200.55
514.695	183.56
515.119	188.41
515.544	164.14
515.969	98.61
516.393	202.98
516.817	227.25
517.242	137.44
517.666	178.7
518.09	156.86
518.515	118.02
518.939	120.45
519.363	399.58
519.787	118.02
520.211	198.12
520.635	183.56
521.059	144.72
521.483	137.44
521.907	159.29
522.331	173.85
522.754	147.15
523.178	193.27
523.602	217.54
524.025	152
524.449	246.67
524.872	149.58
525.296	149.58
525.719	219.97
526.143	232.1
526.566	144.72
526.989	125.31
527.412	149.58
527.836	185.99
528.259	152
528.682	195.69
529.105	190.84
529.528	224.82
529.951	147.15
530.374	166.57
530.796	147.15
531.219	164.14
531.642	130.16
532.065	171.42
532.487	149.58
532.91	171.42
533.332	135.01
533.755	125.31
534.177	125.31
534.6	178.7
535.022	195.69
535.444	156.86
535.867	135.01
536.289	142.3
536.711	159.29
537.133	108.31
537.555	249.09
537.977	229.68
538.399	198.12
538.821	188.41
539.243	212.69
539.665	253.95
540.086	200.55
540.508	212.69
540.93	171.42
541.351	183.56
541.773	222.39
542.195	249.09
542.616	246.67
543.037	275.79
543.459	215.11
543.88	200.55
544.301	200.55
544.723	263.66
545.144	300.07
545.565	275.79
545.986	219.97
546.407	249.09
546.828	130.16
547.249	212.69
547.67	244.24
548.091	164.14
548.512	198.12
548.932	198.12
549.353	249.09
549.774	161.71
550.194	207.83
550.615	241.81
551.035	120.45
551.456	224.82
551.876	139.87
552.296	227.25
552.717	152
553.137	178.7
553.557	135.01
553.977	210.26
554.397	161.71
554.817	154.43
555.237	166.57
555.657	173.85
556.077	159.29
556.497	142.3
556.917	246.67
557.337	115.6
557.756	212.69
558.176	110.74
558.596	132.59
559.015	156.86
559.435	253.95
559.854	227.25
560.274	147.15
560.693	190.84
561.112	130.16
561.532	154.43
561.951	178.7
562.37	135.01
562.789	227.25
563.208	154.43
563.627	217.54
564.046	181.13
564.465	118.02
564.884	164.14
565.303	120.45
565.722	113.17
566.14	147.15
566.559	185.99
566.978	205.4
567.396	249.09
567.815	154.43
568.233	188.41
568.652	156.86
569.07	118.02
569.489	210.26
569.907	166.57
570.325	181.13
570.743	171.42
571.161	166.57
571.58	173.85
571.998	137.44
572.416	219.97
572.833	161.71
573.251	173.85
573.669	236.96
574.087	195.69
574.505	173.85
574.922	135.01
575.34	118.02
575.758	137.44
576.175	251.52
576.593	149.58
577.01	181.13
577.428	202.98
577.845	1496.69
578.262	202.98
578.68	156.86
579.097	156.86
579.514	139.87
579.931	169
580.348	229.68
580.765	185.99
581.182	169
581.599	142.3
582.016	127.73
582.433	215.11
582.849	120.45
583.266	190.84
583.683	154.43
584.099	152
584.516	173.85
584.933	251.52
585.349	183.56
585.765	161.71
586.182	144.72
586.598	154.43
587.014	142.3
587.431	215.11
587.847	178.7
588.263	156.86
588.679	183.56
589.095	142.3
589.511	127.73
589.927	122.88
590.343	198.12
590.759	178.7
591.174	142.3
591.59	88.9
592.006	118.02
592.421	161.71
592.837	181.13
593.252	115.6
593.668	154.43
594.083	156.86
594.499	183.56
594.914	164.14
595.329	156.86
595.745	173.85
596.16	120.45
596.575	156.86
596.99	200.55
597.405	118.02
597.82	185.99
598.235	169
598.65	190.84
599.065	205.4
599.479	147.15
599.894	188.41
600.309	195.69
600.724	149.58
601.138	210.26
601.553	224.82
601.967	152
602.382	144.72
602.796	101.03
603.21	108.31
603.625	173.85
604.039	142.3
604.453	210.26
604.867	217.54
605.281	139.87
605.695	173.85
606.109	200.55
606.523	222.39
606.937	212.69
607.351	234.53
607.765	205.4
608.178	120.45
608.592	144.72
609.006	130.16
609.419	159.29
609.833	205.4
610.246	178.7
610.66	169
611.073	166.57
611.487	205.4
611.9	207.83
612.313	185.99
612.726	215.11
613.139	246.67
613.553	200.55
613.966	178.7
614.379	217.54
614.792	202.98
615.204	190.84
615.617	67.05
616.03	161.71
616.443	210.26
616.856	190.84
617.268	71.91
617.681	164.14
618.093	190.84
618.506	144.72
618.918	188.41
619.331	232.1
619.743	152
620.155	210.26
620.568	190.84
620.98	135.01
621.392	161.71
621.804	193.27
622.216	142.3
622.628	227.25
623.04	222.39
623.452	125.31
623.864	234.53
624.276	147.15
624.687	88.9
625.099	149.58
625.511	130.16
625.922	193.27
626.334	156.86
626.745	67.05
627.157	171.42
627.568	173.85
627.979	219.97
628.391	161.71
628.802	135.01
629.213	98.61
629.624	132.59
630.035	115.6
630.446	137.44
630.857	154.43
631.268	118.02
631.679	210.26
632.09	173.85
632.501	105.89
632.912	147.15
633.322	144.72
633.733	161.71
634.144	185.99
634.554	188.41
634.965	188.41
635.375	154.43
635.785	142.3
636.196	137.44
636.606	205.4
637.016	198.12
637.427	93.75
637.837	173.85
638.247	154.43
638.657	137.44
639.067	176.28
639.477	142.3
639.887	190.84
640.297	156.86
640.706	166.57
641.116	202.98
641.526	118.02
641.935	142.3
642.345	135.01
642.755	173.85
643.164	149.58
643.573	263.66
643.983	273.37
644.392	190.84
644.801	152
645.211	101.03
645.62	195.69
646.029	154.43
646.438	156.86
646.847	169
647.256	125.31
647.665	135.01
648.074	207.83
648.483	198.12
648.892	130.16
649.3	132.59
649.709	118.02
650.118	130.16
650.526	205.4
650.935	147.15
651.343	190.84
651.752	149.58
652.16	193.27
652.568	169
652.977	149.58
653.385	127.73
653.793	161.71
654.201	118.02
654.609	215.11
655.017	171.42
655.425	156.86
655.833	171.42
656.241	161.71
656.649	113.17
657.057	88.9
657.464	200.55
657.872	173.85
658.28	118.02
658.687	198.12
659.095	193.27
659.502	164.14
659.91	185.99
660.317	137.44
660.724	212.69
661.132	185.99
661.539	190.84
661.946	91.32
662.353	101.03
662.76	147.15
663.167	171.42
663.574	139.87
663.981	137.44
664.388	113.17
664.795	122.88
665.202	207.83
665.608	144.72
666.015	178.7
666.422	110.74
666.828	156.86
667.235	195.69
667.641	115.6
668.047	161.71
668.454	193.27
668.86	154.43
669.266	188.41
669.673	173.85
670.079	173.85
670.485	84.04
670.891	176.28
671.297	113.17
671.703	135.01
672.109	159.29
672.515	113.17
672.92	178.7
673.326	156.86
673.732	198.12
674.138	149.58
674.543	185.99
674.949	110.74
675.354	178.7
675.76	147.15
676.165	144.72
676.57	69.48
676.976	118.02
677.381	166.57
677.786	239.38
678.191	195.69
678.596	188.41
679.001	188.41
679.406	113.17
679.811	154.43
680.216	142.3
680.621	166.57
681.026	166.57
681.43	159.29
681.835	147.15
682.24	147.15
682.644	173.85
683.049	88.9
683.453	98.61
683.858	183.56
684.262	185.99
684.667	142.3
685.071	149.58
685.475	118.02
685.879	185.99
686.283	171.42
686.687	156.86
687.091	198.12
687.495	122.88
687.899	159.29
688.303	173.85
688.707	113.17
689.111	166.57
689.514	183.56
689.918	147.15
690.322	139.87
690.725	122.88
691.129	144.72
691.532	125.31
691.936	173.85
692.339	198.12
692.742	164.14
693.146	135.01
693.549	234.53
693.952	169
694.355	74.33
694.758	181.13
695.161	127.73
695.564	236.96
695.967	188.41
696.37	105.89
696.773	176.28
697.175	93.75
697.578	176.28
697.981	232.1
698.383	166.57
698.786	205.4
699.188	200.55
699.591	74.33
699.993	171.42
700.395	115.6
700.798	183.56
701.2	156.86
701.602	183.56
702.004	212.69
702.406	152
702.808	161.71
703.21	181.13
703.612	183.56
704.014	215.11
704.416	193.27
704.818	164.14
705.219	185.99
705.621	127.73
706.023	144.72
706.424	185.99
706.826	154.43
707.227	173.85
707.629	236.96
708.03	169
708.431	241.81
708.832	212.69
709.234	273.37
709.635	202.98
710.036	268.51
710.437	198.12
710.838	249.09
711.239	183.56
711.64	173.85
712.041	200.55
712.441	183.56
712.842	202.98
713.243	193.27
713.643	147.15
714.044	212.69
714.445	188.41
714.845	244.24
715.246	181.13
715.646	278.22
716.046	215.11
716.447	217.54
716.847	251.52
717.247	159.29
717.647	176.28
718.047	224.82
718.447	222.39
718.847	202.98
719.247	266.08
719.647	212.69
720.047	219.97
720.446	244.24
720.846	183.56
721.246	324.34
721.645	239.38
722.045	234.53
722.444	307.35
722.844	261.23
723.243	324.34
723.643	285.5
724.042	307.35
724.441	336.47
724.84	309.77
725.24	302.49
725.639	360.75
726.038	297.64
726.437	292.78
726.836	275.79
727.234	326.76
727.633	338.9
728.032	261.23
728.431	346.18
728.83	365.6
729.228	321.91
729.627	469.97
730.025	455.41
730.424	472.4
730.822	576.77
731.22	537.93
731.619	496.67
732.017	620.46
732.415	632.59
732.813	741.82
733.212	817.06
733.61	948.13
734.008	914.15
734.406	938.42
734.803	892.31
735.201	933.57
735.599	1108.33
735.997	1292.8
736.395	1567.08
736.792	1528.24
737.19	1469.99
737.587	1368.04
737.985	1278.24
738.382	1491.83
738.78	1892.32
739.177	2135.05
739.574	2229.71
739.971	2135.05
740.369	1838.92
740.766	1792.81
741.163	1994.27
741.56	2181.16
741.957	2722.43
742.354	2972.44
742.751	2664.18
743.147	2506.41
743.544	2263.69
743.941	2314.66
744.338	3088.94
744.734	3703.03
745.131	4239.45
745.527	4205.47
745.924	3824.39
746.32	3353.51
746.716	3193.31
747.113	3962.74
747.509	5118.1
747.905	5982.19
748.301	6256.47
748.697	5659.37
749.093	4970.04
749.489	4321.97
749.885	5035.58
750.281	6271.03
750.677	7800.18
751.073	8705.54
751.468	8797.77
751.864	7598.72
752.26	6533.17
752.655	6322
753.051	7212.79
753.446	9055.06
753.842	10749.26
754.237	11268.68
754.632	10307.5
755.028	8877.87
755.423	7552.61
755.818	7508.92
756.213	8972.53
756.608	10472.55
757.003	11979.86
757.398	11521.11
757.793	10295.37
758.188	8499.22
758.583	7630.28
758.977	7943.39
759.372	10542.94
759.767	13365.8
760.161	15613.41
760.556	15273.6
760.95	13249.3
761.345	11402.18
761.739	10945.86
762.133	12637.64
762.527	16642.55
762.922	20351.35
763.316	22062.54
763.71	21145.05
764.104	18169.28
764.498	15550.3
764.892	14996.9
765.286	17341.59
765.68	21710.59
766.073	26562.61
766.467	28708.27
766.861	27569.91
767.255	23958.2
767.648	20496.98
768.042	19314.92
768.435	21589.23
768.829	27567.48
769.222	33048.15
769.615	35613.72
770.008	32926.79
770.402	27815.06
770.795	23380.52
771.188	21261.56
771.581	22671.77
771.974	26739.8
772.367	31805.41
772.76	33053
773.153	32179.2
773.545	27555.34
773.938	23089.25
774.331	19992.12
774.724	21783.41
775.116	27329.61
775.509	34036.03
775.901	38701.15
776.294	38232.69
776.686	34810.31
777.078	28589.34
777.471	25654.83
777.863	26613.58
778.255	32215.61
778.647	39405.04
779.039	46269.23
779.431	46771.66
779.823	42582.28
780.215	36475.39
780.607	30288.4
780.999	29271.39
781.39	32266.58
781.782	39460.87
782.174	47048.37
782.565	49788.7
782.957	47776.53
783.348	42375.96
783.74	35225.37
784.131	30701.02
784.522	31921.92
784.914	35914.7
785.305	42795.87
785.696	47315.36
786.087	47113.9
786.478	42596.84
786.869	35205.95
787.26	28849.05
787.651	25924.25
788.042	26484.94
788.433	29596.64
788.823	33603.98
789.214	35567.6
789.605	33509.32
789.995	29106.34
790.386	23737.32
790.776	20038.24
791.167	19382.89
791.557	22528.57
791.948	27667
792.338	33392.81
792.728	36074.89
793.118	35077.31
793.508	31038.41
793.898	26026.19
794.288	22264
794.678	21768.85
795.068	25829.59
795.458	30133.05
795.848	35193.81
796.238	37101.61
796.627	34460.79
797.017	30045.67
797.406	24980.06
797.796	21052.82
798.185	21715.45
798.575	25970.37
798.964	31538.42
799.354	37271.51
799.743	39691.45
800.132	37659.87
800.521	32594.26
800.91	26603.87
801.299	23327.12
801.688	23409.65
802.077	26205.81
802.466	31351.52
802.855	36943.84
803.244	37519.09
803.633	35312.75
804.021	30220.43
804.41	24470.34
804.799	20467.85
805.187	19035.79
805.576	20999.42
805.964	25028.61
806.352	28120.89
806.741	30196.16
807.129	28200.98
807.517	24399.95
807.905	20011.54
808.293	17174.11
808.681	16380.41
809.069	19098.9
809.457	24657.24
809.845	29300.52
810.233	31892.79
810.621	31904.93
811.009	29108.77
811.396	23778.59
811.784	19873.19
812.171	17870.73
812.559	18742.1
812.946	22305.26
813.334	26822.32
813.721	29764.12
814.108	30480.15
814.496	28409.73
814.883	24412.09
815.27	20132.9
815.657	16924.11
816.044	16652.26
816.431	19783.38
816.818	24098.98
817.205	29035.95
817.592	32344.25
817.979	30800.54
818.365	26361.15
818.752	20996.99
819.139	16688.67
819.525	14652.23
819.912	15108.55
820.298	17691.11
820.685	20914.46
821.071	23123.24
821.457	23652.37
821.843	21708.17
822.23	18509.09
822.616	14098.82
823.002	10741.98
823.388	9618.17
823.774	9957.98
824.16	12062.38
824.546	13999.31
824.931	15560.01
825.317	15504.19
825.703	14295.43
826.089	11873.06
826.474	9523.51
826.86	7683.68
827.245	7319.59
827.631	8632.72
828.016	10885.18
828.401	13142.5
828.787	14023.58
829.172	13681.34
829.557	12159.47
829.942	9746.81
830.327	7710.37
830.712	6555.02
831.097	6108.41
831.482	7074.44
831.867	8698.25
832.252	10164.3
832.636	11120.62
833.021	10802.66
833.406	9545.35
833.79	7773.48
834.175	6006.46
834.559	5254.03
834.944	5071.98
835.328	5965.2
835.713	7164.25
836.097	8445.82
836.481	8919.13
836.865	8739.52
837.249	7749.21
837.633	6137.53
838.017	4904.51
838.401	3914.2
838.785	3426.33
839.169	3802.55
839.553	4790.43
839.937	5470.05
840.32	5671.51
840.704	5528.3
841.087	4904.51
841.471	4033.13
841.854	3096.23
842.238	2360.78
842.621	2003.98
843.004	2275.82
843.388	2698.16
843.771	3489.44
844.154	4030.71
844.537	4256.44
844.92	4067.11
845.303	3482.15
845.686	2695.73
846.069	2161.74
846.452	1821.93
846.834	1892.32
847.217	2295.24
847.6	2654.47
847.982	3275.84
848.365	3693.32
848.748	3484.58
849.13	3280.69
849.512	2615.64
849.895	2222.43
850.277	1593.77
850.659	1506.39
851.041	1652.03
851.423	2067.08
851.806	2489.42
852.188	2807.39
852.57	3057.39
852.951	2928.75
853.333	2574.37
853.715	2076.79
854.097	1540.38
854.479	1246.68
854.86	1205.42
855.242	1438.43
855.623	1647.17
856.005	1965.14
856.386	2234.56
856.768	2113.2
857.149	1921.45
857.53	1686.01
857.911	1343.77
858.292	1091.34
858.674	914.15
859.055	807.35
859.436	875.32
859.817	1105.9
860.197	1166.58
860.578	1341.34
860.959	1380.18
861.34	1219.98
861.72	1011.24
862.101	802.5
862.482	671.43
862.862	591.33
863.243	469.97
863.623	681.14
864.003	812.21
864.384	855.9
864.764	1035.51
865.144	885.03
865.524	804.93
865.904	698.13
866.284	690.85
866.664	530.65
867.044	387.45
867.424	443.27
867.804	414.14
868.183	571.91
868.563	652.01
868.943	654.44
869.322	664.15
869.702	654.44
870.081	499.1
870.461	484.53
870.84	377.74
871.22	389.87
871.599	402.01
871.978	397.15
872.357	368.03
872.736	428.71
873.115	438.42
873.494	462.69
873.873	419
874.252	382.59
874.631	343.76
875.01	321.91
875.388	207.83
875.767	285.5
876.146	198.12
876.524	278.22
876.903	280.65
877.281	244.24
877.66	336.47
878.038	343.76
878.416	285.5
878.794	236.96
879.173	280.65
879.551	176.28
879.929	185.99
880.307	210.26
880.685	236.96
881.063	227.25
881.441	200.55
881.818	210.26
882.196	188.41
882.574	261.23
882.951	241.81
883.329	156.86
883.707	212.69
884.084	154.43
884.461	234.53
884.839	193.27
885.216	164.14
885.593	185.99
885.971	178.7
886.348	171.42
886.725	118.02
887.102	219.97
887.479	135.01
887.856	161.71
888.233	195.69
888.609	263.66
888.986	188.41
889.363	169
889.74	176.28
890.116	137.44
890.493	171.42
890.869	183.56
891.246	222.39
891.622	161.71
891.998	171.42
892.375	118.02
892.751	181.13
893.127	188.41
893.503	178.7
893.879	105.89
894.255	183.56
894.631	173.85
895.007	198.12
895.383	176.28
895.759	178.7
896.134	176.28
896.51	185.99
896.886	84.04
897.261	176.28
897.637	135.01
898.012	149.58
898.388	190.84
898.763	93.75
899.138	59.77
899.514	193.27
899.889	183.56
900.264	149.58
900.639	166.57
901.014	185.99
901.389	166.57
901.764	96.18
902.139	190.84
902.513	59.77
902.888	118.02
903.263	132.59
903.638	139.87
904.012	110.74
904.387	113.17
904.761	137.44
905.136	139.87
905.51	166.57
905.884	42.78
906.259	79.19
906.633	88.9
907.007	183.56
907.381	185.99
907.755	178.7
908.129	164.14
908.503	154.43
908.877	142.3
909.251	101.03
909.624	135.01
909.998	139.87
910.372	130.16
910.745	200.55
911.119	127.73
911.492	236.96
911.866	105.89
912.239	181.13
912.612	130.16
912.986	118.02
913.359	169
913.732	135.01
914.105	135.01
914.478	156.86
914.851	115.6
915.224	81.62
915.597	205.4
915.97	183.56
916.343	147.15
916.715	171.42
917.088	132.59
917.461	190.84
917.833	132.59
918.206	154.43
918.578	108.31
918.951	91.32
919.323	156.86
919.695	190.84
920.067	169
920.44	120.45
920.812	118.02
921.184	193.27
921.556	164.14
921.928	120.45
922.3	169
922.672	156.86
923.043	195.69
923.415	135.01
923.787	130.16
924.158	40.35
924.53	166.57
924.901	183.56
925.273	122.88
925.644	166.57
926.016	161.71
926.387	185.99
926.758	154.43
927.129	149.58
927.5	125.31
927.872	166.57
928.243	188.41
928.613	164.14
928.984	142.3
929.355	118.02
929.726	159.29
930.097	76.76
930.467	164.14
930.838	190.84
931.209	195.69
931.579	156.86
931.95	118.02
932.32	144.72
932.69	139.87
933.061	108.31
933.431	161.71
933.801	198.12
934.171	154.43
934.541	176.28
934.911	137.44
935.281	173.85
935.651	164.14
936.021	224.82
936.391	113.17
936.761	110.74
937.13	71.91
937.5	173.85
937.87	166.57
938.239	125.31
938.609	101.03
938.978	81.62
939.347	98.61
939.717	118.02
940.086	176.28
940.455	147.15
940.824	139.87
941.193	108.31
941.562	98.61
941.931	171.42
942.3	176.28
942.669	190.84
943.038	132.59
943.407	176.28
943.775	173.85
944.144	159.29
944.513	135.01
944.881	115.6
945.25	113.17
945.618	84.04
945.986	210.26
946.355	198.12
946.723	118.02
947.091	110.74
947.459	127.73
947.827	152
948.195	152
948.563	181.13
948.931	173.85
949.299	159.29
949.667	113.17
950.035	185.99
950.402	130.16
950.77	54.92
951.138	205.4
951.505	171.42
951.873	198.12
952.24	154.43
952.607	88.9
952.975	98.61
953.342	149.58
953.709	152
954.076	96.18
954.443	166.57
954.81	127.73
955.177	190.84
955.544	147.15
955.911	93.75
956.278	190.84
956.645	101.03
957.012	142.3
957.378	137.44
957.745	169
958.111	178.7
958.478	164.14
958.844	222.39
959.211	188.41
959.577	127.73
959.943	98.61
960.309	188.41
960.675	173.85
961.042	164.14
961.408	96.18
961.774	91.32
962.139	181.13
962.505	190.84
962.871	115.6
963.237	127.73
963.603	120.45
963.968	159.29
964.334	185.99
964.699	127.73
965.065	161.71
965.43	130.16
965.796	81.62
966.161	193.27
966.526	113.17
966.891	178.7
967.256	176.28
967.622	144.72
967.987	127.73
968.352	130.16
968.716	130.16
969.081	86.47
969.446	137.44
969.811	113.17
970.176	101.03
970.54	200.55
970.905	144.72
971.269	118.02
971.634	178.7
971.998	88.9
972.363	142.3
972.727	130.16
973.091	154.43
973.455	173.85
973.819	118.02
974.183	139.87
974.547	125.31
974.911	47.63
975.275	198.12
975.639	185.99
976.003	144.72
976.367	122.88
976.73	176.28
977.094	253.95
977.458	169
977.821	159.29
978.185	98.61
978.548	122.88
978.911	122.88
979.275	166.57
979.638	118.02
980.001	147.15
980.364	156.86
980.727	91.32
981.09	171.42
981.453	144.72
981.816	159.29
982.179	185.99
982.542	161.71
982.905	176.28
983.267	98.61
983.63	127.73
983.992	159.29
984.355	142.3
984.717	161.71
985.08	144.72
985.442	130.16
985.804	183.56
986.167	171.42
986.529	181.13
986.891	154.43
987.253	122.88
987.615	161.71
987.977	108.31
988.339	190.84
988.701	152
989.062	86.47
989.424	118.02
989.786	98.61
990.147	142.3
990.509	101.03
990.87	164.14
991.232	164.14
991.593	132.59
991.955	198.12
992.316	222.39
992.677	193.27
993.038	105.89
993.399	76.76
993.76	127.73
994.121	173.85
994.482	105.89
994.843	156.86
995.204	169
995.565	118.02
995.926	171.42
996.286	156.86
996.647	137.44
997.007	164.14
997.368	181.13
997.728	57.34
998.089	69.48
998.449	185.99
998.809	166.57
999.169	130.16
999.53	64.62
999.89	144.72
1000.25	74.33
1000.61	169
1000.97	69.48
1001.329	84.04
1001.689	142.3
1002.049	130.16
1002.409	81.62
1002.768	188.41
1003.128	185.99
1003.487	217.54
1003.847	137.44
1004.206	139.87
1004.566	195.69
1004.925	120.45
1005.284	115.6
1005.643	147.15
1006.003	113.17
1006.362	74.33
1006.721	76.76
1007.08	135.01
1007.438	103.46
1007.797	139.87
1008.156	147.15
1008.515	152
1008.874	215.11
1009.232	173.85
1009.591	166.57
1009.949	144.72
1010.308	181.13
1010.666	161.71
1011.024	142.3
1011.383	130.16
1011.741	74.33
1012.099	166.57
1012.457	166.57
1012.815	193.27
1013.173	169
1013.531	149.58
1013.889	93.75
1014.247	115.6
1014.605	171.42
1014.962	127.73
1015.32	178.7
1015.678	33.07
1016.035	149.58
1016.393	130.16
1016.75	127.73
1017.107	137.44
1017.465	137.44
1017.822	147.15
1018.179	253.95
1018.536	144.72
1018.894	139.87
1019.251	98.61
1019.608	139.87
1019.964	103.46
1020.321	101.03
1020.678	115.6
1021.035	156.86
1021.392	173.85
1021.748	130.16
1022.105	173.85
1022.461	173.85
1022.818	139.87
1023.174	96.18
1023.531	205.4
1023.887	125.31
1024.243	110.74
1024.599	161.71
1024.955	164.14
1025.311	132.59
1025.667	98.61
1026.023	173.85
1026.379	135.01
1026.735	152
1027.091	113.17
1027.447	127.73
