189.514	52.19
189.973	52.19
190.431	52.19
190.889	30.34
191.348	-13.35
191.806	-37.62
192.264	13.35
192.722	40.05
193.18	-27.91
193.638	-91.02
194.096	18.2
194.554	-44.9
195.012	-10.92
195.47	-44.9
195.928	-13.35
196.385	42.48
196.843	-47.33
197.301	-54.61
197.758	69.18
198.216	47.33
198.674	30.34
199.131	74.03
199.589	103.16
200.046	6.07
200.503	69.18
200.961	42.48
201.418	103.16
201.875	95.88
202.332	32.77
202.79	59.47
203.247	108.01
203.704	112.87
204.161	69.18
204.618	88.59
205.075	137.14
205.532	132.28
205.989	115.29
206.445	154.13
206.902	144.42
207.359	146.85
207.816	197.82
208.272	149.27
208.729	127.43
209.185	40.05
209.642	98.3
210.098	175.97
210.555	224.52
211.011	226.95
211.467	127.43
211.924	156.56
212.38	188.11
212.836	76.46
213.292	137.14
213.748	158.98
214.204	168.69
214.66	195.39
215.116	197.82
215.572	100.73
216.028	100.73
216.484	127.43
216.94	190.54
217.396	178.4
217.851	108.01
218.307	49.76
218.763	132.28
219.218	78.88
219.674	103.16
220.129	61.89
220.585	91.02
221.04	61.89
221.496	122.57
221.951	81.31
222.406	103.16
222.861	105.58
223.317	161.41
223.772	173.55
224.227	161.41
224.682	125
225.137	154.13
225.592	175.97
226.047	110.44
226.502	161.41
226.957	183.26
227.411	88.59
227.866	122.57
228.321	183.26
228.776	83.74
229.23	112.87
229.685	115.29
230.139	120.15
230.594	103.16
231.048	78.88
231.503	141.99
231.957	205.1
232.411	137.14
232.865	144.42
233.32	139.57
233.774	81.31
234.228	100.73
234.682	183.26
235.136	175.97
235.59	127.43
236.044	122.57
236.498	205.1
236.952	183.26
237.406	144.42
237.86	154.13
238.313	127.43
238.767	161.41
239.221	180.83
239.674	146.85
240.128	93.45
240.581	175.97
241.035	91.02
241.488	149.27
241.942	110.44
242.395	86.17
242.848	129.86
243.301	120.15
243.755	127.43
244.208	137.14
244.661	173.55
245.114	141.99
245.567	178.4
246.02	175.97
246.473	120.15
246.926	120.15
247.379	117.72
247.832	132.28
248.284	129.86
248.737	120.15
249.19	95.88
249.642	44.9
250.095	154.13
250.547	125
251	158.98
251.452	76.46
251.905	137.14
252.357	86.17
252.81	141.99
253.262	154.13
253.714	175.97
254.166	103.16
254.618	166.26
255.07	180.83
255.523	103.16
255.975	93.45
256.427	74.03
256.878	134.71
257.33	100.73
257.782	178.4
258.234	110.44
258.686	175.97
259.137	115.29
259.589	137.14
260.041	141.99
260.492	108.01
260.944	185.68
261.395	110.44
261.847	166.26
262.298	112.87
262.749	91.02
263.201	183.26
263.652	139.57
264.103	219.66
264.554	139.57
265.005	115.29
265.457	134.71
265.908	127.43
266.359	88.59
266.809	183.26
267.26	163.84
267.711	146.85
268.162	125
268.613	161.41
269.064	212.38
269.514	88.59
269.965	158.98
270.415	129.86
270.866	88.59
271.316	88.59
271.767	163.84
272.217	137.14
272.668	134.71
273.118	125
273.568	185.68
274.019	44.9
274.469	112.87
274.919	173.55
275.369	127.43
275.819	161.41
276.269	173.55
276.719	166.26
277.169	108.01
277.619	183.26
278.069	144.42
278.518	120.15
278.968	112.87
279.418	195.39
279.867	183.26
280.317	146.85
280.767	76.46
281.216	146.85
281.666	112.87
282.115	78.88
282.564	287.63
283.014	134.71
283.463	180.83
283.912	175.97
284.361	173.55
284.811	156.56
285.26	161.41
285.709	112.87
286.158	156.56
286.607	178.4
287.056	171.12
287.505	117.72
287.953	122.57
288.402	110.44
288.851	115.29
289.3	168.69
289.748	188.11
290.197	95.88
290.646	178.4
291.094	175.97
291.543	64.32
291.991	173.55
292.439	129.86
292.888	132.28
293.336	105.58
293.784	88.59
294.233	122.57
294.681	195.39
295.129	161.41
295.577	139.57
296.025	127.43
296.473	163.84
296.921	161.41
297.369	178.4
297.817	81.31
298.264	151.7
298.712	88.59
299.16	125
299.608	81.31
300.055	93.45
300.503	125
300.95	110.44
301.398	141.99
301.845	146.85
302.293	224.52
302.74	183.26
303.187	110.44
303.635	141.99
304.082	91.02
304.529	120.15
304.976	69.18
305.423	127.43
305.87	122.57
306.317	127.43
306.764	144.42
307.211	217.24
307.658	108.01
308.105	122.57
308.552	154.13
308.998	129.86
309.445	146.85
309.892	168.69
310.338	137.14
310.785	64.32
311.231	168.69
311.678	190.54
312.124	154.13
312.571	95.88
313.017	178.4
313.463	83.74
313.909	132.28
314.356	81.31
314.802	127.43
315.248	166.26
315.694	139.57
316.14	144.42
316.586	120.15
317.032	197.82
317.478	158.98
317.923	141.99
318.369	127.43
318.815	134.71
319.261	149.27
319.706	93.45
320.152	129.86
320.597	78.88
321.043	144.42
321.488	132.28
321.934	180.83
322.379	110.44
322.824	137.14
323.27	197.82
323.715	151.7
324.16	76.46
324.605	180.83
325.05	146.85
325.495	163.84
325.94	144.42
326.385	185.68
326.83	32.77
327.275	161.41
327.72	137.14
328.165	151.7
328.61	127.43
329.054	86.17
329.499	103.16
329.943	161.41
330.388	134.71
330.832	122.57
331.277	158.98
331.721	166.26
332.166	168.69
332.61	49.76
333.054	110.44
333.499	175.97
333.943	161.41
334.387	137.14
334.831	154.13
335.275	158.98
335.719	144.42
336.163	100.73
336.607	144.42
337.051	180.83
337.495	178.4
337.938	134.71
338.382	144.42
338.826	202.67
339.269	146.85
339.713	98.3
340.157	88.59
340.6	158.98
341.044	166.26
341.487	161.41
341.93	108.01
342.374	183.26
342.817	149.27
343.26	120.15
343.703	146.85
344.146	117.72
344.59	190.54
345.033	120.15
345.476	166.26
345.919	105.58
346.361	105.58
346.804	129.86
347.247	171.12
347.69	112.87
348.133	81.31
348.575	132.28
349.018	103.16
349.461	168.69
349.903	197.82
350.346	105.58
350.788	168.69
351.23	49.76
351.673	154.13
352.115	173.55
352.557	151.7
353	134.71
353.442	100.73
353.884	239.08
354.326	185.68
354.768	132.28
355.21	100.73
355.652	78.88
356.094	129.86
356.536	139.57
356.978	64.32
357.419	209.95
357.861	115.29
358.303	161.41
358.744	129.86
359.186	163.84
359.627	137.14
360.069	154.13
360.51	125
360.952	132.28
361.393	163.84
361.834	154.13
362.276	163.84
362.717	137.14
363.158	127.43
363.599	151.7
364.04	137.14
364.481	100.73
364.922	144.42
365.363	108.01
365.804	171.12
366.245	120.15
366.686	86.17
367.126	134.71
367.567	163.84
368.008	205.1
368.448	125
368.889	120.15
369.33	129.86
369.77	151.7
370.21	146.85
370.651	110.44
371.091	71.6
371.531	137.14
371.972	137.14
372.412	137.14
372.852	163.84
373.292	141.99
373.732	161.41
374.172	146.85
374.612	202.67
375.052	122.57
375.492	149.27
375.932	144.42
376.372	115.29
376.811	190.54
377.251	139.57
377.691	171.12
378.13	137.14
378.57	207.53
379.009	86.17
379.449	86.17
379.888	103.16
380.328	54.61
380.767	144.42
381.206	83.74
381.645	197.82
382.085	144.42
382.524	110.44
382.963	108.01
383.402	122.57
383.841	127.43
384.28	146.85
384.719	127.43
385.158	127.43
385.596	151.7
386.035	95.88
386.474	178.4
386.913	137.14
387.351	154.13
387.79	166.26
388.228	103.16
388.667	78.88
389.105	154.13
389.544	149.27
389.982	61.89
390.42	120.15
390.859	171.12
391.297	151.7
391.735	173.55
392.173	178.4
392.611	132.28
393.049	178.4
393.487	163.84
393.925	129.86
394.363	180.83
394.801	105.58
395.239	115.29
395.676	105.58
396.114	178.4
396.552	141.99
396.989	175.97
397.427	105.58
397.864	139.57
398.302	139.57
398.739	183.26
399.177	122.57
399.614	112.87
400.051	154.13
400.488	163.84
400.926	122.57
401.363	112.87
401.8	151.7
402.237	163.84
402.674	105.58
403.111	134.71
403.548	88.59
403.985	125
404.421	154.13
404.858	139.57
405.295	151.7
405.732	154.13
406.168	95.88
406.605	115.29
407.041	151.7
407.478	76.46
407.914	144.42
408.351	78.88
408.787	178.4
409.223	27.91
409.66	103.16
410.096	158.98
410.532	146.85
410.968	158.98
411.404	122.57
411.84	86.17
412.276	127.43
412.712	144.42
413.148	91.02
413.584	151.7
414.02	185.68
414.455	188.11
414.891	100.73
415.327	173.55
415.762	127.43
416.198	190.54
416.633	146.85
417.069	212.38
417.504	166.26
417.94	54.61
418.375	91.02
418.81	156.56
419.245	175.97
419.681	149.27
420.116	88.59
420.551	112.87
420.986	98.3
421.421	146.85
421.856	122.57
422.291	156.56
422.726	127.43
423.16	120.15
423.595	156.56
424.03	122.57
424.464	47.33
424.899	95.88
425.334	137.14
425.768	146.85
426.203	149.27
426.637	129.86
427.071	127.43
427.506	57.04
427.94	200.25
428.374	207.53
428.809	158.98
429.243	117.72
429.677	117.72
430.111	117.72
430.545	120.15
430.979	161.41
431.413	76.46
431.847	137.14
432.28	171.12
432.714	88.59
433.148	137.14
433.582	185.68
434.015	64.32
434.449	115.29
434.882	132.28
435.316	88.59
435.749	219.66
436.183	151.7
436.616	125
437.049	120.15
437.483	212.38
437.916	195.39
438.349	183.26
438.782	214.81
439.215	236.65
439.648	202.67
440.081	234.23
440.514	270.64
440.947	129.86
441.38	141.99
441.813	175.97
442.245	156.56
442.678	98.3
443.111	166.26
443.543	154.13
443.976	139.57
444.408	146.85
444.841	154.13
445.273	122.57
445.705	171.12
446.138	156.56
446.57	125
447.002	103.16
447.434	156.56
447.867	205.1
448.299	185.68
448.731	205.1
449.163	222.09
449.595	178.4
450.026	202.67
450.458	197.82
450.89	190.54
451.322	185.68
451.754	108.01
452.185	171.12
452.617	173.55
453.048	222.09
453.48	144.42
453.911	168.69
454.343	175.97
454.774	209.95
455.205	163.84
455.637	205.1
456.068	175.97
456.499	175.97
456.93	185.68
457.361	224.52
457.792	222.09
458.223	214.81
458.654	195.39
459.085	166.26
459.516	205.1
459.947	166.26
460.378	175.97
460.808	168.69
461.239	243.94
461.669	234.23
462.1	173.55
462.531	200.25
462.961	163.84
463.391	173.55
463.822	154.13
464.252	125
464.682	241.51
465.113	166.26
465.543	183.26
465.973	180.83
466.403	166.26
466.833	175.97
467.263	207.53
467.693	197.82
468.123	146.85
468.553	185.68
468.983	217.24
469.412	156.56
469.842	212.38
470.272	231.8
470.701	117.72
471.131	229.37
471.56	129.86
471.99	197.82
472.419	171.12
472.849	175.97
473.278	110.44
473.707	183.26
474.136	217.24
474.566	188.11
474.995	166.26
475.424	163.84
475.853	185.68
476.282	166.26
476.711	178.4
477.14	226.95
477.569	197.82
477.997	236.65
478.426	163.84
478.855	229.37
479.283	207.53
479.712	171.12
480.141	173.55
480.569	132.28
480.998	168.69
481.426	122.57
481.854	195.39
482.283	171.12
482.711	243.94
483.139	185.68
483.567	171.12
483.995	132.28
484.424	183.26
484.852	156.56
485.28	188.11
485.708	222.09
486.135	129.86
486.563	122.57
486.991	108.01
487.419	144.42
487.847	173.55
488.274	226.95
488.702	161.41
489.129	207.53
489.557	149.27
489.984	175.97
490.412	158.98
490.839	202.67
491.266	168.69
491.694	149.27
492.121	175.97
492.548	180.83
492.975	163.84
493.402	154.13
493.829	188.11
494.256	171.12
494.683	185.68
495.11	212.38
495.537	132.28
495.964	139.57
496.39	117.72
496.817	185.68
497.244	212.38
497.67	115.29
498.097	163.84
498.523	173.55
498.95	137.14
499.376	158.98
499.803	168.69
500.229	93.45
500.655	158.98
501.081	205.1
501.508	231.8
501.934	183.26
502.36	168.69
502.786	134.71
503.212	163.84
503.638	180.83
504.064	105.58
504.489	163.84
504.915	117.72
505.341	110.44
505.767	146.85
506.192	190.54
506.618	163.84
507.043	134.71
507.469	214.81
507.894	192.96
508.32	100.73
508.745	166.26
509.17	134.71
509.596	137.14
510.021	137.14
510.446	100.73
510.871	144.42
511.296	178.4
511.721	224.52
512.146	132.28
512.571	127.43
512.996	139.57
513.421	151.7
513.845	127.43
514.27	120.15
514.695	154.13
515.119	175.97
515.544	103.16
515.969	161.41
516.393	214.81
516.817	190.54
517.242	129.86
517.666	127.43
518.09	105.58
518.515	154.13
518.939	175.97
519.363	421.12
519.787	222.09
520.211	78.88
520.635	127.43
521.059	212.38
521.483	190.54
521.907	161.41
522.331	137.14
522.754	108.01
523.178	149.27
523.602	207.53
524.025	156.56
524.449	205.1
524.872	161.41
525.296	173.55
525.719	178.4
526.143	122.57
526.566	149.27
526.989	146.85
527.412	175.97
527.836	180.83
528.259	188.11
528.682	134.71
529.105	132.28
529.528	127.43
529.951	195.39
530.374	91.02
530.796	134.71
531.219	175.97
531.642	139.57
532.065	188.11
532.487	161.41
532.91	132.28
533.332	180.83
533.755	168.69
534.177	86.17
534.6	214.81
535.022	166.26
535.444	158.98
535.867	122.57
536.289	134.71
536.711	171.12
537.133	173.55
537.555	137.14
537.977	149.27
538.399	246.36
538.821	146.85
539.243	224.52
539.665	178.4
540.086	163.84
540.508	180.83
540.93	108.01
541.351	93.45
541.773	161.41
542.195	180.83
542.616	190.54
543.037	86.17
543.459	195.39
543.88	112.87
544.301	168.69
544.723	139.57
545.144	146.85
545.565	219.66
545.986	192.96
546.407	166.26
546.828	163.84
547.249	185.68
547.67	108.01
548.091	122.57
548.512	166.26
548.932	110.44
549.353	241.51
549.774	115.29
550.194	158.98
550.615	166.26
551.035	200.25
551.456	173.55
551.876	69.18
552.296	175.97
552.717	163.84
553.137	163.84
553.557	144.42
553.977	52.19
554.397	120.15
554.817	173.55
555.237	95.88
555.657	171.12
556.077	103.16
556.497	200.25
556.917	163.84
557.337	163.84
557.756	132.28
558.176	76.46
558.596	44.9
559.015	139.57
559.435	146.85
559.854	207.53
560.274	171.12
560.693	188.11
561.112	175.97
561.532	144.42
561.951	185.68
562.37	146.85
562.789	154.13
563.208	139.57
563.627	180.83
564.046	175.97
564.465	224.52
564.884	168.69
565.303	141.99
565.722	185.68
566.14	236.65
566.559	158.98
566.978	141.99
567.396	158.98
567.815	134.71
568.233	185.68
568.652	158.98
569.07	219.66
569.489	139.57
569.907	117.72
570.325	151.7
570.743	154.13
571.161	188.11
571.58	129.86
571.998	93.45
572.416	217.24
572.833	139.57
573.251	144.42
573.669	161.41
574.087	95.88
574.505	180.83
574.922	129.86
575.34	91.02
575.758	134.71
576.175	183.26
576.593	112.87
577.01	171.12
577.428	141.99
577.845	1438.13
578.262	294.91
578.68	168.69
579.097	139.57
579.514	74.03
579.931	175.97
580.348	127.43
580.765	115.29
581.182	127.43
581.599	178.4
582.016	125
582.433	161.41
582.849	190.54
583.266	205.1
583.683	146.85
584.099	180.83
584.516	251.22
584.933	117.72
585.349	149.27
585.765	144.42
586.182	125
586.598	168.69
587.014	154.13
587.431	200.25
587.847	141.99
588.263	207.53
588.679	158.98
589.095	188.11
589.511	200.25
589.927	202.67
590.343	183.26
590.759	158.98
591.174	219.66
591.59	173.55
592.006	200.25
592.421	190.54
592.837	161.41
593.252	156.56
593.668	76.46
594.083	229.37
594.499	219.66
594.914	183.26
595.329	132.28
595.745	171.12
596.16	139.57
596.575	132.28
596.99	110.44
597.405	103.16
597.82	163.84
598.235	192.96
598.65	105.58
599.065	78.88
599.479	154.13
599.894	151.7
600.309	144.42
600.724	74.03
601.138	105.58
601.553	154.13
601.967	197.82
602.382	139.57
602.796	137.14
603.21	161.41
603.625	100.73
604.039	93.45
604.453	173.55
604.867	180.83
605.281	178.4
605.695	163.84
606.109	234.23
606.523	144.42
606.937	103.16
607.351	280.34
607.765	98.3
608.178	115.29
608.592	171.12
609.006	137.14
609.419	195.39
609.833	231.8
610.246	137.14
610.66	166.26
611.073	141.99
611.487	129.86
611.9	224.52
612.313	200.25
612.726	158.98
613.139	173.55
613.553	236.65
613.966	158.98
614.379	178.4
614.792	105.58
615.204	144.42
615.617	209.95
616.03	122.57
616.443	110.44
616.856	151.7
617.268	183.26
617.681	156.56
618.093	183.26
618.506	168.69
618.918	144.42
619.331	156.56
619.743	93.45
620.155	144.42
620.568	163.84
620.98	192.96
621.392	149.27
621.804	144.42
622.216	175.97
622.628	171.12
623.04	132.28
623.452	192.96
623.864	168.69
624.276	105.58
624.687	149.27
625.099	120.15
625.511	100.73
625.922	192.96
626.334	134.71
626.745	168.69
627.157	195.39
627.568	144.42
627.979	122.57
628.391	171.12
628.802	226.95
629.213	202.67
629.624	149.27
630.035	205.1
630.446	163.84
630.857	146.85
631.268	202.67
631.679	69.18
632.09	137.14
632.501	86.17
632.912	88.59
633.322	149.27
633.733	141.99
634.144	139.57
634.554	154.13
634.965	156.56
635.375	139.57
635.785	146.85
636.196	122.57
636.606	197.82
637.016	144.42
637.427	161.41
637.837	137.14
638.247	197.82
638.657	163.84
639.067	144.42
639.477	132.28
639.887	168.69
640.297	137.14
640.706	192.96
641.116	158.98
641.526	197.82
641.935	110.44
642.345	141.99
642.755	137.14
643.164	161.41
643.573	163.84
643.983	202.67
644.392	175.97
644.801	141.99
645.211	175.97
645.62	141.99
646.029	202.67
646.438	154.13
646.847	161.41
647.256	64.32
647.665	129.86
648.074	156.56
648.483	134.71
648.892	132.28
649.3	212.38
649.709	100.73
650.118	212.38
650.526	134.71
650.935	151.7
651.343	125
651.752	100.73
652.16	171.12
652.568	98.3
652.977	180.83
653.385	185.68
653.793	115.29
654.201	178.4
654.609	156.56
655.017	161.41
655.425	141.99
655.833	161.41
656.241	178.4
656.649	108.01
657.057	98.3
657.464	137.14
657.872	115.29
658.28	141.99
658.687	166.26
659.095	100.73
659.502	146.85
659.91	134.71
660.317	115.29
660.724	180.83
661.132	183.26
661.539	156.56
661.946	158.98
662.353	134.71
662.76	154.13
663.167	134.71
663.574	149.27
663.981	146.85
664.388	108.01
664.795	139.57
665.202	105.58
665.608	103.16
666.015	185.68
666.422	166.26
666.828	168.69
667.235	226.95
667.641	127.43
668.047	108.01
668.454	141.99
668.86	197.82
669.266	141.99
669.673	175.97
670.079	205.1
670.485	88.59
670.891	64.32
671.297	183.26
671.703	105.58
672.109	103.16
672.515	112.87
672.92	168.69
673.326	105.58
673.732	168.69
674.138	110.44
674.543	93.45
674.949	158.98
675.354	95.88
675.76	129.86
676.165	163.84
676.57	132.28
676.976	139.57
677.381	132.28
677.786	188.11
678.191	137.14
678.596	127.43
679.001	137.14
679.406	88.59
679.811	151.7
680.216	226.95
680.621	93.45
681.026	139.57
681.43	146.85
681.835	49.76
682.24	151.7
682.644	117.72
683.049	91.02
683.453	98.3
683.858	180.83
684.262	195.39
684.667	134.71
685.071	212.38
685.475	134.71
685.879	71.6
686.283	134.71
686.687	115.29
687.091	178.4
687.495	161.41
687.899	168.69
688.303	158.98
688.707	129.86
689.111	161.41
689.514	83.74
689.918	100.73
690.322	115.29
690.725	190.54
691.129	202.67
691.532	146.85
691.936	183.26
692.339	115.29
692.742	163.84
693.146	151.7
693.549	163.84
693.952	137.14
694.355	86.17
694.758	156.56
695.161	180.83
695.564	161.41
695.967	115.29
696.37	197.82
696.773	137.14
697.175	144.42
697.578	120.15
697.981	163.84
698.383	158.98
698.786	209.95
699.188	180.83
699.591	132.28
699.993	163.84
700.395	156.56
700.798	258.5
701.2	132.28
701.602	117.72
702.004	188.11
702.406	146.85
702.808	156.56
703.21	168.69
703.612	236.65
704.014	173.55
704.416	180.83
704.818	139.57
705.219	137.14
705.621	205.1
706.023	226.95
706.424	185.68
706.826	214.81
707.227	195.39
707.629	100.73
708.03	180.83
708.431	166.26
708.832	214.81
709.234	212.38
709.635	224.52
710.036	236.65
710.437	154.13
710.838	158.98
711.239	205.1
711.64	178.4
712.041	168.69
712.441	205.1
712.842	171.12
713.243	185.68
713.643	175.97
714.044	180.83
714.445	163.84
714.845	144.42
715.246	161.41
715.646	256.07
716.046	180.83
716.447	214.81
716.847	256.07
717.247	197.82
717.647	260.93
718.047	224.52
718.447	144.42
718.847	205.1
719.247	192.96
719.647	192.96
720.047	168.69
720.446	188.11
720.846	183.26
721.246	205.1
721.645	231.8
722.045	256.07
722.444	205.1
722.844	231.8
723.243	290.05
723.643	163.84
724.042	256.07
724.441	294.91
724.84	265.78
725.24	265.78
725.639	205.1
726.038	251.22
726.437	243.94
726.836	299.76
727.234	324.03
727.633	263.35
728.032	282.77
728.431	258.5
728.83	273.06
729.228	241.51
729.627	294.91
730.025	324.03
730.424	304.62
730.822	379.86
731.22	358.02
731.619	435.69
732.017	389.57
732.415	392
732.813	486.66
733.212	559.47
733.61	498.79
734.008	479.38
734.406	508.5
734.803	552.19
735.201	557.05
735.599	666.27
735.997	642
736.395	765.79
736.792	729.38
737.19	811.91
737.587	739.09
737.985	734.23
738.382	877.44
738.78	862.88
739.177	862.88
739.574	1083.75
739.971	967.25
740.369	1115.31
740.766	1142.01
741.163	1188.13
741.56	1127.44
741.957	1127.44
742.354	1185.7
742.751	1253.66
743.147	1459.97
743.544	1479.39
743.941	1486.67
744.338	1719.69
744.734	1695.41
745.131	1824.06
745.527	1709.98
745.924	1952.7
746.32	1955.13
746.716	1979.4
747.113	2146.88
747.509	2360.47
747.905	2375.04
748.301	2595.91
748.697	2666.3
749.093	2719.7
749.489	2676.01
749.885	2853.2
750.281	2989.12
750.677	2921.16
751.073	3321.65
751.468	3435.73
751.864	3719.72
752.26	3627.48
752.655	3957.59
753.051	3896.91
753.446	4023.12
753.842	4105.65
754.237	4311.96
754.632	4452.74
755.028	4797.4
755.423	4811.97
755.818	4809.54
756.213	4862.94
756.608	4845.95
757.003	5035.27
757.398	4860.51
757.793	4979.45
758.188	5142.07
758.583	5231.88
758.977	5673.63
759.372	6003.73
759.767	5972.18
760.161	5996.45
760.556	6219.76
760.95	6571.7
761.345	6700.35
761.739	7224.63
762.133	7802.31
762.527	8098.43
762.922	8028.04
763.316	8297.46
763.71	8319.3
764.104	8309.6
764.498	8435.81
764.892	8812.03
765.286	9217.38
765.68	9489.23
766.073	9707.68
766.467	9795.06
766.861	9695.54
767.255	9758.65
767.648	10144.58
768.042	10642.16
768.435	11227.12
768.829	11416.44
769.222	11681.01
769.615	11596.05
770.008	11469.84
770.402	10974.69
770.795	11380.03
771.188	11435.86
771.581	11962.56
771.974	11918.87
772.367	11736.83
772.76	12144.61
773.153	11236.83
773.545	11035.37
773.938	11409.16
774.331	11860.62
774.724	12380.05
775.116	13280.55
775.509	13452.88
775.901	13814.54
776.294	13168.89
776.686	13319.38
777.078	14020.85
777.471	14644.65
777.863	15445.63
778.255	16202.92
778.647	15972.34
779.039	16195.64
779.431	15219.9
779.823	15499.03
780.215	15938.35
780.607	16562.15
780.999	17428.67
781.39	17006.33
781.782	16756.33
782.174	16503.9
782.565	16438.36
782.957	16897.11
783.348	17377.7
783.74	17445.66
784.131	17846.15
784.522	17693.24
784.914	17387.41
785.305	16567.01
785.696	16312.15
786.087	16598.56
786.478	16707.78
786.869	16474.77
787.26	16222.34
787.651	15615.53
788.042	15134.94
788.433	14217.45
788.823	14139.78
789.214	14749.02
789.605	14639.79
789.995	14132.5
790.386	13576.67
790.776	13324.24
791.167	13299.96
791.557	13484.43
791.948	13972.3
792.338	14268.43
792.728	14812.12
793.118	14360.66
793.508	14329.11
793.898	14244.15
794.288	14448.04
794.678	14790.28
795.068	15134.94
795.458	14928.63
795.848	14734.45
796.238	14583.96
796.627	14045.12
797.017	14020.85
797.406	14358.23
797.796	14545.13
798.185	14950.48
798.575	14598.53
798.964	14268.43
799.354	14282.99
799.743	14365.51
800.132	14336.39
800.521	14581.54
800.91	14870.38
801.299	14414.06
801.688	14212.6
802.077	13797.54
802.466	13727.16
802.855	13986.87
803.244	13722.3
803.633	13627.64
804.021	12960.15
804.41	12690.73
804.799	12210.14
805.187	12241.7
805.576	12241.7
805.964	11986.84
806.352	11712.56
806.741	11202.84
807.129	10923.71
807.517	11035.37
807.905	10960.12
808.293	11059.64
808.681	11149.45
809.069	11183.43
809.457	11248.96
809.845	11076.63
810.233	11011.09
810.621	11498.97
811.009	11472.27
811.396	11282.94
811.784	11375.18
812.171	11117.89
812.559	10829.05
812.946	10792.64
813.334	10644.58
813.721	10627.59
814.108	10537.79
814.496	10253.8
814.883	9850.88
815.27	10389.72
815.657	10074.19
816.044	10372.73
816.431	10045.06
816.818	9981.95
817.205	9654.28
817.592	9608.16
817.979	9270.78
818.365	9513.5
818.752	8998.93
819.139	9137.28
819.525	8625.13
819.912	8207.65
820.298	8207.65
820.685	8178.53
821.071	8079.01
821.457	7773.18
821.843	7314.43
822.23	7253.75
822.616	6680.93
823.002	6430.93
823.388	6345.97
823.774	6248.88
824.16	6059.56
824.546	5763.44
824.931	5559.55
825.317	5617.81
825.703	5651.79
826.089	5452.75
826.474	5416.35
826.86	5142.07
827.245	5253.72
827.631	5078.96
828.016	5185.76
828.401	5069.25
828.787	4831.39
829.172	4865.37
829.557	4535.26
829.942	4316.81
830.327	4248.85
830.712	4338.66
831.097	4324.1
831.482	4236.72
831.867	4134.77
832.252	4037.68
832.636	3848.36
833.021	3858.07
833.406	3790.11
833.79	3697.87
834.175	3510.98
834.559	3493.99
834.944	3350.78
835.328	3290.1
835.713	3222.14
836.097	3195.44
836.481	3088.64
836.865	3054.66
837.249	2853.2
837.633	2705.14
838.017	2707.57
838.401	2581.35
838.785	2472.13
839.169	2370.18
839.553	2294.94
839.937	2214.84
840.32	2037.65
840.704	2010.95
841.087	1899.3
841.471	1802.21
841.854	1811.92
842.238	1683.28
842.621	1799.79
843.004	1714.83
843.388	1685.71
843.771	1583.76
844.154	1663.86
844.537	1598.33
844.92	1617.74
845.303	1549.78
845.686	1459.97
846.069	1510.95
846.452	1489.1
846.834	1348.32
847.217	1282.79
847.6	1338.61
847.982	1467.26
848.365	1285.21
848.748	1304.63
849.13	1137.15
849.512	1151.72
849.895	1180.84
850.277	1134.73
850.659	1088.61
851.041	976.96
851.423	1030.36
851.806	1057.06
852.188	1110.45
852.57	947.83
852.951	1023.07
853.333	962.39
853.715	853.17
854.097	925.99
854.479	908.99
854.86	858.02
855.242	765.79
855.623	833.75
856.005	848.31
856.386	731.81
856.768	741.52
857.149	661.42
857.53	709.96
857.911	576.47
858.292	581.32
858.674	576.47
859.055	566.76
859.436	537.63
859.817	559.47
860.197	557.05
860.578	457.53
860.959	416.27
861.34	498.79
861.72	421.12
862.101	479.38
862.482	418.7
862.862	520.64
863.243	392
863.623	438.11
864.003	503.65
864.384	467.24
864.764	416.27
865.144	425.98
865.524	413.84
865.904	428.4
866.284	396.85
866.664	387.14
867.044	384.71
867.424	404.13
867.804	350.73
868.183	292.48
868.563	333.74
868.943	311.9
869.322	319.18
869.702	253.64
870.081	314.33
870.461	275.49
870.84	343.45
871.22	304.62
871.599	273.06
871.978	241.51
872.357	265.78
872.736	263.35
873.115	282.77
873.494	294.91
873.873	270.64
874.252	246.36
874.631	188.11
875.01	197.82
875.388	195.39
875.767	222.09
876.146	161.41
876.524	192.96
876.903	236.65
877.281	190.54
877.66	161.41
878.038	222.09
878.416	234.23
878.794	253.64
879.173	171.12
879.551	280.34
879.929	125
880.307	212.38
880.685	277.92
881.063	212.38
881.441	214.81
881.818	197.82
882.196	251.22
882.574	168.69
882.951	209.95
883.329	209.95
883.707	190.54
884.084	91.02
884.461	178.4
884.839	91.02
885.216	108.01
885.593	154.13
885.971	163.84
886.348	175.97
886.725	139.57
887.102	146.85
887.479	197.82
887.856	112.87
888.233	166.26
888.609	144.42
888.986	168.69
889.363	146.85
889.74	149.27
890.116	161.41
890.493	163.84
890.869	171.12
891.246	188.11
891.622	110.44
891.998	253.64
892.375	122.57
892.751	161.41
893.127	158.98
893.503	175.97
893.879	141.99
894.255	127.43
894.631	108.01
895.007	120.15
895.383	86.17
895.759	161.41
896.134	117.72
896.51	156.56
896.886	212.38
897.261	83.74
897.637	122.57
898.012	166.26
898.388	105.58
898.763	166.26
899.138	100.73
899.514	64.32
899.889	137.14
900.264	125
900.639	202.67
901.014	161.41
901.389	146.85
901.764	76.46
902.139	171.12
902.513	161.41
902.888	144.42
903.263	158.98
903.638	117.72
904.012	144.42
904.387	171.12
904.761	144.42
905.136	168.69
905.51	139.57
905.884	161.41
906.259	100.73
906.633	91.02
907.007	98.3
907.381	149.27
907.755	205.1
908.129	151.7
908.503	117.72
908.877	71.6
909.251	144.42
909.624	78.88
909.998	112.87
910.372	120.15
910.745	134.71
911.119	151.7
911.492	115.29
911.866	127.43
912.239	108.01
912.612	146.85
912.986	95.88
913.359	161.41
913.732	146.85
914.105	137.14
914.478	125
914.851	103.16
915.224	139.57
915.597	108.01
915.97	188.11
916.343	108.01
916.715	137.14
917.088	139.57
917.461	110.44
917.833	161.41
918.206	173.55
918.578	132.28
918.951	217.24
919.323	95.88
919.695	105.58
920.067	134.71
920.44	127.43
920.812	173.55
921.184	125
921.556	180.83
921.928	115.29
922.3	158.98
922.672	224.52
923.043	37.62
923.415	190.54
923.787	202.67
924.158	71.6
924.53	125
924.901	243.94
925.273	69.18
925.644	224.52
926.016	132.28
926.387	139.57
926.758	161.41
927.129	171.12
927.5	151.7
927.872	185.68
928.243	120.15
928.613	134.71
928.984	120.15
929.355	125
929.726	98.3
930.097	108.01
930.467	144.42
930.838	183.26
931.209	168.69
931.579	156.56
931.95	105.58
932.32	144.42
932.69	154.13
933.061	98.3
933.431	120.15
933.801	151.7
934.171	137.14
934.541	122.57
934.911	127.43
935.281	139.57
935.651	149.27
936.021	125
936.391	139.57
936.761	122.57
937.13	74.03
937.5	134.71
937.87	108.01
938.239	192.96
938.609	98.3
938.978	134.71
939.347	192.96
939.717	110.44
940.086	171.12
940.455	149.27
940.824	137.14
941.193	151.7
941.562	132.28
941.931	117.72
942.3	222.09
942.669	134.71
943.038	52.19
943.407	171.12
943.775	168.69
944.144	125
944.513	120.15
944.881	69.18
945.25	103.16
945.618	161.41
945.986	158.98
946.355	141.99
946.723	190.54
947.091	127.43
947.459	134.71
947.827	125
948.195	76.46
948.563	88.59
948.931	183.26
949.299	93.45
949.667	71.6
950.035	183.26
950.402	117.72
950.77	146.85
951.138	110.44
951.505	219.66
951.873	163.84
952.24	81.31
952.607	146.85
952.975	158.98
953.342	180.83
953.709	141.99
954.076	134.71
954.443	127.43
954.81	180.83
955.177	154.13
955.544	166.26
955.911	139.57
956.278	88.59
956.645	154.13
957.012	88.59
957.378	207.53
957.745	151.7
958.111	112.87
958.478	173.55
958.844	125
959.211	54.61
959.577	37.62
959.943	168.69
960.309	178.4
960.675	127.43
961.042	129.86
961.408	129.86
961.774	105.58
962.139	134.71
962.505	122.57
962.871	88.59
963.237	154.13
963.603	166.26
963.968	127.43
964.334	105.58
964.699	129.86
965.065	158.98
965.43	163.84
965.796	117.72
966.161	137.14
966.526	95.88
966.891	207.53
967.256	108.01
967.622	117.72
967.987	125
968.352	110.44
968.716	132.28
969.081	115.29
969.446	91.02
969.811	105.58
970.176	117.72
970.54	105.58
970.905	54.61
971.269	95.88
971.634	132.28
971.998	137.14
972.363	185.68
972.727	120.15
973.091	120.15
973.455	117.72
973.819	127.43
974.183	149.27
974.547	173.55
974.911	122.57
975.275	175.97
975.639	125
976.003	125
976.367	95.88
976.73	40.05
977.094	171.12
977.458	115.29
977.821	180.83
978.185	125
978.548	127.43
978.911	171.12
979.275	195.39
979.638	222.09
980.001	173.55
980.364	239.08
980.727	190.54
981.09	120.15
981.453	137.14
981.816	149.27
982.179	175.97
982.542	137.14
982.905	219.66
983.267	158.98
983.63	178.4
983.992	120.15
984.355	98.3
984.717	100.73
985.08	127.43
985.442	188.11
985.804	125
986.167	156.56
986.529	108.01
986.891	122.57
987.253	86.17
987.615	190.54
987.977	163.84
988.339	158.98
988.701	146.85
989.062	122.57
989.424	161.41
989.786	166.26
990.147	156.56
990.509	81.31
990.87	209.95
991.232	171.12
991.593	154.13
991.955	127.43
992.316	144.42
992.677	93.45
993.038	108.01
993.399	161.41
993.76	132.28
994.121	112.87
994.482	190.54
994.843	132.28
995.204	100.73
995.565	195.39
995.926	125
996.286	178.4
996.647	115.29
997.007	117.72
997.368	120.15
997.728	192.96
998.089	168.69
998.449	166.26
998.809	59.47
999.169	141.99
999.53	86.17
999.89	115.29
1000.25	66.75
1000.61	120.15
1000.97	125
1001.329	139.57
1001.689	134.71
1002.049	141.99
1002.409	112.87
1002.768	171.12
1003.128	149.27
1003.487	127.43
1003.847	163.84
1004.206	144.42
1004.566	226.95
1004.925	158.98
1005.284	207.53
1005.643	163.84
1006.003	103.16
1006.362	197.82
1006.721	105.58
1007.08	151.7
1007.438	88.59
1007.797	171.12
1008.156	105.58
1008.515	226.95
1008.874	149.27
1009.232	86.17
1009.591	192.96
1009.949	171.12
1010.308	163.84
1010.666	141.99
1011.024	132.28
1011.383	95.88
1011.741	100.73
1012.099	78.88
1012.457	168.69
1012.815	149.27
1013.173	141.99
1013.531	54.61
1013.889	180.83
1014.247	200.25
1014.605	112.87
1014.962	108.01
1015.32	103.16
1015.678	54.61
1016.035	91.02
1016.393	125
1016.75	112.87
1017.107	154.13
1017.465	151.7
1017.822	178.4
1018.179	122.57
1018.536	78.88
1018.894	173.55
1019.251	139.57
1019.608	166.26
1019.964	108.01
1020.321	144.42
1020.678	149.27
1021.035	129.86
1021.392	166.26
1021.748	103.16
1022.105	66.75
1022.461	120.15
1022.818	144.42
1023.174	115.29
1023.531	161.41
1023.887	243.94
1024.243	146.85
1024.599	151.7
1024.955	154.13
1025.311	154.13
1025.667	151.7
1026.023	168.69
1026.379	171.12
1026.735	173.55
1027.091	144.42
1027.447	154.13
