189.514	105.43
189.973	105.43
190.431	105.43
190.889	39.9
191.348	39.9
191.806	22.91
192.264	-15.93
192.722	8.34
193.18	10.77
193.638	-45.06
194.096	49.61
194.554	-81.46
195.012	39.9
195.47	-54.76
195.928	3.49
196.385	-1.37
196.843	22.91
197.301	35.04
197.758	-23.21
198.216	3.49
198.674	27.76
199.131	20.48
199.589	-13.5
200.046	39.9
200.503	64.17
200.961	132.13
201.418	161.26
201.875	144.27
202.332	44.75
202.79	66.6
203.247	71.45
203.704	146.7
204.161	144.27
204.618	226.79
205.075	120
205.532	117.57
205.989	86.01
206.445	175.82
206.902	166.11
207.359	141.84
207.816	151.55
208.272	166.11
208.729	120
209.185	204.95
209.642	132.13
210.098	209.8
210.555	166.11
211.011	185.53
211.467	238.93
211.924	200.09
212.38	175.82
212.836	144.27
213.292	219.51
213.748	214.66
214.204	115.14
214.66	168.54
215.116	178.25
215.572	166.11
216.028	98.15
216.484	156.4
216.94	136.99
217.396	185.53
217.851	236.5
218.307	127.28
218.763	144.27
219.218	260.77
219.674	139.41
220.129	195.24
220.585	107.86
221.04	61.74
221.496	175.82
221.951	163.69
222.406	122.42
222.861	161.26
223.317	217.08
223.772	187.96
224.227	173.39
224.682	132.13
225.137	117.57
225.592	163.69
226.047	88.44
226.502	192.81
226.957	120
227.411	149.12
227.866	163.69
228.321	183.1
228.776	146.7
229.23	144.27
229.685	88.44
230.139	86.01
230.594	129.7
231.048	195.24
231.503	127.28
231.957	187.96
232.411	132.13
232.865	207.38
233.32	175.82
233.774	129.7
234.228	129.7
234.682	136.99
235.136	120
235.59	127.28
236.044	115.14
236.498	93.3
236.952	103.01
237.406	158.83
237.86	170.97
238.313	156.4
238.767	168.54
239.221	158.83
239.674	153.98
240.128	183.1
240.581	282.62
241.035	136.99
241.488	175.82
241.942	136.99
242.395	178.25
242.848	59.32
243.301	209.8
243.755	200.09
244.208	170.97
244.661	202.52
245.114	200.09
245.567	178.25
246.02	124.85
246.473	136.99
246.926	153.98
247.379	136.99
247.832	151.55
248.284	149.12
248.737	226.79
249.19	209.8
249.642	134.56
250.095	161.26
250.547	190.39
251	156.4
251.452	209.8
251.905	209.8
252.357	115.14
252.81	139.41
253.262	202.52
253.714	209.8
254.166	149.12
254.618	127.28
255.07	112.71
255.523	83.59
255.975	158.83
256.427	168.54
256.878	149.12
257.33	197.67
257.782	132.13
258.234	163.69
258.686	190.39
259.137	178.25
259.589	209.8
260.041	146.7
260.492	88.44
260.944	151.55
261.395	149.12
261.847	195.24
262.298	209.8
262.749	234.08
263.201	120
263.652	200.09
264.103	204.95
264.554	178.25
265.005	192.81
265.457	136.99
265.908	168.54
266.359	175.82
266.809	197.67
267.26	200.09
267.711	132.13
268.162	73.88
268.613	185.53
269.064	197.67
269.514	163.69
269.965	209.8
270.415	153.98
270.866	187.96
271.316	207.38
271.767	226.79
272.217	64.17
272.668	185.53
273.118	156.4
273.568	195.24
274.019	187.96
274.469	146.7
274.919	217.08
275.369	124.85
275.819	185.53
276.269	185.53
276.719	105.43
277.169	132.13
277.619	180.68
278.069	163.69
278.518	258.35
278.968	110.29
279.418	107.86
279.867	185.53
280.317	168.54
280.767	170.97
281.216	183.1
281.666	78.73
282.115	175.82
282.564	231.65
283.014	161.26
283.463	200.09
283.912	202.52
284.361	163.69
284.811	141.84
285.26	212.23
285.709	197.67
286.158	187.96
286.607	195.24
287.056	168.54
287.505	207.38
287.953	180.68
288.402	294.76
288.851	129.7
289.3	183.1
289.748	166.11
290.197	178.25
290.646	144.27
291.094	149.12
291.543	212.23
291.991	175.82
292.439	183.1
292.888	134.56
293.336	115.14
293.784	95.72
294.233	204.95
294.681	173.39
295.129	170.97
295.577	200.09
296.025	183.1
296.473	221.94
296.921	217.08
297.369	153.98
297.817	139.41
298.264	163.69
298.712	158.83
299.16	146.7
299.608	156.4
300.055	170.97
300.503	144.27
300.95	185.53
301.398	146.7
301.845	185.53
302.293	173.39
302.74	139.41
303.187	204.95
303.635	129.7
304.082	76.31
304.529	231.65
304.976	192.81
305.423	175.82
305.87	120
306.317	132.13
306.764	185.53
307.211	190.39
307.658	132.13
308.105	209.8
308.552	146.7
308.998	54.46
309.445	158.83
309.892	149.12
310.338	166.11
310.785	153.98
311.231	115.14
311.678	141.84
312.124	149.12
312.571	212.23
313.017	117.57
313.463	73.88
313.909	163.69
314.356	221.94
314.802	95.72
315.248	144.27
315.694	180.68
316.14	141.84
316.586	178.25
317.032	156.4
317.478	149.12
317.923	192.81
318.369	127.28
318.815	100.58
319.261	161.26
319.706	139.41
320.152	146.7
320.597	168.54
321.043	153.98
321.488	190.39
321.934	156.4
322.379	170.97
322.824	202.52
323.27	173.39
323.715	195.24
324.16	204.95
324.605	103.01
325.05	112.71
325.495	127.28
325.94	207.38
326.385	149.12
326.83	166.11
327.275	187.96
327.72	139.41
328.165	115.14
328.61	146.7
329.054	173.39
329.499	107.86
329.943	221.94
330.388	122.42
330.832	207.38
331.277	139.41
331.721	144.27
332.166	183.1
332.61	132.13
333.054	151.55
333.499	200.09
333.943	183.1
334.387	146.7
334.831	124.85
335.275	151.55
335.719	187.96
336.163	163.69
336.607	190.39
337.051	192.81
337.495	151.55
337.938	144.27
338.382	141.84
338.826	183.1
339.269	151.55
339.713	90.87
340.157	112.71
340.6	163.69
341.044	195.24
341.487	136.99
341.93	158.83
342.374	209.8
342.817	185.53
343.26	180.68
343.703	183.1
344.146	129.7
344.59	270.48
345.033	161.26
345.476	195.24
345.919	144.27
346.361	78.73
346.804	146.7
347.247	183.1
347.69	236.5
348.133	163.69
348.575	163.69
349.018	197.67
349.461	170.97
349.903	107.86
350.346	185.53
350.788	141.84
351.23	192.81
351.673	195.24
352.115	195.24
352.557	127.28
353	207.38
353.442	161.26
353.884	141.84
354.326	192.81
354.768	185.53
355.21	144.27
355.652	175.82
356.094	180.68
356.536	200.09
356.978	234.08
357.419	231.65
357.861	151.55
358.303	163.69
358.744	166.11
359.186	212.23
359.627	204.95
360.069	163.69
360.51	231.65
360.952	166.11
361.393	122.42
361.834	175.82
362.276	180.68
362.717	195.24
363.158	163.69
363.599	132.13
364.04	175.82
364.481	95.72
364.922	129.7
365.363	204.95
365.804	149.12
366.245	124.85
366.686	168.54
367.126	105.43
367.567	204.95
368.008	173.39
368.448	129.7
368.889	110.29
369.33	129.7
369.77	136.99
370.21	141.84
370.651	166.11
371.091	120
371.531	32.62
371.972	207.38
372.412	166.11
372.852	161.26
373.292	178.25
373.732	204.95
374.172	183.1
374.612	88.44
375.052	200.09
375.492	107.86
375.932	149.12
376.372	219.51
376.811	153.98
377.251	112.71
377.691	132.13
378.13	180.68
378.57	156.4
379.009	207.38
379.449	117.57
379.888	166.11
380.328	117.57
380.767	200.09
381.206	173.39
381.645	221.94
382.085	170.97
382.524	209.8
382.963	200.09
383.402	139.41
383.841	175.82
384.28	100.58
384.719	136.99
385.158	153.98
385.596	153.98
386.035	180.68
386.474	202.52
386.913	110.29
387.351	170.97
387.79	178.25
388.228	146.7
388.667	195.24
389.105	166.11
389.544	166.11
389.982	103.01
390.42	120
390.859	78.73
391.297	185.53
391.735	183.1
392.173	115.14
392.611	187.96
393.049	204.95
393.487	183.1
393.925	224.37
394.363	166.11
394.801	166.11
395.239	71.45
395.676	110.29
396.114	251.07
396.552	248.64
396.989	115.14
397.427	173.39
397.864	76.31
398.302	136.99
398.739	151.55
399.177	163.69
399.614	209.8
400.051	141.84
400.488	132.13
400.926	110.29
401.363	127.28
401.8	115.14
402.237	163.69
402.674	175.82
403.111	103.01
403.548	141.84
403.985	202.52
404.421	168.54
404.858	166.11
405.295	204.95
405.732	146.7
406.168	168.54
406.605	122.42
407.041	166.11
407.478	144.27
407.914	178.25
408.351	132.13
408.787	141.84
409.223	139.41
409.66	163.69
410.096	163.69
410.532	132.13
410.968	209.8
411.404	151.55
411.84	183.1
412.276	231.65
412.712	190.39
413.148	234.08
413.584	202.52
414.02	170.97
414.455	115.14
414.891	110.29
415.327	124.85
415.762	192.81
416.198	163.69
416.633	149.12
417.069	170.97
417.504	149.12
417.94	88.44
418.375	170.97
418.81	153.98
419.245	180.68
419.681	158.83
420.116	175.82
420.551	115.14
420.986	204.95
421.421	158.83
421.856	170.97
422.291	185.53
422.726	166.11
423.16	187.96
423.595	212.23
424.03	163.69
424.464	122.42
424.899	209.8
425.334	166.11
425.768	163.69
426.203	166.11
426.637	132.13
427.071	195.24
427.506	231.65
427.94	156.4
428.374	202.52
428.809	195.24
429.243	100.58
429.677	214.66
430.111	236.5
430.545	163.69
430.979	144.27
431.413	122.42
431.847	190.39
432.28	170.97
432.714	175.82
433.148	187.96
433.582	115.14
434.015	149.12
434.449	212.23
434.882	217.08
435.316	136.99
435.749	139.41
436.183	107.86
436.616	221.94
437.049	98.15
437.483	219.51
437.916	197.67
438.349	158.83
438.782	224.37
439.215	136.99
439.648	180.68
440.081	187.96
440.514	103.01
440.947	168.54
441.38	166.11
441.813	144.27
442.245	156.4
442.678	168.54
443.111	158.83
443.543	166.11
443.976	183.1
444.408	139.41
444.841	168.54
445.273	122.42
445.705	197.67
446.138	141.84
446.57	156.4
447.002	132.13
447.434	166.11
447.867	187.96
448.299	129.7
448.731	163.69
449.163	248.64
449.595	163.69
450.026	178.25
450.458	98.15
450.89	183.1
451.322	166.11
451.754	187.96
452.185	129.7
452.617	197.67
453.048	217.08
453.48	185.53
453.911	134.56
454.343	158.83
454.774	163.69
455.205	212.23
455.637	209.8
456.068	163.69
456.499	170.97
456.93	149.12
457.361	185.53
457.792	156.4
458.223	175.82
458.654	163.69
459.085	204.95
459.516	170.97
459.947	190.39
460.378	202.52
460.808	168.54
461.239	200.09
461.669	217.08
462.1	272.91
462.531	207.38
462.961	139.41
463.391	168.54
463.822	153.98
464.252	178.25
464.682	202.52
465.113	185.53
465.543	200.09
465.973	166.11
466.403	146.7
466.833	221.94
467.263	170.97
467.693	197.67
468.123	127.28
468.553	144.27
468.983	192.81
469.412	187.96
469.842	187.96
470.272	168.54
470.701	129.7
471.131	141.84
471.56	236.5
471.99	168.54
472.419	183.1
472.849	192.81
473.278	229.22
473.707	224.37
474.136	151.55
474.566	170.97
474.995	185.53
475.424	185.53
475.853	270.48
476.282	234.08
476.711	168.54
477.14	144.27
477.569	192.81
477.997	207.38
478.426	107.86
478.855	212.23
479.283	122.42
479.712	185.53
480.141	204.95
480.569	173.39
480.998	248.64
481.426	173.39
481.854	105.43
482.283	122.42
482.711	197.67
483.139	195.24
483.567	178.25
483.995	120
484.424	187.96
484.852	141.84
485.28	221.94
485.708	144.27
486.135	217.08
486.563	202.52
486.991	192.81
487.419	255.92
487.847	226.79
488.274	238.93
488.702	200.09
489.129	226.79
489.557	192.81
489.984	204.95
490.412	202.52
490.839	229.22
491.266	202.52
491.694	156.4
492.121	251.07
492.548	166.11
492.975	178.25
493.402	178.25
493.829	185.53
494.256	173.39
494.683	202.52
495.11	212.23
495.537	212.23
495.964	195.24
496.39	153.98
496.817	192.81
497.244	153.98
497.67	166.11
498.097	238.93
498.523	151.55
498.95	156.4
499.376	234.08
499.803	183.1
500.229	168.54
500.655	204.95
501.081	161.26
501.508	187.96
501.934	146.7
502.36	158.83
502.786	187.96
503.212	153.98
503.638	120
504.064	170.97
504.489	226.79
504.915	178.25
505.341	190.39
505.767	136.99
506.192	224.37
506.618	212.23
507.043	163.69
507.469	197.67
507.894	168.54
508.32	127.28
508.745	166.11
509.17	158.83
509.596	115.14
510.021	129.7
510.446	120
510.871	141.84
511.296	141.84
511.721	107.86
512.146	173.39
512.571	212.23
512.996	202.52
513.421	95.72
513.845	166.11
514.27	190.39
514.695	178.25
515.119	219.51
515.544	139.41
515.969	129.7
516.393	27.76
516.817	190.39
517.242	212.23
517.666	161.26
518.09	183.1
518.515	168.54
518.939	207.38
519.363	454.95
519.787	175.82
520.211	197.67
520.635	168.54
521.059	120
521.483	180.68
521.907	178.25
522.331	144.27
522.754	192.81
523.178	136.99
523.602	100.58
524.025	207.38
524.449	192.81
524.872	185.53
525.296	180.68
525.719	190.39
526.143	209.8
526.566	168.54
526.989	161.26
527.412	200.09
527.836	197.67
528.259	212.23
528.682	170.97
529.105	166.11
529.528	202.52
529.951	170.97
530.374	226.79
530.796	156.4
531.219	212.23
531.642	178.25
532.065	175.82
532.487	146.7
532.91	153.98
533.332	195.24
533.755	238.93
534.177	124.85
534.6	168.54
535.022	178.25
535.444	209.8
535.867	149.12
536.289	141.84
536.711	204.95
537.133	180.68
537.555	207.38
537.977	243.78
538.399	168.54
538.821	175.82
539.243	178.25
539.665	139.41
540.086	255.92
540.508	234.08
540.93	238.93
541.351	202.52
541.773	168.54
542.195	219.51
542.616	180.68
543.037	328.74
543.459	280.19
543.88	161.26
544.301	209.8
544.723	255.92
545.144	294.76
545.565	275.34
545.986	280.19
546.407	306.89
546.828	294.76
547.249	255.92
547.67	187.96
548.091	185.53
548.512	192.81
548.932	187.96
549.353	299.61
549.774	166.11
550.194	204.95
550.615	178.25
551.035	185.53
551.456	200.09
551.876	214.66
552.296	217.08
552.717	180.68
553.137	134.56
553.557	185.53
553.977	243.78
554.397	272.91
554.817	166.11
555.237	175.82
555.657	107.86
556.077	124.85
556.497	161.26
556.917	122.42
557.337	103.01
557.756	202.52
558.176	153.98
558.596	178.25
559.015	217.08
559.435	192.81
559.854	158.83
560.274	170.97
560.693	151.55
561.112	158.83
561.532	156.4
561.951	183.1
562.37	168.54
562.789	158.83
563.208	173.39
563.627	175.82
564.046	95.72
564.465	146.7
564.884	168.54
565.303	134.56
565.722	103.01
566.14	139.41
566.559	149.12
566.978	183.1
567.396	151.55
567.815	231.65
568.233	195.24
568.652	231.65
569.07	217.08
569.489	212.23
569.907	224.37
570.325	134.56
570.743	161.26
571.161	115.14
571.58	136.99
571.998	187.96
572.416	117.57
572.833	173.39
573.251	117.57
573.669	149.12
574.087	183.1
574.505	149.12
574.922	214.66
575.34	195.24
575.758	197.67
576.175	120
576.593	204.95
577.01	163.69
577.428	197.67
577.845	1469.53
578.262	268.06
578.68	175.82
579.097	170.97
579.514	163.69
579.931	153.98
580.348	207.38
580.765	214.66
581.182	226.79
581.599	190.39
582.016	161.26
582.433	180.68
582.849	163.69
583.266	268.06
583.683	190.39
584.099	217.08
584.516	248.64
584.933	156.4
585.349	200.09
585.765	180.68
586.182	149.12
586.598	192.81
587.014	170.97
587.431	129.7
587.847	200.09
588.263	124.85
588.679	202.52
589.095	139.41
589.511	214.66
589.927	163.69
590.343	214.66
590.759	192.81
591.174	258.35
591.59	146.7
592.006	158.83
592.421	187.96
592.837	166.11
593.252	180.68
593.668	129.7
594.083	202.52
594.499	217.08
594.914	166.11
595.329	183.1
595.745	197.67
596.16	214.66
596.575	209.8
596.99	209.8
597.405	146.7
597.82	127.28
598.235	202.52
598.65	136.99
599.065	173.39
599.479	163.69
599.894	141.84
600.309	202.52
600.724	209.8
601.138	197.67
601.553	144.27
601.967	146.7
602.382	209.8
602.796	115.14
603.21	107.86
603.625	168.54
604.039	200.09
604.453	141.84
604.867	144.27
605.281	224.37
605.695	204.95
606.109	161.26
606.523	180.68
606.937	214.66
607.351	299.61
607.765	224.37
608.178	175.82
608.592	163.69
609.006	141.84
609.419	190.39
609.833	146.7
610.246	214.66
610.66	231.65
611.073	236.5
611.487	219.51
611.9	238.93
612.313	139.41
612.726	209.8
613.139	158.83
613.553	178.25
613.966	117.57
614.379	185.53
614.792	221.94
615.204	236.5
615.617	190.39
616.03	180.68
616.443	129.7
616.856	146.7
617.268	110.29
617.681	122.42
618.093	151.55
618.506	200.09
618.918	134.56
619.331	197.67
619.743	224.37
620.155	202.52
620.568	192.81
620.98	146.7
621.392	192.81
621.804	234.08
622.216	195.24
622.628	129.7
623.04	153.98
623.452	190.39
623.864	161.26
624.276	255.92
624.687	158.83
625.099	144.27
625.511	132.13
625.922	173.39
626.334	170.97
626.745	192.81
627.157	229.22
627.568	153.98
627.979	183.1
628.391	153.98
628.802	156.4
629.213	217.08
629.624	95.72
630.035	144.27
630.446	195.24
630.857	185.53
631.268	139.41
631.679	141.84
632.09	197.67
632.501	95.72
632.912	149.12
633.322	195.24
633.733	180.68
634.144	156.4
634.554	183.1
634.965	166.11
635.375	153.98
635.785	180.68
636.196	231.65
636.606	158.83
637.016	185.53
637.427	139.41
637.837	141.84
638.247	212.23
638.657	187.96
639.067	136.99
639.477	173.39
639.887	136.99
640.297	158.83
640.706	134.56
641.116	187.96
641.526	202.52
641.935	178.25
642.345	120
642.755	202.52
643.164	173.39
643.573	197.67
643.983	224.37
644.392	192.81
644.801	120
645.211	180.68
645.62	219.51
646.029	197.67
646.438	166.11
646.847	200.09
647.256	153.98
647.665	183.1
648.074	183.1
648.483	151.55
648.892	180.68
649.3	156.4
649.709	124.85
650.118	161.26
650.526	166.11
650.935	127.28
651.343	139.41
651.752	161.26
652.16	173.39
652.568	98.15
652.977	204.95
653.385	178.25
653.793	151.55
654.201	156.4
654.609	195.24
655.017	195.24
655.425	132.13
655.833	185.53
656.241	187.96
656.649	187.96
657.057	158.83
657.464	170.97
657.872	161.26
658.28	107.86
658.687	187.96
659.095	200.09
659.502	153.98
659.91	168.54
660.317	192.81
660.724	149.12
661.132	153.98
661.539	234.08
661.946	197.67
662.353	166.11
662.76	190.39
663.167	156.4
663.574	129.7
663.981	166.11
664.388	127.28
664.795	146.7
665.202	156.4
665.608	170.97
666.015	141.84
666.422	149.12
666.828	163.69
667.235	168.54
667.641	212.23
668.047	197.67
668.454	183.1
668.86	127.28
669.266	112.71
669.673	166.11
670.079	178.25
670.485	149.12
670.891	183.1
671.297	64.17
671.703	200.09
672.109	178.25
672.515	158.83
672.92	139.41
673.326	187.96
673.732	197.67
674.138	255.92
674.543	156.4
674.949	173.39
675.354	144.27
675.76	129.7
676.165	178.25
676.57	173.39
676.976	192.81
677.381	161.26
677.786	146.7
678.191	187.96
678.596	132.13
679.001	175.82
679.406	124.85
679.811	217.08
680.216	166.11
680.621	163.69
681.026	146.7
681.43	136.99
681.835	183.1
682.24	129.7
682.644	185.53
683.049	226.79
683.453	175.82
683.858	141.84
684.262	163.69
684.667	166.11
685.071	168.54
685.475	251.07
685.879	93.3
686.283	183.1
686.687	185.53
687.091	136.99
687.495	183.1
687.899	170.97
688.303	173.39
688.707	115.14
689.111	185.53
689.514	163.69
689.918	168.54
690.322	146.7
690.725	103.01
691.129	192.81
691.532	173.39
691.936	173.39
692.339	214.66
692.742	175.82
693.146	156.4
693.549	217.08
693.952	219.51
694.355	134.56
694.758	175.82
695.161	173.39
695.564	204.95
695.967	136.99
696.37	149.12
696.773	141.84
697.175	238.93
697.578	190.39
697.981	204.95
698.383	156.4
698.786	200.09
699.188	149.12
699.591	103.01
699.993	149.12
700.395	183.1
700.798	243.78
701.2	190.39
701.602	149.12
702.004	204.95
702.406	183.1
702.808	163.69
703.21	151.55
703.612	314.17
704.014	217.08
704.416	190.39
704.818	187.96
705.219	163.69
705.621	175.82
706.023	163.69
706.424	221.94
706.826	263.2
707.227	180.68
707.629	209.8
708.03	258.35
708.431	289.9
708.832	251.07
709.234	190.39
709.635	219.51
710.036	219.51
710.437	217.08
710.838	263.2
711.239	297.18
711.64	243.78
712.041	272.91
712.441	195.24
712.842	280.19
713.243	277.77
713.643	209.8
714.044	314.17
714.445	299.61
714.845	251.07
715.246	350.58
715.646	326.31
716.046	299.61
716.447	265.63
716.847	331.16
717.247	282.62
717.647	270.48
718.047	353.01
718.447	357.86
718.847	255.92
719.247	280.19
719.647	399.13
720.047	391.84
720.446	272.91
720.846	282.62
721.246	353.01
721.645	323.88
722.045	370
722.444	340.87
722.844	403.98
723.243	403.98
723.643	423.4
724.042	340.87
724.441	391.84
724.84	454.95
725.24	425.83
725.639	416.12
726.038	450.1
726.437	573.89
726.836	530.2
727.234	573.89
727.633	535.05
728.032	586.02
728.431	622.43
728.83	629.71
729.228	586.02
729.627	700.1
730.025	772.92
730.424	845.74
730.822	867.58
731.22	920.98
731.619	981.66
732.017	1069.04
732.415	1268.07
732.813	1297.2
733.212	1343.32
733.61	1411.28
734.008	1479.24
734.406	1622.45
734.803	1734.1
735.201	1821.48
735.599	2030.22
735.997	1996.24
736.395	2243.82
736.792	2331.2
737.19	2394.3
737.587	2556.93
737.985	2520.52
738.382	2758.39
738.78	3001.11
739.177	3081.21
739.574	3205
739.971	3455
740.369	3644.32
740.766	3811.8
741.163	4005.98
741.56	3930.73
741.957	4219.57
742.354	4326.37
742.751	4503.56
743.147	4806.96
743.544	4789.97
743.941	5137.06
744.338	5615.23
744.734	5816.69
745.131	5882.22
745.527	6316.69
745.924	6629.81
746.32	6964.76
746.716	7226.9
747.113	7722.06
747.509	7930.8
747.905	8316.73
748.301	8610.42
748.697	8845.86
749.093	9530.34
749.489	9722.09
749.885	10190.54
750.281	10675.99
750.677	10921.13
751.073	11918.72
751.468	11845.91
751.864	13105.63
752.26	13542.53
752.655	13722.15
753.051	14190.6
753.446	14909.06
753.842	15353.24
754.237	16095.97
754.632	16355.69
755.028	17042.59
755.423	16795.01
755.818	17326.57
756.213	18020.76
756.608	18117.85
757.003	17894.54
757.398	18496.5
757.793	18819.32
758.188	18972.23
758.583	19244.08
758.977	19792.63
759.372	20542.64
759.767	21183.43
760.161	22382.48
760.556	22972.29
760.95	24093.67
761.345	24931.06
761.739	26297.59
762.133	26855.85
762.527	27736.93
762.922	28469.95
763.316	29406.86
763.71	30156.87
764.104	30746.69
764.498	31011.25
764.892	31807.38
765.286	32460.3
765.68	33273.42
766.073	33545.27
766.467	33972.46
766.861	34642.38
767.255	36033.18
767.648	37712.81
768.042	37865.73
768.435	38171.56
768.829	39220.12
769.222	40042.95
769.615	40564.8
770.008	40356.06
770.402	40254.12
770.795	40722.57
771.188	41292.97
771.581	40365.77
771.974	40975
772.367	40489.56
772.76	40640.04
773.153	39819.64
773.545	39550.22
773.938	39839.06
774.331	40110.91
774.724	41157.04
775.116	41916.76
775.509	42936.2
775.901	44499.33
776.294	45766.34
776.686	46084.3
777.078	46851.31
777.471	48691.14
777.863	49232.41
778.255	50734.86
778.647	51618.37
779.039	51283.41
779.431	50992.15
779.823	51128.07
780.215	51890.22
780.607	51579.53
780.999	53259.17
781.39	52492.17
781.782	53016.45
782.174	52844.12
782.565	53637.82
782.957	53327.13
783.348	53931.51
783.74	54336.86
784.131	53441.21
784.522	54179.09
784.914	54344.14
785.305	54271.32
785.696	53331.99
786.087	53443.64
786.478	52788.29
786.869	51494.58
787.26	50200.87
787.651	49907.18
788.042	49652.32
788.433	47373.16
788.823	46632.86
789.214	45729.93
789.605	43897.38
789.995	43295.42
790.386	42695.9
790.776	42188.61
791.167	41576.95
791.557	42511.43
791.948	41664.33
792.338	42450.75
792.728	43567.27
793.118	44193.5
793.508	44132.82
793.898	44836.71
794.288	44492.05
794.678	43972.62
795.068	44771.18
795.458	44489.62
795.848	44632.82
796.238	44543.02
796.627	44390.1
797.017	44472.63
797.406	43892.52
797.796	43285.72
798.185	43776.01
798.575	43880.39
798.964	43399.8
799.354	44069.71
799.743	43586.69
800.132	44062.43
800.521	44118.25
800.91	44285.73
801.299	43824.56
801.688	43674.07
802.077	43208.04
802.466	43176.49
802.855	43271.15
803.244	41380.35
803.633	40950.73
804.021	40659.46
804.41	39416.72
804.799	38339.04
805.187	38239.52
805.576	37576.89
805.964	36440.95
806.352	34610.82
806.741	34474.9
807.129	33554.98
807.517	33251.58
807.905	33467.6
808.293	33304.98
808.681	33016.14
809.069	32324.38
809.457	34203.05
809.845	34336.55
810.233	34358.39
810.621	34501.6
811.009	33921.49
811.396	34110.82
811.784	34103.53
812.171	33249.15
812.559	33763.72
812.946	32821.96
813.334	31909.33
813.721	31751.56
814.108	31518.54
814.496	31416.6
814.883	29872.89
815.27	30380.18
815.657	30397.17
816.044	30431.15
816.431	29749.1
816.818	30079.2
817.205	29727.25
817.592	30086.48
817.979	28846.17
818.365	29018.5
818.752	28193.25
819.139	27195.66
819.525	26445.65
819.912	25661.66
820.298	25533.01
820.685	25348.54
821.071	24057.26
821.457	23205.31
821.843	22647.05
822.23	22003.83
822.616	21333.92
823.002	20292.64
823.388	19758.65
823.774	19059.61
824.16	17671.24
824.546	17409.1
824.931	17477.06
825.317	17282.88
825.703	16663.94
826.089	16222.19
826.474	16375.1
826.86	16115.39
827.245	15705.19
827.631	15722.18
828.016	15782.86
828.401	15680.92
828.787	14879.93
829.172	14273.13
829.557	14061.96
829.942	13972.15
830.327	13765.84
830.712	13260.98
831.097	12491.55
831.482	12717.28
831.867	12370.19
832.252	11967.27
832.636	11467.26
833.021	11481.82
833.406	11389.59
833.79	11217.26
834.175	10797.35
834.559	10724.53
834.944	10472.1
835.328	10692.98
835.713	9955.1
836.097	9513.35
836.481	9324.02
836.865	9343.44
837.249	9023.05
837.633	8748.77
838.017	8071.58
838.401	8195.36
838.785	7870.12
839.169	7425.93
839.553	6765.73
839.937	6598.25
840.32	6476.89
840.704	6357.96
841.087	6110.38
841.471	5552.12
841.854	5690.47
842.238	5321.53
842.621	5226.87
843.004	5005.99
843.388	4891.91
843.771	4938.03
844.154	5025.41
844.537	4823.95
844.92	4583.66
845.303	4496.28
845.686	4683.17
846.069	4612.78
846.452	4537.54
846.834	4214.72
847.217	4008.41
847.6	4115.2
847.982	4001.12
848.365	3843.35
848.748	3702.58
849.13	3622.48
849.512	3641.9
849.895	3700.15
850.277	3508.4
850.659	3326.36
851.041	3173.44
851.423	3408.88
851.806	3093.34
852.188	3115.19
852.57	2971.98
852.951	2921.01
853.333	3027.81
853.715	2916.16
854.097	2673.43
854.479	2513.24
854.86	2663.72
855.242	2564.21
855.623	2467.12
856.005	2401.58
856.386	2103.04
856.768	2054.49
857.149	1974.39
857.53	1996.24
857.911	1882.16
858.292	1874.88
858.674	1692.84
859.055	1680.7
859.436	1680.7
859.817	1564.19
860.197	1513.22
860.578	1450.11
860.959	1321.47
861.34	1360.31
861.72	1406.42
862.101	1207.39
862.482	1144.28
862.862	1071.47
863.243	1178.26
863.623	1139.43
864.003	1127.29
864.384	1076.32
864.764	993.8
865.144	993.8
865.524	969.52
865.904	843.31
866.284	874.86
866.664	857.87
867.044	887
867.424	780.2
867.804	789.91
868.183	809.33
868.563	697.67
868.943	741.36
869.322	666.12
869.702	653.98
870.081	530.2
870.461	634.57
870.84	636.99
871.22	586.02
871.599	583.6
871.978	527.77
872.357	505.92
872.736	583.6
873.115	527.77
873.494	501.07
873.873	488.93
874.252	481.65
874.631	484.08
875.01	370
875.388	386.99
875.767	408.84
876.146	399.13
876.524	437.96
876.903	336.02
877.281	377.28
877.66	357.86
878.038	292.33
878.416	350.58
878.794	321.46
879.173	285.05
879.551	285.05
879.929	277.77
880.307	263.2
880.685	248.64
881.063	255.92
881.441	299.61
881.818	236.5
882.196	275.34
882.574	229.22
882.951	355.44
883.329	238.93
883.707	231.65
884.084	226.79
884.461	231.65
884.839	197.67
885.216	183.1
885.593	192.81
885.971	229.22
886.348	236.5
886.725	277.77
887.102	224.37
887.479	229.22
887.856	209.8
888.233	236.5
888.609	224.37
888.986	253.49
889.363	202.52
889.74	212.23
890.116	268.06
890.493	197.67
890.869	204.95
891.246	192.81
891.622	282.62
891.998	200.09
892.375	268.06
892.751	229.22
893.127	204.95
893.503	229.22
893.879	187.96
894.255	202.52
894.631	173.39
895.007	141.84
895.383	163.69
895.759	132.13
896.134	175.82
896.51	187.96
896.886	122.42
897.261	166.11
897.637	217.08
898.012	136.99
898.388	219.51
898.763	166.11
899.138	217.08
899.514	107.86
899.889	158.83
900.264	105.43
900.639	178.25
901.014	129.7
901.389	156.4
901.764	127.28
902.139	124.85
902.513	158.83
902.888	170.97
903.263	166.11
903.638	98.15
904.012	185.53
904.387	178.25
904.761	141.84
905.136	153.98
905.51	175.82
905.884	129.7
906.259	134.56
906.633	127.28
907.007	110.29
907.381	112.71
907.755	168.54
908.129	149.12
908.503	129.7
908.877	221.94
909.251	219.51
909.624	192.81
909.998	156.4
910.372	146.7
910.745	209.8
911.119	141.84
911.492	151.55
911.866	136.99
912.239	224.37
912.612	180.68
912.986	149.12
913.359	180.68
913.732	192.81
914.105	129.7
914.478	151.55
914.851	156.4
915.224	124.85
915.597	173.39
915.97	153.98
916.343	178.25
916.715	146.7
917.088	168.54
917.461	168.54
917.833	156.4
918.206	144.27
918.578	243.78
918.951	153.98
919.323	173.39
919.695	190.39
920.067	132.13
920.44	149.12
920.812	134.56
921.184	122.42
921.556	178.25
921.928	132.13
922.3	136.99
922.672	117.57
923.043	178.25
923.415	115.14
923.787	88.44
924.158	105.43
924.53	115.14
924.901	170.97
925.273	192.81
925.644	197.67
926.016	76.31
926.387	170.97
926.758	217.08
927.129	183.1
927.5	187.96
927.872	112.71
928.243	76.31
928.613	170.97
928.984	183.1
929.355	117.57
929.726	178.25
930.097	161.26
930.467	190.39
930.838	238.93
931.209	115.14
931.579	173.39
931.95	149.12
932.32	192.81
932.69	156.4
933.061	144.27
933.431	166.11
933.801	141.84
934.171	141.84
934.541	136.99
934.911	144.27
935.281	120
935.651	88.44
936.021	136.99
936.391	146.7
936.761	166.11
937.13	144.27
937.5	103.01
937.87	183.1
938.239	151.55
938.609	166.11
938.978	214.66
939.347	112.71
939.717	156.4
940.086	158.83
940.455	54.46
940.824	178.25
941.193	151.55
941.562	115.14
941.931	141.84
942.3	161.26
942.669	146.7
943.038	166.11
943.407	221.94
943.775	224.37
944.144	200.09
944.513	153.98
944.881	151.55
945.25	158.83
945.618	139.41
945.986	141.84
946.355	185.53
946.723	93.3
947.091	90.87
947.459	90.87
947.827	187.96
948.195	180.68
948.563	127.28
948.931	187.96
949.299	144.27
949.667	190.39
950.035	134.56
950.402	139.41
950.77	105.43
951.138	149.12
951.505	149.12
951.873	76.31
952.24	69.02
952.607	151.55
952.975	161.26
953.342	120
953.709	204.95
954.076	134.56
954.443	168.54
954.81	163.69
955.177	163.69
955.544	183.1
955.911	134.56
956.278	226.79
956.645	236.5
957.012	163.69
957.378	163.69
957.745	161.26
958.111	170.97
958.478	173.39
958.844	166.11
959.211	134.56
959.577	158.83
959.943	141.84
960.309	192.81
960.675	122.42
961.042	110.29
961.408	134.56
961.774	144.27
962.139	132.13
962.505	166.11
962.871	115.14
963.237	103.01
963.603	98.15
963.968	144.27
964.334	146.7
964.699	129.7
965.065	209.8
965.43	115.14
965.796	139.41
966.161	115.14
966.526	141.84
966.891	170.97
967.256	168.54
967.622	141.84
967.987	158.83
968.352	178.25
968.716	127.28
969.081	122.42
969.446	197.67
969.811	168.54
970.176	151.55
970.54	197.67
970.905	178.25
971.269	120
971.634	149.12
971.998	175.82
972.363	163.69
972.727	151.55
973.091	110.29
973.455	112.71
973.819	217.08
974.183	117.57
974.547	187.96
974.911	170.97
975.275	144.27
975.639	132.13
976.003	153.98
976.367	166.11
976.73	132.13
977.094	161.26
977.458	141.84
977.821	185.53
978.185	54.46
978.548	120
978.911	175.82
979.275	136.99
979.638	35.04
980.001	141.84
980.364	168.54
980.727	112.71
981.09	180.68
981.453	95.72
981.816	180.68
982.179	144.27
982.542	209.8
982.905	61.74
983.267	163.69
983.63	168.54
983.992	270.48
984.355	127.28
984.717	217.08
985.08	141.84
985.442	153.98
985.804	110.29
986.167	212.23
986.529	134.56
986.891	180.68
987.253	112.71
987.615	120
987.977	120
988.339	175.82
988.701	212.23
989.062	110.29
989.424	127.28
989.786	185.53
990.147	149.12
990.509	166.11
990.87	151.55
991.232	207.38
991.593	153.98
991.955	120
992.316	178.25
992.677	83.59
993.038	141.84
993.399	221.94
993.76	134.56
994.121	139.41
994.482	178.25
994.843	146.7
995.204	166.11
995.565	187.96
995.926	173.39
996.286	144.27
996.647	81.16
997.007	200.09
997.368	124.85
997.728	178.25
998.089	156.4
998.449	124.85
998.809	170.97
999.169	103.01
999.53	178.25
999.89	149.12
1000.25	132.13
1000.61	156.4
1000.97	163.69
1001.329	122.42
1001.689	175.82
1002.049	132.13
1002.409	95.72
1002.768	163.69
1003.128	151.55
1003.487	161.26
1003.847	144.27
1004.206	175.82
1004.566	204.95
1004.925	212.23
1005.284	122.42
1005.643	141.84
1006.003	163.69
1006.362	95.72
1006.721	149.12
1007.08	221.94
1007.438	149.12
1007.797	192.81
1008.156	103.01
1008.515	105.43
1008.874	95.72
1009.232	153.98
1009.591	166.11
1009.949	132.13
1010.308	139.41
1010.666	134.56
1011.024	153.98
1011.383	180.68
1011.741	183.1
1012.099	173.39
1012.457	156.4
1012.815	71.45
1013.173	122.42
1013.531	166.11
1013.889	112.71
1014.247	156.4
1014.605	200.09
1014.962	241.36
1015.32	209.8
1015.678	156.4
1016.035	156.4
1016.393	141.84
1016.75	168.54
1017.107	120
1017.465	144.27
1017.822	117.57
1018.179	180.68
1018.536	151.55
1018.894	132.13
1019.251	124.85
1019.608	168.54
1019.964	229.22
1020.321	120
1020.678	209.8
1021.035	214.66
1021.392	158.83
1021.748	120
1022.105	149.12
1022.461	175.82
1022.818	200.09
1023.174	124.85
1023.531	163.69
1023.887	197.67
1024.243	81.16
1024.599	163.69
1024.955	161.26
1025.311	195.24
1025.667	204.95
1026.023	163.69
1026.379	115.14
1026.735	107.86
1027.091	136.99
1027.447	139.41
