189.514	70.54
189.973	70.54
190.431	70.54
190.889	12.29
191.348	-21.69
191.806	87.53
192.264	-53.25
192.722	7.43
193.18	7.43
193.638	-45.97
194.096	-50.82
194.554	29.28
195.012	-11.98
195.47	17.14
195.928	2.58
196.385	-31.4
196.843	5.01
197.301	46.27
197.758	-31.4
198.216	0.15
198.674	5.01
199.131	104.52
199.589	89.96
200.046	22
200.503	38.99
200.961	87.53
201.418	102.1
201.875	133.65
202.332	75.4
202.79	104.52
203.247	97.24
203.704	123.94
204.161	77.82
204.618	133.65
205.075	153.07
205.532	92.39
205.989	136.08
206.445	89.96
206.902	172.48
207.359	143.36
207.816	131.22
208.272	111.8
208.729	97.24
209.185	126.37
209.642	162.78
210.098	187.05
210.555	165.2
211.011	58.41
211.467	97.24
211.924	131.22
212.38	148.21
212.836	170.06
213.292	182.19
213.748	133.65
214.204	221.03
214.66	187.05
215.116	99.67
215.572	138.5
216.028	145.79
216.484	143.36
216.94	184.62
217.396	187.05
217.851	148.21
218.307	138.5
218.763	126.37
219.218	133.65
219.674	179.77
220.129	77.82
220.585	172.48
221.04	201.61
221.496	63.26
221.951	123.94
222.406	196.76
222.861	170.06
223.317	201.61
223.772	114.23
224.227	208.89
224.682	138.5
225.137	184.62
225.592	148.21
226.047	104.52
226.502	162.78
226.957	208.89
227.411	99.67
227.866	133.65
228.321	177.34
228.776	123.94
229.23	148.21
229.685	92.39
230.139	119.09
230.594	162.78
231.048	153.07
231.503	131.22
231.957	167.63
232.411	104.52
232.865	133.65
233.32	131.22
233.774	140.93
234.228	138.5
234.682	145.79
235.136	145.79
235.59	121.51
236.044	121.51
236.498	126.37
236.952	143.36
237.406	150.64
237.86	97.24
238.313	126.37
238.767	121.51
239.221	106.95
239.674	104.52
240.128	119.09
240.581	92.39
241.035	114.23
241.488	138.5
241.942	189.48
242.395	138.5
242.848	114.23
243.301	145.79
243.755	150.64
244.208	109.38
244.661	140.93
245.114	165.2
245.567	131.22
246.02	184.62
246.473	182.19
246.926	194.33
247.379	123.94
247.832	123.94
248.284	99.67
248.737	148.21
249.19	109.38
249.642	143.36
250.095	162.78
250.547	150.64
251	97.24
251.452	121.51
251.905	162.78
252.357	143.36
252.81	162.78
253.262	148.21
253.714	170.06
254.166	148.21
254.618	128.79
255.07	160.35
255.523	133.65
255.975	126.37
256.427	102.1
256.878	121.51
257.33	99.67
257.782	184.62
258.234	179.77
258.686	170.06
259.137	138.5
259.589	165.2
260.041	160.35
260.492	196.76
260.944	114.23
261.395	167.63
261.847	252.58
262.298	106.95
262.749	174.91
263.201	155.49
263.652	157.92
264.103	136.08
264.554	116.66
265.005	131.22
265.457	140.93
265.908	138.5
266.359	162.78
266.809	177.34
267.26	172.48
267.711	94.81
268.162	160.35
268.613	123.94
269.064	153.07
269.514	174.91
269.965	157.92
270.415	123.94
270.866	160.35
271.316	111.8
271.767	153.07
272.217	80.25
272.668	138.5
273.118	128.79
273.568	204.04
274.019	143.36
274.469	85.1
274.919	182.19
275.369	189.48
275.819	150.64
276.269	199.18
276.719	165.2
277.169	136.08
277.619	165.2
278.069	165.2
278.518	201.61
278.968	216.17
279.418	153.07
279.867	106.95
280.317	116.66
280.767	123.94
281.216	162.78
281.666	104.52
282.115	92.39
282.564	179.77
283.014	99.67
283.463	92.39
283.912	162.78
284.361	187.05
284.811	162.78
285.26	182.19
285.709	174.91
286.158	143.36
286.607	165.2
287.056	104.52
287.505	148.21
287.953	199.18
288.402	153.07
288.851	153.07
289.3	143.36
289.748	196.76
290.197	126.37
290.646	143.36
291.094	153.07
291.543	140.93
291.991	177.34
292.439	172.48
292.888	119.09
293.336	148.21
293.784	77.82
294.233	114.23
294.681	196.76
295.129	102.1
295.577	184.62
296.025	119.09
296.473	208.89
296.921	111.8
297.369	85.1
297.817	177.34
298.264	170.06
298.712	170.06
299.16	104.52
299.608	138.5
300.055	157.92
300.503	72.97
300.95	223.46
301.398	223.46
301.845	218.6
302.293	102.1
302.74	58.41
303.187	172.48
303.635	189.48
304.082	211.32
304.529	128.79
304.976	133.65
305.423	143.36
305.87	211.32
306.317	201.61
306.764	155.49
307.211	177.34
307.658	191.9
308.105	133.65
308.552	121.51
308.998	65.69
309.445	157.92
309.892	206.47
310.338	191.9
310.785	145.79
311.231	140.93
311.678	121.51
312.124	153.07
312.571	177.34
313.017	114.23
313.463	133.65
313.909	184.62
314.356	191.9
314.802	109.38
315.248	157.92
315.694	213.75
316.14	199.18
316.586	133.65
317.032	138.5
317.478	109.38
317.923	206.47
318.369	174.91
318.815	80.25
319.261	174.91
319.706	187.05
320.152	104.52
320.597	145.79
321.043	194.33
321.488	157.92
321.934	131.22
322.379	235.59
322.824	184.62
323.27	114.23
323.715	119.09
324.16	133.65
324.605	133.65
325.05	160.35
325.495	221.03
325.94	165.2
326.385	102.1
326.83	111.8
327.275	128.79
327.72	179.77
328.165	148.21
328.61	162.78
329.054	155.49
329.499	102.1
329.943	150.64
330.388	119.09
330.832	148.21
331.277	179.77
331.721	116.66
332.166	172.48
332.61	165.2
333.054	165.2
333.499	177.34
333.943	170.06
334.387	150.64
334.831	114.23
335.275	140.93
335.719	184.62
336.163	153.07
336.607	131.22
337.051	114.23
337.495	162.78
337.938	136.08
338.382	99.67
338.826	116.66
339.269	68.11
339.713	140.93
340.157	196.76
340.6	160.35
341.044	133.65
341.487	187.05
341.93	148.21
342.374	131.22
342.817	160.35
343.26	140.93
343.703	133.65
344.146	128.79
344.59	160.35
345.033	48.7
345.476	106.95
345.919	211.32
346.361	102.1
346.804	138.5
347.247	177.34
347.69	240.45
348.133	145.79
348.575	148.21
349.018	208.89
349.461	167.63
349.903	162.78
350.346	140.93
350.788	123.94
351.23	136.08
351.673	138.5
352.115	82.68
352.557	102.1
353	211.32
353.442	99.67
353.884	182.19
354.326	170.06
354.768	189.48
355.21	104.52
355.652	162.78
356.094	121.51
356.536	179.77
356.978	131.22
357.419	167.63
357.861	172.48
358.303	109.38
358.744	216.17
359.186	228.31
359.627	114.23
360.069	157.92
360.51	150.64
360.952	160.35
361.393	131.22
361.834	201.61
362.276	174.91
362.717	150.64
363.158	138.5
363.599	114.23
364.04	165.2
364.481	77.82
364.922	160.35
365.363	123.94
365.804	155.49
366.245	140.93
366.686	170.06
367.126	189.48
367.567	167.63
368.008	153.07
368.448	99.67
368.889	182.19
369.33	114.23
369.77	119.09
370.21	160.35
370.651	187.05
371.091	172.48
371.531	174.91
371.972	140.93
372.412	148.21
372.852	194.33
373.292	94.81
373.732	123.94
374.172	162.78
374.612	150.64
375.052	167.63
375.492	150.64
375.932	170.06
376.372	148.21
376.811	138.5
377.251	160.35
377.691	187.05
378.13	204.04
378.57	252.58
379.009	184.62
379.449	123.94
379.888	123.94
380.328	89.96
380.767	111.8
381.206	104.52
381.645	228.31
382.085	143.36
382.524	174.91
382.963	155.49
383.402	177.34
383.841	133.65
384.28	167.63
384.719	221.03
385.158	189.48
385.596	99.67
386.035	121.51
386.474	170.06
386.913	80.25
387.351	160.35
387.79	155.49
388.228	104.52
388.667	191.9
389.105	150.64
389.544	191.9
389.982	133.65
390.42	136.08
390.859	133.65
391.297	140.93
391.735	119.09
392.173	109.38
392.611	167.63
393.049	189.48
393.487	116.66
393.925	196.76
394.363	75.4
394.801	102.1
395.239	41.41
395.676	104.52
396.114	138.5
396.552	172.48
396.989	223.46
397.427	114.23
397.864	194.33
398.302	240.45
398.739	140.93
399.177	172.48
399.614	155.49
400.051	228.31
400.488	194.33
400.926	111.8
401.363	131.22
401.8	128.79
402.237	174.91
402.674	140.93
403.111	162.78
403.548	85.1
403.985	126.37
404.421	177.34
404.858	150.64
405.295	114.23
405.732	131.22
406.168	119.09
406.605	128.79
407.041	89.96
407.478	172.48
407.914	114.23
408.351	128.79
408.787	123.94
409.223	148.21
409.66	157.92
410.096	109.38
410.532	179.77
410.968	257.44
411.404	174.91
411.84	148.21
412.276	145.79
412.712	140.93
413.148	114.23
413.584	170.06
414.02	213.75
414.455	191.9
414.891	177.34
415.327	155.49
415.762	177.34
416.198	160.35
416.633	121.51
417.069	87.53
417.504	114.23
417.94	131.22
418.375	131.22
418.81	123.94
419.245	77.82
419.681	167.63
420.116	143.36
420.551	70.54
420.986	77.82
421.421	157.92
421.856	155.49
422.291	140.93
422.726	174.91
423.16	116.66
423.595	160.35
424.03	157.92
424.464	155.49
424.899	189.48
425.334	143.36
425.768	133.65
426.203	114.23
426.637	72.97
427.071	128.79
427.506	162.78
427.94	119.09
428.374	201.61
428.809	194.33
429.243	155.49
429.677	211.32
430.111	145.79
430.545	174.91
430.979	114.23
431.413	133.65
431.847	199.18
432.28	165.2
432.714	155.49
433.148	70.54
433.582	128.79
434.015	131.22
434.449	162.78
434.882	179.77
435.316	172.48
435.749	131.22
436.183	167.63
436.616	211.32
437.049	179.77
437.483	184.62
437.916	162.78
438.349	199.18
438.782	162.78
439.215	177.34
439.648	191.9
440.081	177.34
440.514	148.21
440.947	179.77
441.38	140.93
441.813	191.9
442.245	225.88
442.678	99.67
443.111	182.19
443.543	119.09
443.976	172.48
444.408	191.9
444.841	167.63
445.273	230.74
445.705	160.35
446.138	247.73
446.57	153.07
447.002	148.21
447.434	223.46
447.867	165.2
448.299	189.48
448.731	208.89
449.163	259.86
449.595	191.9
450.026	257.44
450.458	204.04
450.89	206.47
451.322	182.19
451.754	252.58
452.185	233.17
452.617	233.17
453.048	272
453.48	208.89
453.911	250.16
454.343	216.17
454.774	211.32
455.205	160.35
455.637	228.31
456.068	216.17
456.499	228.31
456.93	255.01
457.361	225.88
457.792	191.9
458.223	201.61
458.654	211.32
459.085	242.87
459.516	235.59
459.947	218.6
460.378	194.33
460.808	150.64
461.239	199.18
461.669	211.32
462.1	284.14
462.531	162.78
462.961	182.19
463.391	238.02
463.822	242.87
464.252	206.47
464.682	264.72
465.113	182.19
465.543	204.04
465.973	165.2
466.403	155.49
466.833	126.37
467.263	247.73
467.693	274.43
468.123	235.59
468.553	223.46
468.983	233.17
469.412	201.61
469.842	225.88
470.272	174.91
470.701	160.35
471.131	196.76
471.56	233.17
471.99	133.65
472.419	177.34
472.849	167.63
473.278	172.48
473.707	196.76
474.136	228.31
474.566	213.75
474.995	143.36
475.424	174.91
475.853	196.76
476.282	162.78
476.711	191.9
477.14	167.63
477.569	255.01
477.997	228.31
478.426	145.79
478.855	216.17
479.283	211.32
479.712	259.86
480.141	167.63
480.569	119.09
480.998	264.72
481.426	150.64
481.854	153.07
482.283	133.65
482.711	216.17
483.139	211.32
483.567	187.05
483.995	165.2
484.424	182.19
484.852	213.75
485.28	196.76
485.708	242.87
486.135	189.48
486.563	272
486.991	123.94
487.419	204.04
487.847	235.59
488.274	221.03
488.702	87.53
489.129	133.65
489.557	172.48
489.984	148.21
490.412	150.64
490.839	228.31
491.266	174.91
491.694	182.19
492.121	194.33
492.548	165.2
492.975	150.64
493.402	182.19
493.829	150.64
494.256	187.05
494.683	131.22
495.11	157.92
495.537	167.63
495.964	162.78
496.39	189.48
496.817	138.5
497.244	114.23
497.67	204.04
498.097	216.17
498.523	111.8
498.95	119.09
499.376	140.93
499.803	104.52
500.229	225.88
500.655	87.53
501.081	204.04
501.508	213.75
501.934	109.38
502.36	262.29
502.786	155.49
503.212	140.93
503.638	155.49
504.064	182.19
504.489	133.65
504.915	89.96
505.341	211.32
505.767	218.6
506.192	206.47
506.618	136.08
507.043	228.31
507.469	150.64
507.894	133.65
508.32	128.79
508.745	160.35
509.17	145.79
509.596	165.2
510.021	153.07
510.446	106.95
510.871	162.78
511.296	138.5
511.721	126.37
512.146	218.6
512.571	184.62
512.996	221.03
513.421	165.2
513.845	179.77
514.27	225.88
514.695	194.33
515.119	201.61
515.544	145.79
515.969	116.66
516.393	208.89
516.817	143.36
517.242	119.09
517.666	177.34
518.09	172.48
518.515	177.34
518.939	148.21
519.363	371.52
519.787	177.34
520.211	170.06
520.635	174.91
521.059	182.19
521.483	138.5
521.907	75.4
522.331	111.8
522.754	153.07
523.178	119.09
523.602	187.05
524.025	201.61
524.449	194.33
524.872	155.49
525.296	128.79
525.719	208.89
526.143	284.14
526.566	174.91
526.989	187.05
527.412	150.64
527.836	131.22
528.259	133.65
528.682	75.4
529.105	174.91
529.528	187.05
529.951	167.63
530.374	121.51
530.796	177.34
531.219	174.91
531.642	148.21
532.065	116.66
532.487	143.36
532.91	174.91
533.332	157.92
533.755	216.17
534.177	165.2
534.6	216.17
535.022	153.07
535.444	153.07
535.867	174.91
536.289	182.19
536.711	157.92
537.133	162.78
537.555	208.89
537.977	170.06
538.399	179.77
538.821	172.48
539.243	162.78
539.665	206.47
540.086	238.02
540.508	221.03
540.93	174.91
541.351	235.59
541.773	87.53
542.195	162.78
542.616	179.77
543.037	131.22
543.459	184.62
543.88	155.49
544.301	257.44
544.723	179.77
545.144	194.33
545.565	174.91
545.986	262.29
546.407	201.61
546.828	177.34
547.249	145.79
547.67	133.65
548.091	167.63
548.512	206.47
548.932	208.89
549.353	252.58
549.774	104.52
550.194	213.75
550.615	119.09
551.035	167.63
551.456	208.89
551.876	160.35
552.296	238.02
552.717	155.49
553.137	148.21
553.557	160.35
553.977	213.75
554.397	153.07
554.817	136.08
555.237	272
555.657	138.5
556.077	150.64
556.497	114.23
556.917	145.79
557.337	255.01
557.756	189.48
558.176	148.21
558.596	204.04
559.015	150.64
559.435	211.32
559.854	187.05
560.274	262.29
560.693	206.47
561.112	148.21
561.532	179.77
561.951	206.47
562.37	196.76
562.789	194.33
563.208	179.77
563.627	191.9
564.046	201.61
564.465	133.65
564.884	177.34
565.303	155.49
565.722	111.8
566.14	216.17
566.559	177.34
566.978	216.17
567.396	104.52
567.815	172.48
568.233	191.9
568.652	121.51
569.07	187.05
569.489	218.6
569.907	143.36
570.325	174.91
570.743	235.59
571.161	177.34
571.58	211.32
571.998	184.62
572.416	162.78
572.833	199.18
573.251	196.76
573.669	223.46
574.087	213.75
574.505	99.67
574.922	133.65
575.34	140.93
575.758	179.77
576.175	211.32
576.593	150.64
577.01	182.19
577.428	172.48
577.845	1570.56
578.262	235.59
578.68	204.04
579.097	165.2
579.514	179.77
579.931	189.48
580.348	187.05
580.765	208.89
581.182	206.47
581.599	153.07
582.016	111.8
582.433	177.34
582.849	194.33
583.266	177.34
583.683	189.48
584.099	206.47
584.516	194.33
584.933	211.32
585.349	172.48
585.765	206.47
586.182	145.79
586.598	145.79
587.014	228.31
587.431	233.17
587.847	223.46
588.263	121.51
588.679	133.65
589.095	201.61
589.511	240.45
589.927	170.06
590.343	145.79
590.759	206.47
591.174	172.48
591.59	119.09
592.006	213.75
592.421	218.6
592.837	150.64
593.252	85.1
593.668	167.63
594.083	204.04
594.499	189.48
594.914	191.9
595.329	94.81
595.745	172.48
596.16	221.03
596.575	136.08
596.99	157.92
597.405	165.2
597.82	182.19
598.235	172.48
598.65	160.35
599.065	145.79
599.479	165.2
599.894	206.47
600.309	106.95
600.724	148.21
601.138	177.34
601.553	150.64
601.967	153.07
602.382	208.89
602.796	174.91
603.21	182.19
603.625	182.19
604.039	174.91
604.453	223.46
604.867	191.9
605.281	194.33
605.695	153.07
606.109	218.6
606.523	167.63
606.937	189.48
607.351	305.98
607.765	228.31
608.178	136.08
608.592	148.21
609.006	179.77
609.419	194.33
609.833	165.2
610.246	104.52
610.66	172.48
611.073	111.8
611.487	177.34
611.9	221.03
612.313	131.22
612.726	148.21
613.139	187.05
613.553	208.89
613.966	228.31
614.379	131.22
614.792	189.48
615.204	160.35
615.617	191.9
616.03	170.06
616.443	177.34
616.856	206.47
617.268	179.77
617.681	165.2
618.093	148.21
618.506	196.76
618.918	208.89
619.331	218.6
619.743	196.76
620.155	155.49
620.568	143.36
620.98	94.81
621.392	162.78
621.804	138.5
622.216	213.75
622.628	131.22
623.04	213.75
623.452	191.9
623.864	138.5
624.276	211.32
624.687	177.34
625.099	223.46
625.511	123.94
625.922	109.38
626.334	126.37
626.745	160.35
627.157	187.05
627.568	208.89
627.979	216.17
628.391	153.07
628.802	199.18
629.213	174.91
629.624	174.91
630.035	213.75
630.446	155.49
630.857	245.3
631.268	172.48
631.679	196.76
632.09	160.35
632.501	136.08
632.912	145.79
633.322	189.48
633.733	177.34
634.144	172.48
634.554	199.18
634.965	136.08
635.375	131.22
635.785	184.62
636.196	204.04
636.606	199.18
637.016	150.64
637.427	196.76
637.837	157.92
638.247	228.31
638.657	182.19
639.067	140.93
639.477	194.33
639.887	223.46
640.297	157.92
640.706	165.2
641.116	223.46
641.526	80.25
641.935	145.79
642.345	187.05
642.755	123.94
643.164	196.76
643.573	242.87
643.983	172.48
644.392	145.79
644.801	153.07
645.211	167.63
645.62	170.06
646.029	182.19
646.438	92.39
646.847	221.03
647.256	116.66
647.665	160.35
648.074	189.48
648.483	99.67
648.892	123.94
649.3	153.07
649.709	128.79
650.118	221.03
650.526	119.09
650.935	170.06
651.343	157.92
651.752	97.24
652.16	116.66
652.568	150.64
652.977	167.63
653.385	213.75
653.793	184.62
654.201	123.94
654.609	172.48
655.017	111.8
655.425	114.23
655.833	206.47
656.241	211.32
656.649	218.6
657.057	204.04
657.464	177.34
657.872	128.79
658.28	157.92
658.687	204.04
659.095	126.37
659.502	213.75
659.91	162.78
660.317	196.76
660.724	153.07
661.132	99.67
661.539	119.09
661.946	201.61
662.353	136.08
662.76	109.38
663.167	165.2
663.574	184.62
663.981	160.35
664.388	136.08
664.795	133.65
665.202	121.51
665.608	148.21
666.015	184.62
666.422	133.65
666.828	204.04
667.235	189.48
667.641	160.35
668.047	160.35
668.454	109.38
668.86	194.33
669.266	116.66
669.673	170.06
670.079	221.03
670.485	80.25
670.891	136.08
671.297	126.37
671.703	201.61
672.109	140.93
672.515	187.05
672.92	184.62
673.326	182.19
673.732	138.5
674.138	148.21
674.543	191.9
674.949	116.66
675.354	150.64
675.76	128.79
676.165	177.34
676.57	167.63
676.976	143.36
677.381	174.91
677.786	187.05
678.191	111.8
678.596	123.94
679.001	170.06
679.406	155.49
679.811	194.33
680.216	162.78
680.621	230.74
681.026	145.79
681.43	170.06
681.835	157.92
682.24	167.63
682.644	179.77
683.049	196.76
683.453	150.64
683.858	116.66
684.262	172.48
684.667	143.36
685.071	184.62
685.475	155.49
685.879	208.89
686.283	153.07
686.687	145.79
687.091	177.34
687.495	138.5
687.899	179.77
688.303	165.2
688.707	182.19
689.111	201.61
689.514	179.77
689.918	143.36
690.322	187.05
690.725	140.93
691.129	211.32
691.532	128.79
691.936	126.37
692.339	162.78
692.742	128.79
693.146	211.32
693.549	126.37
693.952	170.06
694.355	182.19
694.758	238.02
695.161	133.65
695.564	184.62
695.967	194.33
696.37	121.51
696.773	165.2
697.175	155.49
697.578	187.05
697.981	148.21
698.383	223.46
698.786	150.64
699.188	204.04
699.591	114.23
699.993	172.48
700.395	138.5
700.798	136.08
701.2	143.36
701.602	184.62
702.004	170.06
702.406	148.21
702.808	126.37
703.21	179.77
703.612	179.77
704.014	138.5
704.416	204.04
704.818	189.48
705.219	148.21
705.621	179.77
706.023	133.65
706.424	187.05
706.826	172.48
707.227	160.35
707.629	145.79
708.03	128.79
708.431	157.92
708.832	204.04
709.234	206.47
709.635	233.17
710.036	221.03
710.437	228.31
710.838	235.59
711.239	187.05
711.64	216.17
712.041	143.36
712.441	165.2
712.842	230.74
713.243	247.73
713.643	235.59
714.044	153.07
714.445	230.74
714.845	157.92
715.246	233.17
715.646	165.2
716.046	131.22
716.447	293.85
716.847	233.17
717.247	269.57
717.647	267.15
718.047	216.17
718.447	221.03
718.847	216.17
719.247	230.74
719.647	284.14
720.047	240.45
720.446	252.58
720.846	199.18
721.246	240.45
721.645	250.16
722.045	279.28
722.444	298.7
722.844	187.05
723.243	211.32
723.643	286.56
724.042	216.17
724.441	233.17
724.84	196.76
725.24	247.73
725.639	349.67
726.038	255.01
726.437	216.17
726.836	257.44
727.234	213.75
727.633	199.18
728.032	298.7
728.431	250.16
728.83	330.25
729.228	281.71
729.627	342.39
730.025	315.69
730.424	395.79
730.822	366.66
731.22	344.82
731.619	349.67
732.017	415.21
732.415	415.21
732.813	454.04
733.212	432.2
733.61	488.02
734.008	488.02
734.406	541.42
734.803	614.24
735.201	636.08
735.599	619.09
735.997	640.94
736.395	721.04
736.792	742.88
737.19	772.01
737.587	793.85
737.985	818.13
738.382	818.13
738.78	917.64
739.177	1019.59
739.574	934.63
739.971	1012.3
740.369	1077.84
740.766	1189.49
741.163	1155.51
741.56	1199.2
741.957	1233.18
742.354	1330.27
742.751	1308.42
743.147	1478.33
743.544	1412.8
743.941	1546.29
744.338	1640.95
744.734	1704.06
745.131	1774.45
745.527	1791.44
745.924	1849.7
746.32	1873.97
746.716	2082.71
747.113	2102.13
747.509	2165.23
747.905	2376.4
748.301	2546.31
748.697	2437.08
749.093	2638.54
749.489	2769.61
749.885	2937.09
750.281	3085.15
750.677	3153.11
751.073	3252.63
751.468	3468.65
751.864	3587.59
752.26	3648.27
752.655	3842.44
753.051	3958.95
753.446	4126.43
753.842	4267.21
754.237	4471.1
754.632	4507.5
755.028	4483.23
755.423	4730.81
755.818	4803.62
756.213	4971.1
756.608	4971.1
757.003	5099.75
757.398	5007.51
757.793	5131.3
758.188	5165.28
758.583	5386.16
758.977	5505.09
759.372	5791.5
759.767	5895.87
760.161	6267.24
760.556	6403.16
760.95	6750.26
761.345	7041.52
761.739	7400.75
762.133	7444.44
762.527	7740.56
762.922	7832.8
763.316	8310.96
763.71	8364.36
764.104	8318.24
764.498	8546.4
764.892	9094.95
765.286	9060.97
765.68	9366.8
766.073	9626.52
766.467	9359.52
766.861	9871.66
767.255	10340.12
767.648	10594.98
768.042	10500.32
768.435	10842.55
768.829	10871.68
769.222	10976.05
769.615	11206.64
770.008	11252.75
770.402	11502.76
770.795	11777.03
771.188	11988.2
771.581	11762.47
771.974	11738.2
772.367	11558.58
772.76	12044.03
773.153	11488.19
773.545	11699.36
773.938	11772.18
774.331	11929.95
774.724	12206.65
775.116	12667.82
775.509	12842.58
775.901	13476.09
776.294	13769.78
776.686	14041.63
777.078	14349.89
777.471	14840.19
777.863	14973.69
778.255	15548.94
778.647	16053.8
779.039	16051.37
779.431	16097.49
779.823	15886.32
780.215	16245.55
780.607	15927.58
780.999	16524.68
781.39	16447.01
781.782	16769.83
782.174	16832.94
782.565	16798.96
782.957	16993.13
783.348	17165.47
783.74	17226.15
784.131	17328.09
784.522	17536.83
784.914	17233.43
785.305	17245.57
785.696	16879.06
786.087	16747.99
786.478	16740.7
786.869	15849.91
787.26	15548.94
787.651	15480.98
788.042	15272.23
788.433	15075.63
788.823	14524.65
789.214	14279.5
789.605	13997.94
789.995	13478.52
790.386	13311.04
790.776	13318.32
791.167	13376.57
791.557	13614.44
791.948	13728.52
792.338	13963.96
792.728	14675.14
793.118	14463.97
793.508	14646.01
793.898	14556.2
794.288	14587.76
794.678	14500.38
795.068	14585.33
795.458	14638.73
795.848	14097.46
796.238	14510.09
796.627	14131.44
797.017	14349.89
797.406	14485.81
797.796	14189.69
798.185	14624.17
798.575	14332.9
798.964	14206.68
799.354	14653.29
799.743	14563.49
800.132	14723.68
800.521	14514.94
800.91	14488.24
801.299	14286.78
801.688	14335.33
802.077	13990.66
802.466	13832.89
802.855	13893.57
803.244	13558.62
803.633	13318.32
804.021	13044.04
804.41	12888.7
804.799	12801.32
805.187	12352.29
805.576	11949.37
805.964	11531.88
806.352	11201.78
806.741	11250.33
807.129	10699.35
807.517	10988.19
807.905	11179.94
808.293	10917.8
808.681	11094.98
809.069	11034.3
809.457	11102.27
809.845	11267.32
810.233	11522.18
810.621	11349.84
811.009	11097.41
811.396	11218.77
811.784	11352.27
812.171	11158.09
812.559	11167.8
812.946	10650.8
813.334	10505.17
813.721	10403.23
814.108	10085.26
814.496	10230.89
814.883	10075.55
815.27	10177.49
815.657	10235.75
816.044	10192.06
816.431	9929.92
816.818	9551.27
817.205	9973.61
817.592	9774.58
817.979	9510.01
818.365	9340.1
818.752	9128.93
819.139	8696.89
819.525	8757.57
819.912	8240.57
820.298	8274.55
820.685	7971.15
821.071	7864.35
821.457	7585.22
821.843	7087.64
822.23	7085.21
822.616	6898.32
823.002	6512.39
823.388	6298.79
823.774	6383.75
824.16	6014.81
824.546	5725.97
824.931	5519.66
825.317	5553.64
825.703	5320.62
826.089	5427.42
826.474	5306.06
826.86	5259.94
827.245	5063.34
827.631	5206.54
828.016	4944.4
828.401	4857.02
828.787	4825.47
829.172	4842.46
829.557	4570.61
829.942	4441.97
830.327	4417.7
830.712	4335.17
831.097	4189.54
831.482	4225.95
831.867	3886.13
832.252	3827.88
832.636	3716.23
833.021	3808.46
833.406	3633.7
833.79	3762.35
834.175	3507.49
834.559	3534.19
834.944	3373.99
835.328	3427.39
835.713	3201.66
836.097	3165.25
836.481	3026.9
836.865	2856.99
837.249	2900.68
837.633	2660.39
838.017	2689.51
838.401	2541.45
838.785	2376.4
839.169	2330.29
839.553	2259.9
839.937	2245.33
840.32	2080.28
840.704	2036.59
841.087	1941.93
841.471	1883.68
841.854	1793.87
842.238	1742.9
842.621	1757.46
843.004	1730.76
843.388	1604.55
843.771	1594.84
844.154	1553.57
844.537	1519.59
844.92	1560.86
845.303	1514.74
845.686	1439.49
846.069	1390.95
846.452	1456.49
846.834	1429.79
847.217	1451.63
847.6	1395.8
847.982	1291.43
848.365	1286.58
848.748	1233.18
849.13	1240.46
849.512	1194.35
849.895	1172.5
850.277	1123.96
850.659	1119.1
851.041	1063.28
851.423	1111.82
851.806	1017.16
852.188	990.46
852.57	1017.16
852.951	1026.87
853.333	951.62
853.715	937.06
854.097	871.52
854.479	915.21
854.86	805.99
855.242	803.56
855.623	822.98
856.005	769.58
856.386	665.21
856.768	733.17
857.149	708.9
857.53	716.18
857.911	631.23
858.292	701.62
858.674	606.96
859.055	587.54
859.436	614.24
859.817	514.72
860.197	616.67
860.578	604.53
860.959	587.54
861.34	548.7
861.72	531.71
862.101	507.44
862.482	492.88
862.862	434.62
863.243	427.34
863.623	485.6
864.003	424.92
864.384	400.64
864.764	412.78
865.144	393.36
865.524	454.04
865.904	424.92
866.284	400.64
866.664	359.38
867.044	395.79
867.424	386.08
867.804	395.79
868.183	335.11
868.563	361.81
868.943	320.55
869.322	383.65
869.702	315.69
870.081	305.98
870.461	284.14
870.84	407.93
871.22	310.84
871.599	262.29
871.978	264.72
872.357	262.29
872.736	281.71
873.115	279.28
873.494	218.6
873.873	225.88
874.252	267.15
874.631	221.03
875.01	286.56
875.388	257.44
875.767	228.31
876.146	288.99
876.524	279.28
876.903	157.92
877.281	259.86
877.66	216.17
878.038	191.9
878.416	252.58
878.794	187.05
879.173	189.48
879.551	245.3
879.929	267.15
880.307	216.17
880.685	75.4
881.063	201.61
881.441	143.36
881.818	204.04
882.196	223.46
882.574	148.21
882.951	199.18
883.329	196.76
883.707	228.31
884.084	204.04
884.461	167.63
884.839	121.51
885.216	221.03
885.593	167.63
885.971	196.76
886.348	160.35
886.725	153.07
887.102	199.18
887.479	189.48
887.856	162.78
888.233	140.93
888.609	216.17
888.986	111.8
889.363	153.07
889.74	157.92
890.116	116.66
890.493	140.93
890.869	157.92
891.246	213.75
891.622	143.36
891.998	165.2
892.375	177.34
892.751	153.07
893.127	196.76
893.503	182.19
893.879	170.06
894.255	104.52
894.631	89.96
895.007	150.64
895.383	148.21
895.759	89.96
896.134	172.48
896.51	167.63
896.886	136.08
897.261	189.48
897.637	116.66
898.012	109.38
898.388	133.65
898.763	153.07
899.138	131.22
899.514	191.9
899.889	128.79
900.264	153.07
900.639	143.36
901.014	133.65
901.389	138.5
901.764	148.21
902.139	102.1
902.513	126.37
902.888	201.61
903.263	174.91
903.638	85.1
904.012	211.32
904.387	179.77
904.761	97.24
905.136	160.35
905.51	162.78
905.884	170.06
906.259	126.37
906.633	170.06
907.007	233.17
907.381	138.5
907.755	119.09
908.129	123.94
908.503	189.48
908.877	119.09
909.251	106.95
909.624	87.53
909.998	204.04
910.372	165.2
910.745	170.06
911.119	170.06
911.492	208.89
911.866	196.76
912.239	138.5
912.612	157.92
912.986	204.04
913.359	140.93
913.732	162.78
914.105	123.94
914.478	102.1
914.851	140.93
915.224	148.21
915.597	138.5
915.97	133.65
916.343	136.08
916.715	104.52
917.088	131.22
917.461	104.52
917.833	131.22
918.206	235.59
918.578	104.52
918.951	133.65
919.323	153.07
919.695	94.81
920.067	177.34
920.44	99.67
920.812	201.61
921.184	114.23
921.556	153.07
921.928	123.94
922.3	172.48
922.672	206.47
923.043	138.5
923.415	148.21
923.787	89.96
924.158	174.91
924.53	153.07
924.901	162.78
925.273	167.63
925.644	167.63
926.016	140.93
926.387	97.24
926.758	143.36
927.129	136.08
927.5	82.68
927.872	208.89
928.243	128.79
928.613	123.94
928.984	145.79
929.355	148.21
929.726	153.07
930.097	211.32
930.467	179.77
930.838	182.19
931.209	131.22
931.579	136.08
931.95	128.79
932.32	131.22
932.69	182.19
933.061	140.93
933.431	138.5
933.801	172.48
934.171	140.93
934.541	126.37
934.911	128.79
935.281	138.5
935.651	189.48
936.021	46.27
936.391	145.79
936.761	106.95
937.13	148.21
937.5	165.2
937.87	199.18
938.239	123.94
938.609	255.01
938.978	177.34
939.347	143.36
939.717	191.9
940.086	89.96
940.455	184.62
940.824	259.86
941.193	196.76
941.562	165.2
941.931	191.9
942.3	155.49
942.669	184.62
943.038	177.34
943.407	167.63
943.775	133.65
944.144	123.94
944.513	206.47
944.881	114.23
945.25	213.75
945.618	128.79
945.986	208.89
946.355	87.53
946.723	109.38
947.091	131.22
947.459	128.79
947.827	170.06
948.195	145.79
948.563	160.35
948.931	167.63
949.299	177.34
949.667	157.92
950.035	179.77
950.402	252.58
950.77	123.94
951.138	80.25
951.505	177.34
951.873	102.1
952.24	131.22
952.607	177.34
952.975	114.23
953.342	97.24
953.709	165.2
954.076	221.03
954.443	109.38
954.81	145.79
955.177	174.91
955.544	119.09
955.911	208.89
956.278	162.78
956.645	191.9
957.012	133.65
957.378	133.65
957.745	143.36
958.111	150.64
958.478	189.48
958.844	172.48
959.211	140.93
959.577	150.64
959.943	140.93
960.309	238.02
960.675	216.17
961.042	153.07
961.408	184.62
961.774	165.2
962.139	119.09
962.505	206.47
962.871	179.77
963.237	184.62
963.603	123.94
963.968	153.07
964.334	172.48
964.699	121.51
965.065	264.72
965.43	148.21
965.796	102.1
966.161	143.36
966.526	128.79
966.891	145.79
967.256	194.33
967.622	99.67
967.987	145.79
968.352	136.08
968.716	162.78
969.081	153.07
969.446	94.81
969.811	92.39
970.176	104.52
970.54	150.64
970.905	121.51
971.269	109.38
971.634	160.35
971.998	196.76
972.363	111.8
972.727	106.95
973.091	179.77
973.455	138.5
973.819	104.52
974.183	140.93
974.547	191.9
974.911	128.79
975.275	182.19
975.639	102.1
976.003	106.95
976.367	70.54
976.73	109.38
977.094	153.07
977.458	174.91
977.821	148.21
978.185	174.91
978.548	157.92
978.911	145.79
979.275	172.48
979.638	128.79
980.001	106.95
980.364	150.64
980.727	140.93
981.09	123.94
981.453	153.07
981.816	140.93
982.179	245.3
982.542	145.79
982.905	143.36
983.267	145.79
983.63	80.25
983.992	155.49
984.355	131.22
984.717	160.35
985.08	160.35
985.442	199.18
985.804	109.38
986.167	153.07
986.529	160.35
986.891	160.35
987.253	172.48
987.615	196.76
987.977	138.5
988.339	128.79
988.701	221.03
989.062	189.48
989.424	167.63
989.786	136.08
990.147	136.08
990.509	162.78
990.87	114.23
991.232	80.25
991.593	148.21
991.955	206.47
992.316	116.66
992.677	172.48
993.038	85.1
993.399	160.35
993.76	160.35
994.121	119.09
994.482	114.23
994.843	133.65
995.204	94.81
995.565	157.92
995.926	97.24
996.286	99.67
996.647	225.88
997.007	155.49
997.368	136.08
997.728	150.64
998.089	165.2
998.449	131.22
998.809	138.5
999.169	92.39
999.53	191.9
999.89	123.94
1000.25	179.77
1000.61	174.91
1000.97	140.93
1001.329	114.23
1001.689	143.36
1002.049	106.95
1002.409	174.91
1002.768	99.67
1003.128	109.38
1003.487	160.35
1003.847	131.22
1004.206	114.23
1004.566	165.2
1004.925	172.48
1005.284	99.67
1005.643	138.5
1006.003	114.23
1006.362	201.61
1006.721	196.76
1007.08	111.8
1007.438	167.63
1007.797	160.35
1008.156	177.34
1008.515	128.79
1008.874	89.96
1009.232	179.77
1009.591	170.06
1009.949	104.52
1010.308	206.47
1010.666	153.07
1011.024	187.05
1011.383	128.79
1011.741	187.05
1012.099	136.08
1012.457	155.49
1012.815	199.18
1013.173	99.67
1013.531	136.08
1013.889	68.11
1014.247	165.2
1014.605	131.22
1014.962	153.07
1015.32	136.08
1015.678	97.24
1016.035	68.11
1016.393	114.23
1016.75	150.64
1017.107	160.35
1017.465	157.92
1017.822	143.36
1018.179	157.92
1018.536	143.36
1018.894	80.25
1019.251	131.22
1019.608	150.64
1019.964	150.64
1020.321	165.2
1020.678	162.78
1021.035	94.81
1021.392	145.79
1021.748	128.79
1022.105	196.76
1022.461	136.08
1022.818	128.79
1023.174	80.25
1023.531	136.08
1023.887	182.19
1024.243	177.34
1024.599	179.77
1024.955	187.05
1025.311	148.21
1025.667	94.81
1026.023	201.61
1026.379	111.8
1026.735	225.88
1027.091	150.64
1027.447	179.77
