189.514	61.29
189.973	61.29
190.431	61.29
190.889	-16.38
191.348	-26.09
191.806	3.03
192.264	-1.82
192.722	-30.95
193.18	17.6
193.638	-33.37
194.096	-67.36
194.554	29.73
195.012	22.45
195.47	-28.52
195.928	-11.53
196.385	-64.93
196.843	-33.37
197.301	22.45
197.758	-28.52
198.216	20.02
198.674	102.55
199.131	85.56
199.589	68.57
200.046	75.85
200.503	90.41
200.961	102.55
201.418	114.69
201.875	109.83
202.332	124.4
202.79	134.1
203.247	107.4
203.704	129.25
204.161	95.27
204.618	121.97
205.075	243.33
205.532	175.37
205.989	165.66
206.445	185.08
206.902	170.51
207.359	182.65
207.816	158.38
208.272	117.11
208.729	92.84
209.185	138.96
209.642	119.54
210.098	187.5
210.555	165.66
211.011	187.5
211.467	85.56
211.924	114.69
212.38	219.06
212.836	172.94
213.292	126.82
213.748	107.4
214.204	160.8
214.66	206.92
215.116	199.64
215.572	121.97
216.028	163.23
216.484	148.67
216.94	168.09
217.396	104.98
217.851	71
218.307	37.02
218.763	151.09
219.218	202.07
219.674	112.26
220.129	172.94
220.585	175.37
221.04	170.51
221.496	148.67
221.951	151.09
222.406	175.37
222.861	180.22
223.317	182.65
223.772	119.54
224.227	136.53
224.682	138.96
225.137	165.66
225.592	151.09
226.047	228.77
226.502	155.95
226.957	182.65
227.411	170.51
227.866	83.13
228.321	158.38
228.776	134.1
229.23	117.11
229.685	143.81
230.139	136.53
230.594	206.92
231.048	158.38
231.503	131.68
231.957	104.98
232.411	87.99
232.865	153.52
233.32	185.08
233.774	177.79
234.228	165.66
234.682	54.01
235.136	153.52
235.59	151.09
236.044	168.09
236.498	189.93
236.952	134.1
237.406	85.56
237.86	102.55
238.313	141.39
238.767	102.55
239.221	138.96
239.674	168.09
240.128	61.29
240.581	160.8
241.035	80.71
241.488	90.41
241.942	151.09
242.395	131.68
242.848	168.09
243.301	165.66
243.755	134.1
244.208	134.1
244.661	114.69
245.114	180.22
245.567	68.57
246.02	63.71
246.473	165.66
246.926	138.96
247.379	100.12
247.832	160.8
248.284	141.39
248.737	163.23
249.19	192.36
249.642	172.94
250.095	141.39
250.547	165.66
251	160.8
251.452	138.96
251.905	138.96
252.357	165.66
252.81	151.09
253.262	109.83
253.714	175.37
254.166	107.4
254.618	182.65
255.07	143.81
255.523	194.78
255.975	168.09
256.427	119.54
256.878	197.21
257.33	148.67
257.782	197.21
258.234	151.09
258.686	221.48
259.137	185.08
259.589	160.8
260.041	141.39
260.492	153.52
260.944	160.8
261.395	141.39
261.847	199.64
262.298	163.23
262.749	172.94
263.201	158.38
263.652	95.27
264.103	163.23
264.554	121.97
265.005	163.23
265.457	143.81
265.908	172.94
266.359	172.94
266.809	104.98
267.26	119.54
267.711	107.4
268.162	197.21
268.613	204.49
269.064	151.09
269.514	163.23
269.965	165.66
270.415	151.09
270.866	124.4
271.316	209.35
271.767	90.41
272.217	163.23
272.668	168.09
273.118	165.66
273.568	177.79
274.019	131.68
274.469	90.41
274.919	158.38
275.369	163.23
275.819	107.4
276.269	248.18
276.719	138.96
277.169	160.8
277.619	177.79
278.069	194.78
278.518	168.09
278.968	168.09
279.418	182.65
279.867	134.1
280.317	97.7
280.767	163.23
281.216	238.47
281.666	131.68
282.115	194.78
282.564	78.28
283.014	231.19
283.463	114.69
283.912	172.94
284.361	177.79
284.811	155.95
285.26	148.67
285.709	189.93
286.158	121.97
286.607	165.66
287.056	194.78
287.505	165.66
287.953	131.68
288.402	163.23
288.851	124.4
289.3	121.97
289.748	185.08
290.197	146.24
290.646	163.23
291.094	175.37
291.543	141.39
291.991	129.25
292.439	153.52
292.888	209.35
293.336	126.82
293.784	129.25
294.233	121.97
294.681	180.22
295.129	95.27
295.577	172.94
296.025	177.79
296.473	180.22
296.921	170.51
297.369	177.79
297.817	136.53
298.264	172.94
298.712	170.51
299.16	136.53
299.608	172.94
300.055	172.94
300.503	141.39
300.95	192.36
301.398	177.79
301.845	204.49
302.293	126.82
302.74	211.78
303.187	223.91
303.635	180.22
304.082	170.51
304.529	151.09
304.976	160.8
305.423	136.53
305.87	180.22
306.317	136.53
306.764	211.78
307.211	209.35
307.658	155.95
308.105	124.4
308.552	187.5
308.998	117.11
309.445	109.83
309.892	177.79
310.338	141.39
310.785	80.71
311.231	185.08
311.678	197.21
312.124	172.94
312.571	155.95
313.017	95.27
313.463	112.26
313.909	119.54
314.356	160.8
314.802	182.65
315.248	172.94
315.694	138.96
316.14	100.12
316.586	155.95
317.032	270.03
317.478	170.51
317.923	248.18
318.369	155.95
318.815	146.24
319.261	141.39
319.706	172.94
320.152	255.47
320.597	107.4
321.043	153.52
321.488	134.1
321.934	117.11
322.379	92.84
322.824	71
323.27	85.56
323.715	155.95
324.16	151.09
324.605	141.39
325.05	107.4
325.495	163.23
325.94	146.24
326.385	119.54
326.83	124.4
327.275	219.06
327.72	158.38
328.165	197.21
328.61	192.36
329.054	163.23
329.499	185.08
329.943	114.69
330.388	185.08
330.832	146.24
331.277	155.95
331.721	155.95
332.166	192.36
332.61	131.68
333.054	158.38
333.499	180.22
333.943	117.11
334.387	97.7
334.831	206.92
335.275	175.37
335.719	177.79
336.163	211.78
336.607	168.09
337.051	148.67
337.495	124.4
337.938	206.92
338.382	165.66
338.826	202.07
339.269	136.53
339.713	180.22
340.157	104.98
340.6	197.21
341.044	199.64
341.487	158.38
341.93	148.67
342.374	109.83
342.817	197.21
343.26	143.81
343.703	175.37
344.146	182.65
344.59	112.26
345.033	182.65
345.476	177.79
345.919	121.97
346.361	121.97
346.804	107.4
347.247	175.37
347.69	170.51
348.133	114.69
348.575	153.52
349.018	206.92
349.461	165.66
349.903	73.42
350.346	180.22
350.788	172.94
351.23	138.96
351.673	134.1
352.115	78.28
352.557	73.42
353	223.91
353.442	243.33
353.884	112.26
354.326	197.21
354.768	180.22
355.21	136.53
355.652	143.81
356.094	119.54
356.536	160.8
356.978	131.68
357.419	146.24
357.861	187.5
358.303	102.55
358.744	172.94
359.186	146.24
359.627	192.36
360.069	131.68
360.51	151.09
360.952	141.39
361.393	134.1
361.834	228.77
362.276	102.55
362.717	182.65
363.158	75.85
363.599	114.69
364.04	151.09
364.481	168.09
364.922	165.66
365.363	124.4
365.804	175.37
366.245	153.52
366.686	182.65
367.126	204.49
367.567	136.53
368.008	209.35
368.448	189.93
368.889	146.24
369.33	155.95
369.77	151.09
370.21	170.51
370.651	172.94
371.091	236.05
371.531	197.21
371.972	216.63
372.412	138.96
372.852	163.23
373.292	187.5
373.732	87.99
374.172	104.98
374.612	141.39
375.052	143.81
375.492	104.98
375.932	204.49
376.372	85.56
376.811	204.49
377.251	240.9
377.691	180.22
378.13	121.97
378.57	180.22
379.009	158.38
379.449	121.97
379.888	185.08
380.328	160.8
380.767	104.98
381.206	165.66
381.645	80.71
382.085	143.81
382.524	131.68
382.963	158.38
383.402	112.26
383.841	112.26
384.28	197.21
384.719	78.28
385.158	146.24
385.596	143.81
386.035	172.94
386.474	148.67
386.913	180.22
387.351	102.55
387.79	151.09
388.228	102.55
388.667	107.4
389.105	180.22
389.544	92.84
389.982	160.8
390.42	160.8
390.859	151.09
391.297	146.24
391.735	172.94
392.173	143.81
392.611	131.68
393.049	117.11
393.487	104.98
393.925	163.23
394.363	155.95
394.801	141.39
395.239	121.97
395.676	172.94
396.114	182.65
396.552	172.94
396.989	134.1
397.427	228.77
397.864	119.54
398.302	170.51
398.739	126.82
399.177	80.71
399.614	56.43
400.051	170.51
400.488	153.52
400.926	189.93
401.363	75.85
401.8	112.26
402.237	189.93
402.674	170.51
403.111	192.36
403.548	158.38
403.985	197.21
404.421	129.25
404.858	97.7
405.295	168.09
405.732	90.41
406.168	175.37
406.605	197.21
407.041	192.36
407.478	221.48
407.914	83.13
408.351	97.7
408.787	182.65
409.223	204.49
409.66	177.79
410.096	95.27
410.532	185.08
410.968	151.09
411.404	90.41
411.84	172.94
412.276	204.49
412.712	121.97
413.148	109.83
413.584	138.96
414.02	185.08
414.455	204.49
414.891	92.84
415.327	148.67
415.762	114.69
416.198	117.11
416.633	114.69
417.069	114.69
417.504	175.37
417.94	168.09
418.375	121.97
418.81	141.39
419.245	160.8
419.681	146.24
420.116	83.13
420.551	107.4
420.986	170.51
421.421	136.53
421.856	177.79
422.291	185.08
422.726	131.68
423.16	175.37
423.595	170.51
424.03	104.98
424.464	126.82
424.899	180.22
425.334	109.83
425.768	129.25
426.203	141.39
426.637	126.82
427.071	282.16
427.506	49.15
427.94	107.4
428.374	216.63
428.809	165.66
429.243	124.4
429.677	170.51
430.111	141.39
430.545	165.66
430.979	97.7
431.413	97.7
431.847	126.82
432.28	158.38
432.714	75.85
433.148	97.7
433.582	165.66
434.015	131.68
434.449	216.63
434.882	148.67
435.316	138.96
435.749	165.66
436.183	192.36
436.616	121.97
437.049	211.78
437.483	172.94
437.916	194.78
438.349	175.37
438.782	194.78
439.215	73.42
439.648	126.82
440.081	155.95
440.514	155.95
440.947	138.96
441.38	170.51
441.813	146.24
442.245	177.79
442.678	180.22
443.111	155.95
443.543	114.69
443.976	199.64
444.408	170.51
444.841	223.91
445.273	143.81
445.705	199.64
446.138	129.25
446.57	165.66
447.002	92.84
447.434	124.4
447.867	143.81
448.299	151.09
448.731	134.1
449.163	168.09
449.595	180.22
450.026	102.55
450.458	163.23
450.89	136.53
451.322	124.4
451.754	114.69
452.185	172.94
452.617	75.85
453.048	117.11
453.48	240.9
453.911	206.92
454.343	180.22
454.774	228.77
455.205	158.38
455.637	170.51
456.068	100.12
456.499	168.09
456.93	257.89
457.361	138.96
457.792	172.94
458.223	170.51
458.654	197.21
459.085	134.1
459.516	187.5
459.947	189.93
460.378	124.4
460.808	95.27
461.239	221.48
461.669	153.52
462.1	160.8
462.531	243.33
462.961	209.35
463.391	206.92
463.822	87.99
464.252	153.52
464.682	112.26
465.113	250.61
465.543	165.66
465.973	182.65
466.403	153.52
466.833	134.1
467.263	97.7
467.693	153.52
468.123	151.09
468.553	148.67
468.983	182.65
469.412	114.69
469.842	219.06
470.272	243.33
470.701	148.67
471.131	160.8
471.56	136.53
471.99	92.84
472.419	155.95
472.849	199.64
473.278	80.71
473.707	170.51
474.136	168.09
474.566	219.06
474.995	182.65
475.424	189.93
475.853	253.04
476.282	148.67
476.711	187.5
477.14	102.55
477.569	204.49
477.997	97.7
478.426	165.66
478.855	182.65
479.283	223.91
479.712	245.76
480.141	209.35
480.569	172.94
480.998	204.49
481.426	185.08
481.854	248.18
482.283	134.1
482.711	158.38
483.139	231.19
483.567	168.09
483.995	177.79
484.424	121.97
484.852	204.49
485.28	153.52
485.708	325.85
486.135	250.61
486.563	153.52
486.991	170.51
487.419	155.95
487.847	194.78
488.274	202.07
488.702	214.2
489.129	223.91
489.557	172.94
489.984	204.49
490.412	180.22
490.839	202.07
491.266	177.79
491.694	221.48
492.121	262.75
492.548	146.24
492.975	151.09
493.402	185.08
493.829	233.62
494.256	155.95
494.683	148.67
495.11	170.51
495.537	170.51
495.964	119.54
496.39	189.93
496.817	219.06
497.244	187.5
497.67	134.1
498.097	185.08
498.523	155.95
498.95	163.23
499.376	172.94
499.803	100.12
500.229	155.95
500.655	143.81
501.081	199.64
501.508	165.66
501.934	187.5
502.36	97.7
502.786	175.37
503.212	192.36
503.638	148.67
504.064	112.26
504.489	211.78
504.915	182.65
505.341	141.39
505.767	138.96
506.192	194.78
506.618	141.39
507.043	189.93
507.469	126.82
507.894	160.8
508.32	165.66
508.745	148.67
509.17	231.19
509.596	177.79
510.021	119.54
510.446	182.65
510.871	151.09
511.296	204.49
511.721	131.68
512.146	104.98
512.571	175.37
512.996	214.2
513.421	141.39
513.845	148.67
514.27	163.23
514.695	197.21
515.119	168.09
515.544	148.67
515.969	172.94
516.393	143.81
516.817	160.8
517.242	175.37
517.666	119.54
518.09	168.09
518.515	102.55
518.939	175.37
519.363	359.84
519.787	165.66
520.211	226.34
520.635	214.2
521.059	177.79
521.483	146.24
521.907	211.78
522.331	141.39
522.754	185.08
523.178	95.27
523.602	92.84
524.025	199.64
524.449	187.5
524.872	126.82
525.296	141.39
525.719	158.38
526.143	175.37
526.566	131.68
526.989	117.11
527.412	141.39
527.836	151.09
528.259	121.97
528.682	102.55
529.105	197.21
529.528	134.1
529.951	124.4
530.374	95.27
530.796	148.67
531.219	206.92
531.642	151.09
532.065	175.37
532.487	153.52
532.91	143.81
533.332	63.71
533.755	155.95
534.177	126.82
534.6	206.92
535.022	112.26
535.444	119.54
535.867	153.52
536.289	151.09
536.711	209.35
537.133	136.53
537.555	177.79
537.977	168.09
538.399	170.51
538.821	172.94
539.243	182.65
539.665	231.19
540.086	151.09
540.508	187.5
540.93	199.64
541.351	104.98
541.773	202.07
542.195	189.93
542.616	279.74
543.037	253.04
543.459	257.89
543.88	255.47
544.301	231.19
544.723	214.2
545.144	214.2
545.565	294.3
545.986	257.89
546.407	240.9
546.828	243.33
547.249	165.66
547.67	192.36
548.091	163.23
548.512	189.93
548.932	182.65
549.353	245.76
549.774	204.49
550.194	250.61
550.615	153.52
551.035	206.92
551.456	180.22
551.876	143.81
552.296	223.91
552.717	124.4
553.137	189.93
553.557	160.8
553.977	172.94
554.397	221.48
554.817	160.8
555.237	170.51
555.657	90.41
556.077	134.1
556.497	112.26
556.917	172.94
557.337	153.52
557.756	163.23
558.176	189.93
558.596	112.26
559.015	141.39
559.435	92.84
559.854	189.93
560.274	126.82
560.693	114.69
561.112	117.11
561.532	129.25
561.951	189.93
562.37	153.52
562.789	158.38
563.208	104.98
563.627	61.29
564.046	155.95
564.465	136.53
564.884	95.27
565.303	182.65
565.722	185.08
566.14	107.4
566.559	155.95
566.978	187.5
567.396	155.95
567.815	136.53
568.233	243.33
568.652	117.11
569.07	177.79
569.489	182.65
569.907	121.97
570.325	141.39
570.743	204.49
571.161	177.79
571.58	163.23
571.998	194.78
572.416	180.22
572.833	209.35
573.251	170.51
573.669	172.94
574.087	172.94
574.505	221.48
574.922	134.1
575.34	100.12
575.758	175.37
576.175	199.64
576.593	160.8
577.01	112.26
577.428	158.38
577.845	1728.79
578.262	279.74
578.68	219.06
579.097	136.53
579.514	158.38
579.931	90.41
580.348	185.08
580.765	124.4
581.182	223.91
581.599	253.04
582.016	141.39
582.433	112.26
582.849	102.55
583.266	160.8
583.683	114.69
584.099	202.07
584.516	141.39
584.933	182.65
585.349	153.52
585.765	175.37
586.182	163.23
586.598	155.95
587.014	209.35
587.431	189.93
587.847	182.65
588.263	228.77
588.679	219.06
589.095	177.79
589.511	185.08
589.927	270.03
590.343	170.51
590.759	119.54
591.174	160.8
591.59	199.64
592.006	131.68
592.421	165.66
592.837	117.11
593.252	194.78
593.668	185.08
594.083	187.5
594.499	197.21
594.914	185.08
595.329	175.37
595.745	194.78
596.16	216.63
596.575	124.4
596.99	87.99
597.405	143.81
597.82	185.08
598.235	131.68
598.65	95.27
599.065	153.52
599.479	119.54
599.894	104.98
600.309	248.18
600.724	219.06
601.138	165.66
601.553	175.37
601.967	197.21
602.382	146.24
602.796	117.11
603.21	131.68
603.625	143.81
604.039	168.09
604.453	134.1
604.867	151.09
605.281	223.91
605.695	172.94
606.109	185.08
606.523	155.95
606.937	192.36
607.351	304.01
607.765	134.1
608.178	155.95
608.592	194.78
609.006	136.53
609.419	185.08
609.833	253.04
610.246	141.39
610.66	206.92
611.073	240.9
611.487	151.09
611.9	238.47
612.313	177.79
612.726	170.51
613.139	221.48
613.553	202.07
613.966	240.9
614.379	236.05
614.792	221.48
615.204	194.78
615.617	163.23
616.03	187.5
616.443	165.66
616.856	192.36
617.268	199.64
617.681	175.37
618.093	168.09
618.506	187.5
618.918	168.09
619.331	153.52
619.743	131.68
620.155	143.81
620.568	168.09
620.98	168.09
621.392	172.94
621.804	211.78
622.216	199.64
622.628	231.19
623.04	175.37
623.452	180.22
623.864	160.8
624.276	151.09
624.687	197.21
625.099	197.21
625.511	197.21
625.922	231.19
626.334	148.67
626.745	172.94
627.157	165.66
627.568	277.31
627.979	143.81
628.391	172.94
628.802	104.98
629.213	223.91
629.624	177.79
630.035	177.79
630.446	180.22
630.857	160.8
631.268	202.07
631.679	153.52
632.09	248.18
632.501	112.26
632.912	131.68
633.322	233.62
633.733	199.64
634.144	114.69
634.554	109.83
634.965	199.64
635.375	138.96
635.785	180.22
636.196	238.47
636.606	202.07
637.016	163.23
637.427	202.07
637.837	240.9
638.247	202.07
638.657	146.24
639.067	80.71
639.477	155.95
639.887	155.95
640.297	141.39
640.706	129.25
641.116	114.69
641.526	129.25
641.935	160.8
642.345	138.96
642.755	219.06
643.164	177.79
643.573	185.08
643.983	168.09
644.392	141.39
644.801	163.23
645.211	172.94
645.62	165.66
646.029	160.8
646.438	223.91
646.847	228.77
647.256	112.26
647.665	102.55
648.074	175.37
648.483	192.36
648.892	112.26
649.3	233.62
649.709	177.79
650.118	170.51
650.526	151.09
650.935	170.51
651.343	187.5
651.752	202.07
652.16	165.66
652.568	92.84
652.977	177.79
653.385	141.39
653.793	211.78
654.201	204.49
654.609	151.09
655.017	155.95
655.425	134.1
655.833	146.24
656.241	104.98
656.649	170.51
657.057	223.91
657.464	155.95
657.872	226.34
658.28	172.94
658.687	138.96
659.095	131.68
659.502	192.36
659.91	158.38
660.317	211.78
660.724	175.37
661.132	155.95
661.539	211.78
661.946	219.06
662.353	136.53
662.76	189.93
663.167	189.93
663.574	138.96
663.981	199.64
664.388	138.96
664.795	175.37
665.202	83.13
665.608	165.66
666.015	129.25
666.422	119.54
666.828	78.28
667.235	233.62
667.641	163.23
668.047	180.22
668.454	165.66
668.86	153.52
669.266	160.8
669.673	187.5
670.079	170.51
670.485	107.4
670.891	155.95
671.297	121.97
671.703	175.37
672.109	206.92
672.515	100.12
672.92	168.09
673.326	185.08
673.732	175.37
674.138	204.49
674.543	231.19
674.949	100.12
675.354	158.38
675.76	202.07
676.165	194.78
676.57	204.49
676.976	257.89
677.381	151.09
677.786	199.64
678.191	172.94
678.596	158.38
679.001	146.24
679.406	97.7
679.811	158.38
680.216	168.09
680.621	141.39
681.026	175.37
681.43	158.38
681.835	158.38
682.24	216.63
682.644	141.39
683.049	172.94
683.453	121.97
683.858	141.39
684.262	194.78
684.667	104.98
685.071	165.66
685.475	233.62
685.879	185.08
686.283	199.64
686.687	151.09
687.091	192.36
687.495	114.69
687.899	168.09
688.303	136.53
688.707	216.63
689.111	172.94
689.514	170.51
689.918	180.22
690.322	141.39
690.725	85.56
691.129	170.51
691.532	129.25
691.936	155.95
692.339	182.65
692.742	211.78
693.146	233.62
693.549	231.19
693.952	165.66
694.355	158.38
694.758	170.51
695.161	211.78
695.564	71
695.967	158.38
696.37	192.36
696.773	153.52
697.175	216.63
697.578	168.09
697.981	158.38
698.383	180.22
698.786	141.39
699.188	172.94
699.591	206.92
699.993	151.09
700.395	257.89
700.798	194.78
701.2	219.06
701.602	165.66
702.004	160.8
702.406	175.37
702.808	187.5
703.21	180.22
703.612	219.06
704.014	197.21
704.416	199.64
704.818	153.52
705.219	226.34
705.621	253.04
706.023	231.19
706.424	172.94
706.826	233.62
707.227	223.91
707.629	209.35
708.03	243.33
708.431	260.32
708.832	233.62
709.234	194.78
709.635	255.47
710.036	180.22
710.437	301.58
710.838	214.2
711.239	274.88
711.64	260.32
712.041	245.76
712.441	177.79
712.842	138.96
713.243	289.45
713.643	270.03
714.044	325.85
714.445	270.03
714.845	294.3
715.246	253.04
715.646	272.46
716.046	194.78
716.447	306.44
716.847	284.59
717.247	255.47
717.647	284.59
718.047	277.31
718.447	282.16
718.847	323.43
719.247	287.02
719.647	379.25
720.047	354.98
720.446	379.25
720.846	381.68
721.246	437.51
721.645	376.83
722.045	335.56
722.444	420.52
722.844	396.24
723.243	384.11
723.643	371.97
724.042	437.51
724.441	376.83
724.84	388.96
725.24	379.25
725.639	442.36
726.038	444.79
726.437	410.81
726.836	432.65
727.234	568.58
727.633	592.85
728.032	604.99
728.431	604.99
728.83	646.25
729.228	636.54
729.627	694.79
730.025	714.21
730.424	719.06
730.822	888.97
731.22	918.1
731.619	981.2
732.017	1177.81
732.415	1129.27
732.813	1168.1
733.212	1401.11
733.61	1522.48
734.008	1561.31
734.406	1672.96
734.803	1675.39
735.201	1825.88
735.599	2107.44
735.997	2155.98
736.395	2172.97
736.792	2291.9
737.19	2505.5
737.587	2459.38
737.985	2728.8
738.382	2867.16
738.78	2903.56
739.177	3228.81
739.574	3294.35
739.971	3413.28
740.369	3493.38
740.766	3823.48
741.163	3923
741.56	4126.88
741.957	4272.52
742.354	4415.72
742.751	4541.94
743.147	4733.69
743.544	4942.43
743.941	5197.29
744.338	5410.89
744.734	5585.65
745.131	5779.82
745.527	6476.44
745.924	6757.99
746.32	7117.22
746.716	7049.26
747.113	7418.2
747.509	7927.91
747.905	8459.48
748.301	8714.33
748.697	8864.82
749.093	9454.64
749.489	9466.77
749.885	10209.5
750.281	10930.39
750.677	11260.49
751.073	11495.93
751.468	11614.87
751.864	12792.07
752.26	13561.5
752.655	13978.98
753.051	14357.63
753.446	14940.16
753.842	15272.69
754.237	15879.49
754.632	16488.73
755.028	17418.35
755.423	17178.06
755.818	17127.09
756.213	17636.8
756.608	17923.22
757.003	18602.84
757.398	18818.86
757.793	19367.41
758.188	18479.05
758.583	19066.44
758.977	19411.1
759.372	20789.77
759.767	21578.61
760.161	22636.88
760.556	23119.9
760.95	23605.34
761.345	24207.29
761.739	26624.81
762.133	27294.72
762.527	28479.21
762.922	28741.35
763.316	28518.04
763.71	28809.31
764.104	29738.93
764.498	31287.5
764.892	32629.76
765.286	32993.84
765.68	33124.91
766.073	33049.66
766.467	33032.67
766.861	34183.18
767.255	36501.17
767.648	38139.55
768.042	38998.79
768.435	38688.1
768.829	38200.23
769.222	38634.7
769.615	39430.83
770.008	40362.89
770.402	42032.81
770.795	42527.97
771.188	41860.48
771.581	40175.99
771.974	39423.55
772.367	39462.39
772.76	40168.71
773.153	40316.77
773.545	41197.85
773.938	41180.86
774.331	40243.95
774.724	39552.19
775.116	40178.42
775.509	42091.07
775.901	44358.09
776.294	47248.91
776.686	48435.83
777.078	48630
777.471	48227.09
777.863	47955.24
778.255	48253.78
778.647	49904.3
779.039	51418.88
779.431	52462.59
779.823	53690.76
780.215	53882.51
780.607	52435.89
780.999	52202.88
781.39	50515.96
781.782	49863.03
782.174	50671.3
782.565	52972.3
782.957	55037.87
783.348	56423.81
783.74	56205.36
784.131	54217.47
784.522	53215.03
784.914	51258.69
785.305	51530.53
785.696	51542.67
786.087	53921.35
786.478	55096.12
786.869	54450.48
787.26	53115.51
787.651	51117.91
788.042	48001.35
788.433	44593.53
788.823	43229.43
789.214	42477
789.605	43324.1
789.995	45008.59
790.386	45498.89
790.776	46545.02
791.167	44142.07
791.557	42996.42
791.948	40872.6
792.338	39498.79
792.728	40129.87
793.118	40530.36
793.508	42809.53
793.898	46639.68
794.288	47528.05
794.678	49132.44
795.068	48693.11
795.458	46197.93
795.848	43642.06
796.238	41462.42
796.627	39042.48
797.017	39285.2
797.406	41108.04
797.796	42889.62
798.185	46202.78
798.575	47532.9
798.964	48387.28
799.354	48258.64
799.743	45122.67
800.132	42819.23
800.521	40226.96
800.91	38775.48
801.299	38226.93
801.688	39675.98
802.077	41129.89
802.466	44319.26
802.855	47156.68
803.244	46413.95
803.633	46666.38
804.021	43649.34
804.41	40399.29
804.799	37292.45
805.187	33772.98
805.576	31848.19
805.964	30294.77
806.352	31020.51
806.741	32991.41
807.129	35527.86
807.517	37379.83
807.905	39469.67
808.293	39030.34
808.681	37569.15
809.069	35090.96
809.457	34100.65
809.845	30833.61
810.233	28996.2
810.621	29030.18
811.009	28782.61
811.396	29697.67
811.784	32491.4
812.171	35270.57
812.559	37474.49
812.946	38425.96
813.334	38064.31
813.721	36695.35
814.108	34605.51
814.496	32117.61
814.883	28838.43
815.27	26988.89
815.657	24925.75
816.044	24474.29
816.431	25017.99
816.818	26391.79
817.205	28037.45
817.592	30840.89
817.979	32544.8
818.365	34472.02
818.752	33423.46
819.139	32207.42
819.525	30867.59
819.912	28821.44
820.298	25707.32
820.685	23042.23
821.071	21064.04
821.457	19255.76
821.843	17794.57
822.23	17379.52
822.616	18226.62
823.002	18272.74
823.388	19469.36
823.774	20394.13
824.16	20724.23
824.546	21294.63
824.931	21338.32
825.317	20823.75
825.703	20163.54
826.089	18932.94
826.474	17578.55
826.86	15544.54
827.245	14204.71
827.631	13071.2
828.016	12537.21
828.401	11964.39
828.787	11731.37
829.172	12163.42
829.557	12391.58
829.942	13029.94
830.327	14226.56
830.712	14983.85
831.097	15139.19
831.482	15270.26
831.867	14806.66
832.252	14947.44
832.636	14110.05
833.021	13398.87
833.406	12214.39
833.79	11481.37
834.175	10372.13
834.559	9658.52
834.944	8741.03
835.328	8008.01
835.713	7728.88
836.097	7476.45
836.481	7440.04
836.865	7724.03
837.249	7957.04
837.633	8340.54
838.017	8342.97
838.401	8707.05
838.785	8840.55
839.169	8690.06
839.553	8566.27
839.937	8372.1
840.32	7969.18
840.704	7461.89
841.087	6998.29
841.471	6415.76
841.854	5998.27
842.238	5532.25
842.621	5068.65
843.004	4580.78
843.388	4214.26
843.771	4107.47
844.154	3842.9
844.537	3672.99
844.92	3930.28
845.303	3908.43
845.686	3901.15
846.069	3915.72
846.452	4163.29
846.834	4143.88
847.217	4175.43
847.6	4435.14
847.982	4549.22
848.365	4347.76
848.748	4515.24
849.13	4272.52
849.512	4372.03
849.895	4124.46
850.277	3852.61
850.659	3891.44
851.041	3864.74
851.423	3689.98
851.806	3299.2
852.188	3083.18
852.57	2850.17
852.951	2784.63
853.333	2668.12
853.715	2527.35
854.097	2357.44
854.479	2311.32
854.86	2160.83
855.242	2080.74
855.623	1954.52
856.005	1990.93
856.386	1927.82
856.768	1816.17
857.149	1806.46
857.53	1760.34
857.911	1847.72
858.292	1726.36
858.674	1665.68
859.055	1723.93
859.436	1704.52
859.817	1597.72
860.197	1481.21
860.578	1388.98
860.959	1442.38
861.34	1388.98
861.72	1391.41
862.101	1371.99
862.482	1367.13
862.862	1240.92
863.243	1253.05
863.623	1202.08
864.003	1160.82
864.384	1185.09
864.764	1124.41
865.144	1034.6
865.524	930.23
865.904	966.64
866.284	908.39
866.664	888.97
867.044	833.14
867.424	777.32
867.804	799.16
868.183	808.87
868.563	757.9
868.943	699.65
869.322	699.65
869.702	699.65
870.081	680.23
870.461	597.7
870.84	658.38
871.22	592.85
871.599	539.45
871.978	556.44
872.357	539.45
872.736	541.88
873.115	476.34
873.494	476.34
873.873	430.23
874.252	352.55
874.631	444.79
875.01	432.65
875.388	388.96
875.767	418.09
876.146	277.31
876.524	337.99
876.903	403.53
877.281	328.28
877.66	347.7
878.038	306.44
878.416	267.6
878.794	301.58
879.173	231.19
879.551	299.16
879.929	255.47
880.307	335.56
880.685	291.87
881.063	284.59
881.441	313.72
881.818	294.3
882.196	243.33
882.574	270.03
882.951	282.16
883.329	260.32
883.707	226.34
884.084	289.45
884.461	236.05
884.839	219.06
885.216	231.19
885.593	289.45
885.971	253.04
886.348	206.92
886.725	274.88
887.102	119.54
887.479	284.59
887.856	257.89
888.233	194.78
888.609	187.5
888.986	206.92
889.363	172.94
889.74	270.03
890.116	187.5
890.493	199.64
890.869	175.37
891.246	163.23
891.622	206.92
891.998	248.18
892.375	180.22
892.751	240.9
893.127	177.79
893.503	151.09
893.879	153.52
894.255	221.48
894.631	104.98
895.007	148.67
895.383	221.48
895.759	221.48
896.134	197.21
896.51	180.22
896.886	204.49
897.261	253.04
897.637	148.67
898.012	211.78
898.388	104.98
898.763	192.36
899.138	160.8
899.514	121.97
899.889	170.51
900.264	199.64
900.639	177.79
901.014	236.05
901.389	97.7
901.764	146.24
902.139	146.24
902.513	177.79
902.888	124.4
903.263	211.78
903.638	185.08
904.012	119.54
904.387	146.24
904.761	107.4
905.136	104.98
905.51	155.95
905.884	143.81
906.259	129.25
906.633	104.98
907.007	158.38
907.381	170.51
907.755	68.57
908.129	151.09
908.503	163.23
908.877	141.39
909.251	158.38
909.624	95.27
909.998	131.68
910.372	143.81
910.745	104.98
911.119	216.63
911.492	153.52
911.866	138.96
912.239	177.79
912.612	141.39
912.986	168.09
913.359	102.55
913.732	131.68
914.105	61.29
914.478	185.08
914.851	189.93
915.224	155.95
915.597	151.09
915.97	202.07
916.343	141.39
916.715	223.91
917.088	185.08
917.461	134.1
917.833	148.67
918.206	168.09
918.578	134.1
918.951	104.98
919.323	107.4
919.695	155.95
920.067	170.51
920.44	119.54
920.812	95.27
921.184	129.25
921.556	170.51
921.928	58.86
922.3	126.82
922.672	192.36
923.043	141.39
923.415	107.4
923.787	168.09
924.158	148.67
924.53	185.08
924.901	219.06
925.273	136.53
925.644	104.98
926.016	168.09
926.387	131.68
926.758	109.83
927.129	119.54
927.5	185.08
927.872	209.35
928.243	141.39
928.613	151.09
928.984	109.83
929.355	182.65
929.726	138.96
930.097	102.55
930.467	129.25
930.838	175.37
931.209	143.81
931.579	131.68
931.95	172.94
932.32	165.66
932.69	189.93
933.061	102.55
933.431	126.82
933.801	170.51
934.171	158.38
934.541	63.71
934.911	197.21
935.281	194.78
935.651	160.8
936.021	95.27
936.391	85.56
936.761	131.68
937.13	131.68
937.5	126.82
937.87	148.67
938.239	83.13
938.609	163.23
938.978	141.39
939.347	131.68
939.717	185.08
940.086	175.37
940.455	158.38
940.824	204.49
941.193	165.66
941.562	163.23
941.931	112.26
942.3	168.09
942.669	192.36
943.038	182.65
943.407	153.52
943.775	141.39
944.144	223.91
944.513	131.68
944.881	143.81
945.25	124.4
945.618	104.98
945.986	228.77
946.355	102.55
946.723	112.26
947.091	148.67
947.459	112.26
947.827	87.99
948.195	131.68
948.563	87.99
948.931	158.38
949.299	109.83
949.667	129.25
950.035	138.96
950.402	185.08
950.77	58.86
951.138	121.97
951.505	160.8
951.873	146.24
952.24	136.53
952.607	134.1
952.975	124.4
953.342	107.4
953.709	121.97
954.076	165.66
954.443	153.52
954.81	192.36
955.177	138.96
955.544	107.4
955.911	170.51
956.278	112.26
956.645	138.96
957.012	109.83
957.378	131.68
957.745	97.7
958.111	117.11
958.478	180.22
958.844	257.89
959.211	134.1
959.577	141.39
959.943	160.8
960.309	163.23
960.675	172.94
961.042	151.09
961.408	138.96
961.774	180.22
962.139	136.53
962.505	170.51
962.871	114.69
963.237	177.79
963.603	129.25
963.968	107.4
964.334	172.94
964.699	143.81
965.065	112.26
965.43	158.38
965.796	155.95
966.161	189.93
966.526	175.37
966.891	153.52
967.256	121.97
967.622	143.81
967.987	189.93
968.352	131.68
968.716	177.79
969.081	172.94
969.446	124.4
969.811	119.54
970.176	90.41
970.54	199.64
970.905	153.52
971.269	187.5
971.634	148.67
971.998	182.65
972.363	160.8
972.727	121.97
973.091	136.53
973.455	136.53
973.819	136.53
974.183	83.13
974.547	216.63
974.911	204.49
975.275	104.98
975.639	170.51
976.003	204.49
976.367	141.39
976.73	80.71
977.094	194.78
977.458	104.98
977.821	182.65
978.185	148.67
978.548	138.96
978.911	168.09
979.275	109.83
979.638	119.54
980.001	148.67
980.364	124.4
980.727	129.25
981.09	95.27
981.453	117.11
981.816	151.09
982.179	177.79
982.542	160.8
982.905	136.53
983.267	175.37
983.63	172.94
983.992	187.5
984.355	119.54
984.717	97.7
985.08	131.68
985.442	126.82
985.804	95.27
986.167	187.5
986.529	102.55
986.891	141.39
987.253	189.93
987.615	85.56
987.977	109.83
988.339	112.26
988.701	168.09
989.062	165.66
989.424	141.39
989.786	172.94
990.147	124.4
990.509	223.91
990.87	165.66
991.232	170.51
991.593	211.78
991.955	114.69
992.316	143.81
992.677	141.39
993.038	107.4
993.399	209.35
993.76	114.69
994.121	182.65
994.482	136.53
994.843	143.81
995.204	199.64
995.565	100.12
995.926	136.53
996.286	172.94
996.647	153.52
997.007	95.27
997.368	85.56
997.728	124.4
998.089	112.26
998.449	104.98
998.809	68.57
999.169	182.65
999.53	214.2
999.89	138.96
1000.25	117.11
1000.61	168.09
1000.97	172.94
1001.329	158.38
1001.689	155.95
1002.049	146.24
1002.409	121.97
1002.768	104.98
1003.128	153.52
1003.487	78.28
1003.847	124.4
1004.206	211.78
1004.566	126.82
1004.925	49.15
1005.284	107.4
1005.643	155.95
1006.003	143.81
1006.362	131.68
1006.721	199.64
1007.08	119.54
1007.438	112.26
1007.797	177.79
1008.156	185.08
1008.515	148.67
1008.874	138.96
1009.232	206.92
1009.591	153.52
1009.949	131.68
1010.308	153.52
1010.666	211.78
1011.024	172.94
1011.383	165.66
1011.741	168.09
1012.099	170.51
1012.457	153.52
1012.815	71
1013.173	90.41
1013.531	17.6
1013.889	148.67
1014.247	151.09
1014.605	87.99
1014.962	131.68
1015.32	151.09
1015.678	87.99
1016.035	267.6
1016.393	121.97
1016.75	209.35
1017.107	117.11
1017.465	114.69
1017.822	187.5
1018.179	114.69
1018.536	172.94
1018.894	248.18
1019.251	121.97
1019.608	126.82
1019.964	129.25
1020.321	182.65
1020.678	206.92
1021.035	134.1
1021.392	151.09
1021.748	126.82
1022.105	192.36
1022.461	117.11
1022.818	223.91
1023.174	68.57
1023.531	204.49
1023.887	129.25
1024.243	100.12
1024.599	119.54
1024.955	202.07
1025.311	151.09
1025.667	146.24
1026.023	85.56
1026.379	136.53
1026.735	143.81
1027.091	146.24
1027.447	138.96
