189.514	60.38
189.973	60.38
190.431	60.38
190.889	87.08
191.348	23.97
191.806	53.1
192.264	14.26
192.722	33.68
193.18	38.53
193.638	-107.1
194.096	-22.15
194.554	-34.28
195.012	36.1
195.47	-2.73
195.928	16.69
196.385	16.69
196.843	-34.28
197.301	-19.72
197.758	21.54
198.216	-39.14
198.674	-29.43
199.131	111.35
199.589	84.65
200.046	123.48
200.503	113.78
200.961	108.92
201.418	123.48
201.875	128.34
202.332	53.1
202.79	84.65
203.247	121.06
203.704	125.91
204.161	118.63
204.618	157.47
205.075	172.03
205.532	99.21
205.989	184.17
206.445	203.58
206.902	157.47
207.359	167.17
207.816	181.74
208.272	225.43
208.729	181.74
209.185	181.74
209.642	167.17
210.098	145.33
210.555	210.86
211.011	138.05
211.467	201.16
211.924	179.31
212.38	198.73
212.836	123.48
213.292	196.3
213.748	145.33
214.204	225.43
214.66	196.3
215.116	196.3
215.572	179.31
216.028	186.59
216.484	167.17
216.94	157.47
217.396	133.19
217.851	172.03
218.307	123.48
218.763	179.31
219.218	111.35
219.674	147.76
220.129	104.07
220.585	142.9
221.04	140.48
221.496	225.43
221.951	181.74
222.406	179.31
222.861	172.03
223.317	174.46
223.772	72.51
224.227	189.02
224.682	184.17
225.137	155.04
225.592	133.19
226.047	145.33
226.502	213.29
226.957	142.9
227.411	213.29
227.866	157.47
228.321	159.89
228.776	147.76
229.23	196.3
229.685	142.9
230.139	116.2
230.594	157.47
231.048	162.32
231.503	157.47
231.957	111.35
232.411	113.78
232.865	159.89
233.32	128.34
233.774	167.17
234.228	111.35
234.682	145.33
235.136	159.89
235.59	140.48
236.044	206.01
236.498	135.62
236.952	147.76
237.406	174.46
237.86	162.32
238.313	152.61
238.767	130.77
239.221	125.91
239.674	106.49
240.128	147.76
240.581	220.57
241.035	123.48
241.488	162.32
241.942	215.72
242.395	174.46
242.848	227.86
243.301	162.32
243.755	145.33
244.208	208.44
244.661	191.45
245.114	206.01
245.567	184.17
246.02	196.3
246.473	206.01
246.926	116.2
247.379	128.34
247.832	145.33
248.284	181.74
248.737	162.32
249.19	225.43
249.642	121.06
250.095	152.61
250.547	169.6
251	189.02
251.452	133.19
251.905	152.61
252.357	186.59
252.81	138.05
253.262	159.89
253.714	203.58
254.166	150.18
254.618	159.89
255.07	155.04
255.523	198.73
255.975	172.03
256.427	147.76
256.878	94.36
257.33	196.3
257.782	162.32
258.234	242.42
258.686	176.88
259.137	159.89
259.589	142.9
260.041	157.47
260.492	167.17
260.944	140.48
261.395	167.17
261.847	193.87
262.298	125.91
262.749	125.91
263.201	196.3
263.652	215.72
264.103	125.91
264.554	189.02
265.005	147.76
265.457	164.75
265.908	108.92
266.359	179.31
266.809	169.6
267.26	181.74
267.711	108.92
268.162	108.92
268.613	159.89
269.064	186.59
269.514	155.04
269.965	198.73
270.415	145.33
270.866	142.9
271.316	189.02
271.767	167.17
272.217	244.85
272.668	208.44
273.118	101.64
273.568	179.31
274.019	225.43
274.469	232.71
274.919	138.05
275.369	167.17
275.819	111.35
276.269	237.56
276.719	138.05
277.169	138.05
277.619	201.16
278.069	215.72
278.518	65.23
278.968	155.04
279.418	172.03
279.867	172.03
280.317	152.61
280.767	125.91
281.216	130.77
281.666	201.16
282.115	198.73
282.564	164.75
283.014	157.47
283.463	145.33
283.912	155.04
284.361	159.89
284.811	174.46
285.26	140.48
285.709	247.27
286.158	256.98
286.607	184.17
287.056	164.75
287.505	213.29
287.953	155.04
288.402	184.17
288.851	176.88
289.3	133.19
289.748	152.61
290.197	203.58
290.646	142.9
291.094	150.18
291.543	145.33
291.991	203.58
292.439	215.72
292.888	133.19
293.336	225.43
293.784	133.19
294.233	179.31
294.681	198.73
295.129	189.02
295.577	189.02
296.025	150.18
296.473	138.05
296.921	138.05
297.369	223
297.817	147.76
298.264	140.48
298.712	193.87
299.16	164.75
299.608	145.33
300.055	113.78
300.503	159.89
300.95	157.47
301.398	104.07
301.845	142.9
302.293	145.33
302.74	121.06
303.187	218.15
303.635	174.46
304.082	135.62
304.529	125.91
304.976	215.72
305.423	196.3
305.87	186.59
306.317	193.87
306.764	155.04
307.211	191.45
307.658	191.45
308.105	152.61
308.552	135.62
308.998	179.31
309.445	150.18
309.892	196.3
310.338	186.59
310.785	203.58
311.231	91.93
311.678	179.31
312.124	162.32
312.571	176.88
313.017	172.03
313.463	142.9
313.909	172.03
314.356	281.25
314.802	193.87
315.248	206.01
315.694	150.18
316.14	203.58
316.586	159.89
317.032	108.92
317.478	201.16
317.923	84.65
318.369	138.05
318.815	150.18
319.261	118.63
319.706	108.92
320.152	189.02
320.597	235.14
321.043	128.34
321.488	138.05
321.934	208.44
322.379	220.57
322.824	138.05
323.27	184.17
323.715	152.61
324.16	176.88
324.605	193.87
325.05	113.78
325.495	162.32
325.94	118.63
326.385	210.86
326.83	130.77
327.275	142.9
327.72	111.35
328.165	135.62
328.61	130.77
329.054	152.61
329.499	157.47
329.943	113.78
330.388	145.33
330.832	172.03
331.277	193.87
331.721	152.61
332.166	201.16
332.61	152.61
333.054	184.17
333.499	184.17
333.943	140.48
334.387	179.31
334.831	179.31
335.275	174.46
335.719	179.31
336.163	145.33
336.607	111.35
337.051	138.05
337.495	155.04
337.938	198.73
338.382	159.89
338.826	181.74
339.269	198.73
339.713	74.94
340.157	162.32
340.6	239.99
341.044	172.03
341.487	164.75
341.93	123.48
342.374	135.62
342.817	87.08
343.26	176.88
343.703	162.32
344.146	159.89
344.59	157.47
345.033	159.89
345.476	138.05
345.919	164.75
346.361	108.92
346.804	101.64
347.247	184.17
347.69	193.87
348.133	94.36
348.575	189.02
349.018	176.88
349.461	218.15
349.903	213.29
350.346	244.85
350.788	155.04
351.23	181.74
351.673	198.73
352.115	157.47
352.557	159.89
353	172.03
353.442	70.09
353.884	179.31
354.326	220.57
354.768	145.33
355.21	116.2
355.652	123.48
356.094	135.62
356.536	169.6
356.978	155.04
357.419	249.7
357.861	157.47
358.303	172.03
358.744	142.9
359.186	193.87
359.627	169.6
360.069	169.6
360.51	159.89
360.952	159.89
361.393	157.47
361.834	155.04
362.276	164.75
362.717	152.61
363.158	94.36
363.599	116.2
364.04	172.03
364.481	155.04
364.922	113.78
365.363	208.44
365.804	184.17
366.245	123.48
366.686	198.73
367.126	150.18
367.567	169.6
368.008	252.13
368.448	162.32
368.889	140.48
369.33	179.31
369.77	186.59
370.21	155.04
370.651	198.73
371.091	186.59
371.531	167.17
371.972	159.89
372.412	169.6
372.852	223
373.292	172.03
373.732	121.06
374.172	218.15
374.612	111.35
375.052	155.04
375.492	191.45
375.932	164.75
376.372	159.89
376.811	142.9
377.251	133.19
377.691	184.17
378.13	181.74
378.57	206.01
379.009	189.02
379.449	164.75
379.888	189.02
380.328	167.17
380.767	123.48
381.206	155.04
381.645	179.31
382.085	133.19
382.524	193.87
382.963	186.59
383.402	84.65
383.841	142.9
384.28	104.07
384.719	191.45
385.158	184.17
385.596	123.48
386.035	176.88
386.474	140.48
386.913	147.76
387.351	145.33
387.79	99.21
388.228	123.48
388.667	70.09
389.105	169.6
389.544	218.15
389.982	167.17
390.42	198.73
390.859	152.61
391.297	179.31
391.735	208.44
392.173	111.35
392.611	186.59
393.049	111.35
393.487	133.19
393.925	232.71
394.363	150.18
394.801	159.89
395.239	181.74
395.676	162.32
396.114	135.62
396.552	162.32
396.989	203.58
397.427	208.44
397.864	167.17
398.302	174.46
398.739	138.05
399.177	174.46
399.614	128.34
400.051	184.17
400.488	130.77
400.926	162.32
401.363	145.33
401.8	164.75
402.237	150.18
402.674	174.46
403.111	208.44
403.548	79.79
403.985	152.61
404.421	147.76
404.858	162.32
405.295	162.32
405.732	150.18
406.168	174.46
406.605	189.02
407.041	169.6
407.478	142.9
407.914	232.71
408.351	201.16
408.787	150.18
409.223	121.06
409.66	184.17
410.096	208.44
410.532	125.91
410.968	159.89
411.404	150.18
411.84	118.63
412.276	176.88
412.712	223
413.148	198.73
413.584	191.45
414.02	218.15
414.455	203.58
414.891	198.73
415.327	101.64
415.762	162.32
416.198	167.17
416.633	130.77
417.069	116.2
417.504	108.92
417.94	184.17
418.375	167.17
418.81	128.34
419.245	133.19
419.681	157.47
420.116	150.18
420.551	138.05
420.986	130.77
421.421	123.48
421.856	142.9
422.291	142.9
422.726	169.6
423.16	203.58
423.595	145.33
424.03	164.75
424.464	181.74
424.899	215.72
425.334	162.32
425.768	96.79
426.203	138.05
426.637	135.62
427.071	208.44
427.506	152.61
427.94	186.59
428.374	121.06
428.809	213.29
429.243	210.86
429.677	247.27
430.111	155.04
430.545	106.49
430.979	164.75
431.413	232.71
431.847	184.17
432.28	138.05
432.714	169.6
433.148	179.31
433.582	147.76
434.015	155.04
434.449	186.59
434.882	150.18
435.316	230.28
435.749	239.99
436.183	176.88
436.616	191.45
437.049	239.99
437.483	193.87
437.916	235.14
438.349	232.71
438.782	164.75
439.215	225.43
439.648	145.33
440.081	155.04
440.514	242.42
440.947	210.86
441.38	135.62
441.813	189.02
442.245	273.97
442.678	155.04
443.111	237.56
443.543	252.13
443.976	215.72
444.408	157.47
444.841	254.55
445.273	174.46
445.705	145.33
446.138	198.73
446.57	218.15
447.002	242.42
447.434	247.27
447.867	159.89
448.299	288.54
448.731	259.41
449.163	244.85
449.595	213.29
450.026	227.86
450.458	208.44
450.89	290.96
451.322	203.58
451.754	225.43
452.185	225.43
452.617	271.55
453.048	225.43
453.48	278.83
453.911	303.1
454.343	293.39
454.774	220.57
455.205	273.97
455.637	312.81
456.068	324.94
456.499	290.96
456.93	264.26
457.361	261.84
457.792	254.55
458.223	281.25
458.654	358.93
459.085	324.94
459.516	322.52
459.947	244.85
460.378	329.8
460.808	317.66
461.239	278.83
461.669	288.54
462.1	276.4
462.531	193.87
462.961	247.27
463.391	225.43
463.822	213.29
464.252	249.7
464.682	269.12
465.113	264.26
465.543	271.55
465.973	266.69
466.403	242.42
466.833	320.09
467.263	259.41
467.693	312.81
468.123	295.82
468.553	303.1
468.983	230.28
469.412	269.12
469.842	281.25
470.272	329.8
470.701	220.57
471.131	276.4
471.56	276.4
471.99	218.15
472.419	290.96
472.849	288.54
473.278	320.09
473.707	252.13
474.136	239.99
474.566	232.71
474.995	242.42
475.424	210.86
475.853	121.06
476.282	283.68
476.711	225.43
477.14	278.83
477.569	232.71
477.997	230.28
478.426	220.57
478.855	203.58
479.283	249.7
479.712	278.83
480.141	283.68
480.569	264.26
480.998	266.69
481.426	232.71
481.854	307.95
482.283	206.01
482.711	213.29
483.139	198.73
483.567	125.91
483.995	191.45
484.424	152.61
484.852	276.4
485.28	239.99
485.708	298.24
486.135	208.44
486.563	218.15
486.991	189.02
487.419	142.9
487.847	191.45
488.274	256.98
488.702	232.71
489.129	235.14
489.557	220.57
489.984	147.76
490.412	125.91
490.839	242.42
491.266	157.47
491.694	184.17
492.121	181.74
492.548	208.44
492.975	193.87
493.402	167.17
493.829	247.27
494.256	266.69
494.683	164.75
495.11	145.33
495.537	186.59
495.964	152.61
496.39	135.62
496.817	150.18
497.244	198.73
497.67	133.19
498.097	208.44
498.523	184.17
498.95	147.76
499.376	273.97
499.803	210.86
500.229	244.85
500.655	218.15
501.081	203.58
501.508	242.42
501.934	152.61
502.36	218.15
502.786	223
503.212	264.26
503.638	206.01
504.064	227.86
504.489	206.01
504.915	215.72
505.341	181.74
505.767	184.17
506.192	186.59
506.618	113.78
507.043	201.16
507.469	196.3
507.894	128.34
508.32	172.03
508.745	244.85
509.17	179.31
509.596	249.7
510.021	223
510.446	213.29
510.871	259.41
511.296	172.03
511.721	179.31
512.146	225.43
512.571	220.57
512.996	118.63
513.421	223
513.845	128.34
514.27	198.73
514.695	181.74
515.119	201.16
515.544	157.47
515.969	159.89
516.393	150.18
516.817	201.16
517.242	193.87
517.666	169.6
518.09	198.73
518.515	220.57
518.939	218.15
519.363	388.05
519.787	179.31
520.211	271.55
520.635	186.59
521.059	247.27
521.483	179.31
521.907	201.16
522.331	189.02
522.754	189.02
523.178	206.01
523.602	116.2
524.025	155.04
524.449	242.42
524.872	169.6
525.296	254.55
525.719	152.61
526.143	259.41
526.566	191.45
526.989	218.15
527.412	135.62
527.836	247.27
528.259	101.64
528.682	159.89
529.105	162.32
529.528	196.3
529.951	225.43
530.374	201.16
530.796	210.86
531.219	237.56
531.642	184.17
532.065	184.17
532.487	259.41
532.91	244.85
533.332	184.17
533.755	230.28
534.177	174.46
534.6	203.58
535.022	155.04
535.444	193.87
535.867	264.26
536.289	230.28
536.711	210.86
537.133	169.6
537.555	179.31
537.977	208.44
538.399	201.16
538.821	186.59
539.243	179.31
539.665	206.01
540.086	162.32
540.508	186.59
540.93	281.25
541.351	147.76
541.773	252.13
542.195	191.45
542.616	208.44
543.037	218.15
543.459	227.86
543.88	206.01
544.301	227.86
544.723	288.54
545.144	242.42
545.565	235.14
545.986	208.44
546.407	242.42
546.828	237.56
547.249	179.31
547.67	239.99
548.091	210.86
548.512	191.45
548.932	264.26
549.353	206.01
549.774	184.17
550.194	220.57
550.615	271.55
551.035	193.87
551.456	191.45
551.876	235.14
552.296	252.13
552.717	227.86
553.137	203.58
553.557	176.88
553.977	210.86
554.397	220.57
554.817	186.59
555.237	145.33
555.657	208.44
556.077	128.34
556.497	174.46
556.917	157.47
557.337	189.02
557.756	140.48
558.176	196.3
558.596	244.85
559.015	147.76
559.435	193.87
559.854	239.99
560.274	247.27
560.693	189.02
561.112	176.88
561.532	223
561.951	259.41
562.37	269.12
562.789	286.11
563.208	237.56
563.627	261.84
564.046	189.02
564.465	184.17
564.884	201.16
565.303	174.46
565.722	130.77
566.14	181.74
566.559	167.17
566.978	191.45
567.396	261.84
567.815	235.14
568.233	184.17
568.652	203.58
569.07	140.48
569.489	133.19
569.907	196.3
570.325	223
570.743	208.44
571.161	264.26
571.58	179.31
571.998	206.01
572.416	133.19
572.833	237.56
573.251	164.75
573.669	281.25
574.087	235.14
574.505	247.27
574.922	172.03
575.34	125.91
575.758	174.46
576.175	203.58
576.593	181.74
577.01	206.01
577.428	278.83
577.845	1667.2
578.262	286.11
578.68	198.73
579.097	123.48
579.514	193.87
579.931	150.18
580.348	147.76
580.765	133.19
581.182	244.85
581.599	252.13
582.016	208.44
582.433	242.42
582.849	159.89
583.266	206.01
583.683	198.73
584.099	235.14
584.516	210.86
584.933	193.87
585.349	227.86
585.765	179.31
586.182	152.61
586.598	218.15
587.014	147.76
587.431	303.1
587.847	203.58
588.263	198.73
588.679	218.15
589.095	157.47
589.511	239.99
589.927	184.17
590.343	249.7
590.759	162.32
591.174	179.31
591.59	198.73
592.006	135.62
592.421	164.75
592.837	230.28
593.252	203.58
593.668	176.88
594.083	189.02
594.499	152.61
594.914	174.46
595.329	184.17
595.745	201.16
596.16	259.41
596.575	193.87
596.99	157.47
597.405	189.02
597.82	235.14
598.235	208.44
598.65	162.32
599.065	203.58
599.479	227.86
599.894	198.73
600.309	218.15
600.724	220.57
601.138	230.28
601.553	172.03
601.967	225.43
602.382	227.86
602.796	201.16
603.21	152.61
603.625	106.49
604.039	162.32
604.453	225.43
604.867	164.75
605.281	157.47
605.695	162.32
606.109	181.74
606.523	128.34
606.937	213.29
607.351	361.35
607.765	123.48
608.178	186.59
608.592	215.72
609.006	152.61
609.419	223
609.833	225.43
610.246	191.45
610.66	213.29
611.073	140.48
611.487	208.44
611.9	232.71
612.313	247.27
612.726	201.16
613.139	193.87
613.553	213.29
613.966	227.86
614.379	210.86
614.792	186.59
615.204	249.7
615.617	150.18
616.03	208.44
616.443	201.16
616.856	128.34
617.268	184.17
617.681	157.47
618.093	191.45
618.506	142.9
618.918	191.45
619.331	201.16
619.743	227.86
620.155	198.73
620.568	118.63
620.98	227.86
621.392	159.89
621.804	244.85
622.216	184.17
622.628	213.29
623.04	186.59
623.452	201.16
623.864	189.02
624.276	208.44
624.687	218.15
625.099	223
625.511	227.86
625.922	174.46
626.334	145.33
626.745	142.9
627.157	252.13
627.568	184.17
627.979	193.87
628.391	176.88
628.802	145.33
629.213	157.47
629.624	218.15
630.035	140.48
630.446	230.28
630.857	169.6
631.268	164.75
631.679	133.19
632.09	206.01
632.501	201.16
632.912	237.56
633.322	181.74
633.733	210.86
634.144	142.9
634.554	159.89
634.965	145.33
635.375	176.88
635.785	142.9
636.196	193.87
636.606	157.47
637.016	247.27
637.427	239.99
637.837	256.98
638.247	155.04
638.657	189.02
639.067	186.59
639.477	164.75
639.887	147.76
640.297	135.62
640.706	172.03
641.116	169.6
641.526	213.29
641.935	191.45
642.345	176.88
642.755	140.48
643.164	198.73
643.573	145.33
643.983	164.75
644.392	179.31
644.801	225.43
645.211	167.17
645.62	145.33
646.029	198.73
646.438	203.58
646.847	206.01
647.256	140.48
647.665	208.44
648.074	145.33
648.483	162.32
648.892	162.32
649.3	230.28
649.709	128.34
650.118	113.78
650.526	184.17
650.935	191.45
651.343	172.03
651.752	227.86
652.16	181.74
652.568	218.15
652.977	189.02
653.385	174.46
653.793	193.87
654.201	206.01
654.609	116.2
655.017	157.47
655.425	184.17
655.833	206.01
656.241	157.47
656.649	201.16
657.057	140.48
657.464	223
657.872	140.48
658.28	164.75
658.687	201.16
659.095	108.92
659.502	157.47
659.91	193.87
660.317	179.31
660.724	227.86
661.132	169.6
661.539	155.04
661.946	184.17
662.353	176.88
662.76	184.17
663.167	169.6
663.574	203.58
663.981	125.91
664.388	218.15
664.795	150.18
665.202	201.16
665.608	172.03
666.015	152.61
666.422	179.31
666.828	48.24
667.235	152.61
667.641	203.58
668.047	186.59
668.454	230.28
668.86	191.45
669.266	247.27
669.673	218.15
670.079	242.42
670.485	159.89
670.891	150.18
671.297	121.06
671.703	239.99
672.109	191.45
672.515	152.61
672.92	152.61
673.326	174.46
673.732	189.02
674.138	123.48
674.543	181.74
674.949	220.57
675.354	140.48
675.76	162.32
676.165	176.88
676.57	191.45
676.976	189.02
677.381	164.75
677.786	203.58
678.191	142.9
678.596	157.47
679.001	157.47
679.406	181.74
679.811	150.18
680.216	169.6
680.621	208.44
681.026	189.02
681.43	150.18
681.835	167.17
682.24	157.47
682.644	227.86
683.049	135.62
683.453	123.48
683.858	208.44
684.262	208.44
684.667	157.47
685.071	167.17
685.475	179.31
685.879	167.17
686.283	101.64
686.687	184.17
687.091	184.17
687.495	157.47
687.899	169.6
688.303	184.17
688.707	172.03
689.111	159.89
689.514	208.44
689.918	189.02
690.322	218.15
690.725	227.86
691.129	237.56
691.532	162.32
691.936	206.01
692.339	65.23
692.742	164.75
693.146	227.86
693.549	157.47
693.952	162.32
694.355	201.16
694.758	172.03
695.161	191.45
695.564	159.89
695.967	179.31
696.37	189.02
696.773	193.87
697.175	162.32
697.578	128.34
697.981	218.15
698.383	201.16
698.786	261.84
699.188	176.88
699.591	123.48
699.993	159.89
700.395	210.86
700.798	176.88
701.2	172.03
701.602	193.87
702.004	218.15
702.406	208.44
702.808	239.99
703.21	210.86
703.612	181.74
704.014	237.56
704.416	138.05
704.818	193.87
705.219	125.91
705.621	208.44
706.023	247.27
706.424	317.66
706.826	213.29
707.227	193.87
707.629	208.44
708.03	247.27
708.431	254.55
708.832	252.13
709.234	225.43
709.635	235.14
710.036	254.55
710.437	300.67
710.838	261.84
711.239	261.84
711.64	227.86
712.041	176.88
712.441	213.29
712.842	232.71
713.243	315.24
713.643	276.4
714.044	322.52
714.445	273.97
714.845	288.54
715.246	385.62
715.646	300.67
716.046	329.8
716.447	305.53
716.847	327.37
717.247	315.24
717.647	307.95
718.047	385.62
718.447	290.96
718.847	349.22
719.247	354.07
719.647	339.51
720.047	392.91
720.446	414.75
720.846	312.81
721.246	354.07
721.645	439.02
722.045	337.08
722.444	358.93
722.844	426.89
723.243	426.89
723.643	407.47
724.042	368.63
724.441	380.77
724.84	439.02
725.24	426.89
725.639	473
726.038	494.85
726.437	497.28
726.836	502.13
727.234	497.28
727.633	446.31
728.032	509.41
728.431	465.72
728.83	487.57
729.228	633.2
729.627	679.32
730.025	659.9
730.424	706.02
730.822	747.28
731.22	718.15
731.619	718.15
732.017	805.53
732.415	909.9
732.813	1014.28
733.212	1019.13
733.61	1009.42
734.008	1067.67
734.406	1164.76
734.803	1329.81
735.201	1460.88
735.599	1482.73
735.997	1424.48
736.395	1470.59
736.792	1519.14
737.19	1691.47
737.587	1829.82
737.985	2004.58
738.382	2101.67
738.78	2142.93
739.177	1975.46
739.574	2108.95
739.971	2322.55
740.369	2805.57
740.766	3135.67
741.163	3091.98
741.56	2866.25
741.957	2579.83
742.354	2635.66
742.751	3048.29
743.147	3715.77
743.544	4062.87
743.941	4189.08
744.338	4021.6
744.734	3737.62
745.131	3521.6
745.527	4138.11
745.924	4730.35
746.32	5718.23
746.716	5856.58
747.113	5766.78
747.509	4997.35
747.905	4907.54
748.301	5276.48
748.697	6477.95
749.093	7662.44
749.489	8225.55
749.885	7812.92
750.281	7259.52
750.677	6477.95
751.073	6982.81
751.468	8354.2
751.864	10184.32
752.26	10798.41
752.655	10667.34
753.051	9589.65
753.446	8980.42
753.842	8927.02
754.237	10342.09
754.632	12092.12
755.028	13354.27
755.423	13912.53
755.818	12172.22
756.213	10995.01
756.608	10215.87
757.003	11184.34
757.398	13092.13
757.793	14907.7
758.188	15436.83
758.583	14837.31
758.977	12834.85
759.372	11424.63
759.767	12524.16
760.161	15109.15
760.556	18184.45
760.95	20473.32
761.345	20315.55
761.739	19140.77
762.133	16698.99
762.527	16150.43
762.922	17800.94
763.316	21121.38
763.71	25230.67
764.104	26177.29
764.498	24844.74
764.892	21973.34
765.286	19189.32
765.68	19458.74
766.073	22674.81
766.467	26737.98
766.861	30053.56
767.255	30898.24
767.648	28123.92
768.042	24439.4
768.435	22618.98
768.829	23980.65
769.222	28177.32
769.615	33090.02
770.008	34199.26
770.402	33257.5
770.795	29721.03
771.188	25864.18
771.581	24361.73
771.974	26041.36
772.367	29988.03
772.76	33820.61
773.153	34376.44
773.545	32667.68
773.938	28813.25
774.331	25970.97
774.724	25407.86
775.116	29342.39
775.509	35284.23
775.901	39488.17
776.294	39823.13
776.686	37774.56
777.078	33323.03
777.471	30937.07
777.863	31992.91
778.255	36449.29
778.647	43279.5
779.039	47065.96
779.431	45430.01
779.823	42209.09
780.215	37102.22
780.607	33570.61
780.999	35114.32
781.39	39092.54
781.782	45459.14
782.174	47777.14
782.565	48095.1
782.957	44541.65
783.348	39332.83
783.74	36320.65
784.131	35614.33
784.522	40806.16
784.914	46294.11
785.305	49116.97
785.696	48553.85
786.087	44624.18
786.478	38357.09
786.869	33907.99
787.26	33638.57
787.651	36111.91
788.042	40417.8
788.433	42915.41
788.823	42582.88
789.214	38150.78
789.605	33063.32
789.995	29097.24
790.386	28798.69
790.776	31194.36
791.167	35374.03
791.557	39830.41
791.948	40213.91
792.338	38121.65
792.728	34272.07
793.118	30488.03
793.508	29689.48
793.898	32563.31
794.288	37206.59
794.678	40995.48
795.068	42592.59
795.458	40524.6
795.848	36022.1
796.238	31577.86
796.627	29378.79
797.017	30536.58
797.406	34798.78
797.796	39699.34
798.185	42114.43
798.575	40772.18
798.964	36218.71
799.354	32721.08
799.743	29587.54
800.132	30259.88
800.521	33599.73
800.91	37374.06
801.299	40611.98
801.688	41429.95
802.077	37832.81
802.466	33738.09
802.855	29422.48
803.244	26706.42
803.633	28390.91
804.021	32140.97
804.41	35764.82
804.799	37400.76
805.187	35269.66
805.576	30995.32
805.964	26912.74
806.352	22987.92
806.741	23619
807.129	25677.28
807.517	28796.26
807.905	32330.3
808.293	33007.49
808.681	30403.08
809.069	26322.92
809.457	23541.32
809.845	22842.28
810.233	24543.77
810.621	28208.87
811.009	31475.91
811.396	33745.37
811.784	32941.96
812.171	29505.01
812.559	25305.92
812.946	21944.21
813.334	21541.29
813.721	23267.05
814.108	26422.44
814.496	29230.73
814.883	30031.72
815.27	29764.72
815.657	25747.67
816.044	22293.73
816.431	20031.56
816.818	20094.67
817.205	22618.98
817.592	26403.02
817.979	28929.76
818.365	29145.78
818.752	26184.57
819.139	21910.23
819.525	18730.57
819.912	16548.5
820.298	17325.21
820.685	18939.31
821.071	21665.08
821.457	23383.56
821.843	22526.75
822.23	20405.35
822.616	16978.12
823.002	14162.54
823.388	12563
823.774	12961.06
824.16	14395.55
824.546	16417.43
824.931	17376.18
825.317	17237.83
825.703	15337.31
826.089	13351.85
826.474	11130.94
826.86	9968.3
827.245	10691.61
827.631	12579.99
828.016	14405.26
828.401	15541.2
828.787	15240.22
829.172	13647.97
829.557	11461.04
829.942	9618.78
830.327	8718.28
830.712	9194.01
831.097	10220.73
831.482	11715.9
831.867	12667.37
832.252	12145.52
832.636	11211.04
833.021	9308.09
833.406	7771.66
833.79	7007.09
834.175	7121.17
834.559	8363.9
834.944	9502.27
835.328	10558.11
835.713	10310.54
836.097	9356.64
836.481	7647.87
836.865	6409.99
837.249	5538.62
837.633	5342.01
838.017	5810.47
838.401	6849.32
838.785	7587.19
839.169	7410.01
839.553	7160
839.937	6089.6
840.32	5104.14
840.704	4116.27
841.087	3956.07
841.471	4094.42
841.854	4589.57
842.238	5344.44
842.621	5536.19
843.004	5201.23
843.388	4737.63
843.771	3905.1
844.154	3225.47
844.537	2941.49
844.92	3223.05
845.303	3616.26
845.686	4189.08
846.069	4742.49
846.452	4594.43
846.834	4266.75
847.217	3490.04
847.6	2934.21
847.982	2565.27
848.365	2487.6
848.748	2710.9
849.13	3108.97
849.512	3531.3
849.895	3749.75
850.277	3635.68
850.659	3033.72
851.041	2441.48
851.423	2172.06
851.806	1948.76
852.188	2162.35
852.57	2426.92
852.951	2691.49
853.333	2951.2
853.715	3106.54
854.097	2822.56
854.479	2405.07
854.86	1822.54
855.242	1657.49
855.623	1560.4
856.005	1659.92
856.386	1902.64
856.768	2084.68
857.149	2215.75
857.53	2201.19
857.911	1929.34
858.292	1463.31
858.674	1373.5
859.055	1215.73
859.436	1101.66
859.817	1206.03
860.197	1300.69
860.578	1550.69
860.959	1507
861.34	1419.62
861.72	1312.82
862.101	1053.11
862.482	851.65
862.862	776.41
863.243	846.8
863.623	1019.13
864.003	1031.27
864.384	1116.22
864.764	1201.17
865.144	1070.1
865.524	1036.12
865.904	846.8
866.284	756.99
866.664	732.72
867.044	727.86
867.424	727.86
867.804	807.96
868.183	827.38
868.563	778.83
868.943	747.28
869.322	703.59
869.702	606.5
870.081	550.68
870.461	460.87
870.84	526.4
871.22	560.38
871.599	601.65
871.978	655.05
872.357	638.06
872.736	652.62
873.115	497.28
873.494	526.4
873.873	412.32
874.252	303.1
874.631	354.07
875.01	414.75
875.388	417.18
875.767	451.16
876.146	441.45
876.524	363.78
876.903	419.61
877.281	332.23
877.66	334.65
878.038	271.55
878.416	290.96
878.794	358.93
879.173	363.78
879.551	354.07
879.929	307.95
880.307	290.96
880.685	373.49
881.063	278.83
881.441	273.97
881.818	293.39
882.196	244.85
882.574	254.55
882.951	283.68
883.329	230.28
883.707	300.67
884.084	193.87
884.461	273.97
884.839	269.12
885.216	235.14
885.593	157.47
885.971	239.99
886.348	305.53
886.725	218.15
887.102	223
887.479	208.44
887.856	215.72
888.233	184.17
888.609	201.16
888.986	203.58
889.363	269.12
889.74	213.29
890.116	196.3
890.493	130.77
890.869	230.28
891.246	242.42
891.622	295.82
891.998	196.3
892.375	218.15
892.751	133.19
893.127	242.42
893.503	159.89
893.879	121.06
894.255	203.58
894.631	118.63
895.007	181.74
895.383	208.44
895.759	181.74
896.134	184.17
896.51	172.03
896.886	220.57
897.261	174.46
897.637	159.89
898.012	230.28
898.388	266.69
898.763	174.46
899.138	159.89
899.514	181.74
899.889	227.86
900.264	215.72
900.639	164.75
901.014	184.17
901.389	203.58
901.764	218.15
902.139	142.9
902.513	176.88
902.888	152.61
903.263	172.03
903.638	135.62
904.012	130.77
904.387	135.62
904.761	184.17
905.136	201.16
905.51	174.46
905.884	193.87
906.259	181.74
906.633	179.31
907.007	150.18
907.381	111.35
907.755	157.47
908.129	191.45
908.503	140.48
908.877	215.72
909.251	210.86
909.624	184.17
909.998	101.64
910.372	145.33
910.745	159.89
911.119	179.31
911.492	174.46
911.866	179.31
912.239	152.61
912.612	174.46
912.986	133.19
913.359	87.08
913.732	157.47
914.105	128.34
914.478	142.9
914.851	116.2
915.224	206.01
915.597	179.31
915.97	142.9
916.343	179.31
916.715	203.58
917.088	87.08
917.461	215.72
917.833	162.32
918.206	164.75
918.578	193.87
918.951	179.31
919.323	206.01
919.695	133.19
920.067	198.73
920.44	201.16
920.812	96.79
921.184	118.63
921.556	169.6
921.928	181.74
922.3	159.89
922.672	230.28
923.043	198.73
923.415	203.58
923.787	186.59
924.158	242.42
924.53	142.9
924.901	235.14
925.273	201.16
925.644	169.6
926.016	138.05
926.387	145.33
926.758	116.2
927.129	201.16
927.5	130.77
927.872	201.16
928.243	172.03
928.613	162.32
928.984	191.45
929.355	184.17
929.726	169.6
930.097	237.56
930.467	184.17
930.838	167.17
931.209	155.04
931.579	186.59
931.95	164.75
932.32	176.88
932.69	164.75
933.061	164.75
933.431	196.3
933.801	213.29
934.171	210.86
934.541	111.35
934.911	239.99
935.281	225.43
935.651	99.21
936.021	167.17
936.391	162.32
936.761	125.91
937.13	174.46
937.5	176.88
937.87	157.47
938.239	179.31
938.609	147.76
938.978	157.47
939.347	206.01
939.717	113.78
940.086	174.46
940.455	169.6
940.824	140.48
941.193	181.74
941.562	225.43
941.931	106.49
942.3	196.3
942.669	186.59
943.038	116.2
943.407	138.05
943.775	142.9
944.144	157.47
944.513	169.6
944.881	145.33
945.25	239.99
945.618	164.75
945.986	84.65
946.355	167.17
946.723	184.17
947.091	169.6
947.459	201.16
947.827	167.17
948.195	121.06
948.563	155.04
948.931	155.04
949.299	237.56
949.667	247.27
950.035	164.75
950.402	181.74
950.77	152.61
951.138	191.45
951.505	193.87
951.873	223
952.24	133.19
952.607	213.29
952.975	147.76
953.342	201.16
953.709	179.31
954.076	116.2
954.443	203.58
954.81	176.88
955.177	181.74
955.544	225.43
955.911	152.61
956.278	89.5
956.645	128.34
957.012	155.04
957.378	84.65
957.745	118.63
958.111	186.59
958.478	181.74
958.844	210.86
959.211	147.76
959.577	174.46
959.943	159.89
960.309	215.72
960.675	121.06
961.042	48.24
961.408	155.04
961.774	213.29
962.139	189.02
962.505	172.03
962.871	152.61
963.237	164.75
963.603	152.61
963.968	172.03
964.334	130.77
964.699	181.74
965.065	179.31
965.43	167.17
965.796	186.59
966.161	213.29
966.526	53.1
966.891	142.9
967.256	91.93
967.622	230.28
967.987	172.03
968.352	232.71
968.716	230.28
969.081	172.03
969.446	121.06
969.811	147.76
970.176	142.9
970.54	259.41
970.905	123.48
971.269	138.05
971.634	113.78
971.998	169.6
972.363	140.48
972.727	167.17
973.091	152.61
973.455	164.75
973.819	157.47
974.183	150.18
974.547	116.2
974.911	181.74
975.275	155.04
975.639	191.45
976.003	237.56
976.367	164.75
976.73	249.7
977.094	118.63
977.458	184.17
977.821	193.87
978.185	152.61
978.548	159.89
978.911	91.93
979.275	116.2
979.638	186.59
980.001	96.79
980.364	123.48
980.727	147.76
981.09	172.03
981.453	87.08
981.816	150.18
982.179	225.43
982.542	94.36
982.905	184.17
983.267	145.33
983.63	206.01
983.992	152.61
984.355	125.91
984.717	179.31
985.08	164.75
985.442	147.76
985.804	67.66
986.167	167.17
986.529	181.74
986.891	121.06
987.253	198.73
987.615	167.17
987.977	172.03
988.339	208.44
988.701	152.61
989.062	147.76
989.424	72.51
989.786	96.79
990.147	121.06
990.509	113.78
990.87	169.6
991.232	230.28
991.593	128.34
991.955	184.17
992.316	169.6
992.677	150.18
993.038	123.48
993.399	157.47
993.76	174.46
994.121	239.99
994.482	239.99
994.843	174.46
995.204	164.75
995.565	116.2
995.926	121.06
996.286	130.77
996.647	108.92
997.007	193.87
997.368	123.48
997.728	147.76
998.089	147.76
998.449	176.88
998.809	91.93
999.169	145.33
999.53	150.18
999.89	155.04
1000.25	128.34
1000.61	191.45
1000.97	152.61
1001.329	138.05
1001.689	181.74
1002.049	169.6
1002.409	145.33
1002.768	138.05
1003.128	65.23
1003.487	155.04
1003.847	152.61
1004.206	172.03
1004.566	203.58
1004.925	210.86
1005.284	167.17
1005.643	152.61
1006.003	169.6
1006.362	128.34
1006.721	208.44
1007.08	167.17
1007.438	106.49
1007.797	186.59
1008.156	130.77
1008.515	201.16
1008.874	96.79
1009.232	106.49
1009.591	147.76
1009.949	145.33
1010.308	157.47
1010.666	184.17
1011.024	140.48
1011.383	147.76
1011.741	167.17
1012.099	138.05
1012.457	191.45
1012.815	147.76
1013.173	125.91
1013.531	104.07
1013.889	198.73
1014.247	203.58
1014.605	223
1014.962	140.48
1015.32	147.76
1015.678	135.62
1016.035	101.64
1016.393	186.59
1016.75	101.64
1017.107	145.33
1017.465	162.32
1017.822	145.33
1018.179	130.77
1018.536	152.61
1018.894	135.62
1019.251	135.62
1019.608	237.56
1019.964	186.59
1020.321	174.46
1020.678	208.44
1021.035	145.33
1021.392	108.92
1021.748	208.44
1022.105	179.31
1022.461	147.76
1022.818	147.76
1023.174	147.76
1023.531	157.47
1023.887	193.87
1024.243	142.9
1024.599	130.77
1024.955	84.65
1025.311	157.47
1025.667	106.49
1026.023	184.17
1026.379	164.75
1026.735	133.19
1027.091	237.56
1027.447	223
