189.514	37.47
189.973	37.47
190.431	37.47
190.889	10.77
191.348	-62.05
191.806	-6.22
192.264	-32.92
192.722	56.89
193.18	-81.46
193.638	-57.19
194.096	5.92
194.554	-8.65
195.012	-35.35
195.47	42.32
195.928	39.9
196.385	13.2
196.843	-54.76
197.301	25.33
197.758	32.62
198.216	1.06
198.674	-6.22
199.131	59.32
199.589	88.44
200.046	64.17
200.503	39.9
200.961	110.29
201.418	124.85
201.875	122.42
202.332	98.15
202.79	86.01
203.247	153.98
203.704	117.57
204.161	144.27
204.618	103.01
205.075	129.7
205.532	90.87
205.989	170.97
206.445	200.09
206.902	180.68
207.359	66.6
207.816	229.22
208.272	100.58
208.729	120
209.185	175.82
209.642	141.84
210.098	185.53
210.555	197.67
211.011	202.52
211.467	129.7
211.924	168.54
212.38	98.15
212.836	156.4
213.292	153.98
213.748	115.14
214.204	185.53
214.66	129.7
215.116	93.3
215.572	170.97
216.028	175.82
216.484	149.12
216.94	207.38
217.396	170.97
217.851	144.27
218.307	83.59
218.763	83.59
219.218	136.99
219.674	149.12
220.129	88.44
220.585	103.01
221.04	156.4
221.496	124.85
221.951	127.28
222.406	183.1
222.861	170.97
223.317	90.87
223.772	110.29
224.227	178.25
224.682	151.55
225.137	52.03
225.592	76.31
226.047	134.56
226.502	127.28
226.957	100.58
227.411	117.57
227.866	202.52
228.321	175.82
228.776	136.99
229.23	88.44
229.685	134.56
230.139	107.86
230.594	197.67
231.048	134.56
231.503	144.27
231.957	124.85
232.411	175.82
232.865	185.53
233.32	192.81
233.774	117.57
234.228	149.12
234.682	161.26
235.136	90.87
235.59	83.59
236.044	134.56
236.498	132.13
236.952	61.74
237.406	95.72
237.86	224.37
238.313	156.4
238.767	37.47
239.221	141.84
239.674	83.59
240.128	149.12
240.581	117.57
241.035	236.5
241.488	134.56
241.942	110.29
242.395	197.67
242.848	95.72
243.301	107.86
243.755	178.25
244.208	170.97
244.661	107.86
245.114	117.57
245.567	107.86
246.02	202.52
246.473	127.28
246.926	158.83
247.379	153.98
247.832	156.4
248.284	163.69
248.737	141.84
249.19	190.39
249.642	151.55
250.095	107.86
250.547	83.59
251	139.41
251.452	195.24
251.905	151.55
252.357	156.4
252.81	76.31
253.262	146.7
253.714	151.55
254.166	168.54
254.618	168.54
255.07	243.78
255.523	66.6
255.975	185.53
256.427	151.55
256.878	120
257.33	212.23
257.782	107.86
258.234	120
258.686	224.37
259.137	98.15
259.589	115.14
260.041	110.29
260.492	132.13
260.944	173.39
261.395	117.57
261.847	175.82
262.298	132.13
262.749	112.71
263.201	161.26
263.652	158.83
264.103	180.68
264.554	139.41
265.005	105.43
265.457	209.8
265.908	124.85
266.359	161.26
266.809	139.41
267.26	166.11
267.711	163.69
268.162	153.98
268.613	146.7
269.064	168.54
269.514	175.82
269.965	158.83
270.415	151.55
270.866	115.14
271.316	132.13
271.767	139.41
272.217	134.56
272.668	187.96
273.118	120
273.568	212.23
274.019	151.55
274.469	156.4
274.919	144.27
275.369	173.39
275.819	212.23
276.269	146.7
276.719	151.55
277.169	175.82
277.619	134.56
278.069	105.43
278.518	134.56
278.968	146.7
279.418	59.32
279.867	73.88
280.317	161.26
280.767	139.41
281.216	151.55
281.666	100.58
282.115	161.26
282.564	110.29
283.014	117.57
283.463	139.41
283.912	224.37
284.361	158.83
284.811	149.12
285.26	110.29
285.709	115.14
286.158	132.13
286.607	212.23
287.056	153.98
287.505	178.25
287.953	163.69
288.402	170.97
288.851	146.7
289.3	107.86
289.748	192.81
290.197	149.12
290.646	144.27
291.094	120
291.543	217.08
291.991	124.85
292.439	83.59
292.888	183.1
293.336	197.67
293.784	117.57
294.233	129.7
294.681	136.99
295.129	139.41
295.577	192.81
296.025	149.12
296.473	139.41
296.921	185.53
297.369	175.82
297.817	107.86
298.264	129.7
298.712	187.96
299.16	170.97
299.608	151.55
300.055	151.55
300.503	127.28
300.95	132.13
301.398	183.1
301.845	153.98
302.293	190.39
302.74	95.72
303.187	141.84
303.635	149.12
304.082	170.97
304.529	183.1
304.976	192.81
305.423	214.66
305.87	219.51
306.317	185.53
306.764	166.11
307.211	156.4
307.658	207.38
308.105	93.3
308.552	175.82
308.998	214.66
309.445	197.67
309.892	158.83
310.338	149.12
310.785	192.81
311.231	136.99
311.678	107.86
312.124	83.59
312.571	98.15
313.017	144.27
313.463	83.59
313.909	173.39
314.356	141.84
314.802	185.53
315.248	195.24
315.694	144.27
316.14	88.44
316.586	146.7
317.032	158.83
317.478	185.53
317.923	175.82
318.369	149.12
318.815	112.71
319.261	185.53
319.706	144.27
320.152	120
320.597	197.67
321.043	93.3
321.488	156.4
321.934	187.96
322.379	166.11
322.824	161.26
323.27	136.99
323.715	141.84
324.16	166.11
324.605	149.12
325.05	156.4
325.495	183.1
325.94	183.1
326.385	144.27
326.83	122.42
327.275	178.25
327.72	185.53
328.165	122.42
328.61	170.97
329.054	47.18
329.499	153.98
329.943	170.97
330.388	153.98
330.832	207.38
331.277	170.97
331.721	144.27
332.166	149.12
332.61	124.85
333.054	163.69
333.499	178.25
333.943	173.39
334.387	129.7
334.831	173.39
335.275	221.94
335.719	190.39
336.163	146.7
336.607	202.52
337.051	98.15
337.495	212.23
337.938	124.85
338.382	110.29
338.826	185.53
339.269	224.37
339.713	231.65
340.157	204.95
340.6	161.26
341.044	163.69
341.487	117.57
341.93	103.01
342.374	76.31
342.817	161.26
343.26	183.1
343.703	156.4
344.146	180.68
344.59	120
345.033	144.27
345.476	117.57
345.919	217.08
346.361	124.85
346.804	139.41
347.247	175.82
347.69	129.7
348.133	117.57
348.575	153.98
349.018	117.57
349.461	156.4
349.903	122.42
350.346	170.97
350.788	161.26
351.23	141.84
351.673	192.81
352.115	69.02
352.557	149.12
353	214.66
353.442	175.82
353.884	127.28
354.326	180.68
354.768	209.8
355.21	202.52
355.652	110.29
356.094	180.68
356.536	136.99
356.978	103.01
357.419	144.27
357.861	190.39
358.303	183.1
358.744	163.69
359.186	156.4
359.627	178.25
360.069	129.7
360.51	248.64
360.952	158.83
361.393	151.55
361.834	136.99
362.276	166.11
362.717	183.1
363.158	141.84
363.599	178.25
364.04	86.01
364.481	209.8
364.922	151.55
365.363	202.52
365.804	190.39
366.245	156.4
366.686	180.68
367.126	209.8
367.567	219.51
368.008	156.4
368.448	103.01
368.889	100.58
369.33	149.12
369.77	224.37
370.21	134.56
370.651	112.71
371.091	64.17
371.531	185.53
371.972	141.84
372.412	173.39
372.852	149.12
373.292	136.99
373.732	185.53
374.172	207.38
374.612	132.13
375.052	120
375.492	83.59
375.932	168.54
376.372	64.17
376.811	81.16
377.251	168.54
377.691	156.4
378.13	141.84
378.57	212.23
379.009	156.4
379.449	214.66
379.888	153.98
380.328	180.68
380.767	202.52
381.206	158.83
381.645	139.41
382.085	207.38
382.524	158.83
382.963	110.29
383.402	149.12
383.841	180.68
384.28	127.28
384.719	144.27
385.158	197.67
385.596	153.98
386.035	161.26
386.474	183.1
386.913	120
387.351	122.42
387.79	151.55
388.228	175.82
388.667	173.39
389.105	93.3
389.544	156.4
389.982	170.97
390.42	187.96
390.859	120
391.297	103.01
391.735	139.41
392.173	168.54
392.611	132.13
393.049	163.69
393.487	127.28
393.925	115.14
394.363	190.39
394.801	95.72
395.239	151.55
395.676	178.25
396.114	187.96
396.552	168.54
396.989	95.72
397.427	141.84
397.864	151.55
398.302	153.98
398.739	139.41
399.177	153.98
399.614	100.58
400.051	134.56
400.488	105.43
400.926	81.16
401.363	178.25
401.8	200.09
402.237	234.08
402.674	229.22
403.111	175.82
403.548	66.6
403.985	98.15
404.421	151.55
404.858	214.66
405.295	166.11
405.732	78.73
406.168	144.27
406.605	163.69
407.041	158.83
407.478	144.27
407.914	158.83
408.351	103.01
408.787	200.09
409.223	127.28
409.66	175.82
410.096	129.7
410.532	187.96
410.968	161.26
411.404	103.01
411.84	156.4
412.276	178.25
412.712	149.12
413.148	166.11
413.584	180.68
414.02	156.4
414.455	129.7
414.891	107.86
415.327	129.7
415.762	73.88
416.198	173.39
416.633	134.56
417.069	134.56
417.504	173.39
417.94	66.6
418.375	112.71
418.81	112.71
419.245	141.84
419.681	141.84
420.116	136.99
420.551	161.26
420.986	144.27
421.421	200.09
421.856	144.27
422.291	183.1
422.726	120
423.16	153.98
423.595	139.41
424.03	248.64
424.464	134.56
424.899	168.54
425.334	195.24
425.768	69.02
426.203	207.38
426.637	219.51
427.071	183.1
427.506	141.84
427.94	163.69
428.374	127.28
428.809	134.56
429.243	146.7
429.677	183.1
430.111	112.71
430.545	134.56
430.979	95.72
431.413	110.29
431.847	158.83
432.28	221.94
432.714	98.15
433.148	134.56
433.582	168.54
434.015	115.14
434.449	115.14
434.882	202.52
435.316	166.11
435.749	187.96
436.183	175.82
436.616	141.84
437.049	103.01
437.483	204.95
437.916	105.43
438.349	103.01
438.782	204.95
439.215	175.82
439.648	219.51
440.081	168.54
440.514	153.98
440.947	161.26
441.38	124.85
441.813	192.81
442.245	202.52
442.678	178.25
443.111	221.94
443.543	180.68
443.976	207.38
444.408	187.96
444.841	153.98
445.273	180.68
445.705	151.55
446.138	168.54
446.57	107.86
447.002	66.6
447.434	258.35
447.867	136.99
448.299	136.99
448.731	204.95
449.163	236.5
449.595	175.82
450.026	175.82
450.458	151.55
450.89	226.79
451.322	214.66
451.754	229.22
452.185	187.96
452.617	268.06
453.048	221.94
453.48	221.94
453.911	265.63
454.343	246.21
454.774	253.49
455.205	217.08
455.637	187.96
456.068	263.2
456.499	192.81
456.93	200.09
457.361	197.67
457.792	294.76
458.223	265.63
458.654	260.77
459.085	231.65
459.516	277.77
459.947	251.07
460.378	236.5
460.808	214.66
461.239	234.08
461.669	178.25
462.1	243.78
462.531	258.35
462.961	209.8
463.391	224.37
463.822	175.82
464.252	231.65
464.682	289.9
465.113	139.41
465.543	275.34
465.973	268.06
466.403	268.06
466.833	248.64
467.263	209.8
467.693	231.65
468.123	200.09
468.553	217.08
468.983	207.38
469.412	183.1
469.842	229.22
470.272	234.08
470.701	217.08
471.131	173.39
471.56	204.95
471.99	180.68
472.419	173.39
472.849	219.51
473.278	209.8
473.707	212.23
474.136	241.36
474.566	238.93
474.995	204.95
475.424	161.26
475.853	202.52
476.282	124.85
476.711	187.96
477.14	144.27
477.569	136.99
477.997	234.08
478.426	190.39
478.855	219.51
479.283	158.83
479.712	202.52
480.141	212.23
480.569	195.24
480.998	197.67
481.426	212.23
481.854	136.99
482.283	173.39
482.711	161.26
483.139	214.66
483.567	221.94
483.995	204.95
484.424	129.7
484.852	209.8
485.28	197.67
485.708	265.63
486.135	156.4
486.563	149.12
486.991	105.43
487.419	187.96
487.847	166.11
488.274	219.51
488.702	175.82
489.129	153.98
489.557	161.26
489.984	124.85
490.412	224.37
490.839	197.67
491.266	153.98
491.694	200.09
492.121	117.57
492.548	236.5
492.975	226.79
493.402	185.53
493.829	234.08
494.256	146.7
494.683	132.13
495.11	229.22
495.537	217.08
495.964	175.82
496.39	158.83
496.817	127.28
497.244	197.67
497.67	221.94
498.097	207.38
498.523	197.67
498.95	183.1
499.376	190.39
499.803	163.69
500.229	241.36
500.655	136.99
501.081	163.69
501.508	214.66
501.934	173.39
502.36	163.69
502.786	163.69
503.212	134.56
503.638	204.95
504.064	168.54
504.489	178.25
504.915	231.65
505.341	180.68
505.767	183.1
506.192	163.69
506.618	158.83
507.043	180.68
507.469	175.82
507.894	226.79
508.32	190.39
508.745	153.98
509.17	166.11
509.596	185.53
510.021	117.57
510.446	226.79
510.871	214.66
511.296	187.96
511.721	120
512.146	153.98
512.571	139.41
512.996	117.57
513.421	175.82
513.845	187.96
514.27	146.7
514.695	149.12
515.119	151.55
515.544	175.82
515.969	187.96
516.393	258.35
516.817	156.4
517.242	195.24
517.666	88.44
518.09	151.55
518.515	168.54
518.939	166.11
519.363	428.25
519.787	183.1
520.211	144.27
520.635	120
521.059	168.54
521.483	204.95
521.907	168.54
522.331	103.01
522.754	163.69
523.178	178.25
523.602	173.39
524.025	236.5
524.449	192.81
524.872	214.66
525.296	158.83
525.719	166.11
526.143	231.65
526.566	139.41
526.989	204.95
527.412	219.51
527.836	173.39
528.259	136.99
528.682	161.26
529.105	180.68
529.528	146.7
529.951	144.27
530.374	166.11
530.796	146.7
531.219	122.42
531.642	195.24
532.065	163.69
532.487	144.27
532.91	202.52
533.332	197.67
533.755	149.12
534.177	161.26
534.6	190.39
535.022	124.85
535.444	180.68
535.867	173.39
536.289	195.24
536.711	195.24
537.133	146.7
537.555	132.13
537.977	129.7
538.399	146.7
538.821	195.24
539.243	207.38
539.665	180.68
540.086	197.67
540.508	238.93
540.93	178.25
541.351	190.39
541.773	209.8
542.195	173.39
542.616	263.2
543.037	229.22
543.459	219.51
543.88	248.64
544.301	221.94
544.723	241.36
545.144	282.62
545.565	226.79
545.986	265.63
546.407	260.77
546.828	178.25
547.249	195.24
547.67	175.82
548.091	224.37
548.512	175.82
548.932	153.98
549.353	246.21
549.774	158.83
550.194	231.65
550.615	144.27
551.035	214.66
551.456	241.36
551.876	185.53
552.296	161.26
552.717	185.53
553.137	120
553.557	195.24
553.977	146.7
554.397	192.81
554.817	134.56
555.237	98.15
555.657	246.21
556.077	158.83
556.497	229.22
556.917	260.77
557.337	132.13
557.756	95.72
558.176	214.66
558.596	166.11
559.015	224.37
559.435	132.13
559.854	158.83
560.274	156.4
560.693	214.66
561.112	107.86
561.532	161.26
561.951	226.79
562.37	156.4
562.789	221.94
563.208	115.14
563.627	161.26
564.046	153.98
564.465	153.98
564.884	88.44
565.303	200.09
565.722	231.65
566.14	173.39
566.559	163.69
566.978	122.42
567.396	168.54
567.815	132.13
568.233	207.38
568.652	219.51
569.07	200.09
569.489	173.39
569.907	282.62
570.325	175.82
570.743	156.4
571.161	153.98
571.58	214.66
571.998	158.83
572.416	168.54
572.833	180.68
573.251	158.83
573.669	139.41
574.087	221.94
574.505	151.55
574.922	163.69
575.34	185.53
575.758	149.12
576.175	190.39
576.593	229.22
577.01	234.08
577.428	192.81
577.845	1598.17
578.262	304.46
578.68	204.95
579.097	149.12
579.514	173.39
579.931	170.97
580.348	153.98
580.765	190.39
581.182	180.68
581.599	197.67
582.016	258.35
582.433	246.21
582.849	229.22
583.266	163.69
583.683	163.69
584.099	170.97
584.516	178.25
584.933	231.65
585.349	207.38
585.765	224.37
586.182	141.84
586.598	156.4
587.014	217.08
587.431	175.82
587.847	178.25
588.263	180.68
588.679	178.25
589.095	166.11
589.511	115.14
589.927	158.83
590.343	166.11
590.759	173.39
591.174	127.28
591.59	132.13
592.006	168.54
592.421	146.7
592.837	231.65
593.252	248.64
593.668	163.69
594.083	209.8
594.499	134.56
594.914	197.67
595.329	170.97
595.745	136.99
596.16	204.95
596.575	212.23
596.99	195.24
597.405	136.99
597.82	173.39
598.235	129.7
598.65	146.7
599.065	122.42
599.479	202.52
599.894	175.82
600.309	229.22
600.724	173.39
601.138	183.1
601.553	192.81
601.967	122.42
602.382	212.23
602.796	144.27
603.21	117.57
603.625	166.11
604.039	185.53
604.453	151.55
604.867	226.79
605.281	127.28
605.695	197.67
606.109	229.22
606.523	153.98
606.937	178.25
607.351	306.89
607.765	134.56
608.178	156.4
608.592	144.27
609.006	124.85
609.419	192.81
609.833	253.49
610.246	207.38
610.66	200.09
611.073	197.67
611.487	224.37
611.9	141.84
612.313	190.39
612.726	207.38
613.139	163.69
613.553	236.5
613.966	229.22
614.379	173.39
614.792	158.83
615.204	124.85
615.617	187.96
616.03	202.52
616.443	107.86
616.856	166.11
617.268	149.12
617.681	204.95
618.093	158.83
618.506	173.39
618.918	163.69
619.331	115.14
619.743	151.55
620.155	219.51
620.568	146.7
620.98	120
621.392	229.22
621.804	258.35
622.216	200.09
622.628	175.82
623.04	190.39
623.452	200.09
623.864	183.1
624.276	129.7
624.687	120
625.099	183.1
625.511	117.57
625.922	236.5
626.334	149.12
626.745	139.41
627.157	158.83
627.568	136.99
627.979	134.56
628.391	141.84
628.802	136.99
629.213	120
629.624	178.25
630.035	163.69
630.446	185.53
630.857	132.13
631.268	166.11
631.679	151.55
632.09	153.98
632.501	180.68
632.912	212.23
633.322	202.52
633.733	124.85
634.144	166.11
634.554	246.21
634.965	209.8
635.375	146.7
635.785	202.52
636.196	214.66
636.606	202.52
637.016	195.24
637.427	132.13
637.837	161.26
638.247	229.22
638.657	122.42
639.067	195.24
639.477	236.5
639.887	234.08
640.297	221.94
640.706	183.1
641.116	170.97
641.526	161.26
641.935	146.7
642.345	217.08
642.755	132.13
643.164	83.59
643.573	112.71
643.983	156.4
644.392	149.12
644.801	161.26
645.211	139.41
645.62	200.09
646.029	221.94
646.438	117.57
646.847	207.38
647.256	161.26
647.665	161.26
648.074	175.82
648.483	187.96
648.892	214.66
649.3	139.41
649.709	207.38
650.118	183.1
650.526	105.43
650.935	146.7
651.343	212.23
651.752	268.06
652.16	141.84
652.568	120
652.977	195.24
653.385	168.54
653.793	192.81
654.201	180.68
654.609	129.7
655.017	156.4
655.425	214.66
655.833	151.55
656.241	221.94
656.649	120
657.057	192.81
657.464	190.39
657.872	153.98
658.28	202.52
658.687	156.4
659.095	120
659.502	166.11
659.91	207.38
660.317	144.27
660.724	187.96
661.132	100.58
661.539	73.88
661.946	163.69
662.353	153.98
662.76	168.54
663.167	207.38
663.574	190.39
663.981	173.39
664.388	112.71
664.795	139.41
665.202	129.7
665.608	195.24
666.015	190.39
666.422	122.42
666.828	100.58
667.235	173.39
667.641	197.67
668.047	73.88
668.454	83.59
668.86	163.69
669.266	180.68
669.673	144.27
670.079	122.42
670.485	98.15
670.891	183.1
671.297	136.99
671.703	93.3
672.109	120
672.515	168.54
672.92	151.55
673.326	93.3
673.732	134.56
674.138	83.59
674.543	195.24
674.949	178.25
675.354	83.59
675.76	204.95
676.165	132.13
676.57	158.83
676.976	149.12
677.381	195.24
677.786	178.25
678.191	170.97
678.596	197.67
679.001	124.85
679.406	144.27
679.811	163.69
680.216	158.83
680.621	197.67
681.026	163.69
681.43	163.69
681.835	168.54
682.24	158.83
682.644	224.37
683.049	192.81
683.453	185.53
683.858	132.13
684.262	110.29
684.667	243.78
685.071	187.96
685.475	180.68
685.879	180.68
686.283	127.28
686.687	134.56
687.091	195.24
687.495	120
687.899	149.12
688.303	207.38
688.707	168.54
689.111	141.84
689.514	170.97
689.918	156.4
690.322	136.99
690.725	175.82
691.129	168.54
691.532	204.95
691.936	200.09
692.339	163.69
692.742	202.52
693.146	139.41
693.549	178.25
693.952	217.08
694.355	190.39
694.758	207.38
695.161	178.25
695.564	197.67
695.967	202.52
696.37	112.71
696.773	185.53
697.175	183.1
697.578	144.27
697.981	168.54
698.383	175.82
698.786	175.82
699.188	170.97
699.591	185.53
699.993	136.99
700.395	120
700.798	66.6
701.2	158.83
701.602	149.12
702.004	241.36
702.406	173.39
702.808	175.82
703.21	163.69
703.612	204.95
704.014	231.65
704.416	175.82
704.818	277.77
705.219	127.28
705.621	166.11
706.023	217.08
706.424	170.97
706.826	161.26
707.227	183.1
707.629	185.53
708.03	187.96
708.431	289.9
708.832	204.95
709.234	175.82
709.635	173.39
710.036	175.82
710.437	151.55
710.838	248.64
711.239	185.53
711.64	105.43
712.041	158.83
712.441	192.81
712.842	200.09
713.243	265.63
713.643	224.37
714.044	251.07
714.445	202.52
714.845	170.97
715.246	255.92
715.646	251.07
716.046	212.23
716.447	153.98
716.847	260.77
717.247	149.12
717.647	224.37
718.047	195.24
718.447	190.39
718.847	207.38
719.247	238.93
719.647	299.61
720.047	163.69
720.446	241.36
720.846	156.4
721.246	224.37
721.645	272.91
722.045	212.23
722.444	212.23
722.844	219.51
723.243	268.06
723.643	319.03
724.042	272.91
724.441	297.18
724.84	299.61
725.24	289.9
725.639	311.75
726.038	365.15
726.437	289.9
726.836	306.89
727.234	406.41
727.633	379.71
728.032	396.7
728.431	321.46
728.83	333.59
729.228	379.71
729.627	462.23
730.025	425.83
730.424	416.12
730.822	518.06
731.22	520.49
731.619	569.03
732.017	639.42
732.415	668.55
732.813	702.53
733.212	734.08
733.61	816.61
734.008	870.01
734.406	957.39
734.803	1047.19
735.201	991.37
735.599	1294.77
735.997	1265.64
736.395	1187.97
736.792	1258.36
737.19	1496.23
737.587	1535.07
737.985	1525.36
738.382	1632.16
738.78	1836.04
739.177	1870.02
739.574	1976.82
739.971	1797.21
740.369	1988.96
740.766	2221.97
741.163	2270.51
741.56	2272.94
741.957	2139.44
742.354	2389.45
742.751	2646.73
743.147	2726.83
743.544	2680.72
743.941	2746.25
744.338	3253.54
744.734	3321.5
745.131	3382.18
745.527	3246.26
745.924	3792.38
746.32	4214.72
746.716	4554.53
747.113	4396.76
747.509	4539.97
747.905	5132.21
748.301	5559.4
748.697	5226.87
749.093	5297.26
749.489	5489.01
749.885	6472.04
750.281	6695.34
750.677	6445.34
751.073	6535.14
751.468	7321.56
751.864	8285.17
752.26	7840.99
752.655	7552.15
753.051	7831.28
753.446	9248.78
753.842	9547.33
754.237	8816.73
754.632	8530.32
755.028	9178.39
755.423	9768.2
755.818	9758.5
756.213	9282.76
756.608	8913.82
757.003	9705.1
757.398	10246.37
757.793	9552.18
758.188	8858
758.583	9481.79
758.977	10501.23
759.372	11120.17
759.767	10726.96
760.161	10942.98
760.556	12440.58
760.95	14411.48
761.345	14566.82
761.739	13991.57
762.133	14253.71
762.527	16770.74
762.922	18321.74
763.316	18185.81
763.71	16855.69
764.104	17644.54
764.498	20161.57
764.892	21358.19
765.286	20193.12
765.68	19122.72
766.073	20909.15
766.467	23491.72
766.861	24940.77
767.255	24011.14
767.648	23054.82
768.042	24603.39
768.435	27651.98
768.829	28088.88
769.222	26331.57
769.615	24889.8
770.008	26967.5
770.402	30375.32
770.795	29753.95
771.188	26877.69
771.581	25994.18
771.974	27618
772.367	29438.41
772.76	28501.51
773.153	25300
773.545	24161.63
773.938	26574.29
774.331	29137.44
774.724	28610.73
775.116	25770.88
775.509	26596.14
775.901	31394.75
776.294	33545.27
776.686	32280.69
777.078	30236.97
777.471	31773.4
777.863	35923.95
778.255	39055.07
778.647	37127.85
779.039	34540.43
779.431	34664.22
779.823	38940.99
780.215	41829.38
780.607	38586.61
780.999	35518.6
781.39	35751.62
781.782	40013.82
782.174	42984.74
782.565	41161.9
782.957	36909.4
783.348	37817.18
783.74	41312.38
784.131	43166.78
784.522	41283.26
784.914	36610.85
785.305	36683.67
785.696	39542.94
786.087	41033.25
786.478	38671.57
786.869	33491.87
787.26	32635.06
787.651	34780.73
788.042	35516.18
788.433	32108.36
788.823	28474.81
789.214	27210.22
789.605	28537.91
789.995	29496.67
790.386	26139.82
790.776	23074.24
791.167	23015.98
791.557	26154.38
791.948	29763.66
792.338	28472.38
792.728	26508.76
793.118	26122.83
793.508	29011.22
793.898	32368.07
794.288	31530.68
794.678	27569.45
795.068	25989.33
795.458	27673.82
795.848	31307.37
796.238	31266.11
796.627	27656.83
797.017	26144.67
797.406	27814.6
797.796	30984.55
798.185	31989.42
798.575	29972.4
798.964	26727.21
799.354	28671.41
799.743	32484.58
800.132	34855.97
800.521	32314.67
800.91	29202.97
801.299	28574.32
801.688	31756.41
802.077	33025.85
802.466	31780.68
802.855	28535.49
803.244	26671.38
803.633	28302.47
804.021	30115.61
804.41	29348.61
804.799	25814.57
805.187	22984.43
805.576	24079.11
805.964	26324.29
806.352	25880.11
806.741	23489.29
807.129	20251.38
807.517	20644.59
807.905	23724.73
808.293	24576.69
808.681	23122.78
809.069	21115.47
809.457	21940.72
809.845	24979.61
810.233	27144.69
810.621	26249.04
811.009	23700.46
811.396	22083.93
811.784	24799.99
812.171	27736.93
812.559	28127.71
812.946	24627.66
813.334	21622.76
813.721	22151.89
814.108	24659.21
814.496	26025.74
814.883	24151.92
815.27	22047.52
815.657	21416.44
816.044	23632.5
816.431	26433.51
816.818	26183.51
817.205	23365.5
817.592	21414.02
817.979	21212.56
818.365	23227.15
818.752	23499
819.139	22292.67
819.525	19462.53
819.912	18717.37
820.298	19224.66
820.685	20724.69
821.071	20576.62
821.457	17443.08
821.843	15418.78
822.23	15494.02
822.616	15882.38
823.002	15734.32
823.388	14159.05
823.774	12554.66
824.16	11671.15
824.546	12239.12
824.931	12651.74
825.317	12855.63
825.703	11314.34
826.089	10428.41
826.474	10780.36
826.86	11809.5
827.245	12268.24
827.631	11513.38
828.016	10248.79
828.401	9695.39
828.787	10275.49
829.172	10751.23
829.557	10758.51
829.942	9671.12
830.327	8942.95
830.712	8561.87
831.097	8984.21
831.482	9574.03
831.867	9277.91
832.252	8163.81
832.636	7384.67
833.021	7816.72
833.406	8377.41
833.79	8712.36
834.175	8297.31
834.559	7336.13
834.944	6870.1
835.328	7273.02
835.713	7518.17
836.097	7790.02
836.481	6777.87
836.865	6020.57
837.249	5627.36
837.633	5802.12
838.017	6382.23
838.401	5974.46
838.785	5348.23
839.169	4595.79
839.553	4316.66
839.937	4624.92
840.32	4656.47
840.704	4396.76
841.087	3782.67
841.471	3197.71
841.854	3255.97
842.238	3515.68
842.621	3782.67
843.004	3452.57
843.388	3030.24
843.771	2814.21
844.154	2848.19
844.537	3258.39
844.92	3360.34
845.303	3149.17
845.686	2738.97
846.069	2651.59
846.452	2721.98
846.834	3090.92
847.217	3120.04
847.6	2945.28
847.982	2520.52
848.365	2234.11
848.748	2576.34
849.13	2816.64
849.512	2799.65
849.895	2503.53
850.277	2146.73
850.659	2061.77
851.041	2365.18
851.423	2678.29
851.806	2464.69
852.188	2212.26
852.57	2020.51
852.951	1879.73
853.333	2122.45
853.715	2355.47
854.097	2221.97
854.479	2030.22
854.86	1770.51
855.242	1629.73
855.623	1797.21
856.005	2008.37
856.386	1879.73
856.768	1564.19
857.149	1340.89
857.53	1195.26
857.911	1391.86
858.292	1457.4
858.674	1411.28
859.055	1401.57
859.436	1018.07
859.817	911.27
860.197	1107.88
860.578	1146.71
860.959	1124.87
861.34	996.22
861.72	838.45
862.101	751.07
862.482	882.14
862.862	969.52
863.243	940.4
863.623	855.44
864.003	724.37
864.384	653.98
864.764	746.22
865.144	729.23
865.524	848.16
865.904	692.82
866.284	542.33
866.664	571.46
867.044	651.56
867.424	724.37
867.804	673.4
868.183	624.86
868.563	467.09
868.943	374.85
869.322	474.37
869.702	474.37
870.081	537.48
870.461	518.06
870.84	481.65
871.22	420.97
871.599	484.08
871.978	486.51
872.357	488.93
872.736	411.26
873.115	416.12
873.494	360.29
873.873	382.14
874.252	357.86
874.631	338.45
875.01	423.4
875.388	345.73
875.767	326.31
876.146	289.9
876.524	289.9
876.903	272.91
877.281	326.31
877.66	263.2
878.038	263.2
878.416	202.52
878.794	236.5
879.173	277.77
879.551	229.22
879.929	251.07
880.307	248.64
880.685	197.67
881.063	190.39
881.441	146.7
881.818	258.35
882.196	209.8
882.574	136.99
882.951	173.39
883.329	207.38
883.707	202.52
884.084	251.07
884.461	234.08
884.839	212.23
885.216	166.11
885.593	161.26
885.971	221.94
886.348	173.39
886.725	209.8
887.102	124.85
887.479	141.84
887.856	178.25
888.233	263.2
888.609	202.52
888.986	132.13
889.363	166.11
889.74	187.96
890.116	187.96
890.493	175.82
890.869	173.39
891.246	217.08
891.622	195.24
891.998	175.82
892.375	175.82
892.751	139.41
893.127	204.95
893.503	234.08
893.879	197.67
894.255	224.37
894.631	185.53
895.007	173.39
895.383	166.11
895.759	185.53
896.134	146.7
896.51	163.69
896.886	158.83
897.261	214.66
897.637	168.54
898.012	204.95
898.388	93.3
898.763	86.01
899.138	107.86
899.514	100.58
899.889	141.84
900.264	132.13
900.639	170.97
901.014	134.56
901.389	151.55
901.764	156.4
902.139	105.43
902.513	144.27
902.888	71.45
903.263	127.28
903.638	136.99
904.012	110.29
904.387	120
904.761	124.85
905.136	124.85
905.51	170.97
905.884	110.29
906.259	134.56
906.633	115.14
907.007	168.54
907.381	139.41
907.755	158.83
908.129	141.84
908.503	95.72
908.877	124.85
909.251	202.52
909.624	107.86
909.998	86.01
910.372	129.7
910.745	110.29
911.119	144.27
911.492	173.39
911.866	76.31
912.239	105.43
912.612	122.42
912.986	56.89
913.359	61.74
913.732	105.43
914.105	163.69
914.478	180.68
914.851	115.14
915.224	168.54
915.597	153.98
915.97	185.53
916.343	151.55
916.715	153.98
917.088	76.31
917.461	115.14
917.833	90.87
918.206	134.56
918.578	185.53
918.951	195.24
919.323	275.34
919.695	122.42
920.067	168.54
920.44	110.29
920.812	134.56
921.184	187.96
921.556	173.39
921.928	139.41
922.3	110.29
922.672	166.11
923.043	178.25
923.415	226.79
923.787	139.41
924.158	129.7
924.53	141.84
924.901	197.67
925.273	163.69
925.644	153.98
926.016	158.83
926.387	163.69
926.758	78.73
927.129	187.96
927.5	197.67
927.872	134.56
928.243	134.56
928.613	185.53
928.984	175.82
929.355	163.69
929.726	168.54
930.097	124.85
930.467	170.97
930.838	144.27
931.209	168.54
931.579	117.57
931.95	112.71
932.32	149.12
932.69	178.25
933.061	146.7
933.431	156.4
933.801	153.98
934.171	168.54
934.541	144.27
934.911	100.58
935.281	158.83
935.651	161.26
936.021	187.96
936.391	139.41
936.761	127.28
937.13	132.13
937.5	153.98
937.87	95.72
938.239	100.58
938.609	122.42
938.978	100.58
939.347	141.84
939.717	134.56
940.086	183.1
940.455	136.99
940.824	200.09
941.193	153.98
941.562	163.69
941.931	214.66
942.3	302.04
942.669	214.66
943.038	166.11
943.407	217.08
943.775	170.97
944.144	263.2
944.513	178.25
944.881	151.55
945.25	170.97
945.618	190.39
945.986	185.53
946.355	212.23
946.723	141.84
947.091	149.12
947.459	103.01
947.827	149.12
948.195	90.87
948.563	153.98
948.931	144.27
949.299	149.12
949.667	112.71
950.035	153.98
950.402	141.84
950.77	107.86
951.138	66.6
951.505	192.81
951.873	183.1
952.24	168.54
952.607	134.56
952.975	66.6
953.342	161.26
953.709	156.4
954.076	170.97
954.443	183.1
954.81	200.09
955.177	175.82
955.544	88.44
955.911	173.39
956.278	112.71
956.645	173.39
957.012	173.39
957.378	187.96
957.745	117.57
958.111	166.11
958.478	151.55
958.844	146.7
959.211	236.5
959.577	93.3
959.943	156.4
960.309	127.28
960.675	146.7
961.042	122.42
961.408	124.85
961.774	170.97
962.139	175.82
962.505	115.14
962.871	139.41
963.237	161.26
963.603	105.43
963.968	153.98
964.334	64.17
964.699	224.37
965.065	112.71
965.43	144.27
965.796	175.82
966.161	110.29
966.526	173.39
966.891	124.85
967.256	156.4
967.622	105.43
967.987	146.7
968.352	158.83
968.716	158.83
969.081	173.39
969.446	144.27
969.811	54.46
970.176	183.1
970.54	139.41
970.905	66.6
971.269	115.14
971.634	71.45
971.998	175.82
972.363	139.41
972.727	221.94
973.091	168.54
973.455	149.12
973.819	149.12
974.183	146.7
974.547	110.29
974.911	122.42
975.275	141.84
975.639	139.41
976.003	76.31
976.367	192.81
976.73	90.87
977.094	112.71
977.458	161.26
977.821	134.56
978.185	86.01
978.548	93.3
978.911	124.85
979.275	209.8
979.638	153.98
980.001	120
980.364	170.97
980.727	112.71
981.09	156.4
981.453	175.82
981.816	187.96
982.179	127.28
982.542	124.85
982.905	149.12
983.267	268.06
983.63	187.96
983.992	93.3
984.355	103.01
984.717	139.41
985.08	192.81
985.442	66.6
985.804	124.85
986.167	161.26
986.529	110.29
986.891	234.08
987.253	173.39
987.615	151.55
987.977	83.59
988.339	156.4
988.701	170.97
989.062	95.72
989.424	117.57
989.786	153.98
990.147	112.71
990.509	112.71
990.87	197.67
991.232	153.98
991.593	112.71
991.955	180.68
992.316	129.7
992.677	187.96
993.038	81.16
993.399	175.82
993.76	98.15
994.121	136.99
994.482	183.1
994.843	187.96
995.204	146.7
995.565	149.12
995.926	134.56
996.286	178.25
996.647	136.99
997.007	110.29
997.368	175.82
997.728	100.58
998.089	146.7
998.449	173.39
998.809	161.26
999.169	136.99
999.53	136.99
999.89	151.55
1000.25	158.83
1000.61	73.88
1000.97	115.14
1001.329	161.26
1001.689	66.6
1002.049	141.84
1002.409	156.4
1002.768	212.23
1003.128	170.97
1003.487	204.95
1003.847	158.83
1004.206	200.09
1004.566	209.8
1004.925	197.67
1005.284	100.58
1005.643	161.26
1006.003	110.29
1006.362	107.86
1006.721	180.68
1007.08	163.69
1007.438	134.56
1007.797	93.3
1008.156	134.56
1008.515	168.54
1008.874	146.7
1009.232	88.44
1009.591	115.14
1009.949	153.98
1010.308	149.12
1010.666	110.29
1011.024	163.69
1011.383	178.25
1011.741	95.72
1012.099	98.15
1012.457	107.86
1012.815	127.28
1013.173	183.1
1013.531	132.13
1013.889	163.69
1014.247	129.7
1014.605	98.15
1014.962	144.27
1015.32	117.57
1015.678	107.86
1016.035	122.42
1016.393	151.55
1016.75	105.43
1017.107	144.27
1017.465	103.01
1017.822	56.89
1018.179	110.29
1018.536	166.11
1018.894	88.44
1019.251	173.39
1019.608	136.99
1019.964	141.84
1020.321	107.86
1020.678	195.24
1021.035	170.97
1021.392	134.56
1021.748	190.39
1022.105	195.24
1022.461	151.55
1022.818	166.11
1023.174	141.84
1023.531	219.51
1023.887	183.1
1024.243	200.09
1024.599	175.82
1024.955	127.28
1025.311	129.7
1025.667	120
1026.023	120
1026.379	120
1026.735	197.67
1027.091	110.29
1027.447	187.96
