189.514	108.47
189.973	108.47
190.431	108.47
190.889	25.94
191.348	79.34
191.806	-29.89
192.264	-15.32
192.722	47.79
193.18	-37.17
193.638	-54.16
194.096	-22.6
194.554	-27.46
195.012	-66.29
195.47	-8.04
195.928	-22.6
196.385	-20.18
196.843	8.95
197.301	1.67
197.758	28.37
198.216	52.64
198.674	86.62
199.131	47.79
199.589	96.33
200.046	91.48
200.503	16.23
200.961	93.9
201.418	84.19
201.875	30.8
202.332	135.17
202.79	135.17
203.247	120.6
203.704	142.45
204.161	123.03
204.618	178.86
205.075	149.73
205.532	205.56
205.989	118.18
206.445	161.87
206.902	142.45
207.359	227.4
207.816	164.29
208.272	200.7
208.729	159.44
209.185	178.86
209.642	159.44
210.098	183.71
210.555	224.97
211.011	120.6
211.467	169.15
211.924	186.14
212.38	132.74
212.836	154.58
213.292	190.99
213.748	164.29
214.204	166.72
214.66	76.91
215.116	169.15
215.572	178.86
216.028	113.32
216.484	176.43
216.94	152.16
217.396	166.72
217.851	224.97
218.307	123.03
218.763	135.17
219.218	89.05
219.674	120.6
220.129	127.88
220.585	246.82
221.04	169.15
221.496	127.88
221.951	142.45
222.406	178.86
222.861	198.27
223.317	193.42
223.772	200.7
224.227	183.71
224.682	232.25
225.137	159.44
225.592	64.78
226.047	144.87
226.502	140.02
226.957	220.12
227.411	188.56
227.866	64.78
228.321	98.76
228.776	157.01
229.23	81.77
229.685	169.15
230.139	181.28
230.594	125.46
231.048	188.56
231.503	98.76
231.957	178.86
232.411	181.28
232.865	210.41
233.32	176.43
233.774	96.33
234.228	120.6
234.682	164.29
235.136	93.9
235.59	57.49
236.044	161.87
236.498	285.65
236.952	217.69
237.406	195.85
237.86	171.57
238.313	188.56
238.767	183.71
239.221	181.28
239.674	125.46
240.128	127.88
240.581	166.72
241.035	178.86
241.488	210.41
241.942	220.12
242.395	166.72
242.848	186.14
243.301	130.31
243.755	62.35
244.208	261.38
244.661	232.25
245.114	183.71
245.567	161.87
246.02	130.31
246.473	178.86
246.926	142.45
247.379	193.42
247.832	166.72
248.284	123.03
248.737	181.28
249.19	183.71
249.642	166.72
250.095	205.56
250.547	159.44
251	178.86
251.452	157.01
251.905	220.12
252.357	178.86
252.81	132.74
253.262	217.69
253.714	207.98
254.166	123.03
254.618	125.46
255.07	205.56
255.523	142.45
255.975	190.99
256.427	140.02
256.878	207.98
257.33	161.87
257.782	157.01
258.234	147.3
258.686	224.97
259.137	205.56
259.589	154.58
260.041	98.76
260.492	161.87
260.944	222.55
261.395	166.72
261.847	174
262.298	120.6
262.749	183.71
263.201	127.88
263.652	147.3
264.103	186.14
264.554	149.73
265.005	118.18
265.457	147.3
265.908	91.48
266.359	176.43
266.809	178.86
267.26	186.14
267.711	157.01
268.162	157.01
268.613	161.87
269.064	103.61
269.514	171.57
269.965	147.3
270.415	152.16
270.866	205.56
271.316	159.44
271.767	152.16
272.217	91.48
272.668	195.85
273.118	222.55
273.568	113.32
274.019	161.87
274.469	108.47
274.919	152.16
275.369	125.46
275.819	157.01
276.269	212.84
276.719	142.45
277.169	176.43
277.619	140.02
278.069	101.18
278.518	198.27
278.968	120.6
279.418	106.04
279.867	178.86
280.317	137.59
280.767	159.44
281.216	142.45
281.666	227.4
282.115	152.16
282.564	93.9
283.014	137.59
283.463	137.59
283.912	103.61
284.361	142.45
284.811	157.01
285.26	234.68
285.709	161.87
286.158	176.43
286.607	125.46
287.056	127.88
287.505	186.14
287.953	132.74
288.402	181.28
288.851	152.16
289.3	171.57
289.748	144.87
290.197	186.14
290.646	232.25
291.094	200.7
291.543	203.13
291.991	232.25
292.439	157.01
292.888	84.19
293.336	108.47
293.784	234.68
294.233	178.86
294.681	210.41
295.129	142.45
295.577	178.86
296.025	261.38
296.473	200.7
296.921	176.43
297.369	186.14
297.817	140.02
298.264	125.46
298.712	212.84
299.16	42.93
299.608	164.29
300.055	132.74
300.503	154.58
300.95	198.27
301.398	103.61
301.845	181.28
302.293	125.46
302.74	125.46
303.187	176.43
303.635	164.29
304.082	166.72
304.529	171.57
304.976	195.85
305.423	137.59
305.87	123.03
306.317	200.7
306.764	244.39
307.211	89.05
307.658	166.72
308.105	137.59
308.552	161.87
308.998	181.28
309.445	142.45
309.892	144.87
310.338	166.72
310.785	144.87
311.231	132.74
311.678	127.88
312.124	186.14
312.571	215.26
313.017	140.02
313.463	224.97
313.909	149.73
314.356	207.98
314.802	140.02
315.248	198.27
315.694	147.3
316.14	152.16
316.586	161.87
317.032	164.29
317.478	166.72
317.923	217.69
318.369	101.18
318.815	171.57
319.261	140.02
319.706	103.61
320.152	108.47
320.597	142.45
321.043	249.25
321.488	171.57
321.934	210.41
322.379	123.03
322.824	127.88
323.27	229.83
323.715	161.87
324.16	193.42
324.605	125.46
325.05	79.34
325.495	144.87
325.94	164.29
326.385	152.16
326.83	190.99
327.275	120.6
327.72	127.88
328.165	103.61
328.61	137.59
329.054	127.88
329.499	195.85
329.943	159.44
330.388	210.41
330.832	115.75
331.277	195.85
331.721	157.01
332.166	110.89
332.61	212.84
333.054	164.29
333.499	142.45
333.943	220.12
334.387	193.42
334.831	217.69
335.275	140.02
335.719	149.73
336.163	169.15
336.607	140.02
337.051	183.71
337.495	203.13
337.938	123.03
338.382	147.3
338.826	198.27
339.269	198.27
339.713	149.73
340.157	159.44
340.6	174
341.044	135.17
341.487	123.03
341.93	183.71
342.374	149.73
342.817	154.58
343.26	169.15
343.703	125.46
344.146	132.74
344.59	132.74
345.033	123.03
345.476	171.57
345.919	108.47
346.361	171.57
346.804	159.44
347.247	161.87
347.69	181.28
348.133	130.31
348.575	108.47
349.018	127.88
349.461	159.44
349.903	142.45
350.346	157.01
350.788	161.87
351.23	144.87
351.673	147.3
352.115	147.3
352.557	190.99
353	188.56
353.442	154.58
353.884	203.13
354.326	127.88
354.768	137.59
355.21	152.16
355.652	89.05
356.094	137.59
356.536	193.42
356.978	103.61
357.419	198.27
357.861	98.76
358.303	174
358.744	149.73
359.186	127.88
359.627	149.73
360.069	186.14
360.51	142.45
360.952	76.91
361.393	137.59
361.834	125.46
362.276	169.15
362.717	115.75
363.158	169.15
363.599	183.71
364.04	181.28
364.481	110.89
364.922	127.88
365.363	164.29
365.804	132.74
366.245	171.57
366.686	149.73
367.126	198.27
367.567	171.57
368.008	154.58
368.448	193.42
368.889	190.99
369.33	127.88
369.77	164.29
370.21	227.4
370.651	154.58
371.091	198.27
371.531	142.45
371.972	157.01
372.412	174
372.852	285.65
373.292	207.98
373.732	106.04
374.172	154.58
374.612	195.85
375.052	200.7
375.492	210.41
375.932	152.16
376.372	244.39
376.811	198.27
377.251	157.01
377.691	232.25
378.13	186.14
378.57	261.38
379.009	140.02
379.449	137.59
379.888	174
380.328	203.13
380.767	123.03
381.206	96.33
381.645	195.85
382.085	135.17
382.524	190.99
382.963	113.32
383.402	190.99
383.841	137.59
384.28	174
384.719	210.41
385.158	132.74
385.596	130.31
386.035	188.56
386.474	142.45
386.913	149.73
387.351	263.81
387.79	193.42
388.228	166.72
388.667	123.03
389.105	137.59
389.544	101.18
389.982	147.3
390.42	144.87
390.859	144.87
391.297	106.04
391.735	161.87
392.173	142.45
392.611	183.71
393.049	222.55
393.487	142.45
393.925	176.43
394.363	132.74
394.801	176.43
395.239	147.3
395.676	137.59
396.114	183.71
396.552	169.15
396.989	96.33
397.427	113.32
397.864	164.29
398.302	171.57
398.739	140.02
399.177	169.15
399.614	144.87
400.051	123.03
400.488	207.98
400.926	171.57
401.363	198.27
401.8	149.73
402.237	205.56
402.674	123.03
403.111	144.87
403.548	198.27
403.985	198.27
404.421	152.16
404.858	147.3
405.295	229.83
405.732	154.58
406.168	140.02
406.605	137.59
407.041	220.12
407.478	178.86
407.914	123.03
408.351	140.02
408.787	188.56
409.223	174
409.66	147.3
410.096	152.16
410.532	159.44
410.968	188.56
411.404	127.88
411.84	169.15
412.276	174
412.712	152.16
413.148	174
413.584	152.16
414.02	149.73
414.455	101.18
414.891	142.45
415.327	220.12
415.762	152.16
416.198	72.06
416.633	166.72
417.069	188.56
417.504	135.17
417.94	152.16
418.375	186.14
418.81	203.13
419.245	118.18
419.681	144.87
420.116	154.58
420.551	171.57
420.986	263.81
421.421	176.43
421.856	125.46
422.291	140.02
422.726	227.4
423.16	237.11
423.595	147.3
424.03	200.7
424.464	164.29
424.899	222.55
425.334	125.46
425.768	127.88
426.203	140.02
426.637	118.18
427.071	164.29
427.506	152.16
427.94	157.01
428.374	210.41
428.809	210.41
429.243	164.29
429.677	161.87
430.111	135.17
430.545	154.58
430.979	188.56
431.413	195.85
431.847	198.27
432.28	186.14
432.714	161.87
433.148	178.86
433.582	263.81
434.015	195.85
434.449	166.72
434.882	205.56
435.316	144.87
435.749	176.43
436.183	171.57
436.616	125.46
437.049	222.55
437.483	186.14
437.916	164.29
438.349	183.71
438.782	157.01
439.215	149.73
439.648	157.01
440.081	152.16
440.514	229.83
440.947	140.02
441.38	169.15
441.813	239.54
442.245	183.71
442.678	176.43
443.111	181.28
443.543	171.57
443.976	215.26
444.408	171.57
444.841	178.86
445.273	254.1
445.705	217.69
446.138	132.74
446.57	244.39
447.002	120.6
447.434	222.55
447.867	205.56
448.299	200.7
448.731	176.43
449.163	220.12
449.595	123.03
450.026	174
450.458	222.55
450.89	193.42
451.322	220.12
451.754	188.56
452.185	169.15
452.617	176.43
453.048	246.82
453.48	207.98
453.911	258.95
454.343	210.41
454.774	324.49
455.205	280.8
455.637	166.72
456.068	256.53
456.499	205.56
456.93	273.52
457.361	227.4
457.792	261.38
458.223	176.43
458.654	322.06
459.085	229.83
459.516	215.26
459.947	210.41
460.378	215.26
460.808	195.85
461.239	130.31
461.669	275.94
462.1	249.25
462.531	249.25
462.961	222.55
463.391	147.3
463.822	169.15
464.252	157.01
464.682	171.57
465.113	164.29
465.543	217.69
465.973	181.28
466.403	176.43
466.833	249.25
467.263	181.28
467.693	239.54
468.123	176.43
468.553	166.72
468.983	207.98
469.412	212.84
469.842	178.86
470.272	239.54
470.701	178.86
471.131	222.55
471.56	140.02
471.99	200.7
472.419	183.71
472.849	210.41
473.278	127.88
473.707	190.99
474.136	169.15
474.566	256.53
474.995	186.14
475.424	203.13
475.853	144.87
476.282	193.42
476.711	193.42
477.14	183.71
477.569	263.81
477.997	152.16
478.426	190.99
478.855	232.25
479.283	181.28
479.712	174
480.141	169.15
480.569	135.17
480.998	280.8
481.426	132.74
481.854	234.68
482.283	288.08
482.711	200.7
483.139	169.15
483.567	166.72
483.995	217.69
484.424	164.29
484.852	186.14
485.28	246.82
485.708	140.02
486.135	249.25
486.563	174
486.991	205.56
487.419	227.4
487.847	239.54
488.274	171.57
488.702	227.4
489.129	188.56
489.557	147.3
489.984	215.26
490.412	200.7
490.839	210.41
491.266	229.83
491.694	203.13
492.121	215.26
492.548	183.71
492.975	142.45
493.402	183.71
493.829	186.14
494.256	234.68
494.683	222.55
495.11	130.31
495.537	234.68
495.964	137.59
496.39	234.68
496.817	181.28
497.244	258.95
497.67	169.15
498.097	130.31
498.523	186.14
498.95	137.59
499.376	205.56
499.803	181.28
500.229	178.86
500.655	149.73
501.081	183.71
501.508	188.56
501.934	183.71
502.36	186.14
502.786	193.42
503.212	157.01
503.638	227.4
504.064	217.69
504.489	222.55
504.915	178.86
505.341	239.54
505.767	195.85
506.192	195.85
506.618	220.12
507.043	186.14
507.469	183.71
507.894	132.74
508.32	127.88
508.745	171.57
509.17	220.12
509.596	186.14
510.021	157.01
510.446	166.72
510.871	203.13
511.296	174
511.721	251.67
512.146	130.31
512.571	210.41
512.996	130.31
513.421	178.86
513.845	152.16
514.27	154.58
514.695	190.99
515.119	188.56
515.544	149.73
515.969	123.03
516.393	205.56
516.817	198.27
517.242	149.73
517.666	273.52
518.09	149.73
518.515	166.72
518.939	174
519.363	351.19
519.787	183.71
520.211	152.16
520.635	108.47
521.059	135.17
521.483	200.7
521.907	181.28
522.331	205.56
522.754	147.3
523.178	174
523.602	220.12
524.025	132.74
524.449	178.86
524.872	183.71
525.296	227.4
525.719	154.58
526.143	159.44
526.566	161.87
526.989	164.29
527.412	222.55
527.836	190.99
528.259	210.41
528.682	123.03
529.105	193.42
529.528	174
529.951	142.45
530.374	113.32
530.796	166.72
531.219	181.28
531.642	152.16
532.065	127.88
532.487	152.16
532.91	273.52
533.332	254.1
533.755	69.63
534.177	215.26
534.6	125.46
535.022	183.71
535.444	96.33
535.867	190.99
536.289	193.42
536.711	193.42
537.133	198.27
537.555	181.28
537.977	212.84
538.399	195.85
538.821	254.1
539.243	207.98
539.665	176.43
540.086	142.45
540.508	254.1
540.93	210.41
541.351	169.15
541.773	241.96
542.195	246.82
542.616	200.7
543.037	285.65
543.459	300.22
543.88	227.4
544.301	249.25
544.723	278.37
545.144	275.94
545.565	178.86
545.986	256.53
546.407	217.69
546.828	256.53
547.249	215.26
547.67	161.87
548.091	268.66
548.512	188.56
548.932	149.73
549.353	229.83
549.774	210.41
550.194	186.14
550.615	215.26
551.035	164.29
551.456	234.68
551.876	123.03
552.296	195.85
552.717	176.43
553.137	171.57
553.557	227.4
553.977	135.17
554.397	200.7
554.817	123.03
555.237	188.56
555.657	159.44
556.077	217.69
556.497	171.57
556.917	220.12
557.337	195.85
557.756	229.83
558.176	224.97
558.596	144.87
559.015	171.57
559.435	115.75
559.854	159.44
560.274	205.56
560.693	171.57
561.112	195.85
561.532	178.86
561.951	222.55
562.37	234.68
562.789	135.17
563.208	207.98
563.627	123.03
564.046	132.74
564.465	161.87
564.884	178.86
565.303	98.76
565.722	171.57
566.14	261.38
566.559	113.32
566.978	183.71
567.396	154.58
567.815	181.28
568.233	232.25
568.652	215.26
569.07	229.83
569.489	193.42
569.907	178.86
570.325	224.97
570.743	125.46
571.161	164.29
571.58	181.28
571.998	132.74
572.416	174
572.833	183.71
573.251	212.84
573.669	98.76
574.087	169.15
574.505	120.6
574.922	142.45
575.34	234.68
575.758	147.3
576.175	171.57
576.593	176.43
577.01	130.31
577.428	234.68
577.845	1805.09
578.262	336.63
578.68	144.87
579.097	120.6
579.514	217.69
579.931	159.44
580.348	125.46
580.765	159.44
581.182	159.44
581.599	98.76
582.016	174
582.433	203.13
582.849	198.27
583.266	174
583.683	190.99
584.099	195.85
584.516	174
584.933	176.43
585.349	149.73
585.765	164.29
586.182	256.53
586.598	203.13
587.014	215.26
587.431	193.42
587.847	212.84
588.263	154.58
588.679	137.59
589.095	113.32
589.511	234.68
589.927	227.4
590.343	232.25
590.759	157.01
591.174	251.67
591.59	210.41
592.006	249.25
592.421	159.44
592.837	174
593.252	190.99
593.668	212.84
594.083	137.59
594.499	164.29
594.914	203.13
595.329	232.25
595.745	183.71
596.16	268.66
596.575	183.71
596.99	166.72
597.405	188.56
597.82	161.87
598.235	137.59
598.65	113.32
599.065	198.27
599.479	176.43
599.894	212.84
600.309	200.7
600.724	159.44
601.138	190.99
601.553	164.29
601.967	161.87
602.382	115.75
602.796	98.76
603.21	227.4
603.625	212.84
604.039	222.55
604.453	142.45
604.867	166.72
605.281	205.56
605.695	137.59
606.109	152.16
606.523	207.98
606.937	210.41
607.351	292.94
607.765	159.44
608.178	157.01
608.592	207.98
609.006	183.71
609.419	254.1
609.833	195.85
610.246	193.42
610.66	215.26
611.073	222.55
611.487	280.8
611.9	210.41
612.313	232.25
612.726	205.56
613.139	161.87
613.553	159.44
613.966	174
614.379	125.46
614.792	135.17
615.204	137.59
615.617	183.71
616.03	164.29
616.443	205.56
616.856	178.86
617.268	210.41
617.681	159.44
618.093	130.31
618.506	161.87
618.918	161.87
619.331	261.38
619.743	224.97
620.155	147.3
620.568	205.56
620.98	237.11
621.392	159.44
621.804	222.55
622.216	178.86
622.628	140.02
623.04	183.71
623.452	144.87
623.864	137.59
624.276	144.87
624.687	183.71
625.099	183.71
625.511	157.01
625.922	188.56
626.334	140.02
626.745	178.86
627.157	144.87
627.568	164.29
627.979	176.43
628.391	205.56
628.802	157.01
629.213	195.85
629.624	183.71
630.035	181.28
630.446	161.87
630.857	130.31
631.268	220.12
631.679	147.3
632.09	166.72
632.501	246.82
632.912	147.3
633.322	137.59
633.733	157.01
634.144	198.27
634.554	190.99
634.965	159.44
635.375	101.18
635.785	164.29
636.196	198.27
636.606	222.55
637.016	181.28
637.427	171.57
637.837	212.84
638.247	123.03
638.657	207.98
639.067	125.46
639.477	176.43
639.887	207.98
640.297	178.86
640.706	132.74
641.116	183.71
641.526	169.15
641.935	183.71
642.345	171.57
642.755	147.3
643.164	154.58
643.573	190.99
643.983	212.84
644.392	210.41
644.801	212.84
645.211	157.01
645.62	137.59
646.029	157.01
646.438	164.29
646.847	220.12
647.256	193.42
647.665	186.14
648.074	132.74
648.483	161.87
648.892	212.84
649.3	171.57
649.709	176.43
650.118	159.44
650.526	232.25
650.935	125.46
651.343	195.85
651.752	188.56
652.16	246.82
652.568	190.99
652.977	152.16
653.385	244.39
653.793	190.99
654.201	207.98
654.609	183.71
655.017	149.73
655.425	203.13
655.833	178.86
656.241	183.71
656.649	161.87
657.057	212.84
657.464	135.17
657.872	140.02
658.28	147.3
658.687	181.28
659.095	188.56
659.502	171.57
659.91	108.47
660.317	232.25
660.724	161.87
661.132	256.53
661.539	237.11
661.946	147.3
662.353	198.27
662.76	215.26
663.167	174
663.574	74.49
663.981	171.57
664.388	181.28
664.795	74.49
665.202	215.26
665.608	174
666.015	103.61
666.422	164.29
666.828	205.56
667.235	135.17
667.641	171.57
668.047	157.01
668.454	171.57
668.86	137.59
669.266	144.87
669.673	258.95
670.079	178.86
670.485	152.16
670.891	207.98
671.297	161.87
671.703	203.13
672.109	203.13
672.515	118.18
672.92	113.32
673.326	183.71
673.732	171.57
674.138	149.73
674.543	176.43
674.949	147.3
675.354	137.59
675.76	193.42
676.165	190.99
676.57	181.28
676.976	207.98
677.381	198.27
677.786	118.18
678.191	157.01
678.596	215.26
679.001	166.72
679.406	200.7
679.811	220.12
680.216	249.25
680.621	193.42
681.026	154.58
681.43	157.01
681.835	178.86
682.24	157.01
682.644	200.7
683.049	118.18
683.453	174
683.858	157.01
684.262	200.7
684.667	144.87
685.071	157.01
685.475	212.84
685.879	137.59
686.283	152.16
686.687	195.85
687.091	164.29
687.495	200.7
687.899	149.73
688.303	123.03
688.707	198.27
689.111	147.3
689.514	217.69
689.918	123.03
690.322	176.43
690.725	174
691.129	186.14
691.532	142.45
691.936	157.01
692.339	169.15
692.742	200.7
693.146	142.45
693.549	186.14
693.952	198.27
694.355	157.01
694.758	222.55
695.161	203.13
695.564	149.73
695.967	137.59
696.37	203.13
696.773	237.11
697.175	174
697.578	181.28
697.981	132.74
698.383	169.15
698.786	193.42
699.188	181.28
699.591	178.86
699.993	159.44
700.395	193.42
700.798	169.15
701.2	171.57
701.602	159.44
702.004	183.71
702.406	183.71
702.808	193.42
703.21	178.86
703.612	166.72
704.014	169.15
704.416	169.15
704.818	227.4
705.219	181.28
705.621	149.73
706.023	200.7
706.424	198.27
706.826	183.71
707.227	198.27
707.629	174
708.03	174
708.431	246.82
708.832	108.47
709.234	234.68
709.635	241.96
710.036	217.69
710.437	169.15
710.838	254.1
711.239	215.26
711.64	169.15
712.041	232.25
712.441	256.53
712.842	241.96
713.243	285.65
713.643	205.56
714.044	203.13
714.445	222.55
714.845	169.15
715.246	220.12
715.646	198.27
716.046	176.43
716.447	288.08
716.847	205.56
717.247	174
717.647	215.26
718.047	244.39
718.447	186.14
718.847	249.25
719.247	343.91
719.647	258.95
720.047	368.18
720.446	268.66
720.846	266.24
721.246	300.22
721.645	261.38
722.045	181.28
722.444	232.25
722.844	292.94
723.243	227.4
723.643	309.93
724.042	346.33
724.441	229.83
724.84	263.81
725.24	292.94
725.639	305.07
726.038	373.03
726.437	300.22
726.836	326.92
727.234	331.77
727.633	324.49
728.032	339.05
728.431	368.18
728.83	402.16
729.228	370.61
729.627	404.59
730.025	387.6
730.424	491.97
730.822	542.94
731.22	608.47
731.619	610.9
732.017	647.31
732.415	734.69
732.813	724.98
733.212	756.53
733.61	763.82
734.008	928.87
734.406	1008.97
734.803	1030.81
735.201	996.83
735.599	1159.45
735.997	1278.39
736.395	1302.66
736.792	1375.48
737.19	1441.01
737.587	1608.49
737.985	1640.04
738.382	1613.34
738.78	1741.99
739.177	1846.36
739.574	2013.84
739.971	1945.87
740.369	2081.8
740.766	2183.74
741.163	2275.98
741.56	2477.44
741.957	2266.27
742.354	2356.07
742.751	2657.05
743.147	2712.88
743.544	2598.8
743.941	2797.83
744.338	3103.66
744.734	3263.86
745.131	3205.6
745.527	3414.34
745.924	3943.48
746.32	4370.67
746.716	4309.99
747.113	4225.04
747.509	4715.33
747.905	5093.98
748.301	5125.53
748.697	5086.7
749.093	5489.62
749.489	6013.9
749.885	6208.08
750.281	6314.87
750.677	6314.87
751.073	7108.58
751.468	7800.33
751.864	7734.8
752.26	7477.51
752.655	8259.08
753.051	9045.5
753.446	8921.71
753.842	8339.18
754.237	8836.76
754.632	9659.59
755.028	9635.31
755.423	9225.11
755.818	8846.47
756.213	9645.02
756.608	10021.24
757.003	9759.1
757.398	9077.05
757.793	9412.01
758.188	10123.19
758.583	10266.39
758.977	9844.05
759.372	9931.43
759.767	11562.53
760.161	12829.54
760.556	12659.63
760.95	12431.47
761.345	13827.13
761.739	16256.78
762.133	16196.1
762.527	15700.94
762.922	15955.8
763.316	18074.77
763.71	19618.48
764.104	18400.01
764.498	17717.96
764.892	18946.14
765.286	21759.29
765.68	21977.74
766.073	21133.07
766.467	20715.58
766.861	23167.08
767.255	25676.83
767.648	25647.7
768.042	24698.65
768.435	24438.94
768.829	28125.89
769.222	29703.59
769.615	27849.19
770.008	25880.71
770.402	27385.59
770.795	29681.74
771.188	29392.9
771.581	26795.77
771.974	25286.04
772.367	26829.76
772.76	28744.83
773.153	27130.73
773.545	25555.46
773.938	25283.62
774.331	27730.26
774.724	29181.73
775.116	27557.92
775.509	26528.78
775.901	29327.37
776.294	33477.92
776.686	34147.83
777.078	32392.95
777.471	31507.01
777.863	34931.82
778.255	38715.86
778.647	38499.84
779.039	35744.94
779.431	33902.68
779.823	37133.31
780.215	40589.68
780.607	38980.43
780.999	36555.64
781.39	36259.51
781.782	39786.27
782.174	43043.6
782.565	40172.2
782.957	37167.3
783.348	37752.26
783.74	41291.15
784.131	42087.27
784.522	41126.09
784.914	36856.61
785.305	37269.24
785.696	40618.81
786.087	40885.8
786.478	37485.26
786.869	33400.25
787.26	33159.95
787.651	35490.08
788.042	35152.7
788.433	31710.9
788.823	27798.22
789.214	27858.9
789.605	28485.12
789.995	28776.39
790.386	25045.75
790.776	23242.32
791.167	24239.91
791.557	27778.8
791.948	28227.84
792.338	26028.77
792.728	25198.66
793.118	27684.14
793.508	30824.96
793.898	31888.09
794.288	28958.43
794.678	26739.95
795.068	28009.39
795.458	30800.69
795.848	31155.07
796.238	27708.41
796.627	26286.06
797.017	28521.53
797.406	31608.96
797.796	31281.28
798.185	28939.01
798.575	27019.08
798.964	28208.42
799.354	32104.11
799.743	33922.1
800.132	31091.96
800.521	28091.91
800.91	29361.35
801.299	31854.11
801.688	33958.51
802.077	30713.31
802.466	28082.2
802.855	27960.84
803.244	29868.64
803.633	31271.57
804.021	29638.05
804.41	25786.05
804.799	24754.48
805.187	25349.15
805.576	27611.32
805.964	26247.22
806.352	22698.62
806.741	21164.62
807.129	22261.72
807.517	24293.31
807.905	24482.63
808.293	22531.15
808.681	20385.48
809.069	22220.46
809.457	25917.12
809.845	27089.47
810.233	24193.79
810.621	22346.68
811.009	22817.56
811.396	26346.74
811.784	28191.43
812.171	26477.81
812.559	23286.01
812.946	22130.65
813.334	23980.2
813.721	25637.99
814.108	24921.96
814.496	22579.69
814.883	20844.23
815.27	22921.93
815.657	25548.18
816.044	26147.71
816.431	23550.58
816.818	21725.31
817.205	22031.14
817.592	24798.17
817.979	25871
818.365	24060.3
818.752	20977.72
819.139	19147.6
819.525	20281.11
819.912	22196.19
820.298	21769
820.685	19584.5
821.071	17130.58
821.457	16501.93
821.843	17477.67
822.23	17805.34
822.616	16181.53
823.002	14004.31
823.388	12618.37
823.774	12897.5
824.16	13839.26
824.546	13475.18
824.931	12004.28
825.317	10766.4
825.703	10472.71
826.089	11547.96
826.474	12475.16
826.86	11861.08
827.245	10696.01
827.631	10118.33
828.016	10453.29
828.401	11334.37
828.787	11487.28
829.172	10365.91
829.557	9263.95
829.942	8581.9
830.327	9263.95
830.712	9931.43
831.097	9530.94
831.482	8443.55
831.867	7805.19
832.252	8004.22
832.636	8572.19
833.021	8987.25
833.406	8336.75
833.79	7390.13
834.175	7052.75
834.559	7562.47
834.944	8142.57
835.328	8329.47
835.713	7722.66
836.097	6657.11
836.481	5967.78
836.865	6385.26
837.249	6603.71
837.633	6356.14
838.017	5800.3
838.401	4916.79
838.785	4729.9
839.169	5045.44
839.553	5453.21
839.937	5101.26
840.32	4397.37
840.704	3623.08
841.087	3589.1
841.471	3661.92
841.854	3982.31
842.238	3610.95
842.621	3188.61
843.004	2792.97
843.388	2936.18
843.771	3232.3
844.154	3368.23
844.537	3292.98
844.92	2858.51
845.303	2683.75
845.686	2683.75
846.069	3052.69
846.452	3285.7
846.834	3072.1
847.217	2596.37
847.6	2404.62
847.982	2494.43
848.365	2819.67
848.748	2856.08
849.13	2593.94
849.512	2113.35
849.895	2096.36
850.277	2292.97
850.659	2649.77
851.041	2817.25
851.423	2615.79
851.806	2018.69
852.188	1875.48
852.57	2050.24
852.951	2443.45
853.333	2508.99
853.715	2278.4
854.097	1965.29
854.479	1749.27
854.86	1691.02
855.242	1914.32
855.623	2030.83
856.005	1909.47
856.386	1496.84
856.768	1322.08
857.149	1322.08
857.53	1569.65
857.911	1661.89
858.292	1501.69
858.674	1212.85
859.055	1135.18
859.436	1076.93
859.817	1169.16
860.197	1220.13
860.578	1161.88
860.959	999.26
861.34	812.36
861.72	800.22
862.101	967.7
862.482	1008.97
862.862	941
863.243	834.21
863.623	722.55
864.003	722.55
864.384	771.1
864.764	897.31
865.144	831.78
865.524	778.38
865.904	647.31
866.284	603.62
866.664	574.49
867.044	727.41
867.424	674.01
867.804	642.46
868.183	564.78
868.563	518.67
868.943	615.76
869.322	513.81
869.702	572.07
870.081	530.8
870.461	528.38
870.84	460.41
871.22	448.28
871.599	542.94
871.978	457.99
872.357	482.26
872.736	385.17
873.115	414.3
873.494	339.05
873.873	402.16
874.252	416.72
874.631	353.62
875.01	280.8
875.388	271.09
875.767	220.12
876.146	322.06
876.524	300.22
876.903	275.94
877.281	341.48
877.66	212.84
878.038	288.08
878.416	268.66
878.794	207.98
879.173	164.29
879.551	273.52
879.929	188.56
880.307	258.95
880.685	266.24
881.063	203.13
881.441	234.68
881.818	166.72
882.196	241.96
882.574	275.94
882.951	224.97
883.329	234.68
883.707	254.1
884.084	300.22
884.461	278.37
884.839	147.3
885.216	266.24
885.593	171.57
885.971	212.84
886.348	188.56
886.725	195.85
887.102	144.87
887.479	229.83
887.856	183.71
888.233	154.58
888.609	176.43
888.986	144.87
889.363	176.43
889.74	183.71
890.116	144.87
890.493	210.41
890.869	256.53
891.246	178.86
891.622	152.16
891.998	161.87
892.375	200.7
892.751	239.54
893.127	171.57
893.503	275.94
893.879	120.6
894.255	166.72
894.631	207.98
895.007	127.88
895.383	79.34
895.759	149.73
896.134	222.55
896.51	220.12
896.886	195.85
897.261	193.42
897.637	149.73
898.012	98.76
898.388	135.17
898.763	135.17
899.138	120.6
899.514	93.9
899.889	149.73
900.264	166.72
900.639	171.57
901.014	169.15
901.389	169.15
901.764	140.02
902.139	130.31
902.513	142.45
902.888	118.18
903.263	157.01
903.638	183.71
904.012	215.26
904.387	176.43
904.761	190.99
905.136	186.14
905.51	200.7
905.884	159.44
906.259	93.9
906.633	186.14
907.007	169.15
907.381	181.28
907.755	149.73
908.129	152.16
908.503	268.66
908.877	164.29
909.251	188.56
909.624	84.19
909.998	103.61
910.372	147.3
910.745	195.85
911.119	142.45
911.492	203.13
911.866	207.98
912.239	171.57
912.612	79.34
912.986	222.55
913.359	190.99
913.732	224.97
914.105	176.43
914.478	174
914.851	210.41
915.224	268.66
915.597	203.13
915.97	188.56
916.343	171.57
916.715	176.43
917.088	169.15
917.461	127.88
917.833	178.86
918.206	154.58
918.578	132.74
918.951	154.58
919.323	123.03
919.695	127.88
920.067	195.85
920.44	188.56
920.812	84.19
921.184	176.43
921.556	144.87
921.928	157.01
922.3	171.57
922.672	207.98
923.043	193.42
923.415	200.7
923.787	125.46
924.158	174
924.53	113.32
924.901	207.98
925.273	181.28
925.644	157.01
926.016	142.45
926.387	115.75
926.758	125.46
927.129	166.72
927.5	188.56
927.872	118.18
928.243	140.02
928.613	159.44
928.984	161.87
929.355	96.33
929.726	149.73
930.097	130.31
930.467	161.87
930.838	120.6
931.209	62.35
931.579	229.83
931.95	152.16
932.32	149.73
932.69	147.3
933.061	166.72
933.431	195.85
933.801	101.18
934.171	137.59
934.541	110.89
934.911	120.6
935.281	159.44
935.651	190.99
936.021	176.43
936.391	164.29
936.761	169.15
937.13	140.02
937.5	123.03
937.87	113.32
938.239	91.48
938.609	152.16
938.978	176.43
939.347	198.27
939.717	72.06
940.086	161.87
940.455	159.44
940.824	190.99
941.193	161.87
941.562	178.86
941.931	149.73
942.3	207.98
942.669	222.55
943.038	169.15
943.407	178.86
943.775	171.57
944.144	149.73
944.513	261.38
944.881	224.97
945.25	169.15
945.618	79.34
945.986	140.02
946.355	217.69
946.723	91.48
947.091	142.45
947.459	108.47
947.827	137.59
948.195	140.02
948.563	217.69
948.931	183.71
949.299	149.73
949.667	137.59
950.035	154.58
950.402	174
950.77	91.48
951.138	239.54
951.505	140.02
951.873	154.58
952.24	212.84
952.607	198.27
952.975	159.44
953.342	154.58
953.709	125.46
954.076	123.03
954.443	106.04
954.81	178.86
955.177	132.74
955.544	169.15
955.911	193.42
956.278	166.72
956.645	164.29
957.012	154.58
957.378	186.14
957.745	137.59
958.111	45.36
958.478	132.74
958.844	140.02
959.211	142.45
959.577	181.28
959.943	159.44
960.309	212.84
960.675	171.57
961.042	186.14
961.408	161.87
961.774	171.57
962.139	171.57
962.505	195.85
962.871	169.15
963.237	195.85
963.603	171.57
963.968	178.86
964.334	186.14
964.699	130.31
965.065	130.31
965.43	118.18
965.796	123.03
966.161	110.89
966.526	154.58
966.891	147.3
967.256	152.16
967.622	169.15
967.987	137.59
968.352	147.3
968.716	198.27
969.081	186.14
969.446	127.88
969.811	166.72
970.176	178.86
970.54	176.43
970.905	237.11
971.269	181.28
971.634	217.69
971.998	183.71
972.363	215.26
972.727	127.88
973.091	190.99
973.455	137.59
973.819	174
974.183	164.29
974.547	113.32
974.911	181.28
975.275	127.88
975.639	183.71
976.003	144.87
976.367	171.57
976.73	120.6
977.094	183.71
977.458	205.56
977.821	198.27
978.185	135.17
978.548	152.16
978.911	86.62
979.275	157.01
979.638	186.14
980.001	171.57
980.364	152.16
980.727	149.73
981.09	203.13
981.453	222.55
981.816	154.58
982.179	195.85
982.542	142.45
982.905	188.56
983.267	176.43
983.63	178.86
983.992	96.33
984.355	123.03
984.717	123.03
985.08	159.44
985.442	188.56
985.804	103.61
986.167	152.16
986.529	169.15
986.891	113.32
987.253	193.42
987.615	169.15
987.977	147.3
988.339	125.46
988.701	161.87
989.062	127.88
989.424	164.29
989.786	135.17
990.147	106.04
990.509	161.87
990.87	103.61
991.232	239.54
991.593	120.6
991.955	183.71
992.316	212.84
992.677	195.85
993.038	144.87
993.399	195.85
993.76	190.99
994.121	125.46
994.482	67.2
994.843	125.46
995.204	220.12
995.565	174
995.926	188.56
996.286	171.57
996.647	176.43
997.007	190.99
997.368	144.87
997.728	130.31
998.089	220.12
998.449	98.76
998.809	157.01
999.169	183.71
999.53	152.16
999.89	106.04
1000.25	110.89
1000.61	98.76
1000.97	96.33
1001.329	135.17
1001.689	161.87
1002.049	123.03
1002.409	142.45
1002.768	159.44
1003.128	137.59
1003.487	229.83
1003.847	157.01
1004.206	198.27
1004.566	161.87
1004.925	152.16
1005.284	140.02
1005.643	123.03
1006.003	212.84
1006.362	142.45
1006.721	135.17
1007.08	93.9
1007.438	152.16
1007.797	186.14
1008.156	212.84
1008.515	69.63
1008.874	91.48
1009.232	140.02
1009.591	137.59
1009.949	140.02
1010.308	232.25
1010.666	195.85
1011.024	142.45
1011.383	101.18
1011.741	183.71
1012.099	118.18
1012.457	176.43
1012.815	210.41
1013.173	166.72
1013.531	171.57
1013.889	98.76
1014.247	203.13
1014.605	137.59
1014.962	229.83
1015.32	101.18
1015.678	125.46
1016.035	67.2
1016.393	159.44
1016.75	118.18
1017.107	171.57
1017.465	152.16
1017.822	159.44
1018.179	169.15
1018.536	137.59
1018.894	200.7
1019.251	123.03
1019.608	161.87
1019.964	137.59
1020.321	147.3
1020.678	159.44
1021.035	227.4
1021.392	144.87
1021.748	161.87
1022.105	178.86
1022.461	135.17
1022.818	186.14
1023.174	178.86
1023.531	205.56
1023.887	166.72
1024.243	127.88
1024.599	144.87
1024.955	147.3
1025.311	135.17
1025.667	176.43
1026.023	210.41
1026.379	127.88
1026.735	193.42
1027.091	166.72
1027.447	135.17
