189.514	116.51
189.973	116.51
190.431	116.51
190.889	-24.27
191.348	-16.99
191.806	14.56
192.264	19.42
192.722	-21.84
193.18	-21.84
193.638	-53.4
194.096	9.71
194.554	-55.83
195.012	-9.71
195.47	-9.71
195.928	-16.99
196.385	55.83
196.843	16.99
197.301	50.97
197.758	29.13
198.216	-38.84
198.674	4.85
199.131	41.26
199.589	94.66
200.046	67.96
200.503	48.54
200.961	194.18
201.418	80.1
201.875	53.4
202.332	82.53
202.79	208.74
203.247	121.36
203.704	135.92
204.161	121.36
204.618	135.92
205.075	165.05
205.532	77.67
205.989	162.62
206.445	138.35
206.902	143.21
207.359	123.79
207.816	143.21
208.272	162.62
208.729	133.5
209.185	145.63
209.642	160.2
210.098	165.05
210.555	162.62
211.011	206.31
211.467	140.78
211.924	203.89
212.38	203.89
212.836	162.62
213.292	150.49
213.748	148.06
214.204	213.6
214.66	167.48
215.116	143.21
215.572	131.07
216.028	106.8
216.484	174.76
216.94	208.74
217.396	128.64
217.851	133.5
218.307	152.92
218.763	133.5
219.218	150.49
219.674	174.76
220.129	143.21
220.585	155.34
221.04	114.08
221.496	50.97
221.951	128.64
222.406	165.05
222.861	150.49
223.317	150.49
223.772	169.91
224.227	123.79
224.682	172.33
225.137	165.05
225.592	140.78
226.047	99.52
226.502	104.37
226.957	133.5
227.411	155.34
227.866	140.78
228.321	143.21
228.776	177.19
229.23	157.77
229.685	82.53
230.139	99.52
230.594	162.62
231.048	104.37
231.503	118.93
231.957	84.95
232.411	111.65
232.865	131.07
233.32	177.19
233.774	152.92
234.228	121.36
234.682	138.35
235.136	131.07
235.59	89.81
236.044	155.34
236.498	145.63
236.952	121.36
237.406	254.86
237.86	109.22
238.313	196.6
238.767	189.32
239.221	72.82
239.674	97.09
240.128	116.51
240.581	155.34
241.035	157.77
241.488	128.64
241.942	89.81
242.395	121.36
242.848	155.34
243.301	128.64
243.755	245.15
244.208	131.07
244.661	152.92
245.114	92.23
245.567	184.47
246.02	118.93
246.473	184.47
246.926	191.75
247.379	128.64
247.832	194.18
248.284	94.66
248.737	131.07
249.19	174.76
249.642	138.35
250.095	111.65
250.547	216.02
251	167.48
251.452	182.04
251.905	189.32
252.357	140.78
252.81	97.09
253.262	165.05
253.714	179.61
254.166	133.5
254.618	101.94
255.07	131.07
255.523	162.62
255.975	99.52
256.427	152.92
256.878	106.8
257.33	150.49
257.782	155.34
258.234	101.94
258.686	165.05
259.137	165.05
259.589	179.61
260.041	140.78
260.492	167.48
260.944	189.32
261.395	208.74
261.847	216.02
262.298	143.21
262.749	104.37
263.201	213.6
263.652	186.9
264.103	87.38
264.554	157.77
265.005	116.51
265.457	138.35
265.908	82.53
266.359	172.33
266.809	116.51
267.26	143.21
267.711	123.79
268.162	116.51
268.613	148.06
269.064	116.51
269.514	165.05
269.965	145.63
270.415	101.94
270.866	216.02
271.316	160.2
271.767	189.32
272.217	126.22
272.668	152.92
273.118	118.93
273.568	152.92
274.019	118.93
274.469	177.19
274.919	135.92
275.369	84.95
275.819	94.66
276.269	118.93
276.719	203.89
277.169	213.6
277.619	194.18
278.069	199.03
278.518	177.19
278.968	138.35
279.418	191.75
279.867	172.33
280.317	99.52
280.767	97.09
281.216	157.77
281.666	106.8
282.115	145.63
282.564	162.62
283.014	167.48
283.463	162.62
283.912	106.8
284.361	155.34
284.811	145.63
285.26	143.21
285.709	104.37
286.158	174.76
286.607	165.05
287.056	138.35
287.505	148.06
287.953	143.21
288.402	177.19
288.851	172.33
289.3	143.21
289.748	201.46
290.197	114.08
290.646	228.16
291.094	194.18
291.543	118.93
291.991	114.08
292.439	53.4
292.888	140.78
293.336	145.63
293.784	162.62
294.233	77.67
294.681	148.06
295.129	167.48
295.577	104.37
296.025	150.49
296.473	189.32
296.921	208.74
297.369	216.02
297.817	111.65
298.264	177.19
298.712	67.96
299.16	167.48
299.608	145.63
300.055	143.21
300.503	114.08
300.95	203.89
301.398	201.46
301.845	177.19
302.293	179.61
302.74	237.87
303.187	160.2
303.635	111.65
304.082	140.78
304.529	118.93
304.976	169.91
305.423	133.5
305.87	104.37
306.317	157.77
306.764	135.92
307.211	126.22
307.658	184.47
308.105	104.37
308.552	106.8
308.998	160.2
309.445	165.05
309.892	135.92
310.338	199.03
310.785	155.34
311.231	177.19
311.678	126.22
312.124	184.47
312.571	116.51
313.017	165.05
313.463	186.9
313.909	152.92
314.356	186.9
314.802	75.24
315.248	201.46
315.694	167.48
316.14	114.08
316.586	109.22
317.032	150.49
317.478	174.76
317.923	138.35
318.369	225.73
318.815	126.22
319.261	143.21
319.706	145.63
320.152	145.63
320.597	140.78
321.043	167.48
321.488	218.45
321.934	189.32
322.379	186.9
322.824	160.2
323.27	203.89
323.715	135.92
324.16	131.07
324.605	148.06
325.05	174.76
325.495	80.1
325.94	216.02
326.385	157.77
326.83	111.65
327.275	157.77
327.72	143.21
328.165	92.23
328.61	186.9
329.054	208.74
329.499	211.17
329.943	80.1
330.388	53.4
330.832	145.63
331.277	116.51
331.721	143.21
332.166	169.91
332.61	92.23
333.054	148.06
333.499	152.92
333.943	155.34
334.387	126.22
334.831	106.8
335.275	131.07
335.719	167.48
336.163	133.5
336.607	152.92
337.051	186.9
337.495	114.08
337.938	150.49
338.382	165.05
338.826	196.6
339.269	172.33
339.713	172.33
340.157	174.76
340.6	106.8
341.044	189.32
341.487	213.6
341.93	157.77
342.374	143.21
342.817	150.49
343.26	101.94
343.703	114.08
344.146	128.64
344.59	111.65
345.033	138.35
345.476	157.77
345.919	208.74
346.361	104.37
346.804	94.66
347.247	160.2
347.69	148.06
348.133	186.9
348.575	114.08
349.018	118.93
349.461	218.45
349.903	150.49
350.346	87.38
350.788	172.33
351.23	143.21
351.673	157.77
352.115	157.77
352.557	111.65
353	172.33
353.442	111.65
353.884	165.05
354.326	184.47
354.768	165.05
355.21	118.93
355.652	191.75
356.094	123.79
356.536	121.36
356.978	206.31
357.419	165.05
357.861	157.77
358.303	165.05
358.744	165.05
359.186	167.48
359.627	216.02
360.069	140.78
360.51	106.8
360.952	135.92
361.393	174.76
361.834	177.19
362.276	196.6
362.717	172.33
363.158	72.82
363.599	208.74
364.04	121.36
364.481	172.33
364.922	169.91
365.363	111.65
365.804	155.34
366.245	109.22
366.686	135.92
367.126	155.34
367.567	87.38
368.008	169.91
368.448	145.63
368.889	126.22
369.33	109.22
369.77	133.5
370.21	133.5
370.651	167.48
371.091	121.36
371.531	182.04
371.972	179.61
372.412	155.34
372.852	104.37
373.292	101.94
373.732	143.21
374.172	152.92
374.612	157.77
375.052	167.48
375.492	126.22
375.932	182.04
376.372	155.34
376.811	118.93
377.251	121.36
377.691	143.21
378.13	116.51
378.57	160.2
379.009	201.46
379.449	116.51
379.888	160.2
380.328	131.07
380.767	165.05
381.206	123.79
381.645	116.51
382.085	133.5
382.524	84.95
382.963	114.08
383.402	172.33
383.841	143.21
384.28	152.92
384.719	143.21
385.158	228.16
385.596	106.8
386.035	126.22
386.474	126.22
386.913	191.75
387.351	167.48
387.79	99.52
388.228	157.77
388.667	118.93
389.105	196.6
389.544	201.46
389.982	162.62
390.42	157.77
390.859	152.92
391.297	84.95
391.735	165.05
392.173	121.36
392.611	194.18
393.049	194.18
393.487	150.49
393.925	167.48
394.363	155.34
394.801	162.62
395.239	140.78
395.676	97.09
396.114	191.75
396.552	152.92
396.989	172.33
397.427	177.19
397.864	114.08
398.302	162.62
398.739	111.65
399.177	160.2
399.614	104.37
400.051	235.44
400.488	196.6
400.926	111.65
401.363	162.62
401.8	94.66
402.237	145.63
402.674	114.08
403.111	123.79
403.548	99.52
403.985	162.62
404.421	186.9
404.858	186.9
405.295	123.79
405.732	140.78
406.168	123.79
406.605	203.89
407.041	148.06
407.478	152.92
407.914	114.08
408.351	179.61
408.787	140.78
409.223	152.92
409.66	99.52
410.096	111.65
410.532	160.2
410.968	148.06
411.404	203.89
411.84	152.92
412.276	228.16
412.712	179.61
413.148	201.46
413.584	174.76
414.02	99.52
414.455	167.48
414.891	118.93
415.327	152.92
415.762	194.18
416.198	126.22
416.633	114.08
417.069	97.09
417.504	155.34
417.94	106.8
418.375	186.9
418.81	162.62
419.245	213.6
419.681	121.36
420.116	143.21
420.551	128.64
420.986	208.74
421.421	87.38
421.856	167.48
422.291	165.05
422.726	160.2
423.16	155.34
423.595	199.03
424.03	101.94
424.464	118.93
424.899	145.63
425.334	150.49
425.768	133.5
426.203	109.22
426.637	177.19
427.071	135.92
427.506	152.92
427.94	126.22
428.374	143.21
428.809	143.21
429.243	189.32
429.677	213.6
430.111	179.61
430.545	143.21
430.979	160.2
431.413	118.93
431.847	167.48
432.28	121.36
432.714	99.52
433.148	157.77
433.582	143.21
434.015	191.75
434.449	196.6
434.882	101.94
435.316	111.65
435.749	174.76
436.183	145.63
436.616	140.78
437.049	138.35
437.483	145.63
437.916	75.24
438.349	177.19
438.782	225.73
439.215	155.34
439.648	201.46
440.081	184.47
440.514	116.51
440.947	206.31
441.38	167.48
441.813	109.22
442.245	216.02
442.678	211.17
443.111	167.48
443.543	150.49
443.976	128.64
444.408	133.5
444.841	182.04
445.273	138.35
445.705	225.73
446.138	162.62
446.57	116.51
447.002	152.92
447.434	150.49
447.867	114.08
448.299	271.85
448.731	152.92
449.163	201.46
449.595	184.47
450.026	48.54
450.458	135.92
450.89	148.06
451.322	80.1
451.754	189.32
452.185	116.51
452.617	104.37
453.048	218.45
453.48	230.59
453.911	182.04
454.343	157.77
454.774	165.05
455.205	160.2
455.637	230.59
456.068	89.81
456.499	126.22
456.93	160.2
457.361	143.21
457.792	206.31
458.223	145.63
458.654	206.31
459.085	203.89
459.516	257.29
459.947	172.33
460.378	199.03
460.808	196.6
461.239	84.95
461.669	157.77
462.1	177.19
462.531	194.18
462.961	174.76
463.391	206.31
463.822	167.48
464.252	213.6
464.682	199.03
465.113	133.5
465.543	155.34
465.973	191.75
466.403	128.64
466.833	133.5
467.263	177.19
467.693	135.92
468.123	216.02
468.553	106.8
468.983	233.01
469.412	135.92
469.842	152.92
470.272	194.18
470.701	182.04
471.131	191.75
471.56	140.78
471.99	162.62
472.419	167.48
472.849	157.77
473.278	67.96
473.707	155.34
474.136	172.33
474.566	172.33
474.995	165.05
475.424	111.65
475.853	126.22
476.282	199.03
476.711	177.19
477.14	194.18
477.569	87.38
477.997	225.73
478.426	101.94
478.855	150.49
479.283	140.78
479.712	169.91
480.141	179.61
480.569	194.18
480.998	123.79
481.426	196.6
481.854	162.62
482.283	155.34
482.711	182.04
483.139	257.29
483.567	82.53
483.995	140.78
484.424	213.6
484.852	121.36
485.28	230.59
485.708	259.71
486.135	199.03
486.563	191.75
486.991	179.61
487.419	208.74
487.847	155.34
488.274	109.22
488.702	172.33
489.129	138.35
489.557	233.01
489.984	245.15
490.412	155.34
490.839	165.05
491.266	111.65
491.694	174.76
492.121	208.74
492.548	135.92
492.975	172.33
493.402	194.18
493.829	152.92
494.256	104.37
494.683	162.62
495.11	165.05
495.537	213.6
495.964	155.34
496.39	162.62
496.817	165.05
497.244	220.88
497.67	177.19
498.097	254.86
498.523	172.33
498.95	216.02
499.376	157.77
499.803	133.5
500.229	140.78
500.655	135.92
501.081	94.66
501.508	128.64
501.934	201.46
502.36	118.93
502.786	138.35
503.212	196.6
503.638	177.19
504.064	140.78
504.489	203.89
504.915	237.87
505.341	123.79
505.767	208.74
506.192	196.6
506.618	135.92
507.043	138.35
507.469	179.61
507.894	174.76
508.32	114.08
508.745	92.23
509.17	177.19
509.596	199.03
510.021	92.23
510.446	145.63
510.871	184.47
511.296	150.49
511.721	177.19
512.146	70.39
512.571	160.2
512.996	128.64
513.421	152.92
513.845	94.66
514.27	152.92
514.695	186.9
515.119	194.18
515.544	116.51
515.969	160.2
516.393	186.9
516.817	121.36
517.242	145.63
517.666	111.65
518.09	157.77
518.515	199.03
518.939	216.02
519.363	432.05
519.787	191.75
520.211	140.78
520.635	162.62
521.059	145.63
521.483	145.63
521.907	135.92
522.331	196.6
522.754	126.22
523.178	148.06
523.602	216.02
524.025	191.75
524.449	194.18
524.872	133.5
525.296	182.04
525.719	191.75
526.143	233.01
526.566	140.78
526.989	194.18
527.412	145.63
527.836	89.81
528.259	235.44
528.682	131.07
529.105	213.6
529.528	145.63
529.951	165.05
530.374	152.92
530.796	245.15
531.219	189.32
531.642	167.48
532.065	72.82
532.487	169.91
532.91	143.21
533.332	165.05
533.755	194.18
534.177	55.83
534.6	167.48
535.022	133.5
535.444	191.75
535.867	128.64
536.289	121.36
536.711	84.95
537.133	172.33
537.555	109.22
537.977	143.21
538.399	174.76
538.821	157.77
539.243	172.33
539.665	228.16
540.086	131.07
540.508	228.16
540.93	218.45
541.351	228.16
541.773	208.74
542.195	191.75
542.616	245.15
543.037	252.43
543.459	240.3
543.88	235.44
544.301	250
544.723	220.88
545.144	271.85
545.565	286.41
545.986	310.68
546.407	247.58
546.828	211.17
547.249	230.59
547.67	135.92
548.091	199.03
548.512	182.04
548.932	152.92
549.353	257.29
549.774	233.01
550.194	184.47
550.615	254.86
551.035	155.34
551.456	162.62
551.876	128.64
552.296	150.49
552.717	160.2
553.137	179.61
553.557	135.92
553.977	128.64
554.397	97.09
554.817	160.2
555.237	114.08
555.657	169.91
556.077	131.07
556.497	182.04
556.917	220.88
557.337	165.05
557.756	174.76
558.176	82.53
558.596	53.4
559.015	138.35
559.435	203.89
559.854	155.34
560.274	179.61
560.693	208.74
561.112	196.6
561.532	157.77
561.951	189.32
562.37	152.92
562.789	140.78
563.208	191.75
563.627	203.89
564.046	121.36
564.465	106.8
564.884	165.05
565.303	133.5
565.722	99.52
566.14	152.92
566.559	152.92
566.978	155.34
567.396	189.32
567.815	167.48
568.233	140.78
568.652	189.32
569.07	179.61
569.489	182.04
569.907	191.75
570.325	99.52
570.743	174.76
571.161	172.33
571.58	118.93
571.998	145.63
572.416	92.23
572.833	121.36
573.251	131.07
573.669	206.31
574.087	182.04
574.505	121.36
574.922	155.34
575.34	138.35
575.758	165.05
576.175	184.47
576.593	189.32
577.01	155.34
577.428	179.61
577.845	1417.5
578.262	233.01
578.68	99.52
579.097	167.48
579.514	155.34
579.931	165.05
580.348	162.62
580.765	182.04
581.182	143.21
581.599	189.32
582.016	182.04
582.433	126.22
582.849	191.75
583.266	177.19
583.683	148.06
584.099	206.31
584.516	167.48
584.933	182.04
585.349	199.03
585.765	138.35
586.182	155.34
586.598	121.36
587.014	148.06
587.431	162.62
587.847	155.34
588.263	140.78
588.679	184.47
589.095	157.77
589.511	201.46
589.927	150.49
590.343	228.16
590.759	148.06
591.174	121.36
591.59	157.77
592.006	160.2
592.421	152.92
592.837	203.89
593.252	148.06
593.668	148.06
594.083	121.36
594.499	220.88
594.914	131.07
595.329	167.48
595.745	196.6
596.16	186.9
596.575	167.48
596.99	97.09
597.405	155.34
597.82	135.92
598.235	138.35
598.65	223.3
599.065	101.94
599.479	213.6
599.894	89.81
600.309	160.2
600.724	211.17
601.138	252.43
601.553	199.03
601.967	140.78
602.382	184.47
602.796	194.18
603.21	182.04
603.625	145.63
604.039	169.91
604.453	172.33
604.867	131.07
605.281	184.47
605.695	182.04
606.109	189.32
606.523	220.88
606.937	194.18
607.351	320.39
607.765	179.61
608.178	203.89
608.592	152.92
609.006	194.18
609.419	225.73
609.833	189.32
610.246	182.04
610.66	257.29
611.073	266.99
611.487	274.28
611.9	194.18
612.313	189.32
612.726	233.01
613.139	242.72
613.553	92.23
613.966	235.44
614.379	189.32
614.792	189.32
615.204	140.78
615.617	116.51
616.03	189.32
616.443	223.3
616.856	208.74
617.268	140.78
617.681	148.06
618.093	150.49
618.506	208.74
618.918	228.16
619.331	208.74
619.743	208.74
620.155	118.93
620.568	131.07
620.98	165.05
621.392	150.49
621.804	216.02
622.216	111.65
622.628	186.9
623.04	162.62
623.452	177.19
623.864	218.45
624.276	177.19
624.687	152.92
625.099	157.77
625.511	199.03
625.922	182.04
626.334	165.05
626.745	150.49
627.157	201.46
627.568	196.6
627.979	254.86
628.391	148.06
628.802	109.22
629.213	157.77
629.624	145.63
630.035	80.1
630.446	145.63
630.857	77.67
631.268	213.6
631.679	143.21
632.09	174.76
632.501	143.21
632.912	133.5
633.322	128.64
633.733	128.64
634.144	131.07
634.554	165.05
634.965	186.9
635.375	89.81
635.785	162.62
636.196	189.32
636.606	135.92
637.016	182.04
637.427	174.76
637.837	189.32
638.247	157.77
638.657	191.75
639.067	196.6
639.477	162.62
639.887	186.9
640.297	182.04
640.706	235.44
641.116	145.63
641.526	106.8
641.935	182.04
642.345	106.8
642.755	186.9
643.164	121.36
643.573	230.59
643.983	196.6
644.392	233.01
644.801	84.95
645.211	206.31
645.62	162.62
646.029	152.92
646.438	165.05
646.847	109.22
647.256	186.9
647.665	123.79
648.074	182.04
648.483	152.92
648.892	179.61
649.3	152.92
649.709	235.44
650.118	196.6
650.526	167.48
650.935	135.92
651.343	123.79
651.752	177.19
652.16	160.2
652.568	138.35
652.977	177.19
653.385	177.19
653.793	138.35
654.201	186.9
654.609	128.64
655.017	118.93
655.425	177.19
655.833	97.09
656.241	172.33
656.649	150.49
657.057	123.79
657.464	169.91
657.872	135.92
658.28	179.61
658.687	191.75
659.095	135.92
659.502	140.78
659.91	162.62
660.317	191.75
660.724	94.66
661.132	157.77
661.539	104.37
661.946	152.92
662.353	169.91
662.76	169.91
663.167	145.63
663.574	114.08
663.981	177.19
664.388	208.74
664.795	121.36
665.202	104.37
665.608	177.19
666.015	150.49
666.422	220.88
666.828	87.38
667.235	182.04
667.641	131.07
668.047	138.35
668.454	150.49
668.86	104.37
669.266	191.75
669.673	177.19
670.079	288.84
670.485	114.08
670.891	126.22
671.297	148.06
671.703	133.5
672.109	131.07
672.515	216.02
672.92	135.92
673.326	172.33
673.732	169.91
674.138	194.18
674.543	199.03
674.949	191.75
675.354	145.63
675.76	157.77
676.165	184.47
676.57	123.79
676.976	101.94
677.381	150.49
677.786	220.88
678.191	138.35
678.596	99.52
679.001	208.74
679.406	97.09
679.811	157.77
680.216	252.43
680.621	189.32
681.026	165.05
681.43	140.78
681.835	148.06
682.24	101.94
682.644	109.22
683.049	189.32
683.453	133.5
683.858	138.35
684.262	118.93
684.667	145.63
685.071	174.76
685.475	165.05
685.879	206.31
686.283	194.18
686.687	211.17
687.091	131.07
687.495	133.5
687.899	216.02
688.303	179.61
688.707	99.52
689.111	196.6
689.514	155.34
689.918	191.75
690.322	177.19
690.725	220.88
691.129	174.76
691.532	128.64
691.936	150.49
692.339	172.33
692.742	182.04
693.146	123.79
693.549	116.51
693.952	186.9
694.355	165.05
694.758	172.33
695.161	101.94
695.564	121.36
695.967	84.95
696.37	223.3
696.773	109.22
697.175	266.99
697.578	189.32
697.981	194.18
698.383	211.17
698.786	199.03
699.188	140.78
699.591	191.75
699.993	182.04
700.395	152.92
700.798	145.63
701.2	121.36
701.602	206.31
702.004	216.02
702.406	254.86
702.808	245.15
703.21	99.52
703.612	174.76
704.014	235.44
704.416	114.08
704.818	216.02
705.219	186.9
705.621	189.32
706.023	196.6
706.424	286.41
706.826	223.3
707.227	271.85
707.629	143.21
708.03	196.6
708.431	274.28
708.832	174.76
709.234	242.72
709.635	242.72
710.036	228.16
710.437	169.91
710.838	218.45
711.239	218.45
711.64	228.16
712.041	254.86
712.441	208.74
712.842	233.01
713.243	211.17
713.643	250
714.044	252.43
714.445	293.69
714.845	271.85
715.246	279.13
715.646	233.01
716.046	240.3
716.447	291.27
716.847	300.98
717.247	196.6
717.647	254.86
718.047	286.41
718.447	327.68
718.847	349.52
719.247	276.7
719.647	327.68
720.047	400.49
720.446	308.26
720.846	313.11
721.246	378.65
721.645	325.25
722.045	327.68
722.444	334.96
722.844	434.47
723.243	424.76
723.643	356.8
724.042	439.33
724.441	313.11
724.84	400.49
725.24	424.76
725.639	419.91
726.038	434.47
726.437	463.6
726.836	456.32
727.234	509.72
727.633	529.13
728.032	509.72
728.431	662.63
728.83	662.63
729.228	718.46
729.627	696.61
730.025	754.87
730.424	793.7
730.822	820.4
731.22	919.92
731.619	1084.97
732.017	1099.53
732.415	1104.39
732.813	1194.19
733.212	1303.42
733.61	1356.82
734.008	1587.4
734.406	1601.97
734.803	1803.43
735.201	1745.17
735.599	1995.18
735.997	2092.27
736.395	2126.25
736.792	2339.84
737.19	2466.06
737.587	2497.61
737.985	2628.68
738.382	2820.43
738.78	2934.51
739.177	3133.54
739.574	3315.59
739.971	3354.42
740.369	3502.48
740.766	3801.03
741.163	4145.7
741.56	4177.25
741.957	4478.22
742.354	4478.22
742.751	4754.93
743.147	4956.39
743.544	5165.13
743.941	5667.56
744.338	6133.59
744.734	6315.63
745.131	6495.25
745.527	6910.3
745.924	7201.57
746.32	7657.89
746.716	7922.45
747.113	8432.17
747.509	8754.99
747.905	8995.29
748.301	9480.73
748.697	9696.75
749.093	10449.19
749.489	10252.59
749.885	10553.56
750.281	11407.94
750.677	11587.56
751.073	11854.55
751.468	12165.24
751.864	12764.76
752.26	12638.55
752.655	13383.7
753.051	13235.64
753.446	13932.26
753.842	14000.22
754.237	14308.48
754.632	14983.24
755.028	15475.97
755.423	15604.61
755.818	16034.23
756.213	16706.57
756.608	17352.21
757.003	17849.79
757.398	18274.56
757.793	18966.31
758.188	19116.8
758.583	20602.26
758.977	20624.11
759.372	21728.49
759.767	22682.39
760.161	24036.78
760.556	24825.63
760.95	26126.62
761.345	26658.18
761.739	28187.33
762.133	28065.97
762.527	28903.36
762.922	28748.02
763.316	29451.91
763.71	29532.01
764.104	29653.37
764.498	29789.3
764.892	30595.14
765.286	30517.47
765.68	31005.34
766.073	31883.99
766.467	31990.79
766.861	33337.9
767.255	35342.78
767.648	37138.93
768.042	37969.04
768.435	39604.99
768.829	40561.31
769.222	42088.03
769.615	42906.01
770.008	42930.28
770.402	43253.1
770.795	43347.76
771.188	43629.32
771.581	41811.33
771.974	40777.33
772.367	39998.19
772.76	39180.22
773.153	36857.37
773.545	36374.35
773.938	36478.72
774.331	36876.79
774.724	37993.31
775.116	40488.49
775.509	42842.9
775.901	45216.72
776.294	47677.93
776.686	49806.6
777.078	51364.88
777.471	52491.11
777.863	53275.1
778.255	53136.75
778.647	52663.44
779.039	51042.06
779.431	48891.54
779.823	47512.88
780.215	47466.76
780.607	47641.52
780.999	48976.49
781.39	49709.51
781.782	51464.39
782.174	53105.19
782.565	55330.96
782.957	56585.83
783.348	58207.22
783.74	58726.64
784.131	57182.93
784.522	56090.68
784.914	53770.25
785.305	52173.14
785.696	50126.99
786.087	49046.88
786.478	47384.23
786.869	46580.82
787.26	47330.83
787.651	48733.77
788.042	50607.58
788.433	51520.22
788.823	51770.22
789.214	51073.61
789.605	48891.54
789.995	47160.93
790.386	43401.16
790.776	41071.03
791.167	37852.53
791.557	37590.39
791.948	37374.37
792.338	38731.18
792.728	42022.5
793.118	44190.01
793.508	46556.55
793.898	49590.58
794.288	50384.28
794.678	49309.02
795.068	48204.63
795.458	45898.77
795.848	43524.95
796.238	40833.16
796.627	38794.29
797.017	38617.11
797.406	39488.48
797.796	42105.02
798.185	44745.84
798.575	47192.48
798.964	48864.84
799.354	50151.27
799.743	48758.04
800.132	45889.06
800.521	43160.87
800.91	40888.99
801.299	38774.88
801.688	38012.73
802.077	38100.11
802.466	40956.95
802.855	43835.63
803.244	45609.93
803.633	46071.1
804.021	46061.4
804.41	44058.94
804.799	40757.92
805.187	37551.56
805.576	34170.43
805.964	31655.83
806.352	30102.41
806.741	31124.27
807.129	32857.31
807.517	36119.49
807.905	37478.74
808.293	38483.61
808.681	37112.23
809.069	35024.82
809.457	33716.54
809.845	31252.91
810.233	29405.8
810.621	29738.33
811.009	31282.04
811.396	33124.3
811.784	35641.33
812.171	37850.1
812.559	38046.71
812.946	36677.75
813.334	34401.02
813.721	31153.4
814.108	28328.11
814.496	27311.1
814.883	26279.53
815.27	28126.65
815.657	30068.43
816.044	33235.95
816.431	34107.33
816.818	34250.53
817.205	32544.2
817.592	31199.51
817.979	27978.59
818.365	25718.85
818.752	24017.36
819.139	23893.58
819.525	25180
819.912	27243.14
820.298	27784.41
820.685	28396.07
821.071	27194.6
821.457	25345.05
821.843	22240.64
822.23	20073.13
822.616	18398.34
823.002	17857.07
823.388	18427.47
823.774	19352.24
824.16	19468.75
824.546	19910.5
824.931	19471.18
825.317	18121.64
825.703	16422.59
826.089	14747.8
826.474	14711.39
826.86	14684.69
827.245	15167.71
827.631	16827.93
828.016	17502.7
828.401	17315.8
828.787	16495.4
829.172	15240.53
829.557	13745.36
829.942	12359.42
830.327	11728.34
830.712	12114.27
831.097	12502.62
831.482	13505.06
831.867	13679.82
832.252	13308.46
832.636	12514.76
833.021	11400.66
833.406	10619.1
833.79	9849.67
834.175	9689.47
834.559	10369.09
834.944	10886.09
835.328	11371.54
835.713	11204.06
836.097	10655.51
836.481	9900.64
836.865	8504.99
837.249	8121.49
837.633	7720.99
838.017	7699.15
838.401	8046.24
838.785	8128.77
839.169	8191.88
839.553	7754.98
839.937	7254.97
840.32	6538.94
840.704	5803.49
841.087	5487.95
841.471	5320.47
841.854	5602.03
842.238	5667.56
842.621	5694.26
843.004	5487.95
843.388	5177.26
843.771	4793.76
844.154	4415.12
844.537	4332.59
844.92	4446.67
845.303	4628.71
845.686	4927.26
846.069	4963.67
846.452	4767.06
846.834	4402.98
847.217	3980.64
847.6	3638.41
847.982	3585.01
848.365	3628.7
848.748	3837.44
849.13	3876.27
849.512	3730.64
849.895	3822.88
850.277	3451.51
850.659	3148.11
851.041	3002.47
851.423	2927.23
851.806	3101.99
852.188	3114.13
852.57	3167.52
852.951	3172.38
853.333	3077.72
853.715	2902.96
854.097	2548.58
854.479	2390.81
854.86	2405.38
855.242	2458.78
855.623	2432.08
856.005	2478.19
856.386	2259.74
856.768	2092.27
857.149	2058.28
857.53	1757.31
857.911	1825.27
858.292	1762.16
858.674	1793.72
859.055	1851.97
859.436	1648.08
859.817	1473.32
860.197	1555.85
860.578	1330.12
860.959	1305.85
861.34	1373.81
861.72	1315.55
862.101	1354.39
862.482	1206.33
862.862	1150.5
863.243	1152.93
863.623	1092.25
864.003	985.45
864.384	1072.83
864.764	1000.02
865.144	1038.85
865.524	885.94
865.904	934.48
866.284	861.66
866.664	779.14
867.044	781.57
867.424	834.96
867.804	757.29
868.183	735.45
868.563	725.74
868.943	774.28
869.322	720.88
869.702	694.19
870.081	628.65
870.461	592.24
870.84	580.11
871.22	577.68
871.599	575.25
871.978	507.29
872.357	490.3
872.736	490.3
873.115	507.29
873.494	453.89
873.873	466.03
874.252	480.59
874.631	395.64
875.01	478.16
875.388	356.8
875.767	342.24
876.146	337.38
876.524	368.94
876.903	305.83
877.281	351.95
877.66	276.7
878.038	283.99
878.416	315.54
878.794	334.96
879.173	271.85
879.551	250
879.929	298.55
880.307	281.56
880.685	211.17
881.063	247.58
881.441	262.14
881.818	288.84
882.196	262.14
882.574	223.3
882.951	201.46
883.329	223.3
883.707	291.27
884.084	203.89
884.461	271.85
884.839	274.28
885.216	179.61
885.593	225.73
885.971	218.45
886.348	199.03
886.725	191.75
887.102	237.87
887.479	225.73
887.856	240.3
888.233	196.6
888.609	196.6
888.986	228.16
889.363	179.61
889.74	233.01
890.116	150.49
890.493	218.45
890.869	174.76
891.246	196.6
891.622	165.05
891.998	201.46
892.375	174.76
892.751	152.92
893.127	174.76
893.503	199.03
893.879	106.8
894.255	208.74
894.631	196.6
895.007	109.22
895.383	121.36
895.759	155.34
896.134	184.47
896.51	177.19
896.886	160.2
897.261	121.36
897.637	177.19
898.012	165.05
898.388	230.59
898.763	121.36
899.138	230.59
899.514	128.64
899.889	126.22
900.264	194.18
900.639	186.9
901.014	167.48
901.389	179.61
901.764	135.92
902.139	213.6
902.513	109.22
902.888	133.5
903.263	99.52
903.638	48.54
904.012	143.21
904.387	126.22
904.761	128.64
905.136	160.2
905.51	148.06
905.884	189.32
906.259	208.74
906.633	191.75
907.007	152.92
907.381	118.93
907.755	94.66
908.129	131.07
908.503	89.81
908.877	150.49
909.251	160.2
909.624	189.32
909.998	106.8
910.372	167.48
910.745	208.74
911.119	97.09
911.492	145.63
911.866	145.63
912.239	135.92
912.612	218.45
912.986	133.5
913.359	152.92
913.732	82.53
914.105	140.78
914.478	169.91
914.851	150.49
915.224	189.32
915.597	199.03
915.97	155.34
916.343	97.09
916.715	138.35
917.088	133.5
917.461	155.34
917.833	114.08
918.206	123.79
918.578	225.73
918.951	196.6
919.323	126.22
919.695	228.16
920.067	199.03
920.44	116.51
920.812	111.65
921.184	174.76
921.556	174.76
921.928	89.81
922.3	140.78
922.672	152.92
923.043	196.6
923.415	179.61
923.787	191.75
924.158	135.92
924.53	121.36
924.901	131.07
925.273	148.06
925.644	135.92
926.016	135.92
926.387	89.81
926.758	106.8
927.129	172.33
927.5	106.8
927.872	104.37
928.243	111.65
928.613	89.81
928.984	77.67
929.355	203.89
929.726	89.81
930.097	143.21
930.467	114.08
930.838	196.6
931.209	135.92
931.579	157.77
931.95	140.78
932.32	148.06
932.69	208.74
933.061	148.06
933.431	104.37
933.801	174.76
934.171	114.08
934.541	148.06
934.911	186.9
935.281	135.92
935.651	92.23
936.021	104.37
936.391	196.6
936.761	77.67
937.13	133.5
937.5	126.22
937.87	184.47
938.239	121.36
938.609	179.61
938.978	157.77
939.347	211.17
939.717	177.19
940.086	116.51
940.455	162.62
940.824	138.35
941.193	177.19
941.562	133.5
941.931	101.94
942.3	220.88
942.669	174.76
943.038	116.51
943.407	140.78
943.775	131.07
944.144	145.63
944.513	133.5
944.881	126.22
945.25	138.35
945.618	155.34
945.986	131.07
946.355	155.34
946.723	150.49
947.091	177.19
947.459	87.38
947.827	182.04
948.195	162.62
948.563	97.09
948.931	116.51
949.299	104.37
949.667	126.22
950.035	167.48
950.402	160.2
950.77	123.79
951.138	92.23
951.505	191.75
951.873	145.63
952.24	138.35
952.607	89.81
952.975	201.46
953.342	211.17
953.709	138.35
954.076	48.54
954.443	131.07
954.81	223.3
955.177	143.21
955.544	152.92
955.911	118.93
956.278	126.22
956.645	114.08
957.012	189.32
957.378	165.05
957.745	111.65
958.111	174.76
958.478	172.33
958.844	172.33
959.211	194.18
959.577	101.94
959.943	128.64
960.309	58.25
960.675	167.48
961.042	106.8
961.408	77.67
961.774	148.06
962.139	131.07
962.505	148.06
962.871	77.67
963.237	138.35
963.603	150.49
963.968	157.77
964.334	104.37
964.699	145.63
965.065	118.93
965.43	160.2
965.796	99.52
966.161	123.79
966.526	89.81
966.891	157.77
967.256	172.33
967.622	177.19
967.987	133.5
968.352	133.5
968.716	128.64
969.081	196.6
969.446	167.48
969.811	152.92
970.176	194.18
970.54	133.5
970.905	201.46
971.269	162.62
971.634	162.62
971.998	123.79
972.363	138.35
972.727	138.35
973.091	206.31
973.455	186.9
973.819	172.33
974.183	80.1
974.547	155.34
974.911	131.07
975.275	118.93
975.639	41.26
976.003	109.22
976.367	135.92
976.73	87.38
977.094	123.79
977.458	186.9
977.821	55.83
978.185	106.8
978.548	194.18
978.911	201.46
979.275	196.6
979.638	138.35
980.001	225.73
980.364	152.92
980.727	184.47
981.09	140.78
981.453	84.95
981.816	186.9
982.179	213.6
982.542	165.05
982.905	208.74
983.267	116.51
983.63	131.07
983.992	135.92
984.355	106.8
984.717	101.94
985.08	140.78
985.442	169.91
985.804	104.37
986.167	186.9
986.529	94.66
986.891	201.46
987.253	237.87
987.615	155.34
987.977	126.22
988.339	111.65
988.701	116.51
989.062	143.21
989.424	179.61
989.786	148.06
990.147	131.07
990.509	104.37
990.87	201.46
991.232	203.89
991.593	143.21
991.955	172.33
992.316	208.74
992.677	165.05
993.038	194.18
993.399	94.66
993.76	55.83
994.121	116.51
994.482	114.08
994.843	145.63
995.204	165.05
995.565	191.75
995.926	167.48
996.286	131.07
996.647	148.06
997.007	97.09
997.368	89.81
997.728	24.27
998.089	77.67
998.449	140.78
998.809	184.47
999.169	143.21
999.53	152.92
999.89	94.66
1000.25	99.52
1000.61	126.22
1000.97	167.48
1001.329	87.38
1001.689	128.64
1002.049	148.06
1002.409	80.1
1002.768	167.48
1003.128	82.53
1003.487	106.8
1003.847	138.35
1004.206	101.94
1004.566	126.22
1004.925	135.92
1005.284	179.61
1005.643	186.9
1006.003	131.07
1006.362	169.91
1006.721	133.5
1007.08	123.79
1007.438	126.22
1007.797	145.63
1008.156	140.78
1008.515	160.2
1008.874	128.64
1009.232	87.38
1009.591	182.04
1009.949	196.6
1010.308	157.77
1010.666	162.62
1011.024	145.63
1011.383	172.33
1011.741	92.23
1012.099	87.38
1012.457	94.66
1012.815	111.65
1013.173	123.79
1013.531	194.18
1013.889	106.8
1014.247	172.33
1014.605	94.66
1014.962	169.91
1015.32	114.08
1015.678	111.65
1016.035	126.22
1016.393	131.07
1016.75	143.21
1017.107	148.06
1017.465	167.48
1017.822	189.32
1018.179	87.38
1018.536	143.21
1018.894	111.65
1019.251	145.63
1019.608	172.33
1019.964	148.06
1020.321	150.49
1020.678	118.93
1021.035	114.08
1021.392	174.76
1021.748	121.36
1022.105	55.83
1022.461	29.13
1022.818	104.37
1023.174	114.08
1023.531	184.47
1023.887	111.65
1024.243	145.63
1024.599	150.49
1024.955	131.07
1025.311	101.94
1025.667	179.61
1026.023	157.77
1026.379	155.34
1026.735	145.63
1027.091	157.77
1027.447	237.87
