189.514	92.99
189.973	92.99
190.431	92.99
190.889	61.44
191.348	-33.22
191.806	3.19
192.264	32.31
192.722	27.46
193.18	-55.07
193.638	-76.91
194.096	-69.63
194.554	12.89
195.012	10.47
195.47	-62.35
195.928	0.76
196.385	15.32
196.843	0.76
197.301	-6.52
197.758	-13.8
198.216	100.27
198.674	37.17
199.131	46.88
199.589	56.58
200.046	29.89
200.503	92.99
200.961	25.03
201.418	90.57
201.875	134.26
202.332	129.4
202.79	73.58
203.247	90.57
203.704	158.53
204.161	136.68
204.618	180.37
205.075	129.4
205.532	73.58
205.989	165.81
206.445	97.85
206.902	197.36
207.359	170.66
207.816	177.95
208.272	134.26
208.729	124.55
209.185	170.66
209.642	170.66
210.098	177.95
210.555	207.07
211.011	165.81
211.467	88.14
211.924	139.11
212.38	177.95
212.836	199.79
213.292	180.37
213.748	119.69
214.204	192.51
214.66	173.09
215.116	197.36
215.572	177.95
216.028	170.66
216.484	187.65
216.94	126.97
217.396	209.5
217.851	146.39
218.307	143.96
218.763	141.54
219.218	190.08
219.674	214.35
220.129	190.08
220.585	85.71
221.04	112.41
221.496	117.27
221.951	107.56
222.406	190.08
222.861	192.51
223.317	175.52
223.772	122.12
224.227	136.68
224.682	100.27
225.137	141.54
225.592	119.69
226.047	95.42
226.502	134.26
226.957	109.98
227.411	76
227.866	136.68
228.321	151.25
228.776	129.4
229.23	129.4
229.685	146.39
230.139	175.52
230.594	129.4
231.048	139.11
231.503	102.7
231.957	78.43
232.411	102.7
232.865	170.66
233.32	160.96
233.774	207.07
234.228	141.54
234.682	126.97
235.136	197.36
235.59	163.38
236.044	211.93
236.498	170.66
236.952	119.69
237.406	199.79
237.86	156.1
238.313	156.1
238.767	143.96
239.221	117.27
239.674	112.41
240.128	199.79
240.581	216.78
241.035	170.66
241.488	180.37
241.942	112.41
242.395	173.09
242.848	97.85
243.301	80.86
243.755	175.52
244.208	141.54
244.661	180.37
245.114	66.29
245.567	216.78
246.02	153.67
246.473	107.56
246.926	102.7
247.379	136.68
247.832	168.24
248.284	177.95
248.737	143.96
249.19	177.95
249.642	131.83
250.095	173.09
250.547	158.53
251	158.53
251.452	124.55
251.905	129.4
252.357	185.23
252.81	119.69
253.262	192.51
253.714	197.36
254.166	146.39
254.618	54.16
255.07	170.66
255.523	117.27
255.975	209.5
256.427	187.65
256.878	124.55
257.33	141.54
257.782	219.21
258.234	165.81
258.686	170.66
259.137	177.95
259.589	168.24
260.041	124.55
260.492	129.4
260.944	180.37
261.395	182.8
261.847	190.08
262.298	194.94
262.749	153.67
263.201	190.08
263.652	160.96
264.103	146.39
264.554	182.8
265.005	148.82
265.457	51.73
265.908	117.27
266.359	143.96
266.809	131.83
267.26	131.83
267.711	148.82
268.162	204.65
268.613	194.94
269.064	194.94
269.514	207.07
269.965	163.38
270.415	187.65
270.866	224.06
271.316	139.11
271.767	199.79
272.217	194.94
272.668	153.67
273.118	134.26
273.568	194.94
274.019	153.67
274.469	146.39
274.919	124.55
275.369	80.86
275.819	165.81
276.269	151.25
276.719	192.51
277.169	105.13
277.619	136.68
278.069	146.39
278.518	126.97
278.968	124.55
279.418	151.25
279.867	153.67
280.317	148.82
280.767	143.96
281.216	148.82
281.666	102.7
282.115	182.8
282.564	153.67
283.014	102.7
283.463	177.95
283.912	177.95
284.361	122.12
284.811	209.5
285.26	126.97
285.709	160.96
286.158	231.34
286.607	170.66
287.056	124.55
287.505	180.37
287.953	146.39
288.402	105.13
288.851	136.68
289.3	173.09
289.748	204.65
290.197	131.83
290.646	241.05
291.094	204.65
291.543	102.7
291.991	143.96
292.439	59.01
292.888	90.57
293.336	163.38
293.784	190.08
294.233	194.94
294.681	194.94
295.129	170.66
295.577	95.42
296.025	139.11
296.473	151.25
296.921	66.29
297.369	151.25
297.817	126.97
298.264	92.99
298.712	141.54
299.16	192.51
299.608	151.25
300.055	114.84
300.503	129.4
300.95	141.54
301.398	151.25
301.845	105.13
302.293	124.55
302.74	117.27
303.187	170.66
303.635	97.85
304.082	107.56
304.529	194.94
304.976	197.36
305.423	199.79
305.87	211.93
306.317	175.52
306.764	146.39
307.211	129.4
307.658	168.24
308.105	187.65
308.552	151.25
308.998	143.96
309.445	129.4
309.892	204.65
310.338	129.4
310.785	119.69
311.231	190.08
311.678	143.96
312.124	173.09
312.571	124.55
313.017	92.99
313.463	148.82
313.909	168.24
314.356	146.39
314.802	207.07
315.248	190.08
315.694	238.63
316.14	151.25
316.586	105.13
317.032	39.59
317.478	134.26
317.923	109.98
318.369	114.84
318.815	85.71
319.261	71.15
319.706	112.41
320.152	177.95
320.597	131.83
321.043	131.83
321.488	199.79
321.934	107.56
322.379	126.97
322.824	190.08
323.27	175.52
323.715	131.83
324.16	180.37
324.605	170.66
325.05	112.41
325.495	187.65
325.94	194.94
326.385	148.82
326.83	136.68
327.275	168.24
327.72	158.53
328.165	202.22
328.61	153.67
329.054	129.4
329.499	119.69
329.943	202.22
330.388	119.69
330.832	126.97
331.277	160.96
331.721	124.55
332.166	119.69
332.61	95.42
333.054	153.67
333.499	209.5
333.943	134.26
334.387	129.4
334.831	163.38
335.275	146.39
335.719	107.56
336.163	192.51
336.607	241.05
337.051	163.38
337.495	156.1
337.938	117.27
338.382	185.23
338.826	124.55
339.269	219.21
339.713	143.96
340.157	105.13
340.6	61.44
341.044	148.82
341.487	180.37
341.93	207.07
342.374	143.96
342.817	156.1
343.26	163.38
343.703	129.4
344.146	151.25
344.59	141.54
345.033	156.1
345.476	122.12
345.919	180.37
346.361	102.7
346.804	185.23
347.247	112.41
347.69	185.23
348.133	114.84
348.575	143.96
349.018	151.25
349.461	199.79
349.903	175.52
350.346	163.38
350.788	124.55
351.23	131.83
351.673	114.84
352.115	180.37
352.557	170.66
353	168.24
353.442	153.67
353.884	139.11
354.326	124.55
354.768	114.84
355.21	192.51
355.652	175.52
356.094	226.49
356.536	255.62
356.978	153.67
357.419	34.74
357.861	163.38
358.303	117.27
358.744	122.12
359.186	216.78
359.627	192.51
360.069	170.66
360.51	175.52
360.952	194.94
361.393	119.69
361.834	163.38
362.276	165.81
362.717	136.68
363.158	158.53
363.599	207.07
364.04	163.38
364.481	165.81
364.922	153.67
365.363	177.95
365.804	192.51
366.245	136.68
366.686	156.1
367.126	158.53
367.567	170.66
368.008	185.23
368.448	139.11
368.889	214.35
369.33	136.68
369.77	114.84
370.21	153.67
370.651	100.27
371.091	88.14
371.531	151.25
371.972	224.06
372.412	136.68
372.852	156.1
373.292	156.1
373.732	163.38
374.172	88.14
374.612	136.68
375.052	170.66
375.492	160.96
375.932	177.95
376.372	160.96
376.811	131.83
377.251	214.35
377.691	148.82
378.13	66.29
378.57	163.38
379.009	122.12
379.449	163.38
379.888	134.26
380.328	168.24
380.767	156.1
381.206	202.22
381.645	177.95
382.085	199.79
382.524	190.08
382.963	163.38
383.402	194.94
383.841	122.12
384.28	92.99
384.719	199.79
385.158	156.1
385.596	197.36
386.035	168.24
386.474	143.96
386.913	66.29
387.351	173.09
387.79	129.4
388.228	114.84
388.667	202.22
389.105	168.24
389.544	100.27
389.982	136.68
390.42	97.85
390.859	165.81
391.297	151.25
391.735	148.82
392.173	34.74
392.611	209.5
393.049	168.24
393.487	117.27
393.925	192.51
394.363	114.84
394.801	177.95
395.239	90.57
395.676	134.26
396.114	202.22
396.552	131.83
396.989	139.11
397.427	126.97
397.864	134.26
398.302	92.99
398.739	158.53
399.177	139.11
399.614	139.11
400.051	192.51
400.488	156.1
400.926	209.5
401.363	122.12
401.8	228.92
402.237	199.79
402.674	163.38
403.111	199.79
403.548	122.12
403.985	97.85
404.421	105.13
404.858	122.12
405.295	158.53
405.732	153.67
406.168	124.55
406.605	197.36
407.041	153.67
407.478	131.83
407.914	182.8
408.351	151.25
408.787	151.25
409.223	202.22
409.66	156.1
410.096	253.19
410.532	187.65
410.968	114.84
411.404	141.54
411.84	165.81
412.276	192.51
412.712	117.27
413.148	160.96
413.584	170.66
414.02	109.98
414.455	131.83
414.891	141.54
415.327	153.67
415.762	197.36
416.198	109.98
416.633	151.25
417.069	209.5
417.504	124.55
417.94	122.12
418.375	151.25
418.81	180.37
419.245	114.84
419.681	92.99
420.116	173.09
420.551	139.11
420.986	129.4
421.421	177.95
421.856	182.8
422.291	112.41
422.726	151.25
423.16	109.98
423.595	156.1
424.03	143.96
424.464	177.95
424.899	170.66
425.334	126.97
425.768	136.68
426.203	114.84
426.637	170.66
427.071	117.27
427.506	219.21
427.94	134.26
428.374	168.24
428.809	90.57
429.243	114.84
429.677	134.26
430.111	190.08
430.545	126.97
430.979	146.39
431.413	68.72
431.847	216.78
432.28	168.24
432.714	180.37
433.148	170.66
433.582	88.14
434.015	148.82
434.449	165.81
434.882	177.95
435.316	173.09
435.749	187.65
436.183	177.95
436.616	163.38
437.049	170.66
437.483	177.95
437.916	192.51
438.349	175.52
438.782	163.38
439.215	173.09
439.648	107.56
440.081	182.8
440.514	175.52
440.947	129.4
441.38	182.8
441.813	136.68
442.245	182.8
442.678	117.27
443.111	231.34
443.543	141.54
443.976	194.94
444.408	187.65
444.841	107.56
445.273	143.96
445.705	153.67
446.138	100.27
446.57	119.69
447.002	83.28
447.434	175.52
447.867	163.38
448.299	119.69
448.731	151.25
449.163	182.8
449.595	197.36
450.026	151.25
450.458	136.68
450.89	134.26
451.322	151.25
451.754	226.49
452.185	129.4
452.617	156.1
453.048	194.94
453.48	185.23
453.911	199.79
454.343	202.22
454.774	146.39
455.205	175.52
455.637	204.65
456.068	92.99
456.499	158.53
456.93	117.27
457.361	160.96
457.792	105.13
458.223	56.58
458.654	197.36
459.085	214.35
459.516	177.95
459.947	182.8
460.378	194.94
460.808	185.23
461.239	199.79
461.669	194.94
462.1	173.09
462.531	102.7
462.961	158.53
463.391	112.41
463.822	182.8
464.252	102.7
464.682	187.65
465.113	136.68
465.543	187.65
465.973	131.83
466.403	187.65
466.833	192.51
467.263	194.94
467.693	158.53
468.123	175.52
468.553	158.53
468.983	170.66
469.412	173.09
469.842	207.07
470.272	231.34
470.701	148.82
471.131	190.08
471.56	207.07
471.99	73.58
472.419	114.84
472.849	197.36
473.278	182.8
473.707	258.04
474.136	236.2
474.566	168.24
474.995	151.25
475.424	163.38
475.853	170.66
476.282	187.65
476.711	153.67
477.14	199.79
477.569	112.41
477.997	182.8
478.426	199.79
478.855	146.39
479.283	197.36
479.712	190.08
480.141	165.81
480.569	197.36
480.998	146.39
481.426	168.24
481.854	134.26
482.283	221.64
482.711	207.07
483.139	163.38
483.567	177.95
483.995	165.81
484.424	160.96
484.852	219.21
485.28	119.69
485.708	224.06
486.135	233.77
486.563	219.21
486.991	143.96
487.419	185.23
487.847	153.67
488.274	175.52
488.702	153.67
489.129	160.96
489.557	168.24
489.984	141.54
490.412	126.97
490.839	165.81
491.266	199.79
491.694	219.21
492.121	177.95
492.548	141.54
492.975	160.96
493.402	153.67
493.829	124.55
494.256	122.12
494.683	83.28
495.11	73.58
495.537	131.83
495.964	146.39
496.39	182.8
496.817	107.56
497.244	158.53
497.67	136.68
498.097	112.41
498.523	197.36
498.95	90.57
499.376	173.09
499.803	197.36
500.229	90.57
500.655	180.37
501.081	139.11
501.508	160.96
501.934	146.39
502.36	170.66
502.786	207.07
503.212	170.66
503.638	141.54
504.064	219.21
504.489	192.51
504.915	122.12
505.341	131.83
505.767	216.78
506.192	185.23
506.618	199.79
507.043	156.1
507.469	180.37
507.894	168.24
508.32	165.81
508.745	175.52
509.17	192.51
509.596	153.67
510.021	204.65
510.446	122.12
510.871	197.36
511.296	194.94
511.721	148.82
512.146	182.8
512.571	126.97
512.996	199.79
513.421	114.84
513.845	156.1
514.27	177.95
514.695	76
515.119	114.84
515.544	168.24
515.969	156.1
516.393	100.27
516.817	95.42
517.242	194.94
517.666	129.4
518.09	202.22
518.515	170.66
518.939	197.36
519.363	338.14
519.787	202.22
520.211	228.92
520.635	175.52
521.059	163.38
521.483	156.1
521.907	112.41
522.331	175.52
522.754	216.78
523.178	107.56
523.602	148.82
524.025	83.28
524.449	141.54
524.872	126.97
525.296	117.27
525.719	160.96
526.143	156.1
526.566	90.57
526.989	109.98
527.412	156.1
527.836	168.24
528.259	207.07
528.682	224.06
529.105	160.96
529.528	131.83
529.951	126.97
530.374	158.53
530.796	190.08
531.219	146.39
531.642	160.96
532.065	129.4
532.487	141.54
532.91	131.83
533.332	136.68
533.755	100.27
534.177	216.78
534.6	197.36
535.022	107.56
535.444	146.39
535.867	160.96
536.289	107.56
536.711	158.53
537.133	139.11
537.555	216.78
537.977	190.08
538.399	187.65
538.821	112.41
539.243	119.69
539.665	197.36
540.086	126.97
540.508	107.56
540.93	185.23
541.351	204.65
541.773	192.51
542.195	143.96
542.616	238.63
543.037	156.1
543.459	207.07
543.88	214.35
544.301	168.24
544.723	177.95
545.144	173.09
545.565	146.39
545.986	165.81
546.407	156.1
546.828	143.96
547.249	168.24
547.67	190.08
548.091	185.23
548.512	146.39
548.932	148.82
549.353	214.35
549.774	160.96
550.194	129.4
550.615	168.24
551.035	214.35
551.456	219.21
551.876	119.69
552.296	160.96
552.717	136.68
553.137	151.25
553.557	168.24
553.977	141.54
554.397	136.68
554.817	173.09
555.237	158.53
555.657	129.4
556.077	148.82
556.497	173.09
556.917	197.36
557.337	197.36
557.756	185.23
558.176	139.11
558.596	192.51
559.015	185.23
559.435	165.81
559.854	194.94
560.274	182.8
560.693	219.21
561.112	126.97
561.532	112.41
561.951	160.96
562.37	194.94
562.789	163.38
563.208	182.8
563.627	71.15
564.046	56.58
564.465	100.27
564.884	114.84
565.303	90.57
565.722	173.09
566.14	85.71
566.559	180.37
566.978	71.15
567.396	182.8
567.815	165.81
568.233	117.27
568.652	163.38
569.07	143.96
569.489	226.49
569.907	156.1
570.325	177.95
570.743	66.29
571.161	160.96
571.58	141.54
571.998	187.65
572.416	165.81
572.833	197.36
573.251	146.39
573.669	175.52
574.087	131.83
574.505	163.38
574.922	80.86
575.34	158.53
575.758	126.97
576.175	105.13
576.593	148.82
577.01	129.4
577.428	136.68
577.845	1782.34
578.262	219.21
578.68	175.52
579.097	143.96
579.514	156.1
579.931	97.85
580.348	204.65
580.765	177.95
581.182	158.53
581.599	233.77
582.016	126.97
582.433	182.8
582.849	148.82
583.266	119.69
583.683	136.68
584.099	148.82
584.516	107.56
584.933	117.27
585.349	190.08
585.765	165.81
586.182	114.84
586.598	158.53
587.014	187.65
587.431	170.66
587.847	170.66
588.263	221.64
588.679	141.54
589.095	219.21
589.511	173.09
589.927	148.82
590.343	148.82
590.759	270.18
591.174	124.55
591.59	187.65
592.006	143.96
592.421	119.69
592.837	158.53
593.252	163.38
593.668	153.67
594.083	151.25
594.499	194.94
594.914	214.35
595.329	221.64
595.745	233.77
596.16	151.25
596.575	105.13
596.99	129.4
597.405	190.08
597.82	141.54
598.235	180.37
598.65	182.8
599.065	134.26
599.479	187.65
599.894	165.81
600.309	143.96
600.724	160.96
601.138	199.79
601.553	199.79
601.967	146.39
602.382	190.08
602.796	143.96
603.21	170.66
603.625	151.25
604.039	168.24
604.453	126.97
604.867	151.25
605.281	158.53
605.695	141.54
606.109	136.68
606.523	177.95
606.937	194.94
607.351	284.74
607.765	163.38
608.178	119.69
608.592	129.4
609.006	134.26
609.419	211.93
609.833	117.27
610.246	224.06
610.66	117.27
611.073	76
611.487	160.96
611.9	163.38
612.313	177.95
612.726	134.26
613.139	253.19
613.553	148.82
613.966	262.9
614.379	168.24
614.792	146.39
615.204	112.41
615.617	136.68
616.03	126.97
616.443	170.66
616.856	168.24
617.268	199.79
617.681	173.09
618.093	119.69
618.506	124.55
618.918	165.81
619.331	97.85
619.743	160.96
620.155	141.54
620.568	148.82
620.98	139.11
621.392	117.27
621.804	199.79
622.216	163.38
622.628	175.52
623.04	177.95
623.452	148.82
623.864	209.5
624.276	214.35
624.687	97.85
625.099	119.69
625.511	170.66
625.922	158.53
626.334	168.24
626.745	148.82
627.157	136.68
627.568	163.38
627.979	153.67
628.391	165.81
628.802	190.08
629.213	182.8
629.624	187.65
630.035	126.97
630.446	238.63
630.857	168.24
631.268	204.65
631.679	107.56
632.09	129.4
632.501	119.69
632.912	134.26
633.322	187.65
633.733	228.92
634.144	136.68
634.554	100.27
634.965	143.96
635.375	175.52
635.785	148.82
636.196	190.08
636.606	153.67
637.016	126.97
637.427	192.51
637.837	190.08
638.247	80.86
638.657	175.52
639.067	134.26
639.477	173.09
639.887	175.52
640.297	129.4
640.706	141.54
641.116	187.65
641.526	146.39
641.935	100.27
642.345	192.51
642.755	112.41
643.164	134.26
643.573	185.23
643.983	95.42
644.392	158.53
644.801	182.8
645.211	207.07
645.62	168.24
646.029	151.25
646.438	151.25
646.847	233.77
647.256	168.24
647.665	185.23
648.074	182.8
648.483	148.82
648.892	90.57
649.3	117.27
649.709	109.98
650.118	170.66
650.526	180.37
650.935	151.25
651.343	185.23
651.752	143.96
652.16	126.97
652.568	182.8
652.977	175.52
653.385	160.96
653.793	134.26
654.201	170.66
654.609	192.51
655.017	158.53
655.425	209.5
655.833	119.69
656.241	216.78
656.649	241.05
657.057	151.25
657.464	160.96
657.872	163.38
658.28	158.53
658.687	180.37
659.095	177.95
659.502	182.8
659.91	131.83
660.317	114.84
660.724	151.25
661.132	124.55
661.539	190.08
661.946	177.95
662.353	209.5
662.76	136.68
663.167	146.39
663.574	170.66
663.981	148.82
664.388	177.95
664.795	141.54
665.202	165.81
665.608	141.54
666.015	131.83
666.422	143.96
666.828	148.82
667.235	173.09
667.641	71.15
668.047	117.27
668.454	163.38
668.86	126.97
669.266	190.08
669.673	117.27
670.079	153.67
670.485	211.93
670.891	187.65
671.297	204.65
671.703	197.36
672.109	131.83
672.515	131.83
672.92	141.54
673.326	228.92
673.732	241.05
674.138	194.94
674.543	107.56
674.949	236.2
675.354	151.25
675.76	194.94
676.165	219.21
676.57	134.26
676.976	151.25
677.381	182.8
677.786	122.12
678.191	122.12
678.596	197.36
679.001	185.23
679.406	177.95
679.811	175.52
680.216	192.51
680.621	109.98
681.026	163.38
681.43	122.12
681.835	124.55
682.24	119.69
682.644	97.85
683.049	146.39
683.453	151.25
683.858	165.81
684.262	194.94
684.667	153.67
685.071	151.25
685.475	168.24
685.879	151.25
686.283	165.81
686.687	126.97
687.091	170.66
687.495	173.09
687.899	131.83
688.303	126.97
688.707	141.54
689.111	143.96
689.514	180.37
689.918	107.56
690.322	136.68
690.725	163.38
691.129	100.27
691.532	194.94
691.936	124.55
692.339	151.25
692.742	143.96
693.146	156.1
693.549	187.65
693.952	207.07
694.355	177.95
694.758	151.25
695.161	165.81
695.564	168.24
695.967	153.67
696.37	185.23
696.773	170.66
697.175	131.83
697.578	153.67
697.981	156.1
698.383	245.91
698.786	238.63
699.188	194.94
699.591	129.4
699.993	143.96
700.395	233.77
700.798	170.66
701.2	182.8
701.602	209.5
702.004	80.86
702.406	143.96
702.808	219.21
703.21	260.47
703.612	168.24
704.014	216.78
704.416	173.09
704.818	180.37
705.219	255.62
705.621	284.74
706.023	260.47
706.424	160.96
706.826	272.61
707.227	153.67
707.629	207.07
708.03	258.04
708.431	177.95
708.832	224.06
709.234	255.62
709.635	228.92
710.036	243.48
710.437	214.35
710.838	207.07
711.239	216.78
711.64	221.64
712.041	287.17
712.441	265.33
712.842	221.64
713.243	304.16
713.643	372.12
714.044	228.92
714.445	294.45
714.845	241.05
715.246	284.74
715.646	275.03
716.046	248.34
716.447	289.6
716.847	328.43
717.247	352.71
717.647	338.14
718.047	294.45
718.447	258.04
718.847	330.86
719.247	379.41
719.647	335.72
720.047	304.16
720.446	265.33
720.846	296.88
721.246	323.58
721.645	369.7
722.045	352.71
722.444	282.32
722.844	393.97
723.243	333.29
723.643	369.7
724.042	401.25
724.441	408.53
724.84	389.11
725.24	410.96
725.639	408.53
726.038	452.22
726.437	447.37
726.836	512.9
727.234	464.36
727.633	449.79
728.032	529.89
728.431	520.18
728.83	527.47
729.228	595.43
729.627	544.46
730.025	622.13
730.424	624.55
730.822	709.51
731.22	767.76
731.619	748.34
732.017	770.19
732.415	804.17
732.813	908.54
733.212	1088.15
733.61	1114.85
734.008	1197.38
734.406	1131.84
734.803	1134.27
735.201	1318.74
735.599	1546.9
735.997	1474.08
736.395	1481.36
736.792	1374.57
737.19	1629.42
737.587	1923.12
737.985	2078.46
738.382	2156.13
738.78	2105.16
739.177	2032.34
739.574	2163.41
739.971	2510.51
740.369	2823.62
740.766	2891.58
741.163	2588.18
741.56	2464.39
741.957	2670.7
742.354	3153.72
742.751	3435.28
743.147	3685.28
743.544	3313.92
743.941	3015.37
744.338	3299.35
744.734	3974.12
745.131	4588.21
745.527	4593.06
745.924	4350.34
746.32	4071.21
746.716	4296.94
747.113	5275.11
747.509	6078.52
747.905	6107.65
748.301	5680.46
748.697	5185.31
749.093	5483.85
749.489	6435.32
749.885	7532.43
750.281	8107.68
750.677	7503.3
751.073	6750.86
751.468	6794.55
751.864	8260.6
752.26	9459.64
752.655	10185.38
753.051	9418.38
753.446	8513.03
753.842	8367.39
754.237	9906.25
754.632	11656.28
755.028	12416
755.423	11583.46
755.818	10170.82
756.213	9598
756.608	10624.71
757.003	12799.5
757.398	13797.09
757.793	13345.63
758.188	11520.36
758.583	10862.58
758.977	11581.04
759.372	13787.38
759.767	16168.49
760.161	16862.67
760.556	15391.77
760.95	13867.48
761.345	14124.76
761.739	17166.07
762.133	19933.11
762.527	21853.04
762.922	20200.1
763.316	18132.11
763.71	17226.75
764.104	19083.58
764.498	22413.73
764.892	25098.24
765.286	24634.64
765.68	21634.59
766.073	20103.01
766.467	20547.19
766.861	24243.85
767.255	27998.77
767.648	28872.57
768.042	26154.08
768.435	23127.33
768.829	22559.36
769.222	25950.19
769.615	30702.69
770.008	32069.22
770.402	30520.65
770.795	26671.08
771.188	24277.84
771.581	25365.23
771.974	29175.97
772.367	31418.72
772.76	32496.41
773.153	28821.6
773.545	25032.7
773.938	24809.4
774.331	27603.13
774.724	32110.48
775.116	35472.18
775.509	34571.68
775.901	30797.35
776.294	28474.5
776.686	30032.78
777.078	35547.43
777.471	39957.69
777.863	42401.9
778.255	38952.82
778.647	34314.4
779.039	32586.22
779.431	35535.29
779.823	40583.91
780.215	44423.78
780.607	42520.84
780.999	39525.65
781.39	34615.37
781.782	35265.87
782.174	40122.74
782.565	46751.49
782.957	47829.17
783.348	44482.03
783.74	39185.83
784.131	35586.26
784.522	37814.45
784.914	42469.87
785.305	46741.78
785.696	45610.69
786.087	41591.21
786.478	35418.79
786.869	32879.91
787.26	35571.7
787.651	39664
788.042	42375.2
788.433	39778.08
788.823	35015.87
789.214	31472.12
789.605	30001.23
789.995	32010.97
790.386	36392.1
790.776	37571.73
791.167	35450.34
791.557	31476.98
791.948	28780.33
792.338	30115.3
792.728	34668.77
793.118	39093.6
793.508	40877.61
793.898	37770.76
794.288	33348.36
794.678	30328.9
795.068	31214.84
795.458	35513.45
795.848	39503.8
796.238	39826.62
796.627	36321.71
797.017	31928.44
797.406	30229.38
797.796	31078.91
798.185	35928.5
798.575	39083.89
798.964	39214.96
799.354	36139.67
799.743	31773.1
800.132	29821.61
800.521	31809.51
800.91	36132.39
801.299	37841.15
801.688	38846.02
802.077	35108.1
802.466	31159.01
802.855	28530.33
803.244	29202.67
803.633	32746.41
804.021	35401.79
804.41	35285.29
804.799	31110.47
805.187	27018.17
805.576	24955.03
805.964	25828.83
806.352	27311.86
806.741	30125.01
807.129	30476.96
807.517	28057.02
807.905	24938.04
808.293	22777.81
808.681	24069.09
809.069	27365.26
809.457	31027.94
809.845	32023.1
810.233	29348.3
810.621	26076.41
811.009	23229.28
811.396	24047.25
811.784	27423.52
812.171	29804.62
812.559	30591.04
812.946	28307.02
813.334	24639.49
813.721	21797.21
814.108	21700.13
814.496	24377.35
814.883	26226.89
815.27	28729.36
815.657	26666.22
816.044	23547.24
816.431	20896.71
816.818	20355.44
817.205	22195.28
817.592	25217.17
817.979	26297.28
818.365	25780.29
818.752	22013.24
819.139	18772.9
819.525	17520.45
819.912	18416.09
820.298	20758.36
820.685	22382.17
821.071	21775.37
821.457	19685.53
821.843	16564.12
822.23	14590.79
822.616	14335.93
823.002	15602.94
823.388	16755.87
823.774	17175.78
824.16	15874.79
824.546	13661.17
824.931	11974.25
825.317	11464.53
825.703	12743.68
826.089	14226.71
826.474	15243.71
826.86	14741.28
827.245	12602.9
827.631	10833.45
828.016	10039.75
828.401	10729.08
828.787	11678.12
829.172	13037.37
829.557	12877.17
829.942	11479.09
830.327	9947.52
830.712	8491.18
831.097	8394.09
831.482	9265.47
831.867	10316.45
832.252	10957.24
832.636	10187.81
833.021	9097.99
833.406	7748.45
833.79	7248.44
834.175	7663.5
834.559	8656.23
834.944	9306.73
835.328	9246.05
835.713	8034.86
836.097	6746.01
836.481	5889.2
836.865	5835.8
837.249	6391.63
837.633	7037.28
838.017	7559.13
838.401	7037.28
838.785	5835.8
839.169	5153.75
839.553	4384.32
839.937	4350.34
840.32	4947.44
840.704	5488.71
841.087	5576.09
841.471	4881.9
841.854	4003.25
842.238	3420.71
842.621	3323.63
843.004	3542.08
843.388	4136.75
843.771	4670.73
844.154	4481.41
844.537	3731.4
844.92	3304.21
845.303	2835.75
845.686	2857.6
846.069	3323.63
846.452	3651.3
846.834	3925.58
847.217	3520.23
847.6	3221.68
847.982	2745.95
848.365	2272.64
848.748	2488.66
849.13	2830.9
849.512	3127.02
849.895	3287.22
850.277	3076.05
850.659	2573.61
851.041	2071.18
851.423	2000.79
851.806	2068.75
852.188	2299.34
852.57	2731.38
852.951	2724.1
853.333	2452.25
853.715	1944.96
854.097	1753.21
854.479	1600.3
854.86	1736.22
855.242	1927.97
855.623	2042.05
856.005	2090.6
856.386	1889.14
856.768	1471.66
857.149	1287.19
857.53	1180.39
857.911	1321.17
858.292	1435.25
858.674	1537.19
859.055	1534.76
859.436	1367.28
859.817	1131.84
860.197	1046.89
860.578	874.56
860.959	1012.91
861.34	1093.01
861.72	1226.51
862.101	1202.23
862.482	981.36
862.862	910.97
863.243	731.35
863.623	736.21
864.003	826.01
864.384	923.1
864.764	935.24
865.144	944.95
865.524	804.17
865.904	714.36
866.284	629.41
866.664	639.12
867.044	665.82
867.424	658.54
867.804	838.15
868.183	765.33
868.563	707.08
868.943	622.13
869.322	573.58
869.702	488.63
870.081	534.75
870.461	512.9
870.84	605.14
871.22	515.33
871.599	568.73
871.978	510.48
872.357	459.5
872.736	340.57
873.115	432.8
873.494	430.38
873.873	466.79
874.252	457.08
874.631	522.61
875.01	437.66
875.388	384.26
875.767	321.15
876.146	318.72
876.524	323.58
876.903	372.12
877.281	350.28
877.66	372.12
878.038	323.58
878.416	311.44
878.794	311.44
879.173	243.48
879.551	296.88
879.929	265.33
880.307	367.27
880.685	270.18
881.063	284.74
881.441	452.22
881.818	272.61
882.196	267.75
882.574	243.48
882.951	311.44
883.329	255.62
883.707	275.03
884.084	301.73
884.461	301.73
884.839	262.9
885.216	270.18
885.593	238.63
885.971	207.07
886.348	209.5
886.725	177.95
887.102	197.36
887.479	202.22
887.856	275.03
888.233	236.2
888.609	241.05
888.986	262.9
889.363	180.37
889.74	258.04
890.116	236.2
890.493	214.35
890.869	182.8
891.246	211.93
891.622	170.66
891.998	224.06
892.375	221.64
892.751	204.65
893.127	214.35
893.503	241.05
893.879	219.21
894.255	190.08
894.631	180.37
895.007	85.71
895.383	204.65
895.759	168.24
896.134	202.22
896.51	141.54
896.886	226.49
897.261	158.53
897.637	231.34
898.012	175.52
898.388	260.47
898.763	105.13
899.138	211.93
899.514	163.38
899.889	126.97
900.264	158.53
900.639	158.53
901.014	192.51
901.389	156.1
901.764	124.55
902.139	190.08
902.513	168.24
902.888	134.26
903.263	139.11
903.638	224.06
904.012	141.54
904.387	153.67
904.761	139.11
905.136	143.96
905.51	139.11
905.884	141.54
906.259	158.53
906.633	163.38
907.007	163.38
907.381	109.98
907.755	190.08
908.129	122.12
908.503	192.51
908.877	146.39
909.251	199.79
909.624	170.66
909.998	192.51
910.372	180.37
910.745	92.99
911.119	180.37
911.492	112.41
911.866	129.4
912.239	177.95
912.612	187.65
912.986	163.38
913.359	165.81
913.732	122.12
914.105	158.53
914.478	214.35
914.851	151.25
915.224	158.53
915.597	131.83
915.97	136.68
916.343	168.24
916.715	119.69
917.088	156.1
917.461	148.82
917.833	228.92
918.206	163.38
918.578	129.4
918.951	194.94
919.323	66.29
919.695	124.55
920.067	209.5
920.44	194.94
920.812	148.82
921.184	151.25
921.556	190.08
921.928	63.87
922.3	112.41
922.672	158.53
923.043	158.53
923.415	197.36
923.787	100.27
924.158	163.38
924.53	109.98
924.901	146.39
925.273	175.52
925.644	156.1
926.016	165.81
926.387	109.98
926.758	124.55
927.129	141.54
927.5	216.78
927.872	117.27
928.243	90.57
928.613	148.82
928.984	136.68
929.355	141.54
929.726	136.68
930.097	105.13
930.467	170.66
930.838	211.93
931.209	63.87
931.579	129.4
931.95	160.96
932.32	146.39
932.69	163.38
933.061	182.8
933.431	182.8
933.801	182.8
934.171	95.42
934.541	107.56
934.911	151.25
935.281	112.41
935.651	148.82
936.021	163.38
936.391	187.65
936.761	141.54
937.13	107.56
937.5	124.55
937.87	143.96
938.239	219.21
938.609	175.52
938.978	139.11
939.347	126.97
939.717	131.83
940.086	139.11
940.455	119.69
940.824	216.78
941.193	114.84
941.562	156.1
941.931	92.99
942.3	199.79
942.669	187.65
943.038	156.1
943.407	207.07
943.775	151.25
944.144	136.68
944.513	95.42
944.881	170.66
945.25	187.65
945.618	192.51
945.986	207.07
946.355	131.83
946.723	146.39
947.091	272.61
947.459	141.54
947.827	146.39
948.195	190.08
948.563	109.98
948.931	153.67
949.299	107.56
949.667	80.86
950.035	170.66
950.402	192.51
950.77	143.96
951.138	185.23
951.505	182.8
951.873	173.09
952.24	114.84
952.607	112.41
952.975	143.96
953.342	122.12
953.709	192.51
954.076	122.12
954.443	126.97
954.81	209.5
955.177	262.9
955.544	143.96
955.911	185.23
956.278	163.38
956.645	168.24
957.012	163.38
957.378	151.25
957.745	148.82
958.111	163.38
958.478	124.55
958.844	197.36
959.211	170.66
959.577	146.39
959.943	119.69
960.309	226.49
960.675	168.24
961.042	129.4
961.408	122.12
961.774	114.84
962.139	100.27
962.505	160.96
962.871	129.4
963.237	151.25
963.603	168.24
963.968	49.3
964.334	187.65
964.699	124.55
965.065	105.13
965.43	148.82
965.796	255.62
966.161	146.39
966.526	216.78
966.891	78.43
967.256	143.96
967.622	160.96
967.987	163.38
968.352	158.53
968.716	199.79
969.081	163.38
969.446	83.28
969.811	151.25
970.176	148.82
970.54	182.8
970.905	141.54
971.269	158.53
971.634	156.1
971.998	90.57
972.363	226.49
972.727	109.98
973.091	173.09
973.455	143.96
973.819	100.27
974.183	83.28
974.547	143.96
974.911	146.39
975.275	109.98
975.639	180.37
976.003	124.55
976.367	80.86
976.73	129.4
977.094	160.96
977.458	197.36
977.821	153.67
978.185	170.66
978.548	151.25
978.911	165.81
979.275	122.12
979.638	85.71
980.001	153.67
980.364	131.83
980.727	216.78
981.09	228.92
981.453	168.24
981.816	182.8
982.179	236.2
982.542	182.8
982.905	163.38
983.267	63.87
983.63	134.26
983.992	139.11
984.355	136.68
984.717	95.42
985.08	197.36
985.442	92.99
985.804	107.56
986.167	199.79
986.529	119.69
986.891	146.39
987.253	66.29
987.615	168.24
987.977	129.4
988.339	177.95
988.701	168.24
989.062	156.1
989.424	156.1
989.786	100.27
990.147	100.27
990.509	78.43
990.87	92.99
991.232	134.26
991.593	160.96
991.955	114.84
992.316	141.54
992.677	119.69
993.038	90.57
993.399	190.08
993.76	126.97
994.121	49.3
994.482	114.84
994.843	153.67
995.204	180.37
995.565	143.96
995.926	170.66
996.286	134.26
996.647	158.53
997.007	122.12
997.368	134.26
997.728	122.12
998.089	209.5
998.449	141.54
998.809	173.09
999.169	139.11
999.53	109.98
999.89	197.36
1000.25	168.24
1000.61	119.69
1000.97	119.69
1001.329	90.57
1001.689	114.84
1002.049	134.26
1002.409	177.95
1002.768	124.55
1003.128	97.85
1003.487	102.7
1003.847	173.09
1004.206	141.54
1004.566	180.37
1004.925	177.95
1005.284	163.38
1005.643	146.39
1006.003	146.39
1006.362	90.57
1006.721	139.11
1007.08	153.67
1007.438	228.92
1007.797	177.95
1008.156	124.55
1008.515	199.79
1008.874	180.37
1009.232	68.72
1009.591	190.08
1009.949	163.38
1010.308	170.66
1010.666	177.95
1011.024	204.65
1011.383	146.39
1011.741	131.83
1012.099	95.42
1012.457	168.24
1012.815	209.5
1013.173	168.24
1013.531	187.65
1013.889	241.05
1014.247	122.12
1014.605	214.35
1014.962	139.11
1015.32	131.83
1015.678	129.4
1016.035	90.57
1016.393	139.11
1016.75	146.39
1017.107	107.56
1017.465	165.81
1017.822	202.22
1018.179	90.57
1018.536	131.83
1018.894	151.25
1019.251	112.41
1019.608	66.29
1019.964	163.38
1020.321	114.84
1020.678	173.09
1021.035	173.09
1021.392	146.39
1021.748	168.24
1022.105	100.27
1022.461	136.68
1022.818	148.82
1023.174	153.67
1023.531	158.53
1023.887	139.11
1024.243	129.4
1024.599	107.56
1024.955	177.95
1025.311	163.38
1025.667	136.68
1026.023	148.82
1026.379	136.68
1026.735	63.87
1027.091	129.4
1027.447	163.38
