189.514	73.88
189.973	73.88
190.431	73.88
190.889	76.31
191.348	-1.37
191.806	-42.63
192.264	73.88
192.722	-49.91
193.18	-40.2
193.638	-3.79
194.096	-23.21
194.554	-32.92
195.012	3.49
195.47	-45.06
195.928	61.74
196.385	22.91
196.843	-13.5
197.301	-8.65
197.758	1.06
198.216	-49.91
198.674	54.46
199.131	49.61
199.589	76.31
200.046	69.02
200.503	110.29
200.961	66.6
201.418	-3.79
201.875	44.75
202.332	112.71
202.79	124.85
203.247	105.43
203.704	120
204.161	178.25
204.618	161.26
205.075	120
205.532	124.85
205.989	95.72
206.445	61.74
206.902	132.13
207.359	120
207.816	88.44
208.272	161.26
208.729	90.87
209.185	115.14
209.642	134.56
210.098	173.39
210.555	175.82
211.011	103.01
211.467	115.14
211.924	110.29
212.38	127.28
212.836	195.24
213.292	153.98
213.748	224.37
214.204	120
214.66	110.29
215.116	117.57
215.572	136.99
216.028	124.85
216.484	158.83
216.94	212.23
217.396	149.12
217.851	185.53
218.307	86.01
218.763	122.42
219.218	107.86
219.674	151.55
220.129	100.58
220.585	124.85
221.04	129.7
221.496	88.44
221.951	139.41
222.406	66.6
222.861	129.7
223.317	161.26
223.772	112.71
224.227	127.28
224.682	132.13
225.137	129.7
225.592	144.27
226.047	71.45
226.502	132.13
226.957	83.59
227.411	153.98
227.866	132.13
228.321	173.39
228.776	115.14
229.23	83.59
229.685	127.28
230.139	141.84
230.594	163.69
231.048	105.43
231.503	95.72
231.957	76.31
232.411	120
232.865	76.31
233.32	141.84
233.774	156.4
234.228	151.55
234.682	122.42
235.136	129.7
235.59	166.11
236.044	132.13
236.498	180.68
236.952	151.55
237.406	153.98
237.86	139.41
238.313	195.24
238.767	156.4
239.221	175.82
239.674	83.59
240.128	168.54
240.581	129.7
241.035	255.92
241.488	168.54
241.942	190.39
242.395	73.88
242.848	78.73
243.301	81.16
243.755	187.96
244.208	163.69
244.661	173.39
245.114	156.4
245.567	217.08
246.02	112.71
246.473	115.14
246.926	103.01
247.379	105.43
247.832	76.31
248.284	178.25
248.737	153.98
249.19	187.96
249.642	139.41
250.095	64.17
250.547	144.27
251	117.57
251.452	124.85
251.905	117.57
252.357	83.59
252.81	170.97
253.262	153.98
253.714	217.08
254.166	132.13
254.618	195.24
255.07	141.84
255.523	120
255.975	156.4
256.427	144.27
256.878	69.02
257.33	195.24
257.782	146.7
258.234	231.65
258.686	149.12
259.137	139.41
259.589	187.96
260.041	190.39
260.492	122.42
260.944	112.71
261.395	183.1
261.847	175.82
262.298	144.27
262.749	161.26
263.201	76.31
263.652	168.54
264.103	107.86
264.554	107.86
265.005	120
265.457	178.25
265.908	158.83
266.359	124.85
266.809	170.97
267.26	178.25
267.711	136.99
268.162	175.82
268.613	136.99
269.064	212.23
269.514	83.59
269.965	132.13
270.415	153.98
270.866	156.4
271.316	178.25
271.767	144.27
272.217	207.38
272.668	243.78
273.118	161.26
273.568	112.71
274.019	93.3
274.469	105.43
274.919	105.43
275.369	151.55
275.819	187.96
276.269	88.44
276.719	141.84
277.169	103.01
277.619	195.24
278.069	153.98
278.518	115.14
278.968	178.25
279.418	151.55
279.867	136.99
280.317	180.68
280.767	192.81
281.216	158.83
281.666	132.13
282.115	151.55
282.564	139.41
283.014	146.7
283.463	151.55
283.912	129.7
284.361	251.07
284.811	161.26
285.26	187.96
285.709	175.82
286.158	136.99
286.607	117.57
287.056	124.85
287.505	192.81
287.953	212.23
288.402	103.01
288.851	95.72
289.3	170.97
289.748	127.28
290.197	156.4
290.646	151.55
291.094	117.57
291.543	139.41
291.991	144.27
292.439	98.15
292.888	195.24
293.336	161.26
293.784	185.53
294.233	132.13
294.681	141.84
295.129	175.82
295.577	156.4
296.025	163.69
296.473	132.13
296.921	190.39
297.369	134.56
297.817	95.72
298.264	139.41
298.712	168.54
299.16	178.25
299.608	200.09
300.055	124.85
300.503	168.54
300.95	166.11
301.398	175.82
301.845	129.7
302.293	61.74
302.74	209.8
303.187	183.1
303.635	124.85
304.082	134.56
304.529	88.44
304.976	158.83
305.423	156.4
305.87	136.99
306.317	127.28
306.764	158.83
307.211	144.27
307.658	69.02
308.105	209.8
308.552	175.82
308.998	54.46
309.445	197.67
309.892	95.72
310.338	146.7
310.785	90.87
311.231	185.53
311.678	129.7
312.124	185.53
312.571	134.56
313.017	141.84
313.463	66.6
313.909	122.42
314.356	168.54
314.802	141.84
315.248	83.59
315.694	141.84
316.14	151.55
316.586	136.99
317.032	124.85
317.478	168.54
317.923	100.58
318.369	115.14
318.815	144.27
319.261	185.53
319.706	139.41
320.152	105.43
320.597	192.81
321.043	180.68
321.488	197.67
321.934	144.27
322.379	175.82
322.824	185.53
323.27	117.57
323.715	129.7
324.16	151.55
324.605	166.11
325.05	144.27
325.495	212.23
325.94	149.12
326.385	124.85
326.83	192.81
327.275	149.12
327.72	144.27
328.165	139.41
328.61	127.28
329.054	158.83
329.499	212.23
329.943	144.27
330.388	103.01
330.832	93.3
331.277	103.01
331.721	134.56
332.166	236.5
332.61	166.11
333.054	134.56
333.499	103.01
333.943	178.25
334.387	115.14
334.831	81.16
335.275	200.09
335.719	197.67
336.163	86.01
336.607	207.38
337.051	156.4
337.495	103.01
337.938	73.88
338.382	100.58
338.826	156.4
339.269	124.85
339.713	183.1
340.157	187.96
340.6	166.11
341.044	134.56
341.487	153.98
341.93	129.7
342.374	178.25
342.817	170.97
343.26	112.71
343.703	151.55
344.146	146.7
344.59	86.01
345.033	139.41
345.476	151.55
345.919	95.72
346.361	117.57
346.804	127.28
347.247	100.58
347.69	173.39
348.133	107.86
348.575	134.56
349.018	120
349.461	156.4
349.903	197.67
350.346	18.05
350.788	144.27
351.23	124.85
351.673	178.25
352.115	122.42
352.557	95.72
353	144.27
353.442	197.67
353.884	190.39
354.326	170.97
354.768	144.27
355.21	54.46
355.652	110.29
356.094	151.55
356.536	105.43
356.978	156.4
357.419	103.01
357.861	166.11
358.303	132.13
358.744	39.9
359.186	153.98
359.627	64.17
360.069	93.3
360.51	185.53
360.952	149.12
361.393	107.86
361.834	134.56
362.276	132.13
362.717	122.42
363.158	110.29
363.599	120
364.04	168.54
364.481	105.43
364.922	183.1
365.363	146.7
365.804	246.21
366.245	122.42
366.686	127.28
367.126	151.55
367.567	219.51
368.008	127.28
368.448	229.22
368.889	168.54
369.33	175.82
369.77	207.38
370.21	141.84
370.651	180.68
371.091	132.13
371.531	120
371.972	204.95
372.412	192.81
372.852	144.27
373.292	124.85
373.732	156.4
374.172	153.98
374.612	115.14
375.052	197.67
375.492	132.13
375.932	129.7
376.372	187.96
376.811	168.54
377.251	202.52
377.691	49.61
378.13	56.89
378.57	195.24
379.009	156.4
379.449	146.7
379.888	103.01
380.328	197.67
380.767	158.83
381.206	173.39
381.645	149.12
382.085	178.25
382.524	149.12
382.963	187.96
383.402	100.58
383.841	122.42
384.28	117.57
384.719	95.72
385.158	83.59
385.596	129.7
386.035	161.26
386.474	129.7
386.913	163.69
387.351	112.71
387.79	98.15
388.228	73.88
388.667	78.73
389.105	161.26
389.544	124.85
389.982	151.55
390.42	144.27
390.859	105.43
391.297	124.85
391.735	151.55
392.173	78.73
392.611	134.56
393.049	132.13
393.487	115.14
393.925	98.15
394.363	103.01
394.801	115.14
395.239	124.85
395.676	144.27
396.114	134.56
396.552	124.85
396.989	166.11
397.427	95.72
397.864	95.72
398.302	166.11
398.739	168.54
399.177	221.94
399.614	163.69
400.051	163.69
400.488	146.7
400.926	168.54
401.363	81.16
401.8	161.26
402.237	134.56
402.674	166.11
403.111	98.15
403.548	173.39
403.985	156.4
404.421	136.99
404.858	103.01
405.295	180.68
405.732	166.11
406.168	149.12
406.605	180.68
407.041	224.37
407.478	95.72
407.914	200.09
408.351	129.7
408.787	107.86
409.223	122.42
409.66	120
410.096	226.79
410.532	217.08
410.968	93.3
411.404	100.58
411.84	107.86
412.276	192.81
412.712	95.72
413.148	202.52
413.584	190.39
414.02	136.99
414.455	115.14
414.891	144.27
415.327	146.7
415.762	117.57
416.198	151.55
416.633	144.27
417.069	180.68
417.504	139.41
417.94	175.82
418.375	144.27
418.81	110.29
419.245	156.4
419.681	163.69
420.116	153.98
420.551	139.41
420.986	132.13
421.421	132.13
421.856	173.39
422.291	112.71
422.726	93.3
423.16	132.13
423.595	86.01
424.03	183.1
424.464	212.23
424.899	173.39
425.334	139.41
425.768	129.7
426.203	122.42
426.637	168.54
427.071	139.41
427.506	127.28
427.94	100.58
428.374	202.52
428.809	163.69
429.243	149.12
429.677	146.7
430.111	187.96
430.545	141.84
430.979	168.54
431.413	183.1
431.847	197.67
432.28	88.44
432.714	132.13
433.148	141.84
433.582	187.96
434.015	90.87
434.449	129.7
434.882	207.38
435.316	110.29
435.749	141.84
436.183	183.1
436.616	161.26
437.049	190.39
437.483	202.52
437.916	90.87
438.349	168.54
438.782	132.13
439.215	134.56
439.648	112.71
440.081	163.69
440.514	149.12
440.947	117.57
441.38	129.7
441.813	132.13
442.245	149.12
442.678	98.15
443.111	105.43
443.543	105.43
443.976	98.15
444.408	183.1
444.841	103.01
445.273	141.84
445.705	153.98
446.138	127.28
446.57	136.99
447.002	107.86
447.434	163.69
447.867	134.56
448.299	161.26
448.731	105.43
449.163	153.98
449.595	192.81
450.026	170.97
450.458	170.97
450.89	105.43
451.322	202.52
451.754	146.7
452.185	93.3
452.617	127.28
453.048	161.26
453.48	139.41
453.911	153.98
454.343	112.71
454.774	134.56
455.205	161.26
455.637	103.01
456.068	146.7
456.499	144.27
456.93	144.27
457.361	185.53
457.792	127.28
458.223	224.37
458.654	156.4
459.085	139.41
459.516	212.23
459.947	180.68
460.378	178.25
460.808	161.26
461.239	161.26
461.669	156.4
462.1	151.55
462.531	158.83
462.961	122.42
463.391	132.13
463.822	156.4
464.252	153.98
464.682	175.82
465.113	127.28
465.543	124.85
465.973	263.2
466.403	149.12
466.833	161.26
467.263	112.71
467.693	146.7
468.123	183.1
468.553	95.72
468.983	224.37
469.412	105.43
469.842	229.22
470.272	175.82
470.701	107.86
471.131	151.55
471.56	166.11
471.99	124.85
472.419	156.4
472.849	180.68
473.278	170.97
473.707	197.67
474.136	144.27
474.566	134.56
474.995	146.7
475.424	197.67
475.853	151.55
476.282	192.81
476.711	139.41
477.14	158.83
477.569	110.29
477.997	86.01
478.426	141.84
478.855	156.4
479.283	197.67
479.712	127.28
480.141	168.54
480.569	187.96
480.998	149.12
481.426	139.41
481.854	146.7
482.283	144.27
482.711	158.83
483.139	151.55
483.567	161.26
483.995	234.08
484.424	110.29
484.852	202.52
485.28	173.39
485.708	168.54
486.135	156.4
486.563	149.12
486.991	178.25
487.419	151.55
487.847	241.36
488.274	217.08
488.702	158.83
489.129	212.23
489.557	166.11
489.984	124.85
490.412	195.24
490.839	170.97
491.266	129.7
491.694	115.14
492.121	134.56
492.548	136.99
492.975	136.99
493.402	178.25
493.829	158.83
494.256	163.69
494.683	136.99
495.11	173.39
495.537	163.69
495.964	151.55
496.39	204.95
496.817	117.57
497.244	178.25
497.67	163.69
498.097	180.68
498.523	141.84
498.95	86.01
499.376	129.7
499.803	144.27
500.229	166.11
500.655	190.39
501.081	120
501.508	187.96
501.934	175.82
502.36	120
502.786	107.86
503.212	192.81
503.638	129.7
504.064	178.25
504.489	146.7
504.915	115.14
505.341	115.14
505.767	98.15
506.192	183.1
506.618	132.13
507.043	56.89
507.469	168.54
507.894	124.85
508.32	207.38
508.745	93.3
509.17	163.69
509.596	136.99
510.021	161.26
510.446	144.27
510.871	151.55
511.296	178.25
511.721	134.56
512.146	195.24
512.571	149.12
512.996	185.53
513.421	127.28
513.845	187.96
514.27	243.78
514.695	161.26
515.119	134.56
515.544	158.83
515.969	178.25
516.393	180.68
516.817	95.72
517.242	120
517.666	156.4
518.09	120
518.515	93.3
518.939	178.25
519.363	345.73
519.787	195.24
520.211	187.96
520.635	170.97
521.059	144.27
521.483	243.78
521.907	124.85
522.331	115.14
522.754	185.53
523.178	90.87
523.602	122.42
524.025	166.11
524.449	241.36
524.872	136.99
525.296	105.43
525.719	178.25
526.143	272.91
526.566	153.98
526.989	124.85
527.412	141.84
527.836	183.1
528.259	219.51
528.682	175.82
529.105	163.69
529.528	146.7
529.951	168.54
530.374	170.97
530.796	190.39
531.219	190.39
531.642	231.65
532.065	185.53
532.487	120
532.91	122.42
533.332	124.85
533.755	144.27
534.177	151.55
534.6	156.4
535.022	200.09
535.444	124.85
535.867	170.97
536.289	163.69
536.711	146.7
537.133	146.7
537.555	153.98
537.977	139.41
538.399	129.7
538.821	161.26
539.243	136.99
539.665	156.4
540.086	115.14
540.508	202.52
540.93	197.67
541.351	78.73
541.773	156.4
542.195	136.99
542.616	229.22
543.037	202.52
543.459	190.39
543.88	161.26
544.301	163.69
544.723	127.28
545.144	185.53
545.565	151.55
545.986	185.53
546.407	183.1
546.828	149.12
547.249	144.27
547.67	122.42
548.091	183.1
548.512	168.54
548.932	129.7
549.353	107.86
549.774	141.84
550.194	217.08
550.615	124.85
551.035	124.85
551.456	202.52
551.876	124.85
552.296	168.54
552.717	156.4
553.137	141.84
553.557	146.7
553.977	183.1
554.397	132.13
554.817	197.67
555.237	158.83
555.657	168.54
556.077	129.7
556.497	134.56
556.917	120
557.337	146.7
557.756	163.69
558.176	69.02
558.596	156.4
559.015	175.82
559.435	134.56
559.854	139.41
560.274	207.38
560.693	127.28
561.112	185.53
561.532	153.98
561.951	212.23
562.37	127.28
562.789	81.16
563.208	166.11
563.627	166.11
564.046	161.26
564.465	166.11
564.884	105.43
565.303	161.26
565.722	161.26
566.14	93.3
566.559	103.01
566.978	185.53
567.396	144.27
567.815	241.36
568.233	144.27
568.652	173.39
569.07	144.27
569.489	127.28
569.907	202.52
570.325	197.67
570.743	139.41
571.161	134.56
571.58	115.14
571.998	90.87
572.416	117.57
572.833	149.12
573.251	127.28
573.669	115.14
574.087	151.55
574.505	141.84
574.922	149.12
575.34	105.43
575.758	93.3
576.175	183.1
576.593	86.01
577.01	107.86
577.428	122.42
577.845	1501.09
578.262	302.04
578.68	103.01
579.097	146.7
579.514	180.68
579.931	185.53
580.348	122.42
580.765	98.15
581.182	156.4
581.599	168.54
582.016	192.81
582.433	73.88
582.849	103.01
583.266	156.4
583.683	149.12
584.099	192.81
584.516	192.81
584.933	146.7
585.349	132.13
585.765	139.41
586.182	183.1
586.598	197.67
587.014	139.41
587.431	163.69
587.847	88.44
588.263	183.1
588.679	170.97
589.095	195.24
589.511	168.54
589.927	246.21
590.343	107.86
590.759	285.05
591.174	122.42
591.59	129.7
592.006	129.7
592.421	110.29
592.837	168.54
593.252	163.69
593.668	183.1
594.083	168.54
594.499	187.96
594.914	139.41
595.329	173.39
595.745	141.84
596.16	195.24
596.575	132.13
596.99	187.96
597.405	178.25
597.82	127.28
598.235	112.71
598.65	141.84
599.065	141.84
599.479	95.72
599.894	158.83
600.309	112.71
600.724	212.23
601.138	127.28
601.553	95.72
601.967	129.7
602.382	217.08
602.796	129.7
603.21	117.57
603.625	115.14
604.039	81.16
604.453	129.7
604.867	170.97
605.281	197.67
605.695	144.27
606.109	185.53
606.523	115.14
606.937	168.54
607.351	304.46
607.765	149.12
608.178	110.29
608.592	122.42
609.006	105.43
609.419	192.81
609.833	132.13
610.246	95.72
610.66	163.69
611.073	209.8
611.487	175.82
611.9	105.43
612.313	122.42
612.726	241.36
613.139	153.98
613.553	110.29
613.966	209.8
614.379	127.28
614.792	127.28
615.204	161.26
615.617	107.86
616.03	120
616.443	78.73
616.856	151.55
617.268	136.99
617.681	112.71
618.093	141.84
618.506	219.51
618.918	163.69
619.331	136.99
619.743	156.4
620.155	170.97
620.568	197.67
620.98	163.69
621.392	112.71
621.804	202.52
622.216	158.83
622.628	214.66
623.04	134.56
623.452	136.99
623.864	173.39
624.276	127.28
624.687	132.13
625.099	149.12
625.511	180.68
625.922	124.85
626.334	115.14
626.745	180.68
627.157	52.03
627.568	173.39
627.979	112.71
628.391	144.27
628.802	229.22
629.213	134.56
629.624	153.98
630.035	163.69
630.446	195.24
630.857	168.54
631.268	153.98
631.679	183.1
632.09	195.24
632.501	168.54
632.912	226.79
633.322	168.54
633.733	132.13
634.144	124.85
634.554	175.82
634.965	187.96
635.375	217.08
635.785	168.54
636.196	81.16
636.606	127.28
637.016	161.26
637.427	90.87
637.837	175.82
638.247	149.12
638.657	129.7
639.067	224.37
639.477	112.71
639.887	207.38
640.297	195.24
640.706	151.55
641.116	178.25
641.526	95.72
641.935	175.82
642.345	151.55
642.755	166.11
643.164	161.26
643.573	122.42
643.983	175.82
644.392	180.68
644.801	144.27
645.211	178.25
645.62	158.83
646.029	129.7
646.438	136.99
646.847	124.85
647.256	173.39
647.665	158.83
648.074	197.67
648.483	149.12
648.892	156.4
649.3	268.06
649.709	132.13
650.118	156.4
650.526	112.71
650.935	136.99
651.343	195.24
651.752	173.39
652.16	153.98
652.568	115.14
652.977	161.26
653.385	170.97
653.793	141.84
654.201	173.39
654.609	156.4
655.017	209.8
655.425	66.6
655.833	103.01
656.241	129.7
656.649	122.42
657.057	226.79
657.464	134.56
657.872	134.56
658.28	69.02
658.687	105.43
659.095	190.39
659.502	200.09
659.91	192.81
660.317	156.4
660.724	163.69
661.132	112.71
661.539	175.82
661.946	170.97
662.353	112.71
662.76	224.37
663.167	197.67
663.574	122.42
663.981	93.3
664.388	146.7
664.795	146.7
665.202	88.44
665.608	146.7
666.015	141.84
666.422	122.42
666.828	141.84
667.235	187.96
667.641	107.86
668.047	156.4
668.454	180.68
668.86	100.58
669.266	120
669.673	166.11
670.079	241.36
670.485	146.7
670.891	202.52
671.297	151.55
671.703	100.58
672.109	88.44
672.515	185.53
672.92	156.4
673.326	134.56
673.732	158.83
674.138	183.1
674.543	122.42
674.949	151.55
675.354	151.55
675.76	107.86
676.165	180.68
676.57	156.4
676.976	25.33
677.381	120
677.786	83.59
678.191	187.96
678.596	117.57
679.001	185.53
679.406	134.56
679.811	158.83
680.216	238.93
680.621	141.84
681.026	144.27
681.43	156.4
681.835	139.41
682.24	156.4
682.644	178.25
683.049	204.95
683.453	95.72
683.858	122.42
684.262	168.54
684.667	95.72
685.071	217.08
685.475	161.26
685.879	170.97
686.283	192.81
686.687	129.7
687.091	221.94
687.495	107.86
687.899	183.1
688.303	180.68
688.707	44.75
689.111	149.12
689.514	136.99
689.918	187.96
690.322	95.72
690.725	229.22
691.129	153.98
691.532	110.29
691.936	161.26
692.339	195.24
692.742	139.41
693.146	200.09
693.549	78.73
693.952	190.39
694.355	187.96
694.758	132.13
695.161	103.01
695.564	134.56
695.967	231.65
696.37	170.97
696.773	115.14
697.175	192.81
697.578	168.54
697.981	173.39
698.383	217.08
698.786	202.52
699.188	117.57
699.591	107.86
699.993	204.95
700.395	217.08
700.798	161.26
701.2	161.26
701.602	212.23
702.004	144.27
702.406	124.85
702.808	139.41
703.21	151.55
703.612	221.94
704.014	153.98
704.416	166.11
704.818	122.42
705.219	120
705.621	178.25
706.023	136.99
706.424	149.12
706.826	158.83
707.227	122.42
707.629	134.56
708.03	224.37
708.431	202.52
708.832	185.53
709.234	93.3
709.635	156.4
710.036	258.35
710.437	139.41
710.838	204.95
711.239	221.94
711.64	209.8
712.041	238.93
712.441	136.99
712.842	195.24
713.243	161.26
713.643	190.39
714.044	226.79
714.445	226.79
714.845	234.08
715.246	263.2
715.646	180.68
716.046	204.95
716.447	183.1
716.847	217.08
717.247	195.24
717.647	260.77
718.047	192.81
718.447	207.38
718.847	219.51
719.247	224.37
719.647	292.33
720.047	285.05
720.446	287.47
720.846	243.78
721.246	248.64
721.645	197.67
722.045	306.89
722.444	234.08
722.844	302.04
723.243	297.18
723.643	251.07
724.042	236.5
724.441	309.32
724.84	238.93
725.24	270.48
725.639	260.77
726.038	328.74
726.437	299.61
726.836	255.92
727.234	360.29
727.633	299.61
728.032	321.46
728.431	338.45
728.83	260.77
729.228	362.72
729.627	464.66
730.025	462.23
730.424	486.51
730.822	493.79
731.22	595.73
731.619	559.32
732.017	636.99
732.415	683.11
732.813	668.55
733.212	734.08
733.61	848.16
734.008	845.74
734.406	838.45
734.803	969.52
735.201	1020.5
735.599	1122.44
735.997	1185.55
736.395	1282.64
736.792	1272.93
737.19	1467.1
737.587	1445.26
737.985	1559.34
738.382	1535.07
738.78	1700.12
739.177	1714.68
739.574	1797.21
739.971	1957.4
740.369	2049.64
740.766	2010.8
741.163	2137.02
741.56	2350.61
741.957	2270.51
742.354	2353.04
742.751	2476.83
743.147	2425.86
743.544	2656.44
743.941	2755.96
744.338	2962.27
744.734	3093.34
745.131	3391.89
745.527	3569.08
745.924	3896.75
746.32	3938.02
746.716	4188.02
747.113	4391.91
747.509	4695.31
747.905	4828.81
748.301	5124.93
748.697	5391.92
749.093	5874.94
749.489	5843.39
749.885	6100.67
750.281	6666.21
750.677	6722.04
751.073	7061.85
751.468	7360.4
751.864	7824
752.26	7964.78
752.655	8561.87
753.051	8991.49
753.446	9396.84
753.842	9459.95
754.237	9571.6
754.632	9913.84
755.028	9763.35
755.423	9695.39
755.818	9945.39
756.213	10311.9
756.608	10343.46
757.003	10248.79
757.398	10375.01
757.793	9957.53
758.188	9986.65
758.583	10316.76
758.977	10129.86
759.372	10603.17
759.767	11409.01
760.161	12309.51
760.556	12969.71
760.95	13273.11
761.345	13848.36
761.739	15231.88
762.133	16185.78
762.527	17115.41
762.922	17095.99
763.316	17986.78
763.71	18812.03
764.104	19234.37
764.498	20088.75
764.892	20348.47
765.286	20404.29
765.68	21411.59
766.073	22384.91
766.467	21775.67
766.861	22785.4
767.255	24166.49
767.648	25280.58
768.042	26329.14
768.435	26421.38
768.829	26338.85
769.222	27448.09
769.615	28535.49
770.008	28865.59
770.402	28312.18
770.795	28496.65
771.188	28346.16
771.581	28722.38
771.974	28411.7
772.367	27513.63
772.76	27445.66
773.153	26452.93
773.545	26457.78
773.938	26552.45
774.331	26384.97
774.724	26074.28
775.116	27414.11
775.509	29207.83
775.901	30334.06
776.294	30727.27
776.686	31295.24
777.078	32705.45
777.471	34552.57
777.863	36572.02
778.255	36331.72
778.647	36164.25
779.039	36572.02
779.431	36914.26
779.823	38229.81
780.215	38329.33
780.607	37215.23
780.999	38093.89
781.39	39411.87
781.782	40152.17
782.174	39149.73
782.565	38822.05
782.957	39504.1
783.348	41829.38
783.74	42093.95
784.131	39984.69
784.522	39839.06
784.914	38754.09
785.305	39843.91
785.696	40142.46
786.087	39195.85
786.478	37025.91
786.869	35084.13
787.26	35207.92
787.651	34436.06
788.042	34285.58
788.433	31411.74
788.823	29513.66
789.214	29438.41
789.605	28605.88
789.995	26688.37
790.386	25030.58
790.776	24535.42
791.167	24355.81
791.557	25079.12
791.948	26329.14
792.338	26710.22
792.728	27484.5
793.118	27329.16
793.508	28309.75
793.898	29802.5
794.288	29868.03
794.678	28848.6
795.068	27948.1
795.458	28151.99
795.848	28761.22
796.238	29045.2
796.627	28020.92
797.017	27234.5
797.406	28020.92
797.796	29115.59
798.185	29860.75
798.575	28851.03
798.964	27863.15
799.354	28722.38
799.743	29360.74
800.132	30290.37
800.521	30227.26
800.91	30006.38
801.299	29783.08
801.688	30249.11
802.077	30807.37
802.466	31210.29
802.855	30389.88
803.244	28101.01
803.633	28144.7
804.021	28348.59
804.41	28656.85
804.799	26727.21
805.187	25338.83
805.576	24057.26
805.964	23965.03
806.352	22914.04
806.741	22324.22
807.129	21666.45
807.517	20918.86
807.905	21127.6
808.293	21916.45
808.681	22329.08
809.069	22690.74
809.457	22984.43
809.845	22212.57
810.233	23149.48
810.621	24346.1
811.009	24479.6
811.396	23239.29
811.784	23232.01
812.171	23309.68
812.559	23846.09
812.946	24270.86
813.334	23695.61
813.721	22911.61
814.108	22273.25
814.496	22406.75
814.883	22190.73
815.27	23149.48
815.657	22668.89
816.044	21921.31
816.431	21918.88
816.818	22656.75
817.205	23011.13
817.592	23212.59
817.979	21668.87
818.365	21617.9
818.752	21190.71
819.139	20193.12
819.525	20469.83
819.912	20142.15
820.298	19120.29
820.685	18404.26
821.071	17649.39
821.457	17462.5
821.843	16770.74
822.23	15986.75
822.616	15040.13
823.002	13911.47
823.388	13248.84
823.774	12807.09
824.16	12321.64
824.546	11831.34
824.931	11302.21
825.317	10865.31
825.703	11241.53
826.089	11535.22
826.474	11171.14
826.86	11224.54
827.245	10974.53
827.631	10608.02
828.016	10836.18
828.401	10467.24
828.787	10297.34
829.172	9790.05
829.557	9450.24
829.942	9008.48
830.327	8777.9
830.712	8756.05
831.097	8574.01
831.482	8382.26
831.867	8015.75
832.252	8020.6
832.636	7908.95
833.021	8282.74
833.406	7884.68
833.79	7651.67
834.175	7447.78
834.559	7353.12
834.944	7064.28
835.328	7338.55
835.713	7161.37
836.097	6794.86
836.481	6178.34
836.865	5940.47
837.249	5690.47
837.633	5569.11
838.017	5862.8
838.401	5421.05
838.785	5030.27
839.169	4797.25
839.553	4486.57
839.937	4527.83
840.32	4217.15
840.704	4120.06
841.087	3615.2
841.471	3287.52
841.854	3105.48
842.238	3355.48
842.621	3287.52
843.004	3035.09
843.388	2942.86
843.771	2913.73
844.154	2988.97
844.537	2952.56
844.92	3013.24
845.303	2867.61
845.686	2746.25
846.069	2666.15
846.452	2661.3
846.834	2717.12
847.217	2658.87
847.6	2571.49
847.982	2488.96
848.365	2331.2
848.748	2423.43
849.13	2311.78
849.512	2333.62
849.895	2384.59
850.277	2289.93
850.659	2168.57
851.041	2149.15
851.423	2093.33
851.806	2042.36
852.188	2183.13
852.57	2146.73
852.951	1954.98
853.333	1889.44
853.715	1836.04
854.097	1986.53
854.479	1872.45
854.86	1806.92
855.242	1768.08
855.623	1595.75
856.005	1498.66
856.386	1404
856.768	1476.81
857.149	1387.01
857.53	1234.09
857.911	1268.07
858.292	1207.39
858.674	1183.12
859.055	1161.27
859.436	1086.03
859.817	986.51
860.197	1013.21
860.578	896.71
860.959	884.57
861.34	877.29
861.72	887
862.101	838.45
862.482	794.76
862.862	700.1
863.243	734.08
863.623	661.27
864.003	707.38
864.384	736.51
864.764	729.23
865.144	603.01
865.524	629.71
865.904	549.61
866.284	535.05
866.664	581.17
867.044	532.62
867.424	459.81
867.804	370
868.183	515.63
868.563	505.92
868.943	457.38
869.322	469.52
869.702	435.53
870.081	411.26
870.461	365.15
870.84	496.22
871.22	350.58
871.599	394.27
871.978	372.43
872.357	360.29
872.736	311.75
873.115	319.03
873.494	314.17
873.873	345.73
874.252	343.3
874.631	289.9
875.01	243.78
875.388	294.76
875.767	260.77
876.146	224.37
876.524	241.36
876.903	204.95
877.281	251.07
877.66	246.21
878.038	175.82
878.416	195.24
878.794	226.79
879.173	248.64
879.551	234.08
879.929	183.1
880.307	170.97
880.685	161.26
881.063	229.22
881.441	234.08
881.818	183.1
882.196	168.54
882.574	221.94
882.951	173.39
883.329	282.62
883.707	268.06
884.084	229.22
884.461	253.49
884.839	170.97
885.216	202.52
885.593	166.11
885.971	168.54
886.348	175.82
886.725	178.25
887.102	168.54
887.479	175.82
887.856	180.68
888.233	156.4
888.609	175.82
888.986	156.4
889.363	158.83
889.74	149.12
890.116	226.79
890.493	146.7
890.869	195.24
891.246	173.39
891.622	117.57
891.998	153.98
892.375	73.88
892.751	217.08
893.127	163.69
893.503	161.26
893.879	197.67
894.255	185.53
894.631	136.99
895.007	139.41
895.383	163.69
895.759	170.97
896.134	180.68
896.51	168.54
896.886	122.42
897.261	158.83
897.637	183.1
898.012	120
898.388	166.11
898.763	129.7
899.138	134.56
899.514	129.7
899.889	149.12
900.264	197.67
900.639	207.38
901.014	195.24
901.389	124.85
901.764	129.7
902.139	122.42
902.513	127.28
902.888	120
903.263	112.71
903.638	47.18
904.012	173.39
904.387	115.14
904.761	93.3
905.136	146.7
905.51	136.99
905.884	83.59
906.259	156.4
906.633	103.01
907.007	61.74
907.381	120
907.755	192.81
908.129	134.56
908.503	132.13
908.877	100.58
909.251	146.7
909.624	88.44
909.998	93.3
910.372	129.7
910.745	158.83
911.119	166.11
911.492	124.85
911.866	141.84
912.239	132.13
912.612	83.59
912.986	200.09
913.359	124.85
913.732	144.27
914.105	153.98
914.478	124.85
914.851	141.84
915.224	105.43
915.597	120
915.97	120
916.343	161.26
916.715	110.29
917.088	166.11
917.461	146.7
917.833	192.81
918.206	212.23
918.578	195.24
918.951	83.59
919.323	163.69
919.695	124.85
920.067	100.58
920.44	136.99
920.812	107.86
921.184	73.88
921.556	112.71
921.928	146.7
922.3	156.4
922.672	166.11
923.043	112.71
923.415	117.57
923.787	192.81
924.158	175.82
924.53	168.54
924.901	153.98
925.273	112.71
925.644	190.39
926.016	168.54
926.387	112.71
926.758	105.43
927.129	95.72
927.5	163.69
927.872	149.12
928.243	161.26
928.613	86.01
928.984	168.54
929.355	141.84
929.726	144.27
930.097	151.55
930.467	107.86
930.838	149.12
931.209	151.55
931.579	64.17
931.95	221.94
932.32	88.44
932.69	156.4
933.061	105.43
933.431	144.27
933.801	98.15
934.171	112.71
934.541	134.56
934.911	132.13
935.281	141.84
935.651	129.7
936.021	136.99
936.391	93.3
936.761	103.01
937.13	139.41
937.5	144.27
937.87	124.85
938.239	161.26
938.609	132.13
938.978	158.83
939.347	156.4
939.717	115.14
940.086	156.4
940.455	226.79
940.824	153.98
941.193	144.27
941.562	149.12
941.931	170.97
942.3	156.4
942.669	83.59
943.038	76.31
943.407	141.84
943.775	117.57
944.144	178.25
944.513	156.4
944.881	103.01
945.25	105.43
945.618	56.89
945.986	103.01
946.355	100.58
946.723	117.57
947.091	90.87
947.459	158.83
947.827	158.83
948.195	112.71
948.563	115.14
948.931	110.29
949.299	134.56
949.667	175.82
950.035	124.85
950.402	139.41
950.77	105.43
951.138	110.29
951.505	105.43
951.873	134.56
952.24	117.57
952.607	146.7
952.975	112.71
953.342	90.87
953.709	178.25
954.076	175.82
954.443	132.13
954.81	139.41
955.177	156.4
955.544	122.42
955.911	88.44
956.278	103.01
956.645	180.68
957.012	66.6
957.378	151.55
957.745	136.99
958.111	90.87
958.478	161.26
958.844	115.14
959.211	90.87
959.577	110.29
959.943	81.16
960.309	139.41
960.675	136.99
961.042	149.12
961.408	192.81
961.774	132.13
962.139	153.98
962.505	151.55
962.871	115.14
963.237	76.31
963.603	103.01
963.968	141.84
964.334	93.3
964.699	115.14
965.065	146.7
965.43	122.42
965.796	127.28
966.161	168.54
966.526	132.13
966.891	163.69
967.256	141.84
967.622	158.83
967.987	132.13
968.352	192.81
968.716	187.96
969.081	166.11
969.446	35.04
969.811	136.99
970.176	129.7
970.54	149.12
970.905	141.84
971.269	136.99
971.634	122.42
971.998	212.23
972.363	124.85
972.727	112.71
973.091	166.11
973.455	100.58
973.819	170.97
974.183	71.45
974.547	105.43
974.911	190.39
975.275	86.01
975.639	187.96
976.003	170.97
976.367	156.4
976.73	93.3
977.094	127.28
977.458	103.01
977.821	129.7
978.185	163.69
978.548	127.28
978.911	122.42
979.275	98.15
979.638	117.57
980.001	163.69
980.364	141.84
980.727	132.13
981.09	139.41
981.453	98.15
981.816	83.59
982.179	190.39
982.542	59.32
982.905	153.98
983.267	105.43
983.63	207.38
983.992	212.23
984.355	112.71
984.717	144.27
985.08	149.12
985.442	156.4
985.804	161.26
986.167	136.99
986.529	183.1
986.891	86.01
987.253	217.08
987.615	170.97
987.977	112.71
988.339	146.7
988.701	141.84
989.062	200.09
989.424	151.55
989.786	149.12
990.147	204.95
990.509	163.69
990.87	195.24
991.232	90.87
991.593	163.69
991.955	158.83
992.316	161.26
992.677	139.41
993.038	136.99
993.399	103.01
993.76	64.17
994.121	139.41
994.482	112.71
994.843	66.6
995.204	132.13
995.565	49.61
995.926	149.12
996.286	136.99
996.647	129.7
997.007	192.81
997.368	156.4
997.728	105.43
998.089	120
998.449	88.44
998.809	139.41
999.169	117.57
999.53	134.56
999.89	153.98
1000.25	183.1
1000.61	161.26
1000.97	88.44
1001.329	120
1001.689	153.98
1002.049	66.6
1002.409	122.42
1002.768	151.55
1003.128	175.82
1003.487	141.84
1003.847	86.01
1004.206	129.7
1004.566	115.14
1004.925	81.16
1005.284	81.16
1005.643	146.7
1006.003	132.13
1006.362	93.3
1006.721	173.39
1007.08	144.27
1007.438	100.58
1007.797	98.15
1008.156	103.01
1008.515	81.16
1008.874	127.28
1009.232	100.58
1009.591	139.41
1009.949	175.82
1010.308	204.95
1010.666	100.58
1011.024	81.16
1011.383	105.43
1011.741	166.11
1012.099	112.71
1012.457	132.13
1012.815	90.87
1013.173	166.11
1013.531	107.86
1013.889	105.43
1014.247	117.57
1014.605	88.44
1014.962	151.55
1015.32	117.57
1015.678	180.68
1016.035	134.56
1016.393	173.39
1016.75	197.67
1017.107	132.13
1017.465	98.15
1017.822	122.42
1018.179	173.39
1018.536	146.7
1018.894	132.13
1019.251	100.58
1019.608	141.84
1019.964	149.12
1020.321	151.55
1020.678	120
1021.035	195.24
1021.392	103.01
1021.748	93.3
1022.105	127.28
1022.461	95.72
1022.818	195.24
1023.174	151.55
1023.531	204.95
1023.887	204.95
1024.243	93.3
1024.599	71.45
1024.955	134.56
1025.311	122.42
1025.667	32.62
1026.023	66.6
1026.379	136.99
1026.735	98.15
1027.091	124.85
1027.447	178.25
