189.514	45.66
189.973	45.66
190.431	45.66
190.889	16.54
191.348	-22.3
191.806	-46.57
192.264	-53.85
192.722	1.97
193.18	-10.16
193.638	-32.01
194.096	-10.16
194.554	16.54
195.012	-19.87
195.47	-27.15
195.928	-29.58
196.385	77.22
196.843	1.97
197.301	-2.88
197.758	-29.58
198.216	50.52
198.674	67.51
199.131	-0.46
199.589	-19.87
200.046	9.25
200.503	91.78
200.961	108.77
201.418	67.51
201.875	21.39
202.332	106.34
202.79	120.91
203.247	116.05
203.704	123.33
204.161	111.2
204.618	135.47
205.075	116.05
205.532	174.3
205.989	94.21
206.445	164.6
206.902	196.15
207.359	188.87
207.816	188.87
208.272	157.31
208.729	116.05
209.185	154.89
209.642	186.44
210.098	164.6
210.555	164.6
211.011	116.05
211.467	111.2
211.924	133.04
212.38	135.47
212.836	101.49
213.292	133.04
213.748	154.89
214.204	191.3
214.66	108.77
215.116	176.73
215.572	82.07
216.028	157.31
216.484	137.9
216.94	179.16
217.396	130.61
217.851	154.89
218.307	116.05
218.763	140.32
219.218	162.17
219.674	74.79
220.129	140.32
220.585	179.16
221.04	176.73
221.496	120.91
221.951	72.36
222.406	125.76
222.861	106.34
223.317	101.49
223.772	118.48
224.227	101.49
224.682	120.91
225.137	91.78
225.592	133.04
226.047	142.75
226.502	213.14
226.957	145.18
227.411	128.19
227.866	198.58
228.321	96.63
228.776	137.9
229.23	84.5
229.685	150.03
230.139	171.88
230.594	215.57
231.048	169.45
231.503	40.81
231.957	154.89
232.411	116.05
232.865	198.58
233.32	133.04
233.774	167.02
234.228	167.02
234.682	201
235.136	94.21
235.59	142.75
236.044	208.29
236.498	154.89
236.952	162.17
237.406	137.9
237.86	86.92
238.313	118.48
238.767	157.31
239.221	210.71
239.674	142.75
240.128	205.86
240.581	150.03
241.035	157.31
241.488	91.78
241.942	125.76
242.395	159.74
242.848	181.59
243.301	101.49
243.755	179.16
244.208	145.18
244.661	217.99
245.114	111.2
245.567	176.73
246.02	106.34
246.473	215.57
246.926	169.45
247.379	142.75
247.832	154.89
248.284	123.33
248.737	176.73
249.19	94.21
249.642	181.59
250.095	120.91
250.547	106.34
251	186.44
251.452	140.32
251.905	140.32
252.357	69.93
252.81	152.46
253.262	198.58
253.714	120.91
254.166	157.31
254.618	242.27
255.07	125.76
255.523	157.31
255.975	77.22
256.427	184.01
256.878	188.87
257.33	164.6
257.782	103.92
258.234	130.61
258.686	157.31
259.137	188.87
259.589	179.16
260.041	145.18
260.492	145.18
260.944	106.34
261.395	152.46
261.847	215.57
262.298	171.88
262.749	154.89
263.201	154.89
263.652	164.6
264.103	150.03
264.554	169.45
265.005	150.03
265.457	108.77
265.908	91.78
266.359	94.21
266.809	142.75
267.26	152.46
267.711	242.27
268.162	213.14
268.613	106.34
269.064	89.35
269.514	237.41
269.965	150.03
270.415	201
270.866	154.89
271.316	179.16
271.767	55.37
272.217	171.88
272.668	215.57
273.118	99.06
273.568	147.61
274.019	77.22
274.469	74.79
274.919	128.19
275.369	186.44
275.819	113.62
276.269	154.89
276.719	123.33
277.169	181.59
277.619	154.89
278.069	215.57
278.518	120.91
278.968	234.99
279.418	171.88
279.867	152.46
280.317	154.89
280.767	108.77
281.216	130.61
281.666	123.33
282.115	159.74
282.564	181.59
283.014	94.21
283.463	118.48
283.912	157.31
284.361	130.61
284.811	137.9
285.26	145.18
285.709	157.31
286.158	217.99
286.607	154.89
287.056	191.3
287.505	157.31
287.953	215.57
288.402	86.92
288.851	118.48
289.3	120.91
289.748	67.51
290.197	72.36
290.646	128.19
291.094	167.02
291.543	86.92
291.991	196.15
292.439	89.35
292.888	72.36
293.336	154.89
293.784	140.32
294.233	130.61
294.681	120.91
295.129	174.3
295.577	176.73
296.025	179.16
296.473	43.23
296.921	232.56
297.369	106.34
297.817	164.6
298.264	140.32
298.712	152.46
299.16	145.18
299.608	145.18
300.055	113.62
300.503	123.33
300.95	169.45
301.398	154.89
301.845	159.74
302.293	133.04
302.74	181.59
303.187	176.73
303.635	106.34
304.082	154.89
304.529	174.3
304.976	213.14
305.423	108.77
305.87	120.91
306.317	171.88
306.764	99.06
307.211	137.9
307.658	118.48
308.105	101.49
308.552	79.64
308.998	113.62
309.445	181.59
309.892	147.61
310.338	147.61
310.785	120.91
311.231	198.58
311.678	188.87
312.124	157.31
312.571	176.73
313.017	157.31
313.463	179.16
313.909	167.02
314.356	130.61
314.802	89.35
315.248	164.6
315.694	108.77
316.14	164.6
316.586	162.17
317.032	203.43
317.478	196.15
317.923	164.6
318.369	174.3
318.815	215.57
319.261	169.45
319.706	174.3
320.152	242.27
320.597	169.45
321.043	184.01
321.488	152.46
321.934	220.42
322.379	125.76
322.824	142.75
323.27	147.61
323.715	133.04
324.16	145.18
324.605	191.3
325.05	135.47
325.495	137.9
325.94	174.3
326.385	234.99
326.83	94.21
327.275	113.62
327.72	94.21
328.165	130.61
328.61	154.89
329.054	145.18
329.499	179.16
329.943	157.31
330.388	130.61
330.832	145.18
331.277	232.56
331.721	167.02
332.166	77.22
332.61	140.32
333.054	123.33
333.499	145.18
333.943	118.48
334.387	135.47
334.831	99.06
335.275	198.58
335.719	150.03
336.163	145.18
336.607	91.78
337.051	164.6
337.495	118.48
337.938	167.02
338.382	198.58
338.826	217.99
339.269	164.6
339.713	120.91
340.157	130.61
340.6	179.16
341.044	169.45
341.487	130.61
341.93	164.6
342.374	133.04
342.817	167.02
343.26	191.3
343.703	116.05
344.146	179.16
344.59	162.17
345.033	142.75
345.476	103.92
345.919	157.31
346.361	176.73
346.804	145.18
347.247	145.18
347.69	159.74
348.133	96.63
348.575	45.66
349.018	128.19
349.461	150.03
349.903	140.32
350.346	174.3
350.788	188.87
351.23	179.16
351.673	164.6
352.115	106.34
352.557	128.19
353	106.34
353.442	84.5
353.884	113.62
354.326	169.45
354.768	142.75
355.21	152.46
355.652	96.63
356.094	128.19
356.536	133.04
356.978	140.32
357.419	116.05
357.861	118.48
358.303	176.73
358.744	130.61
359.186	125.76
359.627	125.76
360.069	147.61
360.51	227.7
360.952	232.56
361.393	188.87
361.834	116.05
362.276	181.59
362.717	162.17
363.158	150.03
363.599	84.5
364.04	120.91
364.481	118.48
364.922	72.36
365.363	128.19
365.804	222.85
366.245	179.16
366.686	120.91
367.126	135.47
367.567	145.18
368.008	150.03
368.448	157.31
368.889	111.2
369.33	157.31
369.77	128.19
370.21	179.16
370.651	188.87
371.091	123.33
371.531	171.88
371.972	120.91
372.412	57.8
372.852	169.45
373.292	164.6
373.732	106.34
374.172	176.73
374.612	130.61
375.052	154.89
375.492	188.87
375.932	217.99
376.372	123.33
376.811	169.45
377.251	171.88
377.691	225.28
378.13	130.61
378.57	169.45
379.009	135.47
379.449	86.92
379.888	116.05
380.328	147.61
380.767	125.76
381.206	94.21
381.645	120.91
382.085	125.76
382.524	133.04
382.963	103.92
383.402	125.76
383.841	213.14
384.28	174.3
384.719	167.02
385.158	118.48
385.596	79.64
386.035	181.59
386.474	188.87
386.913	133.04
387.351	150.03
387.79	169.45
388.228	135.47
388.667	150.03
389.105	171.88
389.544	94.21
389.982	186.44
390.42	48.09
390.859	164.6
391.297	145.18
391.735	159.74
392.173	130.61
392.611	77.22
393.049	140.32
393.487	140.32
393.925	140.32
394.363	150.03
394.801	145.18
395.239	101.49
395.676	157.31
396.114	162.17
396.552	77.22
396.989	79.64
397.427	147.61
397.864	167.02
398.302	157.31
398.739	196.15
399.177	130.61
399.614	142.75
400.051	186.44
400.488	157.31
400.926	147.61
401.363	96.63
401.8	118.48
402.237	140.32
402.674	152.46
403.111	174.3
403.548	103.92
403.985	167.02
404.421	130.61
404.858	152.46
405.295	99.06
405.732	157.31
406.168	133.04
406.605	169.45
407.041	106.34
407.478	118.48
407.914	184.01
408.351	116.05
408.787	111.2
409.223	113.62
409.66	176.73
410.096	176.73
410.532	222.85
410.968	113.62
411.404	167.02
411.84	135.47
412.276	106.34
412.712	217.99
413.148	135.47
413.584	106.34
414.02	137.9
414.455	118.48
414.891	91.78
415.327	120.91
415.762	120.91
416.198	208.29
416.633	147.61
417.069	38.38
417.504	133.04
417.94	201
418.375	159.74
418.81	120.91
419.245	133.04
419.681	116.05
420.116	128.19
420.551	157.31
420.986	154.89
421.421	125.76
421.856	145.18
422.291	162.17
422.726	123.33
423.16	147.61
423.595	188.87
424.03	128.19
424.464	162.17
424.899	96.63
425.334	101.49
425.768	99.06
426.203	191.3
426.637	162.17
427.071	205.86
427.506	94.21
427.94	101.49
428.374	188.87
428.809	203.43
429.243	120.91
429.677	118.48
430.111	227.7
430.545	150.03
430.979	140.32
431.413	152.46
431.847	116.05
432.28	159.74
432.714	164.6
433.148	198.58
433.582	135.47
434.015	176.73
434.449	188.87
434.882	169.45
435.316	208.29
435.749	137.9
436.183	215.57
436.616	198.58
437.049	179.16
437.483	157.31
437.916	162.17
438.349	137.9
438.782	162.17
439.215	135.47
439.648	150.03
440.081	191.3
440.514	82.07
440.947	203.43
441.38	108.77
441.813	220.42
442.245	157.31
442.678	188.87
443.111	201
443.543	125.76
443.976	147.61
444.408	215.57
444.841	86.92
445.273	159.74
445.705	159.74
446.138	237.41
446.57	184.01
447.002	174.3
447.434	222.85
447.867	164.6
448.299	268.97
448.731	169.45
449.163	184.01
449.595	203.43
450.026	254.4
450.458	237.41
450.89	259.26
451.322	244.69
451.754	227.7
452.185	205.86
452.617	179.16
453.048	154.89
453.48	247.12
453.911	307.8
454.343	184.01
454.774	188.87
455.205	234.99
455.637	254.4
456.068	249.55
456.499	217.99
456.93	208.29
457.361	145.18
457.792	268.97
458.223	213.14
458.654	264.11
459.085	237.41
459.516	268.97
459.947	234.99
460.378	227.7
460.808	254.4
461.239	198.58
461.669	213.14
462.1	295.67
462.531	184.01
462.961	157.31
463.391	259.26
463.822	244.69
464.252	152.46
464.682	188.87
465.113	188.87
465.543	217.99
465.973	142.75
466.403	169.45
466.833	237.41
467.263	225.28
467.693	222.85
468.123	205.86
468.553	227.7
468.983	179.16
469.412	171.88
469.842	234.99
470.272	232.56
470.701	130.61
471.131	179.16
471.56	169.45
471.99	135.47
472.419	135.47
472.849	266.54
473.278	239.84
473.707	201
474.136	254.4
474.566	145.18
474.995	217.99
475.424	201
475.853	217.99
476.282	169.45
476.711	157.31
477.14	159.74
477.569	154.89
477.997	167.02
478.426	123.33
478.855	164.6
479.283	181.59
479.712	230.13
480.141	159.74
480.569	167.02
480.998	130.61
481.426	203.43
481.854	227.7
482.283	193.72
482.711	159.74
483.139	169.45
483.567	133.04
483.995	210.71
484.424	118.48
484.852	140.32
485.28	193.72
485.708	140.32
486.135	196.15
486.563	191.3
486.991	186.44
487.419	203.43
487.847	191.3
488.274	179.16
488.702	147.61
489.129	167.02
489.557	184.01
489.984	176.73
490.412	184.01
490.839	145.18
491.266	167.02
491.694	193.72
492.121	249.55
492.548	152.46
492.975	225.28
493.402	154.89
493.829	208.29
494.256	191.3
494.683	123.33
495.11	108.77
495.537	150.03
495.964	125.76
496.39	152.46
496.817	145.18
497.244	152.46
497.67	125.76
498.097	244.69
498.523	145.18
498.95	167.02
499.376	176.73
499.803	140.32
500.229	135.47
500.655	133.04
501.081	169.45
501.508	171.88
501.934	167.02
502.36	147.61
502.786	174.3
503.212	181.59
503.638	167.02
504.064	208.29
504.489	137.9
504.915	222.85
505.341	103.92
505.767	184.01
506.192	193.72
506.618	217.99
507.043	196.15
507.469	193.72
507.894	162.17
508.32	147.61
508.745	167.02
509.17	186.44
509.596	152.46
510.021	147.61
510.446	118.48
510.871	142.75
511.296	205.86
511.721	118.48
512.146	113.62
512.571	140.32
512.996	176.73
513.421	179.16
513.845	201
514.27	159.74
514.695	196.15
515.119	137.9
515.544	147.61
515.969	152.46
516.393	162.17
516.817	96.63
517.242	201
517.666	147.61
518.09	171.88
518.515	171.88
518.939	196.15
519.363	341.78
519.787	174.3
520.211	157.31
520.635	152.46
521.059	150.03
521.483	203.43
521.907	162.17
522.331	213.14
522.754	152.46
523.178	176.73
523.602	179.16
524.025	142.75
524.449	268.97
524.872	167.02
525.296	118.48
525.719	120.91
526.143	217.99
526.566	118.48
526.989	184.01
527.412	135.47
527.836	103.92
528.259	196.15
528.682	162.17
529.105	176.73
529.528	140.32
529.951	186.44
530.374	120.91
530.796	162.17
531.219	215.57
531.642	203.43
532.065	101.49
532.487	113.62
532.91	188.87
533.332	171.88
533.755	159.74
534.177	147.61
534.6	174.3
535.022	191.3
535.444	179.16
535.867	164.6
536.289	186.44
536.711	244.69
537.133	140.32
537.555	203.43
537.977	184.01
538.399	205.86
538.821	188.87
539.243	184.01
539.665	145.18
540.086	213.14
540.508	191.3
540.93	116.05
541.351	251.98
541.773	237.41
542.195	227.7
542.616	191.3
543.037	239.84
543.459	208.29
543.88	220.42
544.301	249.55
544.723	181.59
545.144	230.13
545.565	208.29
545.986	188.87
546.407	140.32
546.828	171.88
547.249	152.46
547.67	210.71
548.091	232.56
548.512	157.31
548.932	145.18
549.353	169.45
549.774	176.73
550.194	264.11
550.615	152.46
551.035	162.17
551.456	193.72
551.876	174.3
552.296	188.87
552.717	171.88
553.137	152.46
553.557	217.99
553.977	227.7
554.397	167.02
554.817	150.03
555.237	220.42
555.657	205.86
556.077	196.15
556.497	169.45
556.917	191.3
557.337	184.01
557.756	176.73
558.176	137.9
558.596	152.46
559.015	128.19
559.435	179.16
559.854	167.02
560.274	174.3
560.693	191.3
561.112	191.3
561.532	130.61
561.951	111.2
562.37	118.48
562.789	94.21
563.208	137.9
563.627	208.29
564.046	213.14
564.465	193.72
564.884	167.02
565.303	157.31
565.722	152.46
566.14	162.17
566.559	135.47
566.978	264.11
567.396	191.3
567.815	186.44
568.233	193.72
568.652	227.7
569.07	186.44
569.489	147.61
569.907	174.3
570.325	133.04
570.743	205.86
571.161	162.17
571.58	205.86
571.998	220.42
572.416	232.56
572.833	176.73
573.251	159.74
573.669	186.44
574.087	159.74
574.505	157.31
574.922	159.74
575.34	125.76
575.758	208.29
576.175	167.02
576.593	145.18
577.01	125.76
577.428	128.19
577.845	1951.03
578.262	329.65
578.68	193.72
579.097	181.59
579.514	137.9
579.931	94.21
580.348	120.91
580.765	164.6
581.182	116.05
581.599	184.01
582.016	152.46
582.433	159.74
582.849	184.01
583.266	108.77
583.683	198.58
584.099	186.44
584.516	162.17
584.933	174.3
585.349	184.01
585.765	210.71
586.182	188.87
586.598	220.42
587.014	125.76
587.431	217.99
587.847	140.32
588.263	157.31
588.679	181.59
589.095	162.17
589.511	193.72
589.927	191.3
590.343	142.75
590.759	164.6
591.174	234.99
591.59	142.75
592.006	162.17
592.421	123.33
592.837	142.75
593.252	169.45
593.668	164.6
594.083	239.84
594.499	159.74
594.914	152.46
595.329	179.16
595.745	101.49
596.16	181.59
596.575	230.13
596.99	150.03
597.405	145.18
597.82	152.46
598.235	174.3
598.65	157.31
599.065	201
599.479	217.99
599.894	103.92
600.309	201
600.724	198.58
601.138	217.99
601.553	196.15
601.967	205.86
602.382	188.87
602.796	145.18
603.21	176.73
603.625	152.46
604.039	137.9
604.453	152.46
604.867	251.98
605.281	171.88
605.695	184.01
606.109	191.3
606.523	167.02
606.937	205.86
607.351	261.68
607.765	142.75
608.178	215.57
608.592	130.61
609.006	193.72
609.419	239.84
609.833	188.87
610.246	171.88
610.66	213.14
611.073	247.12
611.487	198.58
611.9	176.73
612.313	142.75
612.726	186.44
613.139	201
613.553	120.91
613.966	179.16
614.379	142.75
614.792	198.58
615.204	179.16
615.617	191.3
616.03	222.85
616.443	101.49
616.856	147.61
617.268	120.91
617.681	205.86
618.093	193.72
618.506	103.92
618.918	188.87
619.331	142.75
619.743	150.03
620.155	89.35
620.568	169.45
620.98	159.74
621.392	157.31
621.804	208.29
622.216	203.43
622.628	154.89
623.04	179.16
623.452	208.29
623.864	176.73
624.276	184.01
624.687	159.74
625.099	113.62
625.511	164.6
625.922	201
626.334	96.63
626.745	169.45
627.157	159.74
627.568	137.9
627.979	208.29
628.391	174.3
628.802	188.87
629.213	188.87
629.624	227.7
630.035	167.02
630.446	157.31
630.857	130.61
631.268	169.45
631.679	150.03
632.09	176.73
632.501	169.45
632.912	145.18
633.322	215.57
633.733	164.6
634.144	135.47
634.554	147.61
634.965	157.31
635.375	169.45
635.785	120.91
636.196	239.84
636.606	40.81
637.016	128.19
637.427	227.7
637.837	169.45
638.247	225.28
638.657	164.6
639.067	191.3
639.477	116.05
639.887	247.12
640.297	152.46
640.706	159.74
641.116	196.15
641.526	72.36
641.935	188.87
642.345	147.61
642.755	99.06
643.164	227.7
643.573	222.85
643.983	96.63
644.392	164.6
644.801	162.17
645.211	145.18
645.62	111.2
646.029	181.59
646.438	94.21
646.847	120.91
647.256	164.6
647.665	103.92
648.074	159.74
648.483	145.18
648.892	130.61
649.3	154.89
649.709	130.61
650.118	133.04
650.526	86.92
650.935	77.22
651.343	169.45
651.752	201
652.16	145.18
652.568	123.33
652.977	147.61
653.385	191.3
653.793	213.14
654.201	152.46
654.609	103.92
655.017	145.18
655.425	145.18
655.833	164.6
656.241	174.3
656.649	179.16
657.057	196.15
657.464	145.18
657.872	111.2
658.28	167.02
658.687	196.15
659.095	159.74
659.502	147.61
659.91	208.29
660.317	130.61
660.724	137.9
661.132	140.32
661.539	188.87
661.946	164.6
662.353	108.77
662.76	106.34
663.167	94.21
663.574	91.78
663.981	103.92
664.388	176.73
664.795	140.32
665.202	176.73
665.608	201
666.015	140.32
666.422	157.31
666.828	193.72
667.235	176.73
667.641	186.44
668.047	137.9
668.454	196.15
668.86	135.47
669.266	140.32
669.673	118.48
670.079	152.46
670.485	184.01
670.891	140.32
671.297	137.9
671.703	198.58
672.109	113.62
672.515	96.63
672.92	162.17
673.326	196.15
673.732	210.71
674.138	152.46
674.543	150.03
674.949	244.69
675.354	191.3
675.76	142.75
676.165	208.29
676.57	116.05
676.976	196.15
677.381	159.74
677.786	106.34
678.191	145.18
678.596	208.29
679.001	125.76
679.406	154.89
679.811	154.89
680.216	128.19
680.621	142.75
681.026	128.19
681.43	164.6
681.835	198.58
682.24	205.86
682.644	113.62
683.049	137.9
683.453	94.21
683.858	150.03
684.262	111.2
684.667	147.61
685.071	222.85
685.475	164.6
685.879	106.34
686.283	125.76
686.687	193.72
687.091	164.6
687.495	201
687.899	184.01
688.303	123.33
688.707	193.72
689.111	152.46
689.514	140.32
689.918	118.48
690.322	135.47
690.725	140.32
691.129	140.32
691.532	130.61
691.936	193.72
692.339	193.72
692.742	137.9
693.146	174.3
693.549	169.45
693.952	174.3
694.355	225.28
694.758	162.17
695.161	125.76
695.564	239.84
695.967	225.28
696.37	77.22
696.773	130.61
697.175	201
697.578	140.32
697.981	154.89
698.383	142.75
698.786	157.31
699.188	205.86
699.591	133.04
699.993	120.91
700.395	169.45
700.798	208.29
701.2	174.3
701.602	169.45
702.004	162.17
702.406	220.42
702.808	142.75
703.21	184.01
703.612	222.85
704.014	167.02
704.416	222.85
704.818	251.98
705.219	145.18
705.621	186.44
706.023	227.7
706.424	220.42
706.826	188.87
707.227	208.29
707.629	285.96
708.03	254.4
708.431	193.72
708.832	307.8
709.234	201
709.635	290.81
710.036	171.88
710.437	239.84
710.838	220.42
711.239	193.72
711.64	271.39
712.041	220.42
712.441	220.42
712.842	205.86
713.243	283.53
713.643	273.82
714.044	242.27
714.445	217.99
714.845	268.97
715.246	264.11
715.646	196.15
716.046	205.86
716.447	288.38
716.847	322.37
717.247	266.54
717.647	329.65
718.047	310.23
718.447	281.1
718.847	230.13
719.247	319.94
719.647	281.1
720.047	334.5
720.446	375.76
720.846	288.38
721.246	334.5
721.645	336.93
722.045	409.75
722.444	300.52
722.844	375.76
723.243	322.37
723.643	344.21
724.042	431.59
724.441	414.6
724.84	378.19
725.24	366.06
725.639	383.05
726.038	441.3
726.437	414.6
726.836	370.91
727.234	521.4
727.633	463.14
728.032	586.93
728.431	535.96
728.83	594.21
729.228	645.19
729.627	630.62
730.025	647.61
730.424	608.78
730.822	815.09
731.22	802.96
731.619	810.24
732.017	895.19
732.415	972.86
732.813	1096.65
733.212	1052.96
733.61	1205.87
734.008	1249.56
734.406	1356.36
734.803	1497.14
735.201	1531.12
735.599	1667.05
735.997	1829.67
736.395	1904.91
736.792	2116.08
737.19	2128.22
737.587	2269
737.985	2254.43
738.382	2460.75
738.78	2642.79
739.177	2761.72
739.574	2931.63
739.971	3130.66
740.369	3188.91
740.766	3460.76
741.163	3603.97
741.56	3732.61
741.957	3897.66
742.354	3936.5
742.751	4179.22
743.147	4254.47
743.544	4436.51
743.941	4620.98
744.338	5101.57
744.734	5222.93
745.131	5579.73
745.527	5807.89
745.924	5946.24
746.32	6278.77
746.716	6579.74
747.113	7128.3
747.509	7453.54
747.905	7737.53
748.301	8184.14
748.697	8371.03
749.093	8519.09
749.489	9050.66
749.885	9773.97
750.281	10307.96
750.677	10744.86
751.073	10800.68
751.468	11077.39
751.864	11553.12
752.26	12133.23
752.655	13002.17
753.051	13553.15
753.446	14058.02
753.842	14308.02
754.237	14482.78
754.632	14791.04
755.028	15218.23
755.423	16150.28
755.818	16609.03
756.213	17261.95
756.608	16948.84
757.003	16844.47
757.398	16509.51
757.793	17312.92
758.188	18177.01
758.583	19135.76
758.977	19371.21
759.372	19946.46
759.767	20130.93
760.161	20609.09
760.556	21293.57
760.95	22609.12
761.345	24232.93
761.739	26201.41
762.133	27131.03
762.527	28121.34
762.922	27711.14
763.316	27740.27
763.71	28143.19
764.104	28749.99
764.498	30427.2
764.892	32101.99
765.286	33538.9
765.68	34213.67
766.073	33995.22
766.467	33303.46
766.861	33514.63
767.255	34626.3
767.648	36366.62
768.042	38687.04
768.435	40636.1
768.829	41519.61
769.222	41611.84
769.615	41330.28
770.008	38915.2
770.402	38507.43
770.795	39359.38
771.188	41643.4
771.581	42890.99
771.974	43997.8
772.367	44128.87
772.76	43840.03
773.153	41687.09
773.545	40279.3
773.938	40917.66
774.331	40262.31
774.724	41449.22
775.116	45221.12
775.509	48269.71
775.901	51279.47
776.294	50857.13
776.686	50568.29
777.078	50179.94
777.471	48881.37
777.863	49694.49
778.255	51269.76
778.647	53954.27
779.039	55823.23
779.431	56444.6
779.823	57201.89
780.215	57701.9
780.607	56699.46
780.999	56306.25
781.39	54692.14
781.782	54345.05
782.174	54881.47
782.565	56449.45
782.957	57427.62
783.348	60133.98
783.74	60558.74
784.131	60590.29
784.522	59920.38
784.914	58267.44
785.305	56862.08
785.696	55308.66
786.087	54801.37
786.478	53636.3
786.869	53476.1
787.26	54430
787.651	54689.72
788.042	55951.87
788.433	55425.16
788.823	54318.35
789.214	52747.94
789.605	50218.77
789.995	48672.63
790.386	45796.37
790.776	45189.57
791.167	45303.65
791.557	47182.32
791.948	49784.3
792.338	51429.96
792.728	54010.09
793.118	54267.38
793.508	53910.58
793.898	53519.79
794.288	52478.52
794.678	50007.6
795.068	49393.52
795.458	48942.05
795.848	48908.07
796.238	48881.37
796.627	50442.08
797.017	50978.49
797.406	52330.46
797.796	53267.36
798.185	54769.81
798.575	54228.54
798.964	53359.6
799.354	51944.53
799.743	51230.92
800.132	49881.39
800.521	49082.83
800.91	48019.71
801.299	48187.19
801.688	48767.29
802.077	49102.25
802.466	50393.53
802.855	52165.4
803.244	51226.07
803.633	51247.91
804.021	51044.03
804.41	49041.57
804.799	47211.44
805.187	44342.47
805.576	42284.18
805.964	40568.14
806.352	38660.34
806.741	38538.98
807.129	37898.19
807.517	38631.21
807.905	39432.2
808.293	40660.37
808.681	42590.01
809.069	42844.87
809.457	44264.8
809.845	43905.57
810.233	43985.67
810.621	43551.19
811.009	42871.57
811.396	41250.19
811.784	39922.5
812.171	37995.28
812.559	37781.69
812.946	36903.03
813.334	36233.12
813.721	36092.34
814.108	35747.67
814.496	36225.84
814.883	37109.35
815.27	38471.02
815.657	38725.88
816.044	39805.99
816.431	39577.83
816.818	38708.88
817.205	37519.55
817.592	37536.54
817.979	35754.96
818.365	34262.21
818.752	32628.69
819.139	30458.76
819.525	29043.69
819.912	27796.09
820.298	27463.56
820.685	26635.88
821.071	26283.93
821.457	26383.45
821.843	25473.24
822.23	25650.43
822.616	25575.19
823.002	24672.26
823.388	24628.57
823.774	24055.74
824.16	23929.53
824.546	22776.6
824.931	22495.04
825.317	21948.92
825.703	20657.63
826.089	19558.1
826.474	18885.76
826.86	17842.06
827.245	17055.64
827.631	16817.77
828.016	16041.06
828.401	15664.84
828.787	15509.49
829.172	15575.03
829.557	15123.57
829.942	14890.55
830.327	15269.2
830.712	15453.67
831.097	15140.56
831.482	15550.76
831.867	15291.04
832.252	15193.96
832.636	15101.72
833.021	14975.51
833.406	14657.54
833.79	14334.72
834.175	13312.86
834.559	12844.4
834.944	12351.68
835.328	11713.32
835.713	11055.54
836.097	10441.45
836.481	9640.47
836.865	9006.97
837.249	8817.64
837.633	8247.25
838.017	8082.19
838.401	7907.43
838.785	7392.86
839.169	7286.07
839.553	7159.85
839.937	6902.56
840.32	6890.43
840.704	6671.98
841.087	6582.17
841.471	6659.84
841.854	6390.42
842.238	6392.85
842.621	6339.45
843.004	6128.28
843.388	6201.1
843.771	6169.54
844.154	6026.34
844.537	6065.17
844.92	5844.3
845.303	5531.18
845.686	5351.57
846.069	4873.41
846.452	4907.39
846.834	4722.92
847.217	4414.66
847.6	4176.79
847.982	4048.15
848.365	4023.88
848.748	3698.63
849.13	3509.31
849.512	3533.58
849.895	3414.65
850.277	3281.15
850.659	3065.13
851.041	3065.13
851.423	3040.85
851.806	3014.15
852.188	3169.5
852.57	2909.78
852.951	2931.63
853.333	2987.46
853.715	2870.95
854.097	2849.1
854.479	2829.69
854.86	2756.87
855.242	2771.43
855.623	2635.51
856.005	2650.07
856.386	2552.98
856.768	2329.68
857.149	2317.54
857.53	2254.43
857.911	2285.99
858.292	2184.04
858.674	1963.17
859.055	1955.89
859.436	1810.25
859.817	1703.45
860.197	1735.01
860.578	1637.92
860.959	1565.1
861.34	1540.83
861.72	1460.73
862.101	1400.05
862.482	1215.58
862.862	1302.96
863.243	1196.17
863.623	1256.85
864.003	1116.07
864.384	1099.08
864.764	1033.54
865.144	907.33
865.524	989.85
865.904	938.88
866.284	946.16
866.664	856.35
867.044	841.79
867.424	790.82
867.804	824.8
868.183	880.63
868.563	701.01
868.943	676.74
869.322	628.2
869.702	669.46
870.081	654.89
870.461	531.11
870.84	625.77
871.22	603.92
871.599	647.61
871.978	565.09
872.357	475.28
872.736	562.66
873.115	414.6
873.494	489.84
873.873	400.04
874.252	436.44
874.631	341.78
875.01	361.2
875.388	397.61
875.767	366.06
876.146	361.2
876.524	443.73
876.903	319.94
877.281	349.06
877.66	339.36
878.038	278.68
878.416	315.08
878.794	317.51
879.173	319.94
879.551	322.37
879.929	285.96
880.307	251.98
880.685	295.67
881.063	261.68
881.441	259.26
881.818	312.66
882.196	327.22
882.574	259.26
882.951	225.28
883.329	259.26
883.707	208.29
884.084	264.11
884.461	247.12
884.839	266.54
885.216	225.28
885.593	232.56
885.971	283.53
886.348	191.3
886.725	232.56
887.102	174.3
887.479	290.81
887.856	222.85
888.233	150.03
888.609	239.84
888.986	164.6
889.363	147.61
889.74	184.01
890.116	215.57
890.493	213.14
890.869	152.46
891.246	222.85
891.622	188.87
891.998	164.6
892.375	99.06
892.751	249.55
893.127	220.42
893.503	106.34
893.879	181.59
894.255	201
894.631	174.3
895.007	130.61
895.383	96.63
895.759	237.41
896.134	142.75
896.51	227.7
896.886	201
897.261	145.18
897.637	164.6
898.012	159.74
898.388	140.32
898.763	130.61
899.138	142.75
899.514	128.19
899.889	135.47
900.264	150.03
900.639	145.18
901.014	84.5
901.389	167.02
901.764	118.48
902.139	152.46
902.513	147.61
902.888	133.04
903.263	113.62
903.638	72.36
904.012	62.65
904.387	171.88
904.761	191.3
905.136	152.46
905.51	111.2
905.884	145.18
906.259	99.06
906.633	118.48
907.007	145.18
907.381	128.19
907.755	128.19
908.129	86.92
908.503	133.04
908.877	152.46
909.251	128.19
909.624	188.87
909.998	145.18
910.372	77.22
910.745	113.62
911.119	65.08
911.492	86.92
911.866	118.48
912.239	133.04
912.612	150.03
912.986	171.88
913.359	167.02
913.732	128.19
914.105	164.6
914.478	135.47
914.851	128.19
915.224	188.87
915.597	201
915.97	103.92
916.343	120.91
916.715	179.16
917.088	101.49
917.461	203.43
917.833	111.2
918.206	84.5
918.578	135.47
918.951	186.44
919.323	135.47
919.695	145.18
920.067	145.18
920.44	157.31
920.812	40.81
921.184	142.75
921.556	188.87
921.928	167.02
922.3	133.04
922.672	174.3
923.043	154.89
923.415	150.03
923.787	79.64
924.158	137.9
924.53	77.22
924.901	116.05
925.273	77.22
925.644	108.77
926.016	164.6
926.387	167.02
926.758	77.22
927.129	128.19
927.5	130.61
927.872	147.61
928.243	169.45
928.613	128.19
928.984	106.34
929.355	186.44
929.726	135.47
930.097	103.92
930.467	169.45
930.838	164.6
931.209	152.46
931.579	62.65
931.95	147.61
932.32	96.63
932.69	164.6
933.061	77.22
933.431	120.91
933.801	154.89
934.171	164.6
934.541	86.92
934.911	111.2
935.281	157.31
935.651	116.05
936.021	142.75
936.391	116.05
936.761	123.33
937.13	94.21
937.5	116.05
937.87	184.01
938.239	128.19
938.609	159.74
938.978	140.32
939.347	176.73
939.717	135.47
940.086	186.44
940.455	67.51
940.824	171.88
941.193	91.78
941.562	147.61
941.931	108.77
942.3	188.87
942.669	130.61
943.038	169.45
943.407	181.59
943.775	135.47
944.144	176.73
944.513	162.17
944.881	150.03
945.25	91.78
945.618	181.59
945.986	171.88
946.355	99.06
946.723	188.87
947.091	74.79
947.459	130.61
947.827	116.05
948.195	184.01
948.563	179.16
948.931	188.87
949.299	130.61
949.667	145.18
950.035	79.64
950.402	140.32
950.77	208.29
951.138	69.93
951.505	147.61
951.873	103.92
952.24	140.32
952.607	169.45
952.975	108.77
953.342	116.05
953.709	162.17
954.076	142.75
954.443	72.36
954.81	169.45
955.177	128.19
955.544	150.03
955.911	186.44
956.278	142.75
956.645	154.89
957.012	74.79
957.378	111.2
957.745	137.9
958.111	157.31
958.478	201
958.844	191.3
959.211	169.45
959.577	123.33
959.943	101.49
960.309	179.16
960.675	174.3
961.042	179.16
961.408	130.61
961.774	120.91
962.139	157.31
962.505	128.19
962.871	118.48
963.237	103.92
963.603	193.72
963.968	230.13
964.334	167.02
964.699	99.06
965.065	154.89
965.43	120.91
965.796	116.05
966.161	150.03
966.526	137.9
966.891	123.33
967.256	152.46
967.622	150.03
967.987	72.36
968.352	164.6
968.716	62.65
969.081	142.75
969.446	111.2
969.811	89.35
970.176	111.2
970.54	99.06
970.905	111.2
971.269	123.33
971.634	96.63
971.998	94.21
972.363	137.9
972.727	57.8
973.091	106.34
973.455	145.18
973.819	152.46
974.183	167.02
974.547	116.05
974.911	101.49
975.275	167.02
975.639	94.21
976.003	215.57
976.367	57.8
976.73	113.62
977.094	196.15
977.458	181.59
977.821	152.46
978.185	133.04
978.548	133.04
978.911	133.04
979.275	125.76
979.638	118.48
980.001	84.5
980.364	108.77
980.727	154.89
981.09	133.04
981.453	72.36
981.816	171.88
982.179	167.02
982.542	120.91
982.905	77.22
983.267	137.9
983.63	164.6
983.992	164.6
984.355	154.89
984.717	108.77
985.08	106.34
985.442	147.61
985.804	142.75
986.167	133.04
986.529	140.32
986.891	193.72
987.253	186.44
987.615	164.6
987.977	154.89
988.339	179.16
988.701	154.89
989.062	179.16
989.424	125.76
989.786	198.58
990.147	213.14
990.509	128.19
990.87	208.29
991.232	167.02
991.593	84.5
991.955	118.48
992.316	157.31
992.677	118.48
993.038	140.32
993.399	186.44
993.76	113.62
994.121	150.03
994.482	96.63
994.843	113.62
995.204	167.02
995.565	150.03
995.926	152.46
996.286	125.76
996.647	157.31
997.007	176.73
997.368	157.31
997.728	125.76
998.089	137.9
998.449	86.92
998.809	106.34
999.169	125.76
999.53	152.46
999.89	108.77
1000.25	186.44
1000.61	174.3
1000.97	169.45
1001.329	101.49
1001.689	125.76
1002.049	215.57
1002.409	142.75
1002.768	103.92
1003.128	113.62
1003.487	133.04
1003.847	128.19
1004.206	103.92
1004.566	150.03
1004.925	86.92
1005.284	116.05
1005.643	101.49
1006.003	116.05
1006.362	176.73
1006.721	201
1007.08	137.9
1007.438	86.92
1007.797	188.87
1008.156	142.75
1008.515	193.72
1008.874	150.03
1009.232	176.73
1009.591	135.47
1009.949	113.62
1010.308	208.29
1010.666	152.46
1011.024	111.2
1011.383	103.92
1011.741	106.34
1012.099	69.93
1012.457	113.62
1012.815	89.35
1013.173	130.61
1013.531	184.01
1013.889	225.28
1014.247	123.33
1014.605	69.93
1014.962	103.92
1015.32	45.66
1015.678	94.21
1016.035	159.74
1016.393	108.77
1016.75	84.5
1017.107	130.61
1017.465	137.9
1017.822	84.5
1018.179	201
1018.536	184.01
1018.894	174.3
1019.251	171.88
1019.608	86.92
1019.964	103.92
1020.321	111.2
1020.678	118.48
1021.035	145.18
1021.392	164.6
1021.748	67.51
1022.105	118.48
1022.461	154.89
1022.818	147.61
1023.174	147.61
1023.531	84.5
1023.887	52.94
1024.243	103.92
1024.599	67.51
1024.955	106.34
1025.311	188.87
1025.667	74.79
1026.023	116.05
1026.379	101.49
1026.735	133.04
1027.091	133.04
1027.447	94.21
