189.514	74.49
189.973	74.49
190.431	74.49
190.889	1.67
191.348	-66.29
191.806	4.1
192.264	-29.89
192.722	-15.32
193.18	11.38
193.638	16.23
194.096	-42.02
194.554	-34.74
195.012	-10.47
195.47	-10.47
195.928	-20.18
196.385	-32.31
196.843	-12.89
197.301	35.65
197.758	-0.76
198.216	30.8
198.674	16.23
199.131	98.76
199.589	38.08
200.046	74.49
200.503	67.2
200.961	93.9
201.418	108.47
201.875	130.31
202.332	74.49
202.79	93.9
203.247	106.04
203.704	108.47
204.161	195.85
204.618	110.89
205.075	169.15
205.532	81.77
205.989	79.34
206.445	161.87
206.902	154.58
207.359	169.15
207.816	176.43
208.272	164.29
208.729	132.74
209.185	123.03
209.642	183.71
210.098	110.89
210.555	193.42
211.011	144.87
211.467	142.45
211.924	135.17
212.38	59.92
212.836	152.16
213.292	157.01
213.748	149.73
214.204	186.14
214.66	120.6
215.116	137.59
215.572	147.3
216.028	176.43
216.484	188.56
216.94	190.99
217.396	79.34
217.851	159.44
218.307	106.04
218.763	118.18
219.218	178.86
219.674	144.87
220.129	198.27
220.585	115.75
221.04	123.03
221.496	106.04
221.951	30.8
222.406	140.02
222.861	59.92
223.317	118.18
223.772	127.88
224.227	190.99
224.682	166.72
225.137	142.45
225.592	195.85
226.047	161.87
226.502	110.89
226.957	166.72
227.411	176.43
227.866	110.89
228.321	135.17
228.776	89.05
229.23	108.47
229.685	171.57
230.139	149.73
230.594	171.57
231.048	149.73
231.503	79.34
231.957	140.02
232.411	152.16
232.865	186.14
233.32	110.89
233.774	147.3
234.228	144.87
234.682	96.33
235.136	142.45
235.59	137.59
236.044	200.7
236.498	96.33
236.952	200.7
237.406	176.43
237.86	132.74
238.313	91.48
238.767	137.59
239.221	127.88
239.674	268.66
240.128	118.18
240.581	154.58
241.035	118.18
241.488	149.73
241.942	89.05
242.395	147.3
242.848	108.47
243.301	101.18
243.755	237.11
244.208	123.03
244.661	174
245.114	186.14
245.567	118.18
246.02	178.86
246.473	81.77
246.926	127.88
247.379	108.47
247.832	154.58
248.284	142.45
248.737	171.57
249.19	106.04
249.642	132.74
250.095	118.18
250.547	110.89
251	103.61
251.452	103.61
251.905	125.46
252.357	161.87
252.81	176.43
253.262	125.46
253.714	142.45
254.166	125.46
254.618	89.05
255.07	135.17
255.523	132.74
255.975	161.87
256.427	76.91
256.878	183.71
257.33	159.44
257.782	140.02
258.234	190.99
258.686	108.47
259.137	142.45
259.589	166.72
260.041	89.05
260.492	186.14
260.944	140.02
261.395	108.47
261.847	174
262.298	164.29
262.749	108.47
263.201	164.29
263.652	98.76
264.103	154.58
264.554	169.15
265.005	123.03
265.457	120.6
265.908	186.14
266.359	166.72
266.809	137.59
267.26	154.58
267.711	72.06
268.162	106.04
268.613	154.58
269.064	203.13
269.514	115.75
269.965	147.3
270.415	157.01
270.866	149.73
271.316	140.02
271.767	96.33
272.217	193.42
272.668	169.15
273.118	198.27
273.568	161.87
274.019	161.87
274.469	96.33
274.919	183.71
275.369	132.74
275.819	181.28
276.269	157.01
276.719	132.74
277.169	123.03
277.619	178.86
278.069	164.29
278.518	200.7
278.968	108.47
279.418	166.72
279.867	152.16
280.317	127.88
280.767	178.86
281.216	171.57
281.666	178.86
282.115	142.45
282.564	135.17
283.014	190.99
283.463	227.4
283.912	207.98
284.361	144.87
284.811	132.74
285.26	96.33
285.709	152.16
286.158	115.75
286.607	113.32
287.056	127.88
287.505	161.87
287.953	176.43
288.402	212.84
288.851	127.88
289.3	127.88
289.748	142.45
290.197	224.97
290.646	130.31
291.094	76.91
291.543	108.47
291.991	149.73
292.439	137.59
292.888	118.18
293.336	169.15
293.784	142.45
294.233	132.74
294.681	161.87
295.129	174
295.577	147.3
296.025	125.46
296.473	137.59
296.921	127.88
297.369	174
297.817	103.61
298.264	144.87
298.712	188.56
299.16	144.87
299.608	147.3
300.055	137.59
300.503	127.88
300.95	91.48
301.398	130.31
301.845	113.32
302.293	103.61
302.74	186.14
303.187	169.15
303.635	166.72
304.082	103.61
304.529	140.02
304.976	127.88
305.423	149.73
305.87	149.73
306.317	115.75
306.764	210.41
307.211	115.75
307.658	135.17
308.105	154.58
308.552	120.6
308.998	181.28
309.445	244.39
309.892	157.01
310.338	169.15
310.785	152.16
311.231	135.17
311.678	110.89
312.124	125.46
312.571	147.3
313.017	132.74
313.463	103.61
313.909	200.7
314.356	166.72
314.802	130.31
315.248	142.45
315.694	132.74
316.14	98.76
316.586	183.71
317.032	135.17
317.478	176.43
317.923	144.87
318.369	164.29
318.815	106.04
319.261	144.87
319.706	69.63
320.152	174
320.597	142.45
321.043	190.99
321.488	166.72
321.934	188.56
322.379	147.3
322.824	200.7
323.27	171.57
323.715	144.87
324.16	147.3
324.605	130.31
325.05	125.46
325.495	176.43
325.94	110.89
326.385	140.02
326.83	110.89
327.275	154.58
327.72	147.3
328.165	166.72
328.61	140.02
329.054	135.17
329.499	210.41
329.943	106.04
330.388	232.25
330.832	174
331.277	169.15
331.721	103.61
332.166	178.86
332.61	130.31
333.054	125.46
333.499	142.45
333.943	149.73
334.387	210.41
334.831	144.87
335.275	91.48
335.719	72.06
336.163	62.35
336.607	166.72
337.051	188.56
337.495	164.29
337.938	161.87
338.382	125.46
338.826	154.58
339.269	106.04
339.713	169.15
340.157	103.61
340.6	186.14
341.044	96.33
341.487	144.87
341.93	115.75
342.374	123.03
342.817	108.47
343.26	159.44
343.703	120.6
344.146	161.87
344.59	106.04
345.033	137.59
345.476	176.43
345.919	142.45
346.361	161.87
346.804	186.14
347.247	108.47
347.69	193.42
348.133	96.33
348.575	178.86
349.018	101.18
349.461	140.02
349.903	161.87
350.346	120.6
350.788	186.14
351.23	108.47
351.673	127.88
352.115	164.29
352.557	188.56
353	98.76
353.442	115.75
353.884	198.27
354.326	159.44
354.768	140.02
355.21	118.18
355.652	169.15
356.094	110.89
356.536	147.3
356.978	132.74
357.419	152.16
357.861	113.32
358.303	193.42
358.744	144.87
359.186	203.13
359.627	127.88
360.069	89.05
360.51	132.74
360.952	215.26
361.393	98.76
361.834	123.03
362.276	64.78
362.717	200.7
363.158	147.3
363.599	154.58
364.04	130.31
364.481	183.71
364.922	137.59
365.363	91.48
365.804	169.15
366.245	183.71
366.686	198.27
367.126	115.75
367.567	174
368.008	164.29
368.448	174
368.889	176.43
369.33	135.17
369.77	200.7
370.21	152.16
370.651	93.9
371.091	108.47
371.531	25.94
371.972	91.48
372.412	115.75
372.852	123.03
373.292	152.16
373.732	142.45
374.172	176.43
374.612	72.06
375.052	188.56
375.492	98.76
375.932	91.48
376.372	106.04
376.811	115.75
377.251	171.57
377.691	207.98
378.13	103.61
378.57	174
379.009	205.56
379.449	108.47
379.888	169.15
380.328	159.44
380.767	147.3
381.206	176.43
381.645	123.03
382.085	127.88
382.524	74.49
382.963	103.61
383.402	140.02
383.841	127.88
384.28	195.85
384.719	157.01
385.158	101.18
385.596	144.87
386.035	96.33
386.474	149.73
386.913	123.03
387.351	220.12
387.79	101.18
388.228	186.14
388.667	142.45
389.105	171.57
389.544	110.89
389.982	183.71
390.42	183.71
390.859	147.3
391.297	188.56
391.735	125.46
392.173	113.32
392.611	140.02
393.049	137.59
393.487	130.31
393.925	135.17
394.363	101.18
394.801	166.72
395.239	149.73
395.676	103.61
396.114	171.57
396.552	118.18
396.989	98.76
397.427	171.57
397.864	164.29
398.302	178.86
398.739	76.91
399.177	169.15
399.614	152.16
400.051	113.32
400.488	246.82
400.926	176.43
401.363	181.28
401.8	164.29
402.237	142.45
402.674	154.58
403.111	142.45
403.548	113.32
403.985	183.71
404.421	147.3
404.858	149.73
405.295	241.96
405.732	161.87
406.168	118.18
406.605	106.04
407.041	137.59
407.478	164.29
407.914	161.87
408.351	152.16
408.787	127.88
409.223	62.35
409.66	205.56
410.096	79.34
410.532	193.42
410.968	76.91
411.404	120.6
411.84	64.78
412.276	142.45
412.712	152.16
413.148	161.87
413.584	190.99
414.02	174
414.455	127.88
414.891	123.03
415.327	147.3
415.762	127.88
416.198	113.32
416.633	195.85
417.069	152.16
417.504	169.15
417.94	135.17
418.375	154.58
418.81	123.03
419.245	135.17
419.681	72.06
420.116	190.99
420.551	193.42
420.986	161.87
421.421	132.74
421.856	157.01
422.291	157.01
422.726	183.71
423.16	161.87
423.595	161.87
424.03	144.87
424.464	93.9
424.899	161.87
425.334	127.88
425.768	132.74
426.203	193.42
426.637	171.57
427.071	147.3
427.506	79.34
427.94	161.87
428.374	159.44
428.809	169.15
429.243	161.87
429.677	169.15
430.111	137.59
430.545	123.03
430.979	140.02
431.413	123.03
431.847	183.71
432.28	159.44
432.714	81.77
433.148	118.18
433.582	110.89
434.015	174
434.449	144.87
434.882	135.17
435.316	159.44
435.749	176.43
436.183	169.15
436.616	149.73
437.049	113.32
437.483	103.61
437.916	149.73
438.349	154.58
438.782	137.59
439.215	127.88
439.648	164.29
440.081	142.45
440.514	195.85
440.947	203.13
441.38	159.44
441.813	120.6
442.245	227.4
442.678	118.18
443.111	193.42
443.543	79.34
443.976	147.3
444.408	159.44
444.841	135.17
445.273	149.73
445.705	193.42
446.138	169.15
446.57	110.89
447.002	142.45
447.434	203.13
447.867	140.02
448.299	166.72
448.731	181.28
449.163	176.43
449.595	188.56
450.026	171.57
450.458	113.32
450.89	217.69
451.322	183.71
451.754	210.41
452.185	120.6
452.617	193.42
453.048	147.3
453.48	176.43
453.911	181.28
454.343	212.84
454.774	106.04
455.205	203.13
455.637	188.56
456.068	130.31
456.499	212.84
456.93	212.84
457.361	171.57
457.792	210.41
458.223	207.98
458.654	203.13
459.085	190.99
459.516	234.68
459.947	183.71
460.378	237.11
460.808	200.7
461.239	137.59
461.669	164.29
462.1	183.71
462.531	181.28
462.961	212.84
463.391	154.58
463.822	217.69
464.252	193.42
464.682	195.85
465.113	174
465.543	224.97
465.973	222.55
466.403	152.16
466.833	207.98
467.263	166.72
467.693	210.41
468.123	234.68
468.553	174
468.983	203.13
469.412	127.88
469.842	210.41
470.272	186.14
470.701	149.73
471.131	96.33
471.56	220.12
471.99	203.13
472.419	142.45
472.849	234.68
473.278	178.86
473.707	222.55
474.136	224.97
474.566	203.13
474.995	152.16
475.424	198.27
475.853	161.87
476.282	169.15
476.711	169.15
477.14	125.46
477.569	110.89
477.997	171.57
478.426	149.73
478.855	144.87
479.283	164.29
479.712	115.75
480.141	103.61
480.569	212.84
480.998	120.6
481.426	127.88
481.854	120.6
482.283	198.27
482.711	123.03
483.139	190.99
483.567	144.87
483.995	125.46
484.424	193.42
484.852	181.28
485.28	171.57
485.708	147.3
486.135	171.57
486.563	154.58
486.991	137.59
487.419	186.14
487.847	157.01
488.274	169.15
488.702	183.71
489.129	149.73
489.557	149.73
489.984	195.85
490.412	176.43
490.839	157.01
491.266	135.17
491.694	190.99
492.121	144.87
492.548	190.99
492.975	166.72
493.402	113.32
493.829	205.56
494.256	174
494.683	176.43
495.11	147.3
495.537	210.41
495.964	193.42
496.39	157.01
496.817	142.45
497.244	161.87
497.67	93.9
498.097	118.18
498.523	169.15
498.95	108.47
499.376	161.87
499.803	135.17
500.229	67.2
500.655	203.13
501.081	215.26
501.508	195.85
501.934	212.84
502.36	183.71
502.786	132.74
503.212	152.16
503.638	205.56
504.064	152.16
504.489	149.73
504.915	183.71
505.341	127.88
505.767	171.57
506.192	157.01
506.618	190.99
507.043	120.6
507.469	130.31
507.894	203.13
508.32	200.7
508.745	161.87
509.17	115.75
509.596	212.84
510.021	147.3
510.446	164.29
510.871	103.61
511.296	161.87
511.721	178.86
512.146	149.73
512.571	164.29
512.996	157.01
513.421	205.56
513.845	176.43
514.27	169.15
514.695	86.62
515.119	171.57
515.544	203.13
515.969	135.17
516.393	149.73
516.817	169.15
517.242	198.27
517.666	159.44
518.09	193.42
518.515	183.71
518.939	147.3
519.363	462.84
519.787	261.38
520.211	127.88
520.635	181.28
521.059	183.71
521.483	118.18
521.907	188.56
522.331	159.44
522.754	195.85
523.178	159.44
523.602	106.04
524.025	188.56
524.449	161.87
524.872	147.3
525.296	81.77
525.719	130.31
526.143	142.45
526.566	207.98
526.989	130.31
527.412	212.84
527.836	186.14
528.259	186.14
528.682	110.89
529.105	203.13
529.528	166.72
529.951	198.27
530.374	166.72
530.796	212.84
531.219	171.57
531.642	234.68
532.065	159.44
532.487	174
532.91	171.57
533.332	101.18
533.755	144.87
534.177	125.46
534.6	174
535.022	144.87
535.444	169.15
535.867	152.16
536.289	144.87
536.711	142.45
537.133	174
537.555	229.83
537.977	193.42
538.399	174
538.821	125.46
539.243	222.55
539.665	256.53
540.086	123.03
540.508	210.41
540.93	200.7
541.351	229.83
541.773	186.14
542.195	239.54
542.616	183.71
543.037	166.72
543.459	212.84
543.88	183.71
544.301	147.3
544.723	169.15
545.144	157.01
545.565	195.85
545.986	176.43
546.407	181.28
546.828	169.15
547.249	176.43
547.67	127.88
548.091	183.71
548.512	127.88
548.932	193.42
549.353	176.43
549.774	164.29
550.194	137.59
550.615	120.6
551.035	232.25
551.456	149.73
551.876	125.46
552.296	154.58
552.717	149.73
553.137	140.02
553.557	152.16
553.977	135.17
554.397	212.84
554.817	176.43
555.237	181.28
555.657	188.56
556.077	200.7
556.497	195.85
556.917	169.15
557.337	135.17
557.756	178.86
558.176	157.01
558.596	140.02
559.015	190.99
559.435	169.15
559.854	147.3
560.274	161.87
560.693	144.87
561.112	157.01
561.532	154.58
561.951	174
562.37	142.45
562.789	118.18
563.208	142.45
563.627	190.99
564.046	130.31
564.465	193.42
564.884	205.56
565.303	183.71
565.722	178.86
566.14	154.58
566.559	193.42
566.978	220.12
567.396	171.57
567.815	178.86
568.233	239.54
568.652	171.57
569.07	123.03
569.489	190.99
569.907	154.58
570.325	186.14
570.743	178.86
571.161	147.3
571.58	171.57
571.998	232.25
572.416	193.42
572.833	140.02
573.251	164.29
573.669	154.58
574.087	157.01
574.505	86.62
574.922	132.74
575.34	157.01
575.758	137.59
576.175	169.15
576.593	190.99
577.01	205.56
577.428	115.75
577.845	1572.08
578.262	278.37
578.68	101.18
579.097	152.16
579.514	154.58
579.931	93.9
580.348	76.91
580.765	147.3
581.182	171.57
581.599	190.99
582.016	174
582.433	195.85
582.849	176.43
583.266	174
583.683	186.14
584.099	200.7
584.516	135.17
584.933	135.17
585.349	96.33
585.765	149.73
586.182	190.99
586.598	181.28
587.014	140.02
587.431	176.43
587.847	118.18
588.263	125.46
588.679	198.27
589.095	98.76
589.511	169.15
589.927	30.8
590.343	210.41
590.759	135.17
591.174	91.48
591.59	164.29
592.006	123.03
592.421	123.03
592.837	142.45
593.252	178.86
593.668	113.32
594.083	142.45
594.499	183.71
594.914	161.87
595.329	81.77
595.745	140.02
596.16	171.57
596.575	169.15
596.99	132.74
597.405	103.61
597.82	106.04
598.235	149.73
598.65	108.47
599.065	166.72
599.479	186.14
599.894	142.45
600.309	181.28
600.724	203.13
601.138	190.99
601.553	137.59
601.967	98.76
602.382	125.46
602.796	157.01
603.21	193.42
603.625	188.56
604.039	144.87
604.453	137.59
604.867	154.58
605.281	135.17
605.695	244.39
606.109	140.02
606.523	120.6
606.937	106.04
607.351	312.35
607.765	174
608.178	132.74
608.592	159.44
609.006	164.29
609.419	190.99
609.833	152.16
610.246	144.87
610.66	193.42
611.073	178.86
611.487	220.12
611.9	144.87
612.313	176.43
612.726	113.32
613.139	198.27
613.553	200.7
613.966	241.96
614.379	198.27
614.792	174
615.204	166.72
615.617	130.31
616.03	137.59
616.443	144.87
616.856	169.15
617.268	183.71
617.681	149.73
618.093	123.03
618.506	152.16
618.918	142.45
619.331	246.82
619.743	171.57
620.155	84.19
620.568	164.29
620.98	193.42
621.392	181.28
621.804	246.82
622.216	140.02
622.628	135.17
623.04	193.42
623.452	135.17
623.864	132.74
624.276	183.71
624.687	127.88
625.099	171.57
625.511	118.18
625.922	188.56
626.334	96.33
626.745	98.76
627.157	147.3
627.568	205.56
627.979	59.92
628.391	118.18
628.802	96.33
629.213	178.86
629.624	127.88
630.035	149.73
630.446	157.01
630.857	103.61
631.268	67.2
631.679	147.3
632.09	86.62
632.501	152.16
632.912	147.3
633.322	140.02
633.733	115.75
634.144	212.84
634.554	161.87
634.965	174
635.375	123.03
635.785	169.15
636.196	212.84
636.606	166.72
637.016	74.49
637.427	118.18
637.837	186.14
638.247	169.15
638.657	159.44
639.067	198.27
639.477	125.46
639.887	159.44
640.297	130.31
640.706	198.27
641.116	190.99
641.526	115.75
641.935	161.87
642.345	106.04
642.755	164.29
643.164	72.06
643.573	174
643.983	152.16
644.392	198.27
644.801	169.15
645.211	195.85
645.62	207.98
646.029	137.59
646.438	198.27
646.847	147.3
647.256	144.87
647.665	144.87
648.074	113.32
648.483	140.02
648.892	120.6
649.3	130.31
649.709	203.13
650.118	142.45
650.526	76.91
650.935	132.74
651.343	200.7
651.752	227.4
652.16	137.59
652.568	154.58
652.977	140.02
653.385	183.71
653.793	101.18
654.201	174
654.609	176.43
655.017	144.87
655.425	106.04
655.833	144.87
656.241	188.56
656.649	207.98
657.057	152.16
657.464	144.87
657.872	171.57
658.28	171.57
658.687	154.58
659.095	132.74
659.502	176.43
659.91	79.34
660.317	132.74
660.724	120.6
661.132	159.44
661.539	186.14
661.946	176.43
662.353	169.15
662.76	113.32
663.167	101.18
663.574	137.59
663.981	171.57
664.388	207.98
664.795	157.01
665.202	135.17
665.608	130.31
666.015	98.76
666.422	164.29
666.828	137.59
667.235	166.72
667.641	154.58
668.047	152.16
668.454	159.44
668.86	166.72
669.266	135.17
669.673	93.9
670.079	169.15
670.485	127.88
670.891	159.44
671.297	118.18
671.703	113.32
672.109	130.31
672.515	190.99
672.92	137.59
673.326	190.99
673.732	93.9
674.138	149.73
674.543	227.4
674.949	67.2
675.354	96.33
675.76	193.42
676.165	118.18
676.57	115.75
676.976	86.62
677.381	130.31
677.786	188.56
678.191	174
678.596	113.32
679.001	159.44
679.406	142.45
679.811	110.89
680.216	215.26
680.621	183.71
681.026	76.91
681.43	166.72
681.835	195.85
682.24	166.72
682.644	154.58
683.049	176.43
683.453	118.18
683.858	183.71
684.262	132.74
684.667	154.58
685.071	161.87
685.475	212.84
685.879	101.18
686.283	166.72
686.687	171.57
687.091	188.56
687.495	137.59
687.899	152.16
688.303	193.42
688.707	169.15
689.111	144.87
689.514	84.19
689.918	147.3
690.322	174
690.725	154.58
691.129	176.43
691.532	132.74
691.936	103.61
692.339	135.17
692.742	101.18
693.146	147.3
693.549	234.68
693.952	159.44
694.355	142.45
694.758	186.14
695.161	108.47
695.564	227.4
695.967	222.55
696.37	115.75
696.773	169.15
697.175	193.42
697.578	210.41
697.981	157.01
698.383	132.74
698.786	161.87
699.188	174
699.591	183.71
699.993	154.58
700.395	159.44
700.798	69.63
701.2	178.86
701.602	118.18
702.004	176.43
702.406	154.58
702.808	229.83
703.21	110.89
703.612	195.85
704.014	166.72
704.416	110.89
704.818	164.29
705.219	152.16
705.621	212.84
706.023	161.87
706.424	178.86
706.826	81.77
707.227	181.28
707.629	98.76
708.03	164.29
708.431	169.15
708.832	152.16
709.234	142.45
709.635	178.86
710.036	183.71
710.437	152.16
710.838	161.87
711.239	232.25
711.64	174
712.041	166.72
712.441	166.72
712.842	224.97
713.243	224.97
713.643	181.28
714.044	135.17
714.445	183.71
714.845	217.69
715.246	164.29
715.646	227.4
716.046	200.7
716.447	234.68
716.847	183.71
717.247	144.87
717.647	215.26
718.047	203.13
718.447	181.28
718.847	169.15
719.247	285.65
719.647	217.69
720.047	217.69
720.446	237.11
720.846	256.53
721.246	290.51
721.645	275.94
722.045	239.54
722.444	249.25
722.844	217.69
723.243	273.52
723.643	268.66
724.042	176.43
724.441	246.82
724.84	176.43
725.24	290.51
725.639	290.51
726.038	244.39
726.437	261.38
726.836	256.53
727.234	227.4
727.633	305.07
728.032	239.54
728.431	249.25
728.83	305.07
729.228	275.94
729.627	331.77
730.025	263.81
730.424	397.31
730.822	363.32
731.22	397.31
731.619	407.01
732.017	387.6
732.415	465.27
732.813	431.29
733.212	455.56
733.61	518.67
734.008	535.66
734.406	547.79
734.803	489.54
735.201	591.48
735.599	657.02
735.997	671.58
736.395	737.12
736.792	741.97
737.19	756.53
737.587	870.61
737.985	819.64
738.382	921.59
738.78	960.42
739.177	974.98
739.574	1050.23
739.971	1123.05
740.369	1176.44
740.766	1217.71
741.163	1081.78
741.56	1152.17
741.957	1198.29
742.354	1237.12
742.751	1280.81
743.147	1540.53
743.544	1465.28
743.941	1550.24
744.338	1712.86
744.734	1666.74
745.131	1775.97
745.527	1892.47
745.924	1991.99
746.32	1994.42
746.716	2059.95
747.113	2055.1
747.509	2176.46
747.905	2181.31
748.301	2433.75
748.697	2535.69
749.093	2795.4
749.489	2700.74
749.885	3074.53
750.281	3188.61
750.677	3292.98
751.073	3540.56
751.468	3572.11
751.864	3664.35
752.26	3649.78
752.655	3652.21
753.051	3831.83
753.446	3863.38
753.842	3924.06
754.237	4147.36
754.632	4188.63
755.028	4334.26
755.423	4545.43
755.818	4899.8
756.213	5040.58
756.608	5132.82
757.003	5142.53
757.398	5200.78
757.793	5513.89
758.188	5509.04
758.583	5693.5
758.977	5793.02
759.372	5654.67
759.767	5632.82
760.161	5860.98
760.556	6157.1
760.95	6164.39
761.345	6336.72
761.739	6812.45
762.133	6919.25
762.527	7106.15
762.922	7348.87
763.316	8026.07
763.71	8479.96
764.104	8506.66
764.498	8846.47
764.892	9530.94
765.286	9771.24
765.68	10064.93
766.073	10361.05
766.467	10535.81
766.861	10824.65
767.255	10963
767.648	11200.87
768.042	11069.8
768.435	10979.99
768.829	10778.54
769.222	10819.8
769.615	10829.51
770.008	10727.56
770.402	10365.91
770.795	10591.64
771.188	10513.97
771.581	10448.43
771.974	10365.91
772.367	10584.36
772.76	10904.75
773.153	10703.29
773.545	10890.19
773.938	11314.95
774.331	11516.41
774.724	12084.38
775.116	13101.39
775.509	14006.74
775.901	14526.17
776.294	14919.38
776.686	14987.34
777.078	15744.63
777.471	16108.72
777.863	16941.25
778.255	17698.55
778.647	17955.83
779.039	17650
779.431	17021.35
779.823	17482.52
780.215	17518.93
780.607	16824.75
780.999	17361.16
781.39	16933.97
781.782	16705.81
782.174	16460.66
782.565	16477.65
782.957	16130.56
783.348	16234.93
783.74	16385.42
784.131	15713.08
784.522	15640.26
784.914	15130.54
785.305	15001.9
785.696	14785.88
786.087	14926.66
786.478	14370.82
786.869	14334.42
787.26	13730.04
787.651	13482.46
788.042	13467.9
788.433	13290.71
788.823	13125.66
789.214	12841.67
789.605	12819.83
789.995	12635.36
790.386	12572.25
790.776	12669.34
791.167	12538.27
791.557	12899.93
791.948	13329.55
792.338	13186.34
792.728	13696.06
793.118	13878.1
793.508	14329.56
793.898	14414.51
794.288	14339.27
794.678	14470.34
795.068	14390.24
795.458	14281.02
795.848	14569.86
796.238	14596.56
796.627	14666.95
797.017	14586.85
797.406	14603.84
797.796	14363.54
798.185	14863.55
798.575	14771.32
798.964	14895.1
799.354	14984.91
799.743	15062.58
800.132	14999.47
800.521	14865.98
800.91	15186.37
801.299	14516.46
801.688	14545.58
802.077	14557.72
802.466	14416.94
802.855	14499.47
803.244	13654.79
803.633	13528.58
804.021	13569.84
804.41	13336.83
804.799	12997.02
805.187	12431.47
805.576	12443.61
805.964	12057.68
806.352	11703.31
806.741	11273.69
807.129	11130.48
807.517	11307.67
807.905	11147.47
808.293	11064.95
808.681	11106.21
809.069	11040.68
809.457	11174.17
809.845	11009.12
810.233	11060.09
810.621	11081.94
811.009	10831.93
811.396	11055.24
811.784	11035.82
812.171	10834.36
812.559	10865.92
812.946	10540.67
813.334	10246.97
813.721	9899.88
814.108	9693.57
814.496	9608.61
814.883	9293.08
815.27	9683.86
815.657	9322.2
816.044	9234.82
816.431	9179
816.818	9176.57
817.205	8928.99
817.592	9011.52
817.979	8645.01
818.365	8596.46
818.752	8361.02
819.139	8045.48
819.525	7914.41
819.912	7698.39
820.298	7574.6
820.685	7465.38
821.071	7331.88
821.457	7307.61
821.843	7050.32
822.23	7050.32
822.616	6545.46
823.002	6450.8
823.388	6215.36
823.774	6166.81
824.16	6030.89
824.546	5882.83
824.931	6062.44
825.317	5831.86
825.703	5824.57
826.089	5756.61
826.474	5572.14
826.86	5632.82
827.245	5759.04
827.631	5521.17
828.016	5569.72
828.401	5475.05
828.787	5174.08
829.172	5072.14
829.557	5011.46
829.942	4727.47
830.327	4649.8
830.712	4681.35
831.097	4494.46
831.482	4283.29
831.867	4089.11
832.252	4067.27
832.636	3914.35
833.021	3800.27
833.406	3576.97
833.79	3647.36
834.175	3373.08
834.559	3416.77
834.944	3166.77
835.328	3115.79
835.713	2960.45
836.097	2839.09
836.481	2751.71
836.865	2737.15
837.249	2615.79
837.633	2523.55
838.017	2397.34
838.401	2351.22
838.785	2441.03
839.169	2373.06
839.553	2178.89
839.937	2193.45
840.32	2137.62
840.704	2103.64
841.087	2130.34
841.471	2001.7
841.854	1987.14
842.238	2008.98
842.621	1863.35
843.004	1708.01
843.388	1856.07
843.771	1870.63
844.154	1858.49
844.537	1671.6
844.92	1644.9
845.303	1642.47
845.686	1506.55
846.069	1494.41
846.452	1426.45
846.834	1368.19
847.217	1336.64
847.6	1246.83
847.982	1224.99
848.365	1195.86
848.748	1188.58
849.13	1059.94
849.512	1079.36
849.895	991.98
850.277	1091.49
850.659	1028.38
851.041	1028.38
851.423	1171.59
851.806	991.98
852.188	1001.68
852.57	1001.68
852.951	1016.25
853.333	1033.24
853.715	1050.23
854.097	943.43
854.479	982.27
854.86	994.4
855.242	928.87
855.623	860.91
856.005	693.43
856.386	848.77
856.768	758.96
857.149	717.7
857.53	642.46
857.911	625.46
858.292	688.57
858.674	530.8
859.055	625.46
859.436	513.81
859.817	484.69
860.197	474.98
860.578	462.84
860.959	465.27
861.34	538.08
861.72	477.4
862.101	525.95
862.482	472.55
862.862	455.56
863.243	487.11
863.623	479.83
864.003	441
864.384	421.58
864.764	382.74
865.144	479.83
865.524	455.56
865.904	397.31
866.284	309.93
866.664	329.34
867.044	353.62
867.424	324.49
867.804	324.49
868.183	380.32
868.563	309.93
868.943	295.36
869.322	341.48
869.702	329.34
870.081	309.93
870.461	275.94
870.84	336.63
871.22	271.09
871.599	319.63
871.978	319.63
872.357	290.51
872.736	249.25
873.115	324.49
873.494	246.82
873.873	275.94
874.252	237.11
874.631	222.55
875.01	266.24
875.388	174
875.767	205.56
876.146	261.38
876.524	205.56
876.903	266.24
877.281	266.24
877.66	193.42
878.038	210.41
878.416	283.23
878.794	288.08
879.173	171.57
879.551	283.23
879.929	186.14
880.307	237.11
880.685	200.7
881.063	174
881.441	205.56
881.818	237.11
882.196	176.43
882.574	125.46
882.951	190.99
883.329	174
883.707	186.14
884.084	171.57
884.461	195.85
884.839	181.28
885.216	193.42
885.593	106.04
885.971	237.11
886.348	149.73
886.725	190.99
887.102	174
887.479	205.56
887.856	203.13
888.233	237.11
888.609	181.28
888.986	217.69
889.363	181.28
889.74	181.28
890.116	217.69
890.493	149.73
890.869	190.99
891.246	142.45
891.622	135.17
891.998	190.99
892.375	84.19
892.751	198.27
893.127	215.26
893.503	166.72
893.879	110.89
894.255	171.57
894.631	200.7
895.007	171.57
895.383	210.41
895.759	241.96
896.134	115.75
896.51	203.13
896.886	171.57
897.261	178.86
897.637	125.46
898.012	190.99
898.388	174
898.763	224.97
899.138	135.17
899.514	123.03
899.889	142.45
900.264	244.39
900.639	198.27
901.014	200.7
901.389	190.99
901.764	174
902.139	157.01
902.513	113.32
902.888	157.01
903.263	174
903.638	174
904.012	166.72
904.387	142.45
904.761	152.16
905.136	193.42
905.51	110.89
905.884	137.59
906.259	152.16
906.633	113.32
907.007	147.3
907.381	135.17
907.755	154.58
908.129	108.47
908.503	110.89
908.877	174
909.251	190.99
909.624	161.87
909.998	120.6
910.372	186.14
910.745	79.34
911.119	152.16
911.492	130.31
911.866	84.19
912.239	152.16
912.612	227.4
912.986	166.72
913.359	166.72
913.732	186.14
914.105	164.29
914.478	110.89
914.851	161.87
915.224	224.97
915.597	176.43
915.97	123.03
916.343	96.33
916.715	154.58
917.088	149.73
917.461	130.31
917.833	98.76
918.206	193.42
918.578	115.75
918.951	144.87
919.323	86.62
919.695	130.31
920.067	108.47
920.44	149.73
920.812	161.87
921.184	224.97
921.556	188.56
921.928	159.44
922.3	237.11
922.672	115.75
923.043	125.46
923.415	157.01
923.787	198.27
924.158	161.87
924.53	188.56
924.901	239.54
925.273	159.44
925.644	106.04
926.016	115.75
926.387	132.74
926.758	125.46
927.129	89.05
927.5	93.9
927.872	115.75
928.243	76.91
928.613	135.17
928.984	125.46
929.355	144.87
929.726	115.75
930.097	110.89
930.467	178.86
930.838	220.12
931.209	98.76
931.579	106.04
931.95	147.3
932.32	101.18
932.69	132.74
933.061	142.45
933.431	224.97
933.801	164.29
934.171	210.41
934.541	74.49
934.911	171.57
935.281	183.71
935.651	144.87
936.021	188.56
936.391	98.76
936.761	135.17
937.13	101.18
937.5	84.19
937.87	69.63
938.239	147.3
938.609	130.31
938.978	215.26
939.347	181.28
939.717	118.18
940.086	181.28
940.455	132.74
940.824	147.3
941.193	161.87
941.562	157.01
941.931	76.91
942.3	149.73
942.669	149.73
943.038	106.04
943.407	140.02
943.775	159.44
944.144	174
944.513	176.43
944.881	147.3
945.25	157.01
945.618	220.12
945.986	232.25
946.355	115.75
946.723	130.31
947.091	188.56
947.459	147.3
947.827	183.71
948.195	183.71
948.563	215.26
948.931	110.89
949.299	164.29
949.667	161.87
950.035	110.89
950.402	108.47
950.77	106.04
951.138	127.88
951.505	152.16
951.873	74.49
952.24	166.72
952.607	205.56
952.975	137.59
953.342	118.18
953.709	157.01
954.076	193.42
954.443	130.31
954.81	203.13
955.177	115.75
955.544	174
955.911	195.85
956.278	161.87
956.645	246.82
957.012	123.03
957.378	178.86
957.745	89.05
958.111	110.89
958.478	273.52
958.844	178.86
959.211	207.98
959.577	125.46
959.943	198.27
960.309	161.87
960.675	132.74
961.042	76.91
961.408	115.75
961.774	137.59
962.139	89.05
962.505	161.87
962.871	178.86
963.237	125.46
963.603	215.26
963.968	103.61
964.334	178.86
964.699	101.18
965.065	210.41
965.43	135.17
965.796	190.99
966.161	149.73
966.526	144.87
966.891	147.3
967.256	154.58
967.622	195.85
967.987	123.03
968.352	115.75
968.716	86.62
969.081	108.47
969.446	181.28
969.811	157.01
970.176	154.58
970.54	195.85
970.905	142.45
971.269	149.73
971.634	144.87
971.998	169.15
972.363	176.43
972.727	120.6
973.091	178.86
973.455	152.16
973.819	118.18
974.183	91.48
974.547	113.32
974.911	93.9
975.275	157.01
975.639	166.72
976.003	149.73
976.367	64.78
976.73	186.14
977.094	149.73
977.458	152.16
977.821	127.88
978.185	130.31
978.548	157.01
978.911	159.44
979.275	154.58
979.638	159.44
980.001	161.87
980.364	67.2
980.727	149.73
981.09	101.18
981.453	84.19
981.816	113.32
982.179	222.55
982.542	232.25
982.905	157.01
983.267	154.58
983.63	171.57
983.992	147.3
984.355	188.56
984.717	110.89
985.08	186.14
985.442	164.29
985.804	154.58
986.167	164.29
986.529	86.62
986.891	171.57
987.253	123.03
987.615	115.75
987.977	137.59
988.339	207.98
988.701	147.3
989.062	154.58
989.424	108.47
989.786	188.56
990.147	161.87
990.509	159.44
990.87	174
991.232	174
991.593	166.72
991.955	152.16
992.316	132.74
992.677	130.31
993.038	135.17
993.399	176.43
993.76	110.89
994.121	98.76
994.482	200.7
994.843	106.04
995.204	152.16
995.565	130.31
995.926	171.57
996.286	144.87
996.647	91.48
997.007	161.87
997.368	132.74
997.728	144.87
998.089	142.45
998.449	195.85
998.809	147.3
999.169	113.32
999.53	169.15
999.89	152.16
1000.25	142.45
1000.61	96.33
1000.97	91.48
1001.329	98.76
1001.689	137.59
1002.049	115.75
1002.409	149.73
1002.768	101.18
1003.128	108.47
1003.487	183.71
1003.847	144.87
1004.206	113.32
1004.566	103.61
1004.925	186.14
1005.284	118.18
1005.643	93.9
1006.003	144.87
1006.362	144.87
1006.721	137.59
1007.08	164.29
1007.438	127.88
1007.797	101.18
1008.156	115.75
1008.515	220.12
1008.874	140.02
1009.232	174
1009.591	125.46
1009.949	169.15
1010.308	118.18
1010.666	154.58
1011.024	108.47
1011.383	159.44
1011.741	164.29
1012.099	76.91
1012.457	137.59
1012.815	183.71
1013.173	183.71
1013.531	171.57
1013.889	135.17
1014.247	251.67
1014.605	178.86
1014.962	98.76
1015.32	118.18
1015.678	103.61
1016.035	181.28
1016.393	125.46
1016.75	127.88
1017.107	186.14
1017.465	195.85
1017.822	108.47
1018.179	176.43
1018.536	144.87
1018.894	171.57
1019.251	110.89
1019.608	157.01
1019.964	110.89
1020.321	118.18
1020.678	142.45
1021.035	161.87
1021.392	147.3
1021.748	205.56
1022.105	144.87
1022.461	118.18
1022.818	234.68
1023.174	169.15
1023.531	169.15
1023.887	127.88
1024.243	159.44
1024.599	89.05
1024.955	137.59
1025.311	171.57
1025.667	169.15
1026.023	220.12
1026.379	176.43
1026.735	198.27
1027.091	120.6
1027.447	210.41
