189.514	48.54
189.973	48.54
190.431	48.54
190.889	-43.69
191.348	-4.85
191.806	-63.11
192.264	16.99
192.722	-24.27
193.18	38.84
193.638	-43.69
194.096	9.71
194.554	-75.24
195.012	-41.26
195.47	43.69
195.928	41.26
196.385	-36.41
196.843	-12.14
197.301	-43.69
197.758	58.25
198.216	55.83
198.674	-2.43
199.131	14.56
199.589	-24.27
200.046	2.43
200.503	43.69
200.961	33.98
201.418	116.51
201.875	63.11
202.332	48.54
202.79	29.13
203.247	111.65
203.704	169.91
204.161	184.47
204.618	186.9
205.075	111.65
205.532	138.35
205.989	128.64
206.445	155.34
206.902	140.78
207.359	82.53
207.816	135.92
208.272	118.93
208.729	87.38
209.185	140.78
209.642	143.21
210.098	75.24
210.555	140.78
211.011	152.91
211.467	114.08
211.924	148.06
212.38	138.35
212.836	165.05
213.292	172.33
213.748	109.22
214.204	148.06
214.66	135.92
215.116	172.33
215.572	126.22
216.028	191.75
216.484	145.63
216.94	123.79
217.396	131.07
217.851	123.79
218.307	99.52
218.763	191.75
219.218	148.06
219.674	148.06
220.129	155.34
220.585	121.36
221.04	162.62
221.496	133.5
221.951	99.52
222.406	135.92
222.861	189.32
223.317	157.77
223.772	172.33
224.227	135.92
224.682	172.33
225.137	128.64
225.592	133.5
226.047	99.52
226.502	131.07
226.957	143.21
227.411	150.49
227.866	97.09
228.321	121.36
228.776	174.76
229.23	97.09
229.685	121.36
230.139	106.8
230.594	182.04
231.048	172.33
231.503	135.92
231.957	77.67
232.411	155.34
232.865	121.36
233.32	92.23
233.774	116.51
234.228	72.82
234.682	97.09
235.136	58.25
235.59	89.81
236.044	99.52
236.498	145.63
236.952	116.51
237.406	116.51
237.86	55.83
238.313	87.38
238.767	169.91
239.221	60.68
239.674	140.78
240.128	126.22
240.581	97.09
241.035	106.8
241.488	143.21
241.942	165.05
242.395	109.22
242.848	84.95
243.301	179.61
243.755	140.78
244.208	111.65
244.661	150.49
245.114	94.66
245.567	165.05
246.02	160.2
246.473	97.09
246.926	162.62
247.379	155.34
247.832	152.91
248.284	199.03
248.737	140.78
249.19	131.07
249.642	104.37
250.095	101.94
250.547	126.22
251	48.54
251.452	111.65
251.905	77.67
252.357	104.37
252.81	138.35
253.262	143.21
253.714	118.93
254.166	121.36
254.618	196.6
255.07	126.22
255.523	191.75
255.975	109.22
256.427	150.49
256.878	99.52
257.33	97.09
257.782	133.5
258.234	92.23
258.686	169.91
259.137	92.23
259.589	143.21
260.041	145.63
260.492	111.65
260.944	114.08
261.395	189.32
261.847	189.32
262.298	152.91
262.749	80.1
263.201	133.5
263.652	140.78
264.103	92.23
264.554	135.92
265.005	114.08
265.457	150.49
265.908	114.08
266.359	172.33
266.809	84.95
267.26	118.93
267.711	121.36
268.162	97.09
268.613	182.04
269.064	111.65
269.514	106.8
269.965	131.07
270.415	118.93
270.866	101.94
271.316	165.05
271.767	75.24
272.217	58.25
272.668	114.08
273.118	150.49
273.568	145.63
274.019	111.65
274.469	145.63
274.919	116.51
275.369	172.33
275.819	148.06
276.269	155.34
276.719	167.48
277.169	150.49
277.619	82.53
278.069	169.91
278.518	97.09
278.968	94.66
279.418	179.61
279.867	211.17
280.317	143.21
280.767	126.22
281.216	152.91
281.666	89.81
282.115	177.19
282.564	118.93
283.014	191.75
283.463	133.5
283.912	128.64
284.361	160.2
284.811	106.8
285.26	121.36
285.709	106.8
286.158	199.03
286.607	138.35
287.056	50.97
287.505	133.5
287.953	99.52
288.402	126.22
288.851	87.38
289.3	148.06
289.748	97.09
290.197	80.1
290.646	123.79
291.094	109.22
291.543	155.34
291.991	201.46
292.439	177.19
292.888	135.92
293.336	55.83
293.784	157.77
294.233	177.19
294.681	123.79
295.129	179.61
295.577	162.62
296.025	72.82
296.473	104.37
296.921	167.48
297.369	135.92
297.817	211.17
298.264	138.35
298.712	138.35
299.16	135.92
299.608	143.21
300.055	33.98
300.503	150.49
300.95	155.34
301.398	70.39
301.845	75.24
302.293	143.21
302.74	121.36
303.187	165.05
303.635	131.07
304.082	145.63
304.529	99.52
304.976	247.58
305.423	145.63
305.87	199.03
306.317	199.03
306.764	179.61
307.211	165.05
307.658	148.06
308.105	148.06
308.552	143.21
308.998	194.18
309.445	140.78
309.892	169.91
310.338	165.05
310.785	109.22
311.231	84.95
311.678	148.06
312.124	121.36
312.571	121.36
313.017	111.65
313.463	104.37
313.909	194.18
314.356	121.36
314.802	160.2
315.248	165.05
315.694	114.08
316.14	116.51
316.586	157.77
317.032	143.21
317.478	126.22
317.923	121.36
318.369	123.79
318.815	131.07
319.261	133.5
319.706	145.63
320.152	172.33
320.597	126.22
321.043	94.66
321.488	167.48
321.934	182.04
322.379	94.66
322.824	94.66
323.27	77.67
323.715	150.49
324.16	43.69
324.605	131.07
325.05	211.17
325.495	126.22
325.94	150.49
326.385	194.18
326.83	145.63
327.275	140.78
327.72	184.47
328.165	101.94
328.61	133.5
329.054	111.65
329.499	172.33
329.943	135.92
330.388	114.08
330.832	148.06
331.277	160.2
331.721	128.64
332.166	184.47
332.61	99.52
333.054	121.36
333.499	167.48
333.943	111.65
334.387	133.5
334.831	138.35
335.275	155.34
335.719	135.92
336.163	150.49
336.607	135.92
337.051	87.38
337.495	123.79
337.938	150.49
338.382	89.81
338.826	148.06
339.269	157.77
339.713	116.51
340.157	126.22
340.6	186.9
341.044	162.62
341.487	126.22
341.93	199.03
342.374	157.77
342.817	87.38
343.26	191.75
343.703	211.17
344.146	126.22
344.59	106.8
345.033	99.52
345.476	157.77
345.919	116.51
346.361	179.61
346.804	106.8
347.247	152.91
347.69	131.07
348.133	92.23
348.575	118.93
349.018	128.64
349.461	133.5
349.903	155.34
350.346	150.49
350.788	131.07
351.23	82.53
351.673	82.53
352.115	206.31
352.557	133.5
353	160.2
353.442	126.22
353.884	126.22
354.326	189.32
354.768	121.36
355.21	70.39
355.652	65.53
356.094	135.92
356.536	104.37
356.978	145.63
357.419	191.75
357.861	169.91
358.303	152.91
358.744	89.81
359.186	150.49
359.627	213.6
360.069	179.61
360.51	140.78
360.952	191.75
361.393	109.22
361.834	121.36
362.276	104.37
362.717	133.5
363.158	101.94
363.599	165.05
364.04	145.63
364.481	191.75
364.922	101.94
365.363	143.21
365.804	174.76
366.245	104.37
366.686	155.34
367.126	140.78
367.567	140.78
368.008	138.35
368.448	148.06
368.889	133.5
369.33	111.65
369.77	133.5
370.21	84.95
370.651	150.49
371.091	123.79
371.531	84.95
371.972	157.77
372.412	150.49
372.852	80.1
373.292	218.45
373.732	157.77
374.172	80.1
374.612	109.22
375.052	109.22
375.492	186.9
375.932	162.62
376.372	148.06
376.811	150.49
377.251	94.66
377.691	218.45
378.13	145.63
378.57	160.2
379.009	169.91
379.449	92.23
379.888	140.78
380.328	135.92
380.767	191.75
381.206	126.22
381.645	162.62
382.085	72.82
382.524	148.06
382.963	165.05
383.402	179.61
383.841	157.77
384.28	135.92
384.719	194.18
385.158	77.67
385.596	118.93
386.035	133.5
386.474	174.76
386.913	138.35
387.351	160.2
387.79	216.02
388.228	131.07
388.667	167.48
389.105	165.05
389.544	133.5
389.982	160.2
390.42	133.5
390.859	167.48
391.297	128.64
391.735	58.25
392.173	140.78
392.611	138.35
393.049	138.35
393.487	131.07
393.925	148.06
394.363	140.78
394.801	223.3
395.239	116.51
395.676	97.09
396.114	116.51
396.552	160.2
396.989	41.26
397.427	167.48
397.864	101.94
398.302	135.92
398.739	94.66
399.177	133.5
399.614	94.66
400.051	165.05
400.488	84.95
400.926	140.78
401.363	92.23
401.8	131.07
402.237	111.65
402.674	165.05
403.111	148.06
403.548	160.2
403.985	123.79
404.421	97.09
404.858	126.22
405.295	150.49
405.732	121.36
406.168	135.92
406.605	169.91
407.041	94.66
407.478	126.22
407.914	116.51
408.351	177.19
408.787	165.05
409.223	240.29
409.66	182.04
410.096	70.39
410.532	157.77
410.968	128.64
411.404	121.36
411.84	128.64
412.276	111.65
412.712	189.32
413.148	184.47
413.584	169.91
414.02	135.92
414.455	174.76
414.891	128.64
415.327	131.07
415.762	135.92
416.198	138.35
416.633	179.61
417.069	150.49
417.504	157.77
417.94	67.96
418.375	138.35
418.81	80.1
419.245	177.19
419.681	150.49
420.116	140.78
420.551	118.93
420.986	155.34
421.421	109.22
421.856	191.75
422.291	118.93
422.726	84.95
423.16	75.24
423.595	155.34
424.03	189.32
424.464	106.8
424.899	128.64
425.334	182.04
425.768	162.62
426.203	140.78
426.637	114.08
427.071	145.63
427.506	152.91
427.94	118.93
428.374	123.79
428.809	101.94
429.243	189.32
429.677	172.33
430.111	216.02
430.545	128.64
430.979	167.48
431.413	135.92
431.847	104.37
432.28	121.36
432.714	150.49
433.148	177.19
433.582	203.89
434.015	123.79
434.449	160.2
434.882	121.36
435.316	174.76
435.749	128.64
436.183	121.36
436.616	208.74
437.049	172.33
437.483	104.37
437.916	160.2
438.349	169.91
438.782	169.91
439.215	160.2
439.648	121.36
440.081	148.06
440.514	148.06
440.947	186.9
441.38	206.31
441.813	196.6
442.245	157.77
442.678	199.03
443.111	150.49
443.543	172.33
443.976	235.44
444.408	216.02
444.841	206.31
445.273	247.58
445.705	189.32
446.138	228.16
446.57	150.49
447.002	140.78
447.434	196.6
447.867	174.76
448.299	194.18
448.731	315.54
449.163	182.04
449.595	206.31
450.026	160.2
450.458	237.87
450.89	203.89
451.322	196.6
451.754	283.98
452.185	242.72
452.617	235.44
453.048	254.86
453.48	271.85
453.911	310.68
454.343	293.69
454.774	211.17
455.205	247.58
455.637	220.88
456.068	325.25
456.499	322.82
456.93	240.29
457.361	250
457.792	240.29
458.223	300.98
458.654	293.69
459.085	233.01
459.516	266.99
459.947	194.18
460.378	262.14
460.808	296.12
461.239	303.4
461.669	254.86
462.1	313.11
462.531	262.14
462.961	245.15
463.391	283.98
463.822	259.71
464.252	172.33
464.682	305.83
465.113	283.98
465.543	254.86
465.973	276.7
466.403	218.45
466.833	310.68
467.263	216.02
467.693	245.15
468.123	220.88
468.553	269.42
468.983	240.29
469.412	182.04
469.842	296.12
470.272	199.03
470.701	172.33
471.131	148.06
471.56	203.89
471.99	135.92
472.419	160.2
472.849	148.06
473.278	208.74
473.707	199.03
474.136	233.01
474.566	252.43
474.995	233.01
475.424	165.05
475.853	218.45
476.282	240.29
476.711	191.75
477.14	235.44
477.569	184.47
477.997	177.19
478.426	242.72
478.855	186.9
479.283	179.61
479.712	165.05
480.141	262.14
480.569	186.9
480.998	174.76
481.426	237.87
481.854	177.19
482.283	225.73
482.711	259.71
483.139	189.32
483.567	189.32
483.995	155.34
484.424	189.32
484.852	165.05
485.28	155.34
485.708	218.45
486.135	213.6
486.563	177.19
486.991	174.76
487.419	182.04
487.847	179.61
488.274	206.31
488.702	145.63
489.129	179.61
489.557	128.64
489.984	186.9
490.412	220.88
490.839	208.74
491.266	194.18
491.694	126.22
492.121	189.32
492.548	174.76
492.975	206.31
493.402	172.33
493.829	257.29
494.256	213.6
494.683	169.91
495.11	116.51
495.537	194.18
495.964	167.48
496.39	177.19
496.817	143.21
497.244	126.22
497.67	189.32
498.097	155.34
498.523	179.61
498.95	179.61
499.376	109.22
499.803	160.2
500.229	177.19
500.655	101.94
501.081	72.82
501.508	104.37
501.934	143.21
502.36	218.45
502.786	186.9
503.212	172.33
503.638	150.49
504.064	152.91
504.489	131.07
504.915	162.62
505.341	196.6
505.767	218.45
506.192	150.49
506.618	237.87
507.043	174.76
507.469	160.2
507.894	157.77
508.32	169.91
508.745	167.48
509.17	118.93
509.596	172.33
510.021	126.22
510.446	126.22
510.871	152.91
511.296	220.88
511.721	167.48
512.146	177.19
512.571	194.18
512.996	220.88
513.421	186.9
513.845	111.65
514.27	174.76
514.695	186.9
515.119	169.91
515.544	167.48
515.969	145.63
516.393	157.77
516.817	182.04
517.242	89.81
517.666	213.6
518.09	199.03
518.515	169.91
518.939	128.64
519.363	466.03
519.787	165.05
520.211	203.89
520.635	213.6
521.059	152.91
521.483	150.49
521.907	186.9
522.331	128.64
522.754	184.47
523.178	235.44
523.602	160.2
524.025	225.73
524.449	245.15
524.872	182.04
525.296	179.61
525.719	133.5
526.143	240.29
526.566	199.03
526.989	194.18
527.412	206.31
527.836	223.3
528.259	223.3
528.682	135.92
529.105	184.47
529.528	148.06
529.951	220.88
530.374	245.15
530.796	203.89
531.219	128.64
531.642	199.03
532.065	97.09
532.487	174.76
532.91	116.51
533.332	196.6
533.755	230.59
534.177	182.04
534.6	194.18
535.022	135.92
535.444	216.02
535.867	169.91
536.289	160.2
536.711	135.92
537.133	199.03
537.555	109.22
537.977	189.32
538.399	225.73
538.821	199.03
539.243	169.91
539.665	160.2
540.086	223.3
540.508	220.88
540.93	237.87
541.351	172.33
541.773	266.99
542.195	196.6
542.616	206.31
543.037	225.73
543.459	218.45
543.88	233.01
544.301	218.45
544.723	118.93
545.144	211.17
545.565	254.86
545.986	199.03
546.407	276.7
546.828	157.77
547.249	199.03
547.67	223.3
548.091	201.46
548.512	169.91
548.932	196.6
549.353	230.59
549.774	242.72
550.194	135.92
550.615	179.61
551.035	167.48
551.456	194.18
551.876	186.9
552.296	184.47
552.717	177.19
553.137	133.5
553.557	160.2
553.977	157.77
554.397	233.01
554.817	213.6
555.237	184.47
555.657	128.64
556.077	165.05
556.497	160.2
556.917	199.03
557.337	186.9
557.756	313.11
558.176	126.22
558.596	104.37
559.015	131.07
559.435	189.32
559.854	138.35
560.274	196.6
560.693	174.76
561.112	97.09
561.532	177.19
561.951	235.44
562.37	152.91
562.789	106.8
563.208	152.91
563.627	160.2
564.046	201.46
564.465	101.94
564.884	199.03
565.303	177.19
565.722	211.17
566.14	145.63
566.559	213.6
566.978	177.19
567.396	218.45
567.815	184.47
568.233	206.31
568.652	172.33
569.07	233.01
569.489	118.93
569.907	184.47
570.325	196.6
570.743	186.9
571.161	225.73
571.58	247.58
571.998	237.87
572.416	242.72
572.833	157.77
573.251	174.76
573.669	235.44
574.087	140.78
574.505	80.1
574.922	199.03
575.34	191.75
575.758	174.76
576.175	169.91
576.593	237.87
577.01	126.22
577.428	174.76
577.845	1555.85
578.262	364.08
578.68	223.3
579.097	162.62
579.514	186.9
579.931	143.21
580.348	148.06
580.765	184.47
581.182	126.22
581.599	169.91
582.016	148.06
582.433	162.62
582.849	218.45
583.266	131.07
583.683	109.22
584.099	218.45
584.516	216.02
584.933	155.34
585.349	165.05
585.765	143.21
586.182	182.04
586.598	131.07
587.014	157.77
587.431	271.85
587.847	111.65
588.263	165.05
588.679	148.06
589.095	89.81
589.511	162.62
589.927	225.73
590.343	211.17
590.759	191.75
591.174	123.79
591.59	201.46
592.006	225.73
592.421	169.91
592.837	155.34
593.252	194.18
593.668	172.33
594.083	189.32
594.499	191.75
594.914	99.52
595.329	189.32
595.745	162.62
596.16	213.6
596.575	184.47
596.99	201.46
597.405	194.18
597.82	169.91
598.235	172.33
598.65	199.03
599.065	123.79
599.479	172.33
599.894	118.93
600.309	225.73
600.724	172.33
601.138	101.94
601.553	160.2
601.967	140.78
602.382	155.34
602.796	143.21
603.21	165.05
603.625	104.37
604.039	199.03
604.453	182.04
604.867	145.63
605.281	196.6
605.695	162.62
606.109	240.29
606.523	77.67
606.937	140.78
607.351	283.98
607.765	203.89
608.178	269.42
608.592	138.35
609.006	155.34
609.419	169.91
609.833	186.9
610.246	133.5
610.66	135.92
611.073	172.33
611.487	182.04
611.9	184.47
612.313	223.3
612.726	225.73
613.139	208.74
613.553	191.75
613.966	172.33
614.379	242.72
614.792	145.63
615.204	152.91
615.617	145.63
616.03	206.31
616.443	114.08
616.856	172.33
617.268	150.49
617.681	162.62
618.093	172.33
618.506	196.6
618.918	177.19
619.331	118.93
619.743	133.5
620.155	140.78
620.568	169.91
620.98	131.07
621.392	208.74
621.804	225.73
622.216	138.35
622.628	174.76
623.04	155.34
623.452	242.72
623.864	128.64
624.276	133.5
624.687	155.34
625.099	160.2
625.511	172.33
625.922	118.93
626.334	143.21
626.745	97.09
627.157	133.5
627.568	133.5
627.979	160.2
628.391	126.22
628.802	169.91
629.213	157.77
629.624	186.9
630.035	128.64
630.446	155.34
630.857	104.37
631.268	182.04
631.679	123.79
632.09	145.63
632.501	174.76
632.912	281.56
633.322	106.8
633.733	169.91
634.144	104.37
634.554	174.76
634.965	169.91
635.375	174.76
635.785	167.48
636.196	143.21
636.606	148.06
637.016	201.46
637.427	179.61
637.837	223.3
638.247	189.32
638.657	155.34
639.067	145.63
639.477	174.76
639.887	186.9
640.297	128.64
640.706	201.46
641.116	111.65
641.526	109.22
641.935	118.93
642.345	67.96
642.755	99.52
643.164	140.78
643.573	152.91
643.983	126.22
644.392	208.74
644.801	145.63
645.211	123.79
645.62	97.09
646.029	126.22
646.438	189.32
646.847	213.6
647.256	97.09
647.665	169.91
648.074	143.21
648.483	184.47
648.892	143.21
649.3	162.62
649.709	133.5
650.118	203.89
650.526	92.23
650.935	138.35
651.343	143.21
651.752	114.08
652.16	80.1
652.568	165.05
652.977	131.07
653.385	160.2
653.793	116.51
654.201	58.25
654.609	128.64
655.017	138.35
655.425	84.95
655.833	191.75
656.241	179.61
656.649	116.51
657.057	97.09
657.464	121.36
657.872	213.6
658.28	140.78
658.687	213.6
659.095	131.07
659.502	189.32
659.91	237.87
660.317	199.03
660.724	82.53
661.132	152.91
661.539	148.06
661.946	128.64
662.353	160.2
662.76	201.46
663.167	111.65
663.574	92.23
663.981	138.35
664.388	75.24
664.795	111.65
665.202	138.35
665.608	160.2
666.015	126.22
666.422	111.65
666.828	148.06
667.235	145.63
667.641	82.53
668.047	155.34
668.454	167.48
668.86	228.16
669.266	106.8
669.673	109.22
670.079	160.2
670.485	150.49
670.891	150.49
671.297	55.83
671.703	133.5
672.109	143.21
672.515	82.53
672.92	157.77
673.326	109.22
673.732	114.08
674.138	118.93
674.543	189.32
674.949	174.76
675.354	172.33
675.76	196.6
676.165	126.22
676.57	121.36
676.976	143.21
677.381	201.46
677.786	118.93
678.191	114.08
678.596	177.19
679.001	116.51
679.406	165.05
679.811	208.74
680.216	177.19
680.621	138.35
681.026	145.63
681.43	133.5
681.835	133.5
682.24	133.5
682.644	94.66
683.049	201.46
683.453	218.45
683.858	140.78
684.262	186.9
684.667	135.92
685.071	174.76
685.475	174.76
685.879	169.91
686.283	116.51
686.687	157.77
687.091	123.79
687.495	99.52
687.899	182.04
688.303	157.77
688.707	189.32
689.111	143.21
689.514	145.63
689.918	182.04
690.322	133.5
690.725	203.89
691.129	97.09
691.532	169.91
691.936	167.48
692.339	177.19
692.742	101.94
693.146	111.65
693.549	135.92
693.952	179.61
694.355	140.78
694.758	101.94
695.161	126.22
695.564	203.89
695.967	206.31
696.37	174.76
696.773	167.48
697.175	174.76
697.578	201.46
697.981	89.81
698.383	177.19
698.786	169.91
699.188	206.31
699.591	150.49
699.993	194.18
700.395	228.16
700.798	177.19
701.2	186.9
701.602	116.51
702.004	162.62
702.406	133.5
702.808	167.48
703.21	138.35
703.612	203.89
704.014	155.34
704.416	155.34
704.818	201.46
705.219	172.33
705.621	218.45
706.023	220.88
706.424	230.59
706.826	201.46
707.227	186.9
707.629	252.43
708.03	223.3
708.431	237.87
708.832	218.45
709.234	201.46
709.635	230.59
710.036	191.75
710.437	194.18
710.838	211.17
711.239	196.6
711.64	237.87
712.041	228.16
712.441	303.4
712.842	211.17
713.243	186.9
713.643	228.16
714.044	281.56
714.445	276.7
714.845	208.74
715.246	240.29
715.646	235.44
716.046	266.99
716.447	337.38
716.847	279.13
717.247	281.56
717.647	293.69
718.047	274.28
718.447	308.26
718.847	337.38
719.247	303.4
719.647	359.23
720.047	315.54
720.446	364.08
720.846	371.36
721.246	390.78
721.645	390.78
722.045	368.94
722.444	385.93
722.844	317.97
723.243	429.62
723.643	417.48
724.042	398.06
724.441	429.62
724.84	342.24
725.24	410.2
725.639	446.61
726.038	395.64
726.437	429.62
726.836	487.87
727.234	468.45
727.633	475.74
728.032	553.41
728.431	504.86
728.83	514.57
729.228	567.97
729.627	533.99
730.025	548.55
730.424	609.23
730.822	686.9
731.22	745.16
731.619	703.89
732.017	827.68
732.415	868.95
732.813	825.26
733.212	929.63
733.61	1021.86
734.008	1000.02
734.406	1155.36
734.803	1145.65
735.201	1264.58
735.599	1330.12
735.997	1393.23
736.395	1419.92
736.792	1548.57
737.19	1604.39
737.587	1708.76
737.985	1667.5
738.382	1730.61
738.78	1932.07
739.177	1978.19
739.574	2051
739.971	2053.43
740.369	2366.54
740.766	2446.64
741.163	2422.37
741.56	2497.61
741.957	2737.91
742.354	2660.24
742.751	2788.88
743.147	3070.44
743.544	3145.68
743.941	3310.73
744.338	3305.88
744.734	3548.6
745.131	3975.79
745.527	3779.19
745.924	3932.1
746.32	4318.03
746.716	4711.24
747.113	4774.35
747.509	4849.59
747.905	5034.06
748.301	5449.11
748.697	5575.33
749.093	5640.86
749.489	5878.73
749.885	6344.76
750.281	6798.65
750.677	6854.48
751.073	7361.77
751.468	7869.05
751.864	8019.54
752.26	7939.44
752.655	8206.44
753.051	8691.88
753.446	9296.26
753.842	8849.65
754.237	9616.65
754.632	10286.57
755.028	10335.11
755.423	10119.09
755.818	10255.01
756.213	11092.41
756.608	11262.31
757.003	11009.88
757.398	11075.42
757.793	11529.31
758.188	12075.43
758.583	11784.16
758.977	11556.01
759.372	12924.96
759.767	13883.71
760.161	14276.92
760.556	14143.42
760.95	15332.76
761.345	16374.04
761.739	16939.58
762.133	16769.68
762.527	17721.15
762.922	19201.75
763.316	19502.73
763.71	19172.63
764.104	18976.02
764.498	20561
764.892	21905.68
765.286	20976.05
765.68	20713.91
766.073	22527.05
766.467	23459.1
766.861	23252.79
767.255	22946.96
767.648	24369.31
768.042	25786.81
768.435	25976.13
768.829	25002.82
769.222	25260.1
769.615	27204.31
770.008	27798.98
770.402	26172.74
770.795	26029.53
771.188	27714.02
771.581	28481.03
771.974	27531.98
772.367	25718.85
772.76	26997.99
773.153	28148.5
773.545	27325.67
773.938	26677.6
774.331	26784.4
774.724	29121.81
775.116	31182.52
775.509	30320.86
775.901	30189.79
776.294	32058.75
776.686	33968.97
777.078	34235.97
777.471	33129.16
777.863	34495.68
778.255	38073.41
778.647	38891.38
779.039	36935.04
779.431	35408.32
779.823	38034.57
780.215	39194.78
780.607	38381.67
780.999	37391.36
781.39	37391.36
781.782	40007.9
782.174	41221.51
782.565	39505.47
782.957	38529.73
783.348	40607.43
783.74	42122.01
784.131	41270.06
784.522	39199.64
784.914	38614.68
785.305	41267.63
785.696	41544.34
786.087	39672.95
786.478	37029.7
786.869	36566.1
787.26	38694.78
787.651	37862.24
788.042	34769.96
788.433	33221.39
788.823	34194.71
789.214	35524.82
789.605	33330.62
789.995	30772.32
790.386	30968.93
790.776	33058.77
791.167	33165.56
791.557	31893.7
791.948	30583
792.338	32595.17
792.728	35837.94
793.118	35306.37
793.508	32854.88
793.898	32318.46
794.288	34813.65
794.678	37114.65
795.068	35415.6
795.458	32650.99
795.848	32422.83
796.238	35347.64
796.627	35226.28
797.017	33519.94
797.406	31614.57
797.796	32655.85
798.185	35566.09
798.575	35260.26
798.964	32485.94
799.354	31743.21
799.743	34303.93
800.132	36000.56
800.521	35282.1
800.91	32337.88
801.299	31374.27
801.688	33495.67
802.077	33636.45
802.466	32600.02
802.855	30985.92
803.244	29956.78
803.633	32170.4
804.021	31680.1
804.41	29859.69
804.799	27551.4
805.187	27226.15
805.576	29388.81
805.964	29182.49
806.352	25881.47
806.741	24784.37
807.129	25658.17
807.517	26726.14
807.905	27289.26
808.293	25124.18
808.681	23696.97
809.069	24857.18
809.457	28146.07
809.845	27393.63
810.233	25187.28
810.621	24762.52
811.009	25847.49
811.396	27544.12
811.784	27451.88
812.171	25163.01
812.559	23871.73
812.946	24289.21
813.334	25682.44
813.721	25070.78
814.108	22857.15
814.496	22172.67
814.883	23029.48
815.27	25099.9
815.657	24150.86
816.044	22332.87
816.431	21524.61
816.818	22638.7
817.205	23857.17
817.592	23694.54
817.979	21398.39
818.365	20136.24
818.752	20628.96
819.139	21209.07
819.525	21128.97
819.912	18929.91
820.298	17645.91
820.685	17660.47
821.071	18541.55
821.457	18354.65
821.843	16772.11
822.23	15374.03
822.616	15235.67
823.002	15706.56
823.388	15670.15
823.774	14053.62
824.16	12682.24
824.546	12679.81
824.931	13007.48
825.317	13446.81
825.703	12764.76
826.089	11682.22
826.474	11725.91
826.86	12104.56
827.245	12704.08
827.631	11781.74
828.016	10890.95
828.401	10252.59
828.787	10801.14
829.172	11325.42
829.557	10839.97
829.942	9665.2
830.327	9330.24
830.712	9536.56
831.097	9876.37
831.482	9869.09
831.867	8798.68
832.252	8024.4
832.636	8162.75
833.021	8536.54
833.406	8820.53
833.79	8415.18
834.175	7655.46
834.559	7160.31
834.944	7466.14
835.328	7859.35
835.713	7461.28
836.097	6531.65
836.481	6157.86
836.865	6378.74
837.249	6509.81
837.633	6359.32
838.017	5973.39
838.401	5417.56
838.785	5080.18
839.169	5201.54
839.553	5347.17
839.937	4929.69
840.32	4410.26
840.704	4252.49
841.087	4007.34
841.471	4184.53
841.854	4269.48
842.238	3837.44
842.621	3327.72
843.004	3359.28
843.388	3689.38
843.771	3827.73
844.154	3504.91
844.537	3143.25
844.92	2975.77
845.303	3245.2
845.686	3453.94
846.069	3390.83
846.452	3194.22
846.834	2788.88
847.217	2689.36
847.6	2919.95
847.982	3021.89
848.365	2757.32
848.748	2536.45
849.13	2339.84
849.512	2366.54
849.895	2529.17
850.277	2638.39
850.659	2390.81
851.041	2177.22
851.423	2267.03
851.806	2230.62
852.188	2296.15
852.57	2118.97
852.951	2184.5
853.333	1893.23
853.715	1847.12
854.097	2029.16
854.479	2004.89
854.86	1885.95
855.242	1706.34
855.623	1592.26
856.005	1592.26
856.386	1594.68
856.768	1592.26
857.149	1534
857.53	1337.4
857.911	1174.78
858.292	1247.59
858.674	1383.52
859.055	1310.7
859.436	1143.22
859.817	1004.87
860.197	1036.42
860.578	1082.54
860.959	1182.06
861.34	1029.14
861.72	910.21
862.101	827.68
862.482	873.8
862.862	910.21
863.243	973.32
863.623	868.95
864.003	895.64
864.384	737.88
864.764	839.82
865.144	708.75
865.524	815.55
865.904	711.18
866.284	725.74
866.664	650.5
867.044	711.18
867.424	706.32
867.804	655.35
868.183	701.47
868.563	502.43
868.943	584.96
869.322	536.42
869.702	616.51
870.081	604.38
870.461	616.51
870.84	466.03
871.22	470.88
871.599	512.14
871.978	512.14
872.357	432.05
872.736	429.62
873.115	412.63
873.494	385.93
873.873	351.95
874.252	429.62
874.631	417.48
875.01	419.91
875.388	402.92
875.767	347.09
876.146	393.21
876.524	327.67
876.903	339.81
877.281	356.8
877.66	252.43
878.038	327.67
878.416	327.67
878.794	245.15
879.173	322.82
879.551	271.85
879.929	276.7
880.307	271.85
880.685	203.89
881.063	286.41
881.441	276.7
881.818	242.72
882.196	182.04
882.574	216.02
882.951	269.42
883.329	189.32
883.707	305.83
884.084	237.87
884.461	225.73
884.839	203.89
885.216	237.87
885.593	228.16
885.971	213.6
886.348	196.6
886.725	240.29
887.102	250
887.479	199.03
887.856	196.6
888.233	254.86
888.609	240.29
888.986	225.73
889.363	169.91
889.74	203.89
890.116	174.76
890.493	177.19
890.869	213.6
891.246	140.78
891.622	199.03
891.998	138.35
892.375	240.29
892.751	162.62
893.127	150.49
893.503	228.16
893.879	186.9
894.255	218.45
894.631	165.05
895.007	145.63
895.383	167.48
895.759	228.16
896.134	172.33
896.51	184.47
896.886	148.06
897.261	99.52
897.637	162.62
898.012	152.91
898.388	143.21
898.763	189.32
899.138	114.08
899.514	148.06
899.889	155.34
900.264	182.04
900.639	211.17
901.014	203.89
901.389	186.9
901.764	169.91
902.139	72.82
902.513	148.06
902.888	140.78
903.263	140.78
903.638	121.36
904.012	94.66
904.387	80.1
904.761	145.63
905.136	143.21
905.51	179.61
905.884	194.18
906.259	50.97
906.633	135.92
907.007	162.62
907.381	189.32
907.755	135.92
908.129	128.64
908.503	189.32
908.877	111.65
909.251	145.63
909.624	75.24
909.998	140.78
910.372	152.91
910.745	206.31
911.119	152.91
911.492	118.93
911.866	131.07
912.239	172.33
912.612	121.36
912.986	80.1
913.359	135.92
913.732	167.48
914.105	104.37
914.478	109.22
914.851	116.51
915.224	126.22
915.597	126.22
915.97	203.89
916.343	123.79
916.715	155.34
917.088	174.76
917.461	94.66
917.833	109.22
918.206	126.22
918.578	50.97
918.951	131.07
919.323	152.91
919.695	92.23
920.067	121.36
920.44	131.07
920.812	162.62
921.184	111.65
921.556	157.77
921.928	118.93
922.3	128.64
922.672	160.2
923.043	165.05
923.415	140.78
923.787	128.64
924.158	165.05
924.53	140.78
924.901	111.65
925.273	162.62
925.644	131.07
926.016	111.65
926.387	145.63
926.758	138.35
927.129	111.65
927.5	80.1
927.872	75.24
928.243	160.2
928.613	123.79
928.984	131.07
929.355	162.62
929.726	114.08
930.097	131.07
930.467	145.63
930.838	167.48
931.209	104.37
931.579	114.08
931.95	167.48
932.32	92.23
932.69	172.33
933.061	155.34
933.431	172.33
933.801	140.78
934.171	48.54
934.541	138.35
934.911	145.63
935.281	179.61
935.651	116.51
936.021	143.21
936.391	148.06
936.761	143.21
937.13	126.22
937.5	157.77
937.87	114.08
938.239	162.62
938.609	87.38
938.978	148.06
939.347	165.05
939.717	65.53
940.086	70.39
940.455	160.2
940.824	38.84
941.193	189.32
941.562	114.08
941.931	152.91
942.3	189.32
942.669	211.17
943.038	148.06
943.407	92.23
943.775	123.79
944.144	165.05
944.513	126.22
944.881	145.63
945.25	191.75
945.618	184.47
945.986	116.51
946.355	162.62
946.723	152.91
947.091	138.35
947.459	48.54
947.827	138.35
948.195	155.34
948.563	138.35
948.931	162.62
949.299	121.36
949.667	75.24
950.035	80.1
950.402	109.22
950.77	150.49
951.138	157.77
951.505	152.91
951.873	150.49
952.24	63.11
952.607	121.36
952.975	104.37
953.342	143.21
953.709	89.81
954.076	114.08
954.443	131.07
954.81	184.47
955.177	114.08
955.544	201.46
955.911	174.76
956.278	114.08
956.645	167.48
957.012	87.38
957.378	172.33
957.745	135.92
958.111	140.78
958.478	152.91
958.844	104.37
959.211	150.49
959.577	46.12
959.943	155.34
960.309	133.5
960.675	148.06
961.042	143.21
961.408	145.63
961.774	157.77
962.139	106.8
962.505	174.76
962.871	162.62
963.237	126.22
963.603	31.55
963.968	150.49
964.334	140.78
964.699	104.37
965.065	160.2
965.43	155.34
965.796	162.62
966.161	160.2
966.526	160.2
966.891	145.63
967.256	106.8
967.622	67.96
967.987	138.35
968.352	114.08
968.716	87.38
969.081	87.38
969.446	106.8
969.811	70.39
970.176	189.32
970.54	140.78
970.905	123.79
971.269	75.24
971.634	143.21
971.998	165.05
972.363	118.93
972.727	131.07
973.091	114.08
973.455	116.51
973.819	194.18
974.183	140.78
974.547	160.2
974.911	172.33
975.275	174.76
975.639	184.47
976.003	155.34
976.367	123.79
976.73	109.22
977.094	55.83
977.458	150.49
977.821	145.63
978.185	133.5
978.548	186.9
978.911	109.22
979.275	118.93
979.638	109.22
980.001	140.78
980.364	150.49
980.727	140.78
981.09	169.91
981.453	114.08
981.816	109.22
982.179	109.22
982.542	89.81
982.905	203.89
983.267	133.5
983.63	126.22
983.992	109.22
984.355	135.92
984.717	148.06
985.08	118.93
985.442	111.65
985.804	101.94
986.167	118.93
986.529	101.94
986.891	36.41
987.253	29.13
987.615	126.22
987.977	177.19
988.339	109.22
988.701	145.63
989.062	145.63
989.424	160.2
989.786	133.5
990.147	128.64
990.509	155.34
990.87	135.92
991.232	109.22
991.593	97.09
991.955	160.2
992.316	99.52
992.677	106.8
993.038	152.91
993.399	80.1
993.76	143.21
994.121	167.48
994.482	43.69
994.843	104.37
995.204	114.08
995.565	94.66
995.926	70.39
996.286	162.62
996.647	169.91
997.007	128.64
997.368	167.48
997.728	97.09
998.089	165.05
998.449	177.19
998.809	111.65
999.169	152.91
999.53	126.22
999.89	55.83
1000.25	177.19
1000.61	186.9
1000.97	104.37
1001.329	111.65
1001.689	167.48
1002.049	133.5
1002.409	118.93
1002.768	109.22
1003.128	145.63
1003.487	116.51
1003.847	155.34
1004.206	165.05
1004.566	138.35
1004.925	111.65
1005.284	128.64
1005.643	155.34
1006.003	97.09
1006.362	186.9
1006.721	63.11
1007.08	169.91
1007.438	101.94
1007.797	67.96
1008.156	104.37
1008.515	179.61
1008.874	106.8
1009.232	116.51
1009.591	106.8
1009.949	116.51
1010.308	150.49
1010.666	84.95
1011.024	157.77
1011.383	70.39
1011.741	75.24
1012.099	148.06
1012.457	94.66
1012.815	135.92
1013.173	160.2
1013.531	157.77
1013.889	72.82
1014.247	97.09
1014.605	131.07
1014.962	99.52
1015.32	118.93
1015.678	174.76
1016.035	157.77
1016.393	77.67
1016.75	126.22
1017.107	97.09
1017.465	128.64
1017.822	116.51
1018.179	121.36
1018.536	89.81
1018.894	138.35
1019.251	99.52
1019.608	143.21
1019.964	131.07
1020.321	118.93
1020.678	104.37
1021.035	167.48
1021.392	157.77
1021.748	126.22
1022.105	128.64
1022.461	123.79
1022.818	213.6
1023.174	65.53
1023.531	194.18
1023.887	148.06
1024.243	114.08
1024.599	89.81
1024.955	126.22
1025.311	126.22
1025.667	118.93
1026.023	155.34
1026.379	33.98
1026.735	165.05
1027.091	21.84
1027.447	138.35
