189.514	49.45
189.973	49.45
190.431	49.45
190.889	-1.52
191.348	-67.05
191.806	-18.51
192.264	0.91
192.722	-76.76
193.18	13.05
193.638	-47.63
194.096	-37.93
194.554	-28.22
195.012	-50.06
195.47	-11.23
195.928	-33.07
196.385	5.76
196.843	54.31
197.301	61.59
197.758	15.47
198.216	22.76
198.674	51.88
199.131	59.16
199.589	93.14
200.046	68.87
200.503	8.19
200.961	141.69
201.418	56.74
201.875	110.14
202.332	54.31
202.79	17.9
203.247	131.98
203.704	148.97
204.161	151.4
204.618	158.68
205.075	173.24
205.532	146.54
205.989	151.4
206.445	148.97
206.902	173.24
207.359	178.1
207.816	117.42
208.272	146.54
208.729	204.8
209.185	131.98
209.642	144.12
210.098	197.52
210.555	202.37
211.011	168.39
211.467	187.81
211.924	192.66
212.38	102.85
212.836	141.69
213.292	173.24
213.748	139.26
214.204	151.4
214.66	158.68
215.116	173.24
215.572	71.3
216.028	119.84
216.484	173.24
216.94	226.64
217.396	139.26
217.851	158.68
218.307	127.13
218.763	182.95
219.218	117.42
219.674	90.72
220.129	139.26
220.585	170.82
221.04	199.94
221.496	168.39
221.951	144.12
222.406	102.85
222.861	146.54
223.317	136.83
223.772	144.12
224.227	139.26
224.682	182.95
225.137	51.88
225.592	66.45
226.047	85.86
226.502	112.56
226.957	165.96
227.411	214.51
227.866	139.26
228.321	258.2
228.776	124.7
229.23	168.39
229.685	117.42
230.139	163.53
230.594	173.24
231.048	61.59
231.503	78.58
231.957	136.83
232.411	73.73
232.865	165.96
233.32	114.99
233.774	146.54
234.228	141.69
234.682	85.86
235.136	117.42
235.59	192.66
236.044	122.27
236.498	136.83
236.952	144.12
237.406	110.14
237.86	146.54
238.313	168.39
238.767	209.65
239.221	151.4
239.674	148.97
240.128	90.72
240.581	199.94
241.035	107.71
241.488	127.13
241.942	146.54
242.395	204.8
242.848	139.26
243.301	66.45
243.755	182.95
244.208	185.38
244.661	170.82
245.114	168.39
245.567	187.81
246.02	146.54
246.473	102.85
246.926	165.96
247.379	144.12
247.832	197.52
248.284	127.13
248.737	156.25
249.19	136.83
249.642	146.54
250.095	124.7
250.547	119.84
251	173.24
251.452	156.25
251.905	156.25
252.357	61.59
252.81	148.97
253.262	68.87
253.714	161.11
254.166	178.1
254.618	127.13
255.07	175.67
255.523	175.67
255.975	124.7
256.427	107.71
256.878	105.28
257.33	141.69
257.782	161.11
258.234	98
258.686	185.38
259.137	122.27
259.589	59.16
260.041	127.13
260.492	110.14
260.944	131.98
261.395	161.11
261.847	192.66
262.298	139.26
262.749	146.54
263.201	180.52
263.652	129.55
264.103	114.99
264.554	102.85
265.005	163.53
265.457	187.81
265.908	216.93
266.359	192.66
266.809	134.41
267.26	156.25
267.711	158.68
268.162	141.69
268.613	124.7
269.064	163.53
269.514	178.1
269.965	192.66
270.415	163.53
270.866	134.41
271.316	105.28
271.767	158.68
272.217	204.8
272.668	190.23
273.118	124.7
273.568	127.13
274.019	93.14
274.469	139.26
274.919	148.97
275.369	231.5
275.819	180.52
276.269	141.69
276.719	144.12
277.169	241.21
277.619	214.51
278.069	161.11
278.518	141.69
278.968	119.84
279.418	127.13
279.867	163.53
280.317	161.11
280.767	129.55
281.216	117.42
281.666	151.4
282.115	110.14
282.564	216.93
283.014	139.26
283.463	131.98
283.912	221.79
284.361	175.67
284.811	173.24
285.26	187.81
285.709	190.23
286.158	156.25
286.607	197.52
287.056	134.41
287.505	182.95
287.953	180.52
288.402	124.7
288.851	236.35
289.3	182.95
289.748	163.53
290.197	144.12
290.646	178.1
291.094	114.99
291.543	161.11
291.991	54.31
292.439	146.54
292.888	144.12
293.336	37.32
293.784	134.41
294.233	173.24
294.681	175.67
295.129	151.4
295.577	202.37
296.025	161.11
296.473	112.56
296.921	139.26
297.369	136.83
297.817	144.12
298.264	117.42
298.712	129.55
299.16	148.97
299.608	170.82
300.055	129.55
300.503	161.11
300.95	209.65
301.398	146.54
301.845	117.42
302.293	98
302.74	141.69
303.187	178.1
303.635	168.39
304.082	146.54
304.529	139.26
304.976	229.07
305.423	114.99
305.87	83.44
306.317	219.36
306.764	146.54
307.211	139.26
307.658	144.12
308.105	146.54
308.552	175.67
308.998	112.56
309.445	117.42
309.892	148.97
310.338	139.26
310.785	136.83
311.231	195.09
311.678	127.13
312.124	131.98
312.571	144.12
313.017	139.26
313.463	187.81
313.909	85.86
314.356	110.14
314.802	161.11
315.248	165.96
315.694	144.12
316.14	190.23
316.586	173.24
317.032	173.24
317.478	141.69
317.923	136.83
318.369	170.82
318.815	173.24
319.261	185.38
319.706	105.28
320.152	139.26
320.597	168.39
321.043	134.41
321.488	190.23
321.934	71.3
322.379	212.08
322.824	122.27
323.27	214.51
323.715	156.25
324.16	100.43
324.605	122.27
325.05	136.83
325.495	161.11
325.94	117.42
326.385	153.83
326.83	187.81
327.275	153.83
327.72	168.39
328.165	105.28
328.61	114.99
329.054	122.27
329.499	114.99
329.943	173.24
330.388	61.59
330.832	163.53
331.277	119.84
331.721	112.56
332.166	170.82
332.61	141.69
333.054	136.83
333.499	156.25
333.943	136.83
334.387	187.81
334.831	158.68
335.275	93.14
335.719	131.98
336.163	151.4
336.607	146.54
337.051	146.54
337.495	107.71
337.938	170.82
338.382	139.26
338.826	187.81
339.269	134.41
339.713	107.71
340.157	90.72
340.6	197.52
341.044	197.52
341.487	88.29
341.93	146.54
342.374	144.12
342.817	165.96
343.26	197.52
343.703	175.67
344.146	131.98
344.59	139.26
345.033	253.34
345.476	158.68
345.919	134.41
346.361	112.56
346.804	168.39
347.247	199.94
347.69	112.56
348.133	144.12
348.575	44.6
349.018	105.28
349.461	197.52
349.903	134.41
350.346	83.44
350.788	139.26
351.23	170.82
351.673	212.08
352.115	146.54
352.557	156.25
353	119.84
353.442	173.24
353.884	144.12
354.326	195.09
354.768	119.84
355.21	187.81
355.652	163.53
356.094	95.57
356.536	163.53
356.978	199.94
357.419	187.81
357.861	141.69
358.303	165.96
358.744	107.71
359.186	119.84
359.627	114.99
360.069	90.72
360.51	112.56
360.952	105.28
361.393	88.29
361.834	241.21
362.276	141.69
362.717	178.1
363.158	204.8
363.599	158.68
364.04	119.84
364.481	127.13
364.922	158.68
365.363	148.97
365.804	216.93
366.245	168.39
366.686	95.57
367.126	100.43
367.567	153.83
368.008	168.39
368.448	195.09
368.889	110.14
369.33	144.12
369.77	127.13
370.21	129.55
370.651	117.42
371.091	141.69
371.531	238.78
371.972	187.81
372.412	134.41
372.852	136.83
373.292	127.13
373.732	161.11
374.172	173.24
374.612	78.58
375.052	131.98
375.492	139.26
375.932	146.54
376.372	110.14
376.811	170.82
377.251	165.96
377.691	192.66
378.13	185.38
378.57	178.1
379.009	146.54
379.449	73.73
379.888	156.25
380.328	175.67
380.767	117.42
381.206	134.41
381.645	98
382.085	44.6
382.524	180.52
382.963	219.36
383.402	144.12
383.841	180.52
384.28	127.13
384.719	141.69
385.158	219.36
385.596	209.65
386.035	119.84
386.474	146.54
386.913	161.11
387.351	141.69
387.79	199.94
388.228	165.96
388.667	204.8
389.105	158.68
389.544	100.43
389.982	127.13
390.42	161.11
390.859	122.27
391.297	158.68
391.735	136.83
392.173	88.29
392.611	168.39
393.049	185.38
393.487	47.03
393.925	173.24
394.363	187.81
394.801	117.42
395.239	182.95
395.676	170.82
396.114	192.66
396.552	95.57
396.989	90.72
397.427	148.97
397.864	54.31
398.302	175.67
398.739	134.41
399.177	144.12
399.614	148.97
400.051	73.73
400.488	148.97
400.926	153.83
401.363	76.15
401.8	114.99
402.237	168.39
402.674	185.38
403.111	59.16
403.548	146.54
403.985	168.39
404.421	122.27
404.858	151.4
405.295	197.52
405.732	168.39
406.168	117.42
406.605	161.11
407.041	156.25
407.478	209.65
407.914	64.02
408.351	71.3
408.787	127.13
409.223	158.68
409.66	85.86
410.096	144.12
410.532	199.94
410.968	165.96
411.404	173.24
411.84	161.11
412.276	148.97
412.712	95.57
413.148	156.25
413.584	127.13
414.02	190.23
414.455	156.25
414.891	168.39
415.327	178.1
415.762	114.99
416.198	78.58
416.633	127.13
417.069	129.55
417.504	131.98
417.94	185.38
418.375	117.42
418.81	146.54
419.245	199.94
419.681	122.27
420.116	139.26
420.551	168.39
420.986	153.83
421.421	134.41
421.856	134.41
422.291	141.69
422.726	146.54
423.16	178.1
423.595	207.22
424.03	148.97
424.464	127.13
424.899	221.79
425.334	182.95
425.768	153.83
426.203	127.13
426.637	170.82
427.071	129.55
427.506	163.53
427.94	122.27
428.374	161.11
428.809	192.66
429.243	146.54
429.677	144.12
430.111	146.54
430.545	122.27
430.979	129.55
431.413	151.4
431.847	136.83
432.28	134.41
432.714	219.36
433.148	187.81
433.582	185.38
434.015	134.41
434.449	175.67
434.882	136.83
435.316	148.97
435.749	163.53
436.183	236.35
436.616	93.14
437.049	156.25
437.483	180.52
437.916	78.58
438.349	170.82
438.782	144.12
439.215	124.7
439.648	187.81
440.081	190.23
440.514	204.8
440.947	158.68
441.38	182.95
441.813	93.14
442.245	163.53
442.678	146.54
443.111	148.97
443.543	131.98
443.976	178.1
444.408	114.99
444.841	49.45
445.273	81.01
445.705	165.96
446.138	207.22
446.57	173.24
447.002	136.83
447.434	161.11
447.867	185.38
448.299	229.07
448.731	221.79
449.163	207.22
449.595	190.23
450.026	148.97
450.458	146.54
450.89	146.54
451.322	158.68
451.754	158.68
452.185	165.96
452.617	161.11
453.048	168.39
453.48	117.42
453.911	173.24
454.343	180.52
454.774	168.39
455.205	258.2
455.637	163.53
456.068	146.54
456.499	226.64
456.93	146.54
457.361	212.08
457.792	134.41
458.223	165.96
458.654	127.13
459.085	197.52
459.516	151.4
459.947	187.81
460.378	110.14
460.808	190.23
461.239	182.95
461.669	136.83
462.1	141.69
462.531	158.68
462.961	158.68
463.391	107.71
463.822	182.95
464.252	110.14
464.682	182.95
465.113	134.41
465.543	95.57
465.973	117.42
466.403	148.97
466.833	144.12
467.263	178.1
467.693	168.39
468.123	180.52
468.553	127.13
468.983	204.8
469.412	124.7
469.842	100.43
470.272	146.54
470.701	233.92
471.131	127.13
471.56	224.21
471.99	158.68
472.419	197.52
472.849	146.54
473.278	168.39
473.707	153.83
474.136	168.39
474.566	95.57
474.995	170.82
475.424	153.83
475.853	141.69
476.282	105.28
476.711	156.25
477.14	110.14
477.569	129.55
477.997	192.66
478.426	56.74
478.855	165.96
479.283	190.23
479.712	202.37
480.141	131.98
480.569	165.96
480.998	134.41
481.426	231.5
481.854	250.91
482.283	195.09
482.711	158.68
483.139	202.37
483.567	141.69
483.995	156.25
484.424	175.67
484.852	146.54
485.28	158.68
485.708	139.26
486.135	175.67
486.563	185.38
486.991	212.08
487.419	202.37
487.847	233.92
488.274	100.43
488.702	119.84
489.129	214.51
489.557	144.12
489.984	168.39
490.412	127.13
490.839	127.13
491.266	139.26
491.694	158.68
492.121	175.67
492.548	197.52
492.975	165.96
493.402	170.82
493.829	233.92
494.256	195.09
494.683	117.42
495.11	187.81
495.537	219.36
495.964	144.12
496.39	131.98
496.817	119.84
497.244	148.97
497.67	95.57
498.097	134.41
498.523	158.68
498.95	170.82
499.376	197.52
499.803	127.13
500.229	136.83
500.655	170.82
501.081	192.66
501.508	212.08
501.934	119.84
502.36	136.83
502.786	131.98
503.212	134.41
503.638	144.12
504.064	114.99
504.489	173.24
504.915	146.54
505.341	151.4
505.767	139.26
506.192	185.38
506.618	161.11
507.043	173.24
507.469	168.39
507.894	180.52
508.32	119.84
508.745	148.97
509.17	185.38
509.596	144.12
510.021	85.86
510.446	158.68
510.871	112.56
511.296	129.55
511.721	93.14
512.146	163.53
512.571	185.38
512.996	246.06
513.421	202.37
513.845	119.84
514.27	168.39
514.695	163.53
515.119	182.95
515.544	146.54
515.969	131.98
516.393	209.65
516.817	175.67
517.242	98
517.666	190.23
518.09	185.38
518.515	144.12
518.939	175.67
519.363	389.27
519.787	161.11
520.211	122.27
520.635	161.11
521.059	119.84
521.483	161.11
521.907	136.83
522.331	148.97
522.754	129.55
523.178	185.38
523.602	134.41
524.025	182.95
524.449	102.85
524.872	151.4
525.296	163.53
525.719	207.22
526.143	233.92
526.566	148.97
526.989	95.57
527.412	161.11
527.836	114.99
528.259	100.43
528.682	165.96
529.105	233.92
529.528	161.11
529.951	105.28
530.374	158.68
530.796	158.68
531.219	161.11
531.642	209.65
532.065	226.64
532.487	98
532.91	170.82
533.332	136.83
533.755	66.45
534.177	153.83
534.6	148.97
535.022	114.99
535.444	117.42
535.867	173.24
536.289	144.12
536.711	187.81
537.133	204.8
537.555	182.95
537.977	124.7
538.399	146.54
538.821	175.67
539.243	246.06
539.665	156.25
540.086	182.95
540.508	202.37
540.93	139.26
541.351	175.67
541.773	127.13
542.195	139.26
542.616	226.64
543.037	202.37
543.459	204.8
543.88	212.08
544.301	178.1
544.723	163.53
545.144	270.33
545.565	207.22
545.986	214.51
546.407	151.4
546.828	216.93
547.249	221.79
547.67	168.39
548.091	134.41
548.512	180.52
548.932	192.66
549.353	161.11
549.774	224.21
550.194	153.83
550.615	146.54
551.035	148.97
551.456	209.65
551.876	168.39
552.296	202.37
552.717	127.13
553.137	146.54
553.557	216.93
553.977	192.66
554.397	102.85
554.817	163.53
555.237	207.22
555.657	180.52
556.077	158.68
556.497	178.1
556.917	163.53
557.337	187.81
557.756	129.55
558.176	219.36
558.596	165.96
559.015	144.12
559.435	148.97
559.854	148.97
560.274	122.27
560.693	144.12
561.112	141.69
561.532	146.54
561.951	187.81
562.37	112.56
562.789	141.69
563.208	105.28
563.627	127.13
564.046	202.37
564.465	192.66
564.884	158.68
565.303	112.56
565.722	158.68
566.14	134.41
566.559	144.12
566.978	129.55
567.396	231.5
567.815	95.57
568.233	202.37
568.652	156.25
569.07	165.96
569.489	163.53
569.907	131.98
570.325	182.95
570.743	146.54
571.161	117.42
571.58	68.87
571.998	175.67
572.416	95.57
572.833	267.9
573.251	117.42
573.669	202.37
574.087	151.4
574.505	139.26
574.922	151.4
575.34	180.52
575.758	214.51
576.175	153.83
576.593	153.83
577.01	163.53
577.428	165.96
577.845	1386.85
578.262	265.48
578.68	117.42
579.097	192.66
579.514	221.79
579.931	165.96
580.348	114.99
580.765	190.23
581.182	214.51
581.599	185.38
582.016	139.26
582.433	165.96
582.849	190.23
583.266	173.24
583.683	173.24
584.099	175.67
584.516	136.83
584.933	134.41
585.349	178.1
585.765	190.23
586.182	131.98
586.598	73.73
587.014	161.11
587.431	173.24
587.847	185.38
588.263	76.15
588.679	224.21
589.095	66.45
589.511	173.24
589.927	173.24
590.343	141.69
590.759	170.82
591.174	93.14
591.59	119.84
592.006	117.42
592.421	153.83
592.837	204.8
593.252	110.14
593.668	170.82
594.083	139.26
594.499	168.39
594.914	165.96
595.329	112.56
595.745	192.66
596.16	151.4
596.575	114.99
596.99	129.55
597.405	173.24
597.82	158.68
598.235	173.24
598.65	148.97
599.065	163.53
599.479	156.25
599.894	122.27
600.309	8.19
600.724	197.52
601.138	136.83
601.553	127.13
601.967	151.4
602.382	122.27
602.796	168.39
603.21	153.83
603.625	102.85
604.039	100.43
604.453	168.39
604.867	192.66
605.281	241.21
605.695	107.71
606.109	229.07
606.523	158.68
606.937	165.96
607.351	202.37
607.765	95.57
608.178	131.98
608.592	131.98
609.006	170.82
609.419	148.97
609.833	178.1
610.246	170.82
610.66	180.52
611.073	68.87
611.487	158.68
611.9	151.4
612.313	226.64
612.726	197.52
613.139	231.5
613.553	151.4
613.966	134.41
614.379	219.36
614.792	134.41
615.204	216.93
615.617	168.39
616.03	131.98
616.443	168.39
616.856	185.38
617.268	168.39
617.681	131.98
618.093	151.4
618.506	192.66
618.918	221.79
619.331	168.39
619.743	175.67
620.155	136.83
620.568	119.84
620.98	127.13
621.392	207.22
621.804	216.93
622.216	192.66
622.628	134.41
623.04	163.53
623.452	163.53
623.864	117.42
624.276	195.09
624.687	165.96
625.099	131.98
625.511	178.1
625.922	153.83
626.334	117.42
626.745	148.97
627.157	190.23
627.568	141.69
627.979	180.52
628.391	124.7
628.802	136.83
629.213	124.7
629.624	117.42
630.035	124.7
630.446	163.53
630.857	146.54
631.268	90.72
631.679	148.97
632.09	163.53
632.501	153.83
632.912	197.52
633.322	192.66
633.733	144.12
634.144	202.37
634.554	114.99
634.965	47.03
635.375	190.23
635.785	148.97
636.196	151.4
636.606	158.68
637.016	197.52
637.427	163.53
637.837	202.37
638.247	153.83
638.657	141.69
639.067	151.4
639.477	119.84
639.887	141.69
640.297	112.56
640.706	216.93
641.116	173.24
641.526	178.1
641.935	219.36
642.345	102.85
642.755	231.5
643.164	144.12
643.573	134.41
643.983	112.56
644.392	187.81
644.801	134.41
645.211	134.41
645.62	88.29
646.029	134.41
646.438	207.22
646.847	119.84
647.256	105.28
647.665	207.22
648.074	141.69
648.483	139.26
648.892	175.67
649.3	187.81
649.709	119.84
650.118	102.85
650.526	170.82
650.935	102.85
651.343	114.99
651.752	161.11
652.16	141.69
652.568	207.22
652.977	98
653.385	212.08
653.793	156.25
654.201	204.8
654.609	165.96
655.017	163.53
655.425	161.11
655.833	134.41
656.241	114.99
656.649	144.12
657.057	178.1
657.464	163.53
657.872	158.68
658.28	153.83
658.687	185.38
659.095	141.69
659.502	207.22
659.91	153.83
660.317	117.42
660.724	187.81
661.132	117.42
661.539	165.96
661.946	156.25
662.353	236.35
662.76	129.55
663.167	102.85
663.574	180.52
663.981	212.08
664.388	107.71
664.795	185.38
665.202	199.94
665.608	151.4
666.015	146.54
666.422	233.92
666.828	158.68
667.235	170.82
667.641	144.12
668.047	66.45
668.454	102.85
668.86	180.52
669.266	134.41
669.673	168.39
670.079	229.07
670.485	146.54
670.891	59.16
671.297	161.11
671.703	141.69
672.109	163.53
672.515	136.83
672.92	199.94
673.326	131.98
673.732	241.21
674.138	187.81
674.543	71.3
674.949	131.98
675.354	212.08
675.76	117.42
676.165	187.81
676.57	148.97
676.976	146.54
677.381	100.43
677.786	156.25
678.191	163.53
678.596	212.08
679.001	182.95
679.406	156.25
679.811	233.92
680.216	192.66
680.621	170.82
681.026	182.95
681.43	146.54
681.835	204.8
682.24	214.51
682.644	204.8
683.049	136.83
683.453	185.38
683.858	127.13
684.262	107.71
684.667	139.26
685.071	148.97
685.475	185.38
685.879	136.83
686.283	173.24
686.687	117.42
687.091	163.53
687.495	129.55
687.899	195.09
688.303	190.23
688.707	124.7
689.111	114.99
689.514	122.27
689.918	139.26
690.322	170.82
690.725	170.82
691.129	110.14
691.532	190.23
691.936	161.11
692.339	124.7
692.742	190.23
693.146	158.68
693.549	112.56
693.952	158.68
694.355	105.28
694.758	144.12
695.161	175.67
695.564	182.95
695.967	156.25
696.37	117.42
696.773	238.78
697.175	180.52
697.578	175.67
697.981	226.64
698.383	221.79
698.786	214.51
699.188	105.28
699.591	139.26
699.993	165.96
700.395	182.95
700.798	209.65
701.2	173.24
701.602	117.42
702.004	180.52
702.406	182.95
702.808	224.21
703.21	204.8
703.612	243.63
704.014	178.1
704.416	156.25
704.818	185.38
705.219	214.51
705.621	175.67
706.023	219.36
706.424	185.38
706.826	163.53
707.227	202.37
707.629	231.5
708.03	209.65
708.431	209.65
708.832	253.34
709.234	219.36
709.635	270.33
710.036	253.34
710.437	197.52
710.838	236.35
711.239	153.83
711.64	263.05
712.041	241.21
712.441	250.91
712.842	221.79
713.243	263.05
713.643	202.37
714.044	202.37
714.445	229.07
714.845	231.5
715.246	321.3
715.646	292.18
716.046	243.63
716.447	255.77
716.847	287.32
717.247	301.89
717.647	246.06
718.047	226.64
718.447	233.92
718.847	246.06
719.247	272.76
719.647	328.59
720.047	270.33
720.446	306.74
720.846	280.04
721.246	345.58
721.645	280.04
722.045	326.16
722.444	331.01
722.844	386.84
723.243	326.16
723.643	284.9
724.042	352.86
724.441	403.83
724.84	379.56
725.24	396.55
725.639	435.38
726.038	471.79
726.437	445.09
726.836	493.64
727.234	430.53
727.633	483.93
728.032	513.05
728.431	525.19
728.83	442.66
729.228	530.04
729.627	505.77
730.025	644.12
730.424	588.3
730.822	692.67
731.22	634.42
731.619	753.35
732.017	865
732.415	918.4
732.813	874.71
733.212	801.89
733.61	1032.48
734.008	1105.3
734.406	1209.67
734.803	1284.91
735.201	1221.8
735.599	1301.9
735.997	1496.08
736.395	1639.29
736.792	1733.95
737.19	1748.51
737.587	1593.17
737.985	1731.52
738.382	2008.22
738.78	2199.97
739.177	2350.46
739.574	2258.23
739.971	2156.28
740.369	2214.54
740.766	2729.11
741.163	2954.84
741.56	2986.39
741.957	2743.67
742.354	2697.55
742.751	2971.83
743.147	3513.1
743.544	3707.28
743.941	3661.16
744.338	3289.8
744.734	3384.46
745.131	3695.14
745.527	4520.4
745.924	4794.67
746.32	4629.62
746.716	4224.28
747.113	4566.52
747.509	5207.3
747.905	6149.06
748.301	6331.11
748.697	5874.79
749.093	5447.6
749.489	5816.53
749.885	6760.72
750.281	8105.41
750.677	8100.55
751.073	7428.21
751.468	6838.4
751.864	7556.85
752.26	8962.21
752.655	10015.63
753.051	9945.24
753.446	9166.1
753.842	8442.79
754.237	9345.72
754.632	11129.72
755.028	11998.67
755.423	11802.06
755.818	10588.45
756.213	9763.2
756.608	10433.11
757.003	12418.58
757.398	13860.35
757.793	13416.17
758.188	11615.17
758.583	10775.35
758.977	11814.2
759.372	14374.92
759.767	16236.6
760.161	16236.6
760.556	14688.03
760.95	13913.75
761.345	14996.29
761.739	17942.94
762.133	20350.74
762.527	20833.76
762.922	18493.92
763.316	17486.62
763.71	17891.97
764.104	20959.97
764.498	24100.8
764.892	24188.18
765.286	21940.57
765.68	19722.09
766.073	20086.17
766.467	22748.84
766.861	26998.9
767.255	28069.31
767.648	26341.13
768.042	23144.47
768.435	22714.86
768.829	25015.86
769.222	29299.91
769.615	32035.39
770.008	30244.1
770.402	26093.55
770.795	24010.99
771.188	25879.95
771.581	29969.82
771.974	32409.18
772.367	30748.96
772.76	28241.64
773.153	24605.66
773.545	24557.12
773.938	28935.83
774.331	32554.81
774.724	33469.88
775.116	31644.61
775.509	28171.25
775.901	27906.68
776.294	31807.23
776.686	36734.49
777.078	40183.57
777.471	38596.17
777.863	35040.29
778.255	32717.44
778.647	34649.51
779.039	39404.44
779.431	43579.26
779.823	43622.95
780.215	39591.33
780.607	34309.7
780.999	34586.4
781.39	37933.54
781.782	43062.26
782.174	45868.13
782.565	44809.86
782.957	39659.29
783.348	36086.42
783.74	37329.16
784.131	40744.26
784.522	46251.63
784.914	46739.5
785.305	42819.54
785.696	37739.36
786.087	34785.43
786.478	36079.14
786.869	39807.35
787.26	43159.35
787.651	41720.01
788.042	36591.29
788.433	31974.71
788.823	31096.05
789.214	33083.95
789.605	36906.82
789.995	38513.65
790.386	36727.21
790.776	31576.64
791.167	28183.39
791.557	29299.91
791.948	33530.56
792.338	38295.2
792.728	40455.42
793.118	37523.34
793.508	32897.05
793.898	30460.12
794.288	31382.47
794.678	35809.72
795.068	39807.35
795.458	40152.02
795.848	37346.15
796.238	32600.93
796.627	29918.85
797.017	31401.88
797.406	35787.87
797.796	38999.09
798.185	39627.74
798.575	36783.04
798.964	32025.68
799.354	29899.43
799.743	31523.25
800.132	36190.79
800.521	39751.53
800.91	40676.3
801.299	36358.27
801.688	31952.86
802.077	29302.34
802.466	30807.21
802.855	34127.65
803.244	36545.17
803.633	36076.71
804.021	33438.32
804.41	29625.16
804.799	26185.78
805.187	26149.38
805.576	28957.67
805.964	31256.25
806.352	30914.01
806.741	29025.63
807.129	25156.64
807.517	23156.61
807.905	23493.99
808.293	26489.19
808.681	29802.34
809.069	31372.76
809.457	30168.86
809.845	27013.47
810.233	23503.7
810.621	23887.2
811.009	26326.56
811.396	29850.89
811.784	31792.67
812.171	30081.48
812.559	26353.26
812.946	22807.09
813.334	21741.54
813.721	23210.01
814.108	25853.25
814.496	28620.29
814.883	27714.93
815.27	25598.4
815.657	21989.12
816.044	20256.08
816.431	21258.52
816.818	24270.71
817.205	26142.09
817.592	27045.02
817.979	25008.58
818.365	21588.62
818.752	18598.29
819.139	17811.87
819.525	19270.63
819.912	21219.69
820.298	23210.01
820.685	21882.32
821.071	19074.02
821.457	16649.23
821.843	14918.62
822.23	15547.27
822.616	16537.58
823.002	18355.56
823.388	17569.14
823.774	16158.93
824.16	13874.91
824.546	12037.51
824.931	11717.11
825.317	12452.56
825.703	14741.43
826.089	15605.52
826.474	15027.84
826.86	13042.38
827.245	11168.56
827.631	10047.18
828.016	10668.55
828.401	11775.37
828.787	13372.48
829.172	13610.35
829.557	12408.87
829.942	10515.64
830.327	8879.69
830.712	8413.66
831.097	8624.83
831.482	9942.81
831.867	11103.02
832.252	11008.36
832.636	9950.09
833.021	8406.38
833.406	7243.74
833.79	7153.93
834.175	7755.89
834.559	8891.83
834.944	9559.31
835.328	9260.76
835.713	7899.09
836.097	6729.17
836.481	5809.25
836.865	5678.18
837.249	6304.41
837.633	6969.47
838.017	7501.03
838.401	7010.73
838.785	6061.68
839.169	5122.35
839.553	4260.69
839.937	4224.28
840.32	4826.23
840.704	5243.71
841.087	5403.91
841.471	5000.99
841.854	4394.18
842.238	3617.47
842.621	3192.71
843.004	3233.97
843.388	3716.99
843.771	4236.41
844.154	4498.55
844.537	4335.93
844.92	3755.82
845.303	3253.39
845.686	2675.71
846.069	2809.21
846.452	3088.34
846.834	3700
847.217	3833.49
847.6	3716.99
847.982	3309.21
848.365	2719.4
848.748	2345.61
849.13	2246.09
849.512	2547.07
849.895	2809.21
850.277	3102.9
850.659	3064.06
851.041	2619.88
851.423	2350.46
851.806	1874.73
852.188	1811.62
852.57	2022.79
852.951	2318.91
853.333	2556.78
853.715	2483.96
854.097	2311.63
854.479	1814.05
854.86	1517.92
855.242	1440.25
855.623	1420.84
856.005	1690.26
856.386	1855.31
856.768	1930.55
857.149	1792.2
857.53	1537.34
857.911	1250.93
858.292	1119.86
858.674	1105.3
859.055	1192.68
859.436	1318.89
859.817	1435.4
860.197	1367.44
860.578	1289.77
860.959	1000.93
861.34	865
861.72	838.3
862.101	913.55
862.482	1017.92
862.862	1129.57
863.243	1032.48
863.623	1081.02
864.003	823.74
864.384	763.06
864.764	692.67
865.144	690.24
865.524	753.35
865.904	811.6
866.284	903.84
866.664	784.9
867.044	780.05
867.424	656.26
867.804	595.58
868.183	566.45
868.563	581.02
868.943	627.13
869.322	724.22
869.702	682.96
870.081	619.85
870.461	585.87
870.84	520.34
871.22	415.97
871.599	386.84
871.978	457.23
872.357	556.74
872.736	551.89
873.115	508.2
873.494	537.33
873.873	384.41
874.252	326.16
874.631	357.71
875.01	381.98
875.388	377.13
875.767	437.81
876.146	428.1
876.524	415.97
876.903	343.15
877.281	331.01
877.66	318.88
878.038	284.9
878.416	282.47
878.794	328.59
879.173	318.88
879.551	294.6
879.929	292.18
880.307	311.59
880.685	275.19
881.063	214.51
881.441	311.59
881.818	267.9
882.196	153.83
882.574	284.9
882.951	270.33
883.329	270.33
883.707	321.3
884.084	263.05
884.461	226.64
884.839	226.64
885.216	263.05
885.593	226.64
885.971	280.04
886.348	199.94
886.725	158.68
887.102	241.21
887.479	190.23
887.856	190.23
888.233	204.8
888.609	185.38
888.986	185.38
889.363	238.78
889.74	195.09
890.116	134.41
890.493	236.35
890.869	182.95
891.246	136.83
891.622	98
891.998	127.13
892.375	195.09
892.751	175.67
893.127	255.77
893.503	202.37
893.879	187.81
894.255	178.1
894.631	165.96
895.007	175.67
895.383	153.83
895.759	192.66
896.134	139.26
896.51	168.39
896.886	195.09
897.261	151.4
897.637	151.4
898.012	175.67
898.388	192.66
898.763	173.24
899.138	192.66
899.514	156.25
899.889	134.41
900.264	110.14
900.639	156.25
901.014	178.1
901.389	204.8
901.764	165.96
902.139	85.86
902.513	170.82
902.888	158.68
903.263	168.39
903.638	204.8
904.012	127.13
904.387	81.01
904.761	107.71
905.136	161.11
905.51	202.37
905.884	129.55
906.259	185.38
906.633	187.81
907.007	214.51
907.381	112.56
907.755	165.96
908.129	136.83
908.503	156.25
908.877	139.26
909.251	190.23
909.624	165.96
909.998	119.84
910.372	139.26
910.745	165.96
911.119	146.54
911.492	163.53
911.866	212.08
912.239	129.55
912.612	156.25
912.986	165.96
913.359	114.99
913.732	129.55
914.105	204.8
914.478	141.69
914.851	158.68
915.224	112.56
915.597	122.27
915.97	95.57
916.343	170.82
916.715	102.85
917.088	144.12
917.461	127.13
917.833	165.96
918.206	151.4
918.578	190.23
918.951	144.12
919.323	141.69
919.695	163.53
920.067	185.38
920.44	117.42
920.812	114.99
921.184	117.42
921.556	146.54
921.928	185.38
922.3	90.72
922.672	197.52
923.043	156.25
923.415	182.95
923.787	170.82
924.158	141.69
924.53	209.65
924.901	190.23
925.273	122.27
925.644	112.56
926.016	156.25
926.387	131.98
926.758	146.54
927.129	141.69
927.5	131.98
927.872	202.37
928.243	110.14
928.613	114.99
928.984	124.7
929.355	161.11
929.726	85.86
930.097	207.22
930.467	165.96
930.838	100.43
931.209	139.26
931.579	212.08
931.95	136.83
932.32	131.98
932.69	134.41
933.061	168.39
933.431	212.08
933.801	119.84
934.171	88.29
934.541	165.96
934.911	136.83
935.281	146.54
935.651	212.08
936.021	139.26
936.391	146.54
936.761	153.83
937.13	83.44
937.5	156.25
937.87	98
938.239	173.24
938.609	209.65
938.978	178.1
939.347	219.36
939.717	139.26
940.086	192.66
940.455	64.02
940.824	98
941.193	131.98
941.562	221.79
941.931	71.3
942.3	173.24
942.669	195.09
943.038	73.73
943.407	158.68
943.775	81.01
944.144	212.08
944.513	146.54
944.881	122.27
945.25	131.98
945.618	146.54
945.986	124.7
946.355	204.8
946.723	141.69
947.091	141.69
947.459	180.52
947.827	122.27
948.195	163.53
948.563	141.69
948.931	146.54
949.299	129.55
949.667	127.13
950.035	136.83
950.402	175.67
950.77	182.95
951.138	151.4
951.505	114.99
951.873	158.68
952.24	170.82
952.607	122.27
952.975	112.56
953.342	93.14
953.709	221.79
954.076	105.28
954.443	139.26
954.81	165.96
955.177	151.4
955.544	66.45
955.911	185.38
956.278	197.52
956.645	178.1
957.012	144.12
957.378	204.8
957.745	146.54
958.111	83.44
958.478	192.66
958.844	124.7
959.211	131.98
959.577	148.97
959.943	146.54
960.309	168.39
960.675	214.51
961.042	110.14
961.408	178.1
961.774	136.83
962.139	134.41
962.505	146.54
962.871	59.16
963.237	163.53
963.603	173.24
963.968	95.57
964.334	146.54
964.699	158.68
965.065	192.66
965.43	148.97
965.796	202.37
966.161	168.39
966.526	112.56
966.891	170.82
967.256	110.14
967.622	212.08
967.987	204.8
968.352	141.69
968.716	122.27
969.081	54.31
969.446	124.7
969.811	110.14
970.176	78.58
970.54	170.82
970.905	93.14
971.269	158.68
971.634	112.56
971.998	141.69
972.363	93.14
972.727	122.27
973.091	93.14
973.455	114.99
973.819	114.99
974.183	163.53
974.547	136.83
974.911	68.87
975.275	180.52
975.639	163.53
976.003	165.96
976.367	185.38
976.73	139.26
977.094	117.42
977.458	175.67
977.821	173.24
978.185	83.44
978.548	98
978.911	112.56
979.275	119.84
979.638	81.01
980.001	144.12
980.364	136.83
980.727	163.53
981.09	136.83
981.453	117.42
981.816	117.42
982.179	178.1
982.542	148.97
982.905	202.37
983.267	190.23
983.63	209.65
983.992	141.69
984.355	158.68
984.717	168.39
985.08	175.67
985.442	129.55
985.804	146.54
986.167	117.42
986.529	139.26
986.891	144.12
987.253	178.1
987.615	170.82
987.977	216.93
988.339	131.98
988.701	136.83
989.062	144.12
989.424	107.71
989.786	136.83
990.147	178.1
990.509	165.96
990.87	187.81
991.232	124.7
991.593	93.14
991.955	173.24
992.316	88.29
992.677	88.29
993.038	93.14
993.399	163.53
993.76	182.95
994.121	122.27
994.482	134.41
994.843	146.54
995.204	153.83
995.565	175.67
995.926	158.68
996.286	146.54
996.647	156.25
997.007	102.85
997.368	153.83
997.728	233.92
998.089	144.12
998.449	151.4
998.809	122.27
999.169	34.89
999.53	144.12
999.89	146.54
1000.25	163.53
1000.61	134.41
1000.97	178.1
1001.329	204.8
1001.689	168.39
1002.049	112.56
1002.409	158.68
1002.768	122.27
1003.128	148.97
1003.487	73.73
1003.847	182.95
1004.206	156.25
1004.566	122.27
1004.925	197.52
1005.284	114.99
1005.643	148.97
1006.003	136.83
1006.362	117.42
1006.721	168.39
1007.08	119.84
1007.438	187.81
1007.797	199.94
1008.156	122.27
1008.515	173.24
1008.874	68.87
1009.232	141.69
1009.591	90.72
1009.949	85.86
1010.308	139.26
1010.666	110.14
1011.024	98
1011.383	144.12
1011.741	175.67
1012.099	182.95
1012.457	202.37
1012.815	139.26
1013.173	248.49
1013.531	141.69
1013.889	141.69
1014.247	148.97
1014.605	165.96
1014.962	110.14
1015.32	90.72
1015.678	127.13
1016.035	117.42
1016.393	131.98
1016.75	61.59
1017.107	110.14
1017.465	139.26
1017.822	136.83
1018.179	175.67
1018.536	182.95
1018.894	178.1
1019.251	131.98
1019.608	178.1
1019.964	168.39
1020.321	192.66
1020.678	165.96
1021.035	100.43
1021.392	131.98
1021.748	66.45
1022.105	151.4
1022.461	190.23
1022.818	161.11
1023.174	144.12
1023.531	119.84
1023.887	141.69
1024.243	76.15
1024.599	127.13
1024.955	107.71
1025.311	161.11
1025.667	175.67
1026.023	190.23
1026.379	144.12
1026.735	141.69
1027.091	178.1
1027.447	190.23
