189.514	67.51
189.973	67.51
190.431	67.51
190.889	-22.3
191.348	9.25
191.806	1.97
192.264	-24.73
192.722	35.95
193.18	-32.01
193.638	-61.14
194.096	26.24
194.554	50.52
195.012	-2.88
195.47	-29.58
195.928	-7.74
196.385	-12.59
196.843	43.23
197.301	23.82
197.758	-32.01
198.216	4.4
198.674	23.82
199.131	-5.31
199.589	65.08
200.046	35.95
200.503	82.07
200.961	135.47
201.418	94.21
201.875	125.76
202.332	65.08
202.79	108.77
203.247	116.05
203.704	159.74
204.161	133.04
204.618	171.88
205.075	167.02
205.532	174.3
205.989	135.47
206.445	150.03
206.902	65.08
207.359	154.89
207.816	184.01
208.272	171.88
208.729	181.59
209.185	147.61
209.642	120.91
210.098	111.2
210.555	152.46
211.011	154.89
211.467	213.14
211.924	118.48
212.38	159.74
212.836	184.01
213.292	208.29
213.748	184.01
214.204	162.17
214.66	84.5
215.116	106.34
215.572	162.17
216.028	208.29
216.484	174.3
216.94	215.57
217.396	106.34
217.851	227.7
218.307	106.34
218.763	135.47
219.218	84.5
219.674	120.91
220.129	176.73
220.585	130.61
221.04	137.9
221.496	159.74
221.951	137.9
222.406	171.88
222.861	145.18
223.317	145.18
223.772	171.88
224.227	181.59
224.682	128.19
225.137	89.35
225.592	140.32
226.047	133.04
226.502	125.76
226.957	181.59
227.411	171.88
227.866	147.61
228.321	125.76
228.776	176.73
229.23	167.02
229.685	154.89
230.139	208.29
230.594	152.46
231.048	191.3
231.503	137.9
231.957	159.74
232.411	142.75
232.865	123.33
233.32	203.43
233.774	230.13
234.228	111.2
234.682	133.04
235.136	181.59
235.59	106.34
236.044	157.31
236.498	179.16
236.952	179.16
237.406	191.3
237.86	84.5
238.313	103.92
238.767	152.46
239.221	184.01
239.674	94.21
240.128	103.92
240.581	203.43
241.035	142.75
241.488	152.46
241.942	164.6
242.395	159.74
242.848	193.72
243.301	145.18
243.755	213.14
244.208	128.19
244.661	130.61
245.114	171.88
245.567	152.46
246.02	164.6
246.473	186.44
246.926	171.88
247.379	113.62
247.832	111.2
248.284	217.99
248.737	86.92
249.19	162.17
249.642	159.74
250.095	140.32
250.547	169.45
251	79.64
251.452	116.05
251.905	162.17
252.357	96.63
252.81	164.6
253.262	140.32
253.714	152.46
254.166	198.58
254.618	159.74
255.07	179.16
255.523	116.05
255.975	120.91
256.427	135.47
256.878	135.47
257.33	130.61
257.782	99.06
258.234	135.47
258.686	220.42
259.137	116.05
259.589	157.31
260.041	137.9
260.492	91.78
260.944	217.99
261.395	140.32
261.847	208.29
262.298	135.47
262.749	164.6
263.201	215.57
263.652	133.04
264.103	145.18
264.554	201
265.005	181.59
265.457	133.04
265.908	179.16
266.359	150.03
266.809	147.61
267.26	157.31
267.711	116.05
268.162	145.18
268.613	196.15
269.064	108.77
269.514	174.3
269.965	137.9
270.415	120.91
270.866	171.88
271.316	152.46
271.767	140.32
272.217	162.17
272.668	244.69
273.118	137.9
273.568	208.29
274.019	111.2
274.469	113.62
274.919	220.42
275.369	152.46
275.819	142.75
276.269	203.43
276.719	103.92
277.169	118.48
277.619	135.47
278.069	94.21
278.518	140.32
278.968	91.78
279.418	140.32
279.867	196.15
280.317	157.31
280.767	145.18
281.216	152.46
281.666	145.18
282.115	152.46
282.564	159.74
283.014	174.3
283.463	184.01
283.912	150.03
284.361	210.71
284.811	167.02
285.26	123.33
285.709	169.45
286.158	162.17
286.607	181.59
287.056	184.01
287.505	174.3
287.953	135.47
288.402	157.31
288.851	135.47
289.3	128.19
289.748	217.99
290.197	171.88
290.646	184.01
291.094	203.43
291.543	227.7
291.991	147.61
292.439	152.46
292.888	150.03
293.336	62.65
293.784	167.02
294.233	113.62
294.681	184.01
295.129	188.87
295.577	152.46
296.025	140.32
296.473	103.92
296.921	118.48
297.369	203.43
297.817	145.18
298.264	169.45
298.712	157.31
299.16	86.92
299.608	220.42
300.055	128.19
300.503	91.78
300.95	133.04
301.398	225.28
301.845	123.33
302.293	179.16
302.74	174.3
303.187	193.72
303.635	150.03
304.082	174.3
304.529	152.46
304.976	203.43
305.423	181.59
305.87	154.89
306.317	205.86
306.764	103.92
307.211	113.62
307.658	164.6
308.105	169.45
308.552	174.3
308.998	159.74
309.445	176.73
309.892	142.75
310.338	140.32
310.785	79.64
311.231	137.9
311.678	186.44
312.124	159.74
312.571	232.56
313.017	198.58
313.463	203.43
313.909	213.14
314.356	164.6
314.802	167.02
315.248	145.18
315.694	208.29
316.14	210.71
316.586	159.74
317.032	135.47
317.478	125.76
317.923	130.61
318.369	140.32
318.815	147.61
319.261	116.05
319.706	140.32
320.152	145.18
320.597	108.77
321.043	103.92
321.488	222.85
321.934	150.03
322.379	162.17
322.824	174.3
323.27	169.45
323.715	91.78
324.16	84.5
324.605	116.05
325.05	106.34
325.495	193.72
325.94	217.99
326.385	108.77
326.83	106.34
327.275	108.77
327.72	169.45
328.165	118.48
328.61	123.33
329.054	193.72
329.499	164.6
329.943	232.56
330.388	82.07
330.832	142.75
331.277	213.14
331.721	171.88
332.166	169.45
332.61	179.16
333.054	157.31
333.499	152.46
333.943	217.99
334.387	113.62
334.831	181.59
335.275	150.03
335.719	159.74
336.163	133.04
336.607	174.3
337.051	113.62
337.495	140.32
337.938	111.2
338.382	118.48
338.826	234.99
339.269	162.17
339.713	125.76
340.157	123.33
340.6	215.57
341.044	142.75
341.487	227.7
341.93	77.22
342.374	130.61
342.817	188.87
343.26	150.03
343.703	152.46
344.146	72.36
344.59	191.3
345.033	135.47
345.476	140.32
345.919	167.02
346.361	154.89
346.804	171.88
347.247	147.61
347.69	145.18
348.133	179.16
348.575	191.3
349.018	242.27
349.461	130.61
349.903	116.05
350.346	171.88
350.788	169.45
351.23	108.77
351.673	120.91
352.115	133.04
352.557	171.88
353	157.31
353.442	169.45
353.884	125.76
354.326	154.89
354.768	193.72
355.21	125.76
355.652	191.3
356.094	171.88
356.536	184.01
356.978	213.14
357.419	135.47
357.861	169.45
358.303	201
358.744	179.16
359.186	128.19
359.627	184.01
360.069	125.76
360.51	157.31
360.952	159.74
361.393	154.89
361.834	181.59
362.276	147.61
362.717	157.31
363.158	123.33
363.599	198.58
364.04	179.16
364.481	159.74
364.922	99.06
365.363	150.03
365.804	157.31
366.245	106.34
366.686	130.61
367.126	84.5
367.567	164.6
368.008	232.56
368.448	220.42
368.889	133.04
369.33	171.88
369.77	128.19
370.21	179.16
370.651	154.89
371.091	196.15
371.531	159.74
371.972	137.9
372.412	137.9
372.852	181.59
373.292	176.73
373.732	179.16
374.172	159.74
374.612	174.3
375.052	125.76
375.492	181.59
375.932	157.31
376.372	150.03
376.811	162.17
377.251	196.15
377.691	152.46
378.13	186.44
378.57	225.28
379.009	120.91
379.449	145.18
379.888	181.59
380.328	188.87
380.767	106.34
381.206	193.72
381.645	142.75
382.085	159.74
382.524	208.29
382.963	186.44
383.402	184.01
383.841	179.16
384.28	147.61
384.719	135.47
385.158	154.89
385.596	174.3
386.035	140.32
386.474	164.6
386.913	147.61
387.351	167.02
387.79	147.61
388.228	179.16
388.667	145.18
389.105	120.91
389.544	133.04
389.982	118.48
390.42	205.86
390.859	96.63
391.297	94.21
391.735	137.9
392.173	120.91
392.611	273.82
393.049	164.6
393.487	145.18
393.925	142.75
394.363	164.6
394.801	140.32
395.239	186.44
395.676	67.51
396.114	86.92
396.552	135.47
396.989	116.05
397.427	142.75
397.864	116.05
398.302	193.72
398.739	111.2
399.177	99.06
399.614	181.59
400.051	135.47
400.488	157.31
400.926	152.46
401.363	77.22
401.8	154.89
402.237	152.46
402.674	125.76
403.111	159.74
403.548	96.63
403.985	174.3
404.421	198.58
404.858	89.35
405.295	133.04
405.732	99.06
406.168	135.47
406.605	72.36
407.041	125.76
407.478	135.47
407.914	152.46
408.351	133.04
408.787	201
409.223	244.69
409.66	128.19
410.096	176.73
410.532	210.71
410.968	111.2
411.404	99.06
411.84	135.47
412.276	244.69
412.712	140.32
413.148	179.16
413.584	196.15
414.02	101.49
414.455	157.31
414.891	145.18
415.327	196.15
415.762	118.48
416.198	176.73
416.633	169.45
417.069	181.59
417.504	147.61
417.94	86.92
418.375	181.59
418.81	171.88
419.245	159.74
419.681	174.3
420.116	123.33
420.551	167.02
420.986	91.78
421.421	179.16
421.856	120.91
422.291	191.3
422.726	167.02
423.16	103.92
423.595	111.2
424.03	169.45
424.464	67.51
424.899	184.01
425.334	244.69
425.768	123.33
426.203	137.9
426.637	133.04
427.071	167.02
427.506	150.03
427.94	128.19
428.374	167.02
428.809	186.44
429.243	150.03
429.677	154.89
430.111	203.43
430.545	159.74
430.979	111.2
431.413	123.33
431.847	220.42
432.28	103.92
432.714	77.22
433.148	130.61
433.582	128.19
434.015	157.31
434.449	201
434.882	184.01
435.316	184.01
435.749	208.29
436.183	140.32
436.616	154.89
437.049	198.58
437.483	152.46
437.916	135.47
438.349	198.58
438.782	220.42
439.215	137.9
439.648	145.18
440.081	152.46
440.514	232.56
440.947	203.43
441.38	162.17
441.813	222.85
442.245	201
442.678	210.71
443.111	232.56
443.543	234.99
443.976	174.3
444.408	186.44
444.841	174.3
445.273	186.44
445.705	247.12
446.138	239.84
446.57	154.89
447.002	220.42
447.434	159.74
447.867	234.99
448.299	254.4
448.731	213.14
449.163	266.54
449.595	237.41
450.026	234.99
450.458	176.73
450.89	191.3
451.322	210.71
451.754	188.87
452.185	193.72
452.617	222.85
453.048	198.58
453.48	290.81
453.911	268.97
454.343	281.1
454.774	220.42
455.205	234.99
455.637	169.45
456.068	266.54
456.499	295.67
456.93	300.52
457.361	244.69
457.792	230.13
458.223	251.98
458.654	281.1
459.085	293.24
459.516	198.58
459.947	247.12
460.378	281.1
460.808	281.1
461.239	268.97
461.669	179.16
462.1	288.38
462.531	302.95
462.961	317.51
463.391	222.85
463.822	251.98
464.252	242.27
464.682	198.58
465.113	251.98
465.543	174.3
465.973	244.69
466.403	271.39
466.833	295.67
467.263	307.8
467.693	196.15
468.123	244.69
468.553	222.85
468.983	232.56
469.412	205.86
469.842	254.4
470.272	281.1
470.701	220.42
471.131	210.71
471.56	222.85
471.99	171.88
472.419	215.57
472.849	266.54
473.278	186.44
473.707	283.53
474.136	261.68
474.566	215.57
474.995	186.44
475.424	154.89
475.853	205.86
476.282	213.14
476.711	249.55
477.14	220.42
477.569	230.13
477.997	196.15
478.426	205.86
478.855	217.99
479.283	140.32
479.712	203.43
480.141	201
480.569	184.01
480.998	193.72
481.426	176.73
481.854	225.28
482.283	184.01
482.711	220.42
483.139	162.17
483.567	239.84
483.995	230.13
484.424	225.28
484.852	169.45
485.28	174.3
485.708	220.42
486.135	203.43
486.563	271.39
486.991	249.55
487.419	198.58
487.847	181.59
488.274	181.59
488.702	193.72
489.129	230.13
489.557	140.32
489.984	193.72
490.412	225.28
490.839	184.01
491.266	159.74
491.694	193.72
492.121	201
492.548	162.17
492.975	193.72
493.402	186.44
493.829	188.87
494.256	256.83
494.683	169.45
495.11	215.57
495.537	186.44
495.964	191.3
496.39	247.12
496.817	201
497.244	234.99
497.67	217.99
498.097	220.42
498.523	184.01
498.95	196.15
499.376	135.47
499.803	181.59
500.229	191.3
500.655	118.48
501.081	135.47
501.508	213.14
501.934	174.3
502.36	154.89
502.786	247.12
503.212	193.72
503.638	118.48
504.064	213.14
504.489	147.61
504.915	142.75
505.341	201
505.767	261.68
506.192	217.99
506.618	191.3
507.043	147.61
507.469	188.87
507.894	167.02
508.32	196.15
508.745	184.01
509.17	147.61
509.596	184.01
510.021	230.13
510.446	215.57
510.871	232.56
511.296	130.61
511.721	171.88
512.146	169.45
512.571	125.76
512.996	249.55
513.421	150.03
513.845	232.56
514.27	191.3
514.695	181.59
515.119	171.88
515.544	179.16
515.969	147.61
516.393	196.15
516.817	171.88
517.242	108.77
517.666	108.77
518.09	251.98
518.515	196.15
518.939	203.43
519.363	436.44
519.787	225.28
520.211	184.01
520.635	113.62
521.059	154.89
521.483	174.3
521.907	193.72
522.331	222.85
522.754	169.45
523.178	171.88
523.602	196.15
524.025	174.3
524.449	205.86
524.872	196.15
525.296	186.44
525.719	191.3
526.143	217.99
526.566	169.45
526.989	247.12
527.412	244.69
527.836	174.3
528.259	106.34
528.682	171.88
529.105	222.85
529.528	167.02
529.951	169.45
530.374	205.86
530.796	113.62
531.219	208.29
531.642	159.74
532.065	184.01
532.487	201
532.91	227.7
533.332	108.77
533.755	191.3
534.177	198.58
534.6	142.75
535.022	193.72
535.444	203.43
535.867	120.91
536.289	159.74
536.711	152.46
537.133	220.42
537.555	145.18
537.977	264.11
538.399	162.17
538.821	237.41
539.243	108.77
539.665	215.57
540.086	203.43
540.508	142.75
540.93	210.71
541.351	181.59
541.773	222.85
542.195	201
542.616	237.41
543.037	295.67
543.459	205.86
543.88	167.02
544.301	208.29
544.723	157.31
545.144	232.56
545.565	225.28
545.986	201
546.407	237.41
546.828	288.38
547.249	227.7
547.67	181.59
548.091	237.41
548.512	208.29
548.932	230.13
549.353	232.56
549.774	220.42
550.194	167.02
550.615	213.14
551.035	181.59
551.456	111.2
551.876	150.03
552.296	176.73
552.717	188.87
553.137	120.91
553.557	133.04
553.977	201
554.397	157.31
554.817	179.16
555.237	239.84
555.657	227.7
556.077	120.91
556.497	201
556.917	203.43
557.337	169.45
557.756	222.85
558.176	179.16
558.596	184.01
559.015	232.56
559.435	179.16
559.854	220.42
560.274	135.47
560.693	181.59
561.112	217.99
561.532	234.99
561.951	201
562.37	247.12
562.789	174.3
563.208	198.58
563.627	184.01
564.046	130.61
564.465	184.01
564.884	174.3
565.303	213.14
565.722	230.13
566.14	130.61
566.559	176.73
566.978	264.11
567.396	237.41
567.815	208.29
568.233	167.02
568.652	152.46
569.07	164.6
569.489	157.31
569.907	210.71
570.325	198.58
570.743	152.46
571.161	135.47
571.58	217.99
571.998	184.01
572.416	186.44
572.833	203.43
573.251	193.72
573.669	157.31
574.087	264.11
574.505	225.28
574.922	191.3
575.34	193.72
575.758	203.43
576.175	137.9
576.593	196.15
577.01	210.71
577.428	159.74
577.845	1594.23
578.262	290.81
578.68	259.26
579.097	198.58
579.514	186.44
579.931	184.01
580.348	186.44
580.765	147.61
581.182	186.44
581.599	167.02
582.016	179.16
582.433	220.42
582.849	239.84
583.266	193.72
583.683	171.88
584.099	220.42
584.516	159.74
584.933	174.3
585.349	159.74
585.765	196.15
586.182	188.87
586.598	217.99
587.014	210.71
587.431	169.45
587.847	162.17
588.263	181.59
588.679	196.15
589.095	99.06
589.511	152.46
589.927	232.56
590.343	154.89
590.759	164.6
591.174	278.68
591.59	157.31
592.006	208.29
592.421	193.72
592.837	120.91
593.252	196.15
593.668	203.43
594.083	196.15
594.499	133.04
594.914	188.87
595.329	213.14
595.745	227.7
596.16	123.33
596.575	203.43
596.99	198.58
597.405	159.74
597.82	184.01
598.235	111.2
598.65	242.27
599.065	162.17
599.479	208.29
599.894	162.17
600.309	184.01
600.724	186.44
601.138	118.48
601.553	203.43
601.967	188.87
602.382	186.44
602.796	222.85
603.21	150.03
603.625	191.3
604.039	201
604.453	171.88
604.867	176.73
605.281	145.18
605.695	174.3
606.109	196.15
606.523	133.04
606.937	179.16
607.351	312.66
607.765	193.72
608.178	213.14
608.592	261.68
609.006	179.16
609.419	215.57
609.833	217.99
610.246	137.9
610.66	227.7
611.073	157.31
611.487	186.44
611.9	215.57
612.313	198.58
612.726	217.99
613.139	176.73
613.553	191.3
613.966	188.87
614.379	137.9
614.792	210.71
615.204	186.44
615.617	133.04
616.03	152.46
616.443	167.02
616.856	198.58
617.268	116.05
617.681	184.01
618.093	171.88
618.506	130.61
618.918	79.64
619.331	171.88
619.743	167.02
620.155	164.6
620.568	169.45
620.98	118.48
621.392	186.44
621.804	196.15
622.216	191.3
622.628	191.3
623.04	167.02
623.452	225.28
623.864	135.47
624.276	145.18
624.687	159.74
625.099	154.89
625.511	135.47
625.922	135.47
626.334	118.48
626.745	217.99
627.157	196.15
627.568	118.48
627.979	162.17
628.391	213.14
628.802	215.57
629.213	188.87
629.624	171.88
630.035	82.07
630.446	157.31
630.857	196.15
631.268	108.77
631.679	123.33
632.09	247.12
632.501	201
632.912	174.3
633.322	249.55
633.733	113.62
634.144	120.91
634.554	174.3
634.965	157.31
635.375	181.59
635.785	203.43
636.196	130.61
636.606	191.3
637.016	130.61
637.427	142.75
637.837	186.44
638.247	106.34
638.657	210.71
639.067	133.04
639.477	184.01
639.887	205.86
640.297	164.6
640.706	120.91
641.116	176.73
641.526	130.61
641.935	94.21
642.345	154.89
642.755	111.2
643.164	79.64
643.573	176.73
643.983	147.61
644.392	152.46
644.801	181.59
645.211	157.31
645.62	232.56
646.029	186.44
646.438	201
646.847	186.44
647.256	186.44
647.665	208.29
648.074	196.15
648.483	184.01
648.892	215.57
649.3	198.58
649.709	140.32
650.118	247.12
650.526	84.5
650.935	99.06
651.343	242.27
651.752	167.02
652.16	128.19
652.568	128.19
652.977	174.3
653.385	239.84
653.793	215.57
654.201	150.03
654.609	179.16
655.017	154.89
655.425	133.04
655.833	285.96
656.241	188.87
656.649	157.31
657.057	181.59
657.464	186.44
657.872	210.71
658.28	103.92
658.687	157.31
659.095	186.44
659.502	147.61
659.91	116.05
660.317	159.74
660.724	150.03
661.132	130.61
661.539	220.42
661.946	82.07
662.353	181.59
662.76	203.43
663.167	184.01
663.574	99.06
663.981	142.75
664.388	164.6
664.795	159.74
665.202	176.73
665.608	137.9
666.015	179.16
666.422	96.63
666.828	191.3
667.235	176.73
667.641	137.9
668.047	225.28
668.454	135.47
668.86	103.92
669.266	106.34
669.673	171.88
670.079	174.3
670.485	157.31
670.891	217.99
671.297	147.61
671.703	123.33
672.109	135.47
672.515	142.75
672.92	196.15
673.326	154.89
673.732	167.02
674.138	147.61
674.543	215.57
674.949	196.15
675.354	152.46
675.76	171.88
676.165	157.31
676.57	169.45
676.976	169.45
677.381	150.03
677.786	179.16
678.191	184.01
678.596	167.02
679.001	208.29
679.406	157.31
679.811	133.04
680.216	154.89
680.621	196.15
681.026	169.45
681.43	135.47
681.835	184.01
682.24	120.91
682.644	171.88
683.049	213.14
683.453	142.75
683.858	159.74
684.262	171.88
684.667	205.86
685.071	133.04
685.475	174.3
685.879	147.61
686.283	171.88
686.687	205.86
687.091	184.01
687.495	147.61
687.899	154.89
688.303	169.45
688.707	234.99
689.111	137.9
689.514	157.31
689.918	213.14
690.322	181.59
690.725	106.34
691.129	133.04
691.532	193.72
691.936	179.16
692.339	142.75
692.742	225.28
693.146	174.3
693.549	203.43
693.952	152.46
694.355	164.6
694.758	247.12
695.161	244.69
695.564	203.43
695.967	213.14
696.37	111.2
696.773	198.58
697.175	125.76
697.578	198.58
697.981	208.29
698.383	201
698.786	181.59
699.188	157.31
699.591	191.3
699.993	230.13
700.395	159.74
700.798	157.31
701.2	188.87
701.602	157.31
702.004	210.71
702.406	213.14
702.808	154.89
703.21	203.43
703.612	174.3
704.014	249.55
704.416	157.31
704.818	203.43
705.219	237.41
705.621	217.99
706.023	176.73
706.424	205.86
706.826	191.3
707.227	215.57
707.629	225.28
708.03	210.71
708.431	164.6
708.832	237.41
709.234	254.4
709.635	244.69
710.036	159.74
710.437	203.43
710.838	310.23
711.239	239.84
711.64	232.56
712.041	176.73
712.441	201
712.842	188.87
713.243	239.84
713.643	239.84
714.044	259.26
714.445	295.67
714.845	203.43
715.246	295.67
715.646	225.28
716.046	256.83
716.447	327.22
716.847	300.52
717.247	315.08
717.647	290.81
718.047	261.68
718.447	344.21
718.847	339.36
719.247	368.48
719.647	368.48
720.047	327.22
720.446	407.32
720.846	322.37
721.246	431.59
721.645	363.63
722.045	385.47
722.444	441.3
722.844	412.17
723.243	397.61
723.643	370.91
724.042	402.46
724.441	451.01
724.84	494.7
725.24	443.73
725.639	419.45
726.038	480.13
726.437	516.54
726.836	511.69
727.234	545.67
727.633	492.27
728.032	482.56
728.431	531.11
728.83	618.49
729.228	579.65
729.627	557.81
730.025	579.65
730.424	703.44
730.822	691.3
731.22	667.03
731.619	742.27
732.017	897.62
732.415	807.81
732.813	914.61
733.212	968.01
733.61	1101.5
734.008	1137.91
734.406	1106.36
734.803	1283.55
735.201	1307.82
735.599	1434.03
735.997	1438.89
736.395	1477.72
736.792	1618.5
737.19	1676.76
737.587	1861.22
737.985	1856.37
738.382	2009.28
738.78	2135.5
739.177	2254.43
739.574	2264.14
739.971	2516.57
740.369	2640.36
740.766	2713.18
741.163	2667.06
741.56	2917.07
741.957	2926.77
742.354	3086.97
742.751	3198.62
743.147	3281.15
743.544	3414.65
743.941	3722.9
744.338	3946.21
744.734	4116.11
745.131	4295.73
745.527	4509.32
745.924	4771.46
746.32	4696.22
746.716	4987.49
747.113	5400.11
747.509	5742.35
747.905	5829.73
748.301	6300.61
748.697	6463.24
749.093	6863.73
749.489	7123.44
749.885	7424.42
750.281	7705.98
750.677	7815.2
751.073	8446.28
751.468	8815.22
751.864	9196.29
752.26	9249.69
752.655	9589.5
753.051	9897.76
753.446	10240
753.842	11070.11
754.237	11502.15
754.632	11179.33
755.028	11667.2
755.423	11863.81
755.818	12074.98
756.213	12196.34
756.608	12650.23
757.003	12817.71
757.398	12980.33
757.793	13079.85
758.188	13405.09
758.583	13752.19
758.977	13965.78
759.372	14502.2
759.767	15215.8
760.161	15834.74
760.556	16456.11
760.95	17410.01
761.345	18048.37
761.739	18694.01
762.133	19274.12
762.527	20191.61
762.922	20599.38
763.316	21157.64
763.71	21815.42
764.104	22305.72
764.498	22390.67
764.892	22769.32
765.286	23657.68
765.68	23762.05
766.073	23732.92
766.467	23897.97
766.861	25677.13
767.255	26390.73
767.648	26434.42
768.042	26970.84
768.435	28012.12
768.829	28143.19
769.222	28007.26
769.615	29422.33
770.008	29851.95
770.402	29514.57
770.795	29373.79
771.188	30373.8
771.581	30116.52
771.974	29524.28
772.367	29584.96
772.76	30939.35
773.153	30123.8
773.545	29361.65
773.938	30580.12
774.331	31322.85
774.724	30990.32
775.116	31885.96
775.509	34233.09
775.901	34970.96
776.294	34616.59
776.686	34898.15
777.078	37051.09
777.471	37939.46
777.863	38109.36
778.255	39213.75
778.647	41619.12
779.039	40854.55
779.431	38895.78
779.823	39869.1
780.215	41364.27
780.607	39995.31
780.999	40764.74
781.39	41150.67
781.782	42857.01
782.174	42058.45
782.565	41626.41
782.957	42849.73
783.348	44468.68
783.74	43643.43
784.131	42230.78
784.522	43124
784.914	43961.39
785.305	43138.57
785.696	42235.64
786.087	42893.42
786.478	41849.71
786.869	39599.68
787.26	38315.67
787.651	39468.61
788.042	39293.85
788.433	36937.01
788.823	35924.86
789.214	36245.25
789.605	35852.04
789.995	34216.1
790.386	33203.94
790.776	33975.8
791.167	34029.2
791.557	33832.6
791.948	34359.3
792.338	35628.74
792.728	36997.69
793.118	36162.73
793.508	35024.36
793.898	36400.6
794.288	37247.7
794.678	35883.6
795.068	35587.48
795.458	36165.16
795.848	37128.76
796.238	35941.85
796.627	34900.57
797.017	35514.66
797.406	36133.6
797.796	34835.04
798.185	35051.06
798.575	36136.03
798.964	35973.41
799.354	35555.92
799.743	34677.27
800.132	35992.82
800.521	36757.4
800.91	35966.12
801.299	34021.92
801.688	35257.37
802.077	36189.43
802.466	35291.36
802.855	33934.54
803.244	32713.65
803.633	33745.22
804.021	32395.68
804.41	31524.31
804.799	31235.47
805.187	31451.49
805.576	30131.08
805.964	28645.62
806.352	27737.84
806.741	29094.66
807.129	27958.72
807.517	26808.21
807.905	27123.75
808.293	28111.63
808.681	28274.26
809.069	27305.79
809.457	27842.21
809.845	28990.29
810.233	29072.81
810.621	28381.05
811.009	27383.47
811.396	28395.62
811.784	29487.87
812.171	28097.07
812.559	26631.03
812.946	27288.8
813.334	28014.54
813.721	26427.14
814.108	24587.31
814.496	25019.35
814.883	26181.99
815.27	26361.61
815.657	24798.47
816.044	24468.37
816.431	25701.4
816.818	25944.12
817.205	24475.65
817.592	23980.5
817.979	24325.17
818.365	24735.37
818.752	22810.58
819.139	21456.19
819.525	21982.9
819.912	22167.37
820.298	21390.65
820.685	19837.23
821.071	19424.6
821.457	19783.83
821.843	19291.11
822.23	17696.42
822.616	17288.65
823.002	17247.39
823.388	16567.76
823.774	15431.82
824.16	14363.85
824.546	14698.8
824.931	15252.21
825.317	14371.13
825.703	13419.66
826.089	13159.94
826.474	13834.71
826.86	13414.8
827.245	12669.64
827.631	12640.52
828.016	12965.77
828.401	12985.18
828.787	12470.61
829.172	11902.64
829.557	11708.46
829.942	11798.27
830.327	11451.18
830.712	10596.8
831.097	10324.95
831.482	10572.52
831.867	10456.02
832.252	10055.53
832.636	9553.09
833.021	9565.23
833.406	10048.24
833.79	9591.93
834.175	8771.53
834.559	8790.94
834.944	8912.3
835.328	8941.43
835.713	8227.83
836.097	7638.01
836.481	7591.9
836.865	7905.01
837.249	7688.98
837.633	7130.72
838.017	6749.65
838.401	6713.24
838.785	6402.56
839.169	6070.03
839.553	5854
839.937	5613.71
840.32	5667.11
840.704	5337.01
841.087	5048.17
841.471	4499.61
841.854	4759.33
842.238	4837
842.621	4502.04
843.004	4198.64
843.388	4050.58
843.771	4239.9
844.154	4286.02
844.537	3951.06
844.92	3829.7
845.303	3698.63
845.686	3958.34
846.069	3880.67
846.452	3681.64
846.834	3485.04
847.217	3511.74
847.6	3618.53
847.982	3548.14
848.365	3084.54
848.748	3055.42
849.13	3164.64
849.512	3106.39
849.895	2929.2
850.277	2679.2
850.659	2664.63
851.041	2902.5
851.423	2856.39
851.806	2565.12
852.188	2567.55
852.57	2533.56
852.951	2676.77
853.333	2562.69
853.715	2385.5
854.097	2247.15
854.479	2247.15
854.86	2332.11
855.242	2140.35
855.623	2018.99
856.005	1737.44
856.386	1946.18
856.768	1873.36
857.149	1735.01
857.53	1657.34
857.911	1613.65
858.292	1596.66
858.674	1545.69
859.055	1404.91
859.436	1278.69
859.817	1344.23
860.197	1341.8
860.578	1281.12
860.959	1174.32
861.34	1176.75
861.72	1186.46
862.101	1167.04
862.482	1137.91
862.862	987.42
863.243	931.6
863.623	1033.54
864.003	1091.79
864.384	1035.97
864.764	878.2
865.144	849.07
865.524	955.87
865.904	853.93
866.284	868.49
866.664	819.95
867.044	710.72
867.424	773.83
867.804	710.72
868.183	824.8
868.563	698.58
868.943	620.91
869.322	681.59
869.702	696.16
870.081	635.48
870.461	497.13
870.84	565.09
871.22	596.64
871.599	591.79
871.978	555.38
872.357	475.28
872.736	470.43
873.115	516.54
873.494	533.53
873.873	409.75
874.252	487.42
874.631	438.87
875.01	429.16
875.388	409.75
875.767	429.16
876.146	400.04
876.524	361.2
876.903	368.48
877.281	358.77
877.66	361.2
878.038	295.67
878.416	375.76
878.794	378.19
879.173	361.2
879.551	332.07
879.929	281.1
880.307	285.96
880.685	298.09
881.063	285.96
881.441	281.1
881.818	264.11
882.196	300.52
882.574	249.55
882.951	288.38
883.329	234.99
883.707	254.4
884.084	273.82
884.461	256.83
884.839	261.68
885.216	222.85
885.593	203.43
885.971	249.55
886.348	196.15
886.725	222.85
887.102	244.69
887.479	249.55
887.856	210.71
888.233	157.31
888.609	215.57
888.986	162.17
889.363	205.86
889.74	225.28
890.116	186.44
890.493	208.29
890.869	171.88
891.246	220.42
891.622	137.9
891.998	174.3
892.375	188.87
892.751	213.14
893.127	220.42
893.503	215.57
893.879	142.75
894.255	213.14
894.631	193.72
895.007	108.77
895.383	135.47
895.759	169.45
896.134	171.88
896.51	152.46
896.886	145.18
897.261	232.56
897.637	159.74
898.012	137.9
898.388	130.61
898.763	196.15
899.138	188.87
899.514	106.34
899.889	193.72
900.264	123.33
900.639	159.74
901.014	174.3
901.389	145.18
901.764	152.46
902.139	116.05
902.513	94.21
902.888	198.58
903.263	145.18
903.638	91.78
904.012	145.18
904.387	154.89
904.761	186.44
905.136	167.02
905.51	164.6
905.884	99.06
906.259	169.45
906.633	140.32
907.007	188.87
907.381	244.69
907.755	84.5
908.129	147.61
908.503	217.99
908.877	145.18
909.251	120.91
909.624	181.59
909.998	167.02
910.372	130.61
910.745	108.77
911.119	159.74
911.492	179.16
911.866	157.31
912.239	164.6
912.612	196.15
912.986	154.89
913.359	133.04
913.732	91.78
914.105	196.15
914.478	125.76
914.851	106.34
915.224	152.46
915.597	103.92
915.97	120.91
916.343	227.7
916.715	242.27
917.088	159.74
917.461	171.88
917.833	140.32
918.206	264.11
918.578	171.88
918.951	135.47
919.323	186.44
919.695	150.03
920.067	188.87
920.44	140.32
920.812	152.46
921.184	108.77
921.556	191.3
921.928	152.46
922.3	169.45
922.672	176.73
923.043	79.64
923.415	142.75
923.787	91.78
924.158	201
924.53	123.33
924.901	113.62
925.273	164.6
925.644	108.77
926.016	176.73
926.387	133.04
926.758	135.47
927.129	167.02
927.5	162.17
927.872	118.48
928.243	128.19
928.613	150.03
928.984	201
929.355	125.76
929.726	133.04
930.097	154.89
930.467	69.93
930.838	154.89
931.209	150.03
931.579	135.47
931.95	111.2
932.32	94.21
932.69	169.45
933.061	208.29
933.431	142.75
933.801	130.61
934.171	210.71
934.541	96.63
934.911	113.62
935.281	65.08
935.651	171.88
936.021	159.74
936.391	150.03
936.761	145.18
937.13	111.2
937.5	191.3
937.87	137.9
938.239	137.9
938.609	118.48
938.978	145.18
939.347	103.92
939.717	162.17
940.086	103.92
940.455	99.06
940.824	164.6
941.193	147.61
941.562	184.01
941.931	154.89
942.3	142.75
942.669	169.45
943.038	184.01
943.407	118.48
943.775	213.14
944.144	169.45
944.513	208.29
944.881	157.31
945.25	162.17
945.618	169.45
945.986	181.59
946.355	140.32
946.723	89.35
947.091	145.18
947.459	152.46
947.827	145.18
948.195	154.89
948.563	159.74
948.931	62.65
949.299	227.7
949.667	157.31
950.035	111.2
950.402	159.74
950.77	113.62
951.138	179.16
951.505	145.18
951.873	101.49
952.24	152.46
952.607	213.14
952.975	86.92
953.342	179.16
953.709	181.59
954.076	239.84
954.443	208.29
954.81	213.14
955.177	113.62
955.544	147.61
955.911	125.76
956.278	167.02
956.645	217.99
957.012	108.77
957.378	125.76
957.745	159.74
958.111	167.02
958.478	181.59
958.844	123.33
959.211	167.02
959.577	205.86
959.943	120.91
960.309	128.19
960.675	220.42
961.042	181.59
961.408	118.48
961.774	135.47
962.139	113.62
962.505	167.02
962.871	108.77
963.237	91.78
963.603	150.03
963.968	198.58
964.334	140.32
964.699	135.47
965.065	157.31
965.43	142.75
965.796	140.32
966.161	57.8
966.526	145.18
966.891	164.6
967.256	191.3
967.622	137.9
967.987	205.86
968.352	116.05
968.716	162.17
969.081	116.05
969.446	162.17
969.811	167.02
970.176	157.31
970.54	164.6
970.905	164.6
971.269	118.48
971.634	130.61
971.998	137.9
972.363	123.33
972.727	198.58
973.091	33.53
973.455	167.02
973.819	123.33
974.183	118.48
974.547	181.59
974.911	111.2
975.275	169.45
975.639	150.03
976.003	116.05
976.367	123.33
976.73	123.33
977.094	111.2
977.458	208.29
977.821	137.9
978.185	150.03
978.548	128.19
978.911	167.02
979.275	184.01
979.638	157.31
980.001	65.08
980.364	118.48
980.727	159.74
981.09	91.78
981.453	167.02
981.816	116.05
982.179	176.73
982.542	120.91
982.905	188.87
983.267	142.75
983.63	118.48
983.992	174.3
984.355	116.05
984.717	128.19
985.08	164.6
985.442	113.62
985.804	82.07
986.167	152.46
986.529	169.45
986.891	123.33
987.253	137.9
987.615	196.15
987.977	150.03
988.339	55.37
988.701	147.61
989.062	137.9
989.424	145.18
989.786	167.02
990.147	164.6
990.509	116.05
990.87	167.02
991.232	133.04
991.593	140.32
991.955	174.3
992.316	164.6
992.677	89.35
993.038	140.32
993.399	135.47
993.76	154.89
994.121	167.02
994.482	103.92
994.843	116.05
995.204	208.29
995.565	150.03
995.926	140.32
996.286	152.46
996.647	89.35
997.007	130.61
997.368	176.73
997.728	147.61
998.089	181.59
998.449	62.65
998.809	154.89
999.169	196.15
999.53	154.89
999.89	118.48
1000.25	140.32
1000.61	191.3
1000.97	201
1001.329	99.06
1001.689	203.43
1002.049	201
1002.409	198.58
1002.768	181.59
1003.128	142.75
1003.487	118.48
1003.847	171.88
1004.206	176.73
1004.566	171.88
1004.925	154.89
1005.284	130.61
1005.643	162.17
1006.003	147.61
1006.362	188.87
1006.721	99.06
1007.08	96.63
1007.438	135.47
1007.797	113.62
1008.156	159.74
1008.515	201
1008.874	186.44
1009.232	101.49
1009.591	113.62
1009.949	116.05
1010.308	113.62
1010.666	106.34
1011.024	91.78
1011.383	123.33
1011.741	159.74
1012.099	179.16
1012.457	133.04
1012.815	181.59
1013.173	103.92
1013.531	111.2
1013.889	181.59
1014.247	72.36
1014.605	198.58
1014.962	128.19
1015.32	123.33
1015.678	137.9
1016.035	196.15
1016.393	135.47
1016.75	145.18
1017.107	188.87
1017.465	169.45
1017.822	99.06
1018.179	174.3
1018.536	99.06
1018.894	67.51
1019.251	40.81
1019.608	152.46
1019.964	145.18
1020.321	203.43
1020.678	91.78
1021.035	147.61
1021.392	162.17
1021.748	171.88
1022.105	142.75
1022.461	159.74
1022.818	208.29
1023.174	133.04
1023.531	230.13
1023.887	120.91
1024.243	154.89
1024.599	179.16
1024.955	137.9
1025.311	150.03
1025.667	67.51
1026.023	106.34
1026.379	167.02
1026.735	174.3
1027.091	96.63
1027.447	191.3
