189.514	-8.95
189.973	-8.95
190.431	-8.95
190.889	0.76
191.348	32.31
191.806	5.61
192.264	-81.77
192.722	27.46
193.18	0.76
193.638	-25.94
194.096	25.03
194.554	-38.08
195.012	56.58
195.47	-35.65
195.928	-35.65
196.385	12.89
196.843	59.01
197.301	-18.66
197.758	-30.8
198.216	3.19
198.674	25.03
199.131	56.58
199.589	117.27
200.046	39.59
200.503	90.57
200.961	61.44
201.418	170.66
201.875	126.97
202.332	95.42
202.79	126.97
203.247	173.09
203.704	153.67
204.161	117.27
204.618	190.08
205.075	90.57
205.532	156.1
205.989	165.81
206.445	114.84
206.902	214.35
207.359	124.55
207.816	180.37
208.272	187.65
208.729	126.97
209.185	151.25
209.642	151.25
210.098	163.38
210.555	180.37
211.011	151.25
211.467	158.53
211.924	243.48
212.38	151.25
212.836	185.23
213.292	199.79
213.748	168.24
214.204	221.64
214.66	122.12
215.116	177.95
215.572	114.84
216.028	141.54
216.484	131.83
216.94	182.8
217.396	158.53
217.851	233.77
218.307	163.38
218.763	143.96
219.218	126.97
219.674	204.65
220.129	148.82
220.585	163.38
221.04	105.13
221.496	156.1
221.951	209.5
222.406	202.22
222.861	117.27
223.317	153.67
223.772	134.26
224.227	182.8
224.682	160.96
225.137	139.11
225.592	173.09
226.047	134.26
226.502	168.24
226.957	102.7
227.411	146.39
227.866	85.71
228.321	173.09
228.776	170.66
229.23	160.96
229.685	114.84
230.139	107.56
230.594	182.8
231.048	136.68
231.503	163.38
231.957	177.95
232.411	139.11
232.865	190.08
233.32	129.4
233.774	194.94
234.228	185.23
234.682	194.94
235.136	95.42
235.59	197.36
236.044	114.84
236.498	146.39
236.952	175.52
237.406	117.27
237.86	134.26
238.313	156.1
238.767	146.39
239.221	122.12
239.674	197.36
240.128	100.27
240.581	180.37
241.035	165.81
241.488	163.38
241.942	124.55
242.395	136.68
242.848	158.53
243.301	170.66
243.755	160.96
244.208	170.66
244.661	156.1
245.114	190.08
245.567	119.69
246.02	241.05
246.473	122.12
246.926	124.55
247.379	146.39
247.832	207.07
248.284	192.51
248.737	192.51
249.19	165.81
249.642	165.81
250.095	129.4
250.547	88.14
251	107.56
251.452	92.99
251.905	102.7
252.357	134.26
252.81	148.82
253.262	136.68
253.714	243.48
254.166	88.14
254.618	165.81
255.07	129.4
255.523	158.53
255.975	146.39
256.427	151.25
256.878	180.37
257.33	163.38
257.782	202.22
258.234	100.27
258.686	197.36
259.137	63.87
259.589	160.96
260.041	117.27
260.492	175.52
260.944	139.11
261.395	124.55
261.847	151.25
262.298	153.67
262.749	185.23
263.201	187.65
263.652	180.37
264.103	165.81
264.554	182.8
265.005	165.81
265.457	95.42
265.908	177.95
266.359	143.96
266.809	228.92
267.26	165.81
267.711	170.66
268.162	202.22
268.613	131.83
269.064	163.38
269.514	182.8
269.965	158.53
270.415	124.55
270.866	146.39
271.316	185.23
271.767	139.11
272.217	194.94
272.668	253.19
273.118	134.26
273.568	153.67
274.019	153.67
274.469	92.99
274.919	156.1
275.369	119.69
275.819	112.41
276.269	173.09
276.719	158.53
277.169	114.84
277.619	170.66
278.069	131.83
278.518	209.5
278.968	153.67
279.418	243.48
279.867	190.08
280.317	158.53
280.767	122.12
281.216	182.8
281.666	231.34
282.115	182.8
282.564	153.67
283.014	190.08
283.463	168.24
283.912	105.13
284.361	97.85
284.811	124.55
285.26	190.08
285.709	238.63
286.158	185.23
286.607	156.1
287.056	107.56
287.505	158.53
287.953	165.81
288.402	194.94
288.851	158.53
289.3	153.67
289.748	165.81
290.197	136.68
290.646	153.67
291.094	109.98
291.543	119.69
291.991	153.67
292.439	114.84
292.888	148.82
293.336	146.39
293.784	146.39
294.233	143.96
294.681	156.1
295.129	170.66
295.577	139.11
296.025	258.04
296.473	180.37
296.921	141.54
297.369	185.23
297.817	134.26
298.264	85.71
298.712	170.66
299.16	156.1
299.608	141.54
300.055	163.38
300.503	151.25
300.95	190.08
301.398	117.27
301.845	88.14
302.293	73.58
302.74	100.27
303.187	226.49
303.635	207.07
304.082	129.4
304.529	107.56
304.976	114.84
305.423	158.53
305.87	204.65
306.317	134.26
306.764	143.96
307.211	143.96
307.658	141.54
308.105	122.12
308.552	163.38
308.998	143.96
309.445	126.97
309.892	146.39
310.338	168.24
310.785	143.96
311.231	76
311.678	202.22
312.124	170.66
312.571	139.11
313.017	143.96
313.463	192.51
313.909	102.7
314.356	141.54
314.802	158.53
315.248	163.38
315.694	168.24
316.14	139.11
316.586	151.25
317.032	175.52
317.478	160.96
317.923	146.39
318.369	160.96
318.815	102.7
319.261	202.22
319.706	170.66
320.152	146.39
320.597	170.66
321.043	148.82
321.488	197.36
321.934	163.38
322.379	190.08
322.824	226.49
323.27	185.23
323.715	202.22
324.16	182.8
324.605	165.81
325.05	160.96
325.495	146.39
325.94	134.26
326.385	126.97
326.83	129.4
327.275	180.37
327.72	209.5
328.165	175.52
328.61	156.1
329.054	117.27
329.499	199.79
329.943	160.96
330.388	165.81
330.832	126.97
331.277	224.06
331.721	95.42
332.166	197.36
332.61	143.96
333.054	114.84
333.499	141.54
333.943	180.37
334.387	211.93
334.831	233.77
335.275	61.44
335.719	199.79
336.163	131.83
336.607	148.82
337.051	170.66
337.495	221.64
337.938	168.24
338.382	139.11
338.826	158.53
339.269	182.8
339.713	199.79
340.157	185.23
340.6	66.29
341.044	139.11
341.487	180.37
341.93	165.81
342.374	170.66
342.817	231.34
343.26	124.55
343.703	165.81
344.146	122.12
344.59	134.26
345.033	170.66
345.476	194.94
345.919	119.69
346.361	136.68
346.804	170.66
347.247	168.24
347.69	122.12
348.133	78.43
348.575	153.67
349.018	141.54
349.461	131.83
349.903	102.7
350.346	131.83
350.788	168.24
351.23	124.55
351.673	163.38
352.115	124.55
352.557	202.22
353	126.97
353.442	129.4
353.884	143.96
354.326	228.92
354.768	211.93
355.21	102.7
355.652	182.8
356.094	153.67
356.536	151.25
356.978	165.81
357.419	160.96
357.861	207.07
358.303	228.92
358.744	129.4
359.186	163.38
359.627	177.95
360.069	160.96
360.51	90.57
360.952	160.96
361.393	148.82
361.834	173.09
362.276	165.81
362.717	185.23
363.158	73.58
363.599	160.96
364.04	146.39
364.481	109.98
364.922	143.96
365.363	151.25
365.804	143.96
366.245	204.65
366.686	117.27
367.126	39.59
367.567	146.39
368.008	175.52
368.448	97.85
368.889	139.11
369.33	153.67
369.77	163.38
370.21	143.96
370.651	228.92
371.091	165.81
371.531	143.96
371.972	163.38
372.412	119.69
372.852	177.95
373.292	175.52
373.732	85.71
374.172	114.84
374.612	148.82
375.052	146.39
375.492	136.68
375.932	194.94
376.372	182.8
376.811	168.24
377.251	158.53
377.691	175.52
378.13	197.36
378.57	253.19
379.009	187.65
379.449	107.56
379.888	253.19
380.328	190.08
380.767	141.54
381.206	158.53
381.645	175.52
382.085	151.25
382.524	153.67
382.963	199.79
383.402	170.66
383.841	143.96
384.28	197.36
384.719	143.96
385.158	175.52
385.596	158.53
386.035	185.23
386.474	156.1
386.913	216.78
387.351	160.96
387.79	151.25
388.228	158.53
388.667	192.51
389.105	202.22
389.544	136.68
389.982	214.35
390.42	139.11
390.859	199.79
391.297	129.4
391.735	122.12
392.173	114.84
392.611	141.54
393.049	236.2
393.487	139.11
393.925	175.52
394.363	141.54
394.801	107.56
395.239	177.95
395.676	124.55
396.114	190.08
396.552	158.53
396.989	148.82
397.427	207.07
397.864	153.67
398.302	131.83
398.739	163.38
399.177	143.96
399.614	119.69
400.051	192.51
400.488	197.36
400.926	131.83
401.363	131.83
401.8	202.22
402.237	126.97
402.674	192.51
403.111	151.25
403.548	156.1
403.985	119.69
404.421	119.69
404.858	156.1
405.295	173.09
405.732	165.81
406.168	122.12
406.605	190.08
407.041	148.82
407.478	192.51
407.914	141.54
408.351	126.97
408.787	165.81
409.223	160.96
409.66	168.24
410.096	238.63
410.532	153.67
410.968	153.67
411.404	134.26
411.84	153.67
412.276	177.95
412.712	190.08
413.148	202.22
413.584	146.39
414.02	34.74
414.455	185.23
414.891	158.53
415.327	139.11
415.762	209.5
416.198	131.83
416.633	202.22
417.069	131.83
417.504	202.22
417.94	129.4
418.375	102.7
418.81	199.79
419.245	204.65
419.681	78.43
420.116	170.66
420.551	153.67
420.986	204.65
421.421	211.93
421.856	156.1
422.291	180.37
422.726	199.79
423.16	124.55
423.595	199.79
424.03	185.23
424.464	105.13
424.899	180.37
425.334	114.84
425.768	141.54
426.203	148.82
426.637	187.65
427.071	187.65
427.506	192.51
427.94	175.52
428.374	204.65
428.809	173.09
429.243	160.96
429.677	141.54
430.111	139.11
430.545	177.95
430.979	180.37
431.413	199.79
431.847	204.65
432.28	165.81
432.714	148.82
433.148	134.26
433.582	97.85
434.015	185.23
434.449	192.51
434.882	182.8
435.316	194.94
435.749	153.67
436.183	214.35
436.616	117.27
437.049	151.25
437.483	185.23
437.916	194.94
438.349	175.52
438.782	173.09
439.215	165.81
439.648	156.1
440.081	243.48
440.514	221.64
440.947	224.06
441.38	194.94
441.813	245.91
442.245	243.48
442.678	202.22
443.111	272.61
443.543	197.36
443.976	219.21
444.408	231.34
444.841	180.37
445.273	236.2
445.705	204.65
446.138	175.52
446.57	292.03
447.002	207.07
447.434	204.65
447.867	236.2
448.299	250.76
448.731	272.61
449.163	253.19
449.595	231.34
450.026	221.64
450.458	262.9
450.89	248.34
451.322	216.78
451.754	260.47
452.185	224.06
452.617	255.62
453.048	272.61
453.48	243.48
453.911	321.15
454.343	335.72
454.774	287.17
455.205	275.03
455.637	326.01
456.068	313.87
456.499	367.27
456.93	287.17
457.361	289.6
457.792	359.99
458.223	352.71
458.654	309.02
459.085	221.64
459.516	282.32
459.947	284.74
460.378	318.72
460.808	357.56
461.239	330.86
461.669	306.59
462.1	326.01
462.531	437.66
462.961	296.88
463.391	289.6
463.822	267.75
464.252	306.59
464.682	260.47
465.113	330.86
465.543	311.44
465.973	296.88
466.403	294.45
466.833	289.6
467.263	224.06
467.693	228.92
468.123	226.49
468.553	194.94
468.983	250.76
469.412	190.08
469.842	248.34
470.272	207.07
470.701	214.35
471.131	245.91
471.56	233.77
471.99	260.47
472.419	224.06
472.849	182.8
473.278	265.33
473.707	255.62
474.136	221.64
474.566	275.03
474.995	272.61
475.424	277.46
475.853	253.19
476.282	250.76
476.711	301.73
477.14	180.37
477.569	231.34
477.997	219.21
478.426	243.48
478.855	209.5
479.283	241.05
479.712	182.8
480.141	228.92
480.569	277.46
480.998	180.37
481.426	233.77
481.854	177.95
482.283	219.21
482.711	219.21
483.139	221.64
483.567	202.22
483.995	219.21
484.424	185.23
484.852	272.61
485.28	323.58
485.708	309.02
486.135	228.92
486.563	190.08
486.991	177.95
487.419	248.34
487.847	156.1
488.274	204.65
488.702	250.76
489.129	221.64
489.557	163.38
489.984	228.92
490.412	202.22
490.839	211.93
491.266	190.08
491.694	194.94
492.121	175.52
492.548	219.21
492.975	207.07
493.402	275.03
493.829	219.21
494.256	245.91
494.683	253.19
495.11	238.63
495.537	209.5
495.964	175.52
496.39	160.96
496.817	226.49
497.244	272.61
497.67	158.53
498.097	168.24
498.523	272.61
498.95	160.96
499.376	170.66
499.803	148.82
500.229	173.09
500.655	190.08
501.081	177.95
501.508	173.09
501.934	226.49
502.36	224.06
502.786	173.09
503.212	163.38
503.638	216.78
504.064	180.37
504.489	224.06
504.915	233.77
505.341	216.78
505.767	216.78
506.192	156.1
506.618	190.08
507.043	207.07
507.469	267.75
507.894	158.53
508.32	168.24
508.745	187.65
509.17	182.8
509.596	129.4
510.021	163.38
510.446	253.19
510.871	190.08
511.296	207.07
511.721	204.65
512.146	207.07
512.571	180.37
512.996	194.94
513.421	219.21
513.845	241.05
514.27	248.34
514.695	209.5
515.119	241.05
515.544	124.55
515.969	209.5
516.393	214.35
516.817	170.66
517.242	255.62
517.666	122.12
518.09	211.93
518.515	211.93
518.939	202.22
519.363	420.67
519.787	238.63
520.211	187.65
520.635	236.2
521.059	151.25
521.483	214.35
521.907	143.96
522.331	148.82
522.754	221.64
523.178	173.09
523.602	194.94
524.025	156.1
524.449	224.06
524.872	243.48
525.296	204.65
525.719	190.08
526.143	170.66
526.566	151.25
526.989	180.37
527.412	170.66
527.836	192.51
528.259	202.22
528.682	214.35
529.105	231.34
529.528	228.92
529.951	173.09
530.374	185.23
530.796	192.51
531.219	255.62
531.642	192.51
532.065	211.93
532.487	192.51
532.91	199.79
533.332	192.51
533.755	165.81
534.177	143.96
534.6	158.53
535.022	197.36
535.444	165.81
535.867	194.94
536.289	185.23
536.711	226.49
537.133	219.21
537.555	143.96
537.977	148.82
538.399	199.79
538.821	192.51
539.243	148.82
539.665	177.95
540.086	209.5
540.508	243.48
540.93	141.54
541.351	197.36
541.773	180.37
542.195	190.08
542.616	224.06
543.037	236.2
543.459	287.17
543.88	182.8
544.301	250.76
544.723	275.03
545.144	275.03
545.565	296.88
545.986	233.77
546.407	185.23
546.828	209.5
547.249	199.79
547.67	180.37
548.091	207.07
548.512	211.93
548.932	192.51
549.353	284.74
549.774	270.18
550.194	255.62
550.615	243.48
551.035	243.48
551.456	221.64
551.876	231.34
552.296	139.11
552.717	148.82
553.137	136.68
553.557	231.34
553.977	233.77
554.397	202.22
554.817	182.8
555.237	211.93
555.657	202.22
556.077	255.62
556.497	173.09
556.917	207.07
557.337	194.94
557.756	296.88
558.176	187.65
558.596	231.34
559.015	173.09
559.435	209.5
559.854	165.81
560.274	185.23
560.693	226.49
561.112	221.64
561.532	190.08
561.951	221.64
562.37	231.34
562.789	192.51
563.208	143.96
563.627	160.96
564.046	156.1
564.465	221.64
564.884	187.65
565.303	190.08
565.722	146.39
566.14	202.22
566.559	262.9
566.978	255.62
567.396	190.08
567.815	238.63
568.233	224.06
568.652	211.93
569.07	134.26
569.489	255.62
569.907	255.62
570.325	238.63
570.743	211.93
571.161	185.23
571.58	211.93
571.998	282.32
572.416	219.21
572.833	258.04
573.251	194.94
573.669	202.22
574.087	260.47
574.505	156.1
574.922	258.04
575.34	219.21
575.758	231.34
576.175	139.11
576.593	250.76
577.01	209.5
577.428	216.78
577.845	1787.19
578.262	277.46
578.68	192.51
579.097	204.65
579.514	219.21
579.931	209.5
580.348	187.65
580.765	170.66
581.182	122.12
581.599	173.09
582.016	204.65
582.433	168.24
582.849	245.91
583.266	226.49
583.683	180.37
584.099	219.21
584.516	219.21
584.933	219.21
585.349	211.93
585.765	190.08
586.182	199.79
586.598	151.25
587.014	202.22
587.431	207.07
587.847	165.81
588.263	122.12
588.679	267.75
589.095	194.94
589.511	277.46
589.927	199.79
590.343	194.94
590.759	185.23
591.174	199.79
591.59	185.23
592.006	260.47
592.421	190.08
592.837	214.35
593.252	233.77
593.668	219.21
594.083	209.5
594.499	146.39
594.914	158.53
595.329	146.39
595.745	219.21
596.16	221.64
596.575	216.78
596.99	177.95
597.405	182.8
597.82	219.21
598.235	221.64
598.65	219.21
599.065	207.07
599.479	221.64
599.894	165.81
600.309	233.77
600.724	165.81
601.138	207.07
601.553	158.53
601.967	173.09
602.382	202.22
602.796	107.56
603.21	255.62
603.625	241.05
604.039	226.49
604.453	219.21
604.867	226.49
605.281	299.31
605.695	148.82
606.109	245.91
606.523	185.23
606.937	180.37
607.351	311.44
607.765	143.96
608.178	173.09
608.592	221.64
609.006	236.2
609.419	109.98
609.833	211.93
610.246	163.38
610.66	173.09
611.073	158.53
611.487	141.54
611.9	214.35
612.313	197.36
612.726	156.1
613.139	211.93
613.553	199.79
613.966	216.78
614.379	243.48
614.792	180.37
615.204	216.78
615.617	146.39
616.03	165.81
616.443	136.68
616.856	199.79
617.268	221.64
617.681	158.53
618.093	117.27
618.506	153.67
618.918	289.6
619.331	156.1
619.743	194.94
620.155	151.25
620.568	199.79
620.98	148.82
621.392	151.25
621.804	243.48
622.216	185.23
622.628	190.08
623.04	199.79
623.452	224.06
623.864	173.09
624.276	131.83
624.687	182.8
625.099	136.68
625.511	151.25
625.922	267.75
626.334	190.08
626.745	202.22
627.157	182.8
627.568	136.68
627.979	224.06
628.391	168.24
628.802	216.78
629.213	204.65
629.624	209.5
630.035	153.67
630.446	228.92
630.857	160.96
631.268	202.22
631.679	190.08
632.09	185.23
632.501	158.53
632.912	226.49
633.322	224.06
633.733	190.08
634.144	136.68
634.554	190.08
634.965	236.2
635.375	168.24
635.785	190.08
636.196	180.37
636.606	192.51
637.016	109.98
637.427	180.37
637.837	233.77
638.247	141.54
638.657	160.96
639.067	190.08
639.477	148.82
639.887	214.35
640.297	141.54
640.706	182.8
641.116	163.38
641.526	114.84
641.935	153.67
642.345	163.38
642.755	194.94
643.164	165.81
643.573	197.36
643.983	180.37
644.392	117.27
644.801	190.08
645.211	209.5
645.62	231.34
646.029	175.52
646.438	199.79
646.847	168.24
647.256	122.12
647.665	158.53
648.074	119.69
648.483	129.4
648.892	148.82
649.3	170.66
649.709	139.11
650.118	165.81
650.526	88.14
650.935	80.86
651.343	168.24
651.752	199.79
652.16	148.82
652.568	126.97
652.977	197.36
653.385	143.96
653.793	148.82
654.201	170.66
654.609	219.21
655.017	156.1
655.425	168.24
655.833	204.65
656.241	207.07
656.649	143.96
657.057	131.83
657.464	139.11
657.872	197.36
658.28	209.5
658.687	105.13
659.095	209.5
659.502	126.97
659.91	151.25
660.317	190.08
660.724	168.24
661.132	175.52
661.539	126.97
661.946	185.23
662.353	151.25
662.76	192.51
663.167	160.96
663.574	143.96
663.981	197.36
664.388	158.53
664.795	309.02
665.202	211.93
665.608	160.96
666.015	141.54
666.422	170.66
666.828	90.57
667.235	168.24
667.641	129.4
668.047	204.65
668.454	97.85
668.86	160.96
669.266	185.23
669.673	194.94
670.079	187.65
670.485	185.23
670.891	163.38
671.297	204.65
671.703	124.55
672.109	107.56
672.515	231.34
672.92	126.97
673.326	238.63
673.732	97.85
674.138	156.1
674.543	231.34
674.949	190.08
675.354	151.25
675.76	214.35
676.165	160.96
676.57	175.52
676.976	148.82
677.381	134.26
677.786	153.67
678.191	209.5
678.596	170.66
679.001	194.94
679.406	173.09
679.811	241.05
680.216	211.93
680.621	180.37
681.026	202.22
681.43	204.65
681.835	143.96
682.24	170.66
682.644	143.96
683.049	160.96
683.453	214.35
683.858	228.92
684.262	177.95
684.667	182.8
685.071	165.81
685.475	122.12
685.879	180.37
686.283	224.06
686.687	214.35
687.091	211.93
687.495	182.8
687.899	214.35
688.303	170.66
688.707	170.66
689.111	148.82
689.514	136.68
689.918	139.11
690.322	226.49
690.725	170.66
691.129	182.8
691.532	182.8
691.936	112.41
692.339	177.95
692.742	173.09
693.146	160.96
693.549	231.34
693.952	238.63
694.355	156.1
694.758	194.94
695.161	190.08
695.564	226.49
695.967	80.86
696.37	163.38
696.773	194.94
697.175	163.38
697.578	168.24
697.981	185.23
698.383	129.4
698.786	107.56
699.188	182.8
699.591	185.23
699.993	180.37
700.395	243.48
700.798	224.06
701.2	165.81
701.602	228.92
702.004	151.25
702.406	156.1
702.808	180.37
703.21	173.09
703.612	219.21
704.014	202.22
704.416	238.63
704.818	260.47
705.219	194.94
705.621	219.21
706.023	228.92
706.424	177.95
706.826	313.87
707.227	238.63
707.629	270.18
708.03	241.05
708.431	270.18
708.832	248.34
709.234	236.2
709.635	204.65
710.036	243.48
710.437	255.62
710.838	204.65
711.239	248.34
711.64	216.78
712.041	292.03
712.441	211.93
712.842	219.21
713.243	275.03
713.643	187.65
714.044	258.04
714.445	238.63
714.845	284.74
715.246	216.78
715.646	258.04
716.046	175.52
716.447	299.31
716.847	289.6
717.247	345.42
717.647	277.46
718.047	350.28
718.447	219.21
718.847	367.27
719.247	316.3
719.647	359.99
720.047	406.1
720.446	357.56
720.846	338.14
721.246	384.26
721.645	408.53
722.045	425.52
722.444	372.12
722.844	389.11
723.243	374.55
723.643	461.93
724.042	491.06
724.441	435.23
724.84	410.96
725.24	437.66
725.639	410.96
726.038	510.48
726.437	476.49
726.836	432.8
727.234	542.03
727.633	493.48
728.032	452.22
728.431	464.36
728.83	578.44
729.228	566.3
729.627	563.87
730.025	593
730.424	692.52
730.822	794.46
731.22	704.65
731.619	755.62
732.017	796.89
732.415	947.38
732.813	923.1
733.212	995.92
733.61	1044.46
734.008	1112.43
734.406	1090.58
734.803	1216.8
735.201	1236.21
735.599	1372.14
735.997	1391.56
736.395	1420.68
736.792	1629.42
737.19	1610.01
737.587	1566.32
737.985	1728.94
738.382	1981.37
738.78	2090.6
739.177	2037.2
739.574	2129.43
739.971	2272.64
740.369	2374.58
740.766	2415.84
741.163	2401.28
741.56	2653.71
741.957	2743.52
742.354	2833.33
742.751	2697.4
743.147	2901.29
743.544	3267.8
743.941	3316.34
744.338	3461.98
744.734	3447.41
745.131	3801.79
745.527	3976.55
745.924	4029.95
746.32	4144.03
746.716	4459.57
747.113	4653.74
747.509	5039.67
747.905	4976.56
748.301	5403.76
748.697	5796.97
749.093	6056.68
749.489	5617.35
749.885	6224.16
750.281	6991.16
750.677	7124.66
751.073	6913.49
751.468	7221.74
751.864	7884.38
752.26	8139.23
752.655	8202.34
753.051	8321.28
753.446	9056.72
753.842	9804.31
754.237	9750.91
754.632	9423.24
755.028	9848
755.423	10942.68
755.818	10928.11
756.213	10226.65
756.608	10318.88
757.003	11369.87
757.398	11848.03
757.793	11394.14
758.188	11272.78
758.583	12173.28
758.977	12899.02
759.372	12814.06
759.767	12746.1
760.161	13399.03
760.556	15301.97
760.95	15862.66
761.345	15360.22
761.739	15607.8
762.133	17035
762.527	18802.02
762.922	18513.18
763.316	18149.1
763.71	18302.01
764.104	20588.46
764.498	21110.31
764.892	19925.83
765.286	19753.49
765.68	21753.52
766.073	23224.42
766.467	21879.74
766.861	21658.86
767.255	22967.14
767.648	25258.43
768.042	25552.13
768.435	24328.81
768.829	24302.11
769.222	26052.13
769.615	27527.89
770.008	26343.4
770.402	25748.73
770.795	26066.7
771.188	28083.72
771.581	28537.61
771.974	26950.21
772.367	26306.99
772.76	27166.23
773.153	28307.02
773.545	27263.32
773.938	26149.22
774.331	26496.32
774.724	28879.85
775.116	30678.42
775.509	29967.24
775.901	30353.17
776.294	31581.35
776.686	33760.99
777.078	34035.27
777.471	32756.12
777.863	33367.78
778.255	36775.6
778.647	38576.6
779.039	38052.32
779.431	35967.34
779.823	36780.46
780.215	39302.34
780.607	39295.06
780.999	38273.2
781.39	36639.68
781.782	38200.38
782.174	40984.41
782.565	41372.76
782.957	37673.67
783.348	38353.3
783.74	40916.44
784.131	41731.99
784.522	41579.08
784.914	37612.99
785.305	38314.46
785.696	40370.32
786.087	41236.84
786.478	38003.78
786.869	34559.55
787.26	35566.85
787.651	38091.16
788.042	38037.76
788.433	34547.41
788.823	32156.6
789.214	33758.57
789.605	34445.47
789.995	32790.1
790.386	30350.75
790.776	29976.95
791.167	31678.44
791.557	34057.11
791.948	33057.1
792.338	30661.43
792.728	31974.56
793.118	35159.07
793.508	35768.31
793.898	33935.75
794.288	32435.73
794.678	33061.95
795.068	35707.62
795.458	35761.02
795.848	33797.4
796.238	31940.58
796.627	32702.72
797.017	34909.07
797.406	34758.58
797.796	31459.99
798.185	31387.17
798.575	32957.58
798.964	34678.48
799.354	34828.97
799.743	32095.92
800.132	31078.91
800.521	33413.9
800.91	35569.27
801.299	33799.83
801.688	31015.8
802.077	30333.75
802.466	32304.66
802.855	34241.58
803.244	32782.82
803.633	29717.24
804.021	28268.19
804.41	29993.94
804.799	31042.5
805.187	29690.54
805.576	26209.9
805.964	25311.83
806.352	26518.16
806.741	27644.39
807.129	26071.55
807.517	23717.15
807.905	23884.63
808.293	26086.12
808.681	27149.24
809.069	26093.4
809.457	24658.91
809.845	24518.13
810.233	26365.25
810.621	28042.46
811.009	26690.49
811.396	24772.99
811.784	25015.71
812.171	26399.23
812.559	27241.47
812.946	25513.29
813.334	23515.69
813.721	22896.75
814.108	24268.13
814.496	24913.77
814.883	23867.63
815.27	22462.27
815.657	21787.51
816.044	23100.63
816.431	24357.93
816.818	23333.65
817.205	21530.22
817.592	21248.66
817.979	22229.26
818.365	22282.66
818.752	21520.51
819.139	19695.24
819.525	18457.36
819.912	19158.82
820.298	19680.68
820.685	19508.34
821.071	17653.95
821.457	16450.04
821.843	16151.5
822.23	16928.21
822.616	16396.64
823.002	14826.23
823.388	13561.65
823.774	13333.49
824.16	13930.59
824.546	13583.49
824.931	12520.37
825.317	11600.45
825.703	11932.98
826.089	12481.54
826.474	12937.85
826.86	12277.65
827.245	11098.02
827.631	10896.56
828.016	11551.91
828.401	11678.12
828.787	11449.97
829.172	10139.27
829.557	9709.65
829.942	9889.26
830.327	10190.24
830.712	10114.99
831.097	9148.96
831.482	8636.82
831.867	8585.84
832.252	8957.21
832.636	9100.41
833.021	8243.61
833.406	7942.63
833.79	7651.36
834.175	7996.03
834.559	8330.99
834.944	7809.13
835.328	7102.81
835.713	6554.26
836.097	6806.69
836.481	7015.43
836.865	6779.99
837.249	6394.06
837.633	5610.07
838.017	5648.9
838.401	5906.19
838.785	5707.16
839.169	5355.21
839.553	4702.29
839.937	4491.12
840.32	4726.56
840.704	4699.86
841.087	4389.18
841.471	3957.13
841.854	3738.68
842.238	3794.51
842.621	3925.58
843.004	3872.18
843.388	3651.3
843.771	3304.21
844.154	3219.26
844.537	3474.11
844.92	3750.82
845.303	3512.95
845.686	3177.99
846.069	2925.56
846.452	2896.43
846.834	3139.16
847.217	3054.2
847.6	2869.74
847.982	2724.1
848.365	2474.1
848.748	2719.25
849.13	2758.08
849.512	2612.45
849.895	2423.13
850.277	2095.45
850.659	2160.99
851.041	2340.6
851.423	2384.29
851.806	2192.54
852.188	1944.96
852.57	1940.11
852.951	2095.45
853.333	2187.69
853.715	2209.53
854.097	1949.82
854.479	1656.12
854.86	1690.11
855.242	1896.42
855.623	1918.26
856.005	1641.56
856.386	1469.23
856.768	1309.03
857.149	1401.27
857.53	1425.54
857.911	1478.94
858.292	1345.44
858.674	1165.83
859.055	1076.02
859.436	1129.42
859.817	1185.24
860.197	1204.66
860.578	986.21
860.959	901.26
861.34	1025.05
861.72	935.24
862.101	1037.18
862.482	971.65
862.862	821.16
863.243	673.1
863.623	915.82
864.003	884.27
864.384	920.68
864.764	811.45
865.144	741.06
865.524	748.34
865.904	738.63
866.284	750.77
866.664	789.61
867.044	665.82
867.424	595.43
867.804	619.7
868.183	697.37
868.563	559.02
868.943	593
869.322	559.02
869.702	478.92
870.081	549.31
870.461	600.28
870.84	539.6
871.22	554.17
871.599	512.9
871.978	515.33
872.357	430.38
872.736	437.66
873.115	481.35
873.494	457.08
873.873	347.85
874.252	379.41
874.631	452.22
875.01	340.57
875.388	423.1
875.767	362.41
876.146	311.44
876.524	340.57
876.903	347.85
877.281	330.86
877.66	289.6
878.038	321.15
878.416	345.42
878.794	284.74
879.173	260.47
879.551	316.3
879.929	345.42
880.307	330.86
880.685	284.74
881.063	311.44
881.441	267.75
881.818	243.48
882.196	250.76
882.574	272.61
882.951	187.65
883.329	211.93
883.707	318.72
884.084	209.5
884.461	255.62
884.839	275.03
885.216	260.47
885.593	265.33
885.971	294.45
886.348	228.92
886.725	207.07
887.102	299.31
887.479	267.75
887.856	243.48
888.233	245.91
888.609	228.92
888.986	258.04
889.363	224.06
889.74	224.06
890.116	173.09
890.493	241.05
890.869	236.2
891.246	236.2
891.622	185.23
891.998	204.65
892.375	180.37
892.751	241.05
893.127	219.21
893.503	221.64
893.879	248.34
894.255	182.8
894.631	241.05
895.007	202.22
895.383	180.37
895.759	182.8
896.134	199.79
896.51	211.93
896.886	211.93
897.261	204.65
897.637	160.96
898.012	168.24
898.388	139.11
898.763	163.38
899.138	199.79
899.514	175.52
899.889	236.2
900.264	211.93
900.639	180.37
901.014	139.11
901.389	236.2
901.764	199.79
902.139	153.67
902.513	163.38
902.888	117.27
903.263	131.83
903.638	173.09
904.012	194.94
904.387	165.81
904.761	168.24
905.136	163.38
905.51	139.11
905.884	126.97
906.259	175.52
906.633	131.83
907.007	114.84
907.381	168.24
907.755	78.43
908.129	187.65
908.503	139.11
908.877	129.4
909.251	163.38
909.624	146.39
909.998	163.38
910.372	158.53
910.745	158.53
911.119	214.35
911.492	190.08
911.866	131.83
912.239	168.24
912.612	129.4
912.986	173.09
913.359	175.52
913.732	190.08
914.105	158.53
914.478	102.7
914.851	119.69
915.224	122.12
915.597	197.36
915.97	207.07
916.343	226.49
916.715	190.08
917.088	143.96
917.461	136.68
917.833	88.14
918.206	209.5
918.578	199.79
918.951	143.96
919.323	112.41
919.695	163.38
920.067	185.23
920.44	194.94
920.812	170.66
921.184	175.52
921.556	134.26
921.928	71.15
922.3	165.81
922.672	165.81
923.043	165.81
923.415	185.23
923.787	97.85
924.158	131.83
924.53	168.24
924.901	156.1
925.273	173.09
925.644	95.42
926.016	168.24
926.387	243.48
926.758	231.34
927.129	153.67
927.5	153.67
927.872	146.39
928.243	153.67
928.613	139.11
928.984	146.39
929.355	187.65
929.726	83.28
930.097	136.68
930.467	151.25
930.838	163.38
931.209	95.42
931.579	122.12
931.95	88.14
932.32	182.8
932.69	194.94
933.061	182.8
933.431	158.53
933.801	180.37
934.171	122.12
934.541	134.26
934.911	105.13
935.281	207.07
935.651	143.96
936.021	139.11
936.391	112.41
936.761	129.4
937.13	182.8
937.5	158.53
937.87	207.07
938.239	109.98
938.609	163.38
938.978	143.96
939.347	194.94
939.717	163.38
940.086	92.99
940.455	185.23
940.824	122.12
941.193	146.39
941.562	158.53
941.931	78.43
942.3	177.95
942.669	141.54
943.038	165.81
943.407	177.95
943.775	134.26
944.144	163.38
944.513	109.98
944.881	216.78
945.25	163.38
945.618	197.36
945.986	139.11
946.355	214.35
946.723	177.95
947.091	136.68
947.459	146.39
947.827	190.08
948.195	126.97
948.563	97.85
948.931	173.09
949.299	131.83
949.667	153.67
950.035	214.35
950.402	190.08
950.77	173.09
951.138	114.84
951.505	148.82
951.873	76
952.24	117.27
952.607	170.66
952.975	158.53
953.342	143.96
953.709	122.12
954.076	175.52
954.443	97.85
954.81	156.1
955.177	204.65
955.544	124.55
955.911	156.1
956.278	165.81
956.645	182.8
957.012	168.24
957.378	158.53
957.745	141.54
958.111	85.71
958.478	177.95
958.844	175.52
959.211	207.07
959.577	185.23
959.943	226.49
960.309	185.23
960.675	143.96
961.042	143.96
961.408	151.25
961.774	117.27
962.139	124.55
962.505	185.23
962.871	153.67
963.237	207.07
963.603	139.11
963.968	131.83
964.334	122.12
964.699	126.97
965.065	143.96
965.43	143.96
965.796	146.39
966.161	156.1
966.526	88.14
966.891	119.69
967.256	190.08
967.622	109.98
967.987	102.7
968.352	173.09
968.716	119.69
969.081	187.65
969.446	170.66
969.811	173.09
970.176	202.22
970.54	224.06
970.905	126.97
971.269	224.06
971.634	158.53
971.998	112.41
972.363	95.42
972.727	175.52
973.091	165.81
973.455	153.67
973.819	160.96
974.183	88.14
974.547	146.39
974.911	146.39
975.275	112.41
975.639	156.1
976.003	117.27
976.367	141.54
976.73	136.68
977.094	165.81
977.458	139.11
977.821	214.35
978.185	190.08
978.548	156.1
978.911	187.65
979.275	102.7
979.638	158.53
980.001	148.82
980.364	139.11
980.727	100.27
981.09	197.36
981.453	124.55
981.816	129.4
982.179	173.09
982.542	141.54
982.905	117.27
983.267	160.96
983.63	168.24
983.992	175.52
984.355	122.12
984.717	165.81
985.08	197.36
985.442	117.27
985.804	134.26
986.167	168.24
986.529	88.14
986.891	122.12
987.253	209.5
987.615	143.96
987.977	59.01
988.339	97.85
988.701	192.51
989.062	129.4
989.424	219.21
989.786	148.82
990.147	158.53
990.509	202.22
990.87	126.97
991.232	141.54
991.593	136.68
991.955	226.49
992.316	168.24
992.677	199.79
993.038	158.53
993.399	160.96
993.76	165.81
994.121	182.8
994.482	117.27
994.843	139.11
995.204	158.53
995.565	97.85
995.926	134.26
996.286	148.82
996.647	146.39
997.007	197.36
997.368	80.86
997.728	117.27
998.089	95.42
998.449	158.53
998.809	97.85
999.169	168.24
999.53	109.98
999.89	126.97
1000.25	131.83
1000.61	117.27
1000.97	95.42
1001.329	163.38
1001.689	134.26
1002.049	102.7
1002.409	175.52
1002.768	129.4
1003.128	143.96
1003.487	71.15
1003.847	182.8
1004.206	180.37
1004.566	190.08
1004.925	219.21
1005.284	97.85
1005.643	214.35
1006.003	124.55
1006.362	190.08
1006.721	124.55
1007.08	134.26
1007.438	129.4
1007.797	148.82
1008.156	102.7
1008.515	180.37
1008.874	119.69
1009.232	107.56
1009.591	182.8
1009.949	160.96
1010.308	139.11
1010.666	170.66
1011.024	214.35
1011.383	160.96
1011.741	160.96
1012.099	143.96
1012.457	148.82
1012.815	146.39
1013.173	139.11
1013.531	190.08
1013.889	92.99
1014.247	63.87
1014.605	80.86
1014.962	102.7
1015.32	119.69
1015.678	156.1
1016.035	221.64
1016.393	131.83
1016.75	100.27
1017.107	190.08
1017.465	112.41
1017.822	180.37
1018.179	180.37
1018.536	143.96
1018.894	165.81
1019.251	163.38
1019.608	114.84
1019.964	92.99
1020.321	134.26
1020.678	185.23
1021.035	134.26
1021.392	153.67
1021.748	90.57
1022.105	131.83
1022.461	160.96
1022.818	180.37
1023.174	173.09
1023.531	163.38
1023.887	136.68
1024.243	139.11
1024.599	109.98
1024.955	134.26
1025.311	131.83
1025.667	97.85
1026.023	170.66
1026.379	168.24
1026.735	141.54
1027.091	226.49
1027.447	219.21
