189.514	107.86
189.973	107.86
190.431	107.86
190.889	42.32
191.348	22.91
191.806	129.7
192.264	-6.22
192.722	-8.65
193.18	-23.21
193.638	-54.76
194.096	-49.91
194.554	-54.76
195.012	-15.93
195.47	-20.78
195.928	3.49
196.385	-35.35
196.843	3.49
197.301	93.3
197.758	39.9
198.216	39.9
198.674	69.02
199.131	20.48
199.589	59.32
200.046	66.6
200.503	103.01
200.961	161.26
201.418	93.3
201.875	146.7
202.332	146.7
202.79	173.39
203.247	110.29
203.704	110.29
204.161	115.14
204.618	88.44
205.075	149.12
205.532	151.55
205.989	144.27
206.445	156.4
206.902	197.67
207.359	134.56
207.816	144.27
208.272	151.55
208.729	185.53
209.185	209.8
209.642	76.31
210.098	163.69
210.555	187.96
211.011	175.82
211.467	219.51
211.924	275.34
212.38	122.42
212.836	168.54
213.292	105.43
213.748	110.29
214.204	117.57
214.66	132.13
215.116	178.25
215.572	69.02
216.028	255.92
216.484	122.42
216.94	88.44
217.396	175.82
217.851	110.29
218.307	129.7
218.763	132.13
219.218	151.55
219.674	122.42
220.129	153.98
220.585	168.54
221.04	127.28
221.496	122.42
221.951	178.25
222.406	197.67
222.861	168.54
223.317	166.11
223.772	202.52
224.227	166.11
224.682	158.83
225.137	124.85
225.592	56.89
226.047	103.01
226.502	180.68
226.957	161.26
227.411	120
227.866	115.14
228.321	255.92
228.776	158.83
229.23	100.58
229.685	180.68
230.139	141.84
230.594	134.56
231.048	231.65
231.503	129.7
231.957	200.09
232.411	161.26
232.865	178.25
233.32	202.52
233.774	149.12
234.228	161.26
234.682	81.16
235.136	149.12
235.59	132.13
236.044	207.38
236.498	168.54
236.952	149.12
237.406	180.68
237.86	190.39
238.313	173.39
238.767	180.68
239.221	122.42
239.674	163.69
240.128	158.83
240.581	120
241.035	151.55
241.488	153.98
241.942	156.4
242.395	170.97
242.848	195.24
243.301	163.69
243.755	146.7
244.208	202.52
244.661	207.38
245.114	129.7
245.567	221.94
246.02	115.14
246.473	202.52
246.926	107.86
247.379	71.45
247.832	207.38
248.284	180.68
248.737	195.24
249.19	195.24
249.642	149.12
250.095	107.86
250.547	153.98
251	202.52
251.452	122.42
251.905	122.42
252.357	185.53
252.81	178.25
253.262	132.13
253.714	241.36
254.166	158.83
254.618	156.4
255.07	197.67
255.523	166.11
255.975	214.66
256.427	166.11
256.878	166.11
257.33	190.39
257.782	129.7
258.234	100.58
258.686	231.65
259.137	158.83
259.589	105.43
260.041	88.44
260.492	151.55
260.944	185.53
261.395	166.11
261.847	243.78
262.298	144.27
262.749	132.13
263.201	151.55
263.652	153.98
264.103	175.82
264.554	170.97
265.005	139.41
265.457	120
265.908	192.81
266.359	175.82
266.809	163.69
267.26	139.41
267.711	122.42
268.162	192.81
268.613	173.39
269.064	190.39
269.514	166.11
269.965	122.42
270.415	141.84
270.866	139.41
271.316	207.38
271.767	117.57
272.217	212.23
272.668	166.11
273.118	134.56
273.568	149.12
274.019	144.27
274.469	132.13
274.919	132.13
275.369	200.09
275.819	117.57
276.269	180.68
276.719	178.25
277.169	115.14
277.619	115.14
278.069	180.68
278.518	166.11
278.968	158.83
279.418	100.58
279.867	127.28
280.317	100.58
280.767	173.39
281.216	229.22
281.666	170.97
282.115	156.4
282.564	103.01
283.014	117.57
283.463	178.25
283.912	168.54
284.361	151.55
284.811	129.7
285.26	161.26
285.709	217.08
286.158	161.26
286.607	183.1
287.056	134.56
287.505	173.39
287.953	149.12
288.402	175.82
288.851	195.24
289.3	268.06
289.748	207.38
290.197	95.72
290.646	192.81
291.094	185.53
291.543	180.68
291.991	153.98
292.439	161.26
292.888	134.56
293.336	236.5
293.784	141.84
294.233	166.11
294.681	98.15
295.129	151.55
295.577	192.81
296.025	207.38
296.473	175.82
296.921	212.23
297.369	166.11
297.817	185.53
298.264	202.52
298.712	115.14
299.16	153.98
299.608	175.82
300.055	207.38
300.503	161.26
300.95	166.11
301.398	183.1
301.845	124.85
302.293	144.27
302.74	120
303.187	170.97
303.635	115.14
304.082	69.02
304.529	120
304.976	117.57
305.423	93.3
305.87	178.25
306.317	151.55
306.764	117.57
307.211	107.86
307.658	156.4
308.105	238.93
308.552	105.43
308.998	93.3
309.445	219.51
309.892	151.55
310.338	200.09
310.785	136.99
311.231	175.82
311.678	219.51
312.124	231.65
312.571	192.81
313.017	209.8
313.463	180.68
313.909	151.55
314.356	120
314.802	180.68
315.248	153.98
315.694	139.41
316.14	217.08
316.586	93.3
317.032	209.8
317.478	185.53
317.923	156.4
318.369	197.67
318.815	212.23
319.261	110.29
319.706	192.81
320.152	156.4
320.597	202.52
321.043	168.54
321.488	229.22
321.934	144.27
322.379	166.11
322.824	117.57
323.27	178.25
323.715	212.23
324.16	190.39
324.605	168.54
325.05	180.68
325.495	161.26
325.94	129.7
326.385	238.93
326.83	144.27
327.275	178.25
327.72	166.11
328.165	190.39
328.61	185.53
329.054	129.7
329.499	219.51
329.943	187.96
330.388	105.43
330.832	100.58
331.277	139.41
331.721	217.08
332.166	209.8
332.61	187.96
333.054	107.86
333.499	166.11
333.943	158.83
334.387	214.66
334.831	151.55
335.275	120
335.719	204.95
336.163	139.41
336.607	156.4
337.051	93.3
337.495	170.97
337.938	124.85
338.382	149.12
338.826	207.38
339.269	251.07
339.713	166.11
340.157	144.27
340.6	146.7
341.044	192.81
341.487	124.85
341.93	221.94
342.374	200.09
342.817	163.69
343.26	221.94
343.703	195.24
344.146	195.24
344.59	112.71
345.033	112.71
345.476	185.53
345.919	221.94
346.361	173.39
346.804	200.09
347.247	197.67
347.69	129.7
348.133	195.24
348.575	132.13
349.018	200.09
349.461	136.99
349.903	47.18
350.346	146.7
350.788	183.1
351.23	156.4
351.673	202.52
352.115	226.79
352.557	149.12
353	209.8
353.442	156.4
353.884	166.11
354.326	107.86
354.768	105.43
355.21	124.85
355.652	115.14
356.094	183.1
356.536	197.67
356.978	105.43
357.419	209.8
357.861	202.52
358.303	127.28
358.744	129.7
359.186	110.29
359.627	207.38
360.069	192.81
360.51	158.83
360.952	120
361.393	144.27
361.834	144.27
362.276	163.69
362.717	107.86
363.158	117.57
363.599	100.58
364.04	170.97
364.481	61.74
364.922	226.79
365.363	170.97
365.804	202.52
366.245	173.39
366.686	139.41
367.126	146.7
367.567	168.54
368.008	151.55
368.448	236.5
368.889	202.52
369.33	178.25
369.77	207.38
370.21	234.08
370.651	168.54
371.091	115.14
371.531	144.27
371.972	161.26
372.412	175.82
372.852	214.66
373.292	190.39
373.732	153.98
374.172	170.97
374.612	153.98
375.052	209.8
375.492	127.28
375.932	144.27
376.372	197.67
376.811	134.56
377.251	204.95
377.691	229.22
378.13	149.12
378.57	219.51
379.009	168.54
379.449	192.81
379.888	144.27
380.328	173.39
380.767	163.69
381.206	190.39
381.645	107.86
382.085	253.49
382.524	180.68
382.963	190.39
383.402	127.28
383.841	185.53
384.28	163.69
384.719	231.65
385.158	110.29
385.596	83.59
386.035	144.27
386.474	187.96
386.913	86.01
387.351	144.27
387.79	141.84
388.228	170.97
388.667	180.68
389.105	253.49
389.544	124.85
389.982	175.82
390.42	168.54
390.859	149.12
391.297	197.67
391.735	156.4
392.173	173.39
392.611	161.26
393.049	178.25
393.487	195.24
393.925	122.42
394.363	166.11
394.801	202.52
395.239	170.97
395.676	139.41
396.114	202.52
396.552	146.7
396.989	192.81
397.427	129.7
397.864	195.24
398.302	124.85
398.739	76.31
399.177	151.55
399.614	103.01
400.051	71.45
400.488	202.52
400.926	202.52
401.363	115.14
401.8	166.11
402.237	127.28
402.674	161.26
403.111	190.39
403.548	146.7
403.985	178.25
404.421	88.44
404.858	144.27
405.295	217.08
405.732	173.39
406.168	161.26
406.605	120
407.041	124.85
407.478	81.16
407.914	122.42
408.351	100.58
408.787	153.98
409.223	170.97
409.66	158.83
410.096	185.53
410.532	219.51
410.968	149.12
411.404	151.55
411.84	153.98
412.276	173.39
412.712	141.84
413.148	146.7
413.584	163.69
414.02	105.43
414.455	187.96
414.891	144.27
415.327	161.26
415.762	122.42
416.198	129.7
416.633	115.14
417.069	105.43
417.504	129.7
417.94	153.98
418.375	134.56
418.81	170.97
419.245	207.38
419.681	156.4
420.116	173.39
420.551	178.25
420.986	197.67
421.421	163.69
421.856	161.26
422.291	144.27
422.726	120
423.16	139.41
423.595	161.26
424.03	170.97
424.464	173.39
424.899	144.27
425.334	120
425.768	161.26
426.203	166.11
426.637	163.69
427.071	170.97
427.506	132.13
427.94	144.27
428.374	175.82
428.809	217.08
429.243	214.66
429.677	156.4
430.111	112.71
430.545	209.8
430.979	151.55
431.413	95.72
431.847	178.25
432.28	129.7
432.714	156.4
433.148	103.01
433.582	224.37
434.015	151.55
434.449	129.7
434.882	83.59
435.316	151.55
435.749	158.83
436.183	185.53
436.616	178.25
437.049	190.39
437.483	161.26
437.916	209.8
438.349	161.26
438.782	107.86
439.215	178.25
439.648	151.55
440.081	158.83
440.514	141.84
440.947	151.55
441.38	170.97
441.813	190.39
442.245	144.27
442.678	127.28
443.111	183.1
443.543	209.8
443.976	115.14
444.408	117.57
444.841	129.7
445.273	141.84
445.705	156.4
446.138	161.26
446.57	149.12
447.002	197.67
447.434	112.71
447.867	195.24
448.299	173.39
448.731	187.96
449.163	156.4
449.595	151.55
450.026	144.27
450.458	166.11
450.89	212.23
451.322	139.41
451.754	173.39
452.185	234.08
452.617	229.22
453.048	200.09
453.48	139.41
453.911	112.71
454.343	132.13
454.774	158.83
455.205	185.53
455.637	204.95
456.068	146.7
456.499	202.52
456.93	115.14
457.361	175.82
457.792	195.24
458.223	180.68
458.654	224.37
459.085	209.8
459.516	192.81
459.947	217.08
460.378	202.52
460.808	207.38
461.239	173.39
461.669	136.99
462.1	93.3
462.531	146.7
462.961	195.24
463.391	187.96
463.822	166.11
464.252	234.08
464.682	158.83
465.113	132.13
465.543	255.92
465.973	229.22
466.403	275.34
466.833	161.26
467.263	183.1
467.693	197.67
468.123	105.43
468.553	224.37
468.983	166.11
469.412	163.69
469.842	175.82
470.272	221.94
470.701	161.26
471.131	178.25
471.56	166.11
471.99	161.26
472.419	151.55
472.849	173.39
473.278	221.94
473.707	282.62
474.136	103.01
474.566	190.39
474.995	166.11
475.424	144.27
475.853	209.8
476.282	192.81
476.711	161.26
477.14	168.54
477.569	112.71
477.997	149.12
478.426	183.1
478.855	255.92
479.283	234.08
479.712	168.54
480.141	178.25
480.569	161.26
480.998	197.67
481.426	163.69
481.854	221.94
482.283	168.54
482.711	202.52
483.139	139.41
483.567	161.26
483.995	185.53
484.424	197.67
484.852	195.24
485.28	224.37
485.708	219.51
486.135	221.94
486.563	178.25
486.991	156.4
487.419	124.85
487.847	149.12
488.274	204.95
488.702	156.4
489.129	127.28
489.557	178.25
489.984	231.65
490.412	202.52
490.839	209.8
491.266	124.85
491.694	178.25
492.121	200.09
492.548	236.5
492.975	168.54
493.402	200.09
493.829	156.4
494.256	190.39
494.683	122.42
495.11	200.09
495.537	153.98
495.964	122.42
496.39	260.77
496.817	163.69
497.244	183.1
497.67	180.68
498.097	132.13
498.523	158.83
498.95	170.97
499.376	139.41
499.803	149.12
500.229	141.84
500.655	161.26
501.081	146.7
501.508	141.84
501.934	202.52
502.36	166.11
502.786	209.8
503.212	178.25
503.638	95.72
504.064	161.26
504.489	178.25
504.915	217.08
505.341	200.09
505.767	204.95
506.192	170.97
506.618	93.3
507.043	158.83
507.469	122.42
507.894	98.15
508.32	163.69
508.745	180.68
509.17	178.25
509.596	156.4
510.021	112.71
510.446	161.26
510.871	217.08
511.296	134.56
511.721	134.56
512.146	187.96
512.571	168.54
512.996	139.41
513.421	180.68
513.845	71.45
514.27	100.58
514.695	98.15
515.119	149.12
515.544	163.69
515.969	127.28
516.393	122.42
516.817	173.39
517.242	127.28
517.666	185.53
518.09	200.09
518.515	209.8
518.939	217.08
519.363	433.11
519.787	185.53
520.211	141.84
520.635	185.53
521.059	149.12
521.483	105.43
521.907	168.54
522.331	226.79
522.754	158.83
523.178	226.79
523.602	158.83
524.025	207.38
524.449	204.95
524.872	151.55
525.296	122.42
525.719	272.91
526.143	231.65
526.566	134.56
526.989	151.55
527.412	139.41
527.836	149.12
528.259	156.4
528.682	163.69
529.105	83.59
529.528	192.81
529.951	175.82
530.374	144.27
530.796	175.82
531.219	144.27
531.642	195.24
532.065	185.53
532.487	151.55
532.91	129.7
533.332	238.93
533.755	151.55
534.177	153.98
534.6	175.82
535.022	117.57
535.444	136.99
535.867	212.23
536.289	197.67
536.711	214.66
537.133	158.83
537.555	156.4
537.977	149.12
538.399	221.94
538.821	190.39
539.243	236.5
539.665	178.25
540.086	163.69
540.508	202.52
540.93	219.51
541.351	243.78
541.773	229.22
542.195	238.93
542.616	268.06
543.037	275.34
543.459	260.77
543.88	224.37
544.301	251.07
544.723	219.51
545.144	207.38
545.565	202.52
545.986	251.07
546.407	282.62
546.828	204.95
547.249	221.94
547.67	139.41
548.091	246.21
548.512	178.25
548.932	226.79
549.353	204.95
549.774	149.12
550.194	243.78
550.615	207.38
551.035	246.21
551.456	166.11
551.876	175.82
552.296	234.08
552.717	217.08
553.137	88.44
553.557	178.25
553.977	202.52
554.397	146.7
554.817	98.15
555.237	132.13
555.657	224.37
556.077	144.27
556.497	136.99
556.917	153.98
557.337	209.8
557.756	238.93
558.176	190.39
558.596	166.11
559.015	212.23
559.435	134.56
559.854	144.27
560.274	129.7
560.693	117.57
561.112	151.55
561.532	173.39
561.951	149.12
562.37	161.26
562.789	129.7
563.208	156.4
563.627	100.58
564.046	129.7
564.465	110.29
564.884	192.81
565.303	56.89
565.722	149.12
566.14	134.56
566.559	136.99
566.978	219.51
567.396	217.08
567.815	202.52
568.233	173.39
568.652	168.54
569.07	151.55
569.489	151.55
569.907	190.39
570.325	117.57
570.743	170.97
571.161	156.4
571.58	163.69
571.998	187.96
572.416	110.29
572.833	178.25
573.251	197.67
573.669	236.5
574.087	226.79
574.505	173.39
574.922	151.55
575.34	112.71
575.758	139.41
576.175	146.7
576.593	178.25
577.01	185.53
577.428	149.12
577.845	1904
578.262	263.2
578.68	217.08
579.097	212.23
579.514	161.26
579.931	200.09
580.348	61.74
580.765	197.67
581.182	183.1
581.599	187.96
582.016	178.25
582.433	161.26
582.849	161.26
583.266	149.12
583.683	139.41
584.099	124.85
584.516	175.82
584.933	115.14
585.349	127.28
585.765	192.81
586.182	200.09
586.598	251.07
587.014	180.68
587.431	112.71
587.847	200.09
588.263	156.4
588.679	263.2
589.095	219.51
589.511	170.97
589.927	168.54
590.343	170.97
590.759	141.84
591.174	180.68
591.59	158.83
592.006	134.56
592.421	100.58
592.837	141.84
593.252	66.6
593.668	134.56
594.083	136.99
594.499	100.58
594.914	192.81
595.329	231.65
595.745	217.08
596.16	192.81
596.575	115.14
596.99	139.41
597.405	105.43
597.82	224.37
598.235	161.26
598.65	124.85
599.065	153.98
599.479	178.25
599.894	120
600.309	190.39
600.724	166.11
601.138	190.39
601.553	183.1
601.967	149.12
602.382	129.7
602.796	166.11
603.21	200.09
603.625	190.39
604.039	219.51
604.453	187.96
604.867	151.55
605.281	144.27
605.695	127.28
606.109	200.09
606.523	149.12
606.937	190.39
607.351	255.92
607.765	134.56
608.178	129.7
608.592	110.29
609.006	226.79
609.419	170.97
609.833	161.26
610.246	144.27
610.66	219.51
611.073	268.06
611.487	200.09
611.9	217.08
612.313	190.39
612.726	144.27
613.139	175.82
613.553	141.84
613.966	163.69
614.379	190.39
614.792	163.69
615.204	192.81
615.617	146.7
616.03	229.22
616.443	212.23
616.856	156.4
617.268	166.11
617.681	221.94
618.093	73.88
618.506	158.83
618.918	163.69
619.331	170.97
619.743	248.64
620.155	170.97
620.568	173.39
620.98	112.71
621.392	175.82
621.804	221.94
622.216	282.62
622.628	207.38
623.04	209.8
623.452	117.57
623.864	158.83
624.276	246.21
624.687	175.82
625.099	149.12
625.511	178.25
625.922	226.79
626.334	163.69
626.745	120
627.157	163.69
627.568	187.96
627.979	219.51
628.391	190.39
628.802	144.27
629.213	168.54
629.624	146.7
630.035	156.4
630.446	158.83
630.857	132.13
631.268	127.28
631.679	204.95
632.09	200.09
632.501	163.69
632.912	129.7
633.322	153.98
633.733	139.41
634.144	170.97
634.554	185.53
634.965	192.81
635.375	170.97
635.785	187.96
636.196	241.36
636.606	115.14
637.016	129.7
637.427	120
637.837	168.54
638.247	178.25
638.657	180.68
639.067	202.52
639.477	107.86
639.887	221.94
640.297	117.57
640.706	175.82
641.116	187.96
641.526	178.25
641.935	163.69
642.345	149.12
642.755	175.82
643.164	64.17
643.573	204.95
643.983	170.97
644.392	207.38
644.801	219.51
645.211	166.11
645.62	248.64
646.029	192.81
646.438	141.84
646.847	180.68
647.256	224.37
647.665	187.96
648.074	178.25
648.483	166.11
648.892	248.64
649.3	151.55
649.709	168.54
650.118	217.08
650.526	221.94
650.935	173.39
651.343	175.82
651.752	158.83
652.16	158.83
652.568	212.23
652.977	180.68
653.385	132.13
653.793	129.7
654.201	168.54
654.609	146.7
655.017	175.82
655.425	163.69
655.833	178.25
656.241	141.84
656.649	197.67
657.057	173.39
657.464	180.68
657.872	234.08
658.28	175.82
658.687	141.84
659.095	202.52
659.502	149.12
659.91	219.51
660.317	178.25
660.724	158.83
661.132	168.54
661.539	144.27
661.946	166.11
662.353	139.41
662.76	168.54
663.167	243.78
663.574	120
663.981	134.56
664.388	185.53
664.795	112.71
665.202	139.41
665.608	175.82
666.015	207.38
666.422	141.84
666.828	149.12
667.235	187.96
667.641	209.8
668.047	120
668.454	100.58
668.86	136.99
669.266	153.98
669.673	124.85
670.079	158.83
670.485	129.7
670.891	163.69
671.297	156.4
671.703	197.67
672.109	170.97
672.515	217.08
672.92	202.52
673.326	163.69
673.732	197.67
674.138	180.68
674.543	132.13
674.949	195.24
675.354	141.84
675.76	202.52
676.165	207.38
676.57	187.96
676.976	180.68
677.381	200.09
677.786	158.83
678.191	161.26
678.596	161.26
679.001	180.68
679.406	180.68
679.811	197.67
680.216	195.24
680.621	180.68
681.026	163.69
681.43	197.67
681.835	144.27
682.24	132.13
682.644	187.96
683.049	141.84
683.453	185.53
683.858	200.09
684.262	204.95
684.667	146.7
685.071	168.54
685.475	136.99
685.879	212.23
686.283	158.83
686.687	134.56
687.091	149.12
687.495	139.41
687.899	139.41
688.303	166.11
688.707	153.98
689.111	136.99
689.514	180.68
689.918	163.69
690.322	158.83
690.725	173.39
691.129	136.99
691.532	132.13
691.936	178.25
692.339	139.41
692.742	153.98
693.146	163.69
693.549	243.78
693.952	187.96
694.355	136.99
694.758	226.79
695.161	197.67
695.564	166.11
695.967	100.58
696.37	175.82
696.773	195.24
697.175	221.94
697.578	209.8
697.981	217.08
698.383	190.39
698.786	202.52
699.188	166.11
699.591	197.67
699.993	299.61
700.395	200.09
700.798	204.95
701.2	93.3
701.602	161.26
702.004	197.67
702.406	127.28
702.808	217.08
703.21	219.51
703.612	265.63
704.014	153.98
704.416	139.41
704.818	168.54
705.219	153.98
705.621	173.39
706.023	197.67
706.424	170.97
706.826	212.23
707.227	277.77
707.629	246.21
708.03	236.5
708.431	195.24
708.832	260.77
709.234	170.97
709.635	248.64
710.036	236.5
710.437	207.38
710.838	280.19
711.239	185.53
711.64	258.35
712.041	224.37
712.441	234.08
712.842	251.07
713.243	173.39
713.643	304.46
714.044	272.91
714.445	234.08
714.845	178.25
715.246	336.02
715.646	224.37
716.046	302.04
716.447	258.35
716.847	207.38
717.247	314.17
717.647	328.74
718.047	289.9
718.447	309.32
718.847	350.58
719.247	343.3
719.647	241.36
720.047	316.6
720.446	464.66
720.846	294.76
721.246	408.84
721.645	321.46
722.045	372.43
722.444	348.15
722.844	430.68
723.243	396.7
723.643	411.26
724.042	430.68
724.441	479.22
724.84	372.43
725.24	440.39
725.639	386.99
726.038	420.97
726.437	452.53
726.836	447.67
727.234	496.22
727.633	542.33
728.032	518.06
728.431	586.02
728.83	615.15
729.228	687.97
729.627	758.36
730.025	731.66
730.424	884.57
730.822	891.85
731.22	889.43
731.619	1049.62
732.017	1149.14
732.415	1112.73
732.813	1180.69
733.212	1316.62
733.61	1488.95
734.008	1520.5
734.406	1668.56
734.803	1765.65
735.201	1865.17
735.599	1974.39
735.997	2054.49
736.395	2246.24
736.792	2367.6
737.19	2559.35
737.587	2474.4
737.985	2615.18
738.382	2789.94
738.78	2969.55
739.177	2935.57
739.574	3253.54
739.971	3476.84
740.369	3530.24
740.766	3634.61
741.163	3743.84
741.56	4078.8
741.957	4076.37
742.354	4348.22
742.751	4418.61
743.147	4688.03
743.544	4794.83
743.941	5018.13
744.338	5605.52
744.734	5724.45
745.131	5955.04
745.527	6195.33
745.924	6542.43
746.32	6814.27
746.716	7445.35
747.113	7899.24
747.509	8090.99
747.905	8061.87
748.301	8348.28
748.697	8870.13
749.093	9765.78
749.489	9979.37
749.885	10392
750.281	10938.13
750.677	10950.26
751.073	11537.65
751.468	12455.14
751.864	13168.74
752.26	13314.38
752.655	13642.05
753.051	14049.82
753.446	15185.76
753.842	15836.26
754.237	16379.96
754.632	16821.71
755.028	16185.78
755.423	16748.9
755.818	17314.44
756.213	18270.76
756.608	18646.98
757.003	18554.75
757.398	18423.68
757.793	18671.26
758.188	18986.79
758.583	19620.3
758.977	19991.66
759.372	20566.92
759.767	21273.24
760.161	22312.09
760.556	23681.04
760.95	24787.86
761.345	25266.02
761.739	26013.6
762.133	26596.14
762.527	27870.43
762.922	28727.24
763.316	30042.79
763.71	30198.13
764.104	30210.27
764.498	30979.7
764.892	32076.8
765.286	32506.42
765.68	32763.71
766.073	33627.8
766.467	33936.06
766.861	34899.66
767.255	36649.69
767.648	37938.55
768.042	37936.12
768.435	38673.99
768.829	39329.34
769.222	40055.08
769.615	41227.43
770.008	40212.85
770.402	39967.7
770.795	40965.29
771.188	41518.7
771.581	41921.62
771.974	41098.79
772.367	40268.68
772.76	40305.09
773.153	40064.79
773.545	39768.67
773.938	40824.51
774.331	40222.56
774.724	40443.44
775.116	42171.62
775.509	43640.09
775.901	45205.65
776.294	45390.12
776.686	46033.33
777.078	46513.92
777.471	48038.22
777.863	50103.78
778.255	51545.55
778.647	51446.04
779.039	50967.87
779.431	51297.98
779.823	52108.67
780.215	52929.07
780.607	51744.59
780.999	52023.72
781.39	52730.04
781.782	53596.56
782.174	53399.95
782.565	53482.48
782.957	53516.46
783.348	54220.35
783.74	54620.84
784.131	54509.19
784.522	54210.64
784.914	52941.21
785.305	53412.09
785.696	54436.37
786.087	54652.4
786.478	53305.29
786.869	50919.33
787.26	50222.72
787.651	50319.81
788.042	50613.5
788.433	48698.42
788.823	46700.82
789.214	46125.57
789.605	45489.63
789.995	44700.79
790.386	42356.09
790.776	41603.65
791.167	41278.4
791.557	43305.13
791.948	43521.16
792.338	42671.63
792.728	42751.73
793.118	43836.7
793.508	45375.55
793.898	45992.07
794.288	44630.4
794.678	43278.43
795.068	44424.08
795.458	44727.49
795.848	46018.77
796.238	44227.48
796.627	43161.93
797.017	43994.46
797.406	44975.06
797.796	44538.16
798.185	44055.15
798.575	43055.13
798.964	43615.82
799.354	45147.4
799.743	44135.24
800.132	42470.17
800.521	43152.22
800.91	43814.85
801.299	44994.48
801.688	44899.82
802.077	42428.91
802.466	42288.13
802.855	43404.65
803.244	42414.34
803.633	41445.88
804.021	39967.7
804.41	40093.92
804.799	40062.36
805.187	38448.26
805.576	36853.58
805.964	35159.38
806.352	34450.63
806.741	34955.49
807.129	34251.59
807.517	32773.42
807.905	32948.18
808.293	33297.7
808.681	33904.5
809.069	33220.03
809.457	33312.26
809.845	32902.06
810.233	34508.88
810.621	35673.95
811.009	34125.38
811.396	33962.76
811.784	33710.32
812.171	34380.24
812.559	34346.26
812.946	32503.99
813.334	31222.42
813.721	31989.42
814.108	32113.21
814.496	31554.95
814.883	29579.19
815.27	30348.62
815.657	30372.89
816.044	31013.68
816.431	30433.57
816.818	29368.02
817.205	29358.31
817.592	30787.95
817.979	29819.49
818.365	29059.77
818.752	26962.65
819.139	26671.38
819.525	26972.36
819.912	26353.41
820.298	25181.07
820.685	23892.21
821.071	24227.17
821.457	24426.2
821.843	22816.95
822.23	21622.76
822.616	21338.77
823.002	20901.87
823.388	19746.51
823.774	18729.51
824.16	18003.77
824.546	17795.03
824.931	17935.81
825.317	17040.16
825.703	16399.38
826.089	16462.48
826.474	16945.5
826.86	16462.48
827.245	15807.13
827.631	15787.72
828.016	15744.03
828.401	15819.27
828.787	15178.48
829.172	14668.77
829.557	14185.75
829.942	13918.75
830.327	13816.81
830.712	13258.55
831.097	12399.31
831.482	12426.01
831.867	12836.21
832.252	12328.92
832.636	11396.87
833.021	11566.78
833.406	11355.61
833.79	11360.46
834.175	10940.55
834.559	10467.24
834.944	10326.47
835.328	10554.62
835.713	10139.57
836.097	9705.1
836.481	9258.49
836.865	9399.27
837.249	9054.6
837.633	8598.28
838.017	8421.1
838.401	7833.71
838.785	7586.13
839.169	7680.79
839.553	6986.61
839.937	6753.59
840.32	6571.55
840.704	6323.98
841.087	6100.67
841.471	5622.51
841.854	5627.36
842.238	5428.33
842.621	5455.03
843.004	5112.79
843.388	4974.44
843.771	4908.91
844.154	4981.72
844.537	4765.7
844.92	4860.36
845.303	4649.19
845.686	4595.79
846.069	4605.5
846.452	4258.41
846.834	4200.16
847.217	4214.72
847.6	3981.71
847.982	4020.54
848.365	3806.95
848.748	3826.36
849.13	3785.1
849.512	3654.03
849.895	3612.77
850.277	3445.29
850.659	3355.48
851.041	3486.55
851.423	3442.86
851.806	3086.06
852.188	3100.62
852.57	3035.09
852.951	3049.65
853.333	2959.85
853.715	2794.79
854.097	2751.1
854.479	2615.18
854.86	2542.36
855.242	2467.12
855.623	2379.74
856.005	2270.51
856.386	2248.67
856.768	2166.14
857.149	2064.2
857.53	1901.58
857.911	1918.57
858.292	1748.66
858.674	1765.65
859.055	1617.59
859.436	1634.58
859.817	1513.22
860.197	1491.38
860.578	1408.85
860.959	1404
861.34	1343.32
861.72	1314.19
862.101	1260.79
862.482	1212.25
862.862	1156.42
863.243	1163.7
863.623	1093.31
864.003	1098.17
864.384	1010.79
864.764	967.1
865.144	925.83
865.524	996.22
865.904	896.71
866.284	879.72
866.664	838.45
867.044	799.62
867.424	729.23
867.804	845.74
868.183	743.79
868.563	692.82
868.943	663.69
869.322	695.25
869.702	653.98
870.081	578.74
870.461	588.45
870.84	629.71
871.22	561.75
871.599	566.6
871.978	547.19
872.357	508.35
872.736	508.35
873.115	471.94
873.494	544.76
873.873	437.96
874.252	515.63
874.631	442.82
875.01	411.26
875.388	406.41
875.767	420.97
876.146	372.43
876.524	416.12
876.903	319.03
877.281	277.77
877.66	292.33
878.038	287.47
878.416	277.77
878.794	275.34
879.173	333.59
879.551	316.6
879.929	319.03
880.307	338.45
880.685	275.34
881.063	241.36
881.441	255.92
881.818	265.63
882.196	229.22
882.574	246.21
882.951	253.49
883.329	311.75
883.707	243.78
884.084	229.22
884.461	277.77
884.839	306.89
885.216	248.64
885.593	277.77
885.971	299.61
886.348	238.93
886.725	190.39
887.102	190.39
887.479	229.22
887.856	234.08
888.233	207.38
888.609	212.23
888.986	183.1
889.363	197.67
889.74	197.67
890.116	234.08
890.493	231.65
890.869	156.4
891.246	178.25
891.622	187.96
891.998	207.38
892.375	207.38
892.751	226.79
893.127	226.79
893.503	173.39
893.879	178.25
894.255	124.85
894.631	219.51
895.007	231.65
895.383	217.08
895.759	170.97
896.134	195.24
896.51	183.1
896.886	183.1
897.261	243.78
897.637	192.81
898.012	178.25
898.388	136.99
898.763	204.95
899.138	158.83
899.514	166.11
899.889	207.38
900.264	149.12
900.639	209.8
901.014	163.69
901.389	161.26
901.764	129.7
902.139	149.12
902.513	127.28
902.888	105.43
903.263	178.25
903.638	161.26
904.012	151.55
904.387	226.79
904.761	107.86
905.136	112.71
905.51	153.98
905.884	132.13
906.259	180.68
906.633	151.55
907.007	144.27
907.381	149.12
907.755	141.84
908.129	166.11
908.503	175.82
908.877	175.82
909.251	139.41
909.624	219.51
909.998	110.29
910.372	120
910.745	166.11
911.119	158.83
911.492	158.83
911.866	153.98
912.239	175.82
912.612	183.1
912.986	100.58
913.359	127.28
913.732	187.96
914.105	183.1
914.478	178.25
914.851	170.97
915.224	158.83
915.597	139.41
915.97	202.52
916.343	105.43
916.715	141.84
917.088	129.7
917.461	144.27
917.833	144.27
918.206	168.54
918.578	117.57
918.951	192.81
919.323	214.66
919.695	71.45
920.067	139.41
920.44	139.41
920.812	112.71
921.184	141.84
921.556	207.38
921.928	161.26
922.3	105.43
922.672	229.22
923.043	187.96
923.415	175.82
923.787	200.09
924.158	122.42
924.53	175.82
924.901	226.79
925.273	170.97
925.644	144.27
926.016	134.56
926.387	166.11
926.758	219.51
927.129	54.46
927.5	127.28
927.872	178.25
928.243	141.84
928.613	178.25
928.984	200.09
929.355	178.25
929.726	217.08
930.097	120
930.467	139.41
930.838	207.38
931.209	117.57
931.579	112.71
931.95	110.29
932.32	156.4
932.69	190.39
933.061	136.99
933.431	149.12
933.801	173.39
934.171	141.84
934.541	144.27
934.911	175.82
935.281	197.67
935.651	214.66
936.021	163.69
936.391	251.07
936.761	175.82
937.13	161.26
937.5	122.42
937.87	178.25
938.239	139.41
938.609	156.4
938.978	132.13
939.347	156.4
939.717	156.4
940.086	229.22
940.455	115.14
940.824	120
941.193	144.27
941.562	158.83
941.931	139.41
942.3	197.67
942.669	141.84
943.038	122.42
943.407	56.89
943.775	124.85
944.144	141.84
944.513	185.53
944.881	127.28
945.25	173.39
945.618	163.69
945.986	197.67
946.355	190.39
946.723	195.24
947.091	202.52
947.459	120
947.827	134.56
948.195	178.25
948.563	122.42
948.931	153.98
949.299	107.86
949.667	132.13
950.035	103.01
950.402	112.71
950.77	100.58
951.138	112.71
951.505	180.68
951.873	149.12
952.24	144.27
952.607	93.3
952.975	195.24
953.342	163.69
953.709	168.54
954.076	132.13
954.443	124.85
954.81	151.55
955.177	175.82
955.544	110.29
955.911	178.25
956.278	110.29
956.645	153.98
957.012	178.25
957.378	100.58
957.745	122.42
958.111	132.13
958.478	83.59
958.844	251.07
959.211	178.25
959.577	127.28
959.943	175.82
960.309	144.27
960.675	161.26
961.042	168.54
961.408	180.68
961.774	163.69
962.139	117.57
962.505	173.39
962.871	110.29
963.237	183.1
963.603	151.55
963.968	127.28
964.334	178.25
964.699	141.84
965.065	86.01
965.43	146.7
965.796	83.59
966.161	195.24
966.526	158.83
966.891	183.1
967.256	110.29
967.622	134.56
967.987	175.82
968.352	202.52
968.716	153.98
969.081	195.24
969.446	71.45
969.811	49.61
970.176	161.26
970.54	158.83
970.905	175.82
971.269	183.1
971.634	153.98
971.998	117.57
972.363	107.86
972.727	120
973.091	132.13
973.455	120
973.819	122.42
974.183	178.25
974.547	183.1
974.911	86.01
975.275	161.26
975.639	134.56
976.003	141.84
976.367	115.14
976.73	149.12
977.094	139.41
977.458	149.12
977.821	83.59
978.185	120
978.548	173.39
978.911	149.12
979.275	197.67
979.638	156.4
980.001	110.29
980.364	107.86
980.727	187.96
981.09	132.13
981.453	183.1
981.816	144.27
982.179	158.83
982.542	124.85
982.905	139.41
983.267	163.69
983.63	170.97
983.992	105.43
984.355	78.73
984.717	209.8
985.08	187.96
985.442	163.69
985.804	81.16
986.167	209.8
986.529	129.7
986.891	156.4
987.253	229.22
987.615	112.71
987.977	76.31
988.339	197.67
988.701	124.85
989.062	93.3
989.424	115.14
989.786	112.71
990.147	132.13
990.509	127.28
990.87	175.82
991.232	178.25
991.593	170.97
991.955	158.83
992.316	209.8
992.677	146.7
993.038	122.42
993.399	115.14
993.76	144.27
994.121	149.12
994.482	192.81
994.843	190.39
995.204	129.7
995.565	132.13
995.926	141.84
996.286	197.67
996.647	183.1
997.007	180.68
997.368	197.67
997.728	153.98
998.089	144.27
998.449	52.03
998.809	127.28
999.169	229.22
999.53	153.98
999.89	204.95
1000.25	175.82
1000.61	129.7
1000.97	180.68
1001.329	200.09
1001.689	136.99
1002.049	158.83
1002.409	105.43
1002.768	120
1003.128	132.13
1003.487	187.96
1003.847	88.44
1004.206	178.25
1004.566	187.96
1004.925	129.7
1005.284	195.24
1005.643	153.98
1006.003	122.42
1006.362	214.66
1006.721	217.08
1007.08	161.26
1007.438	158.83
1007.797	115.14
1008.156	88.44
1008.515	190.39
1008.874	161.26
1009.232	127.28
1009.591	158.83
1009.949	144.27
1010.308	93.3
1010.666	144.27
1011.024	149.12
1011.383	100.58
1011.741	149.12
1012.099	204.95
1012.457	163.69
1012.815	120
1013.173	136.99
1013.531	161.26
1013.889	132.13
1014.247	107.86
1014.605	209.8
1014.962	110.29
1015.32	156.4
1015.678	146.7
1016.035	117.57
1016.393	185.53
1016.75	180.68
1017.107	168.54
1017.465	187.96
1017.822	187.96
1018.179	212.23
1018.536	197.67
1018.894	136.99
1019.251	149.12
1019.608	146.7
1019.964	59.32
1020.321	134.56
1020.678	197.67
1021.035	195.24
1021.392	139.41
1021.748	141.84
1022.105	132.13
1022.461	158.83
1022.818	144.27
1023.174	88.44
1023.531	183.1
1023.887	168.54
1024.243	204.95
1024.599	117.57
1024.955	175.82
1025.311	149.12
1025.667	117.57
1026.023	170.97
1026.379	141.84
1026.735	98.15
1027.091	98.15
1027.447	175.82
