189.514	99.52
189.973	99.52
190.431	99.52
190.889	75.24
191.348	60.68
191.806	38.84
192.264	7.28
192.722	4.85
193.18	29.13
193.638	-82.53
194.096	16.99
194.554	-7.28
195.012	-21.85
195.47	26.7
195.928	-12.14
196.385	67.96
196.843	-4.85
197.301	-26.7
197.758	-29.13
198.216	24.27
198.674	-24.27
199.131	31.55
199.589	53.4
200.046	-0
200.503	89.81
200.961	84.95
201.418	92.23
201.875	70.39
202.332	70.39
202.79	70.39
203.247	145.63
203.704	213.6
204.161	138.35
204.618	121.36
205.075	111.65
205.532	67.96
205.989	111.65
206.445	123.79
206.902	213.6
207.359	160.2
207.816	160.2
208.272	179.61
208.729	157.77
209.185	145.63
209.642	148.06
210.098	179.61
210.555	104.37
211.011	143.21
211.467	152.91
211.924	104.37
212.38	216.02
212.836	114.08
213.292	126.22
213.748	131.07
214.204	186.9
214.66	133.5
215.116	177.19
215.572	123.79
216.028	150.49
216.484	174.76
216.94	247.58
217.396	121.36
217.851	101.94
218.307	157.77
218.763	148.06
219.218	109.23
219.674	201.46
220.129	186.9
220.585	121.36
221.04	172.33
221.496	131.07
221.951	143.21
222.406	182.04
222.861	160.2
223.317	162.62
223.772	184.47
224.227	199.03
224.682	155.34
225.137	174.76
225.592	133.5
226.047	128.64
226.502	111.65
226.957	218.45
227.411	121.36
227.866	157.77
228.321	118.93
228.776	135.92
229.23	177.19
229.685	191.75
230.139	133.5
230.594	177.19
231.048	126.22
231.503	155.34
231.957	162.62
232.411	228.16
232.865	133.5
233.32	145.63
233.774	143.21
234.228	152.91
234.682	184.47
235.136	121.36
235.59	114.08
236.044	218.45
236.498	182.04
236.952	155.34
237.406	46.12
237.86	177.19
238.313	111.65
238.767	148.06
239.221	162.62
239.674	116.51
240.128	131.07
240.581	172.33
241.035	150.49
241.488	169.91
241.942	128.64
242.395	213.6
242.848	106.8
243.301	157.77
243.755	99.52
244.208	160.2
244.661	196.61
245.114	203.89
245.567	138.35
246.02	131.07
246.473	92.23
246.926	179.61
247.379	135.92
247.832	160.2
248.284	133.5
248.737	135.92
249.19	172.33
249.642	131.07
250.095	123.79
250.547	208.74
251	148.06
251.452	155.34
251.905	155.34
252.357	225.73
252.81	157.77
253.262	123.79
253.714	155.34
254.166	177.19
254.618	92.23
255.07	101.94
255.523	194.18
255.975	155.34
256.427	165.05
256.878	169.91
257.33	177.19
257.782	121.36
258.234	165.05
258.686	237.87
259.137	72.82
259.589	189.32
260.041	104.37
260.492	89.81
260.944	165.05
261.395	89.81
261.847	128.64
262.298	143.21
262.749	116.51
263.201	114.08
263.652	220.88
264.103	172.33
264.554	194.18
265.005	191.75
265.457	94.66
265.908	140.78
266.359	186.9
266.809	218.45
267.26	148.06
267.711	101.94
268.162	111.65
268.613	145.63
269.064	201.46
269.514	140.78
269.965	138.35
270.415	145.63
270.866	143.21
271.316	101.94
271.767	182.04
272.217	167.48
272.668	206.31
273.118	223.3
273.568	111.65
274.019	84.95
274.469	145.63
274.919	101.94
275.369	157.77
275.819	152.91
276.269	157.77
276.719	191.75
277.169	111.65
277.619	223.3
278.069	133.5
278.518	155.34
278.968	106.8
279.418	174.76
279.867	167.48
280.317	211.17
280.767	89.81
281.216	250
281.666	196.61
282.115	104.37
282.564	206.31
283.014	150.49
283.463	167.48
283.912	182.04
284.361	179.61
284.811	109.23
285.26	77.67
285.709	148.06
286.158	201.46
286.607	167.48
287.056	184.47
287.505	206.31
287.953	135.92
288.402	201.46
288.851	157.77
289.3	116.51
289.748	135.92
290.197	148.06
290.646	155.34
291.094	194.18
291.543	169.91
291.991	182.04
292.439	150.49
292.888	174.76
293.336	165.05
293.784	152.91
294.233	70.39
294.681	167.48
295.129	135.92
295.577	157.77
296.025	89.81
296.473	131.07
296.921	133.5
297.369	184.47
297.817	182.04
298.264	218.45
298.712	116.51
299.16	155.34
299.608	157.77
300.055	155.34
300.503	138.35
300.95	111.65
301.398	111.65
301.845	184.47
302.293	169.91
302.74	152.91
303.187	162.62
303.635	186.9
304.082	116.51
304.529	167.48
304.976	135.92
305.423	167.48
305.87	138.35
306.317	199.03
306.764	116.51
307.211	140.78
307.658	155.34
308.105	157.77
308.552	104.37
308.998	116.51
309.445	220.88
309.892	145.63
310.338	116.51
310.785	123.79
311.231	184.47
311.678	191.75
312.124	203.89
312.571	145.63
313.017	179.61
313.463	182.04
313.909	186.9
314.356	97.09
314.802	169.91
315.248	201.46
315.694	133.5
316.14	121.36
316.586	162.62
317.032	201.46
317.478	182.04
317.923	155.34
318.369	135.92
318.815	203.89
319.261	165.05
319.706	101.94
320.152	233.01
320.597	182.04
321.043	145.63
321.488	199.03
321.934	109.23
322.379	167.48
322.824	165.05
323.27	160.2
323.715	155.34
324.16	172.33
324.605	179.61
325.05	111.65
325.495	87.38
325.94	177.19
326.385	126.22
326.83	201.46
327.275	225.73
327.72	101.94
328.165	179.61
328.61	165.05
329.054	162.62
329.499	135.92
329.943	77.67
330.388	126.22
330.832	106.8
331.277	196.61
331.721	150.49
332.166	194.18
332.61	194.18
333.054	167.48
333.499	182.04
333.943	208.74
334.387	155.34
334.831	177.19
335.275	155.34
335.719	199.03
336.163	162.62
336.607	186.9
337.051	157.77
337.495	126.22
337.938	189.32
338.382	126.22
338.826	169.91
339.269	203.89
339.713	101.94
340.157	186.9
340.6	186.9
341.044	194.18
341.487	138.35
341.93	138.35
342.374	135.92
342.817	196.61
343.26	223.3
343.703	179.61
344.146	135.92
344.59	157.77
345.033	189.32
345.476	182.04
345.919	111.65
346.361	140.78
346.804	128.64
347.247	106.8
347.69	162.62
348.133	225.73
348.575	152.91
349.018	157.77
349.461	116.51
349.903	213.6
350.346	191.75
350.788	167.48
351.23	169.91
351.673	126.22
352.115	252.43
352.557	128.64
353	116.51
353.442	145.63
353.884	109.23
354.326	162.62
354.768	152.91
355.21	121.36
355.652	133.5
356.094	121.36
356.536	121.36
356.978	157.77
357.419	172.33
357.861	145.63
358.303	111.65
358.744	169.91
359.186	148.06
359.627	179.61
360.069	174.76
360.51	179.61
360.952	169.91
361.393	191.75
361.834	155.34
362.276	87.38
362.717	123.79
363.158	109.23
363.599	150.49
364.04	216.02
364.481	157.77
364.922	213.6
365.363	148.06
365.804	179.61
366.245	116.51
366.686	155.34
367.126	111.65
367.567	131.07
368.008	118.93
368.448	148.06
368.889	182.04
369.33	138.35
369.77	72.82
370.21	184.47
370.651	208.74
371.091	160.2
371.531	135.92
371.972	257.29
372.412	186.9
372.852	118.93
373.292	233.01
373.732	160.2
374.172	191.75
374.612	220.88
375.052	131.07
375.492	138.35
375.932	131.07
376.372	179.61
376.811	167.48
377.251	148.06
377.691	155.34
378.13	169.91
378.57	186.9
379.009	138.35
379.449	162.62
379.888	126.22
380.328	203.89
380.767	167.48
381.206	177.19
381.645	155.34
382.085	148.06
382.524	191.75
382.963	179.61
383.402	150.49
383.841	177.19
384.28	148.06
384.719	179.61
385.158	177.19
385.596	160.2
386.035	218.45
386.474	169.91
386.913	109.23
387.351	72.82
387.79	123.79
388.228	186.9
388.667	172.33
389.105	230.59
389.544	184.47
389.982	211.17
390.42	165.05
390.859	157.77
391.297	118.93
391.735	228.16
392.173	89.81
392.611	106.8
393.049	157.77
393.487	118.93
393.925	26.7
394.363	165.05
394.801	157.77
395.239	77.67
395.676	174.76
396.114	172.33
396.552	206.31
396.989	118.93
397.427	191.75
397.864	225.73
398.302	152.91
398.739	148.06
399.177	189.32
399.614	169.91
400.051	203.89
400.488	179.61
400.926	114.08
401.363	169.91
401.8	162.62
402.237	174.76
402.674	111.65
403.111	126.22
403.548	191.75
403.985	211.17
404.421	216.02
404.858	182.04
405.295	189.32
405.732	143.21
406.168	111.65
406.605	145.63
407.041	174.76
407.478	109.23
407.914	174.76
408.351	128.64
408.787	160.2
409.223	94.66
409.66	140.78
410.096	194.18
410.532	138.35
410.968	152.91
411.404	167.48
411.84	172.33
412.276	138.35
412.712	199.03
413.148	148.06
413.584	121.36
414.02	70.39
414.455	150.49
414.891	145.63
415.327	206.31
415.762	201.46
416.198	160.2
416.633	167.48
417.069	135.92
417.504	140.78
417.94	67.96
418.375	196.61
418.81	148.06
419.245	150.49
419.681	82.53
420.116	152.91
420.551	135.92
420.986	155.34
421.421	165.05
421.856	179.61
422.291	118.93
422.726	174.76
423.16	186.9
423.595	131.07
424.03	165.05
424.464	133.5
424.899	114.08
425.334	77.67
425.768	160.2
426.203	140.78
426.637	155.34
427.071	145.63
427.506	179.61
427.94	143.21
428.374	133.5
428.809	186.9
429.243	143.21
429.677	172.33
430.111	160.2
430.545	123.79
430.979	208.74
431.413	174.76
431.847	177.19
432.28	145.63
432.714	150.49
433.148	162.62
433.582	186.9
434.015	97.09
434.449	138.35
434.882	106.8
435.316	75.24
435.749	242.72
436.183	101.94
436.616	126.22
437.049	145.63
437.483	184.47
437.916	177.19
438.349	191.75
438.782	138.35
439.215	155.34
439.648	82.53
440.081	160.2
440.514	167.48
440.947	186.9
441.38	199.03
441.813	237.87
442.245	216.02
442.678	177.19
443.111	138.35
443.543	126.22
443.976	148.06
444.408	111.65
444.841	266.99
445.273	143.21
445.705	182.04
446.138	128.64
446.57	148.06
447.002	118.93
447.434	191.75
447.867	165.05
448.299	165.05
448.731	211.17
449.163	174.76
449.595	157.77
450.026	199.03
450.458	196.61
450.89	220.88
451.322	213.6
451.754	177.19
452.185	194.18
452.617	283.99
453.048	196.61
453.48	101.94
453.911	220.88
454.343	201.46
454.774	242.72
455.205	189.32
455.637	199.03
456.068	220.88
456.499	206.31
456.93	216.02
457.361	140.78
457.792	216.02
458.223	109.23
458.654	247.58
459.085	179.61
459.516	276.7
459.947	240.29
460.378	169.91
460.808	211.17
461.239	148.06
461.669	199.03
462.1	230.59
462.531	220.88
462.961	245.15
463.391	240.29
463.822	199.03
464.252	196.61
464.682	194.18
465.113	174.76
465.543	167.48
465.973	269.42
466.403	216.02
466.833	286.41
467.263	230.59
467.693	216.02
468.123	218.45
468.553	247.58
468.983	208.74
469.412	174.76
469.842	211.17
470.272	184.47
470.701	213.6
471.131	245.15
471.56	135.92
471.99	150.49
472.419	104.37
472.849	169.91
473.278	211.17
473.707	167.48
474.136	223.3
474.566	179.61
474.995	216.02
475.424	155.34
475.853	114.08
476.282	167.48
476.711	179.61
477.14	177.19
477.569	148.06
477.997	109.23
478.426	87.38
478.855	208.74
479.283	143.21
479.712	155.34
480.141	160.2
480.569	177.19
480.998	211.17
481.426	133.5
481.854	160.2
482.283	165.05
482.711	138.35
483.139	271.85
483.567	167.48
483.995	152.91
484.424	160.2
484.852	138.35
485.28	143.21
485.708	131.07
486.135	208.74
486.563	143.21
486.991	155.34
487.419	111.65
487.847	247.58
488.274	201.46
488.702	106.8
489.129	162.62
489.557	169.91
489.984	186.9
490.412	230.59
490.839	233.01
491.266	201.46
491.694	148.06
492.121	123.79
492.548	208.74
492.975	155.34
493.402	167.48
493.829	235.44
494.256	169.91
494.683	116.51
495.11	152.91
495.537	167.48
495.964	189.32
496.39	114.08
496.817	150.49
497.244	165.05
497.67	201.46
498.097	148.06
498.523	203.89
498.95	196.61
499.376	182.04
499.803	186.9
500.229	223.3
500.655	135.92
501.081	155.34
501.508	160.2
501.934	99.52
502.36	201.46
502.786	220.88
503.212	191.75
503.638	155.34
504.064	123.79
504.489	135.92
504.915	208.74
505.341	145.63
505.767	123.79
506.192	223.3
506.618	148.06
507.043	116.51
507.469	155.34
507.894	245.15
508.32	218.45
508.745	138.35
509.17	208.74
509.596	162.62
510.021	191.75
510.446	233.01
510.871	143.21
511.296	177.19
511.721	162.62
512.146	172.33
512.571	162.62
512.996	245.15
513.421	182.04
513.845	118.93
514.27	123.79
514.695	218.45
515.119	174.76
515.544	177.19
515.969	189.32
516.393	143.21
516.817	150.49
517.242	138.35
517.666	160.2
518.09	184.47
518.515	109.23
518.939	172.33
519.363	366.51
519.787	179.61
520.211	101.94
520.635	157.77
521.059	138.35
521.483	233.01
521.907	155.34
522.331	199.03
522.754	237.87
523.178	143.21
523.602	157.77
524.025	152.91
524.449	152.91
524.872	123.79
525.296	191.75
525.719	191.75
526.143	133.5
526.566	126.22
526.989	157.77
527.412	145.63
527.836	179.61
528.259	184.47
528.682	182.04
529.105	135.92
529.528	121.36
529.951	169.91
530.374	203.89
530.796	104.37
531.219	121.36
531.642	157.77
532.065	145.63
532.487	123.79
532.91	167.48
533.332	172.33
533.755	133.5
534.177	177.19
534.6	203.89
535.022	118.93
535.444	172.33
535.867	191.75
536.289	235.44
536.711	191.75
537.133	182.04
537.555	167.48
537.977	269.42
538.399	206.31
538.821	196.61
539.243	157.77
539.665	218.45
540.086	225.73
540.508	237.87
540.93	201.46
541.351	150.49
541.773	143.21
542.195	216.02
542.616	194.18
543.037	201.46
543.459	186.9
543.88	203.89
544.301	162.62
544.723	257.29
545.144	223.3
545.565	174.76
545.986	208.74
546.407	184.47
546.828	213.6
547.249	257.29
547.67	174.76
548.091	177.19
548.512	167.48
548.932	203.89
549.353	235.44
549.774	191.75
550.194	179.61
550.615	203.89
551.035	145.63
551.456	211.17
551.876	152.91
552.296	172.33
552.717	138.35
553.137	201.46
553.557	138.35
553.977	169.91
554.397	101.94
554.817	172.33
555.237	199.03
555.657	165.05
556.077	140.78
556.497	174.76
556.917	257.29
557.337	138.35
557.756	216.02
558.176	194.18
558.596	126.22
559.015	160.2
559.435	196.61
559.854	177.19
560.274	135.92
560.693	179.61
561.112	201.46
561.532	133.5
561.951	104.37
562.37	140.78
562.789	150.49
563.208	189.32
563.627	259.71
564.046	184.47
564.465	121.36
564.884	211.17
565.303	220.88
565.722	172.33
566.14	133.5
566.559	235.44
566.978	230.59
567.396	150.49
567.815	225.73
568.233	135.92
568.652	203.89
569.07	157.77
569.489	203.89
569.907	247.58
570.325	177.19
570.743	186.9
571.161	160.2
571.58	174.76
571.998	94.66
572.416	220.88
572.833	216.02
573.251	148.06
573.669	160.2
574.087	177.19
574.505	169.91
574.922	165.05
575.34	186.9
575.758	167.48
576.175	216.02
576.593	138.35
577.01	133.5
577.428	228.16
577.845	1451.48
578.262	283.99
578.68	160.2
579.097	172.33
579.514	169.91
579.931	247.58
580.348	111.65
580.765	184.47
581.182	182.04
581.599	247.58
582.016	220.88
582.433	160.2
582.849	211.17
583.266	208.74
583.683	245.15
584.099	143.21
584.516	155.34
584.933	182.04
585.349	138.35
585.765	162.62
586.182	189.32
586.598	138.35
587.014	128.64
587.431	167.48
587.847	104.37
588.263	169.91
588.679	167.48
589.095	101.94
589.511	160.2
589.927	165.05
590.343	271.85
590.759	165.05
591.174	160.2
591.59	196.61
592.006	111.65
592.421	157.77
592.837	111.65
593.252	133.5
593.668	199.03
594.083	152.91
594.499	223.3
594.914	177.19
595.329	84.95
595.745	269.42
596.16	160.2
596.575	111.65
596.99	223.3
597.405	213.6
597.82	230.59
598.235	169.91
598.65	179.61
599.065	169.91
599.479	182.04
599.894	216.02
600.309	213.6
600.724	157.77
601.138	230.59
601.553	167.48
601.967	92.23
602.382	191.75
602.796	174.76
603.21	160.2
603.625	169.91
604.039	203.89
604.453	223.3
604.867	165.05
605.281	177.19
605.695	169.91
606.109	177.19
606.523	118.93
606.937	211.17
607.351	310.68
607.765	172.33
608.178	162.62
608.592	167.48
609.006	237.87
609.419	174.76
609.833	208.74
610.246	203.89
610.66	123.79
611.073	233.01
611.487	194.18
611.9	152.91
612.313	116.51
612.726	220.88
613.139	118.93
613.553	196.61
613.966	179.61
614.379	116.51
614.792	194.18
615.204	152.91
615.617	150.49
616.03	194.18
616.443	167.48
616.856	228.16
617.268	84.95
617.681	138.35
618.093	177.19
618.506	184.47
618.918	121.36
619.331	150.49
619.743	92.23
620.155	184.47
620.568	223.3
620.98	225.73
621.392	118.93
621.804	138.35
622.216	169.91
622.628	194.18
623.04	194.18
623.452	206.31
623.864	174.76
624.276	123.79
624.687	182.04
625.099	196.61
625.511	169.91
625.922	143.21
626.334	157.77
626.745	114.08
627.157	111.65
627.568	157.77
627.979	186.9
628.391	140.78
628.802	182.04
629.213	186.9
629.624	143.21
630.035	169.91
630.446	104.37
630.857	155.34
631.268	128.64
631.679	72.82
632.09	152.91
632.501	201.46
632.912	194.18
633.322	140.78
633.733	126.22
634.144	213.6
634.554	162.62
634.965	138.35
635.375	189.32
635.785	165.05
636.196	138.35
636.606	150.49
637.016	182.04
637.427	182.04
637.837	133.5
638.247	143.21
638.657	189.32
639.067	106.8
639.477	150.49
639.887	157.77
640.297	184.47
640.706	145.63
641.116	208.74
641.526	143.21
641.935	128.64
642.345	106.8
642.755	196.61
643.164	220.88
643.573	155.34
643.983	223.3
644.392	182.04
644.801	145.63
645.211	177.19
645.62	203.89
646.029	206.31
646.438	167.48
646.847	82.53
647.256	177.19
647.665	240.29
648.074	150.49
648.483	99.52
648.892	177.19
649.3	218.45
649.709	133.5
650.118	114.08
650.526	148.06
650.935	167.48
651.343	225.73
651.752	247.58
652.16	230.59
652.568	216.02
652.977	165.05
653.385	216.02
653.793	101.94
654.201	143.21
654.609	208.74
655.017	128.64
655.425	148.06
655.833	196.61
656.241	160.2
656.649	194.18
657.057	194.18
657.464	186.9
657.872	140.78
658.28	145.63
658.687	128.64
659.095	114.08
659.502	123.79
659.91	177.19
660.317	191.75
660.724	165.05
661.132	169.91
661.539	182.04
661.946	169.91
662.353	138.35
662.76	82.53
663.167	157.77
663.574	194.18
663.981	165.05
664.388	186.9
664.795	196.61
665.202	184.47
665.608	106.8
666.015	128.64
666.422	206.31
666.828	179.61
667.235	169.91
667.641	138.35
668.047	135.92
668.454	213.6
668.86	145.63
669.266	174.76
669.673	208.74
670.079	186.9
670.485	230.59
670.891	148.06
671.297	189.32
671.703	118.93
672.109	179.61
672.515	169.91
672.92	194.18
673.326	167.48
673.732	172.33
674.138	114.08
674.543	203.89
674.949	213.6
675.354	143.21
675.76	121.36
676.165	182.04
676.57	228.16
676.976	152.91
677.381	138.35
677.786	148.06
678.191	213.6
678.596	152.91
679.001	143.21
679.406	160.2
679.811	177.19
680.216	150.49
680.621	189.32
681.026	252.43
681.43	143.21
681.835	118.93
682.24	116.51
682.644	152.91
683.049	213.6
683.453	140.78
683.858	97.09
684.262	160.2
684.667	135.92
685.071	167.48
685.475	203.89
685.879	186.9
686.283	211.17
686.687	157.77
687.091	148.06
687.495	196.61
687.899	174.76
688.303	191.75
688.707	106.8
689.111	116.51
689.514	106.8
689.918	213.6
690.322	143.21
690.725	160.2
691.129	150.49
691.532	191.75
691.936	169.91
692.339	165.05
692.742	218.45
693.146	143.21
693.549	160.2
693.952	184.47
694.355	189.32
694.758	165.05
695.161	121.36
695.564	196.61
695.967	201.46
696.37	77.67
696.773	208.74
697.175	237.87
697.578	138.35
697.981	220.88
698.383	201.46
698.786	174.76
699.188	184.47
699.591	191.75
699.993	169.91
700.395	186.9
700.798	162.62
701.2	216.02
701.602	167.48
702.004	216.02
702.406	199.03
702.808	203.89
703.21	237.87
703.612	208.74
704.014	184.47
704.416	191.75
704.818	201.46
705.219	242.72
705.621	223.3
706.023	216.02
706.424	237.87
706.826	245.15
707.227	228.16
707.629	165.05
708.03	225.73
708.431	128.64
708.832	208.74
709.234	220.88
709.635	264.57
710.036	257.29
710.437	250
710.838	199.03
711.239	109.23
711.64	233.01
712.041	216.02
712.441	220.88
712.842	269.42
713.243	322.82
713.643	269.42
714.044	351.95
714.445	269.42
714.845	213.6
715.246	233.01
715.646	327.67
716.046	286.41
716.447	303.4
716.847	320.39
717.247	351.95
717.647	327.67
718.047	349.52
718.447	342.24
718.847	330.1
719.247	359.23
719.647	337.38
720.047	415.05
720.446	400.49
720.846	303.4
721.246	361.66
721.645	347.09
722.045	398.06
722.444	422.34
722.844	473.31
723.243	419.91
723.643	441.75
724.042	463.6
724.441	422.34
724.84	446.61
725.24	466.03
725.639	589.82
726.038	536.42
726.437	487.87
726.836	453.89
727.234	541.27
727.633	577.68
728.032	536.42
728.431	594.67
728.83	633.5
729.228	655.35
729.627	657.78
730.025	730.59
730.424	783.99
730.822	783.99
731.22	910.21
731.619	832.54
732.017	915.06
732.415	978.17
732.813	1067.98
733.212	1228.17
733.61	1237.88
734.008	1330.12
734.406	1383.52
734.803	1351.96
735.201	1398.08
735.599	1599.54
735.997	1888.38
736.395	1958.77
736.792	2160.23
737.19	1922.36
737.587	1944.2
737.985	2060.71
738.382	2412.66
738.78	2682.08
739.177	2774.32
739.574	2745.19
739.971	2672.37
740.369	2662.66
740.766	3094.71
741.163	3538.89
741.56	3895.69
741.957	3568.02
742.354	3349.57
742.751	3325.29
743.147	3650.54
743.544	4332.59
743.941	4713.67
744.338	4730.66
744.734	4407.84
745.131	4373.85
745.527	4949.11
745.924	5818.05
746.32	6393.3
746.716	6609.33
747.113	6053.49
747.509	5997.67
747.905	6468.55
748.301	7383.61
748.697	8060.81
749.093	8395.76
749.489	7888.47
749.885	7677.3
750.281	8303.53
750.677	9604.52
751.073	10808.42
751.468	10784.15
751.864	10233.17
752.26	9738.02
752.655	10373.95
753.051	12017.18
753.446	13429.82
753.842	13289.04
754.237	12526.89
754.632	12102.13
755.028	13036.61
755.423	14415.27
755.818	15500.24
756.213	15349.75
756.608	14179.83
757.003	13718.66
757.398	14412.85
757.793	16068.21
758.188	16830.36
758.583	16517.25
758.977	14915.28
759.372	15097.32
759.767	17250.27
760.161	19750.31
760.556	21218.78
760.95	20301.29
761.345	19306.13
761.739	19910.5
762.133	22478.51
762.527	25036.8
762.922	25250.39
763.316	24148.43
763.71	23095.02
764.104	24510.09
764.498	26947.02
764.892	29352.4
765.286	27629.07
765.68	26235.85
766.073	26388.76
766.467	28898.51
766.861	31784.47
767.255	32063.61
767.648	30845.14
768.042	29711.63
768.435	31019.9
768.829	33556.35
769.222	35646.19
769.615	34937.44
770.008	32328.17
770.402	32080.6
770.795	34913.16
771.188	37770
771.581	36510.28
771.974	34085.48
772.367	32316.04
772.76	33274.79
773.153	35185.01
773.545	36825.82
773.938	35922.89
774.331	33274.79
774.724	33080.61
775.116	37260.29
775.509	41357.44
775.901	41524.92
776.294	39505.47
776.686	38653.51
777.078	41175.4
777.471	44677.88
777.863	46636.65
778.255	45182.74
778.647	44151.17
779.039	44529.82
779.431	46974.03
779.823	49027.46
780.215	47668.22
780.607	44961.86
780.999	45716.73
781.39	49440.09
781.782	51658.57
782.174	49833.3
782.565	47597.83
782.957	47420.64
783.348	49947.38
783.74	51792.07
784.131	51821.19
784.522	49692.52
784.914	46670.63
785.305	48170.65
785.696	49966.8
786.087	51107.59
786.478	46964.32
786.869	43869.61
787.26	44534.67
787.651	46284.7
788.042	46643.93
788.433	43949.71
788.823	41056.46
789.214	40369.56
789.605	41279.77
789.995	41932.69
790.386	40840.44
790.776	38148.65
791.167	37476.31
791.557	40954.52
791.948	42845.33
792.338	42546.78
792.728	40257.91
793.118	40299.17
793.508	42170.56
793.898	43876.9
794.288	43185.14
794.678	40413.25
795.068	40602.57
795.458	42066.19
795.848	44245.83
796.238	43296.79
796.627	40338.01
797.017	39177.79
797.406	41629.29
797.796	43740.97
798.185	43374.46
798.575	41294.33
798.964	39638.97
799.354	42187.55
799.743	44520.11
800.132	43685.15
800.521	41680.26
800.91	40549.17
801.299	41437.54
801.688	43631.75
802.077	42066.19
802.466	39874.41
802.855	38233.6
803.244	39160.8
803.633	41024.91
804.021	39476.34
804.41	36568.53
804.799	36138.91
805.187	36575.81
805.576	37791.85
805.964	35655.89
806.352	32583.03
806.741	31917.97
807.129	32131.57
807.517	34408.3
807.905	33447.12
808.293	31172.81
808.681	30731.06
809.069	32405.84
809.457	34636.46
809.845	33905.87
810.233	31617
810.621	32044.19
811.009	33653.44
811.396	34648.6
811.784	34051.5
812.171	31551.46
812.559	31694.67
812.946	32245.65
813.334	33167.99
813.721	31129.12
814.108	29041.71
814.496	29235.89
814.883	30146.1
815.27	31660.69
815.657	29871.82
816.044	28425.2
816.431	28578.11
816.818	30068.43
817.205	30250.47
817.592	29485.9
817.979	27065.95
818.365	27767.42
818.752	28146.07
819.139	26808.67
819.525	25357.19
819.912	24357.17
820.298	24320.77
820.685	25048.93
821.071	24022.22
821.457	22150.83
821.843	20883.82
822.23	21546.45
822.616	21311.01
823.002	19844.97
823.388	18017.27
823.774	17582.8
824.16	17815.81
824.546	17667.75
824.931	17005.12
825.317	16136.17
825.703	16092.48
826.089	16359.48
826.474	16444.43
826.86	15446.84
827.245	15000.23
827.631	15099.75
828.016	15983.26
828.401	15410.43
828.787	14327.89
829.172	13526.91
829.557	13590.02
829.942	13449.24
830.327	13536.62
830.712	12716.22
831.097	11614.26
831.482	12577.87
831.867	12551.17
832.252	12034.17
832.636	11121.53
833.021	10951.63
833.406	11313.28
833.79	11454.06
834.175	10932.21
834.559	10184.62
834.944	10068.12
835.328	10170.06
835.713	9881.22
836.097	9126.36
836.481	8706.45
836.865	8912.76
837.249	8621.49
837.633	8432.17
838.017	7854.49
838.401	7296.23
838.785	7230.69
839.169	7259.82
839.553	7041.37
839.937	6403.01
840.32	6075.34
840.704	5987.96
841.087	6172.43
841.471	5810.77
841.854	5252.51
842.238	5070.47
842.621	5114.16
843.004	5150.57
843.388	4944.25
843.771	4674.83
844.154	4716.09
844.537	4973.38
844.92	4735.51
845.303	4444.24
845.686	4099.58
846.069	4286.47
846.452	4424.83
846.834	4393.27
847.217	4038.9
847.6	3696.66
847.982	3890.84
848.365	4021.91
848.748	3713.65
849.13	3415.1
849.512	3286.46
849.895	3419.96
850.277	3473.36
850.659	3220.92
851.041	2907.81
851.423	3068.01
851.806	3269.47
852.188	3174.81
852.57	2873.83
852.951	2672.37
853.333	2747.62
853.715	2835
854.097	2691.79
854.479	2502.47
854.86	2475.77
855.242	2422.37
855.623	2347.12
856.005	2220.91
856.386	2080.13
856.768	1997.6
857.149	2070.42
857.53	2065.57
857.911	1844.69
858.292	1682.07
858.674	1713.62
859.055	1784.01
859.436	1652.94
859.817	1504.88
860.197	1390.8
860.578	1609.25
860.959	1429.63
861.34	1371.38
861.72	1317.98
862.101	1300.99
862.482	1291.28
862.862	1194.19
863.243	1155.36
863.623	1092.25
864.003	1014.58
864.384	1140.79
864.764	1165.07
865.144	987.88
865.524	983.02
865.904	973.32
866.284	905.35
866.664	898.07
867.044	820.4
867.424	910.21
867.804	842.25
868.183	919.92
868.563	856.81
868.943	745.16
869.322	820.4
869.702	771.86
870.081	769.43
870.461	703.89
870.84	669.91
871.22	694.19
871.599	660.2
871.978	580.11
872.357	645.64
872.736	548.55
873.115	502.43
873.494	575.25
873.873	487.87
874.252	415.05
874.631	468.45
875.01	458.75
875.388	473.31
875.767	553.41
876.146	429.62
876.524	383.5
876.903	424.76
877.281	490.3
877.66	320.39
878.038	349.52
878.416	296.12
878.794	303.4
879.173	315.54
879.551	262.14
879.929	322.82
880.307	305.83
880.685	315.54
881.063	334.96
881.441	339.81
881.818	296.12
882.196	276.7
882.574	281.56
882.951	269.42
883.329	288.84
883.707	266.99
884.084	344.67
884.461	325.25
884.839	186.9
885.216	203.89
885.593	220.88
885.971	242.72
886.348	271.85
886.725	201.46
887.102	250
887.479	235.44
887.856	266.99
888.233	254.86
888.609	206.31
888.986	274.28
889.363	206.31
889.74	218.45
890.116	196.61
890.493	252.43
890.869	194.18
891.246	220.88
891.622	182.04
891.998	169.91
892.375	179.61
892.751	121.36
893.127	182.04
893.503	293.69
893.879	114.08
894.255	262.14
894.631	220.88
895.007	118.93
895.383	189.32
895.759	148.06
896.134	189.32
896.51	177.19
896.886	135.92
897.261	213.6
897.637	128.64
898.012	128.64
898.388	174.76
898.763	155.34
899.138	186.9
899.514	223.3
899.889	167.48
900.264	152.91
900.639	223.3
901.014	211.17
901.389	169.91
901.764	143.21
902.139	162.62
902.513	196.61
902.888	155.34
903.263	140.78
903.638	150.49
904.012	162.62
904.387	128.64
904.761	140.78
905.136	160.2
905.51	148.06
905.884	155.34
906.259	123.79
906.633	155.34
907.007	138.35
907.381	99.52
907.755	167.48
908.129	99.52
908.503	121.36
908.877	104.37
909.251	167.48
909.624	235.44
909.998	152.91
910.372	182.04
910.745	179.61
911.119	150.49
911.492	143.21
911.866	218.45
912.239	194.18
912.612	165.05
912.986	201.46
913.359	203.89
913.732	206.31
914.105	140.78
914.478	172.33
914.851	133.5
915.224	177.19
915.597	135.92
915.97	165.05
916.343	133.5
916.715	75.24
917.088	138.35
917.461	194.18
917.833	186.9
918.206	148.06
918.578	152.91
918.951	203.89
919.323	157.77
919.695	106.8
920.067	169.91
920.44	75.24
920.812	126.22
921.184	160.2
921.556	167.48
921.928	140.78
922.3	169.91
922.672	145.63
923.043	179.61
923.415	143.21
923.787	140.78
924.158	143.21
924.53	121.36
924.901	160.2
925.273	186.9
925.644	160.2
926.016	109.23
926.387	140.78
926.758	203.89
927.129	218.45
927.5	145.63
927.872	118.93
928.243	160.2
928.613	213.6
928.984	111.65
929.355	143.21
929.726	97.09
930.097	186.9
930.467	157.77
930.838	216.02
931.209	206.31
931.579	194.18
931.95	167.48
932.32	82.53
932.69	203.89
933.061	106.8
933.431	128.64
933.801	179.61
934.171	82.53
934.541	135.92
934.911	97.09
935.281	191.75
935.651	155.34
936.021	160.2
936.391	77.67
936.761	169.91
937.13	230.59
937.5	172.33
937.87	155.34
938.239	216.02
938.609	165.05
938.978	148.06
939.347	169.91
939.717	118.93
940.086	101.94
940.455	174.76
940.824	128.64
941.193	196.61
941.562	123.79
941.931	133.5
942.3	191.75
942.669	172.33
943.038	138.35
943.407	123.79
943.775	169.91
944.144	155.34
944.513	104.37
944.881	157.77
945.25	206.31
945.618	121.36
945.986	177.19
946.355	160.2
946.723	116.51
947.091	143.21
947.459	101.94
947.827	135.92
948.195	177.19
948.563	167.48
948.931	67.96
949.299	94.66
949.667	94.66
950.035	167.48
950.402	114.08
950.77	116.51
951.138	162.62
951.505	131.07
951.873	237.87
952.24	131.07
952.607	167.48
952.975	121.36
953.342	143.21
953.709	94.66
954.076	89.81
954.443	106.8
954.81	162.62
955.177	225.73
955.544	150.49
955.911	196.61
956.278	123.79
956.645	167.48
957.012	213.6
957.378	169.91
957.745	123.79
958.111	182.04
958.478	152.91
958.844	133.5
959.211	165.05
959.577	123.79
959.943	118.93
960.309	145.63
960.675	148.06
961.042	169.91
961.408	104.37
961.774	14.56
962.139	177.19
962.505	196.61
962.871	152.91
963.237	199.03
963.603	128.64
963.968	116.51
964.334	184.47
964.699	148.06
965.065	196.61
965.43	131.07
965.796	133.5
966.161	109.23
966.526	97.09
966.891	157.77
967.256	155.34
967.622	203.89
967.987	104.37
968.352	254.86
968.716	186.9
969.081	128.64
969.446	242.72
969.811	189.32
970.176	114.08
970.54	123.79
970.905	179.61
971.269	169.91
971.634	184.47
971.998	218.45
972.363	143.21
972.727	123.79
973.091	75.24
973.455	135.92
973.819	128.64
974.183	169.91
974.547	165.05
974.911	189.32
975.275	184.47
975.639	148.06
976.003	203.89
976.367	101.94
976.73	128.64
977.094	97.09
977.458	140.78
977.821	145.63
978.185	116.51
978.548	184.47
978.911	77.67
979.275	143.21
979.638	201.46
980.001	157.77
980.364	152.91
980.727	189.32
981.09	131.07
981.453	206.31
981.816	97.09
982.179	228.16
982.542	109.23
982.905	196.61
983.267	128.64
983.63	148.06
983.992	162.62
984.355	101.94
984.717	131.07
985.08	114.08
985.442	169.91
985.804	150.49
986.167	145.63
986.529	133.5
986.891	148.06
987.253	65.53
987.615	177.19
987.977	114.08
988.339	206.31
988.701	191.75
989.062	109.23
989.424	65.53
989.786	143.21
990.147	77.67
990.509	155.34
990.87	114.08
991.232	220.88
991.593	165.05
991.955	145.63
992.316	169.91
992.677	94.66
993.038	75.24
993.399	135.92
993.76	114.08
994.121	131.07
994.482	174.76
994.843	106.8
995.204	216.02
995.565	199.03
995.926	223.3
996.286	131.07
996.647	99.52
997.007	160.2
997.368	63.11
997.728	201.46
998.089	143.21
998.449	116.51
998.809	148.06
999.169	133.5
999.53	150.49
999.89	177.19
1000.25	114.08
1000.61	89.81
1000.97	182.04
1001.329	152.91
1001.689	169.91
1002.049	111.65
1002.409	135.92
1002.768	80.1
1003.128	191.75
1003.487	186.9
1003.847	89.81
1004.206	138.35
1004.566	126.22
1004.925	152.91
1005.284	174.76
1005.643	109.23
1006.003	186.9
1006.362	160.2
1006.721	133.5
1007.08	189.32
1007.438	114.08
1007.797	194.18
1008.156	82.53
1008.515	135.92
1008.874	116.51
1009.232	70.39
1009.591	99.52
1009.949	143.21
1010.308	225.73
1010.666	189.32
1011.024	128.64
1011.383	157.77
1011.741	109.23
1012.099	111.65
1012.457	148.06
1012.815	148.06
1013.173	118.93
1013.531	104.37
1013.889	189.32
1014.247	160.2
1014.605	155.34
1014.962	186.9
1015.32	114.08
1015.678	123.79
1016.035	111.65
1016.393	165.05
1016.75	169.91
1017.107	106.8
1017.465	182.04
1017.822	106.8
1018.179	126.22
1018.536	169.91
1018.894	126.22
1019.251	133.5
1019.608	97.09
1019.964	201.46
1020.321	252.43
1020.678	196.61
1021.035	179.61
1021.392	143.21
1021.748	155.34
1022.105	126.22
1022.461	162.62
1022.818	157.77
1023.174	145.63
1023.531	199.03
1023.887	128.64
1024.243	162.62
1024.599	114.08
1024.955	75.24
1025.311	101.94
1025.667	165.05
1026.023	162.62
1026.379	116.51
1026.735	72.82
1027.091	182.04
1027.447	208.74
