189.514	45.97
189.973	45.97
190.431	45.97
190.889	-0.15
191.348	-99.67
191.806	-22
192.264	16.84
192.722	14.41
193.18	-34.13
193.638	-31.71
194.096	-38.99
194.554	16.84
195.012	-22
195.47	-0.15
195.928	-94.81
196.385	92.08
196.843	-22
197.301	53.25
197.758	-5.01
198.216	31.4
198.674	-22
199.131	45.97
199.589	75.09
200.046	-12.29
200.503	36.26
200.961	70.24
201.418	55.67
201.875	72.66
202.332	96.94
202.79	55.67
203.247	96.94
203.704	123.64
204.161	130.92
204.618	138.2
205.075	184.32
205.532	167.33
205.989	186.74
206.445	109.07
206.902	75.09
207.359	116.35
207.816	179.46
208.272	75.09
208.729	135.77
209.185	174.61
209.642	92.08
210.098	101.79
210.555	164.9
211.011	164.9
211.467	138.2
211.924	143.05
212.38	150.34
212.836	162.47
213.292	189.17
213.748	116.35
214.204	113.93
214.66	160.04
215.116	145.48
215.572	133.35
216.028	113.93
216.484	99.36
216.94	140.63
217.396	123.64
217.851	128.49
218.307	152.76
218.763	172.18
219.218	109.07
219.674	133.35
220.129	104.22
220.585	138.2
221.04	106.65
221.496	79.95
221.951	118.78
222.406	133.35
222.861	87.23
223.317	145.48
223.772	150.34
224.227	130.92
224.682	135.77
225.137	172.18
225.592	82.37
226.047	181.89
226.502	84.8
226.957	133.35
227.411	121.21
227.866	94.51
228.321	145.48
228.776	140.63
229.23	128.49
229.685	62.96
230.139	152.76
230.594	174.61
231.048	184.32
231.503	92.08
231.957	128.49
232.411	147.91
232.865	147.91
233.32	104.22
233.774	198.88
234.228	106.65
234.682	106.65
235.136	150.34
235.59	169.75
236.044	191.6
236.498	145.48
236.952	87.23
237.406	138.2
237.86	162.47
238.313	167.33
238.767	150.34
239.221	157.62
239.674	143.05
240.128	147.91
240.581	140.63
241.035	130.92
241.488	106.65
241.942	174.61
242.395	167.33
242.848	150.34
243.301	133.35
243.755	152.76
244.208	179.46
244.661	94.51
245.114	121.21
245.567	101.79
246.02	87.23
246.473	198.88
246.926	143.05
247.379	147.91
247.832	150.34
248.284	135.77
248.737	99.36
249.19	157.62
249.642	140.63
250.095	113.93
250.547	128.49
251	99.36
251.452	72.66
251.905	172.18
252.357	128.49
252.81	172.18
253.262	126.06
253.714	111.5
254.166	77.52
254.618	174.61
255.07	140.63
255.523	172.18
255.975	172.18
256.427	140.63
256.878	179.46
257.33	89.66
257.782	123.64
258.234	84.8
258.686	113.93
259.137	121.21
259.589	179.46
260.041	101.79
260.492	213.44
260.944	140.63
261.395	164.9
261.847	155.19
262.298	194.03
262.749	126.06
263.201	101.79
263.652	152.76
264.103	55.67
264.554	104.22
265.005	133.35
265.457	116.35
265.908	82.37
266.359	177.04
266.809	198.88
267.26	118.78
267.711	106.65
268.162	167.33
268.613	75.09
269.064	169.75
269.514	128.49
269.965	82.37
270.415	157.62
270.866	130.92
271.316	111.5
271.767	104.22
272.217	145.48
272.668	169.75
273.118	181.89
273.568	198.88
274.019	162.47
274.469	128.49
274.919	160.04
275.369	50.82
275.819	89.66
276.269	157.62
276.719	162.47
277.169	140.63
277.619	133.35
278.069	186.74
278.518	150.34
278.968	116.35
279.418	70.24
279.867	133.35
280.317	94.51
280.767	118.78
281.216	189.17
281.666	150.34
282.115	164.9
282.564	53.25
283.014	77.52
283.463	164.9
283.912	106.65
284.361	172.18
284.811	140.63
285.26	201.31
285.709	77.52
286.158	155.19
286.607	138.2
287.056	113.93
287.505	96.94
287.953	138.2
288.402	213.44
288.851	53.25
289.3	113.93
289.748	147.91
290.197	172.18
290.646	150.34
291.094	198.88
291.543	116.35
291.991	121.21
292.439	172.18
292.888	77.52
293.336	116.35
293.784	121.21
294.233	194.03
294.681	201.31
295.129	145.48
295.577	147.91
296.025	174.61
296.473	128.49
296.921	167.33
297.369	133.35
297.817	228.01
298.264	126.06
298.712	138.2
299.16	177.04
299.608	179.46
300.055	143.05
300.503	155.19
300.95	152.76
301.398	111.5
301.845	87.23
302.293	177.04
302.74	133.35
303.187	113.93
303.635	152.76
304.082	109.07
304.529	106.65
304.976	179.46
305.423	179.46
305.87	43.54
306.317	118.78
306.764	126.06
307.211	111.5
307.658	174.61
308.105	167.33
308.552	70.24
308.998	130.92
309.445	130.92
309.892	203.73
310.338	101.79
310.785	106.65
311.231	145.48
311.678	196.45
312.124	101.79
312.571	160.04
313.017	113.93
313.463	87.23
313.909	126.06
314.356	169.75
314.802	133.35
315.248	155.19
315.694	174.61
316.14	87.23
316.586	181.89
317.032	50.82
317.478	121.21
317.923	128.49
318.369	133.35
318.815	121.21
319.261	160.04
319.706	150.34
320.152	147.91
320.597	109.07
321.043	128.49
321.488	99.36
321.934	147.91
322.379	135.77
322.824	189.17
323.27	94.51
323.715	140.63
324.16	94.51
324.605	147.91
325.05	145.48
325.495	145.48
325.94	191.6
326.385	150.34
326.83	96.94
327.275	203.73
327.72	164.9
328.165	150.34
328.61	109.07
329.054	164.9
329.499	106.65
329.943	75.09
330.388	126.06
330.832	126.06
331.277	150.34
331.721	220.73
332.166	133.35
332.61	118.78
333.054	92.08
333.499	152.76
333.943	169.75
334.387	109.07
334.831	126.06
335.275	94.51
335.719	140.63
336.163	162.47
336.607	152.76
337.051	147.91
337.495	121.21
337.938	99.36
338.382	162.47
338.826	133.35
339.269	157.62
339.713	50.82
340.157	174.61
340.6	155.19
341.044	133.35
341.487	157.62
341.93	155.19
342.374	174.61
342.817	147.91
343.26	84.8
343.703	152.76
344.146	113.93
344.59	174.61
345.033	160.04
345.476	145.48
345.919	118.78
346.361	106.65
346.804	70.24
347.247	213.44
347.69	145.48
348.133	160.04
348.575	191.6
349.018	152.76
349.461	225.58
349.903	157.62
350.346	220.73
350.788	184.32
351.23	50.82
351.673	152.76
352.115	143.05
352.557	135.77
353	87.23
353.442	162.47
353.884	211.02
354.326	94.51
354.768	189.17
355.21	94.51
355.652	147.91
356.094	172.18
356.536	138.2
356.978	126.06
357.419	140.63
357.861	160.04
358.303	145.48
358.744	147.91
359.186	147.91
359.627	177.04
360.069	169.75
360.51	157.62
360.952	157.62
361.393	172.18
361.834	106.65
362.276	177.04
362.717	130.92
363.158	133.35
363.599	101.79
364.04	130.92
364.481	135.77
364.922	167.33
365.363	147.91
365.804	121.21
366.245	177.04
366.686	138.2
367.126	133.35
367.567	135.77
368.008	138.2
368.448	252.28
368.889	157.62
369.33	123.64
369.77	118.78
370.21	118.78
370.651	169.75
371.091	118.78
371.531	152.76
371.972	133.35
372.412	121.21
372.852	152.76
373.292	87.23
373.732	162.47
374.172	116.35
374.612	130.92
375.052	203.73
375.492	111.5
375.932	99.36
376.372	157.62
376.811	225.58
377.251	111.5
377.691	147.91
378.13	138.2
378.57	194.03
379.009	157.62
379.449	155.19
379.888	181.89
380.328	157.62
380.767	109.07
381.206	155.19
381.645	96.94
382.085	96.94
382.524	138.2
382.963	211.02
383.402	150.34
383.841	113.93
384.28	111.5
384.719	101.79
385.158	130.92
385.596	92.08
386.035	155.19
386.474	126.06
386.913	118.78
387.351	203.73
387.79	181.89
388.228	116.35
388.667	184.32
389.105	162.47
389.544	160.04
389.982	201.31
390.42	140.63
390.859	189.17
391.297	79.95
391.735	150.34
392.173	121.21
392.611	167.33
393.049	126.06
393.487	113.93
393.925	215.87
394.363	145.48
394.801	157.62
395.239	140.63
395.676	116.35
396.114	75.09
396.552	152.76
396.989	113.93
397.427	87.23
397.864	118.78
398.302	89.66
398.739	89.66
399.177	138.2
399.614	140.63
400.051	152.76
400.488	118.78
400.926	211.02
401.363	152.76
401.8	164.9
402.237	104.22
402.674	130.92
403.111	140.63
403.548	143.05
403.985	174.61
404.421	75.09
404.858	126.06
405.295	138.2
405.732	152.76
406.168	143.05
406.605	189.17
407.041	145.48
407.478	53.25
407.914	140.63
408.351	143.05
408.787	215.87
409.223	150.34
409.66	191.6
410.096	145.48
410.532	184.32
410.968	101.79
411.404	130.92
411.84	106.65
412.276	145.48
412.712	99.36
413.148	150.34
413.584	150.34
414.02	177.04
414.455	126.06
414.891	130.92
415.327	92.08
415.762	138.2
416.198	194.03
416.633	143.05
417.069	60.53
417.504	194.03
417.94	138.2
418.375	130.92
418.81	143.05
419.245	111.5
419.681	133.35
420.116	104.22
420.551	109.07
420.986	135.77
421.421	109.07
421.856	116.35
422.291	145.48
422.726	169.75
423.16	135.77
423.595	172.18
424.03	133.35
424.464	101.79
424.899	126.06
425.334	121.21
425.768	133.35
426.203	104.22
426.637	196.45
427.071	174.61
427.506	177.04
427.94	116.35
428.374	79.95
428.809	169.75
429.243	155.19
429.677	128.49
430.111	174.61
430.545	87.23
430.979	140.63
431.413	191.6
431.847	147.91
432.28	177.04
432.714	113.93
433.148	111.5
433.582	121.21
434.015	121.21
434.449	143.05
434.882	130.92
435.316	208.59
435.749	138.2
436.183	172.18
436.616	184.32
437.049	169.75
437.483	228.01
437.916	111.5
438.349	164.9
438.782	174.61
439.215	160.04
439.648	203.73
440.081	186.74
440.514	237.72
440.947	191.6
441.38	126.06
441.813	133.35
442.245	167.33
442.678	181.89
443.111	147.91
443.543	198.88
443.976	206.16
444.408	172.18
444.841	203.73
445.273	116.35
445.705	150.34
446.138	179.46
446.57	184.32
447.002	147.91
447.434	133.35
447.867	167.33
448.299	189.17
448.731	191.6
449.163	198.88
449.595	198.88
450.026	208.59
450.458	157.62
450.89	179.46
451.322	232.86
451.754	228.01
452.185	286.26
452.617	220.73
453.048	213.44
453.48	211.02
453.911	177.04
454.343	181.89
454.774	203.73
455.205	169.75
455.637	232.86
456.068	198.88
456.499	172.18
456.93	184.32
457.361	274.12
457.792	191.6
458.223	203.73
458.654	266.84
459.085	242.57
459.516	213.44
459.947	249.85
460.378	278.98
460.808	334.8
461.239	271.7
461.669	201.31
462.1	145.48
462.531	223.15
462.961	145.48
463.391	198.88
463.822	162.47
464.252	225.58
464.682	177.04
465.113	242.57
465.543	198.88
465.973	162.47
466.403	220.73
466.833	215.87
467.263	164.9
467.693	179.46
468.123	155.19
468.553	201.31
468.983	196.45
469.412	198.88
469.842	215.87
470.272	194.03
470.701	189.17
471.131	215.87
471.56	143.05
471.99	164.9
472.419	194.03
472.849	174.61
473.278	155.19
473.707	198.88
474.136	218.3
474.566	228.01
474.995	172.18
475.424	152.76
475.853	179.46
476.282	145.48
476.711	138.2
477.14	167.33
477.569	235.29
477.997	213.44
478.426	223.15
478.855	194.03
479.283	242.57
479.712	247.42
480.141	206.16
480.569	184.32
480.998	147.91
481.426	157.62
481.854	138.2
482.283	184.32
482.711	162.47
483.139	155.19
483.567	143.05
483.995	235.29
484.424	186.74
484.852	208.59
485.28	135.77
485.708	206.16
486.135	169.75
486.563	164.9
486.991	150.34
487.419	147.91
487.847	220.73
488.274	179.46
488.702	109.07
489.129	157.62
489.557	232.86
489.984	172.18
490.412	84.8
490.839	121.21
491.266	213.44
491.694	138.2
492.121	201.31
492.548	174.61
492.975	174.61
493.402	111.5
493.829	145.48
494.256	194.03
494.683	152.76
495.11	162.47
495.537	172.18
495.964	169.75
496.39	145.48
496.817	172.18
497.244	135.77
497.67	55.67
498.097	181.89
498.523	96.94
498.95	121.21
499.376	160.04
499.803	138.2
500.229	111.5
500.655	184.32
501.081	126.06
501.508	101.79
501.934	113.93
502.36	167.33
502.786	172.18
503.212	55.67
503.638	155.19
504.064	164.9
504.489	155.19
504.915	177.04
505.341	155.19
505.767	169.75
506.192	143.05
506.618	194.03
507.043	155.19
507.469	162.47
507.894	177.04
508.32	157.62
508.745	164.9
509.17	133.35
509.596	138.2
510.021	106.65
510.446	128.49
510.871	181.89
511.296	130.92
511.721	186.74
512.146	152.76
512.571	198.88
512.996	215.87
513.421	162.47
513.845	116.35
514.27	128.49
514.695	99.36
515.119	138.2
515.544	133.35
515.969	87.23
516.393	230.43
516.817	130.92
517.242	203.73
517.666	177.04
518.09	174.61
518.515	174.61
518.939	157.62
519.363	373.64
519.787	191.6
520.211	203.73
520.635	211.02
521.059	218.3
521.483	145.48
521.907	201.31
522.331	145.48
522.754	104.22
523.178	181.89
523.602	145.48
524.025	106.65
524.449	201.31
524.872	167.33
525.296	179.46
525.719	133.35
526.143	293.54
526.566	123.64
526.989	164.9
527.412	121.21
527.836	167.33
528.259	92.08
528.682	189.17
529.105	157.62
529.528	167.33
529.951	152.76
530.374	116.35
530.796	167.33
531.219	143.05
531.642	145.48
532.065	138.2
532.487	220.73
532.91	135.77
533.332	143.05
533.755	174.61
534.177	232.86
534.6	160.04
535.022	172.18
535.444	145.48
535.867	203.73
536.289	155.19
536.711	130.92
537.133	96.94
537.555	191.6
537.977	174.61
538.399	181.89
538.821	133.35
539.243	138.2
539.665	155.19
540.086	101.79
540.508	206.16
540.93	152.76
541.351	113.93
541.773	160.04
542.195	160.04
542.616	169.75
543.037	162.47
543.459	181.89
543.88	189.17
544.301	201.31
544.723	189.17
545.144	215.87
545.565	203.73
545.986	184.32
546.407	145.48
546.828	186.74
547.249	208.59
547.67	145.48
548.091	160.04
548.512	172.18
548.932	228.01
549.353	201.31
549.774	116.35
550.194	126.06
550.615	152.76
551.035	157.62
551.456	150.34
551.876	167.33
552.296	201.31
552.717	223.15
553.137	162.47
553.557	152.76
553.977	196.45
554.397	213.44
554.817	101.79
555.237	196.45
555.657	138.2
556.077	118.78
556.497	211.02
556.917	96.94
557.337	162.47
557.756	121.21
558.176	179.46
558.596	206.16
559.015	121.21
559.435	177.04
559.854	162.47
560.274	167.33
560.693	152.76
561.112	184.32
561.532	157.62
561.951	181.89
562.37	186.74
562.789	215.87
563.208	189.17
563.627	143.05
564.046	123.64
564.465	198.88
564.884	116.35
565.303	172.18
565.722	138.2
566.14	157.62
566.559	145.48
566.978	126.06
567.396	203.73
567.815	150.34
568.233	145.48
568.652	177.04
569.07	189.17
569.489	116.35
569.907	177.04
570.325	101.79
570.743	133.35
571.161	179.46
571.58	184.32
571.998	218.3
572.416	211.02
572.833	220.73
573.251	138.2
573.669	118.78
574.087	133.35
574.505	101.79
574.922	155.19
575.34	157.62
575.758	152.76
576.175	201.31
576.593	181.89
577.01	82.37
577.428	155.19
577.845	1436.76
578.262	310.53
578.68	152.76
579.097	169.75
579.514	143.05
579.931	177.04
580.348	135.77
580.765	174.61
581.182	184.32
581.599	160.04
582.016	133.35
582.433	121.21
582.849	135.77
583.266	92.08
583.683	155.19
584.099	160.04
584.516	99.36
584.933	240.14
585.349	118.78
585.765	191.6
586.182	186.74
586.598	135.77
587.014	92.08
587.431	162.47
587.847	191.6
588.263	208.59
588.679	198.88
589.095	150.34
589.511	130.92
589.927	242.57
590.343	155.19
590.759	104.22
591.174	143.05
591.59	106.65
592.006	194.03
592.421	130.92
592.837	152.76
593.252	140.63
593.668	167.33
594.083	135.77
594.499	118.78
594.914	128.49
595.329	82.37
595.745	147.91
596.16	169.75
596.575	211.02
596.99	206.16
597.405	184.32
597.82	189.17
598.235	138.2
598.65	179.46
599.065	111.5
599.479	203.73
599.894	58.1
600.309	177.04
600.724	123.64
601.138	167.33
601.553	169.75
601.967	113.93
602.382	167.33
602.796	179.46
603.21	118.78
603.625	128.49
604.039	143.05
604.453	196.45
604.867	208.59
605.281	172.18
605.695	174.61
606.109	160.04
606.523	94.51
606.937	111.5
607.351	164.9
607.765	208.59
608.178	201.31
608.592	123.64
609.006	194.03
609.419	201.31
609.833	89.66
610.246	172.18
610.66	128.49
611.073	140.63
611.487	179.46
611.9	147.91
612.313	150.34
612.726	201.31
613.139	179.46
613.553	203.73
613.966	118.78
614.379	198.88
614.792	162.47
615.204	201.31
615.617	225.58
616.03	133.35
616.443	130.92
616.856	155.19
617.268	196.45
617.681	145.48
618.093	140.63
618.506	249.85
618.918	198.88
619.331	138.2
619.743	126.06
620.155	203.73
620.568	155.19
620.98	160.04
621.392	162.47
621.804	191.6
622.216	130.92
622.628	113.93
623.04	96.94
623.452	189.17
623.864	140.63
624.276	94.51
624.687	121.21
625.099	96.94
625.511	123.64
625.922	41.11
626.334	126.06
626.745	177.04
627.157	94.51
627.568	133.35
627.979	162.47
628.391	167.33
628.802	128.49
629.213	140.63
629.624	186.74
630.035	89.66
630.446	174.61
630.857	174.61
631.268	111.5
631.679	138.2
632.09	150.34
632.501	130.92
632.912	189.17
633.322	109.07
633.733	167.33
634.144	152.76
634.554	177.04
634.965	177.04
635.375	177.04
635.785	177.04
636.196	96.94
636.606	118.78
637.016	189.17
637.427	106.65
637.837	150.34
638.247	164.9
638.657	155.19
639.067	111.5
639.477	189.17
639.887	99.36
640.297	113.93
640.706	111.5
641.116	111.5
641.526	184.32
641.935	77.52
642.345	82.37
642.755	87.23
643.164	181.89
643.573	128.49
643.983	121.21
644.392	174.61
644.801	84.8
645.211	113.93
645.62	232.86
646.029	157.62
646.438	109.07
646.847	206.16
647.256	155.19
647.665	232.86
648.074	123.64
648.483	147.91
648.892	203.73
649.3	157.62
649.709	150.34
650.118	174.61
650.526	126.06
650.935	143.05
651.343	189.17
651.752	116.35
652.16	87.23
652.568	109.07
652.977	62.96
653.385	147.91
653.793	92.08
654.201	87.23
654.609	82.37
655.017	147.91
655.425	164.9
655.833	184.32
656.241	177.04
656.649	167.33
657.057	143.05
657.464	145.48
657.872	140.63
658.28	152.76
658.687	140.63
659.095	121.21
659.502	118.78
659.91	118.78
660.317	179.46
660.724	118.78
661.132	211.02
661.539	189.17
661.946	123.64
662.353	232.86
662.76	177.04
663.167	152.76
663.574	99.36
663.981	211.02
664.388	172.18
664.795	92.08
665.202	113.93
665.608	96.94
666.015	228.01
666.422	172.18
666.828	101.79
667.235	113.93
667.641	196.45
668.047	157.62
668.454	160.04
668.86	225.58
669.266	169.75
669.673	96.94
670.079	99.36
670.485	133.35
670.891	162.47
671.297	169.75
671.703	169.75
672.109	109.07
672.515	157.62
672.92	135.77
673.326	87.23
673.732	99.36
674.138	167.33
674.543	150.34
674.949	116.35
675.354	133.35
675.76	162.47
676.165	179.46
676.57	87.23
676.976	140.63
677.381	111.5
677.786	147.91
678.191	186.74
678.596	143.05
679.001	174.61
679.406	155.19
679.811	72.66
680.216	152.76
680.621	121.21
681.026	133.35
681.43	172.18
681.835	143.05
682.24	140.63
682.644	198.88
683.049	177.04
683.453	106.65
683.858	111.5
684.262	172.18
684.667	126.06
685.071	96.94
685.475	123.64
685.879	128.49
686.283	164.9
686.687	135.77
687.091	186.74
687.495	167.33
687.899	152.76
688.303	164.9
688.707	145.48
689.111	92.08
689.514	172.18
689.918	138.2
690.322	135.77
690.725	116.35
691.129	140.63
691.532	145.48
691.936	150.34
692.339	169.75
692.742	118.78
693.146	152.76
693.549	147.91
693.952	220.73
694.355	189.17
694.758	155.19
695.161	84.8
695.564	184.32
695.967	266.84
696.37	160.04
696.773	104.22
697.175	92.08
697.578	172.18
697.981	177.04
698.383	191.6
698.786	164.9
699.188	174.61
699.591	130.92
699.993	135.77
700.395	152.76
700.798	152.76
701.2	147.91
701.602	179.46
702.004	228.01
702.406	147.91
702.808	130.92
703.21	177.04
703.612	169.75
704.014	186.74
704.416	181.89
704.818	177.04
705.219	230.43
705.621	201.31
706.023	215.87
706.424	235.29
706.826	274.12
707.227	247.42
707.629	189.17
708.03	218.3
708.431	160.04
708.832	232.86
709.234	186.74
709.635	264.42
710.036	245
710.437	194.03
710.838	215.87
711.239	245
711.64	109.07
712.041	266.84
712.441	213.44
712.842	235.29
713.243	237.72
713.643	213.44
714.044	266.84
714.445	220.73
714.845	254.71
715.246	235.29
715.646	220.73
716.046	218.3
716.447	264.42
716.847	254.71
717.247	342.09
717.647	257.13
718.047	308.11
718.447	320.24
718.847	278.98
719.247	249.85
719.647	344.51
720.047	325.1
720.446	223.15
720.846	395.49
721.246	380.92
721.645	337.23
722.045	390.63
722.444	393.06
722.844	473.16
723.243	378.49
723.643	405.19
724.042	468.3
724.441	422.18
724.84	407.62
725.24	344.51
725.639	397.91
726.038	461.02
726.437	383.35
726.836	395.49
727.234	461.02
727.633	448.88
728.032	448.88
728.431	473.16
728.83	567.82
729.228	553.25
729.627	611.51
730.025	689.18
730.424	732.87
730.822	805.69
731.22	786.27
731.619	745.01
732.017	888.21
732.415	961.03
732.813	893.07
733.212	895.49
733.61	917.34
734.008	936.76
734.406	929.47
734.803	839.67
735.201	883.36
735.599	914.91
735.997	878.5
736.395	936.76
736.792	1055.69
737.19	1223.17
737.587	1293.56
737.985	1635.8
738.382	1844.54
738.78	2143.09
739.177	2453.77
739.574	2686.78
739.971	3077.57
740.369	3380.97
740.766	3638.25
741.163	3713.5
741.56	3740.2
741.957	3650.39
742.354	3732.92
742.751	3635.83
743.147	3412.52
743.544	3113.97
743.941	2730.47
744.338	2565.42
744.734	2164.93
745.131	1999.88
745.527	1842.11
745.924	1793.57
746.32	1825.12
746.716	2145.51
747.113	2541.15
747.509	3075.14
747.905	3643.11
748.301	4594.58
748.697	5417.41
749.093	6473.25
749.489	7626.18
749.885	8667.46
750.281	10162.63
750.677	10958.76
751.073	11793.72
751.468	12058.29
751.864	12529.17
752.26	12206.35
752.655	12264.6
753.051	11652.94
753.446	11128.66
753.842	10250.01
754.237	9500
754.632	8172.31
755.028	7123.75
755.423	6228.1
755.818	5337.31
756.213	4832.45
756.608	4431.96
757.003	4509.63
757.398	4985.36
757.793	5480.52
758.188	6560.63
758.583	7936.86
758.977	9402.91
759.372	11645.66
759.767	14259.78
760.161	16973.41
760.556	19805.98
760.95	21633.68
761.345	23827.89
761.739	26692.01
762.133	28000.28
762.527	28378.93
762.922	28876.51
763.316	28886.22
763.71	28199.32
764.104	26446.86
764.498	24844.89
764.892	23245.36
765.286	20951.63
765.68	18742.86
766.073	16769.53
766.467	14298.61
766.861	12568
767.255	11643.23
767.648	10691.76
768.042	9968.45
768.435	10555.84
768.829	11699.06
769.222	13012.19
769.615	15017.07
770.008	17432.16
770.402	20420.07
770.795	23878.86
771.188	27560.96
771.581	30735.76
771.974	33240.66
772.367	36267.4
772.76	39837.85
773.153	40767.47
773.545	42352.45
773.938	43665.58
774.331	44408.31
774.724	44185
775.116	44461.7
775.509	43762.66
775.901	42959.25
776.294	40733.49
776.686	37597.52
777.078	34803.79
777.471	31565.87
777.863	28738.16
778.255	25985.69
778.647	22449.23
779.039	20390.94
779.431	18077.8
779.823	16420.01
780.215	16136.02
780.607	16126.31
780.999	17723.42
781.39	19065.68
781.782	22080.29
782.174	25548.79
782.565	29427.49
782.957	33832.9
783.348	38565.98
783.74	43303.92
784.131	46918.05
784.522	51143.85
784.914	53563.79
785.305	55745.86
785.696	57160.93
786.087	57937.64
786.478	57403.65
786.869	57187.63
787.26	56423.06
787.651	54092.92
788.042	52097.75
788.433	48816.14
788.823	44721.42
789.214	40704.36
789.605	36364.49
789.995	32568.32
790.386	28255.14
790.776	24641.01
791.167	21233.19
791.557	19589.96
791.948	17400.6
792.338	15677.28
792.728	14951.54
793.118	14223.37
793.508	14126.28
793.898	15004.94
794.288	16199.13
794.678	18148.19
795.068	20488.03
795.458	23386.13
795.848	26427.44
796.238	30014.88
796.627	33294.06
797.017	36432.45
797.406	40728.64
797.796	43134.01
798.185	46311.25
798.575	49068.57
798.964	49743.34
799.354	51927.84
799.743	52862.32
800.132	52634.16
800.521	52847.76
800.91	52124.45
801.299	49884.12
801.688	47284.56
802.077	44155.87
802.466	40840.29
802.855	38228.6
803.244	34201.84
803.633	30556.15
804.021	26463.85
804.41	23301.18
804.799	20395.8
805.187	17961.29
805.576	15344.75
805.964	13208.79
806.352	11487.89
806.741	10730.6
807.129	10194.18
807.517	10480.59
807.905	11402.94
808.293	12356.84
808.681	13718.51
809.069	15720.97
809.457	18572.95
809.845	20242.88
810.233	22738.07
810.621	25624.03
811.009	27988.15
811.396	30677.51
811.784	33002.79
812.171	35325.64
812.559	36862.07
812.946	37871.8
813.334	39138.81
813.721	38619.38
814.108	37789.27
814.496	37580.53
814.883	37148.48
815.27	37546.55
815.657	35439.72
816.044	34514.95
816.431	32306.18
816.818	30257.6
817.205	27264.84
817.592	25410.44
817.979	22189.51
818.365	19861.81
818.752	16963.7
819.139	14679.69
819.525	12975.78
819.912	11189.34
820.298	9652.91
820.685	8349.49
821.071	7456.27
821.457	6815.49
821.843	6419.85
822.23	6405.29
822.616	6604.32
823.002	6609.17
823.388	7174.72
823.774	7655.31
824.16	8283.96
824.546	9186.88
824.931	10004.86
825.317	11225.75
825.703	12337.42
826.089	13097.14
826.474	13987.93
826.86	15162.71
827.245	15815.63
827.631	16432.14
828.016	17199.14
828.401	17417.59
828.787	17446.72
829.172	17237.98
829.557	16970.99
829.942	16470.98
830.327	15621.45
830.712	15276.78
831.097	14541.34
831.482	13793.75
831.867	12839.85
832.252	11614.11
832.636	10837.4
833.021	9934.47
833.406	8912.61
833.79	7827.64
834.175	7101.9
834.559	5968.39
834.944	5410.13
835.328	4621.28
835.713	3919.81
836.097	3478.06
836.481	3094.56
836.865	2691.64
837.249	2470.76
837.633	2174.64
838.017	2126.09
838.401	2208.62
838.785	2232.89
839.169	2356.68
839.553	2412.51
839.937	2672.22
840.32	2868.82
840.704	3196.5
841.087	3257.18
841.471	3536.31
841.854	3735.34
842.238	4024.18
842.621	4196.52
843.004	4417.39
843.388	4490.21
843.771	4764.49
844.154	4965.94
844.537	5094.59
844.92	5254.78
845.303	5410.13
845.686	5157.7
846.069	4997.5
846.452	4961.09
846.834	4956.24
847.217	4587.3
847.6	4283.9
847.982	4181.95
848.365	3893.11
848.748	3684.37
849.13	3410.1
849.512	3145.53
849.895	2970.77
850.277	2674.65
850.659	2354.25
851.041	2106.68
851.423	1878.52
851.806	1766.87
852.188	1456.18
852.57	1342.1
852.951	1184.33
853.333	1070.25
853.715	1002.29
854.097	720.73
854.479	764.42
854.86	774.13
855.242	669.76
855.623	713.45
856.005	742.58
856.386	769.28
856.768	747.43
857.149	805.69
857.53	842.09
857.911	924.62
858.292	914.91
858.674	1028.99
859.055	1065.4
859.436	948.89
859.817	1050.84
860.197	1062.97
860.578	1225.6
860.959	1157.63
861.34	1281.42
861.72	1240.16
862.101	1128.51
862.482	1259.58
862.862	1264.43
863.243	1315.4
863.623	1247.44
864.003	1235.3
864.384	1203.75
864.764	1138.22
865.144	1065.4
865.524	1094.53
865.904	1058.12
866.284	946.46
866.664	929.47
867.044	866.37
867.424	863.94
867.804	786.27
868.183	713.45
868.563	606.65
868.943	567.82
869.322	582.38
869.702	519.27
870.081	507.14
870.461	448.88
870.84	414.9
871.22	329.95
871.599	327.52
871.978	312.96
872.357	346.94
872.736	291.11
873.115	332.38
873.494	356.65
873.873	223.15
874.252	223.15
874.631	245
875.01	237.72
875.388	218.3
875.767	252.28
876.146	325.1
876.524	322.67
876.903	271.7
877.281	305.68
877.66	252.28
878.038	269.27
878.416	359.08
878.794	308.11
879.173	288.69
879.551	303.25
879.929	242.57
880.307	298.4
880.685	269.27
881.063	295.97
881.441	278.98
881.818	334.8
882.196	257.13
882.574	271.7
882.951	339.66
883.329	220.73
883.707	325.1
884.084	245
884.461	308.11
884.839	225.58
885.216	276.55
885.593	181.89
885.971	191.6
886.348	230.43
886.725	235.29
887.102	245
887.479	274.12
887.856	206.16
888.233	198.88
888.609	208.59
888.986	145.48
889.363	215.87
889.74	167.33
890.116	191.6
890.493	203.73
890.869	220.73
891.246	198.88
891.622	116.35
891.998	191.6
892.375	160.04
892.751	140.63
893.127	128.49
893.503	128.49
893.879	155.19
894.255	172.18
894.631	228.01
895.007	133.35
895.383	225.58
895.759	186.74
896.134	160.04
896.51	201.31
896.886	160.04
897.261	150.34
897.637	167.33
898.012	186.74
898.388	109.07
898.763	186.74
899.138	135.77
899.514	126.06
899.889	138.2
900.264	123.64
900.639	201.31
901.014	143.05
901.389	99.36
901.764	147.91
902.139	164.9
902.513	181.89
902.888	77.52
903.263	75.09
903.638	123.64
904.012	111.5
904.387	145.48
904.761	157.62
905.136	113.93
905.51	174.61
905.884	155.19
906.259	101.79
906.633	126.06
907.007	155.19
907.381	109.07
907.755	145.48
908.129	150.34
908.503	160.04
908.877	206.16
909.251	77.52
909.624	45.97
909.998	94.51
910.372	116.35
910.745	128.49
911.119	208.59
911.492	48.39
911.866	121.21
912.239	55.67
912.612	43.54
912.986	164.9
913.359	123.64
913.732	109.07
914.105	84.8
914.478	106.65
914.851	150.34
915.224	87.23
915.597	160.04
915.97	194.03
916.343	162.47
916.715	133.35
917.088	147.91
917.461	138.2
917.833	145.48
918.206	169.75
918.578	167.33
918.951	109.07
919.323	140.63
919.695	169.75
920.067	160.04
920.44	113.93
920.812	140.63
921.184	128.49
921.556	96.94
921.928	104.22
922.3	118.78
922.672	135.77
923.043	123.64
923.415	160.04
923.787	121.21
924.158	186.74
924.53	145.48
924.901	96.94
925.273	104.22
925.644	138.2
926.016	41.11
926.387	104.22
926.758	135.77
927.129	106.65
927.5	96.94
927.872	123.64
928.243	138.2
928.613	198.88
928.984	147.91
929.355	118.78
929.726	167.33
930.097	70.24
930.467	143.05
930.838	194.03
931.209	99.36
931.579	143.05
931.95	152.76
932.32	143.05
932.69	198.88
933.061	118.78
933.431	145.48
933.801	181.89
934.171	160.04
934.541	116.35
934.911	84.8
935.281	111.5
935.651	118.78
936.021	89.66
936.391	104.22
936.761	70.24
937.13	53.25
937.5	116.35
937.87	152.76
938.239	150.34
938.609	191.6
938.978	126.06
939.347	152.76
939.717	184.32
940.086	126.06
940.455	157.62
940.824	121.21
941.193	123.64
941.562	128.49
941.931	130.92
942.3	208.59
942.669	186.74
943.038	92.08
943.407	92.08
943.775	128.49
944.144	116.35
944.513	164.9
944.881	186.74
945.25	113.93
945.618	203.73
945.986	155.19
946.355	172.18
946.723	116.35
947.091	79.95
947.459	157.62
947.827	181.89
948.195	191.6
948.563	164.9
948.931	147.91
949.299	155.19
949.667	111.5
950.035	172.18
950.402	191.6
950.77	82.37
951.138	84.8
951.505	150.34
951.873	128.49
952.24	101.79
952.607	220.73
952.975	164.9
953.342	167.33
953.709	130.92
954.076	135.77
954.443	123.64
954.81	140.63
955.177	172.18
955.544	174.61
955.911	94.51
956.278	62.96
956.645	191.6
957.012	82.37
957.378	116.35
957.745	126.06
958.111	130.92
958.478	126.06
958.844	198.88
959.211	140.63
959.577	104.22
959.943	116.35
960.309	87.23
960.675	121.21
961.042	123.64
961.408	106.65
961.774	106.65
962.139	104.22
962.505	104.22
962.871	138.2
963.237	189.17
963.603	77.52
963.968	203.73
964.334	215.87
964.699	126.06
965.065	70.24
965.43	172.18
965.796	94.51
966.161	77.52
966.526	87.23
966.891	121.21
967.256	157.62
967.622	169.75
967.987	147.91
968.352	135.77
968.716	118.78
969.081	133.35
969.446	179.46
969.811	177.04
970.176	130.92
970.54	167.33
970.905	89.66
971.269	99.36
971.634	43.54
971.998	135.77
972.363	92.08
972.727	87.23
973.091	186.74
973.455	135.77
973.819	143.05
974.183	135.77
974.547	101.79
974.911	152.76
975.275	116.35
975.639	130.92
976.003	82.37
976.367	135.77
976.73	138.2
977.094	164.9
977.458	116.35
977.821	143.05
978.185	179.46
978.548	106.65
978.911	140.63
979.275	138.2
979.638	191.6
980.001	133.35
980.364	157.62
980.727	150.34
981.09	113.93
981.453	126.06
981.816	121.21
982.179	191.6
982.542	162.47
982.905	109.07
983.267	181.89
983.63	101.79
983.992	162.47
984.355	225.58
984.717	77.52
985.08	109.07
985.442	116.35
985.804	106.65
986.167	145.48
986.529	84.8
986.891	177.04
987.253	116.35
987.615	109.07
987.977	60.53
988.339	186.74
988.701	196.45
989.062	82.37
989.424	118.78
989.786	116.35
990.147	101.79
990.509	126.06
990.87	128.49
991.232	155.19
991.593	123.64
991.955	150.34
992.316	147.91
992.677	152.76
993.038	72.66
993.399	87.23
993.76	143.05
994.121	177.04
994.482	58.1
994.843	87.23
995.204	157.62
995.565	143.05
995.926	55.67
996.286	157.62
996.647	191.6
997.007	252.28
997.368	84.8
997.728	82.37
998.089	157.62
998.449	121.21
998.809	213.44
999.169	157.62
999.53	198.88
999.89	118.78
1000.25	138.2
1000.61	138.2
1000.97	145.48
1001.329	160.04
1001.689	111.5
1002.049	138.2
1002.409	196.45
1002.768	126.06
1003.128	111.5
1003.487	130.92
1003.847	157.62
1004.206	174.61
1004.566	191.6
1004.925	109.07
1005.284	99.36
1005.643	138.2
1006.003	181.89
1006.362	172.18
1006.721	133.35
1007.08	130.92
1007.438	84.8
1007.797	84.8
1008.156	140.63
1008.515	79.95
1008.874	82.37
1009.232	130.92
1009.591	155.19
1009.949	162.47
1010.308	174.61
1010.666	167.33
1011.024	126.06
1011.383	72.66
1011.741	82.37
1012.099	147.91
1012.457	220.73
1012.815	135.77
1013.173	99.36
1013.531	116.35
1013.889	152.76
1014.247	147.91
1014.605	128.49
1014.962	160.04
1015.32	123.64
1015.678	160.04
1016.035	92.08
1016.393	130.92
1016.75	96.94
1017.107	130.92
1017.465	147.91
1017.822	109.07
1018.179	82.37
1018.536	133.35
1018.894	70.24
1019.251	121.21
1019.608	140.63
1019.964	89.66
1020.321	191.6
1020.678	130.92
1021.035	164.9
1021.392	89.66
1021.748	58.1
1022.105	145.48
1022.461	109.07
1022.818	143.05
1023.174	140.63
1023.531	145.48
1023.887	169.75
1024.243	179.46
1024.599	77.52
1024.955	79.95
1025.311	109.07
1025.667	121.21
1026.023	92.08
1026.379	82.37
1026.735	58.1
1027.091	126.06
1027.447	130.92
