189.514	62.96
189.973	62.96
190.431	62.96
190.889	50.82
191.348	2.28
191.806	28.97
192.264	16.84
192.722	11.98
193.18	-22
193.638	-53.55
194.096	38.68
194.554	-9.86
195.012	-14.72
195.47	-36.56
195.928	31.4
196.385	21.69
196.843	-53.55
197.301	26.55
197.758	7.13
198.216	24.12
198.674	-12.29
199.131	24.12
199.589	79.95
200.046	87.23
200.503	152.76
200.961	96.94
201.418	133.35
201.875	162.47
202.332	145.48
202.79	109.07
203.247	79.95
203.704	118.78
204.161	101.79
204.618	177.04
205.075	135.77
205.532	121.21
205.989	128.49
206.445	143.05
206.902	160.04
207.359	198.88
207.816	126.06
208.272	194.03
208.729	121.21
209.185	157.62
209.642	162.47
210.098	145.48
210.555	157.62
211.011	162.47
211.467	92.08
211.924	140.63
212.38	128.49
212.836	162.47
213.292	218.3
213.748	140.63
214.204	167.33
214.66	150.34
215.116	147.91
215.572	167.33
216.028	138.2
216.484	104.22
216.94	206.16
217.396	126.06
217.851	169.75
218.307	128.49
218.763	157.62
219.218	172.18
219.674	104.22
220.129	87.23
220.585	138.2
221.04	106.65
221.496	150.34
221.951	126.06
222.406	164.9
222.861	145.48
223.317	94.51
223.772	72.66
224.227	118.78
224.682	89.66
225.137	121.21
225.592	169.75
226.047	106.65
226.502	196.45
226.957	111.5
227.411	145.48
227.866	164.9
228.321	150.34
228.776	157.62
229.23	121.21
229.685	50.82
230.139	174.61
230.594	186.74
231.048	106.65
231.503	150.34
231.957	123.64
232.411	106.65
232.865	150.34
233.32	181.89
233.774	191.6
234.228	145.48
234.682	194.03
235.136	147.91
235.59	145.48
236.044	135.77
236.498	169.75
236.952	143.05
237.406	116.35
237.86	138.2
238.313	128.49
238.767	111.5
239.221	140.63
239.674	196.45
240.128	111.5
240.581	130.92
241.035	147.91
241.488	162.47
241.942	150.34
242.395	169.75
242.848	118.78
243.301	79.95
243.755	113.93
244.208	162.47
244.661	143.05
245.114	79.95
245.567	109.07
246.02	203.73
246.473	145.48
246.926	177.04
247.379	109.07
247.832	198.88
248.284	162.47
248.737	225.58
249.19	179.46
249.642	138.2
250.095	157.62
250.547	130.92
251	133.35
251.452	164.9
251.905	140.63
252.357	147.91
252.81	196.45
253.262	184.32
253.714	203.73
254.166	113.93
254.618	116.35
255.07	191.6
255.523	189.17
255.975	172.18
256.427	82.37
256.878	133.35
257.33	143.05
257.782	186.74
258.234	169.75
258.686	203.73
259.137	155.19
259.589	70.24
260.041	67.81
260.492	143.05
260.944	157.62
261.395	65.38
261.847	133.35
262.298	138.2
262.749	45.97
263.201	143.05
263.652	177.04
264.103	155.19
264.554	128.49
265.005	147.91
265.457	169.75
265.908	94.51
266.359	167.33
266.809	145.48
267.26	160.04
267.711	99.36
268.162	143.05
268.613	101.79
269.064	167.33
269.514	116.35
269.965	169.75
270.415	181.89
270.866	191.6
271.316	228.01
271.767	179.46
272.217	106.65
272.668	113.93
273.118	189.17
273.568	162.47
274.019	138.2
274.469	94.51
274.919	160.04
275.369	215.87
275.819	157.62
276.269	160.04
276.719	223.15
277.169	133.35
277.619	174.61
278.069	177.04
278.518	138.2
278.968	11.98
279.418	138.2
279.867	130.92
280.317	150.34
280.767	104.22
281.216	184.32
281.666	128.49
282.115	160.04
282.564	196.45
283.014	121.21
283.463	138.2
283.912	77.52
284.361	111.5
284.811	167.33
285.26	164.9
285.709	181.89
286.158	230.43
286.607	186.74
287.056	174.61
287.505	249.85
287.953	164.9
288.402	174.61
288.851	106.65
289.3	116.35
289.748	143.05
290.197	143.05
290.646	167.33
291.094	126.06
291.543	167.33
291.991	133.35
292.439	135.77
292.888	147.91
293.336	157.62
293.784	194.03
294.233	118.78
294.681	138.2
295.129	152.76
295.577	111.5
296.025	172.18
296.473	126.06
296.921	167.33
297.369	104.22
297.817	206.16
298.264	203.73
298.712	130.92
299.16	106.65
299.608	162.47
300.055	184.32
300.503	211.02
300.95	208.59
301.398	130.92
301.845	179.46
302.293	138.2
302.74	123.64
303.187	101.79
303.635	167.33
304.082	109.07
304.529	62.96
304.976	109.07
305.423	196.45
305.87	155.19
306.317	121.21
306.764	113.93
307.211	162.47
307.658	130.92
308.105	196.45
308.552	128.49
308.998	138.2
309.445	167.33
309.892	116.35
310.338	126.06
310.785	184.32
311.231	89.66
311.678	150.34
312.124	155.19
312.571	121.21
313.017	157.62
313.463	113.93
313.909	196.45
314.356	147.91
314.802	113.93
315.248	123.64
315.694	186.74
316.14	157.62
316.586	99.36
317.032	160.04
317.478	106.65
317.923	123.64
318.369	133.35
318.815	179.46
319.261	201.31
319.706	201.31
320.152	116.35
320.597	140.63
321.043	179.46
321.488	145.48
321.934	172.18
322.379	116.35
322.824	186.74
323.27	121.21
323.715	196.45
324.16	145.48
324.605	164.9
325.05	140.63
325.495	160.04
325.94	150.34
326.385	237.72
326.83	113.93
327.275	106.65
327.72	36.26
328.165	135.77
328.61	109.07
329.054	94.51
329.499	155.19
329.943	162.47
330.388	157.62
330.832	50.82
331.277	194.03
331.721	123.64
332.166	160.04
332.61	191.6
333.054	179.46
333.499	213.44
333.943	104.22
334.387	147.91
334.831	147.91
335.275	164.9
335.719	230.43
336.163	145.48
336.607	135.77
337.051	218.3
337.495	89.66
337.938	116.35
338.382	118.78
338.826	126.06
339.269	130.92
339.713	169.75
340.157	123.64
340.6	162.47
341.044	211.02
341.487	150.34
341.93	135.77
342.374	104.22
342.817	152.76
343.26	140.63
343.703	123.64
344.146	179.46
344.59	92.08
345.033	179.46
345.476	138.2
345.919	167.33
346.361	126.06
346.804	223.15
347.247	126.06
347.69	106.65
348.133	106.65
348.575	121.21
349.018	169.75
349.461	123.64
349.903	126.06
350.346	113.93
350.788	126.06
351.23	123.64
351.673	130.92
352.115	72.66
352.557	179.46
353	143.05
353.442	179.46
353.884	106.65
354.326	113.93
354.768	121.21
355.21	196.45
355.652	140.63
356.094	94.51
356.536	160.04
356.978	126.06
357.419	164.9
357.861	164.9
358.303	150.34
358.744	43.54
359.186	121.21
359.627	140.63
360.069	101.79
360.51	177.04
360.952	167.33
361.393	140.63
361.834	160.04
362.276	150.34
362.717	138.2
363.158	128.49
363.599	94.51
364.04	130.92
364.481	135.77
364.922	218.3
365.363	201.31
365.804	211.02
366.245	150.34
366.686	157.62
367.126	181.89
367.567	157.62
368.008	118.78
368.448	89.66
368.889	138.2
369.33	167.33
369.77	143.05
370.21	118.78
370.651	99.36
371.091	89.66
371.531	28.97
371.972	138.2
372.412	133.35
372.852	177.04
373.292	109.07
373.732	211.02
374.172	174.61
374.612	130.92
375.052	118.78
375.492	150.34
375.932	152.76
376.372	150.34
376.811	174.61
377.251	174.61
377.691	135.77
378.13	157.62
378.57	235.29
379.009	196.45
379.449	218.3
379.888	150.34
380.328	172.18
380.767	196.45
381.206	155.19
381.645	92.08
382.085	164.9
382.524	147.91
382.963	174.61
383.402	113.93
383.841	164.9
384.28	143.05
384.719	92.08
385.158	96.94
385.596	172.18
386.035	194.03
386.474	186.74
386.913	130.92
387.351	96.94
387.79	218.3
388.228	126.06
388.667	138.2
389.105	191.6
389.544	135.77
389.982	167.33
390.42	128.49
390.859	198.88
391.297	152.76
391.735	150.34
392.173	138.2
392.611	130.92
393.049	126.06
393.487	135.77
393.925	208.59
394.363	194.03
394.801	155.19
395.239	128.49
395.676	109.07
396.114	135.77
396.552	160.04
396.989	179.46
397.427	172.18
397.864	169.75
398.302	111.5
398.739	150.34
399.177	191.6
399.614	150.34
400.051	213.44
400.488	177.04
400.926	94.51
401.363	106.65
401.8	172.18
402.237	143.05
402.674	70.24
403.111	174.61
403.548	155.19
403.985	128.49
404.421	189.17
404.858	82.37
405.295	96.94
405.732	130.92
406.168	130.92
406.605	104.22
407.041	126.06
407.478	225.58
407.914	155.19
408.351	169.75
408.787	164.9
409.223	140.63
409.66	164.9
410.096	128.49
410.532	172.18
410.968	109.07
411.404	118.78
411.84	104.22
412.276	196.45
412.712	123.64
413.148	140.63
413.584	106.65
414.02	157.62
414.455	201.31
414.891	109.07
415.327	167.33
415.762	62.96
416.198	147.91
416.633	106.65
417.069	65.38
417.504	126.06
417.94	145.48
418.375	111.5
418.81	160.04
419.245	184.32
419.681	201.31
420.116	135.77
420.551	147.91
420.986	147.91
421.421	174.61
421.856	186.74
422.291	177.04
422.726	177.04
423.16	203.73
423.595	101.79
424.03	130.92
424.464	179.46
424.899	215.87
425.334	206.16
425.768	106.65
426.203	184.32
426.637	196.45
427.071	135.77
427.506	94.51
427.94	123.64
428.374	101.79
428.809	152.76
429.243	96.94
429.677	228.01
430.111	145.48
430.545	157.62
430.979	172.18
431.413	143.05
431.847	157.62
432.28	135.77
432.714	113.93
433.148	172.18
433.582	150.34
434.015	167.33
434.449	130.92
434.882	177.04
435.316	162.47
435.749	237.72
436.183	184.32
436.616	152.76
437.049	79.95
437.483	198.88
437.916	135.77
438.349	128.49
438.782	160.04
439.215	96.94
439.648	109.07
440.081	232.86
440.514	220.73
440.947	162.47
441.38	162.47
441.813	206.16
442.245	213.44
442.678	164.9
443.111	189.17
443.543	191.6
443.976	126.06
444.408	218.3
444.841	179.46
445.273	206.16
445.705	167.33
446.138	177.04
446.57	177.04
447.002	186.74
447.434	198.88
447.867	220.73
448.299	177.04
448.731	191.6
449.163	177.04
449.595	230.43
450.026	186.74
450.458	164.9
450.89	249.85
451.322	230.43
451.754	213.44
452.185	240.14
452.617	218.3
453.048	245
453.48	206.16
453.911	276.55
454.343	220.73
454.774	208.59
455.205	247.42
455.637	288.69
456.068	232.86
456.499	281.41
456.93	235.29
457.361	177.04
457.792	203.73
458.223	291.11
458.654	174.61
459.085	261.99
459.516	308.11
459.947	181.89
460.378	281.41
460.808	218.3
461.239	191.6
461.669	189.17
462.1	150.34
462.531	181.89
462.961	194.03
463.391	271.7
463.822	198.88
464.252	201.31
464.682	167.33
465.113	191.6
465.543	174.61
465.973	281.41
466.403	235.29
466.833	266.84
467.263	223.15
467.693	174.61
468.123	194.03
468.553	172.18
468.983	167.33
469.412	201.31
469.842	152.76
470.272	196.45
470.701	150.34
471.131	223.15
471.56	147.91
471.99	160.04
472.419	245
472.849	189.17
473.278	225.58
473.707	208.59
474.136	228.01
474.566	179.46
474.995	167.33
475.424	145.48
475.853	220.73
476.282	228.01
476.711	276.55
477.14	196.45
477.569	198.88
477.997	254.71
478.426	174.61
478.855	152.76
479.283	235.29
479.712	218.3
480.141	177.04
480.569	181.89
480.998	232.86
481.426	181.89
481.854	240.14
482.283	211.02
482.711	232.86
483.139	198.88
483.567	133.35
483.995	121.21
484.424	130.92
484.852	247.42
485.28	201.31
485.708	174.61
486.135	235.29
486.563	133.35
486.991	242.57
487.419	143.05
487.847	206.16
488.274	179.46
488.702	162.47
489.129	167.33
489.557	123.64
489.984	177.04
490.412	145.48
490.839	194.03
491.266	164.9
491.694	152.76
492.121	116.35
492.548	157.62
492.975	240.14
493.402	118.78
493.829	157.62
494.256	167.33
494.683	150.34
495.11	164.9
495.537	179.46
495.964	184.32
496.39	126.06
496.817	162.47
497.244	152.76
497.67	109.07
498.097	167.33
498.523	174.61
498.95	174.61
499.376	177.04
499.803	186.74
500.229	89.66
500.655	184.32
501.081	179.46
501.508	230.43
501.934	96.94
502.36	77.52
502.786	150.34
503.212	213.44
503.638	160.04
504.064	198.88
504.489	143.05
504.915	167.33
505.341	135.77
505.767	247.42
506.192	155.19
506.618	237.72
507.043	181.89
507.469	184.32
507.894	152.76
508.32	189.17
508.745	186.74
509.17	169.75
509.596	143.05
510.021	181.89
510.446	186.74
510.871	174.61
511.296	177.04
511.721	177.04
512.146	249.85
512.571	138.2
512.996	245
513.421	196.45
513.845	162.47
514.27	150.34
514.695	172.18
515.119	138.2
515.544	164.9
515.969	167.33
516.393	133.35
516.817	184.32
517.242	230.43
517.666	145.48
518.09	215.87
518.515	135.77
518.939	215.87
519.363	380.92
519.787	220.73
520.211	155.19
520.635	181.89
521.059	135.77
521.483	177.04
521.907	245
522.331	169.75
522.754	189.17
523.178	208.59
523.602	237.72
524.025	140.63
524.449	203.73
524.872	169.75
525.296	145.48
525.719	172.18
526.143	218.3
526.566	189.17
526.989	181.89
527.412	228.01
527.836	201.31
528.259	140.63
528.682	218.3
529.105	269.27
529.528	220.73
529.951	143.05
530.374	162.47
530.796	211.02
531.219	208.59
531.642	150.34
532.065	111.5
532.487	111.5
532.91	177.04
533.332	162.47
533.755	140.63
534.177	291.11
534.6	177.04
535.022	240.14
535.444	201.31
535.867	111.5
536.289	162.47
536.711	208.59
537.133	228.01
537.555	179.46
537.977	198.88
538.399	220.73
538.821	189.17
539.243	208.59
539.665	164.9
540.086	186.74
540.508	167.33
540.93	211.02
541.351	186.74
541.773	179.46
542.195	230.43
542.616	186.74
543.037	208.59
543.459	186.74
543.88	169.75
544.301	174.61
544.723	196.45
545.144	160.04
545.565	162.47
545.986	228.01
546.407	167.33
546.828	208.59
547.249	174.61
547.67	169.75
548.091	169.75
548.512	211.02
548.932	179.46
549.353	274.12
549.774	218.3
550.194	261.99
550.615	249.85
551.035	249.85
551.456	191.6
551.876	169.75
552.296	116.35
552.717	186.74
553.137	211.02
553.557	147.91
553.977	215.87
554.397	232.86
554.817	75.09
555.237	184.32
555.657	133.35
556.077	184.32
556.497	181.89
556.917	237.72
557.337	135.77
557.756	155.19
558.176	79.95
558.596	232.86
559.015	208.59
559.435	172.18
559.854	164.9
560.274	123.64
560.693	128.49
561.112	194.03
561.532	133.35
561.951	138.2
562.37	152.76
562.789	230.43
563.208	140.63
563.627	220.73
564.046	138.2
564.465	194.03
564.884	218.3
565.303	228.01
565.722	130.92
566.14	157.62
566.559	140.63
566.978	135.77
567.396	169.75
567.815	169.75
568.233	242.57
568.652	164.9
569.07	87.23
569.489	84.8
569.907	174.61
570.325	160.04
570.743	155.19
571.161	181.89
571.58	218.3
571.998	196.45
572.416	145.48
572.833	143.05
573.251	211.02
573.669	123.64
574.087	160.04
574.505	150.34
574.922	184.32
575.34	106.65
575.758	218.3
576.175	196.45
576.593	160.04
577.01	123.64
577.428	150.34
577.845	1626.09
578.262	322.67
578.68	189.17
579.097	160.04
579.514	194.03
579.931	218.3
580.348	211.02
580.765	174.61
581.182	179.46
581.599	172.18
582.016	198.88
582.433	152.76
582.849	208.59
583.266	196.45
583.683	126.06
584.099	186.74
584.516	242.57
584.933	189.17
585.349	215.87
585.765	230.43
586.182	179.46
586.598	164.9
587.014	191.6
587.431	203.73
587.847	104.22
588.263	130.92
588.679	174.61
589.095	147.91
589.511	172.18
589.927	191.6
590.343	179.46
590.759	138.2
591.174	237.72
591.59	147.91
592.006	164.9
592.421	152.76
592.837	196.45
593.252	240.14
593.668	181.89
594.083	181.89
594.499	235.29
594.914	186.74
595.329	123.64
595.745	133.35
596.16	184.32
596.575	140.63
596.99	174.61
597.405	135.77
597.82	145.48
598.235	101.79
598.65	203.73
599.065	135.77
599.479	167.33
599.894	211.02
600.309	111.5
600.724	126.06
601.138	218.3
601.553	92.08
601.967	179.46
602.382	191.6
602.796	211.02
603.21	140.63
603.625	269.27
604.039	109.07
604.453	152.76
604.867	177.04
605.281	208.59
605.695	152.76
606.109	150.34
606.523	145.48
606.937	211.02
607.351	293.54
607.765	121.21
608.178	179.46
608.592	167.33
609.006	201.31
609.419	169.75
609.833	211.02
610.246	152.76
610.66	147.91
611.073	72.66
611.487	218.3
611.9	130.92
612.313	179.46
612.726	101.79
613.139	201.31
613.553	179.46
613.966	177.04
614.379	174.61
614.792	169.75
615.204	215.87
615.617	179.46
616.03	162.47
616.443	201.31
616.856	121.21
617.268	87.23
617.681	215.87
618.093	121.21
618.506	143.05
618.918	128.49
619.331	228.01
619.743	203.73
620.155	116.35
620.568	116.35
620.98	106.65
621.392	99.36
621.804	215.87
622.216	232.86
622.628	169.75
623.04	157.62
623.452	245
623.864	145.48
624.276	155.19
624.687	181.89
625.099	116.35
625.511	67.81
625.922	177.04
626.334	145.48
626.745	230.43
627.157	150.34
627.568	198.88
627.979	198.88
628.391	164.9
628.802	169.75
629.213	249.85
629.624	177.04
630.035	123.64
630.446	186.74
630.857	155.19
631.268	101.79
631.679	174.61
632.09	162.47
632.501	169.75
632.912	169.75
633.322	179.46
633.733	150.34
634.144	123.64
634.554	126.06
634.965	147.91
635.375	172.18
635.785	184.32
636.196	218.3
636.606	186.74
637.016	218.3
637.427	189.17
637.837	99.36
638.247	140.63
638.657	143.05
639.067	179.46
639.477	79.95
639.887	147.91
640.297	177.04
640.706	164.9
641.116	228.01
641.526	167.33
641.935	150.34
642.345	138.2
642.755	116.35
643.164	196.45
643.573	152.76
643.983	162.47
644.392	172.18
644.801	130.92
645.211	118.78
645.62	106.65
646.029	140.63
646.438	169.75
646.847	77.52
647.256	150.34
647.665	145.48
648.074	172.18
648.483	162.47
648.892	179.46
649.3	155.19
649.709	130.92
650.118	157.62
650.526	96.94
650.935	128.49
651.343	213.44
651.752	155.19
652.16	194.03
652.568	147.91
652.977	92.08
653.385	157.62
653.793	123.64
654.201	223.15
654.609	157.62
655.017	169.75
655.425	152.76
655.833	106.65
656.241	150.34
656.649	184.32
657.057	162.47
657.464	177.04
657.872	121.21
658.28	138.2
658.687	111.5
659.095	172.18
659.502	162.47
659.91	174.61
660.317	157.62
660.724	104.22
661.132	155.19
661.539	203.73
661.946	138.2
662.353	152.76
662.76	223.15
663.167	191.6
663.574	164.9
663.981	126.06
664.388	162.47
664.795	208.59
665.202	147.91
665.608	160.04
666.015	145.48
666.422	223.15
666.828	140.63
667.235	186.74
667.641	130.92
668.047	126.06
668.454	140.63
668.86	181.89
669.266	160.04
669.673	147.91
670.079	152.76
670.485	160.04
670.891	157.62
671.297	174.61
671.703	128.49
672.109	162.47
672.515	140.63
672.92	181.89
673.326	143.05
673.732	164.9
674.138	215.87
674.543	186.74
674.949	196.45
675.354	130.92
675.76	235.29
676.165	123.64
676.57	128.49
676.976	211.02
677.381	242.57
677.786	220.73
678.191	181.89
678.596	123.64
679.001	133.35
679.406	160.04
679.811	174.61
680.216	126.06
680.621	194.03
681.026	106.65
681.43	140.63
681.835	138.2
682.24	130.92
682.644	203.73
683.049	174.61
683.453	169.75
683.858	194.03
684.262	177.04
684.667	203.73
685.071	133.35
685.475	82.37
685.879	177.04
686.283	189.17
686.687	174.61
687.091	177.04
687.495	99.36
687.899	208.59
688.303	177.04
688.707	160.04
689.111	177.04
689.514	169.75
689.918	208.59
690.322	186.74
690.725	116.35
691.129	181.89
691.532	167.33
691.936	194.03
692.339	130.92
692.742	143.05
693.146	50.82
693.549	89.66
693.952	208.59
694.355	89.66
694.758	135.77
695.161	191.6
695.564	206.16
695.967	147.91
696.37	104.22
696.773	196.45
697.175	220.73
697.578	143.05
697.981	215.87
698.383	189.17
698.786	208.59
699.188	160.04
699.591	186.74
699.993	259.56
700.395	160.04
700.798	96.94
701.2	164.9
701.602	152.76
702.004	245
702.406	213.44
702.808	133.35
703.21	196.45
703.612	228.01
704.014	196.45
704.416	191.6
704.818	218.3
705.219	160.04
705.621	198.88
706.023	213.44
706.424	181.89
706.826	203.73
707.227	164.9
707.629	157.62
708.03	257.13
708.431	174.61
708.832	237.72
709.234	181.89
709.635	257.13
710.036	230.43
710.437	237.72
710.838	288.69
711.239	218.3
711.64	237.72
712.041	232.86
712.441	208.59
712.842	208.59
713.243	261.99
713.643	264.42
714.044	269.27
714.445	266.84
714.845	254.71
715.246	354.22
715.646	298.4
716.046	261.99
716.447	361.5
716.847	310.53
717.247	232.86
717.647	291.11
718.047	320.24
718.447	383.35
718.847	368.79
719.247	305.68
719.647	436.75
720.047	410.05
720.446	373.64
720.846	327.52
721.246	400.34
721.645	380.92
722.045	361.5
722.444	371.21
722.844	354.22
723.243	400.34
723.643	368.79
724.042	334.8
724.441	431.89
724.84	373.64
725.24	376.07
725.639	475.58
726.038	480.44
726.437	465.87
726.836	441.6
727.234	468.3
727.633	499.86
728.032	558.11
728.431	526.56
728.83	526.56
729.228	541.12
729.627	604.23
730.025	630.93
730.424	596.94
730.822	691.61
731.22	679.47
731.619	720.73
732.017	832.39
732.415	735.3
732.813	1012
733.212	863.94
733.61	941.61
734.008	1106.66
734.406	1094.53
734.803	1096.95
735.201	1174.62
735.599	1274.14
735.997	1400.36
736.395	1470.74
736.792	1490.16
737.19	1592.11
737.587	1691.62
737.985	1735.31
738.382	1808.13
738.78	1946.48
739.177	2007.16
739.574	2067.84
739.971	2079.98
740.369	2242.6
740.766	2497.46
741.163	2490.18
741.56	2448.92
741.957	2677.07
742.354	2679.5
742.751	2910.09
743.147	3060.58
743.544	3072.71
743.941	3089.7
744.338	3283.88
744.734	3558.16
745.131	3638.25
745.527	3876.12
745.924	3810.59
746.32	4313.02
746.716	4376.13
747.113	4788.76
747.509	4876.14
747.905	5070.32
748.301	5310.61
748.697	5660.13
749.093	5934.41
749.489	5851.88
749.885	6135.87
750.281	6885.88
750.677	6924.71
751.073	7257.24
751.468	7432
751.864	7715.99
752.26	8031.53
752.655	8305.8
753.051	8565.52
753.446	9206.3
753.842	9196.59
754.237	9907.77
754.632	9902.91
755.028	9902.91
755.423	10128.65
755.818	10208.74
756.213	10570.4
756.608	10866.52
757.003	11145.65
757.398	11332.55
757.793	11434.49
758.188	11827.7
758.583	11798.58
758.977	12247.61
759.372	12568
759.767	13565.59
760.161	13652.97
760.556	14822.89
760.95	15225.81
761.345	15696.69
761.739	16495.25
762.133	17070.5
762.527	17485.56
762.922	18187.02
763.316	19150.63
763.71	19075.39
764.104	19458.89
764.498	20123.95
764.892	20733.18
765.286	21036.58
765.68	21606.98
766.073	21847.28
766.467	22349.71
766.861	22505.05
767.255	23791.48
767.648	24403.14
768.042	24602.17
768.435	25276.94
768.829	25740.54
769.222	25932.29
769.615	26509.97
770.008	26602.2
770.402	26716.28
770.795	26910.46
771.188	27337.65
771.581	27446.88
771.974	27306.1
772.367	26954.15
772.76	27905.62
773.153	26757.55
773.545	26842.5
773.938	27631.35
774.331	27546.39
774.724	28087.66
775.116	29604.68
775.509	30143.52
775.901	31505.19
776.294	32456.66
776.686	32723.66
777.078	33223.67
777.471	34002.8
777.863	35143.6
778.255	36784.4
778.647	37090.23
779.039	37349.94
779.431	36704.3
779.823	36531.97
780.215	37570.82
780.607	37325.67
780.999	38548.99
781.39	38437.34
781.782	38903.37
782.174	39124.24
782.565	39922.8
782.957	39799.01
783.348	40398.53
783.74	40806.31
784.131	40226.2
784.522	40177.66
784.914	39539.3
785.305	39209.2
785.696	39216.48
786.087	39612.11
786.478	38779.58
786.869	37226.16
787.26	37595.09
787.651	36750.42
788.042	35798.95
788.433	34862.04
788.823	33862.03
789.214	33354.74
789.605	32524.63
789.995	32546.47
790.386	31527.04
790.776	31631.41
791.167	30993.05
791.557	31891.12
791.948	32002.77
792.338	32422.68
792.728	34303.78
793.118	34876.6
793.508	34175.14
793.898	33653.28
794.288	34709.13
794.678	34189.7
795.068	33828.04
795.458	33971.25
795.848	34529.51
796.238	33519.79
796.627	33616.88
797.017	33277.06
797.406	33607.17
797.796	32801.33
798.185	33636.29
798.575	33961.54
798.964	33510.08
799.354	33638.72
799.743	33706.68
800.132	34311.06
800.521	33667.85
800.91	33400.85
801.299	33449.4
801.688	32864.44
802.077	31757.62
802.466	31959.08
802.855	32432.39
803.244	31476.07
803.633	30745.47
804.021	29840.12
804.41	29777.01
804.799	28803.69
805.187	28017.27
805.576	28704.18
805.964	27502.7
806.352	26048.8
806.741	26233.27
807.129	26284.24
807.517	25391.02
807.905	25172.57
808.293	25759.96
808.681	25888.6
809.069	24924.99
809.457	26077.92
809.845	26658.03
810.233	26104.62
810.621	26009.96
811.009	26126.47
811.396	26633.76
811.784	26087.63
812.171	25369.17
812.559	25388.59
812.946	25107.03
813.334	25070.63
813.721	23376.43
814.108	23820.61
814.496	23791.48
814.883	22757.48
815.27	22963.8
815.657	23728.37
816.044	23932.26
816.431	22762.34
816.818	22313.3
817.205	22910.4
817.592	22677.39
817.979	21238.04
818.365	21323
818.752	21228.33
819.139	19594.81
819.525	19131.21
819.912	19240.44
820.298	19602.09
820.685	18335.08
821.071	17446.72
821.457	17177.3
821.843	16735.55
822.23	16167.58
822.616	15504.94
823.002	15109.31
823.388	15119.02
823.774	14089.87
824.16	13179.66
824.546	13058.3
824.931	12803.45
825.317	12419.94
825.703	12000.03
826.089	12390.82
826.474	12262.17
826.86	11910.23
827.245	11334.98
827.631	11514.59
828.016	11456.34
828.401	10793.71
828.787	10487.88
829.172	10752.44
829.557	10517
829.942	9781.55
830.327	9747.57
830.712	9720.87
831.097	9631.07
831.482	9148.05
831.867	8900.47
832.252	8650.47
832.636	8526.68
833.021	8264.54
833.406	8429.59
833.79	8106.77
834.175	7883.47
834.559	7803.37
834.944	7201.42
835.328	7385.89
835.713	7172.29
836.097	6876.17
836.481	6546.07
836.865	6482.96
837.249	6393.15
837.633	5980.52
838.017	5730.52
838.401	5859.16
838.785	5621.29
839.169	5327.6
839.553	5007.21
839.937	4805.75
840.32	4820.31
840.704	4448.95
841.087	4060.59
841.471	4123.7
841.854	4080.01
842.238	3747.48
842.621	3740.2
843.004	3548.45
843.388	3626.12
843.771	3444.08
844.154	3482.91
844.537	3422.23
844.92	3487.77
845.303	3247.47
845.686	3118.83
846.069	3016.89
846.452	3169.8
846.834	3055.72
847.217	2771.74
847.6	2730.47
847.982	2791.15
848.365	2779.02
848.748	2621.25
849.13	2601.83
849.512	2572.7
849.895	2560.57
850.277	2359.11
850.659	2351.83
851.041	2349.4
851.423	2300.85
851.806	2220.76
852.188	2162.5
852.57	2019.3
852.951	2116.39
853.333	2007.16
853.715	1931.92
854.097	1798.42
854.479	1832.4
854.86	1783.86
855.242	1783.86
855.623	1703.76
856.005	1577.54
856.386	1718.32
856.768	1575.12
857.149	1470.74
857.53	1337.25
857.911	1402.78
858.292	1424.63
858.674	1155.21
859.055	1123.65
859.436	1230.45
859.817	1138.22
860.197	1157.63
860.578	997.44
860.959	978.02
861.34	970.74
861.72	871.22
862.101	859.08
862.482	883.36
862.862	829.96
863.243	890.64
863.623	851.8
864.003	769.28
864.384	786.27
864.764	861.51
865.144	766.85
865.524	781.41
865.904	749.86
866.284	742.58
866.664	720.73
867.044	701.32
867.424	584.81
867.804	640.63
868.183	611.51
868.563	582.38
868.943	548.4
869.322	543.55
869.702	560.54
870.081	509.56
870.461	456.17
870.84	575.1
871.22	470.73
871.599	485.29
871.978	485.29
872.357	465.87
872.736	427.04
873.115	478.01
873.494	451.31
873.873	344.51
874.252	368.79
874.631	380.92
875.01	429.47
875.388	444.03
875.767	405.19
876.146	293.54
876.524	337.23
876.903	305.68
877.281	351.8
877.66	312.96
878.038	271.7
878.416	240.14
878.794	232.86
879.173	288.69
879.551	312.96
879.929	286.26
880.307	288.69
880.685	252.28
881.063	310.53
881.441	266.84
881.818	286.26
882.196	264.42
882.574	232.86
882.951	138.2
883.329	225.58
883.707	237.72
884.084	276.55
884.461	201.31
884.839	228.01
885.216	128.49
885.593	201.31
885.971	172.18
886.348	295.97
886.725	208.59
887.102	298.4
887.479	172.18
887.856	194.03
888.233	230.43
888.609	223.15
888.986	220.73
889.363	247.42
889.74	223.15
890.116	169.75
890.493	172.18
890.869	147.91
891.246	213.44
891.622	240.14
891.998	198.88
892.375	184.32
892.751	157.62
893.127	99.36
893.503	169.75
893.879	179.46
894.255	230.43
894.631	133.35
895.007	196.45
895.383	140.63
895.759	198.88
896.134	196.45
896.51	177.04
896.886	147.91
897.261	133.35
897.637	174.61
898.012	130.92
898.388	82.37
898.763	177.04
899.138	186.74
899.514	157.62
899.889	220.73
900.264	133.35
900.639	109.07
901.014	179.46
901.389	145.48
901.764	128.49
902.139	128.49
902.513	179.46
902.888	145.48
903.263	177.04
903.638	116.35
904.012	167.33
904.387	130.92
904.761	160.04
905.136	218.3
905.51	101.79
905.884	169.75
906.259	118.78
906.633	135.77
907.007	123.64
907.381	164.9
907.755	160.04
908.129	160.04
908.503	123.64
908.877	155.19
909.251	128.49
909.624	155.19
909.998	135.77
910.372	203.73
910.745	123.64
911.119	113.93
911.492	157.62
911.866	118.78
912.239	116.35
912.612	92.08
912.986	184.32
913.359	140.63
913.732	184.32
914.105	123.64
914.478	60.53
914.851	67.81
915.224	123.64
915.597	203.73
915.97	116.35
916.343	160.04
916.715	147.91
917.088	116.35
917.461	167.33
917.833	140.63
918.206	177.04
918.578	87.23
918.951	143.05
919.323	169.75
919.695	181.89
920.067	140.63
920.44	140.63
920.812	164.9
921.184	133.35
921.556	208.59
921.928	111.5
922.3	196.45
922.672	252.28
923.043	181.89
923.415	138.2
923.787	101.79
924.158	133.35
924.53	145.48
924.901	181.89
925.273	172.18
925.644	116.35
926.016	162.47
926.387	167.33
926.758	186.74
927.129	99.36
927.5	128.49
927.872	147.91
928.243	123.64
928.613	169.75
928.984	82.37
929.355	140.63
929.726	150.34
930.097	113.93
930.467	101.79
930.838	181.89
931.209	104.22
931.579	184.32
931.95	89.66
932.32	130.92
932.69	167.33
933.061	101.79
933.431	194.03
933.801	157.62
934.171	89.66
934.541	147.91
934.911	113.93
935.281	186.74
935.651	179.46
936.021	101.79
936.391	87.23
936.761	140.63
937.13	155.19
937.5	109.07
937.87	143.05
938.239	145.48
938.609	174.61
938.978	92.08
939.347	189.17
939.717	135.77
940.086	150.34
940.455	145.48
940.824	167.33
941.193	121.21
941.562	169.75
941.931	94.51
942.3	298.4
942.669	138.2
943.038	162.47
943.407	104.22
943.775	113.93
944.144	135.77
944.513	101.79
944.881	104.22
945.25	128.49
945.618	72.66
945.986	257.13
946.355	121.21
946.723	160.04
947.091	50.82
947.459	116.35
947.827	145.48
948.195	116.35
948.563	186.74
948.931	135.77
949.299	186.74
949.667	181.89
950.035	218.3
950.402	164.9
950.77	84.8
951.138	126.06
951.505	167.33
951.873	177.04
952.24	109.07
952.607	123.64
952.975	164.9
953.342	111.5
953.709	45.97
954.076	79.95
954.443	123.64
954.81	167.33
955.177	206.16
955.544	89.66
955.911	157.62
956.278	130.92
956.645	179.46
957.012	152.76
957.378	157.62
957.745	138.2
958.111	179.46
958.478	230.43
958.844	126.06
959.211	169.75
959.577	150.34
959.943	189.17
960.309	189.17
960.675	167.33
961.042	155.19
961.408	118.78
961.774	143.05
962.139	174.61
962.505	164.9
962.871	65.38
963.237	162.47
963.603	118.78
963.968	150.34
964.334	121.21
964.699	104.22
965.065	65.38
965.43	167.33
965.796	169.75
966.161	164.9
966.526	196.45
966.891	89.66
967.256	135.77
967.622	79.95
967.987	186.74
968.352	140.63
968.716	126.06
969.081	211.02
969.446	143.05
969.811	116.35
970.176	162.47
970.54	203.73
970.905	72.66
971.269	133.35
971.634	167.33
971.998	143.05
972.363	121.21
972.727	130.92
973.091	130.92
973.455	111.5
973.819	160.04
974.183	111.5
974.547	113.93
974.911	138.2
975.275	106.65
975.639	82.37
976.003	96.94
976.367	172.18
976.73	140.63
977.094	126.06
977.458	194.03
977.821	140.63
978.185	213.44
978.548	160.04
978.911	89.66
979.275	206.16
979.638	155.19
980.001	155.19
980.364	196.45
980.727	121.21
981.09	181.89
981.453	89.66
981.816	116.35
982.179	145.48
982.542	126.06
982.905	198.88
983.267	111.5
983.63	109.07
983.992	160.04
984.355	162.47
984.717	92.08
985.08	111.5
985.442	109.07
985.804	135.77
986.167	135.77
986.529	113.93
986.891	160.04
987.253	225.58
987.615	96.94
987.977	92.08
988.339	79.95
988.701	145.48
989.062	111.5
989.424	87.23
989.786	174.61
990.147	133.35
990.509	72.66
990.87	106.65
991.232	79.95
991.593	150.34
991.955	89.66
992.316	147.91
992.677	135.77
993.038	89.66
993.399	130.92
993.76	96.94
994.121	155.19
994.482	155.19
994.843	116.35
995.204	196.45
995.565	138.2
995.926	189.17
996.286	135.77
996.647	82.37
997.007	138.2
997.368	87.23
997.728	133.35
998.089	135.77
998.449	147.91
998.809	145.48
999.169	179.46
999.53	113.93
999.89	113.93
1000.25	164.9
1000.61	189.17
1000.97	121.21
1001.329	113.93
1001.689	191.6
1002.049	184.32
1002.409	140.63
1002.768	48.39
1003.128	135.77
1003.487	189.17
1003.847	143.05
1004.206	101.79
1004.566	135.77
1004.925	164.9
1005.284	133.35
1005.643	84.8
1006.003	145.48
1006.362	220.73
1006.721	162.47
1007.08	189.17
1007.438	118.78
1007.797	152.76
1008.156	128.49
1008.515	194.03
1008.874	79.95
1009.232	147.91
1009.591	206.16
1009.949	157.62
1010.308	152.76
1010.666	118.78
1011.024	169.75
1011.383	118.78
1011.741	160.04
1012.099	116.35
1012.457	147.91
1012.815	92.08
1013.173	82.37
1013.531	140.63
1013.889	77.52
1014.247	169.75
1014.605	138.2
1014.962	145.48
1015.32	147.91
1015.678	145.48
1016.035	111.5
1016.393	160.04
1016.75	118.78
1017.107	135.77
1017.465	82.37
1017.822	65.38
1018.179	133.35
1018.536	155.19
1018.894	147.91
1019.251	67.81
1019.608	135.77
1019.964	172.18
1020.321	130.92
1020.678	128.49
1021.035	145.48
1021.392	133.35
1021.748	135.77
1022.105	150.34
1022.461	113.93
1022.818	140.63
1023.174	169.75
1023.531	143.05
1023.887	138.2
1024.243	147.91
1024.599	196.45
1024.955	55.67
1025.311	128.49
1025.667	157.62
1026.023	79.95
1026.379	145.48
1026.735	128.49
1027.091	126.06
1027.447	191.6
