189.514	8.65
189.973	8.65
190.431	8.65
190.889	81.46
191.348	20.78
191.806	-22.91
192.264	11.07
192.722	35.35
193.18	-30.19
193.638	-49.61
194.096	-93.3
194.554	-13.2
195.012	-20.48
195.47	6.22
195.928	62.05
196.385	-20.48
196.843	-49.61
197.301	-1.06
197.758	35.35
198.216	-5.92
198.674	71.75
199.131	62.05
199.589	47.48
200.046	64.47
200.503	125.15
200.961	88.75
201.418	125.15
201.875	64.47
202.332	23.21
202.79	127.58
203.247	139.72
203.704	127.58
204.161	62.05
204.618	134.86
205.075	137.29
205.532	132.44
205.989	108.16
206.445	134.86
206.902	149.43
207.359	161.56
207.816	159.13
208.272	178.55
208.729	117.87
209.185	229.52
209.642	185.83
210.098	134.86
210.555	185.83
211.011	156.71
211.467	190.69
211.924	197.97
212.38	173.7
212.836	149.43
213.292	132.44
213.748	217.39
214.204	193.12
214.66	168.84
215.116	156.71
215.572	217.39
216.028	122.73
216.484	183.41
216.94	173.7
217.396	144.57
217.851	113.02
218.307	66.9
218.763	205.25
219.218	142.14
219.674	142.14
220.129	234.38
220.585	52.34
221.04	96.03
221.496	142.14
221.951	120.3
222.406	282.92
222.861	142.14
223.317	130.01
223.772	103.31
224.227	163.99
224.682	127.58
225.137	142.14
225.592	117.87
226.047	185.83
226.502	149.43
226.957	176.13
227.411	205.25
227.866	130.01
228.321	149.43
228.776	173.7
229.23	139.72
229.685	156.71
230.139	166.42
230.594	166.42
231.048	154.28
231.503	127.58
231.957	176.13
232.411	151.85
232.865	161.56
233.32	161.56
233.774	142.14
234.228	163.99
234.682	139.72
235.136	173.7
235.59	156.71
236.044	91.17
236.498	202.82
236.952	86.32
237.406	127.58
237.86	144.57
238.313	161.56
238.767	88.75
239.221	183.41
239.674	180.98
240.128	139.72
240.581	202.82
241.035	115.44
241.488	163.99
241.942	161.56
242.395	197.97
242.848	193.12
243.301	144.57
243.755	173.7
244.208	188.26
244.661	142.14
245.114	117.87
245.567	163.99
246.02	93.6
246.473	122.73
246.926	173.7
247.379	147
247.832	166.42
248.284	66.9
248.737	151.85
249.19	79.04
249.642	166.42
250.095	154.28
250.547	142.14
251	159.13
251.452	139.72
251.905	171.27
252.357	161.56
252.81	214.96
253.262	168.84
253.714	161.56
254.166	127.58
254.618	163.99
255.07	161.56
255.523	168.84
255.975	142.14
256.427	115.44
256.878	176.13
257.33	183.41
257.782	120.3
258.234	100.88
258.686	161.56
259.137	227.1
259.589	159.13
260.041	183.41
260.492	81.46
260.944	183.41
261.395	171.27
261.847	173.7
262.298	173.7
262.749	171.27
263.201	161.56
263.652	125.15
264.103	117.87
264.554	207.68
265.005	161.56
265.457	168.84
265.908	47.48
266.359	236.81
266.809	137.29
267.26	166.42
267.711	176.13
268.162	166.42
268.613	149.43
269.064	166.42
269.514	197.97
269.965	134.86
270.415	117.87
270.866	125.15
271.316	79.04
271.767	122.73
272.217	154.28
272.668	224.67
273.118	149.43
273.568	190.69
274.019	120.3
274.469	108.16
274.919	154.28
275.369	176.13
275.819	132.44
276.269	103.31
276.719	137.29
277.169	197.97
277.619	188.26
278.069	144.57
278.518	251.37
278.968	120.3
279.418	176.13
279.867	159.13
280.317	125.15
280.767	134.86
281.216	176.13
281.666	185.83
282.115	171.27
282.564	168.84
283.014	151.85
283.463	161.56
283.912	159.13
284.361	113.02
284.811	149.43
285.26	193.12
285.709	154.28
286.158	151.85
286.607	168.84
287.056	110.59
287.505	147
287.953	200.4
288.402	190.69
288.851	151.85
289.3	96.03
289.748	100.88
290.197	156.71
290.646	217.39
291.094	197.97
291.543	171.27
291.991	134.86
292.439	122.73
292.888	105.74
293.336	195.54
293.784	71.75
294.233	173.7
294.681	185.83
295.129	161.56
295.577	154.28
296.025	202.82
296.473	193.12
296.921	161.56
297.369	110.59
297.817	93.6
298.264	219.82
298.712	176.13
299.16	185.83
299.608	149.43
300.055	113.02
300.503	168.84
300.95	120.3
301.398	139.72
301.845	122.73
302.293	110.59
302.74	197.97
303.187	166.42
303.635	108.16
304.082	147
304.529	151.85
304.976	134.86
305.423	147
305.87	98.45
306.317	166.42
306.764	127.58
307.211	168.84
307.658	122.73
308.105	168.84
308.552	93.6
308.998	168.84
309.445	190.69
309.892	171.27
310.338	120.3
310.785	115.44
311.231	154.28
311.678	163.99
312.124	202.82
312.571	163.99
313.017	132.44
313.463	168.84
313.909	156.71
314.356	188.26
314.802	212.53
315.248	197.97
315.694	190.69
316.14	86.32
316.586	171.27
317.032	132.44
317.478	132.44
317.923	183.41
318.369	93.6
318.815	142.14
319.261	139.72
319.706	98.45
320.152	134.86
320.597	163.99
321.043	76.61
321.488	132.44
321.934	149.43
322.379	173.7
322.824	113.02
323.27	130.01
323.715	144.57
324.16	147
324.605	200.4
325.05	117.87
325.495	79.04
325.94	144.57
326.385	154.28
326.83	163.99
327.275	190.69
327.72	132.44
328.165	173.7
328.61	171.27
329.054	122.73
329.499	120.3
329.943	139.72
330.388	134.86
330.832	115.44
331.277	96.03
331.721	207.68
332.166	156.71
332.61	176.13
333.054	147
333.499	212.53
333.943	137.29
334.387	180.98
334.831	168.84
335.275	154.28
335.719	205.25
336.163	202.82
336.607	163.99
337.051	62.05
337.495	156.71
337.938	210.11
338.382	173.7
338.826	161.56
339.269	227.1
339.713	79.04
340.157	178.55
340.6	156.71
341.044	214.96
341.487	193.12
341.93	197.97
342.374	139.72
342.817	105.74
343.26	137.29
343.703	142.14
344.146	168.84
344.59	122.73
345.033	185.83
345.476	108.16
345.919	185.83
346.361	132.44
346.804	144.57
347.247	127.58
347.69	144.57
348.133	132.44
348.575	156.71
349.018	147
349.461	161.56
349.903	108.16
350.346	100.88
350.788	147
351.23	144.57
351.673	178.55
352.115	193.12
352.557	142.14
353	139.72
353.442	132.44
353.884	159.13
354.326	176.13
354.768	132.44
355.21	151.85
355.652	193.12
356.094	132.44
356.536	180.98
356.978	105.74
357.419	217.39
357.861	93.6
358.303	224.67
358.744	161.56
359.186	103.31
359.627	154.28
360.069	156.71
360.51	202.82
360.952	132.44
361.393	144.57
361.834	188.26
362.276	139.72
362.717	154.28
363.158	178.55
363.599	176.13
364.04	183.41
364.481	205.25
364.922	139.72
365.363	120.3
365.804	176.13
366.245	163.99
366.686	127.58
367.126	168.84
367.567	154.28
368.008	219.82
368.448	197.97
368.889	105.74
369.33	117.87
369.77	156.71
370.21	190.69
370.651	142.14
371.091	188.26
371.531	144.57
371.972	166.42
372.412	108.16
372.852	185.83
373.292	229.52
373.732	171.27
374.172	171.27
374.612	176.13
375.052	163.99
375.492	144.57
375.932	190.69
376.372	154.28
376.811	212.53
377.251	86.32
377.691	115.44
378.13	144.57
378.57	185.83
379.009	193.12
379.449	137.29
379.888	142.14
380.328	132.44
380.767	154.28
381.206	115.44
381.645	188.26
382.085	166.42
382.524	214.96
382.963	161.56
383.402	151.85
383.841	205.25
384.28	171.27
384.719	115.44
385.158	57.19
385.596	159.13
386.035	147
386.474	96.03
386.913	151.85
387.351	183.41
387.79	154.28
388.228	69.33
388.667	236.81
389.105	139.72
389.544	142.14
389.982	185.83
390.42	132.44
390.859	178.55
391.297	139.72
391.735	193.12
392.173	207.68
392.611	154.28
393.049	127.58
393.487	42.63
393.925	81.46
394.363	156.71
394.801	205.25
395.239	205.25
395.676	76.61
396.114	91.17
396.552	139.72
396.989	134.86
397.427	151.85
397.864	195.54
398.302	176.13
398.739	159.13
399.177	207.68
399.614	159.13
400.051	144.57
400.488	127.58
400.926	108.16
401.363	83.89
401.8	171.27
402.237	171.27
402.674	193.12
403.111	173.7
403.548	156.71
403.985	193.12
404.421	200.4
404.858	137.29
405.295	178.55
405.732	149.43
406.168	207.68
406.605	149.43
407.041	156.71
407.478	166.42
407.914	93.6
408.351	83.89
408.787	120.3
409.223	132.44
409.66	149.43
410.096	144.57
410.532	214.96
410.968	151.85
411.404	142.14
411.84	151.85
412.276	217.39
412.712	234.38
413.148	137.29
413.584	156.71
414.02	168.84
414.455	103.31
414.891	188.26
415.327	210.11
415.762	185.83
416.198	132.44
416.633	193.12
417.069	115.44
417.504	173.7
417.94	149.43
418.375	127.58
418.81	103.31
419.245	149.43
419.681	74.18
420.116	207.68
420.551	103.31
420.986	83.89
421.421	176.13
421.856	156.71
422.291	120.3
422.726	171.27
423.16	96.03
423.595	147
424.03	178.55
424.464	154.28
424.899	185.83
425.334	147
425.768	256.22
426.203	193.12
426.637	163.99
427.071	137.29
427.506	127.58
427.94	115.44
428.374	193.12
428.809	142.14
429.243	180.98
429.677	151.85
430.111	144.57
430.545	166.42
430.979	62.05
431.413	132.44
431.847	210.11
432.28	183.41
432.714	163.99
433.148	117.87
433.582	98.45
434.015	147
434.449	156.71
434.882	171.27
435.316	113.02
435.749	195.54
436.183	127.58
436.616	76.61
437.049	100.88
437.483	205.25
437.916	180.98
438.349	246.51
438.782	219.82
439.215	163.99
439.648	108.16
440.081	173.7
440.514	176.13
440.947	217.39
441.38	171.27
441.813	142.14
442.245	224.67
442.678	178.55
443.111	144.57
443.543	193.12
443.976	193.12
444.408	173.7
444.841	117.87
445.273	122.73
445.705	139.72
446.138	178.55
446.57	173.7
447.002	127.58
447.434	239.23
447.867	200.4
448.299	282.92
448.731	236.81
449.163	139.72
449.595	229.52
450.026	144.57
450.458	171.27
450.89	132.44
451.322	197.97
451.754	76.61
452.185	105.74
452.617	159.13
453.048	144.57
453.48	222.24
453.911	205.25
454.343	227.1
454.774	188.26
455.205	142.14
455.637	197.97
456.068	239.23
456.499	217.39
456.93	253.8
457.361	171.27
457.792	163.99
458.223	180.98
458.654	96.03
459.085	115.44
459.516	197.97
459.947	193.12
460.378	122.73
460.808	219.82
461.239	188.26
461.669	142.14
462.1	212.53
462.531	159.13
462.961	251.37
463.391	156.71
463.822	154.28
464.252	122.73
464.682	139.72
465.113	251.37
465.543	183.41
465.973	171.27
466.403	144.57
466.833	229.52
467.263	246.51
467.693	222.24
468.123	176.13
468.553	154.28
468.983	134.86
469.412	91.17
469.842	173.7
470.272	217.39
470.701	185.83
471.131	202.82
471.56	173.7
471.99	154.28
472.419	144.57
472.849	156.71
473.278	103.31
473.707	180.98
474.136	193.12
474.566	144.57
474.995	171.27
475.424	147
475.853	166.42
476.282	183.41
476.711	180.98
477.14	202.82
477.569	103.31
477.997	185.83
478.426	115.44
478.855	100.88
479.283	183.41
479.712	113.02
480.141	212.53
480.569	176.13
480.998	180.98
481.426	127.58
481.854	197.97
482.283	222.24
482.711	149.43
483.139	117.87
483.567	159.13
483.995	159.13
484.424	183.41
484.852	156.71
485.28	163.99
485.708	210.11
486.135	224.67
486.563	163.99
486.991	188.26
487.419	149.43
487.847	108.16
488.274	147
488.702	113.02
489.129	193.12
489.557	93.6
489.984	137.29
490.412	195.54
490.839	71.75
491.266	190.69
491.694	120.3
492.121	142.14
492.548	263.51
492.975	210.11
493.402	244.09
493.829	197.97
494.256	217.39
494.683	202.82
495.11	178.55
495.537	147
495.964	154.28
496.39	149.43
496.817	166.42
497.244	144.57
497.67	117.87
498.097	183.41
498.523	151.85
498.95	178.55
499.376	91.17
499.803	236.81
500.229	110.59
500.655	168.84
501.081	130.01
501.508	227.1
501.934	195.54
502.36	168.84
502.786	159.13
503.212	244.09
503.638	159.13
504.064	193.12
504.489	139.72
504.915	147
505.341	176.13
505.767	142.14
506.192	142.14
506.618	134.86
507.043	202.82
507.469	168.84
507.894	178.55
508.32	195.54
508.745	251.37
509.17	253.8
509.596	185.83
510.021	195.54
510.446	151.85
510.871	193.12
511.296	83.89
511.721	151.85
512.146	147
512.571	103.31
512.996	151.85
513.421	154.28
513.845	134.86
514.27	147
514.695	159.13
515.119	193.12
515.544	142.14
515.969	113.02
516.393	188.26
516.817	103.31
517.242	166.42
517.666	176.13
518.09	156.71
518.515	236.81
518.939	139.72
519.363	397
519.787	178.55
520.211	161.56
520.635	110.59
521.059	127.58
521.483	130.01
521.907	105.74
522.331	212.53
522.754	130.01
523.178	173.7
523.602	149.43
524.025	149.43
524.449	241.66
524.872	190.69
525.296	166.42
525.719	96.03
526.143	202.82
526.566	115.44
526.989	144.57
527.412	151.85
527.836	224.67
528.259	142.14
528.682	168.84
529.105	183.41
529.528	231.95
529.951	202.82
530.374	163.99
530.796	98.45
531.219	195.54
531.642	134.86
532.065	100.88
532.487	149.43
532.91	139.72
533.332	96.03
533.755	115.44
534.177	163.99
534.6	161.56
535.022	71.75
535.444	149.43
535.867	166.42
536.289	227.1
536.711	180.98
537.133	299.91
537.555	210.11
537.977	202.82
538.399	180.98
538.821	251.37
539.243	180.98
539.665	285.35
540.086	200.4
540.508	178.55
540.93	219.82
541.351	183.41
541.773	137.29
542.195	207.68
542.616	159.13
543.037	193.12
543.459	202.82
543.88	214.96
544.301	183.41
544.723	183.41
545.144	183.41
545.565	185.83
545.986	188.26
546.407	241.66
546.828	173.7
547.249	166.42
547.67	212.53
548.091	163.99
548.512	178.55
548.932	147
549.353	183.41
549.774	197.97
550.194	180.98
550.615	171.27
551.035	147
551.456	176.13
551.876	137.29
552.296	244.09
552.717	108.16
553.137	154.28
553.557	156.71
553.977	178.55
554.397	222.24
554.817	144.57
555.237	137.29
555.657	161.56
556.077	125.15
556.497	161.56
556.917	261.08
557.337	176.13
557.756	258.65
558.176	142.14
558.596	122.73
559.015	115.44
559.435	149.43
559.854	125.15
560.274	154.28
560.693	125.15
561.112	202.82
561.532	219.82
561.951	176.13
562.37	139.72
562.789	108.16
563.208	125.15
563.627	246.51
564.046	144.57
564.465	103.31
564.884	163.99
565.303	207.68
565.722	139.72
566.14	103.31
566.559	144.57
566.978	205.25
567.396	190.69
567.815	190.69
568.233	166.42
568.652	200.4
569.07	190.69
569.489	154.28
569.907	193.12
570.325	139.72
570.743	134.86
571.161	147
571.58	207.68
571.998	176.13
572.416	134.86
572.833	200.4
573.251	183.41
573.669	144.57
574.087	100.88
574.505	98.45
574.922	98.45
575.34	161.56
575.758	193.12
576.175	161.56
576.593	161.56
577.01	234.38
577.428	137.29
577.845	1821.78
578.262	333.89
578.68	212.53
579.097	142.14
579.514	130.01
579.931	166.42
580.348	113.02
580.765	159.13
581.182	122.73
581.599	178.55
582.016	180.98
582.433	91.17
582.849	149.43
583.266	212.53
583.683	134.86
584.099	163.99
584.516	96.03
584.933	180.98
585.349	151.85
585.765	142.14
586.182	190.69
586.598	168.84
587.014	190.69
587.431	134.86
587.847	236.81
588.263	125.15
588.679	144.57
589.095	127.58
589.511	224.67
589.927	180.98
590.343	176.13
590.759	163.99
591.174	144.57
591.59	217.39
592.006	144.57
592.421	120.3
592.837	147
593.252	144.57
593.668	197.97
594.083	180.98
594.499	139.72
594.914	207.68
595.329	120.3
595.745	231.95
596.16	224.67
596.575	217.39
596.99	166.42
597.405	122.73
597.82	163.99
598.235	147
598.65	265.93
599.065	166.42
599.479	173.7
599.894	139.72
600.309	139.72
600.724	183.41
601.138	241.66
601.553	202.82
601.967	115.44
602.382	202.82
602.796	125.15
603.21	229.52
603.625	142.14
604.039	183.41
604.453	163.99
604.867	142.14
605.281	151.85
605.695	163.99
606.109	166.42
606.523	117.87
606.937	151.85
607.351	295.06
607.765	178.55
608.178	202.82
608.592	147
609.006	207.68
609.419	200.4
609.833	256.22
610.246	134.86
610.66	154.28
611.073	147
611.487	178.55
611.9	144.57
612.313	151.85
612.726	227.1
613.139	156.71
613.553	166.42
613.966	202.82
614.379	214.96
614.792	234.38
615.204	202.82
615.617	171.27
616.03	163.99
616.443	154.28
616.856	147
617.268	151.85
617.681	149.43
618.093	202.82
618.506	161.56
618.918	180.98
619.331	241.66
619.743	227.1
620.155	176.13
620.568	134.86
620.98	130.01
621.392	217.39
621.804	222.24
622.216	210.11
622.628	176.13
623.04	139.72
623.452	166.42
623.864	132.44
624.276	217.39
624.687	173.7
625.099	154.28
625.511	197.97
625.922	144.57
626.334	180.98
626.745	144.57
627.157	163.99
627.568	134.86
627.979	154.28
628.391	183.41
628.802	205.25
629.213	144.57
629.624	217.39
630.035	127.58
630.446	227.1
630.857	117.87
631.268	200.4
631.679	147
632.09	134.86
632.501	137.29
632.912	231.95
633.322	224.67
633.733	130.01
634.144	190.69
634.554	159.13
634.965	210.11
635.375	231.95
635.785	246.51
636.196	229.52
636.606	224.67
637.016	193.12
637.427	159.13
637.837	168.84
638.247	117.87
638.657	110.59
639.067	88.75
639.477	132.44
639.887	91.17
640.297	163.99
640.706	200.4
641.116	151.85
641.526	166.42
641.935	193.12
642.345	154.28
642.755	193.12
643.164	88.75
643.573	178.55
643.983	173.7
644.392	159.13
644.801	130.01
645.211	88.75
645.62	149.43
646.029	154.28
646.438	224.67
646.847	205.25
647.256	125.15
647.665	205.25
648.074	222.24
648.483	171.27
648.892	173.7
649.3	130.01
649.709	193.12
650.118	222.24
650.526	142.14
650.935	188.26
651.343	195.54
651.752	219.82
652.16	142.14
652.568	151.85
652.977	147
653.385	168.84
653.793	207.68
654.201	214.96
654.609	132.44
655.017	122.73
655.425	154.28
655.833	210.11
656.241	159.13
656.649	154.28
657.057	134.86
657.464	173.7
657.872	159.13
658.28	149.43
658.687	108.16
659.095	130.01
659.502	190.69
659.91	183.41
660.317	88.75
660.724	168.84
661.132	195.54
661.539	171.27
661.946	163.99
662.353	185.83
662.76	210.11
663.167	176.13
663.574	183.41
663.981	178.55
664.388	163.99
664.795	74.18
665.202	185.83
665.608	159.13
666.015	147
666.422	137.29
666.828	154.28
667.235	137.29
667.641	210.11
668.047	197.97
668.454	147
668.86	197.97
669.266	156.71
669.673	207.68
670.079	248.94
670.485	159.13
670.891	219.82
671.297	147
671.703	161.56
672.109	210.11
672.515	159.13
672.92	127.58
673.326	168.84
673.732	197.97
674.138	137.29
674.543	166.42
674.949	132.44
675.354	166.42
675.76	227.1
676.165	229.52
676.57	125.15
676.976	127.58
677.381	139.72
677.786	113.02
678.191	142.14
678.596	117.87
679.001	171.27
679.406	166.42
679.811	212.53
680.216	188.26
680.621	193.12
681.026	76.61
681.43	130.01
681.835	154.28
682.24	171.27
682.644	163.99
683.049	188.26
683.453	193.12
683.858	156.71
684.262	137.29
684.667	142.14
685.071	134.86
685.475	163.99
685.879	108.16
686.283	185.83
686.687	151.85
687.091	132.44
687.495	105.74
687.899	176.13
688.303	130.01
688.707	163.99
689.111	176.13
689.514	190.69
689.918	219.82
690.322	142.14
690.725	115.44
691.129	207.68
691.532	231.95
691.936	205.25
692.339	229.52
692.742	122.73
693.146	66.9
693.549	91.17
693.952	195.54
694.355	168.84
694.758	195.54
695.161	154.28
695.564	154.28
695.967	122.73
696.37	76.61
696.773	132.44
697.175	137.29
697.578	100.88
697.981	197.97
698.383	185.83
698.786	134.86
699.188	159.13
699.591	134.86
699.993	108.16
700.395	147
700.798	171.27
701.2	219.82
701.602	125.15
702.004	205.25
702.406	183.41
702.808	210.11
703.21	171.27
703.612	151.85
704.014	229.52
704.416	139.72
704.818	149.43
705.219	202.82
705.621	241.66
706.023	142.14
706.424	173.7
706.826	263.51
707.227	190.69
707.629	261.08
708.03	156.71
708.431	127.58
708.832	219.82
709.234	168.84
709.635	183.41
710.036	151.85
710.437	217.39
710.838	180.98
711.239	161.56
711.64	154.28
712.041	202.82
712.441	200.4
712.842	190.69
713.243	222.24
713.643	144.57
714.044	168.84
714.445	210.11
714.845	207.68
715.246	178.55
715.646	253.8
716.046	168.84
716.447	246.51
716.847	183.41
717.247	98.45
717.647	227.1
718.047	251.37
718.447	316.9
718.847	268.36
719.247	324.19
719.647	241.66
720.047	329.04
720.446	231.95
720.846	292.63
721.246	268.36
721.645	241.66
722.045	244.09
722.444	258.65
722.844	338.75
723.243	297.49
723.643	314.48
724.042	256.22
724.441	229.52
724.84	302.34
725.24	312.05
725.639	324.19
726.038	365.45
726.437	307.2
726.836	336.32
727.234	333.89
727.633	380.01
728.032	326.61
728.431	309.62
728.83	438.27
729.228	394.58
729.627	472.25
730.025	457.68
730.424	530.5
730.822	588.75
731.22	598.46
731.619	593.61
732.017	680.99
732.415	702.83
732.813	673.71
733.212	727.1
733.61	775.65
734.008	870.31
734.406	880.02
734.803	969.83
735.201	1062.06
735.599	1188.28
735.997	1130.02
736.395	1185.85
736.792	1363.04
737.19	1418.86
737.587	1481.97
737.985	1472.26
738.382	1627.6
738.78	1731.97
739.177	1773.24
739.574	1785.37
739.971	1931.01
740.369	1909.16
740.766	2132.47
741.163	2161.59
741.56	2275.67
741.957	2297.52
742.354	2324.22
742.751	2520.82
743.147	2501.4
743.544	2656.75
743.941	2875.2
744.338	2940.73
744.734	3096.07
745.131	3360.64
745.527	3496.57
745.924	3571.81
746.32	3952.88
746.716	4207.74
747.113	4486.87
747.509	4710.18
747.905	4797.56
748.301	5035.42
748.697	5435.92
749.093	5756.31
749.489	5848.54
749.885	6030.59
750.281	6506.32
750.677	6637.39
751.073	7054.87
751.468	7673.81
751.864	7982.07
752.26	7705.37
752.655	8042.75
753.051	8644.7
753.446	9329.18
753.842	9620.45
754.237	9533.07
754.632	9727.24
755.028	9601.03
755.423	10030.65
755.818	10280.65
756.213	10232.11
756.608	10050.07
757.003	10139.87
757.398	9909.29
757.793	10406.87
758.188	10287.93
758.583	10547.65
758.977	10312.21
759.372	10348.61
759.767	11387.46
760.161	12365.64
760.556	13297.69
760.95	13892.36
761.345	14130.23
761.739	14945.77
762.133	15533.16
762.527	17292.9
762.922	17836.59
763.316	18538.06
763.71	18215.24
764.104	18086.6
764.498	19627.88
764.892	20691.01
765.286	21725
765.68	21601.22
766.073	21525.97
766.467	21200.72
766.861	22936.19
767.255	25276.03
767.648	26312.45
768.042	26380.42
768.435	26557.6
768.829	25819.73
769.222	27263.93
769.615	28414.43
770.008	29040.65
770.402	28125.59
770.795	27790.63
771.188	28038.21
771.581	27416.84
771.974	28205.69
772.367	28081.9
772.76	28120.73
773.153	25941.09
773.545	24836.7
773.938	25749.34
774.331	27069.75
774.724	27613.45
775.116	28314.91
775.509	28237.24
775.901	28074.62
776.294	29089.2
776.686	31926.62
777.078	34463.07
777.471	35169.39
777.863	35356.28
778.255	35142.69
778.647	35227.64
779.039	37089.32
779.431	37829.62
779.823	39637.9
780.215	39453.44
780.607	36858.73
780.999	37171.85
781.39	38038.36
781.782	39288.38
782.174	40443.74
782.565	40018.98
782.957	39484.99
783.348	40113.64
783.74	40353.93
784.131	40079.66
784.522	41540.85
784.914	41409.78
785.305	39458.29
785.696	37953.41
786.087	37875.74
786.478	37565.06
786.869	36722.81
787.26	36666.98
787.651	34288.31
788.042	32594.11
788.433	30074.65
788.823	29873.19
789.214	29783.38
789.605	28861.04
789.995	26411.97
790.386	24625.53
790.776	24351.26
791.167	24035.72
791.557	25283.31
791.948	26397.41
792.338	27351.31
792.728	27538.2
793.118	27091.59
793.508	27239.65
793.898	28645.01
794.288	30579.51
794.678	30174.16
795.068	29327.06
795.458	28200.83
795.848	27135.28
796.238	27705.68
796.627	28601.32
797.017	28924.15
797.406	29280.95
797.796	28094.04
798.185	27545.48
798.575	28237.24
798.964	29171.72
799.354	30841.65
799.743	30686.31
800.132	30477.57
800.521	29482.41
800.91	29040.65
801.299	29518.81
801.688	30827.09
802.077	31378.07
802.466	31329.52
802.855	29577.07
803.244	28778.51
803.633	27572.18
804.021	27443.54
804.41	28072.19
804.799	27021.2
805.187	25909.54
805.576	25115.83
805.964	23064.83
806.352	21511.41
806.741	21530.83
807.129	21555.1
807.517	21397.33
807.905	21358.49
808.293	21123.05
808.681	21023.54
809.069	21892.48
809.457	23322.12
809.845	23785.72
810.233	24409.51
810.621	23637.66
811.009	22987.16
811.396	22863.37
811.784	23409.5
812.171	23873.1
812.559	24210.48
812.946	23785.72
813.334	23470.18
813.721	22268.7
814.108	21669.18
814.496	22176.47
814.883	22644.92
815.27	23535.71
815.657	22860.94
816.044	22623.08
816.431	22033.26
816.818	22222.58
817.205	22249.28
817.592	23033.28
817.979	22860.94
818.365	22324.53
818.752	20785.67
819.139	19792.94
819.525	19826.92
819.912	19695.85
820.298	19907.01
820.685	19166.71
821.071	18016.21
821.457	17122.99
821.843	16076.86
822.23	14911.79
822.616	15098.69
823.002	14513.73
823.388	14018.57
823.774	13054.97
824.16	12011.26
824.546	11382.61
824.931	11338.92
825.317	11370.47
825.703	11695.72
826.089	11334.07
826.474	11033.09
826.86	10921.44
827.245	10501.53
827.631	10584.05
828.016	10795.22
828.401	10625.32
828.787	10639.88
829.172	9892.3
829.557	9448.11
829.942	9040.34
830.327	8753.93
830.712	8783.06
831.097	8591.3
831.482	8520.92
831.867	8040.33
832.252	7931.1
832.636	7608.28
833.021	7948.09
833.406	7865.57
833.79	7972.36
834.175	7588.86
834.559	7591.29
834.944	7142.25
835.328	6979.63
835.713	6948.08
836.097	6918.95
836.481	6593.7
836.865	6215.05
837.249	6122.82
837.633	5576.69
838.017	5346.11
838.401	5120.38
838.785	5183.48
839.169	5074.26
839.553	5079.11
839.937	4530.56
840.32	4076.67
840.704	3702.88
841.087	3452.88
841.471	3394.62
841.854	3246.56
842.238	3312.1
842.621	3120.35
843.004	3025.68
843.388	2933.45
843.771	2931.02
844.154	2875.2
844.537	2960.15
844.92	3025.68
845.303	2977.14
845.686	2812.09
846.069	2656.75
846.452	2523.25
846.834	2489.27
847.217	2591.21
847.6	2549.95
847.982	2566.94
848.365	2445.58
848.748	2358.2
849.13	2200.43
849.512	2168.87
849.895	2265.96
850.277	2236.84
850.659	2244.12
851.041	2214.99
851.423	2117.9
851.806	2185.87
852.188	2054.8
852.57	1948
852.951	2171.3
853.333	1989.26
853.715	2115.48
854.097	1889.74
854.479	1797.51
854.86	1690.71
855.242	1659.16
855.623	1649.45
856.005	1610.61
856.386	1637.31
856.768	1496.53
857.149	1353.33
857.53	1188.28
857.911	1185.85
858.292	1161.58
858.674	1229.54
859.055	1202.84
859.436	1030.51
859.817	943.13
860.197	916.43
860.578	909.15
860.959	897.01
861.34	853.32
861.72	836.33
862.101	875.17
862.482	853.32
862.862	712.54
863.243	724.68
863.623	746.52
864.003	659.14
864.384	741.67
864.764	702.83
865.144	576.62
865.524	654.29
865.904	605.74
866.284	600.89
866.664	540.21
867.044	501.37
867.424	554.77
867.804	447.97
868.183	445.55
868.563	506.23
868.943	515.94
869.322	525.65
869.702	455.26
870.081	416.42
870.461	438.27
870.84	387.29
871.22	360.59
871.599	423.7
871.978	314.48
872.357	375.16
872.736	312.05
873.115	377.58
873.494	350.89
873.873	256.22
874.252	380.01
874.631	229.52
875.01	299.91
875.388	263.51
875.767	219.82
876.146	268.36
876.524	256.22
876.903	282.92
877.281	190.69
877.66	205.25
878.038	278.07
878.416	234.38
878.794	178.55
879.173	263.51
879.551	246.51
879.929	256.22
880.307	270.79
880.685	197.97
881.063	161.56
881.441	217.39
881.818	231.95
882.196	205.25
882.574	163.99
882.951	154.28
883.329	299.91
883.707	222.24
884.084	168.84
884.461	241.66
884.839	188.26
885.216	173.7
885.593	161.56
885.971	210.11
886.348	205.25
886.725	134.86
887.102	142.14
887.479	236.81
887.856	222.24
888.233	207.68
888.609	130.01
888.986	113.02
889.363	166.42
889.74	149.43
890.116	139.72
890.493	212.53
890.869	149.43
891.246	108.16
891.622	105.74
891.998	180.98
892.375	154.28
892.751	227.1
893.127	207.68
893.503	190.69
893.879	154.28
894.255	197.97
894.631	120.3
895.007	168.84
895.383	134.86
895.759	105.74
896.134	154.28
896.51	263.51
896.886	159.13
897.261	193.12
897.637	166.42
898.012	103.31
898.388	120.3
898.763	183.41
899.138	246.51
899.514	161.56
899.889	200.4
900.264	166.42
900.639	180.98
901.014	142.14
901.389	171.27
901.764	88.75
902.139	234.38
902.513	137.29
902.888	100.88
903.263	132.44
903.638	156.71
904.012	122.73
904.387	178.55
904.761	113.02
905.136	159.13
905.51	110.59
905.884	185.83
906.259	122.73
906.633	200.4
907.007	212.53
907.381	190.69
907.755	151.85
908.129	195.54
908.503	217.39
908.877	173.7
909.251	200.4
909.624	180.98
909.998	125.15
910.372	261.08
910.745	120.3
911.119	74.18
911.492	190.69
911.866	161.56
912.239	142.14
912.612	163.99
912.986	120.3
913.359	180.98
913.732	163.99
914.105	125.15
914.478	161.56
914.851	200.4
915.224	200.4
915.597	168.84
915.97	103.31
916.343	134.86
916.715	161.56
917.088	197.97
917.461	113.02
917.833	159.13
918.206	171.27
918.578	93.6
918.951	166.42
919.323	154.28
919.695	173.7
920.067	219.82
920.44	151.85
920.812	176.13
921.184	163.99
921.556	217.39
921.928	125.15
922.3	159.13
922.672	166.42
923.043	149.43
923.415	91.17
923.787	171.27
924.158	134.86
924.53	132.44
924.901	156.71
925.273	103.31
925.644	217.39
926.016	156.71
926.387	178.55
926.758	108.16
927.129	222.24
927.5	151.85
927.872	180.98
928.243	122.73
928.613	151.85
928.984	81.46
929.355	108.16
929.726	120.3
930.097	79.04
930.467	96.03
930.838	117.87
931.209	149.43
931.579	113.02
931.95	151.85
932.32	190.69
932.69	144.57
933.061	173.7
933.431	134.86
933.801	214.96
934.171	134.86
934.541	108.16
934.911	105.74
935.281	122.73
935.651	222.24
936.021	142.14
936.391	142.14
936.761	171.27
937.13	171.27
937.5	93.6
937.87	127.58
938.239	113.02
938.609	195.54
938.978	134.86
939.347	166.42
939.717	139.72
940.086	166.42
940.455	163.99
940.824	190.69
941.193	183.41
941.562	236.81
941.931	144.57
942.3	185.83
942.669	115.44
943.038	173.7
943.407	144.57
943.775	100.88
944.144	185.83
944.513	166.42
944.881	115.44
945.25	93.6
945.618	91.17
945.986	183.41
946.355	246.51
946.723	166.42
947.091	183.41
947.459	178.55
947.827	69.33
948.195	125.15
948.563	139.72
948.931	214.96
949.299	205.25
949.667	132.44
950.035	178.55
950.402	159.13
950.77	117.87
951.138	207.68
951.505	185.83
951.873	149.43
952.24	210.11
952.607	180.98
952.975	122.73
953.342	139.72
953.709	144.57
954.076	149.43
954.443	117.87
954.81	190.69
955.177	183.41
955.544	171.27
955.911	168.84
956.278	168.84
956.645	178.55
957.012	127.58
957.378	200.4
957.745	156.71
958.111	142.14
958.478	149.43
958.844	200.4
959.211	132.44
959.577	185.83
959.943	115.44
960.309	147
960.675	188.26
961.042	156.71
961.408	149.43
961.774	156.71
962.139	159.13
962.505	147
962.871	130.01
963.237	176.13
963.603	229.52
963.968	113.02
964.334	161.56
964.699	185.83
965.065	130.01
965.43	127.58
965.796	134.86
966.161	117.87
966.526	130.01
966.891	113.02
967.256	173.7
967.622	180.98
967.987	197.97
968.352	205.25
968.716	122.73
969.081	156.71
969.446	149.43
969.811	127.58
970.176	193.12
970.54	188.26
970.905	222.24
971.269	154.28
971.634	96.03
971.998	103.31
972.363	139.72
972.727	173.7
973.091	142.14
973.455	144.57
973.819	185.83
974.183	149.43
974.547	93.6
974.911	120.3
975.275	180.98
975.639	193.12
976.003	115.44
976.367	81.46
976.73	132.44
977.094	100.88
977.458	154.28
977.821	151.85
978.185	151.85
978.548	193.12
978.911	115.44
979.275	154.28
979.638	110.59
980.001	166.42
980.364	193.12
980.727	142.14
981.09	122.73
981.453	100.88
981.816	137.29
982.179	144.57
982.542	127.58
982.905	156.71
983.267	142.14
983.63	93.6
983.992	142.14
984.355	139.72
984.717	171.27
985.08	159.13
985.442	142.14
985.804	166.42
986.167	207.68
986.529	115.44
986.891	176.13
987.253	190.69
987.615	171.27
987.977	120.3
988.339	163.99
988.701	185.83
989.062	163.99
989.424	173.7
989.786	139.72
990.147	134.86
990.509	147
990.87	176.13
991.232	197.97
991.593	125.15
991.955	130.01
992.316	251.37
992.677	130.01
993.038	163.99
993.399	93.6
993.76	154.28
994.121	163.99
994.482	159.13
994.843	62.05
995.204	171.27
995.565	132.44
995.926	113.02
996.286	134.86
996.647	183.41
997.007	171.27
997.368	144.57
997.728	149.43
998.089	205.25
998.449	156.71
998.809	127.58
999.169	105.74
999.53	144.57
999.89	144.57
1000.25	202.82
1000.61	188.26
1000.97	127.58
1001.329	132.44
1001.689	125.15
1002.049	96.03
1002.409	93.6
1002.768	103.31
1003.128	120.3
1003.487	176.13
1003.847	105.74
1004.206	76.61
1004.566	115.44
1004.925	154.28
1005.284	173.7
1005.643	156.71
1006.003	144.57
1006.362	127.58
1006.721	176.13
1007.08	149.43
1007.438	171.27
1007.797	154.28
1008.156	134.86
1008.515	205.25
1008.874	219.82
1009.232	113.02
1009.591	166.42
1009.949	139.72
1010.308	178.55
1010.666	142.14
1011.024	156.71
1011.383	147
1011.741	156.71
1012.099	144.57
1012.457	125.15
1012.815	134.86
1013.173	185.83
1013.531	212.53
1013.889	113.02
1014.247	151.85
1014.605	132.44
1014.962	117.87
1015.32	113.02
1015.678	171.27
1016.035	142.14
1016.393	205.25
1016.75	108.16
1017.107	151.85
1017.465	113.02
1017.822	139.72
1018.179	113.02
1018.536	180.98
1018.894	149.43
1019.251	134.86
1019.608	91.17
1019.964	134.86
1020.321	190.69
1020.678	154.28
1021.035	154.28
1021.392	200.4
1021.748	151.85
1022.105	139.72
1022.461	159.13
1022.818	144.57
1023.174	120.3
1023.531	207.68
1023.887	64.47
1024.243	147
1024.599	210.11
1024.955	159.13
1025.311	103.31
1025.667	81.46
1026.023	130.01
1026.379	120.3
1026.735	154.28
1027.091	166.42
1027.447	156.71
