189.514	89.35
189.973	89.35
190.431	89.35
190.889	-32.01
191.348	-5.31
191.806	9.25
192.264	-34.44
192.722	-22.3
193.18	-24.73
193.638	-49
194.096	-22.3
194.554	-24.73
195.012	9.25
195.47	-7.74
195.928	-58.71
196.385	21.39
196.843	-15.02
197.301	6.83
197.758	23.82
198.216	94.21
198.674	33.53
199.131	69.93
199.589	96.63
200.046	96.63
200.503	31.1
200.961	130.61
201.418	67.51
201.875	86.92
202.332	91.78
202.79	142.75
203.247	198.58
203.704	128.19
204.161	167.02
204.618	135.47
205.075	152.46
205.532	94.21
205.989	106.34
206.445	157.31
206.902	181.59
207.359	171.88
207.816	154.89
208.272	196.15
208.729	125.76
209.185	154.89
209.642	145.18
210.098	145.18
210.555	181.59
211.011	154.89
211.467	108.77
211.924	164.6
212.38	193.72
212.836	111.2
213.292	140.32
213.748	164.6
214.204	159.74
214.66	150.03
215.116	198.58
215.572	116.05
216.028	99.06
216.484	154.89
216.94	201
217.396	111.2
217.851	169.45
218.307	113.62
218.763	67.51
219.218	135.47
219.674	103.92
220.129	147.61
220.585	113.62
221.04	130.61
221.496	184.01
221.951	147.61
222.406	137.9
222.861	137.9
223.317	171.88
223.772	142.75
224.227	152.46
224.682	174.3
225.137	167.02
225.592	196.15
226.047	120.91
226.502	99.06
226.957	234.99
227.411	205.86
227.866	133.04
228.321	154.89
228.776	215.57
229.23	128.19
229.685	181.59
230.139	147.61
230.594	196.15
231.048	159.74
231.503	159.74
231.957	130.61
232.411	169.45
232.865	225.28
233.32	125.76
233.774	130.61
234.228	256.83
234.682	181.59
235.136	118.48
235.59	96.63
236.044	196.15
236.498	169.45
236.952	157.31
237.406	157.31
237.86	152.46
238.313	96.63
238.767	259.26
239.221	162.17
239.674	152.46
240.128	108.77
240.581	162.17
241.035	147.61
241.488	171.88
241.942	215.57
242.395	167.02
242.848	157.31
243.301	123.33
243.755	210.71
244.208	150.03
244.661	130.61
245.114	171.88
245.567	135.47
246.02	142.75
246.473	164.6
246.926	162.17
247.379	103.92
247.832	196.15
248.284	135.47
248.737	113.62
249.19	142.75
249.642	133.04
250.095	152.46
250.547	125.76
251	215.57
251.452	128.19
251.905	123.33
252.357	186.44
252.81	164.6
253.262	174.3
253.714	205.86
254.166	137.9
254.618	171.88
255.07	106.34
255.523	150.03
255.975	157.31
256.427	145.18
256.878	133.04
257.33	125.76
257.782	184.01
258.234	157.31
258.686	230.13
259.137	130.61
259.589	145.18
260.041	140.32
260.492	239.84
260.944	116.05
261.395	130.61
261.847	184.01
262.298	174.3
262.749	191.3
263.201	203.43
263.652	120.91
264.103	171.88
264.554	162.17
265.005	69.93
265.457	171.88
265.908	198.58
266.359	142.75
266.809	118.48
267.26	198.58
267.711	188.87
268.162	142.75
268.613	116.05
269.064	239.84
269.514	162.17
269.965	169.45
270.415	203.43
270.866	154.89
271.316	137.9
271.767	99.06
272.217	79.64
272.668	162.17
273.118	179.16
273.568	96.63
274.019	176.73
274.469	103.92
274.919	55.37
275.369	147.61
275.819	159.74
276.269	188.87
276.719	174.3
277.169	152.46
277.619	99.06
278.069	196.15
278.518	150.03
278.968	125.76
279.418	152.46
279.867	179.16
280.317	84.5
280.767	154.89
281.216	169.45
281.666	174.3
282.115	111.2
282.564	120.91
283.014	108.77
283.463	203.43
283.912	154.89
284.361	72.36
284.811	174.3
285.26	150.03
285.709	157.31
286.158	171.88
286.607	171.88
287.056	77.22
287.505	135.47
287.953	157.31
288.402	140.32
288.851	147.61
289.3	137.9
289.748	181.59
290.197	217.99
290.646	130.61
291.094	154.89
291.543	111.2
291.991	89.35
292.439	82.07
292.888	133.04
293.336	125.76
293.784	99.06
294.233	118.48
294.681	174.3
295.129	137.9
295.577	181.59
296.025	147.61
296.473	191.3
296.921	164.6
297.369	164.6
297.817	159.74
298.264	174.3
298.712	145.18
299.16	120.91
299.608	169.45
300.055	60.23
300.503	111.2
300.95	99.06
301.398	133.04
301.845	130.61
302.293	179.16
302.74	123.33
303.187	150.03
303.635	150.03
304.082	196.15
304.529	157.31
304.976	164.6
305.423	232.56
305.87	164.6
306.317	142.75
306.764	162.17
307.211	145.18
307.658	157.31
308.105	128.19
308.552	89.35
308.998	164.6
309.445	154.89
309.892	210.71
310.338	130.61
310.785	191.3
311.231	84.5
311.678	152.46
312.124	145.18
312.571	169.45
313.017	191.3
313.463	186.44
313.909	186.44
314.356	159.74
314.802	145.18
315.248	179.16
315.694	181.59
316.14	201
316.586	164.6
317.032	116.05
317.478	210.71
317.923	164.6
318.369	239.84
318.815	106.34
319.261	188.87
319.706	164.6
320.152	159.74
320.597	174.3
321.043	181.59
321.488	234.99
321.934	196.15
322.379	108.77
322.824	208.29
323.27	147.61
323.715	164.6
324.16	120.91
324.605	140.32
325.05	181.59
325.495	251.98
325.94	159.74
326.385	247.12
326.83	169.45
327.275	157.31
327.72	203.43
328.165	103.92
328.61	164.6
329.054	152.46
329.499	201
329.943	184.01
330.388	103.92
330.832	130.61
331.277	116.05
331.721	135.47
332.166	191.3
332.61	181.59
333.054	208.29
333.499	147.61
333.943	193.72
334.387	145.18
334.831	184.01
335.275	162.17
335.719	174.3
336.163	103.92
336.607	176.73
337.051	227.7
337.495	120.91
337.938	120.91
338.382	203.43
338.826	154.89
339.269	152.46
339.713	130.61
340.157	145.18
340.6	201
341.044	157.31
341.487	203.43
341.93	135.47
342.374	198.58
342.817	86.92
343.26	128.19
343.703	167.02
344.146	217.99
344.59	193.72
345.033	145.18
345.476	142.75
345.919	150.03
346.361	145.18
346.804	152.46
347.247	169.45
347.69	157.31
348.133	164.6
348.575	159.74
349.018	215.57
349.461	174.3
349.903	159.74
350.346	89.35
350.788	198.58
351.23	157.31
351.673	79.64
352.115	111.2
352.557	150.03
353	142.75
353.442	159.74
353.884	125.76
354.326	147.61
354.768	162.17
355.21	162.17
355.652	157.31
356.094	191.3
356.536	157.31
356.978	157.31
357.419	145.18
357.861	176.73
358.303	242.27
358.744	176.73
359.186	118.48
359.627	118.48
360.069	193.72
360.51	147.61
360.952	116.05
361.393	94.21
361.834	179.16
362.276	152.46
362.717	96.63
363.158	154.89
363.599	142.75
364.04	140.32
364.481	174.3
364.922	152.46
365.363	157.31
365.804	217.99
366.245	164.6
366.686	133.04
367.126	164.6
367.567	167.02
368.008	162.17
368.448	193.72
368.889	140.32
369.33	159.74
369.77	120.91
370.21	157.31
370.651	101.49
371.091	125.76
371.531	135.47
371.972	152.46
372.412	164.6
372.852	118.48
373.292	181.59
373.732	103.92
374.172	152.46
374.612	128.19
375.052	162.17
375.492	164.6
375.932	111.2
376.372	179.16
376.811	215.57
377.251	167.02
377.691	137.9
378.13	157.31
378.57	222.85
379.009	142.75
379.449	137.9
379.888	145.18
380.328	179.16
380.767	145.18
381.206	108.77
381.645	186.44
382.085	103.92
382.524	120.91
382.963	135.47
383.402	213.14
383.841	208.29
384.28	150.03
384.719	133.04
385.158	152.46
385.596	123.33
386.035	186.44
386.474	135.47
386.913	103.92
387.351	201
387.79	179.16
388.228	152.46
388.667	181.59
389.105	142.75
389.544	133.04
389.982	176.73
390.42	147.61
390.859	120.91
391.297	89.35
391.735	188.87
392.173	133.04
392.611	213.14
393.049	150.03
393.487	176.73
393.925	157.31
394.363	215.57
394.801	169.45
395.239	91.78
395.676	145.18
396.114	208.29
396.552	213.14
396.989	164.6
397.427	159.74
397.864	130.61
398.302	152.46
398.739	176.73
399.177	157.31
399.614	135.47
400.051	167.02
400.488	186.44
400.926	176.73
401.363	123.33
401.8	171.88
402.237	111.2
402.674	176.73
403.111	167.02
403.548	169.45
403.985	145.18
404.421	101.49
404.858	123.33
405.295	111.2
405.732	113.62
406.168	159.74
406.605	103.92
407.041	128.19
407.478	150.03
407.914	99.06
408.351	154.89
408.787	108.77
409.223	191.3
409.66	162.17
410.096	167.02
410.532	152.46
410.968	116.05
411.404	176.73
411.84	164.6
412.276	186.44
412.712	215.57
413.148	142.75
413.584	113.62
414.02	67.51
414.455	174.3
414.891	169.45
415.327	137.9
415.762	205.86
416.198	179.16
416.633	205.86
417.069	145.18
417.504	94.21
417.94	133.04
418.375	123.33
418.81	140.32
419.245	101.49
419.681	72.36
420.116	179.16
420.551	259.26
420.986	103.92
421.421	152.46
421.856	140.32
422.291	152.46
422.726	145.18
423.16	152.46
423.595	137.9
424.03	171.88
424.464	210.71
424.899	234.99
425.334	113.62
425.768	201
426.203	101.49
426.637	167.02
427.071	210.71
427.506	167.02
427.94	142.75
428.374	94.21
428.809	154.89
429.243	140.32
429.677	120.91
430.111	205.86
430.545	176.73
430.979	120.91
431.413	152.46
431.847	128.19
432.28	196.15
432.714	164.6
433.148	174.3
433.582	162.17
434.015	152.46
434.449	142.75
434.882	69.93
435.316	215.57
435.749	99.06
436.183	174.3
436.616	133.04
437.049	120.91
437.483	169.45
437.916	157.31
438.349	128.19
438.782	186.44
439.215	120.91
439.648	133.04
440.081	103.92
440.514	169.45
440.947	147.61
441.38	171.88
441.813	205.86
442.245	225.28
442.678	130.61
443.111	137.9
443.543	205.86
443.976	167.02
444.408	99.06
444.841	120.91
445.273	154.89
445.705	191.3
446.138	181.59
446.57	147.61
447.002	208.29
447.434	108.77
447.867	203.43
448.299	215.57
448.731	169.45
449.163	220.42
449.595	239.84
450.026	203.43
450.458	307.8
450.89	237.41
451.322	230.13
451.754	193.72
452.185	201
452.617	217.99
453.048	188.87
453.48	242.27
453.911	220.42
454.343	281.1
454.774	157.31
455.205	205.86
455.637	271.39
456.068	203.43
456.499	305.37
456.93	150.03
457.361	162.17
457.792	186.44
458.223	251.98
458.654	184.01
459.085	198.58
459.516	232.56
459.947	186.44
460.378	171.88
460.808	254.4
461.239	247.12
461.669	205.86
462.1	249.55
462.531	249.55
462.961	174.3
463.391	145.18
463.822	147.61
464.252	237.41
464.682	220.42
465.113	162.17
465.543	135.47
465.973	239.84
466.403	128.19
466.833	288.38
467.263	259.26
467.693	193.72
468.123	203.43
468.553	191.3
468.983	176.73
469.412	210.71
469.842	217.99
470.272	249.55
470.701	239.84
471.131	222.85
471.56	154.89
471.99	142.75
472.419	169.45
472.849	203.43
473.278	135.47
473.707	147.61
474.136	145.18
474.566	167.02
474.995	217.99
475.424	201
475.853	205.86
476.282	210.71
476.711	135.47
477.14	118.48
477.569	157.31
477.997	215.57
478.426	208.29
478.855	164.6
479.283	174.3
479.712	213.14
480.141	242.27
480.569	184.01
480.998	179.16
481.426	176.73
481.854	159.74
482.283	193.72
482.711	230.13
483.139	123.33
483.567	227.7
483.995	259.26
484.424	176.73
484.852	140.32
485.28	123.33
485.708	150.03
486.135	232.56
486.563	137.9
486.991	125.76
487.419	196.15
487.847	130.61
488.274	159.74
488.702	171.88
489.129	210.71
489.557	171.88
489.984	215.57
490.412	181.59
490.839	181.59
491.266	201
491.694	164.6
492.121	201
492.548	193.72
492.975	222.85
493.402	239.84
493.829	174.3
494.256	171.88
494.683	150.03
495.11	181.59
495.537	186.44
495.964	244.69
496.39	215.57
496.817	147.61
497.244	130.61
497.67	147.61
498.097	157.31
498.523	118.48
498.95	145.18
499.376	186.44
499.803	116.05
500.229	118.48
500.655	208.29
501.081	184.01
501.508	60.23
501.934	191.3
502.36	227.7
502.786	174.3
503.212	237.41
503.638	215.57
504.064	162.17
504.489	186.44
504.915	174.3
505.341	176.73
505.767	184.01
506.192	193.72
506.618	108.77
507.043	186.44
507.469	108.77
507.894	152.46
508.32	217.99
508.745	201
509.17	208.29
509.596	222.85
510.021	164.6
510.446	191.3
510.871	154.89
511.296	174.3
511.721	157.31
512.146	193.72
512.571	167.02
512.996	205.86
513.421	164.6
513.845	159.74
514.27	154.89
514.695	196.15
515.119	176.73
515.544	140.32
515.969	201
516.393	108.77
516.817	193.72
517.242	196.15
517.666	159.74
518.09	169.45
518.515	120.91
518.939	234.99
519.363	356.35
519.787	123.33
520.211	222.85
520.635	232.56
521.059	150.03
521.483	179.16
521.907	222.85
522.331	120.91
522.754	193.72
523.178	191.3
523.602	142.75
524.025	222.85
524.449	227.7
524.872	179.16
525.296	164.6
525.719	157.31
526.143	220.42
526.566	196.15
526.989	196.15
527.412	157.31
527.836	152.46
528.259	193.72
528.682	225.28
529.105	220.42
529.528	208.29
529.951	179.16
530.374	203.43
530.796	222.85
531.219	179.16
531.642	196.15
532.065	150.03
532.487	150.03
532.91	116.05
533.332	176.73
533.755	135.47
534.177	106.34
534.6	222.85
535.022	188.87
535.444	108.77
535.867	118.48
536.289	150.03
536.711	157.31
537.133	232.56
537.555	230.13
537.977	176.73
538.399	191.3
538.821	196.15
539.243	162.17
539.665	234.99
540.086	118.48
540.508	135.47
540.93	181.59
541.351	123.33
541.773	181.59
542.195	205.86
542.616	201
543.037	237.41
543.459	188.87
543.88	150.03
544.301	227.7
544.723	133.04
545.144	140.32
545.565	256.83
545.986	215.57
546.407	193.72
546.828	201
547.249	111.2
547.67	128.19
548.091	135.47
548.512	164.6
548.932	186.44
549.353	201
549.774	193.72
550.194	213.14
550.615	217.99
551.035	191.3
551.456	213.14
551.876	188.87
552.296	191.3
552.717	215.57
553.137	150.03
553.557	198.58
553.977	184.01
554.397	193.72
554.817	162.17
555.237	222.85
555.657	210.71
556.077	159.74
556.497	137.9
556.917	220.42
557.337	128.19
557.756	154.89
558.176	128.19
558.596	128.19
559.015	213.14
559.435	101.49
559.854	130.61
560.274	157.31
560.693	142.75
561.112	159.74
561.532	239.84
561.951	193.72
562.37	176.73
562.789	135.47
563.208	152.46
563.627	157.31
564.046	201
564.465	159.74
564.884	147.61
565.303	130.61
565.722	198.58
566.14	217.99
566.559	125.76
566.978	217.99
567.396	220.42
567.815	176.73
568.233	147.61
568.652	232.56
569.07	142.75
569.489	201
569.907	154.89
570.325	133.04
570.743	152.46
571.161	99.06
571.58	184.01
571.998	135.47
572.416	137.9
572.833	157.31
573.251	220.42
573.669	193.72
574.087	205.86
574.505	193.72
574.922	164.6
575.34	188.87
575.758	193.72
576.175	113.62
576.593	179.16
577.01	113.62
577.428	137.9
577.845	1514.13
578.262	259.26
578.68	171.88
579.097	171.88
579.514	179.16
579.931	150.03
580.348	169.45
580.765	196.15
581.182	213.14
581.599	237.41
582.016	159.74
582.433	215.57
582.849	191.3
583.266	244.69
583.683	193.72
584.099	181.59
584.516	106.34
584.933	133.04
585.349	174.3
585.765	150.03
586.182	181.59
586.598	123.33
587.014	171.88
587.431	181.59
587.847	203.43
588.263	140.32
588.679	288.38
589.095	196.15
589.511	154.89
589.927	196.15
590.343	186.44
590.759	130.61
591.174	203.43
591.59	203.43
592.006	203.43
592.421	181.59
592.837	225.28
593.252	188.87
593.668	91.78
594.083	222.85
594.499	159.74
594.914	118.48
595.329	145.18
595.745	125.76
596.16	191.3
596.575	191.3
596.99	239.84
597.405	157.31
597.82	142.75
598.235	142.75
598.65	201
599.065	150.03
599.479	147.61
599.894	130.61
600.309	179.16
600.724	174.3
601.138	133.04
601.553	145.18
601.967	120.91
602.382	135.47
602.796	133.04
603.21	111.2
603.625	171.88
604.039	174.3
604.453	123.33
604.867	142.75
605.281	137.9
605.695	186.44
606.109	203.43
606.523	232.56
606.937	135.47
607.351	239.84
607.765	208.29
608.178	188.87
608.592	135.47
609.006	174.3
609.419	169.45
609.833	191.3
610.246	135.47
610.66	154.89
611.073	169.45
611.487	181.59
611.9	157.31
612.313	162.17
612.726	152.46
613.139	74.79
613.553	108.77
613.966	164.6
614.379	196.15
614.792	217.99
615.204	152.46
615.617	193.72
616.03	169.45
616.443	118.48
616.856	249.55
617.268	118.48
617.681	184.01
618.093	125.76
618.506	137.9
618.918	140.32
619.331	147.61
619.743	89.35
620.155	188.87
620.568	108.77
620.98	137.9
621.392	196.15
621.804	164.6
622.216	157.31
622.628	150.03
623.04	171.88
623.452	237.41
623.864	162.17
624.276	186.44
624.687	154.89
625.099	150.03
625.511	137.9
625.922	137.9
626.334	82.07
626.745	164.6
627.157	193.72
627.568	89.35
627.979	116.05
628.391	176.73
628.802	116.05
629.213	179.16
629.624	210.71
630.035	125.76
630.446	169.45
630.857	186.44
631.268	89.35
631.679	164.6
632.09	208.29
632.501	188.87
632.912	186.44
633.322	176.73
633.733	191.3
634.144	154.89
634.554	135.47
634.965	184.01
635.375	128.19
635.785	196.15
636.196	133.04
636.606	162.17
637.016	74.79
637.427	169.45
637.837	176.73
638.247	154.89
638.657	220.42
639.067	196.15
639.477	191.3
639.887	159.74
640.297	130.61
640.706	171.88
641.116	174.3
641.526	184.01
641.935	157.31
642.345	196.15
642.755	142.75
643.164	220.42
643.573	188.87
643.983	251.98
644.392	133.04
644.801	220.42
645.211	203.43
645.62	130.61
646.029	167.02
646.438	116.05
646.847	171.88
647.256	205.86
647.665	154.89
648.074	154.89
648.483	116.05
648.892	215.57
649.3	174.3
649.709	130.61
650.118	205.86
650.526	154.89
650.935	150.03
651.343	154.89
651.752	116.05
652.16	147.61
652.568	147.61
652.977	169.45
653.385	188.87
653.793	137.9
654.201	203.43
654.609	234.99
655.017	188.87
655.425	128.19
655.833	201
656.241	201
656.649	150.03
657.057	164.6
657.464	232.56
657.872	184.01
658.28	176.73
658.687	164.6
659.095	128.19
659.502	128.19
659.91	135.47
660.317	135.47
660.724	215.57
661.132	169.45
661.539	133.04
661.946	203.43
662.353	179.16
662.76	213.14
663.167	74.79
663.574	145.18
663.981	217.99
664.388	186.44
664.795	116.05
665.202	164.6
665.608	120.91
666.015	167.02
666.422	176.73
666.828	150.03
667.235	113.62
667.641	193.72
668.047	193.72
668.454	184.01
668.86	137.9
669.266	213.14
669.673	171.88
670.079	159.74
670.485	159.74
670.891	101.49
671.297	111.2
671.703	157.31
672.109	142.75
672.515	201
672.92	198.58
673.326	108.77
673.732	133.04
674.138	181.59
674.543	196.15
674.949	125.76
675.354	130.61
675.76	174.3
676.165	111.2
676.57	96.63
676.976	135.47
677.381	142.75
677.786	147.61
678.191	181.59
678.596	227.7
679.001	140.32
679.406	145.18
679.811	176.73
680.216	150.03
680.621	196.15
681.026	220.42
681.43	142.75
681.835	142.75
682.24	169.45
682.644	159.74
683.049	198.58
683.453	140.32
683.858	217.99
684.262	184.01
684.667	171.88
685.071	140.32
685.475	181.59
685.879	213.14
686.283	167.02
686.687	137.9
687.091	135.47
687.495	123.33
687.899	179.16
688.303	171.88
688.707	176.73
689.111	82.07
689.514	225.28
689.918	169.45
690.322	157.31
690.725	174.3
691.129	184.01
691.532	201
691.936	201
692.339	184.01
692.742	254.4
693.146	188.87
693.549	210.71
693.952	210.71
694.355	239.84
694.758	193.72
695.161	157.31
695.564	230.13
695.967	188.87
696.37	227.7
696.773	193.72
697.175	193.72
697.578	174.3
697.981	230.13
698.383	220.42
698.786	116.05
699.188	203.43
699.591	234.99
699.993	213.14
700.395	210.71
700.798	201
701.2	145.18
701.602	234.99
702.004	128.19
702.406	225.28
702.808	198.58
703.21	169.45
703.612	217.99
704.014	256.83
704.416	227.7
704.818	171.88
705.219	198.58
705.621	162.17
706.023	157.31
706.424	154.89
706.826	273.82
707.227	215.57
707.629	205.86
708.03	232.56
708.431	171.88
708.832	222.85
709.234	271.39
709.635	249.55
710.036	135.47
710.437	179.16
710.838	213.14
711.239	295.67
711.64	242.27
712.041	237.41
712.441	244.69
712.842	225.28
713.243	273.82
713.643	264.11
714.044	261.68
714.445	271.39
714.845	271.39
715.246	271.39
715.646	271.39
716.046	266.54
716.447	383.05
716.847	307.8
717.247	276.25
717.647	336.93
718.047	366.06
718.447	358.77
718.847	322.37
719.247	295.67
719.647	395.18
720.047	409.75
720.446	358.77
720.846	353.92
721.246	319.94
721.645	332.07
722.045	385.47
722.444	446.15
722.844	373.34
723.243	373.34
723.643	380.62
724.042	385.47
724.441	453.44
724.84	487.42
725.24	465.57
725.639	419.45
726.038	543.24
726.437	480.13
726.836	538.39
727.234	552.95
727.633	591.79
728.032	618.49
728.431	511.69
728.83	628.2
729.228	579.65
729.627	713.15
730.025	718
730.424	912.18
730.822	730.14
731.22	866.06
731.619	912.18
732.017	931.6
732.415	999.56
732.813	917.03
733.212	1067.52
733.61	1230.15
734.008	1201.02
734.406	1339.37
734.803	1429.18
735.201	1492.29
735.599	1582.09
735.997	1688.89
736.395	1742.29
736.792	1931.61
737.19	1987.44
737.587	2065.11
737.985	2174.34
738.382	2341.81
738.78	2465.6
739.177	2599.1
739.574	2754.44
739.971	2776.29
740.369	3028.72
740.766	3232.6
741.163	3281.15
741.56	3370.96
741.957	3324.84
742.354	3521.44
742.751	3662.22
743.147	3917.08
743.544	4125.82
743.941	4290.87
744.338	4538.45
744.734	4817.58
745.131	5084.58
745.527	5332.15
745.924	5414.68
746.32	5841.87
746.716	5999.64
747.113	6208.38
747.509	6630.72
747.905	6960.82
748.301	7038.49
748.697	7616.17
749.093	7783.65
749.489	8057.92
749.885	8528.8
750.281	8982.69
750.677	9356.49
751.073	9718.14
751.468	9929.31
751.864	10630.78
752.26	10798.26
752.655	11650.21
753.051	11774
753.446	11990.02
753.842	12332.26
754.237	13048.29
754.632	13249.75
755.028	13735.2
755.423	13749.76
755.818	14041.03
756.213	14417.24
756.608	14244.91
757.003	14808.03
757.398	15366.29
757.793	15322.6
758.188	15468.23
758.583	15982.8
758.977	16128.44
759.372	16718.25
759.767	17359.04
760.161	18160.02
760.556	19099.36
760.95	19650.34
761.345	20720.74
761.739	21531.43
762.133	21997.46
762.527	23155.24
762.922	23786.32
763.316	24485.36
763.71	25317.9
764.104	25463.53
764.498	26398.01
764.892	26735.4
765.286	27055.79
765.68	27842.21
766.073	28769.41
766.467	28584.94
766.861	29359.22
767.255	30531.57
767.648	31216.05
768.042	31538.87
768.435	32890.83
768.829	33337.44
769.222	33534.05
769.615	33885.99
770.008	33325.31
770.402	34308.33
770.795	34444.26
771.188	34958.83
771.581	34912.71
771.974	34754.94
772.367	34735.52
772.76	35034.07
773.153	33922.4
773.545	34024.35
773.938	35242.81
774.331	35208.83
774.724	36160.3
775.116	36653.03
775.509	38060.82
775.901	39861.82
776.294	41310.87
776.686	41034.16
777.078	42184.67
777.471	43291.48
777.863	44590.04
778.255	45347.34
778.647	45738.12
779.039	46267.25
779.431	46507.55
779.823	47111.93
780.215	47245.43
780.607	46942.02
780.999	47692.03
781.39	48420.2
781.782	48454.18
782.174	48803.7
782.565	49065.84
782.957	48968.75
783.348	49869.25
783.74	50483.34
784.131	50328
784.522	50825.58
784.914	49990.61
785.305	50114.4
785.696	49378.95
786.087	49121.67
786.478	47842.52
786.869	46645.9
787.26	45747.83
787.651	45684.72
788.042	45289.08
788.433	43653.14
788.823	42342.44
789.214	42541.47
789.605	41157.95
789.995	39769.58
790.386	39966.19
790.776	39580.26
791.167	39653.07
791.557	40167.65
791.948	41077.85
792.338	40667.65
792.728	42541.47
793.118	42626.42
793.508	42539.04
793.898	41988.06
794.288	42371.56
794.678	42497.78
795.068	42090.01
795.458	41757.48
795.848	42519.62
796.238	42565.74
796.627	42286.61
797.017	41929.81
797.406	41944.37
797.796	41876.41
798.185	41745.34
798.575	42759.92
798.964	42043.89
799.354	42563.31
799.743	41849.71
800.132	42708.95
800.521	42590.01
800.91	42196.8
801.299	41747.77
801.688	42813.32
802.077	41199.21
802.466	40400.66
802.855	40570.56
803.244	39929.78
803.633	38888.5
804.021	37852.08
804.41	38276.84
804.799	37682.17
805.187	35711.27
805.576	35502.52
805.964	35325.34
806.352	33271.91
806.741	33128.7
807.129	31953.93
807.517	33121.42
807.905	33031.61
808.293	32116.55
808.681	32427.23
809.069	33259.77
809.457	33407.83
809.845	32245.19
810.233	32970.93
810.621	33504.92
811.009	33152.97
811.396	32922.39
811.784	32946.66
812.171	33735.51
812.559	32694.23
812.946	31417.51
813.334	31689.36
813.721	31847.13
814.108	30281.57
814.496	29723.31
814.883	29902.92
815.27	31344.69
815.657	30223.32
816.044	29135.92
816.431	29342.23
816.818	30084.96
817.205	28533.97
817.592	28237.85
817.979	28298.53
818.365	28368.92
818.752	27495.12
819.139	25708.68
819.525	25126.15
819.912	25917.42
820.298	25347.03
820.685	23669.82
821.071	23191.65
821.457	23701.37
821.843	22606.69
822.23	21072.69
822.616	20181.9
823.002	19747.42
823.388	19487.71
823.774	18434.3
824.16	17390.59
824.546	17072.63
824.931	17781.37
825.317	16876.02
825.703	16096.88
826.089	16082.32
826.474	16676.99
826.86	16036.2
827.245	15271.63
827.631	14854.14
828.016	15562.89
828.401	15276.48
828.787	14659.97
829.172	13778.89
829.557	13703.64
829.942	13791.02
830.327	13482.76
830.712	12832.27
831.097	12434.2
831.482	12383.23
831.867	12388.09
832.252	11771.57
832.636	11252.15
833.021	11050.69
833.406	11642.93
833.79	11237.58
834.175	10400.19
834.559	10456.02
834.944	10256.99
835.328	10142.91
835.713	9596.78
836.097	9106.48
836.481	8951.14
836.865	8919.59
837.249	8856.48
837.633	8188.99
838.017	7596.75
838.401	7616.17
838.785	7863.74
839.169	7281.21
839.553	6669.55
839.937	6528.77
840.32	6271.49
840.704	6176.83
841.087	5630.7
841.471	5281.18
841.854	5312.73
842.238	5276.33
842.621	5232.64
843.004	4977.78
843.388	4652.53
843.771	4815.15
844.154	4926.81
844.537	4929.23
844.92	4613.69
845.303	4482.62
845.686	4295.73
846.069	4489.91
846.452	4407.38
846.834	4026.31
847.217	3972.91
847.6	3815.14
847.982	4237.47
848.365	3795.72
848.748	3514.16
849.13	3351.54
849.512	3504.45
849.895	3387.95
850.277	3453.48
850.659	3290.86
851.041	3069.98
851.423	3065.13
851.806	3215.61
852.188	3150.08
852.57	2980.17
852.951	2875.8
853.333	2742.31
853.715	2773.86
854.097	2812.7
854.479	2625.8
854.86	2339.39
855.242	2232.59
855.623	2239.87
856.005	2269
856.386	2239.87
856.768	2067.54
857.149	1827.24
857.53	1994.72
857.911	2031.13
858.292	1975.3
858.674	1773.84
859.055	1577.24
859.436	1482.58
859.817	1572.38
860.197	1591.8
860.578	1523.84
860.959	1203.45
861.34	1203.45
861.72	1380.63
862.101	1368.5
862.482	1366.07
862.862	1150.05
863.243	1084.51
863.623	1208.3
864.003	1208.3
864.384	1154.9
864.764	1106.36
865.144	963.15
865.524	921.89
865.904	955.87
866.284	989.85
866.664	934.03
867.044	849.07
867.424	827.23
867.804	778.68
868.183	921.89
868.563	844.22
868.943	844.22
869.322	739.85
869.702	625.77
870.081	720.43
870.461	766.55
870.84	778.68
871.22	698.58
871.599	586.93
871.978	528.68
872.357	591.79
872.736	589.36
873.115	516.54
873.494	463.14
873.873	511.69
874.252	463.14
874.631	523.82
875.01	438.87
875.388	448.58
875.767	426.74
876.146	404.89
876.524	368.48
876.903	378.19
877.281	407.32
877.66	339.36
878.038	363.63
878.416	317.51
878.794	383.05
879.173	366.06
879.551	288.38
879.929	290.81
880.307	305.37
880.685	266.54
881.063	259.26
881.441	264.11
881.818	247.12
882.196	307.8
882.574	247.12
882.951	213.14
883.329	276.25
883.707	266.54
884.084	324.79
884.461	285.96
884.839	271.39
885.216	215.57
885.593	242.27
885.971	247.12
886.348	271.39
886.725	259.26
887.102	215.57
887.479	239.84
887.856	264.11
888.233	266.54
888.609	217.99
888.986	205.86
889.363	220.42
889.74	203.43
890.116	179.16
890.493	181.59
890.869	237.41
891.246	254.4
891.622	203.43
891.998	167.02
892.375	171.88
892.751	208.29
893.127	193.72
893.503	285.96
893.879	181.59
894.255	188.87
894.631	213.14
895.007	174.3
895.383	203.43
895.759	203.43
896.134	179.16
896.51	150.03
896.886	145.18
897.261	162.17
897.637	142.75
898.012	118.48
898.388	171.88
898.763	150.03
899.138	191.3
899.514	213.14
899.889	123.33
900.264	135.47
900.639	174.3
901.014	205.86
901.389	201
901.764	125.76
902.139	152.46
902.513	67.51
902.888	179.16
903.263	140.32
903.638	99.06
904.012	128.19
904.387	220.42
904.761	193.72
905.136	201
905.51	147.61
905.884	118.48
906.259	133.04
906.633	125.76
907.007	101.49
907.381	150.03
907.755	220.42
908.129	174.3
908.503	164.6
908.877	152.46
909.251	125.76
909.624	133.04
909.998	99.06
910.372	116.05
910.745	106.34
911.119	133.04
911.492	108.77
911.866	91.78
912.239	176.73
912.612	106.34
912.986	133.04
913.359	147.61
913.732	130.61
914.105	123.33
914.478	135.47
914.851	128.19
915.224	89.35
915.597	157.31
915.97	123.33
916.343	201
916.715	247.12
917.088	130.61
917.461	154.89
917.833	213.14
918.206	174.3
918.578	176.73
918.951	106.34
919.323	108.77
919.695	225.28
920.067	198.58
920.44	113.62
920.812	106.34
921.184	142.75
921.556	188.87
921.928	174.3
922.3	116.05
922.672	154.89
923.043	67.51
923.415	188.87
923.787	133.04
924.158	176.73
924.53	181.59
924.901	179.16
925.273	123.33
925.644	181.59
926.016	193.72
926.387	120.91
926.758	150.03
927.129	154.89
927.5	96.63
927.872	215.57
928.243	164.6
928.613	113.62
928.984	96.63
929.355	154.89
929.726	77.22
930.097	179.16
930.467	86.92
930.838	169.45
931.209	99.06
931.579	99.06
931.95	145.18
932.32	186.44
932.69	188.87
933.061	186.44
933.431	116.05
933.801	145.18
934.171	184.01
934.541	186.44
934.911	140.32
935.281	125.76
935.651	184.01
936.021	184.01
936.391	159.74
936.761	167.02
937.13	125.76
937.5	79.64
937.87	145.18
938.239	184.01
938.609	137.9
938.978	220.42
939.347	198.58
939.717	123.33
940.086	111.2
940.455	118.48
940.824	152.46
941.193	171.88
941.562	181.59
941.931	60.23
942.3	188.87
942.669	167.02
943.038	140.32
943.407	72.36
943.775	157.31
944.144	135.47
944.513	159.74
944.881	133.04
945.25	103.92
945.618	140.32
945.986	174.3
946.355	84.5
946.723	145.18
947.091	196.15
947.459	48.09
947.827	125.76
948.195	147.61
948.563	130.61
948.931	162.17
949.299	137.9
949.667	133.04
950.035	111.2
950.402	130.61
950.77	133.04
951.138	164.6
951.505	140.32
951.873	137.9
952.24	140.32
952.607	91.78
952.975	179.16
953.342	145.18
953.709	152.46
954.076	135.47
954.443	123.33
954.81	171.88
955.177	174.3
955.544	137.9
955.911	169.45
956.278	145.18
956.645	232.56
957.012	222.85
957.378	89.35
957.745	135.47
958.111	181.59
958.478	113.62
958.844	201
959.211	159.74
959.577	120.91
959.943	123.33
960.309	259.26
960.675	169.45
961.042	108.77
961.408	213.14
961.774	96.63
962.139	108.77
962.505	201
962.871	208.29
963.237	111.2
963.603	169.45
963.968	108.77
964.334	174.3
964.699	89.35
965.065	188.87
965.43	157.31
965.796	154.89
966.161	116.05
966.526	123.33
966.891	111.2
967.256	130.61
967.622	91.78
967.987	118.48
968.352	116.05
968.716	120.91
969.081	125.76
969.446	215.57
969.811	103.92
970.176	181.59
970.54	167.02
970.905	157.31
971.269	162.17
971.634	130.61
971.998	140.32
972.363	205.86
972.727	91.78
973.091	152.46
973.455	174.3
973.819	133.04
974.183	179.16
974.547	84.5
974.911	142.75
975.275	130.61
975.639	196.15
976.003	142.75
976.367	133.04
976.73	103.92
977.094	123.33
977.458	157.31
977.821	135.47
978.185	103.92
978.548	184.01
978.911	191.3
979.275	171.88
979.638	99.06
980.001	186.44
980.364	120.91
980.727	135.47
981.09	111.2
981.453	174.3
981.816	152.46
982.179	220.42
982.542	145.18
982.905	157.31
983.267	103.92
983.63	208.29
983.992	108.77
984.355	133.04
984.717	116.05
985.08	169.45
985.442	147.61
985.804	74.79
986.167	171.88
986.529	198.58
986.891	103.92
987.253	130.61
987.615	154.89
987.977	162.17
988.339	159.74
988.701	176.73
989.062	152.46
989.424	89.35
989.786	108.77
990.147	210.71
990.509	108.77
990.87	140.32
991.232	179.16
991.593	171.88
991.955	142.75
992.316	130.61
992.677	65.08
993.038	96.63
993.399	128.19
993.76	152.46
994.121	50.52
994.482	133.04
994.843	193.72
995.204	164.6
995.565	176.73
995.926	103.92
996.286	84.5
996.647	99.06
997.007	101.49
997.368	150.03
997.728	108.77
998.089	174.3
998.449	101.49
998.809	113.62
999.169	169.45
999.53	130.61
999.89	106.34
1000.25	159.74
1000.61	106.34
1000.97	179.16
1001.329	145.18
1001.689	96.63
1002.049	116.05
1002.409	118.48
1002.768	152.46
1003.128	120.91
1003.487	106.34
1003.847	150.03
1004.206	159.74
1004.566	171.88
1004.925	128.19
1005.284	103.92
1005.643	184.01
1006.003	89.35
1006.362	147.61
1006.721	128.19
1007.08	162.17
1007.438	176.73
1007.797	113.62
1008.156	176.73
1008.515	176.73
1008.874	169.45
1009.232	123.33
1009.591	167.02
1009.949	118.48
1010.308	116.05
1010.666	237.41
1011.024	167.02
1011.383	135.47
1011.741	120.91
1012.099	140.32
1012.457	128.19
1012.815	128.19
1013.173	106.34
1013.531	111.2
1013.889	62.65
1014.247	220.42
1014.605	181.59
1014.962	179.16
1015.32	128.19
1015.678	150.03
1016.035	89.35
1016.393	130.61
1016.75	103.92
1017.107	111.2
1017.465	103.92
1017.822	94.21
1018.179	99.06
1018.536	169.45
1018.894	162.17
1019.251	120.91
1019.608	108.77
1019.964	125.76
1020.321	135.47
1020.678	123.33
1021.035	147.61
1021.392	142.75
1021.748	103.92
1022.105	145.18
1022.461	174.3
1022.818	152.46
1023.174	159.74
1023.531	181.59
1023.887	174.3
1024.243	137.9
1024.599	125.76
1024.955	101.49
1025.311	133.04
1025.667	120.91
1026.023	108.77
1026.379	164.6
1026.735	184.01
1027.091	152.46
1027.447	176.73
