189.514	10.62
189.973	10.62
190.431	10.62
190.889	3.34
191.348	-37.93
191.806	-11.23
192.264	-28.22
192.722	20.33
193.18	-11.23
193.638	5.76
194.096	32.46
194.554	-37.93
195.012	27.61
195.47	30.04
195.928	27.61
196.385	51.88
196.843	-28.22
197.301	-37.93
197.758	-71.91
198.216	-67.05
198.674	49.45
199.131	37.32
199.589	5.76
200.046	37.32
200.503	64.02
200.961	42.17
201.418	44.6
201.875	78.58
202.332	105.28
202.79	158.68
203.247	122.27
203.704	134.41
204.161	61.59
204.618	117.42
205.075	136.83
205.532	85.86
205.989	131.98
206.445	127.13
206.902	165.96
207.359	100.43
207.816	190.23
208.272	156.25
208.729	85.86
209.185	112.56
209.642	124.7
210.098	221.79
210.555	204.8
211.011	161.11
211.467	216.93
211.924	127.13
212.38	146.54
212.836	151.4
213.292	136.83
213.748	127.13
214.204	90.72
214.66	195.09
215.116	134.41
215.572	129.55
216.028	163.53
216.484	129.55
216.94	173.24
217.396	119.84
217.851	141.69
218.307	110.14
218.763	124.7
219.218	148.97
219.674	93.14
220.129	156.25
220.585	153.83
221.04	110.14
221.496	102.85
221.951	158.68
222.406	178.1
222.861	98
223.317	85.86
223.772	122.27
224.227	102.85
224.682	93.14
225.137	119.84
225.592	136.83
226.047	158.68
226.502	187.81
226.957	146.54
227.411	153.83
227.866	144.12
228.321	146.54
228.776	146.54
229.23	98
229.685	144.12
230.139	168.39
230.594	144.12
231.048	105.28
231.503	110.14
231.957	85.86
232.411	127.13
232.865	148.97
233.32	59.16
233.774	124.7
234.228	81.01
234.682	100.43
235.136	122.27
235.59	88.29
236.044	127.13
236.498	153.83
236.952	112.56
237.406	102.85
237.86	158.68
238.313	127.13
238.767	175.67
239.221	90.72
239.674	158.68
240.128	117.42
240.581	204.8
241.035	66.45
241.488	81.01
241.942	192.66
242.395	102.85
242.848	187.81
243.301	90.72
243.755	122.27
244.208	124.7
244.661	98
245.114	114.99
245.567	134.41
246.02	100.43
246.473	131.98
246.926	199.94
247.379	98
247.832	136.83
248.284	122.27
248.737	134.41
249.19	95.57
249.642	158.68
250.095	146.54
250.547	139.26
251	192.66
251.452	141.69
251.905	105.28
252.357	66.45
252.81	66.45
253.262	170.82
253.714	214.51
254.166	88.29
254.618	156.25
255.07	146.54
255.523	110.14
255.975	161.11
256.427	98
256.878	119.84
257.33	93.14
257.782	202.37
258.234	156.25
258.686	185.38
259.137	122.27
259.589	102.85
260.041	64.02
260.492	112.56
260.944	54.31
261.395	148.97
261.847	139.26
262.298	148.97
262.749	112.56
263.201	102.85
263.652	124.7
264.103	148.97
264.554	129.55
265.005	83.44
265.457	178.1
265.908	163.53
266.359	61.59
266.809	192.66
267.26	163.53
267.711	124.7
268.162	158.68
268.613	105.28
269.064	110.14
269.514	182.95
269.965	119.84
270.415	195.09
270.866	136.83
271.316	168.39
271.767	231.5
272.217	102.85
272.668	182.95
273.118	146.54
273.568	144.12
274.019	105.28
274.469	112.56
274.919	141.69
275.369	146.54
275.819	112.56
276.269	124.7
276.719	71.3
277.169	59.16
277.619	107.71
278.069	107.71
278.518	146.54
278.968	119.84
279.418	168.39
279.867	146.54
280.317	107.71
280.767	105.28
281.216	180.52
281.666	146.54
282.115	127.13
282.564	100.43
283.014	129.55
283.463	173.24
283.912	100.43
284.361	151.4
284.811	182.95
285.26	119.84
285.709	173.24
286.158	161.11
286.607	158.68
287.056	146.54
287.505	151.4
287.953	64.02
288.402	90.72
288.851	141.69
289.3	202.37
289.748	144.12
290.197	156.25
290.646	165.96
291.094	165.96
291.543	112.56
291.991	98
292.439	207.22
292.888	144.12
293.336	136.83
293.784	59.16
294.233	173.24
294.681	134.41
295.129	114.99
295.577	117.42
296.025	153.83
296.473	212.08
296.921	122.27
297.369	66.45
297.817	76.15
298.264	158.68
298.712	165.96
299.16	64.02
299.608	134.41
300.055	139.26
300.503	144.12
300.95	209.65
301.398	144.12
301.845	124.7
302.293	127.13
302.74	114.99
303.187	122.27
303.635	54.31
304.082	136.83
304.529	88.29
304.976	161.11
305.423	148.97
305.87	168.39
306.317	134.41
306.764	127.13
307.211	187.81
307.658	161.11
308.105	112.56
308.552	107.71
308.998	119.84
309.445	124.7
309.892	209.65
310.338	158.68
310.785	182.95
311.231	197.52
311.678	161.11
312.124	146.54
312.571	119.84
313.017	122.27
313.463	56.74
313.909	100.43
314.356	68.87
314.802	153.83
315.248	151.4
315.694	158.68
316.14	197.52
316.586	199.94
317.032	134.41
317.478	202.37
317.923	202.37
318.369	85.86
318.815	148.97
319.261	165.96
319.706	192.66
320.152	209.65
320.597	144.12
321.043	158.68
321.488	100.43
321.934	114.99
322.379	134.41
322.824	158.68
323.27	148.97
323.715	112.56
324.16	131.98
324.605	141.69
325.05	168.39
325.495	110.14
325.94	182.95
326.385	102.85
326.83	85.86
327.275	105.28
327.72	141.69
328.165	134.41
328.61	173.24
329.054	129.55
329.499	207.22
329.943	178.1
330.388	105.28
330.832	107.71
331.277	178.1
331.721	146.54
332.166	168.39
332.61	136.83
333.054	185.38
333.499	148.97
333.943	163.53
334.387	131.98
334.831	144.12
335.275	175.67
335.719	93.14
336.163	163.53
336.607	105.28
337.051	122.27
337.495	153.83
337.938	81.01
338.382	202.37
338.826	148.97
339.269	141.69
339.713	117.42
340.157	76.15
340.6	136.83
341.044	78.58
341.487	127.13
341.93	178.1
342.374	114.99
342.817	204.8
343.26	153.83
343.703	112.56
344.146	158.68
344.59	153.83
345.033	100.43
345.476	122.27
345.919	88.29
346.361	114.99
346.804	170.82
347.247	170.82
347.69	102.85
348.133	168.39
348.575	114.99
349.018	136.83
349.461	161.11
349.903	73.73
350.346	146.54
350.788	93.14
351.23	124.7
351.673	98
352.115	173.24
352.557	129.55
353	114.99
353.442	64.02
353.884	182.95
354.326	98
354.768	212.08
355.21	124.7
355.652	136.83
356.094	81.01
356.536	146.54
356.978	185.38
357.419	165.96
357.861	100.43
358.303	148.97
358.744	129.55
359.186	122.27
359.627	117.42
360.069	148.97
360.51	144.12
360.952	76.15
361.393	148.97
361.834	197.52
362.276	136.83
362.717	73.73
363.158	95.57
363.599	153.83
364.04	153.83
364.481	131.98
364.922	110.14
365.363	153.83
365.804	168.39
366.245	127.13
366.686	153.83
367.126	122.27
367.567	231.5
368.008	90.72
368.448	173.24
368.889	141.69
369.33	124.7
369.77	197.52
370.21	192.66
370.651	195.09
371.091	144.12
371.531	156.25
371.972	127.13
372.412	124.7
372.852	163.53
373.292	144.12
373.732	168.39
374.172	110.14
374.612	107.71
375.052	182.95
375.492	187.81
375.932	168.39
376.372	124.7
376.811	190.23
377.251	95.57
377.691	122.27
378.13	199.94
378.57	238.78
379.009	185.38
379.449	180.52
379.888	119.84
380.328	134.41
380.767	85.86
381.206	127.13
381.645	95.57
382.085	158.68
382.524	168.39
382.963	122.27
383.402	134.41
383.841	202.37
384.28	93.14
384.719	64.02
385.158	219.36
385.596	76.15
386.035	73.73
386.474	131.98
386.913	122.27
387.351	151.4
387.79	88.29
388.228	39.75
388.667	122.27
389.105	105.28
389.544	114.99
389.982	144.12
390.42	202.37
390.859	114.99
391.297	119.84
391.735	175.67
392.173	71.3
392.611	105.28
393.049	131.98
393.487	117.42
393.925	83.44
394.363	156.25
394.801	107.71
395.239	161.11
395.676	148.97
396.114	136.83
396.552	51.88
396.989	141.69
397.427	90.72
397.864	141.69
398.302	110.14
398.739	122.27
399.177	76.15
399.614	71.3
400.051	180.52
400.488	64.02
400.926	175.67
401.363	144.12
401.8	139.26
402.237	139.26
402.674	98
403.111	119.84
403.548	90.72
403.985	107.71
404.421	85.86
404.858	139.26
405.295	93.14
405.732	127.13
406.168	163.53
406.605	129.55
407.041	139.26
407.478	195.09
407.914	73.73
408.351	163.53
408.787	161.11
409.223	107.71
409.66	134.41
410.096	173.24
410.532	231.5
410.968	144.12
411.404	185.38
411.84	124.7
412.276	144.12
412.712	90.72
413.148	185.38
413.584	131.98
414.02	124.7
414.455	165.96
414.891	134.41
415.327	168.39
415.762	95.57
416.198	180.52
416.633	151.4
417.069	129.55
417.504	136.83
417.94	100.43
418.375	148.97
418.81	144.12
419.245	170.82
419.681	163.53
420.116	139.26
420.551	134.41
420.986	105.28
421.421	204.8
421.856	226.64
422.291	39.75
422.726	85.86
423.16	95.57
423.595	170.82
424.03	100.43
424.464	204.8
424.899	187.81
425.334	127.13
425.768	122.27
426.203	158.68
426.637	175.67
427.071	146.54
427.506	93.14
427.94	83.44
428.374	195.09
428.809	134.41
429.243	85.86
429.677	139.26
430.111	199.94
430.545	148.97
430.979	207.22
431.413	209.65
431.847	161.11
432.28	134.41
432.714	175.67
433.148	95.57
433.582	129.55
434.015	114.99
434.449	146.54
434.882	119.84
435.316	66.45
435.749	134.41
436.183	168.39
436.616	112.56
437.049	114.99
437.483	153.83
437.916	139.26
438.349	153.83
438.782	180.52
439.215	88.29
439.648	134.41
440.081	131.98
440.514	151.4
440.947	139.26
441.38	146.54
441.813	117.42
442.245	158.68
442.678	173.24
443.111	98
443.543	156.25
443.976	105.28
444.408	185.38
444.841	122.27
445.273	178.1
445.705	178.1
446.138	54.31
446.57	102.85
447.002	100.43
447.434	117.42
447.867	122.27
448.299	122.27
448.731	199.94
449.163	117.42
449.595	124.7
450.026	127.13
450.458	190.23
450.89	219.36
451.322	139.26
451.754	148.97
452.185	95.57
452.617	148.97
453.048	141.69
453.48	139.26
453.911	180.52
454.343	168.39
454.774	114.99
455.205	207.22
455.637	216.93
456.068	107.71
456.499	195.09
456.93	122.27
457.361	182.95
457.792	105.28
458.223	141.69
458.654	100.43
459.085	148.97
459.516	195.09
459.947	187.81
460.378	151.4
460.808	212.08
461.239	156.25
461.669	64.02
462.1	170.82
462.531	185.38
462.961	146.54
463.391	129.55
463.822	207.22
464.252	129.55
464.682	219.36
465.113	209.65
465.543	139.26
465.973	163.53
466.403	134.41
466.833	195.09
467.263	192.66
467.693	197.52
468.123	168.39
468.553	153.83
468.983	129.55
469.412	156.25
469.842	119.84
470.272	187.81
470.701	178.1
471.131	151.4
471.56	107.71
471.99	131.98
472.419	161.11
472.849	141.69
473.278	117.42
473.707	110.14
474.136	124.7
474.566	144.12
474.995	139.26
475.424	219.36
475.853	146.54
476.282	195.09
476.711	146.54
477.14	192.66
477.569	141.69
477.997	122.27
478.426	192.66
478.855	146.54
479.283	102.85
479.712	170.82
480.141	180.52
480.569	139.26
480.998	168.39
481.426	119.84
481.854	182.95
482.283	175.67
482.711	229.07
483.139	136.83
483.567	112.56
483.995	190.23
484.424	122.27
484.852	163.53
485.28	212.08
485.708	173.24
486.135	185.38
486.563	173.24
486.991	114.99
487.419	136.83
487.847	170.82
488.274	168.39
488.702	119.84
489.129	165.96
489.557	182.95
489.984	127.13
490.412	148.97
490.839	173.24
491.266	146.54
491.694	163.53
492.121	207.22
492.548	175.67
492.975	185.38
493.402	197.52
493.829	224.21
494.256	83.44
494.683	127.13
495.11	151.4
495.537	161.11
495.964	163.53
496.39	190.23
496.817	221.79
497.244	105.28
497.67	95.57
498.097	195.09
498.523	114.99
498.95	168.39
499.376	163.53
499.803	248.49
500.229	131.98
500.655	158.68
501.081	131.98
501.508	185.38
501.934	134.41
502.36	102.85
502.786	170.82
503.212	151.4
503.638	161.11
504.064	136.83
504.489	95.57
504.915	170.82
505.341	85.86
505.767	175.67
506.192	139.26
506.618	93.14
507.043	146.54
507.469	163.53
507.894	185.38
508.32	95.57
508.745	105.28
509.17	173.24
509.596	102.85
510.021	122.27
510.446	119.84
510.871	148.97
511.296	117.42
511.721	139.26
512.146	170.82
512.571	156.25
512.996	163.53
513.421	136.83
513.845	85.86
514.27	105.28
514.695	170.82
515.119	102.85
515.544	83.44
515.969	175.67
516.393	141.69
516.817	148.97
517.242	148.97
517.666	134.41
518.09	151.4
518.515	146.54
518.939	148.97
519.363	425.67
519.787	175.67
520.211	161.11
520.635	156.25
521.059	90.72
521.483	136.83
521.907	98
522.331	175.67
522.754	136.83
523.178	202.37
523.602	136.83
524.025	153.83
524.449	161.11
524.872	158.68
525.296	98
525.719	190.23
526.143	165.96
526.566	204.8
526.989	139.26
527.412	178.1
527.836	190.23
528.259	224.21
528.682	153.83
529.105	175.67
529.528	129.55
529.951	117.42
530.374	127.13
530.796	59.16
531.219	224.21
531.642	90.72
532.065	59.16
532.487	117.42
532.91	78.58
533.332	76.15
533.755	107.71
534.177	168.39
534.6	182.95
535.022	151.4
535.444	175.67
535.867	139.26
536.289	170.82
536.711	139.26
537.133	178.1
537.555	151.4
537.977	139.26
538.399	117.42
538.821	85.86
539.243	112.56
539.665	180.52
540.086	180.52
540.508	146.54
540.93	148.97
541.351	129.55
541.773	153.83
542.195	76.15
542.616	180.52
543.037	158.68
543.459	141.69
543.88	246.06
544.301	122.27
544.723	127.13
545.144	112.56
545.565	170.82
545.986	199.94
546.407	192.66
546.828	105.28
547.249	131.98
547.67	119.84
548.091	170.82
548.512	112.56
548.932	107.71
549.353	190.23
549.774	114.99
550.194	131.98
550.615	127.13
551.035	175.67
551.456	199.94
551.876	122.27
552.296	107.71
552.717	173.24
553.137	216.93
553.557	151.4
553.977	170.82
554.397	136.83
554.817	165.96
555.237	195.09
555.657	190.23
556.077	173.24
556.497	148.97
556.917	153.83
557.337	141.69
557.756	134.41
558.176	122.27
558.596	88.29
559.015	158.68
559.435	158.68
559.854	117.42
560.274	102.85
560.693	202.37
561.112	195.09
561.532	134.41
561.951	144.12
562.37	197.52
562.789	163.53
563.208	134.41
563.627	110.14
564.046	199.94
564.465	85.86
564.884	117.42
565.303	146.54
565.722	122.27
566.14	134.41
566.559	168.39
566.978	209.65
567.396	136.83
567.815	151.4
568.233	231.5
568.652	163.53
569.07	105.28
569.489	134.41
569.907	209.65
570.325	119.84
570.743	105.28
571.161	66.45
571.58	199.94
571.998	156.25
572.416	192.66
572.833	93.14
573.251	202.37
573.669	178.1
574.087	141.69
574.505	124.7
574.922	146.54
575.34	122.27
575.758	148.97
576.175	146.54
576.593	102.85
577.01	182.95
577.428	204.8
577.845	1848.03
578.262	221.79
578.68	158.68
579.097	180.52
579.514	178.1
579.931	161.11
580.348	178.1
580.765	105.28
581.182	146.54
581.599	185.38
582.016	178.1
582.433	136.83
582.849	153.83
583.266	185.38
583.683	161.11
584.099	131.98
584.516	173.24
584.933	114.99
585.349	117.42
585.765	165.96
586.182	168.39
586.598	161.11
587.014	158.68
587.431	163.53
587.847	114.99
588.263	156.25
588.679	253.34
589.095	168.39
589.511	180.52
589.927	212.08
590.343	158.68
590.759	163.53
591.174	175.67
591.59	175.67
592.006	114.99
592.421	102.85
592.837	182.95
593.252	134.41
593.668	146.54
594.083	107.71
594.499	182.95
594.914	131.98
595.329	122.27
595.745	139.26
596.16	178.1
596.575	178.1
596.99	93.14
597.405	168.39
597.82	129.55
598.235	153.83
598.65	161.11
599.065	165.96
599.479	107.71
599.894	158.68
600.309	199.94
600.724	151.4
601.138	175.67
601.553	204.8
601.967	175.67
602.382	117.42
602.796	95.57
603.21	131.98
603.625	148.97
604.039	163.53
604.453	161.11
604.867	119.84
605.281	180.52
605.695	100.43
606.109	173.24
606.523	129.55
606.937	238.78
607.351	219.36
607.765	112.56
608.178	153.83
608.592	114.99
609.006	76.15
609.419	146.54
609.833	112.56
610.246	107.71
610.66	178.1
611.073	122.27
611.487	195.09
611.9	73.73
612.313	170.82
612.726	178.1
613.139	105.28
613.553	98
613.966	224.21
614.379	144.12
614.792	212.08
615.204	165.96
615.617	83.44
616.03	136.83
616.443	88.29
616.856	175.67
617.268	127.13
617.681	270.33
618.093	141.69
618.506	178.1
618.918	156.25
619.331	134.41
619.743	185.38
620.155	122.27
620.568	95.57
620.98	158.68
621.392	216.93
621.804	221.79
622.216	221.79
622.628	238.78
623.04	136.83
623.452	124.7
623.864	131.98
624.276	207.22
624.687	163.53
625.099	153.83
625.511	139.26
625.922	182.95
626.334	129.55
626.745	170.82
627.157	178.1
627.568	114.99
627.979	105.28
628.391	102.85
628.802	168.39
629.213	127.13
629.624	93.14
630.035	170.82
630.446	161.11
630.857	119.84
631.268	136.83
631.679	185.38
632.09	134.41
632.501	165.96
632.912	170.82
633.322	173.24
633.733	83.44
634.144	180.52
634.554	124.7
634.965	134.41
635.375	161.11
635.785	178.1
636.196	180.52
636.606	73.73
637.016	165.96
637.427	49.45
637.837	190.23
638.247	144.12
638.657	122.27
639.067	231.5
639.477	112.56
639.887	192.66
640.297	231.5
640.706	151.4
641.116	122.27
641.526	144.12
641.935	180.52
642.345	187.81
642.755	136.83
643.164	131.98
643.573	127.13
643.983	161.11
644.392	131.98
644.801	139.26
645.211	153.83
645.62	151.4
646.029	178.1
646.438	102.85
646.847	156.25
647.256	141.69
647.665	107.71
648.074	117.42
648.483	139.26
648.892	173.24
649.3	54.31
649.709	151.4
650.118	175.67
650.526	95.57
650.935	110.14
651.343	163.53
651.752	136.83
652.16	124.7
652.568	112.56
652.977	161.11
653.385	165.96
653.793	195.09
654.201	216.93
654.609	182.95
655.017	173.24
655.425	100.43
655.833	110.14
656.241	151.4
656.649	119.84
657.057	148.97
657.464	144.12
657.872	114.99
658.28	168.39
658.687	187.81
659.095	146.54
659.502	139.26
659.91	144.12
660.317	141.69
660.724	158.68
661.132	139.26
661.539	90.72
661.946	134.41
662.353	156.25
662.76	110.14
663.167	76.15
663.574	117.42
663.981	173.24
664.388	170.82
664.795	98
665.202	122.27
665.608	168.39
666.015	151.4
666.422	136.83
666.828	107.71
667.235	134.41
667.641	122.27
668.047	144.12
668.454	158.68
668.86	165.96
669.266	182.95
669.673	204.8
670.079	219.36
670.485	134.41
670.891	158.68
671.297	100.43
671.703	136.83
672.109	153.83
672.515	148.97
672.92	185.38
673.326	190.23
673.732	229.07
674.138	212.08
674.543	175.67
674.949	180.52
675.354	119.84
675.76	233.92
676.165	146.54
676.57	190.23
676.976	165.96
677.381	114.99
677.786	141.69
678.191	88.29
678.596	122.27
679.001	180.52
679.406	141.69
679.811	165.96
680.216	170.82
680.621	168.39
681.026	107.71
681.43	175.67
681.835	88.29
682.24	170.82
682.644	105.28
683.049	207.22
683.453	139.26
683.858	107.71
684.262	209.65
684.667	187.81
685.071	221.79
685.475	153.83
685.879	124.7
686.283	153.83
686.687	129.55
687.091	141.69
687.495	168.39
687.899	134.41
688.303	173.24
688.707	156.25
689.111	146.54
689.514	88.29
689.918	139.26
690.322	214.51
690.725	202.37
691.129	204.8
691.532	207.22
691.936	180.52
692.339	114.99
692.742	119.84
693.146	178.1
693.549	204.8
693.952	165.96
694.355	163.53
694.758	163.53
695.161	180.52
695.564	139.26
695.967	136.83
696.37	124.7
696.773	90.72
697.175	107.71
697.578	151.4
697.981	136.83
698.383	141.69
698.786	110.14
699.188	182.95
699.591	134.41
699.993	95.57
700.395	207.22
700.798	119.84
701.2	119.84
701.602	168.39
702.004	129.55
702.406	151.4
702.808	148.97
703.21	136.83
703.612	224.21
704.014	141.69
704.416	114.99
704.818	173.24
705.219	236.35
705.621	156.25
706.023	209.65
706.424	178.1
706.826	139.26
707.227	76.15
707.629	131.98
708.03	134.41
708.431	170.82
708.832	131.98
709.234	61.59
709.635	263.05
710.036	277.61
710.437	185.38
710.838	141.69
711.239	170.82
711.64	148.97
712.041	180.52
712.441	195.09
712.842	224.21
713.243	136.83
713.643	202.37
714.044	229.07
714.445	175.67
714.845	233.92
715.246	214.51
715.646	209.65
716.046	238.78
716.447	182.95
716.847	265.48
717.247	265.48
717.647	226.64
718.047	226.64
718.447	212.08
718.847	185.38
719.247	231.5
719.647	248.49
720.047	272.76
720.446	212.08
720.846	224.21
721.246	192.66
721.645	238.78
722.045	258.2
722.444	224.21
722.844	229.07
723.243	267.9
723.643	287.32
724.042	255.77
724.441	280.04
724.84	267.9
725.24	246.06
725.639	316.45
726.038	289.75
726.437	265.48
726.836	348
727.234	282.47
727.633	318.88
728.032	328.59
728.431	350.43
728.83	389.27
729.228	272.76
729.627	479.07
730.025	464.51
730.424	445.09
730.822	503.35
731.22	462.08
731.619	542.18
732.017	581.02
732.415	610.14
732.813	663.54
733.212	709.66
733.61	797.04
734.008	794.61
734.406	835.87
734.803	949.95
735.201	925.68
735.599	1056.75
735.997	1180.54
736.395	1158.7
736.792	1219.38
737.19	1277.63
737.587	1408.7
737.985	1459.67
738.382	1661.13
738.78	1615.01
739.177	1746.08
739.574	1748.51
739.971	1915.99
740.369	1959.68
740.766	2136.87
741.163	2173.27
741.56	2362.6
741.957	2207.26
742.354	2399.01
742.751	2486.39
743.147	2736.39
743.544	2750.95
743.941	2996.1
744.338	3119.89
744.734	3377.18
745.131	3629.61
745.527	3869.9
745.924	4151.46
746.32	4367.48
746.716	4719.43
747.113	4928.17
747.509	5287.4
747.905	5646.63
748.301	5860.22
748.697	6061.68
749.093	6156.35
749.489	6498.58
749.885	6428.19
750.281	7129.66
750.677	7178.21
751.073	7576.27
751.468	7785.01
751.864	8214.63
752.26	7942.78
752.655	8209.78
753.051	8532.6
753.446	9037.46
753.842	8845.71
754.237	8814.15
754.632	9066.59
755.028	8857.84
755.423	8891.83
755.818	8882.12
756.213	8872.41
756.608	8811.73
757.003	8913.67
757.398	8685.51
757.793	8593.28
758.188	8406.38
758.583	8780.17
758.977	8797.16
759.372	9061.73
759.767	9724.36
760.161	10221.94
760.556	10862.73
760.95	11544.78
761.345	12241.39
761.739	13566.66
762.133	14054.53
762.527	14918.62
762.922	16088.54
763.316	17071.56
763.71	17656.52
764.104	18578.87
764.498	19770.64
764.892	20384.72
765.286	21445.42
765.68	22333.78
766.073	23027.97
766.467	23996.43
766.861	25627.52
767.255	27430.95
767.648	28744.08
768.042	28974.66
768.435	30748.96
768.829	31331.49
769.222	32173.74
769.615	33421.33
770.008	32846.08
770.402	32867.93
770.795	33418.91
771.188	34185.91
771.581	33535.41
771.974	32831.52
772.367	31761.11
772.76	32239.28
773.153	30630.03
773.545	29591.18
773.938	29273.21
774.331	29528.07
774.724	29389.72
775.116	30139.73
775.509	30477.11
775.901	31642.18
776.294	31523.25
776.686	32498.99
777.078	32610.64
777.471	33392.21
777.863	33586.38
778.255	33863.09
778.647	33977.17
779.039	34040.27
779.431	33532.99
779.823	32741.71
780.215	32644.62
780.607	31884.9
780.999	32365.49
781.39	32411.61
781.782	32450.44
782.174	32176.17
782.565	32460.15
782.957	32460.15
783.348	33935.9
783.74	33972.31
784.131	33086.38
784.522	33865.51
784.914	33360.65
785.305	33914.06
785.696	34006.29
786.087	34678.63
786.478	34115.52
786.869	32549.96
787.26	32967.44
787.651	31957.72
788.042	31814.51
788.433	30401.87
788.823	30409.15
789.214	29350.88
789.605	29142.14
789.995	27714.93
790.386	27142.11
790.776	27460.08
791.167	27193.08
791.557	27780.47
791.948	29064.47
792.338	30074.19
792.728	31205.28
793.118	32401.9
793.508	32909.19
793.898	33872.8
794.288	34753.88
794.678	34409.21
795.068	34025.71
795.458	33336.38
795.848	33234.44
796.238	33263.56
796.627	32421.32
797.017	32205.29
797.406	31894.61
797.796	31707.71
798.185	31617.91
798.575	31275.67
798.964	31037.8
799.354	31479.56
799.743	29979.53
800.132	29986.81
800.521	30015.94
800.91	30113.03
801.299	29581.47
801.688	28542.62
802.077	27712.51
802.466	27625.13
802.855	27045.02
803.244	25639.66
803.633	24896.93
804.021	24331.39
804.41	23727.01
804.799	22532.81
805.187	21709.99
805.576	20976.96
805.964	20163.85
806.352	18717.22
806.741	18467.22
807.129	17899.25
807.517	18178.38
807.905	18428.38
808.293	18391.97
808.681	19166.26
809.069	19685.68
809.457	21040.07
809.845	20855.6
810.233	21069.2
810.621	22426.02
811.009	22299.8
811.396	22581.36
811.784	23520.69
812.171	23826.52
812.559	23909.05
812.946	24299.83
813.334	24828.97
813.721	24440.61
814.108	24246.43
814.496	24426.05
814.883	24583.82
815.27	25193.05
815.657	25110.52
816.044	25826.55
816.431	26571.71
816.818	25991.61
817.205	25394.51
817.592	25629.95
817.979	25202.76
818.365	25253.73
818.752	24811.98
819.139	23753.71
819.525	23290.11
819.912	22625.05
820.298	21693
820.685	20595.89
821.071	19268.2
821.457	19003.63
821.843	18061.87
822.23	16464.76
822.616	15484.16
823.002	14726.87
823.388	13588.5
823.774	12634.6
824.16	11945.27
824.546	11435.55
824.931	11229.24
825.317	10775.35
825.703	10425.83
826.089	10323.89
826.474	10170.97
826.86	10025.34
827.245	9884.56
827.631	9297.17
828.016	9170.96
828.401	9003.48
828.787	8598.13
829.172	8486.48
829.557	8241.33
829.942	7974.34
830.327	7789.87
830.712	7612.68
831.097	7430.64
831.482	7301.99
831.867	7083.54
832.252	7425.78
832.636	7318.99
833.021	7369.96
833.406	7282.58
833.79	7311.7
834.175	7209.76
834.559	7163.64
834.944	7127.23
835.328	7202.48
835.713	7200.05
836.097	6889.37
836.481	6656.35
836.865	6474.31
837.249	6098.09
837.633	6115.08
838.017	6034.98
838.401	5823.82
838.785	5610.22
839.169	5525.27
839.553	5282.55
839.937	5027.69
840.32	4646.61
840.704	4238.84
841.087	4059.23
841.471	3891.75
841.854	3571.35
842.238	3585.92
842.621	3301.93
843.004	3396.59
843.388	3246.11
843.771	3110.18
844.154	3076.2
844.537	3078.63
844.92	3178.14
845.303	2916
845.686	2848.04
846.069	2658.72
846.452	2801.92
846.834	2622.31
847.217	2653.86
847.6	2583.47
847.982	2379.59
848.365	2304.34
848.748	2190.26
849.13	2088.32
849.512	2165.99
849.895	2020.36
850.277	1979.1
850.659	1993.66
851.041	2030.07
851.423	1962.11
851.806	1930.55
852.188	1855.31
852.57	1794.63
852.951	1789.77
853.333	1792.2
853.715	1738.8
854.097	1753.36
854.479	1634.43
854.86	1661.13
855.242	1542.2
855.623	1486.37
856.005	1479.09
856.386	1406.27
856.768	1367.44
857.149	1394.14
857.53	1253.36
857.911	1250.93
858.292	1214.52
858.674	1132
859.055	1124.71
859.436	1051.9
859.817	1020.34
860.197	1020.34
860.578	915.97
860.959	911.12
861.34	954.81
861.72	852.87
862.101	784.9
862.482	782.48
862.862	789.76
863.243	707.23
863.623	746.07
864.003	639.27
864.384	731.5
864.764	658.69
865.144	617.42
865.524	571.31
865.904	585.87
866.284	527.62
866.664	549.46
867.044	474.22
867.424	566.45
867.804	542.18
868.183	522.76
868.563	479.07
868.943	442.66
869.322	425.67
869.702	437.81
870.081	500.92
870.461	481.5
870.84	428.1
871.22	437.81
871.599	420.82
871.978	413.54
872.357	367.42
872.736	314.02
873.115	326.16
873.494	263.05
873.873	311.59
874.252	246.06
874.631	372.28
875.01	304.31
875.388	255.77
875.767	243.63
876.146	207.22
876.524	277.61
876.903	238.78
877.281	233.92
877.66	197.52
878.038	246.06
878.416	190.23
878.794	163.53
879.173	260.62
879.551	207.22
879.929	124.7
880.307	204.8
880.685	185.38
881.063	173.24
881.441	258.2
881.818	182.95
882.196	163.53
882.574	192.66
882.951	182.95
883.329	243.63
883.707	289.75
884.084	241.21
884.461	199.94
884.839	195.09
885.216	168.39
885.593	117.42
885.971	212.08
886.348	129.55
886.725	134.41
887.102	216.93
887.479	165.96
887.856	161.11
888.233	192.66
888.609	168.39
888.986	202.37
889.363	107.71
889.74	214.51
890.116	114.99
890.493	117.42
890.869	175.67
891.246	114.99
891.622	127.13
891.998	110.14
892.375	127.13
892.751	175.67
893.127	141.69
893.503	151.4
893.879	117.42
894.255	180.52
894.631	129.55
895.007	139.26
895.383	139.26
895.759	131.98
896.134	98
896.51	209.65
896.886	98
897.261	136.83
897.637	141.69
898.012	158.68
898.388	153.83
898.763	161.11
899.138	148.97
899.514	170.82
899.889	98
900.264	158.68
900.639	195.09
901.014	168.39
901.389	187.81
901.764	119.84
902.139	76.15
902.513	165.96
902.888	95.57
903.263	127.13
903.638	66.45
904.012	124.7
904.387	139.26
904.761	182.95
905.136	93.14
905.51	112.56
905.884	32.46
906.259	100.43
906.633	131.98
907.007	148.97
907.381	170.82
907.755	165.96
908.129	117.42
908.503	117.42
908.877	134.41
909.251	153.83
909.624	170.82
909.998	107.71
910.372	83.44
910.745	122.27
911.119	144.12
911.492	156.25
911.866	129.55
912.239	156.25
912.612	156.25
912.986	114.99
913.359	170.82
913.732	165.96
914.105	114.99
914.478	156.25
914.851	105.28
915.224	81.01
915.597	139.26
915.97	56.74
916.343	153.83
916.715	131.98
917.088	197.52
917.461	141.69
917.833	98
918.206	102.85
918.578	129.55
918.951	122.27
919.323	141.69
919.695	170.82
920.067	129.55
920.44	117.42
920.812	112.56
921.184	202.37
921.556	102.85
921.928	93.14
922.3	156.25
922.672	134.41
923.043	141.69
923.415	114.99
923.787	182.95
924.158	122.27
924.53	90.72
924.901	185.38
925.273	124.7
925.644	151.4
926.016	129.55
926.387	187.81
926.758	122.27
927.129	190.23
927.5	151.4
927.872	161.11
928.243	195.09
928.613	158.68
928.984	161.11
929.355	170.82
929.726	153.83
930.097	141.69
930.467	190.23
930.838	180.52
931.209	110.14
931.579	151.4
931.95	136.83
932.32	110.14
932.69	153.83
933.061	129.55
933.431	105.28
933.801	105.28
934.171	117.42
934.541	102.85
934.911	68.87
935.281	110.14
935.651	105.28
936.021	151.4
936.391	131.98
936.761	190.23
937.13	131.98
937.5	112.56
937.87	144.12
938.239	117.42
938.609	64.02
938.978	192.66
939.347	30.04
939.717	134.41
940.086	170.82
940.455	139.26
940.824	102.85
941.193	124.7
941.562	131.98
941.931	98
942.3	173.24
942.669	59.16
943.038	64.02
943.407	151.4
943.775	192.66
944.144	204.8
944.513	158.68
944.881	32.46
945.25	119.84
945.618	199.94
945.986	204.8
946.355	190.23
946.723	161.11
947.091	127.13
947.459	112.56
947.827	180.52
948.195	112.56
948.563	146.54
948.931	105.28
949.299	144.12
949.667	153.83
950.035	163.53
950.402	117.42
950.77	93.14
951.138	88.29
951.505	146.54
951.873	161.11
952.24	139.26
952.607	117.42
952.975	156.25
953.342	144.12
953.709	78.58
954.076	90.72
954.443	93.14
954.81	207.22
955.177	129.55
955.544	51.88
955.911	165.96
956.278	146.54
956.645	151.4
957.012	47.03
957.378	90.72
957.745	119.84
958.111	117.42
958.478	156.25
958.844	129.55
959.211	112.56
959.577	146.54
959.943	165.96
960.309	158.68
960.675	119.84
961.042	153.83
961.408	122.27
961.774	127.13
962.139	107.71
962.505	178.1
962.871	90.72
963.237	197.52
963.603	112.56
963.968	119.84
964.334	195.09
964.699	165.96
965.065	124.7
965.43	141.69
965.796	110.14
966.161	131.98
966.526	158.68
966.891	151.4
967.256	49.45
967.622	139.26
967.987	95.57
968.352	151.4
968.716	107.71
969.081	110.14
969.446	122.27
969.811	107.71
970.176	170.82
970.54	212.08
970.905	190.23
971.269	134.41
971.634	195.09
971.998	161.11
972.363	114.99
972.727	136.83
973.091	141.69
973.455	136.83
973.819	180.52
974.183	129.55
974.547	112.56
974.911	122.27
975.275	170.82
975.639	98
976.003	173.24
976.367	127.13
976.73	139.26
977.094	117.42
977.458	114.99
977.821	122.27
978.185	141.69
978.548	141.69
978.911	112.56
979.275	151.4
979.638	93.14
980.001	129.55
980.364	146.54
980.727	81.01
981.09	37.32
981.453	151.4
981.816	175.67
982.179	173.24
982.542	148.97
982.905	131.98
983.267	114.99
983.63	197.52
983.992	175.67
984.355	161.11
984.717	76.15
985.08	136.83
985.442	98
985.804	88.29
986.167	158.68
986.529	158.68
986.891	139.26
987.253	182.95
987.615	134.41
987.977	93.14
988.339	187.81
988.701	146.54
989.062	122.27
989.424	161.11
989.786	105.28
990.147	136.83
990.509	93.14
990.87	144.12
991.232	178.1
991.593	178.1
991.955	66.45
992.316	178.1
992.677	170.82
993.038	146.54
993.399	163.53
993.76	124.7
994.121	112.56
994.482	156.25
994.843	98
995.204	148.97
995.565	127.13
995.926	158.68
996.286	153.83
996.647	71.3
997.007	56.74
997.368	107.71
997.728	136.83
998.089	131.98
998.449	90.72
998.809	151.4
999.169	117.42
999.53	73.73
999.89	136.83
1000.25	47.03
1000.61	182.95
1000.97	151.4
1001.329	66.45
1001.689	153.83
1002.049	173.24
1002.409	156.25
1002.768	207.22
1003.128	192.66
1003.487	187.81
1003.847	148.97
1004.206	127.13
1004.566	90.72
1004.925	144.12
1005.284	187.81
1005.643	175.67
1006.003	122.27
1006.362	83.44
1006.721	117.42
1007.08	151.4
1007.438	98
1007.797	124.7
1008.156	173.24
1008.515	66.45
1008.874	117.42
1009.232	54.31
1009.591	54.31
1009.949	148.97
1010.308	146.54
1010.666	163.53
1011.024	185.38
1011.383	32.46
1011.741	100.43
1012.099	93.14
1012.457	134.41
1012.815	105.28
1013.173	110.14
1013.531	90.72
1013.889	146.54
1014.247	212.08
1014.605	195.09
1014.962	139.26
1015.32	129.55
1015.678	161.11
1016.035	95.57
1016.393	102.85
1016.75	156.25
1017.107	124.7
1017.465	78.58
1017.822	119.84
1018.179	224.21
1018.536	146.54
1018.894	158.68
1019.251	141.69
1019.608	139.26
1019.964	81.01
1020.321	117.42
1020.678	182.95
1021.035	182.95
1021.392	255.77
1021.748	146.54
1022.105	141.69
1022.461	124.7
1022.818	127.13
1023.174	59.16
1023.531	107.71
1023.887	129.55
1024.243	131.98
1024.599	185.38
1024.955	122.27
1025.311	158.68
1025.667	61.59
1026.023	110.14
1026.379	144.12
1026.735	153.83
1027.091	139.26
1027.447	141.69
