189.514	87.08
189.973	87.08
190.431	87.08
190.889	-34.28
191.348	-19.72
191.806	-77.97
192.264	-43.99
192.722	16.69
193.18	-19.72
193.638	-46.42
194.096	-24.58
194.554	-24.58
195.012	23.97
195.47	43.39
195.928	-43.99
196.385	23.97
196.843	-7.59
197.301	26.4
197.758	38.53
198.216	-7.59
198.674	19.11
199.131	26.4
199.589	74.94
200.046	19.11
200.503	104.07
200.961	89.5
201.418	33.68
201.875	26.4
202.332	167.17
202.79	89.5
203.247	128.34
203.704	184.17
204.161	108.92
204.618	172.03
205.075	142.9
205.532	133.19
205.989	135.62
206.445	157.47
206.902	167.17
207.359	218.15
207.816	140.48
208.272	193.87
208.729	113.78
209.185	128.34
209.642	91.93
210.098	87.08
210.555	157.47
211.011	36.1
211.467	140.48
211.924	89.5
212.38	167.17
212.836	108.92
213.292	101.64
213.748	74.94
214.204	186.59
214.66	186.59
215.116	133.19
215.572	50.67
216.028	111.35
216.484	133.19
216.94	94.36
217.396	181.74
217.851	40.96
218.307	162.32
218.763	125.91
219.218	84.65
219.674	150.18
220.129	125.91
220.585	140.48
221.04	152.61
221.496	152.61
221.951	155.04
222.406	108.92
222.861	77.37
223.317	138.05
223.772	181.74
224.227	138.05
224.682	138.05
225.137	101.64
225.592	62.8
226.047	152.61
226.502	125.91
226.957	125.91
227.411	189.02
227.866	140.48
228.321	55.52
228.776	130.77
229.23	157.47
229.685	193.87
230.139	113.78
230.594	128.34
231.048	142.9
231.503	155.04
231.957	111.35
232.411	116.2
232.865	111.35
233.32	135.62
233.774	116.2
234.228	62.8
234.682	145.33
235.136	125.91
235.59	74.94
236.044	123.48
236.498	164.75
236.952	87.08
237.406	96.79
237.86	121.06
238.313	28.82
238.767	135.62
239.221	142.9
239.674	138.05
240.128	72.51
240.581	157.47
241.035	147.76
241.488	135.62
241.942	186.59
242.395	176.88
242.848	104.07
243.301	108.92
243.755	145.33
244.208	57.95
244.661	94.36
245.114	142.9
245.567	101.64
246.02	36.1
246.473	138.05
246.926	89.5
247.379	142.9
247.832	176.88
248.284	145.33
248.737	128.34
249.19	70.09
249.642	128.34
250.095	121.06
250.547	84.65
251	79.79
251.452	82.22
251.905	96.79
252.357	77.37
252.81	145.33
253.262	101.64
253.714	176.88
254.166	84.65
254.618	135.62
255.07	215.72
255.523	125.91
255.975	113.78
256.427	172.03
256.878	121.06
257.33	164.75
257.782	196.3
258.234	210.86
258.686	152.61
259.137	155.04
259.589	130.77
260.041	145.33
260.492	123.48
260.944	162.32
261.395	106.49
261.847	220.57
262.298	157.47
262.749	164.75
263.201	121.06
263.652	91.93
264.103	133.19
264.554	157.47
265.005	121.06
265.457	128.34
265.908	140.48
266.359	179.31
266.809	152.61
267.26	196.3
267.711	135.62
268.162	128.34
268.613	157.47
269.064	70.09
269.514	101.64
269.965	135.62
270.415	193.87
270.866	89.5
271.316	101.64
271.767	142.9
272.217	152.61
272.668	179.31
273.118	121.06
273.568	157.47
274.019	74.94
274.469	77.37
274.919	152.61
275.369	133.19
275.819	172.03
276.269	77.37
276.719	111.35
277.169	125.91
277.619	123.48
278.069	123.48
278.518	159.89
278.968	94.36
279.418	155.04
279.867	130.77
280.317	125.91
280.767	116.2
281.216	164.75
281.666	167.17
282.115	201.16
282.564	172.03
283.014	82.22
283.463	104.07
283.912	140.48
284.361	118.63
284.811	128.34
285.26	91.93
285.709	113.78
286.158	198.73
286.607	121.06
287.056	142.9
287.505	172.03
287.953	152.61
288.402	96.79
288.851	152.61
289.3	147.76
289.748	223
290.197	96.79
290.646	164.75
291.094	247.27
291.543	82.22
291.991	123.48
292.439	108.92
292.888	118.63
293.336	79.79
293.784	106.49
294.233	106.49
294.681	133.19
295.129	99.21
295.577	155.04
296.025	172.03
296.473	125.91
296.921	193.87
297.369	113.78
297.817	125.91
298.264	99.21
298.712	191.45
299.16	145.33
299.608	150.18
300.055	121.06
300.503	125.91
300.95	176.88
301.398	152.61
301.845	162.32
302.293	174.46
302.74	162.32
303.187	155.04
303.635	36.1
304.082	186.59
304.529	145.33
304.976	155.04
305.423	125.91
305.87	106.49
306.317	84.65
306.764	101.64
307.211	157.47
307.658	84.65
308.105	239.99
308.552	162.32
308.998	150.18
309.445	94.36
309.892	164.75
310.338	150.18
310.785	142.9
311.231	70.09
311.678	94.36
312.124	191.45
312.571	162.32
313.017	140.48
313.463	179.31
313.909	133.19
314.356	121.06
314.802	106.49
315.248	172.03
315.694	89.5
316.14	87.08
316.586	179.31
317.032	142.9
317.478	150.18
317.923	111.35
318.369	223
318.815	155.04
319.261	142.9
319.706	104.07
320.152	191.45
320.597	145.33
321.043	89.5
321.488	186.59
321.934	123.48
322.379	123.48
322.824	130.77
323.27	87.08
323.715	113.78
324.16	196.3
324.605	123.48
325.05	28.82
325.495	130.77
325.94	84.65
326.385	79.79
326.83	84.65
327.275	106.49
327.72	179.31
328.165	118.63
328.61	176.88
329.054	133.19
329.499	108.92
329.943	162.32
330.388	142.9
330.832	164.75
331.277	147.76
331.721	133.19
332.166	169.6
332.61	142.9
333.054	174.46
333.499	111.35
333.943	152.61
334.387	125.91
334.831	128.34
335.275	152.61
335.719	101.64
336.163	138.05
336.607	140.48
337.051	152.61
337.495	157.47
337.938	138.05
338.382	150.18
338.826	123.48
339.269	162.32
339.713	167.17
340.157	138.05
340.6	116.2
341.044	176.88
341.487	167.17
341.93	101.64
342.374	179.31
342.817	155.04
343.26	201.16
343.703	111.35
344.146	167.17
344.59	181.74
345.033	96.79
345.476	108.92
345.919	150.18
346.361	150.18
346.804	104.07
347.247	227.86
347.69	133.19
348.133	157.47
348.575	150.18
349.018	176.88
349.461	101.64
349.903	157.47
350.346	140.48
350.788	140.48
351.23	140.48
351.673	87.08
352.115	74.94
352.557	111.35
353	172.03
353.442	142.9
353.884	79.79
354.326	140.48
354.768	87.08
355.21	179.31
355.652	142.9
356.094	206.01
356.536	172.03
356.978	121.06
357.419	206.01
357.861	67.66
358.303	118.63
358.744	162.32
359.186	125.91
359.627	106.49
360.069	164.75
360.51	159.89
360.952	157.47
361.393	121.06
361.834	140.48
362.276	186.59
362.717	167.17
363.158	169.6
363.599	145.33
364.04	77.37
364.481	147.76
364.922	169.6
365.363	113.78
365.804	201.16
366.245	84.65
366.686	65.23
367.126	133.19
367.567	157.47
368.008	99.21
368.448	164.75
368.889	159.89
369.33	118.63
369.77	130.77
370.21	130.77
370.651	140.48
371.091	130.77
371.531	152.61
371.972	203.58
372.412	118.63
372.852	123.48
373.292	176.88
373.732	121.06
374.172	179.31
374.612	108.92
375.052	140.48
375.492	169.6
375.932	128.34
376.372	172.03
376.811	189.02
377.251	164.75
377.691	184.17
378.13	113.78
378.57	244.85
379.009	164.75
379.449	142.9
379.888	94.36
380.328	152.61
380.767	104.07
381.206	106.49
381.645	84.65
382.085	162.32
382.524	179.31
382.963	150.18
383.402	162.32
383.841	172.03
384.28	96.79
384.719	138.05
385.158	155.04
385.596	145.33
386.035	104.07
386.474	113.78
386.913	111.35
387.351	123.48
387.79	184.17
388.228	145.33
388.667	123.48
389.105	121.06
389.544	147.76
389.982	89.5
390.42	130.77
390.859	74.94
391.297	167.17
391.735	179.31
392.173	118.63
392.611	191.45
393.049	191.45
393.487	57.95
393.925	169.6
394.363	72.51
394.801	79.79
395.239	167.17
395.676	99.21
396.114	121.06
396.552	138.05
396.989	142.9
397.427	130.77
397.864	128.34
398.302	116.2
398.739	162.32
399.177	111.35
399.614	70.09
400.051	155.04
400.488	113.78
400.926	150.18
401.363	140.48
401.8	167.17
402.237	184.17
402.674	123.48
403.111	150.18
403.548	96.79
403.985	77.37
404.421	53.1
404.858	104.07
405.295	206.01
405.732	150.18
406.168	108.92
406.605	145.33
407.041	128.34
407.478	174.46
407.914	116.2
408.351	45.81
408.787	133.19
409.223	118.63
409.66	65.23
410.096	157.47
410.532	157.47
410.968	130.77
411.404	150.18
411.84	155.04
412.276	232.71
412.712	106.49
413.148	94.36
413.584	38.53
414.02	157.47
414.455	104.07
414.891	89.5
415.327	128.34
415.762	138.05
416.198	94.36
416.633	99.21
417.069	123.48
417.504	108.92
417.94	167.17
418.375	138.05
418.81	104.07
419.245	125.91
419.681	172.03
420.116	99.21
420.551	91.93
420.986	164.75
421.421	116.2
421.856	179.31
422.291	106.49
422.726	104.07
423.16	169.6
423.595	128.34
424.03	108.92
424.464	118.63
424.899	116.2
425.334	147.76
425.768	116.2
426.203	111.35
426.637	128.34
427.071	116.2
427.506	79.79
427.94	128.34
428.374	142.9
428.809	155.04
429.243	113.78
429.677	135.62
430.111	150.18
430.545	118.63
430.979	167.17
431.413	89.5
431.847	145.33
432.28	111.35
432.714	108.92
433.148	106.49
433.582	164.75
434.015	101.64
434.449	116.2
434.882	91.93
435.316	74.94
435.749	167.17
436.183	179.31
436.616	116.2
437.049	147.76
437.483	121.06
437.916	206.01
438.349	174.46
438.782	128.34
439.215	121.06
439.648	147.76
440.081	159.89
440.514	118.63
440.947	121.06
441.38	118.63
441.813	164.75
442.245	118.63
442.678	118.63
443.111	150.18
443.543	118.63
443.976	169.6
444.408	152.61
444.841	223
445.273	157.47
445.705	159.89
446.138	167.17
446.57	147.76
447.002	89.5
447.434	94.36
447.867	147.76
448.299	142.9
448.731	118.63
449.163	147.76
449.595	87.08
450.026	152.61
450.458	108.92
450.89	191.45
451.322	142.9
451.754	128.34
452.185	181.74
452.617	167.17
453.048	157.47
453.48	210.86
453.911	198.73
454.343	145.33
454.774	74.94
455.205	198.73
455.637	138.05
456.068	130.77
456.499	157.47
456.93	176.88
457.361	128.34
457.792	140.48
458.223	147.76
458.654	164.75
459.085	118.63
459.516	181.74
459.947	128.34
460.378	128.34
460.808	179.31
461.239	220.57
461.669	111.35
462.1	193.87
462.531	138.05
462.961	138.05
463.391	208.44
463.822	157.47
464.252	140.48
464.682	87.08
465.113	138.05
465.543	91.93
465.973	164.75
466.403	140.48
466.833	196.3
467.263	99.21
467.693	176.88
468.123	142.9
468.553	150.18
468.983	142.9
469.412	145.33
469.842	82.22
470.272	186.59
470.701	176.88
471.131	104.07
471.56	164.75
471.99	152.61
472.419	164.75
472.849	123.48
473.278	133.19
473.707	162.32
474.136	111.35
474.566	179.31
474.995	189.02
475.424	142.9
475.853	155.04
476.282	106.49
476.711	184.17
477.14	169.6
477.569	133.19
477.997	111.35
478.426	87.08
478.855	125.91
479.283	167.17
479.712	181.74
480.141	106.49
480.569	172.03
480.998	179.31
481.426	70.09
481.854	96.79
482.283	133.19
482.711	159.89
483.139	206.01
483.567	201.16
483.995	130.77
484.424	157.47
484.852	84.65
485.28	155.04
485.708	186.59
486.135	155.04
486.563	169.6
486.991	184.17
487.419	125.91
487.847	123.48
488.274	206.01
488.702	138.05
489.129	172.03
489.557	150.18
489.984	138.05
490.412	155.04
490.839	201.16
491.266	203.58
491.694	135.62
492.121	210.86
492.548	206.01
492.975	196.3
493.402	152.61
493.829	172.03
494.256	138.05
494.683	147.76
495.11	91.93
495.537	138.05
495.964	150.18
496.39	142.9
496.817	123.48
497.244	106.49
497.67	142.9
498.097	159.89
498.523	79.79
498.95	104.07
499.376	198.73
499.803	135.62
500.229	181.74
500.655	157.47
501.081	130.77
501.508	140.48
501.934	176.88
502.36	140.48
502.786	147.76
503.212	121.06
503.638	113.78
504.064	135.62
504.489	142.9
504.915	108.92
505.341	157.47
505.767	193.87
506.192	145.33
506.618	118.63
507.043	196.3
507.469	89.5
507.894	60.38
508.32	142.9
508.745	203.58
509.17	130.77
509.596	121.06
510.021	118.63
510.446	108.92
510.871	135.62
511.296	96.79
511.721	104.07
512.146	145.33
512.571	162.32
512.996	121.06
513.421	135.62
513.845	150.18
514.27	118.63
514.695	142.9
515.119	157.47
515.544	116.2
515.969	155.04
516.393	89.5
516.817	96.79
517.242	142.9
517.666	172.03
518.09	155.04
518.515	94.36
518.939	48.24
519.363	271.55
519.787	140.48
520.211	130.77
520.635	186.59
521.059	123.48
521.483	133.19
521.907	99.21
522.331	106.49
522.754	135.62
523.178	113.78
523.602	101.64
524.025	140.48
524.449	152.61
524.872	191.45
525.296	150.18
525.719	189.02
526.143	72.51
526.566	164.75
526.989	130.77
527.412	225.43
527.836	118.63
528.259	142.9
528.682	118.63
529.105	162.32
529.528	193.87
529.951	162.32
530.374	84.65
530.796	128.34
531.219	118.63
531.642	159.89
532.065	113.78
532.487	147.76
532.91	65.23
533.332	140.48
533.755	130.77
534.177	84.65
534.6	140.48
535.022	108.92
535.444	157.47
535.867	135.62
536.289	72.51
536.711	152.61
537.133	140.48
537.555	150.18
537.977	135.62
538.399	193.87
538.821	164.75
539.243	186.59
539.665	159.89
540.086	172.03
540.508	138.05
540.93	172.03
541.351	135.62
541.773	201.16
542.195	140.48
542.616	89.5
543.037	191.45
543.459	162.32
543.88	162.32
544.301	108.92
544.723	157.47
545.144	186.59
545.565	140.48
545.986	169.6
546.407	133.19
546.828	113.78
547.249	130.77
547.67	125.91
548.091	94.36
548.512	235.14
548.932	89.5
549.353	147.76
549.774	111.35
550.194	130.77
550.615	174.46
551.035	172.03
551.456	118.63
551.876	79.79
552.296	162.32
552.717	101.64
553.137	82.22
553.557	157.47
553.977	125.91
554.397	113.78
554.817	138.05
555.237	89.5
555.657	174.46
556.077	155.04
556.497	162.32
556.917	140.48
557.337	225.43
557.756	176.88
558.176	155.04
558.596	116.2
559.015	94.36
559.435	218.15
559.854	174.46
560.274	121.06
560.693	150.18
561.112	121.06
561.532	106.49
561.951	147.76
562.37	159.89
562.789	60.38
563.208	133.19
563.627	176.88
564.046	189.02
564.465	123.48
564.884	193.87
565.303	225.43
565.722	155.04
566.14	62.8
566.559	89.5
566.978	152.61
567.396	162.32
567.815	99.21
568.233	150.18
568.652	162.32
569.07	113.78
569.489	172.03
569.907	152.61
570.325	130.77
570.743	142.9
571.161	145.33
571.58	84.65
571.998	125.91
572.416	108.92
572.833	145.33
573.251	189.02
573.669	133.19
574.087	145.33
574.505	181.74
574.922	111.35
575.34	145.33
575.758	121.06
576.175	142.9
576.593	174.46
577.01	116.2
577.428	123.48
577.845	1281.27
578.262	208.44
578.68	169.6
579.097	150.18
579.514	125.91
579.931	130.77
580.348	70.09
580.765	135.62
581.182	106.49
581.599	196.3
582.016	147.76
582.433	130.77
582.849	130.77
583.266	169.6
583.683	123.48
584.099	113.78
584.516	176.88
584.933	191.45
585.349	55.52
585.765	121.06
586.182	210.86
586.598	121.06
587.014	215.72
587.431	108.92
587.847	191.45
588.263	142.9
588.679	147.76
589.095	116.2
589.511	208.44
589.927	172.03
590.343	152.61
590.759	140.48
591.174	123.48
591.59	125.91
592.006	213.29
592.421	113.78
592.837	184.17
593.252	101.64
593.668	174.46
594.083	142.9
594.499	172.03
594.914	142.9
595.329	169.6
595.745	208.44
596.16	152.61
596.575	186.59
596.99	147.76
597.405	123.48
597.82	96.79
598.235	135.62
598.65	60.38
599.065	116.2
599.479	128.34
599.894	118.63
600.309	186.59
600.724	159.89
601.138	157.47
601.553	135.62
601.967	155.04
602.382	179.31
602.796	67.66
603.21	121.06
603.625	159.89
604.039	172.03
604.453	101.64
604.867	138.05
605.281	169.6
605.695	189.02
606.109	106.49
606.523	239.99
606.937	201.16
607.351	283.68
607.765	145.33
608.178	162.32
608.592	164.75
609.006	167.17
609.419	108.92
609.833	70.09
610.246	123.48
610.66	111.35
611.073	164.75
611.487	159.89
611.9	162.32
612.313	125.91
612.726	147.76
613.139	118.63
613.553	121.06
613.966	164.75
614.379	247.27
614.792	206.01
615.204	186.59
615.617	140.48
616.03	191.45
616.443	196.3
616.856	213.29
617.268	111.35
617.681	162.32
618.093	198.73
618.506	106.49
618.918	213.29
619.331	118.63
619.743	189.02
620.155	201.16
620.568	208.44
620.98	123.48
621.392	108.92
621.804	172.03
622.216	201.16
622.628	113.78
623.04	213.29
623.452	172.03
623.864	123.48
624.276	186.59
624.687	186.59
625.099	193.87
625.511	181.74
625.922	111.35
626.334	118.63
626.745	53.1
627.157	135.62
627.568	162.32
627.979	176.88
628.391	123.48
628.802	179.31
629.213	155.04
629.624	167.17
630.035	72.51
630.446	96.79
630.857	125.91
631.268	111.35
631.679	176.88
632.09	135.62
632.501	157.47
632.912	140.48
633.322	99.21
633.733	193.87
634.144	179.31
634.554	155.04
634.965	147.76
635.375	111.35
635.785	169.6
636.196	142.9
636.606	135.62
637.016	174.46
637.427	145.33
637.837	128.34
638.247	184.17
638.657	167.17
639.067	176.88
639.477	96.79
639.887	159.89
640.297	121.06
640.706	145.33
641.116	133.19
641.526	150.18
641.935	62.8
642.345	67.66
642.755	123.48
643.164	135.62
643.573	179.31
643.983	159.89
644.392	198.73
644.801	125.91
645.211	123.48
645.62	123.48
646.029	128.34
646.438	169.6
646.847	101.64
647.256	96.79
647.665	14.26
648.074	116.2
648.483	89.5
648.892	159.89
649.3	79.79
649.709	186.59
650.118	179.31
650.526	150.18
650.935	91.93
651.343	164.75
651.752	184.17
652.16	62.8
652.568	125.91
652.977	176.88
653.385	128.34
653.793	128.34
654.201	249.7
654.609	113.78
655.017	198.73
655.425	140.48
655.833	142.9
656.241	152.61
656.649	189.02
657.057	106.49
657.464	140.48
657.872	125.91
658.28	130.77
658.687	225.43
659.095	155.04
659.502	176.88
659.91	128.34
660.317	125.91
660.724	130.77
661.132	167.17
661.539	174.46
661.946	191.45
662.353	172.03
662.76	89.5
663.167	125.91
663.574	162.32
663.981	162.32
664.388	159.89
664.795	111.35
665.202	244.85
665.608	128.34
666.015	169.6
666.422	116.2
666.828	150.18
667.235	140.48
667.641	135.62
668.047	176.88
668.454	201.16
668.86	125.91
669.266	196.3
669.673	121.06
670.079	213.29
670.485	181.74
670.891	159.89
671.297	138.05
671.703	145.33
672.109	142.9
672.515	196.3
672.92	142.9
673.326	242.42
673.732	113.78
674.138	189.02
674.543	169.6
674.949	140.48
675.354	203.58
675.76	138.05
676.165	145.33
676.57	155.04
676.976	186.59
677.381	196.3
677.786	159.89
678.191	125.91
678.596	184.17
679.001	162.32
679.406	145.33
679.811	223
680.216	218.15
680.621	135.62
681.026	123.48
681.43	84.65
681.835	179.31
682.24	172.03
682.644	89.5
683.049	101.64
683.453	157.47
683.858	79.79
684.262	113.78
684.667	145.33
685.071	150.18
685.475	179.31
685.879	196.3
686.283	186.59
686.687	167.17
687.091	145.33
687.495	106.49
687.899	147.76
688.303	108.92
688.707	159.89
689.111	111.35
689.514	84.65
689.918	104.07
690.322	179.31
690.725	162.32
691.129	104.07
691.532	206.01
691.936	191.45
692.339	99.21
692.742	169.6
693.146	74.94
693.549	174.46
693.952	135.62
694.355	138.05
694.758	210.86
695.161	147.76
695.564	140.48
695.967	147.76
696.37	167.17
696.773	162.32
697.175	201.16
697.578	118.63
697.981	189.02
698.383	162.32
698.786	176.88
699.188	155.04
699.591	147.76
699.993	123.48
700.395	157.47
700.798	172.03
701.2	155.04
701.602	128.34
702.004	164.75
702.406	201.16
702.808	159.89
703.21	101.64
703.612	249.7
704.014	150.18
704.416	184.17
704.818	208.44
705.219	159.89
705.621	138.05
706.023	157.47
706.424	206.01
706.826	176.88
707.227	164.75
707.629	162.32
708.03	159.89
708.431	213.29
708.832	208.44
709.234	181.74
709.635	206.01
710.036	145.33
710.437	138.05
710.838	225.43
711.239	242.42
711.64	184.17
712.041	259.41
712.441	196.3
712.842	244.85
713.243	164.75
713.643	186.59
714.044	213.29
714.445	244.85
714.845	227.86
715.246	271.55
715.646	293.39
716.046	256.98
716.447	300.67
716.847	327.37
717.247	290.96
717.647	307.95
718.047	315.24
718.447	327.37
718.847	322.52
719.247	213.29
719.647	317.66
720.047	327.37
720.446	312.81
720.846	244.85
721.246	334.65
721.645	337.08
722.045	310.38
722.444	337.08
722.844	327.37
723.243	375.92
723.643	383.2
724.042	371.06
724.441	329.8
724.84	261.84
725.24	312.81
725.639	298.24
726.038	358.93
726.437	443.88
726.836	422.03
727.234	436.6
727.633	480.29
728.032	422.03
728.431	526.4
728.83	538.54
729.228	570.09
729.627	630.77
730.025	640.48
730.424	633.2
730.822	608.93
731.22	708.45
731.619	689.03
732.017	858.93
732.415	956.02
732.813	965.73
733.212	902.62
733.61	951.17
734.008	941.46
734.406	1089.52
734.803	1286.12
735.201	1446.32
735.599	1572.54
735.997	1572.54
736.395	1392.92
736.792	1383.21
737.19	1499.72
737.587	1795.84
737.985	2123.52
738.382	2181.77
738.78	2271.58
739.177	1948.76
739.574	1902.64
739.971	2140.51
740.369	2446.34
740.766	2956.05
741.163	3186.64
741.56	3125.96
741.957	2723.04
742.354	2545.85
742.751	2494.88
743.147	3181.78
743.544	3725.48
743.941	4167.24
744.338	4174.52
744.734	3822.57
745.131	3329.85
745.527	3317.71
745.924	3793.44
746.32	4737.63
746.716	5550.75
747.113	5793.48
747.509	5693.96
747.905	4941.52
748.301	4458.5
748.697	4800.74
749.093	5902.7
749.489	7230.39
749.885	8198.85
750.281	8305.65
750.677	7269.23
751.073	6278.92
751.468	6210.96
751.864	7186.7
752.26	8931.87
752.655	10242.57
753.051	10929.48
753.446	10366.36
753.842	8985.27
754.237	8179.44
754.632	8582.35
755.028	9764.41
755.423	12123.67
755.818	13354.27
756.213	13317.86
756.608	11817.84
757.003	10116.36
757.398	9575.09
757.793	10344.52
758.188	12509.6
758.583	14985.37
758.977	15885.87
759.372	15271.78
759.767	13344.56
760.161	12252.31
760.556	12075.13
760.95	14172.25
761.345	17167.44
761.739	21092.26
762.133	21752.46
762.527	21296.14
762.922	18400.47
763.316	15978.1
763.71	15902.86
764.104	18213.57
764.498	22199.07
764.892	26121.46
765.286	26890.89
765.68	24696.68
766.073	21677.22
766.467	18281.53
766.861	18631.05
767.255	22446.65
767.648	27388.47
768.042	31007.46
768.435	31844.85
768.829	28813.25
769.222	24929.7
769.615	22635.97
770.008	22145.67
770.402	24531.63
770.795	29313.26
771.188	33759.93
771.581	34626.45
771.974	31941.94
772.367	27060.8
772.76	23555.89
773.153	22662.67
773.545	24640.86
773.938	29478.31
774.331	33963.82
774.724	35400.73
775.116	34648.29
775.509	30767.17
775.901	27019.53
776.294	25961.27
776.686	28665.19
777.078	35208.98
777.471	40519.74
777.863	45014.96
778.255	43696.98
778.647	39558.56
779.039	34381.3
779.431	30291.43
779.823	31354.55
780.215	37085.22
780.607	42124.14
780.999	47973.74
781.39	47524.71
781.782	44335.34
782.174	38471.17
782.565	34323.05
782.957	33082.74
783.348	36689.59
783.74	42818.32
784.131	46675.18
784.522	49772.32
784.914	47315.97
785.305	42061.03
785.696	35587.63
786.087	32563.31
786.478	31888.54
786.869	35437.14
787.26	41002.76
787.651	44143.59
788.042	43332.89
788.433	39837.69
788.823	34306.06
789.214	29407.92
789.605	27335.07
789.995	28662.76
790.386	32820.6
790.776	37102.22
791.167	39179.92
791.557	38796.42
791.948	35126.46
792.338	29837.54
792.728	27883.63
793.118	27349.64
793.508	31187.07
793.898	36022.1
794.288	40813.44
794.678	42721.23
795.068	40968.78
795.458	35509.96
795.848	31024.45
796.238	27655.47
796.627	27585.08
797.017	30864.25
797.406	36141.04
797.796	40417.8
798.185	42694.54
798.575	40068.28
798.964	35272.09
799.354	30213.76
799.743	27320.51
800.132	27801.1
800.521	31114.26
800.91	37553.68
801.299	39704.2
801.688	41942.1
802.077	38954.19
802.466	34813.34
802.855	29218.6
803.244	24936.98
803.633	24570.47
804.021	27225.85
804.41	31866.7
804.799	35065.78
805.187	36056.08
805.576	34490.52
805.964	29898.22
806.352	24597.17
806.741	21390.81
807.129	20543.71
807.517	22876.27
807.905	26975.84
808.293	31191.93
808.681	33332.74
809.069	32461.37
809.457	29912.78
809.845	25344.75
810.233	21618.96
810.621	20388.36
811.009	22165.09
811.396	26674.87
811.784	30903.09
812.171	33104.58
812.559	32958.95
812.946	29803.56
813.334	25233.1
813.721	20701.47
814.108	18514.55
814.496	18864.07
814.883	21691.78
815.27	26463.7
815.657	29738.02
816.044	30662.79
816.431	29347.24
816.818	25012.22
817.205	20546.13
817.592	17766.96
817.979	16582.48
818.365	18342.21
818.752	20694.19
819.139	23929.68
819.525	25592.33
819.912	25034.07
820.298	23036.46
820.685	19128.63
821.071	15354.3
821.457	13453.79
821.843	13249.9
822.23	14849.44
822.616	16665
823.002	18999.99
823.388	19516.99
823.774	18092.21
824.16	16016.94
824.546	12849.41
824.931	10509.57
825.317	9538.68
825.703	10480.44
826.089	11859.1
826.474	14130.98
826.86	15890.72
827.245	16162.57
827.631	15330.03
828.016	12890.67
828.401	10431.9
828.787	8584.78
829.172	7934.29
829.557	8635.75
829.942	9973.15
830.327	11832.4
830.712	12740.19
831.097	13094.56
831.482	12303.29
831.867	10235.29
832.252	8152.74
832.636	6657.57
833.021	6254.65
833.406	6715.82
833.79	7965.84
834.175	9349.36
834.559	10487.72
834.944	10485.3
835.328	9718.29
835.713	8053.22
836.097	6497.37
836.481	5283.76
836.865	4735.21
837.249	5016.76
837.633	5783.77
838.017	6708.54
838.401	7509.52
838.785	7725.54
839.169	7045.92
839.553	6072.61
839.937	4706.08
840.32	3723.06
840.704	3133.24
841.087	3351.69
841.471	3713.35
841.854	4409.96
842.238	5007.06
842.621	5201.23
843.004	5016.76
843.388	4502.19
843.771	3601.69
844.154	2824.98
844.537	2475.46
844.92	2511.87
845.303	2880.81
845.686	3412.37
846.069	3963.35
846.452	4269.18
846.834	4210.93
847.217	3875.97
847.6	3230.33
847.982	2553.13
848.365	2169.63
848.748	1863.8
849.13	2062.84
849.512	2439.05
849.895	2895.37
850.277	3108.97
850.659	3324.99
851.041	3210.91
851.423	2936.64
851.806	2295.85
852.188	1919.63
852.57	1536.13
852.951	1492.44
853.333	1672.05
853.715	1999.73
854.097	2368.67
854.479	2570.12
854.86	2591.97
855.242	2315.27
855.623	2002.15
856.005	1560.4
856.386	1159.91
856.768	1053.11
857.149	1101.66
857.53	1108.94
857.911	1453.6
858.292	1642.93
858.674	1635.64
859.055	1628.36
859.436	1507
859.817	1317.68
860.197	1016.7
860.578	849.22
860.959	650.19
861.34	727.86
861.72	875.92
862.101	897.77
862.482	1164.76
862.862	1196.32
863.243	1264.28
863.623	1084.66
864.003	841.94
864.384	803.11
864.764	638.06
865.144	548.25
865.524	531.26
865.904	723.01
866.284	727.86
866.664	790.97
867.044	812.82
867.424	815.24
867.804	805.53
868.183	781.26
868.563	565.24
868.943	509.41
869.322	429.31
869.702	434.17
870.081	565.24
870.461	506.99
870.84	526.4
871.22	587.08
871.599	562.81
871.978	625.92
872.357	480.29
872.736	419.61
873.115	339.51
873.494	329.8
873.873	383.2
874.252	373.49
874.631	373.49
875.01	395.33
875.388	405.04
875.767	397.76
876.146	463.3
876.524	332.23
876.903	317.66
877.281	256.98
877.66	300.67
878.038	247.27
878.416	174.46
878.794	315.24
879.173	341.93
879.551	300.67
879.929	295.82
880.307	254.55
880.685	242.42
881.063	218.15
881.441	242.42
881.818	235.14
882.196	164.75
882.574	198.73
882.951	303.1
883.329	266.69
883.707	191.45
884.084	276.4
884.461	317.66
884.839	278.83
885.216	286.11
885.593	213.29
885.971	227.86
886.348	235.14
886.725	179.31
887.102	155.04
887.479	261.84
887.856	164.75
888.233	242.42
888.609	239.99
888.986	140.48
889.363	220.57
889.74	164.75
890.116	276.4
890.493	174.46
890.869	179.31
891.246	206.01
891.622	184.17
891.998	196.3
892.375	307.95
892.751	106.49
893.127	184.17
893.503	99.21
893.879	142.9
894.255	213.29
894.631	172.03
895.007	159.89
895.383	130.77
895.759	213.29
896.134	193.87
896.51	193.87
896.886	150.18
897.261	157.47
897.637	227.86
898.012	96.79
898.388	123.48
898.763	113.78
899.138	135.62
899.514	164.75
899.889	135.62
900.264	157.47
900.639	162.32
901.014	249.7
901.389	125.91
901.764	108.92
902.139	84.65
902.513	181.74
902.888	118.63
903.263	62.8
903.638	87.08
904.012	176.88
904.387	150.18
904.761	96.79
905.136	242.42
905.51	198.73
905.884	193.87
906.259	111.35
906.633	133.19
907.007	157.47
907.381	201.16
907.755	113.78
908.129	138.05
908.503	62.8
908.877	111.35
909.251	157.47
909.624	130.77
909.998	147.76
910.372	125.91
910.745	123.48
911.119	135.62
911.492	140.48
911.866	145.33
912.239	125.91
912.612	201.16
912.986	155.04
913.359	145.33
913.732	135.62
914.105	213.29
914.478	128.34
914.851	91.93
915.224	108.92
915.597	140.48
915.97	48.24
916.343	118.63
916.715	125.91
917.088	152.61
917.461	159.89
917.833	123.48
918.206	140.48
918.578	118.63
918.951	77.37
919.323	128.34
919.695	72.51
920.067	118.63
920.44	96.79
920.812	104.07
921.184	72.51
921.556	191.45
921.928	55.52
922.3	65.23
922.672	159.89
923.043	157.47
923.415	145.33
923.787	181.74
924.158	147.76
924.53	77.37
924.901	116.2
925.273	189.02
925.644	104.07
926.016	164.75
926.387	116.2
926.758	72.51
927.129	113.78
927.5	101.64
927.872	135.62
928.243	106.49
928.613	60.38
928.984	125.91
929.355	108.92
929.726	89.5
930.097	135.62
930.467	174.46
930.838	167.17
931.209	101.64
931.579	101.64
931.95	113.78
932.32	157.47
932.69	164.75
933.061	96.79
933.431	159.89
933.801	123.48
934.171	164.75
934.541	108.92
934.911	125.91
935.281	174.46
935.651	123.48
936.021	152.61
936.391	111.35
936.761	121.06
937.13	147.76
937.5	116.2
937.87	101.64
938.239	70.09
938.609	96.79
938.978	142.9
939.347	118.63
939.717	142.9
940.086	91.93
940.455	67.66
940.824	189.02
941.193	210.86
941.562	99.21
941.931	140.48
942.3	164.75
942.669	167.17
943.038	155.04
943.407	74.94
943.775	133.19
944.144	106.49
944.513	118.63
944.881	123.48
945.25	152.61
945.618	87.08
945.986	77.37
946.355	172.03
946.723	123.48
947.091	157.47
947.459	125.91
947.827	96.79
948.195	125.91
948.563	130.77
948.931	113.78
949.299	101.64
949.667	140.48
950.035	167.17
950.402	108.92
950.77	91.93
951.138	99.21
951.505	106.49
951.873	159.89
952.24	87.08
952.607	169.6
952.975	167.17
953.342	65.23
953.709	70.09
954.076	65.23
954.443	142.9
954.81	210.86
955.177	155.04
955.544	91.93
955.911	147.76
956.278	261.84
956.645	118.63
957.012	116.2
957.378	172.03
957.745	99.21
958.111	118.63
958.478	108.92
958.844	130.77
959.211	176.88
959.577	152.61
959.943	99.21
960.309	147.76
960.675	130.77
961.042	87.08
961.408	138.05
961.774	162.32
962.139	140.48
962.505	176.88
962.871	133.19
963.237	130.77
963.603	162.32
963.968	186.59
964.334	191.45
964.699	142.9
965.065	128.34
965.43	138.05
965.796	84.65
966.161	96.79
966.526	101.64
966.891	140.48
967.256	142.9
967.622	174.46
967.987	125.91
968.352	138.05
968.716	147.76
969.081	174.46
969.446	167.17
969.811	113.78
970.176	142.9
970.54	150.18
970.905	70.09
971.269	123.48
971.634	101.64
971.998	145.33
972.363	123.48
972.727	172.03
973.091	116.2
973.455	162.32
973.819	106.49
974.183	215.72
974.547	125.91
974.911	133.19
975.275	104.07
975.639	125.91
976.003	181.74
976.367	189.02
976.73	106.49
977.094	130.77
977.458	130.77
977.821	91.93
978.185	121.06
978.548	113.78
978.911	145.33
979.275	116.2
979.638	162.32
980.001	121.06
980.364	142.9
980.727	79.79
981.09	172.03
981.453	193.87
981.816	150.18
982.179	179.31
982.542	89.5
982.905	181.74
983.267	123.48
983.63	150.18
983.992	70.09
984.355	123.48
984.717	118.63
985.08	106.49
985.442	208.44
985.804	189.02
986.167	191.45
986.529	181.74
986.891	82.22
987.253	133.19
987.615	108.92
987.977	74.94
988.339	145.33
988.701	162.32
989.062	191.45
989.424	128.34
989.786	101.64
990.147	72.51
990.509	169.6
990.87	150.18
991.232	159.89
991.593	70.09
991.955	128.34
992.316	181.74
992.677	108.92
993.038	101.64
993.399	125.91
993.76	94.36
994.121	145.33
994.482	145.33
994.843	133.19
995.204	174.46
995.565	106.49
995.926	101.64
996.286	159.89
996.647	84.65
997.007	142.9
997.368	133.19
997.728	96.79
998.089	125.91
998.449	174.46
998.809	70.09
999.169	111.35
999.53	135.62
999.89	147.76
1000.25	70.09
1000.61	159.89
1000.97	150.18
1001.329	142.9
1001.689	140.48
1002.049	111.35
1002.409	118.63
1002.768	113.78
1003.128	198.73
1003.487	62.8
1003.847	94.36
1004.206	79.79
1004.566	82.22
1004.925	77.37
1005.284	191.45
1005.643	96.79
1006.003	123.48
1006.362	145.33
1006.721	138.05
1007.08	135.62
1007.438	155.04
1007.797	113.78
1008.156	48.24
1008.515	179.31
1008.874	150.18
1009.232	99.21
1009.591	128.34
1009.949	152.61
1010.308	111.35
1010.666	210.86
1011.024	72.51
1011.383	91.93
1011.741	145.33
1012.099	140.48
1012.457	84.65
1012.815	164.75
1013.173	181.74
1013.531	96.79
1013.889	96.79
1014.247	130.77
1014.605	176.88
1014.962	181.74
1015.32	128.34
1015.678	176.88
1016.035	152.61
1016.393	77.37
1016.75	108.92
1017.107	118.63
1017.465	123.48
1017.822	184.17
1018.179	157.47
1018.536	162.32
1018.894	162.32
1019.251	130.77
1019.608	167.17
1019.964	157.47
1020.321	87.08
1020.678	152.61
1021.035	184.17
1021.392	147.76
1021.748	159.89
1022.105	67.66
1022.461	152.61
1022.818	162.32
1023.174	70.09
1023.531	179.31
1023.887	179.31
1024.243	150.18
1024.599	138.05
1024.955	111.35
1025.311	118.63
1025.667	101.64
1026.023	123.48
1026.379	113.78
1026.735	96.79
1027.091	155.04
1027.447	191.45
