189.514	84.35
189.973	84.35
190.431	84.35
190.889	47.94
191.348	-49.15
191.806	18.81
192.264	23.67
192.722	-27.31
193.18	-27.31
193.638	-39.44
194.096	-5.46
194.554	-61.29
195.012	26.09
195.47	-10.32
195.928	18.81
196.385	-32.16
196.843	52.79
197.301	38.23
197.758	1.82
198.216	6.67
198.674	21.24
199.131	13.96
199.589	13.96
200.046	135.32
200.503	43.08
200.961	123.18
201.418	72.21
201.875	18.81
202.332	113.47
202.79	108.62
203.247	108.62
203.704	130.46
204.161	106.19
204.618	108.62
205.075	179.01
205.532	111.05
205.989	147.45
206.445	196
206.902	193.57
207.359	174.15
207.816	208.13
208.272	188.72
208.729	64.93
209.185	118.33
209.642	196
210.098	234.83
210.555	232.41
211.011	176.58
211.467	81.92
211.924	142.6
212.38	96.48
212.836	125.61
213.292	140.17
213.748	154.74
214.204	166.87
214.66	196
215.116	169.3
215.572	263.96
216.028	176.58
216.484	166.87
216.94	174.15
217.396	171.73
217.851	198.43
218.307	89.2
218.763	142.6
219.218	149.88
219.674	162.02
220.129	174.15
220.585	67.36
221.04	118.33
221.496	191.14
221.951	147.45
222.406	152.31
222.861	198.43
223.317	166.87
223.772	162.02
224.227	198.43
224.682	123.18
225.137	179.01
225.592	203.28
226.047	106.19
226.502	152.31
226.957	147.45
227.411	200.85
227.866	249.4
228.321	181.43
228.776	135.32
229.23	169.3
229.685	118.33
230.139	183.86
230.594	171.73
231.048	186.29
231.503	169.3
231.957	118.33
232.411	94.05
232.865	162.02
233.32	157.16
233.774	113.47
234.228	176.58
234.682	242.12
235.136	147.45
235.59	171.73
236.044	147.45
236.498	183.86
236.952	149.88
237.406	111.05
237.86	210.56
238.313	111.05
238.767	203.28
239.221	98.91
239.674	94.05
240.128	149.88
240.581	125.61
241.035	113.47
241.488	81.92
241.942	183.86
242.395	208.13
242.848	171.73
243.301	205.71
243.755	162.02
244.208	171.73
244.661	128.04
245.114	123.18
245.567	145.03
246.02	215.42
246.473	140.17
246.926	157.16
247.379	157.16
247.832	205.71
248.284	130.46
248.737	198.43
249.19	176.58
249.642	169.3
250.095	196
250.547	125.61
251	115.9
251.452	140.17
251.905	169.3
252.357	186.29
252.81	162.02
253.262	210.56
253.714	162.02
254.166	176.58
254.618	135.32
255.07	113.47
255.523	183.86
255.975	142.6
256.427	123.18
256.878	215.42
257.33	47.94
257.782	176.58
258.234	169.3
258.686	164.44
259.137	108.62
259.589	229.98
260.041	154.74
260.492	154.74
260.944	77.06
261.395	183.86
261.847	157.16
262.298	174.15
262.749	125.61
263.201	147.45
263.652	176.58
264.103	171.73
264.554	225.12
265.005	208.13
265.457	166.87
265.908	125.61
266.359	52.79
266.809	176.58
267.26	176.58
267.711	169.3
268.162	229.98
268.613	157.16
269.064	137.74
269.514	135.32
269.965	142.6
270.415	130.46
270.866	181.43
271.316	123.18
271.767	176.58
272.217	171.73
272.668	171.73
273.118	225.12
273.568	154.74
274.019	118.33
274.469	152.31
274.919	193.57
275.369	249.4
275.819	140.17
276.269	215.42
276.719	128.04
277.169	186.29
277.619	174.15
278.069	140.17
278.518	225.12
278.968	128.04
279.418	181.43
279.867	256.68
280.317	205.71
280.767	108.62
281.216	174.15
281.666	115.9
282.115	118.33
282.564	157.16
283.014	140.17
283.463	171.73
283.912	103.76
284.361	166.87
284.811	179.01
285.26	135.32
285.709	188.72
286.158	179.01
286.607	212.99
287.056	154.74
287.505	196
287.953	183.86
288.402	147.45
288.851	176.58
289.3	152.31
289.748	188.72
290.197	147.45
290.646	229.98
291.094	174.15
291.543	164.44
291.991	186.29
292.439	215.42
292.888	210.56
293.336	118.33
293.784	159.59
294.233	115.9
294.681	198.43
295.129	188.72
295.577	234.83
296.025	149.88
296.473	154.74
296.921	174.15
297.369	174.15
297.817	237.26
298.264	166.87
298.712	196
299.16	159.59
299.608	89.2
300.055	103.76
300.503	222.7
300.95	188.72
301.398	171.73
301.845	169.3
302.293	227.55
302.74	193.57
303.187	244.54
303.635	200.85
304.082	193.57
304.529	113.47
304.976	154.74
305.423	159.59
305.87	169.3
306.317	171.73
306.764	203.28
307.211	196
307.658	200.85
308.105	217.84
308.552	125.61
308.998	98.91
309.445	186.29
309.892	220.27
310.338	169.3
310.785	111.05
311.231	115.9
311.678	157.16
312.124	171.73
312.571	183.86
313.017	145.03
313.463	166.87
313.909	222.7
314.356	169.3
314.802	191.14
315.248	181.43
315.694	91.63
316.14	145.03
316.586	179.01
317.032	220.27
317.478	179.01
317.923	149.88
318.369	135.32
318.815	113.47
319.261	152.31
319.706	147.45
320.152	208.13
320.597	196
321.043	135.32
321.488	208.13
321.934	169.3
322.379	179.01
322.824	159.59
323.27	145.03
323.715	130.46
324.16	145.03
324.605	94.05
325.05	140.17
325.495	157.16
325.94	125.61
326.385	200.85
326.83	118.33
327.275	222.7
327.72	186.29
328.165	191.14
328.61	188.72
329.054	193.57
329.499	169.3
329.943	120.75
330.388	120.75
330.832	164.44
331.277	208.13
331.721	188.72
332.166	193.57
332.61	225.12
333.054	181.43
333.499	220.27
333.943	125.61
334.387	132.89
334.831	222.7
335.275	208.13
335.719	120.75
336.163	205.71
336.607	196
337.051	164.44
337.495	96.48
337.938	181.43
338.382	123.18
338.826	203.28
339.269	205.71
339.713	176.58
340.157	157.16
340.6	125.61
341.044	164.44
341.487	157.16
341.93	152.31
342.374	152.31
342.817	220.27
343.26	162.02
343.703	217.84
344.146	186.29
344.59	162.02
345.033	149.88
345.476	174.15
345.919	169.3
346.361	162.02
346.804	113.47
347.247	174.15
347.69	176.58
348.133	174.15
348.575	169.3
349.018	217.84
349.461	220.27
349.903	179.01
350.346	162.02
350.788	162.02
351.23	196
351.673	147.45
352.115	176.58
352.557	174.15
353	171.73
353.442	147.45
353.884	169.3
354.326	101.34
354.768	188.72
355.21	128.04
355.652	198.43
356.094	113.47
356.536	152.31
356.978	205.71
357.419	152.31
357.861	193.57
358.303	164.44
358.744	171.73
359.186	145.03
359.627	106.19
360.069	96.48
360.51	130.46
360.952	191.14
361.393	142.6
361.834	166.87
362.276	120.75
362.717	159.59
363.158	159.59
363.599	152.31
364.04	157.16
364.481	196
364.922	101.34
365.363	123.18
365.804	179.01
366.245	196
366.686	149.88
367.126	135.32
367.567	237.26
368.008	130.46
368.448	149.88
368.889	234.83
369.33	147.45
369.77	215.42
370.21	171.73
370.651	132.89
371.091	125.61
371.531	142.6
371.972	152.31
372.412	130.46
372.852	137.74
373.292	171.73
373.732	181.43
374.172	106.19
374.612	162.02
375.052	191.14
375.492	142.6
375.932	152.31
376.372	128.04
376.811	166.87
377.251	232.41
377.691	140.17
378.13	106.19
378.57	174.15
379.009	166.87
379.449	111.05
379.888	193.57
380.328	193.57
380.767	135.32
381.206	142.6
381.645	135.32
382.085	147.45
382.524	200.85
382.963	142.6
383.402	198.43
383.841	154.74
384.28	125.61
384.719	149.88
385.158	159.59
385.596	183.86
386.035	176.58
386.474	142.6
386.913	157.16
387.351	128.04
387.79	115.9
388.228	130.46
388.667	176.58
389.105	157.16
389.544	162.02
389.982	225.12
390.42	169.3
390.859	169.3
391.297	157.16
391.735	89.2
392.173	152.31
392.611	200.85
393.049	171.73
393.487	128.04
393.925	118.33
394.363	157.16
394.801	147.45
395.239	147.45
395.676	164.44
396.114	205.71
396.552	186.29
396.989	159.59
397.427	154.74
397.864	159.59
398.302	198.43
398.739	147.45
399.177	113.47
399.614	130.46
400.051	140.17
400.488	215.42
400.926	135.32
401.363	162.02
401.8	217.84
402.237	140.17
402.674	205.71
403.111	208.13
403.548	101.34
403.985	96.48
404.421	149.88
404.858	215.42
405.295	212.99
405.732	166.87
406.168	135.32
406.605	77.06
407.041	91.63
407.478	130.46
407.914	212.99
408.351	200.85
408.787	149.88
409.223	171.73
409.66	149.88
410.096	120.75
410.532	149.88
410.968	67.36
411.404	91.63
411.84	98.91
412.276	159.59
412.712	225.12
413.148	154.74
413.584	200.85
414.02	130.46
414.455	210.56
414.891	125.61
415.327	152.31
415.762	152.31
416.198	162.02
416.633	166.87
417.069	154.74
417.504	86.77
417.94	205.71
418.375	171.73
418.81	132.89
419.245	157.16
419.681	162.02
420.116	157.16
420.551	162.02
420.986	145.03
421.421	106.19
421.856	140.17
422.291	152.31
422.726	140.17
423.16	120.75
423.595	101.34
424.03	186.29
424.464	198.43
424.899	132.89
425.334	147.45
425.768	176.58
426.203	169.3
426.637	171.73
427.071	203.28
427.506	166.87
427.94	149.88
428.374	196
428.809	174.15
429.243	120.75
429.677	232.41
430.111	132.89
430.545	149.88
430.979	196
431.413	193.57
431.847	186.29
432.28	183.86
432.714	210.56
433.148	196
433.582	130.46
434.015	166.87
434.449	145.03
434.882	171.73
435.316	174.15
435.749	196
436.183	222.7
436.616	179.01
437.049	193.57
437.483	242.12
437.916	142.6
438.349	132.89
438.782	196
439.215	191.14
439.648	220.27
440.081	186.29
440.514	171.73
440.947	186.29
441.38	154.74
441.813	210.56
442.245	266.39
442.678	212.99
443.111	145.03
443.543	251.82
443.976	217.84
444.408	183.86
444.841	259.11
445.273	210.56
445.705	249.4
446.138	171.73
446.57	225.12
447.002	210.56
447.434	176.58
447.867	198.43
448.299	285.81
448.731	256.68
449.163	237.26
449.595	312.5
450.026	251.82
450.458	217.84
450.89	278.52
451.322	227.55
451.754	222.7
452.185	249.4
452.617	200.85
453.048	249.4
453.48	288.23
453.911	266.39
454.343	232.41
454.774	220.27
455.205	246.97
455.637	263.96
456.068	239.69
456.499	256.68
456.93	288.23
457.361	225.12
457.792	251.82
458.223	324.64
458.654	329.5
459.085	212.99
459.516	283.38
459.947	237.26
460.378	256.68
460.808	203.28
461.239	314.93
461.669	302.8
462.1	212.99
462.531	271.24
462.961	259.11
463.391	222.7
463.822	183.86
464.252	220.27
464.682	210.56
465.113	186.29
465.543	140.17
465.973	259.11
466.403	210.56
466.833	232.41
467.263	220.27
467.693	210.56
468.123	242.12
468.553	256.68
468.983	290.66
469.412	191.14
469.842	249.4
470.272	254.25
470.701	212.99
471.131	259.11
471.56	196
471.99	212.99
472.419	222.7
472.849	203.28
473.278	212.99
473.707	232.41
474.136	176.58
474.566	232.41
474.995	200.85
475.424	220.27
475.853	217.84
476.282	297.94
476.711	227.55
477.14	171.73
477.569	171.73
477.997	227.55
478.426	249.4
478.855	232.41
479.283	305.22
479.712	242.12
480.141	188.72
480.569	212.99
480.998	159.59
481.426	251.82
481.854	181.43
482.283	203.28
482.711	220.27
483.139	232.41
483.567	210.56
483.995	203.28
484.424	222.7
484.852	115.9
485.28	227.55
485.708	259.11
486.135	232.41
486.563	149.88
486.991	183.86
487.419	242.12
487.847	229.98
488.274	217.84
488.702	210.56
489.129	200.85
489.557	200.85
489.984	273.67
490.412	220.27
490.839	186.29
491.266	225.12
491.694	174.15
492.121	183.86
492.548	254.25
492.975	244.54
493.402	205.71
493.829	186.29
494.256	183.86
494.683	179.01
495.11	179.01
495.537	183.86
495.964	120.75
496.39	208.13
496.817	256.68
497.244	288.23
497.67	225.12
498.097	174.15
498.523	142.6
498.95	193.57
499.376	196
499.803	162.02
500.229	166.87
500.655	234.83
501.081	166.87
501.508	210.56
501.934	159.59
502.36	244.54
502.786	188.72
503.212	169.3
503.638	188.72
504.064	193.57
504.489	166.87
504.915	135.32
505.341	179.01
505.767	164.44
506.192	169.3
506.618	217.84
507.043	217.84
507.469	196
507.894	186.29
508.32	181.43
508.745	169.3
509.17	135.32
509.596	186.29
510.021	193.57
510.446	140.17
510.871	225.12
511.296	179.01
511.721	198.43
512.146	244.54
512.571	237.26
512.996	186.29
513.421	210.56
513.845	145.03
514.27	166.87
514.695	123.18
515.119	183.86
515.544	176.58
515.969	181.43
516.393	183.86
516.817	217.84
517.242	244.54
517.666	132.89
518.09	193.57
518.515	106.19
518.939	188.72
519.363	353.77
519.787	232.41
520.211	162.02
520.635	249.4
521.059	145.03
521.483	196
521.907	198.43
522.331	115.9
522.754	174.15
523.178	157.16
523.602	147.45
524.025	225.12
524.449	273.67
524.872	159.59
525.296	179.01
525.719	98.91
526.143	261.53
526.566	166.87
526.989	94.05
527.412	193.57
527.836	208.13
528.259	215.42
528.682	176.58
529.105	225.12
529.528	208.13
529.951	169.3
530.374	203.28
530.796	174.15
531.219	237.26
531.642	174.15
532.065	210.56
532.487	222.7
532.91	215.42
533.332	220.27
533.755	205.71
534.177	234.83
534.6	203.28
535.022	179.01
535.444	162.02
535.867	237.26
536.289	183.86
536.711	191.14
537.133	251.82
537.555	176.58
537.977	149.88
538.399	205.71
538.821	149.88
539.243	205.71
539.665	135.32
540.086	162.02
540.508	193.57
540.93	171.73
541.351	203.28
541.773	200.85
542.195	171.73
542.616	208.13
543.037	171.73
543.459	229.98
543.88	166.87
544.301	191.14
544.723	297.94
545.144	191.14
545.565	290.66
545.986	188.72
546.407	191.14
546.828	259.11
547.249	152.31
547.67	266.39
548.091	181.43
548.512	215.42
548.932	154.74
549.353	217.84
549.774	210.56
550.194	244.54
550.615	181.43
551.035	159.59
551.456	246.97
551.876	179.01
552.296	191.14
552.717	186.29
553.137	179.01
553.557	191.14
553.977	234.83
554.397	220.27
554.817	229.98
555.237	164.44
555.657	208.13
556.077	232.41
556.497	198.43
556.917	179.01
557.337	203.28
557.756	227.55
558.176	162.02
558.596	188.72
559.015	276.1
559.435	188.72
559.854	193.57
560.274	222.7
560.693	232.41
561.112	191.14
561.532	200.85
561.951	208.13
562.37	229.98
562.789	166.87
563.208	196
563.627	229.98
564.046	188.72
564.465	205.71
564.884	234.83
565.303	234.83
565.722	222.7
566.14	205.71
566.559	232.41
566.978	200.85
567.396	181.43
567.815	171.73
568.233	183.86
568.652	183.86
569.07	222.7
569.489	171.73
569.907	193.57
570.325	208.13
570.743	208.13
571.161	186.29
571.58	162.02
571.998	171.73
572.416	159.59
572.833	310.08
573.251	176.58
573.669	198.43
574.087	227.55
574.505	79.49
574.922	147.45
575.34	208.13
575.758	179.01
576.175	212.99
576.593	239.69
577.01	198.43
577.428	166.87
577.845	1543.11
578.262	370.76
578.68	205.71
579.097	205.71
579.514	205.71
579.931	169.3
580.348	147.45
580.765	154.74
581.182	193.57
581.599	251.82
582.016	171.73
582.433	203.28
582.849	215.42
583.266	191.14
583.683	179.01
584.099	203.28
584.516	162.02
584.933	210.56
585.349	181.43
585.765	222.7
586.182	181.43
586.598	217.84
587.014	169.3
587.431	171.73
587.847	183.86
588.263	174.15
588.679	159.59
589.095	215.42
589.511	77.06
589.927	137.74
590.343	186.29
590.759	188.72
591.174	261.53
591.59	164.44
592.006	157.16
592.421	67.36
592.837	164.44
593.252	193.57
593.668	193.57
594.083	200.85
594.499	186.29
594.914	159.59
595.329	154.74
595.745	191.14
596.16	159.59
596.575	266.39
596.99	193.57
597.405	115.9
597.82	169.3
598.235	154.74
598.65	188.72
599.065	203.28
599.479	205.71
599.894	181.43
600.309	157.16
600.724	246.97
601.138	210.56
601.553	217.84
601.967	169.3
602.382	176.58
602.796	183.86
603.21	174.15
603.625	159.59
604.039	142.6
604.453	174.15
604.867	225.12
605.281	188.72
605.695	196
606.109	244.54
606.523	183.86
606.937	220.27
607.351	363.48
607.765	193.57
608.178	212.99
608.592	239.69
609.006	176.58
609.419	234.83
609.833	171.73
610.246	217.84
610.66	162.02
611.073	212.99
611.487	198.43
611.9	220.27
612.313	149.88
612.726	191.14
613.139	94.05
613.553	171.73
613.966	222.7
614.379	227.55
614.792	229.98
615.204	183.86
615.617	164.44
616.03	179.01
616.443	169.3
616.856	222.7
617.268	169.3
617.681	261.53
618.093	186.29
618.506	176.58
618.918	154.74
619.331	239.69
619.743	174.15
620.155	198.43
620.568	183.86
620.98	101.34
621.392	162.02
621.804	217.84
622.216	229.98
622.628	154.74
623.04	166.87
623.452	225.12
623.864	191.14
624.276	115.9
624.687	123.18
625.099	142.6
625.511	157.16
625.922	188.72
626.334	147.45
626.745	111.05
627.157	171.73
627.568	179.01
627.979	171.73
628.391	140.17
628.802	222.7
629.213	174.15
629.624	135.32
630.035	157.16
630.446	176.58
630.857	140.17
631.268	164.44
631.679	169.3
632.09	186.29
632.501	166.87
632.912	176.58
633.322	266.39
633.733	234.83
634.144	98.91
634.554	196
634.965	215.42
635.375	254.25
635.785	147.45
636.196	234.83
636.606	208.13
637.016	174.15
637.427	140.17
637.837	169.3
638.247	186.29
638.657	174.15
639.067	203.28
639.477	186.29
639.887	113.47
640.297	229.98
640.706	181.43
641.116	232.41
641.526	152.31
641.935	94.05
642.345	183.86
642.755	179.01
643.164	198.43
643.573	220.27
643.983	140.17
644.392	217.84
644.801	212.99
645.211	142.6
645.62	212.99
646.029	152.31
646.438	171.73
646.847	157.16
647.256	212.99
647.665	140.17
648.074	193.57
648.483	169.3
648.892	203.28
649.3	205.71
649.709	193.57
650.118	217.84
650.526	125.61
650.935	164.44
651.343	193.57
651.752	179.01
652.16	166.87
652.568	198.43
652.977	186.29
653.385	234.83
653.793	147.45
654.201	162.02
654.609	169.3
655.017	212.99
655.425	154.74
655.833	191.14
656.241	188.72
656.649	166.87
657.057	101.34
657.464	198.43
657.872	113.47
658.28	103.76
658.687	186.29
659.095	186.29
659.502	193.57
659.91	142.6
660.317	169.3
660.724	84.35
661.132	147.45
661.539	210.56
661.946	171.73
662.353	183.86
662.76	225.12
663.167	149.88
663.574	205.71
663.981	169.3
664.388	176.58
664.795	208.13
665.202	176.58
665.608	227.55
666.015	147.45
666.422	176.58
666.828	179.01
667.235	193.57
667.641	203.28
668.047	205.71
668.454	111.05
668.86	222.7
669.266	225.12
669.673	128.04
670.079	123.18
670.485	164.44
670.891	135.32
671.297	137.74
671.703	234.83
672.109	225.12
672.515	152.31
672.92	171.73
673.326	135.32
673.732	162.02
674.138	181.43
674.543	145.03
674.949	229.98
675.354	244.54
675.76	244.54
676.165	162.02
676.57	176.58
676.976	137.74
677.381	220.27
677.786	176.58
678.191	186.29
678.596	162.02
679.001	103.76
679.406	191.14
679.811	174.15
680.216	152.31
680.621	159.59
681.026	149.88
681.43	174.15
681.835	183.86
682.24	106.19
682.644	169.3
683.049	147.45
683.453	171.73
683.858	239.69
684.262	188.72
684.667	128.04
685.071	222.7
685.475	152.31
685.879	215.42
686.283	174.15
686.687	166.87
687.091	96.48
687.495	140.17
687.899	176.58
688.303	225.12
688.707	176.58
689.111	174.15
689.514	142.6
689.918	246.97
690.322	169.3
690.725	239.69
691.129	162.02
691.532	181.43
691.936	276.1
692.339	203.28
692.742	176.58
693.146	181.43
693.549	193.57
693.952	251.82
694.355	154.74
694.758	186.29
695.161	123.18
695.564	212.99
695.967	222.7
696.37	142.6
696.773	135.32
697.175	234.83
697.578	196
697.981	203.28
698.383	108.62
698.786	212.99
699.188	278.52
699.591	154.74
699.993	200.85
700.395	203.28
700.798	120.75
701.2	128.04
701.602	106.19
702.004	176.58
702.406	217.84
702.808	222.7
703.21	169.3
703.612	198.43
704.014	198.43
704.416	203.28
704.818	280.95
705.219	215.42
705.621	186.29
706.023	210.56
706.424	222.7
706.826	203.28
707.227	212.99
707.629	254.25
708.03	246.97
708.431	203.28
708.832	266.39
709.234	186.29
709.635	198.43
710.036	208.13
710.437	322.21
710.838	222.7
711.239	271.24
711.64	297.94
712.041	242.12
712.441	237.26
712.842	239.69
713.243	215.42
713.643	263.96
714.044	212.99
714.445	251.82
714.845	322.21
715.246	261.53
715.646	239.69
716.046	225.12
716.447	368.33
716.847	283.38
717.247	302.8
717.647	208.13
718.047	263.96
718.447	361.05
718.847	290.66
719.247	344.06
719.647	351.34
720.047	356.19
720.446	339.2
720.846	271.24
721.246	361.05
721.645	351.34
722.045	363.48
722.444	329.5
722.844	310.08
723.243	370.76
723.643	385.32
724.042	414.45
724.441	404.74
724.84	382.89
725.24	395.03
725.639	465.42
726.038	460.57
726.437	412.02
726.836	397.46
727.234	470.27
727.633	477.56
728.032	530.95
728.431	479.98
728.83	562.51
729.228	676.59
729.627	628.04
730.025	744.55
730.424	632.9
730.822	669.31
731.22	776.1
731.619	800.38
732.017	846.49
732.415	912.03
732.813	1016.4
733.212	1050.38
733.61	1191.16
734.008	1179.02
734.406	1285.82
734.803	1329.51
735.201	1433.88
735.599	1523.69
735.997	1679.03
736.395	1817.38
736.792	1895.05
737.19	2011.56
737.587	2135.35
737.985	2271.27
738.382	2305.25
738.78	2463.02
739.177	2594.09
739.574	2698.46
739.971	2953.32
740.369	2963.03
740.766	3373.23
741.163	3344.11
741.56	3446.05
741.957	3681.49
742.354	3703.33
742.751	4021.3
743.147	4273.73
743.544	4458.2
743.941	4618.4
744.338	4924.23
744.734	5220.35
745.131	5596.57
745.527	5846.57
745.924	6298.03
746.32	6480.08
746.716	6856.3
747.113	7278.63
747.509	7895.15
747.905	8426.71
748.301	8669.43
748.697	9082.06
749.093	9800.52
749.489	9900.03
749.885	10579.65
750.281	11242.29
750.677	11567.53
751.073	12084.53
751.468	12421.92
751.864	13082.12
752.26	12909.79
752.655	13480.19
753.051	13827.28
753.446	14147.67
753.842	14438.94
754.237	14587
754.632	14526.32
755.028	14870.98
755.423	14812.73
755.818	14480.2
756.213	15002.05
756.608	15050.6
757.003	15492.35
757.398	15606.43
757.793	16383.14
758.188	16402.56
758.583	16900.14
758.977	17759.38
759.372	18696.29
759.767	20011.84
760.161	21880.8
760.556	22992.47
760.95	24987.65
761.345	26072.61
761.739	27805.65
762.133	28723.14
762.527	30218.31
762.922	30555.69
763.316	32096.98
763.71	32395.53
764.104	32468.34
764.498	32487.76
764.892	32948.93
765.286	32565.43
765.68	31999.89
766.073	31880.96
766.467	31383.38
766.861	31339.69
767.255	32232.9
767.648	32363.97
768.042	33094.57
768.435	34684.4
768.829	36080.05
769.222	37184.44
769.615	39359.23
770.008	40196.62
770.402	41652.95
770.795	43915.12
771.188	45684.57
771.581	46390.89
771.974	45888.46
772.367	46240.4
772.76	46162.73
773.153	43946.68
773.545	42932.1
773.938	42332.58
774.331	40779.15
774.724	40271.86
775.116	40609.25
775.509	41058.28
775.901	42606.85
776.294	43750.07
776.686	45157.86
777.078	47303.53
777.471	49420.06
777.863	52774.49
778.255	55893.47
778.647	58153.21
779.039	58456.61
779.431	58213.89
779.823	58577.97
780.215	58908.08
780.607	57284.26
780.999	57662.91
781.39	56209.01
781.782	55043.94
782.174	54357.03
782.565	54099.75
782.957	53818.19
783.348	54507.52
783.74	55383.75
784.131	56269.69
784.522	57628.93
784.914	58201.75
785.305	59784.3
785.696	60070.72
786.087	60204.21
786.478	58786.72
786.869	57995.44
787.26	57243
787.651	54995.39
788.042	52640.99
788.433	50677.37
788.823	48138.49
789.214	47318.09
789.605	46170.01
789.995	46417.59
790.386	46364.19
790.776	47298.67
791.167	48837.53
791.557	50599.69
791.948	52958.95
792.338	53650.71
792.728	54497.81
793.118	53228.38
793.508	52403.12
793.898	50798.73
794.288	49488.03
794.678	48400.63
795.068	49053.55
795.458	48582.67
795.848	49774.44
796.238	50123.96
796.627	51029.31
797.017	51762.33
797.406	52687.11
797.796	53488.09
798.185	53842.46
798.575	53716.25
798.964	53167.7
799.354	51582.72
799.743	49830.27
800.132	49259.87
800.521	48344.81
800.91	48701.61
801.299	48174.9
801.688	49793.86
802.077	50150.66
802.466	51883.7
802.855	52701.67
803.244	51546.31
803.633	50842.42
804.021	48924.91
804.41	47051.1
804.799	43849.59
805.187	41924.8
805.576	40621.38
805.964	40228.17
806.352	39004.85
806.741	40172.35
807.129	40429.63
807.517	41677.23
807.905	41929.66
808.293	42611.71
808.681	41730.62
809.069	40890.81
809.457	40786.44
809.845	38978.15
810.233	38560.67
810.621	38152.9
811.009	38929.61
811.396	40055.84
811.784	41699.07
812.171	41767.03
812.559	42271.9
812.946	42342.28
813.334	40601.97
813.721	39371.36
814.108	37657.75
814.496	35905.29
814.883	34434.39
815.27	34711.1
815.657	34805.76
816.044	36058.21
816.431	36339.76
816.818	36970.84
817.205	36999.97
817.592	37288.81
817.979	36291.22
818.365	34691.68
818.752	32194.07
819.139	30262
819.525	29456.16
819.912	28810.52
820.298	28453.72
820.685	28553.24
821.071	28718.29
821.457	28349.35
821.843	28123.62
822.23	27594.48
822.616	25286.19
823.002	23058
823.388	21956.05
823.774	21237.59
824.16	20497.28
824.546	20150.19
824.931	20128.35
825.317	20582.24
825.703	20764.28
826.089	20795.83
826.474	20351.65
826.86	19570.09
827.245	18951.14
827.631	18269.09
828.016	17375.88
828.401	16941.4
828.787	16448.68
829.172	16856.45
829.557	16951.11
829.942	16873.44
830.327	16795.77
830.712	16028.77
831.097	15344.29
831.482	14623.41
831.867	13752.03
832.252	12912.22
832.636	12810.27
833.021	12771.44
833.406	12960.76
833.79	13028.72
834.175	12934.06
834.559	13113.67
834.944	12390.36
835.328	12055.41
835.713	11492.29
836.097	10773.83
836.481	9785.95
836.865	9582.07
837.249	9205.85
837.633	9103.9
838.017	9317.5
838.401	9271.38
838.785	8861.18
839.169	8533.51
839.553	7827.18
839.937	7492.23
840.32	6946.1
840.704	6424.25
841.087	6099
841.471	6069.88
841.854	6273.76
842.238	5997.06
842.621	6123.27
843.004	6018.9
843.388	5734.92
843.771	5356.27
844.154	5213.07
844.537	5026.17
844.92	4982.48
845.303	4994.62
845.686	4936.36
846.069	5001.9
846.452	5147.53
846.834	5055.3
847.217	4613.54
847.6	4312.57
847.982	4031.01
848.365	3865.96
848.748	3931.49
849.13	3722.75
849.512	3963.05
849.895	3848.97
850.277	3829.55
850.659	3812.56
851.041	3640.23
851.423	3581.97
851.806	3314.98
852.188	3026.14
852.57	2941.19
852.951	3045.56
853.333	3108.66
853.715	3052.84
854.097	3011.58
854.479	2802.83
854.86	2773.71
855.242	2555.26
855.623	2375.64
856.005	2268.85
856.386	2162.05
856.768	2106.22
857.149	2166.9
857.53	2106.22
857.911	2132.92
858.292	2004.28
858.674	1904.76
859.055	1776.12
859.436	1618.35
859.817	1487.28
860.197	1465.44
860.578	1569.81
860.959	1455.73
861.34	1501.84
861.72	1433.88
862.101	1322.23
862.482	1220.29
862.862	1103.78
863.243	1142.61
863.623	1186.3
864.003	1171.74
864.384	1069.8
864.764	1162.03
865.144	1137.76
865.524	1050.38
865.904	972.71
866.284	848.92
866.664	936.3
867.044	839.21
867.424	856.2
867.804	822.22
868.183	805.23
868.563	793.09
868.943	858.63
869.322	807.66
869.702	771.25
870.081	681.44
870.461	645.03
870.84	717.85
871.22	608.63
871.599	700.86
871.978	606.2
872.357	555.23
872.736	533.38
873.115	552.8
873.494	521.25
873.873	547.95
874.252	465.42
874.631	390.18
875.01	419.3
875.388	450.86
875.767	416.88
876.146	392.6
876.524	511.54
876.903	370.76
877.281	329.5
877.66	327.07
878.038	380.47
878.416	261.53
878.794	353.77
879.173	426.58
879.551	351.34
879.929	329.5
880.307	251.82
880.685	290.66
881.063	280.95
881.441	331.92
881.818	239.69
882.196	295.51
882.574	293.09
882.951	295.51
883.329	271.24
883.707	242.12
884.084	256.68
884.461	300.37
884.839	246.97
885.216	169.3
885.593	242.12
885.971	251.82
886.348	271.24
886.725	295.51
887.102	162.02
887.479	229.98
887.856	225.12
888.233	232.41
888.609	212.99
888.986	183.86
889.363	268.81
889.74	302.8
890.116	261.53
890.493	280.95
890.869	196
891.246	234.83
891.622	169.3
891.998	162.02
892.375	183.86
892.751	203.28
893.127	232.41
893.503	183.86
893.879	232.41
894.255	285.81
894.631	256.68
895.007	164.44
895.383	193.57
895.759	154.74
896.134	142.6
896.51	176.58
896.886	145.03
897.261	140.17
897.637	176.58
898.012	128.04
898.388	181.43
898.763	164.44
899.138	196
899.514	186.29
899.889	205.71
900.264	186.29
900.639	198.43
901.014	198.43
901.389	166.87
901.764	174.15
902.139	159.59
902.513	169.3
902.888	123.18
903.263	157.16
903.638	111.05
904.012	200.85
904.387	157.16
904.761	123.18
905.136	164.44
905.51	215.42
905.884	196
906.259	137.74
906.633	205.71
907.007	132.89
907.381	137.74
907.755	101.34
908.129	193.57
908.503	232.41
908.877	157.16
909.251	176.58
909.624	115.9
909.998	181.43
910.372	135.32
910.745	256.68
911.119	137.74
911.492	106.19
911.866	157.16
912.239	140.17
912.612	103.76
912.986	135.32
913.359	183.86
913.732	140.17
914.105	174.15
914.478	162.02
914.851	108.62
915.224	98.91
915.597	171.73
915.97	94.05
916.343	137.74
916.715	125.61
917.088	137.74
917.461	193.57
917.833	113.47
918.206	174.15
918.578	125.61
918.951	220.27
919.323	179.01
919.695	147.45
920.067	130.46
920.44	208.13
920.812	251.82
921.184	174.15
921.556	229.98
921.928	86.77
922.3	171.73
922.672	149.88
923.043	152.31
923.415	159.59
923.787	164.44
924.158	152.31
924.53	145.03
924.901	242.12
925.273	234.83
925.644	212.99
926.016	152.31
926.387	128.04
926.758	191.14
927.129	162.02
927.5	256.68
927.872	154.74
928.243	154.74
928.613	123.18
928.984	179.01
929.355	169.3
929.726	198.43
930.097	67.36
930.467	149.88
930.838	203.28
931.209	176.58
931.579	171.73
931.95	142.6
932.32	191.14
932.69	149.88
933.061	50.36
933.431	162.02
933.801	137.74
934.171	145.03
934.541	128.04
934.911	186.29
935.281	120.75
935.651	130.46
936.021	191.14
936.391	135.32
936.761	183.86
937.13	130.46
937.5	154.74
937.87	162.02
938.239	123.18
938.609	183.86
938.978	191.14
939.347	246.97
939.717	91.63
940.086	147.45
940.455	130.46
940.824	169.3
941.193	106.19
941.562	210.56
941.931	157.16
942.3	210.56
942.669	96.48
943.038	169.3
943.407	132.89
943.775	123.18
944.144	181.43
944.513	215.42
944.881	98.91
945.25	222.7
945.618	94.05
945.986	181.43
946.355	179.01
946.723	200.85
947.091	120.75
947.459	123.18
947.827	94.05
948.195	154.74
948.563	174.15
948.931	113.47
949.299	154.74
949.667	179.01
950.035	120.75
950.402	132.89
950.77	152.31
951.138	118.33
951.505	200.85
951.873	181.43
952.24	132.89
952.607	157.16
952.975	174.15
953.342	128.04
953.709	145.03
954.076	174.15
954.443	229.98
954.81	208.13
955.177	200.85
955.544	111.05
955.911	188.72
956.278	205.71
956.645	200.85
957.012	128.04
957.378	162.02
957.745	166.87
958.111	89.2
958.478	130.46
958.844	120.75
959.211	149.88
959.577	147.45
959.943	106.19
960.309	181.43
960.675	145.03
961.042	140.17
961.408	157.16
961.774	198.43
962.139	145.03
962.505	98.91
962.871	98.91
963.237	152.31
963.603	174.15
963.968	176.58
964.334	188.72
964.699	142.6
965.065	130.46
965.43	154.74
965.796	135.32
966.161	125.61
966.526	205.71
966.891	174.15
967.256	198.43
967.622	159.59
967.987	118.33
968.352	179.01
968.716	174.15
969.081	118.33
969.446	106.19
969.811	179.01
970.176	174.15
970.54	179.01
970.905	186.29
971.269	142.6
971.634	203.28
971.998	203.28
972.363	220.27
972.727	142.6
973.091	140.17
973.455	140.17
973.819	157.16
974.183	128.04
974.547	118.33
974.911	171.73
975.275	106.19
975.639	103.76
976.003	183.86
976.367	118.33
976.73	193.57
977.094	171.73
977.458	266.39
977.821	115.9
978.185	152.31
978.548	128.04
978.911	188.72
979.275	147.45
979.638	125.61
980.001	108.62
980.364	157.16
980.727	77.06
981.09	179.01
981.453	171.73
981.816	162.02
982.179	215.42
982.542	205.71
982.905	106.19
983.267	157.16
983.63	135.32
983.992	179.01
984.355	164.44
984.717	98.91
985.08	130.46
985.442	113.47
985.804	152.31
986.167	220.27
986.529	149.88
986.891	123.18
987.253	174.15
987.615	91.63
987.977	179.01
988.339	118.33
988.701	81.92
989.062	186.29
989.424	164.44
989.786	91.63
990.147	154.74
990.509	137.74
990.87	123.18
991.232	169.3
991.593	137.74
991.955	157.16
992.316	149.88
992.677	171.73
993.038	164.44
993.399	140.17
993.76	159.59
994.121	137.74
994.482	212.99
994.843	142.6
995.204	140.17
995.565	166.87
995.926	113.47
996.286	200.85
996.647	111.05
997.007	164.44
997.368	115.9
997.728	186.29
998.089	232.41
998.449	120.75
998.809	111.05
999.169	81.92
999.53	96.48
999.89	106.19
1000.25	171.73
1000.61	137.74
1000.97	183.86
1001.329	115.9
1001.689	98.91
1002.049	118.33
1002.409	171.73
1002.768	193.57
1003.128	113.47
1003.487	132.89
1003.847	89.2
1004.206	108.62
1004.566	142.6
1004.925	203.28
1005.284	181.43
1005.643	191.14
1006.003	120.75
1006.362	123.18
1006.721	128.04
1007.08	118.33
1007.438	128.04
1007.797	188.72
1008.156	186.29
1008.515	154.74
1008.874	227.55
1009.232	137.74
1009.591	154.74
1009.949	142.6
1010.308	137.74
1010.666	147.45
1011.024	147.45
1011.383	205.71
1011.741	166.87
1012.099	137.74
1012.457	145.03
1012.815	169.3
1013.173	113.47
1013.531	171.73
1013.889	152.31
1014.247	125.61
1014.605	157.16
1014.962	101.34
1015.32	91.63
1015.678	130.46
1016.035	137.74
1016.393	176.58
1016.75	171.73
1017.107	111.05
1017.465	225.12
1017.822	183.86
1018.179	198.43
1018.536	159.59
1018.894	215.42
1019.251	171.73
1019.608	179.01
1019.964	142.6
1020.321	111.05
1020.678	203.28
1021.035	162.02
1021.392	145.03
1021.748	140.17
1022.105	145.03
1022.461	145.03
1022.818	227.55
1023.174	62.5
1023.531	149.88
1023.887	145.03
1024.243	137.74
1024.599	159.59
1024.955	140.17
1025.311	130.46
1025.667	200.85
1026.023	96.48
1026.379	130.46
1026.735	125.61
1027.091	183.86
1027.447	193.57
