189.514	95.88
189.973	95.88
190.431	95.88
190.889	23.06
191.348	30.34
191.806	6.07
192.264	-23.06
192.722	-44.9
193.18	3.64
193.638	1.21
194.096	8.5
194.554	-3.64
195.012	-15.78
195.47	-15.78
195.928	-44.9
196.385	8.5
196.843	-8.5
197.301	-30.34
197.758	6.07
198.216	61.89
198.674	20.63
199.131	76.46
199.589	81.31
200.046	64.32
200.503	139.57
200.961	30.34
201.418	115.29
201.875	134.71
202.332	129.86
202.79	57.04
203.247	117.72
203.704	188.11
204.161	163.84
204.618	163.84
205.075	100.73
205.532	112.87
205.989	163.84
206.445	132.28
206.902	180.83
207.359	217.24
207.816	183.26
208.272	192.96
208.729	141.99
209.185	163.84
209.642	185.68
210.098	146.85
210.555	241.51
211.011	197.82
211.467	132.28
211.924	112.87
212.38	139.57
212.836	185.68
213.292	149.27
213.748	112.87
214.204	156.56
214.66	180.83
215.116	156.56
215.572	156.56
216.028	183.26
216.484	163.84
216.94	207.53
217.396	144.42
217.851	125
218.307	115.29
218.763	122.57
219.218	141.99
219.674	200.25
220.129	166.26
220.585	117.72
221.04	192.96
221.496	108.01
221.951	146.85
222.406	226.95
222.861	158.98
223.317	161.41
223.772	115.29
224.227	158.98
224.682	149.27
225.137	158.98
225.592	127.43
226.047	134.71
226.502	141.99
226.957	173.55
227.411	149.27
227.866	175.97
228.321	129.86
228.776	144.42
229.23	161.41
229.685	134.71
230.139	83.74
230.594	95.88
231.048	183.26
231.503	91.02
231.957	112.87
232.411	110.44
232.865	98.3
233.32	183.26
233.774	217.24
234.228	192.96
234.682	144.42
235.136	122.57
235.59	202.67
236.044	141.99
236.498	195.39
236.952	154.13
237.406	156.56
237.86	214.81
238.313	192.96
238.767	175.97
239.221	175.97
239.674	149.27
240.128	168.69
240.581	149.27
241.035	103.16
241.488	171.12
241.942	226.95
242.395	98.3
242.848	100.73
243.301	154.13
243.755	212.38
244.208	146.85
244.661	173.55
245.114	98.3
245.567	117.72
246.02	137.14
246.473	158.98
246.926	125
247.379	144.42
247.832	156.56
248.284	197.82
248.737	115.29
249.19	192.96
249.642	112.87
250.095	173.55
250.547	195.39
251	171.12
251.452	146.85
251.905	205.1
252.357	180.83
252.81	183.26
253.262	163.84
253.714	183.26
254.166	139.57
254.618	141.99
255.07	112.87
255.523	144.42
255.975	115.29
256.427	166.26
256.878	112.87
257.33	151.7
257.782	195.39
258.234	188.11
258.686	195.39
259.137	180.83
259.589	154.13
260.041	158.98
260.492	195.39
260.944	183.26
261.395	110.44
261.847	202.67
262.298	224.52
262.749	156.56
263.201	156.56
263.652	146.85
264.103	117.72
264.554	141.99
265.005	98.3
265.457	139.57
265.908	129.86
266.359	144.42
266.809	180.83
267.26	156.56
267.711	149.27
268.162	171.12
268.613	183.26
269.064	134.71
269.514	105.58
269.965	168.69
270.415	171.12
270.866	163.84
271.316	163.84
271.767	146.85
272.217	173.55
272.668	139.57
273.118	125
273.568	163.84
274.019	93.45
274.469	86.17
274.919	149.27
275.369	168.69
275.819	149.27
276.269	209.95
276.719	183.26
277.169	115.29
277.619	125
278.069	197.82
278.518	125
278.968	173.55
279.418	117.72
279.867	156.56
280.317	103.16
280.767	134.71
281.216	219.66
281.666	171.12
282.115	168.69
282.564	137.14
283.014	207.53
283.463	156.56
283.912	226.95
284.361	166.26
284.811	205.1
285.26	151.7
285.709	188.11
286.158	214.81
286.607	168.69
287.056	180.83
287.505	168.69
287.953	86.17
288.402	175.97
288.851	144.42
289.3	115.29
289.748	185.68
290.197	141.99
290.646	173.55
291.094	180.83
291.543	137.14
291.991	149.27
292.439	146.85
292.888	115.29
293.336	231.8
293.784	183.26
294.233	154.13
294.681	175.97
295.129	127.43
295.577	173.55
296.025	224.52
296.473	178.4
296.921	192.96
297.369	91.02
297.817	197.82
298.264	108.01
298.712	129.86
299.16	212.38
299.608	115.29
300.055	183.26
300.503	171.12
300.95	183.26
301.398	171.12
301.845	171.12
302.293	258.5
302.74	156.56
303.187	183.26
303.635	141.99
304.082	180.83
304.529	154.13
304.976	154.13
305.423	197.82
305.87	108.01
306.317	98.3
306.764	190.54
307.211	66.75
307.658	110.44
308.105	108.01
308.552	156.56
308.998	108.01
309.445	183.26
309.892	151.7
310.338	149.27
310.785	151.7
311.231	156.56
311.678	146.85
312.124	183.26
312.571	171.12
313.017	83.74
313.463	83.74
313.909	137.14
314.356	54.61
314.802	144.42
315.248	217.24
315.694	200.25
316.14	134.71
316.586	137.14
317.032	207.53
317.478	98.3
317.923	146.85
318.369	158.98
318.815	188.11
319.261	129.86
319.706	161.41
320.152	185.68
320.597	120.15
321.043	122.57
321.488	158.98
321.934	156.56
322.379	161.41
322.824	166.26
323.27	134.71
323.715	158.98
324.16	129.86
324.605	190.54
325.05	161.41
325.495	129.86
325.94	200.25
326.385	222.09
326.83	100.73
327.275	161.41
327.72	161.41
328.165	175.97
328.61	180.83
329.054	200.25
329.499	158.98
329.943	231.8
330.388	137.14
330.832	173.55
331.277	154.13
331.721	108.01
332.166	168.69
332.61	151.7
333.054	173.55
333.499	202.67
333.943	200.25
334.387	171.12
334.831	171.12
335.275	110.44
335.719	234.23
336.163	188.11
336.607	156.56
337.051	236.65
337.495	178.4
337.938	173.55
338.382	180.83
338.826	234.23
339.269	207.53
339.713	117.72
340.157	158.98
340.6	195.39
341.044	98.3
341.487	192.96
341.93	88.59
342.374	105.58
342.817	125
343.26	144.42
343.703	149.27
344.146	88.59
344.59	76.46
345.033	149.27
345.476	110.44
345.919	125
346.361	161.41
346.804	139.57
347.247	202.67
347.69	146.85
348.133	192.96
348.575	200.25
349.018	144.42
349.461	185.68
349.903	103.16
350.346	161.41
350.788	117.72
351.23	156.56
351.673	171.12
352.115	146.85
352.557	120.15
353	149.27
353.442	100.73
353.884	214.81
354.326	222.09
354.768	185.68
355.21	120.15
355.652	103.16
356.094	154.13
356.536	151.7
356.978	146.85
357.419	222.09
357.861	141.99
358.303	217.24
358.744	134.71
359.186	132.28
359.627	173.55
360.069	112.87
360.51	139.57
360.952	141.99
361.393	161.41
361.834	195.39
362.276	134.71
362.717	125
363.158	141.99
363.599	200.25
364.04	117.72
364.481	161.41
364.922	236.65
365.363	134.71
365.804	183.26
366.245	229.37
366.686	175.97
367.126	132.28
367.567	117.72
368.008	171.12
368.448	149.27
368.889	125
369.33	115.29
369.77	190.54
370.21	217.24
370.651	141.99
371.091	129.86
371.531	134.71
371.972	103.16
372.412	129.86
372.852	163.84
373.292	226.95
373.732	91.02
374.172	122.57
374.612	144.42
375.052	112.87
375.492	180.83
375.932	137.14
376.372	180.83
376.811	253.64
377.251	207.53
377.691	154.13
378.13	183.26
378.57	197.82
379.009	112.87
379.449	175.97
379.888	81.31
380.328	134.71
380.767	161.41
381.206	188.11
381.645	74.03
382.085	173.55
382.524	175.97
382.963	127.43
383.402	161.41
383.841	144.42
384.28	122.57
384.719	151.7
385.158	137.14
385.596	154.13
386.035	161.41
386.474	190.54
386.913	88.59
387.351	61.89
387.79	129.86
388.228	100.73
388.667	112.87
389.105	202.67
389.544	197.82
389.982	183.26
390.42	146.85
390.859	190.54
391.297	103.16
391.735	171.12
392.173	200.25
392.611	78.88
393.049	224.52
393.487	151.7
393.925	178.4
394.363	117.72
394.801	209.95
395.239	175.97
395.676	200.25
396.114	127.43
396.552	154.13
396.989	98.3
397.427	137.14
397.864	180.83
398.302	219.66
398.739	175.97
399.177	98.3
399.614	146.85
400.051	190.54
400.488	192.96
400.926	78.88
401.363	129.86
401.8	139.57
402.237	110.44
402.674	105.58
403.111	166.26
403.548	168.69
403.985	197.82
404.421	146.85
404.858	100.73
405.295	205.1
405.732	175.97
406.168	125
406.605	127.43
407.041	161.41
407.478	168.69
407.914	117.72
408.351	141.99
408.787	115.29
409.223	154.13
409.66	120.15
410.096	132.28
410.532	197.82
410.968	171.12
411.404	190.54
411.84	217.24
412.276	171.12
412.712	161.41
413.148	122.57
413.584	129.86
414.02	156.56
414.455	132.28
414.891	168.69
415.327	149.27
415.762	161.41
416.198	171.12
416.633	149.27
417.069	168.69
417.504	110.44
417.94	115.29
418.375	144.42
418.81	103.16
419.245	129.86
419.681	212.38
420.116	149.27
420.551	158.98
420.986	168.69
421.421	202.67
421.856	149.27
422.291	151.7
422.726	212.38
423.16	188.11
423.595	178.4
424.03	175.97
424.464	219.66
424.899	202.67
425.334	224.52
425.768	110.44
426.203	141.99
426.637	202.67
427.071	171.12
427.506	192.96
427.94	125
428.374	144.42
428.809	178.4
429.243	175.97
429.677	212.38
430.111	190.54
430.545	171.12
430.979	98.3
431.413	129.86
431.847	93.45
432.28	168.69
432.714	156.56
433.148	139.57
433.582	185.68
434.015	217.24
434.449	248.79
434.882	197.82
435.316	214.81
435.749	137.14
436.183	180.83
436.616	214.81
437.049	185.68
437.483	161.41
437.916	234.23
438.349	209.95
438.782	154.13
439.215	139.57
439.648	192.96
440.081	139.57
440.514	132.28
440.947	219.66
441.38	190.54
441.813	158.98
442.245	180.83
442.678	163.84
443.111	202.67
443.543	212.38
443.976	180.83
444.408	200.25
444.841	180.83
445.273	209.95
445.705	192.96
446.138	241.51
446.57	256.07
447.002	234.23
447.434	270.64
447.867	248.79
448.299	246.36
448.731	251.22
449.163	163.84
449.595	243.94
450.026	224.52
450.458	311.9
450.89	217.24
451.322	248.79
451.754	253.64
452.185	273.06
452.617	222.09
453.048	239.08
453.48	188.11
453.911	345.88
454.343	207.53
454.774	251.22
455.205	231.8
455.637	302.19
456.068	302.19
456.499	248.79
456.93	265.78
457.361	241.51
457.792	275.49
458.223	268.21
458.654	273.06
459.085	311.9
459.516	275.49
459.947	297.33
460.378	241.51
460.808	304.62
461.239	280.34
461.669	241.51
462.1	297.33
462.531	290.05
462.961	280.34
463.391	243.94
463.822	260.93
464.252	256.07
464.682	263.35
465.113	256.07
465.543	248.79
465.973	234.23
466.403	304.62
466.833	256.07
467.263	292.48
467.693	277.92
468.123	219.66
468.553	321.61
468.983	265.78
469.412	248.79
469.842	314.33
470.272	282.77
470.701	234.23
471.131	214.81
471.56	175.97
471.99	226.95
472.419	205.1
472.849	246.36
473.278	275.49
473.707	246.36
474.136	243.94
474.566	212.38
474.995	246.36
475.424	195.39
475.853	258.5
476.282	229.37
476.711	202.67
477.14	253.64
477.569	214.81
477.997	224.52
478.426	197.82
478.855	115.29
479.283	214.81
479.712	207.53
480.141	229.37
480.569	268.21
480.998	275.49
481.426	188.11
481.854	190.54
482.283	212.38
482.711	175.97
483.139	202.67
483.567	260.93
483.995	222.09
484.424	209.95
484.852	243.94
485.28	222.09
485.708	248.79
486.135	287.63
486.563	151.7
486.991	178.4
487.419	158.98
487.847	192.96
488.274	202.67
488.702	260.93
489.129	154.13
489.557	202.67
489.984	188.11
490.412	277.92
490.839	263.35
491.266	200.25
491.694	214.81
492.121	251.22
492.548	219.66
492.975	239.08
493.402	151.7
493.829	163.84
494.256	207.53
494.683	163.84
495.11	229.37
495.537	175.97
495.964	149.27
496.39	175.97
496.817	188.11
497.244	285.2
497.67	183.26
498.097	146.85
498.523	173.55
498.95	185.68
499.376	149.27
499.803	195.39
500.229	180.83
500.655	212.38
501.081	173.55
501.508	180.83
501.934	224.52
502.36	188.11
502.786	110.44
503.212	156.56
503.638	217.24
504.064	117.72
504.489	156.56
504.915	226.95
505.341	214.81
505.767	197.82
506.192	156.56
506.618	180.83
507.043	127.43
507.469	122.57
507.894	239.08
508.32	209.95
508.745	192.96
509.17	190.54
509.596	214.81
510.021	158.98
510.446	137.14
510.871	205.1
511.296	258.5
511.721	236.65
512.146	214.81
512.571	229.37
512.996	236.65
513.421	207.53
513.845	248.79
514.27	231.8
514.695	195.39
515.119	158.98
515.544	214.81
515.969	200.25
516.393	183.26
516.817	222.09
517.242	134.71
517.666	222.09
518.09	207.53
518.515	117.72
518.939	205.1
519.363	389.57
519.787	212.38
520.211	161.41
520.635	103.16
521.059	188.11
521.483	260.93
521.907	183.26
522.331	209.95
522.754	197.82
523.178	205.1
523.602	149.27
524.025	197.82
524.449	154.13
524.872	190.54
525.296	151.7
525.719	241.51
526.143	217.24
526.566	163.84
526.989	175.97
527.412	202.67
527.836	161.41
528.259	200.25
528.682	168.69
529.105	229.37
529.528	146.85
529.951	212.38
530.374	173.55
530.796	248.79
531.219	234.23
531.642	166.26
532.065	151.7
532.487	158.98
532.91	195.39
533.332	243.94
533.755	217.24
534.177	171.12
534.6	217.24
535.022	202.67
535.444	239.08
535.867	190.54
536.289	192.96
536.711	168.69
537.133	141.99
537.555	183.26
537.977	151.7
538.399	209.95
538.821	260.93
539.243	161.41
539.665	222.09
540.086	168.69
540.508	154.13
540.93	231.8
541.351	166.26
541.773	158.98
542.195	137.14
542.616	263.35
543.037	139.57
543.459	183.26
543.88	173.55
544.301	241.51
544.723	212.38
545.144	190.54
545.565	207.53
545.986	236.65
546.407	166.26
546.828	163.84
547.249	183.26
547.67	151.7
548.091	239.08
548.512	151.7
548.932	219.66
549.353	285.2
549.774	163.84
550.194	229.37
550.615	137.14
551.035	217.24
551.456	156.56
551.876	205.1
552.296	258.5
552.717	192.96
553.137	217.24
553.557	222.09
553.977	125
554.397	168.69
554.817	173.55
555.237	205.1
555.657	219.66
556.077	205.1
556.497	202.67
556.917	212.38
557.337	125
557.756	151.7
558.176	163.84
558.596	166.26
559.015	185.68
559.435	236.65
559.854	222.09
560.274	209.95
560.693	129.86
561.112	183.26
561.532	146.85
561.951	178.4
562.37	141.99
562.789	248.79
563.208	185.68
563.627	151.7
564.046	195.39
564.465	188.11
564.884	137.14
565.303	209.95
565.722	195.39
566.14	195.39
566.559	180.83
566.978	219.66
567.396	265.78
567.815	241.51
568.233	158.98
568.652	202.67
569.07	132.28
569.489	234.23
569.907	248.79
570.325	253.64
570.743	137.14
571.161	202.67
571.58	161.41
571.998	146.85
572.416	246.36
572.833	197.82
573.251	166.26
573.669	185.68
574.087	171.12
574.505	205.1
574.922	188.11
575.34	125
575.758	188.11
576.175	173.55
576.593	129.86
577.01	195.39
577.428	207.53
577.845	1712.41
578.262	294.91
578.68	190.54
579.097	161.41
579.514	209.95
579.931	154.13
580.348	125
580.765	173.55
581.182	219.66
581.599	202.67
582.016	243.94
582.433	112.87
582.849	117.72
583.266	188.11
583.683	188.11
584.099	212.38
584.516	192.96
584.933	205.1
585.349	180.83
585.765	212.38
586.182	156.56
586.598	178.4
587.014	207.53
587.431	209.95
587.847	212.38
588.263	149.27
588.679	161.41
589.095	132.28
589.511	192.96
589.927	144.42
590.343	214.81
590.759	173.55
591.174	144.42
591.59	110.44
592.006	197.82
592.421	234.23
592.837	239.08
593.252	202.67
593.668	175.97
594.083	205.1
594.499	236.65
594.914	154.13
595.329	122.57
595.745	190.54
596.16	110.44
596.575	173.55
596.99	183.26
597.405	202.67
597.82	178.4
598.235	205.1
598.65	156.56
599.065	175.97
599.479	239.08
599.894	197.82
600.309	115.29
600.724	214.81
601.138	185.68
601.553	192.96
601.967	234.23
602.382	229.37
602.796	222.09
603.21	226.95
603.625	183.26
604.039	205.1
604.453	219.66
604.867	205.1
605.281	212.38
605.695	190.54
606.109	209.95
606.523	137.14
606.937	302.19
607.351	248.79
607.765	88.59
608.178	166.26
608.592	239.08
609.006	200.25
609.419	209.95
609.833	156.56
610.246	192.96
610.66	178.4
611.073	141.99
611.487	168.69
611.9	231.8
612.313	185.68
612.726	178.4
613.139	224.52
613.553	144.42
613.966	236.65
614.379	219.66
614.792	141.99
615.204	166.26
615.617	197.82
616.03	222.09
616.443	166.26
616.856	248.79
617.268	214.81
617.681	151.7
618.093	183.26
618.506	185.68
618.918	171.12
619.331	91.02
619.743	88.59
620.155	175.97
620.568	120.15
620.98	209.95
621.392	234.23
621.804	251.22
622.216	268.21
622.628	200.25
623.04	154.13
623.452	110.44
623.864	154.13
624.276	151.7
624.687	161.41
625.099	137.14
625.511	246.36
625.922	185.68
626.334	117.72
626.745	154.13
627.157	117.72
627.568	141.99
627.979	188.11
628.391	229.37
628.802	132.28
629.213	192.96
629.624	105.58
630.035	171.12
630.446	144.42
630.857	115.29
631.268	108.01
631.679	161.41
632.09	171.12
632.501	141.99
632.912	134.71
633.322	355.59
633.733	168.69
634.144	183.26
634.554	117.72
634.965	134.71
635.375	209.95
635.785	207.53
636.196	229.37
636.606	161.41
637.016	214.81
637.427	188.11
637.837	185.68
638.247	134.71
638.657	188.11
639.067	192.96
639.477	154.13
639.887	207.53
640.297	217.24
640.706	197.82
641.116	139.57
641.526	110.44
641.935	127.43
642.345	115.29
642.755	137.14
643.164	105.58
643.573	222.09
643.983	195.39
644.392	178.4
644.801	197.82
645.211	180.83
645.62	168.69
646.029	151.7
646.438	212.38
646.847	200.25
647.256	137.14
647.665	156.56
648.074	161.41
648.483	93.45
648.892	188.11
649.3	161.41
649.709	149.27
650.118	178.4
650.526	100.73
650.935	163.84
651.343	190.54
651.752	144.42
652.16	219.66
652.568	139.57
652.977	156.56
653.385	190.54
653.793	178.4
654.201	158.98
654.609	125
655.017	183.26
655.425	205.1
655.833	132.28
656.241	117.72
656.649	163.84
657.057	137.14
657.464	202.67
657.872	163.84
658.28	207.53
658.687	163.84
659.095	175.97
659.502	112.87
659.91	134.71
660.317	95.88
660.724	144.42
661.132	105.58
661.539	120.15
661.946	146.85
662.353	168.69
662.76	108.01
663.167	212.38
663.574	98.3
663.981	200.25
664.388	103.16
664.795	185.68
665.202	146.85
665.608	156.56
666.015	112.87
666.422	229.37
666.828	137.14
667.235	192.96
667.641	209.95
668.047	183.26
668.454	132.28
668.86	115.29
669.266	222.09
669.673	178.4
670.079	141.99
670.485	226.95
670.891	115.29
671.297	188.11
671.703	125
672.109	185.68
672.515	115.29
672.92	175.97
673.326	95.88
673.732	171.12
674.138	214.81
674.543	127.43
674.949	137.14
675.354	180.83
675.76	180.83
676.165	200.25
676.57	151.7
676.976	200.25
677.381	120.15
677.786	202.67
678.191	175.97
678.596	154.13
679.001	137.14
679.406	195.39
679.811	88.59
680.216	195.39
680.621	137.14
681.026	117.72
681.43	98.3
681.835	122.57
682.24	226.95
682.644	156.56
683.049	127.43
683.453	212.38
683.858	115.29
684.262	156.56
684.667	115.29
685.071	183.26
685.475	195.39
685.879	205.1
686.283	166.26
686.687	132.28
687.091	188.11
687.495	144.42
687.899	105.58
688.303	108.01
688.707	166.26
689.111	156.56
689.514	156.56
689.918	192.96
690.322	141.99
690.725	98.3
691.129	214.81
691.532	212.38
691.936	120.15
692.339	161.41
692.742	173.55
693.146	163.84
693.549	200.25
693.952	207.53
694.355	188.11
694.758	154.13
695.161	168.69
695.564	161.41
695.967	195.39
696.37	195.39
696.773	202.67
697.175	144.42
697.578	171.12
697.981	163.84
698.383	171.12
698.786	166.26
699.188	205.1
699.591	175.97
699.993	183.26
700.395	168.69
700.798	156.56
701.2	146.85
701.602	163.84
702.004	175.97
702.406	188.11
702.808	246.36
703.21	151.7
703.612	200.25
704.014	243.94
704.416	175.97
704.818	234.23
705.219	175.97
705.621	183.26
706.023	190.54
706.424	166.26
706.826	200.25
707.227	190.54
707.629	239.08
708.03	226.95
708.431	212.38
708.832	217.24
709.234	214.81
709.635	239.08
710.036	185.68
710.437	154.13
710.838	185.68
711.239	229.37
711.64	251.22
712.041	188.11
712.441	88.59
712.842	219.66
713.243	197.82
713.643	214.81
714.044	205.1
714.445	209.95
714.845	200.25
715.246	273.06
715.646	287.63
716.046	209.95
716.447	212.38
716.847	265.78
717.247	146.85
717.647	275.49
718.047	205.1
718.447	241.51
718.847	236.65
719.247	285.2
719.647	214.81
720.047	273.06
720.446	299.76
720.846	316.75
721.246	321.61
721.645	294.91
722.045	243.94
722.444	304.62
722.844	280.34
723.243	304.62
723.643	316.75
724.042	277.92
724.441	219.66
724.84	331.32
725.24	307.04
725.639	297.33
726.038	324.03
726.437	302.19
726.836	343.45
727.234	350.73
727.633	358.02
728.032	413.84
728.431	387.14
728.83	452.68
729.228	319.18
729.627	430.83
730.025	396.85
730.424	452.68
730.822	472.09
731.22	491.51
731.619	481.8
732.017	523.07
732.415	513.36
732.813	520.64
733.212	595.88
733.61	658.99
734.008	724.53
734.406	785.21
734.803	850.74
735.201	770.64
735.599	792.49
735.997	712.39
736.395	743.94
736.792	928.41
737.19	991.52
737.587	1127.44
737.985	1251.23
738.382	1142.01
738.78	1120.16
739.177	1047.35
739.574	1066.76
739.971	1234.24
740.369	1404.15
740.766	1644.44
741.163	1782.79
741.56	1685.71
741.957	1673.57
742.354	1484.25
742.751	1481.82
743.147	1731.82
743.544	1993.96
743.941	2345.91
744.338	2459.99
744.734	2508.53
745.131	2200.28
745.527	2054.64
745.924	1901.73
746.32	2166.3
746.716	2702.71
747.113	3115.34
747.509	3646.9
747.905	3530.39
748.301	3367.77
748.697	2964.85
749.093	2819.22
749.489	2943.01
749.885	3508.55
750.281	4341.09
750.677	5042.55
751.073	5110.52
751.468	4913.91
751.864	4362.93
752.26	3899.33
752.655	4052.25
753.051	4520.7
753.446	5469.75
753.842	6285.29
754.237	7008.6
754.632	6671.22
755.028	6061.99
755.423	5345.96
755.818	5061.97
756.213	5350.81
756.608	6319.27
757.003	7382.4
757.398	7865.41
757.793	7974.64
758.188	7428.51
758.583	6731.9
758.977	5724.6
759.372	5977.03
759.767	7066.86
760.161	8586.3
760.556	10319.34
760.95	10741.67
761.345	10615.46
761.739	10122.73
762.133	8901.84
762.527	8336.29
762.922	8746.5
763.316	10258.65
763.71	11974.7
764.104	13554.82
764.498	13969.88
764.892	13346.08
765.286	11727.12
765.68	10380.02
766.073	10013.51
766.467	11064.49
766.861	13173.75
767.255	15622.82
767.648	16807.3
768.042	16448.07
768.435	15309.7
768.829	13559.68
769.222	12032.95
769.615	11984.41
770.008	13513.56
770.402	16003.89
770.795	17911.69
771.188	19028.21
771.581	18168.97
771.974	16275.74
772.367	13952.89
772.76	13001.42
773.153	12836.36
773.545	14503.87
773.938	16768.46
774.331	18270.92
774.724	19176.27
775.116	18814.61
775.509	17232.06
775.901	15545.14
776.294	14681.05
776.686	15261.16
777.078	17715.08
777.471	21030.67
777.863	23916.63
778.255	24778.3
778.647	23438.47
779.039	21081.64
779.431	18368
779.823	17411.68
780.215	18547.62
780.607	20542.8
780.999	23926.34
781.39	25700.64
781.782	26326.87
782.174	24855.97
782.565	21812.23
782.957	19161.71
783.348	18222.37
783.74	19222.39
784.131	21118.05
784.522	24533.15
784.914	26351.14
785.305	26914.25
785.696	24909.37
786.087	21627.76
786.478	19144.72
786.869	17535.47
787.26	17348.57
787.651	19030.64
788.042	21341.35
788.433	22741.86
788.823	22870.5
789.214	21372.91
789.605	18727.23
789.995	16443.22
790.386	14795.13
790.776	15093.68
791.167	16530.6
791.557	18994.23
791.948	21503.98
792.338	22232.14
792.728	21749.12
793.118	19741.81
793.508	17064.59
793.898	15615.53
794.288	15482.04
794.678	16960.22
795.068	19443.26
795.458	21933.59
795.848	22528.26
796.238	21761.26
796.627	19974.83
797.017	17542.75
797.406	15719.9
797.796	15202.91
798.185	16195.64
798.575	18455.38
798.964	20957.85
799.354	22385.06
799.743	22324.38
800.132	20826.78
800.521	18418.98
800.91	16338.85
801.299	14615.52
801.688	15025.72
802.077	16768.46
802.466	18758.79
802.855	21023.39
803.244	20581.63
803.633	19802.49
804.021	17865.57
804.41	15321.84
804.799	13651.91
805.187	12673.74
805.576	13336.37
805.964	15147.08
806.352	16455.35
806.741	17952.95
807.129	17268.47
807.517	16091.27
807.905	13846.09
808.293	12202.86
808.681	11032.94
809.069	11511.1
809.457	13494.14
809.845	15579.13
810.233	17341.29
810.621	18300.04
811.009	17219.93
811.396	15552.43
811.784	13457.73
812.171	11809.65
812.559	11132.45
812.946	11981.98
813.334	13261.13
813.721	15076.69
814.108	16394.67
814.496	16067
814.883	14685.91
815.27	13382.49
815.657	11229.54
816.044	10113.02
816.431	10295.06
816.818	11224.69
817.205	12792.67
817.592	14227.16
817.979	15115.53
818.365	14824.26
818.752	13183.46
819.139	11130.03
819.525	9137.28
819.912	8307.17
820.298	8557.17
820.685	9275.63
821.071	10545.07
821.457	11710.13
821.843	11957.71
822.23	11202.84
822.616	9630
823.002	7816.87
823.388	6761.03
823.774	6115.39
824.16	6185.78
824.546	7093.56
824.931	8071.73
825.317	8700.38
825.703	8727.08
826.089	8338.72
826.474	7525.6
826.86	6256.17
827.245	5241.59
827.631	5003.72
828.016	5275.57
828.401	5962.47
828.787	6812
829.172	7411.52
829.557	7469.78
829.942	6860.54
830.327	5923.64
830.712	5023.14
831.097	4338.66
831.482	4093.51
831.867	4137.2
832.252	4850.8
832.636	5501.3
833.021	5884.8
833.406	6064.41
833.79	5544.99
834.175	4787.7
834.559	4115.36
834.944	3443.01
835.328	3258.55
835.713	3178.45
836.097	3612.92
836.481	4217.3
836.865	4615.36
837.249	4503.71
837.633	4290.12
838.017	3775.54
838.401	3061.94
838.785	2620.19
839.169	2273.09
839.553	2273.09
839.937	2443
840.32	2780.38
840.704	3054.66
841.087	3088.64
841.471	2768.25
841.854	2566.79
842.238	2224.55
842.621	1773.09
843.004	1678.42
843.388	1581.34
843.771	1753.67
844.154	2059.5
844.537	2530.38
844.92	2547.37
845.303	2464.84
845.686	2229.4
846.069	1962.41
846.452	1515.8
846.834	1355.6
847.217	1304.63
847.6	1411.43
847.982	1656.58
848.365	1814.35
848.748	1984.25
849.13	1979.4
849.512	1802.21
849.895	1484.25
850.277	1226.96
850.659	1100.75
851.041	976.96
851.423	1057.06
851.806	1209.97
852.188	1411.43
852.57	1515.8
852.951	1617.74
853.333	1472.11
853.715	1309.49
854.097	1115.31
854.479	901.71
854.86	862.88
855.242	845.89
855.623	892
856.005	989.09
856.386	1054.63
856.768	1144.44
857.149	1125.02
857.53	1001.23
857.911	845.89
858.292	799.77
858.674	666.27
859.055	576.47
859.436	532.78
859.817	673.55
860.197	632.29
860.578	828.9
860.959	780.35
861.34	773.07
861.72	678.41
862.101	627.44
862.482	542.48
862.862	389.57
863.243	355.59
863.623	493.94
864.003	491.51
864.384	552.19
864.764	654.14
865.144	571.61
865.524	598.31
865.904	525.49
866.284	464.81
866.664	413.84
867.044	440.54
867.424	406.56
867.804	377.43
868.183	467.24
868.563	387.14
868.943	411.41
869.322	452.68
869.702	404.13
870.081	425.98
870.461	411.41
870.84	336.17
871.22	367.72
871.599	297.33
871.978	256.07
872.357	292.48
872.736	375.01
873.115	362.87
873.494	343.45
873.873	348.31
874.252	302.19
874.631	270.64
875.01	316.75
875.388	222.09
875.767	256.07
876.146	316.75
876.524	241.51
876.903	231.8
877.281	297.33
877.66	239.08
878.038	304.62
878.416	231.8
878.794	222.09
879.173	214.81
879.551	173.55
879.929	214.81
880.307	263.35
880.685	158.98
881.063	239.08
881.441	302.19
881.818	248.79
882.196	275.49
882.574	239.08
882.951	239.08
883.329	168.69
883.707	241.51
884.084	236.65
884.461	183.26
884.839	188.11
885.216	134.71
885.593	171.12
885.971	209.95
886.348	212.38
886.725	243.94
887.102	146.85
887.479	197.82
887.856	190.54
888.233	219.66
888.609	212.38
888.986	192.96
889.363	122.57
889.74	163.84
890.116	192.96
890.493	185.68
890.869	171.12
891.246	253.64
891.622	173.55
891.998	205.1
892.375	137.14
892.751	195.39
893.127	260.93
893.503	163.84
893.879	171.12
894.255	161.41
894.631	151.7
895.007	175.97
895.383	173.55
895.759	226.95
896.134	226.95
896.51	76.46
896.886	214.81
897.261	166.26
897.637	166.26
898.012	105.58
898.388	171.12
898.763	117.72
899.138	178.4
899.514	168.69
899.889	209.95
900.264	173.55
900.639	175.97
901.014	154.13
901.389	103.16
901.764	219.66
902.139	129.86
902.513	156.56
902.888	180.83
903.263	214.81
903.638	108.01
904.012	137.14
904.387	144.42
904.761	168.69
905.136	173.55
905.51	108.01
905.884	168.69
906.259	93.45
906.633	146.85
907.007	197.82
907.381	163.84
907.755	105.58
908.129	205.1
908.503	171.12
908.877	117.72
909.251	163.84
909.624	163.84
909.998	151.7
910.372	105.58
910.745	129.86
911.119	105.58
911.492	98.3
911.866	173.55
912.239	110.44
912.612	168.69
912.986	188.11
913.359	202.67
913.732	139.57
914.105	163.84
914.478	178.4
914.851	141.99
915.224	156.56
915.597	151.7
915.97	190.54
916.343	132.28
916.715	202.67
917.088	205.1
917.461	212.38
917.833	158.98
918.206	110.44
918.578	122.57
918.951	175.97
919.323	146.85
919.695	115.29
920.067	110.44
920.44	151.7
920.812	134.71
921.184	100.73
921.556	125
921.928	144.42
922.3	132.28
922.672	168.69
923.043	100.73
923.415	202.67
923.787	180.83
924.158	192.96
924.53	207.53
924.901	239.08
925.273	173.55
925.644	129.86
926.016	134.71
926.387	81.31
926.758	127.43
927.129	129.86
927.5	154.13
927.872	141.99
928.243	125
928.613	127.43
928.984	188.11
929.355	117.72
929.726	103.16
930.097	103.16
930.467	178.4
930.838	168.69
931.209	120.15
931.579	127.43
931.95	125
932.32	103.16
932.69	205.1
933.061	183.26
933.431	132.28
933.801	166.26
934.171	146.85
934.541	180.83
934.911	132.28
935.281	115.29
935.651	192.96
936.021	139.57
936.391	98.3
936.761	219.66
937.13	231.8
937.5	151.7
937.87	185.68
938.239	154.13
938.609	219.66
938.978	209.95
939.347	171.12
939.717	139.57
940.086	151.7
940.455	195.39
940.824	134.71
941.193	188.11
941.562	149.27
941.931	168.69
942.3	137.14
942.669	132.28
943.038	98.3
943.407	120.15
943.775	171.12
944.144	166.26
944.513	188.11
944.881	171.12
945.25	156.56
945.618	183.26
945.986	195.39
946.355	69.18
946.723	125
947.091	149.27
947.459	197.82
947.827	200.25
948.195	129.86
948.563	185.68
948.931	190.54
949.299	161.41
949.667	88.59
950.035	149.27
950.402	168.69
950.77	226.95
951.138	144.42
951.505	209.95
951.873	214.81
952.24	161.41
952.607	195.39
952.975	163.84
953.342	151.7
953.709	195.39
954.076	98.3
954.443	192.96
954.81	137.14
955.177	144.42
955.544	134.71
955.911	202.67
956.278	171.12
956.645	141.99
957.012	207.53
957.378	207.53
957.745	158.98
958.111	154.13
958.478	134.71
958.844	127.43
959.211	151.7
959.577	139.57
959.943	166.26
960.309	214.81
960.675	251.22
961.042	125
961.408	100.73
961.774	205.1
962.139	141.99
962.505	205.1
962.871	144.42
963.237	197.82
963.603	163.84
963.968	207.53
964.334	134.71
964.699	219.66
965.065	180.83
965.43	202.67
965.796	151.7
966.161	127.43
966.526	117.72
966.891	166.26
967.256	180.83
967.622	173.55
967.987	110.44
968.352	173.55
968.716	122.57
969.081	178.4
969.446	139.57
969.811	197.82
970.176	158.98
970.54	195.39
970.905	141.99
971.269	192.96
971.634	175.97
971.998	260.93
972.363	168.69
972.727	122.57
973.091	171.12
973.455	251.22
973.819	190.54
974.183	158.98
974.547	146.85
974.911	120.15
975.275	149.27
975.639	127.43
976.003	180.83
976.367	168.69
976.73	149.27
977.094	156.56
977.458	243.94
977.821	219.66
978.185	120.15
978.548	175.97
978.911	190.54
979.275	117.72
979.638	117.72
980.001	93.45
980.364	117.72
980.727	166.26
981.09	185.68
981.453	139.57
981.816	185.68
982.179	217.24
982.542	132.28
982.905	125
983.267	134.71
983.63	144.42
983.992	110.44
984.355	168.69
984.717	217.24
985.08	137.14
985.442	151.7
985.804	180.83
986.167	166.26
986.529	175.97
986.891	139.57
987.253	105.58
987.615	222.09
987.977	103.16
988.339	100.73
988.701	137.14
989.062	137.14
989.424	120.15
989.786	234.23
990.147	146.85
990.509	161.41
990.87	226.95
991.232	154.13
991.593	83.74
991.955	129.86
992.316	207.53
992.677	95.88
993.038	175.97
993.399	125
993.76	149.27
994.121	209.95
994.482	180.83
994.843	71.6
995.204	134.71
995.565	125
995.926	158.98
996.286	200.25
996.647	188.11
997.007	134.71
997.368	71.6
997.728	161.41
998.089	158.98
998.449	166.26
998.809	151.7
999.169	95.88
999.53	132.28
999.89	103.16
1000.25	98.3
1000.61	144.42
1000.97	86.17
1001.329	137.14
1001.689	175.97
1002.049	161.41
1002.409	139.57
1002.768	86.17
1003.128	83.74
1003.487	188.11
1003.847	129.86
1004.206	112.87
1004.566	144.42
1004.925	137.14
1005.284	154.13
1005.643	219.66
1006.003	127.43
1006.362	188.11
1006.721	144.42
1007.08	166.26
1007.438	149.27
1007.797	209.95
1008.156	115.29
1008.515	154.13
1008.874	127.43
1009.232	98.3
1009.591	93.45
1009.949	115.29
1010.308	166.26
1010.666	229.37
1011.024	139.57
1011.383	161.41
1011.741	180.83
1012.099	122.57
1012.457	161.41
1012.815	183.26
1013.173	115.29
1013.531	129.86
1013.889	125
1014.247	149.27
1014.605	222.09
1014.962	139.57
1015.32	91.02
1015.678	202.67
1016.035	158.98
1016.393	105.58
1016.75	127.43
1017.107	168.69
1017.465	158.98
1017.822	183.26
1018.179	156.56
1018.536	100.73
1018.894	158.98
1019.251	200.25
1019.608	183.26
1019.964	144.42
1020.321	122.57
1020.678	171.12
1021.035	202.67
1021.392	190.54
1021.748	151.7
1022.105	144.42
1022.461	180.83
1022.818	141.99
1023.174	95.88
1023.531	180.83
1023.887	149.27
1024.243	100.73
1024.599	192.96
1024.955	127.43
1025.311	178.4
1025.667	175.97
1026.023	86.17
1026.379	98.3
1026.735	175.97
1027.091	129.86
1027.447	197.82
