189.514	109.38
189.973	109.38
190.431	109.38
190.889	43.84
191.348	-14.41
191.806	17.14
192.264	-7.13
192.722	-7.13
193.18	-82.37
193.638	-11.98
194.096	-60.53
194.554	-72.66
195.012	46.27
195.47	-50.82
195.928	17.14
196.385	70.54
196.843	-14.41
197.301	41.41
197.758	31.71
198.216	55.98
198.674	53.55
199.131	-9.56
199.589	102.1
200.046	70.54
200.503	109.38
200.961	148.21
201.418	136.08
201.875	102.1
202.332	94.81
202.79	189.48
203.247	114.23
203.704	172.48
204.161	114.23
204.618	114.23
205.075	189.48
205.532	208.89
205.989	145.79
206.445	126.37
206.902	97.24
207.359	116.66
207.816	155.49
208.272	106.95
208.729	184.62
209.185	143.36
209.642	114.23
210.098	196.76
210.555	155.49
211.011	111.8
211.467	170.06
211.924	182.19
212.38	138.5
212.836	140.93
213.292	114.23
213.748	131.22
214.204	155.49
214.66	216.17
215.116	179.77
215.572	264.72
216.028	201.61
216.484	143.36
216.94	221.03
217.396	145.79
217.851	138.5
218.307	184.62
218.763	199.18
219.218	172.48
219.674	75.4
220.129	182.19
220.585	182.19
221.04	143.36
221.496	99.67
221.951	82.68
222.406	123.94
222.861	153.07
223.317	213.75
223.772	167.63
224.227	201.61
224.682	114.23
225.137	99.67
225.592	167.63
226.047	172.48
226.502	148.21
226.957	157.92
227.411	172.48
227.866	119.09
228.321	143.36
228.776	204.04
229.23	184.62
229.685	153.07
230.139	109.38
230.594	189.48
231.048	128.79
231.503	136.08
231.957	133.65
232.411	131.22
232.865	213.75
233.32	123.94
233.774	189.48
234.228	131.22
234.682	97.24
235.136	94.81
235.59	194.33
236.044	160.35
236.498	170.06
236.952	106.95
237.406	162.78
237.86	128.79
238.313	160.35
238.767	208.89
239.221	102.1
239.674	133.65
240.128	92.39
240.581	128.79
241.035	162.78
241.488	138.5
241.942	140.93
242.395	97.24
242.848	131.22
243.301	153.07
243.755	155.49
244.208	148.21
244.661	148.21
245.114	121.51
245.567	170.06
246.02	148.21
246.473	128.79
246.926	111.8
247.379	121.51
247.832	150.64
248.284	75.4
248.737	167.63
249.19	104.52
249.642	121.51
250.095	189.48
250.547	140.93
251	162.78
251.452	223.46
251.905	106.95
252.357	196.76
252.81	85.1
253.262	111.8
253.714	165.2
254.166	102.1
254.618	167.63
255.07	194.33
255.523	145.79
255.975	114.23
256.427	123.94
256.878	140.93
257.33	172.48
257.782	191.9
258.234	211.32
258.686	157.92
259.137	143.36
259.589	189.48
260.041	136.08
260.492	102.1
260.944	191.9
261.395	126.37
261.847	157.92
262.298	191.9
262.749	194.33
263.201	165.2
263.652	155.49
264.103	104.52
264.554	165.2
265.005	143.36
265.457	155.49
265.908	55.98
266.359	119.09
266.809	72.97
267.26	143.36
267.711	170.06
268.162	174.91
268.613	145.79
269.064	196.76
269.514	196.76
269.965	140.93
270.415	172.48
270.866	187.05
271.316	157.92
271.767	92.39
272.217	157.92
272.668	191.9
273.118	182.19
273.568	111.8
274.019	157.92
274.469	184.62
274.919	150.64
275.369	157.92
275.819	157.92
276.269	187.05
276.719	106.95
277.169	201.61
277.619	65.69
278.069	160.35
278.518	165.2
278.968	170.06
279.418	174.91
279.867	119.09
280.317	172.48
280.767	196.76
281.216	274.43
281.666	182.19
282.115	170.06
282.564	204.04
283.014	162.78
283.463	191.9
283.912	126.37
284.361	114.23
284.811	99.67
285.26	194.33
285.709	145.79
286.158	138.5
286.607	143.36
287.056	140.93
287.505	172.48
287.953	250.16
288.402	148.21
288.851	182.19
289.3	104.52
289.748	208.89
290.197	138.5
290.646	199.18
291.094	160.35
291.543	126.37
291.991	150.64
292.439	116.66
292.888	106.95
293.336	104.52
293.784	140.93
294.233	145.79
294.681	184.62
295.129	174.91
295.577	201.61
296.025	133.65
296.473	126.37
296.921	189.48
297.369	179.77
297.817	72.97
298.264	204.04
298.712	199.18
299.16	92.39
299.608	182.19
300.055	106.95
300.503	143.36
300.95	148.21
301.398	191.9
301.845	216.17
302.293	87.53
302.74	148.21
303.187	189.48
303.635	157.92
304.082	182.19
304.529	94.81
304.976	179.77
305.423	131.22
305.87	211.32
306.317	150.64
306.764	189.48
307.211	104.52
307.658	218.6
308.105	143.36
308.552	128.79
308.998	131.22
309.445	170.06
309.892	191.9
310.338	131.22
310.785	213.75
311.231	167.63
311.678	102.1
312.124	184.62
312.571	211.32
313.017	85.1
313.463	128.79
313.909	87.53
314.356	145.79
314.802	126.37
315.248	94.81
315.694	150.64
316.14	167.63
316.586	138.5
317.032	174.91
317.478	162.78
317.923	104.52
318.369	150.64
318.815	123.94
319.261	140.93
319.706	94.81
320.152	121.51
320.597	191.9
321.043	179.77
321.488	206.47
321.934	138.5
322.379	140.93
322.824	182.19
323.27	106.95
323.715	218.6
324.16	153.07
324.605	167.63
325.05	133.65
325.495	242.87
325.94	140.93
326.385	109.38
326.83	167.63
327.275	199.18
327.72	157.92
328.165	172.48
328.61	140.93
329.054	216.17
329.499	102.1
329.943	199.18
330.388	148.21
330.832	123.94
331.277	221.03
331.721	221.03
332.166	235.59
332.61	133.65
333.054	114.23
333.499	109.38
333.943	157.92
334.387	170.06
334.831	182.19
335.275	109.38
335.719	177.34
336.163	106.95
336.607	199.18
337.051	160.35
337.495	182.19
337.938	153.07
338.382	162.78
338.826	136.08
339.269	196.76
339.713	131.22
340.157	191.9
340.6	225.88
341.044	189.48
341.487	133.65
341.93	153.07
342.374	167.63
342.817	208.89
343.26	177.34
343.703	170.06
344.146	150.64
344.59	177.34
345.033	160.35
345.476	191.9
345.919	174.91
346.361	80.25
346.804	199.18
347.247	194.33
347.69	121.51
348.133	247.73
348.575	133.65
349.018	242.87
349.461	136.08
349.903	136.08
350.346	177.34
350.788	133.65
351.23	119.09
351.673	157.92
352.115	148.21
352.557	165.2
353	143.36
353.442	97.24
353.884	153.07
354.326	133.65
354.768	172.48
355.21	157.92
355.652	85.1
356.094	206.47
356.536	121.51
356.978	153.07
357.419	170.06
357.861	150.64
358.303	128.79
358.744	187.05
359.186	172.48
359.627	128.79
360.069	167.63
360.51	206.47
360.952	145.79
361.393	114.23
361.834	109.38
362.276	143.36
362.717	191.9
363.158	128.79
363.599	174.91
364.04	145.79
364.481	179.77
364.922	213.75
365.363	165.2
365.804	167.63
366.245	97.24
366.686	143.36
367.126	172.48
367.567	233.17
368.008	114.23
368.448	150.64
368.889	136.08
369.33	167.63
369.77	102.1
370.21	133.65
370.651	68.11
371.091	133.65
371.531	157.92
371.972	199.18
372.412	145.79
372.852	143.36
373.292	165.2
373.732	160.35
374.172	172.48
374.612	75.4
375.052	182.19
375.492	179.77
375.932	131.22
376.372	191.9
376.811	153.07
377.251	131.22
377.691	167.63
378.13	172.48
378.57	191.9
379.009	208.89
379.449	182.19
379.888	208.89
380.328	196.76
380.767	218.6
381.206	116.66
381.645	160.35
382.085	191.9
382.524	157.92
382.963	187.05
383.402	157.92
383.841	162.78
384.28	136.08
384.719	157.92
385.158	136.08
385.596	182.19
386.035	94.81
386.474	116.66
386.913	172.48
387.351	177.34
387.79	99.67
388.228	196.76
388.667	116.66
389.105	85.1
389.544	211.32
389.982	150.64
390.42	179.77
390.859	174.91
391.297	242.87
391.735	191.9
392.173	179.77
392.611	167.63
393.049	162.78
393.487	128.79
393.925	123.94
394.363	155.49
394.801	170.06
395.239	145.79
395.676	123.94
396.114	174.91
396.552	177.34
396.989	194.33
397.427	160.35
397.864	245.3
398.302	123.94
398.739	201.61
399.177	119.09
399.614	182.19
400.051	138.5
400.488	187.05
400.926	191.9
401.363	167.63
401.8	170.06
402.237	221.03
402.674	235.59
403.111	138.5
403.548	174.91
403.985	160.35
404.421	170.06
404.858	199.18
405.295	179.77
405.732	172.48
406.168	128.79
406.605	194.33
407.041	238.02
407.478	184.62
407.914	133.65
408.351	145.79
408.787	177.34
409.223	116.66
409.66	150.64
410.096	150.64
410.532	189.48
410.968	170.06
411.404	238.02
411.84	145.79
412.276	206.47
412.712	157.92
413.148	162.78
413.584	162.78
414.02	206.47
414.455	145.79
414.891	58.41
415.327	179.77
415.762	150.64
416.198	162.78
416.633	121.51
417.069	177.34
417.504	189.48
417.94	126.37
418.375	148.21
418.81	143.36
419.245	75.4
419.681	128.79
420.116	157.92
420.551	133.65
420.986	114.23
421.421	177.34
421.856	150.64
422.291	157.92
422.726	221.03
423.16	206.47
423.595	242.87
424.03	189.48
424.464	133.65
424.899	111.8
425.334	252.58
425.768	136.08
426.203	116.66
426.637	165.2
427.071	199.18
427.506	160.35
427.94	225.88
428.374	191.9
428.809	111.8
429.243	126.37
429.677	160.35
430.111	109.38
430.545	133.65
430.979	136.08
431.413	148.21
431.847	170.06
432.28	184.62
432.714	221.03
433.148	116.66
433.582	221.03
434.015	167.63
434.449	92.39
434.882	121.51
435.316	245.3
435.749	182.19
436.183	160.35
436.616	136.08
437.049	211.32
437.483	257.44
437.916	140.93
438.349	199.18
438.782	191.9
439.215	131.22
439.648	189.48
440.081	170.06
440.514	172.48
440.947	138.5
441.38	221.03
441.813	165.2
442.245	240.45
442.678	204.04
443.111	225.88
443.543	218.6
443.976	182.19
444.408	194.33
444.841	196.76
445.273	160.35
445.705	204.04
446.138	228.31
446.57	194.33
447.002	204.04
447.434	208.89
447.867	179.77
448.299	233.17
448.731	233.17
449.163	211.32
449.595	143.36
450.026	233.17
450.458	204.04
450.89	155.49
451.322	162.78
451.754	221.03
452.185	153.07
452.617	208.89
453.048	284.14
453.48	250.16
453.911	216.17
454.343	179.77
454.774	221.03
455.205	238.02
455.637	238.02
456.068	204.04
456.499	157.92
456.93	230.74
457.361	259.86
457.792	196.76
458.223	284.14
458.654	196.76
459.085	242.87
459.516	233.17
459.947	272
460.378	250.16
460.808	252.58
461.239	221.03
461.669	264.72
462.1	184.62
462.531	194.33
462.961	184.62
463.391	216.17
463.822	240.45
464.252	216.17
464.682	213.75
465.113	211.32
465.543	255.01
465.973	213.75
466.403	230.74
466.833	228.31
467.263	230.74
467.693	228.31
468.123	218.6
468.553	182.19
468.983	204.04
469.412	179.77
469.842	199.18
470.272	216.17
470.701	187.05
471.131	179.77
471.56	225.88
471.99	187.05
472.419	264.72
472.849	177.34
473.278	165.2
473.707	247.73
474.136	233.17
474.566	225.88
474.995	218.6
475.424	247.73
475.853	286.56
476.282	252.58
476.711	196.76
477.14	216.17
477.569	191.9
477.997	272
478.426	184.62
478.855	211.32
479.283	259.86
479.712	191.9
480.141	187.05
480.569	211.32
480.998	286.56
481.426	177.34
481.854	218.6
482.283	218.6
482.711	143.36
483.139	213.75
483.567	85.1
483.995	179.77
484.424	167.63
484.852	216.17
485.28	230.74
485.708	191.9
486.135	322.97
486.563	233.17
486.991	153.07
487.419	191.9
487.847	191.9
488.274	279.28
488.702	133.65
489.129	172.48
489.557	189.48
489.984	240.45
490.412	228.31
490.839	191.9
491.266	179.77
491.694	245.3
492.121	184.62
492.548	184.62
492.975	208.89
493.402	191.9
493.829	196.76
494.256	213.75
494.683	228.31
495.11	182.19
495.537	286.56
495.964	218.6
496.39	213.75
496.817	174.91
497.244	223.46
497.67	157.92
498.097	150.64
498.523	133.65
498.95	179.77
499.376	109.38
499.803	160.35
500.229	153.07
500.655	223.46
501.081	165.2
501.508	162.78
501.934	208.89
502.36	191.9
502.786	155.49
503.212	208.89
503.638	160.35
504.064	233.17
504.489	172.48
504.915	167.63
505.341	228.31
505.767	114.23
506.192	174.91
506.618	213.75
507.043	174.91
507.469	136.08
507.894	182.19
508.32	191.9
508.745	150.64
509.17	216.17
509.596	143.36
510.021	204.04
510.446	104.52
510.871	150.64
511.296	155.49
511.721	196.76
512.146	216.17
512.571	150.64
512.996	225.88
513.421	179.77
513.845	221.03
514.27	140.93
514.695	187.05
515.119	184.62
515.544	172.48
515.969	157.92
516.393	133.65
516.817	187.05
517.242	155.49
517.666	170.06
518.09	218.6
518.515	179.77
518.939	165.2
519.363	386.08
519.787	153.07
520.211	267.15
520.635	252.58
521.059	179.77
521.483	242.87
521.907	157.92
522.331	170.06
522.754	204.04
523.178	143.36
523.602	191.9
524.025	216.17
524.449	240.45
524.872	160.35
525.296	116.66
525.719	128.79
526.143	204.04
526.566	189.48
526.989	194.33
527.412	167.63
527.836	170.06
528.259	143.36
528.682	167.63
529.105	250.16
529.528	172.48
529.951	213.75
530.374	133.65
530.796	165.2
531.219	213.75
531.642	119.09
532.065	138.5
532.487	172.48
532.91	167.63
533.332	213.75
533.755	179.77
534.177	131.22
534.6	187.05
535.022	145.79
535.444	208.89
535.867	133.65
536.289	182.19
536.711	136.08
537.133	216.17
537.555	218.6
537.977	170.06
538.399	240.45
538.821	167.63
539.243	160.35
539.665	230.74
540.086	259.86
540.508	228.31
540.93	269.57
541.351	281.71
541.773	177.34
542.195	279.28
542.616	286.56
543.037	213.75
543.459	245.3
543.88	201.61
544.301	233.17
544.723	274.43
545.144	245.3
545.565	272
545.986	279.28
546.407	230.74
546.828	157.92
547.249	238.02
547.67	216.17
548.091	230.74
548.512	250.16
548.932	245.3
549.353	272
549.774	160.35
550.194	252.58
550.615	218.6
551.035	240.45
551.456	284.14
551.876	218.6
552.296	272
552.717	250.16
553.137	211.32
553.557	201.61
553.977	225.88
554.397	194.33
554.817	211.32
555.237	119.09
555.657	274.43
556.077	174.91
556.497	170.06
556.917	208.89
557.337	140.93
557.756	213.75
558.176	199.18
558.596	160.35
559.015	167.63
559.435	228.31
559.854	216.17
560.274	162.78
560.693	177.34
561.112	123.94
561.532	136.08
561.951	208.89
562.37	208.89
562.789	223.46
563.208	177.34
563.627	145.79
564.046	167.63
564.465	155.49
564.884	128.79
565.303	182.19
565.722	218.6
566.14	133.65
566.559	174.91
566.978	174.91
567.396	223.46
567.815	150.64
568.233	199.18
568.652	138.5
569.07	194.33
569.489	162.78
569.907	172.48
570.325	155.49
570.743	170.06
571.161	187.05
571.58	199.18
571.998	252.58
572.416	225.88
572.833	201.61
573.251	145.79
573.669	194.33
574.087	131.22
574.505	162.78
574.922	218.6
575.34	126.37
575.758	223.46
576.175	119.09
576.593	170.06
577.01	153.07
577.428	179.77
577.845	1580.27
578.262	298.7
578.68	136.08
579.097	230.74
579.514	240.45
579.931	238.02
580.348	206.47
580.765	155.49
581.182	206.47
581.599	216.17
582.016	157.92
582.433	255.01
582.849	170.06
583.266	182.19
583.683	238.02
584.099	179.77
584.516	131.22
584.933	208.89
585.349	250.16
585.765	230.74
586.182	162.78
586.598	230.74
587.014	172.48
587.431	165.2
587.847	148.21
588.263	162.78
588.679	223.46
589.095	194.33
589.511	174.91
589.927	184.62
590.343	201.61
590.759	167.63
591.174	187.05
591.59	196.76
592.006	174.91
592.421	170.06
592.837	208.89
593.252	218.6
593.668	172.48
594.083	201.61
594.499	204.04
594.914	208.89
595.329	116.66
595.745	187.05
596.16	238.02
596.575	128.79
596.99	177.34
597.405	194.33
597.82	213.75
598.235	199.18
598.65	172.48
599.065	206.47
599.479	174.91
599.894	80.25
600.309	162.78
600.724	182.19
601.138	242.87
601.553	174.91
601.967	223.46
602.382	191.9
602.796	184.62
603.21	201.61
603.625	126.37
604.039	150.64
604.453	162.78
604.867	165.2
605.281	238.02
605.695	172.48
606.109	228.31
606.523	165.2
606.937	245.3
607.351	332.68
607.765	102.1
608.178	167.63
608.592	174.91
609.006	206.47
609.419	223.46
609.833	189.48
610.246	250.16
610.66	238.02
611.073	247.73
611.487	218.6
611.9	264.72
612.313	165.2
612.726	228.31
613.139	174.91
613.553	213.75
613.966	262.29
614.379	145.79
614.792	106.95
615.204	233.17
615.617	235.59
616.03	201.61
616.443	165.2
616.856	150.64
617.268	216.17
617.681	133.65
618.093	85.1
618.506	167.63
618.918	240.45
619.331	208.89
619.743	172.48
620.155	235.59
620.568	191.9
620.98	216.17
621.392	150.64
621.804	179.77
622.216	174.91
622.628	128.79
623.04	179.77
623.452	225.88
623.864	140.93
624.276	233.17
624.687	213.75
625.099	157.92
625.511	148.21
625.922	262.29
626.334	106.95
626.745	153.07
627.157	218.6
627.568	167.63
627.979	136.08
628.391	150.64
628.802	184.62
629.213	182.19
629.624	206.47
630.035	194.33
630.446	160.35
630.857	157.92
631.268	143.36
631.679	223.46
632.09	182.19
632.501	121.51
632.912	174.91
633.322	252.58
633.733	128.79
634.144	99.67
634.554	148.21
634.965	189.48
635.375	240.45
635.785	157.92
636.196	196.76
636.606	170.06
637.016	138.5
637.427	182.19
637.837	160.35
638.247	182.19
638.657	208.89
639.067	157.92
639.477	150.64
639.887	187.05
640.297	201.61
640.706	196.76
641.116	187.05
641.526	216.17
641.935	140.93
642.345	199.18
642.755	230.74
643.164	187.05
643.573	111.8
643.983	208.89
644.392	177.34
644.801	143.36
645.211	206.47
645.62	165.2
646.029	128.79
646.438	194.33
646.847	170.06
647.256	191.9
647.665	179.77
648.074	92.39
648.483	145.79
648.892	128.79
649.3	233.17
649.709	148.21
650.118	194.33
650.526	177.34
650.935	145.79
651.343	177.34
651.752	218.6
652.16	133.65
652.568	138.5
652.977	143.36
653.385	194.33
653.793	153.07
654.201	102.1
654.609	133.65
655.017	208.89
655.425	201.61
655.833	194.33
656.241	170.06
656.649	208.89
657.057	97.24
657.464	160.35
657.872	177.34
658.28	133.65
658.687	160.35
659.095	182.19
659.502	136.08
659.91	187.05
660.317	184.62
660.724	187.05
661.132	182.19
661.539	143.36
661.946	211.32
662.353	167.63
662.76	140.93
663.167	165.2
663.574	223.46
663.981	157.92
664.388	179.77
664.795	216.17
665.202	187.05
665.608	235.59
666.015	148.21
666.422	213.75
666.828	126.37
667.235	155.49
667.641	228.31
668.047	191.9
668.454	160.35
668.86	89.96
669.266	177.34
669.673	240.45
670.079	216.17
670.485	145.79
670.891	182.19
671.297	238.02
671.703	182.19
672.109	153.07
672.515	165.2
672.92	157.92
673.326	162.78
673.732	121.51
674.138	172.48
674.543	123.94
674.949	191.9
675.354	257.44
675.76	213.75
676.165	184.62
676.57	204.04
676.976	208.89
677.381	148.21
677.786	194.33
678.191	247.73
678.596	216.17
679.001	179.77
679.406	196.76
679.811	172.48
680.216	126.37
680.621	199.18
681.026	123.94
681.43	143.36
681.835	247.73
682.24	208.89
682.644	126.37
683.049	179.77
683.453	179.77
683.858	145.79
684.262	191.9
684.667	177.34
685.071	143.36
685.475	104.52
685.879	228.31
686.283	191.9
686.687	208.89
687.091	145.79
687.495	189.48
687.899	153.07
688.303	116.66
688.707	172.48
689.111	172.48
689.514	191.9
689.918	145.79
690.322	121.51
690.725	216.17
691.129	196.76
691.532	182.19
691.936	116.66
692.339	170.06
692.742	157.92
693.146	196.76
693.549	174.91
693.952	179.77
694.355	138.5
694.758	155.49
695.161	218.6
695.564	153.07
695.967	136.08
696.37	257.44
696.773	167.63
697.175	167.63
697.578	138.5
697.981	191.9
698.383	174.91
698.786	269.57
699.188	174.91
699.591	206.47
699.993	138.5
700.395	138.5
700.798	218.6
701.2	150.64
701.602	199.18
702.004	194.33
702.406	189.48
702.808	201.61
703.21	252.58
703.612	191.9
704.014	174.91
704.416	170.06
704.818	242.87
705.219	162.78
705.621	172.48
706.023	213.75
706.424	213.75
706.826	153.07
707.227	199.18
707.629	257.44
708.03	228.31
708.431	204.04
708.832	140.93
709.234	170.06
709.635	230.74
710.036	276.86
710.437	235.59
710.838	230.74
711.239	160.35
711.64	221.03
712.041	252.58
712.441	182.19
712.842	238.02
713.243	160.35
713.643	201.61
714.044	206.47
714.445	235.59
714.845	213.75
715.246	182.19
715.646	216.17
716.046	140.93
716.447	223.46
716.847	235.59
717.247	182.19
717.647	223.46
718.047	206.47
718.447	274.43
718.847	247.73
719.247	274.43
719.647	279.28
720.047	313.26
720.446	242.87
720.846	184.62
721.246	247.73
721.645	208.89
722.045	257.44
722.444	262.29
722.844	322.97
723.243	313.26
723.643	354.53
724.042	337.54
724.441	281.71
724.84	264.72
725.24	288.99
725.639	286.56
726.038	354.53
726.437	327.83
726.836	301.13
727.234	298.7
727.633	335.11
728.032	383.65
728.431	417.63
728.83	407.93
729.228	347.24
729.627	422.49
730.025	478.31
730.424	480.74
730.822	480.74
731.22	488.02
731.619	568.12
732.017	650.65
732.415	645.79
732.813	745.31
733.212	813.27
733.61	718.61
734.008	835.12
734.406	975.9
734.803	1136.09
735.201	1136.09
735.599	1187.06
735.997	1133.66
736.395	1174.93
736.792	1475.9
737.19	1672.51
737.587	1560.86
737.985	1560.86
738.382	1405.51
738.78	1648.24
739.177	2026.88
739.574	2235.62
739.971	2194.36
740.369	1915.23
740.766	1852.12
741.163	1975.91
741.56	2347.28
741.957	2631.26
742.354	2701.65
742.751	2281.74
743.147	2417.67
743.544	2568.15
743.941	3000.2
744.338	3679.82
744.734	3609.43
745.131	3306.03
745.527	3111.85
745.924	3378.85
746.32	4138.57
746.716	5073.05
747.113	5124.02
747.509	4708.96
747.905	4289.05
748.301	4483.23
748.697	5524.51
749.093	6490.54
749.489	6648.31
749.885	6199.28
750.281	5740.53
750.677	5577.91
751.073	6781.81
751.468	8335.23
751.864	9082.82
752.26	8313.39
752.655	7228.42
753.051	6937.15
753.446	8141.06
753.842	9721.18
754.237	10609.54
754.632	10230.89
755.028	8696.89
755.423	7886.2
755.818	8410.48
756.213	9835.26
756.608	10910.52
757.003	10764.88
757.398	9527
757.793	8160.47
758.188	8204.16
758.583	10255.17
758.977	11289.16
759.372	12245.49
759.767	11150.81
760.161	10267.3
760.556	10252.74
760.95	12354.71
761.345	15650.88
761.739	17762.56
762.133	16631.48
762.527	15204.27
762.922	13951.83
763.316	15391.17
763.71	18697.04
764.104	21410.68
764.498	21900.98
764.892	19488.32
765.286	17163.04
765.68	17595.09
766.073	21201.94
766.467	25563.66
766.861	26922.9
767.255	26325.8
767.648	22990.8
768.042	21141.26
768.435	22709.24
768.829	27512.72
769.222	32561.34
769.615	31600.16
770.008	27272.42
770.402	23454.4
770.795	23976.25
771.188	27253
771.581	30949.66
771.974	32175.41
772.367	29774.89
772.76	25114.62
773.153	22352.44
773.545	23061.19
773.938	27199.6
774.331	31024.91
774.724	31233.65
775.116	27901.07
775.509	24223.83
775.901	24575.78
776.294	29498.18
776.686	35287.11
777.078	37328.4
777.471	37423.06
777.863	33202.12
778.255	30000.62
778.647	31107.43
779.039	37983.75
779.431	42792.08
779.823	43241.12
780.215	39241.05
780.607	33197.27
780.999	31682.68
781.39	34558.94
781.782	41340.6
782.174	46746.02
782.565	45357.65
782.957	40143.98
783.348	34988.56
783.74	33430.28
784.131	37369.67
784.522	44275.11
784.914	45680.47
785.305	43360.05
785.696	36731.31
786.087	32325.9
786.478	32153.56
786.869	35595.37
787.26	39425.52
787.651	39190.08
788.042	34578.36
788.433	29066.14
788.823	25425.3
789.214	25638.9
789.605	27944.76
789.995	30464.22
790.386	29236.04
790.776	25456.86
791.167	22136.42
791.557	20981.06
791.948	23682.56
792.338	28777.3
792.728	33316.2
793.118	33253.1
793.508	30228.78
793.898	26114.64
794.288	23893.73
794.678	26250.56
795.068	30850.15
795.458	33003.09
795.848	32636.58
796.238	29010.31
796.627	25143.75
797.017	24097.61
797.406	26311.24
797.796	30461.79
798.185	34221.56
798.575	34636.61
798.964	28862.25
799.354	25311.23
799.743	25408.31
800.132	29020.02
800.521	34223.99
800.91	37037.14
801.299	36078.38
801.688	31862.3
802.077	26745.71
802.466	25073.36
802.855	27602.52
803.244	30219.07
803.633	33109.89
804.021	31862.3
804.41	28277.29
804.799	23791.78
805.187	21563.59
805.576	22434.97
805.964	25782.11
806.352	27609.8
806.741	26966.59
807.129	23833.05
807.517	20189.79
807.905	18582.97
808.293	20019.88
808.681	24007.81
809.069	27206.89
809.457	28646.23
809.845	25913.18
810.233	21755.34
810.621	20049.01
811.009	21221.36
811.396	24867.04
811.784	29350.12
812.171	30051.59
812.559	27500.58
812.946	22871.87
813.334	19832.98
813.721	20170.37
814.108	23080.61
814.496	26629.21
814.883	27672.91
815.27	26665.62
815.657	23134.01
816.044	20131.53
816.431	19609.68
816.818	21837.87
817.205	26058.81
817.592	28520.01
817.979	27306.4
818.365	23471.39
818.752	19199.48
819.139	17575.67
819.525	18706.75
819.912	20777.17
820.298	22927.69
820.685	22587.88
821.071	20507.75
821.457	16738.28
821.843	13939.69
822.23	14080.47
822.616	14832.91
823.002	16211.57
823.388	16735.85
823.774	14762.52
824.16	12347.43
824.546	10692.07
824.931	9942.05
825.317	10815.85
825.703	12696.95
826.089	13879.01
826.474	13665.41
826.86	11920.24
827.245	9633.8
827.631	8961.46
828.016	9391.07
828.401	10672.65
828.787	12172.67
829.172	12199.37
829.557	11061
829.942	9437.19
830.327	7937.17
830.712	7597.36
831.097	8226.01
831.482	9553.7
831.867	10400.8
832.252	9925.06
832.636	8485.72
833.021	7121.62
833.406	6592.49
833.79	6713.85
834.175	7881.34
834.559	8973.59
834.944	9228.45
835.328	8471.16
835.713	7131.33
836.097	5883.74
836.481	5170.14
836.865	5543.93
837.249	6509.96
837.633	6954.14
838.017	6854.63
838.401	6041.51
838.785	4883.72
839.169	4053.61
839.553	4063.32
839.937	4274.49
840.32	4667.7
840.704	4779.35
841.087	4437.11
841.471	3791.47
841.854	3034.18
842.238	2694.37
842.621	2667.67
843.004	3179.81
843.388	3616.71
843.771	3859.44
844.154	3638.56
844.537	3022.04
844.92	2468.64
845.303	2371.55
845.686	2488.05
846.069	3111.85
846.452	3509.92
846.834	3514.77
847.217	3094.86
847.6	2609.42
847.982	2143.39
848.365	1997.76
848.748	2378.83
849.13	2735.63
849.512	3075.44
849.895	3102.14
850.277	2682.23
850.659	2087.56
851.041	1801.15
851.423	1791.44
851.806	2111.84
852.188	2565.73
852.57	2708.93
852.951	2835.15
853.333	2488.05
853.715	1922.51
854.097	1580.27
854.479	1531.73
854.86	1769.6
855.242	2009.89
855.623	2191.93
856.005	2179.8
856.386	1859.4
856.768	1604.55
857.149	1182.21
857.53	1196.77
857.911	1337.55
858.292	1361.82
858.674	1500.18
859.055	1446.78
859.436	1274.44
859.817	1022.01
860.197	839.97
860.578	793.85
860.959	922.5
861.34	1034.15
861.72	1145.8
862.101	1116.67
862.482	893.37
862.862	854.53
863.243	648.22
863.623	594.82
864.003	757.45
864.384	844.83
864.764	963.76
865.144	898.22
865.524	847.25
865.904	687.06
866.284	592.39
866.664	628.8
867.044	628.8
867.424	742.88
867.804	718.61
868.183	793.85
868.563	650.65
868.943	594.82
869.322	434.62
869.702	478.31
870.081	429.77
870.461	483.17
870.84	597.25
871.22	650.65
871.599	505.01
871.978	558.41
872.357	415.21
872.736	400.64
873.115	417.63
873.494	378.8
873.873	386.08
874.252	444.33
874.631	373.94
875.01	381.23
875.388	381.23
875.767	298.7
876.146	296.27
876.524	313.26
876.903	269.57
877.281	320.55
877.66	303.55
878.038	267.15
878.416	221.03
878.794	252.58
879.173	264.72
879.551	208.89
879.929	288.99
880.307	259.86
880.685	255.01
881.063	238.02
881.441	293.85
881.818	228.31
882.196	204.04
882.574	242.87
882.951	223.46
883.329	165.2
883.707	262.29
884.084	172.48
884.461	206.47
884.839	191.9
885.216	179.77
885.593	228.31
885.971	182.19
886.348	206.47
886.725	206.47
887.102	177.34
887.479	247.73
887.856	179.77
888.233	187.05
888.609	204.04
888.986	114.23
889.363	160.35
889.74	204.04
890.116	172.48
890.493	155.49
890.869	177.34
891.246	172.48
891.622	167.63
891.998	187.05
892.375	145.79
892.751	167.63
893.127	172.48
893.503	140.93
893.879	167.63
894.255	140.93
894.631	184.62
895.007	172.48
895.383	133.65
895.759	174.91
896.134	187.05
896.51	305.98
896.886	162.78
897.261	119.09
897.637	208.89
898.012	138.5
898.388	136.08
898.763	148.21
899.138	165.2
899.514	187.05
899.889	123.94
900.264	189.48
900.639	204.04
901.014	252.58
901.389	114.23
901.764	155.49
902.139	213.75
902.513	179.77
902.888	162.78
903.263	114.23
903.638	165.2
904.012	179.77
904.387	145.79
904.761	199.18
905.136	194.33
905.51	160.35
905.884	97.24
906.259	92.39
906.633	77.82
907.007	165.2
907.381	170.06
907.755	221.03
908.129	157.92
908.503	121.51
908.877	206.47
909.251	140.93
909.624	106.95
909.998	114.23
910.372	121.51
910.745	131.22
911.119	133.65
911.492	170.06
911.866	77.82
912.239	138.5
912.612	221.03
912.986	177.34
913.359	170.06
913.732	184.62
914.105	160.35
914.478	133.65
914.851	170.06
915.224	143.36
915.597	126.37
915.97	179.77
916.343	172.48
916.715	179.77
917.088	138.5
917.461	97.24
917.833	172.48
918.206	223.46
918.578	99.67
918.951	167.63
919.323	128.79
919.695	148.21
920.067	199.18
920.44	99.67
920.812	179.77
921.184	155.49
921.556	148.21
921.928	131.22
922.3	128.79
922.672	145.79
923.043	206.47
923.415	136.08
923.787	153.07
924.158	136.08
924.53	94.81
924.901	162.78
925.273	131.22
925.644	136.08
926.016	82.68
926.387	92.39
926.758	160.35
927.129	116.66
927.5	82.68
927.872	184.62
928.243	116.66
928.613	172.48
928.984	53.55
929.355	247.73
929.726	133.65
930.097	140.93
930.467	116.66
930.838	60.83
931.209	102.1
931.579	148.21
931.95	114.23
932.32	102.1
932.69	196.76
933.061	208.89
933.431	119.09
933.801	92.39
934.171	128.79
934.541	123.94
934.911	85.1
935.281	204.04
935.651	138.5
936.021	128.79
936.391	155.49
936.761	136.08
937.13	114.23
937.5	143.36
937.87	148.21
938.239	177.34
938.609	138.5
938.978	99.67
939.347	153.07
939.717	174.91
940.086	182.19
940.455	167.63
940.824	143.36
941.193	238.02
941.562	191.9
941.931	150.64
942.3	153.07
942.669	148.21
943.038	157.92
943.407	162.78
943.775	228.31
944.144	77.82
944.513	179.77
944.881	140.93
945.25	145.79
945.618	111.8
945.986	136.08
946.355	182.19
946.723	162.78
947.091	143.36
947.459	162.78
947.827	148.21
948.195	160.35
948.563	97.24
948.931	184.62
949.299	174.91
949.667	155.49
950.035	179.77
950.402	97.24
950.77	177.34
951.138	170.06
951.505	145.79
951.873	126.37
952.24	116.66
952.607	133.65
952.975	194.33
953.342	140.93
953.709	143.36
954.076	111.8
954.443	82.68
954.81	162.78
955.177	184.62
955.544	165.2
955.911	204.04
956.278	131.22
956.645	160.35
957.012	119.09
957.378	145.79
957.745	160.35
958.111	136.08
958.478	157.92
958.844	157.92
959.211	140.93
959.577	247.73
959.943	179.77
960.309	189.48
960.675	157.92
961.042	106.95
961.408	119.09
961.774	119.09
962.139	150.64
962.505	133.65
962.871	136.08
963.237	225.88
963.603	172.48
963.968	143.36
964.334	201.61
964.699	150.64
965.065	199.18
965.43	99.67
965.796	150.64
966.161	121.51
966.526	109.38
966.891	179.77
967.256	82.68
967.622	121.51
967.987	131.22
968.352	177.34
968.716	172.48
969.081	126.37
969.446	97.24
969.811	179.77
970.176	165.2
970.54	206.47
970.905	177.34
971.269	172.48
971.634	206.47
971.998	109.38
972.363	162.78
972.727	148.21
973.091	119.09
973.455	194.33
973.819	148.21
974.183	211.32
974.547	172.48
974.911	92.39
975.275	145.79
975.639	111.8
976.003	170.06
976.367	170.06
976.73	155.49
977.094	109.38
977.458	75.4
977.821	109.38
978.185	77.82
978.548	145.79
978.911	138.5
979.275	140.93
979.638	160.35
980.001	179.77
980.364	187.05
980.727	150.64
981.09	187.05
981.453	133.65
981.816	136.08
982.179	240.45
982.542	43.84
982.905	148.21
983.267	145.79
983.63	160.35
983.992	148.21
984.355	116.66
984.717	97.24
985.08	170.06
985.442	184.62
985.804	170.06
986.167	148.21
986.529	167.63
986.891	162.78
987.253	177.34
987.615	172.48
987.977	136.08
988.339	138.5
988.701	184.62
989.062	177.34
989.424	121.51
989.786	143.36
990.147	123.94
990.509	177.34
990.87	128.79
991.232	167.63
991.593	143.36
991.955	172.48
992.316	121.51
992.677	155.49
993.038	172.48
993.399	182.19
993.76	97.24
994.121	179.77
994.482	116.66
994.843	119.09
995.204	162.78
995.565	128.79
995.926	131.22
996.286	184.62
996.647	123.94
997.007	191.9
997.368	165.2
997.728	157.92
998.089	170.06
998.449	133.65
998.809	106.95
999.169	121.51
999.53	150.64
999.89	148.21
1000.25	136.08
1000.61	177.34
1000.97	123.94
1001.329	102.1
1001.689	182.19
1002.049	126.37
1002.409	201.61
1002.768	165.2
1003.128	162.78
1003.487	92.39
1003.847	92.39
1004.206	109.38
1004.566	123.94
1004.925	114.23
1005.284	85.1
1005.643	138.5
1006.003	121.51
1006.362	114.23
1006.721	109.38
1007.08	182.19
1007.438	167.63
1007.797	150.64
1008.156	162.78
1008.515	133.65
1008.874	143.36
1009.232	128.79
1009.591	160.35
1009.949	155.49
1010.308	184.62
1010.666	143.36
1011.024	145.79
1011.383	102.1
1011.741	136.08
1012.099	109.38
1012.457	133.65
1012.815	155.49
1013.173	140.93
1013.531	140.93
1013.889	206.47
1014.247	109.38
1014.605	174.91
1014.962	143.36
1015.32	179.77
1015.678	179.77
1016.035	136.08
1016.393	92.39
1016.75	206.47
1017.107	109.38
1017.465	145.79
1017.822	157.92
1018.179	201.61
1018.536	114.23
1018.894	145.79
1019.251	116.66
1019.608	174.91
1019.964	153.07
1020.321	116.66
1020.678	143.36
1021.035	162.78
1021.392	162.78
1021.748	182.19
1022.105	106.95
1022.461	133.65
1022.818	155.49
1023.174	211.32
1023.531	196.76
1023.887	111.8
1024.243	162.78
1024.599	145.79
1024.955	165.2
1025.311	138.5
1025.667	221.03
1026.023	196.76
1026.379	157.92
1026.735	184.62
1027.091	97.24
1027.447	109.38
