189.514	24.58
189.973	24.58
190.431	24.58
190.889	-11.83
191.348	-28.82
191.806	-23.97
192.264	48.85
192.722	-21.54
193.18	-104.07
193.638	-87.08
194.096	31.86
194.554	-4.55
195.012	36.71
195.47	-38.53
195.928	-26.4
196.385	17.29
196.843	29.43
197.301	-23.97
197.758	36.71
198.216	12.44
198.674	39.14
199.131	53.7
199.589	85.26
200.046	51.28
200.503	63.41
200.961	109.53
201.418	97.39
201.875	77.97
202.332	167.78
202.79	126.52
203.247	121.66
203.704	150.79
204.161	80.4
204.618	179.92
205.075	177.49
205.532	160.5
205.989	77.97
206.445	184.77
206.902	189.63
207.359	90.11
207.816	199.34
208.272	223.61
208.729	99.82
209.185	153.22
209.642	97.39
210.098	145.94
210.555	199.34
211.011	155.65
211.467	111.96
211.924	60.98
212.38	53.7
212.836	204.19
213.292	94.97
213.748	170.21
214.204	141.08
214.66	136.23
215.116	148.36
215.572	94.97
216.028	131.37
216.484	131.37
216.94	126.52
217.396	148.36
217.851	53.7
218.307	99.82
218.763	162.93
219.218	138.66
219.674	99.82
220.129	77.97
220.585	102.25
221.04	119.24
221.496	133.8
221.951	138.66
222.406	109.53
222.861	194.48
223.317	141.08
223.772	136.23
224.227	114.38
224.682	141.08
225.137	82.83
225.592	102.25
226.047	141.08
226.502	136.23
226.957	162.93
227.411	119.24
227.866	160.5
228.321	155.65
228.776	102.25
229.23	94.97
229.685	82.83
230.139	162.93
230.594	170.21
231.048	82.83
231.503	160.5
231.957	187.2
232.411	119.24
232.865	228.46
233.32	187.2
233.774	90.11
234.228	167.78
234.682	126.52
235.136	136.23
235.59	213.9
236.044	167.78
236.498	119.24
236.952	111.96
237.406	99.82
237.86	150.79
238.313	119.24
238.767	92.54
239.221	136.23
239.674	182.35
240.128	87.68
240.581	104.67
241.035	136.23
241.488	141.08
241.942	155.65
242.395	145.94
242.848	102.25
243.301	107.1
243.755	179.92
244.208	97.39
244.661	119.24
245.114	162.93
245.567	136.23
246.02	165.35
246.473	155.65
246.926	104.67
247.379	104.67
247.832	158.07
248.284	138.66
248.737	158.07
249.19	138.66
249.642	128.95
250.095	138.66
250.547	172.64
251	131.37
251.452	82.83
251.905	165.35
252.357	126.52
252.81	133.8
253.262	80.4
253.714	155.65
254.166	119.24
254.618	179.92
255.07	131.37
255.523	114.38
255.975	53.7
256.427	133.8
256.878	213.9
257.33	221.18
257.782	124.09
258.234	153.22
258.686	238.17
259.137	131.37
259.589	131.37
260.041	126.52
260.492	136.23
260.944	133.8
261.395	82.83
261.847	165.35
262.298	131.37
262.749	119.24
263.201	158.07
263.652	150.79
264.103	107.1
264.554	141.08
265.005	70.69
265.457	162.93
265.908	82.83
266.359	182.35
266.809	92.54
267.26	145.94
267.711	160.5
268.162	126.52
268.613	172.64
269.064	80.4
269.514	90.11
269.965	160.5
270.415	128.95
270.866	153.22
271.316	82.83
271.767	116.81
272.217	160.5
272.668	141.08
273.118	107.1
273.568	175.06
274.019	119.24
274.469	70.69
274.919	172.64
275.369	119.24
275.819	124.09
276.269	192.05
276.719	116.81
277.169	121.66
277.619	121.66
278.069	109.53
278.518	138.66
278.968	145.94
279.418	170.21
279.867	138.66
280.317	102.25
280.767	94.97
281.216	182.35
281.666	97.39
282.115	155.65
282.564	133.8
283.014	73.12
283.463	104.67
283.912	109.53
284.361	133.8
284.811	121.66
285.26	119.24
285.709	148.36
286.158	131.37
286.607	136.23
287.056	116.81
287.505	182.35
287.953	179.92
288.402	150.79
288.851	201.76
289.3	128.95
289.748	187.2
290.197	90.11
290.646	162.93
291.094	114.38
291.543	126.52
291.991	158.07
292.439	68.27
292.888	133.8
293.336	162.93
293.784	111.96
294.233	85.26
294.681	177.49
295.129	121.66
295.577	138.66
296.025	158.07
296.473	158.07
296.921	192.05
297.369	94.97
297.817	92.54
298.264	119.24
298.712	165.35
299.16	172.64
299.608	155.65
300.055	87.68
300.503	143.51
300.95	160.5
301.398	170.21
301.845	131.37
302.293	99.82
302.74	68.27
303.187	179.92
303.635	80.4
304.082	170.21
304.529	165.35
304.976	114.38
305.423	138.66
305.87	121.66
306.317	116.81
306.764	177.49
307.211	150.79
307.658	133.8
308.105	189.63
308.552	155.65
308.998	167.78
309.445	167.78
309.892	162.93
310.338	51.28
310.785	138.66
311.231	73.12
311.678	131.37
312.124	158.07
312.571	116.81
313.017	133.8
313.463	124.09
313.909	201.76
314.356	133.8
314.802	128.95
315.248	184.77
315.694	196.91
316.14	119.24
316.586	170.21
317.032	182.35
317.478	213.9
317.923	155.65
318.369	128.95
318.815	199.34
319.261	126.52
319.706	65.84
320.152	267.3
320.597	102.25
321.043	104.67
321.488	165.35
321.934	131.37
322.379	85.26
322.824	165.35
323.27	167.78
323.715	148.36
324.16	158.07
324.605	143.51
325.05	158.07
325.495	104.67
325.94	116.81
326.385	145.94
326.83	82.83
327.275	160.5
327.72	158.07
328.165	153.22
328.61	172.64
329.054	153.22
329.499	82.83
329.943	136.23
330.388	99.82
330.832	150.79
331.277	128.95
331.721	145.94
332.166	184.77
332.61	109.53
333.054	143.51
333.499	138.66
333.943	133.8
334.387	184.77
334.831	177.49
335.275	228.46
335.719	126.52
336.163	158.07
336.607	136.23
337.051	97.39
337.495	153.22
337.938	109.53
338.382	128.95
338.826	189.63
339.269	97.39
339.713	143.51
340.157	133.8
340.6	158.07
341.044	160.5
341.487	158.07
341.93	85.26
342.374	121.66
342.817	138.66
343.26	114.38
343.703	170.21
344.146	175.06
344.59	80.4
345.033	107.1
345.476	80.4
345.919	179.92
346.361	90.11
346.804	90.11
347.247	111.96
347.69	90.11
348.133	60.98
348.575	126.52
349.018	170.21
349.461	150.79
349.903	165.35
350.346	136.23
350.788	124.09
351.23	94.97
351.673	153.22
352.115	136.23
352.557	87.68
353	133.8
353.442	126.52
353.884	87.68
354.326	148.36
354.768	150.79
355.21	228.46
355.652	126.52
356.094	170.21
356.536	90.11
356.978	116.81
357.419	107.1
357.861	97.39
358.303	160.5
358.744	145.94
359.186	121.66
359.627	126.52
360.069	150.79
360.51	80.4
360.952	148.36
361.393	85.26
361.834	194.48
362.276	119.24
362.717	177.49
363.158	80.4
363.599	141.08
364.04	121.66
364.481	99.82
364.922	148.36
365.363	141.08
365.804	94.97
366.245	170.21
366.686	143.51
367.126	90.11
367.567	109.53
368.008	175.06
368.448	85.26
368.889	184.77
369.33	99.82
369.77	97.39
370.21	138.66
370.651	128.95
371.091	228.46
371.531	143.51
371.972	150.79
372.412	131.37
372.852	114.38
373.292	128.95
373.732	99.82
374.172	160.5
374.612	97.39
375.052	94.97
375.492	94.97
375.932	107.1
376.372	150.79
376.811	145.94
377.251	111.96
377.691	53.7
378.13	97.39
378.57	99.82
379.009	102.25
379.449	209.04
379.888	107.1
380.328	211.47
380.767	107.1
381.206	121.66
381.645	116.81
382.085	184.77
382.524	99.82
382.963	150.79
383.402	170.21
383.841	150.79
384.28	126.52
384.719	119.24
385.158	150.79
385.596	119.24
386.035	121.66
386.474	116.81
386.913	114.38
387.351	150.79
387.79	121.66
388.228	126.52
388.667	189.63
389.105	145.94
389.544	116.81
389.982	82.83
390.42	240.6
390.859	116.81
391.297	141.08
391.735	111.96
392.173	175.06
392.611	121.66
393.049	148.36
393.487	131.37
393.925	126.52
394.363	141.08
394.801	175.06
395.239	126.52
395.676	141.08
396.114	136.23
396.552	119.24
396.989	201.76
397.427	133.8
397.864	136.23
398.302	104.67
398.739	99.82
399.177	107.1
399.614	170.21
400.051	145.94
400.488	167.78
400.926	133.8
401.363	131.37
401.8	119.24
402.237	155.65
402.674	109.53
403.111	167.78
403.548	63.41
403.985	31.86
404.421	167.78
404.858	160.5
405.295	109.53
405.732	148.36
406.168	138.66
406.605	167.78
407.041	111.96
407.478	128.95
407.914	131.37
408.351	85.26
408.787	102.25
409.223	94.97
409.66	189.63
410.096	138.66
410.532	206.62
410.968	124.09
411.404	68.27
411.84	109.53
412.276	124.09
412.712	138.66
413.148	138.66
413.584	177.49
414.02	90.11
414.455	136.23
414.891	187.2
415.327	167.78
415.762	138.66
416.198	162.93
416.633	155.65
417.069	124.09
417.504	126.52
417.94	116.81
418.375	126.52
418.81	172.64
419.245	184.77
419.681	124.09
420.116	158.07
420.551	177.49
420.986	109.53
421.421	141.08
421.856	133.8
422.291	155.65
422.726	104.67
423.16	143.51
423.595	82.83
424.03	124.09
424.464	114.38
424.899	160.5
425.334	138.66
425.768	136.23
426.203	80.4
426.637	109.53
427.071	99.82
427.506	114.38
427.94	153.22
428.374	133.8
428.809	216.33
429.243	116.81
429.677	165.35
430.111	182.35
430.545	104.67
430.979	153.22
431.413	143.51
431.847	136.23
432.28	102.25
432.714	136.23
433.148	99.82
433.582	99.82
434.015	172.64
434.449	99.82
434.882	102.25
435.316	138.66
435.749	158.07
436.183	136.23
436.616	138.66
437.049	209.04
437.483	128.95
437.916	213.9
438.349	133.8
438.782	162.93
439.215	111.96
439.648	192.05
440.081	165.35
440.514	167.78
440.947	138.66
441.38	177.49
441.813	131.37
442.245	179.92
442.678	196.91
443.111	155.65
443.543	192.05
443.976	201.76
444.408	165.35
444.841	167.78
445.273	211.47
445.705	291.57
446.138	257.59
446.57	189.63
447.002	158.07
447.434	228.46
447.867	175.06
448.299	264.87
448.731	226.04
449.163	199.34
449.595	233.32
450.026	204.19
450.458	245.45
450.89	235.74
451.322	167.78
451.754	221.18
452.185	243.03
452.617	233.32
453.048	233.32
453.48	150.79
453.911	349.82
454.343	284.29
454.774	257.59
455.205	344.97
455.637	281.86
456.068	252.73
456.499	281.86
456.93	286.72
457.361	269.73
457.792	240.6
458.223	218.75
458.654	269.73
459.085	206.62
459.516	313.42
459.947	243.03
460.378	257.59
460.808	315.84
461.239	277.01
461.669	228.46
462.1	255.16
462.531	238.17
462.961	247.88
463.391	267.3
463.822	289.14
464.252	228.46
464.682	267.3
465.113	162.93
465.543	223.61
465.973	289.14
466.403	209.04
466.833	192.05
467.263	223.61
467.693	150.79
468.123	279.43
468.553	153.22
468.983	272.15
469.412	196.91
469.842	192.05
470.272	238.17
470.701	226.04
471.131	201.76
471.56	218.75
471.99	201.76
472.419	250.31
472.849	272.15
473.278	289.14
473.707	206.62
474.136	274.58
474.566	204.19
474.995	192.05
475.424	226.04
475.853	235.74
476.282	245.45
476.711	213.9
477.14	182.35
477.569	194.48
477.997	162.93
478.426	204.19
478.855	179.92
479.283	206.62
479.712	228.46
480.141	201.76
480.569	170.21
480.998	245.45
481.426	172.64
481.854	119.24
482.283	145.94
482.711	136.23
483.139	221.18
483.567	189.63
483.995	133.8
484.424	121.66
484.852	238.17
485.28	177.49
485.708	201.76
486.135	148.36
486.563	218.75
486.991	216.33
487.419	124.09
487.847	172.64
488.274	158.07
488.702	199.34
489.129	175.06
489.557	216.33
489.984	257.59
490.412	206.62
490.839	172.64
491.266	167.78
491.694	153.22
492.121	175.06
492.548	209.04
492.975	136.23
493.402	162.93
493.829	211.47
494.256	211.47
494.683	160.5
495.11	68.27
495.537	145.94
495.964	194.48
496.39	73.12
496.817	158.07
497.244	97.39
497.67	170.21
498.097	167.78
498.523	213.9
498.95	119.24
499.376	148.36
499.803	102.25
500.229	99.82
500.655	184.77
501.081	102.25
501.508	121.66
501.934	221.18
502.36	73.12
502.786	175.06
503.212	121.66
503.638	255.16
504.064	167.78
504.489	143.51
504.915	192.05
505.341	165.35
505.767	109.53
506.192	150.79
506.618	124.09
507.043	90.11
507.469	179.92
507.894	138.66
508.32	148.36
508.745	153.22
509.17	204.19
509.596	204.19
510.021	158.07
510.446	104.67
510.871	189.63
511.296	104.67
511.721	80.4
512.146	204.19
512.571	167.78
512.996	201.76
513.421	126.52
513.845	201.76
514.27	94.97
514.695	177.49
515.119	92.54
515.544	104.67
515.969	150.79
516.393	143.51
516.817	209.04
517.242	226.04
517.666	206.62
518.09	206.62
518.515	196.91
518.939	99.82
519.363	327.98
519.787	175.06
520.211	143.51
520.635	182.35
521.059	158.07
521.483	141.08
521.907	160.5
522.331	233.32
522.754	206.62
523.178	184.77
523.602	97.39
524.025	175.06
524.449	194.48
524.872	119.24
525.296	170.21
525.719	187.2
526.143	109.53
526.566	172.64
526.989	128.95
527.412	153.22
527.836	87.68
528.259	75.55
528.682	107.1
529.105	133.8
529.528	124.09
529.951	218.75
530.374	141.08
530.796	247.88
531.219	136.23
531.642	184.77
532.065	194.48
532.487	92.54
532.91	131.37
533.332	80.4
533.755	158.07
534.177	167.78
534.6	131.37
535.022	153.22
535.444	131.37
535.867	136.23
536.289	63.41
536.711	102.25
537.133	204.19
537.555	206.62
537.977	94.97
538.399	221.18
538.821	131.37
539.243	160.5
539.665	165.35
540.086	218.75
540.508	221.18
540.93	196.91
541.351	162.93
541.773	233.32
542.195	221.18
542.616	153.22
543.037	238.17
543.459	172.64
543.88	172.64
544.301	209.04
544.723	204.19
545.144	226.04
545.565	201.76
545.986	133.8
546.407	116.81
546.828	184.77
547.249	194.48
547.67	177.49
548.091	145.94
548.512	196.91
548.932	116.81
549.353	216.33
549.774	238.17
550.194	296.42
550.615	218.75
551.035	128.95
551.456	136.23
551.876	213.9
552.296	204.19
552.717	182.35
553.137	196.91
553.557	175.06
553.977	206.62
554.397	179.92
554.817	226.04
555.237	201.76
555.657	233.32
556.077	172.64
556.497	155.65
556.917	194.48
557.337	133.8
557.756	226.04
558.176	141.08
558.596	102.25
559.015	196.91
559.435	148.36
559.854	187.2
560.274	199.34
560.693	114.38
561.112	245.45
561.532	128.95
561.951	182.35
562.37	206.62
562.789	240.6
563.208	204.19
563.627	162.93
564.046	148.36
564.465	160.5
564.884	141.08
565.303	160.5
565.722	204.19
566.14	172.64
566.559	211.47
566.978	148.36
567.396	170.21
567.815	133.8
568.233	158.07
568.652	145.94
569.07	153.22
569.489	116.81
569.907	223.61
570.325	177.49
570.743	209.04
571.161	172.64
571.58	121.66
571.998	221.18
572.416	133.8
572.833	102.25
573.251	182.35
573.669	153.22
574.087	179.92
574.505	167.78
574.922	218.75
575.34	109.53
575.758	194.48
576.175	148.36
576.593	179.92
577.01	201.76
577.428	153.22
577.845	1599.84
578.262	264.87
578.68	189.63
579.097	165.35
579.514	141.08
579.931	138.66
580.348	223.61
580.765	165.35
581.182	136.23
581.599	155.65
582.016	162.93
582.433	216.33
582.849	131.37
583.266	230.89
583.683	206.62
584.099	158.07
584.516	136.23
584.933	250.31
585.349	155.65
585.765	192.05
586.182	170.21
586.598	228.46
587.014	167.78
587.431	209.04
587.847	175.06
588.263	109.53
588.679	211.47
589.095	213.9
589.511	189.63
589.927	75.55
590.343	148.36
590.759	150.79
591.174	124.09
591.59	182.35
592.006	131.37
592.421	206.62
592.837	184.77
593.252	143.51
593.668	155.65
594.083	170.21
594.499	121.66
594.914	148.36
595.329	196.91
595.745	179.92
596.16	97.39
596.575	228.46
596.99	131.37
597.405	218.75
597.82	209.04
598.235	133.8
598.65	182.35
599.065	104.67
599.479	145.94
599.894	243.03
600.309	194.48
600.724	150.79
601.138	97.39
601.553	204.19
601.967	233.32
602.382	153.22
602.796	116.81
603.21	121.66
603.625	182.35
604.039	269.73
604.453	194.48
604.867	223.61
605.281	128.95
605.695	107.1
606.109	192.05
606.523	179.92
606.937	192.05
607.351	262.44
607.765	184.77
608.178	138.66
608.592	192.05
609.006	158.07
609.419	165.35
609.833	155.65
610.246	177.49
610.66	148.36
611.073	172.64
611.487	182.35
611.9	218.75
612.313	223.61
612.726	141.08
613.139	126.52
613.553	138.66
613.966	143.51
614.379	126.52
614.792	228.46
615.204	153.22
615.617	199.34
616.03	90.11
616.443	143.51
616.856	160.5
617.268	153.22
617.681	199.34
618.093	141.08
618.506	150.79
618.918	126.52
619.331	252.73
619.743	177.49
620.155	162.93
620.568	165.35
620.98	213.9
621.392	167.78
621.804	189.63
622.216	145.94
622.628	187.2
623.04	206.62
623.452	170.21
623.864	82.83
624.276	196.91
624.687	194.48
625.099	201.76
625.511	177.49
625.922	158.07
626.334	194.48
626.745	94.97
627.157	194.48
627.568	136.23
627.979	184.77
628.391	97.39
628.802	213.9
629.213	138.66
629.624	145.94
630.035	145.94
630.446	165.35
630.857	153.22
631.268	138.66
631.679	73.12
632.09	77.97
632.501	182.35
632.912	179.92
633.322	124.09
633.733	87.68
634.144	196.91
634.554	187.2
634.965	177.49
635.375	99.82
635.785	150.79
636.196	150.79
636.606	119.24
637.016	138.66
637.427	172.64
637.837	194.48
638.247	90.11
638.657	162.93
639.067	145.94
639.477	92.54
639.887	148.36
640.297	136.23
640.706	172.64
641.116	209.04
641.526	70.69
641.935	128.95
642.345	126.52
642.755	141.08
643.164	155.65
643.573	90.11
643.983	75.55
644.392	228.46
644.801	141.08
645.211	150.79
645.62	141.08
646.029	109.53
646.438	58.56
646.847	158.07
647.256	109.53
647.665	184.77
648.074	155.65
648.483	92.54
648.892	153.22
649.3	145.94
649.709	145.94
650.118	131.37
650.526	111.96
650.935	160.5
651.343	211.47
651.752	138.66
652.16	145.94
652.568	175.06
652.977	165.35
653.385	116.81
653.793	126.52
654.201	184.77
654.609	155.65
655.017	187.2
655.425	73.12
655.833	204.19
656.241	107.1
656.649	153.22
657.057	116.81
657.464	90.11
657.872	114.38
658.28	153.22
658.687	162.93
659.095	90.11
659.502	160.5
659.91	138.66
660.317	107.1
660.724	170.21
661.132	199.34
661.539	116.81
661.946	138.66
662.353	160.5
662.76	111.96
663.167	167.78
663.574	119.24
663.981	162.93
664.388	148.36
664.795	172.64
665.202	119.24
665.608	143.51
666.015	80.4
666.422	141.08
666.828	92.54
667.235	160.5
667.641	153.22
668.047	124.09
668.454	179.92
668.86	111.96
669.266	165.35
669.673	184.77
670.079	141.08
670.485	82.83
670.891	240.6
671.297	141.08
671.703	102.25
672.109	65.84
672.515	102.25
672.92	133.8
673.326	165.35
673.732	90.11
674.138	172.64
674.543	107.1
674.949	165.35
675.354	153.22
675.76	116.81
676.165	141.08
676.57	165.35
676.976	128.95
677.381	160.5
677.786	116.81
678.191	133.8
678.596	160.5
679.001	153.22
679.406	128.95
679.811	114.38
680.216	153.22
680.621	204.19
681.026	114.38
681.43	116.81
681.835	150.79
682.24	104.67
682.644	119.24
683.049	196.91
683.453	121.66
683.858	145.94
684.262	155.65
684.667	160.5
685.071	114.38
685.475	175.06
685.879	187.2
686.283	199.34
686.687	116.81
687.091	175.06
687.495	172.64
687.899	184.77
688.303	165.35
688.707	143.51
689.111	97.39
689.514	99.82
689.918	187.2
690.322	153.22
690.725	162.93
691.129	177.49
691.532	138.66
691.936	172.64
692.339	150.79
692.742	162.93
693.146	121.66
693.549	165.35
693.952	187.2
694.355	158.07
694.758	80.4
695.161	213.9
695.564	70.69
695.967	167.78
696.37	167.78
696.773	99.82
697.175	148.36
697.578	189.63
697.981	177.49
698.383	257.59
698.786	221.18
699.188	99.82
699.591	126.52
699.993	206.62
700.395	170.21
700.798	99.82
701.2	90.11
701.602	199.34
702.004	209.04
702.406	160.5
702.808	104.67
703.21	107.1
703.612	201.76
704.014	162.93
704.416	213.9
704.818	141.08
705.219	119.24
705.621	277.01
706.023	221.18
706.424	204.19
706.826	194.48
707.227	138.66
707.629	172.64
708.03	235.74
708.431	228.46
708.832	192.05
709.234	291.57
709.635	233.32
710.036	272.15
710.437	182.35
710.838	262.44
711.239	194.48
711.64	153.22
712.041	192.05
712.441	206.62
712.842	245.45
713.243	209.04
713.643	196.91
714.044	260.02
714.445	274.58
714.845	260.02
715.246	291.57
715.646	252.73
716.046	281.86
716.447	315.84
716.847	264.87
717.247	260.02
717.647	257.59
718.047	318.27
718.447	320.7
718.847	344.97
719.247	332.83
719.647	361.96
720.047	340.11
720.446	352.25
720.846	286.72
721.246	318.27
721.645	410.5
722.045	347.4
722.444	386.23
722.844	371.67
723.243	366.81
723.643	449.34
724.042	378.95
724.441	364.39
724.84	403.22
725.24	405.65
725.639	417.79
726.038	415.36
726.437	444.49
726.836	442.06
727.234	514.87
727.633	534.29
728.032	517.3
728.431	502.74
728.83	446.91
729.228	626.53
729.627	580.41
730.025	665.36
730.424	682.35
730.822	713.91
731.22	781.87
731.619	774.59
732.017	852.26
732.415	871.68
732.813	825.56
733.212	1002.75
733.61	1000.32
734.008	1063.43
734.406	1111.97
734.803	1114.4
735.201	1150.81
735.599	1369.26
735.997	1381.39
736.395	1444.5
736.792	1527.03
737.19	1709.07
737.587	1684.8
737.985	1830.43
738.382	1881.4
738.78	1995.48
739.177	1893.54
739.574	2080.43
739.971	2243.06
740.369	2269.76
740.766	2558.6
741.163	2410.54
741.56	2570.73
741.957	2607.14
742.354	2677.53
742.751	2849.86
743.147	2963.94
743.544	3143.56
743.941	3243.07
744.338	3437.25
744.734	3471.23
745.131	3704.24
745.527	3893.57
745.924	4051.34
746.32	4323.19
746.716	4463.97
747.113	4451.83
747.509	4888.73
747.905	5133.88
748.301	5325.63
748.697	5551.36
749.093	5840.2
749.489	5980.98
749.885	6155.74
750.281	6699.44
750.677	7082.94
751.073	7189.74
751.468	7439.74
751.864	7711.59
752.26	7726.15
752.655	8214.02
753.051	8403.35
753.446	9199.48
753.842	9218.89
754.237	9609.68
754.632	9842.69
755.028	9927.64
755.423	10160.66
755.818	10277.16
756.213	10646.1
756.608	10886.4
757.003	11005.33
757.398	11519.9
757.793	11638.83
758.188	11493.2
758.583	11871.85
758.977	12354.86
759.372	12864.58
759.767	13352.45
760.161	14330.62
760.556	14796.65
760.95	15100.05
761.345	15517.54
761.739	16813.67
762.133	17199.6
762.527	17733.59
762.922	18231.17
763.316	19027.3
763.71	18682.63
764.104	19296.72
764.498	20352.56
764.892	20682.66
765.286	20473.92
765.68	21609.86
766.073	22507.94
766.467	22151.13
766.861	22714.25
767.255	23828.34
767.648	24726.42
768.042	24490.98
768.435	24893.89
768.829	26180.32
769.222	25855.07
769.615	26063.82
770.008	26141.49
770.402	27025
770.795	26420.62
771.188	26539.55
771.581	27692.48
771.974	27782.29
772.367	26617.22
772.76	27085.68
773.153	27289.56
773.545	26719.17
773.938	27044.41
774.331	27410.92
774.724	28338.12
775.116	28619.68
775.509	29733.78
775.901	31476.52
776.294	32396.44
776.686	31862.45
777.078	33428.01
777.471	34687.74
777.863	35682.9
778.255	35979.02
778.647	36957.19
779.039	37935.36
779.431	37105.25
779.823	37396.52
780.215	38027.59
780.607	37639.24
780.999	38294.59
781.39	37794.58
781.782	39462.08
782.174	39386.84
782.565	39020.33
782.957	38928.09
783.348	40794.63
783.74	40466.95
784.131	39042.17
784.522	40534.91
784.914	40430.54
785.305	40185.39
785.696	38564.01
786.087	39719.37
786.478	39064.02
786.869	36894.08
787.26	35901.35
787.651	36527.57
788.042	36857.67
788.433	34534.82
788.823	33721.7
789.214	34027.53
789.605	32937.71
789.995	31668.27
790.386	31481.38
790.776	31983.81
791.167	30767.77
791.557	30944.96
791.948	32316.34
792.338	32954.7
792.728	33522.67
793.118	32949.85
793.508	33886.75
793.898	35027.55
794.288	34148.89
794.678	33199.85
795.068	34224.14
795.458	34369.77
795.848	33731.41
796.238	32838.19
796.627	33690.15
797.017	34061.51
797.406	33461.99
797.796	32520.23
798.185	33874.62
798.575	34304.24
798.964	32969.26
799.354	33294.51
799.743	33894.03
800.132	34168.31
800.521	32321.19
800.91	32850.33
801.299	33614.9
801.688	33046.93
802.077	31896.43
802.466	31265.35
802.855	32801.78
803.244	31918.28
803.633	30454.66
804.021	29532.32
804.41	30299.32
804.799	29750.77
805.187	27874.52
805.576	27384.22
805.964	27821.12
806.352	26449.74
806.741	25588.08
807.129	25119.63
807.517	26355.08
807.905	25876.92
808.293	24459.42
808.681	24673.02
809.069	26027.41
809.457	26508
809.845	25520.12
810.233	25352.64
810.621	26665.77
811.009	26697.32
811.396	25665.75
811.784	25796.82
812.171	27282.28
812.559	25966.73
812.946	24153.59
813.334	24012.81
813.721	24884.19
814.108	24058.93
814.496	22949.69
814.883	22194.82
815.27	24056.5
815.657	23333.19
816.044	22507.94
816.431	22585.61
816.818	23736.11
817.205	23163.29
817.592	22622.01
817.979	21318.6
818.365	21774.91
818.752	21558.89
819.139	19784.59
819.525	19422.94
819.912	19590.41
820.298	19653.52
820.685	18270.01
821.071	17396.21
821.457	17578.25
821.843	17386.5
822.23	16272.4
822.616	15102.48
823.002	14752.96
823.388	14709.27
823.774	14090.33
824.16	13015.07
824.546	12733.51
824.931	13284.49
825.317	13068.47
825.703	12092.72
826.089	12073.31
826.474	12325.74
826.86	12087.87
827.245	11410.68
827.631	11481.06
828.016	11252.91
828.401	11451.94
828.787	10692.22
829.172	10512.6
829.557	10311.14
829.942	10381.53
830.327	9616.96
830.712	9342.68
831.097	9073.26
831.482	9425.21
831.867	9080.54
832.252	8447.04
832.636	8376.65
833.021	8573.25
833.406	8364.51
833.79	7900.91
834.175	7595.08
834.559	7942.17
834.944	7701.88
835.328	7226.14
835.713	7099.93
836.097	6900.9
836.481	6811.09
836.865	6531.96
837.249	6061.08
837.633	5796.51
838.017	5971.27
838.401	5597.48
838.785	5245.53
839.169	4942.13
839.553	5034.36
839.937	4876.59
840.32	4510.08
840.704	4240.66
841.087	4148.43
841.471	4165.42
841.854	3942.11
842.238	3653.27
842.621	3631.43
843.004	3645.99
843.388	3582.88
843.771	3449.39
844.154	3235.79
844.537	3357.15
844.92	3383.85
845.303	3332.88
845.686	3075.59
846.069	3097.44
846.452	3085.3
846.834	2942.1
847.217	2764.91
847.6	2813.45
847.982	2757.63
848.365	2845.01
848.748	2692.09
849.13	2471.22
849.512	2476.07
849.895	2507.62
850.277	2364.42
850.659	2204.22
851.041	2201.79
851.423	2335.29
851.806	2243.06
852.188	2063.44
852.57	1980.92
852.951	2046.45
853.333	2095
853.715	2048.88
854.097	1903.25
854.479	1876.55
854.86	1740.62
855.242	1813.44
855.623	1609.55
856.005	1500.33
856.386	1611.98
856.768	1497.9
857.149	1376.54
857.53	1298.87
857.911	1315.86
858.292	1364.4
858.674	1335.28
859.055	1228.48
859.436	1131.39
859.817	1027.02
860.197	1099.84
860.578	988.18
860.959	976.05
861.34	869.25
861.72	939.64
862.101	993.04
862.482	891.09
862.862	871.68
863.243	883.81
863.623	859.54
864.003	818.28
864.384	818.28
864.764	806.14
865.144	808.57
865.524	760.02
865.904	689.63
866.284	711.48
866.664	604.68
867.044	665.36
867.424	665.36
867.804	667.79
868.183	495.46
868.563	522.16
868.943	556.14
869.322	570.7
869.702	602.25
870.081	573.13
870.461	529.44
870.84	536.72
871.22	539.15
871.599	454.19
871.978	444.49
872.357	478.47
872.736	495.46
873.115	425.07
873.494	400.8
873.873	403.22
874.252	391.09
874.631	422.64
875.01	473.61
875.388	364.39
875.767	412.93
876.146	364.39
876.524	327.98
876.903	335.26
877.281	306.13
877.66	228.46
878.038	279.43
878.416	296.42
878.794	269.73
879.173	221.18
879.551	281.86
879.929	264.87
880.307	245.45
880.685	182.35
881.063	245.45
881.441	277.01
881.818	279.43
882.196	272.15
882.574	281.86
882.951	247.88
883.329	158.07
883.707	291.57
884.084	233.32
884.461	245.45
884.839	216.33
885.216	216.33
885.593	243.03
885.971	235.74
886.348	257.59
886.725	160.5
887.102	162.93
887.479	194.48
887.856	223.61
888.233	228.46
888.609	264.87
888.986	196.91
889.363	206.62
889.74	213.9
890.116	245.45
890.493	196.91
890.869	187.2
891.246	216.33
891.622	199.34
891.998	119.24
892.375	170.21
892.751	177.49
893.127	179.92
893.503	153.22
893.879	218.75
894.255	194.48
894.631	199.34
895.007	121.66
895.383	128.95
895.759	179.92
896.134	172.64
896.51	145.94
896.886	192.05
897.261	65.84
897.637	226.04
898.012	155.65
898.388	143.51
898.763	141.08
899.138	116.81
899.514	27
899.889	172.64
900.264	160.5
900.639	145.94
901.014	162.93
901.389	143.51
901.764	145.94
902.139	109.53
902.513	131.37
902.888	133.8
903.263	179.92
903.638	73.12
904.012	82.83
904.387	158.07
904.761	141.08
905.136	143.51
905.51	114.38
905.884	175.06
906.259	136.23
906.633	189.63
907.007	87.68
907.381	199.34
907.755	131.37
908.129	111.96
908.503	170.21
908.877	155.65
909.251	114.38
909.624	138.66
909.998	153.22
910.372	99.82
910.745	80.4
911.119	80.4
911.492	145.94
911.866	82.83
912.239	65.84
912.612	177.49
912.986	145.94
913.359	165.35
913.732	104.67
914.105	141.08
914.478	150.79
914.851	162.93
915.224	128.95
915.597	121.66
915.97	124.09
916.343	119.24
916.715	160.5
917.088	162.93
917.461	138.66
917.833	192.05
918.206	228.46
918.578	107.1
918.951	87.68
919.323	131.37
919.695	138.66
920.067	141.08
920.44	141.08
920.812	119.24
921.184	175.06
921.556	192.05
921.928	170.21
922.3	94.97
922.672	94.97
923.043	116.81
923.415	148.36
923.787	109.53
924.158	133.8
924.53	94.97
924.901	99.82
925.273	60.98
925.644	99.82
926.016	126.52
926.387	126.52
926.758	133.8
927.129	102.25
927.5	73.12
927.872	133.8
928.243	150.79
928.613	211.47
928.984	97.39
929.355	165.35
929.726	126.52
930.097	104.67
930.467	102.25
930.838	126.52
931.209	111.96
931.579	162.93
931.95	141.08
932.32	94.97
932.69	124.09
933.061	77.97
933.431	99.82
933.801	111.96
934.171	17.29
934.541	119.24
934.911	94.97
935.281	124.09
935.651	133.8
936.021	167.78
936.391	148.36
936.761	133.8
937.13	121.66
937.5	175.06
937.87	175.06
938.239	155.65
938.609	131.37
938.978	211.47
939.347	104.67
939.717	109.53
940.086	102.25
940.455	128.95
940.824	148.36
941.193	104.67
941.562	182.35
941.931	109.53
942.3	138.66
942.669	136.23
943.038	133.8
943.407	85.26
943.775	150.79
944.144	177.49
944.513	155.65
944.881	80.4
945.25	107.1
945.618	87.68
945.986	124.09
946.355	111.96
946.723	85.26
947.091	124.09
947.459	114.38
947.827	148.36
948.195	119.24
948.563	90.11
948.931	70.69
949.299	90.11
949.667	167.78
950.035	97.39
950.402	167.78
950.77	209.04
951.138	126.52
951.505	153.22
951.873	114.38
952.24	133.8
952.607	158.07
952.975	119.24
953.342	194.48
953.709	94.97
954.076	179.92
954.443	82.83
954.81	119.24
955.177	107.1
955.544	85.26
955.911	162.93
956.278	114.38
956.645	136.23
957.012	165.35
957.378	141.08
957.745	172.64
958.111	175.06
958.478	172.64
958.844	158.07
959.211	87.68
959.577	60.98
959.943	111.96
960.309	143.51
960.675	158.07
961.042	99.82
961.408	131.37
961.774	128.95
962.139	216.33
962.505	99.82
962.871	109.53
963.237	107.1
963.603	138.66
963.968	36.71
964.334	46.42
964.699	107.1
965.065	158.07
965.43	116.81
965.796	63.41
966.161	109.53
966.526	111.96
966.891	182.35
967.256	53.7
967.622	22.15
967.987	51.28
968.352	77.97
968.716	138.66
969.081	111.96
969.446	109.53
969.811	116.81
970.176	124.09
970.54	133.8
970.905	128.95
971.269	167.78
971.634	155.65
971.998	116.81
972.363	133.8
972.727	104.67
973.091	116.81
973.455	104.67
973.819	155.65
974.183	124.09
974.547	119.24
974.911	56.13
975.275	107.1
975.639	102.25
976.003	126.52
976.367	102.25
976.73	119.24
977.094	126.52
977.458	128.95
977.821	177.49
978.185	119.24
978.548	165.35
978.911	155.65
979.275	70.69
979.638	177.49
980.001	179.92
980.364	85.26
980.727	124.09
981.09	155.65
981.453	155.65
981.816	133.8
982.179	85.26
982.542	209.04
982.905	119.24
983.267	184.77
983.63	111.96
983.992	85.26
984.355	94.97
984.717	94.97
985.08	80.4
985.442	172.64
985.804	143.51
986.167	177.49
986.529	77.97
986.891	128.95
987.253	141.08
987.615	58.56
987.977	138.66
988.339	109.53
988.701	82.83
989.062	167.78
989.424	126.52
989.786	170.21
990.147	148.36
990.509	133.8
990.87	155.65
991.232	131.37
991.593	99.82
991.955	126.52
992.316	102.25
992.677	56.13
993.038	128.95
993.399	119.24
993.76	128.95
994.121	107.1
994.482	153.22
994.843	184.77
995.204	133.8
995.565	160.5
995.926	148.36
996.286	172.64
996.647	75.55
997.007	82.83
997.368	99.82
997.728	138.66
998.089	158.07
998.449	155.65
998.809	150.79
999.169	60.98
999.53	99.82
999.89	126.52
1000.25	107.1
1000.61	102.25
1000.97	92.54
1001.329	121.66
1001.689	111.96
1002.049	97.39
1002.409	148.36
1002.768	104.67
1003.128	165.35
1003.487	121.66
1003.847	121.66
1004.206	141.08
1004.566	12.44
1004.925	136.23
1005.284	124.09
1005.643	63.41
1006.003	158.07
1006.362	70.69
1006.721	87.68
1007.08	77.97
1007.438	77.97
1007.797	126.52
1008.156	187.2
1008.515	77.97
1008.874	136.23
1009.232	121.66
1009.591	133.8
1009.949	131.37
1010.308	63.41
1010.666	213.9
1011.024	138.66
1011.383	158.07
1011.741	68.27
1012.099	85.26
1012.457	133.8
1012.815	124.09
1013.173	167.78
1013.531	107.1
1013.889	158.07
1014.247	114.38
1014.605	136.23
1014.962	121.66
1015.32	141.08
1015.678	155.65
1016.035	126.52
1016.393	128.95
1016.75	160.5
1017.107	133.8
1017.465	109.53
1017.822	111.96
1018.179	119.24
1018.536	107.1
1018.894	121.66
1019.251	87.68
1019.608	92.54
1019.964	179.92
1020.321	160.5
1020.678	121.66
1021.035	141.08
1021.392	158.07
1021.748	184.77
1022.105	133.8
1022.461	70.69
1022.818	107.1
1023.174	158.07
1023.531	109.53
1023.887	107.1
1024.243	109.53
1024.599	143.51
1024.955	199.34
1025.311	136.23
1025.667	107.1
1026.023	136.23
1026.379	138.66
1026.735	58.56
1027.091	104.67
1027.447	90.11
