189.514	40.2
189.973	40.2
190.431	40.2
190.889	40.2
191.348	13.5
191.806	32.92
192.264	-42.32
192.722	30.49
193.18	8.65
193.638	-1.06
194.096	-15.63
194.554	-66.6
195.012	20.78
195.47	-20.48
195.928	-18.05
196.385	-1.06
196.843	59.62
197.301	-22.91
197.758	28.06
198.216	-13.2
198.674	52.34
199.131	1.37
199.589	59.62
200.046	74.18
200.503	57.19
200.961	117.87
201.418	81.46
201.875	132.44
202.332	122.73
202.79	125.15
203.247	100.88
203.704	137.29
204.161	76.61
204.618	52.34
205.075	91.17
205.532	120.3
205.989	163.99
206.445	115.44
206.902	168.84
207.359	142.14
207.816	115.44
208.272	151.85
208.729	100.88
209.185	132.44
209.642	188.26
210.098	193.12
210.555	139.72
211.011	151.85
211.467	137.29
211.924	156.71
212.38	83.89
212.836	159.13
213.292	178.55
213.748	69.33
214.204	98.45
214.66	234.38
215.116	142.14
215.572	115.44
216.028	188.26
216.484	147
216.94	188.26
217.396	115.44
217.851	122.73
218.307	142.14
218.763	66.9
219.218	144.57
219.674	96.03
220.129	120.3
220.585	188.26
221.04	166.42
221.496	105.74
221.951	154.28
222.406	214.96
222.861	127.58
223.317	149.43
223.772	110.59
224.227	76.61
224.682	144.57
225.137	144.57
225.592	142.14
226.047	178.55
226.502	91.17
226.957	105.74
227.411	74.18
227.866	142.14
228.321	115.44
228.776	132.44
229.23	91.17
229.685	122.73
230.139	159.13
230.594	163.99
231.048	134.86
231.503	96.03
231.957	144.57
232.411	144.57
232.865	185.83
233.32	178.55
233.774	23.21
234.228	110.59
234.682	134.86
235.136	122.73
235.59	132.44
236.044	130.01
236.498	100.88
236.952	113.02
237.406	100.88
237.86	113.02
238.313	127.58
238.767	185.83
239.221	171.27
239.674	69.33
240.128	120.3
240.581	154.28
241.035	98.45
241.488	108.16
241.942	127.58
242.395	125.15
242.848	108.16
243.301	139.72
243.755	151.85
244.208	132.44
244.661	188.26
245.114	79.04
245.567	193.12
246.02	134.86
246.473	117.87
246.926	115.44
247.379	110.59
247.832	81.46
248.284	132.44
248.737	120.3
249.19	178.55
249.642	144.57
250.095	154.28
250.547	137.29
251	197.97
251.452	142.14
251.905	166.42
252.357	113.02
252.81	59.62
253.262	142.14
253.714	88.75
254.166	108.16
254.618	117.87
255.07	144.57
255.523	103.31
255.975	151.85
256.427	125.15
256.878	144.57
257.33	110.59
257.782	178.55
258.234	147
258.686	127.58
259.137	105.74
259.589	171.27
260.041	161.56
260.492	122.73
260.944	139.72
261.395	130.01
261.847	117.87
262.298	144.57
262.749	180.98
263.201	168.84
263.652	185.83
264.103	171.27
264.554	149.43
265.005	159.13
265.457	79.04
265.908	113.02
266.359	168.84
266.809	180.98
267.26	246.51
267.711	120.3
268.162	96.03
268.613	127.58
269.064	161.56
269.514	132.44
269.965	149.43
270.415	105.74
270.866	188.26
271.316	185.83
271.767	139.72
272.217	113.02
272.668	219.82
273.118	171.27
273.568	134.86
274.019	88.75
274.469	91.17
274.919	154.28
275.369	156.71
275.819	147
276.269	188.26
276.719	105.74
277.169	125.15
277.619	147
278.069	176.13
278.518	188.26
278.968	139.72
279.418	156.71
279.867	171.27
280.317	154.28
280.767	151.85
281.216	139.72
281.666	151.85
282.115	139.72
282.564	168.84
283.014	127.58
283.463	188.26
283.912	156.71
284.361	134.86
284.811	202.82
285.26	113.02
285.709	96.03
286.158	117.87
286.607	139.72
287.056	105.74
287.505	137.29
287.953	197.97
288.402	137.29
288.851	132.44
289.3	86.32
289.748	115.44
290.197	154.28
290.646	142.14
291.094	91.17
291.543	166.42
291.991	93.6
292.439	113.02
292.888	115.44
293.336	127.58
293.784	137.29
294.233	110.59
294.681	180.98
295.129	154.28
295.577	193.12
296.025	147
296.473	147
296.921	139.72
297.369	108.16
297.817	134.86
298.264	151.85
298.712	159.13
299.16	200.4
299.608	193.12
300.055	127.58
300.503	79.04
300.95	166.42
301.398	142.14
301.845	144.57
302.293	142.14
302.74	79.04
303.187	154.28
303.635	127.58
304.082	166.42
304.529	93.6
304.976	195.54
305.423	127.58
305.87	176.13
306.317	166.42
306.764	161.56
307.211	185.83
307.658	176.13
308.105	122.73
308.552	151.85
308.998	147
309.445	122.73
309.892	130.01
310.338	125.15
310.785	103.31
311.231	69.33
311.678	120.3
312.124	193.12
312.571	120.3
313.017	159.13
313.463	147
313.909	173.7
314.356	166.42
314.802	159.13
315.248	168.84
315.694	202.82
316.14	166.42
316.586	117.87
317.032	154.28
317.478	134.86
317.923	163.99
318.369	93.6
318.815	110.59
319.261	103.31
319.706	149.43
320.152	66.9
320.597	183.41
321.043	130.01
321.488	195.54
321.934	79.04
322.379	130.01
322.824	117.87
323.27	173.7
323.715	86.32
324.16	98.45
324.605	156.71
325.05	91.17
325.495	103.31
325.94	105.74
326.385	110.59
326.83	183.41
327.275	173.7
327.72	173.7
328.165	168.84
328.61	91.17
329.054	163.99
329.499	125.15
329.943	93.6
330.388	103.31
330.832	161.56
331.277	154.28
331.721	98.45
332.166	161.56
332.61	71.75
333.054	120.3
333.499	83.89
333.943	154.28
334.387	127.58
334.831	214.96
335.275	159.13
335.719	115.44
336.163	120.3
336.607	115.44
337.051	120.3
337.495	93.6
337.938	161.56
338.382	159.13
338.826	120.3
339.269	105.74
339.713	100.88
340.157	171.27
340.6	74.18
341.044	190.69
341.487	214.96
341.93	173.7
342.374	59.62
342.817	178.55
343.26	130.01
343.703	54.76
344.146	83.89
344.59	113.02
345.033	105.74
345.476	127.58
345.919	137.29
346.361	139.72
346.804	161.56
347.247	163.99
347.69	171.27
348.133	178.55
348.575	130.01
349.018	156.71
349.461	125.15
349.903	115.44
350.346	115.44
350.788	188.26
351.23	54.76
351.673	127.58
352.115	113.02
352.557	105.74
353	117.87
353.442	86.32
353.884	113.02
354.326	125.15
354.768	115.44
355.21	159.13
355.652	147
356.094	173.7
356.536	122.73
356.978	96.03
357.419	125.15
357.861	212.53
358.303	105.74
358.744	122.73
359.186	71.75
359.627	149.43
360.069	110.59
360.51	144.57
360.952	98.45
361.393	115.44
361.834	130.01
362.276	110.59
362.717	105.74
363.158	71.75
363.599	142.14
364.04	239.23
364.481	144.57
364.922	117.87
365.363	185.83
365.804	134.86
366.245	156.71
366.686	159.13
367.126	125.15
367.567	263.51
368.008	151.85
368.448	76.61
368.889	200.4
369.33	134.86
369.77	185.83
370.21	227.1
370.651	120.3
371.091	122.73
371.531	154.28
371.972	147
372.412	193.12
372.852	139.72
373.292	64.47
373.732	176.13
374.172	125.15
374.612	180.98
375.052	168.84
375.492	81.46
375.932	166.42
376.372	132.44
376.811	98.45
377.251	156.71
377.691	117.87
378.13	134.86
378.57	171.27
379.009	190.69
379.449	79.04
379.888	166.42
380.328	76.61
380.767	110.59
381.206	137.29
381.645	66.9
382.085	120.3
382.524	117.87
382.963	125.15
383.402	74.18
383.841	125.15
384.28	159.13
384.719	163.99
385.158	69.33
385.596	86.32
386.035	161.56
386.474	188.26
386.913	100.88
387.351	173.7
387.79	134.86
388.228	57.19
388.667	195.54
389.105	207.68
389.544	125.15
389.982	193.12
390.42	113.02
390.859	185.83
391.297	96.03
391.735	103.31
392.173	134.86
392.611	100.88
393.049	103.31
393.487	154.28
393.925	173.7
394.363	161.56
394.801	185.83
395.239	113.02
395.676	113.02
396.114	113.02
396.552	195.54
396.989	139.72
397.427	156.71
397.864	132.44
398.302	161.56
398.739	81.46
399.177	57.19
399.614	98.45
400.051	134.86
400.488	168.84
400.926	132.44
401.363	88.75
401.8	74.18
402.237	154.28
402.674	183.41
403.111	130.01
403.548	185.83
403.985	91.17
404.421	183.41
404.858	86.32
405.295	195.54
405.732	163.99
406.168	142.14
406.605	180.98
407.041	86.32
407.478	105.74
407.914	110.59
408.351	105.74
408.787	108.16
409.223	122.73
409.66	130.01
410.096	147
410.532	161.56
410.968	62.05
411.404	108.16
411.84	134.86
412.276	154.28
412.712	183.41
413.148	173.7
413.584	137.29
414.02	100.88
414.455	98.45
414.891	168.84
415.327	105.74
415.762	139.72
416.198	113.02
416.633	96.03
417.069	159.13
417.504	144.57
417.94	122.73
418.375	120.3
418.81	171.27
419.245	159.13
419.681	117.87
420.116	88.75
420.551	127.58
420.986	127.58
421.421	142.14
421.856	188.26
422.291	81.46
422.726	149.43
423.16	66.9
423.595	183.41
424.03	130.01
424.464	132.44
424.899	151.85
425.334	178.55
425.768	100.88
426.203	117.87
426.637	171.27
427.071	166.42
427.506	137.29
427.94	149.43
428.374	156.71
428.809	151.85
429.243	239.23
429.677	193.12
430.111	159.13
430.545	117.87
430.979	144.57
431.413	64.47
431.847	120.3
432.28	149.43
432.714	190.69
433.148	125.15
433.582	113.02
434.015	159.13
434.449	74.18
434.882	180.98
435.316	93.6
435.749	144.57
436.183	144.57
436.616	49.91
437.049	142.14
437.483	142.14
437.916	166.42
438.349	147
438.782	139.72
439.215	113.02
439.648	127.58
440.081	149.43
440.514	130.01
440.947	122.73
441.38	110.59
441.813	151.85
442.245	144.57
442.678	207.68
443.111	130.01
443.543	117.87
443.976	185.83
444.408	125.15
444.841	163.99
445.273	110.59
445.705	200.4
446.138	166.42
446.57	185.83
447.002	154.28
447.434	154.28
447.867	130.01
448.299	161.56
448.731	214.96
449.163	193.12
449.595	134.86
450.026	171.27
450.458	74.18
450.89	120.3
451.322	105.74
451.754	139.72
452.185	127.58
452.617	91.17
453.048	125.15
453.48	105.74
453.911	176.13
454.343	139.72
454.774	166.42
455.205	207.68
455.637	127.58
456.068	122.73
456.499	229.52
456.93	93.6
457.361	173.7
457.792	125.15
458.223	176.13
458.654	115.44
459.085	202.82
459.516	200.4
459.947	178.55
460.378	45.06
460.808	173.7
461.239	127.58
461.669	127.58
462.1	163.99
462.531	180.98
462.961	110.59
463.391	154.28
463.822	108.16
464.252	115.44
464.682	193.12
465.113	83.89
465.543	200.4
465.973	147
466.403	168.84
466.833	125.15
467.263	210.11
467.693	159.13
468.123	130.01
468.553	151.85
468.983	139.72
469.412	117.87
469.842	139.72
470.272	197.97
470.701	193.12
471.131	183.41
471.56	207.68
471.99	81.46
472.419	173.7
472.849	205.25
473.278	96.03
473.707	161.56
474.136	115.44
474.566	166.42
474.995	96.03
475.424	100.88
475.853	205.25
476.282	86.32
476.711	161.56
477.14	144.57
477.569	142.14
477.997	117.87
478.426	154.28
478.855	137.29
479.283	156.71
479.712	180.98
480.141	83.89
480.569	147
480.998	47.48
481.426	147
481.854	130.01
482.283	178.55
482.711	161.56
483.139	173.7
483.567	100.88
483.995	195.54
484.424	144.57
484.852	190.69
485.28	168.84
485.708	142.14
486.135	205.25
486.563	142.14
486.991	149.43
487.419	197.97
487.847	117.87
488.274	151.85
488.702	134.86
489.129	161.56
489.557	88.75
489.984	171.27
490.412	110.59
490.839	139.72
491.266	171.27
491.694	173.7
492.121	180.98
492.548	200.4
492.975	154.28
493.402	134.86
493.829	127.58
494.256	81.46
494.683	49.91
495.11	125.15
495.537	205.25
495.964	195.54
496.39	108.16
496.817	183.41
497.244	144.57
497.67	125.15
498.097	117.87
498.523	137.29
498.95	176.13
499.376	132.44
499.803	147
500.229	79.04
500.655	149.43
501.081	122.73
501.508	183.41
501.934	71.75
502.36	132.44
502.786	96.03
503.212	144.57
503.638	195.54
504.064	108.16
504.489	161.56
504.915	144.57
505.341	127.58
505.767	100.88
506.192	217.39
506.618	178.55
507.043	149.43
507.469	156.71
507.894	180.98
508.32	163.99
508.745	178.55
509.17	137.29
509.596	103.31
510.021	168.84
510.446	71.75
510.871	110.59
511.296	171.27
511.721	96.03
512.146	113.02
512.571	127.58
512.996	178.55
513.421	219.82
513.845	161.56
514.27	110.59
514.695	185.83
515.119	132.44
515.544	122.73
515.969	173.7
516.393	137.29
516.817	168.84
517.242	190.69
517.666	149.43
518.09	183.41
518.515	176.13
518.939	98.45
519.363	297.49
519.787	168.84
520.211	171.27
520.635	163.99
521.059	161.56
521.483	183.41
521.907	132.44
522.331	168.84
522.754	134.86
523.178	127.58
523.602	134.86
524.025	110.59
524.449	188.26
524.872	115.44
525.296	110.59
525.719	147
526.143	103.31
526.566	193.12
526.989	151.85
527.412	202.82
527.836	159.13
528.259	161.56
528.682	147
529.105	113.02
529.528	127.58
529.951	108.16
530.374	130.01
530.796	149.43
531.219	166.42
531.642	79.04
532.065	122.73
532.487	122.73
532.91	144.57
533.332	151.85
533.755	173.7
534.177	127.58
534.6	62.05
535.022	147
535.444	115.44
535.867	134.86
536.289	139.72
536.711	142.14
537.133	163.99
537.555	156.71
537.977	147
538.399	173.7
538.821	176.13
539.243	62.05
539.665	154.28
540.086	176.13
540.508	132.44
540.93	161.56
541.351	139.72
541.773	142.14
542.195	188.26
542.616	188.26
543.037	125.15
543.459	154.28
543.88	156.71
544.301	210.11
544.723	74.18
545.144	171.27
545.565	98.45
545.986	188.26
546.407	210.11
546.828	120.3
547.249	132.44
547.67	183.41
548.091	88.75
548.512	188.26
548.932	142.14
549.353	197.97
549.774	166.42
550.194	161.56
550.615	171.27
551.035	188.26
551.456	134.86
551.876	202.82
552.296	100.88
552.717	147
553.137	117.87
553.557	120.3
553.977	173.7
554.397	190.69
554.817	96.03
555.237	142.14
555.657	180.98
556.077	115.44
556.497	127.58
556.917	168.84
557.337	154.28
557.756	159.13
558.176	159.13
558.596	147
559.015	185.83
559.435	115.44
559.854	117.87
560.274	100.88
560.693	120.3
561.112	168.84
561.532	178.55
561.951	171.27
562.37	161.56
562.789	137.29
563.208	161.56
563.627	142.14
564.046	105.74
564.465	195.54
564.884	151.85
565.303	142.14
565.722	130.01
566.14	110.59
566.559	149.43
566.978	151.85
567.396	115.44
567.815	132.44
568.233	168.84
568.652	195.54
569.07	200.4
569.489	108.16
569.907	207.68
570.325	147
570.743	62.05
571.161	127.58
571.58	79.04
571.998	188.26
572.416	125.15
572.833	166.42
573.251	127.58
573.669	173.7
574.087	190.69
574.505	142.14
574.922	142.14
575.34	142.14
575.758	147
576.175	166.42
576.593	137.29
577.01	180.98
577.428	122.73
577.845	1761.1
578.262	275.64
578.68	168.84
579.097	159.13
579.514	151.85
579.931	115.44
580.348	113.02
580.765	168.84
581.182	185.83
581.599	161.56
582.016	117.87
582.433	156.71
582.849	180.98
583.266	188.26
583.683	156.71
584.099	108.16
584.516	180.98
584.933	161.56
585.349	161.56
585.765	176.13
586.182	120.3
586.598	64.47
587.014	168.84
587.431	166.42
587.847	144.57
588.263	193.12
588.679	163.99
589.095	149.43
589.511	79.04
589.927	93.6
590.343	183.41
590.759	173.7
591.174	144.57
591.59	108.16
592.006	156.71
592.421	151.85
592.837	154.28
593.252	120.3
593.668	130.01
594.083	132.44
594.499	171.27
594.914	88.75
595.329	69.33
595.745	130.01
596.16	214.96
596.575	151.85
596.99	103.31
597.405	156.71
597.82	130.01
598.235	132.44
598.65	110.59
599.065	151.85
599.479	134.86
599.894	88.75
600.309	156.71
600.724	195.54
601.138	161.56
601.553	93.6
601.967	195.54
602.382	214.96
602.796	149.43
603.21	88.75
603.625	100.88
604.039	183.41
604.453	139.72
604.867	100.88
605.281	149.43
605.695	185.83
606.109	159.13
606.523	180.98
606.937	110.59
607.351	278.07
607.765	151.85
608.178	88.75
608.592	180.98
609.006	207.68
609.419	176.13
609.833	127.58
610.246	156.71
610.66	188.26
611.073	93.6
611.487	132.44
611.9	176.13
612.313	195.54
612.726	173.7
613.139	134.86
613.553	142.14
613.966	180.98
614.379	166.42
614.792	137.29
615.204	147
615.617	137.29
616.03	168.84
616.443	125.15
616.856	173.7
617.268	147
617.681	81.46
618.093	122.73
618.506	117.87
618.918	180.98
619.331	149.43
619.743	161.56
620.155	117.87
620.568	147
620.98	76.61
621.392	147
621.804	59.62
622.216	110.59
622.628	212.53
623.04	195.54
623.452	100.88
623.864	142.14
624.276	93.6
624.687	193.12
625.099	156.71
625.511	130.01
625.922	149.43
626.334	161.56
626.745	154.28
627.157	185.83
627.568	127.58
627.979	200.4
628.391	120.3
628.802	239.23
629.213	163.99
629.624	122.73
630.035	71.75
630.446	159.13
630.857	168.84
631.268	173.7
631.679	188.26
632.09	115.44
632.501	117.87
632.912	100.88
633.322	154.28
633.733	176.13
634.144	127.58
634.554	100.88
634.965	185.83
635.375	130.01
635.785	183.41
636.196	188.26
636.606	125.15
637.016	214.96
637.427	190.69
637.837	205.25
638.247	183.41
638.657	130.01
639.067	171.27
639.477	195.54
639.887	168.84
640.297	151.85
640.706	154.28
641.116	125.15
641.526	178.55
641.935	149.43
642.345	183.41
642.755	159.13
643.164	130.01
643.573	117.87
643.983	120.3
644.392	156.71
644.801	142.14
645.211	231.95
645.62	137.29
646.029	190.69
646.438	130.01
646.847	132.44
647.256	83.89
647.665	159.13
648.074	151.85
648.483	173.7
648.892	156.71
649.3	185.83
649.709	166.42
650.118	156.71
650.526	122.73
650.935	93.6
651.343	108.16
651.752	117.87
652.16	127.58
652.568	108.16
652.977	188.26
653.385	115.44
653.793	142.14
654.201	83.89
654.609	166.42
655.017	154.28
655.425	103.31
655.833	117.87
656.241	151.85
656.649	100.88
657.057	139.72
657.464	154.28
657.872	166.42
658.28	66.9
658.687	122.73
659.095	168.84
659.502	224.67
659.91	113.02
660.317	195.54
660.724	134.86
661.132	154.28
661.539	130.01
661.946	173.7
662.353	122.73
662.76	195.54
663.167	142.14
663.574	151.85
663.981	176.13
664.388	132.44
664.795	108.16
665.202	137.29
665.608	183.41
666.015	127.58
666.422	147
666.828	137.29
667.235	231.95
667.641	132.44
668.047	108.16
668.454	142.14
668.86	88.75
669.266	137.29
669.673	122.73
670.079	144.57
670.485	81.46
670.891	142.14
671.297	120.3
671.703	137.29
672.109	154.28
672.515	137.29
672.92	127.58
673.326	190.69
673.732	159.13
674.138	151.85
674.543	132.44
674.949	222.24
675.354	69.33
675.76	197.97
676.165	100.88
676.57	159.13
676.976	125.15
677.381	214.96
677.786	163.99
678.191	202.82
678.596	139.72
679.001	188.26
679.406	166.42
679.811	105.74
680.216	161.56
680.621	134.86
681.026	122.73
681.43	96.03
681.835	100.88
682.24	171.27
682.644	156.71
683.049	180.98
683.453	91.17
683.858	156.71
684.262	178.55
684.667	144.57
685.071	147
685.475	96.03
685.879	134.86
686.283	142.14
686.687	154.28
687.091	127.58
687.495	144.57
687.899	120.3
688.303	185.83
688.707	183.41
689.111	108.16
689.514	81.46
689.918	132.44
690.322	147
690.725	176.13
691.129	120.3
691.532	212.53
691.936	137.29
692.339	110.59
692.742	210.11
693.146	202.82
693.549	173.7
693.952	159.13
694.355	142.14
694.758	120.3
695.161	64.47
695.564	168.84
695.967	110.59
696.37	98.45
696.773	154.28
697.175	132.44
697.578	139.72
697.981	166.42
698.383	59.62
698.786	166.42
699.188	163.99
699.591	161.56
699.993	149.43
700.395	173.7
700.798	115.44
701.2	190.69
701.602	178.55
702.004	180.98
702.406	171.27
702.808	149.43
703.21	161.56
703.612	205.25
704.014	100.88
704.416	159.13
704.818	156.71
705.219	195.54
705.621	190.69
706.023	154.28
706.424	239.23
706.826	212.53
707.227	185.83
707.629	205.25
708.03	130.01
708.431	127.58
708.832	202.82
709.234	142.14
709.635	161.56
710.036	166.42
710.437	185.83
710.838	163.99
711.239	236.81
711.64	190.69
712.041	207.68
712.441	176.13
712.842	205.25
713.243	190.69
713.643	195.54
714.044	176.13
714.445	147
714.845	103.31
715.246	241.66
715.646	227.1
716.046	125.15
716.447	202.82
716.847	246.51
717.247	173.7
717.647	261.08
718.047	241.66
718.447	224.67
718.847	180.98
719.247	282.92
719.647	312.05
720.047	299.91
720.446	236.81
720.846	236.81
721.246	299.91
721.645	261.08
722.045	256.22
722.444	253.8
722.844	287.78
723.243	350.89
723.643	268.36
724.042	227.1
724.441	295.06
724.84	314.48
725.24	202.82
725.639	350.89
726.038	280.5
726.437	295.06
726.836	326.61
727.234	287.78
727.633	307.2
728.032	316.9
728.431	401.86
728.83	384.87
729.228	413.99
729.627	511.08
730.025	426.13
730.424	474.67
730.822	518.36
731.22	547.49
731.619	513.51
732.017	559.63
732.415	659.14
732.813	782.93
733.212	739.24
733.61	816.91
734.008	802.35
734.406	930.99
734.803	950.41
735.201	994.1
735.599	1088.76
735.997	1142.16
736.395	1185.85
736.792	1217.4
737.19	1365.46
737.587	1411.58
737.985	1540.22
738.382	1647.02
738.78	1748.97
739.177	1685.86
739.574	1872.75
739.971	1848.48
740.369	1931.01
740.766	2040.23
741.163	2096.06
741.56	2120.33
741.957	2120.33
742.354	2309.65
742.751	2423.73
743.147	2620.34
743.544	2637.33
743.941	2962.58
744.338	3171.32
744.734	3268.41
745.131	3528.12
745.527	3746.57
745.924	4023.27
746.32	4079.1
746.716	3923.76
747.113	4363.08
747.509	4462.6
747.905	4513.57
748.301	4722.31
748.697	5033
749.093	5496.6
749.489	5773.3
749.885	6554.87
750.281	7120.41
750.677	7348.57
751.073	7591.29
751.468	8154.4
751.864	8300.04
752.26	8188.39
752.655	8275.77
753.051	8246.64
753.446	8460.23
753.842	8353.44
754.237	8630.14
754.632	9144.71
755.028	9440.83
755.423	9736.95
755.818	10501.53
756.213	10933.57
756.608	10957.85
757.003	11193.29
757.398	10991.83
757.793	10751.53
758.188	10351.04
758.583	10149.58
758.977	10057.35
759.372	9877.73
759.767	10059.77
760.161	10962.7
760.556	11460.28
760.95	12584.09
761.345	13787.99
761.739	16285.6
762.133	17339.01
762.527	18965.25
762.922	19438.56
763.316	20610.91
763.71	20686.15
764.104	20472.56
764.498	20431.29
764.892	19681.28
765.286	19387.59
765.68	19161.86
766.073	19278.36
766.467	19161.86
766.861	20982.27
767.255	22654.63
767.648	25021.17
768.042	26302.75
768.435	28305.2
768.829	29936.3
769.222	31533.41
769.615	31778.56
770.008	31288.26
770.402	30370.77
770.795	29688.72
771.188	28538.22
771.581	26778.48
771.974	25280.88
772.367	24220.19
772.76	24562.43
773.153	23868.24
773.545	23739.6
773.938	25091.56
774.331	26348.86
774.724	28149.86
775.116	29802.8
775.509	31368.36
775.901	33419.36
776.294	34322.29
776.686	35480.07
777.078	35264.05
777.471	34628.12
777.863	34346.56
778.255	33443.63
778.647	32293.13
779.039	32941.2
779.431	32295.56
779.823	33074.7
780.215	34868.41
780.607	35730.08
780.999	38785.95
781.39	40761.71
781.782	42009.3
782.174	43167.09
782.565	43980.2
782.957	44684.1
783.348	45701.11
783.74	44303.03
784.131	40633.07
784.522	39938.88
784.914	37414.57
785.305	35761.63
785.696	34679.09
786.087	34242.19
786.478	33339.26
786.869	31875.65
787.26	32980.03
787.651	33477.61
788.042	33863.54
788.433	33963.06
788.823	33186.35
789.214	32203.32
789.605	31484.86
789.995	29176.58
790.386	27436.26
790.776	26475.08
791.167	24504.17
791.557	24225.04
791.948	23737.17
792.338	23380.37
792.728	23992.03
793.118	24742.04
793.508	25737.2
793.898	26766.34
794.288	28242.1
794.678	29130.46
795.068	30334.36
795.458	31047.96
795.848	31606.23
796.238	31970.31
796.627	31831.96
797.017	31390.2
797.406	30916.89
797.796	29528.52
798.185	28249.38
798.575	27028.48
798.964	26074.59
799.354	26229.93
799.743	25606.13
800.132	26026.04
800.521	27091.59
800.91	27390.14
801.299	29094.05
801.688	30089.21
802.077	30754.27
802.466	32749.45
802.855	33011.59
803.244	32853.82
803.633	32094.1
804.021	31074.66
804.41	30290.67
804.799	28242.1
805.187	26445.95
805.576	23870.67
805.964	22258.99
806.352	20491.98
806.741	19676.43
807.129	18647.29
807.517	18846.32
807.905	19229.82
808.293	20072.07
808.681	21200.72
809.069	22084.23
809.457	23868.24
809.845	25055.15
810.233	26001.77
810.621	27382.86
811.009	26749.35
811.396	26484.79
811.784	25907.11
812.171	25377.97
812.559	23941.06
812.946	22664.34
813.334	22011.42
813.721	21183.73
814.108	19768.66
814.496	19710.41
814.883	19093.9
815.27	19596.33
815.657	20865.77
816.044	21635.2
816.431	22836.67
816.818	23154.64
817.205	23860.96
817.592	24479.9
817.979	24416.79
818.365	23982.32
818.752	23606.1
819.139	23047.84
819.525	21790.54
819.912	20839.07
820.298	19307.49
820.685	17873
821.071	16622.98
821.457	15695.78
821.843	14729.75
822.23	13727.31
822.616	13101.08
823.002	12637.48
823.388	12482.14
823.774	12125.34
824.16	12193.3
824.546	12127.77
824.931	12246.7
825.317	12569.52
825.703	12470.01
826.089	12358.35
826.474	12236.99
826.86	11734.56
827.245	11719.99
827.631	11045.23
828.016	10567.06
828.401	9957.83
828.787	9297.63
829.172	8797.62
829.557	8516.06
829.942	8134.99
830.327	8035.47
830.712	7751.49
831.097	7780.61
831.482	7717.5
831.867	7795.18
832.252	8258.78
832.636	8397.13
833.021	8744.22
833.406	8622.86
833.79	8523.34
834.175	8433.54
834.559	8278.19
834.944	7744.2
835.328	7494.2
835.713	7091.28
836.097	6642.25
836.481	6003.89
836.865	5763.59
837.249	5418.93
837.633	4972.32
838.017	4901.93
838.401	4790.27
838.785	4513.57
839.169	4545.13
839.553	4630.08
839.937	4333.96
840.32	4110.65
840.704	4028.13
841.087	3838.8
841.471	3761.13
841.854	3501.42
842.238	3477.15
842.621	3282.97
843.004	3098.5
843.388	3057.24
843.771	3074.23
844.154	2758.69
844.537	2739.27
844.92	2688.3
845.303	2608.2
845.686	2586.36
846.069	2312.08
846.452	2474.7
846.834	2448.01
847.217	2416.45
847.6	2481.99
847.982	2370.33
848.365	2251.4
848.748	2438.3
849.13	2380.04
849.512	2341.21
849.895	2545.09
850.277	2370.33
850.659	2401.89
851.041	2392.18
851.423	2285.38
851.806	2139.75
852.188	2130.04
852.57	2001.4
852.951	1935.86
853.333	1928.58
853.715	1768.38
854.097	1761.1
854.479	1719.84
854.86	1574.21
855.242	1656.73
855.623	1569.35
856.005	1532.94
856.386	1486.83
856.768	1452.84
857.149	1341.19
857.53	1309.64
857.911	1338.76
858.292	1268.38
858.674	1246.53
859.055	1154.3
859.436	1166.43
859.817	1113.03
860.197	974.68
860.578	933.42
860.959	947.98
861.34	826.62
861.72	812.06
862.101	751.38
862.482	707.69
862.862	680.99
863.243	610.6
863.623	690.7
864.003	610.6
864.384	690.7
864.764	668.85
865.144	647.01
865.524	588.75
865.904	615.45
866.284	664
866.664	542.64
867.044	540.21
867.424	608.17
867.804	484.38
868.183	515.94
868.563	537.78
868.943	501.37
869.322	477.1
869.702	489.24
870.081	406.71
870.461	399.43
870.84	363.02
871.22	360.59
871.599	406.71
871.978	399.43
872.357	394.58
872.736	360.59
873.115	360.59
873.494	321.76
873.873	360.59
874.252	331.47
874.631	336.32
875.01	275.64
875.388	231.95
875.767	246.51
876.146	251.37
876.524	246.51
876.903	270.79
877.281	280.5
877.66	205.25
878.038	251.37
878.416	217.39
878.794	251.37
879.173	205.25
879.551	275.64
879.929	231.95
880.307	222.24
880.685	171.27
881.063	282.92
881.441	195.54
881.818	195.54
882.196	210.11
882.574	176.13
882.951	178.55
883.329	49.91
883.707	180.98
884.084	214.96
884.461	244.09
884.839	258.65
885.216	183.41
885.593	190.69
885.971	159.13
886.348	147
886.725	113.02
887.102	168.84
887.479	154.28
887.856	231.95
888.233	144.57
888.609	176.13
888.986	154.28
889.363	190.69
889.74	151.85
890.116	88.75
890.493	144.57
890.869	183.41
891.246	173.7
891.622	117.87
891.998	108.16
892.375	214.96
892.751	205.25
893.127	202.82
893.503	171.27
893.879	159.13
894.255	144.57
894.631	110.59
895.007	147
895.383	161.56
895.759	163.99
896.134	161.56
896.51	120.3
896.886	142.14
897.261	103.31
897.637	214.96
898.012	185.83
898.388	154.28
898.763	88.75
899.138	200.4
899.514	154.28
899.889	185.83
900.264	45.06
900.639	105.74
901.014	154.28
901.389	122.73
901.764	98.45
902.139	144.57
902.513	134.86
902.888	125.15
903.263	171.27
903.638	188.26
904.012	166.42
904.387	180.98
904.761	137.29
905.136	110.59
905.51	64.47
905.884	171.27
906.259	105.74
906.633	144.57
907.007	185.83
907.381	151.85
907.755	147
908.129	117.87
908.503	98.45
908.877	132.44
909.251	142.14
909.624	144.57
909.998	183.41
910.372	57.19
910.745	122.73
911.119	83.89
911.492	115.44
911.866	86.32
912.239	195.54
912.612	178.55
912.986	176.13
913.359	71.75
913.732	117.87
914.105	159.13
914.478	154.28
914.851	47.48
915.224	74.18
915.597	161.56
915.97	173.7
916.343	161.56
916.715	142.14
917.088	115.44
917.461	144.57
917.833	151.85
918.206	147
918.578	163.99
918.951	151.85
919.323	183.41
919.695	166.42
920.067	134.86
920.44	127.58
920.812	156.71
921.184	113.02
921.556	147
921.928	163.99
922.3	113.02
922.672	45.06
923.043	86.32
923.415	122.73
923.787	59.62
924.158	168.84
924.53	212.53
924.901	144.57
925.273	108.16
925.644	149.43
926.016	149.43
926.387	59.62
926.758	134.86
927.129	125.15
927.5	139.72
927.872	197.97
928.243	66.9
928.613	173.7
928.984	214.96
929.355	142.14
929.726	93.6
930.097	91.17
930.467	59.62
930.838	166.42
931.209	137.29
931.579	120.3
931.95	142.14
932.32	91.17
932.69	168.84
933.061	161.56
933.431	149.43
933.801	134.86
934.171	180.98
934.541	127.58
934.911	81.46
935.281	117.87
935.651	98.45
936.021	183.41
936.391	149.43
936.761	69.33
937.13	130.01
937.5	108.16
937.87	149.43
938.239	205.25
938.609	195.54
938.978	120.3
939.347	212.53
939.717	130.01
940.086	132.44
940.455	120.3
940.824	81.46
941.193	113.02
941.562	132.44
941.931	134.86
942.3	180.98
942.669	161.56
943.038	171.27
943.407	151.85
943.775	166.42
944.144	142.14
944.513	134.86
944.881	93.6
945.25	163.99
945.618	173.7
945.986	168.84
946.355	202.82
946.723	117.87
947.091	100.88
947.459	139.72
947.827	200.4
948.195	108.16
948.563	110.59
948.931	147
949.299	83.89
949.667	207.68
950.035	156.71
950.402	151.85
950.77	59.62
951.138	81.46
951.505	147
951.873	142.14
952.24	159.13
952.607	151.85
952.975	156.71
953.342	137.29
953.709	103.31
954.076	117.87
954.443	98.45
954.81	161.56
955.177	74.18
955.544	117.87
955.911	178.55
956.278	202.82
956.645	188.26
957.012	139.72
957.378	163.99
957.745	161.56
958.111	120.3
958.478	195.54
958.844	159.13
959.211	185.83
959.577	151.85
959.943	81.46
960.309	125.15
960.675	161.56
961.042	117.87
961.408	185.83
961.774	125.15
962.139	166.42
962.505	113.02
962.871	130.01
963.237	188.26
963.603	103.31
963.968	139.72
964.334	134.86
964.699	147
965.065	149.43
965.43	134.86
965.796	125.15
966.161	122.73
966.526	178.55
966.891	117.87
967.256	113.02
967.622	88.75
967.987	144.57
968.352	193.12
968.716	176.13
969.081	122.73
969.446	144.57
969.811	185.83
970.176	168.84
970.54	173.7
970.905	93.6
971.269	113.02
971.634	166.42
971.998	81.46
972.363	108.16
972.727	96.03
973.091	149.43
973.455	88.75
973.819	149.43
974.183	132.44
974.547	178.55
974.911	74.18
975.275	120.3
975.639	113.02
976.003	151.85
976.367	200.4
976.73	100.88
977.094	149.43
977.458	100.88
977.821	134.86
978.185	35.35
978.548	147
978.911	117.87
979.275	117.87
979.638	134.86
980.001	125.15
980.364	168.84
980.727	113.02
981.09	122.73
981.453	74.18
981.816	147
982.179	147
982.542	122.73
982.905	161.56
983.267	161.56
983.63	166.42
983.992	166.42
984.355	147
984.717	127.58
985.08	163.99
985.442	151.85
985.804	161.56
986.167	125.15
986.529	163.99
986.891	173.7
987.253	176.13
987.615	108.16
987.977	147
988.339	96.03
988.701	147
989.062	120.3
989.424	151.85
989.786	159.13
990.147	142.14
990.509	122.73
990.87	176.13
991.232	125.15
991.593	127.58
991.955	120.3
992.316	69.33
992.677	130.01
993.038	161.56
993.399	205.25
993.76	137.29
994.121	117.87
994.482	132.44
994.843	132.44
995.204	151.85
995.565	103.31
995.926	47.48
996.286	105.74
996.647	113.02
997.007	171.27
997.368	137.29
997.728	137.29
998.089	149.43
998.449	229.52
998.809	132.44
999.169	98.45
999.53	122.73
999.89	156.71
1000.25	125.15
1000.61	108.16
1000.97	120.3
1001.329	132.44
1001.689	122.73
1002.049	96.03
1002.409	86.32
1002.768	93.6
1003.128	161.56
1003.487	173.7
1003.847	139.72
1004.206	166.42
1004.566	219.82
1004.925	125.15
1005.284	137.29
1005.643	144.57
1006.003	222.24
1006.362	159.13
1006.721	81.46
1007.08	79.04
1007.438	130.01
1007.797	176.13
1008.156	156.71
1008.515	86.32
1008.874	117.87
1009.232	113.02
1009.591	178.55
1009.949	103.31
1010.308	122.73
1010.666	178.55
1011.024	117.87
1011.383	127.58
1011.741	200.4
1012.099	66.9
1012.457	132.44
1012.815	100.88
1013.173	149.43
1013.531	134.86
1013.889	147
1014.247	115.44
1014.605	88.75
1014.962	166.42
1015.32	103.31
1015.678	147
1016.035	149.43
1016.393	139.72
1016.75	113.02
1017.107	147
1017.465	110.59
1017.822	105.74
1018.179	122.73
1018.536	40.2
1018.894	117.87
1019.251	100.88
1019.608	149.43
1019.964	105.74
1020.321	122.73
1020.678	163.99
1021.035	69.33
1021.392	132.44
1021.748	156.71
1022.105	130.01
1022.461	156.71
1022.818	117.87
1023.174	100.88
1023.531	115.44
1023.887	149.43
1024.243	125.15
1024.599	137.29
1024.955	134.86
1025.311	62.05
1025.667	110.59
1026.023	159.13
1026.379	86.32
1026.735	156.71
1027.091	188.26
1027.447	273.21
