189.514	123.03
189.973	123.03
190.431	123.03
190.889	33.22
191.348	89.05
191.806	72.06
192.264	23.51
192.722	-27.46
193.18	23.51
193.638	-17.75
194.096	-8.04
194.554	57.49
195.012	-25.03
195.47	-17.75
195.928	-32.31
196.385	25.94
196.843	-12.89
197.301	16.23
197.758	-27.46
198.216	67.2
198.674	-51.73
199.131	6.52
199.589	93.9
200.046	106.04
200.503	69.63
200.961	91.48
201.418	72.06
201.875	164.29
202.332	108.47
202.79	137.59
203.247	142.45
203.704	142.45
204.161	152.16
204.618	195.85
205.075	210.41
205.532	147.3
205.989	137.59
206.445	108.47
206.902	164.29
207.359	157.01
207.816	174
208.272	120.6
208.729	205.56
209.185	115.75
209.642	169.15
210.098	135.17
210.555	205.56
211.011	118.18
211.467	210.41
211.924	190.99
212.38	101.18
212.836	205.56
213.292	142.45
213.748	166.72
214.204	161.87
214.66	249.25
215.116	178.86
215.572	140.02
216.028	254.1
216.484	256.53
216.94	227.4
217.396	149.73
217.851	103.61
218.307	159.44
218.763	203.13
219.218	161.87
219.674	188.56
220.129	98.76
220.585	135.17
221.04	169.15
221.496	140.02
221.951	130.31
222.406	169.15
222.861	212.84
223.317	176.43
223.772	161.87
224.227	215.26
224.682	188.56
225.137	183.71
225.592	212.84
226.047	166.72
226.502	154.58
226.957	190.99
227.411	200.7
227.866	171.57
228.321	174
228.776	220.12
229.23	140.02
229.685	135.17
230.139	164.29
230.594	144.87
231.048	144.87
231.503	234.68
231.957	118.18
232.411	125.46
232.865	178.86
233.32	229.83
233.774	144.87
234.228	159.44
234.682	193.42
235.136	127.88
235.59	195.85
236.044	232.25
236.498	157.01
236.952	157.01
237.406	232.25
237.86	205.56
238.313	140.02
238.767	234.68
239.221	203.13
239.674	263.81
240.128	215.26
240.581	224.97
241.035	169.15
241.488	169.15
241.942	166.72
242.395	169.15
242.848	186.14
243.301	142.45
243.755	203.13
244.208	174
244.661	166.72
245.114	174
245.567	161.87
246.02	164.29
246.473	142.45
246.926	113.32
247.379	152.16
247.832	186.14
248.284	144.87
248.737	207.98
249.19	115.75
249.642	113.32
250.095	125.46
250.547	154.58
251	154.58
251.452	125.46
251.905	176.43
252.357	118.18
252.81	203.13
253.262	183.71
253.714	144.87
254.166	193.42
254.618	193.42
255.07	152.16
255.523	205.56
255.975	144.87
256.427	142.45
256.878	154.58
257.33	157.01
257.782	91.48
258.234	178.86
258.686	115.75
259.137	169.15
259.589	144.87
260.041	210.41
260.492	152.16
260.944	188.56
261.395	300.22
261.847	234.68
262.298	181.28
262.749	215.26
263.201	190.99
263.652	237.11
264.103	125.46
264.554	161.87
265.005	203.13
265.457	93.9
265.908	181.28
266.359	186.14
266.809	176.43
267.26	164.29
267.711	161.87
268.162	190.99
268.613	193.42
269.064	210.41
269.514	169.15
269.965	161.87
270.415	140.02
270.866	215.26
271.316	152.16
271.767	217.69
272.217	115.75
272.668	183.71
273.118	222.55
273.568	164.29
274.019	123.03
274.469	207.98
274.919	166.72
275.369	157.01
275.819	217.69
276.269	203.13
276.719	159.44
277.169	183.71
277.619	164.29
278.069	220.12
278.518	188.56
278.968	171.57
279.418	159.44
279.867	176.43
280.317	154.58
280.767	113.32
281.216	149.73
281.666	215.26
282.115	210.41
282.564	217.69
283.014	193.42
283.463	166.72
283.912	186.14
284.361	190.99
284.811	157.01
285.26	176.43
285.709	144.87
286.158	193.42
286.607	203.13
287.056	120.6
287.505	207.98
287.953	203.13
288.402	178.86
288.851	227.4
289.3	278.37
289.748	115.75
290.197	154.58
290.646	157.01
291.094	149.73
291.543	193.42
291.991	212.84
292.439	130.31
292.888	188.56
293.336	130.31
293.784	157.01
294.233	203.13
294.681	205.56
295.129	178.86
295.577	164.29
296.025	169.15
296.473	210.41
296.921	181.28
297.369	157.01
297.817	190.99
298.264	178.86
298.712	181.28
299.16	205.56
299.608	222.55
300.055	171.57
300.503	239.54
300.95	108.47
301.398	246.82
301.845	205.56
302.293	147.3
302.74	224.97
303.187	198.27
303.635	91.48
304.082	140.02
304.529	125.46
304.976	217.69
305.423	164.29
305.87	222.55
306.317	178.86
306.764	169.15
307.211	127.88
307.658	193.42
308.105	178.86
308.552	205.56
308.998	207.98
309.445	217.69
309.892	190.99
310.338	174
310.785	161.87
311.231	207.98
311.678	159.44
312.124	205.56
312.571	198.27
313.017	142.45
313.463	178.86
313.909	174
314.356	183.71
314.802	244.39
315.248	176.43
315.694	130.31
316.14	152.16
316.586	118.18
317.032	127.88
317.478	244.39
317.923	193.42
318.369	152.16
318.815	132.74
319.261	127.88
319.706	103.61
320.152	203.13
320.597	154.58
321.043	227.4
321.488	229.83
321.934	164.29
322.379	169.15
322.824	174
323.27	193.42
323.715	181.28
324.16	144.87
324.605	120.6
325.05	178.86
325.495	135.17
325.94	140.02
326.385	176.43
326.83	161.87
327.275	137.59
327.72	200.7
328.165	171.57
328.61	176.43
329.054	137.59
329.499	232.25
329.943	190.99
330.388	115.75
330.832	178.86
331.277	207.98
331.721	164.29
332.166	181.28
332.61	195.85
333.054	123.03
333.499	193.42
333.943	147.3
334.387	178.86
334.831	198.27
335.275	193.42
335.719	176.43
336.163	186.14
336.607	205.56
337.051	147.3
337.495	135.17
337.938	195.85
338.382	157.01
338.826	203.13
339.269	178.86
339.713	183.71
340.157	171.57
340.6	186.14
341.044	207.98
341.487	178.86
341.93	176.43
342.374	157.01
342.817	222.55
343.26	256.53
343.703	186.14
344.146	178.86
344.59	181.28
345.033	135.17
345.476	169.15
345.919	207.98
346.361	147.3
346.804	183.71
347.247	171.57
347.69	210.41
348.133	210.41
348.575	169.15
349.018	108.47
349.461	171.57
349.903	195.85
350.346	178.86
350.788	123.03
351.23	176.43
351.673	271.09
352.115	176.43
352.557	198.27
353	171.57
353.442	210.41
353.884	118.18
354.326	174
354.768	234.68
355.21	161.87
355.652	200.7
356.094	174
356.536	101.18
356.978	144.87
357.419	200.7
357.861	161.87
358.303	178.86
358.744	171.57
359.186	132.74
359.627	152.16
360.069	154.58
360.51	149.73
360.952	154.58
361.393	217.69
361.834	224.97
362.276	215.26
362.717	195.85
363.158	215.26
363.599	144.87
364.04	147.3
364.481	183.71
364.922	166.72
365.363	207.98
365.804	147.3
366.245	207.98
366.686	181.28
367.126	113.32
367.567	212.84
368.008	210.41
368.448	171.57
368.889	258.95
369.33	135.17
369.77	176.43
370.21	144.87
370.651	181.28
371.091	164.29
371.531	149.73
371.972	178.86
372.412	186.14
372.852	166.72
373.292	157.01
373.732	181.28
374.172	140.02
374.612	169.15
375.052	215.26
375.492	190.99
375.932	254.1
376.372	125.46
376.811	190.99
377.251	125.46
377.691	176.43
378.13	132.74
378.57	241.96
379.009	200.7
379.449	212.84
379.888	190.99
380.328	190.99
380.767	174
381.206	152.16
381.645	157.01
382.085	188.56
382.524	127.88
382.963	227.4
383.402	169.15
383.841	200.7
384.28	164.29
384.719	149.73
385.158	142.45
385.596	227.4
386.035	224.97
386.474	186.14
386.913	137.59
387.351	207.98
387.79	74.49
388.228	205.56
388.667	140.02
389.105	195.85
389.544	152.16
389.982	258.95
390.42	190.99
390.859	132.74
391.297	161.87
391.735	188.56
392.173	132.74
392.611	210.41
393.049	212.84
393.487	171.57
393.925	115.75
394.363	154.58
394.801	161.87
395.239	222.55
395.676	171.57
396.114	178.86
396.552	195.85
396.989	258.95
397.427	217.69
397.864	212.84
398.302	178.86
398.739	224.97
399.177	181.28
399.614	186.14
400.051	181.28
400.488	123.03
400.926	125.46
401.363	198.27
401.8	89.05
402.237	96.33
402.674	203.13
403.111	115.75
403.548	174
403.985	96.33
404.421	171.57
404.858	171.57
405.295	295.36
405.732	203.13
406.168	195.85
406.605	176.43
407.041	224.97
407.478	200.7
407.914	174
408.351	181.28
408.787	224.97
409.223	193.42
409.66	174
410.096	212.84
410.532	210.41
410.968	144.87
411.404	178.86
411.84	205.56
412.276	205.56
412.712	186.14
413.148	169.15
413.584	144.87
414.02	200.7
414.455	198.27
414.891	176.43
415.327	195.85
415.762	154.58
416.198	135.17
416.633	195.85
417.069	154.58
417.504	244.39
417.94	181.28
418.375	144.87
418.81	190.99
419.245	149.73
419.681	176.43
420.116	159.44
420.551	130.31
420.986	178.86
421.421	193.42
421.856	72.06
422.291	203.13
422.726	178.86
423.16	142.45
423.595	115.75
424.03	159.44
424.464	190.99
424.899	142.45
425.334	186.14
425.768	212.84
426.203	171.57
426.637	190.99
427.071	190.99
427.506	178.86
427.94	169.15
428.374	159.44
428.809	266.24
429.243	181.28
429.677	147.3
430.111	130.31
430.545	229.83
430.979	229.83
431.413	137.59
431.847	125.46
432.28	200.7
432.714	176.43
433.148	229.83
433.582	244.39
434.015	181.28
434.449	186.14
434.882	137.59
435.316	154.58
435.749	125.46
436.183	227.4
436.616	210.41
437.049	205.56
437.483	178.86
437.916	183.71
438.349	186.14
438.782	198.27
439.215	166.72
439.648	205.56
440.081	86.62
440.514	183.71
440.947	137.59
441.38	152.16
441.813	186.14
442.245	222.55
442.678	212.84
443.111	207.98
443.543	186.14
443.976	154.58
444.408	181.28
444.841	239.54
445.273	186.14
445.705	232.25
446.138	263.81
446.57	200.7
447.002	251.67
447.434	227.4
447.867	234.68
448.299	217.69
448.731	178.86
449.163	207.98
449.595	229.83
450.026	210.41
450.458	234.68
450.89	251.67
451.322	176.43
451.754	159.44
452.185	212.84
452.617	268.66
453.048	300.22
453.48	271.09
453.911	254.1
454.343	212.84
454.774	251.67
455.205	212.84
455.637	326.92
456.068	239.54
456.499	249.25
456.93	256.53
457.361	254.1
457.792	263.81
458.223	227.4
458.654	203.13
459.085	239.54
459.516	249.25
459.947	258.95
460.378	200.7
460.808	251.67
461.239	244.39
461.669	283.23
462.1	263.81
462.531	266.24
462.961	234.68
463.391	239.54
463.822	261.38
464.252	222.55
464.682	256.53
465.113	174
465.543	232.25
465.973	246.82
466.403	280.8
466.833	200.7
467.263	261.38
467.693	263.81
468.123	229.83
468.553	254.1
468.983	222.55
469.412	147.3
469.842	205.56
470.272	266.24
470.701	176.43
471.131	288.08
471.56	212.84
471.99	183.71
472.419	256.53
472.849	195.85
473.278	195.85
473.707	198.27
474.136	227.4
474.566	254.1
474.995	183.71
475.424	120.6
475.853	207.98
476.282	186.14
476.711	190.99
477.14	251.67
477.569	224.97
477.997	193.42
478.426	169.15
478.855	149.73
479.283	261.38
479.712	210.41
480.141	229.83
480.569	178.86
480.998	249.25
481.426	212.84
481.854	198.27
482.283	195.85
482.711	166.72
483.139	212.84
483.567	212.84
483.995	200.7
484.424	174
484.852	251.67
485.28	166.72
485.708	249.25
486.135	263.81
486.563	183.71
486.991	166.72
487.419	176.43
487.847	142.45
488.274	283.23
488.702	188.56
489.129	234.68
489.557	251.67
489.984	227.4
490.412	193.42
490.839	210.41
491.266	174
491.694	227.4
492.121	229.83
492.548	234.68
492.975	207.98
493.402	244.39
493.829	166.72
494.256	176.43
494.683	178.86
495.11	239.54
495.537	178.86
495.964	193.42
496.39	166.72
496.817	181.28
497.244	261.38
497.67	169.15
498.097	227.4
498.523	212.84
498.95	171.57
499.376	203.13
499.803	176.43
500.229	222.55
500.655	210.41
501.081	166.72
501.508	157.01
501.934	203.13
502.36	195.85
502.786	212.84
503.212	234.68
503.638	205.56
504.064	176.43
504.489	207.98
504.915	186.14
505.341	178.86
505.767	164.29
506.192	161.87
506.618	244.39
507.043	118.18
507.469	144.87
507.894	144.87
508.32	190.99
508.745	154.58
509.17	183.71
509.596	227.4
510.021	161.87
510.446	224.97
510.871	212.84
511.296	220.12
511.721	113.32
512.146	210.41
512.571	205.56
512.996	200.7
513.421	186.14
513.845	164.29
514.27	207.98
514.695	222.55
515.119	212.84
515.544	190.99
515.969	171.57
516.393	174
516.817	203.13
517.242	210.41
517.666	188.56
518.09	176.43
518.515	200.7
518.939	181.28
519.363	375.46
519.787	164.29
520.211	178.86
520.635	186.14
521.059	159.44
521.483	205.56
521.907	176.43
522.331	200.7
522.754	227.4
523.178	193.42
523.602	237.11
524.025	171.57
524.449	166.72
524.872	210.41
525.296	212.84
525.719	159.44
526.143	234.68
526.566	210.41
526.989	178.86
527.412	210.41
527.836	140.02
528.259	227.4
528.682	135.17
529.105	135.17
529.528	198.27
529.951	224.97
530.374	144.87
530.796	154.58
531.219	169.15
531.642	190.99
532.065	147.3
532.487	137.59
532.91	186.14
533.332	159.44
533.755	178.86
534.177	200.7
534.6	227.4
535.022	205.56
535.444	220.12
535.867	215.26
536.289	195.85
536.711	178.86
537.133	224.97
537.555	237.11
537.977	256.53
538.399	261.38
538.821	210.41
539.243	195.85
539.665	256.53
540.086	210.41
540.508	263.81
540.93	188.56
541.351	249.25
541.773	210.41
542.195	164.29
542.616	210.41
543.037	234.68
543.459	224.97
543.88	198.27
544.301	220.12
544.723	241.96
545.144	314.78
545.565	249.25
545.986	302.64
546.407	166.72
546.828	297.79
547.249	159.44
547.67	205.56
548.091	212.84
548.512	254.1
548.932	220.12
549.353	239.54
549.774	239.54
550.194	142.45
550.615	234.68
551.035	142.45
551.456	198.27
551.876	144.87
552.296	249.25
552.717	161.87
553.137	254.1
553.557	195.85
553.977	205.56
554.397	181.28
554.817	166.72
555.237	137.59
555.657	234.68
556.077	241.96
556.497	249.25
556.917	176.43
557.337	178.86
557.756	195.85
558.176	174
558.596	241.96
559.015	227.4
559.435	200.7
559.854	140.02
560.274	186.14
560.693	205.56
561.112	200.7
561.532	154.58
561.951	203.13
562.37	256.53
562.789	159.44
563.208	181.28
563.627	222.55
564.046	215.26
564.465	237.11
564.884	140.02
565.303	157.01
565.722	147.3
566.14	232.25
566.559	178.86
566.978	220.12
567.396	144.87
567.815	186.14
568.233	271.09
568.652	227.4
569.07	140.02
569.489	207.98
569.907	166.72
570.325	237.11
570.743	176.43
571.161	166.72
571.58	171.57
571.998	157.01
572.416	227.4
572.833	190.99
573.251	125.46
573.669	183.71
574.087	198.27
574.505	157.01
574.922	207.98
575.34	157.01
575.758	193.42
576.175	188.56
576.593	215.26
577.01	198.27
577.428	275.94
577.845	1589.07
578.262	356.04
578.68	195.85
579.097	203.13
579.514	147.3
579.931	203.13
580.348	188.56
580.765	174
581.182	263.81
581.599	176.43
582.016	169.15
582.433	224.97
582.849	166.72
583.266	237.11
583.683	220.12
584.099	125.46
584.516	200.7
584.933	203.13
585.349	176.43
585.765	212.84
586.182	205.56
586.598	135.17
587.014	200.7
587.431	207.98
587.847	258.95
588.263	244.39
588.679	207.98
589.095	251.67
589.511	193.42
589.927	217.69
590.343	164.29
590.759	186.14
591.174	166.72
591.59	183.71
592.006	220.12
592.421	161.87
592.837	193.42
593.252	244.39
593.668	174
594.083	183.71
594.499	203.13
594.914	195.85
595.329	244.39
595.745	166.72
596.16	224.97
596.575	251.67
596.99	193.42
597.405	193.42
597.82	152.16
598.235	178.86
598.65	193.42
599.065	135.17
599.479	181.28
599.894	67.2
600.309	200.7
600.724	188.56
601.138	144.87
601.553	159.44
601.967	232.25
602.382	186.14
602.796	181.28
603.21	178.86
603.625	183.71
604.039	154.58
604.453	239.54
604.867	190.99
605.281	222.55
605.695	295.36
606.109	195.85
606.523	159.44
606.937	174
607.351	295.36
607.765	246.82
608.178	193.42
608.592	142.45
609.006	193.42
609.419	127.88
609.833	164.29
610.246	227.4
610.66	205.56
611.073	261.38
611.487	244.39
611.9	246.82
612.313	203.13
612.726	178.86
613.139	188.56
613.553	193.42
613.966	193.42
614.379	210.41
614.792	207.98
615.204	188.56
615.617	166.72
616.03	166.72
616.443	203.13
616.856	232.25
617.268	164.29
617.681	249.25
618.093	193.42
618.506	205.56
618.918	207.98
619.331	198.27
619.743	244.39
620.155	171.57
620.568	188.56
620.98	212.84
621.392	215.26
621.804	159.44
622.216	149.73
622.628	237.11
623.04	222.55
623.452	278.37
623.864	275.94
624.276	186.14
624.687	190.99
625.099	152.16
625.511	198.27
625.922	210.41
626.334	171.57
626.745	222.55
627.157	198.27
627.568	183.71
627.979	123.03
628.391	159.44
628.802	234.68
629.213	215.26
629.624	144.87
630.035	183.71
630.446	140.02
630.857	140.02
631.268	222.55
631.679	183.71
632.09	193.42
632.501	200.7
632.912	190.99
633.322	254.1
633.733	147.3
634.144	110.89
634.554	203.13
634.965	210.41
635.375	178.86
635.785	207.98
636.196	183.71
636.606	171.57
637.016	215.26
637.427	215.26
637.837	178.86
638.247	176.43
638.657	137.59
639.067	137.59
639.477	207.98
639.887	227.4
640.297	149.73
640.706	193.42
641.116	157.01
641.526	200.7
641.935	193.42
642.345	210.41
642.755	205.56
643.164	205.56
643.573	169.15
643.983	154.58
644.392	190.99
644.801	157.01
645.211	154.58
645.62	224.97
646.029	212.84
646.438	186.14
646.847	154.58
647.256	190.99
647.665	278.37
648.074	212.84
648.483	215.26
648.892	258.95
649.3	210.41
649.709	178.86
650.118	115.75
650.526	227.4
650.935	241.96
651.343	207.98
651.752	188.56
652.16	237.11
652.568	164.29
652.977	186.14
653.385	147.3
653.793	181.28
654.201	205.56
654.609	258.95
655.017	183.71
655.425	222.55
655.833	307.5
656.241	210.41
656.649	174
657.057	220.12
657.464	210.41
657.872	157.01
658.28	147.3
658.687	174
659.095	195.85
659.502	207.98
659.91	198.27
660.317	232.25
660.724	164.29
661.132	137.59
661.539	176.43
661.946	123.03
662.353	108.47
662.76	220.12
663.167	198.27
663.574	188.56
663.981	203.13
664.388	205.56
664.795	127.88
665.202	159.44
665.608	224.97
666.015	166.72
666.422	193.42
666.828	186.14
667.235	207.98
667.641	186.14
668.047	198.27
668.454	244.39
668.86	140.02
669.266	178.86
669.673	190.99
670.079	207.98
670.485	132.74
670.891	130.31
671.297	224.97
671.703	227.4
672.109	164.29
672.515	239.54
672.92	144.87
673.326	174
673.732	183.71
674.138	222.55
674.543	147.3
674.949	207.98
675.354	161.87
675.76	200.7
676.165	186.14
676.57	169.15
676.976	154.58
677.381	210.41
677.786	244.39
678.191	200.7
678.596	178.86
679.001	161.87
679.406	212.84
679.811	157.01
680.216	215.26
680.621	261.38
681.026	183.71
681.43	106.04
681.835	181.28
682.24	200.7
682.644	186.14
683.049	224.97
683.453	193.42
683.858	195.85
684.262	181.28
684.667	176.43
685.071	188.56
685.475	222.55
685.879	154.58
686.283	186.14
686.687	188.56
687.091	198.27
687.495	178.86
687.899	200.7
688.303	193.42
688.707	171.57
689.111	200.7
689.514	152.16
689.918	161.87
690.322	174
690.725	178.86
691.129	181.28
691.532	132.74
691.936	190.99
692.339	198.27
692.742	164.29
693.146	142.45
693.549	224.97
693.952	171.57
694.355	142.45
694.758	239.54
695.161	188.56
695.564	198.27
695.967	249.25
696.37	157.01
696.773	200.7
697.175	251.67
697.578	232.25
697.981	241.96
698.383	193.42
698.786	217.69
699.188	258.95
699.591	203.13
699.993	188.56
700.395	256.53
700.798	137.59
701.2	271.09
701.602	152.16
702.004	198.27
702.406	198.27
702.808	181.28
703.21	198.27
703.612	271.09
704.014	190.99
704.416	159.44
704.818	273.52
705.219	152.16
705.621	190.99
706.023	258.95
706.424	178.86
706.826	249.25
707.227	263.81
707.629	302.64
708.03	307.5
708.431	280.8
708.832	241.96
709.234	186.14
709.635	237.11
710.036	263.81
710.437	251.67
710.838	234.68
711.239	229.83
711.64	280.8
712.041	244.39
712.441	200.7
712.842	309.93
713.243	254.1
713.643	212.84
714.044	292.94
714.445	234.68
714.845	295.36
715.246	329.34
715.646	365.75
716.046	334.2
716.447	324.49
716.847	312.35
717.247	402.16
717.647	370.61
718.047	382.74
718.447	370.61
718.847	334.2
719.247	353.62
719.647	385.17
720.047	334.2
720.446	377.89
720.846	346.33
721.246	448.28
721.645	394.88
722.045	309.93
722.444	392.45
722.844	409.44
723.243	419.15
723.643	348.76
724.042	424.01
724.441	407.01
724.84	387.6
725.24	472.55
725.639	433.71
726.038	511.39
726.437	455.56
726.836	467.7
727.234	494.39
727.633	489.54
728.032	499.25
728.431	601.19
728.83	610.9
729.228	538.08
729.627	574.49
730.025	707.99
730.424	751.68
730.822	785.66
731.22	688.57
731.619	795.37
732.017	778.38
732.415	880.32
732.813	955.57
733.212	1042.95
733.61	1096.35
734.008	1319.65
734.406	1356.06
734.803	1295.38
735.201	1186.15
735.599	1263.82
735.997	1343.92
736.395	1397.32
736.792	1564.8
737.19	1984.71
737.587	2076.94
737.985	2450.74
738.382	2533.26
738.78	2674.04
739.177	2353.65
739.574	2205.59
739.971	2040.54
740.369	2011.41
740.766	2268.69
741.163	2620.64
741.56	3249.29
741.957	3652.21
742.354	4178.92
742.751	4244.45
743.147	4188.63
743.544	3647.36
743.941	3358.52
744.338	2972.59
744.734	3030.84
745.131	3542.99
745.527	4176.49
745.924	5443.5
746.32	6239.63
746.716	6982.36
747.113	6817.31
747.509	6695.95
747.905	6018.75
748.301	5137.67
748.697	4657.08
749.093	4848.83
749.489	5504.18
749.885	6793.04
750.281	8589.18
750.677	9977.55
751.073	11033.39
751.468	11351.36
751.864	10438.72
752.26	8965.4
752.655	7902.28
753.051	7183.82
753.446	7256.64
753.842	8125.58
754.237	10043.09
754.632	12421.76
755.028	14239.75
755.423	15516.47
755.818	15727.64
756.213	14980.06
756.608	12744.59
757.003	10751.84
757.398	9470.26
757.793	8870.74
758.188	9438.71
758.583	11606.22
758.977	14181.5
759.372	17353.88
759.767	19846.64
760.161	21045.69
760.556	20528.69
760.95	18380.6
761.345	15912.11
761.739	13560.13
762.133	12455.75
762.527	13239.74
762.922	15679.1
763.316	19463.14
763.71	23485.04
764.104	27388.02
764.498	29361.35
764.892	29956.02
765.286	27577.34
765.68	24074.86
766.073	20506.84
766.467	17344.17
766.861	16567.46
767.255	18278.65
767.648	22375.8
768.042	26815.19
768.435	32448.78
768.829	36395.44
769.222	37662.45
769.615	37422.15
770.008	33808.02
770.402	28633.18
770.795	24344.28
771.188	21390.35
771.581	20103.92
771.974	20968.01
772.367	24589.43
772.76	29560.38
773.153	34123.56
773.545	37264.38
773.938	39211.02
774.331	38611.49
774.724	35021.63
775.116	31038.56
775.509	26477.81
775.901	23883.11
776.294	22907.36
776.686	25424.39
777.078	29946.31
777.471	36451.26
777.863	43664.97
778.255	49495.16
778.647	51808.3
779.039	51599.56
779.431	46898.03
779.823	40497.44
780.215	35210.95
780.607	29657.47
780.999	28222.98
781.39	29499.7
781.782	33832.29
782.174	40747.45
782.565	47900.47
782.957	53313.18
783.348	56155.45
783.74	54536.5
784.131	51012.17
784.522	46412.58
784.914	39116.35
785.305	32829.85
785.696	29072.51
786.087	28494.83
786.478	30638.07
786.869	35393
787.26	41463.48
787.651	46094.62
788.042	48990.29
788.433	48667.47
788.823	46087.34
789.214	41130.95
789.605	34220.65
789.995	28691.44
790.386	24337
790.776	22739.89
791.167	23540.87
791.557	28023.95
791.948	33548.31
792.338	39786.27
792.728	45310.63
793.118	47650.47
793.508	47245.12
793.898	44533.91
794.288	39635.78
794.678	33686.66
795.068	28261.82
795.458	24805.45
795.848	23890.39
796.238	25499.64
796.627	29698.73
797.017	36157.57
797.406	41990.19
797.796	45232.95
798.185	47584.93
798.575	46589.77
798.964	43662.54
799.354	38747.42
799.743	32536.16
800.132	26737.52
800.521	24057.87
800.91	23497.18
801.299	25400.12
801.688	30392.92
802.077	35176.97
802.466	40997.45
802.855	44720.81
803.244	44813.05
803.633	44160.12
804.021	39810.54
804.41	34414.83
804.799	28409.88
805.187	22883.09
805.576	19873.34
805.964	18378.17
806.352	19215.56
806.741	23036.01
807.129	27531.22
807.517	32485.18
807.905	36463.4
808.293	37269.24
808.681	37004.67
809.069	34150.26
809.457	30963.32
809.845	25409.83
810.233	21077.24
810.621	18329.62
811.009	16953.39
811.396	18463.12
811.784	21761.72
812.171	26208.39
812.559	31747.31
812.946	33936.66
813.334	36805.64
813.721	36698.84
814.108	33167.23
814.496	29480.28
814.883	24630.69
815.27	20545.68
815.657	17072.32
816.044	15086.85
816.431	15310.16
816.818	17671.85
817.205	20997.14
817.592	25769.06
817.979	29509.41
818.365	31956.05
818.752	32016.73
819.139	30009.42
819.525	27502.1
819.912	23441.35
820.298	18972.84
820.685	14938.79
821.071	12387.78
821.457	11429.03
821.843	11322.23
822.23	12977.6
822.616	15506.76
823.002	17866.02
823.388	20077.22
823.774	21310.25
824.16	21103.94
824.546	20152.47
824.931	17749.52
825.317	14773.74
825.703	11875.64
826.089	9545.51
826.474	8115.87
826.86	7705.67
827.245	8244.52
827.631	9805.22
828.016	11783.41
828.401	13581.98
828.787	15696.09
829.172	16628.14
829.557	16620.86
829.942	15378.12
830.327	13579.55
830.712	11598.94
831.097	9120.74
831.482	7438.68
831.867	6127.98
832.252	5635.25
832.636	6203.22
833.021	6914.4
833.406	8378.01
833.79	10135.32
834.175	11387.77
834.559	12077.1
834.944	12239.72
835.328	11426.6
835.713	10324.64
836.097	8589.18
836.481	6972.65
836.865	5613.41
837.249	4630.38
837.633	3967.75
838.017	3873.09
838.401	4479.89
838.785	5232.33
839.169	6273.61
839.553	6846.44
839.937	7458.1
840.32	7606.16
840.704	7263.92
841.087	6562.45
841.471	5482.34
841.854	4674.07
842.238	3897.36
842.621	3028.41
843.004	2424.04
843.388	2375.49
843.771	2557.53
844.154	3045.41
844.537	3715.32
844.92	4465.33
845.303	4805.14
845.686	5227.48
846.069	5130.39
846.452	5110.97
846.834	4462.9
847.217	3899.79
847.6	3341.53
847.982	2712.88
848.365	2144.91
848.748	1817.23
849.13	1812.38
849.512	1936.16
849.895	2331.8
850.277	2664.33
850.659	3030.84
851.041	3542.99
851.423	3860.95
851.806	3705.61
852.188	3708.04
852.57	3317.25
852.951	2858.51
853.333	2351.22
853.715	1938.59
854.097	1584.22
854.479	1322.08
854.86	1305.09
855.242	1462.86
855.623	1542.95
856.005	1800.24
856.386	1999.27
856.768	2198.3
857.149	2275.98
857.53	2499.28
857.911	2188.6
858.292	2050.24
858.674	1907.04
859.055	1576.94
859.436	1254.12
859.817	1001.68
860.197	843.91
860.578	749.25
860.959	771.1
861.34	960.42
861.72	931.29
862.101	1159.45
862.482	1220.13
862.862	1331.79
863.243	1411.88
863.623	1479.85
864.003	1365.77
864.384	1157.03
864.764	1118.19
865.144	994.4
865.524	768.67
865.904	618.18
866.284	620.61
866.664	627.89
867.044	569.64
867.424	640.03
867.804	766.24
868.183	865.76
868.563	875.47
868.943	941
869.322	907.02
869.702	899.74
870.081	807.51
870.461	761.39
870.84	661.87
871.22	572.07
871.599	470.12
871.978	441
872.357	365.75
872.736	380.32
873.115	428.86
873.494	428.86
873.873	421.58
874.252	467.7
874.631	477.4
875.01	618.18
875.388	523.52
875.767	477.4
876.146	462.84
876.524	404.59
876.903	373.03
877.281	341.48
877.66	314.78
878.038	297.79
878.416	307.5
878.794	295.36
879.173	297.79
879.551	307.5
879.929	322.06
880.307	329.34
880.685	353.62
881.063	300.22
881.441	331.77
881.818	280.8
882.196	307.5
882.574	312.35
882.951	249.25
883.329	263.81
883.707	312.35
884.084	241.96
884.461	241.96
884.839	239.54
885.216	251.67
885.593	261.38
885.971	288.08
886.348	278.37
886.725	266.24
887.102	222.55
887.479	222.55
887.856	222.55
888.233	297.79
888.609	224.97
888.986	183.71
889.363	200.7
889.74	224.97
890.116	227.4
890.493	174
890.869	249.25
891.246	232.25
891.622	198.27
891.998	212.84
892.375	207.98
892.751	215.26
893.127	222.55
893.503	232.25
893.879	195.85
894.255	203.13
894.631	220.12
895.007	224.97
895.383	215.26
895.759	258.95
896.134	186.14
896.51	188.56
896.886	178.86
897.261	224.97
897.637	174
898.012	176.43
898.388	212.84
898.763	174
899.138	110.89
899.514	161.87
899.889	157.01
900.264	198.27
900.639	266.24
901.014	144.87
901.389	193.42
901.764	198.27
902.139	183.71
902.513	169.15
902.888	110.89
903.263	79.34
903.638	195.85
904.012	203.13
904.387	164.29
904.761	181.28
905.136	181.28
905.51	174
905.884	159.44
906.259	186.14
906.633	166.72
907.007	181.28
907.381	154.58
907.755	120.6
908.129	57.49
908.503	183.71
908.877	152.16
909.251	193.42
909.624	110.89
909.998	161.87
910.372	171.57
910.745	142.45
911.119	186.14
911.492	93.9
911.866	157.01
912.239	120.6
912.612	195.85
912.986	161.87
913.359	142.45
913.732	159.44
914.105	135.17
914.478	125.46
914.851	164.29
915.224	212.84
915.597	144.87
915.97	193.42
916.343	135.17
916.715	154.58
917.088	169.15
917.461	118.18
917.833	130.31
918.206	249.25
918.578	217.69
918.951	135.17
919.323	152.16
919.695	164.29
920.067	157.01
920.44	130.31
920.812	115.75
921.184	166.72
921.556	227.4
921.928	132.74
922.3	142.45
922.672	166.72
923.043	147.3
923.415	188.56
923.787	164.29
924.158	142.45
924.53	174
924.901	161.87
925.273	176.43
925.644	142.45
926.016	164.29
926.387	137.59
926.758	198.27
927.129	171.57
927.5	96.33
927.872	166.72
928.243	157.01
928.613	115.75
928.984	217.69
929.355	212.84
929.726	103.61
930.097	171.57
930.467	154.58
930.838	232.25
931.209	135.17
931.579	224.97
931.95	186.14
932.32	215.26
932.69	203.13
933.061	176.43
933.431	186.14
933.801	190.99
934.171	120.6
934.541	181.28
934.911	181.28
935.281	125.46
935.651	186.14
936.021	140.02
936.391	186.14
936.761	205.56
937.13	135.17
937.5	164.29
937.87	186.14
938.239	154.58
938.609	229.83
938.978	127.88
939.347	123.03
939.717	140.02
940.086	198.27
940.455	198.27
940.824	147.3
941.193	207.98
941.562	205.56
941.931	190.99
942.3	217.69
942.669	144.87
943.038	161.87
943.407	183.71
943.775	154.58
944.144	157.01
944.513	118.18
944.881	176.43
945.25	227.4
945.618	171.57
945.986	132.74
946.355	157.01
946.723	198.27
947.091	222.55
947.459	178.86
947.827	174
948.195	174
948.563	205.56
948.931	181.28
949.299	186.14
949.667	171.57
950.035	164.29
950.402	217.69
950.77	195.85
951.138	198.27
951.505	142.45
951.873	215.26
952.24	140.02
952.607	96.33
952.975	110.89
953.342	186.14
953.709	210.41
954.076	118.18
954.443	106.04
954.81	186.14
955.177	220.12
955.544	186.14
955.911	186.14
956.278	144.87
956.645	188.56
957.012	190.99
957.378	157.01
957.745	127.88
958.111	174
958.478	186.14
958.844	147.3
959.211	164.29
959.577	195.85
959.943	217.69
960.309	207.98
960.675	118.18
961.042	127.88
961.408	147.3
961.774	86.62
962.139	188.56
962.505	157.01
962.871	157.01
963.237	118.18
963.603	224.97
963.968	115.75
964.334	232.25
964.699	159.44
965.065	200.7
965.43	127.88
965.796	98.76
966.161	161.87
966.526	188.56
966.891	254.1
967.256	137.59
967.622	166.72
967.987	171.57
968.352	142.45
968.716	137.59
969.081	135.17
969.446	108.47
969.811	174
970.176	74.49
970.54	220.12
970.905	159.44
971.269	164.29
971.634	137.59
971.998	98.76
972.363	166.72
972.727	176.43
973.091	210.41
973.455	183.71
973.819	144.87
974.183	159.44
974.547	195.85
974.911	144.87
975.275	183.71
975.639	195.85
976.003	176.43
976.367	203.13
976.73	76.91
977.094	188.56
977.458	118.18
977.821	217.69
978.185	188.56
978.548	164.29
978.911	161.87
979.275	118.18
979.638	176.43
980.001	125.46
980.364	164.29
980.727	198.27
981.09	241.96
981.453	152.16
981.816	123.03
982.179	198.27
982.542	120.6
982.905	93.9
983.267	130.31
983.63	212.84
983.992	183.71
984.355	232.25
984.717	159.44
985.08	169.15
985.442	166.72
985.804	159.44
986.167	195.85
986.529	210.41
986.891	123.03
987.253	212.84
987.615	142.45
987.977	188.56
988.339	159.44
988.701	183.71
989.062	154.58
989.424	190.99
989.786	140.02
990.147	215.26
990.509	188.56
990.87	157.01
991.232	176.43
991.593	157.01
991.955	195.85
992.316	205.56
992.677	152.16
993.038	164.29
993.399	113.32
993.76	193.42
994.121	135.17
994.482	157.01
994.843	227.4
995.204	198.27
995.565	137.59
995.926	227.4
996.286	176.43
996.647	140.02
997.007	159.44
997.368	142.45
997.728	183.71
998.089	186.14
998.449	207.98
998.809	149.73
999.169	174
999.53	183.71
999.89	171.57
1000.25	193.42
1000.61	205.56
1000.97	169.15
1001.329	169.15
1001.689	96.33
1002.049	178.86
1002.409	132.74
1002.768	152.16
1003.128	144.87
1003.487	157.01
1003.847	157.01
1004.206	166.72
1004.566	183.71
1004.925	140.02
1005.284	207.98
1005.643	195.85
1006.003	137.59
1006.362	271.09
1006.721	217.69
1007.08	154.58
1007.438	178.86
1007.797	118.18
1008.156	207.98
1008.515	178.86
1008.874	222.55
1009.232	161.87
1009.591	157.01
1009.949	176.43
1010.308	174
1010.666	207.98
1011.024	149.73
1011.383	93.9
1011.741	195.85
1012.099	106.04
1012.457	127.88
1012.815	110.89
1013.173	188.56
1013.531	183.71
1013.889	198.27
1014.247	193.42
1014.605	176.43
1014.962	171.57
1015.32	144.87
1015.678	176.43
1016.035	188.56
1016.393	205.56
1016.75	142.45
1017.107	157.01
1017.465	127.88
1017.822	144.87
1018.179	256.53
1018.536	195.85
1018.894	166.72
1019.251	130.31
1019.608	157.01
1019.964	193.42
1020.321	142.45
1020.678	178.86
1021.035	169.15
1021.392	96.33
1021.748	152.16
1022.105	161.87
1022.461	176.43
1022.818	166.72
1023.174	166.72
1023.531	178.86
1023.887	169.15
1024.243	125.46
1024.599	135.17
1024.955	152.16
1025.311	183.71
1025.667	222.55
1026.023	106.04
1026.379	113.32
1026.735	174
1027.091	205.56
1027.447	222.55
