189.514	188.41
189.973	188.41
190.431	188.41
190.889	6.37
191.348	-56.74
191.806	37.93
192.264	59.77
192.722	69.48
193.18	-39.75
193.638	-13.05
194.096	-85.86
194.554	-15.47
195.012	-42.17
195.47	-10.62
195.928	-66.45
196.385	67.05
196.843	3.94
197.301	64.62
197.758	33.07
198.216	-51.88
198.674	8.8
199.131	18.51
199.589	67.05
200.046	35.5
200.503	81.62
200.961	130.16
201.418	81.62
201.875	81.62
202.332	96.18
202.79	93.75
203.247	76.76
203.704	142.3
204.161	101.03
204.618	178.7
205.075	132.59
205.532	185.99
205.989	195.69
206.445	234.53
206.902	164.14
207.359	202.98
207.816	173.85
208.272	190.84
208.729	115.6
209.185	164.14
209.642	130.16
210.098	195.69
210.555	193.27
211.011	193.27
211.467	232.1
211.924	190.84
212.38	188.41
212.836	171.42
213.292	125.31
213.748	152
214.204	166.57
214.66	181.13
215.116	198.12
215.572	149.58
216.028	113.17
216.484	161.71
216.94	236.96
217.396	195.69
217.851	142.3
218.307	139.87
218.763	147.15
219.218	198.12
219.674	193.27
220.129	139.87
220.585	169
221.04	132.59
221.496	152
221.951	161.71
222.406	144.72
222.861	159.29
223.317	125.31
223.772	84.04
224.227	181.13
224.682	190.84
225.137	178.7
225.592	130.16
226.047	149.58
226.502	195.69
226.957	210.26
227.411	224.82
227.866	185.99
228.321	181.13
228.776	152
229.23	154.43
229.685	152
230.139	127.73
230.594	171.42
231.048	169
231.503	159.29
231.957	84.04
232.411	86.47
232.865	176.28
233.32	154.43
233.774	122.88
234.228	161.71
234.682	181.13
235.136	149.58
235.59	130.16
236.044	152
236.498	166.57
236.952	202.98
237.406	137.44
237.86	171.42
238.313	113.17
238.767	144.72
239.221	103.46
239.674	171.42
240.128	139.87
240.581	142.3
241.035	176.28
241.488	156.86
241.942	176.28
242.395	190.84
242.848	50.06
243.301	64.62
243.755	110.74
244.208	122.88
244.661	205.4
245.114	200.55
245.567	198.12
246.02	200.55
246.473	88.9
246.926	178.7
247.379	139.87
247.832	110.74
248.284	130.16
248.737	122.88
249.19	135.01
249.642	190.84
250.095	164.14
250.547	198.12
251	236.96
251.452	91.32
251.905	108.31
252.357	183.56
252.81	169
253.262	181.13
253.714	207.83
254.166	130.16
254.618	154.43
255.07	84.04
255.523	120.45
255.975	227.25
256.427	173.85
256.878	161.71
257.33	120.45
257.782	144.72
258.234	164.14
258.686	207.83
259.137	195.69
259.589	88.9
260.041	122.88
260.492	135.01
260.944	156.86
261.395	253.95
261.847	236.96
262.298	144.72
262.749	154.43
263.201	156.86
263.652	181.13
264.103	147.15
264.554	118.02
265.005	149.58
265.457	154.43
265.908	193.27
266.359	139.87
266.809	207.83
267.26	147.15
267.711	217.54
268.162	161.71
268.613	166.57
269.064	249.09
269.514	202.98
269.965	144.72
270.415	156.86
270.866	171.42
271.316	132.59
271.767	190.84
272.217	169
272.668	173.85
273.118	154.43
273.568	200.55
274.019	232.1
274.469	202.98
274.919	152
275.369	154.43
275.819	154.43
276.269	154.43
276.719	93.75
277.169	147.15
277.619	103.46
278.069	171.42
278.518	161.71
278.968	139.87
279.418	161.71
279.867	171.42
280.317	190.84
280.767	130.16
281.216	173.85
281.666	139.87
282.115	154.43
282.564	166.57
283.014	169
283.463	159.29
283.912	120.45
284.361	122.88
284.811	156.86
285.26	67.05
285.709	185.99
286.158	115.6
286.607	144.72
287.056	164.14
287.505	161.71
287.953	205.4
288.402	183.56
288.851	193.27
289.3	130.16
289.748	166.57
290.197	198.12
290.646	188.41
291.094	115.6
291.543	181.13
291.991	176.28
292.439	144.72
292.888	166.57
293.336	169
293.784	161.71
294.233	181.13
294.681	207.83
295.129	113.17
295.577	181.13
296.025	127.73
296.473	93.75
296.921	227.25
297.369	207.83
297.817	144.72
298.264	178.7
298.712	185.99
299.16	222.39
299.608	154.43
300.055	135.01
300.503	176.28
300.95	156.86
301.398	108.31
301.845	147.15
302.293	205.4
302.74	181.13
303.187	210.26
303.635	215.11
304.082	132.59
304.529	137.44
304.976	122.88
305.423	122.88
305.87	113.17
306.317	98.61
306.764	159.29
307.211	244.24
307.658	113.17
308.105	202.98
308.552	139.87
308.998	169
309.445	198.12
309.892	164.14
310.338	147.15
310.785	224.82
311.231	76.76
311.678	222.39
312.124	169
312.571	147.15
313.017	139.87
313.463	149.58
313.909	227.25
314.356	139.87
314.802	159.29
315.248	195.69
315.694	166.57
316.14	147.15
316.586	37.93
317.032	132.59
317.478	152
317.923	169
318.369	176.28
318.815	227.25
319.261	198.12
319.706	224.82
320.152	164.14
320.597	161.71
321.043	164.14
321.488	222.39
321.934	176.28
322.379	193.27
322.824	156.86
323.27	185.99
323.715	149.58
324.16	169
324.605	176.28
325.05	110.74
325.495	171.42
325.94	142.3
326.385	159.29
326.83	212.69
327.275	161.71
327.72	137.44
328.165	125.31
328.61	176.28
329.054	249.09
329.499	166.57
329.943	159.29
330.388	166.57
330.832	127.73
331.277	217.54
331.721	147.15
332.166	169
332.61	135.01
333.054	212.69
333.499	152
333.943	93.75
334.387	190.84
334.831	144.72
335.275	142.3
335.719	149.58
336.163	156.86
336.607	108.31
337.051	115.6
337.495	142.3
337.938	154.43
338.382	101.03
338.826	232.1
339.269	91.32
339.713	169
340.157	144.72
340.6	253.95
341.044	156.86
341.487	103.46
341.93	178.7
342.374	185.99
342.817	188.41
343.26	122.88
343.703	202.98
344.146	159.29
344.59	154.43
345.033	185.99
345.476	285.5
345.919	171.42
346.361	188.41
346.804	81.62
347.247	193.27
347.69	224.82
348.133	122.88
348.575	113.17
349.018	200.55
349.461	144.72
349.903	198.12
350.346	156.86
350.788	176.28
351.23	202.98
351.673	212.69
352.115	122.88
352.557	122.88
353	219.97
353.442	176.28
353.884	149.58
354.326	120.45
354.768	215.11
355.21	142.3
355.652	122.88
356.094	171.42
356.536	144.72
356.978	164.14
357.419	183.56
357.861	135.01
358.303	202.98
358.744	161.71
359.186	173.85
359.627	183.56
360.069	198.12
360.51	84.04
360.952	144.72
361.393	139.87
361.834	147.15
362.276	229.68
362.717	118.02
363.158	127.73
363.599	169
364.04	88.9
364.481	142.3
364.922	215.11
365.363	188.41
365.804	173.85
366.245	176.28
366.686	62.2
367.126	222.39
367.567	229.68
368.008	217.54
368.448	122.88
368.889	159.29
369.33	159.29
369.77	161.71
370.21	161.71
370.651	159.29
371.091	149.58
371.531	166.57
371.972	147.15
372.412	176.28
372.852	217.54
373.292	132.59
373.732	144.72
374.172	159.29
374.612	222.39
375.052	258.8
375.492	173.85
375.932	193.27
376.372	236.96
376.811	152
377.251	137.44
377.691	120.45
378.13	178.7
378.57	173.85
379.009	127.73
379.449	173.85
379.888	149.58
380.328	132.59
380.767	188.41
381.206	249.09
381.645	154.43
382.085	161.71
382.524	173.85
382.963	154.43
383.402	171.42
383.841	200.55
384.28	200.55
384.719	149.58
385.158	173.85
385.596	113.17
386.035	154.43
386.474	122.88
386.913	190.84
387.351	161.71
387.79	181.13
388.228	171.42
388.667	122.88
389.105	118.02
389.544	207.83
389.982	173.85
390.42	108.31
390.859	198.12
391.297	86.47
391.735	142.3
392.173	152
392.611	161.71
393.049	198.12
393.487	202.98
393.925	98.61
394.363	161.71
394.801	125.31
395.239	185.99
395.676	188.41
396.114	110.74
396.552	159.29
396.989	127.73
397.427	115.6
397.864	159.29
398.302	183.56
398.739	178.7
399.177	86.47
399.614	135.01
400.051	144.72
400.488	79.19
400.926	98.61
401.363	67.05
401.8	144.72
402.237	173.85
402.674	125.31
403.111	115.6
403.548	256.38
403.985	195.69
404.421	156.86
404.858	210.26
405.295	215.11
405.732	193.27
406.168	120.45
406.605	137.44
407.041	152
407.478	127.73
407.914	181.13
408.351	161.71
408.787	185.99
409.223	139.87
409.66	142.3
410.096	164.14
410.532	125.31
410.968	164.14
411.404	64.62
411.84	176.28
412.276	176.28
412.712	154.43
413.148	147.15
413.584	118.02
414.02	154.43
414.455	139.87
414.891	115.6
415.327	159.29
415.762	181.13
416.198	156.86
416.633	154.43
417.069	236.96
417.504	130.16
417.94	67.05
418.375	144.72
418.81	164.14
419.245	154.43
419.681	159.29
420.116	137.44
420.551	171.42
420.986	181.13
421.421	122.88
421.856	188.41
422.291	98.61
422.726	130.16
423.16	200.55
423.595	108.31
424.03	193.27
424.464	152
424.899	198.12
425.334	173.85
425.768	45.21
426.203	195.69
426.637	166.57
427.071	127.73
427.506	159.29
427.94	125.31
428.374	181.13
428.809	166.57
429.243	91.32
429.677	164.14
430.111	185.99
430.545	130.16
430.979	183.56
431.413	142.3
431.847	222.39
432.28	166.57
432.714	207.83
433.148	222.39
433.582	135.01
434.015	198.12
434.449	142.3
434.882	229.68
435.316	205.4
435.749	219.97
436.183	185.99
436.616	113.17
437.049	171.42
437.483	159.29
437.916	154.43
438.349	178.7
438.782	171.42
439.215	149.58
439.648	152
440.081	166.57
440.514	207.83
440.947	205.4
441.38	224.82
441.813	122.88
442.245	200.55
442.678	222.39
443.111	234.53
443.543	219.97
443.976	202.98
444.408	154.43
444.841	183.56
445.273	212.69
445.705	229.68
446.138	234.53
446.57	222.39
447.002	193.27
447.434	263.66
447.867	202.98
448.299	183.56
448.731	224.82
449.163	205.4
449.595	178.7
450.026	195.69
450.458	212.69
450.89	270.94
451.322	244.24
451.754	251.52
452.185	300.07
452.617	239.38
453.048	317.06
453.48	258.8
453.911	297.64
454.343	258.8
454.774	195.69
455.205	239.38
455.637	312.2
456.068	258.8
456.499	326.76
456.93	229.68
457.361	200.55
457.792	217.54
458.223	292.78
458.654	285.5
459.085	280.65
459.516	253.95
459.947	268.51
460.378	244.24
460.808	283.07
461.239	178.7
461.669	275.79
462.1	256.38
462.531	353.46
462.961	251.52
463.391	290.36
463.822	176.28
464.252	236.96
464.682	253.95
465.113	185.99
465.543	278.22
465.973	229.68
466.403	292.78
466.833	321.91
467.263	278.22
467.693	280.65
468.123	273.37
468.553	251.52
468.983	246.67
469.412	234.53
469.842	324.34
470.272	244.24
470.701	202.98
471.131	176.28
471.56	261.23
471.99	164.14
472.419	256.38
472.849	210.26
473.278	212.69
473.707	263.66
474.136	275.79
474.566	258.8
474.995	217.54
475.424	205.4
475.853	283.07
476.282	212.69
476.711	266.08
477.14	234.53
477.569	202.98
477.997	222.39
478.426	266.08
478.855	200.55
479.283	169
479.712	224.82
480.141	169
480.569	283.07
480.998	224.82
481.426	185.99
481.854	195.69
482.283	222.39
482.711	181.13
483.139	266.08
483.567	135.01
483.995	202.98
484.424	268.51
484.852	273.37
485.28	229.68
485.708	185.99
486.135	232.1
486.563	207.83
486.991	147.15
487.419	159.29
487.847	200.55
488.274	166.57
488.702	241.81
489.129	200.55
489.557	181.13
489.984	120.45
490.412	236.96
490.839	181.13
491.266	229.68
491.694	278.22
492.121	195.69
492.548	212.69
492.975	202.98
493.402	239.38
493.829	156.86
494.256	142.3
494.683	169
495.11	164.14
495.537	147.15
495.964	137.44
496.39	149.58
496.817	178.7
497.244	210.26
497.67	173.85
498.097	205.4
498.523	190.84
498.95	159.29
499.376	144.72
499.803	149.58
500.229	227.25
500.655	164.14
501.081	159.29
501.508	156.86
501.934	205.4
502.36	188.41
502.786	253.95
503.212	154.43
503.638	127.73
504.064	224.82
504.489	190.84
504.915	88.9
505.341	217.54
505.767	164.14
506.192	171.42
506.618	207.83
507.043	198.12
507.469	169
507.894	244.24
508.32	183.56
508.745	210.26
509.17	212.69
509.596	152
510.021	130.16
510.446	115.6
510.871	207.83
511.296	173.85
511.721	181.13
512.146	200.55
512.571	224.82
512.996	215.11
513.421	154.43
513.845	219.97
514.27	139.87
514.695	181.13
515.119	178.7
515.544	195.69
515.969	154.43
516.393	190.84
516.817	219.97
517.242	219.97
517.666	181.13
518.09	176.28
518.515	132.59
518.939	212.69
519.363	445.7
519.787	193.27
520.211	205.4
520.635	202.98
521.059	202.98
521.483	263.66
521.907	132.59
522.331	188.41
522.754	190.84
523.178	224.82
523.602	195.69
524.025	176.28
524.449	193.27
524.872	152
525.296	224.82
525.719	278.22
526.143	193.27
526.566	171.42
526.989	202.98
527.412	253.95
527.836	210.26
528.259	212.69
528.682	227.25
529.105	176.28
529.528	210.26
529.951	149.58
530.374	198.12
530.796	147.15
531.219	178.7
531.642	122.88
532.065	212.69
532.487	207.83
532.91	193.27
533.332	127.73
533.755	183.56
534.177	236.96
534.6	185.99
535.022	152
535.444	198.12
535.867	236.96
536.289	166.57
536.711	207.83
537.133	195.69
537.555	190.84
537.977	246.67
538.399	234.53
538.821	246.67
539.243	171.42
539.665	258.8
540.086	273.37
540.508	251.52
540.93	173.85
541.351	217.54
541.773	130.16
542.195	202.98
542.616	164.14
543.037	232.1
543.459	244.24
543.88	193.27
544.301	205.4
544.723	205.4
545.144	215.11
545.565	249.09
545.986	292.78
546.407	232.1
546.828	193.27
547.249	217.54
547.67	195.69
548.091	156.86
548.512	132.59
548.932	183.56
549.353	200.55
549.774	224.82
550.194	210.26
550.615	234.53
551.035	166.57
551.456	215.11
551.876	198.12
552.296	147.15
552.717	91.32
553.137	176.28
553.557	244.24
553.977	185.99
554.397	212.69
554.817	188.41
555.237	181.13
555.657	229.68
556.077	246.67
556.497	149.58
556.917	159.29
557.337	251.52
557.756	219.97
558.176	152
558.596	169
559.015	147.15
559.435	183.56
559.854	215.11
560.274	161.71
560.693	195.69
561.112	156.86
561.532	224.82
561.951	195.69
562.37	229.68
562.789	178.7
563.208	166.57
563.627	154.43
564.046	139.87
564.465	261.23
564.884	147.15
565.303	193.27
565.722	173.85
566.14	200.55
566.559	188.41
566.978	181.13
567.396	219.97
567.815	215.11
568.233	236.96
568.652	227.25
569.07	154.43
569.489	239.38
569.907	173.85
570.325	178.7
570.743	113.17
571.161	137.44
571.58	185.99
571.998	251.52
572.416	152
572.833	171.42
573.251	195.69
573.669	193.27
574.087	193.27
574.505	164.14
574.922	164.14
575.34	98.61
575.758	164.14
576.175	198.12
576.593	195.69
577.01	183.56
577.428	103.46
577.845	1729.7
578.262	202.98
578.68	154.43
579.097	149.58
579.514	205.4
579.931	156.86
580.348	229.68
580.765	202.98
581.182	122.88
581.599	200.55
582.016	103.46
582.433	227.25
582.849	127.73
583.266	217.54
583.683	152
584.099	173.85
584.516	176.28
584.933	200.55
585.349	200.55
585.765	198.12
586.182	127.73
586.598	152
587.014	159.29
587.431	137.44
587.847	217.54
588.263	169
588.679	176.28
589.095	122.88
589.511	178.7
589.927	224.82
590.343	176.28
590.759	224.82
591.174	154.43
591.59	171.42
592.006	169
592.421	210.26
592.837	176.28
593.252	139.87
593.668	149.58
594.083	195.69
594.499	171.42
594.914	147.15
595.329	159.29
595.745	193.27
596.16	190.84
596.575	200.55
596.99	183.56
597.405	164.14
597.82	219.97
598.235	234.53
598.65	198.12
599.065	154.43
599.479	234.53
599.894	217.54
600.309	198.12
600.724	159.29
601.138	122.88
601.553	236.96
601.967	183.56
602.382	215.11
602.796	295.21
603.21	190.84
603.625	249.09
604.039	227.25
604.453	198.12
604.867	152
605.281	234.53
605.695	137.44
606.109	176.28
606.523	190.84
606.937	232.1
607.351	275.79
607.765	169
608.178	173.85
608.592	113.17
609.006	215.11
609.419	251.52
609.833	169
610.246	241.81
610.66	190.84
611.073	198.12
611.487	207.83
611.9	195.69
612.313	110.74
612.726	147.15
613.139	159.29
613.553	185.99
613.966	183.56
614.379	205.4
614.792	139.87
615.204	159.29
615.617	159.29
616.03	154.43
616.443	246.67
616.856	169
617.268	149.58
617.681	152
618.093	198.12
618.506	193.27
618.918	127.73
619.331	241.81
619.743	234.53
620.155	195.69
620.568	139.87
620.98	161.71
621.392	224.82
621.804	224.82
622.216	183.56
622.628	239.38
623.04	181.13
623.452	217.54
623.864	210.26
624.276	232.1
624.687	241.81
625.099	181.13
625.511	135.01
625.922	154.43
626.334	147.15
626.745	202.98
627.157	132.59
627.568	132.59
627.979	215.11
628.391	166.57
628.802	127.73
629.213	224.82
629.624	118.02
630.035	139.87
630.446	161.71
630.857	178.7
631.268	171.42
631.679	166.57
632.09	161.71
632.501	183.56
632.912	258.8
633.322	253.95
633.733	178.7
634.144	171.42
634.554	127.73
634.965	207.83
635.375	137.44
635.785	185.99
636.196	173.85
636.606	219.97
637.016	193.27
637.427	178.7
637.837	188.41
638.247	135.01
638.657	144.72
639.067	263.66
639.477	122.88
639.887	205.4
640.297	178.7
640.706	161.71
641.116	159.29
641.526	173.85
641.935	217.54
642.345	96.18
642.755	149.58
643.164	161.71
643.573	135.01
643.983	183.56
644.392	152
644.801	190.84
645.211	115.6
645.62	185.99
646.029	154.43
646.438	202.98
646.847	207.83
647.256	118.02
647.665	166.57
648.074	130.16
648.483	210.26
648.892	166.57
649.3	161.71
649.709	232.1
650.118	176.28
650.526	176.28
650.935	84.04
651.343	130.16
651.752	200.55
652.16	193.27
652.568	144.72
652.977	144.72
653.385	198.12
653.793	127.73
654.201	101.03
654.609	166.57
655.017	127.73
655.425	139.87
655.833	185.99
656.241	164.14
656.649	181.13
657.057	169
657.464	161.71
657.872	164.14
658.28	105.89
658.687	139.87
659.095	176.28
659.502	144.72
659.91	166.57
660.317	193.27
660.724	183.56
661.132	164.14
661.539	195.69
661.946	135.01
662.353	195.69
662.76	164.14
663.167	86.47
663.574	125.31
663.981	161.71
664.388	181.13
664.795	156.86
665.202	215.11
665.608	173.85
666.015	178.7
666.422	164.14
666.828	227.25
667.235	127.73
667.641	239.38
668.047	103.46
668.454	224.82
668.86	207.83
669.266	207.83
669.673	154.43
670.079	149.58
670.485	113.17
670.891	132.59
671.297	135.01
671.703	147.15
672.109	188.41
672.515	161.71
672.92	244.24
673.326	195.69
673.732	166.57
674.138	202.98
674.543	188.41
674.949	210.26
675.354	147.15
675.76	207.83
676.165	185.99
676.57	198.12
676.976	125.31
677.381	147.15
677.786	139.87
678.191	161.71
678.596	224.82
679.001	188.41
679.406	169
679.811	236.96
680.216	173.85
680.621	122.88
681.026	144.72
681.43	103.46
681.835	195.69
682.24	205.4
682.644	137.44
683.049	185.99
683.453	108.31
683.858	142.3
684.262	164.14
684.667	190.84
685.071	215.11
685.475	193.27
685.879	120.45
686.283	239.38
686.687	183.56
687.091	130.16
687.495	219.97
687.899	161.71
688.303	127.73
688.707	185.99
689.111	118.02
689.514	185.99
689.918	198.12
690.322	137.44
690.725	217.54
691.129	178.7
691.532	156.86
691.936	202.98
692.339	183.56
692.742	152
693.146	215.11
693.549	110.74
693.952	171.42
694.355	130.16
694.758	232.1
695.161	246.67
695.564	227.25
695.967	113.17
696.37	139.87
696.773	202.98
697.175	152
697.578	144.72
697.981	164.14
698.383	171.42
698.786	205.4
699.188	173.85
699.591	166.57
699.993	193.27
700.395	200.55
700.798	202.98
701.2	210.26
701.602	149.58
702.004	190.84
702.406	130.16
702.808	198.12
703.21	169
703.612	207.83
704.014	178.7
704.416	205.4
704.818	234.53
705.219	137.44
705.621	212.69
706.023	210.26
706.424	222.39
706.826	236.96
707.227	246.67
707.629	164.14
708.03	183.56
708.431	205.4
708.832	227.25
709.234	176.28
709.635	227.25
710.036	239.38
710.437	183.56
710.838	217.54
711.239	207.83
711.64	183.56
712.041	202.98
712.441	166.57
712.842	215.11
713.243	244.24
713.643	232.1
714.044	188.41
714.445	312.2
714.845	219.97
715.246	188.41
715.646	229.68
716.046	185.99
716.447	224.82
716.847	319.48
717.247	258.8
717.647	244.24
718.047	241.81
718.447	266.08
718.847	253.95
719.247	217.54
719.647	258.8
720.047	261.23
720.446	229.68
720.846	261.23
721.246	270.94
721.645	244.24
722.045	302.49
722.444	309.77
722.844	278.22
723.243	300.07
723.643	292.78
724.042	287.93
724.441	283.07
724.84	275.79
725.24	241.81
725.639	377.74
726.038	283.07
726.437	324.34
726.836	304.92
727.234	319.48
727.633	285.5
728.032	365.6
728.431	278.22
728.83	455.41
729.228	411.72
729.627	404.44
730.025	334.05
730.424	438.42
730.822	533.08
731.22	455.41
731.619	440.84
732.017	535.51
732.415	579.2
732.813	613.18
733.212	632.59
733.61	700.56
734.008	647.16
734.406	715.12
734.803	773.37
735.201	753.96
735.599	829.2
735.997	887.45
736.395	928.72
736.792	940.85
737.19	967.55
737.587	962.7
737.985	1093.77
738.382	1202.99
738.78	1135.03
739.177	1290.37
739.574	1224.84
739.971	1205.42
740.369	1406.88
740.766	1533.09
741.163	1513.68
741.56	1554.94
741.957	1581.64
742.354	1705.43
742.751	1787.95
743.147	1872.91
743.544	2008.83
743.941	2050.09
744.338	2108.35
744.734	2183.59
745.131	2207.86
745.527	2292.81
745.924	2542.82
746.32	2547.67
746.716	2695.73
747.113	2904.47
747.509	3045.25
747.905	3057.39
748.301	3329.24
748.697	3295.26
749.093	3581.67
749.489	3557.4
749.885	3770.99
750.281	3974.88
750.677	4079.25
751.073	4431.2
751.468	4545.28
751.864	4724.89
752.26	4751.59
752.655	5047.71
753.051	5159.36
753.446	5334.12
753.842	5576.85
754.237	5865.69
754.632	5955.49
755.028	5989.47
755.423	6159.38
755.818	6334.14
756.213	6496.76
756.608	6506.47
757.003	6855.99
757.398	6814.73
757.793	6630.26
758.188	7125.41
758.583	7307.46
758.977	7329.3
759.372	7448.23
759.767	8040.48
760.161	8268.64
760.556	8564.76
760.95	8907
761.345	9416.71
761.739	9771.09
762.133	9904.58
762.527	10487.12
762.922	10761.39
763.316	10707.99
763.71	11064.8
764.104	11576.94
764.498	11647.33
764.892	12013.84
765.286	12271.13
765.68	12545.4
766.073	12739.58
766.467	12839.1
766.861	13375.51
767.255	13802.7
767.648	14261.45
768.042	13928.92
768.435	14547.86
768.829	14606.11
769.222	14853.69
769.615	15584.28
770.008	15715.35
770.402	15433.8
770.795	15577
771.188	16064.87
771.581	15848.85
771.974	15377.97
772.367	15140.1
772.76	15984.78
773.153	15307.58
773.545	15089.13
773.938	15523.6
774.331	16302.74
774.724	16249.34
775.116	16763.91
775.509	17632.86
775.901	18159.57
776.294	18261.51
776.686	18438.7
777.078	18972.69
777.471	19562.5
777.863	20021.25
778.255	20744.56
778.647	21970.31
779.039	21484.86
779.431	20645.04
779.823	21540.69
780.215	21895.06
780.607	21448.45
780.999	21725.16
781.39	22208.17
781.782	22023.7
782.174	22064.97
782.565	21936.32
782.957	22807.7
783.348	23135.37
783.74	22778.57
784.131	22463.03
784.522	23365.96
784.914	22778.57
785.305	22341.67
785.696	22395.07
786.087	22511.58
786.478	22009.14
786.869	20841.65
787.26	20785.82
787.651	21064.95
788.042	20215.42
788.433	19263.95
788.823	19378.03
789.214	19606.19
789.605	18742.1
789.995	18125.59
790.386	17924.13
790.776	18378.02
791.167	17642.57
791.557	17856.16
791.948	18530.93
792.338	19050.36
792.728	19157.15
793.118	18567.34
793.508	19351.33
793.898	19708.13
794.288	18972.69
794.678	18926.57
795.068	19780.95
795.458	19725.12
795.848	18892.59
796.238	18467.82
796.627	19128.03
797.017	18831.91
797.406	18572.19
797.796	18079.47
798.185	19123.17
798.575	19584.35
798.964	18356.17
799.354	18630.45
799.743	19096.47
800.132	19392.6
800.521	18734.82
800.91	18822.2
801.299	18681.42
801.688	18824.63
802.077	18186.27
802.466	17681.4
802.855	18407.14
803.244	17744.51
803.633	17021.2
804.021	16560.03
804.41	17329.46
804.799	17123.14
805.187	15834.29
805.576	15103.69
805.964	15319.72
806.352	14924.08
806.741	14470.19
807.129	14169.21
807.517	14737.18
807.905	14703.2
808.293	14276.01
808.681	14239.6
809.069	14664.37
809.457	15186.22
809.845	14807.57
810.233	14026.01
810.621	15244.47
811.009	15057.58
811.396	14385.24
811.784	14127.95
812.171	14465.33
812.559	14734.76
812.946	13902.22
813.334	13409.49
813.721	13686.2
814.108	13931.35
814.496	13385.22
814.883	12591.52
815.27	13127.93
815.657	13559.98
816.044	13222.6
816.431	12574.53
816.818	12693.46
817.205	13152.21
817.592	12834.24
817.979	12137.63
818.365	11778.4
818.752	12023.55
819.139	11739.56
819.525	10897.32
819.912	10552.65
820.298	11021.11
820.685	10710.42
821.071	10091.48
821.457	9797.79
821.843	9241.95
822.23	9508.95
822.616	8846.31
823.002	8462.81
823.388	8193.39
823.774	8385.14
824.16	7788.05
824.546	7343.86
824.931	7312.31
825.317	7453.09
825.703	7176.39
826.089	6892.4
826.474	6897.26
826.86	7161.82
827.245	6880.26
827.631	6863.27
828.016	6290.45
828.401	6419.09
828.787	6479.77
829.172	6028.31
829.557	5703.06
829.942	5715.2
830.327	5953.07
830.712	5613.25
831.097	5183.64
831.482	5069.56
831.867	5312.28
832.252	5120.53
832.636	4843.83
833.021	4656.93
833.406	4707.9
833.79	4819.55
834.175	4538
834.559	4399.64
834.944	4351.1
835.328	4504.01
835.713	4130.22
836.097	3933.62
836.481	3720.02
836.865	3902.06
837.249	3746.72
837.633	3338.95
838.017	3440.89
838.401	3392.35
838.785	3229.72
839.169	3278.27
839.553	2916.61
839.937	2846.22
840.32	2824.38
840.704	2707.87
841.087	2470
841.471	2297.67
841.854	2331.65
842.238	2295.24
842.621	2215.14
843.004	2059.8
843.388	2023.39
843.771	2270.97
844.154	1982.13
844.537	1974.85
844.92	1936.01
845.303	1999.12
845.686	1996.69
846.069	1892.32
846.452	1872.91
846.834	1715.14
847.217	1853.49
847.6	1722.42
847.982	1715.14
848.365	1579.21
848.748	1562.22
849.13	1540.38
849.512	1445.71
849.895	1462.7
850.277	1338.92
850.659	1511.25
851.041	1385.03
851.423	1389.89
851.806	1280.66
852.188	1307.36
852.57	1219.98
852.951	1273.38
853.333	1241.83
853.715	1193.28
854.097	1232.12
854.479	1147.17
854.86	1091.34
855.242	1047.65
855.623	969.98
856.005	1067.07
856.386	1035.51
856.768	885.03
857.149	838.91
857.53	843.76
857.911	899.59
858.292	809.78
858.674	753.96
859.055	695.7
859.436	688.42
859.817	717.55
860.197	722.4
860.578	715.12
860.959	552.5
861.34	637.45
861.72	625.31
862.101	571.91
862.482	574.34
862.862	520.94
863.243	649.59
863.623	603.47
864.003	460.26
864.384	537.93
864.764	567.06
865.144	569.49
865.524	523.37
865.904	411.72
866.284	416.57
866.664	443.27
867.044	431.14
867.424	455.41
867.804	392.3
868.183	409.29
868.563	368.03
868.943	382.59
869.322	304.92
869.702	353.46
870.081	370.45
870.461	380.16
870.84	338.9
871.22	375.31
871.599	334.05
871.978	380.16
872.357	304.92
872.736	358.32
873.115	304.92
873.494	343.76
873.873	275.79
874.252	292.78
874.631	253.95
875.01	273.37
875.388	309.77
875.767	246.67
876.146	268.51
876.524	249.09
876.903	246.67
877.281	268.51
877.66	246.67
878.038	249.09
878.416	258.8
878.794	207.83
879.173	210.26
879.551	300.07
879.929	283.07
880.307	169
880.685	193.27
881.063	229.68
881.441	207.83
881.818	224.82
882.196	246.67
882.574	171.42
882.951	215.11
883.329	207.83
883.707	176.28
884.084	236.96
884.461	224.82
884.839	229.68
885.216	176.28
885.593	164.14
885.971	244.24
886.348	161.71
886.725	185.99
887.102	159.29
887.479	185.99
887.856	152
888.233	154.43
888.609	212.69
888.986	178.7
889.363	190.84
889.74	144.72
890.116	161.71
890.493	161.71
890.869	132.59
891.246	166.57
891.622	181.13
891.998	156.86
892.375	200.55
892.751	215.11
893.127	183.56
893.503	127.73
893.879	173.85
894.255	176.28
894.631	164.14
895.007	195.69
895.383	127.73
895.759	105.89
896.134	178.7
896.51	164.14
896.886	198.12
897.261	171.42
897.637	178.7
898.012	190.84
898.388	166.57
898.763	139.87
899.138	176.28
899.514	183.56
899.889	176.28
900.264	198.12
900.639	166.57
901.014	181.13
901.389	113.17
901.764	183.56
902.139	115.6
902.513	149.58
902.888	169
903.263	144.72
903.638	173.85
904.012	149.58
904.387	139.87
904.761	188.41
905.136	105.89
905.51	149.58
905.884	118.02
906.259	142.3
906.633	103.46
907.007	169
907.381	76.76
907.755	139.87
908.129	122.88
908.503	156.86
908.877	103.46
909.251	130.16
909.624	207.83
909.998	169
910.372	118.02
910.745	132.59
911.119	81.62
911.492	202.98
911.866	108.31
912.239	93.75
912.612	217.54
912.986	188.41
913.359	215.11
913.732	166.57
914.105	137.44
914.478	132.59
914.851	161.71
915.224	154.43
915.597	118.02
915.97	149.58
916.343	190.84
916.715	200.55
917.088	120.45
917.461	193.27
917.833	183.56
918.206	149.58
918.578	96.18
918.951	171.42
919.323	183.56
919.695	232.1
920.067	147.15
920.44	81.62
920.812	173.85
921.184	152
921.556	234.53
921.928	156.86
922.3	132.59
922.672	198.12
923.043	173.85
923.415	176.28
923.787	190.84
924.158	137.44
924.53	185.99
924.901	198.12
925.273	181.13
925.644	149.58
926.016	176.28
926.387	147.15
926.758	130.16
927.129	210.26
927.5	149.58
927.872	166.57
928.243	159.29
928.613	173.85
928.984	139.87
929.355	205.4
929.726	159.29
930.097	173.85
930.467	164.14
930.838	193.27
931.209	120.45
931.579	147.15
931.95	176.28
932.32	125.31
932.69	137.44
933.061	149.58
933.431	202.98
933.801	76.76
934.171	198.12
934.541	132.59
934.911	154.43
935.281	212.69
935.651	164.14
936.021	205.4
936.391	108.31
936.761	130.16
937.13	118.02
937.5	118.02
937.87	135.01
938.239	156.86
938.609	227.25
938.978	152
939.347	169
939.717	183.56
940.086	181.13
940.455	103.46
940.824	135.01
941.193	135.01
941.562	207.83
941.931	164.14
942.3	142.3
942.669	156.86
943.038	176.28
943.407	91.32
943.775	113.17
944.144	166.57
944.513	210.26
944.881	122.88
945.25	193.27
945.618	118.02
945.986	120.45
946.355	202.98
946.723	185.99
947.091	62.2
947.459	183.56
947.827	190.84
948.195	224.82
948.563	181.13
948.931	113.17
949.299	183.56
949.667	166.57
950.035	181.13
950.402	173.85
950.77	93.75
951.138	135.01
951.505	142.3
951.873	142.3
952.24	161.71
952.607	198.12
952.975	169
953.342	207.83
953.709	132.59
954.076	103.46
954.443	120.45
954.81	224.82
955.177	144.72
955.544	173.85
955.911	176.28
956.278	147.15
956.645	190.84
957.012	171.42
957.378	130.16
957.745	137.44
958.111	171.42
958.478	181.13
958.844	122.88
959.211	139.87
959.577	122.88
959.943	181.13
960.309	229.68
960.675	236.96
961.042	173.85
961.408	251.52
961.774	147.15
962.139	176.28
962.505	173.85
962.871	142.3
963.237	118.02
963.603	171.42
963.968	135.01
964.334	190.84
964.699	142.3
965.065	161.71
965.43	125.31
965.796	185.99
966.161	161.71
966.526	142.3
966.891	212.69
967.256	103.46
967.622	154.43
967.987	144.72
968.352	122.88
968.716	52.49
969.081	149.58
969.446	195.69
969.811	173.85
970.176	202.98
970.54	164.14
970.905	147.15
971.269	149.58
971.634	193.27
971.998	173.85
972.363	147.15
972.727	178.7
973.091	176.28
973.455	249.09
973.819	98.61
974.183	198.12
974.547	135.01
974.911	76.76
975.275	101.03
975.639	185.99
976.003	173.85
976.367	195.69
976.73	188.41
977.094	127.73
977.458	127.73
977.821	244.24
978.185	239.38
978.548	135.01
978.911	169
979.275	127.73
979.638	101.03
980.001	171.42
980.364	183.56
980.727	205.4
981.09	101.03
981.453	113.17
981.816	185.99
982.179	219.97
982.542	103.46
982.905	164.14
983.267	185.99
983.63	253.95
983.992	122.88
984.355	74.33
984.717	130.16
985.08	113.17
985.442	144.72
985.804	135.01
986.167	202.98
986.529	193.27
986.891	188.41
987.253	185.99
987.615	132.59
987.977	166.57
988.339	137.44
988.701	173.85
989.062	98.61
989.424	188.41
989.786	154.43
990.147	156.86
990.509	159.29
990.87	234.53
991.232	161.71
991.593	113.17
991.955	120.45
992.316	139.87
992.677	81.62
993.038	212.69
993.399	152
993.76	105.89
994.121	159.29
994.482	113.17
994.843	210.26
995.204	246.67
995.565	188.41
995.926	169
996.286	188.41
996.647	101.03
997.007	105.89
997.368	101.03
997.728	169
998.089	159.29
998.449	154.43
998.809	103.46
999.169	152
999.53	217.54
999.89	176.28
1000.25	137.44
1000.61	188.41
1000.97	154.43
1001.329	183.56
1001.689	176.28
1002.049	202.98
1002.409	234.53
1002.768	193.27
1003.128	105.89
1003.487	122.88
1003.847	166.57
1004.206	132.59
1004.566	132.59
1004.925	110.74
1005.284	108.31
1005.643	115.6
1006.003	142.3
1006.362	125.31
1006.721	156.86
1007.08	185.99
1007.438	202.98
1007.797	154.43
1008.156	132.59
1008.515	198.12
1008.874	171.42
1009.232	142.3
1009.591	144.72
1009.949	169
1010.308	135.01
1010.666	171.42
1011.024	164.14
1011.383	120.45
1011.741	210.26
1012.099	185.99
1012.457	176.28
1012.815	159.29
1013.173	161.71
1013.531	176.28
1013.889	156.86
1014.247	166.57
1014.605	125.31
1014.962	193.27
1015.32	96.18
1015.678	164.14
1016.035	188.41
1016.393	105.89
1016.75	96.18
1017.107	120.45
1017.465	132.59
1017.822	181.13
1018.179	125.31
1018.536	81.62
1018.894	149.58
1019.251	149.58
1019.608	113.17
1019.964	205.4
1020.321	195.69
1020.678	164.14
1021.035	232.1
1021.392	205.4
1021.748	122.88
1022.105	258.8
1022.461	147.15
1022.818	181.13
1023.174	108.31
1023.531	152
1023.887	154.43
1024.243	108.31
1024.599	125.31
1024.955	161.71
1025.311	181.13
1025.667	178.7
1026.023	149.58
1026.379	113.17
1026.735	188.41
1027.091	147.15
1027.447	178.7
