189.514	39.44
189.973	39.44
190.431	39.44
190.889	15.17
191.348	73.42
191.806	61.29
192.264	-4.25
192.722	-47.94
193.18	12.74
193.638	51.58
194.096	0.61
194.554	5.46
195.012	-45.51
195.47	-33.37
195.928	49.15
196.385	10.32
196.843	15.17
197.301	-4.25
197.758	-1.82
198.216	-13.96
198.674	34.59
199.131	-28.52
199.589	-21.24
200.046	56.43
200.503	15.17
200.961	121.97
201.418	63.71
201.875	87.99
202.332	39.44
202.79	39.44
203.247	114.69
203.704	102.55
204.161	102.55
204.618	102.55
205.075	158.38
205.532	124.4
205.989	117.11
206.445	114.69
206.902	90.41
207.359	124.4
207.816	100.12
208.272	129.25
208.729	151.09
209.185	192.36
209.642	97.7
210.098	189.93
210.555	180.22
211.011	104.98
211.467	170.51
211.924	158.38
212.38	165.66
212.836	100.12
213.292	141.39
213.748	155.95
214.204	223.91
214.66	172.94
215.116	136.53
215.572	175.37
216.028	180.22
216.484	160.8
216.94	187.5
217.396	158.38
217.851	124.4
218.307	151.09
218.763	172.94
219.218	131.68
219.674	107.4
220.129	117.11
220.585	87.99
221.04	165.66
221.496	112.26
221.951	126.82
222.406	109.83
222.861	121.97
223.317	158.38
223.772	155.95
224.227	75.85
224.682	109.83
225.137	168.09
225.592	114.69
226.047	73.42
226.502	104.98
226.957	172.94
227.411	202.07
227.866	189.93
228.321	112.26
228.776	119.54
229.23	165.66
229.685	109.83
230.139	175.37
230.594	85.56
231.048	124.4
231.503	117.11
231.957	83.13
232.411	46.72
232.865	100.12
233.32	148.67
233.774	131.68
234.228	100.12
234.682	243.33
235.136	146.24
235.59	114.69
236.044	177.79
236.498	143.81
236.952	146.24
237.406	165.66
237.86	92.84
238.313	151.09
238.767	148.67
239.221	134.1
239.674	141.39
240.128	119.54
240.581	107.4
241.035	194.78
241.488	46.72
241.942	163.23
242.395	151.09
242.848	100.12
243.301	114.69
243.755	141.39
244.208	170.51
244.661	175.37
245.114	209.35
245.567	170.51
246.02	160.8
246.473	75.85
246.926	180.22
247.379	83.13
247.832	168.09
248.284	148.67
248.737	182.65
249.19	155.95
249.642	121.97
250.095	134.1
250.547	158.38
251	104.98
251.452	78.28
251.905	71
252.357	204.49
252.81	153.52
253.262	175.37
253.714	102.55
254.166	121.97
254.618	146.24
255.07	117.11
255.523	138.96
255.975	129.25
256.427	143.81
256.878	97.7
257.33	90.41
257.782	119.54
258.234	61.29
258.686	136.53
259.137	189.93
259.589	129.25
260.041	124.4
260.492	71
260.944	83.13
261.395	221.48
261.847	219.06
262.298	134.1
262.749	129.25
263.201	141.39
263.652	100.12
264.103	136.53
264.554	112.26
265.005	114.69
265.457	107.4
265.908	180.22
266.359	112.26
266.809	136.53
267.26	114.69
267.711	197.21
268.162	146.24
268.613	151.09
269.064	107.4
269.514	148.67
269.965	131.68
270.415	90.41
270.866	126.82
271.316	172.94
271.767	104.98
272.217	160.8
272.668	97.7
273.118	146.24
273.568	109.83
274.019	126.82
274.469	138.96
274.919	158.38
275.369	146.24
275.819	117.11
276.269	170.51
276.719	141.39
277.169	153.52
277.619	141.39
278.069	78.28
278.518	146.24
278.968	153.52
279.418	175.37
279.867	119.54
280.317	211.78
280.767	85.56
281.216	141.39
281.666	206.92
282.115	129.25
282.564	117.11
283.014	146.24
283.463	189.93
283.912	109.83
284.361	148.67
284.811	80.71
285.26	119.54
285.709	90.41
286.158	172.94
286.607	177.79
287.056	109.83
287.505	148.67
287.953	100.12
288.402	151.09
288.851	100.12
289.3	80.71
289.748	131.68
290.197	138.96
290.646	114.69
291.094	112.26
291.543	187.5
291.991	95.27
292.439	75.85
292.888	90.41
293.336	141.39
293.784	141.39
294.233	131.68
294.681	192.36
295.129	175.37
295.577	219.06
296.025	172.94
296.473	265.17
296.921	219.06
297.369	134.1
297.817	155.95
298.264	165.66
298.712	124.4
299.16	194.78
299.608	131.68
300.055	165.66
300.503	189.93
300.95	168.09
301.398	119.54
301.845	182.65
302.293	138.96
302.74	112.26
303.187	151.09
303.635	141.39
304.082	134.1
304.529	151.09
304.976	211.78
305.423	155.95
305.87	158.38
306.317	134.1
306.764	117.11
307.211	192.36
307.658	109.83
308.105	143.81
308.552	151.09
308.998	148.67
309.445	136.53
309.892	141.39
310.338	160.8
310.785	160.8
311.231	138.96
311.678	138.96
312.124	168.09
312.571	143.81
313.017	151.09
313.463	185.08
313.909	165.66
314.356	54.01
314.802	121.97
315.248	100.12
315.694	131.68
316.14	192.36
316.586	92.84
317.032	151.09
317.478	146.24
317.923	168.09
318.369	148.67
318.815	168.09
319.261	134.1
319.706	136.53
320.152	124.4
320.597	136.53
321.043	148.67
321.488	189.93
321.934	117.11
322.379	148.67
322.824	124.4
323.27	204.49
323.715	158.38
324.16	180.22
324.605	117.11
325.05	189.93
325.495	131.68
325.94	153.52
326.385	121.97
326.83	129.25
327.275	194.78
327.72	119.54
328.165	155.95
328.61	112.26
329.054	175.37
329.499	158.38
329.943	141.39
330.388	141.39
330.832	92.84
331.277	117.11
331.721	124.4
332.166	228.77
332.61	146.24
333.054	124.4
333.499	158.38
333.943	102.55
334.387	121.97
334.831	100.12
335.275	134.1
335.719	180.22
336.163	121.97
336.607	87.99
337.051	95.27
337.495	187.5
337.938	114.69
338.382	114.69
338.826	182.65
339.269	153.52
339.713	148.67
340.157	136.53
340.6	211.78
341.044	129.25
341.487	151.09
341.93	80.71
342.374	51.58
342.817	165.66
343.26	134.1
343.703	175.37
344.146	151.09
344.59	126.82
345.033	90.41
345.476	87.99
345.919	78.28
346.361	107.4
346.804	177.79
347.247	163.23
347.69	109.83
348.133	129.25
348.575	109.83
349.018	100.12
349.461	155.95
349.903	109.83
350.346	124.4
350.788	109.83
351.23	141.39
351.673	121.97
352.115	138.96
352.557	129.25
353	104.98
353.442	202.07
353.884	112.26
354.326	248.18
354.768	141.39
355.21	51.58
355.652	114.69
356.094	151.09
356.536	134.1
356.978	131.68
357.419	206.92
357.861	112.26
358.303	100.12
358.744	138.96
359.186	119.54
359.627	155.95
360.069	182.65
360.51	143.81
360.952	109.83
361.393	124.4
361.834	141.39
362.276	129.25
362.717	104.98
363.158	138.96
363.599	160.8
364.04	175.37
364.481	109.83
364.922	153.52
365.363	151.09
365.804	141.39
366.245	163.23
366.686	87.99
367.126	107.4
367.567	124.4
368.008	197.21
368.448	134.1
368.889	134.1
369.33	197.21
369.77	153.52
370.21	83.13
370.651	170.51
371.091	151.09
371.531	121.97
371.972	202.07
372.412	124.4
372.852	90.41
373.292	129.25
373.732	126.82
374.172	204.49
374.612	194.78
375.052	148.67
375.492	153.52
375.932	97.7
376.372	68.57
376.811	151.09
377.251	202.07
377.691	92.84
378.13	61.29
378.57	170.51
379.009	134.1
379.449	168.09
379.888	119.54
380.328	114.69
380.767	56.43
381.206	109.83
381.645	177.79
382.085	104.98
382.524	121.97
382.963	146.24
383.402	126.82
383.841	192.36
384.28	192.36
384.719	131.68
385.158	175.37
385.596	97.7
386.035	206.92
386.474	155.95
386.913	141.39
387.351	143.81
387.79	165.66
388.228	92.84
388.667	197.21
389.105	175.37
389.544	109.83
389.982	151.09
390.42	90.41
390.859	126.82
391.297	155.95
391.735	155.95
392.173	185.08
392.611	114.69
393.049	146.24
393.487	185.08
393.925	148.67
394.363	189.93
394.801	165.66
395.239	131.68
395.676	112.26
396.114	192.36
396.552	187.5
396.989	146.24
397.427	182.65
397.864	121.97
398.302	192.36
398.739	177.79
399.177	136.53
399.614	85.56
400.051	151.09
400.488	107.4
400.926	124.4
401.363	114.69
401.8	119.54
402.237	165.66
402.674	143.81
403.111	170.51
403.548	146.24
403.985	100.12
404.421	168.09
404.858	126.82
405.295	129.25
405.732	158.38
406.168	146.24
406.605	189.93
407.041	163.23
407.478	90.41
407.914	182.65
408.351	141.39
408.787	129.25
409.223	129.25
409.66	197.21
410.096	121.97
410.532	250.61
410.968	119.54
411.404	170.51
411.84	177.79
412.276	143.81
412.712	194.78
413.148	170.51
413.584	165.66
414.02	158.38
414.455	102.55
414.891	131.68
415.327	126.82
415.762	117.11
416.198	56.43
416.633	112.26
417.069	32.16
417.504	180.22
417.94	206.92
418.375	172.94
418.81	124.4
419.245	143.81
419.681	102.55
420.116	182.65
420.551	177.79
420.986	126.82
421.421	146.24
421.856	87.99
422.291	112.26
422.726	109.83
423.16	160.8
423.595	100.12
424.03	124.4
424.464	51.58
424.899	109.83
425.334	146.24
425.768	168.09
426.203	112.26
426.637	112.26
427.071	117.11
427.506	177.79
427.94	146.24
428.374	182.65
428.809	182.65
429.243	134.1
429.677	165.66
430.111	216.63
430.545	204.49
430.979	189.93
431.413	100.12
431.847	182.65
432.28	112.26
432.714	187.5
433.148	100.12
433.582	163.23
434.015	160.8
434.449	168.09
434.882	104.98
435.316	194.78
435.749	192.36
436.183	170.51
436.616	61.29
437.049	226.34
437.483	134.1
437.916	134.1
438.349	107.4
438.782	206.92
439.215	158.38
439.648	168.09
440.081	163.23
440.514	124.4
440.947	131.68
441.38	87.99
441.813	163.23
442.245	136.53
442.678	141.39
443.111	153.52
443.543	126.82
443.976	187.5
444.408	199.64
444.841	189.93
445.273	175.37
445.705	153.52
446.138	121.97
446.57	124.4
447.002	233.62
447.434	209.35
447.867	211.78
448.299	182.65
448.731	146.24
449.163	187.5
449.595	223.91
450.026	199.64
450.458	151.09
450.89	204.49
451.322	73.42
451.754	219.06
452.185	253.04
452.617	274.88
453.048	160.8
453.48	199.64
453.911	202.07
454.343	238.47
454.774	104.98
455.205	170.51
455.637	187.5
456.068	126.82
456.499	199.64
456.93	66.14
457.361	238.47
457.792	202.07
458.223	245.76
458.654	197.21
459.085	177.79
459.516	206.92
459.947	270.03
460.378	175.37
460.808	233.62
461.239	175.37
461.669	185.08
462.1	248.18
462.531	202.07
462.961	175.37
463.391	189.93
463.822	233.62
464.252	151.09
464.682	180.22
465.113	214.2
465.543	182.65
465.973	219.06
466.403	141.39
466.833	136.53
467.263	253.04
467.693	141.39
468.123	199.64
468.553	185.08
468.983	209.35
469.412	170.51
469.842	211.78
470.272	187.5
470.701	192.36
471.131	206.92
471.56	219.06
471.99	216.63
472.419	151.09
472.849	248.18
473.278	160.8
473.707	197.21
474.136	231.19
474.566	211.78
474.995	177.79
475.424	160.8
475.853	187.5
476.282	160.8
476.711	175.37
477.14	146.24
477.569	185.08
477.997	175.37
478.426	151.09
478.855	153.52
479.283	211.78
479.712	223.91
480.141	175.37
480.569	165.66
480.998	209.35
481.426	151.09
481.854	168.09
482.283	163.23
482.711	216.63
483.139	211.78
483.567	143.81
483.995	204.49
484.424	175.37
484.852	182.65
485.28	194.78
485.708	257.89
486.135	141.39
486.563	143.81
486.991	117.11
487.419	214.2
487.847	148.67
488.274	216.63
488.702	265.17
489.129	148.67
489.557	141.39
489.984	158.38
490.412	141.39
490.839	168.09
491.266	163.23
491.694	138.96
492.121	148.67
492.548	291.87
492.975	146.24
493.402	163.23
493.829	192.36
494.256	172.94
494.683	177.79
495.11	223.91
495.537	187.5
495.964	163.23
496.39	211.78
496.817	121.97
497.244	199.64
497.67	187.5
498.097	177.79
498.523	214.2
498.95	141.39
499.376	141.39
499.803	160.8
500.229	141.39
500.655	165.66
501.081	189.93
501.508	100.12
501.934	160.8
502.36	168.09
502.786	141.39
503.212	153.52
503.638	194.78
504.064	95.27
504.489	146.24
504.915	131.68
505.341	136.53
505.767	155.95
506.192	267.6
506.618	112.26
507.043	155.95
507.469	112.26
507.894	143.81
508.32	194.78
508.745	202.07
509.17	114.69
509.596	136.53
510.021	95.27
510.446	134.1
510.871	155.95
511.296	172.94
511.721	141.39
512.146	163.23
512.571	109.83
512.996	172.94
513.421	211.78
513.845	182.65
514.27	141.39
514.695	75.85
515.119	131.68
515.544	117.11
515.969	143.81
516.393	158.38
516.817	146.24
517.242	228.77
517.666	92.84
518.09	185.08
518.515	148.67
518.939	182.65
519.363	328.28
519.787	194.78
520.211	158.38
520.635	109.83
521.059	187.5
521.483	146.24
521.907	121.97
522.331	163.23
522.754	138.96
523.178	182.65
523.602	216.63
524.025	148.67
524.449	180.22
524.872	199.64
525.296	185.08
525.719	219.06
526.143	221.48
526.566	114.69
526.989	168.09
527.412	223.91
527.836	151.09
528.259	185.08
528.682	109.83
529.105	117.11
529.528	211.78
529.951	158.38
530.374	189.93
530.796	155.95
531.219	175.37
531.642	153.52
532.065	83.13
532.487	158.38
532.91	182.65
533.332	202.07
533.755	155.95
534.177	87.99
534.6	160.8
535.022	189.93
535.444	117.11
535.867	151.09
536.289	209.35
536.711	172.94
537.133	189.93
537.555	182.65
537.977	204.49
538.399	141.39
538.821	180.22
539.243	163.23
539.665	209.35
540.086	206.92
540.508	151.09
540.93	160.8
541.351	206.92
541.773	114.69
542.195	240.9
542.616	270.03
543.037	206.92
543.459	233.62
543.88	153.52
544.301	211.78
544.723	182.65
545.144	180.22
545.565	238.47
545.986	192.36
546.407	199.64
546.828	187.5
547.249	211.78
547.67	211.78
548.091	204.49
548.512	158.38
548.932	209.35
549.353	202.07
549.774	182.65
550.194	185.08
550.615	194.78
551.035	168.09
551.456	151.09
551.876	129.25
552.296	199.64
552.717	197.21
553.137	221.48
553.557	143.81
553.977	129.25
554.397	153.52
554.817	114.69
555.237	158.38
555.657	141.39
556.077	126.82
556.497	189.93
556.917	112.26
557.337	134.1
557.756	134.1
558.176	138.96
558.596	182.65
559.015	168.09
559.435	151.09
559.854	104.98
560.274	124.4
560.693	83.13
561.112	102.55
561.532	141.39
561.951	136.53
562.37	134.1
562.789	172.94
563.208	182.65
563.627	192.36
564.046	160.8
564.465	189.93
564.884	209.35
565.303	177.79
565.722	143.81
566.14	126.82
566.559	141.39
566.978	153.52
567.396	185.08
567.815	172.94
568.233	243.33
568.652	177.79
569.07	170.51
569.489	194.78
569.907	182.65
570.325	180.22
570.743	100.12
571.161	136.53
571.58	134.1
571.998	87.99
572.416	175.37
572.833	221.48
573.251	172.94
573.669	131.68
574.087	202.07
574.505	185.08
574.922	134.1
575.34	148.67
575.758	136.53
576.175	126.82
576.593	153.52
577.01	134.1
577.428	204.49
577.845	1449.66
578.262	270.03
578.68	155.95
579.097	170.51
579.514	165.66
579.931	102.55
580.348	146.24
580.765	180.22
581.182	153.52
581.599	163.23
582.016	119.54
582.433	185.08
582.849	158.38
583.266	160.8
583.683	126.82
584.099	155.95
584.516	146.24
584.933	238.47
585.349	214.2
585.765	146.24
586.182	194.78
586.598	121.97
587.014	197.21
587.431	170.51
587.847	165.66
588.263	104.98
588.679	160.8
589.095	136.53
589.511	172.94
589.927	211.78
590.343	92.84
590.759	83.13
591.174	168.09
591.59	187.5
592.006	90.41
592.421	136.53
592.837	107.4
593.252	197.21
593.668	177.79
594.083	219.06
594.499	151.09
594.914	143.81
595.329	92.84
595.745	265.17
596.16	216.63
596.575	180.22
596.99	168.09
597.405	177.79
597.82	194.78
598.235	138.96
598.65	134.1
599.065	109.83
599.479	243.33
599.894	185.08
600.309	114.69
600.724	151.09
601.138	151.09
601.553	129.25
601.967	121.97
602.382	170.51
602.796	90.41
603.21	148.67
603.625	153.52
604.039	119.54
604.453	78.28
604.867	146.24
605.281	168.09
605.695	168.09
606.109	100.12
606.523	165.66
606.937	92.84
607.351	279.74
607.765	148.67
608.178	141.39
608.592	114.69
609.006	141.39
609.419	206.92
609.833	121.97
610.246	197.21
610.66	211.78
611.073	155.95
611.487	204.49
611.9	180.22
612.313	192.36
612.726	204.49
613.139	151.09
613.553	172.94
613.966	175.37
614.379	228.77
614.792	148.67
615.204	206.92
615.617	197.21
616.03	172.94
616.443	153.52
616.856	180.22
617.268	148.67
617.681	260.32
618.093	146.24
618.506	189.93
618.918	141.39
619.331	211.78
619.743	160.8
620.155	107.4
620.568	109.83
620.98	177.79
621.392	214.2
621.804	202.07
622.216	194.78
622.628	204.49
623.04	168.09
623.452	172.94
623.864	124.4
624.276	153.52
624.687	168.09
625.099	165.66
625.511	187.5
625.922	168.09
626.334	233.62
626.745	90.41
627.157	97.7
627.568	78.28
627.979	54.01
628.391	158.38
628.802	151.09
629.213	136.53
629.624	177.79
630.035	104.98
630.446	136.53
630.857	134.1
631.268	92.84
631.679	175.37
632.09	170.51
632.501	141.39
632.912	92.84
633.322	163.23
633.733	143.81
634.144	172.94
634.554	148.67
634.965	141.39
635.375	163.23
635.785	175.37
636.196	194.78
636.606	146.24
637.016	233.62
637.427	131.68
637.837	175.37
638.247	175.37
638.657	146.24
639.067	114.69
639.477	185.08
639.887	185.08
640.297	136.53
640.706	177.79
641.116	129.25
641.526	78.28
641.935	114.69
642.345	160.8
642.755	87.99
643.164	114.69
643.573	168.09
643.983	170.51
644.392	182.65
644.801	194.78
645.211	97.7
645.62	97.7
646.029	177.79
646.438	170.51
646.847	121.97
647.256	107.4
647.665	148.67
648.074	155.95
648.483	185.08
648.892	165.66
649.3	168.09
649.709	180.22
650.118	119.54
650.526	189.93
650.935	134.1
651.343	238.47
651.752	187.5
652.16	180.22
652.568	143.81
652.977	158.38
653.385	231.19
653.793	155.95
654.201	124.4
654.609	95.27
655.017	197.21
655.425	109.83
655.833	151.09
656.241	163.23
656.649	126.82
657.057	206.92
657.464	117.11
657.872	124.4
658.28	141.39
658.687	126.82
659.095	170.51
659.502	100.12
659.91	129.25
660.317	73.42
660.724	151.09
661.132	155.95
661.539	124.4
661.946	148.67
662.353	141.39
662.76	141.39
663.167	165.66
663.574	119.54
663.981	175.37
664.388	148.67
664.795	187.5
665.202	134.1
665.608	134.1
666.015	124.4
666.422	148.67
666.828	95.27
667.235	90.41
667.641	168.09
668.047	112.26
668.454	170.51
668.86	214.2
669.266	148.67
669.673	119.54
670.079	197.21
670.485	126.82
670.891	153.52
671.297	240.9
671.703	206.92
672.109	121.97
672.515	170.51
672.92	146.24
673.326	143.81
673.732	180.22
674.138	134.1
674.543	194.78
674.949	109.83
675.354	61.29
675.76	124.4
676.165	100.12
676.57	58.86
676.976	168.09
677.381	85.56
677.786	124.4
678.191	192.36
678.596	124.4
679.001	129.25
679.406	189.93
679.811	187.5
680.216	170.51
680.621	131.68
681.026	121.97
681.43	143.81
681.835	138.96
682.24	95.27
682.644	83.13
683.049	126.82
683.453	146.24
683.858	158.38
684.262	73.42
684.667	163.23
685.071	168.09
685.475	136.53
685.879	141.39
686.283	160.8
686.687	136.53
687.091	73.42
687.495	153.52
687.899	170.51
688.303	104.98
688.707	168.09
689.111	168.09
689.514	155.95
689.918	136.53
690.322	136.53
690.725	95.27
691.129	236.05
691.532	148.67
691.936	114.69
692.339	107.4
692.742	136.53
693.146	160.8
693.549	170.51
693.952	148.67
694.355	102.55
694.758	141.39
695.161	87.99
695.564	199.64
695.967	104.98
696.37	146.24
696.773	160.8
697.175	104.98
697.578	170.51
697.981	257.89
698.383	206.92
698.786	221.48
699.188	158.38
699.591	119.54
699.993	216.63
700.395	136.53
700.798	141.39
701.2	168.09
701.602	163.23
702.004	170.51
702.406	143.81
702.808	206.92
703.21	155.95
703.612	136.53
704.014	177.79
704.416	168.09
704.818	107.4
705.219	189.93
705.621	143.81
706.023	185.08
706.424	182.65
706.826	104.98
707.227	231.19
707.629	211.78
708.03	160.8
708.431	197.21
708.832	270.03
709.234	143.81
709.635	240.9
710.036	221.48
710.437	323.43
710.838	155.95
711.239	311.29
711.64	226.34
712.041	260.32
712.441	296.73
712.842	277.31
713.243	236.05
713.643	194.78
714.044	228.77
714.445	214.2
714.845	291.87
715.246	282.16
715.646	279.74
716.046	304.01
716.447	323.43
716.847	325.85
717.247	243.33
717.647	299.16
718.047	294.3
718.447	330.71
718.847	345.27
719.247	321
719.647	337.99
720.047	393.82
720.446	313.72
720.846	321
721.246	321
721.645	359.84
722.045	342.85
722.444	384.11
722.844	435.08
723.243	359.84
723.643	386.54
724.042	469.06
724.441	401.1
724.84	405.95
725.24	354.98
725.639	386.54
726.038	437.51
726.437	422.94
726.836	456.92
727.234	471.49
727.633	495.76
728.032	517.61
728.431	503.04
728.83	578.29
729.228	505.47
729.627	578.29
730.025	600.13
730.424	668.09
730.822	777.32
731.22	721.49
731.619	777.32
732.017	930.23
732.415	990.91
732.813	1109.85
733.212	949.65
733.61	959.36
734.008	1015.19
734.406	1095.28
734.803	1243.34
735.201	1435.1
735.599	1646.26
735.997	1670.54
736.395	1719.08
736.792	1653.55
737.19	1738.5
737.587	1486.07
737.985	1527.33
738.382	1716.65
738.78	2131.71
739.177	2512.78
739.574	2910.85
739.971	3105.02
740.369	3148.71
740.766	2922.98
741.163	2551.62
741.56	2364.72
741.957	2403.56
742.354	2588.03
742.751	3163.28
743.147	3777.36
743.544	4357.47
743.941	4791.94
744.338	4978.84
744.734	4818.64
745.131	4330.77
745.527	3748.24
745.924	3469.11
746.32	3672.99
746.716	4136.59
747.113	5107.48
747.509	6313.81
747.905	7464.32
748.301	8027.43
748.697	7889.08
749.093	7646.36
749.489	6464.3
749.885	5884.19
750.281	5617.2
750.677	6100.22
751.073	6986.15
751.468	8651.23
751.864	10673.1
752.26	11821.18
752.655	12595.46
753.051	12025.07
753.446	11391.56
753.842	9792.02
754.237	8677.93
754.632	8066.27
755.028	8568.7
755.423	10066.3
755.818	12369.73
756.213	14813.94
756.608	15789.69
757.003	16318.82
757.398	15279.97
757.793	13318.78
758.188	11447.39
758.583	10134.26
758.977	9520.17
759.372	10767.76
759.767	13156.15
760.161	16852.81
760.556	20187.81
760.95	22925.72
761.345	23064.07
761.739	22306.78
762.133	19993.64
762.527	17182.91
762.922	14850.35
763.316	14384.33
763.71	15622.21
764.104	18634.39
764.498	23248.54
764.892	27105.4
765.286	30056.9
765.68	30906.43
766.073	29569.03
766.467	25962.18
766.861	22250.95
767.255	19522.76
767.648	18418.37
768.042	19522.76
768.435	23127.18
768.829	27986.48
769.222	32753.54
769.615	36821.57
770.008	38564.31
770.402	36309.42
770.795	32518.1
771.188	28173.38
771.581	23933.02
771.974	21085.89
772.367	20799.47
772.76	23452.43
773.153	27323.85
773.545	32933.16
773.938	37251.19
774.331	39224.52
774.724	38557.03
775.116	36540.01
775.509	31787.51
775.901	28246.19
776.294	25136.92
776.686	24166.03
777.078	26877.24
777.471	31692.85
777.863	39583.75
778.255	46336.28
778.647	51215
779.039	51370.34
779.431	48384.85
779.823	43554.68
780.215	37700.22
780.607	31904.02
780.999	29457.38
781.39	30302.05
781.782	34355.51
782.174	40345.89
782.565	47338.72
782.957	52506.28
783.348	55219.91
783.74	54222.32
784.131	49787.79
784.522	45078.98
784.914	37760.9
785.305	32265.67
785.696	29360.29
786.087	30734.09
786.478	34195.31
786.869	38726.94
787.26	44554.7
787.651	47501.35
788.042	48850.88
788.433	46974.64
788.823	42394.47
789.214	36794.87
789.605	30374.87
789.995	25996.16
790.386	24044.67
790.776	25467.02
791.167	28362.7
791.557	34658.91
791.948	40457.55
792.338	44316.83
792.728	46933.38
793.118	45132.38
793.508	41074.06
793.898	35925.92
794.288	30734.09
794.678	26331.11
795.068	24979.15
795.458	25789.84
795.848	29539.9
796.238	35214.75
796.627	40719.69
797.017	45382.38
797.406	47547.46
797.796	45450.34
798.185	41979.42
798.575	36743.9
798.964	31083.61
799.354	26581.12
799.743	24372.35
800.132	25685.47
800.521	29129.7
800.91	35052.12
801.299	39923.56
801.688	44739.17
802.077	46207.64
802.466	46583.86
802.855	42896.91
803.244	36195.34
803.633	30576.33
804.021	25001
804.41	21600.46
804.799	20716.95
805.187	22136.87
805.576	25530.13
805.964	30326.32
806.352	33292.39
806.741	36163.79
807.129	36590.98
807.517	35044.84
807.905	31474.4
808.293	26717.04
808.681	22083.47
809.069	18816.43
809.457	18063.99
809.845	19226.63
810.233	22695.13
810.621	27467.05
811.009	32496.26
811.396	35887.09
811.784	38627.42
812.171	37549.73
812.559	34217.16
812.946	29287.47
813.334	24561.67
813.721	19690.23
814.108	16947.47
814.496	16289.7
814.883	17595.54
815.27	21714.54
815.657	25411.2
816.044	30971.96
816.431	34316.67
816.818	34258.42
817.205	32362.76
817.592	29632.14
817.979	25105.37
818.365	20503.35
818.752	16515.43
819.139	14008.11
819.525	13585.77
819.912	15144.05
820.298	17724.18
820.685	20801.9
821.071	23947.58
821.457	25151.48
821.843	25651.49
822.23	23901.46
822.616	20928.12
823.002	17185.34
823.388	13578.49
823.774	11100.29
824.16	9515.32
824.546	9015.31
824.931	10386.69
825.317	12284.78
825.703	14716.86
826.089	16792.13
826.474	18381.96
826.86	18629.54
827.245	17471.75
827.631	15658.62
828.016	13059.06
828.401	10500.77
828.787	8670.64
829.172	7440.04
829.557	7177.9
829.942	7998.3
830.327	9311.43
830.712	11083.3
831.097	12576.05
831.482	13573.63
831.867	14148.89
832.252	13478.97
832.636	12173.13
833.021	10190.09
833.406	8578.41
833.79	6908.48
834.175	5554.09
834.559	5240.98
834.944	5481.27
835.328	6406.05
835.713	7578.39
836.097	8828.41
836.481	9925.52
836.865	10347.86
837.249	10333.29
837.633	9255.61
838.017	7864.81
838.401	6602.65
838.785	5039.52
839.169	3971.54
839.553	3566.2
839.937	3291.92
840.32	3723.97
840.704	4408.44
841.087	4804.08
841.471	5663.32
841.854	6316.24
842.238	6211.87
842.621	5872.06
843.004	5316.22
843.388	4573.49
843.771	3716.68
844.154	3088.03
844.537	2677.83
844.92	2194.82
845.303	2362.29
845.686	2799.19
846.069	3333.18
846.452	3862.32
846.834	4209.41
847.217	4660.87
847.6	4619.61
847.982	4415.72
848.365	3893.87
848.748	3338.04
849.13	2779.78
849.512	2180.25
849.895	1891.41
850.277	1682.67
850.659	1791.9
851.041	2158.41
851.423	2507.93
851.806	2818.61
852.188	3347.75
852.57	3284.64
852.951	3345.32
853.333	3318.62
853.715	2779.78
854.097	2459.38
854.479	2046.76
854.86	1588.01
855.242	1367.13
855.623	1323.44
856.005	1313.73
856.386	1549.17
856.768	1641.41
857.149	1954.52
857.53	2022.48
857.911	2095.3
858.292	2078.31
858.674	2046.76
859.055	1833.16
859.436	1561.31
859.817	1228.78
860.197	1007.9
860.578	920.52
860.959	852.56
861.34	871.98
861.72	859.84
862.101	1085.58
862.482	1211.79
862.862	1301.6
863.243	1282.18
863.623	1267.62
864.003	1194.8
864.384	1155.96
864.764	1083.15
865.144	867.13
865.524	821.01
865.904	641.39
866.284	532.17
866.664	597.7
867.044	711.78
867.424	728.77
867.804	799.16
868.183	811.3
868.563	821.01
868.943	840.43
869.322	874.41
869.702	779.75
870.081	709.36
870.461	517.61
870.84	566.15
871.22	473.92
871.599	398.67
871.978	432.65
872.357	369.54
872.736	454.5
873.115	471.49
873.494	510.32
873.873	510.32
874.252	546.73
874.631	488.48
875.01	435.08
875.388	459.35
875.767	420.52
876.146	398.67
876.524	330.71
876.903	304.01
877.281	289.45
877.66	321
878.038	340.42
878.416	296.73
878.794	289.45
879.173	354.98
879.551	369.54
879.929	313.72
880.307	359.84
880.685	294.3
881.063	316.15
881.441	403.53
881.818	345.27
882.196	282.16
882.574	194.78
882.951	194.78
883.329	248.18
883.707	192.36
884.084	245.76
884.461	214.2
884.839	262.75
885.216	209.35
885.593	187.5
885.971	209.35
886.348	221.48
886.725	240.9
887.102	228.77
887.479	170.51
887.856	182.65
888.233	202.07
888.609	112.26
888.986	175.37
889.363	204.49
889.74	189.93
890.116	206.92
890.493	185.08
890.869	136.53
891.246	206.92
891.622	180.22
891.998	146.24
892.375	151.09
892.751	185.08
893.127	206.92
893.503	136.53
893.879	102.55
894.255	211.78
894.631	187.5
895.007	185.08
895.383	136.53
895.759	211.78
896.134	163.23
896.51	177.79
896.886	168.09
897.261	182.65
897.637	185.08
898.012	102.55
898.388	202.07
898.763	141.39
899.138	126.82
899.514	138.96
899.889	141.39
900.264	177.79
900.639	192.36
901.014	131.68
901.389	68.57
901.764	119.54
902.139	119.54
902.513	177.79
902.888	180.22
903.263	148.67
903.638	73.42
904.012	172.94
904.387	114.69
904.761	141.39
905.136	95.27
905.51	63.71
905.884	107.4
906.259	102.55
906.633	124.4
907.007	209.35
907.381	136.53
907.755	214.2
908.129	146.24
908.503	155.95
908.877	109.83
909.251	83.13
909.624	100.12
909.998	155.95
910.372	138.96
910.745	138.96
911.119	102.55
911.492	92.84
911.866	39.44
912.239	146.24
912.612	143.81
912.986	153.52
913.359	163.23
913.732	177.79
914.105	187.5
914.478	158.38
914.851	78.28
915.224	138.96
915.597	73.42
915.97	90.41
916.343	151.09
916.715	107.4
917.088	155.95
917.461	102.55
917.833	117.11
918.206	226.34
918.578	129.25
918.951	199.64
919.323	199.64
919.695	117.11
920.067	165.66
920.44	104.98
920.812	129.25
921.184	63.71
921.556	143.81
921.928	177.79
922.3	109.83
922.672	83.13
923.043	134.1
923.415	146.24
923.787	90.41
924.158	187.5
924.53	168.09
924.901	129.25
925.273	66.14
925.644	158.38
926.016	83.13
926.387	124.4
926.758	90.41
927.129	117.11
927.5	160.8
927.872	121.97
928.243	92.84
928.613	126.82
928.984	138.96
929.355	83.13
929.726	104.98
930.097	175.37
930.467	138.96
930.838	109.83
931.209	100.12
931.579	131.68
931.95	119.54
932.32	175.37
932.69	155.95
933.061	177.79
933.431	182.65
933.801	129.25
934.171	155.95
934.541	202.07
934.911	109.83
935.281	126.82
935.651	117.11
936.021	163.23
936.391	124.4
936.761	138.96
937.13	66.14
937.5	124.4
937.87	92.84
938.239	124.4
938.609	114.69
938.978	109.83
939.347	163.23
939.717	100.12
940.086	121.97
940.455	146.24
940.824	114.69
941.193	175.37
941.562	143.81
941.931	109.83
942.3	109.83
942.669	172.94
943.038	138.96
943.407	104.98
943.775	87.99
944.144	138.96
944.513	100.12
944.881	143.81
945.25	39.44
945.618	100.12
945.986	95.27
946.355	104.98
946.723	134.1
947.091	112.26
947.459	90.41
947.827	170.51
948.195	126.82
948.563	158.38
948.931	124.4
949.299	163.23
949.667	141.39
950.035	90.41
950.402	119.54
950.77	102.55
951.138	95.27
951.505	29.73
951.873	107.4
952.24	168.09
952.607	168.09
952.975	114.69
953.342	90.41
953.709	100.12
954.076	87.99
954.443	175.37
954.81	131.68
955.177	134.1
955.544	109.83
955.911	163.23
956.278	175.37
956.645	180.22
957.012	39.44
957.378	182.65
957.745	175.37
958.111	141.39
958.478	228.77
958.844	136.53
959.211	151.09
959.577	56.43
959.943	168.09
960.309	155.95
960.675	153.52
961.042	129.25
961.408	146.24
961.774	126.82
962.139	107.4
962.505	117.11
962.871	112.26
963.237	104.98
963.603	182.65
963.968	146.24
964.334	163.23
964.699	153.52
965.065	121.97
965.43	121.97
965.796	148.67
966.161	75.85
966.526	95.27
966.891	148.67
967.256	104.98
967.622	117.11
967.987	104.98
968.352	124.4
968.716	104.98
969.081	134.1
969.446	112.26
969.811	131.68
970.176	104.98
970.54	134.1
970.905	153.52
971.269	148.67
971.634	95.27
971.998	117.11
972.363	124.4
972.727	155.95
973.091	134.1
973.455	158.38
973.819	97.7
974.183	109.83
974.547	22.45
974.911	117.11
975.275	71
975.639	170.51
976.003	121.97
976.367	109.83
976.73	117.11
977.094	163.23
977.458	204.49
977.821	141.39
978.185	85.56
978.548	175.37
978.911	146.24
979.275	151.09
979.638	134.1
980.001	114.69
980.364	90.41
980.727	138.96
981.09	117.11
981.453	204.49
981.816	165.66
982.179	187.5
982.542	187.5
982.905	136.53
983.267	73.42
983.63	148.67
983.992	117.11
984.355	117.11
984.717	182.65
985.08	104.98
985.442	56.43
985.804	87.99
986.167	187.5
986.529	141.39
986.891	136.53
987.253	134.1
987.615	155.95
987.977	192.36
988.339	124.4
988.701	66.14
989.062	46.72
989.424	121.97
989.786	129.25
990.147	148.67
990.509	163.23
990.87	126.82
991.232	151.09
991.593	92.84
991.955	143.81
992.316	143.81
992.677	114.69
993.038	126.82
993.399	148.67
993.76	102.55
994.121	148.67
994.482	141.39
994.843	151.09
995.204	124.4
995.565	85.56
995.926	117.11
996.286	197.21
996.647	141.39
997.007	49.15
997.368	138.96
997.728	170.51
998.089	136.53
998.449	126.82
998.809	192.36
999.169	126.82
999.53	109.83
999.89	109.83
1000.25	172.94
1000.61	175.37
1000.97	78.28
1001.329	92.84
1001.689	138.96
1002.049	95.27
1002.409	158.38
1002.768	163.23
1003.128	153.52
1003.487	109.83
1003.847	209.35
1004.206	136.53
1004.566	175.37
1004.925	107.4
1005.284	121.97
1005.643	73.42
1006.003	83.13
1006.362	134.1
1006.721	129.25
1007.08	151.09
1007.438	73.42
1007.797	104.98
1008.156	121.97
1008.515	240.9
1008.874	163.23
1009.232	126.82
1009.591	146.24
1009.949	95.27
1010.308	126.82
1010.666	112.26
1011.024	138.96
1011.383	131.68
1011.741	151.09
1012.099	71
1012.457	107.4
1012.815	204.49
1013.173	109.83
1013.531	143.81
1013.889	109.83
1014.247	148.67
1014.605	75.85
1014.962	97.7
1015.32	194.78
1015.678	100.12
1016.035	121.97
1016.393	87.99
1016.75	131.68
1017.107	117.11
1017.465	126.82
1017.822	63.71
1018.179	219.06
1018.536	177.79
1018.894	124.4
1019.251	104.98
1019.608	102.55
1019.964	124.4
1020.321	126.82
1020.678	143.81
1021.035	102.55
1021.392	117.11
1021.748	136.53
1022.105	73.42
1022.461	61.29
1022.818	151.09
1023.174	54.01
1023.531	136.53
1023.887	177.79
1024.243	107.4
1024.599	114.69
1024.955	129.25
1025.311	175.37
1025.667	117.11
1026.023	112.26
1026.379	78.28
1026.735	180.22
1027.091	180.22
1027.447	158.38
