189.514	112.87
189.973	112.87
190.431	112.87
190.889	10.92
191.348	-6.07
191.806	42.48
192.264	49.76
192.722	61.89
193.18	-20.63
193.638	-81.31
194.096	-35.19
194.554	25.49
195.012	78.88
195.47	37.62
195.928	-6.07
196.385	-59.47
196.843	-61.89
197.301	-20.63
197.758	35.19
198.216	6.07
198.674	-37.62
199.131	27.91
199.589	115.29
200.046	6.07
200.503	57.04
200.961	139.57
201.418	134.71
201.875	120.15
202.332	154.13
202.79	98.3
203.247	139.57
203.704	173.55
204.161	129.86
204.618	144.42
205.075	108.01
205.532	81.31
205.989	146.85
206.445	132.28
206.902	129.86
207.359	173.55
207.816	139.57
208.272	83.74
208.729	156.56
209.185	166.26
209.642	173.55
210.098	151.7
210.555	180.83
211.011	112.87
211.467	88.59
211.924	239.08
212.38	219.66
212.836	183.26
213.292	180.83
213.748	134.71
214.204	175.97
214.66	171.12
215.116	183.26
215.572	125
216.028	154.13
216.484	149.27
216.94	137.14
217.396	127.43
217.851	108.01
218.307	127.43
218.763	161.41
219.218	185.68
219.674	88.59
220.129	78.88
220.585	93.45
221.04	207.53
221.496	137.14
221.951	151.7
222.406	86.17
222.861	137.14
223.317	86.17
223.772	122.57
224.227	151.7
224.682	120.15
225.137	86.17
225.592	105.58
226.047	98.3
226.502	139.57
226.957	108.01
227.411	103.16
227.866	95.88
228.321	95.88
228.776	105.58
229.23	137.14
229.685	190.54
230.139	171.12
230.594	139.57
231.048	117.72
231.503	144.42
231.957	125
232.411	139.57
232.865	98.3
233.32	144.42
233.774	192.96
234.228	171.12
234.682	144.42
235.136	105.58
235.59	139.57
236.044	180.83
236.498	69.18
236.952	105.58
237.406	110.44
237.86	115.29
238.313	163.84
238.767	105.58
239.221	139.57
239.674	59.47
240.128	132.28
240.581	127.43
241.035	156.56
241.488	69.18
241.942	125
242.395	144.42
242.848	139.57
243.301	144.42
243.755	175.97
244.208	163.84
244.661	122.57
245.114	183.26
245.567	127.43
246.02	253.64
246.473	134.71
246.926	144.42
247.379	144.42
247.832	151.7
248.284	149.27
248.737	98.3
249.19	229.37
249.642	129.86
250.095	134.71
250.547	146.85
251	151.7
251.452	117.72
251.905	137.14
252.357	108.01
252.81	129.86
253.262	78.88
253.714	224.52
254.166	175.97
254.618	161.41
255.07	122.57
255.523	112.87
255.975	178.4
256.427	129.86
256.878	76.46
257.33	149.27
257.782	93.45
258.234	105.58
258.686	144.42
259.137	132.28
259.589	180.83
260.041	171.12
260.492	105.58
260.944	105.58
261.395	127.43
261.847	139.57
262.298	54.61
262.749	175.97
263.201	168.69
263.652	108.01
264.103	127.43
264.554	81.31
265.005	154.13
265.457	166.26
265.908	129.86
266.359	108.01
266.809	217.24
267.26	175.97
267.711	207.53
268.162	120.15
268.613	86.17
269.064	180.83
269.514	154.13
269.965	151.7
270.415	151.7
270.866	180.83
271.316	200.25
271.767	141.99
272.217	144.42
272.668	166.26
273.118	151.7
273.568	180.83
274.019	171.12
274.469	175.97
274.919	125
275.369	156.56
275.819	154.13
276.269	158.98
276.719	110.44
277.169	127.43
277.619	171.12
278.069	86.17
278.518	156.56
278.968	134.71
279.418	105.58
279.867	127.43
280.317	158.98
280.767	154.13
281.216	171.12
281.666	151.7
282.115	125
282.564	120.15
283.014	248.79
283.463	74.03
283.912	207.53
284.361	205.1
284.811	132.28
285.26	110.44
285.709	88.59
286.158	277.92
286.607	195.39
287.056	81.31
287.505	192.96
287.953	209.95
288.402	134.71
288.851	146.85
289.3	137.14
289.748	178.4
290.197	141.99
290.646	188.11
291.094	93.45
291.543	137.14
291.991	120.15
292.439	202.67
292.888	166.26
293.336	185.68
293.784	141.99
294.233	205.1
294.681	149.27
295.129	139.57
295.577	146.85
296.025	149.27
296.473	151.7
296.921	110.44
297.369	144.42
297.817	103.16
298.264	144.42
298.712	117.72
299.16	129.86
299.608	154.13
300.055	141.99
300.503	129.86
300.95	205.1
301.398	112.87
301.845	209.95
302.293	98.3
302.74	163.84
303.187	178.4
303.635	183.26
304.082	141.99
304.529	112.87
304.976	200.25
305.423	103.16
305.87	98.3
306.317	127.43
306.764	139.57
307.211	141.99
307.658	117.72
308.105	154.13
308.552	217.24
308.998	69.18
309.445	178.4
309.892	166.26
310.338	129.86
310.785	127.43
311.231	207.53
311.678	166.26
312.124	103.16
312.571	66.75
313.017	127.43
313.463	166.26
313.909	171.12
314.356	137.14
314.802	83.74
315.248	205.1
315.694	103.16
316.14	185.68
316.586	103.16
317.032	156.56
317.478	226.95
317.923	149.27
318.369	91.02
318.815	127.43
319.261	144.42
319.706	98.3
320.152	120.15
320.597	156.56
321.043	149.27
321.488	125
321.934	175.97
322.379	149.27
322.824	132.28
323.27	173.55
323.715	129.86
324.16	178.4
324.605	103.16
325.05	161.41
325.495	59.47
325.94	248.79
326.385	144.42
326.83	180.83
327.275	112.87
327.72	64.32
328.165	151.7
328.61	137.14
329.054	132.28
329.499	144.42
329.943	117.72
330.388	127.43
330.832	171.12
331.277	129.86
331.721	185.68
332.166	139.57
332.61	105.58
333.054	171.12
333.499	139.57
333.943	134.71
334.387	173.55
334.831	134.71
335.275	40.05
335.719	134.71
336.163	175.97
336.607	156.56
337.051	100.73
337.495	122.57
337.938	168.69
338.382	122.57
338.826	200.25
339.269	175.97
339.713	71.6
340.157	103.16
340.6	175.97
341.044	149.27
341.487	195.39
341.93	166.26
342.374	137.14
342.817	175.97
343.26	122.57
343.703	132.28
344.146	175.97
344.59	219.66
345.033	122.57
345.476	144.42
345.919	120.15
346.361	117.72
346.804	127.43
347.247	180.83
347.69	137.14
348.133	137.14
348.575	95.88
349.018	163.84
349.461	120.15
349.903	202.67
350.346	103.16
350.788	115.29
351.23	149.27
351.673	103.16
352.115	47.33
352.557	129.86
353	120.15
353.442	103.16
353.884	134.71
354.326	93.45
354.768	127.43
355.21	132.28
355.652	132.28
356.094	139.57
356.536	117.72
356.978	149.27
357.419	188.11
357.861	149.27
358.303	125
358.744	117.72
359.186	125
359.627	137.14
360.069	195.39
360.51	105.58
360.952	185.68
361.393	207.53
361.834	166.26
362.276	69.18
362.717	175.97
363.158	122.57
363.599	122.57
364.04	178.4
364.481	151.7
364.922	151.7
365.363	185.68
365.804	200.25
366.245	161.41
366.686	158.98
367.126	173.55
367.567	209.95
368.008	212.38
368.448	185.68
368.889	180.83
369.33	112.87
369.77	137.14
370.21	139.57
370.651	173.55
371.091	103.16
371.531	146.85
371.972	173.55
372.412	95.88
372.852	103.16
373.292	110.44
373.732	127.43
374.172	139.57
374.612	154.13
375.052	175.97
375.492	137.14
375.932	141.99
376.372	141.99
376.811	166.26
377.251	74.03
377.691	178.4
378.13	117.72
378.57	149.27
379.009	151.7
379.449	141.99
379.888	117.72
380.328	207.53
380.767	127.43
381.206	214.81
381.645	139.57
382.085	120.15
382.524	91.02
382.963	134.71
383.402	166.26
383.841	154.13
384.28	134.71
384.719	134.71
385.158	76.46
385.596	129.86
386.035	156.56
386.474	132.28
386.913	134.71
387.351	132.28
387.79	163.84
388.228	195.39
388.667	154.13
389.105	139.57
389.544	134.71
389.982	127.43
390.42	132.28
390.859	161.41
391.297	173.55
391.735	175.97
392.173	156.56
392.611	192.96
393.049	175.97
393.487	86.17
393.925	141.99
394.363	158.98
394.801	156.56
395.239	139.57
395.676	144.42
396.114	175.97
396.552	146.85
396.989	78.88
397.427	207.53
397.864	149.27
398.302	180.83
398.739	81.31
399.177	161.41
399.614	103.16
400.051	127.43
400.488	195.39
400.926	192.96
401.363	139.57
401.8	166.26
402.237	158.98
402.674	151.7
403.111	129.86
403.548	141.99
403.985	134.71
404.421	117.72
404.858	175.97
405.295	180.83
405.732	86.17
406.168	117.72
406.605	161.41
407.041	95.88
407.478	173.55
407.914	110.44
408.351	151.7
408.787	139.57
409.223	144.42
409.66	175.97
410.096	76.46
410.532	134.71
410.968	141.99
411.404	139.57
411.84	105.58
412.276	144.42
412.712	139.57
413.148	171.12
413.584	129.86
414.02	154.13
414.455	42.48
414.891	151.7
415.327	183.26
415.762	178.4
416.198	149.27
416.633	158.98
417.069	146.85
417.504	137.14
417.94	112.87
418.375	110.44
418.81	188.11
419.245	108.01
419.681	134.71
420.116	163.84
420.551	93.45
420.986	129.86
421.421	178.4
421.856	144.42
422.291	146.85
422.726	146.85
423.16	120.15
423.595	197.82
424.03	146.85
424.464	129.86
424.899	192.96
425.334	103.16
425.768	144.42
426.203	168.69
426.637	168.69
427.071	108.01
427.506	146.85
427.94	146.85
428.374	125
428.809	144.42
429.243	103.16
429.677	137.14
430.111	180.83
430.545	139.57
430.979	115.29
431.413	154.13
431.847	122.57
432.28	125
432.714	132.28
433.148	139.57
433.582	188.11
434.015	270.64
434.449	195.39
434.882	127.43
435.316	69.18
435.749	178.4
436.183	105.58
436.616	117.72
437.049	132.28
437.483	120.15
437.916	93.45
438.349	192.96
438.782	137.14
439.215	219.66
439.648	117.72
440.081	95.88
440.514	125
440.947	171.12
441.38	129.86
441.813	108.01
442.245	108.01
442.678	81.31
443.111	185.68
443.543	166.26
443.976	168.69
444.408	144.42
444.841	161.41
445.273	137.14
445.705	190.54
446.138	173.55
446.57	154.13
447.002	197.82
447.434	214.81
447.867	146.85
448.299	214.81
448.731	200.25
449.163	224.52
449.595	134.71
450.026	166.26
450.458	163.84
450.89	226.95
451.322	161.41
451.754	190.54
452.185	243.94
452.617	209.95
453.048	256.07
453.48	144.42
453.911	268.21
454.343	158.98
454.774	205.1
455.205	217.24
455.637	246.36
456.068	192.96
456.499	231.8
456.93	260.93
457.361	217.24
457.792	275.49
458.223	192.96
458.654	171.12
459.085	190.54
459.516	137.14
459.947	141.99
460.378	190.54
460.808	144.42
461.239	173.55
461.669	175.97
462.1	175.97
462.531	185.68
462.961	175.97
463.391	173.55
463.822	139.57
464.252	151.7
464.682	146.85
465.113	180.83
465.543	188.11
465.973	175.97
466.403	205.1
466.833	154.13
467.263	185.68
467.693	117.72
468.123	156.56
468.553	260.93
468.983	192.96
469.412	212.38
469.842	256.07
470.272	161.41
470.701	163.84
471.131	299.76
471.56	239.08
471.99	83.74
472.419	134.71
472.849	171.12
473.278	156.56
473.707	183.26
474.136	166.26
474.566	241.51
474.995	54.61
475.424	161.41
475.853	166.26
476.282	154.13
476.711	224.52
477.14	168.69
477.569	185.68
477.997	146.85
478.426	212.38
478.855	205.1
479.283	222.09
479.712	275.49
480.141	212.38
480.569	197.82
480.998	166.26
481.426	134.71
481.854	192.96
482.283	134.71
482.711	163.84
483.139	173.55
483.567	190.54
483.995	137.14
484.424	185.68
484.852	205.1
485.28	168.69
485.708	212.38
486.135	178.4
486.563	149.27
486.991	158.98
487.419	168.69
487.847	175.97
488.274	134.71
488.702	100.73
489.129	173.55
489.557	151.7
489.984	86.17
490.412	166.26
490.839	183.26
491.266	151.7
491.694	175.97
492.121	122.57
492.548	173.55
492.975	183.26
493.402	195.39
493.829	64.32
494.256	212.38
494.683	195.39
495.11	141.99
495.537	112.87
495.964	141.99
496.39	132.28
496.817	195.39
497.244	212.38
497.67	110.44
498.097	231.8
498.523	137.14
498.95	273.06
499.376	161.41
499.803	149.27
500.229	171.12
500.655	158.98
501.081	202.67
501.508	188.11
501.934	163.84
502.36	173.55
502.786	154.13
503.212	168.69
503.638	108.01
504.064	166.26
504.489	166.26
504.915	125
505.341	139.57
505.767	134.71
506.192	158.98
506.618	180.83
507.043	180.83
507.469	217.24
507.894	129.86
508.32	192.96
508.745	66.75
509.17	161.41
509.596	168.69
510.021	120.15
510.446	173.55
510.871	168.69
511.296	163.84
511.721	122.57
512.146	234.23
512.571	110.44
512.996	200.25
513.421	231.8
513.845	200.25
514.27	154.13
514.695	168.69
515.119	144.42
515.544	141.99
515.969	112.87
516.393	83.74
516.817	197.82
517.242	139.57
517.666	158.98
518.09	108.01
518.515	202.67
518.939	173.55
519.363	360.44
519.787	125
520.211	188.11
520.635	139.57
521.059	173.55
521.483	141.99
521.907	151.7
522.331	110.44
522.754	188.11
523.178	175.97
523.602	178.4
524.025	180.83
524.449	200.25
524.872	127.43
525.296	197.82
525.719	171.12
526.143	151.7
526.566	120.15
526.989	98.3
527.412	173.55
527.836	108.01
528.259	207.53
528.682	190.54
529.105	195.39
529.528	137.14
529.951	175.97
530.374	173.55
530.796	224.52
531.219	229.37
531.642	214.81
532.065	108.01
532.487	139.57
532.91	125
533.332	178.4
533.755	183.26
534.177	158.98
534.6	190.54
535.022	229.37
535.444	200.25
535.867	178.4
536.289	168.69
536.711	180.83
537.133	146.85
537.555	144.42
537.977	161.41
538.399	154.13
538.821	151.7
539.243	115.29
539.665	129.86
540.086	197.82
540.508	158.98
540.93	173.55
541.351	141.99
541.773	183.26
542.195	163.84
542.616	241.51
543.037	234.23
543.459	224.52
543.88	151.7
544.301	166.26
544.723	168.69
545.144	163.84
545.565	125
545.986	243.94
546.407	168.69
546.828	127.43
547.249	236.65
547.67	112.87
548.091	139.57
548.512	171.12
548.932	175.97
549.353	239.08
549.774	214.81
550.194	195.39
550.615	173.55
551.035	197.82
551.456	212.38
551.876	151.7
552.296	202.67
552.717	132.28
553.137	241.51
553.557	180.83
553.977	175.97
554.397	149.27
554.817	183.26
555.237	156.56
555.657	129.86
556.077	214.81
556.497	239.08
556.917	158.98
557.337	166.26
557.756	175.97
558.176	122.57
558.596	139.57
559.015	139.57
559.435	115.29
559.854	222.09
560.274	217.24
560.693	161.41
561.112	141.99
561.532	200.25
561.951	212.38
562.37	183.26
562.789	217.24
563.208	214.81
563.627	234.23
564.046	134.71
564.465	156.56
564.884	141.99
565.303	91.02
565.722	178.4
566.14	93.45
566.559	146.85
566.978	180.83
567.396	146.85
567.815	200.25
568.233	171.12
568.652	151.7
569.07	188.11
569.489	105.58
569.907	134.71
570.325	188.11
570.743	195.39
571.161	173.55
571.58	226.95
571.998	212.38
572.416	144.42
572.833	76.46
573.251	144.42
573.669	173.55
574.087	168.69
574.505	149.27
574.922	132.28
575.34	149.27
575.758	183.26
576.175	156.56
576.593	76.46
577.01	137.14
577.428	156.56
577.845	1807.07
578.262	268.21
578.68	195.39
579.097	200.25
579.514	112.87
579.931	200.25
580.348	146.85
580.765	190.54
581.182	98.3
581.599	219.66
582.016	158.98
582.433	195.39
582.849	180.83
583.266	195.39
583.683	40.05
584.099	144.42
584.516	239.08
584.933	154.13
585.349	161.41
585.765	161.41
586.182	151.7
586.598	144.42
587.014	234.23
587.431	180.83
587.847	222.09
588.263	166.26
588.679	129.86
589.095	205.1
589.511	156.56
589.927	156.56
590.343	112.87
590.759	125
591.174	139.57
591.59	168.69
592.006	190.54
592.421	219.66
592.837	222.09
593.252	197.82
593.668	144.42
594.083	219.66
594.499	122.57
594.914	178.4
595.329	144.42
595.745	137.14
596.16	224.52
596.575	146.85
596.99	151.7
597.405	144.42
597.82	209.95
598.235	190.54
598.65	258.5
599.065	161.41
599.479	185.68
599.894	195.39
600.309	163.84
600.724	253.64
601.138	185.68
601.553	205.1
601.967	110.44
602.382	168.69
602.796	144.42
603.21	154.13
603.625	195.39
604.039	137.14
604.453	120.15
604.867	141.99
605.281	205.1
605.695	71.6
606.109	217.24
606.523	175.97
606.937	195.39
607.351	297.33
607.765	151.7
608.178	205.1
608.592	134.71
609.006	173.55
609.419	197.82
609.833	134.71
610.246	185.68
610.66	219.66
611.073	137.14
611.487	163.84
611.9	188.11
612.313	188.11
612.726	226.95
613.139	171.12
613.553	175.97
613.966	175.97
614.379	236.65
614.792	122.57
615.204	202.67
615.617	161.41
616.03	154.13
616.443	200.25
616.856	144.42
617.268	168.69
617.681	161.41
618.093	125
618.506	231.8
618.918	149.27
619.331	95.88
619.743	122.57
620.155	144.42
620.568	71.6
620.98	168.69
621.392	195.39
621.804	231.8
622.216	175.97
622.628	178.4
623.04	175.97
623.452	166.26
623.864	86.17
624.276	178.4
624.687	185.68
625.099	197.82
625.511	178.4
625.922	146.85
626.334	103.16
626.745	129.86
627.157	149.27
627.568	231.8
627.979	154.13
628.391	158.98
628.802	146.85
629.213	185.68
629.624	166.26
630.035	180.83
630.446	188.11
630.857	175.97
631.268	158.98
631.679	212.38
632.09	205.1
632.501	188.11
632.912	166.26
633.322	231.8
633.733	115.29
634.144	161.41
634.554	214.81
634.965	180.83
635.375	166.26
635.785	188.11
636.196	205.1
636.606	190.54
637.016	137.14
637.427	151.7
637.837	161.41
638.247	154.13
638.657	122.57
639.067	127.43
639.477	120.15
639.887	229.37
640.297	137.14
640.706	183.26
641.116	122.57
641.526	202.67
641.935	105.58
642.345	81.31
642.755	115.29
643.164	110.44
643.573	188.11
643.983	188.11
644.392	190.54
644.801	125
645.211	161.41
645.62	134.71
646.029	168.69
646.438	149.27
646.847	168.69
647.256	149.27
647.665	71.6
648.074	205.1
648.483	88.59
648.892	234.23
649.3	134.71
649.709	112.87
650.118	197.82
650.526	175.97
650.935	166.26
651.343	180.83
651.752	163.84
652.16	175.97
652.568	180.83
652.977	219.66
653.385	156.56
653.793	151.7
654.201	149.27
654.609	236.65
655.017	134.71
655.425	163.84
655.833	166.26
656.241	158.98
656.649	205.1
657.057	154.13
657.464	166.26
657.872	156.56
658.28	125
658.687	103.16
659.095	146.85
659.502	125
659.91	88.59
660.317	146.85
660.724	103.16
661.132	146.85
661.539	183.26
661.946	166.26
662.353	154.13
662.76	212.38
663.167	127.43
663.574	134.71
663.981	163.84
664.388	132.28
664.795	137.14
665.202	241.51
665.608	161.41
666.015	122.57
666.422	168.69
666.828	161.41
667.235	200.25
667.641	132.28
668.047	168.69
668.454	93.45
668.86	183.26
669.266	134.71
669.673	149.27
670.079	66.75
670.485	144.42
670.891	161.41
671.297	192.96
671.703	178.4
672.109	110.44
672.515	180.83
672.92	168.69
673.326	105.58
673.732	132.28
674.138	154.13
674.543	125
674.949	78.88
675.354	190.54
675.76	120.15
676.165	93.45
676.57	161.41
676.976	163.84
677.381	108.01
677.786	100.73
678.191	188.11
678.596	137.14
679.001	144.42
679.406	86.17
679.811	134.71
680.216	224.52
680.621	185.68
681.026	129.86
681.43	163.84
681.835	149.27
682.24	163.84
682.644	178.4
683.049	149.27
683.453	178.4
683.858	139.57
684.262	91.02
684.667	205.1
685.071	209.95
685.475	115.29
685.879	144.42
686.283	173.55
686.687	151.7
687.091	197.82
687.495	197.82
687.899	200.25
688.303	98.3
688.707	188.11
689.111	161.41
689.514	144.42
689.918	195.39
690.322	137.14
690.725	178.4
691.129	134.71
691.532	183.26
691.936	192.96
692.339	115.29
692.742	105.58
693.146	137.14
693.549	183.26
693.952	190.54
694.355	156.56
694.758	146.85
695.161	144.42
695.564	156.56
695.967	112.87
696.37	125
696.773	260.93
697.175	229.37
697.578	93.45
697.981	183.26
698.383	103.16
698.786	71.6
699.188	132.28
699.591	168.69
699.993	112.87
700.395	139.57
700.798	95.88
701.2	180.83
701.602	183.26
702.004	202.67
702.406	158.98
702.808	132.28
703.21	137.14
703.612	105.58
704.014	197.82
704.416	149.27
704.818	207.53
705.219	127.43
705.621	149.27
706.023	190.54
706.424	156.56
706.826	125
707.227	185.68
707.629	115.29
708.03	185.68
708.431	214.81
708.832	108.01
709.234	129.86
709.635	222.09
710.036	144.42
710.437	200.25
710.838	183.26
711.239	207.53
711.64	195.39
712.041	149.27
712.441	163.84
712.842	183.26
713.243	205.1
713.643	207.53
714.044	200.25
714.445	188.11
714.845	183.26
715.246	251.22
715.646	241.51
716.046	209.95
716.447	214.81
716.847	195.39
717.247	93.45
717.647	253.64
718.047	175.97
718.447	280.34
718.847	231.8
719.247	314.33
719.647	239.08
720.047	195.39
720.446	173.55
720.846	195.39
721.246	258.5
721.645	212.38
722.045	195.39
722.444	197.82
722.844	243.94
723.243	260.93
723.643	253.64
724.042	224.52
724.441	246.36
724.84	197.82
725.24	273.06
725.639	217.24
726.038	311.9
726.437	246.36
726.836	275.49
727.234	268.21
727.633	287.63
728.032	273.06
728.431	260.93
728.83	236.65
729.228	294.91
729.627	319.18
730.025	268.21
730.424	338.6
730.822	392
731.22	336.17
731.619	377.43
732.017	435.69
732.415	406.56
732.813	418.7
733.212	408.99
733.61	561.9
734.008	532.78
734.406	583.75
734.803	525.49
735.201	610.45
735.599	675.98
735.997	683.26
736.395	588.6
736.792	734.23
737.19	775.5
737.587	838.61
737.985	879.87
738.382	850.74
738.78	959.97
739.177	916.28
739.574	952.68
739.971	1042.49
740.369	1120.16
740.766	1200.26
741.163	1205.12
741.56	1168.71
741.957	1166.28
742.354	1285.21
742.751	1370.17
743.147	1462.4
743.544	1464.83
743.941	1459.97
744.338	1530.36
744.734	1642.02
745.131	1659.01
745.527	1858.04
745.924	1865.32
746.32	1928.43
746.716	2008.53
747.113	2209.99
747.509	2256.1
747.905	2316.78
748.301	2574.07
748.697	2530.38
749.093	2763.39
749.489	2671.16
749.885	2811.94
750.281	3103.2
750.677	3214.86
751.073	3302.24
751.468	3462.43
751.864	3532.82
752.26	3559.52
752.655	3666.32
753.051	3875.06
753.446	3996.42
753.842	4248.85
754.237	4299.82
754.632	4455.17
755.028	4559.54
755.423	4676.04
755.818	4639.64
756.213	4816.82
756.608	5008.57
757.003	5081.39
757.398	5171.2
757.793	5125.08
758.188	5071.68
758.583	5258.58
758.977	5338.68
759.372	5445.47
759.767	5899.36
760.161	6282.86
760.556	6639.67
760.95	6707.63
761.345	6984.33
761.739	7197.93
762.133	7591.14
762.527	7855.7
762.922	7676.09
763.316	8270.76
763.71	8457.66
764.104	8613
764.498	8712.51
764.892	8877.57
765.286	9127.57
765.68	9506.22
766.073	9545.05
766.467	9503.79
766.861	9773.21
767.255	10035.35
767.648	10748.95
768.042	10690.7
768.435	10763.52
768.829	10848.47
769.222	11032.94
769.615	11382.46
770.008	11409.16
770.402	11372.75
770.795	11423.72
771.188	11707.71
771.581	11826.64
771.974	11627.61
772.367	11353.33
772.76	11780.52
773.153	11625.18
773.545	11579.06
773.938	11598.48
774.331	11761.11
774.724	12115.48
775.116	12867.92
775.509	13239.28
775.901	13559.68
776.294	13591.23
776.686	13537.83
777.078	14450.47
777.471	14479.59
777.863	15389.8
778.255	15093.68
778.647	15727.19
779.039	15620.39
779.431	15986.9
779.823	16091.27
780.215	15804.86
780.607	15865.54
780.999	15984.47
781.39	16850.99
781.782	16642.25
782.174	16739.34
782.565	16406.81
782.957	16972.35
783.348	17496.63
783.74	17489.35
784.131	17205.36
784.522	17011.19
784.914	16809.73
785.305	16870.41
785.696	17319.44
786.087	17081.58
786.478	16445.64
786.869	15897.09
787.26	15649.52
787.651	15300
788.042	15448.06
788.433	15300
788.823	14455.32
789.214	14054.83
789.605	13921.33
789.995	13702.88
790.386	13729.58
790.776	13384.92
791.167	13144.62
791.557	13639.78
791.948	13943.18
792.338	14404.35
792.728	14535.42
793.118	14489.3
793.508	14171.34
793.898	14246.58
794.288	14671.34
794.678	14717.46
795.068	14785.42
795.458	14134.93
795.848	14234.44
796.238	14377.65
796.627	14168.91
797.017	14266
797.406	14443.19
797.796	14472.31
798.185	14181.05
798.575	13911.62
798.964	14156.77
799.354	14525.71
799.743	14600.96
800.132	14799.99
800.521	14183.47
800.91	14270.85
801.299	14217.45
801.688	14367.94
802.077	14241.73
802.466	14105.8
802.855	13753.85
803.244	13134.91
803.633	13144.62
804.021	12911.61
804.41	13130.06
804.799	12940.74
805.187	12503.84
805.576	11819.36
805.964	11802.37
806.352	10998.96
806.741	10974.69
807.129	11066.92
807.517	11316.92
807.905	11173.72
808.293	10722.25
808.681	10829.05
809.069	11018.38
809.457	11227.12
809.845	11251.39
810.233	11406.73
810.621	11523.24
811.009	11193.14
811.396	10989.25
811.784	11161.58
812.171	11018.38
812.559	11239.25
812.946	11054.78
813.334	10571.77
813.721	10214.96
814.108	9875.15
814.496	10103.31
814.883	9918.84
815.27	10409.14
815.657	10241.66
816.044	10299.92
816.431	10083.89
816.818	9775.64
817.205	9484.37
817.592	9872.73
817.979	9421.26
818.365	9426.12
818.752	9103.3
819.139	8593.58
819.525	8530.47
819.912	8275.61
820.298	8307.17
820.685	7994.06
821.071	7935.8
821.457	7639.68
821.843	7569.29
822.23	7251.33
822.616	6722.19
823.002	6345.97
823.388	6256.17
823.774	6115.39
824.16	6054.71
824.546	5887.23
824.931	5649.36
825.317	5336.25
825.703	5343.53
826.089	5168.77
826.474	5336.25
826.86	5241.59
827.245	5362.95
827.631	5268.29
828.016	4994.01
828.401	4761
828.787	4620.22
829.172	4557.11
829.557	4469.73
829.942	4409.05
830.327	4506.14
830.712	4360.5
831.097	4086.23
831.482	3926.03
831.867	3865.35
832.252	3814.38
832.636	3758.55
833.021	3707.58
833.406	3753.7
833.79	3603.21
834.175	3542.53
834.559	3527.97
834.944	3166.31
835.328	3173.59
835.713	3105.63
836.097	3117.77
836.481	3030.39
836.865	3020.68
837.249	2901.74
837.633	2862.91
838.017	2680.87
838.401	2464.84
838.785	2367.76
839.169	2309.5
839.553	2345.91
839.937	2154.16
840.32	2239.11
840.704	2105.62
841.087	2025.52
841.471	1921.15
841.854	1811.92
842.238	1683.28
842.621	1620.17
843.004	1690.56
843.388	1673.57
843.771	1746.39
844.154	1637.16
844.537	1593.47
844.92	1544.93
845.303	1569.2
845.686	1445.41
846.069	1425.99
846.452	1348.32
846.834	1328.9
847.217	1411.43
847.6	1384.73
847.982	1435.7
848.365	1367.74
848.748	1241.52
849.13	1110.45
849.512	1132.3
849.895	1185.7
850.277	1013.37
850.659	1086.18
851.041	1078.9
851.423	1076.47
851.806	1110.45
852.188	1006.08
852.57	1064.34
852.951	904.14
853.333	935.69
853.715	947.83
854.097	896.86
854.479	889.58
854.86	933.27
855.242	833.75
855.623	780.35
856.005	819.19
856.386	751.23
856.768	705.11
857.149	658.99
857.53	654.14
857.911	632.29
858.292	629.86
858.674	705.11
859.055	600.74
859.436	658.99
859.817	588.6
860.197	561.9
860.578	493.94
860.959	525.49
861.34	467.24
861.72	481.8
862.101	476.95
862.482	481.8
862.862	496.37
863.243	399.28
863.623	442.97
864.003	394.42
864.384	467.24
864.764	319.18
865.144	406.56
865.524	392
865.904	428.4
866.284	277.92
866.664	423.55
867.044	353.16
867.424	382.29
867.804	362.87
868.183	384.71
868.563	309.47
868.943	408.99
869.322	260.93
869.702	331.32
870.081	212.38
870.461	299.76
870.84	370.15
871.22	277.92
871.599	294.91
871.978	287.63
872.357	314.33
872.736	365.3
873.115	297.33
873.494	236.65
873.873	214.81
874.252	212.38
874.631	282.77
875.01	180.83
875.388	362.87
875.767	192.96
876.146	265.78
876.524	195.39
876.903	207.53
877.281	268.21
877.66	197.82
878.038	146.85
878.416	175.97
878.794	188.11
879.173	241.51
879.551	224.52
879.929	183.26
880.307	229.37
880.685	209.95
881.063	290.05
881.441	200.25
881.818	202.67
882.196	146.85
882.574	188.11
882.951	151.7
883.329	108.01
883.707	197.82
884.084	175.97
884.461	175.97
884.839	158.98
885.216	207.53
885.593	168.69
885.971	100.73
886.348	197.82
886.725	103.16
887.102	117.72
887.479	200.25
887.856	161.41
888.233	110.44
888.609	209.95
888.986	190.54
889.363	69.18
889.74	161.41
890.116	251.22
890.493	112.87
890.869	173.55
891.246	171.12
891.622	180.83
891.998	115.29
892.375	229.37
892.751	173.55
893.127	129.86
893.503	192.96
893.879	110.44
894.255	217.24
894.631	163.84
895.007	139.57
895.383	163.84
895.759	144.42
896.134	120.15
896.51	168.69
896.886	120.15
897.261	137.14
897.637	112.87
898.012	163.84
898.388	192.96
898.763	100.73
899.138	154.13
899.514	129.86
899.889	134.71
900.264	146.85
900.639	222.09
901.014	154.13
901.389	108.01
901.764	146.85
902.139	144.42
902.513	115.29
902.888	149.27
903.263	149.27
903.638	112.87
904.012	171.12
904.387	151.7
904.761	103.16
905.136	137.14
905.51	161.41
905.884	156.56
906.259	125
906.633	127.43
907.007	156.56
907.381	185.68
907.755	178.4
908.129	175.97
908.503	127.43
908.877	122.57
909.251	105.58
909.624	105.58
909.998	137.14
910.372	139.57
910.745	125
911.119	125
911.492	105.58
911.866	115.29
912.239	149.27
912.612	214.81
912.986	125
913.359	117.72
913.732	83.74
914.105	175.97
914.478	188.11
914.851	120.15
915.224	168.69
915.597	171.12
915.97	149.27
916.343	171.12
916.715	144.42
917.088	122.57
917.461	151.7
917.833	168.69
918.206	163.84
918.578	200.25
918.951	146.85
919.323	161.41
919.695	178.4
920.067	205.1
920.44	146.85
920.812	103.16
921.184	146.85
921.556	226.95
921.928	156.56
922.3	122.57
922.672	144.42
923.043	108.01
923.415	219.66
923.787	163.84
924.158	180.83
924.53	180.83
924.901	190.54
925.273	202.67
925.644	132.28
926.016	149.27
926.387	71.6
926.758	125
927.129	129.86
927.5	127.43
927.872	137.14
928.243	154.13
928.613	185.68
928.984	100.73
929.355	129.86
929.726	86.17
930.097	129.86
930.467	127.43
930.838	163.84
931.209	190.54
931.579	178.4
931.95	120.15
932.32	105.58
932.69	144.42
933.061	103.16
933.431	115.29
933.801	195.39
934.171	86.17
934.541	168.69
934.911	197.82
935.281	134.71
935.651	158.98
936.021	151.7
936.391	88.59
936.761	144.42
937.13	212.38
937.5	132.28
937.87	144.42
938.239	141.99
938.609	158.98
938.978	175.97
939.347	180.83
939.717	110.44
940.086	154.13
940.455	207.53
940.824	76.46
941.193	161.41
941.562	173.55
941.931	103.16
942.3	260.93
942.669	197.82
943.038	112.87
943.407	120.15
943.775	132.28
944.144	168.69
944.513	166.26
944.881	93.45
945.25	105.58
945.618	173.55
945.986	195.39
946.355	93.45
946.723	161.41
947.091	139.57
947.459	183.26
947.827	195.39
948.195	141.99
948.563	139.57
948.931	95.88
949.299	117.72
949.667	137.14
950.035	151.7
950.402	156.56
950.77	105.58
951.138	110.44
951.505	127.43
951.873	144.42
952.24	98.3
952.607	149.27
952.975	6.07
953.342	163.84
953.709	161.41
954.076	108.01
954.443	110.44
954.81	222.09
955.177	110.44
955.544	110.44
955.911	151.7
956.278	146.85
956.645	110.44
957.012	185.68
957.378	127.43
957.745	122.57
958.111	158.98
958.478	144.42
958.844	151.7
959.211	95.88
959.577	168.69
959.943	185.68
960.309	251.22
960.675	144.42
961.042	141.99
961.408	149.27
961.774	156.56
962.139	185.68
962.505	103.16
962.871	120.15
963.237	149.27
963.603	112.87
963.968	195.39
964.334	129.86
964.699	95.88
965.065	117.72
965.43	112.87
965.796	161.41
966.161	112.87
966.526	154.13
966.891	151.7
967.256	144.42
967.622	139.57
967.987	154.13
968.352	127.43
968.716	71.6
969.081	141.99
969.446	112.87
969.811	141.99
970.176	161.41
970.54	185.68
970.905	64.32
971.269	180.83
971.634	141.99
971.998	105.58
972.363	74.03
972.727	151.7
973.091	125
973.455	154.13
973.819	91.02
974.183	88.59
974.547	183.26
974.911	141.99
975.275	108.01
975.639	120.15
976.003	200.25
976.367	134.71
976.73	141.99
977.094	163.84
977.458	161.41
977.821	69.18
978.185	168.69
978.548	78.88
978.911	117.72
979.275	173.55
979.638	76.46
980.001	168.69
980.364	139.57
980.727	161.41
981.09	139.57
981.453	141.99
981.816	168.69
982.179	263.35
982.542	180.83
982.905	151.7
983.267	129.86
983.63	117.72
983.992	156.56
984.355	154.13
984.717	103.16
985.08	108.01
985.442	100.73
985.804	141.99
986.167	144.42
986.529	108.01
986.891	141.99
987.253	122.57
987.615	98.3
987.977	127.43
988.339	103.16
988.701	178.4
989.062	154.13
989.424	98.3
989.786	144.42
990.147	173.55
990.509	139.57
990.87	158.98
991.232	144.42
991.593	154.13
991.955	98.3
992.316	151.7
992.677	86.17
993.038	134.71
993.399	158.98
993.76	110.44
994.121	120.15
994.482	93.45
994.843	217.24
995.204	139.57
995.565	108.01
995.926	83.74
996.286	178.4
996.647	134.71
997.007	115.29
997.368	134.71
997.728	154.13
998.089	217.24
998.449	151.7
998.809	139.57
999.169	137.14
999.53	120.15
999.89	95.88
1000.25	129.86
1000.61	195.39
1000.97	149.27
1001.329	168.69
1001.689	110.44
1002.049	149.27
1002.409	149.27
1002.768	132.28
1003.128	86.17
1003.487	120.15
1003.847	168.69
1004.206	86.17
1004.566	146.85
1004.925	163.84
1005.284	185.68
1005.643	149.27
1006.003	168.69
1006.362	168.69
1006.721	141.99
1007.08	132.28
1007.438	178.4
1007.797	132.28
1008.156	61.89
1008.515	115.29
1008.874	178.4
1009.232	129.86
1009.591	149.27
1009.949	129.86
1010.308	175.97
1010.666	149.27
1011.024	129.86
1011.383	103.16
1011.741	122.57
1012.099	110.44
1012.457	122.57
1012.815	236.65
1013.173	115.29
1013.531	117.72
1013.889	66.75
1014.247	115.29
1014.605	161.41
1014.962	168.69
1015.32	168.69
1015.678	139.57
1016.035	156.56
1016.393	127.43
1016.75	112.87
1017.107	132.28
1017.465	173.55
1017.822	190.54
1018.179	141.99
1018.536	69.18
1018.894	66.75
1019.251	229.37
1019.608	76.46
1019.964	205.1
1020.321	93.45
1020.678	161.41
1021.035	166.26
1021.392	180.83
1021.748	88.59
1022.105	137.14
1022.461	168.69
1022.818	205.1
1023.174	183.26
1023.531	115.29
1023.887	125
1024.243	125
1024.599	122.57
1024.955	117.72
1025.311	163.84
1025.667	129.86
1026.023	156.56
1026.379	108.01
1026.735	112.87
1027.091	54.61
1027.447	86.17
