189.514	91.48
189.973	91.48
190.431	91.48
190.889	47.79
191.348	-22.6
191.806	-12.89
192.264	-15.32
192.722	16.23
193.18	-39.59
193.638	-32.31
194.096	38.08
194.554	-46.88
195.012	-20.18
195.47	-25.03
195.928	35.65
196.385	-12.89
196.843	8.95
197.301	50.21
197.758	-15.32
198.216	-27.46
198.674	89.05
199.131	-3.19
199.589	62.35
200.046	-44.45
200.503	72.06
200.961	62.35
201.418	67.2
201.875	72.06
202.332	103.61
202.79	33.22
203.247	79.34
203.704	210.41
204.161	176.43
204.618	181.28
205.075	103.61
205.532	164.29
205.989	120.6
206.445	154.58
206.902	164.29
207.359	183.71
207.816	115.75
208.272	144.87
208.729	132.74
209.185	140.02
209.642	159.44
210.098	147.3
210.555	142.45
211.011	190.99
211.467	147.3
211.924	176.43
212.38	203.13
212.836	164.29
213.292	227.4
213.748	147.3
214.204	103.61
214.66	178.86
215.116	110.89
215.572	144.87
216.028	91.48
216.484	164.29
216.94	198.27
217.396	135.17
217.851	157.01
218.307	132.74
218.763	198.27
219.218	161.87
219.674	178.86
220.129	115.75
220.585	152.16
221.04	142.45
221.496	106.04
221.951	108.47
222.406	25.94
222.861	123.03
223.317	152.16
223.772	157.01
224.227	45.36
224.682	174
225.137	120.6
225.592	186.14
226.047	176.43
226.502	123.03
226.957	193.42
227.411	241.96
227.866	125.46
228.321	178.86
228.776	140.02
229.23	164.29
229.685	132.74
230.139	113.32
230.594	183.71
231.048	207.98
231.503	174
231.957	110.89
232.411	91.48
232.865	118.18
233.32	67.2
233.774	157.01
234.228	127.88
234.682	123.03
235.136	135.17
235.59	135.17
236.044	101.18
236.498	169.15
236.952	137.59
237.406	149.73
237.86	174
238.313	120.6
238.767	161.87
239.221	132.74
239.674	174
240.128	98.76
240.581	152.16
241.035	188.56
241.488	137.59
241.942	144.87
242.395	188.56
242.848	84.19
243.301	142.45
243.755	120.6
244.208	149.73
244.661	171.57
245.114	186.14
245.567	118.18
246.02	132.74
246.473	130.31
246.926	142.45
247.379	98.76
247.832	161.87
248.284	176.43
248.737	186.14
249.19	174
249.642	132.74
250.095	149.73
250.547	190.99
251	181.28
251.452	137.59
251.905	132.74
252.357	132.74
252.81	207.98
253.262	91.48
253.714	178.86
254.166	174
254.618	140.02
255.07	169.15
255.523	103.61
255.975	174
256.427	110.89
256.878	93.9
257.33	137.59
257.782	137.59
258.234	222.55
258.686	181.28
259.137	193.42
259.589	16.23
260.041	171.57
260.492	154.58
260.944	132.74
261.395	144.87
261.847	178.86
262.298	140.02
262.749	69.63
263.201	178.86
263.652	157.01
264.103	96.33
264.554	224.97
265.005	152.16
265.457	159.44
265.908	137.59
266.359	115.75
266.809	137.59
267.26	127.88
267.711	137.59
268.162	176.43
268.613	178.86
269.064	127.88
269.514	86.62
269.965	120.6
270.415	169.15
270.866	125.46
271.316	176.43
271.767	198.27
272.217	200.7
272.668	186.14
273.118	123.03
273.568	91.48
274.019	154.58
274.469	178.86
274.919	149.73
275.369	110.89
275.819	130.31
276.269	157.01
276.719	110.89
277.169	152.16
277.619	118.18
278.069	171.57
278.518	130.31
278.968	159.44
279.418	125.46
279.867	152.16
280.317	174
280.767	76.91
281.216	159.44
281.666	110.89
282.115	125.46
282.564	86.62
283.014	132.74
283.463	212.84
283.912	169.15
284.361	215.26
284.811	159.44
285.26	227.4
285.709	220.12
286.158	178.86
286.607	157.01
287.056	171.57
287.505	181.28
287.953	166.72
288.402	169.15
288.851	144.87
289.3	149.73
289.748	110.89
290.197	132.74
290.646	152.16
291.094	164.29
291.543	186.14
291.991	227.4
292.439	186.14
292.888	190.99
293.336	190.99
293.784	127.88
294.233	157.01
294.681	176.43
295.129	159.44
295.577	149.73
296.025	86.62
296.473	183.71
296.921	178.86
297.369	101.18
297.817	135.17
298.264	157.01
298.712	152.16
299.16	110.89
299.608	110.89
300.055	140.02
300.503	171.57
300.95	210.41
301.398	125.46
301.845	110.89
302.293	132.74
302.74	98.76
303.187	157.01
303.635	178.86
304.082	154.58
304.529	120.6
304.976	193.42
305.423	181.28
305.87	188.56
306.317	178.86
306.764	123.03
307.211	212.84
307.658	188.56
308.105	144.87
308.552	147.3
308.998	229.83
309.445	164.29
309.892	118.18
310.338	123.03
310.785	137.59
311.231	137.59
311.678	125.46
312.124	147.3
312.571	215.26
313.017	147.3
313.463	74.49
313.909	144.87
314.356	220.12
314.802	157.01
315.248	130.31
315.694	108.47
316.14	115.75
316.586	188.56
317.032	176.43
317.478	67.2
317.923	227.4
318.369	147.3
318.815	154.58
319.261	149.73
319.706	135.17
320.152	159.44
320.597	149.73
321.043	183.71
321.488	130.31
321.934	164.29
322.379	127.88
322.824	110.89
323.27	166.72
323.715	135.17
324.16	127.88
324.605	144.87
325.05	183.71
325.495	110.89
325.94	166.72
326.385	157.01
326.83	195.85
327.275	149.73
327.72	132.74
328.165	106.04
328.61	137.59
329.054	137.59
329.499	93.9
329.943	183.71
330.388	174
330.832	135.17
331.277	159.44
331.721	154.58
332.166	135.17
332.61	200.7
333.054	166.72
333.499	166.72
333.943	142.45
334.387	174
334.831	142.45
335.275	110.89
335.719	166.72
336.163	132.74
336.607	188.56
337.051	181.28
337.495	190.99
337.938	203.13
338.382	203.13
338.826	164.29
339.269	237.11
339.713	115.75
340.157	144.87
340.6	174
341.044	152.16
341.487	154.58
341.93	120.6
342.374	147.3
342.817	98.76
343.26	135.17
343.703	101.18
344.146	132.74
344.59	76.91
345.033	159.44
345.476	181.28
345.919	166.72
346.361	164.29
346.804	113.32
347.247	205.56
347.69	193.42
348.133	190.99
348.575	193.42
349.018	152.16
349.461	159.44
349.903	195.85
350.346	125.46
350.788	132.74
351.23	152.16
351.673	159.44
352.115	137.59
352.557	98.76
353	169.15
353.442	183.71
353.884	149.73
354.326	147.3
354.768	149.73
355.21	149.73
355.652	142.45
356.094	164.29
356.536	251.67
356.978	200.7
357.419	137.59
357.861	159.44
358.303	120.6
358.744	110.89
359.186	210.41
359.627	110.89
360.069	178.86
360.51	120.6
360.952	149.73
361.393	159.44
361.834	190.99
362.276	178.86
362.717	118.18
363.158	89.05
363.599	157.01
364.04	152.16
364.481	125.46
364.922	174
365.363	118.18
365.804	178.86
366.245	154.58
366.686	142.45
367.126	200.7
367.567	186.14
368.008	76.91
368.448	93.9
368.889	149.73
369.33	108.47
369.77	178.86
370.21	120.6
370.651	222.55
371.091	193.42
371.531	118.18
371.972	120.6
372.412	108.47
372.852	149.73
373.292	166.72
373.732	127.88
374.172	103.61
374.612	108.47
375.052	154.58
375.492	171.57
375.932	125.46
376.372	123.03
376.811	118.18
377.251	132.74
377.691	207.98
378.13	171.57
378.57	246.82
379.009	188.56
379.449	152.16
379.888	166.72
380.328	186.14
380.767	140.02
381.206	149.73
381.645	186.14
382.085	149.73
382.524	174
382.963	118.18
383.402	166.72
383.841	152.16
384.28	154.58
384.719	176.43
385.158	190.99
385.596	188.56
386.035	198.27
386.474	183.71
386.913	108.47
387.351	164.29
387.79	115.75
388.228	137.59
388.667	135.17
389.105	246.82
389.544	157.01
389.982	176.43
390.42	101.18
390.859	135.17
391.297	152.16
391.735	115.75
392.173	108.47
392.611	47.79
393.049	161.87
393.487	132.74
393.925	171.57
394.363	207.98
394.801	176.43
395.239	115.75
395.676	176.43
396.114	183.71
396.552	181.28
396.989	159.44
397.427	186.14
397.864	140.02
398.302	93.9
398.739	181.28
399.177	227.4
399.614	193.42
400.051	118.18
400.488	159.44
400.926	106.04
401.363	147.3
401.8	123.03
402.237	159.44
402.674	93.9
403.111	159.44
403.548	142.45
403.985	152.16
404.421	125.46
404.858	159.44
405.295	198.27
405.732	106.04
406.168	157.01
406.605	229.83
407.041	135.17
407.478	183.71
407.914	142.45
408.351	142.45
408.787	142.45
409.223	183.71
409.66	120.6
410.096	89.05
410.532	171.57
410.968	140.02
411.404	215.26
411.84	169.15
412.276	193.42
412.712	183.71
413.148	198.27
413.584	205.56
414.02	154.58
414.455	123.03
414.891	164.29
415.327	120.6
415.762	140.02
416.198	118.18
416.633	67.2
417.069	169.15
417.504	108.47
417.94	227.4
418.375	123.03
418.81	176.43
419.245	98.76
419.681	147.3
420.116	149.73
420.551	142.45
420.986	234.68
421.421	169.15
421.856	152.16
422.291	154.58
422.726	147.3
423.16	212.84
423.595	106.04
424.03	210.41
424.464	118.18
424.899	101.18
425.334	174
425.768	84.19
426.203	135.17
426.637	203.13
427.071	171.57
427.506	98.76
427.94	142.45
428.374	127.88
428.809	176.43
429.243	171.57
429.677	164.29
430.111	174
430.545	159.44
430.979	186.14
431.413	198.27
431.847	152.16
432.28	103.61
432.714	159.44
433.148	103.61
433.582	198.27
434.015	135.17
434.449	147.3
434.882	135.17
435.316	193.42
435.749	169.15
436.183	125.46
436.616	130.31
437.049	207.98
437.483	142.45
437.916	123.03
438.349	135.17
438.782	212.84
439.215	212.84
439.648	147.3
440.081	164.29
440.514	200.7
440.947	178.86
441.38	135.17
441.813	166.72
442.245	207.98
442.678	93.9
443.111	159.44
443.543	135.17
443.976	205.56
444.408	132.74
444.841	159.44
445.273	178.86
445.705	115.75
446.138	190.99
446.57	210.41
447.002	176.43
447.434	198.27
447.867	154.58
448.299	144.87
448.731	229.83
449.163	210.41
449.595	147.3
450.026	195.85
450.458	174
450.89	195.85
451.322	210.41
451.754	268.66
452.185	239.54
452.617	256.53
453.048	164.29
453.48	195.85
453.911	181.28
454.343	174
454.774	232.25
455.205	275.94
455.637	205.56
456.068	249.25
456.499	249.25
456.93	229.83
457.361	251.67
457.792	210.41
458.223	220.12
458.654	161.87
459.085	186.14
459.516	212.84
459.947	224.97
460.378	200.7
460.808	178.86
461.239	215.26
461.669	149.73
462.1	271.09
462.531	210.41
462.961	288.08
463.391	210.41
463.822	237.11
464.252	193.42
464.682	207.98
465.113	135.17
465.543	203.13
465.973	195.85
466.403	166.72
466.833	193.42
467.263	169.15
467.693	261.38
468.123	220.12
468.553	198.27
468.983	249.25
469.412	186.14
469.842	283.23
470.272	246.82
470.701	292.94
471.131	263.81
471.56	224.97
471.99	137.59
472.419	174
472.849	190.99
473.278	140.02
473.707	273.52
474.136	212.84
474.566	239.54
474.995	186.14
475.424	241.96
475.853	217.69
476.282	183.71
476.711	183.71
477.14	220.12
477.569	166.72
477.997	137.59
478.426	186.14
478.855	195.85
479.283	181.28
479.712	266.24
480.141	229.83
480.569	110.89
480.998	178.86
481.426	203.13
481.854	205.56
482.283	149.73
482.711	152.16
483.139	195.85
483.567	280.8
483.995	137.59
484.424	166.72
484.852	190.99
485.28	205.56
485.708	166.72
486.135	135.17
486.563	188.56
486.991	193.42
487.419	152.16
487.847	169.15
488.274	171.57
488.702	171.57
489.129	144.87
489.557	181.28
489.984	217.69
490.412	176.43
490.839	186.14
491.266	135.17
491.694	183.71
492.121	222.55
492.548	183.71
492.975	232.25
493.402	140.02
493.829	181.28
494.256	200.7
494.683	239.54
495.11	161.87
495.537	273.52
495.964	161.87
496.39	258.95
496.817	101.18
497.244	118.18
497.67	222.55
498.097	164.29
498.523	74.49
498.95	178.86
499.376	164.29
499.803	161.87
500.229	178.86
500.655	142.45
501.081	171.57
501.508	188.56
501.934	159.44
502.36	215.26
502.786	164.29
503.212	203.13
503.638	96.33
504.064	142.45
504.489	125.46
504.915	198.27
505.341	152.16
505.767	152.16
506.192	169.15
506.618	212.84
507.043	157.01
507.469	135.17
507.894	154.58
508.32	98.76
508.745	130.31
509.17	217.69
509.596	183.71
510.021	157.01
510.446	188.56
510.871	176.43
511.296	166.72
511.721	246.82
512.146	135.17
512.571	195.85
512.996	198.27
513.421	166.72
513.845	149.73
514.27	161.87
514.695	195.85
515.119	210.41
515.544	171.57
515.969	113.32
516.393	198.27
516.817	178.86
517.242	118.18
517.666	193.42
518.09	135.17
518.515	106.04
518.939	144.87
519.363	414.3
519.787	207.98
520.211	127.88
520.635	261.38
521.059	224.97
521.483	152.16
521.907	232.25
522.331	207.98
522.754	164.29
523.178	123.03
523.602	164.29
524.025	261.38
524.449	232.25
524.872	181.28
525.296	171.57
525.719	154.58
526.143	174
526.566	101.18
526.989	224.97
527.412	186.14
527.836	147.3
528.259	103.61
528.682	144.87
529.105	198.27
529.528	249.25
529.951	157.01
530.374	152.16
530.796	212.84
531.219	195.85
531.642	176.43
532.065	108.47
532.487	147.3
532.91	159.44
533.332	210.41
533.755	174
534.177	212.84
534.6	110.89
535.022	171.57
535.444	198.27
535.867	149.73
536.289	174
536.711	50.21
537.133	132.74
537.555	229.83
537.977	171.57
538.399	132.74
538.821	210.41
539.243	169.15
539.665	137.59
540.086	241.96
540.508	169.15
540.93	169.15
541.351	137.59
541.773	118.18
542.195	188.56
542.616	227.4
543.037	198.27
543.459	232.25
543.88	256.53
544.301	193.42
544.723	258.95
545.144	229.83
545.565	166.72
545.986	249.25
546.407	188.56
546.828	127.88
547.249	178.86
547.67	169.15
548.091	205.56
548.512	176.43
548.932	159.44
549.353	190.99
549.774	193.42
550.194	164.29
550.615	237.11
551.035	186.14
551.456	142.45
551.876	220.12
552.296	178.86
552.717	164.29
553.137	132.74
553.557	157.01
553.977	161.87
554.397	186.14
554.817	178.86
555.237	200.7
555.657	127.88
556.077	130.31
556.497	132.74
556.917	142.45
557.337	113.32
557.756	266.24
558.176	186.14
558.596	127.88
559.015	135.17
559.435	222.55
559.854	161.87
560.274	142.45
560.693	135.17
561.112	149.73
561.532	144.87
561.951	147.3
562.37	261.38
562.789	149.73
563.208	183.71
563.627	178.86
564.046	174
564.465	157.01
564.884	195.85
565.303	101.18
565.722	161.87
566.14	181.28
566.559	157.01
566.978	154.58
567.396	106.04
567.815	220.12
568.233	246.82
568.652	212.84
569.07	227.4
569.489	171.57
569.907	178.86
570.325	169.15
570.743	164.29
571.161	52.64
571.58	161.87
571.998	220.12
572.416	137.59
572.833	217.69
573.251	130.31
573.669	161.87
574.087	137.59
574.505	113.32
574.922	186.14
575.34	144.87
575.758	200.7
576.175	135.17
576.593	164.29
577.01	193.42
577.428	174
577.845	1528.39
578.262	215.26
578.68	152.16
579.097	188.56
579.514	157.01
579.931	183.71
580.348	203.13
580.765	181.28
581.182	215.26
581.599	123.03
582.016	125.46
582.433	137.59
582.849	210.41
583.266	207.98
583.683	135.17
584.099	164.29
584.516	157.01
584.933	81.77
585.349	280.8
585.765	171.57
586.182	142.45
586.598	84.19
587.014	171.57
587.431	207.98
587.847	207.98
588.263	176.43
588.679	181.28
589.095	142.45
589.511	229.83
589.927	188.56
590.343	237.11
590.759	91.48
591.174	183.71
591.59	76.91
592.006	239.54
592.421	220.12
592.837	144.87
593.252	176.43
593.668	130.31
594.083	198.27
594.499	169.15
594.914	217.69
595.329	181.28
595.745	220.12
596.16	224.97
596.575	212.84
596.99	232.25
597.405	125.46
597.82	137.59
598.235	178.86
598.65	157.01
599.065	169.15
599.479	171.57
599.894	161.87
600.309	157.01
600.724	178.86
601.138	130.31
601.553	142.45
601.967	108.47
602.382	249.25
602.796	137.59
603.21	140.02
603.625	161.87
604.039	159.44
604.453	203.13
604.867	205.56
605.281	159.44
605.695	140.02
606.109	205.56
606.523	127.88
606.937	188.56
607.351	246.82
607.765	127.88
608.178	171.57
608.592	91.48
609.006	193.42
609.419	164.29
609.833	203.13
610.246	120.6
610.66	132.74
611.073	222.55
611.487	186.14
611.9	181.28
612.313	147.3
612.726	171.57
613.139	147.3
613.553	183.71
613.966	210.41
614.379	140.02
614.792	166.72
615.204	275.94
615.617	103.61
616.03	142.45
616.443	222.55
616.856	229.83
617.268	183.71
617.681	178.86
618.093	135.17
618.506	207.98
618.918	166.72
619.331	149.73
619.743	171.57
620.155	229.83
620.568	222.55
620.98	161.87
621.392	174
621.804	205.56
622.216	127.88
622.628	241.96
623.04	241.96
623.452	123.03
623.864	106.04
624.276	207.98
624.687	118.18
625.099	130.31
625.511	193.42
625.922	144.87
626.334	174
626.745	72.06
627.157	207.98
627.568	106.04
627.979	178.86
628.391	74.49
628.802	137.59
629.213	207.98
629.624	200.7
630.035	159.44
630.446	195.85
630.857	239.54
631.268	125.46
631.679	132.74
632.09	181.28
632.501	135.17
632.912	103.61
633.322	215.26
633.733	176.43
634.144	186.14
634.554	123.03
634.965	183.71
635.375	178.86
635.785	169.15
636.196	127.88
636.606	130.31
637.016	161.87
637.427	193.42
637.837	120.6
638.247	166.72
638.657	144.87
639.067	127.88
639.477	178.86
639.887	256.53
640.297	186.14
640.706	169.15
641.116	159.44
641.526	171.57
641.935	205.56
642.345	144.87
642.755	144.87
643.164	154.58
643.573	241.96
643.983	159.44
644.392	127.88
644.801	190.99
645.211	161.87
645.62	188.56
646.029	135.17
646.438	193.42
646.847	234.68
647.256	149.73
647.665	106.04
648.074	64.78
648.483	89.05
648.892	232.25
649.3	125.46
649.709	144.87
650.118	144.87
650.526	98.76
650.935	174
651.343	210.41
651.752	186.14
652.16	188.56
652.568	142.45
652.977	181.28
653.385	186.14
653.793	125.46
654.201	190.99
654.609	212.84
655.017	157.01
655.425	125.46
655.833	137.59
656.241	147.3
656.649	178.86
657.057	127.88
657.464	200.7
657.872	159.44
658.28	157.01
658.687	142.45
659.095	181.28
659.502	188.56
659.91	161.87
660.317	157.01
660.724	140.02
661.132	125.46
661.539	144.87
661.946	188.56
662.353	118.18
662.76	157.01
663.167	147.3
663.574	166.72
663.981	203.13
664.388	169.15
664.795	188.56
665.202	210.41
665.608	137.59
666.015	171.57
666.422	164.29
666.828	140.02
667.235	164.29
667.641	195.85
668.047	178.86
668.454	132.74
668.86	161.87
669.266	110.89
669.673	239.54
670.079	210.41
670.485	120.6
670.891	171.57
671.297	176.43
671.703	166.72
672.109	198.27
672.515	200.7
672.92	215.26
673.326	215.26
673.732	186.14
674.138	176.43
674.543	205.56
674.949	140.02
675.354	164.29
675.76	144.87
676.165	142.45
676.57	222.55
676.976	188.56
677.381	110.89
677.786	120.6
678.191	164.29
678.596	224.97
679.001	142.45
679.406	205.56
679.811	220.12
680.216	203.13
680.621	174
681.026	67.2
681.43	207.98
681.835	120.6
682.24	93.9
682.644	137.59
683.049	164.29
683.453	140.02
683.858	123.03
684.262	125.46
684.667	222.55
685.071	130.31
685.475	195.85
685.879	217.69
686.283	120.6
686.687	164.29
687.091	203.13
687.495	195.85
687.899	147.3
688.303	171.57
688.707	203.13
689.111	164.29
689.514	212.84
689.918	234.68
690.322	215.26
690.725	224.97
691.129	101.18
691.532	164.29
691.936	205.56
692.339	183.71
692.742	207.98
693.146	142.45
693.549	174
693.952	113.32
694.355	222.55
694.758	183.71
695.161	193.42
695.564	137.59
695.967	132.74
696.37	149.73
696.773	132.74
697.175	159.44
697.578	193.42
697.981	200.7
698.383	212.84
698.786	195.85
699.188	130.31
699.591	152.16
699.993	190.99
700.395	169.15
700.798	130.31
701.2	246.82
701.602	164.29
702.004	200.7
702.406	186.14
702.808	115.75
703.21	137.59
703.612	241.96
704.014	205.56
704.416	178.86
704.818	266.24
705.219	152.16
705.621	237.11
706.023	200.7
706.424	278.37
706.826	215.26
707.227	232.25
707.629	205.56
708.03	256.53
708.431	140.02
708.832	217.69
709.234	278.37
709.635	302.64
710.036	251.67
710.437	166.72
710.838	161.87
711.239	254.1
711.64	190.99
712.041	241.96
712.441	285.65
712.842	309.93
713.243	273.52
713.643	271.09
714.044	212.84
714.445	283.23
714.845	343.91
715.246	307.5
715.646	266.24
716.046	329.34
716.447	273.52
716.847	329.34
717.247	314.78
717.647	300.22
718.047	314.78
718.447	278.37
718.847	302.64
719.247	331.77
719.647	322.06
720.047	336.63
720.446	358.47
720.846	370.61
721.246	380.32
721.645	336.63
722.045	356.04
722.444	394.88
722.844	443.42
723.243	443.42
723.643	399.73
724.042	373.03
724.441	477.4
724.84	457.99
725.24	525.95
725.639	448.28
726.038	521.09
726.437	528.38
726.836	552.65
727.234	494.39
727.633	511.39
728.032	545.37
728.431	627.89
728.83	657.02
729.228	712.84
729.627	666.73
730.025	674.01
730.424	705.56
730.822	875.47
731.22	863.33
731.619	858.48
732.017	899.74
732.415	1047.8
732.813	1108.48
733.212	1203.14
733.61	1178.87
734.008	1220.13
734.406	1341.5
734.803	1407.03
735.201	1615.77
735.599	1683.73
735.997	1676.45
736.395	1841.5
736.792	1955.58
737.19	2011.41
737.587	2169.18
737.985	2176.46
738.382	2297.82
738.78	2540.54
739.177	2562.39
739.574	2788.12
739.971	2826.96
740.369	3045.41
740.766	3268.71
741.163	3263.86
741.56	3360.94
741.957	3339.1
742.354	3615.8
742.751	3725.03
743.147	3987.17
743.544	4120.66
743.941	4346.4
744.338	4465.33
744.734	4688.63
745.131	4892.52
745.527	5120.68
745.924	5472.63
746.32	5674.09
746.716	6057.59
747.113	6249.34
747.509	6678.96
747.905	6977.51
748.301	7157.12
748.697	7530.91
749.093	7831.89
749.489	8009.07
749.885	8460.54
750.281	9152.3
750.677	9283.37
751.073	9674.15
751.468	10069.79
751.864	10637.76
752.26	10982.42
752.655	11244.56
753.051	11817.39
753.446	12378.07
753.842	12317.39
754.237	12987.31
754.632	13140.22
755.028	13630.52
755.423	13742.17
755.818	14031.01
756.213	14511.6
756.608	14654.81
757.003	15077.15
757.398	14994.62
757.793	15125.69
758.188	15538.32
758.583	16060.17
758.977	16137.84
759.372	16977.66
759.767	17317.47
760.161	18404.87
760.556	19271.39
760.95	20130.62
761.345	20929.18
761.739	21628.22
762.133	22164.63
762.527	23004.45
762.922	24055.44
763.316	24409.82
763.71	24917.1
764.104	25455.95
764.498	25914.69
764.892	27201.12
765.286	27031.22
765.68	27764.24
766.073	28613.76
766.467	28487.55
766.861	29320.09
767.255	30652.63
767.648	31368.66
768.042	32082.26
768.435	32453.63
768.829	32832.28
769.222	32732.76
769.615	33596.85
770.008	34308.03
770.402	34247.35
770.795	34924.54
771.188	35079.88
771.581	34973.09
771.974	35038.62
772.367	34426.96
772.76	34994.93
773.153	34749.78
773.545	34679.39
773.938	34851.73
774.331	35502.22
774.724	35618.73
775.116	36555.64
775.509	39293.54
775.901	39298.4
776.294	40630.94
776.686	41453.77
777.078	42033.88
777.471	43509.63
777.863	44701.39
778.255	46002.38
778.647	47007.25
779.039	46711.13
779.431	45978.11
779.823	46650.45
780.215	47184.44
780.607	46419.87
780.999	48296.11
781.39	48541.26
781.782	48567.96
782.174	49165.05
782.565	49359.23
782.957	49233.02
783.348	50067.98
783.74	50315.56
784.131	49929.63
784.522	50597.12
784.914	49296.12
785.305	48922.33
785.696	49490.3
786.087	48701.46
786.478	47876.2
786.869	46123.75
787.26	46116.46
787.651	44737.8
788.042	45487.81
788.433	43480.5
788.823	42587.28
789.214	42104.27
789.605	40723.18
789.995	40062.97
790.386	39713.45
790.776	39577.53
791.167	38946.45
791.557	40482.88
791.948	40747.45
792.338	41327.55
792.728	42135.82
793.118	41109.1
793.508	41565.42
793.898	41473.19
794.288	42286.31
794.678	42604.27
795.068	42121.26
795.458	41577.56
795.848	42228.05
796.238	41990.19
796.627	42067.86
797.017	42206.21
797.406	41611.54
797.796	41584.84
798.185	41786.3
798.575	41492.61
798.964	41249.88
799.354	42482.91
799.743	41592.12
800.132	42271.74
800.521	42058.15
800.91	42269.32
801.299	41524.16
801.688	41694.06
802.077	40800.85
802.466	41339.69
802.855	40647.93
803.244	39793.55
803.633	39147.91
804.021	38380.91
804.41	37490.12
804.799	37242.54
805.187	36749.81
805.576	35587.17
805.964	34647.84
806.352	32926.94
806.741	32890.53
807.129	32565.28
807.517	32747.32
807.905	32089.55
808.293	32431.78
808.681	32633.24
809.069	31545.85
809.457	33361.41
809.845	33264.32
810.233	33868.7
810.621	33866.27
811.009	33592
811.396	33761.9
811.784	33909.96
812.171	33053.15
812.559	32713.34
812.946	32349.26
813.334	31271.57
813.721	30815.25
814.108	30701.18
814.496	29368.63
814.883	29875.92
815.27	30975.45
815.657	29307.95
816.044	29941.45
816.431	29839.51
816.818	29790.97
817.205	29320.09
817.592	29519.12
817.979	29055.52
818.365	28407.45
818.752	26718.1
819.139	26322.47
819.525	26203.53
819.912	25324.88
820.298	24691.37
820.685	24033.6
821.071	23436.5
821.457	23067.56
821.843	21856.38
822.23	21247.14
822.616	20654.9
823.002	19805.37
823.388	18819.92
823.774	18477.68
824.16	17795.63
824.546	16907.27
824.931	17293.2
825.317	16868.44
825.703	16276.19
826.089	16436.39
826.474	15849
826.86	15579.58
827.245	15591.72
827.631	15220.35
828.016	14987.34
828.401	15040.74
828.787	14307.72
829.172	14060.14
829.557	13766.45
829.942	13205.76
830.327	13026.14
830.712	12984.88
831.097	12370.79
831.482	12089.24
831.867	11868.36
832.252	11552.82
832.636	11480
833.021	11246.99
833.406	11060.09
833.79	10814.94
834.175	10579.5
834.559	10416.88
834.944	10113.48
835.328	9841.63
835.713	9557.64
836.097	9358.61
836.481	9009.09
836.865	8652.29
837.249	8664.42
837.633	8115.87
838.017	7924.12
838.401	7596.45
838.785	7288.19
839.169	7011.49
839.553	6802.75
839.937	6397.4
840.32	6079.43
840.704	6103.71
841.087	5795.45
841.471	5523.6
841.854	5377.97
842.238	5276.02
842.621	4965.34
843.004	5064.85
843.388	4802.71
843.771	4899.8
844.154	4678.93
844.537	4712.91
844.92	4550.28
845.303	4511.45
845.686	4421.64
846.069	4285.72
846.452	4123.09
846.834	3977.46
847.217	4001.73
847.6	4115.81
847.982	3851.24
848.365	3695.9
848.748	3647.36
849.13	3516.29
849.512	3470.17
849.895	3557.55
850.277	3339.1
850.659	3307.55
851.041	3292.98
851.423	3120.65
851.806	2958.03
852.188	2977.44
852.57	2926.47
852.951	2853.65
853.333	2931.33
853.715	2671.61
854.097	2640.06
854.479	2657.05
854.86	2501.71
855.242	2482.29
855.623	2431.32
856.005	2256.56
856.386	2137.62
856.768	2042.96
857.149	2057.53
857.53	1873.06
857.911	1880.34
858.292	1807.52
858.674	1700.72
859.055	1652.18
859.436	1640.04
859.817	1433.73
860.197	1363.34
860.578	1394.89
860.959	1416.74
861.34	1414.31
861.72	1416.74
862.101	1241.98
862.482	1263.82
862.862	1241.98
863.243	1246.83
863.623	1144.89
864.003	1113.34
864.384	1072.07
864.764	1069.65
865.144	1059.94
865.524	1101.2
865.904	977.41
866.284	972.56
866.664	996.83
867.044	882.75
867.424	788.09
867.804	829.35
868.183	800.22
868.563	853.62
868.943	741.97
869.322	717.7
869.702	693.43
870.081	686.15
870.461	657.02
870.84	644.88
871.22	678.86
871.599	686.15
871.978	581.77
872.357	603.62
872.736	559.93
873.115	489.54
873.494	533.23
873.873	477.4
874.252	511.39
874.631	428.86
875.01	431.29
875.388	484.69
875.767	392.45
876.146	390.02
876.524	346.33
876.903	356.04
877.281	414.3
877.66	377.89
878.038	370.61
878.416	336.63
878.794	227.4
879.173	343.91
879.551	278.37
879.929	397.31
880.307	319.63
880.685	234.68
881.063	251.67
881.441	348.76
881.818	239.54
882.196	271.09
882.574	246.82
882.951	246.82
883.329	251.67
883.707	205.56
884.084	254.1
884.461	278.37
884.839	244.39
885.216	234.68
885.593	254.1
885.971	324.49
886.348	188.56
886.725	166.72
887.102	237.11
887.479	212.84
887.856	224.97
888.233	169.15
888.609	227.4
888.986	207.98
889.363	195.85
889.74	188.56
890.116	210.41
890.493	222.55
890.869	220.12
891.246	246.82
891.622	217.69
891.998	130.31
892.375	171.57
892.751	205.56
893.127	210.41
893.503	181.28
893.879	161.87
894.255	193.42
894.631	198.27
895.007	181.28
895.383	186.14
895.759	188.56
896.134	178.86
896.51	120.6
896.886	205.56
897.261	118.18
897.637	237.11
898.012	152.16
898.388	106.04
898.763	98.76
899.138	132.74
899.514	144.87
899.889	161.87
900.264	149.73
900.639	178.86
901.014	188.56
901.389	174
901.764	195.85
902.139	149.73
902.513	222.55
902.888	125.46
903.263	147.3
903.638	110.89
904.012	164.29
904.387	149.73
904.761	142.45
905.136	159.44
905.51	127.88
905.884	198.27
906.259	144.87
906.633	98.76
907.007	147.3
907.381	118.18
907.755	169.15
908.129	190.99
908.503	127.88
908.877	103.61
909.251	190.99
909.624	190.99
909.998	142.45
910.372	159.44
910.745	130.31
911.119	159.44
911.492	118.18
911.866	159.44
912.239	169.15
912.612	137.59
912.986	120.6
913.359	154.58
913.732	174
914.105	103.61
914.478	157.01
914.851	137.59
915.224	132.74
915.597	130.31
915.97	215.26
916.343	164.29
916.715	154.58
917.088	186.14
917.461	106.04
917.833	171.57
918.206	135.17
918.578	113.32
918.951	154.58
919.323	86.62
919.695	154.58
920.067	176.43
920.44	137.59
920.812	178.86
921.184	142.45
921.556	188.56
921.928	52.64
922.3	152.16
922.672	89.05
923.043	164.29
923.415	101.18
923.787	123.03
924.158	176.43
924.53	174
924.901	234.68
925.273	120.6
925.644	108.47
926.016	125.46
926.387	98.76
926.758	4.1
927.129	108.47
927.5	164.29
927.872	132.74
928.243	174
928.613	144.87
928.984	166.72
929.355	108.47
929.726	106.04
930.097	154.58
930.467	157.01
930.838	161.87
931.209	67.2
931.579	127.88
931.95	178.86
932.32	154.58
932.69	186.14
933.061	106.04
933.431	159.44
933.801	200.7
934.171	188.56
934.541	166.72
934.911	132.74
935.281	115.75
935.651	103.61
936.021	106.04
936.391	147.3
936.761	174
937.13	106.04
937.5	127.88
937.87	118.18
938.239	181.28
938.609	154.58
938.978	154.58
939.347	106.04
939.717	91.48
940.086	164.29
940.455	81.77
940.824	144.87
941.193	127.88
941.562	132.74
941.931	81.77
942.3	123.03
942.669	118.18
943.038	89.05
943.407	144.87
943.775	135.17
944.144	125.46
944.513	203.13
944.881	118.18
945.25	152.16
945.618	98.76
945.986	203.13
946.355	178.86
946.723	93.9
947.091	159.44
947.459	137.59
947.827	130.31
948.195	144.87
948.563	118.18
948.931	149.73
949.299	154.58
949.667	96.33
950.035	178.86
950.402	137.59
950.77	118.18
951.138	157.01
951.505	159.44
951.873	186.14
952.24	169.15
952.607	258.95
952.975	93.9
953.342	183.71
953.709	127.88
954.076	147.3
954.443	137.59
954.81	93.9
955.177	166.72
955.544	98.76
955.911	142.45
956.278	132.74
956.645	207.98
957.012	144.87
957.378	115.75
957.745	106.04
958.111	101.18
958.478	210.41
958.844	130.31
959.211	108.47
959.577	154.58
959.943	147.3
960.309	176.43
960.675	181.28
961.042	144.87
961.408	115.75
961.774	169.15
962.139	103.61
962.505	89.05
962.871	123.03
963.237	84.19
963.603	67.2
963.968	98.76
964.334	200.7
964.699	120.6
965.065	157.01
965.43	135.17
965.796	161.87
966.161	142.45
966.526	137.59
966.891	154.58
967.256	171.57
967.622	224.97
967.987	113.32
968.352	137.59
968.716	103.61
969.081	40.5
969.446	183.71
969.811	152.16
970.176	98.76
970.54	147.3
970.905	195.85
971.269	161.87
971.634	220.12
971.998	52.64
972.363	106.04
972.727	125.46
973.091	142.45
973.455	118.18
973.819	176.43
974.183	161.87
974.547	76.91
974.911	135.17
975.275	140.02
975.639	103.61
976.003	195.85
976.367	190.99
976.73	103.61
977.094	229.83
977.458	144.87
977.821	159.44
978.185	125.46
978.548	161.87
978.911	93.9
979.275	186.14
979.638	130.31
980.001	106.04
980.364	210.41
980.727	171.57
981.09	200.7
981.453	140.02
981.816	178.86
982.179	137.59
982.542	135.17
982.905	176.43
983.267	166.72
983.63	69.63
983.992	188.56
984.355	59.92
984.717	195.85
985.08	125.46
985.442	200.7
985.804	149.73
986.167	93.9
986.529	186.14
986.891	140.02
987.253	178.86
987.615	149.73
987.977	137.59
988.339	181.28
988.701	120.6
989.062	198.27
989.424	132.74
989.786	144.87
990.147	125.46
990.509	108.47
990.87	91.48
991.232	142.45
991.593	154.58
991.955	176.43
992.316	157.01
992.677	108.47
993.038	147.3
993.399	103.61
993.76	154.58
994.121	154.58
994.482	164.29
994.843	161.87
995.204	132.74
995.565	186.14
995.926	74.49
996.286	152.16
996.647	186.14
997.007	193.42
997.368	144.87
997.728	154.58
998.089	101.18
998.449	62.35
998.809	142.45
999.169	166.72
999.53	120.6
999.89	152.16
1000.25	154.58
1000.61	140.02
1000.97	157.01
1001.329	93.9
1001.689	81.77
1002.049	84.19
1002.409	123.03
1002.768	181.28
1003.128	144.87
1003.487	161.87
1003.847	176.43
1004.206	176.43
1004.566	166.72
1004.925	164.29
1005.284	89.05
1005.643	123.03
1006.003	93.9
1006.362	157.01
1006.721	135.17
1007.08	166.72
1007.438	76.91
1007.797	190.99
1008.156	171.57
1008.515	169.15
1008.874	81.77
1009.232	118.18
1009.591	96.33
1009.949	166.72
1010.308	176.43
1010.666	132.74
1011.024	101.18
1011.383	159.44
1011.741	154.58
1012.099	72.06
1012.457	115.75
1012.815	96.33
1013.173	93.9
1013.531	140.02
1013.889	96.33
1014.247	169.15
1014.605	132.74
1014.962	149.73
1015.32	130.31
1015.678	137.59
1016.035	181.28
1016.393	166.72
1016.75	142.45
1017.107	157.01
1017.465	147.3
1017.822	86.62
1018.179	174
1018.536	166.72
1018.894	188.56
1019.251	207.98
1019.608	164.29
1019.964	103.61
1020.321	140.02
1020.678	125.46
1021.035	120.6
1021.392	157.01
1021.748	144.87
1022.105	195.85
1022.461	55.07
1022.818	181.28
1023.174	154.58
1023.531	115.75
1023.887	108.47
1024.243	152.16
1024.599	164.29
1024.955	193.42
1025.311	142.45
1025.667	33.22
1026.023	166.72
1026.379	123.03
1026.735	149.73
1027.091	125.46
1027.447	147.3
