189.514	2.88
189.973	2.88
190.431	2.88
190.889	10.16
191.348	-31.1
191.806	-94.21
192.264	29.58
192.722	-16.54
193.18	-74.79
193.638	-60.23
194.096	-38.38
194.554	17.45
195.012	-28.67
195.47	46.57
195.928	34.44
196.385	-31.1
196.843	2.88
197.301	22.3
197.758	-9.25
198.216	10.16
198.674	12.59
199.131	82.98
199.589	15.02
200.046	24.73
200.503	24.73
200.961	97.54
201.418	49
201.875	80.55
202.332	114.53
202.79	95.12
203.247	75.7
203.704	87.84
204.161	109.68
204.618	121.82
205.075	180.07
205.532	170.36
205.989	119.39
206.445	177.64
206.902	218.91
207.359	131.53
207.816	167.93
208.272	172.79
208.729	131.53
209.185	114.53
209.642	170.36
210.098	177.64
210.555	131.53
211.011	148.52
211.467	153.37
211.924	182.5
212.38	206.77
212.836	172.79
213.292	141.23
213.748	138.81
214.204	180.07
214.66	182.5
215.116	141.23
215.572	116.96
216.028	158.22
216.484	126.67
216.94	170.36
217.396	182.5
217.851	95.12
218.307	68.42
218.763	133.95
219.218	104.83
219.674	112.11
220.129	143.66
220.585	136.38
221.04	192.21
221.496	211.62
221.951	163.08
222.406	155.8
222.861	95.12
223.317	165.51
223.772	116.96
224.227	116.96
224.682	104.83
225.137	180.07
225.592	109.68
226.047	121.82
226.502	170.36
226.957	182.5
227.411	58.71
227.866	41.72
228.321	187.35
228.776	223.76
229.23	131.53
229.685	112.11
230.139	197.06
230.594	228.61
231.048	92.69
231.503	90.26
231.957	172.79
232.411	141.23
232.865	78.13
233.32	184.92
233.774	99.97
234.228	129.1
234.682	65.99
235.136	119.39
235.59	141.23
236.044	136.38
236.498	201.91
236.952	131.53
237.406	201.91
237.86	92.69
238.313	194.63
238.767	238.32
239.221	114.53
239.674	158.22
240.128	143.66
240.581	184.92
241.035	209.2
241.488	209.2
241.942	192.21
242.395	197.06
242.848	180.07
243.301	87.84
243.755	148.52
244.208	204.34
244.661	109.68
245.114	126.67
245.567	148.52
246.02	160.65
246.473	114.53
246.926	148.52
247.379	99.97
247.832	180.07
248.284	170.36
248.737	143.66
249.19	107.25
249.642	163.08
250.095	107.25
250.547	148.52
251	133.95
251.452	133.95
251.905	211.62
252.357	97.54
252.81	82.98
253.262	90.26
253.714	216.48
254.166	206.77
254.618	153.37
255.07	133.95
255.523	153.37
255.975	153.37
256.427	209.2
256.878	143.66
257.33	138.81
257.782	138.81
258.234	112.11
258.686	148.52
259.137	155.8
259.589	180.07
260.041	112.11
260.492	133.95
260.944	170.36
261.395	126.67
261.847	124.24
262.298	194.63
262.749	170.36
263.201	170.36
263.652	150.94
264.103	148.52
264.554	124.24
265.005	175.22
265.457	211.62
265.908	141.23
266.359	97.54
266.809	133.95
267.26	80.55
267.711	153.37
268.162	231.04
268.613	175.22
269.064	199.49
269.514	129.1
269.965	160.65
270.415	211.62
270.866	109.68
271.316	109.68
271.767	107.25
272.217	97.54
272.668	231.04
273.118	131.53
273.568	148.52
274.019	97.54
274.469	192.21
274.919	131.53
275.369	172.79
275.819	131.53
276.269	175.22
276.719	75.7
277.169	167.93
277.619	75.7
278.069	197.06
278.518	192.21
278.968	99.97
279.418	138.81
279.867	206.77
280.317	175.22
280.767	85.41
281.216	121.82
281.666	165.51
282.115	180.07
282.564	199.49
283.014	172.79
283.463	150.94
283.912	177.64
284.361	175.22
284.811	153.37
285.26	131.53
285.709	214.05
286.158	235.9
286.607	216.48
287.056	189.78
287.505	146.09
287.953	184.92
288.402	126.67
288.851	148.52
289.3	87.84
289.748	116.96
290.197	153.37
290.646	170.36
291.094	85.41
291.543	160.65
291.991	165.51
292.439	141.23
292.888	153.37
293.336	155.8
293.784	228.61
294.233	170.36
294.681	175.22
295.129	143.66
295.577	175.22
296.025	129.1
296.473	150.94
296.921	116.96
297.369	197.06
297.817	170.36
298.264	204.34
298.712	187.35
299.16	141.23
299.608	209.2
300.055	58.71
300.503	133.95
300.95	231.04
301.398	114.53
301.845	138.81
302.293	136.38
302.74	214.05
303.187	143.66
303.635	136.38
304.082	136.38
304.529	124.24
304.976	92.69
305.423	177.64
305.87	148.52
306.317	143.66
306.764	172.79
307.211	165.51
307.658	121.82
308.105	192.21
308.552	131.53
308.998	155.8
309.445	121.82
309.892	146.09
310.338	172.79
310.785	138.81
311.231	133.95
311.678	136.38
312.124	126.67
312.571	180.07
313.017	172.79
313.463	170.36
313.909	172.79
314.356	184.92
314.802	143.66
315.248	104.83
315.694	175.22
316.14	199.49
316.586	109.68
317.032	175.22
317.478	170.36
317.923	160.65
318.369	184.92
318.815	126.67
319.261	107.25
319.706	201.91
320.152	158.22
320.597	226.19
321.043	194.63
321.488	192.21
321.934	199.49
322.379	133.95
322.824	148.52
323.27	221.33
323.715	160.65
324.16	121.82
324.605	107.25
325.05	129.1
325.495	75.7
325.94	189.78
326.385	248.03
326.83	146.09
327.275	158.22
327.72	197.06
328.165	221.33
328.61	150.94
329.054	228.61
329.499	218.91
329.943	129.1
330.388	153.37
330.832	177.64
331.277	165.51
331.721	165.51
332.166	223.76
332.61	177.64
333.054	119.39
333.499	133.95
333.943	133.95
334.387	153.37
334.831	136.38
335.275	187.35
335.719	165.51
336.163	141.23
336.607	90.26
337.051	155.8
337.495	102.4
337.938	131.53
338.382	177.64
338.826	143.66
339.269	138.81
339.713	138.81
340.157	124.24
340.6	182.5
341.044	150.94
341.487	165.51
341.93	107.25
342.374	109.68
342.817	182.5
343.26	221.33
343.703	233.47
344.146	167.93
344.59	65.99
345.033	148.52
345.476	104.83
345.919	170.36
346.361	95.12
346.804	136.38
347.247	158.22
347.69	192.21
348.133	97.54
348.575	95.12
349.018	133.95
349.461	133.95
349.903	177.64
350.346	177.64
350.788	187.35
351.23	150.94
351.673	131.53
352.115	216.48
352.557	124.24
353	121.82
353.442	148.52
353.884	146.09
354.326	148.52
354.768	75.7
355.21	136.38
355.652	158.22
356.094	209.2
356.536	146.09
356.978	126.67
357.419	155.8
357.861	167.93
358.303	146.09
358.744	199.49
359.186	150.94
359.627	155.8
360.069	199.49
360.51	163.08
360.952	163.08
361.393	136.38
361.834	194.63
362.276	129.1
362.717	133.95
363.158	170.36
363.599	216.48
364.04	148.52
364.481	160.65
364.922	206.77
365.363	197.06
365.804	131.53
366.245	109.68
366.686	124.24
367.126	148.52
367.567	184.92
368.008	194.63
368.448	206.77
368.889	194.63
369.33	243.18
369.77	214.05
370.21	197.06
370.651	201.91
371.091	177.64
371.531	138.81
371.972	201.91
372.412	92.69
372.852	209.2
373.292	165.51
373.732	114.53
374.172	124.24
374.612	163.08
375.052	148.52
375.492	177.64
375.932	165.51
376.372	177.64
376.811	119.39
377.251	170.36
377.691	175.22
378.13	146.09
378.57	124.24
379.009	155.8
379.449	211.62
379.888	95.12
380.328	99.97
380.767	136.38
381.206	119.39
381.645	131.53
382.085	167.93
382.524	153.37
382.963	116.96
383.402	153.37
383.841	214.05
384.28	172.79
384.719	194.63
385.158	197.06
385.596	119.39
386.035	99.97
386.474	180.07
386.913	136.38
387.351	160.65
387.79	141.23
388.228	180.07
388.667	133.95
389.105	131.53
389.544	163.08
389.982	177.64
390.42	204.34
390.859	167.93
391.297	107.25
391.735	107.25
392.173	211.62
392.611	223.76
393.049	206.77
393.487	112.11
393.925	150.94
394.363	82.98
394.801	158.22
395.239	177.64
395.676	165.51
396.114	160.65
396.552	150.94
396.989	141.23
397.427	182.5
397.864	192.21
398.302	97.54
398.739	170.36
399.177	172.79
399.614	129.1
400.051	148.52
400.488	182.5
400.926	143.66
401.363	119.39
401.8	158.22
402.237	19.87
402.674	121.82
403.111	119.39
403.548	107.25
403.985	206.77
404.421	138.81
404.858	194.63
405.295	206.77
405.732	206.77
406.168	197.06
406.605	172.79
407.041	150.94
407.478	226.19
407.914	121.82
408.351	102.4
408.787	170.36
409.223	165.51
409.66	109.68
410.096	160.65
410.532	226.19
410.968	158.22
411.404	126.67
411.84	153.37
412.276	136.38
412.712	121.82
413.148	126.67
413.584	126.67
414.02	138.81
414.455	129.1
414.891	78.13
415.327	184.92
415.762	158.22
416.198	199.49
416.633	116.96
417.069	90.26
417.504	165.51
417.94	104.83
418.375	133.95
418.81	153.37
419.245	172.79
419.681	163.08
420.116	114.53
420.551	136.38
420.986	133.95
421.421	155.8
421.856	92.69
422.291	245.6
422.726	146.09
423.16	155.8
423.595	192.21
424.03	109.68
424.464	148.52
424.899	180.07
425.334	223.76
425.768	138.81
426.203	90.26
426.637	170.36
427.071	126.67
427.506	167.93
427.94	133.95
428.374	99.97
428.809	165.51
429.243	199.49
429.677	165.51
430.111	112.11
430.545	114.53
430.979	85.41
431.413	107.25
431.847	158.22
432.28	119.39
432.714	175.22
433.148	112.11
433.582	158.22
434.015	182.5
434.449	133.95
434.882	209.2
435.316	172.79
435.749	163.08
436.183	163.08
436.616	114.53
437.049	109.68
437.483	153.37
437.916	158.22
438.349	194.63
438.782	138.81
439.215	189.78
439.648	138.81
440.081	131.53
440.514	126.67
440.947	158.22
441.38	170.36
441.813	221.33
442.245	209.2
442.678	165.51
443.111	177.64
443.543	240.75
443.976	221.33
444.408	141.23
444.841	180.07
445.273	146.09
445.705	262.6
446.138	102.4
446.57	223.76
447.002	216.48
447.434	194.63
447.867	180.07
448.299	197.06
448.731	148.52
449.163	226.19
449.595	138.81
450.026	228.61
450.458	180.07
450.89	165.51
451.322	184.92
451.754	223.76
452.185	233.47
452.617	282.01
453.048	325.7
453.48	267.45
453.911	211.62
454.343	218.91
454.774	233.47
455.205	257.74
455.637	260.17
456.068	299
456.499	233.47
456.93	267.45
457.361	172.79
457.792	214.05
458.223	235.9
458.654	257.74
459.085	265.02
459.516	296.58
459.947	262.6
460.378	301.43
460.808	160.65
461.239	209.2
461.669	218.91
462.1	267.45
462.531	257.74
462.961	199.49
463.391	175.22
463.822	177.64
464.252	248.03
464.682	250.46
465.113	216.48
465.543	201.91
465.973	255.31
466.403	206.77
466.833	272.3
467.263	240.75
467.693	175.22
468.123	204.34
468.553	201.91
468.983	180.07
469.412	192.21
469.842	223.76
470.272	303.86
470.701	182.5
471.131	218.91
471.56	245.6
471.99	177.64
472.419	226.19
472.849	165.51
473.278	180.07
473.707	194.63
474.136	265.02
474.566	184.92
474.995	148.52
475.424	214.05
475.853	194.63
476.282	226.19
476.711	214.05
477.14	184.92
477.569	165.51
477.997	143.66
478.426	214.05
478.855	172.79
479.283	214.05
479.712	214.05
480.141	231.04
480.569	175.22
480.998	209.2
481.426	175.22
481.854	197.06
482.283	158.22
482.711	199.49
483.139	141.23
483.567	184.92
483.995	160.65
484.424	187.35
484.852	165.51
485.28	184.92
485.708	197.06
486.135	214.05
486.563	211.62
486.991	150.94
487.419	167.93
487.847	197.06
488.274	158.22
488.702	160.65
489.129	197.06
489.557	153.37
489.984	165.51
490.412	228.61
490.839	189.78
491.266	172.79
491.694	223.76
492.121	138.81
492.548	192.21
492.975	245.6
493.402	204.34
493.829	172.79
494.256	104.83
494.683	180.07
495.11	136.38
495.537	165.51
495.964	184.92
496.39	187.35
496.817	233.47
497.244	214.05
497.67	97.54
498.097	201.91
498.523	124.24
498.95	214.05
499.376	126.67
499.803	165.51
500.229	197.06
500.655	209.2
501.081	201.91
501.508	180.07
501.934	204.34
502.36	223.76
502.786	265.02
503.212	136.38
503.638	177.64
504.064	160.65
504.489	194.63
504.915	180.07
505.341	87.84
505.767	238.32
506.192	209.2
506.618	209.2
507.043	199.49
507.469	182.5
507.894	243.18
508.32	248.03
508.745	265.02
509.17	201.91
509.596	197.06
510.021	172.79
510.446	153.37
510.871	211.62
511.296	104.83
511.721	172.79
512.146	160.65
512.571	197.06
512.996	201.91
513.421	184.92
513.845	182.5
514.27	231.04
514.695	119.39
515.119	102.4
515.544	192.21
515.969	153.37
516.393	228.61
516.817	165.51
517.242	252.89
517.666	192.21
518.09	180.07
518.515	194.63
518.939	160.65
519.363	451.92
519.787	216.48
520.211	189.78
520.635	214.05
521.059	129.1
521.483	133.95
521.907	189.78
522.331	153.37
522.754	182.5
523.178	175.22
523.602	143.66
524.025	167.93
524.449	124.24
524.872	216.48
525.296	214.05
525.719	146.09
526.143	286.87
526.566	192.21
526.989	163.08
527.412	124.24
527.836	231.04
528.259	197.06
528.682	107.25
529.105	192.21
529.528	211.62
529.951	184.92
530.374	136.38
530.796	182.5
531.219	107.25
531.642	206.77
532.065	201.91
532.487	218.91
532.91	192.21
533.332	170.36
533.755	138.81
534.177	187.35
534.6	197.06
535.022	189.78
535.444	109.68
535.867	218.91
536.289	184.92
536.711	180.07
537.133	197.06
537.555	182.5
537.977	189.78
538.399	201.91
538.821	199.49
539.243	182.5
539.665	221.33
540.086	194.63
540.508	187.35
540.93	189.78
541.351	155.8
541.773	177.64
542.195	138.81
542.616	243.18
543.037	238.32
543.459	226.19
543.88	155.8
544.301	177.64
544.723	148.52
545.144	248.03
545.565	189.78
545.986	148.52
546.407	192.21
546.828	136.38
547.249	124.24
547.67	141.23
548.091	187.35
548.512	182.5
548.932	182.5
549.353	165.51
549.774	165.51
550.194	148.52
550.615	172.79
551.035	226.19
551.456	201.91
551.876	126.67
552.296	303.86
552.717	138.81
553.137	175.22
553.557	158.22
553.977	216.48
554.397	206.77
554.817	126.67
555.237	163.08
555.657	177.64
556.077	209.2
556.497	146.09
556.917	252.89
557.337	160.65
557.756	158.22
558.176	143.66
558.596	148.52
559.015	141.23
559.435	136.38
559.854	165.51
560.274	160.65
560.693	165.51
561.112	172.79
561.532	177.64
561.951	182.5
562.37	61.14
562.789	90.26
563.208	187.35
563.627	141.23
564.046	231.04
564.465	143.66
564.884	172.79
565.303	187.35
565.722	199.49
566.14	204.34
566.559	129.1
566.978	167.93
567.396	170.36
567.815	172.79
568.233	226.19
568.652	194.63
569.07	133.95
569.489	172.79
569.907	114.53
570.325	218.91
570.743	218.91
571.161	155.8
571.58	131.53
571.998	199.49
572.416	197.06
572.833	233.47
573.251	182.5
573.669	197.06
574.087	223.76
574.505	216.48
574.922	187.35
575.34	192.21
575.758	197.06
576.175	153.37
576.593	192.21
577.01	172.79
577.428	129.1
577.845	1740.77
578.262	286.87
578.68	184.92
579.097	204.34
579.514	97.54
579.931	165.51
580.348	218.91
580.765	155.8
581.182	150.94
581.599	146.09
582.016	119.39
582.433	184.92
582.849	192.21
583.266	204.34
583.683	204.34
584.099	175.22
584.516	204.34
584.933	204.34
585.349	187.35
585.765	199.49
586.182	133.95
586.598	133.95
587.014	170.36
587.431	150.94
587.847	189.78
588.263	177.64
588.679	194.63
589.095	194.63
589.511	175.22
589.927	184.92
590.343	187.35
590.759	133.95
591.174	109.68
591.59	175.22
592.006	216.48
592.421	233.47
592.837	214.05
593.252	155.8
593.668	148.52
594.083	175.22
594.499	141.23
594.914	184.92
595.329	189.78
595.745	177.64
596.16	126.67
596.575	201.91
596.99	163.08
597.405	177.64
597.82	235.9
598.235	199.49
598.65	199.49
599.065	209.2
599.479	231.04
599.894	146.09
600.309	184.92
600.724	138.81
601.138	167.93
601.553	240.75
601.967	155.8
602.382	170.36
602.796	146.09
603.21	216.48
603.625	238.32
604.039	187.35
604.453	172.79
604.867	184.92
605.281	189.78
605.695	245.6
606.109	172.79
606.523	221.33
606.937	172.79
607.351	260.17
607.765	158.22
608.178	214.05
608.592	114.53
609.006	211.62
609.419	160.65
609.833	163.08
610.246	194.63
610.66	240.75
611.073	163.08
611.487	97.54
611.9	216.48
612.313	194.63
612.726	233.47
613.139	194.63
613.553	160.65
613.966	209.2
614.379	192.21
614.792	170.36
615.204	141.23
615.617	104.83
616.03	221.33
616.443	136.38
616.856	238.32
617.268	172.79
617.681	257.74
618.093	138.81
618.506	131.53
618.918	197.06
619.331	158.22
619.743	221.33
620.155	228.61
620.568	180.07
620.98	148.52
621.392	189.78
621.804	143.66
622.216	112.11
622.628	199.49
623.04	209.2
623.452	189.78
623.864	177.64
624.276	119.39
624.687	182.5
625.099	124.24
625.511	141.23
625.922	177.64
626.334	218.91
626.745	153.37
627.157	153.37
627.568	180.07
627.979	167.93
628.391	131.53
628.802	218.91
629.213	201.91
629.624	177.64
630.035	150.94
630.446	209.2
630.857	218.91
631.268	136.38
631.679	155.8
632.09	131.53
632.501	126.67
632.912	204.34
633.322	240.75
633.733	184.92
634.144	218.91
634.554	126.67
634.965	163.08
635.375	163.08
635.785	165.51
636.196	194.63
636.606	126.67
637.016	131.53
637.427	129.1
637.837	197.06
638.247	167.93
638.657	172.79
639.067	180.07
639.477	170.36
639.887	189.78
640.297	206.77
640.706	165.51
641.116	136.38
641.526	109.68
641.935	129.1
642.345	218.91
642.755	167.93
643.164	150.94
643.573	189.78
643.983	211.62
644.392	197.06
644.801	214.05
645.211	155.8
645.62	197.06
646.029	226.19
646.438	201.91
646.847	238.32
647.256	153.37
647.665	102.4
648.074	155.8
648.483	175.22
648.892	221.33
649.3	175.22
649.709	182.5
650.118	155.8
650.526	143.66
650.935	199.49
651.343	223.76
651.752	206.77
652.16	153.37
652.568	146.09
652.977	211.62
653.385	267.45
653.793	80.55
654.201	121.82
654.609	218.91
655.017	158.22
655.425	170.36
655.833	104.83
656.241	158.22
656.649	112.11
657.057	163.08
657.464	160.65
657.872	126.67
658.28	107.25
658.687	199.49
659.095	136.38
659.502	172.79
659.91	138.81
660.317	155.8
660.724	150.94
661.132	141.23
661.539	199.49
661.946	214.05
662.353	204.34
662.76	221.33
663.167	126.67
663.574	150.94
663.981	182.5
664.388	104.83
664.795	204.34
665.202	201.91
665.608	180.07
666.015	172.79
666.422	170.36
666.828	124.24
667.235	150.94
667.641	138.81
668.047	141.23
668.454	138.81
668.86	175.22
669.266	167.93
669.673	199.49
670.079	223.76
670.485	189.78
670.891	184.92
671.297	150.94
671.703	102.4
672.109	104.83
672.515	138.81
672.92	221.33
673.326	175.22
673.732	163.08
674.138	65.99
674.543	177.64
674.949	155.8
675.354	126.67
675.76	158.22
676.165	102.4
676.57	141.23
676.976	126.67
677.381	180.07
677.786	197.06
678.191	243.18
678.596	116.96
679.001	121.82
679.406	170.36
679.811	214.05
680.216	199.49
680.621	163.08
681.026	109.68
681.43	146.09
681.835	109.68
682.24	177.64
682.644	112.11
683.049	177.64
683.453	143.66
683.858	116.96
684.262	126.67
684.667	175.22
685.071	184.92
685.475	148.52
685.879	170.36
686.283	133.95
686.687	138.81
687.091	121.82
687.495	184.92
687.899	184.92
688.303	148.52
688.707	163.08
689.111	155.8
689.514	184.92
689.918	182.5
690.322	199.49
690.725	194.63
691.129	155.8
691.532	170.36
691.936	170.36
692.339	248.03
692.742	204.34
693.146	126.67
693.549	126.67
693.952	189.78
694.355	107.25
694.758	129.1
695.161	182.5
695.564	197.06
695.967	189.78
696.37	182.5
696.773	216.48
697.175	180.07
697.578	99.97
697.981	206.77
698.383	143.66
698.786	143.66
699.188	201.91
699.591	204.34
699.993	102.4
700.395	155.8
700.798	160.65
701.2	194.63
701.602	121.82
702.004	170.36
702.406	124.24
702.808	155.8
703.21	189.78
703.612	223.76
704.014	194.63
704.416	158.22
704.818	184.92
705.219	184.92
705.621	235.9
706.023	184.92
706.424	223.76
706.826	211.62
707.227	201.91
707.629	209.2
708.03	201.91
708.431	160.65
708.832	143.66
709.234	201.91
709.635	172.79
710.036	306.29
710.437	136.38
710.838	248.03
711.239	226.19
711.64	204.34
712.041	192.21
712.441	206.77
712.842	250.46
713.243	238.32
713.643	148.52
714.044	231.04
714.445	282.01
714.845	311.14
715.246	318.42
715.646	299
716.046	233.47
716.447	248.03
716.847	289.29
717.247	294.15
717.647	291.72
718.047	282.01
718.447	362.11
718.847	252.89
719.247	291.72
719.647	274.73
720.047	323.28
720.446	274.73
720.846	299
721.246	444.64
721.645	400.95
722.045	369.39
722.444	357.26
722.844	439.78
723.243	400.95
723.643	398.52
724.042	349.98
724.441	449.49
724.84	352.4
725.24	398.52
725.639	415.51
726.038	456.77
726.437	369.39
726.836	420.36
727.234	471.34
727.633	447.06
728.032	517.45
728.431	546.58
728.83	578.13
729.228	585.42
729.627	609.69
730.025	704.35
730.424	733.48
730.822	731.05
731.22	782.02
731.619	862.12
732.017	896.1
732.415	951.93
732.813	1087.85
733.212	1165.52
733.61	1216.49
734.008	1124.26
734.406	1415.53
734.803	1500.48
735.201	1536.89
735.599	1684.95
735.997	1784.46
736.395	1886.41
736.792	1968.93
737.19	2000.49
737.587	2143.69
737.985	2415.54
738.382	2619.43
738.78	2782.05
739.177	2806.32
739.574	2850.01
739.971	3027.2
740.369	3005.36
740.766	3427.69
741.163	3566.04
741.56	3816.05
741.957	3968.96
742.354	4155.86
742.751	4187.41
743.147	4192.27
743.544	4488.39
743.941	4641.3
744.338	4964.12
744.734	5226.26
745.131	5801.52
745.527	6022.39
745.924	6177.74
746.32	6260.26
746.716	6534.54
747.113	6772.41
747.509	7024.84
747.905	7374.36
748.301	8158.35
748.697	8568.55
749.093	9231.18
749.489	9379.24
749.885	9842.84
750.281	10192.36
750.677	10316.15
751.073	10675.38
751.468	10728.78
751.864	11806.46
752.26	12134.14
752.655	13325.91
753.051	13816.2
753.446	14347.77
753.842	14692.43
754.237	15168.17
754.632	15054.09
755.028	14978.84
755.423	14748.26
755.818	15015.25
756.213	16257.99
756.608	16986.16
757.003	17833.26
757.398	18372.1
757.793	18663.37
758.188	18801.72
758.583	18750.75
758.977	18321.13
759.372	18357.54
759.767	18840.55
760.161	20158.54
760.556	21512.93
760.95	23216.84
761.345	25153.76
761.739	26777.57
762.133	27675.64
762.527	28731.48
762.922	28821.29
763.316	28503.33
763.71	27789.72
764.104	27668.36
764.498	28000.89
764.892	29199.94
765.286	30760.64
765.68	32996.11
766.073	34891.77
766.467	36112.67
766.861	37695.22
767.255	39042.32
767.648	39129.7
768.042	38768.05
768.435	38537.46
768.829	37428.22
769.222	37204.92
769.615	37615.12
770.008	37513.17
770.402	38331.15
770.795	39651.56
771.188	42032.66
771.581	44146.77
771.974	45265.72
772.367	44785.13
772.76	45709.9
773.153	44292.41
773.545	43544.82
773.938	42498.69
774.331	41171
774.724	39530.2
775.116	40549.63
775.509	42156.45
775.901	44149.2
776.294	46520.6
776.686	48724.51
777.078	50945.42
777.471	52758.56
777.863	55462.48
778.255	57821.74
778.647	58554.76
779.039	57872.71
779.431	56955.22
779.823	55455.2
780.215	55103.25
780.607	53787.7
780.999	53678.47
781.39	52404.18
781.782	52338.65
782.174	52702.73
782.565	54163.92
782.957	55508.6
783.348	58329.03
783.74	59795.07
784.131	59943.14
784.522	60952.86
784.914	60647.03
785.305	61030.53
785.696	60926.16
786.087	60178.58
786.478	58588.75
786.869	56778.04
787.26	55108.11
787.651	53030.41
788.042	50787.65
788.433	48986.65
788.823	47015.75
789.214	46265.74
789.605	45095.82
789.995	44981.74
790.386	44265.71
790.776	45107.95
791.167	46345.84
791.557	48675.97
791.948	51047.37
792.338	52770.69
792.728	54761.02
793.118	54913.93
793.508	55663.94
793.898	55940.65
794.288	55494.04
794.678	54367.81
795.068	53904.21
795.458	52824.09
795.848	52319.23
796.238	50591.05
796.627	48756.07
797.017	47472.07
797.406	46678.37
797.796	46911.38
798.185	46675.94
798.575	46870.12
798.964	46523.02
799.354	47341
799.743	47855.57
800.132	49501.23
800.521	49513.36
800.91	50709.98
801.299	50896.88
801.688	52566.81
802.077	52066.8
802.466	52600.79
802.855	53304.68
803.244	52193.01
803.633	52855.65
804.021	52287.68
804.41	51040.08
804.799	49372.58
805.187	47649.25
805.576	47217.21
805.964	46020.59
806.352	43071.51
806.741	42005.96
807.129	40731.67
807.517	39916.12
807.905	39297.18
808.293	39229.22
808.681	38583.58
809.069	37175.79
809.457	38117.55
809.845	37389.39
810.233	37493.76
810.621	37311.72
811.009	36539.86
811.396	36726.75
811.784	36039.85
812.171	36042.28
812.559	36607.82
812.946	36605.39
813.334	36258.3
813.721	35940.33
814.108	35505.86
814.496	35719.46
814.883	35736.45
815.27	36600.54
815.657	36787.44
816.044	37450.07
816.431	37632.11
816.818	37190.35
817.205	36942.78
817.592	37437.93
817.979	37202.49
818.365	36394.23
818.752	35323.82
819.139	34355.36
819.525	33508.26
819.912	33646.61
820.298	32957.28
820.685	32132.02
821.071	31003.36
821.457	30964.53
821.843	29367.42
822.23	28488.76
822.616	27517.87
823.002	25602.8
823.388	25136.77
823.774	24100.34
824.16	23617.33
824.546	22930.42
824.931	22454.69
825.317	21663.41
825.703	21454.67
826.089	20187.66
826.474	20177.95
826.86	19583.28
827.245	19182.79
827.631	18886.67
828.016	18253.17
828.401	17808.98
828.787	17393.93
829.172	16876.93
829.557	15991
829.942	15413.32
830.327	15151.18
830.712	14794.37
831.097	14423.01
831.482	13821.06
831.867	13381.73
832.252	12838.03
832.636	12602.59
833.021	12355.02
833.406	12109.87
833.79	11990.93
834.175	11335.58
834.559	11044.32
834.944	10733.63
835.328	10621.98
835.713	10478.77
836.097	10097.7
836.481	9461.77
836.865	9126.81
837.249	8743.31
837.633	8357.38
838.017	8083.11
838.401	7789.41
838.785	7473.87
839.169	7211.73
839.553	7129.21
839.937	6631.63
840.32	6172.88
840.704	6034.53
841.087	5869.48
841.471	5561.22
841.854	5493.26
842.238	5330.64
842.621	5143.74
843.004	4888.88
843.388	4973.83
843.771	4935
844.154	4634.02
844.537	4658.29
844.92	4704.41
845.303	4561.21
845.686	4354.89
846.069	4141.3
846.452	4255.38
846.834	4102.46
847.217	3934.98
847.6	3835.47
847.982	3799.06
848.365	3869.45
848.748	3653.42
849.13	3551.48
849.512	3481.09
849.895	3483.52
850.277	3454.39
850.659	3165.55
851.041	3345.17
851.423	3333.03
851.806	3092.74
852.188	3019.92
852.57	3022.35
852.951	3015.07
853.333	2942.25
853.715	2806.32
854.097	2718.94
854.479	2697.1
854.86	2684.96
855.242	2561.17
855.623	2536.9
856.005	2415.54
856.386	2255.34
856.768	2218.94
857.149	2228.65
857.53	2114.57
857.911	2095.15
858.292	2032.04
858.674	1947.09
859.055	1857.28
859.436	1748.06
859.817	1643.68
860.197	1648.54
860.578	1544.17
860.959	1541.74
861.34	1522.32
861.72	1388.83
862.101	1437.37
862.482	1347.56
862.862	1269.89
863.243	1289.31
863.623	1274.75
864.003	1235.91
864.384	1218.92
864.764	1104.84
865.144	1143.68
865.524	1097.56
865.904	1027.17
866.284	1000.47
866.664	993.19
867.044	942.22
867.424	823.28
867.804	917.95
868.183	857.26
868.563	820.86
868.943	752.89
869.322	801.44
869.702	711.63
870.081	701.92
870.461	643.67
870.84	743.19
871.22	677.65
871.599	614.54
871.978	536.87
872.357	566
872.736	534.44
873.115	485.9
873.494	430.07
873.873	468.91
874.252	468.91
874.631	388.81
875.01	359.68
875.388	447.06
875.767	425.22
876.146	328.13
876.524	325.7
876.903	349.98
877.281	410.66
877.66	349.98
878.038	311.14
878.416	296.58
878.794	265.02
879.173	240.75
879.551	282.01
879.929	315.99
880.307	299
880.685	286.87
881.063	279.59
881.441	272.3
881.818	313.57
882.196	291.72
882.574	267.45
882.951	296.58
883.329	286.87
883.707	301.43
884.084	211.62
884.461	262.6
884.839	221.33
885.216	243.18
885.593	201.91
885.971	233.47
886.348	209.2
886.725	221.33
887.102	248.03
887.479	262.6
887.856	226.19
888.233	221.33
888.609	170.36
888.986	199.49
889.363	126.67
889.74	277.16
890.116	199.49
890.493	201.91
890.869	201.91
891.246	189.78
891.622	243.18
891.998	167.93
892.375	197.06
892.751	233.47
893.127	167.93
893.503	109.68
893.879	167.93
894.255	211.62
894.631	136.38
895.007	143.66
895.383	163.08
895.759	175.22
896.134	226.19
896.51	165.51
896.886	184.92
897.261	136.38
897.637	184.92
898.012	194.63
898.388	124.24
898.763	82.98
899.138	158.22
899.514	129.1
899.889	112.11
900.264	114.53
900.639	138.81
901.014	153.37
901.389	189.78
901.764	158.22
902.139	177.64
902.513	153.37
902.888	112.11
903.263	112.11
903.638	58.71
904.012	194.63
904.387	138.81
904.761	201.91
905.136	102.4
905.51	180.07
905.884	163.08
906.259	187.35
906.633	121.82
907.007	124.24
907.381	107.25
907.755	150.94
908.129	90.26
908.503	223.76
908.877	163.08
909.251	114.53
909.624	56.28
909.998	126.67
910.372	146.09
910.745	158.22
911.119	82.98
911.492	197.06
911.866	95.12
912.239	90.26
912.612	158.22
912.986	80.55
913.359	155.8
913.732	133.95
914.105	172.79
914.478	221.33
914.851	129.1
915.224	138.81
915.597	172.79
915.97	112.11
916.343	102.4
916.715	163.08
917.088	160.65
917.461	116.96
917.833	131.53
918.206	129.1
918.578	121.82
918.951	92.69
919.323	148.52
919.695	153.37
920.067	143.66
920.44	99.97
920.812	163.08
921.184	175.22
921.556	146.09
921.928	78.13
922.3	82.98
922.672	175.22
923.043	112.11
923.415	146.09
923.787	143.66
924.158	172.79
924.53	114.53
924.901	97.54
925.273	141.23
925.644	165.51
926.016	172.79
926.387	182.5
926.758	53.85
927.129	146.09
927.5	97.54
927.872	180.07
928.243	182.5
928.613	114.53
928.984	104.83
929.355	136.38
929.726	133.95
930.097	46.57
930.467	104.83
930.838	104.83
931.209	109.68
931.579	131.53
931.95	104.83
932.32	165.51
932.69	85.41
933.061	121.82
933.431	116.96
933.801	95.12
934.171	68.42
934.541	119.39
934.911	138.81
935.281	153.37
935.651	153.37
936.021	184.92
936.391	182.5
936.761	61.14
937.13	92.69
937.5	167.93
937.87	155.8
938.239	133.95
938.609	141.23
938.978	133.95
939.347	148.52
939.717	153.37
940.086	167.93
940.455	104.83
940.824	116.96
941.193	153.37
941.562	182.5
941.931	141.23
942.3	226.19
942.669	172.79
943.038	189.78
943.407	92.69
943.775	99.97
944.144	138.81
944.513	104.83
944.881	131.53
945.25	138.81
945.618	180.07
945.986	182.5
946.355	165.51
946.723	184.92
947.091	112.11
947.459	53.85
947.827	187.35
948.195	184.92
948.563	141.23
948.931	99.97
949.299	138.81
949.667	116.96
950.035	78.13
950.402	119.39
950.77	99.97
951.138	116.96
951.505	163.08
951.873	148.52
952.24	138.81
952.607	141.23
952.975	143.66
953.342	170.36
953.709	141.23
954.076	119.39
954.443	155.8
954.81	102.4
955.177	148.52
955.544	136.38
955.911	165.51
956.278	75.7
956.645	150.94
957.012	107.25
957.378	216.48
957.745	184.92
958.111	114.53
958.478	119.39
958.844	214.05
959.211	155.8
959.577	116.96
959.943	102.4
960.309	218.91
960.675	216.48
961.042	199.49
961.408	129.1
961.774	121.82
962.139	153.37
962.505	138.81
962.871	153.37
963.237	114.53
963.603	187.35
963.968	116.96
964.334	133.95
964.699	126.67
965.065	192.21
965.43	172.79
965.796	126.67
966.161	70.84
966.526	114.53
966.891	172.79
967.256	199.49
967.622	116.96
967.987	136.38
968.352	214.05
968.716	133.95
969.081	148.52
969.446	51.43
969.811	180.07
970.176	143.66
970.54	129.1
970.905	85.41
971.269	124.24
971.634	141.23
971.998	97.54
972.363	163.08
972.727	131.53
973.091	243.18
973.455	90.26
973.819	124.24
974.183	126.67
974.547	119.39
974.911	158.22
975.275	146.09
975.639	158.22
976.003	184.92
976.367	141.23
976.73	99.97
977.094	143.66
977.458	126.67
977.821	187.35
978.185	133.95
978.548	160.65
978.911	107.25
979.275	131.53
979.638	102.4
980.001	97.54
980.364	124.24
980.727	175.22
981.09	180.07
981.453	160.65
981.816	119.39
982.179	165.51
982.542	63.56
982.905	114.53
983.267	141.23
983.63	143.66
983.992	112.11
984.355	109.68
984.717	150.94
985.08	131.53
985.442	163.08
985.804	167.93
986.167	206.77
986.529	184.92
986.891	160.65
987.253	170.36
987.615	95.12
987.977	175.22
988.339	214.05
988.701	119.39
989.062	146.09
989.424	167.93
989.786	131.53
990.147	136.38
990.509	133.95
990.87	170.36
991.232	158.22
991.593	99.97
991.955	216.48
992.316	112.11
992.677	46.57
993.038	58.71
993.399	141.23
993.76	129.1
994.121	158.22
994.482	146.09
994.843	158.22
995.204	199.49
995.565	85.41
995.926	167.93
996.286	199.49
996.647	167.93
997.007	136.38
997.368	153.37
997.728	146.09
998.089	209.2
998.449	192.21
998.809	138.81
999.169	121.82
999.53	184.92
999.89	155.8
1000.25	141.23
1000.61	131.53
1000.97	121.82
1001.329	107.25
1001.689	167.93
1002.049	184.92
1002.409	119.39
1002.768	92.69
1003.128	109.68
1003.487	126.67
1003.847	158.22
1004.206	184.92
1004.566	56.28
1004.925	182.5
1005.284	141.23
1005.643	114.53
1006.003	114.53
1006.362	119.39
1006.721	211.62
1007.08	167.93
1007.438	107.25
1007.797	114.53
1008.156	107.25
1008.515	163.08
1008.874	109.68
1009.232	141.23
1009.591	138.81
1009.949	131.53
1010.308	187.35
1010.666	150.94
1011.024	75.7
1011.383	53.85
1011.741	102.4
1012.099	163.08
1012.457	141.23
1012.815	153.37
1013.173	133.95
1013.531	102.4
1013.889	82.98
1014.247	172.79
1014.605	143.66
1014.962	116.96
1015.32	126.67
1015.678	92.69
1016.035	172.79
1016.393	143.66
1016.75	116.96
1017.107	131.53
1017.465	97.54
1017.822	53.85
1018.179	116.96
1018.536	163.08
1018.894	146.09
1019.251	133.95
1019.608	177.64
1019.964	155.8
1020.321	204.34
1020.678	85.41
1021.035	95.12
1021.392	165.51
1021.748	153.37
1022.105	133.95
1022.461	146.09
1022.818	170.36
1023.174	61.14
1023.531	112.11
1023.887	85.41
1024.243	228.61
1024.599	172.79
1024.955	153.37
1025.311	99.97
1025.667	107.25
1026.023	85.41
1026.379	87.84
1026.735	119.39
1027.091	165.51
1027.447	216.48
