189.514	83.13
189.973	83.13
190.431	83.13
190.889	5.46
191.348	-1.82
191.806	12.74
192.264	-62.5
192.722	-57.65
193.18	29.73
193.638	-6.67
194.096	44.3
194.554	-52.79
195.012	49.15
195.47	24.88
195.928	-35.8
196.385	-57.65
196.843	17.6
197.301	-69.78
197.758	22.45
198.216	3.03
198.674	121.97
199.131	29.73
199.589	97.7
200.046	44.3
200.503	102.55
200.961	102.55
201.418	75.85
201.875	44.3
202.332	153.52
202.79	71
203.247	187.5
203.704	160.8
204.161	189.93
204.618	172.94
205.075	112.26
205.532	129.25
205.989	153.52
206.445	151.09
206.902	172.94
207.359	209.35
207.816	172.94
208.272	206.92
208.729	151.09
209.185	175.37
209.642	182.65
210.098	134.1
210.555	231.19
211.011	172.94
211.467	231.19
211.924	80.71
212.38	172.94
212.836	138.96
213.292	155.95
213.748	143.81
214.204	151.09
214.66	153.52
215.116	221.48
215.572	155.95
216.028	228.77
216.484	129.25
216.94	141.39
217.396	163.23
217.851	138.96
218.307	73.42
218.763	163.23
219.218	219.06
219.674	151.09
220.129	141.39
220.585	114.69
221.04	151.09
221.496	189.93
221.951	177.79
222.406	143.81
222.861	180.22
223.317	209.35
223.772	121.97
224.227	66.14
224.682	107.4
225.137	175.37
225.592	180.22
226.047	131.68
226.502	175.37
226.957	177.79
227.411	197.21
227.866	136.53
228.321	185.08
228.776	170.51
229.23	185.08
229.685	112.26
230.139	153.52
230.594	199.64
231.048	194.78
231.503	141.39
231.957	197.21
232.411	131.68
232.865	168.09
233.32	114.69
233.774	102.55
234.228	138.96
234.682	56.43
235.136	138.96
235.59	97.7
236.044	211.78
236.498	180.22
236.952	192.36
237.406	182.65
237.86	141.39
238.313	155.95
238.767	180.22
239.221	163.23
239.674	204.49
240.128	182.65
240.581	185.08
241.035	187.5
241.488	158.38
241.942	206.92
242.395	228.77
242.848	194.78
243.301	126.82
243.755	194.78
244.208	160.8
244.661	155.95
245.114	160.8
245.567	126.82
246.02	177.79
246.473	199.64
246.926	214.2
247.379	175.37
247.832	204.49
248.284	155.95
248.737	204.49
249.19	182.65
249.642	175.37
250.095	136.53
250.547	209.35
251	119.54
251.452	153.52
251.905	131.68
252.357	112.26
252.81	206.92
253.262	172.94
253.714	151.09
254.166	185.08
254.618	236.05
255.07	204.49
255.523	126.82
255.975	153.52
256.427	143.81
256.878	121.97
257.33	160.8
257.782	189.93
258.234	129.25
258.686	185.08
259.137	126.82
259.589	121.97
260.041	177.79
260.492	180.22
260.944	143.81
261.395	177.79
261.847	134.1
262.298	109.83
262.749	129.25
263.201	177.79
263.652	189.93
264.103	146.24
264.554	138.96
265.005	141.39
265.457	141.39
265.908	189.93
266.359	194.78
266.809	158.38
267.26	146.24
267.711	141.39
268.162	192.36
268.613	141.39
269.064	165.66
269.514	151.09
269.965	199.64
270.415	182.65
270.866	177.79
271.316	151.09
271.767	182.65
272.217	97.7
272.668	223.91
273.118	124.4
273.568	129.25
274.019	134.1
274.469	206.92
274.919	119.54
275.369	175.37
275.819	92.84
276.269	226.34
276.719	206.92
277.169	155.95
277.619	121.97
278.069	168.09
278.518	221.48
278.968	71
279.418	194.78
279.867	109.83
280.317	209.35
280.767	214.2
281.216	185.08
281.666	211.78
282.115	204.49
282.564	153.52
283.014	124.4
283.463	170.51
283.912	202.07
284.361	121.97
284.811	185.08
285.26	121.97
285.709	114.69
286.158	187.5
286.607	165.66
287.056	102.55
287.505	216.63
287.953	126.82
288.402	180.22
288.851	170.51
289.3	141.39
289.748	209.35
290.197	182.65
290.646	238.47
291.094	126.82
291.543	175.37
291.991	197.21
292.439	211.78
292.888	168.09
293.336	126.82
293.784	114.69
294.233	194.78
294.681	180.22
295.129	189.93
295.577	146.24
296.025	136.53
296.473	124.4
296.921	172.94
297.369	100.12
297.817	160.8
298.264	185.08
298.712	182.65
299.16	143.81
299.608	151.09
300.055	168.09
300.503	223.91
300.95	187.5
301.398	117.11
301.845	155.95
302.293	204.49
302.74	204.49
303.187	187.5
303.635	158.38
304.082	143.81
304.529	136.53
304.976	155.95
305.423	187.5
305.87	158.38
306.317	73.42
306.764	197.21
307.211	155.95
307.658	170.51
308.105	216.63
308.552	136.53
308.998	180.22
309.445	245.76
309.892	109.83
310.338	141.39
310.785	165.66
311.231	199.64
311.678	143.81
312.124	146.24
312.571	202.07
313.017	219.06
313.463	95.27
313.909	262.75
314.356	107.4
314.802	182.65
315.248	177.79
315.694	170.51
316.14	177.79
316.586	223.91
317.032	136.53
317.478	158.38
317.923	136.53
318.369	112.26
318.815	160.8
319.261	182.65
319.706	170.51
320.152	172.94
320.597	107.4
321.043	87.99
321.488	206.92
321.934	236.05
322.379	206.92
322.824	165.66
323.27	143.81
323.715	160.8
324.16	199.64
324.605	238.47
325.05	187.5
325.495	143.81
325.94	131.68
326.385	155.95
326.83	168.09
327.275	131.68
327.72	97.7
328.165	131.68
328.61	100.12
329.054	165.66
329.499	206.92
329.943	177.79
330.388	158.38
330.832	155.95
331.277	151.09
331.721	117.11
332.166	95.27
332.61	194.78
333.054	114.69
333.499	202.07
333.943	163.23
334.387	158.38
334.831	168.09
335.275	160.8
335.719	170.51
336.163	117.11
336.607	192.36
337.051	192.36
337.495	194.78
337.938	175.37
338.382	170.51
338.826	172.94
339.269	151.09
339.713	141.39
340.157	148.67
340.6	170.51
341.044	197.21
341.487	138.96
341.93	151.09
342.374	85.56
342.817	131.68
343.26	117.11
343.703	194.78
344.146	175.37
344.59	172.94
345.033	134.1
345.476	143.81
345.919	177.79
346.361	158.38
346.804	136.53
347.247	92.84
347.69	136.53
348.133	104.98
348.575	197.21
349.018	202.07
349.461	168.09
349.903	223.91
350.346	153.52
350.788	163.23
351.23	153.52
351.673	194.78
352.115	148.67
352.557	165.66
353	126.82
353.442	187.5
353.884	136.53
354.326	151.09
354.768	211.78
355.21	153.52
355.652	148.67
356.094	170.51
356.536	194.78
356.978	160.8
357.419	253.04
357.861	148.67
358.303	274.88
358.744	170.51
359.186	187.5
359.627	214.2
360.069	170.51
360.51	199.64
360.952	192.36
361.393	114.69
361.834	202.07
362.276	141.39
362.717	141.39
363.158	121.97
363.599	192.36
364.04	185.08
364.481	134.1
364.922	155.95
365.363	107.4
365.804	260.32
366.245	153.52
366.686	175.37
367.126	172.94
367.567	221.48
368.008	185.08
368.448	221.48
368.889	172.94
369.33	136.53
369.77	202.07
370.21	209.35
370.651	163.23
371.091	158.38
371.531	180.22
371.972	192.36
372.412	121.97
372.852	163.23
373.292	175.37
373.732	102.55
374.172	189.93
374.612	141.39
375.052	151.09
375.492	141.39
375.932	163.23
376.372	170.51
376.811	180.22
377.251	180.22
377.691	185.08
378.13	114.69
378.57	155.95
379.009	175.37
379.449	124.4
379.888	192.36
380.328	206.92
380.767	158.38
381.206	185.08
381.645	199.64
382.085	121.97
382.524	117.11
382.963	153.52
383.402	187.5
383.841	153.52
384.28	204.49
384.719	170.51
385.158	107.4
385.596	180.22
386.035	143.81
386.474	170.51
386.913	87.99
387.351	216.63
387.79	141.39
388.228	189.93
388.667	131.68
389.105	151.09
389.544	134.1
389.982	172.94
390.42	158.38
390.859	170.51
391.297	168.09
391.735	182.65
392.173	163.23
392.611	172.94
393.049	185.08
393.487	175.37
393.925	141.39
394.363	170.51
394.801	180.22
395.239	177.79
395.676	177.79
396.114	78.28
396.552	97.7
396.989	182.65
397.427	197.21
397.864	216.63
398.302	170.51
398.739	185.08
399.177	163.23
399.614	124.4
400.051	182.65
400.488	177.79
400.926	146.24
401.363	194.78
401.8	194.78
402.237	165.66
402.674	151.09
403.111	187.5
403.548	112.26
403.985	168.09
404.421	158.38
404.858	129.25
405.295	199.64
405.732	124.4
406.168	160.8
406.605	192.36
407.041	114.69
407.478	151.09
407.914	143.81
408.351	172.94
408.787	257.89
409.223	172.94
409.66	114.69
410.096	85.56
410.532	138.96
410.968	194.78
411.404	172.94
411.84	146.24
412.276	158.38
412.712	194.78
413.148	185.08
413.584	80.71
414.02	138.96
414.455	148.67
414.891	124.4
415.327	131.68
415.762	158.38
416.198	136.53
416.633	226.34
417.069	141.39
417.504	197.21
417.94	124.4
418.375	177.79
418.81	112.26
419.245	136.53
419.681	177.79
420.116	172.94
420.551	182.65
420.986	165.66
421.421	206.92
421.856	202.07
422.291	158.38
422.726	143.81
423.16	177.79
423.595	197.21
424.03	117.11
424.464	146.24
424.899	153.52
425.334	160.8
425.768	168.09
426.203	141.39
426.637	228.77
427.071	160.8
427.506	163.23
427.94	134.1
428.374	204.49
428.809	197.21
429.243	182.65
429.677	114.69
430.111	141.39
430.545	221.48
430.979	189.93
431.413	168.09
431.847	187.5
432.28	117.11
432.714	119.54
433.148	148.67
433.582	202.07
434.015	146.24
434.449	199.64
434.882	151.09
435.316	163.23
435.749	146.24
436.183	202.07
436.616	107.4
437.049	155.95
437.483	134.1
437.916	221.48
438.349	177.79
438.782	136.53
439.215	119.54
439.648	177.79
440.081	148.67
440.514	131.68
440.947	250.61
441.38	141.39
441.813	204.49
442.245	182.65
442.678	134.1
443.111	158.38
443.543	160.8
443.976	202.07
444.408	104.98
444.841	163.23
445.273	151.09
445.705	185.08
446.138	180.22
446.57	146.24
447.002	141.39
447.434	199.64
447.867	172.94
448.299	245.76
448.731	226.34
449.163	134.1
449.595	192.36
450.026	226.34
450.458	194.78
450.89	192.36
451.322	194.78
451.754	238.47
452.185	243.33
452.617	245.76
453.048	272.46
453.48	214.2
453.911	250.61
454.343	189.93
454.774	257.89
455.205	236.05
455.637	177.79
456.068	214.2
456.499	236.05
456.93	209.35
457.361	163.23
457.792	168.09
458.223	192.36
458.654	197.21
459.085	219.06
459.516	134.1
459.947	204.49
460.378	177.79
460.808	226.34
461.239	236.05
461.669	223.91
462.1	194.78
462.531	175.37
462.961	185.08
463.391	245.76
463.822	284.59
464.252	146.24
464.682	221.48
465.113	238.47
465.543	189.93
465.973	170.51
466.403	189.93
466.833	214.2
467.263	170.51
467.693	231.19
468.123	158.38
468.553	160.8
468.983	204.49
469.412	223.91
469.842	267.6
470.272	265.17
470.701	119.54
471.131	257.89
471.56	170.51
471.99	209.35
472.419	197.21
472.849	231.19
473.278	170.51
473.707	214.2
474.136	187.5
474.566	204.49
474.995	177.79
475.424	236.05
475.853	175.37
476.282	158.38
476.711	121.97
477.14	160.8
477.569	155.95
477.997	180.22
478.426	245.76
478.855	192.36
479.283	192.36
479.712	221.48
480.141	189.93
480.569	199.64
480.998	153.52
481.426	119.54
481.854	240.9
482.283	245.76
482.711	168.09
483.139	126.82
483.567	209.35
483.995	136.53
484.424	136.53
484.852	216.63
485.28	187.5
485.708	221.48
486.135	185.08
486.563	104.98
486.991	180.22
487.419	160.8
487.847	131.68
488.274	177.79
488.702	165.66
489.129	141.39
489.557	151.09
489.984	180.22
490.412	223.91
490.839	131.68
491.266	180.22
491.694	185.08
492.121	194.78
492.548	209.35
492.975	163.23
493.402	146.24
493.829	158.38
494.256	155.95
494.683	158.38
495.11	206.92
495.537	87.99
495.964	124.4
496.39	165.66
496.817	168.09
497.244	206.92
497.67	146.24
498.097	177.79
498.523	109.83
498.95	194.78
499.376	134.1
499.803	165.66
500.229	124.4
500.655	228.77
501.081	131.68
501.508	185.08
501.934	182.65
502.36	240.9
502.786	199.64
503.212	151.09
503.638	126.82
504.064	134.1
504.489	187.5
504.915	194.78
505.341	172.94
505.767	134.1
506.192	180.22
506.618	153.52
507.043	197.21
507.469	163.23
507.894	155.95
508.32	209.35
508.745	141.39
509.17	165.66
509.596	172.94
510.021	138.96
510.446	160.8
510.871	153.52
511.296	158.38
511.721	177.79
512.146	134.1
512.571	78.28
512.996	192.36
513.421	117.11
513.845	194.78
514.27	124.4
514.695	204.49
515.119	219.06
515.544	114.69
515.969	151.09
516.393	100.12
516.817	175.37
517.242	194.78
517.666	117.11
518.09	253.04
518.515	121.97
518.939	168.09
519.363	369.54
519.787	153.52
520.211	192.36
520.635	141.39
521.059	160.8
521.483	243.33
521.907	187.5
522.331	216.63
522.754	141.39
523.178	102.55
523.602	194.78
524.025	151.09
524.449	117.11
524.872	182.65
525.296	138.96
525.719	228.77
526.143	209.35
526.566	192.36
526.989	189.93
527.412	185.08
527.836	155.95
528.259	172.94
528.682	151.09
529.105	240.9
529.528	172.94
529.951	114.69
530.374	102.55
530.796	233.62
531.219	194.78
531.642	146.24
532.065	119.54
532.487	233.62
532.91	168.09
533.332	214.2
533.755	199.64
534.177	189.93
534.6	199.64
535.022	175.37
535.444	194.78
535.867	194.78
536.289	182.65
536.711	202.07
537.133	185.08
537.555	155.95
537.977	197.21
538.399	204.49
538.821	146.24
539.243	223.91
539.665	185.08
540.086	238.47
540.508	209.35
540.93	170.51
541.351	180.22
541.773	141.39
542.195	204.49
542.616	202.07
543.037	172.94
543.459	189.93
543.88	151.09
544.301	189.93
544.723	206.92
545.144	231.19
545.565	180.22
545.986	138.96
546.407	194.78
546.828	219.06
547.249	180.22
547.67	158.38
548.091	170.51
548.512	160.8
548.932	158.38
549.353	202.07
549.774	236.05
550.194	267.6
550.615	170.51
551.035	192.36
551.456	148.67
551.876	146.24
552.296	143.81
552.717	202.07
553.137	180.22
553.557	131.68
553.977	168.09
554.397	163.23
554.817	177.79
555.237	189.93
555.657	223.91
556.077	177.79
556.497	187.5
556.917	160.8
557.337	136.53
557.756	143.81
558.176	160.8
558.596	121.97
559.015	165.66
559.435	129.25
559.854	197.21
560.274	134.1
560.693	206.92
561.112	104.98
561.532	160.8
561.951	187.5
562.37	189.93
562.789	250.61
563.208	197.21
563.627	238.47
564.046	141.39
564.465	182.65
564.884	182.65
565.303	153.52
565.722	163.23
566.14	114.69
566.559	170.51
566.978	199.64
567.396	221.48
567.815	180.22
568.233	155.95
568.652	219.06
569.07	146.24
569.489	141.39
569.907	192.36
570.325	204.49
570.743	206.92
571.161	206.92
571.58	168.09
571.998	219.06
572.416	136.53
572.833	177.79
573.251	187.5
573.669	170.51
574.087	194.78
574.505	126.82
574.922	129.25
575.34	180.22
575.758	138.96
576.175	189.93
576.593	182.65
577.01	146.24
577.428	243.33
577.845	1396.26
578.262	274.88
578.68	168.09
579.097	138.96
579.514	170.51
579.931	197.21
580.348	175.37
580.765	175.37
581.182	175.37
581.599	189.93
582.016	177.79
582.433	206.92
582.849	192.36
583.266	209.35
583.683	199.64
584.099	219.06
584.516	163.23
584.933	143.81
585.349	163.23
585.765	158.38
586.182	160.8
586.598	175.37
587.014	165.66
587.431	267.6
587.847	202.07
588.263	219.06
588.679	153.52
589.095	146.24
589.511	245.76
589.927	189.93
590.343	153.52
590.759	238.47
591.174	148.67
591.59	163.23
592.006	146.24
592.421	199.64
592.837	165.66
593.252	124.4
593.668	129.25
594.083	129.25
594.499	148.67
594.914	151.09
595.329	187.5
595.745	209.35
596.16	185.08
596.575	114.69
596.99	206.92
597.405	175.37
597.82	194.78
598.235	158.38
598.65	163.23
599.065	226.34
599.479	175.37
599.894	192.36
600.309	172.94
600.724	262.75
601.138	197.21
601.553	214.2
601.967	182.65
602.382	185.08
602.796	163.23
603.21	148.67
603.625	197.21
604.039	175.37
604.453	228.77
604.867	163.23
605.281	219.06
605.695	170.51
606.109	97.7
606.523	204.49
606.937	204.49
607.351	238.47
607.765	121.97
608.178	158.38
608.592	175.37
609.006	233.62
609.419	223.91
609.833	126.82
610.246	153.52
610.66	199.64
611.073	308.86
611.487	187.5
611.9	172.94
612.313	148.67
612.726	117.11
613.139	199.64
613.553	248.18
613.966	185.08
614.379	182.65
614.792	165.66
615.204	177.79
615.617	121.97
616.03	185.08
616.443	126.82
616.856	194.78
617.268	177.79
617.681	102.55
618.093	155.95
618.506	172.94
618.918	138.96
619.331	248.18
619.743	129.25
620.155	163.23
620.568	136.53
620.98	141.39
621.392	182.65
621.804	199.64
622.216	129.25
622.628	165.66
623.04	192.36
623.452	182.65
623.864	165.66
624.276	151.09
624.687	124.4
625.099	165.66
625.511	138.96
625.922	175.37
626.334	83.13
626.745	160.8
627.157	172.94
627.568	153.52
627.979	160.8
628.391	136.53
628.802	168.09
629.213	182.65
629.624	270.03
630.035	134.1
630.446	155.95
630.857	180.22
631.268	180.22
631.679	114.69
632.09	214.2
632.501	199.64
632.912	206.92
633.322	209.35
633.733	151.09
634.144	158.38
634.554	182.65
634.965	172.94
635.375	109.83
635.785	163.23
636.196	151.09
636.606	194.78
637.016	117.11
637.427	216.63
637.837	204.49
638.247	287.02
638.657	197.21
639.067	146.24
639.477	170.51
639.887	185.08
640.297	163.23
640.706	192.36
641.116	216.63
641.526	143.81
641.935	126.82
642.345	107.4
642.755	121.97
643.164	182.65
643.573	87.99
643.983	160.8
644.392	148.67
644.801	192.36
645.211	131.68
645.62	177.79
646.029	248.18
646.438	141.39
646.847	138.96
647.256	214.2
647.665	175.37
648.074	172.94
648.483	148.67
648.892	109.83
649.3	163.23
649.709	189.93
650.118	172.94
650.526	189.93
650.935	155.95
651.343	206.92
651.752	58.86
652.16	124.4
652.568	153.52
652.977	177.79
653.385	119.54
653.793	148.67
654.201	124.4
654.609	177.79
655.017	187.5
655.425	124.4
655.833	194.78
656.241	165.66
656.649	170.51
657.057	155.95
657.464	180.22
657.872	148.67
658.28	165.66
658.687	151.09
659.095	146.24
659.502	146.24
659.91	194.78
660.317	172.94
660.724	119.54
661.132	121.97
661.539	126.82
661.946	131.68
662.353	211.78
662.76	185.08
663.167	146.24
663.574	182.65
663.981	143.81
664.388	163.23
664.795	209.35
665.202	175.37
665.608	192.36
666.015	134.1
666.422	168.09
666.828	180.22
667.235	211.78
667.641	228.77
668.047	92.84
668.454	192.36
668.86	131.68
669.266	112.26
669.673	160.8
670.079	192.36
670.485	180.22
670.891	221.48
671.297	151.09
671.703	124.4
672.109	211.78
672.515	209.35
672.92	126.82
673.326	172.94
673.732	187.5
674.138	131.68
674.543	204.49
674.949	175.37
675.354	158.38
675.76	175.37
676.165	163.23
676.57	231.19
676.976	165.66
677.381	158.38
677.786	146.24
678.191	216.63
678.596	187.5
679.001	175.37
679.406	238.47
679.811	121.97
680.216	243.33
680.621	202.07
681.026	131.68
681.43	119.54
681.835	187.5
682.24	194.78
682.644	185.08
683.049	170.51
683.453	257.89
683.858	223.91
684.262	155.95
684.667	138.96
685.071	148.67
685.475	228.77
685.879	192.36
686.283	216.63
686.687	248.18
687.091	202.07
687.495	153.52
687.899	168.09
688.303	238.47
688.707	194.78
689.111	199.64
689.514	177.79
689.918	155.95
690.322	109.83
690.725	155.95
691.129	138.96
691.532	272.46
691.936	158.38
692.339	219.06
692.742	126.82
693.146	90.41
693.549	160.8
693.952	194.78
694.355	187.5
694.758	194.78
695.161	155.95
695.564	158.38
695.967	226.34
696.37	214.2
696.773	209.35
697.175	151.09
697.578	165.66
697.981	223.91
698.383	134.1
698.786	245.76
699.188	202.07
699.591	146.24
699.993	194.78
700.395	112.26
700.798	165.66
701.2	206.92
701.602	211.78
702.004	187.5
702.406	117.11
702.808	245.76
703.21	168.09
703.612	226.34
704.014	177.79
704.416	146.24
704.818	248.18
705.219	231.19
705.621	313.72
706.023	308.86
706.424	277.31
706.826	262.75
707.227	168.09
707.629	216.63
708.03	211.78
708.431	262.75
708.832	245.76
709.234	240.9
709.635	223.91
710.036	272.46
710.437	272.46
710.838	294.3
711.239	216.63
711.64	260.32
712.041	257.89
712.441	180.22
712.842	238.47
713.243	289.45
713.643	192.36
714.044	287.02
714.445	219.06
714.845	379.25
715.246	257.89
715.646	379.25
716.046	299.16
716.447	359.84
716.847	357.41
717.247	342.85
717.647	325.85
718.047	340.42
718.447	357.41
718.847	335.56
719.247	321
719.647	439.93
720.047	379.25
720.446	367.12
720.846	330.71
721.246	369.54
721.645	291.87
722.045	374.4
722.444	352.55
722.844	376.83
723.243	430.23
723.643	418.09
724.042	435.08
724.441	478.77
724.84	437.51
725.24	471.49
725.639	488.48
726.038	539.45
726.437	515.18
726.836	532.17
727.234	520.03
727.633	483.62
728.032	551.59
728.431	532.17
728.83	571
729.228	685.08
729.627	745.76
730.025	859.84
730.424	847.71
730.822	927.81
731.22	833.14
731.619	959.36
732.017	876.83
732.415	920.52
732.813	961.79
733.212	983.63
733.61	1073.44
734.008	1199.65
734.406	1461.79
734.803	1702.09
735.201	1726.36
735.599	1939.96
735.997	1969.08
736.395	2073.45
736.792	1908.4
737.19	1774.91
737.587	1709.37
737.985	1709.37
738.382	1808.89
738.78	2049.18
739.177	2452.1
739.574	2939.97
739.971	3384.15
740.369	3728.82
740.766	3920.57
741.163	3774.94
741.56	3520.08
741.957	3221.53
742.354	2981.24
742.751	2978.81
743.147	3039.49
743.544	3442.41
743.941	4168.15
744.338	4891.46
744.734	5568.65
745.131	6136.62
745.527	6345.37
745.924	6046.82
746.32	5692.44
746.716	5148.75
747.113	4799.23
747.509	4821.07
747.905	5677.88
748.301	6721.59
748.697	7927.91
749.093	9391.53
749.489	9816.29
749.885	10406.11
750.281	10071.15
750.677	8913.37
751.073	7969.18
751.468	7794.42
751.864	7995.88
752.26	9211.92
752.655	11129.42
753.051	13267.8
753.446	14653.75
753.842	15229
754.237	15054.24
754.632	13721.69
755.028	12025.07
755.423	10789.61
755.818	10886.7
756.213	12391.58
756.608	14323.65
757.003	16595.53
757.398	17864.96
757.793	18263.03
758.188	17595.54
758.583	16282.41
758.977	13937.72
759.372	13194.99
759.767	14068.79
760.161	16517.85
760.556	20129.56
760.95	23294.66
761.345	25066.53
761.739	25158.77
762.133	23986.42
762.527	21668.42
762.922	19816.45
763.316	19891.69
763.71	21452.4
764.104	24911.19
764.498	28806.88
764.892	31789.94
765.286	31569.06
765.68	30569.04
766.073	27423.36
766.467	24491.28
766.861	24503.42
767.255	26401.5
767.648	30741.38
768.042	34938.04
768.435	37758.48
768.829	37591
769.222	35600.68
769.615	32559.37
770.008	28726.78
770.402	28692.8
770.795	31302.06
771.188	34654.06
771.581	38416.25
771.974	39542.48
772.367	38782.76
772.76	36617.68
773.153	32003.53
773.545	30277.78
773.938	29782.62
774.331	32797.23
774.724	37241.48
775.116	41629.9
775.509	44518.29
775.901	43399.34
776.294	39535.2
776.686	36052.14
777.078	35658.93
777.471	38918.69
777.863	44935.77
778.255	49967.4
778.647	52375.21
779.039	50571.78
779.431	46411.52
779.823	42877.49
780.215	41506.11
780.607	41916.31
780.999	47384.84
781.39	52513.56
781.782	54283
782.174	53105.8
782.565	50105.76
782.957	45525.59
783.348	43911.48
783.74	44637.22
784.131	49316.91
784.522	53302.41
784.914	54025.72
785.305	53758.72
785.696	49520.79
786.087	45011.02
786.478	42336.22
786.869	42629.91
787.26	46074.14
787.651	48511.07
788.042	49603.32
788.433	46894.54
788.823	42581.37
789.214	38372.56
789.605	36622.54
789.995	37195.36
790.386	40758.52
790.776	43370.21
791.167	43615.36
791.557	41996.41
791.948	38620.14
792.338	36564.28
792.728	37527.89
793.118	40018.22
793.508	44328.97
793.898	46678.52
794.288	45889.67
794.678	42642.05
795.068	39739.09
795.458	37622.55
795.848	39212.38
796.238	42355.63
796.627	45440.63
797.017	45620.25
797.406	43588.66
797.796	39464.81
798.185	37314.29
798.575	37736.63
798.964	40666.29
799.354	45132.38
799.743	46729.49
800.132	45831.42
800.521	42862.92
800.91	39251.22
801.299	36984.19
801.688	39739.09
802.077	42411.46
802.466	44790.14
802.855	44469.75
803.244	40506.09
803.633	36826.42
804.021	34518.13
804.41	35421.06
804.799	38222.08
805.187	38841.02
805.576	38974.51
805.964	36158.94
806.352	32391.89
806.741	29918.55
807.129	30054.47
807.517	32705
807.905	35603.1
808.293	36401.66
808.681	33947.74
809.069	30680.7
809.457	29988.94
809.845	30469.53
810.233	33197.73
810.621	36139.52
811.009	36433.21
811.396	35306.98
811.784	32513.25
812.171	30319.04
812.559	30413.7
812.946	31622.46
813.334	34396.77
813.721	34219.59
814.108	31870.03
814.496	28755.91
814.883	26649.08
815.27	27950.07
815.657	29731.65
816.044	31882.17
816.431	32326.35
816.818	30510.79
817.205	27617.54
817.592	26442.77
817.979	26935.49
818.365	28751.05
818.752	29537.47
819.139	27942.79
819.525	26382.09
819.912	23835.93
820.298	22428.14
820.685	22670.86
821.071	23743.69
821.457	24590.8
821.843	23331.07
822.23	21440.26
822.616	19073.72
823.002	17571.27
823.388	18195.06
823.774	19420.81
824.16	19360.13
824.546	18032.44
824.931	16493.58
825.317	15255.7
825.703	14845.5
826.089	16027.56
826.474	17185.34
826.86	17013.01
827.245	16282.41
827.631	14699.86
828.016	13804.22
828.401	13954.71
828.787	14551.8
829.172	15173.17
829.557	14515.4
829.942	13161.01
830.327	12042.06
830.712	11830.89
831.097	12440.12
831.482	13114.89
831.867	13216.83
832.252	12296.91
832.636	10889.13
833.021	10418.24
833.406	10219.21
833.79	11165.83
834.175	11578.46
834.559	11282.34
834.944	10262.9
835.328	9532.31
835.713	8966.77
836.097	8978.9
836.481	9406.09
836.865	9697.36
837.249	8978.9
837.633	7903.64
838.017	7199.75
838.401	7083.24
838.785	7403.63
839.169	7799.27
839.553	7306.55
839.937	6600.22
840.32	5774.97
840.704	5515.26
841.087	5585.65
841.471	6000.7
841.854	5913.32
842.238	5546.81
842.621	4825.92
843.004	4573.49
843.388	4658.45
843.771	5020.1
844.154	5214.28
844.537	5029.81
844.92	4556.5
845.303	4134.17
845.686	3845.33
846.069	4219.12
846.452	4418.15
846.834	4488.54
847.217	4272.52
847.6	3680.28
847.982	3464.25
848.365	3658.43
848.748	3799.21
849.13	3806.49
849.512	3617.17
849.895	3214.25
850.277	2918.13
850.659	3022.5
851.041	3357.46
851.423	3580.76
851.806	3340.46
852.188	2981.24
852.57	2590.45
852.951	2685.11
853.333	2804.05
853.715	2838.03
854.097	2852.59
854.479	2597.73
854.86	2248.21
855.242	2216.66
855.623	2151.13
856.005	2335.59
856.386	2357.44
856.768	2141.42
857.149	1937.53
857.53	1592.86
857.911	1804.03
858.292	1881.7
858.674	1966.66
859.055	1838.01
859.436	1595.29
859.817	1464.22
860.197	1444.8
860.578	1512.77
860.959	1641.41
861.34	1524.9
861.72	1299.17
862.101	1243.34
862.482	1100.14
862.862	1250.63
863.243	1262.76
863.623	1321.02
864.003	1170.53
864.384	1063.73
864.764	1020.04
865.144	971.5
865.524	1071.01
865.904	1143.83
866.284	993.34
866.664	886.54
867.044	859.84
867.424	857.42
867.804	918.1
868.183	922.95
868.563	813.73
868.943	694.79
869.322	709.36
869.702	670.52
870.081	680.23
870.461	753.05
870.84	738.48
871.22	714.21
871.599	551.59
871.978	600.13
872.357	583.14
872.736	609.84
873.115	600.13
873.494	461.78
873.873	532.17
874.252	515.18
874.631	488.48
875.01	493.33
875.388	527.31
875.767	369.54
876.146	304.01
876.524	398.67
876.903	425.37
877.281	427.8
877.66	442.36
878.038	362.26
878.416	318.57
878.794	294.3
879.173	369.54
879.551	376.83
879.929	388.96
880.307	306.44
880.685	238.47
881.063	270.03
881.441	304.01
881.818	306.44
882.196	284.59
882.574	296.73
882.951	284.59
883.329	119.54
883.707	262.75
884.084	279.74
884.461	221.48
884.839	219.06
885.216	124.4
885.593	192.36
885.971	262.75
886.348	236.05
886.725	204.49
887.102	240.9
887.479	260.32
887.856	311.29
888.233	262.75
888.609	284.59
888.986	216.63
889.363	262.75
889.74	240.9
890.116	216.63
890.493	238.47
890.869	214.2
891.246	287.02
891.622	206.92
891.998	138.96
892.375	267.6
892.751	211.78
893.127	143.81
893.503	134.1
893.879	172.94
894.255	214.2
894.631	202.07
895.007	172.94
895.383	204.49
895.759	180.22
896.134	211.78
896.51	202.07
896.886	223.91
897.261	143.81
897.637	151.09
898.012	192.36
898.388	182.65
898.763	168.09
899.138	153.52
899.514	180.22
899.889	121.97
900.264	180.22
900.639	151.09
901.014	172.94
901.389	187.5
901.764	165.66
902.139	175.37
902.513	209.35
902.888	109.83
903.263	114.69
903.638	165.66
904.012	146.24
904.387	197.21
904.761	151.09
905.136	223.91
905.51	187.5
905.884	160.8
906.259	168.09
906.633	100.12
907.007	119.54
907.381	165.66
907.755	151.09
908.129	206.92
908.503	134.1
908.877	202.07
909.251	148.67
909.624	163.23
909.998	158.38
910.372	172.94
910.745	163.23
911.119	131.68
911.492	209.35
911.866	158.38
912.239	202.07
912.612	148.67
912.986	172.94
913.359	165.66
913.732	126.82
914.105	214.2
914.478	100.12
914.851	151.09
915.224	219.06
915.597	131.68
915.97	226.34
916.343	134.1
916.715	112.26
917.088	109.83
917.461	141.39
917.833	121.97
918.206	129.25
918.578	165.66
918.951	148.67
919.323	165.66
919.695	170.51
920.067	228.77
920.44	109.83
920.812	172.94
921.184	221.48
921.556	272.46
921.928	112.26
922.3	160.8
922.672	158.38
923.043	151.09
923.415	180.22
923.787	146.24
924.158	219.06
924.53	175.37
924.901	177.79
925.273	134.1
925.644	187.5
926.016	90.41
926.387	177.79
926.758	170.51
927.129	158.38
927.5	129.25
927.872	185.08
928.243	124.4
928.613	155.95
928.984	182.65
929.355	146.24
929.726	124.4
930.097	95.27
930.467	151.09
930.838	182.65
931.209	131.68
931.579	160.8
931.95	134.1
932.32	109.83
932.69	119.54
933.061	141.39
933.431	151.09
933.801	155.95
934.171	163.23
934.541	141.39
934.911	170.51
935.281	172.94
935.651	138.96
936.021	172.94
936.391	107.4
936.761	155.95
937.13	126.82
937.5	117.11
937.87	175.37
938.239	134.1
938.609	202.07
938.978	134.1
939.347	112.26
939.717	155.95
940.086	214.2
940.455	136.53
940.824	141.39
941.193	175.37
941.562	204.49
941.931	175.37
942.3	245.76
942.669	172.94
943.038	158.38
943.407	214.2
943.775	155.95
944.144	182.65
944.513	199.64
944.881	165.66
945.25	177.79
945.618	126.82
945.986	165.66
946.355	163.23
946.723	141.39
947.091	138.96
947.459	85.56
947.827	124.4
948.195	202.07
948.563	209.35
948.931	202.07
949.299	192.36
949.667	109.83
950.035	107.4
950.402	124.4
950.77	112.26
951.138	177.79
951.505	160.8
951.873	109.83
952.24	155.95
952.607	90.41
952.975	182.65
953.342	155.95
953.709	92.84
954.076	185.08
954.443	155.95
954.81	131.68
955.177	158.38
955.544	102.55
955.911	126.82
956.278	160.8
956.645	192.36
957.012	151.09
957.378	180.22
957.745	170.51
958.111	177.79
958.478	180.22
958.844	170.51
959.211	168.09
959.577	175.37
959.943	168.09
960.309	172.94
960.675	146.24
961.042	126.82
961.408	158.38
961.774	148.67
962.139	158.38
962.505	117.11
962.871	136.53
963.237	151.09
963.603	138.96
963.968	151.09
964.334	121.97
964.699	143.81
965.065	146.24
965.43	143.81
965.796	158.38
966.161	143.81
966.526	131.68
966.891	194.78
967.256	119.54
967.622	138.96
967.987	131.68
968.352	158.38
968.716	134.1
969.081	175.37
969.446	146.24
969.811	151.09
970.176	100.12
970.54	202.07
970.905	194.78
971.269	160.8
971.634	245.76
971.998	102.55
972.363	141.39
972.727	90.41
973.091	175.37
973.455	194.78
973.819	138.96
974.183	97.7
974.547	148.67
974.911	97.7
975.275	197.21
975.639	151.09
976.003	136.53
976.367	146.24
976.73	170.51
977.094	146.24
977.458	165.66
977.821	124.4
978.185	163.23
978.548	131.68
978.911	121.97
979.275	148.67
979.638	192.36
980.001	124.4
980.364	117.11
980.727	192.36
981.09	107.4
981.453	202.07
981.816	158.38
982.179	202.07
982.542	206.92
982.905	165.66
983.267	185.08
983.63	202.07
983.992	202.07
984.355	68.57
984.717	85.56
985.08	158.38
985.442	177.79
985.804	109.83
986.167	182.65
986.529	160.8
986.891	131.68
987.253	129.25
987.615	180.22
987.977	100.12
988.339	119.54
988.701	117.11
989.062	163.23
989.424	95.27
989.786	141.39
990.147	228.77
990.509	107.4
990.87	170.51
991.232	189.93
991.593	143.81
991.955	126.82
992.316	100.12
992.677	175.37
993.038	177.79
993.399	148.67
993.76	206.92
994.121	192.36
994.482	197.21
994.843	243.33
995.204	165.66
995.565	148.67
995.926	148.67
996.286	151.09
996.647	109.83
997.007	129.25
997.368	134.1
997.728	129.25
998.089	185.08
998.449	124.4
998.809	129.25
999.169	129.25
999.53	146.24
999.89	187.5
1000.25	163.23
1000.61	153.52
1000.97	129.25
1001.329	134.1
1001.689	138.96
1002.049	168.09
1002.409	131.68
1002.768	138.96
1003.128	231.19
1003.487	119.54
1003.847	172.94
1004.206	197.21
1004.566	104.98
1004.925	131.68
1005.284	119.54
1005.643	131.68
1006.003	117.11
1006.362	253.04
1006.721	134.1
1007.08	158.38
1007.438	146.24
1007.797	119.54
1008.156	134.1
1008.515	189.93
1008.874	117.11
1009.232	126.82
1009.591	136.53
1009.949	121.97
1010.308	182.65
1010.666	136.53
1011.024	160.8
1011.383	129.25
1011.741	119.54
1012.099	153.52
1012.457	112.26
1012.815	172.94
1013.173	104.98
1013.531	189.93
1013.889	148.67
1014.247	126.82
1014.605	143.81
1014.962	131.68
1015.32	175.37
1015.678	165.66
1016.035	138.96
1016.393	153.52
1016.75	158.38
1017.107	172.94
1017.465	114.69
1017.822	187.5
1018.179	170.51
1018.536	194.78
1018.894	170.51
1019.251	155.95
1019.608	119.54
1019.964	141.39
1020.321	199.64
1020.678	112.26
1021.035	151.09
1021.392	136.53
1021.748	146.24
1022.105	136.53
1022.461	209.35
1022.818	97.7
1023.174	117.11
1023.531	199.64
1023.887	141.39
1024.243	146.24
1024.599	117.11
1024.955	151.09
1025.311	112.26
1025.667	143.81
1026.023	143.81
1026.379	124.4
1026.735	129.25
1027.091	248.18
1027.447	185.08
