189.514	65.69
189.973	65.69
190.431	65.69
190.889	46.27
191.348	75.4
191.806	14.72
192.264	-2.28
192.722	-50.82
193.18	0.15
193.638	-31.4
194.096	-19.27
194.554	-84.8
195.012	12.29
195.47	-16.84
195.928	5.01
196.385	26.85
196.843	38.99
197.301	-77.52
197.758	17.14
198.216	70.54
198.674	77.82
199.131	34.13
199.589	24.42
200.046	60.83
200.503	17.14
200.961	65.69
201.418	72.97
201.875	80.25
202.332	41.41
202.79	111.8
203.247	133.65
203.704	216.17
204.161	114.23
204.618	77.82
205.075	194.33
205.532	102.1
205.989	111.8
206.445	119.09
206.902	182.19
207.359	177.34
207.816	167.63
208.272	218.6
208.729	179.77
209.185	116.66
209.642	131.22
210.098	140.93
210.555	119.09
211.011	170.06
211.467	235.59
211.924	182.19
212.38	204.04
212.836	111.8
213.292	206.47
213.748	138.5
214.204	184.62
214.66	172.48
215.116	97.24
215.572	160.35
216.028	182.19
216.484	233.17
216.94	187.05
217.396	131.22
217.851	182.19
218.307	136.08
218.763	97.24
219.218	133.65
219.674	119.09
220.129	106.95
220.585	189.48
221.04	109.38
221.496	191.9
221.951	150.64
222.406	194.33
222.861	133.65
223.317	174.91
223.772	145.79
224.227	75.4
224.682	104.52
225.137	126.37
225.592	182.19
226.047	131.22
226.502	191.9
226.957	136.08
227.411	184.62
227.866	204.04
228.321	148.21
228.776	162.78
229.23	136.08
229.685	87.53
230.139	119.09
230.594	196.76
231.048	162.78
231.503	187.05
231.957	172.48
232.411	255.01
232.865	131.22
233.32	128.79
233.774	155.49
234.228	187.05
234.682	225.88
235.136	104.52
235.59	167.63
236.044	165.2
236.498	150.64
236.952	89.96
237.406	174.91
237.86	225.88
238.313	157.92
238.767	143.36
239.221	111.8
239.674	172.48
240.128	182.19
240.581	179.77
241.035	208.89
241.488	85.1
241.942	138.5
242.395	138.5
242.848	119.09
243.301	140.93
243.755	184.62
244.208	140.93
244.661	109.38
245.114	150.64
245.567	143.36
246.02	155.49
246.473	162.78
246.926	165.2
247.379	189.48
247.832	138.5
248.284	170.06
248.737	126.37
249.19	167.63
249.642	211.32
250.095	155.49
250.547	133.65
251	211.32
251.452	153.07
251.905	106.95
252.357	150.64
252.81	138.5
253.262	121.51
253.714	143.36
254.166	133.65
254.618	123.94
255.07	131.22
255.523	194.33
255.975	116.66
256.427	143.36
256.878	140.93
257.33	155.49
257.782	201.61
258.234	162.78
258.686	204.04
259.137	150.64
259.589	150.64
260.041	172.48
260.492	153.07
260.944	119.09
261.395	208.89
261.847	259.86
262.298	138.5
262.749	150.64
263.201	140.93
263.652	85.1
264.103	218.6
264.554	174.91
265.005	199.18
265.457	172.48
265.908	143.36
266.359	85.1
266.809	138.5
267.26	104.52
267.711	218.6
268.162	191.9
268.613	184.62
269.064	196.76
269.514	182.19
269.965	194.33
270.415	160.35
270.866	177.34
271.316	211.32
271.767	131.22
272.217	150.64
272.668	187.05
273.118	145.79
273.568	145.79
274.019	70.54
274.469	143.36
274.919	167.63
275.369	119.09
275.819	157.92
276.269	213.75
276.719	160.35
277.169	194.33
277.619	189.48
278.069	131.22
278.518	114.23
278.968	143.36
279.418	165.2
279.867	116.66
280.317	182.19
280.767	167.63
281.216	228.31
281.666	148.21
282.115	179.77
282.564	128.79
283.014	187.05
283.463	196.76
283.912	233.17
284.361	145.79
284.811	187.05
285.26	213.75
285.709	145.79
286.158	211.32
286.607	165.2
287.056	99.67
287.505	211.32
287.953	123.94
288.402	128.79
288.851	162.78
289.3	262.29
289.748	174.91
290.197	143.36
290.646	170.06
291.094	201.61
291.543	165.2
291.991	172.48
292.439	196.76
292.888	165.2
293.336	104.52
293.784	182.19
294.233	155.49
294.681	89.96
295.129	206.47
295.577	114.23
296.025	143.36
296.473	148.21
296.921	126.37
297.369	153.07
297.817	187.05
298.264	196.76
298.712	99.67
299.16	104.52
299.608	191.9
300.055	97.24
300.503	63.26
300.95	194.33
301.398	106.95
301.845	126.37
302.293	85.1
302.74	119.09
303.187	138.5
303.635	116.66
304.082	150.64
304.529	184.62
304.976	162.78
305.423	148.21
305.87	114.23
306.317	167.63
306.764	92.39
307.211	106.95
307.658	211.32
308.105	150.64
308.552	172.48
308.998	174.91
309.445	116.66
309.892	191.9
310.338	116.66
310.785	184.62
311.231	201.61
311.678	145.79
312.124	114.23
312.571	174.91
313.017	114.23
313.463	136.08
313.909	99.67
314.356	99.67
314.802	167.63
315.248	148.21
315.694	170.06
316.14	143.36
316.586	155.49
317.032	194.33
317.478	182.19
317.923	121.51
318.369	170.06
318.815	162.78
319.261	140.93
319.706	121.51
320.152	145.79
320.597	179.77
321.043	140.93
321.488	148.21
321.934	102.1
322.379	123.94
322.824	126.37
323.27	177.34
323.715	230.74
324.16	126.37
324.605	167.63
325.05	165.2
325.495	157.92
325.94	211.32
326.385	123.94
326.83	111.8
327.275	114.23
327.72	160.35
328.165	194.33
328.61	228.31
329.054	160.35
329.499	136.08
329.943	138.5
330.388	133.65
330.832	213.75
331.277	150.64
331.721	155.49
332.166	160.35
332.61	104.52
333.054	170.06
333.499	136.08
333.943	233.17
334.387	140.93
334.831	187.05
335.275	187.05
335.719	179.77
336.163	138.5
336.607	155.49
337.051	111.8
337.495	182.19
337.938	201.61
338.382	150.64
338.826	191.9
339.269	153.07
339.713	119.09
340.157	87.53
340.6	160.35
341.044	165.2
341.487	155.49
341.93	148.21
342.374	102.1
342.817	99.67
343.26	174.91
343.703	177.34
344.146	148.21
344.59	131.22
345.033	208.89
345.476	221.03
345.919	140.93
346.361	189.48
346.804	128.79
347.247	165.2
347.69	162.78
348.133	140.93
348.575	162.78
349.018	140.93
349.461	170.06
349.903	189.48
350.346	133.65
350.788	114.23
351.23	153.07
351.673	157.92
352.115	179.77
352.557	174.91
353	140.93
353.442	204.04
353.884	187.05
354.326	143.36
354.768	97.24
355.21	133.65
355.652	204.04
356.094	208.89
356.536	160.35
356.978	92.39
357.419	143.36
357.861	140.93
358.303	157.92
358.744	143.36
359.186	97.24
359.627	148.21
360.069	201.61
360.51	104.52
360.952	174.91
361.393	245.3
361.834	172.48
362.276	162.78
362.717	216.17
363.158	191.9
363.599	174.91
364.04	157.92
364.481	148.21
364.922	131.22
365.363	150.64
365.804	218.6
366.245	157.92
366.686	157.92
367.126	216.17
367.567	155.49
368.008	114.23
368.448	155.49
368.889	157.92
369.33	160.35
369.77	177.34
370.21	208.89
370.651	206.47
371.091	191.9
371.531	131.22
371.972	145.79
372.412	148.21
372.852	191.9
373.292	179.77
373.732	157.92
374.172	177.34
374.612	184.62
375.052	184.62
375.492	155.49
375.932	177.34
376.372	133.65
376.811	160.35
377.251	189.48
377.691	123.94
378.13	87.53
378.57	160.35
379.009	242.87
379.449	191.9
379.888	191.9
380.328	201.61
380.767	167.63
381.206	155.49
381.645	201.61
382.085	153.07
382.524	123.94
382.963	194.33
383.402	204.04
383.841	184.62
384.28	170.06
384.719	123.94
385.158	143.36
385.596	92.39
386.035	182.19
386.474	218.6
386.913	109.38
387.351	194.33
387.79	145.79
388.228	221.03
388.667	191.9
389.105	170.06
389.544	157.92
389.982	221.03
390.42	128.79
390.859	145.79
391.297	201.61
391.735	121.51
392.173	269.57
392.611	160.35
393.049	150.64
393.487	60.83
393.925	177.34
394.363	114.23
394.801	225.88
395.239	194.33
395.676	184.62
396.114	230.74
396.552	204.04
396.989	155.49
397.427	165.2
397.864	179.77
398.302	145.79
398.739	123.94
399.177	87.53
399.614	97.24
400.051	109.38
400.488	167.63
400.926	218.6
401.363	114.23
401.8	177.34
402.237	216.17
402.674	111.8
403.111	179.77
403.548	97.24
403.985	87.53
404.421	153.07
404.858	143.36
405.295	201.61
405.732	204.04
406.168	89.96
406.605	153.07
407.041	148.21
407.478	99.67
407.914	196.76
408.351	99.67
408.787	162.78
409.223	133.65
409.66	174.91
410.096	165.2
410.532	189.48
410.968	184.62
411.404	121.51
411.84	87.53
412.276	196.76
412.712	145.79
413.148	121.51
413.584	121.51
414.02	140.93
414.455	121.51
414.891	162.78
415.327	140.93
415.762	184.62
416.198	189.48
416.633	160.35
417.069	157.92
417.504	148.21
417.94	233.17
418.375	143.36
418.81	174.91
419.245	111.8
419.681	123.94
420.116	136.08
420.551	199.18
420.986	213.75
421.421	191.9
421.856	167.63
422.291	155.49
422.726	150.64
423.16	221.03
423.595	121.51
424.03	230.74
424.464	119.09
424.899	46.27
425.334	165.2
425.768	82.68
426.203	140.93
426.637	128.79
427.071	201.61
427.506	165.2
427.94	145.79
428.374	187.05
428.809	213.75
429.243	111.8
429.677	143.36
430.111	143.36
430.545	131.22
430.979	138.5
431.413	157.92
431.847	157.92
432.28	165.2
432.714	157.92
433.148	184.62
433.582	128.79
434.015	133.65
434.449	106.95
434.882	179.77
435.316	194.33
435.749	109.38
436.183	162.78
436.616	247.73
437.049	140.93
437.483	170.06
437.916	184.62
438.349	238.02
438.782	182.19
439.215	225.88
439.648	165.2
440.081	58.41
440.514	153.07
440.947	208.89
441.38	131.22
441.813	155.49
442.245	208.89
442.678	191.9
443.111	126.37
443.543	157.92
443.976	177.34
444.408	206.47
444.841	165.2
445.273	194.33
445.705	238.02
446.138	189.48
446.57	213.75
447.002	177.34
447.434	162.78
447.867	162.78
448.299	177.34
448.731	138.5
449.163	184.62
449.595	233.17
450.026	191.9
450.458	191.9
450.89	194.33
451.322	189.48
451.754	177.34
452.185	281.71
452.617	204.04
453.048	184.62
453.48	250.16
453.911	308.41
454.343	274.43
454.774	204.04
455.205	255.01
455.637	211.32
456.068	216.17
456.499	279.28
456.93	218.6
457.361	208.89
457.792	184.62
458.223	264.72
458.654	211.32
459.085	257.44
459.516	264.72
459.947	221.03
460.378	204.04
460.808	213.75
461.239	272
461.669	228.31
462.1	240.45
462.531	240.45
462.961	257.44
463.391	170.06
463.822	213.75
464.252	216.17
464.682	177.34
465.113	223.46
465.543	191.9
465.973	225.88
466.403	242.87
466.833	230.74
467.263	221.03
467.693	262.29
468.123	272
468.553	211.32
468.983	233.17
469.412	216.17
469.842	235.59
470.272	194.33
470.701	228.31
471.131	170.06
471.56	187.05
471.99	257.44
472.419	177.34
472.849	221.03
473.278	196.76
473.707	206.47
474.136	136.08
474.566	170.06
474.995	225.88
475.424	247.73
475.853	194.33
476.282	170.06
476.711	240.45
477.14	225.88
477.569	257.44
477.997	225.88
478.426	221.03
478.855	225.88
479.283	228.31
479.712	208.89
480.141	206.47
480.569	187.05
480.998	174.91
481.426	184.62
481.854	160.35
482.283	240.45
482.711	148.21
483.139	264.72
483.567	194.33
483.995	235.59
484.424	177.34
484.852	221.03
485.28	247.73
485.708	274.43
486.135	206.47
486.563	240.45
486.991	162.78
487.419	216.17
487.847	162.78
488.274	242.87
488.702	170.06
489.129	150.64
489.557	189.48
489.984	187.05
490.412	242.87
490.839	177.34
491.266	201.61
491.694	216.17
492.121	218.6
492.548	201.61
492.975	216.17
493.402	170.06
493.829	238.02
494.256	145.79
494.683	187.05
495.11	172.48
495.537	264.72
495.964	172.48
496.39	172.48
496.817	233.17
497.244	162.78
497.67	128.79
498.097	218.6
498.523	89.96
498.95	162.78
499.376	126.37
499.803	145.79
500.229	153.07
500.655	208.89
501.081	182.19
501.508	162.78
501.934	172.48
502.36	201.61
502.786	206.47
503.212	199.18
503.638	131.22
504.064	174.91
504.489	82.68
504.915	140.93
505.341	153.07
505.767	148.21
506.192	153.07
506.618	204.04
507.043	150.64
507.469	199.18
507.894	111.8
508.32	165.2
508.745	218.6
509.17	160.35
509.596	177.34
510.021	179.77
510.446	174.91
510.871	179.77
511.296	221.03
511.721	172.48
512.146	172.48
512.571	172.48
512.996	145.79
513.421	162.78
513.845	174.91
514.27	191.9
514.695	143.36
515.119	223.46
515.544	121.51
515.969	165.2
516.393	165.2
516.817	201.61
517.242	199.18
517.666	123.94
518.09	216.17
518.515	167.63
518.939	191.9
519.363	381.23
519.787	182.19
520.211	121.51
520.635	281.71
521.059	216.17
521.483	136.08
521.907	211.32
522.331	225.88
522.754	148.21
523.178	140.93
523.602	182.19
524.025	170.06
524.449	240.45
524.872	167.63
525.296	174.91
525.719	177.34
526.143	155.49
526.566	223.46
526.989	257.44
527.412	196.76
527.836	177.34
528.259	145.79
528.682	228.31
529.105	184.62
529.528	201.61
529.951	157.92
530.374	162.78
530.796	182.19
531.219	148.21
531.642	199.18
532.065	201.61
532.487	187.05
532.91	172.48
533.332	174.91
533.755	199.18
534.177	184.62
534.6	252.58
535.022	170.06
535.444	182.19
535.867	145.79
536.289	138.5
536.711	182.19
537.133	199.18
537.555	194.33
537.977	196.76
538.399	179.77
538.821	187.05
539.243	196.76
539.665	252.58
540.086	136.08
540.508	252.58
540.93	189.48
541.351	228.31
541.773	230.74
542.195	223.46
542.616	165.2
543.037	201.61
543.459	213.75
543.88	221.03
544.301	204.04
544.723	189.48
545.144	284.14
545.565	179.77
545.986	187.05
546.407	218.6
546.828	245.3
547.249	182.19
547.67	119.09
548.091	235.59
548.512	206.47
548.932	174.91
549.353	170.06
549.774	138.5
550.194	199.18
550.615	187.05
551.035	221.03
551.456	235.59
551.876	230.74
552.296	196.76
552.717	191.9
553.137	218.6
553.557	223.46
553.977	162.78
554.397	162.78
554.817	223.46
555.237	153.07
555.657	111.8
556.077	182.19
556.497	126.37
556.917	233.17
557.337	143.36
557.756	182.19
558.176	174.91
558.596	201.61
559.015	184.62
559.435	211.32
559.854	162.78
560.274	240.45
560.693	111.8
561.112	189.48
561.532	293.85
561.951	123.94
562.37	162.78
562.789	228.31
563.208	235.59
563.627	126.37
564.046	235.59
564.465	194.33
564.884	213.75
565.303	138.5
565.722	157.92
566.14	157.92
566.559	165.2
566.978	150.64
567.396	255.01
567.815	225.88
568.233	228.31
568.652	189.48
569.07	145.79
569.489	238.02
569.907	238.02
570.325	213.75
570.743	153.07
571.161	131.22
571.58	138.5
571.998	213.75
572.416	174.91
572.833	238.02
573.251	174.91
573.669	196.76
574.087	162.78
574.505	194.33
574.922	184.62
575.34	148.21
575.758	201.61
576.175	196.76
576.593	199.18
577.01	172.48
577.428	262.29
577.845	1441.92
578.262	218.6
578.68	247.73
579.097	155.49
579.514	196.76
579.931	123.94
580.348	204.04
580.765	89.96
581.182	157.92
581.599	167.63
582.016	126.37
582.433	223.46
582.849	170.06
583.266	208.89
583.683	218.6
584.099	228.31
584.516	187.05
584.933	208.89
585.349	123.94
585.765	145.79
586.182	242.87
586.598	177.34
587.014	182.19
587.431	218.6
587.847	184.62
588.263	235.59
588.679	213.75
589.095	136.08
589.511	170.06
589.927	201.61
590.343	242.87
590.759	218.6
591.174	191.9
591.59	114.23
592.006	92.39
592.421	170.06
592.837	201.61
593.252	250.16
593.668	189.48
594.083	233.17
594.499	119.09
594.914	177.34
595.329	201.61
595.745	199.18
596.16	172.48
596.575	199.18
596.99	119.09
597.405	167.63
597.82	213.75
598.235	121.51
598.65	170.06
599.065	157.92
599.479	182.19
599.894	148.21
600.309	150.64
600.724	233.17
601.138	116.66
601.553	225.88
601.967	128.79
602.382	179.77
602.796	172.48
603.21	160.35
603.625	184.62
604.039	162.78
604.453	150.64
604.867	160.35
605.281	174.91
605.695	157.92
606.109	177.34
606.523	116.66
606.937	138.5
607.351	318.12
607.765	145.79
608.178	140.93
608.592	148.21
609.006	221.03
609.419	201.61
609.833	155.49
610.246	242.87
610.66	153.07
611.073	172.48
611.487	262.29
611.9	230.74
612.313	157.92
612.726	213.75
613.139	148.21
613.553	213.75
613.966	235.59
614.379	245.3
614.792	160.35
615.204	225.88
615.617	167.63
616.03	167.63
616.443	189.48
616.856	218.6
617.268	179.77
617.681	155.49
618.093	208.89
618.506	223.46
618.918	252.58
619.331	191.9
619.743	155.49
620.155	228.31
620.568	72.97
620.98	123.94
621.392	114.23
621.804	177.34
622.216	218.6
622.628	184.62
623.04	148.21
623.452	172.48
623.864	247.73
624.276	187.05
624.687	136.08
625.099	228.31
625.511	191.9
625.922	228.31
626.334	182.19
626.745	131.22
627.157	179.77
627.568	204.04
627.979	140.93
628.391	174.91
628.802	199.18
629.213	223.46
629.624	145.79
630.035	189.48
630.446	182.19
630.857	165.2
631.268	157.92
631.679	97.24
632.09	235.59
632.501	153.07
632.912	189.48
633.322	145.79
633.733	165.2
634.144	128.79
634.554	216.17
634.965	143.36
635.375	211.32
635.785	208.89
636.196	191.9
636.606	179.77
637.016	225.88
637.427	106.95
637.837	126.37
638.247	191.9
638.657	138.5
639.067	157.92
639.477	148.21
639.887	194.33
640.297	160.35
640.706	218.6
641.116	250.16
641.526	167.63
641.935	189.48
642.345	165.2
642.755	80.25
643.164	123.94
643.573	204.04
643.983	150.64
644.392	140.93
644.801	221.03
645.211	157.92
645.62	138.5
646.029	293.85
646.438	157.92
646.847	196.76
647.256	116.66
647.665	230.74
648.074	201.61
648.483	208.89
648.892	160.35
649.3	199.18
649.709	145.79
650.118	189.48
650.526	136.08
650.935	179.77
651.343	116.66
651.752	187.05
652.16	208.89
652.568	119.09
652.977	75.4
653.385	187.05
653.793	213.75
654.201	211.32
654.609	184.62
655.017	194.33
655.425	191.9
655.833	167.63
656.241	136.08
656.649	218.6
657.057	157.92
657.464	150.64
657.872	128.79
658.28	150.64
658.687	126.37
659.095	177.34
659.502	143.36
659.91	208.89
660.317	170.06
660.724	187.05
661.132	177.34
661.539	184.62
661.946	131.22
662.353	184.62
662.76	123.94
663.167	182.19
663.574	145.79
663.981	162.78
664.388	165.2
664.795	143.36
665.202	208.89
665.608	170.06
666.015	131.22
666.422	111.8
666.828	160.35
667.235	155.49
667.641	182.19
668.047	179.77
668.454	162.78
668.86	182.19
669.266	119.09
669.673	140.93
670.079	143.36
670.485	114.23
670.891	208.89
671.297	204.04
671.703	204.04
672.109	140.93
672.515	140.93
672.92	140.93
673.326	177.34
673.732	252.58
674.138	228.31
674.543	165.2
674.949	155.49
675.354	196.76
675.76	145.79
676.165	157.92
676.57	204.04
676.976	143.36
677.381	136.08
677.786	160.35
678.191	170.06
678.596	170.06
679.001	170.06
679.406	189.48
679.811	189.48
680.216	177.34
680.621	238.02
681.026	223.46
681.43	150.64
681.835	194.33
682.24	189.48
682.644	157.92
683.049	172.48
683.453	189.48
683.858	225.88
684.262	138.5
684.667	194.33
685.071	162.78
685.475	187.05
685.879	206.47
686.283	167.63
686.687	189.48
687.091	242.87
687.495	126.37
687.899	157.92
688.303	187.05
688.707	165.2
689.111	187.05
689.514	136.08
689.918	140.93
690.322	242.87
690.725	172.48
691.129	82.68
691.532	182.19
691.936	213.75
692.339	155.49
692.742	145.79
693.146	126.37
693.549	160.35
693.952	196.76
694.355	179.77
694.758	153.07
695.161	174.91
695.564	160.35
695.967	177.34
696.37	247.73
696.773	208.89
697.175	259.86
697.578	179.77
697.981	177.34
698.383	165.2
698.786	172.48
699.188	106.95
699.591	199.18
699.993	194.33
700.395	172.48
700.798	199.18
701.2	201.61
701.602	177.34
702.004	233.17
702.406	238.02
702.808	174.91
703.21	211.32
703.612	242.87
704.014	167.63
704.416	235.59
704.818	174.91
705.219	240.45
705.621	235.59
706.023	269.57
706.424	240.45
706.826	247.73
707.227	223.46
707.629	208.89
708.03	179.77
708.431	138.5
708.832	318.12
709.234	179.77
709.635	191.9
710.036	225.88
710.437	247.73
710.838	223.46
711.239	259.86
711.64	208.89
712.041	296.27
712.441	218.6
712.842	213.75
713.243	247.73
713.643	318.12
714.044	286.56
714.445	366.66
714.845	264.72
715.246	325.4
715.646	262.29
716.046	303.55
716.447	296.27
716.847	274.43
717.247	330.25
717.647	325.4
718.047	308.41
718.447	361.81
718.847	325.4
719.247	313.26
719.647	398.22
720.047	398.22
720.446	369.09
720.846	318.12
721.246	388.51
721.645	371.52
722.045	407.93
722.444	407.93
722.844	395.79
723.243	366.66
723.643	458.9
724.042	446.76
724.441	454.04
724.84	432.2
725.24	437.05
725.639	471.03
726.038	572.98
726.437	505.01
726.836	514.72
727.234	551.13
727.633	502.59
728.032	495.31
728.431	589.97
728.83	577.83
729.228	572.98
729.627	621.52
730.025	636.08
730.424	728.32
730.822	738.03
731.22	667.64
731.619	689.48
732.017	740.45
732.415	784.14
732.813	762.3
733.212	767.15
733.61	898.22
734.008	1058.42
734.406	1148.23
734.803	1240.46
735.201	1473.48
735.599	1589.98
735.997	1869.11
736.395	1988.05
736.792	2131.25
737.19	2043.87
737.587	2097.27
737.985	2060.86
738.382	1876.39
738.78	1798.72
739.177	1735.62
739.574	1706.49
739.971	1585.13
740.369	1594.84
740.766	1900.67
741.163	1978.34
741.56	2388.54
741.957	2810.88
742.354	3347.29
742.751	3893.42
743.147	4691.97
743.544	4920.13
743.941	5335.19
744.338	5597.33
744.734	5492.96
745.131	5376.45
745.527	5053.63
745.924	4755.08
746.32	4172.55
746.716	3587.59
747.113	3417.68
747.509	3194.38
747.905	3182.24
748.301	3420.11
748.697	4077.89
749.093	5034.21
749.489	6138.6
749.885	7543.96
750.281	9412.92
750.677	10366.82
751.073	11670.24
751.468	13036.76
751.864	13723.67
752.26	13281.91
752.655	13029.48
753.051	12580.44
753.446	11536.74
753.842	10044
754.237	8847.38
754.632	7429.88
755.028	6667.73
755.423	5963.84
755.818	6017.24
756.213	6820.65
756.608	8209.02
757.003	10022.15
757.398	12068.3
757.793	14247.95
758.188	16148.46
758.583	18612.09
758.977	20306.29
759.372	21811.17
759.767	22461.67
760.161	22718.95
760.556	22121.86
760.95	20532.02
761.345	18485.88
761.739	16663.03
762.133	14531.93
762.527	12534.33
762.922	11184.79
763.316	10638.67
763.71	11408.1
764.104	12391.12
764.498	14813.49
764.892	18235.87
765.286	21735.93
765.68	26058.81
766.073	29905.96
766.467	33636.6
766.861	37190.05
767.255	39457.08
767.648	40211.94
768.042	39364.84
768.435	38025.02
768.829	35389.05
769.222	31830.74
769.615	27871.94
770.008	23413.14
770.402	19859.68
770.795	17243.14
771.188	15721.27
771.581	15519.81
771.974	16158.17
772.367	18027.13
772.76	21277.18
773.153	25073.36
773.545	29318.57
773.938	34838.07
774.331	38930.37
774.724	43146.45
775.116	46311.55
775.509	48593.14
775.901	49241.21
776.294	48619.84
776.686	45474.16
777.078	43025.09
777.471	39357.56
777.863	34146.31
778.255	29998.19
778.647	25874.34
779.039	22871.87
779.431	21119.41
779.823	20680.09
780.215	22578.17
780.607	25529.68
780.999	30976.36
781.39	36253.14
781.782	43326.07
782.174	48449.93
782.565	53343.21
782.957	56593.27
783.348	59231.66
783.74	59962.25
784.131	58896.7
784.522	58219.5
784.914	55015.57
785.305	50974.25
785.696	45357.65
786.087	39304.16
786.478	32842.9
786.869	27274.85
787.26	23107.31
787.651	20733.48
788.042	19371.81
788.433	20073.28
788.823	21937.39
789.214	24903.45
789.605	28524.87
789.995	33272.51
790.386	36864.8
790.776	41687.69
791.167	45012.99
791.557	48680.52
791.948	50784.92
792.338	50850.46
792.728	51119.88
793.118	49610.15
793.508	44847.94
793.898	41350.31
794.288	36311.4
794.678	31097.72
795.068	26723.87
795.458	22556.33
795.848	20299.01
796.238	18393.64
796.627	18340.24
797.017	19464.05
797.406	22070.88
797.796	25658.32
798.185	30141.4
798.575	35359.93
798.964	39660.96
799.354	45279.98
799.743	48231.48
800.132	51556.78
800.521	52598.06
800.91	52287.37
801.299	50899
801.688	48687.8
802.077	45313.96
802.466	41100.31
802.855	35512.84
803.244	29597.7
803.633	25170.45
804.021	21243.2
804.41	17942.18
804.799	15995.55
805.187	14949.41
805.576	15303.79
805.964	16947.02
806.352	18665.49
806.741	21934.96
807.129	25223.85
807.517	29260.32
807.905	33296.79
808.293	36930.34
808.681	39998.35
809.069	41850.32
809.457	43027.52
809.845	42054.2
810.233	40741.08
810.621	38590.56
811.009	34685.16
811.396	31529.77
811.784	27495.73
812.171	22990.8
812.559	19362.1
812.946	16039.24
813.334	13929.98
813.721	12980.94
814.108	12252.77
814.496	13036.76
814.883	14478.53
815.27	17784.41
815.657	20842.71
816.044	24073.34
816.431	27670.49
816.818	30852.57
817.205	33986.12
817.592	36384.21
817.979	37117.23
818.365	36500.72
818.752	34971.57
819.139	33330.77
819.525	30774.9
819.912	27185.04
820.298	24306.36
820.685	20658.24
821.071	17201.88
821.457	14036.78
821.843	11378.97
822.23	9502.73
822.616	8158.05
823.002	7679.88
823.388	7672.6
823.774	8429.89
824.16	9500.3
824.546	10908.09
824.931	12760.06
825.317	14869.32
825.703	16675.17
826.089	18366.94
826.474	19616.96
826.86	20267.46
827.245	20544.16
827.631	20279.59
828.016	19818.42
828.401	18141.21
828.787	16925.17
829.172	14954.27
829.557	13012.49
829.942	11177.51
830.327	9145.93
830.712	7570.66
831.097	6065.78
831.482	5344.9
831.867	4665.27
832.252	4422.55
832.636	4677.41
833.021	5165.28
833.406	6063.35
833.79	7155.6
834.175	7995.42
834.559	9449.33
834.944	10124.1
835.328	11357.12
835.713	11823.15
836.097	12031.89
836.481	11978.49
836.865	11767.33
837.249	11170.23
837.633	10672.65
838.017	9507.58
838.401	8223.58
838.785	7364.34
839.169	6148.31
839.553	5150.72
839.937	4230.8
840.32	3398.26
840.704	2803.59
841.087	2415.24
841.471	2238.05
841.854	2165.23
842.238	2403.1
842.621	2606.99
843.004	3036.61
843.388	3485.64
843.771	3854.58
844.154	4381.29
844.537	4869.16
844.92	5410.43
845.303	5832.77
845.686	5854.61
846.069	5842.48
846.452	5791.5
846.834	5592.47
847.217	5051.2
847.6	4602.17
847.982	4208.96
848.365	3594.87
848.748	3170.1
849.13	2713.79
849.512	2281.74
849.895	1745.32
850.277	1439.49
850.659	1342.41
851.041	1320.56
851.423	1267.16
851.806	1366.68
852.188	1502.6
852.57	1803.58
852.951	2007.46
853.333	2276.89
853.715	2708.93
854.097	2796.31
854.479	2912.82
854.86	3070.59
855.242	3157.97
855.623	3019.62
856.005	2941.95
856.386	2878.84
856.768	2694.37
857.149	2373.98
857.53	2106.98
857.911	1971.06
858.292	1628.82
858.674	1458.91
859.055	1191.92
859.436	1014.73
859.817	818.13
860.197	755.02
860.578	716.18
860.959	687.06
861.34	708.9
861.72	762.3
862.101	740.45
862.482	818.13
862.862	888.52
863.243	1000.17
863.623	1114.25
864.003	1242.89
864.384	1184.64
864.764	1213.76
865.144	1284.15
865.524	1335.12
865.904	1140.95
866.284	1162.79
866.664	997.74
867.044	1060.85
867.424	861.82
867.804	691.91
868.183	723.46
868.563	626.38
868.943	541.42
869.322	551.13
869.702	471.03
870.081	388.51
870.461	420.06
870.84	390.93
871.22	320.55
871.599	318.12
871.978	497.73
872.357	383.65
872.736	492.88
873.115	483.17
873.494	451.62
873.873	565.69
874.252	490.45
874.631	517.15
875.01	517.15
875.388	500.16
875.767	512.3
876.146	485.6
876.524	454.04
876.903	410.35
877.281	298.7
877.66	412.78
878.038	400.64
878.416	310.84
878.794	276.86
879.173	305.98
879.551	301.13
879.929	255.01
880.307	310.84
880.685	225.88
881.063	242.87
881.441	259.86
881.818	259.86
882.196	262.29
882.574	301.13
882.951	218.6
883.329	281.71
883.707	318.12
884.084	262.29
884.461	301.13
884.839	288.99
885.216	281.71
885.593	262.29
885.971	264.72
886.348	191.9
886.725	177.34
887.102	293.85
887.479	262.29
887.856	218.6
888.233	196.76
888.609	225.88
888.986	187.05
889.363	194.33
889.74	121.51
890.116	165.2
890.493	162.78
890.869	133.65
891.246	177.34
891.622	204.04
891.998	252.58
892.375	172.48
892.751	213.75
893.127	225.88
893.503	206.47
893.879	104.52
894.255	199.18
894.631	228.31
895.007	174.91
895.383	242.87
895.759	240.45
896.134	191.9
896.51	191.9
896.886	189.48
897.261	145.79
897.637	162.78
898.012	167.63
898.388	238.02
898.763	157.92
899.138	174.91
899.514	131.22
899.889	162.78
900.264	162.78
900.639	153.07
901.014	109.38
901.389	138.5
901.764	155.49
902.139	131.22
902.513	116.66
902.888	145.79
903.263	121.51
903.638	119.09
904.012	111.8
904.387	63.26
904.761	153.07
905.136	133.65
905.51	136.08
905.884	136.08
906.259	136.08
906.633	136.08
907.007	194.33
907.381	133.65
907.755	140.93
908.129	140.93
908.503	194.33
908.877	172.48
909.251	148.21
909.624	242.87
909.998	85.1
910.372	150.64
910.745	106.95
911.119	128.79
911.492	89.96
911.866	121.51
912.239	114.23
912.612	131.22
912.986	143.36
913.359	250.16
913.732	148.21
914.105	187.05
914.478	201.61
914.851	187.05
915.224	172.48
915.597	174.91
915.97	162.78
916.343	177.34
916.715	94.81
917.088	153.07
917.461	155.49
917.833	204.04
918.206	160.35
918.578	211.32
918.951	177.34
919.323	187.05
919.695	121.51
920.067	102.1
920.44	187.05
920.812	126.37
921.184	194.33
921.556	174.91
921.928	97.24
922.3	85.1
922.672	143.36
923.043	145.79
923.415	218.6
923.787	187.05
924.158	133.65
924.53	106.95
924.901	123.94
925.273	148.21
925.644	68.11
926.016	87.53
926.387	170.06
926.758	179.77
927.129	140.93
927.5	114.23
927.872	194.33
928.243	228.31
928.613	111.8
928.984	119.09
929.355	109.38
929.726	150.64
930.097	123.94
930.467	182.19
930.838	160.35
931.209	155.49
931.579	119.09
931.95	104.52
932.32	196.76
932.69	92.39
933.061	145.79
933.431	208.89
933.801	126.37
934.171	184.62
934.541	123.94
934.911	128.79
935.281	136.08
935.651	58.41
936.021	114.23
936.391	155.49
936.761	145.79
937.13	121.51
937.5	77.82
937.87	182.19
938.239	213.75
938.609	143.36
938.978	136.08
939.347	109.38
939.717	145.79
940.086	194.33
940.455	140.93
940.824	187.05
941.193	114.23
941.562	167.63
941.931	131.22
942.3	199.18
942.669	187.05
943.038	114.23
943.407	116.66
943.775	102.1
944.144	133.65
944.513	136.08
944.881	199.18
945.25	133.65
945.618	199.18
945.986	204.04
946.355	167.63
946.723	167.63
947.091	136.08
947.459	109.38
947.827	106.95
948.195	126.37
948.563	106.95
948.931	145.79
949.299	99.67
949.667	179.77
950.035	221.03
950.402	160.35
950.77	121.51
951.138	187.05
951.505	182.19
951.873	133.65
952.24	155.49
952.607	174.91
952.975	143.36
953.342	145.79
953.709	119.09
954.076	94.81
954.443	111.8
954.81	191.9
955.177	138.5
955.544	143.36
955.911	242.87
956.278	213.75
956.645	97.24
957.012	196.76
957.378	133.65
957.745	106.95
958.111	208.89
958.478	140.93
958.844	160.35
959.211	162.78
959.577	187.05
959.943	162.78
960.309	191.9
960.675	138.5
961.042	206.47
961.408	172.48
961.774	143.36
962.139	138.5
962.505	140.93
962.871	136.08
963.237	157.92
963.603	97.24
963.968	65.69
964.334	230.74
964.699	153.07
965.065	140.93
965.43	133.65
965.796	174.91
966.161	172.48
966.526	119.09
966.891	172.48
967.256	136.08
967.622	157.92
967.987	97.24
968.352	87.53
968.716	162.78
969.081	38.99
969.446	177.34
969.811	167.63
970.176	80.25
970.54	140.93
970.905	48.7
971.269	174.91
971.634	174.91
971.998	177.34
972.363	121.51
972.727	167.63
973.091	128.79
973.455	170.06
973.819	184.62
974.183	189.48
974.547	221.03
974.911	128.79
975.275	94.81
975.639	194.33
976.003	136.08
976.367	109.38
976.73	191.9
977.094	82.68
977.458	153.07
977.821	162.78
978.185	182.19
978.548	179.77
978.911	133.65
979.275	194.33
979.638	114.23
980.001	145.79
980.364	225.88
980.727	182.19
981.09	138.5
981.453	150.64
981.816	196.76
982.179	131.22
982.542	218.6
982.905	167.63
983.267	162.78
983.63	140.93
983.992	174.91
984.355	201.61
984.717	148.21
985.08	179.77
985.442	145.79
985.804	97.24
986.167	223.46
986.529	153.07
986.891	138.5
987.253	121.51
987.615	140.93
987.977	104.52
988.339	172.48
988.701	160.35
989.062	46.27
989.424	179.77
989.786	213.75
990.147	167.63
990.509	187.05
990.87	182.19
991.232	70.54
991.593	87.53
991.955	165.2
992.316	194.33
992.677	189.48
993.038	99.67
993.399	119.09
993.76	126.37
994.121	155.49
994.482	177.34
994.843	179.77
995.204	131.22
995.565	89.96
995.926	189.48
996.286	160.35
996.647	170.06
997.007	160.35
997.368	89.96
997.728	126.37
998.089	174.91
998.449	153.07
998.809	153.07
999.169	174.91
999.53	102.1
999.89	157.92
1000.25	189.48
1000.61	116.66
1000.97	116.66
1001.329	162.78
1001.689	102.1
1002.049	92.39
1002.409	150.64
1002.768	167.63
1003.128	221.03
1003.487	106.95
1003.847	201.61
1004.206	136.08
1004.566	182.19
1004.925	189.48
1005.284	148.21
1005.643	145.79
1006.003	187.05
1006.362	92.39
1006.721	143.36
1007.08	140.93
1007.438	136.08
1007.797	136.08
1008.156	150.64
1008.515	211.32
1008.874	204.04
1009.232	148.21
1009.591	235.59
1009.949	143.36
1010.308	167.63
1010.666	116.66
1011.024	201.61
1011.383	157.92
1011.741	133.65
1012.099	148.21
1012.457	157.92
1012.815	136.08
1013.173	111.8
1013.531	160.35
1013.889	191.9
1014.247	114.23
1014.605	167.63
1014.962	150.64
1015.32	131.22
1015.678	109.38
1016.035	155.49
1016.393	162.78
1016.75	191.9
1017.107	145.79
1017.465	160.35
1017.822	157.92
1018.179	216.17
1018.536	136.08
1018.894	196.76
1019.251	155.49
1019.608	160.35
1019.964	116.66
1020.321	128.79
1020.678	111.8
1021.035	150.64
1021.392	133.65
1021.748	123.94
1022.105	160.35
1022.461	121.51
1022.818	208.89
1023.174	94.81
1023.531	182.19
1023.887	153.07
1024.243	85.1
1024.599	136.08
1024.955	216.17
1025.311	218.6
1025.667	123.94
1026.023	128.79
1026.379	155.49
1026.735	194.33
1027.091	138.5
1027.447	133.65
