189.514	100.88
189.973	100.88
190.431	100.88
190.889	81.46
191.348	-98.15
191.806	-56.89
192.264	8.65
192.722	-8.34
193.18	13.5
193.638	-42.32
194.096	-13.2
194.554	-35.04
195.012	-52.03
195.47	-25.33
195.928	-42.32
196.385	20.78
196.843	-42.32
197.301	-20.48
197.758	25.64
198.216	47.48
198.674	47.48
199.131	117.87
199.589	25.64
200.046	25.64
200.503	42.63
200.961	66.9
201.418	120.3
201.875	74.18
202.332	86.32
202.79	127.58
203.247	64.47
203.704	130.01
204.161	25.64
204.618	120.3
205.075	127.58
205.532	125.15
205.989	142.14
206.445	64.47
206.902	156.71
207.359	86.32
207.816	108.16
208.272	178.55
208.729	8.65
209.185	52.34
209.642	144.57
210.098	137.29
210.555	139.72
211.011	120.3
211.467	193.12
211.924	253.8
212.38	180.98
212.836	185.83
213.292	91.17
213.748	183.41
214.204	147
214.66	134.86
215.116	130.01
215.572	159.13
216.028	161.56
216.484	171.27
216.94	142.14
217.396	168.84
217.851	147
218.307	127.58
218.763	125.15
219.218	166.42
219.674	166.42
220.129	127.58
220.585	110.59
221.04	74.18
221.496	115.44
221.951	120.3
222.406	166.42
222.861	156.71
223.317	91.17
223.772	62.05
224.227	98.45
224.682	120.3
225.137	127.58
225.592	137.29
226.047	132.44
226.502	91.17
226.957	42.63
227.411	171.27
227.866	176.13
228.321	144.57
228.776	185.83
229.23	134.86
229.685	130.01
230.139	125.15
230.594	197.97
231.048	125.15
231.503	79.04
231.957	96.03
232.411	134.86
232.865	122.73
233.32	127.58
233.774	142.14
234.228	142.14
234.682	76.61
235.136	180.98
235.59	127.58
236.044	147
236.498	144.57
236.952	142.14
237.406	110.59
237.86	134.86
238.313	197.97
238.767	161.56
239.221	173.7
239.674	163.99
240.128	130.01
240.581	161.56
241.035	108.16
241.488	125.15
241.942	154.28
242.395	171.27
242.848	144.57
243.301	76.61
243.755	149.43
244.208	176.13
244.661	105.74
245.114	134.86
245.567	173.7
246.02	176.13
246.473	156.71
246.926	188.26
247.379	149.43
247.832	147
248.284	108.16
248.737	113.02
249.19	130.01
249.642	137.29
250.095	91.17
250.547	193.12
251	120.3
251.452	176.13
251.905	147
252.357	122.73
252.81	86.32
253.262	83.89
253.714	108.16
254.166	261.08
254.618	88.75
255.07	149.43
255.523	134.86
255.975	161.56
256.427	180.98
256.878	142.14
257.33	100.88
257.782	86.32
258.234	71.75
258.686	161.56
259.137	96.03
259.589	103.31
260.041	166.42
260.492	132.44
260.944	159.13
261.395	125.15
261.847	100.88
262.298	54.76
262.749	100.88
263.201	134.86
263.652	205.25
264.103	200.4
264.554	117.87
265.005	83.89
265.457	130.01
265.908	96.03
266.359	71.75
266.809	76.61
267.26	93.6
267.711	125.15
268.162	149.43
268.613	93.6
269.064	185.83
269.514	120.3
269.965	178.55
270.415	76.61
270.866	127.58
271.316	100.88
271.767	180.98
272.217	93.6
272.668	178.55
273.118	139.72
273.568	110.59
274.019	113.02
274.469	100.88
274.919	134.86
275.369	173.7
275.819	156.71
276.269	149.43
276.719	132.44
277.169	163.99
277.619	122.73
278.069	113.02
278.518	139.72
278.968	151.85
279.418	171.27
279.867	113.02
280.317	139.72
280.767	178.55
281.216	207.68
281.666	139.72
282.115	132.44
282.564	139.72
283.014	130.01
283.463	120.3
283.912	185.83
284.361	183.41
284.811	163.99
285.26	185.83
285.709	132.44
286.158	120.3
286.607	202.82
287.056	132.44
287.505	122.73
287.953	166.42
288.402	139.72
288.851	110.59
289.3	137.29
289.748	122.73
290.197	156.71
290.646	137.29
291.094	83.89
291.543	113.02
291.991	163.99
292.439	154.28
292.888	149.43
293.336	180.98
293.784	142.14
294.233	108.16
294.681	127.58
295.129	149.43
295.577	149.43
296.025	137.29
296.473	110.59
296.921	197.97
297.369	120.3
297.817	134.86
298.264	122.73
298.712	139.72
299.16	88.75
299.608	163.99
300.055	130.01
300.503	54.76
300.95	151.85
301.398	49.91
301.845	149.43
302.293	115.44
302.74	52.34
303.187	173.7
303.635	144.57
304.082	81.46
304.529	130.01
304.976	86.32
305.423	139.72
305.87	100.88
306.317	105.74
306.764	120.3
307.211	137.29
307.658	98.45
308.105	88.75
308.552	137.29
308.998	173.7
309.445	168.84
309.892	190.69
310.338	183.41
310.785	103.31
311.231	149.43
311.678	178.55
312.124	147
312.571	113.02
313.017	149.43
313.463	113.02
313.909	79.04
314.356	154.28
314.802	88.75
315.248	127.58
315.694	132.44
316.14	98.45
316.586	144.57
317.032	81.46
317.478	171.27
317.923	134.86
318.369	103.31
318.815	168.84
319.261	183.41
319.706	105.74
320.152	134.86
320.597	183.41
321.043	122.73
321.488	154.28
321.934	132.44
322.379	132.44
322.824	159.13
323.27	115.44
323.715	132.44
324.16	212.53
324.605	93.6
325.05	117.87
325.495	91.17
325.94	159.13
326.385	168.84
326.83	108.16
327.275	125.15
327.72	120.3
328.165	149.43
328.61	127.58
329.054	190.69
329.499	105.74
329.943	134.86
330.388	37.77
330.832	180.98
331.277	180.98
331.721	91.17
332.166	127.58
332.61	151.85
333.054	83.89
333.499	166.42
333.943	115.44
334.387	122.73
334.831	57.19
335.275	54.76
335.719	178.55
336.163	163.99
336.607	137.29
337.051	159.13
337.495	154.28
337.938	176.13
338.382	132.44
338.826	117.87
339.269	139.72
339.713	110.59
340.157	139.72
340.6	149.43
341.044	96.03
341.487	122.73
341.93	202.82
342.374	147
342.817	156.71
343.26	100.88
343.703	178.55
344.146	79.04
344.59	178.55
345.033	147
345.476	176.13
345.919	205.25
346.361	161.56
346.804	130.01
347.247	190.69
347.69	122.73
348.133	127.58
348.575	98.45
349.018	217.39
349.461	161.56
349.903	142.14
350.346	74.18
350.788	49.91
351.23	125.15
351.673	168.84
352.115	156.71
352.557	173.7
353	142.14
353.442	168.84
353.884	144.57
354.326	142.14
354.768	110.59
355.21	122.73
355.652	110.59
356.094	108.16
356.536	88.75
356.978	147
357.419	154.28
357.861	180.98
358.303	134.86
358.744	127.58
359.186	91.17
359.627	142.14
360.069	176.13
360.51	176.13
360.952	139.72
361.393	81.46
361.834	195.54
362.276	205.25
362.717	171.27
363.158	93.6
363.599	91.17
364.04	108.16
364.481	54.76
364.922	171.27
365.363	151.85
365.804	142.14
366.245	91.17
366.686	115.44
367.126	120.3
367.567	113.02
368.008	122.73
368.448	120.3
368.889	183.41
369.33	185.83
369.77	195.54
370.21	159.13
370.651	185.83
371.091	183.41
371.531	137.29
371.972	83.89
372.412	132.44
372.852	113.02
373.292	108.16
373.732	120.3
374.172	217.39
374.612	122.73
375.052	132.44
375.492	91.17
375.932	183.41
376.372	115.44
376.811	91.17
377.251	222.24
377.691	147
378.13	59.62
378.57	168.84
379.009	149.43
379.449	134.86
379.888	185.83
380.328	83.89
380.767	110.59
381.206	200.4
381.645	195.54
382.085	132.44
382.524	113.02
382.963	149.43
383.402	163.99
383.841	120.3
384.28	156.71
384.719	173.7
385.158	195.54
385.596	137.29
386.035	127.58
386.474	144.57
386.913	168.84
387.351	166.42
387.79	81.46
388.228	132.44
388.667	173.7
389.105	202.82
389.544	117.87
389.982	147
390.42	103.31
390.859	180.98
391.297	79.04
391.735	100.88
392.173	154.28
392.611	144.57
393.049	161.56
393.487	137.29
393.925	183.41
394.363	120.3
394.801	125.15
395.239	125.15
395.676	188.26
396.114	115.44
396.552	93.6
396.989	151.85
397.427	81.46
397.864	122.73
398.302	171.27
398.739	151.85
399.177	137.29
399.614	144.57
400.051	122.73
400.488	81.46
400.926	108.16
401.363	173.7
401.8	127.58
402.237	132.44
402.674	154.28
403.111	132.44
403.548	120.3
403.985	147
404.421	103.31
404.858	134.86
405.295	147
405.732	178.55
406.168	83.89
406.605	163.99
407.041	120.3
407.478	132.44
407.914	110.59
408.351	154.28
408.787	168.84
409.223	98.45
409.66	163.99
410.096	83.89
410.532	171.27
410.968	149.43
411.404	100.88
411.84	125.15
412.276	130.01
412.712	132.44
413.148	200.4
413.584	115.44
414.02	212.53
414.455	188.26
414.891	178.55
415.327	125.15
415.762	147
416.198	231.95
416.633	185.83
417.069	120.3
417.504	161.56
417.94	83.89
418.375	163.99
418.81	151.85
419.245	176.13
419.681	159.13
420.116	66.9
420.551	93.6
420.986	168.84
421.421	202.82
421.856	212.53
422.291	127.58
422.726	149.43
423.16	193.12
423.595	156.71
424.03	144.57
424.464	154.28
424.899	137.29
425.334	117.87
425.768	125.15
426.203	98.45
426.637	83.89
427.071	137.29
427.506	173.7
427.94	76.61
428.374	183.41
428.809	149.43
429.243	105.74
429.677	86.32
430.111	122.73
430.545	132.44
430.979	168.84
431.413	156.71
431.847	113.02
432.28	117.87
432.714	76.61
433.148	217.39
433.582	144.57
434.015	151.85
434.449	166.42
434.882	142.14
435.316	100.88
435.749	197.97
436.183	154.28
436.616	149.43
437.049	161.56
437.483	188.26
437.916	210.11
438.349	190.69
438.782	166.42
439.215	190.69
439.648	115.44
440.081	110.59
440.514	130.01
440.947	190.69
441.38	147
441.813	108.16
442.245	229.52
442.678	137.29
443.111	83.89
443.543	137.29
443.976	171.27
444.408	156.71
444.841	183.41
445.273	156.71
445.705	81.46
446.138	200.4
446.57	154.28
447.002	149.43
447.434	183.41
447.867	185.83
448.299	210.11
448.731	156.71
449.163	178.55
449.595	166.42
450.026	154.28
450.458	168.84
450.89	190.69
451.322	161.56
451.754	163.99
452.185	197.97
452.617	142.14
453.048	183.41
453.48	159.13
453.911	163.99
454.343	149.43
454.774	122.73
455.205	139.72
455.637	183.41
456.068	180.98
456.499	173.7
456.93	161.56
457.361	154.28
457.792	256.22
458.223	193.12
458.654	195.54
459.085	147
459.516	236.81
459.947	139.72
460.378	231.95
460.808	214.96
461.239	183.41
461.669	161.56
462.1	212.53
462.531	156.71
462.961	229.52
463.391	120.3
463.822	183.41
464.252	166.42
464.682	185.83
465.113	122.73
465.543	185.83
465.973	205.25
466.403	200.4
466.833	290.2
467.263	195.54
467.693	154.28
468.123	122.73
468.553	105.74
468.983	193.12
469.412	239.23
469.842	190.69
470.272	142.14
470.701	207.68
471.131	151.85
471.56	200.4
471.99	147
472.419	185.83
472.849	183.41
473.278	147
473.707	185.83
474.136	176.13
474.566	176.13
474.995	156.71
475.424	195.54
475.853	210.11
476.282	139.72
476.711	202.82
477.14	130.01
477.569	98.45
477.997	151.85
478.426	151.85
478.855	161.56
479.283	195.54
479.712	147
480.141	168.84
480.569	93.6
480.998	234.38
481.426	214.96
481.854	125.15
482.283	173.7
482.711	91.17
483.139	156.71
483.567	86.32
483.995	212.53
484.424	127.58
484.852	137.29
485.28	159.13
485.708	183.41
486.135	120.3
486.563	134.86
486.991	122.73
487.419	117.87
487.847	197.97
488.274	147
488.702	130.01
489.129	214.96
489.557	168.84
489.984	183.41
490.412	115.44
490.839	154.28
491.266	171.27
491.694	205.25
492.121	178.55
492.548	139.72
492.975	151.85
493.402	98.45
493.829	137.29
494.256	176.13
494.683	130.01
495.11	195.54
495.537	163.99
495.964	147
496.39	149.43
496.817	163.99
497.244	161.56
497.67	139.72
498.097	185.83
498.523	71.75
498.95	156.71
499.376	197.97
499.803	214.96
500.229	149.43
500.655	130.01
501.081	110.59
501.508	161.56
501.934	195.54
502.36	105.74
502.786	190.69
503.212	142.14
503.638	122.73
504.064	108.16
504.489	159.13
504.915	134.86
505.341	81.46
505.767	185.83
506.192	108.16
506.618	91.17
507.043	200.4
507.469	117.87
507.894	149.43
508.32	163.99
508.745	149.43
509.17	154.28
509.596	139.72
510.021	207.68
510.446	108.16
510.871	217.39
511.296	190.69
511.721	79.04
512.146	137.29
512.571	183.41
512.996	166.42
513.421	103.31
513.845	130.01
514.27	222.24
514.695	159.13
515.119	151.85
515.544	93.6
515.969	229.52
516.393	178.55
516.817	151.85
517.242	151.85
517.666	125.15
518.09	130.01
518.515	219.82
518.939	125.15
519.363	370.3
519.787	261.08
520.211	183.41
520.635	163.99
521.059	183.41
521.483	188.26
521.907	190.69
522.331	159.13
522.754	122.73
523.178	110.59
523.602	139.72
524.025	161.56
524.449	188.26
524.872	173.7
525.296	91.17
525.719	137.29
526.143	200.4
526.566	190.69
526.989	185.83
527.412	178.55
527.836	173.7
528.259	147
528.682	100.88
529.105	142.14
529.528	168.84
529.951	161.56
530.374	173.7
530.796	127.58
531.219	178.55
531.642	130.01
532.065	144.57
532.487	132.44
532.91	127.58
533.332	197.97
533.755	161.56
534.177	197.97
534.6	185.83
535.022	115.44
535.444	156.71
535.867	127.58
536.289	161.56
536.711	139.72
537.133	176.13
537.555	200.4
537.977	117.87
538.399	120.3
538.821	207.68
539.243	163.99
539.665	212.53
540.086	98.45
540.508	151.85
540.93	234.38
541.351	188.26
541.773	108.16
542.195	205.25
542.616	207.68
543.037	171.27
543.459	244.09
543.88	168.84
544.301	197.97
544.723	132.44
545.144	149.43
545.565	185.83
545.986	161.56
546.407	154.28
546.828	139.72
547.249	190.69
547.67	200.4
548.091	244.09
548.512	156.71
548.932	142.14
549.353	214.96
549.774	108.16
550.194	224.67
550.615	156.71
551.035	178.55
551.456	115.44
551.876	122.73
552.296	163.99
552.717	190.69
553.137	81.46
553.557	154.28
553.977	214.96
554.397	183.41
554.817	163.99
555.237	217.39
555.657	132.44
556.077	105.74
556.497	139.72
556.917	231.95
557.337	205.25
557.756	147
558.176	200.4
558.596	173.7
559.015	134.86
559.435	100.88
559.854	171.27
560.274	217.39
560.693	178.55
561.112	149.43
561.532	188.26
561.951	163.99
562.37	236.81
562.789	207.68
563.208	214.96
563.627	188.26
564.046	210.11
564.465	117.87
564.884	98.45
565.303	193.12
565.722	117.87
566.14	159.13
566.559	210.11
566.978	188.26
567.396	156.71
567.815	127.58
568.233	156.71
568.652	214.96
569.07	207.68
569.489	219.82
569.907	171.27
570.325	168.84
570.743	115.44
571.161	103.31
571.58	110.59
571.998	134.86
572.416	190.69
572.833	142.14
573.251	195.54
573.669	197.97
574.087	173.7
574.505	139.72
574.922	137.29
575.34	161.56
575.758	125.15
576.175	103.31
576.593	173.7
577.01	137.29
577.428	161.56
577.845	1758.67
578.262	280.5
578.68	139.72
579.097	193.12
579.514	161.56
579.931	154.28
580.348	96.03
580.765	210.11
581.182	147
581.599	231.95
582.016	134.86
582.433	178.55
582.849	127.58
583.266	195.54
583.683	156.71
584.099	166.42
584.516	137.29
584.933	178.55
585.349	86.32
585.765	195.54
586.182	139.72
586.598	188.26
587.014	176.13
587.431	205.25
587.847	193.12
588.263	185.83
588.679	159.13
589.095	144.57
589.511	180.98
589.927	122.73
590.343	139.72
590.759	239.23
591.174	132.44
591.59	108.16
592.006	120.3
592.421	125.15
592.837	188.26
593.252	142.14
593.668	125.15
594.083	134.86
594.499	171.27
594.914	149.43
595.329	154.28
595.745	166.42
596.16	151.85
596.575	166.42
596.99	103.31
597.405	190.69
597.82	100.88
598.235	159.13
598.65	144.57
599.065	161.56
599.479	207.68
599.894	185.83
600.309	137.29
600.724	127.58
601.138	159.13
601.553	166.42
601.967	105.74
602.382	115.44
602.796	137.29
603.21	132.44
603.625	200.4
604.039	113.02
604.453	217.39
604.867	156.71
605.281	195.54
605.695	93.6
606.109	154.28
606.523	127.58
606.937	188.26
607.351	285.35
607.765	188.26
608.178	122.73
608.592	200.4
609.006	154.28
609.419	130.01
609.833	188.26
610.246	159.13
610.66	178.55
611.073	183.41
611.487	222.24
611.9	134.86
612.313	180.98
612.726	195.54
613.139	86.32
613.553	54.76
613.966	113.02
614.379	154.28
614.792	127.58
615.204	110.59
615.617	178.55
616.03	178.55
616.443	105.74
616.856	139.72
617.268	130.01
617.681	134.86
618.093	144.57
618.506	219.82
618.918	178.55
619.331	103.31
619.743	134.86
620.155	183.41
620.568	132.44
620.98	142.14
621.392	159.13
621.804	253.8
622.216	115.44
622.628	161.56
623.04	163.99
623.452	110.59
623.864	115.44
624.276	161.56
624.687	166.42
625.099	159.13
625.511	144.57
625.922	159.13
626.334	54.76
626.745	96.03
627.157	130.01
627.568	151.85
627.979	130.01
628.391	147
628.802	166.42
629.213	71.75
629.624	163.99
630.035	127.58
630.446	139.72
630.857	115.44
631.268	205.25
631.679	171.27
632.09	168.84
632.501	183.41
632.912	120.3
633.322	239.23
633.733	142.14
634.144	105.74
634.554	137.29
634.965	168.84
635.375	159.13
635.785	156.71
636.196	173.7
636.606	115.44
637.016	137.29
637.427	147
637.837	105.74
638.247	127.58
638.657	171.27
639.067	151.85
639.477	144.57
639.887	142.14
640.297	139.72
640.706	98.45
641.116	66.9
641.526	190.69
641.935	91.17
642.345	122.73
642.755	132.44
643.164	161.56
643.573	144.57
643.983	151.85
644.392	149.43
644.801	110.59
645.211	188.26
645.62	93.6
646.029	139.72
646.438	91.17
646.847	171.27
647.256	159.13
647.665	137.29
648.074	110.59
648.483	83.89
648.892	76.61
649.3	105.74
649.709	110.59
650.118	130.01
650.526	127.58
650.935	57.19
651.343	185.83
651.752	120.3
652.16	62.05
652.568	113.02
652.977	125.15
653.385	185.83
653.793	142.14
654.201	173.7
654.609	227.1
655.017	139.72
655.425	222.24
655.833	210.11
656.241	115.44
656.649	147
657.057	139.72
657.464	134.86
657.872	132.44
658.28	117.87
658.687	147
659.095	103.31
659.502	171.27
659.91	105.74
660.317	144.57
660.724	108.16
661.132	190.69
661.539	117.87
661.946	137.29
662.353	144.57
662.76	154.28
663.167	173.7
663.574	122.73
663.981	142.14
664.388	171.27
664.795	202.82
665.202	197.97
665.608	144.57
666.015	127.58
666.422	168.84
666.828	176.13
667.235	159.13
667.641	134.86
668.047	142.14
668.454	105.74
668.86	54.76
669.266	180.98
669.673	197.97
670.079	176.13
670.485	125.15
670.891	86.32
671.297	69.33
671.703	176.13
672.109	144.57
672.515	151.85
672.92	163.99
673.326	161.56
673.732	173.7
674.138	132.44
674.543	185.83
674.949	193.12
675.354	156.71
675.76	207.68
676.165	188.26
676.57	113.02
676.976	173.7
677.381	149.43
677.786	127.58
678.191	127.58
678.596	147
679.001	88.75
679.406	180.98
679.811	137.29
680.216	137.29
680.621	125.15
681.026	132.44
681.43	96.03
681.835	185.83
682.24	205.25
682.644	171.27
683.049	154.28
683.453	115.44
683.858	147
684.262	130.01
684.667	130.01
685.071	185.83
685.475	108.16
685.879	159.13
686.283	93.6
686.687	127.58
687.091	83.89
687.495	151.85
687.899	176.13
688.303	132.44
688.707	185.83
689.111	166.42
689.514	127.58
689.918	180.98
690.322	161.56
690.725	180.98
691.129	205.25
691.532	117.87
691.936	54.76
692.339	125.15
692.742	132.44
693.146	125.15
693.549	120.3
693.952	180.98
694.355	154.28
694.758	205.25
695.161	139.72
695.564	205.25
695.967	171.27
696.37	188.26
696.773	161.56
697.175	139.72
697.578	117.87
697.981	212.53
698.383	125.15
698.786	132.44
699.188	122.73
699.591	151.85
699.993	168.84
700.395	154.28
700.798	71.75
701.2	122.73
701.602	134.86
702.004	115.44
702.406	205.25
702.808	168.84
703.21	144.57
703.612	147
704.014	161.56
704.416	127.58
704.818	120.3
705.219	183.41
705.621	212.53
706.023	188.26
706.424	214.96
706.826	183.41
707.227	88.75
707.629	236.81
708.03	248.94
708.431	130.01
708.832	134.86
709.234	98.45
709.635	193.12
710.036	178.55
710.437	178.55
710.838	122.73
711.239	127.58
711.64	142.14
712.041	200.4
712.441	193.12
712.842	144.57
713.243	180.98
713.643	183.41
714.044	251.37
714.445	241.66
714.845	205.25
715.246	229.52
715.646	205.25
716.046	156.71
716.447	214.96
716.847	173.7
717.247	214.96
717.647	234.38
718.047	261.08
718.447	222.24
718.847	217.39
719.247	190.69
719.647	287.78
720.047	195.54
720.446	178.55
720.846	258.65
721.246	253.8
721.645	236.81
722.045	234.38
722.444	231.95
722.844	159.13
723.243	253.8
723.643	224.67
724.042	219.82
724.441	261.08
724.84	219.82
725.24	261.08
725.639	239.23
726.038	273.21
726.437	256.22
726.836	302.34
727.234	246.51
727.633	207.68
728.032	304.77
728.431	312.05
728.83	292.63
729.228	270.79
729.627	287.78
730.025	263.51
730.424	326.61
730.822	331.47
731.22	377.58
731.619	326.61
732.017	401.86
732.415	455.26
732.813	515.94
733.212	508.65
733.61	523.22
734.008	554.77
734.406	566.91
734.803	678.56
735.201	666.42
735.599	683.41
735.997	680.99
736.395	739.24
736.792	710.11
737.19	712.54
737.587	858.17
737.985	761.09
738.382	826.62
738.78	838.76
739.177	938.27
739.574	894.58
739.971	1047.5
740.369	996.53
740.766	1030.51
741.163	979.54
741.56	1105.75
741.957	1113.03
742.354	1244.1
742.751	1270.8
743.147	1435.85
743.544	1428.57
743.941	1447.99
744.338	1416.44
744.734	1491.68
745.131	1588.77
745.527	1664.01
745.924	1821.78
746.32	1882.46
746.716	2013.53
747.113	2032.95
747.509	2083.92
747.905	2295.09
748.301	2241.69
748.697	2540.24
749.093	2549.95
749.489	2634.9
749.885	2761.12
750.281	2882.48
750.677	3076.66
751.073	3139.76
751.468	3239.28
751.864	3593.65
752.26	3540.26
752.655	3727.15
753.051	3831.52
753.446	3940.75
753.842	3948.03
754.237	4234.44
754.632	4239.3
755.028	4421.34
755.423	4392.21
755.818	4627.65
756.213	4581.53
756.608	4600.95
757.003	4836.39
757.398	4642.21
757.793	4770.86
758.188	4880.08
758.583	4865.52
758.977	5178.63
759.372	5183.48
759.767	5346.11
760.161	5600.97
760.556	6081.56
760.95	6198.06
761.345	6222.34
761.739	6593.7
762.133	6698.07
762.527	7028.17
762.922	7241.77
763.316	7249.05
763.71	7350.99
764.104	7574.3
764.498	7668.96
764.892	7901.97
765.286	8054.89
765.68	8244.21
766.073	8574.31
766.467	8705.38
766.861	8894.71
767.255	9232.09
767.648	9744.24
768.042	9802.49
768.435	10171.43
768.829	10419
769.222	10936
769.615	11249.11
770.008	11581.64
770.402	11365.62
770.795	11885.05
771.188	11965.14
771.581	12195.73
771.974	12445.73
772.367	12785.54
772.76	13079.24
773.153	12639.91
773.545	12965.16
773.938	13246.72
774.331	13292.83
774.724	13567.11
775.116	14195.76
775.509	14581.69
775.901	15028.3
776.294	14982.18
776.686	14819.56
777.078	15110.82
777.471	14991.89
777.863	15472.48
778.255	15516.17
778.647	15215.19
779.039	15421.51
779.431	14734.6
779.823	14821.98
780.215	14727.32
780.607	14256.44
780.999	14790.43
781.39	14523.44
781.782	14902.08
782.174	14788
782.565	15239.47
782.957	15550.15
783.348	15996.76
783.74	16275.89
784.131	16829.3
784.522	17271.05
784.914	17307.46
785.305	17996.79
785.696	17856.01
786.087	18353.59
786.478	18152.13
786.869	17681.25
787.26	17406.98
787.651	16916.68
788.042	16681.24
788.433	15979.77
788.823	15545.3
789.214	14615.67
789.605	14300.13
789.995	13763.72
790.386	13035.55
790.776	12737
791.167	12433.6
791.557	12331.65
791.948	12467.58
792.338	12671.47
792.728	13127.78
793.118	13695.75
793.508	13664.2
793.898	14139.93
794.288	14256.44
794.678	14795.28
795.068	15467.63
795.458	15156.94
795.848	15819.57
796.238	15788.02
796.627	15392.38
797.017	15491.9
797.406	15363.25
797.796	14965.19
798.185	14989.46
798.575	14453.05
798.964	13605.95
799.354	13681.19
799.743	13695.75
800.132	13370.51
800.521	13188.46
800.91	13419.05
801.299	13292.83
801.688	13647.21
802.077	13588.96
802.466	13853.52
802.855	14030.71
803.244	14263.72
803.633	13965.17
804.021	13858.38
804.41	13518.57
804.799	13229.73
805.187	12843.8
805.576	12212.72
805.964	11807.37
806.352	11382.61
806.741	10807.36
807.129	10416.58
807.517	10508.81
807.905	10372.89
808.293	10331.62
808.681	10702.99
809.069	10710.27
809.457	11232.12
809.845	11426.3
810.233	11537.95
810.621	11744.27
811.009	12091.36
811.396	12101.07
811.784	12093.79
812.171	11632.61
812.559	11290.38
812.946	10671.43
813.334	10690.85
813.721	10110.75
814.108	9530.64
814.496	9467.53
814.883	9719.96
815.27	9885.01
815.657	9872.88
816.044	9989.38
816.431	10275.8
816.818	10297.64
817.205	10115.6
817.592	10278.22
817.979	9880.16
818.365	9763.65
818.752	9290.34
819.139	8904.42
819.525	8389.85
819.912	8098.58
820.298	7792.75
820.685	7440.8
821.071	7300.02
821.457	7438.37
821.843	7263.61
822.23	7207.79
822.616	7013.61
823.002	6897.1
823.388	6583.99
823.774	6387.39
824.16	6188.35
824.546	5918.93
824.931	5780.58
825.317	5600.97
825.703	5224.75
826.089	5011.15
826.474	4982.03
826.86	4943.19
827.245	4918.92
827.631	4984.45
828.016	4996.59
828.401	5171.35
828.787	5132.51
829.172	4906.78
829.557	4865.52
829.942	4586.39
830.327	4554.83
830.712	4239.3
831.097	3875.21
831.482	3843.66
831.867	3756.28
832.252	3807.25
832.636	3659.19
833.021	3804.82
833.406	3586.37
833.79	3758.71
834.175	3877.64
834.559	3654.33
834.944	3695.6
835.328	3467.44
835.713	3297.53
836.097	3086.36
836.481	2763.54
836.865	2671.31
837.249	2678.59
837.633	2613.06
838.017	2525.68
838.401	2484.41
838.785	2469.85
839.169	2481.99
839.553	2435.87
839.937	2360.63
840.32	2312.08
840.704	2071.79
841.087	1938.29
841.471	1804.79
841.854	1664.01
842.238	1688.28
842.621	1583.91
843.004	1557.21
843.388	1549.93
843.771	1707.7
844.154	1610.61
844.537	1644.59
844.92	1659.16
845.303	1562.07
845.686	1591.2
846.069	1360.61
846.452	1377.6
846.834	1355.76
847.217	1188.28
847.6	1205.27
847.982	1263.52
848.365	1231.97
848.748	1134.88
849.13	1195.56
849.512	1212.55
849.895	1229.54
850.277	1227.11
850.659	1151.87
851.041	1062.06
851.423	1023.23
851.806	1008.66
852.188	981.96
852.57	989.24
852.951	916.43
853.333	901.86
853.715	952.84
854.097	928.56
854.479	872.74
854.86	923.71
855.242	884.87
855.623	860.6
856.005	661.57
856.386	705.26
856.768	666.42
857.149	736.81
857.53	613.03
857.911	685.84
858.292	634.87
858.674	744.1
859.055	542.64
859.436	613.03
859.817	598.46
860.197	508.65
860.578	547.49
860.959	523.22
861.34	462.54
861.72	450.4
862.101	423.7
862.482	457.68
862.862	457.68
863.243	477.1
863.623	399.43
864.003	409.14
864.384	409.14
864.764	452.83
865.144	394.58
865.524	392.15
865.904	399.43
866.284	401.86
866.664	353.31
867.044	353.31
867.424	375.16
867.804	321.76
868.183	399.43
868.563	236.81
868.943	309.62
869.322	319.33
869.702	384.87
870.081	268.36
870.461	314.48
870.84	333.89
871.22	299.91
871.599	309.62
871.978	297.49
872.357	202.82
872.736	229.52
873.115	239.23
873.494	268.36
873.873	202.82
874.252	180.98
874.631	222.24
875.01	231.95
875.388	161.56
875.767	219.82
876.146	195.54
876.524	263.51
876.903	205.25
877.281	127.58
877.66	185.83
878.038	200.4
878.416	163.99
878.794	210.11
879.173	120.3
879.551	217.39
879.929	200.4
880.307	154.28
880.685	205.25
881.063	161.56
881.441	207.68
881.818	197.97
882.196	98.45
882.574	207.68
882.951	224.67
883.329	151.85
883.707	190.69
884.084	190.69
884.461	246.51
884.839	147
885.216	188.26
885.593	195.54
885.971	231.95
886.348	195.54
886.725	161.56
887.102	134.86
887.479	154.28
887.856	202.82
888.233	79.04
888.609	125.15
888.986	120.3
889.363	103.31
889.74	132.44
890.116	147
890.493	251.37
890.869	210.11
891.246	149.43
891.622	113.02
891.998	159.13
892.375	139.72
892.751	142.14
893.127	69.33
893.503	96.03
893.879	176.13
894.255	159.13
894.631	219.82
895.007	149.43
895.383	100.88
895.759	127.58
896.134	81.46
896.51	108.16
896.886	130.01
897.261	134.86
897.637	188.26
898.012	81.46
898.388	91.17
898.763	54.76
899.138	96.03
899.514	127.58
899.889	122.73
900.264	137.29
900.639	227.1
901.014	149.43
901.389	161.56
901.764	130.01
902.139	142.14
902.513	137.29
902.888	178.55
903.263	147
903.638	142.14
904.012	130.01
904.387	117.87
904.761	115.44
905.136	176.13
905.51	149.43
905.884	137.29
906.259	149.43
906.633	139.72
907.007	105.74
907.381	137.29
907.755	74.18
908.129	147
908.503	210.11
908.877	117.87
909.251	139.72
909.624	115.44
909.998	108.16
910.372	113.02
910.745	156.71
911.119	83.89
911.492	173.7
911.866	130.01
912.239	142.14
912.612	151.85
912.986	105.74
913.359	96.03
913.732	183.41
914.105	161.56
914.478	171.27
914.851	134.86
915.224	115.44
915.597	190.69
915.97	176.13
916.343	156.71
916.715	130.01
917.088	139.72
917.461	83.89
917.833	166.42
918.206	113.02
918.578	127.58
918.951	166.42
919.323	130.01
919.695	147
920.067	130.01
920.44	64.47
920.812	134.86
921.184	183.41
921.556	137.29
921.928	96.03
922.3	173.7
922.672	166.42
923.043	163.99
923.415	132.44
923.787	142.14
924.158	147
924.53	178.55
924.901	190.69
925.273	139.72
925.644	59.62
926.016	93.6
926.387	115.44
926.758	81.46
927.129	159.13
927.5	139.72
927.872	130.01
928.243	132.44
928.613	156.71
928.984	132.44
929.355	168.84
929.726	86.32
930.097	154.28
930.467	103.31
930.838	139.72
931.209	144.57
931.579	154.28
931.95	156.71
932.32	147
932.69	161.56
933.061	202.82
933.431	137.29
933.801	134.86
934.171	113.02
934.541	127.58
934.911	113.02
935.281	127.58
935.651	147
936.021	110.59
936.391	96.03
936.761	76.61
937.13	120.3
937.5	137.29
937.87	156.71
938.239	132.44
938.609	127.58
938.978	139.72
939.347	134.86
939.717	108.16
940.086	120.3
940.455	144.57
940.824	163.99
941.193	156.71
941.562	205.25
941.931	79.04
942.3	224.67
942.669	180.98
943.038	120.3
943.407	100.88
943.775	161.56
944.144	176.13
944.513	159.13
944.881	132.44
945.25	195.54
945.618	139.72
945.986	207.68
946.355	130.01
946.723	93.6
947.091	47.48
947.459	122.73
947.827	96.03
948.195	149.43
948.563	156.71
948.931	144.57
949.299	147
949.667	100.88
950.035	144.57
950.402	137.29
950.77	207.68
951.138	96.03
951.505	212.53
951.873	154.28
952.24	54.76
952.607	134.86
952.975	64.47
953.342	132.44
953.709	183.41
954.076	117.87
954.443	93.6
954.81	195.54
955.177	180.98
955.544	183.41
955.911	130.01
956.278	88.75
956.645	246.51
957.012	134.86
957.378	185.83
957.745	147
958.111	96.03
958.478	117.87
958.844	134.86
959.211	207.68
959.577	151.85
959.943	190.69
960.309	96.03
960.675	173.7
961.042	130.01
961.408	139.72
961.774	122.73
962.139	93.6
962.505	113.02
962.871	105.74
963.237	144.57
963.603	103.31
963.968	161.56
964.334	159.13
964.699	166.42
965.065	134.86
965.43	91.17
965.796	193.12
966.161	173.7
966.526	142.14
966.891	151.85
967.256	171.27
967.622	185.83
967.987	52.34
968.352	173.7
968.716	83.89
969.081	76.61
969.446	74.18
969.811	154.28
970.176	130.01
970.54	151.85
970.905	159.13
971.269	202.82
971.634	159.13
971.998	142.14
972.363	98.45
972.727	115.44
973.091	96.03
973.455	76.61
973.819	110.59
974.183	163.99
974.547	59.62
974.911	147
975.275	154.28
975.639	139.72
976.003	159.13
976.367	115.44
976.73	173.7
977.094	142.14
977.458	98.45
977.821	103.31
978.185	173.7
978.548	161.56
978.911	180.98
979.275	188.26
979.638	49.91
980.001	88.75
980.364	156.71
980.727	178.55
981.09	103.31
981.453	171.27
981.816	142.14
982.179	190.69
982.542	137.29
982.905	171.27
983.267	193.12
983.63	205.25
983.992	122.73
984.355	137.29
984.717	120.3
985.08	212.53
985.442	159.13
985.804	127.58
986.167	217.39
986.529	117.87
986.891	210.11
987.253	156.71
987.615	139.72
987.977	76.61
988.339	149.43
988.701	224.67
989.062	142.14
989.424	139.72
989.786	130.01
990.147	195.54
990.509	154.28
990.87	110.59
991.232	197.97
991.593	103.31
991.955	115.44
992.316	163.99
992.677	113.02
993.038	134.86
993.399	149.43
993.76	125.15
994.121	144.57
994.482	144.57
994.843	91.17
995.204	130.01
995.565	108.16
995.926	137.29
996.286	98.45
996.647	115.44
997.007	88.75
997.368	96.03
997.728	134.86
998.089	66.9
998.449	156.71
998.809	144.57
999.169	151.85
999.53	105.74
999.89	122.73
1000.25	151.85
1000.61	163.99
1000.97	137.29
1001.329	88.75
1001.689	147
1002.049	151.85
1002.409	137.29
1002.768	76.61
1003.128	139.72
1003.487	180.98
1003.847	139.72
1004.206	163.99
1004.566	176.13
1004.925	207.68
1005.284	137.29
1005.643	166.42
1006.003	132.44
1006.362	147
1006.721	210.11
1007.08	103.31
1007.438	28.06
1007.797	110.59
1008.156	91.17
1008.515	185.83
1008.874	59.62
1009.232	108.16
1009.591	139.72
1009.949	171.27
1010.308	76.61
1010.666	127.58
1011.024	166.42
1011.383	103.31
1011.741	113.02
1012.099	127.58
1012.457	188.26
1012.815	151.85
1013.173	117.87
1013.531	105.74
1013.889	156.71
1014.247	125.15
1014.605	193.12
1014.962	108.16
1015.32	127.58
1015.678	261.08
1016.035	120.3
1016.393	117.87
1016.75	142.14
1017.107	166.42
1017.465	83.89
1017.822	79.04
1018.179	185.83
1018.536	217.39
1018.894	83.89
1019.251	81.46
1019.608	142.14
1019.964	195.54
1020.321	117.87
1020.678	219.82
1021.035	98.45
1021.392	142.14
1021.748	88.75
1022.105	91.17
1022.461	144.57
1022.818	132.44
1023.174	76.61
1023.531	151.85
1023.887	161.56
1024.243	190.69
1024.599	134.86
1024.955	137.29
1025.311	159.13
1025.667	110.59
1026.023	185.83
1026.379	117.87
1026.735	132.44
1027.091	147
1027.447	176.13
