189.514	88.59
189.973	88.59
190.431	88.59
190.889	15.78
191.348	-6.07
191.806	35.19
192.264	23.06
192.722	-1.21
193.18	-57.04
193.638	81.31
194.096	-35.19
194.554	-23.06
195.012	25.49
195.47	-47.33
195.928	-15.78
196.385	-61.89
196.843	25.49
197.301	44.9
197.758	20.63
198.216	8.5
198.674	10.92
199.131	1.21
199.589	-10.92
200.046	86.17
200.503	44.9
200.961	91.02
201.418	108.01
201.875	52.19
202.332	132.28
202.79	57.04
203.247	112.87
203.704	120.15
204.161	120.15
204.618	188.11
205.075	93.45
205.532	173.55
205.989	190.54
206.445	158.98
206.902	154.13
207.359	151.7
207.816	117.72
208.272	32.77
208.729	110.44
209.185	141.99
209.642	175.97
210.098	151.7
210.555	214.81
211.011	195.39
211.467	173.55
211.924	205.1
212.38	154.13
212.836	166.26
213.292	105.58
213.748	117.72
214.204	91.02
214.66	141.99
215.116	158.98
215.572	190.54
216.028	166.26
216.484	151.7
216.94	192.96
217.396	100.73
217.851	188.11
218.307	151.7
218.763	146.85
219.218	52.19
219.674	125
220.129	83.74
220.585	166.26
221.04	103.16
221.496	95.88
221.951	183.26
222.406	105.58
222.861	137.14
223.317	154.13
223.772	139.57
224.227	57.04
224.682	132.28
225.137	64.32
225.592	141.99
226.047	76.46
226.502	108.01
226.957	105.58
227.411	151.7
227.866	81.31
228.321	125
228.776	44.9
229.23	166.26
229.685	168.69
230.139	134.71
230.594	166.26
231.048	112.87
231.503	81.31
231.957	139.57
232.411	91.02
232.865	183.26
233.32	168.69
233.774	103.16
234.228	129.86
234.682	156.56
235.136	188.11
235.59	161.41
236.044	137.14
236.498	195.39
236.952	125
237.406	214.81
237.86	149.27
238.313	115.29
238.767	125
239.221	95.88
239.674	207.53
240.128	110.44
240.581	151.7
241.035	127.43
241.488	71.6
241.942	127.43
242.395	173.55
242.848	178.4
243.301	212.38
243.755	129.86
244.208	137.14
244.661	103.16
245.114	168.69
245.567	117.72
246.02	180.83
246.473	141.99
246.926	117.72
247.379	137.14
247.832	134.71
248.284	185.68
248.737	141.99
249.19	120.15
249.642	144.42
250.095	115.29
250.547	146.85
251	154.13
251.452	154.13
251.905	202.67
252.357	110.44
252.81	93.45
253.262	178.4
253.714	144.42
254.166	134.71
254.618	141.99
255.07	163.84
255.523	156.56
255.975	127.43
256.427	188.11
256.878	122.57
257.33	117.72
257.782	105.58
258.234	188.11
258.686	132.28
259.137	175.97
259.589	105.58
260.041	163.84
260.492	200.25
260.944	122.57
261.395	134.71
261.847	231.8
262.298	103.16
262.749	122.57
263.201	154.13
263.652	69.18
264.103	139.57
264.554	134.71
265.005	125
265.457	105.58
265.908	117.72
266.359	110.44
266.809	161.41
267.26	146.85
267.711	69.18
268.162	105.58
268.613	81.31
269.064	122.57
269.514	120.15
269.965	100.73
270.415	78.88
270.866	178.4
271.316	139.57
271.767	103.16
272.217	156.56
272.668	166.26
273.118	144.42
273.568	146.85
274.019	86.17
274.469	132.28
274.919	151.7
275.369	115.29
275.819	185.68
276.269	188.11
276.719	105.58
277.169	141.99
277.619	207.53
278.069	134.71
278.518	217.24
278.968	100.73
279.418	52.19
279.867	100.73
280.317	88.59
280.767	146.85
281.216	197.82
281.666	156.56
282.115	137.14
282.564	112.87
283.014	100.73
283.463	149.27
283.912	171.12
284.361	88.59
284.811	158.98
285.26	161.41
285.709	158.98
286.158	149.27
286.607	95.88
287.056	163.84
287.505	175.97
287.953	158.98
288.402	212.38
288.851	173.55
289.3	144.42
289.748	195.39
290.197	137.14
290.646	149.27
291.094	127.43
291.543	195.39
291.991	139.57
292.439	103.16
292.888	134.71
293.336	156.56
293.784	137.14
294.233	139.57
294.681	98.3
295.129	117.72
295.577	134.71
296.025	132.28
296.473	139.57
296.921	195.39
297.369	120.15
297.817	137.14
298.264	154.13
298.712	180.83
299.16	158.98
299.608	125
300.055	122.57
300.503	93.45
300.95	175.97
301.398	190.54
301.845	144.42
302.293	122.57
302.74	112.87
303.187	163.84
303.635	127.43
304.082	146.85
304.529	115.29
304.976	129.86
305.423	151.7
305.87	137.14
306.317	105.58
306.764	171.12
307.211	161.41
307.658	122.57
308.105	115.29
308.552	141.99
308.998	42.48
309.445	156.56
309.892	95.88
310.338	125
310.785	197.82
311.231	108.01
311.678	110.44
312.124	178.4
312.571	158.98
313.017	205.1
313.463	110.44
313.909	127.43
314.356	122.57
314.802	171.12
315.248	132.28
315.694	180.83
316.14	168.69
316.586	185.68
317.032	86.17
317.478	129.86
317.923	71.6
318.369	120.15
318.815	125
319.261	151.7
319.706	151.7
320.152	175.97
320.597	137.14
321.043	146.85
321.488	178.4
321.934	88.59
322.379	168.69
322.824	132.28
323.27	166.26
323.715	231.8
324.16	125
324.605	154.13
325.05	149.27
325.495	103.16
325.94	122.57
326.385	149.27
326.83	188.11
327.275	151.7
327.72	183.26
328.165	134.71
328.61	151.7
329.054	132.28
329.499	185.68
329.943	137.14
330.388	134.71
330.832	146.85
331.277	156.56
331.721	190.54
332.166	185.68
332.61	156.56
333.054	103.16
333.499	91.02
333.943	161.41
334.387	125
334.831	175.97
335.275	151.7
335.719	86.17
336.163	137.14
336.607	158.98
337.051	146.85
337.495	154.13
337.938	103.16
338.382	125
338.826	132.28
339.269	125
339.713	137.14
340.157	156.56
340.6	180.83
341.044	158.98
341.487	117.72
341.93	100.73
342.374	129.86
342.817	183.26
343.26	234.23
343.703	129.86
344.146	93.45
344.59	141.99
345.033	158.98
345.476	180.83
345.919	146.85
346.361	125
346.804	146.85
347.247	149.27
347.69	49.76
348.133	88.59
348.575	105.58
349.018	149.27
349.461	158.98
349.903	144.42
350.346	122.57
350.788	122.57
351.23	59.47
351.673	195.39
352.115	105.58
352.557	88.59
353	71.6
353.442	137.14
353.884	137.14
354.326	95.88
354.768	154.13
355.21	125
355.652	185.68
356.094	110.44
356.536	127.43
356.978	163.84
357.419	141.99
357.861	127.43
358.303	105.58
358.744	180.83
359.186	112.87
359.627	132.28
360.069	117.72
360.51	108.01
360.952	207.53
361.393	120.15
361.834	144.42
362.276	134.71
362.717	93.45
363.158	156.56
363.599	183.26
364.04	173.55
364.481	166.26
364.922	197.82
365.363	171.12
365.804	137.14
366.245	105.58
366.686	171.12
367.126	151.7
367.567	108.01
368.008	108.01
368.448	98.3
368.889	166.26
369.33	91.02
369.77	74.03
370.21	134.71
370.651	122.57
371.091	139.57
371.531	158.98
371.972	190.54
372.412	166.26
372.852	103.16
373.292	137.14
373.732	146.85
374.172	78.88
374.612	137.14
375.052	81.31
375.492	158.98
375.932	156.56
376.372	132.28
376.811	115.29
377.251	141.99
377.691	205.1
378.13	158.98
378.57	122.57
379.009	129.86
379.449	151.7
379.888	168.69
380.328	127.43
380.767	88.59
381.206	168.69
381.645	226.95
382.085	129.86
382.524	151.7
382.963	132.28
383.402	137.14
383.841	81.31
384.28	110.44
384.719	146.85
385.158	195.39
385.596	64.32
386.035	120.15
386.474	69.18
386.913	95.88
387.351	146.85
387.79	166.26
388.228	122.57
388.667	110.44
389.105	180.83
389.544	185.68
389.982	103.16
390.42	122.57
390.859	81.31
391.297	122.57
391.735	132.28
392.173	129.86
392.611	112.87
393.049	122.57
393.487	137.14
393.925	91.02
394.363	171.12
394.801	188.11
395.239	100.73
395.676	78.88
396.114	139.57
396.552	61.89
396.989	132.28
397.427	125
397.864	95.88
398.302	161.41
398.739	134.71
399.177	154.13
399.614	112.87
400.051	88.59
400.488	117.72
400.926	163.84
401.363	173.55
401.8	180.83
402.237	168.69
402.674	125
403.111	180.83
403.548	100.73
403.985	195.39
404.421	134.71
404.858	188.11
405.295	149.27
405.732	125
406.168	144.42
406.605	105.58
407.041	110.44
407.478	146.85
407.914	132.28
408.351	161.41
408.787	144.42
409.223	197.82
409.66	171.12
410.096	117.72
410.532	129.86
410.968	151.7
411.404	151.7
411.84	149.27
412.276	146.85
412.712	180.83
413.148	127.43
413.584	137.14
414.02	183.26
414.455	86.17
414.891	122.57
415.327	183.26
415.762	158.98
416.198	197.82
416.633	110.44
417.069	125
417.504	154.13
417.94	88.59
418.375	141.99
418.81	88.59
419.245	195.39
419.681	132.28
420.116	166.26
420.551	139.57
420.986	158.98
421.421	134.71
421.856	125
422.291	127.43
422.726	88.59
423.16	129.86
423.595	139.57
424.03	173.55
424.464	103.16
424.899	192.96
425.334	168.69
425.768	105.58
426.203	144.42
426.637	127.43
427.071	185.68
427.506	105.58
427.94	95.88
428.374	115.29
428.809	195.39
429.243	144.42
429.677	180.83
430.111	125
430.545	158.98
430.979	180.83
431.413	74.03
431.847	134.71
432.28	95.88
432.714	110.44
433.148	103.16
433.582	163.84
434.015	64.32
434.449	205.1
434.882	180.83
435.316	137.14
435.749	129.86
436.183	151.7
436.616	137.14
437.049	180.83
437.483	105.58
437.916	110.44
438.349	163.84
438.782	146.85
439.215	137.14
439.648	173.55
440.081	200.25
440.514	146.85
440.947	195.39
441.38	188.11
441.813	103.16
442.245	217.24
442.678	125
443.111	154.13
443.543	108.01
443.976	168.69
444.408	127.43
444.841	110.44
445.273	171.12
445.705	149.27
446.138	137.14
446.57	202.67
447.002	166.26
447.434	190.54
447.867	207.53
448.299	229.37
448.731	246.36
449.163	205.1
449.595	178.4
450.026	183.26
450.458	222.09
450.89	129.86
451.322	112.87
451.754	127.43
452.185	161.41
452.617	180.83
453.048	195.39
453.48	260.93
453.911	243.94
454.343	188.11
454.774	212.38
455.205	158.98
455.637	178.4
456.068	195.39
456.499	231.8
456.93	207.53
457.361	222.09
457.792	178.4
458.223	146.85
458.654	277.92
459.085	202.67
459.516	236.65
459.947	195.39
460.378	122.57
460.808	166.26
461.239	222.09
461.669	175.97
462.1	219.66
462.531	209.95
462.961	207.53
463.391	166.26
463.822	171.12
464.252	183.26
464.682	156.56
465.113	282.77
465.543	192.96
465.973	175.97
466.403	192.96
466.833	188.11
467.263	253.64
467.693	212.38
468.123	231.8
468.553	149.27
468.983	149.27
469.412	139.57
469.842	192.96
470.272	149.27
470.701	192.96
471.131	209.95
471.56	156.56
471.99	139.57
472.419	231.8
472.849	202.67
473.278	112.87
473.707	224.52
474.136	175.97
474.566	224.52
474.995	91.02
475.424	156.56
475.853	168.69
476.282	163.84
476.711	207.53
477.14	207.53
477.569	190.54
477.997	163.84
478.426	188.11
478.855	173.55
479.283	188.11
479.712	168.69
480.141	161.41
480.569	180.83
480.998	154.13
481.426	137.14
481.854	146.85
482.283	246.36
482.711	192.96
483.139	161.41
483.567	185.68
483.995	166.26
484.424	134.71
484.852	200.25
485.28	163.84
485.708	207.53
486.135	173.55
486.563	219.66
486.991	178.4
487.419	168.69
487.847	192.96
488.274	207.53
488.702	168.69
489.129	141.99
489.557	144.42
489.984	243.94
490.412	190.54
490.839	226.95
491.266	156.56
491.694	98.3
492.121	178.4
492.548	161.41
492.975	229.37
493.402	175.97
493.829	185.68
494.256	108.01
494.683	188.11
495.11	146.85
495.537	171.12
495.964	166.26
496.39	195.39
496.817	95.88
497.244	229.37
497.67	200.25
498.097	178.4
498.523	185.68
498.95	163.84
499.376	125
499.803	127.43
500.229	108.01
500.655	188.11
501.081	178.4
501.508	144.42
501.934	108.01
502.36	115.29
502.786	205.1
503.212	151.7
503.638	156.56
504.064	212.38
504.489	168.69
504.915	212.38
505.341	139.57
505.767	163.84
506.192	190.54
506.618	166.26
507.043	103.16
507.469	166.26
507.894	231.8
508.32	149.27
508.745	190.54
509.17	185.68
509.596	166.26
510.021	137.14
510.446	156.56
510.871	132.28
511.296	219.66
511.721	112.87
512.146	231.8
512.571	69.18
512.996	197.82
513.421	197.82
513.845	190.54
514.27	226.95
514.695	144.42
515.119	200.25
515.544	173.55
515.969	108.01
516.393	156.56
516.817	222.09
517.242	132.28
517.666	195.39
518.09	88.59
518.515	207.53
518.939	185.68
519.363	416.27
519.787	105.58
520.211	163.84
520.635	151.7
521.059	200.25
521.483	132.28
521.907	129.86
522.331	161.41
522.754	112.87
523.178	180.83
523.602	173.55
524.025	163.84
524.449	175.97
524.872	149.27
525.296	168.69
525.719	139.57
526.143	156.56
526.566	154.13
526.989	129.86
527.412	239.08
527.836	129.86
528.259	253.64
528.682	163.84
529.105	188.11
529.528	178.4
529.951	226.95
530.374	180.83
530.796	226.95
531.219	214.81
531.642	161.41
532.065	183.26
532.487	149.27
532.91	205.1
533.332	163.84
533.755	173.55
534.177	166.26
534.6	188.11
535.022	76.46
535.444	86.17
535.867	105.58
536.289	132.28
536.711	197.82
537.133	171.12
537.555	71.6
537.977	161.41
538.399	173.55
538.821	156.56
539.243	149.27
539.665	202.67
540.086	156.56
540.508	178.4
540.93	214.81
541.351	139.57
541.773	171.12
542.195	173.55
542.616	110.44
543.037	168.69
543.459	141.99
543.88	161.41
544.301	168.69
544.723	144.42
545.144	122.57
545.565	217.24
545.986	171.12
546.407	134.71
546.828	141.99
547.249	175.97
547.67	171.12
548.091	212.38
548.512	168.69
548.932	146.85
549.353	178.4
549.774	180.83
550.194	175.97
550.615	156.56
551.035	197.82
551.456	134.71
551.876	149.27
552.296	207.53
552.717	149.27
553.137	180.83
553.557	134.71
553.977	151.7
554.397	156.56
554.817	205.1
555.237	95.88
555.657	168.69
556.077	175.97
556.497	146.85
556.917	156.56
557.337	219.66
557.756	212.38
558.176	139.57
558.596	86.17
559.015	171.12
559.435	183.26
559.854	137.14
560.274	120.15
560.693	149.27
561.112	188.11
561.532	95.88
561.951	171.12
562.37	154.13
562.789	231.8
563.208	93.45
563.627	200.25
564.046	110.44
564.465	205.1
564.884	200.25
565.303	149.27
565.722	139.57
566.14	154.13
566.559	146.85
566.978	144.42
567.396	195.39
567.815	188.11
568.233	149.27
568.652	139.57
569.07	122.57
569.489	122.57
569.907	88.59
570.325	161.41
570.743	134.71
571.161	122.57
571.58	100.73
571.998	163.84
572.416	151.7
572.833	183.26
573.251	129.86
573.669	129.86
574.087	180.83
574.505	132.28
574.922	234.23
575.34	151.7
575.758	166.26
576.175	151.7
576.593	190.54
577.01	207.53
577.428	192.96
577.845	1523.08
578.262	256.07
578.68	139.57
579.097	180.83
579.514	246.36
579.931	134.71
580.348	185.68
580.765	173.55
581.182	144.42
581.599	185.68
582.016	175.97
582.433	185.68
582.849	161.41
583.266	105.58
583.683	110.44
584.099	231.8
584.516	190.54
584.933	132.28
585.349	156.56
585.765	171.12
586.182	166.26
586.598	127.43
587.014	154.13
587.431	163.84
587.847	231.8
588.263	137.14
588.679	120.15
589.095	156.56
589.511	178.4
589.927	127.43
590.343	222.09
590.759	166.26
591.174	146.85
591.59	141.99
592.006	156.56
592.421	112.87
592.837	110.44
593.252	156.56
593.668	117.72
594.083	166.26
594.499	161.41
594.914	151.7
595.329	178.4
595.745	141.99
596.16	151.7
596.575	190.54
596.99	137.14
597.405	154.13
597.82	202.67
598.235	192.96
598.65	108.01
599.065	171.12
599.479	171.12
599.894	141.99
600.309	141.99
600.724	156.56
601.138	200.25
601.553	144.42
601.967	137.14
602.382	127.43
602.796	112.87
603.21	141.99
603.625	161.41
604.039	144.42
604.453	212.38
604.867	229.37
605.281	173.55
605.695	190.54
606.109	207.53
606.523	183.26
606.937	219.66
607.351	253.64
607.765	171.12
608.178	158.98
608.592	86.17
609.006	154.13
609.419	202.67
609.833	173.55
610.246	100.73
610.66	173.55
611.073	168.69
611.487	222.09
611.9	137.14
612.313	137.14
612.726	168.69
613.139	171.12
613.553	161.41
613.966	122.57
614.379	141.99
614.792	144.42
615.204	132.28
615.617	132.28
616.03	161.41
616.443	144.42
616.856	115.29
617.268	141.99
617.681	168.69
618.093	144.42
618.506	192.96
618.918	125
619.331	129.86
619.743	137.14
620.155	76.46
620.568	122.57
620.98	175.97
621.392	171.12
621.804	200.25
622.216	88.59
622.628	178.4
623.04	122.57
623.452	120.15
623.864	151.7
624.276	110.44
624.687	144.42
625.099	190.54
625.511	132.28
625.922	95.88
626.334	149.27
626.745	100.73
627.157	161.41
627.568	151.7
627.979	91.02
628.391	137.14
628.802	122.57
629.213	190.54
629.624	125
630.035	154.13
630.446	163.84
630.857	125
631.268	117.72
631.679	222.09
632.09	246.36
632.501	224.52
632.912	151.7
633.322	212.38
633.733	200.25
634.144	117.72
634.554	185.68
634.965	180.83
635.375	163.84
635.785	151.7
636.196	202.67
636.606	132.28
637.016	120.15
637.427	212.38
637.837	149.27
638.247	248.79
638.657	141.99
639.067	200.25
639.477	226.95
639.887	149.27
640.297	76.46
640.706	197.82
641.116	137.14
641.526	139.57
641.935	112.87
642.345	88.59
642.755	190.54
643.164	61.89
643.573	127.43
643.983	205.1
644.392	185.68
644.801	180.83
645.211	149.27
645.62	122.57
646.029	171.12
646.438	173.55
646.847	202.67
647.256	146.85
647.665	127.43
648.074	137.14
648.483	110.44
648.892	129.86
649.3	185.68
649.709	83.74
650.118	146.85
650.526	95.88
650.935	86.17
651.343	163.84
651.752	146.85
652.16	195.39
652.568	139.57
652.977	173.55
653.385	173.55
653.793	173.55
654.201	163.84
654.609	83.74
655.017	183.26
655.425	149.27
655.833	110.44
656.241	146.85
656.649	95.88
657.057	154.13
657.464	120.15
657.872	168.69
658.28	141.99
658.687	151.7
659.095	117.72
659.502	151.7
659.91	110.44
660.317	180.83
660.724	112.87
661.132	158.98
661.539	171.12
661.946	129.86
662.353	76.46
662.76	134.71
663.167	166.26
663.574	91.02
663.981	122.57
664.388	120.15
664.795	137.14
665.202	120.15
665.608	137.14
666.015	163.84
666.422	139.57
666.828	108.01
667.235	190.54
667.641	173.55
668.047	163.84
668.454	144.42
668.86	161.41
669.266	149.27
669.673	149.27
670.079	134.71
670.485	115.29
670.891	168.69
671.297	161.41
671.703	105.58
672.109	144.42
672.515	178.4
672.92	105.58
673.326	120.15
673.732	151.7
674.138	178.4
674.543	173.55
674.949	98.3
675.354	149.27
675.76	154.13
676.165	251.22
676.57	185.68
676.976	132.28
677.381	93.45
677.786	139.57
678.191	112.87
678.596	127.43
679.001	120.15
679.406	180.83
679.811	47.33
680.216	158.98
680.621	226.95
681.026	100.73
681.43	141.99
681.835	156.56
682.24	171.12
682.644	209.95
683.049	110.44
683.453	129.86
683.858	93.45
684.262	163.84
684.667	158.98
685.071	105.58
685.475	139.57
685.879	71.6
686.283	200.25
686.687	98.3
687.091	141.99
687.495	122.57
687.899	192.96
688.303	122.57
688.707	139.57
689.111	154.13
689.514	115.29
689.918	122.57
690.322	132.28
690.725	144.42
691.129	168.69
691.532	161.41
691.936	146.85
692.339	91.02
692.742	144.42
693.146	205.1
693.549	132.28
693.952	134.71
694.355	112.87
694.758	110.44
695.161	151.7
695.564	180.83
695.967	129.86
696.37	110.44
696.773	105.58
697.175	47.33
697.578	137.14
697.981	161.41
698.383	219.66
698.786	149.27
699.188	205.1
699.591	151.7
699.993	163.84
700.395	129.86
700.798	166.26
701.2	166.26
701.602	190.54
702.004	158.98
702.406	125
702.808	122.57
703.21	127.43
703.612	185.68
704.014	156.56
704.416	122.57
704.818	171.12
705.219	188.11
705.621	188.11
706.023	117.72
706.424	154.13
706.826	151.7
707.227	154.13
707.629	163.84
708.03	205.1
708.431	224.52
708.832	205.1
709.234	158.98
709.635	253.64
710.036	246.36
710.437	197.82
710.838	183.26
711.239	127.43
711.64	231.8
712.041	185.68
712.441	173.55
712.842	154.13
713.243	183.26
713.643	141.99
714.044	168.69
714.445	171.12
714.845	183.26
715.246	175.97
715.646	246.36
716.046	141.99
716.447	268.21
716.847	200.25
717.247	207.53
717.647	202.67
718.047	144.42
718.447	219.66
718.847	207.53
719.247	236.65
719.647	256.07
720.047	197.82
720.446	241.51
720.846	178.4
721.246	253.64
721.645	222.09
722.045	239.08
722.444	158.98
722.844	200.25
723.243	231.8
723.643	273.06
724.042	311.9
724.441	248.79
724.84	243.94
725.24	265.78
725.639	209.95
726.038	239.08
726.437	270.64
726.836	302.19
727.234	326.46
727.633	253.64
728.032	287.63
728.431	217.24
728.83	333.74
729.228	285.2
729.627	275.49
730.025	345.88
730.424	423.55
730.822	423.55
731.22	355.59
731.619	343.45
732.017	469.67
732.415	450.25
732.813	428.4
733.212	501.22
733.61	496.37
734.008	469.67
734.406	583.75
734.803	486.66
735.201	610.45
735.599	673.55
735.997	690.54
736.395	627.44
736.792	714.82
737.19	642
737.587	790.06
737.985	828.9
738.382	794.92
738.78	918.7
739.177	908.99
739.574	1071.62
739.971	1044.92
740.369	1083.75
740.766	1044.92
741.163	1120.16
741.56	1260.94
741.957	1205.12
742.354	1343.47
742.751	1411.43
743.147	1409
743.544	1421.14
743.941	1530.36
744.338	1542.5
744.734	1656.58
745.131	1719.69
745.527	1867.75
745.924	1794.93
746.32	1872.6
746.716	2052.22
747.113	2149.31
747.509	2321.64
747.905	2396.88
748.301	2493.97
748.697	2506.11
749.093	2644.46
749.489	2695.43
749.885	2867.76
750.281	3066.8
750.677	3299.81
751.073	3392.04
751.468	3413.89
751.864	3506.12
752.26	3508.55
752.655	3875.06
753.051	3969.72
753.446	4108.07
753.842	4207.59
754.237	4229.43
754.632	4472.16
755.028	4532.84
755.423	4498.86
755.818	4814.4
756.213	4916.34
756.608	4994.01
757.003	5057.12
757.398	5091.1
757.793	5105.66
758.188	5316.83
758.583	5258.58
758.977	5547.42
759.372	5644.51
759.767	5802.27
760.161	6171.21
760.556	6663.94
760.95	6935.79
761.345	6986.76
761.739	7047.44
762.133	7287.73
762.527	7734.34
762.922	8207.65
763.316	8392.12
763.71	8605.72
764.104	8540.18
764.498	8227.07
764.892	8960.09
765.286	9426.12
765.68	9537.77
766.073	9503.79
766.467	9312.04
766.861	9443.11
767.255	10214.96
767.648	10532.93
768.042	10617.88
768.435	11270.81
768.829	11134.88
769.222	11028.08
769.615	11336.34
770.008	11326.63
770.402	11651.88
770.795	11904.31
771.188	11549.94
771.581	11605.76
771.974	11489.26
772.367	11360.61
772.76	12028.1
773.153	11833.92
773.545	11503.82
773.938	11586.35
774.331	11656.73
774.724	11938.29
775.116	12802.38
775.509	13113.07
775.901	13236.86
776.294	13484.43
776.686	13860.65
777.078	14232.02
777.471	14872.8
777.863	15528.15
778.255	15401.94
778.647	15778.16
779.039	16042.73
779.431	15710.2
779.823	16397.1
780.215	16656.81
780.607	15994.18
780.999	16414.09
781.39	16139.81
781.782	16836.43
782.174	17103.42
782.565	17151.97
782.957	17045.17
783.348	16867.98
783.74	17280.61
784.131	17321.87
784.522	17431.1
784.914	17302.45
785.305	16897.11
785.696	16511.18
786.087	16739.34
786.478	16625.26
786.869	16256.32
787.26	15705.34
787.651	15324.27
788.042	14880.09
788.433	14986.88
788.823	14889.79
789.214	14617.95
789.605	13846.09
789.995	13717.45
790.386	13326.66
790.776	13739.29
791.167	13372.78
791.557	14023.28
791.948	13950.46
792.338	13727.16
792.728	14103.37
793.118	14372.8
793.508	14899.5
793.898	14661.64
794.288	14540.27
794.678	14518.43
795.068	14884.94
795.458	14596.1
795.848	14549.98
796.238	14537.85
796.627	14397.07
797.017	14178.62
797.406	14724.74
797.796	14717.46
798.185	14452.89
798.575	14540.27
798.964	14093.67
799.354	14642.22
799.743	14528.14
800.132	14591.25
800.521	14780.57
800.91	14622.8
801.299	14309.69
801.688	14263.57
802.077	14103.37
802.466	13916.48
802.855	13666.47
803.244	13147.05
803.633	13239.28
804.021	13156.76
804.41	13181.03
804.799	12812.09
805.187	11964.99
805.576	11926.16
805.964	11627.61
806.352	11690.72
806.741	11120.32
807.129	10850.9
807.517	10872.74
807.905	11195.56
808.293	11057.21
808.681	11149.45
809.069	10938.28
809.457	11469.84
809.845	11394.59
810.233	11256.24
810.621	11431
811.009	11270.81
811.396	11195.56
811.784	11149.45
812.171	11117.89
812.559	11079.06
812.946	10836.33
813.334	10765.94
813.721	10363.03
814.108	10083.89
814.496	10117.88
814.883	10047.49
815.27	10171.27
815.657	9814.47
816.044	10134.87
816.431	10076.61
816.818	9763.5
817.205	9727.09
817.592	9656.7
817.979	9396.99
818.365	9433.4
818.752	8952.81
819.139	8994.07
819.525	8501.35
819.912	8469.79
820.298	8006.19
820.685	8103.28
821.071	7879.98
821.457	7673.66
821.843	7299.87
822.23	7125.11
822.616	7001.32
823.002	6591.12
823.388	6324.13
823.774	6120.24
824.16	6074.12
824.546	5756.16
824.931	5775.58
825.317	5700.33
825.703	5574.12
826.089	5409.06
826.474	5377.51
826.86	5484.31
827.245	5202.75
827.631	5125.08
828.016	4894.49
828.401	4989.16
828.787	4894.49
829.172	4729.44
829.557	4506.14
829.942	4428.47
830.327	4362.93
830.712	4180.89
831.097	4212.44
831.482	4064.38
831.867	3879.91
832.252	3836.22
832.636	3872.63
833.021	3811.95
833.406	3622.63
833.79	3637.19
834.175	3474.57
834.559	3549.81
834.944	3304.66
835.328	3353.21
835.713	3183.3
836.097	3088.64
836.481	3151.75
836.865	2913.88
837.249	2828.93
837.633	2748.83
838.017	2566.79
838.401	2581.35
838.785	2486.69
839.169	2406.59
839.553	2324.07
839.937	2127.46
840.32	2091.05
840.704	2057.07
841.087	2025.52
841.471	1828.91
841.854	1780.37
842.238	1875.03
842.621	1683.28
843.004	1639.59
843.388	1610.46
843.771	1503.66
844.154	1508.52
844.537	1600.75
844.92	1554.64
845.303	1557.06
845.686	1379.88
846.069	1384.73
846.452	1399.29
846.834	1404.15
847.217	1273.08
847.6	1302.2
847.982	1297.35
848.365	1277.93
848.748	1299.78
849.13	1175.99
849.512	1129.87
849.895	1146.86
850.277	1134.73
850.659	1129.87
851.041	1066.76
851.423	1064.34
851.806	1023.07
852.188	989.09
852.57	1040.06
852.951	950.26
853.333	989.09
853.715	862.88
854.097	928.41
854.479	790.06
854.86	867.73
855.242	833.75
855.623	826.47
856.005	722.1
856.386	712.39
856.768	700.25
857.149	707.54
857.53	608.02
857.911	651.71
858.292	634.72
858.674	600.74
859.055	608.02
859.436	535.2
859.817	583.75
860.197	554.62
860.578	537.63
860.959	508.5
861.34	455.1
861.72	467.24
862.101	445.4
862.482	479.38
862.862	474.52
863.243	503.65
863.623	428.4
864.003	440.54
864.384	491.51
864.764	501.22
865.144	413.84
865.524	396.85
865.904	428.4
866.284	336.17
866.664	355.59
867.044	343.45
867.424	362.87
867.804	408.99
868.183	338.6
868.563	304.62
868.943	345.88
869.322	304.62
869.702	331.32
870.081	321.61
870.461	265.78
870.84	309.47
871.22	205.1
871.599	343.45
871.978	321.61
872.357	287.63
872.736	229.37
873.115	258.5
873.494	241.51
873.873	309.47
874.252	285.2
874.631	251.22
875.01	207.53
875.388	222.09
875.767	234.23
876.146	205.1
876.524	231.8
876.903	209.95
877.281	258.5
877.66	144.42
878.038	246.36
878.416	243.94
878.794	154.13
879.173	110.44
879.551	219.66
879.929	154.13
880.307	202.67
880.685	166.26
881.063	231.8
881.441	171.12
881.818	243.94
882.196	141.99
882.574	178.4
882.951	195.39
883.329	175.97
883.707	166.26
884.084	122.57
884.461	256.07
884.839	207.53
885.216	134.71
885.593	200.25
885.971	139.57
886.348	144.42
886.725	197.82
887.102	180.83
887.479	154.13
887.856	175.97
888.233	188.11
888.609	76.46
888.986	125
889.363	234.23
889.74	224.52
890.116	161.41
890.493	115.29
890.869	158.98
891.246	183.26
891.622	214.81
891.998	217.24
892.375	163.84
892.751	183.26
893.127	151.7
893.503	188.11
893.879	154.13
894.255	185.68
894.631	144.42
895.007	202.67
895.383	183.26
895.759	234.23
896.134	173.55
896.51	166.26
896.886	158.98
897.261	125
897.637	163.84
898.012	125
898.388	132.28
898.763	166.26
899.138	190.54
899.514	144.42
899.889	132.28
900.264	161.41
900.639	163.84
901.014	168.69
901.389	226.95
901.764	127.43
902.139	100.73
902.513	156.56
902.888	200.25
903.263	195.39
903.638	100.73
904.012	161.41
904.387	137.14
904.761	125
905.136	158.98
905.51	163.84
905.884	108.01
906.259	110.44
906.633	103.16
907.007	71.6
907.381	137.14
907.755	151.7
908.129	132.28
908.503	154.13
908.877	91.02
909.251	146.85
909.624	180.83
909.998	146.85
910.372	144.42
910.745	158.98
911.119	197.82
911.492	154.13
911.866	158.98
912.239	78.88
912.612	146.85
912.986	100.73
913.359	125
913.732	137.14
914.105	141.99
914.478	74.03
914.851	129.86
915.224	209.95
915.597	103.16
915.97	180.83
916.343	161.41
916.715	151.7
917.088	61.89
917.461	120.15
917.833	120.15
918.206	197.82
918.578	125
918.951	83.74
919.323	163.84
919.695	156.56
920.067	188.11
920.44	110.44
920.812	117.72
921.184	158.98
921.556	161.41
921.928	105.58
922.3	161.41
922.672	105.58
923.043	141.99
923.415	180.83
923.787	81.31
924.158	127.43
924.53	74.03
924.901	192.96
925.273	100.73
925.644	158.98
926.016	151.7
926.387	120.15
926.758	129.86
927.129	209.95
927.5	144.42
927.872	71.6
928.243	161.41
928.613	83.74
928.984	100.73
929.355	163.84
929.726	69.18
930.097	98.3
930.467	149.27
930.838	217.24
931.209	192.96
931.579	161.41
931.95	149.27
932.32	134.71
932.69	200.25
933.061	122.57
933.431	161.41
933.801	171.12
934.171	61.89
934.541	127.43
934.911	134.71
935.281	117.72
935.651	137.14
936.021	156.56
936.391	166.26
936.761	105.58
937.13	163.84
937.5	183.26
937.87	110.44
938.239	120.15
938.609	137.14
938.978	127.43
939.347	263.35
939.717	149.27
940.086	103.16
940.455	127.43
940.824	154.13
941.193	127.43
941.562	214.81
941.931	137.14
942.3	207.53
942.669	171.12
943.038	117.72
943.407	115.29
943.775	188.11
944.144	120.15
944.513	139.57
944.881	112.87
945.25	175.97
945.618	139.57
945.986	110.44
946.355	129.86
946.723	139.57
947.091	100.73
947.459	122.57
947.827	175.97
948.195	248.79
948.563	110.44
948.931	129.86
949.299	98.3
949.667	154.13
950.035	207.53
950.402	95.88
950.77	81.31
951.138	168.69
951.505	156.56
951.873	212.38
952.24	98.3
952.607	219.66
952.975	192.96
953.342	166.26
953.709	103.16
954.076	185.68
954.443	205.1
954.81	144.42
955.177	134.71
955.544	217.24
955.911	178.4
956.278	134.71
956.645	166.26
957.012	141.99
957.378	185.68
957.745	161.41
958.111	112.87
958.478	151.7
958.844	144.42
959.211	151.7
959.577	108.01
959.943	154.13
960.309	188.11
960.675	188.11
961.042	132.28
961.408	144.42
961.774	108.01
962.139	137.14
962.505	110.44
962.871	110.44
963.237	139.57
963.603	120.15
963.968	158.98
964.334	115.29
964.699	156.56
965.065	163.84
965.43	166.26
965.796	175.97
966.161	129.86
966.526	134.71
966.891	163.84
967.256	83.74
967.622	137.14
967.987	132.28
968.352	91.02
968.716	197.82
969.081	185.68
969.446	88.59
969.811	125
970.176	149.27
970.54	166.26
970.905	132.28
971.269	129.86
971.634	158.98
971.998	163.84
972.363	151.7
972.727	158.98
973.091	212.38
973.455	192.96
973.819	156.56
974.183	132.28
974.547	105.58
974.911	71.6
975.275	161.41
975.639	212.38
976.003	117.72
976.367	108.01
976.73	146.85
977.094	175.97
977.458	120.15
977.821	146.85
978.185	180.83
978.548	197.82
978.911	100.73
979.275	141.99
979.638	137.14
980.001	156.56
980.364	146.85
980.727	185.68
981.09	125
981.453	112.87
981.816	129.86
982.179	144.42
982.542	171.12
982.905	129.86
983.267	115.29
983.63	168.69
983.992	207.53
984.355	95.88
984.717	137.14
985.08	100.73
985.442	115.29
985.804	156.56
986.167	146.85
986.529	171.12
986.891	129.86
987.253	141.99
987.615	207.53
987.977	168.69
988.339	115.29
988.701	243.94
989.062	98.3
989.424	71.6
989.786	125
990.147	117.72
990.509	139.57
990.87	168.69
991.232	178.4
991.593	105.58
991.955	129.86
992.316	149.27
992.677	98.3
993.038	81.31
993.399	183.26
993.76	190.54
994.121	129.86
994.482	146.85
994.843	205.1
995.204	151.7
995.565	171.12
995.926	139.57
996.286	158.98
996.647	108.01
997.007	81.31
997.368	151.7
997.728	134.71
998.089	144.42
998.449	105.58
998.809	117.72
999.169	100.73
999.53	137.14
999.89	156.56
1000.25	110.44
1000.61	171.12
1000.97	134.71
1001.329	180.83
1001.689	171.12
1002.049	122.57
1002.409	141.99
1002.768	141.99
1003.128	163.84
1003.487	180.83
1003.847	161.41
1004.206	112.87
1004.566	166.26
1004.925	168.69
1005.284	86.17
1005.643	168.69
1006.003	146.85
1006.362	154.13
1006.721	141.99
1007.08	188.11
1007.438	163.84
1007.797	161.41
1008.156	100.73
1008.515	115.29
1008.874	105.58
1009.232	78.88
1009.591	146.85
1009.949	127.43
1010.308	183.26
1010.666	180.83
1011.024	166.26
1011.383	144.42
1011.741	132.28
1012.099	168.69
1012.457	120.15
1012.815	105.58
1013.173	105.58
1013.531	171.12
1013.889	151.7
1014.247	185.68
1014.605	185.68
1014.962	105.58
1015.32	103.16
1015.678	151.7
1016.035	129.86
1016.393	25.49
1016.75	166.26
1017.107	180.83
1017.465	192.96
1017.822	173.55
1018.179	129.86
1018.536	168.69
1018.894	115.29
1019.251	149.27
1019.608	190.54
1019.964	127.43
1020.321	151.7
1020.678	161.41
1021.035	98.3
1021.392	108.01
1021.748	120.15
1022.105	81.31
1022.461	78.88
1022.818	64.32
1023.174	190.54
1023.531	156.56
1023.887	141.99
1024.243	122.57
1024.599	209.95
1024.955	139.57
1025.311	149.27
1025.667	185.68
1026.023	161.41
1026.379	110.44
1026.735	69.18
1027.091	161.41
1027.447	178.4
