189.514	36.26
189.973	36.26
190.431	36.26
190.889	-46.27
191.348	-43.84
191.806	-22
192.264	-17.14
192.722	14.41
193.18	-41.41
193.638	-46.27
194.096	16.84
194.554	-17.14
195.012	11.98
195.47	-2.58
195.928	21.69
196.385	-46.27
196.843	21.69
197.301	-34.13
197.758	7.13
198.216	58.1
198.674	-5.01
199.131	58.1
199.589	45.97
200.046	11.98
200.503	62.96
200.961	75.09
201.418	104.22
201.875	77.52
202.332	58.1
202.79	72.66
203.247	121.21
203.704	121.21
204.161	160.04
204.618	164.9
205.075	152.76
205.532	130.92
205.989	177.04
206.445	169.75
206.902	184.32
207.359	201.31
207.816	201.31
208.272	145.48
208.729	211.02
209.185	150.34
209.642	145.48
210.098	186.74
210.555	128.49
211.011	169.75
211.467	113.93
211.924	145.48
212.38	160.04
212.836	147.91
213.292	164.9
213.748	196.45
214.204	189.17
214.66	184.32
215.116	169.75
215.572	123.64
216.028	164.9
216.484	189.17
216.94	126.06
217.396	179.46
217.851	143.05
218.307	128.49
218.763	143.05
219.218	172.18
219.674	172.18
220.129	145.48
220.585	116.35
221.04	60.53
221.496	186.74
221.951	92.08
222.406	179.46
222.861	198.88
223.317	109.07
223.772	189.17
224.227	143.05
224.682	177.04
225.137	167.33
225.592	135.77
226.047	92.08
226.502	130.92
226.957	106.65
227.411	172.18
227.866	123.64
228.321	220.73
228.776	169.75
229.23	208.59
229.685	169.75
230.139	186.74
230.594	206.16
231.048	109.07
231.503	123.64
231.957	99.36
232.411	135.77
232.865	194.03
233.32	184.32
233.774	135.77
234.228	198.88
234.682	116.35
235.136	128.49
235.59	101.79
236.044	118.78
236.498	147.91
236.952	121.21
237.406	133.35
237.86	177.04
238.313	140.63
238.767	62.96
239.221	206.16
239.674	155.19
240.128	167.33
240.581	123.64
241.035	101.79
241.488	111.5
241.942	181.89
242.395	143.05
242.848	84.8
243.301	138.2
243.755	172.18
244.208	194.03
244.661	196.45
245.114	164.9
245.567	174.61
246.02	128.49
246.473	140.63
246.926	99.36
247.379	162.47
247.832	177.04
248.284	92.08
248.737	172.18
249.19	184.32
249.642	106.65
250.095	109.07
250.547	126.06
251	130.92
251.452	113.93
251.905	128.49
252.357	140.63
252.81	194.03
253.262	191.6
253.714	164.9
254.166	116.35
254.618	169.75
255.07	143.05
255.523	184.32
255.975	113.93
256.427	123.64
256.878	84.8
257.33	123.64
257.782	160.04
258.234	109.07
258.686	177.04
259.137	145.48
259.589	133.35
260.041	70.24
260.492	150.34
260.944	140.63
261.395	96.94
261.847	128.49
262.298	167.33
262.749	198.88
263.201	179.46
263.652	194.03
264.103	181.89
264.554	116.35
265.005	143.05
265.457	87.23
265.908	167.33
266.359	121.21
266.809	172.18
267.26	164.9
267.711	152.76
268.162	162.47
268.613	164.9
269.064	152.76
269.514	104.22
269.965	143.05
270.415	116.35
270.866	191.6
271.316	94.51
271.767	123.64
272.217	123.64
272.668	167.33
273.118	164.9
273.568	186.74
274.019	143.05
274.469	174.61
274.919	128.49
275.369	220.73
275.819	201.31
276.269	113.93
276.719	150.34
277.169	140.63
277.619	118.78
278.069	99.36
278.518	177.04
278.968	186.74
279.418	167.33
279.867	128.49
280.317	167.33
280.767	177.04
281.216	121.21
281.666	174.61
282.115	177.04
282.564	167.33
283.014	140.63
283.463	169.75
283.912	96.94
284.361	140.63
284.811	135.77
285.26	147.91
285.709	174.61
286.158	152.76
286.607	118.78
287.056	167.33
287.505	194.03
287.953	172.18
288.402	172.18
288.851	150.34
289.3	140.63
289.748	123.64
290.197	62.96
290.646	147.91
291.094	116.35
291.543	162.47
291.991	121.21
292.439	104.22
292.888	198.88
293.336	162.47
293.784	138.2
294.233	133.35
294.681	104.22
295.129	150.34
295.577	160.04
296.025	230.43
296.473	118.78
296.921	179.46
297.369	138.2
297.817	126.06
298.264	184.32
298.712	140.63
299.16	150.34
299.608	189.17
300.055	169.75
300.503	152.76
300.95	206.16
301.398	162.47
301.845	223.15
302.293	174.61
302.74	121.21
303.187	101.79
303.635	92.08
304.082	48.39
304.529	155.19
304.976	75.09
305.423	179.46
305.87	123.64
306.317	160.04
306.764	177.04
307.211	232.86
307.658	164.9
308.105	150.34
308.552	143.05
308.998	203.73
309.445	147.91
309.892	169.75
310.338	106.65
310.785	184.32
311.231	157.62
311.678	164.9
312.124	184.32
312.571	145.48
313.017	157.62
313.463	118.78
313.909	135.77
314.356	179.46
314.802	203.73
315.248	147.91
315.694	167.33
316.14	198.88
316.586	128.49
317.032	89.66
317.478	96.94
317.923	177.04
318.369	135.77
318.815	150.34
319.261	164.9
319.706	169.75
320.152	181.89
320.597	201.31
321.043	116.35
321.488	155.19
321.934	138.2
322.379	164.9
322.824	155.19
323.27	198.88
323.715	104.22
324.16	164.9
324.605	140.63
325.05	223.15
325.495	164.9
325.94	140.63
326.385	70.24
326.83	116.35
327.275	189.17
327.72	147.91
328.165	133.35
328.61	128.49
329.054	189.17
329.499	138.2
329.943	167.33
330.388	133.35
330.832	152.76
331.277	230.43
331.721	152.76
332.166	198.88
332.61	133.35
333.054	118.78
333.499	177.04
333.943	126.06
334.387	123.64
334.831	186.74
335.275	113.93
335.719	174.61
336.163	104.22
336.607	116.35
337.051	155.19
337.495	118.78
337.938	135.77
338.382	167.33
338.826	162.47
339.269	43.54
339.713	203.73
340.157	99.36
340.6	220.73
341.044	143.05
341.487	111.5
341.93	126.06
342.374	186.74
342.817	101.79
343.26	172.18
343.703	189.17
344.146	186.74
344.59	128.49
345.033	143.05
345.476	145.48
345.919	140.63
346.361	133.35
346.804	133.35
347.247	164.9
347.69	126.06
348.133	140.63
348.575	211.02
349.018	157.62
349.461	82.37
349.903	164.9
350.346	116.35
350.788	128.49
351.23	186.74
351.673	177.04
352.115	160.04
352.557	203.73
353	113.93
353.442	162.47
353.884	179.46
354.326	104.22
354.768	162.47
355.21	133.35
355.652	113.93
356.094	220.73
356.536	89.66
356.978	104.22
357.419	184.32
357.861	150.34
358.303	133.35
358.744	196.45
359.186	62.96
359.627	160.04
360.069	198.88
360.51	111.5
360.952	169.75
361.393	198.88
361.834	179.46
362.276	53.25
362.717	133.35
363.158	135.77
363.599	138.2
364.04	147.91
364.481	145.48
364.922	135.77
365.363	133.35
365.804	191.6
366.245	203.73
366.686	162.47
367.126	104.22
367.567	155.19
368.008	147.91
368.448	43.54
368.889	174.61
369.33	181.89
369.77	218.3
370.21	128.49
370.651	157.62
371.091	242.57
371.531	155.19
371.972	203.73
372.412	126.06
372.852	135.77
373.292	123.64
373.732	191.6
374.172	172.18
374.612	147.91
375.052	174.61
375.492	96.94
375.932	198.88
376.372	162.47
376.811	186.74
377.251	160.04
377.691	189.17
378.13	113.93
378.57	169.75
379.009	203.73
379.449	138.2
379.888	169.75
380.328	181.89
380.767	135.77
381.206	130.92
381.645	181.89
382.085	167.33
382.524	172.18
382.963	177.04
383.402	203.73
383.841	145.48
384.28	79.95
384.719	126.06
385.158	128.49
385.596	128.49
386.035	174.61
386.474	58.1
386.913	138.2
387.351	140.63
387.79	167.33
388.228	138.2
388.667	181.89
389.105	189.17
389.544	36.26
389.982	109.07
390.42	157.62
390.859	121.21
391.297	79.95
391.735	138.2
392.173	198.88
392.611	179.46
393.049	206.16
393.487	191.6
393.925	79.95
394.363	169.75
394.801	147.91
395.239	104.22
395.676	84.8
396.114	147.91
396.552	128.49
396.989	174.61
397.427	92.08
397.864	145.48
398.302	106.65
398.739	130.92
399.177	152.76
399.614	106.65
400.051	111.5
400.488	87.23
400.926	177.04
401.363	89.66
401.8	135.77
402.237	96.94
402.674	126.06
403.111	92.08
403.548	140.63
403.985	104.22
404.421	162.47
404.858	128.49
405.295	140.63
405.732	162.47
406.168	152.76
406.605	181.89
407.041	121.21
407.478	104.22
407.914	167.33
408.351	130.92
408.787	104.22
409.223	101.79
409.66	126.06
410.096	113.93
410.532	121.21
410.968	152.76
411.404	113.93
411.84	150.34
412.276	135.77
412.712	126.06
413.148	109.07
413.584	174.61
414.02	87.23
414.455	174.61
414.891	152.76
415.327	135.77
415.762	133.35
416.198	121.21
416.633	169.75
417.069	162.47
417.504	206.16
417.94	201.31
418.375	164.9
418.81	147.91
419.245	121.21
419.681	130.92
420.116	121.21
420.551	96.94
420.986	106.65
421.421	174.61
421.856	206.16
422.291	191.6
422.726	123.64
423.16	169.75
423.595	87.23
424.03	186.74
424.464	179.46
424.899	164.9
425.334	133.35
425.768	152.76
426.203	111.5
426.637	174.61
427.071	133.35
427.506	109.07
427.94	135.77
428.374	167.33
428.809	147.91
429.243	99.36
429.677	155.19
430.111	152.76
430.545	104.22
430.979	191.6
431.413	123.64
431.847	138.2
432.28	157.62
432.714	138.2
433.148	145.48
433.582	143.05
434.015	111.5
434.449	111.5
434.882	138.2
435.316	194.03
435.749	113.93
436.183	164.9
436.616	164.9
437.049	152.76
437.483	181.89
437.916	135.77
438.349	194.03
438.782	177.04
439.215	147.91
439.648	152.76
440.081	126.06
440.514	220.73
440.947	218.3
441.38	143.05
441.813	181.89
442.245	228.01
442.678	72.66
443.111	206.16
443.543	213.44
443.976	186.74
444.408	218.3
444.841	225.58
445.273	181.89
445.705	208.59
446.138	218.3
446.57	101.79
447.002	155.19
447.434	194.03
447.867	223.15
448.299	235.29
448.731	206.16
449.163	201.31
449.595	215.87
450.026	261.99
450.458	223.15
450.89	215.87
451.322	230.43
451.754	252.28
452.185	303.25
452.617	257.13
453.048	249.85
453.48	266.84
453.911	342.09
454.343	278.98
454.774	220.73
455.205	203.73
455.637	266.84
456.068	215.87
456.499	211.02
456.93	230.43
457.361	201.31
457.792	276.55
458.223	232.86
458.654	293.54
459.085	261.99
459.516	257.13
459.947	203.73
460.378	235.29
460.808	189.17
461.239	293.54
461.669	213.44
462.1	266.84
462.531	271.7
462.961	257.13
463.391	172.18
463.822	308.11
464.252	213.44
464.682	201.31
465.113	230.43
465.543	237.72
465.973	232.86
466.403	140.63
466.833	208.59
467.263	247.42
467.693	167.33
468.123	257.13
468.553	215.87
468.983	213.44
469.412	266.84
469.842	206.16
470.272	271.7
470.701	167.33
471.131	276.55
471.56	264.42
471.99	145.48
472.419	198.88
472.849	322.67
473.278	247.42
473.707	264.42
474.136	261.99
474.566	252.28
474.995	223.15
475.424	206.16
475.853	196.45
476.282	223.15
476.711	191.6
477.14	135.77
477.569	169.75
477.997	235.29
478.426	245
478.855	213.44
479.283	206.16
479.712	223.15
480.141	184.32
480.569	257.13
480.998	206.16
481.426	211.02
481.854	220.73
482.283	109.07
482.711	196.45
483.139	269.27
483.567	167.33
483.995	121.21
484.424	179.46
484.852	213.44
485.28	177.04
485.708	218.3
486.135	235.29
486.563	198.88
486.991	147.91
487.419	208.59
487.847	162.47
488.274	228.01
488.702	174.61
489.129	155.19
489.557	143.05
489.984	220.73
490.412	179.46
490.839	198.88
491.266	167.33
491.694	191.6
492.121	126.06
492.548	186.74
492.975	152.76
493.402	196.45
493.829	213.44
494.256	179.46
494.683	174.61
495.11	184.32
495.537	157.62
495.964	181.89
496.39	106.65
496.817	194.03
497.244	235.29
497.67	155.19
498.097	133.35
498.523	157.62
498.95	147.91
499.376	160.04
499.803	220.73
500.229	152.76
500.655	201.31
501.081	109.07
501.508	228.01
501.934	162.47
502.36	206.16
502.786	203.73
503.212	203.73
503.638	184.32
504.064	167.33
504.489	169.75
504.915	89.66
505.341	162.47
505.767	230.43
506.192	259.56
506.618	240.14
507.043	196.45
507.469	121.21
507.894	118.78
508.32	162.47
508.745	160.04
509.17	162.47
509.596	104.22
510.021	215.87
510.446	150.34
510.871	157.62
511.296	213.44
511.721	230.43
512.146	186.74
512.571	252.28
512.996	245
513.421	167.33
513.845	143.05
514.27	135.77
514.695	203.73
515.119	135.77
515.544	135.77
515.969	211.02
516.393	123.64
516.817	145.48
517.242	228.01
517.666	184.32
518.09	177.04
518.515	194.03
518.939	162.47
519.363	371.21
519.787	169.75
520.211	220.73
520.635	230.43
521.059	179.46
521.483	189.17
521.907	109.07
522.331	160.04
522.754	157.62
523.178	145.48
523.602	245
524.025	206.16
524.449	145.48
524.872	254.71
525.296	213.44
525.719	186.74
526.143	261.99
526.566	130.92
526.989	84.8
527.412	225.58
527.836	96.94
528.259	201.31
528.682	133.35
529.105	147.91
529.528	235.29
529.951	230.43
530.374	177.04
530.796	143.05
531.219	198.88
531.642	211.02
532.065	179.46
532.487	201.31
532.91	160.04
533.332	194.03
533.755	201.31
534.177	89.66
534.6	186.74
535.022	213.44
535.444	218.3
535.867	198.88
536.289	208.59
536.711	203.73
537.133	203.73
537.555	177.04
537.977	152.76
538.399	169.75
538.821	242.57
539.243	138.2
539.665	174.61
540.086	254.71
540.508	116.35
540.93	160.04
541.351	194.03
541.773	169.75
542.195	189.17
542.616	196.45
543.037	186.74
543.459	203.73
543.88	220.73
544.301	237.72
544.723	194.03
545.144	276.55
545.565	213.44
545.986	169.75
546.407	181.89
546.828	242.57
547.249	135.77
547.67	155.19
548.091	225.58
548.512	198.88
548.932	235.29
549.353	201.31
549.774	164.9
550.194	160.04
550.615	184.32
551.035	191.6
551.456	181.89
551.876	196.45
552.296	143.05
552.717	150.34
553.137	211.02
553.557	211.02
553.977	133.35
554.397	218.3
554.817	109.07
555.237	152.76
555.657	208.59
556.077	213.44
556.497	155.19
556.917	184.32
557.337	167.33
557.756	245
558.176	143.05
558.596	133.35
559.015	147.91
559.435	169.75
559.854	179.46
560.274	167.33
560.693	123.64
561.112	211.02
561.532	203.73
561.951	172.18
562.37	143.05
562.789	245
563.208	184.32
563.627	228.01
564.046	140.63
564.465	140.63
564.884	135.77
565.303	164.9
565.722	87.23
566.14	157.62
566.559	162.47
566.978	157.62
567.396	247.42
567.815	230.43
568.233	186.74
568.652	152.76
569.07	94.51
569.489	186.74
569.907	138.2
570.325	184.32
570.743	133.35
571.161	155.19
571.58	261.99
571.998	196.45
572.416	213.44
572.833	213.44
573.251	211.02
573.669	164.9
574.087	140.63
574.505	118.78
574.922	174.61
575.34	203.73
575.758	75.09
576.175	157.62
576.593	111.5
577.01	206.16
577.428	252.28
577.845	1752.3
578.262	269.27
578.68	174.61
579.097	99.36
579.514	109.07
579.931	235.29
580.348	235.29
580.765	167.33
581.182	169.75
581.599	269.27
582.016	208.59
582.433	130.92
582.849	172.18
583.266	261.99
583.683	167.33
584.099	225.58
584.516	198.88
584.933	237.72
585.349	223.15
585.765	167.33
586.182	147.91
586.598	128.49
587.014	230.43
587.431	186.74
587.847	179.46
588.263	89.66
588.679	245
589.095	232.86
589.511	228.01
589.927	225.58
590.343	147.91
590.759	164.9
591.174	174.61
591.59	196.45
592.006	220.73
592.421	198.88
592.837	174.61
593.252	155.19
593.668	84.8
594.083	138.2
594.499	140.63
594.914	160.04
595.329	121.21
595.745	264.42
596.16	167.33
596.575	186.74
596.99	167.33
597.405	174.61
597.82	104.22
598.235	167.33
598.65	237.72
599.065	218.3
599.479	225.58
599.894	123.64
600.309	140.63
600.724	140.63
601.138	181.89
601.553	223.15
601.967	213.44
602.382	106.65
602.796	179.46
603.21	225.58
603.625	143.05
604.039	198.88
604.453	230.43
604.867	181.89
605.281	288.69
605.695	150.34
606.109	240.14
606.523	150.34
606.937	194.03
607.351	264.42
607.765	198.88
608.178	164.9
608.592	133.35
609.006	140.63
609.419	140.63
609.833	118.78
610.246	189.17
610.66	223.15
611.073	186.74
611.487	184.32
611.9	172.18
612.313	121.21
612.726	167.33
613.139	203.73
613.553	135.77
613.966	140.63
614.379	143.05
614.792	145.48
615.204	135.77
615.617	181.89
616.03	96.94
616.443	162.47
616.856	237.72
617.268	201.31
617.681	118.78
618.093	147.91
618.506	150.34
618.918	140.63
619.331	169.75
619.743	189.17
620.155	201.31
620.568	228.01
620.98	121.21
621.392	213.44
621.804	177.04
622.216	172.18
622.628	143.05
623.04	201.31
623.452	135.77
623.864	164.9
624.276	203.73
624.687	177.04
625.099	167.33
625.511	155.19
625.922	130.92
626.334	89.66
626.745	157.62
627.157	167.33
627.568	133.35
627.979	99.36
628.391	128.49
628.802	203.73
629.213	123.64
629.624	206.16
630.035	133.35
630.446	143.05
630.857	157.62
631.268	104.22
631.679	169.75
632.09	130.92
632.501	228.01
632.912	169.75
633.322	147.91
633.733	152.76
634.144	184.32
634.554	189.17
634.965	157.62
635.375	237.72
635.785	169.75
636.196	145.48
636.606	128.49
637.016	162.47
637.427	184.32
637.837	179.46
638.247	174.61
638.657	198.88
639.067	157.62
639.477	101.79
639.887	147.91
640.297	133.35
640.706	196.45
641.116	150.34
641.526	184.32
641.935	104.22
642.345	111.5
642.755	121.21
643.164	167.33
643.573	169.75
643.983	118.78
644.392	118.78
644.801	140.63
645.211	126.06
645.62	150.34
646.029	189.17
646.438	157.62
646.847	128.49
647.256	135.77
647.665	143.05
648.074	138.2
648.483	181.89
648.892	152.76
649.3	150.34
649.709	138.2
650.118	172.18
650.526	179.46
650.935	174.61
651.343	252.28
651.752	118.78
652.16	147.91
652.568	194.03
652.977	126.06
653.385	203.73
653.793	160.04
654.201	152.76
654.609	138.2
655.017	184.32
655.425	116.35
655.833	181.89
656.241	186.74
656.649	220.73
657.057	58.1
657.464	160.04
657.872	169.75
658.28	126.06
658.687	72.66
659.095	135.77
659.502	133.35
659.91	111.5
660.317	96.94
660.724	211.02
661.132	138.2
661.539	162.47
661.946	130.92
662.353	186.74
662.76	145.48
663.167	152.76
663.574	157.62
663.981	215.87
664.388	140.63
664.795	150.34
665.202	172.18
665.608	164.9
666.015	111.5
666.422	106.65
666.828	140.63
667.235	160.04
667.641	116.35
668.047	189.17
668.454	177.04
668.86	160.04
669.266	150.34
669.673	167.33
670.079	177.04
670.485	126.06
670.891	77.52
671.297	143.05
671.703	111.5
672.109	152.76
672.515	228.01
672.92	123.64
673.326	172.18
673.732	135.77
674.138	150.34
674.543	155.19
674.949	211.02
675.354	191.6
675.76	138.2
676.165	160.04
676.57	169.75
676.976	121.21
677.381	145.48
677.786	96.94
678.191	99.36
678.596	213.44
679.001	157.62
679.406	135.77
679.811	208.59
680.216	111.5
680.621	198.88
681.026	174.61
681.43	123.64
681.835	94.51
682.24	82.37
682.644	113.93
683.049	167.33
683.453	164.9
683.858	118.78
684.262	138.2
684.667	70.24
685.071	130.92
685.475	147.91
685.879	143.05
686.283	194.03
686.687	138.2
687.091	150.34
687.495	145.48
687.899	118.78
688.303	194.03
688.707	164.9
689.111	135.77
689.514	145.48
689.918	181.89
690.322	191.6
690.725	135.77
691.129	194.03
691.532	160.04
691.936	152.76
692.339	189.17
692.742	145.48
693.146	179.46
693.549	242.57
693.952	155.19
694.355	191.6
694.758	123.64
695.161	211.02
695.564	194.03
695.967	116.35
696.37	184.32
696.773	179.46
697.175	206.16
697.578	118.78
697.981	230.43
698.383	186.74
698.786	160.04
699.188	143.05
699.591	123.64
699.993	130.92
700.395	164.9
700.798	235.29
701.2	162.47
701.602	101.79
702.004	177.04
702.406	155.19
702.808	198.88
703.21	157.62
703.612	138.2
704.014	147.91
704.416	160.04
704.818	169.75
705.219	140.63
705.621	140.63
706.023	196.45
706.424	150.34
706.826	225.58
707.227	123.64
707.629	211.02
708.03	181.89
708.431	198.88
708.832	186.74
709.234	211.02
709.635	235.29
710.036	213.44
710.437	276.55
710.838	169.75
711.239	123.64
711.64	186.74
712.041	186.74
712.441	191.6
712.842	174.61
713.243	152.76
713.643	259.56
714.044	198.88
714.445	174.61
714.845	259.56
715.246	201.31
715.646	206.16
716.046	245
716.447	220.73
716.847	283.83
717.247	242.57
717.647	203.73
718.047	249.85
718.447	274.12
718.847	184.32
719.247	225.58
719.647	295.97
720.047	259.56
720.446	228.01
720.846	215.87
721.246	257.13
721.645	240.14
722.045	223.15
722.444	261.99
722.844	325.1
723.243	295.97
723.643	208.59
724.042	247.42
724.441	274.12
724.84	249.85
725.24	312.96
725.639	213.44
726.038	271.7
726.437	242.57
726.836	354.22
727.234	288.69
727.633	349.37
728.032	327.52
728.431	332.38
728.83	337.23
729.228	363.93
729.627	422.18
730.025	356.65
730.424	453.74
730.822	495
731.22	441.6
731.619	444.03
732.017	509.56
732.415	558.11
732.813	609.08
733.212	662.48
733.61	592.09
734.008	613.94
734.406	640.63
734.803	701.32
735.201	696.46
735.599	822.68
735.997	880.93
736.395	854.23
736.792	895.49
737.19	965.88
737.587	980.45
737.985	1072.68
738.382	1079.96
738.78	1213.46
739.177	1208.6
739.574	1228.02
739.971	1266.86
740.369	1344.53
740.766	1405.21
741.163	1577.54
741.56	1560.55
741.957	1626.09
742.354	1618.81
742.751	1759.58
743.147	1820.26
743.544	1868.81
743.941	1992.6
744.338	2002.31
744.734	2084.83
745.131	2223.18
745.527	2414.93
745.924	2565.42
746.32	2594.55
746.716	2662.51
747.113	2919.8
747.509	3077.57
747.905	3009.6
748.301	3252.33
748.697	3356.7
749.093	3621.26
749.489	3708.64
749.885	3883.4
750.281	3999.91
750.677	4155.25
751.073	4354.28
751.468	4546.04
751.864	4565.45
752.26	4817.88
752.655	4900.41
753.051	4987.79
753.446	5232.94
753.842	5414.98
754.237	5757.22
754.632	5868.87
755.028	6072.76
755.423	6140.72
755.818	6291.21
756.213	6320.33
756.608	6497.52
757.003	6633.45
757.398	6703.84
757.793	6837.33
758.188	6905.3
758.583	7118.89
758.977	7036.37
759.372	7677.15
759.767	7822.79
760.161	8097.06
760.556	8703.87
760.95	8929.6
761.345	9424.75
761.739	9735.44
762.133	10002.43
762.527	10480.59
762.922	10492.73
763.316	11084.97
763.71	11330.12
764.104	11393.23
764.498	11711.2
764.892	11973.34
765.286	12284.02
765.68	12451.5
766.073	12995.2
766.467	12873.83
766.861	13371.42
767.255	13662.68
767.648	14029.19
768.042	14135.99
768.435	14422.4
768.829	14458.81
769.222	14922.41
769.615	15434.55
770.008	15070.47
770.402	15242.8
770.795	15478.24
771.188	15890.87
771.581	15657.86
771.974	15742.81
772.367	15456.4
772.76	15805.92
773.153	15257.37
773.545	15524.36
773.938	16004.95
774.331	16211.27
774.724	15924.85
775.116	16662.73
775.509	17301.09
775.901	17655.46
776.294	18623.92
776.686	18327.8
777.078	19082.67
777.471	19407.92
777.863	20473.47
778.255	21089.98
778.647	21221.05
779.039	21201.63
779.431	21053.57
779.823	21529.31
780.215	21747.76
780.607	21286.59
780.999	22024.46
781.39	22092.42
781.782	21864.27
782.174	22310.87
782.565	22774.47
782.957	22342.43
783.348	22779.33
783.74	23000.21
784.131	22706.51
784.522	22747.77
784.914	22563.31
785.305	22988.07
785.696	22070.58
786.087	22157.96
786.478	21876.4
786.869	20871.53
787.26	20359.39
787.651	20519.58
788.042	20514.73
788.433	19582.68
788.823	18844.8
789.214	18895.77
789.605	18733.15
789.995	18053.53
790.386	18026.83
790.776	18111.78
791.167	17924.88
791.557	18053.53
791.948	18866.65
792.338	18699.17
792.728	18728.29
793.118	18971.02
793.508	19259.86
793.898	19072.96
794.288	19335.1
794.678	19264.71
795.068	19337.53
795.458	19238.01
795.848	18689.46
796.238	19157.91
796.627	18759.85
797.017	18655.48
797.406	19121.5
797.796	18626.35
798.185	18643.34
798.575	18873.93
798.964	19672.48
799.354	19075.39
799.743	18597.22
800.132	19029.27
800.521	18995.29
800.91	18796.26
801.299	17975.86
801.688	18488
802.077	18750.14
802.466	18157.9
802.855	17844.79
803.244	17398.18
803.633	17036.52
804.021	16456.41
804.41	16492.82
804.799	16725.84
805.187	15968.54
805.576	15599.61
805.964	15220.96
806.352	15034.06
806.741	14771.92
807.129	14043.76
807.517	14657.84
807.905	14543.76
808.293	14271.91
808.681	14385.99
809.069	14662.7
809.457	14924.84
809.845	14754.93
810.233	14745.22
810.621	15315.62
811.009	14939.4
811.396	14444.25
811.784	14667.55
812.171	14873.87
812.559	14412.69
812.946	14017.06
813.334	14055.89
813.721	13929.68
814.108	13157.82
814.496	13339.86
814.883	13308.31
815.27	13298.6
815.657	13019.47
816.044	13133.55
816.431	13543.75
816.818	13002.48
817.205	12521.89
817.592	12927.23
817.979	12376.25
818.365	11890.81
818.752	11529.15
819.139	11517.02
819.525	11434.49
819.912	10546.13
820.298	10485.45
820.685	10509.72
821.071	9927.19
821.457	9754.85
821.843	9395.63
822.23	9305.82
822.616	8968.43
823.002	8368.91
823.388	8114.05
823.774	8249.98
824.16	7679.58
824.546	7322.78
824.931	7308.21
825.317	7378.6
825.703	7264.52
826.089	6691.7
826.474	6883.45
826.86	6681.99
827.245	6706.26
827.631	6594.61
828.016	6548.49
828.401	6417.42
828.787	6133.44
829.172	6172.27
829.557	5878.58
829.942	5851.88
830.327	5577.6
830.712	5266.92
831.097	5334.88
831.482	5507.22
831.867	5303.33
832.252	4982.94
832.636	4813.03
833.021	4878.56
833.406	4817.88
833.79	4703.8
834.175	4572.73
834.559	4555.74
834.944	4393.12
835.328	4155.25
835.713	4063.02
836.097	4080.01
836.481	3895.54
836.865	3643.11
837.249	3754.76
837.633	3609.13
838.017	3322.72
838.401	3264.46
838.785	3128.54
839.169	3038.73
839.553	2946.5
839.937	2781.44
840.32	2604.26
840.704	2599.4
841.087	2570.28
841.471	2349.4
841.854	2312.99
842.238	2276.58
842.621	2191.63
843.004	2079.98
843.388	2043.57
843.771	2082.4
844.154	2046
844.537	1893.08
844.92	1992.6
845.303	1961.04
845.686	1876.09
846.069	1863.95
846.452	1713.47
846.834	1783.86
847.217	1800.85
847.6	1752.3
847.982	1582.4
848.365	1548.42
848.748	1582.4
849.13	1621.23
849.512	1497.44
849.895	1465.89
850.277	1495.02
850.659	1470.74
851.041	1252.29
851.423	1325.11
851.806	1373.66
852.188	1378.51
852.57	1225.6
852.951	1206.18
853.333	1235.3
853.715	1208.6
854.097	1179.48
854.479	1155.21
854.86	1082.39
855.242	1065.4
855.623	992.58
856.005	907.63
856.386	975.59
856.768	914.91
857.149	825.1
857.53	820.25
857.911	856.66
858.292	745.01
858.674	810.54
859.055	774.13
859.436	669.76
859.817	701.32
860.197	720.73
860.578	633.35
860.959	638.21
861.34	567.82
861.72	596.94
862.101	570.25
862.482	635.78
862.862	538.69
863.243	548.4
863.623	565.39
864.003	448.88
864.384	509.56
864.764	487.72
865.144	456.17
865.524	434.32
865.904	458.59
866.284	422.18
866.664	492.57
867.044	453.74
867.424	475.58
867.804	417.33
868.183	422.18
868.563	339.66
868.943	322.67
869.322	397.91
869.702	363.93
870.081	300.82
870.461	322.67
870.84	334.8
871.22	288.69
871.599	310.53
871.978	320.24
872.357	320.24
872.736	305.68
873.115	293.54
873.494	320.24
873.873	293.54
874.252	264.42
874.631	332.38
875.01	261.99
875.388	245
875.767	276.55
876.146	288.69
876.524	300.82
876.903	242.57
877.281	220.73
877.66	235.29
878.038	230.43
878.416	194.03
878.794	206.16
879.173	201.31
879.551	215.87
879.929	259.56
880.307	228.01
880.685	257.13
881.063	247.42
881.441	252.28
881.818	167.33
882.196	140.63
882.574	121.21
882.951	206.16
883.329	130.92
883.707	203.73
884.084	196.45
884.461	245
884.839	257.13
885.216	155.19
885.593	196.45
885.971	240.14
886.348	152.76
886.725	169.75
887.102	160.04
887.479	232.86
887.856	201.31
888.233	218.3
888.609	189.17
888.986	152.76
889.363	220.73
889.74	152.76
890.116	225.58
890.493	169.75
890.869	169.75
891.246	203.73
891.622	160.04
891.998	177.04
892.375	155.19
892.751	174.61
893.127	123.64
893.503	179.46
893.879	143.05
894.255	225.58
894.631	130.92
895.007	118.78
895.383	147.91
895.759	167.33
896.134	145.48
896.51	143.05
896.886	94.51
897.261	172.18
897.637	140.63
898.012	196.45
898.388	169.75
898.763	191.6
899.138	126.06
899.514	126.06
899.889	123.64
900.264	177.04
900.639	189.17
901.014	140.63
901.389	155.19
901.764	179.46
902.139	123.64
902.513	147.91
902.888	174.61
903.263	130.92
903.638	157.62
904.012	160.04
904.387	164.9
904.761	121.21
905.136	257.13
905.51	160.04
905.884	116.35
906.259	89.66
906.633	111.5
907.007	157.62
907.381	189.17
907.755	140.63
908.129	113.93
908.503	128.49
908.877	92.08
909.251	162.47
909.624	160.04
909.998	123.64
910.372	121.21
910.745	145.48
911.119	157.62
911.492	174.61
911.866	198.88
912.239	128.49
912.612	118.78
912.986	191.6
913.359	150.34
913.732	121.21
914.105	123.64
914.478	118.78
914.851	167.33
915.224	213.44
915.597	169.75
915.97	174.61
916.343	84.8
916.715	169.75
917.088	152.76
917.461	143.05
917.833	113.93
918.206	191.6
918.578	162.47
918.951	128.49
919.323	101.79
919.695	101.79
920.067	230.43
920.44	123.64
920.812	181.89
921.184	181.89
921.556	155.19
921.928	101.79
922.3	111.5
922.672	133.35
923.043	87.23
923.415	89.66
923.787	167.33
924.158	135.77
924.53	126.06
924.901	201.31
925.273	43.54
925.644	150.34
926.016	140.63
926.387	138.2
926.758	128.49
927.129	128.49
927.5	84.8
927.872	128.49
928.243	220.73
928.613	130.92
928.984	111.5
929.355	174.61
929.726	143.05
930.097	206.16
930.467	70.24
930.838	184.32
931.209	128.49
931.579	157.62
931.95	143.05
932.32	130.92
932.69	135.77
933.061	96.94
933.431	94.51
933.801	111.5
934.171	130.92
934.541	113.93
934.911	174.61
935.281	157.62
935.651	92.08
936.021	104.22
936.391	130.92
936.761	206.16
937.13	109.07
937.5	198.88
937.87	186.74
938.239	130.92
938.609	150.34
938.978	230.43
939.347	179.46
939.717	135.77
940.086	157.62
940.455	96.94
940.824	189.17
941.193	196.45
941.562	147.91
941.931	174.61
942.3	169.75
942.669	172.18
943.038	82.37
943.407	45.97
943.775	123.64
944.144	174.61
944.513	157.62
944.881	58.1
945.25	208.59
945.618	118.78
945.986	174.61
946.355	167.33
946.723	133.35
947.091	82.37
947.459	140.63
947.827	140.63
948.195	152.76
948.563	155.19
948.931	145.48
949.299	94.51
949.667	145.48
950.035	92.08
950.402	164.9
950.77	135.77
951.138	111.5
951.505	164.9
951.873	62.96
952.24	186.74
952.607	177.04
952.975	174.61
953.342	94.51
953.709	177.04
954.076	121.21
954.443	126.06
954.81	143.05
955.177	164.9
955.544	181.89
955.911	155.19
956.278	116.35
956.645	118.78
957.012	94.51
957.378	157.62
957.745	118.78
958.111	75.09
958.478	179.46
958.844	109.07
959.211	160.04
959.577	133.35
959.943	177.04
960.309	198.88
960.675	143.05
961.042	167.33
961.408	152.76
961.774	167.33
962.139	174.61
962.505	118.78
962.871	177.04
963.237	101.79
963.603	140.63
963.968	152.76
964.334	89.66
964.699	186.74
965.065	194.03
965.43	111.5
965.796	121.21
966.161	135.77
966.526	121.21
966.891	167.33
967.256	96.94
967.622	116.35
967.987	111.5
968.352	113.93
968.716	118.78
969.081	101.79
969.446	116.35
969.811	184.32
970.176	145.48
970.54	135.77
970.905	194.03
971.269	111.5
971.634	113.93
971.998	118.78
972.363	145.48
972.727	130.92
973.091	164.9
973.455	157.62
973.819	177.04
974.183	104.22
974.547	126.06
974.911	89.66
975.275	99.36
975.639	160.04
976.003	150.34
976.367	143.05
976.73	106.65
977.094	138.2
977.458	111.5
977.821	138.2
978.185	70.24
978.548	101.79
978.911	138.2
979.275	135.77
979.638	135.77
980.001	152.76
980.364	99.36
980.727	140.63
981.09	130.92
981.453	130.92
981.816	70.24
982.179	220.73
982.542	206.16
982.905	128.49
983.267	113.93
983.63	155.19
983.992	150.34
984.355	140.63
984.717	194.03
985.08	147.91
985.442	128.49
985.804	101.79
986.167	201.31
986.529	155.19
986.891	77.52
987.253	128.49
987.615	167.33
987.977	104.22
988.339	94.51
988.701	123.64
989.062	145.48
989.424	135.77
989.786	121.21
990.147	138.2
990.509	181.89
990.87	191.6
991.232	201.31
991.593	133.35
991.955	79.95
992.316	138.2
992.677	130.92
993.038	160.04
993.399	109.07
993.76	135.77
994.121	179.46
994.482	150.34
994.843	133.35
995.204	140.63
995.565	145.48
995.926	145.48
996.286	196.45
996.647	116.35
997.007	147.91
997.368	109.07
997.728	198.88
998.089	155.19
998.449	79.95
998.809	167.33
999.169	109.07
999.53	169.75
999.89	126.06
1000.25	84.8
1000.61	157.62
1000.97	99.36
1001.329	109.07
1001.689	145.48
1002.049	62.96
1002.409	101.79
1002.768	138.2
1003.128	126.06
1003.487	109.07
1003.847	218.3
1004.206	191.6
1004.566	162.47
1004.925	133.35
1005.284	174.61
1005.643	135.77
1006.003	138.2
1006.362	128.49
1006.721	128.49
1007.08	215.87
1007.438	123.64
1007.797	167.33
1008.156	135.77
1008.515	152.76
1008.874	177.04
1009.232	92.08
1009.591	104.22
1009.949	113.93
1010.308	138.2
1010.666	220.73
1011.024	220.73
1011.383	121.21
1011.741	150.34
1012.099	169.75
1012.457	123.64
1012.815	162.47
1013.173	157.62
1013.531	145.48
1013.889	123.64
1014.247	177.04
1014.605	184.32
1014.962	128.49
1015.32	72.66
1015.678	75.09
1016.035	130.92
1016.393	150.34
1016.75	133.35
1017.107	169.75
1017.465	155.19
1017.822	162.47
1018.179	211.02
1018.536	147.91
1018.894	172.18
1019.251	128.49
1019.608	213.44
1019.964	135.77
1020.321	152.76
1020.678	169.75
1021.035	157.62
1021.392	152.76
1021.748	157.62
1022.105	109.07
1022.461	135.77
1022.818	130.92
1023.174	99.36
1023.531	172.18
1023.887	157.62
1024.243	172.18
1024.599	191.6
1024.955	99.36
1025.311	147.91
1025.667	143.05
1026.023	118.78
1026.379	198.88
1026.735	228.01
1027.091	179.46
1027.447	177.04
