189.514	59.01
189.973	59.01
190.431	59.01
190.889	88.14
191.348	5.61
191.806	25.03
192.264	-18.66
192.722	-40.5
193.18	-47.79
193.638	-30.8
194.096	-47.79
194.554	-42.93
195.012	32.31
195.47	0.76
195.928	-13.8
196.385	-1.67
196.843	10.47
197.301	42.02
197.758	8.04
198.216	5.61
198.674	12.89
199.131	131.83
199.589	68.72
200.046	68.72
200.503	85.71
200.961	148.82
201.418	114.84
201.875	139.11
202.332	71.15
202.79	117.27
203.247	160.96
203.704	146.39
204.161	76
204.618	95.42
205.075	158.53
205.532	143.96
205.989	117.27
206.445	122.12
206.902	180.37
207.359	122.12
207.816	92.99
208.272	238.63
208.729	187.65
209.185	168.24
209.642	160.96
210.098	146.39
210.555	192.51
211.011	131.83
211.467	139.11
211.924	126.97
212.38	153.67
212.836	192.51
213.292	187.65
213.748	124.55
214.204	182.8
214.66	117.27
215.116	158.53
215.572	92.99
216.028	158.53
216.484	219.21
216.94	224.06
217.396	117.27
217.851	126.97
218.307	102.7
218.763	92.99
219.218	126.97
219.674	139.11
220.129	214.35
220.585	209.5
221.04	156.1
221.496	165.81
221.951	153.67
222.406	134.26
222.861	122.12
223.317	126.97
223.772	148.82
224.227	146.39
224.682	129.4
225.137	163.38
225.592	109.98
226.047	102.7
226.502	173.09
226.957	153.67
227.411	180.37
227.866	134.26
228.321	199.79
228.776	255.62
229.23	180.37
229.685	95.42
230.139	156.1
230.594	163.38
231.048	214.35
231.503	112.41
231.957	160.96
232.411	153.67
232.865	202.22
233.32	194.94
233.774	163.38
234.228	90.57
234.682	158.53
235.136	151.25
235.59	92.99
236.044	139.11
236.498	202.22
236.952	139.11
237.406	143.96
237.86	187.65
238.313	158.53
238.767	173.09
239.221	168.24
239.674	163.38
240.128	170.66
240.581	158.53
241.035	180.37
241.488	76
241.942	124.55
242.395	126.97
242.848	204.65
243.301	160.96
243.755	148.82
244.208	97.85
244.661	197.36
245.114	170.66
245.567	180.37
246.02	197.36
246.473	141.54
246.926	185.23
247.379	151.25
247.832	146.39
248.284	153.67
248.737	126.97
249.19	114.84
249.642	165.81
250.095	192.51
250.547	211.93
251	153.67
251.452	129.4
251.905	141.54
252.357	202.22
252.81	139.11
253.262	165.81
253.714	197.36
254.166	97.85
254.618	185.23
255.07	185.23
255.523	112.41
255.975	134.26
256.427	182.8
256.878	168.24
257.33	170.66
257.782	139.11
258.234	170.66
258.686	141.54
259.137	194.94
259.589	151.25
260.041	214.35
260.492	175.52
260.944	160.96
261.395	158.53
261.847	160.96
262.298	199.79
262.749	190.08
263.201	165.81
263.652	151.25
264.103	165.81
264.554	216.78
265.005	153.67
265.457	117.27
265.908	209.5
266.359	148.82
266.809	112.41
267.26	131.83
267.711	136.68
268.162	139.11
268.613	146.39
269.064	199.79
269.514	109.98
269.965	175.52
270.415	199.79
270.866	175.52
271.316	105.13
271.767	211.93
272.217	170.66
272.668	202.22
273.118	180.37
273.568	180.37
274.019	204.65
274.469	207.07
274.919	216.78
275.369	199.79
275.819	185.23
276.269	170.66
276.719	134.26
277.169	219.21
277.619	221.64
278.069	173.09
278.518	180.37
278.968	83.28
279.418	177.95
279.867	214.35
280.317	197.36
280.767	107.56
281.216	197.36
281.666	173.09
282.115	194.94
282.564	153.67
283.014	192.51
283.463	209.5
283.912	207.07
284.361	160.96
284.811	131.83
285.26	170.66
285.709	122.12
286.158	190.08
286.607	158.53
287.056	192.51
287.505	197.36
287.953	180.37
288.402	224.06
288.851	129.4
289.3	153.67
289.748	153.67
290.197	163.38
290.646	126.97
291.094	124.55
291.543	139.11
291.991	187.65
292.439	153.67
292.888	163.38
293.336	187.65
293.784	68.72
294.233	156.1
294.681	160.96
295.129	163.38
295.577	165.81
296.025	153.67
296.473	173.09
296.921	199.79
297.369	131.83
297.817	173.09
298.264	148.82
298.712	126.97
299.16	173.09
299.608	194.94
300.055	177.95
300.503	153.67
300.95	202.22
301.398	102.7
301.845	124.55
302.293	197.36
302.74	146.39
303.187	224.06
303.635	148.82
304.082	194.94
304.529	139.11
304.976	180.37
305.423	148.82
305.87	180.37
306.317	146.39
306.764	68.72
307.211	173.09
307.658	146.39
308.105	126.97
308.552	180.37
308.998	165.81
309.445	199.79
309.892	197.36
310.338	126.97
310.785	182.8
311.231	160.96
311.678	148.82
312.124	190.08
312.571	226.49
313.017	173.09
313.463	175.52
313.909	182.8
314.356	187.65
314.802	258.04
315.248	122.12
315.694	156.1
316.14	180.37
316.586	163.38
317.032	185.23
317.478	204.65
317.923	214.35
318.369	143.96
318.815	151.25
319.261	95.42
319.706	187.65
320.152	153.67
320.597	192.51
321.043	216.78
321.488	214.35
321.934	224.06
322.379	139.11
322.824	199.79
323.27	207.07
323.715	177.95
324.16	129.4
324.605	83.28
325.05	177.95
325.495	158.53
325.94	141.54
326.385	90.57
326.83	170.66
327.275	185.23
327.72	170.66
328.165	126.97
328.61	153.67
329.054	95.42
329.499	182.8
329.943	197.36
330.388	129.4
330.832	192.51
331.277	158.53
331.721	211.93
332.166	141.54
332.61	100.27
333.054	177.95
333.499	175.52
333.943	177.95
334.387	185.23
334.831	148.82
335.275	151.25
335.719	143.96
336.163	211.93
336.607	175.52
337.051	207.07
337.495	148.82
337.938	194.94
338.382	112.41
338.826	146.39
339.269	124.55
339.713	260.47
340.157	180.37
340.6	221.64
341.044	194.94
341.487	131.83
341.93	190.08
342.374	209.5
342.817	168.24
343.26	214.35
343.703	202.22
344.146	192.51
344.59	197.36
345.033	163.38
345.476	170.66
345.919	143.96
346.361	175.52
346.804	153.67
347.247	105.13
347.69	122.12
348.133	139.11
348.575	134.26
349.018	173.09
349.461	170.66
349.903	151.25
350.346	139.11
350.788	139.11
351.23	190.08
351.673	165.81
352.115	243.48
352.557	209.5
353	156.1
353.442	177.95
353.884	158.53
354.326	207.07
354.768	109.98
355.21	139.11
355.652	148.82
356.094	139.11
356.536	165.81
356.978	122.12
357.419	148.82
357.861	146.39
358.303	177.95
358.744	134.26
359.186	153.67
359.627	185.23
360.069	102.7
360.51	146.39
360.952	177.95
361.393	168.24
361.834	192.51
362.276	197.36
362.717	182.8
363.158	126.97
363.599	134.26
364.04	126.97
364.481	192.51
364.922	173.09
365.363	146.39
365.804	194.94
366.245	168.24
366.686	117.27
367.126	148.82
367.567	211.93
368.008	126.97
368.448	214.35
368.889	202.22
369.33	141.54
369.77	146.39
370.21	134.26
370.651	151.25
371.091	192.51
371.531	160.96
371.972	122.12
372.412	165.81
372.852	170.66
373.292	112.41
373.732	180.37
374.172	190.08
374.612	141.54
375.052	170.66
375.492	226.49
375.932	153.67
376.372	114.84
376.811	185.23
377.251	141.54
377.691	131.83
378.13	180.37
378.57	284.74
379.009	187.65
379.449	129.4
379.888	136.68
380.328	119.69
380.767	76
381.206	136.68
381.645	158.53
382.085	168.24
382.524	131.83
382.963	209.5
383.402	168.24
383.841	199.79
384.28	122.12
384.719	190.08
385.158	209.5
385.596	151.25
386.035	241.05
386.474	202.22
386.913	129.4
387.351	173.09
387.79	170.66
388.228	112.41
388.667	163.38
389.105	194.94
389.544	148.82
389.982	122.12
390.42	197.36
390.859	187.65
391.297	151.25
391.735	92.99
392.173	187.65
392.611	160.96
393.049	143.96
393.487	175.52
393.925	117.27
394.363	105.13
394.801	211.93
395.239	153.67
395.676	168.24
396.114	134.26
396.552	199.79
396.989	153.67
397.427	197.36
397.864	187.65
398.302	134.26
398.739	83.28
399.177	168.24
399.614	122.12
400.051	197.36
400.488	129.4
400.926	148.82
401.363	100.27
401.8	136.68
402.237	250.76
402.674	151.25
403.111	233.77
403.548	117.27
403.985	126.97
404.421	180.37
404.858	197.36
405.295	197.36
405.732	165.81
406.168	134.26
406.605	194.94
407.041	158.53
407.478	153.67
407.914	148.82
408.351	92.99
408.787	245.91
409.223	109.98
409.66	119.69
410.096	163.38
410.532	175.52
410.968	194.94
411.404	158.53
411.84	168.24
412.276	143.96
412.712	143.96
413.148	192.51
413.584	168.24
414.02	187.65
414.455	211.93
414.891	187.65
415.327	160.96
415.762	105.13
416.198	177.95
416.633	126.97
417.069	168.24
417.504	160.96
417.94	134.26
418.375	170.66
418.81	148.82
419.245	122.12
419.681	199.79
420.116	226.49
420.551	160.96
420.986	153.67
421.421	163.38
421.856	165.81
422.291	177.95
422.726	148.82
423.16	107.56
423.595	151.25
424.03	175.52
424.464	141.54
424.899	185.23
425.334	224.06
425.768	168.24
426.203	92.99
426.637	221.64
427.071	173.09
427.506	156.1
427.94	197.36
428.374	153.67
428.809	170.66
429.243	160.96
429.677	209.5
430.111	175.52
430.545	207.07
430.979	151.25
431.413	163.38
431.847	224.06
432.28	156.1
432.714	126.97
433.148	122.12
433.582	175.52
434.015	131.83
434.449	185.23
434.882	211.93
435.316	163.38
435.749	173.09
436.183	238.63
436.616	153.67
437.049	129.4
437.483	112.41
437.916	173.09
438.349	258.04
438.782	209.5
439.215	221.64
439.648	187.65
440.081	231.34
440.514	214.35
440.947	190.08
441.38	153.67
441.813	231.34
442.245	241.05
442.678	168.24
443.111	226.49
443.543	202.22
443.976	175.52
444.408	236.2
444.841	192.51
445.273	192.51
445.705	216.78
446.138	209.5
446.57	151.25
447.002	221.64
447.434	228.92
447.867	284.74
448.299	262.9
448.731	323.58
449.163	253.19
449.595	160.96
450.026	236.2
450.458	304.16
450.89	241.05
451.322	228.92
451.754	272.61
452.185	316.3
452.617	311.44
453.048	258.04
453.48	294.45
453.911	347.85
454.343	330.86
454.774	255.62
455.205	265.33
455.637	333.29
456.068	267.75
456.499	345.42
456.93	270.18
457.361	318.72
457.792	236.2
458.223	289.6
458.654	294.45
459.085	231.34
459.516	299.31
459.947	277.46
460.378	255.62
460.808	296.88
461.239	287.17
461.669	255.62
462.1	289.6
462.531	277.46
462.961	258.04
463.391	253.19
463.822	253.19
464.252	287.17
464.682	211.93
465.113	214.35
465.543	272.61
465.973	248.34
466.403	311.44
466.833	275.03
467.263	228.92
467.693	260.47
468.123	260.47
468.553	277.46
468.983	248.34
469.412	243.48
469.842	243.48
470.272	204.65
470.701	197.36
471.131	211.93
471.56	243.48
471.99	253.19
472.419	238.63
472.849	275.03
473.278	214.35
473.707	260.47
474.136	231.34
474.566	245.91
474.995	267.75
475.424	296.88
475.853	258.04
476.282	248.34
476.711	214.35
477.14	219.21
477.569	202.22
477.997	170.66
478.426	192.51
478.855	226.49
479.283	238.63
479.712	231.34
480.141	214.35
480.569	226.49
480.998	238.63
481.426	233.77
481.854	177.95
482.283	173.09
482.711	238.63
483.139	236.2
483.567	165.81
483.995	211.93
484.424	194.94
484.852	226.49
485.28	139.11
485.708	202.22
486.135	202.22
486.563	260.47
486.991	168.24
487.419	272.61
487.847	253.19
488.274	238.63
488.702	224.06
489.129	199.79
489.557	236.2
489.984	204.65
490.412	228.92
490.839	248.34
491.266	199.79
491.694	224.06
492.121	192.51
492.548	170.66
492.975	180.37
493.402	173.09
493.829	233.77
494.256	199.79
494.683	216.78
495.11	224.06
495.537	177.95
495.964	168.24
496.39	190.08
496.817	187.65
497.244	211.93
497.67	124.55
498.097	170.66
498.523	160.96
498.95	190.08
499.376	187.65
499.803	214.35
500.229	173.09
500.655	187.65
501.081	109.98
501.508	219.21
501.934	163.38
502.36	170.66
502.786	194.94
503.212	158.53
503.638	199.79
504.064	214.35
504.489	243.48
504.915	192.51
505.341	226.49
505.767	207.07
506.192	180.37
506.618	160.96
507.043	272.61
507.469	187.65
507.894	207.07
508.32	211.93
508.745	190.08
509.17	160.96
509.596	204.65
510.021	168.24
510.446	187.65
510.871	146.39
511.296	260.47
511.721	211.93
512.146	134.26
512.571	192.51
512.996	267.75
513.421	248.34
513.845	151.25
514.27	238.63
514.695	170.66
515.119	224.06
515.544	197.36
515.969	153.67
516.393	219.21
516.817	117.27
517.242	245.91
517.666	141.54
518.09	211.93
518.515	226.49
518.939	197.36
519.363	398.82
519.787	207.07
520.211	153.67
520.635	262.9
521.059	170.66
521.483	173.09
521.907	197.36
522.331	226.49
522.754	109.98
523.178	204.65
523.602	146.39
524.025	253.19
524.449	194.94
524.872	221.64
525.296	202.22
525.719	187.65
526.143	233.77
526.566	194.94
526.989	248.34
527.412	258.04
527.836	187.65
528.259	228.92
528.682	163.38
529.105	236.2
529.528	194.94
529.951	260.47
530.374	173.09
530.796	146.39
531.219	207.07
531.642	207.07
532.065	224.06
532.487	228.92
532.91	187.65
533.332	231.34
533.755	180.37
534.177	160.96
534.6	216.78
535.022	219.21
535.444	194.94
535.867	241.05
536.289	182.8
536.711	211.93
537.133	238.63
537.555	182.8
537.977	231.34
538.399	124.55
538.821	262.9
539.243	73.58
539.665	207.07
540.086	258.04
540.508	202.22
540.93	219.21
541.351	197.36
541.773	224.06
542.195	258.04
542.616	194.94
543.037	245.91
543.459	241.05
543.88	221.64
544.301	238.63
544.723	194.94
545.144	284.74
545.565	224.06
545.986	221.64
546.407	233.77
546.828	284.74
547.249	219.21
547.67	209.5
548.091	202.22
548.512	248.34
548.932	236.2
549.353	197.36
549.774	241.05
550.194	272.61
550.615	187.65
551.035	185.23
551.456	238.63
551.876	177.95
552.296	284.74
552.717	204.65
553.137	207.07
553.557	250.76
553.977	168.24
554.397	199.79
554.817	156.1
555.237	173.09
555.657	190.08
556.077	197.36
556.497	156.1
556.917	185.23
557.337	187.65
557.756	214.35
558.176	197.36
558.596	158.53
559.015	216.78
559.435	233.77
559.854	192.51
560.274	175.52
560.693	262.9
561.112	219.21
561.532	219.21
561.951	214.35
562.37	255.62
562.789	245.91
563.208	192.51
563.627	216.78
564.046	173.09
564.465	226.49
564.884	221.64
565.303	204.65
565.722	224.06
566.14	204.65
566.559	202.22
566.978	197.36
567.396	156.1
567.815	177.95
568.233	202.22
568.652	233.77
569.07	194.94
569.489	265.33
569.907	228.92
570.325	180.37
570.743	185.23
571.161	173.09
571.58	267.75
571.998	199.79
572.416	199.79
572.833	209.5
573.251	197.36
573.669	158.53
574.087	219.21
574.505	160.96
574.922	146.39
575.34	233.77
575.758	156.1
576.175	202.22
576.593	219.21
577.01	170.66
577.428	226.49
577.845	1648.84
578.262	275.03
578.68	255.62
579.097	270.18
579.514	163.38
579.931	209.5
580.348	248.34
580.765	185.23
581.182	216.78
581.599	250.76
582.016	199.79
582.433	211.93
582.849	182.8
583.266	265.33
583.683	194.94
584.099	204.65
584.516	197.36
584.933	211.93
585.349	245.91
585.765	202.22
586.182	194.94
586.598	253.19
587.014	146.39
587.431	180.37
587.847	243.48
588.263	226.49
588.679	192.51
589.095	187.65
589.511	194.94
589.927	221.64
590.343	136.68
590.759	194.94
591.174	255.62
591.59	221.64
592.006	180.37
592.421	153.67
592.837	187.65
593.252	158.53
593.668	224.06
594.083	255.62
594.499	146.39
594.914	185.23
595.329	219.21
595.745	194.94
596.16	233.77
596.575	241.05
596.99	197.36
597.405	180.37
597.82	175.52
598.235	214.35
598.65	272.61
599.065	190.08
599.479	175.52
599.894	151.25
600.309	153.67
600.724	226.49
601.138	207.07
601.553	160.96
601.967	182.8
602.382	245.91
602.796	219.21
603.21	209.5
603.625	199.79
604.039	151.25
604.453	129.4
604.867	233.77
605.281	216.78
605.695	207.07
606.109	236.2
606.523	199.79
606.937	158.53
607.351	335.72
607.765	185.23
608.178	197.36
608.592	192.51
609.006	192.51
609.419	202.22
609.833	202.22
610.246	214.35
610.66	214.35
611.073	214.35
611.487	209.5
611.9	197.36
612.313	185.23
612.726	233.77
613.139	207.07
613.553	241.05
613.966	194.94
614.379	194.94
614.792	209.5
615.204	207.07
615.617	253.19
616.03	158.53
616.443	185.23
616.856	216.78
617.268	228.92
617.681	216.78
618.093	139.11
618.506	192.51
618.918	214.35
619.331	95.42
619.743	180.37
620.155	221.64
620.568	199.79
620.98	241.05
621.392	187.65
621.804	214.35
622.216	228.92
622.628	228.92
623.04	180.37
623.452	211.93
623.864	199.79
624.276	265.33
624.687	177.95
625.099	153.67
625.511	109.98
625.922	199.79
626.334	197.36
626.745	185.23
627.157	109.98
627.568	160.96
627.979	175.52
628.391	207.07
628.802	204.65
629.213	148.82
629.624	182.8
630.035	214.35
630.446	122.12
630.857	219.21
631.268	199.79
631.679	143.96
632.09	160.96
632.501	211.93
632.912	243.48
633.322	207.07
633.733	175.52
634.144	182.8
634.554	141.54
634.965	163.38
635.375	56.58
635.785	192.51
636.196	197.36
636.606	194.94
637.016	192.51
637.427	175.52
637.837	168.24
638.247	194.94
638.657	187.65
639.067	182.8
639.477	197.36
639.887	197.36
640.297	143.96
640.706	165.81
641.116	197.36
641.526	163.38
641.935	170.66
642.345	141.54
642.755	180.37
643.164	139.11
643.573	173.09
643.983	182.8
644.392	177.95
644.801	211.93
645.211	134.26
645.62	170.66
646.029	248.34
646.438	141.54
646.847	209.5
647.256	160.96
647.665	129.4
648.074	221.64
648.483	160.96
648.892	190.08
649.3	199.79
649.709	177.95
650.118	163.38
650.526	165.81
650.935	197.36
651.343	148.82
651.752	207.07
652.16	156.1
652.568	85.71
652.977	168.24
653.385	177.95
653.793	177.95
654.201	204.65
654.609	139.11
655.017	148.82
655.425	187.65
655.833	224.06
656.241	151.25
656.649	109.98
657.057	207.07
657.464	170.66
657.872	134.26
658.28	207.07
658.687	182.8
659.095	153.67
659.502	158.53
659.91	180.37
660.317	185.23
660.724	126.97
661.132	173.09
661.539	146.39
661.946	73.58
662.353	148.82
662.76	180.37
663.167	102.7
663.574	173.09
663.981	168.24
664.388	185.23
664.795	214.35
665.202	216.78
665.608	165.81
666.015	141.54
666.422	199.79
666.828	236.2
667.235	262.9
667.641	187.65
668.047	141.54
668.454	185.23
668.86	209.5
669.266	216.78
669.673	131.83
670.079	250.76
670.485	160.96
670.891	163.38
671.297	156.1
671.703	202.22
672.109	187.65
672.515	209.5
672.92	109.98
673.326	197.36
673.732	192.51
674.138	177.95
674.543	219.21
674.949	187.65
675.354	131.83
675.76	122.12
676.165	163.38
676.57	158.53
676.976	197.36
677.381	165.81
677.786	182.8
678.191	238.63
678.596	165.81
679.001	114.84
679.406	165.81
679.811	211.93
680.216	160.96
680.621	170.66
681.026	153.67
681.43	204.65
681.835	180.37
682.24	199.79
682.644	168.24
683.049	187.65
683.453	119.69
683.858	136.68
684.262	141.54
684.667	163.38
685.071	216.78
685.475	136.68
685.879	151.25
686.283	185.23
686.687	258.04
687.091	156.1
687.495	175.52
687.899	190.08
688.303	224.06
688.707	194.94
689.111	197.36
689.514	136.68
689.918	173.09
690.322	158.53
690.725	160.96
691.129	146.39
691.532	190.08
691.936	160.96
692.339	158.53
692.742	153.67
693.146	114.84
693.549	236.2
693.952	192.51
694.355	175.52
694.758	139.11
695.161	134.26
695.564	197.36
695.967	156.1
696.37	197.36
696.773	224.06
697.175	187.65
697.578	202.22
697.981	182.8
698.383	214.35
698.786	284.74
699.188	241.05
699.591	204.65
699.993	153.67
700.395	170.66
700.798	219.21
701.2	165.81
701.602	241.05
702.004	160.96
702.406	233.77
702.808	131.83
703.21	199.79
703.612	221.64
704.014	134.26
704.416	211.93
704.818	221.64
705.219	241.05
705.621	199.79
706.023	277.46
706.424	187.65
706.826	228.92
707.227	267.75
707.629	250.76
708.03	192.51
708.431	282.32
708.832	309.02
709.234	260.47
709.635	333.29
710.036	306.59
710.437	253.19
710.838	287.17
711.239	311.44
711.64	277.46
712.041	219.21
712.441	270.18
712.842	294.45
713.243	292.03
713.643	287.17
714.044	216.78
714.445	279.89
714.845	279.89
715.246	304.16
715.646	267.75
716.046	384.26
716.447	321.15
716.847	321.15
717.247	272.61
717.647	304.16
718.047	296.88
718.447	335.72
718.847	418.24
719.247	323.58
719.647	381.83
720.047	430.38
720.446	296.88
720.846	326.01
721.246	406.1
721.645	427.95
722.045	449.79
722.444	389.11
722.844	410.96
723.243	437.66
723.643	430.38
724.042	440.09
724.441	432.8
724.84	442.51
725.24	452.22
725.639	430.38
726.038	534.75
726.437	447.37
726.836	510.48
727.234	512.9
727.633	510.48
728.032	495.91
728.431	578.44
728.83	549.31
729.228	539.6
729.627	561.45
730.025	668.24
730.424	634.26
730.822	762.91
731.22	753.2
731.619	702.23
732.017	884.27
732.415	995.92
732.813	954.66
733.212	1037.18
733.61	1083.3
734.008	1119.71
734.406	1143.98
734.803	1190.1
735.201	1333.3
735.599	1389.13
735.997	1442.53
736.395	1498.35
736.792	1653.7
737.19	1864.87
737.587	1862.44
737.985	1961.95
738.382	1988.65
738.78	2059.04
739.177	2190.11
739.574	2474.1
739.971	2488.66
740.369	2597.89
740.766	2738.67
741.163	2823.62
741.56	2925.56
741.957	2998.38
742.354	3185.27
742.751	3364.89
743.147	3391.59
743.544	3466.83
743.941	3758.1
744.338	3954.7
744.734	4228.98
745.131	4148.88
745.527	4539.66
745.924	4796.95
746.32	4857.63
746.716	5187.73
747.113	5471.72
747.509	5789.68
747.905	5877.06
748.301	6513
748.697	6493.58
749.093	6937.76
749.489	7122.23
749.885	7362.52
750.281	7792.14
750.677	7877.09
751.073	8343.12
751.468	8719.34
751.864	8983.91
752.26	9219.35
752.655	9726.64
753.051	9998.49
753.446	10469.37
753.842	10748.5
754.237	11061.61
754.632	11491.23
755.028	11792.2
755.423	11806.77
755.818	11794.63
756.213	12746.1
756.608	12539.79
757.003	12801.93
757.398	12991.25
757.793	13090.77
758.188	13231.55
758.583	13767.96
758.977	14095.64
759.372	14467
759.767	15234.01
760.161	15998.58
760.556	17175.78
760.95	17010.73
761.345	17930.65
761.739	18804.45
762.133	19175.81
762.527	19814.17
762.922	20323.89
763.316	21103.03
763.71	21532.65
764.104	22018.09
764.498	22690.43
764.892	22816.65
765.286	23287.53
765.68	24217.15
766.073	25161.34
766.467	24493.86
766.861	25556.98
767.255	26840.98
767.648	27455.07
768.042	26627.39
768.435	27857.99
768.829	28527.9
769.222	28311.88
769.615	29071.6
770.008	29263.35
770.402	29290.05
770.795	29066.74
771.188	30125.01
771.581	30746.38
771.974	29811.9
772.367	29680.83
772.76	30416.28
773.153	29675.98
773.545	29481.8
773.938	30739.1
774.331	30952.7
774.724	30637.16
775.116	32430.87
775.509	33744
775.901	33816.82
776.294	34552.27
776.686	35549.86
777.078	37066.87
777.471	37168.81
777.863	38190.67
778.255	40054.78
778.647	40610.61
779.039	39880.02
779.431	39620.31
779.823	40608.19
780.215	40346.05
780.607	39739.24
780.999	41518.39
781.39	42113.06
781.782	41768.4
782.174	41729.56
782.565	43251.43
782.957	42843.66
783.348	42688.32
783.74	43693.19
784.131	43117.93
784.522	42979.58
784.914	41916.46
785.305	42894.63
785.696	42819.39
786.087	41741.7
786.478	40746.54
786.869	40928.58
787.26	40411.58
787.651	38729.52
788.042	37962.51
788.433	37865.43
788.823	36413.95
789.214	35663.93
789.605	35047.42
789.995	35066.84
790.386	33933.33
790.776	33401.76
791.167	33858.08
791.557	34634.79
791.948	33678.47
792.338	35042.57
792.728	36930.94
793.118	36387.25
793.508	35496.46
793.898	36261.03
794.288	36996.48
794.678	35962.48
795.068	35598.4
795.458	36309.58
795.848	36700.36
796.238	36261.03
796.627	34906.64
797.017	35731.9
797.406	35787.72
797.796	34831.4
798.185	35268.3
798.575	36486.76
798.964	35370.24
799.354	35314.41
799.743	34654.21
800.132	36523.17
800.521	36202.78
800.91	35394.51
801.299	34503.72
801.688	36008.6
802.077	35098.39
802.466	34520.71
802.855	34659.06
803.244	33401.76
803.633	33210.01
804.021	31773.1
804.41	32185.73
804.799	32010.97
805.187	30552.2
805.576	29149.27
805.964	29510.93
806.352	28624.99
806.741	28404.11
807.129	26862.83
807.517	27374.97
807.905	28540.04
808.293	27052.15
808.681	27304.58
809.069	27763.33
809.457	28760.91
809.845	28260.91
810.233	27993.91
810.621	28705.09
811.009	29151.7
811.396	28324.01
811.784	28389.55
812.171	28391.98
812.559	28867.71
812.946	26850.69
813.334	26484.18
813.721	26637.1
814.108	26401.65
814.496	25309.4
814.883	24416.19
815.27	26069.13
815.657	26304.57
816.044	25370.09
816.431	24991.44
816.818	25166.2
817.205	25217.17
817.592	24328.81
817.979	23226.85
818.365	23537.53
818.752	23275.39
819.139	22190.42
819.525	21593.33
819.912	21731.68
820.298	21624.88
820.685	20192.82
821.071	18945.23
821.457	19234.07
821.843	19151.54
822.23	18173.37
822.616	17294.72
823.002	16865.1
823.388	16797.14
823.774	15544.69
824.16	14566.52
824.546	14857.79
824.931	14998.56
825.317	14241.27
825.703	13666.02
826.089	13765.54
826.474	14115.06
826.86	13202.42
827.245	12809.21
827.631	12835.91
828.016	13122.32
828.401	12649.01
828.787	12115.02
829.172	11915.99
829.557	12153.86
829.942	11913.57
830.327	10826.17
830.712	10964.52
831.097	10811.61
831.482	10991.22
831.867	10301.89
832.252	9709.65
832.636	10100.43
833.021	10071.3
833.406	9665.96
833.79	9136.82
834.175	9097.99
834.559	9161.1
834.944	8670.8
835.328	8420.79
835.713	8078.55
836.097	8168.36
836.481	7889.23
836.865	7267.86
837.249	7119.8
837.633	7170.77
838.017	7255.73
838.401	6544.55
838.785	6246
839.169	6229.01
839.553	6323.67
839.937	5799.39
840.32	5316.38
840.704	5117.34
841.087	5180.45
841.471	4789.67
841.854	4593.06
842.238	4510.54
842.621	4476.56
843.004	4447.43
843.388	4272.67
843.771	3993.54
844.154	3957.13
844.537	4289.66
844.92	3988.68
845.303	3745.96
845.686	3724.12
846.069	3777.52
846.452	3709.55
846.834	3593.05
847.217	3447.41
847.6	3476.54
847.982	3457.12
848.365	3343.04
848.748	3107.6
849.13	3083.33
849.512	3073.62
849.895	2998.38
850.277	2784.78
850.659	2619.73
851.041	2794.49
851.423	2828.47
851.806	2600.31
852.188	2549.34
852.57	2597.89
852.951	2622.16
853.333	2561.48
853.715	2508.08
854.097	2386.72
854.479	2309.05
854.86	2233.8
855.242	2102.73
855.623	1954.67
856.005	1830.88
856.386	2017.78
856.768	1893.99
857.149	1697.39
857.53	1653.7
857.911	1622.14
858.292	1765.35
858.674	1498.35
859.055	1423.11
859.436	1321.17
859.817	1313.89
860.197	1279.9
860.578	1265.34
860.959	1175.53
861.34	1338.16
861.72	1287.19
862.101	1253.21
862.482	991.07
862.862	976.5
863.243	1146.41
863.623	1039.61
864.003	971.65
864.384	949.8
864.764	991.07
865.144	940.09
865.524	809.02
865.904	828.44
866.284	830.87
866.664	821.16
867.044	816.31
867.424	743.49
867.804	690.09
868.183	753.2
868.563	724.07
868.943	670.67
869.322	680.38
869.702	682.81
870.081	588.15
870.461	673.1
870.84	578.44
871.22	537.17
871.599	643.97
871.978	617.27
872.357	520.18
872.736	534.75
873.115	415.81
873.494	461.93
873.873	510.48
874.252	430.38
874.631	491.06
875.01	369.7
875.388	442.51
875.767	347.85
876.146	359.99
876.524	381.83
876.903	340.57
877.281	326.01
877.66	372.12
878.038	299.31
878.416	289.6
878.794	340.57
879.173	311.44
879.551	352.71
879.929	340.57
880.307	296.88
880.685	357.56
881.063	248.34
881.441	309.02
881.818	248.34
882.196	289.6
882.574	316.3
882.951	253.19
883.329	272.61
883.707	192.51
884.084	224.06
884.461	221.64
884.839	243.48
885.216	255.62
885.593	207.07
885.971	231.34
886.348	250.76
886.725	243.48
887.102	231.34
887.479	277.46
887.856	233.77
888.233	258.04
888.609	211.93
888.986	209.5
889.363	216.78
889.74	243.48
890.116	199.79
890.493	226.49
890.869	192.51
891.246	194.94
891.622	255.62
891.998	270.18
892.375	226.49
892.751	192.51
893.127	219.21
893.503	153.67
893.879	156.1
894.255	187.65
894.631	158.53
895.007	143.96
895.383	173.09
895.759	156.1
896.134	175.52
896.51	175.52
896.886	202.22
897.261	163.38
897.637	187.65
898.012	90.57
898.388	114.84
898.763	199.79
899.138	231.34
899.514	158.53
899.889	245.91
900.264	190.08
900.639	173.09
901.014	173.09
901.389	182.8
901.764	141.54
902.139	143.96
902.513	117.27
902.888	165.81
903.263	190.08
903.638	119.69
904.012	119.69
904.387	146.39
904.761	107.56
905.136	173.09
905.51	214.35
905.884	160.96
906.259	151.25
906.633	170.66
907.007	158.53
907.381	197.36
907.755	173.09
908.129	85.71
908.503	153.67
908.877	153.67
909.251	194.94
909.624	168.24
909.998	173.09
910.372	219.21
910.745	112.41
911.119	209.5
911.492	202.22
911.866	177.95
912.239	71.15
912.612	146.39
912.986	165.81
913.359	207.07
913.732	78.43
914.105	180.37
914.478	109.98
914.851	83.28
915.224	112.41
915.597	160.96
915.97	160.96
916.343	190.08
916.715	100.27
917.088	102.7
917.461	173.09
917.833	236.2
918.206	146.39
918.578	163.38
918.951	129.4
919.323	146.39
919.695	126.97
920.067	153.67
920.44	97.85
920.812	107.56
921.184	173.09
921.556	187.65
921.928	160.96
922.3	158.53
922.672	112.41
923.043	170.66
923.415	139.11
923.787	177.95
924.158	187.65
924.53	100.27
924.901	194.94
925.273	158.53
925.644	107.56
926.016	156.1
926.387	173.09
926.758	129.4
927.129	151.25
927.5	173.09
927.872	168.24
928.243	207.07
928.613	143.96
928.984	165.81
929.355	105.13
929.726	131.83
930.097	190.08
930.467	141.54
930.838	153.67
931.209	112.41
931.579	156.1
931.95	129.4
932.32	109.98
932.69	170.66
933.061	194.94
933.431	163.38
933.801	177.95
934.171	146.39
934.541	156.1
934.911	119.69
935.281	129.4
935.651	173.09
936.021	202.22
936.391	143.96
936.761	148.82
937.13	134.26
937.5	143.96
937.87	187.65
938.239	175.52
938.609	134.26
938.978	141.54
939.347	173.09
939.717	163.38
940.086	207.07
940.455	250.76
940.824	160.96
941.193	163.38
941.562	204.65
941.931	124.55
942.3	202.22
942.669	124.55
943.038	90.57
943.407	129.4
943.775	136.68
944.144	175.52
944.513	90.57
944.881	102.7
945.25	199.79
945.618	136.68
945.986	143.96
946.355	168.24
946.723	141.54
947.091	109.98
947.459	165.81
947.827	163.38
948.195	148.82
948.563	146.39
948.931	148.82
949.299	141.54
949.667	112.41
950.035	134.26
950.402	105.13
950.77	185.23
951.138	187.65
951.505	148.82
951.873	156.1
952.24	192.51
952.607	160.96
952.975	165.81
953.342	165.81
953.709	187.65
954.076	192.51
954.443	185.23
954.81	211.93
955.177	182.8
955.544	136.68
955.911	197.36
956.278	117.27
956.645	146.39
957.012	187.65
957.378	129.4
957.745	129.4
958.111	153.67
958.478	245.91
958.844	209.5
959.211	114.84
959.577	192.51
959.943	165.81
960.309	185.23
960.675	260.47
961.042	158.53
961.408	153.67
961.774	117.27
962.139	197.36
962.505	175.52
962.871	170.66
963.237	194.94
963.603	187.65
963.968	112.41
964.334	136.68
964.699	165.81
965.065	177.95
965.43	187.65
965.796	204.65
966.161	153.67
966.526	209.5
966.891	182.8
967.256	122.12
967.622	114.84
967.987	163.38
968.352	163.38
968.716	187.65
969.081	90.57
969.446	109.98
969.811	182.8
970.176	146.39
970.54	209.5
970.905	202.22
971.269	175.52
971.634	175.52
971.998	119.69
972.363	199.79
972.727	158.53
973.091	158.53
973.455	163.38
973.819	139.11
974.183	180.37
974.547	151.25
974.911	107.56
975.275	192.51
975.639	209.5
976.003	219.21
976.367	194.94
976.73	143.96
977.094	136.68
977.458	177.95
977.821	194.94
978.185	148.82
978.548	209.5
978.911	119.69
979.275	160.96
979.638	129.4
980.001	146.39
980.364	158.53
980.727	170.66
981.09	117.27
981.453	180.37
981.816	182.8
982.179	211.93
982.542	105.13
982.905	119.69
983.267	131.83
983.63	131.83
983.992	156.1
984.355	156.1
984.717	109.98
985.08	151.25
985.442	192.51
985.804	114.84
986.167	182.8
986.529	136.68
986.891	165.81
987.253	209.5
987.615	170.66
987.977	126.97
988.339	112.41
988.701	151.25
989.062	175.52
989.424	287.17
989.786	194.94
990.147	117.27
990.509	194.94
990.87	190.08
991.232	148.82
991.593	170.66
991.955	90.57
992.316	146.39
992.677	141.54
993.038	139.11
993.399	148.82
993.76	117.27
994.121	146.39
994.482	134.26
994.843	216.78
995.204	117.27
995.565	131.83
995.926	97.85
996.286	204.65
996.647	143.96
997.007	192.51
997.368	199.79
997.728	175.52
998.089	160.96
998.449	109.98
998.809	146.39
999.169	221.64
999.53	190.08
999.89	177.95
1000.25	199.79
1000.61	233.77
1000.97	185.23
1001.329	119.69
1001.689	173.09
1002.049	143.96
1002.409	158.53
1002.768	187.65
1003.128	216.78
1003.487	165.81
1003.847	117.27
1004.206	199.79
1004.566	163.38
1004.925	180.37
1005.284	139.11
1005.643	170.66
1006.003	190.08
1006.362	219.21
1006.721	207.07
1007.08	148.82
1007.438	143.96
1007.797	136.68
1008.156	156.1
1008.515	112.41
1008.874	139.11
1009.232	163.38
1009.591	163.38
1009.949	141.54
1010.308	211.93
1010.666	185.23
1011.024	126.97
1011.383	153.67
1011.741	187.65
1012.099	102.7
1012.457	153.67
1012.815	112.41
1013.173	97.85
1013.531	131.83
1013.889	126.97
1014.247	194.94
1014.605	146.39
1014.962	192.51
1015.32	173.09
1015.678	177.95
1016.035	51.73
1016.393	95.42
1016.75	117.27
1017.107	151.25
1017.465	126.97
1017.822	199.79
1018.179	233.77
1018.536	163.38
1018.894	163.38
1019.251	124.55
1019.608	236.2
1019.964	168.24
1020.321	158.53
1020.678	158.53
1021.035	180.37
1021.392	102.7
1021.748	105.13
1022.105	156.1
1022.461	117.27
1022.818	131.83
1023.174	136.68
1023.531	136.68
1023.887	173.09
1024.243	168.24
1024.599	185.23
1024.955	160.96
1025.311	153.67
1025.667	126.97
1026.023	153.67
1026.379	117.27
1026.735	170.66
1027.091	131.83
1027.447	168.24
