189.514	111.35
189.973	111.35
190.431	111.35
190.889	-0.3
191.348	77.37
191.806	9.41
192.264	4.55
192.722	-73.12
193.18	-63.41
193.638	-53.7
194.096	-0.3
194.554	2.12
195.012	33.68
195.47	-5.16
195.928	16.69
196.385	-46.42
196.843	40.96
197.301	45.81
197.758	21.54
198.216	-2.73
198.674	9.41
199.131	70.09
199.589	108.92
200.046	33.68
200.503	99.21
200.961	70.09
201.418	179.31
201.875	123.48
202.332	101.64
202.79	142.9
203.247	116.2
203.704	142.9
204.161	118.63
204.618	147.76
205.075	116.2
205.532	167.17
205.989	155.04
206.445	140.48
206.902	157.47
207.359	135.62
207.816	191.45
208.272	215.72
208.729	145.33
209.185	135.62
209.642	218.15
210.098	169.6
210.555	176.88
211.011	169.6
211.467	176.88
211.924	184.17
212.38	167.17
212.836	189.02
213.292	169.6
213.748	130.77
214.204	189.02
214.66	101.64
215.116	184.17
215.572	125.91
216.028	191.45
216.484	174.46
216.94	227.86
217.396	218.15
217.851	150.18
218.307	142.9
218.763	220.57
219.218	232.71
219.674	184.17
220.129	99.21
220.585	172.03
221.04	135.62
221.496	227.86
221.951	125.91
222.406	138.05
222.861	210.86
223.317	152.61
223.772	152.61
224.227	201.16
224.682	138.05
225.137	125.91
225.592	244.85
226.047	89.5
226.502	159.89
226.957	176.88
227.411	181.74
227.866	198.73
228.321	150.18
228.776	191.45
229.23	198.73
229.685	167.17
230.139	223
230.594	138.05
231.048	125.91
231.503	118.63
231.957	203.58
232.411	133.19
232.865	176.88
233.32	189.02
233.774	179.31
234.228	121.06
234.682	174.46
235.136	157.47
235.59	179.31
236.044	172.03
236.498	213.29
236.952	176.88
237.406	145.33
237.86	176.88
238.313	87.08
238.767	210.86
239.221	193.87
239.674	152.61
240.128	113.78
240.581	142.9
241.035	140.48
241.488	147.76
241.942	176.88
242.395	201.16
242.848	159.89
243.301	213.29
243.755	237.56
244.208	218.15
244.661	130.77
245.114	116.2
245.567	162.32
246.02	201.16
246.473	142.9
246.926	145.33
247.379	198.73
247.832	106.49
248.284	147.76
248.737	150.18
249.19	155.04
249.642	227.86
250.095	99.21
250.547	179.31
251	169.6
251.452	113.78
251.905	164.75
252.357	121.06
252.81	239.99
253.262	128.34
253.714	189.02
254.166	223
254.618	176.88
255.07	138.05
255.523	172.03
255.975	162.32
256.427	206.01
256.878	184.17
257.33	201.16
257.782	150.18
258.234	176.88
258.686	230.28
259.137	176.88
259.589	191.45
260.041	130.77
260.492	150.18
260.944	232.71
261.395	201.16
261.847	196.3
262.298	244.85
262.749	157.47
263.201	155.04
263.652	213.29
264.103	128.34
264.554	142.9
265.005	181.74
265.457	113.78
265.908	133.19
266.359	225.43
266.809	157.47
267.26	179.31
267.711	164.75
268.162	142.9
268.613	118.63
269.064	232.71
269.514	225.43
269.965	113.78
270.415	152.61
270.866	176.88
271.316	130.77
271.767	150.18
272.217	225.43
272.668	181.74
273.118	232.71
273.568	104.07
274.019	208.44
274.469	118.63
274.919	208.44
275.369	162.32
275.819	186.59
276.269	249.7
276.719	227.86
277.169	169.6
277.619	128.34
278.069	140.48
278.518	116.2
278.968	157.47
279.418	186.59
279.867	227.86
280.317	174.46
280.767	108.92
281.216	116.2
281.666	164.75
282.115	147.76
282.564	169.6
283.014	145.33
283.463	118.63
283.912	208.44
284.361	189.02
284.811	174.46
285.26	191.45
285.709	125.91
286.158	186.59
286.607	123.48
287.056	193.87
287.505	152.61
287.953	203.58
288.402	176.88
288.851	174.46
289.3	196.3
289.748	230.28
290.197	193.87
290.646	203.58
291.094	150.18
291.543	206.01
291.991	206.01
292.439	118.63
292.888	155.04
293.336	218.15
293.784	198.73
294.233	96.79
294.681	184.17
295.129	135.62
295.577	116.2
296.025	196.3
296.473	184.17
296.921	198.73
297.369	145.33
297.817	142.9
298.264	172.03
298.712	140.48
299.16	223
299.608	176.88
300.055	135.62
300.503	113.78
300.95	135.62
301.398	189.02
301.845	239.99
302.293	213.29
302.74	147.76
303.187	116.2
303.635	133.19
304.082	123.48
304.529	123.48
304.976	208.44
305.423	179.31
305.87	91.93
306.317	140.48
306.764	206.01
307.211	186.59
307.658	227.86
308.105	101.64
308.552	135.62
308.998	201.16
309.445	213.29
309.892	169.6
310.338	179.31
310.785	213.29
311.231	174.46
311.678	237.56
312.124	176.88
312.571	152.61
313.017	62.8
313.463	130.77
313.909	164.75
314.356	155.04
314.802	108.92
315.248	138.05
315.694	99.21
316.14	210.86
316.586	196.3
317.032	108.92
317.478	203.58
317.923	152.61
318.369	125.91
318.815	210.86
319.261	186.59
319.706	172.03
320.152	189.02
320.597	147.76
321.043	130.77
321.488	237.56
321.934	215.72
322.379	176.88
322.824	220.57
323.27	213.29
323.715	138.05
324.16	147.76
324.605	140.48
325.05	128.34
325.495	176.88
325.94	138.05
326.385	121.06
326.83	152.61
327.275	159.89
327.72	174.46
328.165	169.6
328.61	172.03
329.054	201.16
329.499	186.59
329.943	150.18
330.388	150.18
330.832	193.87
331.277	164.75
331.721	172.03
332.166	213.29
332.61	128.34
333.054	147.76
333.499	157.47
333.943	189.02
334.387	150.18
334.831	142.9
335.275	142.9
335.719	189.02
336.163	125.91
336.607	184.17
337.051	181.74
337.495	142.9
337.938	145.33
338.382	189.02
338.826	184.17
339.269	196.3
339.713	133.19
340.157	145.33
340.6	225.43
341.044	169.6
341.487	186.59
341.93	235.14
342.374	191.45
342.817	184.17
343.26	116.2
343.703	203.58
344.146	164.75
344.59	140.48
345.033	176.88
345.476	167.17
345.919	140.48
346.361	125.91
346.804	213.29
347.247	101.64
347.69	215.72
348.133	135.62
348.575	116.2
349.018	145.33
349.461	181.74
349.903	152.61
350.346	164.75
350.788	237.56
351.23	167.17
351.673	125.91
352.115	208.44
352.557	159.89
353	164.75
353.442	164.75
353.884	162.32
354.326	118.63
354.768	169.6
355.21	99.21
355.652	196.3
356.094	99.21
356.536	198.73
356.978	172.03
357.419	169.6
357.861	172.03
358.303	186.59
358.744	130.77
359.186	123.48
359.627	145.33
360.069	155.04
360.51	142.9
360.952	150.18
361.393	106.49
361.834	108.92
362.276	157.47
362.717	155.04
363.158	174.46
363.599	118.63
364.04	213.29
364.481	186.59
364.922	223
365.363	145.33
365.804	106.49
366.245	135.62
366.686	147.76
367.126	142.9
367.567	230.28
368.008	167.17
368.448	99.21
368.889	123.48
369.33	157.47
369.77	130.77
370.21	210.86
370.651	239.99
371.091	208.44
371.531	220.57
371.972	189.02
372.412	147.76
372.852	130.77
373.292	121.06
373.732	145.33
374.172	147.76
374.612	174.46
375.052	167.17
375.492	138.05
375.932	145.33
376.372	125.91
376.811	159.89
377.251	220.57
377.691	121.06
378.13	162.32
378.57	230.28
379.009	203.58
379.449	184.17
379.888	118.63
380.328	150.18
380.767	142.9
381.206	191.45
381.645	184.17
382.085	174.46
382.524	193.87
382.963	201.16
383.402	108.92
383.841	130.77
384.28	215.72
384.719	138.05
385.158	181.74
385.596	167.17
386.035	172.03
386.474	155.04
386.913	223
387.351	172.03
387.79	186.59
388.228	135.62
388.667	201.16
389.105	210.86
389.544	184.17
389.982	169.6
390.42	138.05
390.859	208.44
391.297	138.05
391.735	91.93
392.173	67.66
392.611	181.74
393.049	203.58
393.487	159.89
393.925	198.73
394.363	167.17
394.801	140.48
395.239	145.33
395.676	155.04
396.114	130.77
396.552	96.79
396.989	128.34
397.427	242.42
397.864	176.88
398.302	164.75
398.739	186.59
399.177	135.62
399.614	172.03
400.051	138.05
400.488	176.88
400.926	172.03
401.363	159.89
401.8	169.6
402.237	193.87
402.674	145.33
403.111	196.3
403.548	147.76
403.985	150.18
404.421	201.16
404.858	196.3
405.295	189.02
405.732	189.02
406.168	140.48
406.605	157.47
407.041	152.61
407.478	84.65
407.914	130.77
408.351	167.17
408.787	108.92
409.223	99.21
409.66	167.17
410.096	167.17
410.532	176.88
410.968	138.05
411.404	159.89
411.84	167.17
412.276	184.17
412.712	186.59
413.148	196.3
413.584	159.89
414.02	186.59
414.455	172.03
414.891	142.9
415.327	150.18
415.762	201.16
416.198	184.17
416.633	191.45
417.069	201.16
417.504	111.35
417.94	164.75
418.375	198.73
418.81	218.15
419.245	152.61
419.681	186.59
420.116	94.36
420.551	201.16
420.986	145.33
421.421	162.32
421.856	174.46
422.291	164.75
422.726	189.02
423.16	189.02
423.595	193.87
424.03	213.29
424.464	169.6
424.899	193.87
425.334	157.47
425.768	167.17
426.203	138.05
426.637	162.32
427.071	184.17
427.506	128.34
427.94	223
428.374	181.74
428.809	169.6
429.243	147.76
429.677	152.61
430.111	159.89
430.545	116.2
430.979	106.49
431.413	203.58
431.847	135.62
432.28	99.21
432.714	113.78
433.148	140.48
433.582	196.3
434.015	213.29
434.449	152.61
434.882	169.6
435.316	130.77
435.749	155.04
436.183	196.3
436.616	176.88
437.049	157.47
437.483	113.78
437.916	176.88
438.349	256.98
438.782	150.18
439.215	142.9
439.648	206.01
440.081	206.01
440.514	179.31
440.947	186.59
441.38	169.6
441.813	184.17
442.245	196.3
442.678	230.28
443.111	157.47
443.543	203.58
443.976	155.04
444.408	208.44
444.841	198.73
445.273	278.83
445.705	220.57
446.138	128.34
446.57	227.86
447.002	145.33
447.434	206.01
447.867	169.6
448.299	198.73
448.731	196.3
449.163	198.73
449.595	193.87
450.026	157.47
450.458	191.45
450.89	218.15
451.322	164.75
451.754	210.86
452.185	254.55
452.617	210.86
453.048	295.82
453.48	152.61
453.911	225.43
454.343	237.56
454.774	208.44
455.205	213.29
455.637	249.7
456.068	159.89
456.499	220.57
456.93	230.28
457.361	218.15
457.792	213.29
458.223	261.84
458.654	256.98
459.085	252.13
459.516	213.29
459.947	159.89
460.378	252.13
460.808	191.45
461.239	201.16
461.669	244.85
462.1	232.71
462.531	261.84
462.961	232.71
463.391	288.54
463.822	266.69
464.252	179.31
464.682	237.56
465.113	242.42
465.543	286.11
465.973	232.71
466.403	252.13
466.833	305.53
467.263	210.86
467.693	213.29
468.123	235.14
468.553	189.02
468.983	130.77
469.412	162.32
469.842	189.02
470.272	237.56
470.701	235.14
471.131	223
471.56	247.27
471.99	206.01
472.419	193.87
472.849	225.43
473.278	215.72
473.707	184.17
474.136	247.27
474.566	244.85
474.995	232.71
475.424	218.15
475.853	201.16
476.282	167.17
476.711	130.77
477.14	252.13
477.569	215.72
477.997	191.45
478.426	184.17
478.855	179.31
479.283	181.74
479.712	242.42
480.141	232.71
480.569	169.6
480.998	218.15
481.426	247.27
481.854	252.13
482.283	256.98
482.711	208.44
483.139	232.71
483.567	174.46
483.995	123.48
484.424	113.78
484.852	181.74
485.28	181.74
485.708	169.6
486.135	196.3
486.563	193.87
486.991	232.71
487.419	227.86
487.847	206.01
488.274	184.17
488.702	184.17
489.129	147.76
489.557	230.28
489.984	193.87
490.412	230.28
490.839	189.02
491.266	293.39
491.694	201.16
492.121	125.91
492.548	201.16
492.975	179.31
493.402	196.3
493.829	189.02
494.256	147.76
494.683	201.16
495.11	213.29
495.537	220.57
495.964	121.06
496.39	181.74
496.817	174.46
497.244	223
497.67	113.78
498.097	155.04
498.523	167.17
498.95	82.22
499.376	133.19
499.803	247.27
500.229	111.35
500.655	121.06
501.081	172.03
501.508	162.32
501.934	203.58
502.36	218.15
502.786	237.56
503.212	239.99
503.638	159.89
504.064	232.71
504.489	235.14
504.915	196.3
505.341	108.92
505.767	133.19
506.192	252.13
506.618	189.02
507.043	179.31
507.469	213.29
507.894	206.01
508.32	164.75
508.745	193.87
509.17	210.86
509.596	147.76
510.021	179.31
510.446	150.18
510.871	174.46
511.296	174.46
511.721	191.45
512.146	155.04
512.571	237.56
512.996	196.3
513.421	218.15
513.845	186.59
514.27	155.04
514.695	167.17
515.119	167.17
515.544	162.32
515.969	210.86
516.393	150.18
516.817	191.45
517.242	179.31
517.666	140.48
518.09	206.01
518.515	155.04
518.939	172.03
519.363	434.17
519.787	179.31
520.211	196.3
520.635	223
521.059	167.17
521.483	162.32
521.907	142.9
522.331	203.58
522.754	220.57
523.178	147.76
523.602	191.45
524.025	184.17
524.449	218.15
524.872	155.04
525.296	184.17
525.719	155.04
526.143	172.03
526.566	225.43
526.989	157.47
527.412	206.01
527.836	223
528.259	242.42
528.682	155.04
529.105	179.31
529.528	140.48
529.951	162.32
530.374	174.46
530.796	169.6
531.219	196.3
531.642	184.17
532.065	218.15
532.487	130.77
532.91	206.01
533.332	167.17
533.755	223
534.177	152.61
534.6	162.32
535.022	145.33
535.444	159.89
535.867	227.86
536.289	239.99
536.711	230.28
537.133	140.48
537.555	181.74
537.977	162.32
538.399	252.13
538.821	244.85
539.243	179.31
539.665	235.14
540.086	225.43
540.508	189.02
540.93	191.45
541.351	210.86
541.773	167.17
542.195	181.74
542.616	252.13
543.037	247.27
543.459	227.86
543.88	196.3
544.301	208.44
544.723	201.16
545.144	184.17
545.565	169.6
545.986	237.56
546.407	244.85
546.828	201.16
547.249	123.48
547.67	220.57
548.091	215.72
548.512	227.86
548.932	193.87
549.353	189.02
549.774	169.6
550.194	138.05
550.615	215.72
551.035	162.32
551.456	138.05
551.876	133.19
552.296	159.89
552.717	213.29
553.137	189.02
553.557	186.59
553.977	203.58
554.397	198.73
554.817	121.06
555.237	193.87
555.657	169.6
556.077	210.86
556.497	227.86
556.917	198.73
557.337	198.73
557.756	210.86
558.176	206.01
558.596	157.47
559.015	172.03
559.435	196.3
559.854	159.89
560.274	174.46
560.693	138.05
561.112	162.32
561.532	184.17
561.951	167.17
562.37	300.67
562.789	206.01
563.208	242.42
563.627	210.86
564.046	164.75
564.465	189.02
564.884	218.15
565.303	108.92
565.722	155.04
566.14	193.87
566.559	210.86
566.978	206.01
567.396	264.26
567.815	225.43
568.233	172.03
568.652	193.87
569.07	174.46
569.489	167.17
569.907	249.7
570.325	276.4
570.743	193.87
571.161	169.6
571.58	271.55
571.998	210.86
572.416	162.32
572.833	123.48
573.251	162.32
573.669	235.14
574.087	118.63
574.505	227.86
574.922	201.16
575.34	235.14
575.758	138.05
576.175	145.33
576.593	230.28
577.01	220.57
577.428	79.79
577.845	1533.7
578.262	266.69
578.68	196.3
579.097	172.03
579.514	176.88
579.931	167.17
580.348	147.76
580.765	244.85
581.182	208.44
581.599	210.86
582.016	152.61
582.433	196.3
582.849	157.47
583.266	159.89
583.683	159.89
584.099	247.27
584.516	252.13
584.933	189.02
585.349	150.18
585.765	162.32
586.182	203.58
586.598	191.45
587.014	138.05
587.431	208.44
587.847	213.29
588.263	140.48
588.679	147.76
589.095	169.6
589.511	220.57
589.927	152.61
590.343	208.44
590.759	176.88
591.174	249.7
591.59	150.18
592.006	96.79
592.421	174.46
592.837	203.58
593.252	196.3
593.668	150.18
594.083	218.15
594.499	157.47
594.914	220.57
595.329	247.27
595.745	191.45
596.16	174.46
596.575	150.18
596.99	155.04
597.405	150.18
597.82	118.63
598.235	140.48
598.65	239.99
599.065	113.78
599.479	172.03
599.894	104.07
600.309	179.31
600.724	172.03
601.138	196.3
601.553	203.58
601.967	225.43
602.382	186.59
602.796	220.57
603.21	191.45
603.625	218.15
604.039	147.76
604.453	235.14
604.867	140.48
605.281	227.86
605.695	133.19
606.109	206.01
606.523	147.76
606.937	159.89
607.351	269.12
607.765	186.59
608.178	198.73
608.592	172.03
609.006	223
609.419	179.31
609.833	172.03
610.246	155.04
610.66	232.71
611.073	116.2
611.487	225.43
611.9	184.17
612.313	261.84
612.726	227.86
613.139	169.6
613.553	181.74
613.966	191.45
614.379	176.88
614.792	176.88
615.204	191.45
615.617	218.15
616.03	172.03
616.443	142.9
616.856	181.74
617.268	169.6
617.681	82.22
618.093	223
618.506	147.76
618.918	186.59
619.331	218.15
619.743	198.73
620.155	140.48
620.568	184.17
620.98	150.18
621.392	186.59
621.804	174.46
622.216	179.31
622.628	196.3
623.04	232.71
623.452	213.29
623.864	157.47
624.276	198.73
624.687	142.9
625.099	191.45
625.511	281.25
625.922	186.59
626.334	227.86
626.745	193.87
627.157	179.31
627.568	184.17
627.979	133.19
628.391	208.44
628.802	155.04
629.213	239.99
629.624	218.15
630.035	142.9
630.446	142.9
630.857	179.31
631.268	172.03
631.679	218.15
632.09	172.03
632.501	138.05
632.912	244.85
633.322	286.11
633.733	208.44
634.144	232.71
634.554	198.73
634.965	125.91
635.375	111.35
635.785	184.17
636.196	94.36
636.606	206.01
637.016	237.56
637.427	159.89
637.837	142.9
638.247	179.31
638.657	167.17
639.067	133.19
639.477	140.48
639.887	232.71
640.297	152.61
640.706	203.58
641.116	155.04
641.526	184.17
641.935	198.73
642.345	152.61
642.755	159.89
643.164	150.18
643.573	198.73
643.983	232.71
644.392	213.29
644.801	169.6
645.211	155.04
645.62	174.46
646.029	184.17
646.438	174.46
646.847	218.15
647.256	206.01
647.665	138.05
648.074	193.87
648.483	223
648.892	193.87
649.3	147.76
649.709	179.31
650.118	191.45
650.526	174.46
650.935	147.76
651.343	159.89
651.752	108.92
652.16	181.74
652.568	135.62
652.977	206.01
653.385	162.32
653.793	213.29
654.201	155.04
654.609	184.17
655.017	184.17
655.425	130.77
655.833	157.47
656.241	150.18
656.649	201.16
657.057	167.17
657.464	169.6
657.872	157.47
658.28	130.77
658.687	184.17
659.095	113.78
659.502	159.89
659.91	152.61
660.317	167.17
660.724	167.17
661.132	164.75
661.539	123.48
661.946	133.19
662.353	135.62
662.76	167.17
663.167	140.48
663.574	186.59
663.981	215.72
664.388	152.61
664.795	147.76
665.202	203.58
665.608	133.19
666.015	196.3
666.422	167.17
666.828	142.9
667.235	150.18
667.641	159.89
668.047	186.59
668.454	152.61
668.86	196.3
669.266	155.04
669.673	196.3
670.079	225.43
670.485	152.61
670.891	155.04
671.297	121.06
671.703	135.62
672.109	152.61
672.515	189.02
672.92	164.75
673.326	186.59
673.732	196.3
674.138	164.75
674.543	159.89
674.949	196.3
675.354	155.04
675.76	196.3
676.165	140.48
676.57	155.04
676.976	225.43
677.381	203.58
677.786	172.03
678.191	142.9
678.596	210.86
679.001	152.61
679.406	181.74
679.811	138.05
680.216	203.58
680.621	159.89
681.026	162.32
681.43	186.59
681.835	150.18
682.24	96.79
682.644	196.3
683.049	220.57
683.453	142.9
683.858	203.58
684.262	135.62
684.667	223
685.071	164.75
685.475	157.47
685.879	164.75
686.283	210.86
686.687	186.59
687.091	176.88
687.495	159.89
687.899	164.75
688.303	198.73
688.707	237.56
689.111	142.9
689.514	184.17
689.918	94.36
690.322	174.46
690.725	157.47
691.129	140.48
691.532	145.33
691.936	167.17
692.339	157.47
692.742	206.01
693.146	213.29
693.549	210.86
693.952	181.74
694.355	196.3
694.758	155.04
695.161	174.46
695.564	176.88
695.967	133.19
696.37	167.17
696.773	218.15
697.175	191.45
697.578	152.61
697.981	196.3
698.383	220.57
698.786	210.86
699.188	223
699.591	167.17
699.993	169.6
700.395	206.01
700.798	147.76
701.2	215.72
701.602	218.15
702.004	191.45
702.406	145.33
702.808	189.02
703.21	225.43
703.612	269.12
704.014	196.3
704.416	247.27
704.818	189.02
705.219	227.86
705.621	215.72
706.023	152.61
706.424	213.29
706.826	283.68
707.227	249.7
707.629	247.27
708.03	227.86
708.431	191.45
708.832	247.27
709.234	242.42
709.635	225.43
710.036	239.99
710.437	179.31
710.838	320.09
711.239	295.82
711.64	252.13
712.041	310.38
712.441	213.29
712.842	283.68
713.243	322.52
713.643	281.25
714.044	276.4
714.445	317.66
714.845	327.37
715.246	303.1
715.646	317.66
716.046	264.26
716.447	273.97
716.847	346.79
717.247	310.38
717.647	332.23
718.047	303.1
718.447	380.77
718.847	288.54
719.247	312.81
719.647	409.9
720.047	419.61
720.446	422.03
720.846	349.22
721.246	412.32
721.645	392.91
722.045	465.72
722.444	458.44
722.844	497.28
723.243	485.14
723.643	441.45
724.042	475.43
724.441	407.47
724.84	407.47
725.24	463.3
725.639	417.18
726.038	492.42
726.437	465.72
726.836	473
727.234	604.07
727.633	528.83
728.032	630.77
728.431	608.93
728.83	579.8
729.228	689.03
729.627	662.33
730.025	725.44
730.424	771.55
730.822	892.91
731.22	824.95
731.619	885.63
732.017	992.43
732.415	1048.26
732.813	1004.57
733.212	1130.78
733.61	1159.91
734.008	1380.79
734.406	1341.95
734.803	1405.06
735.201	1555.55
735.599	1638.07
735.997	1715.74
736.395	1897.78
736.792	1973.03
737.19	2053.13
737.587	2191.48
737.985	2191.48
738.382	2341.97
738.78	2555.56
739.177	2480.32
739.574	2759.45
739.971	2849.26
740.369	3065.28
740.766	3150.23
741.163	3145.38
741.56	3412.37
741.957	3601.69
742.354	3740.05
742.751	3812.86
743.147	3990.05
743.544	4121.12
743.941	4434.23
744.338	4679.38
744.734	4604.14
745.131	4922.1
745.527	5424.54
745.924	5490.07
746.32	5599.3
746.716	6077.46
747.113	6181.83
747.509	6652.71
747.905	6980.39
748.301	7227.96
748.697	7494.96
749.093	7900.3
749.489	8106.62
749.885	8587.21
750.281	9060.52
750.677	9274.11
751.073	9706.16
751.468	9965.87
751.864	10329.95
752.26	10888.22
752.655	11487.74
753.051	11618.81
753.446	12429.5
753.842	12320.28
754.237	12880.96
754.632	13473.21
755.028	13575.15
755.423	13978.07
755.818	13776.61
756.213	14174.67
756.608	14759.63
757.003	15050.9
757.398	15237.8
757.793	15143.14
758.188	15320.32
758.583	15902.86
758.977	16160.14
759.372	16497.53
759.767	17148.02
760.161	18509.69
760.556	19128.63
760.95	19898.06
761.345	20618.95
761.739	21754.89
762.133	22339.85
762.527	23218.5
762.922	23623.85
763.316	24262.21
763.71	24703.96
764.104	25252.52
764.498	26104.47
764.892	26208.84
765.286	26847.2
765.68	28150.62
766.073	28553.54
766.467	28640.92
766.861	29866.67
767.255	31070.57
767.648	32068.16
768.042	32184.66
768.435	32512.34
768.829	32667.68
769.222	33507.5
769.615	33483.23
770.008	34631.3
770.402	34432.27
770.795	34587.61
771.188	35442
771.581	34626.45
771.974	34789.07
772.367	34616.74
772.76	34922.57
773.153	34194.4
773.545	34745.38
773.938	34679.85
774.331	35124.03
774.724	35820.64
775.116	36774.54
775.509	38823.12
775.901	39398.37
776.294	40405.66
776.686	41267.33
777.078	42141.13
777.471	43672.71
777.863	45155.74
778.255	45704.29
778.647	46490.71
779.039	46388.77
779.431	45699.44
779.823	46932.47
780.215	46735.86
780.607	45947.01
780.999	48498.02
781.39	48165.49
781.782	49046.58
782.174	49400.95
782.565	49422.8
782.957	49524.74
783.348	50983.5
783.74	49709.21
784.131	50034.46
784.522	50765.05
784.914	49121.82
785.305	49735.91
785.696	49116.97
786.087	48553.85
786.478	48211.61
786.869	46881.49
787.26	45959.15
787.651	45966.43
788.042	44493.11
788.433	43362.02
788.823	43320.76
789.214	42250.35
789.605	41177.52
789.995	40434.79
790.386	39291.57
790.776	39908.08
791.167	39014.87
791.557	40325.57
791.948	40900.82
792.338	40522.17
792.728	42417.83
793.118	41944.52
793.508	41631.41
793.898	42721.23
794.288	42391.13
794.678	42320.74
795.068	42643.56
795.458	41995.5
795.848	41811.03
796.238	42721.23
796.627	41692.09
797.017	41167.81
797.406	42631.43
797.796	41446.94
798.185	41541.6
798.575	42442.1
798.964	41813.45
799.354	42420.26
799.743	42216.37
800.132	42313.46
800.521	42427.54
800.91	42658.13
801.299	41803.74
801.688	41944.52
802.077	41124.12
802.466	41034.32
802.855	41201.79
803.244	39670.22
803.633	39175.06
804.021	38655.64
804.41	37449.31
804.799	37575.52
805.187	35789.09
805.576	35432.29
805.964	34359.45
806.352	33196.81
806.741	32793.9
807.129	32786.61
807.517	32626.42
807.905	32407.97
808.293	32456.51
808.681	32289.03
809.069	32031.75
809.457	33250.21
809.845	32968.66
810.233	33323.03
810.621	33446.82
811.009	32378.84
811.396	33900.71
811.784	33536.63
812.171	32738.07
812.559	32745.35
812.946	32012.33
813.334	31575.43
813.721	31012.31
814.108	30068.13
814.496	29805.99
814.883	29920.06
815.27	30886.1
815.657	29988.03
816.044	29859.38
816.431	29196.75
816.818	29687.05
817.205	29177.33
817.592	29364.23
817.979	28924.9
818.365	27667.6
818.752	26626.32
819.139	26087.48
819.525	25808.35
819.912	25169.99
820.298	24568.04
820.685	23985.51
821.071	23604.43
821.457	23019.47
821.843	21837.41
822.23	20902.93
822.616	20407.78
823.002	19589.81
823.388	18611.64
823.774	18701.44
824.16	17652.88
824.546	16878.6
824.931	16796.07
825.317	16980.54
825.703	16825.2
826.089	15825.19
826.474	16201.4
826.86	15944.12
827.245	15529.06
827.631	15609.16
828.016	15230.52
828.401	14798.47
828.787	14368.85
829.172	14237.78
829.557	13621.27
829.942	13320.29
830.327	13143.1
830.712	12601.83
831.097	12155.23
831.482	12111.54
831.867	12133.38
832.252	11669.78
832.636	11473.18
833.021	11618.81
833.406	11223.17
833.79	10786.27
834.175	10647.92
834.559	10429.47
834.944	10337.24
835.328	9936.74
835.713	9558.1
836.097	9305.67
836.481	9128.48
836.865	8871.19
837.249	8477.98
837.633	8062.93
838.017	7880.89
838.401	7747.39
838.785	7383.31
839.169	6866.31
839.553	6888.15
839.937	6689.12
840.32	6179.4
840.704	6104.16
841.087	5640.56
841.471	5560.46
841.854	5439.1
842.238	5135.7
842.621	5062.88
843.004	5070.16
843.388	4914.82
843.771	4842
844.154	4703.65
844.537	4737.63
844.92	4638.12
845.303	4592
845.686	4482.78
846.069	4291.03
846.452	4225.49
846.834	4084.71
847.217	4104.13
847.6	3883.25
847.982	3873.54
848.365	3752.18
848.748	3740.05
849.13	3611.4
849.512	3485.19
849.895	3470.62
850.277	3283.73
850.659	3324.99
851.041	3230.33
851.423	3201.2
851.806	3152.66
852.188	2987.61
852.57	2985.18
852.951	2956.05
853.333	2788.57
853.715	2623.52
854.097	2604.11
854.479	2526.43
854.86	2584.69
855.242	2579.83
855.623	2358.96
856.005	2232.74
856.386	2281.29
856.768	2072.54
857.149	1997.3
857.53	1985.16
857.911	1907.49
858.292	1868.66
858.674	1892.93
859.055	1689.04
859.436	1509.43
859.817	1473.02
860.197	1562.83
860.578	1526.42
860.959	1409.91
861.34	1485.16
861.72	1344.38
862.101	1257
862.482	1283.7
862.862	1257
863.243	1220.59
863.623	1111.36
864.003	1111.36
864.384	1057.97
864.764	1135.64
865.144	1057.97
865.524	1055.54
865.904	1072.53
866.284	994.86
866.664	846.8
867.044	941.46
867.424	936.6
867.804	856.51
868.183	820.1
868.563	810.39
868.943	725.44
869.322	752.14
869.702	667.18
870.081	710.87
870.461	640.48
870.84	737.57
871.22	604.07
871.599	638.06
871.978	596.79
872.357	582.23
872.736	570.09
873.115	531.26
873.494	531.26
873.873	543.39
874.252	475.43
874.631	521.55
875.01	456.01
875.388	470.58
875.767	424.46
876.146	434.17
876.524	494.85
876.903	412.32
877.281	392.91
877.66	380.77
878.038	395.33
878.416	315.24
878.794	339.51
879.173	278.83
879.551	329.8
879.929	315.24
880.307	329.8
880.685	341.93
881.063	293.39
881.441	276.4
881.818	290.96
882.196	278.83
882.574	249.7
882.951	281.25
883.329	283.68
883.707	329.8
884.084	271.55
884.461	400.19
884.839	264.26
885.216	225.43
885.593	261.84
885.971	300.67
886.348	300.67
886.725	235.14
887.102	125.91
887.479	193.87
887.856	159.89
888.233	223
888.609	203.58
888.986	249.7
889.363	249.7
889.74	269.12
890.116	215.72
890.493	254.55
890.869	218.15
891.246	167.17
891.622	232.71
891.998	215.72
892.375	174.46
892.751	220.57
893.127	276.4
893.503	239.99
893.879	193.87
894.255	218.15
894.631	220.57
895.007	133.19
895.383	206.01
895.759	247.27
896.134	157.47
896.51	235.14
896.886	152.61
897.261	128.34
897.637	191.45
898.012	181.74
898.388	172.03
898.763	155.04
899.138	111.35
899.514	157.47
899.889	213.29
900.264	65.23
900.639	198.73
901.014	155.04
901.389	159.89
901.764	147.76
902.139	172.03
902.513	191.45
902.888	186.59
903.263	150.18
903.638	189.02
904.012	213.29
904.387	206.01
904.761	125.91
905.136	208.44
905.51	184.17
905.884	176.88
906.259	130.77
906.633	167.17
907.007	206.01
907.381	84.65
907.755	159.89
908.129	162.32
908.503	116.2
908.877	157.47
909.251	155.04
909.624	130.77
909.998	147.76
910.372	125.91
910.745	138.05
911.119	167.17
911.492	113.78
911.866	174.46
912.239	138.05
912.612	152.61
912.986	159.89
913.359	133.19
913.732	118.63
914.105	116.2
914.478	138.05
914.851	152.61
915.224	191.45
915.597	138.05
915.97	223
916.343	150.18
916.715	123.48
917.088	174.46
917.461	174.46
917.833	172.03
918.206	215.72
918.578	140.48
918.951	181.74
919.323	118.63
919.695	152.61
920.067	210.86
920.44	174.46
920.812	176.88
921.184	159.89
921.556	116.2
921.928	142.9
922.3	184.17
922.672	167.17
923.043	167.17
923.415	218.15
923.787	157.47
924.158	206.01
924.53	121.06
924.901	172.03
925.273	113.78
925.644	179.31
926.016	196.3
926.387	152.61
926.758	138.05
927.129	186.59
927.5	106.49
927.872	225.43
928.243	135.62
928.613	113.78
928.984	193.87
929.355	140.48
929.726	157.47
930.097	189.02
930.467	174.46
930.838	99.21
931.209	145.33
931.579	164.75
931.95	155.04
932.32	196.3
932.69	181.74
933.061	167.17
933.431	123.48
933.801	121.06
934.171	106.49
934.541	169.6
934.911	193.87
935.281	162.32
935.651	196.3
936.021	111.35
936.391	167.17
936.761	94.36
937.13	138.05
937.5	152.61
937.87	67.66
938.239	128.34
938.609	179.31
938.978	169.6
939.347	147.76
939.717	130.77
940.086	133.19
940.455	130.77
940.824	167.17
941.193	186.59
941.562	169.6
941.931	138.05
942.3	145.33
942.669	167.17
943.038	162.32
943.407	128.34
943.775	198.73
944.144	121.06
944.513	142.9
944.881	172.03
945.25	155.04
945.618	145.33
945.986	193.87
946.355	184.17
946.723	133.19
947.091	181.74
947.459	128.34
947.827	133.19
948.195	196.3
948.563	106.49
948.931	208.44
949.299	125.91
949.667	172.03
950.035	116.2
950.402	159.89
950.77	189.02
951.138	147.76
951.505	176.88
951.873	147.76
952.24	169.6
952.607	116.2
952.975	167.17
953.342	191.45
953.709	138.05
954.076	94.36
954.443	118.63
954.81	184.17
955.177	193.87
955.544	174.46
955.911	152.61
956.278	162.32
956.645	135.62
957.012	169.6
957.378	128.34
957.745	104.07
958.111	164.75
958.478	237.56
958.844	130.77
959.211	121.06
959.577	189.02
959.943	189.02
960.309	278.83
960.675	150.18
961.042	152.61
961.408	167.17
961.774	111.35
962.139	159.89
962.505	111.35
962.871	135.62
963.237	121.06
963.603	60.38
963.968	193.87
964.334	142.9
964.699	235.14
965.065	159.89
965.43	104.07
965.796	138.05
966.161	252.13
966.526	96.79
966.891	145.33
967.256	104.07
967.622	118.63
967.987	159.89
968.352	196.3
968.716	108.92
969.081	123.48
969.446	104.07
969.811	130.77
970.176	174.46
970.54	167.17
970.905	172.03
971.269	140.48
971.634	176.88
971.998	218.15
972.363	198.73
972.727	186.59
973.091	108.92
973.455	176.88
973.819	167.17
974.183	169.6
974.547	174.46
974.911	230.28
975.275	150.18
975.639	155.04
976.003	174.46
976.367	142.9
976.73	184.17
977.094	140.48
977.458	261.84
977.821	176.88
978.185	140.48
978.548	123.48
978.911	113.78
979.275	155.04
979.638	130.77
980.001	208.44
980.364	108.92
980.727	198.73
981.09	176.88
981.453	113.78
981.816	176.88
982.179	189.02
982.542	142.9
982.905	176.88
983.267	94.36
983.63	186.59
983.992	157.47
984.355	128.34
984.717	181.74
985.08	162.32
985.442	130.77
985.804	99.21
986.167	193.87
986.529	91.93
986.891	145.33
987.253	191.45
987.615	135.62
987.977	94.36
988.339	179.31
988.701	138.05
989.062	155.04
989.424	133.19
989.786	167.17
990.147	176.88
990.509	145.33
990.87	128.34
991.232	174.46
991.593	213.29
991.955	123.48
992.316	223
992.677	191.45
993.038	128.34
993.399	138.05
993.76	196.3
994.121	176.88
994.482	169.6
994.843	118.63
995.204	116.2
995.565	150.18
995.926	152.61
996.286	176.88
996.647	162.32
997.007	118.63
997.368	79.79
997.728	138.05
998.089	159.89
998.449	201.16
998.809	179.31
999.169	179.31
999.53	184.17
999.89	74.94
1000.25	116.2
1000.61	142.9
1000.97	189.02
1001.329	155.04
1001.689	142.9
1002.049	201.16
1002.409	99.21
1002.768	169.6
1003.128	123.48
1003.487	118.63
1003.847	157.47
1004.206	150.18
1004.566	152.61
1004.925	181.74
1005.284	198.73
1005.643	116.2
1006.003	130.77
1006.362	235.14
1006.721	189.02
1007.08	169.6
1007.438	142.9
1007.797	213.29
1008.156	133.19
1008.515	189.02
1008.874	147.76
1009.232	87.08
1009.591	223
1009.949	174.46
1010.308	206.01
1010.666	147.76
1011.024	174.46
1011.383	142.9
1011.741	172.03
1012.099	125.91
1012.457	138.05
1012.815	208.44
1013.173	140.48
1013.531	130.77
1013.889	179.31
1014.247	191.45
1014.605	167.17
1014.962	198.73
1015.32	174.46
1015.678	176.88
1016.035	142.9
1016.393	111.35
1016.75	128.34
1017.107	220.57
1017.465	104.07
1017.822	155.04
1018.179	116.2
1018.536	230.28
1018.894	116.2
1019.251	169.6
1019.608	179.31
1019.964	157.47
1020.321	142.9
1020.678	198.73
1021.035	169.6
1021.392	159.89
1021.748	118.63
1022.105	125.91
1022.461	125.91
1022.818	208.44
1023.174	196.3
1023.531	254.55
1023.887	135.62
1024.243	169.6
1024.599	104.07
1024.955	159.89
1025.311	184.17
1025.667	189.02
1026.023	157.47
1026.379	172.03
1026.735	155.04
1027.091	94.36
1027.447	172.03
