189.514	81.16
189.973	81.16
190.431	81.16
190.889	-3.79
191.348	-28.06
191.806	13.2
192.264	-40.2
192.722	8.34
193.18	22.91
193.638	-105.74
194.096	-25.64
194.554	-42.63
195.012	-30.49
195.47	73.88
195.928	15.63
196.385	25.33
196.843	35.04
197.301	-6.22
197.758	47.18
198.216	22.91
198.674	-42.63
199.131	42.32
199.589	44.75
200.046	37.47
200.503	59.32
200.961	44.75
201.418	66.6
201.875	107.86
202.332	95.72
202.79	54.46
203.247	127.28
203.704	132.13
204.161	83.59
204.618	144.27
205.075	180.68
205.532	127.28
205.989	129.7
206.445	107.86
206.902	168.54
207.359	139.41
207.816	105.43
208.272	139.41
208.729	73.88
209.185	190.39
209.642	56.89
210.098	139.41
210.555	234.08
211.011	151.55
211.467	107.86
211.924	144.27
212.38	120
212.836	115.14
213.292	173.39
213.748	139.41
214.204	146.7
214.66	117.57
215.116	136.99
215.572	166.11
216.028	202.52
216.484	129.7
216.94	202.52
217.396	170.97
217.851	170.97
218.307	183.1
218.763	98.15
219.218	183.1
219.674	69.02
220.129	163.69
220.585	144.27
221.04	73.88
221.496	180.68
221.951	100.58
222.406	136.99
222.861	110.29
223.317	120
223.772	103.01
224.227	151.55
224.682	195.24
225.137	180.68
225.592	173.39
226.047	153.98
226.502	175.82
226.957	100.58
227.411	47.18
227.866	86.01
228.321	78.73
228.776	134.56
229.23	93.3
229.685	187.96
230.139	158.83
230.594	173.39
231.048	161.26
231.503	180.68
231.957	146.7
232.411	168.54
232.865	200.09
233.32	136.99
233.774	127.28
234.228	103.01
234.682	122.42
235.136	93.3
235.59	156.4
236.044	86.01
236.498	180.68
236.952	105.43
237.406	175.82
237.86	166.11
238.313	158.83
238.767	134.56
239.221	224.37
239.674	183.1
240.128	149.12
240.581	127.28
241.035	146.7
241.488	129.7
241.942	103.01
242.395	139.41
242.848	120
243.301	175.82
243.755	129.7
244.208	185.53
244.661	173.39
245.114	219.51
245.567	136.99
246.02	161.26
246.473	139.41
246.926	185.53
247.379	139.41
247.832	93.3
248.284	151.55
248.737	175.82
249.19	185.53
249.642	207.38
250.095	134.56
250.547	168.54
251	163.69
251.452	153.98
251.905	132.13
252.357	170.97
252.81	190.39
253.262	163.69
253.714	178.25
254.166	217.08
254.618	146.7
255.07	214.66
255.523	110.29
255.975	156.4
256.427	95.72
256.878	166.11
257.33	120
257.782	139.41
258.234	204.95
258.686	192.81
259.137	134.56
259.589	161.26
260.041	132.13
260.492	42.32
260.944	127.28
261.395	161.26
261.847	185.53
262.298	93.3
262.749	122.42
263.201	132.13
263.652	139.41
264.103	158.83
264.554	149.12
265.005	110.29
265.457	173.39
265.908	195.24
266.359	95.72
266.809	134.56
267.26	112.71
267.711	156.4
268.162	163.69
268.613	185.53
269.064	183.1
269.514	161.26
269.965	156.4
270.415	86.01
270.866	81.16
271.316	132.13
271.767	168.54
272.217	175.82
272.668	158.83
273.118	180.68
273.568	71.45
274.019	173.39
274.469	127.28
274.919	166.11
275.369	134.56
275.819	236.5
276.269	93.3
276.719	166.11
277.169	117.57
277.619	100.58
278.069	151.55
278.518	168.54
278.968	183.1
279.418	207.38
279.867	98.15
280.317	156.4
280.767	141.84
281.216	115.14
281.666	231.65
282.115	83.59
282.564	136.99
283.014	132.13
283.463	81.16
283.912	132.13
284.361	146.7
284.811	141.84
285.26	103.01
285.709	192.81
286.158	144.27
286.607	149.12
287.056	158.83
287.505	158.83
287.953	139.41
288.402	153.98
288.851	144.27
289.3	146.7
289.748	141.84
290.197	136.99
290.646	146.7
291.094	120
291.543	134.56
291.991	146.7
292.439	195.24
292.888	185.53
293.336	168.54
293.784	100.58
294.233	178.25
294.681	144.27
295.129	156.4
295.577	200.09
296.025	151.55
296.473	234.08
296.921	136.99
297.369	78.73
297.817	187.96
298.264	144.27
298.712	141.84
299.16	175.82
299.608	190.39
300.055	158.83
300.503	173.39
300.95	234.08
301.398	115.14
301.845	139.41
302.293	163.69
302.74	139.41
303.187	170.97
303.635	197.67
304.082	112.71
304.529	156.4
304.976	219.51
305.423	144.27
305.87	141.84
306.317	168.54
306.764	207.38
307.211	115.14
307.658	161.26
308.105	187.96
308.552	139.41
308.998	151.55
309.445	139.41
309.892	183.1
310.338	139.41
310.785	78.73
311.231	173.39
311.678	170.97
312.124	146.7
312.571	144.27
313.017	132.13
313.463	146.7
313.909	146.7
314.356	170.97
314.802	161.26
315.248	122.42
315.694	69.02
316.14	136.99
316.586	178.25
317.032	122.42
317.478	161.26
317.923	200.09
318.369	149.12
318.815	132.13
319.261	156.4
319.706	231.65
320.152	173.39
320.597	144.27
321.043	170.97
321.488	158.83
321.934	163.69
322.379	117.57
322.824	168.54
323.27	149.12
323.715	141.84
324.16	161.26
324.605	95.72
325.05	134.56
325.495	76.31
325.94	212.23
326.385	183.1
326.83	112.71
327.275	115.14
327.72	122.42
328.165	56.89
328.61	86.01
329.054	212.23
329.499	180.68
329.943	153.98
330.388	141.84
330.832	175.82
331.277	178.25
331.721	183.1
332.166	166.11
332.61	120
333.054	136.99
333.499	122.42
333.943	217.08
334.387	83.59
334.831	185.53
335.275	178.25
335.719	149.12
336.163	146.7
336.607	146.7
337.051	95.72
337.495	132.13
337.938	120
338.382	134.56
338.826	86.01
339.269	197.67
339.713	166.11
340.157	149.12
340.6	195.24
341.044	132.13
341.487	141.84
341.93	122.42
342.374	95.72
342.817	195.24
343.26	158.83
343.703	107.86
344.146	115.14
344.59	86.01
345.033	83.59
345.476	117.57
345.919	103.01
346.361	129.7
346.804	76.31
347.247	168.54
347.69	161.26
348.133	105.43
348.575	161.26
349.018	163.69
349.461	151.55
349.903	168.54
350.346	107.86
350.788	153.98
351.23	115.14
351.673	141.84
352.115	187.96
352.557	195.24
353	146.7
353.442	163.69
353.884	175.82
354.326	122.42
354.768	136.99
355.21	132.13
355.652	124.85
356.094	156.4
356.536	187.96
356.978	117.57
357.419	219.51
357.861	180.68
358.303	141.84
358.744	153.98
359.186	86.01
359.627	153.98
360.069	207.38
360.51	86.01
360.952	112.71
361.393	146.7
361.834	217.08
362.276	93.3
362.717	107.86
363.158	158.83
363.599	212.23
364.04	90.87
364.481	153.98
364.922	127.28
365.363	105.43
365.804	149.12
366.245	139.41
366.686	61.74
367.126	204.95
367.567	200.09
368.008	158.83
368.448	42.32
368.889	144.27
369.33	175.82
369.77	168.54
370.21	115.14
370.651	166.11
371.091	100.58
371.531	161.26
371.972	69.02
372.412	180.68
372.852	134.56
373.292	161.26
373.732	90.87
374.172	161.26
374.612	103.01
375.052	170.97
375.492	214.66
375.932	129.7
376.372	183.1
376.811	127.28
377.251	134.56
377.691	180.68
378.13	124.85
378.57	231.65
379.009	168.54
379.449	98.15
379.888	127.28
380.328	136.99
380.767	149.12
381.206	234.08
381.645	124.85
382.085	134.56
382.524	149.12
382.963	200.09
383.402	187.96
383.841	149.12
384.28	139.41
384.719	178.25
385.158	204.95
385.596	156.4
386.035	158.83
386.474	90.87
386.913	202.52
387.351	158.83
387.79	204.95
388.228	90.87
388.667	144.27
389.105	219.51
389.544	134.56
389.982	197.67
390.42	149.12
390.859	127.28
391.297	151.55
391.735	153.98
392.173	151.55
392.611	124.85
393.049	168.54
393.487	144.27
393.925	69.02
394.363	166.11
394.801	161.26
395.239	170.97
395.676	73.88
396.114	170.97
396.552	139.41
396.989	117.57
397.427	173.39
397.864	93.3
398.302	120
398.739	71.45
399.177	115.14
399.614	112.71
400.051	168.54
400.488	217.08
400.926	105.43
401.363	192.81
401.8	163.69
402.237	141.84
402.674	132.13
403.111	153.98
403.548	93.3
403.985	163.69
404.421	47.18
404.858	180.68
405.295	132.13
405.732	163.69
406.168	73.88
406.605	129.7
407.041	178.25
407.478	146.7
407.914	129.7
408.351	122.42
408.787	100.58
409.223	192.81
409.66	153.98
410.096	204.95
410.532	217.08
410.968	69.02
411.404	134.56
411.84	141.84
412.276	190.39
412.712	202.52
413.148	156.4
413.584	146.7
414.02	158.83
414.455	207.38
414.891	86.01
415.327	187.96
415.762	120
416.198	132.13
416.633	103.01
417.069	185.53
417.504	161.26
417.94	107.86
418.375	166.11
418.81	139.41
419.245	136.99
419.681	83.59
420.116	187.96
420.551	151.55
420.986	221.94
421.421	163.69
421.856	110.29
422.291	117.57
422.726	127.28
423.16	200.09
423.595	110.29
424.03	268.06
424.464	122.42
424.899	207.38
425.334	117.57
425.768	156.4
426.203	209.8
426.637	156.4
427.071	132.13
427.506	178.25
427.94	100.58
428.374	192.81
428.809	105.43
429.243	124.85
429.677	112.71
430.111	134.56
430.545	156.4
430.979	163.69
431.413	112.71
431.847	170.97
432.28	180.68
432.714	158.83
433.148	180.68
433.582	180.68
434.015	93.3
434.449	124.85
434.882	149.12
435.316	197.67
435.749	127.28
436.183	166.11
436.616	127.28
437.049	209.8
437.483	146.7
437.916	161.26
438.349	231.65
438.782	129.7
439.215	112.71
439.648	195.24
440.081	158.83
440.514	185.53
440.947	141.84
441.38	127.28
441.813	183.1
442.245	221.94
442.678	78.73
443.111	190.39
443.543	166.11
443.976	195.24
444.408	197.67
444.841	112.71
445.273	187.96
445.705	190.39
446.138	170.97
446.57	170.97
447.002	163.69
447.434	156.4
447.867	166.11
448.299	183.1
448.731	153.98
449.163	214.66
449.595	204.95
450.026	187.96
450.458	78.73
450.89	192.81
451.322	156.4
451.754	136.99
452.185	163.69
452.617	183.1
453.048	168.54
453.48	158.83
453.911	217.08
454.343	248.64
454.774	221.94
455.205	178.25
455.637	214.66
456.068	144.27
456.499	180.68
456.93	183.1
457.361	180.68
457.792	224.37
458.223	221.94
458.654	231.65
459.085	207.38
459.516	275.34
459.947	209.8
460.378	200.09
460.808	149.12
461.239	190.39
461.669	202.52
462.1	192.81
462.531	226.79
462.961	173.39
463.391	149.12
463.822	217.08
464.252	224.37
464.682	214.66
465.113	187.96
465.543	190.39
465.973	263.2
466.403	178.25
466.833	294.76
467.263	204.95
467.693	163.69
468.123	146.7
468.553	204.95
468.983	231.65
469.412	180.68
469.842	163.69
470.272	214.66
470.701	200.09
471.131	170.97
471.56	197.67
471.99	103.01
472.419	161.26
472.849	115.14
473.278	163.69
473.707	212.23
474.136	170.97
474.566	185.53
474.995	214.66
475.424	158.83
475.853	141.84
476.282	173.39
476.711	178.25
477.14	149.12
477.569	153.98
477.997	170.97
478.426	178.25
478.855	132.13
479.283	183.1
479.712	200.09
480.141	207.38
480.569	185.53
480.998	209.8
481.426	146.7
481.854	146.7
482.283	173.39
482.711	139.41
483.139	183.1
483.567	151.55
483.995	258.35
484.424	158.83
484.852	141.84
485.28	180.68
485.708	120
486.135	170.97
486.563	161.26
486.991	161.26
487.419	197.67
487.847	195.24
488.274	132.13
488.702	163.69
489.129	178.25
489.557	168.54
489.984	173.39
490.412	219.51
490.839	156.4
491.266	166.11
491.694	149.12
492.121	132.13
492.548	226.79
492.975	212.23
493.402	212.23
493.829	192.81
494.256	197.67
494.683	120
495.11	175.82
495.537	163.69
495.964	168.54
496.39	151.55
496.817	212.23
497.244	170.97
497.67	129.7
498.097	180.68
498.523	139.41
498.95	168.54
499.376	161.26
499.803	200.09
500.229	219.51
500.655	207.38
501.081	156.4
501.508	103.01
501.934	141.84
502.36	178.25
502.786	161.26
503.212	161.26
503.638	161.26
504.064	124.85
504.489	122.42
504.915	183.1
505.341	168.54
505.767	192.81
506.192	170.97
506.618	124.85
507.043	168.54
507.469	166.11
507.894	98.15
508.32	141.84
508.745	161.26
509.17	105.43
509.596	166.11
510.021	197.67
510.446	103.01
510.871	214.66
511.296	170.97
511.721	132.13
512.146	117.57
512.571	149.12
512.996	153.98
513.421	178.25
513.845	190.39
514.27	98.15
514.695	120
515.119	161.26
515.544	173.39
515.969	209.8
516.393	180.68
516.817	153.98
517.242	202.52
517.666	170.97
518.09	144.27
518.515	207.38
518.939	214.66
519.363	333.59
519.787	200.09
520.211	163.69
520.635	195.24
521.059	144.27
521.483	93.3
521.907	153.98
522.331	69.02
522.754	185.53
523.178	161.26
523.602	90.87
524.025	163.69
524.449	212.23
524.872	187.96
525.296	134.56
525.719	161.26
526.143	173.39
526.566	161.26
526.989	183.1
527.412	253.49
527.836	183.1
528.259	190.39
528.682	190.39
529.105	161.26
529.528	124.85
529.951	107.86
530.374	166.11
530.796	161.26
531.219	144.27
531.642	146.7
532.065	226.79
532.487	197.67
532.91	127.28
533.332	156.4
533.755	153.98
534.177	173.39
534.6	129.7
535.022	195.24
535.444	192.81
535.867	168.54
536.289	146.7
536.711	129.7
537.133	192.81
537.555	197.67
537.977	200.09
538.399	117.57
538.821	100.58
539.243	112.71
539.665	144.27
540.086	204.95
540.508	217.08
540.93	163.69
541.351	170.97
541.773	243.78
542.195	178.25
542.616	115.14
543.037	144.27
543.459	187.96
543.88	187.96
544.301	187.96
544.723	168.54
545.144	200.09
545.565	149.12
545.986	207.38
546.407	170.97
546.828	124.85
547.249	120
547.67	141.84
548.091	195.24
548.512	127.28
548.932	129.7
549.353	200.09
549.774	175.82
550.194	197.67
550.615	173.39
551.035	117.57
551.456	141.84
551.876	166.11
552.296	200.09
552.717	197.67
553.137	180.68
553.557	78.73
553.977	161.26
554.397	183.1
554.817	255.92
555.237	170.97
555.657	166.11
556.077	180.68
556.497	146.7
556.917	156.4
557.337	209.8
557.756	158.83
558.176	105.43
558.596	146.7
559.015	163.69
559.435	90.87
559.854	180.68
560.274	170.97
560.693	151.55
561.112	200.09
561.532	105.43
561.951	168.54
562.37	253.49
562.789	149.12
563.208	120
563.627	180.68
564.046	180.68
564.465	134.56
564.884	136.99
565.303	129.7
565.722	166.11
566.14	175.82
566.559	197.67
566.978	124.85
567.396	185.53
567.815	141.84
568.233	197.67
568.652	183.1
569.07	146.7
569.489	163.69
569.907	151.55
570.325	163.69
570.743	146.7
571.161	209.8
571.58	163.69
571.998	139.41
572.416	151.55
572.833	170.97
573.251	158.83
573.669	175.82
574.087	192.81
574.505	117.57
574.922	120
575.34	158.83
575.758	158.83
576.175	161.26
576.593	156.4
577.01	110.29
577.428	151.55
577.845	1501.09
578.262	333.59
578.68	226.79
579.097	180.68
579.514	185.53
579.931	166.11
580.348	173.39
580.765	175.82
581.182	229.22
581.599	178.25
582.016	192.81
582.433	180.68
582.849	156.4
583.266	260.77
583.683	161.26
584.099	187.96
584.516	103.01
584.933	168.54
585.349	151.55
585.765	185.53
586.182	168.54
586.598	141.84
587.014	129.7
587.431	202.52
587.847	129.7
588.263	95.72
588.679	200.09
589.095	78.73
589.511	192.81
589.927	190.39
590.343	127.28
590.759	221.94
591.174	90.87
591.59	158.83
592.006	158.83
592.421	134.56
592.837	141.84
593.252	168.54
593.668	170.97
594.083	158.83
594.499	83.59
594.914	202.52
595.329	158.83
595.745	224.37
596.16	127.28
596.575	156.4
596.99	122.42
597.405	185.53
597.82	117.57
598.235	197.67
598.65	173.39
599.065	173.39
599.479	129.7
599.894	149.12
600.309	226.79
600.724	161.26
601.138	163.69
601.553	192.81
601.967	202.52
602.382	117.57
602.796	170.97
603.21	124.85
603.625	110.29
604.039	217.08
604.453	195.24
604.867	190.39
605.281	158.83
605.695	185.53
606.109	180.68
606.523	168.54
606.937	202.52
607.351	236.5
607.765	178.25
608.178	168.54
608.592	175.82
609.006	134.56
609.419	163.69
609.833	202.52
610.246	183.1
610.66	202.52
611.073	86.01
611.487	149.12
611.9	117.57
612.313	153.98
612.726	149.12
613.139	112.71
613.553	120
613.966	144.27
614.379	238.93
614.792	156.4
615.204	107.86
615.617	105.43
616.03	105.43
616.443	146.7
616.856	153.98
617.268	112.71
617.681	195.24
618.093	66.6
618.506	115.14
618.918	124.85
619.331	180.68
619.743	158.83
620.155	122.42
620.568	158.83
620.98	146.7
621.392	170.97
621.804	204.95
622.216	175.82
622.628	151.55
623.04	115.14
623.452	122.42
623.864	195.24
624.276	185.53
624.687	156.4
625.099	52.03
625.511	246.21
625.922	149.12
626.334	139.41
626.745	146.7
627.157	69.02
627.568	141.84
627.979	166.11
628.391	132.13
628.802	129.7
629.213	156.4
629.624	149.12
630.035	149.12
630.446	117.57
630.857	183.1
631.268	129.7
631.679	146.7
632.09	231.65
632.501	127.28
632.912	146.7
633.322	209.8
633.733	168.54
634.144	180.68
634.554	139.41
634.965	144.27
635.375	139.41
635.785	166.11
636.196	178.25
636.606	173.39
637.016	115.14
637.427	190.39
637.837	202.52
638.247	151.55
638.657	163.69
639.067	139.41
639.477	195.24
639.887	236.5
640.297	132.13
640.706	129.7
641.116	180.68
641.526	151.55
641.935	173.39
642.345	156.4
642.755	107.86
643.164	151.55
643.573	144.27
643.983	110.29
644.392	124.85
644.801	139.41
645.211	136.99
645.62	153.98
646.029	197.67
646.438	183.1
646.847	243.78
647.256	146.7
647.665	170.97
648.074	161.26
648.483	146.7
648.892	156.4
649.3	115.14
649.709	202.52
650.118	219.51
650.526	168.54
650.935	86.01
651.343	122.42
651.752	146.7
652.16	185.53
652.568	268.06
652.977	141.84
653.385	153.98
653.793	112.71
654.201	183.1
654.609	190.39
655.017	112.71
655.425	107.86
655.833	151.55
656.241	161.26
656.649	139.41
657.057	110.29
657.464	78.73
657.872	129.7
658.28	207.38
658.687	190.39
659.095	71.45
659.502	183.1
659.91	134.56
660.317	173.39
660.724	207.38
661.132	156.4
661.539	158.83
661.946	173.39
662.353	86.01
662.76	134.56
663.167	207.38
663.574	234.08
663.981	209.8
664.388	122.42
664.795	209.8
665.202	129.7
665.608	149.12
666.015	178.25
666.422	175.82
666.828	175.82
667.235	129.7
667.641	187.96
668.047	105.43
668.454	112.71
668.86	173.39
669.266	86.01
669.673	180.68
670.079	129.7
670.485	144.27
670.891	207.38
671.297	217.08
671.703	158.83
672.109	136.99
672.515	170.97
672.92	105.43
673.326	134.56
673.732	214.66
674.138	161.26
674.543	224.37
674.949	122.42
675.354	59.32
675.76	187.96
676.165	204.95
676.57	134.56
676.976	168.54
677.381	100.58
677.786	156.4
678.191	127.28
678.596	129.7
679.001	156.4
679.406	202.52
679.811	153.98
680.216	149.12
680.621	153.98
681.026	139.41
681.43	120
681.835	78.73
682.24	107.86
682.644	107.86
683.049	161.26
683.453	146.7
683.858	187.96
684.262	161.26
684.667	153.98
685.071	209.8
685.475	149.12
685.879	115.14
686.283	132.13
686.687	166.11
687.091	153.98
687.495	212.23
687.899	163.69
688.303	132.13
688.707	175.82
689.111	149.12
689.514	95.72
689.918	168.54
690.322	134.56
690.725	190.39
691.129	251.07
691.532	146.7
691.936	170.97
692.339	207.38
692.742	170.97
693.146	226.79
693.549	178.25
693.952	200.09
694.355	105.43
694.758	59.32
695.161	234.08
695.564	115.14
695.967	158.83
696.37	144.27
696.773	166.11
697.175	151.55
697.578	221.94
697.981	185.53
698.383	200.09
698.786	170.97
699.188	124.85
699.591	100.58
699.993	180.68
700.395	202.52
700.798	161.26
701.2	212.23
701.602	161.26
702.004	204.95
702.406	168.54
702.808	158.83
703.21	139.41
703.612	151.55
704.014	224.37
704.416	202.52
704.818	241.36
705.219	212.23
705.621	289.9
706.023	173.39
706.424	187.96
706.826	219.51
707.227	190.39
707.629	231.65
708.03	270.48
708.431	219.51
708.832	173.39
709.234	253.49
709.635	204.95
710.036	212.23
710.437	314.17
710.838	268.06
711.239	253.49
711.64	156.4
712.041	268.06
712.441	263.2
712.842	251.07
713.243	265.63
713.643	306.89
714.044	306.89
714.445	285.05
714.845	306.89
715.246	345.73
715.646	282.62
716.046	265.63
716.447	287.47
716.847	265.63
717.247	389.42
717.647	292.33
718.047	302.04
718.447	367.57
718.847	275.34
719.247	277.77
719.647	437.96
720.047	379.71
720.446	294.76
720.846	386.99
721.246	382.14
721.645	367.57
722.045	348.15
722.444	384.56
722.844	462.23
723.243	408.84
723.643	428.25
724.042	416.12
724.441	408.84
724.84	467.09
725.24	479.22
725.639	554.47
726.038	539.91
726.437	527.77
726.836	525.34
727.234	542.33
727.633	510.78
728.032	634.57
728.431	556.9
728.83	607.87
729.228	683.11
729.627	683.11
730.025	653.98
730.424	731.66
730.822	802.05
731.22	874.86
731.619	1003.5
732.017	913.7
732.415	991.37
732.813	1081.18
733.212	1185.55
733.61	1066.61
734.008	1270.5
734.406	1326.33
734.803	1462.25
735.201	1573.9
735.599	1700.12
735.997	1794.78
736.395	1896.72
736.792	1916.14
737.19	2020.51
737.587	2122.45
737.985	2187.99
738.382	2285.08
738.78	2452.56
739.177	2518.09
739.574	2678.29
739.971	2874.89
740.369	3020.53
740.766	3076.35
741.163	3251.11
741.56	3299.66
741.957	3530.24
742.354	3632.19
742.751	3816.66
743.147	4088.5
743.544	3979.28
743.941	4333.65
744.338	4501.13
744.734	4641.91
745.131	4916.19
745.527	5338.52
745.924	5382.21
746.32	5787.56
746.716	5942.9
747.113	6459.9
747.509	6612.82
747.905	6775.44
748.301	7124.96
748.697	7455.06
749.093	7794.87
749.489	8209.93
749.885	8576.44
750.281	8799.74
750.677	9304.6
751.073	9695.39
751.468	10144.42
751.864	10214.81
752.26	10569.19
752.655	11256.09
753.051	11525.51
753.446	12100.76
753.842	12595.92
754.237	13399.33
754.632	12858.06
755.028	13542.53
755.423	13940.6
755.818	14086.23
756.213	14151.77
756.608	14581.39
757.003	15003.72
757.398	14940.61
757.793	15088.68
758.188	15612.96
758.583	16360.54
758.977	15967.33
759.372	16828.99
759.767	17627.55
760.161	18586.3
760.556	18646.98
760.95	19748.94
761.345	20731.97
761.739	21792.66
762.133	21472.27
762.527	23049.96
762.922	24164.06
763.316	24700.48
763.71	24649.5
764.104	25581.56
764.498	26678.66
764.892	26414.09
765.286	26872.84
765.68	28307.33
766.073	29314.62
766.467	28620.44
766.861	28758.79
767.255	30756.39
767.648	31819.52
768.042	31520.97
768.435	32011.27
768.829	32897.2
769.222	34125.38
769.615	34132.66
770.008	33421.48
770.402	34115.67
770.795	35508.9
771.188	35564.72
771.581	33872.95
771.974	34436.06
772.367	35805.02
772.76	36103.57
773.153	33773.43
773.545	33698.19
773.938	35783.17
774.331	36416.68
774.724	35574.43
775.116	36426.39
775.509	38623.02
775.901	41329.37
776.294	40851.21
776.686	39941
777.078	41516.27
777.471	44661.95
777.863	45649.83
778.255	44254.18
778.647	44511.46
779.039	47096.45
779.431	47846.47
779.823	46280.91
780.215	45780.9
780.607	46336.73
780.999	49722.71
781.39	49001.82
781.782	47960.55
782.174	47530.93
782.565	50060.09
782.957	50807.68
783.348	50637.77
783.74	47839.18
784.131	49057.65
784.522	51625.65
784.914	51285.84
785.305	49513.97
785.696	47276.07
786.087	48691.14
786.478	48936.29
786.869	47324.61
787.26	44756.61
787.651	44004.17
788.042	45496.92
788.433	44370.68
788.823	43557.56
789.214	40899.76
789.605	39860.91
789.995	40795.39
790.386	41103.64
790.776	39802.65
791.167	37848.74
791.557	39157.01
791.948	42195.89
792.338	43164.35
792.728	42205.6
793.118	39438.57
793.508	41234.71
793.898	42955.61
794.288	44703.21
794.678	42528.42
795.068	40115.76
795.458	41353.65
795.848	43559.99
796.238	44858.56
796.627	42613.38
797.017	39584.2
797.406	40098.77
797.796	42581.82
798.185	43581.84
798.575	42001.72
798.964	39868.19
799.354	40059.94
799.743	42455.61
800.132	44509.04
800.521	43642.52
800.91	41096.36
801.299	39363.32
801.688	42030.84
802.077	42407.06
802.466	43055.13
802.855	40217.71
803.244	37224.94
803.633	38137.58
804.021	40030.81
804.41	40006.54
804.799	38487.1
805.187	35249.18
805.576	33508.86
805.964	34484.61
806.352	34700.63
806.741	34746.75
807.129	31800.1
807.517	30377.75
807.905	31317.08
808.293	34285.58
808.681	35195.78
809.069	33756.44
809.457	32147.19
809.845	31139.9
810.233	32669.05
810.621	35127.82
811.009	35487.05
811.396	34108.39
811.784	31081.64
812.171	30598.63
812.559	32319.53
812.946	33686.05
813.334	33457.89
813.721	31130.19
814.108	28380.14
814.496	28761.22
814.883	29916.58
815.27	32358.36
815.657	31783.11
816.044	29758.81
816.431	27627.71
816.818	27613.14
817.205	29047.63
817.592	31113.2
817.979	30380.18
818.365	28346.16
818.752	25574.28
819.139	24516.01
819.525	25365.53
819.912	27207.8
820.298	26380.11
820.685	24705.33
821.071	22433.45
821.457	21193.14
821.843	21190.71
822.23	22331.51
822.616	22154.32
823.002	20498.95
823.388	18525.62
823.774	17064.43
824.16	16780.45
824.546	17234.34
824.931	18197.95
825.317	18096
825.703	16450.35
826.089	15163.92
826.474	14780.42
826.86	15251.3
827.245	16629.96
827.631	16707.63
828.016	16251.31
828.401	14309.54
828.787	13161.46
829.172	13100.78
829.557	13697.88
829.942	14120.21
830.327	14292.55
830.712	13362.92
831.097	11700.27
831.482	11297.35
831.867	11025.51
832.252	12222.13
832.636	12224.55
833.021	12217.27
833.406	11353.18
833.79	10151.71
834.175	9440.53
834.559	9974.52
834.944	10464.82
835.328	10865.31
835.713	10724.53
836.097	9520.63
836.481	8469.64
836.865	7860.41
837.249	8015.75
837.633	8149.25
838.017	8811.88
838.401	8624.98
838.785	7756.04
839.169	6751.17
839.553	6086.11
839.937	5891.93
840.32	6168.63
840.704	6535.14
841.087	6404.07
841.471	5955.04
841.854	5166.19
842.238	4610.36
842.621	4348.22
843.004	4746.28
843.388	5251.14
843.771	5510.86
844.154	5302.12
844.537	4836.09
844.92	4141.9
845.303	3819.08
845.686	3870.05
846.069	4238.99
846.452	4726.86
846.834	4705.02
847.217	4634.63
847.6	3877.34
847.982	3302.08
848.365	3234.12
848.748	3238.98
849.13	3734.13
849.512	3972
849.895	3889.47
850.277	3581.21
850.659	3047.23
851.041	2833.63
851.423	2522.95
851.806	2765.67
852.188	3171.01
852.57	3362.76
852.951	3447.72
853.333	3139.46
853.715	2700.13
854.097	2282.65
854.479	2180.71
854.86	2212.26
855.242	2518.09
855.623	2656.44
856.005	2656.44
856.386	2370.03
856.768	2052.06
857.149	1828.76
857.53	1564.19
857.911	1595.75
858.292	1772.93
858.674	1976.82
859.055	1911.29
859.436	1850.61
859.817	1617.59
860.197	1309.33
860.578	1238.95
860.959	1141.86
861.34	1285.06
861.72	1450.11
862.101	1374.87
862.482	1420.99
862.862	1294.77
863.243	1178.26
863.623	1008.36
864.003	952.53
864.384	787.48
864.764	1042.34
865.144	981.66
865.524	1243.8
865.904	1090.88
866.284	1027.78
866.664	998.65
867.044	855.44
867.424	724.37
867.804	663.69
868.183	840.88
868.563	850.59
868.943	903.99
869.322	838.45
869.702	780.2
870.081	731.66
870.461	620
870.84	595.73
871.22	501.07
871.599	598.16
871.978	578.74
872.357	683.11
872.736	610.29
873.115	620
873.494	675.83
873.873	469.52
874.252	469.52
874.631	396.7
875.01	365.15
875.388	416.12
875.767	437.96
876.146	501.07
876.524	501.07
876.903	403.98
877.281	350.58
877.66	357.86
878.038	263.2
878.416	297.18
878.794	306.89
879.173	314.17
879.551	294.76
879.929	365.15
880.307	306.89
880.685	336.02
881.063	362.72
881.441	292.33
881.818	314.17
882.196	236.5
882.574	200.09
882.951	251.07
883.329	275.34
883.707	214.66
884.084	297.18
884.461	282.62
884.839	195.24
885.216	183.1
885.593	260.77
885.971	326.31
886.348	226.79
886.725	255.92
887.102	214.66
887.479	238.93
887.856	280.19
888.233	161.26
888.609	226.79
888.986	204.95
889.363	212.23
889.74	204.95
890.116	197.67
890.493	217.08
890.869	173.39
891.246	255.92
891.622	161.26
891.998	200.09
892.375	190.39
892.751	190.39
893.127	134.56
893.503	127.28
893.879	212.23
894.255	180.68
894.631	207.38
895.007	209.8
895.383	144.27
895.759	146.7
896.134	180.68
896.51	136.99
896.886	98.15
897.261	112.71
897.637	156.4
898.012	134.56
898.388	166.11
898.763	122.42
899.138	115.14
899.514	202.52
899.889	146.7
900.264	129.7
900.639	59.32
901.014	127.28
901.389	209.8
901.764	110.29
902.139	134.56
902.513	127.28
902.888	117.57
903.263	139.41
903.638	73.88
904.012	197.67
904.387	158.83
904.761	144.27
905.136	136.99
905.51	168.54
905.884	158.83
906.259	153.98
906.633	168.54
907.007	163.69
907.381	127.28
907.755	168.54
908.129	180.68
908.503	209.8
908.877	129.7
909.251	156.4
909.624	120
909.998	153.98
910.372	166.11
910.745	168.54
911.119	141.84
911.492	156.4
911.866	163.69
912.239	197.67
912.612	190.39
912.986	141.84
913.359	122.42
913.732	136.99
914.105	146.7
914.478	141.84
914.851	151.55
915.224	139.41
915.597	95.72
915.97	156.4
916.343	127.28
916.715	170.97
917.088	170.97
917.461	117.57
917.833	83.59
918.206	185.53
918.578	170.97
918.951	105.43
919.323	149.12
919.695	149.12
920.067	129.7
920.44	100.58
920.812	168.54
921.184	170.97
921.556	192.81
921.928	146.7
922.3	86.01
922.672	124.85
923.043	112.71
923.415	139.41
923.787	185.53
924.158	129.7
924.53	100.58
924.901	144.27
925.273	158.83
925.644	139.41
926.016	144.27
926.387	141.84
926.758	178.25
927.129	156.4
927.5	110.29
927.872	129.7
928.243	146.7
928.613	129.7
928.984	134.56
929.355	122.42
929.726	136.99
930.097	117.57
930.467	132.13
930.838	229.22
931.209	83.59
931.579	132.13
931.95	151.55
932.32	90.87
932.69	197.67
933.061	136.99
933.431	124.85
933.801	146.7
934.171	122.42
934.541	78.73
934.911	163.69
935.281	103.01
935.651	146.7
936.021	134.56
936.391	149.12
936.761	112.71
937.13	115.14
937.5	141.84
937.87	173.39
938.239	234.08
938.609	105.43
938.978	178.25
939.347	158.83
939.717	146.7
940.086	83.59
940.455	112.71
940.824	134.56
941.193	61.74
941.562	156.4
941.931	129.7
942.3	166.11
942.669	134.56
943.038	122.42
943.407	175.82
943.775	134.56
944.144	61.74
944.513	170.97
944.881	161.26
945.25	139.41
945.618	117.57
945.986	117.57
946.355	120
946.723	88.44
947.091	122.42
947.459	105.43
947.827	178.25
948.195	129.7
948.563	98.15
948.931	93.3
949.299	95.72
949.667	59.32
950.035	156.4
950.402	178.25
950.77	175.82
951.138	183.1
951.505	166.11
951.873	110.29
952.24	139.41
952.607	83.59
952.975	141.84
953.342	146.7
953.709	95.72
954.076	127.28
954.443	86.01
954.81	158.83
955.177	204.95
955.544	136.99
955.911	183.1
956.278	90.87
956.645	134.56
957.012	200.09
957.378	100.58
957.745	93.3
958.111	175.82
958.478	146.7
958.844	153.98
959.211	88.44
959.577	163.69
959.943	117.57
960.309	178.25
960.675	39.9
961.042	32.62
961.408	144.27
961.774	141.84
962.139	144.27
962.505	105.43
962.871	90.87
963.237	103.01
963.603	146.7
963.968	178.25
964.334	141.84
964.699	37.47
965.065	105.43
965.43	122.42
965.796	112.71
966.161	86.01
966.526	61.74
966.891	187.96
967.256	124.85
967.622	158.83
967.987	122.42
968.352	129.7
968.716	192.81
969.081	153.98
969.446	78.73
969.811	146.7
970.176	122.42
970.54	195.24
970.905	107.86
971.269	183.1
971.634	76.31
971.998	117.57
972.363	134.56
972.727	105.43
973.091	204.95
973.455	132.13
973.819	139.41
974.183	197.67
974.547	136.99
974.911	158.83
975.275	127.28
975.639	166.11
976.003	129.7
976.367	124.85
976.73	146.7
977.094	166.11
977.458	185.53
977.821	86.01
978.185	90.87
978.548	144.27
978.911	153.98
979.275	166.11
979.638	161.26
980.001	127.28
980.364	100.58
980.727	124.85
981.09	132.13
981.453	134.56
981.816	195.24
982.179	166.11
982.542	127.28
982.905	78.73
983.267	146.7
983.63	59.32
983.992	124.85
984.355	59.32
984.717	90.87
985.08	141.84
985.442	100.58
985.804	158.83
986.167	146.7
986.529	83.59
986.891	134.56
987.253	168.54
987.615	120
987.977	166.11
988.339	151.55
988.701	122.42
989.062	146.7
989.424	54.46
989.786	175.82
990.147	175.82
990.509	170.97
990.87	163.69
991.232	149.12
991.593	149.12
991.955	124.85
992.316	163.69
992.677	132.13
993.038	183.1
993.399	170.97
993.76	115.14
994.121	168.54
994.482	124.85
994.843	161.26
995.204	144.27
995.565	117.57
995.926	117.57
996.286	139.41
996.647	175.82
997.007	146.7
997.368	139.41
997.728	105.43
998.089	115.14
998.449	42.32
998.809	149.12
999.169	141.84
999.53	173.39
999.89	158.83
1000.25	136.99
1000.61	139.41
1000.97	117.57
1001.329	175.82
1001.689	183.1
1002.049	156.4
1002.409	185.53
1002.768	120
1003.128	117.57
1003.487	173.39
1003.847	161.26
1004.206	153.98
1004.566	117.57
1004.925	158.83
1005.284	139.41
1005.643	81.16
1006.003	161.26
1006.362	161.26
1006.721	122.42
1007.08	149.12
1007.438	161.26
1007.797	136.99
1008.156	156.4
1008.515	151.55
1008.874	153.98
1009.232	112.71
1009.591	168.54
1009.949	132.13
1010.308	129.7
1010.666	134.56
1011.024	178.25
1011.383	100.58
1011.741	122.42
1012.099	161.26
1012.457	98.15
1012.815	59.32
1013.173	156.4
1013.531	185.53
1013.889	207.38
1014.247	136.99
1014.605	98.15
1014.962	178.25
1015.32	197.67
1015.678	178.25
1016.035	112.71
1016.393	107.86
1016.75	103.01
1017.107	144.27
1017.465	134.56
1017.822	122.42
1018.179	156.4
1018.536	180.68
1018.894	134.56
1019.251	153.98
1019.608	95.72
1019.964	134.56
1020.321	166.11
1020.678	163.69
1021.035	127.28
1021.392	202.52
1021.748	81.16
1022.105	90.87
1022.461	161.26
1022.818	153.98
1023.174	132.13
1023.531	156.4
1023.887	183.1
1024.243	156.4
1024.599	139.41
1024.955	161.26
1025.311	149.12
1025.667	86.01
1026.023	134.56
1026.379	132.13
1026.735	166.11
1027.091	83.59
1027.447	214.66
