189.514	36.71
189.973	36.71
190.431	36.71
190.889	-11.83
191.348	7.59
191.806	-38.53
192.264	27
192.722	-23.97
193.18	0.3
193.638	-21.54
194.096	-31.25
194.554	-26.4
195.012	-55.52
195.47	31.86
195.928	-2.12
196.385	-4.55
196.843	-21.54
197.301	29.43
197.758	19.72
198.216	0.3
198.674	75.55
199.131	2.73
199.589	94.97
200.046	41.57
200.503	94.97
200.961	24.58
201.418	7.59
201.875	90.11
202.332	124.09
202.79	46.42
203.247	133.8
203.704	111.96
204.161	80.4
204.618	153.22
205.075	119.24
205.532	77.97
205.989	92.54
206.445	165.35
206.902	172.64
207.359	148.36
207.816	99.82
208.272	128.95
208.729	165.35
209.185	124.09
209.642	114.38
210.098	160.5
210.555	223.61
211.011	223.61
211.467	124.09
211.924	114.38
212.38	133.8
212.836	133.8
213.292	124.09
213.748	187.2
214.204	136.23
214.66	194.48
215.116	189.63
215.572	148.36
216.028	182.35
216.484	177.49
216.94	141.08
217.396	102.25
217.851	155.65
218.307	92.54
218.763	131.37
219.218	138.66
219.674	119.24
220.129	158.07
220.585	97.39
221.04	121.66
221.496	150.79
221.951	138.66
222.406	145.94
222.861	179.92
223.317	133.8
223.772	87.68
224.227	114.38
224.682	111.96
225.137	114.38
225.592	192.05
226.047	70.69
226.502	143.51
226.957	97.39
227.411	121.66
227.866	155.65
228.321	128.95
228.776	196.91
229.23	90.11
229.685	94.97
230.139	136.23
230.594	109.53
231.048	107.1
231.503	148.36
231.957	114.38
232.411	94.97
232.865	114.38
233.32	124.09
233.774	158.07
234.228	102.25
234.682	162.93
235.136	131.37
235.59	92.54
236.044	131.37
236.498	165.35
236.952	141.08
237.406	189.63
237.86	104.67
238.313	109.53
238.767	138.66
239.221	170.21
239.674	107.1
240.128	143.51
240.581	170.21
241.035	116.81
241.488	102.25
241.942	196.91
242.395	94.97
242.848	155.65
243.301	141.08
243.755	80.4
244.208	124.09
244.661	131.37
245.114	90.11
245.567	114.38
246.02	162.93
246.473	111.96
246.926	143.51
247.379	53.7
247.832	138.66
248.284	94.97
248.737	90.11
249.19	148.36
249.642	119.24
250.095	145.94
250.547	153.22
251	109.53
251.452	73.12
251.905	114.38
252.357	63.41
252.81	128.95
253.262	119.24
253.714	148.36
254.166	145.94
254.618	182.35
255.07	148.36
255.523	150.79
255.975	175.06
256.427	153.22
256.878	68.27
257.33	160.5
257.782	124.09
258.234	131.37
258.686	206.62
259.137	189.63
259.589	264.87
260.041	116.81
260.492	138.66
260.944	172.64
261.395	107.1
261.847	143.51
262.298	138.66
262.749	172.64
263.201	90.11
263.652	124.09
264.103	160.5
264.554	70.69
265.005	141.08
265.457	128.95
265.908	182.35
266.359	192.05
266.809	165.35
267.26	165.35
267.711	109.53
268.162	138.66
268.613	124.09
269.064	148.36
269.514	94.97
269.965	124.09
270.415	114.38
270.866	131.37
271.316	119.24
271.767	136.23
272.217	155.65
272.668	162.93
273.118	114.38
273.568	201.76
274.019	75.55
274.469	124.09
274.919	143.51
275.369	167.78
275.819	160.5
276.269	177.49
276.719	162.93
277.169	150.79
277.619	158.07
278.069	128.95
278.518	111.96
278.968	111.96
279.418	155.65
279.867	165.35
280.317	70.69
280.767	162.93
281.216	177.49
281.666	211.47
282.115	90.11
282.564	104.67
283.014	133.8
283.463	158.07
283.912	121.66
284.361	148.36
284.811	121.66
285.26	194.48
285.709	58.56
286.158	211.47
286.607	99.82
287.056	131.37
287.505	92.54
287.953	138.66
288.402	131.37
288.851	141.08
289.3	92.54
289.748	189.63
290.197	167.78
290.646	87.68
291.094	133.8
291.543	102.25
291.991	128.95
292.439	179.92
292.888	145.94
293.336	119.24
293.784	107.1
294.233	109.53
294.681	124.09
295.129	141.08
295.577	107.1
296.025	116.81
296.473	107.1
296.921	184.77
297.369	155.65
297.817	128.95
298.264	162.93
298.712	158.07
299.16	97.39
299.608	199.34
300.055	90.11
300.503	153.22
300.95	153.22
301.398	141.08
301.845	128.95
302.293	114.38
302.74	124.09
303.187	133.8
303.635	160.5
304.082	179.92
304.529	119.24
304.976	104.67
305.423	102.25
305.87	63.41
306.317	70.69
306.764	70.69
307.211	148.36
307.658	196.91
308.105	201.76
308.552	133.8
308.998	111.96
309.445	136.23
309.892	177.49
310.338	124.09
310.785	58.56
311.231	153.22
311.678	121.66
312.124	162.93
312.571	107.1
313.017	119.24
313.463	158.07
313.909	116.81
314.356	136.23
314.802	124.09
315.248	65.84
315.694	102.25
316.14	82.83
316.586	148.36
317.032	133.8
317.478	133.8
317.923	206.62
318.369	126.52
318.815	111.96
319.261	148.36
319.706	148.36
320.152	121.66
320.597	141.08
321.043	97.39
321.488	141.08
321.934	143.51
322.379	162.93
322.824	160.5
323.27	99.82
323.715	138.66
324.16	111.96
324.605	141.08
325.05	150.79
325.495	107.1
325.94	145.94
326.385	158.07
326.83	153.22
327.275	77.97
327.72	192.05
328.165	128.95
328.61	138.66
329.054	87.68
329.499	158.07
329.943	124.09
330.388	201.76
330.832	145.94
331.277	160.5
331.721	179.92
332.166	80.4
332.61	82.83
333.054	165.35
333.499	145.94
333.943	119.24
334.387	155.65
334.831	187.2
335.275	218.75
335.719	128.95
336.163	175.06
336.607	99.82
337.051	133.8
337.495	153.22
337.938	153.22
338.382	124.09
338.826	165.35
339.269	158.07
339.713	90.11
340.157	145.94
340.6	155.65
341.044	138.66
341.487	175.06
341.93	75.55
342.374	136.23
342.817	138.66
343.26	155.65
343.703	199.34
344.146	138.66
344.59	148.36
345.033	153.22
345.476	138.66
345.919	107.1
346.361	107.1
346.804	90.11
347.247	160.5
347.69	170.21
348.133	162.93
348.575	143.51
349.018	126.52
349.461	119.24
349.903	155.65
350.346	128.95
350.788	150.79
351.23	70.69
351.673	87.68
352.115	206.62
352.557	46.42
353	77.97
353.442	65.84
353.884	141.08
354.326	148.36
354.768	167.78
355.21	153.22
355.652	165.35
356.094	80.4
356.536	82.83
356.978	126.52
357.419	150.79
357.861	141.08
358.303	170.21
358.744	97.39
359.186	128.95
359.627	182.35
360.069	160.5
360.51	189.63
360.952	148.36
361.393	121.66
361.834	124.09
362.276	77.97
362.717	153.22
363.158	165.35
363.599	194.48
364.04	97.39
364.481	107.1
364.922	109.53
365.363	116.81
365.804	189.63
366.245	131.37
366.686	116.81
367.126	172.64
367.567	124.09
368.008	136.23
368.448	90.11
368.889	165.35
369.33	162.93
369.77	119.24
370.21	92.54
370.651	128.95
371.091	136.23
371.531	97.39
371.972	116.81
372.412	182.35
372.852	111.96
373.292	160.5
373.732	189.63
374.172	158.07
374.612	160.5
375.052	109.53
375.492	126.52
375.932	199.34
376.372	141.08
376.811	133.8
377.251	145.94
377.691	196.91
378.13	107.1
378.57	177.49
379.009	107.1
379.449	128.95
379.888	109.53
380.328	128.95
380.767	90.11
381.206	189.63
381.645	87.68
382.085	153.22
382.524	133.8
382.963	36.71
383.402	150.79
383.841	167.78
384.28	80.4
384.719	121.66
385.158	73.12
385.596	150.79
386.035	111.96
386.474	160.5
386.913	109.53
387.351	114.38
387.79	90.11
388.228	73.12
388.667	160.5
389.105	172.64
389.544	107.1
389.982	199.34
390.42	128.95
390.859	104.67
391.297	85.26
391.735	63.41
392.173	145.94
392.611	158.07
393.049	148.36
393.487	116.81
393.925	128.95
394.363	128.95
394.801	179.92
395.239	136.23
395.676	150.79
396.114	141.08
396.552	116.81
396.989	119.24
397.427	199.34
397.864	150.79
398.302	119.24
398.739	121.66
399.177	87.68
399.614	148.36
400.051	70.69
400.488	124.09
400.926	60.98
401.363	126.52
401.8	226.04
402.237	170.21
402.674	172.64
403.111	136.23
403.548	204.19
403.985	99.82
404.421	97.39
404.858	111.96
405.295	204.19
405.732	213.9
406.168	179.92
406.605	116.81
407.041	160.5
407.478	148.36
407.914	196.91
408.351	119.24
408.787	87.68
409.223	107.1
409.66	119.24
410.096	128.95
410.532	119.24
410.968	111.96
411.404	172.64
411.84	158.07
412.276	138.66
412.712	209.04
413.148	189.63
413.584	145.94
414.02	143.51
414.455	175.06
414.891	126.52
415.327	80.4
415.762	104.67
416.198	77.97
416.633	138.66
417.069	131.37
417.504	170.21
417.94	179.92
418.375	119.24
418.81	109.53
419.245	92.54
419.681	131.37
420.116	116.81
420.551	167.78
420.986	82.83
421.421	221.18
421.856	228.46
422.291	111.96
422.726	160.5
423.16	175.06
423.595	119.24
424.03	82.83
424.464	170.21
424.899	136.23
425.334	87.68
425.768	133.8
426.203	116.81
426.637	148.36
427.071	172.64
427.506	150.79
427.94	145.94
428.374	221.18
428.809	111.96
429.243	179.92
429.677	124.09
430.111	150.79
430.545	148.36
430.979	167.78
431.413	167.78
431.847	141.08
432.28	218.75
432.714	160.5
433.148	179.92
433.582	196.91
434.015	97.39
434.449	92.54
434.882	104.67
435.316	172.64
435.749	128.95
436.183	148.36
436.616	141.08
437.049	175.06
437.483	167.78
437.916	75.55
438.349	165.35
438.782	116.81
439.215	175.06
439.648	158.07
440.081	126.52
440.514	167.78
440.947	150.79
441.38	206.62
441.813	184.77
442.245	160.5
442.678	192.05
443.111	192.05
443.543	153.22
443.976	218.75
444.408	150.79
444.841	189.63
445.273	162.93
445.705	143.51
446.138	204.19
446.57	153.22
447.002	204.19
447.434	252.73
447.867	204.19
448.299	194.48
448.731	235.74
449.163	257.59
449.595	153.22
450.026	262.44
450.458	194.48
450.89	160.5
451.322	206.62
451.754	155.65
452.185	175.06
452.617	162.93
453.048	111.96
453.48	184.77
453.911	267.3
454.343	216.33
454.774	153.22
455.205	184.77
455.637	264.87
456.068	255.16
456.499	199.34
456.93	179.92
457.361	199.34
457.792	145.94
458.223	167.78
458.654	192.05
459.085	196.91
459.516	204.19
459.947	230.89
460.378	175.06
460.808	211.47
461.239	209.04
461.669	187.2
462.1	192.05
462.531	209.04
462.961	243.03
463.391	194.48
463.822	201.76
464.252	230.89
464.682	257.59
465.113	204.19
465.543	235.74
465.973	189.63
466.403	187.2
466.833	243.03
467.263	189.63
467.693	204.19
468.123	145.94
468.553	145.94
468.983	206.62
469.412	141.08
469.842	286.72
470.272	269.73
470.701	111.96
471.131	119.24
471.56	182.35
471.99	177.49
472.419	158.07
472.849	247.88
473.278	133.8
473.707	141.08
474.136	187.2
474.566	235.74
474.995	177.49
475.424	211.47
475.853	182.35
476.282	138.66
476.711	155.65
477.14	172.64
477.569	184.77
477.997	187.2
478.426	184.77
478.855	97.39
479.283	211.47
479.712	153.22
480.141	155.65
480.569	126.52
480.998	240.6
481.426	172.64
481.854	138.66
482.283	230.89
482.711	206.62
483.139	230.89
483.567	206.62
483.995	167.78
484.424	167.78
484.852	162.93
485.28	216.33
485.708	160.5
486.135	184.77
486.563	262.44
486.991	238.17
487.419	175.06
487.847	194.48
488.274	138.66
488.702	141.08
489.129	179.92
489.557	179.92
489.984	170.21
490.412	184.77
490.839	230.89
491.266	126.52
491.694	201.76
492.121	240.6
492.548	155.65
492.975	126.52
493.402	196.91
493.829	155.65
494.256	189.63
494.683	143.51
495.11	184.77
495.537	221.18
495.964	167.78
496.39	138.66
496.817	111.96
497.244	192.05
497.67	133.8
498.097	107.1
498.523	189.63
498.95	167.78
499.376	148.36
499.803	133.8
500.229	226.04
500.655	119.24
501.081	158.07
501.508	158.07
501.934	143.51
502.36	189.63
502.786	187.2
503.212	153.22
503.638	162.93
504.064	155.65
504.489	150.79
504.915	126.52
505.341	124.09
505.767	172.64
506.192	194.48
506.618	167.78
507.043	141.08
507.469	119.24
507.894	194.48
508.32	141.08
508.745	238.17
509.17	182.35
509.596	121.66
510.021	153.22
510.446	138.66
510.871	150.79
511.296	133.8
511.721	138.66
512.146	160.5
512.571	204.19
512.996	133.8
513.421	92.54
513.845	85.26
514.27	223.61
514.695	124.09
515.119	172.64
515.544	235.74
515.969	167.78
516.393	179.92
516.817	269.73
517.242	204.19
517.666	121.66
518.09	136.23
518.515	184.77
518.939	199.34
519.363	335.26
519.787	155.65
520.211	124.09
520.635	245.45
521.059	204.19
521.483	192.05
521.907	230.89
522.331	170.21
522.754	150.79
523.178	124.09
523.602	131.37
524.025	172.64
524.449	155.65
524.872	172.64
525.296	189.63
525.719	126.52
526.143	235.74
526.566	155.65
526.989	80.4
527.412	182.35
527.836	121.66
528.259	187.2
528.682	201.76
529.105	177.49
529.528	138.66
529.951	194.48
530.374	160.5
530.796	160.5
531.219	153.22
531.642	172.64
532.065	167.78
532.487	158.07
532.91	221.18
533.332	116.81
533.755	136.23
534.177	179.92
534.6	199.34
535.022	165.35
535.444	179.92
535.867	199.34
536.289	126.52
536.711	167.78
537.133	189.63
537.555	155.65
537.977	148.36
538.399	187.2
538.821	206.62
539.243	124.09
539.665	172.64
540.086	116.81
540.508	204.19
540.93	175.06
541.351	216.33
541.773	240.6
542.195	145.94
542.616	196.91
543.037	162.93
543.459	194.48
543.88	158.07
544.301	124.09
544.723	104.67
545.144	196.91
545.565	162.93
545.986	223.61
546.407	162.93
546.828	104.67
547.249	155.65
547.67	192.05
548.091	175.06
548.512	121.66
548.932	158.07
549.353	148.36
549.774	179.92
550.194	172.64
550.615	128.95
551.035	150.79
551.456	158.07
551.876	141.08
552.296	153.22
552.717	145.94
553.137	187.2
553.557	128.95
553.977	131.37
554.397	187.2
554.817	138.66
555.237	177.49
555.657	143.51
556.077	143.51
556.497	194.48
556.917	175.06
557.337	155.65
557.756	182.35
558.176	119.24
558.596	170.21
559.015	133.8
559.435	119.24
559.854	194.48
560.274	141.08
560.693	97.39
561.112	102.25
561.532	179.92
561.951	153.22
562.37	68.27
562.789	145.94
563.208	184.77
563.627	177.49
564.046	192.05
564.465	150.79
564.884	109.53
565.303	138.66
565.722	114.38
566.14	194.48
566.559	160.5
566.978	162.93
567.396	145.94
567.815	111.96
568.233	233.32
568.652	204.19
569.07	153.22
569.489	82.83
569.907	192.05
570.325	201.76
570.743	170.21
571.161	148.36
571.58	211.47
571.998	143.51
572.416	221.18
572.833	155.65
573.251	209.04
573.669	162.93
574.087	240.6
574.505	107.1
574.922	187.2
575.34	128.95
575.758	153.22
576.175	158.07
576.593	162.93
577.01	177.49
577.428	167.78
577.845	1757.61
578.262	238.17
578.68	194.48
579.097	150.79
579.514	133.8
579.931	133.8
580.348	136.23
580.765	179.92
581.182	136.23
581.599	121.66
582.016	184.77
582.433	179.92
582.849	158.07
583.266	124.09
583.683	131.37
584.099	211.47
584.516	148.36
584.933	182.35
585.349	136.23
585.765	226.04
586.182	204.19
586.598	177.49
587.014	204.19
587.431	138.66
587.847	138.66
588.263	196.91
588.679	187.2
589.095	175.06
589.511	160.5
589.927	153.22
590.343	162.93
590.759	158.07
591.174	141.08
591.59	165.35
592.006	126.52
592.421	184.77
592.837	138.66
593.252	167.78
593.668	124.09
594.083	162.93
594.499	172.64
594.914	148.36
595.329	138.66
595.745	170.21
596.16	114.38
596.575	172.64
596.99	160.5
597.405	97.39
597.82	119.24
598.235	160.5
598.65	102.25
599.065	102.25
599.479	167.78
599.894	102.25
600.309	124.09
600.724	182.35
601.138	177.49
601.553	158.07
601.967	143.51
602.382	128.95
602.796	160.5
603.21	90.11
603.625	136.23
604.039	189.63
604.453	136.23
604.867	211.47
605.281	226.04
605.695	138.66
606.109	136.23
606.523	150.79
606.937	216.33
607.351	306.13
607.765	150.79
608.178	158.07
608.592	196.91
609.006	187.2
609.419	170.21
609.833	109.53
610.246	102.25
610.66	201.76
611.073	124.09
611.487	182.35
611.9	136.23
612.313	209.04
612.726	94.97
613.139	194.48
613.553	172.64
613.966	179.92
614.379	189.63
614.792	162.93
615.204	204.19
615.617	87.68
616.03	167.78
616.443	189.63
616.856	155.65
617.268	128.95
617.681	177.49
618.093	82.83
618.506	182.35
618.918	184.77
619.331	153.22
619.743	213.9
620.155	199.34
620.568	201.76
620.98	162.93
621.392	150.79
621.804	177.49
622.216	204.19
622.628	187.2
623.04	170.21
623.452	136.23
623.864	126.52
624.276	150.79
624.687	170.21
625.099	148.36
625.511	114.38
625.922	145.94
626.334	167.78
626.745	87.68
627.157	199.34
627.568	90.11
627.979	99.82
628.391	153.22
628.802	158.07
629.213	121.66
629.624	177.49
630.035	165.35
630.446	114.38
630.857	119.24
631.268	145.94
631.679	196.91
632.09	138.66
632.501	165.35
632.912	165.35
633.322	158.07
633.733	99.82
634.144	223.61
634.554	128.95
634.965	196.91
635.375	111.96
635.785	187.2
636.196	158.07
636.606	138.66
637.016	175.06
637.427	179.92
637.837	199.34
638.247	192.05
638.657	111.96
639.067	124.09
639.477	141.08
639.887	114.38
640.297	182.35
640.706	97.39
641.116	206.62
641.526	85.26
641.935	172.64
642.345	165.35
642.755	165.35
643.164	133.8
643.573	204.19
643.983	216.33
644.392	124.09
644.801	111.96
645.211	213.9
645.62	196.91
646.029	179.92
646.438	114.38
646.847	150.79
647.256	201.76
647.665	184.77
648.074	167.78
648.483	131.37
648.892	104.67
649.3	99.82
649.709	109.53
650.118	165.35
650.526	187.2
650.935	131.37
651.343	153.22
651.752	124.09
652.16	145.94
652.568	167.78
652.977	153.22
653.385	119.24
653.793	124.09
654.201	131.37
654.609	119.24
655.017	138.66
655.425	148.36
655.833	131.37
656.241	143.51
656.649	99.82
657.057	153.22
657.464	128.95
657.872	177.49
658.28	182.35
658.687	128.95
659.095	182.35
659.502	204.19
659.91	119.24
660.317	167.78
660.724	179.92
661.132	116.81
661.539	116.81
661.946	187.2
662.353	141.08
662.76	233.32
663.167	167.78
663.574	99.82
663.981	92.54
664.388	97.39
664.795	170.21
665.202	124.09
665.608	189.63
666.015	172.64
666.422	109.53
666.828	43.99
667.235	77.97
667.641	192.05
668.047	148.36
668.454	145.94
668.86	172.64
669.266	102.25
669.673	92.54
670.079	145.94
670.485	150.79
670.891	114.38
671.297	160.5
671.703	170.21
672.109	155.65
672.515	155.65
672.92	211.47
673.326	116.81
673.732	165.35
674.138	182.35
674.543	165.35
674.949	145.94
675.354	216.33
675.76	213.9
676.165	111.96
676.57	104.67
676.976	172.64
677.381	172.64
677.786	204.19
678.191	182.35
678.596	111.96
679.001	126.52
679.406	162.93
679.811	211.47
680.216	126.52
680.621	204.19
681.026	141.08
681.43	145.94
681.835	145.94
682.24	143.51
682.644	172.64
683.049	160.5
683.453	153.22
683.858	175.06
684.262	136.23
684.667	172.64
685.071	170.21
685.475	138.66
685.879	126.52
686.283	116.81
686.687	136.23
687.091	109.53
687.495	177.49
687.899	192.05
688.303	209.04
688.707	128.95
689.111	104.67
689.514	90.11
689.918	177.49
690.322	187.2
690.725	155.65
691.129	75.55
691.532	155.65
691.936	150.79
692.339	184.77
692.742	201.76
693.146	145.94
693.549	155.65
693.952	184.77
694.355	126.52
694.758	138.66
695.161	92.54
695.564	102.25
695.967	82.83
696.37	141.08
696.773	126.52
697.175	184.77
697.578	162.93
697.981	153.22
698.383	201.76
698.786	133.8
699.188	126.52
699.591	155.65
699.993	124.09
700.395	204.19
700.798	141.08
701.2	158.07
701.602	189.63
702.004	133.8
702.406	124.09
702.808	73.12
703.21	170.21
703.612	192.05
704.014	145.94
704.416	172.64
704.818	226.04
705.219	145.94
705.621	121.66
706.023	124.09
706.424	179.92
706.826	167.78
707.227	160.5
707.629	172.64
708.03	172.64
708.431	209.04
708.832	138.66
709.234	148.36
709.635	192.05
710.036	158.07
710.437	170.21
710.838	138.66
711.239	160.5
711.64	192.05
712.041	131.37
712.441	209.04
712.842	124.09
713.243	172.64
713.643	179.92
714.044	116.81
714.445	172.64
714.845	177.49
715.246	221.18
715.646	221.18
716.046	247.88
716.447	238.17
716.847	260.02
717.247	179.92
717.647	218.75
718.047	189.63
718.447	228.46
718.847	252.73
719.247	192.05
719.647	206.62
720.047	238.17
720.446	238.17
720.846	177.49
721.246	264.87
721.645	184.77
722.045	243.03
722.444	291.57
722.844	189.63
723.243	269.73
723.643	206.62
724.042	262.44
724.441	325.55
724.84	279.43
725.24	267.3
725.639	277.01
726.038	289.14
726.437	284.29
726.836	262.44
727.234	269.73
727.633	235.74
728.032	262.44
728.431	320.7
728.83	318.27
729.228	294
729.627	281.86
730.025	393.51
730.424	357.11
730.822	403.22
731.22	381.38
731.619	381.38
732.017	429.92
732.415	386.23
732.813	463.9
733.212	388.66
733.61	446.91
734.008	541.57
734.406	519.73
734.803	556.14
735.201	558.56
735.599	645.94
735.997	636.24
736.395	713.91
736.792	738.18
737.19	808.57
737.587	823.13
737.985	840.12
738.382	854.69
738.78	881.39
739.177	874.1
739.574	966.34
739.971	1000.32
740.369	1022.16
740.766	1104.69
741.163	1145.95
741.56	1204.21
741.957	1167.8
742.354	1332.85
742.751	1400.81
743.147	1456.64
743.544	1444.5
743.941	1544.02
744.338	1650.81
744.734	1594.99
745.131	1580.43
745.527	1864.41
745.924	1869.26
746.32	1956.64
746.716	2061.02
747.113	2177.52
747.509	2233.35
747.905	2398.4
748.301	2544.03
748.697	2645.98
749.093	2689.67
749.489	2852.29
749.885	2769.76
750.281	3075.59
750.677	3148.41
751.073	3277.05
751.468	3422.69
751.864	3463.95
752.26	3614.44
752.655	3862.01
753.051	3915.41
753.446	4109.59
753.842	4162.99
754.237	4284.35
754.632	4565.91
755.028	4665.42
755.423	4614.45
755.818	4633.87
756.213	4762.51
756.608	5010.09
757.003	4946.98
757.398	4849.89
757.793	4934.85
758.188	5075.63
758.583	5454.27
758.977	5396.02
759.372	5604.76
759.767	5961.56
760.161	6318.36
760.556	6454.29
760.95	6762.54
761.345	6917.89
761.739	7189.74
762.133	7483.43
762.527	7801.4
762.922	8085.38
763.316	8214.02
763.71	8136.35
764.104	8386.36
764.498	8905.78
764.892	9032
765.286	8949.47
765.68	9102.39
766.073	9646.08
766.467	9687.35
766.861	10039.29
767.255	10243.18
767.648	10282.02
768.042	10383.96
768.435	10864.55
768.829	11121.84
769.222	11371.84
769.615	11172.81
770.008	11175.23
770.402	11478.64
770.795	11939.81
771.188	11883.98
771.581	11699.51
771.974	11490.77
772.367	11413.1
772.76	11709.22
773.153	11896.12
773.545	11706.8
773.938	11748.06
774.331	11779.61
774.724	11971.36
775.116	12949.53
775.509	13255.36
775.901	13718.96
776.294	13648.57
776.686	13706.83
777.078	14257.81
777.471	14859.76
777.863	15478.7
778.255	15680.16
778.647	15534.53
779.039	15529.67
779.431	15444.72
779.823	16452.02
780.215	16585.51
780.607	16403.47
780.999	16219
781.39	16223.86
781.782	16519.98
782.174	17527.28
782.565	17061.25
782.957	17148.63
783.348	17180.18
783.74	16847.65
784.131	16845.23
784.522	17255.43
784.914	17350.09
785.305	17279.7
785.696	16903.48
786.087	16779.69
786.478	16214.15
786.869	16041.82
787.26	16177.74
787.651	15740.84
788.042	15175.3
788.433	14655.87
788.823	14325.77
789.214	14012.66
789.605	13828.19
789.995	14228.68
790.386	13908.29
790.776	13539.35
791.167	13058.76
791.557	13272.35
791.948	13891.3
792.338	14323.34
792.728	14692.28
793.118	14675.29
793.508	14495.67
793.898	14141.3
794.288	14437.42
794.678	14223.83
795.068	14602.47
795.458	14697.13
795.848	14549.07
796.238	14595.19
796.627	14087.9
797.017	14075.77
797.406	14422.86
797.796	14432.57
798.185	14600.05
798.575	14590.34
798.964	14701.99
799.354	14192.27
799.743	14184.99
800.132	14519.95
800.521	14636.45
800.91	14925.29
801.299	14617.04
801.688	14286.93
802.077	13731.1
802.466	13745.66
802.855	13811.2
803.244	13134
803.633	13583.04
804.021	13359.73
804.41	12983.52
804.799	12665.55
805.187	12199.52
805.576	11828.16
805.964	11459.22
806.352	11209.22
806.741	11233.49
807.129	11434.95
807.517	11274.75
807.905	10944.65
808.293	10626.68
808.681	10862.12
809.069	10624.26
809.457	11238.34
809.845	11510.19
810.233	11490.77
810.621	11578.15
811.009	11364.56
811.396	11216.5
811.784	10981.06
812.171	10898.53
812.559	11024.75
812.946	10947.08
813.334	10842.71
813.721	10512.6
814.108	10447.07
814.496	10002.89
814.883	9903.37
815.27	10068.42
815.657	9799
816.044	10187.36
816.431	10065.99
816.818	9852.4
817.205	10012.6
817.592	9692.2
817.979	9119.38
818.365	9056.27
818.752	8680.05
819.139	8357.23
819.525	8684.9
819.912	8733.45
820.298	8546.55
820.685	8364.51
821.071	7898.48
821.457	7621.78
821.843	7172.75
822.23	6740.7
822.616	6784.39
823.002	6573.22
823.388	6464
823.774	6352.34
824.16	6199.43
824.546	5747.97
824.931	5653.3
825.317	5291.65
825.703	5320.77
826.089	5417.86
826.474	5284.37
826.86	5345.05
827.245	5415.44
827.631	5478.54
828.016	5332.91
828.401	4825.62
828.787	4764.94
829.172	4609.6
829.557	4495.52
829.942	4301.34
830.327	4369.3
830.712	4354.74
831.097	4269.79
831.482	4345.03
831.867	4112.02
832.252	3942.11
832.636	3740.65
833.021	3607.16
833.406	3381.42
833.79	3466.38
834.175	3461.52
834.559	3502.79
834.944	3417.83
835.328	3573.17
835.713	3335.31
836.097	3213.95
836.481	3010.06
836.865	2743.06
837.249	2762.48
837.633	2570.73
838.017	2616.85
838.401	2641.12
838.785	2607.14
839.169	2570.73
839.553	2422.67
839.937	2303.74
840.32	2184.8
840.704	2031.89
841.087	1915.38
841.471	1723.63
841.854	1713.92
842.238	1789.17
842.621	1806.16
843.004	1733.34
843.388	1837.71
843.771	1764.89
844.154	1638.68
844.537	1611.98
844.92	1602.27
845.303	1539.16
845.686	1371.68
846.069	1311
846.452	1434.79
846.834	1519.74
847.217	1417.8
847.6	1405.67
847.982	1439.65
848.365	1325.57
848.748	1308.58
849.13	1167.8
849.512	1175.08
849.895	1044.01
850.277	973.62
850.659	1010.03
851.041	1085.27
851.423	1077.99
851.806	1061
852.188	1005.17
852.57	922.65
852.951	1048.86
853.333	1017.31
853.715	922.65
854.097	956.63
854.479	777.01
854.86	835.27
855.242	750.32
855.623	774.59
856.005	811
856.386	682.35
856.768	726.04
857.149	733.32
857.53	777.01
857.911	774.59
858.292	762.45
858.674	662.94
859.055	592.55
859.436	558.56
859.817	529.44
860.197	514.87
860.578	570.7
860.959	556.14
861.34	471.18
861.72	461.48
862.101	514.87
862.482	497.88
862.862	395.94
863.243	473.61
863.623	463.9
864.003	378.95
864.384	461.48
864.764	403.22
865.144	434.78
865.524	366.81
865.904	417.79
866.284	412.93
866.664	308.56
867.044	451.77
867.424	371.67
867.804	296.42
868.183	400.8
868.563	352.25
868.943	403.22
869.322	286.72
869.702	347.4
870.081	318.27
870.461	325.55
870.84	347.4
871.22	352.25
871.599	357.11
871.978	274.58
872.357	230.89
872.736	194.48
873.115	238.17
873.494	218.75
873.873	221.18
874.252	226.04
874.631	199.34
875.01	211.47
875.388	187.2
875.767	233.32
876.146	184.77
876.524	272.15
876.903	192.05
877.281	194.48
877.66	107.1
878.038	167.78
878.416	250.31
878.794	172.64
879.173	291.57
879.551	172.64
879.929	218.75
880.307	274.58
880.685	199.34
881.063	296.42
881.441	196.91
881.818	209.04
882.196	167.78
882.574	158.07
882.951	133.8
883.329	194.48
883.707	221.18
884.084	187.2
884.461	235.74
884.839	77.97
885.216	218.75
885.593	189.63
885.971	158.07
886.348	165.35
886.725	204.19
887.102	155.65
887.479	189.63
887.856	179.92
888.233	155.65
888.609	192.05
888.986	218.75
889.363	131.37
889.74	240.6
890.116	165.35
890.493	145.94
890.869	187.2
891.246	209.04
891.622	201.76
891.998	189.63
892.375	94.97
892.751	179.92
893.127	102.25
893.503	150.79
893.879	175.06
894.255	182.35
894.631	206.62
895.007	167.78
895.383	73.12
895.759	150.79
896.134	162.93
896.51	226.04
896.886	172.64
897.261	148.36
897.637	230.89
898.012	128.95
898.388	145.94
898.763	94.97
899.138	126.52
899.514	97.39
899.889	116.81
900.264	141.08
900.639	143.51
901.014	145.94
901.389	172.64
901.764	158.07
902.139	175.06
902.513	128.95
902.888	141.08
903.263	107.1
903.638	155.65
904.012	82.83
904.387	184.77
904.761	158.07
905.136	189.63
905.51	128.95
905.884	150.79
906.259	133.8
906.633	107.1
907.007	155.65
907.381	92.54
907.755	119.24
908.129	160.5
908.503	179.92
908.877	167.78
909.251	153.22
909.624	170.21
909.998	102.25
910.372	162.93
910.745	182.35
911.119	155.65
911.492	209.04
911.866	148.36
912.239	162.93
912.612	138.66
912.986	133.8
913.359	94.97
913.732	111.96
914.105	126.52
914.478	70.69
914.851	177.49
915.224	131.37
915.597	131.37
915.97	114.38
916.343	141.08
916.715	119.24
917.088	187.2
917.461	138.66
917.833	138.66
918.206	167.78
918.578	165.35
918.951	143.51
919.323	114.38
919.695	172.64
920.067	167.78
920.44	148.36
920.812	218.75
921.184	153.22
921.556	187.2
921.928	104.67
922.3	80.4
922.672	153.22
923.043	177.49
923.415	119.24
923.787	92.54
924.158	177.49
924.53	175.06
924.901	138.66
925.273	145.94
925.644	158.07
926.016	145.94
926.387	124.09
926.758	158.07
927.129	102.25
927.5	92.54
927.872	201.76
928.243	184.77
928.613	172.64
928.984	114.38
929.355	153.22
929.726	131.37
930.097	65.84
930.467	131.37
930.838	158.07
931.209	126.52
931.579	172.64
931.95	160.5
932.32	162.93
932.69	141.08
933.061	102.25
933.431	104.67
933.801	177.49
934.171	77.97
934.541	131.37
934.911	216.33
935.281	53.7
935.651	92.54
936.021	87.68
936.391	99.82
936.761	97.39
937.13	155.65
937.5	80.4
937.87	102.25
938.239	104.67
938.609	162.93
938.978	199.34
939.347	128.95
939.717	63.41
940.086	184.77
940.455	141.08
940.824	150.79
941.193	187.2
941.562	124.09
941.931	92.54
942.3	138.66
942.669	131.37
943.038	43.99
943.407	128.95
943.775	46.42
944.144	192.05
944.513	153.22
944.881	111.96
945.25	211.47
945.618	145.94
945.986	111.96
946.355	141.08
946.723	199.34
947.091	99.82
947.459	162.93
947.827	179.92
948.195	138.66
948.563	136.23
948.931	75.55
949.299	184.77
949.667	128.95
950.035	141.08
950.402	97.39
950.77	70.69
951.138	124.09
951.505	124.09
951.873	143.51
952.24	138.66
952.607	145.94
952.975	75.55
953.342	145.94
953.709	114.38
954.076	153.22
954.443	148.36
954.81	114.38
955.177	145.94
955.544	56.13
955.911	119.24
956.278	143.51
956.645	170.21
957.012	170.21
957.378	189.63
957.745	92.54
958.111	182.35
958.478	165.35
958.844	153.22
959.211	172.64
959.577	114.38
959.943	160.5
960.309	155.65
960.675	153.22
961.042	119.24
961.408	158.07
961.774	184.77
962.139	36.71
962.505	211.47
962.871	201.76
963.237	167.78
963.603	111.96
963.968	107.1
964.334	114.38
964.699	141.08
965.065	111.96
965.43	141.08
965.796	160.5
966.161	126.52
966.526	172.64
966.891	150.79
967.256	121.66
967.622	175.06
967.987	73.12
968.352	107.1
968.716	165.35
969.081	131.37
969.446	145.94
969.811	128.95
970.176	167.78
970.54	165.35
970.905	114.38
971.269	143.51
971.634	121.66
971.998	124.09
972.363	192.05
972.727	138.66
973.091	153.22
973.455	162.93
973.819	141.08
974.183	131.37
974.547	126.52
974.911	155.65
975.275	128.95
975.639	143.51
976.003	209.04
976.367	73.12
976.73	141.08
977.094	82.83
977.458	136.23
977.821	170.21
978.185	133.8
978.548	177.49
978.911	87.68
979.275	199.34
979.638	206.62
980.001	211.47
980.364	128.95
980.727	175.06
981.09	77.97
981.453	114.38
981.816	199.34
982.179	133.8
982.542	167.78
982.905	175.06
983.267	177.49
983.63	211.47
983.992	199.34
984.355	63.41
984.717	192.05
985.08	131.37
985.442	153.22
985.804	138.66
986.167	155.65
986.529	104.67
986.891	63.41
987.253	109.53
987.615	94.97
987.977	97.39
988.339	92.54
988.701	116.81
989.062	90.11
989.424	158.07
989.786	145.94
990.147	141.08
990.509	97.39
990.87	133.8
991.232	145.94
991.593	155.65
991.955	165.35
992.316	114.38
992.677	189.63
993.038	177.49
993.399	179.92
993.76	128.95
994.121	75.55
994.482	121.66
994.843	145.94
995.204	124.09
995.565	138.66
995.926	94.97
996.286	182.35
996.647	128.95
997.007	109.53
997.368	126.52
997.728	121.66
998.089	189.63
998.449	104.67
998.809	150.79
999.169	167.78
999.53	111.96
999.89	53.7
1000.25	126.52
1000.61	121.66
1000.97	111.96
1001.329	182.35
1001.689	121.66
1002.049	145.94
1002.409	209.04
1002.768	138.66
1003.128	162.93
1003.487	128.95
1003.847	133.8
1004.206	175.06
1004.566	189.63
1004.925	107.1
1005.284	170.21
1005.643	126.52
1006.003	131.37
1006.362	121.66
1006.721	160.5
1007.08	138.66
1007.438	111.96
1007.797	119.24
1008.156	41.57
1008.515	114.38
1008.874	104.67
1009.232	73.12
1009.591	94.97
1009.949	150.79
1010.308	175.06
1010.666	143.51
1011.024	209.04
1011.383	155.65
1011.741	124.09
1012.099	92.54
1012.457	153.22
1012.815	150.79
1013.173	150.79
1013.531	111.96
1013.889	133.8
1014.247	114.38
1014.605	119.24
1014.962	143.51
1015.32	145.94
1015.678	111.96
1016.035	114.38
1016.393	111.96
1016.75	155.65
1017.107	126.52
1017.465	153.22
1017.822	107.1
1018.179	148.36
1018.536	170.21
1018.894	172.64
1019.251	94.97
1019.608	162.93
1019.964	80.4
1020.321	121.66
1020.678	179.92
1021.035	116.81
1021.392	201.76
1021.748	167.78
1022.105	145.94
1022.461	138.66
1022.818	143.51
1023.174	138.66
1023.531	179.92
1023.887	182.35
1024.243	221.18
1024.599	121.66
1024.955	153.22
1025.311	150.79
1025.667	187.2
1026.023	177.49
1026.379	114.38
1026.735	116.81
1027.091	172.64
1027.447	155.65
