189.514	159.29
189.973	159.29
190.431	159.29
190.889	62.2
191.348	6.37
191.806	33.07
192.264	-49.45
192.722	-68.87
193.18	-30.04
193.638	59.77
194.096	-32.46
194.554	23.36
195.012	20.93
195.47	-37.32
195.928	-34.89
196.385	6.37
196.843	1.52
197.301	23.36
197.758	-25.18
198.216	81.62
198.674	47.63
199.131	13.65
199.589	98.61
200.046	42.78
200.503	64.62
200.961	113.17
201.418	84.04
201.875	74.33
202.332	47.63
202.79	79.19
203.247	57.34
203.704	207.83
204.161	74.33
204.618	181.13
205.075	142.3
205.532	113.17
205.989	198.12
206.445	110.74
206.902	125.31
207.359	152
207.816	200.55
208.272	135.01
208.729	137.44
209.185	142.3
209.642	149.58
210.098	108.31
210.555	249.09
211.011	190.84
211.467	154.43
211.924	120.45
212.38	139.87
212.836	224.82
213.292	164.14
213.748	122.88
214.204	176.28
214.66	156.86
215.116	176.28
215.572	173.85
216.028	142.3
216.484	159.29
216.94	202.98
217.396	144.72
217.851	152
218.307	105.89
218.763	113.17
219.218	156.86
219.674	147.15
220.129	173.85
220.585	86.47
221.04	185.99
221.496	188.41
221.951	195.69
222.406	202.98
222.861	152
223.317	130.16
223.772	135.01
224.227	132.59
224.682	127.73
225.137	171.42
225.592	152
226.047	96.18
226.502	178.7
226.957	147.15
227.411	161.71
227.866	195.69
228.321	166.57
228.776	169
229.23	127.73
229.685	127.73
230.139	122.88
230.594	188.41
231.048	115.6
231.503	147.15
231.957	207.83
232.411	118.02
232.865	152
233.32	198.12
233.774	176.28
234.228	130.16
234.682	98.61
235.136	105.89
235.59	152
236.044	159.29
236.498	142.3
236.952	212.69
237.406	166.57
237.86	156.86
238.313	120.45
238.767	164.14
239.221	190.84
239.674	103.46
240.128	159.29
240.581	149.58
241.035	188.41
241.488	188.41
241.942	195.69
242.395	142.3
242.848	118.02
243.301	171.42
243.755	202.98
244.208	164.14
244.661	183.56
245.114	101.03
245.567	169
246.02	156.86
246.473	79.19
246.926	198.12
247.379	115.6
247.832	198.12
248.284	147.15
248.737	147.15
249.19	122.88
249.642	178.7
250.095	132.59
250.547	137.44
251	217.54
251.452	207.83
251.905	176.28
252.357	122.88
252.81	115.6
253.262	200.55
253.714	108.31
254.166	161.71
254.618	108.31
255.07	135.01
255.523	130.16
255.975	215.11
256.427	166.57
256.878	147.15
257.33	125.31
257.782	193.27
258.234	98.61
258.686	154.43
259.137	120.45
259.589	69.48
260.041	118.02
260.492	113.17
260.944	144.72
261.395	93.75
261.847	202.98
262.298	108.31
262.749	137.44
263.201	137.44
263.652	98.61
264.103	67.05
264.554	120.45
265.005	156.86
265.457	173.85
265.908	154.43
266.359	122.88
266.809	200.55
267.26	222.39
267.711	181.13
268.162	169
268.613	207.83
269.064	156.86
269.514	135.01
269.965	202.98
270.415	166.57
270.866	147.15
271.316	161.71
271.767	173.85
272.217	122.88
272.668	178.7
273.118	108.31
273.568	207.83
274.019	115.6
274.469	130.16
274.919	198.12
275.369	176.28
275.819	101.03
276.269	202.98
276.719	152
277.169	152
277.619	113.17
278.069	132.59
278.518	120.45
278.968	137.44
279.418	139.87
279.867	137.44
280.317	120.45
280.767	185.99
281.216	202.98
281.666	234.53
282.115	159.29
282.564	120.45
283.014	149.58
283.463	120.45
283.912	166.57
284.361	178.7
284.811	202.98
285.26	69.48
285.709	181.13
286.158	169
286.607	156.86
287.056	241.81
287.505	166.57
287.953	212.69
288.402	205.4
288.851	154.43
289.3	127.73
289.748	195.69
290.197	154.43
290.646	156.86
291.094	113.17
291.543	154.43
291.991	229.68
292.439	149.58
292.888	178.7
293.336	105.89
293.784	142.3
294.233	164.14
294.681	171.42
295.129	161.71
295.577	149.58
296.025	190.84
296.473	137.44
296.921	190.84
297.369	127.73
297.817	173.85
298.264	103.46
298.712	164.14
299.16	152
299.608	137.44
300.055	190.84
300.503	127.73
300.95	139.87
301.398	185.99
301.845	144.72
302.293	113.17
302.74	185.99
303.187	147.15
303.635	207.83
304.082	156.86
304.529	142.3
304.976	130.16
305.423	156.86
305.87	166.57
306.317	120.45
306.764	185.99
307.211	132.59
307.658	144.72
308.105	105.89
308.552	159.29
308.998	130.16
309.445	198.12
309.892	164.14
310.338	185.99
310.785	161.71
311.231	105.89
311.678	232.1
312.124	101.03
312.571	185.99
313.017	135.01
313.463	137.44
313.909	171.42
314.356	149.58
314.802	212.69
315.248	144.72
315.694	142.3
316.14	176.28
316.586	108.31
317.032	161.71
317.478	169
317.923	135.01
318.369	212.69
318.815	125.31
319.261	205.4
319.706	110.74
320.152	173.85
320.597	130.16
321.043	217.54
321.488	176.28
321.934	156.86
322.379	122.88
322.824	176.28
323.27	195.69
323.715	178.7
324.16	127.73
324.605	86.47
325.05	185.99
325.495	142.3
325.94	219.97
326.385	120.45
326.83	188.41
327.275	110.74
327.72	132.59
328.165	241.81
328.61	105.89
329.054	222.39
329.499	154.43
329.943	96.18
330.388	122.88
330.832	200.55
331.277	176.28
331.721	176.28
332.166	149.58
332.61	120.45
333.054	176.28
333.499	166.57
333.943	135.01
334.387	227.25
334.831	139.87
335.275	142.3
335.719	159.29
336.163	76.76
336.607	147.15
337.051	127.73
337.495	188.41
337.938	210.26
338.382	224.82
338.826	207.83
339.269	164.14
339.713	33.07
340.157	205.4
340.6	183.56
341.044	185.99
341.487	149.58
341.93	195.69
342.374	93.75
342.817	263.66
343.26	120.45
343.703	183.56
344.146	156.86
344.59	200.55
345.033	173.85
345.476	156.86
345.919	188.41
346.361	166.57
346.804	103.46
347.247	202.98
347.69	171.42
348.133	152
348.575	110.74
349.018	236.96
349.461	171.42
349.903	149.58
350.346	127.73
350.788	207.83
351.23	127.73
351.673	137.44
352.115	198.12
352.557	110.74
353	178.7
353.442	156.86
353.884	156.86
354.326	137.44
354.768	91.32
355.21	219.97
355.652	173.85
356.094	178.7
356.536	122.88
356.978	142.3
357.419	205.4
357.861	176.28
358.303	224.82
358.744	178.7
359.186	74.33
359.627	127.73
360.069	159.29
360.51	171.42
360.952	156.86
361.393	88.9
361.834	166.57
362.276	205.4
362.717	275.79
363.158	113.17
363.599	91.32
364.04	130.16
364.481	183.56
364.922	183.56
365.363	185.99
365.804	229.68
366.245	135.01
366.686	132.59
367.126	166.57
367.567	152
368.008	103.46
368.448	166.57
368.889	161.71
369.33	161.71
369.77	185.99
370.21	152
370.651	154.43
371.091	120.45
371.531	120.45
371.972	113.17
372.412	205.4
372.852	193.27
373.292	137.44
373.732	142.3
374.172	130.16
374.612	149.58
375.052	164.14
375.492	137.44
375.932	147.15
376.372	154.43
376.811	120.45
377.251	130.16
377.691	222.39
378.13	249.09
378.57	183.56
379.009	105.89
379.449	152
379.888	64.62
380.328	190.84
380.767	156.86
381.206	149.58
381.645	156.86
382.085	110.74
382.524	161.71
382.963	188.41
383.402	185.99
383.841	144.72
384.28	161.71
384.719	105.89
385.158	122.88
385.596	188.41
386.035	147.15
386.474	152
386.913	173.85
387.351	118.02
387.79	139.87
388.228	152
388.667	227.25
389.105	166.57
389.544	74.33
389.982	219.97
390.42	139.87
390.859	156.86
391.297	139.87
391.735	105.89
392.173	118.02
392.611	156.86
393.049	137.44
393.487	154.43
393.925	135.01
394.363	190.84
394.801	159.29
395.239	183.56
395.676	195.69
396.114	137.44
396.552	166.57
396.989	207.83
397.427	171.42
397.864	152
398.302	149.58
398.739	176.28
399.177	105.89
399.614	120.45
400.051	127.73
400.488	181.13
400.926	188.41
401.363	164.14
401.8	166.57
402.237	164.14
402.674	195.69
403.111	130.16
403.548	159.29
403.985	135.01
404.421	181.13
404.858	169
405.295	171.42
405.732	142.3
406.168	169
406.605	110.74
407.041	130.16
407.478	115.6
407.914	132.59
408.351	127.73
408.787	193.27
409.223	115.6
409.66	164.14
410.096	122.88
410.532	132.59
410.968	173.85
411.404	176.28
411.84	251.52
412.276	142.3
412.712	183.56
413.148	185.99
413.584	232.1
414.02	161.71
414.455	169
414.891	164.14
415.327	137.44
415.762	169
416.198	173.85
416.633	144.72
417.069	118.02
417.504	142.3
417.94	178.7
418.375	169
418.81	127.73
419.245	164.14
419.681	183.56
420.116	166.57
420.551	176.28
420.986	219.97
421.421	105.89
421.856	164.14
422.291	130.16
422.726	202.98
423.16	205.4
423.595	178.7
424.03	224.82
424.464	164.14
424.899	135.01
425.334	142.3
425.768	207.83
426.203	176.28
426.637	185.99
427.071	205.4
427.506	149.58
427.94	152
428.374	161.71
428.809	122.88
429.243	154.43
429.677	178.7
430.111	161.71
430.545	152
430.979	149.58
431.413	144.72
431.847	181.13
432.28	120.45
432.714	169
433.148	110.74
433.582	113.17
434.015	139.87
434.449	127.73
434.882	171.42
435.316	96.18
435.749	183.56
436.183	200.55
436.616	156.86
437.049	103.46
437.483	176.28
437.916	185.99
438.349	176.28
438.782	273.37
439.215	185.99
439.648	171.42
440.081	161.71
440.514	212.69
440.947	210.26
441.38	149.58
441.813	253.95
442.245	188.41
442.678	198.12
443.111	200.55
443.543	166.57
443.976	147.15
444.408	232.1
444.841	222.39
445.273	176.28
445.705	202.98
446.138	198.12
446.57	280.65
447.002	244.24
447.434	176.28
447.867	239.38
448.299	283.07
448.731	207.83
449.163	253.95
449.595	202.98
450.026	185.99
450.458	166.57
450.89	217.54
451.322	169
451.754	207.83
452.185	253.95
452.617	268.51
453.048	292.78
453.48	202.98
453.911	290.36
454.343	258.8
454.774	246.67
455.205	261.23
455.637	244.24
456.068	246.67
456.499	258.8
456.93	268.51
457.361	302.49
457.792	241.81
458.223	268.51
458.654	263.66
459.085	244.24
459.516	317.06
459.947	268.51
460.378	198.12
460.808	258.8
461.239	256.38
461.669	244.24
462.1	317.06
462.531	253.95
462.961	253.95
463.391	258.8
463.822	287.93
464.252	193.27
464.682	229.68
465.113	270.94
465.543	239.38
465.973	300.07
466.403	212.69
466.833	263.66
467.263	295.21
467.693	200.55
468.123	239.38
468.553	227.25
468.983	249.09
469.412	207.83
469.842	317.06
470.272	292.78
470.701	188.41
471.131	273.37
471.56	212.69
471.99	139.87
472.419	222.39
472.849	275.79
473.278	253.95
473.707	246.67
474.136	229.68
474.566	234.53
474.995	227.25
475.424	215.11
475.853	205.4
476.282	130.16
476.711	195.69
477.14	178.7
477.569	239.38
477.997	215.11
478.426	210.26
478.855	161.71
479.283	222.39
479.712	188.41
480.141	159.29
480.569	217.54
480.998	266.08
481.426	200.55
481.854	219.97
482.283	198.12
482.711	166.57
483.139	181.13
483.567	207.83
483.995	147.15
484.424	166.57
484.852	176.28
485.28	227.25
485.708	224.82
486.135	227.25
486.563	283.07
486.991	212.69
487.419	212.69
487.847	185.99
488.274	246.67
488.702	190.84
489.129	154.43
489.557	219.97
489.984	275.79
490.412	190.84
490.839	152
491.266	241.81
491.694	176.28
492.121	266.08
492.548	244.24
492.975	110.74
493.402	205.4
493.829	185.99
494.256	166.57
494.683	130.16
495.11	164.14
495.537	149.58
495.964	164.14
496.39	205.4
496.817	202.98
497.244	205.4
497.67	198.12
498.097	159.29
498.523	212.69
498.95	266.08
499.376	193.27
499.803	118.02
500.229	200.55
500.655	110.74
501.081	188.41
501.508	195.69
501.934	154.43
502.36	261.23
502.786	215.11
503.212	224.82
503.638	261.23
504.064	217.54
504.489	152
504.915	183.56
505.341	183.56
505.767	224.82
506.192	222.39
506.618	147.15
507.043	164.14
507.469	185.99
507.894	169
508.32	193.27
508.745	224.82
509.17	152
509.596	215.11
510.021	147.15
510.446	130.16
510.871	215.11
511.296	215.11
511.721	164.14
512.146	190.84
512.571	149.58
512.996	171.42
513.421	198.12
513.845	188.41
514.27	217.54
514.695	185.99
515.119	219.97
515.544	188.41
515.969	127.73
516.393	135.01
516.817	198.12
517.242	127.73
517.666	144.72
518.09	159.29
518.515	178.7
518.939	164.14
519.363	375.31
519.787	224.82
520.211	113.17
520.635	236.96
521.059	200.55
521.483	164.14
521.907	185.99
522.331	135.01
522.754	190.84
523.178	130.16
523.602	185.99
524.025	195.69
524.449	173.85
524.872	185.99
525.296	224.82
525.719	215.11
526.143	159.29
526.566	239.38
526.989	236.96
527.412	181.13
527.836	152
528.259	169
528.682	185.99
529.105	219.97
529.528	181.13
529.951	147.15
530.374	159.29
530.796	159.29
531.219	154.43
531.642	154.43
532.065	154.43
532.487	93.75
532.91	207.83
533.332	142.3
533.755	202.98
534.177	215.11
534.6	183.56
535.022	137.44
535.444	93.75
535.867	173.85
536.289	195.69
536.711	219.97
537.133	236.96
537.555	144.72
537.977	251.52
538.399	161.71
538.821	132.59
539.243	149.58
539.665	173.85
540.086	125.31
540.508	200.55
540.93	217.54
541.351	246.67
541.773	241.81
542.195	156.86
542.616	212.69
543.037	273.37
543.459	173.85
543.88	178.7
544.301	219.97
544.723	193.27
545.144	219.97
545.565	156.86
545.986	135.01
546.407	219.97
546.828	212.69
547.249	212.69
547.67	217.54
548.091	217.54
548.512	202.98
548.932	183.56
549.353	251.52
549.774	222.39
550.194	185.99
550.615	181.13
551.035	188.41
551.456	202.98
551.876	185.99
552.296	122.88
552.717	169
553.137	246.67
553.557	215.11
553.977	183.56
554.397	215.11
554.817	217.54
555.237	149.58
555.657	166.57
556.077	224.82
556.497	193.27
556.917	280.65
557.337	137.44
557.756	200.55
558.176	229.68
558.596	137.44
559.015	188.41
559.435	159.29
559.854	108.31
560.274	152
560.693	149.58
561.112	169
561.532	166.57
561.951	222.39
562.37	210.26
562.789	154.43
563.208	202.98
563.627	227.25
564.046	169
564.465	176.28
564.884	198.12
565.303	195.69
565.722	217.54
566.14	108.31
566.559	188.41
566.978	195.69
567.396	263.66
567.815	176.28
568.233	149.58
568.652	156.86
569.07	202.98
569.489	195.69
569.907	149.58
570.325	241.81
570.743	205.4
571.161	205.4
571.58	159.29
571.998	164.14
572.416	144.72
572.833	215.11
573.251	212.69
573.669	152
574.087	181.13
574.505	198.12
574.922	190.84
575.34	139.87
575.758	224.82
576.175	188.41
576.593	173.85
577.01	200.55
577.428	217.54
577.845	1618.05
578.262	270.94
578.68	200.55
579.097	183.56
579.514	210.26
579.931	110.74
580.348	171.42
580.765	154.43
581.182	122.88
581.599	253.95
582.016	161.71
582.433	185.99
582.849	178.7
583.266	156.86
583.683	161.71
584.099	229.68
584.516	164.14
584.933	202.98
585.349	210.26
585.765	190.84
586.182	222.39
586.598	113.17
587.014	147.15
587.431	185.99
587.847	161.71
588.263	173.85
588.679	149.58
589.095	144.72
589.511	236.96
589.927	178.7
590.343	193.27
590.759	137.44
591.174	217.54
591.59	193.27
592.006	193.27
592.421	200.55
592.837	190.84
593.252	147.15
593.668	195.69
594.083	159.29
594.499	118.02
594.914	217.54
595.329	215.11
595.745	173.85
596.16	188.41
596.575	130.16
596.99	139.87
597.405	81.62
597.82	193.27
598.235	178.7
598.65	188.41
599.065	210.26
599.479	154.43
599.894	164.14
600.309	118.02
600.724	181.13
601.138	108.31
601.553	178.7
601.967	256.38
602.382	181.13
602.796	113.17
603.21	154.43
603.625	176.28
604.039	188.41
604.453	181.13
604.867	161.71
605.281	183.56
605.695	249.09
606.109	195.69
606.523	173.85
606.937	166.57
607.351	266.08
607.765	159.29
608.178	156.86
608.592	142.3
609.006	200.55
609.419	166.57
609.833	249.09
610.246	161.71
610.66	193.27
611.073	244.24
611.487	232.1
611.9	200.55
612.313	166.57
612.726	202.98
613.139	195.69
613.553	181.13
613.966	173.85
614.379	232.1
614.792	210.26
615.204	181.13
615.617	181.13
616.03	190.84
616.443	178.7
616.856	159.29
617.268	144.72
617.681	173.85
618.093	190.84
618.506	161.71
618.918	181.13
619.331	173.85
619.743	200.55
620.155	149.58
620.568	185.99
620.98	195.69
621.392	147.15
621.804	256.38
622.216	166.57
622.628	115.6
623.04	212.69
623.452	105.89
623.864	159.29
624.276	122.88
624.687	142.3
625.099	137.44
625.511	147.15
625.922	137.44
626.334	132.59
626.745	169
627.157	176.28
627.568	103.46
627.979	198.12
628.391	159.29
628.802	169
629.213	181.13
629.624	169
630.035	181.13
630.446	152
630.857	144.72
631.268	188.41
631.679	142.3
632.09	183.56
632.501	176.28
632.912	205.4
633.322	176.28
633.733	147.15
634.144	154.43
634.554	135.01
634.965	113.17
635.375	188.41
635.785	110.74
636.196	181.13
636.606	173.85
637.016	127.73
637.427	183.56
637.837	137.44
638.247	215.11
638.657	132.59
639.067	118.02
639.477	161.71
639.887	152
640.297	202.98
640.706	185.99
641.116	176.28
641.526	139.87
641.935	130.16
642.345	176.28
642.755	91.32
643.164	185.99
643.573	125.31
643.983	178.7
644.392	171.42
644.801	198.12
645.211	161.71
645.62	156.86
646.029	178.7
646.438	139.87
646.847	161.71
647.256	137.44
647.665	215.11
648.074	185.99
648.483	222.39
648.892	166.57
649.3	227.25
649.709	188.41
650.118	200.55
650.526	183.56
650.935	200.55
651.343	173.85
651.752	115.6
652.16	149.58
652.568	234.53
652.977	115.6
653.385	176.28
653.793	137.44
654.201	195.69
654.609	193.27
655.017	193.27
655.425	135.01
655.833	181.13
656.241	202.98
656.649	125.31
657.057	195.69
657.464	202.98
657.872	212.69
658.28	178.7
658.687	115.6
659.095	185.99
659.502	169
659.91	156.86
660.317	217.54
660.724	202.98
661.132	188.41
661.539	219.97
661.946	139.87
662.353	173.85
662.76	161.71
663.167	222.39
663.574	115.6
663.981	178.7
664.388	188.41
664.795	164.14
665.202	59.77
665.608	166.57
666.015	159.29
666.422	210.26
666.828	222.39
667.235	144.72
667.641	178.7
668.047	205.4
668.454	101.03
668.86	171.42
669.266	132.59
669.673	105.89
670.079	139.87
670.485	207.83
670.891	171.42
671.297	144.72
671.703	183.56
672.109	176.28
672.515	200.55
672.92	154.43
673.326	200.55
673.732	144.72
674.138	234.53
674.543	147.15
674.949	193.27
675.354	198.12
675.76	115.6
676.165	169
676.57	105.89
676.976	217.54
677.381	181.13
677.786	202.98
678.191	147.15
678.596	171.42
679.001	169
679.406	185.99
679.811	137.44
680.216	195.69
680.621	137.44
681.026	176.28
681.43	84.04
681.835	105.89
682.24	178.7
682.644	154.43
683.049	183.56
683.453	159.29
683.858	113.17
684.262	190.84
684.667	176.28
685.071	232.1
685.475	105.89
685.879	122.88
686.283	190.84
686.687	137.44
687.091	188.41
687.495	178.7
687.899	181.13
688.303	156.86
688.707	198.12
689.111	166.57
689.514	156.86
689.918	156.86
690.322	127.73
690.725	86.47
691.129	198.12
691.532	212.69
691.936	149.58
692.339	173.85
692.742	176.28
693.146	156.86
693.549	159.29
693.952	202.98
694.355	139.87
694.758	188.41
695.161	178.7
695.564	166.57
695.967	207.83
696.37	166.57
696.773	183.56
697.175	190.84
697.578	193.27
697.981	212.69
698.383	190.84
698.786	142.3
699.188	127.73
699.591	108.31
699.993	166.57
700.395	135.01
700.798	227.25
701.2	190.84
701.602	176.28
702.004	193.27
702.406	127.73
702.808	139.87
703.21	173.85
703.612	263.66
704.014	227.25
704.416	215.11
704.818	239.38
705.219	135.01
705.621	156.86
706.023	152
706.424	219.97
706.826	251.52
707.227	241.81
707.629	159.29
708.03	185.99
708.431	142.3
708.832	200.55
709.234	154.43
709.635	251.52
710.036	183.56
710.437	176.28
710.838	217.54
711.239	176.28
711.64	205.4
712.041	234.53
712.441	164.14
712.842	171.42
713.243	241.81
713.643	171.42
714.044	188.41
714.445	261.23
714.845	217.54
715.246	212.69
715.646	190.84
716.046	154.43
716.447	212.69
716.847	227.25
717.247	295.21
717.647	227.25
718.047	207.83
718.447	283.07
718.847	232.1
719.247	270.94
719.647	258.8
720.047	217.54
720.446	307.35
720.846	212.69
721.246	287.93
721.645	261.23
722.045	280.65
722.444	312.2
722.844	253.95
723.243	321.91
723.643	312.2
724.042	251.52
724.441	326.76
724.84	215.11
725.24	302.49
725.639	355.89
726.038	358.32
726.437	326.76
726.836	360.75
727.234	324.34
727.633	351.04
728.032	363.17
728.431	307.35
728.83	445.7
729.228	457.83
729.627	542.79
730.025	472.4
730.424	516.09
730.822	569.49
731.22	550.07
731.619	605.9
732.017	654.44
732.415	700.56
732.813	690.85
733.212	707.84
733.61	829.2
734.008	858.33
734.406	851.04
734.803	938.42
735.201	1069.49
735.599	1152.02
735.997	1154.45
736.395	1132.6
736.792	1309.79
737.19	1423.87
737.587	1399.6
737.985	1559.79
738.382	1520.96
738.78	1627.76
739.177	1724.84
739.574	1821.93
739.971	1953
740.369	2103.49
740.766	2047.67
741.163	2147.18
741.56	2234.56
741.957	2353.5
742.354	2372.91
742.751	2542.82
743.147	2618.06
743.544	2625.34
743.941	2601.07
744.338	3033.12
744.734	3144.77
745.131	3377.78
745.527	3661.77
745.924	3693.32
746.32	4125.37
746.716	4285.56
747.113	4504.01
747.509	4756.45
747.905	5144.8
748.301	5312.28
748.697	5508.88
749.093	5518.59
749.489	5688.5
749.885	6042.87
750.281	6707.93
750.677	6659.39
751.073	7273.47
751.468	7426.39
751.864	7940.96
752.26	8059.89
752.655	8440.97
753.051	8756.51
753.446	9331.76
753.842	9404.58
754.237	9666.72
754.632	9953.13
755.028	9909.44
755.423	10064.78
755.818	10164.3
756.213	10086.63
756.608	10266.24
757.003	10441
757.398	10076.92
757.793	10081.77
758.188	9885.17
758.583	10062.35
758.977	10559.93
759.372	10882.75
759.767	11598.78
760.161	12033.26
760.556	12890.07
760.95	13572.12
761.345	14091.54
761.739	15725.06
762.133	16329.44
762.527	16555.17
762.922	17217.8
763.316	18666.86
763.71	18800.35
764.104	19060.07
764.498	20118.33
764.892	20183.87
765.286	20773.68
765.68	21623.21
766.073	21977.59
766.467	22166.91
766.861	23261.59
767.255	24120.82
767.648	25128.12
768.042	26045.61
768.435	26414.55
768.829	26880.58
769.222	27691.27
769.615	29285.95
770.008	27688.84
770.402	27900.01
770.795	28417.01
771.188	28676.72
771.581	28492.25
771.974	28266.52
772.367	27014.07
772.76	27980.11
773.153	26647.56
773.545	25953.38
773.938	26091.73
774.331	26247.07
774.724	26574.75
775.116	27645.15
775.509	28654.88
775.901	29846.64
776.294	30599.08
776.686	32181.63
777.078	32676.78
777.471	33980.2
777.863	35866.15
778.255	36373.44
778.647	36036.06
779.039	37273.94
779.431	36854.03
779.823	37400.16
780.215	37783.66
780.607	37523.95
780.999	39021.54
781.39	38873.48
781.782	38684.16
782.174	38470.56
782.565	39992.43
782.957	40235.15
783.348	41412.36
783.74	41045.84
784.131	39970.59
784.522	39800.68
784.914	39456.01
785.305	40198.74
785.696	39970.59
786.087	38155.02
786.478	36863.74
786.869	35669.55
787.26	35322.45
787.651	34113.7
788.042	33424.37
788.433	32225.32
788.823	29958.29
789.214	29028.67
789.605	28137.88
789.995	26356.3
790.386	25608.71
790.776	24875.69
791.167	24899.96
791.557	25227.64
791.948	25768.91
792.338	26659.7
792.728	27812.63
793.118	28339.34
793.508	28014.09
793.898	27805.35
794.288	29201
794.678	29375.76
795.068	28929.15
795.458	28011.66
795.848	28222.83
796.238	28839.34
796.627	27970.4
797.017	27307.77
797.406	28167
797.796	28332.05
798.185	28798.08
798.575	28958.28
798.964	29035.95
799.354	30167.03
799.743	29077.21
800.132	29815.09
800.521	30201.02
800.91	30548.11
801.299	30171.89
801.688	30001.98
802.077	29798.1
802.466	30438.88
802.855	30140.34
803.244	28829.64
803.633	28509.24
804.021	28244.67
804.41	27679.13
804.799	26210.66
805.187	25302.88
805.576	24598.99
805.964	23713.05
806.352	21737.29
806.741	22009.14
807.129	21722.73
807.517	21492.14
807.905	21181.46
808.293	21266.41
808.681	21759.14
809.069	22319.83
809.457	22567.4
809.845	22705.75
810.233	23213.04
810.621	23885.38
811.009	23414.5
811.396	23467.9
811.784	24640.25
812.171	23950.92
812.559	23166.93
812.946	22953.33
813.334	23455.77
813.721	22880.51
814.108	22251.86
814.496	22198.46
814.883	21691.17
815.27	22618.37
815.657	22327.11
816.044	22615.95
816.431	23004.3
816.818	23026.15
817.205	22664.49
817.592	22613.52
817.979	21882.93
818.365	22186.33
818.752	21463.02
819.139	20336.78
819.525	20193.58
819.912	19861.05
820.298	19239.68
820.685	18462.97
821.071	17603.73
821.457	17310.04
821.843	16805.18
822.23	15681.37
822.616	15329.43
823.002	14067.27
823.388	13715.32
823.774	12686.18
824.16	11965.3
824.546	11822.09
824.931	11768.69
825.317	11402.18
825.703	11229.85
826.089	11191.01
826.474	11195.87
826.86	11147.32
827.245	11127.9
827.631	10846.35
828.016	10681.29
828.401	10431.29
828.787	9928.86
829.172	9683.71
829.557	9513.8
829.942	9397.29
830.327	8710.39
830.712	8591.46
831.097	8329.32
831.482	8188.54
831.867	8161.84
832.252	7967.66
832.636	7892.42
833.021	8137.57
833.406	8013.78
833.79	7848.73
834.175	7508.92
834.559	7489.5
834.944	7200.66
835.328	7045.32
835.713	6848.71
836.097	6555.02
836.481	6234.62
836.865	6285.6
837.249	5751.61
837.633	5508.88
838.017	5377.81
838.401	5261.31
838.785	5137.52
839.169	5018.59
839.553	4630.23
839.937	4331.68
840.32	4062.26
840.704	3872.94
841.087	3688.47
841.471	3440.89
841.854	3321.96
842.238	3159.33
842.621	3093.8
843.004	3122.92
843.388	2979.72
843.771	2933.6
844.154	3003.99
844.537	2899.62
844.92	3001.56
845.303	2829.23
845.686	2749.13
846.069	2605.93
846.452	2639.91
846.834	2581.65
847.217	2557.38
847.6	2559.81
847.982	2450.58
848.365	2394.76
848.748	2324.37
849.13	2341.36
849.512	2210.29
849.895	2280.68
850.277	2253.98
850.659	2266.12
851.041	2278.25
851.423	2222.43
851.806	2101.06
852.188	2054.95
852.57	1979.7
852.951	2054.95
853.333	1982.13
853.715	1838.92
854.097	1957.86
854.479	1780.67
854.86	1804.94
855.242	1632.61
855.623	1557.37
856.005	1518.53
856.386	1523.39
856.768	1484.55
857.149	1319.5
857.53	1351.05
857.911	1215.13
858.292	1173.87
858.674	1120.47
859.055	1115.61
859.436	1020.95
859.817	979.69
860.197	1018.52
860.578	931.14
860.959	882.6
861.34	952.99
861.72	809.78
862.101	736.97
862.482	722.4
862.862	817.06
863.243	722.4
863.623	773.37
864.003	622.89
864.384	656.87
864.764	710.27
865.144	700.56
865.524	688.42
865.904	591.33
866.284	586.48
866.664	669
867.044	598.61
867.424	528.22
867.804	501.52
868.183	528.22
868.563	542.79
868.943	491.82
869.322	496.67
869.702	382.59
870.081	392.3
870.461	397.15
870.84	419
871.22	421.43
871.599	411.72
871.978	411.72
872.357	370.45
872.736	428.71
873.115	334.05
873.494	329.19
873.873	394.73
874.252	292.78
874.631	336.47
875.01	270.94
875.388	317.06
875.767	266.08
876.146	217.54
876.524	331.62
876.903	278.22
877.281	263.66
877.66	190.84
878.038	207.83
878.416	207.83
878.794	253.95
879.173	202.98
879.551	195.69
879.929	147.15
880.307	273.37
880.685	195.69
881.063	193.27
881.441	253.95
881.818	147.15
882.196	292.78
882.574	193.27
882.951	219.97
883.329	185.99
883.707	270.94
884.084	200.55
884.461	266.08
884.839	137.44
885.216	227.25
885.593	268.51
885.971	219.97
886.348	185.99
886.725	161.71
887.102	198.12
887.479	183.56
887.856	181.13
888.233	195.69
888.609	173.85
888.986	164.14
889.363	105.89
889.74	229.68
890.116	239.38
890.493	147.15
890.869	122.88
891.246	149.58
891.622	188.41
891.998	161.71
892.375	190.84
892.751	149.58
893.127	210.26
893.503	164.14
893.879	198.12
894.255	142.3
894.631	139.87
895.007	159.29
895.383	166.57
895.759	142.3
896.134	118.02
896.51	149.58
896.886	171.42
897.261	144.72
897.637	159.29
898.012	135.01
898.388	224.82
898.763	113.17
899.138	193.27
899.514	193.27
899.889	139.87
900.264	224.82
900.639	176.28
901.014	198.12
901.389	147.15
901.764	135.01
902.139	156.86
902.513	176.28
902.888	156.86
903.263	132.59
903.638	183.56
904.012	152
904.387	91.32
904.761	173.85
905.136	258.8
905.51	173.85
905.884	154.43
906.259	96.18
906.633	173.85
907.007	144.72
907.381	110.74
907.755	183.56
908.129	113.17
908.503	215.11
908.877	185.99
909.251	74.33
909.624	67.05
909.998	188.41
910.372	198.12
910.745	52.49
911.119	178.7
911.492	169
911.866	149.58
912.239	132.59
912.612	193.27
912.986	188.41
913.359	169
913.732	193.27
914.105	88.9
914.478	139.87
914.851	217.54
915.224	113.17
915.597	166.57
915.97	125.31
916.343	156.86
916.715	156.86
917.088	205.4
917.461	67.05
917.833	200.55
918.206	188.41
918.578	144.72
918.951	81.62
919.323	142.3
919.695	181.13
920.067	207.83
920.44	127.73
920.812	130.16
921.184	118.02
921.556	222.39
921.928	190.84
922.3	181.13
922.672	205.4
923.043	156.86
923.415	169
923.787	190.84
924.158	125.31
924.53	200.55
924.901	178.7
925.273	84.04
925.644	166.57
926.016	127.73
926.387	193.27
926.758	108.31
927.129	178.7
927.5	156.86
927.872	144.72
928.243	232.1
928.613	135.01
928.984	207.83
929.355	152
929.726	207.83
930.097	142.3
930.467	149.58
930.838	193.27
931.209	159.29
931.579	161.71
931.95	139.87
932.32	176.28
932.69	183.56
933.061	200.55
933.431	81.62
933.801	219.97
934.171	147.15
934.541	81.62
934.911	135.01
935.281	101.03
935.651	147.15
936.021	236.96
936.391	198.12
936.761	217.54
937.13	159.29
937.5	195.69
937.87	79.19
938.239	115.6
938.609	139.87
938.978	173.85
939.347	127.73
939.717	142.3
940.086	139.87
940.455	171.42
940.824	135.01
941.193	154.43
941.562	144.72
941.931	98.61
942.3	224.82
942.669	161.71
943.038	113.17
943.407	149.58
943.775	139.87
944.144	161.71
944.513	108.31
944.881	67.05
945.25	152
945.618	164.14
945.986	166.57
946.355	176.28
946.723	115.6
947.091	118.02
947.459	142.3
947.827	122.88
948.195	229.68
948.563	130.16
948.931	183.56
949.299	159.29
949.667	159.29
950.035	154.43
950.402	164.14
950.77	137.44
951.138	137.44
951.505	113.17
951.873	190.84
952.24	103.46
952.607	69.48
952.975	198.12
953.342	127.73
953.709	215.11
954.076	161.71
954.443	154.43
954.81	142.3
955.177	200.55
955.544	137.44
955.911	127.73
956.278	169
956.645	215.11
957.012	195.69
957.378	176.28
957.745	142.3
958.111	139.87
958.478	161.71
958.844	156.86
959.211	198.12
959.577	139.87
959.943	108.31
960.309	210.26
960.675	139.87
961.042	125.31
961.408	132.59
961.774	154.43
962.139	64.62
962.505	127.73
962.871	96.18
963.237	147.15
963.603	173.85
963.968	147.15
964.334	169
964.699	76.76
965.065	161.71
965.43	178.7
965.796	142.3
966.161	198.12
966.526	178.7
966.891	161.71
967.256	115.6
967.622	200.55
967.987	161.71
968.352	74.33
968.716	198.12
969.081	166.57
969.446	127.73
969.811	161.71
970.176	171.42
970.54	139.87
970.905	110.74
971.269	152
971.634	144.72
971.998	52.49
972.363	149.58
972.727	96.18
973.091	190.84
973.455	159.29
973.819	176.28
974.183	110.74
974.547	69.48
974.911	139.87
975.275	202.98
975.639	188.41
976.003	227.25
976.367	152
976.73	93.75
977.094	156.86
977.458	161.71
977.821	101.03
978.185	195.69
978.548	210.26
978.911	164.14
979.275	91.32
979.638	173.85
980.001	101.03
980.364	207.83
980.727	149.58
981.09	142.3
981.453	137.44
981.816	152
982.179	234.53
982.542	173.85
982.905	142.3
983.267	96.18
983.63	212.69
983.992	166.57
984.355	67.05
984.717	137.44
985.08	103.46
985.442	98.61
985.804	103.46
986.167	135.01
986.529	190.84
986.891	161.71
987.253	154.43
987.615	183.56
987.977	142.3
988.339	200.55
988.701	166.57
989.062	227.25
989.424	147.15
989.786	86.47
990.147	108.31
990.509	178.7
990.87	125.31
991.232	135.01
991.593	185.99
991.955	193.27
992.316	127.73
992.677	137.44
993.038	127.73
993.399	115.6
993.76	103.46
994.121	222.39
994.482	200.55
994.843	142.3
995.204	173.85
995.565	152
995.926	118.02
996.286	122.88
996.647	169
997.007	122.88
997.368	137.44
997.728	178.7
998.089	103.46
998.449	113.17
998.809	147.15
999.169	98.61
999.53	110.74
999.89	171.42
1000.25	169
1000.61	200.55
1000.97	147.15
1001.329	105.89
1001.689	234.53
1002.049	152
1002.409	127.73
1002.768	125.31
1003.128	183.56
1003.487	147.15
1003.847	142.3
1004.206	115.6
1004.566	183.56
1004.925	173.85
1005.284	183.56
1005.643	130.16
1006.003	130.16
1006.362	159.29
1006.721	185.99
1007.08	135.01
1007.438	76.76
1007.797	115.6
1008.156	120.45
1008.515	188.41
1008.874	173.85
1009.232	202.98
1009.591	115.6
1009.949	181.13
1010.308	229.68
1010.666	207.83
1011.024	147.15
1011.383	176.28
1011.741	166.57
1012.099	147.15
1012.457	178.7
1012.815	166.57
1013.173	193.27
1013.531	127.73
1013.889	113.17
1014.247	152
1014.605	96.18
1014.962	190.84
1015.32	152
1015.678	120.45
1016.035	202.98
1016.393	105.89
1016.75	152
1017.107	239.38
1017.465	173.85
1017.822	108.31
1018.179	193.27
1018.536	137.44
1018.894	149.58
1019.251	169
1019.608	108.31
1019.964	139.87
1020.321	96.18
1020.678	181.13
1021.035	74.33
1021.392	127.73
1021.748	156.86
1022.105	185.99
1022.461	125.31
1022.818	224.82
1023.174	103.46
1023.531	105.89
1023.887	178.7
1024.243	171.42
1024.599	91.32
1024.955	110.74
1025.311	215.11
1025.667	98.61
1026.023	105.89
1026.379	91.32
1026.735	152
1027.091	86.47
1027.447	185.99
