189.514	149.43
189.973	149.43
190.431	149.43
190.889	-15.63
191.348	-13.2
191.806	15.93
192.264	42.63
192.722	-13.2
193.18	-32.62
193.638	-25.33
194.096	-1.06
194.554	-93.3
195.012	32.92
195.47	-15.63
195.928	-69.02
196.385	35.35
196.843	3.79
197.301	49.91
197.758	-1.06
198.216	20.78
198.674	32.92
199.131	32.92
199.589	64.47
200.046	-10.77
200.503	20.78
200.961	86.32
201.418	35.35
201.875	113.02
202.332	88.75
202.79	74.18
203.247	183.41
203.704	103.31
204.161	45.06
204.618	171.27
205.075	180.98
205.532	113.02
205.989	137.29
206.445	159.13
206.902	193.12
207.359	105.74
207.816	166.42
208.272	176.13
208.729	202.82
209.185	139.72
209.642	127.58
210.098	142.14
210.555	125.15
211.011	62.05
211.467	105.74
211.924	202.82
212.38	163.99
212.836	120.3
213.292	113.02
213.748	161.56
214.204	100.88
214.66	108.16
215.116	193.12
215.572	195.54
216.028	115.44
216.484	113.02
216.94	193.12
217.396	147
217.851	180.98
218.307	188.26
218.763	117.87
219.218	156.71
219.674	147
220.129	125.15
220.585	144.57
221.04	168.84
221.496	149.43
221.951	86.32
222.406	134.86
222.861	132.44
223.317	202.82
223.772	134.86
224.227	161.56
224.682	151.85
225.137	120.3
225.592	69.33
226.047	163.99
226.502	115.44
226.957	125.15
227.411	125.15
227.866	137.29
228.321	83.89
228.776	178.55
229.23	122.73
229.685	96.03
230.139	54.76
230.594	173.7
231.048	149.43
231.503	139.72
231.957	151.85
232.411	83.89
232.865	103.31
233.32	98.45
233.774	134.86
234.228	79.04
234.682	142.14
235.136	110.59
235.59	159.13
236.044	185.83
236.498	163.99
236.952	154.28
237.406	91.17
237.86	98.45
238.313	163.99
238.767	100.88
239.221	127.58
239.674	117.87
240.128	120.3
240.581	125.15
241.035	142.14
241.488	137.29
241.942	144.57
242.395	171.27
242.848	173.7
243.301	149.43
243.755	197.97
244.208	159.13
244.661	193.12
245.114	120.3
245.567	93.6
246.02	91.17
246.473	127.58
246.926	139.72
247.379	214.96
247.832	197.97
248.284	176.13
248.737	137.29
249.19	113.02
249.642	166.42
250.095	62.05
250.547	142.14
251	100.88
251.452	86.32
251.905	142.14
252.357	151.85
252.81	108.16
253.262	130.01
253.714	139.72
254.166	103.31
254.618	88.75
255.07	120.3
255.523	149.43
255.975	197.97
256.427	149.43
256.878	142.14
257.33	154.28
257.782	127.58
258.234	195.54
258.686	74.18
259.137	166.42
259.589	188.26
260.041	120.3
260.492	105.74
260.944	178.55
261.395	125.15
261.847	151.85
262.298	66.9
262.749	115.44
263.201	205.25
263.652	115.44
264.103	161.56
264.554	149.43
265.005	98.45
265.457	147
265.908	180.98
266.359	159.13
266.809	49.91
267.26	173.7
267.711	168.84
268.162	130.01
268.613	139.72
269.064	147
269.514	115.44
269.965	178.55
270.415	149.43
270.866	166.42
271.316	171.27
271.767	193.12
272.217	173.7
272.668	110.59
273.118	137.29
273.568	173.7
274.019	125.15
274.469	122.73
274.919	183.41
275.369	156.71
275.819	193.12
276.269	166.42
276.719	88.75
277.169	205.25
277.619	66.9
278.069	163.99
278.518	200.4
278.968	54.76
279.418	125.15
279.867	154.28
280.317	176.13
280.767	93.6
281.216	105.74
281.666	137.29
282.115	163.99
282.564	144.57
283.014	159.13
283.463	117.87
283.912	134.86
284.361	105.74
284.811	120.3
285.26	217.39
285.709	190.69
286.158	137.29
286.607	163.99
287.056	83.89
287.505	168.84
287.953	79.04
288.402	120.3
288.851	134.86
289.3	132.44
289.748	147
290.197	161.56
290.646	193.12
291.094	147
291.543	176.13
291.991	132.44
292.439	52.34
292.888	156.71
293.336	120.3
293.784	188.26
294.233	168.84
294.681	142.14
295.129	159.13
295.577	154.28
296.025	86.32
296.473	137.29
296.921	168.84
297.369	117.87
297.817	110.59
298.264	130.01
298.712	159.13
299.16	156.71
299.608	217.39
300.055	159.13
300.503	180.98
300.95	113.02
301.398	127.58
301.845	188.26
302.293	117.87
302.74	125.15
303.187	168.84
303.635	147
304.082	190.69
304.529	171.27
304.976	137.29
305.423	171.27
305.87	147
306.317	122.73
306.764	176.13
307.211	176.13
307.658	166.42
308.105	161.56
308.552	105.74
308.998	178.55
309.445	134.86
309.892	110.59
310.338	151.85
310.785	120.3
311.231	161.56
311.678	173.7
312.124	134.86
312.571	115.44
313.017	180.98
313.463	149.43
313.909	54.76
314.356	151.85
314.802	185.83
315.248	134.86
315.694	98.45
316.14	159.13
316.586	159.13
317.032	183.41
317.478	180.98
317.923	108.16
318.369	163.99
318.815	134.86
319.261	151.85
319.706	154.28
320.152	156.71
320.597	144.57
321.043	185.83
321.488	171.27
321.934	76.61
322.379	79.04
322.824	110.59
323.27	159.13
323.715	149.43
324.16	149.43
324.605	120.3
325.05	180.98
325.495	100.88
325.94	168.84
326.385	156.71
326.83	144.57
327.275	98.45
327.72	171.27
328.165	132.44
328.61	132.44
329.054	180.98
329.499	163.99
329.943	139.72
330.388	168.84
330.832	166.42
331.277	139.72
331.721	142.14
332.166	144.57
332.61	103.31
333.054	110.59
333.499	132.44
333.943	159.13
334.387	100.88
334.831	195.54
335.275	195.54
335.719	261.08
336.163	200.4
336.607	139.72
337.051	120.3
337.495	163.99
337.938	163.99
338.382	120.3
338.826	147
339.269	188.26
339.713	98.45
340.157	115.44
340.6	168.84
341.044	154.28
341.487	108.16
341.93	96.03
342.374	125.15
342.817	156.71
343.26	183.41
343.703	163.99
344.146	147
344.59	74.18
345.033	134.86
345.476	190.69
345.919	110.59
346.361	71.75
346.804	127.58
347.247	100.88
347.69	100.88
348.133	120.3
348.575	183.41
349.018	125.15
349.461	91.17
349.903	151.85
350.346	149.43
350.788	117.87
351.23	134.86
351.673	137.29
352.115	178.55
352.557	130.01
353	108.16
353.442	212.53
353.884	224.67
354.326	202.82
354.768	52.34
355.21	137.29
355.652	176.13
356.094	96.03
356.536	130.01
356.978	134.86
357.419	166.42
357.861	219.82
358.303	185.83
358.744	205.25
359.186	205.25
359.627	100.88
360.069	122.73
360.51	178.55
360.952	163.99
361.393	93.6
361.834	132.44
362.276	149.43
362.717	205.25
363.158	168.84
363.599	151.85
364.04	88.75
364.481	147
364.922	139.72
365.363	134.86
365.804	217.39
366.245	190.69
366.686	205.25
367.126	222.24
367.567	246.51
368.008	120.3
368.448	200.4
368.889	197.97
369.33	98.45
369.77	205.25
370.21	159.13
370.651	176.13
371.091	127.58
371.531	132.44
371.972	115.44
372.412	120.3
372.852	113.02
373.292	173.7
373.732	105.74
374.172	139.72
374.612	105.74
375.052	178.55
375.492	144.57
375.932	180.98
376.372	149.43
376.811	180.98
377.251	183.41
377.691	137.29
378.13	115.44
378.57	200.4
379.009	212.53
379.449	134.86
379.888	117.87
380.328	127.58
380.767	147
381.206	171.27
381.645	171.27
382.085	127.58
382.524	130.01
382.963	130.01
383.402	115.44
383.841	156.71
384.28	122.73
384.719	139.72
385.158	156.71
385.596	163.99
386.035	161.56
386.474	159.13
386.913	159.13
387.351	176.13
387.79	120.3
388.228	120.3
388.667	137.29
389.105	207.68
389.544	163.99
389.982	154.28
390.42	173.7
390.859	159.13
391.297	168.84
391.735	134.86
392.173	188.26
392.611	154.28
393.049	161.56
393.487	57.19
393.925	154.28
394.363	120.3
394.801	144.57
395.239	91.17
395.676	98.45
396.114	98.45
396.552	151.85
396.989	139.72
397.427	117.87
397.864	173.7
398.302	156.71
398.739	161.56
399.177	122.73
399.614	154.28
400.051	144.57
400.488	159.13
400.926	125.15
401.363	156.71
401.8	163.99
402.237	149.43
402.674	217.39
403.111	183.41
403.548	147
403.985	134.86
404.421	108.16
404.858	142.14
405.295	113.02
405.732	127.58
406.168	180.98
406.605	103.31
407.041	113.02
407.478	154.28
407.914	149.43
408.351	147
408.787	180.98
409.223	132.44
409.66	176.13
410.096	130.01
410.532	212.53
410.968	178.55
411.404	193.12
411.84	159.13
412.276	214.96
412.712	161.56
413.148	159.13
413.584	125.15
414.02	161.56
414.455	178.55
414.891	110.59
415.327	86.32
415.762	91.17
416.198	127.58
416.633	161.56
417.069	93.6
417.504	147
417.94	142.14
418.375	210.11
418.81	127.58
419.245	127.58
419.681	171.27
420.116	193.12
420.551	96.03
420.986	137.29
421.421	188.26
421.856	166.42
422.291	122.73
422.726	139.72
423.16	147
423.595	188.26
424.03	173.7
424.464	66.9
424.899	142.14
425.334	163.99
425.768	205.25
426.203	108.16
426.637	144.57
427.071	176.13
427.506	202.82
427.94	144.57
428.374	142.14
428.809	137.29
429.243	197.97
429.677	137.29
430.111	105.74
430.545	176.13
430.979	79.04
431.413	166.42
431.847	59.62
432.28	149.43
432.714	168.84
433.148	178.55
433.582	105.74
434.015	176.13
434.449	163.99
434.882	248.94
435.316	214.96
435.749	200.4
436.183	122.73
436.616	161.56
437.049	144.57
437.483	122.73
437.916	183.41
438.349	234.38
438.782	180.98
439.215	205.25
439.648	137.29
440.081	156.71
440.514	151.85
440.947	193.12
441.38	168.84
441.813	149.43
442.245	185.83
442.678	210.11
443.111	227.1
443.543	190.69
443.976	137.29
444.408	166.42
444.841	236.81
445.273	214.96
445.705	200.4
446.138	137.29
446.57	217.39
447.002	214.96
447.434	263.51
447.867	229.52
448.299	212.53
448.731	190.69
449.163	217.39
449.595	171.27
450.026	132.44
450.458	163.99
450.89	197.97
451.322	195.54
451.754	261.08
452.185	224.67
452.617	185.83
453.048	299.91
453.48	307.2
453.911	309.62
454.343	312.05
454.774	253.8
455.205	224.67
455.637	299.91
456.068	270.79
456.499	261.08
456.93	297.49
457.361	268.36
457.792	244.09
458.223	331.47
458.654	275.64
459.085	222.24
459.516	241.66
459.947	263.51
460.378	185.83
460.808	248.94
461.239	234.38
461.669	219.82
462.1	258.65
462.531	261.08
462.961	295.06
463.391	290.2
463.822	207.68
464.252	214.96
464.682	219.82
465.113	273.21
465.543	280.5
465.973	268.36
466.403	239.23
466.833	295.06
467.263	268.36
467.693	241.66
468.123	236.81
468.553	246.51
468.983	195.54
469.412	256.22
469.842	253.8
470.272	246.51
470.701	163.99
471.131	222.24
471.56	246.51
471.99	154.28
472.419	193.12
472.849	217.39
473.278	212.53
473.707	258.65
474.136	231.95
474.566	149.43
474.995	231.95
475.424	159.13
475.853	234.38
476.282	246.51
476.711	193.12
477.14	202.82
477.569	212.53
477.997	222.24
478.426	200.4
478.855	287.78
479.283	261.08
479.712	236.81
480.141	171.27
480.569	229.52
480.998	195.54
481.426	151.85
481.854	183.41
482.283	231.95
482.711	188.26
483.139	268.36
483.567	178.55
483.995	188.26
484.424	273.21
484.852	168.84
485.28	210.11
485.708	212.53
486.135	229.52
486.563	163.99
486.991	200.4
487.419	188.26
487.847	139.72
488.274	236.81
488.702	202.82
489.129	142.14
489.557	127.58
489.984	202.82
490.412	185.83
490.839	214.96
491.266	134.86
491.694	166.42
492.121	144.57
492.548	183.41
492.975	234.38
493.402	188.26
493.829	113.02
494.256	132.44
494.683	159.13
495.11	125.15
495.537	171.27
495.964	190.69
496.39	239.23
496.817	130.01
497.244	193.12
497.67	163.99
498.097	173.7
498.523	154.28
498.95	176.13
499.376	214.96
499.803	125.15
500.229	147
500.655	161.56
501.081	202.82
501.508	134.86
501.934	217.39
502.36	173.7
502.786	173.7
503.212	161.56
503.638	207.68
504.064	231.95
504.489	147
504.915	156.71
505.341	151.85
505.767	166.42
506.192	125.15
506.618	171.27
507.043	149.43
507.469	122.73
507.894	74.18
508.32	147
508.745	200.4
509.17	193.12
509.596	217.39
510.021	113.02
510.446	151.85
510.871	214.96
511.296	139.72
511.721	197.97
512.146	149.43
512.571	117.87
512.996	154.28
513.421	173.7
513.845	149.43
514.27	154.28
514.695	105.74
515.119	156.71
515.544	105.74
515.969	193.12
516.393	113.02
516.817	147
517.242	173.7
517.666	200.4
518.09	173.7
518.515	197.97
518.939	188.26
519.363	360.59
519.787	156.71
520.211	207.68
520.635	156.71
521.059	190.69
521.483	195.54
521.907	190.69
522.331	168.84
522.754	151.85
523.178	156.71
523.602	171.27
524.025	248.94
524.449	156.71
524.872	137.29
525.296	151.85
525.719	154.28
526.143	173.7
526.566	156.71
526.989	200.4
527.412	231.95
527.836	188.26
528.259	217.39
528.682	142.14
529.105	265.93
529.528	137.29
529.951	197.97
530.374	217.39
530.796	197.97
531.219	222.24
531.642	193.12
532.065	178.55
532.487	161.56
532.91	180.98
533.332	168.84
533.755	142.14
534.177	81.46
534.6	137.29
535.022	142.14
535.444	188.26
535.867	125.15
536.289	79.04
536.711	195.54
537.133	183.41
537.555	239.23
537.977	188.26
538.399	214.96
538.821	246.51
539.243	154.28
539.665	222.24
540.086	149.43
540.508	244.09
540.93	190.69
541.351	190.69
541.773	219.82
542.195	197.97
542.616	229.52
543.037	236.81
543.459	212.53
543.88	212.53
544.301	295.06
544.723	236.81
545.144	142.14
545.565	222.24
545.986	210.11
546.407	163.99
546.828	210.11
547.249	180.98
547.67	195.54
548.091	147
548.512	185.83
548.932	130.01
549.353	234.38
549.774	190.69
550.194	178.55
550.615	142.14
551.035	229.52
551.456	222.24
551.876	120.3
552.296	214.96
552.717	236.81
553.137	151.85
553.557	180.98
553.977	151.85
554.397	142.14
554.817	137.29
555.237	132.44
555.657	125.15
556.077	151.85
556.497	132.44
556.917	224.67
557.337	173.7
557.756	188.26
558.176	173.7
558.596	183.41
559.015	173.7
559.435	110.59
559.854	122.73
560.274	180.98
560.693	173.7
561.112	105.74
561.532	173.7
561.951	180.98
562.37	217.39
562.789	190.69
563.208	251.37
563.627	224.67
564.046	117.87
564.465	244.09
564.884	127.58
565.303	224.67
565.722	142.14
566.14	154.28
566.559	127.58
566.978	219.82
567.396	258.65
567.815	239.23
568.233	224.67
568.652	258.65
569.07	173.7
569.489	134.86
569.907	178.55
570.325	239.23
570.743	210.11
571.161	171.27
571.58	251.37
571.998	200.4
572.416	173.7
572.833	142.14
573.251	54.76
573.669	202.82
574.087	193.12
574.505	178.55
574.922	117.87
575.34	236.81
575.758	178.55
576.175	139.72
576.593	248.94
577.01	120.3
577.428	188.26
577.845	1520.81
578.262	304.77
578.68	234.38
579.097	173.7
579.514	156.71
579.931	137.29
580.348	200.4
580.765	193.12
581.182	214.96
581.599	178.55
582.016	161.56
582.433	261.08
582.849	144.57
583.266	227.1
583.683	188.26
584.099	122.73
584.516	210.11
584.933	197.97
585.349	190.69
585.765	183.41
586.182	205.25
586.598	151.85
587.014	185.83
587.431	166.42
587.847	202.82
588.263	183.41
588.679	244.09
589.095	127.58
589.511	188.26
589.927	130.01
590.343	163.99
590.759	161.56
591.174	200.4
591.59	195.54
592.006	168.84
592.421	193.12
592.837	197.97
593.252	190.69
593.668	122.73
594.083	151.85
594.499	134.86
594.914	205.25
595.329	197.97
595.745	202.82
596.16	248.94
596.575	244.09
596.99	171.27
597.405	103.31
597.82	144.57
598.235	185.83
598.65	217.39
599.065	139.72
599.479	166.42
599.894	200.4
600.309	195.54
600.724	231.95
601.138	227.1
601.553	127.58
601.967	137.29
602.382	151.85
602.796	100.88
603.21	120.3
603.625	161.56
604.039	130.01
604.453	142.14
604.867	197.97
605.281	217.39
605.695	210.11
606.109	200.4
606.523	168.84
606.937	188.26
607.351	229.52
607.765	161.56
608.178	246.51
608.592	202.82
609.006	168.84
609.419	231.95
609.833	178.55
610.246	236.81
610.66	202.82
611.073	229.52
611.487	246.51
611.9	227.1
612.313	200.4
612.726	200.4
613.139	115.44
613.553	224.67
613.966	197.97
614.379	113.02
614.792	207.68
615.204	159.13
615.617	91.17
616.03	151.85
616.443	125.15
616.856	210.11
617.268	207.68
617.681	154.28
618.093	120.3
618.506	190.69
618.918	263.51
619.331	151.85
619.743	197.97
620.155	171.27
620.568	115.44
620.98	161.56
621.392	183.41
621.804	258.65
622.216	178.55
622.628	195.54
623.04	193.12
623.452	166.42
623.864	173.7
624.276	142.14
624.687	137.29
625.099	156.71
625.511	231.95
625.922	122.73
626.334	197.97
626.745	86.32
627.157	166.42
627.568	117.87
627.979	178.55
628.391	205.25
628.802	161.56
629.213	144.57
629.624	151.85
630.035	113.02
630.446	212.53
630.857	113.02
631.268	115.44
631.679	105.74
632.09	200.4
632.501	163.99
632.912	137.29
633.322	183.41
633.733	163.99
634.144	161.56
634.554	154.28
634.965	190.69
635.375	159.13
635.785	137.29
636.196	207.68
636.606	113.02
637.016	130.01
637.427	130.01
637.837	224.67
638.247	163.99
638.657	139.72
639.067	127.58
639.477	180.98
639.887	224.67
640.297	139.72
640.706	120.3
641.116	122.73
641.526	130.01
641.935	224.67
642.345	142.14
642.755	134.86
643.164	144.57
643.573	100.88
643.983	125.15
644.392	120.3
644.801	142.14
645.211	115.44
645.62	113.02
646.029	205.25
646.438	171.27
646.847	227.1
647.256	120.3
647.665	139.72
648.074	110.59
648.483	168.84
648.892	176.13
649.3	149.43
649.709	100.88
650.118	173.7
650.526	110.59
650.935	161.56
651.343	149.43
651.752	96.03
652.16	108.16
652.568	100.88
652.977	127.58
653.385	86.32
653.793	178.55
654.201	166.42
654.609	207.68
655.017	151.85
655.425	98.45
655.833	100.88
656.241	115.44
656.649	171.27
657.057	139.72
657.464	117.87
657.872	96.03
658.28	122.73
658.687	137.29
659.095	142.14
659.502	200.4
659.91	173.7
660.317	113.02
660.724	173.7
661.132	168.84
661.539	137.29
661.946	88.75
662.353	147
662.76	134.86
663.167	96.03
663.574	134.86
663.981	161.56
664.388	120.3
664.795	147
665.202	161.56
665.608	127.58
666.015	137.29
666.422	214.96
666.828	180.98
667.235	166.42
667.641	144.57
668.047	149.43
668.454	151.85
668.86	134.86
669.266	151.85
669.673	149.43
670.079	139.72
670.485	222.24
670.891	134.86
671.297	105.74
671.703	127.58
672.109	154.28
672.515	96.03
672.92	180.98
673.326	113.02
673.732	173.7
674.138	137.29
674.543	134.86
674.949	166.42
675.354	79.04
675.76	159.13
676.165	185.83
676.57	105.74
676.976	147
677.381	103.31
677.786	127.58
678.191	156.71
678.596	142.14
679.001	190.69
679.406	117.87
679.811	197.97
680.216	144.57
680.621	122.73
681.026	96.03
681.43	93.6
681.835	161.56
682.24	149.43
682.644	202.82
683.049	168.84
683.453	134.86
683.858	108.16
684.262	159.13
684.667	127.58
685.071	151.85
685.475	105.74
685.879	166.42
686.283	96.03
686.687	151.85
687.091	100.88
687.495	147
687.899	212.53
688.303	130.01
688.707	173.7
689.111	171.27
689.514	183.41
689.918	166.42
690.322	154.28
690.725	263.51
691.129	132.44
691.532	154.28
691.936	168.84
692.339	122.73
692.742	212.53
693.146	151.85
693.549	178.55
693.952	178.55
694.355	144.57
694.758	185.83
695.161	185.83
695.564	171.27
695.967	98.45
696.37	200.4
696.773	188.26
697.175	178.55
697.578	134.86
697.981	156.71
698.383	202.82
698.786	210.11
699.188	200.4
699.591	176.13
699.993	200.4
700.395	210.11
700.798	195.54
701.2	239.23
701.602	156.71
702.004	168.84
702.406	151.85
702.808	161.56
703.21	214.96
703.612	236.81
704.014	229.52
704.416	183.41
704.818	188.26
705.219	178.55
705.621	234.38
706.023	183.41
706.424	163.99
706.826	188.26
707.227	159.13
707.629	173.7
708.03	171.27
708.431	197.97
708.832	200.4
709.234	231.95
709.635	239.23
710.036	200.4
710.437	214.96
710.838	173.7
711.239	197.97
711.64	248.94
712.041	275.64
712.441	263.51
712.842	236.81
713.243	166.42
713.643	217.39
714.044	285.35
714.445	287.78
714.845	319.33
715.246	285.35
715.646	239.23
716.046	241.66
716.447	222.24
716.847	285.35
717.247	295.06
717.647	258.65
718.047	248.94
718.447	319.33
718.847	367.88
719.247	273.21
719.647	343.6
720.047	329.04
720.446	273.21
720.846	331.47
721.246	380.01
721.645	336.32
722.045	399.43
722.444	384.87
722.844	384.87
723.243	404.28
723.643	416.42
724.042	406.71
724.441	523.22
724.84	416.42
725.24	384.87
725.639	387.29
726.038	445.55
726.437	455.26
726.836	462.54
727.234	428.56
727.633	457.68
728.032	515.94
728.431	535.35
728.83	552.34
729.228	484.38
729.627	651.86
730.025	545.06
730.424	603.32
730.822	729.53
731.22	746.52
731.619	838.76
732.017	867.88
732.415	765.94
732.813	955.26
733.212	998.95
733.61	1137.31
734.008	1171.29
734.406	1159.15
734.803	1207.69
735.201	1142.16
735.599	1370.32
735.997	1547.51
736.395	1690.71
736.792	1637.31
737.19	1678.58
737.587	1552.36
737.985	1719.84
738.382	2052.37
738.78	2360.63
739.177	2452.86
739.574	2498.98
739.971	2280.53
740.369	2309.65
740.766	2377.62
741.163	2945.59
741.56	3324.23
741.957	3333.94
742.354	3280.54
742.751	2945.59
743.147	2998.98
743.544	3324.23
743.941	3957.74
744.338	4491.73
744.734	4457.75
745.131	4164.05
745.527	3846.09
745.924	4134.92
746.32	4797.56
746.716	5651.94
747.113	6292.73
747.509	6268.45
747.905	5671.36
748.301	5482.03
748.697	5654.37
749.093	6651.95
749.489	7693.23
749.885	8409.26
750.281	8491.79
750.677	7443.23
751.073	6943.22
751.468	7644.69
751.864	9227.24
752.26	10520.95
752.655	11125.32
753.051	10817.07
753.446	9695.69
753.842	9006.36
754.237	9802.49
754.632	11173.87
755.028	13093.8
755.423	13506.43
755.818	12368.06
756.213	11484.55
756.608	10564.64
757.003	11236.98
757.398	13003.99
757.793	14804.99
758.188	15360.83
758.583	14329.26
758.977	12676.32
759.372	11826.79
759.767	13156.91
760.161	15938.51
760.556	19045.35
760.95	20241.97
761.345	19496.81
761.739	17455.52
762.133	15979.77
762.527	17040.47
762.922	19761.38
763.316	23785.72
763.71	25504.19
764.104	24433.78
764.498	22069.67
764.892	19579.34
765.286	19606.04
765.68	22538.12
766.073	26664.4
766.467	28967.84
766.861	29062.5
767.255	26023.61
767.648	23052.69
768.042	22343.95
768.435	25343.99
768.829	29654.74
769.222	33222.76
769.615	34084.42
770.008	30494.56
770.402	26793.04
770.795	24749.32
771.188	26200.8
771.581	30038.24
771.974	33863.54
772.367	34375.69
772.76	33055.28
773.153	28351.32
773.545	25273.6
773.938	25620.7
774.331	29081.91
774.724	34310.15
775.116	37400.01
775.509	38181.57
775.901	34460.64
776.294	30477.57
776.686	29397.45
777.078	31914.48
777.471	38128.17
777.863	43426.8
778.255	45625.86
778.647	43383.11
779.039	38827.21
779.431	33861.12
779.823	34264.03
780.215	38387.88
780.607	42710.77
780.999	46926.85
781.39	46669.57
781.782	43259.32
782.174	37795.64
782.565	36239.79
782.957	37963.12
783.348	43516.61
783.74	48708.43
784.131	49604.08
784.522	47783.66
784.914	41895.22
785.305	36810.19
785.696	35713.09
786.087	38679.15
786.478	42387.95
786.869	45378.28
787.26	45293.33
787.651	41662.21
788.042	36130.57
788.433	32215.46
788.823	31846.52
789.214	34276.17
789.605	37213.11
789.995	39722.86
790.386	37771.37
790.776	34647.54
791.167	30361.06
791.557	28878.03
791.948	30069.79
792.338	33635.38
792.728	39662.18
793.118	42645.23
793.508	40502
793.898	36916.99
794.288	32669.35
794.678	30310.09
795.068	31426.61
795.458	35526.19
795.848	39810.24
796.238	41798.13
796.627	39451.01
797.017	35788.33
797.406	31652.34
797.796	29810.08
798.185	31339.23
798.575	35038.32
798.964	38734.98
799.354	41878.23
799.743	39972.86
800.132	35899.98
800.521	31812.54
800.91	29688.72
801.299	30513.98
801.688	34443.65
802.077	38458.27
802.466	41062.68
802.855	38955.85
803.244	34404.81
803.633	29963
804.021	26970.23
804.41	27737.23
804.799	30370.77
805.187	33040.71
805.576	34239.76
805.964	33676.65
806.352	29375.61
806.741	25967.79
807.129	23079.39
807.517	23387.65
807.905	26528.48
808.293	29994.55
808.681	33123.24
809.069	32307.69
809.457	30137.76
809.845	26220.22
810.233	23186.19
810.621	23215.32
811.009	25729.92
811.396	29448.43
811.784	32912.07
812.171	33069.84
812.559	30504.27
812.946	26348.86
813.334	23018.71
813.721	21657.04
814.108	22496.86
814.496	25135.25
814.883	28788.22
815.27	31064.96
815.657	28885.31
816.044	25766.33
816.431	22142.49
816.818	20011.39
817.205	20501.68
817.592	23365.81
817.979	26472.65
818.365	28489.67
818.752	27312.47
819.139	24280.87
819.525	20460.42
819.912	17664.26
820.298	16683.66
820.685	17875.43
821.071	20297.8
821.457	22336.66
821.843	22200.74
822.23	20627.9
822.616	17916.69
823.002	15076.84
823.388	13023.41
823.774	13200.6
824.16	14200.62
824.546	16069.58
824.931	17188.53
825.317	16807.45
825.703	15195.78
826.089	12836.52
826.474	11154.45
826.86	10338.9
827.245	11088.92
827.631	13079.24
828.016	15033.15
828.401	15348.69
828.787	14545.28
829.172	12848.65
829.557	10586.48
829.942	9037.91
830.327	9064.61
830.712	9933.56
831.097	11324.36
831.482	12596.22
831.867	12567.09
832.252	11460.28
832.636	9892.3
833.021	8023.33
833.406	7584.01
833.79	7484.49
834.175	8368
834.559	9916.57
834.944	10394.73
835.328	10732.11
835.713	9433.55
836.097	7821.88
836.481	6244.18
836.865	5853.4
837.249	5938.35
837.633	6676.23
838.017	7574.3
838.401	8215.09
838.785	7722.36
839.169	6897.1
839.553	5766.02
839.937	4639.79
840.32	4219.88
840.704	4154.34
841.087	4848.53
841.471	5287.86
841.854	5785.44
842.238	5659.22
842.621	4897.07
843.004	3948.03
843.388	3399.48
843.771	3164.04
844.154	3309.67
844.537	3935.89
844.92	4457.75
845.303	4707.75
845.686	4651.92
846.069	4251.43
846.452	3554.82
846.834	2909.18
847.217	2613.06
847.6	2787.82
847.982	3057.24
848.365	3756.28
848.748	3882.49
849.13	3867.93
849.512	3571.81
849.895	2998.98
850.277	2450.43
850.659	2113.05
851.041	2166.45
851.423	2484.41
851.806	2850.92
852.188	3156.75
852.57	3219.86
852.951	2887.33
853.333	2600.92
853.715	2125.18
854.097	1719.84
854.479	1761.1
854.86	1894.6
855.242	2093.63
855.623	2338.78
856.005	2394.61
856.386	2353.34
856.768	1957.71
857.149	1654.3
857.53	1275.66
857.911	1360.61
858.292	1367.89
858.674	1394.59
859.055	1702.85
859.436	1625.18
859.817	1661.59
860.197	1486.83
860.578	1299.93
860.959	1037.79
861.34	952.84
861.72	911.57
862.101	1011.09
862.482	1134.88
862.862	1258.67
863.243	1270.8
863.623	1287.79
864.003	1185.85
864.384	938.27
864.764	867.88
865.144	765.94
865.524	753.8
865.904	850.89
866.284	858.17
866.664	916.43
867.044	865.46
867.424	880.02
867.804	756.23
868.183	707.69
868.563	583.9
868.943	586.33
869.322	571.76
869.702	617.88
870.081	705.26
870.461	659.14
870.84	678.56
871.22	630.02
871.599	484.38
871.978	479.53
872.357	430.98
872.736	457.68
873.115	421.27
873.494	399.43
873.873	508.65
874.252	530.5
874.631	445.55
875.01	489.24
875.388	443.12
875.767	297.49
876.146	324.19
876.524	261.08
876.903	370.3
877.281	367.88
877.66	321.76
878.038	346.03
878.416	261.08
878.794	331.47
879.173	275.64
879.551	319.33
879.929	163.99
880.307	268.36
880.685	365.45
881.063	287.78
881.441	227.1
881.818	236.81
882.196	178.55
882.574	278.07
882.951	302.34
883.329	176.13
883.707	234.38
884.084	214.96
884.461	224.67
884.839	248.94
885.216	244.09
885.593	287.78
885.971	265.93
886.348	195.54
886.725	229.52
887.102	227.1
887.479	214.96
887.856	142.14
888.233	180.98
888.609	219.82
888.986	132.44
889.363	241.66
889.74	200.4
890.116	231.95
890.493	241.66
890.869	163.99
891.246	154.28
891.622	207.68
891.998	200.4
892.375	144.57
892.751	147
893.127	176.13
893.503	149.43
893.879	149.43
894.255	227.1
894.631	183.41
895.007	100.88
895.383	161.56
895.759	142.14
896.134	154.28
896.51	110.59
896.886	122.73
897.261	180.98
897.637	163.99
898.012	214.96
898.388	134.86
898.763	151.85
899.138	132.44
899.514	59.62
899.889	144.57
900.264	156.71
900.639	161.56
901.014	134.86
901.389	190.69
901.764	132.44
902.139	83.89
902.513	81.46
902.888	142.14
903.263	144.57
903.638	100.88
904.012	125.15
904.387	147
904.761	115.44
905.136	217.39
905.51	88.75
905.884	195.54
906.259	127.58
906.633	156.71
907.007	168.84
907.381	183.41
907.755	134.86
908.129	139.72
908.503	219.82
908.877	180.98
909.251	183.41
909.624	171.27
909.998	125.15
910.372	151.85
910.745	105.74
911.119	144.57
911.492	134.86
911.866	125.15
912.239	147
912.612	105.74
912.986	115.44
913.359	115.44
913.732	154.28
914.105	110.59
914.478	142.14
914.851	178.55
915.224	122.73
915.597	134.86
915.97	137.29
916.343	113.02
916.715	166.42
917.088	127.58
917.461	166.42
917.833	149.43
918.206	139.72
918.578	161.56
918.951	134.86
919.323	54.76
919.695	185.83
920.067	166.42
920.44	113.02
920.812	134.86
921.184	113.02
921.556	168.84
921.928	125.15
922.3	178.55
922.672	163.99
923.043	200.4
923.415	120.3
923.787	151.85
924.158	125.15
924.53	195.54
924.901	224.67
925.273	147
925.644	144.57
926.016	205.25
926.387	130.01
926.758	105.74
927.129	173.7
927.5	120.3
927.872	159.13
928.243	144.57
928.613	83.89
928.984	120.3
929.355	161.56
929.726	163.99
930.097	42.63
930.467	127.58
930.838	108.16
931.209	74.18
931.579	57.19
931.95	120.3
932.32	159.13
932.69	127.58
933.061	159.13
933.431	125.15
933.801	154.28
934.171	64.47
934.541	142.14
934.911	188.26
935.281	151.85
935.651	132.44
936.021	188.26
936.391	120.3
936.761	100.88
937.13	156.71
937.5	117.87
937.87	122.73
938.239	134.86
938.609	54.76
938.978	105.74
939.347	171.27
939.717	144.57
940.086	185.83
940.455	134.86
940.824	137.29
941.193	154.28
941.562	210.11
941.931	132.44
942.3	234.38
942.669	190.69
943.038	74.18
943.407	149.43
943.775	173.7
944.144	176.13
944.513	103.31
944.881	134.86
945.25	149.43
945.618	154.28
945.986	161.56
946.355	168.84
946.723	188.26
947.091	127.58
947.459	163.99
947.827	105.74
948.195	115.44
948.563	71.75
948.931	125.15
949.299	176.13
949.667	117.87
950.035	161.56
950.402	176.13
950.77	156.71
951.138	183.41
951.505	180.98
951.873	163.99
952.24	183.41
952.607	173.7
952.975	144.57
953.342	105.74
953.709	120.3
954.076	137.29
954.443	159.13
954.81	180.98
955.177	173.7
955.544	185.83
955.911	66.9
956.278	117.87
956.645	139.72
957.012	71.75
957.378	142.14
957.745	64.47
958.111	144.57
958.478	149.43
958.844	205.25
959.211	205.25
959.577	188.26
959.943	127.58
960.309	149.43
960.675	197.97
961.042	96.03
961.408	125.15
961.774	142.14
962.139	183.41
962.505	127.58
962.871	98.45
963.237	159.13
963.603	180.98
963.968	178.55
964.334	137.29
964.699	88.75
965.065	200.4
965.43	185.83
965.796	96.03
966.161	173.7
966.526	134.86
966.891	200.4
967.256	110.59
967.622	217.39
967.987	161.56
968.352	195.54
968.716	139.72
969.081	159.13
969.446	139.72
969.811	161.56
970.176	74.18
970.54	210.11
970.905	139.72
971.269	130.01
971.634	108.16
971.998	185.83
972.363	210.11
972.727	91.17
973.091	86.32
973.455	120.3
973.819	180.98
974.183	96.03
974.547	40.2
974.911	59.62
975.275	108.16
975.639	86.32
976.003	139.72
976.367	98.45
976.73	134.86
977.094	105.74
977.458	122.73
977.821	76.61
978.185	195.54
978.548	171.27
978.911	100.88
979.275	244.09
979.638	139.72
980.001	88.75
980.364	103.31
980.727	171.27
981.09	115.44
981.453	113.02
981.816	110.59
982.179	154.28
982.542	110.59
982.905	100.88
983.267	163.99
983.63	231.95
983.992	195.54
984.355	108.16
984.717	183.41
985.08	163.99
985.442	161.56
985.804	117.87
986.167	205.25
986.529	156.71
986.891	105.74
987.253	166.42
987.615	108.16
987.977	139.72
988.339	166.42
988.701	125.15
989.062	130.01
989.424	127.58
989.786	142.14
990.147	144.57
990.509	168.84
990.87	103.31
991.232	168.84
991.593	91.17
991.955	83.89
992.316	122.73
992.677	147
993.038	154.28
993.399	147
993.76	168.84
994.121	173.7
994.482	132.44
994.843	188.26
995.204	76.61
995.565	125.15
995.926	159.13
996.286	134.86
996.647	57.19
997.007	103.31
997.368	57.19
997.728	91.17
998.089	173.7
998.449	113.02
998.809	96.03
999.169	151.85
999.53	154.28
999.89	147
1000.25	142.14
1000.61	142.14
1000.97	108.16
1001.329	105.74
1001.689	117.87
1002.049	122.73
1002.409	120.3
1002.768	105.74
1003.128	132.44
1003.487	108.16
1003.847	173.7
1004.206	79.04
1004.566	171.27
1004.925	127.58
1005.284	130.01
1005.643	183.41
1006.003	178.55
1006.362	120.3
1006.721	130.01
1007.08	88.75
1007.438	113.02
1007.797	93.6
1008.156	127.58
1008.515	195.54
1008.874	62.05
1009.232	142.14
1009.591	120.3
1009.949	149.43
1010.308	166.42
1010.666	176.13
1011.024	127.58
1011.383	173.7
1011.741	86.32
1012.099	163.99
1012.457	113.02
1012.815	122.73
1013.173	93.6
1013.531	161.56
1013.889	93.6
1014.247	71.75
1014.605	113.02
1014.962	195.54
1015.32	156.71
1015.678	32.92
1016.035	195.54
1016.393	139.72
1016.75	144.57
1017.107	185.83
1017.465	151.85
1017.822	188.26
1018.179	180.98
1018.536	125.15
1018.894	161.56
1019.251	122.73
1019.608	178.55
1019.964	88.75
1020.321	151.85
1020.678	183.41
1021.035	161.56
1021.392	108.16
1021.748	108.16
1022.105	115.44
1022.461	173.7
1022.818	81.46
1023.174	120.3
1023.531	144.57
1023.887	137.29
1024.243	120.3
1024.599	144.57
1024.955	149.43
1025.311	127.58
1025.667	134.86
1026.023	176.13
1026.379	81.46
1026.735	151.85
1027.091	163.99
1027.447	127.58
