189.514	141.99
189.973	141.99
190.431	141.99
190.889	-6.07
191.348	32.77
191.806	23.06
192.264	10.92
192.722	3.64
193.18	-23.06
193.638	-59.47
194.096	-13.35
194.554	-35.19
195.012	37.62
195.47	15.78
195.928	-81.31
196.385	23.06
196.843	15.78
197.301	-10.92
197.758	25.49
198.216	27.91
198.674	37.62
199.131	25.49
199.589	27.91
200.046	71.6
200.503	66.75
200.961	-6.07
201.418	61.89
201.875	112.87
202.332	95.88
202.79	188.11
203.247	125
203.704	149.27
204.161	156.56
204.618	166.26
205.075	134.71
205.532	141.99
205.989	122.57
206.445	156.56
206.902	134.71
207.359	163.84
207.816	205.1
208.272	134.71
208.729	173.55
209.185	192.96
209.642	125
210.098	125
210.555	200.25
211.011	173.55
211.467	195.39
211.924	154.13
212.38	122.57
212.836	175.97
213.292	163.84
213.748	120.15
214.204	161.41
214.66	173.55
215.116	154.13
215.572	190.54
216.028	141.99
216.484	151.7
216.94	144.42
217.396	144.42
217.851	168.69
218.307	163.84
218.763	151.7
219.218	105.58
219.674	151.7
220.129	173.55
220.585	146.85
221.04	219.66
221.496	141.99
221.951	134.71
222.406	168.69
222.861	115.29
223.317	144.42
223.772	171.12
224.227	212.38
224.682	129.86
225.137	122.57
225.592	95.88
226.047	173.55
226.502	175.97
226.957	112.87
227.411	173.55
227.866	108.01
228.321	188.11
228.776	166.26
229.23	127.43
229.685	74.03
230.139	144.42
230.594	183.26
231.048	173.55
231.503	146.85
231.957	134.71
232.411	190.54
232.865	168.69
233.32	149.27
233.774	112.87
234.228	83.74
234.682	195.39
235.136	197.82
235.59	137.14
236.044	149.27
236.498	158.98
236.952	161.41
237.406	205.1
237.86	161.41
238.313	115.29
238.767	156.56
239.221	156.56
239.674	144.42
240.128	183.26
240.581	200.25
241.035	100.73
241.488	74.03
241.942	154.13
242.395	163.84
242.848	137.14
243.301	222.09
243.755	202.67
244.208	117.72
244.661	88.59
245.114	236.65
245.567	154.13
246.02	108.01
246.473	66.75
246.926	127.43
247.379	117.72
247.832	161.41
248.284	86.17
248.737	112.87
249.19	30.34
249.642	190.54
250.095	154.13
250.547	224.52
251	236.65
251.452	183.26
251.905	129.86
252.357	134.71
252.81	103.16
253.262	154.13
253.714	149.27
254.166	120.15
254.618	168.69
255.07	122.57
255.523	117.72
255.975	180.83
256.427	146.85
256.878	78.88
257.33	117.72
257.782	112.87
258.234	209.95
258.686	149.27
259.137	192.96
259.589	168.69
260.041	137.14
260.492	81.31
260.944	117.72
261.395	127.43
261.847	168.69
262.298	95.88
262.749	149.27
263.201	81.31
263.652	144.42
264.103	163.84
264.554	86.17
265.005	154.13
265.457	149.27
265.908	161.41
266.359	108.01
266.809	163.84
267.26	200.25
267.711	86.17
268.162	54.61
268.613	117.72
269.064	231.8
269.514	151.7
269.965	74.03
270.415	168.69
270.866	156.56
271.316	127.43
271.767	98.3
272.217	129.86
272.668	178.4
273.118	141.99
273.568	175.97
274.019	88.59
274.469	151.7
274.919	168.69
275.369	115.29
275.819	127.43
276.269	219.66
276.719	192.96
277.169	129.86
277.619	134.71
278.069	149.27
278.518	163.84
278.968	88.59
279.418	139.57
279.867	76.46
280.317	146.85
280.767	163.84
281.216	163.84
281.666	151.7
282.115	171.12
282.564	202.67
283.014	129.86
283.463	185.68
283.912	86.17
284.361	168.69
284.811	214.81
285.26	200.25
285.709	185.68
286.158	185.68
286.607	192.96
287.056	163.84
287.505	115.29
287.953	180.83
288.402	156.56
288.851	95.88
289.3	117.72
289.748	190.54
290.197	105.58
290.646	207.53
291.094	183.26
291.543	156.56
291.991	125
292.439	205.1
292.888	122.57
293.336	185.68
293.784	127.43
294.233	166.26
294.681	95.88
295.129	105.58
295.577	151.7
296.025	137.14
296.473	144.42
296.921	188.11
297.369	163.84
297.817	144.42
298.264	180.83
298.712	83.74
299.16	139.57
299.608	149.27
300.055	141.99
300.503	163.84
300.95	151.7
301.398	156.56
301.845	175.97
302.293	151.7
302.74	156.56
303.187	122.57
303.635	202.67
304.082	173.55
304.529	190.54
304.976	219.66
305.423	100.73
305.87	195.39
306.317	149.27
306.764	156.56
307.211	132.28
307.658	178.4
308.105	144.42
308.552	91.02
308.998	76.46
309.445	144.42
309.892	154.13
310.338	129.86
310.785	171.12
311.231	175.97
311.678	183.26
312.124	156.56
312.571	156.56
313.017	69.18
313.463	125
313.909	219.66
314.356	74.03
314.802	78.88
315.248	205.1
315.694	188.11
316.14	185.68
316.586	175.97
317.032	195.39
317.478	180.83
317.923	149.27
318.369	173.55
318.815	139.57
319.261	173.55
319.706	139.57
320.152	132.28
320.597	127.43
321.043	185.68
321.488	185.68
321.934	161.41
322.379	127.43
322.824	134.71
323.27	149.27
323.715	188.11
324.16	163.84
324.605	98.3
325.05	154.13
325.495	166.26
325.94	173.55
326.385	88.59
326.83	100.73
327.275	154.13
327.72	158.98
328.165	86.17
328.61	117.72
329.054	236.65
329.499	137.14
329.943	258.5
330.388	178.4
330.832	173.55
331.277	192.96
331.721	173.55
332.166	217.24
332.61	112.87
333.054	125
333.499	144.42
333.943	178.4
334.387	231.8
334.831	125
335.275	183.26
335.719	144.42
336.163	137.14
336.607	229.37
337.051	192.96
337.495	185.68
337.938	110.44
338.382	158.98
338.826	154.13
339.269	141.99
339.713	81.31
340.157	161.41
340.6	139.57
341.044	219.66
341.487	146.85
341.93	76.46
342.374	139.57
342.817	151.7
343.26	149.27
343.703	117.72
344.146	98.3
344.59	122.57
345.033	134.71
345.476	122.57
345.919	141.99
346.361	139.57
346.804	146.85
347.247	146.85
347.69	100.73
348.133	132.28
348.575	156.56
349.018	171.12
349.461	192.96
349.903	151.7
350.346	171.12
350.788	224.52
351.23	151.7
351.673	231.8
352.115	166.26
352.557	175.97
353	183.26
353.442	173.55
353.884	163.84
354.326	91.02
354.768	163.84
355.21	134.71
355.652	129.86
356.094	129.86
356.536	110.44
356.978	141.99
357.419	168.69
357.861	207.53
358.303	183.26
358.744	120.15
359.186	120.15
359.627	146.85
360.069	117.72
360.51	129.86
360.952	158.98
361.393	156.56
361.834	178.4
362.276	222.09
362.717	205.1
363.158	161.41
363.599	168.69
364.04	117.72
364.481	78.88
364.922	175.97
365.363	234.23
365.804	149.27
366.245	137.14
366.686	224.52
367.126	190.54
367.567	209.95
368.008	212.38
368.448	171.12
368.889	188.11
369.33	202.67
369.77	71.6
370.21	137.14
370.651	125
371.091	125
371.531	141.99
371.972	185.68
372.412	95.88
372.852	78.88
373.292	190.54
373.732	149.27
374.172	163.84
374.612	120.15
375.052	158.98
375.492	141.99
375.932	110.44
376.372	163.84
376.811	91.02
377.251	166.26
377.691	173.55
378.13	139.57
378.57	265.78
379.009	171.12
379.449	120.15
379.888	180.83
380.328	180.83
380.767	108.01
381.206	197.82
381.645	205.1
382.085	180.83
382.524	32.77
382.963	163.84
383.402	197.82
383.841	127.43
384.28	54.61
384.719	134.71
385.158	115.29
385.596	224.52
386.035	205.1
386.474	171.12
386.913	195.39
387.351	110.44
387.79	173.55
388.228	154.13
388.667	192.96
389.105	183.26
389.544	137.14
389.982	180.83
390.42	190.54
390.859	139.57
391.297	76.46
391.735	229.37
392.173	171.12
392.611	132.28
393.049	163.84
393.487	158.98
393.925	161.41
394.363	108.01
394.801	127.43
395.239	37.62
395.676	161.41
396.114	192.96
396.552	108.01
396.989	129.86
397.427	137.14
397.864	108.01
398.302	122.57
398.739	146.85
399.177	154.13
399.614	192.96
400.051	171.12
400.488	171.12
400.926	151.7
401.363	112.87
401.8	163.84
402.237	122.57
402.674	144.42
403.111	161.41
403.548	171.12
403.985	108.01
404.421	144.42
404.858	163.84
405.295	122.57
405.732	115.29
406.168	137.14
406.605	74.03
407.041	141.99
407.478	166.26
407.914	120.15
408.351	188.11
408.787	134.71
409.223	141.99
409.66	229.37
410.096	149.27
410.532	168.69
410.968	149.27
411.404	144.42
411.84	83.74
412.276	122.57
412.712	132.28
413.148	139.57
413.584	183.26
414.02	127.43
414.455	137.14
414.891	137.14
415.327	98.3
415.762	171.12
416.198	127.43
416.633	180.83
417.069	122.57
417.504	132.28
417.94	134.71
418.375	103.16
418.81	163.84
419.245	158.98
419.681	91.02
420.116	173.55
420.551	180.83
420.986	141.99
421.421	192.96
421.856	163.84
422.291	154.13
422.726	105.58
423.16	112.87
423.595	183.26
424.03	117.72
424.464	154.13
424.899	117.72
425.334	202.67
425.768	144.42
426.203	222.09
426.637	180.83
427.071	122.57
427.506	98.3
427.94	202.67
428.374	180.83
428.809	183.26
429.243	134.71
429.677	154.13
430.111	98.3
430.545	161.41
430.979	154.13
431.413	108.01
431.847	156.56
432.28	158.98
432.714	127.43
433.148	214.81
433.582	188.11
434.015	146.85
434.449	197.82
434.882	98.3
435.316	178.4
435.749	178.4
436.183	168.69
436.616	168.69
437.049	88.59
437.483	154.13
437.916	125
438.349	146.85
438.782	219.66
439.215	132.28
439.648	127.43
440.081	197.82
440.514	158.98
440.947	161.41
441.38	248.79
441.813	185.68
442.245	234.23
442.678	110.44
443.111	202.67
443.543	222.09
443.976	139.57
444.408	139.57
444.841	209.95
445.273	185.68
445.705	149.27
446.138	195.39
446.57	185.68
447.002	127.43
447.434	185.68
447.867	149.27
448.299	166.26
448.731	139.57
449.163	231.8
449.595	151.7
450.026	171.12
450.458	149.27
450.89	129.86
451.322	166.26
451.754	183.26
452.185	195.39
452.617	205.1
453.048	224.52
453.48	161.41
453.911	207.53
454.343	253.64
454.774	83.74
455.205	200.25
455.637	192.96
456.068	200.25
456.499	212.38
456.93	200.25
457.361	258.5
457.792	120.15
458.223	180.83
458.654	222.09
459.085	134.71
459.516	185.68
459.947	151.7
460.378	205.1
460.808	156.56
461.239	122.57
461.669	134.71
462.1	178.4
462.531	178.4
462.961	117.72
463.391	163.84
463.822	207.53
464.252	183.26
464.682	207.53
465.113	212.38
465.543	180.83
465.973	171.12
466.403	200.25
466.833	258.5
467.263	154.13
467.693	202.67
468.123	151.7
468.553	91.02
468.983	197.82
469.412	156.56
469.842	190.54
470.272	209.95
470.701	229.37
471.131	231.8
471.56	200.25
471.99	139.57
472.419	185.68
472.849	173.55
473.278	146.85
473.707	214.81
474.136	214.81
474.566	222.09
474.995	209.95
475.424	190.54
475.853	197.82
476.282	163.84
476.711	137.14
477.14	149.27
477.569	127.43
477.997	137.14
478.426	192.96
478.855	120.15
479.283	173.55
479.712	178.4
480.141	154.13
480.569	200.25
480.998	171.12
481.426	195.39
481.854	146.85
482.283	178.4
482.711	110.44
483.139	171.12
483.567	129.86
483.995	139.57
484.424	200.25
484.852	173.55
485.28	175.97
485.708	224.52
486.135	197.82
486.563	88.59
486.991	168.69
487.419	125
487.847	115.29
488.274	180.83
488.702	158.98
489.129	226.95
489.557	197.82
489.984	156.56
490.412	100.73
490.839	129.86
491.266	134.71
491.694	171.12
492.121	154.13
492.548	122.57
492.975	178.4
493.402	156.56
493.829	154.13
494.256	117.72
494.683	154.13
495.11	95.88
495.537	222.09
495.964	161.41
496.39	105.58
496.817	120.15
497.244	183.26
497.67	163.84
498.097	192.96
498.523	139.57
498.95	190.54
499.376	212.38
499.803	180.83
500.229	141.99
500.655	110.44
501.081	134.71
501.508	134.71
501.934	134.71
502.36	125
502.786	241.51
503.212	209.95
503.638	175.97
504.064	173.55
504.489	183.26
504.915	161.41
505.341	205.1
505.767	188.11
506.192	168.69
506.618	190.54
507.043	120.15
507.469	166.26
507.894	195.39
508.32	178.4
508.745	185.68
509.17	158.98
509.596	200.25
510.021	178.4
510.446	253.64
510.871	129.86
511.296	154.13
511.721	110.44
512.146	222.09
512.571	144.42
512.996	139.57
513.421	158.98
513.845	168.69
514.27	132.28
514.695	146.85
515.119	180.83
515.544	146.85
515.969	154.13
516.393	149.27
516.817	139.57
517.242	146.85
517.666	163.84
518.09	197.82
518.515	69.18
518.939	200.25
519.363	413.84
519.787	275.49
520.211	154.13
520.635	180.83
521.059	214.81
521.483	178.4
521.907	154.13
522.331	81.31
522.754	173.55
523.178	161.41
523.602	110.44
524.025	149.27
524.449	149.27
524.872	246.36
525.296	158.98
525.719	149.27
526.143	234.23
526.566	134.71
526.989	273.06
527.412	205.1
527.836	171.12
528.259	166.26
528.682	161.41
529.105	134.71
529.528	178.4
529.951	175.97
530.374	217.24
530.796	127.43
531.219	149.27
531.642	161.41
532.065	168.69
532.487	129.86
532.91	168.69
533.332	134.71
533.755	178.4
534.177	219.66
534.6	151.7
535.022	141.99
535.444	149.27
535.867	185.68
536.289	127.43
536.711	207.53
537.133	231.8
537.555	132.28
537.977	168.69
538.399	122.57
538.821	178.4
539.243	149.27
539.665	163.84
540.086	156.56
540.508	195.39
540.93	154.13
541.351	192.96
541.773	171.12
542.195	214.81
542.616	217.24
543.037	175.97
543.459	163.84
543.88	122.57
544.301	217.24
544.723	127.43
545.144	156.56
545.565	120.15
545.986	192.96
546.407	166.26
546.828	180.83
547.249	236.65
547.67	156.56
548.091	171.12
548.512	122.57
548.932	212.38
549.353	188.11
549.774	197.82
550.194	168.69
550.615	209.95
551.035	188.11
551.456	180.83
551.876	129.86
552.296	175.97
552.717	156.56
553.137	200.25
553.557	185.68
553.977	151.7
554.397	190.54
554.817	171.12
555.237	175.97
555.657	171.12
556.077	219.66
556.497	158.98
556.917	105.58
557.337	188.11
557.756	139.57
558.176	127.43
558.596	163.84
559.015	156.56
559.435	185.68
559.854	134.71
560.274	173.55
560.693	188.11
561.112	95.88
561.532	188.11
561.951	127.43
562.37	105.58
562.789	180.83
563.208	229.37
563.627	108.01
564.046	127.43
564.465	151.7
564.884	161.41
565.303	166.26
565.722	158.98
566.14	209.95
566.559	173.55
566.978	144.42
567.396	180.83
567.815	120.15
568.233	156.56
568.652	180.83
569.07	144.42
569.489	127.43
569.907	280.34
570.325	209.95
570.743	178.4
571.161	154.13
571.58	226.95
571.998	197.82
572.416	209.95
572.833	125
573.251	190.54
573.669	156.56
574.087	141.99
574.505	178.4
574.922	141.99
575.34	132.28
575.758	205.1
576.175	146.85
576.593	185.68
577.01	132.28
577.428	205.1
577.845	1595.9
578.262	365.3
578.68	185.68
579.097	175.97
579.514	171.12
579.931	178.4
580.348	219.66
580.765	236.65
581.182	219.66
581.599	168.69
582.016	149.27
582.433	88.59
582.849	141.99
583.266	209.95
583.683	197.82
584.099	144.42
584.516	192.96
584.933	175.97
585.349	205.1
585.765	188.11
586.182	144.42
586.598	173.55
587.014	103.16
587.431	224.52
587.847	214.81
588.263	161.41
588.679	185.68
589.095	158.98
589.511	139.57
589.927	112.87
590.343	156.56
590.759	141.99
591.174	190.54
591.59	137.14
592.006	178.4
592.421	180.83
592.837	149.27
593.252	100.73
593.668	156.56
594.083	222.09
594.499	173.55
594.914	175.97
595.329	149.27
595.745	175.97
596.16	108.01
596.575	190.54
596.99	183.26
597.405	175.97
597.82	200.25
598.235	183.26
598.65	144.42
599.065	139.57
599.479	178.4
599.894	134.71
600.309	205.1
600.724	219.66
601.138	134.71
601.553	144.42
601.967	154.13
602.382	154.13
602.796	151.7
603.21	168.69
603.625	175.97
604.039	207.53
604.453	137.14
604.867	185.68
605.281	132.28
605.695	163.84
606.109	134.71
606.523	122.57
606.937	234.23
607.351	260.93
607.765	151.7
608.178	171.12
608.592	183.26
609.006	146.85
609.419	226.95
609.833	226.95
610.246	200.25
610.66	197.82
611.073	178.4
611.487	258.5
611.9	122.57
612.313	129.86
612.726	192.96
613.139	214.81
613.553	185.68
613.966	195.39
614.379	144.42
614.792	180.83
615.204	156.56
615.617	195.39
616.03	156.56
616.443	151.7
616.856	188.11
617.268	156.56
617.681	180.83
618.093	125
618.506	173.55
618.918	132.28
619.331	122.57
619.743	137.14
620.155	207.53
620.568	171.12
620.98	134.71
621.392	166.26
621.804	222.09
622.216	141.99
622.628	180.83
623.04	100.73
623.452	146.85
623.864	59.47
624.276	178.4
624.687	134.71
625.099	141.99
625.511	149.27
625.922	212.38
626.334	156.56
626.745	192.96
627.157	110.44
627.568	175.97
627.979	202.67
628.391	144.42
628.802	212.38
629.213	120.15
629.624	141.99
630.035	175.97
630.446	166.26
630.857	158.98
631.268	178.4
631.679	188.11
632.09	149.27
632.501	163.84
632.912	231.8
633.322	156.56
633.733	91.02
634.144	146.85
634.554	132.28
634.965	158.98
635.375	93.45
635.785	178.4
636.196	190.54
636.606	202.67
637.016	132.28
637.427	188.11
637.837	212.38
638.247	171.12
638.657	156.56
639.067	129.86
639.477	178.4
639.887	141.99
640.297	120.15
640.706	171.12
641.116	200.25
641.526	192.96
641.935	120.15
642.345	115.29
642.755	192.96
643.164	178.4
643.573	129.86
643.983	149.27
644.392	248.79
644.801	239.08
645.211	197.82
645.62	137.14
646.029	129.86
646.438	125
646.847	141.99
647.256	117.72
647.665	178.4
648.074	132.28
648.483	173.55
648.892	110.44
649.3	161.41
649.709	185.68
650.118	98.3
650.526	149.27
650.935	190.54
651.343	149.27
651.752	141.99
652.16	163.84
652.568	137.14
652.977	127.43
653.385	175.97
653.793	91.02
654.201	137.14
654.609	166.26
655.017	78.88
655.425	190.54
655.833	158.98
656.241	112.87
656.649	156.56
657.057	173.55
657.464	183.26
657.872	103.16
658.28	168.69
658.687	183.26
659.095	137.14
659.502	127.43
659.91	149.27
660.317	44.9
660.724	166.26
661.132	154.13
661.539	209.95
661.946	134.71
662.353	175.97
662.76	190.54
663.167	154.13
663.574	144.42
663.981	132.28
664.388	168.69
664.795	239.08
665.202	117.72
665.608	188.11
666.015	161.41
666.422	83.74
666.828	144.42
667.235	180.83
667.641	195.39
668.047	161.41
668.454	229.37
668.86	178.4
669.266	139.57
669.673	156.56
670.079	173.55
670.485	183.26
670.891	154.13
671.297	149.27
671.703	98.3
672.109	100.73
672.515	156.56
672.92	207.53
673.326	173.55
673.732	241.51
674.138	163.84
674.543	154.13
674.949	178.4
675.354	171.12
675.76	197.82
676.165	141.99
676.57	180.83
676.976	219.66
677.381	180.83
677.786	151.7
678.191	226.95
678.596	127.43
679.001	120.15
679.406	183.26
679.811	141.99
680.216	234.23
680.621	270.64
681.026	132.28
681.43	141.99
681.835	161.41
682.24	122.57
682.644	192.96
683.049	149.27
683.453	139.57
683.858	217.24
684.262	154.13
684.667	117.72
685.071	120.15
685.475	127.43
685.879	125
686.283	168.69
686.687	163.84
687.091	180.83
687.495	134.71
687.899	188.11
688.303	173.55
688.707	141.99
689.111	134.71
689.514	205.1
689.918	137.14
690.322	149.27
690.725	234.23
691.129	112.87
691.532	205.1
691.936	180.83
692.339	127.43
692.742	144.42
693.146	200.25
693.549	253.64
693.952	258.5
694.355	183.26
694.758	192.96
695.161	212.38
695.564	144.42
695.967	175.97
696.37	212.38
696.773	178.4
697.175	154.13
697.578	171.12
697.981	171.12
698.383	141.99
698.786	188.11
699.188	195.39
699.591	183.26
699.993	163.84
700.395	168.69
700.798	195.39
701.2	207.53
701.602	222.09
702.004	146.85
702.406	127.43
702.808	188.11
703.21	192.96
703.612	231.8
704.014	134.71
704.416	163.84
704.818	190.54
705.219	156.56
705.621	273.06
706.023	212.38
706.424	243.94
706.826	178.4
707.227	217.24
707.629	158.98
708.03	173.55
708.431	248.79
708.832	214.81
709.234	217.24
709.635	260.93
710.036	253.64
710.437	149.27
710.838	229.37
711.239	256.07
711.64	287.63
712.041	304.62
712.441	217.24
712.842	270.64
713.243	243.94
713.643	302.19
714.044	280.34
714.445	336.17
714.845	219.66
715.246	248.79
715.646	258.5
716.046	316.75
716.447	338.6
716.847	336.17
717.247	299.76
717.647	270.64
718.047	326.46
718.447	399.28
718.847	331.32
719.247	307.04
719.647	406.56
720.047	326.46
720.446	304.62
720.846	365.3
721.246	418.7
721.645	328.89
722.045	324.03
722.444	387.14
722.844	408.99
723.243	404.13
723.643	396.85
724.042	404.13
724.441	394.42
724.84	377.43
725.24	459.96
725.639	358.02
726.038	396.85
726.437	438.11
726.836	365.3
727.234	491.51
727.633	588.6
728.032	552.19
728.431	518.21
728.83	593.46
729.228	608.02
729.627	627.44
730.025	661.42
730.424	639.57
730.822	743.94
731.22	726.95
731.619	792.49
732.017	848.31
732.415	867.73
732.813	906.57
733.212	904.14
733.61	1025.5
734.008	1093.46
734.406	1093.46
734.803	1183.27
735.201	1277.93
735.599	1348.32
735.997	1401.72
736.395	1428.42
736.792	1469.68
737.19	1523.08
737.587	1685.71
737.985	1702.7
738.382	1794.93
738.78	1899.3
739.177	2088.62
739.574	2134.74
739.971	2127.46
740.369	2280.38
740.766	2540.09
741.163	2464.84
741.56	2588.63
741.957	2734.27
742.354	2629.9
742.751	2809.51
743.147	3015.82
743.544	3088.64
743.941	3331.36
744.338	3396.9
744.734	3581.37
745.131	3702.73
745.527	3848.36
745.924	4027.98
746.32	4438.18
746.716	4535.26
747.113	4748.86
747.509	5083.82
747.905	5115.37
748.301	5578.97
748.697	5629.94
749.093	5960.04
749.489	6064.41
749.885	6384.81
750.281	6661.51
750.677	6906.66
751.073	7183.36
751.468	7338.71
751.864	7846
752.26	7913.96
752.655	8365.42
753.051	8826.59
753.446	9166.4
753.842	9452.82
754.237	9651.85
754.632	9741.66
755.028	10142.15
755.423	10324.19
755.818	10622.74
756.213	11083.91
756.608	10889.73
757.003	11253.82
757.398	11161.58
757.793	11326.63
758.188	11552.36
758.583	11974.7
758.977	12321.79
759.372	12314.51
759.767	13343.65
760.161	13931.04
760.556	14804.84
760.95	15008.73
761.345	15659.22
761.739	16729.63
762.133	16984.49
762.527	17690.81
762.922	18144.7
763.316	19142.29
763.71	18744.22
764.104	19516.08
764.498	20149.59
764.892	20860.76
765.286	21365.62
765.68	21712.72
766.073	21739.42
766.467	22494.28
766.861	23421.48
767.255	23695.76
767.648	24508.88
768.042	24695.77
768.435	25644.82
768.829	25729.77
769.222	25797.73
769.615	26627.84
770.008	26671.53
770.402	26994.35
770.795	27098.72
771.188	28394.86
771.581	27773.49
771.974	27237.07
772.367	27030.76
772.76	28159.42
773.153	27050.18
773.545	27205.52
773.938	28188.55
774.331	28159.42
774.724	28149.71
775.116	29586.63
775.509	30271.1
775.901	31856.08
776.294	31892.49
776.686	32819.69
777.078	33797.86
777.471	33873.1
777.863	35038.17
778.255	36863.44
778.647	37142.57
779.039	37069.75
779.431	37365.87
779.823	37746.95
780.215	37678.98
780.607	37783.35
780.999	38768.81
781.39	38865.9
781.782	38771.23
782.174	38744.53
782.565	40555.24
782.957	39948.44
783.348	39805.23
783.74	40606.21
784.131	39739.7
784.522	40208.15
784.914	39518.82
785.305	40351.36
785.696	39895.04
786.087	38814.92
786.478	37851.32
786.869	37897.43
787.26	37164.41
787.651	35887.69
788.042	36130.42
788.433	35819.73
788.823	34130.39
789.214	33637.66
789.605	33195.9
789.995	32487.16
790.386	31470.15
790.776	31482.29
791.167	31703.16
791.557	32448.32
791.948	32331.81
792.338	32637.64
792.728	34778.45
793.118	34232.33
793.508	34006.6
793.898	34370.68
794.288	34710.49
794.678	33385.23
795.068	33703.19
795.458	34647.38
795.848	34324.56
796.238	33894.94
796.627	33276
797.017	33644.94
797.406	34186.21
797.796	32569.68
798.185	32705.61
798.575	34016.31
798.964	34028.44
799.354	33074.54
799.743	33708.05
800.132	33635.23
800.521	33649.8
800.91	32426.48
801.299	33394.94
801.688	33953.2
802.077	32608.52
802.466	31739.57
802.855	32324.53
803.244	32157.05
803.633	31222.57
804.021	29763.81
804.41	30285.67
804.799	30399.74
805.187	28445.83
805.576	27523.49
805.964	27979.8
806.352	26343.86
806.741	25656.95
807.129	25487.05
807.517	26300.17
807.905	25863.27
808.293	25263.74
808.681	25038.01
809.069	25739.48
809.457	26351.14
809.845	25171.51
810.233	25814.72
810.621	26768.62
811.009	25972.49
811.396	25783.17
811.784	26229.78
812.171	26317.16
812.559	25751.61
812.946	24436.06
813.334	24596.26
813.721	24754.03
814.108	23824.4
814.496	22693.31
814.883	23559.83
815.27	24518.59
815.657	23052.54
816.044	22953.03
816.431	23222.45
816.818	23974.89
817.205	22576.81
817.592	22115.64
817.979	22152.04
818.365	21853.5
818.752	20574.35
819.139	19557.34
819.525	19841.33
819.912	19778.22
820.298	19287.92
820.685	18033.05
821.071	17855.86
821.457	17926.25
821.843	16887.4
822.23	15918.94
822.616	15550
823.002	15329.12
823.388	14688.34
823.774	14164.06
824.16	13576.67
824.546	13295.11
824.931	12659.18
825.317	12091.21
825.703	12253.83
826.089	12826.66
826.474	12258.69
826.86	11700.42
827.245	11666.44
827.631	11765.96
828.016	11452.85
828.401	10464.97
828.787	10685.85
829.172	10901.87
829.557	10506.23
829.942	10066.9
830.327	9763.5
830.712	9933.41
831.097	9554.76
831.482	9132.42
831.867	8712.51
832.252	8819.31
832.636	8722.22
833.021	8200.37
833.406	8132.41
833.79	8336.29
834.175	8326.59
834.559	7661.53
834.944	7382.4
835.328	7591.14
835.713	7367.83
836.097	6848.41
836.481	6588.69
836.865	6404.23
837.249	6338.69
837.633	6159.08
838.017	5831.4
838.401	5561.98
838.785	5542.56
839.169	5498.87
839.553	5013.43
839.937	4765.85
840.32	4828.96
840.704	4457.59
841.087	4151.76
841.471	3828.94
841.854	4064.38
842.238	4069.24
842.621	3748.84
843.004	3600.78
843.388	3586.22
843.771	3680.88
844.154	3622.63
844.537	3443.01
844.92	3294.95
845.303	3433.31
845.686	3333.79
846.069	3117.77
846.452	3037.67
846.834	3020.68
847.217	2935.73
847.6	2860.48
847.982	2882.33
848.365	2833.78
848.748	2693
849.13	2423.58
849.512	2530.38
849.895	2353.19
850.277	2409.02
850.659	2292.51
851.041	2217.27
851.423	2246.39
851.806	2314.36
852.188	2304.65
852.57	2139.6
852.951	1957.55
853.333	2040.08
853.715	1984.25
854.097	1989.11
854.479	1811.92
854.86	1790.08
855.242	1807.07
855.623	1685.71
856.005	1510.95
856.386	1421.14
856.768	1425.99
857.149	1474.54
857.53	1423.57
857.911	1433.27
858.292	1209.97
858.674	1384.73
859.055	1285.21
859.436	1180.84
859.817	1173.56
860.197	1139.58
860.578	1175.99
860.959	1057.06
861.34	1018.22
861.72	976.96
862.101	979.38
862.482	1018.22
862.862	838.61
863.243	933.27
863.623	921.13
864.003	862.88
864.384	843.46
864.764	739.09
865.144	751.23
865.524	634.72
865.904	697.83
866.284	697.83
866.664	731.81
867.044	591.03
867.424	709.96
867.804	675.98
868.183	583.75
868.563	632.29
868.943	656.56
869.322	552.19
869.702	608.02
870.081	569.18
870.461	610.45
870.84	508.5
871.22	496.37
871.599	506.08
871.978	457.53
872.357	375.01
872.736	445.4
873.115	433.26
873.494	455.1
873.873	408.99
874.252	389.57
874.631	418.7
875.01	338.6
875.388	365.3
875.767	372.58
876.146	324.03
876.524	348.31
876.903	331.32
877.281	294.91
877.66	297.33
878.038	304.62
878.416	326.46
878.794	297.33
879.173	241.51
879.551	375.01
879.929	251.22
880.307	343.45
880.685	326.46
881.063	290.05
881.441	234.23
881.818	224.52
882.196	253.64
882.574	209.95
882.951	292.48
883.329	241.51
883.707	260.93
884.084	205.1
884.461	214.81
884.839	241.51
885.216	192.96
885.593	183.26
885.971	304.62
886.348	166.26
886.725	214.81
887.102	173.55
887.479	212.38
887.856	200.25
888.233	190.54
888.609	200.25
888.986	229.37
889.363	190.54
889.74	156.56
890.116	166.26
890.493	258.5
890.869	188.11
891.246	200.25
891.622	185.68
891.998	222.09
892.375	253.64
892.751	141.99
893.127	226.95
893.503	137.14
893.879	188.11
894.255	166.26
894.631	163.84
895.007	108.01
895.383	246.36
895.759	180.83
896.134	192.96
896.51	151.7
896.886	192.96
897.261	205.1
897.637	61.89
898.012	183.26
898.388	163.84
898.763	100.73
899.138	185.68
899.514	175.97
899.889	226.95
900.264	134.71
900.639	163.84
901.014	234.23
901.389	192.96
901.764	192.96
902.139	69.18
902.513	144.42
902.888	115.29
903.263	139.57
903.638	137.14
904.012	129.86
904.387	115.29
904.761	132.28
905.136	86.17
905.51	112.87
905.884	149.27
906.259	112.87
906.633	120.15
907.007	100.73
907.381	125
907.755	154.13
908.129	158.98
908.503	195.39
908.877	156.56
909.251	183.26
909.624	117.72
909.998	171.12
910.372	183.26
910.745	146.85
911.119	156.56
911.492	141.99
911.866	132.28
912.239	129.86
912.612	71.6
912.986	190.54
913.359	178.4
913.732	112.87
914.105	192.96
914.478	91.02
914.851	163.84
915.224	141.99
915.597	117.72
915.97	185.68
916.343	154.13
916.715	171.12
917.088	137.14
917.461	129.86
917.833	129.86
918.206	173.55
918.578	127.43
918.951	173.55
919.323	117.72
919.695	98.3
920.067	137.14
920.44	117.72
920.812	141.99
921.184	105.58
921.556	137.14
921.928	108.01
922.3	100.73
922.672	202.67
923.043	146.85
923.415	149.27
923.787	173.55
924.158	66.75
924.53	214.81
924.901	246.36
925.273	54.61
925.644	78.88
926.016	200.25
926.387	127.43
926.758	115.29
927.129	151.7
927.5	178.4
927.872	180.83
928.243	166.26
928.613	151.7
928.984	166.26
929.355	120.15
929.726	166.26
930.097	117.72
930.467	115.29
930.838	197.82
931.209	154.13
931.579	178.4
931.95	175.97
932.32	144.42
932.69	110.44
933.061	81.31
933.431	69.18
933.801	120.15
934.171	120.15
934.541	76.46
934.911	93.45
935.281	168.69
935.651	108.01
936.021	171.12
936.391	98.3
936.761	178.4
937.13	129.86
937.5	134.71
937.87	195.39
938.239	105.58
938.609	112.87
938.978	132.28
939.347	132.28
939.717	168.69
940.086	117.72
940.455	115.29
940.824	197.82
941.193	173.55
941.562	122.57
941.931	69.18
942.3	195.39
942.669	105.58
943.038	78.88
943.407	105.58
943.775	134.71
944.144	120.15
944.513	168.69
944.881	120.15
945.25	112.87
945.618	120.15
945.986	200.25
946.355	180.83
946.723	144.42
947.091	115.29
947.459	103.16
947.827	166.26
948.195	139.57
948.563	125
948.931	132.28
949.299	137.14
949.667	188.11
950.035	122.57
950.402	222.09
950.77	192.96
951.138	120.15
951.505	190.54
951.873	178.4
952.24	214.81
952.607	125
952.975	93.45
953.342	139.57
953.709	175.97
954.076	158.98
954.443	120.15
954.81	141.99
955.177	141.99
955.544	20.63
955.911	146.85
956.278	144.42
956.645	163.84
957.012	127.43
957.378	158.98
957.745	137.14
958.111	200.25
958.478	149.27
958.844	146.85
959.211	197.82
959.577	105.58
959.943	224.52
960.309	115.29
960.675	122.57
961.042	125
961.408	117.72
961.774	195.39
962.139	146.85
962.505	149.27
962.871	141.99
963.237	127.43
963.603	146.85
963.968	149.27
964.334	209.95
964.699	156.56
965.065	188.11
965.43	115.29
965.796	76.46
966.161	134.71
966.526	180.83
966.891	202.67
967.256	144.42
967.622	188.11
967.987	158.98
968.352	146.85
968.716	183.26
969.081	100.73
969.446	180.83
969.811	202.67
970.176	171.12
970.54	190.54
970.905	175.97
971.269	173.55
971.634	151.7
971.998	234.23
972.363	219.66
972.727	171.12
973.091	156.56
973.455	110.44
973.819	222.09
974.183	137.14
974.547	161.41
974.911	183.26
975.275	112.87
975.639	154.13
976.003	156.56
976.367	117.72
976.73	129.86
977.094	98.3
977.458	222.09
977.821	100.73
978.185	219.66
978.548	154.13
978.911	185.68
979.275	156.56
979.638	76.46
980.001	139.57
980.364	100.73
980.727	178.4
981.09	91.02
981.453	95.88
981.816	129.86
982.179	197.82
982.542	139.57
982.905	134.71
983.267	163.84
983.63	158.98
983.992	197.82
984.355	141.99
984.717	120.15
985.08	127.43
985.442	134.71
985.804	35.19
986.167	122.57
986.529	149.27
986.891	161.41
987.253	149.27
987.615	188.11
987.977	127.43
988.339	83.74
988.701	108.01
989.062	149.27
989.424	117.72
989.786	154.13
990.147	95.88
990.509	197.82
990.87	146.85
991.232	180.83
991.593	171.12
991.955	98.3
992.316	134.71
992.677	158.98
993.038	91.02
993.399	129.86
993.76	175.97
994.121	163.84
994.482	149.27
994.843	209.95
995.204	207.53
995.565	202.67
995.926	144.42
996.286	139.57
996.647	115.29
997.007	183.26
997.368	200.25
997.728	158.98
998.089	81.31
998.449	139.57
998.809	183.26
999.169	108.01
999.53	95.88
999.89	127.43
1000.25	178.4
1000.61	173.55
1000.97	171.12
1001.329	139.57
1001.689	134.71
1002.049	76.46
1002.409	141.99
1002.768	120.15
1003.128	137.14
1003.487	185.68
1003.847	149.27
1004.206	127.43
1004.566	158.98
1004.925	78.88
1005.284	95.88
1005.643	122.57
1006.003	108.01
1006.362	214.81
1006.721	127.43
1007.08	122.57
1007.438	161.41
1007.797	122.57
1008.156	173.55
1008.515	205.1
1008.874	163.84
1009.232	188.11
1009.591	91.02
1009.949	120.15
1010.308	112.87
1010.666	163.84
1011.024	137.14
1011.383	64.32
1011.741	132.28
1012.099	180.83
1012.457	219.66
1012.815	83.74
1013.173	86.17
1013.531	120.15
1013.889	141.99
1014.247	127.43
1014.605	200.25
1014.962	139.57
1015.32	103.16
1015.678	98.3
1016.035	127.43
1016.393	117.72
1016.75	171.12
1017.107	202.67
1017.465	139.57
1017.822	151.7
1018.179	183.26
1018.536	171.12
1018.894	161.41
1019.251	81.31
1019.608	178.4
1019.964	117.72
1020.321	166.26
1020.678	180.83
1021.035	200.25
1021.392	127.43
1021.748	129.86
1022.105	120.15
1022.461	93.45
1022.818	132.28
1023.174	180.83
1023.531	134.71
1023.887	139.57
1024.243	205.1
1024.599	151.7
1024.955	149.27
1025.311	175.97
1025.667	110.44
1026.023	91.02
1026.379	125
1026.735	154.13
1027.091	98.3
1027.447	207.53
