189.514	124.09
189.973	124.09
190.431	124.09
190.889	-14.26
191.348	-36.1
191.806	-99.21
192.264	27
192.722	31.86
193.18	-55.52
193.638	-33.68
194.096	-57.95
194.554	-19.11
195.012	27
195.47	22.15
195.928	5.16
196.385	70.69
196.843	-79.79
197.301	-19.11
197.758	51.28
198.216	-4.55
198.674	24.58
199.131	10.01
199.589	5.16
200.046	-2.12
200.503	75.55
200.961	58.56
201.418	80.4
201.875	70.69
202.332	102.25
202.79	56.13
203.247	133.8
203.704	155.65
204.161	70.69
204.618	126.52
205.075	121.66
205.532	85.26
205.989	145.94
206.445	145.94
206.902	145.94
207.359	172.64
207.816	136.23
208.272	138.66
208.729	153.22
209.185	199.34
209.642	170.21
210.098	172.64
210.555	204.19
211.011	126.52
211.467	131.37
211.924	162.93
212.38	80.4
212.836	133.8
213.292	131.37
213.748	138.66
214.204	121.66
214.66	136.23
215.116	143.51
215.572	170.21
216.028	114.38
216.484	121.66
216.94	160.5
217.396	128.95
217.851	155.65
218.307	116.81
218.763	209.04
219.218	199.34
219.674	175.06
220.129	121.66
220.585	87.68
221.04	153.22
221.496	196.91
221.951	138.66
222.406	131.37
222.861	68.27
223.317	124.09
223.772	109.53
224.227	133.8
224.682	128.95
225.137	179.92
225.592	114.38
226.047	116.81
226.502	182.35
226.957	90.11
227.411	75.55
227.866	99.82
228.321	53.7
228.776	124.09
229.23	119.24
229.685	133.8
230.139	124.09
230.594	104.67
231.048	155.65
231.503	167.78
231.957	90.11
232.411	175.06
232.865	128.95
233.32	102.25
233.774	116.81
234.228	155.65
234.682	155.65
235.136	126.52
235.59	128.95
236.044	138.66
236.498	211.47
236.952	136.23
237.406	138.66
237.86	87.68
238.313	114.38
238.767	179.92
239.221	131.37
239.674	211.47
240.128	107.1
240.581	148.36
241.035	116.81
241.488	165.35
241.942	223.61
242.395	162.93
242.848	155.65
243.301	119.24
243.755	182.35
244.208	221.18
244.661	116.81
245.114	153.22
245.567	119.24
246.02	177.49
246.473	138.66
246.926	165.35
247.379	158.07
247.832	160.5
248.284	143.51
248.737	175.06
249.19	192.05
249.642	128.95
250.095	116.81
250.547	114.38
251	162.93
251.452	126.52
251.905	124.09
252.357	77.97
252.81	204.19
253.262	80.4
253.714	138.66
254.166	126.52
254.618	155.65
255.07	114.38
255.523	126.52
255.975	201.76
256.427	133.8
256.878	126.52
257.33	148.36
257.782	94.97
258.234	138.66
258.686	221.18
259.137	111.96
259.589	196.91
260.041	34.28
260.492	179.92
260.944	145.94
261.395	119.24
261.847	199.34
262.298	165.35
262.749	107.1
263.201	124.09
263.652	165.35
264.103	119.24
264.554	94.97
265.005	184.77
265.457	94.97
265.908	143.51
266.359	175.06
266.809	121.66
267.26	177.49
267.711	109.53
268.162	136.23
268.613	165.35
269.064	138.66
269.514	124.09
269.965	153.22
270.415	179.92
270.866	114.38
271.316	124.09
271.767	128.95
272.217	155.65
272.668	153.22
273.118	175.06
273.568	240.6
274.019	160.5
274.469	99.82
274.919	116.81
275.369	218.75
275.819	160.5
276.269	141.08
276.719	90.11
277.169	133.8
277.619	97.39
278.069	131.37
278.518	158.07
278.968	70.69
279.418	209.04
279.867	133.8
280.317	136.23
280.767	136.23
281.216	187.2
281.666	172.64
282.115	230.89
282.564	145.94
283.014	170.21
283.463	136.23
283.912	162.93
284.361	233.32
284.811	136.23
285.26	155.65
285.709	124.09
286.158	131.37
286.607	128.95
287.056	138.66
287.505	182.35
287.953	121.66
288.402	148.36
288.851	165.35
289.3	97.39
289.748	109.53
290.197	107.1
290.646	158.07
291.094	133.8
291.543	177.49
291.991	150.79
292.439	189.63
292.888	153.22
293.336	165.35
293.784	150.79
294.233	148.36
294.681	218.75
295.129	136.23
295.577	143.51
296.025	155.65
296.473	192.05
296.921	216.33
297.369	153.22
297.817	43.99
298.264	148.36
298.712	109.53
299.16	133.8
299.608	119.24
300.055	128.95
300.503	150.79
300.95	172.64
301.398	143.51
301.845	90.11
302.293	121.66
302.74	128.95
303.187	141.08
303.635	87.68
304.082	145.94
304.529	182.35
304.976	153.22
305.423	104.67
305.87	92.54
306.317	92.54
306.764	194.48
307.211	153.22
307.658	167.78
308.105	184.77
308.552	162.93
308.998	141.08
309.445	167.78
309.892	165.35
310.338	155.65
310.785	199.34
311.231	121.66
311.678	172.64
312.124	150.79
312.571	223.61
313.017	201.76
313.463	158.07
313.909	160.5
314.356	184.77
314.802	92.54
315.248	141.08
315.694	143.51
316.14	85.26
316.586	213.9
317.032	143.51
317.478	192.05
317.923	184.77
318.369	145.94
318.815	131.37
319.261	136.23
319.706	116.81
320.152	175.06
320.597	41.57
321.043	167.78
321.488	252.73
321.934	128.95
322.379	182.35
322.824	160.5
323.27	131.37
323.715	119.24
324.16	153.22
324.605	167.78
325.05	167.78
325.495	141.08
325.94	92.54
326.385	177.49
326.83	124.09
327.275	136.23
327.72	172.64
328.165	204.19
328.61	128.95
329.054	184.77
329.499	153.22
329.943	126.52
330.388	143.51
330.832	211.47
331.277	153.22
331.721	141.08
332.166	143.51
332.61	189.63
333.054	126.52
333.499	221.18
333.943	160.5
334.387	80.4
334.831	206.62
335.275	131.37
335.719	216.33
336.163	162.93
336.607	128.95
337.051	184.77
337.495	128.95
337.938	189.63
338.382	111.96
338.826	228.46
339.269	143.51
339.713	58.56
340.157	167.78
340.6	201.76
341.044	124.09
341.487	226.04
341.93	111.96
342.374	116.81
342.817	170.21
343.26	247.88
343.703	143.51
344.146	133.8
344.59	126.52
345.033	128.95
345.476	111.96
345.919	141.08
346.361	128.95
346.804	133.8
347.247	233.32
347.69	175.06
348.133	92.54
348.575	75.55
349.018	133.8
349.461	184.77
349.903	182.35
350.346	124.09
350.788	136.23
351.23	94.97
351.673	133.8
352.115	192.05
352.557	170.21
353	133.8
353.442	148.36
353.884	165.35
354.326	114.38
354.768	170.21
355.21	148.36
355.652	97.39
356.094	199.34
356.536	160.5
356.978	145.94
357.419	131.37
357.861	175.06
358.303	199.34
358.744	104.67
359.186	136.23
359.627	145.94
360.069	145.94
360.51	138.66
360.952	63.41
361.393	145.94
361.834	109.53
362.276	131.37
362.717	126.52
363.158	136.23
363.599	60.98
364.04	77.97
364.481	133.8
364.922	104.67
365.363	165.35
365.804	160.5
366.245	126.52
366.686	119.24
367.126	206.62
367.567	167.78
368.008	204.19
368.448	167.78
368.889	206.62
369.33	119.24
369.77	143.51
370.21	158.07
370.651	143.51
371.091	114.38
371.531	128.95
371.972	167.78
372.412	138.66
372.852	73.12
373.292	124.09
373.732	145.94
374.172	116.81
374.612	109.53
375.052	150.79
375.492	155.65
375.932	155.65
376.372	175.06
376.811	187.2
377.251	102.25
377.691	167.78
378.13	75.55
378.57	213.9
379.009	184.77
379.449	170.21
379.888	153.22
380.328	109.53
380.767	104.67
381.206	131.37
381.645	167.78
382.085	145.94
382.524	167.78
382.963	182.35
383.402	182.35
383.841	165.35
384.28	124.09
384.719	148.36
385.158	121.66
385.596	136.23
386.035	138.66
386.474	131.37
386.913	175.06
387.351	138.66
387.79	128.95
388.228	189.63
388.667	155.65
389.105	148.36
389.544	133.8
389.982	153.22
390.42	201.76
390.859	143.51
391.297	145.94
391.735	119.24
392.173	148.36
392.611	206.62
393.049	175.06
393.487	136.23
393.925	138.66
394.363	182.35
394.801	182.35
395.239	148.36
395.676	121.66
396.114	196.91
396.552	162.93
396.989	102.25
397.427	111.96
397.864	111.96
398.302	114.38
398.739	99.82
399.177	131.37
399.614	131.37
400.051	189.63
400.488	143.51
400.926	194.48
401.363	189.63
401.8	209.04
402.237	141.08
402.674	145.94
403.111	145.94
403.548	58.56
403.985	109.53
404.421	148.36
404.858	148.36
405.295	240.6
405.732	126.52
406.168	162.93
406.605	85.26
407.041	250.31
407.478	196.91
407.914	206.62
408.351	172.64
408.787	155.65
409.223	138.66
409.66	177.49
410.096	172.64
410.532	148.36
410.968	133.8
411.404	172.64
411.84	128.95
412.276	209.04
412.712	187.2
413.148	172.64
413.584	119.24
414.02	107.1
414.455	160.5
414.891	133.8
415.327	179.92
415.762	158.07
416.198	124.09
416.633	182.35
417.069	189.63
417.504	179.92
417.94	153.22
418.375	119.24
418.81	124.09
419.245	213.9
419.681	99.82
420.116	160.5
420.551	153.22
420.986	85.26
421.421	102.25
421.856	119.24
422.291	73.12
422.726	167.78
423.16	165.35
423.595	102.25
424.03	131.37
424.464	155.65
424.899	131.37
425.334	153.22
425.768	160.5
426.203	131.37
426.637	138.66
427.071	119.24
427.506	162.93
427.94	111.96
428.374	138.66
428.809	252.73
429.243	155.65
429.677	155.65
430.111	172.64
430.545	160.5
430.979	179.92
431.413	131.37
431.847	170.21
432.28	116.81
432.714	121.66
433.148	128.95
433.582	143.51
434.015	116.81
434.449	138.66
434.882	162.93
435.316	143.51
435.749	136.23
436.183	119.24
436.616	131.37
437.049	165.35
437.483	121.66
437.916	97.39
438.349	221.18
438.782	177.49
439.215	167.78
439.648	111.96
440.081	160.5
440.514	138.66
440.947	189.63
441.38	70.69
441.813	172.64
442.245	196.91
442.678	131.37
443.111	170.21
443.543	260.02
443.976	182.35
444.408	170.21
444.841	238.17
445.273	167.78
445.705	218.75
446.138	155.65
446.57	114.38
447.002	162.93
447.434	150.79
447.867	160.5
448.299	182.35
448.731	211.47
449.163	196.91
449.595	155.65
450.026	148.36
450.458	184.77
450.89	187.2
451.322	155.65
451.754	189.63
452.185	209.04
452.617	160.5
453.048	213.9
453.48	201.76
453.911	269.73
454.343	216.33
454.774	160.5
455.205	133.8
455.637	204.19
456.068	158.07
456.499	131.37
456.93	187.2
457.361	131.37
457.792	158.07
458.223	153.22
458.654	175.06
459.085	177.49
459.516	213.9
459.947	177.49
460.378	235.74
460.808	196.91
461.239	199.34
461.669	213.9
462.1	255.16
462.531	245.45
462.961	199.34
463.391	221.18
463.822	187.2
464.252	226.04
464.682	143.51
465.113	119.24
465.543	221.18
465.973	230.89
466.403	226.04
466.833	245.45
467.263	141.08
467.693	119.24
468.123	94.97
468.553	167.78
468.983	233.32
469.412	199.34
469.842	170.21
470.272	182.35
470.701	126.52
471.131	145.94
471.56	194.48
471.99	162.93
472.419	170.21
472.849	189.63
473.278	153.22
473.707	269.73
474.136	213.9
474.566	175.06
474.995	150.79
475.424	213.9
475.853	158.07
476.282	184.77
476.711	141.08
477.14	189.63
477.569	153.22
477.997	172.64
478.426	196.91
478.855	165.35
479.283	138.66
479.712	182.35
480.141	172.64
480.569	136.23
480.998	158.07
481.426	160.5
481.854	111.96
482.283	184.77
482.711	141.08
483.139	160.5
483.567	160.5
483.995	133.8
484.424	182.35
484.852	170.21
485.28	209.04
485.708	153.22
486.135	209.04
486.563	192.05
486.991	184.77
487.419	221.18
487.847	160.5
488.274	182.35
488.702	201.76
489.129	226.04
489.557	167.78
489.984	143.51
490.412	189.63
490.839	150.79
491.266	131.37
491.694	148.36
492.121	119.24
492.548	199.34
492.975	165.35
493.402	223.61
493.829	211.47
494.256	155.65
494.683	153.22
495.11	138.66
495.537	179.92
495.964	179.92
496.39	189.63
496.817	194.48
497.244	170.21
497.67	189.63
498.097	175.06
498.523	102.25
498.95	131.37
499.376	179.92
499.803	153.22
500.229	155.65
500.655	148.36
501.081	189.63
501.508	175.06
501.934	201.76
502.36	119.24
502.786	162.93
503.212	247.88
503.638	97.39
504.064	184.77
504.489	213.9
504.915	170.21
505.341	196.91
505.767	162.93
506.192	158.07
506.618	172.64
507.043	172.64
507.469	148.36
507.894	126.52
508.32	160.5
508.745	221.18
509.17	155.65
509.596	194.48
510.021	136.23
510.446	114.38
510.871	216.33
511.296	213.9
511.721	211.47
512.146	128.95
512.571	189.63
512.996	143.51
513.421	199.34
513.845	145.94
514.27	167.78
514.695	167.78
515.119	128.95
515.544	114.38
515.969	58.56
516.393	128.95
516.817	145.94
517.242	233.32
517.666	182.35
518.09	119.24
518.515	162.93
518.939	160.5
519.363	388.66
519.787	143.51
520.211	165.35
520.635	184.77
521.059	143.51
521.483	213.9
521.907	204.19
522.331	213.9
522.754	165.35
523.178	114.38
523.602	172.64
524.025	87.68
524.449	133.8
524.872	143.51
525.296	211.47
525.719	179.92
526.143	143.51
526.566	167.78
526.989	119.24
527.412	153.22
527.836	160.5
528.259	199.34
528.682	126.52
529.105	150.79
529.528	160.5
529.951	126.52
530.374	170.21
530.796	141.08
531.219	116.81
531.642	75.55
532.065	87.68
532.487	119.24
532.91	131.37
533.332	133.8
533.755	216.33
534.177	179.92
534.6	209.04
535.022	124.09
535.444	192.05
535.867	148.36
536.289	143.51
536.711	172.64
537.133	92.54
537.555	167.78
537.977	206.62
538.399	131.37
538.821	162.93
539.243	204.19
539.665	155.65
540.086	199.34
540.508	150.79
540.93	136.23
541.351	82.83
541.773	184.77
542.195	155.65
542.616	187.2
543.037	160.5
543.459	194.48
543.88	204.19
544.301	213.9
544.723	175.06
545.144	216.33
545.565	170.21
545.986	189.63
546.407	158.07
546.828	148.36
547.249	187.2
547.67	172.64
548.091	109.53
548.512	97.39
548.932	211.47
549.353	199.34
549.774	213.9
550.194	218.75
550.615	160.5
551.035	80.4
551.456	107.1
551.876	99.82
552.296	221.18
552.717	162.93
553.137	104.67
553.557	92.54
553.977	158.07
554.397	175.06
554.817	172.64
555.237	187.2
555.657	192.05
556.077	187.2
556.497	165.35
556.917	148.36
557.337	206.62
557.756	170.21
558.176	131.37
558.596	165.35
559.015	116.81
559.435	97.39
559.854	143.51
560.274	201.76
560.693	167.78
561.112	116.81
561.532	107.1
561.951	145.94
562.37	158.07
562.789	206.62
563.208	131.37
563.627	182.35
564.046	82.83
564.465	196.91
564.884	226.04
565.303	175.06
565.722	143.51
566.14	97.39
566.559	128.95
566.978	257.59
567.396	162.93
567.815	160.5
568.233	213.9
568.652	184.77
569.07	204.19
569.489	189.63
569.907	182.35
570.325	131.37
570.743	226.04
571.161	209.04
571.58	187.2
571.998	216.33
572.416	199.34
572.833	175.06
573.251	131.37
573.669	167.78
574.087	218.75
574.505	138.66
574.922	167.78
575.34	119.24
575.758	73.12
576.175	194.48
576.593	189.63
577.01	116.81
577.428	80.4
577.845	1500.33
578.262	294
578.68	136.23
579.097	119.24
579.514	155.65
579.931	119.24
580.348	145.94
580.765	143.51
581.182	143.51
581.599	182.35
582.016	189.63
582.433	143.51
582.849	143.51
583.266	189.63
583.683	184.77
584.099	136.23
584.516	160.5
584.933	99.82
585.349	133.8
585.765	138.66
586.182	124.09
586.598	107.1
587.014	116.81
587.431	226.04
587.847	177.49
588.263	92.54
588.679	245.45
589.095	145.94
589.511	189.63
589.927	165.35
590.343	148.36
590.759	167.78
591.174	162.93
591.59	119.24
592.006	138.66
592.421	131.37
592.837	119.24
593.252	77.97
593.668	201.76
594.083	158.07
594.499	162.93
594.914	138.66
595.329	94.97
595.745	155.65
596.16	167.78
596.575	124.09
596.99	209.04
597.405	167.78
597.82	247.88
598.235	160.5
598.65	138.66
599.065	196.91
599.479	170.21
599.894	92.54
600.309	192.05
600.724	145.94
601.138	153.22
601.553	145.94
601.967	179.92
602.382	162.93
602.796	114.38
603.21	136.23
603.625	179.92
604.039	162.93
604.453	172.64
604.867	128.95
605.281	199.34
605.695	143.51
606.109	201.76
606.523	167.78
606.937	116.81
607.351	216.33
607.765	131.37
608.178	133.8
608.592	121.66
609.006	138.66
609.419	192.05
609.833	199.34
610.246	111.96
610.66	192.05
611.073	201.76
611.487	172.64
611.9	102.25
612.313	158.07
612.726	172.64
613.139	189.63
613.553	206.62
613.966	230.89
614.379	184.77
614.792	133.8
615.204	141.08
615.617	218.75
616.03	213.9
616.443	165.35
616.856	211.47
617.268	158.07
617.681	155.65
618.093	204.19
618.506	204.19
618.918	136.23
619.331	252.73
619.743	128.95
620.155	196.91
620.568	121.66
620.98	138.66
621.392	170.21
621.804	230.89
622.216	155.65
622.628	192.05
623.04	121.66
623.452	155.65
623.864	119.24
624.276	162.93
624.687	179.92
625.099	109.53
625.511	58.56
625.922	170.21
626.334	109.53
626.745	187.2
627.157	126.52
627.568	167.78
627.979	128.95
628.391	133.8
628.802	158.07
629.213	109.53
629.624	182.35
630.035	128.95
630.446	141.08
630.857	90.11
631.268	165.35
631.679	235.74
632.09	209.04
632.501	165.35
632.912	136.23
633.322	187.2
633.733	170.21
634.144	141.08
634.554	126.52
634.965	172.64
635.375	131.37
635.785	131.37
636.196	141.08
636.606	70.69
637.016	199.34
637.427	182.35
637.837	136.23
638.247	187.2
638.657	128.95
639.067	63.41
639.477	167.78
639.887	175.06
640.297	187.2
640.706	162.93
641.116	167.78
641.526	77.97
641.935	155.65
642.345	194.48
642.755	114.38
643.164	175.06
643.573	165.35
643.983	158.07
644.392	172.64
644.801	141.08
645.211	148.36
645.62	165.35
646.029	141.08
646.438	177.49
646.847	121.66
647.256	175.06
647.665	90.11
648.074	138.66
648.483	138.66
648.892	126.52
649.3	184.77
649.709	77.97
650.118	211.47
650.526	221.18
650.935	189.63
651.343	218.75
651.752	211.47
652.16	136.23
652.568	211.47
652.977	196.91
653.385	175.06
653.793	141.08
654.201	138.66
654.609	211.47
655.017	56.13
655.425	194.48
655.833	201.76
656.241	133.8
656.649	192.05
657.057	184.77
657.464	204.19
657.872	165.35
658.28	148.36
658.687	170.21
659.095	158.07
659.502	99.82
659.91	189.63
660.317	145.94
660.724	233.32
661.132	165.35
661.539	82.83
661.946	133.8
662.353	172.64
662.76	145.94
663.167	155.65
663.574	82.83
663.981	177.49
664.388	131.37
664.795	196.91
665.202	167.78
665.608	141.08
666.015	131.37
666.422	165.35
666.828	184.77
667.235	148.36
667.641	145.94
668.047	177.49
668.454	155.65
668.86	158.07
669.266	145.94
669.673	155.65
670.079	141.08
670.485	150.79
670.891	155.65
671.297	175.06
671.703	204.19
672.109	150.79
672.515	138.66
672.92	189.63
673.326	167.78
673.732	187.2
674.138	162.93
674.543	189.63
674.949	172.64
675.354	184.77
675.76	211.47
676.165	194.48
676.57	184.77
676.976	170.21
677.381	148.36
677.786	192.05
678.191	172.64
678.596	148.36
679.001	182.35
679.406	141.08
679.811	167.78
680.216	111.96
680.621	221.18
681.026	131.37
681.43	126.52
681.835	114.38
682.24	177.49
682.644	109.53
683.049	155.65
683.453	97.39
683.858	153.22
684.262	145.94
684.667	162.93
685.071	201.76
685.475	99.82
685.879	141.08
686.283	167.78
686.687	211.47
687.091	177.49
687.495	138.66
687.899	141.08
688.303	111.96
688.707	116.81
689.111	53.7
689.514	148.36
689.918	102.25
690.322	162.93
690.725	162.93
691.129	199.34
691.532	182.35
691.936	209.04
692.339	194.48
692.742	136.23
693.146	138.66
693.549	114.38
693.952	124.09
694.355	170.21
694.758	187.2
695.161	175.06
695.564	170.21
695.967	218.75
696.37	150.79
696.773	194.48
697.175	109.53
697.578	213.9
697.981	194.48
698.383	131.37
698.786	179.92
699.188	194.48
699.591	160.5
699.993	136.23
700.395	206.62
700.798	119.24
701.2	133.8
701.602	206.62
702.004	260.02
702.406	223.61
702.808	92.54
703.21	165.35
703.612	223.61
704.014	160.5
704.416	124.09
704.818	245.45
705.219	192.05
705.621	201.76
706.023	213.9
706.424	199.34
706.826	192.05
707.227	175.06
707.629	138.66
708.03	175.06
708.431	204.19
708.832	257.59
709.234	187.2
709.635	172.64
710.036	296.42
710.437	243.03
710.838	272.15
711.239	286.72
711.64	213.9
712.041	235.74
712.441	260.02
712.842	238.17
713.243	187.2
713.643	260.02
714.044	240.6
714.445	262.44
714.845	281.86
715.246	211.47
715.646	274.58
716.046	306.13
716.447	327.98
716.847	313.42
717.247	400.8
717.647	235.74
718.047	323.12
718.447	335.26
718.847	310.99
719.247	318.27
719.647	301.28
720.047	427.49
720.446	359.53
720.846	383.8
721.246	366.81
721.645	417.79
722.045	451.77
722.444	374.1
722.844	393.51
723.243	444.49
723.643	323.12
724.042	400.8
724.441	327.98
724.84	371.67
725.24	459.05
725.639	425.07
726.038	442.06
726.437	468.76
726.836	493.03
727.234	570.7
727.633	461.48
728.032	485.75
728.431	488.18
728.83	560.99
729.228	534.29
729.627	621.67
730.025	580.41
730.424	662.94
730.822	701.77
731.22	755.17
731.619	798.86
732.017	869.25
732.415	920.22
732.813	837.7
733.212	1046.44
733.61	1010.03
734.008	1102.26
734.406	1150.81
734.803	1252.75
735.201	1311
735.599	1485.76
735.997	1519.74
736.395	1546.44
736.792	1662.95
737.19	1774.6
737.587	1844.99
737.985	1988.2
738.382	2017.33
738.78	2243.06
739.177	2311.02
739.574	2408.11
739.971	2609.57
740.369	2670.25
740.766	2820.74
741.163	2874.13
741.56	3014.91
741.957	3056.18
742.354	3252.78
742.751	3393.56
743.147	3672.69
743.544	3638.71
743.941	3781.92
744.338	4150.85
744.734	4233.38
745.131	4194.54
745.527	4563.48
745.924	4789.21
746.32	5029.51
746.716	5277.08
747.113	5476.12
747.509	5939.72
747.905	6136.32
748.301	6284.38
748.697	6410.6
749.093	6937.3
749.489	7061.09
749.885	7223.72
750.281	7813.53
750.677	7893.63
751.073	8410.63
751.468	8663.06
751.864	9109.67
752.26	9364.53
752.655	9619.39
753.051	9881.53
753.446	10541.73
753.842	10791.73
754.237	11233.49
754.632	11515.05
755.028	11595.14
755.423	11697.09
755.818	11854.86
756.213	12075.73
756.608	12153.41
757.003	12316.03
757.398	12600.01
757.793	12908.27
758.188	13092.74
758.583	13570.9
758.977	13449.54
759.372	13932.56
759.767	14983.55
760.161	16129.2
760.556	16119.49
760.95	17209.31
761.345	17354.94
761.739	18505.45
762.133	18820.98
762.527	19534.59
762.922	20340.43
763.316	20767.62
763.71	21088.01
764.104	21692.39
764.498	22267.64
764.892	22612.31
765.286	22794.35
765.68	23556.5
766.073	24357.48
766.467	24410.88
766.861	25629.34
767.255	26301.68
767.648	26522.56
768.042	26425.47
768.435	27073.54
768.829	28109.96
769.222	28342.98
769.615	29190.08
770.008	28762.89
770.402	28682.79
770.795	29228.91
771.188	29605.13
771.581	29804.17
771.974	29241.05
772.367	29032.31
772.76	29653.68
773.153	29595.42
773.545	29590.57
773.938	29826.01
774.331	29738.63
774.724	30515.34
775.116	32100.32
775.509	32750.81
775.901	34076.08
776.294	34602.78
776.686	34668.32
777.078	35471.73
777.471	36080.96
777.863	37496.03
778.255	39534.9
778.647	39991.22
779.039	40098.01
779.431	39736.36
779.823	39804.32
780.215	40105.3
780.607	40355.3
780.999	41937.85
781.39	41357.74
781.782	41476.68
782.174	42292.22
782.565	42265.52
782.957	42852.91
783.348	42901.46
783.74	43345.64
784.131	42724.27
784.522	43384.47
784.914	42425.72
785.305	41923.29
785.696	42770.39
786.087	41886.88
786.478	40646.57
786.869	39998.5
787.26	39178.1
787.651	38139.25
788.042	38631.97
788.433	37377.1
788.823	36226.6
789.214	36080.96
789.605	34840.65
789.995	33787.24
790.386	33277.52
790.776	33945.01
791.167	33318.78
791.557	33974.13
791.948	34311.52
792.338	34588.22
792.728	35651.34
793.118	36537.28
793.508	36420.77
793.898	36185.33
794.288	36466.89
794.678	36364.95
795.068	36374.66
795.458	35595.52
795.848	35772.7
796.238	35937.76
796.627	35440.18
797.017	35442.6
797.406	35787.27
797.796	35301.82
798.185	36059.12
798.575	36690.19
798.964	36287.28
799.354	36328.54
799.743	36289.7
800.132	36263
800.521	35993.58
800.91	36161.06
801.299	35544.55
801.688	35644.06
802.077	34648.9
802.466	35158.62
802.855	34886.77
803.244	32481.39
803.633	32750.81
804.021	31903.71
804.41	31610.02
804.799	30915.83
805.187	30304.17
805.576	30012.91
805.964	28556.57
806.352	27845.4
806.741	27944.91
807.129	27323.54
807.517	27481.31
807.905	27304.13
808.293	27452.19
808.681	27461.9
809.069	27461.9
809.457	28622.11
809.845	28180.35
810.233	27978.89
810.621	28299.29
811.009	27539.57
811.396	27459.47
811.784	27942.49
812.171	28369.68
812.559	27736.17
812.946	26641.49
813.334	26634.21
813.721	26493.43
814.108	25333.22
814.496	25126.91
814.883	25061.37
815.27	25430.31
815.657	24549.23
816.044	25454.58
816.431	25124.48
816.818	24512.82
817.205	23791.94
817.592	24415.73
817.979	23738.54
818.365	22949.69
818.752	22381.72
819.139	22100.16
819.525	21270.05
819.912	20539.46
820.298	20660.82
820.685	20369.55
821.071	19112.25
821.457	19100.12
821.843	18808.85
822.23	17956.89
822.616	16726.29
823.002	15978.71
823.388	15949.58
823.774	15507.83
824.16	15024.81
824.546	14767.52
824.931	14303.92
825.317	13884.01
825.703	13762.65
826.089	13485.95
826.474	13381.58
826.86	13102.45
827.245	13131.58
827.631	13252.94
828.016	12650.99
828.401	12522.34
828.787	12427.68
829.172	12051.46
829.557	11403.39
829.942	11209.22
830.327	11104.85
830.712	10896.1
831.097	10209.2
831.482	10063.57
831.867	9978.61
832.252	9832.98
832.636	9517.44
833.021	9398.51
833.406	9417.93
833.79	9116.95
834.175	8728.59
834.559	8803.84
834.944	8439.76
835.328	8146.06
835.713	8063.54
836.097	7990.72
836.481	7731.01
836.865	7383.91
837.249	6949.44
837.633	7005.27
838.017	6740.7
838.401	6381.47
838.785	6131.47
839.169	5905.74
839.553	5713.98
839.937	5410.58
840.32	5325.63
840.704	5279.51
841.087	4942.13
841.471	4602.32
841.854	4701.83
842.238	4422.7
842.621	4102.31
843.004	4087.75
843.388	4012.5
843.771	4017.36
844.154	3910.56
844.537	3881.43
844.92	4002.79
845.303	3789.2
845.686	3718.81
846.069	3524.63
846.452	3602.3
846.834	3318.32
847.217	3427.54
847.6	3318.32
847.982	3335.31
848.365	3121.71
848.748	3039.19
849.13	2995.5
849.512	2886.27
849.895	2849.86
850.277	2828.02
850.659	2859.57
851.041	2704.23
851.423	2670.25
851.806	2558.6
852.188	2512.48
852.57	2534.32
852.951	2473.64
853.333	2233.35
853.715	2238.2
854.097	2272.18
854.479	2291.6
854.86	2041.6
855.242	2046.45
855.623	2039.17
856.005	1959.07
856.386	1844.99
856.768	1798.88
857.149	1767.32
857.53	1728.49
857.911	1522.17
858.292	1510.04
858.674	1541.59
859.055	1446.93
859.436	1422.66
859.817	1330.42
860.197	1262.46
860.578	1252.75
860.959	1240.61
861.34	1153.23
861.72	1179.93
862.101	1104.69
862.482	1116.83
862.862	1104.69
863.243	1109.54
863.623	1065.85
864.003	925.08
864.384	942.07
864.764	1010.03
865.144	929.93
865.524	883.81
865.904	920.22
866.284	823.13
866.664	861.97
867.044	764.88
867.424	713.91
867.804	789.15
868.183	718.76
868.563	779.44
868.943	665.36
869.322	723.62
869.702	643.52
870.081	624.1
870.461	675.07
870.84	633.81
871.22	643.52
871.599	563.42
871.978	573.13
872.357	580.41
872.736	534.29
873.115	556.14
873.494	473.61
873.873	490.6
874.252	485.75
874.631	325.55
875.01	364.39
875.388	369.24
875.767	444.49
876.146	357.11
876.524	388.66
876.903	327.98
877.281	366.81
877.66	342.54
878.038	354.68
878.416	313.42
878.794	330.41
879.173	310.99
879.551	376.52
879.929	335.26
880.307	332.83
880.685	272.15
881.063	250.31
881.441	269.73
881.818	301.28
882.196	262.44
882.574	257.59
882.951	245.45
883.329	170.21
883.707	272.15
884.084	281.86
884.461	284.29
884.839	187.2
885.216	213.9
885.593	199.34
885.971	262.44
886.348	257.59
886.725	226.04
887.102	277.01
887.479	260.02
887.856	238.17
888.233	177.49
888.609	145.94
888.986	179.92
889.363	245.45
889.74	179.92
890.116	245.45
890.493	196.91
890.869	187.2
891.246	238.17
891.622	143.51
891.998	172.64
892.375	209.04
892.751	196.91
893.127	116.81
893.503	170.21
893.879	201.76
894.255	145.94
894.631	172.64
895.007	167.78
895.383	172.64
895.759	136.23
896.134	184.77
896.51	160.5
896.886	182.35
897.261	145.94
897.637	160.5
898.012	107.1
898.388	121.66
898.763	145.94
899.138	102.25
899.514	155.65
899.889	158.07
900.264	170.21
900.639	196.91
901.014	196.91
901.389	128.95
901.764	187.2
902.139	153.22
902.513	170.21
902.888	136.23
903.263	141.08
903.638	143.51
904.012	194.48
904.387	136.23
904.761	155.65
905.136	175.06
905.51	165.35
905.884	165.35
906.259	194.48
906.633	155.65
907.007	128.95
907.381	136.23
907.755	143.51
908.129	148.36
908.503	150.79
908.877	138.66
909.251	104.67
909.624	133.8
909.998	160.5
910.372	160.5
910.745	90.11
911.119	158.07
911.492	121.66
911.866	121.66
912.239	179.92
912.612	165.35
912.986	167.78
913.359	90.11
913.732	143.51
914.105	126.52
914.478	121.66
914.851	111.96
915.224	175.06
915.597	143.51
915.97	158.07
916.343	179.92
916.715	116.81
917.088	136.23
917.461	143.51
917.833	165.35
918.206	131.37
918.578	162.93
918.951	141.08
919.323	155.65
919.695	175.06
920.067	175.06
920.44	97.39
920.812	221.18
921.184	143.51
921.556	192.05
921.928	160.5
922.3	136.23
922.672	82.83
923.043	121.66
923.415	160.5
923.787	128.95
924.158	124.09
924.53	143.51
924.901	187.2
925.273	85.26
925.644	116.81
926.016	58.56
926.387	109.53
926.758	99.82
927.129	143.51
927.5	119.24
927.872	133.8
928.243	170.21
928.613	170.21
928.984	187.2
929.355	177.49
929.726	107.1
930.097	155.65
930.467	182.35
930.838	179.92
931.209	153.22
931.579	175.06
931.95	155.65
932.32	92.54
932.69	107.1
933.061	77.97
933.431	138.66
933.801	133.8
934.171	99.82
934.541	136.23
934.911	119.24
935.281	107.1
935.651	150.79
936.021	201.76
936.391	116.81
936.761	143.51
937.13	104.67
937.5	145.94
937.87	150.79
938.239	92.54
938.609	104.67
938.978	90.11
939.347	199.34
939.717	196.91
940.086	196.91
940.455	111.96
940.824	97.39
941.193	175.06
941.562	184.77
941.931	94.97
942.3	148.36
942.669	114.38
943.038	233.32
943.407	109.53
943.775	160.5
944.144	148.36
944.513	114.38
944.881	90.11
945.25	128.95
945.618	85.26
945.986	133.8
946.355	199.34
946.723	141.08
947.091	131.37
947.459	131.37
947.827	158.07
948.195	126.52
948.563	73.12
948.931	141.08
949.299	175.06
949.667	131.37
950.035	165.35
950.402	126.52
950.77	116.81
951.138	126.52
951.505	124.09
951.873	172.64
952.24	133.8
952.607	143.51
952.975	141.08
953.342	133.8
953.709	141.08
954.076	65.84
954.443	29.43
954.81	204.19
955.177	143.51
955.544	177.49
955.911	121.66
956.278	124.09
956.645	153.22
957.012	162.93
957.378	172.64
957.745	167.78
958.111	213.9
958.478	194.48
958.844	155.65
959.211	172.64
959.577	131.37
959.943	194.48
960.309	150.79
960.675	150.79
961.042	68.27
961.408	97.39
961.774	143.51
962.139	192.05
962.505	124.09
962.871	167.78
963.237	46.42
963.603	85.26
963.968	150.79
964.334	150.79
964.699	155.65
965.065	192.05
965.43	94.97
965.796	131.37
966.161	102.25
966.526	97.39
966.891	73.12
967.256	87.68
967.622	155.65
967.987	131.37
968.352	124.09
968.716	94.97
969.081	150.79
969.446	121.66
969.811	87.68
970.176	148.36
970.54	114.38
970.905	109.53
971.269	58.56
971.634	87.68
971.998	179.92
972.363	104.67
972.727	162.93
973.091	126.52
973.455	138.66
973.819	111.96
974.183	172.64
974.547	211.47
974.911	141.08
975.275	126.52
975.639	138.66
976.003	155.65
976.367	153.22
976.73	141.08
977.094	170.21
977.458	128.95
977.821	136.23
978.185	92.54
978.548	199.34
978.911	206.62
979.275	153.22
979.638	75.55
980.001	126.52
980.364	128.95
980.727	155.65
981.09	141.08
981.453	97.39
981.816	150.79
982.179	153.22
982.542	128.95
982.905	148.36
983.267	155.65
983.63	153.22
983.992	141.08
984.355	128.95
984.717	104.67
985.08	143.51
985.442	167.78
985.804	75.55
986.167	160.5
986.529	133.8
986.891	102.25
987.253	192.05
987.615	94.97
987.977	133.8
988.339	90.11
988.701	153.22
989.062	124.09
989.424	90.11
989.786	138.66
990.147	158.07
990.509	187.2
990.87	138.66
991.232	126.52
991.593	175.06
991.955	192.05
992.316	221.18
992.677	138.66
993.038	111.96
993.399	189.63
993.76	179.92
994.121	128.95
994.482	107.1
994.843	109.53
995.204	131.37
995.565	128.95
995.926	158.07
996.286	179.92
996.647	136.23
997.007	121.66
997.368	143.51
997.728	109.53
998.089	99.82
998.449	145.94
998.809	107.1
999.169	116.81
999.53	165.35
999.89	160.5
1000.25	97.39
1000.61	160.5
1000.97	133.8
1001.329	126.52
1001.689	126.52
1002.049	158.07
1002.409	165.35
1002.768	70.69
1003.128	107.1
1003.487	99.82
1003.847	150.79
1004.206	68.27
1004.566	119.24
1004.925	160.5
1005.284	107.1
1005.643	85.26
1006.003	199.34
1006.362	167.78
1006.721	143.51
1007.08	107.1
1007.438	182.35
1007.797	97.39
1008.156	165.35
1008.515	160.5
1008.874	128.95
1009.232	196.91
1009.591	182.35
1009.949	189.63
1010.308	141.08
1010.666	136.23
1011.024	155.65
1011.383	109.53
1011.741	107.1
1012.099	145.94
1012.457	160.5
1012.815	153.22
1013.173	213.9
1013.531	133.8
1013.889	204.19
1014.247	209.04
1014.605	160.5
1014.962	145.94
1015.32	145.94
1015.678	160.5
1016.035	107.1
1016.393	128.95
1016.75	158.07
1017.107	131.37
1017.465	124.09
1017.822	119.24
1018.179	155.65
1018.536	75.55
1018.894	175.06
1019.251	155.65
1019.608	155.65
1019.964	126.52
1020.321	213.9
1020.678	75.55
1021.035	158.07
1021.392	172.64
1021.748	199.34
1022.105	172.64
1022.461	170.21
1022.818	192.05
1023.174	170.21
1023.531	177.49
1023.887	107.1
1024.243	97.39
1024.599	170.21
1024.955	138.66
1025.311	92.54
1025.667	70.69
1026.023	85.26
1026.379	141.08
1026.735	172.64
1027.091	145.94
1027.447	148.36
