189.514	123.64
189.973	123.64
190.431	123.64
190.889	21.69
191.348	65.38
191.806	28.97
192.264	48.39
192.722	-29.28
193.18	-26.85
193.638	-46.27
194.096	-31.71
194.554	11.98
195.012	-24.42
195.47	-17.14
195.928	33.83
196.385	-34.13
196.843	-5.01
197.301	-68.11
197.758	16.84
198.216	89.66
198.674	55.67
199.131	26.55
199.589	28.97
200.046	70.24
200.503	104.22
200.961	167.33
201.418	104.22
201.875	92.08
202.332	109.07
202.79	53.25
203.247	94.51
203.704	184.32
204.161	135.77
204.618	194.03
205.075	138.2
205.532	116.35
205.989	118.78
206.445	164.9
206.902	135.77
207.359	194.03
207.816	223.15
208.272	167.33
208.729	167.33
209.185	218.3
209.642	174.61
210.098	116.35
210.555	128.49
211.011	138.2
211.467	186.74
211.924	116.35
212.38	138.2
212.836	167.33
213.292	232.86
213.748	104.22
214.204	162.47
214.66	126.06
215.116	174.61
215.572	126.06
216.028	150.34
216.484	130.92
216.94	186.74
217.396	130.92
217.851	228.01
218.307	116.35
218.763	196.45
219.218	130.92
219.674	172.18
220.129	130.92
220.585	94.51
221.04	150.34
221.496	123.64
221.951	133.35
222.406	140.63
222.861	177.04
223.317	99.36
223.772	157.62
224.227	145.48
224.682	92.08
225.137	138.2
225.592	167.33
226.047	189.17
226.502	160.04
226.957	89.66
227.411	143.05
227.866	172.18
228.321	172.18
228.776	167.33
229.23	155.19
229.685	130.92
230.139	172.18
230.594	133.35
231.048	135.77
231.503	147.91
231.957	121.21
232.411	87.23
232.865	215.87
233.32	157.62
233.774	140.63
234.228	152.76
234.682	160.04
235.136	235.29
235.59	150.34
236.044	172.18
236.498	128.49
236.952	201.31
237.406	133.35
237.86	174.61
238.313	140.63
238.767	201.31
239.221	172.18
239.674	135.77
240.128	101.79
240.581	147.91
241.035	174.61
241.488	133.35
241.942	133.35
242.395	143.05
242.848	186.74
243.301	206.16
243.755	237.72
244.208	181.89
244.661	140.63
245.114	145.48
245.567	111.5
246.02	169.75
246.473	123.64
246.926	179.46
247.379	118.78
247.832	167.33
248.284	228.01
248.737	240.14
249.19	225.58
249.642	196.45
250.095	82.37
250.547	196.45
251	135.77
251.452	143.05
251.905	143.05
252.357	203.73
252.81	145.48
253.262	162.47
253.714	208.59
254.166	140.63
254.618	160.04
255.07	140.63
255.523	143.05
255.975	101.79
256.427	150.34
256.878	160.04
257.33	145.48
257.782	215.87
258.234	194.03
258.686	230.43
259.137	167.33
259.589	140.63
260.041	99.36
260.492	155.19
260.944	128.49
261.395	109.07
261.847	172.18
262.298	89.66
262.749	130.92
263.201	167.33
263.652	167.33
264.103	126.06
264.554	135.77
265.005	109.07
265.457	123.64
265.908	70.24
266.359	111.5
266.809	116.35
267.26	152.76
267.711	225.58
268.162	147.91
268.613	109.07
269.064	75.09
269.514	189.17
269.965	99.36
270.415	135.77
270.866	123.64
271.316	135.77
271.767	128.49
272.217	261.99
272.668	164.9
273.118	155.19
273.568	215.87
274.019	177.04
274.469	147.91
274.919	179.46
275.369	218.3
275.819	138.2
276.269	77.52
276.719	135.77
277.169	130.92
277.619	79.95
278.069	118.78
278.518	189.17
278.968	147.91
279.418	189.17
279.867	198.88
280.317	106.65
280.767	164.9
281.216	194.03
281.666	203.73
282.115	128.49
282.564	191.6
283.014	162.47
283.463	218.3
283.912	152.76
284.361	96.94
284.811	138.2
285.26	189.17
285.709	164.9
286.158	177.04
286.607	84.8
287.056	160.04
287.505	169.75
287.953	157.62
288.402	140.63
288.851	92.08
289.3	179.46
289.748	179.46
290.197	126.06
290.646	160.04
291.094	201.31
291.543	140.63
291.991	211.02
292.439	172.18
292.888	147.91
293.336	123.64
293.784	211.02
294.233	174.61
294.681	169.75
295.129	106.65
295.577	106.65
296.025	121.21
296.473	128.49
296.921	191.6
297.369	177.04
297.817	162.47
298.264	133.35
298.712	96.94
299.16	191.6
299.608	198.88
300.055	147.91
300.503	140.63
300.95	150.34
301.398	147.91
301.845	87.23
302.293	164.9
302.74	201.31
303.187	155.19
303.635	186.74
304.082	118.78
304.529	167.33
304.976	169.75
305.423	177.04
305.87	155.19
306.317	143.05
306.764	191.6
307.211	198.88
307.658	179.46
308.105	138.2
308.552	203.73
308.998	152.76
309.445	130.92
309.892	94.51
310.338	104.22
310.785	128.49
311.231	174.61
311.678	189.17
312.124	184.32
312.571	213.44
313.017	240.14
313.463	145.48
313.909	128.49
314.356	150.34
314.802	206.16
315.248	184.32
315.694	172.18
316.14	223.15
316.586	167.33
317.032	121.21
317.478	189.17
317.923	116.35
318.369	201.31
318.815	184.32
319.261	128.49
319.706	109.07
320.152	181.89
320.597	162.47
321.043	177.04
321.488	228.01
321.934	155.19
322.379	147.91
322.824	191.6
323.27	174.61
323.715	186.74
324.16	135.77
324.605	147.91
325.05	150.34
325.495	145.48
325.94	143.05
326.385	152.76
326.83	147.91
327.275	113.93
327.72	179.46
328.165	196.45
328.61	211.02
329.054	167.33
329.499	206.16
329.943	184.32
330.388	181.89
330.832	191.6
331.277	145.48
331.721	152.76
332.166	181.89
332.61	184.32
333.054	147.91
333.499	196.45
333.943	186.74
334.387	126.06
334.831	215.87
335.275	177.04
335.719	162.47
336.163	118.78
336.607	177.04
337.051	181.89
337.495	181.89
337.938	201.31
338.382	116.35
338.826	181.89
339.269	184.32
339.713	126.06
340.157	150.34
340.6	150.34
341.044	218.3
341.487	101.79
341.93	143.05
342.374	167.33
342.817	194.03
343.26	135.77
343.703	143.05
344.146	133.35
344.59	172.18
345.033	177.04
345.476	167.33
345.919	225.58
346.361	152.76
346.804	150.34
347.247	198.88
347.69	94.51
348.133	118.78
348.575	164.9
349.018	194.03
349.461	203.73
349.903	143.05
350.346	82.37
350.788	206.16
351.23	104.22
351.673	118.78
352.115	106.65
352.557	133.35
353	198.88
353.442	160.04
353.884	130.92
354.326	203.73
354.768	179.46
355.21	121.21
355.652	147.91
356.094	162.47
356.536	145.48
356.978	157.62
357.419	143.05
357.861	254.71
358.303	140.63
358.744	79.95
359.186	191.6
359.627	94.51
360.069	162.47
360.51	130.92
360.952	145.48
361.393	172.18
361.834	160.04
362.276	135.77
362.717	169.75
363.158	140.63
363.599	162.47
364.04	179.46
364.481	172.18
364.922	150.34
365.363	218.3
365.804	157.62
366.245	203.73
366.686	150.34
367.126	157.62
367.567	179.46
368.008	152.76
368.448	189.17
368.889	184.32
369.33	128.49
369.77	225.58
370.21	174.61
370.651	181.89
371.091	162.47
371.531	140.63
371.972	174.61
372.412	109.07
372.852	111.5
373.292	152.76
373.732	123.64
374.172	230.43
374.612	140.63
375.052	155.19
375.492	143.05
375.932	147.91
376.372	147.91
376.811	126.06
377.251	123.64
377.691	140.63
378.13	143.05
378.57	230.43
379.009	186.74
379.449	150.34
379.888	160.04
380.328	126.06
380.767	116.35
381.206	172.18
381.645	96.94
382.085	152.76
382.524	140.63
382.963	228.01
383.402	101.79
383.841	167.33
384.28	140.63
384.719	177.04
385.158	72.66
385.596	201.31
386.035	113.93
386.474	138.2
386.913	140.63
387.351	143.05
387.79	184.32
388.228	143.05
388.667	179.46
389.105	79.95
389.544	130.92
389.982	249.85
390.42	123.64
390.859	155.19
391.297	116.35
391.735	109.07
392.173	106.65
392.611	172.18
393.049	147.91
393.487	89.66
393.925	145.48
394.363	174.61
394.801	237.72
395.239	162.47
395.676	220.73
396.114	133.35
396.552	179.46
396.989	121.21
397.427	230.43
397.864	186.74
398.302	162.47
398.739	179.46
399.177	118.78
399.614	135.77
400.051	184.32
400.488	147.91
400.926	198.88
401.363	179.46
401.8	172.18
402.237	218.3
402.674	184.32
403.111	162.47
403.548	174.61
403.985	111.5
404.421	184.32
404.858	213.44
405.295	206.16
405.732	164.9
406.168	150.34
406.605	167.33
407.041	218.3
407.478	162.47
407.914	116.35
408.351	249.85
408.787	162.47
409.223	147.91
409.66	208.59
410.096	130.92
410.532	162.47
410.968	157.62
411.404	133.35
411.84	162.47
412.276	150.34
412.712	167.33
413.148	167.33
413.584	177.04
414.02	194.03
414.455	147.91
414.891	152.76
415.327	213.44
415.762	118.78
416.198	191.6
416.633	157.62
417.069	147.91
417.504	177.04
417.94	143.05
418.375	179.46
418.81	89.66
419.245	138.2
419.681	111.5
420.116	133.35
420.551	174.61
420.986	94.51
421.421	167.33
421.856	189.17
422.291	126.06
422.726	128.49
423.16	133.35
423.595	109.07
424.03	177.04
424.464	184.32
424.899	167.33
425.334	276.55
425.768	150.34
426.203	123.64
426.637	194.03
427.071	213.44
427.506	147.91
427.94	157.62
428.374	169.75
428.809	191.6
429.243	184.32
429.677	133.35
430.111	106.65
430.545	169.75
430.979	172.18
431.413	245
431.847	133.35
432.28	164.9
432.714	150.34
433.148	118.78
433.582	121.21
434.015	186.74
434.449	121.21
434.882	160.04
435.316	99.36
435.749	198.88
436.183	113.93
436.616	116.35
437.049	162.47
437.483	206.16
437.916	130.92
438.349	121.21
438.782	225.58
439.215	189.17
439.648	179.46
440.081	198.88
440.514	167.33
440.947	143.05
441.38	201.31
441.813	191.6
442.245	261.99
442.678	162.47
443.111	215.87
443.543	133.35
443.976	203.73
444.408	194.03
444.841	201.31
445.273	218.3
445.705	181.89
446.138	174.61
446.57	225.58
447.002	162.47
447.434	201.31
447.867	135.77
448.299	223.15
448.731	194.03
449.163	155.19
449.595	135.77
450.026	240.14
450.458	172.18
450.89	213.44
451.322	242.57
451.754	179.46
452.185	201.31
452.617	172.18
453.048	201.31
453.48	179.46
453.911	281.41
454.343	223.15
454.774	191.6
455.205	181.89
455.637	249.85
456.068	242.57
456.499	274.12
456.93	160.04
457.361	218.3
457.792	130.92
458.223	274.12
458.654	247.42
459.085	295.97
459.516	257.13
459.947	196.45
460.378	223.15
460.808	155.19
461.239	298.4
461.669	240.14
462.1	276.55
462.531	218.3
462.961	189.17
463.391	162.47
463.822	206.16
464.252	198.88
464.682	189.17
465.113	276.55
465.543	206.16
465.973	206.16
466.403	206.16
466.833	223.15
467.263	240.14
467.693	169.75
468.123	150.34
468.553	215.87
468.983	237.72
469.412	147.91
469.842	237.72
470.272	225.58
470.701	198.88
471.131	235.29
471.56	230.43
471.99	220.73
472.419	208.59
472.849	235.29
473.278	232.86
473.707	157.62
474.136	271.7
474.566	215.87
474.995	223.15
475.424	206.16
475.853	232.86
476.282	291.11
476.711	111.5
477.14	92.08
477.569	145.48
477.997	138.2
478.426	157.62
478.855	169.75
479.283	230.43
479.712	179.46
480.141	225.58
480.569	143.05
480.998	177.04
481.426	133.35
481.854	213.44
482.283	150.34
482.711	223.15
483.139	211.02
483.567	174.61
483.995	162.47
484.424	181.89
484.852	211.02
485.28	155.19
485.708	189.17
486.135	206.16
486.563	133.35
486.991	203.73
487.419	189.17
487.847	191.6
488.274	145.48
488.702	181.89
489.129	150.34
489.557	198.88
489.984	198.88
490.412	191.6
490.839	208.59
491.266	172.18
491.694	155.19
492.121	208.59
492.548	160.04
492.975	167.33
493.402	143.05
493.829	186.74
494.256	167.33
494.683	145.48
495.11	174.61
495.537	179.46
495.964	164.9
496.39	247.42
496.817	223.15
497.244	223.15
497.67	133.35
498.097	135.77
498.523	191.6
498.95	152.76
499.376	198.88
499.803	191.6
500.229	218.3
500.655	145.48
501.081	174.61
501.508	240.14
501.934	160.04
502.36	169.75
502.786	220.73
503.212	169.75
503.638	211.02
504.064	181.89
504.489	167.33
504.915	230.43
505.341	242.57
505.767	160.04
506.192	191.6
506.618	130.92
507.043	196.45
507.469	215.87
507.894	128.49
508.32	228.01
508.745	181.89
509.17	123.64
509.596	143.05
510.021	152.76
510.446	215.87
510.871	213.44
511.296	143.05
511.721	138.2
512.146	237.72
512.571	174.61
512.996	194.03
513.421	128.49
513.845	181.89
514.27	160.04
514.695	203.73
515.119	191.6
515.544	133.35
515.969	133.35
516.393	152.76
516.817	196.45
517.242	169.75
517.666	198.88
518.09	201.31
518.515	230.43
518.939	111.5
519.363	339.66
519.787	177.04
520.211	211.02
520.635	147.91
521.059	121.21
521.483	164.9
521.907	179.46
522.331	167.33
522.754	172.18
523.178	247.42
523.602	169.75
524.025	247.42
524.449	196.45
524.872	228.01
525.296	220.73
525.719	160.04
526.143	257.13
526.566	155.19
526.989	118.78
527.412	133.35
527.836	155.19
528.259	206.16
528.682	150.34
529.105	220.73
529.528	130.92
529.951	172.18
530.374	194.03
530.796	184.32
531.219	196.45
531.642	138.2
532.065	150.34
532.487	106.65
532.91	201.31
533.332	145.48
533.755	133.35
534.177	179.46
534.6	228.01
535.022	157.62
535.444	203.73
535.867	186.74
536.289	235.29
536.711	230.43
537.133	174.61
537.555	172.18
537.977	179.46
538.399	169.75
538.821	247.42
539.243	155.19
539.665	194.03
540.086	191.6
540.508	198.88
540.93	264.42
541.351	235.29
541.773	181.89
542.195	160.04
542.616	232.86
543.037	174.61
543.459	218.3
543.88	228.01
544.301	177.04
544.723	230.43
545.144	167.33
545.565	145.48
545.986	254.71
546.407	206.16
546.828	206.16
547.249	135.77
547.67	191.6
548.091	181.89
548.512	194.03
548.932	174.61
549.353	198.88
549.774	201.31
550.194	194.03
550.615	194.03
551.035	155.19
551.456	174.61
551.876	215.87
552.296	155.19
552.717	247.42
553.137	264.42
553.557	191.6
553.977	109.07
554.397	269.27
554.817	160.04
555.237	164.9
555.657	155.19
556.077	155.19
556.497	189.17
556.917	211.02
557.337	160.04
557.756	186.74
558.176	152.76
558.596	177.04
559.015	135.77
559.435	196.45
559.854	160.04
560.274	162.47
560.693	96.94
561.112	198.88
561.532	194.03
561.951	152.76
562.37	133.35
562.789	152.76
563.208	99.36
563.627	123.64
564.046	191.6
564.465	162.47
564.884	167.33
565.303	116.35
565.722	92.08
566.14	206.16
566.559	135.77
566.978	123.64
567.396	181.89
567.815	162.47
568.233	230.43
568.652	172.18
569.07	160.04
569.489	194.03
569.907	181.89
570.325	140.63
570.743	160.04
571.161	135.77
571.58	206.16
571.998	230.43
572.416	211.02
572.833	245
573.251	215.87
573.669	155.19
574.087	179.46
574.505	177.04
574.922	138.2
575.34	213.44
575.758	172.18
576.175	155.19
576.593	232.86
577.01	181.89
577.428	186.74
577.845	1337.25
578.262	228.01
578.68	145.48
579.097	228.01
579.514	198.88
579.931	116.35
580.348	160.04
580.765	189.17
581.182	189.17
581.599	196.45
582.016	169.75
582.433	152.76
582.849	213.44
583.266	228.01
583.683	189.17
584.099	181.89
584.516	181.89
584.933	72.66
585.349	208.59
585.765	213.44
586.182	191.6
586.598	206.16
587.014	225.58
587.431	150.34
587.847	211.02
588.263	172.18
588.679	232.86
589.095	208.59
589.511	198.88
589.927	247.42
590.343	249.85
590.759	186.74
591.174	211.02
591.59	79.95
592.006	172.18
592.421	191.6
592.837	135.77
593.252	184.32
593.668	208.59
594.083	155.19
594.499	191.6
594.914	160.04
595.329	191.6
595.745	179.46
596.16	184.32
596.575	218.3
596.99	152.76
597.405	196.45
597.82	196.45
598.235	191.6
598.65	213.44
599.065	228.01
599.479	143.05
599.894	133.35
600.309	201.31
600.724	225.58
601.138	203.73
601.553	181.89
601.967	162.47
602.382	218.3
602.796	133.35
603.21	181.89
603.625	174.61
604.039	211.02
604.453	194.03
604.867	213.44
605.281	208.59
605.695	211.02
606.109	162.47
606.523	143.05
606.937	186.74
607.351	363.93
607.765	128.49
608.178	92.08
608.592	179.46
609.006	184.32
609.419	220.73
609.833	237.72
610.246	152.76
610.66	230.43
611.073	179.46
611.487	201.31
611.9	150.34
612.313	172.18
612.726	179.46
613.139	196.45
613.553	174.61
613.966	186.74
614.379	160.04
614.792	140.63
615.204	198.88
615.617	167.33
616.03	240.14
616.443	213.44
616.856	201.31
617.268	198.88
617.681	128.49
618.093	147.91
618.506	155.19
618.918	160.04
619.331	198.88
619.743	138.2
620.155	179.46
620.568	164.9
620.98	186.74
621.392	160.04
621.804	196.45
622.216	157.62
622.628	184.32
623.04	140.63
623.452	157.62
623.864	130.92
624.276	87.23
624.687	126.06
625.099	191.6
625.511	167.33
625.922	198.88
626.334	89.66
626.745	172.18
627.157	147.91
627.568	225.58
627.979	261.99
628.391	184.32
628.802	261.99
629.213	201.31
629.624	150.34
630.035	198.88
630.446	169.75
630.857	160.04
631.268	152.76
631.679	194.03
632.09	172.18
632.501	184.32
632.912	181.89
633.322	223.15
633.733	118.78
634.144	215.87
634.554	150.34
634.965	191.6
635.375	172.18
635.785	157.62
636.196	167.33
636.606	145.48
637.016	140.63
637.427	215.87
637.837	138.2
638.247	215.87
638.657	174.61
639.067	162.47
639.477	130.92
639.887	164.9
640.297	121.21
640.706	145.48
641.116	186.74
641.526	177.04
641.935	157.62
642.345	121.21
642.755	140.63
643.164	174.61
643.573	211.02
643.983	189.17
644.392	155.19
644.801	155.19
645.211	206.16
645.62	169.75
646.029	215.87
646.438	177.04
646.847	162.47
647.256	191.6
647.665	191.6
648.074	228.01
648.483	177.04
648.892	172.18
649.3	198.88
649.709	213.44
650.118	203.73
650.526	201.31
650.935	145.48
651.343	203.73
651.752	164.9
652.16	179.46
652.568	157.62
652.977	152.76
653.385	189.17
653.793	179.46
654.201	152.76
654.609	220.73
655.017	118.78
655.425	130.92
655.833	160.04
656.241	220.73
656.649	196.45
657.057	172.18
657.464	155.19
657.872	189.17
658.28	218.3
658.687	206.16
659.095	160.04
659.502	211.02
659.91	79.95
660.317	206.16
660.724	126.06
661.132	147.91
661.539	194.03
661.946	201.31
662.353	157.62
662.76	152.76
663.167	162.47
663.574	150.34
663.981	121.21
664.388	106.65
664.795	111.5
665.202	157.62
665.608	167.33
666.015	186.74
666.422	128.49
666.828	155.19
667.235	172.18
667.641	155.19
668.047	116.35
668.454	208.59
668.86	147.91
669.266	169.75
669.673	150.34
670.079	206.16
670.485	145.48
670.891	145.48
671.297	172.18
671.703	160.04
672.109	157.62
672.515	174.61
672.92	164.9
673.326	167.33
673.732	133.35
674.138	138.2
674.543	281.41
674.949	157.62
675.354	155.19
675.76	206.16
676.165	206.16
676.57	89.66
676.976	135.77
677.381	79.95
677.786	133.35
678.191	201.31
678.596	167.33
679.001	225.58
679.406	160.04
679.811	218.3
680.216	254.71
680.621	232.86
681.026	181.89
681.43	172.18
681.835	218.3
682.24	189.17
682.644	169.75
683.049	128.49
683.453	111.5
683.858	257.13
684.262	118.78
684.667	164.9
685.071	147.91
685.475	189.17
685.879	162.47
686.283	130.92
686.687	150.34
687.091	230.43
687.495	133.35
687.899	126.06
688.303	116.35
688.707	152.76
689.111	155.19
689.514	181.89
689.918	138.2
690.322	123.64
690.725	179.46
691.129	177.04
691.532	121.21
691.936	203.73
692.339	157.62
692.742	179.46
693.146	155.19
693.549	172.18
693.952	215.87
694.355	184.32
694.758	177.04
695.161	123.64
695.564	179.46
695.967	157.62
696.37	169.75
696.773	157.62
697.175	184.32
697.578	181.89
697.981	252.28
698.383	203.73
698.786	184.32
699.188	201.31
699.591	201.31
699.993	133.35
700.395	179.46
700.798	196.45
701.2	150.34
701.602	160.04
702.004	179.46
702.406	133.35
702.808	167.33
703.21	196.45
703.612	194.03
704.014	186.74
704.416	208.59
704.818	242.57
705.219	169.75
705.621	223.15
706.023	196.45
706.424	215.87
706.826	186.74
707.227	220.73
707.629	291.11
708.03	194.03
708.431	259.56
708.832	354.22
709.234	140.63
709.635	186.74
710.036	235.29
710.437	305.68
710.838	242.57
711.239	157.62
711.64	286.26
712.041	286.26
712.441	378.49
712.842	247.42
713.243	252.28
713.643	271.7
714.044	293.54
714.445	320.24
714.845	295.97
715.246	339.66
715.646	254.71
716.046	312.96
716.447	410.05
716.847	339.66
717.247	293.54
717.647	329.95
718.047	312.96
718.447	315.39
718.847	298.4
719.247	356.65
719.647	322.67
720.047	315.39
720.446	327.52
720.846	354.22
721.246	322.67
721.645	429.47
722.045	325.1
722.444	402.77
722.844	339.66
723.243	461.02
723.643	453.74
724.042	361.5
724.441	453.74
724.84	395.49
725.24	463.45
725.639	473.16
726.038	524.13
726.437	436.75
726.836	502.28
727.234	458.59
727.633	550.83
728.032	521.7
728.431	536.26
728.83	640.63
729.228	601.8
729.627	572.67
730.025	737.72
730.424	657.63
730.822	728.01
731.22	679.47
731.619	781.41
732.017	822.68
732.415	914.91
732.813	990.15
733.212	946.46
733.61	1138.22
734.008	1198.9
734.406	1157.63
734.803	1245.01
735.201	1315.4
735.599	1419.77
735.997	1577.54
736.395	1601.81
736.792	1742.59
737.19	1825.12
737.587	1897.94
737.985	1910.07
738.382	2019.3
738.78	2305.71
739.177	2245.03
739.574	2393.09
739.971	2582.41
740.369	2779.02
740.766	2902.81
741.163	2832.42
741.56	3130.96
741.957	3213.49
742.354	3164.95
742.751	3395.53
743.147	3679.52
743.544	3737.77
743.941	3847
744.338	4036.32
744.734	4177.1
745.131	4604.29
745.527	4669.82
745.924	4859.15
746.32	5235.37
746.716	5502.36
747.113	5589.74
747.509	5667.41
747.905	6067.9
748.301	6604.32
748.697	6776.65
749.093	6800.92
749.489	7094.62
749.885	7631.03
750.281	8072.79
750.677	7856.77
751.073	8150.46
751.468	8890.76
751.864	9419.9
752.26	8970.86
752.655	9509.7
753.051	10094.67
753.446	11031.57
753.842	10754.87
754.237	10871.38
754.632	11635.95
755.028	12014.6
755.423	11645.66
755.818	11754.89
756.213	12293.73
756.608	12771.89
757.003	12551.01
757.398	12507.32
757.793	12951.51
758.188	13854.43
758.583	13706.37
758.977	13237.92
759.372	14150.55
759.767	15449.12
760.161	15871.45
760.556	15798.64
760.95	16356.9
761.345	18262.27
761.739	18835.09
762.133	18684.6
762.527	18788.98
762.922	20381.23
763.316	21631.25
763.71	20801.14
764.104	20398.22
764.498	22342.43
764.892	23412.83
765.286	23128.85
765.68	22483.21
766.073	23225.94
766.467	25143.44
766.861	25548.79
767.255	25235.68
767.648	26153.17
768.042	27604.65
768.435	28730.88
768.829	27497.85
769.222	27609.5
769.615	28997.87
770.008	30556.15
770.402	29937.21
770.795	28233.3
771.188	29347.39
771.581	30835.28
771.974	30109.54
772.367	28337.67
772.76	28534.27
773.153	29713.9
773.545	30155.66
773.938	29672.64
774.331	28917.77
774.724	30029.44
775.116	32747.93
775.509	33692.12
775.901	32951.82
776.294	33184.83
776.686	35951.86
777.078	37573.25
777.471	36291.67
777.863	37116.93
778.255	38648.51
778.647	41417.97
779.039	41561.17
779.431	38830.55
779.823	38714.04
780.215	41461.66
780.607	42699.54
780.999	41206.8
781.39	39527.16
781.782	41243.21
782.174	44284.52
782.565	44187.43
782.957	41726.23
783.348	42228.66
783.74	44100.05
784.131	44303.94
784.522	43194.69
784.914	40551.45
785.305	41461.66
785.696	43801.5
786.087	43160.71
786.478	39988.33
786.869	38604.82
787.26	39891.25
787.651	40483.49
788.042	38510.16
788.433	35400.88
788.823	35558.65
789.214	37102.37
789.605	36590.22
789.995	33546.49
790.386	31849.86
790.776	32973.66
791.167	34675.14
791.557	34818.35
791.948	33830.47
792.338	33682.41
792.728	37007.71
793.118	37837.82
793.508	36490.71
793.898	34573.2
794.288	35818.37
794.678	37811.12
795.068	38311.12
795.458	35976.14
795.848	34131.45
796.238	35653.32
796.627	37102.37
797.017	36393.62
797.406	34454.27
797.796	33818.34
798.185	36485.85
798.575	38039.27
798.964	36738.28
799.354	34439.7
799.743	34456.69
800.132	36866.93
800.521	37847.52
800.91	35784.39
801.299	33624.16
801.688	34854.76
802.077	35917.88
802.466	36925.18
802.855	33891.15
803.244	30772.17
803.633	32798.9
804.021	34211.55
804.41	32738.22
804.799	29997.89
805.187	28573.11
805.576	29895.94
805.964	30891.11
806.352	29087.68
806.741	26560.94
807.129	25621.61
807.517	27509.98
807.905	29493.03
808.293	27706.59
808.681	26257.54
809.069	25388.59
809.457	29493.03
809.845	30432.36
810.233	28145.92
810.621	26517.25
811.009	26451.72
811.396	28893.5
811.784	29927.5
812.171	28616.8
812.559	26172.59
812.946	25973.55
813.334	27772.12
813.721	28344.95
814.108	25660.44
814.496	23492.93
814.883	23628.86
815.27	26682.3
815.657	26374.04
816.044	25000.24
816.431	23310.89
816.818	23895.85
817.205	25141.02
817.592	25934.72
817.979	24099.74
818.365	22233.2
818.752	22036.6
819.139	22594.86
819.525	22655.54
819.912	21123.96
820.298	19721.03
820.685	19128.79
821.071	19657.92
821.457	20140.94
821.843	18614.22
822.23	16878.75
822.616	16674.86
823.002	16813.22
823.388	17070.5
823.774	15585.04
824.16	14058.32
824.546	14007.35
824.931	14730.66
825.317	15128.72
825.703	14004.92
826.089	12767.04
826.474	12388.39
826.86	13148.11
827.245	13759.77
827.631	13356.85
828.016	12572.86
828.401	11378.67
828.787	12024.31
829.172	12490.33
829.557	12060.72
829.942	11084.97
830.327	10250.01
830.712	10640.79
831.097	10885.94
831.482	10939.34
831.867	9856.8
832.252	9410.19
832.636	9320.38
833.021	9660.19
833.406	9881.07
833.79	9349.51
834.175	8565.52
834.559	8351.92
834.944	8558.23
835.328	8997.56
835.713	8400.46
836.097	7606.76
836.481	7138.31
836.865	7497.54
837.249	7465.98
837.633	7286.37
838.017	6444.12
838.401	5990.23
838.785	5803.34
839.169	5995.09
839.553	6128.58
839.937	5660.13
840.32	5070.32
840.704	4766.91
841.087	5031.48
841.471	5070.32
841.854	4781.48
842.238	4310.59
842.621	4058.16
843.004	4223.21
843.388	4371.28
843.771	4262.05
844.154	3934.38
844.537	3647.96
844.92	3681.94
845.303	3936.8
845.686	3980.49
846.069	3764.47
846.452	3383.4
846.834	3356.7
847.217	3361.55
847.6	3701.36
847.982	3492.62
848.365	3223.2
848.748	2970.77
849.13	2973.2
849.512	3208.64
849.895	3092.13
850.277	2902.81
850.659	2562.99
851.041	2582.41
851.423	2696.49
851.806	2871.25
852.188	2832.42
852.57	2405.23
852.951	2257.16
853.333	2232.89
853.715	2555.71
854.097	2465.91
854.479	2325.13
854.86	1992.6
855.242	1905.22
855.623	1978.03
856.005	2062.99
856.386	2016.87
856.768	1764.44
857.149	1643.08
857.53	1519.29
857.911	1543.56
858.292	1766.87
858.674	1650.36
859.055	1444.05
859.436	1300.84
859.817	1303.27
860.197	1429.48
860.578	1482.88
860.959	1322.68
861.34	1101.81
861.72	1067.83
862.101	1198.9
862.482	1075.11
862.862	1196.47
863.243	1084.82
863.623	1055.69
864.003	888.21
864.384	980.45
864.764	1053.26
865.144	997.44
865.524	834.81
865.904	698.89
866.284	832.39
866.664	832.39
867.044	829.96
867.424	788.7
867.804	686.75
868.183	740.15
868.563	652.77
868.943	715.88
869.322	837.24
869.702	669.76
870.081	613.94
870.461	497.43
870.84	652.77
871.22	567.82
871.599	606.65
871.978	553.25
872.357	575.1
872.736	446.46
873.115	528.98
873.494	470.73
873.873	497.43
874.252	487.72
874.631	315.39
875.01	422.18
875.388	410.05
875.767	427.04
876.146	439.18
876.524	414.9
876.903	334.8
877.281	295.97
877.66	349.37
878.038	373.64
878.416	278.98
878.794	312.96
879.173	363.93
879.551	315.39
879.929	383.35
880.307	329.95
880.685	308.11
881.063	230.43
881.441	261.99
881.818	312.96
882.196	266.84
882.574	308.11
882.951	184.32
883.329	230.43
883.707	283.83
884.084	261.99
884.461	281.41
884.839	228.01
885.216	232.86
885.593	266.84
885.971	167.33
886.348	218.3
886.725	247.42
887.102	310.53
887.479	232.86
887.856	177.04
888.233	196.45
888.609	181.89
888.986	261.99
889.363	160.04
889.74	213.44
890.116	186.74
890.493	181.89
890.869	206.16
891.246	177.04
891.622	203.73
891.998	203.73
892.375	220.73
892.751	172.18
893.127	208.59
893.503	208.59
893.879	128.49
894.255	121.21
894.631	160.04
895.007	196.45
895.383	113.93
895.759	169.75
896.134	128.49
896.51	213.44
896.886	177.04
897.261	126.06
897.637	208.59
898.012	177.04
898.388	84.8
898.763	164.9
899.138	143.05
899.514	191.6
899.889	135.77
900.264	130.92
900.639	240.14
901.014	138.2
901.389	72.66
901.764	206.16
902.139	152.76
902.513	157.62
902.888	126.06
903.263	191.6
903.638	147.91
904.012	164.9
904.387	143.05
904.761	189.17
905.136	147.91
905.51	189.17
905.884	126.06
906.259	130.92
906.633	113.93
907.007	38.68
907.381	201.31
907.755	147.91
908.129	150.34
908.503	215.87
908.877	223.15
909.251	138.2
909.624	198.88
909.998	177.04
910.372	155.19
910.745	162.47
911.119	126.06
911.492	113.93
911.866	130.92
912.239	140.63
912.612	130.92
912.986	116.35
913.359	143.05
913.732	172.18
914.105	198.88
914.478	106.65
914.851	14.41
915.224	160.04
915.597	128.49
915.97	147.91
916.343	167.33
916.715	140.63
917.088	111.5
917.461	126.06
917.833	135.77
918.206	143.05
918.578	162.47
918.951	94.51
919.323	135.77
919.695	174.61
920.067	164.9
920.44	184.32
920.812	118.78
921.184	147.91
921.556	228.01
921.928	128.49
922.3	133.35
922.672	130.92
923.043	162.47
923.415	152.76
923.787	169.75
924.158	145.48
924.53	155.19
924.901	177.04
925.273	162.47
925.644	126.06
926.016	111.5
926.387	111.5
926.758	184.32
927.129	203.73
927.5	109.07
927.872	133.35
928.243	96.94
928.613	113.93
928.984	218.3
929.355	155.19
929.726	133.35
930.097	143.05
930.467	145.48
930.838	133.35
931.209	164.9
931.579	94.51
931.95	135.77
932.32	198.88
932.69	201.31
933.061	135.77
933.431	138.2
933.801	169.75
934.171	96.94
934.541	215.87
934.911	186.74
935.281	169.75
935.651	167.33
936.021	143.05
936.391	135.77
936.761	99.36
937.13	111.5
937.5	116.35
937.87	109.07
938.239	55.67
938.609	130.92
938.978	167.33
939.347	109.07
939.717	172.18
940.086	155.19
940.455	145.48
940.824	96.94
941.193	130.92
941.562	113.93
941.931	147.91
942.3	203.73
942.669	113.93
943.038	177.04
943.407	140.63
943.775	162.47
944.144	106.65
944.513	138.2
944.881	167.33
945.25	147.91
945.618	89.66
945.986	174.61
946.355	172.18
946.723	160.04
947.091	167.33
947.459	79.95
947.827	198.88
948.195	150.34
948.563	162.47
948.931	174.61
949.299	121.21
949.667	126.06
950.035	106.65
950.402	186.74
950.77	121.21
951.138	104.22
951.505	75.09
951.873	167.33
952.24	77.52
952.607	118.78
952.975	126.06
953.342	162.47
953.709	130.92
954.076	130.92
954.443	160.04
954.81	111.5
955.177	196.45
955.544	121.21
955.911	181.89
956.278	186.74
956.645	121.21
957.012	225.58
957.378	167.33
957.745	94.51
958.111	172.18
958.478	198.88
958.844	235.29
959.211	150.34
959.577	140.63
959.943	140.63
960.309	162.47
960.675	208.59
961.042	155.19
961.408	261.99
961.774	237.72
962.139	133.35
962.505	121.21
962.871	172.18
963.237	133.35
963.603	113.93
963.968	147.91
964.334	174.61
964.699	111.5
965.065	126.06
965.43	84.8
965.796	130.92
966.161	167.33
966.526	186.74
966.891	147.91
967.256	138.2
967.622	135.77
967.987	155.19
968.352	128.49
968.716	181.89
969.081	174.61
969.446	162.47
969.811	128.49
970.176	128.49
970.54	184.32
970.905	167.33
971.269	203.73
971.634	126.06
971.998	220.73
972.363	138.2
972.727	79.95
973.091	157.62
973.455	225.58
973.819	232.86
974.183	169.75
974.547	116.35
974.911	116.35
975.275	143.05
975.639	164.9
976.003	228.01
976.367	179.46
976.73	177.04
977.094	133.35
977.458	164.9
977.821	152.76
978.185	106.65
978.548	160.04
978.911	155.19
979.275	145.48
979.638	130.92
980.001	191.6
980.364	189.17
980.727	162.47
981.09	155.19
981.453	206.16
981.816	164.9
982.179	155.19
982.542	194.03
982.905	101.79
983.267	147.91
983.63	157.62
983.992	213.44
984.355	121.21
984.717	138.2
985.08	172.18
985.442	147.91
985.804	77.52
986.167	130.92
986.529	92.08
986.891	160.04
987.253	60.53
987.615	220.73
987.977	109.07
988.339	157.62
988.701	184.32
989.062	133.35
989.424	196.45
989.786	135.77
990.147	174.61
990.509	145.48
990.87	189.17
991.232	169.75
991.593	174.61
991.955	184.32
992.316	184.32
992.677	152.76
993.038	133.35
993.399	172.18
993.76	169.75
994.121	121.21
994.482	172.18
994.843	109.07
995.204	167.33
995.565	96.94
995.926	155.19
996.286	167.33
996.647	138.2
997.007	45.97
997.368	167.33
997.728	167.33
998.089	111.5
998.449	191.6
998.809	155.19
999.169	160.04
999.53	118.78
999.89	177.04
1000.25	87.23
1000.61	160.04
1000.97	128.49
1001.329	150.34
1001.689	118.78
1002.049	157.62
1002.409	87.23
1002.768	191.6
1003.128	162.47
1003.487	118.78
1003.847	184.32
1004.206	138.2
1004.566	133.35
1004.925	169.75
1005.284	215.87
1005.643	167.33
1006.003	172.18
1006.362	123.64
1006.721	201.31
1007.08	220.73
1007.438	172.18
1007.797	133.35
1008.156	147.91
1008.515	145.48
1008.874	140.63
1009.232	172.18
1009.591	179.46
1009.949	121.21
1010.308	181.89
1010.666	155.19
1011.024	145.48
1011.383	169.75
1011.741	113.93
1012.099	126.06
1012.457	130.92
1012.815	70.24
1013.173	152.76
1013.531	133.35
1013.889	130.92
1014.247	82.37
1014.605	133.35
1014.962	198.88
1015.32	135.77
1015.678	160.04
1016.035	126.06
1016.393	157.62
1016.75	118.78
1017.107	162.47
1017.465	172.18
1017.822	181.89
1018.179	126.06
1018.536	123.64
1018.894	147.91
1019.251	150.34
1019.608	28.97
1019.964	135.77
1020.321	121.21
1020.678	147.91
1021.035	96.94
1021.392	189.17
1021.748	228.01
1022.105	167.33
1022.461	121.21
1022.818	160.04
1023.174	123.64
1023.531	208.59
1023.887	179.46
1024.243	181.89
1024.599	157.62
1024.955	135.77
1025.311	169.75
1025.667	196.45
1026.023	157.62
1026.379	121.21
1026.735	155.19
1027.091	126.06
1027.447	218.3
