189.514	69.93
189.973	69.93
190.431	69.93
190.889	45.66
191.348	-29.58
191.806	14.11
192.264	18.96
192.722	-0.46
193.18	-27.15
193.638	-73.27
194.096	9.25
194.554	-46.57
195.012	26.24
195.47	-49
195.928	-2.88
196.385	-17.45
196.843	-17.45
197.301	4.4
197.758	108.77
198.216	16.54
198.674	-15.02
199.131	65.08
199.589	26.24
200.046	72.36
200.503	135.47
200.961	48.09
201.418	91.78
201.875	99.06
202.332	145.18
202.79	103.92
203.247	150.03
203.704	193.72
204.161	96.63
204.618	201
205.075	188.87
205.532	196.15
205.989	179.16
206.445	157.31
206.902	174.3
207.359	106.34
207.816	169.45
208.272	137.9
208.729	128.19
209.185	113.62
209.642	128.19
210.098	137.9
210.555	232.56
211.011	176.73
211.467	239.84
211.924	147.61
212.38	174.3
212.836	191.3
213.292	201
213.748	171.88
214.204	205.86
214.66	188.87
215.116	203.43
215.572	174.3
216.028	176.73
216.484	191.3
216.94	186.44
217.396	174.3
217.851	150.03
218.307	186.44
218.763	120.91
219.218	198.58
219.674	142.75
220.129	157.31
220.585	142.75
221.04	198.58
221.496	142.75
221.951	213.14
222.406	159.74
222.861	181.59
223.317	116.05
223.772	142.75
224.227	150.03
224.682	116.05
225.137	154.89
225.592	152.46
226.047	150.03
226.502	123.33
226.957	174.3
227.411	135.47
227.866	140.32
228.321	179.16
228.776	125.76
229.23	133.04
229.685	169.45
230.139	203.43
230.594	179.16
231.048	159.74
231.503	159.74
231.957	164.6
232.411	159.74
232.865	171.88
233.32	142.75
233.774	125.76
234.228	152.46
234.682	171.88
235.136	142.75
235.59	181.59
236.044	154.89
236.498	193.72
236.952	162.17
237.406	176.73
237.86	154.89
238.313	169.45
238.767	213.14
239.221	154.89
239.674	184.01
240.128	150.03
240.581	108.77
241.035	220.42
241.488	28.67
241.942	181.59
242.395	176.73
242.848	208.29
243.301	215.57
243.755	196.15
244.208	227.7
244.661	205.86
245.114	230.13
245.567	84.5
246.02	106.34
246.473	181.59
246.926	152.46
247.379	150.03
247.832	128.19
248.284	135.47
248.737	208.29
249.19	188.87
249.642	167.02
250.095	205.86
250.547	157.31
251	230.13
251.452	188.87
251.905	186.44
252.357	130.61
252.81	181.59
253.262	157.31
253.714	196.15
254.166	111.2
254.618	74.79
255.07	145.18
255.523	196.15
255.975	198.58
256.427	60.23
256.878	133.04
257.33	162.17
257.782	181.59
258.234	159.74
258.686	120.91
259.137	186.44
259.589	135.47
260.041	116.05
260.492	164.6
260.944	147.61
261.395	128.19
261.847	181.59
262.298	169.45
262.749	152.46
263.201	150.03
263.652	184.01
264.103	208.29
264.554	169.45
265.005	203.43
265.457	106.34
265.908	145.18
266.359	133.04
266.809	128.19
267.26	162.17
267.711	191.3
268.162	152.46
268.613	188.87
269.064	159.74
269.514	169.45
269.965	133.04
270.415	164.6
270.866	188.87
271.316	157.31
271.767	193.72
272.217	203.43
272.668	91.78
273.118	179.16
273.568	135.47
274.019	154.89
274.469	215.57
274.919	188.87
275.369	147.61
275.819	116.05
276.269	176.73
276.719	101.49
277.169	140.32
277.619	174.3
278.069	118.48
278.518	196.15
278.968	159.74
279.418	174.3
279.867	188.87
280.317	203.43
280.767	186.44
281.216	217.99
281.666	147.61
282.115	203.43
282.564	137.9
283.014	171.88
283.463	208.29
283.912	174.3
284.361	120.91
284.811	147.61
285.26	167.02
285.709	133.04
286.158	217.99
286.607	159.74
287.056	251.98
287.505	254.4
287.953	205.86
288.402	171.88
288.851	162.17
289.3	103.92
289.748	157.31
290.197	164.6
290.646	184.01
291.094	191.3
291.543	167.02
291.991	201
292.439	140.32
292.888	125.76
293.336	198.58
293.784	133.04
294.233	184.01
294.681	208.29
295.129	103.92
295.577	210.71
296.025	159.74
296.473	181.59
296.921	174.3
297.369	133.04
297.817	205.86
298.264	191.3
298.712	174.3
299.16	184.01
299.608	147.61
300.055	125.76
300.503	193.72
300.95	196.15
301.398	244.69
301.845	130.61
302.293	179.16
302.74	118.48
303.187	181.59
303.635	215.57
304.082	154.89
304.529	164.6
304.976	220.42
305.423	196.15
305.87	118.48
306.317	145.18
306.764	120.91
307.211	167.02
307.658	210.71
308.105	179.16
308.552	181.59
308.998	210.71
309.445	145.18
309.892	217.99
310.338	152.46
310.785	164.6
311.231	157.31
311.678	152.46
312.124	215.57
312.571	116.05
313.017	179.16
313.463	174.3
313.909	213.14
314.356	111.2
314.802	128.19
315.248	167.02
315.694	198.58
316.14	198.58
316.586	133.04
317.032	215.57
317.478	142.75
317.923	101.49
318.369	198.58
318.815	210.71
319.261	179.16
319.706	193.72
320.152	186.44
320.597	213.14
321.043	237.41
321.488	174.3
321.934	181.59
322.379	169.45
322.824	174.3
323.27	174.3
323.715	191.3
324.16	106.34
324.605	147.61
325.05	150.03
325.495	152.46
325.94	133.04
326.385	169.45
326.83	164.6
327.275	106.34
327.72	140.32
328.165	227.7
328.61	251.98
329.054	193.72
329.499	167.02
329.943	191.3
330.388	103.92
330.832	196.15
331.277	184.01
331.721	232.56
332.166	196.15
332.61	135.47
333.054	205.86
333.499	103.92
333.943	162.17
334.387	137.9
334.831	176.73
335.275	118.48
335.719	120.91
336.163	120.91
336.607	154.89
337.051	169.45
337.495	210.71
337.938	128.19
338.382	159.74
338.826	174.3
339.269	135.47
339.713	133.04
340.157	133.04
340.6	140.32
341.044	193.72
341.487	193.72
341.93	174.3
342.374	133.04
342.817	232.56
343.26	205.86
343.703	111.2
344.146	171.88
344.59	145.18
345.033	196.15
345.476	164.6
345.919	116.05
346.361	244.69
346.804	184.01
347.247	159.74
347.69	225.28
348.133	176.73
348.575	159.74
349.018	181.59
349.461	120.91
349.903	152.46
350.346	89.35
350.788	154.89
351.23	128.19
351.673	147.61
352.115	256.83
352.557	159.74
353	203.43
353.442	213.14
353.884	130.61
354.326	217.99
354.768	106.34
355.21	145.18
355.652	242.27
356.094	217.99
356.536	179.16
356.978	181.59
357.419	116.05
357.861	150.03
358.303	193.72
358.744	171.88
359.186	162.17
359.627	116.05
360.069	179.16
360.51	133.04
360.952	251.98
361.393	201
361.834	140.32
362.276	142.75
362.717	125.76
363.158	157.31
363.599	188.87
364.04	174.3
364.481	186.44
364.922	145.18
365.363	150.03
365.804	198.58
366.245	208.29
366.686	169.45
367.126	171.88
367.567	217.99
368.008	133.04
368.448	232.56
368.889	171.88
369.33	145.18
369.77	159.74
370.21	278.68
370.651	179.16
371.091	213.14
371.531	118.48
371.972	169.45
372.412	137.9
372.852	135.47
373.292	152.46
373.732	198.58
374.172	193.72
374.612	167.02
375.052	230.13
375.492	113.62
375.932	128.19
376.372	135.47
376.811	171.88
377.251	152.46
377.691	157.31
378.13	181.59
378.57	205.86
379.009	196.15
379.449	208.29
379.888	103.92
380.328	116.05
380.767	118.48
381.206	174.3
381.645	137.9
382.085	164.6
382.524	171.88
382.963	169.45
383.402	164.6
383.841	249.55
384.28	152.46
384.719	164.6
385.158	220.42
385.596	152.46
386.035	198.58
386.474	171.88
386.913	142.75
387.351	249.55
387.79	147.61
388.228	113.62
388.667	186.44
389.105	220.42
389.544	222.85
389.982	103.92
390.42	142.75
390.859	169.45
391.297	113.62
391.735	91.78
392.173	125.76
392.611	234.99
393.049	227.7
393.487	174.3
393.925	145.18
394.363	230.13
394.801	159.74
395.239	215.57
395.676	154.89
396.114	210.71
396.552	210.71
396.989	188.87
397.427	188.87
397.864	181.59
398.302	201
398.739	147.61
399.177	169.45
399.614	186.44
400.051	213.14
400.488	159.74
400.926	154.89
401.363	179.16
401.8	196.15
402.237	181.59
402.674	176.73
403.111	150.03
403.548	123.33
403.985	205.86
404.421	186.44
404.858	152.46
405.295	179.16
405.732	135.47
406.168	157.31
406.605	120.91
407.041	128.19
407.478	186.44
407.914	179.16
408.351	145.18
408.787	157.31
409.223	169.45
409.66	188.87
410.096	159.74
410.532	150.03
410.968	188.87
411.404	128.19
411.84	201
412.276	181.59
412.712	169.45
413.148	191.3
413.584	215.57
414.02	147.61
414.455	125.76
414.891	162.17
415.327	179.16
415.762	157.31
416.198	205.86
416.633	118.48
417.069	162.17
417.504	120.91
417.94	230.13
418.375	103.92
418.81	220.42
419.245	171.88
419.681	167.02
420.116	130.61
420.551	118.48
420.986	142.75
421.421	154.89
421.856	140.32
422.291	196.15
422.726	225.28
423.16	164.6
423.595	196.15
424.03	181.59
424.464	193.72
424.899	164.6
425.334	217.99
425.768	159.74
426.203	125.76
426.637	108.77
427.071	162.17
427.506	179.16
427.94	196.15
428.374	203.43
428.809	167.02
429.243	181.59
429.677	210.71
430.111	225.28
430.545	96.63
430.979	193.72
431.413	213.14
431.847	244.69
432.28	184.01
432.714	137.9
433.148	103.92
433.582	191.3
434.015	215.57
434.449	154.89
434.882	188.87
435.316	145.18
435.749	174.3
436.183	125.76
436.616	164.6
437.049	244.69
437.483	157.31
437.916	169.45
438.349	234.99
438.782	205.86
439.215	176.73
439.648	125.76
440.081	251.98
440.514	237.41
440.947	215.57
441.38	196.15
441.813	298.09
442.245	193.72
442.678	184.01
443.111	152.46
443.543	162.17
443.976	203.43
444.408	215.57
444.841	256.83
445.273	140.32
445.705	251.98
446.138	176.73
446.57	196.15
447.002	249.55
447.434	300.52
447.867	184.01
448.299	247.12
448.731	217.99
449.163	198.58
449.595	256.83
450.026	261.68
450.458	315.08
450.89	208.29
451.322	230.13
451.754	176.73
452.185	213.14
452.617	251.98
453.048	295.67
453.48	244.69
453.911	366.06
454.343	322.37
454.774	271.39
455.205	283.53
455.637	298.09
456.068	315.08
456.499	259.26
456.93	264.11
457.361	225.28
457.792	268.97
458.223	307.8
458.654	317.51
459.085	254.4
459.516	380.62
459.947	329.65
460.378	271.39
460.808	239.84
461.239	210.71
461.669	259.26
462.1	205.86
462.531	208.29
462.961	215.57
463.391	249.55
463.822	249.55
464.252	220.42
464.682	254.4
465.113	288.38
465.543	142.75
465.973	210.71
466.403	312.66
466.833	312.66
467.263	268.97
467.693	234.99
468.123	244.69
468.553	288.38
468.983	329.65
469.412	237.41
469.842	278.68
470.272	290.81
470.701	210.71
471.131	174.3
471.56	220.42
471.99	205.86
472.419	210.71
472.849	181.59
473.278	157.31
473.707	239.84
474.136	251.98
474.566	239.84
474.995	198.58
475.424	193.72
475.853	305.37
476.282	237.41
476.711	281.1
477.14	230.13
477.569	234.99
477.997	256.83
478.426	179.16
478.855	222.85
479.283	196.15
479.712	264.11
480.141	271.39
480.569	237.41
480.998	232.56
481.426	193.72
481.854	307.8
482.283	217.99
482.711	210.71
483.139	237.41
483.567	181.59
483.995	184.01
484.424	215.57
484.852	208.29
485.28	201
485.708	283.53
486.135	230.13
486.563	137.9
486.991	227.7
487.419	237.41
487.847	256.83
488.274	225.28
488.702	230.13
489.129	239.84
489.557	215.57
489.984	251.98
490.412	217.99
490.839	271.39
491.266	295.67
491.694	198.58
492.121	203.43
492.548	201
492.975	208.29
493.402	164.6
493.829	193.72
494.256	186.44
494.683	176.73
495.11	167.02
495.537	285.96
495.964	157.31
496.39	116.05
496.817	113.62
497.244	259.26
497.67	157.31
498.097	137.9
498.523	128.19
498.95	302.95
499.376	201
499.803	184.01
500.229	264.11
500.655	196.15
501.081	159.74
501.508	157.31
501.934	188.87
502.36	171.88
502.786	217.99
503.212	145.18
503.638	140.32
504.064	215.57
504.489	213.14
504.915	152.46
505.341	273.82
505.767	179.16
506.192	225.28
506.618	251.98
507.043	288.38
507.469	162.17
507.894	176.73
508.32	225.28
508.745	152.46
509.17	191.3
509.596	181.59
510.021	162.17
510.446	196.15
510.871	208.29
511.296	171.88
511.721	188.87
512.146	145.18
512.571	215.57
512.996	198.58
513.421	242.27
513.845	215.57
514.27	186.44
514.695	186.44
515.119	227.7
515.544	169.45
515.969	164.6
516.393	184.01
516.817	259.26
517.242	186.44
517.666	222.85
518.09	254.4
518.515	191.3
518.939	201
519.363	429.16
519.787	254.4
520.211	208.29
520.635	201
521.059	191.3
521.483	201
521.907	261.68
522.331	222.85
522.754	237.41
523.178	176.73
523.602	179.16
524.025	193.72
524.449	213.14
524.872	176.73
525.296	196.15
525.719	154.89
526.143	181.59
526.566	164.6
526.989	196.15
527.412	196.15
527.836	208.29
528.259	203.43
528.682	261.68
529.105	227.7
529.528	171.88
529.951	244.69
530.374	188.87
530.796	225.28
531.219	184.01
531.642	249.55
532.065	193.72
532.487	188.87
532.91	181.59
533.332	176.73
533.755	116.05
534.177	188.87
534.6	227.7
535.022	174.3
535.444	179.16
535.867	159.74
536.289	174.3
536.711	227.7
537.133	181.59
537.555	251.98
537.977	205.86
538.399	164.6
538.821	254.4
539.243	201
539.665	217.99
540.086	230.13
540.508	179.16
540.93	312.66
541.351	213.14
541.773	205.86
542.195	215.57
542.616	268.97
543.037	310.23
543.459	237.41
543.88	230.13
544.301	281.1
544.723	169.45
545.144	251.98
545.565	205.86
545.986	251.98
546.407	196.15
546.828	232.56
547.249	196.15
547.67	188.87
548.091	256.83
548.512	266.54
548.932	254.4
549.353	176.73
549.774	239.84
550.194	237.41
550.615	140.32
551.035	201
551.456	188.87
551.876	145.18
552.296	147.61
552.717	259.26
553.137	196.15
553.557	167.02
553.977	196.15
554.397	130.61
554.817	234.99
555.237	307.8
555.657	237.41
556.077	208.29
556.497	225.28
556.917	188.87
557.337	193.72
557.756	208.29
558.176	217.99
558.596	266.54
559.015	181.59
559.435	232.56
559.854	169.45
560.274	234.99
560.693	193.72
561.112	268.97
561.532	130.61
561.951	266.54
562.37	305.37
562.789	198.58
563.208	125.76
563.627	247.12
564.046	186.44
564.465	227.7
564.884	203.43
565.303	174.3
565.722	201
566.14	230.13
566.559	150.03
566.978	152.46
567.396	196.15
567.815	164.6
568.233	167.02
568.652	125.76
569.07	130.61
569.489	191.3
569.907	254.4
570.325	264.11
570.743	157.31
571.161	232.56
571.58	147.61
571.998	230.13
572.416	215.57
572.833	171.88
573.251	215.57
573.669	169.45
574.087	179.16
574.505	106.34
574.922	118.48
575.34	176.73
575.758	215.57
576.175	237.41
576.593	176.73
577.01	181.59
577.428	225.28
577.845	1596.66
578.262	298.09
578.68	278.68
579.097	217.99
579.514	198.58
579.931	227.7
580.348	222.85
580.765	256.83
581.182	147.61
581.599	191.3
582.016	181.59
582.433	237.41
582.849	222.85
583.266	205.86
583.683	193.72
584.099	210.71
584.516	217.99
584.933	164.6
585.349	227.7
585.765	215.57
586.182	184.01
586.598	174.3
587.014	176.73
587.431	205.86
587.847	169.45
588.263	205.86
588.679	188.87
589.095	193.72
589.511	198.58
589.927	137.9
590.343	203.43
590.759	181.59
591.174	169.45
591.59	176.73
592.006	179.16
592.421	171.88
592.837	210.71
593.252	244.69
593.668	191.3
594.083	198.58
594.499	188.87
594.914	203.43
595.329	150.03
595.745	191.3
596.16	208.29
596.575	157.31
596.99	154.89
597.405	201
597.82	210.71
598.235	222.85
598.65	208.29
599.065	164.6
599.479	164.6
599.894	169.45
600.309	234.99
600.724	222.85
601.138	145.18
601.553	273.82
601.967	205.86
602.382	222.85
602.796	169.45
603.21	205.86
603.625	215.57
604.039	133.04
604.453	184.01
604.867	167.02
605.281	225.28
605.695	167.02
606.109	120.91
606.523	176.73
606.937	213.14
607.351	334.5
607.765	208.29
608.178	181.59
608.592	217.99
609.006	186.44
609.419	118.48
609.833	307.8
610.246	186.44
610.66	217.99
611.073	150.03
611.487	196.15
611.9	220.42
612.313	159.74
612.726	244.69
613.139	251.98
613.553	217.99
613.966	234.99
614.379	254.4
614.792	181.59
615.204	239.84
615.617	293.24
616.03	208.29
616.443	142.75
616.856	222.85
617.268	167.02
617.681	167.02
618.093	208.29
618.506	193.72
618.918	220.42
619.331	203.43
619.743	154.89
620.155	159.74
620.568	167.02
620.98	193.72
621.392	130.61
621.804	222.85
622.216	162.17
622.628	174.3
623.04	205.86
623.452	254.4
623.864	193.72
624.276	176.73
624.687	174.3
625.099	179.16
625.511	196.15
625.922	215.57
626.334	174.3
626.745	113.62
627.157	130.61
627.568	215.57
627.979	254.4
628.391	184.01
628.802	145.18
629.213	203.43
629.624	237.41
630.035	196.15
630.446	217.99
630.857	191.3
631.268	174.3
631.679	179.16
632.09	181.59
632.501	181.59
632.912	227.7
633.322	254.4
633.733	232.56
634.144	205.86
634.554	152.46
634.965	213.14
635.375	181.59
635.785	259.26
636.196	220.42
636.606	247.12
637.016	147.61
637.427	113.62
637.837	201
638.247	188.87
638.657	118.48
639.067	174.3
639.477	145.18
639.887	205.86
640.297	152.46
640.706	137.9
641.116	203.43
641.526	167.02
641.935	181.59
642.345	205.86
642.755	111.2
643.164	184.01
643.573	205.86
643.983	193.72
644.392	210.71
644.801	123.33
645.211	140.32
645.62	150.03
646.029	213.14
646.438	196.15
646.847	196.15
647.256	196.15
647.665	157.31
648.074	232.56
648.483	237.41
648.892	213.14
649.3	162.17
649.709	154.89
650.118	186.44
650.526	176.73
650.935	201
651.343	162.17
651.752	167.02
652.16	227.7
652.568	167.02
652.977	167.02
653.385	225.28
653.793	164.6
654.201	273.82
654.609	123.33
655.017	171.88
655.425	174.3
655.833	162.17
656.241	234.99
656.649	176.73
657.057	220.42
657.464	142.75
657.872	108.77
658.28	174.3
658.687	208.29
659.095	215.57
659.502	208.29
659.91	159.74
660.317	201
660.724	145.18
661.132	191.3
661.539	208.29
661.946	213.14
662.353	181.59
662.76	205.86
663.167	184.01
663.574	94.21
663.981	128.19
664.388	171.88
664.795	242.27
665.202	191.3
665.608	176.73
666.015	140.32
666.422	215.57
666.828	142.75
667.235	251.98
667.641	167.02
668.047	181.59
668.454	157.31
668.86	157.31
669.266	220.42
669.673	128.19
670.079	205.86
670.485	133.04
670.891	244.69
671.297	179.16
671.703	208.29
672.109	234.99
672.515	283.53
672.92	101.49
673.326	242.27
673.732	222.85
674.138	169.45
674.543	184.01
674.949	205.86
675.354	188.87
675.76	164.6
676.165	154.89
676.57	167.02
676.976	184.01
677.381	196.15
677.786	196.15
678.191	196.15
678.596	133.04
679.001	123.33
679.406	249.55
679.811	247.12
680.216	179.16
680.621	215.57
681.026	198.58
681.43	137.9
681.835	123.33
682.24	174.3
682.644	167.02
683.049	179.16
683.453	159.74
683.858	154.89
684.262	106.34
684.667	135.47
685.071	152.46
685.475	159.74
685.879	196.15
686.283	150.03
686.687	142.75
687.091	145.18
687.495	116.05
687.899	140.32
688.303	164.6
688.707	145.18
689.111	179.16
689.514	154.89
689.918	237.41
690.322	169.45
690.725	191.3
691.129	164.6
691.532	222.85
691.936	137.9
692.339	184.01
692.742	159.74
693.146	176.73
693.549	150.03
693.952	188.87
694.355	181.59
694.758	225.28
695.161	147.61
695.564	184.01
695.967	203.43
696.37	193.72
696.773	179.16
697.175	242.27
697.578	220.42
697.981	174.3
698.383	130.61
698.786	268.97
699.188	196.15
699.591	210.71
699.993	264.11
700.395	164.6
700.798	181.59
701.2	188.87
701.602	203.43
702.004	186.44
702.406	237.41
702.808	179.16
703.21	208.29
703.612	239.84
704.014	239.84
704.416	125.76
704.818	271.39
705.219	217.99
705.621	203.43
706.023	244.69
706.424	234.99
706.826	239.84
707.227	232.56
707.629	167.02
708.03	234.99
708.431	247.12
708.832	247.12
709.234	242.27
709.635	332.07
710.036	290.81
710.437	307.8
710.838	254.4
711.239	227.7
711.64	237.41
712.041	239.84
712.441	290.81
712.842	264.11
713.243	295.67
713.643	208.29
714.044	208.29
714.445	247.12
714.845	312.66
715.246	344.21
715.646	302.95
716.046	239.84
716.447	312.66
716.847	278.68
717.247	302.95
717.647	312.66
718.047	302.95
718.447	324.79
718.847	356.35
719.247	375.76
719.647	392.75
720.047	453.44
720.446	375.76
720.846	329.65
721.246	412.17
721.645	378.19
722.045	402.46
722.444	373.34
722.844	368.48
723.243	414.6
723.643	451.01
724.042	404.89
724.441	414.6
724.84	453.44
725.24	441.3
725.639	366.06
726.038	540.82
726.437	453.44
726.836	468
727.234	518.97
727.633	601.5
728.032	548.1
728.431	526.25
728.83	535.96
729.228	601.5
729.627	676.74
730.025	533.53
730.424	637.9
730.822	739.85
731.22	751.98
731.619	783.54
732.017	832.08
732.415	870.92
732.813	900.04
733.212	1033.54
733.61	1137.91
734.008	1133.06
734.406	1179.17
734.803	1281.12
735.201	1344.23
735.599	1448.6
735.997	1516.56
736.395	1555.39
736.792	1705.88
737.19	1754.43
737.587	1771.42
737.985	1914.62
738.382	2002
738.78	2084.53
739.177	2186.47
739.574	2455.89
739.971	2489.87
740.369	2470.46
740.766	2701.04
741.163	2909.78
741.56	2822.4
741.957	2912.21
742.354	3120.95
742.751	3485.04
743.147	3373.38
743.544	3543.29
743.941	3822.42
744.338	3938.93
744.734	4053.01
745.131	4164.66
745.527	4555.44
745.924	4574.86
746.32	5048.17
746.716	5164.67
747.113	5368.56
747.509	5531.18
747.905	5914.69
748.301	6315.18
748.697	6436.54
749.093	6686.54
749.489	7186.55
749.885	7346.75
750.281	7727.82
750.677	7754.52
751.073	8283.65
751.468	8824.92
751.864	8871.04
752.26	9147.75
752.655	9800.67
753.051	10240
753.446	10351.65
753.842	10790.97
754.237	11446.32
754.632	11429.33
755.028	11259.43
755.423	11718.17
755.818	12031.29
756.213	12150.22
756.608	12446.34
757.003	12985.18
757.398	13456.06
757.793	12808
758.188	13123.54
758.583	13958.5
758.977	14424.53
759.372	14203.65
759.767	14997.35
760.161	16342.03
760.556	17045.93
760.95	16985.25
761.345	17740.11
761.739	19351.79
762.133	18990.13
762.527	19662.47
762.922	20223.16
763.316	22058.14
763.71	21448.91
764.104	21735.32
764.498	22740.19
764.892	23468.36
765.286	23480.49
765.68	23647.97
766.073	25024.21
766.467	25327.61
766.861	25152.85
767.255	25968.4
767.648	27327.64
768.042	28526.69
768.435	27890.76
768.829	27839.78
769.222	28978.15
769.615	30048.56
770.008	29080.09
770.402	29060.68
770.795	30121.37
771.188	30621.38
771.581	29825.25
771.974	29300.97
772.367	30157.78
772.76	30492.74
773.153	29140.77
773.545	29366.51
773.938	31043.72
774.331	31165.08
774.724	30337.4
775.116	32196.65
775.509	34560.76
775.901	34847.17
776.294	34216.1
776.686	34898.15
777.078	37140.9
777.471	37672.46
777.863	37988
778.255	38274.41
778.647	41944.37
779.039	41492.91
779.431	39133.65
779.823	38827.82
780.215	40910.38
780.607	40937.07
780.999	40849.69
781.39	40541.44
781.782	42500.21
782.174	43289.05
782.565	42393.41
782.957	41269.6
783.348	44007.51
783.74	44854.61
784.131	42837.59
784.522	42216.22
784.914	42854.58
785.305	44352.18
785.696	42944.39
786.087	40718.62
786.478	41393.39
786.869	41682.23
787.26	40344.83
787.651	38128.78
788.042	37679.74
788.433	38303.54
788.823	37165.17
789.214	34949.12
789.605	34716.1
789.995	35536.51
790.386	34745.23
790.776	33669.97
791.167	32844.72
791.557	34808.34
791.948	35818.06
792.338	34689.4
792.728	34580.18
793.118	36677.3
793.508	37456.44
793.898	36058.36
794.288	34764.65
794.678	35895.73
795.068	38424.9
795.458	36805.94
795.848	35009.8
796.238	35752.53
796.627	36170.01
797.017	36174.86
797.406	34504.94
797.796	34349.59
798.185	36543.8
798.575	36796.23
798.964	35097.18
799.354	34213.67
799.743	35373.88
800.132	37723.43
800.521	35987.97
800.91	34211.24
801.299	34218.52
801.688	36504.97
802.077	35553.5
802.466	34347.17
802.855	33548.61
803.244	33990.36
803.633	34366.58
804.021	32453.93
804.41	30990.32
804.799	31813.15
805.187	32009.75
805.576	30276.71
805.964	28203.87
806.352	27441.72
806.741	29478.16
807.129	28446.59
807.517	26541.22
807.905	26427.14
808.293	27759.69
808.681	28898.05
809.069	27487.84
809.457	27135.89
809.845	28055.81
810.233	29373.79
810.621	29216.02
811.009	26815.5
811.396	27742.69
811.784	29082.52
812.171	29504.86
812.559	27609.2
812.946	26184.42
813.334	26946.57
813.721	27577.64
814.108	25900.43
814.496	24330.02
814.883	24410.12
815.27	26643.16
815.657	26419.86
816.044	25390.72
816.431	24240.21
816.818	25135.86
817.205	26254.81
817.592	24805.76
817.979	23208.64
818.365	22662.52
818.752	23101.85
819.139	23111.55
819.525	21696.48
819.912	20470.74
820.298	20650.35
820.685	21174.63
821.071	19995
821.457	18769.25
821.843	17443.99
822.23	18259.54
822.616	18477.99
823.002	16849.32
823.388	15366.29
823.774	15570.18
824.16	15689.11
824.546	15502.21
824.931	13946.36
825.317	13344.41
825.703	14225.49
826.089	14397.83
826.474	13808.01
826.86	12866.25
827.245	12703.63
827.631	13516.75
828.016	13545.87
828.401	12108.96
828.787	11613.8
829.172	11817.69
829.557	12305.56
829.942	12019.15
830.327	10849.23
830.712	10555.53
831.097	10844.37
831.482	11101.66
831.867	10344.37
832.252	9594.35
832.636	9706.01
833.021	9900.18
833.406	10004.55
833.79	9327.36
834.175	8650.16
834.559	8778.81
834.944	8997.26
835.328	8965.7
835.713	8281.23
836.097	7596.75
836.481	7611.31
836.865	7878.31
837.249	7630.73
837.633	6926.84
838.017	6494.79
838.401	6567.61
838.785	6611.3
839.169	6249.64
839.553	5701.09
839.937	5453.51
840.32	5540.89
840.704	5385.55
841.087	5278.75
841.471	4718.06
841.854	4521.46
842.238	4570
842.621	4662.24
843.004	4380.68
843.388	4072.42
843.771	4043.3
844.154	4218.06
844.537	4133.1
844.92	4048.15
845.303	3579.7
845.686	3565.13
846.069	3873.39
846.452	4031.16
846.834	3528.73
847.217	3431.64
847.6	3397.66
847.982	3438.92
848.365	3477.75
848.748	3135.52
849.13	2982.6
849.512	2921.92
849.895	3050.56
850.277	2953.47
850.659	2766.58
851.041	2691.33
851.423	2739.88
851.806	2817.55
852.188	2788.42
852.57	2453.47
852.951	2346.67
853.333	2259.29
853.715	2463.18
854.097	2468.03
854.479	2145.21
854.86	1960.74
855.242	2006.86
855.623	2154.92
856.005	2028.7
856.386	1953.46
856.768	1698.6
857.149	1718.02
857.53	1819.96
857.911	1873.36
858.292	1603.94
858.674	1502
859.055	1363.64
859.436	1470.44
859.817	1390.34
860.197	1317.53
860.578	1196.17
860.959	1118.49
861.34	1256.85
861.72	1198.59
862.101	1225.29
862.482	1077.23
862.862	955.87
863.243	1018.98
863.623	1084.51
864.003	1043.25
864.384	965.58
864.764	885.48
865.144	878.2
865.524	1023.83
865.904	936.45
866.284	861.21
866.664	781.11
867.044	856.35
867.424	817.52
867.804	819.95
868.183	701.01
868.563	676.74
868.943	715.58
869.322	730.14
869.702	645.19
870.081	611.2
870.461	596.64
870.84	567.51
871.22	628.2
871.599	572.37
871.978	616.06
872.357	572.37
872.736	480.13
873.115	392.75
873.494	465.57
873.873	540.82
874.252	484.99
874.631	349.06
875.01	414.6
875.388	434.02
875.767	434.02
876.146	400.04
876.524	373.34
876.903	353.92
877.281	353.92
877.66	387.9
878.038	329.65
878.416	251.98
878.794	295.67
879.173	239.84
879.551	259.26
879.929	281.1
880.307	361.2
880.685	339.36
881.063	244.69
881.441	273.82
881.818	249.55
882.196	273.82
882.574	276.25
882.951	305.37
883.329	266.54
883.707	259.26
884.084	285.96
884.461	305.37
884.839	259.26
885.216	234.99
885.593	281.1
885.971	203.43
886.348	215.57
886.725	217.99
887.102	256.83
887.479	164.6
887.856	237.41
888.233	222.85
888.609	247.12
888.986	152.46
889.363	215.57
889.74	210.71
890.116	264.11
890.493	152.46
890.869	213.14
891.246	234.99
891.622	213.14
891.998	210.71
892.375	196.15
892.751	201
893.127	157.31
893.503	193.72
893.879	174.3
894.255	208.29
894.631	208.29
895.007	191.3
895.383	157.31
895.759	137.9
896.134	164.6
896.51	193.72
896.886	196.15
897.261	157.31
897.637	208.29
898.012	159.74
898.388	111.2
898.763	179.16
899.138	184.01
899.514	123.33
899.889	201
900.264	120.91
900.639	135.47
901.014	164.6
901.389	184.01
901.764	157.31
902.139	208.29
902.513	188.87
902.888	152.46
903.263	174.3
903.638	196.15
904.012	137.9
904.387	99.06
904.761	186.44
905.136	145.18
905.51	230.13
905.884	123.33
906.259	62.65
906.633	184.01
907.007	135.47
907.381	225.28
907.755	140.32
908.129	186.44
908.503	174.3
908.877	159.74
909.251	179.16
909.624	162.17
909.998	159.74
910.372	135.47
910.745	140.32
911.119	140.32
911.492	150.03
911.866	176.73
912.239	142.75
912.612	106.34
912.986	169.45
913.359	176.73
913.732	120.91
914.105	230.13
914.478	171.88
914.851	145.18
915.224	201
915.597	167.02
915.97	164.6
916.343	164.6
916.715	116.05
917.088	215.57
917.461	118.48
917.833	201
918.206	239.84
918.578	137.9
918.951	101.49
919.323	113.62
919.695	179.16
920.067	181.59
920.44	186.44
920.812	94.21
921.184	191.3
921.556	140.32
921.928	140.32
922.3	128.19
922.672	140.32
923.043	179.16
923.415	171.88
923.787	179.16
924.158	196.15
924.53	99.06
924.901	222.85
925.273	167.02
925.644	123.33
926.016	164.6
926.387	135.47
926.758	222.85
927.129	103.92
927.5	147.61
927.872	142.75
928.243	145.18
928.613	118.48
928.984	159.74
929.355	174.3
929.726	135.47
930.097	159.74
930.467	128.19
930.838	154.89
931.209	201
931.579	145.18
931.95	135.47
932.32	154.89
932.69	196.15
933.061	196.15
933.431	154.89
933.801	196.15
934.171	184.01
934.541	244.69
934.911	205.86
935.281	186.44
935.651	128.19
936.021	179.16
936.391	174.3
936.761	96.63
937.13	111.2
937.5	164.6
937.87	152.46
938.239	137.9
938.609	217.99
938.978	179.16
939.347	135.47
939.717	89.35
940.086	145.18
940.455	116.05
940.824	201
941.193	230.13
941.562	176.73
941.931	205.86
942.3	167.02
942.669	152.46
943.038	101.49
943.407	118.48
943.775	256.83
944.144	167.02
944.513	120.91
944.881	162.17
945.25	220.42
945.618	198.58
945.986	157.31
946.355	159.74
946.723	157.31
947.091	113.62
947.459	123.33
947.827	234.99
948.195	234.99
948.563	201
948.931	125.76
949.299	116.05
949.667	157.31
950.035	72.36
950.402	174.3
950.77	118.48
951.138	167.02
951.505	169.45
951.873	147.61
952.24	123.33
952.607	145.18
952.975	128.19
953.342	137.9
953.709	162.17
954.076	91.78
954.443	164.6
954.81	210.71
955.177	220.42
955.544	169.45
955.911	179.16
956.278	247.12
956.645	118.48
957.012	184.01
957.378	193.72
957.745	137.9
958.111	184.01
958.478	174.3
958.844	201
959.211	137.9
959.577	205.86
959.943	227.7
960.309	210.71
960.675	186.44
961.042	120.91
961.408	208.29
961.774	198.58
962.139	96.63
962.505	159.74
962.871	174.3
963.237	113.62
963.603	140.32
963.968	147.61
964.334	181.59
964.699	171.88
965.065	201
965.43	167.02
965.796	205.86
966.161	140.32
966.526	188.87
966.891	174.3
967.256	116.05
967.622	128.19
967.987	215.57
968.352	208.29
968.716	152.46
969.081	174.3
969.446	145.18
969.811	157.31
970.176	181.59
970.54	120.91
970.905	137.9
971.269	164.6
971.634	169.45
971.998	184.01
972.363	186.44
972.727	150.03
973.091	193.72
973.455	167.02
973.819	222.85
974.183	128.19
974.547	135.47
974.911	186.44
975.275	123.33
975.639	164.6
976.003	201
976.367	157.31
976.73	108.77
977.094	196.15
977.458	188.87
977.821	111.2
978.185	120.91
978.548	196.15
978.911	162.17
979.275	186.44
979.638	106.34
980.001	140.32
980.364	174.3
980.727	181.59
981.09	171.88
981.453	176.73
981.816	96.63
982.179	215.57
982.542	171.88
982.905	133.04
983.267	118.48
983.63	147.61
983.992	188.87
984.355	201
984.717	130.61
985.08	162.17
985.442	152.46
985.804	174.3
986.167	259.26
986.529	157.31
986.891	171.88
987.253	137.9
987.615	159.74
987.977	179.16
988.339	184.01
988.701	157.31
989.062	186.44
989.424	123.33
989.786	191.3
990.147	157.31
990.509	162.17
990.87	118.48
991.232	171.88
991.593	147.61
991.955	188.87
992.316	193.72
992.677	145.18
993.038	91.78
993.399	157.31
993.76	142.75
994.121	167.02
994.482	65.08
994.843	167.02
995.204	191.3
995.565	191.3
995.926	91.78
996.286	99.06
996.647	89.35
997.007	140.32
997.368	133.04
997.728	167.02
998.089	196.15
998.449	210.71
998.809	106.34
999.169	203.43
999.53	213.14
999.89	150.03
1000.25	186.44
1000.61	103.92
1000.97	193.72
1001.329	213.14
1001.689	154.89
1002.049	123.33
1002.409	142.75
1002.768	106.34
1003.128	193.72
1003.487	106.34
1003.847	162.17
1004.206	128.19
1004.566	133.04
1004.925	150.03
1005.284	118.48
1005.643	116.05
1006.003	86.92
1006.362	96.63
1006.721	217.99
1007.08	111.2
1007.438	181.59
1007.797	174.3
1008.156	147.61
1008.515	157.31
1008.874	205.86
1009.232	203.43
1009.591	128.19
1009.949	113.62
1010.308	210.71
1010.666	188.87
1011.024	171.88
1011.383	230.13
1011.741	137.9
1012.099	154.89
1012.457	162.17
1012.815	162.17
1013.173	159.74
1013.531	186.44
1013.889	135.47
1014.247	251.98
1014.605	150.03
1014.962	208.29
1015.32	154.89
1015.678	210.71
1016.035	184.01
1016.393	140.32
1016.75	147.61
1017.107	167.02
1017.465	125.76
1017.822	205.86
1018.179	150.03
1018.536	118.48
1018.894	150.03
1019.251	193.72
1019.608	179.16
1019.964	137.9
1020.321	113.62
1020.678	113.62
1021.035	94.21
1021.392	135.47
1021.748	171.88
1022.105	118.48
1022.461	171.88
1022.818	147.61
1023.174	150.03
1023.531	201
1023.887	205.86
1024.243	171.88
1024.599	84.5
1024.955	201
1025.311	162.17
1025.667	147.61
1026.023	123.33
1026.379	142.75
1026.735	137.9
1027.091	164.6
1027.447	162.17
