189.514	106.19
189.973	106.19
190.431	106.19
190.889	-27.31
191.348	16.38
191.806	-32.16
192.264	28.52
192.722	-27.31
193.18	-29.73
193.638	-54.01
194.096	-41.87
194.554	4.25
195.012	1.82
195.47	-37.02
195.928	13.96
196.385	-5.46
196.843	-0.61
197.301	-17.6
197.758	-15.17
198.216	96.48
198.674	11.53
199.131	72.21
199.589	62.5
200.046	28.52
200.503	28.52
200.961	81.92
201.418	94.05
201.875	169.3
202.332	47.94
202.79	125.61
203.247	118.33
203.704	176.58
204.161	174.15
204.618	193.57
205.075	166.87
205.532	212.99
205.989	164.44
206.445	98.91
206.902	115.9
207.359	96.48
207.816	166.87
208.272	229.98
208.729	200.85
209.185	198.43
209.642	239.69
210.098	157.16
210.555	137.74
211.011	244.54
211.467	169.3
211.924	159.59
212.38	183.86
212.836	210.56
213.292	113.47
213.748	149.88
214.204	193.57
214.66	120.75
215.116	239.69
215.572	152.31
216.028	166.87
216.484	183.86
216.94	232.41
217.396	222.7
217.851	186.29
218.307	98.91
218.763	249.4
219.218	237.26
219.674	137.74
220.129	130.46
220.585	115.9
221.04	208.13
221.496	162.02
221.951	191.14
222.406	145.03
222.861	193.57
223.317	222.7
223.772	188.72
224.227	193.57
224.682	108.62
225.137	162.02
225.592	98.91
226.047	113.47
226.502	179.01
226.957	137.74
227.411	152.31
227.866	149.88
228.321	166.87
228.776	169.3
229.23	145.03
229.685	154.74
230.139	227.55
230.594	154.74
231.048	120.75
231.503	125.61
231.957	208.13
232.411	77.06
232.865	164.44
233.32	181.43
233.774	164.44
234.228	171.73
234.682	98.91
235.136	132.89
235.59	164.44
236.044	166.87
236.498	200.85
236.952	203.28
237.406	191.14
237.86	174.15
238.313	242.12
238.767	113.47
239.221	171.73
239.674	174.15
240.128	171.73
240.581	169.3
241.035	212.99
241.488	157.16
241.942	94.05
242.395	149.88
242.848	186.29
243.301	183.86
243.755	227.55
244.208	106.19
244.661	142.6
245.114	234.83
245.567	186.29
246.02	149.88
246.473	186.29
246.926	174.15
247.379	181.43
247.832	193.57
248.284	96.48
248.737	186.29
249.19	157.16
249.642	188.72
250.095	174.15
250.547	147.45
251	174.15
251.452	198.43
251.905	232.41
252.357	145.03
252.81	157.16
253.262	242.12
253.714	149.88
254.166	208.13
254.618	212.99
255.07	179.01
255.523	220.27
255.975	251.82
256.427	103.76
256.878	106.19
257.33	154.74
257.782	128.04
258.234	176.58
258.686	200.85
259.137	86.77
259.589	125.61
260.041	98.91
260.492	203.28
260.944	251.82
261.395	123.18
261.847	149.88
262.298	154.74
262.749	181.43
263.201	152.31
263.652	176.58
264.103	225.12
264.554	181.43
265.005	135.32
265.457	171.73
265.908	164.44
266.359	169.3
266.809	147.45
267.26	191.14
267.711	249.4
268.162	157.16
268.613	101.34
269.064	142.6
269.514	115.9
269.965	125.61
270.415	210.56
270.866	212.99
271.316	174.15
271.767	171.73
272.217	234.83
272.668	212.99
273.118	222.7
273.568	147.45
274.019	145.03
274.469	174.15
274.919	225.12
275.369	130.46
275.819	198.43
276.269	188.72
276.719	154.74
277.169	196
277.619	181.43
278.069	166.87
278.518	128.04
278.968	217.84
279.418	157.16
279.867	181.43
280.317	128.04
280.767	181.43
281.216	130.46
281.666	157.16
282.115	171.73
282.564	157.16
283.014	145.03
283.463	164.44
283.912	159.59
284.361	246.97
284.811	196
285.26	164.44
285.709	181.43
286.158	268.81
286.607	237.26
287.056	212.99
287.505	198.43
287.953	176.58
288.402	89.2
288.851	162.02
289.3	217.84
289.748	132.89
290.197	171.73
290.646	205.71
291.094	154.74
291.543	96.48
291.991	181.43
292.439	166.87
292.888	225.12
293.336	147.45
293.784	174.15
294.233	115.9
294.681	200.85
295.129	147.45
295.577	159.59
296.025	205.71
296.473	171.73
296.921	174.15
297.369	186.29
297.817	186.29
298.264	159.59
298.712	181.43
299.16	217.84
299.608	166.87
300.055	191.14
300.503	181.43
300.95	215.42
301.398	200.85
301.845	174.15
302.293	186.29
302.74	188.72
303.187	183.86
303.635	169.3
304.082	118.33
304.529	196
304.976	135.32
305.423	183.86
305.87	142.6
306.317	130.46
306.764	200.85
307.211	111.05
307.658	169.3
308.105	222.7
308.552	183.86
308.998	179.01
309.445	154.74
309.892	203.28
310.338	196
310.785	152.31
311.231	181.43
311.678	181.43
312.124	210.56
312.571	152.31
313.017	210.56
313.463	130.46
313.909	196
314.356	186.29
314.802	186.29
315.248	210.56
315.694	171.73
316.14	183.86
316.586	166.87
317.032	169.3
317.478	244.54
317.923	220.27
318.369	183.86
318.815	171.73
319.261	174.15
319.706	145.03
320.152	169.3
320.597	159.59
321.043	176.58
321.488	120.75
321.934	169.3
322.379	198.43
322.824	128.04
323.27	145.03
323.715	115.9
324.16	123.18
324.605	159.59
325.05	111.05
325.495	157.16
325.94	176.58
326.385	210.56
326.83	174.15
327.275	140.17
327.72	212.99
328.165	193.57
328.61	120.75
329.054	212.99
329.499	193.57
329.943	215.42
330.388	198.43
330.832	186.29
331.277	210.56
331.721	176.58
332.166	181.43
332.61	169.3
333.054	159.59
333.499	115.9
333.943	232.41
334.387	183.86
334.831	239.69
335.275	200.85
335.719	261.53
336.163	188.72
336.607	181.43
337.051	193.57
337.495	118.33
337.938	188.72
338.382	179.01
338.826	164.44
339.269	183.86
339.713	162.02
340.157	140.17
340.6	276.1
341.044	259.11
341.487	145.03
341.93	179.01
342.374	212.99
342.817	128.04
343.26	244.54
343.703	181.43
344.146	115.9
344.59	268.81
345.033	130.46
345.476	162.02
345.919	135.32
346.361	77.06
346.804	183.86
347.247	193.57
347.69	198.43
348.133	145.03
348.575	162.02
349.018	215.42
349.461	186.29
349.903	188.72
350.346	198.43
350.788	203.28
351.23	140.17
351.673	118.33
352.115	159.59
352.557	149.88
353	225.12
353.442	200.85
353.884	208.13
354.326	242.12
354.768	135.32
355.21	142.6
355.652	198.43
356.094	198.43
356.536	149.88
356.978	137.74
357.419	166.87
357.861	203.28
358.303	154.74
358.744	193.57
359.186	164.44
359.627	147.45
360.069	159.59
360.51	154.74
360.952	229.98
361.393	111.05
361.834	128.04
362.276	154.74
362.717	196
363.158	174.15
363.599	164.44
364.04	147.45
364.481	191.14
364.922	181.43
365.363	142.6
365.804	196
366.245	157.16
366.686	79.49
367.126	159.59
367.567	229.98
368.008	179.01
368.448	115.9
368.889	188.72
369.33	140.17
369.77	198.43
370.21	113.47
370.651	142.6
371.091	159.59
371.531	215.42
371.972	111.05
372.412	205.71
372.852	217.84
373.292	137.74
373.732	198.43
374.172	132.89
374.612	191.14
375.052	162.02
375.492	208.13
375.932	169.3
376.372	246.97
376.811	145.03
377.251	130.46
377.691	130.46
378.13	164.44
378.57	196
379.009	154.74
379.449	181.43
379.888	183.86
380.328	152.31
380.767	157.16
381.206	174.15
381.645	115.9
382.085	149.88
382.524	118.33
382.963	152.31
383.402	137.74
383.841	166.87
384.28	169.3
384.719	217.84
385.158	171.73
385.596	145.03
386.035	191.14
386.474	169.3
386.913	212.99
387.351	166.87
387.79	188.72
388.228	130.46
388.667	179.01
389.105	251.82
389.544	196
389.982	183.86
390.42	225.12
390.859	205.71
391.297	162.02
391.735	179.01
392.173	128.04
392.611	145.03
393.049	96.48
393.487	94.05
393.925	154.74
394.363	176.58
394.801	157.16
395.239	215.42
395.676	229.98
396.114	198.43
396.552	135.32
396.989	103.76
397.427	145.03
397.864	171.73
398.302	147.45
398.739	188.72
399.177	157.16
399.614	162.02
400.051	222.7
400.488	200.85
400.926	123.18
401.363	164.44
401.8	166.87
402.237	251.82
402.674	142.6
403.111	115.9
403.548	186.29
403.985	191.14
404.421	203.28
404.858	210.56
405.295	111.05
405.732	142.6
406.168	159.59
406.605	215.42
407.041	176.58
407.478	125.61
407.914	130.46
408.351	140.17
408.787	179.01
409.223	171.73
409.66	154.74
410.096	135.32
410.532	157.16
410.968	147.45
411.404	120.75
411.84	186.29
412.276	174.15
412.712	200.85
413.148	162.02
413.584	128.04
414.02	179.01
414.455	210.56
414.891	193.57
415.327	188.72
415.762	159.59
416.198	142.6
416.633	183.86
417.069	145.03
417.504	120.75
417.94	183.86
418.375	135.32
418.81	179.01
419.245	183.86
419.681	135.32
420.116	227.55
420.551	118.33
420.986	225.12
421.421	154.74
421.856	157.16
422.291	208.13
422.726	113.47
423.16	191.14
423.595	157.16
424.03	181.43
424.464	203.28
424.899	188.72
425.334	212.99
425.768	239.69
426.203	142.6
426.637	191.14
427.071	232.41
427.506	198.43
427.94	198.43
428.374	210.56
428.809	137.74
429.243	176.58
429.677	154.74
430.111	169.3
430.545	244.54
430.979	171.73
431.413	125.61
431.847	137.74
432.28	147.45
432.714	171.73
433.148	137.74
433.582	234.83
434.015	142.6
434.449	244.54
434.882	263.96
435.316	196
435.749	152.31
436.183	205.71
436.616	183.86
437.049	205.71
437.483	203.28
437.916	273.67
438.349	242.12
438.782	225.12
439.215	176.58
439.648	225.12
440.081	244.54
440.514	210.56
440.947	142.6
441.38	103.76
441.813	263.96
442.245	266.39
442.678	125.61
443.111	225.12
443.543	249.4
443.976	135.32
444.408	188.72
444.841	249.4
445.273	212.99
445.705	234.83
446.138	232.41
446.57	217.84
447.002	259.11
447.434	261.53
447.867	232.41
448.299	188.72
448.731	208.13
449.163	263.96
449.595	222.7
450.026	237.26
450.458	208.13
450.89	222.7
451.322	229.98
451.754	203.28
452.185	217.84
452.617	251.82
453.048	203.28
453.48	278.52
453.911	322.21
454.343	285.81
454.774	263.96
455.205	263.96
455.637	285.81
456.068	312.5
456.499	208.13
456.93	276.1
457.361	283.38
457.792	242.12
458.223	295.51
458.654	307.65
459.085	300.37
459.516	322.21
459.947	290.66
460.378	261.53
460.808	205.71
461.239	271.24
461.669	297.94
462.1	273.67
462.531	229.98
462.961	227.55
463.391	297.94
463.822	249.4
464.252	261.53
464.682	322.21
465.113	193.57
465.543	254.25
465.973	300.37
466.403	317.36
466.833	261.53
467.263	268.81
467.693	234.83
468.123	266.39
468.553	249.4
468.983	319.79
469.412	237.26
469.842	271.24
470.272	193.57
470.701	176.58
471.131	256.68
471.56	193.57
471.99	149.88
472.419	237.26
472.849	215.42
473.278	186.29
473.707	254.25
474.136	208.13
474.566	283.38
474.995	208.13
475.424	242.12
475.853	196
476.282	205.71
476.711	254.25
477.14	266.39
477.569	215.42
477.997	232.41
478.426	261.53
478.855	205.71
479.283	232.41
479.712	329.5
480.141	193.57
480.569	234.83
480.998	183.86
481.426	140.17
481.854	193.57
482.283	244.54
482.711	188.72
483.139	176.58
483.567	210.56
483.995	171.73
484.424	215.42
484.852	232.41
485.28	203.28
485.708	200.85
486.135	225.12
486.563	210.56
486.991	232.41
487.419	193.57
487.847	276.1
488.274	249.4
488.702	154.74
489.129	208.13
489.557	171.73
489.984	249.4
490.412	162.02
490.839	251.82
491.266	191.14
491.694	222.7
492.121	234.83
492.548	169.3
492.975	220.27
493.402	283.38
493.829	222.7
494.256	290.66
494.683	193.57
495.11	159.59
495.537	234.83
495.964	186.29
496.39	203.28
496.817	220.27
497.244	232.41
497.67	193.57
498.097	159.59
498.523	162.02
498.95	162.02
499.376	193.57
499.803	154.74
500.229	222.7
500.655	179.01
501.081	193.57
501.508	234.83
501.934	183.86
502.36	242.12
502.786	198.43
503.212	246.97
503.638	152.31
504.064	227.55
504.489	128.04
504.915	212.99
505.341	159.59
505.767	244.54
506.192	244.54
506.618	254.25
507.043	251.82
507.469	237.26
507.894	200.85
508.32	130.46
508.745	212.99
509.17	179.01
509.596	162.02
510.021	176.58
510.446	137.74
510.871	188.72
511.296	237.26
511.721	171.73
512.146	181.43
512.571	203.28
512.996	220.27
513.421	186.29
513.845	220.27
514.27	259.11
514.695	174.15
515.119	196
515.544	140.17
515.969	147.45
516.393	193.57
516.817	198.43
517.242	263.96
517.666	183.86
518.09	217.84
518.515	147.45
518.939	210.56
519.363	397.46
519.787	229.98
520.211	210.56
520.635	259.11
521.059	179.01
521.483	196
521.907	174.15
522.331	171.73
522.754	244.54
523.178	186.29
523.602	212.99
524.025	166.87
524.449	210.56
524.872	237.26
525.296	176.58
525.719	181.43
526.143	276.1
526.566	215.42
526.989	217.84
527.412	234.83
527.836	293.09
528.259	239.69
528.682	237.26
529.105	222.7
529.528	164.44
529.951	203.28
530.374	179.01
530.796	171.73
531.219	266.39
531.642	205.71
532.065	159.59
532.487	244.54
532.91	179.01
533.332	273.67
533.755	191.14
534.177	225.12
534.6	200.85
535.022	246.97
535.444	186.29
535.867	188.72
536.289	181.43
536.711	263.96
537.133	217.84
537.555	174.15
537.977	179.01
538.399	142.6
538.821	181.43
539.243	220.27
539.665	205.71
540.086	222.7
540.508	205.71
540.93	237.26
541.351	268.81
541.773	234.83
542.195	159.59
542.616	251.82
543.037	169.3
543.459	193.57
543.88	232.41
544.301	205.71
544.723	217.84
545.144	300.37
545.565	217.84
545.986	246.97
546.407	212.99
546.828	198.43
547.249	176.58
547.67	229.98
548.091	166.87
548.512	181.43
548.932	215.42
549.353	198.43
549.774	149.88
550.194	254.25
550.615	225.12
551.035	254.25
551.456	205.71
551.876	268.81
552.296	249.4
552.717	225.12
553.137	244.54
553.557	191.14
553.977	154.74
554.397	169.3
554.817	120.75
555.237	203.28
555.657	212.99
556.077	169.3
556.497	220.27
556.917	234.83
557.337	169.3
557.756	198.43
558.176	217.84
558.596	232.41
559.015	229.98
559.435	242.12
559.854	200.85
560.274	229.98
560.693	266.39
561.112	140.17
561.532	239.69
561.951	234.83
562.37	217.84
562.789	179.01
563.208	205.71
563.627	256.68
564.046	193.57
564.465	196
564.884	135.32
565.303	234.83
565.722	152.31
566.14	239.69
566.559	125.61
566.978	210.56
567.396	232.41
567.815	220.27
568.233	205.71
568.652	234.83
569.07	159.59
569.489	179.01
569.907	181.43
570.325	147.45
570.743	205.71
571.161	176.58
571.58	154.74
571.998	229.98
572.416	186.29
572.833	215.42
573.251	157.16
573.669	266.39
574.087	266.39
574.505	229.98
574.922	217.84
575.34	193.57
575.758	220.27
576.175	205.71
576.593	198.43
577.01	237.26
577.428	217.84
577.845	1768.84
578.262	319.79
578.68	181.43
579.097	183.86
579.514	208.13
579.931	176.58
580.348	176.58
580.765	183.86
581.182	212.99
581.599	210.56
582.016	193.57
582.433	249.4
582.849	181.43
583.266	246.97
583.683	162.02
584.099	222.7
584.516	239.69
584.933	191.14
585.349	225.12
585.765	188.72
586.182	191.14
586.598	186.29
587.014	200.85
587.431	145.03
587.847	174.15
588.263	234.83
588.679	140.17
589.095	186.29
589.511	229.98
589.927	166.87
590.343	229.98
590.759	215.42
591.174	142.6
591.59	271.24
592.006	176.58
592.421	183.86
592.837	181.43
593.252	239.69
593.668	186.29
594.083	259.11
594.499	246.97
594.914	222.7
595.329	130.46
595.745	210.56
596.16	179.01
596.575	222.7
596.99	198.43
597.405	198.43
597.82	200.85
598.235	225.12
598.65	244.54
599.065	188.72
599.479	188.72
599.894	205.71
600.309	200.85
600.724	169.3
601.138	225.12
601.553	179.01
601.967	212.99
602.382	222.7
602.796	200.85
603.21	164.44
603.625	179.01
604.039	162.02
604.453	227.55
604.867	176.58
605.281	302.8
605.695	249.4
606.109	232.41
606.523	169.3
606.937	232.41
607.351	259.11
607.765	191.14
608.178	198.43
608.592	179.01
609.006	212.99
609.419	179.01
609.833	268.81
610.246	256.68
610.66	176.58
611.073	198.43
611.487	215.42
611.9	162.02
612.313	166.87
612.726	217.84
613.139	174.15
613.553	183.86
613.966	217.84
614.379	196
614.792	200.85
615.204	220.27
615.617	140.17
616.03	145.03
616.443	181.43
616.856	256.68
617.268	179.01
617.681	220.27
618.093	200.85
618.506	152.31
618.918	183.86
619.331	208.13
619.743	169.3
620.155	242.12
620.568	132.89
620.98	225.12
621.392	179.01
621.804	234.83
622.216	203.28
622.628	196
623.04	227.55
623.452	215.42
623.864	176.58
624.276	193.57
624.687	164.44
625.099	191.14
625.511	200.85
625.922	181.43
626.334	111.05
626.745	96.48
627.157	205.71
627.568	145.03
627.979	222.7
628.391	140.17
628.802	234.83
629.213	183.86
629.624	137.74
630.035	137.74
630.446	229.98
630.857	196
631.268	186.29
631.679	171.73
632.09	237.26
632.501	215.42
632.912	210.56
633.322	234.83
633.733	125.61
634.144	227.55
634.554	234.83
634.965	246.97
635.375	232.41
635.785	179.01
636.196	263.96
636.606	200.85
637.016	147.45
637.427	183.86
637.837	176.58
638.247	183.86
638.657	166.87
639.067	157.16
639.477	159.59
639.887	271.24
640.297	232.41
640.706	196
641.116	198.43
641.526	149.88
641.935	196
642.345	249.4
642.755	186.29
643.164	162.02
643.573	166.87
643.983	251.82
644.392	300.37
644.801	198.43
645.211	208.13
645.62	208.13
646.029	186.29
646.438	220.27
646.847	208.13
647.256	176.58
647.665	208.13
648.074	174.15
648.483	147.45
648.892	169.3
649.3	242.12
649.709	140.17
650.118	164.44
650.526	166.87
650.935	227.55
651.343	200.85
651.752	217.84
652.16	239.69
652.568	130.46
652.977	120.75
653.385	174.15
653.793	130.46
654.201	210.56
654.609	162.02
655.017	200.85
655.425	210.56
655.833	198.43
656.241	217.84
656.649	229.98
657.057	91.63
657.464	232.41
657.872	208.13
658.28	166.87
658.687	154.74
659.095	166.87
659.502	174.15
659.91	128.04
660.317	120.75
660.724	164.44
661.132	111.05
661.539	188.72
661.946	125.61
662.353	196
662.76	200.85
663.167	234.83
663.574	94.05
663.981	120.75
664.388	198.43
664.795	193.57
665.202	215.42
665.608	205.71
666.015	179.01
666.422	203.28
666.828	198.43
667.235	176.58
667.641	169.3
668.047	171.73
668.454	183.86
668.86	164.44
669.266	210.56
669.673	176.58
670.079	193.57
670.485	157.16
670.891	132.89
671.297	130.46
671.703	227.55
672.109	196
672.515	208.13
672.92	212.99
673.326	91.63
673.732	186.29
674.138	149.88
674.543	183.86
674.949	183.86
675.354	205.71
675.76	162.02
676.165	140.17
676.57	179.01
676.976	188.72
677.381	169.3
677.786	188.72
678.191	181.43
678.596	137.74
679.001	183.86
679.406	183.86
679.811	179.01
680.216	171.73
680.621	210.56
681.026	200.85
681.43	108.62
681.835	179.01
682.24	203.28
682.644	169.3
683.049	210.56
683.453	203.28
683.858	242.12
684.262	229.98
684.667	193.57
685.071	251.82
685.475	157.16
685.879	103.76
686.283	188.72
686.687	200.85
687.091	229.98
687.495	111.05
687.899	203.28
688.303	174.15
688.707	130.46
689.111	242.12
689.514	227.55
689.918	152.31
690.322	183.86
690.725	135.32
691.129	179.01
691.532	186.29
691.936	193.57
692.339	166.87
692.742	159.59
693.146	147.45
693.549	203.28
693.952	149.88
694.355	222.7
694.758	183.86
695.161	227.55
695.564	205.71
695.967	198.43
696.37	295.51
696.773	196
697.175	169.3
697.578	171.73
697.981	181.43
698.383	220.27
698.786	203.28
699.188	149.88
699.591	176.58
699.993	176.58
700.395	188.72
700.798	198.43
701.2	196
701.602	162.02
702.004	263.96
702.406	166.87
702.808	188.72
703.21	125.61
703.612	220.27
704.014	280.95
704.416	205.71
704.818	179.01
705.219	205.71
705.621	266.39
706.023	210.56
706.424	198.43
706.826	256.68
707.227	222.7
707.629	220.27
708.03	225.12
708.431	256.68
708.832	225.12
709.234	179.01
709.635	234.83
710.036	186.29
710.437	193.57
710.838	239.69
711.239	268.81
711.64	208.13
712.041	234.83
712.441	234.83
712.842	244.54
713.243	273.67
713.643	261.53
714.044	188.72
714.445	300.37
714.845	261.53
715.246	208.13
715.646	251.82
716.046	261.53
716.447	348.91
716.847	361.05
717.247	334.35
717.647	295.51
718.047	259.11
718.447	290.66
718.847	276.1
719.247	339.2
719.647	331.92
720.047	348.91
720.446	382.89
720.846	222.7
721.246	387.75
721.645	375.61
722.045	290.66
722.444	392.6
722.844	370.76
723.243	455.71
723.643	319.79
724.042	378.04
724.441	450.86
724.84	433.87
725.24	421.73
725.639	414.45
726.038	518.82
726.437	399.88
726.836	511.54
727.234	465.42
727.633	547.95
728.032	538.24
728.431	572.22
728.83	589.21
729.228	630.47
729.627	696.01
730.025	691.15
730.424	722.71
730.822	783.39
731.22	831.93
731.619	890.18
732.017	984.85
732.415	1067.37
732.813	1123.2
733.212	1159.61
733.61	1135.33
734.008	1297.96
734.406	1382.91
734.803	1518.83
735.201	1613.5
735.599	1836.8
735.997	1819.81
736.395	1946.03
736.792	2101.37
737.19	2145.06
737.587	2331.95
737.985	2453.31
738.382	2460.6
738.78	2725.16
739.177	2834.39
739.574	3096.53
739.971	3047.98
740.369	3208.18
740.766	3482.46
741.163	3504.3
741.56	3892.66
741.957	3805.28
742.354	4135.38
742.751	4186.35
743.147	4416.94
743.544	4521.31
743.941	4827.14
744.338	5101.41
744.734	5341.71
745.131	5608.7
745.527	5810.16
745.924	5907.25
746.32	6489.79
746.716	6863.58
747.113	7060.18
747.509	7383
747.905	7785.92
748.301	8147.58
748.697	8616.03
749.093	8924.29
749.489	9125.75
749.885	9717.99
750.281	10006.83
750.677	10339.36
751.073	11140.34
751.468	11657.34
751.864	12261.72
752.26	12370.94
752.655	12759.3
753.051	13145.23
753.446	13815.14
753.842	14332.14
754.237	14795.74
754.632	15373.42
755.028	15312.74
755.423	15907.41
755.818	16123.43
756.213	16640.43
756.608	16861.31
757.003	17130.73
757.398	17635.59
757.793	18128.32
758.188	18339.48
758.583	18708.42
758.977	18645.31
759.372	19407.46
759.767	20698.74
760.161	21499.73
760.556	22392.95
760.95	23332.28
761.345	24101.71
761.739	25305.61
762.133	26451.26
762.527	27541.08
762.922	28494.98
763.316	28951.3
763.71	29453.73
764.104	29747.43
764.498	30694.05
764.892	31604.25
765.286	31997.46
765.68	33630.98
766.073	33601.86
766.467	34053.32
766.861	34587.31
767.255	36344.62
767.648	37145.6
768.042	37963.58
768.435	39262.14
768.829	39793.7
769.222	40645.66
769.615	41109.26
770.008	40560.7
770.402	40754.88
770.795	40912.65
771.188	41109.26
771.581	41750.04
771.974	41436.93
772.367	41888.39
772.76	42072.86
773.153	41026.73
773.545	41747.62
773.938	42504.91
774.331	42796.18
774.724	43203.95
775.116	45114.17
775.509	45946.71
775.901	47978.29
776.294	49133.65
776.686	50177.36
777.078	50395.81
777.471	51582.72
777.863	52733.22
778.255	53774.5
778.647	55048.79
779.039	55444.43
779.431	54725.97
779.823	54454.12
780.215	55827.93
780.607	55757.54
780.999	56959.02
781.39	55985.7
781.782	56861.93
782.174	57199.31
782.565	57966.31
782.957	58310.98
783.348	58932.35
783.74	59031.86
784.131	58085.25
784.522	58553.7
784.914	57910.49
785.305	57636.21
785.696	57570.68
786.087	57983.3
786.478	56340.08
786.869	55665.31
787.26	55463.85
787.651	54174.99
788.042	53626.44
788.433	52614.29
788.823	51580.29
789.214	51764.76
789.605	50296.29
789.995	49636.09
790.386	48621.51
790.776	47949.17
791.167	47638.48
791.557	49005.01
791.948	49912.79
792.338	49796.28
792.728	51657.96
793.118	51660.39
793.508	52235.64
793.898	51672.53
794.288	52327.88
794.678	51573.01
795.068	51128.83
795.458	51650.68
795.848	52005.06
796.238	51325.43
796.627	51138.54
797.017	50648.24
797.406	50980.77
797.796	50968.63
798.185	51313.3
798.575	52313.31
798.964	51172.52
799.354	52102.15
799.743	51966.22
800.132	52454.09
800.521	51415.24
800.91	51174.95
801.299	50815.72
801.688	50888.53
802.077	49791.43
802.466	50267.17
802.855	49672.5
803.244	48046.26
803.633	47893.34
804.021	48019.56
804.41	46878.76
804.799	45594.76
805.187	44407.85
805.576	43361.72
805.964	43068.02
806.352	41014.59
806.741	40873.82
807.129	40662.65
807.517	40012.15
807.905	39970.89
808.293	40237.88
808.681	41216.05
809.069	41674.8
809.457	41774.31
809.845	42034.03
810.233	41684.51
810.621	41546.16
811.009	40640.8
811.396	40703.91
811.784	41628.68
812.171	40274.29
812.559	40325.26
812.946	39177.19
813.334	39660.2
813.721	38895.63
814.108	37215.99
814.496	37152.88
814.883	36851.91
815.27	36555.79
815.657	36169.86
816.044	36567.92
816.431	36191.7
816.818	36138.3
817.205	34706.24
817.592	35577.62
817.979	35427.13
818.365	34461.09
818.752	32956.22
819.139	32067.85
819.525	31366.39
819.912	30553.27
820.298	30009.57
820.685	29567.81
821.071	29024.12
821.457	28526.54
821.843	26477.96
822.23	25834.75
822.616	24825.02
823.002	23618.69
823.388	22791.01
823.774	22218.19
824.16	21545.84
824.546	21169.63
824.931	20769.13
825.317	20091.94
825.703	19565.23
826.089	19429.31
826.474	19494.84
826.86	18793.37
827.245	18875.9
827.631	18455.99
828.016	18203.56
828.401	17560.35
828.787	17128.3
829.172	16965.68
829.557	16582.18
829.942	16116.15
830.327	15645.27
830.712	15303.03
831.097	15128.27
831.482	15033.61
831.867	14060.29
832.252	13710.77
832.636	13448.63
833.021	13625.82
833.406	13091.83
833.79	12883.09
834.175	12397.64
834.559	12509.3
834.944	12191.33
835.328	11919.48
835.713	11465.59
836.097	11193.74
836.481	10616.06
836.865	10472.86
837.249	9938.87
837.633	9569.93
838.017	9339.34
838.401	9200.99
838.785	8715.55
839.169	8259.23
839.553	8086.9
839.937	7412.13
840.32	7317.47
840.704	7188.83
841.087	6601.44
841.471	6433.96
841.854	6179.1
842.238	6174.25
842.621	5882.98
843.004	5739.77
843.388	5691.23
843.771	5555.3
844.154	5378.12
844.537	5176.66
844.92	5397.54
845.303	5098.99
845.686	4853.84
846.069	4875.68
846.452	4933.94
846.834	4501.89
847.217	4521.31
847.6	4390.24
847.982	4266.45
848.365	4208.2
848.748	3950.91
849.13	3989.75
849.512	3997.03
849.895	3878.09
850.277	3630.52
850.659	3601.39
851.041	3446.05
851.423	3521.29
851.806	3482.46
852.188	3329.54
852.57	3064.97
852.951	3191.19
853.333	3118.37
853.715	3018.86
854.097	2790.7
854.479	2759.14
854.86	2581.96
855.242	2572.25
855.623	2431.47
856.005	2307.68
856.386	2176.61
856.768	2327.1
857.149	2176.61
857.53	2118.36
857.911	1994.57
858.292	1909.62
858.674	1870.78
859.055	1793.11
859.436	1700.88
859.817	1608.64
860.197	1506.7
860.578	1463.01
860.959	1446.02
861.34	1496.99
861.72	1385.34
862.101	1358.64
862.482	1239.7
862.862	1254.27
863.243	1200.87
863.623	1263.98
864.003	1205.72
864.384	1052.81
864.764	1108.63
865.144	1043.1
865.524	1064.94
865.904	1055.23
866.284	950.86
866.664	890.18
867.044	895.04
867.424	863.48
867.804	924.16
868.183	914.46
868.563	848.92
868.943	788.24
869.322	751.83
869.702	749.4
870.081	693.58
870.461	691.15
870.84	703.29
871.22	652.32
871.599	654.74
871.978	666.88
872.357	613.48
872.736	552.8
873.115	615.91
873.494	523.67
873.873	475.13
874.252	564.94
874.631	489.69
875.01	545.52
875.388	455.71
875.767	390.18
876.146	450.86
876.524	450.86
876.903	368.33
877.281	346.49
877.66	358.62
878.038	263.96
878.416	395.03
878.794	329.5
879.173	334.35
879.551	249.4
879.929	373.19
880.307	341.63
880.685	300.37
881.063	295.51
881.441	290.66
881.818	295.51
882.196	259.11
882.574	271.24
882.951	234.83
883.329	336.78
883.707	276.1
884.084	276.1
884.461	285.81
884.839	259.11
885.216	232.41
885.593	263.96
885.971	196
886.348	312.5
886.725	234.83
887.102	317.36
887.479	295.51
887.856	259.11
888.233	305.22
888.609	196
888.986	217.84
889.363	244.54
889.74	271.24
890.116	234.83
890.493	222.7
890.869	188.72
891.246	179.01
891.622	132.89
891.998	200.85
892.375	246.97
892.751	164.44
893.127	239.69
893.503	183.86
893.879	203.28
894.255	278.52
894.631	198.43
895.007	179.01
895.383	271.24
895.759	135.32
896.134	164.44
896.51	229.98
896.886	188.72
897.261	186.29
897.637	229.98
898.012	181.43
898.388	200.85
898.763	166.87
899.138	183.86
899.514	130.46
899.889	225.12
900.264	174.15
900.639	203.28
901.014	140.17
901.389	196
901.764	261.53
902.139	164.44
902.513	196
902.888	157.16
903.263	152.31
903.638	98.91
904.012	162.02
904.387	174.15
904.761	142.6
905.136	96.48
905.51	181.43
905.884	84.35
906.259	128.04
906.633	103.76
907.007	181.43
907.381	181.43
907.755	237.26
908.129	108.62
908.503	208.13
908.877	212.99
909.251	162.02
909.624	188.72
909.998	130.46
910.372	193.57
910.745	179.01
911.119	188.72
911.492	191.14
911.866	159.59
912.239	157.16
912.612	159.59
912.986	186.29
913.359	164.44
913.732	196
914.105	196
914.478	108.62
914.851	118.33
915.224	210.56
915.597	191.14
915.97	203.28
916.343	176.58
916.715	132.89
917.088	147.45
917.461	128.04
917.833	152.31
918.206	205.71
918.578	169.3
918.951	193.57
919.323	135.32
919.695	196
920.067	128.04
920.44	203.28
920.812	159.59
921.184	142.6
921.556	140.17
921.928	181.43
922.3	137.74
922.672	91.63
923.043	205.71
923.415	196
923.787	147.45
924.158	162.02
924.53	154.74
924.901	166.87
925.273	171.73
925.644	193.57
926.016	159.59
926.387	232.41
926.758	147.45
927.129	215.42
927.5	164.44
927.872	159.59
928.243	123.18
928.613	132.89
928.984	164.44
929.355	169.3
929.726	149.88
930.097	215.42
930.467	67.36
930.838	140.17
931.209	128.04
931.579	181.43
931.95	179.01
932.32	145.03
932.69	164.44
933.061	108.62
933.431	171.73
933.801	149.88
934.171	227.55
934.541	196
934.911	130.46
935.281	193.57
935.651	174.15
936.021	179.01
936.391	108.62
936.761	120.75
937.13	193.57
937.5	220.27
937.87	135.32
938.239	152.31
938.609	98.91
938.978	198.43
939.347	186.29
939.717	101.34
940.086	193.57
940.455	232.41
940.824	232.41
941.193	222.7
941.562	251.82
941.931	176.58
942.3	222.7
942.669	215.42
943.038	152.31
943.407	111.05
943.775	188.72
944.144	145.03
944.513	164.44
944.881	111.05
945.25	157.16
945.618	174.15
945.986	106.19
946.355	193.57
946.723	188.72
947.091	154.74
947.459	101.34
947.827	174.15
948.195	67.36
948.563	142.6
948.931	132.89
949.299	130.46
949.667	113.47
950.035	64.93
950.402	162.02
950.77	193.57
951.138	103.76
951.505	179.01
951.873	147.45
952.24	166.87
952.607	159.59
952.975	191.14
953.342	166.87
953.709	77.06
954.076	157.16
954.443	154.74
954.81	227.55
955.177	154.74
955.544	135.32
955.911	203.28
956.278	145.03
956.645	115.9
957.012	212.99
957.378	169.3
957.745	179.01
958.111	152.31
958.478	166.87
958.844	145.03
959.211	108.62
959.577	193.57
959.943	142.6
960.309	181.43
960.675	183.86
961.042	181.43
961.408	137.74
961.774	152.31
962.139	176.58
962.505	115.9
962.871	171.73
963.237	203.28
963.603	159.59
963.968	154.74
964.334	205.71
964.699	123.18
965.065	174.15
965.43	242.12
965.796	174.15
966.161	128.04
966.526	128.04
966.891	222.7
967.256	101.34
967.622	181.43
967.987	149.88
968.352	149.88
968.716	179.01
969.081	130.46
969.446	162.02
969.811	130.46
970.176	103.76
970.54	186.29
970.905	220.27
971.269	166.87
971.634	149.88
971.998	108.62
972.363	196
972.727	212.99
973.091	128.04
973.455	152.31
973.819	171.73
974.183	140.17
974.547	210.56
974.911	239.69
975.275	212.99
975.639	208.13
976.003	128.04
976.367	132.89
976.73	203.28
977.094	193.57
977.458	152.31
977.821	128.04
978.185	108.62
978.548	140.17
978.911	222.7
979.275	137.74
979.638	188.72
980.001	142.6
980.364	154.74
980.727	140.17
981.09	128.04
981.453	147.45
981.816	132.89
982.179	147.45
982.542	166.87
982.905	186.29
983.267	72.21
983.63	154.74
983.992	212.99
984.355	171.73
984.717	149.88
985.08	166.87
985.442	98.91
985.804	142.6
986.167	212.99
986.529	118.33
986.891	145.03
987.253	215.42
987.615	171.73
987.977	108.62
988.339	164.44
988.701	183.86
989.062	164.44
989.424	152.31
989.786	91.63
990.147	157.16
990.509	120.75
990.87	179.01
991.232	157.16
991.593	125.61
991.955	101.34
992.316	159.59
992.677	159.59
993.038	200.85
993.399	191.14
993.76	159.59
994.121	91.63
994.482	137.74
994.843	162.02
995.204	147.45
995.565	140.17
995.926	171.73
996.286	215.42
996.647	128.04
997.007	147.45
997.368	205.71
997.728	174.15
998.089	166.87
998.449	193.57
998.809	193.57
999.169	176.58
999.53	149.88
999.89	137.74
1000.25	120.75
1000.61	196
1000.97	166.87
1001.329	200.85
1001.689	145.03
1002.049	123.18
1002.409	171.73
1002.768	164.44
1003.128	186.29
1003.487	169.3
1003.847	154.74
1004.206	166.87
1004.566	176.58
1004.925	125.61
1005.284	130.46
1005.643	135.32
1006.003	132.89
1006.362	200.85
1006.721	140.17
1007.08	181.43
1007.438	120.75
1007.797	191.14
1008.156	137.74
1008.515	225.12
1008.874	101.34
1009.232	125.61
1009.591	181.43
1009.949	137.74
1010.308	137.74
1010.666	198.43
1011.024	157.16
1011.383	162.02
1011.741	186.29
1012.099	157.16
1012.457	64.93
1012.815	137.74
1013.173	183.86
1013.531	147.45
1013.889	125.61
1014.247	171.73
1014.605	159.59
1014.962	149.88
1015.32	193.57
1015.678	108.62
1016.035	191.14
1016.393	159.59
1016.75	174.15
1017.107	179.01
1017.465	176.58
1017.822	132.89
1018.179	159.59
1018.536	128.04
1018.894	94.05
1019.251	162.02
1019.608	181.43
1019.964	98.91
1020.321	162.02
1020.678	166.87
1021.035	137.74
1021.392	162.02
1021.748	174.15
1022.105	145.03
1022.461	152.31
1022.818	142.6
1023.174	208.13
1023.531	171.73
1023.887	188.72
1024.243	159.59
1024.599	193.57
1024.955	186.29
1025.311	162.02
1025.667	200.85
1026.023	132.89
1026.379	145.03
1026.735	210.56
1027.091	162.02
1027.447	179.01
