189.514	53.1
189.973	53.1
190.431	53.1
190.889	-48.85
191.348	-48.85
191.806	-48.85
192.264	-19.72
192.722	-43.99
193.18	14.26
193.638	-53.7
194.096	16.69
194.554	-29.43
195.012	82.22
195.47	23.97
195.928	45.81
196.385	-2.73
196.843	-34.28
197.301	2.12
197.758	36.1
198.216	-29.43
198.674	-12.44
199.131	4.55
199.589	60.38
200.046	23.97
200.503	60.38
200.961	84.65
201.418	111.35
201.875	138.05
202.332	164.75
202.79	106.49
203.247	74.94
203.704	145.33
204.161	50.67
204.618	150.18
205.075	91.93
205.532	145.33
205.989	157.47
206.445	130.77
206.902	128.34
207.359	135.62
207.816	181.74
208.272	101.64
208.729	116.2
209.185	189.02
209.642	145.33
210.098	138.05
210.555	169.6
211.011	201.16
211.467	108.92
211.924	150.18
212.38	179.31
212.836	155.04
213.292	145.33
213.748	89.5
214.204	140.48
214.66	145.33
215.116	162.32
215.572	179.31
216.028	155.04
216.484	162.32
216.94	150.18
217.396	157.47
217.851	150.18
218.307	138.05
218.763	145.33
219.218	121.06
219.674	157.47
220.129	125.91
220.585	108.92
221.04	142.9
221.496	142.9
221.951	140.48
222.406	116.2
222.861	84.65
223.317	138.05
223.772	82.22
224.227	57.95
224.682	145.33
225.137	89.5
225.592	152.61
226.047	152.61
226.502	142.9
226.957	152.61
227.411	147.76
227.866	96.79
228.321	116.2
228.776	91.93
229.23	142.9
229.685	91.93
230.139	140.48
230.594	116.2
231.048	150.18
231.503	162.32
231.957	135.62
232.411	116.2
232.865	101.64
233.32	125.91
233.774	118.63
234.228	96.79
234.682	116.2
235.136	87.08
235.59	74.94
236.044	101.64
236.498	159.89
236.952	152.61
237.406	130.77
237.86	145.33
238.313	191.45
238.767	189.02
239.221	125.91
239.674	130.77
240.128	142.9
240.581	150.18
241.035	125.91
241.488	96.79
241.942	123.48
242.395	135.62
242.848	82.22
243.301	152.61
243.755	174.46
244.208	164.75
244.661	191.45
245.114	128.34
245.567	140.48
246.02	130.77
246.473	152.61
246.926	128.34
247.379	162.32
247.832	113.78
248.284	133.19
248.737	135.62
249.19	101.64
249.642	74.94
250.095	123.48
250.547	67.66
251	155.04
251.452	133.19
251.905	159.89
252.357	130.77
252.81	133.19
253.262	159.89
253.714	118.63
254.166	203.58
254.618	142.9
255.07	155.04
255.523	123.48
255.975	111.35
256.427	172.03
256.878	150.18
257.33	142.9
257.782	140.48
258.234	145.33
258.686	189.02
259.137	142.9
259.589	72.51
260.041	162.32
260.492	176.88
260.944	208.44
261.395	101.64
261.847	179.31
262.298	191.45
262.749	140.48
263.201	140.48
263.652	235.14
264.103	145.33
264.554	118.63
265.005	111.35
265.457	138.05
265.908	133.19
266.359	128.34
266.809	138.05
267.26	77.37
267.711	125.91
268.162	189.02
268.613	176.88
269.064	142.9
269.514	162.32
269.965	138.05
270.415	142.9
270.866	169.6
271.316	138.05
271.767	123.48
272.217	176.88
272.668	145.33
273.118	125.91
273.568	145.33
274.019	150.18
274.469	164.75
274.919	174.46
275.369	159.89
275.819	121.06
276.269	87.08
276.719	164.75
277.169	74.94
277.619	99.21
278.069	159.89
278.518	94.36
278.968	150.18
279.418	130.77
279.867	79.79
280.317	79.79
280.767	150.18
281.216	225.43
281.666	104.07
282.115	169.6
282.564	159.89
283.014	82.22
283.463	210.86
283.912	169.6
284.361	172.03
284.811	125.91
285.26	159.89
285.709	125.91
286.158	181.74
286.607	184.17
287.056	123.48
287.505	140.48
287.953	121.06
288.402	174.46
288.851	135.62
289.3	227.86
289.748	135.62
290.197	159.89
290.646	196.3
291.094	162.32
291.543	111.35
291.991	164.75
292.439	108.92
292.888	121.06
293.336	125.91
293.784	164.75
294.233	65.23
294.681	118.63
295.129	128.34
295.577	157.47
296.025	210.86
296.473	113.78
296.921	208.44
297.369	174.46
297.817	128.34
298.264	206.01
298.712	72.51
299.16	123.48
299.608	94.36
300.055	101.64
300.503	152.61
300.95	201.16
301.398	196.3
301.845	189.02
302.293	220.57
302.74	172.03
303.187	169.6
303.635	184.17
304.082	206.01
304.529	130.77
304.976	150.18
305.423	99.21
305.87	140.48
306.317	79.79
306.764	172.03
307.211	155.04
307.658	142.9
308.105	123.48
308.552	123.48
308.998	150.18
309.445	193.87
309.892	157.47
310.338	155.04
310.785	167.17
311.231	225.43
311.678	104.07
312.124	198.73
312.571	162.32
313.017	96.79
313.463	140.48
313.909	157.47
314.356	48.24
314.802	138.05
315.248	145.33
315.694	111.35
316.14	152.61
316.586	111.35
317.032	128.34
317.478	145.33
317.923	259.41
318.369	206.01
318.815	138.05
319.261	123.48
319.706	135.62
320.152	118.63
320.597	179.31
321.043	99.21
321.488	155.04
321.934	140.48
322.379	108.92
322.824	133.19
323.27	104.07
323.715	191.45
324.16	147.76
324.605	208.44
325.05	172.03
325.495	176.88
325.94	186.59
326.385	152.61
326.83	147.76
327.275	191.45
327.72	145.33
328.165	159.89
328.61	91.93
329.054	89.5
329.499	147.76
329.943	203.58
330.388	145.33
330.832	101.64
331.277	150.18
331.721	101.64
332.166	208.44
332.61	181.74
333.054	89.5
333.499	104.07
333.943	121.06
334.387	164.75
334.831	159.89
335.275	123.48
335.719	162.32
336.163	164.75
336.607	142.9
337.051	169.6
337.495	152.61
337.938	198.73
338.382	164.75
338.826	142.9
339.269	96.79
339.713	116.2
340.157	38.53
340.6	135.62
341.044	172.03
341.487	135.62
341.93	162.32
342.374	138.05
342.817	181.74
343.26	203.58
343.703	157.47
344.146	210.86
344.59	106.49
345.033	140.48
345.476	111.35
345.919	174.46
346.361	162.32
346.804	106.49
347.247	50.67
347.69	150.18
348.133	106.49
348.575	116.2
349.018	176.88
349.461	118.63
349.903	123.48
350.346	142.9
350.788	113.78
351.23	220.57
351.673	147.76
352.115	167.17
352.557	172.03
353	128.34
353.442	101.64
353.884	152.61
354.326	96.79
354.768	104.07
355.21	138.05
355.652	60.38
356.094	108.92
356.536	162.32
356.978	164.75
357.419	145.33
357.861	145.33
358.303	138.05
358.744	72.51
359.186	176.88
359.627	87.08
360.069	152.61
360.51	201.16
360.952	142.9
361.393	176.88
361.834	145.33
362.276	176.88
362.717	142.9
363.158	121.06
363.599	150.18
364.04	133.19
364.481	113.78
364.922	169.6
365.363	184.17
365.804	138.05
366.245	123.48
366.686	128.34
367.126	172.03
367.567	184.17
368.008	99.21
368.448	167.17
368.889	193.87
369.33	123.48
369.77	176.88
370.21	125.91
370.651	118.63
371.091	142.9
371.531	140.48
371.972	135.62
372.412	155.04
372.852	176.88
373.292	53.1
373.732	145.33
374.172	74.94
374.612	106.49
375.052	121.06
375.492	179.31
375.932	186.59
376.372	113.78
376.811	99.21
377.251	106.49
377.691	150.18
378.13	118.63
378.57	167.17
379.009	210.86
379.449	104.07
379.888	135.62
380.328	113.78
380.767	159.89
381.206	142.9
381.645	104.07
382.085	84.65
382.524	91.93
382.963	133.19
383.402	140.48
383.841	213.29
384.28	82.22
384.719	157.47
385.158	135.62
385.596	125.91
386.035	116.2
386.474	150.18
386.913	108.92
387.351	147.76
387.79	140.48
388.228	142.9
388.667	130.77
389.105	159.89
389.544	172.03
389.982	94.36
390.42	167.17
390.859	106.49
391.297	99.21
391.735	96.79
392.173	218.15
392.611	191.45
393.049	106.49
393.487	140.48
393.925	142.9
394.363	193.87
394.801	169.6
395.239	164.75
395.676	189.02
396.114	193.87
396.552	118.63
396.989	191.45
397.427	179.31
397.864	142.9
398.302	118.63
398.739	96.79
399.177	169.6
399.614	123.48
400.051	155.04
400.488	150.18
400.926	79.79
401.363	147.76
401.8	210.86
402.237	138.05
402.674	198.73
403.111	162.32
403.548	128.34
403.985	125.91
404.421	118.63
404.858	235.14
405.295	128.34
405.732	106.49
406.168	184.17
406.605	150.18
407.041	96.79
407.478	218.15
407.914	135.62
408.351	140.48
408.787	159.89
409.223	189.02
409.66	208.44
410.096	123.48
410.532	135.62
410.968	36.1
411.404	108.92
411.84	104.07
412.276	201.16
412.712	164.75
413.148	147.76
413.584	157.47
414.02	150.18
414.455	128.34
414.891	87.08
415.327	99.21
415.762	94.36
416.198	130.77
416.633	116.2
417.069	167.17
417.504	79.79
417.94	152.61
418.375	87.08
418.81	135.62
419.245	123.48
419.681	104.07
420.116	99.21
420.551	157.47
420.986	172.03
421.421	198.73
421.856	174.46
422.291	172.03
422.726	118.63
423.16	106.49
423.595	203.58
424.03	239.99
424.464	215.72
424.899	99.21
425.334	118.63
425.768	43.39
426.203	184.17
426.637	162.32
427.071	172.03
427.506	96.79
427.94	108.92
428.374	125.91
428.809	213.29
429.243	77.37
429.677	203.58
430.111	96.79
430.545	118.63
430.979	164.75
431.413	142.9
431.847	162.32
432.28	140.48
432.714	133.19
433.148	164.75
433.582	99.21
434.015	186.59
434.449	186.59
434.882	157.47
435.316	147.76
435.749	62.8
436.183	150.18
436.616	116.2
437.049	57.95
437.483	82.22
437.916	191.45
438.349	167.17
438.782	179.31
439.215	130.77
439.648	138.05
440.081	125.91
440.514	108.92
440.947	138.05
441.38	130.77
441.813	152.61
442.245	191.45
442.678	72.51
443.111	130.77
443.543	133.19
443.976	140.48
444.408	142.9
444.841	101.64
445.273	116.2
445.705	169.6
446.138	113.78
446.57	123.48
447.002	138.05
447.434	125.91
447.867	164.75
448.299	145.33
448.731	125.91
449.163	198.73
449.595	125.91
450.026	96.79
450.458	91.93
450.89	116.2
451.322	155.04
451.754	57.95
452.185	123.48
452.617	167.17
453.048	239.99
453.48	135.62
453.911	201.16
454.343	191.45
454.774	140.48
455.205	159.89
455.637	232.71
456.068	113.78
456.499	225.43
456.93	196.3
457.361	172.03
457.792	135.62
458.223	113.78
458.654	145.33
459.085	215.72
459.516	208.44
459.947	140.48
460.378	133.19
460.808	191.45
461.239	167.17
461.669	121.06
462.1	174.46
462.531	91.93
462.961	179.31
463.391	111.35
463.822	135.62
464.252	91.93
464.682	159.89
465.113	150.18
465.543	167.17
465.973	152.61
466.403	128.34
466.833	189.02
467.263	174.46
467.693	157.47
468.123	181.74
468.553	191.45
468.983	176.88
469.412	159.89
469.842	201.16
470.272	227.86
470.701	123.48
471.131	223
471.56	111.35
471.99	125.91
472.419	162.32
472.849	128.34
473.278	164.75
473.707	162.32
474.136	133.19
474.566	162.32
474.995	135.62
475.424	201.16
475.853	201.16
476.282	172.03
476.711	79.79
477.14	164.75
477.569	150.18
477.997	138.05
478.426	142.9
478.855	181.74
479.283	193.87
479.712	198.73
480.141	196.3
480.569	99.21
480.998	104.07
481.426	130.77
481.854	164.75
482.283	138.05
482.711	227.86
483.139	191.45
483.567	162.32
483.995	118.63
484.424	169.6
484.852	176.88
485.28	155.04
485.708	138.05
486.135	84.65
486.563	184.17
486.991	104.07
487.419	213.29
487.847	201.16
488.274	191.45
488.702	191.45
489.129	145.33
489.557	145.33
489.984	89.5
490.412	181.74
490.839	159.89
491.266	96.79
491.694	123.48
492.121	189.02
492.548	215.72
492.975	162.32
493.402	113.78
493.829	193.87
494.256	193.87
494.683	60.38
495.11	145.33
495.537	152.61
495.964	147.76
496.39	174.46
496.817	172.03
497.244	128.34
497.67	106.49
498.097	130.77
498.523	155.04
498.95	140.48
499.376	155.04
499.803	172.03
500.229	150.18
500.655	159.89
501.081	96.79
501.508	193.87
501.934	113.78
502.36	218.15
502.786	82.22
503.212	135.62
503.638	130.77
504.064	121.06
504.489	169.6
504.915	167.17
505.341	145.33
505.767	196.3
506.192	116.2
506.618	94.36
507.043	164.75
507.469	159.89
507.894	111.35
508.32	237.56
508.745	196.3
509.17	159.89
509.596	101.64
510.021	155.04
510.446	60.38
510.871	142.9
511.296	138.05
511.721	176.88
512.146	113.78
512.571	72.51
512.996	169.6
513.421	108.92
513.845	147.76
514.27	108.92
514.695	84.65
515.119	135.62
515.544	108.92
515.969	96.79
516.393	130.77
516.817	123.48
517.242	215.72
517.666	162.32
518.09	89.5
518.515	162.32
518.939	169.6
519.363	385.62
519.787	147.76
520.211	94.36
520.635	121.06
521.059	147.76
521.483	121.06
521.907	99.21
522.331	135.62
522.754	186.59
523.178	179.31
523.602	181.74
524.025	121.06
524.449	159.89
524.872	140.48
525.296	94.36
525.719	106.49
526.143	164.75
526.566	147.76
526.989	138.05
527.412	189.02
527.836	135.62
528.259	111.35
528.682	157.47
529.105	193.87
529.528	167.17
529.951	167.17
530.374	113.78
530.796	172.03
531.219	145.33
531.642	135.62
532.065	133.19
532.487	130.77
532.91	223
533.332	179.31
533.755	99.21
534.177	87.08
534.6	155.04
535.022	145.33
535.444	164.75
535.867	145.33
536.289	106.49
536.711	157.47
537.133	239.99
537.555	116.2
537.977	99.21
538.399	140.48
538.821	133.19
539.243	208.44
539.665	159.89
540.086	223
540.508	237.56
540.93	193.87
541.351	176.88
541.773	186.59
542.195	167.17
542.616	232.71
543.037	244.85
543.459	283.68
543.88	232.71
544.301	278.83
544.723	230.28
545.144	276.4
545.565	242.42
545.986	223
546.407	237.56
546.828	235.14
547.249	206.01
547.67	147.76
548.091	121.06
548.512	157.47
548.932	135.62
549.353	189.02
549.774	172.03
550.194	179.31
550.615	128.34
551.035	193.87
551.456	128.34
551.876	215.72
552.296	79.79
552.717	172.03
553.137	172.03
553.557	111.35
553.977	123.48
554.397	142.9
554.817	218.15
555.237	206.01
555.657	113.78
556.077	157.47
556.497	155.04
556.917	140.48
557.337	130.77
557.756	118.63
558.176	128.34
558.596	33.68
559.015	198.73
559.435	106.49
559.854	179.31
560.274	179.31
560.693	247.27
561.112	172.03
561.532	167.17
561.951	74.94
562.37	162.32
562.789	133.19
563.208	106.49
563.627	196.3
564.046	186.59
564.465	162.32
564.884	167.17
565.303	101.64
565.722	140.48
566.14	147.76
566.559	135.62
566.978	150.18
567.396	145.33
567.815	155.04
568.233	172.03
568.652	113.78
569.07	123.48
569.489	140.48
569.907	106.49
570.325	157.47
570.743	179.31
571.161	186.59
571.58	215.72
571.998	150.18
572.416	174.46
572.833	147.76
573.251	101.64
573.669	138.05
574.087	142.9
574.505	130.77
574.922	157.47
575.34	172.03
575.758	152.61
576.175	133.19
576.593	99.21
577.01	94.36
577.428	210.86
577.845	1771.57
578.262	312.81
578.68	215.72
579.097	138.05
579.514	176.88
579.931	123.48
580.348	123.48
580.765	145.33
581.182	159.89
581.599	152.61
582.016	121.06
582.433	162.32
582.849	179.31
583.266	125.91
583.683	159.89
584.099	174.46
584.516	138.05
584.933	123.48
585.349	101.64
585.765	164.75
586.182	208.44
586.598	155.04
587.014	169.6
587.431	239.99
587.847	179.31
588.263	164.75
588.679	218.15
589.095	191.45
589.511	210.86
589.927	89.5
590.343	172.03
590.759	169.6
591.174	116.2
591.59	147.76
592.006	142.9
592.421	150.18
592.837	145.33
593.252	147.76
593.668	106.49
594.083	142.9
594.499	152.61
594.914	128.34
595.329	118.63
595.745	150.18
596.16	179.31
596.575	172.03
596.99	116.2
597.405	99.21
597.82	147.76
598.235	108.92
598.65	142.9
599.065	106.49
599.479	164.75
599.894	130.77
600.309	201.16
600.724	181.74
601.138	203.58
601.553	176.88
601.967	174.46
602.382	244.85
602.796	150.18
603.21	191.45
603.625	138.05
604.039	84.65
604.453	203.58
604.867	108.92
605.281	155.04
605.695	140.48
606.109	172.03
606.523	142.9
606.937	176.88
607.351	242.42
607.765	111.35
608.178	181.74
608.592	152.61
609.006	172.03
609.419	206.01
609.833	181.74
610.246	213.29
610.66	208.44
611.073	167.17
611.487	201.16
611.9	227.86
612.313	215.72
612.726	196.3
613.139	121.06
613.553	116.2
613.966	150.18
614.379	198.73
614.792	172.03
615.204	133.19
615.617	174.46
616.03	162.32
616.443	256.98
616.856	191.45
617.268	159.89
617.681	184.17
618.093	167.17
618.506	155.04
618.918	162.32
619.331	191.45
619.743	152.61
620.155	111.35
620.568	164.75
620.98	176.88
621.392	99.21
621.804	242.42
622.216	159.89
622.628	206.01
623.04	128.34
623.452	142.9
623.864	147.76
624.276	104.07
624.687	210.86
625.099	203.58
625.511	159.89
625.922	189.02
626.334	196.3
626.745	133.19
627.157	155.04
627.568	118.63
627.979	159.89
628.391	104.07
628.802	201.16
629.213	208.44
629.624	159.89
630.035	186.59
630.446	213.29
630.857	196.3
631.268	133.19
631.679	87.08
632.09	108.92
632.501	91.93
632.912	135.62
633.322	169.6
633.733	203.58
634.144	142.9
634.554	193.87
634.965	150.18
635.375	184.17
635.785	174.46
636.196	235.14
636.606	181.74
637.016	198.73
637.427	138.05
637.837	198.73
638.247	133.19
638.657	128.34
639.067	147.76
639.477	133.19
639.887	169.6
640.297	121.06
640.706	164.75
641.116	189.02
641.526	87.08
641.935	135.62
642.345	96.79
642.755	108.92
643.164	111.35
643.573	121.06
643.983	125.91
644.392	147.76
644.801	189.02
645.211	150.18
645.62	169.6
646.029	189.02
646.438	65.23
646.847	220.57
647.256	133.19
647.665	118.63
648.074	140.48
648.483	113.78
648.892	181.74
649.3	172.03
649.709	118.63
650.118	150.18
650.526	99.21
650.935	108.92
651.343	152.61
651.752	201.16
652.16	189.02
652.568	67.66
652.977	150.18
653.385	193.87
653.793	174.46
654.201	135.62
654.609	142.9
655.017	174.46
655.425	162.32
655.833	113.78
656.241	87.08
656.649	196.3
657.057	152.61
657.464	159.89
657.872	99.21
658.28	113.78
658.687	135.62
659.095	138.05
659.502	193.87
659.91	104.07
660.317	145.33
660.724	162.32
661.132	128.34
661.539	164.75
661.946	189.02
662.353	159.89
662.76	138.05
663.167	106.49
663.574	128.34
663.981	186.59
664.388	89.5
664.795	152.61
665.202	162.32
665.608	89.5
666.015	179.31
666.422	203.58
666.828	179.31
667.235	169.6
667.641	140.48
668.047	167.17
668.454	174.46
668.86	215.72
669.266	196.3
669.673	142.9
670.079	198.73
670.485	94.36
670.891	72.51
671.297	142.9
671.703	176.88
672.109	133.19
672.515	186.59
672.92	208.44
673.326	128.34
673.732	167.17
674.138	201.16
674.543	179.31
674.949	125.91
675.354	186.59
675.76	198.73
676.165	94.36
676.57	128.34
676.976	152.61
677.381	186.59
677.786	179.31
678.191	203.58
678.596	121.06
679.001	155.04
679.406	123.48
679.811	225.43
680.216	215.72
680.621	193.87
681.026	145.33
681.43	135.62
681.835	162.32
682.24	157.47
682.644	172.03
683.049	159.89
683.453	135.62
683.858	169.6
684.262	72.51
684.667	89.5
685.071	108.92
685.475	196.3
685.879	198.73
686.283	189.02
686.687	142.9
687.091	179.31
687.495	145.33
687.899	138.05
688.303	186.59
688.707	179.31
689.111	184.17
689.514	125.91
689.918	184.17
690.322	155.04
690.725	167.17
691.129	155.04
691.532	174.46
691.936	113.78
692.339	223
692.742	162.32
693.146	206.01
693.549	159.89
693.952	164.75
694.355	155.04
694.758	150.18
695.161	104.07
695.564	169.6
695.967	218.15
696.37	203.58
696.773	138.05
697.175	208.44
697.578	181.74
697.981	186.59
698.383	254.55
698.786	203.58
699.188	138.05
699.591	121.06
699.993	157.47
700.395	106.49
700.798	135.62
701.2	128.34
701.602	111.35
702.004	218.15
702.406	138.05
702.808	215.72
703.21	191.45
703.612	247.27
704.014	164.75
704.416	232.71
704.818	269.12
705.219	181.74
705.621	128.34
706.023	215.72
706.424	218.15
706.826	145.33
707.227	176.88
707.629	152.61
708.03	67.66
708.431	186.59
708.832	225.43
709.234	215.72
709.635	147.76
710.036	186.59
710.437	191.45
710.838	174.46
711.239	191.45
711.64	150.18
712.041	203.58
712.441	249.7
712.842	259.41
713.243	264.26
713.643	210.86
714.044	203.58
714.445	162.32
714.845	244.85
715.246	269.12
715.646	244.85
716.046	252.13
716.447	254.55
716.847	249.7
717.247	273.97
717.647	203.58
718.047	300.67
718.447	283.68
718.847	261.84
719.247	266.69
719.647	371.06
720.047	298.24
720.446	317.66
720.846	339.51
721.246	247.27
721.645	324.94
722.045	385.62
722.444	324.94
722.844	402.62
723.243	337.08
723.643	390.48
724.042	351.64
724.441	375.92
724.84	383.2
725.24	412.32
725.639	358.93
726.038	497.28
726.437	458.44
726.836	465.72
727.234	477.86
727.633	499.7
728.032	572.52
728.431	577.38
728.83	625.92
729.228	655.05
729.627	681.75
730.025	720.58
730.424	783.69
730.822	888.06
731.22	895.34
731.619	924.47
732.017	1036.12
732.415	1191.46
732.813	1169.62
733.212	1259.42
733.61	1356.51
734.008	1589.53
734.406	1574.96
734.803	1696.32
735.201	1892.93
735.599	1883.22
735.997	1982.74
736.395	2133.22
736.792	2397.79
737.19	2524.01
737.587	2497.31
737.985	2560.42
738.382	2807.99
738.78	3011.88
739.177	3070.13
739.574	3235.18
739.971	3337.13
740.369	3494.9
740.766	3895.39
741.163	3732.76
741.56	3985.2
741.957	4174.52
742.354	4395.4
742.751	4616.27
743.147	4808.02
743.544	4832.3
743.941	5021.62
744.338	5575.03
744.734	5829.88
745.131	6011.93
745.527	6230.38
745.924	6684.27
746.32	6956.12
746.716	7317.77
747.113	7349.33
747.509	7958.56
747.905	8237.69
748.301	8582.35
748.697	9021.68
749.093	9259.55
749.489	9771.69
749.885	10184.32
750.281	10924.62
750.677	11380.94
751.073	11553.27
751.468	12410.08
751.864	12973.2
752.26	13264.47
752.655	13880.98
753.051	14130.98
753.446	15291.2
753.842	15470.81
754.237	16635.88
754.632	16322.77
755.028	16779.08
755.423	17524.24
755.818	17436.86
756.213	17752.4
756.608	18451.44
757.003	18339.79
757.398	18665.04
757.793	19286.4
758.188	19264.56
758.583	19441.75
758.977	19759.71
759.372	20740.31
759.767	21679.65
760.161	22257.32
760.556	23473.36
760.95	24708.82
761.345	25276.79
761.739	26264.67
762.133	26798.66
762.527	28517.13
762.922	28594.8
763.316	29597.24
763.71	29915.21
764.104	30293.86
764.498	31099.69
764.892	32017.18
765.286	32781.76
765.68	33017.2
766.073	33810.9
766.467	34017.22
766.861	34844.9
767.255	35825.5
767.648	36670.17
768.042	37925.04
768.435	38143.49
768.829	38949.33
769.222	39376.52
769.615	40051.29
770.008	40245.47
770.402	40692.08
770.795	41063.44
771.188	41449.37
771.581	41558.6
771.974	41595
772.367	40442.07
772.76	40383.82
773.153	39837.69
773.545	39514.87
773.938	39942.07
774.331	40136.24
774.724	40471.2
775.116	42946.97
775.509	43599.89
775.901	44716.41
776.294	45153.31
776.686	47090.23
777.078	47723.74
777.471	48815.99
777.863	49432.5
778.255	50597.57
778.647	52134
779.039	52937.41
779.431	51177.68
779.823	51388.85
780.215	52311.19
780.607	52357.31
780.999	53119.45
781.39	52820.91
781.782	52985.96
782.174	52898.58
782.565	53199.55
782.957	53709.27
783.348	54320.93
783.74	54828.22
784.131	53803.93
784.522	53697.13
784.914	54250.54
785.305	54117.04
785.696	53765.1
786.087	53158.29
786.478	52786.93
786.869	52201.96
787.26	50680.1
787.651	49801.44
788.042	48427.63
788.433	48937.35
788.823	47789.27
789.214	46277.12
789.605	43985.82
789.995	43755.23
790.386	43189.69
790.776	42058.6
791.167	41507.62
791.557	42561.04
791.948	43556.2
792.338	42374.14
792.728	43485.81
793.118	44252.81
793.508	44811.07
793.898	45017.39
794.288	44233.39
794.678	44667.87
795.068	45721.28
795.458	44684.86
795.848	44947
796.238	44837.77
796.627	44449.42
797.017	44133.88
797.406	43449.4
797.796	42456.67
798.185	43876.59
798.575	43794.07
798.964	42963.96
799.354	43429.98
799.743	43896.01
800.132	44595.05
800.521	43764.94
800.91	43883.87
801.299	44107.18
801.688	44075.62
802.077	42881.43
802.466	43107.16
802.855	43374.16
803.244	42563.47
803.633	41459.08
804.021	40041.58
804.41	40444.5
804.799	39925.07
805.187	38213.88
805.576	36682.31
805.964	35747.83
806.352	34611.89
806.741	34199.26
807.129	33281.77
807.517	34104.6
807.905	33742.94
808.293	33548.76
808.681	32776.91
809.069	32772.05
809.457	34689.56
809.845	33891
810.233	33534.2
810.621	34483.24
811.009	34565.77
811.396	34524.51
811.784	33631.29
812.171	34284.21
812.559	34330.33
812.946	33094.87
813.334	31835.14
813.721	31444.36
814.108	31878.83
814.496	31420.09
814.883	30208.9
815.27	30810.86
815.657	30432.21
816.044	30699.2
816.431	30218.61
816.818	30165.21
817.205	30553.57
817.592	30461.34
817.979	28837.52
818.365	29153.06
818.752	28322.95
819.139	27213.71
819.525	26330.2
819.912	25890.88
820.298	25762.23
820.685	24985.52
821.071	24196.67
821.457	23878.71
821.843	23203.94
822.23	22490.34
822.616	21116.53
823.002	20213.6
823.388	19677.19
823.774	19148.05
824.16	18201.44
824.546	17900.46
824.931	17458.71
825.317	17109.19
825.703	16776.66
826.089	16679.57
826.474	16725.68
826.86	16109.17
827.245	15681.98
827.631	15888.29
828.016	15643.14
828.401	15177.12
828.787	15157.7
829.172	14577.59
829.557	14502.35
829.942	13927.1
830.327	13485.34
830.712	13502.33
831.097	12725.62
831.482	12701.35
831.867	12058.14
832.252	11844.54
832.636	12004.74
833.021	11478.03
833.406	11150.36
833.79	11181.91
834.175	11099.38
834.559	10650.35
834.944	10410.05
835.328	10407.63
835.713	10031.41
836.097	9521.69
836.481	9453.73
836.865	9298.38
837.249	8953.72
837.633	8538.66
838.017	8507.11
838.401	8072.64
838.785	7565.35
839.169	7480.4
839.553	7193.98
839.937	6956.12
840.32	6633.29
840.704	6409.99
841.087	6065.32
841.471	5829.88
841.854	5519.2
842.238	5363.86
842.621	5339.59
843.004	5142.98
843.388	5128.42
843.771	4822.59
844.154	4737.63
844.537	4747.34
844.92	4834.72
845.303	4545.88
845.686	4681.81
846.069	4356.56
846.452	4334.72
846.834	4264.33
847.217	4058.01
847.6	3934.22
847.982	4014.32
848.365	3936.65
848.748	3858.98
849.13	3713.35
849.512	3538.59
849.895	3494.9
850.277	3424.51
850.659	3329.85
851.041	3281.3
851.423	3186.64
851.806	3138.09
852.188	3140.52
852.57	3087.12
852.951	2997.32
853.333	2824.98
853.715	2861.39
854.097	2737.6
854.479	2642.94
854.86	2591.97
855.242	2327.4
855.623	2329.83
856.005	2266.72
856.386	2121.09
856.768	2065.26
857.149	2060.41
857.53	1958.46
857.911	1943.9
858.292	1912.35
858.674	1749.72
859.055	1601.66
859.436	1531.27
859.817	1482.73
860.197	1412.34
860.578	1337.1
860.959	1341.95
861.34	1276.42
861.72	1356.51
862.101	1145.35
862.482	1278.84
862.862	1184.18
863.243	1067.67
863.623	1123.5
864.003	987.58
864.384	1011.85
864.764	958.45
865.144	924.47
865.524	941.46
865.904	812.82
866.284	839.52
866.664	841.94
867.044	875.92
867.424	756.99
867.804	674.46
868.183	710.87
868.563	778.83
868.943	737.57
869.322	645.34
869.702	676.89
870.081	591.94
870.461	555.53
870.84	557.96
871.22	509.41
871.599	540.97
871.978	555.53
872.357	511.84
872.736	528.83
873.115	429.31
873.494	426.89
873.873	429.31
874.252	463.3
874.631	405.04
875.01	332.23
875.388	373.49
875.767	344.36
876.146	366.21
876.524	378.34
876.903	349.22
877.281	286.11
877.66	286.11
878.038	303.1
878.416	278.83
878.794	351.64
879.173	247.27
879.551	332.23
879.929	266.69
880.307	239.99
880.685	322.52
881.063	264.26
881.441	235.14
881.818	203.58
882.196	208.44
882.574	278.83
882.951	249.7
883.329	261.84
883.707	213.29
884.084	193.87
884.461	244.85
884.839	174.46
885.216	150.18
885.593	189.02
885.971	232.71
886.348	186.59
886.725	201.16
887.102	252.13
887.479	176.88
887.856	232.71
888.233	213.29
888.609	189.02
888.986	210.86
889.363	198.73
889.74	147.76
890.116	135.62
890.493	184.17
890.869	232.71
891.246	218.15
891.622	189.02
891.998	191.45
892.375	254.55
892.751	155.04
893.127	176.88
893.503	167.17
893.879	162.32
894.255	155.04
894.631	181.74
895.007	169.6
895.383	155.04
895.759	162.32
896.134	181.74
896.51	150.18
896.886	164.75
897.261	123.48
897.637	94.36
898.012	113.78
898.388	176.88
898.763	101.64
899.138	176.88
899.514	116.2
899.889	162.32
900.264	159.89
900.639	215.72
901.014	174.46
901.389	87.08
901.764	111.35
902.139	157.47
902.513	108.92
902.888	150.18
903.263	152.61
903.638	176.88
904.012	111.35
904.387	72.51
904.761	201.16
905.136	186.59
905.51	135.62
905.884	172.03
906.259	101.64
906.633	60.38
907.007	135.62
907.381	172.03
907.755	184.17
908.129	130.77
908.503	113.78
908.877	60.38
909.251	155.04
909.624	184.17
909.998	111.35
910.372	79.79
910.745	101.64
911.119	147.76
911.492	176.88
911.866	159.89
912.239	123.48
912.612	84.65
912.986	113.78
913.359	82.22
913.732	128.34
914.105	99.21
914.478	140.48
914.851	133.19
915.224	65.23
915.597	179.31
915.97	189.02
916.343	101.64
916.715	106.49
917.088	142.9
917.461	159.89
917.833	155.04
918.206	142.9
918.578	140.48
918.951	23.97
919.323	189.02
919.695	203.58
920.067	167.17
920.44	133.19
920.812	155.04
921.184	181.74
921.556	159.89
921.928	169.6
922.3	113.78
922.672	164.75
923.043	135.62
923.415	181.74
923.787	150.18
924.158	128.34
924.53	48.24
924.901	121.06
925.273	150.18
925.644	118.63
926.016	150.18
926.387	138.05
926.758	104.07
927.129	108.92
927.5	70.09
927.872	87.08
928.243	130.77
928.613	121.06
928.984	145.33
929.355	91.93
929.726	113.78
930.097	91.93
930.467	108.92
930.838	123.48
931.209	135.62
931.579	89.5
931.95	201.16
932.32	155.04
932.69	84.65
933.061	108.92
933.431	176.88
933.801	133.19
934.171	118.63
934.541	147.76
934.911	142.9
935.281	121.06
935.651	72.51
936.021	159.89
936.391	121.06
936.761	96.79
937.13	142.9
937.5	118.63
937.87	113.78
938.239	111.35
938.609	142.9
938.978	116.2
939.347	135.62
939.717	116.2
940.086	128.34
940.455	96.79
940.824	118.63
941.193	164.75
941.562	189.02
941.931	164.75
942.3	116.2
942.669	189.02
943.038	96.79
943.407	145.33
943.775	79.79
944.144	179.31
944.513	210.86
944.881	123.48
945.25	223
945.618	101.64
945.986	176.88
946.355	191.45
946.723	172.03
947.091	67.66
947.459	213.29
947.827	140.48
948.195	118.63
948.563	106.49
948.931	91.93
949.299	159.89
949.667	104.07
950.035	135.62
950.402	155.04
950.77	145.33
951.138	99.21
951.505	91.93
951.873	140.48
952.24	237.56
952.607	191.45
952.975	145.33
953.342	189.02
953.709	164.75
954.076	65.23
954.443	72.51
954.81	172.03
955.177	125.91
955.544	147.76
955.911	101.64
956.278	162.32
956.645	208.44
957.012	181.74
957.378	184.17
957.745	87.08
958.111	104.07
958.478	186.59
958.844	198.73
959.211	108.92
959.577	172.03
959.943	84.65
960.309	142.9
960.675	157.47
961.042	133.19
961.408	138.05
961.774	140.48
962.139	150.18
962.505	145.33
962.871	106.49
963.237	135.62
963.603	130.77
963.968	77.37
964.334	210.86
964.699	106.49
965.065	116.2
965.43	121.06
965.796	147.76
966.161	116.2
966.526	152.61
966.891	118.63
967.256	184.17
967.622	74.94
967.987	108.92
968.352	125.91
968.716	184.17
969.081	96.79
969.446	133.19
969.811	130.77
970.176	140.48
970.54	181.74
970.905	152.61
971.269	176.88
971.634	193.87
971.998	133.19
972.363	164.75
972.727	176.88
973.091	116.2
973.455	87.08
973.819	94.36
974.183	130.77
974.547	159.89
974.911	106.49
975.275	84.65
975.639	72.51
976.003	145.33
976.367	67.66
976.73	213.29
977.094	106.49
977.458	218.15
977.821	67.66
978.185	138.05
978.548	157.47
978.911	128.34
979.275	203.58
979.638	130.77
980.001	111.35
980.364	176.88
980.727	147.76
981.09	189.02
981.453	186.59
981.816	106.49
982.179	164.75
982.542	125.91
982.905	87.08
983.267	72.51
983.63	140.48
983.992	138.05
984.355	121.06
984.717	108.92
985.08	106.49
985.442	123.48
985.804	104.07
986.167	133.19
986.529	130.77
986.891	155.04
987.253	106.49
987.615	101.64
987.977	167.17
988.339	84.65
988.701	79.79
989.062	89.5
989.424	152.61
989.786	101.64
990.147	169.6
990.509	164.75
990.87	152.61
991.232	77.37
991.593	111.35
991.955	172.03
992.316	152.61
992.677	77.37
993.038	113.78
993.399	99.21
993.76	133.19
994.121	186.59
994.482	123.48
994.843	138.05
995.204	196.3
995.565	147.76
995.926	157.47
996.286	77.37
996.647	118.63
997.007	128.34
997.368	140.48
997.728	145.33
998.089	118.63
998.449	118.63
998.809	111.35
999.169	101.64
999.53	94.36
999.89	167.17
1000.25	159.89
1000.61	145.33
1000.97	225.43
1001.329	215.72
1001.689	91.93
1002.049	96.79
1002.409	135.62
1002.768	128.34
1003.128	116.2
1003.487	106.49
1003.847	208.44
1004.206	142.9
1004.566	55.52
1004.925	201.16
1005.284	147.76
1005.643	72.51
1006.003	169.6
1006.362	135.62
1006.721	155.04
1007.08	84.65
1007.438	140.48
1007.797	118.63
1008.156	87.08
1008.515	167.17
1008.874	140.48
1009.232	123.48
1009.591	108.92
1009.949	147.76
1010.308	145.33
1010.666	159.89
1011.024	138.05
1011.383	89.5
1011.741	169.6
1012.099	142.9
1012.457	135.62
1012.815	94.36
1013.173	89.5
1013.531	67.66
1013.889	138.05
1014.247	116.2
1014.605	193.87
1014.962	140.48
1015.32	106.49
1015.678	133.19
1016.035	157.47
1016.393	152.61
1016.75	142.9
1017.107	152.61
1017.465	138.05
1017.822	79.79
1018.179	172.03
1018.536	142.9
1018.894	108.92
1019.251	191.45
1019.608	130.77
1019.964	196.3
1020.321	215.72
1020.678	106.49
1021.035	125.91
1021.392	186.59
1021.748	142.9
1022.105	96.79
1022.461	142.9
1022.818	94.36
1023.174	121.06
1023.531	157.47
1023.887	140.48
1024.243	186.59
1024.599	167.17
1024.955	91.93
1025.311	147.76
1025.667	138.05
1026.023	152.61
1026.379	123.48
1026.735	108.92
1027.091	118.63
1027.447	164.75
