189.514	87.08
189.973	87.08
190.431	87.08
190.889	4.55
191.348	23.97
191.806	6.98
192.264	9.41
192.722	-68.27
193.18	6.98
193.638	2.12
194.096	-46.42
194.554	-34.28
195.012	-39.14
195.47	-14.87
195.928	-5.16
196.385	-31.86
196.843	31.25
197.301	16.69
197.758	28.82
198.216	45.81
198.674	45.81
199.131	53.1
199.589	79.79
200.046	72.51
200.503	113.78
200.961	87.08
201.418	79.79
201.875	130.77
202.332	140.48
202.79	79.79
203.247	57.95
203.704	116.2
204.161	198.73
204.618	116.2
205.075	210.86
205.532	128.34
205.989	101.64
206.445	174.46
206.902	116.2
207.359	218.15
207.816	128.34
208.272	223
208.729	247.27
209.185	169.6
209.642	138.05
210.098	152.61
210.555	227.86
211.011	181.74
211.467	215.72
211.924	198.73
212.38	145.33
212.836	138.05
213.292	101.64
213.748	123.48
214.204	142.9
214.66	169.6
215.116	181.74
215.572	145.33
216.028	164.75
216.484	169.6
216.94	172.03
217.396	94.36
217.851	157.47
218.307	104.07
218.763	159.89
219.218	186.59
219.674	174.46
220.129	123.48
220.585	162.32
221.04	72.51
221.496	128.34
221.951	150.18
222.406	152.61
222.861	87.08
223.317	167.17
223.772	133.19
224.227	116.2
224.682	157.47
225.137	123.48
225.592	111.35
226.047	145.33
226.502	147.76
226.957	60.38
227.411	152.61
227.866	133.19
228.321	169.6
228.776	189.02
229.23	157.47
229.685	167.17
230.139	198.73
230.594	162.32
231.048	157.47
231.503	150.18
231.957	113.78
232.411	125.91
232.865	142.9
233.32	138.05
233.774	147.76
234.228	135.62
234.682	125.91
235.136	53.1
235.59	145.33
236.044	82.22
236.498	152.61
236.952	125.91
237.406	264.26
237.86	118.63
238.313	169.6
238.767	147.76
239.221	174.46
239.674	213.29
240.128	118.63
240.581	121.06
241.035	150.18
241.488	94.36
241.942	67.66
242.395	215.72
242.848	145.33
243.301	142.9
243.755	172.03
244.208	201.16
244.661	179.31
245.114	79.79
245.567	101.64
246.02	147.76
246.473	50.67
246.926	55.52
247.379	164.75
247.832	201.16
248.284	138.05
248.737	196.3
249.19	121.06
249.642	111.35
250.095	140.48
250.547	155.04
251	167.17
251.452	191.45
251.905	184.17
252.357	116.2
252.81	140.48
253.262	142.9
253.714	196.3
254.166	172.03
254.618	157.47
255.07	162.32
255.523	164.75
255.975	193.87
256.427	96.79
256.878	198.73
257.33	106.49
257.782	181.74
258.234	237.56
258.686	227.86
259.137	191.45
259.589	196.3
260.041	33.68
260.492	135.62
260.944	140.48
261.395	179.31
261.847	215.72
262.298	208.44
262.749	82.22
263.201	155.04
263.652	113.78
264.103	203.58
264.554	60.38
265.005	140.48
265.457	140.48
265.908	125.91
266.359	101.64
266.809	152.61
267.26	164.75
267.711	167.17
268.162	79.79
268.613	113.78
269.064	152.61
269.514	87.08
269.965	113.78
270.415	167.17
270.866	196.3
271.316	130.77
271.767	176.88
272.217	189.02
272.668	138.05
273.118	155.04
273.568	140.48
274.019	167.17
274.469	99.21
274.919	186.59
275.369	201.16
275.819	89.5
276.269	176.88
276.719	169.6
277.169	142.9
277.619	142.9
278.069	82.22
278.518	145.33
278.968	210.86
279.418	208.44
279.867	108.92
280.317	179.31
280.767	140.48
281.216	218.15
281.666	142.9
282.115	172.03
282.564	203.58
283.014	150.18
283.463	155.04
283.912	203.58
284.361	79.79
284.811	181.74
285.26	186.59
285.709	125.91
286.158	108.92
286.607	130.77
287.056	164.75
287.505	252.13
287.953	150.18
288.402	164.75
288.851	201.16
289.3	145.33
289.748	206.01
290.197	152.61
290.646	196.3
291.094	140.48
291.543	159.89
291.991	74.94
292.439	101.64
292.888	184.17
293.336	135.62
293.784	118.63
294.233	121.06
294.681	152.61
295.129	155.04
295.577	145.33
296.025	111.35
296.473	159.89
296.921	130.77
297.369	269.12
297.817	87.08
298.264	128.34
298.712	128.34
299.16	218.15
299.608	130.77
300.055	198.73
300.503	113.78
300.95	142.9
301.398	145.33
301.845	157.47
302.293	125.91
302.74	150.18
303.187	232.71
303.635	242.42
304.082	172.03
304.529	176.88
304.976	150.18
305.423	138.05
305.87	130.77
306.317	193.87
306.764	210.86
307.211	116.2
307.658	230.28
308.105	196.3
308.552	159.89
308.998	118.63
309.445	145.33
309.892	142.9
310.338	218.15
310.785	104.07
311.231	118.63
311.678	196.3
312.124	176.88
312.571	152.61
313.017	60.38
313.463	138.05
313.909	162.32
314.356	118.63
314.802	176.88
315.248	179.31
315.694	140.48
316.14	152.61
316.586	152.61
317.032	198.73
317.478	125.91
317.923	162.32
318.369	179.31
318.815	138.05
319.261	65.23
319.706	155.04
320.152	186.59
320.597	157.47
321.043	184.17
321.488	164.75
321.934	116.2
322.379	169.6
322.824	196.3
323.27	159.89
323.715	162.32
324.16	152.61
324.605	111.35
325.05	150.18
325.495	176.88
325.94	184.17
326.385	206.01
326.83	174.46
327.275	152.61
327.72	123.48
328.165	145.33
328.61	130.77
329.054	167.17
329.499	169.6
329.943	191.45
330.388	135.62
330.832	140.48
331.277	162.32
331.721	176.88
332.166	157.47
332.61	157.47
333.054	172.03
333.499	123.48
333.943	157.47
334.387	133.19
334.831	172.03
335.275	157.47
335.719	157.47
336.163	189.02
336.607	176.88
337.051	138.05
337.495	133.19
337.938	111.35
338.382	125.91
338.826	121.06
339.269	155.04
339.713	155.04
340.157	79.79
340.6	196.3
341.044	206.01
341.487	162.32
341.93	162.32
342.374	121.06
342.817	181.74
343.26	157.47
343.703	142.9
344.146	106.49
344.59	164.75
345.033	162.32
345.476	142.9
345.919	237.56
346.361	125.91
346.804	135.62
347.247	140.48
347.69	121.06
348.133	77.37
348.575	121.06
349.018	164.75
349.461	164.75
349.903	106.49
350.346	189.02
350.788	152.61
351.23	179.31
351.673	181.74
352.115	135.62
352.557	84.65
353	174.46
353.442	198.73
353.884	130.77
354.326	142.9
354.768	123.48
355.21	174.46
355.652	82.22
356.094	91.93
356.536	125.91
356.978	104.07
357.419	128.34
357.861	181.74
358.303	181.74
358.744	157.47
359.186	220.57
359.627	152.61
360.069	181.74
360.51	133.19
360.952	206.01
361.393	108.92
361.834	106.49
362.276	70.09
362.717	123.48
363.158	218.15
363.599	157.47
364.04	138.05
364.481	133.19
364.922	157.47
365.363	147.76
365.804	225.43
366.245	147.76
366.686	104.07
367.126	128.34
367.567	225.43
368.008	176.88
368.448	145.33
368.889	77.37
369.33	208.44
369.77	176.88
370.21	223
370.651	184.17
371.091	150.18
371.531	123.48
371.972	186.59
372.412	138.05
372.852	176.88
373.292	121.06
373.732	157.47
374.172	116.2
374.612	113.78
375.052	133.19
375.492	174.46
375.932	184.17
376.372	118.63
376.811	140.48
377.251	191.45
377.691	162.32
378.13	159.89
378.57	213.29
379.009	159.89
379.449	108.92
379.888	142.9
380.328	125.91
380.767	196.3
381.206	121.06
381.645	189.02
382.085	152.61
382.524	89.5
382.963	215.72
383.402	140.48
383.841	147.76
384.28	138.05
384.719	167.17
385.158	162.32
385.596	133.19
386.035	82.22
386.474	128.34
386.913	191.45
387.351	172.03
387.79	140.48
388.228	176.88
388.667	140.48
389.105	206.01
389.544	169.6
389.982	150.18
390.42	164.75
390.859	181.74
391.297	167.17
391.735	145.33
392.173	91.93
392.611	184.17
393.049	203.58
393.487	167.17
393.925	113.78
394.363	210.86
394.801	213.29
395.239	206.01
395.676	89.5
396.114	96.79
396.552	152.61
396.989	162.32
397.427	152.61
397.864	125.91
398.302	179.31
398.739	215.72
399.177	184.17
399.614	191.45
400.051	116.2
400.488	121.06
400.926	130.77
401.363	72.51
401.8	184.17
402.237	191.45
402.674	172.03
403.111	116.2
403.548	169.6
403.985	101.64
404.421	128.34
404.858	118.63
405.295	167.17
405.732	113.78
406.168	135.62
406.605	218.15
407.041	147.76
407.478	116.2
407.914	162.32
408.351	147.76
408.787	123.48
409.223	152.61
409.66	118.63
410.096	230.28
410.532	164.75
410.968	36.1
411.404	108.92
411.84	145.33
412.276	186.59
412.712	145.33
413.148	206.01
413.584	91.93
414.02	118.63
414.455	215.72
414.891	164.75
415.327	169.6
415.762	186.59
416.198	133.19
416.633	116.2
417.069	172.03
417.504	130.77
417.94	213.29
418.375	174.46
418.81	123.48
419.245	157.47
419.681	150.18
420.116	164.75
420.551	186.59
420.986	155.04
421.421	198.73
421.856	145.33
422.291	138.05
422.726	176.88
423.16	157.47
423.595	142.9
424.03	104.07
424.464	186.59
424.899	135.62
425.334	135.62
425.768	94.36
426.203	150.18
426.637	130.77
427.071	150.18
427.506	169.6
427.94	159.89
428.374	135.62
428.809	203.58
429.243	191.45
429.677	181.74
430.111	128.34
430.545	84.65
430.979	181.74
431.413	94.36
431.847	254.55
432.28	155.04
432.714	142.9
433.148	91.93
433.582	152.61
434.015	113.78
434.449	135.62
434.882	167.17
435.316	206.01
435.749	106.49
436.183	189.02
436.616	155.04
437.049	215.72
437.483	184.17
437.916	179.31
438.349	186.59
438.782	140.48
439.215	111.35
439.648	210.86
440.081	172.03
440.514	142.9
440.947	159.89
441.38	113.78
441.813	140.48
442.245	256.98
442.678	218.15
443.111	181.74
443.543	232.71
443.976	220.57
444.408	196.3
444.841	135.62
445.273	203.58
445.705	210.86
446.138	203.58
446.57	210.86
447.002	179.31
447.434	264.26
447.867	201.16
448.299	201.16
448.731	247.27
449.163	125.91
449.595	249.7
450.026	256.98
450.458	247.27
450.89	179.31
451.322	179.31
451.754	237.56
452.185	261.84
452.617	213.29
453.048	266.69
453.48	227.86
453.911	293.39
454.343	293.39
454.774	220.57
455.205	273.97
455.637	247.27
456.068	225.43
456.499	210.86
456.93	215.72
457.361	196.3
457.792	254.55
458.223	286.11
458.654	261.84
459.085	269.12
459.516	208.44
459.947	276.4
460.378	312.81
460.808	259.41
461.239	322.52
461.669	288.54
462.1	203.58
462.531	273.97
462.961	172.03
463.391	329.8
463.822	210.86
464.252	252.13
464.682	235.14
465.113	242.42
465.543	232.71
465.973	259.41
466.403	138.05
466.833	244.85
467.263	223
467.693	169.6
468.123	235.14
468.553	259.41
468.983	230.28
469.412	223
469.842	315.24
470.272	276.4
470.701	213.29
471.131	230.28
471.56	196.3
471.99	184.17
472.419	174.46
472.849	213.29
473.278	184.17
473.707	215.72
474.136	239.99
474.566	256.98
474.995	169.6
475.424	223
475.853	189.02
476.282	174.46
476.711	155.04
477.14	181.74
477.569	147.76
477.997	196.3
478.426	206.01
478.855	215.72
479.283	203.58
479.712	220.57
480.141	210.86
480.569	220.57
480.998	130.77
481.426	184.17
481.854	123.48
482.283	215.72
482.711	235.14
483.139	218.15
483.567	138.05
483.995	235.14
484.424	198.73
484.852	152.61
485.28	193.87
485.708	220.57
486.135	223
486.563	242.42
486.991	123.48
487.419	133.19
487.847	206.01
488.274	186.59
488.702	116.2
489.129	179.31
489.557	181.74
489.984	184.17
490.412	298.24
490.839	196.3
491.266	206.01
491.694	152.61
492.121	256.98
492.548	191.45
492.975	162.32
493.402	191.45
493.829	167.17
494.256	201.16
494.683	162.32
495.11	189.02
495.537	206.01
495.964	213.29
496.39	193.87
496.817	189.02
497.244	179.31
497.67	184.17
498.097	220.57
498.523	213.29
498.95	223
499.376	237.56
499.803	118.63
500.229	140.48
500.655	181.74
501.081	235.14
501.508	208.44
501.934	220.57
502.36	179.31
502.786	162.32
503.212	208.44
503.638	106.49
504.064	169.6
504.489	176.88
504.915	118.63
505.341	208.44
505.767	184.17
506.192	179.31
506.618	167.17
507.043	172.03
507.469	164.75
507.894	230.28
508.32	162.32
508.745	223
509.17	201.16
509.596	232.71
510.021	155.04
510.446	162.32
510.871	196.3
511.296	147.76
511.721	147.76
512.146	111.35
512.571	206.01
512.996	215.72
513.421	138.05
513.845	157.47
514.27	157.47
514.695	145.33
515.119	140.48
515.544	118.63
515.969	184.17
516.393	198.73
516.817	130.77
517.242	159.89
517.666	186.59
518.09	181.74
518.515	142.9
518.939	164.75
519.363	358.93
519.787	208.44
520.211	223
520.635	140.48
521.059	155.04
521.483	159.89
521.907	176.88
522.331	174.46
522.754	172.03
523.178	215.72
523.602	198.73
524.025	206.01
524.449	254.55
524.872	237.56
525.296	172.03
525.719	142.9
526.143	281.25
526.566	176.88
526.989	184.17
527.412	208.44
527.836	150.18
528.259	159.89
528.682	174.46
529.105	181.74
529.528	213.29
529.951	169.6
530.374	155.04
530.796	140.48
531.219	74.94
531.642	172.03
532.065	215.72
532.487	172.03
532.91	179.31
533.332	191.45
533.755	145.33
534.177	135.62
534.6	152.61
535.022	169.6
535.444	191.45
535.867	198.73
536.289	249.7
536.711	203.58
537.133	208.44
537.555	215.72
537.977	147.76
538.399	113.78
538.821	169.6
539.243	142.9
539.665	203.58
540.086	140.48
540.508	157.47
540.93	232.71
541.351	203.58
541.773	186.59
542.195	230.28
542.616	237.56
543.037	227.86
543.459	213.29
543.88	220.57
544.301	227.86
544.723	179.31
545.144	186.59
545.565	242.42
545.986	256.98
546.407	252.13
546.828	235.14
547.249	239.99
547.67	130.77
548.091	172.03
548.512	184.17
548.932	176.88
549.353	167.17
549.774	159.89
550.194	218.15
550.615	164.75
551.035	169.6
551.456	198.73
551.876	220.57
552.296	223
552.717	186.59
553.137	203.58
553.557	193.87
553.977	121.06
554.397	128.34
554.817	201.16
555.237	189.02
555.657	247.27
556.077	172.03
556.497	191.45
556.917	273.97
557.337	140.48
557.756	254.55
558.176	164.75
558.596	181.74
559.015	116.2
559.435	196.3
559.854	157.47
560.274	72.51
560.693	147.76
561.112	181.74
561.532	203.58
561.951	269.12
562.37	193.87
562.789	232.71
563.208	167.17
563.627	181.74
564.046	164.75
564.465	186.59
564.884	179.31
565.303	128.34
565.722	152.61
566.14	213.29
566.559	140.48
566.978	196.3
567.396	172.03
567.815	218.15
568.233	167.17
568.652	227.86
569.07	201.16
569.489	157.47
569.907	176.88
570.325	176.88
570.743	179.31
571.161	196.3
571.58	142.9
571.998	96.79
572.416	198.73
572.833	208.44
573.251	159.89
573.669	264.26
574.087	157.47
574.505	213.29
574.922	162.32
575.34	179.31
575.758	152.61
576.175	174.46
576.593	140.48
577.01	213.29
577.428	249.7
577.845	1526.42
578.262	256.98
578.68	174.46
579.097	196.3
579.514	264.26
579.931	181.74
580.348	159.89
580.765	235.14
581.182	220.57
581.599	220.57
582.016	172.03
582.433	206.01
582.849	169.6
583.266	247.27
583.683	208.44
584.099	169.6
584.516	239.99
584.933	247.27
585.349	239.99
585.765	167.17
586.182	123.48
586.598	162.32
587.014	164.75
587.431	186.59
587.847	193.87
588.263	155.04
588.679	230.28
589.095	184.17
589.511	218.15
589.927	191.45
590.343	176.88
590.759	218.15
591.174	157.47
591.59	155.04
592.006	138.05
592.421	201.16
592.837	193.87
593.252	147.76
593.668	140.48
594.083	159.89
594.499	162.32
594.914	128.34
595.329	140.48
595.745	94.36
596.16	249.7
596.575	184.17
596.99	147.76
597.405	159.89
597.82	174.46
598.235	201.16
598.65	198.73
599.065	269.12
599.479	210.86
599.894	140.48
600.309	196.3
600.724	145.33
601.138	104.07
601.553	218.15
601.967	128.34
602.382	186.59
602.796	128.34
603.21	152.61
603.625	176.88
604.039	218.15
604.453	130.77
604.867	227.86
605.281	184.17
605.695	162.32
606.109	193.87
606.523	174.46
606.937	152.61
607.351	312.81
607.765	128.34
608.178	230.28
608.592	218.15
609.006	223
609.419	176.88
609.833	206.01
610.246	145.33
610.66	174.46
611.073	164.75
611.487	230.28
611.9	232.71
612.313	172.03
612.726	208.44
613.139	213.29
613.553	210.86
613.966	196.3
614.379	128.34
614.792	227.86
615.204	96.79
615.617	184.17
616.03	172.03
616.443	215.72
616.856	150.18
617.268	162.32
617.681	113.78
618.093	174.46
618.506	152.61
618.918	184.17
619.331	210.86
619.743	225.43
620.155	152.61
620.568	118.63
620.98	128.34
621.392	159.89
621.804	203.58
622.216	118.63
622.628	130.77
623.04	140.48
623.452	164.75
623.864	191.45
624.276	157.47
624.687	113.78
625.099	256.98
625.511	174.46
625.922	225.43
626.334	135.62
626.745	159.89
627.157	206.01
627.568	189.02
627.979	155.04
628.391	181.74
628.802	157.47
629.213	111.35
629.624	125.91
630.035	193.87
630.446	237.56
630.857	167.17
631.268	176.88
631.679	96.79
632.09	142.9
632.501	174.46
632.912	152.61
633.322	172.03
633.733	203.58
634.144	101.64
634.554	145.33
634.965	176.88
635.375	203.58
635.785	210.86
636.196	179.31
636.606	169.6
637.016	157.47
637.427	111.35
637.837	179.31
638.247	210.86
638.657	121.06
639.067	152.61
639.477	155.04
639.887	186.59
640.297	159.89
640.706	181.74
641.116	147.76
641.526	162.32
641.935	184.17
642.345	123.48
642.755	198.73
643.164	133.19
643.573	184.17
643.983	113.78
644.392	189.02
644.801	157.47
645.211	191.45
645.62	164.75
646.029	176.88
646.438	150.18
646.847	138.05
647.256	191.45
647.665	196.3
648.074	145.33
648.483	198.73
648.892	145.33
649.3	208.44
649.709	196.3
650.118	142.9
650.526	162.32
650.935	147.76
651.343	181.74
651.752	249.7
652.16	155.04
652.568	196.3
652.977	111.35
653.385	157.47
653.793	186.59
654.201	193.87
654.609	198.73
655.017	159.89
655.425	121.06
655.833	140.48
656.241	169.6
656.649	181.74
657.057	198.73
657.464	184.17
657.872	203.58
658.28	220.57
658.687	140.48
659.095	123.48
659.502	235.14
659.91	140.48
660.317	174.46
660.724	133.19
661.132	179.31
661.539	186.59
661.946	135.62
662.353	121.06
662.76	189.02
663.167	140.48
663.574	172.03
663.981	164.75
664.388	142.9
664.795	135.62
665.202	108.92
665.608	298.24
666.015	152.61
666.422	198.73
666.828	121.06
667.235	206.01
667.641	164.75
668.047	135.62
668.454	244.85
668.86	106.49
669.266	159.89
669.673	118.63
670.079	167.17
670.485	128.34
670.891	196.3
671.297	172.03
671.703	189.02
672.109	193.87
672.515	225.43
672.92	125.91
673.326	104.07
673.732	128.34
674.138	167.17
674.543	125.91
674.949	150.18
675.354	135.62
675.76	157.47
676.165	150.18
676.57	89.5
676.976	196.3
677.381	162.32
677.786	87.08
678.191	208.44
678.596	101.64
679.001	186.59
679.406	152.61
679.811	140.48
680.216	135.62
680.621	235.14
681.026	113.78
681.43	125.91
681.835	152.61
682.24	130.77
682.644	169.6
683.049	196.3
683.453	157.47
683.858	203.58
684.262	118.63
684.667	162.32
685.071	135.62
685.475	108.92
685.879	108.92
686.283	130.77
686.687	227.86
687.091	179.31
687.495	164.75
687.899	184.17
688.303	142.9
688.707	193.87
689.111	138.05
689.514	121.06
689.918	181.74
690.322	184.17
690.725	118.63
691.129	142.9
691.532	218.15
691.936	133.19
692.339	179.31
692.742	145.33
693.146	174.46
693.549	169.6
693.952	108.92
694.355	150.18
694.758	213.29
695.161	150.18
695.564	138.05
695.967	128.34
696.37	113.78
696.773	201.16
697.175	220.57
697.578	174.46
697.981	215.72
698.383	220.57
698.786	176.88
699.188	121.06
699.591	147.76
699.993	138.05
700.395	118.63
700.798	159.89
701.2	203.58
701.602	193.87
702.004	174.46
702.406	235.14
702.808	125.91
703.21	184.17
703.612	276.4
704.014	133.19
704.416	230.28
704.818	203.58
705.219	237.56
705.621	184.17
706.023	203.58
706.424	225.43
706.826	210.86
707.227	252.13
707.629	208.44
708.03	288.54
708.431	264.26
708.832	232.71
709.234	230.28
709.635	259.41
710.036	334.65
710.437	227.86
710.838	176.88
711.239	196.3
711.64	184.17
712.041	227.86
712.441	225.43
712.842	220.57
713.243	227.86
713.643	327.37
714.044	307.95
714.445	281.25
714.845	320.09
715.246	293.39
715.646	252.13
716.046	256.98
716.447	293.39
716.847	259.41
717.247	271.55
717.647	256.98
718.047	315.24
718.447	354.07
718.847	329.8
719.247	288.54
719.647	392.91
720.047	341.93
720.446	390.48
720.846	303.1
721.246	312.81
721.645	443.88
722.045	356.5
722.444	312.81
722.844	385.62
723.243	385.62
723.643	422.03
724.042	409.9
724.441	422.03
724.84	395.33
725.24	456.01
725.639	458.44
726.038	506.99
726.437	436.6
726.836	504.56
727.234	499.7
727.633	599.22
728.032	545.82
728.431	572.52
728.83	519.12
729.228	613.78
729.627	606.5
730.025	601.65
730.424	676.89
730.822	689.03
731.22	788.54
731.619	810.39
732.017	851.65
732.415	900.2
732.813	941.46
733.212	1002.14
733.61	1116.22
734.008	1070.1
734.406	1210.88
734.803	1278.84
735.201	1390.49
735.599	1337.1
735.997	1523.99
736.395	1577.39
736.792	1761.86
737.19	1667.2
737.587	1790.99
737.985	1832.25
738.382	2028.85
738.78	2281.29
739.177	2133.22
739.574	2261.87
739.971	2448.76
740.369	2638.09
740.766	2703.62
741.163	2764.3
741.56	2679.35
741.957	3009.45
742.354	3257.03
742.751	3320.14
743.147	3261.88
743.544	3363.83
743.941	3861.41
744.338	4128.4
744.734	3895.39
745.131	4072.58
745.527	4570.16
745.924	5072.59
746.32	4980.36
746.716	4822.59
747.113	5305.6
747.509	6072.61
747.905	6308.05
748.301	5987.65
748.697	5977.94
749.093	6565.33
749.489	7145.44
749.885	7599.33
750.281	7424.57
750.677	7606.61
751.073	8458.57
751.468	9288.68
751.864	9252.27
752.26	8570.22
752.655	9206.15
753.051	10528.99
753.446	11329.97
753.842	10907.63
754.237	10504.71
754.632	11283.85
755.028	12167.36
755.423	12565.43
755.818	11596.96
756.213	11766.87
756.608	12616.4
757.003	13817.87
757.398	13317.86
757.793	12429.5
758.188	12589.7
758.583	14211.08
758.977	14798.47
759.372	14672.25
759.767	14388.27
760.161	15344.6
760.556	17684.44
760.95	18412.6
761.345	17694.15
761.739	17776.67
762.133	18815.52
762.527	20728.17
762.922	21405.37
763.316	20614.09
763.71	20546.13
764.104	21582.56
764.498	23536.47
764.892	24031.62
765.286	22682.09
765.68	22517.04
766.073	24553.48
766.467	26191.85
766.861	26781.67
767.255	25220.96
767.648	25053.48
768.042	26854.48
768.435	29395.78
768.829	29196.75
769.222	27657.89
769.615	27388.47
770.008	28934.61
770.402	31475.91
770.795	31026.88
771.188	28883.64
771.581	28252.56
771.974	30245.31
772.367	31660.38
772.76	31400.67
773.153	28303.53
773.545	27733.14
773.938	30626.39
774.331	33022.05
774.724	32650.69
775.116	31257.46
775.509	31155.52
775.901	34223.53
776.294	37791.55
776.686	36973.57
777.078	34963.83
777.471	35063.35
777.863	38677.48
778.255	41752.77
778.647	42774.63
779.039	39849.83
779.431	36849.78
779.823	39456.62
780.215	42510.07
780.607	42281.91
780.999	40886.25
781.39	38526.99
781.782	40966.35
782.174	44281.94
782.565	45369.33
782.957	41985.79
783.348	40121.68
783.74	41735.78
784.131	44097.47
784.522	46575.66
784.914	43010.07
785.305	39565.85
785.696	40325.57
786.087	43614.45
786.478	44065.92
786.869	41165.39
787.26	37721.16
787.651	36750.27
788.042	38541.56
788.433	40590.13
788.823	38155.63
789.214	34393.44
789.605	33073.03
789.995	34638.58
790.386	35937.15
790.776	36034.24
791.167	32284.18
791.557	31359.41
791.948	33269.63
792.338	36959.01
792.728	38556.12
793.118	36672.6
793.508	32956.52
793.898	33502.64
794.288	37279.4
794.678	38823.12
795.068	37726.01
795.458	34250.23
795.848	33767.21
796.238	35908.02
796.627	37784.26
797.017	37473.58
797.406	34798.78
797.796	32723.51
798.185	34063.33
798.575	37289.11
798.964	37624.07
799.354	36228.42
799.743	33548.76
800.132	33594.88
800.521	36551.24
800.91	38638.65
801.299	36735.7
801.688	33844.88
802.077	32036.6
802.466	34415.28
802.855	36577.94
803.244	35388.6
803.633	33604.59
804.021	30077.83
804.41	30378.81
804.799	32563.31
805.187	32560.88
805.576	31140.96
805.964	28119.07
806.352	25912.72
806.741	27679.74
807.129	28878.79
807.517	29092.38
807.905	27371.48
808.293	25080.18
808.681	25893.3
809.069	28116.64
809.457	30250.17
809.845	29796.28
810.233	27288.96
810.621	25740.39
811.009	27507.41
811.396	29764.72
811.784	30699.2
812.171	28388.49
812.559	26174.86
812.946	25145.72
813.334	26861.76
813.721	27869.06
814.108	27106.91
814.496	24990.38
814.883	22776.75
815.27	24485.51
815.657	25837.48
816.044	27626.34
816.431	26674.87
816.818	23667.54
817.205	22371.4
817.592	24264.64
817.979	25602.04
818.365	25694.27
818.752	23361.71
819.139	20912.64
819.525	20189.33
819.912	21087.4
820.298	22543.74
820.685	21888.39
821.071	19660.2
821.457	17827.64
821.843	17252.39
822.23	18286.39
822.616	18660.18
823.002	17973.28
823.388	15929.56
823.774	14745.07
824.16	14422.25
824.546	15220.81
824.931	15638.29
825.317	14657.69
825.703	13118.83
826.089	12596.98
826.474	13041.16
826.86	13599.42
827.245	14075.16
827.631	13177.09
828.016	12155.23
828.401	11480.46
828.787	11992.6
829.172	12473.19
829.557	12907.66
829.942	12096.97
830.327	10509.57
830.712	10177.04
831.097	10264.42
831.482	11223.17
831.867	11140.65
832.252	10228.01
832.636	9257.12
833.021	8856.63
833.406	9414.89
833.79	9985.29
834.175	10002.28
834.559	9194.01
834.944	8181.86
835.328	7897.88
835.713	8050.79
836.097	8587.21
836.481	8383.32
836.865	7405.15
837.249	6793.49
837.633	6371.15
838.017	6749.8
838.401	6900.29
838.785	6803.2
839.169	6223.09
839.553	5545.9
839.937	5206.09
840.32	5266.77
840.704	5599.3
841.087	5604.15
841.471	4997.35
841.854	4414.81
842.238	4142.96
842.621	4276.46
843.004	4553.17
843.388	4582.29
843.771	4252.19
844.154	3849.27
844.537	3456.06
844.92	3587.13
845.303	4147.82
845.686	4288.6
846.069	4011.89
846.452	3536.16
846.834	3201.2
847.217	3249.75
847.6	3613.83
847.982	3803.15
848.365	3579.85
848.748	3111.4
849.13	2698.77
849.512	2720.61
849.895	2960.91
850.277	3067.71
850.659	3094.4
851.041	2727.89
851.423	2565.27
851.806	2431.77
852.188	2499.74
852.57	2803.14
852.951	2737.6
853.333	2531.29
853.715	2138.08
854.097	2019.15
854.479	2145.36
854.86	2254.59
855.242	2320.12
855.623	2184.2
856.005	1856.52
856.386	1630.79
856.768	1625.94
857.149	1696.32
857.53	1931.77
857.911	1810.4
858.292	1538.56
858.674	1344.38
859.055	1286.12
859.436	1332.24
859.817	1422.05
860.197	1550.69
860.578	1363.8
860.959	1135.64
861.34	1023.98
861.72	1118.65
862.101	1172.04
862.482	1208.45
862.862	1150.2
863.243	1016.7
863.623	926.9
864.003	963.3
864.384	963.3
864.764	1045.83
865.144	968.16
865.524	834.66
865.904	829.81
866.284	725.44
866.664	771.55
867.044	820.1
867.424	841.94
867.804	800.68
868.183	710.87
868.563	613.78
868.943	659.9
869.322	681.75
869.702	650.19
870.081	752.14
870.461	616.21
870.84	606.5
871.22	494.85
871.599	572.52
871.978	555.53
872.357	582.23
872.736	521.55
873.115	533.69
873.494	443.88
873.873	439.02
874.252	458.44
874.631	378.34
875.01	533.69
875.388	383.2
875.767	349.22
876.146	315.24
876.524	351.64
876.903	307.95
877.281	409.9
877.66	327.37
878.038	322.52
878.416	324.94
878.794	329.8
879.173	380.77
879.551	310.38
879.929	300.67
880.307	307.95
880.685	271.55
881.063	259.41
881.441	256.98
881.818	269.12
882.196	261.84
882.574	237.56
882.951	247.27
883.329	242.42
883.707	288.54
884.084	315.24
884.461	269.12
884.839	147.76
885.216	239.99
885.593	230.28
885.971	232.71
886.348	174.46
886.725	147.76
887.102	142.9
887.479	220.57
887.856	298.24
888.233	232.71
888.609	235.14
888.986	198.73
889.363	193.87
889.74	201.16
890.116	206.01
890.493	208.44
890.869	135.62
891.246	164.75
891.622	247.27
891.998	225.43
892.375	242.42
892.751	189.02
893.127	249.7
893.503	220.57
893.879	82.22
894.255	186.59
894.631	181.74
895.007	145.33
895.383	157.47
895.759	215.72
896.134	159.89
896.51	164.75
896.886	186.59
897.261	193.87
897.637	232.71
898.012	179.31
898.388	121.06
898.763	142.9
899.138	174.46
899.514	213.29
899.889	145.33
900.264	193.87
900.639	201.16
901.014	140.48
901.389	87.08
901.764	142.9
902.139	111.35
902.513	191.45
902.888	116.2
903.263	164.75
903.638	96.79
904.012	155.04
904.387	138.05
904.761	155.04
905.136	225.43
905.51	140.48
905.884	87.08
906.259	145.33
906.633	135.62
907.007	167.17
907.381	189.02
907.755	135.62
908.129	130.77
908.503	155.04
908.877	198.73
909.251	145.33
909.624	147.76
909.998	99.21
910.372	145.33
910.745	123.48
911.119	186.59
911.492	150.18
911.866	159.89
912.239	101.64
912.612	157.47
912.986	189.02
913.359	186.59
913.732	206.01
914.105	116.2
914.478	157.47
914.851	164.75
915.224	121.06
915.597	113.78
915.97	125.91
916.343	150.18
916.715	138.05
917.088	189.02
917.461	193.87
917.833	179.31
918.206	184.17
918.578	108.92
918.951	106.49
919.323	150.18
919.695	108.92
920.067	111.35
920.44	135.62
920.812	140.48
921.184	101.64
921.556	128.34
921.928	169.6
922.3	174.46
922.672	135.62
923.043	150.18
923.415	181.74
923.787	162.32
924.158	203.58
924.53	113.78
924.901	193.87
925.273	201.16
925.644	145.33
926.016	72.51
926.387	152.61
926.758	157.47
927.129	128.34
927.5	123.48
927.872	184.17
928.243	135.62
928.613	174.46
928.984	87.08
929.355	74.94
929.726	142.9
930.097	167.17
930.467	145.33
930.838	203.58
931.209	196.3
931.579	111.35
931.95	152.61
932.32	87.08
932.69	152.61
933.061	99.21
933.431	113.78
933.801	133.19
934.171	123.48
934.541	162.32
934.911	152.61
935.281	157.47
935.651	210.86
936.021	118.63
936.391	191.45
936.761	167.17
937.13	179.31
937.5	150.18
937.87	223
938.239	121.06
938.609	164.75
938.978	108.92
939.347	108.92
939.717	113.78
940.086	116.2
940.455	104.07
940.824	215.72
941.193	147.76
941.562	225.43
941.931	108.92
942.3	230.28
942.669	218.15
943.038	169.6
943.407	130.77
943.775	74.94
944.144	201.16
944.513	157.47
944.881	140.48
945.25	172.03
945.618	101.64
945.986	186.59
946.355	232.71
946.723	142.9
947.091	150.18
947.459	174.46
947.827	104.07
948.195	157.47
948.563	152.61
948.931	138.05
949.299	130.77
949.667	215.72
950.035	186.59
950.402	106.49
950.77	213.29
951.138	159.89
951.505	145.33
951.873	135.62
952.24	198.73
952.607	82.22
952.975	111.35
953.342	123.48
953.709	77.37
954.076	123.48
954.443	135.62
954.81	218.15
955.177	196.3
955.544	150.18
955.911	106.49
956.278	116.2
956.645	196.3
957.012	94.36
957.378	162.32
957.745	79.79
958.111	167.17
958.478	174.46
958.844	140.48
959.211	206.01
959.577	130.77
959.943	111.35
960.309	147.76
960.675	133.19
961.042	147.76
961.408	133.19
961.774	184.17
962.139	138.05
962.505	116.2
962.871	87.08
963.237	108.92
963.603	172.03
963.968	159.89
964.334	140.48
964.699	123.48
965.065	147.76
965.43	128.34
965.796	193.87
966.161	150.18
966.526	142.9
966.891	128.34
967.256	191.45
967.622	147.76
967.987	113.78
968.352	138.05
968.716	111.35
969.081	155.04
969.446	140.48
969.811	135.62
970.176	133.19
970.54	203.58
970.905	106.49
971.269	184.17
971.634	130.77
971.998	157.47
972.363	94.36
972.727	106.49
973.091	150.18
973.455	138.05
973.819	94.36
974.183	145.33
974.547	121.06
974.911	208.44
975.275	164.75
975.639	140.48
976.003	193.87
976.367	145.33
976.73	116.2
977.094	65.23
977.458	164.75
977.821	57.95
978.185	172.03
978.548	164.75
978.911	150.18
979.275	155.04
979.638	113.78
980.001	172.03
980.364	152.61
980.727	116.2
981.09	220.57
981.453	140.48
981.816	142.9
982.179	155.04
982.542	135.62
982.905	101.64
983.267	108.92
983.63	133.19
983.992	169.6
984.355	123.48
984.717	152.61
985.08	94.36
985.442	140.48
985.804	203.58
986.167	184.17
986.529	172.03
986.891	96.79
987.253	133.19
987.615	118.63
987.977	101.64
988.339	150.18
988.701	174.46
989.062	140.48
989.424	128.34
989.786	147.76
990.147	167.17
990.509	179.31
990.87	113.78
991.232	174.46
991.593	135.62
991.955	145.33
992.316	123.48
992.677	138.05
993.038	164.75
993.399	99.21
993.76	111.35
994.121	147.76
994.482	218.15
994.843	176.88
995.204	193.87
995.565	152.61
995.926	167.17
996.286	135.62
996.647	157.47
997.007	159.89
997.368	162.32
997.728	60.38
998.089	133.19
998.449	113.78
998.809	179.31
999.169	116.2
999.53	113.78
999.89	104.07
1000.25	74.94
1000.61	104.07
1000.97	142.9
1001.329	172.03
1001.689	169.6
1002.049	133.19
1002.409	142.9
1002.768	111.35
1003.128	164.75
1003.487	96.79
1003.847	104.07
1004.206	125.91
1004.566	174.46
1004.925	152.61
1005.284	138.05
1005.643	138.05
1006.003	113.78
1006.362	106.49
1006.721	208.44
1007.08	128.34
1007.438	159.89
1007.797	96.79
1008.156	138.05
1008.515	123.48
1008.874	140.48
1009.232	138.05
1009.591	130.77
1009.949	147.76
1010.308	150.18
1010.666	133.19
1011.024	181.74
1011.383	121.06
1011.741	101.64
1012.099	152.61
1012.457	184.17
1012.815	198.73
1013.173	125.91
1013.531	111.35
1013.889	184.17
1014.247	172.03
1014.605	118.63
1014.962	108.92
1015.32	162.32
1015.678	155.04
1016.035	220.57
1016.393	152.61
1016.75	140.48
1017.107	155.04
1017.465	150.18
1017.822	138.05
1018.179	152.61
1018.536	203.58
1018.894	215.72
1019.251	70.09
1019.608	101.64
1019.964	150.18
1020.321	189.02
1020.678	101.64
1021.035	155.04
1021.392	128.34
1021.748	79.79
1022.105	94.36
1022.461	138.05
1022.818	164.75
1023.174	133.19
1023.531	162.32
1023.887	203.58
1024.243	111.35
1024.599	174.46
1024.955	206.01
1025.311	167.17
1025.667	123.48
1026.023	167.17
1026.379	108.92
1026.735	91.93
1027.091	125.91
1027.447	99.21
