189.514	69.02
189.973	69.02
190.431	69.02
190.889	-23.21
191.348	-1.37
191.806	30.19
192.264	-25.64
192.722	-3.79
193.18	-30.49
193.638	-62.05
194.096	-8.65
194.554	-3.79
195.012	-32.92
195.47	-45.06
195.928	-49.91
196.385	30.19
196.843	-47.48
197.301	35.04
197.758	56.89
198.216	69.02
198.674	64.17
199.131	54.46
199.589	15.63
200.046	49.61
200.503	93.3
200.961	146.7
201.418	76.31
201.875	134.56
202.332	120
202.79	132.13
203.247	129.7
203.704	110.29
204.161	93.3
204.618	122.42
205.075	161.26
205.532	207.38
205.989	117.57
206.445	134.56
206.902	190.39
207.359	93.3
207.816	95.72
208.272	151.55
208.729	146.7
209.185	180.68
209.642	158.83
210.098	161.26
210.555	134.56
211.011	156.4
211.467	156.4
211.924	136.99
212.38	59.32
212.836	151.55
213.292	253.49
213.748	187.96
214.204	146.7
214.66	144.27
215.116	136.99
215.572	127.28
216.028	187.96
216.484	129.7
216.94	221.94
217.396	144.27
217.851	200.09
218.307	134.56
218.763	214.66
219.218	120
219.674	110.29
220.129	146.7
220.585	136.99
221.04	90.87
221.496	166.11
221.951	153.98
222.406	73.88
222.861	173.39
223.317	100.58
223.772	156.4
224.227	136.99
224.682	251.07
225.137	146.7
225.592	178.25
226.047	136.99
226.502	219.51
226.957	229.22
227.411	100.58
227.866	149.12
228.321	197.67
228.776	214.66
229.23	76.31
229.685	163.69
230.139	134.56
230.594	81.16
231.048	241.36
231.503	217.08
231.957	158.83
232.411	129.7
232.865	192.81
233.32	178.25
233.774	168.54
234.228	129.7
234.682	61.74
235.136	144.27
235.59	224.37
236.044	166.11
236.498	192.81
236.952	178.25
237.406	127.28
237.86	158.83
238.313	127.28
238.767	115.14
239.221	158.83
239.674	204.95
240.128	187.96
240.581	221.94
241.035	212.23
241.488	141.84
241.942	207.38
242.395	90.87
242.848	103.01
243.301	243.78
243.755	168.54
244.208	103.01
244.661	190.39
245.114	175.82
245.567	185.53
246.02	132.13
246.473	156.4
246.926	146.7
247.379	90.87
247.832	156.4
248.284	115.14
248.737	153.98
249.19	173.39
249.642	141.84
250.095	115.14
250.547	129.7
251	209.8
251.452	88.44
251.905	190.39
252.357	149.12
252.81	132.13
253.262	112.71
253.714	204.95
254.166	170.97
254.618	187.96
255.07	158.83
255.523	180.68
255.975	122.42
256.427	180.68
256.878	149.12
257.33	197.67
257.782	76.31
258.234	236.5
258.686	144.27
259.137	200.09
259.589	153.98
260.041	170.97
260.492	195.24
260.944	110.29
261.395	107.86
261.847	129.7
262.298	163.69
262.749	105.43
263.201	287.47
263.652	141.84
264.103	163.69
264.554	151.55
265.005	107.86
265.457	103.01
265.908	173.39
266.359	66.6
266.809	129.7
267.26	170.97
267.711	127.28
268.162	98.15
268.613	219.51
269.064	195.24
269.514	161.26
269.965	166.11
270.415	161.26
270.866	105.43
271.316	103.01
271.767	153.98
272.217	163.69
272.668	168.54
273.118	214.66
273.568	132.13
274.019	168.54
274.469	156.4
274.919	190.39
275.369	161.26
275.819	112.71
276.269	192.81
276.719	132.13
277.169	95.72
277.619	190.39
278.069	122.42
278.518	163.69
278.968	93.3
279.418	163.69
279.867	105.43
280.317	168.54
280.767	166.11
281.216	170.97
281.666	103.01
282.115	214.66
282.564	129.7
283.014	166.11
283.463	98.15
283.912	180.68
284.361	139.41
284.811	144.27
285.26	192.81
285.709	180.68
286.158	185.53
286.607	226.79
287.056	78.73
287.505	258.35
287.953	71.45
288.402	151.55
288.851	149.12
289.3	200.09
289.748	195.24
290.197	156.4
290.646	178.25
291.094	141.84
291.543	73.88
291.991	95.72
292.439	132.13
292.888	151.55
293.336	161.26
293.784	139.41
294.233	139.41
294.681	175.82
295.129	149.12
295.577	200.09
296.025	115.14
296.473	117.57
296.921	44.75
297.369	207.38
297.817	183.1
298.264	129.7
298.712	224.37
299.16	136.99
299.608	156.4
300.055	105.43
300.503	180.68
300.95	234.08
301.398	178.25
301.845	183.1
302.293	170.97
302.74	117.57
303.187	141.84
303.635	105.43
304.082	200.09
304.529	166.11
304.976	192.81
305.423	110.29
305.87	195.24
306.317	144.27
306.764	153.98
307.211	166.11
307.658	180.68
308.105	166.11
308.552	226.79
308.998	200.09
309.445	124.85
309.892	120
310.338	105.43
310.785	132.13
311.231	163.69
311.678	151.55
312.124	207.38
312.571	141.84
313.017	149.12
313.463	134.56
313.909	166.11
314.356	195.24
314.802	192.81
315.248	151.55
315.694	156.4
316.14	110.29
316.586	144.27
317.032	139.41
317.478	139.41
317.923	173.39
318.369	146.7
318.815	204.95
319.261	161.26
319.706	175.82
320.152	187.96
320.597	146.7
321.043	200.09
321.488	158.83
321.934	132.13
322.379	168.54
322.824	149.12
323.27	124.85
323.715	175.82
324.16	69.02
324.605	195.24
325.05	175.82
325.495	214.66
325.94	139.41
326.385	185.53
326.83	231.65
327.275	207.38
327.72	110.29
328.165	161.26
328.61	127.28
329.054	39.9
329.499	129.7
329.943	151.55
330.388	153.98
330.832	81.16
331.277	139.41
331.721	224.37
332.166	185.53
332.61	134.56
333.054	158.83
333.499	187.96
333.943	146.7
334.387	144.27
334.831	124.85
335.275	105.43
335.719	163.69
336.163	136.99
336.607	158.83
337.051	175.82
337.495	115.14
337.938	141.84
338.382	139.41
338.826	197.67
339.269	93.3
339.713	158.83
340.157	129.7
340.6	122.42
341.044	93.3
341.487	202.52
341.93	78.73
342.374	180.68
342.817	163.69
343.26	139.41
343.703	170.97
344.146	127.28
344.59	134.56
345.033	153.98
345.476	81.16
345.919	158.83
346.361	175.82
346.804	166.11
347.247	120
347.69	134.56
348.133	156.4
348.575	100.58
349.018	200.09
349.461	139.41
349.903	158.83
350.346	197.67
350.788	180.68
351.23	168.54
351.673	151.55
352.115	136.99
352.557	180.68
353	144.27
353.442	192.81
353.884	161.26
354.326	141.84
354.768	226.79
355.21	163.69
355.652	120
356.094	151.55
356.536	117.57
356.978	192.81
357.419	170.97
357.861	149.12
358.303	202.52
358.744	115.14
359.186	161.26
359.627	124.85
360.069	69.02
360.51	190.39
360.952	166.11
361.393	120
361.834	95.72
362.276	149.12
362.717	124.85
363.158	105.43
363.599	151.55
364.04	207.38
364.481	180.68
364.922	146.7
365.363	163.69
365.804	144.27
366.245	110.29
366.686	127.28
367.126	141.84
367.567	122.42
368.008	139.41
368.448	141.84
368.889	122.42
369.33	141.84
369.77	217.08
370.21	141.84
370.651	139.41
371.091	120
371.531	105.43
371.972	141.84
372.412	153.98
372.852	149.12
373.292	207.38
373.732	134.56
374.172	197.67
374.612	166.11
375.052	192.81
375.492	146.7
375.932	202.52
376.372	134.56
376.811	207.38
377.251	112.71
377.691	178.25
378.13	117.57
378.57	107.86
379.009	151.55
379.449	158.83
379.888	117.57
380.328	120
380.767	93.3
381.206	178.25
381.645	35.04
382.085	151.55
382.524	153.98
382.963	192.81
383.402	163.69
383.841	195.24
384.28	234.08
384.719	163.69
385.158	207.38
385.596	161.26
386.035	175.82
386.474	146.7
386.913	144.27
387.351	129.7
387.79	209.8
388.228	236.5
388.667	192.81
389.105	178.25
389.544	163.69
389.982	161.26
390.42	146.7
390.859	173.39
391.297	187.96
391.735	124.85
392.173	86.01
392.611	158.83
393.049	103.01
393.487	136.99
393.925	122.42
394.363	180.68
394.801	166.11
395.239	166.11
395.676	132.13
396.114	151.55
396.552	107.86
396.989	178.25
397.427	146.7
397.864	275.34
398.302	100.58
398.739	202.52
399.177	136.99
399.614	151.55
400.051	158.83
400.488	88.44
400.926	151.55
401.363	151.55
401.8	122.42
402.237	129.7
402.674	173.39
403.111	209.8
403.548	90.87
403.985	134.56
404.421	246.21
404.858	120
405.295	151.55
405.732	139.41
406.168	103.01
406.605	127.28
407.041	173.39
407.478	122.42
407.914	93.3
408.351	134.56
408.787	175.82
409.223	134.56
409.66	246.21
410.096	136.99
410.532	166.11
410.968	156.4
411.404	149.12
411.84	141.84
412.276	187.96
412.712	129.7
413.148	197.67
413.584	141.84
414.02	110.29
414.455	163.69
414.891	136.99
415.327	139.41
415.762	170.97
416.198	207.38
416.633	149.12
417.069	136.99
417.504	42.32
417.94	168.54
418.375	83.59
418.81	178.25
419.245	156.4
419.681	151.55
420.116	122.42
420.551	195.24
420.986	129.7
421.421	151.55
421.856	149.12
422.291	234.08
422.726	134.56
423.16	136.99
423.595	103.01
424.03	129.7
424.464	153.98
424.899	129.7
425.334	263.2
425.768	132.13
426.203	90.87
426.637	204.95
427.071	141.84
427.506	204.95
427.94	170.97
428.374	163.69
428.809	129.7
429.243	151.55
429.677	120
430.111	168.54
430.545	88.44
430.979	163.69
431.413	161.26
431.847	183.1
432.28	214.66
432.714	190.39
433.148	185.53
433.582	209.8
434.015	141.84
434.449	120
434.882	195.24
435.316	221.94
435.749	187.96
436.183	166.11
436.616	112.71
437.049	175.82
437.483	197.67
437.916	219.51
438.349	192.81
438.782	221.94
439.215	212.23
439.648	144.27
440.081	158.83
440.514	124.85
440.947	170.97
441.38	238.93
441.813	178.25
442.245	175.82
442.678	200.09
443.111	166.11
443.543	175.82
443.976	105.43
444.408	115.14
444.841	204.95
445.273	265.63
445.705	270.48
446.138	156.4
446.57	197.67
447.002	175.82
447.434	112.71
447.867	253.49
448.299	231.65
448.731	185.53
449.163	280.19
449.595	260.77
450.026	285.05
450.458	258.35
450.89	185.53
451.322	241.36
451.754	265.63
452.185	272.91
452.617	217.08
453.048	316.6
453.48	255.92
453.911	294.76
454.343	292.33
454.774	234.08
455.205	236.5
455.637	272.91
456.068	270.48
456.499	294.76
456.93	299.61
457.361	275.34
457.792	268.06
458.223	236.5
458.654	248.64
459.085	299.61
459.516	285.05
459.947	231.65
460.378	197.67
460.808	299.61
461.239	246.21
461.669	241.36
462.1	285.05
462.531	268.06
462.961	260.77
463.391	197.67
463.822	258.35
464.252	226.79
464.682	192.81
465.113	200.09
465.543	202.52
465.973	246.21
466.403	263.2
466.833	280.19
467.263	224.37
467.693	212.23
468.123	272.91
468.553	229.22
468.983	241.36
469.412	180.68
469.842	207.38
470.272	319.03
470.701	255.92
471.131	197.67
471.56	263.2
471.99	268.06
472.419	260.77
472.849	197.67
473.278	260.77
473.707	207.38
474.136	217.08
474.566	219.51
474.995	260.77
475.424	234.08
475.853	226.79
476.282	209.8
476.711	166.11
477.14	282.62
477.569	219.51
477.997	197.67
478.426	219.51
478.855	200.09
479.283	248.64
479.712	258.35
480.141	214.66
480.569	231.65
480.998	263.2
481.426	170.97
481.854	246.21
482.283	243.78
482.711	224.37
483.139	243.78
483.567	226.79
483.995	168.54
484.424	187.96
484.852	251.07
485.28	151.55
485.708	170.97
486.135	195.24
486.563	221.94
486.991	202.52
487.419	187.96
487.847	231.65
488.274	141.84
488.702	197.67
489.129	146.7
489.557	149.12
489.984	180.68
490.412	180.68
490.839	243.78
491.266	149.12
491.694	153.98
492.121	180.68
492.548	248.64
492.975	204.95
493.402	192.81
493.829	178.25
494.256	95.72
494.683	163.69
495.11	151.55
495.537	236.5
495.964	166.11
496.39	258.35
496.817	195.24
497.244	214.66
497.67	134.56
498.097	241.36
498.523	166.11
498.95	221.94
499.376	163.69
499.803	175.82
500.229	195.24
500.655	175.82
501.081	185.53
501.508	178.25
501.934	197.67
502.36	170.97
502.786	217.08
503.212	180.68
503.638	214.66
504.064	183.1
504.489	219.51
504.915	178.25
505.341	132.13
505.767	149.12
506.192	187.96
506.618	156.4
507.043	146.7
507.469	190.39
507.894	139.41
508.32	229.22
508.745	214.66
509.17	151.55
509.596	156.4
510.021	187.96
510.446	166.11
510.871	192.81
511.296	214.66
511.721	136.99
512.146	187.96
512.571	122.42
512.996	163.69
513.421	197.67
513.845	183.1
514.27	200.09
514.695	170.97
515.119	168.54
515.544	166.11
515.969	136.99
516.393	180.68
516.817	209.8
517.242	246.21
517.666	202.52
518.09	195.24
518.515	168.54
518.939	209.8
519.363	399.13
519.787	221.94
520.211	241.36
520.635	192.81
521.059	166.11
521.483	248.64
521.907	132.13
522.331	134.56
522.754	217.08
523.178	180.68
523.602	107.86
524.025	149.12
524.449	236.5
524.872	190.39
525.296	166.11
525.719	202.52
526.143	200.09
526.566	185.53
526.989	180.68
527.412	238.93
527.836	151.55
528.259	187.96
528.682	168.54
529.105	178.25
529.528	207.38
529.951	132.13
530.374	187.96
530.796	180.68
531.219	197.67
531.642	173.39
532.065	178.25
532.487	168.54
532.91	219.51
533.332	153.98
533.755	107.86
534.177	202.52
534.6	141.84
535.022	132.13
535.444	136.99
535.867	236.5
536.289	224.37
536.711	149.12
537.133	187.96
537.555	136.99
537.977	260.77
538.399	253.49
538.821	258.35
539.243	217.08
539.665	224.37
540.086	200.09
540.508	195.24
540.93	236.5
541.351	180.68
541.773	170.97
542.195	187.96
542.616	185.53
543.037	280.19
543.459	319.03
543.88	202.52
544.301	221.94
544.723	217.08
545.144	241.36
545.565	275.34
545.986	204.95
546.407	268.06
546.828	204.95
547.249	151.55
547.67	234.08
548.091	132.13
548.512	178.25
548.932	178.25
549.353	243.78
549.774	197.67
550.194	255.92
550.615	180.68
551.035	221.94
551.456	170.97
551.876	161.26
552.296	185.53
552.717	212.23
553.137	187.96
553.557	136.99
553.977	224.37
554.397	248.64
554.817	180.68
555.237	166.11
555.657	185.53
556.077	260.77
556.497	234.08
556.917	226.79
557.337	146.7
557.756	214.66
558.176	151.55
558.596	192.81
559.015	275.34
559.435	127.28
559.854	200.09
560.274	238.93
560.693	146.7
561.112	187.96
561.532	180.68
561.951	202.52
562.37	161.26
562.789	187.96
563.208	86.01
563.627	221.94
564.046	161.26
564.465	224.37
564.884	195.24
565.303	115.14
565.722	204.95
566.14	192.81
566.559	134.56
566.978	173.39
567.396	224.37
567.815	190.39
568.233	251.07
568.652	192.81
569.07	204.95
569.489	224.37
569.907	168.54
570.325	195.24
570.743	255.92
571.161	202.52
571.58	234.08
571.998	173.39
572.416	187.96
572.833	180.68
573.251	144.27
573.669	231.65
574.087	144.27
574.505	224.37
574.922	229.22
575.34	168.54
575.758	202.52
576.175	180.68
576.593	156.4
577.01	122.42
577.428	180.68
577.845	1505.94
578.262	243.78
578.68	236.5
579.097	151.55
579.514	149.12
579.931	156.4
580.348	202.52
580.765	168.54
581.182	202.52
581.599	195.24
582.016	173.39
582.433	207.38
582.849	224.37
583.266	226.79
583.683	202.52
584.099	153.98
584.516	149.12
584.933	192.81
585.349	151.55
585.765	156.4
586.182	178.25
586.598	170.97
587.014	253.49
587.431	185.53
587.847	141.84
588.263	202.52
588.679	190.39
589.095	229.22
589.511	168.54
589.927	175.82
590.343	241.36
590.759	212.23
591.174	192.81
591.59	236.5
592.006	173.39
592.421	226.79
592.837	144.27
593.252	229.22
593.668	168.54
594.083	187.96
594.499	192.81
594.914	183.1
595.329	200.09
595.745	195.24
596.16	183.1
596.575	105.43
596.99	132.13
597.405	180.68
597.82	221.94
598.235	243.78
598.65	187.96
599.065	175.82
599.479	253.49
599.894	144.27
600.309	178.25
600.724	178.25
601.138	226.79
601.553	212.23
601.967	180.68
602.382	251.07
602.796	173.39
603.21	204.95
603.625	229.22
604.039	217.08
604.453	190.39
604.867	173.39
605.281	207.38
605.695	156.4
606.109	229.22
606.523	136.99
606.937	202.52
607.351	280.19
607.765	115.14
608.178	163.69
608.592	156.4
609.006	161.26
609.419	209.8
609.833	168.54
610.246	158.83
610.66	173.39
611.073	246.21
611.487	158.83
611.9	202.52
612.313	187.96
612.726	178.25
613.139	156.4
613.553	229.22
613.966	190.39
614.379	175.82
614.792	209.8
615.204	229.22
615.617	153.98
616.03	149.12
616.443	168.54
616.856	217.08
617.268	212.23
617.681	195.24
618.093	187.96
618.506	190.39
618.918	221.94
619.331	248.64
619.743	185.53
620.155	156.4
620.568	163.69
620.98	207.38
621.392	248.64
621.804	178.25
622.216	200.09
622.628	153.98
623.04	175.82
623.452	163.69
623.864	161.26
624.276	149.12
624.687	115.14
625.099	149.12
625.511	139.41
625.922	200.09
626.334	95.72
626.745	112.71
627.157	200.09
627.568	217.08
627.979	209.8
628.391	156.4
628.802	180.68
629.213	158.83
629.624	226.79
630.035	187.96
630.446	151.55
630.857	231.65
631.268	202.52
631.679	139.41
632.09	195.24
632.501	153.98
632.912	183.1
633.322	248.64
633.733	209.8
634.144	192.81
634.554	158.83
634.965	217.08
635.375	163.69
635.785	95.72
636.196	202.52
636.606	219.51
637.016	192.81
637.427	178.25
637.837	141.84
638.247	234.08
638.657	146.7
639.067	158.83
639.477	144.27
639.887	207.38
640.297	231.65
640.706	117.57
641.116	195.24
641.526	161.26
641.935	229.22
642.345	124.85
642.755	103.01
643.164	105.43
643.573	175.82
643.983	83.59
644.392	132.13
644.801	141.84
645.211	178.25
645.62	146.7
646.029	207.38
646.438	187.96
646.847	180.68
647.256	134.56
647.665	207.38
648.074	202.52
648.483	200.09
648.892	255.92
649.3	197.67
649.709	144.27
650.118	149.12
650.526	192.81
650.935	141.84
651.343	141.84
651.752	190.39
652.16	209.8
652.568	178.25
652.977	132.13
653.385	229.22
653.793	163.69
654.201	156.4
654.609	144.27
655.017	195.24
655.425	202.52
655.833	141.84
656.241	136.99
656.649	158.83
657.057	192.81
657.464	166.11
657.872	185.53
658.28	112.71
658.687	117.57
659.095	161.26
659.502	144.27
659.91	170.97
660.317	158.83
660.724	149.12
661.132	187.96
661.539	187.96
661.946	136.99
662.353	185.53
662.76	122.42
663.167	127.28
663.574	73.88
663.981	122.42
664.388	166.11
664.795	180.68
665.202	151.55
665.608	195.24
666.015	103.01
666.422	175.82
666.828	149.12
667.235	161.26
667.641	132.13
668.047	175.82
668.454	98.15
668.86	134.56
669.266	122.42
669.673	132.13
670.079	149.12
670.485	224.37
670.891	158.83
671.297	144.27
671.703	178.25
672.109	122.42
672.515	110.29
672.92	158.83
673.326	170.97
673.732	161.26
674.138	200.09
674.543	170.97
674.949	122.42
675.354	105.43
675.76	170.97
676.165	197.67
676.57	190.39
676.976	195.24
677.381	187.96
677.786	122.42
678.191	190.39
678.596	207.38
679.001	90.87
679.406	175.82
679.811	236.5
680.216	204.95
680.621	151.55
681.026	95.72
681.43	158.83
681.835	156.4
682.24	112.71
682.644	192.81
683.049	144.27
683.453	141.84
683.858	187.96
684.262	173.39
684.667	93.3
685.071	132.13
685.475	76.31
685.879	161.26
686.283	146.7
686.687	195.24
687.091	200.09
687.495	204.95
687.899	146.7
688.303	156.4
688.707	170.97
689.111	153.98
689.514	158.83
689.918	86.01
690.322	134.56
690.725	134.56
691.129	161.26
691.532	195.24
691.936	124.85
692.339	168.54
692.742	251.07
693.146	258.35
693.549	226.79
693.952	170.97
694.355	173.39
694.758	127.28
695.161	170.97
695.564	170.97
695.967	178.25
696.37	95.72
696.773	207.38
697.175	163.69
697.578	195.24
697.981	209.8
698.383	175.82
698.786	161.26
699.188	144.27
699.591	120
699.993	149.12
700.395	200.09
700.798	141.84
701.2	243.78
701.602	258.35
702.004	149.12
702.406	187.96
702.808	173.39
703.21	202.52
703.612	197.67
704.014	156.4
704.416	214.66
704.818	255.92
705.219	175.82
705.621	209.8
706.023	231.65
706.424	277.77
706.826	270.48
707.227	234.08
707.629	214.66
708.03	202.52
708.431	255.92
708.832	277.77
709.234	185.53
709.635	209.8
710.036	238.93
710.437	219.51
710.838	221.94
711.239	258.35
711.64	226.79
712.041	214.66
712.441	229.22
712.842	277.77
713.243	221.94
713.643	265.63
714.044	265.63
714.445	209.8
714.845	275.34
715.246	302.04
715.646	246.21
716.046	231.65
716.447	265.63
716.847	270.48
717.247	258.35
717.647	268.06
718.047	265.63
718.447	255.92
718.847	316.6
719.247	345.73
719.647	275.34
720.047	355.44
720.446	319.03
720.846	323.88
721.246	389.42
721.645	365.15
722.045	357.86
722.444	362.72
722.844	362.72
723.243	382.14
723.643	394.27
724.042	408.84
724.441	433.11
724.84	411.26
725.24	450.1
725.639	476.8
726.038	406.41
726.437	459.81
726.836	343.3
727.234	493.79
727.633	552.04
728.032	542.33
728.431	510.78
728.83	559.32
729.228	569.03
729.627	636.99
730.025	666.12
730.424	653.98
730.822	700.1
731.22	690.39
731.619	785.05
732.017	887
732.415	836.03
732.813	894.28
733.212	998.65
733.61	1069.04
734.008	1178.26
734.406	1064.19
734.803	1202.54
735.201	1338.46
735.599	1539.92
735.997	1508.37
736.395	1520.5
736.792	1673.42
737.19	1870.02
737.587	1816.62
737.985	2008.37
738.382	1889.44
738.78	2202.55
739.177	2200.13
739.574	2306.92
739.971	2367.6
740.369	2493.82
740.766	2877.32
741.163	2831.2
741.56	2867.61
741.957	2765.67
742.354	3037.52
742.751	3367.62
743.147	3505.97
743.544	3316.65
743.941	3486.55
744.338	3928.31
744.734	4285.11
745.131	4319.09
745.527	4287.54
745.924	4547.25
746.32	5093.37
746.716	5447.75
747.113	5535.13
747.509	5552.12
747.905	5644.35
748.301	6525.44
748.697	6675.92
749.093	6617.67
749.489	6401.65
749.885	7105.54
750.281	8197.79
750.677	8156.53
751.073	8042.45
751.468	8285.17
751.864	8794.89
752.26	9658.98
752.655	9942.96
753.051	9600.73
753.446	9537.62
753.842	10675.99
754.237	11862.9
754.632	11964.84
755.028	11115.31
755.423	11108.03
755.818	11850.76
756.213	13129.91
756.608	13129.91
757.003	12239.12
757.398	12202.71
757.793	13212.43
758.188	14132.35
758.583	14076.52
758.977	13088.64
759.372	13222.14
759.767	15319.26
760.161	17018.32
760.556	17163.95
760.95	16069.27
761.345	16163.93
761.739	18591.16
762.133	20537.79
762.527	20727.11
762.922	19513.5
763.316	19765.93
763.71	21974.7
764.104	23389.78
764.498	23717.45
764.892	22054.8
765.286	21702.86
765.68	23758.71
766.073	26222.34
766.467	25989.33
766.861	24486.88
767.255	24083.96
767.648	26346.13
768.042	28991.8
768.435	29688.42
768.829	27151.97
769.222	26394.68
769.615	28382.57
770.008	30639.89
770.402	31246.69
770.795	29319.48
771.188	27705.38
771.581	28147.13
771.974	31207.86
772.367	31984.57
772.76	30545.23
773.153	27329.16
773.545	27858.29
773.938	31261.26
774.331	32511.28
774.724	31817.09
775.116	29989.39
775.509	30581.63
775.901	34222.47
776.294	37521.06
776.686	37404.56
777.078	34241.89
777.471	34324.41
777.863	37977.38
778.255	42042.98
778.647	42783.28
779.039	39620.61
779.431	36902.12
779.823	38067.19
780.215	42387.64
780.607	42455.61
780.999	41314.81
781.39	37623.01
781.782	39586.63
782.174	42676.48
782.565	44841.57
782.957	43200.76
783.348	41008.98
783.74	40074.5
784.131	42072.1
784.522	46562.47
784.914	44911.95
785.305	41654.62
785.696	39307.5
786.087	40797.81
786.478	42887.65
786.869	43404.65
787.26	40067.22
787.651	35826.86
788.042	35152.09
788.433	37700.68
788.823	39079.34
789.214	37266.2
789.605	33744.31
789.995	31991.85
790.386	32987.01
790.776	36285.61
791.167	35690.94
791.557	34115.67
791.948	31613.2
792.338	33198.18
792.728	36870.57
793.118	38795.35
793.508	37137.56
793.898	34521.02
794.288	33067.11
794.678	35295.3
795.068	38632.73
795.458	38370.59
795.848	35744.34
796.238	32999.15
796.627	33139.93
797.017	36057.45
797.406	38380.3
797.796	36814.74
798.185	33639.93
798.575	32239.43
798.964	33727.31
799.354	38089.03
799.743	38407
800.132	36421.53
800.521	32921.48
800.91	32520.99
801.299	35363.26
801.688	37870.58
802.077	37215.23
802.466	33681.2
802.855	30989.41
803.244	31249.12
803.633	34574.42
804.021	35258.89
804.41	33402.07
804.799	30013.66
805.187	27778.19
805.576	29093.75
805.964	31792.82
806.352	30295.22
806.741	28729.66
807.129	25814.57
807.517	25302.43
807.905	27173.81
808.293	29860.75
808.681	29489.38
809.069	26627.69
809.457	25695.64
809.845	26443.22
810.233	29236.95
810.621	31018.53
811.009	29469.97
811.396	27266.05
811.784	25707.77
812.171	26734.49
812.559	28821.9
812.946	29875.31
813.334	28273.35
813.721	24850.96
814.108	23091.23
814.496	24773.29
814.883	26287.88
815.27	27906.84
815.657	25945.64
816.044	24290.27
816.431	23071.81
816.818	24222.31
817.205	26244.19
817.592	27132.55
817.979	24627.66
818.365	21986.84
818.752	21069.35
819.139	21870.33
819.525	23241.71
819.912	22773.26
820.298	21290.23
820.685	18894.56
821.071	18193.09
821.457	19049.9
821.843	19765.93
822.23	19651.85
822.616	17622.7
823.002	15836.26
823.388	14841.1
823.774	15666.35
824.16	16384.81
824.546	15646.94
824.931	14464.88
825.317	12928.45
825.703	12996.41
826.089	13724.58
826.474	14731.87
826.86	14552.26
827.245	13280.39
827.631	11952.7
828.016	11790.08
828.401	12178.44
828.787	13464.86
829.172	13355.64
829.557	12069.21
829.942	10707.54
830.327	10294.91
830.712	10996.38
831.097	11426
831.482	11639.59
831.867	10642
832.252	9127.42
832.636	8807.02
833.021	9331.3
833.406	10120.15
833.79	10355.59
834.175	9605.58
834.559	8260.9
834.944	7620.11
835.328	8052.16
835.713	8612.85
836.097	9015.77
836.481	8120.12
836.865	7175.93
837.249	6336.11
837.633	6404.07
838.017	6945.34
838.401	7183.21
838.785	6972.04
839.169	6071.54
839.553	5353.09
839.937	5054.54
840.32	5372.5
840.704	5712.32
841.087	5522.99
841.471	4836.09
841.854	4207.44
842.238	4018.11
842.621	4275.4
843.004	4588.51
843.388	4833.66
843.771	4357.93
844.154	3928.31
844.537	3418.59
844.92	3583.64
845.303	3964.72
845.686	4314.24
846.069	4052.1
846.452	3547.23
846.834	3294.8
847.217	3020.53
847.6	3408.88
847.982	3678.3
848.365	3627.33
848.748	3144.31
849.13	2819.07
849.512	2641.88
849.895	2862.76
850.277	3202.57
850.659	3171.01
851.041	3020.53
851.423	2685.57
851.806	2382.17
852.188	2389.45
852.57	2532.65
852.951	2780.23
853.333	2809.36
853.715	2452.56
854.097	2120.03
854.479	1976.82
854.86	2120.03
855.242	2272.94
855.623	2253.52
856.005	1986.53
856.386	1848.18
856.768	1537.49
857.149	1593.32
857.53	1712.25
857.911	1996.24
858.292	1690.41
858.674	1527.78
859.055	1297.2
859.436	1178.26
859.817	1292.34
860.197	1387.01
860.578	1457.4
860.959	1323.9
861.34	1146.71
861.72	981.66
862.101	1052.05
862.482	1110.3
862.862	1183.12
863.243	1144.28
863.623	1061.76
864.003	945.25
864.384	772.92
864.764	882.14
865.144	1005.93
865.524	969.52
865.904	877.29
866.284	792.34
866.664	695.25
867.044	717.09
867.424	702.53
867.804	768.06
868.183	860.3
868.563	627.29
868.943	632.14
869.322	622.43
869.702	581.17
870.081	544.76
870.461	610.29
870.84	736.51
871.22	537.48
871.599	544.76
871.978	581.17
872.357	496.22
872.736	488.93
873.115	496.22
873.494	447.67
873.873	454.95
874.252	479.22
874.631	396.7
875.01	408.84
875.388	411.26
875.767	428.25
876.146	377.28
876.524	348.15
876.903	360.29
877.281	338.45
877.66	357.86
878.038	389.42
878.416	328.74
878.794	336.02
879.173	277.77
879.551	277.77
879.929	272.91
880.307	328.74
880.685	292.33
881.063	285.05
881.441	299.61
881.818	238.93
882.196	251.07
882.574	209.8
882.951	265.63
883.329	248.64
883.707	333.59
884.084	202.52
884.461	280.19
884.839	292.33
885.216	204.95
885.593	236.5
885.971	195.24
886.348	236.5
886.725	192.81
887.102	197.67
887.479	236.5
887.856	248.64
888.233	243.78
888.609	192.81
888.986	163.69
889.363	146.7
889.74	268.06
890.116	209.8
890.493	221.94
890.869	202.52
891.246	151.55
891.622	238.93
891.998	187.96
892.375	195.24
892.751	190.39
893.127	173.39
893.503	219.51
893.879	180.68
894.255	178.25
894.631	236.5
895.007	136.99
895.383	229.22
895.759	212.23
896.134	115.14
896.51	163.69
896.886	183.1
897.261	190.39
897.637	238.93
898.012	175.82
898.388	207.38
898.763	132.13
899.138	105.43
899.514	127.28
899.889	192.81
900.264	185.53
900.639	195.24
901.014	107.86
901.389	292.33
901.764	175.82
902.139	149.12
902.513	180.68
902.888	163.69
903.263	178.25
903.638	204.95
904.012	209.8
904.387	105.43
904.761	153.98
905.136	158.83
905.51	209.8
905.884	129.7
906.259	66.6
906.633	76.31
907.007	141.84
907.381	226.79
907.755	136.99
908.129	170.97
908.503	231.65
908.877	144.27
909.251	217.08
909.624	129.7
909.998	117.57
910.372	204.95
910.745	192.81
911.119	105.43
911.492	236.5
911.866	93.3
912.239	192.81
912.612	136.99
912.986	214.66
913.359	166.11
913.732	149.12
914.105	146.7
914.478	158.83
914.851	81.16
915.224	161.26
915.597	122.42
915.97	173.39
916.343	204.95
916.715	141.84
917.088	146.7
917.461	120
917.833	141.84
918.206	146.7
918.578	105.43
918.951	129.7
919.323	161.26
919.695	132.13
920.067	110.29
920.44	88.44
920.812	86.01
921.184	202.52
921.556	144.27
921.928	185.53
922.3	112.71
922.672	124.85
923.043	141.84
923.415	180.68
923.787	141.84
924.158	141.84
924.53	168.54
924.901	217.08
925.273	136.99
925.644	107.86
926.016	144.27
926.387	134.56
926.758	110.29
927.129	115.14
927.5	163.69
927.872	234.08
928.243	158.83
928.613	136.99
928.984	139.41
929.355	229.22
929.726	103.01
930.097	115.14
930.467	117.57
930.838	180.68
931.209	139.41
931.579	139.41
931.95	173.39
932.32	178.25
932.69	204.95
933.061	141.84
933.431	183.1
933.801	158.83
934.171	185.53
934.541	178.25
934.911	161.26
935.281	149.12
935.651	178.25
936.021	178.25
936.391	158.83
936.761	122.42
937.13	115.14
937.5	158.83
937.87	129.7
938.239	149.12
938.609	178.25
938.978	100.58
939.347	234.08
939.717	207.38
940.086	209.8
940.455	110.29
940.824	107.86
941.193	178.25
941.562	141.84
941.931	149.12
942.3	163.69
942.669	185.53
943.038	107.86
943.407	127.28
943.775	124.85
944.144	151.55
944.513	178.25
944.881	153.98
945.25	183.1
945.618	107.86
945.986	170.97
946.355	139.41
946.723	204.95
947.091	173.39
947.459	120
947.827	78.73
948.195	187.96
948.563	180.68
948.931	141.84
949.299	219.51
949.667	146.7
950.035	163.69
950.402	151.55
950.77	86.01
951.138	190.39
951.505	120
951.873	141.84
952.24	202.52
952.607	134.56
952.975	207.38
953.342	105.43
953.709	170.97
954.076	141.84
954.443	156.4
954.81	95.72
955.177	124.85
955.544	107.86
955.911	197.67
956.278	146.7
956.645	163.69
957.012	178.25
957.378	132.13
957.745	183.1
958.111	103.01
958.478	197.67
958.844	173.39
959.211	231.65
959.577	112.71
959.943	93.3
960.309	129.7
960.675	185.53
961.042	221.94
961.408	166.11
961.774	139.41
962.139	134.56
962.505	156.4
962.871	129.7
963.237	161.26
963.603	120
963.968	129.7
964.334	175.82
964.699	115.14
965.065	134.56
965.43	117.57
965.796	117.57
966.161	153.98
966.526	190.39
966.891	197.67
967.256	59.32
967.622	115.14
967.987	141.84
968.352	124.85
968.716	214.66
969.081	163.69
969.446	90.87
969.811	117.57
970.176	86.01
970.54	185.53
970.905	144.27
971.269	168.54
971.634	120
971.998	158.83
972.363	115.14
972.727	132.13
973.091	76.31
973.455	141.84
973.819	141.84
974.183	124.85
974.547	163.69
974.911	115.14
975.275	175.82
975.639	95.72
976.003	251.07
976.367	158.83
976.73	115.14
977.094	132.13
977.458	107.86
977.821	190.39
978.185	69.02
978.548	115.14
978.911	127.28
979.275	141.84
979.638	86.01
980.001	146.7
980.364	134.56
980.727	132.13
981.09	115.14
981.453	168.54
981.816	195.24
982.179	224.37
982.542	124.85
982.905	149.12
983.267	163.69
983.63	190.39
983.992	151.55
984.355	105.43
984.717	136.99
985.08	187.96
985.442	192.81
985.804	132.13
986.167	180.68
986.529	224.37
986.891	173.39
987.253	224.37
987.615	178.25
987.977	18.05
988.339	100.58
988.701	107.86
989.062	129.7
989.424	110.29
989.786	163.69
990.147	175.82
990.509	115.14
990.87	144.27
991.232	141.84
991.593	168.54
991.955	141.84
992.316	202.52
992.677	132.13
993.038	185.53
993.399	158.83
993.76	103.01
994.121	161.26
994.482	146.7
994.843	168.54
995.204	207.38
995.565	168.54
995.926	168.54
996.286	190.39
996.647	163.69
997.007	144.27
997.368	166.11
997.728	61.74
998.089	127.28
998.449	132.13
998.809	139.41
999.169	185.53
999.53	90.87
999.89	54.46
1000.25	110.29
1000.61	173.39
1000.97	146.7
1001.329	166.11
1001.689	90.87
1002.049	197.67
1002.409	115.14
1002.768	175.82
1003.128	127.28
1003.487	124.85
1003.847	153.98
1004.206	103.01
1004.566	158.83
1004.925	166.11
1005.284	141.84
1005.643	122.42
1006.003	158.83
1006.362	127.28
1006.721	146.7
1007.08	175.82
1007.438	153.98
1007.797	110.29
1008.156	166.11
1008.515	122.42
1008.874	163.69
1009.232	134.56
1009.591	178.25
1009.949	151.55
1010.308	163.69
1010.666	132.13
1011.024	141.84
1011.383	158.83
1011.741	202.52
1012.099	105.43
1012.457	146.7
1012.815	107.86
1013.173	78.73
1013.531	144.27
1013.889	197.67
1014.247	129.7
1014.605	98.15
1014.962	226.79
1015.32	124.85
1015.678	93.3
1016.035	98.15
1016.393	103.01
1016.75	163.69
1017.107	149.12
1017.465	136.99
1017.822	180.68
1018.179	122.42
1018.536	136.99
1018.894	187.96
1019.251	93.3
1019.608	170.97
1019.964	175.82
1020.321	207.38
1020.678	73.88
1021.035	127.28
1021.392	52.03
1021.748	139.41
1022.105	107.86
1022.461	134.56
1022.818	107.86
1023.174	76.31
1023.531	158.83
1023.887	178.25
1024.243	144.27
1024.599	127.28
1024.955	202.52
1025.311	170.97
1025.667	163.69
1026.023	117.57
1026.379	173.39
1026.735	173.39
1027.091	158.83
1027.447	168.54
