189.514	81.31
189.973	81.31
190.431	81.31
190.889	-52.19
191.348	-59.47
191.806	-1.21
192.264	-23.06
192.722	-18.2
193.18	-35.19
193.638	-23.06
194.096	10.92
194.554	-6.07
195.012	-1.21
195.47	32.77
195.928	-44.9
196.385	18.2
196.843	18.2
197.301	37.62
197.758	-37.62
198.216	32.77
198.674	15.78
199.131	23.06
199.589	30.34
200.046	-37.62
200.503	64.32
200.961	59.47
201.418	86.17
201.875	32.77
202.332	88.59
202.79	54.61
203.247	83.74
203.704	132.28
204.161	112.87
204.618	95.88
205.075	161.41
205.532	127.43
205.989	149.27
206.445	108.01
206.902	192.96
207.359	112.87
207.816	76.46
208.272	117.72
208.729	81.31
209.185	108.01
209.642	98.3
210.098	171.12
210.555	156.56
211.011	158.98
211.467	158.98
211.924	134.71
212.38	112.87
212.836	178.4
213.292	134.71
213.748	86.17
214.204	141.99
214.66	122.57
215.116	161.41
215.572	144.42
216.028	71.6
216.484	146.85
216.94	137.14
217.396	100.73
217.851	178.4
218.307	188.11
218.763	125
219.218	112.87
219.674	37.62
220.129	108.01
220.585	64.32
221.04	105.58
221.496	83.74
221.951	88.59
222.406	78.88
222.861	151.7
223.317	125
223.772	144.42
224.227	76.46
224.682	122.57
225.137	154.13
225.592	76.46
226.047	180.83
226.502	171.12
226.957	151.7
227.411	95.88
227.866	93.45
228.321	110.44
228.776	120.15
229.23	95.88
229.685	163.84
230.139	141.99
230.594	132.28
231.048	81.31
231.503	117.72
231.957	83.74
232.411	98.3
232.865	158.98
233.32	134.71
233.774	156.56
234.228	81.31
234.682	120.15
235.136	95.88
235.59	151.7
236.044	141.99
236.498	180.83
236.952	168.69
237.406	180.83
237.86	91.02
238.313	83.74
238.767	93.45
239.221	166.26
239.674	173.55
240.128	74.03
240.581	134.71
241.035	98.3
241.488	115.29
241.942	175.97
242.395	98.3
242.848	122.57
243.301	54.61
243.755	151.7
244.208	156.56
244.661	108.01
245.114	127.43
245.567	163.84
246.02	151.7
246.473	236.65
246.926	122.57
247.379	44.9
247.832	115.29
248.284	166.26
248.737	168.69
249.19	129.86
249.642	117.72
250.095	178.4
250.547	103.16
251	132.28
251.452	141.99
251.905	100.73
252.357	171.12
252.81	103.16
253.262	98.3
253.714	239.08
254.166	146.85
254.618	54.61
255.07	100.73
255.523	81.31
255.975	83.74
256.427	175.97
256.878	156.56
257.33	151.7
257.782	158.98
258.234	161.41
258.686	125
259.137	134.71
259.589	115.29
260.041	108.01
260.492	103.16
260.944	139.57
261.395	127.43
261.847	217.24
262.298	25.49
262.749	163.84
263.201	125
263.652	76.46
264.103	103.16
264.554	149.27
265.005	91.02
265.457	125
265.908	127.43
266.359	144.42
266.809	141.99
267.26	156.56
267.711	180.83
268.162	71.6
268.613	154.13
269.064	171.12
269.514	134.71
269.965	185.68
270.415	110.44
270.866	188.11
271.316	171.12
271.767	120.15
272.217	125
272.668	30.34
273.118	83.74
273.568	122.57
274.019	151.7
274.469	54.61
274.919	141.99
275.369	158.98
275.819	103.16
276.269	115.29
276.719	117.72
277.169	137.14
277.619	134.71
278.069	188.11
278.518	188.11
278.968	129.86
279.418	175.97
279.867	185.68
280.317	149.27
280.767	163.84
281.216	222.09
281.666	151.7
282.115	74.03
282.564	139.57
283.014	78.88
283.463	158.98
283.912	144.42
284.361	158.98
284.811	117.72
285.26	161.41
285.709	171.12
286.158	158.98
286.607	120.15
287.056	149.27
287.505	151.7
287.953	173.55
288.402	110.44
288.851	127.43
289.3	183.26
289.748	173.55
290.197	173.55
290.646	234.23
291.094	188.11
291.543	117.72
291.991	127.43
292.439	115.29
292.888	166.26
293.336	183.26
293.784	158.98
294.233	86.17
294.681	125
295.129	66.75
295.577	122.57
296.025	108.01
296.473	120.15
296.921	154.13
297.369	105.58
297.817	134.71
298.264	83.74
298.712	156.56
299.16	171.12
299.608	161.41
300.055	91.02
300.503	205.1
300.95	134.71
301.398	117.72
301.845	183.26
302.293	175.97
302.74	144.42
303.187	125
303.635	185.68
304.082	125
304.529	122.57
304.976	154.13
305.423	192.96
305.87	144.42
306.317	120.15
306.764	134.71
307.211	161.41
307.658	171.12
308.105	195.39
308.552	195.39
308.998	122.57
309.445	127.43
309.892	156.56
310.338	197.82
310.785	120.15
311.231	71.6
311.678	192.96
312.124	139.57
312.571	66.75
313.017	168.69
313.463	20.63
313.909	154.13
314.356	125
314.802	78.88
315.248	132.28
315.694	125
316.14	146.85
316.586	122.57
317.032	115.29
317.478	156.56
317.923	149.27
318.369	168.69
318.815	144.42
319.261	149.27
319.706	146.85
320.152	149.27
320.597	166.26
321.043	115.29
321.488	86.17
321.934	134.71
322.379	134.71
322.824	139.57
323.27	161.41
323.715	105.58
324.16	195.39
324.605	64.32
325.05	91.02
325.495	105.58
325.94	132.28
326.385	81.31
326.83	178.4
327.275	163.84
327.72	154.13
328.165	125
328.61	139.57
329.054	137.14
329.499	161.41
329.943	66.75
330.388	112.87
330.832	83.74
331.277	151.7
331.721	207.53
332.166	168.69
332.61	141.99
333.054	178.4
333.499	180.83
333.943	91.02
334.387	192.96
334.831	141.99
335.275	64.32
335.719	185.68
336.163	173.55
336.607	91.02
337.051	134.71
337.495	137.14
337.938	173.55
338.382	59.47
338.826	185.68
339.269	146.85
339.713	95.88
340.157	149.27
340.6	183.26
341.044	141.99
341.487	139.57
341.93	166.26
342.374	42.48
342.817	105.58
343.26	154.13
343.703	100.73
344.146	100.73
344.59	100.73
345.033	125
345.476	188.11
345.919	88.59
346.361	112.87
346.804	137.14
347.247	88.59
347.69	108.01
348.133	146.85
348.575	120.15
349.018	139.57
349.461	125
349.903	154.13
350.346	158.98
350.788	129.86
351.23	105.58
351.673	132.28
352.115	158.98
352.557	122.57
353	117.72
353.442	105.58
353.884	158.98
354.326	185.68
354.768	146.85
355.21	139.57
355.652	112.87
356.094	190.54
356.536	180.83
356.978	168.69
357.419	115.29
357.861	178.4
358.303	132.28
358.744	91.02
359.186	117.72
359.627	137.14
360.069	171.12
360.51	64.32
360.952	117.72
361.393	132.28
361.834	146.85
362.276	105.58
362.717	144.42
363.158	120.15
363.599	151.7
364.04	175.97
364.481	146.85
364.922	151.7
365.363	207.53
365.804	81.31
366.245	122.57
366.686	161.41
367.126	117.72
367.567	120.15
368.008	30.34
368.448	173.55
368.889	151.7
369.33	149.27
369.77	154.13
370.21	125
370.651	178.4
371.091	141.99
371.531	175.97
371.972	183.26
372.412	98.3
372.852	103.16
373.292	120.15
373.732	139.57
374.172	37.62
374.612	188.11
375.052	105.58
375.492	98.3
375.932	178.4
376.372	173.55
376.811	146.85
377.251	81.31
377.691	52.19
378.13	229.37
378.57	192.96
379.009	161.41
379.449	151.7
379.888	163.84
380.328	207.53
380.767	122.57
381.206	173.55
381.645	108.01
382.085	105.58
382.524	125
382.963	78.88
383.402	146.85
383.841	141.99
384.28	132.28
384.719	30.34
385.158	141.99
385.596	144.42
386.035	78.88
386.474	137.14
386.913	163.84
387.351	88.59
387.79	122.57
388.228	151.7
388.667	139.57
389.105	188.11
389.544	154.13
389.982	137.14
390.42	134.71
390.859	105.58
391.297	214.81
391.735	112.87
392.173	173.55
392.611	146.85
393.049	156.56
393.487	158.98
393.925	117.72
394.363	122.57
394.801	137.14
395.239	141.99
395.676	86.17
396.114	156.56
396.552	117.72
396.989	127.43
397.427	105.58
397.864	71.6
398.302	146.85
398.739	110.44
399.177	137.14
399.614	122.57
400.051	129.86
400.488	163.84
400.926	127.43
401.363	100.73
401.8	69.18
402.237	100.73
402.674	151.7
403.111	134.71
403.548	125
403.985	91.02
404.421	163.84
404.858	161.41
405.295	190.54
405.732	149.27
406.168	139.57
406.605	132.28
407.041	91.02
407.478	103.16
407.914	125
408.351	158.98
408.787	54.61
409.223	192.96
409.66	158.98
410.096	156.56
410.532	175.97
410.968	83.74
411.404	112.87
411.84	117.72
412.276	95.88
412.712	156.56
413.148	192.96
413.584	137.14
414.02	105.58
414.455	132.28
414.891	156.56
415.327	190.54
415.762	112.87
416.198	178.4
416.633	205.1
417.069	120.15
417.504	78.88
417.94	166.26
418.375	115.29
418.81	151.7
419.245	185.68
419.681	125
420.116	52.19
420.551	129.86
420.986	117.72
421.421	151.7
421.856	146.85
422.291	122.57
422.726	100.73
423.16	117.72
423.595	139.57
424.03	122.57
424.464	105.58
424.899	108.01
425.334	146.85
425.768	139.57
426.203	132.28
426.637	197.82
427.071	154.13
427.506	105.58
427.94	64.32
428.374	149.27
428.809	185.68
429.243	103.16
429.677	151.7
430.111	81.31
430.545	122.57
430.979	100.73
431.413	76.46
431.847	154.13
432.28	122.57
432.714	175.97
433.148	112.87
433.582	105.58
434.015	61.89
434.449	129.86
434.882	100.73
435.316	64.32
435.749	54.61
436.183	132.28
436.616	192.96
437.049	115.29
437.483	154.13
437.916	149.27
438.349	132.28
438.782	100.73
439.215	122.57
439.648	100.73
440.081	163.84
440.514	154.13
440.947	120.15
441.38	76.46
441.813	137.14
442.245	156.56
442.678	146.85
443.111	112.87
443.543	163.84
443.976	178.4
444.408	178.4
444.841	175.97
445.273	149.27
445.705	125
446.138	137.14
446.57	129.86
447.002	74.03
447.434	163.84
447.867	166.26
448.299	146.85
448.731	125
449.163	175.97
449.595	151.7
450.026	192.96
450.458	134.71
450.89	141.99
451.322	178.4
451.754	180.83
452.185	212.38
452.617	192.96
453.048	207.53
453.48	214.81
453.911	234.23
454.343	212.38
454.774	207.53
455.205	139.57
455.637	185.68
456.068	183.26
456.499	231.8
456.93	239.08
457.361	294.91
457.792	183.26
458.223	217.24
458.654	154.13
459.085	219.66
459.516	222.09
459.947	188.11
460.378	175.97
460.808	207.53
461.239	212.38
461.669	190.54
462.1	180.83
462.531	175.97
462.961	185.68
463.391	122.57
463.822	202.67
464.252	241.51
464.682	188.11
465.113	125
465.543	163.84
465.973	78.88
466.403	205.1
466.833	200.25
467.263	212.38
467.693	231.8
468.123	217.24
468.553	219.66
468.983	197.82
469.412	146.85
469.842	253.64
470.272	171.12
470.701	141.99
471.131	168.69
471.56	234.23
471.99	146.85
472.419	173.55
472.849	224.52
473.278	178.4
473.707	156.56
474.136	190.54
474.566	127.43
474.995	180.83
475.424	200.25
475.853	175.97
476.282	156.56
476.711	144.42
477.14	132.28
477.569	112.87
477.997	161.41
478.426	115.29
478.855	180.83
479.283	163.84
479.712	183.26
480.141	217.24
480.569	156.56
480.998	163.84
481.426	151.7
481.854	139.57
482.283	112.87
482.711	178.4
483.139	183.26
483.567	146.85
483.995	195.39
484.424	115.29
484.852	173.55
485.28	127.43
485.708	139.57
486.135	139.57
486.563	129.86
486.991	146.85
487.419	173.55
487.847	137.14
488.274	222.09
488.702	129.86
489.129	154.13
489.557	185.68
489.984	120.15
490.412	192.96
490.839	91.02
491.266	158.98
491.694	139.57
492.121	154.13
492.548	163.84
492.975	173.55
493.402	132.28
493.829	112.87
494.256	149.27
494.683	125
495.11	110.44
495.537	100.73
495.964	183.26
496.39	163.84
496.817	161.41
497.244	141.99
497.67	122.57
498.097	78.88
498.523	122.57
498.95	141.99
499.376	81.31
499.803	134.71
500.229	93.45
500.655	134.71
501.081	122.57
501.508	175.97
501.934	129.86
502.36	226.95
502.786	93.45
503.212	64.32
503.638	141.99
504.064	117.72
504.489	173.55
504.915	149.27
505.341	112.87
505.767	151.7
506.192	180.83
506.618	112.87
507.043	42.48
507.469	115.29
507.894	125
508.32	108.01
508.745	178.4
509.17	139.57
509.596	156.56
510.021	40.05
510.446	200.25
510.871	74.03
511.296	137.14
511.721	112.87
512.146	175.97
512.571	117.72
512.996	141.99
513.421	163.84
513.845	144.42
514.27	146.85
514.695	171.12
515.119	137.14
515.544	171.12
515.969	129.86
516.393	173.55
516.817	95.88
517.242	108.01
517.666	202.67
518.09	151.7
518.515	132.28
518.939	202.67
519.363	355.59
519.787	117.72
520.211	151.7
520.635	146.85
521.059	146.85
521.483	146.85
521.907	132.28
522.331	161.41
522.754	86.17
523.178	69.18
523.602	132.28
524.025	103.16
524.449	127.43
524.872	134.71
525.296	173.55
525.719	205.1
526.143	178.4
526.566	154.13
526.989	117.72
527.412	127.43
527.836	188.11
528.259	180.83
528.682	149.27
529.105	192.96
529.528	202.67
529.951	125
530.374	146.85
530.796	190.54
531.219	183.26
531.642	69.18
532.065	151.7
532.487	239.08
532.91	158.98
533.332	154.13
533.755	134.71
534.177	156.56
534.6	168.69
535.022	103.16
535.444	156.56
535.867	112.87
536.289	192.96
536.711	125
537.133	156.56
537.555	127.43
537.977	149.27
538.399	190.54
538.821	209.95
539.243	197.82
539.665	197.82
540.086	168.69
540.508	154.13
540.93	190.54
541.351	146.85
541.773	127.43
542.195	88.59
542.616	161.41
543.037	188.11
543.459	115.29
543.88	178.4
544.301	178.4
544.723	229.37
545.144	200.25
545.565	83.74
545.986	134.71
546.407	180.83
546.828	134.71
547.249	173.55
547.67	156.56
548.091	129.86
548.512	103.16
548.932	141.99
549.353	156.56
549.774	137.14
550.194	127.43
550.615	141.99
551.035	154.13
551.456	197.82
551.876	151.7
552.296	134.71
552.717	139.57
553.137	171.12
553.557	134.71
553.977	132.28
554.397	141.99
554.817	120.15
555.237	161.41
555.657	120.15
556.077	120.15
556.497	132.28
556.917	171.12
557.337	188.11
557.756	171.12
558.176	149.27
558.596	120.15
559.015	125
559.435	166.26
559.854	229.37
560.274	134.71
560.693	154.13
561.112	112.87
561.532	120.15
561.951	108.01
562.37	168.69
562.789	120.15
563.208	168.69
563.627	105.58
564.046	185.68
564.465	112.87
564.884	171.12
565.303	134.71
565.722	168.69
566.14	42.48
566.559	112.87
566.978	171.12
567.396	168.69
567.815	117.72
568.233	120.15
568.652	178.4
569.07	93.45
569.489	141.99
569.907	163.84
570.325	110.44
570.743	163.84
571.161	127.43
571.58	168.69
571.998	202.67
572.416	154.13
572.833	156.56
573.251	171.12
573.669	86.17
574.087	188.11
574.505	83.74
574.922	144.42
575.34	144.42
575.758	117.72
576.175	180.83
576.593	161.41
577.01	168.69
577.428	185.68
577.845	1879.88
578.262	290.05
578.68	178.4
579.097	137.14
579.514	209.95
579.931	74.03
580.348	71.6
580.765	122.57
581.182	178.4
581.599	214.81
582.016	127.43
582.433	112.87
582.849	117.72
583.266	151.7
583.683	192.96
584.099	134.71
584.516	163.84
584.933	132.28
585.349	163.84
585.765	112.87
586.182	91.02
586.598	154.13
587.014	156.56
587.431	100.73
587.847	183.26
588.263	224.52
588.679	212.38
589.095	105.58
589.511	253.64
589.927	161.41
590.343	175.97
590.759	120.15
591.174	100.73
591.59	144.42
592.006	117.72
592.421	175.97
592.837	175.97
593.252	212.38
593.668	110.44
594.083	178.4
594.499	98.3
594.914	175.97
595.329	117.72
595.745	173.55
596.16	91.02
596.575	129.86
596.99	171.12
597.405	175.97
597.82	110.44
598.235	78.88
598.65	171.12
599.065	110.44
599.479	183.26
599.894	173.55
600.309	161.41
600.724	139.57
601.138	115.29
601.553	168.69
601.967	125
602.382	151.7
602.796	151.7
603.21	149.27
603.625	132.28
604.039	120.15
604.453	149.27
604.867	195.39
605.281	173.55
605.695	192.96
606.109	212.38
606.523	168.69
606.937	139.57
607.351	268.21
607.765	141.99
608.178	166.26
608.592	156.56
609.006	122.57
609.419	192.96
609.833	166.26
610.246	93.45
610.66	127.43
611.073	134.71
611.487	207.53
611.9	178.4
612.313	144.42
612.726	125
613.139	146.85
613.553	154.13
613.966	98.3
614.379	151.7
614.792	125
615.204	93.45
615.617	178.4
616.03	151.7
616.443	95.88
616.856	137.14
617.268	120.15
617.681	112.87
618.093	158.98
618.506	183.26
618.918	117.72
619.331	183.26
619.743	171.12
620.155	95.88
620.568	98.3
620.98	139.57
621.392	185.68
621.804	141.99
622.216	103.16
622.628	188.11
623.04	129.86
623.452	202.67
623.864	168.69
624.276	219.66
624.687	127.43
625.099	115.29
625.511	151.7
625.922	158.98
626.334	180.83
626.745	81.31
627.157	192.96
627.568	139.57
627.979	163.84
628.391	144.42
628.802	146.85
629.213	122.57
629.624	209.95
630.035	139.57
630.446	144.42
630.857	141.99
631.268	112.87
631.679	156.56
632.09	195.39
632.501	166.26
632.912	83.74
633.322	192.96
633.733	144.42
634.144	175.97
634.554	137.14
634.965	156.56
635.375	226.95
635.785	120.15
636.196	224.52
636.606	76.46
637.016	154.13
637.427	93.45
637.837	122.57
638.247	103.16
638.657	129.86
639.067	64.32
639.477	120.15
639.887	112.87
640.297	103.16
640.706	161.41
641.116	125
641.526	156.56
641.935	139.57
642.345	163.84
642.755	139.57
643.164	207.53
643.573	98.3
643.983	110.44
644.392	139.57
644.801	161.41
645.211	180.83
645.62	117.72
646.029	156.56
646.438	98.3
646.847	209.95
647.256	149.27
647.665	229.37
648.074	120.15
648.483	154.13
648.892	154.13
649.3	149.27
649.709	144.42
650.118	168.69
650.526	144.42
650.935	64.32
651.343	180.83
651.752	146.85
652.16	120.15
652.568	137.14
652.977	83.74
653.385	117.72
653.793	100.73
654.201	127.43
654.609	149.27
655.017	151.7
655.425	127.43
655.833	122.57
656.241	158.98
656.649	154.13
657.057	134.71
657.464	108.01
657.872	156.56
658.28	91.02
658.687	168.69
659.095	81.31
659.502	132.28
659.91	100.73
660.317	110.44
660.724	207.53
661.132	141.99
661.539	110.44
661.946	202.67
662.353	197.82
662.76	151.7
663.167	132.28
663.574	219.66
663.981	139.57
664.388	91.02
664.795	108.01
665.202	197.82
665.608	120.15
666.015	127.43
666.422	180.83
666.828	185.68
667.235	127.43
667.641	139.57
668.047	173.55
668.454	81.31
668.86	100.73
669.266	171.12
669.673	137.14
670.079	137.14
670.485	91.02
670.891	197.82
671.297	188.11
671.703	185.68
672.109	144.42
672.515	129.86
672.92	154.13
673.326	158.98
673.732	120.15
674.138	141.99
674.543	158.98
674.949	105.58
675.354	112.87
675.76	151.7
676.165	173.55
676.57	110.44
676.976	168.69
677.381	112.87
677.786	175.97
678.191	103.16
678.596	158.98
679.001	117.72
679.406	105.58
679.811	156.56
680.216	149.27
680.621	158.98
681.026	144.42
681.43	154.13
681.835	93.45
682.24	175.97
682.644	105.58
683.049	115.29
683.453	146.85
683.858	171.12
684.262	117.72
684.667	163.84
685.071	156.56
685.475	144.42
685.879	168.69
686.283	117.72
686.687	156.56
687.091	171.12
687.495	74.03
687.899	103.16
688.303	171.12
688.707	151.7
689.111	120.15
689.514	173.55
689.918	144.42
690.322	108.01
690.725	137.14
691.129	78.88
691.532	127.43
691.936	197.82
692.339	141.99
692.742	149.27
693.146	108.01
693.549	120.15
693.952	161.41
694.355	202.67
694.758	197.82
695.161	108.01
695.564	202.67
695.967	192.96
696.37	175.97
696.773	156.56
697.175	141.99
697.578	139.57
697.981	185.68
698.383	190.54
698.786	71.6
699.188	195.39
699.591	188.11
699.993	180.83
700.395	120.15
700.798	125
701.2	202.67
701.602	112.87
702.004	110.44
702.406	154.13
702.808	98.3
703.21	168.69
703.612	132.28
704.014	144.42
704.416	122.57
704.818	173.55
705.219	149.27
705.621	115.29
706.023	110.44
706.424	166.26
706.826	260.93
707.227	178.4
707.629	117.72
708.03	241.51
708.431	134.71
708.832	273.06
709.234	137.14
709.635	217.24
710.036	178.4
710.437	173.55
710.838	175.97
711.239	161.41
711.64	188.11
712.041	197.82
712.441	192.96
712.842	217.24
713.243	219.66
713.643	175.97
714.044	190.54
714.445	188.11
714.845	151.7
715.246	166.26
715.646	200.25
716.046	214.81
716.447	260.93
716.847	209.95
717.247	192.96
717.647	222.09
718.047	200.25
718.447	205.1
718.847	200.25
719.247	188.11
719.647	200.25
720.047	241.51
720.446	224.52
720.846	270.64
721.246	258.5
721.645	253.64
722.045	319.18
722.444	219.66
722.844	139.57
723.243	253.64
723.643	304.62
724.042	217.24
724.441	192.96
724.84	212.38
725.24	260.93
725.639	341.02
726.038	260.93
726.437	239.08
726.836	275.49
727.234	297.33
727.633	345.88
728.032	338.6
728.431	367.72
728.83	401.71
729.228	348.31
729.627	433.26
730.025	421.12
730.424	382.29
730.822	501.22
731.22	462.39
731.619	503.65
732.017	610.45
732.415	729.38
732.813	649.28
733.212	756.08
733.61	855.6
734.008	918.7
734.406	938.12
734.803	940.55
735.201	959.97
735.599	1010.94
735.997	1093.46
736.395	1243.95
736.792	1447.84
737.19	1656.58
737.587	1809.49
737.985	1862.89
738.382	1736.68
738.78	1739.1
739.177	1661.43
739.574	1741.53
739.971	1989.11
740.369	2290.08
740.766	2751.26
741.163	2955.14
741.56	2913.88
741.957	2729.41
742.354	2586.21
742.751	2392.03
743.147	2472.13
743.544	2685.72
743.941	3139.61
744.338	3933.31
744.734	4404.19
745.131	4654.2
745.527	4676.04
745.924	4535.26
746.32	4013.41
746.716	3785.25
747.113	3770.69
747.509	4574.1
747.905	5549.84
748.301	6911.52
748.697	8166.39
749.093	8714.94
749.489	8411.54
749.885	7685.8
750.281	7236.76
750.677	6384.81
751.073	5952.76
751.468	6545
751.864	7600.85
752.26	9052.33
752.655	10962.55
753.051	12532.96
753.446	13579.09
753.842	13639.78
754.237	12809.67
754.632	11205.27
755.028	9877.58
755.423	8460.08
755.818	8214.93
756.213	8882.42
756.608	9904.28
757.003	11421.29
757.398	13394.63
757.793	14678.63
758.188	15431.07
758.583	15632.52
758.977	14583.96
759.372	13377.64
759.767	11969.85
760.161	10853.32
760.556	10392.15
760.95	10719.83
761.345	12724.71
761.739	15397.08
762.133	19229.67
762.527	22887.49
762.922	26045.31
763.316	28360.88
763.71	29147.3
764.104	28021.07
764.498	26370.56
764.892	23309.83
765.286	20843.77
765.68	18380.14
766.073	17033.03
766.467	16792.74
766.861	18229.65
767.255	22324.38
767.648	26807.46
768.042	31025.97
768.435	36562.46
768.829	41261.56
769.222	42390.22
769.615	44079.57
770.008	41822.25
770.402	38979.98
770.795	36479.94
771.188	32608.52
771.581	27630.28
771.974	23571.97
772.367	21409.31
772.76	20394.73
773.153	20292.79
773.545	22127.77
773.938	24751.6
774.331	28606.03
774.724	33314.84
775.116	38557.64
775.509	44166.95
775.901	48383.03
776.294	50237.43
776.686	50424.33
777.078	49516.55
777.471	48594.2
777.863	44895.12
778.255	42108.66
778.647	37800.35
779.039	33521.15
779.431	29409.44
779.823	27489.51
780.215	26795.32
780.607	27453.1
780.999	29521.09
781.39	32928.91
781.782	37865.88
782.174	43572.28
782.565	49635.48
782.957	53834.58
783.348	57363.76
783.74	59227.86
784.131	59706.03
784.522	60470.6
784.914	60130.79
785.305	58582.22
785.696	56070.05
786.087	53856.42
786.478	48819.93
786.869	43183.92
787.26	38246.95
787.651	33637.66
788.042	29055.06
788.433	25603.55
788.823	21804.95
789.214	20025.8
789.605	18508.78
789.995	18273.34
790.386	18443.25
790.776	19814.63
791.167	20989.4
791.557	24666.65
791.948	27710.38
792.338	30746.84
792.728	35135.26
793.118	39018.81
793.508	41475.16
793.898	42916.93
794.288	45322.31
794.678	46805.34
795.068	48747.12
795.458	48662.16
795.848	48023.81
796.238	46482.52
796.627	44480.06
797.017	43700.92
797.406	42324.69
797.796	40069.8
798.185	38545.5
798.575	36513.92
798.964	34232.33
799.354	32938.62
799.743	30686.16
800.132	28809.91
800.521	26882.7
800.91	24834.12
801.299	23404.49
801.688	22300.1
802.077	20586.49
802.466	20067.06
802.855	19309.77
803.244	18576.75
803.633	18372.86
804.021	17817.02
804.41	18181.11
804.799	18076.74
805.187	17979.65
805.576	18161.69
805.964	19168.99
806.352	19511.23
806.741	20360.75
807.129	21445.72
807.517	22074.37
807.905	22914.19
808.293	24581.69
808.681	26377.84
809.069	27416.69
809.457	30627.9
809.845	32064.82
810.233	33091.53
810.621	34351.26
811.009	35513.9
811.396	36380.42
811.784	37164.41
812.171	36921.69
812.559	37984.81
812.946	37528.5
813.334	37759.08
813.721	37594.03
814.108	36606.15
814.496	37555.2
814.883	37290.63
815.27	39572.22
815.657	40271.26
816.044	39683.87
816.431	39615.91
816.818	38778.52
817.205	38785.8
817.592	38572.2
817.979	38484.82
818.365	38016.37
818.752	36144.98
819.139	35348.85
819.525	35035.74
819.912	33848.83
820.298	33324.55
820.685	31812.39
821.071	30780.82
821.457	29241.96
821.843	28101.17
822.23	27450.67
822.616	25746.76
823.002	23554.98
823.388	22727.3
823.774	21615.63
824.16	20530.66
824.546	19986.96
824.931	19426.27
825.317	18746.65
825.703	18744.22
826.089	18894.71
826.474	18372.86
826.86	18190.82
827.245	18059.75
827.631	18035.47
828.016	17855.86
828.401	17491.78
828.787	17622.85
829.172	17496.63
829.557	16117.97
829.942	15518.45
830.327	15455.34
830.712	15341.26
831.097	14719.89
831.482	14513.58
831.867	14108.23
832.252	13838.81
832.636	13523.27
833.021	13319.38
833.406	13052.39
833.79	13117.92
834.175	12608.21
834.559	12608.21
834.944	12049.94
835.328	11474.69
835.713	11326.63
836.097	10909.15
836.481	10615.46
836.865	10367.88
837.249	9799.91
837.633	9639.71
838.017	9057.18
838.401	8540.18
838.785	7926.09
839.169	7625.12
839.553	7144.53
839.937	6632.38
840.32	6091.11
840.704	5612.95
841.087	5389.65
841.471	5061.97
841.854	4564.39
842.238	4304.68
842.621	4324.1
843.004	4052.25
843.388	3727
843.771	3447.87
844.154	3234.27
844.537	3129.9
844.92	2993.98
845.303	2867.76
845.686	2724.56
846.069	2683.29
846.452	2321.64
846.834	2149.31
847.217	2117.75
847.6	1845.9
847.982	1899.3
848.365	1770.66
848.748	1620.17
849.13	1668.72
849.512	1571.63
849.895	1549.78
850.277	1457.55
850.659	1416.28
851.041	1510.95
851.423	1576.48
851.806	1603.18
852.188	1690.56
852.57	1760.95
852.951	1802.21
853.333	1996.39
853.715	2100.76
854.097	2105.62
854.479	2231.83
854.86	2112.9
855.242	2163.87
855.623	2353.19
856.005	2304.65
856.386	2452.71
856.768	2277.95
857.149	2287.66
857.53	2076.49
857.911	2222.12
858.292	2132.31
858.674	2098.33
859.055	1957.55
859.436	1787.65
859.817	1622.6
860.197	1634.73
860.578	1501.24
860.959	1343.47
861.34	1222.11
861.72	1125.02
862.101	1040.06
862.482	969.68
862.862	836.18
863.243	918.7
863.623	756.08
864.003	620.16
864.384	690.54
864.764	595.88
865.144	576.47
865.524	515.78
865.904	501.22
866.284	455.1
866.664	496.37
867.044	435.69
867.424	438.11
867.804	438.11
868.183	469.67
868.563	450.25
868.943	549.77
869.322	544.91
869.702	527.92
870.081	510.93
870.461	547.34
870.84	561.9
871.22	608.02
871.599	530.35
871.978	566.76
872.357	481.8
872.736	447.82
873.115	472.09
873.494	513.36
873.873	411.41
874.252	394.42
874.631	379.86
875.01	348.31
875.388	299.76
875.767	316.75
876.146	224.52
876.524	202.67
876.903	280.34
877.281	253.64
877.66	200.25
878.038	188.11
878.416	185.68
878.794	207.53
879.173	224.52
879.551	183.26
879.929	185.68
880.307	202.67
880.685	183.26
881.063	234.23
881.441	231.8
881.818	146.85
882.196	175.97
882.574	156.56
882.951	175.97
883.329	185.68
883.707	178.4
884.084	226.95
884.461	200.25
884.839	171.12
885.216	166.26
885.593	141.99
885.971	151.7
886.348	180.83
886.725	149.27
887.102	151.7
887.479	234.23
887.856	171.12
888.233	95.88
888.609	91.02
888.986	146.85
889.363	173.55
889.74	129.86
890.116	200.25
890.493	197.82
890.869	188.11
891.246	185.68
891.622	132.28
891.998	156.56
892.375	146.85
892.751	115.29
893.127	95.88
893.503	180.83
893.879	205.1
894.255	151.7
894.631	173.55
895.007	95.88
895.383	93.45
895.759	166.26
896.134	171.12
896.51	122.57
896.886	108.01
897.261	110.44
897.637	205.1
898.012	139.57
898.388	108.01
898.763	112.87
899.138	171.12
899.514	103.16
899.889	69.18
900.264	185.68
900.639	166.26
901.014	122.57
901.389	117.72
901.764	115.29
902.139	95.88
902.513	120.15
902.888	105.58
903.263	125
903.638	127.43
904.012	6.07
904.387	122.57
904.761	175.97
905.136	95.88
905.51	154.13
905.884	129.86
906.259	129.86
906.633	54.61
907.007	93.45
907.381	49.76
907.755	69.18
908.129	156.56
908.503	154.13
908.877	120.15
909.251	91.02
909.624	57.04
909.998	71.6
910.372	166.26
910.745	146.85
911.119	171.12
911.492	120.15
911.866	108.01
912.239	137.14
912.612	212.38
912.986	93.45
913.359	141.99
913.732	175.97
914.105	154.13
914.478	103.16
914.851	127.43
915.224	156.56
915.597	71.6
915.97	112.87
916.343	134.71
916.715	144.42
917.088	52.19
917.461	168.69
917.833	166.26
918.206	178.4
918.578	166.26
918.951	91.02
919.323	76.46
919.695	163.84
920.067	137.14
920.44	117.72
920.812	86.17
921.184	163.84
921.556	105.58
921.928	134.71
922.3	93.45
922.672	115.29
923.043	86.17
923.415	168.69
923.787	175.97
924.158	171.12
924.53	42.48
924.901	175.97
925.273	144.42
925.644	144.42
926.016	132.28
926.387	127.43
926.758	146.85
927.129	100.73
927.5	141.99
927.872	161.41
928.243	83.74
928.613	86.17
928.984	139.57
929.355	100.73
929.726	188.11
930.097	139.57
930.467	122.57
930.838	151.7
931.209	81.31
931.579	146.85
931.95	95.88
932.32	158.98
932.69	141.99
933.061	112.87
933.431	132.28
933.801	105.58
934.171	134.71
934.541	86.17
934.911	137.14
935.281	93.45
935.651	151.7
936.021	141.99
936.391	81.31
936.761	108.01
937.13	168.69
937.5	86.17
937.87	132.28
938.239	100.73
938.609	168.69
938.978	115.29
939.347	117.72
939.717	69.18
940.086	69.18
940.455	190.54
940.824	183.26
941.193	61.89
941.562	166.26
941.931	120.15
942.3	151.7
942.669	146.85
943.038	158.98
943.407	110.44
943.775	183.26
944.144	168.69
944.513	108.01
944.881	154.13
945.25	129.86
945.618	93.45
945.986	180.83
946.355	122.57
946.723	115.29
947.091	163.84
947.459	81.31
947.827	137.14
948.195	105.58
948.563	129.86
948.931	197.82
949.299	156.56
949.667	61.89
950.035	117.72
950.402	105.58
950.77	115.29
951.138	120.15
951.505	127.43
951.873	54.61
952.24	88.59
952.607	120.15
952.975	190.54
953.342	141.99
953.709	141.99
954.076	49.76
954.443	93.45
954.81	122.57
955.177	156.56
955.544	134.71
955.911	105.58
956.278	108.01
956.645	95.88
957.012	151.7
957.378	71.6
957.745	185.68
958.111	171.12
958.478	141.99
958.844	190.54
959.211	171.12
959.577	93.45
959.943	200.25
960.309	195.39
960.675	197.82
961.042	100.73
961.408	166.26
961.774	137.14
962.139	120.15
962.505	88.59
962.871	129.86
963.237	144.42
963.603	91.02
963.968	103.16
964.334	161.41
964.699	207.53
965.065	110.44
965.43	117.72
965.796	115.29
966.161	110.44
966.526	81.31
966.891	154.13
967.256	175.97
967.622	183.26
967.987	100.73
968.352	44.9
968.716	69.18
969.081	141.99
969.446	91.02
969.811	166.26
970.176	158.98
970.54	161.41
970.905	149.27
971.269	103.16
971.634	103.16
971.998	144.42
972.363	156.56
972.727	15.78
973.091	110.44
973.455	129.86
973.819	103.16
974.183	110.44
974.547	44.9
974.911	168.69
975.275	158.98
975.639	125
976.003	146.85
976.367	125
976.73	95.88
977.094	115.29
977.458	178.4
977.821	110.44
978.185	115.29
978.548	115.29
978.911	115.29
979.275	149.27
979.638	134.71
980.001	132.28
980.364	86.17
980.727	59.47
981.09	168.69
981.453	76.46
981.816	183.26
982.179	158.98
982.542	175.97
982.905	139.57
983.267	108.01
983.63	78.88
983.992	156.56
984.355	132.28
984.717	76.46
985.08	151.7
985.442	137.14
985.804	146.85
986.167	120.15
986.529	115.29
986.891	95.88
987.253	95.88
987.615	91.02
987.977	74.03
988.339	110.44
988.701	125
989.062	132.28
989.424	64.32
989.786	205.1
990.147	134.71
990.509	125
990.87	122.57
991.232	91.02
991.593	183.26
991.955	141.99
992.316	139.57
992.677	146.85
993.038	180.83
993.399	110.44
993.76	100.73
994.121	98.3
994.482	76.46
994.843	144.42
995.204	129.86
995.565	95.88
995.926	95.88
996.286	69.18
996.647	149.27
997.007	185.68
997.368	158.98
997.728	112.87
998.089	69.18
998.449	93.45
998.809	86.17
999.169	141.99
999.53	134.71
999.89	74.03
1000.25	134.71
1000.61	178.4
1000.97	185.68
1001.329	117.72
1001.689	156.56
1002.049	132.28
1002.409	83.74
1002.768	112.87
1003.128	71.6
1003.487	105.58
1003.847	156.56
1004.206	154.13
1004.566	117.72
1004.925	205.1
1005.284	76.46
1005.643	151.7
1006.003	214.81
1006.362	132.28
1006.721	134.71
1007.08	156.56
1007.438	127.43
1007.797	122.57
1008.156	132.28
1008.515	178.4
1008.874	146.85
1009.232	86.17
1009.591	98.3
1009.949	127.43
1010.308	127.43
1010.666	137.14
1011.024	183.26
1011.383	93.45
1011.741	66.75
1012.099	178.4
1012.457	108.01
1012.815	108.01
1013.173	110.44
1013.531	129.86
1013.889	86.17
1014.247	127.43
1014.605	120.15
1014.962	139.57
1015.32	86.17
1015.678	44.9
1016.035	112.87
1016.393	100.73
1016.75	100.73
1017.107	173.55
1017.465	52.19
1017.822	66.75
1018.179	144.42
1018.536	127.43
1018.894	149.27
1019.251	134.71
1019.608	122.57
1019.964	122.57
1020.321	122.57
1020.678	134.71
1021.035	108.01
1021.392	110.44
1021.748	83.74
1022.105	127.43
1022.461	78.88
1022.818	154.13
1023.174	134.71
1023.531	125
1023.887	178.4
1024.243	158.98
1024.599	117.72
1024.955	86.17
1025.311	127.43
1025.667	78.88
1026.023	103.16
1026.379	132.28
1026.735	105.58
1027.091	117.72
1027.447	171.12
