189.514	82.68
189.973	82.68
190.431	82.68
190.889	-9.56
191.348	0.15
191.806	29.28
192.264	-16.84
192.722	43.84
193.18	-11.98
193.638	-2.28
194.096	-48.39
194.554	-53.25
195.012	7.43
195.47	-53.25
195.928	2.58
196.385	2.58
196.843	-50.82
197.301	-2.28
197.758	2.58
198.216	60.83
198.674	29.28
199.131	89.96
199.589	121.51
200.046	99.67
200.503	26.85
200.961	22
201.418	150.64
201.875	41.41
202.332	89.96
202.79	72.97
203.247	99.67
203.704	94.81
204.161	119.09
204.618	123.94
205.075	106.95
205.532	85.1
205.989	167.63
206.445	191.9
206.902	109.38
207.359	204.04
207.816	114.23
208.272	92.39
208.729	116.66
209.185	99.67
209.642	184.62
210.098	128.79
210.555	167.63
211.011	131.22
211.467	153.07
211.924	126.37
212.38	157.92
212.836	136.08
213.292	194.33
213.748	109.38
214.204	102.1
214.66	99.67
215.116	136.08
215.572	155.49
216.028	160.35
216.484	131.22
216.94	160.35
217.396	133.65
217.851	143.36
218.307	140.93
218.763	143.36
219.218	160.35
219.674	160.35
220.129	196.76
220.585	155.49
221.04	140.93
221.496	136.08
221.951	123.94
222.406	165.2
222.861	89.96
223.317	126.37
223.772	60.83
224.227	140.93
224.682	128.79
225.137	145.79
225.592	123.94
226.047	89.96
226.502	126.37
226.957	136.08
227.411	138.5
227.866	165.2
228.321	133.65
228.776	182.19
229.23	138.5
229.685	174.91
230.139	191.9
230.594	126.37
231.048	165.2
231.503	94.81
231.957	182.19
232.411	145.79
232.865	155.49
233.32	170.06
233.774	155.49
234.228	128.79
234.682	111.8
235.136	162.78
235.59	75.4
236.044	114.23
236.498	162.78
236.952	75.4
237.406	138.5
237.86	174.91
238.313	170.06
238.767	225.88
239.221	111.8
239.674	170.06
240.128	126.37
240.581	85.1
241.035	94.81
241.488	150.64
241.942	143.36
242.395	160.35
242.848	145.79
243.301	109.38
243.755	70.54
244.208	136.08
244.661	189.48
245.114	82.68
245.567	75.4
246.02	68.11
246.473	150.64
246.926	208.89
247.379	77.82
247.832	121.51
248.284	60.83
248.737	136.08
249.19	148.21
249.642	85.1
250.095	160.35
250.547	116.66
251	184.62
251.452	170.06
251.905	160.35
252.357	140.93
252.81	162.78
253.262	80.25
253.714	162.78
254.166	187.05
254.618	143.36
255.07	123.94
255.523	77.82
255.975	128.79
256.427	99.67
256.878	187.05
257.33	245.3
257.782	99.67
258.234	187.05
258.686	177.34
259.137	150.64
259.589	165.2
260.041	126.37
260.492	213.75
260.944	94.81
261.395	85.1
261.847	172.48
262.298	153.07
262.749	165.2
263.201	116.66
263.652	111.8
264.103	94.81
264.554	153.07
265.005	150.64
265.457	89.96
265.908	131.22
266.359	179.77
266.809	211.32
267.26	160.35
267.711	160.35
268.162	165.2
268.613	145.79
269.064	123.94
269.514	55.98
269.965	133.65
270.415	114.23
270.866	148.21
271.316	133.65
271.767	153.07
272.217	119.09
272.668	201.61
273.118	126.37
273.568	177.34
274.019	102.1
274.469	153.07
274.919	167.63
275.369	140.93
275.819	133.65
276.269	77.82
276.719	174.91
277.169	199.18
277.619	199.18
278.069	138.5
278.518	128.79
278.968	160.35
279.418	155.49
279.867	199.18
280.317	116.66
280.767	87.53
281.216	160.35
281.666	136.08
282.115	194.33
282.564	126.37
283.014	109.38
283.463	116.66
283.912	123.94
284.361	104.52
284.811	126.37
285.26	138.5
285.709	157.92
286.158	187.05
286.607	116.66
287.056	136.08
287.505	160.35
287.953	172.48
288.402	182.19
288.851	128.79
289.3	133.65
289.748	145.79
290.197	104.52
290.646	77.82
291.094	85.1
291.543	85.1
291.991	126.37
292.439	94.81
292.888	128.79
293.336	145.79
293.784	167.63
294.233	138.5
294.681	123.94
295.129	184.62
295.577	136.08
296.025	153.07
296.473	162.78
296.921	89.96
297.369	121.51
297.817	165.2
298.264	121.51
298.712	170.06
299.16	126.37
299.608	116.66
300.055	77.82
300.503	121.51
300.95	233.17
301.398	70.54
301.845	116.66
302.293	140.93
302.74	89.96
303.187	211.32
303.635	165.2
304.082	102.1
304.529	99.67
304.976	148.21
305.423	77.82
305.87	187.05
306.317	165.2
306.764	155.49
307.211	204.04
307.658	111.8
308.105	153.07
308.552	87.53
308.998	104.52
309.445	99.67
309.892	136.08
310.338	157.92
310.785	160.35
311.231	223.46
311.678	133.65
312.124	131.22
312.571	131.22
313.017	131.22
313.463	172.48
313.909	121.51
314.356	89.96
314.802	221.03
315.248	138.5
315.694	140.93
316.14	102.1
316.586	179.77
317.032	157.92
317.478	174.91
317.923	228.31
318.369	121.51
318.815	143.36
319.261	138.5
319.706	138.5
320.152	167.63
320.597	77.82
321.043	153.07
321.488	128.79
321.934	82.68
322.379	143.36
322.824	165.2
323.27	140.93
323.715	160.35
324.16	80.25
324.605	165.2
325.05	58.41
325.495	133.65
325.94	145.79
326.385	194.33
326.83	138.5
327.275	140.93
327.72	121.51
328.165	201.61
328.61	143.36
329.054	114.23
329.499	165.2
329.943	182.19
330.388	48.7
330.832	89.96
331.277	187.05
331.721	213.75
332.166	184.62
332.61	119.09
333.054	128.79
333.499	155.49
333.943	119.09
334.387	145.79
334.831	225.88
335.275	94.81
335.719	187.05
336.163	174.91
336.607	99.67
337.051	145.79
337.495	155.49
337.938	53.55
338.382	99.67
338.826	136.08
339.269	131.22
339.713	92.39
340.157	133.65
340.6	136.08
341.044	128.79
341.487	153.07
341.93	172.48
342.374	150.64
342.817	189.48
343.26	213.75
343.703	128.79
344.146	148.21
344.59	162.78
345.033	123.94
345.476	89.96
345.919	126.37
346.361	138.5
346.804	160.35
347.247	136.08
347.69	99.67
348.133	140.93
348.575	155.49
349.018	111.8
349.461	128.79
349.903	148.21
350.346	153.07
350.788	133.65
351.23	153.07
351.673	165.2
352.115	111.8
352.557	155.49
353	128.79
353.442	172.48
353.884	148.21
354.326	150.64
354.768	174.91
355.21	187.05
355.652	116.66
356.094	153.07
356.536	194.33
356.978	133.65
357.419	201.61
357.861	99.67
358.303	77.82
358.744	160.35
359.186	157.92
359.627	97.24
360.069	106.95
360.51	121.51
360.952	148.21
361.393	94.81
361.834	143.36
362.276	116.66
362.717	148.21
363.158	170.06
363.599	170.06
364.04	167.63
364.481	97.24
364.922	177.34
365.363	82.68
365.804	111.8
366.245	143.36
366.686	213.75
367.126	123.94
367.567	179.77
368.008	160.35
368.448	92.39
368.889	140.93
369.33	160.35
369.77	99.67
370.21	162.78
370.651	199.18
371.091	65.69
371.531	68.11
371.972	172.48
372.412	126.37
372.852	145.79
373.292	160.35
373.732	191.9
374.172	102.1
374.612	99.67
375.052	170.06
375.492	199.18
375.932	157.92
376.372	123.94
376.811	119.09
377.251	150.64
377.691	104.52
378.13	138.5
378.57	94.81
379.009	99.67
379.449	102.1
379.888	87.53
380.328	128.79
380.767	109.38
381.206	177.34
381.645	179.77
382.085	109.38
382.524	189.48
382.963	145.79
383.402	167.63
383.841	99.67
384.28	104.52
384.719	51.12
385.158	157.92
385.596	133.65
386.035	111.8
386.474	201.61
386.913	153.07
387.351	133.65
387.79	160.35
388.228	111.8
388.667	119.09
389.105	128.79
389.544	191.9
389.982	126.37
390.42	182.19
390.859	106.95
391.297	104.52
391.735	114.23
392.173	148.21
392.611	94.81
393.049	123.94
393.487	165.2
393.925	94.81
394.363	119.09
394.801	114.23
395.239	114.23
395.676	111.8
396.114	143.36
396.552	133.65
396.989	157.92
397.427	143.36
397.864	145.79
398.302	172.48
398.739	187.05
399.177	111.8
399.614	208.89
400.051	131.22
400.488	187.05
400.926	136.08
401.363	143.36
401.8	116.66
402.237	123.94
402.674	123.94
403.111	172.48
403.548	179.77
403.985	172.48
404.421	114.23
404.858	157.92
405.295	191.9
405.732	106.95
406.168	114.23
406.605	75.4
407.041	143.36
407.478	148.21
407.914	114.23
408.351	41.41
408.787	121.51
409.223	182.19
409.66	145.79
410.096	128.79
410.532	162.78
410.968	182.19
411.404	162.78
411.84	65.69
412.276	153.07
412.712	126.37
413.148	128.79
413.584	104.52
414.02	116.66
414.455	191.9
414.891	104.52
415.327	92.39
415.762	143.36
416.198	150.64
416.633	109.38
417.069	65.69
417.504	92.39
417.94	208.89
418.375	153.07
418.81	136.08
419.245	187.05
419.681	131.22
420.116	170.06
420.551	257.44
420.986	165.2
421.421	109.38
421.856	109.38
422.291	89.96
422.726	109.38
423.16	172.48
423.595	82.68
424.03	218.6
424.464	225.88
424.899	259.86
425.334	157.92
425.768	136.08
426.203	133.65
426.637	177.34
427.071	145.79
427.506	143.36
427.94	94.81
428.374	201.61
428.809	223.46
429.243	165.2
429.677	143.36
430.111	145.79
430.545	121.51
430.979	126.37
431.413	162.78
431.847	228.31
432.28	128.79
432.714	145.79
433.148	157.92
433.582	114.23
434.015	128.79
434.449	189.48
434.882	225.88
435.316	102.1
435.749	109.38
436.183	128.79
436.616	155.49
437.049	97.24
437.483	136.08
437.916	157.92
438.349	167.63
438.782	148.21
439.215	58.41
439.648	136.08
440.081	116.66
440.514	165.2
440.947	162.78
441.38	148.21
441.813	182.19
442.245	172.48
442.678	155.49
443.111	194.33
443.543	150.64
443.976	157.92
444.408	174.91
444.841	191.9
445.273	167.63
445.705	94.81
446.138	184.62
446.57	162.78
447.002	116.66
447.434	208.89
447.867	160.35
448.299	167.63
448.731	267.15
449.163	138.5
449.595	128.79
450.026	148.21
450.458	150.64
450.89	204.04
451.322	189.48
451.754	170.06
452.185	177.34
452.617	174.91
453.048	179.77
453.48	138.5
453.911	230.74
454.343	208.89
454.774	187.05
455.205	189.48
455.637	155.49
456.068	235.59
456.499	206.47
456.93	216.17
457.361	157.92
457.792	225.88
458.223	262.29
458.654	211.32
459.085	138.5
459.516	221.03
459.947	123.94
460.378	206.47
460.808	189.48
461.239	208.89
461.669	136.08
462.1	167.63
462.531	250.16
462.961	153.07
463.391	145.79
463.822	157.92
464.252	177.34
464.682	145.79
465.113	177.34
465.543	162.78
465.973	143.36
466.403	177.34
466.833	187.05
467.263	208.89
467.693	255.01
468.123	204.04
468.553	233.17
468.983	194.33
469.412	82.68
469.842	228.31
470.272	153.07
470.701	184.62
471.131	172.48
471.56	233.17
471.99	162.78
472.419	206.47
472.849	153.07
473.278	148.21
473.707	138.5
474.136	199.18
474.566	184.62
474.995	111.8
475.424	153.07
475.853	211.32
476.282	148.21
476.711	187.05
477.14	114.23
477.569	145.79
477.997	145.79
478.426	196.76
478.855	65.69
479.283	153.07
479.712	257.44
480.141	206.47
480.569	157.92
480.998	201.61
481.426	145.79
481.854	145.79
482.283	140.93
482.711	89.96
483.139	187.05
483.567	114.23
483.995	204.04
484.424	104.52
484.852	189.48
485.28	211.32
485.708	143.36
486.135	223.46
486.563	206.47
486.991	187.05
487.419	143.36
487.847	150.64
488.274	128.79
488.702	189.48
489.129	184.62
489.557	128.79
489.984	201.61
490.412	196.76
490.839	128.79
491.266	184.62
491.694	165.2
492.121	245.3
492.548	157.92
492.975	228.31
493.402	189.48
493.829	179.77
494.256	109.38
494.683	160.35
495.11	145.79
495.537	143.36
495.964	155.49
496.39	109.38
496.817	174.91
497.244	204.04
497.67	145.79
498.097	104.52
498.523	191.9
498.95	148.21
499.376	133.65
499.803	133.65
500.229	136.08
500.655	128.79
501.081	145.79
501.508	85.1
501.934	194.33
502.36	155.49
502.786	182.19
503.212	247.73
503.638	189.48
504.064	140.93
504.489	216.17
504.915	208.89
505.341	177.34
505.767	182.19
506.192	155.49
506.618	106.95
507.043	119.09
507.469	157.92
507.894	60.83
508.32	225.88
508.745	184.62
509.17	153.07
509.596	218.6
510.021	109.38
510.446	174.91
510.871	126.37
511.296	92.39
511.721	267.15
512.146	155.49
512.571	133.65
512.996	143.36
513.421	189.48
513.845	162.78
514.27	150.64
514.695	150.64
515.119	148.21
515.544	160.35
515.969	177.34
516.393	162.78
516.817	111.8
517.242	126.37
517.666	138.5
518.09	170.06
518.515	165.2
518.939	172.48
519.363	335.11
519.787	157.92
520.211	128.79
520.635	194.33
521.059	184.62
521.483	184.62
521.907	143.36
522.331	150.64
522.754	89.96
523.178	155.49
523.602	179.77
524.025	211.32
524.449	196.76
524.872	119.09
525.296	182.19
525.719	148.21
526.143	170.06
526.566	165.2
526.989	138.5
527.412	167.63
527.836	109.38
528.259	177.34
528.682	170.06
529.105	121.51
529.528	191.9
529.951	128.79
530.374	114.23
530.796	172.48
531.219	170.06
531.642	114.23
532.065	162.78
532.487	102.1
532.91	126.37
533.332	165.2
533.755	182.19
534.177	182.19
534.6	148.21
535.022	199.18
535.444	136.08
535.867	184.62
536.289	179.77
536.711	179.77
537.133	182.19
537.555	189.48
537.977	153.07
538.399	167.63
538.821	196.76
539.243	160.35
539.665	179.77
540.086	126.37
540.508	235.59
540.93	211.32
541.351	126.37
541.773	114.23
542.195	276.86
542.616	213.75
543.037	269.57
543.459	172.48
543.88	138.5
544.301	228.31
544.723	216.17
545.144	191.9
545.565	238.02
545.986	240.45
546.407	225.88
546.828	150.64
547.249	138.5
547.67	150.64
548.091	184.62
548.512	189.48
548.932	170.06
549.353	194.33
549.774	121.51
550.194	177.34
550.615	138.5
551.035	121.51
551.456	208.89
551.876	150.64
552.296	187.05
552.717	184.62
553.137	138.5
553.557	128.79
553.977	114.23
554.397	187.05
554.817	160.35
555.237	165.2
555.657	150.64
556.077	170.06
556.497	148.21
556.917	199.18
557.337	155.49
557.756	138.5
558.176	94.81
558.596	131.22
559.015	145.79
559.435	165.2
559.854	177.34
560.274	221.03
560.693	138.5
561.112	145.79
561.532	167.63
561.951	155.49
562.37	172.48
562.789	196.76
563.208	189.48
563.627	165.2
564.046	153.07
564.465	208.89
564.884	121.51
565.303	189.48
565.722	162.78
566.14	208.89
566.559	121.51
566.978	221.03
567.396	131.22
567.815	230.74
568.233	216.17
568.652	199.18
569.07	126.37
569.489	126.37
569.907	143.36
570.325	131.22
570.743	184.62
571.161	136.08
571.58	179.77
571.998	199.18
572.416	136.08
572.833	128.79
573.251	138.5
573.669	174.91
574.087	150.64
574.505	167.63
574.922	145.79
575.34	184.62
575.758	187.05
576.175	150.64
576.593	162.78
577.01	150.64
577.428	187.05
577.845	1483.18
578.262	291.42
578.68	194.33
579.097	138.5
579.514	140.93
579.931	153.07
580.348	155.49
580.765	80.25
581.182	126.37
581.599	184.62
582.016	167.63
582.433	167.63
582.849	123.94
583.266	167.63
583.683	126.37
584.099	138.5
584.516	150.64
584.933	133.65
585.349	145.79
585.765	150.64
586.182	184.62
586.598	155.49
587.014	150.64
587.431	184.62
587.847	233.17
588.263	204.04
588.679	187.05
589.095	153.07
589.511	225.88
589.927	157.92
590.343	174.91
590.759	160.35
591.174	170.06
591.59	157.92
592.006	55.98
592.421	97.24
592.837	191.9
593.252	177.34
593.668	162.78
594.083	123.94
594.499	179.77
594.914	121.51
595.329	177.34
595.745	172.48
596.16	123.94
596.575	123.94
596.99	128.79
597.405	160.35
597.82	155.49
598.235	238.02
598.65	143.36
599.065	170.06
599.479	194.33
599.894	221.03
600.309	104.52
600.724	148.21
601.138	187.05
601.553	201.61
601.967	150.64
602.382	97.24
602.796	126.37
603.21	80.25
603.625	228.31
604.039	116.66
604.453	140.93
604.867	145.79
605.281	172.48
605.695	94.81
606.109	184.62
606.523	99.67
606.937	131.22
607.351	221.03
607.765	97.24
608.178	170.06
608.592	191.9
609.006	225.88
609.419	177.34
609.833	170.06
610.246	206.47
610.66	140.93
611.073	189.48
611.487	116.66
611.9	104.52
612.313	223.46
612.726	170.06
613.139	160.35
613.553	111.8
613.966	153.07
614.379	170.06
614.792	199.18
615.204	148.21
615.617	160.35
616.03	104.52
616.443	150.64
616.856	177.34
617.268	194.33
617.681	126.37
618.093	184.62
618.506	121.51
618.918	89.96
619.331	119.09
619.743	157.92
620.155	150.64
620.568	155.49
620.98	82.68
621.392	138.5
621.804	167.63
622.216	104.52
622.628	155.49
623.04	206.47
623.452	196.76
623.864	172.48
624.276	201.61
624.687	140.93
625.099	204.04
625.511	128.79
625.922	201.61
626.334	184.62
626.745	182.19
627.157	87.53
627.568	109.38
627.979	128.79
628.391	143.36
628.802	174.91
629.213	148.21
629.624	109.38
630.035	182.19
630.446	111.8
630.857	126.37
631.268	170.06
631.679	172.48
632.09	157.92
632.501	126.37
632.912	136.08
633.322	136.08
633.733	155.49
634.144	191.9
634.554	94.81
634.965	201.61
635.375	177.34
635.785	138.5
636.196	218.6
636.606	104.52
637.016	121.51
637.427	104.52
637.837	165.2
638.247	157.92
638.657	179.77
639.067	72.97
639.477	133.65
639.887	187.05
640.297	184.62
640.706	182.19
641.116	114.23
641.526	162.78
641.935	153.07
642.345	143.36
642.755	116.66
643.164	102.1
643.573	170.06
643.983	182.19
644.392	119.09
644.801	114.23
645.211	204.04
645.62	102.1
646.029	145.79
646.438	160.35
646.847	145.79
647.256	155.49
647.665	111.8
648.074	150.64
648.483	150.64
648.892	216.17
649.3	177.34
649.709	148.21
650.118	160.35
650.526	131.22
650.935	102.1
651.343	167.63
651.752	106.95
652.16	138.5
652.568	167.63
652.977	145.79
653.385	111.8
653.793	225.88
654.201	211.32
654.609	145.79
655.017	87.53
655.425	150.64
655.833	136.08
656.241	199.18
656.649	126.37
657.057	126.37
657.464	128.79
657.872	167.63
658.28	172.48
658.687	109.38
659.095	172.48
659.502	153.07
659.91	172.48
660.317	225.88
660.724	160.35
661.132	148.21
661.539	136.08
661.946	126.37
662.353	153.07
662.76	148.21
663.167	68.11
663.574	145.79
663.981	170.06
664.388	131.22
664.795	172.48
665.202	157.92
665.608	155.49
666.015	165.2
666.422	123.94
666.828	133.65
667.235	143.36
667.641	143.36
668.047	150.64
668.454	170.06
668.86	106.95
669.266	143.36
669.673	68.11
670.079	121.51
670.485	143.36
670.891	177.34
671.297	121.51
671.703	138.5
672.109	80.25
672.515	111.8
672.92	182.19
673.326	131.22
673.732	216.17
674.138	119.09
674.543	145.79
674.949	121.51
675.354	106.95
675.76	206.47
676.165	194.33
676.57	145.79
676.976	157.92
677.381	145.79
677.786	148.21
678.191	182.19
678.596	174.91
679.001	92.39
679.406	177.34
679.811	102.1
680.216	216.17
680.621	199.18
681.026	126.37
681.43	187.05
681.835	114.23
682.24	97.24
682.644	143.36
683.049	187.05
683.453	153.07
683.858	221.03
684.262	155.49
684.667	196.76
685.071	133.65
685.475	121.51
685.879	145.79
686.283	162.78
686.687	223.46
687.091	165.2
687.495	138.5
687.899	109.38
688.303	97.24
688.707	167.63
689.111	136.08
689.514	133.65
689.918	160.35
690.322	162.78
690.725	157.92
691.129	162.78
691.532	189.48
691.936	138.5
692.339	157.92
692.742	196.76
693.146	138.5
693.549	128.79
693.952	189.48
694.355	121.51
694.758	109.38
695.161	119.09
695.564	138.5
695.967	102.1
696.37	187.05
696.773	177.34
697.175	206.47
697.578	208.89
697.981	123.94
698.383	230.74
698.786	128.79
699.188	218.6
699.591	150.64
699.993	172.48
700.395	123.94
700.798	230.74
701.2	196.76
701.602	213.75
702.004	216.17
702.406	242.87
702.808	201.61
703.21	208.89
703.612	218.6
704.014	187.05
704.416	179.77
704.818	206.47
705.219	148.21
705.621	187.05
706.023	199.18
706.424	204.04
706.826	293.85
707.227	182.19
707.629	196.76
708.03	201.61
708.431	204.04
708.832	189.48
709.234	252.58
709.635	276.86
710.036	216.17
710.437	264.72
710.838	272
711.239	255.01
711.64	211.32
712.041	145.79
712.441	240.45
712.842	199.18
713.243	284.14
713.643	245.3
714.044	259.86
714.445	235.59
714.845	196.76
715.246	284.14
715.646	262.29
716.046	206.47
716.447	313.26
716.847	276.86
717.247	230.74
717.647	359.38
718.047	361.81
718.447	361.81
718.847	284.14
719.247	347.24
719.647	359.38
720.047	330.25
720.446	366.66
720.846	359.38
721.246	388.51
721.645	318.12
722.045	412.78
722.444	390.93
722.844	432.2
723.243	407.93
723.643	415.21
724.042	415.21
724.441	352.1
724.84	427.34
725.24	410.35
725.639	403.07
726.038	429.77
726.437	512.3
726.836	514.72
727.234	502.59
727.633	427.34
728.032	502.59
728.431	439.48
728.83	512.3
729.228	558.41
729.627	534.14
730.025	616.67
730.424	602.1
730.822	689.48
731.22	808.42
731.619	820.55
732.017	789
732.415	915.21
732.813	869.1
733.212	1043.86
733.61	1111.82
734.008	1046.28
734.406	1099.68
734.803	1291.43
735.201	1466.19
735.599	1480.76
735.997	1488.04
736.395	1539.01
736.792	1653.09
737.19	1813.29
737.587	1873.97
737.985	1876.39
738.382	1941.93
738.78	2281.74
739.177	2485.63
739.574	2422.52
739.971	2279.31
740.369	2536.6
740.766	3002.63
741.163	2958.94
741.56	3107
741.957	3017.19
742.354	3167.68
742.751	3643.41
743.147	3847.3
743.544	3791.47
743.941	3502.63
744.338	3910.41
744.734	4330.32
745.131	4665.27
745.527	4691.97
745.924	4480.8
746.32	4810.91
746.716	5466.26
747.113	5898.3
747.509	5813.35
747.905	5560.92
748.301	5893.45
748.697	6692
749.093	7505.12
749.489	7179.88
749.885	6910.45
750.281	7429.88
750.677	8408.05
751.073	9036.7
751.468	9073.11
751.864	8541.55
752.26	8531.84
752.655	9743.02
753.051	10694.49
753.446	10929.93
753.842	10094.97
754.237	10330.41
754.632	11352.27
755.028	12648.41
755.423	12551.32
755.818	11611.98
756.213	11264.89
756.608	11922.67
757.003	13514.93
757.398	13342.59
757.793	13000.35
758.188	12148.4
758.583	12721.22
758.977	14143.58
759.372	15330.49
759.767	15080.48
760.161	14497.95
760.556	15124.17
760.95	17476.15
761.345	19238.32
761.739	19379.09
762.133	17653.34
762.527	17784.41
762.922	19507.74
763.316	22701.96
763.71	22748.08
764.104	21119.41
764.498	20129.11
764.892	21449.51
765.286	23932.56
765.68	25211.71
766.073	24495.68
766.467	22568.46
766.861	23049.05
767.255	26563.67
767.648	29204.49
768.042	28354.96
768.435	26568.53
768.829	25553.95
769.222	27617.09
769.615	30760.34
770.008	31219.08
770.402	29070.99
770.795	26857.37
771.188	27966.61
771.581	30784.61
771.974	32561.34
772.367	30020.04
772.76	28287
773.153	26551.54
773.545	29172.94
773.938	32211.82
774.331	32529.78
774.724	29966.64
775.116	28930.21
775.509	31214.23
775.901	36168.19
776.294	37913.36
776.686	36105.08
777.078	33721.55
777.471	32990.96
777.863	37403.65
778.255	42432.85
778.647	42918.3
779.039	39508.05
779.431	36095.37
779.823	36896.36
780.215	41699.83
780.607	44012.97
780.999	43923.17
781.39	39008.04
781.782	38209.48
782.174	41289.63
782.565	45617.37
782.957	46355.24
783.348	43796.95
783.74	39840.58
784.131	39000.76
784.522	43903.75
784.914	45981.45
785.305	45163.48
785.696	40952.25
786.087	38146.38
786.478	38396.38
786.869	41423.13
787.26	43301.8
787.651	40219.22
788.042	36301.69
788.433	34396.32
788.823	36090.52
789.214	38782.31
789.605	37466.75
789.995	34308.94
790.386	30910.83
790.776	31163.26
791.167	33891.46
791.557	37126.94
791.948	37063.84
792.338	33969.13
792.728	32639.01
793.118	33641.45
793.508	37260.44
793.898	39508.05
794.288	38665.8
794.678	34318.65
795.068	32408.42
795.458	33393.88
795.848	36830.82
796.238	38913.38
796.627	36741.01
797.017	33833.2
797.406	32607.46
797.796	34192.43
798.185	38726.48
798.575	39918.25
798.964	37323.55
799.354	34279.81
799.743	32556.48
800.132	34993.41
800.521	38707.06
800.91	39957.08
801.299	36180.33
801.688	33245.81
802.077	31648.7
802.466	34454.57
802.855	37228.89
803.244	36173.04
803.633	33893.88
804.021	29621.97
804.41	28495.74
804.799	30634.12
805.187	32270.07
805.576	32330.75
805.964	29609.84
806.352	25823.37
806.741	25993.27
807.129	27956.9
807.517	30437.52
807.905	29808.87
808.293	28274.86
808.681	25769.97
809.069	24988.4
809.457	27733.59
809.845	30711.79
810.233	31248.21
810.621	29277.31
811.009	26061.24
811.396	25323.36
811.784	27282.13
812.171	29689.93
812.559	30704.51
812.946	27859.81
813.334	24536.94
813.721	23439.84
814.108	24245.67
814.496	26587.94
814.883	27313.68
815.27	26893.77
815.657	23765.08
816.044	22762.64
816.431	23255.37
816.818	25617.06
817.205	26529.69
817.592	26350.08
817.979	23262.65
818.365	21485.92
818.752	20566.01
819.139	21915.54
819.525	23677.7
819.912	22590.31
820.298	20481.05
820.685	18269.85
821.071	17597.51
821.457	18995.59
821.843	19599.97
822.23	19565.99
822.616	17500.42
823.002	15345.05
823.388	14146
823.774	14590.18
824.16	15886.32
824.546	16131.47
824.931	15170.29
825.317	13216.38
825.703	12264.91
826.089	12485.78
826.474	13997.94
826.86	14864.46
827.245	14354.74
827.631	12968.8
828.016	11507.61
828.401	11230.91
828.787	11990.63
829.172	12857.15
829.557	13005.21
829.942	11604.7
830.327	10536.72
830.712	9706.61
831.097	9915.35
831.482	10721.19
831.867	11017.31
832.252	10495.46
832.636	9381.37
833.021	8531.84
833.406	8577.96
833.79	9439.62
834.175	9631.37
834.559	9480.88
834.944	8696.89
835.328	7607.07
835.713	7136.19
836.097	7400.75
836.481	8014.84
836.865	8410.48
837.249	7903.19
837.633	6776.96
838.017	5854.61
838.401	5769.66
838.785	6160.44
839.169	6364.33
839.553	6366.76
839.937	5808.49
840.32	4992.95
840.704	4573.04
841.087	4512.36
841.471	4905.57
841.854	5189.55
842.238	4803.62
842.621	4187.11
843.004	3874
843.388	3623.99
843.771	4026.91
844.154	4223.52
844.537	4398.28
844.92	4206.53
845.303	3548.75
845.686	3269.62
846.069	3206.51
846.452	3672.54
846.834	3793.9
847.217	3840.02
847.6	3505.06
847.982	3068.16
848.365	2747.77
848.748	2924.95
849.13	3204.09
849.512	3221.08
849.895	3289.04
850.277	2827.87
850.659	2427.37
851.041	2410.38
851.423	2568.15
851.806	2742.91
852.188	3048.74
852.57	2640.97
852.951	2352.13
853.333	2131.25
853.715	2036.59
854.097	2320.58
854.479	2427.37
854.86	2405.53
855.242	2221.06
855.623	2017.17
856.005	1696.78
856.386	1657.94
856.768	1631.25
857.149	1932.22
857.53	1803.58
857.911	1781.73
858.292	1480.76
858.674	1359.4
859.055	1381.24
859.436	1405.51
859.817	1543.87
860.197	1611.83
860.578	1359.4
860.959	1104.54
861.34	1019.59
861.72	1053.57
862.101	1138.52
862.482	1274.44
862.862	1199.2
863.243	988.03
863.623	944.34
864.003	861.82
864.384	975.9
864.764	1017.16
865.144	1051.14
865.524	951.62
865.904	873.95
866.284	791.43
866.664	750.16
867.044	813.27
867.424	779.29
867.804	869.1
868.183	883.66
868.563	699.19
868.943	609.38
869.322	492.88
869.702	565.69
870.081	687.06
870.461	636.08
870.84	626.38
871.22	699.19
871.599	519.58
871.978	432.2
872.357	505.01
872.736	502.59
873.115	560.84
873.494	475.89
873.873	434.62
874.252	495.31
874.631	361.81
875.01	424.92
875.388	417.63
875.767	405.5
876.146	463.75
876.524	403.07
876.903	332.68
877.281	301.13
877.66	318.12
878.038	330.25
878.416	378.8
878.794	296.27
879.173	305.98
879.551	284.14
879.929	247.73
880.307	320.55
880.685	305.98
881.063	318.12
881.441	279.28
881.818	279.28
882.196	259.86
882.574	233.17
882.951	245.3
883.329	276.86
883.707	298.7
884.084	272
884.461	228.31
884.839	279.28
885.216	199.18
885.593	257.44
885.971	286.56
886.348	191.9
886.725	216.17
887.102	242.87
887.479	223.46
887.856	165.2
888.233	206.47
888.609	211.32
888.986	184.62
889.363	201.61
889.74	194.33
890.116	187.05
890.493	191.9
890.869	174.91
891.246	114.23
891.622	191.9
891.998	223.46
892.375	184.62
892.751	145.79
893.127	184.62
893.503	238.02
893.879	123.94
894.255	111.8
894.631	148.21
895.007	133.65
895.383	257.44
895.759	114.23
896.134	170.06
896.51	179.77
896.886	172.48
897.261	102.1
897.637	160.35
898.012	165.2
898.388	179.77
898.763	150.64
899.138	201.61
899.514	89.96
899.889	165.2
900.264	116.66
900.639	109.38
901.014	199.18
901.389	184.62
901.764	172.48
902.139	160.35
902.513	97.24
902.888	140.93
903.263	235.59
903.638	128.79
904.012	182.19
904.387	170.06
904.761	82.68
905.136	85.1
905.51	167.63
905.884	155.49
906.259	106.95
906.633	131.22
907.007	157.92
907.381	138.5
907.755	189.48
908.129	189.48
908.503	182.19
908.877	128.79
909.251	75.4
909.624	143.36
909.998	126.37
910.372	136.08
910.745	119.09
911.119	155.49
911.492	157.92
911.866	114.23
912.239	114.23
912.612	136.08
912.986	58.41
913.359	148.21
913.732	179.77
914.105	143.36
914.478	138.5
914.851	128.79
915.224	177.34
915.597	97.24
915.97	162.78
916.343	145.79
916.715	211.32
917.088	189.48
917.461	133.65
917.833	123.94
918.206	128.79
918.578	128.79
918.951	123.94
919.323	157.92
919.695	121.51
920.067	182.19
920.44	140.93
920.812	106.95
921.184	102.1
921.556	131.22
921.928	65.69
922.3	126.37
922.672	145.79
923.043	155.49
923.415	148.21
923.787	116.66
924.158	162.78
924.53	104.52
924.901	184.62
925.273	94.81
925.644	24.42
926.016	75.4
926.387	143.36
926.758	131.22
927.129	131.22
927.5	160.35
927.872	80.25
928.243	143.36
928.613	104.52
928.984	204.04
929.355	145.79
929.726	111.8
930.097	170.06
930.467	136.08
930.838	128.79
931.209	87.53
931.579	167.63
931.95	126.37
932.32	87.53
932.69	179.77
933.061	157.92
933.431	150.64
933.801	143.36
934.171	87.53
934.541	29.28
934.911	187.05
935.281	121.51
935.651	184.62
936.021	155.49
936.391	114.23
936.761	131.22
937.13	170.06
937.5	114.23
937.87	119.09
938.239	123.94
938.609	196.76
938.978	172.48
939.347	155.49
939.717	157.92
940.086	72.97
940.455	89.96
940.824	155.49
941.193	179.77
941.562	153.07
941.931	143.36
942.3	223.46
942.669	211.32
943.038	138.5
943.407	143.36
943.775	109.38
944.144	204.04
944.513	191.9
944.881	230.74
945.25	123.94
945.618	136.08
945.986	138.5
946.355	225.88
946.723	187.05
947.091	87.53
947.459	119.09
947.827	179.77
948.195	162.78
948.563	165.2
948.931	126.37
949.299	143.36
949.667	119.09
950.035	128.79
950.402	119.09
950.77	85.1
951.138	97.24
951.505	119.09
951.873	70.54
952.24	102.1
952.607	109.38
952.975	172.48
953.342	104.52
953.709	128.79
954.076	128.79
954.443	82.68
954.81	143.36
955.177	121.51
955.544	85.1
955.911	111.8
956.278	208.89
956.645	153.07
957.012	133.65
957.378	140.93
957.745	196.76
958.111	155.49
958.478	153.07
958.844	136.08
959.211	131.22
959.577	92.39
959.943	155.49
960.309	177.34
960.675	104.52
961.042	153.07
961.408	167.63
961.774	182.19
962.139	177.34
962.505	143.36
962.871	116.66
963.237	94.81
963.603	143.36
963.968	150.64
964.334	138.5
964.699	102.1
965.065	92.39
965.43	150.64
965.796	119.09
966.161	170.06
966.526	99.67
966.891	126.37
967.256	109.38
967.622	119.09
967.987	114.23
968.352	111.8
968.716	51.12
969.081	116.66
969.446	121.51
969.811	155.49
970.176	119.09
970.54	196.76
970.905	99.67
971.269	191.9
971.634	111.8
971.998	155.49
972.363	128.79
972.727	121.51
973.091	72.97
973.455	167.63
973.819	150.64
974.183	153.07
974.547	187.05
974.911	126.37
975.275	143.36
975.639	150.64
976.003	136.08
976.367	121.51
976.73	148.21
977.094	140.93
977.458	213.75
977.821	97.24
978.185	145.79
978.548	38.99
978.911	65.69
979.275	140.93
979.638	157.92
980.001	140.93
980.364	77.82
980.727	114.23
981.09	126.37
981.453	63.26
981.816	114.23
982.179	155.49
982.542	150.64
982.905	157.92
983.267	182.19
983.63	204.04
983.992	145.79
984.355	172.48
984.717	60.83
985.08	138.5
985.442	80.25
985.804	92.39
986.167	218.6
986.529	179.77
986.891	126.37
987.253	174.91
987.615	119.09
987.977	187.05
988.339	94.81
988.701	160.35
989.062	116.66
989.424	46.27
989.786	140.93
990.147	150.64
990.509	170.06
990.87	136.08
991.232	167.63
991.593	194.33
991.955	140.93
992.316	111.8
992.677	116.66
993.038	148.21
993.399	94.81
993.76	92.39
994.121	102.1
994.482	126.37
994.843	77.82
995.204	87.53
995.565	106.95
995.926	60.83
996.286	128.79
996.647	92.39
997.007	172.48
997.368	150.64
997.728	99.67
998.089	136.08
998.449	123.94
998.809	182.19
999.169	114.23
999.53	111.8
999.89	104.52
1000.25	116.66
1000.61	109.38
1000.97	89.96
1001.329	162.78
1001.689	97.24
1002.049	131.22
1002.409	82.68
1002.768	131.22
1003.128	160.35
1003.487	153.07
1003.847	140.93
1004.206	104.52
1004.566	109.38
1004.925	136.08
1005.284	116.66
1005.643	123.94
1006.003	85.1
1006.362	184.62
1006.721	89.96
1007.08	187.05
1007.438	111.8
1007.797	126.37
1008.156	150.64
1008.515	97.24
1008.874	123.94
1009.232	153.07
1009.591	136.08
1009.949	99.67
1010.308	106.95
1010.666	140.93
1011.024	150.64
1011.383	157.92
1011.741	123.94
1012.099	104.52
1012.457	104.52
1012.815	143.36
1013.173	143.36
1013.531	126.37
1013.889	128.79
1014.247	196.76
1014.605	106.95
1014.962	116.66
1015.32	153.07
1015.678	131.22
1016.035	138.5
1016.393	60.83
1016.75	172.48
1017.107	153.07
1017.465	136.08
1017.822	191.9
1018.179	184.62
1018.536	174.91
1018.894	187.05
1019.251	94.81
1019.608	92.39
1019.964	165.2
1020.321	97.24
1020.678	165.2
1021.035	155.49
1021.392	136.08
1021.748	75.4
1022.105	114.23
1022.461	87.53
1022.818	172.48
1023.174	170.06
1023.531	196.76
1023.887	128.79
1024.243	133.65
1024.599	121.51
1024.955	109.38
1025.311	121.51
1025.667	119.09
1026.023	177.34
1026.379	165.2
1026.735	123.94
1027.091	123.94
1027.447	167.63
