189.514	123.03
189.973	123.03
190.431	123.03
190.889	6.52
191.348	18.66
191.806	-22.6
192.264	-3.19
192.722	-71.15
193.18	-10.47
193.638	-46.88
194.096	-8.04
194.554	-66.29
195.012	50.21
195.47	-29.89
195.928	-51.73
196.385	-25.03
196.843	16.23
197.301	-3.19
197.758	62.35
198.216	62.35
198.674	33.22
199.131	91.48
199.589	86.62
200.046	79.34
200.503	84.19
200.961	149.73
201.418	52.64
201.875	101.18
202.332	103.61
202.79	72.06
203.247	62.35
203.704	144.87
204.161	147.3
204.618	76.91
205.075	149.73
205.532	157.01
205.989	132.74
206.445	149.73
206.902	98.76
207.359	178.86
207.816	210.41
208.272	98.76
208.729	159.44
209.185	152.16
209.642	171.57
210.098	200.7
210.555	84.19
211.011	132.74
211.467	166.72
211.924	76.91
212.38	113.32
212.836	190.99
213.292	135.17
213.748	186.14
214.204	166.72
214.66	164.29
215.116	174
215.572	181.28
216.028	205.56
216.484	193.42
216.94	174
217.396	164.29
217.851	183.71
218.307	147.3
218.763	174
219.218	118.18
219.674	147.3
220.129	144.87
220.585	135.17
221.04	176.43
221.496	154.58
221.951	152.16
222.406	174
222.861	159.44
223.317	125.46
223.772	212.84
224.227	169.15
224.682	152.16
225.137	222.55
225.592	154.58
226.047	45.36
226.502	113.32
226.957	181.28
227.411	118.18
227.866	137.59
228.321	159.44
228.776	171.57
229.23	181.28
229.685	137.59
230.139	101.18
230.594	110.89
231.048	118.18
231.503	127.88
231.957	144.87
232.411	181.28
232.865	123.03
233.32	161.87
233.774	159.44
234.228	171.57
234.682	142.45
235.136	89.05
235.59	188.56
236.044	166.72
236.498	171.57
236.952	159.44
237.406	125.46
237.86	123.03
238.313	183.71
238.767	157.01
239.221	144.87
239.674	157.01
240.128	181.28
240.581	123.03
241.035	183.71
241.488	152.16
241.942	161.87
242.395	140.02
242.848	103.61
243.301	149.73
243.755	220.12
244.208	205.56
244.661	144.87
245.114	157.01
245.567	144.87
246.02	140.02
246.473	149.73
246.926	149.73
247.379	174
247.832	190.99
248.284	220.12
248.737	113.32
249.19	154.58
249.642	174
250.095	149.73
250.547	125.46
251	190.99
251.452	137.59
251.905	178.86
252.357	186.14
252.81	239.54
253.262	140.02
253.714	178.86
254.166	101.18
254.618	152.16
255.07	120.6
255.523	93.9
255.975	103.61
256.427	81.77
256.878	159.44
257.33	137.59
257.782	132.74
258.234	190.99
258.686	241.96
259.137	132.74
259.589	101.18
260.041	103.61
260.492	140.02
260.944	142.45
261.395	159.44
261.847	113.32
262.298	174
262.749	220.12
263.201	183.71
263.652	147.3
264.103	174
264.554	93.9
265.005	149.73
265.457	103.61
265.908	222.55
266.359	232.25
266.809	164.29
267.26	186.14
267.711	101.18
268.162	183.71
268.613	132.74
269.064	96.33
269.514	118.18
269.965	190.99
270.415	96.33
270.866	135.17
271.316	169.15
271.767	135.17
272.217	171.57
272.668	176.43
273.118	171.57
273.568	166.72
274.019	76.91
274.469	106.04
274.919	178.86
275.369	149.73
275.819	142.45
276.269	188.56
276.719	149.73
277.169	186.14
277.619	123.03
278.069	106.04
278.518	137.59
278.968	166.72
279.418	154.58
279.867	207.98
280.317	123.03
280.767	174
281.216	193.42
281.666	123.03
282.115	159.44
282.564	89.05
283.014	181.28
283.463	217.69
283.912	186.14
284.361	164.29
284.811	149.73
285.26	203.13
285.709	200.7
286.158	106.04
286.607	169.15
287.056	147.3
287.505	181.28
287.953	135.17
288.402	181.28
288.851	84.19
289.3	147.3
289.748	144.87
290.197	178.86
290.646	154.58
291.094	149.73
291.543	98.76
291.991	137.59
292.439	174
292.888	181.28
293.336	166.72
293.784	127.88
294.233	166.72
294.681	154.58
295.129	64.78
295.577	149.73
296.025	115.75
296.473	188.56
296.921	190.99
297.369	113.32
297.817	159.44
298.264	224.97
298.712	135.17
299.16	181.28
299.608	186.14
300.055	93.9
300.503	147.3
300.95	130.31
301.398	127.88
301.845	137.59
302.293	183.71
302.74	174
303.187	195.85
303.635	149.73
304.082	142.45
304.529	174
304.976	166.72
305.423	132.74
305.87	174
306.317	188.56
306.764	249.25
307.211	195.85
307.658	181.28
308.105	198.27
308.552	135.17
308.998	154.58
309.445	144.87
309.892	113.32
310.338	174
310.785	207.98
311.231	123.03
311.678	154.58
312.124	127.88
312.571	115.75
313.017	186.14
313.463	149.73
313.909	103.61
314.356	140.02
314.802	137.59
315.248	161.87
315.694	171.57
316.14	203.13
316.586	166.72
317.032	188.56
317.478	149.73
317.923	174
318.369	135.17
318.815	127.88
319.261	178.86
319.706	118.18
320.152	142.45
320.597	140.02
321.043	193.42
321.488	149.73
321.934	171.57
322.379	176.43
322.824	137.59
323.27	152.16
323.715	147.3
324.16	86.62
324.605	98.76
325.05	140.02
325.495	127.88
325.94	137.59
326.385	249.25
326.83	149.73
327.275	166.72
327.72	91.48
328.165	159.44
328.61	164.29
329.054	110.89
329.499	55.07
329.943	166.72
330.388	152.16
330.832	171.57
331.277	144.87
331.721	188.56
332.166	193.42
332.61	149.73
333.054	203.13
333.499	174
333.943	195.85
334.387	142.45
334.831	110.89
335.275	147.3
335.719	222.55
336.163	157.01
336.607	157.01
337.051	169.15
337.495	212.84
337.938	164.29
338.382	215.26
338.826	222.55
339.269	164.29
339.713	154.58
340.157	98.76
340.6	210.41
341.044	135.17
341.487	157.01
341.93	142.45
342.374	118.18
342.817	186.14
343.26	234.68
343.703	144.87
344.146	125.46
344.59	149.73
345.033	161.87
345.476	154.58
345.919	205.56
346.361	159.44
346.804	186.14
347.247	135.17
347.69	171.57
348.133	166.72
348.575	152.16
349.018	118.18
349.461	120.6
349.903	154.58
350.346	215.26
350.788	118.18
351.23	96.33
351.673	142.45
352.115	159.44
352.557	190.99
353	195.85
353.442	166.72
353.884	140.02
354.326	183.71
354.768	210.41
355.21	55.07
355.652	110.89
356.094	130.31
356.536	137.59
356.978	67.2
357.419	224.97
357.861	198.27
358.303	193.42
358.744	120.6
359.186	183.71
359.627	181.28
360.069	123.03
360.51	127.88
360.952	181.28
361.393	176.43
361.834	215.26
362.276	96.33
362.717	161.87
363.158	154.58
363.599	132.74
364.04	130.31
364.481	91.48
364.922	186.14
365.363	190.99
365.804	149.73
366.245	91.48
366.686	147.3
367.126	79.34
367.567	178.86
368.008	130.31
368.448	110.89
368.889	118.18
369.33	166.72
369.77	142.45
370.21	118.18
370.651	50.21
371.091	127.88
371.531	130.31
371.972	149.73
372.412	108.47
372.852	93.9
373.292	178.86
373.732	176.43
374.172	174
374.612	220.12
375.052	152.16
375.492	161.87
375.932	74.49
376.372	181.28
376.811	210.41
377.251	96.33
377.691	130.31
378.13	193.42
378.57	212.84
379.009	127.88
379.449	101.18
379.888	178.86
380.328	120.6
380.767	113.32
381.206	144.87
381.645	137.59
382.085	190.99
382.524	183.71
382.963	227.4
383.402	169.15
383.841	86.62
384.28	176.43
384.719	115.75
385.158	113.32
385.596	130.31
386.035	154.58
386.474	113.32
386.913	152.16
387.351	215.26
387.79	132.74
388.228	103.61
388.667	239.54
389.105	169.15
389.544	220.12
389.982	207.98
390.42	193.42
390.859	110.89
391.297	81.77
391.735	106.04
392.173	147.3
392.611	144.87
393.049	210.41
393.487	174
393.925	137.59
394.363	123.03
394.801	154.58
395.239	169.15
395.676	135.17
396.114	140.02
396.552	178.86
396.989	135.17
397.427	89.05
397.864	171.57
398.302	149.73
398.739	140.02
399.177	169.15
399.614	188.56
400.051	207.98
400.488	161.87
400.926	195.85
401.363	176.43
401.8	193.42
402.237	140.02
402.674	166.72
403.111	176.43
403.548	161.87
403.985	123.03
404.421	120.6
404.858	149.73
405.295	147.3
405.732	132.74
406.168	176.43
406.605	217.69
407.041	110.89
407.478	207.98
407.914	186.14
408.351	181.28
408.787	144.87
409.223	67.2
409.66	181.28
410.096	186.14
410.532	106.04
410.968	113.32
411.404	161.87
411.84	127.88
412.276	198.27
412.712	166.72
413.148	79.34
413.584	164.29
414.02	74.49
414.455	118.18
414.891	103.61
415.327	118.18
415.762	159.44
416.198	140.02
416.633	171.57
417.069	157.01
417.504	159.44
417.94	149.73
418.375	161.87
418.81	132.74
419.245	164.29
419.681	147.3
420.116	144.87
420.551	93.9
420.986	164.29
421.421	154.58
421.856	115.75
422.291	125.46
422.726	135.17
423.16	154.58
423.595	174
424.03	166.72
424.464	103.61
424.899	195.85
425.334	174
425.768	164.29
426.203	135.17
426.637	181.28
427.071	157.01
427.506	183.71
427.94	147.3
428.374	142.45
428.809	188.56
429.243	154.58
429.677	205.56
430.111	169.15
430.545	169.15
430.979	215.26
431.413	161.87
431.847	159.44
432.28	154.58
432.714	178.86
433.148	195.85
433.582	203.13
434.015	178.86
434.449	147.3
434.882	212.84
435.316	123.03
435.749	220.12
436.183	227.4
436.616	142.45
437.049	169.15
437.483	106.04
437.916	144.87
438.349	176.43
438.782	149.73
439.215	137.59
439.648	207.98
440.081	205.56
440.514	174
440.947	186.14
441.38	113.32
441.813	232.25
442.245	171.57
442.678	174
443.111	152.16
443.543	164.29
443.976	157.01
444.408	147.3
444.841	186.14
445.273	166.72
445.705	190.99
446.138	149.73
446.57	207.98
447.002	130.31
447.434	200.7
447.867	174
448.299	178.86
448.731	261.38
449.163	174
449.595	207.98
450.026	147.3
450.458	232.25
450.89	273.52
451.322	207.98
451.754	193.42
452.185	229.83
452.617	193.42
453.048	258.95
453.48	251.67
453.911	305.07
454.343	261.38
454.774	288.08
455.205	305.07
455.637	280.8
456.068	280.8
456.499	290.51
456.93	266.24
457.361	297.79
457.792	251.67
458.223	273.52
458.654	329.34
459.085	261.38
459.516	309.93
459.947	280.8
460.378	258.95
460.808	241.96
461.239	188.56
461.669	254.1
462.1	263.81
462.531	227.4
462.961	186.14
463.391	169.15
463.822	207.98
464.252	241.96
464.682	210.41
465.113	203.13
465.543	261.38
465.973	186.14
466.403	178.86
466.833	193.42
467.263	249.25
467.693	195.85
468.123	241.96
468.553	244.39
468.983	246.82
469.412	195.85
469.842	215.26
470.272	210.41
470.701	190.99
471.131	159.44
471.56	203.13
471.99	174
472.419	205.56
472.849	210.41
473.278	186.14
473.707	273.52
474.136	188.56
474.566	205.56
474.995	178.86
475.424	280.8
475.853	181.28
476.282	222.55
476.711	188.56
477.14	215.26
477.569	224.97
477.997	237.11
478.426	164.29
478.855	157.01
479.283	190.99
479.712	239.54
480.141	251.67
480.569	144.87
480.998	207.98
481.426	157.01
481.854	232.25
482.283	200.7
482.711	210.41
483.139	152.16
483.567	224.97
483.995	154.58
484.424	190.99
484.852	190.99
485.28	110.89
485.708	234.68
486.135	251.67
486.563	222.55
486.991	190.99
487.419	229.83
487.847	205.56
488.274	212.84
488.702	229.83
489.129	210.41
489.557	144.87
489.984	237.11
490.412	115.75
490.839	200.7
491.266	195.85
491.694	190.99
492.121	164.29
492.548	183.71
492.975	178.86
493.402	190.99
493.829	169.15
494.256	190.99
494.683	98.76
495.11	169.15
495.537	144.87
495.964	207.98
496.39	130.31
496.817	222.55
497.244	222.55
497.67	137.59
498.097	220.12
498.523	207.98
498.95	142.45
499.376	110.89
499.803	149.73
500.229	215.26
500.655	178.86
501.081	261.38
501.508	125.46
501.934	193.42
502.36	244.39
502.786	190.99
503.212	159.44
503.638	113.32
504.064	181.28
504.489	227.4
504.915	188.56
505.341	147.3
505.767	157.01
506.192	161.87
506.618	147.3
507.043	169.15
507.469	241.96
507.894	142.45
508.32	222.55
508.745	215.26
509.17	178.86
509.596	212.84
510.021	127.88
510.446	186.14
510.871	144.87
511.296	229.83
511.721	178.86
512.146	217.69
512.571	166.72
512.996	195.85
513.421	149.73
513.845	135.17
514.27	222.55
514.695	195.85
515.119	164.29
515.544	127.88
515.969	178.86
516.393	227.4
516.817	215.26
517.242	251.67
517.666	174
518.09	176.43
518.515	207.98
518.939	137.59
519.363	356.04
519.787	174
520.211	147.3
520.635	147.3
521.059	174
521.483	207.98
521.907	215.26
522.331	161.87
522.754	176.43
523.178	188.56
523.602	183.71
524.025	198.27
524.449	190.99
524.872	132.74
525.296	161.87
525.719	169.15
526.143	222.55
526.566	113.32
526.989	130.31
527.412	193.42
527.836	164.29
528.259	222.55
528.682	152.16
529.105	203.13
529.528	193.42
529.951	135.17
530.374	127.88
530.796	195.85
531.219	207.98
531.642	188.56
532.065	217.69
532.487	113.32
532.91	186.14
533.332	171.57
533.755	132.74
534.177	106.04
534.6	130.31
535.022	190.99
535.444	174
535.867	263.81
536.289	147.3
536.711	203.13
537.133	154.58
537.555	169.15
537.977	232.25
538.399	268.66
538.821	239.54
539.243	212.84
539.665	174
540.086	176.43
540.508	232.25
540.93	210.41
541.351	227.4
541.773	314.78
542.195	256.53
542.616	220.12
543.037	258.95
543.459	283.23
543.88	285.65
544.301	195.85
544.723	280.8
545.144	292.94
545.565	288.08
545.986	312.35
546.407	244.39
546.828	159.44
547.249	171.57
547.67	203.13
548.091	193.42
548.512	234.68
548.932	110.89
549.353	193.42
549.774	181.28
550.194	137.59
550.615	263.81
551.035	169.15
551.456	125.46
551.876	207.98
552.296	217.69
552.717	171.57
553.137	127.88
553.557	195.85
553.977	103.61
554.397	183.71
554.817	200.7
555.237	190.99
555.657	195.85
556.077	154.58
556.497	137.59
556.917	181.28
557.337	142.45
557.756	164.29
558.176	193.42
558.596	178.86
559.015	229.83
559.435	217.69
559.854	212.84
560.274	183.71
560.693	203.13
561.112	154.58
561.532	224.97
561.951	103.61
562.37	244.39
562.789	147.3
563.208	190.99
563.627	195.85
564.046	195.85
564.465	193.42
564.884	278.37
565.303	215.26
565.722	164.29
566.14	152.16
566.559	224.97
566.978	254.1
567.396	239.54
567.815	190.99
568.233	246.82
568.652	186.14
569.07	256.53
569.489	110.89
569.907	181.28
570.325	135.17
570.743	164.29
571.161	181.28
571.58	171.57
571.998	132.74
572.416	215.26
572.833	205.56
573.251	188.56
573.669	254.1
574.087	181.28
574.505	137.59
574.922	188.56
575.34	195.85
575.758	205.56
576.175	237.11
576.593	237.11
577.01	205.56
577.428	190.99
577.845	1579.36
578.262	300.22
578.68	193.42
579.097	174
579.514	207.98
579.931	181.28
580.348	193.42
580.765	183.71
581.182	249.25
581.599	166.72
582.016	244.39
582.433	127.88
582.849	186.14
583.266	186.14
583.683	203.13
584.099	93.9
584.516	132.74
584.933	227.4
585.349	149.73
585.765	183.71
586.182	164.29
586.598	249.25
587.014	200.7
587.431	234.68
587.847	200.7
588.263	149.73
588.679	176.43
589.095	149.73
589.511	118.18
589.927	239.54
590.343	181.28
590.759	186.14
591.174	147.3
591.59	159.44
592.006	159.44
592.421	217.69
592.837	166.72
593.252	190.99
593.668	183.71
594.083	132.74
594.499	215.26
594.914	188.56
595.329	215.26
595.745	261.38
596.16	152.16
596.575	181.28
596.99	130.31
597.405	222.55
597.82	188.56
598.235	195.85
598.65	123.03
599.065	227.4
599.479	195.85
599.894	96.33
600.309	220.12
600.724	275.94
601.138	120.6
601.553	154.58
601.967	183.71
602.382	171.57
602.796	174
603.21	212.84
603.625	115.75
604.039	152.16
604.453	154.58
604.867	186.14
605.281	188.56
605.695	207.98
606.109	227.4
606.523	157.01
606.937	181.28
607.351	249.25
607.765	130.31
608.178	174
608.592	193.42
609.006	227.4
609.419	203.13
609.833	181.28
610.246	161.87
610.66	241.96
611.073	271.09
611.487	164.29
611.9	210.41
612.313	212.84
612.726	275.94
613.139	171.57
613.553	171.57
613.966	234.68
614.379	186.14
614.792	176.43
615.204	149.73
615.617	195.85
616.03	239.54
616.443	152.16
616.856	195.85
617.268	222.55
617.681	161.87
618.093	161.87
618.506	164.29
618.918	193.42
619.331	98.76
619.743	186.14
620.155	200.7
620.568	200.7
620.98	89.05
621.392	224.97
621.804	220.12
622.216	234.68
622.628	171.57
623.04	178.86
623.452	98.76
623.864	130.31
624.276	212.84
624.687	161.87
625.099	161.87
625.511	123.03
625.922	152.16
626.334	166.72
626.745	127.88
627.157	157.01
627.568	161.87
627.979	135.17
628.391	130.31
628.802	198.27
629.213	183.71
629.624	137.59
630.035	161.87
630.446	188.56
630.857	127.88
631.268	149.73
631.679	161.87
632.09	132.74
632.501	183.71
632.912	203.13
633.322	224.97
633.733	135.17
634.144	147.3
634.554	127.88
634.965	74.49
635.375	176.43
635.785	174
636.196	241.96
636.606	181.28
637.016	195.85
637.427	181.28
637.837	203.13
638.247	195.85
638.657	205.56
639.067	152.16
639.477	125.46
639.887	154.58
640.297	149.73
640.706	232.25
641.116	169.15
641.526	144.87
641.935	142.45
642.345	169.15
642.755	174
643.164	188.56
643.573	135.17
643.983	220.12
644.392	188.56
644.801	171.57
645.211	186.14
645.62	229.83
646.029	169.15
646.438	110.89
646.847	110.89
647.256	169.15
647.665	241.96
648.074	161.87
648.483	125.46
648.892	127.88
649.3	203.13
649.709	130.31
650.118	76.91
650.526	152.16
650.935	164.29
651.343	166.72
651.752	188.56
652.16	251.67
652.568	198.27
652.977	207.98
653.385	159.44
653.793	164.29
654.201	137.59
654.609	161.87
655.017	76.91
655.425	147.3
655.833	207.98
656.241	132.74
656.649	79.34
657.057	152.16
657.464	193.42
657.872	166.72
658.28	159.44
658.687	183.71
659.095	181.28
659.502	152.16
659.91	130.31
660.317	190.99
660.724	176.43
661.132	229.83
661.539	123.03
661.946	186.14
662.353	118.18
662.76	174
663.167	113.32
663.574	144.87
663.981	174
664.388	220.12
664.795	220.12
665.202	176.43
665.608	198.27
666.015	186.14
666.422	135.17
666.828	166.72
667.235	161.87
667.641	106.04
668.047	152.16
668.454	137.59
668.86	239.54
669.266	232.25
669.673	164.29
670.079	164.29
670.485	132.74
670.891	222.55
671.297	190.99
671.703	115.75
672.109	190.99
672.515	186.14
672.92	164.29
673.326	193.42
673.732	200.7
674.138	205.56
674.543	212.84
674.949	224.97
675.354	125.46
675.76	249.25
676.165	166.72
676.57	205.56
676.976	166.72
677.381	144.87
677.786	152.16
678.191	96.33
678.596	110.89
679.001	198.27
679.406	98.76
679.811	91.48
680.216	203.13
680.621	210.41
681.026	152.16
681.43	89.05
681.835	130.31
682.24	217.69
682.644	159.44
683.049	140.02
683.453	157.01
683.858	200.7
684.262	166.72
684.667	108.47
685.071	142.45
685.475	195.85
685.879	110.89
686.283	198.27
686.687	108.47
687.091	169.15
687.495	137.59
687.899	161.87
688.303	181.28
688.707	166.72
689.111	174
689.514	193.42
689.918	171.57
690.322	178.86
690.725	166.72
691.129	159.44
691.532	193.42
691.936	113.32
692.339	186.14
692.742	127.88
693.146	142.45
693.549	169.15
693.952	246.82
694.355	183.71
694.758	125.46
695.161	127.88
695.564	215.26
695.967	224.97
696.37	210.41
696.773	169.15
697.175	207.98
697.578	137.59
697.981	249.25
698.383	195.85
698.786	135.17
699.188	210.41
699.591	186.14
699.993	154.58
700.395	186.14
700.798	171.57
701.2	147.3
701.602	181.28
702.004	157.01
702.406	166.72
702.808	193.42
703.21	142.45
703.612	171.57
704.014	193.42
704.416	186.14
704.818	64.78
705.219	169.15
705.621	161.87
706.023	118.18
706.424	207.98
706.826	229.83
707.227	135.17
707.629	237.11
708.03	169.15
708.431	249.25
708.832	188.56
709.234	239.54
709.635	203.13
710.036	193.42
710.437	190.99
710.838	144.87
711.239	193.42
711.64	227.4
712.041	239.54
712.441	271.09
712.842	198.27
713.243	161.87
713.643	207.98
714.044	159.44
714.445	205.56
714.845	200.7
715.246	193.42
715.646	188.56
716.046	203.13
716.447	147.3
716.847	181.28
717.247	217.69
717.647	198.27
718.047	268.66
718.447	203.13
718.847	263.81
719.247	263.81
719.647	261.38
720.047	324.49
720.446	251.67
720.846	229.83
721.246	322.06
721.645	207.98
722.045	319.63
722.444	292.94
722.844	285.65
723.243	254.1
723.643	258.95
724.042	210.41
724.441	241.96
724.84	309.93
725.24	305.07
725.639	339.05
726.038	382.74
726.437	302.64
726.836	288.08
727.234	317.21
727.633	356.04
728.032	402.16
728.431	348.76
728.83	346.33
729.228	377.89
729.627	428.86
730.025	457.99
730.424	489.54
730.822	581.77
731.22	516.24
731.619	579.35
732.017	637.6
732.415	754.11
732.813	746.83
733.212	717.7
733.61	846.34
734.008	802.65
734.406	965.28
734.803	945.86
735.201	967.7
735.599	1251.69
735.997	1314.8
736.395	1266.25
736.792	1343.92
737.19	1474.99
737.587	1438.58
737.985	1530.82
738.382	1720.14
738.78	1890.05
739.177	1834.22
739.574	1962.86
739.971	2052.67
740.369	2193.45
740.766	2142.48
741.163	2132.77
741.56	2334.23
741.957	2431.32
742.354	2428.89
742.751	2462.87
743.147	2717.73
743.544	2858.51
743.941	2907.05
744.338	2766.27
744.734	3144.92
745.131	3509
745.527	3637.65
745.924	3652.21
746.32	4152.22
746.716	4341.54
747.113	4426.49
747.509	4598.83
747.905	5018.74
748.301	5295.44
748.697	5421.66
749.093	5496.9
749.489	5681.37
749.885	6246.91
750.281	6547.89
750.677	6341.57
751.073	6882.84
751.468	7729.94
751.864	7928.98
752.26	7462.95
752.655	8026.07
753.051	8487.24
753.446	8972.68
753.842	8421.7
754.237	8928.99
754.632	9310.07
755.028	9465.41
755.423	9125.6
755.818	9009.09
756.213	9647.45
756.608	9746.97
757.003	9397.45
757.398	9280.94
757.793	9773.67
758.188	9979.98
758.583	9720.27
758.977	9479.97
759.372	10749.41
759.767	11807.68
760.161	11984.86
760.556	11768.84
760.95	12948.47
761.345	14642.67
761.739	15023.75
762.133	14290.73
762.527	16023.76
762.922	18011.66
763.316	18169.43
763.71	17332.04
764.104	18023.79
764.498	19618.48
764.892	20225.28
765.286	19242.26
765.68	20111.2
766.073	22370.95
766.467	23853.98
766.861	22637.94
767.255	22754.45
767.648	25048.17
768.042	27232.67
768.435	26276.35
768.829	25128.27
769.222	27009.37
769.615	29373.48
770.008	28897.75
770.402	26679.27
770.795	26958.4
771.188	29494.85
771.581	28917.17
771.974	26948.69
772.367	25421.97
772.76	26591.89
773.153	28106.47
773.545	26511.79
773.938	25096.72
774.331	25909.84
774.724	28429.3
775.116	28254.54
775.509	27635.59
775.901	28608.91
776.294	31436.62
776.686	33613.84
777.078	31290.99
777.471	32358.97
777.863	35033.77
778.255	37808.08
778.647	36720.69
779.039	34994.93
779.431	36011.94
779.823	39118.78
780.215	39463.45
780.607	36053.2
780.999	36332.33
781.39	38322.65
781.782	40565.41
782.174	39482.87
782.565	37633.32
782.957	39883.36
783.348	41992.61
783.74	42026.59
784.131	38458.58
784.522	38970.72
784.914	39975.59
785.305	41504.74
785.696	38094.49
786.087	35380.86
786.478	36638.16
786.869	37359.05
787.26	35657.56
787.651	32157.51
788.042	30511.85
788.433	31477.89
788.823	31419.63
789.214	29067.65
789.605	25912.27
789.995	26693.83
790.386	26885.58
790.776	26256.93
791.167	23761.75
791.557	24601.57
791.948	26968.11
792.338	29227.85
792.728	28191.43
793.118	26441.4
793.508	28557.94
793.898	31259.44
794.288	30533.7
794.678	27922.01
795.068	27215.68
795.458	28989.98
795.848	30892.93
796.238	29266.69
796.627	26917.14
797.017	28053.08
797.406	30043.4
797.796	30516.71
798.185	28523.96
798.575	27922.01
798.964	30152.62
799.354	32635.67
799.743	32223.04
800.132	29016.68
800.521	29203.58
800.91	31871.1
801.299	32982.76
801.688	31414.78
802.077	28689.01
802.466	29218.14
802.855	31795.85
803.244	31184.19
803.633	28072.49
804.021	25890.42
804.41	27579.77
804.799	28584.64
805.187	26101.59
805.576	23756.89
805.964	23232.61
806.352	24116.12
806.741	25074.87
807.129	22635.52
807.517	20679.17
807.905	21327.24
808.293	23654.95
808.681	23980.2
809.069	22509.3
809.457	22560.27
809.845	24407.39
810.233	26560.33
810.621	25477.79
811.009	23519.02
811.396	23006.88
811.784	26070.04
812.171	27820.06
812.559	25841.88
812.946	22662.22
813.334	22366.09
813.721	24671.96
814.108	25720.52
814.496	23761.75
814.883	21315.11
815.27	22790.86
815.657	24868.56
816.044	25611.29
816.431	24021.46
816.818	22062.69
817.205	23647.67
817.592	25589.45
817.979	25014.19
818.365	22203.47
818.752	20021.4
819.139	20912.19
819.525	22383.08
819.912	21113.65
820.298	18650.02
820.685	17608.74
821.071	18339.33
821.457	18895.17
821.843	17601.46
822.23	15501.91
822.616	14501.89
823.002	14416.94
823.388	14936.37
823.774	13630.52
824.16	12006.71
824.546	11749.42
824.931	12028.55
825.317	12873.23
825.703	11997
826.089	10914.46
826.474	10802.81
826.86	11521.27
827.245	11805.25
827.631	11115.92
828.016	10288.24
828.401	9873.18
828.787	10591.64
829.172	10975.14
829.557	10096.49
829.942	8921.71
830.327	8914.43
830.712	9351.33
831.097	9533.37
831.482	8958.12
831.867	8135.29
832.252	7911.99
832.636	8244.52
833.021	8611.03
833.406	8210.53
833.79	7681.4
834.175	7261.49
834.559	7975.09
834.944	8159.56
835.328	7795.48
835.713	7251.78
836.097	6625.56
836.481	6572.16
836.865	6885.27
837.249	6555.17
837.633	5700.79
838.017	5310
838.401	5273.6
838.785	5518.74
839.169	5363.4
839.553	4581.84
839.937	4169.21
840.32	4125.52
840.704	4268.73
841.087	3926.49
841.471	3526
841.854	3220.17
842.238	3302.69
842.621	3382.79
843.004	3441.04
843.388	3244.44
843.771	2996.86
844.154	2977.44
844.537	3101.23
844.92	3283.27
845.303	3215.31
845.686	2756.57
846.069	2717.73
846.452	2992.01
846.834	3137.64
847.217	3004.14
847.6	2688.6
847.982	2419.18
848.365	2424.04
848.748	2858.51
849.13	2727.44
849.512	2465.3
849.895	2161.9
850.277	2324.52
850.659	2518.7
851.041	2564.82
851.423	2426.46
851.806	2067.23
852.188	2157.04
852.57	2241.99
852.951	2370.64
853.333	2174.03
853.715	2028.4
854.097	1868.2
854.479	1991.99
854.86	2076.94
855.242	1982.28
855.623	1691.02
856.005	1491.98
856.386	1627.91
856.768	1691.02
857.149	1576.94
857.53	1562.37
857.911	1273.53
858.292	1331.79
858.674	1309.94
859.055	1329.36
859.436	1275.96
859.817	989.55
860.197	1018.67
860.578	955.57
860.959	1072.07
861.34	977.41
861.72	945.86
862.101	807.51
862.482	897.31
862.862	848.77
863.243	860.91
863.623	856.05
864.003	717.7
864.384	758.96
864.764	834.21
865.144	809.93
865.524	756.53
865.904	642.46
866.284	596.34
866.664	593.91
867.044	671.58
867.424	654.59
867.804	569.64
868.183	511.39
868.563	479.83
868.943	491.97
869.322	586.63
869.702	545.37
870.081	513.81
870.461	441
870.84	472.55
871.22	445.85
871.599	545.37
871.978	421.58
872.357	343.91
872.736	356.04
873.115	375.46
873.494	356.04
873.873	390.02
874.252	295.36
874.631	334.2
875.01	324.49
875.388	360.9
875.767	283.23
876.146	373.03
876.524	261.38
876.903	256.53
877.281	263.81
877.66	246.82
878.038	271.09
878.416	224.97
878.794	295.36
879.173	280.8
879.551	176.43
879.929	278.37
880.307	251.67
880.685	190.99
881.063	249.25
881.441	149.73
881.818	215.26
882.196	195.85
882.574	234.68
882.951	174
883.329	183.71
883.707	120.6
884.084	241.96
884.461	161.87
884.839	166.72
885.216	176.43
885.593	190.99
885.971	220.12
886.348	174
886.725	198.27
887.102	193.42
887.479	188.56
887.856	210.41
888.233	181.28
888.609	205.56
888.986	176.43
889.363	108.47
889.74	207.98
890.116	169.15
890.493	215.26
890.869	171.57
891.246	188.56
891.622	152.16
891.998	149.73
892.375	110.89
892.751	161.87
893.127	125.46
893.503	144.87
893.879	140.02
894.255	174
894.631	190.99
895.007	198.27
895.383	166.72
895.759	159.44
896.134	135.17
896.51	130.31
896.886	171.57
897.261	207.98
897.637	152.16
898.012	164.29
898.388	198.27
898.763	135.17
899.138	120.6
899.514	127.88
899.889	190.99
900.264	149.73
900.639	181.28
901.014	166.72
901.389	164.29
901.764	251.67
902.139	171.57
902.513	169.15
902.888	157.01
903.263	140.02
903.638	76.91
904.012	96.33
904.387	159.44
904.761	135.17
905.136	212.84
905.51	254.1
905.884	130.31
906.259	108.47
906.633	171.57
907.007	232.25
907.381	144.87
907.755	149.73
908.129	193.42
908.503	152.16
908.877	125.46
909.251	195.85
909.624	166.72
909.998	115.75
910.372	178.86
910.745	137.59
911.119	142.45
911.492	178.86
911.866	91.48
912.239	135.17
912.612	140.02
912.986	166.72
913.359	169.15
913.732	207.98
914.105	157.01
914.478	123.03
914.851	125.46
915.224	74.49
915.597	157.01
915.97	144.87
916.343	178.86
916.715	149.73
917.088	207.98
917.461	142.45
917.833	161.87
918.206	152.16
918.578	113.32
918.951	149.73
919.323	205.56
919.695	174
920.067	137.59
920.44	154.58
920.812	144.87
921.184	186.14
921.556	215.26
921.928	152.16
922.3	171.57
922.672	135.17
923.043	147.3
923.415	161.87
923.787	178.86
924.158	200.7
924.53	188.56
924.901	140.02
925.273	157.01
925.644	81.77
926.016	91.48
926.387	72.06
926.758	91.48
927.129	96.33
927.5	125.46
927.872	171.57
928.243	93.9
928.613	195.85
928.984	224.97
929.355	193.42
929.726	118.18
930.097	125.46
930.467	164.29
930.838	190.99
931.209	96.33
931.579	130.31
931.95	159.44
932.32	181.28
932.69	256.53
933.061	174
933.431	108.47
933.801	200.7
934.171	108.47
934.541	79.34
934.911	149.73
935.281	166.72
935.651	149.73
936.021	188.56
936.391	171.57
936.761	178.86
937.13	91.48
937.5	161.87
937.87	157.01
938.239	96.33
938.609	193.42
938.978	229.83
939.347	115.75
939.717	89.05
940.086	178.86
940.455	142.45
940.824	147.3
941.193	217.69
941.562	200.7
941.931	159.44
942.3	203.13
942.669	147.3
943.038	96.33
943.407	186.14
943.775	181.28
944.144	164.29
944.513	147.3
944.881	203.13
945.25	181.28
945.618	42.93
945.986	113.32
946.355	174
946.723	59.92
947.091	96.33
947.459	178.86
947.827	157.01
948.195	256.53
948.563	142.45
948.931	110.89
949.299	149.73
949.667	144.87
950.035	176.43
950.402	169.15
950.77	171.57
951.138	101.18
951.505	142.45
951.873	198.27
952.24	215.26
952.607	132.74
952.975	205.56
953.342	166.72
953.709	176.43
954.076	101.18
954.443	166.72
954.81	103.61
955.177	212.84
955.544	212.84
955.911	195.85
956.278	149.73
956.645	120.6
957.012	81.77
957.378	144.87
957.745	157.01
958.111	169.15
958.478	132.74
958.844	123.03
959.211	125.46
959.577	178.86
959.943	125.46
960.309	193.42
960.675	152.16
961.042	55.07
961.408	147.3
961.774	125.46
962.139	152.16
962.505	164.29
962.871	132.74
963.237	169.15
963.603	135.17
963.968	161.87
964.334	123.03
964.699	169.15
965.065	127.88
965.43	98.76
965.796	161.87
966.161	210.41
966.526	125.46
966.891	93.9
967.256	115.75
967.622	154.58
967.987	166.72
968.352	130.31
968.716	149.73
969.081	142.45
969.446	118.18
969.811	190.99
970.176	98.76
970.54	188.56
970.905	144.87
971.269	183.71
971.634	203.13
971.998	147.3
972.363	137.59
972.727	169.15
973.091	137.59
973.455	147.3
973.819	152.16
974.183	140.02
974.547	157.01
974.911	188.56
975.275	166.72
975.639	164.29
976.003	164.29
976.367	161.87
976.73	171.57
977.094	176.43
977.458	125.46
977.821	215.26
978.185	110.89
978.548	147.3
978.911	147.3
979.275	207.98
979.638	106.04
980.001	161.87
980.364	137.59
980.727	108.47
981.09	110.89
981.453	120.6
981.816	144.87
982.179	207.98
982.542	108.47
982.905	190.99
983.267	176.43
983.63	212.84
983.992	188.56
984.355	142.45
984.717	127.88
985.08	152.16
985.442	195.85
985.804	137.59
986.167	244.39
986.529	101.18
986.891	224.97
987.253	98.76
987.615	130.31
987.977	166.72
988.339	152.16
988.701	152.16
989.062	113.32
989.424	195.85
989.786	171.57
990.147	190.99
990.509	178.86
990.87	127.88
991.232	149.73
991.593	176.43
991.955	89.05
992.316	89.05
992.677	171.57
993.038	149.73
993.399	140.02
993.76	198.27
994.121	229.83
994.482	118.18
994.843	140.02
995.204	144.87
995.565	149.73
995.926	125.46
996.286	142.45
996.647	130.31
997.007	113.32
997.368	125.46
997.728	93.9
998.089	205.56
998.449	157.01
998.809	130.31
999.169	110.89
999.53	103.61
999.89	181.28
1000.25	159.44
1000.61	166.72
1000.97	176.43
1001.329	159.44
1001.689	127.88
1002.049	140.02
1002.409	174
1002.768	147.3
1003.128	142.45
1003.487	147.3
1003.847	125.46
1004.206	152.16
1004.566	183.71
1004.925	166.72
1005.284	135.17
1005.643	210.41
1006.003	130.31
1006.362	125.46
1006.721	130.31
1007.08	115.75
1007.438	147.3
1007.797	113.32
1008.156	147.3
1008.515	123.03
1008.874	183.71
1009.232	69.63
1009.591	93.9
1009.949	181.28
1010.308	118.18
1010.666	108.47
1011.024	115.75
1011.383	110.89
1011.741	193.42
1012.099	188.56
1012.457	176.43
1012.815	193.42
1013.173	86.62
1013.531	144.87
1013.889	161.87
1014.247	207.98
1014.605	164.29
1014.962	74.49
1015.32	137.59
1015.678	96.33
1016.035	181.28
1016.393	154.58
1016.75	86.62
1017.107	186.14
1017.465	79.34
1017.822	157.01
1018.179	144.87
1018.536	200.7
1018.894	157.01
1019.251	130.31
1019.608	140.02
1019.964	140.02
1020.321	174
1020.678	115.75
1021.035	144.87
1021.392	123.03
1021.748	144.87
1022.105	144.87
1022.461	149.73
1022.818	101.18
1023.174	188.56
1023.531	166.72
1023.887	205.56
1024.243	244.39
1024.599	178.86
1024.955	113.32
1025.311	113.32
1025.667	147.3
1026.023	169.15
1026.379	101.18
1026.735	178.86
1027.091	137.59
1027.447	174
