189.514	110.44
189.973	110.44
190.431	110.44
190.889	3.64
191.348	23.06
191.806	27.91
192.264	-35.19
192.722	-25.49
193.18	-69.18
193.638	-20.63
194.096	-8.5
194.554	-93.45
195.012	6.07
195.47	-8.5
195.928	1.21
196.385	25.49
196.843	18.2
197.301	-6.07
197.758	115.29
198.216	27.91
198.674	57.04
199.131	15.78
199.589	74.03
200.046	134.71
200.503	54.61
200.961	91.02
201.418	78.88
201.875	100.73
202.332	83.74
202.79	95.88
203.247	197.82
203.704	166.26
204.161	139.57
204.618	180.83
205.075	166.26
205.532	158.98
205.989	141.99
206.445	166.26
206.902	115.29
207.359	175.97
207.816	224.52
208.272	171.12
208.729	134.71
209.185	144.42
209.642	175.97
210.098	154.13
210.555	214.81
211.011	166.26
211.467	117.72
211.924	212.38
212.38	171.12
212.836	134.71
213.292	197.82
213.748	129.86
214.204	180.83
214.66	236.65
215.116	258.5
215.572	178.4
216.028	168.69
216.484	161.41
216.94	188.11
217.396	202.67
217.851	168.69
218.307	134.71
218.763	120.15
219.218	151.7
219.674	168.69
220.129	149.27
220.585	192.96
221.04	209.95
221.496	134.71
221.951	137.14
222.406	205.1
222.861	108.01
223.317	134.71
223.772	158.98
224.227	175.97
224.682	158.98
225.137	117.72
225.592	183.26
226.047	190.54
226.502	158.98
226.957	190.54
227.411	120.15
227.866	144.42
228.321	95.88
228.776	98.3
229.23	120.15
229.685	110.44
230.139	134.71
230.594	205.1
231.048	166.26
231.503	173.55
231.957	129.86
232.411	81.31
232.865	175.97
233.32	195.39
233.774	141.99
234.228	146.85
234.682	161.41
235.136	183.26
235.59	205.1
236.044	229.37
236.498	168.69
236.952	78.88
237.406	112.87
237.86	141.99
238.313	231.8
238.767	178.4
239.221	180.83
239.674	141.99
240.128	222.09
240.581	175.97
241.035	180.83
241.488	115.29
241.942	122.57
242.395	183.26
242.848	149.27
243.301	141.99
243.755	192.96
244.208	175.97
244.661	156.56
245.114	251.22
245.567	168.69
246.02	154.13
246.473	188.11
246.926	166.26
247.379	127.43
247.832	139.57
248.284	146.85
248.737	222.09
249.19	161.41
249.642	141.99
250.095	120.15
250.547	132.28
251	192.96
251.452	154.13
251.905	146.85
252.357	139.57
252.81	190.54
253.262	168.69
253.714	192.96
254.166	173.55
254.618	185.68
255.07	173.55
255.523	112.87
255.975	195.39
256.427	192.96
256.878	188.11
257.33	168.69
257.782	149.27
258.234	146.85
258.686	188.11
259.137	146.85
259.589	168.69
260.041	178.4
260.492	212.38
260.944	115.29
261.395	192.96
261.847	239.08
262.298	183.26
262.749	166.26
263.201	200.25
263.652	166.26
264.103	105.58
264.554	231.8
265.005	217.24
265.457	166.26
265.908	144.42
266.359	112.87
266.809	202.67
267.26	190.54
267.711	175.97
268.162	207.53
268.613	161.41
269.064	137.14
269.514	120.15
269.965	100.73
270.415	188.11
270.866	234.23
271.316	154.13
271.767	200.25
272.217	192.96
272.668	112.87
273.118	141.99
273.568	207.53
274.019	178.4
274.469	158.98
274.919	137.14
275.369	154.13
275.819	217.24
276.269	183.26
276.719	243.94
277.169	115.29
277.619	166.26
278.069	125
278.518	158.98
278.968	205.1
279.418	183.26
279.867	222.09
280.317	125
280.767	178.4
281.216	195.39
281.666	154.13
282.115	158.98
282.564	154.13
283.014	134.71
283.463	192.96
283.912	180.83
284.361	146.85
284.811	175.97
285.26	166.26
285.709	129.86
286.158	185.68
286.607	125
287.056	175.97
287.505	166.26
287.953	202.67
288.402	180.83
288.851	212.38
289.3	197.82
289.748	202.67
290.197	246.36
290.646	151.7
291.094	151.7
291.543	200.25
291.991	115.29
292.439	188.11
292.888	188.11
293.336	83.74
293.784	139.57
294.233	188.11
294.681	127.43
295.129	154.13
295.577	156.56
296.025	156.56
296.473	166.26
296.921	161.41
297.369	120.15
297.817	125
298.264	185.68
298.712	173.55
299.16	112.87
299.608	134.71
300.055	185.68
300.503	212.38
300.95	192.96
301.398	146.85
301.845	185.68
302.293	178.4
302.74	163.84
303.187	168.69
303.635	122.57
304.082	134.71
304.529	158.98
304.976	209.95
305.423	134.71
305.87	137.14
306.317	137.14
306.764	168.69
307.211	200.25
307.658	195.39
308.105	156.56
308.552	151.7
308.998	248.79
309.445	171.12
309.892	183.26
310.338	161.41
310.785	192.96
311.231	156.56
311.678	156.56
312.124	231.8
312.571	105.58
313.017	185.68
313.463	158.98
313.909	212.38
314.356	236.65
314.802	224.52
315.248	236.65
315.694	163.84
316.14	86.17
316.586	127.43
317.032	188.11
317.478	163.84
317.923	185.68
318.369	197.82
318.815	168.69
319.261	129.86
319.706	120.15
320.152	197.82
320.597	108.01
321.043	161.41
321.488	205.1
321.934	205.1
322.379	253.64
322.824	197.82
323.27	129.86
323.715	125
324.16	222.09
324.605	134.71
325.05	192.96
325.495	151.7
325.94	197.82
326.385	163.84
326.83	161.41
327.275	158.98
327.72	171.12
328.165	214.81
328.61	158.98
329.054	105.58
329.499	168.69
329.943	226.95
330.388	125
330.832	183.26
331.277	197.82
331.721	214.81
332.166	173.55
332.61	205.1
333.054	108.01
333.499	188.11
333.943	207.53
334.387	207.53
334.831	173.55
335.275	93.45
335.719	98.3
336.163	166.26
336.607	234.23
337.051	137.14
337.495	154.13
337.938	178.4
338.382	158.98
338.826	171.12
339.269	217.24
339.713	125
340.157	125
340.6	214.81
341.044	200.25
341.487	139.57
341.93	139.57
342.374	137.14
342.817	202.67
343.26	248.79
343.703	115.29
344.146	188.11
344.59	161.41
345.033	185.68
345.476	217.24
345.919	248.79
346.361	195.39
346.804	122.57
347.247	209.95
347.69	122.57
348.133	161.41
348.575	117.72
349.018	154.13
349.461	175.97
349.903	112.87
350.346	166.26
350.788	139.57
351.23	253.64
351.673	95.88
352.115	171.12
352.557	231.8
353	139.57
353.442	188.11
353.884	270.64
354.326	178.4
354.768	214.81
355.21	151.7
355.652	141.99
356.094	192.96
356.536	171.12
356.978	190.54
357.419	224.52
357.861	205.1
358.303	134.71
358.744	185.68
359.186	146.85
359.627	158.98
360.069	168.69
360.51	151.7
360.952	154.13
361.393	134.71
361.834	127.43
362.276	108.01
362.717	183.26
363.158	200.25
363.599	137.14
364.04	144.42
364.481	129.86
364.922	231.8
365.363	161.41
365.804	168.69
366.245	192.96
366.686	173.55
367.126	214.81
367.567	192.96
368.008	222.09
368.448	195.39
368.889	253.64
369.33	149.27
369.77	149.27
370.21	190.54
370.651	166.26
371.091	154.13
371.531	144.42
371.972	151.7
372.412	226.95
372.852	154.13
373.292	180.83
373.732	163.84
374.172	185.68
374.612	151.7
375.052	217.24
375.492	146.85
375.932	156.56
376.372	120.15
376.811	229.37
377.251	161.41
377.691	154.13
378.13	154.13
378.57	263.35
379.009	219.66
379.449	195.39
379.888	173.55
380.328	166.26
380.767	149.27
381.206	125
381.645	197.82
382.085	95.88
382.524	175.97
382.963	163.84
383.402	214.81
383.841	156.56
384.28	197.82
384.719	209.95
385.158	185.68
385.596	112.87
386.035	132.28
386.474	188.11
386.913	180.83
387.351	214.81
387.79	168.69
388.228	122.57
388.667	214.81
389.105	202.67
389.544	146.85
389.982	156.56
390.42	168.69
390.859	120.15
391.297	141.99
391.735	166.26
392.173	180.83
392.611	122.57
393.049	139.57
393.487	158.98
393.925	137.14
394.363	137.14
394.801	166.26
395.239	166.26
395.676	166.26
396.114	207.53
396.552	161.41
396.989	183.26
397.427	132.28
397.864	125
398.302	192.96
398.739	139.57
399.177	125
399.614	151.7
400.051	141.99
400.488	207.53
400.926	173.55
401.363	146.85
401.8	83.74
402.237	188.11
402.674	100.73
403.111	202.67
403.548	163.84
403.985	132.28
404.421	229.37
404.858	139.57
405.295	154.13
405.732	192.96
406.168	154.13
406.605	214.81
407.041	190.54
407.478	158.98
407.914	156.56
408.351	146.85
408.787	234.23
409.223	207.53
409.66	149.27
410.096	229.37
410.532	207.53
410.968	168.69
411.404	239.08
411.84	132.28
412.276	110.44
412.712	158.98
413.148	180.83
413.584	212.38
414.02	183.26
414.455	166.26
414.891	222.09
415.327	125
415.762	37.62
416.198	171.12
416.633	149.27
417.069	127.43
417.504	151.7
417.94	93.45
418.375	144.42
418.81	212.38
419.245	226.95
419.681	156.56
420.116	166.26
420.551	161.41
420.986	195.39
421.421	146.85
421.856	258.5
422.291	103.16
422.726	151.7
423.16	219.66
423.595	197.82
424.03	256.07
424.464	175.97
424.899	209.95
425.334	98.3
425.768	120.15
426.203	132.28
426.637	282.77
427.071	217.24
427.506	127.43
427.94	134.71
428.374	183.26
428.809	163.84
429.243	168.69
429.677	190.54
430.111	88.59
430.545	141.99
430.979	139.57
431.413	158.98
431.847	163.84
432.28	161.41
432.714	154.13
433.148	141.99
433.582	120.15
434.015	214.81
434.449	151.7
434.882	168.69
435.316	226.95
435.749	156.56
436.183	195.39
436.616	178.4
437.049	129.86
437.483	171.12
437.916	231.8
438.349	166.26
438.782	168.69
439.215	86.17
439.648	151.7
440.081	183.26
440.514	212.38
440.947	200.25
441.38	154.13
441.813	178.4
442.245	234.23
442.678	188.11
443.111	209.95
443.543	168.69
443.976	93.45
444.408	205.1
444.841	183.26
445.273	239.08
445.705	207.53
446.138	69.18
446.57	158.98
447.002	209.95
447.434	214.81
447.867	205.1
448.299	246.36
448.731	231.8
449.163	166.26
449.595	202.67
450.026	207.53
450.458	139.57
450.89	222.09
451.322	265.78
451.754	139.57
452.185	158.98
452.617	166.26
453.048	229.37
453.48	212.38
453.911	256.07
454.343	277.92
454.774	229.37
455.205	253.64
455.637	253.64
456.068	168.69
456.499	180.83
456.93	205.1
457.361	243.94
457.792	166.26
458.223	236.65
458.654	132.28
459.085	200.25
459.516	209.95
459.947	132.28
460.378	226.95
460.808	144.42
461.239	190.54
461.669	226.95
462.1	226.95
462.531	231.8
462.961	217.24
463.391	188.11
463.822	222.09
464.252	137.14
464.682	185.68
465.113	197.82
465.543	171.12
465.973	236.65
466.403	185.68
466.833	175.97
467.263	200.25
467.693	158.98
468.123	158.98
468.553	190.54
468.983	190.54
469.412	229.37
469.842	146.85
470.272	241.51
470.701	185.68
471.131	239.08
471.56	190.54
471.99	219.66
472.419	168.69
472.849	173.55
473.278	214.81
473.707	190.54
474.136	112.87
474.566	171.12
474.995	236.65
475.424	141.99
475.853	149.27
476.282	188.11
476.711	192.96
477.14	231.8
477.569	190.54
477.997	192.96
478.426	129.86
478.855	231.8
479.283	222.09
479.712	260.93
480.141	171.12
480.569	224.52
480.998	158.98
481.426	154.13
481.854	108.01
482.283	178.4
482.711	125
483.139	188.11
483.567	132.28
483.995	158.98
484.424	161.41
484.852	125
485.28	171.12
485.708	212.38
486.135	183.26
486.563	183.26
486.991	239.08
487.419	161.41
487.847	192.96
488.274	229.37
488.702	188.11
489.129	219.66
489.557	260.93
489.984	207.53
490.412	207.53
490.839	158.98
491.266	229.37
491.694	180.83
492.121	273.06
492.548	202.67
492.975	173.55
493.402	173.55
493.829	154.13
494.256	197.82
494.683	146.85
495.11	156.56
495.537	197.82
495.964	151.7
496.39	129.86
496.817	188.11
497.244	200.25
497.67	180.83
498.097	205.1
498.523	185.68
498.95	214.81
499.376	222.09
499.803	207.53
500.229	236.65
500.655	231.8
501.081	207.53
501.508	229.37
501.934	158.98
502.36	161.41
502.786	226.95
503.212	200.25
503.638	146.85
504.064	185.68
504.489	263.35
504.915	183.26
505.341	183.26
505.767	178.4
506.192	256.07
506.618	151.7
507.043	149.27
507.469	229.37
507.894	178.4
508.32	163.84
508.745	190.54
509.17	178.4
509.596	183.26
510.021	134.71
510.446	180.83
510.871	207.53
511.296	200.25
511.721	209.95
512.146	217.24
512.571	195.39
512.996	146.85
513.421	207.53
513.845	146.85
514.27	188.11
514.695	234.23
515.119	239.08
515.544	134.71
515.969	134.71
516.393	188.11
516.817	188.11
517.242	180.83
517.666	195.39
518.09	202.67
518.515	197.82
518.939	200.25
519.363	394.42
519.787	110.44
520.211	178.4
520.635	224.52
521.059	132.28
521.483	212.38
521.907	197.82
522.331	100.73
522.754	144.42
523.178	168.69
523.602	168.69
524.025	219.66
524.449	175.97
524.872	141.99
525.296	129.86
525.719	158.98
526.143	139.57
526.566	219.66
526.989	219.66
527.412	171.12
527.836	168.69
528.259	166.26
528.682	122.57
529.105	151.7
529.528	241.51
529.951	241.51
530.374	231.8
530.796	156.56
531.219	154.13
531.642	224.52
532.065	151.7
532.487	251.22
532.91	154.13
533.332	95.88
533.755	234.23
534.177	246.36
534.6	166.26
535.022	163.84
535.444	141.99
535.867	137.14
536.289	163.84
536.711	209.95
537.133	154.13
537.555	175.97
537.977	202.67
538.399	251.22
538.821	219.66
539.243	120.15
539.665	173.55
540.086	222.09
540.508	129.86
540.93	137.14
541.351	190.54
541.773	132.28
542.195	163.84
542.616	192.96
543.037	234.23
543.459	239.08
543.88	212.38
544.301	122.57
544.723	219.66
545.144	190.54
545.565	141.99
545.986	229.37
546.407	236.65
546.828	190.54
547.249	166.26
547.67	248.79
548.091	183.26
548.512	156.56
548.932	226.95
549.353	217.24
549.774	209.95
550.194	195.39
550.615	217.24
551.035	154.13
551.456	229.37
551.876	195.39
552.296	151.7
552.717	180.83
553.137	141.99
553.557	188.11
553.977	134.71
554.397	214.81
554.817	91.02
555.237	127.43
555.657	217.24
556.077	190.54
556.497	175.97
556.917	185.68
557.337	161.41
557.756	195.39
558.176	158.98
558.596	195.39
559.015	287.63
559.435	292.48
559.854	185.68
560.274	149.27
560.693	149.27
561.112	168.69
561.532	185.68
561.951	217.24
562.37	166.26
562.789	178.4
563.208	236.65
563.627	161.41
564.046	183.26
564.465	144.42
564.884	212.38
565.303	166.26
565.722	166.26
566.14	185.68
566.559	168.69
566.978	222.09
567.396	146.85
567.815	166.26
568.233	202.67
568.652	205.1
569.07	202.67
569.489	183.26
569.907	127.43
570.325	149.27
570.743	183.26
571.161	149.27
571.58	168.69
571.998	168.69
572.416	270.64
572.833	175.97
573.251	158.98
573.669	183.26
574.087	251.22
574.505	192.96
574.922	173.55
575.34	161.41
575.758	171.12
576.175	226.95
576.593	132.28
577.01	190.54
577.428	180.83
577.845	1894.45
578.262	224.52
578.68	110.44
579.097	108.01
579.514	137.14
579.931	144.42
580.348	105.58
580.765	163.84
581.182	161.41
581.599	180.83
582.016	175.97
582.433	188.11
582.849	146.85
583.266	149.27
583.683	144.42
584.099	219.66
584.516	156.56
584.933	200.25
585.349	161.41
585.765	161.41
586.182	268.21
586.598	139.57
587.014	161.41
587.431	200.25
587.847	192.96
588.263	197.82
588.679	149.27
589.095	224.52
589.511	205.1
589.927	200.25
590.343	141.99
590.759	180.83
591.174	137.14
591.59	139.57
592.006	183.26
592.421	149.27
592.837	168.69
593.252	185.68
593.668	205.1
594.083	149.27
594.499	178.4
594.914	178.4
595.329	117.72
595.745	117.72
596.16	178.4
596.575	222.09
596.99	290.05
597.405	180.83
597.82	195.39
598.235	183.26
598.65	163.84
599.065	183.26
599.479	195.39
599.894	173.55
600.309	251.22
600.724	185.68
601.138	202.67
601.553	178.4
601.967	195.39
602.382	173.55
602.796	183.26
603.21	212.38
603.625	195.39
604.039	180.83
604.453	197.82
604.867	151.7
605.281	180.83
605.695	178.4
606.109	268.21
606.523	149.27
606.937	200.25
607.351	360.44
607.765	163.84
608.178	180.83
608.592	183.26
609.006	236.65
609.419	214.81
609.833	171.12
610.246	146.85
610.66	209.95
611.073	236.65
611.487	158.98
611.9	156.56
612.313	224.52
612.726	178.4
613.139	200.25
613.553	52.19
613.966	149.27
614.379	168.69
614.792	175.97
615.204	212.38
615.617	188.11
616.03	158.98
616.443	200.25
616.856	154.13
617.268	214.81
617.681	192.96
618.093	183.26
618.506	219.66
618.918	178.4
619.331	166.26
619.743	144.42
620.155	190.54
620.568	188.11
620.98	144.42
621.392	156.56
621.804	197.82
622.216	134.71
622.628	110.44
623.04	141.99
623.452	137.14
623.864	190.54
624.276	188.11
624.687	173.55
625.099	265.78
625.511	209.95
625.922	185.68
626.334	139.57
626.745	129.86
627.157	146.85
627.568	171.12
627.979	200.25
628.391	166.26
628.802	253.64
629.213	120.15
629.624	151.7
630.035	146.85
630.446	219.66
630.857	146.85
631.268	188.11
631.679	256.07
632.09	256.07
632.501	241.51
632.912	156.56
633.322	229.37
633.733	197.82
634.144	161.41
634.554	212.38
634.965	229.37
635.375	141.99
635.785	185.68
636.196	146.85
636.606	178.4
637.016	212.38
637.427	158.98
637.837	149.27
638.247	222.09
638.657	127.43
639.067	229.37
639.477	163.84
639.887	248.79
640.297	212.38
640.706	173.55
641.116	217.24
641.526	110.44
641.935	166.26
642.345	141.99
642.755	149.27
643.164	158.98
643.573	219.66
643.983	246.36
644.392	200.25
644.801	144.42
645.211	241.51
645.62	134.71
646.029	168.69
646.438	180.83
646.847	226.95
647.256	173.55
647.665	192.96
648.074	200.25
648.483	188.11
648.892	212.38
649.3	146.85
649.709	202.67
650.118	209.95
650.526	173.55
650.935	197.82
651.343	168.69
651.752	134.71
652.16	175.97
652.568	120.15
652.977	168.69
653.385	234.23
653.793	122.57
654.201	161.41
654.609	192.96
655.017	183.26
655.425	168.69
655.833	180.83
656.241	141.99
656.649	163.84
657.057	195.39
657.464	195.39
657.872	168.69
658.28	214.81
658.687	141.99
659.095	146.85
659.502	234.23
659.91	195.39
660.317	144.42
660.724	115.29
661.132	197.82
661.539	205.1
661.946	214.81
662.353	226.95
662.76	173.55
663.167	168.69
663.574	200.25
663.981	134.71
664.388	197.82
664.795	236.65
665.202	197.82
665.608	158.98
666.015	168.69
666.422	212.38
666.828	158.98
667.235	212.38
667.641	200.25
668.047	212.38
668.454	117.72
668.86	168.69
669.266	171.12
669.673	197.82
670.079	202.67
670.485	197.82
670.891	158.98
671.297	268.21
671.703	171.12
672.109	154.13
672.515	200.25
672.92	122.57
673.326	202.67
673.732	185.68
674.138	212.38
674.543	222.09
674.949	212.38
675.354	156.56
675.76	222.09
676.165	180.83
676.57	236.65
676.976	205.1
677.381	197.82
677.786	175.97
678.191	202.67
678.596	217.24
679.001	115.29
679.406	190.54
679.811	139.57
680.216	183.26
680.621	246.36
681.026	110.44
681.43	132.28
681.835	239.08
682.24	190.54
682.644	178.4
683.049	156.56
683.453	183.26
683.858	190.54
684.262	144.42
684.667	190.54
685.071	105.58
685.475	173.55
685.879	166.26
686.283	185.68
686.687	212.38
687.091	139.57
687.495	144.42
687.899	256.07
688.303	224.52
688.707	180.83
689.111	243.94
689.514	205.1
689.918	158.98
690.322	219.66
690.725	224.52
691.129	178.4
691.532	190.54
691.936	175.97
692.339	129.86
692.742	154.13
693.146	158.98
693.549	183.26
693.952	175.97
694.355	146.85
694.758	156.56
695.161	212.38
695.564	156.56
695.967	222.09
696.37	192.96
696.773	226.95
697.175	166.26
697.578	190.54
697.981	285.2
698.383	192.96
698.786	144.42
699.188	151.7
699.591	222.09
699.993	217.24
700.395	224.52
700.798	236.65
701.2	178.4
701.602	168.69
702.004	173.55
702.406	151.7
702.808	183.26
703.21	263.35
703.612	219.66
704.014	222.09
704.416	190.54
704.818	234.23
705.219	212.38
705.621	226.95
706.023	183.26
706.424	200.25
706.826	258.5
707.227	185.68
707.629	231.8
708.03	258.5
708.431	183.26
708.832	224.52
709.234	175.97
709.635	275.49
710.036	192.96
710.437	192.96
710.838	197.82
711.239	188.11
711.64	263.35
712.041	256.07
712.441	207.53
712.842	207.53
713.243	180.83
713.643	263.35
714.044	171.12
714.445	200.25
714.845	224.52
715.246	290.05
715.646	185.68
716.046	241.51
716.447	319.18
716.847	171.12
717.247	234.23
717.647	236.65
718.047	226.95
718.447	260.93
718.847	243.94
719.247	248.79
719.647	292.48
720.047	287.63
720.446	285.2
720.846	166.26
721.246	277.92
721.645	273.06
722.045	273.06
722.444	307.04
722.844	314.33
723.243	292.48
723.643	311.9
724.042	314.33
724.441	280.34
724.84	212.38
725.24	311.9
725.639	358.02
726.038	338.6
726.437	338.6
726.836	299.76
727.234	358.02
727.633	406.56
728.032	411.41
728.431	358.02
728.83	421.12
729.228	343.45
729.627	455.1
730.025	518.21
730.424	530.35
730.822	569.18
731.22	569.18
731.619	675.98
732.017	622.58
732.415	629.86
732.813	668.7
733.212	758.51
733.61	865.3
734.008	955.11
734.406	1057.06
734.803	1098.32
735.201	1185.7
735.599	1304.63
735.997	1207.54
736.395	1197.83
736.792	1287.64
737.19	1423.57
737.587	1593.47
737.985	1802.21
738.382	2006.1
738.78	2209.99
739.177	2183.29
739.574	2185.71
739.971	2003.67
740.369	1896.87
740.766	2134.74
741.163	2333.77
741.56	2758.54
741.957	3190.58
742.354	3292.53
742.751	3358.06
743.147	3108.06
743.544	2797.37
743.941	2646.89
744.338	2957.57
744.734	3367.77
745.131	4299.82
745.527	4785.27
745.924	5355.67
746.32	5285.28
746.716	4746.43
747.113	4586.24
747.509	4467.3
747.905	4872.65
748.301	5947.91
748.697	7222.2
749.093	8333.87
749.489	8028.04
749.885	7678.52
750.281	7045.01
750.677	6496.46
751.073	6802.29
751.468	7741.63
751.864	9712.53
752.26	11185.85
752.655	11501.39
753.051	10761.09
753.446	9950.4
753.842	9151.84
754.237	9210.09
754.632	10127.58
755.028	11656.73
755.423	13256.27
755.818	14001.43
756.213	13147.05
756.608	11532.95
757.003	10171.27
757.398	9853.31
757.793	10722.25
758.188	12215
758.583	14324.25
758.977	14554.84
759.372	14251.44
759.767	13263.56
760.161	12367.91
760.556	13064.52
760.95	15901.95
761.345	19224.81
761.739	20945.71
762.133	21642.33
762.527	20508.81
762.922	18732.09
763.316	17700.52
763.71	19033.06
764.104	22142.33
764.498	25596.27
764.892	27249.21
765.286	26504.05
765.68	23950.62
766.073	22122.92
766.467	21950.58
766.861	25132.67
767.255	30115.76
767.648	33443.48
768.042	33441.05
768.435	31404.61
768.829	28987.1
769.222	27193.38
769.615	28569.62
770.008	32644.93
770.402	36436.25
770.795	37523.64
771.188	34996.9
771.581	30589.07
771.974	27858.44
772.367	28904.58
772.76	32564.83
773.153	34198.35
773.545	34545.44
773.938	32499.29
774.331	28727.39
774.724	26715.22
775.116	29557.5
775.509	34795.44
775.901	40654.76
776.294	42717.9
776.686	40581.94
777.078	36157.12
777.471	34661.95
777.863	36341.58
778.255	41936.33
778.647	47518.94
779.039	48586.92
779.431	46919.42
779.823	42477.6
780.215	39642.61
780.607	40822.24
780.999	46412.13
781.39	49451.01
781.782	49970.44
782.174	48164.58
782.565	43980.05
782.957	41975.17
783.348	44892.69
783.74	49489.85
784.131	51921.92
784.522	51356.38
784.914	47106.32
785.305	42681.49
785.696	40429.03
786.087	42319.83
786.478	44521.32
786.869	45120.85
787.26	42033.42
787.651	37581.9
788.042	33994.46
788.433	33132.8
788.823	33390.08
789.214	35193.51
789.605	35127.97
789.995	31096.36
790.386	27989.51
790.776	27038.04
791.167	29013.8
791.557	32186.18
791.948	33761.45
792.338	32972.6
792.728	31203.16
793.118	29174
793.508	30414.31
793.898	33717.76
794.288	35780.9
794.678	36628
795.068	34967.78
795.458	31615.78
795.848	30207.99
796.238	32215.31
796.627	35475.07
797.017	36115.85
797.406	35106.13
797.796	31487.14
798.185	30307.51
798.575	31843.94
798.964	35047.88
799.354	38577.06
799.743	37098.88
800.132	35387.69
800.521	32110.94
800.91	31744.43
801.299	34535.73
801.688	37433.83
802.077	36941.11
802.466	35159.53
802.855	32365.79
803.244	30394.89
803.633	31720.15
804.021	34086.7
804.41	34593.98
804.799	32958.04
805.187	28715.25
805.576	26241.91
805.964	26326.87
806.352	27717.66
806.741	29453.13
807.129	26945.81
807.517	24654.51
807.905	22756.42
808.293	23421.48
808.681	26076.86
809.069	28098.74
809.457	28996.81
809.845	27033.19
810.233	25372.97
810.621	26899.69
811.009	29176.42
811.396	31188.59
811.784	30047.8
812.171	27494.36
812.559	26079.29
812.946	25499.18
813.334	27079.3
813.721	28858.46
814.108	27533.2
814.496	25788.02
814.883	23865.66
815.27	24720.04
815.657	26916.68
816.044	29470.12
816.431	28156.99
816.818	25763.75
817.205	23897.22
817.592	24698.2
817.979	25880.26
818.365	27188.53
818.752	26620.56
819.139	24159.36
819.525	22103.5
819.912	21739.42
820.298	23018.56
820.685	23751.58
821.071	22630.21
821.457	20443.28
821.843	18314.61
822.23	17630.13
822.616	18130.14
823.002	17753.92
823.388	16210.2
823.774	15040.28
824.16	13431.03
824.546	13632.49
824.931	13969.88
825.317	14482.02
825.703	14086.38
826.089	13151.9
826.474	12222.28
826.86	12331.5
827.245	12950.44
827.631	13462.59
828.016	13200.45
828.401	12144.61
828.787	11222.26
829.172	11307.21
829.557	11705.28
829.942	11763.53
830.327	11064.49
830.712	9816.9
831.097	9447.96
831.482	10013.51
831.867	10309.63
832.252	10183.41
832.636	9671.27
833.021	8977.08
833.406	8700.38
833.79	8564.45
834.175	9083.88
834.559	9120.29
834.944	8132.41
835.328	7542.59
835.713	7501.33
836.097	7770.75
836.481	7896.97
836.865	7525.6
837.249	6702.77
837.633	6115.39
838.017	6013.44
838.401	6224.61
838.785	6129.95
839.169	5649.36
839.553	5052.26
839.937	4634.78
840.32	4532.84
840.704	4549.83
841.087	4503.71
841.471	4144.48
841.854	3802.24
842.238	3673.6
842.621	3612.92
843.004	3724.57
843.388	3792.53
843.771	3527.97
844.154	3353.21
844.537	3314.37
844.92	3484.28
845.303	3608.07
845.686	3588.65
846.069	3212.43
846.452	3074.08
846.834	3146.89
847.217	3273.11
847.6	3287.67
847.982	3008.54
848.365	2794.95
848.748	2775.53
849.13	2836.21
849.512	2802.23
849.895	2833.78
850.277	2741.55
850.659	2394.45
851.041	2467.27
851.423	2598.34
851.806	2741.55
852.188	2610.48
852.57	2569.21
852.951	2382.32
853.333	2348.34
853.715	2542.52
854.097	2462.42
854.479	2379.89
854.86	1986.68
855.242	1843.48
855.623	1974.55
856.005	2049.79
856.386	1972.12
856.768	1824.06
857.149	1600.75
857.53	1591.04
857.911	1644.44
858.292	1547.35
858.674	1467.26
859.055	1263.37
859.436	1214.82
859.817	1224.53
860.197	1222.11
860.578	1243.95
860.959	1044.92
861.34	964.82
861.72	979.38
862.101	1020.65
862.482	1035.21
862.862	967.25
863.243	831.32
863.623	882.3
864.003	841.03
864.384	969.68
864.764	855.6
865.144	841.03
865.524	736.66
865.904	743.94
866.284	700.25
866.664	717.24
867.044	751.23
867.424	603.16
867.804	610.45
868.183	629.86
868.563	666.27
868.943	629.86
869.322	576.47
869.702	595.88
870.081	503.65
870.461	442.97
870.84	527.92
871.22	496.37
871.599	489.09
871.978	486.66
872.357	413.84
872.736	510.93
873.115	411.41
873.494	360.44
873.873	294.91
874.252	299.76
874.631	316.75
875.01	336.17
875.388	268.21
875.767	341.02
876.146	307.04
876.524	319.18
876.903	258.5
877.281	222.09
877.66	280.34
878.038	324.03
878.416	277.92
878.794	214.81
879.173	263.35
879.551	224.52
879.929	258.5
880.307	280.34
880.685	231.8
881.063	231.8
881.441	280.34
881.818	185.68
882.196	205.1
882.574	234.23
882.951	127.43
883.329	209.95
883.707	205.1
884.084	260.93
884.461	253.64
884.839	141.99
885.216	258.5
885.593	219.66
885.971	222.09
886.348	149.27
886.725	234.23
887.102	214.81
887.479	183.26
887.856	243.94
888.233	185.68
888.609	202.67
888.986	212.38
889.363	188.11
889.74	205.1
890.116	205.1
890.493	190.54
890.869	171.12
891.246	108.01
891.622	154.13
891.998	239.08
892.375	127.43
892.751	141.99
893.127	163.84
893.503	205.1
893.879	202.67
894.255	151.7
894.631	202.67
895.007	229.37
895.383	192.96
895.759	129.86
896.134	243.94
896.51	108.01
896.886	197.82
897.261	151.7
897.637	144.42
898.012	190.54
898.388	168.69
898.763	214.81
899.138	173.55
899.514	166.26
899.889	132.28
900.264	149.27
900.639	197.82
901.014	166.26
901.389	146.85
901.764	175.97
902.139	149.27
902.513	129.86
902.888	146.85
903.263	151.7
903.638	197.82
904.012	139.57
904.387	71.6
904.761	141.99
905.136	175.97
905.51	149.27
905.884	212.38
906.259	217.24
906.633	115.29
907.007	161.41
907.381	190.54
907.755	132.28
908.129	134.71
908.503	180.83
908.877	115.29
909.251	168.69
909.624	146.85
909.998	100.73
910.372	175.97
910.745	141.99
911.119	212.38
911.492	146.85
911.866	146.85
912.239	129.86
912.612	134.71
912.986	81.31
913.359	129.86
913.732	91.02
914.105	139.57
914.478	127.43
914.851	209.95
915.224	129.86
915.597	120.15
915.97	127.43
916.343	197.82
916.715	209.95
917.088	180.83
917.461	183.26
917.833	175.97
918.206	178.4
918.578	217.24
918.951	183.26
919.323	163.84
919.695	209.95
920.067	149.27
920.44	86.17
920.812	144.42
921.184	168.69
921.556	207.53
921.928	173.55
922.3	86.17
922.672	178.4
923.043	74.03
923.415	151.7
923.787	64.32
924.158	120.15
924.53	122.57
924.901	188.11
925.273	132.28
925.644	200.25
926.016	219.66
926.387	144.42
926.758	180.83
927.129	120.15
927.5	163.84
927.872	180.83
928.243	180.83
928.613	200.25
928.984	156.56
929.355	144.42
929.726	185.68
930.097	183.26
930.467	197.82
930.838	173.55
931.209	112.87
931.579	231.8
931.95	100.73
932.32	66.75
932.69	100.73
933.061	190.54
933.431	280.34
933.801	141.99
934.171	180.83
934.541	146.85
934.911	110.44
935.281	192.96
935.651	195.39
936.021	132.28
936.391	154.13
936.761	226.95
937.13	98.3
937.5	158.98
937.87	217.24
938.239	163.84
938.609	212.38
938.978	149.27
939.347	134.71
939.717	156.56
940.086	166.26
940.455	178.4
940.824	166.26
941.193	178.4
941.562	122.57
941.931	209.95
942.3	163.84
942.669	188.11
943.038	154.13
943.407	166.26
943.775	156.56
944.144	127.43
944.513	105.58
944.881	188.11
945.25	175.97
945.618	141.99
945.986	166.26
946.355	175.97
946.723	212.38
947.091	149.27
947.459	139.57
947.827	190.54
948.195	183.26
948.563	214.81
948.931	134.71
949.299	212.38
949.667	156.56
950.035	175.97
950.402	154.13
950.77	108.01
951.138	217.24
951.505	200.25
951.873	161.41
952.24	163.84
952.607	115.29
952.975	197.82
953.342	207.53
953.709	185.68
954.076	108.01
954.443	166.26
954.81	207.53
955.177	205.1
955.544	180.83
955.911	239.08
956.278	151.7
956.645	205.1
957.012	180.83
957.378	224.52
957.745	168.69
958.111	163.84
958.478	117.72
958.844	127.43
959.211	98.3
959.577	175.97
959.943	224.52
960.309	161.41
960.675	173.55
961.042	219.66
961.408	93.45
961.774	129.86
962.139	156.56
962.505	180.83
962.871	146.85
963.237	192.96
963.603	154.13
963.968	134.71
964.334	195.39
964.699	139.57
965.065	180.83
965.43	185.68
965.796	156.56
966.161	207.53
966.526	163.84
966.891	154.13
967.256	168.69
967.622	207.53
967.987	217.24
968.352	91.02
968.716	93.45
969.081	125
969.446	151.7
969.811	214.81
970.176	158.98
970.54	173.55
970.905	151.7
971.269	139.57
971.634	180.83
971.998	81.31
972.363	175.97
972.727	100.73
973.091	158.98
973.455	188.11
973.819	173.55
974.183	112.87
974.547	110.44
974.911	151.7
975.275	129.86
975.639	158.98
976.003	161.41
976.367	139.57
976.73	173.55
977.094	112.87
977.458	163.84
977.821	125
978.185	173.55
978.548	175.97
978.911	95.88
979.275	222.09
979.638	144.42
980.001	212.38
980.364	183.26
980.727	185.68
981.09	156.56
981.453	139.57
981.816	103.16
982.179	161.41
982.542	173.55
982.905	110.44
983.267	74.03
983.63	202.67
983.992	137.14
984.355	180.83
984.717	219.66
985.08	161.41
985.442	163.84
985.804	144.42
986.167	158.98
986.529	146.85
986.891	166.26
987.253	173.55
987.615	103.16
987.977	154.13
988.339	144.42
988.701	168.69
989.062	209.95
989.424	47.33
989.786	175.97
990.147	120.15
990.509	178.4
990.87	207.53
991.232	163.84
991.593	166.26
991.955	183.26
992.316	163.84
992.677	139.57
993.038	231.8
993.399	171.12
993.76	171.12
994.121	81.31
994.482	127.43
994.843	134.71
995.204	205.1
995.565	125
995.926	175.97
996.286	190.54
996.647	168.69
997.007	185.68
997.368	222.09
997.728	115.29
998.089	171.12
998.449	171.12
998.809	185.68
999.169	149.27
999.53	137.14
999.89	168.69
1000.25	95.88
1000.61	222.09
1000.97	166.26
1001.329	129.86
1001.689	132.28
1002.049	120.15
1002.409	154.13
1002.768	163.84
1003.128	132.28
1003.487	166.26
1003.847	190.54
1004.206	139.57
1004.566	192.96
1004.925	178.4
1005.284	183.26
1005.643	195.39
1006.003	158.98
1006.362	214.81
1006.721	260.93
1007.08	122.57
1007.438	110.44
1007.797	197.82
1008.156	192.96
1008.515	129.86
1008.874	195.39
1009.232	200.25
1009.591	268.21
1009.949	132.28
1010.308	178.4
1010.666	171.12
1011.024	115.29
1011.383	171.12
1011.741	110.44
1012.099	156.56
1012.457	190.54
1012.815	154.13
1013.173	127.43
1013.531	127.43
1013.889	161.41
1014.247	214.81
1014.605	141.99
1014.962	144.42
1015.32	180.83
1015.678	178.4
1016.035	149.27
1016.393	205.1
1016.75	180.83
1017.107	178.4
1017.465	161.41
1017.822	151.7
1018.179	151.7
1018.536	129.86
1018.894	100.73
1019.251	195.39
1019.608	161.41
1019.964	115.29
1020.321	141.99
1020.678	158.98
1021.035	115.29
1021.392	156.56
1021.748	110.44
1022.105	120.15
1022.461	93.45
1022.818	158.98
1023.174	151.7
1023.531	185.68
1023.887	125
1024.243	149.27
1024.599	195.39
1024.955	149.27
1025.311	125
1025.667	158.98
1026.023	149.27
1026.379	166.26
1026.735	183.26
1027.091	195.39
1027.447	231.8
