189.514	22
189.973	22
190.431	22
190.889	-2.28
191.348	12.29
191.806	26.85
192.264	24.42
192.722	-2.28
193.18	-53.25
193.638	-65.38
194.096	-2.28
194.554	-2.28
195.012	38.99
195.47	-2.28
195.928	-79.95
196.385	-19.27
196.843	22
197.301	29.28
197.758	60.83
198.216	38.99
198.674	12.29
199.131	0.15
199.589	46.27
200.046	102.1
200.503	63.26
200.961	77.82
201.418	68.11
201.875	123.94
202.332	165.2
202.79	174.91
203.247	106.95
203.704	157.92
204.161	187.05
204.618	116.66
205.075	143.36
205.532	143.36
205.989	167.63
206.445	167.63
206.902	51.12
207.359	211.32
207.816	167.63
208.272	70.54
208.729	150.64
209.185	123.94
209.642	204.04
210.098	162.78
210.555	206.47
211.011	143.36
211.467	138.5
211.924	136.08
212.38	148.21
212.836	174.91
213.292	55.98
213.748	70.54
214.204	97.24
214.66	145.79
215.116	184.62
215.572	114.23
216.028	94.81
216.484	187.05
216.94	208.89
217.396	179.77
217.851	63.26
218.307	116.66
218.763	187.05
219.218	133.65
219.674	138.5
220.129	274.43
220.585	114.23
221.04	153.07
221.496	174.91
221.951	80.25
222.406	94.81
222.861	126.37
223.317	133.65
223.772	102.1
224.227	182.19
224.682	97.24
225.137	177.34
225.592	157.92
226.047	65.69
226.502	157.92
226.957	150.64
227.411	172.48
227.866	157.92
228.321	191.9
228.776	162.78
229.23	145.79
229.685	153.07
230.139	150.64
230.594	167.63
231.048	153.07
231.503	179.77
231.957	189.48
232.411	80.25
232.865	167.63
233.32	136.08
233.774	145.79
234.228	116.66
234.682	87.53
235.136	51.12
235.59	75.4
236.044	199.18
236.498	179.77
236.952	143.36
237.406	184.62
237.86	126.37
238.313	201.61
238.767	109.38
239.221	121.51
239.674	104.52
240.128	179.77
240.581	104.52
241.035	177.34
241.488	148.21
241.942	172.48
242.395	126.37
242.848	114.23
243.301	170.06
243.755	172.48
244.208	194.33
244.661	153.07
245.114	121.51
245.567	85.1
246.02	174.91
246.473	123.94
246.926	160.35
247.379	119.09
247.832	167.63
248.284	138.5
248.737	259.86
249.19	235.59
249.642	114.23
250.095	157.92
250.547	85.1
251	133.65
251.452	136.08
251.905	106.95
252.357	165.2
252.81	102.1
253.262	131.22
253.714	148.21
254.166	167.63
254.618	174.91
255.07	140.93
255.523	177.34
255.975	182.19
256.427	119.09
256.878	133.65
257.33	123.94
257.782	167.63
258.234	153.07
258.686	167.63
259.137	140.93
259.589	138.5
260.041	140.93
260.492	89.96
260.944	182.19
261.395	111.8
261.847	187.05
262.298	155.49
262.749	160.35
263.201	153.07
263.652	165.2
264.103	189.48
264.554	153.07
265.005	189.48
265.457	128.79
265.908	187.05
266.359	109.38
266.809	153.07
267.26	140.93
267.711	162.78
268.162	128.79
268.613	170.06
269.064	184.62
269.514	170.06
269.965	123.94
270.415	116.66
270.866	170.06
271.316	143.36
271.767	206.47
272.217	157.92
272.668	150.64
273.118	189.48
273.568	150.64
274.019	121.51
274.469	153.07
274.919	184.62
275.369	133.65
275.819	155.49
276.269	143.36
276.719	172.48
277.169	191.9
277.619	123.94
278.069	189.48
278.518	114.23
278.968	109.38
279.418	136.08
279.867	138.5
280.317	167.63
280.767	114.23
281.216	189.48
281.666	194.33
282.115	138.5
282.564	89.96
283.014	167.63
283.463	145.79
283.912	150.64
284.361	148.21
284.811	157.92
285.26	189.48
285.709	143.36
286.158	136.08
286.607	187.05
287.056	133.65
287.505	138.5
287.953	153.07
288.402	114.23
288.851	97.24
289.3	94.81
289.748	148.21
290.197	82.68
290.646	136.08
291.094	116.66
291.543	228.31
291.991	131.22
292.439	145.79
292.888	199.18
293.336	191.9
293.784	99.67
294.233	116.66
294.681	109.38
295.129	140.93
295.577	187.05
296.025	177.34
296.473	136.08
296.921	167.63
297.369	153.07
297.817	267.15
298.264	196.76
298.712	174.91
299.16	136.08
299.608	123.94
300.055	109.38
300.503	177.34
300.95	150.64
301.398	128.79
301.845	116.66
302.293	187.05
302.74	128.79
303.187	77.82
303.635	126.37
304.082	119.09
304.529	119.09
304.976	189.48
305.423	170.06
305.87	128.79
306.317	182.19
306.764	199.18
307.211	184.62
307.658	136.08
308.105	143.36
308.552	167.63
308.998	94.81
309.445	191.9
309.892	167.63
310.338	184.62
310.785	189.48
311.231	111.8
311.678	150.64
312.124	150.64
312.571	121.51
313.017	208.89
313.463	177.34
313.909	143.36
314.356	102.1
314.802	165.2
315.248	143.36
315.694	165.2
316.14	111.8
316.586	133.65
317.032	143.36
317.478	136.08
317.923	208.89
318.369	225.88
318.815	172.48
319.261	160.35
319.706	145.79
320.152	133.65
320.597	187.05
321.043	94.81
321.488	218.6
321.934	128.79
322.379	153.07
322.824	126.37
323.27	162.78
323.715	174.91
324.16	109.38
324.605	155.49
325.05	109.38
325.495	131.22
325.94	68.11
326.385	172.48
326.83	201.61
327.275	104.52
327.72	165.2
328.165	179.77
328.61	155.49
329.054	238.02
329.499	150.64
329.943	177.34
330.388	109.38
330.832	206.47
331.277	155.49
331.721	140.93
332.166	136.08
332.61	133.65
333.054	167.63
333.499	136.08
333.943	136.08
334.387	145.79
334.831	145.79
335.275	60.83
335.719	162.78
336.163	167.63
336.607	133.65
337.051	196.76
337.495	165.2
337.938	121.51
338.382	194.33
338.826	187.05
339.269	148.21
339.713	143.36
340.157	140.93
340.6	162.78
341.044	155.49
341.487	102.1
341.93	114.23
342.374	177.34
342.817	111.8
343.26	138.5
343.703	187.05
344.146	167.63
344.59	199.18
345.033	121.51
345.476	128.79
345.919	162.78
346.361	157.92
346.804	99.67
347.247	204.04
347.69	128.79
348.133	111.8
348.575	211.32
349.018	138.5
349.461	157.92
349.903	119.09
350.346	170.06
350.788	126.37
351.23	114.23
351.673	165.2
352.115	155.49
352.557	201.61
353	133.65
353.442	116.66
353.884	206.47
354.326	109.38
354.768	206.47
355.21	170.06
355.652	167.63
356.094	119.09
356.536	165.2
356.978	165.2
357.419	177.34
357.861	121.51
358.303	121.51
358.744	128.79
359.186	138.5
359.627	160.35
360.069	162.78
360.51	104.52
360.952	150.64
361.393	167.63
361.834	172.48
362.276	114.23
362.717	153.07
363.158	136.08
363.599	165.2
364.04	140.93
364.481	123.94
364.922	143.36
365.363	138.5
365.804	182.19
366.245	184.62
366.686	138.5
367.126	160.35
367.567	114.23
368.008	194.33
368.448	191.9
368.889	143.36
369.33	111.8
369.77	128.79
370.21	128.79
370.651	24.42
371.091	148.21
371.531	87.53
371.972	150.64
372.412	89.96
372.852	128.79
373.292	174.91
373.732	136.08
374.172	111.8
374.612	170.06
375.052	221.03
375.492	77.82
375.932	170.06
376.372	131.22
376.811	136.08
377.251	162.78
377.691	111.8
378.13	133.65
378.57	204.04
379.009	162.78
379.449	194.33
379.888	189.48
380.328	150.64
380.767	143.36
381.206	213.75
381.645	208.89
382.085	140.93
382.524	201.61
382.963	155.49
383.402	140.93
383.841	167.63
384.28	155.49
384.719	167.63
385.158	177.34
385.596	109.38
386.035	92.39
386.474	252.58
386.913	131.22
387.351	191.9
387.79	148.21
388.228	172.48
388.667	177.34
389.105	87.53
389.544	109.38
389.982	170.06
390.42	172.48
390.859	138.5
391.297	165.2
391.735	167.63
392.173	199.18
392.611	187.05
393.049	145.79
393.487	131.22
393.925	111.8
394.363	128.79
394.801	123.94
395.239	182.19
395.676	191.9
396.114	111.8
396.552	153.07
396.989	187.05
397.427	77.82
397.864	189.48
398.302	167.63
398.739	128.79
399.177	128.79
399.614	216.17
400.051	138.5
400.488	177.34
400.926	138.5
401.363	172.48
401.8	157.92
402.237	206.47
402.674	167.63
403.111	196.76
403.548	94.81
403.985	162.78
404.421	155.49
404.858	208.89
405.295	128.79
405.732	97.24
406.168	111.8
406.605	162.78
407.041	153.07
407.478	182.19
407.914	189.48
408.351	189.48
408.787	131.22
409.223	133.65
409.66	167.63
410.096	187.05
410.532	179.77
410.968	172.48
411.404	131.22
411.84	85.1
412.276	204.04
412.712	131.22
413.148	140.93
413.584	123.94
414.02	104.52
414.455	155.49
414.891	131.22
415.327	204.04
415.762	199.18
416.198	194.33
416.633	160.35
417.069	123.94
417.504	97.24
417.94	148.21
418.375	102.1
418.81	167.63
419.245	189.48
419.681	179.77
420.116	160.35
420.551	99.67
420.986	145.79
421.421	97.24
421.856	213.75
422.291	94.81
422.726	85.1
423.16	111.8
423.595	138.5
424.03	136.08
424.464	250.16
424.899	167.63
425.334	155.49
425.768	92.39
426.203	167.63
426.637	187.05
427.071	114.23
427.506	150.64
427.94	150.64
428.374	116.66
428.809	177.34
429.243	184.62
429.677	155.49
430.111	199.18
430.545	104.52
430.979	182.19
431.413	177.34
431.847	179.77
432.28	92.39
432.714	104.52
433.148	177.34
433.582	153.07
434.015	133.65
434.449	148.21
434.882	179.77
435.316	225.88
435.749	228.31
436.183	150.64
436.616	177.34
437.049	131.22
437.483	199.18
437.916	189.48
438.349	150.64
438.782	114.23
439.215	148.21
439.648	143.36
440.081	150.64
440.514	174.91
440.947	77.82
441.38	123.94
441.813	182.19
442.245	259.86
442.678	136.08
443.111	206.47
443.543	128.79
443.976	187.05
444.408	208.89
444.841	123.94
445.273	126.37
445.705	187.05
446.138	179.77
446.57	143.36
447.002	167.63
447.434	206.47
447.867	235.59
448.299	221.03
448.731	174.91
449.163	208.89
449.595	242.87
450.026	172.48
450.458	194.33
450.89	245.3
451.322	177.34
451.754	131.22
452.185	206.47
452.617	206.47
453.048	174.91
453.48	167.63
453.911	223.46
454.343	196.76
454.774	201.61
455.205	206.47
455.637	199.18
456.068	211.32
456.499	204.04
456.93	208.89
457.361	245.3
457.792	204.04
458.223	255.01
458.654	230.74
459.085	191.9
459.516	223.46
459.947	218.6
460.378	162.78
460.808	252.58
461.239	230.74
461.669	201.61
462.1	221.03
462.531	264.72
462.961	194.33
463.391	211.32
463.822	240.45
464.252	194.33
464.682	204.04
465.113	221.03
465.543	240.45
465.973	196.76
466.403	281.71
466.833	216.17
467.263	174.91
467.693	145.79
468.123	167.63
468.553	233.17
468.983	216.17
469.412	206.47
469.842	211.32
470.272	221.03
470.701	257.44
471.131	252.58
471.56	187.05
471.99	247.73
472.419	225.88
472.849	194.33
473.278	189.48
473.707	145.79
474.136	274.43
474.566	235.59
474.995	191.9
475.424	267.15
475.853	58.41
476.282	225.88
476.711	187.05
477.14	165.2
477.569	123.94
477.997	191.9
478.426	240.45
478.855	160.35
479.283	165.2
479.712	245.3
480.141	228.31
480.569	165.2
480.998	228.31
481.426	145.79
481.854	177.34
482.283	119.09
482.711	177.34
483.139	216.17
483.567	211.32
483.995	138.5
484.424	157.92
484.852	259.86
485.28	221.03
485.708	245.3
486.135	221.03
486.563	194.33
486.991	206.47
487.419	182.19
487.847	245.3
488.274	213.75
488.702	187.05
489.129	170.06
489.557	228.31
489.984	162.78
490.412	167.63
490.839	150.64
491.266	187.05
491.694	225.88
492.121	170.06
492.548	153.07
492.975	172.48
493.402	174.91
493.829	34.13
494.256	223.46
494.683	218.6
495.11	184.62
495.537	196.76
495.964	155.49
496.39	155.49
496.817	240.45
497.244	211.32
497.67	133.65
498.097	206.47
498.523	201.61
498.95	201.61
499.376	155.49
499.803	162.78
500.229	160.35
500.655	160.35
501.081	221.03
501.508	187.05
501.934	121.51
502.36	174.91
502.786	179.77
503.212	279.28
503.638	172.48
504.064	116.66
504.489	138.5
504.915	162.78
505.341	240.45
505.767	230.74
506.192	233.17
506.618	162.78
507.043	140.93
507.469	116.66
507.894	143.36
508.32	148.21
508.745	177.34
509.17	162.78
509.596	114.23
510.021	179.77
510.446	187.05
510.871	60.83
511.296	111.8
511.721	179.77
512.146	182.19
512.571	155.49
512.996	157.92
513.421	201.61
513.845	204.04
514.27	194.33
514.695	160.35
515.119	187.05
515.544	213.75
515.969	109.38
516.393	206.47
516.817	199.18
517.242	247.73
517.666	201.61
518.09	138.5
518.515	155.49
518.939	150.64
519.363	373.94
519.787	143.36
520.211	165.2
520.635	170.06
521.059	201.61
521.483	211.32
521.907	218.6
522.331	162.78
522.754	138.5
523.178	99.67
523.602	199.18
524.025	242.87
524.449	208.89
524.872	102.1
525.296	170.06
525.719	111.8
526.143	191.9
526.566	189.48
526.989	211.32
527.412	182.19
527.836	160.35
528.259	150.64
528.682	104.52
529.105	167.63
529.528	153.07
529.951	182.19
530.374	199.18
530.796	233.17
531.219	187.05
531.642	72.97
532.065	165.2
532.487	242.87
532.91	179.77
533.332	167.63
533.755	170.06
534.177	140.93
534.6	206.47
535.022	221.03
535.444	208.89
535.867	230.74
536.289	92.39
536.711	80.25
537.133	288.99
537.555	150.64
537.977	230.74
538.399	223.46
538.821	221.03
539.243	148.21
539.665	225.88
540.086	150.64
540.508	145.79
540.93	228.31
541.351	187.05
541.773	208.89
542.195	199.18
542.616	182.19
543.037	187.05
543.459	238.02
543.88	194.33
544.301	206.47
544.723	201.61
545.144	199.18
545.565	245.3
545.986	211.32
546.407	194.33
546.828	228.31
547.249	216.17
547.67	201.61
548.091	204.04
548.512	242.87
548.932	104.52
549.353	196.76
549.774	196.76
550.194	172.48
550.615	170.06
551.035	170.06
551.456	155.49
551.876	187.05
552.296	196.76
552.717	221.03
553.137	131.22
553.557	162.78
553.977	201.61
554.397	199.18
554.817	167.63
555.237	238.02
555.657	119.09
556.077	162.78
556.497	191.9
556.917	140.93
557.337	172.48
557.756	153.07
558.176	160.35
558.596	206.47
559.015	213.75
559.435	201.61
559.854	213.75
560.274	174.91
560.693	206.47
561.112	272
561.532	267.15
561.951	140.93
562.37	177.34
562.789	153.07
563.208	162.78
563.627	201.61
564.046	225.88
564.465	196.76
564.884	119.09
565.303	194.33
565.722	211.32
566.14	208.89
566.559	155.49
566.978	157.92
567.396	216.17
567.815	189.48
568.233	165.2
568.652	155.49
569.07	162.78
569.489	211.32
569.907	179.77
570.325	247.73
570.743	199.18
571.161	238.02
571.58	165.2
571.998	167.63
572.416	128.79
572.833	189.48
573.251	174.91
573.669	174.91
574.087	194.33
574.505	218.6
574.922	204.04
575.34	145.79
575.758	123.94
576.175	123.94
576.593	153.07
577.01	157.92
577.428	250.16
577.845	1502.6
578.262	259.86
578.68	206.47
579.097	177.34
579.514	177.34
579.931	174.91
580.348	109.38
580.765	128.79
581.182	133.65
581.599	206.47
582.016	162.78
582.433	174.91
582.849	211.32
583.266	179.77
583.683	160.35
584.099	174.91
584.516	228.31
584.933	138.5
585.349	259.86
585.765	242.87
586.182	145.79
586.598	167.63
587.014	225.88
587.431	206.47
587.847	102.1
588.263	131.22
588.679	157.92
589.095	174.91
589.511	140.93
589.927	213.75
590.343	182.19
590.759	162.78
591.174	206.47
591.59	223.46
592.006	136.08
592.421	204.04
592.837	189.48
593.252	148.21
593.668	206.47
594.083	262.29
594.499	153.07
594.914	136.08
595.329	216.17
595.745	131.22
596.16	242.87
596.575	182.19
596.99	162.78
597.405	126.37
597.82	160.35
598.235	174.91
598.65	160.35
599.065	157.92
599.479	194.33
599.894	148.21
600.309	140.93
600.724	206.47
601.138	170.06
601.553	221.03
601.967	233.17
602.382	167.63
602.796	143.36
603.21	216.17
603.625	196.76
604.039	223.46
604.453	218.6
604.867	204.04
605.281	216.17
605.695	179.77
606.109	201.61
606.523	150.64
606.937	157.92
607.351	301.13
607.765	204.04
608.178	136.08
608.592	155.49
609.006	102.1
609.419	204.04
609.833	167.63
610.246	150.64
610.66	189.48
611.073	165.2
611.487	148.21
611.9	250.16
612.313	211.32
612.726	196.76
613.139	165.2
613.553	213.75
613.966	218.6
614.379	199.18
614.792	174.91
615.204	165.2
615.617	131.22
616.03	221.03
616.443	221.03
616.856	177.34
617.268	221.03
617.681	174.91
618.093	194.33
618.506	206.47
618.918	187.05
619.331	99.67
619.743	199.18
620.155	179.77
620.568	167.63
620.98	172.48
621.392	170.06
621.804	199.18
622.216	235.59
622.628	150.64
623.04	148.21
623.452	170.06
623.864	111.8
624.276	133.65
624.687	165.2
625.099	99.67
625.511	148.21
625.922	153.07
626.334	204.04
626.745	143.36
627.157	133.65
627.568	196.76
627.979	138.5
628.391	138.5
628.802	162.78
629.213	184.62
629.624	174.91
630.035	155.49
630.446	148.21
630.857	145.79
631.268	104.52
631.679	150.64
632.09	218.6
632.501	233.17
632.912	155.49
633.322	247.73
633.733	140.93
634.144	206.47
634.554	189.48
634.965	179.77
635.375	177.34
635.785	167.63
636.196	172.48
636.606	235.59
637.016	111.8
637.427	133.65
637.837	204.04
638.247	208.89
638.657	160.35
639.067	201.61
639.477	174.91
639.887	170.06
640.297	174.91
640.706	153.07
641.116	128.79
641.526	153.07
641.935	150.64
642.345	150.64
642.755	179.77
643.164	150.64
643.573	133.65
643.983	99.67
644.392	199.18
644.801	199.18
645.211	102.1
645.62	128.79
646.029	191.9
646.438	172.48
646.847	264.72
647.256	65.69
647.665	206.47
648.074	148.21
648.483	140.93
648.892	165.2
649.3	155.49
649.709	218.6
650.118	148.21
650.526	143.36
650.935	133.65
651.343	145.79
651.752	211.32
652.16	123.94
652.568	136.08
652.977	148.21
653.385	167.63
653.793	174.91
654.201	170.06
654.609	187.05
655.017	114.23
655.425	143.36
655.833	179.77
656.241	221.03
656.649	87.53
657.057	235.59
657.464	174.91
657.872	155.49
658.28	145.79
658.687	153.07
659.095	111.8
659.502	199.18
659.91	216.17
660.317	230.74
660.724	191.9
661.132	174.91
661.539	167.63
661.946	89.96
662.353	155.49
662.76	38.99
663.167	242.87
663.574	133.65
663.981	140.93
664.388	150.64
664.795	153.07
665.202	145.79
665.608	138.5
666.015	145.79
666.422	189.48
666.828	150.64
667.235	148.21
667.641	143.36
668.047	111.8
668.454	148.21
668.86	148.21
669.266	116.66
669.673	131.22
670.079	114.23
670.485	155.49
670.891	187.05
671.297	172.48
671.703	211.32
672.109	106.95
672.515	153.07
672.92	138.5
673.326	104.52
673.732	148.21
674.138	194.33
674.543	109.38
674.949	177.34
675.354	204.04
675.76	221.03
676.165	160.35
676.57	133.65
676.976	189.48
677.381	201.61
677.786	174.91
678.191	165.2
678.596	187.05
679.001	179.77
679.406	196.76
679.811	196.76
680.216	179.77
680.621	145.79
681.026	121.51
681.43	65.69
681.835	94.81
682.24	174.91
682.644	153.07
683.049	174.91
683.453	133.65
683.858	128.79
684.262	131.22
684.667	206.47
685.071	182.19
685.475	194.33
685.879	223.46
686.283	191.9
686.687	182.19
687.091	216.17
687.495	126.37
687.899	114.23
688.303	116.66
688.707	60.83
689.111	143.36
689.514	204.04
689.918	182.19
690.322	150.64
690.725	194.33
691.129	157.92
691.532	165.2
691.936	140.93
692.339	199.18
692.742	213.75
693.146	179.77
693.549	211.32
693.952	179.77
694.355	150.64
694.758	150.64
695.161	206.47
695.564	89.96
695.967	165.2
696.37	177.34
696.773	165.2
697.175	213.75
697.578	184.62
697.981	199.18
698.383	286.56
698.786	153.07
699.188	165.2
699.591	157.92
699.993	116.66
700.395	182.19
700.798	104.52
701.2	252.58
701.602	177.34
702.004	140.93
702.406	165.2
702.808	179.77
703.21	170.06
703.612	228.31
704.014	155.49
704.416	170.06
704.818	199.18
705.219	116.66
705.621	189.48
706.023	208.89
706.424	206.47
706.826	242.87
707.227	182.19
707.629	194.33
708.03	213.75
708.431	269.57
708.832	257.44
709.234	247.73
709.635	230.74
710.036	257.44
710.437	216.17
710.838	247.73
711.239	310.84
711.64	172.48
712.041	230.74
712.441	264.72
712.842	272
713.243	274.43
713.643	259.86
714.044	247.73
714.445	364.24
714.845	208.89
715.246	269.57
715.646	320.55
716.046	303.55
716.447	242.87
716.847	352.1
717.247	288.99
717.647	279.28
718.047	320.55
718.447	279.28
718.847	276.86
719.247	359.38
719.647	339.96
720.047	342.39
720.446	344.82
720.846	286.56
721.246	386.08
721.645	390.93
722.045	451.62
722.444	412.78
722.844	395.79
723.243	354.53
723.643	356.95
724.042	395.79
724.441	444.33
724.84	454.04
725.24	463.75
725.639	376.37
726.038	376.37
726.437	405.5
726.836	514.72
727.234	495.31
727.633	429.77
728.032	488.02
728.431	488.02
728.83	585.11
729.228	451.62
729.627	597.25
730.025	546.28
730.424	609.38
730.822	713.76
731.22	781.72
731.619	738.03
732.017	873.95
732.415	844.83
732.813	951.62
733.212	929.78
733.61	1119.1
734.008	1097.26
734.406	1160.36
734.803	1279.3
735.201	1349.69
735.599	1439.49
735.997	1543.87
736.395	1648.24
736.792	1837.56
737.19	1808.43
737.587	1878.82
737.985	1983.19
738.382	2043.87
738.78	2165.23
739.177	2330.29
739.574	2471.06
739.971	2536.6
740.369	2539.03
740.766	2815.73
741.163	2818.16
741.56	3111.85
741.957	3136.12
742.354	3306.03
742.751	3291.47
743.147	3471.08
743.544	3631.28
743.941	3725.94
744.338	3983.22
744.734	4126.43
745.131	4475.95
745.527	4522.07
745.924	4861.88
746.32	5056.06
746.716	5150.72
747.113	5361.89
747.509	5920.15
747.905	6315.78
748.301	6194.42
748.697	6483.26
749.093	6886.18
749.489	7007.54
749.885	7240.56
750.281	7747.85
750.677	8233.29
751.073	8400.77
751.468	8769.71
751.864	9114.37
752.26	9179.91
752.655	9529.43
753.051	9917.78
753.446	10408.08
753.842	10653.23
754.237	11187.22
754.632	11711.5
755.028	11463.92
755.423	11823.15
755.818	12056.16
756.213	12417.82
756.608	12422.68
757.003	12602.29
757.398	12794.04
757.793	12832.88
758.188	13056.18
758.583	13420.26
758.977	13612.01
759.372	14107.17
759.767	14891.16
760.161	15930.01
760.556	16362.06
760.95	16891.19
761.345	17602.37
761.739	18689.76
762.133	18680.05
762.527	19308.7
762.922	20323.28
763.316	20221.34
763.71	20733.48
764.104	21779.62
764.498	22311.18
764.892	22733.52
765.286	22561.18
765.68	24046.64
766.073	24716.56
766.467	23643.72
766.861	24354.9
767.255	25609.77
767.648	26289.4
768.042	26398.62
768.435	27490.87
768.829	28379.23
769.222	28311.27
769.615	28182.63
770.008	29233.62
770.402	29206.92
770.795	28978.76
771.188	29301.58
771.581	30088
771.974	29155.95
772.367	28682.64
772.76	29493.33
773.153	29626.83
773.545	29138.95
773.938	29104.97
774.331	29743.33
774.724	30840.44
775.116	31520.06
775.509	31896.28
775.901	34476.42
776.294	35636.63
776.686	34289.52
777.078	34986.13
777.471	36529.85
777.863	38010.45
778.255	38211.91
778.647	39372.12
779.039	40610.01
779.431	40277.48
779.823	39182.8
780.215	40165.83
780.607	40913.41
780.999	41534.78
781.39	40758.07
781.782	41498.37
782.174	42668.29
782.565	42500.81
782.957	42209.55
783.348	43860.06
783.74	43988.7
784.131	41940.12
784.522	42403.72
784.914	42668.29
785.305	42993.54
785.696	41886.73
786.087	40770.2
786.478	41350.31
786.869	40362.43
787.26	38585.7
787.651	38107.54
788.042	38580.85
788.433	37857.54
788.823	35855.08
789.214	35335.65
789.605	35277.4
789.995	34626.9
790.386	33233.68
790.776	33214.26
791.167	33255.52
791.557	34534.67
791.948	34100.2
792.338	34777.39
792.728	37151.22
793.118	36209.45
793.508	35083.22
793.898	35867.21
794.288	37355.1
794.678	36818.69
795.068	35736.14
795.458	35651.19
795.848	36432.76
796.238	36753.15
796.627	34488.55
797.017	34578.36
797.406	36386.64
797.796	36185.18
798.185	35163.32
798.575	34755.55
798.964	36410.91
799.354	36898.78
799.743	35173.03
800.132	35452.16
800.521	36126.93
800.91	36605.09
801.299	34622.05
801.688	34937.59
802.077	35017.69
802.466	35811.39
802.855	33709.41
803.244	31886.57
803.633	33376.88
804.021	32874.45
804.41	31272.48
804.799	30374.41
805.187	30935.1
805.576	31027.33
805.964	28053.99
806.352	26454.45
806.741	28044.28
807.129	27816.12
807.517	27267.57
807.905	26837.95
808.293	27209.31
808.681	27738.45
809.069	26908.34
809.457	26731.15
809.845	27796.7
810.233	28604.97
810.621	28597.68
811.009	27029.7
811.396	27051.54
811.784	29104.97
812.171	28541.86
812.559	27362.23
812.946	26294.25
813.334	27260.28
813.721	27126.79
814.108	24910.73
814.496	24218.98
814.883	25265.11
815.27	26255.41
815.657	24823.35
816.044	24015.09
816.431	24410.73
816.818	25660.75
817.205	24121.89
817.592	23279.64
817.979	23092.74
818.365	24180.14
818.752	22852.45
819.139	20990.77
819.525	20944.65
819.912	21908.26
820.298	21267.47
820.685	19515.02
821.071	18854.81
821.457	19238.32
821.843	18624.23
822.23	17432.46
822.616	16849.93
823.002	16561.09
823.388	16480.99
823.774	15558.65
824.16	14505.23
824.546	14437.27
824.931	14818.34
825.317	14296.49
825.703	13298.9
826.089	13075.6
826.474	13689.69
826.86	13466.38
827.245	12990.65
827.631	12240.63
828.016	12201.8
828.401	12706.66
828.787	12303.74
829.172	11578
829.557	11281.88
829.942	11662.95
830.327	11476.06
830.712	10614.39
831.097	10102.25
831.482	10209.05
831.867	10063.42
832.252	9745.45
832.636	9194.47
833.021	9060.97
833.406	9611.95
833.79	9386.22
834.175	8803.69
834.559	8597.37
834.944	8621.65
835.328	8762.42
835.713	8330.38
836.097	7869.21
836.481	7374.05
836.865	7509.98
837.249	7177.45
837.633	6716.28
838.017	6444.43
838.401	6310.93
838.785	6291.51
839.169	5954.13
839.553	5607.04
839.937	5344.9
840.32	5291.5
840.704	5191.98
841.087	4762.36
841.471	4432.26
841.854	4633.72
842.238	4560.9
842.621	4386.14
843.004	4051.19
843.388	3956.52
843.771	4060.89
844.154	4048.76
844.537	3847.3
844.92	3657.98
845.303	3643.41
845.686	3723.51
846.069	3728.37
846.452	3500.21
846.834	3335.16
847.217	3539.04
847.6	3594.87
847.982	3357
848.365	2966.22
848.748	3140.98
849.13	3092.43
849.512	3150.69
849.895	2910.39
850.277	2645.82
850.659	2716.21
851.041	2900.68
851.423	2696.8
851.806	2497.76
852.188	2439.51
852.57	2383.68
852.951	2560.87
853.333	2509.9
853.715	2259.9
854.097	2133.68
854.479	2255.04
854.86	2211.35
855.242	2102.13
855.623	1856.98
856.005	1893.39
856.386	1995.33
856.768	1915.23
857.149	1779.31
857.53	1589.98
857.911	1604.55
858.292	1594.84
858.674	1718.63
859.055	1439.49
859.436	1337.55
859.817	1383.67
860.197	1349.69
860.578	1284.15
860.959	1230.75
861.34	1128.81
861.72	1136.09
862.101	1128.81
862.482	1155.51
862.862	1087.55
863.243	932.21
863.623	1060.85
864.003	995.31
864.384	1009.88
864.764	927.35
865.144	883.66
865.524	946.77
865.904	956.48
866.284	876.38
866.664	767.15
867.044	755.02
867.424	772.01
867.804	801.14
868.183	699.19
868.563	687.06
868.943	730.75
869.322	716.18
869.702	721.04
870.081	621.52
870.461	568.12
870.84	543.85
871.22	563.27
871.599	628.8
871.978	505.01
872.357	534.14
872.736	589.97
873.115	560.84
873.494	454.04
873.873	522
874.252	461.32
874.631	463.75
875.01	347.24
875.388	451.62
875.767	383.65
876.146	410.35
876.524	386.08
876.903	356.95
877.281	390.93
877.66	335.11
878.038	322.97
878.416	308.41
878.794	267.15
879.173	296.27
879.551	332.68
879.929	301.13
880.307	342.39
880.685	291.42
881.063	272
881.441	257.44
881.818	189.48
882.196	250.16
882.574	240.45
882.951	230.74
883.329	187.05
883.707	245.3
884.084	296.27
884.461	245.3
884.839	250.16
885.216	225.88
885.593	313.26
885.971	225.88
886.348	216.17
886.725	223.46
887.102	230.74
887.479	272
887.856	189.48
888.233	230.74
888.609	191.9
888.986	262.29
889.363	216.17
889.74	281.71
890.116	174.91
890.493	242.87
890.869	206.47
891.246	153.07
891.622	170.06
891.998	177.34
892.375	206.47
892.751	213.75
893.127	240.45
893.503	228.31
893.879	240.45
894.255	160.35
894.631	194.33
895.007	148.21
895.383	191.9
895.759	165.2
896.134	85.1
896.51	174.91
896.886	189.48
897.261	138.5
897.637	170.06
898.012	196.76
898.388	191.9
898.763	121.51
899.138	140.93
899.514	148.21
899.889	153.07
900.264	145.79
900.639	177.34
901.014	216.17
901.389	204.04
901.764	157.92
902.139	111.8
902.513	206.47
902.888	140.93
903.263	179.77
903.638	155.49
904.012	143.36
904.387	89.96
904.761	182.19
905.136	106.95
905.51	140.93
905.884	138.5
906.259	170.06
906.633	153.07
907.007	167.63
907.381	148.21
907.755	89.96
908.129	148.21
908.503	150.64
908.877	126.37
909.251	160.35
909.624	172.48
909.998	172.48
910.372	126.37
910.745	150.64
911.119	150.64
911.492	97.24
911.866	145.79
912.239	131.22
912.612	160.35
912.986	157.92
913.359	157.92
913.732	170.06
914.105	111.8
914.478	150.64
914.851	128.79
915.224	179.77
915.597	194.33
915.97	177.34
916.343	165.2
916.715	179.77
917.088	201.61
917.461	170.06
917.833	97.24
918.206	189.48
918.578	157.92
918.951	128.79
919.323	153.07
919.695	143.36
920.067	128.79
920.44	63.26
920.812	123.94
921.184	138.5
921.556	157.92
921.928	131.22
922.3	155.49
922.672	174.91
923.043	184.62
923.415	162.78
923.787	116.66
924.158	136.08
924.53	145.79
924.901	182.19
925.273	128.79
925.644	104.52
926.016	106.95
926.387	111.8
926.758	170.06
927.129	165.2
927.5	140.93
927.872	150.64
928.243	128.79
928.613	136.08
928.984	167.63
929.355	148.21
929.726	155.49
930.097	116.66
930.467	128.79
930.838	104.52
931.209	179.77
931.579	38.99
931.95	179.77
932.32	119.09
932.69	114.23
933.061	187.05
933.431	75.4
933.801	170.06
934.171	177.34
934.541	213.75
934.911	153.07
935.281	119.09
935.651	114.23
936.021	189.48
936.391	167.63
936.761	191.9
937.13	87.53
937.5	106.95
937.87	153.07
938.239	116.66
938.609	182.19
938.978	194.33
939.347	145.79
939.717	174.91
940.086	170.06
940.455	145.79
940.824	170.06
941.193	153.07
941.562	121.51
941.931	148.21
942.3	140.93
942.669	133.65
943.038	174.91
943.407	170.06
943.775	114.23
944.144	121.51
944.513	174.91
944.881	225.88
945.25	148.21
945.618	94.81
945.986	177.34
946.355	145.79
946.723	233.17
947.091	199.18
947.459	87.53
947.827	153.07
948.195	133.65
948.563	165.2
948.931	182.19
949.299	138.5
949.667	85.1
950.035	119.09
950.402	46.27
950.77	116.66
951.138	116.66
951.505	68.11
951.873	111.8
952.24	138.5
952.607	126.37
952.975	148.21
953.342	111.8
953.709	82.68
954.076	123.94
954.443	121.51
954.81	221.03
955.177	89.96
955.544	111.8
955.911	133.65
956.278	140.93
956.645	116.66
957.012	184.62
957.378	165.2
957.745	121.51
958.111	89.96
958.478	155.49
958.844	179.77
959.211	97.24
959.577	99.67
959.943	128.79
960.309	160.35
960.675	160.35
961.042	204.04
961.408	111.8
961.774	131.22
962.139	162.78
962.505	128.79
962.871	204.04
963.237	189.48
963.603	133.65
963.968	153.07
964.334	187.05
964.699	119.09
965.065	174.91
965.43	133.65
965.796	123.94
966.161	172.48
966.526	128.79
966.891	99.67
967.256	121.51
967.622	131.22
967.987	145.79
968.352	138.5
968.716	85.1
969.081	121.51
969.446	148.21
969.811	116.66
970.176	114.23
970.54	194.33
970.905	189.48
971.269	172.48
971.634	126.37
971.998	172.48
972.363	155.49
972.727	131.22
973.091	155.49
973.455	191.9
973.819	177.34
974.183	128.79
974.547	148.21
974.911	160.35
975.275	155.49
975.639	155.49
976.003	206.47
976.367	114.23
976.73	177.34
977.094	153.07
977.458	162.78
977.821	157.92
978.185	157.92
978.548	106.95
978.911	143.36
979.275	218.6
979.638	126.37
980.001	167.63
980.364	131.22
980.727	121.51
981.09	162.78
981.453	172.48
981.816	104.52
982.179	191.9
982.542	167.63
982.905	72.97
983.267	123.94
983.63	162.78
983.992	92.39
984.355	97.24
984.717	170.06
985.08	138.5
985.442	77.82
985.804	82.68
986.167	140.93
986.529	131.22
986.891	102.1
987.253	133.65
987.615	126.37
987.977	60.83
988.339	131.22
988.701	92.39
989.062	150.64
989.424	136.08
989.786	126.37
990.147	204.04
990.509	162.78
990.87	208.89
991.232	196.76
991.593	179.77
991.955	148.21
992.316	104.52
992.677	153.07
993.038	145.79
993.399	140.93
993.76	131.22
994.121	143.36
994.482	157.92
994.843	191.9
995.204	155.49
995.565	145.79
995.926	155.49
996.286	128.79
996.647	133.65
997.007	131.22
997.368	123.94
997.728	172.48
998.089	191.9
998.449	123.94
998.809	119.09
999.169	153.07
999.53	184.62
999.89	167.63
1000.25	102.1
1000.61	153.07
1000.97	172.48
1001.329	70.54
1001.689	196.76
1002.049	201.61
1002.409	99.67
1002.768	155.49
1003.128	145.79
1003.487	133.65
1003.847	133.65
1004.206	191.9
1004.566	126.37
1004.925	102.1
1005.284	114.23
1005.643	170.06
1006.003	104.52
1006.362	104.52
1006.721	109.38
1007.08	182.19
1007.438	94.81
1007.797	99.67
1008.156	143.36
1008.515	140.93
1008.874	162.78
1009.232	128.79
1009.591	131.22
1009.949	150.64
1010.308	172.48
1010.666	121.51
1011.024	172.48
1011.383	75.4
1011.741	170.06
1012.099	114.23
1012.457	143.36
1012.815	131.22
1013.173	89.96
1013.531	97.24
1013.889	104.52
1014.247	145.79
1014.605	153.07
1014.962	123.94
1015.32	138.5
1015.678	102.1
1016.035	128.79
1016.393	160.35
1016.75	162.78
1017.107	199.18
1017.465	99.67
1017.822	150.64
1018.179	162.78
1018.536	94.81
1018.894	153.07
1019.251	150.64
1019.608	179.77
1019.964	126.37
1020.321	179.77
1020.678	155.49
1021.035	184.62
1021.392	121.51
1021.748	104.52
1022.105	126.37
1022.461	187.05
1022.818	177.34
1023.174	157.92
1023.531	228.31
1023.887	206.47
1024.243	109.38
1024.599	155.49
1024.955	17.14
1025.311	199.18
1025.667	155.49
1026.023	174.91
1026.379	123.94
1026.735	160.35
1027.091	123.94
1027.447	109.38
