189.514	52.19
189.973	52.19
190.431	52.19
190.889	112.87
191.348	110.44
191.806	1.21
192.264	49.76
192.722	13.35
193.18	-23.06
193.638	-27.91
194.096	-25.49
194.554	-20.63
195.012	15.78
195.47	-20.63
195.928	-32.77
196.385	-13.35
196.843	23.06
197.301	42.48
197.758	54.61
198.216	-35.19
198.674	8.5
199.131	-8.5
199.589	57.04
200.046	52.19
200.503	18.2
200.961	-1.21
201.418	98.3
201.875	71.6
202.332	100.73
202.79	30.34
203.247	91.02
203.704	158.98
204.161	171.12
204.618	64.32
205.075	168.69
205.532	117.72
205.989	151.7
206.445	175.97
206.902	110.44
207.359	108.01
207.816	151.7
208.272	117.72
208.729	137.14
209.185	178.4
209.642	175.97
210.098	205.1
210.555	219.66
211.011	122.57
211.467	127.43
211.924	93.45
212.38	175.97
212.836	163.84
213.292	149.27
213.748	256.07
214.204	161.41
214.66	185.68
215.116	231.8
215.572	125
216.028	168.69
216.484	120.15
216.94	139.57
217.396	108.01
217.851	112.87
218.307	137.14
218.763	122.57
219.218	149.27
219.674	171.12
220.129	268.21
220.585	98.3
221.04	98.3
221.496	117.72
221.951	47.33
222.406	161.41
222.861	112.87
223.317	236.65
223.772	105.58
224.227	57.04
224.682	183.26
225.137	117.72
225.592	151.7
226.047	103.16
226.502	88.59
226.957	183.26
227.411	139.57
227.866	197.82
228.321	141.99
228.776	158.98
229.23	141.99
229.685	57.04
230.139	166.26
230.594	205.1
231.048	115.29
231.503	117.72
231.957	202.67
232.411	132.28
232.865	112.87
233.32	103.16
233.774	86.17
234.228	149.27
234.682	151.7
235.136	100.73
235.59	171.12
236.044	209.95
236.498	180.83
236.952	125
237.406	122.57
237.86	188.11
238.313	117.72
238.767	129.86
239.221	81.31
239.674	154.13
240.128	146.85
240.581	161.41
241.035	137.14
241.488	91.02
241.942	212.38
242.395	122.57
242.848	120.15
243.301	127.43
243.755	127.43
244.208	161.41
244.661	180.83
245.114	103.16
245.567	163.84
246.02	163.84
246.473	122.57
246.926	171.12
247.379	98.3
247.832	91.02
248.284	122.57
248.737	110.44
249.19	112.87
249.642	134.71
250.095	163.84
250.547	151.7
251	188.11
251.452	149.27
251.905	98.3
252.357	98.3
252.81	175.97
253.262	178.4
253.714	175.97
254.166	134.71
254.618	52.19
255.07	137.14
255.523	139.57
255.975	205.1
256.427	115.29
256.878	127.43
257.33	195.39
257.782	88.59
258.234	200.25
258.686	149.27
259.137	168.69
259.589	166.26
260.041	115.29
260.492	171.12
260.944	129.86
261.395	154.13
261.847	192.96
262.298	122.57
262.749	190.54
263.201	144.42
263.652	173.55
264.103	100.73
264.554	76.46
265.005	137.14
265.457	154.13
265.908	183.26
266.359	132.28
266.809	86.17
267.26	137.14
267.711	195.39
268.162	149.27
268.613	139.57
269.064	180.83
269.514	57.04
269.965	117.72
270.415	115.29
270.866	161.41
271.316	98.3
271.767	151.7
272.217	195.39
272.668	129.86
273.118	139.57
273.568	103.16
274.019	183.26
274.469	180.83
274.919	115.29
275.369	192.96
275.819	183.26
276.269	168.69
276.719	171.12
277.169	132.28
277.619	175.97
278.069	137.14
278.518	212.38
278.968	137.14
279.418	149.27
279.867	185.68
280.317	125
280.767	141.99
281.216	156.56
281.666	195.39
282.115	112.87
282.564	127.43
283.014	151.7
283.463	212.38
283.912	180.83
284.361	149.27
284.811	202.67
285.26	195.39
285.709	205.1
286.158	120.15
286.607	178.4
287.056	125
287.505	256.07
287.953	151.7
288.402	105.58
288.851	105.58
289.3	139.57
289.748	103.16
290.197	154.13
290.646	188.11
291.094	166.26
291.543	132.28
291.991	149.27
292.439	57.04
292.888	151.7
293.336	197.82
293.784	115.29
294.233	127.43
294.681	120.15
295.129	110.44
295.577	183.26
296.025	115.29
296.473	122.57
296.921	156.56
297.369	115.29
297.817	226.95
298.264	224.52
298.712	151.7
299.16	115.29
299.608	125
300.055	139.57
300.503	108.01
300.95	154.13
301.398	156.56
301.845	158.98
302.293	127.43
302.74	178.4
303.187	154.13
303.635	180.83
304.082	149.27
304.529	171.12
304.976	214.81
305.423	166.26
305.87	127.43
306.317	195.39
306.764	163.84
307.211	134.71
307.658	129.86
308.105	154.13
308.552	168.69
308.998	180.83
309.445	207.53
309.892	132.28
310.338	163.84
310.785	197.82
311.231	98.3
311.678	137.14
312.124	183.26
312.571	105.58
313.017	134.71
313.463	195.39
313.909	112.87
314.356	171.12
314.802	108.01
315.248	154.13
315.694	222.09
316.14	105.58
316.586	166.26
317.032	132.28
317.478	139.57
317.923	137.14
318.369	120.15
318.815	144.42
319.261	154.13
319.706	141.99
320.152	78.88
320.597	129.86
321.043	149.27
321.488	180.83
321.934	163.84
322.379	141.99
322.824	197.82
323.27	132.28
323.715	166.26
324.16	129.86
324.605	115.29
325.05	168.69
325.495	137.14
325.94	192.96
326.385	95.88
326.83	205.1
327.275	224.52
327.72	229.37
328.165	103.16
328.61	139.57
329.054	178.4
329.499	175.97
329.943	132.28
330.388	117.72
330.832	129.86
331.277	171.12
331.721	154.13
332.166	175.97
332.61	168.69
333.054	144.42
333.499	78.88
333.943	178.4
334.387	91.02
334.831	95.88
335.275	171.12
335.719	105.58
336.163	134.71
336.607	158.98
337.051	125
337.495	197.82
337.938	146.85
338.382	64.32
338.826	129.86
339.269	95.88
339.713	120.15
340.157	15.78
340.6	243.94
341.044	168.69
341.487	178.4
341.93	202.67
342.374	112.87
342.817	207.53
343.26	178.4
343.703	139.57
344.146	139.57
344.59	146.85
345.033	144.42
345.476	161.41
345.919	144.42
346.361	129.86
346.804	137.14
347.247	134.71
347.69	120.15
348.133	195.39
348.575	154.13
349.018	197.82
349.461	168.69
349.903	144.42
350.346	156.56
350.788	197.82
351.23	144.42
351.673	163.84
352.115	212.38
352.557	134.71
353	166.26
353.442	122.57
353.884	195.39
354.326	183.26
354.768	205.1
355.21	151.7
355.652	98.3
356.094	166.26
356.536	91.02
356.978	91.02
357.419	178.4
357.861	132.28
358.303	180.83
358.744	125
359.186	127.43
359.627	209.95
360.069	108.01
360.51	137.14
360.952	175.97
361.393	146.85
361.834	195.39
362.276	207.53
362.717	175.97
363.158	98.3
363.599	178.4
364.04	185.68
364.481	125
364.922	154.13
365.363	98.3
365.804	139.57
366.245	161.41
366.686	192.96
367.126	146.85
367.567	202.67
368.008	154.13
368.448	120.15
368.889	217.24
369.33	151.7
369.77	141.99
370.21	110.44
370.651	117.72
371.091	112.87
371.531	161.41
371.972	180.83
372.412	144.42
372.852	175.97
373.292	166.26
373.732	105.58
374.172	129.86
374.612	185.68
375.052	105.58
375.492	154.13
375.932	175.97
376.372	139.57
376.811	190.54
377.251	98.3
377.691	115.29
378.13	120.15
378.57	132.28
379.009	171.12
379.449	91.02
379.888	151.7
380.328	129.86
380.767	161.41
381.206	156.56
381.645	158.98
382.085	137.14
382.524	120.15
382.963	134.71
383.402	171.12
383.841	202.67
384.28	207.53
384.719	205.1
385.158	171.12
385.596	134.71
386.035	91.02
386.474	49.76
386.913	74.03
387.351	117.72
387.79	151.7
388.228	168.69
388.667	64.32
389.105	141.99
389.544	146.85
389.982	108.01
390.42	117.72
390.859	141.99
391.297	168.69
391.735	139.57
392.173	117.72
392.611	141.99
393.049	127.43
393.487	76.46
393.925	149.27
394.363	139.57
394.801	161.41
395.239	149.27
395.676	83.74
396.114	161.41
396.552	125
396.989	175.97
397.427	129.86
397.864	156.56
398.302	178.4
398.739	117.72
399.177	141.99
399.614	192.96
400.051	149.27
400.488	144.42
400.926	161.41
401.363	69.18
401.8	78.88
402.237	98.3
402.674	171.12
403.111	95.88
403.548	149.27
403.985	137.14
404.421	125
404.858	137.14
405.295	180.83
405.732	226.95
406.168	209.95
406.605	134.71
407.041	166.26
407.478	156.56
407.914	209.95
408.351	192.96
408.787	88.59
409.223	158.98
409.66	173.55
410.096	154.13
410.532	168.69
410.968	175.97
411.404	239.08
411.84	192.96
412.276	158.98
412.712	100.73
413.148	207.53
413.584	205.1
414.02	161.41
414.455	154.13
414.891	134.71
415.327	115.29
415.762	180.83
416.198	108.01
416.633	122.57
417.069	188.11
417.504	173.55
417.94	226.95
418.375	154.13
418.81	226.95
419.245	192.96
419.681	202.67
420.116	127.43
420.551	195.39
420.986	66.75
421.421	117.72
421.856	149.27
422.291	141.99
422.726	137.14
423.16	137.14
423.595	163.84
424.03	246.36
424.464	144.42
424.899	158.98
425.334	127.43
425.768	125
426.203	188.11
426.637	205.1
427.071	195.39
427.506	110.44
427.94	168.69
428.374	137.14
428.809	217.24
429.243	214.81
429.677	122.57
430.111	163.84
430.545	188.11
430.979	168.69
431.413	115.29
431.847	178.4
432.28	175.97
432.714	166.26
433.148	163.84
433.582	144.42
434.015	171.12
434.449	117.72
434.882	197.82
435.316	163.84
435.749	154.13
436.183	137.14
436.616	166.26
437.049	217.24
437.483	168.69
437.916	180.83
438.349	149.27
438.782	146.85
439.215	185.68
439.648	180.83
440.081	161.41
440.514	156.56
440.947	71.6
441.38	173.55
441.813	200.25
442.245	205.1
442.678	166.26
443.111	146.85
443.543	205.1
443.976	195.39
444.408	175.97
444.841	222.09
445.273	180.83
445.705	226.95
446.138	253.64
446.57	185.68
447.002	151.7
447.434	149.27
447.867	214.81
448.299	229.37
448.731	251.22
449.163	290.05
449.595	207.53
450.026	168.69
450.458	219.66
450.89	231.8
451.322	231.8
451.754	202.67
452.185	268.21
452.617	222.09
453.048	277.92
453.48	258.5
453.911	331.32
454.343	263.35
454.774	246.36
455.205	270.64
455.637	251.22
456.068	258.5
456.499	251.22
456.93	282.77
457.361	270.64
457.792	195.39
458.223	275.49
458.654	234.23
459.085	268.21
459.516	290.05
459.947	243.94
460.378	285.2
460.808	263.35
461.239	309.47
461.669	331.32
462.1	309.47
462.531	273.06
462.961	205.1
463.391	200.25
463.822	258.5
464.252	319.18
464.682	258.5
465.113	219.66
465.543	333.74
465.973	251.22
466.403	226.95
466.833	236.65
467.263	202.67
467.693	263.35
468.123	285.2
468.553	309.47
468.983	205.1
469.412	224.52
469.842	251.22
470.272	251.22
470.701	239.08
471.131	294.91
471.56	241.51
471.99	188.11
472.419	277.92
472.849	282.77
473.278	183.26
473.707	207.53
474.136	270.64
474.566	234.23
474.995	197.82
475.424	212.38
475.853	185.68
476.282	212.38
476.711	224.52
477.14	231.8
477.569	141.99
477.997	224.52
478.426	154.13
478.855	224.52
479.283	195.39
479.712	212.38
480.141	214.81
480.569	224.52
480.998	248.79
481.426	154.13
481.854	173.55
482.283	163.84
482.711	125
483.139	207.53
483.567	163.84
483.995	178.4
484.424	188.11
484.852	168.69
485.28	243.94
485.708	175.97
486.135	217.24
486.563	265.78
486.991	226.95
487.419	195.39
487.847	188.11
488.274	229.37
488.702	253.64
489.129	173.55
489.557	195.39
489.984	175.97
490.412	231.8
490.839	122.57
491.266	200.25
491.694	161.41
492.121	175.97
492.548	188.11
492.975	166.26
493.402	205.1
493.829	178.4
494.256	161.41
494.683	156.56
495.11	120.15
495.537	173.55
495.964	188.11
496.39	137.14
496.817	205.1
497.244	231.8
497.67	217.24
498.097	192.96
498.523	144.42
498.95	144.42
499.376	222.09
499.803	151.7
500.229	163.84
500.655	151.7
501.081	158.98
501.508	202.67
501.934	226.95
502.36	219.66
502.786	188.11
503.212	217.24
503.638	98.3
504.064	212.38
504.489	175.97
504.915	188.11
505.341	154.13
505.767	144.42
506.192	190.54
506.618	175.97
507.043	195.39
507.469	183.26
507.894	205.1
508.32	239.08
508.745	251.22
509.17	197.82
509.596	202.67
510.021	168.69
510.446	161.41
510.871	212.38
511.296	209.95
511.721	161.41
512.146	149.27
512.571	161.41
512.996	200.25
513.421	180.83
513.845	158.98
514.27	209.95
514.695	243.94
515.119	258.5
515.544	156.56
515.969	207.53
516.393	224.52
516.817	103.16
517.242	156.56
517.666	129.86
518.09	188.11
518.515	141.99
518.939	188.11
519.363	428.4
519.787	236.65
520.211	88.59
520.635	125
521.059	195.39
521.483	202.67
521.907	183.26
522.331	154.13
522.754	231.8
523.178	88.59
523.602	134.71
524.025	105.58
524.449	200.25
524.872	256.07
525.296	134.71
525.719	234.23
526.143	243.94
526.566	158.98
526.989	212.38
527.412	166.26
527.836	209.95
528.259	163.84
528.682	163.84
529.105	195.39
529.528	209.95
529.951	214.81
530.374	253.64
530.796	166.26
531.219	234.23
531.642	149.27
532.065	200.25
532.487	141.99
532.91	146.85
533.332	205.1
533.755	137.14
534.177	93.45
534.6	248.79
535.022	185.68
535.444	158.98
535.867	285.2
536.289	168.69
536.711	175.97
537.133	224.52
537.555	125
537.977	200.25
538.399	163.84
538.821	185.68
539.243	171.12
539.665	219.66
540.086	103.16
540.508	115.29
540.93	144.42
541.351	158.98
541.773	214.81
542.195	178.4
542.616	178.4
543.037	219.66
543.459	171.12
543.88	188.11
544.301	192.96
544.723	243.94
545.144	214.81
545.565	188.11
545.986	195.39
546.407	168.69
546.828	158.98
547.249	175.97
547.67	214.81
548.091	183.26
548.512	205.1
548.932	178.4
549.353	212.38
549.774	192.96
550.194	175.97
550.615	173.55
551.035	151.7
551.456	197.82
551.876	151.7
552.296	173.55
552.717	144.42
553.137	110.44
553.557	197.82
553.977	197.82
554.397	219.66
554.817	149.27
555.237	294.91
555.657	222.09
556.077	139.57
556.497	195.39
556.917	178.4
557.337	146.85
557.756	173.55
558.176	185.68
558.596	192.96
559.015	192.96
559.435	188.11
559.854	163.84
560.274	166.26
560.693	129.86
561.112	125
561.532	86.17
561.951	185.68
562.37	183.26
562.789	219.66
563.208	129.86
563.627	120.15
564.046	251.22
564.465	200.25
564.884	231.8
565.303	214.81
565.722	183.26
566.14	173.55
566.559	183.26
566.978	175.97
567.396	178.4
567.815	195.39
568.233	236.65
568.652	195.39
569.07	163.84
569.489	243.94
569.907	205.1
570.325	168.69
570.743	180.83
571.161	209.95
571.58	112.87
571.998	141.99
572.416	195.39
572.833	212.38
573.251	197.82
573.669	200.25
574.087	241.51
574.505	229.37
574.922	200.25
575.34	154.13
575.758	137.14
576.175	183.26
576.593	180.83
577.01	183.26
577.428	168.69
577.845	1695.41
578.262	294.91
578.68	190.54
579.097	207.53
579.514	158.98
579.931	195.39
580.348	190.54
580.765	197.82
581.182	161.41
581.599	180.83
582.016	139.57
582.433	163.84
582.849	195.39
583.266	81.31
583.683	200.25
584.099	226.95
584.516	173.55
584.933	243.94
585.349	202.67
585.765	185.68
586.182	207.53
586.598	200.25
587.014	175.97
587.431	175.97
587.847	166.26
588.263	163.84
588.679	175.97
589.095	125
589.511	161.41
589.927	195.39
590.343	236.65
590.759	178.4
591.174	154.13
591.59	125
592.006	122.57
592.421	125
592.837	192.96
593.252	141.99
593.668	144.42
594.083	214.81
594.499	229.37
594.914	209.95
595.329	171.12
595.745	236.65
596.16	183.26
596.575	175.97
596.99	217.24
597.405	98.3
597.82	202.67
598.235	190.54
598.65	190.54
599.065	197.82
599.479	156.56
599.894	129.86
600.309	134.71
600.724	195.39
601.138	178.4
601.553	173.55
601.967	234.23
602.382	161.41
602.796	178.4
603.21	141.99
603.625	146.85
604.039	171.12
604.453	214.81
604.867	178.4
605.281	234.23
605.695	207.53
606.109	175.97
606.523	197.82
606.937	202.67
607.351	265.78
607.765	166.26
608.178	178.4
608.592	117.72
609.006	161.41
609.419	251.22
609.833	141.99
610.246	171.12
610.66	171.12
611.073	205.1
611.487	243.94
611.9	202.67
612.313	161.41
612.726	171.12
613.139	190.54
613.553	149.27
613.966	144.42
614.379	163.84
614.792	173.55
615.204	146.85
615.617	129.86
616.03	195.39
616.443	127.43
616.856	236.65
617.268	226.95
617.681	195.39
618.093	146.85
618.506	173.55
618.918	103.16
619.331	180.83
619.743	175.97
620.155	178.4
620.568	185.68
620.98	175.97
621.392	127.43
621.804	192.96
622.216	103.16
622.628	197.82
623.04	224.52
623.452	222.09
623.864	132.28
624.276	192.96
624.687	161.41
625.099	173.55
625.511	129.86
625.922	180.83
626.334	158.98
626.745	122.57
627.157	149.27
627.568	202.67
627.979	154.13
628.391	195.39
628.802	212.38
629.213	129.86
629.624	226.95
630.035	173.55
630.446	202.67
630.857	217.24
631.268	178.4
631.679	197.82
632.09	209.95
632.501	178.4
632.912	185.68
633.322	192.96
633.733	161.41
634.144	120.15
634.554	219.66
634.965	185.68
635.375	127.43
635.785	226.95
636.196	156.56
636.606	139.57
637.016	200.25
637.427	120.15
637.837	158.98
638.247	190.54
638.657	173.55
639.067	149.27
639.477	134.71
639.887	156.56
640.297	173.55
640.706	134.71
641.116	156.56
641.526	129.86
641.935	185.68
642.345	175.97
642.755	120.15
643.164	200.25
643.573	149.27
643.983	156.56
644.392	110.44
644.801	146.85
645.211	98.3
645.62	88.59
646.029	185.68
646.438	127.43
646.847	163.84
647.256	71.6
647.665	158.98
648.074	144.42
648.483	197.82
648.892	105.58
649.3	146.85
649.709	185.68
650.118	149.27
650.526	122.57
650.935	224.52
651.343	212.38
651.752	217.24
652.16	141.99
652.568	137.14
652.977	197.82
653.385	161.41
653.793	144.42
654.201	207.53
654.609	197.82
655.017	192.96
655.425	236.65
655.833	115.29
656.241	158.98
656.649	154.13
657.057	195.39
657.464	188.11
657.872	158.98
658.28	180.83
658.687	154.13
659.095	161.41
659.502	190.54
659.91	132.28
660.317	178.4
660.724	212.38
661.132	180.83
661.539	129.86
661.946	146.85
662.353	146.85
662.76	183.26
663.167	144.42
663.574	66.75
663.981	192.96
664.388	200.25
664.795	239.08
665.202	209.95
665.608	134.71
666.015	168.69
666.422	200.25
666.828	105.58
667.235	144.42
667.641	144.42
668.047	180.83
668.454	117.72
668.86	115.29
669.266	108.01
669.673	117.72
670.079	156.56
670.485	154.13
670.891	185.68
671.297	171.12
671.703	178.4
672.109	134.71
672.515	212.38
672.92	178.4
673.326	229.37
673.732	163.84
674.138	125
674.543	156.56
674.949	137.14
675.354	180.83
675.76	209.95
676.165	149.27
676.57	212.38
676.976	183.26
677.381	168.69
677.786	139.57
678.191	207.53
678.596	134.71
679.001	229.37
679.406	168.69
679.811	103.16
680.216	103.16
680.621	202.67
681.026	188.11
681.43	137.14
681.835	151.7
682.24	161.41
682.644	161.41
683.049	129.86
683.453	180.83
683.858	188.11
684.262	95.88
684.667	110.44
685.071	149.27
685.475	171.12
685.879	185.68
686.283	110.44
686.687	120.15
687.091	183.26
687.495	156.56
687.899	156.56
688.303	161.41
688.707	117.72
689.111	134.71
689.514	168.69
689.918	134.71
690.322	183.26
690.725	100.73
691.129	166.26
691.532	151.7
691.936	158.98
692.339	205.1
692.742	163.84
693.146	100.73
693.549	173.55
693.952	134.71
694.355	180.83
694.758	173.55
695.161	185.68
695.564	129.86
695.967	127.43
696.37	93.45
696.773	134.71
697.175	175.97
697.578	188.11
697.981	224.52
698.383	265.78
698.786	180.83
699.188	183.26
699.591	146.85
699.993	127.43
700.395	202.67
700.798	207.53
701.2	168.69
701.602	134.71
702.004	141.99
702.406	117.72
702.808	178.4
703.21	188.11
703.612	217.24
704.014	137.14
704.416	161.41
704.818	154.13
705.219	188.11
705.621	127.43
706.023	192.96
706.424	158.98
706.826	260.93
707.227	200.25
707.629	214.81
708.03	222.09
708.431	226.95
708.832	163.84
709.234	163.84
709.635	277.92
710.036	185.68
710.437	115.29
710.838	239.08
711.239	115.29
711.64	178.4
712.041	141.99
712.441	202.67
712.842	214.81
713.243	268.21
713.643	200.25
714.044	175.97
714.445	234.23
714.845	205.1
715.246	234.23
715.646	319.18
716.046	200.25
716.447	260.93
716.847	260.93
717.247	263.35
717.647	197.82
718.047	207.53
718.447	304.62
718.847	224.52
719.247	205.1
719.647	241.51
720.047	243.94
720.446	212.38
720.846	166.26
721.246	224.52
721.645	248.79
722.045	256.07
722.444	331.32
722.844	299.76
723.243	224.52
723.643	297.33
724.042	287.63
724.441	294.91
724.84	333.74
725.24	280.34
725.639	309.47
726.038	353.16
726.437	302.19
726.836	302.19
727.234	311.9
727.633	341.02
728.032	348.31
728.431	345.88
728.83	365.3
729.228	435.69
729.627	428.4
730.025	433.26
730.424	496.37
730.822	481.8
731.22	445.4
731.619	428.4
732.017	537.63
732.415	440.54
732.813	457.53
733.212	474.52
733.61	496.37
734.008	622.58
734.406	617.73
734.803	625.01
735.201	627.44
735.599	775.5
735.997	925.99
736.395	955.11
736.792	1032.78
737.19	1299.78
737.587	1275.51
737.985	1372.59
738.382	1435.7
738.78	1377.45
739.177	1321.62
739.574	1294.92
739.971	1175.99
740.369	1105.6
740.766	1083.75
741.163	967.25
741.56	1042.49
741.957	1008.51
742.354	1154.14
742.751	1258.51
743.147	1595.9
743.544	1911.44
743.941	2243.97
744.338	2549.8
744.734	2790.09
745.131	2989.12
745.527	3406.61
745.924	3382.33
746.32	3452.72
746.716	3401.75
747.113	3263.4
747.509	3083.79
747.905	2763.39
748.301	2666.3
748.697	2287.66
749.093	2146.88
749.489	2001.24
749.885	2117.75
750.281	2421.15
750.677	2785.24
751.073	3256.12
751.468	3943.02
751.864	4765.85
752.26	5450.33
752.655	6180.92
753.051	6787.73
753.446	7862.99
753.842	8171.24
754.237	8341.15
754.632	8307.17
755.028	8098.43
755.423	7700.36
755.818	6979.48
756.213	6375.1
756.608	5634.8
757.003	5025.56
757.398	4382.35
757.793	4137.2
758.188	3870.21
758.583	4163.9
758.977	4404.19
759.372	5095.95
759.767	6173.64
760.161	7416.38
760.556	8896.98
760.95	10302.34
761.345	12049.94
761.739	13401.91
762.133	14113.08
762.527	15278.15
762.922	15469.9
763.316	15479.61
763.71	14960.18
764.104	14380.08
764.498	13634.92
764.892	12579.08
765.286	11265.95
765.68	9923.7
766.073	9001.35
766.467	8054.74
766.861	7600.85
767.255	7663.95
767.648	8071.73
768.042	8685.81
768.435	9884.86
768.829	11258.67
769.222	13232
769.615	15508.74
770.008	17081.58
770.402	18960.25
770.795	20586.49
771.188	21530.67
771.581	22414.18
771.974	22307.39
772.367	21846.21
772.76	21605.92
773.153	20465.12
773.545	19159.28
773.938	17617.99
774.331	15824.28
774.724	13875.22
775.116	12790.25
775.509	11816.93
775.901	11037.79
776.294	10491.67
776.686	10336.33
777.078	11115.46
777.471	12363.06
777.863	13741.72
778.255	16120.4
778.647	18460.24
779.039	20943.29
779.431	23071.96
779.823	25203.06
780.215	27761.35
780.607	29545.36
780.999	31127.91
781.39	31885.2
781.782	31846.37
782.174	31225
782.565	30064.79
782.957	28530.78
783.348	26241.91
783.74	24368.1
784.131	21550.09
784.522	19370.45
784.914	16826.72
785.305	14960.18
785.696	13348.51
786.087	12654.32
786.478	12188.3
786.869	12091.21
787.26	12656.75
787.651	13773.27
788.042	15210.19
788.433	16911.67
788.823	18443.25
789.214	20006.38
789.605	21829.22
789.995	22732.15
790.386	23620.51
790.776	25120.54
791.167	25399.67
791.557	25712.78
791.948	26159.39
792.338	25278.31
792.728	24598.68
793.118	23203.03
793.508	21406.89
793.898	19676.28
794.288	17591.29
794.678	15329.12
795.068	14018.42
795.458	12333.93
795.848	11321.78
796.238	10727.11
796.627	10350.89
797.017	10714.97
797.406	11389.74
797.796	12438.3
798.185	13974.73
798.575	15860.68
798.964	17790.33
799.354	19741.81
799.743	21523.39
800.132	23579.25
800.521	25669.09
800.91	26528.33
801.299	26957.94
801.688	26904.54
802.077	26698.23
802.466	26419.1
802.855	25064.71
803.244	22703.02
803.633	21482.13
804.021	18957.82
804.41	17239.35
804.799	15309.7
805.187	12989.28
805.576	11464.98
805.964	10006.22
806.352	8887.27
806.741	8304.74
807.129	8093.57
807.517	8040.17
807.905	8515.91
808.293	9312.04
808.681	10197.97
809.069	11557.22
809.457	13054.81
809.845	14695.62
810.233	16263.6
810.621	17746.64
811.009	19054.91
811.396	20212.69
811.784	20936.01
812.171	21219.99
812.559	21210.28
812.946	20326.77
813.334	20125.31
813.721	18639.85
814.108	17644.69
814.496	16418.94
814.883	14586.39
815.27	13778.13
815.657	11892.18
816.044	10967.4
816.431	9714.96
816.818	8224.64
817.205	7428.51
817.592	6940.64
817.979	6324.13
818.365	6083.83
818.752	6122.67
819.139	6542.58
819.525	6916.37
819.912	7809.59
820.298	8571.74
820.685	9227.09
821.071	10234.38
821.457	10989.25
821.843	11263.52
822.23	11722.27
822.616	12142.18
823.002	12151.89
823.388	11991.69
823.774	11850.91
824.16	11564.5
824.546	10952.84
824.931	10430.99
825.317	9729.52
825.703	9030.48
826.089	8142.12
826.474	7559.58
826.86	6617.82
827.245	6171.21
827.631	5426.06
828.016	4663.91
828.401	4071.67
828.787	3654.18
829.172	3433.31
829.557	3183.3
829.942	2945.43
830.327	3047.38
830.712	3027.96
831.097	3438.16
831.482	3661.46
831.867	4098.36
832.252	4430.89
832.636	4855.66
833.021	5190.61
833.406	5642.08
833.79	6035.29
834.175	6241.6
834.559	6263.45
834.944	6311.99
835.328	6382.38
835.713	6239.17
836.097	6100.82
836.481	5595.96
836.865	5355.67
837.249	5137.22
837.633	4532.84
838.017	4076.52
838.401	3719.72
838.785	3219.71
839.169	2877.47
839.553	2440.57
839.937	1981.83
840.32	1911.44
840.704	1491.53
841.087	1324.05
841.471	1129.87
841.854	1224.53
842.238	1212.4
842.621	1195.41
843.004	1226.96
843.388	1355.6
843.771	1479.39
844.154	1600.75
844.537	1760.95
844.92	1896.87
845.303	2010.95
845.686	2108.04
846.069	2256.1
846.452	2345.91
846.834	2396.88
847.217	2569.21
847.6	2510.96
847.982	2406.59
848.365	2406.59
848.748	2292.51
849.13	2226.98
849.512	2008.53
849.895	1984.25
850.277	1843.48
850.659	1610.46
851.041	1578.91
851.423	1474.54
851.806	1166.28
852.188	1074.05
852.57	1025.5
852.951	877.44
853.333	760.93
853.715	729.38
854.097	661.42
854.479	644.43
854.86	673.55
855.242	581.32
855.623	576.47
856.005	622.58
856.386	680.84
856.768	603.16
857.149	668.7
857.53	692.97
857.911	756.08
858.292	785.21
858.674	850.74
859.055	882.3
859.436	843.46
859.817	807.05
860.197	853.17
860.578	843.46
860.959	875.01
861.34	860.45
861.72	780.35
862.101	877.44
862.482	770.64
862.862	712.39
863.243	746.37
863.623	617.73
864.003	646.85
864.384	523.07
864.764	513.36
865.144	469.67
865.524	416.27
865.904	382.29
866.284	353.16
866.664	273.06
867.044	280.34
867.424	321.61
867.804	311.9
868.183	304.62
868.563	297.33
868.943	292.48
869.322	321.61
869.702	253.64
870.081	277.92
870.461	362.87
870.84	209.95
871.22	404.13
871.599	321.61
871.978	375.01
872.357	302.19
872.736	341.02
873.115	336.17
873.494	299.76
873.873	314.33
874.252	328.89
874.631	362.87
875.01	321.61
875.388	292.48
875.767	285.2
876.146	314.33
876.524	321.61
876.903	258.5
877.281	277.92
877.66	212.38
878.038	265.78
878.416	273.06
878.794	202.67
879.173	258.5
879.551	190.54
879.929	214.81
880.307	207.53
880.685	197.82
881.063	192.96
881.441	129.86
881.818	219.66
882.196	190.54
882.574	175.97
882.951	243.94
883.329	163.84
883.707	207.53
884.084	168.69
884.461	202.67
884.839	144.42
885.216	197.82
885.593	161.41
885.971	146.85
886.348	122.57
886.725	151.7
887.102	185.68
887.479	236.65
887.856	239.08
888.233	195.39
888.609	195.39
888.986	103.16
889.363	205.1
889.74	166.26
890.116	144.42
890.493	161.41
890.869	163.84
891.246	129.86
891.622	212.38
891.998	180.83
892.375	197.82
892.751	180.83
893.127	156.56
893.503	183.26
893.879	100.73
894.255	161.41
894.631	188.11
895.007	112.87
895.383	188.11
895.759	171.12
896.134	100.73
896.51	178.4
896.886	166.26
897.261	141.99
897.637	202.67
898.012	117.72
898.388	166.26
898.763	110.44
899.138	144.42
899.514	192.96
899.889	200.25
900.264	141.99
900.639	222.09
901.014	134.71
901.389	149.27
901.764	190.54
902.139	197.82
902.513	141.99
902.888	141.99
903.263	115.29
903.638	190.54
904.012	195.39
904.387	183.26
904.761	134.71
905.136	173.55
905.51	122.57
905.884	195.39
906.259	127.43
906.633	129.86
907.007	171.12
907.381	137.14
907.755	178.4
908.129	197.82
908.503	122.57
908.877	93.45
909.251	100.73
909.624	127.43
909.998	103.16
910.372	110.44
910.745	81.31
911.119	81.31
911.492	110.44
911.866	154.13
912.239	149.27
912.612	154.13
912.986	132.28
913.359	141.99
913.732	139.57
914.105	141.99
914.478	209.95
914.851	129.86
915.224	125
915.597	69.18
915.97	108.01
916.343	207.53
916.715	149.27
917.088	166.26
917.461	146.85
917.833	185.68
918.206	185.68
918.578	200.25
918.951	185.68
919.323	192.96
919.695	156.56
920.067	168.69
920.44	137.14
920.812	115.29
921.184	156.56
921.556	226.95
921.928	91.02
922.3	149.27
922.672	144.42
923.043	180.83
923.415	202.67
923.787	166.26
924.158	175.97
924.53	173.55
924.901	205.1
925.273	93.45
925.644	125
926.016	146.85
926.387	144.42
926.758	158.98
927.129	120.15
927.5	103.16
927.872	171.12
928.243	141.99
928.613	151.7
928.984	112.87
929.355	141.99
929.726	125
930.097	200.25
930.467	188.11
930.838	168.69
931.209	188.11
931.579	57.04
931.95	129.86
932.32	127.43
932.69	156.56
933.061	120.15
933.431	108.01
933.801	139.57
934.171	112.87
934.541	132.28
934.911	178.4
935.281	146.85
935.651	132.28
936.021	154.13
936.391	180.83
936.761	103.16
937.13	132.28
937.5	112.87
937.87	117.72
938.239	168.69
938.609	197.82
938.978	202.67
939.347	158.98
939.717	137.14
940.086	173.55
940.455	163.84
940.824	146.85
941.193	173.55
941.562	122.57
941.931	125
942.3	231.8
942.669	141.99
943.038	125
943.407	134.71
943.775	137.14
944.144	180.83
944.513	144.42
944.881	137.14
945.25	154.13
945.618	120.15
945.986	141.99
946.355	190.54
946.723	171.12
947.091	212.38
947.459	188.11
947.827	137.14
948.195	154.13
948.563	190.54
948.931	134.71
949.299	173.55
949.667	112.87
950.035	149.27
950.402	151.7
950.77	112.87
951.138	205.1
951.505	197.82
951.873	127.43
952.24	168.69
952.607	137.14
952.975	168.69
953.342	168.69
953.709	149.27
954.076	151.7
954.443	110.44
954.81	209.95
955.177	132.28
955.544	134.71
955.911	200.25
956.278	188.11
956.645	154.13
957.012	129.86
957.378	219.66
957.745	127.43
958.111	139.57
958.478	171.12
958.844	175.97
959.211	141.99
959.577	161.41
959.943	125
960.309	141.99
960.675	166.26
961.042	108.01
961.408	180.83
961.774	231.8
962.139	132.28
962.505	141.99
962.871	120.15
963.237	103.16
963.603	180.83
963.968	166.26
964.334	125
964.699	163.84
965.065	178.4
965.43	134.71
965.796	139.57
966.161	226.95
966.526	190.54
966.891	180.83
967.256	78.88
967.622	134.71
967.987	151.7
968.352	146.85
968.716	129.86
969.081	156.56
969.446	151.7
969.811	163.84
970.176	127.43
970.54	129.86
970.905	129.86
971.269	132.28
971.634	137.14
971.998	197.82
972.363	132.28
972.727	100.73
973.091	139.57
973.455	103.16
973.819	132.28
974.183	154.13
974.547	149.27
974.911	161.41
975.275	168.69
975.639	192.96
976.003	125
976.367	108.01
976.73	129.86
977.094	86.17
977.458	183.26
977.821	146.85
978.185	120.15
978.548	141.99
978.911	110.44
979.275	134.71
979.638	185.68
980.001	137.14
980.364	69.18
980.727	175.97
981.09	188.11
981.453	173.55
981.816	173.55
982.179	168.69
982.542	125
982.905	95.88
983.267	190.54
983.63	190.54
983.992	212.38
984.355	117.72
984.717	190.54
985.08	217.24
985.442	120.15
985.804	139.57
986.167	151.7
986.529	139.57
986.891	202.67
987.253	207.53
987.615	188.11
987.977	168.69
988.339	154.13
988.701	214.81
989.062	137.14
989.424	115.29
989.786	149.27
990.147	185.68
990.509	163.84
990.87	144.42
991.232	171.12
991.593	222.09
991.955	141.99
992.316	161.41
992.677	158.98
993.038	134.71
993.399	183.26
993.76	161.41
994.121	156.56
994.482	122.57
994.843	166.26
995.204	139.57
995.565	134.71
995.926	178.4
996.286	127.43
996.647	166.26
997.007	139.57
997.368	149.27
997.728	122.57
998.089	146.85
998.449	144.42
998.809	158.98
999.169	190.54
999.53	200.25
999.89	122.57
1000.25	144.42
1000.61	149.27
1000.97	139.57
1001.329	146.85
1001.689	149.27
1002.049	183.26
1002.409	214.81
1002.768	129.86
1003.128	161.41
1003.487	144.42
1003.847	171.12
1004.206	88.59
1004.566	132.28
1004.925	117.72
1005.284	134.71
1005.643	151.7
1006.003	163.84
1006.362	214.81
1006.721	100.73
1007.08	115.29
1007.438	144.42
1007.797	229.37
1008.156	120.15
1008.515	158.98
1008.874	95.88
1009.232	91.02
1009.591	161.41
1009.949	137.14
1010.308	197.82
1010.666	141.99
1011.024	149.27
1011.383	139.57
1011.741	98.3
1012.099	188.11
1012.457	98.3
1012.815	64.32
1013.173	158.98
1013.531	127.43
1013.889	166.26
1014.247	146.85
1014.605	141.99
1014.962	180.83
1015.32	105.58
1015.678	105.58
1016.035	141.99
1016.393	175.97
1016.75	110.44
1017.107	115.29
1017.465	83.74
1017.822	158.98
1018.179	171.12
1018.536	115.29
1018.894	158.98
1019.251	185.68
1019.608	137.14
1019.964	180.83
1020.321	132.28
1020.678	139.57
1021.035	168.69
1021.392	156.56
1021.748	117.72
1022.105	151.7
1022.461	98.3
1022.818	129.86
1023.174	105.58
1023.531	163.84
1023.887	129.86
1024.243	166.26
1024.599	110.44
1024.955	93.45
1025.311	205.1
1025.667	127.43
1026.023	154.13
1026.379	163.84
1026.735	200.25
1027.091	120.15
1027.447	154.13
