189.514	154.58
189.973	154.58
190.431	154.58
190.889	18.66
191.348	6.52
191.806	13.8
192.264	-51.73
192.722	57.49
193.18	-32.31
193.638	-22.6
194.096	-8.04
194.554	-56.58
195.012	-17.75
195.47	21.09
195.928	-12.89
196.385	38.08
196.843	38.08
197.301	40.5
197.758	1.67
198.216	4.1
198.674	21.09
199.131	-20.18
199.589	125.46
200.046	18.66
200.503	93.9
200.961	35.65
201.418	62.35
201.875	132.74
202.332	132.74
202.79	64.78
203.247	164.29
203.704	188.56
204.161	178.86
204.618	198.27
205.075	118.18
205.532	115.75
205.989	176.43
206.445	118.18
206.902	215.26
207.359	176.43
207.816	195.85
208.272	127.88
208.729	152.16
209.185	244.39
209.642	135.17
210.098	183.71
210.555	132.74
211.011	178.86
211.467	183.71
211.924	154.58
212.38	186.14
212.836	232.25
213.292	120.6
213.748	115.75
214.204	135.17
214.66	198.27
215.116	135.17
215.572	127.88
216.028	207.98
216.484	154.58
216.94	224.97
217.396	142.45
217.851	118.18
218.307	144.87
218.763	198.27
219.218	130.31
219.674	188.56
220.129	130.31
220.585	69.63
221.04	161.87
221.496	166.72
221.951	198.27
222.406	188.56
222.861	132.74
223.317	205.56
223.772	166.72
224.227	159.44
224.682	157.01
225.137	98.76
225.592	193.42
226.047	98.76
226.502	135.17
226.957	181.28
227.411	203.13
227.866	140.02
228.321	178.86
228.776	147.3
229.23	154.58
229.685	183.71
230.139	234.68
230.594	137.59
231.048	227.4
231.503	222.55
231.957	123.03
232.411	91.48
232.865	154.58
233.32	159.44
233.774	244.39
234.228	157.01
234.682	203.13
235.136	161.87
235.59	106.04
236.044	149.73
236.498	171.57
236.952	203.13
237.406	159.44
237.86	174
238.313	159.44
238.767	144.87
239.221	101.18
239.674	169.15
240.128	140.02
240.581	227.4
241.035	164.29
241.488	159.44
241.942	64.78
242.395	183.71
242.848	159.44
243.301	193.42
243.755	174
244.208	181.28
244.661	154.58
245.114	205.56
245.567	203.13
246.02	120.6
246.473	159.44
246.926	157.01
247.379	98.76
247.832	198.27
248.284	144.87
248.737	210.41
249.19	135.17
249.642	125.46
250.095	169.15
250.547	190.99
251	142.45
251.452	123.03
251.905	176.43
252.357	174
252.81	186.14
253.262	195.85
253.714	166.72
254.166	174
254.618	210.41
255.07	130.31
255.523	113.32
255.975	176.43
256.427	174
256.878	205.56
257.33	181.28
257.782	190.99
258.234	142.45
258.686	220.12
259.137	140.02
259.589	256.53
260.041	193.42
260.492	127.88
260.944	224.97
261.395	115.75
261.847	193.42
262.298	120.6
262.749	203.13
263.201	135.17
263.652	207.98
264.103	183.71
264.554	144.87
265.005	144.87
265.457	193.42
265.908	195.85
266.359	120.6
266.809	161.87
267.26	188.56
267.711	171.57
268.162	268.66
268.613	195.85
269.064	195.85
269.514	149.73
269.965	159.44
270.415	198.27
270.866	207.98
271.316	157.01
271.767	171.57
272.217	186.14
272.668	266.24
273.118	232.25
273.568	174
274.019	154.58
274.469	176.43
274.919	113.32
275.369	176.43
275.819	106.04
276.269	210.41
276.719	186.14
277.169	147.3
277.619	166.72
278.069	154.58
278.518	161.87
278.968	166.72
279.418	166.72
279.867	130.31
280.317	176.43
280.767	210.41
281.216	251.67
281.666	93.9
282.115	154.58
282.564	161.87
283.014	108.47
283.463	241.96
283.912	205.56
284.361	154.58
284.811	164.29
285.26	171.57
285.709	108.47
286.158	224.97
286.607	181.28
287.056	137.59
287.505	161.87
287.953	154.58
288.402	137.59
288.851	132.74
289.3	186.14
289.748	220.12
290.197	205.56
290.646	169.15
291.094	118.18
291.543	222.55
291.991	118.18
292.439	144.87
292.888	200.7
293.336	229.83
293.784	110.89
294.233	86.62
294.681	132.74
295.129	127.88
295.577	152.16
296.025	142.45
296.473	171.57
296.921	195.85
297.369	120.6
297.817	106.04
298.264	152.16
298.712	169.15
299.16	152.16
299.608	181.28
300.055	79.34
300.503	123.03
300.95	215.26
301.398	157.01
301.845	178.86
302.293	120.6
302.74	161.87
303.187	183.71
303.635	120.6
304.082	176.43
304.529	195.85
304.976	178.86
305.423	164.29
305.87	203.13
306.317	59.92
306.764	140.02
307.211	207.98
307.658	123.03
308.105	171.57
308.552	198.27
308.998	142.45
309.445	205.56
309.892	178.86
310.338	217.69
310.785	130.31
311.231	154.58
311.678	152.16
312.124	176.43
312.571	200.7
313.017	127.88
313.463	142.45
313.909	200.7
314.356	164.29
314.802	198.27
315.248	164.29
315.694	93.9
316.14	198.27
316.586	220.12
317.032	198.27
317.478	181.28
317.923	222.55
318.369	135.17
318.815	101.18
319.261	181.28
319.706	64.78
320.152	159.44
320.597	135.17
321.043	149.73
321.488	91.48
321.934	132.74
322.379	140.02
322.824	188.56
323.27	178.86
323.715	120.6
324.16	96.33
324.605	135.17
325.05	241.96
325.495	174
325.94	123.03
326.385	130.31
326.83	178.86
327.275	149.73
327.72	183.71
328.165	152.16
328.61	190.99
329.054	120.6
329.499	164.29
329.943	171.57
330.388	169.15
330.832	207.98
331.277	237.11
331.721	161.87
332.166	186.14
332.61	91.48
333.054	161.87
333.499	144.87
333.943	186.14
334.387	207.98
334.831	171.57
335.275	181.28
335.719	161.87
336.163	147.3
336.607	123.03
337.051	171.57
337.495	140.02
337.938	140.02
338.382	74.49
338.826	178.86
339.269	227.4
339.713	161.87
340.157	120.6
340.6	195.85
341.044	181.28
341.487	205.56
341.93	203.13
342.374	101.18
342.817	181.28
343.26	67.2
343.703	149.73
344.146	103.61
344.59	190.99
345.033	154.58
345.476	169.15
345.919	132.74
346.361	149.73
346.804	215.26
347.247	195.85
347.69	149.73
348.133	193.42
348.575	118.18
349.018	176.43
349.461	198.27
349.903	188.56
350.346	115.75
350.788	217.69
351.23	106.04
351.673	169.15
352.115	98.76
352.557	140.02
353	188.56
353.442	195.85
353.884	215.26
354.326	166.72
354.768	178.86
355.21	217.69
355.652	135.17
356.094	166.72
356.536	108.47
356.978	140.02
357.419	144.87
357.861	198.27
358.303	181.28
358.744	157.01
359.186	144.87
359.627	181.28
360.069	157.01
360.51	178.86
360.952	181.28
361.393	74.49
361.834	200.7
362.276	183.71
362.717	205.56
363.158	127.88
363.599	161.87
364.04	140.02
364.481	147.3
364.922	135.17
365.363	130.31
365.804	210.41
366.245	137.59
366.686	113.32
367.126	140.02
367.567	120.6
368.008	161.87
368.448	176.43
368.889	181.28
369.33	115.75
369.77	193.42
370.21	137.59
370.651	127.88
371.091	200.7
371.531	144.87
371.972	174
372.412	181.28
372.852	232.25
373.292	159.44
373.732	149.73
374.172	232.25
374.612	164.29
375.052	241.96
375.492	154.58
375.932	127.88
376.372	195.85
376.811	171.57
377.251	203.13
377.691	166.72
378.13	207.98
378.57	181.28
379.009	171.57
379.449	154.58
379.888	144.87
380.328	164.29
380.767	159.44
381.206	142.45
381.645	127.88
382.085	147.3
382.524	157.01
382.963	125.46
383.402	200.7
383.841	200.7
384.28	152.16
384.719	135.17
385.158	166.72
385.596	115.75
386.035	120.6
386.474	96.33
386.913	224.97
387.351	176.43
387.79	178.86
388.228	171.57
388.667	186.14
389.105	174
389.544	181.28
389.982	222.55
390.42	159.44
390.859	118.18
391.297	234.68
391.735	171.57
392.173	127.88
392.611	251.67
393.049	171.57
393.487	125.46
393.925	106.04
394.363	207.98
394.801	222.55
395.239	123.03
395.676	212.84
396.114	154.58
396.552	164.29
396.989	149.73
397.427	171.57
397.864	130.31
398.302	149.73
398.739	193.42
399.177	152.16
399.614	74.49
400.051	251.67
400.488	171.57
400.926	132.74
401.363	135.17
401.8	147.3
402.237	195.85
402.674	205.56
403.111	183.71
403.548	120.6
403.985	183.71
404.421	222.55
404.858	137.59
405.295	132.74
405.732	159.44
406.168	142.45
406.605	207.98
407.041	147.3
407.478	217.69
407.914	130.31
408.351	149.73
408.787	166.72
409.223	200.7
409.66	212.84
410.096	198.27
410.532	169.15
410.968	190.99
411.404	154.58
411.84	186.14
412.276	125.46
412.712	142.45
413.148	166.72
413.584	195.85
414.02	217.69
414.455	203.13
414.891	190.99
415.327	198.27
415.762	164.29
416.198	108.47
416.633	135.17
417.069	152.16
417.504	193.42
417.94	125.46
418.375	132.74
418.81	152.16
419.245	144.87
419.681	161.87
420.116	152.16
420.551	161.87
420.986	161.87
421.421	181.28
421.856	154.58
422.291	178.86
422.726	147.3
423.16	154.58
423.595	130.31
424.03	176.43
424.464	142.45
424.899	190.99
425.334	149.73
425.768	174
426.203	195.85
426.637	222.55
427.071	154.58
427.506	55.07
427.94	222.55
428.374	103.61
428.809	142.45
429.243	161.87
429.677	190.99
430.111	195.85
430.545	157.01
430.979	169.15
431.413	159.44
431.847	188.56
432.28	183.71
432.714	161.87
433.148	161.87
433.582	101.18
434.015	74.49
434.449	137.59
434.882	178.86
435.316	188.56
435.749	140.02
436.183	154.58
436.616	183.71
437.049	195.85
437.483	178.86
437.916	234.68
438.349	195.85
438.782	222.55
439.215	127.88
439.648	159.44
440.081	193.42
440.514	140.02
440.947	224.97
441.38	130.31
441.813	171.57
442.245	152.16
442.678	193.42
443.111	164.29
443.543	224.97
443.976	178.86
444.408	200.7
444.841	149.73
445.273	157.01
445.705	149.73
446.138	149.73
446.57	166.72
447.002	181.28
447.434	166.72
447.867	193.42
448.299	188.56
448.731	159.44
449.163	118.18
449.595	178.86
450.026	174
450.458	142.45
450.89	200.7
451.322	169.15
451.754	164.29
452.185	224.97
452.617	195.85
453.048	130.31
453.48	157.01
453.911	183.71
454.343	120.6
454.774	110.89
455.205	137.59
455.637	193.42
456.068	157.01
456.499	220.12
456.93	205.56
457.361	171.57
457.792	188.56
458.223	149.73
458.654	190.99
459.085	212.84
459.516	232.25
459.947	144.87
460.378	266.24
460.808	207.98
461.239	190.99
461.669	110.89
462.1	171.57
462.531	159.44
462.961	190.99
463.391	125.46
463.822	120.6
464.252	137.59
464.682	149.73
465.113	227.4
465.543	178.86
465.973	127.88
466.403	169.15
466.833	193.42
467.263	157.01
467.693	188.56
468.123	171.57
468.553	176.43
468.983	174
469.412	186.14
469.842	195.85
470.272	227.4
470.701	152.16
471.131	74.49
471.56	161.87
471.99	140.02
472.419	178.86
472.849	91.48
473.278	110.89
473.707	237.11
474.136	159.44
474.566	227.4
474.995	137.59
475.424	210.41
475.853	237.11
476.282	190.99
476.711	210.41
477.14	198.27
477.569	147.3
477.997	159.44
478.426	171.57
478.855	127.88
479.283	149.73
479.712	157.01
480.141	190.99
480.569	237.11
480.998	169.15
481.426	142.45
481.854	195.85
482.283	200.7
482.711	127.88
483.139	229.83
483.567	222.55
483.995	234.68
484.424	154.58
484.852	132.74
485.28	193.42
485.708	181.28
486.135	195.85
486.563	140.02
486.991	217.69
487.419	91.48
487.847	186.14
488.274	127.88
488.702	186.14
489.129	93.9
489.557	159.44
489.984	220.12
490.412	161.87
490.839	169.15
491.266	152.16
491.694	140.02
492.121	130.31
492.548	157.01
492.975	181.28
493.402	181.28
493.829	195.85
494.256	203.13
494.683	123.03
495.11	159.44
495.537	154.58
495.964	96.33
496.39	123.03
496.817	174
497.244	171.57
497.67	135.17
498.097	137.59
498.523	132.74
498.95	59.92
499.376	181.28
499.803	127.88
500.229	217.69
500.655	190.99
501.081	125.46
501.508	178.86
501.934	152.16
502.36	132.74
502.786	137.59
503.212	147.3
503.638	123.03
504.064	195.85
504.489	193.42
504.915	193.42
505.341	220.12
505.767	154.58
506.192	166.72
506.618	203.13
507.043	142.45
507.469	161.87
507.894	178.86
508.32	130.31
508.745	164.29
509.17	123.03
509.596	178.86
510.021	178.86
510.446	171.57
510.871	220.12
511.296	198.27
511.721	147.3
512.146	174
512.571	190.99
512.996	137.59
513.421	169.15
513.845	200.7
514.27	174
514.695	144.87
515.119	224.97
515.544	147.3
515.969	91.48
516.393	152.16
516.817	161.87
517.242	212.84
517.666	210.41
518.09	215.26
518.515	195.85
518.939	86.62
519.363	358.47
519.787	159.44
520.211	205.56
520.635	149.73
521.059	123.03
521.483	183.71
521.907	120.6
522.331	113.32
522.754	157.01
523.178	157.01
523.602	171.57
524.025	127.88
524.449	174
524.872	205.56
525.296	142.45
525.719	193.42
526.143	193.42
526.566	161.87
526.989	198.27
527.412	220.12
527.836	174
528.259	164.29
528.682	137.59
529.105	188.56
529.528	152.16
529.951	149.73
530.374	157.01
530.796	174
531.219	188.56
531.642	130.31
532.065	171.57
532.487	144.87
532.91	181.28
533.332	91.48
533.755	195.85
534.177	147.3
534.6	210.41
535.022	164.29
535.444	176.43
535.867	181.28
536.289	220.12
536.711	135.17
537.133	203.13
537.555	210.41
537.977	171.57
538.399	125.46
538.821	137.59
539.243	159.44
539.665	220.12
540.086	142.45
540.508	178.86
540.93	161.87
541.351	169.15
541.773	237.11
542.195	217.69
542.616	198.27
543.037	176.43
543.459	171.57
543.88	178.86
544.301	157.01
544.723	251.67
545.144	181.28
545.565	181.28
545.986	217.69
546.407	200.7
546.828	125.46
547.249	181.28
547.67	103.61
548.091	72.06
548.512	178.86
548.932	166.72
549.353	190.99
549.774	110.89
550.194	200.7
550.615	193.42
551.035	149.73
551.456	130.31
551.876	127.88
552.296	125.46
552.717	169.15
553.137	161.87
553.557	154.58
553.977	217.69
554.397	161.87
554.817	125.46
555.237	176.43
555.657	174
556.077	91.48
556.497	127.88
556.917	120.6
557.337	137.59
557.756	183.71
558.176	120.6
558.596	178.86
559.015	195.85
559.435	181.28
559.854	101.18
560.274	161.87
560.693	125.46
561.112	135.17
561.532	215.26
561.951	178.86
562.37	246.82
562.789	215.26
563.208	159.44
563.627	132.74
564.046	205.56
564.465	203.13
564.884	144.87
565.303	125.46
565.722	154.58
566.14	193.42
566.559	181.28
566.978	144.87
567.396	169.15
567.815	222.55
568.233	212.84
568.652	164.29
569.07	176.43
569.489	164.29
569.907	125.46
570.325	166.72
570.743	84.19
571.161	176.43
571.58	137.59
571.998	174
572.416	159.44
572.833	135.17
573.251	166.72
573.669	140.02
574.087	154.58
574.505	154.58
574.922	147.3
575.34	120.6
575.758	130.31
576.175	147.3
576.593	161.87
577.01	190.99
577.428	123.03
577.845	1870.63
578.262	285.65
578.68	127.88
579.097	98.76
579.514	93.9
579.931	183.71
580.348	159.44
580.765	227.4
581.182	152.16
581.599	159.44
582.016	203.13
582.433	149.73
582.849	188.56
583.266	205.56
583.683	159.44
584.099	137.59
584.516	239.54
584.933	176.43
585.349	241.96
585.765	149.73
586.182	113.32
586.598	120.6
587.014	93.9
587.431	190.99
587.847	98.76
588.263	183.71
588.679	74.49
589.095	157.01
589.511	154.58
589.927	142.45
590.343	147.3
590.759	203.13
591.174	142.45
591.59	142.45
592.006	193.42
592.421	106.04
592.837	132.74
593.252	142.45
593.668	123.03
594.083	207.98
594.499	169.15
594.914	157.01
595.329	181.28
595.745	186.14
596.16	186.14
596.575	161.87
596.99	217.69
597.405	190.99
597.82	120.6
598.235	193.42
598.65	132.74
599.065	203.13
599.479	200.7
599.894	164.29
600.309	147.3
600.724	178.86
601.138	188.56
601.553	190.99
601.967	266.24
602.382	222.55
602.796	149.73
603.21	123.03
603.625	154.58
604.039	132.74
604.453	205.56
604.867	181.28
605.281	215.26
605.695	198.27
606.109	142.45
606.523	132.74
606.937	246.82
607.351	387.6
607.765	132.74
608.178	110.89
608.592	174
609.006	200.7
609.419	166.72
609.833	178.86
610.246	171.57
610.66	130.31
611.073	164.29
611.487	152.16
611.9	212.84
612.313	140.02
612.726	193.42
613.139	127.88
613.553	169.15
613.966	181.28
614.379	140.02
614.792	190.99
615.204	195.85
615.617	222.55
616.03	283.23
616.443	123.03
616.856	161.87
617.268	183.71
617.681	106.04
618.093	110.89
618.506	137.59
618.918	244.39
619.331	188.56
619.743	123.03
620.155	103.61
620.568	142.45
620.98	159.44
621.392	154.58
621.804	198.27
622.216	101.18
622.628	210.41
623.04	190.99
623.452	169.15
623.864	217.69
624.276	178.86
624.687	210.41
625.099	212.84
625.511	164.29
625.922	203.13
626.334	147.3
626.745	188.56
627.157	207.98
627.568	149.73
627.979	166.72
628.391	176.43
628.802	234.68
629.213	113.32
629.624	152.16
630.035	127.88
630.446	166.72
630.857	101.18
631.268	120.6
631.679	174
632.09	193.42
632.501	154.58
632.912	224.97
633.322	258.95
633.733	115.75
634.144	205.56
634.554	190.99
634.965	144.87
635.375	234.68
635.785	152.16
636.196	183.71
636.606	178.86
637.016	154.58
637.427	183.71
637.837	193.42
638.247	130.31
638.657	161.87
639.067	159.44
639.477	120.6
639.887	176.43
640.297	127.88
640.706	142.45
641.116	174
641.526	140.02
641.935	229.83
642.345	166.72
642.755	200.7
643.164	169.15
643.573	178.86
643.983	210.41
644.392	212.84
644.801	198.27
645.211	176.43
645.62	108.47
646.029	115.75
646.438	166.72
646.847	161.87
647.256	132.74
647.665	183.71
648.074	171.57
648.483	140.02
648.892	106.04
649.3	144.87
649.709	152.16
650.118	176.43
650.526	200.7
650.935	132.74
651.343	169.15
651.752	108.47
652.16	198.27
652.568	149.73
652.977	152.16
653.385	186.14
653.793	171.57
654.201	237.11
654.609	159.44
655.017	76.91
655.425	159.44
655.833	159.44
656.241	106.04
656.649	118.18
657.057	149.73
657.464	188.56
657.872	178.86
658.28	118.18
658.687	181.28
659.095	137.59
659.502	171.57
659.91	181.28
660.317	205.56
660.724	157.01
661.132	115.75
661.539	157.01
661.946	96.33
662.353	103.61
662.76	178.86
663.167	135.17
663.574	164.29
663.981	135.17
664.388	130.31
664.795	159.44
665.202	200.7
665.608	152.16
666.015	161.87
666.422	227.4
666.828	237.11
667.235	174
667.641	79.34
668.047	137.59
668.454	190.99
668.86	96.33
669.266	98.76
669.673	203.13
670.079	193.42
670.485	212.84
670.891	174
671.297	132.74
671.703	149.73
672.109	115.75
672.515	161.87
672.92	183.71
673.326	144.87
673.732	157.01
674.138	181.28
674.543	154.58
674.949	166.72
675.354	103.61
675.76	178.86
676.165	229.83
676.57	195.85
676.976	140.02
677.381	98.76
677.786	188.56
678.191	198.27
678.596	220.12
679.001	140.02
679.406	203.13
679.811	198.27
680.216	188.56
680.621	241.96
681.026	190.99
681.43	171.57
681.835	188.56
682.24	171.57
682.644	181.28
683.049	147.3
683.453	190.99
683.858	217.69
684.262	113.32
684.667	169.15
685.071	186.14
685.475	159.44
685.879	157.01
686.283	288.08
686.687	186.14
687.091	101.18
687.495	157.01
687.899	120.6
688.303	169.15
688.707	174
689.111	205.56
689.514	190.99
689.918	166.72
690.322	186.14
690.725	205.56
691.129	154.58
691.532	140.02
691.936	174
692.339	244.39
692.742	241.96
693.146	200.7
693.549	212.84
693.952	220.12
694.355	220.12
694.758	135.17
695.161	195.85
695.564	140.02
695.967	132.74
696.37	130.31
696.773	123.03
697.175	195.85
697.578	157.01
697.981	174
698.383	181.28
698.786	183.71
699.188	132.74
699.591	147.3
699.993	203.13
700.395	181.28
700.798	181.28
701.2	174
701.602	166.72
702.004	188.56
702.406	161.87
702.808	181.28
703.21	183.71
703.612	222.55
704.014	237.11
704.416	200.7
704.818	246.82
705.219	237.11
705.621	229.83
706.023	198.27
706.424	207.98
706.826	193.42
707.227	232.25
707.629	244.39
708.03	251.67
708.431	210.41
708.832	249.25
709.234	166.72
709.635	239.54
710.036	305.07
710.437	212.84
710.838	200.7
711.239	283.23
711.64	261.38
712.041	224.97
712.441	263.81
712.842	190.99
713.243	207.98
713.643	237.11
714.044	220.12
714.445	220.12
714.845	302.64
715.246	278.37
715.646	207.98
716.046	336.63
716.447	207.98
716.847	297.79
717.247	331.77
717.647	275.94
718.047	314.78
718.447	178.86
718.847	348.76
719.247	343.91
719.647	373.03
720.047	314.78
720.446	278.37
720.846	331.77
721.246	382.74
721.645	319.63
722.045	297.79
722.444	319.63
722.844	341.48
723.243	375.46
723.643	431.29
724.042	385.17
724.441	431.29
724.84	392.45
725.24	387.6
725.639	436.14
726.038	375.46
726.437	377.89
726.836	545.37
727.234	513.81
727.633	436.14
728.032	465.27
728.431	504.1
728.83	508.96
729.228	564.78
729.627	647.31
730.025	632.75
730.424	671.58
730.822	754.11
731.22	788.09
731.619	870.61
732.017	1018.67
732.415	972.56
732.813	1057.51
733.212	1271.11
733.61	1244.41
734.008	1331.79
734.406	1353.63
734.803	1552.66
735.201	1518.68
735.599	1569.65
735.997	1691.02
736.395	1785.68
736.792	1962.86
737.19	1999.27
737.587	2191.02
737.985	2387.63
738.382	2576.95
738.78	2637.63
739.177	2982.3
739.574	3144.92
739.971	3263.86
740.369	3419.2
740.766	3453.18
741.163	3404.63
741.56	3654.64
741.957	3710.46
742.354	3875.52
742.751	4035.71
743.147	4319.7
743.544	4499.31
743.941	4822.13
744.338	5091.55
744.734	5513.89
745.131	5691.08
745.527	6120.7
745.924	6436.23
746.32	6530.9
746.716	6785.75
747.113	6785.75
747.509	7009.06
747.905	7455.67
748.301	7603.73
748.697	8118.3
749.093	8771.22
749.489	9266.38
749.885	10060.08
750.281	10630.47
750.677	11047.96
751.073	11640.2
751.468	11686.32
751.864	11924.18
752.26	11543.11
752.655	12346.52
753.051	12497.01
753.446	13111.1
753.842	13737.32
754.237	14679.08
754.632	15654.82
755.028	16353.86
755.423	16795.62
755.818	16875.72
756.213	16948.53
756.608	16936.4
757.003	16421.83
757.398	16339.3
757.793	16873.29
758.188	17014.07
758.583	18116.03
758.977	18975.26
759.372	20594.22
759.767	21744.73
760.161	22584.54
760.556	23475.33
760.95	23344.26
761.345	23897.67
761.739	24176.8
762.133	24186.51
762.527	25618.57
762.922	27138.01
763.316	29084.65
763.71	30271.56
764.104	31713.33
764.498	32725.48
764.892	32924.51
765.286	32477.9
765.68	31985.18
766.073	31591.97
766.467	31992.46
766.861	33378.4
767.255	35504.65
767.648	37368.75
768.042	39917.34
768.435	41317.85
768.829	41145.51
769.222	41208.62
769.615	40621.23
770.008	38640.62
770.402	38235.27
770.795	39230.43
771.188	40655.21
771.581	41987.76
771.974	42817.87
772.367	43553.32
772.76	44400.42
773.153	42334.85
773.545	40834.83
773.938	40504.73
774.331	39706.17
774.724	40623.66
775.116	43123.7
775.509	46322.78
775.901	49820.4
776.294	51220.91
776.686	52206.36
777.078	51456.35
777.471	50415.07
777.863	50245.17
778.255	51237.9
778.647	51968.5
779.039	53861.73
779.431	54808.35
779.823	55808.36
780.215	57621.5
780.607	56466.14
780.999	56456.43
781.39	55162.72
781.782	55111.75
782.174	55330.2
782.565	57167.61
782.957	58335.1
783.348	60039.01
783.74	60509.89
784.131	59701.63
784.522	58721.03
784.914	56774.4
785.305	56235.55
785.696	55871.47
786.087	56153.03
786.478	56383.61
786.869	56305.94
787.26	56551.09
787.651	55216.12
788.042	54002.51
788.433	51900.53
788.823	50242.74
789.214	49167.48
789.605	48354.36
789.995	49885.94
790.386	49645.64
790.776	49519.43
791.167	48936.9
791.557	48541.26
791.948	48252.42
792.338	48097.08
792.728	49463.6
793.118	50725.76
793.508	52521.9
793.898	53070.46
794.288	53077.74
794.678	51691.79
795.068	51449.07
795.458	50281.58
795.848	49895.65
796.238	50322.84
796.627	50922.36
797.017	51269.46
797.406	51485.48
797.796	52398.11
798.185	51121.4
798.575	50757.31
798.964	49888.37
799.354	49985.46
799.743	51218.48
800.132	52424.81
800.521	52628.7
800.91	52339.86
801.299	51490.33
801.688	50106.82
802.077	48584.95
802.466	48118.92
802.855	49441.76
803.244	48701.46
803.633	50024.29
804.021	48915.05
804.41	47087.35
804.799	44609.16
805.187	43157.68
805.576	42262.03
805.964	41893.1
806.352	40606.67
806.741	41308.14
807.129	41213.47
807.517	40606.67
807.905	39868.79
808.293	39303.25
808.681	39215.87
809.069	39463.45
809.457	41562.99
809.845	41555.71
810.233	42218.34
810.621	41667.37
811.009	40728.03
811.396	40327.54
811.784	40016.85
812.171	39611.51
812.559	40545.99
812.946	40533.85
813.334	39939.18
813.721	38349.35
814.108	37218.27
814.496	35985.24
814.883	35113.87
815.27	36669.71
815.657	36917.29
816.044	38026.53
816.431	36851.76
816.818	36026.5
817.205	34708.52
817.592	34829.88
817.979	34378.42
818.365	34152.69
818.752	33487.63
819.139	32703.63
819.525	31548.28
819.912	30356.51
820.298	29087.07
820.685	28341.92
821.071	27943.85
821.457	27582.19
821.843	27079.76
822.23	26485.09
822.616	24951.09
823.002	22800.57
823.388	21657.35
823.774	21691.33
824.16	21426.76
824.546	21455.89
824.931	21514.14
825.317	20657.33
825.703	19827.22
826.089	18705.84
826.474	18463.12
826.86	18198.55
827.245	18805.36
827.631	18989.83
828.016	18368.46
828.401	17700.97
828.787	17038.34
829.172	16419.4
829.557	16159.69
829.942	15960.65
830.327	15895.12
830.712	15416.96
831.097	14953.36
831.482	14890.25
831.867	13596.54
832.252	13465.47
832.636	13329.55
833.021	13601.39
833.406	13463.04
833.79	13217.89
834.175	12363.51
834.559	12016.42
834.944	11615.93
835.328	11467.87
835.713	11188.74
836.097	11261.55
836.481	10919.31
836.865	10259.11
837.249	9679
837.633	9113.46
838.017	8746.95
838.401	8797.92
838.785	8479.96
839.169	8521.22
839.553	7931.4
839.937	7450.81
840.32	7135.27
840.704	6678.96
841.087	6574.59
841.471	6259.05
841.854	6329.44
842.238	6132.83
842.621	5805.16
843.004	5414.37
843.388	5399.81
843.771	5421.66
844.154	5421.66
844.537	5433.79
844.92	5404.67
845.303	5043.01
845.686	4768.73
846.069	4591.55
846.452	4870.68
846.834	4788.15
847.217	4521.16
847.6	4496.88
847.982	4261.44
848.365	4256.59
848.748	3996.88
849.13	3992.02
849.512	3819.69
849.895	3904.64
850.277	3858.52
850.659	3477.45
851.041	3542.99
851.423	3329.39
851.806	3225.02
852.188	3322.11
852.57	3322.11
852.951	3193.47
853.333	3023.56
853.715	2984.72
854.097	2676.47
854.479	2783.27
854.86	2700.74
855.242	2695.89
855.623	2591.51
856.005	2472.58
856.386	2305.1
856.768	2266.27
857.149	2081.8
857.53	2089.08
857.911	1979.85
858.292	1860.92
858.674	1817.23
859.055	1744.41
859.436	1625.48
859.817	1538.1
860.197	1479.85
860.578	1545.38
860.959	1453.15
861.34	1360.91
861.72	1392.47
862.101	1203.14
862.482	1283.24
862.862	1224.99
863.243	1261.4
863.623	1169.16
864.003	1108.48
864.384	1120.62
864.764	1081.78
865.144	1089.06
865.524	974.98
865.904	955.57
866.284	1081.78
866.664	965.28
867.044	824.5
867.424	953.14
867.804	843.91
868.183	851.2
868.563	873.04
868.943	853.62
869.322	746.83
869.702	732.26
870.081	707.99
870.461	649.74
870.84	724.98
871.22	647.31
871.599	593.91
871.978	608.47
872.357	574.49
872.736	564.78
873.115	508.96
873.494	530.8
873.873	525.95
874.252	516.24
874.631	467.7
875.01	375.46
875.388	394.88
875.767	404.59
876.146	450.7
876.524	474.98
876.903	363.32
877.281	326.92
877.66	341.48
878.038	283.23
878.416	261.38
878.794	329.34
879.173	292.94
879.551	336.63
879.929	224.97
880.307	339.05
880.685	351.19
881.063	273.52
881.441	300.22
881.818	288.08
882.196	254.1
882.574	232.25
882.951	258.95
883.329	256.53
883.707	273.52
884.084	273.52
884.461	195.85
884.839	232.25
885.216	217.69
885.593	241.96
885.971	309.93
886.348	203.13
886.725	195.85
887.102	207.98
887.479	193.42
887.856	283.23
888.233	205.56
888.609	207.98
888.986	193.42
889.363	198.27
889.74	203.13
890.116	212.84
890.493	198.27
890.869	205.56
891.246	222.55
891.622	190.99
891.998	215.26
892.375	176.43
892.751	200.7
893.127	186.14
893.503	203.13
893.879	224.97
894.255	171.57
894.631	110.89
895.007	157.01
895.383	135.17
895.759	203.13
896.134	166.72
896.51	91.48
896.886	200.7
897.261	159.44
897.637	181.28
898.012	193.42
898.388	178.86
898.763	120.6
899.138	135.17
899.514	132.74
899.889	181.28
900.264	183.71
900.639	227.4
901.014	174
901.389	183.71
901.764	188.56
902.139	232.25
902.513	144.87
902.888	166.72
903.263	149.73
903.638	200.7
904.012	125.46
904.387	152.16
904.761	140.02
905.136	205.56
905.51	113.32
905.884	130.31
906.259	91.48
906.633	108.47
907.007	152.16
907.381	159.44
907.755	174
908.129	135.17
908.503	176.43
908.877	178.86
909.251	220.12
909.624	154.58
909.998	149.73
910.372	174
910.745	159.44
911.119	135.17
911.492	164.29
911.866	161.87
912.239	103.61
912.612	157.01
912.986	195.85
913.359	120.6
913.732	152.16
914.105	81.77
914.478	152.16
914.851	181.28
915.224	147.3
915.597	188.56
915.97	181.28
916.343	110.89
916.715	137.59
917.088	154.58
917.461	152.16
917.833	232.25
918.206	181.28
918.578	183.71
918.951	183.71
919.323	149.73
919.695	135.17
920.067	207.98
920.44	195.85
920.812	142.45
921.184	154.58
921.556	193.42
921.928	164.29
922.3	181.28
922.672	166.72
923.043	154.58
923.415	125.46
923.787	186.14
924.158	74.49
924.53	84.19
924.901	190.99
925.273	142.45
925.644	118.18
926.016	108.47
926.387	152.16
926.758	215.26
927.129	212.84
927.5	96.33
927.872	229.83
928.243	210.41
928.613	86.62
928.984	174
929.355	103.61
929.726	118.18
930.097	186.14
930.467	149.73
930.838	207.98
931.209	118.18
931.579	127.88
931.95	103.61
932.32	86.62
932.69	140.02
933.061	135.17
933.431	140.02
933.801	188.56
934.171	154.58
934.541	132.74
934.911	142.45
935.281	106.04
935.651	224.97
936.021	190.99
936.391	106.04
936.761	123.03
937.13	89.05
937.5	154.58
937.87	130.31
938.239	127.88
938.609	161.87
938.978	174
939.347	220.12
939.717	159.44
940.086	166.72
940.455	125.46
940.824	113.32
941.193	159.44
941.562	186.14
941.931	147.3
942.3	210.41
942.669	188.56
943.038	193.42
943.407	220.12
943.775	144.87
944.144	195.85
944.513	125.46
944.881	159.44
945.25	174
945.618	110.89
945.986	125.46
946.355	154.58
946.723	69.63
947.091	171.57
947.459	157.01
947.827	169.15
948.195	205.56
948.563	140.02
948.931	127.88
949.299	81.77
949.667	147.3
950.035	127.88
950.402	159.44
950.77	190.99
951.138	135.17
951.505	195.85
951.873	125.46
952.24	142.45
952.607	176.43
952.975	166.72
953.342	157.01
953.709	106.04
954.076	108.47
954.443	149.73
954.81	186.14
955.177	205.56
955.544	142.45
955.911	115.75
956.278	161.87
956.645	96.33
957.012	108.47
957.378	125.46
957.745	125.46
958.111	115.75
958.478	164.29
958.844	190.99
959.211	193.42
959.577	164.29
959.943	152.16
960.309	181.28
960.675	178.86
961.042	178.86
961.408	144.87
961.774	157.01
962.139	198.27
962.505	127.88
962.871	152.16
963.237	181.28
963.603	118.18
963.968	142.45
964.334	215.26
964.699	171.57
965.065	127.88
965.43	130.31
965.796	183.71
966.161	169.15
966.526	140.02
966.891	81.77
967.256	120.6
967.622	115.75
967.987	198.27
968.352	166.72
968.716	171.57
969.081	135.17
969.446	203.13
969.811	123.03
970.176	147.3
970.54	174
970.905	101.18
971.269	183.71
971.634	178.86
971.998	154.58
972.363	118.18
972.727	186.14
973.091	171.57
973.455	142.45
973.819	186.14
974.183	130.31
974.547	106.04
974.911	152.16
975.275	135.17
975.639	244.39
976.003	110.89
976.367	115.75
976.73	103.61
977.094	120.6
977.458	135.17
977.821	198.27
978.185	93.9
978.548	144.87
978.911	135.17
979.275	193.42
979.638	45.36
980.001	190.99
980.364	154.58
980.727	98.76
981.09	203.13
981.453	200.7
981.816	176.43
982.179	207.98
982.542	171.57
982.905	174
983.267	152.16
983.63	181.28
983.992	108.47
984.355	91.48
984.717	188.56
985.08	118.18
985.442	195.85
985.804	113.32
986.167	222.55
986.529	188.56
986.891	132.74
987.253	123.03
987.615	67.2
987.977	132.74
988.339	115.75
988.701	186.14
989.062	101.18
989.424	84.19
989.786	176.43
990.147	164.29
990.509	118.18
990.87	108.47
991.232	157.01
991.593	144.87
991.955	169.15
992.316	200.7
992.677	101.18
993.038	137.59
993.399	181.28
993.76	195.85
994.121	142.45
994.482	229.83
994.843	193.42
995.204	84.19
995.565	42.93
995.926	237.11
996.286	154.58
996.647	152.16
997.007	123.03
997.368	198.27
997.728	169.15
998.089	161.87
998.449	157.01
998.809	123.03
999.169	130.31
999.53	161.87
999.89	89.05
1000.25	157.01
1000.61	159.44
1000.97	132.74
1001.329	144.87
1001.689	174
1002.049	188.56
1002.409	176.43
1002.768	169.15
1003.128	159.44
1003.487	154.58
1003.847	169.15
1004.206	203.13
1004.566	91.48
1004.925	195.85
1005.284	169.15
1005.643	123.03
1006.003	149.73
1006.362	113.32
1006.721	149.73
1007.08	140.02
1007.438	147.3
1007.797	203.13
1008.156	164.29
1008.515	186.14
1008.874	118.18
1009.232	193.42
1009.591	198.27
1009.949	166.72
1010.308	193.42
1010.666	118.18
1011.024	132.74
1011.383	127.88
1011.741	118.18
1012.099	91.48
1012.457	118.18
1012.815	154.58
1013.173	110.89
1013.531	159.44
1013.889	161.87
1014.247	147.3
1014.605	198.27
1014.962	205.56
1015.32	144.87
1015.678	130.31
1016.035	144.87
1016.393	154.58
1016.75	159.44
1017.107	198.27
1017.465	113.32
1017.822	164.29
1018.179	207.98
1018.536	164.29
1018.894	166.72
1019.251	152.16
1019.608	57.49
1019.964	132.74
1020.321	142.45
1020.678	159.44
1021.035	154.58
1021.392	181.28
1021.748	203.13
1022.105	142.45
1022.461	154.58
1022.818	152.16
1023.174	171.57
1023.531	125.46
1023.887	169.15
1024.243	113.32
1024.599	169.15
1024.955	212.84
1025.311	190.99
1025.667	135.17
1026.023	147.3
1026.379	113.32
1026.735	220.12
1027.091	147.3
1027.447	198.27
