189.514	50.21
189.973	50.21
190.431	50.21
190.889	-8.04
191.348	18.66
191.806	30.8
192.264	8.95
192.722	-42.02
193.18	-15.32
193.638	-63.87
194.096	-29.89
194.554	-0.76
195.012	-34.74
195.47	-0.76
195.928	-20.18
196.385	76.91
196.843	40.5
197.301	6.52
197.758	-8.04
198.216	-15.32
198.674	59.92
199.131	38.08
199.589	64.78
200.046	23.51
200.503	79.34
200.961	59.92
201.418	93.9
201.875	93.9
202.332	140.02
202.79	106.04
203.247	149.73
203.704	125.46
204.161	217.69
204.618	161.87
205.075	120.6
205.532	190.99
205.989	147.3
206.445	130.31
206.902	164.29
207.359	79.34
207.816	200.7
208.272	171.57
208.729	135.17
209.185	174
209.642	149.73
210.098	127.88
210.555	229.83
211.011	171.57
211.467	256.53
211.924	115.75
212.38	181.28
212.836	137.59
213.292	178.86
213.748	183.71
214.204	203.13
214.66	84.19
215.116	220.12
215.572	222.55
216.028	152.16
216.484	159.44
216.94	210.41
217.396	135.17
217.851	159.44
218.307	144.87
218.763	132.74
219.218	135.17
219.674	220.12
220.129	108.47
220.585	149.73
221.04	98.76
221.496	84.19
221.951	147.3
222.406	147.3
222.861	174
223.317	205.56
223.772	200.7
224.227	137.59
224.682	178.86
225.137	67.2
225.592	113.32
226.047	181.28
226.502	157.01
226.957	130.31
227.411	207.98
227.866	147.3
228.321	76.91
228.776	147.3
229.23	72.06
229.685	186.14
230.139	200.7
230.594	154.58
231.048	193.42
231.503	159.44
231.957	108.47
232.411	113.32
232.865	186.14
233.32	169.15
233.774	203.13
234.228	171.57
234.682	118.18
235.136	125.46
235.59	157.01
236.044	132.74
236.498	190.99
236.952	183.71
237.406	166.72
237.86	144.87
238.313	164.29
238.767	203.13
239.221	96.33
239.674	203.13
240.128	193.42
240.581	178.86
241.035	115.75
241.488	113.32
241.942	115.75
242.395	137.59
242.848	152.16
243.301	140.02
243.755	154.58
244.208	171.57
244.661	195.85
245.114	181.28
245.567	64.78
246.02	176.43
246.473	101.18
246.926	142.45
247.379	215.26
247.832	164.29
248.284	164.29
248.737	178.86
249.19	132.74
249.642	103.61
250.095	91.48
250.547	91.48
251	110.89
251.452	144.87
251.905	135.17
252.357	144.87
252.81	198.27
253.262	115.75
253.714	169.15
254.166	166.72
254.618	220.12
255.07	115.75
255.523	132.74
255.975	161.87
256.427	93.9
256.878	224.97
257.33	207.98
257.782	123.03
258.234	234.68
258.686	227.4
259.137	137.59
259.589	93.9
260.041	152.16
260.492	123.03
260.944	164.29
261.395	203.13
261.847	147.3
262.298	140.02
262.749	132.74
263.201	174
263.652	188.56
264.103	79.34
264.554	207.98
265.005	161.87
265.457	135.17
265.908	147.3
266.359	198.27
266.809	154.58
267.26	127.88
267.711	174
268.162	161.87
268.613	190.99
269.064	118.18
269.514	135.17
269.965	174
270.415	42.93
270.866	176.43
271.316	210.41
271.767	118.18
272.217	132.74
272.668	157.01
273.118	222.55
273.568	147.3
274.019	174
274.469	203.13
274.919	144.87
275.369	159.44
275.819	161.87
276.269	157.01
276.719	113.32
277.169	140.02
277.619	166.72
278.069	103.61
278.518	200.7
278.968	176.43
279.418	132.74
279.867	176.43
280.317	174
280.767	159.44
281.216	169.15
281.666	188.56
282.115	120.6
282.564	246.82
283.014	210.41
283.463	183.71
283.912	215.26
284.361	178.86
284.811	81.77
285.26	229.83
285.709	86.62
286.158	220.12
286.607	164.29
287.056	161.87
287.505	157.01
287.953	142.45
288.402	120.6
288.851	232.25
289.3	203.13
289.748	174
290.197	110.89
290.646	166.72
291.094	164.29
291.543	106.04
291.991	193.42
292.439	159.44
292.888	171.57
293.336	147.3
293.784	130.31
294.233	190.99
294.681	183.71
295.129	147.3
295.577	144.87
296.025	147.3
296.473	132.74
296.921	152.16
297.369	115.75
297.817	169.15
298.264	195.85
298.712	106.04
299.16	154.58
299.608	137.59
300.055	157.01
300.503	123.03
300.95	232.25
301.398	176.43
301.845	178.86
302.293	137.59
302.74	224.97
303.187	234.68
303.635	164.29
304.082	57.49
304.529	91.48
304.976	137.59
305.423	181.28
305.87	210.41
306.317	157.01
306.764	261.38
307.211	157.01
307.658	132.74
308.105	152.16
308.552	137.59
308.998	120.6
309.445	176.43
309.892	164.29
310.338	193.42
310.785	118.18
311.231	93.9
311.678	171.57
312.124	181.28
312.571	113.32
313.017	144.87
313.463	171.57
313.909	222.55
314.356	207.98
314.802	203.13
315.248	93.9
315.694	186.14
316.14	169.15
316.586	200.7
317.032	205.56
317.478	164.29
317.923	147.3
318.369	181.28
318.815	147.3
319.261	190.99
319.706	183.71
320.152	178.86
320.597	256.53
321.043	166.72
321.488	181.28
321.934	154.58
322.379	210.41
322.824	123.03
323.27	152.16
323.715	217.69
324.16	161.87
324.605	164.29
325.05	132.74
325.495	188.56
325.94	186.14
326.385	207.98
326.83	159.44
327.275	210.41
327.72	132.74
328.165	147.3
328.61	140.02
329.054	115.75
329.499	183.71
329.943	198.27
330.388	183.71
330.832	125.46
331.277	186.14
331.721	147.3
332.166	171.57
332.61	140.02
333.054	220.12
333.499	224.97
333.943	161.87
334.387	106.04
334.831	188.56
335.275	174
335.719	166.72
336.163	203.13
336.607	144.87
337.051	152.16
337.495	200.7
337.938	164.29
338.382	140.02
338.826	174
339.269	190.99
339.713	166.72
340.157	125.46
340.6	195.85
341.044	239.54
341.487	169.15
341.93	130.31
342.374	181.28
342.817	140.02
343.26	169.15
343.703	127.88
344.146	130.31
344.59	123.03
345.033	176.43
345.476	171.57
345.919	144.87
346.361	171.57
346.804	147.3
347.247	198.27
347.69	101.18
348.133	176.43
348.575	181.28
349.018	144.87
349.461	183.71
349.903	132.74
350.346	166.72
350.788	232.25
351.23	132.74
351.673	188.56
352.115	142.45
352.557	106.04
353	159.44
353.442	222.55
353.884	212.84
354.326	183.71
354.768	210.41
355.21	140.02
355.652	137.59
356.094	237.11
356.536	93.9
356.978	154.58
357.419	176.43
357.861	144.87
358.303	232.25
358.744	135.17
359.186	123.03
359.627	210.41
360.069	164.29
360.51	176.43
360.952	169.15
361.393	174
361.834	203.13
362.276	193.42
362.717	205.56
363.158	140.02
363.599	96.33
364.04	118.18
364.481	176.43
364.922	212.84
365.363	166.72
365.804	222.55
366.245	183.71
366.686	147.3
367.126	227.4
367.567	198.27
368.008	171.57
368.448	186.14
368.889	149.73
369.33	169.15
369.77	207.98
370.21	101.18
370.651	164.29
371.091	207.98
371.531	113.32
371.972	154.58
372.412	164.29
372.852	123.03
373.292	132.74
373.732	193.42
374.172	135.17
374.612	186.14
375.052	176.43
375.492	195.85
375.932	203.13
376.372	135.17
376.811	186.14
377.251	198.27
377.691	103.61
378.13	169.15
378.57	220.12
379.009	161.87
379.449	244.39
379.888	174
380.328	171.57
380.767	118.18
381.206	159.44
381.645	86.62
382.085	120.6
382.524	152.16
382.963	157.01
383.402	130.31
383.841	137.59
384.28	164.29
384.719	193.42
385.158	125.46
385.596	174
386.035	132.74
386.474	198.27
386.913	203.13
387.351	115.75
387.79	181.28
388.228	144.87
388.667	188.56
389.105	244.39
389.544	161.87
389.982	178.86
390.42	130.31
390.859	135.17
391.297	220.12
391.735	188.56
392.173	217.69
392.611	169.15
393.049	125.46
393.487	149.73
393.925	222.55
394.363	261.38
394.801	237.11
395.239	147.3
395.676	193.42
396.114	207.98
396.552	149.73
396.989	157.01
397.427	188.56
397.864	181.28
398.302	193.42
398.739	178.86
399.177	195.85
399.614	186.14
400.051	166.72
400.488	212.84
400.926	181.28
401.363	198.27
401.8	144.87
402.237	118.18
402.674	161.87
403.111	171.57
403.548	69.63
403.985	110.89
404.421	229.83
404.858	144.87
405.295	137.59
405.732	161.87
406.168	176.43
406.605	176.43
407.041	164.29
407.478	147.3
407.914	161.87
408.351	113.32
408.787	140.02
409.223	181.28
409.66	130.31
410.096	241.96
410.532	140.02
410.968	147.3
411.404	188.56
411.84	178.86
412.276	152.16
412.712	159.44
413.148	135.17
413.584	164.29
414.02	132.74
414.455	186.14
414.891	164.29
415.327	130.31
415.762	183.71
416.198	135.17
416.633	154.58
417.069	127.88
417.504	149.73
417.94	174
418.375	193.42
418.81	127.88
419.245	171.57
419.681	198.27
420.116	161.87
420.551	137.59
420.986	110.89
421.421	205.56
421.856	164.29
422.291	115.75
422.726	198.27
423.16	205.56
423.595	120.6
424.03	205.56
424.464	140.02
424.899	106.04
425.334	169.15
425.768	164.29
426.203	79.34
426.637	157.01
427.071	212.84
427.506	106.04
427.94	154.58
428.374	212.84
428.809	149.73
429.243	127.88
429.677	113.32
430.111	125.46
430.545	215.26
430.979	169.15
431.413	220.12
431.847	215.26
432.28	149.73
432.714	108.47
433.148	203.13
433.582	174
434.015	113.32
434.449	152.16
434.882	123.03
435.316	174
435.749	190.99
436.183	193.42
436.616	258.95
437.049	110.89
437.483	157.01
437.916	166.72
438.349	147.3
438.782	215.26
439.215	193.42
439.648	132.74
440.081	183.71
440.514	193.42
440.947	217.69
441.38	123.03
441.813	210.41
442.245	149.73
442.678	161.87
443.111	220.12
443.543	210.41
443.976	183.71
444.408	178.86
444.841	159.44
445.273	171.57
445.705	261.38
446.138	81.77
446.57	123.03
447.002	193.42
447.434	174
447.867	193.42
448.299	207.98
448.731	171.57
449.163	224.97
449.595	251.67
450.026	140.02
450.458	125.46
450.89	183.71
451.322	186.14
451.754	193.42
452.185	205.56
452.617	309.93
453.048	283.23
453.48	222.55
453.911	273.52
454.343	222.55
454.774	229.83
455.205	132.74
455.637	254.1
456.068	256.53
456.499	205.56
456.93	300.22
457.361	266.24
457.792	220.12
458.223	178.86
458.654	263.81
459.085	256.53
459.516	278.37
459.947	334.2
460.378	198.27
460.808	239.54
461.239	207.98
461.669	174
462.1	249.25
462.531	261.38
462.961	246.82
463.391	220.12
463.822	249.25
464.252	188.56
464.682	174
465.113	152.16
465.543	220.12
465.973	210.41
466.403	224.97
466.833	217.69
467.263	222.55
467.693	186.14
468.123	188.56
468.553	227.4
468.983	220.12
469.412	142.45
469.842	244.39
470.272	241.96
470.701	176.43
471.131	135.17
471.56	212.84
471.99	212.84
472.419	164.29
472.849	212.84
473.278	106.04
473.707	174
474.136	278.37
474.566	212.84
474.995	193.42
475.424	178.86
475.853	200.7
476.282	254.1
476.711	227.4
477.14	246.82
477.569	195.85
477.997	261.38
478.426	157.01
478.855	220.12
479.283	147.3
479.712	137.59
480.141	193.42
480.569	161.87
480.998	174
481.426	195.85
481.854	217.69
482.283	161.87
482.711	183.71
483.139	193.42
483.567	280.8
483.995	217.69
484.424	212.84
484.852	93.9
485.28	203.13
485.708	212.84
486.135	251.67
486.563	249.25
486.991	166.72
487.419	190.99
487.847	157.01
488.274	181.28
488.702	275.94
489.129	232.25
489.557	147.3
489.984	220.12
490.412	212.84
490.839	166.72
491.266	118.18
491.694	271.09
492.121	210.41
492.548	188.56
492.975	239.54
493.402	220.12
493.829	161.87
494.256	239.54
494.683	212.84
495.11	159.44
495.537	120.6
495.964	183.71
496.39	110.89
496.817	171.57
497.244	169.15
497.67	198.27
498.097	186.14
498.523	123.03
498.95	205.56
499.376	67.2
499.803	193.42
500.229	166.72
500.655	103.61
501.081	166.72
501.508	183.71
501.934	154.58
502.36	210.41
502.786	86.62
503.212	181.28
503.638	171.57
504.064	227.4
504.489	222.55
504.915	169.15
505.341	193.42
505.767	239.54
506.192	222.55
506.618	178.86
507.043	205.56
507.469	190.99
507.894	215.26
508.32	190.99
508.745	154.58
509.17	154.58
509.596	154.58
510.021	181.28
510.446	195.85
510.871	164.29
511.296	154.58
511.721	210.41
512.146	176.43
512.571	200.7
512.996	176.43
513.421	140.02
513.845	166.72
514.27	224.97
514.695	251.67
515.119	169.15
515.544	149.73
515.969	227.4
516.393	157.01
516.817	176.43
517.242	239.54
517.666	241.96
518.09	181.28
518.515	183.71
518.939	200.7
519.363	407.01
519.787	171.57
520.211	149.73
520.635	251.67
521.059	115.75
521.483	159.44
521.907	186.14
522.331	178.86
522.754	176.43
523.178	176.43
523.602	147.3
524.025	169.15
524.449	159.44
524.872	266.24
525.296	220.12
525.719	203.13
526.143	166.72
526.566	171.57
526.989	123.03
527.412	220.12
527.836	200.7
528.259	183.71
528.682	166.72
529.105	212.84
529.528	176.43
529.951	161.87
530.374	137.59
530.796	188.56
531.219	178.86
531.642	212.84
532.065	188.56
532.487	181.28
532.91	140.02
533.332	195.85
533.755	157.01
534.177	178.86
534.6	176.43
535.022	212.84
535.444	178.86
535.867	188.56
536.289	159.44
536.711	115.75
537.133	249.25
537.555	220.12
537.977	215.26
538.399	159.44
538.821	205.56
539.243	181.28
539.665	171.57
540.086	140.02
540.508	234.68
540.93	200.7
541.351	212.84
541.773	251.67
542.195	205.56
542.616	217.69
543.037	251.67
543.459	210.41
543.88	309.93
544.301	176.43
544.723	190.99
545.144	190.99
545.565	232.25
545.986	176.43
546.407	314.78
546.828	157.01
547.249	186.14
547.67	171.57
548.091	198.27
548.512	178.86
548.932	174
549.353	193.42
549.774	229.83
550.194	217.69
550.615	161.87
551.035	207.98
551.456	144.87
551.876	137.59
552.296	166.72
552.717	188.56
553.137	198.27
553.557	195.85
553.977	171.57
554.397	169.15
554.817	142.45
555.237	224.97
555.657	232.25
556.077	215.26
556.497	144.87
556.917	229.83
557.337	161.87
557.756	164.29
558.176	176.43
558.596	161.87
559.015	113.32
559.435	152.16
559.854	142.45
560.274	224.97
560.693	188.56
561.112	186.14
561.532	108.47
561.951	174
562.37	222.55
562.789	178.86
563.208	222.55
563.627	118.18
564.046	144.87
564.465	186.14
564.884	123.03
565.303	314.78
565.722	137.59
566.14	164.29
566.559	132.74
566.978	261.38
567.396	186.14
567.815	159.44
568.233	227.4
568.652	190.99
569.07	171.57
569.489	89.05
569.907	232.25
570.325	137.59
570.743	159.44
571.161	181.28
571.58	137.59
571.998	132.74
572.416	181.28
572.833	178.86
573.251	67.2
573.669	154.58
574.087	227.4
574.505	164.29
574.922	157.01
575.34	140.02
575.758	188.56
576.175	212.84
576.593	203.13
577.01	222.55
577.428	147.3
577.845	1491.98
578.262	292.94
578.68	200.7
579.097	166.72
579.514	142.45
579.931	263.81
580.348	188.56
580.765	200.7
581.182	164.29
581.599	198.27
582.016	113.32
582.433	176.43
582.849	188.56
583.266	169.15
583.683	178.86
584.099	198.27
584.516	195.85
584.933	152.16
585.349	164.29
585.765	210.41
586.182	164.29
586.598	166.72
587.014	157.01
587.431	229.83
587.847	115.75
588.263	210.41
588.679	190.99
589.095	174
589.511	212.84
589.927	174
590.343	232.25
590.759	164.29
591.174	237.11
591.59	227.4
592.006	215.26
592.421	198.27
592.837	246.82
593.252	190.99
593.668	190.99
594.083	178.86
594.499	229.83
594.914	154.58
595.329	152.16
595.745	140.02
596.16	149.73
596.575	210.41
596.99	169.15
597.405	169.15
597.82	161.87
598.235	183.71
598.65	120.6
599.065	181.28
599.479	164.29
599.894	123.03
600.309	137.59
600.724	241.96
601.138	212.84
601.553	220.12
601.967	169.15
602.382	215.26
602.796	135.17
603.21	142.45
603.625	186.14
604.039	203.13
604.453	186.14
604.867	215.26
605.281	215.26
605.695	193.42
606.109	118.18
606.523	178.86
606.937	188.56
607.351	271.09
607.765	181.28
608.178	142.45
608.592	188.56
609.006	212.84
609.419	135.17
609.833	234.68
610.246	161.87
610.66	174
611.073	205.56
611.487	169.15
611.9	159.44
612.313	239.54
612.726	198.27
613.139	171.57
613.553	198.27
613.966	123.03
614.379	169.15
614.792	217.69
615.204	212.84
615.617	137.59
616.03	254.1
616.443	183.71
616.856	106.04
617.268	205.56
617.681	234.68
618.093	215.26
618.506	203.13
618.918	142.45
619.331	203.13
619.743	123.03
620.155	152.16
620.568	98.76
620.98	188.56
621.392	190.99
621.804	246.82
622.216	190.99
622.628	283.23
623.04	232.25
623.452	193.42
623.864	142.45
624.276	174
624.687	212.84
625.099	222.55
625.511	140.02
625.922	137.59
626.334	178.86
626.745	181.28
627.157	115.75
627.568	188.56
627.979	152.16
628.391	169.15
628.802	241.96
629.213	190.99
629.624	154.58
630.035	215.26
630.446	190.99
630.857	205.56
631.268	140.02
631.679	207.98
632.09	224.97
632.501	135.17
632.912	171.57
633.322	193.42
633.733	227.4
634.144	188.56
634.554	144.87
634.965	220.12
635.375	198.27
635.785	203.13
636.196	258.95
636.606	120.6
637.016	183.71
637.427	171.57
637.837	113.32
638.247	210.41
638.657	227.4
639.067	96.33
639.477	237.11
639.887	98.76
640.297	161.87
640.706	169.15
641.116	178.86
641.526	140.02
641.935	176.43
642.345	203.13
642.755	195.85
643.164	171.57
643.573	193.42
643.983	164.29
644.392	176.43
644.801	159.44
645.211	152.16
645.62	188.56
646.029	164.29
646.438	149.73
646.847	159.44
647.256	142.45
647.665	142.45
648.074	106.04
648.483	169.15
648.892	84.19
649.3	207.98
649.709	123.03
650.118	198.27
650.526	125.46
650.935	144.87
651.343	147.3
651.752	137.59
652.16	125.46
652.568	181.28
652.977	154.58
653.385	195.85
653.793	154.58
654.201	125.46
654.609	103.61
655.017	149.73
655.425	229.83
655.833	118.18
656.241	205.56
656.649	157.01
657.057	127.88
657.464	67.2
657.872	140.02
658.28	164.29
658.687	115.75
659.095	200.7
659.502	161.87
659.91	186.14
660.317	137.59
660.724	164.29
661.132	195.85
661.539	190.99
661.946	171.57
662.353	125.46
662.76	195.85
663.167	171.57
663.574	140.02
663.981	171.57
664.388	186.14
664.795	106.04
665.202	123.03
665.608	147.3
666.015	125.46
666.422	181.28
666.828	140.02
667.235	103.61
667.641	164.29
668.047	186.14
668.454	203.13
668.86	147.3
669.266	210.41
669.673	193.42
670.079	125.46
670.485	152.16
670.891	103.61
671.297	132.74
671.703	186.14
672.109	149.73
672.515	207.98
672.92	135.17
673.326	164.29
673.732	171.57
674.138	149.73
674.543	169.15
674.949	101.18
675.354	142.45
675.76	91.48
676.165	198.27
676.57	120.6
676.976	171.57
677.381	96.33
677.786	188.56
678.191	207.98
678.596	132.74
679.001	169.15
679.406	154.58
679.811	188.56
680.216	157.01
680.621	181.28
681.026	113.32
681.43	166.72
681.835	142.45
682.24	210.41
682.644	137.59
683.049	120.6
683.453	166.72
683.858	203.13
684.262	186.14
684.667	118.18
685.071	200.7
685.475	178.86
685.879	164.29
686.283	110.89
686.687	91.48
687.091	154.58
687.495	195.85
687.899	200.7
688.303	113.32
688.707	193.42
689.111	171.57
689.514	205.56
689.918	193.42
690.322	103.61
690.725	178.86
691.129	244.39
691.532	181.28
691.936	130.31
692.339	205.56
692.742	190.99
693.146	164.29
693.549	234.68
693.952	232.25
694.355	137.59
694.758	152.16
695.161	181.28
695.564	144.87
695.967	159.44
696.37	188.56
696.773	137.59
697.175	152.16
697.578	149.73
697.981	195.85
698.383	149.73
698.786	193.42
699.188	186.14
699.591	154.58
699.993	178.86
700.395	234.68
700.798	198.27
701.2	183.71
701.602	169.15
702.004	249.25
702.406	186.14
702.808	110.89
703.21	217.69
703.612	217.69
704.014	178.86
704.416	210.41
704.818	224.97
705.219	232.25
705.621	190.99
706.023	215.26
706.424	229.83
706.826	200.7
707.227	195.85
707.629	220.12
708.03	178.86
708.431	319.63
708.832	237.11
709.234	280.8
709.635	285.65
710.036	305.07
710.437	200.7
710.838	220.12
711.239	278.37
711.64	254.1
712.041	275.94
712.441	271.09
712.842	275.94
713.243	200.7
713.643	275.94
714.044	215.26
714.445	256.53
714.845	237.11
715.246	288.08
715.646	220.12
716.046	217.69
716.447	273.52
716.847	307.5
717.247	261.38
717.647	309.93
718.047	326.92
718.447	329.34
718.847	329.34
719.247	341.48
719.647	385.17
720.047	373.03
720.446	285.65
720.846	409.44
721.246	380.32
721.645	356.04
722.045	368.18
722.444	445.85
722.844	360.9
723.243	351.19
723.643	317.21
724.042	521.09
724.441	494.39
724.84	407.01
725.24	441
725.639	474.98
726.038	472.55
726.437	460.41
726.836	419.15
727.234	438.57
727.633	535.66
728.032	518.67
728.431	562.36
728.83	632.75
729.228	550.22
729.627	640.03
730.025	632.75
730.424	649.74
730.822	707.99
731.22	758.96
731.619	800.22
732.017	775.95
732.415	977.41
732.813	897.31
733.212	972.56
733.61	1130.33
734.008	1215.28
734.406	1290.52
734.803	1132.75
735.201	1317.22
735.599	1445.87
735.997	1674.02
736.395	1671.6
736.792	1652.18
737.19	1758.98
737.587	1882.77
737.985	2025.97
738.382	2275.98
738.78	2312.38
739.177	2183.74
739.574	2324.52
739.971	2632.78
740.369	2928.9
740.766	3103.66
741.163	2875.5
741.56	2800.26
741.957	3069.68
742.354	3212.88
742.751	3695.9
743.147	3824.54
743.544	3589.1
743.941	3487.16
744.338	3916.78
744.734	4414.36
745.131	4693.49
745.527	5016.31
745.924	4657.08
746.32	4390.09
746.716	4890.09
747.113	5909.53
747.509	6433.81
747.905	6416.82
748.301	5972.64
748.697	5887.68
749.093	6970.22
749.489	7797.91
749.885	8438.69
750.281	8086.75
750.677	7562.47
751.073	7504.21
751.468	8596.46
751.864	10013.96
752.26	10336.78
752.655	9979.98
753.051	9072.2
753.446	9179
753.842	10426.59
754.237	12295.55
754.632	12732.45
755.028	11904.77
755.423	10754.26
755.818	10589.21
756.213	12205.74
756.608	13598.97
757.003	14006.74
757.398	12948.47
757.793	11717.87
758.188	11521.27
758.583	13181.49
758.977	14931.51
759.372	15885.41
759.767	15154.82
760.161	14043.15
760.556	14458.2
760.95	16943.68
761.345	19448.57
761.739	20812.67
762.133	19487.41
762.527	17785.93
762.922	17674.27
763.316	20035.96
763.71	23239.89
764.104	24485.06
764.498	23060.28
764.892	21358.8
765.286	20426.74
765.68	22701.05
766.073	25691.39
766.467	27858.9
766.861	26506.94
767.255	24667.1
767.648	23358.83
768.042	25057.88
768.435	29278.82
768.829	31555.56
769.222	30975.45
769.615	27939
770.008	25446.24
770.402	27036.07
770.795	29693.88
771.188	33533.74
771.581	32900.24
771.974	29225.42
772.367	26118.58
772.76	26303.05
773.153	29215.72
773.545	32917.23
773.938	33659.96
774.331	30256.99
774.724	27235.1
775.116	27635.59
775.509	31922.07
775.901	37422.15
776.294	39497.43
776.686	36900.3
777.078	33693.94
777.471	31674.49
777.863	35213.38
778.255	41075.12
778.647	44788.77
779.039	43575.16
779.431	38594.5
779.823	35412.41
780.215	36164.85
780.607	40579.97
780.999	46519.38
781.39	46041.22
781.782	42407.67
782.174	38189.16
782.565	37298.37
782.957	40924.64
783.348	46424.72
783.74	48696.6
784.131	45752.38
784.522	41999.89
784.914	37798.37
785.305	38931.89
785.696	42660.1
786.087	46463.56
786.478	45164.99
786.869	41062.99
787.26	36434.27
787.651	33698.79
788.042	36162.43
788.433	39414.9
788.823	40725.6
789.214	38611.49
789.605	33419.66
789.995	30606.51
790.386	30793.41
790.776	34647.84
791.167	37186.71
791.557	37810.51
791.948	35473.09
792.338	31334.68
792.728	31242.45
793.118	33647.82
793.508	38043.52
793.898	40558.12
794.288	40235.3
794.678	35567.76
795.068	32310.42
795.458	31596.82
795.848	34553.18
796.238	38092.07
796.627	40045.98
797.017	38310.52
797.406	34303.17
797.796	31757.02
798.185	32533.73
798.575	35880.87
798.964	40065.4
799.354	40990.17
799.743	37929.44
800.132	33562.87
800.521	31951.19
800.91	33031.31
801.299	36337.19
801.688	39934.33
802.077	38795.96
802.466	35965.82
802.855	31307.98
803.244	28846.78
803.633	30516.71
804.021	33133.25
804.41	35247.36
804.799	34286.18
805.187	30470.59
805.576	27363.74
805.964	25589.45
806.352	26271.49
806.741	29206.01
807.129	30929.33
807.517	30608.94
807.905	26817.62
808.293	24281.17
808.681	23839.42
809.069	25924.4
809.457	30358.94
809.845	32099.26
810.233	31443.91
810.621	27451.12
811.009	24854
811.396	24198.65
811.784	26934.13
812.171	29703.59
812.559	31499.73
812.946	29732.71
813.334	26783.64
813.721	23128.24
814.108	21926.77
814.496	23858.84
814.883	26611.31
815.27	28871.05
815.657	27429.28
816.044	25232.64
816.431	22254.44
816.818	21458.31
817.205	23079.7
817.592	25839.45
817.979	27329.76
818.365	26436.55
818.752	23188.92
819.139	19946.15
819.525	18698.56
819.912	19239.83
820.298	21446.18
820.685	22281.14
821.071	22431.63
821.457	19931.59
821.843	17159.7
822.23	15531.04
822.616	15196.08
823.002	16086.87
823.388	17370.87
823.774	17545.63
824.16	15739.78
824.546	14154.8
824.931	12812.55
825.317	12555.26
825.703	13535.86
826.089	15011.61
826.474	15363.56
826.86	14560.15
827.245	12778.57
827.631	11230
828.016	11089.22
828.401	11705.73
828.787	13261.58
829.172	13657.22
829.557	12950.9
829.942	11596.51
830.327	10067.36
830.712	9268.8
831.097	9331.91
831.482	10620.77
831.867	11344.08
832.252	11256.7
832.636	10239.69
833.021	8870.74
833.406	7834.31
833.79	7788.2
834.175	8710.54
834.559	9577.06
834.944	9790.66
835.328	9295.5
835.713	7882.86
836.097	6880.42
836.481	6436.23
836.865	6659.54
837.249	7307.61
837.633	7904.7
838.017	7848.88
838.401	7026.05
838.785	5746.9
839.169	5147.38
839.553	4909.51
839.937	5157.09
840.32	5598.84
840.704	5953.22
841.087	5492.05
841.471	4606.11
841.854	4217.75
842.238	3652.21
842.621	3992.02
843.004	4540.57
843.388	4938.64
843.771	4742.03
844.154	4217.75
844.537	3688.62
844.92	3227.45
845.303	3307.55
845.686	3450.75
846.069	3994.45
846.452	4246.88
846.834	3970.18
847.217	3482.31
847.6	3028.41
847.982	2742
848.365	2703.17
848.748	3229.87
849.13	3460.46
849.512	3533.28
849.895	3275.99
850.277	2785.69
850.659	2382.77
851.041	2161.9
851.423	2462.87
851.806	2720.16
852.188	3096.38
852.57	2911.91
852.951	2601.22
853.333	2492
853.715	1882.77
854.097	1863.35
854.479	2035.68
854.86	2317.24
855.242	2508.99
855.623	2339.08
856.005	2055.1
856.386	1732.28
856.768	1494.41
857.149	1540.53
857.53	1623.05
857.911	1688.59
858.292	1763.83
858.674	1814.8
859.055	1552.66
859.436	1246.83
859.817	1263.82
860.197	1215.28
860.578	1241.98
860.959	1341.5
861.34	1319.65
861.72	1285.67
862.101	1147.32
862.482	974.98
862.862	870.61
863.243	955.57
863.623	1038.09
864.003	1076.93
864.384	1135.18
864.764	1011.39
865.144	984.69
865.524	839.06
865.904	749.25
866.284	882.75
866.664	907.02
867.044	1004.11
867.424	907.02
867.804	899.74
868.183	763.82
868.563	654.59
868.943	652.16
869.322	703.14
869.702	681.29
870.081	771.1
870.461	671.58
870.84	661.87
871.22	581.77
871.599	559.93
871.978	547.79
872.357	533.23
872.736	489.54
873.115	552.65
873.494	528.38
873.873	496.82
874.252	499.25
874.631	477.4
875.01	397.31
875.388	331.77
875.767	433.71
876.146	392.45
876.524	508.96
876.903	394.88
877.281	314.78
877.66	392.45
878.038	261.38
878.416	336.63
878.794	300.22
879.173	370.61
879.551	336.63
879.929	336.63
880.307	312.35
880.685	300.22
881.063	258.95
881.441	244.39
881.818	254.1
882.196	268.66
882.574	232.25
882.951	246.82
883.329	251.67
883.707	266.24
884.084	222.55
884.461	300.22
884.839	220.12
885.216	275.94
885.593	212.84
885.971	246.82
886.348	256.53
886.725	278.37
887.102	234.68
887.479	288.08
887.856	237.11
888.233	205.56
888.609	176.43
888.986	220.12
889.363	234.68
889.74	244.39
890.116	144.87
890.493	220.12
890.869	258.95
891.246	205.56
891.622	174
891.998	152.16
892.375	171.57
892.751	174
893.127	232.25
893.503	234.68
893.879	164.29
894.255	161.87
894.631	220.12
895.007	103.61
895.383	130.31
895.759	227.4
896.134	220.12
896.51	154.58
896.886	79.34
897.261	120.6
897.637	210.41
898.012	115.75
898.388	198.27
898.763	174
899.138	113.32
899.514	144.87
899.889	181.28
900.264	147.3
900.639	205.56
901.014	203.13
901.389	164.29
901.764	45.36
902.139	108.47
902.513	157.01
902.888	137.59
903.263	239.54
903.638	161.87
904.012	205.56
904.387	186.14
904.761	140.02
905.136	120.6
905.51	137.59
905.884	142.45
906.259	176.43
906.633	166.72
907.007	130.31
907.381	166.72
907.755	188.56
908.129	203.13
908.503	227.4
908.877	161.87
909.251	135.17
909.624	188.56
909.998	195.85
910.372	127.88
910.745	212.84
911.119	190.99
911.492	135.17
911.866	132.74
912.239	164.29
912.612	120.6
912.986	166.72
913.359	164.29
913.732	217.69
914.105	113.32
914.478	169.15
914.851	195.85
915.224	147.3
915.597	108.47
915.97	144.87
916.343	193.42
916.715	157.01
917.088	157.01
917.461	169.15
917.833	140.02
918.206	98.76
918.578	198.27
918.951	101.18
919.323	183.71
919.695	190.99
920.067	258.95
920.44	110.89
920.812	72.06
921.184	190.99
921.556	195.85
921.928	123.03
922.3	108.47
922.672	181.28
923.043	144.87
923.415	174
923.787	171.57
924.158	227.4
924.53	195.85
924.901	178.86
925.273	123.03
925.644	144.87
926.016	140.02
926.387	103.61
926.758	161.87
927.129	174
927.5	115.75
927.872	154.58
928.243	132.74
928.613	154.58
928.984	132.74
929.355	152.16
929.726	125.46
930.097	212.84
930.467	96.33
930.838	152.16
931.209	161.87
931.579	157.01
931.95	171.57
932.32	57.49
932.69	178.86
933.061	137.59
933.431	169.15
933.801	132.74
934.171	174
934.541	207.98
934.911	188.56
935.281	157.01
935.651	89.05
936.021	67.2
936.391	171.57
936.761	200.7
937.13	186.14
937.5	142.45
937.87	164.29
938.239	154.58
938.609	159.44
938.978	220.12
939.347	183.71
939.717	157.01
940.086	254.1
940.455	188.56
940.824	140.02
941.193	161.87
941.562	164.29
941.931	130.31
942.3	161.87
942.669	157.01
943.038	142.45
943.407	135.17
943.775	193.42
944.144	188.56
944.513	144.87
944.881	174
945.25	203.13
945.618	149.73
945.986	120.6
946.355	195.85
946.723	190.99
947.091	144.87
947.459	110.89
947.827	154.58
948.195	171.57
948.563	130.31
948.931	135.17
949.299	137.59
949.667	164.29
950.035	188.56
950.402	120.6
950.77	142.45
951.138	152.16
951.505	188.56
951.873	127.88
952.24	183.71
952.607	176.43
952.975	142.45
953.342	118.18
953.709	157.01
954.076	210.41
954.443	149.73
954.81	302.64
955.177	215.26
955.544	186.14
955.911	203.13
956.278	123.03
956.645	183.71
957.012	164.29
957.378	207.98
957.745	171.57
958.111	186.14
958.478	174
958.844	132.74
959.211	178.86
959.577	67.2
959.943	130.31
960.309	193.42
960.675	249.25
961.042	178.86
961.408	198.27
961.774	169.15
962.139	154.58
962.505	110.89
962.871	171.57
963.237	140.02
963.603	161.87
963.968	144.87
964.334	101.18
964.699	183.71
965.065	144.87
965.43	161.87
965.796	113.32
966.161	110.89
966.526	147.3
966.891	144.87
967.256	169.15
967.622	127.88
967.987	142.45
968.352	132.74
968.716	132.74
969.081	127.88
969.446	164.29
969.811	183.71
970.176	115.75
970.54	161.87
970.905	101.18
971.269	123.03
971.634	132.74
971.998	140.02
972.363	154.58
972.727	89.05
973.091	164.29
973.455	186.14
973.819	178.86
974.183	188.56
974.547	137.59
974.911	113.32
975.275	47.79
975.639	76.91
976.003	166.72
976.367	101.18
976.73	154.58
977.094	217.69
977.458	164.29
977.821	183.71
978.185	171.57
978.548	135.17
978.911	159.44
979.275	157.01
979.638	188.56
980.001	135.17
980.364	127.88
980.727	120.6
981.09	93.9
981.453	171.57
981.816	132.74
982.179	149.73
982.542	161.87
982.905	154.58
983.267	188.56
983.63	239.54
983.992	217.69
984.355	166.72
984.717	127.88
985.08	140.02
985.442	140.02
985.804	149.73
986.167	132.74
986.529	84.19
986.891	118.18
987.253	161.87
987.615	176.43
987.977	79.34
988.339	120.6
988.701	115.75
989.062	161.87
989.424	132.74
989.786	149.73
990.147	195.85
990.509	113.32
990.87	249.25
991.232	220.12
991.593	164.29
991.955	123.03
992.316	135.17
992.677	176.43
993.038	142.45
993.399	186.14
993.76	203.13
994.121	127.88
994.482	157.01
994.843	161.87
995.204	166.72
995.565	140.02
995.926	157.01
996.286	140.02
996.647	135.17
997.007	161.87
997.368	188.56
997.728	154.58
998.089	137.59
998.449	135.17
998.809	166.72
999.169	176.43
999.53	181.28
999.89	125.46
1000.25	154.58
1000.61	169.15
1000.97	157.01
1001.329	130.31
1001.689	152.16
1002.049	203.13
1002.409	149.73
1002.768	123.03
1003.128	144.87
1003.487	178.86
1003.847	108.47
1004.206	74.49
1004.566	144.87
1004.925	98.76
1005.284	157.01
1005.643	118.18
1006.003	203.13
1006.362	174
1006.721	120.6
1007.08	147.3
1007.438	159.44
1007.797	123.03
1008.156	164.29
1008.515	161.87
1008.874	152.16
1009.232	113.32
1009.591	157.01
1009.949	154.58
1010.308	186.14
1010.666	195.85
1011.024	93.9
1011.383	127.88
1011.741	120.6
1012.099	166.72
1012.457	142.45
1012.815	169.15
1013.173	195.85
1013.531	227.4
1013.889	232.25
1014.247	118.18
1014.605	106.04
1014.962	130.31
1015.32	108.47
1015.678	144.87
1016.035	86.62
1016.393	76.91
1016.75	115.75
1017.107	181.28
1017.465	195.85
1017.822	166.72
1018.179	152.16
1018.536	195.85
1018.894	103.61
1019.251	166.72
1019.608	207.98
1019.964	98.76
1020.321	166.72
1020.678	157.01
1021.035	127.88
1021.392	229.83
1021.748	135.17
1022.105	149.73
1022.461	174
1022.818	215.26
1023.174	127.88
1023.531	101.18
1023.887	161.87
1024.243	89.05
1024.599	101.18
1024.955	149.73
1025.311	154.58
1025.667	115.75
1026.023	132.74
1026.379	149.73
1026.735	149.73
1027.091	161.87
1027.447	210.41
