189.514	56.28
189.973	56.28
190.431	56.28
190.889	29.58
191.348	-23.82
191.806	-9.25
192.264	-40.81
192.722	12.59
193.18	-1.97
193.638	-101.49
194.096	-11.68
194.554	-1.97
195.012	7.74
195.47	-4.4
195.928	-28.67
196.385	17.45
196.843	-31.1
197.301	58.71
197.758	39.29
198.216	0.46
198.674	68.42
199.131	17.45
199.589	97.54
200.046	65.99
200.503	36.86
200.961	97.54
201.418	80.55
201.875	126.67
202.332	97.54
202.79	85.41
203.247	148.52
203.704	155.8
204.161	197.06
204.618	150.94
205.075	82.98
205.532	141.23
205.989	172.79
206.445	138.81
206.902	119.39
207.359	148.52
207.816	146.09
208.272	112.11
208.729	124.24
209.185	170.36
209.642	99.97
210.098	148.52
210.555	206.77
211.011	114.53
211.467	189.78
211.924	238.32
212.38	160.65
212.836	121.82
213.292	82.98
213.748	131.53
214.204	138.81
214.66	163.08
215.116	129.1
215.572	136.38
216.028	221.33
216.484	199.49
216.94	99.97
217.396	180.07
217.851	131.53
218.307	170.36
218.763	138.81
219.218	214.05
219.674	165.51
220.129	167.93
220.585	158.22
221.04	148.52
221.496	133.95
221.951	189.78
222.406	187.35
222.861	235.9
223.317	143.66
223.772	165.51
224.227	85.41
224.682	155.8
225.137	238.32
225.592	148.52
226.047	102.4
226.502	114.53
226.957	148.52
227.411	226.19
227.866	75.7
228.321	226.19
228.776	211.62
229.23	129.1
229.685	90.26
230.139	226.19
230.594	143.66
231.048	95.12
231.503	150.94
231.957	163.08
232.411	133.95
232.865	165.51
233.32	194.63
233.774	197.06
234.228	177.64
234.682	150.94
235.136	126.67
235.59	177.64
236.044	131.53
236.498	119.39
236.952	87.84
237.406	155.8
237.86	112.11
238.313	155.8
238.767	204.34
239.221	182.5
239.674	112.11
240.128	163.08
240.581	146.09
241.035	136.38
241.488	112.11
241.942	206.77
242.395	163.08
242.848	175.22
243.301	124.24
243.755	223.76
244.208	121.82
244.661	126.67
245.114	192.21
245.567	175.22
246.02	116.96
246.473	206.77
246.926	129.1
247.379	177.64
247.832	165.51
248.284	163.08
248.737	226.19
249.19	150.94
249.642	163.08
250.095	143.66
250.547	146.09
251	165.51
251.452	148.52
251.905	165.51
252.357	172.79
252.81	204.34
253.262	163.08
253.714	155.8
254.166	136.38
254.618	146.09
255.07	260.17
255.523	136.38
255.975	189.78
256.427	126.67
256.878	126.67
257.33	116.96
257.782	177.64
258.234	129.1
258.686	216.48
259.137	124.24
259.589	165.51
260.041	109.68
260.492	131.53
260.944	180.07
261.395	163.08
261.847	182.5
262.298	206.77
262.749	146.09
263.201	158.22
263.652	136.38
264.103	124.24
264.554	138.81
265.005	165.51
265.457	136.38
265.908	146.09
266.359	163.08
266.809	189.78
267.26	131.53
267.711	150.94
268.162	112.11
268.613	148.52
269.064	163.08
269.514	131.53
269.965	177.64
270.415	109.68
270.866	158.22
271.316	194.63
271.767	163.08
272.217	170.36
272.668	194.63
273.118	129.1
273.568	114.53
274.019	58.71
274.469	206.77
274.919	138.81
275.369	197.06
275.819	121.82
276.269	143.66
276.719	114.53
277.169	136.38
277.619	177.64
278.069	175.22
278.518	153.37
278.968	163.08
279.418	146.09
279.867	92.69
280.317	211.62
280.767	177.64
281.216	184.92
281.666	182.5
282.115	172.79
282.564	153.37
283.014	148.52
283.463	158.22
283.912	177.64
284.361	131.53
284.811	136.38
285.26	131.53
285.709	172.79
286.158	163.08
286.607	201.91
287.056	131.53
287.505	121.82
287.953	124.24
288.402	150.94
288.851	107.25
289.3	114.53
289.748	148.52
290.197	112.11
290.646	129.1
291.094	131.53
291.543	160.65
291.991	226.19
292.439	175.22
292.888	92.69
293.336	136.38
293.784	124.24
294.233	172.79
294.681	170.36
295.129	177.64
295.577	182.5
296.025	136.38
296.473	141.23
296.921	257.74
297.369	153.37
297.817	153.37
298.264	165.51
298.712	206.77
299.16	216.48
299.608	197.06
300.055	184.92
300.503	107.25
300.95	197.06
301.398	187.35
301.845	150.94
302.293	214.05
302.74	153.37
303.187	199.49
303.635	187.35
304.082	146.09
304.529	112.11
304.976	131.53
305.423	184.92
305.87	148.52
306.317	143.66
306.764	197.06
307.211	112.11
307.658	146.09
308.105	129.1
308.552	197.06
308.998	170.36
309.445	211.62
309.892	121.82
310.338	146.09
310.785	92.69
311.231	177.64
311.678	143.66
312.124	269.88
312.571	167.93
313.017	112.11
313.463	136.38
313.909	138.81
314.356	214.05
314.802	155.8
315.248	133.95
315.694	99.97
316.14	155.8
316.586	129.1
317.032	165.51
317.478	206.77
317.923	201.91
318.369	126.67
318.815	146.09
319.261	238.32
319.706	107.25
320.152	177.64
320.597	141.23
321.043	170.36
321.488	192.21
321.934	189.78
322.379	231.04
322.824	177.64
323.27	209.2
323.715	160.65
324.16	153.37
324.605	146.09
325.05	172.79
325.495	141.23
325.94	216.48
326.385	136.38
326.83	218.91
327.275	194.63
327.72	160.65
328.165	116.96
328.61	197.06
329.054	182.5
329.499	138.81
329.943	206.77
330.388	165.51
330.832	175.22
331.277	182.5
331.721	138.81
332.166	114.53
332.61	131.53
333.054	153.37
333.499	150.94
333.943	163.08
334.387	177.64
334.831	197.06
335.275	73.27
335.719	153.37
336.163	177.64
336.607	146.09
337.051	138.81
337.495	133.95
337.938	165.51
338.382	170.36
338.826	250.46
339.269	216.48
339.713	158.22
340.157	121.82
340.6	160.65
341.044	170.36
341.487	182.5
341.93	104.83
342.374	184.92
342.817	211.62
343.26	116.96
343.703	197.06
344.146	153.37
344.59	95.12
345.033	133.95
345.476	126.67
345.919	163.08
346.361	136.38
346.804	133.95
347.247	146.09
347.69	160.65
348.133	95.12
348.575	141.23
349.018	201.91
349.461	129.1
349.903	175.22
350.346	177.64
350.788	194.63
351.23	170.36
351.673	158.22
352.115	131.53
352.557	201.91
353	163.08
353.442	143.66
353.884	155.8
354.326	180.07
354.768	160.65
355.21	148.52
355.652	153.37
356.094	148.52
356.536	148.52
356.978	192.21
357.419	126.67
357.861	141.23
358.303	240.75
358.744	141.23
359.186	175.22
359.627	226.19
360.069	116.96
360.51	70.84
360.952	170.36
361.393	129.1
361.834	204.34
362.276	158.22
362.717	160.65
363.158	158.22
363.599	170.36
364.04	138.81
364.481	180.07
364.922	194.63
365.363	177.64
365.804	189.78
366.245	148.52
366.686	199.49
367.126	182.5
367.567	170.36
368.008	192.21
368.448	153.37
368.889	194.63
369.33	133.95
369.77	194.63
370.21	143.66
370.651	167.93
371.091	148.52
371.531	160.65
371.972	150.94
372.412	177.64
372.852	158.22
373.292	187.35
373.732	146.09
374.172	209.2
374.612	163.08
375.052	223.76
375.492	184.92
375.932	170.36
376.372	155.8
376.811	192.21
377.251	218.91
377.691	163.08
378.13	126.67
378.57	214.05
379.009	199.49
379.449	167.93
379.888	155.8
380.328	136.38
380.767	146.09
381.206	160.65
381.645	175.22
382.085	143.66
382.524	184.92
382.963	172.79
383.402	214.05
383.841	180.07
384.28	180.07
384.719	138.81
385.158	116.96
385.596	153.37
386.035	112.11
386.474	121.82
386.913	218.91
387.351	180.07
387.79	138.81
388.228	184.92
388.667	146.09
389.105	223.76
389.544	143.66
389.982	160.65
390.42	211.62
390.859	175.22
391.297	141.23
391.735	126.67
392.173	158.22
392.611	175.22
393.049	177.64
393.487	150.94
393.925	136.38
394.363	216.48
394.801	167.93
395.239	160.65
395.676	136.38
396.114	148.52
396.552	182.5
396.989	138.81
397.427	158.22
397.864	87.84
398.302	121.82
398.739	146.09
399.177	167.93
399.614	182.5
400.051	165.51
400.488	201.91
400.926	194.63
401.363	150.94
401.8	148.52
402.237	206.77
402.674	158.22
403.111	182.5
403.548	184.92
403.985	158.22
404.421	114.53
404.858	167.93
405.295	146.09
405.732	119.39
406.168	175.22
406.605	155.8
407.041	167.93
407.478	97.54
407.914	172.79
408.351	107.25
408.787	167.93
409.223	170.36
409.66	175.22
410.096	172.79
410.532	197.06
410.968	148.52
411.404	150.94
411.84	155.8
412.276	131.53
412.712	167.93
413.148	163.08
413.584	153.37
414.02	194.63
414.455	189.78
414.891	136.38
415.327	209.2
415.762	180.07
416.198	102.4
416.633	148.52
417.069	116.96
417.504	131.53
417.94	148.52
418.375	150.94
418.81	199.49
419.245	167.93
419.681	163.08
420.116	182.5
420.551	155.8
420.986	158.22
421.421	184.92
421.856	158.22
422.291	95.12
422.726	124.24
423.16	192.21
423.595	187.35
424.03	114.53
424.464	148.52
424.899	184.92
425.334	141.23
425.768	155.8
426.203	121.82
426.637	116.96
427.071	192.21
427.506	235.9
427.94	199.49
428.374	160.65
428.809	109.68
429.243	238.32
429.677	180.07
430.111	133.95
430.545	143.66
430.979	209.2
431.413	209.2
431.847	133.95
432.28	133.95
432.714	138.81
433.148	126.67
433.582	211.62
434.015	143.66
434.449	194.63
434.882	141.23
435.316	226.19
435.749	136.38
436.183	170.36
436.616	172.79
437.049	216.48
437.483	170.36
437.916	182.5
438.349	138.81
438.782	170.36
439.215	199.49
439.648	184.92
440.081	155.8
440.514	248.03
440.947	175.22
441.38	148.52
441.813	184.92
442.245	252.89
442.678	192.21
443.111	165.51
443.543	175.22
443.976	221.33
444.408	175.22
444.841	153.37
445.273	201.91
445.705	240.75
446.138	197.06
446.57	228.61
447.002	233.47
447.434	209.2
447.867	272.3
448.299	269.88
448.731	257.74
449.163	269.88
449.595	216.48
450.026	265.02
450.458	235.9
450.89	182.5
451.322	223.76
451.754	231.04
452.185	255.31
452.617	286.87
453.048	223.76
453.48	291.72
453.911	267.45
454.343	262.6
454.774	277.16
455.205	269.88
455.637	294.15
456.068	315.99
456.499	330.56
456.93	286.87
457.361	167.93
457.792	257.74
458.223	262.6
458.654	255.31
459.085	201.91
459.516	301.43
459.947	255.31
460.378	252.89
460.808	267.45
461.239	204.34
461.669	289.29
462.1	255.31
462.531	257.74
462.961	272.3
463.391	279.59
463.822	257.74
464.252	269.88
464.682	197.06
465.113	199.49
465.543	260.17
465.973	245.6
466.403	206.77
466.833	216.48
467.263	245.6
467.693	209.2
468.123	286.87
468.553	349.98
468.983	189.78
469.412	245.6
469.842	311.14
470.272	233.47
470.701	226.19
471.131	189.78
471.56	231.04
471.99	282.01
472.419	206.77
472.849	218.91
473.278	250.46
473.707	175.22
474.136	138.81
474.566	243.18
474.995	238.32
475.424	214.05
475.853	175.22
476.282	228.61
476.711	141.23
477.14	146.09
477.569	277.16
477.997	177.64
478.426	226.19
478.855	252.89
479.283	313.57
479.712	265.02
480.141	238.32
480.569	240.75
480.998	214.05
481.426	240.75
481.854	153.37
482.283	248.03
482.711	201.91
483.139	177.64
483.567	194.63
483.995	235.9
484.424	172.79
484.852	197.06
485.28	177.64
485.708	296.58
486.135	255.31
486.563	214.05
486.991	184.92
487.419	175.22
487.847	172.79
488.274	172.79
488.702	192.21
489.129	182.5
489.557	189.78
489.984	235.9
490.412	301.43
490.839	197.06
491.266	146.09
491.694	197.06
492.121	211.62
492.548	155.8
492.975	211.62
493.402	170.36
493.829	136.38
494.256	155.8
494.683	138.81
495.11	201.91
495.537	192.21
495.964	189.78
496.39	175.22
496.817	155.8
497.244	141.23
497.67	126.67
498.097	124.24
498.523	184.92
498.95	194.63
499.376	201.91
499.803	218.91
500.229	238.32
500.655	214.05
501.081	199.49
501.508	158.22
501.934	172.79
502.36	223.76
502.786	235.9
503.212	204.34
503.638	197.06
504.064	184.92
504.489	216.48
504.915	204.34
505.341	184.92
505.767	182.5
506.192	214.05
506.618	194.63
507.043	206.77
507.469	206.77
507.894	107.25
508.32	180.07
508.745	126.67
509.17	175.22
509.596	184.92
510.021	158.22
510.446	303.86
510.871	175.22
511.296	201.91
511.721	158.22
512.146	180.07
512.571	158.22
512.996	252.89
513.421	184.92
513.845	231.04
514.27	155.8
514.695	184.92
515.119	146.09
515.544	138.81
515.969	231.04
516.393	131.53
516.817	153.37
517.242	167.93
517.666	136.38
518.09	184.92
518.515	116.96
518.939	167.93
519.363	432.5
519.787	194.63
520.211	226.19
520.635	201.91
521.059	182.5
521.483	199.49
521.907	206.77
522.331	182.5
522.754	150.94
523.178	180.07
523.602	170.36
524.025	158.22
524.449	235.9
524.872	189.78
525.296	231.04
525.719	240.75
526.143	197.06
526.566	136.38
526.989	192.21
527.412	143.66
527.836	272.3
528.259	228.61
528.682	214.05
529.105	226.19
529.528	194.63
529.951	231.04
530.374	189.78
530.796	182.5
531.219	177.64
531.642	177.64
532.065	192.21
532.487	233.47
532.91	252.89
533.332	228.61
533.755	189.78
534.177	136.38
534.6	209.2
535.022	223.76
535.444	189.78
535.867	206.77
536.289	199.49
536.711	150.94
537.133	194.63
537.555	243.18
537.977	136.38
538.399	199.49
538.821	148.52
539.243	146.09
539.665	233.47
540.086	155.8
540.508	121.82
540.93	187.35
541.351	257.74
541.773	177.64
542.195	192.21
542.616	216.48
543.037	274.73
543.459	248.03
543.88	223.76
544.301	257.74
544.723	238.32
545.144	243.18
545.565	248.03
545.986	320.85
546.407	262.6
546.828	274.73
547.249	184.92
547.67	194.63
548.091	163.08
548.512	245.6
548.932	231.04
549.353	233.47
549.774	201.91
550.194	192.21
550.615	167.93
551.035	175.22
551.456	231.04
551.876	177.64
552.296	189.78
552.717	119.39
553.137	155.8
553.557	214.05
553.977	160.65
554.397	265.02
554.817	214.05
555.237	206.77
555.657	172.79
556.077	175.22
556.497	235.9
556.917	187.35
557.337	138.81
557.756	192.21
558.176	155.8
558.596	201.91
559.015	204.34
559.435	172.79
559.854	158.22
560.274	177.64
560.693	78.13
561.112	175.22
561.532	148.52
561.951	248.03
562.37	163.08
562.789	141.23
563.208	199.49
563.627	182.5
564.046	240.75
564.465	199.49
564.884	199.49
565.303	126.67
565.722	167.93
566.14	175.22
566.559	204.34
566.978	250.46
567.396	153.37
567.815	182.5
568.233	250.46
568.652	199.49
569.07	175.22
569.489	214.05
569.907	226.19
570.325	177.64
570.743	187.35
571.161	192.21
571.58	257.74
571.998	216.48
572.416	201.91
572.833	124.24
573.251	184.92
573.669	197.06
574.087	197.06
574.505	104.83
574.922	160.65
575.34	221.33
575.758	131.53
576.175	165.51
576.593	209.2
577.01	221.33
577.428	194.63
577.845	1549.02
578.262	279.59
578.68	182.5
579.097	170.36
579.514	250.46
579.931	146.09
580.348	194.63
580.765	189.78
581.182	228.61
581.599	194.63
582.016	235.9
582.433	209.2
582.849	116.96
583.266	194.63
583.683	218.91
584.099	131.53
584.516	172.79
584.933	172.79
585.349	231.04
585.765	187.35
586.182	197.06
586.598	204.34
587.014	209.2
587.431	243.18
587.847	184.92
588.263	160.65
588.679	146.09
589.095	138.81
589.511	214.05
589.927	235.9
590.343	109.68
590.759	228.61
591.174	211.62
591.59	255.31
592.006	245.6
592.421	199.49
592.837	136.38
593.252	197.06
593.668	153.37
594.083	277.16
594.499	201.91
594.914	104.83
595.329	73.27
595.745	255.31
596.16	245.6
596.575	189.78
596.99	187.35
597.405	114.53
597.82	150.94
598.235	250.46
598.65	170.36
599.065	155.8
599.479	121.82
599.894	155.8
600.309	184.92
600.724	189.78
601.138	194.63
601.553	223.76
601.967	218.91
602.382	211.62
602.796	158.22
603.21	255.31
603.625	158.22
604.039	238.32
604.453	226.19
604.867	252.89
605.281	216.48
605.695	138.81
606.109	221.33
606.523	209.2
606.937	228.61
607.351	303.86
607.765	177.64
608.178	158.22
608.592	184.92
609.006	233.47
609.419	209.2
609.833	204.34
610.246	226.19
610.66	214.05
611.073	177.64
611.487	194.63
611.9	211.62
612.313	197.06
612.726	211.62
613.139	238.32
613.553	146.09
613.966	267.45
614.379	201.91
614.792	160.65
615.204	216.48
615.617	138.81
616.03	177.64
616.443	206.77
616.856	189.78
617.268	165.51
617.681	109.68
618.093	146.09
618.506	177.64
618.918	172.79
619.331	150.94
619.743	131.53
620.155	194.63
620.568	187.35
620.98	214.05
621.392	182.5
621.804	180.07
622.216	197.06
622.628	163.08
623.04	165.51
623.452	148.52
623.864	206.77
624.276	143.66
624.687	150.94
625.099	175.22
625.511	172.79
625.922	112.11
626.334	192.21
626.745	163.08
627.157	136.38
627.568	177.64
627.979	231.04
628.391	221.33
628.802	175.22
629.213	180.07
629.624	119.39
630.035	214.05
630.446	189.78
630.857	146.09
631.268	211.62
631.679	160.65
632.09	187.35
632.501	218.91
632.912	189.78
633.322	216.48
633.733	257.74
634.144	189.78
634.554	172.79
634.965	167.93
635.375	133.95
635.785	182.5
636.196	155.8
636.606	223.76
637.016	143.66
637.427	170.36
637.837	204.34
638.247	184.92
638.657	204.34
639.067	155.8
639.477	240.75
639.887	221.33
640.297	175.22
640.706	182.5
641.116	131.53
641.526	177.64
641.935	116.96
642.345	150.94
642.755	180.07
643.164	116.96
643.573	153.37
643.983	233.47
644.392	187.35
644.801	184.92
645.211	209.2
645.62	148.52
646.029	206.77
646.438	172.79
646.847	167.93
647.256	177.64
647.665	85.41
648.074	192.21
648.483	175.22
648.892	163.08
649.3	182.5
649.709	165.51
650.118	163.08
650.526	109.68
650.935	240.75
651.343	201.91
651.752	206.77
652.16	192.21
652.568	112.11
652.977	182.5
653.385	143.66
653.793	177.64
654.201	167.93
654.609	129.1
655.017	201.91
655.425	223.76
655.833	209.2
656.241	148.52
656.649	160.65
657.057	102.4
657.464	158.22
657.872	119.39
658.28	192.21
658.687	233.47
659.095	189.78
659.502	158.22
659.91	133.95
660.317	226.19
660.724	175.22
661.132	182.5
661.539	177.64
661.946	131.53
662.353	131.53
662.76	129.1
663.167	180.07
663.574	158.22
663.981	146.09
664.388	148.52
664.795	209.2
665.202	99.97
665.608	231.04
666.015	180.07
666.422	160.65
666.828	129.1
667.235	216.48
667.641	206.77
668.047	90.26
668.454	211.62
668.86	243.18
669.266	175.22
669.673	206.77
670.079	189.78
670.485	165.51
670.891	65.99
671.297	92.69
671.703	175.22
672.109	129.1
672.515	172.79
672.92	165.51
673.326	211.62
673.732	129.1
674.138	201.91
674.543	172.79
674.949	109.68
675.354	163.08
675.76	250.46
676.165	163.08
676.57	177.64
676.976	158.22
677.381	197.06
677.786	228.61
678.191	184.92
678.596	170.36
679.001	141.23
679.406	221.33
679.811	204.34
680.216	201.91
680.621	250.46
681.026	155.8
681.43	143.66
681.835	158.22
682.24	167.93
682.644	126.67
683.049	158.22
683.453	199.49
683.858	112.11
684.262	197.06
684.667	177.64
685.071	121.82
685.475	163.08
685.879	187.35
686.283	155.8
686.687	143.66
687.091	199.49
687.495	201.91
687.899	182.5
688.303	119.39
688.707	136.38
689.111	175.22
689.514	148.52
689.918	167.93
690.322	204.34
690.725	182.5
691.129	180.07
691.532	182.5
691.936	182.5
692.339	182.5
692.742	197.06
693.146	228.61
693.549	255.31
693.952	104.83
694.355	231.04
694.758	216.48
695.161	218.91
695.564	163.08
695.967	175.22
696.37	201.91
696.773	160.65
697.175	155.8
697.578	226.19
697.981	233.47
698.383	175.22
698.786	206.77
699.188	221.33
699.591	133.95
699.993	129.1
700.395	180.07
700.798	163.08
701.2	206.77
701.602	155.8
702.004	201.91
702.406	160.65
702.808	177.64
703.21	175.22
703.612	192.21
704.014	231.04
704.416	199.49
704.818	155.8
705.219	201.91
705.621	223.76
706.023	146.09
706.424	255.31
706.826	214.05
707.227	163.08
707.629	279.59
708.03	189.78
708.431	206.77
708.832	233.47
709.234	313.57
709.635	231.04
710.036	245.6
710.437	199.49
710.838	141.23
711.239	180.07
711.64	228.61
712.041	252.89
712.441	335.41
712.842	279.59
713.243	214.05
713.643	248.03
714.044	252.89
714.445	228.61
714.845	294.15
715.246	325.7
715.646	296.58
716.046	238.32
716.447	374.25
716.847	282.01
717.247	282.01
717.647	379.1
718.047	303.86
718.447	306.29
718.847	381.53
719.247	347.55
719.647	415.51
720.047	311.14
720.446	325.7
720.846	383.96
721.246	396.09
721.645	337.84
722.045	393.67
722.444	349.98
722.844	408.23
723.243	415.51
723.643	393.67
724.042	444.64
724.441	396.09
724.84	352.4
725.24	488.33
725.639	410.66
726.038	459.2
726.437	490.75
726.836	478.62
727.234	473.76
727.633	507.74
728.032	546.58
728.431	490.75
728.83	570.85
729.228	561.14
729.627	541.73
730.025	694.64
730.424	697.07
730.822	782.02
731.22	667.94
731.619	750.47
732.017	828.14
732.415	883.96
732.813	908.24
733.212	1056.3
733.61	1078.14
734.008	1184.94
734.406	1177.66
734.803	1272.32
735.201	1206.78
735.599	1425.23
735.997	1505.33
736.395	1609.7
736.792	1677.67
737.19	1738.35
737.587	1876.7
737.985	1784.46
738.382	1988.35
738.78	2102.43
739.177	2209.23
739.574	2340.3
739.971	2507.78
740.369	2456.8
740.766	2721.37
741.163	2735.93
741.56	2949.53
741.957	2995.65
742.354	3107.3
742.751	3262.64
743.147	3425.27
743.544	3602.45
743.941	3740.8
744.338	3942.26
744.734	4051.49
745.131	4211.69
745.527	4439.84
745.924	4636.45
746.32	5049.08
746.716	5267.53
747.113	5342.77
747.509	5757.83
747.905	6151.04
748.301	6121.91
748.697	6211.72
749.093	6959.3
749.489	6959.3
749.885	7165.62
750.281	7857.37
750.677	7813.68
751.073	8112.23
751.468	8621.95
751.864	9121.96
752.26	9287.01
752.655	9930.22
753.051	9944.78
753.446	10425.37
753.842	10949.65
754.237	11243.35
754.632	11265.19
755.028	11641.41
755.423	11874.43
755.818	11859.86
756.213	12299.19
756.608	12738.52
757.003	12740.94
757.398	12944.83
757.793	13092.89
758.188	13134.15
758.583	13794.36
758.977	13745.81
759.372	14626.9
759.767	14983.7
760.161	15796.82
760.556	16566.25
760.95	17248.3
761.345	17767.72
761.739	18660.94
762.133	19258.04
762.527	19765.33
762.922	20187.66
763.316	20932.82
763.71	21515.35
764.104	21610.01
764.498	22610.03
764.892	22765.37
765.286	23551.79
765.68	23619.75
766.073	24469.28
766.467	24313.94
766.861	25476.58
767.255	25879.5
767.648	26440.19
768.042	26748.44
768.435	27981.47
768.829	27729.04
769.222	28547.02
769.615	29627.13
770.008	29415.96
770.402	29168.38
770.795	29794.61
771.188	29600.43
771.581	29954.8
771.974	30386.85
772.367	29607.71
772.76	29714.51
773.153	29182.95
773.545	29782.47
773.938	30255.78
774.331	30360.15
774.724	30947.54
775.116	31826.19
775.509	33226.7
775.901	34389.34
776.294	34658.76
776.686	35690.33
777.078	35986.45
777.471	37265.6
777.863	38248.62
778.255	39173.39
778.647	39976.81
779.039	40010.79
779.431	39942.82
779.823	40457.4
780.215	40583.61
780.607	40423.41
780.999	40736.53
781.39	40377.3
781.782	41641.88
782.174	41268.09
782.565	42117.62
782.957	42607.91
783.348	43493.85
783.74	42991.42
784.131	42714.71
784.522	43474.43
784.914	42610.34
785.305	42930.73
785.696	42688.01
786.087	42661.31
786.478	41338.48
786.869	40018.07
787.26	39787.48
787.651	37945.22
788.042	38025.32
788.433	36498.6
788.823	35935.48
789.214	35593.24
789.605	34695.17
789.995	34175.74
790.386	33646.61
790.776	33952.44
791.167	33054.37
791.557	33748.55
791.948	34314.1
792.338	34843.23
792.728	35889.36
793.118	36192.77
793.508	35865.09
793.898	36018.01
794.288	36105.39
794.678	35848.1
795.068	36513.16
795.458	35585.96
795.848	35612.66
796.238	35845.67
796.627	36044.71
797.017	35539.84
797.406	35622.37
797.796	35751.01
798.185	35420.91
798.575	34942.75
798.964	35321.39
799.354	35260.71
799.743	35382.07
800.132	36032.57
800.521	35928.2
800.91	34508.27
801.299	34821.39
801.688	34838.38
802.077	34719.44
802.466	34488.86
802.855	34610.22
803.244	32566.5
803.633	32428.14
804.021	32117.46
804.41	32093.19
804.799	31646.58
805.187	30406.27
805.576	29949.95
805.964	29231.49
806.352	27648.94
806.741	27993.61
807.129	27474.18
807.517	27544.57
807.905	27068.84
808.293	27379.52
808.681	28265.46
809.069	26969.32
809.457	28066.43
809.845	28971.78
810.233	28418.37
810.621	28148.95
811.009	28607.7
811.396	28777.6
811.784	28175.65
812.171	27449.91
812.559	28486.34
812.946	27568.85
813.334	26835.82
813.721	26471.74
814.108	25612.5
814.496	25182.89
814.883	24685.31
815.27	25935.32
815.657	25537.26
816.044	25311.53
816.431	24949.87
816.818	24840.65
817.205	24469.28
817.592	23940.15
817.979	23949.86
818.365	24042.09
818.752	22758.09
819.139	21588.17
819.525	21670.7
819.912	20920.68
820.298	20423.1
820.685	20357.57
821.071	20160.96
821.457	19384.25
821.843	18228.89
822.23	18207.05
822.616	17325.97
823.002	16825.96
823.388	15806.53
823.774	15847.79
824.16	15432.73
824.546	14204.56
824.931	14435.15
825.317	14223.98
825.703	13876.88
826.089	13558.92
826.474	13656.01
826.86	13702.12
827.245	13379.3
827.631	13039.49
828.016	12813.76
828.401	12845.32
828.787	12068.6
829.172	12226.37
829.557	12189.97
829.942	11454.52
830.327	10859.85
830.712	11119.56
831.097	10566.15
831.482	10602.56
831.867	10226.34
832.252	9886.53
832.636	9726.33
833.021	9672.94
833.406	9279.73
833.79	9658.37
834.175	9163.22
834.559	9010.3
834.944	8602.53
835.328	8808.84
835.713	8371.94
836.097	7852.52
836.481	7653.49
836.865	7556.4
837.249	7306.39
837.633	6903.48
838.017	6660.75
838.401	6653.47
838.785	6359.78
839.169	6063.66
839.553	5910.74
839.937	5779.67
840.32	5367.04
840.704	5100.05
841.087	5053.93
841.471	4714.12
841.854	4573.34
842.238	4471.4
842.621	4432.56
843.004	4342.76
843.388	4148.58
843.771	4041.78
844.154	4168
844.537	4085.47
844.92	3910.71
845.303	3769.93
845.686	3862.17
846.069	3767.5
846.452	3692.26
846.834	3410.7
847.217	3444.68
847.6	3388.86
847.982	3330.6
848.365	3250.51
848.748	3197.11
849.13	3248.08
849.512	2988.37
849.895	2930.11
850.277	2893.7
850.659	2854.87
851.041	2803.9
851.423	2612.15
851.806	2789.33
852.188	2551.47
852.57	2485.93
852.951	2476.22
853.333	2410.69
853.715	2228.65
854.097	2252.92
854.479	2262.63
854.86	2260.2
855.242	2231.07
855.623	2063.59
856.005	1864.56
856.386	1879.13
856.768	1808.74
857.149	1808.74
857.53	1779.61
857.911	1743.2
858.292	1648.54
858.674	1449.51
859.055	1420.38
859.436	1388.83
859.817	1349.99
860.197	1354.85
860.578	1192.22
860.959	1267.47
861.34	1201.93
861.72	1211.64
862.101	1085.42
862.482	1083
862.862	1090.28
863.243	985.91
863.623	961.64
864.003	1010.18
864.384	961.64
864.764	956.78
865.144	852.41
865.524	915.52
865.904	879.11
866.284	852.41
866.664	832.99
867.044	755.32
867.424	779.59
867.804	723.77
868.183	721.34
868.563	692.21
868.943	709.2
869.322	689.79
869.702	694.64
870.081	621.82
870.461	646.1
870.84	604.83
871.22	602.41
871.599	546.58
871.978	563.57
872.357	650.95
872.736	483.47
873.115	473.76
873.494	505.32
873.873	575.71
874.252	371.82
874.631	430.07
875.01	408.23
875.388	437.36
875.767	371.82
876.146	393.67
876.524	381.53
876.903	408.23
877.281	364.54
877.66	352.4
878.038	286.87
878.416	313.57
878.794	272.3
879.173	320.85
879.551	296.58
879.929	289.29
880.307	342.69
880.685	277.16
881.063	279.59
881.441	209.2
881.818	228.61
882.196	279.59
882.574	289.29
882.951	226.19
883.329	216.48
883.707	240.75
884.084	286.87
884.461	299
884.839	177.64
885.216	146.09
885.593	260.17
885.971	187.35
886.348	228.61
886.725	189.78
887.102	238.32
887.479	235.9
887.856	187.35
888.233	204.34
888.609	255.31
888.986	221.33
889.363	180.07
889.74	184.92
890.116	262.6
890.493	223.76
890.869	184.92
891.246	233.47
891.622	197.06
891.998	209.2
892.375	204.34
892.751	248.03
893.127	201.91
893.503	175.22
893.879	163.08
894.255	197.06
894.631	172.79
895.007	138.81
895.383	175.22
895.759	165.51
896.134	131.53
896.51	189.78
896.886	153.37
897.261	170.36
897.637	175.22
898.012	133.95
898.388	150.94
898.763	150.94
899.138	138.81
899.514	228.61
899.889	201.91
900.264	182.5
900.639	231.04
901.014	141.23
901.389	121.82
901.764	180.07
902.139	175.22
902.513	138.81
902.888	153.37
903.263	177.64
903.638	250.46
904.012	160.65
904.387	131.53
904.761	175.22
905.136	175.22
905.51	87.84
905.884	199.49
906.259	158.22
906.633	136.38
907.007	129.1
907.381	148.52
907.755	121.82
908.129	131.53
908.503	187.35
908.877	172.79
909.251	206.77
909.624	136.38
909.998	131.53
910.372	92.69
910.745	180.07
911.119	153.37
911.492	165.51
911.866	102.4
912.239	197.06
912.612	116.96
912.986	170.36
913.359	155.8
913.732	114.53
914.105	136.38
914.478	126.67
914.851	150.94
915.224	170.36
915.597	104.83
915.97	163.08
916.343	175.22
916.715	197.06
917.088	136.38
917.461	107.25
917.833	68.42
918.206	175.22
918.578	146.09
918.951	214.05
919.323	170.36
919.695	97.54
920.067	172.79
920.44	143.66
920.812	197.06
921.184	133.95
921.556	221.33
921.928	167.93
922.3	138.81
922.672	131.53
923.043	160.65
923.415	112.11
923.787	167.93
924.158	194.63
924.53	189.78
924.901	155.8
925.273	63.56
925.644	189.78
926.016	121.82
926.387	129.1
926.758	148.52
927.129	163.08
927.5	175.22
927.872	112.11
928.243	170.36
928.613	167.93
928.984	160.65
929.355	172.79
929.726	136.38
930.097	97.54
930.467	163.08
930.838	112.11
931.209	170.36
931.579	133.95
931.95	112.11
932.32	78.13
932.69	197.06
933.061	153.37
933.431	143.66
933.801	148.52
934.171	119.39
934.541	150.94
934.911	146.09
935.281	170.36
935.651	170.36
936.021	121.82
936.391	148.52
936.761	153.37
937.13	170.36
937.5	150.94
937.87	153.37
938.239	160.65
938.609	182.5
938.978	150.94
939.347	223.76
939.717	146.09
940.086	138.81
940.455	102.4
940.824	163.08
941.193	102.4
941.562	165.51
941.931	136.38
942.3	197.06
942.669	56.28
943.038	90.26
943.407	124.24
943.775	160.65
944.144	184.92
944.513	155.8
944.881	136.38
945.25	143.66
945.618	114.53
945.986	150.94
946.355	204.34
946.723	177.64
947.091	80.55
947.459	136.38
947.827	184.92
948.195	187.35
948.563	158.22
948.931	204.34
949.299	165.51
949.667	150.94
950.035	148.52
950.402	119.39
950.77	184.92
951.138	194.63
951.505	163.08
951.873	92.69
952.24	126.67
952.607	109.68
952.975	85.41
953.342	153.37
953.709	204.34
954.076	95.12
954.443	146.09
954.81	146.09
955.177	136.38
955.544	133.95
955.911	170.36
956.278	197.06
956.645	189.78
957.012	129.1
957.378	107.25
957.745	138.81
958.111	163.08
958.478	143.66
958.844	221.33
959.211	126.67
959.577	163.08
959.943	158.22
960.309	211.62
960.675	119.39
961.042	187.35
961.408	177.64
961.774	121.82
962.139	153.37
962.505	158.22
962.871	221.33
963.237	102.4
963.603	221.33
963.968	170.36
964.334	155.8
964.699	177.64
965.065	138.81
965.43	187.35
965.796	109.68
966.161	73.27
966.526	146.09
966.891	209.2
967.256	153.37
967.622	138.81
967.987	175.22
968.352	155.8
968.716	204.34
969.081	146.09
969.446	126.67
969.811	141.23
970.176	34.44
970.54	90.26
970.905	150.94
971.269	182.5
971.634	153.37
971.998	87.84
972.363	136.38
972.727	92.69
973.091	107.25
973.455	170.36
973.819	146.09
974.183	148.52
974.547	182.5
974.911	53.85
975.275	65.99
975.639	189.78
976.003	189.78
976.367	180.07
976.73	129.1
977.094	150.94
977.458	194.63
977.821	131.53
978.185	95.12
978.548	104.83
978.911	146.09
979.275	192.21
979.638	129.1
980.001	131.53
980.364	114.53
980.727	129.1
981.09	189.78
981.453	109.68
981.816	143.66
982.179	182.5
982.542	172.79
982.905	189.78
983.267	221.33
983.63	192.21
983.992	124.24
984.355	124.24
984.717	170.36
985.08	114.53
985.442	95.12
985.804	148.52
986.167	184.92
986.529	182.5
986.891	133.95
987.253	107.25
987.615	218.91
987.977	150.94
988.339	112.11
988.701	155.8
989.062	109.68
989.424	163.08
989.786	182.5
990.147	177.64
990.509	165.51
990.87	160.65
991.232	182.5
991.593	136.38
991.955	126.67
992.316	158.22
992.677	119.39
993.038	182.5
993.399	97.54
993.76	70.84
994.121	187.35
994.482	107.25
994.843	160.65
995.204	240.75
995.565	182.5
995.926	233.47
996.286	163.08
996.647	187.35
997.007	228.61
997.368	199.49
997.728	116.96
998.089	206.77
998.449	177.64
998.809	116.96
999.169	58.71
999.53	97.54
999.89	90.26
1000.25	155.8
1000.61	204.34
1000.97	167.93
1001.329	136.38
1001.689	63.56
1002.049	92.69
1002.409	102.4
1002.768	163.08
1003.128	180.07
1003.487	114.53
1003.847	175.22
1004.206	87.84
1004.566	146.09
1004.925	90.26
1005.284	129.1
1005.643	170.36
1006.003	155.8
1006.362	146.09
1006.721	85.41
1007.08	146.09
1007.438	121.82
1007.797	148.52
1008.156	119.39
1008.515	165.51
1008.874	204.34
1009.232	126.67
1009.591	143.66
1009.949	211.62
1010.308	204.34
1010.666	104.83
1011.024	119.39
1011.383	216.48
1011.741	158.22
1012.099	104.83
1012.457	163.08
1012.815	104.83
1013.173	158.22
1013.531	121.82
1013.889	148.52
1014.247	153.37
1014.605	165.51
1014.962	131.53
1015.32	129.1
1015.678	95.12
1016.035	175.22
1016.393	180.07
1016.75	85.41
1017.107	184.92
1017.465	129.1
1017.822	197.06
1018.179	153.37
1018.536	175.22
1018.894	107.25
1019.251	92.69
1019.608	155.8
1019.964	148.52
1020.321	136.38
1020.678	177.64
1021.035	153.37
1021.392	143.66
1021.748	73.27
1022.105	119.39
1022.461	165.51
1022.818	182.5
1023.174	197.06
1023.531	63.56
1023.887	138.81
1024.243	170.36
1024.599	192.21
1024.955	163.08
1025.311	131.53
1025.667	136.38
1026.023	102.4
1026.379	136.38
1026.735	192.21
1027.091	138.81
1027.447	136.38
