189.514	140.48
189.973	140.48
190.431	140.48
190.889	9.41
191.348	-41.57
191.806	50.67
192.264	43.39
192.722	-0.3
193.18	-92.54
193.638	-19.72
194.096	-53.7
194.554	26.4
195.012	6.98
195.47	-12.44
195.928	-24.58
196.385	-22.15
196.843	11.83
197.301	11.83
197.758	55.52
198.216	-2.73
198.674	62.8
199.131	9.41
199.589	87.08
200.046	33.68
200.503	104.07
200.961	91.93
201.418	106.49
201.875	79.79
202.332	40.96
202.79	55.52
203.247	213.29
203.704	130.77
204.161	121.06
204.618	152.61
205.075	208.44
205.532	138.05
205.989	225.43
206.445	82.22
206.902	123.48
207.359	191.45
207.816	174.46
208.272	157.47
208.729	113.78
209.185	152.61
209.642	186.59
210.098	189.02
210.555	230.28
211.011	172.03
211.467	227.86
211.924	167.17
212.38	196.3
212.836	150.18
213.292	104.07
213.748	106.49
214.204	157.47
214.66	176.88
215.116	125.91
215.572	123.48
216.028	196.3
216.484	186.59
216.94	215.72
217.396	147.76
217.851	128.34
218.307	239.99
218.763	101.64
219.218	235.14
219.674	184.17
220.129	159.89
220.585	230.28
221.04	155.04
221.496	155.04
221.951	145.33
222.406	125.91
222.861	94.36
223.317	118.63
223.772	196.3
224.227	210.86
224.682	96.79
225.137	133.19
225.592	193.87
226.047	133.19
226.502	155.04
226.957	155.04
227.411	176.88
227.866	176.88
228.321	232.71
228.776	213.29
229.23	198.73
229.685	172.03
230.139	94.36
230.594	108.92
231.048	118.63
231.503	152.61
231.957	164.75
232.411	104.07
232.865	150.18
233.32	169.6
233.774	138.05
234.228	53.1
234.682	118.63
235.136	104.07
235.59	99.21
236.044	123.48
236.498	225.43
236.952	121.06
237.406	191.45
237.86	74.94
238.313	162.32
238.767	147.76
239.221	189.02
239.674	164.75
240.128	145.33
240.581	138.05
241.035	113.78
241.488	123.48
241.942	133.19
242.395	237.56
242.848	169.6
243.301	133.19
243.755	259.41
244.208	162.32
244.661	215.72
245.114	145.33
245.567	128.34
246.02	172.03
246.473	155.04
246.926	162.32
247.379	106.49
247.832	164.75
248.284	147.76
248.737	208.44
249.19	142.9
249.642	130.77
250.095	157.47
250.547	232.71
251	208.44
251.452	189.02
251.905	176.88
252.357	123.48
252.81	162.32
253.262	125.91
253.714	181.74
254.166	181.74
254.618	140.48
255.07	60.38
255.523	169.6
255.975	167.17
256.427	123.48
256.878	140.48
257.33	142.9
257.782	244.85
258.234	227.86
258.686	179.31
259.137	106.49
259.589	155.04
260.041	159.89
260.492	208.44
260.944	157.47
261.395	118.63
261.847	145.33
262.298	186.59
262.749	162.32
263.201	223
263.652	145.33
264.103	145.33
264.554	174.46
265.005	184.17
265.457	108.92
265.908	138.05
266.359	162.32
266.809	118.63
267.26	159.89
267.711	167.17
268.162	157.47
268.613	176.88
269.064	181.74
269.514	215.72
269.965	174.46
270.415	249.7
270.866	208.44
271.316	179.31
271.767	186.59
272.217	176.88
272.668	184.17
273.118	150.18
273.568	174.46
274.019	164.75
274.469	138.05
274.919	203.58
275.369	172.03
275.819	152.61
276.269	191.45
276.719	162.32
277.169	147.76
277.619	128.34
278.069	147.76
278.518	179.31
278.968	128.34
279.418	147.76
279.867	145.33
280.317	106.49
280.767	140.48
281.216	174.46
281.666	176.88
282.115	227.86
282.564	152.61
283.014	172.03
283.463	208.44
283.912	179.31
284.361	189.02
284.811	179.31
285.26	140.48
285.709	150.18
286.158	210.86
286.607	169.6
287.056	162.32
287.505	138.05
287.953	138.05
288.402	130.77
288.851	169.6
289.3	138.05
289.748	191.45
290.197	237.56
290.646	210.86
291.094	172.03
291.543	198.73
291.991	111.35
292.439	186.59
292.888	215.72
293.336	152.61
293.784	215.72
294.233	196.3
294.681	157.47
295.129	77.37
295.577	186.59
296.025	152.61
296.473	203.58
296.921	128.34
297.369	150.18
297.817	162.32
298.264	167.17
298.712	125.91
299.16	140.48
299.608	193.87
300.055	74.94
300.503	123.48
300.95	140.48
301.398	133.19
301.845	235.14
302.293	172.03
302.74	196.3
303.187	172.03
303.635	155.04
304.082	60.38
304.529	125.91
304.976	198.73
305.423	140.48
305.87	215.72
306.317	172.03
306.764	193.87
307.211	201.16
307.658	196.3
308.105	162.32
308.552	174.46
308.998	201.16
309.445	96.79
309.892	181.74
310.338	179.31
310.785	140.48
311.231	181.74
311.678	152.61
312.124	169.6
312.571	164.75
313.017	108.92
313.463	150.18
313.909	198.73
314.356	184.17
314.802	123.48
315.248	157.47
315.694	167.17
316.14	186.59
316.586	227.86
317.032	101.64
317.478	186.59
317.923	239.99
318.369	167.17
318.815	140.48
319.261	208.44
319.706	135.62
320.152	147.76
320.597	193.87
321.043	239.99
321.488	206.01
321.934	138.05
322.379	147.76
322.824	150.18
323.27	198.73
323.715	189.02
324.16	159.89
324.605	169.6
325.05	111.35
325.495	79.79
325.94	123.48
326.385	121.06
326.83	108.92
327.275	152.61
327.72	113.78
328.165	172.03
328.61	116.2
329.054	196.3
329.499	169.6
329.943	152.61
330.388	147.76
330.832	210.86
331.277	150.18
331.721	116.2
332.166	191.45
332.61	157.47
333.054	239.99
333.499	181.74
333.943	191.45
334.387	174.46
334.831	121.06
335.275	147.76
335.719	172.03
336.163	157.47
336.607	159.89
337.051	152.61
337.495	145.33
337.938	223
338.382	169.6
338.826	184.17
339.269	186.59
339.713	186.59
340.157	174.46
340.6	138.05
341.044	174.46
341.487	142.9
341.93	193.87
342.374	174.46
342.817	172.03
343.26	145.33
343.703	164.75
344.146	142.9
344.59	150.18
345.033	172.03
345.476	167.17
345.919	193.87
346.361	79.79
346.804	184.17
347.247	186.59
347.69	104.07
348.133	155.04
348.575	121.06
349.018	191.45
349.461	138.05
349.903	203.58
350.346	133.19
350.788	179.31
351.23	159.89
351.673	79.79
352.115	147.76
352.557	184.17
353	184.17
353.442	133.19
353.884	138.05
354.326	239.99
354.768	186.59
355.21	121.06
355.652	116.2
356.094	206.01
356.536	140.48
356.978	130.77
357.419	164.75
357.861	167.17
358.303	215.72
358.744	128.34
359.186	135.62
359.627	230.28
360.069	169.6
360.51	128.34
360.952	167.17
361.393	164.75
361.834	138.05
362.276	147.76
362.717	147.76
363.158	172.03
363.599	169.6
364.04	176.88
364.481	113.78
364.922	218.15
365.363	142.9
365.804	167.17
366.245	191.45
366.686	84.65
367.126	191.45
367.567	140.48
368.008	155.04
368.448	121.06
368.889	215.72
369.33	116.2
369.77	142.9
370.21	184.17
370.651	150.18
371.091	164.75
371.531	70.09
371.972	196.3
372.412	140.48
372.852	99.21
373.292	152.61
373.732	208.44
374.172	145.33
374.612	140.48
375.052	152.61
375.492	87.08
375.932	155.04
376.372	79.79
376.811	176.88
377.251	84.65
377.691	142.9
378.13	189.02
378.57	181.74
379.009	172.03
379.449	152.61
379.888	172.03
380.328	104.07
380.767	150.18
381.206	147.76
381.645	189.02
382.085	111.35
382.524	164.75
382.963	125.91
383.402	142.9
383.841	111.35
384.28	140.48
384.719	162.32
385.158	213.29
385.596	99.21
386.035	89.5
386.474	232.71
386.913	159.89
387.351	133.19
387.79	140.48
388.228	189.02
388.667	125.91
389.105	162.32
389.544	108.92
389.982	121.06
390.42	218.15
390.859	145.33
391.297	203.58
391.735	118.63
392.173	210.86
392.611	145.33
393.049	135.62
393.487	164.75
393.925	167.17
394.363	162.32
394.801	157.47
395.239	138.05
395.676	227.86
396.114	121.06
396.552	145.33
396.989	198.73
397.427	118.63
397.864	133.19
398.302	172.03
398.739	140.48
399.177	208.44
399.614	104.07
400.051	60.38
400.488	77.37
400.926	172.03
401.363	111.35
401.8	157.47
402.237	206.01
402.674	176.88
403.111	135.62
403.548	150.18
403.985	193.87
404.421	147.76
404.858	138.05
405.295	157.47
405.732	121.06
406.168	189.02
406.605	210.86
407.041	152.61
407.478	242.42
407.914	147.76
408.351	172.03
408.787	174.46
409.223	184.17
409.66	130.77
410.096	157.47
410.532	203.58
410.968	203.58
411.404	167.17
411.84	201.16
412.276	157.47
412.712	111.35
413.148	106.49
413.584	203.58
414.02	167.17
414.455	208.44
414.891	133.19
415.327	172.03
415.762	113.78
416.198	159.89
416.633	189.02
417.069	172.03
417.504	169.6
417.94	159.89
418.375	62.8
418.81	133.19
419.245	121.06
419.681	89.5
420.116	172.03
420.551	181.74
420.986	208.44
421.421	172.03
421.856	210.86
422.291	176.88
422.726	118.63
423.16	157.47
423.595	167.17
424.03	174.46
424.464	184.17
424.899	145.33
425.334	167.17
425.768	57.95
426.203	206.01
426.637	174.46
427.071	108.92
427.506	157.47
427.94	159.89
428.374	116.2
428.809	133.19
429.243	186.59
429.677	162.32
430.111	157.47
430.545	145.33
430.979	189.02
431.413	210.86
431.847	99.21
432.28	223
432.714	138.05
433.148	121.06
433.582	208.44
434.015	138.05
434.449	179.31
434.882	213.29
435.316	142.9
435.749	215.72
436.183	123.48
436.616	87.08
437.049	215.72
437.483	191.45
437.916	206.01
438.349	189.02
438.782	167.17
439.215	203.58
439.648	220.57
440.081	169.6
440.514	174.46
440.947	174.46
441.38	179.31
441.813	181.74
442.245	184.17
442.678	147.76
443.111	116.2
443.543	159.89
443.976	169.6
444.408	159.89
444.841	220.57
445.273	210.86
445.705	247.27
446.138	167.17
446.57	174.46
447.002	232.71
447.434	247.27
447.867	254.55
448.299	271.55
448.731	179.31
449.163	179.31
449.595	208.44
450.026	259.41
450.458	179.31
450.89	232.71
451.322	206.01
451.754	237.56
452.185	239.99
452.617	252.13
453.048	215.72
453.48	223
453.911	273.97
454.343	208.44
454.774	288.54
455.205	278.83
455.637	218.15
456.068	244.85
456.499	242.42
456.93	237.56
457.361	225.43
457.792	184.17
458.223	247.27
458.654	259.41
459.085	261.84
459.516	278.83
459.947	276.4
460.378	269.12
460.808	264.26
461.239	218.15
461.669	223
462.1	230.28
462.531	254.55
462.961	281.25
463.391	227.86
463.822	303.1
464.252	249.7
464.682	159.89
465.113	227.86
465.543	254.55
465.973	218.15
466.403	230.28
466.833	186.59
467.263	193.87
467.693	235.14
468.123	220.57
468.553	232.71
468.983	276.4
469.412	259.41
469.842	271.55
470.272	249.7
470.701	191.45
471.131	191.45
471.56	172.03
471.99	218.15
472.419	172.03
472.849	174.46
473.278	206.01
473.707	227.86
474.136	227.86
474.566	247.27
474.995	281.25
475.424	213.29
475.853	172.03
476.282	220.57
476.711	128.34
477.14	145.33
477.569	184.17
477.997	261.84
478.426	232.71
478.855	186.59
479.283	203.58
479.712	288.54
480.141	196.3
480.569	138.05
480.998	176.88
481.426	191.45
481.854	152.61
482.283	191.45
482.711	167.17
483.139	249.7
483.567	130.77
483.995	213.29
484.424	223
484.852	172.03
485.28	203.58
485.708	227.86
486.135	140.48
486.563	239.99
486.991	157.47
487.419	184.17
487.847	179.31
488.274	176.88
488.702	230.28
489.129	184.17
489.557	176.88
489.984	167.17
490.412	244.85
490.839	249.7
491.266	196.3
491.694	196.3
492.121	232.71
492.548	230.28
492.975	213.29
493.402	179.31
493.829	169.6
494.256	159.89
494.683	108.92
495.11	196.3
495.537	142.9
495.964	89.5
496.39	184.17
496.817	155.04
497.244	191.45
497.67	167.17
498.097	191.45
498.523	191.45
498.95	130.77
499.376	237.56
499.803	215.72
500.229	84.65
500.655	196.3
501.081	215.72
501.508	172.03
501.934	213.29
502.36	164.75
502.786	218.15
503.212	203.58
503.638	164.75
504.064	152.61
504.489	249.7
504.915	281.25
505.341	159.89
505.767	218.15
506.192	232.71
506.618	138.05
507.043	208.44
507.469	123.48
507.894	169.6
508.32	208.44
508.745	176.88
509.17	118.63
509.596	157.47
510.021	247.27
510.446	242.42
510.871	142.9
511.296	196.3
511.721	138.05
512.146	196.3
512.571	223
512.996	189.02
513.421	203.58
513.845	230.28
514.27	218.15
514.695	176.88
515.119	215.72
515.544	169.6
515.969	169.6
516.393	181.74
516.817	210.86
517.242	196.3
517.666	176.88
518.09	135.62
518.515	138.05
518.939	256.98
519.363	366.21
519.787	130.77
520.211	155.04
520.635	135.62
521.059	206.01
521.483	172.03
521.907	203.58
522.331	198.73
522.754	196.3
523.178	273.97
523.602	159.89
524.025	176.88
524.449	116.2
524.872	147.76
525.296	191.45
525.719	235.14
526.143	213.29
526.566	179.31
526.989	121.06
527.412	235.14
527.836	191.45
528.259	174.46
528.682	184.17
529.105	237.56
529.528	193.87
529.951	184.17
530.374	157.47
530.796	203.58
531.219	225.43
531.642	169.6
532.065	198.73
532.487	157.47
532.91	145.33
533.332	125.91
533.755	184.17
534.177	186.59
534.6	145.33
535.022	196.3
535.444	210.86
535.867	232.71
536.289	220.57
536.711	176.88
537.133	220.57
537.555	176.88
537.977	208.44
538.399	225.43
538.821	210.86
539.243	135.62
539.665	172.03
540.086	164.75
540.508	271.55
540.93	215.72
541.351	237.56
541.773	223
542.195	230.28
542.616	247.27
543.037	138.05
543.459	239.99
543.88	223
544.301	295.82
544.723	174.46
545.144	225.43
545.565	206.01
545.986	218.15
546.407	206.01
546.828	196.3
547.249	179.31
547.67	157.47
548.091	169.6
548.512	179.31
548.932	232.71
549.353	252.13
549.774	223
550.194	215.72
550.615	215.72
551.035	218.15
551.456	159.89
551.876	189.02
552.296	193.87
552.717	174.46
553.137	150.18
553.557	172.03
553.977	191.45
554.397	230.28
554.817	135.62
555.237	113.78
555.657	164.75
556.077	213.29
556.497	179.31
556.917	227.86
557.337	191.45
557.756	140.48
558.176	142.9
558.596	225.43
559.015	167.17
559.435	140.48
559.854	159.89
560.274	157.47
560.693	159.89
561.112	145.33
561.532	201.16
561.951	169.6
562.37	145.33
562.789	176.88
563.208	123.48
563.627	230.28
564.046	223
564.465	206.01
564.884	230.28
565.303	159.89
565.722	227.86
566.14	196.3
566.559	254.55
566.978	167.17
567.396	201.16
567.815	225.43
568.233	227.86
568.652	203.58
569.07	193.87
569.489	210.86
569.907	196.3
570.325	196.3
570.743	269.12
571.161	191.45
571.58	261.84
571.998	230.28
572.416	256.98
572.833	196.3
573.251	133.19
573.669	215.72
574.087	142.9
574.505	169.6
574.922	261.84
575.34	193.87
575.758	213.29
576.175	186.59
576.593	191.45
577.01	179.31
577.428	174.46
577.845	1650.21
578.262	295.82
578.68	162.32
579.097	215.72
579.514	176.88
579.931	152.61
580.348	186.59
580.765	189.02
581.182	159.89
581.599	196.3
582.016	196.3
582.433	186.59
582.849	121.06
583.266	186.59
583.683	208.44
584.099	213.29
584.516	128.34
584.933	203.58
585.349	206.01
585.765	206.01
586.182	172.03
586.598	198.73
587.014	264.26
587.431	140.48
587.847	150.18
588.263	184.17
588.679	213.29
589.095	145.33
589.511	239.99
589.927	162.32
590.343	230.28
590.759	210.86
591.174	176.88
591.59	167.17
592.006	162.32
592.421	159.89
592.837	116.2
593.252	215.72
593.668	215.72
594.083	215.72
594.499	213.29
594.914	186.59
595.329	145.33
595.745	235.14
596.16	196.3
596.575	167.17
596.99	189.02
597.405	206.01
597.82	189.02
598.235	210.86
598.65	159.89
599.065	147.76
599.479	152.61
599.894	174.46
600.309	135.62
600.724	237.56
601.138	130.77
601.553	247.27
601.967	191.45
602.382	159.89
602.796	186.59
603.21	174.46
603.625	123.48
604.039	157.47
604.453	184.17
604.867	208.44
605.281	140.48
605.695	138.05
606.109	225.43
606.523	145.33
606.937	138.05
607.351	293.39
607.765	135.62
608.178	215.72
608.592	133.19
609.006	223
609.419	237.56
609.833	167.17
610.246	147.76
610.66	172.03
611.073	186.59
611.487	147.76
611.9	213.29
612.313	181.74
612.726	179.31
613.139	164.75
613.553	147.76
613.966	181.74
614.379	152.61
614.792	169.6
615.204	167.17
615.617	244.85
616.03	227.86
616.443	155.04
616.856	181.74
617.268	225.43
617.681	242.42
618.093	220.57
618.506	237.56
618.918	213.29
619.331	157.47
619.743	206.01
620.155	186.59
620.568	172.03
620.98	223
621.392	189.02
621.804	223
622.216	155.04
622.628	203.58
623.04	162.32
623.452	135.62
623.864	108.92
624.276	147.76
624.687	159.89
625.099	82.22
625.511	215.72
625.922	176.88
626.334	208.44
626.745	218.15
627.157	218.15
627.568	164.75
627.979	193.87
628.391	174.46
628.802	145.33
629.213	157.47
629.624	186.59
630.035	159.89
630.446	142.9
630.857	213.29
631.268	208.44
631.679	220.57
632.09	147.76
632.501	191.45
632.912	169.6
633.322	223
633.733	196.3
634.144	150.18
634.554	210.86
634.965	201.16
635.375	159.89
635.785	191.45
636.196	159.89
636.606	133.19
637.016	237.56
637.427	152.61
637.837	193.87
638.247	235.14
638.657	111.35
639.067	96.79
639.477	162.32
639.887	162.32
640.297	235.14
640.706	181.74
641.116	189.02
641.526	138.05
641.935	169.6
642.345	84.65
642.755	193.87
643.164	223
643.573	196.3
643.983	223
644.392	164.75
644.801	150.18
645.211	145.33
645.62	164.75
646.029	162.32
646.438	142.9
646.847	186.59
647.256	125.91
647.665	150.18
648.074	191.45
648.483	210.86
648.892	104.07
649.3	191.45
649.709	138.05
650.118	157.47
650.526	189.02
650.935	179.31
651.343	237.56
651.752	203.58
652.16	142.9
652.568	210.86
652.977	191.45
653.385	249.7
653.793	203.58
654.201	181.74
654.609	206.01
655.017	159.89
655.425	191.45
655.833	157.47
656.241	181.74
656.649	198.73
657.057	169.6
657.464	225.43
657.872	167.17
658.28	111.35
658.687	138.05
659.095	193.87
659.502	138.05
659.91	172.03
660.317	215.72
660.724	174.46
661.132	155.04
661.539	213.29
661.946	157.47
662.353	159.89
662.76	189.02
663.167	198.73
663.574	167.17
663.981	155.04
664.388	159.89
664.795	145.33
665.202	186.59
665.608	196.3
666.015	152.61
666.422	181.74
666.828	176.88
667.235	135.62
667.641	213.29
668.047	155.04
668.454	179.31
668.86	159.89
669.266	227.86
669.673	218.15
670.079	230.28
670.485	203.58
670.891	130.77
671.297	116.2
671.703	94.36
672.109	193.87
672.515	133.19
672.92	184.17
673.326	172.03
673.732	172.03
674.138	179.31
674.543	138.05
674.949	159.89
675.354	150.18
675.76	201.16
676.165	133.19
676.57	167.17
676.976	196.3
677.381	164.75
677.786	254.55
678.191	99.21
678.596	167.17
679.001	176.88
679.406	174.46
679.811	108.92
680.216	181.74
680.621	189.02
681.026	130.77
681.43	186.59
681.835	135.62
682.24	159.89
682.644	239.99
683.049	145.33
683.453	145.33
683.858	206.01
684.262	206.01
684.667	121.06
685.071	169.6
685.475	189.02
685.879	159.89
686.283	213.29
686.687	189.02
687.091	213.29
687.495	91.93
687.899	196.3
688.303	215.72
688.707	252.13
689.111	179.31
689.514	198.73
689.918	152.61
690.322	201.16
690.725	133.19
691.129	189.02
691.532	208.44
691.936	162.32
692.339	223
692.742	155.04
693.146	157.47
693.549	247.27
693.952	215.72
694.355	193.87
694.758	167.17
695.161	140.48
695.564	179.31
695.967	184.17
696.37	150.18
696.773	235.14
697.175	181.74
697.578	174.46
697.981	227.86
698.383	210.86
698.786	186.59
699.188	147.76
699.591	191.45
699.993	172.03
700.395	218.15
700.798	138.05
701.2	213.29
701.602	201.16
702.004	259.41
702.406	235.14
702.808	184.17
703.21	232.71
703.612	225.43
704.014	174.46
704.416	203.58
704.818	266.69
705.219	215.72
705.621	206.01
706.023	213.29
706.424	227.86
706.826	252.13
707.227	193.87
707.629	193.87
708.03	218.15
708.431	239.99
708.832	242.42
709.234	223
709.635	276.4
710.036	254.55
710.437	196.3
710.838	232.71
711.239	230.28
711.64	237.56
712.041	193.87
712.441	300.67
712.842	288.54
713.243	261.84
713.643	320.09
714.044	249.7
714.445	230.28
714.845	324.94
715.246	227.86
715.646	271.55
716.046	249.7
716.447	288.54
716.847	278.83
717.247	273.97
717.647	300.67
718.047	252.13
718.447	332.23
718.847	378.34
719.247	346.79
719.647	409.9
720.047	317.66
720.446	392.91
720.846	375.92
721.246	337.08
721.645	368.63
722.045	366.21
722.444	424.46
722.844	431.74
723.243	463.3
723.643	451.16
724.042	557.96
724.441	463.3
724.84	480.29
725.24	417.18
725.639	456.01
726.038	516.69
726.437	497.28
726.836	490
727.234	490
727.633	540.97
728.032	519.12
728.431	562.81
728.83	477.86
729.228	577.38
729.627	608.93
730.025	635.63
730.424	647.76
730.822	764.27
731.22	795.83
731.619	795.83
732.017	815.24
732.415	820.1
732.813	897.77
733.212	1113.79
733.61	1019.13
734.008	1101.66
734.406	1108.94
734.803	1290.98
735.201	1298.26
735.599	1392.92
735.997	1499.72
736.395	1613.8
736.792	1633.22
737.19	1805.55
737.587	1820.11
737.985	1907.49
738.382	2011.86
738.78	2191.48
739.177	2278.86
739.574	2395.36
739.971	2402.65
740.369	2635.66
740.766	2693.91
741.163	2807.99
741.56	2951.2
741.957	3007.02
742.354	3036.15
742.751	3516.74
743.147	3468.2
743.544	3574.99
743.941	3652.67
744.338	3878.4
744.734	4011.89
745.131	4235.2
745.527	4565.3
745.924	4781.32
746.32	4922.1
746.716	5123.56
747.113	5291.04
747.509	5684.25
747.905	6252.22
748.301	6203.68
748.697	6407.56
749.093	6764.36
749.489	7024.08
749.885	7366.32
750.281	7730.4
750.677	7822.63
751.073	8147.88
751.468	8444
751.864	8810.51
752.26	9135.76
752.655	9577.52
753.051	9897.91
753.446	10376.07
753.842	10640.64
754.237	11315.41
754.632	10941.61
755.028	11259.58
755.423	12062.99
755.818	11740.17
756.213	12072.7
756.608	12667.37
757.003	12910.09
757.398	12713.49
757.793	13126.11
758.188	13346.99
758.583	13655.25
758.977	13502.33
759.372	14203.8
759.767	14985.37
760.161	15536.35
760.556	16165
760.95	17009.67
761.345	18080.07
761.739	18888.34
762.133	18881.06
762.527	19684.47
762.922	20317.97
763.316	20689.34
763.71	21691.78
764.104	22364.12
764.498	22582.57
764.892	22864.13
765.286	23216.08
765.68	24337.45
766.073	24099.59
766.467	23652.98
766.861	25660.29
767.255	26633.61
767.648	26684.58
768.042	26720.99
768.435	28194.31
768.829	28793.83
769.222	28058.39
769.615	28801.12
770.008	29403.07
770.402	29378.79
770.795	29160.34
771.188	29643.36
771.581	30138.51
771.974	29606.95
772.367	29619.09
772.76	30102.11
773.153	29662.78
773.545	29119.08
773.938	29650.64
774.331	30728.33
774.724	31781.74
775.116	31480.77
775.509	32065.73
775.901	34347.32
776.294	35242.96
776.686	34451.69
777.078	35145.87
777.471	37325.52
777.863	38905.64
778.255	38951.76
778.647	40391.1
779.039	40980.92
779.431	40400.81
779.823	39167.78
780.215	39956.63
780.607	40762.47
780.999	40713.92
781.39	40294.01
781.782	41541.6
782.174	42289.19
782.565	42031.9
782.957	41665.39
783.348	43238.23
783.74	44216.4
784.131	43121.73
784.522	42196.95
784.914	42381.42
785.305	43937.27
785.696	42381.42
786.087	41082.86
786.478	41340.15
786.869	41417.82
787.26	39539.15
787.651	37405.62
788.042	37922.62
788.433	37553.68
788.823	36393.47
789.214	34667.71
789.605	34509.94
789.995	35279.37
790.386	33405.56
790.776	32473.5
791.167	33213.81
791.557	35755.11
791.948	34573.05
792.338	33949.25
792.728	36007.54
793.118	36910.46
793.508	35944.43
793.898	35332.77
794.288	35451.7
794.678	37053.67
795.068	36825.51
795.458	35451.7
795.848	35505.1
796.238	37170.18
796.627	36485.7
797.017	34408
797.406	35201.7
797.796	36393.47
798.185	36238.12
798.575	34898.3
798.964	34276.93
799.354	36891.05
799.743	36903.18
800.132	35963.85
800.521	35272.09
800.91	36077.93
801.299	36048.8
801.688	34174.99
802.077	33929.84
802.466	34917.72
802.855	35267.24
803.244	32791.47
803.633	32070.58
804.021	32424.96
804.41	33036.62
804.799	31293.87
805.187	29871.52
805.576	29577.83
805.964	30320.56
806.352	28420.04
806.741	27519.54
807.129	27021.96
807.517	28063.24
807.905	28303.53
808.293	26555.93
808.681	27276.82
809.069	28082.66
809.457	28988.01
809.845	27279.25
810.233	27085.07
810.621	29024.42
811.009	29077.82
811.396	27995.28
811.784	27274.39
812.171	27859.35
812.559	29427.34
812.946	27847.22
813.334	26051.07
813.721	25818.06
814.108	26645.74
814.496	25636.02
814.883	24199.1
815.27	25063.19
815.657	26114.18
816.044	26526.81
816.431	24490.37
816.818	23873.85
817.205	25162.71
817.592	26150.59
817.979	24483.09
818.365	22939.37
818.752	22308.3
819.139	22864.13
819.525	22451.5
819.912	20890.8
820.298	20373.8
820.685	20677.2
821.071	20837.4
821.457	19371.36
821.843	17742.69
822.23	18160.17
822.616	17966
823.002	17232.97
823.388	15531.49
823.774	15393.14
824.16	15414.98
824.546	14951.39
824.931	13863.99
825.317	13560.59
825.703	14055.74
826.089	14521.77
826.474	13815.45
826.86	12902.81
827.245	13033.88
827.631	13555.73
828.016	13181.94
828.401	12087.26
828.787	11754.73
829.172	12322.7
829.557	12164.93
829.942	11298.42
830.327	10890.64
830.712	10880.93
831.097	10953.75
831.482	10759.57
831.867	10011.99
832.252	9594.51
832.636	10077.52
833.021	9822.66
833.406	9487.71
833.79	8871.19
834.175	8897.89
834.559	9143.04
834.944	8987.7
835.328	8264.39
835.713	8053.22
836.097	7956.13
836.481	8031.37
836.865	7543.5
837.249	7026.5
837.633	6664.85
838.017	7128.45
838.401	6844.46
838.785	6329.89
839.169	5883.28
839.553	6036.2
839.937	6024.06
840.32	5657.55
840.704	5106.57
841.087	4900.26
841.471	4897.83
841.854	4963.37
842.238	4558.02
842.621	4164.81
843.004	4007.04
843.388	4320.15
843.771	4303.16
844.154	4016.75
844.537	3820.14
844.92	3856.55
845.303	4150.25
845.686	3795.87
846.069	3507.03
846.452	3584.7
846.834	3613.83
847.217	3577.42
847.6	3456.06
847.982	3227.9
848.365	3125.96
848.748	3257.03
849.13	3215.77
849.512	2895.37
849.895	2868.67
850.277	2822.56
850.659	3028.87
851.041	2902.65
851.423	2720.61
851.806	2422.06
852.188	2657.5
852.57	2584.69
852.951	2582.26
853.333	2388.08
853.715	2237.6
854.097	2373.52
854.479	2388.08
854.86	2288.57
855.242	2094.39
855.623	1878.37
856.005	1946.33
856.386	1919.63
856.768	1824.97
857.149	1715.74
857.53	1625.94
857.911	1684.19
858.292	1696.32
858.674	1511.86
859.055	1385.64
859.436	1354.09
859.817	1366.22
860.197	1414.77
860.578	1266.71
860.959	1150.2
861.34	1189.04
861.72	1193.89
862.101	1208.45
862.482	997.28
862.862	917.19
863.243	985.15
863.623	1053.11
864.003	1060.39
864.384	866.21
864.764	905.05
865.144	909.9
865.524	892.91
865.904	912.33
866.284	752.14
866.664	781.26
867.044	769.13
867.424	820.1
867.804	771.55
868.183	703.59
868.563	584.66
868.943	574.95
869.322	662.33
869.702	696.31
870.081	591.94
870.461	587.08
870.84	567.67
871.22	587.08
871.599	584.66
871.978	490
872.357	477.86
872.736	572.52
873.115	514.27
873.494	439.02
873.873	441.45
874.252	402.62
874.631	436.6
875.01	439.02
875.388	456.01
875.767	441.45
876.146	341.93
876.524	358.93
876.903	368.63
877.281	329.8
877.66	349.22
878.038	283.68
878.416	356.5
878.794	293.39
879.173	315.24
879.551	332.23
879.929	324.94
880.307	317.66
880.685	252.13
881.063	337.08
881.441	210.86
881.818	298.24
882.196	239.99
882.574	242.42
882.951	181.74
883.329	210.86
883.707	256.98
884.084	290.96
884.461	256.98
884.839	254.55
885.216	244.85
885.593	310.38
885.971	223
886.348	239.99
886.725	239.99
887.102	249.7
887.479	215.72
887.856	242.42
888.233	290.96
888.609	293.39
888.986	213.29
889.363	198.73
889.74	215.72
890.116	242.42
890.493	172.03
890.869	220.57
891.246	271.55
891.622	256.98
891.998	157.47
892.375	198.73
892.751	244.85
893.127	159.89
893.503	150.18
893.879	167.17
894.255	235.14
894.631	172.03
895.007	89.5
895.383	142.9
895.759	157.47
896.134	179.31
896.51	203.58
896.886	176.88
897.261	172.03
897.637	208.44
898.012	152.61
898.388	79.79
898.763	193.87
899.138	220.57
899.514	130.77
899.889	169.6
900.264	57.95
900.639	218.15
901.014	213.29
901.389	186.59
901.764	150.18
902.139	108.92
902.513	186.59
902.888	140.48
903.263	147.76
903.638	157.47
904.012	193.87
904.387	145.33
904.761	133.19
905.136	193.87
905.51	152.61
905.884	198.73
906.259	164.75
906.633	159.89
907.007	162.32
907.381	196.3
907.755	162.32
908.129	164.75
908.503	162.32
908.877	121.06
909.251	101.64
909.624	111.35
909.998	189.02
910.372	203.58
910.745	118.63
911.119	94.36
911.492	167.17
911.866	169.6
912.239	142.9
912.612	184.17
912.986	91.93
913.359	145.33
913.732	108.92
914.105	147.76
914.478	147.76
914.851	142.9
915.224	96.79
915.597	135.62
915.97	118.63
916.343	167.17
916.715	210.86
917.088	147.76
917.461	133.19
917.833	184.17
918.206	261.84
918.578	181.74
918.951	157.47
919.323	193.87
919.695	128.34
920.067	159.89
920.44	142.9
920.812	142.9
921.184	172.03
921.556	189.02
921.928	176.88
922.3	186.59
922.672	198.73
923.043	167.17
923.415	167.17
923.787	147.76
924.158	176.88
924.53	128.34
924.901	164.75
925.273	201.16
925.644	118.63
926.016	111.35
926.387	189.02
926.758	184.17
927.129	210.86
927.5	150.18
927.872	140.48
928.243	174.46
928.613	150.18
928.984	140.48
929.355	162.32
929.726	159.89
930.097	164.75
930.467	155.04
930.838	179.31
931.209	99.21
931.579	138.05
931.95	196.3
932.32	162.32
932.69	164.75
933.061	142.9
933.431	108.92
933.801	101.64
934.171	96.79
934.541	133.19
934.911	121.06
935.281	111.35
935.651	147.76
936.021	169.6
936.391	140.48
936.761	121.06
937.13	179.31
937.5	142.9
937.87	130.77
938.239	130.77
938.609	164.75
938.978	152.61
939.347	203.58
939.717	150.18
940.086	87.08
940.455	184.17
940.824	218.15
941.193	186.59
941.562	181.74
941.931	152.61
942.3	210.86
942.669	152.61
943.038	176.88
943.407	142.9
943.775	157.47
944.144	179.31
944.513	239.99
944.881	121.06
945.25	116.2
945.618	218.15
945.986	176.88
946.355	147.76
946.723	133.19
947.091	162.32
947.459	162.32
947.827	91.93
948.195	159.89
948.563	225.43
948.931	181.74
949.299	150.18
949.667	70.09
950.035	201.16
950.402	191.45
950.77	128.34
951.138	150.18
951.505	184.17
951.873	135.62
952.24	162.32
952.607	108.92
952.975	140.48
953.342	48.24
953.709	121.06
954.076	113.78
954.443	159.89
954.81	155.04
955.177	152.61
955.544	89.5
955.911	150.18
956.278	227.86
956.645	223
957.012	142.9
957.378	121.06
957.745	191.45
958.111	162.32
958.478	227.86
958.844	249.7
959.211	172.03
959.577	121.06
959.943	155.04
960.309	215.72
960.675	150.18
961.042	125.91
961.408	121.06
961.774	150.18
962.139	91.93
962.505	145.33
962.871	89.5
963.237	159.89
963.603	215.72
963.968	162.32
964.334	196.3
964.699	125.91
965.065	121.06
965.43	123.48
965.796	130.77
966.161	145.33
966.526	179.31
966.891	128.34
967.256	184.17
967.622	125.91
967.987	191.45
968.352	113.78
968.716	142.9
969.081	140.48
969.446	121.06
969.811	133.19
970.176	101.64
970.54	208.44
970.905	135.62
971.269	155.04
971.634	159.89
971.998	138.05
972.363	130.77
972.727	123.48
973.091	128.34
973.455	223
973.819	104.07
974.183	142.9
974.547	142.9
974.911	152.61
975.275	206.01
975.639	169.6
976.003	123.48
976.367	150.18
976.73	111.35
977.094	174.46
977.458	181.74
977.821	208.44
978.185	89.5
978.548	130.77
978.911	130.77
979.275	186.59
979.638	203.58
980.001	239.99
980.364	142.9
980.727	150.18
981.09	152.61
981.453	169.6
981.816	123.48
982.179	191.45
982.542	176.88
982.905	118.63
983.267	140.48
983.63	184.17
983.992	196.3
984.355	184.17
984.717	125.91
985.08	130.77
985.442	152.61
985.804	142.9
986.167	172.03
986.529	176.88
986.891	201.16
987.253	225.43
987.615	189.02
987.977	167.17
988.339	179.31
988.701	184.17
989.062	77.37
989.424	155.04
989.786	150.18
990.147	198.73
990.509	65.23
990.87	145.33
991.232	198.73
991.593	179.31
991.955	181.74
992.316	138.05
992.677	106.49
993.038	140.48
993.399	172.03
993.76	65.23
994.121	191.45
994.482	104.07
994.843	176.88
995.204	123.48
995.565	116.2
995.926	162.32
996.286	193.87
996.647	159.89
997.007	147.76
997.368	140.48
997.728	133.19
998.089	159.89
998.449	152.61
998.809	113.78
999.169	164.75
999.53	147.76
999.89	155.04
1000.25	116.2
1000.61	147.76
1000.97	169.6
1001.329	152.61
1001.689	96.79
1002.049	179.31
1002.409	198.73
1002.768	150.18
1003.128	174.46
1003.487	172.03
1003.847	208.44
1004.206	147.76
1004.566	142.9
1004.925	189.02
1005.284	242.42
1005.643	172.03
1006.003	108.92
1006.362	184.17
1006.721	150.18
1007.08	186.59
1007.438	227.86
1007.797	179.31
1008.156	179.31
1008.515	157.47
1008.874	150.18
1009.232	176.88
1009.591	150.18
1009.949	128.34
1010.308	184.17
1010.666	198.73
1011.024	150.18
1011.383	201.16
1011.741	91.93
1012.099	60.38
1012.457	118.63
1012.815	164.75
1013.173	162.32
1013.531	215.72
1013.889	179.31
1014.247	121.06
1014.605	176.88
1014.962	176.88
1015.32	108.92
1015.678	176.88
1016.035	128.34
1016.393	169.6
1016.75	184.17
1017.107	125.91
1017.465	121.06
1017.822	113.78
1018.179	181.74
1018.536	133.19
1018.894	108.92
1019.251	150.18
1019.608	191.45
1019.964	223
1020.321	159.89
1020.678	169.6
1021.035	157.47
1021.392	147.76
1021.748	118.63
1022.105	111.35
1022.461	191.45
1022.818	172.03
1023.174	108.92
1023.531	218.15
1023.887	208.44
1024.243	186.59
1024.599	50.67
1024.955	121.06
1025.311	174.46
1025.667	213.29
1026.023	91.93
1026.379	179.31
1026.735	125.91
1027.091	101.64
1027.447	113.78
