189.514	126.52
189.973	126.52
190.431	126.52
190.889	-19.11
191.348	-72.51
191.806	-19.11
192.264	5.16
192.722	-33.68
193.18	-4.55
193.638	31.86
194.096	2.73
194.554	-43.39
195.012	43.99
195.47	-43.39
195.928	-38.53
196.385	-36.1
196.843	-14.26
197.301	34.28
197.758	34.28
198.216	24.58
198.674	10.01
199.131	27
199.589	68.27
200.046	111.96
200.503	63.41
200.961	114.38
201.418	136.23
201.875	187.2
202.332	119.24
202.79	29.43
203.247	102.25
203.704	138.66
204.161	92.54
204.618	150.79
205.075	124.09
205.532	162.93
205.989	119.24
206.445	116.81
206.902	206.62
207.359	260.02
207.816	141.08
208.272	153.22
208.729	143.51
209.185	148.36
209.642	143.51
210.098	170.21
210.555	141.08
211.011	153.22
211.467	179.92
211.924	175.06
212.38	131.37
212.836	165.35
213.292	155.65
213.748	109.53
214.204	143.51
214.66	172.64
215.116	141.08
215.572	199.34
216.028	204.19
216.484	160.5
216.94	158.07
217.396	189.63
217.851	192.05
218.307	111.96
218.763	155.65
219.218	155.65
219.674	153.22
220.129	204.19
220.585	107.1
221.04	111.96
221.496	82.83
221.951	199.34
222.406	131.37
222.861	201.76
223.317	162.93
223.772	111.96
224.227	170.21
224.682	114.38
225.137	143.51
225.592	182.35
226.047	138.66
226.502	126.52
226.957	213.9
227.411	167.78
227.866	121.66
228.321	138.66
228.776	170.21
229.23	138.66
229.685	124.09
230.139	131.37
230.594	189.63
231.048	209.04
231.503	104.67
231.957	170.21
232.411	160.5
232.865	148.36
233.32	133.8
233.774	133.8
234.228	73.12
234.682	175.06
235.136	46.42
235.59	167.78
236.044	189.63
236.498	189.63
236.952	141.08
237.406	121.66
237.86	148.36
238.313	141.08
238.767	160.5
239.221	111.96
239.674	143.51
240.128	141.08
240.581	177.49
241.035	136.23
241.488	73.12
241.942	128.95
242.395	87.68
242.848	121.66
243.301	119.24
243.755	228.46
244.208	99.82
244.661	82.83
245.114	85.26
245.567	104.67
246.02	107.1
246.473	160.5
246.926	172.64
247.379	99.82
247.832	262.44
248.284	133.8
248.737	124.09
249.19	192.05
249.642	141.08
250.095	133.8
250.547	148.36
251	128.95
251.452	99.82
251.905	124.09
252.357	213.9
252.81	170.21
253.262	138.66
253.714	153.22
254.166	75.55
254.618	184.77
255.07	97.39
255.523	131.37
255.975	128.95
256.427	133.8
256.878	143.51
257.33	92.54
257.782	194.48
258.234	131.37
258.686	196.91
259.137	128.95
259.589	206.62
260.041	167.78
260.492	128.95
260.944	121.66
261.395	170.21
261.847	150.79
262.298	143.51
262.749	148.36
263.201	211.47
263.652	133.8
264.103	182.35
264.554	131.37
265.005	204.19
265.457	104.67
265.908	213.9
266.359	136.23
266.809	201.76
267.26	126.52
267.711	107.1
268.162	179.92
268.613	119.24
269.064	92.54
269.514	194.48
269.965	128.95
270.415	158.07
270.866	150.79
271.316	177.49
271.767	121.66
272.217	131.37
272.668	187.2
273.118	170.21
273.568	107.1
274.019	194.48
274.469	175.06
274.919	121.66
275.369	124.09
275.819	187.2
276.269	131.37
276.719	172.64
277.169	85.26
277.619	150.79
278.069	121.66
278.518	148.36
278.968	182.35
279.418	158.07
279.867	116.81
280.317	172.64
280.767	158.07
281.216	158.07
281.666	175.06
282.115	145.94
282.564	124.09
283.014	170.21
283.463	128.95
283.912	85.26
284.361	141.08
284.811	158.07
285.26	182.35
285.709	143.51
286.158	192.05
286.607	175.06
287.056	167.78
287.505	153.22
287.953	102.25
288.402	172.64
288.851	170.21
289.3	177.49
289.748	165.35
290.197	124.09
290.646	170.21
291.094	184.77
291.543	170.21
291.991	136.23
292.439	184.77
292.888	216.33
293.336	211.47
293.784	194.48
294.233	250.31
294.681	111.96
295.129	138.66
295.577	109.53
296.025	150.79
296.473	170.21
296.921	160.5
297.369	145.94
297.817	131.37
298.264	128.95
298.712	128.95
299.16	111.96
299.608	204.19
300.055	155.65
300.503	170.21
300.95	192.05
301.398	196.91
301.845	204.19
302.293	155.65
302.74	141.08
303.187	213.9
303.635	204.19
304.082	160.5
304.529	155.65
304.976	155.65
305.423	162.93
305.87	114.38
306.317	160.5
306.764	145.94
307.211	194.48
307.658	233.32
308.105	158.07
308.552	143.51
308.998	121.66
309.445	116.81
309.892	121.66
310.338	155.65
310.785	143.51
311.231	199.34
311.678	175.06
312.124	167.78
312.571	124.09
313.017	196.91
313.463	145.94
313.909	182.35
314.356	121.66
314.802	138.66
315.248	245.45
315.694	187.2
316.14	107.1
316.586	158.07
317.032	121.66
317.478	145.94
317.923	184.77
318.369	160.5
318.815	145.94
319.261	194.48
319.706	131.37
320.152	160.5
320.597	126.52
321.043	92.54
321.488	182.35
321.934	167.78
322.379	172.64
322.824	194.48
323.27	145.94
323.715	184.77
324.16	150.79
324.605	162.93
325.05	124.09
325.495	150.79
325.94	172.64
326.385	121.66
326.83	204.19
327.275	192.05
327.72	187.2
328.165	111.96
328.61	172.64
329.054	158.07
329.499	170.21
329.943	170.21
330.388	128.95
330.832	201.76
331.277	162.93
331.721	165.35
332.166	165.35
332.61	60.98
333.054	162.93
333.499	167.78
333.943	192.05
334.387	194.48
334.831	179.92
335.275	179.92
335.719	187.2
336.163	206.62
336.607	128.95
337.051	141.08
337.495	216.33
337.938	194.48
338.382	182.35
338.826	167.78
339.269	209.04
339.713	165.35
340.157	97.39
340.6	267.3
341.044	153.22
341.487	170.21
341.93	209.04
342.374	221.18
342.817	192.05
343.26	216.33
343.703	230.89
344.146	126.52
344.59	160.5
345.033	177.49
345.476	133.8
345.919	223.61
346.361	87.68
346.804	150.79
347.247	175.06
347.69	243.03
348.133	114.38
348.575	150.79
349.018	196.91
349.461	179.92
349.903	126.52
350.346	155.65
350.788	143.51
351.23	175.06
351.673	107.1
352.115	201.76
352.557	206.62
353	153.22
353.442	167.78
353.884	167.78
354.326	177.49
354.768	143.51
355.21	85.26
355.652	153.22
356.094	158.07
356.536	155.65
356.978	162.93
357.419	177.49
357.861	162.93
358.303	141.08
358.744	160.5
359.186	189.63
359.627	213.9
360.069	192.05
360.51	235.74
360.952	206.62
361.393	111.96
361.834	201.76
362.276	238.17
362.717	99.82
363.158	194.48
363.599	172.64
364.04	175.06
364.481	189.63
364.922	150.79
365.363	153.22
365.804	194.48
366.245	187.2
366.686	141.08
367.126	170.21
367.567	230.89
368.008	148.36
368.448	235.74
368.889	148.36
369.33	133.8
369.77	148.36
370.21	126.52
370.651	182.35
371.091	170.21
371.531	158.07
371.972	121.66
372.412	155.65
372.852	126.52
373.292	85.26
373.732	160.5
374.172	187.2
374.612	194.48
375.052	136.23
375.492	177.49
375.932	128.95
376.372	160.5
376.811	121.66
377.251	94.97
377.691	216.33
378.13	192.05
378.57	221.18
379.009	235.74
379.449	192.05
379.888	213.9
380.328	126.52
380.767	80.4
381.206	175.06
381.645	155.65
382.085	99.82
382.524	238.17
382.963	209.04
383.402	131.37
383.841	170.21
384.28	175.06
384.719	264.87
385.158	165.35
385.596	165.35
386.035	196.91
386.474	167.78
386.913	143.51
387.351	172.64
387.79	196.91
388.228	126.52
388.667	175.06
389.105	128.95
389.544	150.79
389.982	148.36
390.42	148.36
390.859	141.08
391.297	107.1
391.735	150.79
392.173	187.2
392.611	226.04
393.049	177.49
393.487	155.65
393.925	184.77
394.363	145.94
394.801	143.51
395.239	148.36
395.676	160.5
396.114	160.5
396.552	175.06
396.989	148.36
397.427	204.19
397.864	184.77
398.302	199.34
398.739	145.94
399.177	121.66
399.614	170.21
400.051	148.36
400.488	172.64
400.926	172.64
401.363	143.51
401.8	179.92
402.237	141.08
402.674	158.07
403.111	179.92
403.548	196.91
403.985	114.38
404.421	121.66
404.858	162.93
405.295	92.54
405.732	99.82
406.168	97.39
406.605	175.06
407.041	167.78
407.478	92.54
407.914	213.9
408.351	150.79
408.787	172.64
409.223	172.64
409.66	192.05
410.096	199.34
410.532	182.35
410.968	128.95
411.404	99.82
411.84	150.79
412.276	218.75
412.712	111.96
413.148	119.24
413.584	31.86
414.02	136.23
414.455	138.66
414.891	131.37
415.327	243.03
415.762	138.66
416.198	218.75
416.633	145.94
417.069	148.36
417.504	204.19
417.94	155.65
418.375	145.94
418.81	201.76
419.245	121.66
419.681	192.05
420.116	148.36
420.551	138.66
420.986	141.08
421.421	128.95
421.856	243.03
422.291	167.78
422.726	131.37
423.16	189.63
423.595	90.11
424.03	121.66
424.464	126.52
424.899	136.23
425.334	131.37
425.768	102.25
426.203	196.91
426.637	199.34
427.071	250.31
427.506	235.74
427.94	131.37
428.374	160.5
428.809	175.06
429.243	121.66
429.677	204.19
430.111	136.23
430.545	221.18
430.979	182.35
431.413	126.52
431.847	148.36
432.28	172.64
432.714	63.41
433.148	165.35
433.582	184.77
434.015	111.96
434.449	226.04
434.882	199.34
435.316	162.93
435.749	187.2
436.183	131.37
436.616	92.54
437.049	126.52
437.483	116.81
437.916	179.92
438.349	182.35
438.782	165.35
439.215	192.05
439.648	165.35
440.081	136.23
440.514	170.21
440.947	155.65
441.38	141.08
441.813	189.63
442.245	158.07
442.678	189.63
443.111	116.81
443.543	153.22
443.976	165.35
444.408	160.5
444.841	141.08
445.273	104.67
445.705	170.21
446.138	209.04
446.57	165.35
447.002	145.94
447.434	182.35
447.867	124.09
448.299	182.35
448.731	221.18
449.163	209.04
449.595	226.04
450.026	206.62
450.458	158.07
450.89	211.47
451.322	209.04
451.754	194.48
452.185	192.05
452.617	126.52
453.048	260.02
453.48	179.92
453.911	184.77
454.343	223.61
454.774	184.77
455.205	247.88
455.637	141.08
456.068	167.78
456.499	153.22
456.93	167.78
457.361	121.66
457.792	77.97
458.223	221.18
458.654	165.35
459.085	165.35
459.516	192.05
459.947	143.51
460.378	148.36
460.808	143.51
461.239	148.36
461.669	150.79
462.1	177.49
462.531	165.35
462.961	143.51
463.391	138.66
463.822	162.93
464.252	155.65
464.682	182.35
465.113	162.93
465.543	158.07
465.973	155.65
466.403	177.49
466.833	206.62
467.263	257.59
467.693	155.65
468.123	240.6
468.553	162.93
468.983	160.5
469.412	177.49
469.842	184.77
470.272	131.37
470.701	192.05
471.131	155.65
471.56	175.06
471.99	107.1
472.419	175.06
472.849	145.94
473.278	228.46
473.707	192.05
474.136	160.5
474.566	223.61
474.995	121.66
475.424	177.49
475.853	148.36
476.282	133.8
476.711	128.95
477.14	170.21
477.569	172.64
477.997	204.19
478.426	192.05
478.855	136.23
479.283	233.32
479.712	184.77
480.141	175.06
480.569	162.93
480.998	136.23
481.426	136.23
481.854	104.67
482.283	136.23
482.711	153.22
483.139	177.49
483.567	172.64
483.995	175.06
484.424	165.35
484.852	167.78
485.28	133.8
485.708	206.62
486.135	257.59
486.563	131.37
486.991	199.34
487.419	182.35
487.847	179.92
488.274	148.36
488.702	175.06
489.129	175.06
489.557	194.48
489.984	313.42
490.412	216.33
490.839	158.07
491.266	170.21
491.694	206.62
492.121	192.05
492.548	221.18
492.975	211.47
493.402	223.61
493.829	189.63
494.256	201.76
494.683	158.07
495.11	128.95
495.537	158.07
495.964	175.06
496.39	199.34
496.817	138.66
497.244	158.07
497.67	131.37
498.097	235.74
498.523	121.66
498.95	196.91
499.376	172.64
499.803	165.35
500.229	160.5
500.655	114.38
501.081	184.77
501.508	155.65
501.934	148.36
502.36	87.68
502.786	162.93
503.212	121.66
503.638	160.5
504.064	148.36
504.489	150.79
504.915	182.35
505.341	250.31
505.767	204.19
506.192	184.77
506.618	194.48
507.043	243.03
507.469	170.21
507.894	131.37
508.32	94.97
508.745	160.5
509.17	194.48
509.596	155.65
510.021	124.09
510.446	184.77
510.871	187.2
511.296	211.47
511.721	165.35
512.146	148.36
512.571	85.26
512.996	223.61
513.421	165.35
513.845	167.78
514.27	177.49
514.695	209.04
515.119	65.84
515.544	175.06
515.969	160.5
516.393	138.66
516.817	148.36
517.242	182.35
517.666	192.05
518.09	131.37
518.515	175.06
518.939	133.8
519.363	332.83
519.787	184.77
520.211	240.6
520.635	153.22
521.059	121.66
521.483	179.92
521.907	150.79
522.331	143.51
522.754	99.82
523.178	175.06
523.602	145.94
524.025	194.48
524.449	179.92
524.872	114.38
525.296	162.93
525.719	162.93
526.143	209.04
526.566	141.08
526.989	107.1
527.412	167.78
527.836	150.79
528.259	150.79
528.682	109.53
529.105	158.07
529.528	141.08
529.951	184.77
530.374	226.04
530.796	150.79
531.219	175.06
531.642	179.92
532.065	184.77
532.487	196.91
532.91	167.78
533.332	189.63
533.755	233.32
534.177	158.07
534.6	102.25
535.022	133.8
535.444	182.35
535.867	175.06
536.289	158.07
536.711	179.92
537.133	175.06
537.555	167.78
537.977	177.49
538.399	199.34
538.821	121.66
539.243	204.19
539.665	175.06
540.086	184.77
540.508	211.47
540.93	228.46
541.351	189.63
541.773	192.05
542.195	175.06
542.616	281.86
543.037	233.32
543.459	243.03
543.88	274.58
544.301	158.07
544.723	204.19
545.144	291.57
545.565	238.17
545.986	294
546.407	269.73
546.828	187.2
547.249	213.9
547.67	187.2
548.091	136.23
548.512	170.21
548.932	226.04
549.353	192.05
549.774	255.16
550.194	184.77
550.615	170.21
551.035	192.05
551.456	165.35
551.876	221.18
552.296	177.49
552.717	211.47
553.137	184.77
553.557	143.51
553.977	201.76
554.397	116.81
554.817	111.96
555.237	143.51
555.657	124.09
556.077	167.78
556.497	184.77
556.917	131.37
557.337	184.77
557.756	194.48
558.176	160.5
558.596	177.49
559.015	201.76
559.435	94.97
559.854	172.64
560.274	230.89
560.693	286.72
561.112	143.51
561.532	194.48
561.951	136.23
562.37	162.93
562.789	187.2
563.208	162.93
563.627	199.34
564.046	124.09
564.465	170.21
564.884	187.2
565.303	175.06
565.722	145.94
566.14	131.37
566.559	175.06
566.978	182.35
567.396	165.35
567.815	121.66
568.233	184.77
568.652	211.47
569.07	104.67
569.489	179.92
569.907	184.77
570.325	170.21
570.743	138.66
571.161	119.24
571.58	175.06
571.998	201.76
572.416	160.5
572.833	138.66
573.251	126.52
573.669	65.84
574.087	170.21
574.505	187.2
574.922	153.22
575.34	158.07
575.758	138.66
576.175	196.91
576.593	175.06
577.01	133.8
577.428	213.9
577.845	1801.3
578.262	279.43
578.68	182.35
579.097	160.5
579.514	155.65
579.931	187.2
580.348	172.64
580.765	167.78
581.182	187.2
581.599	184.77
582.016	196.91
582.433	209.04
582.849	162.93
583.266	199.34
583.683	228.46
584.099	165.35
584.516	192.05
584.933	196.91
585.349	136.23
585.765	235.74
586.182	119.24
586.598	243.03
587.014	204.19
587.431	196.91
587.847	162.93
588.263	196.91
588.679	243.03
589.095	238.17
589.511	182.35
589.927	196.91
590.343	109.53
590.759	209.04
591.174	211.47
591.59	114.38
592.006	131.37
592.421	153.22
592.837	77.97
593.252	247.88
593.668	184.77
594.083	233.32
594.499	213.9
594.914	175.06
595.329	153.22
595.745	136.23
596.16	189.63
596.575	87.68
596.99	230.89
597.405	131.37
597.82	189.63
598.235	133.8
598.65	145.94
599.065	75.55
599.479	162.93
599.894	133.8
600.309	187.2
600.724	177.49
601.138	133.8
601.553	213.9
601.967	158.07
602.382	209.04
602.796	170.21
603.21	150.79
603.625	172.64
604.039	155.65
604.453	167.78
604.867	162.93
605.281	182.35
605.695	150.79
606.109	223.61
606.523	104.67
606.937	90.11
607.351	277.01
607.765	252.73
608.178	150.79
608.592	192.05
609.006	179.92
609.419	204.19
609.833	216.33
610.246	230.89
610.66	187.2
611.073	204.19
611.487	264.87
611.9	114.38
612.313	194.48
612.726	216.33
613.139	189.63
613.553	243.03
613.966	201.76
614.379	182.35
614.792	182.35
615.204	119.24
615.617	128.95
616.03	170.21
616.443	182.35
616.856	226.04
617.268	194.48
617.681	158.07
618.093	240.6
618.506	189.63
618.918	199.34
619.331	116.81
619.743	75.55
620.155	206.62
620.568	187.2
620.98	213.9
621.392	184.77
621.804	150.79
622.216	223.61
622.628	189.63
623.04	204.19
623.452	150.79
623.864	165.35
624.276	85.26
624.687	189.63
625.099	119.24
625.511	228.46
625.922	148.36
626.334	179.92
626.745	143.51
627.157	175.06
627.568	226.04
627.979	184.77
628.391	145.94
628.802	119.24
629.213	199.34
629.624	145.94
630.035	138.66
630.446	177.49
630.857	160.5
631.268	233.32
631.679	167.78
632.09	128.95
632.501	209.04
632.912	172.64
633.322	189.63
633.733	150.79
634.144	158.07
634.554	128.95
634.965	228.46
635.375	240.6
635.785	184.77
636.196	228.46
636.606	145.94
637.016	150.79
637.427	162.93
637.837	153.22
638.247	187.2
638.657	175.06
639.067	162.93
639.477	141.08
639.887	201.76
640.297	141.08
640.706	175.06
641.116	133.8
641.526	247.88
641.935	150.79
642.345	170.21
642.755	175.06
643.164	196.91
643.573	199.34
643.983	162.93
644.392	160.5
644.801	148.36
645.211	141.08
645.62	128.95
646.029	182.35
646.438	182.35
646.847	247.88
647.256	165.35
647.665	172.64
648.074	143.51
648.483	141.08
648.892	206.62
649.3	145.94
649.709	201.76
650.118	177.49
650.526	99.82
650.935	175.06
651.343	155.65
651.752	177.49
652.16	199.34
652.568	172.64
652.977	121.66
653.385	143.51
653.793	194.48
654.201	206.62
654.609	158.07
655.017	155.65
655.425	201.76
655.833	201.76
656.241	138.66
656.649	170.21
657.057	206.62
657.464	184.77
657.872	172.64
658.28	145.94
658.687	126.52
659.095	138.66
659.502	211.47
659.91	170.21
660.317	213.9
660.724	179.92
661.132	204.19
661.539	126.52
661.946	228.46
662.353	175.06
662.76	170.21
663.167	150.79
663.574	155.65
663.981	141.08
664.388	148.36
664.795	155.65
665.202	194.48
665.608	170.21
666.015	143.51
666.422	192.05
666.828	199.34
667.235	179.92
667.641	213.9
668.047	187.2
668.454	228.46
668.86	128.95
669.266	107.1
669.673	194.48
670.079	148.36
670.485	136.23
670.891	121.66
671.297	158.07
671.703	218.75
672.109	216.33
672.515	124.09
672.92	196.91
673.326	155.65
673.732	196.91
674.138	160.5
674.543	211.47
674.949	155.65
675.354	179.92
675.76	199.34
676.165	192.05
676.57	194.48
676.976	138.66
677.381	196.91
677.786	160.5
678.191	145.94
678.596	175.06
679.001	199.34
679.406	170.21
679.811	133.8
680.216	201.76
680.621	162.93
681.026	131.37
681.43	167.78
681.835	136.23
682.24	131.37
682.644	131.37
683.049	184.77
683.453	111.96
683.858	199.34
684.262	177.49
684.667	133.8
685.071	143.51
685.475	141.08
685.879	143.51
686.283	177.49
686.687	107.1
687.091	172.64
687.495	119.24
687.899	136.23
688.303	124.09
688.707	187.2
689.111	148.36
689.514	196.91
689.918	158.07
690.322	148.36
690.725	155.65
691.129	175.06
691.532	213.9
691.936	199.34
692.339	187.2
692.742	165.35
693.146	199.34
693.549	192.05
693.952	136.23
694.355	119.24
694.758	133.8
695.161	165.35
695.564	218.75
695.967	153.22
696.37	233.32
696.773	143.51
697.175	170.21
697.578	109.53
697.981	196.91
698.383	199.34
698.786	213.9
699.188	111.96
699.591	143.51
699.993	194.48
700.395	145.94
700.798	187.2
701.2	201.76
701.602	160.5
702.004	172.64
702.406	218.75
702.808	167.78
703.21	213.9
703.612	255.16
704.014	172.64
704.416	145.94
704.818	167.78
705.219	150.79
705.621	243.03
706.023	187.2
706.424	223.61
706.826	233.32
707.227	264.87
707.629	141.08
708.03	209.04
708.431	243.03
708.832	255.16
709.234	177.49
709.635	209.04
710.036	160.5
710.437	247.88
710.838	247.88
711.239	250.31
711.64	296.42
712.041	235.74
712.441	264.87
712.842	267.3
713.243	187.2
713.643	218.75
714.044	192.05
714.445	289.14
714.845	223.61
715.246	274.58
715.646	294
716.046	306.13
716.447	272.15
716.847	233.32
717.247	315.84
717.647	247.88
718.047	296.42
718.447	301.28
718.847	335.26
719.247	337.69
719.647	376.52
720.047	408.08
720.446	374.1
720.846	315.84
721.246	359.53
721.645	388.66
722.045	335.26
722.444	383.8
722.844	361.96
723.243	444.49
723.643	371.67
724.042	410.5
724.441	454.19
724.84	400.8
725.24	393.51
725.639	488.18
726.038	553.71
726.437	517.3
726.836	493.03
727.234	459.05
727.633	490.6
728.032	592.55
728.431	577.98
728.83	609.54
729.228	711.48
729.627	798.86
730.025	818.28
730.424	786.72
730.822	905.66
731.22	866.82
731.619	1017.31
732.017	1097.41
732.415	1252.75
732.813	1296.44
733.212	1369.26
733.61	1437.22
734.008	1578
734.406	1655.67
734.803	1704.21
735.201	1932.37
735.599	1944.51
735.997	2082.86
736.395	2165.39
736.792	2420.24
737.19	2524.61
737.587	2580.44
737.985	2667.82
738.382	2852.29
738.78	2954.23
739.177	2990.64
739.574	3272.2
739.971	3410.55
740.369	3638.71
740.766	4010.07
741.163	4192.12
741.56	4303.77
741.957	4257.65
742.354	4410.57
742.751	4437.27
743.147	4531.93
743.544	4777.08
743.941	5027.08
744.338	5534.37
744.734	5963.99
745.131	6189.72
745.527	6500.4
745.924	7044.1
746.32	7163.04
746.716	7235.85
747.113	7376.63
747.509	7667.9
747.905	7932.47
748.301	8379.07
748.697	8667.91
749.093	9529.58
749.489	9791.72
749.885	10580.57
750.281	11473.78
750.677	12119.42
751.073	12425.25
751.468	12816.04
751.864	12993.22
752.26	13012.64
752.655	13165.56
753.051	13184.97
753.446	13884.01
753.842	14587.91
754.237	15401.03
754.632	16279.68
755.028	17253
755.423	17786.99
755.818	18442.34
756.213	19187.5
756.608	19449.64
757.003	19260.31
757.398	19107.4
757.793	19058.85
758.188	18862.25
758.583	18694.77
758.977	18811.28
759.372	19367.11
759.767	20253.05
760.161	21568.6
760.556	22964.25
760.95	24313.79
761.345	25646.33
761.739	27311.41
762.133	28830.85
762.527	30034.75
762.922	30056.6
763.316	30881.85
763.71	30544.47
764.104	30517.77
764.498	30901.27
764.892	30969.23
765.286	30760.49
765.68	31209.53
766.073	31304.19
766.467	31221.66
766.861	33272.67
767.255	34134.33
767.648	36309.12
768.042	37449.92
768.435	38641.68
768.829	40828.61
769.222	41554.35
769.615	43197.58
770.008	43306.8
770.402	43471.85
770.795	44658.77
771.188	44627.21
771.581	43483.99
771.974	42867.48
772.367	41848.04
772.76	40178.11
773.153	38753.33
773.545	36590.68
773.938	36585.82
774.331	36646.5
774.724	36648.93
775.116	37595.55
775.509	39401.4
775.901	40760.65
776.294	41544.64
776.686	43418.45
777.078	45192.75
777.471	47277.74
777.863	49440.39
778.255	51792.37
778.647	53690.46
779.039	55357.96
779.431	55722.04
779.823	56442.93
780.215	57389.55
780.607	57212.36
780.999	58571.6
781.39	58435.68
781.782	58617.72
782.174	57821.59
782.565	58246.36
782.957	57879.84
783.348	58280.34
783.74	57641.98
784.131	56379.82
784.522	55685.64
784.914	54350.66
785.305	54037.55
785.696	52600.64
786.087	51180.71
786.478	49158.84
786.869	46440.35
787.26	44629.64
787.651	43564.09
788.042	41840.76
788.433	39581.02
788.823	37852.83
789.214	36505.73
789.605	35561.54
789.995	34440.16
790.386	33515.39
790.776	32813.92
791.167	32491.1
791.557	34022.68
791.948	33758.11
792.338	34323.65
792.728	35986.3
793.118	35692.61
793.508	37017.87
793.898	38219.34
794.288	38457.21
794.678	37901.38
795.068	38449.93
795.458	39250.91
795.848	39964.52
796.238	40525.21
796.627	40420.84
797.017	40913.56
797.406	41231.53
797.796	40908.71
798.185	41928.14
798.575	42733.98
798.964	42772.81
799.354	43787.39
799.743	43576.22
800.132	44197.59
800.521	43933.03
800.91	45420.91
801.299	44911.2
801.688	44952.46
802.077	44241.28
802.466	44670.9
802.855	45119.94
803.244	43187.87
803.633	42700
804.021	41729.11
804.41	41333.47
804.799	40323.75
805.187	39678.11
805.576	38238.76
805.964	37338.26
806.352	35707.17
806.741	35483.87
807.129	34988.71
807.517	34316.37
807.905	34020.25
808.293	33928.02
808.681	32959.55
809.069	32617.32
809.457	32991.11
809.845	31847.89
810.233	32563.92
810.621	32265.37
811.009	31241.08
811.396	31044.48
811.784	30745.93
812.171	29993.49
812.559	29020.17
812.946	28508.03
813.334	27299.27
813.721	26134.21
814.108	25090.5
814.496	24901.18
814.883	23816.21
815.27	23791.94
815.657	22988.53
816.044	22165.7
816.431	22109.87
816.818	21595.3
817.205	21051.6
817.592	21138.98
817.979	20490.91
818.365	20020.03
818.752	19384.1
819.139	18947.2
819.525	18891.37
819.912	18563.7
820.298	18238.45
820.685	18228.74
821.071	18187.48
821.457	18214.18
821.843	17803.98
822.23	18117.09
822.616	17986.02
823.002	17799.12
823.388	17556.4
823.774	17830.68
824.16	17687.47
824.546	18151.07
824.931	18553.99
825.317	18675.35
825.703	19000.6
826.089	19488.47
826.474	19949.64
826.86	20158.38
827.245	20189.94
827.631	20340.43
828.016	20328.29
828.401	19952.07
828.787	19369.54
829.172	19325.85
829.557	18520.01
829.942	17682.62
830.327	16908.33
830.712	16541.82
831.097	15386.47
831.482	14711.7
831.867	13595.18
832.252	12927.69
832.636	12061.17
833.021	11405.82
833.406	10684.94
833.79	9879.1
834.175	9381.52
834.559	8932.48
834.944	8172.76
835.328	7825.67
835.713	7262.55
836.097	7014.98
836.481	6653.32
836.865	6692.16
837.249	6629.05
837.633	6706.72
838.017	6818.37
838.401	6599.92
838.785	6939.73
839.169	6944.59
839.553	7056.24
839.937	7269.83
840.32	6988.28
840.704	7204.3
841.087	6995.56
841.471	6879.05
841.854	6830.51
842.238	6762.54
842.621	6660.6
843.004	6296.52
843.388	6002.82
843.771	5755.25
844.154	5408.15
844.537	5163.01
844.92	4939.7
845.303	4653.29
845.686	4349.89
846.069	4153.28
846.452	3847.45
846.834	3541.62
847.217	3330.45
847.6	3233.36
847.982	3104.72
848.365	3104.72
848.748	3194.53
849.13	3138.7
849.512	3107.15
849.895	3221.23
850.277	3449.39
850.659	3580.46
851.041	3517.35
851.423	3597.45
851.806	3728.52
852.188	3578.03
852.57	3592.59
852.951	3354.72
853.333	3463.95
853.715	3362.01
854.097	3097.44
854.479	2939.67
854.86	2781.9
855.242	2493.06
855.623	2301.31
856.005	2170.24
856.386	2024.61
856.768	1864.41
857.149	1857.13
857.53	1750.33
857.911	1621.69
858.292	1643.53
858.674	1672.66
859.055	1585.28
859.436	1573.14
859.817	1602.27
860.197	1590.13
860.578	1451.78
860.959	1463.92
861.34	1405.67
861.72	1332.85
862.101	1386.25
862.482	1196.92
862.862	1196.92
863.243	1092.55
863.623	1041.58
864.003	993.04
864.384	980.9
864.764	946.92
865.144	886.24
865.524	837.7
865.904	866.82
866.284	784.3
866.664	861.97
867.044	852.26
867.424	832.84
867.804	852.26
868.183	825.56
868.563	747.89
868.943	830.41
869.322	774.59
869.702	653.23
870.081	660.51
870.461	568.27
870.84	614.39
871.22	529.44
871.599	597.4
871.978	568.27
872.357	546.43
872.736	490.6
873.115	466.33
873.494	495.46
873.873	429.92
874.252	505.17
874.631	446.91
875.01	444.49
875.388	432.35
875.767	429.92
876.146	437.2
876.524	359.53
876.903	332.83
877.281	366.81
877.66	313.42
878.038	310.99
878.416	310.99
878.794	325.55
879.173	301.28
879.551	308.56
879.929	291.57
880.307	310.99
880.685	337.69
881.063	296.42
881.441	247.88
881.818	340.11
882.196	332.83
882.574	221.18
882.951	327.98
883.329	216.33
883.707	272.15
884.084	221.18
884.461	279.43
884.839	257.59
885.216	269.73
885.593	233.32
885.971	162.93
886.348	269.73
886.725	230.89
887.102	269.73
887.479	175.06
887.856	238.17
888.233	204.19
888.609	298.85
888.986	250.31
889.363	238.17
889.74	235.74
890.116	218.75
890.493	213.9
890.869	179.92
891.246	158.07
891.622	196.91
891.998	238.17
892.375	189.63
892.751	172.64
893.127	209.04
893.503	250.31
893.879	209.04
894.255	187.2
894.631	255.16
895.007	143.51
895.383	182.35
895.759	209.04
896.134	206.62
896.51	213.9
896.886	226.04
897.261	192.05
897.637	158.07
898.012	165.35
898.388	167.78
898.763	158.07
899.138	153.22
899.514	165.35
899.889	167.78
900.264	138.66
900.639	153.22
901.014	143.51
901.389	213.9
901.764	143.51
902.139	128.95
902.513	158.07
902.888	90.11
903.263	179.92
903.638	109.53
904.012	102.25
904.387	204.19
904.761	201.76
905.136	148.36
905.51	192.05
905.884	230.89
906.259	131.37
906.633	150.79
907.007	187.2
907.381	131.37
907.755	150.79
908.129	158.07
908.503	192.05
908.877	175.06
909.251	158.07
909.624	136.23
909.998	133.8
910.372	160.5
910.745	211.47
911.119	82.83
911.492	133.8
911.866	128.95
912.239	175.06
912.612	150.79
912.986	199.34
913.359	92.54
913.732	143.51
914.105	82.83
914.478	192.05
914.851	165.35
915.224	107.1
915.597	160.5
915.97	160.5
916.343	211.47
916.715	138.66
917.088	109.53
917.461	126.52
917.833	170.21
918.206	141.08
918.578	99.82
918.951	133.8
919.323	116.81
919.695	165.35
920.067	216.33
920.44	109.53
920.812	148.36
921.184	126.52
921.556	153.22
921.928	172.64
922.3	153.22
922.672	184.77
923.043	182.35
923.415	187.2
923.787	133.8
924.158	148.36
924.53	172.64
924.901	170.21
925.273	206.62
925.644	119.24
926.016	165.35
926.387	111.96
926.758	94.97
927.129	150.79
927.5	141.08
927.872	175.06
928.243	131.37
928.613	107.1
928.984	75.55
929.355	201.76
929.726	109.53
930.097	124.09
930.467	90.11
930.838	184.77
931.209	177.49
931.579	160.5
931.95	175.06
932.32	150.79
932.69	179.92
933.061	167.78
933.431	175.06
933.801	111.96
934.171	133.8
934.541	104.67
934.911	126.52
935.281	165.35
935.651	158.07
936.021	223.61
936.391	177.49
936.761	158.07
937.13	196.91
937.5	133.8
937.87	114.38
938.239	107.1
938.609	102.25
938.978	182.35
939.347	201.76
939.717	150.79
940.086	116.81
940.455	150.79
940.824	153.22
941.193	165.35
941.562	184.77
941.931	133.8
942.3	243.03
942.669	206.62
943.038	109.53
943.407	136.23
943.775	133.8
944.144	131.37
944.513	92.54
944.881	172.64
945.25	184.77
945.618	213.9
945.986	143.51
946.355	160.5
946.723	97.39
947.091	145.94
947.459	158.07
947.827	119.24
948.195	148.36
948.563	172.64
948.931	141.08
949.299	102.25
949.667	119.24
950.035	213.9
950.402	111.96
950.77	92.54
951.138	150.79
951.505	189.63
951.873	126.52
952.24	177.49
952.607	150.79
952.975	184.77
953.342	172.64
953.709	194.48
954.076	131.37
954.443	90.11
954.81	177.49
955.177	109.53
955.544	121.66
955.911	150.79
956.278	196.91
956.645	182.35
957.012	175.06
957.378	223.61
957.745	175.06
958.111	126.52
958.478	148.36
958.844	179.92
959.211	131.37
959.577	179.92
959.943	179.92
960.309	209.04
960.675	145.94
961.042	109.53
961.408	143.51
961.774	34.28
962.139	126.52
962.505	167.78
962.871	216.33
963.237	175.06
963.603	196.91
963.968	60.98
964.334	204.19
964.699	209.04
965.065	138.66
965.43	102.25
965.796	109.53
966.161	124.09
966.526	170.21
966.891	206.62
967.256	179.92
967.622	184.77
967.987	187.2
968.352	109.53
968.716	111.96
969.081	121.66
969.446	187.2
969.811	177.49
970.176	182.35
970.54	160.5
970.905	153.22
971.269	213.9
971.634	128.95
971.998	99.82
972.363	126.52
972.727	162.93
973.091	187.2
973.455	179.92
973.819	109.53
974.183	170.21
974.547	141.08
974.911	99.82
975.275	128.95
975.639	131.37
976.003	192.05
976.367	184.77
976.73	119.24
977.094	131.37
977.458	160.5
977.821	209.04
978.185	179.92
978.548	143.51
978.911	102.25
979.275	145.94
979.638	92.54
980.001	184.77
980.364	177.49
980.727	179.92
981.09	209.04
981.453	119.24
981.816	131.37
982.179	184.77
982.542	155.65
982.905	194.48
983.267	192.05
983.63	158.07
983.992	162.93
984.355	116.81
984.717	116.81
985.08	97.39
985.442	162.93
985.804	138.66
986.167	145.94
986.529	141.08
986.891	107.1
987.253	189.63
987.615	138.66
987.977	160.5
988.339	160.5
988.701	107.1
989.062	131.37
989.424	65.84
989.786	184.77
990.147	133.8
990.509	162.93
990.87	82.83
991.232	148.36
991.593	116.81
991.955	116.81
992.316	189.63
992.677	199.34
993.038	158.07
993.399	153.22
993.76	150.79
994.121	175.06
994.482	126.52
994.843	204.19
995.204	172.64
995.565	138.66
995.926	153.22
996.286	179.92
996.647	201.76
997.007	119.24
997.368	143.51
997.728	121.66
998.089	153.22
998.449	126.52
998.809	184.77
999.169	162.93
999.53	201.76
999.89	148.36
1000.25	165.35
1000.61	228.46
1000.97	104.67
1001.329	167.78
1001.689	247.88
1002.049	170.21
1002.409	126.52
1002.768	114.38
1003.128	97.39
1003.487	213.9
1003.847	75.55
1004.206	136.23
1004.566	85.26
1004.925	145.94
1005.284	104.67
1005.643	167.78
1006.003	82.83
1006.362	143.51
1006.721	204.19
1007.08	145.94
1007.438	196.91
1007.797	221.18
1008.156	250.31
1008.515	162.93
1008.874	162.93
1009.232	150.79
1009.591	68.27
1009.949	184.77
1010.308	170.21
1010.666	182.35
1011.024	187.2
1011.383	189.63
1011.741	136.23
1012.099	138.66
1012.457	131.37
1012.815	102.25
1013.173	124.09
1013.531	126.52
1013.889	80.4
1014.247	92.54
1014.605	143.51
1014.962	109.53
1015.32	114.38
1015.678	165.35
1016.035	143.51
1016.393	138.66
1016.75	167.78
1017.107	172.64
1017.465	131.37
1017.822	80.4
1018.179	133.8
1018.536	175.06
1018.894	145.94
1019.251	160.5
1019.608	194.48
1019.964	124.09
1020.321	138.66
1020.678	99.82
1021.035	111.96
1021.392	51.28
1021.748	175.06
1022.105	121.66
1022.461	196.91
1022.818	189.63
1023.174	39.14
1023.531	196.91
1023.887	138.66
1024.243	65.84
1024.599	150.79
1024.955	75.55
1025.311	216.33
1025.667	150.79
1026.023	121.66
1026.379	126.52
1026.735	199.34
1027.091	162.93
1027.447	148.36
