189.514	65.53
189.973	65.53
190.431	65.53
190.889	55.83
191.348	-41.26
191.806	21.84
192.264	-19.42
192.722	-16.99
193.18	19.42
193.638	4.85
194.096	29.13
194.554	-33.98
195.012	-9.71
195.47	-21.85
195.928	24.27
196.385	-21.85
196.843	-48.54
197.301	29.13
197.758	-43.69
198.216	41.26
198.674	-2.43
199.131	70.39
199.589	67.96
200.046	84.95
200.503	53.4
200.961	53.4
201.418	121.36
201.875	138.35
202.332	80.1
202.79	140.78
203.247	99.52
203.704	143.21
204.161	118.93
204.618	135.92
205.075	135.92
205.532	123.79
205.989	262.14
206.445	165.05
206.902	126.22
207.359	184.47
207.816	177.19
208.272	80.1
208.729	165.05
209.185	143.21
209.642	157.77
210.098	152.91
210.555	206.31
211.011	206.31
211.467	87.38
211.924	165.05
212.38	184.47
212.836	152.91
213.292	230.59
213.748	162.62
214.204	189.32
214.66	138.35
215.116	177.19
215.572	196.61
216.028	194.18
216.484	167.48
216.94	167.48
217.396	121.36
217.851	225.73
218.307	160.2
218.763	211.17
219.218	165.05
219.674	152.91
220.129	186.9
220.585	116.51
221.04	206.31
221.496	179.61
221.951	150.49
222.406	196.61
222.861	140.78
223.317	162.62
223.772	182.04
224.227	208.74
224.682	94.66
225.137	184.47
225.592	186.9
226.047	162.62
226.502	140.78
226.957	152.91
227.411	148.06
227.866	182.04
228.321	140.78
228.776	118.93
229.23	116.51
229.685	140.78
230.139	196.61
230.594	177.19
231.048	201.46
231.503	131.07
231.957	84.95
232.411	135.92
232.865	89.81
233.32	201.46
233.774	182.04
234.228	184.47
234.682	131.07
235.136	172.33
235.59	140.78
236.044	157.77
236.498	174.76
236.952	169.91
237.406	182.04
237.86	135.92
238.313	208.74
238.767	148.06
239.221	135.92
239.674	143.21
240.128	135.92
240.581	177.19
241.035	126.22
241.488	160.2
241.942	143.21
242.395	157.77
242.848	148.06
243.301	148.06
243.755	145.63
244.208	206.31
244.661	194.18
245.114	174.76
245.567	152.91
246.02	155.34
246.473	150.49
246.926	152.91
247.379	148.06
247.832	174.76
248.284	174.76
248.737	167.48
249.19	172.33
249.642	162.62
250.095	191.75
250.547	155.34
251	199.03
251.452	155.34
251.905	174.76
252.357	160.2
252.81	145.63
253.262	140.78
253.714	194.18
254.166	165.05
254.618	177.19
255.07	152.91
255.523	169.91
255.975	152.91
256.427	131.07
256.878	220.88
257.33	184.47
257.782	191.75
258.234	199.03
258.686	220.88
259.137	203.89
259.589	165.05
260.041	184.47
260.492	145.63
260.944	118.93
261.395	123.79
261.847	152.91
262.298	111.65
262.749	155.34
263.201	128.64
263.652	114.08
264.103	155.34
264.554	109.23
265.005	211.17
265.457	133.5
265.908	123.79
266.359	155.34
266.809	196.61
267.26	148.06
267.711	150.49
268.162	157.77
268.613	157.77
269.064	157.77
269.514	177.19
269.965	155.34
270.415	194.18
270.866	182.04
271.316	143.21
271.767	191.75
272.217	121.36
272.668	128.64
273.118	109.23
273.568	150.49
274.019	194.18
274.469	148.06
274.919	162.62
275.369	92.23
275.819	152.91
276.269	174.76
276.719	169.91
277.169	133.5
277.619	118.93
278.069	167.48
278.518	128.64
278.968	155.34
279.418	118.93
279.867	145.63
280.317	121.36
280.767	148.06
281.216	138.35
281.666	169.91
282.115	99.52
282.564	199.03
283.014	128.64
283.463	67.96
283.912	191.75
284.361	148.06
284.811	106.8
285.26	211.17
285.709	118.93
286.158	169.91
286.607	160.2
287.056	162.62
287.505	89.81
287.953	160.2
288.402	169.91
288.851	123.79
289.3	162.62
289.748	242.72
290.197	191.75
290.646	143.21
291.094	186.9
291.543	186.9
291.991	199.03
292.439	148.06
292.888	160.2
293.336	140.78
293.784	157.77
294.233	252.43
294.681	167.48
295.129	135.92
295.577	201.46
296.025	189.32
296.473	162.62
296.921	211.17
297.369	152.91
297.817	94.66
298.264	109.23
298.712	143.21
299.16	133.5
299.608	140.78
300.055	160.2
300.503	131.07
300.95	169.91
301.398	118.93
301.845	157.77
302.293	148.06
302.74	121.36
303.187	162.62
303.635	145.63
304.082	160.2
304.529	182.04
304.976	218.45
305.423	218.45
305.87	174.76
306.317	208.74
306.764	172.33
307.211	116.51
307.658	160.2
308.105	169.91
308.552	145.63
308.998	167.48
309.445	196.61
309.892	230.59
310.338	160.2
310.785	184.47
311.231	160.2
311.678	225.73
312.124	114.08
312.571	245.15
313.017	191.75
313.463	140.78
313.909	138.35
314.356	194.18
314.802	116.51
315.248	199.03
315.694	174.76
316.14	218.45
316.586	135.92
317.032	169.91
317.478	174.76
317.923	199.03
318.369	189.32
318.815	196.61
319.261	89.81
319.706	184.47
320.152	169.91
320.597	186.9
321.043	143.21
321.488	235.44
321.934	167.48
322.379	201.46
322.824	138.35
323.27	133.5
323.715	199.03
324.16	135.92
324.605	138.35
325.05	179.61
325.495	213.6
325.94	179.61
326.385	138.35
326.83	94.66
327.275	225.73
327.72	133.5
328.165	148.06
328.61	206.31
329.054	135.92
329.499	230.59
329.943	199.03
330.388	114.08
330.832	138.35
331.277	179.61
331.721	131.07
332.166	135.92
332.61	111.65
333.054	135.92
333.499	133.5
333.943	157.77
334.387	206.31
334.831	172.33
335.275	179.61
335.719	184.47
336.163	186.9
336.607	155.34
337.051	155.34
337.495	169.91
337.938	220.88
338.382	184.47
338.826	94.66
339.269	182.04
339.713	189.32
340.157	177.19
340.6	186.9
341.044	133.5
341.487	203.89
341.93	157.77
342.374	167.48
342.817	114.08
343.26	114.08
343.703	118.93
344.146	208.74
344.59	104.37
345.033	174.76
345.476	157.77
345.919	84.95
346.361	179.61
346.804	123.79
347.247	199.03
347.69	165.05
348.133	179.61
348.575	174.76
349.018	174.76
349.461	220.88
349.903	150.49
350.346	126.22
350.788	179.61
351.23	172.33
351.673	160.2
352.115	182.04
352.557	160.2
353	186.9
353.442	148.06
353.884	140.78
354.326	177.19
354.768	135.92
355.21	157.77
355.652	167.48
356.094	140.78
356.536	77.67
356.978	179.61
357.419	179.61
357.861	145.63
358.303	184.47
358.744	128.64
359.186	133.5
359.627	140.78
360.069	128.64
360.51	131.07
360.952	218.45
361.393	157.77
361.834	138.35
362.276	216.02
362.717	167.48
363.158	75.24
363.599	148.06
364.04	165.05
364.481	50.97
364.922	216.02
365.363	211.17
365.804	186.9
366.245	162.62
366.686	97.09
367.126	165.05
367.567	152.91
368.008	138.35
368.448	128.64
368.889	186.9
369.33	155.34
369.77	196.61
370.21	94.66
370.651	194.18
371.091	184.47
371.531	72.82
371.972	145.63
372.412	89.81
372.852	135.92
373.292	133.5
373.732	138.35
374.172	133.5
374.612	179.61
375.052	87.38
375.492	150.49
375.932	165.05
376.372	92.23
376.811	155.34
377.251	218.45
377.691	189.32
378.13	131.07
378.57	201.46
379.009	155.34
379.449	77.67
379.888	92.23
380.328	174.76
380.767	237.87
381.206	201.46
381.645	218.45
382.085	177.19
382.524	123.79
382.963	174.76
383.402	191.75
383.841	206.31
384.28	109.23
384.719	143.21
385.158	152.91
385.596	160.2
386.035	82.53
386.474	152.91
386.913	111.65
387.351	177.19
387.79	203.89
388.228	208.74
388.667	169.91
389.105	165.05
389.544	211.17
389.982	162.62
390.42	179.61
390.859	143.21
391.297	155.34
391.735	155.34
392.173	169.91
392.611	148.06
393.049	184.47
393.487	199.03
393.925	67.96
394.363	114.08
394.801	196.61
395.239	208.74
395.676	203.89
396.114	199.03
396.552	186.9
396.989	121.36
397.427	172.33
397.864	179.61
398.302	162.62
398.739	138.35
399.177	150.49
399.614	160.2
400.051	157.77
400.488	121.36
400.926	128.64
401.363	111.65
401.8	126.22
402.237	184.47
402.674	133.5
403.111	179.61
403.548	150.49
403.985	208.74
404.421	152.91
404.858	138.35
405.295	123.79
405.732	131.07
406.168	152.91
406.605	155.34
407.041	206.31
407.478	160.2
407.914	189.32
408.351	133.5
408.787	123.79
409.223	162.62
409.66	135.92
410.096	216.02
410.532	179.61
410.968	111.65
411.404	135.92
411.84	184.47
412.276	196.61
412.712	211.17
413.148	240.29
413.584	165.05
414.02	118.93
414.455	189.32
414.891	104.37
415.327	131.07
415.762	208.74
416.198	148.06
416.633	133.5
417.069	169.91
417.504	160.2
417.94	131.07
418.375	162.62
418.81	111.65
419.245	169.91
419.681	92.23
420.116	194.18
420.551	157.77
420.986	189.32
421.421	174.76
421.856	111.65
422.291	155.34
422.726	148.06
423.16	128.64
423.595	152.91
424.03	206.31
424.464	233.01
424.899	233.01
425.334	211.17
425.768	131.07
426.203	140.78
426.637	101.94
427.071	160.2
427.506	155.34
427.94	133.5
428.374	128.64
428.809	211.17
429.243	174.76
429.677	165.05
430.111	140.78
430.545	179.61
430.979	145.63
431.413	145.63
431.847	114.08
432.28	167.48
432.714	150.49
433.148	167.48
433.582	208.74
434.015	87.38
434.449	126.22
434.882	143.21
435.316	114.08
435.749	150.49
436.183	174.76
436.616	213.6
437.049	155.34
437.483	274.28
437.916	228.16
438.349	143.21
438.782	172.33
439.215	169.91
439.648	155.34
440.081	213.6
440.514	223.3
440.947	169.91
441.38	148.06
441.813	169.91
442.245	264.57
442.678	184.47
443.111	213.6
443.543	143.21
443.976	225.73
444.408	196.61
444.841	182.04
445.273	138.35
445.705	97.09
446.138	126.22
446.57	174.76
447.002	101.94
447.434	220.88
447.867	245.15
448.299	225.73
448.731	148.06
449.163	133.5
449.595	196.61
450.026	172.33
450.458	172.33
450.89	230.59
451.322	77.67
451.754	220.88
452.185	150.49
452.617	252.43
453.048	262.14
453.48	235.44
453.911	216.02
454.343	194.18
454.774	182.04
455.205	157.77
455.637	211.17
456.068	169.91
456.499	223.3
456.93	206.31
457.361	235.44
457.792	230.59
458.223	230.59
458.654	179.61
459.085	199.03
459.516	216.02
459.947	186.9
460.378	135.92
460.808	199.03
461.239	160.2
461.669	230.59
462.1	203.89
462.531	150.49
462.961	194.18
463.391	186.9
463.822	242.72
464.252	145.63
464.682	148.06
465.113	206.31
465.543	191.75
465.973	172.33
466.403	135.92
466.833	186.9
467.263	247.58
467.693	216.02
468.123	220.88
468.553	201.46
468.983	177.19
469.412	182.04
469.842	189.32
470.272	155.34
470.701	126.22
471.131	191.75
471.56	138.35
471.99	126.22
472.419	201.46
472.849	247.58
473.278	111.65
473.707	208.74
474.136	118.93
474.566	169.91
474.995	259.71
475.424	160.2
475.853	155.34
476.282	179.61
476.711	242.72
477.14	143.21
477.569	148.06
477.997	165.05
478.426	126.22
478.855	118.93
479.283	240.29
479.712	186.9
480.141	148.06
480.569	182.04
480.998	111.65
481.426	167.48
481.854	92.23
482.283	206.31
482.711	179.61
483.139	230.59
483.567	206.31
483.995	216.02
484.424	247.58
484.852	208.74
485.28	189.32
485.708	177.19
486.135	191.75
486.563	172.33
486.991	114.08
487.419	138.35
487.847	145.63
488.274	150.49
488.702	174.76
489.129	182.04
489.557	233.01
489.984	165.05
490.412	189.32
490.839	167.48
491.266	114.08
491.694	143.21
492.121	264.57
492.548	148.06
492.975	179.61
493.402	135.92
493.829	143.21
494.256	126.22
494.683	138.35
495.11	186.9
495.537	208.74
495.964	184.47
496.39	203.89
496.817	208.74
497.244	213.6
497.67	135.92
498.097	199.03
498.523	172.33
498.95	208.74
499.376	208.74
499.803	140.78
500.229	148.06
500.655	118.93
501.081	211.17
501.508	148.06
501.934	162.62
502.36	126.22
502.786	162.62
503.212	218.45
503.638	160.2
504.064	128.64
504.489	203.89
504.915	99.52
505.341	240.29
505.767	196.61
506.192	257.29
506.618	148.06
507.043	111.65
507.469	179.61
507.894	123.79
508.32	126.22
508.745	220.88
509.17	213.6
509.596	131.07
510.021	123.79
510.446	150.49
510.871	152.91
511.296	179.61
511.721	172.33
512.146	140.78
512.571	216.02
512.996	179.61
513.421	211.17
513.845	172.33
514.27	162.62
514.695	155.34
515.119	143.21
515.544	43.69
515.969	160.2
516.393	199.03
516.817	157.77
517.242	165.05
517.666	162.62
518.09	133.5
518.515	218.45
518.939	155.34
519.363	419.91
519.787	186.9
520.211	165.05
520.635	106.8
521.059	118.93
521.483	206.31
521.907	145.63
522.331	172.33
522.754	162.62
523.178	165.05
523.602	196.61
524.025	148.06
524.449	172.33
524.872	174.76
525.296	167.48
525.719	101.94
526.143	203.89
526.566	111.65
526.989	230.59
527.412	228.16
527.836	123.79
528.259	160.2
528.682	135.92
529.105	165.05
529.528	225.73
529.951	135.92
530.374	169.91
530.796	140.78
531.219	240.29
531.642	179.61
532.065	194.18
532.487	157.77
532.91	174.76
533.332	172.33
533.755	116.51
534.177	206.31
534.6	201.46
535.022	140.78
535.444	194.18
535.867	169.91
536.289	172.33
536.711	201.46
537.133	162.62
537.555	242.72
537.977	118.93
538.399	225.73
538.821	196.61
539.243	135.92
539.665	131.07
540.086	184.47
540.508	145.63
540.93	162.62
541.351	165.05
541.773	155.34
542.195	216.02
542.616	259.71
543.037	218.45
543.459	223.3
543.88	203.89
544.301	143.21
544.723	174.76
545.144	199.03
545.565	250
545.986	259.71
546.407	266.99
546.828	199.03
547.249	99.52
547.67	191.75
548.091	194.18
548.512	211.17
548.932	194.18
549.353	208.74
549.774	177.19
550.194	169.91
550.615	184.47
551.035	230.59
551.456	148.06
551.876	152.91
552.296	133.5
552.717	157.77
553.137	143.21
553.557	143.21
553.977	218.45
554.397	208.74
554.817	165.05
555.237	162.62
555.657	177.19
556.077	143.21
556.497	138.35
556.917	196.61
557.337	155.34
557.756	133.5
558.176	162.62
558.596	157.77
559.015	177.19
559.435	128.64
559.854	138.35
560.274	138.35
560.693	155.34
561.112	220.88
561.532	196.61
561.951	143.21
562.37	111.65
562.789	148.06
563.208	172.33
563.627	167.48
564.046	111.65
564.465	237.87
564.884	138.35
565.303	111.65
565.722	165.05
566.14	167.48
566.559	152.91
566.978	191.75
567.396	148.06
567.815	160.2
568.233	133.5
568.652	160.2
569.07	201.46
569.489	172.33
569.907	106.8
570.325	186.9
570.743	109.23
571.161	186.9
571.58	206.31
571.998	133.5
572.416	133.5
572.833	230.59
573.251	131.07
573.669	174.76
574.087	203.89
574.505	89.81
574.922	169.91
575.34	140.78
575.758	128.64
576.175	199.03
576.593	121.36
577.01	172.33
577.428	186.9
577.845	1550.99
578.262	308.26
578.68	218.45
579.097	126.22
579.514	179.61
579.931	145.63
580.348	160.2
580.765	203.89
581.182	167.48
581.599	97.09
582.016	160.2
582.433	165.05
582.849	262.14
583.266	140.78
583.683	162.62
584.099	247.58
584.516	174.76
584.933	155.34
585.349	155.34
585.765	165.05
586.182	165.05
586.598	196.61
587.014	101.94
587.431	143.21
587.847	174.76
588.263	135.92
588.679	216.02
589.095	182.04
589.511	150.49
589.927	194.18
590.343	274.28
590.759	128.64
591.174	191.75
591.59	160.2
592.006	101.94
592.421	186.9
592.837	172.33
593.252	211.17
593.668	114.08
594.083	174.76
594.499	189.32
594.914	133.5
595.329	160.2
595.745	126.22
596.16	133.5
596.575	211.17
596.99	77.67
597.405	230.59
597.82	162.62
598.235	186.9
598.65	157.77
599.065	174.76
599.479	157.77
599.894	194.18
600.309	157.77
600.724	167.48
601.138	199.03
601.553	160.2
601.967	177.19
602.382	135.92
602.796	143.21
603.21	247.58
603.625	199.03
604.039	186.9
604.453	182.04
604.867	196.61
605.281	182.04
605.695	55.83
606.109	199.03
606.523	189.32
606.937	152.91
607.351	266.99
607.765	186.9
608.178	150.49
608.592	150.49
609.006	179.61
609.419	206.31
609.833	160.2
610.246	276.7
610.66	257.29
611.073	155.34
611.487	162.62
611.9	240.29
612.313	179.61
612.726	220.88
613.139	216.02
613.553	126.22
613.966	196.61
614.379	123.79
614.792	128.64
615.204	150.49
615.617	138.35
616.03	211.17
616.443	111.65
616.856	179.61
617.268	162.62
617.681	135.92
618.093	186.9
618.506	157.77
618.918	191.75
619.331	196.61
619.743	143.21
620.155	184.47
620.568	208.74
620.98	148.06
621.392	196.61
621.804	160.2
622.216	138.35
622.628	182.04
623.04	101.94
623.452	189.32
623.864	152.91
624.276	157.77
624.687	145.63
625.099	199.03
625.511	145.63
625.922	172.33
626.334	174.76
626.745	155.34
627.157	162.62
627.568	169.91
627.979	172.33
628.391	240.29
628.802	194.18
629.213	114.08
629.624	177.19
630.035	191.75
630.446	184.47
630.857	157.77
631.268	111.65
631.679	131.07
632.09	150.49
632.501	194.18
632.912	218.45
633.322	237.87
633.733	179.61
634.144	169.91
634.554	131.07
634.965	155.34
635.375	160.2
635.785	131.07
636.196	135.92
636.606	148.06
637.016	233.01
637.427	157.77
637.837	179.61
638.247	201.46
638.657	131.07
639.067	199.03
639.477	167.48
639.887	179.61
640.297	123.79
640.706	133.5
641.116	228.16
641.526	150.49
641.935	148.06
642.345	123.79
642.755	167.48
643.164	191.75
643.573	155.34
643.983	206.31
644.392	138.35
644.801	150.49
645.211	155.34
645.62	89.81
646.029	138.35
646.438	148.06
646.847	223.3
647.256	165.05
647.665	143.21
648.074	145.63
648.483	92.23
648.892	128.64
649.3	230.59
649.709	184.47
650.118	143.21
650.526	199.03
650.935	123.79
651.343	118.93
651.752	186.9
652.16	186.9
652.568	201.46
652.977	177.19
653.385	174.76
653.793	182.04
654.201	194.18
654.609	157.77
655.017	111.65
655.425	138.35
655.833	208.74
656.241	148.06
656.649	155.34
657.057	116.51
657.464	199.03
657.872	184.47
658.28	203.89
658.687	206.31
659.095	157.77
659.502	179.61
659.91	177.19
660.317	172.33
660.724	140.78
661.132	157.77
661.539	208.74
661.946	99.52
662.353	169.91
662.76	114.08
663.167	199.03
663.574	150.49
663.981	169.91
664.388	186.9
664.795	162.62
665.202	169.91
665.608	179.61
666.015	177.19
666.422	169.91
666.828	148.06
667.235	186.9
667.641	131.07
668.047	201.46
668.454	94.66
668.86	203.89
669.266	148.06
669.673	165.05
670.079	172.33
670.485	199.03
670.891	225.73
671.297	191.75
671.703	80.1
672.109	143.21
672.515	218.45
672.92	135.92
673.326	172.33
673.732	157.77
674.138	201.46
674.543	148.06
674.949	160.2
675.354	203.89
675.76	177.19
676.165	216.02
676.57	162.62
676.976	179.61
677.381	155.34
677.786	167.48
678.191	123.79
678.596	152.91
679.001	143.21
679.406	128.64
679.811	152.91
680.216	218.45
680.621	138.35
681.026	174.76
681.43	143.21
681.835	160.2
682.24	199.03
682.644	157.77
683.049	169.91
683.453	169.91
683.858	155.34
684.262	225.73
684.667	218.45
685.071	140.78
685.475	179.61
685.879	165.05
686.283	165.05
686.687	186.9
687.091	162.62
687.495	172.33
687.899	174.76
688.303	160.2
688.707	87.38
689.111	203.89
689.514	133.5
689.918	155.34
690.322	133.5
690.725	150.49
691.129	157.77
691.532	208.74
691.936	247.58
692.339	148.06
692.742	288.84
693.146	140.78
693.549	218.45
693.952	199.03
694.355	225.73
694.758	133.5
695.161	235.44
695.564	169.91
695.967	196.61
696.37	131.07
696.773	131.07
697.175	196.61
697.578	237.87
697.981	199.03
698.383	162.62
698.786	208.74
699.188	182.04
699.591	182.04
699.993	208.74
700.395	140.78
700.798	111.65
701.2	150.49
701.602	184.47
702.004	220.88
702.406	203.89
702.808	196.61
703.21	148.06
703.612	169.91
704.014	247.58
704.416	199.03
704.818	223.3
705.219	252.43
705.621	172.33
706.023	245.15
706.424	250
706.826	257.29
707.227	250
707.629	283.99
708.03	259.71
708.431	208.74
708.832	325.25
709.234	220.88
709.635	228.16
710.036	296.12
710.437	199.03
710.838	223.3
711.239	257.29
711.64	230.59
712.041	237.87
712.441	218.45
712.842	237.87
713.243	332.53
713.643	300.98
714.044	283.99
714.445	220.88
714.845	262.14
715.246	296.12
715.646	296.12
716.046	296.12
716.447	291.27
716.847	313.11
717.247	327.67
717.647	283.99
718.047	269.42
718.447	310.68
718.847	303.4
719.247	300.98
719.647	310.68
720.047	393.21
720.446	366.51
720.846	366.51
721.246	410.2
721.645	313.11
722.045	429.62
722.444	436.9
722.844	378.65
723.243	449.04
723.643	424.76
724.042	393.21
724.441	458.75
724.84	432.05
725.24	451.46
725.639	424.76
726.038	521.85
726.437	470.88
726.836	412.63
727.234	451.46
727.633	514.57
728.032	512.14
728.431	529.13
728.83	565.54
729.228	628.65
729.627	577.68
730.025	628.65
730.424	730.59
730.822	708.75
731.22	684.48
731.619	730.59
732.017	885.94
732.415	932.05
732.813	949.04
733.212	907.78
733.61	1031.57
734.008	1050.99
734.406	1167.49
734.803	1189.34
735.201	1177.2
735.599	1366.53
735.997	1378.66
736.395	1422.35
736.792	1723.33
737.19	1701.48
737.587	1728.18
737.985	1604.39
738.382	1742.75
738.78	1776.73
739.177	2121.39
739.574	2298.58
739.971	2334.99
740.369	2182.07
740.766	2160.23
741.163	2301.01
741.56	2631.11
741.957	2888.39
742.354	2990.34
742.751	2703.93
743.147	2672.37
743.544	2873.83
743.941	3366.56
744.338	3944.24
744.734	3818.02
745.131	3640.83
745.527	3463.65
745.924	3711.22
746.32	4429.68
746.716	5031.63
747.113	5252.51
747.509	5000.08
747.905	4449.1
748.301	4820.46
748.697	5521.93
749.093	6480.68
749.489	6779.23
749.885	6509.81
750.281	5728.24
750.677	5963.68
751.073	7097.2
751.468	8284.11
751.864	8881.21
752.26	8339.94
752.655	7371.47
753.051	7444.29
753.446	8723.44
753.842	10182.2
754.237	11085.12
754.632	10439.48
755.028	9114.22
755.423	8929.75
755.818	9495.29
756.213	11339.98
756.608	12558.45
757.003	12284.17
757.398	10915.22
757.793	9929.77
758.188	10121.52
758.583	12080.28
758.977	13728.37
759.372	14257.5
759.767	13373.99
760.161	12182.23
760.556	12556.02
760.95	14531.78
761.345	17361.92
761.739	18985.73
762.133	18262.42
762.527	16475.98
762.922	15633.74
763.316	17235.7
763.71	20002.74
764.104	22209.08
764.498	21801.31
764.892	20262.45
765.286	18388.64
765.68	18767.28
766.073	22058.6
766.467	25250.39
766.861	26723.72
767.255	24456.69
767.648	22213.94
768.042	20888.67
768.435	23811.05
768.829	27201.88
769.222	29728.62
769.615	29044.14
770.008	25985.84
770.402	23388.71
770.795	23993.09
771.188	27328.1
771.581	30061.15
771.974	31053.88
772.367	28556.27
772.76	25267.38
773.153	23476.09
773.545	25456.71
773.938	29614.54
774.331	32051.47
774.724	31243.2
775.116	28366.95
775.509	26201.86
775.901	27612.08
776.294	32218.95
776.686	36381.63
777.078	38337.97
777.471	36311.24
777.863	32740.8
778.255	31617
778.647	33655.86
779.039	38345.26
779.431	41993.37
779.823	41316.18
780.215	38022.44
780.607	33468.97
780.999	33818.49
781.39	36867.08
781.782	41901.14
782.174	44622.05
782.565	42983.68
782.957	38034.57
783.348	35163.17
783.74	36279.69
784.131	39493.33
784.522	44823.51
784.914	44656.03
785.305	41952.11
785.696	36675.33
786.087	34034.51
786.478	34893.75
786.869	38024.86
787.26	41386.57
787.651	40422.96
788.042	36262.7
788.433	32175.26
788.823	30158.24
789.214	31279.61
789.605	34583.06
789.995	36015.12
790.386	34658.31
790.776	31044.17
791.167	27527.13
791.557	27743.15
791.948	30765.04
792.338	35393.75
792.728	38255.45
793.118	37520
793.508	33151
793.898	30369.4
794.288	30364.55
794.678	33381.59
795.068	37126.79
795.458	38381.67
795.848	37022.42
796.238	32612.16
796.627	29500.46
797.017	29471.33
797.406	33286.93
797.796	36337.94
798.185	37947.19
798.575	36136.48
798.964	31682.53
799.354	29036.86
799.743	29954.35
800.132	33558.77
800.521	36818.53
800.91	38563.71
801.299	35789.39
801.688	31765.06
802.077	28182.48
802.466	28692.19
802.855	31636.41
803.244	34408.3
803.633	35862.21
804.021	32391.28
804.41	29022.3
804.799	26109.63
805.187	25097.48
805.576	27240.72
805.964	29163.08
806.352	29451.91
806.741	28036.84
807.129	24243.1
807.517	22264.91
807.905	22757.64
808.293	24971.26
808.681	28095.1
809.069	29226.18
809.457	28515.01
809.845	25420.3
810.233	22932.4
810.621	22786.76
811.009	24767.38
811.396	28420.35
811.784	29799.01
812.171	28245.58
812.559	25048.93
812.946	22359.57
813.334	21284.31
813.721	22575.59
814.108	24565.92
814.496	26837.8
814.883	25747.97
815.27	24522.23
815.657	20847.41
816.044	20019.73
816.431	20844.98
816.818	23597.45
817.205	24806.21
817.592	25650.88
817.979	23524.64
818.365	20128.95
818.752	17961.44
819.139	17349.78
819.525	19357.1
819.912	21019.74
820.298	21976.07
820.685	20459.06
821.071	17412.89
821.457	15437.13
821.843	14274.49
822.23	15286.65
822.616	16475.98
823.002	17211.43
823.388	16048.79
823.774	14274.49
824.16	12111.84
824.546	11153.09
824.931	11694.36
825.317	12932.24
825.703	14179.83
826.089	14267.21
826.474	13017.19
826.86	11043.86
827.245	10080.25
827.631	10031.71
828.016	10924.93
828.401	12102.13
828.787	12645.83
829.172	11854.55
829.557	10507.44
829.942	8837.52
830.327	8315.66
830.712	8900.62
831.097	9881.22
831.482	10386.08
831.867	10390.94
832.252	9264.71
832.636	7927.31
833.021	7140.89
833.406	7264.68
833.79	7873.91
834.175	8585.08
834.559	9245.29
834.944	8335.08
835.328	7378.76
835.713	6325.34
836.097	5798.63
836.481	5927.28
836.865	6619.03
837.249	7060.79
837.633	6951.56
838.017	6468.55
838.401	5614.17
838.785	4638.42
839.169	4560.75
839.553	4740.36
839.937	5223.38
840.32	5196.68
840.704	5000.08
841.087	4487.93
841.471	3798.6
841.854	3252.48
842.238	3351.99
842.621	3742.78
843.004	3995.21
843.388	4240.36
843.771	3793.75
844.154	3466.07
844.537	2944.22
844.92	2706.35
845.303	3012.18
845.686	3458.79
846.069	3575.3
846.452	3701.51
846.834	3429.66
847.217	2735.48
847.6	2432.08
847.982	2194.21
848.365	2519.46
848.748	2788.88
849.13	2939.37
849.512	2919.95
849.895	2635.96
850.277	2206.34
850.659	1883.52
851.041	1963.62
851.423	2152.95
851.806	2366.54
852.188	2536.45
852.57	2495.18
852.951	2138.38
853.333	1771.87
853.715	1640.8
854.097	1611.68
854.479	1832.55
854.86	1975.76
855.242	2089.84
855.623	1915.08
856.005	1655.37
856.386	1439.34
856.768	1259.73
857.149	1349.54
857.53	1354.39
857.911	1548.57
858.292	1548.57
858.674	1453.91
859.055	1245.16
859.436	1019.43
859.817	995.16
860.197	961.18
860.578	1084.97
860.959	1152.93
861.34	1094.68
861.72	992.73
862.101	1041.28
862.482	854.38
862.862	737.88
863.243	837.39
863.623	808.26
864.003	961.18
864.384	927.2
864.764	929.63
865.144	793.7
865.524	684.48
865.904	599.52
866.284	662.63
866.664	720.88
867.044	796.13
867.424	796.13
867.804	725.74
868.183	609.23
868.563	468.45
868.943	497.58
869.322	524.28
869.702	584.96
870.081	517
870.461	563.12
870.84	546.12
871.22	519.43
871.599	550.98
871.978	415.05
872.357	419.91
872.736	500.01
873.115	483.02
873.494	463.6
873.873	587.39
874.252	385.93
874.631	407.77
875.01	356.8
875.388	327.67
875.767	395.64
876.146	347.09
876.524	373.79
876.903	390.78
877.281	461.17
877.66	293.69
878.038	356.8
878.416	279.13
878.794	334.96
879.173	286.41
879.551	334.96
879.929	334.96
880.307	330.1
880.685	242.72
881.063	262.14
881.441	240.29
881.818	298.55
882.196	305.83
882.574	218.45
882.951	237.87
883.329	203.89
883.707	254.86
884.084	283.99
884.461	266.99
884.839	208.74
885.216	233.01
885.593	288.84
885.971	252.43
886.348	233.01
886.725	196.61
887.102	271.85
887.479	199.03
887.856	237.87
888.233	266.99
888.609	211.17
888.986	218.45
889.363	201.46
889.74	206.31
890.116	211.17
890.493	172.33
890.869	208.74
891.246	279.13
891.622	216.02
891.998	169.91
892.375	186.9
892.751	184.47
893.127	245.15
893.503	206.31
893.879	155.34
894.255	160.2
894.631	194.18
895.007	84.95
895.383	155.34
895.759	203.89
896.134	182.04
896.51	254.86
896.886	118.93
897.261	182.04
897.637	276.7
898.012	216.02
898.388	155.34
898.763	240.29
899.138	201.46
899.514	135.92
899.889	133.5
900.264	148.06
900.639	199.03
901.014	179.61
901.389	184.47
901.764	148.06
902.139	167.48
902.513	169.91
902.888	165.05
903.263	165.05
903.638	131.07
904.012	148.06
904.387	109.23
904.761	145.63
905.136	152.91
905.51	152.91
905.884	194.18
906.259	162.62
906.633	162.62
907.007	150.49
907.381	148.06
907.755	201.46
908.129	155.34
908.503	179.61
908.877	145.63
909.251	186.9
909.624	203.89
909.998	126.22
910.372	155.34
910.745	89.81
911.119	152.91
911.492	174.76
911.866	138.35
912.239	169.91
912.612	150.49
912.986	140.78
913.359	140.78
913.732	179.61
914.105	184.47
914.478	194.18
914.851	162.62
915.224	123.79
915.597	121.36
915.97	179.61
916.343	155.34
916.715	133.5
917.088	106.8
917.461	111.65
917.833	213.6
918.206	160.2
918.578	169.91
918.951	182.04
919.323	150.49
919.695	152.91
920.067	116.51
920.44	128.64
920.812	99.52
921.184	121.36
921.556	162.62
921.928	75.24
922.3	118.93
922.672	216.02
923.043	233.01
923.415	121.36
923.787	89.81
924.158	165.05
924.53	162.62
924.901	223.3
925.273	143.21
925.644	167.48
926.016	169.91
926.387	109.23
926.758	165.05
927.129	259.71
927.5	50.97
927.872	123.79
928.243	189.32
928.613	160.2
928.984	133.5
929.355	182.04
929.726	169.91
930.097	155.34
930.467	128.64
930.838	177.19
931.209	84.95
931.579	155.34
931.95	99.52
932.32	152.91
932.69	157.77
933.061	138.35
933.431	216.02
933.801	196.61
934.171	109.23
934.541	194.18
934.911	138.35
935.281	155.34
935.651	165.05
936.021	189.32
936.391	128.64
936.761	118.93
937.13	167.48
937.5	123.79
937.87	237.87
938.239	191.75
938.609	150.49
938.978	182.04
939.347	165.05
939.717	152.91
940.086	148.06
940.455	228.16
940.824	194.18
941.193	189.32
941.562	162.62
941.931	152.91
942.3	201.46
942.669	118.93
943.038	111.65
943.407	131.07
943.775	167.48
944.144	206.31
944.513	191.75
944.881	143.21
945.25	218.45
945.618	203.89
945.986	128.64
946.355	82.53
946.723	150.49
947.091	177.19
947.459	70.39
947.827	133.5
948.195	121.36
948.563	211.17
948.931	194.18
949.299	194.18
949.667	75.24
950.035	211.17
950.402	140.78
950.77	140.78
951.138	131.07
951.505	194.18
951.873	138.35
952.24	118.93
952.607	182.04
952.975	145.63
953.342	155.34
953.709	101.94
954.076	135.92
954.443	114.08
954.81	191.75
955.177	194.18
955.544	140.78
955.911	208.74
956.278	165.05
956.645	160.2
957.012	111.65
957.378	220.88
957.745	133.5
958.111	140.78
958.478	123.79
958.844	191.75
959.211	126.22
959.577	165.05
959.943	189.32
960.309	131.07
960.675	155.34
961.042	150.49
961.408	133.5
961.774	174.76
962.139	160.2
962.505	77.67
962.871	80.1
963.237	201.46
963.603	101.94
963.968	89.81
964.334	186.9
964.699	167.48
965.065	162.62
965.43	111.65
965.796	99.52
966.161	128.64
966.526	126.22
966.891	165.05
967.256	148.06
967.622	148.06
967.987	162.62
968.352	145.63
968.716	196.61
969.081	33.98
969.446	140.78
969.811	165.05
970.176	148.06
970.54	206.31
970.905	172.33
971.269	109.23
971.634	133.5
971.998	133.5
972.363	194.18
972.727	109.23
973.091	160.2
973.455	169.91
973.819	99.52
974.183	121.36
974.547	55.83
974.911	143.21
975.275	162.62
975.639	140.78
976.003	165.05
976.367	111.65
976.73	191.75
977.094	160.2
977.458	116.51
977.821	150.49
978.185	121.36
978.548	111.65
978.911	126.22
979.275	169.91
979.638	148.06
980.001	94.66
980.364	179.61
980.727	150.49
981.09	169.91
981.453	123.79
981.816	206.31
982.179	208.74
982.542	114.08
982.905	106.8
983.267	160.2
983.63	157.77
983.992	211.17
984.355	121.36
984.717	133.5
985.08	211.17
985.442	186.9
985.804	145.63
986.167	140.78
986.529	177.19
986.891	189.32
987.253	184.47
987.615	186.9
987.977	126.22
988.339	167.48
988.701	199.03
989.062	174.76
989.424	123.79
989.786	196.61
990.147	167.48
990.509	150.49
990.87	206.31
991.232	150.49
991.593	123.79
991.955	189.32
992.316	143.21
992.677	177.19
993.038	165.05
993.399	84.95
993.76	177.19
994.121	148.06
994.482	194.18
994.843	148.06
995.204	194.18
995.565	92.23
995.926	182.04
996.286	199.03
996.647	189.32
997.007	186.9
997.368	165.05
997.728	121.36
998.089	199.03
998.449	184.47
998.809	172.33
999.169	60.68
999.53	179.61
999.89	174.76
1000.25	201.46
1000.61	233.01
1000.97	118.93
1001.329	177.19
1001.689	121.36
1002.049	118.93
1002.409	118.93
1002.768	165.05
1003.128	116.51
1003.487	123.79
1003.847	148.06
1004.206	145.63
1004.566	116.51
1004.925	186.9
1005.284	169.91
1005.643	131.07
1006.003	138.35
1006.362	133.5
1006.721	174.76
1007.08	155.34
1007.438	97.09
1007.797	131.07
1008.156	152.91
1008.515	189.32
1008.874	140.78
1009.232	165.05
1009.591	150.49
1009.949	182.04
1010.308	233.01
1010.666	191.75
1011.024	128.64
1011.383	211.17
1011.741	152.91
1012.099	138.35
1012.457	133.5
1012.815	82.53
1013.173	77.67
1013.531	80.1
1013.889	133.5
1014.247	155.34
1014.605	138.35
1014.962	179.61
1015.32	172.33
1015.678	189.32
1016.035	162.62
1016.393	162.62
1016.75	177.19
1017.107	123.79
1017.465	182.04
1017.822	131.07
1018.179	143.21
1018.536	116.51
1018.894	140.78
1019.251	152.91
1019.608	184.47
1019.964	155.34
1020.321	118.93
1020.678	182.04
1021.035	213.6
1021.392	143.21
1021.748	220.88
1022.105	109.23
1022.461	167.48
1022.818	157.77
1023.174	169.91
1023.531	99.52
1023.887	174.76
1024.243	245.15
1024.599	191.75
1024.955	101.94
1025.311	123.79
1025.667	70.39
1026.023	145.63
1026.379	174.76
1026.735	201.46
1027.091	123.79
1027.447	53.4
