189.514	123.64
189.973	123.64
190.431	123.64
190.889	-9.86
191.348	55.67
191.806	24.12
192.264	43.54
192.722	-63.26
193.18	2.28
193.638	-53.55
194.096	-70.54
194.554	-22
195.012	-5.01
195.47	-36.56
195.928	-19.57
196.385	-2.58
196.843	24.12
197.301	33.83
197.758	7.13
198.216	45.97
198.674	28.97
199.131	87.23
199.589	126.06
200.046	43.54
200.503	58.1
200.961	135.77
201.418	123.64
201.875	87.23
202.332	118.78
202.79	143.05
203.247	155.19
203.704	123.64
204.161	126.06
204.618	123.64
205.075	84.8
205.532	128.49
205.989	104.22
206.445	121.21
206.902	128.49
207.359	155.19
207.816	126.06
208.272	232.86
208.729	155.19
209.185	138.2
209.642	121.21
210.098	191.6
210.555	174.61
211.011	118.78
211.467	157.62
211.924	206.16
212.38	167.33
212.836	133.35
213.292	181.89
213.748	160.04
214.204	237.72
214.66	160.04
215.116	133.35
215.572	135.77
216.028	181.89
216.484	240.14
216.94	252.28
217.396	152.76
217.851	169.75
218.307	208.59
218.763	194.03
219.218	147.91
219.674	172.18
220.129	194.03
220.585	150.34
221.04	118.78
221.496	113.93
221.951	135.77
222.406	211.02
222.861	196.45
223.317	189.17
223.772	203.73
224.227	99.36
224.682	191.6
225.137	167.33
225.592	87.23
226.047	164.9
226.502	184.32
226.957	191.6
227.411	157.62
227.866	155.19
228.321	155.19
228.776	162.47
229.23	181.89
229.685	184.32
230.139	126.06
230.594	186.74
231.048	160.04
231.503	145.48
231.957	179.46
232.411	145.48
232.865	169.75
233.32	249.85
233.774	126.06
234.228	174.61
234.682	121.21
235.136	89.66
235.59	211.02
236.044	186.74
236.498	194.03
236.952	157.62
237.406	150.34
237.86	138.2
238.313	128.49
238.767	194.03
239.221	167.33
239.674	147.91
240.128	152.76
240.581	184.32
241.035	155.19
241.488	138.2
241.942	133.35
242.395	196.45
242.848	140.63
243.301	157.62
243.755	160.04
244.208	143.05
244.661	174.61
245.114	147.91
245.567	196.45
246.02	247.42
246.473	177.04
246.926	184.32
247.379	177.04
247.832	130.92
248.284	104.22
248.737	247.42
249.19	198.88
249.642	177.04
250.095	169.75
250.547	126.06
251	179.46
251.452	121.21
251.905	92.08
252.357	143.05
252.81	143.05
253.262	172.18
253.714	128.49
254.166	130.92
254.618	121.21
255.07	111.5
255.523	121.21
255.975	152.76
256.427	140.63
256.878	155.19
257.33	196.45
257.782	213.44
258.234	186.74
258.686	225.58
259.137	181.89
259.589	194.03
260.041	128.49
260.492	126.06
260.944	164.9
261.395	179.46
261.847	252.28
262.298	53.25
262.749	191.6
263.201	242.57
263.652	174.61
264.103	179.46
264.554	155.19
265.005	172.18
265.457	133.35
265.908	179.46
266.359	259.56
266.809	126.06
267.26	155.19
267.711	174.61
268.162	208.59
268.613	194.03
269.064	177.04
269.514	150.34
269.965	126.06
270.415	186.74
270.866	186.74
271.316	242.57
271.767	111.5
272.217	138.2
272.668	230.43
273.118	172.18
273.568	143.05
274.019	181.89
274.469	164.9
274.919	164.9
275.369	157.62
275.819	162.47
276.269	145.48
276.719	189.17
277.169	211.02
277.619	116.35
278.069	191.6
278.518	94.51
278.968	150.34
279.418	135.77
279.867	140.63
280.317	186.74
280.767	194.03
281.216	196.45
281.666	89.66
282.115	194.03
282.564	184.32
283.014	113.93
283.463	152.76
283.912	121.21
284.361	75.09
284.811	189.17
285.26	157.62
285.709	140.63
286.158	208.59
286.607	145.48
287.056	143.05
287.505	211.02
287.953	172.18
288.402	169.75
288.851	116.35
289.3	145.48
289.748	152.76
290.197	140.63
290.646	191.6
291.094	198.88
291.543	94.51
291.991	198.88
292.439	121.21
292.888	206.16
293.336	213.44
293.784	123.64
294.233	162.47
294.681	215.87
295.129	172.18
295.577	201.31
296.025	123.64
296.473	218.3
296.921	147.91
297.369	138.2
297.817	94.51
298.264	194.03
298.712	126.06
299.16	128.49
299.608	177.04
300.055	113.93
300.503	123.64
300.95	138.2
301.398	130.92
301.845	157.62
302.293	220.73
302.74	138.2
303.187	215.87
303.635	245
304.082	184.32
304.529	106.65
304.976	99.36
305.423	138.2
305.87	155.19
306.317	215.87
306.764	147.91
307.211	157.62
307.658	143.05
308.105	181.89
308.552	177.04
308.998	87.23
309.445	109.07
309.892	150.34
310.338	174.61
310.785	225.58
311.231	177.04
311.678	208.59
312.124	203.73
312.571	135.77
313.017	167.33
313.463	201.31
313.909	152.76
314.356	116.35
314.802	181.89
315.248	167.33
315.694	189.17
316.14	174.61
316.586	145.48
317.032	215.87
317.478	186.74
317.923	177.04
318.369	118.78
318.815	140.63
319.261	184.32
319.706	138.2
320.152	121.21
320.597	138.2
321.043	160.04
321.488	172.18
321.934	177.04
322.379	252.28
322.824	164.9
323.27	147.91
323.715	196.45
324.16	140.63
324.605	140.63
325.05	230.43
325.495	126.06
325.94	181.89
326.385	184.32
326.83	169.75
327.275	126.06
327.72	169.75
328.165	206.16
328.61	160.04
329.054	104.22
329.499	167.33
329.943	162.47
330.388	174.61
330.832	235.29
331.277	198.88
331.721	181.89
332.166	179.46
332.61	138.2
333.054	133.35
333.499	223.15
333.943	186.74
334.387	157.62
334.831	215.87
335.275	186.74
335.719	206.16
336.163	164.9
336.607	116.35
337.051	138.2
337.495	196.45
337.938	92.08
338.382	191.6
338.826	169.75
339.269	126.06
339.713	162.47
340.157	143.05
340.6	203.73
341.044	138.2
341.487	150.34
341.93	147.91
342.374	181.89
342.817	164.9
343.26	208.59
343.703	157.62
344.146	215.87
344.59	164.9
345.033	269.27
345.476	133.35
345.919	167.33
346.361	147.91
346.804	220.73
347.247	130.92
347.69	118.78
348.133	155.19
348.575	152.76
349.018	145.48
349.461	179.46
349.903	138.2
350.346	169.75
350.788	167.33
351.23	213.44
351.673	201.31
352.115	223.15
352.557	130.92
353	179.46
353.442	208.59
353.884	162.47
354.326	191.6
354.768	143.05
355.21	198.88
355.652	172.18
356.094	196.45
356.536	157.62
356.978	174.61
357.419	150.34
357.861	169.75
358.303	172.18
358.744	130.92
359.186	191.6
359.627	169.75
360.069	198.88
360.51	123.64
360.952	140.63
361.393	152.76
361.834	155.19
362.276	104.22
362.717	113.93
363.158	104.22
363.599	186.74
364.04	174.61
364.481	167.33
364.922	223.15
365.363	157.62
365.804	179.46
366.245	179.46
366.686	194.03
367.126	121.21
367.567	184.32
368.008	152.76
368.448	196.45
368.889	174.61
369.33	160.04
369.77	206.16
370.21	160.04
370.651	133.35
371.091	135.77
371.531	140.63
371.972	138.2
372.412	133.35
372.852	198.88
373.292	167.33
373.732	147.91
374.172	160.04
374.612	189.17
375.052	145.48
375.492	203.73
375.932	206.16
376.372	167.33
376.811	196.45
377.251	162.47
377.691	167.33
378.13	186.74
378.57	106.65
379.009	116.35
379.449	167.33
379.888	94.51
380.328	208.59
380.767	203.73
381.206	198.88
381.645	172.18
382.085	184.32
382.524	138.2
382.963	186.74
383.402	172.18
383.841	135.77
384.28	218.3
384.719	220.73
385.158	215.87
385.596	228.01
386.035	179.46
386.474	116.35
386.913	126.06
387.351	203.73
387.79	116.35
388.228	160.04
388.667	174.61
389.105	184.32
389.544	150.34
389.982	206.16
390.42	138.2
390.859	169.75
391.297	138.2
391.735	189.17
392.173	181.89
392.611	162.47
393.049	184.32
393.487	206.16
393.925	121.21
394.363	177.04
394.801	206.16
395.239	174.61
395.676	203.73
396.114	162.47
396.552	213.44
396.989	157.62
397.427	218.3
397.864	181.89
398.302	128.49
398.739	186.74
399.177	213.44
399.614	138.2
400.051	157.62
400.488	179.46
400.926	133.35
401.363	211.02
401.8	172.18
402.237	126.06
402.674	157.62
403.111	203.73
403.548	155.19
403.985	123.64
404.421	242.57
404.858	242.57
405.295	208.59
405.732	164.9
406.168	225.58
406.605	167.33
407.041	155.19
407.478	203.73
407.914	111.5
408.351	77.52
408.787	160.04
409.223	128.49
409.66	208.59
410.096	215.87
410.532	203.73
410.968	184.32
411.404	79.95
411.84	208.59
412.276	186.74
412.712	111.5
413.148	150.34
413.584	106.65
414.02	174.61
414.455	62.96
414.891	128.49
415.327	155.19
415.762	123.64
416.198	181.89
416.633	211.02
417.069	167.33
417.504	179.46
417.94	157.62
418.375	194.03
418.81	186.74
419.245	177.04
419.681	196.45
420.116	152.76
420.551	109.07
420.986	201.31
421.421	147.91
421.856	167.33
422.291	157.62
422.726	155.19
423.16	211.02
423.595	147.91
424.03	235.29
424.464	181.89
424.899	198.88
425.334	126.06
425.768	169.75
426.203	60.53
426.637	104.22
427.071	162.47
427.506	206.16
427.94	150.34
428.374	140.63
428.809	172.18
429.243	150.34
429.677	215.87
430.111	147.91
430.545	237.72
430.979	220.73
431.413	123.64
431.847	172.18
432.28	189.17
432.714	164.9
433.148	118.78
433.582	155.19
434.015	101.79
434.449	174.61
434.882	194.03
435.316	116.35
435.749	177.04
436.183	181.89
436.616	177.04
437.049	198.88
437.483	196.45
437.916	135.77
438.349	191.6
438.782	208.59
439.215	184.32
439.648	179.46
440.081	174.61
440.514	174.61
440.947	169.75
441.38	213.44
441.813	237.72
442.245	245
442.678	169.75
443.111	167.33
443.543	147.91
443.976	220.73
444.408	215.87
444.841	152.76
445.273	189.17
445.705	278.98
446.138	111.5
446.57	162.47
447.002	157.62
447.434	145.48
447.867	179.46
448.299	213.44
448.731	206.16
449.163	230.43
449.595	201.31
450.026	208.59
450.458	184.32
450.89	130.92
451.322	167.33
451.754	208.59
452.185	196.45
452.617	249.85
453.048	189.17
453.48	218.3
453.911	218.3
454.343	198.88
454.774	150.34
455.205	218.3
455.637	194.03
456.068	308.11
456.499	293.54
456.93	235.29
457.361	215.87
457.792	237.72
458.223	225.58
458.654	230.43
459.085	252.28
459.516	249.85
459.947	218.3
460.378	201.31
460.808	196.45
461.239	237.72
461.669	213.44
462.1	189.17
462.531	247.42
462.961	150.34
463.391	257.13
463.822	215.87
464.252	232.86
464.682	240.14
465.113	179.46
465.543	167.33
465.973	232.86
466.403	208.59
466.833	218.3
467.263	261.99
467.693	179.46
468.123	164.9
468.553	206.16
468.983	252.28
469.412	133.35
469.842	252.28
470.272	254.71
470.701	225.58
471.131	179.46
471.56	191.6
471.99	172.18
472.419	305.68
472.849	274.12
473.278	194.03
473.707	225.58
474.136	194.03
474.566	191.6
474.995	242.57
475.424	208.59
475.853	215.87
476.282	259.56
476.711	203.73
477.14	208.59
477.569	225.58
477.997	191.6
478.426	167.33
478.855	169.75
479.283	198.88
479.712	167.33
480.141	230.43
480.569	194.03
480.998	133.35
481.426	123.64
481.854	152.76
482.283	257.13
482.711	201.31
483.139	198.88
483.567	218.3
483.995	252.28
484.424	198.88
484.852	167.33
485.28	203.73
485.708	181.89
486.135	196.45
486.563	237.72
486.991	298.4
487.419	162.47
487.847	237.72
488.274	157.62
488.702	140.63
489.129	208.59
489.557	118.78
489.984	191.6
490.412	230.43
490.839	213.44
491.266	237.72
491.694	218.3
492.121	179.46
492.548	223.15
492.975	160.04
493.402	152.76
493.829	123.64
494.256	179.46
494.683	201.31
495.11	177.04
495.537	266.84
495.964	208.59
496.39	203.73
496.817	242.57
497.244	179.46
497.67	179.46
498.097	177.04
498.523	177.04
498.95	162.47
499.376	220.73
499.803	198.88
500.229	169.75
500.655	164.9
501.081	147.91
501.508	160.04
501.934	215.87
502.36	228.01
502.786	172.18
503.212	147.91
503.638	157.62
504.064	237.72
504.489	223.15
504.915	177.04
505.341	167.33
505.767	162.47
506.192	177.04
506.618	237.72
507.043	240.14
507.469	145.48
507.894	206.16
508.32	189.17
508.745	152.76
509.17	135.77
509.596	150.34
510.021	181.89
510.446	164.9
510.871	194.03
511.296	116.35
511.721	109.07
512.146	130.92
512.571	177.04
512.996	181.89
513.421	218.3
513.845	196.45
514.27	203.73
514.695	232.86
515.119	138.2
515.544	82.37
515.969	198.88
516.393	164.9
516.817	198.88
517.242	228.01
517.666	198.88
518.09	177.04
518.515	145.48
518.939	79.95
519.363	427.04
519.787	230.43
520.211	218.3
520.635	167.33
521.059	169.75
521.483	237.72
521.907	218.3
522.331	215.87
522.754	138.2
523.178	167.33
523.602	167.33
524.025	181.89
524.449	123.64
524.872	167.33
525.296	194.03
525.719	177.04
526.143	257.13
526.566	172.18
526.989	242.57
527.412	211.02
527.836	147.91
528.259	198.88
528.682	198.88
529.105	218.3
529.528	162.47
529.951	147.91
530.374	230.43
530.796	143.05
531.219	203.73
531.642	179.46
532.065	191.6
532.487	203.73
532.91	225.58
533.332	143.05
533.755	206.16
534.177	118.78
534.6	186.74
535.022	223.15
535.444	172.18
535.867	179.46
536.289	189.17
536.711	220.73
537.133	174.61
537.555	228.01
537.977	172.18
538.399	184.32
538.821	169.75
539.243	133.35
539.665	196.45
540.086	201.31
540.508	191.6
540.93	208.59
541.351	271.7
541.773	201.31
542.195	269.27
542.616	259.56
543.037	264.42
543.459	208.59
543.88	189.17
544.301	310.53
544.723	215.87
545.144	213.44
545.565	247.42
545.986	310.53
546.407	201.31
546.828	240.14
547.249	223.15
547.67	215.87
548.091	235.29
548.512	230.43
548.932	203.73
549.353	208.59
549.774	220.73
550.194	194.03
550.615	162.47
551.035	215.87
551.456	206.16
551.876	179.46
552.296	191.6
552.717	196.45
553.137	169.75
553.557	186.74
553.977	138.2
554.397	150.34
554.817	240.14
555.237	174.61
555.657	194.03
556.077	118.78
556.497	87.23
556.917	196.45
557.337	140.63
557.756	174.61
558.176	177.04
558.596	147.91
559.015	177.04
559.435	177.04
559.854	211.02
560.274	160.04
560.693	218.3
561.112	121.21
561.532	184.32
561.951	172.18
562.37	150.34
562.789	160.04
563.208	147.91
563.627	196.45
564.046	162.47
564.465	186.74
564.884	118.78
565.303	164.9
565.722	155.19
566.14	228.01
566.559	223.15
566.978	223.15
567.396	300.82
567.815	128.49
568.233	186.74
568.652	135.77
569.07	179.46
569.489	164.9
569.907	203.73
570.325	191.6
570.743	174.61
571.161	198.88
571.58	167.33
571.998	223.15
572.416	184.32
572.833	162.47
573.251	177.04
573.669	130.92
574.087	177.04
574.505	162.47
574.922	169.75
575.34	157.62
575.758	186.74
576.175	189.17
576.593	116.35
577.01	172.18
577.428	128.49
577.845	1672.2
578.262	308.11
578.68	215.87
579.097	194.03
579.514	223.15
579.931	186.74
580.348	155.19
580.765	162.47
581.182	150.34
581.599	194.03
582.016	169.75
582.433	172.18
582.849	213.44
583.266	174.61
583.683	181.89
584.099	201.31
584.516	247.42
584.933	215.87
585.349	186.74
585.765	181.89
586.182	230.43
586.598	201.31
587.014	317.81
587.431	213.44
587.847	167.33
588.263	152.76
588.679	211.02
589.095	164.9
589.511	228.01
589.927	240.14
590.343	169.75
590.759	140.63
591.174	177.04
591.59	160.04
592.006	167.33
592.421	179.46
592.837	179.46
593.252	189.17
593.668	213.44
594.083	206.16
594.499	121.21
594.914	162.47
595.329	186.74
595.745	186.74
596.16	147.91
596.575	104.22
596.99	232.86
597.405	206.16
597.82	167.33
598.235	172.18
598.65	177.04
599.065	196.45
599.479	123.64
599.894	172.18
600.309	174.61
600.724	162.47
601.138	232.86
601.553	181.89
601.967	174.61
602.382	179.46
602.796	220.73
603.21	198.88
603.625	196.45
604.039	169.75
604.453	160.04
604.867	215.87
605.281	160.04
605.695	186.74
606.109	157.62
606.523	220.73
606.937	215.87
607.351	242.57
607.765	152.76
608.178	177.04
608.592	213.44
609.006	181.89
609.419	177.04
609.833	184.32
610.246	264.42
610.66	211.02
611.073	274.12
611.487	288.69
611.9	191.6
612.313	194.03
612.726	235.29
613.139	230.43
613.553	181.89
613.966	174.61
614.379	126.06
614.792	118.78
615.204	276.55
615.617	145.48
616.03	162.47
616.443	152.76
616.856	150.34
617.268	203.73
617.681	196.45
618.093	208.59
618.506	203.73
618.918	191.6
619.331	181.89
619.743	201.31
620.155	198.88
620.568	186.74
620.98	203.73
621.392	211.02
621.804	169.75
622.216	189.17
622.628	147.91
623.04	215.87
623.452	177.04
623.864	174.61
624.276	172.18
624.687	155.19
625.099	201.31
625.511	218.3
625.922	228.01
626.334	160.04
626.745	147.91
627.157	232.86
627.568	223.15
627.979	126.06
628.391	194.03
628.802	203.73
629.213	157.62
629.624	208.59
630.035	235.29
630.446	157.62
630.857	106.65
631.268	130.92
631.679	150.34
632.09	203.73
632.501	228.01
632.912	245
633.322	215.87
633.733	162.47
634.144	242.57
634.554	174.61
634.965	252.28
635.375	162.47
635.785	213.44
636.196	240.14
636.606	155.19
637.016	208.59
637.427	133.35
637.837	157.62
638.247	203.73
638.657	160.04
639.067	191.6
639.477	87.23
639.887	196.45
640.297	174.61
640.706	198.88
641.116	201.31
641.526	181.89
641.935	220.73
642.345	130.92
642.755	147.91
643.164	164.9
643.573	196.45
643.983	218.3
644.392	225.58
644.801	177.04
645.211	213.44
645.62	196.45
646.029	164.9
646.438	232.86
646.847	152.76
647.256	145.48
647.665	160.04
648.074	179.46
648.483	218.3
648.892	206.16
649.3	169.75
649.709	198.88
650.118	128.49
650.526	196.45
650.935	133.35
651.343	179.46
651.752	164.9
652.16	208.59
652.568	160.04
652.977	106.65
653.385	235.29
653.793	164.9
654.201	220.73
654.609	128.49
655.017	160.04
655.425	143.05
655.833	174.61
656.241	157.62
656.649	150.34
657.057	150.34
657.464	162.47
657.872	237.72
658.28	201.31
658.687	252.28
659.095	276.55
659.502	181.89
659.91	235.29
660.317	94.51
660.724	198.88
661.132	143.05
661.539	201.31
661.946	126.06
662.353	208.59
662.76	196.45
663.167	133.35
663.574	126.06
663.981	179.46
664.388	164.9
664.795	169.75
665.202	157.62
665.608	179.46
666.015	164.9
666.422	152.76
666.828	169.75
667.235	184.32
667.641	164.9
668.047	184.32
668.454	203.73
668.86	143.05
669.266	181.89
669.673	174.61
670.079	198.88
670.485	111.5
670.891	174.61
671.297	121.21
671.703	75.09
672.109	162.47
672.515	169.75
672.92	140.63
673.326	138.2
673.732	198.88
674.138	130.92
674.543	220.73
674.949	169.75
675.354	191.6
675.76	194.03
676.165	215.87
676.57	245
676.976	206.16
677.381	106.65
677.786	138.2
678.191	128.49
678.596	116.35
679.001	174.61
679.406	220.73
679.811	135.77
680.216	157.62
680.621	169.75
681.026	155.19
681.43	167.33
681.835	208.59
682.24	194.03
682.644	169.75
683.049	201.31
683.453	169.75
683.858	162.47
684.262	150.34
684.667	218.3
685.071	179.46
685.475	167.33
685.879	198.88
686.283	196.45
686.687	150.34
687.091	177.04
687.495	157.62
687.899	157.62
688.303	138.2
688.707	194.03
689.111	208.59
689.514	162.47
689.918	211.02
690.322	218.3
690.725	230.43
691.129	177.04
691.532	172.18
691.936	184.32
692.339	145.48
692.742	162.47
693.146	135.77
693.549	203.73
693.952	201.31
694.355	191.6
694.758	160.04
695.161	172.18
695.564	208.59
695.967	157.62
696.37	198.88
696.773	150.34
697.175	157.62
697.578	138.2
697.981	194.03
698.383	225.58
698.786	191.6
699.188	211.02
699.591	232.86
699.993	174.61
700.395	223.15
700.798	194.03
701.2	138.2
701.602	206.16
702.004	206.16
702.406	194.03
702.808	155.19
703.21	99.36
703.612	152.76
704.014	291.11
704.416	198.88
704.818	186.74
705.219	162.47
705.621	128.49
706.023	264.42
706.424	242.57
706.826	235.29
707.227	269.27
707.629	206.16
708.03	242.57
708.431	196.45
708.832	181.89
709.234	237.72
709.635	247.42
710.036	235.29
710.437	186.74
710.838	184.32
711.239	225.58
711.64	252.28
712.041	128.49
712.441	174.61
712.842	198.88
713.243	228.01
713.643	147.91
714.044	194.03
714.445	240.14
714.845	167.33
715.246	220.73
715.646	215.87
716.046	300.82
716.447	274.12
716.847	257.13
717.247	317.81
717.647	194.03
718.047	203.73
718.447	211.02
718.847	242.57
719.247	225.58
719.647	213.44
720.047	211.02
720.446	242.57
720.846	203.73
721.246	308.11
721.645	351.8
722.045	230.43
722.444	332.38
722.844	300.82
723.243	429.47
723.643	278.98
724.042	293.54
724.441	213.44
724.84	278.98
725.24	320.24
725.639	300.82
726.038	363.93
726.437	291.11
726.836	322.67
727.234	383.35
727.633	393.06
728.032	414.9
728.431	397.91
728.83	436.75
729.228	378.49
729.627	417.33
730.025	446.46
730.424	497.43
730.822	606.65
731.22	589.66
731.619	545.97
732.017	618.79
732.415	626.07
732.813	628.5
733.212	684.32
733.61	820.25
734.008	992.58
734.406	980.45
734.803	1072.68
735.201	1133.36
735.599	1160.06
735.997	1245.01
736.395	1281.42
736.792	1417.35
737.19	1470.74
737.587	1502.3
737.985	1550.84
738.382	1650.36
738.78	1832.4
739.177	1720.75
739.574	1968.33
739.971	2116.39
740.369	2079.98
740.766	2203.77
741.163	2300.85
741.56	2274.16
741.957	2397.94
742.354	2509.6
742.751	2611.54
743.147	2752.32
743.544	2880.96
743.941	2873.68
744.338	3157.66
744.734	3077.57
745.131	3470.78
745.527	3820.3
745.924	3820.3
746.32	4084.86
746.716	4172.24
747.113	4555.74
747.509	4868.86
747.905	5065.46
748.301	5201.39
748.697	5288.77
749.093	5757.22
749.489	5837.32
749.885	6041.2
750.281	6708.69
750.677	6791.22
751.073	7029.08
751.468	7470.84
751.864	7645.6
752.26	7701.42
752.655	7965.99
753.051	8223.28
753.446	8395.61
753.842	8764.55
754.237	9376.21
754.632	9016.98
755.028	9155.33
755.423	9196.59
755.818	9351.94
756.213	9839.81
756.608	9550.97
757.003	9490.29
757.398	9550.97
757.793	9609.22
758.188	9587.38
758.583	9907.77
758.977	9951.46
759.372	10356.81
759.767	11114.1
760.161	12118.97
760.556	12849.56
760.95	13446.66
761.345	14145.7
761.739	14835.03
762.133	15184.55
762.527	16832.63
762.922	17109.34
763.316	17585.07
763.71	18291.39
764.104	18410.33
764.498	19031.7
764.892	19900.64
765.286	20582.69
765.68	21143.38
766.073	22041.45
766.467	22373.98
766.861	22694.38
767.255	24485.67
767.648	25830.35
768.042	26099.77
768.435	25713.84
768.829	26798.81
769.222	27815.81
769.615	28007.57
770.008	27830.38
770.402	28437.18
770.795	28230.87
771.188	28354.66
771.581	27793.97
771.974	28446.89
772.367	26808.52
772.76	26568.22
773.153	26660.46
773.545	26267.25
773.938	26420.16
774.331	26810.94
774.724	27383.77
775.116	28359.51
775.509	28898.36
775.901	30551.29
776.294	31148.39
776.686	31743.06
777.078	32427.54
777.471	33932.41
777.863	35131.46
778.255	35922.74
778.647	36247.98
779.039	37274.7
779.431	36847.51
779.823	37238.29
780.215	38371.8
780.607	37910.63
780.999	38777.15
781.39	38041.7
781.782	38447.05
782.174	39102.4
782.565	39978.63
782.957	40235.91
783.348	40592.71
783.74	39745.61
784.131	40146.1
784.522	39954.35
784.914	39320.85
785.305	39396.09
785.696	38546.56
786.087	37658.2
786.478	37019.84
786.869	36398.47
787.26	34597.47
787.651	33721.25
788.042	33165.41
788.433	31517.33
788.823	30226.05
789.214	29485.74
789.605	27660.47
789.995	26730.85
790.386	26551.23
790.776	25658.01
791.167	24963.83
791.557	26109.48
791.948	26937.16
792.338	27526.98
792.728	28335.24
793.118	29148.36
793.508	29485.74
793.898	29369.24
794.288	28881.37
794.678	28621.65
795.068	29034.28
795.458	28293.98
795.848	28738.16
796.238	28735.73
796.627	28461.46
797.017	28803.69
797.406	29451.76
797.796	28318.25
798.185	28847.38
798.575	29903.23
798.964	29548.85
799.354	29934.78
799.743	30929.94
800.132	31361.99
800.521	31388.69
800.91	31179.94
801.299	31155.67
801.688	30864.41
802.077	30514.89
802.466	30143.52
802.855	30832.85
803.244	28983.31
803.633	28323.1
804.021	27934.75
804.41	27675.04
804.799	26730.85
805.187	25492.96
805.576	25529.37
805.964	24534.21
806.352	23298.75
806.741	23364.29
807.129	22810.88
807.517	21966.21
807.905	22517.19
808.293	22621.56
808.681	22383.69
809.069	23767.21
809.457	24708.97
809.845	24376.44
810.233	23679.83
810.621	24677.42
811.009	25194.41
811.396	24759.94
811.784	26036.66
812.171	26250.26
812.559	25065.77
812.946	24228.38
813.334	24616.74
813.721	23871.58
814.108	23080.3
814.496	23548.76
814.883	23349.73
815.27	24141
815.657	23764.78
816.044	24133.72
816.431	23806.04
816.818	24090.03
817.205	23881.29
817.592	24357.02
817.979	23655.56
818.365	22480.78
818.752	21898.25
819.139	21873.97
819.525	21162.8
819.912	20412.79
820.298	19866.66
820.685	19344.81
821.071	18310.81
821.457	17886.05
821.843	17233.13
822.23	16407.87
822.616	15063.19
823.002	14730.66
823.388	14446.67
823.774	13131.12
824.16	12674.8
824.546	12762.18
824.931	11771.88
825.317	11504.88
825.703	11371.38
826.089	11791.29
826.474	11371.38
826.86	11189.34
827.245	11128.66
827.631	11080.12
828.016	10424.77
828.401	10713.61
828.787	10784
829.172	10359.23
829.557	9529.12
829.942	9298.54
830.327	9706.31
830.712	9424.75
831.097	8691.73
831.482	8774.26
831.867	8735.42
832.252	8519.4
832.636	8332.5
833.021	8191.72
833.406	8099.49
833.79	8087.35
834.175	7864.05
834.559	8053.37
834.944	7638.32
835.328	7376.18
835.713	7259.67
836.097	7213.55
836.481	6364.02
836.865	6359.17
837.249	6191.69
837.633	6063.05
838.017	5684.4
838.401	5417.41
838.785	5279.06
839.169	5053.32
839.553	4723.22
839.937	4504.77
840.32	4308.17
840.704	4080.01
841.087	3939.23
841.471	3706.22
841.854	3519.32
842.238	3313.01
842.621	3281.45
843.004	3194.07
843.388	3138.25
843.771	3147.96
844.154	3101.84
844.537	2958.63
844.92	3220.77
845.303	3007.18
845.686	3084.85
846.069	2965.91
846.452	2902.81
846.834	2885.82
847.217	2842.13
847.6	2839.7
847.982	2674.65
848.365	2601.83
848.748	2628.53
849.13	2657.66
849.512	2463.48
849.895	2628.53
850.277	2337.26
850.659	2448.92
851.041	2344.54
851.423	2293.57
851.806	2359.11
852.188	2405.23
852.57	2245.03
852.951	2128.52
853.333	2211.05
853.715	2266.87
854.097	2026.58
854.479	1968.33
854.86	1953.76
855.242	1992.6
855.623	1766.87
856.005	1783.86
856.386	1664.92
856.768	1842.11
857.149	1630.94
857.53	1383.36
857.911	1521.72
858.292	1436.76
858.674	1291.13
859.055	1262
859.436	1276.57
859.817	1155.21
860.197	1043.55
860.578	1155.21
860.959	1009.57
861.34	946.46
861.72	990.15
862.101	946.46
862.482	995.01
862.862	963.46
863.243	791.12
863.623	822.68
864.003	851.8
864.384	905.2
864.764	803.26
865.144	672.19
865.524	701.32
865.904	764.42
866.284	684.32
866.664	596.94
867.044	706.17
867.424	660.05
867.804	616.36
868.183	536.26
868.563	558.11
868.943	647.92
869.322	618.79
869.702	521.7
870.081	446.46
870.461	516.85
870.84	545.97
871.22	453.74
871.599	424.61
871.978	507.14
872.357	475.58
872.736	410.05
873.115	351.8
873.494	410.05
873.873	427.04
874.252	376.07
874.631	344.51
875.01	269.27
875.388	344.51
875.767	317.81
876.146	259.56
876.524	320.24
876.903	334.8
877.281	264.42
877.66	252.28
878.038	252.28
878.416	281.41
878.794	225.58
879.173	281.41
879.551	177.04
879.929	240.14
880.307	218.3
880.685	211.02
881.063	218.3
881.441	281.41
881.818	194.03
882.196	232.86
882.574	259.56
882.951	201.31
883.329	179.46
883.707	225.58
884.084	196.45
884.461	177.04
884.839	198.88
885.216	206.16
885.593	213.44
885.971	240.14
886.348	186.74
886.725	172.18
887.102	215.87
887.479	167.33
887.856	189.17
888.233	240.14
888.609	213.44
888.986	249.85
889.363	162.47
889.74	225.58
890.116	211.02
890.493	181.89
890.869	194.03
891.246	220.73
891.622	186.74
891.998	215.87
892.375	215.87
892.751	143.05
893.127	245
893.503	162.47
893.879	162.47
894.255	140.63
894.631	184.32
895.007	140.63
895.383	252.28
895.759	220.73
896.134	194.03
896.51	179.46
896.886	169.75
897.261	179.46
897.637	172.18
898.012	160.04
898.388	242.57
898.763	164.9
899.138	164.9
899.514	186.74
899.889	184.32
900.264	245
900.639	211.02
901.014	288.69
901.389	174.61
901.764	194.03
902.139	160.04
902.513	186.74
902.888	130.92
903.263	160.04
903.638	152.76
904.012	160.04
904.387	65.38
904.761	203.73
905.136	147.91
905.51	172.18
905.884	169.75
906.259	89.66
906.633	189.17
907.007	172.18
907.381	155.19
907.755	133.35
908.129	143.05
908.503	155.19
908.877	152.76
909.251	174.61
909.624	164.9
909.998	147.91
910.372	109.07
910.745	111.5
911.119	184.32
911.492	164.9
911.866	126.06
912.239	79.95
912.612	94.51
912.986	162.47
913.359	162.47
913.732	155.19
914.105	215.87
914.478	140.63
914.851	123.64
915.224	123.64
915.597	106.65
915.97	184.32
916.343	191.6
916.715	167.33
917.088	261.99
917.461	118.78
917.833	228.01
918.206	208.59
918.578	237.72
918.951	123.64
919.323	116.35
919.695	169.75
920.067	245
920.44	160.04
920.812	123.64
921.184	143.05
921.556	160.04
921.928	147.91
922.3	118.78
922.672	143.05
923.043	181.89
923.415	145.48
923.787	126.06
924.158	162.47
924.53	128.49
924.901	123.64
925.273	215.87
925.644	130.92
926.016	179.46
926.387	152.76
926.758	128.49
927.129	237.72
927.5	203.73
927.872	189.17
928.243	198.88
928.613	143.05
928.984	109.07
929.355	155.19
929.726	223.15
930.097	116.35
930.467	206.16
930.838	128.49
931.209	111.5
931.579	167.33
931.95	164.9
932.32	106.65
932.69	213.44
933.061	189.17
933.431	179.46
933.801	181.89
934.171	177.04
934.541	191.6
934.911	167.33
935.281	111.5
935.651	113.93
936.021	186.74
936.391	96.94
936.761	164.9
937.13	116.35
937.5	109.07
937.87	172.18
938.239	135.77
938.609	172.18
938.978	172.18
939.347	140.63
939.717	130.92
940.086	235.29
940.455	140.63
940.824	162.47
941.193	186.74
941.562	228.01
941.931	101.79
942.3	189.17
942.669	191.6
943.038	106.65
943.407	130.92
943.775	152.76
944.144	145.48
944.513	213.44
944.881	167.33
945.25	104.22
945.618	96.94
945.986	147.91
946.355	162.47
946.723	96.94
947.091	121.21
947.459	133.35
947.827	191.6
948.195	135.77
948.563	181.89
948.931	196.45
949.299	201.31
949.667	179.46
950.035	157.62
950.402	203.73
950.77	179.46
951.138	162.47
951.505	140.63
951.873	160.04
952.24	177.04
952.607	177.04
952.975	225.58
953.342	138.2
953.709	198.88
954.076	128.49
954.443	164.9
954.81	143.05
955.177	184.32
955.544	179.46
955.911	177.04
956.278	198.88
956.645	208.59
957.012	150.34
957.378	94.51
957.745	143.05
958.111	220.73
958.478	201.31
958.844	145.48
959.211	160.04
959.577	155.19
959.943	206.16
960.309	196.45
960.675	198.88
961.042	113.93
961.408	162.47
961.774	126.06
962.139	128.49
962.505	169.75
962.871	164.9
963.237	150.34
963.603	162.47
963.968	140.63
964.334	109.07
964.699	130.92
965.065	130.92
965.43	147.91
965.796	245
966.161	186.74
966.526	118.78
966.891	126.06
967.256	177.04
967.622	184.32
967.987	155.19
968.352	179.46
968.716	206.16
969.081	152.76
969.446	84.8
969.811	208.59
970.176	143.05
970.54	174.61
970.905	179.46
971.269	111.5
971.634	150.34
971.998	106.65
972.363	126.06
972.727	179.46
973.091	45.97
973.455	172.18
973.819	203.73
974.183	138.2
974.547	155.19
974.911	164.9
975.275	123.64
975.639	213.44
976.003	181.89
976.367	128.49
976.73	198.88
977.094	138.2
977.458	164.9
977.821	157.62
978.185	157.62
978.548	138.2
978.911	106.65
979.275	196.45
979.638	123.64
980.001	152.76
980.364	164.9
980.727	225.58
981.09	135.77
981.453	164.9
981.816	201.31
982.179	247.42
982.542	157.62
982.905	157.62
983.267	147.91
983.63	194.03
983.992	147.91
984.355	164.9
984.717	164.9
985.08	220.73
985.442	130.92
985.804	172.18
986.167	152.76
986.529	164.9
986.891	177.04
987.253	196.45
987.615	181.89
987.977	174.61
988.339	186.74
988.701	206.16
989.062	242.57
989.424	143.05
989.786	174.61
990.147	152.76
990.509	155.19
990.87	135.77
991.232	189.17
991.593	99.36
991.955	218.3
992.316	191.6
992.677	94.51
993.038	201.31
993.399	191.6
993.76	157.62
994.121	121.21
994.482	172.18
994.843	133.35
995.204	232.86
995.565	164.9
995.926	242.57
996.286	162.47
996.647	145.48
997.007	164.9
997.368	167.33
997.728	99.36
998.089	162.47
998.449	191.6
998.809	133.35
999.169	152.76
999.53	65.38
999.89	101.79
1000.25	157.62
1000.61	157.62
1000.97	101.79
1001.329	162.47
1001.689	172.18
1002.049	94.51
1002.409	181.89
1002.768	143.05
1003.128	138.2
1003.487	130.92
1003.847	184.32
1004.206	208.59
1004.566	162.47
1004.925	128.49
1005.284	118.78
1005.643	194.03
1006.003	135.77
1006.362	208.59
1006.721	162.47
1007.08	150.34
1007.438	162.47
1007.797	118.78
1008.156	133.35
1008.515	186.74
1008.874	150.34
1009.232	164.9
1009.591	169.75
1009.949	155.19
1010.308	179.46
1010.666	130.92
1011.024	128.49
1011.383	218.3
1011.741	169.75
1012.099	164.9
1012.457	196.45
1012.815	111.5
1013.173	162.47
1013.531	160.04
1013.889	140.63
1014.247	121.21
1014.605	65.38
1014.962	198.88
1015.32	164.9
1015.678	174.61
1016.035	140.63
1016.393	189.17
1016.75	169.75
1017.107	167.33
1017.465	201.31
1017.822	60.53
1018.179	113.93
1018.536	184.32
1018.894	261.99
1019.251	79.95
1019.608	157.62
1019.964	121.21
1020.321	184.32
1020.678	211.02
1021.035	155.19
1021.392	155.19
1021.748	194.03
1022.105	155.19
1022.461	208.59
1022.818	75.09
1023.174	157.62
1023.531	179.46
1023.887	186.74
1024.243	169.75
1024.599	155.19
1024.955	157.62
1025.311	225.58
1025.667	160.04
1026.023	126.06
1026.379	133.35
1026.735	208.59
1027.091	220.73
1027.447	169.75
