189.514	86.62
189.973	86.62
190.431	86.62
190.889	-20.18
191.348	-17.75
191.806	33.22
192.264	23.51
192.722	-20.18
193.18	-0.76
193.638	-20.18
194.096	-63.87
194.554	-20.18
195.012	45.36
195.47	-10.47
195.928	38.08
196.385	-32.31
196.843	-44.45
197.301	-100.27
197.758	52.64
198.216	64.78
198.674	74.49
199.131	13.8
199.589	84.19
200.046	57.49
200.503	91.48
200.961	113.32
201.418	16.23
201.875	47.79
202.332	89.05
202.79	140.02
203.247	147.3
203.704	229.83
204.161	205.56
204.618	147.3
205.075	181.28
205.532	149.73
205.989	120.6
206.445	186.14
206.902	135.17
207.359	144.87
207.816	137.59
208.272	110.89
208.729	224.97
209.185	154.58
209.642	132.74
210.098	164.29
210.555	188.56
211.011	159.44
211.467	181.28
211.924	81.77
212.38	181.28
212.836	200.7
213.292	181.28
213.748	98.76
214.204	193.42
214.66	106.04
215.116	118.18
215.572	159.44
216.028	108.47
216.484	188.56
216.94	190.99
217.396	178.86
217.851	178.86
218.307	137.59
218.763	190.99
219.218	174
219.674	181.28
220.129	178.86
220.585	130.31
221.04	159.44
221.496	147.3
221.951	190.99
222.406	205.56
222.861	178.86
223.317	154.58
223.772	142.45
224.227	215.26
224.682	154.58
225.137	161.87
225.592	157.01
226.047	137.59
226.502	142.45
226.957	159.44
227.411	217.69
227.866	130.31
228.321	176.43
228.776	157.01
229.23	193.42
229.685	159.44
230.139	200.7
230.594	154.58
231.048	149.73
231.503	181.28
231.957	96.33
232.411	166.72
232.865	135.17
233.32	212.84
233.774	193.42
234.228	147.3
234.682	186.14
235.136	113.32
235.59	152.16
236.044	200.7
236.498	266.24
236.952	171.57
237.406	195.85
237.86	178.86
238.313	169.15
238.767	200.7
239.221	149.73
239.674	195.85
240.128	203.13
240.581	157.01
241.035	164.29
241.488	152.16
241.942	207.98
242.395	125.46
242.848	149.73
243.301	120.6
243.755	241.96
244.208	198.27
244.661	212.84
245.114	161.87
245.567	203.13
246.02	166.72
246.473	149.73
246.926	157.01
247.379	130.31
247.832	149.73
248.284	144.87
248.737	200.7
249.19	217.69
249.642	98.76
250.095	123.03
250.547	135.17
251	174
251.452	159.44
251.905	181.28
252.357	142.45
252.81	147.3
253.262	193.42
253.714	183.71
254.166	120.6
254.618	147.3
255.07	198.27
255.523	154.58
255.975	212.84
256.427	147.3
256.878	188.56
257.33	142.45
257.782	154.58
258.234	178.86
258.686	215.26
259.137	217.69
259.589	140.02
260.041	205.56
260.492	59.92
260.944	174
261.395	130.31
261.847	101.18
262.298	215.26
262.749	123.03
263.201	108.47
263.652	67.2
264.103	140.02
264.554	103.61
265.005	110.89
265.457	161.87
265.908	161.87
266.359	135.17
266.809	171.57
267.26	169.15
267.711	149.73
268.162	164.29
268.613	147.3
269.064	210.41
269.514	171.57
269.965	176.43
270.415	193.42
270.866	212.84
271.316	195.85
271.767	183.71
272.217	113.32
272.668	123.03
273.118	198.27
273.568	183.71
274.019	193.42
274.469	183.71
274.919	140.02
275.369	186.14
275.819	166.72
276.269	234.68
276.719	188.56
277.169	178.86
277.619	178.86
278.069	79.34
278.518	132.74
278.968	113.32
279.418	183.71
279.867	125.46
280.317	198.27
280.767	171.57
281.216	169.15
281.666	176.43
282.115	176.43
282.564	203.13
283.014	181.28
283.463	140.02
283.912	176.43
284.361	178.86
284.811	147.3
285.26	125.46
285.709	103.61
286.158	244.39
286.607	161.87
287.056	203.13
287.505	234.68
287.953	127.88
288.402	130.31
288.851	149.73
289.3	132.74
289.748	161.87
290.197	171.57
290.646	217.69
291.094	203.13
291.543	147.3
291.991	181.28
292.439	110.89
292.888	110.89
293.336	108.47
293.784	198.27
294.233	142.45
294.681	215.26
295.129	108.47
295.577	193.42
296.025	215.26
296.473	161.87
296.921	188.56
297.369	130.31
297.817	210.41
298.264	106.04
298.712	178.86
299.16	183.71
299.608	125.46
300.055	186.14
300.503	113.32
300.95	123.03
301.398	198.27
301.845	166.72
302.293	159.44
302.74	174
303.187	210.41
303.635	137.59
304.082	149.73
304.529	241.96
304.976	188.56
305.423	140.02
305.87	103.61
306.317	178.86
306.764	227.4
307.211	115.75
307.658	207.98
308.105	198.27
308.552	164.29
308.998	96.33
309.445	157.01
309.892	140.02
310.338	174
310.785	193.42
311.231	188.56
311.678	130.31
312.124	178.86
312.571	169.15
313.017	171.57
313.463	123.03
313.909	186.14
314.356	181.28
314.802	171.57
315.248	140.02
315.694	137.59
316.14	169.15
316.586	110.89
317.032	217.69
317.478	224.97
317.923	132.74
318.369	212.84
318.815	147.3
319.261	174
319.706	210.41
320.152	137.59
320.597	159.44
321.043	110.89
321.488	215.26
321.934	132.74
322.379	186.14
322.824	140.02
323.27	157.01
323.715	188.56
324.16	169.15
324.605	130.31
325.05	164.29
325.495	207.98
325.94	157.01
326.385	110.89
326.83	101.18
327.275	142.45
327.72	140.02
328.165	135.17
328.61	224.97
329.054	137.59
329.499	207.98
329.943	152.16
330.388	132.74
330.832	159.44
331.277	190.99
331.721	217.69
332.166	174
332.61	137.59
333.054	237.11
333.499	135.17
333.943	246.82
334.387	154.58
334.831	169.15
335.275	171.57
335.719	176.43
336.163	147.3
336.607	159.44
337.051	157.01
337.495	176.43
337.938	178.86
338.382	176.43
338.826	198.27
339.269	222.55
339.713	147.3
340.157	154.58
340.6	171.57
341.044	166.72
341.487	302.64
341.93	142.45
342.374	84.19
342.817	152.16
343.26	154.58
343.703	183.71
344.146	161.87
344.59	142.45
345.033	86.62
345.476	178.86
345.919	144.87
346.361	164.29
346.804	171.57
347.247	186.14
347.69	195.85
348.133	149.73
348.575	161.87
349.018	113.32
349.461	166.72
349.903	244.39
350.346	176.43
350.788	210.41
351.23	164.29
351.673	157.01
352.115	181.28
352.557	125.46
353	132.74
353.442	113.32
353.884	207.98
354.326	132.74
354.768	118.18
355.21	55.07
355.652	161.87
356.094	169.15
356.536	181.28
356.978	176.43
357.419	144.87
357.861	229.83
358.303	125.46
358.744	174
359.186	130.31
359.627	203.13
360.069	171.57
360.51	190.99
360.952	266.24
361.393	166.72
361.834	152.16
362.276	161.87
362.717	174
363.158	186.14
363.599	144.87
364.04	79.34
364.481	176.43
364.922	161.87
365.363	113.32
365.804	178.86
366.245	188.56
366.686	154.58
367.126	244.39
367.567	190.99
368.008	174
368.448	127.88
368.889	176.43
369.33	149.73
369.77	195.85
370.21	98.76
370.651	193.42
371.091	96.33
371.531	176.43
371.972	159.44
372.412	176.43
372.852	190.99
373.292	203.13
373.732	164.29
374.172	169.15
374.612	106.04
375.052	89.05
375.492	186.14
375.932	123.03
376.372	188.56
376.811	144.87
377.251	96.33
377.691	210.41
378.13	174
378.57	203.13
379.009	161.87
379.449	178.86
379.888	198.27
380.328	200.7
380.767	142.45
381.206	118.18
381.645	130.31
382.085	159.44
382.524	140.02
382.963	135.17
383.402	164.29
383.841	149.73
384.28	171.57
384.719	217.69
385.158	144.87
385.596	120.6
386.035	205.56
386.474	96.33
386.913	181.28
387.351	159.44
387.79	130.31
388.228	125.46
388.667	103.61
389.105	174
389.544	149.73
389.982	157.01
390.42	118.18
390.859	144.87
391.297	198.27
391.735	217.69
392.173	157.01
392.611	198.27
393.049	161.87
393.487	118.18
393.925	193.42
394.363	186.14
394.801	203.13
395.239	144.87
395.676	171.57
396.114	115.75
396.552	190.99
396.989	198.27
397.427	132.74
397.864	174
398.302	207.98
398.739	113.32
399.177	154.58
399.614	205.56
400.051	200.7
400.488	176.43
400.926	152.16
401.363	103.61
401.8	164.29
402.237	147.3
402.674	188.56
403.111	137.59
403.548	207.98
403.985	101.18
404.421	157.01
404.858	186.14
405.295	205.56
405.732	174
406.168	193.42
406.605	130.31
407.041	237.11
407.478	147.3
407.914	125.46
408.351	176.43
408.787	181.28
409.223	181.28
409.66	178.86
410.096	154.58
410.532	103.61
410.968	207.98
411.404	147.3
411.84	91.48
412.276	166.72
412.712	159.44
413.148	205.56
413.584	101.18
414.02	246.82
414.455	186.14
414.891	176.43
415.327	118.18
415.762	198.27
416.198	147.3
416.633	161.87
417.069	118.18
417.504	157.01
417.94	147.3
418.375	203.13
418.81	200.7
419.245	98.76
419.681	154.58
420.116	157.01
420.551	152.16
420.986	174
421.421	147.3
421.856	169.15
422.291	205.56
422.726	127.88
423.16	227.4
423.595	224.97
424.03	149.73
424.464	161.87
424.899	161.87
425.334	161.87
425.768	123.03
426.203	59.92
426.637	215.26
427.071	144.87
427.506	181.28
427.94	149.73
428.374	176.43
428.809	125.46
429.243	176.43
429.677	224.97
430.111	140.02
430.545	227.4
430.979	101.18
431.413	118.18
431.847	164.29
432.28	227.4
432.714	190.99
433.148	220.12
433.582	164.29
434.015	101.18
434.449	164.29
434.882	140.02
435.316	174
435.749	186.14
436.183	164.29
436.616	181.28
437.049	178.86
437.483	127.88
437.916	190.99
438.349	195.85
438.782	178.86
439.215	203.13
439.648	217.69
440.081	135.17
440.514	178.86
440.947	115.75
441.38	86.62
441.813	181.28
442.245	193.42
442.678	147.3
443.111	142.45
443.543	234.68
443.976	164.29
444.408	140.02
444.841	227.4
445.273	176.43
445.705	266.24
446.138	190.99
446.57	207.98
447.002	220.12
447.434	215.26
447.867	171.57
448.299	144.87
448.731	210.41
449.163	190.99
449.595	171.57
450.026	183.71
450.458	203.13
450.89	222.55
451.322	234.68
451.754	220.12
452.185	135.17
452.617	203.13
453.048	181.28
453.48	251.67
453.911	220.12
454.343	137.59
454.774	217.69
455.205	152.16
455.637	137.59
456.068	249.25
456.499	224.97
456.93	161.87
457.361	220.12
457.792	154.58
458.223	203.13
458.654	183.71
459.085	215.26
459.516	205.56
459.947	217.69
460.378	96.33
460.808	227.4
461.239	239.54
461.669	200.7
462.1	224.97
462.531	207.98
462.961	149.73
463.391	224.97
463.822	246.82
464.252	217.69
464.682	183.71
465.113	195.85
465.543	268.66
465.973	246.82
466.403	178.86
466.833	251.67
467.263	215.26
467.693	147.3
468.123	174
468.553	178.86
468.983	171.57
469.412	132.74
469.842	251.67
470.272	190.99
470.701	118.18
471.131	183.71
471.56	188.56
471.99	130.31
472.419	254.1
472.849	227.4
473.278	154.58
473.707	176.43
474.136	258.95
474.566	186.14
474.995	166.72
475.424	234.68
475.853	164.29
476.282	188.56
476.711	169.15
477.14	195.85
477.569	137.59
477.997	193.42
478.426	178.86
478.855	246.82
479.283	229.83
479.712	234.68
480.141	195.85
480.569	198.27
480.998	186.14
481.426	144.87
481.854	152.16
482.283	207.98
482.711	234.68
483.139	203.13
483.567	183.71
483.995	188.56
484.424	178.86
484.852	210.41
485.28	157.01
485.708	176.43
486.135	205.56
486.563	215.26
486.991	161.87
487.419	149.73
487.847	161.87
488.274	188.56
488.702	176.43
489.129	222.55
489.557	178.86
489.984	227.4
490.412	178.86
490.839	198.27
491.266	120.6
491.694	166.72
492.121	144.87
492.548	149.73
492.975	205.56
493.402	169.15
493.829	127.88
494.256	220.12
494.683	108.47
495.11	159.44
495.537	193.42
495.964	188.56
496.39	198.27
496.817	227.4
497.244	159.44
497.67	103.61
498.097	152.16
498.523	224.97
498.95	176.43
499.376	157.01
499.803	198.27
500.229	166.72
500.655	186.14
501.081	157.01
501.508	203.13
501.934	135.17
502.36	176.43
502.786	217.69
503.212	205.56
503.638	193.42
504.064	135.17
504.489	166.72
504.915	157.01
505.341	205.56
505.767	203.13
506.192	181.28
506.618	159.44
507.043	186.14
507.469	244.39
507.894	84.19
508.32	118.18
508.745	234.68
509.17	193.42
509.596	169.15
510.021	144.87
510.446	195.85
510.871	183.71
511.296	137.59
511.721	203.13
512.146	176.43
512.571	159.44
512.996	215.26
513.421	193.42
513.845	152.16
514.27	157.01
514.695	227.4
515.119	123.03
515.544	127.88
515.969	144.87
516.393	193.42
516.817	275.94
517.242	106.04
517.666	188.56
518.09	249.25
518.515	203.13
518.939	149.73
519.363	392.45
519.787	89.05
520.211	217.69
520.635	159.44
521.059	140.02
521.483	154.58
521.907	200.7
522.331	123.03
522.754	234.68
523.178	210.41
523.602	174
524.025	186.14
524.449	125.46
524.872	120.6
525.296	203.13
525.719	166.72
526.143	217.69
526.566	149.73
526.989	207.98
527.412	205.56
527.836	205.56
528.259	137.59
528.682	149.73
529.105	159.44
529.528	171.57
529.951	229.83
530.374	198.27
530.796	132.74
531.219	164.29
531.642	140.02
532.065	234.68
532.487	200.7
532.91	188.56
533.332	186.14
533.755	157.01
534.177	224.97
534.6	292.94
535.022	183.71
535.444	205.56
535.867	159.44
536.289	157.01
536.711	152.16
537.133	174
537.555	127.88
537.977	147.3
538.399	220.12
538.821	215.26
539.243	171.57
539.665	234.68
540.086	244.39
540.508	273.52
540.93	193.42
541.351	229.83
541.773	127.88
542.195	135.17
542.616	169.15
543.037	249.25
543.459	195.85
543.88	142.45
544.301	229.83
544.723	193.42
545.144	215.26
545.565	186.14
545.986	108.47
546.407	239.54
546.828	159.44
547.249	234.68
547.67	212.84
548.091	193.42
548.512	154.58
548.932	212.84
549.353	237.11
549.774	159.44
550.194	183.71
550.615	222.55
551.035	130.31
551.456	212.84
551.876	195.85
552.296	181.28
552.717	149.73
553.137	123.03
553.557	239.54
553.977	234.68
554.397	207.98
554.817	161.87
555.237	161.87
555.657	140.02
556.077	147.3
556.497	161.87
556.917	210.41
557.337	207.98
557.756	174
558.176	113.32
558.596	190.99
559.015	203.13
559.435	207.98
559.854	174
560.274	169.15
560.693	178.86
561.112	149.73
561.532	154.58
561.951	159.44
562.37	183.71
562.789	161.87
563.208	132.74
563.627	174
564.046	207.98
564.465	113.32
564.884	157.01
565.303	137.59
565.722	207.98
566.14	171.57
566.559	123.03
566.978	174
567.396	161.87
567.815	203.13
568.233	198.27
568.652	127.88
569.07	186.14
569.489	227.4
569.907	237.11
570.325	186.14
570.743	186.14
571.161	200.7
571.58	135.17
571.998	169.15
572.416	178.86
572.833	210.41
573.251	227.4
573.669	207.98
574.087	120.6
574.505	232.25
574.922	212.84
575.34	195.85
575.758	193.42
576.175	137.59
576.593	188.56
577.01	144.87
577.428	137.59
577.845	1465.28
578.262	273.52
578.68	193.42
579.097	157.01
579.514	222.55
579.931	166.72
580.348	113.32
580.765	178.86
581.182	157.01
581.599	210.41
582.016	220.12
582.433	186.14
582.849	195.85
583.266	203.13
583.683	200.7
584.099	190.99
584.516	118.18
584.933	157.01
585.349	142.45
585.765	135.17
586.182	212.84
586.598	195.85
587.014	227.4
587.431	256.53
587.847	157.01
588.263	183.71
588.679	190.99
589.095	232.25
589.511	305.07
589.927	171.57
590.343	135.17
590.759	212.84
591.174	120.6
591.59	203.13
592.006	183.71
592.421	144.87
592.837	135.17
593.252	135.17
593.668	135.17
594.083	142.45
594.499	178.86
594.914	127.88
595.329	246.82
595.745	166.72
596.16	183.71
596.575	273.52
596.99	222.55
597.405	140.02
597.82	154.58
598.235	140.02
598.65	224.97
599.065	178.86
599.479	171.57
599.894	183.71
600.309	203.13
600.724	210.41
601.138	222.55
601.553	176.43
601.967	183.71
602.382	183.71
602.796	166.72
603.21	183.71
603.625	205.56
604.039	203.13
604.453	181.28
604.867	203.13
605.281	178.86
605.695	164.29
606.109	200.7
606.523	144.87
606.937	135.17
607.351	312.35
607.765	174
608.178	125.46
608.592	174
609.006	74.49
609.419	149.73
609.833	203.13
610.246	195.85
610.66	120.6
611.073	154.58
611.487	190.99
611.9	227.4
612.313	171.57
612.726	108.47
613.139	149.73
613.553	171.57
613.966	207.98
614.379	224.97
614.792	205.56
615.204	210.41
615.617	190.99
616.03	186.14
616.443	181.28
616.856	171.57
617.268	154.58
617.681	152.16
618.093	137.59
618.506	190.99
618.918	152.16
619.331	147.3
619.743	195.85
620.155	142.45
620.568	188.56
620.98	178.86
621.392	190.99
621.804	200.7
622.216	157.01
622.628	266.24
623.04	174
623.452	232.25
623.864	169.15
624.276	229.83
624.687	152.16
625.099	132.74
625.511	193.42
625.922	137.59
626.334	174
626.745	207.98
627.157	149.73
627.568	120.6
627.979	164.29
628.391	174
628.802	120.6
629.213	130.31
629.624	198.27
630.035	161.87
630.446	198.27
630.857	174
631.268	174
631.679	193.42
632.09	241.96
632.501	174
632.912	181.28
633.322	212.84
633.733	193.42
634.144	125.46
634.554	120.6
634.965	154.58
635.375	108.47
635.785	224.97
636.196	183.71
636.606	237.11
637.016	123.03
637.427	147.3
637.837	123.03
638.247	188.56
638.657	123.03
639.067	169.15
639.477	186.14
639.887	171.57
640.297	161.87
640.706	190.99
641.116	229.83
641.526	207.98
641.935	188.56
642.345	174
642.755	152.16
643.164	132.74
643.573	176.43
643.983	125.46
644.392	93.9
644.801	183.71
645.211	212.84
645.62	135.17
646.029	113.32
646.438	127.88
646.847	154.58
647.256	171.57
647.665	166.72
648.074	113.32
648.483	125.46
648.892	127.88
649.3	224.97
649.709	217.69
650.118	261.38
650.526	164.29
650.935	186.14
651.343	244.39
651.752	198.27
652.16	120.6
652.568	178.86
652.977	169.15
653.385	174
653.793	137.59
654.201	149.73
654.609	123.03
655.017	123.03
655.425	278.37
655.833	164.29
656.241	147.3
656.649	149.73
657.057	149.73
657.464	239.54
657.872	232.25
658.28	174
658.687	135.17
659.095	101.18
659.502	171.57
659.91	174
660.317	130.31
660.724	178.86
661.132	193.42
661.539	106.04
661.946	174
662.353	161.87
662.76	161.87
663.167	258.95
663.574	176.43
663.981	207.98
664.388	212.84
664.795	222.55
665.202	149.73
665.608	164.29
666.015	144.87
666.422	215.26
666.828	203.13
667.235	207.98
667.641	157.01
668.047	203.13
668.454	164.29
668.86	174
669.266	254.1
669.673	161.87
670.079	166.72
670.485	244.39
670.891	188.56
671.297	161.87
671.703	142.45
672.109	234.68
672.515	237.11
672.92	142.45
673.326	132.74
673.732	186.14
674.138	176.43
674.543	130.31
674.949	195.85
675.354	203.13
675.76	188.56
676.165	135.17
676.57	171.57
676.976	154.58
677.381	229.83
677.786	186.14
678.191	198.27
678.596	188.56
679.001	193.42
679.406	115.75
679.811	161.87
680.216	229.83
680.621	224.97
681.026	93.9
681.43	120.6
681.835	161.87
682.24	200.7
682.644	258.95
683.049	137.59
683.453	212.84
683.858	123.03
684.262	169.15
684.667	275.94
685.071	178.86
685.475	159.44
685.879	166.72
686.283	135.17
686.687	200.7
687.091	188.56
687.495	74.49
687.899	157.01
688.303	157.01
688.707	154.58
689.111	142.45
689.514	210.41
689.918	169.15
690.322	171.57
690.725	212.84
691.129	140.02
691.532	127.88
691.936	176.43
692.339	176.43
692.742	190.99
693.146	261.38
693.549	251.67
693.952	183.71
694.355	169.15
694.758	120.6
695.161	164.29
695.564	135.17
695.967	161.87
696.37	176.43
696.773	152.16
697.175	164.29
697.578	188.56
697.981	237.11
698.383	254.1
698.786	166.72
699.188	157.01
699.591	166.72
699.993	84.19
700.395	171.57
700.798	205.56
701.2	234.68
701.602	190.99
702.004	227.4
702.406	188.56
702.808	205.56
703.21	198.27
703.612	249.25
704.014	215.26
704.416	183.71
704.818	285.65
705.219	190.99
705.621	142.45
706.023	161.87
706.424	241.96
706.826	171.57
707.227	195.85
707.629	239.54
708.03	186.14
708.431	324.49
708.832	195.85
709.234	244.39
709.635	292.94
710.036	273.52
710.437	266.24
710.838	309.93
711.239	295.36
711.64	271.09
712.041	275.94
712.441	324.49
712.842	278.37
713.243	244.39
713.643	261.38
714.044	317.21
714.445	278.37
714.845	275.94
715.246	319.63
715.646	302.64
716.046	263.81
716.447	295.36
716.847	380.32
717.247	346.33
717.647	302.64
718.047	373.03
718.447	326.92
718.847	329.34
719.247	254.1
719.647	385.17
720.047	397.31
720.446	353.62
720.846	358.47
721.246	394.88
721.645	382.74
722.045	324.49
722.444	453.13
722.844	477.4
723.243	402.16
723.643	392.45
724.042	472.55
724.441	484.69
724.84	462.84
725.24	436.14
725.639	494.39
726.038	460.41
726.437	557.5
726.836	501.68
727.234	603.62
727.633	562.36
728.032	613.33
728.431	569.64
728.83	654.59
729.228	640.03
729.627	681.29
730.025	695.85
730.424	771.1
730.822	817.22
731.22	873.04
731.619	890.03
732.017	945.86
732.415	1045.37
732.813	1164.31
733.212	1038.09
733.61	1115.76
734.008	1208
734.406	1397.32
734.803	1564.8
735.201	1450.72
735.599	1664.32
735.997	1758.98
736.395	1924.03
736.792	1953.16
737.19	1965.29
737.587	2079.37
737.985	2285.68
738.382	2341.51
738.78	2550.25
739.177	2523.55
739.574	2705.59
739.971	2982.3
740.369	3072.1
740.766	3001.72
741.163	3081.81
741.56	3402.21
741.957	3678.91
742.354	3829.4
742.751	3671.63
743.147	3691.05
743.544	4125.52
743.941	4450.77
744.338	4623.1
744.734	4436.2
745.131	4977.47
745.527	5414.37
745.924	5727.49
746.32	5530.88
746.716	5649.81
747.113	6441.09
747.509	6965.37
747.905	7135.27
748.301	6955.66
748.697	7322.17
749.093	8188.69
749.489	8390.15
749.885	8232.38
750.281	8545.49
750.677	9416.86
751.073	10113.48
751.468	10089.2
751.864	9904.74
752.26	10266.39
752.655	11533.4
753.051	12159.62
753.446	11902.34
753.842	11744.57
754.237	13130.51
754.632	13931.5
755.028	13572.27
755.423	13341.68
755.818	13793.15
756.213	14902.39
756.608	15217.92
757.003	14594.13
757.398	14548.01
757.793	15247.05
758.188	16033.47
758.583	15759.2
758.977	15397.54
759.372	16649.99
759.767	17880.59
760.161	18737.4
760.556	18827.2
760.95	19628.19
761.345	21424.33
761.739	22417.07
762.133	21972.88
762.527	22630.66
762.922	24230.2
763.316	25053.03
763.71	24953.51
764.104	24392.82
764.498	25458.38
764.892	27514.23
765.286	27293.36
765.68	27210.83
766.073	28009.39
766.467	29635.62
766.861	30351.66
767.255	30011.84
767.648	30497.29
768.042	32159.94
768.435	33405.1
768.829	32465.77
769.222	32689.07
769.615	34710.95
770.008	35393
770.402	34264.34
770.795	33953.65
771.188	34730.36
771.581	36041.06
771.974	35536.2
772.367	33710.93
772.76	34451.23
773.153	34982.8
773.545	35155.13
773.938	34308.03
774.331	34431.82
774.724	36412.43
775.116	37839.64
775.509	38320.23
775.901	38890.62
776.294	40606.67
776.686	42349.41
777.078	42019.31
777.471	42126.11
777.863	44970.81
778.255	47203.86
778.647	46791.23
779.039	45681.99
779.431	45968.4
779.823	47087.35
780.215	47779.11
780.607	46342.2
780.999	47762.12
781.39	49444.19
781.782	49788.85
782.174	47898.04
782.565	48417.47
782.957	49686.91
783.348	50983.04
783.74	49458.75
784.131	49109.23
784.522	50769.45
784.914	50046.14
785.305	49320.4
785.696	48065.52
786.087	49135.93
786.478	48975.73
786.869	46121.32
787.26	44978.1
787.651	44934.41
788.042	46067.92
788.433	44313.04
788.823	42174.65
789.214	42181.94
789.605	41640.67
789.995	40070.25
790.386	38618.77
790.776	39609.08
791.167	40196.47
791.557	40395.5
791.948	39764.42
792.338	40745.02
792.728	43201.37
793.118	42036.3
793.508	41546
793.898	41189.2
794.288	43152.83
794.678	42504.76
795.068	42252.33
795.458	41053.28
795.848	42652.82
796.238	42237.76
796.627	41788.73
797.017	40616.38
797.406	41783.87
797.796	42492.62
798.185	41599.4
798.575	40941.63
798.964	41968.34
799.354	43203.8
799.743	42286.31
800.132	41917.37
800.521	42813.01
800.91	43754.78
801.299	40779
801.688	40764.44
802.077	41201.34
802.466	41968.34
802.855	40291.13
803.244	38863.92
803.633	39961.03
804.021	39031.4
804.41	37757.11
804.799	37303.22
805.187	36914.86
805.576	36259.51
805.964	34812.89
806.352	32907.52
806.741	33371.12
807.129	33184.22
807.517	32249.74
807.905	32091.97
808.293	32572.56
808.681	33009.46
809.069	31917.21
809.457	32892.96
809.845	33584.72
810.233	33885.69
810.621	33516.75
811.009	33441.51
811.396	34570.17
811.784	34747.35
812.171	32999.75
812.559	32349.26
812.946	32155.08
813.334	32038.57
813.721	30737.58
814.108	29346.79
814.496	30591.95
814.883	30135.63
815.27	30072.52
815.657	29096.78
816.044	29696.31
816.431	30101.65
816.818	29773.98
817.205	28574.93
817.592	29977.86
817.979	29371.06
818.365	27604.04
818.752	26477.81
819.139	26402.56
819.525	26511.79
819.912	25089.44
820.298	24026.31
820.685	24616.13
821.071	24072.43
821.457	22353.96
821.843	21254.43
822.23	21892.79
822.616	20958.31
823.002	19385.47
823.388	18795.65
823.774	18599.05
824.16	17778.64
824.546	16926.69
824.931	16897.56
825.317	16807.76
825.703	16628.14
826.089	15955.8
826.474	15698.51
826.86	15783.47
827.245	15756.77
827.631	15210.64
828.016	15145.11
828.401	14856.27
828.787	14691.22
829.172	13953.34
829.557	13720.33
829.942	13397.51
830.327	13157.21
830.712	12606.23
831.097	12249.43
831.482	12608.66
831.867	12186.32
832.252	11441.17
832.636	11251.84
833.021	11732.43
833.406	11409.61
833.79	10839.22
834.175	10538.24
834.559	10623.19
834.944	10043.09
835.328	9708.13
835.713	9652.3
836.097	9322.2
836.481	9149.87
836.865	8829.48
837.249	8484.81
837.633	8147.43
838.017	7928.98
838.401	7742.08
838.785	7293.04
839.169	7091.58
839.553	6875.56
839.937	6499.34
840.32	6278.47
840.704	6125.55
841.087	5899.82
841.471	5637.68
841.854	5516.32
842.238	5302.72
842.621	5074.56
843.004	5013.88
843.388	4987.18
843.771	4962.91
844.154	4700.77
844.537	4589.12
844.92	4824.56
845.303	4555.14
845.686	4290.57
846.069	4293
846.452	4169.21
846.834	4210.47
847.217	3890.08
847.6	3807.55
847.982	3945.9
848.365	3669.2
848.748	3620.66
849.13	3460.46
849.512	3530.85
849.895	3576.97
850.277	3356.09
850.659	3256.57
851.041	3232.3
851.423	3280.85
851.806	3042.98
852.188	2907.05
852.57	2994.43
852.951	2899.77
853.333	2822.1
853.715	2725.01
854.097	2484.72
854.479	2584.23
854.86	2477.44
855.242	2411.9
855.623	2295.39
856.005	2288.11
856.386	2222.58
856.768	1979.85
857.149	2045.39
857.53	1933.74
857.911	1877.91
858.292	1868.2
858.674	1875.48
859.055	1657.03
859.436	1545.38
859.817	1494.41
860.197	1433.73
860.578	1499.26
860.959	1368.19
861.34	1331.79
861.72	1322.08
862.101	1404.6
862.482	1322.08
862.862	1210.43
863.243	1232.27
863.623	1302.66
864.003	1079.36
864.384	1067.22
864.764	1018.67
865.144	1115.76
865.524	931.29
865.904	994.4
866.284	1008.97
866.664	916.73
867.044	892.46
867.424	865.76
867.804	904.6
868.183	860.91
868.563	831.78
868.943	739.54
869.322	751.68
869.702	625.46
870.081	688.57
870.461	598.77
870.84	746.83
871.22	559.93
871.599	559.93
871.978	659.45
872.357	606.05
872.736	625.46
873.115	581.77
873.494	564.78
873.873	559.93
874.252	555.08
874.631	533.23
875.01	443.42
875.388	491.97
875.767	441
876.146	443.42
876.524	397.31
876.903	426.43
877.281	399.73
877.66	385.17
878.038	368.18
878.416	358.47
878.794	322.06
879.173	358.47
879.551	331.77
879.929	249.25
880.307	360.9
880.685	234.68
881.063	322.06
881.441	290.51
881.818	317.21
882.196	258.95
882.574	329.34
882.951	292.94
883.329	237.11
883.707	297.79
884.084	203.13
884.461	244.39
884.839	251.67
885.216	258.95
885.593	227.4
885.971	227.4
886.348	285.65
886.725	356.04
887.102	229.83
887.479	210.41
887.856	254.1
888.233	237.11
888.609	256.53
888.986	300.22
889.363	239.54
889.74	237.11
890.116	164.29
890.493	195.85
890.869	239.54
891.246	171.57
891.622	237.11
891.998	220.12
892.375	183.71
892.751	120.6
893.127	174
893.503	190.99
893.879	181.28
894.255	207.98
894.631	234.68
895.007	205.56
895.383	198.27
895.759	152.16
896.134	123.03
896.51	123.03
896.886	147.3
897.261	239.54
897.637	190.99
898.012	157.01
898.388	186.14
898.763	190.99
899.138	227.4
899.514	157.01
899.889	149.73
900.264	142.45
900.639	198.27
901.014	125.46
901.389	130.31
901.764	120.6
902.139	67.2
902.513	157.01
902.888	152.16
903.263	132.74
903.638	154.58
904.012	224.97
904.387	142.45
904.761	67.2
905.136	171.57
905.51	217.69
905.884	161.87
906.259	157.01
906.633	186.14
907.007	152.16
907.381	93.9
907.755	176.43
908.129	215.26
908.503	152.16
908.877	159.44
909.251	149.73
909.624	166.72
909.998	174
910.372	232.25
910.745	96.33
911.119	137.59
911.492	108.47
911.866	251.67
912.239	152.16
912.612	149.73
912.986	215.26
913.359	200.7
913.732	140.02
914.105	130.31
914.478	210.41
914.851	157.01
915.224	147.3
915.597	140.02
915.97	176.43
916.343	174
916.715	137.59
917.088	154.58
917.461	169.15
917.833	164.29
918.206	96.33
918.578	176.43
918.951	166.72
919.323	169.15
919.695	169.15
920.067	96.33
920.44	246.82
920.812	203.13
921.184	161.87
921.556	207.98
921.928	161.87
922.3	181.28
922.672	123.03
923.043	154.58
923.415	169.15
923.787	152.16
924.158	103.61
924.53	147.3
924.901	127.88
925.273	171.57
925.644	142.45
926.016	86.62
926.387	188.56
926.758	215.26
927.129	152.16
927.5	125.46
927.872	79.34
928.243	176.43
928.613	72.06
928.984	74.49
929.355	98.76
929.726	110.89
930.097	118.18
930.467	183.71
930.838	171.57
931.209	103.61
931.579	130.31
931.95	144.87
932.32	115.75
932.69	130.31
933.061	142.45
933.431	144.87
933.801	188.56
934.171	203.13
934.541	195.85
934.911	140.02
935.281	207.98
935.651	154.58
936.021	157.01
936.391	210.41
936.761	135.17
937.13	130.31
937.5	144.87
937.87	200.7
938.239	142.45
938.609	198.27
938.978	144.87
939.347	215.26
939.717	200.7
940.086	132.74
940.455	169.15
940.824	174
941.193	171.57
941.562	195.85
941.931	127.88
942.3	169.15
942.669	188.56
943.038	159.44
943.407	135.17
943.775	93.9
944.144	142.45
944.513	174
944.881	106.04
945.25	171.57
945.618	108.47
945.986	174
946.355	161.87
946.723	224.97
947.091	130.31
947.459	132.74
947.827	127.88
948.195	178.86
948.563	190.99
948.931	190.99
949.299	135.17
949.667	183.71
950.035	181.28
950.402	229.83
950.77	154.58
951.138	127.88
951.505	183.71
951.873	137.59
952.24	198.27
952.607	106.04
952.975	188.56
953.342	125.46
953.709	149.73
954.076	140.02
954.443	159.44
954.81	193.42
955.177	171.57
955.544	195.85
955.911	224.97
956.278	207.98
956.645	215.26
957.012	140.02
957.378	154.58
957.745	132.74
958.111	147.3
958.478	203.13
958.844	159.44
959.211	174
959.577	81.77
959.943	207.98
960.309	183.71
960.675	159.44
961.042	89.05
961.408	93.9
961.774	140.02
962.139	198.27
962.505	142.45
962.871	113.32
963.237	113.32
963.603	157.01
963.968	212.84
964.334	195.85
964.699	217.69
965.065	161.87
965.43	140.02
965.796	154.58
966.161	144.87
966.526	142.45
966.891	86.62
967.256	125.46
967.622	132.74
967.987	171.57
968.352	207.98
968.716	224.97
969.081	140.02
969.446	140.02
969.811	159.44
970.176	79.34
970.54	149.73
970.905	110.89
971.269	171.57
971.634	125.46
971.998	152.16
972.363	113.32
972.727	144.87
973.091	154.58
973.455	174
973.819	115.75
974.183	137.59
974.547	137.59
974.911	130.31
975.275	161.87
975.639	186.14
976.003	135.17
976.367	159.44
976.73	186.14
977.094	130.31
977.458	203.13
977.821	149.73
978.185	142.45
978.548	183.71
978.911	203.13
979.275	178.86
979.638	142.45
980.001	144.87
980.364	152.16
980.727	140.02
981.09	123.03
981.453	152.16
981.816	220.12
982.179	212.84
982.542	193.42
982.905	130.31
983.267	157.01
983.63	164.29
983.992	174
984.355	181.28
984.717	115.75
985.08	164.29
985.442	190.99
985.804	149.73
986.167	198.27
986.529	174
986.891	127.88
987.253	258.95
987.615	176.43
987.977	203.13
988.339	62.35
988.701	132.74
989.062	215.26
989.424	271.09
989.786	176.43
990.147	176.43
990.509	183.71
990.87	149.73
991.232	120.6
991.593	178.86
991.955	147.3
992.316	183.71
992.677	181.28
993.038	171.57
993.399	125.46
993.76	157.01
994.121	161.87
994.482	127.88
994.843	207.98
995.204	186.14
995.565	144.87
995.926	123.03
996.286	130.31
996.647	232.25
997.007	220.12
997.368	178.86
997.728	183.71
998.089	200.7
998.449	132.74
998.809	212.84
999.169	132.74
999.53	205.56
999.89	127.88
1000.25	115.75
1000.61	154.58
1000.97	154.58
1001.329	212.84
1001.689	198.27
1002.049	125.46
1002.409	127.88
1002.768	69.63
1003.128	125.46
1003.487	147.3
1003.847	186.14
1004.206	174
1004.566	198.27
1004.925	113.32
1005.284	157.01
1005.643	149.73
1006.003	125.46
1006.362	118.18
1006.721	217.69
1007.08	120.6
1007.438	161.87
1007.797	142.45
1008.156	127.88
1008.515	176.43
1008.874	52.64
1009.232	152.16
1009.591	118.18
1009.949	123.03
1010.308	127.88
1010.666	166.72
1011.024	115.75
1011.383	140.02
1011.741	106.04
1012.099	91.48
1012.457	103.61
1012.815	137.59
1013.173	195.85
1013.531	108.47
1013.889	147.3
1014.247	220.12
1014.605	140.02
1014.962	120.6
1015.32	164.29
1015.678	91.48
1016.035	149.73
1016.393	115.75
1016.75	106.04
1017.107	120.6
1017.465	72.06
1017.822	176.43
1018.179	161.87
1018.536	171.57
1018.894	113.32
1019.251	149.73
1019.608	190.99
1019.964	140.02
1020.321	142.45
1020.678	169.15
1021.035	144.87
1021.392	132.74
1021.748	200.7
1022.105	147.3
1022.461	125.46
1022.818	125.46
1023.174	152.16
1023.531	200.7
1023.887	115.75
1024.243	176.43
1024.599	164.29
1024.955	169.15
1025.311	154.58
1025.667	178.86
1026.023	140.02
1026.379	164.29
1026.735	149.73
1027.091	152.16
1027.447	195.85
