189.514	158.22
189.973	158.22
190.431	158.22
190.889	27.15
191.348	-11.68
191.806	-48.09
192.264	-1.97
192.722	85.41
193.18	-35.95
193.638	12.59
194.096	-18.96
194.554	-21.39
195.012	-91.78
195.47	-67.51
195.928	-45.66
196.385	5.31
196.843	19.87
197.301	7.74
197.758	70.84
198.216	17.45
198.674	39.29
199.131	24.73
199.589	116.96
200.046	85.41
200.503	99.97
200.961	78.13
201.418	114.53
201.875	114.53
202.332	107.25
202.79	68.42
203.247	143.66
203.704	158.22
204.161	102.4
204.618	184.92
205.075	197.06
205.532	160.65
205.989	138.81
206.445	129.1
206.902	172.79
207.359	143.66
207.816	170.36
208.272	197.06
208.729	146.09
209.185	238.32
209.642	170.36
210.098	184.92
210.555	126.67
211.011	160.65
211.467	141.23
211.924	180.07
212.38	245.6
212.836	177.64
213.292	170.36
213.748	218.91
214.204	107.25
214.66	158.22
215.116	158.22
215.572	150.94
216.028	204.34
216.484	133.95
216.94	182.5
217.396	163.08
217.851	218.91
218.307	160.65
218.763	158.22
219.218	119.39
219.674	158.22
220.129	189.78
220.585	129.1
221.04	165.51
221.496	136.38
221.951	121.82
222.406	201.91
222.861	255.31
223.317	180.07
223.772	189.78
224.227	165.51
224.682	99.97
225.137	131.53
225.592	255.31
226.047	104.83
226.502	148.52
226.957	206.77
227.411	163.08
227.866	150.94
228.321	211.62
228.776	138.81
229.23	138.81
229.685	201.91
230.139	189.78
230.594	184.92
231.048	177.64
231.503	158.22
231.957	129.1
232.411	155.8
232.865	160.65
233.32	209.2
233.774	167.93
234.228	131.53
234.682	146.09
235.136	153.37
235.59	133.95
236.044	172.79
236.498	199.49
236.952	226.19
237.406	124.24
237.86	170.36
238.313	235.9
238.767	138.81
239.221	138.81
239.674	201.91
240.128	206.77
240.581	146.09
241.035	126.67
241.488	172.79
241.942	126.67
242.395	204.34
242.848	141.23
243.301	119.39
243.755	182.5
244.208	172.79
244.661	163.08
245.114	150.94
245.567	194.63
246.02	170.36
246.473	165.51
246.926	180.07
247.379	223.76
247.832	112.11
248.284	136.38
248.737	216.48
249.19	240.75
249.642	165.51
250.095	116.96
250.547	240.75
251	126.67
251.452	141.23
251.905	189.78
252.357	163.08
252.81	206.77
253.262	114.53
253.714	223.76
254.166	170.36
254.618	97.54
255.07	138.81
255.523	146.09
255.975	158.22
256.427	177.64
256.878	136.38
257.33	153.37
257.782	170.36
258.234	160.65
258.686	257.74
259.137	209.2
259.589	95.12
260.041	153.37
260.492	199.49
260.944	112.11
261.395	170.36
261.847	238.32
262.298	165.51
262.749	163.08
263.201	177.64
263.652	177.64
264.103	182.5
264.554	211.62
265.005	175.22
265.457	155.8
265.908	143.66
266.359	204.34
266.809	180.07
267.26	163.08
267.711	116.96
268.162	197.06
268.613	197.06
269.064	158.22
269.514	150.94
269.965	155.8
270.415	109.68
270.866	180.07
271.316	97.54
271.767	163.08
272.217	167.93
272.668	153.37
273.118	131.53
273.568	187.35
274.019	158.22
274.469	148.52
274.919	245.6
275.369	175.22
275.819	160.65
276.269	170.36
276.719	104.83
277.169	138.81
277.619	143.66
278.069	109.68
278.518	148.52
278.968	131.53
279.418	129.1
279.867	211.62
280.317	228.61
280.767	189.78
281.216	199.49
281.666	119.39
282.115	211.62
282.564	187.35
283.014	175.22
283.463	129.1
283.912	160.65
284.361	167.93
284.811	163.08
285.26	163.08
285.709	153.37
286.158	167.93
286.607	160.65
287.056	155.8
287.505	192.21
287.953	160.65
288.402	226.19
288.851	167.93
289.3	148.52
289.748	211.62
290.197	160.65
290.646	228.61
291.094	146.09
291.543	167.93
291.991	223.76
292.439	143.66
292.888	167.93
293.336	107.25
293.784	199.49
294.233	218.91
294.681	184.92
295.129	116.96
295.577	150.94
296.025	160.65
296.473	160.65
296.921	216.48
297.369	167.93
297.817	228.61
298.264	141.23
298.712	197.06
299.16	167.93
299.608	165.51
300.055	189.78
300.503	102.4
300.95	206.77
301.398	184.92
301.845	221.33
302.293	209.2
302.74	158.22
303.187	201.91
303.635	121.82
304.082	182.5
304.529	160.65
304.976	255.31
305.423	124.24
305.87	112.11
306.317	78.13
306.764	124.24
307.211	221.33
307.658	165.51
308.105	131.53
308.552	114.53
308.998	209.2
309.445	218.91
309.892	177.64
310.338	182.5
310.785	189.78
311.231	206.77
311.678	165.51
312.124	216.48
312.571	138.81
313.017	175.22
313.463	133.95
313.909	175.22
314.356	129.1
314.802	104.83
315.248	279.59
315.694	136.38
316.14	192.21
316.586	150.94
317.032	197.06
317.478	167.93
317.923	206.77
318.369	104.83
318.815	116.96
319.261	209.2
319.706	95.12
320.152	221.33
320.597	265.02
321.043	160.65
321.488	153.37
321.934	187.35
322.379	211.62
322.824	170.36
323.27	204.34
323.715	141.23
324.16	192.21
324.605	129.1
325.05	146.09
325.495	90.26
325.94	126.67
326.385	87.84
326.83	146.09
327.275	158.22
327.72	177.64
328.165	141.23
328.61	160.65
329.054	124.24
329.499	136.38
329.943	187.35
330.388	150.94
330.832	167.93
331.277	124.24
331.721	187.35
332.166	133.95
332.61	201.91
333.054	214.05
333.499	167.93
333.943	141.23
334.387	153.37
334.831	126.67
335.275	175.22
335.719	214.05
336.163	180.07
336.607	136.38
337.051	136.38
337.495	95.12
337.938	233.47
338.382	143.66
338.826	209.2
339.269	252.89
339.713	167.93
340.157	104.83
340.6	197.06
341.044	245.6
341.487	143.66
341.93	170.36
342.374	129.1
342.817	170.36
343.26	214.05
343.703	167.93
344.146	221.33
344.59	138.81
345.033	218.91
345.476	155.8
345.919	141.23
346.361	150.94
346.804	204.34
347.247	189.78
347.69	158.22
348.133	165.51
348.575	167.93
349.018	131.53
349.461	155.8
349.903	141.23
350.346	172.79
350.788	223.76
351.23	160.65
351.673	126.67
352.115	197.06
352.557	146.09
353	216.48
353.442	197.06
353.884	184.92
354.326	170.36
354.768	148.52
355.21	170.36
355.652	116.96
356.094	131.53
356.536	160.65
356.978	231.04
357.419	153.37
357.861	216.48
358.303	262.6
358.744	158.22
359.186	167.93
359.627	180.07
360.069	180.07
360.51	184.92
360.952	167.93
361.393	189.78
361.834	163.08
362.276	163.08
362.717	131.53
363.158	175.22
363.599	209.2
364.04	121.82
364.481	182.5
364.922	126.67
365.363	167.93
365.804	172.79
366.245	163.08
366.686	167.93
367.126	141.23
367.567	235.9
368.008	167.93
368.448	160.65
368.889	158.22
369.33	133.95
369.77	170.36
370.21	124.24
370.651	199.49
371.091	199.49
371.531	121.82
371.972	129.1
372.412	153.37
372.852	150.94
373.292	184.92
373.732	182.5
374.172	143.66
374.612	136.38
375.052	158.22
375.492	189.78
375.932	170.36
376.372	116.96
376.811	141.23
377.251	114.53
377.691	153.37
378.13	206.77
378.57	214.05
379.009	197.06
379.449	138.81
379.888	121.82
380.328	155.8
380.767	109.68
381.206	126.67
381.645	233.47
382.085	172.79
382.524	141.23
382.963	201.91
383.402	129.1
383.841	199.49
384.28	146.09
384.719	163.08
385.158	187.35
385.596	116.96
386.035	172.79
386.474	99.97
386.913	189.78
387.351	160.65
387.79	158.22
388.228	146.09
388.667	136.38
389.105	199.49
389.544	133.95
389.982	150.94
390.42	155.8
390.859	163.08
391.297	126.67
391.735	155.8
392.173	163.08
392.611	187.35
393.049	194.63
393.487	201.91
393.925	175.22
394.363	201.91
394.801	201.91
395.239	102.4
395.676	107.25
396.114	163.08
396.552	175.22
396.989	148.52
397.427	167.93
397.864	172.79
398.302	182.5
398.739	172.79
399.177	150.94
399.614	133.95
400.051	119.39
400.488	146.09
400.926	153.37
401.363	206.77
401.8	209.2
402.237	150.94
402.674	170.36
403.111	233.47
403.548	126.67
403.985	153.37
404.421	119.39
404.858	177.64
405.295	201.91
405.732	165.51
406.168	99.97
406.605	218.91
407.041	189.78
407.478	153.37
407.914	184.92
408.351	114.53
408.787	206.77
409.223	163.08
409.66	180.07
410.096	206.77
410.532	250.46
410.968	262.6
411.404	175.22
411.84	150.94
412.276	102.4
412.712	170.36
413.148	206.77
413.584	177.64
414.02	92.69
414.455	82.98
414.891	177.64
415.327	138.81
415.762	121.82
416.198	107.25
416.633	194.63
417.069	124.24
417.504	150.94
417.94	160.65
418.375	204.34
418.81	194.63
419.245	148.52
419.681	138.81
420.116	189.78
420.551	163.08
420.986	170.36
421.421	189.78
421.856	163.08
422.291	163.08
422.726	133.95
423.16	136.38
423.595	192.21
424.03	274.73
424.464	206.77
424.899	158.22
425.334	252.89
425.768	192.21
426.203	170.36
426.637	257.74
427.071	160.65
427.506	189.78
427.94	197.06
428.374	184.92
428.809	170.36
429.243	163.08
429.677	175.22
430.111	148.52
430.545	197.06
430.979	133.95
431.413	167.93
431.847	235.9
432.28	165.51
432.714	201.91
433.148	189.78
433.582	150.94
434.015	180.07
434.449	184.92
434.882	175.22
435.316	107.25
435.749	209.2
436.183	153.37
436.616	189.78
437.049	136.38
437.483	163.08
437.916	146.09
438.349	153.37
438.782	223.76
439.215	155.8
439.648	189.78
440.081	187.35
440.514	206.77
440.947	155.8
441.38	201.91
441.813	192.21
442.245	216.48
442.678	133.95
443.111	119.39
443.543	228.61
443.976	160.65
444.408	197.06
444.841	109.68
445.273	155.8
445.705	124.24
446.138	175.22
446.57	146.09
447.002	211.62
447.434	192.21
447.867	160.65
448.299	150.94
448.731	180.07
449.163	175.22
449.595	131.53
450.026	216.48
450.458	197.06
450.89	160.65
451.322	160.65
451.754	180.07
452.185	289.29
452.617	163.08
453.048	177.64
453.48	240.75
453.911	250.46
454.343	199.49
454.774	187.35
455.205	255.31
455.637	209.2
456.068	223.76
456.499	218.91
456.93	248.03
457.361	182.5
457.792	197.06
458.223	204.34
458.654	279.59
459.085	272.3
459.516	238.32
459.947	201.91
460.378	231.04
460.808	245.6
461.239	301.43
461.669	252.89
462.1	231.04
462.531	141.23
462.961	194.63
463.391	262.6
463.822	231.04
464.252	121.82
464.682	216.48
465.113	165.51
465.543	211.62
465.973	250.46
466.403	306.29
466.833	206.77
467.263	141.23
467.693	163.08
468.123	226.19
468.553	126.67
468.983	262.6
469.412	153.37
469.842	211.62
470.272	189.78
470.701	146.09
471.131	260.17
471.56	163.08
471.99	206.77
472.419	228.61
472.849	182.5
473.278	238.32
473.707	163.08
474.136	155.8
474.566	238.32
474.995	146.09
475.424	146.09
475.853	160.65
476.282	204.34
476.711	170.36
477.14	184.92
477.569	216.48
477.997	150.94
478.426	199.49
478.855	201.91
479.283	194.63
479.712	189.78
480.141	160.65
480.569	160.65
480.998	150.94
481.426	138.81
481.854	136.38
482.283	194.63
482.711	223.76
483.139	160.65
483.567	155.8
483.995	160.65
484.424	167.93
484.852	180.07
485.28	204.34
485.708	153.37
486.135	131.53
486.563	153.37
486.991	177.64
487.419	218.91
487.847	165.51
488.274	214.05
488.702	223.76
489.129	226.19
489.557	146.09
489.984	163.08
490.412	306.29
490.839	189.78
491.266	187.35
491.694	184.92
492.121	109.68
492.548	221.33
492.975	155.8
493.402	187.35
493.829	243.18
494.256	223.76
494.683	231.04
495.11	250.46
495.537	109.68
495.964	199.49
496.39	216.48
496.817	206.77
497.244	180.07
497.67	177.64
498.097	170.36
498.523	172.79
498.95	170.36
499.376	177.64
499.803	204.34
500.229	163.08
500.655	245.6
501.081	216.48
501.508	201.91
501.934	131.53
502.36	194.63
502.786	133.95
503.212	131.53
503.638	199.49
504.064	160.65
504.489	182.5
504.915	119.39
505.341	129.1
505.767	160.65
506.192	252.89
506.618	136.38
507.043	238.32
507.469	182.5
507.894	172.79
508.32	214.05
508.745	160.65
509.17	136.38
509.596	187.35
510.021	153.37
510.446	136.38
510.871	107.25
511.296	201.91
511.721	214.05
512.146	172.79
512.571	167.93
512.996	204.34
513.421	214.05
513.845	150.94
514.27	189.78
514.695	148.52
515.119	143.66
515.544	167.93
515.969	199.49
516.393	218.91
516.817	211.62
517.242	121.82
517.666	163.08
518.09	170.36
518.515	155.8
518.939	163.08
519.363	398.52
519.787	204.34
520.211	138.81
520.635	238.32
521.059	165.51
521.483	180.07
521.907	126.67
522.331	163.08
522.754	184.92
523.178	192.21
523.602	136.38
524.025	126.67
524.449	131.53
524.872	216.48
525.296	129.1
525.719	175.22
526.143	187.35
526.566	209.2
526.989	163.08
527.412	172.79
527.836	150.94
528.259	175.22
528.682	197.06
529.105	131.53
529.528	143.66
529.951	158.22
530.374	214.05
530.796	192.21
531.219	223.76
531.642	180.07
532.065	136.38
532.487	180.07
532.91	155.8
533.332	214.05
533.755	201.91
534.177	165.51
534.6	221.33
535.022	231.04
535.444	233.47
535.867	180.07
536.289	146.09
536.711	189.78
537.133	167.93
537.555	226.19
537.977	192.21
538.399	180.07
538.821	163.08
539.243	165.51
539.665	226.19
540.086	226.19
540.508	223.76
540.93	170.36
541.351	201.91
541.773	165.51
542.195	153.37
542.616	206.77
543.037	199.49
543.459	240.75
543.88	204.34
544.301	218.91
544.723	131.53
545.144	209.2
545.565	167.93
545.986	165.51
546.407	206.77
546.828	189.78
547.249	209.2
547.67	187.35
548.091	129.1
548.512	99.97
548.932	155.8
549.353	235.9
549.774	155.8
550.194	226.19
550.615	204.34
551.035	126.67
551.456	192.21
551.876	158.22
552.296	189.78
552.717	189.78
553.137	177.64
553.557	150.94
553.977	209.2
554.397	141.23
554.817	129.1
555.237	192.21
555.657	180.07
556.077	160.65
556.497	165.51
556.917	182.5
557.337	211.62
557.756	170.36
558.176	221.33
558.596	211.62
559.015	223.76
559.435	204.34
559.854	167.93
560.274	180.07
560.693	170.36
561.112	34.44
561.532	148.52
561.951	194.63
562.37	192.21
562.789	180.07
563.208	167.93
563.627	184.92
564.046	177.64
564.465	209.2
564.884	119.39
565.303	167.93
565.722	180.07
566.14	158.22
566.559	180.07
566.978	163.08
567.396	192.21
567.815	221.33
568.233	182.5
568.652	272.3
569.07	170.36
569.489	133.95
569.907	206.77
570.325	201.91
570.743	187.35
571.161	180.07
571.58	214.05
571.998	226.19
572.416	214.05
572.833	189.78
573.251	153.37
573.669	240.75
574.087	194.63
574.505	114.53
574.922	133.95
575.34	150.94
575.758	221.33
576.175	163.08
576.593	146.09
577.01	119.39
577.428	235.9
577.845	1449.51
578.262	289.29
578.68	133.95
579.097	116.96
579.514	102.4
579.931	121.82
580.348	194.63
580.765	243.18
581.182	194.63
581.599	189.78
582.016	148.52
582.433	165.51
582.849	177.64
583.266	226.19
583.683	187.35
584.099	153.37
584.516	131.53
584.933	133.95
585.349	172.79
585.765	204.34
586.182	182.5
586.598	167.93
587.014	167.93
587.431	133.95
587.847	126.67
588.263	223.76
588.679	99.97
589.095	189.78
589.511	221.33
589.927	211.62
590.343	114.53
590.759	167.93
591.174	192.21
591.59	170.36
592.006	218.91
592.421	177.64
592.837	163.08
593.252	170.36
593.668	121.82
594.083	155.8
594.499	138.81
594.914	150.94
595.329	172.79
595.745	209.2
596.16	192.21
596.575	192.21
596.99	112.11
597.405	141.23
597.82	163.08
598.235	184.92
598.65	180.07
599.065	199.49
599.479	63.56
599.894	165.51
600.309	192.21
600.724	180.07
601.138	240.75
601.553	204.34
601.967	170.36
602.382	211.62
602.796	170.36
603.21	189.78
603.625	199.49
604.039	194.63
604.453	124.24
604.867	49
605.281	216.48
605.695	116.96
606.109	155.8
606.523	184.92
606.937	177.64
607.351	328.13
607.765	228.61
608.178	214.05
608.592	114.53
609.006	211.62
609.419	216.48
609.833	138.81
610.246	165.51
610.66	143.66
611.073	172.79
611.487	175.22
611.9	129.1
612.313	116.96
612.726	155.8
613.139	150.94
613.553	160.65
613.966	153.37
614.379	158.22
614.792	189.78
615.204	189.78
615.617	126.67
616.03	146.09
616.443	133.95
616.856	194.63
617.268	153.37
617.681	143.66
618.093	141.23
618.506	170.36
618.918	182.5
619.331	184.92
619.743	187.35
620.155	218.91
620.568	194.63
620.98	150.94
621.392	155.8
621.804	223.76
622.216	221.33
622.628	197.06
623.04	80.55
623.452	182.5
623.864	112.11
624.276	155.8
624.687	172.79
625.099	129.1
625.511	250.46
625.922	201.91
626.334	165.51
626.745	209.2
627.157	158.22
627.568	155.8
627.979	129.1
628.391	160.65
628.802	158.22
629.213	165.51
629.624	214.05
630.035	262.6
630.446	155.8
630.857	153.37
631.268	155.8
631.679	269.88
632.09	170.36
632.501	197.06
632.912	238.32
633.322	240.75
633.733	206.77
634.144	138.81
634.554	129.1
634.965	189.78
635.375	177.64
635.785	175.22
636.196	170.36
636.606	155.8
637.016	136.38
637.427	99.97
637.837	180.07
638.247	206.77
638.657	170.36
639.067	148.52
639.477	172.79
639.887	197.06
640.297	187.35
640.706	155.8
641.116	133.95
641.526	201.91
641.935	138.81
642.345	177.64
642.755	182.5
643.164	167.93
643.573	218.91
643.983	192.21
644.392	121.82
644.801	119.39
645.211	182.5
645.62	165.51
646.029	223.76
646.438	180.07
646.847	153.37
647.256	116.96
647.665	199.49
648.074	150.94
648.483	231.04
648.892	187.35
649.3	216.48
649.709	104.83
650.118	199.49
650.526	150.94
650.935	206.77
651.343	170.36
651.752	153.37
652.16	172.79
652.568	175.22
652.977	167.93
653.385	180.07
653.793	114.53
654.201	201.91
654.609	163.08
655.017	189.78
655.425	68.42
655.833	216.48
656.241	150.94
656.649	129.1
657.057	119.39
657.464	131.53
657.872	102.4
658.28	177.64
658.687	163.08
659.095	172.79
659.502	138.81
659.91	150.94
660.317	180.07
660.724	187.35
661.132	153.37
661.539	221.33
661.946	177.64
662.353	175.22
662.76	61.14
663.167	107.25
663.574	146.09
663.981	172.79
664.388	201.91
664.795	112.11
665.202	228.61
665.608	269.88
666.015	163.08
666.422	201.91
666.828	175.22
667.235	184.92
667.641	199.49
668.047	155.8
668.454	131.53
668.86	138.81
669.266	146.09
669.673	180.07
670.079	155.8
670.485	158.22
670.891	97.54
671.297	97.54
671.703	155.8
672.109	204.34
672.515	138.81
672.92	194.63
673.326	192.21
673.732	133.95
674.138	206.77
674.543	204.34
674.949	177.64
675.354	175.22
675.76	192.21
676.165	131.53
676.57	148.52
676.976	155.8
677.381	172.79
677.786	182.5
678.191	129.1
678.596	209.2
679.001	131.53
679.406	133.95
679.811	158.22
680.216	170.36
680.621	257.74
681.026	155.8
681.43	109.68
681.835	146.09
682.24	197.06
682.644	177.64
683.049	204.34
683.453	235.9
683.858	184.92
684.262	155.8
684.667	180.07
685.071	163.08
685.475	197.06
685.879	201.91
686.283	226.19
686.687	209.2
687.091	177.64
687.495	199.49
687.899	170.36
688.303	138.81
688.707	228.61
689.111	167.93
689.514	197.06
689.918	192.21
690.322	165.51
690.725	155.8
691.129	170.36
691.532	112.11
691.936	172.79
692.339	155.8
692.742	226.19
693.146	201.91
693.549	172.79
693.952	194.63
694.355	223.76
694.758	172.79
695.161	194.63
695.564	189.78
695.967	141.23
696.37	187.35
696.773	170.36
697.175	255.31
697.578	206.77
697.981	170.36
698.383	197.06
698.786	235.9
699.188	172.79
699.591	158.22
699.993	262.6
700.395	177.64
700.798	197.06
701.2	211.62
701.602	165.51
702.004	158.22
702.406	199.49
702.808	180.07
703.21	170.36
703.612	284.44
704.014	233.47
704.416	177.64
704.818	233.47
705.219	167.93
705.621	228.61
706.023	221.33
706.424	257.74
706.826	301.43
707.227	201.91
707.629	153.37
708.03	238.32
708.431	269.88
708.832	257.74
709.234	177.64
709.635	260.17
710.036	269.88
710.437	277.16
710.838	294.15
711.239	248.03
711.64	303.86
712.041	226.19
712.441	231.04
712.842	303.86
713.243	240.75
713.643	235.9
714.044	243.18
714.445	243.18
714.845	289.29
715.246	362.11
715.646	301.43
716.046	301.43
716.447	315.99
716.847	340.27
717.247	315.99
717.647	330.56
718.047	328.13
718.447	306.29
718.847	323.28
719.247	296.58
719.647	349.98
720.047	306.29
720.446	328.13
720.846	374.25
721.246	425.22
721.645	398.52
722.045	405.8
722.444	376.67
722.844	481.05
723.243	427.65
723.643	376.67
724.042	383.96
724.441	512.6
724.84	468.91
725.24	391.24
725.639	558.72
726.038	512.6
726.437	500.46
726.836	549.01
727.234	595.12
727.633	629.11
728.032	585.42
728.431	563.57
728.83	590.27
729.228	653.38
729.627	667.94
730.025	641.24
730.424	748.04
730.822	796.58
731.22	825.71
731.619	886.39
732.017	932.51
732.415	973.77
732.813	1083
733.212	1160.67
733.61	1240.77
734.008	1286.88
734.406	1430.09
734.803	1524.75
735.201	1536.89
735.599	1672.81
735.997	1689.8
736.395	1762.62
736.792	1920.39
737.19	2041.75
737.587	2056.31
737.985	2192.24
738.382	2294.18
738.78	2551.47
739.177	2549.04
739.574	2655.84
739.971	2888.85
740.369	2874.29
740.766	3066.04
741.163	3235.94
741.56	3434.97
741.957	3447.11
742.354	3648.57
742.751	3888.87
743.147	4056.34
743.544	4124.31
743.941	4354.89
744.338	4595.19
744.734	4833.05
745.131	4891.31
745.527	5328.21
745.924	5515.1
746.32	5782.1
746.716	5898.61
747.113	6466.58
747.509	6551.53
747.905	6748.13
748.301	7236
748.697	7634.07
749.093	7915.63
749.489	7915.63
749.885	8702.05
750.281	9228.75
750.677	9284.58
751.073	9702.06
751.468	10277.31
751.864	10546.74
752.26	10842.86
752.655	11563.74
753.051	11828.31
753.446	11969.09
753.842	12100.16
754.237	13066.19
754.632	13466.68
755.028	13420.57
755.423	13456.98
755.818	13804.07
756.213	14777.38
756.608	14687.58
757.003	14690
757.398	15020.11
757.793	15779.83
758.188	15236.13
758.583	15408.46
758.977	16330.81
759.372	17250.72
759.767	17585.68
760.161	18175.5
760.556	19410.95
760.95	20486.21
761.345	20818.74
761.739	21034.76
762.133	21978.95
762.527	23738.69
762.922	23483.83
763.316	23896.46
763.71	24826.08
764.104	25539.69
764.498	26877.09
764.892	26134.36
765.286	26680.48
765.68	28425.65
766.073	29059.16
766.467	27996.04
766.861	28301.87
767.255	31088.32
767.648	32578.63
768.042	31678.13
768.435	31564.05
768.829	33119.9
769.222	34760.7
769.615	34017.97
770.008	33015.53
770.402	33610.2
770.795	35518
771.188	35831.11
771.581	34250.99
771.974	34437.88
772.367	34996.15
772.76	36498.6
773.153	34292.25
773.545	33168.45
773.938	35017.99
774.331	36360.24
774.724	37035.01
775.116	36469.47
775.509	36695.2
775.901	39755.93
776.294	42396.75
776.686	41408.87
777.078	40476.81
777.471	41867.61
777.863	45175.92
778.255	46950.21
778.647	45372.52
779.039	44673.48
779.431	45690.49
779.823	48513.35
780.215	49127.43
780.607	46450.21
780.999	46071.56
781.39	47462.36
781.782	50175.99
782.174	50246.38
782.565	48389.56
782.957	47421.1
783.348	49760.94
783.74	51923.59
784.131	51644.46
784.522	50100.75
784.914	48178.39
785.305	49882.3
785.696	51059.5
786.087	50610.47
786.478	46991.48
786.869	44629.79
787.26	45047.27
787.651	47365.27
788.042	47226.92
788.433	43377.34
788.823	41141.87
789.214	42013.24
789.605	43139.48
789.995	41887.03
790.386	38770.48
790.776	37292.3
791.167	38105.42
791.557	41561.78
791.948	43071.51
792.338	41394.3
792.728	40071.47
793.118	39406.41
793.508	42624.9
793.898	44489.01
794.288	44379.79
794.678	41052.06
795.068	39882.14
795.458	41226.82
795.848	44430.76
796.238	44632.22
796.627	42289.95
797.017	39013.2
797.406	39797.19
797.796	42452.57
798.185	44047.26
798.575	43246.27
798.964	40746.23
799.354	39527.77
799.743	41103.04
800.132	43904.05
800.521	45326.4
800.91	43299.67
801.299	39826.32
801.688	39479.22
802.077	40700.12
802.466	43316.66
802.855	42838.5
803.244	39605.44
803.633	37139.38
804.021	36692.77
804.41	38316.59
804.799	39848.16
805.187	38547.17
805.576	34901.48
805.964	32132.02
806.352	31561.63
806.741	33610.2
807.129	34624.78
807.517	34129.63
807.905	32013.09
808.293	30231.51
808.681	30379.57
809.069	32539.8
809.457	34971.87
809.845	35326.25
810.233	33386.9
810.621	30867.44
811.009	30542.19
811.396	32294.65
811.784	34869.93
812.171	35221.88
812.559	33248.55
812.946	30568.89
813.334	28930.52
813.721	30144.13
814.108	31219.39
814.496	32561.64
814.883	30901.42
815.27	30124.71
815.657	27377.09
816.044	27151.36
816.431	29238.77
816.818	31297.06
817.205	31365.02
817.592	29915.97
817.979	26903.79
818.365	25488.72
818.752	25233.86
819.139	26646.5
819.525	27384.38
819.912	27197.48
820.298	25061.52
820.685	22627.02
821.071	21491.08
821.457	21947.4
821.843	22915.86
822.23	23767.82
822.616	22034.78
823.002	20008.05
823.388	17806.56
823.774	16731.3
824.16	16864.8
824.546	18027.43
824.931	18913.37
825.317	18243.46
825.703	16406.05
826.089	14852.63
826.474	14624.47
826.86	14765.25
827.245	16372.07
827.631	17304.12
828.016	16743.43
828.401	14859.91
828.787	13488.53
829.172	12561.33
829.557	12944.83
829.942	13801.64
830.327	14609.91
830.712	14624.47
831.097	13243.38
831.482	11490.93
831.867	10391.39
832.252	10566.15
832.636	11342.86
833.021	12206.96
833.406	12806.48
833.79	12172.97
834.175	10738.49
834.559	9282.15
834.944	8595.25
835.328	9189.92
835.713	9857.4
836.097	10762.76
836.481	10454.5
836.865	9437.5
837.249	8335.54
837.633	7272.41
838.017	6969.01
838.401	6956.87
838.785	7483.58
839.169	8007.86
839.553	7908.35
839.937	7299.11
840.32	6017.54
840.704	5231.12
841.087	4879.17
841.471	5148.59
841.854	5786.95
842.238	6027.25
842.621	5964.14
843.004	5279.66
843.388	4665.58
843.771	4197.12
844.154	3803.91
844.537	4126.73
844.92	4791.79
845.303	4990.82
845.686	5177.72
846.069	4760.24
846.452	4257.8
846.834	3653.42
847.217	3456.82
847.6	3371.87
847.982	3755.37
848.365	4223.82
848.748	4250.52
849.13	4092.75
849.512	3750.51
849.895	3100.02
850.277	2799.04
850.659	2636.42
851.041	2854.87
851.423	3136.43
851.806	3493.23
852.188	3653.42
852.57	3519.93
852.951	3036.91
853.333	2624.28
853.715	2238.35
854.097	2133.98
854.479	2330.59
854.86	2515.06
855.242	2803.9
855.623	2733.51
856.005	2646.13
856.386	2391.27
856.768	1976.21
857.149	1616.99
857.53	1500.48
857.911	1665.53
858.292	1735.92
858.674	1930.1
859.055	2049.03
859.436	1959.22
859.817	1723.78
860.197	1495.62
860.578	1233.48
860.959	1158.24
861.34	1056.3
861.72	1223.78
862.101	1388.83
862.482	1519.9
862.862	1366.98
863.243	1447.08
863.623	1260.18
864.003	990.76
864.384	927.65
864.764	791.73
865.144	854.84
865.524	939.79
865.904	937.36
866.284	1083
866.664	1058.72
867.044	1046.59
867.424	908.24
867.804	862.12
868.183	675.22
868.563	566
868.943	602.41
869.322	706.78
869.702	740.76
870.081	818.43
870.461	842.7
870.84	794.16
871.22	692.21
871.599	626.68
871.978	473.76
872.357	464.05
872.736	422.79
873.115	556.29
873.494	558.72
873.873	585.42
874.252	515.03
874.631	488.33
875.01	524.74
875.388	556.29
875.767	415.51
876.146	323.28
876.524	320.85
876.903	332.98
877.281	400.95
877.66	381.53
878.038	352.4
878.416	400.95
878.794	437.36
879.173	432.5
879.551	347.55
879.929	299
880.307	252.89
880.685	274.73
881.063	315.99
881.441	342.69
881.818	303.86
882.196	274.73
882.574	357.26
882.951	257.74
883.329	250.46
883.707	274.73
884.084	328.13
884.461	299
884.839	197.06
885.216	170.36
885.593	155.8
885.971	272.3
886.348	313.57
886.725	228.61
887.102	257.74
887.479	252.89
887.856	250.46
888.233	228.61
888.609	206.77
888.986	192.21
889.363	211.62
889.74	189.78
890.116	291.72
890.493	214.05
890.869	221.33
891.246	226.19
891.622	148.52
891.998	158.22
892.375	231.04
892.751	199.49
893.127	180.07
893.503	218.91
893.879	189.78
894.255	194.63
894.631	177.64
895.007	167.93
895.383	204.34
895.759	204.34
896.134	189.78
896.51	136.38
896.886	136.38
897.261	129.1
897.637	148.52
898.012	153.37
898.388	163.08
898.763	209.2
899.138	170.36
899.514	143.66
899.889	187.35
900.264	172.79
900.639	277.16
901.014	223.76
901.389	180.07
901.764	109.68
902.139	124.24
902.513	177.64
902.888	204.34
903.263	148.52
903.638	97.54
904.012	189.78
904.387	184.92
904.761	177.64
905.136	172.79
905.51	146.09
905.884	148.52
906.259	165.51
906.633	102.4
907.007	90.26
907.381	223.76
907.755	182.5
908.129	138.81
908.503	131.53
908.877	119.39
909.251	175.22
909.624	160.65
909.998	146.09
910.372	126.67
910.745	211.62
911.119	138.81
911.492	206.77
911.866	95.12
912.239	189.78
912.612	124.24
912.986	228.61
913.359	158.22
913.732	124.24
914.105	80.55
914.478	141.23
914.851	129.1
915.224	204.34
915.597	126.67
915.97	209.2
916.343	197.06
916.715	167.93
917.088	184.92
917.461	158.22
917.833	150.94
918.206	197.06
918.578	189.78
918.951	180.07
919.323	129.1
919.695	155.8
920.067	175.22
920.44	163.08
920.812	216.48
921.184	150.94
921.556	153.37
921.928	97.54
922.3	92.69
922.672	209.2
923.043	148.52
923.415	131.53
923.787	136.38
924.158	180.07
924.53	189.78
924.901	148.52
925.273	124.24
925.644	73.27
926.016	245.6
926.387	204.34
926.758	199.49
927.129	223.76
927.5	121.82
927.872	148.52
928.243	109.68
928.613	180.07
928.984	160.65
929.355	124.24
929.726	97.54
930.097	165.51
930.467	182.5
930.838	177.64
931.209	129.1
931.579	124.24
931.95	175.22
932.32	155.8
932.69	209.2
933.061	136.38
933.431	158.22
933.801	167.93
934.171	194.63
934.541	153.37
934.911	204.34
935.281	158.22
935.651	182.5
936.021	112.11
936.391	194.63
936.761	116.96
937.13	82.98
937.5	226.19
937.87	163.08
938.239	153.37
938.609	146.09
938.978	182.5
939.347	129.1
939.717	124.24
940.086	180.07
940.455	175.22
940.824	167.93
941.193	155.8
941.562	192.21
941.931	150.94
942.3	252.89
942.669	85.41
943.038	192.21
943.407	143.66
943.775	199.49
944.144	124.24
944.513	107.25
944.881	163.08
945.25	153.37
945.618	187.35
945.986	211.62
946.355	197.06
946.723	158.22
947.091	163.08
947.459	116.96
947.827	107.25
948.195	194.63
948.563	114.53
948.931	175.22
949.299	158.22
949.667	119.39
950.035	214.05
950.402	124.24
950.77	119.39
951.138	187.35
951.505	180.07
951.873	170.36
952.24	107.25
952.607	85.41
952.975	148.52
953.342	114.53
953.709	206.77
954.076	189.78
954.443	172.79
954.81	182.5
955.177	158.22
955.544	170.36
955.911	199.49
956.278	199.49
956.645	158.22
957.012	160.65
957.378	172.79
957.745	180.07
958.111	180.07
958.478	163.08
958.844	182.5
959.211	138.81
959.577	150.94
959.943	112.11
960.309	192.21
960.675	279.59
961.042	201.91
961.408	192.21
961.774	119.39
962.139	201.91
962.505	148.52
962.871	138.81
963.237	184.92
963.603	187.35
963.968	126.67
964.334	209.2
964.699	175.22
965.065	160.65
965.43	102.4
965.796	155.8
966.161	102.4
966.526	126.67
966.891	126.67
967.256	133.95
967.622	192.21
967.987	131.53
968.352	187.35
968.716	107.25
969.081	206.77
969.446	184.92
969.811	148.52
970.176	189.78
970.54	126.67
970.905	119.39
971.269	148.52
971.634	167.93
971.998	160.65
972.363	138.81
972.727	170.36
973.091	121.82
973.455	165.51
973.819	126.67
974.183	141.23
974.547	68.42
974.911	146.09
975.275	172.79
975.639	124.24
976.003	189.78
976.367	163.08
976.73	155.8
977.094	238.32
977.458	199.49
977.821	197.06
978.185	150.94
978.548	138.81
978.911	116.96
979.275	126.67
979.638	235.9
980.001	133.95
980.364	211.62
980.727	129.1
981.09	124.24
981.453	141.23
981.816	209.2
982.179	167.93
982.542	155.8
982.905	158.22
983.267	155.8
983.63	153.37
983.992	182.5
984.355	133.95
984.717	146.09
985.08	131.53
985.442	167.93
985.804	112.11
986.167	221.33
986.529	121.82
986.891	192.21
987.253	197.06
987.615	204.34
987.977	209.2
988.339	141.23
988.701	180.07
989.062	180.07
989.424	107.25
989.786	180.07
990.147	141.23
990.509	187.35
990.87	124.24
991.232	199.49
991.593	158.22
991.955	218.91
992.316	252.89
992.677	187.35
993.038	184.92
993.399	150.94
993.76	209.2
994.121	167.93
994.482	170.36
994.843	65.99
995.204	143.66
995.565	114.53
995.926	158.22
996.286	150.94
996.647	194.63
997.007	121.82
997.368	194.63
997.728	116.96
998.089	163.08
998.449	163.08
998.809	148.52
999.169	143.66
999.53	121.82
999.89	90.26
1000.25	211.62
1000.61	133.95
1000.97	148.52
1001.329	204.34
1001.689	182.5
1002.049	126.67
1002.409	82.98
1002.768	146.09
1003.128	129.1
1003.487	175.22
1003.847	184.92
1004.206	112.11
1004.566	199.49
1004.925	243.18
1005.284	121.82
1005.643	121.82
1006.003	112.11
1006.362	109.68
1006.721	78.13
1007.08	201.91
1007.438	107.25
1007.797	170.36
1008.156	167.93
1008.515	143.66
1008.874	167.93
1009.232	121.82
1009.591	114.53
1009.949	102.4
1010.308	160.65
1010.666	129.1
1011.024	201.91
1011.383	102.4
1011.741	165.51
1012.099	131.53
1012.457	131.53
1012.815	136.38
1013.173	53.85
1013.531	82.98
1013.889	131.53
1014.247	180.07
1014.605	194.63
1014.962	189.78
1015.32	167.93
1015.678	116.96
1016.035	136.38
1016.393	143.66
1016.75	131.53
1017.107	189.78
1017.465	136.38
1017.822	170.36
1018.179	146.09
1018.536	175.22
1018.894	182.5
1019.251	150.94
1019.608	109.68
1019.964	129.1
1020.321	235.9
1020.678	180.07
1021.035	218.91
1021.392	119.39
1021.748	163.08
1022.105	184.92
1022.461	51.43
1022.818	189.78
1023.174	150.94
1023.531	180.07
1023.887	141.23
1024.243	167.93
1024.599	119.39
1024.955	180.07
1025.311	141.23
1025.667	177.64
1026.023	87.84
1026.379	187.35
1026.735	133.95
1027.091	165.51
1027.447	124.24
