189.514	168.24
189.973	168.24
190.431	168.24
190.889	-6.52
191.348	3.19
191.806	25.03
192.264	12.89
192.722	-6.52
193.18	-25.94
193.638	-30.8
194.096	-81.77
194.554	-1.67
195.012	-8.95
195.47	12.89
195.928	-30.8
196.385	5.61
196.843	0.76
197.301	44.45
197.758	-6.52
198.216	39.59
198.674	44.45
199.131	32.31
199.589	25.03
200.046	17.75
200.503	83.28
200.961	22.6
201.418	122.12
201.875	78.43
202.332	80.86
202.79	44.45
203.247	68.72
203.704	158.53
204.161	54.16
204.618	68.72
205.075	124.55
205.532	34.74
205.989	102.7
206.445	109.98
206.902	141.54
207.359	59.01
207.816	131.83
208.272	92.99
208.729	107.56
209.185	136.68
209.642	95.42
210.098	141.54
210.555	153.67
211.011	107.56
211.467	194.94
211.924	68.72
212.38	173.09
212.836	136.68
213.292	134.26
213.748	156.1
214.204	90.57
214.66	153.67
215.116	156.1
215.572	187.65
216.028	134.26
216.484	131.83
216.94	151.25
217.396	95.42
217.851	148.82
218.307	95.42
218.763	146.39
219.218	136.68
219.674	90.57
220.129	177.95
220.585	83.28
221.04	122.12
221.496	90.57
221.951	158.53
222.406	160.96
222.861	66.29
223.317	114.84
223.772	153.67
224.227	109.98
224.682	148.82
225.137	131.83
225.592	165.81
226.047	100.27
226.502	182.8
226.957	129.4
227.411	109.98
227.866	76
228.321	139.11
228.776	158.53
229.23	136.68
229.685	175.52
230.139	63.87
230.594	190.08
231.048	180.37
231.503	148.82
231.957	88.14
232.411	129.4
232.865	112.41
233.32	136.68
233.774	168.24
234.228	122.12
234.682	92.99
235.136	173.09
235.59	141.54
236.044	151.25
236.498	124.55
236.952	136.68
237.406	114.84
237.86	124.55
238.313	153.67
238.767	97.85
239.221	117.27
239.674	112.41
240.128	97.85
240.581	136.68
241.035	112.41
241.488	136.68
241.942	119.69
242.395	136.68
242.848	117.27
243.301	102.7
243.755	146.39
244.208	131.83
244.661	180.37
245.114	158.53
245.567	141.54
246.02	187.65
246.473	131.83
246.926	165.81
247.379	119.69
247.832	112.41
248.284	126.97
248.737	131.83
249.19	122.12
249.642	71.15
250.095	141.54
250.547	207.07
251	141.54
251.452	92.99
251.905	66.29
252.357	177.95
252.81	146.39
253.262	100.27
253.714	143.96
254.166	124.55
254.618	90.57
255.07	80.86
255.523	141.54
255.975	102.7
256.427	92.99
256.878	141.54
257.33	102.7
257.782	126.97
258.234	156.1
258.686	109.98
259.137	131.83
259.589	134.26
260.041	136.68
260.492	148.82
260.944	163.38
261.395	170.66
261.847	228.92
262.298	119.69
262.749	187.65
263.201	182.8
263.652	126.97
264.103	131.83
264.554	109.98
265.005	117.27
265.457	92.99
265.908	129.4
266.359	170.66
266.809	109.98
267.26	173.09
267.711	129.4
268.162	182.8
268.613	146.39
269.064	85.71
269.514	83.28
269.965	134.26
270.415	117.27
270.866	122.12
271.316	92.99
271.767	165.81
272.217	131.83
272.668	163.38
273.118	139.11
273.568	185.23
274.019	100.27
274.469	117.27
274.919	134.26
275.369	109.98
275.819	136.68
276.269	228.92
276.719	83.28
277.169	63.87
277.619	126.97
278.069	117.27
278.518	129.4
278.968	148.82
279.418	173.09
279.867	163.38
280.317	219.21
280.767	139.11
281.216	173.09
281.666	100.27
282.115	124.55
282.564	124.55
283.014	160.96
283.463	143.96
283.912	105.13
284.361	107.56
284.811	153.67
285.26	168.24
285.709	109.98
286.158	126.97
286.607	97.85
287.056	173.09
287.505	214.35
287.953	153.67
288.402	168.24
288.851	49.3
289.3	88.14
289.748	117.27
290.197	177.95
290.646	97.85
291.094	136.68
291.543	117.27
291.991	194.94
292.439	117.27
292.888	105.13
293.336	148.82
293.784	97.85
294.233	148.82
294.681	95.42
295.129	168.24
295.577	78.43
296.025	122.12
296.473	180.37
296.921	92.99
297.369	63.87
297.817	168.24
298.264	136.68
298.712	131.83
299.16	163.38
299.608	90.57
300.055	107.56
300.503	126.97
300.95	170.66
301.398	61.44
301.845	126.97
302.293	119.69
302.74	71.15
303.187	173.09
303.635	151.25
304.082	117.27
304.529	97.85
304.976	95.42
305.423	158.53
305.87	143.96
306.317	129.4
306.764	100.27
307.211	146.39
307.658	102.7
308.105	71.15
308.552	136.68
308.998	114.84
309.445	151.25
309.892	163.38
310.338	190.08
310.785	119.69
311.231	88.14
311.678	175.52
312.124	100.27
312.571	88.14
313.017	105.13
313.463	129.4
313.909	153.67
314.356	88.14
314.802	156.1
315.248	124.55
315.694	173.09
316.14	105.13
316.586	124.55
317.032	122.12
317.478	175.52
317.923	175.52
318.369	175.52
318.815	109.98
319.261	102.7
319.706	114.84
320.152	114.84
320.597	88.14
321.043	37.17
321.488	141.54
321.934	131.83
322.379	194.94
322.824	109.98
323.27	143.96
323.715	112.41
324.16	73.58
324.605	173.09
325.05	153.67
325.495	124.55
325.94	141.54
326.385	102.7
326.83	182.8
327.275	168.24
327.72	139.11
328.165	165.81
328.61	95.42
329.054	107.56
329.499	153.67
329.943	168.24
330.388	165.81
330.832	151.25
331.277	114.84
331.721	160.96
332.166	163.38
332.61	88.14
333.054	68.72
333.499	177.95
333.943	160.96
334.387	143.96
334.831	243.48
335.275	143.96
335.719	134.26
336.163	190.08
336.607	141.54
337.051	129.4
337.495	117.27
337.938	117.27
338.382	102.7
338.826	136.68
339.269	102.7
339.713	122.12
340.157	102.7
340.6	76
341.044	199.79
341.487	165.81
341.93	95.42
342.374	102.7
342.817	139.11
343.26	129.4
343.703	131.83
344.146	88.14
344.59	136.68
345.033	139.11
345.476	131.83
345.919	51.73
346.361	153.67
346.804	109.98
347.247	92.99
347.69	160.96
348.133	187.65
348.575	160.96
349.018	175.52
349.461	131.83
349.903	146.39
350.346	76
350.788	175.52
351.23	141.54
351.673	134.26
352.115	165.81
352.557	78.43
353	112.41
353.442	129.4
353.884	165.81
354.326	122.12
354.768	168.24
355.21	153.67
355.652	141.54
356.094	136.68
356.536	102.7
356.978	131.83
357.419	126.97
357.861	85.71
358.303	78.43
358.744	173.09
359.186	85.71
359.627	199.79
360.069	131.83
360.51	117.27
360.952	95.42
361.393	156.1
361.834	148.82
362.276	100.27
362.717	100.27
363.158	109.98
363.599	214.35
364.04	107.56
364.481	156.1
364.922	158.53
365.363	165.81
365.804	156.1
366.245	68.72
366.686	73.58
367.126	141.54
367.567	146.39
368.008	151.25
368.448	141.54
368.889	80.86
369.33	136.68
369.77	122.12
370.21	136.68
370.651	190.08
371.091	85.71
371.531	163.38
371.972	156.1
372.412	92.99
372.852	170.66
373.292	134.26
373.732	202.22
374.172	71.15
374.612	139.11
375.052	197.36
375.492	163.38
375.932	194.94
376.372	78.43
376.811	160.96
377.251	85.71
377.691	148.82
378.13	156.1
378.57	207.07
379.009	83.28
379.449	192.51
379.888	136.68
380.328	129.4
380.767	129.4
381.206	95.42
381.645	134.26
382.085	95.42
382.524	122.12
382.963	194.94
383.402	177.95
383.841	117.27
384.28	83.28
384.719	124.55
385.158	68.72
385.596	129.4
386.035	46.88
386.474	170.66
386.913	126.97
387.351	124.55
387.79	117.27
388.228	141.54
388.667	141.54
389.105	136.68
389.544	107.56
389.982	221.64
390.42	187.65
390.859	136.68
391.297	107.56
391.735	143.96
392.173	126.97
392.611	197.36
393.049	136.68
393.487	117.27
393.925	95.42
394.363	102.7
394.801	97.85
395.239	122.12
395.676	54.16
396.114	126.97
396.552	173.09
396.989	122.12
397.427	85.71
397.864	100.27
398.302	180.37
398.739	114.84
399.177	163.38
399.614	134.26
400.051	158.53
400.488	148.82
400.926	151.25
401.363	78.43
401.8	34.74
402.237	90.57
402.674	219.21
403.111	139.11
403.548	102.7
403.985	100.27
404.421	97.85
404.858	109.98
405.295	170.66
405.732	141.54
406.168	168.24
406.605	109.98
407.041	68.72
407.478	95.42
407.914	90.57
408.351	129.4
408.787	139.11
409.223	131.83
409.66	170.66
410.096	122.12
410.532	80.86
410.968	102.7
411.404	211.93
411.84	182.8
412.276	187.65
412.712	122.12
413.148	156.1
413.584	92.99
414.02	185.23
414.455	42.02
414.891	102.7
415.327	78.43
415.762	190.08
416.198	219.21
416.633	109.98
417.069	122.12
417.504	78.43
417.94	112.41
418.375	165.81
418.81	112.41
419.245	76
419.681	131.83
420.116	80.86
420.551	143.96
420.986	148.82
421.421	156.1
421.856	148.82
422.291	139.11
422.726	49.3
423.16	168.24
423.595	90.57
424.03	185.23
424.464	124.55
424.899	151.25
425.334	117.27
425.768	59.01
426.203	73.58
426.637	90.57
427.071	165.81
427.506	109.98
427.94	165.81
428.374	168.24
428.809	148.82
429.243	185.23
429.677	83.28
430.111	73.58
430.545	170.66
430.979	90.57
431.413	124.55
431.847	109.98
432.28	114.84
432.714	59.01
433.148	122.12
433.582	100.27
434.015	85.71
434.449	165.81
434.882	187.65
435.316	102.7
435.749	59.01
436.183	83.28
436.616	112.41
437.049	153.67
437.483	202.22
437.916	165.81
438.349	83.28
438.782	143.96
439.215	136.68
439.648	131.83
440.081	216.78
440.514	119.69
440.947	105.13
441.38	102.7
441.813	185.23
442.245	114.84
442.678	129.4
443.111	173.09
443.543	141.54
443.976	168.24
444.408	170.66
444.841	156.1
445.273	139.11
445.705	180.37
446.138	122.12
446.57	180.37
447.002	160.96
447.434	148.82
447.867	107.56
448.299	204.65
448.731	241.05
449.163	117.27
449.595	173.09
450.026	180.37
450.458	216.78
450.89	207.07
451.322	105.13
451.754	199.79
452.185	185.23
452.617	158.53
453.048	236.2
453.48	153.67
453.911	245.91
454.343	236.2
454.774	156.1
455.205	182.8
455.637	194.94
456.068	231.34
456.499	277.46
456.93	197.36
457.361	158.53
457.792	170.66
458.223	226.49
458.654	226.49
459.085	221.64
459.516	236.2
459.947	238.63
460.378	163.38
460.808	185.23
461.239	177.95
461.669	182.8
462.1	241.05
462.531	190.08
462.961	122.12
463.391	214.35
463.822	158.53
464.252	156.1
464.682	139.11
465.113	214.35
465.543	180.37
465.973	272.61
466.403	214.35
466.833	228.92
467.263	226.49
467.693	163.38
468.123	141.54
468.553	199.79
468.983	185.23
469.412	224.06
469.842	156.1
470.272	182.8
470.701	112.41
471.131	207.07
471.56	209.5
471.99	241.05
472.419	182.8
472.849	131.83
473.278	194.94
473.707	168.24
474.136	165.81
474.566	221.64
474.995	148.82
475.424	122.12
475.853	187.65
476.282	177.95
476.711	139.11
477.14	156.1
477.569	197.36
477.997	214.35
478.426	119.69
478.855	71.15
479.283	185.23
479.712	190.08
480.141	214.35
480.569	168.24
480.998	204.65
481.426	153.67
481.854	163.38
482.283	199.79
482.711	107.56
483.139	190.08
483.567	107.56
483.995	170.66
484.424	131.83
484.852	124.55
485.28	156.1
485.708	214.35
486.135	211.93
486.563	168.24
486.991	163.38
487.419	114.84
487.847	211.93
488.274	209.5
488.702	185.23
489.129	97.85
489.557	134.26
489.984	173.09
490.412	207.07
490.839	134.26
491.266	187.65
491.694	136.68
492.121	168.24
492.548	170.66
492.975	124.55
493.402	148.82
493.829	170.66
494.256	124.55
494.683	136.68
495.11	122.12
495.537	139.11
495.964	136.68
496.39	143.96
496.817	141.54
497.244	165.81
497.67	71.15
498.097	182.8
498.523	122.12
498.95	160.96
499.376	221.64
499.803	199.79
500.229	170.66
500.655	131.83
501.081	156.1
501.508	136.68
501.934	90.57
502.36	158.53
502.786	134.26
503.212	143.96
503.638	141.54
504.064	202.22
504.489	148.82
504.915	112.41
505.341	124.55
505.767	153.67
506.192	153.67
506.618	107.56
507.043	126.97
507.469	216.78
507.894	158.53
508.32	194.94
508.745	190.08
509.17	170.66
509.596	88.14
510.021	165.81
510.446	197.36
510.871	109.98
511.296	129.4
511.721	92.99
512.146	156.1
512.571	192.51
512.996	153.67
513.421	102.7
513.845	124.55
514.27	182.8
514.695	129.4
515.119	173.09
515.544	146.39
515.969	190.08
516.393	141.54
516.817	151.25
517.242	187.65
517.666	173.09
518.09	131.83
518.515	90.57
518.939	151.25
519.363	362.41
519.787	117.27
520.211	153.67
520.635	233.77
521.059	175.52
521.483	143.96
521.907	131.83
522.331	148.82
522.754	107.56
523.178	165.81
523.602	126.97
524.025	180.37
524.449	177.95
524.872	129.4
525.296	185.23
525.719	168.24
526.143	180.37
526.566	139.11
526.989	131.83
527.412	158.53
527.836	134.26
528.259	129.4
528.682	151.25
529.105	126.97
529.528	185.23
529.951	160.96
530.374	143.96
530.796	119.69
531.219	199.79
531.642	105.13
532.065	146.39
532.487	168.24
532.91	151.25
533.332	122.12
533.755	190.08
534.177	226.49
534.6	173.09
535.022	153.67
535.444	187.65
535.867	71.15
536.289	136.68
536.711	221.64
537.133	122.12
537.555	175.52
537.977	214.35
538.399	173.09
538.821	143.96
539.243	148.82
539.665	228.92
540.086	117.27
540.508	139.11
540.93	182.8
541.351	100.27
541.773	131.83
542.195	141.54
542.616	221.64
543.037	209.5
543.459	177.95
543.88	160.96
544.301	109.98
544.723	83.28
545.144	182.8
545.565	255.62
545.986	165.81
546.407	97.85
546.828	173.09
547.249	146.39
547.67	148.82
548.091	182.8
548.512	165.81
548.932	185.23
549.353	199.79
549.774	122.12
550.194	180.37
550.615	173.09
551.035	187.65
551.456	112.41
551.876	156.1
552.296	199.79
552.717	153.67
553.137	129.4
553.557	190.08
553.977	139.11
554.397	141.54
554.817	117.27
555.237	180.37
555.657	122.12
556.077	112.41
556.497	136.68
556.917	194.94
557.337	92.99
557.756	168.24
558.176	160.96
558.596	158.53
559.015	68.72
559.435	192.51
559.854	160.96
560.274	175.52
560.693	199.79
561.112	134.26
561.532	95.42
561.951	202.22
562.37	117.27
562.789	233.77
563.208	146.39
563.627	175.52
564.046	109.98
564.465	173.09
564.884	148.82
565.303	182.8
565.722	139.11
566.14	112.41
566.559	209.5
566.978	245.91
567.396	163.38
567.815	95.42
568.233	175.52
568.652	143.96
569.07	199.79
569.489	170.66
569.907	175.52
570.325	141.54
570.743	146.39
571.161	148.82
571.58	153.67
571.998	226.49
572.416	102.7
572.833	139.11
573.251	192.51
573.669	158.53
574.087	182.8
574.505	119.69
574.922	146.39
575.34	141.54
575.758	143.96
576.175	156.1
576.593	151.25
577.01	221.64
577.428	187.65
577.845	1670.69
578.262	236.2
578.68	170.66
579.097	129.4
579.514	95.42
579.931	160.96
580.348	151.25
580.765	131.83
581.182	202.22
581.599	141.54
582.016	173.09
582.433	134.26
582.849	185.23
583.266	177.95
583.683	182.8
584.099	88.14
584.516	153.67
584.933	107.56
585.349	141.54
585.765	153.67
586.182	170.66
586.598	160.96
587.014	177.95
587.431	163.38
587.847	119.69
588.263	141.54
588.679	211.93
589.095	119.69
589.511	146.39
589.927	168.24
590.343	199.79
590.759	204.65
591.174	119.69
591.59	158.53
592.006	143.96
592.421	143.96
592.837	136.68
593.252	92.99
593.668	173.09
594.083	156.1
594.499	202.22
594.914	109.98
595.329	173.09
595.745	146.39
596.16	112.41
596.575	170.66
596.99	124.55
597.405	180.37
597.82	158.53
598.235	180.37
598.65	126.97
599.065	175.52
599.479	175.52
599.894	122.12
600.309	158.53
600.724	95.42
601.138	173.09
601.553	95.42
601.967	92.99
602.382	112.41
602.796	114.84
603.21	168.24
603.625	185.23
604.039	204.65
604.453	170.66
604.867	168.24
605.281	141.54
605.695	112.41
606.109	190.08
606.523	163.38
606.937	231.34
607.351	238.63
607.765	211.93
608.178	134.26
608.592	175.52
609.006	97.85
609.419	109.98
609.833	148.82
610.246	153.67
610.66	92.99
611.073	173.09
611.487	173.09
611.9	134.26
612.313	143.96
612.726	214.35
613.139	170.66
613.553	143.96
613.966	250.76
614.379	95.42
614.792	197.36
615.204	131.83
615.617	119.69
616.03	146.39
616.443	194.94
616.856	165.81
617.268	148.82
617.681	226.49
618.093	92.99
618.506	177.95
618.918	122.12
619.331	231.34
619.743	134.26
620.155	146.39
620.568	158.53
620.98	204.65
621.392	143.96
621.804	253.19
622.216	105.13
622.628	177.95
623.04	117.27
623.452	163.38
623.864	165.81
624.276	102.7
624.687	105.13
625.099	105.13
625.511	122.12
625.922	146.39
626.334	158.53
626.745	139.11
627.157	134.26
627.568	175.52
627.979	168.24
628.391	139.11
628.802	109.98
629.213	165.81
629.624	122.12
630.035	170.66
630.446	182.8
630.857	139.11
631.268	160.96
631.679	163.38
632.09	177.95
632.501	170.66
632.912	168.24
633.322	163.38
633.733	148.82
634.144	160.96
634.554	124.55
634.965	192.51
635.375	168.24
635.785	139.11
636.196	219.21
636.606	114.84
637.016	112.41
637.427	126.97
637.837	102.7
638.247	119.69
638.657	105.13
639.067	151.25
639.477	146.39
639.887	207.07
640.297	129.4
640.706	163.38
641.116	139.11
641.526	187.65
641.935	129.4
642.345	143.96
642.755	117.27
643.164	124.55
643.573	126.97
643.983	160.96
644.392	151.25
644.801	114.84
645.211	165.81
645.62	114.84
646.029	207.07
646.438	129.4
646.847	194.94
647.256	114.84
647.665	168.24
648.074	180.37
648.483	139.11
648.892	151.25
649.3	148.82
649.709	180.37
650.118	151.25
650.526	141.54
650.935	80.86
651.343	209.5
651.752	231.34
652.16	182.8
652.568	119.69
652.977	187.65
653.385	119.69
653.793	126.97
654.201	153.67
654.609	170.66
655.017	170.66
655.425	141.54
655.833	129.4
656.241	102.7
656.649	170.66
657.057	100.27
657.464	163.38
657.872	143.96
658.28	107.56
658.687	180.37
659.095	158.53
659.502	109.98
659.91	146.39
660.317	80.86
660.724	134.26
661.132	112.41
661.539	148.82
661.946	156.1
662.353	146.39
662.76	160.96
663.167	129.4
663.574	160.96
663.981	165.81
664.388	114.84
664.795	165.81
665.202	173.09
665.608	100.27
666.015	131.83
666.422	173.09
666.828	61.44
667.235	112.41
667.641	105.13
668.047	131.83
668.454	119.69
668.86	105.13
669.266	199.79
669.673	85.71
670.079	168.24
670.485	114.84
670.891	131.83
671.297	139.11
671.703	97.85
672.109	85.71
672.515	131.83
672.92	114.84
673.326	78.43
673.732	126.97
674.138	139.11
674.543	136.68
674.949	146.39
675.354	122.12
675.76	253.19
676.165	146.39
676.57	95.42
676.976	146.39
677.381	143.96
677.786	192.51
678.191	102.7
678.596	71.15
679.001	102.7
679.406	141.54
679.811	160.96
680.216	90.57
680.621	102.7
681.026	129.4
681.43	126.97
681.835	207.07
682.24	100.27
682.644	105.13
683.049	134.26
683.453	165.81
683.858	143.96
684.262	126.97
684.667	100.27
685.071	156.1
685.475	122.12
685.879	143.96
686.283	112.41
686.687	185.23
687.091	163.38
687.495	100.27
687.899	141.54
688.303	107.56
688.707	148.82
689.111	129.4
689.514	156.1
689.918	44.45
690.322	112.41
690.725	136.68
691.129	109.98
691.532	143.96
691.936	134.26
692.339	109.98
692.742	131.83
693.146	131.83
693.549	100.27
693.952	126.97
694.355	163.38
694.758	202.22
695.161	66.29
695.564	177.95
695.967	139.11
696.37	114.84
696.773	114.84
697.175	129.4
697.578	163.38
697.981	219.21
698.383	151.25
698.786	192.51
699.188	95.42
699.591	54.16
699.993	129.4
700.395	165.81
700.798	105.13
701.2	177.95
701.602	153.67
702.004	141.54
702.406	156.1
702.808	214.35
703.21	219.21
703.612	185.23
704.014	158.53
704.416	177.95
704.818	192.51
705.219	231.34
705.621	209.5
706.023	151.25
706.424	114.84
706.826	236.2
707.227	122.12
707.629	194.94
708.03	199.79
708.431	202.22
708.832	153.67
709.234	122.12
709.635	214.35
710.036	199.79
710.437	187.65
710.838	92.99
711.239	170.66
711.64	180.37
712.041	265.33
712.441	168.24
712.842	168.24
713.243	136.68
713.643	146.39
714.044	141.54
714.445	88.14
714.845	153.67
715.246	185.23
715.646	141.54
716.046	190.08
716.447	241.05
716.847	216.78
717.247	156.1
717.647	211.93
718.047	238.63
718.447	209.5
718.847	124.55
719.247	163.38
719.647	204.65
720.047	260.47
720.446	185.23
720.846	199.79
721.246	253.19
721.645	216.78
722.045	209.5
722.444	226.49
722.844	265.33
723.243	258.04
723.643	187.65
724.042	219.21
724.441	311.44
724.84	204.65
725.24	207.07
725.639	384.26
726.038	226.49
726.437	185.23
726.836	224.06
727.234	231.34
727.633	262.9
728.032	357.56
728.431	284.74
728.83	304.16
729.228	299.31
729.627	301.73
730.025	333.29
730.424	367.27
730.822	272.61
731.22	345.42
731.619	408.53
732.017	408.53
732.415	420.67
732.813	447.37
733.212	461.93
733.61	478.92
734.008	549.31
734.406	539.6
734.803	692.52
735.201	600.28
735.599	665.82
735.997	663.39
736.395	748.34
736.792	648.83
737.19	711.93
737.587	794.46
737.985	804.17
738.382	821.16
738.78	947.38
739.177	944.95
739.574	981.36
739.971	981.36
740.369	1039.61
740.766	1100.29
741.163	1085.73
741.56	1187.67
741.957	1233.79
742.354	1294.47
742.751	1396.41
743.147	1512.92
743.544	1386.7
743.941	1425.54
744.338	1527.48
744.734	1534.76
745.131	1583.31
745.527	1908.56
745.924	1862.44
746.32	2017.78
746.716	2182.83
747.113	2112.44
747.509	2306.62
747.905	2330.89
748.301	2413.42
748.697	2423.13
749.093	2583.32
749.489	2651.29
749.885	2896.43
750.281	3209.55
750.677	3391.59
751.073	3452.27
751.468	3529.94
751.864	3534.79
752.26	3469.26
752.655	3610.04
753.051	3748.39
753.446	3850.33
753.842	4073.64
754.237	4275.1
754.632	4561.51
755.028	4573.65
755.423	4850.35
755.818	4855.2
756.213	4964.43
756.608	5029.96
757.003	4925.59
757.398	4804.23
757.793	4855.2
758.188	4850.35
758.583	5068.8
758.977	5335.79
759.372	5724.15
759.767	6114.93
760.161	6469.31
760.556	6867.37
760.95	6986.3
761.345	7195.05
761.739	7420.78
762.133	7207.18
762.527	7607.67
762.922	7534.86
763.316	7568.84
763.71	7894.09
764.104	8030.01
764.498	8454.77
764.892	9170.8
765.286	9500.91
765.68	9911.11
766.073	10141.69
766.467	10272.76
766.861	10537.33
767.255	10845.59
767.648	10731.51
768.042	10365
768.435	10229.07
768.829	10173.25
769.222	10258.2
769.615	10449.95
770.008	10724.23
770.402	10981.51
770.795	11496.08
771.188	11855.31
771.581	12301.92
771.974	12362.6
772.367	12682.99
772.76	13085.91
773.153	12520.37
773.545	12362.6
773.938	12505.81
774.331	12221.82
774.724	11891.72
775.116	11918.42
775.509	11833.47
775.901	12168.42
776.294	12583.48
776.686	12668.43
777.078	13178.15
777.471	13624.76
777.863	14843.22
778.255	15729.16
778.647	16348.1
779.039	16826.26
779.431	17187.92
779.823	17168.5
780.215	18078.71
780.607	17634.53
780.999	18054.44
781.39	17561.71
781.782	17498.6
782.174	17001.02
782.565	16493.73
782.957	16321.4
783.348	16039.84
783.74	15908.77
784.131	15454.88
784.522	15612.65
784.914	15382.07
785.305	15578.67
785.696	15556.83
786.087	16049.55
786.478	15967.03
786.869	16073.82
787.26	16433.05
787.651	15765.57
788.042	16452.47
788.433	15916.05
788.823	16158.78
789.214	15799.55
789.605	15624.79
789.995	15153.91
790.386	14488.85
790.776	14442.73
791.167	14275.25
791.557	14095.64
791.948	14314.09
792.338	14151.46
792.728	14221.85
793.118	13792.24
793.508	13646.6
793.898	13607.77
794.288	13394.17
794.678	13141.74
795.068	13231.55
795.458	13216.98
795.848	13122.32
796.238	13287.37
796.627	13321.35
797.017	13447.57
797.406	13801.94
797.796	13741.26
798.185	13947.58
798.575	14372.34
798.964	14646.62
799.354	15209.73
799.743	14908.76
800.132	15513.14
800.521	15418.47
800.91	15644.21
801.299	15316.53
801.688	15267.99
802.077	15068.95
802.466	15331.09
802.855	15399.06
803.244	14615.06
803.633	14355.35
804.021	13818.93
804.41	13775.24
804.799	13394.17
805.187	13248.54
805.576	12792.22
805.964	12440.27
806.352	11610.16
806.741	11663.56
807.129	11054.33
807.517	11357.73
807.905	11102.87
808.293	11076.17
808.681	10792.19
809.069	10559.18
809.457	11107.73
809.845	10845.59
810.233	10750.93
810.621	10697.53
811.009	10627.14
811.396	10801.9
811.784	10639.27
812.171	10435.39
812.559	10398.98
812.946	10124.7
813.334	9648.97
813.721	9743.63
814.108	9265.47
814.496	9377.12
814.883	9270.32
815.27	9525.18
815.657	9141.68
816.044	9219.35
816.431	9241.19
816.818	8988.76
817.205	9134.4
817.592	8877.11
817.979	8646.52
818.365	8500.89
818.752	8330.99
819.139	8350.4
819.525	7923.21
819.912	7763.02
820.298	7566.41
820.685	7398.93
821.071	7457.19
821.457	6998.44
821.843	6879.51
822.23	6736.3
822.616	6459.6
823.002	6190.18
823.388	6042.11
823.774	5733.86
824.16	5495.99
824.546	5462.01
824.931	5420.75
825.317	5374.63
825.703	5296.96
826.089	4974.14
826.474	5112.49
826.86	4928.02
827.245	4787.24
827.631	4765.4
828.016	4792.1
828.401	4826.08
828.787	4503.26
829.172	4428.01
829.557	4260.53
829.942	4224.13
830.327	4258.11
830.712	4059.07
831.097	3852.76
831.482	3915.87
831.867	3724.12
832.252	3704.7
832.636	3731.4
833.021	3457.12
833.406	3396.44
833.79	3510.52
834.175	3289.64
834.559	3277.51
834.944	3144.01
835.328	3054.2
835.713	2886.73
836.097	2702.26
836.481	2709.54
836.865	2656.14
837.249	2646.43
837.633	2508.08
838.017	2340.6
838.401	2410.99
838.785	2202.25
839.169	2085.74
839.553	2129.43
839.937	1993.51
840.32	1867.29
840.704	1694.96
841.087	1721.66
841.471	1614.86
841.854	1602.73
842.238	1576.03
842.621	1520.2
843.004	1401.27
843.388	1488.65
843.771	1430.39
844.154	1447.38
844.537	1444.96
844.92	1391.56
845.303	1427.97
845.686	1386.7
846.069	1311.46
846.452	1330.88
846.834	1294.47
847.217	1245.92
847.6	1294.47
847.982	1282.33
848.365	1136.7
848.748	1182.82
849.13	1141.55
849.512	1146.41
849.895	1085.73
850.277	1175.53
850.659	1102.72
851.041	1129.42
851.423	1143.98
851.806	957.08
852.188	1097.86
852.57	1085.73
852.951	1032.33
853.333	1044.46
853.715	998.35
854.097	1049.32
854.479	1010.48
854.86	925.53
855.242	930.38
855.623	884.27
856.005	796.89
856.386	860
856.768	745.92
857.149	755.62
857.53	607.56
857.911	728.93
858.292	665.82
858.674	697.37
859.055	651.25
859.436	607.56
859.817	580.86
860.197	593
860.578	578.44
860.959	471.64
861.34	471.64
861.72	503.19
862.101	415.81
862.482	483.78
862.862	464.36
863.243	372.12
863.623	364.84
864.003	389.11
864.384	483.78
864.764	362.41
865.144	406.1
865.524	301.73
865.904	340.57
866.284	398.82
866.664	396.4
867.044	335.72
867.424	440.09
867.804	272.61
868.183	306.59
868.563	258.04
868.943	367.27
869.322	258.04
869.702	279.89
870.081	323.58
870.461	357.56
870.84	347.85
871.22	338.14
871.599	262.9
871.978	253.19
872.357	219.21
872.736	275.03
873.115	243.48
873.494	204.65
873.873	199.79
874.252	245.91
874.631	241.05
875.01	287.17
875.388	199.79
875.767	168.24
876.146	226.49
876.524	253.19
876.903	214.35
877.281	177.95
877.66	173.09
878.038	160.96
878.416	214.35
878.794	177.95
879.173	151.25
879.551	221.64
879.929	209.5
880.307	202.22
880.685	156.1
881.063	170.66
881.441	180.37
881.818	163.38
882.196	156.1
882.574	129.4
882.951	204.65
883.329	202.22
883.707	214.35
884.084	134.26
884.461	231.34
884.839	173.09
885.216	146.39
885.593	163.38
885.971	185.23
886.348	180.37
886.725	143.96
887.102	136.68
887.479	131.83
887.856	182.8
888.233	100.27
888.609	151.25
888.986	238.63
889.363	129.4
889.74	156.1
890.116	109.98
890.493	119.69
890.869	119.69
891.246	194.94
891.622	126.97
891.998	139.11
892.375	190.08
892.751	219.21
893.127	136.68
893.503	165.81
893.879	146.39
894.255	100.27
894.631	197.36
895.007	170.66
895.383	158.53
895.759	153.67
896.134	112.41
896.51	83.28
896.886	83.28
897.261	141.54
897.637	192.51
898.012	134.26
898.388	156.1
898.763	134.26
899.138	139.11
899.514	109.98
899.889	117.27
900.264	124.55
900.639	141.54
901.014	122.12
901.389	105.13
901.764	126.97
902.139	112.41
902.513	85.71
902.888	175.52
903.263	124.55
903.638	153.67
904.012	126.97
904.387	126.97
904.761	97.85
905.136	192.51
905.51	131.83
905.884	90.57
906.259	170.66
906.633	134.26
907.007	85.71
907.381	168.24
907.755	180.37
908.129	148.82
908.503	156.1
908.877	117.27
909.251	102.7
909.624	131.83
909.998	114.84
910.372	105.13
910.745	88.14
911.119	131.83
911.492	122.12
911.866	170.66
912.239	136.68
912.612	107.56
912.986	71.15
913.359	76
913.732	141.54
914.105	100.27
914.478	73.58
914.851	109.98
915.224	194.94
915.597	141.54
915.97	207.07
916.343	204.65
916.715	136.68
917.088	114.84
917.461	56.58
917.833	131.83
918.206	197.36
918.578	177.95
918.951	83.28
919.323	134.26
919.695	158.53
920.067	190.08
920.44	76
920.812	168.24
921.184	143.96
921.556	158.53
921.928	156.1
922.3	102.7
922.672	90.57
923.043	114.84
923.415	139.11
923.787	148.82
924.158	107.56
924.53	109.98
924.901	158.53
925.273	95.42
925.644	56.58
926.016	153.67
926.387	141.54
926.758	126.97
927.129	90.57
927.5	175.52
927.872	139.11
928.243	71.15
928.613	158.53
928.984	90.57
929.355	134.26
929.726	119.69
930.097	180.37
930.467	73.58
930.838	107.56
931.209	117.27
931.579	76
931.95	228.92
932.32	29.89
932.69	109.98
933.061	139.11
933.431	61.44
933.801	126.97
934.171	180.37
934.541	114.84
934.911	109.98
935.281	158.53
935.651	165.81
936.021	122.12
936.391	187.65
936.761	102.7
937.13	197.36
937.5	112.41
937.87	80.86
938.239	119.69
938.609	114.84
938.978	90.57
939.347	163.38
939.717	170.66
940.086	76
940.455	114.84
940.824	114.84
941.193	180.37
941.562	165.81
941.931	177.95
942.3	211.93
942.669	78.43
943.038	141.54
943.407	182.8
943.775	170.66
944.144	129.4
944.513	148.82
944.881	56.58
945.25	158.53
945.618	131.83
945.986	214.35
946.355	124.55
946.723	141.54
947.091	168.24
947.459	92.99
947.827	126.97
948.195	151.25
948.563	153.67
948.931	165.81
949.299	131.83
949.667	76
950.035	85.71
950.402	85.71
950.77	51.73
951.138	139.11
951.505	141.54
951.873	139.11
952.24	102.7
952.607	76
952.975	185.23
953.342	187.65
953.709	158.53
954.076	100.27
954.443	136.68
954.81	160.96
955.177	102.7
955.544	88.14
955.911	129.4
956.278	134.26
956.645	158.53
957.012	124.55
957.378	190.08
957.745	194.94
958.111	168.24
958.478	153.67
958.844	190.08
959.211	177.95
959.577	112.41
959.943	134.26
960.309	141.54
960.675	153.67
961.042	92.99
961.408	202.22
961.774	129.4
962.139	163.38
962.505	151.25
962.871	61.44
963.237	102.7
963.603	122.12
963.968	160.96
964.334	146.39
964.699	139.11
965.065	143.96
965.43	114.84
965.796	160.96
966.161	105.13
966.526	76
966.891	163.38
967.256	66.29
967.622	182.8
967.987	141.54
968.352	92.99
968.716	102.7
969.081	160.96
969.446	153.67
969.811	141.54
970.176	97.85
970.54	119.69
970.905	163.38
971.269	136.68
971.634	71.15
971.998	114.84
972.363	117.27
972.727	80.86
973.091	46.88
973.455	163.38
973.819	107.56
974.183	59.01
974.547	156.1
974.911	124.55
975.275	97.85
975.639	194.94
976.003	124.55
976.367	192.51
976.73	139.11
977.094	107.56
977.458	158.53
977.821	92.99
978.185	107.56
978.548	148.82
978.911	168.24
979.275	148.82
979.638	126.97
980.001	182.8
980.364	151.25
980.727	109.98
981.09	139.11
981.453	122.12
981.816	168.24
982.179	170.66
982.542	131.83
982.905	136.68
983.267	190.08
983.63	175.52
983.992	90.57
984.355	73.58
984.717	185.23
985.08	143.96
985.442	122.12
985.804	49.3
986.167	177.95
986.529	139.11
986.891	80.86
987.253	112.41
987.615	148.82
987.977	216.78
988.339	54.16
988.701	136.68
989.062	190.08
989.424	51.73
989.786	153.67
990.147	160.96
990.509	141.54
990.87	136.68
991.232	190.08
991.593	134.26
991.955	119.69
992.316	131.83
992.677	126.97
993.038	134.26
993.399	168.24
993.76	88.14
994.121	102.7
994.482	61.44
994.843	122.12
995.204	105.13
995.565	146.39
995.926	153.67
996.286	139.11
996.647	124.55
997.007	97.85
997.368	73.58
997.728	126.97
998.089	105.13
998.449	146.39
998.809	100.27
999.169	148.82
999.53	122.12
999.89	88.14
1000.25	114.84
1000.61	143.96
1000.97	226.49
1001.329	97.85
1001.689	102.7
1002.049	92.99
1002.409	148.82
1002.768	73.58
1003.128	105.13
1003.487	141.54
1003.847	117.27
1004.206	151.25
1004.566	170.66
1004.925	134.26
1005.284	90.57
1005.643	190.08
1006.003	165.81
1006.362	126.97
1006.721	114.84
1007.08	88.14
1007.438	71.15
1007.797	194.94
1008.156	151.25
1008.515	160.96
1008.874	199.79
1009.232	105.13
1009.591	59.01
1009.949	85.71
1010.308	80.86
1010.666	151.25
1011.024	109.98
1011.383	34.74
1011.741	76
1012.099	143.96
1012.457	194.94
1012.815	102.7
1013.173	119.69
1013.531	197.36
1013.889	80.86
1014.247	143.96
1014.605	119.69
1014.962	85.71
1015.32	92.99
1015.678	71.15
1016.035	85.71
1016.393	143.96
1016.75	92.99
1017.107	122.12
1017.465	185.23
1017.822	122.12
1018.179	119.69
1018.536	109.98
1018.894	141.54
1019.251	160.96
1019.608	124.55
1019.964	139.11
1020.321	109.98
1020.678	148.82
1021.035	168.24
1021.392	170.66
1021.748	109.98
1022.105	139.11
1022.461	153.67
1022.818	134.26
1023.174	112.41
1023.531	129.4
1023.887	153.67
1024.243	177.95
1024.599	160.96
1024.955	156.1
1025.311	112.41
1025.667	83.28
1026.023	117.27
1026.379	76
1026.735	146.39
1027.091	85.71
1027.447	209.5
