189.514	36.56
189.973	36.56
190.431	36.56
190.889	36.56
191.348	-67.81
191.806	-21.69
192.264	-16.84
192.722	-36.26
193.18	9.86
193.638	-24.12
194.096	-16.84
194.554	-28.97
195.012	41.41
195.47	43.84
195.928	-4.7
196.385	12.29
196.843	-41.11
197.301	-36.26
197.758	46.27
198.216	55.98
198.674	31.71
199.131	-36.26
199.589	89.96
200.046	58.41
200.503	46.27
200.961	68.11
201.418	109.38
201.875	29.28
202.332	123.94
202.79	85.1
203.247	138.5
203.704	143.36
204.161	170.06
204.618	109.38
205.075	199.18
205.532	123.94
205.989	140.93
206.445	128.79
206.902	131.22
207.359	153.07
207.816	136.08
208.272	162.78
208.729	121.51
209.185	119.09
209.642	111.8
210.098	75.4
210.555	89.96
211.011	92.39
211.467	109.38
211.924	162.78
212.38	121.51
212.836	114.23
213.292	182.19
213.748	138.5
214.204	174.91
214.66	97.24
215.116	140.93
215.572	155.49
216.028	155.49
216.484	92.39
216.94	128.79
217.396	182.19
217.851	179.77
218.307	104.52
218.763	121.51
219.218	148.21
219.674	136.08
220.129	143.36
220.585	184.62
221.04	102.1
221.496	136.08
221.951	196.76
222.406	109.38
222.861	157.92
223.317	63.26
223.772	75.4
224.227	128.79
224.682	114.23
225.137	150.64
225.592	136.08
226.047	126.37
226.502	60.83
226.957	201.61
227.411	102.1
227.866	102.1
228.321	196.76
228.776	153.07
229.23	121.51
229.685	155.49
230.139	153.07
230.594	196.76
231.048	211.32
231.503	189.48
231.957	68.11
232.411	106.95
232.865	104.52
233.32	70.54
233.774	106.95
234.228	97.24
234.682	150.64
235.136	94.81
235.59	123.94
236.044	165.2
236.498	201.61
236.952	167.63
237.406	70.54
237.86	136.08
238.313	204.04
238.767	184.62
239.221	121.51
239.674	116.66
240.128	111.8
240.581	196.76
241.035	240.45
241.488	136.08
241.942	97.24
242.395	70.54
242.848	170.06
243.301	106.95
243.755	133.65
244.208	53.55
244.661	213.75
245.114	116.66
245.567	53.55
246.02	102.1
246.473	145.79
246.926	116.66
247.379	53.55
247.832	106.95
248.284	160.35
248.737	116.66
249.19	148.21
249.642	177.34
250.095	177.34
250.547	189.48
251	167.63
251.452	165.2
251.905	140.93
252.357	116.66
252.81	187.05
253.262	145.79
253.714	131.22
254.166	189.48
254.618	177.34
255.07	133.65
255.523	167.63
255.975	111.8
256.427	80.25
256.878	131.22
257.33	155.49
257.782	155.49
258.234	165.2
258.686	194.33
259.137	109.38
259.589	184.62
260.041	140.93
260.492	104.52
260.944	257.44
261.395	206.47
261.847	184.62
262.298	128.79
262.749	174.91
263.201	174.91
263.652	153.07
264.103	89.96
264.554	184.62
265.005	119.09
265.457	94.81
265.908	140.93
266.359	167.63
266.809	167.63
267.26	157.92
267.711	80.25
268.162	85.1
268.613	114.23
269.064	140.93
269.514	92.39
269.965	153.07
270.415	121.51
270.866	133.65
271.316	123.94
271.767	145.79
272.217	233.17
272.668	92.39
273.118	109.38
273.568	123.94
274.019	150.64
274.469	75.4
274.919	208.89
275.369	191.9
275.819	228.31
276.269	97.24
276.719	148.21
277.169	170.06
277.619	235.59
278.069	172.48
278.518	145.79
278.968	131.22
279.418	109.38
279.867	165.2
280.317	143.36
280.767	99.67
281.216	155.49
281.666	172.48
282.115	172.48
282.564	182.19
283.014	172.48
283.463	109.38
283.912	172.48
284.361	99.67
284.811	157.92
285.26	189.48
285.709	131.22
286.158	165.2
286.607	160.35
287.056	182.19
287.505	199.18
287.953	143.36
288.402	140.93
288.851	138.5
289.3	179.77
289.748	143.36
290.197	121.51
290.646	182.19
291.094	68.11
291.543	133.65
291.991	131.22
292.439	80.25
292.888	128.79
293.336	165.2
293.784	172.48
294.233	174.91
294.681	153.07
295.129	157.92
295.577	153.07
296.025	123.94
296.473	187.05
296.921	191.9
297.369	157.92
297.817	211.32
298.264	216.17
298.712	174.91
299.16	106.95
299.608	165.2
300.055	213.75
300.503	155.49
300.95	204.04
301.398	121.51
301.845	70.54
302.293	119.09
302.74	172.48
303.187	162.78
303.635	111.8
304.082	87.53
304.529	155.49
304.976	199.18
305.423	80.25
305.87	123.94
306.317	136.08
306.764	143.36
307.211	106.95
307.658	119.09
308.105	136.08
308.552	177.34
308.998	177.34
309.445	133.65
309.892	160.35
310.338	128.79
310.785	138.5
311.231	189.48
311.678	145.79
312.124	94.81
312.571	187.05
313.017	109.38
313.463	155.49
313.909	153.07
314.356	160.35
314.802	145.79
315.248	140.93
315.694	97.24
316.14	140.93
316.586	153.07
317.032	145.79
317.478	116.66
317.923	75.4
318.369	148.21
318.815	165.2
319.261	165.2
319.706	138.5
320.152	116.66
320.597	92.39
321.043	148.21
321.488	204.04
321.934	119.09
322.379	111.8
322.824	167.63
323.27	116.66
323.715	165.2
324.16	94.81
324.605	145.79
325.05	148.21
325.495	145.79
325.94	123.94
326.385	182.19
326.83	150.64
327.275	148.21
327.72	131.22
328.165	97.24
328.61	172.48
329.054	150.64
329.499	145.79
329.943	131.22
330.388	119.09
330.832	70.54
331.277	153.07
331.721	136.08
332.166	111.8
332.61	199.18
333.054	172.48
333.499	126.37
333.943	126.37
334.387	126.37
334.831	85.1
335.275	102.1
335.719	155.49
336.163	121.51
336.607	153.07
337.051	75.4
337.495	92.39
337.938	114.23
338.382	109.38
338.826	116.66
339.269	167.63
339.713	121.51
340.157	68.11
340.6	119.09
341.044	143.36
341.487	121.51
341.93	99.67
342.374	177.34
342.817	160.35
343.26	153.07
343.703	131.22
344.146	160.35
344.59	82.68
345.033	189.48
345.476	162.78
345.919	160.35
346.361	148.21
346.804	187.05
347.247	160.35
347.69	155.49
348.133	140.93
348.575	111.8
349.018	104.52
349.461	177.34
349.903	111.8
350.346	114.23
350.788	148.21
351.23	34.13
351.673	63.26
352.115	196.76
352.557	157.92
353	170.06
353.442	213.75
353.884	160.35
354.326	128.79
354.768	223.46
355.21	216.17
355.652	201.61
356.094	111.8
356.536	123.94
356.978	170.06
357.419	119.09
357.861	109.38
358.303	157.92
358.744	170.06
359.186	182.19
359.627	187.05
360.069	208.89
360.51	184.62
360.952	119.09
361.393	165.2
361.834	111.8
362.276	150.64
362.717	191.9
363.158	170.06
363.599	201.61
364.04	145.79
364.481	170.06
364.922	189.48
365.363	184.62
365.804	119.09
366.245	194.33
366.686	179.77
367.126	140.93
367.567	267.15
368.008	191.9
368.448	119.09
368.889	187.05
369.33	196.76
369.77	109.38
370.21	116.66
370.651	170.06
371.091	160.35
371.531	121.51
371.972	196.76
372.412	138.5
372.852	109.38
373.292	204.04
373.732	160.35
374.172	153.07
374.612	133.65
375.052	116.66
375.492	184.62
375.932	174.91
376.372	133.65
376.811	189.48
377.251	114.23
377.691	131.22
378.13	126.37
378.57	155.49
379.009	143.36
379.449	179.77
379.888	116.66
380.328	123.94
380.767	150.64
381.206	148.21
381.645	165.2
382.085	196.76
382.524	116.66
382.963	174.91
383.402	102.1
383.841	165.2
384.28	187.05
384.719	191.9
385.158	174.91
385.596	94.81
386.035	140.93
386.474	179.77
386.913	145.79
387.351	70.54
387.79	172.48
388.228	126.37
388.667	153.07
389.105	184.62
389.544	155.49
389.982	153.07
390.42	174.91
390.859	114.23
391.297	60.83
391.735	145.79
392.173	121.51
392.611	138.5
393.049	199.18
393.487	157.92
393.925	128.79
394.363	182.19
394.801	221.03
395.239	150.64
395.676	97.24
396.114	94.81
396.552	167.63
396.989	126.37
397.427	102.1
397.864	150.64
398.302	136.08
398.739	89.96
399.177	111.8
399.614	160.35
400.051	148.21
400.488	223.46
400.926	133.65
401.363	119.09
401.8	102.1
402.237	94.81
402.674	126.37
403.111	177.34
403.548	143.36
403.985	179.77
404.421	126.37
404.858	177.34
405.295	155.49
405.732	167.63
406.168	106.95
406.605	97.24
407.041	109.38
407.478	136.08
407.914	162.78
408.351	148.21
408.787	97.24
409.223	233.17
409.66	53.55
410.096	89.96
410.532	77.82
410.968	123.94
411.404	150.64
411.84	116.66
412.276	126.37
412.712	201.61
413.148	167.63
413.584	121.51
414.02	106.95
414.455	148.21
414.891	225.88
415.327	126.37
415.762	77.82
416.198	153.07
416.633	102.1
417.069	111.8
417.504	131.22
417.94	182.19
418.375	155.49
418.81	150.64
419.245	157.92
419.681	131.22
420.116	106.95
420.551	136.08
420.986	187.05
421.421	160.35
421.856	157.92
422.291	174.91
422.726	131.22
423.16	131.22
423.595	157.92
424.03	121.51
424.464	145.79
424.899	126.37
425.334	155.49
425.768	116.66
426.203	123.94
426.637	167.63
427.071	182.19
427.506	126.37
427.94	140.93
428.374	196.76
428.809	211.32
429.243	116.66
429.677	126.37
430.111	133.65
430.545	119.09
430.979	121.51
431.413	97.24
431.847	126.37
432.28	114.23
432.714	106.95
433.148	148.21
433.582	133.65
434.015	170.06
434.449	121.51
434.882	157.92
435.316	140.93
435.749	133.65
436.183	155.49
436.616	155.49
437.049	138.5
437.483	194.33
437.916	157.92
438.349	216.17
438.782	174.91
439.215	46.27
439.648	126.37
440.081	228.31
440.514	196.76
440.947	150.64
441.38	140.93
441.813	157.92
442.245	116.66
442.678	106.95
443.111	123.94
443.543	172.48
443.976	165.2
444.408	170.06
444.841	92.39
445.273	121.51
445.705	150.64
446.138	148.21
446.57	128.79
447.002	153.07
447.434	191.9
447.867	172.48
448.299	138.5
448.731	174.91
449.163	75.4
449.595	133.65
450.026	157.92
450.458	194.33
450.89	187.05
451.322	179.77
451.754	208.89
452.185	89.96
452.617	206.47
453.048	257.44
453.48	138.5
453.911	179.77
454.343	223.46
454.774	157.92
455.205	162.78
455.637	157.92
456.068	172.48
456.499	194.33
456.93	65.69
457.361	179.77
457.792	155.49
458.223	174.91
458.654	167.63
459.085	145.79
459.516	221.03
459.947	179.77
460.378	230.74
460.808	208.89
461.239	133.65
461.669	136.08
462.1	138.5
462.531	167.63
462.961	204.04
463.391	111.8
463.822	182.19
464.252	126.37
464.682	187.05
465.113	182.19
465.543	223.46
465.973	267.15
466.403	119.09
466.833	153.07
467.263	119.09
467.693	133.65
468.123	133.65
468.553	201.61
468.983	196.76
469.412	99.67
469.842	165.2
470.272	123.94
470.701	148.21
471.131	150.64
471.56	148.21
471.99	177.34
472.419	204.04
472.849	172.48
473.278	99.67
473.707	133.65
474.136	242.87
474.566	218.6
474.995	206.47
475.424	155.49
475.853	179.77
476.282	174.91
476.711	157.92
477.14	172.48
477.569	160.35
477.997	126.37
478.426	201.61
478.855	136.08
479.283	213.75
479.712	172.48
480.141	116.66
480.569	131.22
480.998	104.52
481.426	138.5
481.854	184.62
482.283	177.34
482.711	148.21
483.139	177.34
483.567	162.78
483.995	204.04
484.424	174.91
484.852	102.1
485.28	123.94
485.708	191.9
486.135	136.08
486.563	170.06
486.991	167.63
487.419	143.36
487.847	133.65
488.274	177.34
488.702	223.46
489.129	157.92
489.557	99.67
489.984	162.78
490.412	128.79
490.839	155.49
491.266	177.34
491.694	148.21
492.121	167.63
492.548	194.33
492.975	106.95
493.402	170.06
493.829	150.64
494.256	191.9
494.683	213.75
495.11	94.81
495.537	182.19
495.964	97.24
496.39	133.65
496.817	157.92
497.244	206.47
497.67	150.64
498.097	211.32
498.523	128.79
498.95	201.61
499.376	153.07
499.803	179.77
500.229	157.92
500.655	138.5
501.081	155.49
501.508	213.75
501.934	165.2
502.36	155.49
502.786	104.52
503.212	157.92
503.638	172.48
504.064	165.2
504.489	177.34
504.915	143.36
505.341	162.78
505.767	194.33
506.192	97.24
506.618	174.91
507.043	165.2
507.469	94.81
507.894	131.22
508.32	172.48
508.745	140.93
509.17	174.91
509.596	160.35
510.021	99.67
510.446	114.23
510.871	136.08
511.296	179.77
511.721	126.37
512.146	106.95
512.571	143.36
512.996	128.79
513.421	155.49
513.845	126.37
514.27	150.64
514.695	162.78
515.119	165.2
515.544	92.39
515.969	155.49
516.393	99.67
516.817	143.36
517.242	102.1
517.666	109.38
518.09	157.92
518.515	104.52
518.939	72.97
519.363	330.25
519.787	148.21
520.211	153.07
520.635	170.06
521.059	104.52
521.483	170.06
521.907	94.81
522.331	136.08
522.754	216.17
523.178	102.1
523.602	43.84
524.025	133.65
524.449	94.81
524.872	97.24
525.296	114.23
525.719	140.93
526.143	233.17
526.566	116.66
526.989	167.63
527.412	196.76
527.836	106.95
528.259	170.06
528.682	206.47
529.105	150.64
529.528	106.95
529.951	131.22
530.374	206.47
530.796	148.21
531.219	157.92
531.642	138.5
532.065	155.49
532.487	182.19
532.91	199.18
533.332	162.78
533.755	177.34
534.177	133.65
534.6	179.77
535.022	172.48
535.444	136.08
535.867	208.89
536.289	257.44
536.711	123.94
537.133	182.19
537.555	145.79
537.977	102.1
538.399	114.23
538.821	191.9
539.243	184.62
539.665	208.89
540.086	155.49
540.508	167.63
540.93	201.61
541.351	182.19
541.773	116.66
542.195	140.93
542.616	189.48
543.037	230.74
543.459	109.38
543.88	170.06
544.301	128.79
544.723	182.19
545.144	179.77
545.565	114.23
545.986	211.32
546.407	157.92
546.828	182.19
547.249	143.36
547.67	104.52
548.091	170.06
548.512	165.2
548.932	206.47
549.353	201.61
549.774	136.08
550.194	145.79
550.615	162.78
551.035	150.64
551.456	165.2
551.876	187.05
552.296	160.35
552.717	150.64
553.137	119.09
553.557	102.1
553.977	165.2
554.397	189.48
554.817	109.38
555.237	157.92
555.657	182.19
556.077	133.65
556.497	72.97
556.917	157.92
557.337	138.5
557.756	116.66
558.176	97.24
558.596	199.18
559.015	167.63
559.435	172.48
559.854	102.1
560.274	165.2
560.693	128.79
561.112	167.63
561.532	157.92
561.951	191.9
562.37	133.65
562.789	89.96
563.208	109.38
563.627	155.49
564.046	143.36
564.465	126.37
564.884	89.96
565.303	126.37
565.722	187.05
566.14	187.05
566.559	150.64
566.978	114.23
567.396	165.2
567.815	194.33
568.233	162.78
568.652	155.49
569.07	206.47
569.489	123.94
569.907	97.24
570.325	140.93
570.743	148.21
571.161	182.19
571.58	126.37
571.998	123.94
572.416	170.06
572.833	153.07
573.251	211.32
573.669	126.37
574.087	153.07
574.505	208.89
574.922	121.51
575.34	143.36
575.758	196.76
576.175	123.94
576.593	153.07
577.01	106.95
577.428	238.02
577.845	1694.35
578.262	267.15
578.68	145.79
579.097	140.93
579.514	145.79
579.931	114.23
580.348	119.09
580.765	187.05
581.182	189.48
581.599	218.6
582.016	85.1
582.433	208.89
582.849	138.5
583.266	172.48
583.683	162.78
584.099	157.92
584.516	201.61
584.933	162.78
585.349	172.48
585.765	121.51
586.182	60.83
586.598	150.64
587.014	150.64
587.431	138.5
587.847	126.37
588.263	128.79
588.679	133.65
589.095	89.96
589.511	223.46
589.927	184.62
590.343	194.33
590.759	162.78
591.174	160.35
591.59	184.62
592.006	160.35
592.421	138.5
592.837	221.03
593.252	211.32
593.668	89.96
594.083	121.51
594.499	167.63
594.914	145.79
595.329	150.64
595.745	170.06
596.16	80.25
596.575	133.65
596.99	99.67
597.405	123.94
597.82	140.93
598.235	145.79
598.65	148.21
599.065	111.8
599.479	138.5
599.894	145.79
600.309	179.77
600.724	216.17
601.138	167.63
601.553	184.62
601.967	216.17
602.382	170.06
602.796	99.67
603.21	211.32
603.625	165.2
604.039	150.64
604.453	165.2
604.867	238.02
605.281	82.68
605.695	102.1
606.109	155.49
606.523	189.48
606.937	162.78
607.351	247.73
607.765	133.65
608.178	182.19
608.592	160.35
609.006	153.07
609.419	170.06
609.833	182.19
610.246	150.64
610.66	177.34
611.073	123.94
611.487	182.19
611.9	196.76
612.313	94.81
612.726	153.07
613.139	150.64
613.553	208.89
613.966	208.89
614.379	218.6
614.792	199.18
615.204	126.37
615.617	177.34
616.03	165.2
616.443	165.2
616.856	145.79
617.268	160.35
617.681	162.78
618.093	111.8
618.506	162.78
618.918	187.05
619.331	160.35
619.743	182.19
620.155	189.48
620.568	140.93
620.98	138.5
621.392	97.24
621.804	157.92
622.216	174.91
622.628	167.63
623.04	136.08
623.452	140.93
623.864	162.78
624.276	126.37
624.687	121.51
625.099	172.48
625.511	157.92
625.922	225.88
626.334	153.07
626.745	150.64
627.157	102.1
627.568	85.1
627.979	72.97
628.391	114.23
628.802	153.07
629.213	204.04
629.624	199.18
630.035	119.09
630.446	119.09
630.857	216.17
631.268	172.48
631.679	114.23
632.09	153.07
632.501	213.75
632.912	138.5
633.322	196.76
633.733	128.79
634.144	128.79
634.554	182.19
634.965	213.75
635.375	140.93
635.785	131.22
636.196	165.2
636.606	153.07
637.016	153.07
637.427	170.06
637.837	143.36
638.247	250.16
638.657	82.68
639.067	187.05
639.477	145.79
639.887	155.49
640.297	184.62
640.706	106.95
641.116	167.63
641.526	165.2
641.935	85.1
642.345	85.1
642.755	94.81
643.164	184.62
643.573	165.2
643.983	167.63
644.392	138.5
644.801	119.09
645.211	172.48
645.62	97.24
646.029	126.37
646.438	179.77
646.847	170.06
647.256	153.07
647.665	148.21
648.074	140.93
648.483	162.78
648.892	80.25
649.3	155.49
649.709	99.67
650.118	189.48
650.526	68.11
650.935	99.67
651.343	150.64
651.752	208.89
652.16	167.63
652.568	160.35
652.977	128.79
653.385	177.34
653.793	148.21
654.201	157.92
654.609	245.3
655.017	208.89
655.425	123.94
655.833	170.06
656.241	153.07
656.649	155.49
657.057	218.6
657.464	191.9
657.872	143.36
658.28	153.07
658.687	157.92
659.095	123.94
659.502	172.48
659.91	211.32
660.317	182.19
660.724	119.09
661.132	150.64
661.539	218.6
661.946	196.76
662.353	150.64
662.76	208.89
663.167	201.61
663.574	187.05
663.981	167.63
664.388	70.54
664.795	148.21
665.202	167.63
665.608	150.64
666.015	123.94
666.422	157.92
666.828	145.79
667.235	172.48
667.641	116.66
668.047	128.79
668.454	165.2
668.86	121.51
669.266	148.21
669.673	121.51
670.079	126.37
670.485	143.36
670.891	126.37
671.297	126.37
671.703	109.38
672.109	114.23
672.515	145.79
672.92	121.51
673.326	119.09
673.732	131.22
674.138	123.94
674.543	131.22
674.949	128.79
675.354	140.93
675.76	65.69
676.165	89.96
676.57	157.92
676.976	179.77
677.381	148.21
677.786	165.2
678.191	145.79
678.596	133.65
679.001	77.82
679.406	170.06
679.811	126.37
680.216	208.89
680.621	138.5
681.026	131.22
681.43	97.24
681.835	138.5
682.24	170.06
682.644	85.1
683.049	187.05
683.453	123.94
683.858	177.34
684.262	60.83
684.667	128.79
685.071	208.89
685.475	143.36
685.879	119.09
686.283	167.63
686.687	94.81
687.091	70.54
687.495	228.31
687.899	179.77
688.303	187.05
688.707	155.49
689.111	165.2
689.514	182.19
689.918	204.04
690.322	131.22
690.725	206.47
691.129	133.65
691.532	184.62
691.936	150.64
692.339	160.35
692.742	160.35
693.146	157.92
693.549	119.09
693.952	121.51
694.355	133.65
694.758	167.63
695.161	213.75
695.564	179.77
695.967	167.63
696.37	106.95
696.773	138.5
697.175	119.09
697.578	116.66
697.981	136.08
698.383	196.76
698.786	153.07
699.188	111.8
699.591	179.77
699.993	167.63
700.395	184.62
700.798	160.35
701.2	199.18
701.602	138.5
702.004	191.9
702.406	196.76
702.808	172.48
703.21	150.64
703.612	194.33
704.014	211.32
704.416	174.91
704.818	170.06
705.219	218.6
705.621	177.34
706.023	172.48
706.424	194.33
706.826	191.9
707.227	114.23
707.629	123.94
708.03	213.75
708.431	189.48
708.832	242.87
709.234	172.48
709.635	199.18
710.036	196.76
710.437	162.78
710.838	172.48
711.239	238.02
711.64	228.31
712.041	238.02
712.441	189.48
712.842	191.9
713.243	174.91
713.643	184.62
714.044	136.08
714.445	184.62
714.845	160.35
715.246	238.02
715.646	216.17
716.046	213.75
716.447	196.76
716.847	184.62
717.247	240.45
717.647	187.05
718.047	228.31
718.447	281.71
718.847	157.92
719.247	165.2
719.647	194.33
720.047	187.05
720.446	213.75
720.846	225.88
721.246	291.42
721.645	213.75
722.045	194.33
722.444	213.75
722.844	247.73
723.243	325.4
723.643	238.02
724.042	298.7
724.441	262.29
724.84	279.28
725.24	325.4
725.639	267.15
726.038	347.24
726.437	255.01
726.836	252.58
727.234	301.13
727.633	320.55
728.032	301.13
728.431	381.23
728.83	322.97
729.228	410.35
729.627	512.3
730.025	444.33
730.424	407.93
730.822	497.73
731.22	473.46
731.619	572.98
732.017	657.93
732.415	667.64
732.813	653.07
733.212	667.64
733.61	764.73
734.008	963.76
734.406	1026.87
734.803	1111.82
735.201	1189.49
735.599	1155.51
735.997	1167.65
736.395	1206.48
736.792	1395.8
737.19	1441.92
737.587	1694.35
737.985	1745.32
738.382	1791.44
738.78	1638.53
739.177	1839.99
739.574	2157.95
739.971	2471.06
740.369	2478.35
740.766	2585.14
741.163	2308.44
741.56	2250.19
741.957	2539.03
742.354	2895.83
742.751	3060.88
743.147	3109.42
743.544	3002.63
743.941	2869.13
744.338	2978.35
744.734	3570.6
745.131	4138.57
745.527	4733.24
745.924	4869.16
746.32	4449.25
746.716	4119.15
747.113	4284.2
747.509	5213.83
747.905	6119.18
748.301	7172.59
748.697	7391.04
749.093	6898.32
749.489	6087.63
749.885	6029.37
750.281	6946.86
750.677	7956.59
751.073	9621.66
751.468	10611.97
751.864	10359.54
752.26	8963.88
752.655	8325.52
753.051	8233.29
753.446	9696.9
753.842	11162.95
754.237	12905.69
754.632	13073.17
755.028	12548.89
755.423	11121.68
755.818	9840.11
756.213	9711.47
756.608	10289.15
757.003	12250.34
757.398	14027.07
757.793	14090.18
758.188	13260.07
758.583	12070.73
758.977	10534.3
759.372	10325.56
759.767	12034.32
760.161	14684.85
760.556	18129.07
760.95	20286.88
761.345	20961.64
761.739	19010.16
762.133	16944.59
762.527	15886.32
762.922	16233.41
763.316	18405.78
763.71	21600
764.104	25371.91
764.498	28503.02
764.892	28381.66
765.286	26185.03
765.68	23000.51
766.073	20631.54
766.467	19366.96
766.861	22068.46
767.255	26925.33
767.648	31971.52
768.042	35653.62
768.435	37685.2
768.829	36872.08
769.222	33391.45
769.615	29544.3
770.008	25129.18
770.402	24772.38
770.795	27010.28
771.188	31352.58
771.581	35607.5
771.974	38350.26
772.367	38379.39
772.76	37032.28
773.153	32738.53
773.545	28490.89
773.938	25549.09
774.331	24007.81
774.724	24692.28
775.116	29032.16
775.509	35078.37
775.901	41833.33
776.294	45966.89
776.686	47197.49
777.078	45238.72
777.471	42221.68
777.863	37401.22
778.255	33862.33
778.647	31765.21
779.039	33233.68
779.431	36692.47
779.823	43668.31
780.215	49112.57
780.607	52360.19
780.999	54772.85
781.39	53622.35
781.782	51702.41
782.174	46520.29
782.565	41032.34
782.957	36301.69
783.348	34721.57
783.74	36005.57
784.131	39753.2
784.522	45340.66
784.914	48670.81
785.305	52229.12
785.696	53884.49
786.087	54064.1
786.478	51537.36
786.869	45634.36
787.26	39838.15
787.651	33694.85
788.042	29272.45
788.433	25803.95
788.823	24604.9
789.214	26209.3
789.605	28551.57
789.995	31896.28
790.386	34845.35
790.776	37355.1
791.167	37772.58
791.557	38092.98
791.948	36677.91
792.338	32842.9
792.728	29580.71
793.118	25828.22
793.508	23750.52
793.898	22551.47
794.288	23388.87
794.678	25617.06
795.068	29799.16
795.458	33956.99
795.848	38391.53
796.238	41039.63
796.627	41347.88
797.017	43724.13
797.406	43357.62
797.796	39728.93
798.185	36663.34
798.575	32845.32
798.964	28272.44
799.354	25704.44
799.743	23626.73
800.132	22966.53
800.521	23485.95
800.91	25731.13
801.299	28835.55
801.688	33260.38
802.077	37704.62
802.466	41923.13
802.855	44605.21
803.244	45090.66
803.633	44753.28
804.021	42840.62
804.41	39947.38
804.799	36182.75
805.187	31097.72
805.576	26799.11
805.964	22769.92
806.352	19330.55
806.741	17349.94
807.129	16243.12
807.517	16612.06
807.905	17903.34
808.293	20825.72
808.681	23515.08
809.069	27172.9
809.457	32495.8
809.845	35660.9
810.233	37338.11
810.621	39260.47
811.009	38915.81
811.396	38957.07
811.784	37359.96
812.171	34935.16
812.559	32024.92
812.946	28121.95
813.334	24794.23
813.721	21478.64
814.108	18976.18
814.496	17204.3
814.883	16044.09
815.27	16410.6
815.657	16840.22
816.044	17818.39
816.431	19667.93
816.818	22029.62
817.205	24575.78
817.592	27864.66
817.979	30177.81
818.365	31796.76
818.752	32476.39
819.139	33267.66
819.525	33607.47
819.912	33284.65
820.298	32478.81
820.685	30279.75
821.071	27978.74
821.457	25182.58
821.843	22619.44
822.23	20180.08
822.616	17342.65
823.002	14675.14
823.388	12524.62
823.774	10813.43
824.16	9235.73
824.546	8505.14
824.931	7655.61
825.317	7667.75
825.703	8043.97
826.089	8267.27
826.474	8864.37
826.86	9752.73
827.245	10541.58
827.631	11837.71
828.016	12495.49
828.401	13415.41
828.787	14260.08
829.172	14573.19
829.557	14854.75
829.942	15226.12
830.327	15141.16
830.712	15692.14
831.097	14784.36
831.482	14495.52
831.867	13866.87
832.252	13568.32
832.636	12905.69
833.021	12027.04
833.406	11245.47
833.79	10607.11
834.175	9750.3
834.559	9087.67
834.944	8075.52
835.328	7357.06
835.713	6776.96
836.097	6029.37
836.481	5451.69
836.865	4881.3
837.249	4480.8
837.633	4099.73
838.017	3747.78
838.401	3546.32
838.785	3145.83
839.169	3070.59
839.553	2995.34
839.937	2881.26
840.32	2721.07
840.704	2750.19
841.087	2806.02
841.471	2835.15
841.854	2985.64
842.238	2951.65
842.621	3046.32
843.004	3293.89
843.388	3473.51
843.771	3565.74
844.154	3655.55
844.537	3827.88
844.92	3920.12
845.303	4009.92
845.686	4107.01
846.069	4403.13
846.452	4323.03
846.834	4454.1
847.217	4325.46
847.6	4267.21
847.982	4201.67
848.365	3924.97
848.748	4107.01
849.13	3946.82
849.512	4026.91
849.895	3924.97
850.277	3878.85
850.659	3813.32
851.041	3796.33
851.423	3733.22
851.806	3750.21
852.188	3682.25
852.57	3604.58
852.951	3366.71
853.333	3412.83
853.715	3077.87
854.097	3111.85
854.479	2852.14
854.86	2684.66
855.242	2403.1
855.623	2403.1
856.005	2259.9
856.386	2155.53
856.768	2056.01
857.149	1869.11
857.53	1806.01
857.911	1628.82
858.292	1553.57
858.674	1480.76
859.055	1424.93
859.436	1289.01
859.817	1245.32
860.197	1167.65
860.578	1106.97
860.959	1034.15
861.34	937.06
861.72	997.74
862.101	898.22
862.482	873.95
862.862	832.69
863.243	873.95
863.623	793.85
864.003	682.2
864.384	745.31
864.764	696.76
865.144	645.79
865.524	655.5
865.904	679.77
866.284	655.5
866.664	543.85
867.044	560.84
867.424	592.39
867.804	529.29
868.183	434.62
868.563	410.35
868.943	468.61
869.322	412.78
869.702	422.49
870.081	417.63
870.461	434.62
870.84	332.68
871.22	378.8
871.599	434.62
871.978	412.78
872.357	364.24
872.736	352.1
873.115	386.08
873.494	349.67
873.873	279.28
874.252	332.68
874.631	298.7
875.01	250.16
875.388	233.17
875.767	349.67
876.146	279.28
876.524	242.87
876.903	247.73
877.281	225.88
877.66	191.9
878.038	255.01
878.416	235.59
878.794	272
879.173	276.86
879.551	148.21
879.929	170.06
880.307	228.31
880.685	194.33
881.063	184.62
881.441	182.19
881.818	208.89
882.196	179.77
882.574	213.75
882.951	196.76
883.329	194.33
883.707	245.3
884.084	211.32
884.461	223.46
884.839	204.04
885.216	179.77
885.593	140.93
885.971	221.03
886.348	131.22
886.725	170.06
887.102	123.94
887.479	238.02
887.856	252.58
888.233	162.78
888.609	213.75
888.986	204.04
889.363	104.52
889.74	267.15
890.116	218.6
890.493	114.23
890.869	153.07
891.246	155.49
891.622	133.65
891.998	155.49
892.375	140.93
892.751	128.79
893.127	111.8
893.503	160.35
893.879	155.49
894.255	174.91
894.631	204.04
895.007	206.47
895.383	143.36
895.759	182.19
896.134	145.79
896.51	121.51
896.886	97.24
897.261	143.36
897.637	145.79
898.012	143.36
898.388	162.78
898.763	136.08
899.138	140.93
899.514	99.67
899.889	116.66
900.264	68.11
900.639	157.92
901.014	126.37
901.389	68.11
901.764	148.21
902.139	153.07
902.513	153.07
902.888	140.93
903.263	111.8
903.638	143.36
904.012	89.96
904.387	104.52
904.761	109.38
905.136	138.5
905.51	68.11
905.884	187.05
906.259	85.1
906.633	204.04
907.007	102.1
907.381	160.35
907.755	199.18
908.129	89.96
908.503	55.98
908.877	89.96
909.251	148.21
909.624	184.62
909.998	116.66
910.372	140.93
910.745	119.09
911.119	204.04
911.492	162.78
911.866	150.64
912.239	143.36
912.612	106.95
912.986	136.08
913.359	131.22
913.732	102.1
914.105	133.65
914.478	138.5
914.851	145.79
915.224	109.38
915.597	179.77
915.97	106.95
916.343	136.08
916.715	111.8
917.088	140.93
917.461	140.93
917.833	111.8
918.206	140.93
918.578	121.51
918.951	65.69
919.323	119.09
919.695	131.22
920.067	165.2
920.44	131.22
920.812	138.5
921.184	167.63
921.556	138.5
921.928	89.96
922.3	140.93
922.672	153.07
923.043	111.8
923.415	221.03
923.787	43.84
924.158	133.65
924.53	189.48
924.901	157.92
925.273	148.21
925.644	123.94
926.016	153.07
926.387	123.94
926.758	145.79
927.129	155.49
927.5	55.98
927.872	148.21
928.243	138.5
928.613	128.79
928.984	150.64
929.355	131.22
929.726	68.11
930.097	177.34
930.467	143.36
930.838	187.05
931.209	92.39
931.579	106.95
931.95	119.09
932.32	80.25
932.69	140.93
933.061	160.35
933.431	114.23
933.801	165.2
934.171	126.37
934.541	102.1
934.911	80.25
935.281	119.09
935.651	51.12
936.021	194.33
936.391	36.56
936.761	82.68
937.13	99.67
937.5	106.95
937.87	136.08
938.239	111.8
938.609	114.23
938.978	89.96
939.347	216.17
939.717	111.8
940.086	123.94
940.455	111.8
940.824	82.68
941.193	150.64
941.562	167.63
941.931	55.98
942.3	136.08
942.669	123.94
943.038	102.1
943.407	97.24
943.775	80.25
944.144	250.16
944.513	143.36
944.881	136.08
945.25	162.78
945.618	143.36
945.986	153.07
946.355	155.49
946.723	155.49
947.091	43.84
947.459	85.1
947.827	136.08
948.195	201.61
948.563	126.37
948.931	87.53
949.299	162.78
949.667	51.12
950.035	92.39
950.402	136.08
950.77	82.68
951.138	126.37
951.505	155.49
951.873	121.51
952.24	194.33
952.607	136.08
952.975	126.37
953.342	116.66
953.709	63.26
954.076	131.22
954.443	80.25
954.81	155.49
955.177	150.64
955.544	167.63
955.911	138.5
956.278	114.23
956.645	174.91
957.012	102.1
957.378	189.48
957.745	126.37
958.111	128.79
958.478	121.51
958.844	133.65
959.211	211.32
959.577	119.09
959.943	189.48
960.309	286.56
960.675	114.23
961.042	87.53
961.408	92.39
961.774	150.64
962.139	143.36
962.505	143.36
962.871	116.66
963.237	148.21
963.603	170.06
963.968	199.18
964.334	143.36
964.699	121.51
965.065	131.22
965.43	104.52
965.796	162.78
966.161	94.81
966.526	155.49
966.891	140.93
967.256	97.24
967.622	97.24
967.987	87.53
968.352	123.94
968.716	75.4
969.081	121.51
969.446	92.39
969.811	213.75
970.176	131.22
970.54	196.76
970.905	191.9
971.269	216.17
971.634	136.08
971.998	116.66
972.363	102.1
972.727	133.65
973.091	60.83
973.455	126.37
973.819	138.5
974.183	106.95
974.547	102.1
974.911	109.38
975.275	191.9
975.639	114.23
976.003	145.79
976.367	145.79
976.73	184.62
977.094	82.68
977.458	196.76
977.821	138.5
978.185	179.77
978.548	99.67
978.911	140.93
979.275	167.63
979.638	174.91
980.001	128.79
980.364	136.08
980.727	155.49
981.09	174.91
981.453	97.24
981.816	99.67
982.179	150.64
982.542	133.65
982.905	138.5
983.267	126.37
983.63	131.22
983.992	128.79
984.355	162.78
984.717	94.81
985.08	97.24
985.442	174.91
985.804	160.35
986.167	187.05
986.529	114.23
986.891	87.53
987.253	121.51
987.615	177.34
987.977	121.51
988.339	63.26
988.701	116.66
989.062	157.92
989.424	94.81
989.786	126.37
990.147	138.5
990.509	221.03
990.87	150.64
991.232	128.79
991.593	123.94
991.955	116.66
992.316	111.8
992.677	106.95
993.038	153.07
993.399	238.02
993.76	109.38
994.121	111.8
994.482	121.51
994.843	70.54
995.204	128.79
995.565	160.35
995.926	153.07
996.286	174.91
996.647	194.33
997.007	106.95
997.368	133.65
997.728	104.52
998.089	126.37
998.449	126.37
998.809	111.8
999.169	89.96
999.53	114.23
999.89	145.79
1000.25	123.94
1000.61	104.52
1000.97	51.12
1001.329	99.67
1001.689	150.64
1002.049	136.08
1002.409	87.53
1002.768	155.49
1003.128	116.66
1003.487	68.11
1003.847	104.52
1004.206	179.77
1004.566	136.08
1004.925	116.66
1005.284	87.53
1005.643	123.94
1006.003	106.95
1006.362	121.51
1006.721	136.08
1007.08	136.08
1007.438	85.1
1007.797	70.54
1008.156	165.2
1008.515	167.63
1008.874	126.37
1009.232	68.11
1009.591	94.81
1009.949	104.52
1010.308	157.92
1010.666	145.79
1011.024	184.62
1011.383	116.66
1011.741	63.26
1012.099	157.92
1012.457	111.8
1012.815	131.22
1013.173	82.68
1013.531	179.77
1013.889	123.94
1014.247	136.08
1014.605	172.48
1014.962	133.65
1015.32	131.22
1015.678	179.77
1016.035	65.69
1016.393	170.06
1016.75	131.22
1017.107	143.36
1017.465	123.94
1017.822	109.38
1018.179	140.93
1018.536	153.07
1018.894	80.25
1019.251	99.67
1019.608	121.51
1019.964	145.79
1020.321	109.38
1020.678	123.94
1021.035	216.17
1021.392	189.48
1021.748	123.94
1022.105	160.35
1022.461	58.41
1022.818	89.96
1023.174	182.19
1023.531	114.23
1023.887	184.62
1024.243	167.63
1024.599	109.38
1024.955	140.93
1025.311	133.65
1025.667	114.23
1026.023	174.91
1026.379	145.79
1026.735	123.94
1027.091	194.33
1027.447	111.8
