189.514	36.1
189.973	36.1
190.431	36.1
190.889	14.26
191.348	31.25
191.806	-51.28
192.264	-5.16
192.722	-39.14
193.18	67.66
193.638	-36.71
194.096	-63.41
194.554	-39.14
195.012	-12.44
195.47	-31.86
195.928	-29.43
196.385	-7.59
196.843	-5.16
197.301	43.39
197.758	31.25
198.216	9.41
198.674	33.68
199.131	84.65
199.589	16.69
200.046	23.97
200.503	28.82
200.961	157.47
201.418	128.34
201.875	121.06
202.332	74.94
202.79	62.8
203.247	116.2
203.704	125.91
204.161	70.09
204.618	130.77
205.075	82.22
205.532	142.9
205.989	96.79
206.445	138.05
206.902	133.19
207.359	147.76
207.816	164.75
208.272	198.73
208.729	189.02
209.185	101.64
209.642	162.32
210.098	123.48
210.555	72.51
211.011	99.21
211.467	162.32
211.924	189.02
212.38	138.05
212.836	118.63
213.292	176.88
213.748	116.2
214.204	135.62
214.66	164.75
215.116	239.99
215.572	125.91
216.028	125.91
216.484	38.53
216.94	113.78
217.396	133.19
217.851	150.18
218.307	152.61
218.763	191.45
219.218	135.62
219.674	94.36
220.129	135.62
220.585	111.35
221.04	128.34
221.496	89.5
221.951	162.32
222.406	72.51
222.861	140.48
223.317	210.86
223.772	215.72
224.227	179.31
224.682	159.89
225.137	128.34
225.592	128.34
226.047	125.91
226.502	172.03
226.957	201.16
227.411	121.06
227.866	121.06
228.321	230.28
228.776	164.75
229.23	108.92
229.685	140.48
230.139	133.19
230.594	116.2
231.048	121.06
231.503	169.6
231.957	157.47
232.411	198.73
232.865	123.48
233.32	116.2
233.774	123.48
234.228	101.64
234.682	125.91
235.136	104.07
235.59	142.9
236.044	140.48
236.498	210.86
236.952	155.04
237.406	210.86
237.86	150.18
238.313	206.01
238.767	184.17
239.221	123.48
239.674	167.17
240.128	142.9
240.581	108.92
241.035	135.62
241.488	140.48
241.942	130.77
242.395	87.08
242.848	121.06
243.301	82.22
243.755	159.89
244.208	162.32
244.661	116.2
245.114	108.92
245.567	174.46
246.02	150.18
246.473	101.64
246.926	220.57
247.379	113.78
247.832	108.92
248.284	164.75
248.737	130.77
249.19	101.64
249.642	169.6
250.095	138.05
250.547	145.33
251	145.33
251.452	101.64
251.905	104.07
252.357	74.94
252.81	162.32
253.262	157.47
253.714	167.17
254.166	164.75
254.618	125.91
255.07	150.18
255.523	121.06
255.975	130.77
256.427	113.78
256.878	133.19
257.33	142.9
257.782	130.77
258.234	101.64
258.686	155.04
259.137	145.33
259.589	176.88
260.041	70.09
260.492	169.6
260.944	125.91
261.395	138.05
261.847	74.94
262.298	147.76
262.749	162.32
263.201	128.34
263.652	174.46
264.103	111.35
264.554	94.36
265.005	147.76
265.457	147.76
265.908	40.96
266.359	167.17
266.809	181.74
267.26	130.77
267.711	142.9
268.162	215.72
268.613	138.05
269.064	157.47
269.514	206.01
269.965	186.59
270.415	111.35
270.866	67.66
271.316	130.77
271.767	138.05
272.217	155.04
272.668	167.17
273.118	201.16
273.568	184.17
274.019	186.59
274.469	152.61
274.919	167.17
275.369	167.17
275.819	87.08
276.269	79.79
276.719	106.49
277.169	155.04
277.619	193.87
278.069	157.47
278.518	116.2
278.968	113.78
279.418	225.43
279.867	140.48
280.317	138.05
280.767	121.06
281.216	196.3
281.666	96.79
282.115	172.03
282.564	91.93
283.014	118.63
283.463	193.87
283.912	225.43
284.361	155.04
284.811	172.03
285.26	135.62
285.709	201.16
286.158	186.59
286.607	104.07
287.056	82.22
287.505	186.59
287.953	174.46
288.402	172.03
288.851	128.34
289.3	128.34
289.748	237.56
290.197	108.92
290.646	155.04
291.094	128.34
291.543	176.88
291.991	87.08
292.439	181.74
292.888	210.86
293.336	140.48
293.784	111.35
294.233	155.04
294.681	118.63
295.129	169.6
295.577	147.76
296.025	116.2
296.473	225.43
296.921	159.89
297.369	159.89
297.817	184.17
298.264	167.17
298.712	162.32
299.16	106.49
299.608	174.46
300.055	130.77
300.503	133.19
300.95	130.77
301.398	176.88
301.845	123.48
302.293	172.03
302.74	133.19
303.187	155.04
303.635	145.33
304.082	142.9
304.529	130.77
304.976	196.3
305.423	138.05
305.87	162.32
306.317	118.63
306.764	135.62
307.211	142.9
307.658	118.63
308.105	244.85
308.552	118.63
308.998	174.46
309.445	145.33
309.892	123.48
310.338	128.34
310.785	152.61
311.231	176.88
311.678	155.04
312.124	133.19
312.571	155.04
313.017	140.48
313.463	142.9
313.909	184.17
314.356	159.89
314.802	155.04
315.248	157.47
315.694	94.36
316.14	150.18
316.586	208.44
317.032	53.1
317.478	203.58
317.923	138.05
318.369	191.45
318.815	96.79
319.261	213.29
319.706	167.17
320.152	208.44
320.597	227.86
321.043	77.37
321.488	179.31
321.934	150.18
322.379	152.61
322.824	174.46
323.27	147.76
323.715	60.38
324.16	87.08
324.605	147.76
325.05	179.31
325.495	91.93
325.94	174.46
326.385	89.5
326.83	121.06
327.275	152.61
327.72	223
328.165	193.87
328.61	162.32
329.054	82.22
329.499	174.46
329.943	206.01
330.388	164.75
330.832	70.09
331.277	237.56
331.721	111.35
332.166	108.92
332.61	38.53
333.054	189.02
333.499	198.73
333.943	140.48
334.387	210.86
334.831	113.78
335.275	155.04
335.719	72.51
336.163	201.16
336.607	184.17
337.051	203.58
337.495	118.63
337.938	208.44
338.382	121.06
338.826	133.19
339.269	191.45
339.713	172.03
340.157	138.05
340.6	218.15
341.044	169.6
341.487	130.77
341.93	89.5
342.374	193.87
342.817	128.34
343.26	184.17
343.703	206.01
344.146	116.2
344.59	201.16
345.033	150.18
345.476	130.77
345.919	162.32
346.361	167.17
346.804	167.17
347.247	138.05
347.69	113.78
348.133	176.88
348.575	121.06
349.018	94.36
349.461	150.18
349.903	123.48
350.346	135.62
350.788	128.34
351.23	135.62
351.673	179.31
352.115	130.77
352.557	164.75
353	123.48
353.442	121.06
353.884	130.77
354.326	164.75
354.768	215.72
355.21	155.04
355.652	133.19
356.094	128.34
356.536	55.52
356.978	164.75
357.419	135.62
357.861	189.02
358.303	157.47
358.744	87.08
359.186	113.78
359.627	186.59
360.069	118.63
360.51	130.77
360.952	142.9
361.393	155.04
361.834	155.04
362.276	106.49
362.717	94.36
363.158	155.04
363.599	208.44
364.04	99.21
364.481	70.09
364.922	181.74
365.363	111.35
365.804	150.18
366.245	140.48
366.686	198.73
367.126	121.06
367.567	225.43
368.008	121.06
368.448	138.05
368.889	138.05
369.33	193.87
369.77	242.42
370.21	167.17
370.651	172.03
371.091	116.2
371.531	125.91
371.972	104.07
372.412	159.89
372.852	193.87
373.292	125.91
373.732	74.94
374.172	99.21
374.612	96.79
375.052	159.89
375.492	203.58
375.932	147.76
376.372	232.71
376.811	121.06
377.251	99.21
377.691	111.35
378.13	91.93
378.57	176.88
379.009	138.05
379.449	167.17
379.888	189.02
380.328	142.9
380.767	138.05
381.206	218.15
381.645	133.19
382.085	147.76
382.524	169.6
382.963	176.88
383.402	87.08
383.841	36.1
384.28	111.35
384.719	145.33
385.158	172.03
385.596	142.9
386.035	130.77
386.474	145.33
386.913	138.05
387.351	167.17
387.79	145.33
388.228	159.89
388.667	172.03
389.105	172.03
389.544	169.6
389.982	113.78
390.42	181.74
390.859	140.48
391.297	150.18
391.735	104.07
392.173	172.03
392.611	128.34
393.049	198.73
393.487	111.35
393.925	113.78
394.363	152.61
394.801	152.61
395.239	89.5
395.676	111.35
396.114	167.17
396.552	108.92
396.989	128.34
397.427	140.48
397.864	53.1
398.302	130.77
398.739	140.48
399.177	130.77
399.614	128.34
400.051	181.74
400.488	145.33
400.926	147.76
401.363	138.05
401.8	155.04
402.237	174.46
402.674	147.76
403.111	82.22
403.548	74.94
403.985	99.21
404.421	121.06
404.858	208.44
405.295	164.75
405.732	77.37
406.168	147.76
406.605	138.05
407.041	133.19
407.478	101.64
407.914	125.91
408.351	140.48
408.787	201.16
409.223	155.04
409.66	150.18
410.096	106.49
410.532	181.74
410.968	133.19
411.404	133.19
411.84	111.35
412.276	96.79
412.712	116.2
413.148	145.33
413.584	150.18
414.02	152.61
414.455	239.99
414.891	84.65
415.327	159.89
415.762	145.33
416.198	99.21
416.633	150.18
417.069	101.64
417.504	145.33
417.94	142.9
418.375	125.91
418.81	174.46
419.245	169.6
419.681	157.47
420.116	150.18
420.551	123.48
420.986	133.19
421.421	155.04
421.856	213.29
422.291	130.77
422.726	167.17
423.16	91.93
423.595	123.48
424.03	123.48
424.464	145.33
424.899	111.35
425.334	164.75
425.768	91.93
426.203	196.3
426.637	159.89
427.071	157.47
427.506	162.32
427.94	128.34
428.374	111.35
428.809	147.76
429.243	77.37
429.677	55.52
430.111	128.34
430.545	121.06
430.979	116.2
431.413	142.9
431.847	145.33
432.28	145.33
432.714	145.33
433.148	118.63
433.582	150.18
434.015	104.07
434.449	89.5
434.882	176.88
435.316	142.9
435.749	215.72
436.183	162.32
436.616	157.47
437.049	249.7
437.483	138.05
437.916	91.93
438.349	172.03
438.782	208.44
439.215	135.62
439.648	67.66
440.081	159.89
440.514	140.48
440.947	89.5
441.38	193.87
441.813	203.58
442.245	208.44
442.678	193.87
443.111	101.64
443.543	152.61
443.976	125.91
444.408	193.87
444.841	169.6
445.273	167.17
445.705	184.17
446.138	155.04
446.57	215.72
447.002	135.62
447.434	176.88
447.867	123.48
448.299	181.74
448.731	227.86
449.163	208.44
449.595	155.04
450.026	111.35
450.458	223
450.89	135.62
451.322	150.18
451.754	193.87
452.185	191.45
452.617	150.18
453.048	213.29
453.48	227.86
453.911	191.45
454.343	193.87
454.774	189.02
455.205	159.89
455.637	172.03
456.068	193.87
456.499	167.17
456.93	227.86
457.361	203.58
457.792	252.13
458.223	213.29
458.654	196.3
459.085	184.17
459.516	172.03
459.947	164.75
460.378	135.62
460.808	108.92
461.239	206.01
461.669	242.42
462.1	242.42
462.531	150.18
462.961	193.87
463.391	174.46
463.822	174.46
464.252	150.18
464.682	181.74
465.113	196.3
465.543	225.43
465.973	198.73
466.403	174.46
466.833	215.72
467.263	176.88
467.693	142.9
468.123	186.59
468.553	186.59
468.983	196.3
469.412	191.45
469.842	174.46
470.272	152.61
470.701	101.64
471.131	169.6
471.56	142.9
471.99	186.59
472.419	84.65
472.849	133.19
473.278	193.87
473.707	256.98
474.136	201.16
474.566	184.17
474.995	176.88
475.424	198.73
475.853	130.77
476.282	116.2
476.711	196.3
477.14	235.14
477.569	118.63
477.997	186.59
478.426	210.86
478.855	65.23
479.283	147.76
479.712	162.32
480.141	210.86
480.569	198.73
480.998	128.34
481.426	174.46
481.854	162.32
482.283	123.48
482.711	164.75
483.139	167.17
483.567	208.44
483.995	142.9
484.424	108.92
484.852	111.35
485.28	138.05
485.708	118.63
486.135	162.32
486.563	155.04
486.991	138.05
487.419	133.19
487.847	227.86
488.274	174.46
488.702	140.48
489.129	169.6
489.557	145.33
489.984	242.42
490.412	181.74
490.839	179.31
491.266	111.35
491.694	142.9
492.121	135.62
492.548	179.31
492.975	147.76
493.402	111.35
493.829	169.6
494.256	174.46
494.683	206.01
495.11	84.65
495.537	140.48
495.964	79.79
496.39	150.18
496.817	140.48
497.244	113.78
497.67	33.68
498.097	193.87
498.523	138.05
498.95	72.51
499.376	104.07
499.803	123.48
500.229	125.91
500.655	176.88
501.081	150.18
501.508	145.33
501.934	152.61
502.36	133.19
502.786	-0.3
503.212	123.48
503.638	116.2
504.064	150.18
504.489	162.32
504.915	213.29
505.341	138.05
505.767	96.79
506.192	128.34
506.618	128.34
507.043	123.48
507.469	96.79
507.894	181.74
508.32	186.59
508.745	181.74
509.17	87.08
509.596	150.18
510.021	162.32
510.446	167.17
510.871	121.06
511.296	113.78
511.721	130.77
512.146	128.34
512.571	138.05
512.996	215.72
513.421	174.46
513.845	130.77
514.27	82.22
514.695	191.45
515.119	164.75
515.544	174.46
515.969	189.02
516.393	135.62
516.817	133.19
517.242	174.46
517.666	232.71
518.09	213.29
518.515	123.48
518.939	176.88
519.363	339.51
519.787	259.41
520.211	176.88
520.635	135.62
521.059	130.77
521.483	138.05
521.907	155.04
522.331	201.16
522.754	184.17
523.178	135.62
523.602	198.73
524.025	135.62
524.449	162.32
524.872	201.16
525.296	164.75
525.719	121.06
526.143	186.59
526.566	111.35
526.989	48.24
527.412	159.89
527.836	225.43
528.259	223
528.682	128.34
529.105	133.19
529.528	155.04
529.951	206.01
530.374	191.45
530.796	208.44
531.219	159.89
531.642	101.64
532.065	174.46
532.487	150.18
532.91	104.07
533.332	130.77
533.755	135.62
534.177	140.48
534.6	142.9
535.022	138.05
535.444	150.18
535.867	172.03
536.289	130.77
536.711	116.2
537.133	193.87
537.555	203.58
537.977	125.91
538.399	176.88
538.821	142.9
539.243	193.87
539.665	198.73
540.086	164.75
540.508	140.48
540.93	176.88
541.351	237.56
541.773	142.9
542.195	242.42
542.616	198.73
543.037	193.87
543.459	252.13
543.88	218.15
544.301	191.45
544.723	157.47
545.144	162.32
545.565	121.06
545.986	201.16
546.407	249.7
546.828	106.49
547.249	184.17
547.67	108.92
548.091	167.17
548.512	123.48
548.932	130.77
549.353	150.18
549.774	94.36
550.194	157.47
550.615	140.48
551.035	125.91
551.456	113.78
551.876	191.45
552.296	167.17
552.717	176.88
553.137	130.77
553.557	89.5
553.977	138.05
554.397	147.76
554.817	125.91
555.237	176.88
555.657	96.79
556.077	155.04
556.497	94.36
556.917	157.47
557.337	186.59
557.756	179.31
558.176	186.59
558.596	191.45
559.015	223
559.435	155.04
559.854	121.06
560.274	145.33
560.693	220.57
561.112	242.42
561.532	167.17
561.951	155.04
562.37	135.62
562.789	159.89
563.208	191.45
563.627	99.21
564.046	135.62
564.465	133.19
564.884	147.76
565.303	121.06
565.722	159.89
566.14	174.46
566.559	133.19
566.978	184.17
567.396	164.75
567.815	157.47
568.233	174.46
568.652	140.48
569.07	91.93
569.489	150.18
569.907	208.44
570.325	106.49
570.743	155.04
571.161	152.61
571.58	118.63
571.998	208.44
572.416	191.45
572.833	167.17
573.251	167.17
573.669	142.9
574.087	220.57
574.505	99.21
574.922	145.33
575.34	196.3
575.758	145.33
576.175	152.61
576.593	130.77
577.01	72.51
577.428	159.89
577.845	1397.78
578.262	213.29
578.68	164.75
579.097	157.47
579.514	189.02
579.931	135.62
580.348	184.17
580.765	225.43
581.182	121.06
581.599	189.02
582.016	167.17
582.433	169.6
582.849	113.78
583.266	203.58
583.683	118.63
584.099	174.46
584.516	145.33
584.933	220.57
585.349	104.07
585.765	150.18
586.182	167.17
586.598	140.48
587.014	220.57
587.431	203.58
587.847	128.34
588.263	242.42
588.679	218.15
589.095	96.79
589.511	206.01
589.927	167.17
590.343	169.6
590.759	186.59
591.174	57.95
591.59	169.6
592.006	147.76
592.421	113.78
592.837	164.75
593.252	208.44
593.668	189.02
594.083	164.75
594.499	181.74
594.914	145.33
595.329	179.31
595.745	164.75
596.16	162.32
596.575	176.88
596.99	145.33
597.405	133.19
597.82	184.17
598.235	172.03
598.65	147.76
599.065	201.16
599.479	96.79
599.894	152.61
600.309	125.91
600.724	145.33
601.138	208.44
601.553	159.89
601.967	121.06
602.382	118.63
602.796	179.31
603.21	150.18
603.625	174.46
604.039	164.75
604.453	145.33
604.867	174.46
605.281	208.44
605.695	96.79
606.109	191.45
606.523	142.9
606.937	123.48
607.351	283.68
607.765	121.06
608.178	208.44
608.592	147.76
609.006	184.17
609.419	215.72
609.833	111.35
610.246	203.58
610.66	174.46
611.073	198.73
611.487	201.16
611.9	184.17
612.313	176.88
612.726	87.08
613.139	174.46
613.553	155.04
613.966	174.46
614.379	140.48
614.792	43.39
615.204	176.88
615.617	176.88
616.03	162.32
616.443	167.17
616.856	179.31
617.268	125.91
617.681	159.89
618.093	104.07
618.506	193.87
618.918	113.78
619.331	145.33
619.743	179.31
620.155	135.62
620.568	198.73
620.98	94.36
621.392	198.73
621.804	218.15
622.216	106.49
622.628	138.05
623.04	191.45
623.452	108.92
623.864	303.1
624.276	164.75
624.687	176.88
625.099	157.47
625.511	193.87
625.922	201.16
626.334	227.86
626.745	128.34
627.157	140.48
627.568	74.94
627.979	121.06
628.391	167.17
628.802	191.45
629.213	172.03
629.624	157.47
630.035	128.34
630.446	218.15
630.857	142.9
631.268	155.04
631.679	111.35
632.09	106.49
632.501	155.04
632.912	176.88
633.322	162.32
633.733	164.75
634.144	106.49
634.554	138.05
634.965	164.75
635.375	116.2
635.785	210.86
636.196	193.87
636.606	140.48
637.016	157.47
637.427	184.17
637.837	152.61
638.247	60.38
638.657	155.04
639.067	174.46
639.477	169.6
639.887	152.61
640.297	116.2
640.706	174.46
641.116	172.03
641.526	181.74
641.935	150.18
642.345	179.31
642.755	196.3
643.164	91.93
643.573	220.57
643.983	184.17
644.392	162.32
644.801	203.58
645.211	162.32
645.62	101.64
646.029	198.73
646.438	125.91
646.847	203.58
647.256	206.01
647.665	176.88
648.074	138.05
648.483	196.3
648.892	162.32
649.3	189.02
649.709	140.48
650.118	60.38
650.526	121.06
650.935	213.29
651.343	155.04
651.752	162.32
652.16	159.89
652.568	133.19
652.977	108.92
653.385	189.02
653.793	201.16
654.201	130.77
654.609	142.9
655.017	96.79
655.425	193.87
655.833	220.57
656.241	138.05
656.649	201.16
657.057	155.04
657.464	210.86
657.872	101.64
658.28	189.02
658.687	116.2
659.095	208.44
659.502	123.48
659.91	99.21
660.317	118.63
660.724	101.64
661.132	123.48
661.539	157.47
661.946	130.77
662.353	128.34
662.76	113.78
663.167	142.9
663.574	215.72
663.981	213.29
664.388	186.59
664.795	189.02
665.202	223
665.608	116.2
666.015	121.06
666.422	159.89
666.828	133.19
667.235	150.18
667.641	189.02
668.047	193.87
668.454	87.08
668.86	181.74
669.266	157.47
669.673	145.33
670.079	130.77
670.485	142.9
670.891	104.07
671.297	140.48
671.703	176.88
672.109	123.48
672.515	128.34
672.92	225.43
673.326	125.91
673.732	239.99
674.138	128.34
674.543	104.07
674.949	125.91
675.354	201.16
675.76	186.59
676.165	167.17
676.57	99.21
676.976	174.46
677.381	87.08
677.786	150.18
678.191	184.17
678.596	150.18
679.001	169.6
679.406	84.65
679.811	140.48
680.216	87.08
680.621	152.61
681.026	179.31
681.43	155.04
681.835	203.58
682.24	176.88
682.644	196.3
683.049	215.72
683.453	203.58
683.858	106.49
684.262	189.02
684.667	133.19
685.071	198.73
685.475	150.18
685.879	147.76
686.283	172.03
686.687	191.45
687.091	150.18
687.495	159.89
687.899	198.73
688.303	147.76
688.707	189.02
689.111	130.77
689.514	130.77
689.918	130.77
690.322	118.63
690.725	159.89
691.129	164.75
691.532	162.32
691.936	150.18
692.339	150.18
692.742	128.34
693.146	162.32
693.549	152.61
693.952	252.13
694.355	210.86
694.758	133.19
695.161	181.74
695.564	176.88
695.967	152.61
696.37	189.02
696.773	116.2
697.175	106.49
697.578	179.31
697.981	121.06
698.383	181.74
698.786	201.16
699.188	155.04
699.591	140.48
699.993	210.86
700.395	123.48
700.798	162.32
701.2	203.58
701.602	162.32
702.004	128.34
702.406	179.31
702.808	208.44
703.21	133.19
703.612	157.47
704.014	172.03
704.416	172.03
704.818	223
705.219	176.88
705.621	218.15
706.023	244.85
706.424	230.28
706.826	252.13
707.227	196.3
707.629	145.33
708.03	227.86
708.431	259.41
708.832	317.66
709.234	196.3
709.635	312.81
710.036	225.43
710.437	223
710.838	307.95
711.239	220.57
711.64	237.56
712.041	237.56
712.441	264.26
712.842	259.41
713.243	261.84
713.643	220.57
714.044	213.29
714.445	252.13
714.845	252.13
715.246	290.96
715.646	252.13
716.046	215.72
716.447	298.24
716.847	266.69
717.247	298.24
717.647	252.13
718.047	395.33
718.447	397.76
718.847	363.78
719.247	259.41
719.647	400.19
720.047	458.44
720.446	358.93
720.846	385.62
721.246	332.23
721.645	412.32
722.045	329.8
722.444	380.77
722.844	392.91
723.243	487.57
723.643	465.72
724.042	400.19
724.441	463.3
724.84	443.88
725.24	538.54
725.639	477.86
726.038	494.85
726.437	443.88
726.836	502.13
727.234	519.12
727.633	536.11
728.032	584.66
728.431	606.5
728.83	623.49
729.228	667.18
729.627	659.9
730.025	689.03
730.424	805.53
730.822	905.05
731.22	829.81
731.619	953.59
732.017	1002.14
732.415	1023.98
732.813	956.02
733.212	1089.52
733.61	1261.85
734.008	1218.16
734.406	1339.52
734.803	1295.83
735.201	1519.14
735.599	1594.38
735.997	1696.32
736.395	1883.22
736.792	1926.91
737.19	1999.73
737.587	2050.7
737.985	2261.87
738.382	2409.93
738.78	2497.31
739.177	2565.27
739.574	2723.04
739.971	3011.88
740.369	2948.77
740.766	3084.7
741.163	3074.99
741.56	3465.77
741.957	3395.38
742.354	3579.85
742.751	3713.35
743.147	3982.77
743.544	4060.44
743.941	4150.25
744.338	4514.33
744.734	4788.61
745.131	4914.82
745.527	5099.29
745.924	5378.42
746.32	5740.08
746.716	5888.14
747.113	6300.77
747.509	6647.86
747.905	7106.6
748.301	7026.5
748.697	7147.87
749.093	7883.31
749.489	8026.52
749.885	8410.02
750.281	8861.48
750.677	9434.31
751.073	10011.99
751.468	10060.53
751.864	10252.28
752.26	10888.22
752.655	11397.93
753.051	11448.9
753.446	11951.34
753.842	12621.25
754.237	13509.62
754.632	13269.32
755.028	13594.57
755.423	14308.17
755.818	14388.27
756.213	14351.86
756.608	14414.97
757.003	15191.68
757.398	15191.68
757.793	14968.38
758.188	15172.26
758.583	16465.97
758.977	16378.59
759.372	16514.52
759.767	17305.79
760.161	18368.91
760.556	19519.42
760.95	19932.05
761.345	20810.7
761.739	21912.66
762.133	22179.65
762.527	22876.27
762.922	24145.7
763.316	24441.82
763.71	24796.2
764.104	24936.98
764.498	26403.02
764.892	27036.52
765.286	26514.67
765.68	27483.13
766.073	29284.13
766.467	28915.19
766.861	29223.45
767.255	30451.63
767.648	32424.96
768.042	31784.17
768.435	31995.34
768.829	32738.07
769.222	33912.85
769.615	33648.28
770.008	33369.15
770.402	34507.51
770.795	35276.94
771.188	34568.2
771.581	34925
771.974	35085.19
772.367	34844.9
772.76	34422.56
773.153	34199.26
773.545	34556.06
773.938	35337.62
774.331	34801.21
774.724	35735.69
775.116	37235.71
775.509	38587.68
775.901	39522.16
776.294	40638.68
776.686	42104.72
777.078	41806.17
777.471	42721.23
777.863	45272.25
778.255	46155.75
778.647	45990.7
779.039	45903.32
779.431	46136.34
779.823	46680.03
780.215	46507.7
780.607	47075.67
780.999	49080.56
781.39	47988.31
781.782	48325.69
782.174	48949.49
782.565	49769.89
782.957	48959.2
783.348	49823.29
783.74	50223.78
784.131	50451.94
784.522	50216.5
784.914	49349.98
785.305	49978.63
785.696	48971.33
786.087	48570.84
786.478	48439.77
786.869	47051.4
787.26	45796.53
787.651	45189.72
788.042	45082.92
788.433	43660.57
788.823	43022.21
789.214	42306.18
789.605	41590.15
789.995	40031.87
790.386	39459.05
790.776	39968.76
791.167	38997.88
791.557	39895.95
791.948	40068.28
792.338	41670.25
792.728	42488.22
793.118	41561.02
793.508	41769.76
793.898	42342.59
794.288	42920.27
794.678	41772.19
795.068	42330.45
795.458	42284.33
795.848	42136.27
796.238	42446.96
796.627	42561.04
797.017	42019.77
797.406	41461.51
797.796	41303.74
798.185	42058.6
798.575	42017.34
798.964	42124.14
799.354	42903.28
799.743	42507.64
800.132	42303.75
800.521	42531.91
800.91	43497.95
801.299	41869.28
801.688	41376.55
802.077	40912.95
802.466	41636.27
802.855	40835.28
803.244	39648.37
803.633	40039.15
804.021	38760.01
804.41	37922.62
804.799	37364.36
805.187	36883.77
805.576	35949.28
805.964	34619.17
806.352	33441.96
806.741	32929.82
807.129	32310.88
807.517	31924.95
807.905	32881.28
808.293	32590.01
808.681	32587.58
809.069	31706.5
809.457	33827.89
809.845	32825.45
810.233	32672.53
810.621	33252.64
811.009	33245.36
811.396	33194.39
811.784	33454.1
812.171	33638.57
812.559	32815.74
812.946	31791.45
813.334	32051.17
813.721	31339.99
814.108	30721.05
814.496	29859.38
814.883	29728.31
815.27	30502.6
815.657	29801.13
816.044	29330.25
816.431	29361.8
816.818	29594.82
817.205	28854.51
817.592	29356.95
817.979	29080.25
818.365	28145.77
818.752	26954
819.139	26043.79
819.525	26417.58
819.912	25449.12
820.298	24699.11
820.685	24407.84
821.071	23242.78
821.457	22682.09
821.843	22172.37
822.23	21349.54
822.616	20473.32
823.002	19703.89
823.388	18939.31
823.774	18463.58
824.16	17958.71
824.546	17072.78
824.931	17099.48
825.317	16800.93
825.703	16509.66
826.089	16072.76
826.474	16111.6
826.86	15541.2
827.245	15519.36
827.631	15502.36
828.016	14999.93
828.401	14706.24
828.787	14512.06
829.172	14048.46
829.557	13810.59
829.942	13247.48
830.327	13252.33
830.712	12512.03
831.097	12121.24
831.482	12351.83
831.867	11999.88
832.252	11366.38
832.636	11414.92
833.021	11541.14
833.406	11053.27
833.79	10961.03
834.175	10679.47
834.559	10647.92
834.944	10104.22
835.328	9997.42
835.713	9497.42
836.097	9320.23
836.481	8931.87
836.865	8740.12
837.249	8305.65
837.633	8286.23
838.017	7890.6
838.401	7667.29
838.785	7274.08
839.169	7016.8
839.553	6798.35
839.937	6630.87
840.32	6237.66
840.704	5851.73
841.087	5723.09
841.471	5708.52
841.854	5426.97
842.238	5109
842.621	5077.45
843.004	4868.7
843.388	4839.58
843.771	4752.2
844.154	4647.83
844.537	4594.43
844.92	4575.01
845.303	4485.2
845.686	4402.68
846.069	4315.3
846.452	4257.04
846.834	4147.82
847.217	4028.89
847.6	3849.27
847.982	3761.89
848.365	3693.93
848.748	3652.67
849.13	3611.4
849.512	3502.18
849.895	3485.19
850.277	3332.27
850.659	3288.58
851.041	3218.19
851.423	3167.22
851.806	3026.44
852.188	3033.72
852.57	2892.95
852.951	2892.95
853.333	2858.96
853.715	2667.21
854.097	2689.06
854.479	2468.18
854.86	2526.43
855.242	2548.28
855.623	2276.43
856.005	2181.77
856.386	2140.51
856.768	2028.85
857.149	1973.03
857.53	1953.61
857.911	1883.22
858.292	1803.12
858.674	1727.88
859.055	1747.3
859.436	1511.86
859.817	1521.56
860.197	1395.35
860.578	1514.28
860.959	1300.69
861.34	1344.38
861.72	1419.62
862.101	1206.03
862.482	1232.73
862.862	1240.01
863.243	1257
863.623	1113.79
864.003	1150.2
864.384	1038.55
864.764	994.86
865.144	1036.12
865.524	912.33
865.904	1028.84
866.284	946.31
866.664	897.77
867.044	897.77
867.424	798.25
867.804	861.36
868.183	822.52
868.563	790.97
868.943	744.85
869.322	713.3
869.702	732.72
870.081	689.03
870.461	676.89
870.84	696.31
871.22	628.35
871.599	689.03
871.978	560.38
872.357	589.51
872.736	533.69
873.115	528.83
873.494	504.56
873.873	550.68
874.252	494.85
874.631	453.59
875.01	480.29
875.388	414.75
875.767	402.62
876.146	409.9
876.524	439.02
876.903	434.17
877.281	405.04
877.66	368.63
878.038	327.37
878.416	281.25
878.794	341.93
879.173	276.4
879.551	315.24
879.929	351.64
880.307	322.52
880.685	295.82
881.063	320.09
881.441	310.38
881.818	329.8
882.196	293.39
882.574	322.52
882.951	218.15
883.329	206.01
883.707	295.82
884.084	259.41
884.461	235.14
884.839	252.13
885.216	128.34
885.593	235.14
885.971	271.55
886.348	227.86
886.725	256.98
887.102	315.24
887.479	218.15
887.856	300.67
888.233	232.71
888.609	203.58
888.986	283.68
889.363	174.46
889.74	208.44
890.116	147.76
890.493	181.74
890.869	79.79
891.246	227.86
891.622	181.74
891.998	142.9
892.375	159.89
892.751	147.76
893.127	196.3
893.503	203.58
893.879	184.17
894.255	218.15
894.631	181.74
895.007	206.01
895.383	203.58
895.759	191.45
896.134	142.9
896.51	138.05
896.886	169.6
897.261	133.19
897.637	125.91
898.012	104.07
898.388	150.18
898.763	186.59
899.138	133.19
899.514	106.49
899.889	138.05
900.264	111.35
900.639	104.07
901.014	164.75
901.389	193.87
901.764	140.48
902.139	91.93
902.513	159.89
902.888	140.48
903.263	101.64
903.638	62.8
904.012	138.05
904.387	113.78
904.761	104.07
905.136	94.36
905.51	155.04
905.884	174.46
906.259	172.03
906.633	96.79
907.007	74.94
907.381	172.03
907.755	145.33
908.129	82.22
908.503	130.77
908.877	72.51
909.251	164.75
909.624	145.33
909.998	155.04
910.372	106.49
910.745	38.53
911.119	111.35
911.492	189.02
911.866	111.35
912.239	133.19
912.612	189.02
912.986	130.77
913.359	135.62
913.732	125.91
914.105	79.79
914.478	198.73
914.851	116.2
915.224	116.2
915.597	135.62
915.97	104.07
916.343	118.63
916.715	60.38
917.088	138.05
917.461	184.17
917.833	67.66
918.206	159.89
918.578	223
918.951	128.34
919.323	220.57
919.695	208.44
920.067	106.49
920.44	74.94
920.812	99.21
921.184	123.48
921.556	89.5
921.928	121.06
922.3	164.75
922.672	89.5
923.043	99.21
923.415	77.37
923.787	147.76
924.158	162.32
924.53	138.05
924.901	99.21
925.273	79.79
925.644	91.93
926.016	128.34
926.387	159.89
926.758	176.88
927.129	116.2
927.5	133.19
927.872	181.74
928.243	184.17
928.613	138.05
928.984	169.6
929.355	138.05
929.726	135.62
930.097	101.64
930.467	130.77
930.838	215.72
931.209	125.91
931.579	150.18
931.95	82.22
932.32	106.49
932.69	152.61
933.061	125.91
933.431	91.93
933.801	130.77
934.171	108.92
934.541	150.18
934.911	155.04
935.281	152.61
935.651	167.17
936.021	125.91
936.391	128.34
936.761	145.33
937.13	113.78
937.5	99.21
937.87	82.22
938.239	140.48
938.609	184.17
938.978	186.59
939.347	108.92
939.717	94.36
940.086	164.75
940.455	84.65
940.824	133.19
941.193	164.75
941.562	198.73
941.931	99.21
942.3	239.99
942.669	155.04
943.038	99.21
943.407	108.92
943.775	169.6
944.144	157.47
944.513	147.76
944.881	84.65
945.25	162.32
945.618	152.61
945.986	94.36
946.355	210.86
946.723	87.08
947.091	118.63
947.459	123.48
947.827	116.2
948.195	113.78
948.563	60.38
948.931	138.05
949.299	125.91
949.667	155.04
950.035	138.05
950.402	116.2
950.77	138.05
951.138	145.33
951.505	116.2
951.873	179.31
952.24	135.62
952.607	164.75
952.975	104.07
953.342	91.93
953.709	152.61
954.076	101.64
954.443	101.64
954.81	189.02
955.177	140.48
955.544	162.32
955.911	155.04
956.278	157.47
956.645	169.6
957.012	96.79
957.378	186.59
957.745	111.35
958.111	210.86
958.478	206.01
958.844	123.48
959.211	176.88
959.577	104.07
959.943	164.75
960.309	155.04
960.675	130.77
961.042	91.93
961.408	104.07
961.774	79.79
962.139	157.47
962.505	191.45
962.871	169.6
963.237	128.34
963.603	77.37
963.968	111.35
964.334	176.88
964.699	159.89
965.065	179.31
965.43	150.18
965.796	140.48
966.161	101.64
966.526	155.04
966.891	164.75
967.256	91.93
967.622	40.96
967.987	220.57
968.352	164.75
968.716	121.06
969.081	84.65
969.446	123.48
969.811	155.04
970.176	96.79
970.54	142.9
970.905	128.34
971.269	94.36
971.634	147.76
971.998	125.91
972.363	189.02
972.727	79.79
973.091	19.11
973.455	130.77
973.819	150.18
974.183	108.92
974.547	128.34
974.911	179.31
975.275	125.91
975.639	155.04
976.003	150.18
976.367	164.75
976.73	121.06
977.094	162.32
977.458	174.46
977.821	189.02
978.185	133.19
978.548	138.05
978.911	147.76
979.275	33.68
979.638	135.62
980.001	145.33
980.364	167.17
980.727	162.32
981.09	138.05
981.453	123.48
981.816	191.45
982.179	138.05
982.542	128.34
982.905	123.48
983.267	138.05
983.63	213.29
983.992	125.91
984.355	99.21
984.717	145.33
985.08	152.61
985.442	155.04
985.804	196.3
986.167	150.18
986.529	145.33
986.891	123.48
987.253	206.01
987.615	155.04
987.977	113.78
988.339	79.79
988.701	142.9
989.062	140.48
989.424	164.75
989.786	128.34
990.147	133.19
990.509	142.9
990.87	125.91
991.232	145.33
991.593	130.77
991.955	176.88
992.316	169.6
992.677	128.34
993.038	174.46
993.399	130.77
993.76	116.2
994.121	123.48
994.482	140.48
994.843	184.17
995.204	152.61
995.565	118.63
995.926	176.88
996.286	157.47
996.647	155.04
997.007	130.77
997.368	172.03
997.728	174.46
998.089	140.48
998.449	116.2
998.809	77.37
999.169	99.21
999.53	113.78
999.89	138.05
1000.25	130.77
1000.61	108.92
1000.97	99.21
1001.329	157.47
1001.689	174.46
1002.049	125.91
1002.409	101.64
1002.768	89.5
1003.128	123.48
1003.487	53.1
1003.847	89.5
1004.206	172.03
1004.566	162.32
1004.925	152.61
1005.284	106.49
1005.643	135.62
1006.003	123.48
1006.362	135.62
1006.721	174.46
1007.08	130.77
1007.438	174.46
1007.797	191.45
1008.156	189.02
1008.515	142.9
1008.874	128.34
1009.232	77.37
1009.591	135.62
1009.949	162.32
1010.308	157.47
1010.666	133.19
1011.024	82.22
1011.383	116.2
1011.741	111.35
1012.099	74.94
1012.457	70.09
1012.815	113.78
1013.173	138.05
1013.531	181.74
1013.889	147.76
1014.247	150.18
1014.605	135.62
1014.962	193.87
1015.32	130.77
1015.678	57.95
1016.035	77.37
1016.393	169.6
1016.75	150.18
1017.107	108.92
1017.465	176.88
1017.822	220.57
1018.179	206.01
1018.536	145.33
1018.894	138.05
1019.251	101.64
1019.608	133.19
1019.964	121.06
1020.321	121.06
1020.678	176.88
1021.035	77.37
1021.392	104.07
1021.748	210.86
1022.105	113.78
1022.461	79.79
1022.818	128.34
1023.174	252.13
1023.531	125.91
1023.887	108.92
1024.243	121.06
1024.599	104.07
1024.955	130.77
1025.311	121.06
1025.667	70.09
1026.023	91.93
1026.379	145.33
1026.735	179.31
1027.091	150.18
1027.447	57.95
