189.514	70.84
189.973	70.84
190.431	70.84
190.889	65.99
191.348	39.29
191.806	-16.54
192.264	12.59
192.722	-77.22
193.18	0.46
193.638	-43.23
194.096	56.28
194.554	24.73
195.012	75.7
195.47	49
195.928	-21.39
196.385	-33.53
196.843	2.88
197.301	-18.96
197.758	-11.68
198.216	-38.38
198.674	-1.97
199.131	24.73
199.589	34.44
200.046	58.71
200.503	138.81
200.961	41.72
201.418	63.56
201.875	121.82
202.332	121.82
202.79	124.24
203.247	155.8
203.704	189.78
204.161	163.08
204.618	170.36
205.075	187.35
205.532	129.1
205.989	129.1
206.445	136.38
206.902	175.22
207.359	221.33
207.816	126.67
208.272	146.09
208.729	163.08
209.185	194.63
209.642	153.37
210.098	148.52
210.555	233.47
211.011	214.05
211.467	165.51
211.924	192.21
212.38	206.77
212.836	158.22
213.292	235.9
213.748	150.94
214.204	121.82
214.66	194.63
215.116	158.22
215.572	141.23
216.028	182.5
216.484	238.32
216.94	209.2
217.396	184.92
217.851	167.93
218.307	182.5
218.763	221.33
219.218	116.96
219.674	119.39
220.129	175.22
220.585	211.62
221.04	155.8
221.496	148.52
221.951	218.91
222.406	129.1
222.861	163.08
223.317	121.82
223.772	107.25
224.227	109.68
224.682	102.4
225.137	223.76
225.592	206.77
226.047	124.24
226.502	136.38
226.957	138.81
227.411	192.21
227.866	131.53
228.321	155.8
228.776	172.79
229.23	150.94
229.685	167.93
230.139	221.33
230.594	189.78
231.048	170.36
231.503	167.93
231.957	158.22
232.411	197.06
232.865	158.22
233.32	187.35
233.774	197.06
234.228	133.95
234.682	189.78
235.136	121.82
235.59	146.09
236.044	119.39
236.498	197.06
236.952	214.05
237.406	201.91
237.86	109.68
238.313	138.81
238.767	85.41
239.221	184.92
239.674	204.34
240.128	143.66
240.581	136.38
241.035	148.52
241.488	95.12
241.942	155.8
242.395	148.52
242.848	143.66
243.301	160.65
243.755	136.38
244.208	177.64
244.661	221.33
245.114	153.37
245.567	146.09
246.02	172.79
246.473	163.08
246.926	233.47
247.379	141.23
247.832	172.79
248.284	175.22
248.737	104.83
249.19	201.91
249.642	187.35
250.095	116.96
250.547	172.79
251	165.51
251.452	218.91
251.905	153.37
252.357	153.37
252.81	163.08
253.262	165.51
253.714	192.21
254.166	146.09
254.618	160.65
255.07	184.92
255.523	148.52
255.975	160.65
256.427	133.95
256.878	211.62
257.33	153.37
257.782	262.6
258.234	189.78
258.686	235.9
259.137	194.63
259.589	148.52
260.041	167.93
260.492	165.51
260.944	104.83
261.395	114.53
261.847	194.63
262.298	189.78
262.749	177.64
263.201	265.02
263.652	192.21
264.103	184.92
264.554	112.11
265.005	155.8
265.457	97.54
265.908	160.65
266.359	138.81
266.809	167.93
267.26	194.63
267.711	153.37
268.162	138.81
268.613	148.52
269.064	184.92
269.514	197.06
269.965	141.23
270.415	153.37
270.866	274.73
271.316	148.52
271.767	163.08
272.217	199.49
272.668	204.34
273.118	187.35
273.568	160.65
274.019	148.52
274.469	211.62
274.919	182.5
275.369	201.91
275.819	167.93
276.269	148.52
276.719	136.38
277.169	180.07
277.619	148.52
278.069	138.81
278.518	136.38
278.968	192.21
279.418	175.22
279.867	175.22
280.317	172.79
280.767	116.96
281.216	187.35
281.666	138.81
282.115	167.93
282.564	209.2
283.014	170.36
283.463	238.32
283.912	165.51
284.361	201.91
284.811	197.06
285.26	194.63
285.709	167.93
286.158	218.91
286.607	218.91
287.056	153.37
287.505	233.47
287.953	170.36
288.402	187.35
288.851	155.8
289.3	177.64
289.748	214.05
290.197	136.38
290.646	180.07
291.094	187.35
291.543	155.8
291.991	252.89
292.439	172.79
292.888	143.66
293.336	150.94
293.784	141.23
294.233	150.94
294.681	124.24
295.129	221.33
295.577	95.12
296.025	129.1
296.473	226.19
296.921	165.51
297.369	167.93
297.817	201.91
298.264	165.51
298.712	141.23
299.16	228.61
299.608	257.74
300.055	150.94
300.503	187.35
300.95	194.63
301.398	257.74
301.845	160.65
302.293	214.05
302.74	116.96
303.187	165.51
303.635	112.11
304.082	214.05
304.529	56.28
304.976	163.08
305.423	184.92
305.87	143.66
306.317	136.38
306.764	238.32
307.211	148.52
307.658	170.36
308.105	136.38
308.552	70.84
308.998	214.05
309.445	121.82
309.892	177.64
310.338	167.93
310.785	165.51
311.231	153.37
311.678	250.46
312.124	189.78
312.571	189.78
313.017	165.51
313.463	167.93
313.909	165.51
314.356	143.66
314.802	194.63
315.248	209.2
315.694	172.79
316.14	226.19
316.586	182.5
317.032	223.76
317.478	160.65
317.923	172.79
318.369	228.61
318.815	199.49
319.261	255.31
319.706	82.98
320.152	199.49
320.597	146.09
321.043	121.82
321.488	155.8
321.934	184.92
322.379	153.37
322.824	160.65
323.27	155.8
323.715	133.95
324.16	167.93
324.605	136.38
325.05	182.5
325.495	187.35
325.94	180.07
326.385	146.09
326.83	180.07
327.275	165.51
327.72	194.63
328.165	194.63
328.61	172.79
329.054	146.09
329.499	180.07
329.943	148.52
330.388	155.8
330.832	136.38
331.277	216.48
331.721	206.77
332.166	235.9
332.61	141.23
333.054	199.49
333.499	180.07
333.943	153.37
334.387	160.65
334.831	197.06
335.275	150.94
335.719	201.91
336.163	160.65
336.607	109.68
337.051	78.13
337.495	206.77
337.938	182.5
338.382	170.36
338.826	158.22
339.269	216.48
339.713	197.06
340.157	160.65
340.6	155.8
341.044	180.07
341.487	209.2
341.93	192.21
342.374	182.5
342.817	238.32
343.26	180.07
343.703	155.8
344.146	167.93
344.59	250.46
345.033	187.35
345.476	146.09
345.919	218.91
346.361	192.21
346.804	153.37
347.247	192.21
347.69	177.64
348.133	211.62
348.575	150.94
349.018	201.91
349.461	160.65
349.903	138.81
350.346	126.67
350.788	209.2
351.23	221.33
351.673	177.64
352.115	167.93
352.557	189.78
353	172.79
353.442	116.96
353.884	184.92
354.326	143.66
354.768	199.49
355.21	221.33
355.652	148.52
356.094	175.22
356.536	238.32
356.978	274.73
357.419	126.67
357.861	182.5
358.303	250.46
358.744	170.36
359.186	158.22
359.627	201.91
360.069	238.32
360.51	165.51
360.952	121.82
361.393	133.95
361.834	133.95
362.276	180.07
362.717	204.34
363.158	167.93
363.599	143.66
364.04	167.93
364.481	90.26
364.922	209.2
365.363	119.39
365.804	170.36
366.245	240.75
366.686	218.91
367.126	114.53
367.567	170.36
368.008	146.09
368.448	182.5
368.889	201.91
369.33	148.52
369.77	216.48
370.21	231.04
370.651	177.64
371.091	136.38
371.531	163.08
371.972	214.05
372.412	167.93
372.852	160.65
373.292	165.51
373.732	146.09
374.172	194.63
374.612	85.41
375.052	155.8
375.492	129.1
375.932	131.53
376.372	146.09
376.811	233.47
377.251	155.8
377.691	214.05
378.13	204.34
378.57	206.77
379.009	233.47
379.449	126.67
379.888	172.79
380.328	129.1
380.767	165.51
381.206	163.08
381.645	107.25
382.085	214.05
382.524	136.38
382.963	189.78
383.402	223.76
383.841	187.35
384.28	209.2
384.719	206.77
385.158	175.22
385.596	155.8
386.035	172.79
386.474	201.91
386.913	180.07
387.351	155.8
387.79	209.2
388.228	107.25
388.667	109.68
389.105	124.24
389.544	155.8
389.982	136.38
390.42	148.52
390.859	131.53
391.297	197.06
391.735	165.51
392.173	182.5
392.611	243.18
393.049	163.08
393.487	167.93
393.925	90.26
394.363	165.51
394.801	116.96
395.239	73.27
395.676	177.64
396.114	163.08
396.552	129.1
396.989	148.52
397.427	90.26
397.864	197.06
398.302	160.65
398.739	194.63
399.177	121.82
399.614	201.91
400.051	141.23
400.488	184.92
400.926	119.39
401.363	153.37
401.8	214.05
402.237	286.87
402.674	112.11
403.111	112.11
403.548	163.08
403.985	155.8
404.421	163.08
404.858	167.93
405.295	155.8
405.732	167.93
406.168	182.5
406.605	160.65
407.041	180.07
407.478	194.63
407.914	138.81
408.351	146.09
408.787	136.38
409.223	189.78
409.66	138.81
410.096	206.77
410.532	184.92
410.968	172.79
411.404	150.94
411.84	167.93
412.276	92.69
412.712	206.77
413.148	197.06
413.584	238.32
414.02	129.1
414.455	201.91
414.891	172.79
415.327	95.12
415.762	163.08
416.198	107.25
416.633	180.07
417.069	177.64
417.504	129.1
417.94	192.21
418.375	204.34
418.81	155.8
419.245	197.06
419.681	112.11
420.116	214.05
420.551	109.68
420.986	146.09
421.421	163.08
421.856	126.67
422.291	172.79
422.726	182.5
423.16	204.34
423.595	153.37
424.03	231.04
424.464	182.5
424.899	133.95
425.334	112.11
425.768	175.22
426.203	90.26
426.637	189.78
427.071	129.1
427.506	163.08
427.94	248.03
428.374	138.81
428.809	201.91
429.243	180.07
429.677	204.34
430.111	141.23
430.545	177.64
430.979	170.36
431.413	231.04
431.847	197.06
432.28	199.49
432.714	148.52
433.148	49
433.582	187.35
434.015	129.1
434.449	170.36
434.882	182.5
435.316	146.09
435.749	124.24
436.183	109.68
436.616	143.66
437.049	197.06
437.483	160.65
437.916	197.06
438.349	218.91
438.782	226.19
439.215	114.53
439.648	155.8
440.081	160.65
440.514	199.49
440.947	136.38
441.38	129.1
441.813	209.2
442.245	252.89
442.678	172.79
443.111	121.82
443.543	175.22
443.976	143.66
444.408	146.09
444.841	163.08
445.273	209.2
445.705	233.47
446.138	184.92
446.57	163.08
447.002	141.23
447.434	143.66
447.867	175.22
448.299	211.62
448.731	192.21
449.163	189.78
449.595	228.61
450.026	131.53
450.458	146.09
450.89	136.38
451.322	150.94
451.754	136.38
452.185	228.61
452.617	138.81
453.048	240.75
453.48	155.8
453.911	206.77
454.343	187.35
454.774	194.63
455.205	175.22
455.637	155.8
456.068	206.77
456.499	107.25
456.93	172.79
457.361	158.22
457.792	214.05
458.223	158.22
458.654	204.34
459.085	107.25
459.516	116.96
459.947	102.4
460.378	223.76
460.808	165.51
461.239	192.21
461.669	177.64
462.1	194.63
462.531	165.51
462.961	143.66
463.391	214.05
463.822	226.19
464.252	109.68
464.682	158.22
465.113	116.96
465.543	158.22
465.973	165.51
466.403	180.07
466.833	192.21
467.263	218.91
467.693	172.79
468.123	170.36
468.553	245.6
468.983	223.76
469.412	167.93
469.842	197.06
470.272	245.6
470.701	231.04
471.131	243.18
471.56	182.5
471.99	160.65
472.419	187.35
472.849	177.64
473.278	214.05
473.707	170.36
474.136	218.91
474.566	231.04
474.995	184.92
475.424	206.77
475.853	182.5
476.282	201.91
476.711	170.36
477.14	238.32
477.569	214.05
477.997	160.65
478.426	223.76
478.855	245.6
479.283	180.07
479.712	199.49
480.141	167.93
480.569	204.34
480.998	233.47
481.426	138.81
481.854	180.07
482.283	167.93
482.711	199.49
483.139	187.35
483.567	170.36
483.995	180.07
484.424	124.24
484.852	160.65
485.28	197.06
485.708	170.36
486.135	211.62
486.563	204.34
486.991	226.19
487.419	177.64
487.847	204.34
488.274	99.97
488.702	201.91
489.129	146.09
489.557	172.79
489.984	238.32
490.412	112.11
490.839	197.06
491.266	194.63
491.694	226.19
492.121	228.61
492.548	175.22
492.975	221.33
493.402	177.64
493.829	141.23
494.256	226.19
494.683	167.93
495.11	209.2
495.537	163.08
495.964	233.47
496.39	172.79
496.817	243.18
497.244	182.5
497.67	199.49
498.097	158.22
498.523	221.33
498.95	143.66
499.376	197.06
499.803	175.22
500.229	143.66
500.655	189.78
501.081	158.22
501.508	194.63
501.934	177.64
502.36	129.1
502.786	260.17
503.212	148.52
503.638	153.37
504.064	201.91
504.489	240.75
504.915	189.78
505.341	172.79
505.767	243.18
506.192	218.91
506.618	165.51
507.043	170.36
507.469	150.94
507.894	136.38
508.32	211.62
508.745	182.5
509.17	155.8
509.596	119.39
510.021	197.06
510.446	177.64
510.871	209.2
511.296	146.09
511.721	194.63
512.146	199.49
512.571	172.79
512.996	235.9
513.421	148.52
513.845	138.81
514.27	206.77
514.695	218.91
515.119	146.09
515.544	172.79
515.969	146.09
516.393	160.65
516.817	194.63
517.242	146.09
517.666	218.91
518.09	172.79
518.515	172.79
518.939	153.37
519.363	405.8
519.787	175.22
520.211	180.07
520.635	141.23
521.059	124.24
521.483	238.32
521.907	172.79
522.331	170.36
522.754	150.94
523.178	201.91
523.602	172.79
524.025	153.37
524.449	180.07
524.872	163.08
525.296	204.34
525.719	150.94
526.143	148.52
526.566	138.81
526.989	170.36
527.412	175.22
527.836	129.1
528.259	199.49
528.682	199.49
529.105	143.66
529.528	148.52
529.951	175.22
530.374	182.5
530.796	143.66
531.219	182.5
531.642	182.5
532.065	104.83
532.487	199.49
532.91	175.22
533.332	165.51
533.755	153.37
534.177	121.82
534.6	167.93
535.022	197.06
535.444	121.82
535.867	189.78
536.289	82.98
536.711	82.98
537.133	199.49
537.555	180.07
537.977	211.62
538.399	165.51
538.821	182.5
539.243	87.84
539.665	187.35
540.086	187.35
540.508	211.62
540.93	201.91
541.351	180.07
541.773	216.48
542.195	221.33
542.616	267.45
543.037	354.83
543.459	206.77
543.88	223.76
544.301	187.35
544.723	255.31
545.144	282.01
545.565	260.17
545.986	337.84
546.407	308.71
546.828	170.36
547.249	124.24
547.67	194.63
548.091	124.24
548.512	187.35
548.932	184.92
549.353	255.31
549.774	221.33
550.194	201.91
550.615	260.17
551.035	216.48
551.456	107.25
551.876	167.93
552.296	209.2
552.717	209.2
553.137	116.96
553.557	126.67
553.977	148.52
554.397	167.93
554.817	141.23
555.237	172.79
555.657	184.92
556.077	184.92
556.497	129.1
556.917	240.75
557.337	228.61
557.756	233.47
558.176	121.82
558.596	187.35
559.015	204.34
559.435	175.22
559.854	146.09
560.274	274.73
560.693	235.9
561.112	167.93
561.532	209.2
561.951	233.47
562.37	197.06
562.789	133.95
563.208	228.61
563.627	146.09
564.046	163.08
564.465	197.06
564.884	226.19
565.303	199.49
565.722	226.19
566.14	180.07
566.559	158.22
566.978	255.31
567.396	226.19
567.815	175.22
568.233	194.63
568.652	204.34
569.07	199.49
569.489	175.22
569.907	131.53
570.325	150.94
570.743	124.24
571.161	194.63
571.58	107.25
571.998	148.52
572.416	199.49
572.833	172.79
573.251	165.51
573.669	221.33
574.087	216.48
574.505	119.39
574.922	209.2
575.34	216.48
575.758	180.07
576.175	187.35
576.593	160.65
577.01	160.65
577.428	206.77
577.845	1833.01
578.262	279.59
578.68	218.91
579.097	226.19
579.514	167.93
579.931	177.64
580.348	204.34
580.765	180.07
581.182	313.57
581.599	165.51
582.016	180.07
582.433	109.68
582.849	143.66
583.266	211.62
583.683	146.09
584.099	148.52
584.516	211.62
584.933	165.51
585.349	243.18
585.765	167.93
586.182	189.78
586.598	141.23
587.014	235.9
587.431	214.05
587.847	175.22
588.263	167.93
588.679	180.07
589.095	175.22
589.511	182.5
589.927	209.2
590.343	194.63
590.759	167.93
591.174	138.81
591.59	153.37
592.006	235.9
592.421	231.04
592.837	187.35
593.252	82.98
593.668	87.84
594.083	175.22
594.499	150.94
594.914	221.33
595.329	189.78
595.745	214.05
596.16	274.73
596.575	165.51
596.99	165.51
597.405	146.09
597.82	165.51
598.235	187.35
598.65	87.84
599.065	133.95
599.479	182.5
599.894	158.22
600.309	206.77
600.724	231.04
601.138	155.8
601.553	226.19
601.967	218.91
602.382	199.49
602.796	175.22
603.21	163.08
603.625	143.66
604.039	182.5
604.453	187.35
604.867	233.47
605.281	189.78
605.695	119.39
606.109	172.79
606.523	209.2
606.937	201.91
607.351	318.42
607.765	155.8
608.178	192.21
608.592	199.49
609.006	167.93
609.419	136.38
609.833	211.62
610.246	182.5
610.66	240.75
611.073	364.54
611.487	233.47
611.9	211.62
612.313	245.6
612.726	235.9
613.139	206.77
613.553	170.36
613.966	265.02
614.379	265.02
614.792	177.64
615.204	148.52
615.617	143.66
616.03	138.81
616.443	158.22
616.856	153.37
617.268	131.53
617.681	197.06
618.093	204.34
618.506	192.21
618.918	211.62
619.331	233.47
619.743	238.32
620.155	138.81
620.568	206.77
620.98	153.37
621.392	211.62
621.804	218.91
622.216	194.63
622.628	250.46
623.04	226.19
623.452	148.52
623.864	206.77
624.276	187.35
624.687	163.08
625.099	114.53
625.511	114.53
625.922	204.34
626.334	201.91
626.745	199.49
627.157	192.21
627.568	160.65
627.979	170.36
628.391	204.34
628.802	248.03
629.213	199.49
629.624	238.32
630.035	160.65
630.446	214.05
630.857	180.07
631.268	209.2
631.679	158.22
632.09	155.8
632.501	175.22
632.912	214.05
633.322	235.9
633.733	206.77
634.144	170.36
634.554	201.91
634.965	175.22
635.375	201.91
635.785	153.37
636.196	155.8
636.606	233.47
637.016	187.35
637.427	192.21
637.837	233.47
638.247	143.66
638.657	133.95
639.067	218.91
639.477	187.35
639.887	172.79
640.297	175.22
640.706	218.91
641.116	133.95
641.526	160.65
641.935	214.05
642.345	160.65
642.755	209.2
643.164	150.94
643.573	199.49
643.983	223.76
644.392	240.75
644.801	102.4
645.211	112.11
645.62	150.94
646.029	260.17
646.438	160.65
646.847	209.2
647.256	150.94
647.665	184.92
648.074	177.64
648.483	112.11
648.892	163.08
649.3	223.76
649.709	172.79
650.118	218.91
650.526	209.2
650.935	192.21
651.343	172.79
651.752	177.64
652.16	160.65
652.568	218.91
652.977	184.92
653.385	201.91
653.793	228.61
654.201	158.22
654.609	119.39
655.017	204.34
655.425	155.8
655.833	133.95
656.241	92.69
656.649	201.91
657.057	218.91
657.464	167.93
657.872	189.78
658.28	199.49
658.687	255.31
659.095	133.95
659.502	141.23
659.91	206.77
660.317	138.81
660.724	194.63
661.132	170.36
661.539	133.95
661.946	187.35
662.353	124.24
662.76	148.52
663.167	167.93
663.574	99.97
663.981	172.79
664.388	163.08
664.795	146.09
665.202	172.79
665.608	240.75
666.015	177.64
666.422	218.91
666.828	107.25
667.235	141.23
667.641	197.06
668.047	197.06
668.454	199.49
668.86	245.6
669.266	177.64
669.673	165.51
670.079	218.91
670.485	170.36
670.891	226.19
671.297	170.36
671.703	138.81
672.109	206.77
672.515	116.96
672.92	238.32
673.326	187.35
673.732	214.05
674.138	119.39
674.543	167.93
674.949	172.79
675.354	274.73
675.76	216.48
676.165	165.51
676.57	170.36
676.976	158.22
677.381	197.06
677.786	177.64
678.191	182.5
678.596	153.37
679.001	163.08
679.406	187.35
679.811	211.62
680.216	158.22
680.621	194.63
681.026	187.35
681.43	150.94
681.835	216.48
682.24	155.8
682.644	204.34
683.049	136.38
683.453	141.23
683.858	175.22
684.262	167.93
684.667	155.8
685.071	211.62
685.475	182.5
685.879	211.62
686.283	177.64
686.687	172.79
687.091	170.36
687.495	155.8
687.899	214.05
688.303	182.5
688.707	184.92
689.111	194.63
689.514	216.48
689.918	136.38
690.322	165.51
690.725	121.82
691.129	177.64
691.532	252.89
691.936	177.64
692.339	209.2
692.742	197.06
693.146	182.5
693.549	223.76
693.952	226.19
694.355	150.94
694.758	133.95
695.161	235.9
695.564	158.22
695.967	172.79
696.37	141.23
696.773	102.4
697.175	155.8
697.578	216.48
697.981	218.91
698.383	226.19
698.786	172.79
699.188	226.19
699.591	206.77
699.993	163.08
700.395	170.36
700.798	221.33
701.2	189.78
701.602	126.67
702.004	155.8
702.406	163.08
702.808	160.65
703.21	214.05
703.612	301.43
704.014	170.36
704.416	167.93
704.818	233.47
705.219	214.05
705.621	180.07
706.023	231.04
706.424	206.77
706.826	286.87
707.227	177.64
707.629	167.93
708.03	146.09
708.431	192.21
708.832	311.14
709.234	296.58
709.635	328.13
710.036	172.79
710.437	238.32
710.838	269.88
711.239	211.62
711.64	233.47
712.041	243.18
712.441	235.9
712.842	240.75
713.243	235.9
713.643	231.04
714.044	209.2
714.445	238.32
714.845	240.75
715.246	252.89
715.646	284.44
716.046	235.9
716.447	262.6
716.847	243.18
717.247	340.27
717.647	260.17
718.047	400.95
718.447	311.14
718.847	369.39
719.247	301.43
719.647	354.83
720.047	354.83
720.446	417.94
720.846	330.56
721.246	388.81
721.645	352.4
722.045	349.98
722.444	284.44
722.844	381.53
723.243	415.51
723.643	357.26
724.042	388.81
724.441	403.37
724.84	374.25
725.24	415.51
725.639	454.35
726.038	488.33
726.437	493.18
726.836	502.89
727.234	539.3
727.633	585.42
728.032	524.74
728.431	650.95
728.83	667.94
729.228	706.78
729.627	740.76
730.025	665.51
730.424	740.76
730.822	927.65
731.22	813.57
731.619	1034.45
732.017	1058.72
732.415	1165.52
732.813	1252.9
733.212	1340.28
733.61	1464.07
734.008	1592.71
734.406	1638.83
734.803	1675.24
735.201	1879.13
735.599	2061.17
735.997	2019.9
736.395	2116.99
736.792	2235.93
737.19	2498.07
737.587	2650.98
737.985	2699.53
738.382	2750.5
738.78	3002.93
739.177	3010.21
739.574	3184.97
739.971	3359.73
740.369	3626.73
740.766	3833.04
741.163	4131.59
741.56	4245.67
741.957	4243.24
742.354	4250.52
742.751	4464.12
743.147	4670.43
743.544	4876.74
743.941	5104.9
744.338	5675.3
744.734	6056.37
745.131	6146.18
745.527	6595.22
745.924	6592.79
746.32	6869.49
746.716	6799.1
747.113	7236
747.509	7869.51
747.905	8236.02
748.301	8566.12
748.697	9337.98
749.093	9874.4
749.489	10153.53
749.885	10459.36
750.281	10871.98
750.677	10660.82
751.073	11284.61
751.468	11476.36
751.864	12311.33
752.26	12726.38
752.655	13845.33
753.051	14512.82
753.446	15991
753.842	16512.85
754.237	16932.76
754.632	17406.07
755.028	17134.22
755.423	16918.19
755.818	16884.21
756.213	17102.66
756.608	17107.52
757.003	17656.07
757.398	18258.02
757.793	18964.34
758.188	19826.01
758.583	20566.31
758.977	20668.25
759.372	21262.92
759.767	22141.58
760.161	22940.13
760.556	22998.39
760.95	23178
761.345	23969.27
761.739	24913.46
762.133	25379.49
762.527	27071.26
762.922	28170.8
763.316	30073.74
763.71	31134.43
764.104	32321.35
764.498	32784.95
764.892	33799.52
765.286	33767.97
765.68	34064.09
766.073	34209.73
766.467	33401.46
766.861	33360.2
767.255	34585.94
767.648	35056.83
768.042	35340.81
768.435	36251.02
768.829	37602.98
769.222	38889.41
769.615	40649.15
770.008	41887.03
770.402	43061.8
770.795	44542.41
771.188	44379.79
771.581	43765.7
771.974	43552.1
772.367	42263.25
772.76	41326.34
773.153	39353.01
773.545	37695.22
773.938	36882.1
774.331	36913.65
774.724	37018.02
775.116	37971.92
775.509	39530.2
775.901	41889.46
776.294	43668.61
776.686	44957.47
777.078	48183.24
777.471	50282.79
777.863	52542.53
778.255	54836.26
778.647	55926.08
779.039	56896.97
779.431	56853.28
779.823	56367.84
780.215	56367.84
780.607	55074.13
780.999	55595.98
781.39	53387.21
781.782	52139.62
782.174	50714.84
782.565	49731.81
782.957	48756.07
783.348	48311.89
783.74	47947.8
784.131	46382.24
784.522	46057
784.914	46127.39
785.305	47185.66
785.696	47809.45
786.087	49125.01
786.478	49896.86
786.869	48952.67
787.26	50061.91
787.651	50717.26
788.042	52037.67
788.433	51989.13
788.823	52486.71
789.214	52277.97
789.605	51574.07
789.995	51248.83
790.386	50435.71
790.776	51074.07
791.167	50435.71
791.557	51151.74
791.948	50909.01
792.338	49940.55
792.728	51251.25
793.118	49945.41
793.508	49154.13
793.898	48027.9
794.288	46408.94
794.678	45828.84
795.068	44816.69
795.458	42882.19
795.848	42297.23
796.238	40913.71
796.627	38833.58
797.017	37520.46
797.406	36940.35
797.796	35115.08
798.185	34874.78
798.575	34649.05
798.964	33906.32
799.354	33469.42
799.743	32872.33
800.132	32714.56
800.521	32670.87
800.91	33044.66
801.299	33030.1
801.688	32532.51
802.077	31920.85
802.466	32377.17
802.855	33411.17
803.244	32153.87
803.633	32459.7
804.021	32034.93
804.41	31991.24
804.799	31748.52
805.187	31600.46
805.576	31464.54
805.964	30879.58
806.352	30207.24
806.741	30394.13
807.129	30275.2
807.517	30185.39
807.905	30576.17
808.293	31199.97
808.681	31161.13
809.069	31360.17
809.457	32515.52
809.845	32692.71
810.233	32969.41
810.621	33748.55
811.009	33644.18
811.396	33420.88
811.784	34139.34
812.171	33894.19
812.559	33937.88
812.946	33680.59
813.334	33054.37
813.721	32561.64
814.108	31821.34
814.496	31670.85
814.883	31384.44
815.27	31670.85
815.657	31051.91
816.044	31022.78
816.431	30656.27
816.818	30185.39
817.205	29954.8
817.592	29707.23
817.979	29454.8
818.365	28559.15
818.752	27881.96
819.139	26469.31
819.525	25653.77
819.912	25022.69
820.298	23444.99
820.685	22743.53
821.071	22209.54
821.457	21488.65
821.843	20151.25
822.23	19413.38
822.616	18719.19
823.002	17461.89
823.388	16656.05
823.774	15731.28
824.16	14643.89
824.546	14107.47
824.931	13736.11
825.317	13568.63
825.703	12808.91
826.089	12381.72
826.474	12075.89
826.86	11740.93
827.245	11617.14
827.631	11401.12
828.016	11165.68
828.401	10692.37
828.787	10505.47
829.172	10202.07
829.557	9949.64
829.942	9731.19
830.327	9619.54
830.712	9469.05
831.097	9352.54
831.482	9449.63
831.867	9330.7
832.252	9270.02
832.636	9500.6
833.021	9619.54
833.406	9888.96
833.79	9728.76
834.175	9896.24
834.559	10260.32
834.944	10279.74
835.328	10401.1
835.713	10427.8
836.097	10364.69
836.481	10214.21
836.865	10461.78
837.249	10189.93
837.633	10034.59
838.017	10032.16
838.401	9736.04
838.785	9347.69
839.169	9308.85
839.553	9143.8
839.937	8469.03
840.32	8238.45
840.704	7680.19
841.087	7483.58
841.471	7036.97
841.854	6687.45
842.238	6357.35
842.621	5954.43
843.004	5808.8
843.388	5473.84
843.771	5129.18
844.154	4874.32
844.537	4651.01
844.92	4340.33
845.303	4252.95
845.686	3862.17
846.069	3765.08
846.452	3619.44
846.834	3607.31
847.217	3167.98
847.6	3068.46
847.982	3233.52
848.365	3214.1
848.748	3058.76
849.13	3083.03
849.512	3036.91
849.895	3087.88
850.277	2981.08
850.659	3243.22
851.041	3289.34
851.423	3393.71
851.806	3284.49
852.188	3420.41
852.57	3391.28
852.951	3330.6
853.333	3347.59
853.715	3269.92
854.097	3320.9
854.479	3126.72
854.86	2954.38
855.242	2791.76
855.623	2619.43
856.005	2524.77
856.386	2350.01
856.768	2206.8
857.149	2112.14
857.53	1981.07
857.911	1850
858.292	1684.95
858.674	1549.02
859.055	1456.79
859.436	1354.85
859.817	1357.27
860.197	1299.02
860.578	1311.16
860.959	1252.9
861.34	1316.01
861.72	1223.78
862.101	1189.79
862.482	1216.49
862.862	1180.09
863.243	1233.48
863.623	1204.36
864.003	1051.44
864.384	1034.45
864.764	1092.71
865.144	1022.32
865.524	1056.3
865.904	973.77
866.284	876.68
866.664	789.3
867.044	811.15
867.424	852.41
867.804	779.59
868.183	801.44
868.563	670.37
868.943	723.77
869.322	655.81
869.702	638.81
870.081	597.55
870.461	648.52
870.84	641.24
871.22	609.69
871.599	580.56
871.978	546.58
872.357	558.72
872.736	493.18
873.115	536.87
873.494	413.08
873.873	437.36
874.252	442.21
874.631	471.34
875.01	383.96
875.388	393.67
875.767	415.51
876.146	391.24
876.524	427.65
876.903	398.52
877.281	352.4
877.66	303.86
878.038	354.83
878.416	345.12
878.794	274.73
879.173	296.58
879.551	359.68
879.929	286.87
880.307	260.17
880.685	320.85
881.063	311.14
881.441	330.56
881.818	255.31
882.196	223.76
882.574	221.33
882.951	228.61
883.329	231.04
883.707	257.74
884.084	274.73
884.461	277.16
884.839	252.89
885.216	199.49
885.593	262.6
885.971	235.9
886.348	233.47
886.725	262.6
887.102	257.74
887.479	231.04
887.856	250.46
888.233	248.03
888.609	262.6
888.986	204.34
889.363	218.91
889.74	187.35
890.116	175.22
890.493	206.77
890.869	223.76
891.246	221.33
891.622	170.36
891.998	204.34
892.375	192.21
892.751	211.62
893.127	323.28
893.503	170.36
893.879	172.79
894.255	201.91
894.631	216.48
895.007	167.93
895.383	153.37
895.759	204.34
896.134	243.18
896.51	260.17
896.886	182.5
897.261	165.51
897.637	189.78
898.012	197.06
898.388	192.21
898.763	121.82
899.138	133.95
899.514	223.76
899.889	216.48
900.264	136.38
900.639	257.74
901.014	172.79
901.389	124.24
901.764	150.94
902.139	175.22
902.513	102.4
902.888	155.8
903.263	160.65
903.638	90.26
904.012	240.75
904.387	143.66
904.761	158.22
905.136	124.24
905.51	218.91
905.884	90.26
906.259	167.93
906.633	143.66
907.007	138.81
907.381	214.05
907.755	167.93
908.129	175.22
908.503	102.4
908.877	116.96
909.251	114.53
909.624	172.79
909.998	160.65
910.372	197.06
910.745	116.96
911.119	248.03
911.492	136.38
911.866	153.37
912.239	201.91
912.612	184.92
912.986	184.92
913.359	92.69
913.732	170.36
914.105	209.2
914.478	180.07
914.851	187.35
915.224	116.96
915.597	233.47
915.97	180.07
916.343	221.33
916.715	158.22
917.088	133.95
917.461	107.25
917.833	180.07
918.206	95.12
918.578	182.5
918.951	204.34
919.323	231.04
919.695	138.81
920.067	155.8
920.44	109.68
920.812	187.35
921.184	187.35
921.556	126.67
921.928	175.22
922.3	221.33
922.672	199.49
923.043	153.37
923.415	204.34
923.787	87.84
924.158	165.51
924.53	167.93
924.901	223.76
925.273	180.07
925.644	148.52
926.016	163.08
926.387	187.35
926.758	136.38
927.129	158.22
927.5	153.37
927.872	116.96
928.243	214.05
928.613	129.1
928.984	209.2
929.355	119.39
929.726	141.23
930.097	182.5
930.467	143.66
930.838	223.76
931.209	155.8
931.579	194.63
931.95	209.2
932.32	82.98
932.69	216.48
933.061	102.4
933.431	194.63
933.801	70.84
934.171	187.35
934.541	138.81
934.911	141.23
935.281	109.68
935.651	153.37
936.021	180.07
936.391	216.48
936.761	163.08
937.13	182.5
937.5	204.34
937.87	136.38
938.239	160.65
938.609	189.78
938.978	218.91
939.347	116.96
939.717	85.41
940.086	204.34
940.455	201.91
940.824	138.81
941.193	214.05
941.562	180.07
941.931	167.93
942.3	197.06
942.669	214.05
943.038	192.21
943.407	126.67
943.775	116.96
944.144	155.8
944.513	167.93
944.881	182.5
945.25	165.51
945.618	133.95
945.986	131.53
946.355	187.35
946.723	146.09
947.091	226.19
947.459	112.11
947.827	165.51
948.195	146.09
948.563	136.38
948.931	199.49
949.299	165.51
949.667	160.65
950.035	165.51
950.402	172.79
950.77	216.48
951.138	126.67
951.505	119.39
951.873	153.37
952.24	143.66
952.607	165.51
952.975	133.95
953.342	182.5
953.709	99.97
954.076	119.39
954.443	201.91
954.81	214.05
955.177	172.79
955.544	172.79
955.911	184.92
956.278	170.36
956.645	221.33
957.012	163.08
957.378	158.22
957.745	143.66
958.111	104.83
958.478	112.11
958.844	243.18
959.211	182.5
959.577	143.66
959.943	148.52
960.309	233.47
960.675	165.51
961.042	170.36
961.408	143.66
961.774	102.4
962.139	150.94
962.505	121.82
962.871	92.69
963.237	175.22
963.603	177.64
963.968	184.92
964.334	189.78
964.699	170.36
965.065	124.24
965.43	165.51
965.796	197.06
966.161	180.07
966.526	153.37
966.891	201.91
967.256	121.82
967.622	114.53
967.987	175.22
968.352	138.81
968.716	131.53
969.081	150.94
969.446	141.23
969.811	160.65
970.176	143.66
970.54	170.36
970.905	160.65
971.269	184.92
971.634	167.93
971.998	146.09
972.363	201.91
972.727	68.42
973.091	197.06
973.455	184.92
973.819	126.67
974.183	175.22
974.547	85.41
974.911	136.38
975.275	136.38
975.639	131.53
976.003	184.92
976.367	85.41
976.73	192.21
977.094	155.8
977.458	163.08
977.821	170.36
978.185	160.65
978.548	165.51
978.911	153.37
979.275	170.36
979.638	138.81
980.001	92.69
980.364	180.07
980.727	153.37
981.09	209.2
981.453	214.05
981.816	206.77
982.179	199.49
982.542	129.1
982.905	153.37
983.267	163.08
983.63	180.07
983.992	206.77
984.355	167.93
984.717	223.76
985.08	143.66
985.442	163.08
985.804	175.22
986.167	97.54
986.529	214.05
986.891	206.77
987.253	182.5
987.615	158.22
987.977	61.14
988.339	218.91
988.701	143.66
989.062	177.64
989.424	148.52
989.786	131.53
990.147	243.18
990.509	167.93
990.87	165.51
991.232	180.07
991.593	182.5
991.955	184.92
992.316	172.79
992.677	129.1
993.038	143.66
993.399	155.8
993.76	141.23
994.121	167.93
994.482	153.37
994.843	131.53
995.204	177.64
995.565	192.21
995.926	82.98
996.286	180.07
996.647	221.33
997.007	192.21
997.368	165.51
997.728	158.22
998.089	158.22
998.449	136.38
998.809	194.63
999.169	216.48
999.53	68.42
999.89	143.66
1000.25	153.37
1000.61	136.38
1000.97	143.66
1001.329	102.4
1001.689	133.95
1002.049	158.22
1002.409	148.52
1002.768	167.93
1003.128	192.21
1003.487	92.69
1003.847	182.5
1004.206	109.68
1004.566	160.65
1004.925	177.64
1005.284	112.11
1005.643	209.2
1006.003	184.92
1006.362	172.79
1006.721	136.38
1007.08	153.37
1007.438	131.53
1007.797	175.22
1008.156	129.1
1008.515	192.21
1008.874	245.6
1009.232	199.49
1009.591	126.67
1009.949	129.1
1010.308	116.96
1010.666	221.33
1011.024	197.06
1011.383	129.1
1011.741	99.97
1012.099	109.68
1012.457	175.22
1012.815	201.91
1013.173	143.66
1013.531	87.84
1013.889	177.64
1014.247	177.64
1014.605	121.82
1014.962	199.49
1015.32	129.1
1015.678	148.52
1016.035	235.9
1016.393	148.52
1016.75	206.77
1017.107	199.49
1017.465	163.08
1017.822	175.22
1018.179	150.94
1018.536	129.1
1018.894	133.95
1019.251	172.79
1019.608	218.91
1019.964	223.76
1020.321	160.65
1020.678	192.21
1021.035	248.03
1021.392	192.21
1021.748	138.81
1022.105	165.51
1022.461	131.53
1022.818	218.91
1023.174	170.36
1023.531	138.81
1023.887	87.84
1024.243	221.33
1024.599	143.66
1024.955	133.95
1025.311	187.35
1025.667	124.24
1026.023	141.23
1026.379	170.36
1026.735	131.53
1027.091	150.94
1027.447	182.5
