189.514	120.3
189.973	120.3
190.431	120.3
190.889	8.65
191.348	-10.77
191.806	28.06
192.264	-13.2
192.722	-71.45
193.18	-35.04
193.638	6.22
194.096	-47.18
194.554	-5.92
195.012	8.65
195.47	15.93
195.928	13.5
196.385	-56.89
196.843	-10.77
197.301	110.59
197.758	45.06
198.216	-47.18
198.674	69.33
199.131	18.36
199.589	49.91
200.046	62.05
200.503	40.2
200.961	100.88
201.418	79.04
201.875	105.74
202.332	151.85
202.79	93.6
203.247	113.02
203.704	122.73
204.161	122.73
204.618	173.7
205.075	190.69
205.532	130.01
205.989	103.31
206.445	130.01
206.902	166.42
207.359	156.71
207.816	147
208.272	130.01
208.729	151.85
209.185	149.43
209.642	200.4
210.098	163.99
210.555	122.73
211.011	190.69
211.467	217.39
211.924	166.42
212.38	183.41
212.836	163.99
213.292	130.01
213.748	127.58
214.204	127.58
214.66	127.58
215.116	115.44
215.572	108.16
216.028	222.24
216.484	161.56
216.94	234.38
217.396	173.7
217.851	147
218.307	117.87
218.763	130.01
219.218	81.46
219.674	88.75
220.129	154.28
220.585	91.17
221.04	159.13
221.496	178.55
221.951	156.71
222.406	144.57
222.861	166.42
223.317	86.32
223.772	110.59
224.227	202.82
224.682	132.44
225.137	79.04
225.592	147
226.047	142.14
226.502	110.59
226.957	142.14
227.411	142.14
227.866	108.16
228.321	117.87
228.776	149.43
229.23	227.1
229.685	171.27
230.139	193.12
230.594	161.56
231.048	163.99
231.503	130.01
231.957	149.43
232.411	127.58
232.865	180.98
233.32	168.84
233.774	197.97
234.228	142.14
234.682	161.56
235.136	120.3
235.59	125.15
236.044	147
236.498	149.43
236.952	132.44
237.406	200.4
237.86	139.72
238.313	144.57
238.767	134.86
239.221	142.14
239.674	171.27
240.128	105.74
240.581	139.72
241.035	185.83
241.488	173.7
241.942	137.29
242.395	100.88
242.848	149.43
243.301	185.83
243.755	200.4
244.208	166.42
244.661	178.55
245.114	159.13
245.567	178.55
246.02	132.44
246.473	103.31
246.926	127.58
247.379	144.57
247.832	163.99
248.284	163.99
248.737	299.91
249.19	154.28
249.642	156.71
250.095	190.69
250.547	188.26
251	156.71
251.452	144.57
251.905	98.45
252.357	161.56
252.81	180.98
253.262	173.7
253.714	171.27
254.166	88.75
254.618	151.85
255.07	144.57
255.523	103.31
255.975	154.28
256.427	142.14
256.878	149.43
257.33	130.01
257.782	113.02
258.234	144.57
258.686	144.57
259.137	86.32
259.589	93.6
260.041	156.71
260.492	132.44
260.944	110.59
261.395	154.28
261.847	142.14
262.298	200.4
262.749	130.01
263.201	139.72
263.652	161.56
264.103	207.68
264.554	103.31
265.005	125.15
265.457	161.56
265.908	161.56
266.359	212.53
266.809	52.34
267.26	166.42
267.711	108.16
268.162	159.13
268.613	147
269.064	86.32
269.514	154.28
269.965	127.58
270.415	219.82
270.866	200.4
271.316	190.69
271.767	144.57
272.217	193.12
272.668	142.14
273.118	139.72
273.568	79.04
274.019	49.91
274.469	127.58
274.919	214.96
275.369	159.13
275.819	154.28
276.269	147
276.719	207.68
277.169	120.3
277.619	173.7
278.069	151.85
278.518	161.56
278.968	178.55
279.418	195.54
279.867	127.58
280.317	183.41
280.767	132.44
281.216	183.41
281.666	207.68
282.115	144.57
282.564	105.74
283.014	98.45
283.463	178.55
283.912	132.44
284.361	127.58
284.811	115.44
285.26	117.87
285.709	171.27
286.158	105.74
286.607	159.13
287.056	183.41
287.505	159.13
287.953	159.13
288.402	139.72
288.851	149.43
289.3	156.71
289.748	161.56
290.197	108.16
290.646	147
291.094	134.86
291.543	147
291.991	154.28
292.439	147
292.888	144.57
293.336	180.98
293.784	190.69
294.233	178.55
294.681	159.13
295.129	214.96
295.577	190.69
296.025	137.29
296.473	142.14
296.921	176.13
297.369	180.98
297.817	137.29
298.264	183.41
298.712	246.51
299.16	185.83
299.608	151.85
300.055	127.58
300.503	149.43
300.95	147
301.398	159.13
301.845	113.02
302.293	137.29
302.74	134.86
303.187	149.43
303.635	137.29
304.082	100.88
304.529	180.98
304.976	224.67
305.423	139.72
305.87	132.44
306.317	176.13
306.764	149.43
307.211	161.56
307.658	202.82
308.105	115.44
308.552	171.27
308.998	190.69
309.445	154.28
309.892	168.84
310.338	163.99
310.785	178.55
311.231	227.1
311.678	171.27
312.124	127.58
312.571	105.74
313.017	113.02
313.463	132.44
313.909	168.84
314.356	132.44
314.802	197.97
315.248	168.84
315.694	207.68
316.14	127.58
316.586	125.15
317.032	231.95
317.478	137.29
317.923	125.15
318.369	130.01
318.815	100.88
319.261	120.3
319.706	200.4
320.152	130.01
320.597	154.28
321.043	205.25
321.488	137.29
321.934	227.1
322.379	130.01
322.824	134.86
323.27	183.41
323.715	105.74
324.16	147
324.605	115.44
325.05	171.27
325.495	156.71
325.94	195.54
326.385	134.86
326.83	176.13
327.275	144.57
327.72	125.15
328.165	163.99
328.61	132.44
329.054	161.56
329.499	183.41
329.943	171.27
330.388	137.29
330.832	142.14
331.277	122.73
331.721	149.43
332.166	195.54
332.61	142.14
333.054	173.7
333.499	127.58
333.943	147
334.387	113.02
334.831	185.83
335.275	110.59
335.719	183.41
336.163	115.44
336.607	81.46
337.051	142.14
337.495	147
337.938	166.42
338.382	149.43
338.826	200.4
339.269	176.13
339.713	122.73
340.157	207.68
340.6	251.37
341.044	132.44
341.487	125.15
341.93	147
342.374	108.16
342.817	137.29
343.26	154.28
343.703	214.96
344.146	83.89
344.59	47.48
345.033	142.14
345.476	139.72
345.919	185.83
346.361	144.57
346.804	163.99
347.247	115.44
347.69	147
348.133	149.43
348.575	122.73
349.018	205.25
349.461	241.66
349.903	159.13
350.346	144.57
350.788	193.12
351.23	163.99
351.673	137.29
352.115	166.42
352.557	188.26
353	173.7
353.442	173.7
353.884	134.86
354.326	154.28
354.768	217.39
355.21	98.45
355.652	161.56
356.094	117.87
356.536	171.27
356.978	134.86
357.419	161.56
357.861	147
358.303	178.55
358.744	163.99
359.186	147
359.627	137.29
360.069	69.33
360.51	168.84
360.952	163.99
361.393	161.56
361.834	188.26
362.276	96.03
362.717	171.27
363.158	161.56
363.599	210.11
364.04	96.03
364.481	163.99
364.922	185.83
365.363	113.02
365.804	110.59
366.245	113.02
366.686	108.16
367.126	149.43
367.567	178.55
368.008	217.39
368.448	144.57
368.889	193.12
369.33	178.55
369.77	110.59
370.21	144.57
370.651	212.53
371.091	193.12
371.531	176.13
371.972	159.13
372.412	195.54
372.852	142.14
373.292	115.44
373.732	127.58
374.172	202.82
374.612	171.27
375.052	144.57
375.492	120.3
375.932	159.13
376.372	149.43
376.811	207.68
377.251	76.61
377.691	120.3
378.13	108.16
378.57	171.27
379.009	149.43
379.449	137.29
379.888	137.29
380.328	115.44
380.767	137.29
381.206	154.28
381.645	217.39
382.085	137.29
382.524	144.57
382.963	180.98
383.402	161.56
383.841	197.97
384.28	120.3
384.719	185.83
385.158	144.57
385.596	195.54
386.035	171.27
386.474	139.72
386.913	163.99
387.351	130.01
387.79	110.59
388.228	151.85
388.667	142.14
389.105	151.85
389.544	144.57
389.982	139.72
390.42	183.41
390.859	188.26
391.297	185.83
391.735	154.28
392.173	130.01
392.611	79.04
393.049	163.99
393.487	110.59
393.925	147
394.363	222.24
394.801	190.69
395.239	210.11
395.676	159.13
396.114	210.11
396.552	193.12
396.989	180.98
397.427	180.98
397.864	185.83
398.302	176.13
398.739	113.02
399.177	180.98
399.614	149.43
400.051	147
400.488	195.54
400.926	151.85
401.363	139.72
401.8	149.43
402.237	168.84
402.674	197.97
403.111	171.27
403.548	168.84
403.985	185.83
404.421	190.69
404.858	122.73
405.295	100.88
405.732	197.97
406.168	127.58
406.605	195.54
407.041	105.74
407.478	137.29
407.914	205.25
408.351	159.13
408.787	144.57
409.223	125.15
409.66	161.56
410.096	142.14
410.532	149.43
410.968	180.98
411.404	156.71
411.84	229.52
412.276	127.58
412.712	183.41
413.148	212.53
413.584	156.71
414.02	134.86
414.455	132.44
414.891	144.57
415.327	122.73
415.762	113.02
416.198	173.7
416.633	137.29
417.069	142.14
417.504	108.16
417.94	71.75
418.375	142.14
418.81	183.41
419.245	110.59
419.681	130.01
420.116	178.55
420.551	147
420.986	163.99
421.421	163.99
421.856	108.16
422.291	156.71
422.726	154.28
423.16	132.44
423.595	144.57
424.03	214.96
424.464	161.56
424.899	200.4
425.334	173.7
425.768	142.14
426.203	142.14
426.637	244.09
427.071	156.71
427.506	91.17
427.94	144.57
428.374	134.86
428.809	137.29
429.243	98.45
429.677	137.29
430.111	115.44
430.545	117.87
430.979	171.27
431.413	200.4
431.847	144.57
432.28	122.73
432.714	144.57
433.148	173.7
433.582	144.57
434.015	161.56
434.449	137.29
434.882	151.85
435.316	168.84
435.749	229.52
436.183	142.14
436.616	66.9
437.049	205.25
437.483	290.2
437.916	227.1
438.349	125.15
438.782	163.99
439.215	74.18
439.648	103.31
440.081	161.56
440.514	130.01
440.947	178.55
441.38	103.31
441.813	96.03
442.245	163.99
442.678	176.13
443.111	125.15
443.543	144.57
443.976	144.57
444.408	171.27
444.841	171.27
445.273	159.13
445.705	227.1
446.138	176.13
446.57	156.71
447.002	159.13
447.434	154.28
447.867	161.56
448.299	205.25
448.731	210.11
449.163	163.99
449.595	178.55
450.026	168.84
450.458	139.72
450.89	108.16
451.322	103.31
451.754	137.29
452.185	151.85
452.617	151.85
453.048	244.09
453.48	117.87
453.911	193.12
454.343	144.57
454.774	122.73
455.205	168.84
455.637	190.69
456.068	231.95
456.499	130.01
456.93	197.97
457.361	139.72
457.792	183.41
458.223	176.13
458.654	134.86
459.085	176.13
459.516	154.28
459.947	188.26
460.378	176.13
460.808	202.82
461.239	168.84
461.669	168.84
462.1	188.26
462.531	127.58
462.961	130.01
463.391	207.68
463.822	147
464.252	149.43
464.682	190.69
465.113	178.55
465.543	180.98
465.973	224.67
466.403	149.43
466.833	149.43
467.263	144.57
467.693	147
468.123	113.02
468.553	156.71
468.983	190.69
469.412	202.82
469.842	219.82
470.272	147
470.701	154.28
471.131	166.42
471.56	144.57
471.99	159.13
472.419	239.23
472.849	212.53
473.278	113.02
473.707	178.55
474.136	173.7
474.566	227.1
474.995	147
475.424	185.83
475.853	188.26
476.282	147
476.711	130.01
477.14	212.53
477.569	188.26
477.997	219.82
478.426	176.13
478.855	171.27
479.283	149.43
479.712	263.51
480.141	159.13
480.569	210.11
480.998	120.3
481.426	125.15
481.854	151.85
482.283	185.83
482.711	154.28
483.139	132.44
483.567	151.85
483.995	183.41
484.424	205.25
484.852	163.99
485.28	183.41
485.708	217.39
486.135	190.69
486.563	176.13
486.991	163.99
487.419	193.12
487.847	139.72
488.274	154.28
488.702	147
489.129	171.27
489.557	142.14
489.984	210.11
490.412	180.98
490.839	113.02
491.266	163.99
491.694	163.99
492.121	176.13
492.548	195.54
492.975	193.12
493.402	139.72
493.829	149.43
494.256	195.54
494.683	156.71
495.11	144.57
495.537	190.69
495.964	154.28
496.39	149.43
496.817	183.41
497.244	134.86
497.67	137.29
498.097	120.3
498.523	176.13
498.95	212.53
499.376	173.7
499.803	173.7
500.229	171.27
500.655	122.73
501.081	195.54
501.508	195.54
501.934	166.42
502.36	180.98
502.786	193.12
503.212	180.98
503.638	139.72
504.064	200.4
504.489	147
504.915	149.43
505.341	132.44
505.767	236.81
506.192	217.39
506.618	110.59
507.043	127.58
507.469	134.86
507.894	151.85
508.32	115.44
508.745	144.57
509.17	173.7
509.596	195.54
510.021	149.43
510.446	159.13
510.871	151.85
511.296	147
511.721	210.11
512.146	178.55
512.571	219.82
512.996	180.98
513.421	103.31
513.845	163.99
514.27	193.12
514.695	132.44
515.119	185.83
515.544	132.44
515.969	127.58
516.393	127.58
516.817	147
517.242	178.55
517.666	132.44
518.09	197.97
518.515	132.44
518.939	161.56
519.363	401.86
519.787	185.83
520.211	180.98
520.635	69.33
521.059	156.71
521.483	139.72
521.907	151.85
522.331	108.16
522.754	149.43
523.178	137.29
523.602	178.55
524.025	200.4
524.449	183.41
524.872	96.03
525.296	185.83
525.719	142.14
526.143	222.24
526.566	163.99
526.989	137.29
527.412	105.74
527.836	205.25
528.259	185.83
528.682	117.87
529.105	142.14
529.528	183.41
529.951	214.96
530.374	137.29
530.796	176.13
531.219	154.28
531.642	178.55
532.065	88.75
532.487	103.31
532.91	161.56
533.332	110.59
533.755	122.73
534.177	159.13
534.6	149.43
535.022	178.55
535.444	207.68
535.867	173.7
536.289	151.85
536.711	173.7
537.133	139.72
537.555	154.28
537.977	120.3
538.399	163.99
538.821	161.56
539.243	178.55
539.665	195.54
540.086	180.98
540.508	151.85
540.93	154.28
541.351	183.41
541.773	161.56
542.195	166.42
542.616	239.23
543.037	183.41
543.459	183.41
543.88	130.01
544.301	193.12
544.723	149.43
545.144	265.93
545.565	180.98
545.986	120.3
546.407	149.43
546.828	168.84
547.249	188.26
547.67	154.28
548.091	149.43
548.512	166.42
548.932	185.83
549.353	207.68
549.774	144.57
550.194	122.73
550.615	168.84
551.035	222.24
551.456	171.27
551.876	173.7
552.296	217.39
552.717	180.98
553.137	113.02
553.557	159.13
553.977	115.44
554.397	137.29
554.817	139.72
555.237	166.42
555.657	163.99
556.077	103.31
556.497	149.43
556.917	125.15
557.337	117.87
557.756	263.51
558.176	117.87
558.596	125.15
559.015	166.42
559.435	176.13
559.854	171.27
560.274	163.99
560.693	137.29
561.112	202.82
561.532	197.97
561.951	117.87
562.37	176.13
562.789	127.58
563.208	178.55
563.627	130.01
564.046	151.85
564.465	149.43
564.884	142.14
565.303	163.99
565.722	151.85
566.14	134.86
566.559	185.83
566.978	173.7
567.396	185.83
567.815	137.29
568.233	205.25
568.652	132.44
569.07	83.89
569.489	183.41
569.907	183.41
570.325	125.15
570.743	156.71
571.161	144.57
571.58	202.82
571.998	154.28
572.416	166.42
572.833	103.31
573.251	132.44
573.669	183.41
574.087	188.26
574.505	125.15
574.922	96.03
575.34	180.98
575.758	219.82
576.175	183.41
576.593	64.47
577.01	142.14
577.428	195.54
577.845	1717.41
578.262	273.21
578.68	176.13
579.097	159.13
579.514	168.84
579.931	163.99
580.348	212.53
580.765	166.42
581.182	110.59
581.599	127.58
582.016	122.73
582.433	115.44
582.849	154.28
583.266	188.26
583.683	139.72
584.099	188.26
584.516	197.97
584.933	193.12
585.349	166.42
585.765	180.98
586.182	147
586.598	149.43
587.014	188.26
587.431	151.85
587.847	127.58
588.263	134.86
588.679	205.25
589.095	151.85
589.511	168.84
589.927	147
590.343	188.26
590.759	200.4
591.174	219.82
591.59	193.12
592.006	185.83
592.421	137.29
592.837	161.56
593.252	120.3
593.668	130.01
594.083	142.14
594.499	144.57
594.914	137.29
595.329	113.02
595.745	171.27
596.16	212.53
596.575	210.11
596.99	180.98
597.405	193.12
597.82	144.57
598.235	214.96
598.65	142.14
599.065	244.09
599.479	156.71
599.894	149.43
600.309	110.59
600.724	144.57
601.138	195.54
601.553	176.13
601.967	154.28
602.382	212.53
602.796	117.87
603.21	200.4
603.625	168.84
604.039	173.7
604.453	168.84
604.867	180.98
605.281	127.58
605.695	159.13
606.109	180.98
606.523	83.89
606.937	115.44
607.351	343.6
607.765	154.28
608.178	190.69
608.592	113.02
609.006	113.02
609.419	168.84
609.833	176.13
610.246	200.4
610.66	142.14
611.073	168.84
611.487	224.67
611.9	163.99
612.313	178.55
612.726	224.67
613.139	120.3
613.553	103.31
613.966	147
614.379	144.57
614.792	159.13
615.204	180.98
615.617	154.28
616.03	139.72
616.443	115.44
616.856	185.83
617.268	166.42
617.681	200.4
618.093	156.71
618.506	161.56
618.918	127.58
619.331	217.39
619.743	180.98
620.155	214.96
620.568	105.74
620.98	139.72
621.392	120.3
621.804	227.1
622.216	190.69
622.628	188.26
623.04	105.74
623.452	151.85
623.864	156.71
624.276	142.14
624.687	120.3
625.099	173.7
625.511	161.56
625.922	117.87
626.334	188.26
626.745	132.44
627.157	79.04
627.568	168.84
627.979	166.42
628.391	125.15
628.802	214.96
629.213	139.72
629.624	188.26
630.035	195.54
630.446	134.86
630.857	176.13
631.268	202.82
631.679	239.23
632.09	180.98
632.501	132.44
632.912	190.69
633.322	214.96
633.733	103.31
634.144	96.03
634.554	154.28
634.965	96.03
635.375	195.54
635.785	197.97
636.196	171.27
636.606	166.42
637.016	137.29
637.427	178.55
637.837	98.45
638.247	132.44
638.657	159.13
639.067	120.3
639.477	171.27
639.887	207.68
640.297	188.26
640.706	64.47
641.116	120.3
641.526	161.56
641.935	142.14
642.345	217.39
642.755	159.13
643.164	74.18
643.573	190.69
643.983	154.28
644.392	130.01
644.801	125.15
645.211	202.82
645.62	115.44
646.029	132.44
646.438	161.56
646.847	134.86
647.256	166.42
647.665	168.84
648.074	222.24
648.483	200.4
648.892	154.28
649.3	132.44
649.709	54.76
650.118	127.58
650.526	151.85
650.935	125.15
651.343	110.59
651.752	137.29
652.16	180.98
652.568	144.57
652.977	120.3
653.385	159.13
653.793	117.87
654.201	180.98
654.609	134.86
655.017	163.99
655.425	149.43
655.833	154.28
656.241	163.99
656.649	156.71
657.057	159.13
657.464	159.13
657.872	117.87
658.28	134.86
658.687	154.28
659.095	127.58
659.502	132.44
659.91	156.71
660.317	183.41
660.724	151.85
661.132	142.14
661.539	227.1
661.946	185.83
662.353	137.29
662.76	188.26
663.167	130.01
663.574	154.28
663.981	205.25
664.388	200.4
664.795	190.69
665.202	180.98
665.608	180.98
666.015	120.3
666.422	120.3
666.828	214.96
667.235	219.82
667.641	212.53
668.047	183.41
668.454	127.58
668.86	207.68
669.266	122.73
669.673	171.27
670.079	151.85
670.485	183.41
670.891	86.32
671.297	168.84
671.703	176.13
672.109	151.85
672.515	212.53
672.92	185.83
673.326	115.44
673.732	234.38
674.138	188.26
674.543	69.33
674.949	180.98
675.354	103.31
675.76	176.13
676.165	139.72
676.57	125.15
676.976	214.96
677.381	122.73
677.786	180.98
678.191	210.11
678.596	173.7
679.001	142.14
679.406	166.42
679.811	147
680.216	217.39
680.621	168.84
681.026	149.43
681.43	125.15
681.835	100.88
682.24	217.39
682.644	144.57
683.049	161.56
683.453	142.14
683.858	205.25
684.262	176.13
684.667	200.4
685.071	103.31
685.475	178.55
685.879	151.85
686.283	163.99
686.687	159.13
687.091	156.71
687.495	161.56
687.899	229.52
688.303	171.27
688.707	142.14
689.111	134.86
689.514	214.96
689.918	115.44
690.322	130.01
690.725	166.42
691.129	197.97
691.532	137.29
691.936	163.99
692.339	229.52
692.742	205.25
693.146	154.28
693.549	195.54
693.952	142.14
694.355	171.27
694.758	159.13
695.161	173.7
695.564	214.96
695.967	205.25
696.37	139.72
696.773	105.74
697.175	210.11
697.578	120.3
697.981	219.82
698.383	190.69
698.786	139.72
699.188	161.56
699.591	122.73
699.993	144.57
700.395	127.58
700.798	200.4
701.2	117.87
701.602	171.27
702.004	173.7
702.406	195.54
702.808	147
703.21	219.82
703.612	185.83
704.014	122.73
704.416	144.57
704.818	227.1
705.219	171.27
705.621	193.12
706.023	176.13
706.424	166.42
706.826	139.72
707.227	219.82
707.629	127.58
708.03	163.99
708.431	219.82
708.832	156.71
709.234	113.02
709.635	217.39
710.036	185.83
710.437	195.54
710.838	200.4
711.239	132.44
711.64	214.96
712.041	176.13
712.441	190.69
712.842	202.82
713.243	217.39
713.643	202.82
714.044	122.73
714.445	188.26
714.845	188.26
715.246	195.54
715.646	236.81
716.046	185.83
716.447	239.23
716.847	241.66
717.247	130.01
717.647	236.81
718.047	231.95
718.447	210.11
718.847	207.68
719.247	183.41
719.647	214.96
720.047	273.21
720.446	183.41
720.846	261.08
721.246	299.91
721.645	166.42
722.045	258.65
722.444	234.38
722.844	222.24
723.243	309.62
723.643	314.48
724.042	244.09
724.441	275.64
724.84	299.91
725.24	280.5
725.639	248.94
726.038	343.6
726.437	331.47
726.836	426.13
727.234	297.49
727.633	258.65
728.032	382.44
728.431	484.38
728.83	375.16
729.228	384.87
729.627	486.81
730.025	484.38
730.424	494.09
730.822	549.92
731.22	579.04
731.619	532.93
732.017	647.01
732.415	661.57
732.813	649.43
733.212	702.83
733.61	746.52
734.008	880.02
734.406	858.17
734.803	986.82
735.201	1113.03
735.599	1064.49
735.997	1244.1
736.395	1295.07
736.792	1384.88
737.19	1477.12
737.587	1457.7
737.985	1586.34
738.382	1596.05
738.78	1671.29
739.177	1647.02
739.574	1773.24
739.971	1855.76
740.369	1906.73
740.766	2110.62
741.163	2025.67
741.56	2251.4
741.957	2285.38
742.354	2491.7
742.751	2545.09
743.147	2715
743.544	2826.65
743.941	3020.83
744.338	3020.83
744.734	3292.68
745.131	3355.79
745.527	3569.38
745.924	3681.03
746.32	3739.29
746.716	3780.55
747.113	4166.48
747.509	4409.2
747.905	4501.44
748.301	4979.6
748.697	5263.58
749.093	5511.16
749.489	6059.71
749.885	6535.45
750.281	7071.86
750.677	7452.94
751.073	8001.49
751.468	8307.32
751.864	8491.79
752.26	8513.63
752.655	8632.57
753.051	8736.94
753.446	8901.99
753.842	8756.36
754.237	8530.62
754.632	8756.36
755.028	8770.92
755.423	8974.81
755.818	9263.65
756.213	9727.24
756.608	10050.07
757.003	10355.9
757.398	10712.7
757.793	11084.06
758.188	10746.68
758.583	11467.56
758.977	11785.53
759.372	11841.36
759.767	12324.37
760.161	12703.02
760.556	12928.75
760.95	13176.33
761.345	12870.5
761.739	13639.93
762.133	13744.3
762.527	14491.88
762.922	15096.26
763.316	16135.11
763.71	16994.35
764.104	18249.22
764.498	19734.68
764.892	21263.83
765.286	22530.84
765.68	23462.9
766.073	24780.88
766.467	25023.6
766.861	26831.88
767.255	27892.58
767.648	28591.62
768.042	27608.59
768.435	27414.41
768.829	26943.53
769.222	25943.52
769.615	25635.26
770.008	24958.06
770.402	24411.94
770.795	24482.33
771.188	24797.87
771.581	24892.53
771.974	25305.16
772.367	25788.17
772.76	27560.05
773.153	26926.54
773.545	27378
773.938	28805.21
774.331	29754.26
774.724	30200.86
775.116	31045.54
775.509	31543.12
775.901	31865.94
776.294	32278.57
776.686	33115.96
777.078	32448.47
777.471	31807.69
777.863	31812.54
778.255	31771.28
778.647	31273.7
779.039	32356.24
779.431	31805.26
779.823	33055.28
780.215	35055.31
780.607	35518.91
780.999	38370.89
781.39	39912.18
781.782	41628.23
782.174	42487.46
782.565	44271.47
782.957	45591.88
783.348	46868.6
783.74	46696.27
784.131	44662.25
784.522	44152.54
784.914	42038.43
785.305	40812.68
785.696	38213.12
786.087	36819.9
786.478	34307.72
786.869	31152.34
787.26	30436.3
787.651	29307.65
788.042	28708.12
788.433	27982.38
788.823	27526.07
789.214	27827.04
789.605	27353.73
789.995	26708.09
790.386	26414.4
790.776	27421.69
791.167	27157.13
791.557	27603.74
791.948	29419.3
792.338	29941.15
792.728	30640.19
793.118	30938.74
793.508	29268.81
793.898	29249.39
794.288	29149.88
794.678	27606.16
795.068	26329.44
795.458	24894.96
795.848	24385.24
796.238	24431.36
796.627	24229.9
797.017	24375.53
797.406	25101.27
797.796	26130.41
798.185	27637.72
798.575	29074.63
798.964	29890.18
799.354	32096.52
799.743	31919.34
800.132	32909.64
800.521	34312.58
800.91	34715.5
801.299	34686.37
801.688	34310.15
802.077	33484.9
802.466	32950.91
802.855	31897.49
803.244	29183.86
803.633	27475.09
804.021	26147.4
804.41	24778.45
804.799	23504.16
805.187	21977.44
805.576	21494.42
805.964	20703.14
806.352	19550.21
806.741	20028.38
807.129	19802.64
807.517	20365.76
807.905	21038.1
808.293	22433.75
808.681	23212.89
809.069	24234.75
809.457	25664.39
809.845	26191.09
810.233	26975.09
810.621	27756.65
811.009	26625.57
811.396	25797.88
811.784	25936.23
812.171	25246.9
812.559	23661.93
812.946	22887.64
813.334	22001.71
813.721	21377.91
814.108	20227.41
814.496	19608.47
814.883	18572.04
815.27	18955.54
815.657	19839.05
816.044	20472.56
816.431	20780.81
816.818	21353.64
817.205	22091.51
817.592	22494.43
817.979	23130.37
818.365	23441.05
818.752	23130.37
819.139	22426.47
819.525	23076.97
819.912	22081.81
820.298	21610.92
820.685	20688.58
821.071	19657.01
821.457	18693.4
821.843	17443.38
822.23	15836.56
822.616	14521.01
823.002	13496.72
823.388	12644.77
823.774	11848.64
824.16	10795.22
824.546	10219.97
824.931	10154.44
825.317	10062.2
825.703	10273.37
826.089	10355.9
826.474	10513.66
826.86	10761.24
827.245	11028.24
827.631	11025.81
828.016	11251.54
828.401	11234.55
828.787	11219.99
829.172	11023.38
829.557	10906.87
829.942	10637.45
830.327	10207.83
830.712	9540.35
831.097	9006.36
831.482	8705.38
831.867	8384.99
832.252	8418.97
832.636	7979.64
833.021	7550.03
833.406	7202.93
833.79	6962.64
834.175	6676.23
834.559	6484.48
834.944	6168.94
835.328	6418.94
835.713	6132.53
836.097	6144.66
836.481	5865.53
836.865	5892.23
837.249	5637.38
837.633	5484.46
838.017	5579.12
838.401	5552.42
838.785	5401.93
839.169	5377.66
839.553	5202.9
839.937	4950.47
840.32	4671.34
840.704	4384.93
841.087	3994.15
841.471	3736.86
841.854	3462.58
842.238	3397.05
842.621	3154.33
843.004	2872.77
843.388	2894.61
843.771	2724.71
844.154	2724.71
844.537	2605.77
844.92	2637.33
845.303	2494.12
845.686	2319.36
846.069	2365.48
846.452	2443.15
846.834	2467.42
847.217	2457.71
847.6	2525.68
847.982	2387.32
848.365	2462.57
848.748	2394.61
849.13	2367.91
849.512	2542.67
849.895	2501.4
850.277	2411.6
850.659	2418.88
851.041	2525.68
851.423	2465
851.806	2154.31
852.188	2214.99
852.57	2195.57
852.951	2142.18
853.333	2066.93
853.715	1860.62
854.097	1802.36
854.479	1778.09
854.86	1719.84
855.242	1583.91
855.623	1540.22
856.005	1486.83
856.386	1399.45
856.768	1299.93
857.149	1205.27
857.53	1197.99
857.911	1248.96
858.292	1098.47
858.674	1144.59
859.055	1132.45
859.436	1035.36
859.817	974.68
860.197	969.83
860.578	894.58
860.959	952.84
861.34	872.74
861.72	824.19
862.101	884.87
862.482	821.77
862.862	741.67
863.243	697.98
863.623	722.25
864.003	702.83
864.384	724.68
864.764	685.84
865.144	603.32
865.524	690.7
865.904	566.91
866.284	564.48
866.664	613.03
867.044	525.65
867.424	513.51
867.804	489.24
868.183	501.37
868.563	503.8
868.943	484.38
869.322	523.22
869.702	498.95
870.081	413.99
870.461	404.28
870.84	506.23
871.22	457.68
871.599	423.7
871.978	365.45
872.357	329.04
872.736	350.89
873.115	316.9
873.494	355.74
873.873	331.47
874.252	273.21
874.631	287.78
875.01	295.06
875.388	297.49
875.767	287.78
876.146	287.78
876.524	248.94
876.903	270.79
877.281	275.64
877.66	214.96
878.038	222.24
878.416	205.25
878.794	258.65
879.173	171.27
879.551	241.66
879.929	265.93
880.307	239.23
880.685	227.1
881.063	210.11
881.441	263.51
881.818	224.67
882.196	176.13
882.574	219.82
882.951	176.13
883.329	122.73
883.707	180.98
884.084	224.67
884.461	200.4
884.839	183.41
885.216	183.41
885.593	180.98
885.971	188.26
886.348	178.55
886.725	205.25
887.102	217.39
887.479	202.82
887.856	193.12
888.233	193.12
888.609	217.39
888.986	212.53
889.363	197.97
889.74	222.24
890.116	246.51
890.493	120.3
890.869	178.55
891.246	183.41
891.622	173.7
891.998	163.99
892.375	96.03
892.751	190.69
893.127	130.01
893.503	219.82
893.879	161.56
894.255	142.14
894.631	244.09
895.007	127.58
895.383	171.27
895.759	197.97
896.134	108.16
896.51	127.58
896.886	176.13
897.261	110.59
897.637	241.66
898.012	156.71
898.388	117.87
898.763	180.98
899.138	173.7
899.514	180.98
899.889	200.4
900.264	127.58
900.639	195.54
901.014	222.24
901.389	151.85
901.764	88.75
902.139	134.86
902.513	183.41
902.888	159.13
903.263	154.28
903.638	176.13
904.012	193.12
904.387	88.75
904.761	125.15
905.136	149.43
905.51	217.39
905.884	183.41
906.259	117.87
906.633	122.73
907.007	193.12
907.381	156.71
907.755	161.56
908.129	127.58
908.503	139.72
908.877	137.29
909.251	166.42
909.624	144.57
909.998	212.53
910.372	122.73
910.745	139.72
911.119	161.56
911.492	171.27
911.866	139.72
912.239	207.68
912.612	125.15
912.986	176.13
913.359	154.28
913.732	91.17
914.105	125.15
914.478	176.13
914.851	168.84
915.224	125.15
915.597	132.44
915.97	178.55
916.343	142.14
916.715	171.27
917.088	105.74
917.461	86.32
917.833	163.99
918.206	217.39
918.578	168.84
918.951	195.54
919.323	144.57
919.695	122.73
920.067	156.71
920.44	168.84
920.812	178.55
921.184	178.55
921.556	256.22
921.928	156.71
922.3	130.01
922.672	197.97
923.043	197.97
923.415	173.7
923.787	151.85
924.158	159.13
924.53	197.97
924.901	195.54
925.273	190.69
925.644	122.73
926.016	130.01
926.387	113.02
926.758	188.26
927.129	149.43
927.5	105.74
927.872	176.13
928.243	154.28
928.613	120.3
928.984	149.43
929.355	149.43
929.726	193.12
930.097	127.58
930.467	120.3
930.838	207.68
931.209	86.32
931.579	117.87
931.95	98.45
932.32	176.13
932.69	185.83
933.061	173.7
933.431	139.72
933.801	125.15
934.171	142.14
934.541	159.13
934.911	154.28
935.281	176.13
935.651	151.85
936.021	156.71
936.391	120.3
936.761	144.57
937.13	154.28
937.5	156.71
937.87	115.44
938.239	130.01
938.609	210.11
938.978	132.44
939.347	183.41
939.717	76.61
940.086	115.44
940.455	163.99
940.824	139.72
941.193	122.73
941.562	161.56
941.931	168.84
942.3	159.13
942.669	176.13
943.038	137.29
943.407	88.75
943.775	147
944.144	110.59
944.513	195.54
944.881	88.75
945.25	176.13
945.618	113.02
945.986	156.71
946.355	190.69
946.723	130.01
947.091	103.31
947.459	134.86
947.827	154.28
948.195	197.97
948.563	197.97
948.931	154.28
949.299	110.59
949.667	163.99
950.035	185.83
950.402	96.03
950.77	147
951.138	159.13
951.505	144.57
951.873	171.27
952.24	154.28
952.607	176.13
952.975	161.56
953.342	185.83
953.709	173.7
954.076	149.43
954.443	79.04
954.81	229.52
955.177	156.71
955.544	166.42
955.911	180.98
956.278	205.25
956.645	83.89
957.012	185.83
957.378	144.57
957.745	115.44
958.111	125.15
958.478	142.14
958.844	217.39
959.211	156.71
959.577	137.29
959.943	127.58
960.309	256.22
960.675	110.59
961.042	122.73
961.408	130.01
961.774	149.43
962.139	154.28
962.505	142.14
962.871	151.85
963.237	188.26
963.603	149.43
963.968	222.24
964.334	180.98
964.699	161.56
965.065	134.86
965.43	163.99
965.796	127.58
966.161	139.72
966.526	81.46
966.891	188.26
967.256	163.99
967.622	147
967.987	139.72
968.352	100.88
968.716	173.7
969.081	125.15
969.446	117.87
969.811	154.28
970.176	142.14
970.54	159.13
970.905	115.44
971.269	120.3
971.634	117.87
971.998	173.7
972.363	202.82
972.727	86.32
973.091	168.84
973.455	178.55
973.819	134.86
974.183	154.28
974.547	171.27
974.911	134.86
975.275	178.55
975.639	98.45
976.003	171.27
976.367	115.44
976.73	115.44
977.094	130.01
977.458	156.71
977.821	139.72
978.185	142.14
978.548	105.74
978.911	144.57
979.275	127.58
979.638	154.28
980.001	176.13
980.364	125.15
980.727	134.86
981.09	178.55
981.453	86.32
981.816	139.72
982.179	188.26
982.542	210.11
982.905	108.16
983.267	117.87
983.63	222.24
983.992	132.44
984.355	229.52
984.717	91.17
985.08	130.01
985.442	156.71
985.804	132.44
986.167	132.44
986.529	180.98
986.891	88.75
987.253	159.13
987.615	176.13
987.977	163.99
988.339	134.86
988.701	202.82
989.062	142.14
989.424	202.82
989.786	190.69
990.147	142.14
990.509	200.4
990.87	137.29
991.232	200.4
991.593	159.13
991.955	144.57
992.316	139.72
992.677	156.71
993.038	144.57
993.399	161.56
993.76	154.28
994.121	127.58
994.482	202.82
994.843	147
995.204	125.15
995.565	103.31
995.926	88.75
996.286	81.46
996.647	144.57
997.007	108.16
997.368	139.72
997.728	163.99
998.089	185.83
998.449	122.73
998.809	161.56
999.169	142.14
999.53	139.72
999.89	200.4
1000.25	132.44
1000.61	205.25
1000.97	195.54
1001.329	154.28
1001.689	83.89
1002.049	193.12
1002.409	163.99
1002.768	188.26
1003.128	139.72
1003.487	151.85
1003.847	115.44
1004.206	210.11
1004.566	144.57
1004.925	193.12
1005.284	139.72
1005.643	96.03
1006.003	105.74
1006.362	176.13
1006.721	105.74
1007.08	81.46
1007.438	110.59
1007.797	115.44
1008.156	207.68
1008.515	159.13
1008.874	183.41
1009.232	142.14
1009.591	91.17
1009.949	205.25
1010.308	144.57
1010.666	185.83
1011.024	113.02
1011.383	125.15
1011.741	103.31
1012.099	142.14
1012.457	96.03
1012.815	205.25
1013.173	108.16
1013.531	74.18
1013.889	161.56
1014.247	163.99
1014.605	142.14
1014.962	193.12
1015.32	59.62
1015.678	137.29
1016.035	156.71
1016.393	122.73
1016.75	137.29
1017.107	227.1
1017.465	120.3
1017.822	115.44
1018.179	151.85
1018.536	142.14
1018.894	122.73
1019.251	105.74
1019.608	212.53
1019.964	176.13
1020.321	122.73
1020.678	127.58
1021.035	156.71
1021.392	134.86
1021.748	142.14
1022.105	147
1022.461	161.56
1022.818	224.67
1023.174	122.73
1023.531	115.44
1023.887	185.83
1024.243	197.97
1024.599	117.87
1024.955	171.27
1025.311	229.52
1025.667	120.3
1026.023	195.54
1026.379	125.15
1026.735	117.87
1027.091	139.72
1027.447	134.86
