189.514	21.85
189.973	21.85
190.431	21.85
190.889	77.67
191.348	77.67
191.806	-4.85
192.264	-7.28
192.722	-63.11
193.18	-31.55
193.638	-43.69
194.096	-53.4
194.554	31.55
195.012	48.54
195.47	26.7
195.928	4.85
196.385	-4.85
196.843	-26.7
197.301	19.42
197.758	41.26
198.216	-19.42
198.674	48.54
199.131	29.13
199.589	94.66
200.046	67.96
200.503	48.54
200.961	106.8
201.418	155.34
201.875	101.94
202.332	118.93
202.79	106.8
203.247	118.93
203.704	104.37
204.161	75.24
204.618	99.52
205.075	150.49
205.532	150.49
205.989	169.91
206.445	208.74
206.902	179.61
207.359	118.93
207.816	152.91
208.272	152.91
208.729	155.34
209.185	208.74
209.642	199.03
210.098	145.63
210.555	167.48
211.011	162.62
211.467	150.49
211.924	157.77
212.38	106.8
212.836	116.51
213.292	208.74
213.748	121.36
214.204	169.91
214.66	220.88
215.116	167.48
215.572	106.8
216.028	223.3
216.484	128.64
216.94	225.73
217.396	53.4
217.851	208.74
218.307	242.72
218.763	179.61
219.218	169.91
219.674	184.47
220.129	84.95
220.585	94.66
221.04	169.91
221.496	118.93
221.951	92.23
222.406	150.49
222.861	150.49
223.317	138.35
223.772	55.83
224.227	189.32
224.682	172.33
225.137	184.47
225.592	87.38
226.047	101.94
226.502	148.06
226.957	140.78
227.411	155.34
227.866	203.89
228.321	194.18
228.776	131.07
229.23	177.19
229.685	75.24
230.139	138.35
230.594	72.82
231.048	194.18
231.503	199.03
231.957	150.49
232.411	152.91
232.865	165.05
233.32	162.62
233.774	211.17
234.228	152.91
234.682	138.35
235.136	131.07
235.59	162.62
236.044	177.19
236.498	118.93
236.952	89.81
237.406	169.91
237.86	152.91
238.313	199.03
238.767	240.29
239.221	80.1
239.674	177.19
240.128	97.09
240.581	118.93
241.035	172.33
241.488	77.67
241.942	189.32
242.395	133.5
242.848	194.18
243.301	116.51
243.755	167.48
244.208	101.94
244.661	135.92
245.114	131.07
245.567	89.81
246.02	104.37
246.473	133.5
246.926	104.37
247.379	172.33
247.832	162.62
248.284	152.91
248.737	77.67
249.19	223.3
249.642	208.74
250.095	184.47
250.547	184.47
251	152.91
251.452	148.06
251.905	126.22
252.357	148.06
252.81	184.47
253.262	160.2
253.714	140.78
254.166	140.78
254.618	104.37
255.07	116.51
255.523	186.9
255.975	140.78
256.427	123.79
256.878	126.22
257.33	135.92
257.782	150.49
258.234	165.05
258.686	160.2
259.137	101.94
259.589	109.23
260.041	165.05
260.492	126.22
260.944	179.61
261.395	194.18
261.847	213.6
262.298	196.61
262.749	126.22
263.201	230.59
263.652	148.06
264.103	126.22
264.554	189.32
265.005	162.62
265.457	87.38
265.908	167.48
266.359	228.16
266.809	123.79
267.26	138.35
267.711	228.16
268.162	203.89
268.613	128.64
269.064	206.31
269.514	138.35
269.965	237.87
270.415	109.23
270.866	208.74
271.316	138.35
271.767	143.21
272.217	109.23
272.668	155.34
273.118	194.18
273.568	162.62
274.019	201.46
274.469	155.34
274.919	211.17
275.369	133.5
275.819	138.35
276.269	133.5
276.719	131.07
277.169	162.62
277.619	177.19
278.069	174.76
278.518	126.22
278.968	143.21
279.418	150.49
279.867	162.62
280.317	194.18
280.767	157.77
281.216	101.94
281.666	179.61
282.115	135.92
282.564	182.04
283.014	75.24
283.463	157.77
283.912	174.76
284.361	138.35
284.811	131.07
285.26	126.22
285.709	92.23
286.158	203.89
286.607	191.75
287.056	143.21
287.505	128.64
287.953	126.22
288.402	126.22
288.851	189.32
289.3	118.93
289.748	184.47
290.197	160.2
290.646	189.32
291.094	223.3
291.543	148.06
291.991	206.31
292.439	135.92
292.888	131.07
293.336	167.48
293.784	63.11
294.233	218.45
294.681	145.63
295.129	80.1
295.577	177.19
296.025	179.61
296.473	199.03
296.921	169.91
297.369	114.08
297.817	167.48
298.264	165.05
298.712	126.22
299.16	184.47
299.608	152.91
300.055	126.22
300.503	155.34
300.95	77.67
301.398	152.91
301.845	230.59
302.293	167.48
302.74	87.38
303.187	133.5
303.635	169.91
304.082	160.2
304.529	128.64
304.976	194.18
305.423	233.01
305.87	140.78
306.317	135.92
306.764	157.77
307.211	152.91
307.658	179.61
308.105	121.36
308.552	97.09
308.998	148.06
309.445	152.91
309.892	235.44
310.338	179.61
310.785	123.79
311.231	131.07
311.678	223.3
312.124	206.31
312.571	72.82
313.017	97.09
313.463	126.22
313.909	157.77
314.356	172.33
314.802	160.2
315.248	131.07
315.694	126.22
316.14	152.91
316.586	128.64
317.032	150.49
317.478	123.79
317.923	101.94
318.369	148.06
318.815	218.45
319.261	174.76
319.706	160.2
320.152	208.74
320.597	150.49
321.043	145.63
321.488	177.19
321.934	133.5
322.379	131.07
322.824	250
323.27	218.45
323.715	177.19
324.16	182.04
324.605	155.34
325.05	128.64
325.495	152.91
325.94	152.91
326.385	143.21
326.83	121.36
327.275	143.21
327.72	196.61
328.165	165.05
328.61	145.63
329.054	186.9
329.499	143.21
329.943	162.62
330.388	211.17
330.832	143.21
331.277	128.64
331.721	186.9
332.166	97.09
332.61	135.92
333.054	111.65
333.499	94.66
333.943	199.03
334.387	150.49
334.831	63.11
335.275	114.08
335.719	126.22
336.163	140.78
336.607	191.75
337.051	101.94
337.495	97.09
337.938	167.48
338.382	135.92
338.826	235.44
339.269	218.45
339.713	143.21
340.157	167.48
340.6	177.19
341.044	206.31
341.487	116.51
341.93	138.35
342.374	165.05
342.817	162.62
343.26	152.91
343.703	138.35
344.146	165.05
344.59	128.64
345.033	162.62
345.476	60.68
345.919	237.87
346.361	208.74
346.804	169.91
347.247	157.77
347.69	121.36
348.133	167.48
348.575	150.49
349.018	179.61
349.461	199.03
349.903	169.91
350.346	111.65
350.788	121.36
351.23	186.9
351.673	165.05
352.115	172.33
352.557	140.78
353	186.9
353.442	140.78
353.884	235.44
354.326	140.78
354.768	53.4
355.21	213.6
355.652	177.19
356.094	167.48
356.536	121.36
356.978	169.91
357.419	162.62
357.861	152.91
358.303	114.08
358.744	143.21
359.186	152.91
359.627	186.9
360.069	133.5
360.51	184.47
360.952	138.35
361.393	172.33
361.834	114.08
362.276	155.34
362.717	155.34
363.158	162.62
363.599	121.36
364.04	126.22
364.481	157.77
364.922	75.24
365.363	106.8
365.804	184.47
366.245	116.51
366.686	203.89
367.126	167.48
367.567	140.78
368.008	152.91
368.448	179.61
368.889	143.21
369.33	101.94
369.77	148.06
370.21	162.62
370.651	155.34
371.091	111.65
371.531	160.2
371.972	208.74
372.412	179.61
372.852	172.33
373.292	160.2
373.732	94.66
374.172	133.5
374.612	89.81
375.052	101.94
375.492	157.77
375.932	145.63
376.372	126.22
376.811	165.05
377.251	179.61
377.691	128.64
378.13	148.06
378.57	201.46
379.009	145.63
379.449	167.48
379.888	186.9
380.328	60.68
380.767	138.35
381.206	114.08
381.645	177.19
382.085	145.63
382.524	167.48
382.963	160.2
383.402	160.2
383.841	186.9
384.28	118.93
384.719	150.49
385.158	182.04
385.596	174.76
386.035	121.36
386.474	145.63
386.913	216.02
387.351	114.08
387.79	196.61
388.228	131.07
388.667	118.93
389.105	150.49
389.544	133.5
389.982	80.1
390.42	140.78
390.859	172.33
391.297	174.76
391.735	94.66
392.173	152.91
392.611	148.06
393.049	114.08
393.487	135.92
393.925	167.48
394.363	150.49
394.801	196.61
395.239	155.34
395.676	106.8
396.114	162.62
396.552	172.33
396.989	140.78
397.427	186.9
397.864	135.92
398.302	123.79
398.739	155.34
399.177	145.63
399.614	165.05
400.051	182.04
400.488	140.78
400.926	201.46
401.363	179.61
401.8	82.53
402.237	143.21
402.674	169.91
403.111	123.79
403.548	135.92
403.985	109.23
404.421	128.64
404.858	184.47
405.295	218.45
405.732	157.77
406.168	53.4
406.605	179.61
407.041	150.49
407.478	191.75
407.914	155.34
408.351	179.61
408.787	177.19
409.223	165.05
409.66	174.76
410.096	123.79
410.532	150.49
410.968	118.93
411.404	140.78
411.84	138.35
412.276	160.2
412.712	186.9
413.148	208.74
413.584	196.61
414.02	186.9
414.455	165.05
414.891	150.49
415.327	216.02
415.762	184.47
416.198	118.93
416.633	165.05
417.069	199.03
417.504	118.93
417.94	152.91
418.375	157.77
418.81	179.61
419.245	140.78
419.681	143.21
420.116	172.33
420.551	116.51
420.986	155.34
421.421	118.93
421.856	148.06
422.291	72.82
422.726	140.78
423.16	191.75
423.595	194.18
424.03	94.66
424.464	169.91
424.899	104.37
425.334	203.89
425.768	148.06
426.203	87.38
426.637	162.62
427.071	233.01
427.506	101.94
427.94	201.46
428.374	172.33
428.809	191.75
429.243	140.78
429.677	160.2
430.111	167.48
430.545	109.23
430.979	148.06
431.413	165.05
431.847	201.46
432.28	211.17
432.714	167.48
433.148	150.49
433.582	121.36
434.015	135.92
434.449	143.21
434.882	174.76
435.316	138.35
435.749	150.49
436.183	196.61
436.616	230.59
437.049	116.51
437.483	191.75
437.916	189.32
438.349	203.89
438.782	169.91
439.215	186.9
439.648	145.63
440.081	82.53
440.514	199.03
440.947	174.76
441.38	162.62
441.813	148.06
442.245	194.18
442.678	152.91
443.111	140.78
443.543	172.33
443.976	174.76
444.408	133.5
444.841	143.21
445.273	172.33
445.705	138.35
446.138	184.47
446.57	162.62
447.002	225.73
447.434	145.63
447.867	191.75
448.299	225.73
448.731	199.03
449.163	235.44
449.595	182.04
450.026	114.08
450.458	189.32
450.89	213.6
451.322	165.05
451.754	179.61
452.185	225.73
452.617	162.62
453.048	194.18
453.48	182.04
453.911	211.17
454.343	218.45
454.774	165.05
455.205	145.63
455.637	111.65
456.068	145.63
456.499	250
456.93	230.59
457.361	201.46
457.792	233.01
458.223	293.69
458.654	174.76
459.085	157.77
459.516	264.57
459.947	247.58
460.378	203.89
460.808	174.76
461.239	223.3
461.669	203.89
462.1	177.19
462.531	211.17
462.961	211.17
463.391	276.7
463.822	160.2
464.252	145.63
464.682	179.61
465.113	196.61
465.543	179.61
465.973	199.03
466.403	114.08
466.833	252.43
467.263	169.91
467.693	247.58
468.123	184.47
468.553	162.62
468.983	184.47
469.412	184.47
469.842	165.05
470.272	240.29
470.701	262.14
471.131	152.91
471.56	169.91
471.99	165.05
472.419	174.76
472.849	206.31
473.278	150.49
473.707	174.76
474.136	140.78
474.566	121.36
474.995	191.75
475.424	126.22
475.853	199.03
476.282	186.9
476.711	189.32
477.14	213.6
477.569	162.62
477.997	186.9
478.426	131.07
478.855	172.33
479.283	211.17
479.712	189.32
480.141	191.75
480.569	174.76
480.998	186.9
481.426	126.22
481.854	237.87
482.283	150.49
482.711	126.22
483.139	179.61
483.567	196.61
483.995	182.04
484.424	283.99
484.852	186.9
485.28	131.07
485.708	220.88
486.135	206.31
486.563	121.36
486.991	189.32
487.419	140.78
487.847	174.76
488.274	191.75
488.702	118.93
489.129	177.19
489.557	121.36
489.984	140.78
490.412	148.06
490.839	160.2
491.266	201.46
491.694	131.07
492.121	206.31
492.548	189.32
492.975	148.06
493.402	169.91
493.829	162.62
494.256	116.51
494.683	186.9
495.11	123.79
495.537	174.76
495.964	148.06
496.39	167.48
496.817	196.61
497.244	126.22
497.67	150.49
498.097	135.92
498.523	70.39
498.95	182.04
499.376	237.87
499.803	189.32
500.229	194.18
500.655	138.35
501.081	208.74
501.508	104.37
501.934	174.76
502.36	128.64
502.786	145.63
503.212	155.34
503.638	143.21
504.064	58.25
504.489	135.92
504.915	109.23
505.341	206.31
505.767	184.47
506.192	203.89
506.618	114.08
507.043	133.5
507.469	182.04
507.894	114.08
508.32	157.77
508.745	169.91
509.17	155.34
509.596	196.61
510.021	121.36
510.446	152.91
510.871	160.2
511.296	162.62
511.721	165.05
512.146	140.78
512.571	172.33
512.996	140.78
513.421	131.07
513.845	184.47
514.27	182.04
514.695	157.77
515.119	182.04
515.544	148.06
515.969	114.08
516.393	128.64
516.817	143.21
517.242	211.17
517.666	228.16
518.09	143.21
518.515	169.91
518.939	167.48
519.363	417.48
519.787	228.16
520.211	131.07
520.635	135.92
521.059	121.36
521.483	201.46
521.907	220.88
522.331	162.62
522.754	230.59
523.178	167.48
523.602	206.31
524.025	191.75
524.449	133.5
524.872	211.17
525.296	174.76
525.719	148.06
526.143	160.2
526.566	138.35
526.989	157.77
527.412	162.62
527.836	174.76
528.259	189.32
528.682	182.04
529.105	208.74
529.528	220.88
529.951	165.05
530.374	172.33
530.796	131.07
531.219	160.2
531.642	148.06
532.065	201.46
532.487	160.2
532.91	235.44
533.332	123.79
533.755	167.48
534.177	201.46
534.6	140.78
535.022	169.91
535.444	165.05
535.867	145.63
536.289	118.93
536.711	194.18
537.133	199.03
537.555	218.45
537.977	138.35
538.399	167.48
538.821	208.74
539.243	148.06
539.665	182.04
540.086	208.74
540.508	174.76
540.93	186.9
541.351	70.39
541.773	148.06
542.195	148.06
542.616	155.34
543.037	225.73
543.459	191.75
543.88	194.18
544.301	228.16
544.723	140.78
545.144	216.02
545.565	184.47
545.986	203.89
546.407	155.34
546.828	162.62
547.249	189.32
547.67	184.47
548.091	182.04
548.512	152.91
548.932	169.91
549.353	223.3
549.774	203.89
550.194	138.35
550.615	184.47
551.035	167.48
551.456	169.91
551.876	196.61
552.296	206.31
552.717	189.32
553.137	191.75
553.557	174.76
553.977	118.93
554.397	140.78
554.817	191.75
555.237	216.02
555.657	177.19
556.077	174.76
556.497	218.45
556.917	155.34
557.337	99.52
557.756	150.49
558.176	145.63
558.596	104.37
559.015	109.23
559.435	172.33
559.854	211.17
560.274	145.63
560.693	116.51
561.112	97.09
561.532	148.06
561.951	174.76
562.37	196.61
562.789	191.75
563.208	131.07
563.627	196.61
564.046	177.19
564.465	191.75
564.884	201.46
565.303	169.91
565.722	186.9
566.14	245.15
566.559	213.6
566.978	174.76
567.396	216.02
567.815	233.01
568.233	218.45
568.652	152.91
569.07	135.92
569.489	182.04
569.907	218.45
570.325	165.05
570.743	152.91
571.161	128.64
571.58	121.36
571.998	160.2
572.416	155.34
572.833	162.62
573.251	157.77
573.669	150.49
574.087	228.16
574.505	114.08
574.922	191.75
575.34	150.49
575.758	133.5
576.175	152.91
576.593	148.06
577.01	196.61
577.428	186.9
577.845	1543.71
578.262	216.02
578.68	228.16
579.097	191.75
579.514	165.05
579.931	155.34
580.348	148.06
580.765	155.34
581.182	257.29
581.599	150.49
582.016	109.23
582.433	123.79
582.849	162.62
583.266	135.92
583.683	167.48
584.099	126.22
584.516	211.17
584.933	201.46
585.349	208.74
585.765	167.48
586.182	172.33
586.598	167.48
587.014	167.48
587.431	177.19
587.847	77.67
588.263	169.91
588.679	211.17
589.095	165.05
589.511	162.62
589.927	143.21
590.343	191.75
590.759	179.61
591.174	89.81
591.59	133.5
592.006	160.2
592.421	157.77
592.837	133.5
593.252	157.77
593.668	199.03
594.083	160.2
594.499	150.49
594.914	155.34
595.329	184.47
595.745	157.77
596.16	218.45
596.575	177.19
596.99	150.49
597.405	131.07
597.82	201.46
598.235	138.35
598.65	143.21
599.065	172.33
599.479	143.21
599.894	179.61
600.309	189.32
600.724	179.61
601.138	118.93
601.553	148.06
601.967	131.07
602.382	211.17
602.796	118.93
603.21	169.91
603.625	135.92
604.039	189.32
604.453	203.89
604.867	162.62
605.281	208.74
605.695	157.77
606.109	143.21
606.523	196.61
606.937	218.45
607.351	220.88
607.765	169.91
608.178	169.91
608.592	211.17
609.006	155.34
609.419	177.19
609.833	211.17
610.246	177.19
610.66	196.61
611.073	162.62
611.487	162.62
611.9	189.32
612.313	167.48
612.726	128.64
613.139	116.51
613.553	140.78
613.966	228.16
614.379	184.47
614.792	150.49
615.204	182.04
615.617	148.06
616.03	145.63
616.443	116.51
616.856	150.49
617.268	157.77
617.681	123.79
618.093	109.23
618.506	145.63
618.918	140.78
619.331	70.39
619.743	138.35
620.155	148.06
620.568	165.05
620.98	148.06
621.392	218.45
621.804	199.03
622.216	162.62
622.628	194.18
623.04	157.77
623.452	97.09
623.864	152.91
624.276	184.47
624.687	123.79
625.099	165.05
625.511	143.21
625.922	104.37
626.334	152.91
626.745	208.74
627.157	148.06
627.568	150.49
627.979	262.14
628.391	126.22
628.802	177.19
629.213	165.05
629.624	218.45
630.035	216.02
630.446	155.34
630.857	160.2
631.268	169.91
631.679	196.61
632.09	177.19
632.501	194.18
632.912	201.46
633.322	186.9
633.733	174.76
634.144	138.35
634.554	177.19
634.965	135.92
635.375	157.77
635.785	199.03
636.196	213.6
636.606	143.21
637.016	189.32
637.427	186.9
637.837	211.17
638.247	216.02
638.657	138.35
639.067	143.21
639.477	179.61
639.887	182.04
640.297	140.78
640.706	264.57
641.116	131.07
641.526	135.92
641.935	135.92
642.345	143.21
642.755	140.78
643.164	186.9
643.573	155.34
643.983	191.75
644.392	143.21
644.801	186.9
645.211	237.87
645.62	145.63
646.029	162.62
646.438	167.48
646.847	116.51
647.256	201.46
647.665	92.23
648.074	138.35
648.483	138.35
648.892	191.75
649.3	167.48
649.709	230.59
650.118	143.21
650.526	109.23
650.935	162.62
651.343	191.75
651.752	145.63
652.16	203.89
652.568	152.91
652.977	167.48
653.385	206.31
653.793	111.65
654.201	208.74
654.609	174.76
655.017	140.78
655.425	220.88
655.833	206.31
656.241	169.91
656.649	131.07
657.057	84.95
657.464	148.06
657.872	160.2
658.28	169.91
658.687	186.9
659.095	199.03
659.502	182.04
659.91	203.89
660.317	206.31
660.724	143.21
661.132	160.2
661.539	143.21
661.946	194.18
662.353	157.77
662.76	148.06
663.167	150.49
663.574	138.35
663.981	97.09
664.388	116.51
664.795	109.23
665.202	199.03
665.608	184.47
666.015	123.79
666.422	126.22
666.828	131.07
667.235	145.63
667.641	186.9
668.047	174.76
668.454	150.49
668.86	84.95
669.266	152.91
669.673	150.49
670.079	140.78
670.485	179.61
670.891	148.06
671.297	157.77
671.703	203.89
672.109	162.62
672.515	87.38
672.92	228.16
673.326	220.88
673.732	160.2
674.138	182.04
674.543	106.8
674.949	179.61
675.354	121.36
675.76	123.79
676.165	167.48
676.57	152.91
676.976	172.33
677.381	126.22
677.786	152.91
678.191	128.64
678.596	133.5
679.001	223.3
679.406	157.77
679.811	135.92
680.216	182.04
680.621	203.89
681.026	97.09
681.43	172.33
681.835	126.22
682.24	97.09
682.644	252.43
683.049	133.5
683.453	184.47
683.858	169.91
684.262	150.49
684.667	106.8
685.071	174.76
685.475	220.88
685.879	218.45
686.283	104.37
686.687	165.05
687.091	145.63
687.495	150.49
687.899	203.89
688.303	189.32
688.707	199.03
689.111	148.06
689.514	172.33
689.918	174.76
690.322	152.91
690.725	169.91
691.129	172.33
691.532	157.77
691.936	186.9
692.339	140.78
692.742	216.02
693.146	191.75
693.549	167.48
693.952	213.6
694.355	145.63
694.758	143.21
695.161	157.77
695.564	203.89
695.967	186.9
696.37	160.2
696.773	138.35
697.175	172.33
697.578	177.19
697.981	194.18
698.383	172.33
698.786	150.49
699.188	135.92
699.591	152.91
699.993	126.22
700.395	123.79
700.798	184.47
701.2	235.44
701.602	179.61
702.004	186.9
702.406	218.45
702.808	152.91
703.21	228.16
703.612	242.72
704.014	245.15
704.416	174.76
704.818	196.61
705.219	213.6
705.621	223.3
706.023	165.05
706.424	211.17
706.826	259.71
707.227	245.15
707.629	242.72
708.03	225.73
708.431	201.46
708.832	194.18
709.234	223.3
709.635	252.43
710.036	317.97
710.437	233.01
710.838	199.03
711.239	155.34
711.64	216.02
712.041	320.39
712.441	342.24
712.842	266.99
713.243	242.72
713.643	254.86
714.044	257.29
714.445	262.14
714.845	220.88
715.246	349.52
715.646	298.55
716.046	286.41
716.447	381.07
716.847	274.28
717.247	283.99
717.647	373.79
718.047	313.11
718.447	320.39
718.847	364.08
719.247	298.55
719.647	395.64
720.047	332.53
720.446	344.67
720.846	296.12
721.246	444.18
721.645	366.51
722.045	359.23
722.444	308.26
722.844	422.34
723.243	412.63
723.643	388.36
724.042	466.03
724.441	475.74
724.84	507.29
725.24	500.01
725.639	451.46
726.038	492.73
726.437	410.2
726.836	473.31
727.234	611.66
727.633	628.65
728.032	555.83
728.431	538.84
728.83	550.98
729.228	555.83
729.627	599.52
730.025	720.88
730.424	711.18
730.822	861.66
731.22	888.36
731.619	929.63
732.017	1019.43
732.415	1038.85
732.813	990.31
733.212	934.48
733.61	1029.14
734.008	1157.78
734.406	1288.86
734.803	1485.46
735.201	1716.05
735.599	2000.03
735.997	2084.98
736.395	1973.33
736.792	1922.36
737.19	1873.82
737.587	1592.26
737.985	1757.31
738.382	1970.9
738.78	2366.54
739.177	2745.19
739.574	3247.62
739.971	3548.6
740.369	3626.27
740.766	3585.01
741.163	3271.9
741.56	3048.59
741.957	2762.18
742.354	2599.56
742.751	2932.08
743.147	3429.66
743.544	4135.99
743.941	4975.81
744.338	5784.07
744.734	6051.07
745.131	6213.69
745.527	6082.62
745.924	5665.14
746.32	5014.64
746.716	4395.7
747.113	4378.71
747.509	4565.61
747.905	5223.38
748.301	6405.44
748.697	7737.98
749.093	9330.24
749.489	10587.54
749.885	11352.12
750.281	11861.83
750.677	11500.18
751.073	10818.13
751.468	9699.18
751.864	8745.28
752.26	7854.49
752.655	7534.1
753.051	7890.9
753.446	9080.24
753.842	10342.39
754.237	12767.19
754.632	15087.61
755.028	16738.12
755.423	18466.31
755.818	19192.05
756.213	19361.95
756.608	18410.48
757.003	17153.18
757.398	14905.57
757.793	13174.96
758.188	11589.99
758.583	10631.23
758.977	10051.13
759.372	10609.39
759.767	12434.66
760.161	15026.93
760.556	18412.91
760.95	21573.15
761.345	24954.27
761.739	28546.56
762.133	30990.77
762.527	32359.73
762.922	33070.9
763.316	32325.75
763.71	30561.16
764.104	28019.85
764.498	25818.36
764.892	23301.33
765.286	20682.36
765.68	19109.52
766.073	17798.82
766.467	17211.43
766.861	18507.57
767.255	20529.45
767.648	22908.12
768.042	26180.02
768.435	30694.65
768.829	34143.74
769.222	38046.71
769.615	42202.11
770.008	45498.28
770.402	46825.97
770.795	48602.7
771.188	48830.86
771.581	47809
771.974	46488.59
772.367	43389.02
772.76	40338.01
773.153	36539.4
773.545	33558.77
773.938	30432.51
774.331	27019.84
774.724	24636.31
775.116	23495.51
775.509	22796.47
775.901	22735.79
776.294	23209.1
776.686	23888.72
777.078	26857.21
777.471	30049.01
777.863	34046.65
778.255	38483.61
778.647	42223.96
779.039	46537.13
779.431	49134.26
779.823	53071.21
780.215	56294.57
780.607	57862.55
780.999	60098.02
781.39	61403.87
781.782	62369.9
782.174	62605.34
782.565	62998.55
782.957	62974.28
783.348	62964.57
783.74	62139.32
784.131	61226.68
784.522	60314.04
784.914	57940.22
785.305	56583.4
785.696	54277.54
786.087	51707.11
786.478	47906.08
786.869	43702.14
787.26	40626.85
787.651	36881.64
788.042	34218.98
788.433	31192.23
788.823	29204.34
789.214	26519.83
789.605	24658.15
789.995	23228.52
790.386	21815.87
790.776	21730.92
791.167	20946.93
791.557	21381.4
791.948	21638.69
792.338	21811.02
792.728	23437.26
793.118	23454.25
793.508	24291.64
793.898	25723.7
794.288	26413.03
794.678	27427.61
795.068	28745.59
795.458	29876.68
795.848	31090.29
796.238	32051.47
796.627	33134.01
797.017	33898.59
797.406	35556.38
797.796	36447.17
798.185	38151.08
798.575	39192.36
798.964	39838
799.354	42032.21
799.743	42396.29
800.132	43590.48
800.521	44160.88
800.91	45673.04
801.299	44988.56
801.688	45561.39
802.077	45444.88
802.466	46075.96
802.855	46491.01
803.244	45874.5
803.633	45459.44
804.021	45311.38
804.41	44930.31
804.799	45102.64
805.187	44027.38
805.576	43706.99
805.964	42253.08
806.352	40874.42
806.741	40510.34
807.129	39782.17
807.517	40197.23
807.905	40787.04
808.293	40973.94
808.681	40760.34
809.069	39337.99
809.457	40733.64
809.845	40328.3
810.233	40551.6
810.621	40745.78
811.009	40138.97
811.396	39816.15
811.784	39677.8
812.171	38194.77
812.559	36961.74
812.946	36126.78
813.334	35619.49
813.721	34563.64
814.108	32570.9
814.496	31954.38
814.883	30833
815.27	31614.57
815.657	29755.32
816.044	28978.61
816.431	28041.7
816.818	27689.75
817.205	26194.58
817.592	25284.37
817.979	23677.55
818.365	22148.4
818.752	20900.81
819.139	19536.71
819.525	18558.54
819.912	17650.76
820.298	16347.34
820.685	15434.71
821.071	14449.25
821.457	13114.28
821.843	12199.22
822.23	11480.76
822.616	10784.15
823.002	10007.44
823.388	9388.5
823.774	8997.71
824.16	8745.28
824.546	8395.76
824.931	8356.93
825.317	8271.97
825.703	8478.29
826.089	8502.56
826.474	8954.02
826.86	9310.82
827.245	9733.16
827.631	10187.05
828.016	10757.45
828.401	11119.1
828.787	11655.52
829.172	12223.49
829.557	12616.7
829.942	13155.54
830.327	13512.35
830.712	14070.61
831.097	14592.46
831.482	15230.82
831.867	15798.79
832.252	15764.81
832.636	16143.45
833.021	16276.95
833.406	16410.45
833.79	16327.92
834.175	16014.81
834.559	15893.45
834.944	15422.57
835.328	14980.82
835.713	14374.01
836.097	13478.36
836.481	12679.81
836.865	11803.58
837.249	10677.35
837.633	9526.85
838.017	8975.87
838.401	7869.05
838.785	7148.17
839.169	6201.55
839.553	5487.95
839.937	4924.83
840.32	4162.69
840.704	3669.96
841.087	3322.87
841.471	2907.81
841.854	2784.02
842.238	2752.47
842.621	2667.52
843.004	2652.95
843.388	2801.01
843.771	3026.75
844.154	3274.32
844.537	3512.19
844.92	3912.68
845.303	4133.56
845.686	4679.68
846.069	4781.63
846.452	5119.01
846.834	5388.43
847.217	5492.8
847.6	5563.19
847.982	5750.09
848.365	5682.13
848.748	5296.2
849.13	5305.91
849.512	5009.79
849.895	4849.59
850.277	4383.56
850.659	3973.36
851.041	3599.57
851.423	3373.84
851.806	2825.29
852.188	2368.97
852.57	2080.13
852.951	1825.27
853.333	1643.23
853.715	1456.33
854.097	1288.86
854.479	1315.55
854.86	1373.81
855.242	1405.36
855.623	1495.17
856.005	1730.61
856.386	1866.53
856.768	1915.08
857.149	2162.66
857.53	2196.64
857.911	2381.11
858.292	2354.41
858.674	2424.8
859.055	2487.9
859.436	2385.96
859.817	2237.9
860.197	2140.81
860.578	2051
860.959	1830.13
861.34	1577.69
861.72	1388.37
862.101	1099.53
862.482	1072.83
862.862	893.22
863.243	861.66
863.623	662.63
864.003	631.08
864.384	633.5
864.764	572.82
865.144	565.54
865.524	686.9
865.904	796.13
866.284	796.13
866.664	941.76
867.044	951.47
867.424	1041.28
867.804	1131.09
868.183	1140.79
868.563	1007.3
868.943	1087.4
869.322	1038.85
869.702	885.94
870.081	878.65
870.461	752.44
870.84	711.18
871.22	645.64
871.599	533.99
871.978	407.77
872.357	383.5
872.736	451.46
873.115	325.25
873.494	373.79
873.873	361.66
874.252	378.65
874.631	385.93
875.01	473.31
875.388	563.12
875.767	415.05
876.146	502.43
876.524	563.12
876.903	487.87
877.281	555.83
877.66	507.29
878.038	361.66
878.416	371.37
878.794	398.06
879.173	422.34
879.551	279.13
879.929	291.27
880.307	276.7
880.685	179.61
881.063	291.27
881.441	262.14
881.818	242.72
882.196	216.02
882.574	228.16
882.951	262.14
883.329	271.85
883.707	250
884.084	303.4
884.461	225.73
884.839	225.73
885.216	281.56
885.593	293.69
885.971	254.86
886.348	254.86
886.725	264.57
887.102	274.28
887.479	247.58
887.856	213.6
888.233	218.45
888.609	211.17
888.986	233.01
889.363	196.61
889.74	252.43
890.116	194.18
890.493	233.01
890.869	201.46
891.246	199.03
891.622	186.9
891.998	196.61
892.375	291.27
892.751	225.73
893.127	225.73
893.503	162.62
893.879	162.62
894.255	135.92
894.631	155.34
895.007	148.06
895.383	228.16
895.759	220.88
896.134	155.34
896.51	143.21
896.886	235.44
897.261	109.23
897.637	220.88
898.012	157.77
898.388	126.22
898.763	131.07
899.138	94.66
899.514	116.51
899.889	211.17
900.264	184.47
900.639	213.6
901.014	218.45
901.389	140.78
901.764	174.76
902.139	160.2
902.513	169.91
902.888	97.09
903.263	182.04
903.638	21.85
904.012	189.32
904.387	150.49
904.761	160.2
905.136	104.37
905.51	131.07
905.884	182.04
906.259	169.91
906.633	53.4
907.007	131.07
907.381	150.49
907.755	131.07
908.129	157.77
908.503	99.52
908.877	65.53
909.251	148.06
909.624	89.81
909.998	82.53
910.372	140.78
910.745	143.21
911.119	148.06
911.492	53.4
911.866	126.22
912.239	99.52
912.612	135.92
912.986	201.46
913.359	189.32
913.732	121.36
914.105	128.64
914.478	126.22
914.851	155.34
915.224	143.21
915.597	165.05
915.97	191.75
916.343	155.34
916.715	135.92
917.088	145.63
917.461	106.8
917.833	84.95
918.206	172.33
918.578	145.63
918.951	116.51
919.323	145.63
919.695	114.08
920.067	157.77
920.44	148.06
920.812	94.66
921.184	128.64
921.556	118.93
921.928	87.38
922.3	126.22
922.672	135.92
923.043	111.65
923.415	257.29
923.787	179.61
924.158	167.48
924.53	165.05
924.901	186.9
925.273	128.64
925.644	126.22
926.016	169.91
926.387	116.51
926.758	194.18
927.129	152.91
927.5	152.91
927.872	143.21
928.243	172.33
928.613	123.79
928.984	140.78
929.355	118.93
929.726	118.93
930.097	84.95
930.467	126.22
930.838	150.49
931.209	75.24
931.579	97.09
931.95	75.24
932.32	101.94
932.69	152.91
933.061	131.07
933.431	186.9
933.801	160.2
934.171	99.52
934.541	138.35
934.911	148.06
935.281	186.9
935.651	128.64
936.021	70.39
936.391	143.21
936.761	140.78
937.13	128.64
937.5	118.93
937.87	111.65
938.239	206.31
938.609	152.91
938.978	155.34
939.347	58.25
939.717	165.05
940.086	162.62
940.455	126.22
940.824	152.91
941.193	109.23
941.562	186.9
941.931	133.5
942.3	165.05
942.669	128.64
943.038	196.61
943.407	128.64
943.775	114.08
944.144	184.47
944.513	189.32
944.881	145.63
945.25	140.78
945.618	133.5
945.986	208.74
946.355	155.34
946.723	196.61
947.091	121.36
947.459	126.22
947.827	143.21
948.195	72.82
948.563	128.64
948.931	94.66
949.299	157.77
949.667	89.81
950.035	131.07
950.402	194.18
950.77	208.74
951.138	145.63
951.505	152.91
951.873	123.79
952.24	89.81
952.607	94.66
952.975	150.49
953.342	172.33
953.709	194.18
954.076	165.05
954.443	216.02
954.81	145.63
955.177	140.78
955.544	87.38
955.911	148.06
956.278	196.61
956.645	208.74
957.012	179.61
957.378	131.07
957.745	169.91
958.111	80.1
958.478	216.02
958.844	133.5
959.211	101.94
959.577	60.68
959.943	106.8
960.309	201.46
960.675	148.06
961.042	152.91
961.408	140.78
961.774	179.61
962.139	157.77
962.505	194.18
962.871	133.5
963.237	143.21
963.603	191.75
963.968	133.5
964.334	140.78
964.699	191.75
965.065	126.22
965.43	196.61
965.796	133.5
966.161	179.61
966.526	140.78
966.891	150.49
967.256	97.09
967.622	111.65
967.987	165.05
968.352	184.47
968.716	152.91
969.081	63.11
969.446	145.63
969.811	165.05
970.176	94.66
970.54	104.37
970.905	157.77
971.269	179.61
971.634	106.8
971.998	114.08
972.363	135.92
972.727	150.49
973.091	114.08
973.455	143.21
973.819	126.22
974.183	145.63
974.547	157.77
974.911	92.23
975.275	87.38
975.639	135.92
976.003	177.19
976.367	121.36
976.73	94.66
977.094	104.37
977.458	138.35
977.821	145.63
978.185	155.34
978.548	143.21
978.911	92.23
979.275	191.75
979.638	157.77
980.001	143.21
980.364	184.47
980.727	199.03
981.09	128.64
981.453	114.08
981.816	123.79
982.179	177.19
982.542	133.5
982.905	240.29
983.267	80.1
983.63	216.02
983.992	123.79
984.355	104.37
984.717	167.48
985.08	116.51
985.442	126.22
985.804	118.93
986.167	160.2
986.529	152.91
986.891	160.2
987.253	169.91
987.615	196.61
987.977	194.18
988.339	143.21
988.701	140.78
989.062	135.92
989.424	109.23
989.786	109.23
990.147	109.23
990.509	99.52
990.87	118.93
991.232	135.92
991.593	126.22
991.955	121.36
992.316	114.08
992.677	126.22
993.038	140.78
993.399	184.47
993.76	87.38
994.121	133.5
994.482	167.48
994.843	131.07
995.204	128.64
995.565	174.76
995.926	114.08
996.286	116.51
996.647	128.64
997.007	155.34
997.368	140.78
997.728	55.83
998.089	191.75
998.449	106.8
998.809	140.78
999.169	165.05
999.53	213.6
999.89	184.47
1000.25	148.06
1000.61	138.35
1000.97	135.92
1001.329	155.34
1001.689	114.08
1002.049	116.51
1002.409	155.34
1002.768	140.78
1003.128	177.19
1003.487	111.65
1003.847	123.79
1004.206	237.87
1004.566	116.51
1004.925	109.23
1005.284	218.45
1005.643	186.9
1006.003	111.65
1006.362	92.23
1006.721	101.94
1007.08	109.23
1007.438	131.07
1007.797	177.19
1008.156	148.06
1008.515	172.33
1008.874	63.11
1009.232	118.93
1009.591	109.23
1009.949	184.47
1010.308	143.21
1010.666	167.48
1011.024	133.5
1011.383	111.65
1011.741	133.5
1012.099	97.09
1012.457	230.59
1012.815	131.07
1013.173	162.62
1013.531	155.34
1013.889	155.34
1014.247	140.78
1014.605	104.37
1014.962	160.2
1015.32	179.61
1015.678	160.2
1016.035	89.81
1016.393	114.08
1016.75	140.78
1017.107	150.49
1017.465	169.91
1017.822	135.92
1018.179	160.2
1018.536	104.37
1018.894	143.21
1019.251	174.76
1019.608	150.49
1019.964	116.51
1020.321	48.54
1020.678	145.63
1021.035	145.63
1021.392	155.34
1021.748	121.36
1022.105	145.63
1022.461	118.93
1022.818	143.21
1023.174	143.21
1023.531	172.33
1023.887	145.63
1024.243	145.63
1024.599	121.36
1024.955	138.35
1025.311	145.63
1025.667	72.82
1026.023	179.61
1026.379	206.31
1026.735	228.16
1027.091	184.47
1027.447	70.39
