189.514	52.64
189.973	52.64
190.431	52.64
190.889	38.08
191.348	-0.76
191.806	-66.29
192.264	-29.89
192.722	23.51
193.18	35.65
193.638	-29.89
194.096	-37.17
194.554	28.37
195.012	72.06
195.47	18.66
195.928	-32.31
196.385	-10.47
196.843	-34.74
197.301	-10.47
197.758	8.95
198.216	-37.17
198.674	28.37
199.131	6.52
199.589	120.6
200.046	123.03
200.503	115.75
200.961	98.76
201.418	47.79
201.875	98.76
202.332	72.06
202.79	96.33
203.247	84.19
203.704	137.59
204.161	115.75
204.618	193.42
205.075	101.18
205.532	108.47
205.989	101.18
206.445	157.01
206.902	137.59
207.359	174
207.816	120.6
208.272	132.74
208.729	152.16
209.185	101.18
209.642	164.29
210.098	113.32
210.555	135.17
211.011	142.45
211.467	205.56
211.924	178.86
212.38	135.17
212.836	152.16
213.292	157.01
213.748	144.87
214.204	152.16
214.66	135.17
215.116	140.02
215.572	125.46
216.028	113.32
216.484	64.78
216.94	142.45
217.396	176.43
217.851	161.87
218.307	144.87
218.763	161.87
219.218	149.73
219.674	140.02
220.129	166.72
220.585	142.45
221.04	120.6
221.496	169.15
221.951	123.03
222.406	171.57
222.861	108.47
223.317	205.56
223.772	200.7
224.227	205.56
224.682	130.31
225.137	106.04
225.592	154.58
226.047	152.16
226.502	207.98
226.957	169.15
227.411	178.86
227.866	152.16
228.321	118.18
228.776	149.73
229.23	110.89
229.685	159.44
230.139	174
230.594	220.12
231.048	171.57
231.503	140.02
231.957	174
232.411	76.91
232.865	239.54
233.32	207.98
233.774	127.88
234.228	52.64
234.682	84.19
235.136	79.34
235.59	181.28
236.044	118.18
236.498	251.67
236.952	123.03
237.406	135.17
237.86	125.46
238.313	152.16
238.767	171.57
239.221	108.47
239.674	144.87
240.128	110.89
240.581	144.87
241.035	120.6
241.488	110.89
241.942	174
242.395	149.73
242.848	132.74
243.301	161.87
243.755	164.29
244.208	193.42
244.661	161.87
245.114	154.58
245.567	118.18
246.02	103.61
246.473	198.27
246.926	169.15
247.379	93.9
247.832	178.86
248.284	174
248.737	113.32
249.19	132.74
249.642	200.7
250.095	130.31
250.547	144.87
251	195.85
251.452	166.72
251.905	200.7
252.357	132.74
252.81	186.14
253.262	130.31
253.714	140.02
254.166	72.06
254.618	244.39
255.07	164.29
255.523	166.72
255.975	154.58
256.427	149.73
256.878	181.28
257.33	166.72
257.782	115.75
258.234	166.72
258.686	144.87
259.137	198.27
259.589	164.29
260.041	110.89
260.492	137.59
260.944	186.14
261.395	159.44
261.847	200.7
262.298	166.72
262.749	140.02
263.201	147.3
263.652	147.3
264.103	171.57
264.554	120.6
265.005	144.87
265.457	140.02
265.908	106.04
266.359	193.42
266.809	144.87
267.26	142.45
267.711	101.18
268.162	125.46
268.613	57.49
269.064	144.87
269.514	232.25
269.965	132.74
270.415	132.74
270.866	169.15
271.316	157.01
271.767	154.58
272.217	154.58
272.668	152.16
273.118	174
273.568	205.56
274.019	169.15
274.469	86.62
274.919	137.59
275.369	140.02
275.819	183.71
276.269	169.15
276.719	176.43
277.169	203.13
277.619	261.38
278.069	154.58
278.518	169.15
278.968	157.01
279.418	193.42
279.867	135.17
280.317	110.89
280.767	79.34
281.216	154.58
281.666	195.85
282.115	171.57
282.564	152.16
283.014	212.84
283.463	106.04
283.912	222.55
284.361	137.59
284.811	193.42
285.26	224.97
285.709	127.88
286.158	152.16
286.607	176.43
287.056	169.15
287.505	239.54
287.953	176.43
288.402	169.15
288.851	183.71
289.3	108.47
289.748	101.18
290.197	125.46
290.646	193.42
291.094	147.3
291.543	166.72
291.991	232.25
292.439	166.72
292.888	207.98
293.336	132.74
293.784	130.31
294.233	188.56
294.681	164.29
295.129	135.17
295.577	203.13
296.025	154.58
296.473	157.01
296.921	234.68
297.369	164.29
297.817	120.6
298.264	181.28
298.712	178.86
299.16	210.41
299.608	118.18
300.055	188.56
300.503	169.15
300.95	232.25
301.398	188.56
301.845	207.98
302.293	132.74
302.74	159.44
303.187	159.44
303.635	224.97
304.082	108.47
304.529	140.02
304.976	181.28
305.423	166.72
305.87	207.98
306.317	69.63
306.764	178.86
307.211	127.88
307.658	157.01
308.105	142.45
308.552	137.59
308.998	178.86
309.445	123.03
309.892	137.59
310.338	178.86
310.785	147.3
311.231	161.87
311.678	123.03
312.124	157.01
312.571	227.4
313.017	127.88
313.463	108.47
313.909	79.34
314.356	123.03
314.802	113.32
315.248	152.16
315.694	154.58
316.14	171.57
316.586	147.3
317.032	203.13
317.478	161.87
317.923	176.43
318.369	64.78
318.815	118.18
319.261	157.01
319.706	147.3
320.152	157.01
320.597	183.71
321.043	144.87
321.488	164.29
321.934	183.71
322.379	120.6
322.824	159.44
323.27	171.57
323.715	205.56
324.16	169.15
324.605	72.06
325.05	164.29
325.495	161.87
325.94	258.95
326.385	152.16
326.83	89.05
327.275	193.42
327.72	120.6
328.165	171.57
328.61	135.17
329.054	127.88
329.499	200.7
329.943	166.72
330.388	125.46
330.832	198.27
331.277	178.86
331.721	164.29
332.166	120.6
332.61	125.46
333.054	132.74
333.499	79.34
333.943	157.01
334.387	169.15
334.831	123.03
335.275	140.02
335.719	222.55
336.163	186.14
336.607	144.87
337.051	110.89
337.495	181.28
337.938	164.29
338.382	190.99
338.826	188.56
339.269	118.18
339.713	110.89
340.157	217.69
340.6	127.88
341.044	98.76
341.487	205.56
341.93	178.86
342.374	93.9
342.817	217.69
343.26	67.2
343.703	161.87
344.146	181.28
344.59	207.98
345.033	183.71
345.476	164.29
345.919	120.6
346.361	120.6
346.804	123.03
347.247	186.14
347.69	178.86
348.133	166.72
348.575	183.71
349.018	154.58
349.461	106.04
349.903	144.87
350.346	178.86
350.788	210.41
351.23	89.05
351.673	123.03
352.115	193.42
352.557	157.01
353	193.42
353.442	147.3
353.884	169.15
354.326	118.18
354.768	110.89
355.21	227.4
355.652	178.86
356.094	190.99
356.536	123.03
356.978	174
357.419	166.72
357.861	198.27
358.303	195.85
358.744	135.17
359.186	190.99
359.627	186.14
360.069	125.46
360.51	164.29
360.952	106.04
361.393	115.75
361.834	157.01
362.276	157.01
362.717	176.43
363.158	120.6
363.599	171.57
364.04	147.3
364.481	132.74
364.922	169.15
365.363	123.03
365.804	149.73
366.245	50.21
366.686	132.74
367.126	188.56
367.567	200.7
368.008	149.73
368.448	166.72
368.889	152.16
369.33	186.14
369.77	154.58
370.21	132.74
370.651	149.73
371.091	120.6
371.531	127.88
371.972	217.69
372.412	120.6
372.852	115.75
373.292	186.14
373.732	169.15
374.172	110.89
374.612	135.17
375.052	190.99
375.492	120.6
375.932	176.43
376.372	212.84
376.811	215.26
377.251	127.88
377.691	149.73
378.13	135.17
378.57	237.11
379.009	147.3
379.449	152.16
379.888	113.32
380.328	157.01
380.767	137.59
381.206	178.86
381.645	222.55
382.085	101.18
382.524	198.27
382.963	159.44
383.402	108.47
383.841	186.14
384.28	64.78
384.719	91.48
385.158	101.18
385.596	149.73
386.035	120.6
386.474	127.88
386.913	147.3
387.351	198.27
387.79	132.74
388.228	212.84
388.667	203.13
389.105	203.13
389.544	132.74
389.982	186.14
390.42	154.58
390.859	149.73
391.297	123.03
391.735	195.85
392.173	154.58
392.611	212.84
393.049	157.01
393.487	178.86
393.925	130.31
394.363	130.31
394.801	118.18
395.239	79.34
395.676	142.45
396.114	154.58
396.552	120.6
396.989	137.59
397.427	144.87
397.864	181.28
398.302	166.72
398.739	188.56
399.177	152.16
399.614	106.04
400.051	164.29
400.488	118.18
400.926	159.44
401.363	154.58
401.8	69.63
402.237	169.15
402.674	123.03
403.111	142.45
403.548	96.33
403.985	188.56
404.421	166.72
404.858	120.6
405.295	103.61
405.732	125.46
406.168	169.15
406.605	166.72
407.041	125.46
407.478	127.88
407.914	93.9
408.351	115.75
408.787	149.73
409.223	169.15
409.66	203.13
410.096	178.86
410.532	200.7
410.968	198.27
411.404	140.02
411.84	169.15
412.276	132.74
412.712	166.72
413.148	137.59
413.584	120.6
414.02	176.43
414.455	98.76
414.891	118.18
415.327	125.46
415.762	161.87
416.198	125.46
416.633	118.18
417.069	222.55
417.504	152.16
417.94	161.87
418.375	132.74
418.81	142.45
419.245	154.58
419.681	159.44
420.116	195.85
420.551	193.42
420.986	147.3
421.421	79.34
421.856	198.27
422.291	144.87
422.726	154.58
423.16	205.56
423.595	171.57
424.03	183.71
424.464	222.55
424.899	132.74
425.334	154.58
425.768	164.29
426.203	186.14
426.637	169.15
427.071	212.84
427.506	169.15
427.94	203.13
428.374	76.91
428.809	171.57
429.243	183.71
429.677	195.85
430.111	142.45
430.545	154.58
430.979	188.56
431.413	147.3
431.847	188.56
432.28	203.13
432.714	239.54
433.148	103.61
433.582	183.71
434.015	164.29
434.449	178.86
434.882	186.14
435.316	110.89
435.749	159.44
436.183	123.03
436.616	142.45
437.049	207.98
437.483	132.74
437.916	130.31
438.349	157.01
438.782	200.7
439.215	159.44
439.648	93.9
440.081	210.41
440.514	186.14
440.947	84.19
441.38	188.56
441.813	154.58
442.245	157.01
442.678	130.31
443.111	135.17
443.543	174
443.976	144.87
444.408	159.44
444.841	198.27
445.273	52.64
445.705	159.44
446.138	190.99
446.57	205.56
447.002	188.56
447.434	171.57
447.867	188.56
448.299	176.43
448.731	302.64
449.163	205.56
449.595	239.54
450.026	193.42
450.458	130.31
450.89	232.25
451.322	110.89
451.754	171.57
452.185	120.6
452.617	142.45
453.048	249.25
453.48	239.54
453.911	256.53
454.343	137.59
454.774	178.86
455.205	200.7
455.637	195.85
456.068	169.15
456.499	207.98
456.93	169.15
457.361	212.84
457.792	275.94
458.223	198.27
458.654	232.25
459.085	171.57
459.516	241.96
459.947	207.98
460.378	251.67
460.808	258.95
461.239	227.4
461.669	166.72
462.1	186.14
462.531	137.59
462.961	266.24
463.391	256.53
463.822	166.72
464.252	210.41
464.682	229.83
465.113	212.84
465.543	190.99
465.973	263.81
466.403	195.85
466.833	203.13
467.263	229.83
467.693	229.83
468.123	215.26
468.553	144.87
468.983	159.44
469.412	198.27
469.842	188.56
470.272	207.98
470.701	229.83
471.131	161.87
471.56	212.84
471.99	152.16
472.419	154.58
472.849	149.73
473.278	152.16
473.707	183.71
474.136	198.27
474.566	164.29
474.995	190.99
475.424	125.46
475.853	224.97
476.282	205.56
476.711	164.29
477.14	229.83
477.569	147.3
477.997	159.44
478.426	220.12
478.855	183.71
479.283	135.17
479.712	258.95
480.141	154.58
480.569	161.87
480.998	198.27
481.426	154.58
481.854	157.01
482.283	147.3
482.711	224.97
483.139	200.7
483.567	220.12
483.995	140.02
484.424	137.59
484.852	144.87
485.28	224.97
485.708	183.71
486.135	215.26
486.563	188.56
486.991	200.7
487.419	256.53
487.847	212.84
488.274	178.86
488.702	161.87
489.129	154.58
489.557	110.89
489.984	241.96
490.412	188.56
490.839	190.99
491.266	237.11
491.694	120.6
492.121	232.25
492.548	183.71
492.975	227.4
493.402	154.58
493.829	169.15
494.256	118.18
494.683	161.87
495.11	147.3
495.537	183.71
495.964	110.89
496.39	152.16
496.817	205.56
497.244	169.15
497.67	161.87
498.097	176.43
498.523	210.41
498.95	55.07
499.376	81.77
499.803	178.86
500.229	176.43
500.655	123.03
501.081	176.43
501.508	152.16
501.934	110.89
502.36	157.01
502.786	239.54
503.212	224.97
503.638	181.28
504.064	164.29
504.489	147.3
504.915	181.28
505.341	157.01
505.767	254.1
506.192	178.86
506.618	183.71
507.043	195.85
507.469	144.87
507.894	140.02
508.32	113.32
508.745	203.13
509.17	118.18
509.596	174
510.021	183.71
510.446	110.89
510.871	193.42
511.296	258.95
511.721	147.3
512.146	152.16
512.571	84.19
512.996	127.88
513.421	203.13
513.845	127.88
514.27	127.88
514.695	135.17
515.119	188.56
515.544	200.7
515.969	135.17
516.393	210.41
516.817	147.3
517.242	157.01
517.666	200.7
518.09	164.29
518.515	207.98
518.939	118.18
519.363	370.61
519.787	183.71
520.211	135.17
520.635	205.56
521.059	210.41
521.483	142.45
521.907	154.58
522.331	154.58
522.754	188.56
523.178	113.32
523.602	103.61
524.025	195.85
524.449	188.56
524.872	142.45
525.296	166.72
525.719	207.98
526.143	178.86
526.566	152.16
526.989	176.43
527.412	171.57
527.836	178.86
528.259	135.17
528.682	195.85
529.105	193.42
529.528	215.26
529.951	169.15
530.374	174
530.796	203.13
531.219	161.87
531.642	152.16
532.065	217.69
532.487	251.67
532.91	224.97
533.332	200.7
533.755	203.13
534.177	239.54
534.6	135.17
535.022	135.17
535.444	176.43
535.867	113.32
536.289	154.58
536.711	239.54
537.133	125.46
537.555	183.71
537.977	123.03
538.399	171.57
538.821	181.28
539.243	166.72
539.665	181.28
540.086	195.85
540.508	144.87
540.93	164.29
541.351	193.42
541.773	140.02
542.195	169.15
542.616	224.97
543.037	215.26
543.459	200.7
543.88	149.73
544.301	142.45
544.723	142.45
545.144	149.73
545.565	101.18
545.986	149.73
546.407	157.01
546.828	120.6
547.249	127.88
547.67	115.75
548.091	125.46
548.512	144.87
548.932	210.41
549.353	198.27
549.774	183.71
550.194	200.7
550.615	149.73
551.035	169.15
551.456	127.88
551.876	164.29
552.296	123.03
552.717	159.44
553.137	144.87
553.557	157.01
553.977	103.61
554.397	186.14
554.817	132.74
555.237	154.58
555.657	183.71
556.077	125.46
556.497	212.84
556.917	144.87
557.337	176.43
557.756	205.56
558.176	89.05
558.596	142.45
559.015	188.56
559.435	147.3
559.854	249.25
560.274	154.58
560.693	212.84
561.112	222.55
561.532	127.88
561.951	157.01
562.37	207.98
562.789	190.99
563.208	205.56
563.627	164.29
564.046	164.29
564.465	183.71
564.884	154.58
565.303	166.72
565.722	200.7
566.14	188.56
566.559	200.7
566.978	195.85
567.396	174
567.815	186.14
568.233	205.56
568.652	86.62
569.07	152.16
569.489	69.63
569.907	181.28
570.325	215.26
570.743	161.87
571.161	169.15
571.58	171.57
571.998	132.74
572.416	120.6
572.833	174
573.251	193.42
573.669	193.42
574.087	181.28
574.505	220.12
574.922	161.87
575.34	154.58
575.758	161.87
576.175	149.73
576.593	164.29
577.01	123.03
577.428	135.17
577.845	1377.9
578.262	266.24
578.68	157.01
579.097	190.99
579.514	200.7
579.931	147.3
580.348	103.61
580.765	152.16
581.182	188.56
581.599	178.86
582.016	195.85
582.433	144.87
582.849	166.72
583.266	181.28
583.683	178.86
584.099	130.31
584.516	178.86
584.933	130.31
585.349	207.98
585.765	220.12
586.182	149.73
586.598	193.42
587.014	166.72
587.431	137.59
587.847	207.98
588.263	157.01
588.679	110.89
589.095	152.16
589.511	152.16
589.927	198.27
590.343	140.02
590.759	178.86
591.174	212.84
591.59	195.85
592.006	157.01
592.421	127.88
592.837	140.02
593.252	217.69
593.668	183.71
594.083	195.85
594.499	152.16
594.914	144.87
595.329	195.85
595.745	149.73
596.16	118.18
596.575	127.88
596.99	137.59
597.405	181.28
597.82	169.15
598.235	132.74
598.65	178.86
599.065	132.74
599.479	193.42
599.894	157.01
600.309	195.85
600.724	190.99
601.138	222.55
601.553	152.16
601.967	195.85
602.382	195.85
602.796	154.58
603.21	159.44
603.625	227.4
604.039	217.69
604.453	183.71
604.867	130.31
605.281	91.48
605.695	183.71
606.109	181.28
606.523	207.98
606.937	144.87
607.351	324.49
607.765	207.98
608.178	164.29
608.592	59.92
609.006	137.59
609.419	212.84
609.833	217.69
610.246	152.16
610.66	217.69
611.073	171.57
611.487	183.71
611.9	137.59
612.313	188.56
612.726	193.42
613.139	188.56
613.553	115.75
613.966	123.03
614.379	268.66
614.792	159.44
615.204	198.27
615.617	224.97
616.03	152.16
616.443	198.27
616.856	174
617.268	103.61
617.681	200.7
618.093	210.41
618.506	147.3
618.918	174
619.331	198.27
619.743	154.58
620.155	198.27
620.568	183.71
620.98	132.74
621.392	261.38
621.804	161.87
622.216	171.57
622.628	161.87
623.04	186.14
623.452	149.73
623.864	200.7
624.276	161.87
624.687	205.56
625.099	152.16
625.511	127.88
625.922	186.14
626.334	101.18
626.745	171.57
627.157	169.15
627.568	91.48
627.979	234.68
628.391	140.02
628.802	157.01
629.213	132.74
629.624	171.57
630.035	169.15
630.446	215.26
630.857	186.14
631.268	123.03
631.679	227.4
632.09	123.03
632.501	251.67
632.912	207.98
633.322	166.72
633.733	176.43
634.144	110.89
634.554	164.29
634.965	181.28
635.375	144.87
635.785	176.43
636.196	96.33
636.606	123.03
637.016	118.18
637.427	227.4
637.837	210.41
638.247	222.55
638.657	174
639.067	96.33
639.477	220.12
639.887	166.72
640.297	130.31
640.706	123.03
641.116	193.42
641.526	183.71
641.935	166.72
642.345	154.58
642.755	149.73
643.164	183.71
643.573	164.29
643.983	190.99
644.392	188.56
644.801	166.72
645.211	232.25
645.62	217.69
646.029	200.7
646.438	147.3
646.847	212.84
647.256	118.18
647.665	118.18
648.074	132.74
648.483	140.02
648.892	127.88
649.3	137.59
649.709	239.54
650.118	169.15
650.526	144.87
650.935	140.02
651.343	203.13
651.752	108.47
652.16	123.03
652.568	154.58
652.977	178.86
653.385	106.04
653.793	108.47
654.201	149.73
654.609	176.43
655.017	152.16
655.425	169.15
655.833	106.04
656.241	135.17
656.649	186.14
657.057	169.15
657.464	207.98
657.872	144.87
658.28	229.83
658.687	64.78
659.095	161.87
659.502	147.3
659.91	127.88
660.317	137.59
660.724	174
661.132	144.87
661.539	195.85
661.946	147.3
662.353	174
662.76	164.29
663.167	123.03
663.574	171.57
663.981	101.18
664.388	183.71
664.795	171.57
665.202	254.1
665.608	159.44
666.015	198.27
666.422	217.69
666.828	171.57
667.235	200.7
667.641	123.03
668.047	137.59
668.454	127.88
668.86	217.69
669.266	169.15
669.673	215.26
670.079	190.99
670.485	125.46
670.891	198.27
671.297	190.99
671.703	241.96
672.109	132.74
672.515	164.29
672.92	152.16
673.326	193.42
673.732	246.82
674.138	166.72
674.543	210.41
674.949	149.73
675.354	147.3
675.76	171.57
676.165	210.41
676.57	140.02
676.976	239.54
677.381	198.27
677.786	106.04
678.191	147.3
678.596	127.88
679.001	159.44
679.406	142.45
679.811	171.57
680.216	157.01
680.621	147.3
681.026	101.18
681.43	149.73
681.835	152.16
682.24	157.01
682.644	108.47
683.049	195.85
683.453	205.56
683.858	137.59
684.262	132.74
684.667	147.3
685.071	130.31
685.475	115.75
685.879	176.43
686.283	118.18
686.687	190.99
687.091	169.15
687.495	154.58
687.899	142.45
688.303	203.13
688.707	159.44
689.111	229.83
689.514	200.7
689.918	157.01
690.322	174
690.725	157.01
691.129	195.85
691.532	149.73
691.936	144.87
692.339	157.01
692.742	195.85
693.146	171.57
693.549	210.41
693.952	220.12
694.355	120.6
694.758	120.6
695.161	178.86
695.564	237.11
695.967	176.43
696.37	183.71
696.773	176.43
697.175	212.84
697.578	229.83
697.981	149.73
698.383	161.87
698.786	200.7
699.188	130.31
699.591	190.99
699.993	220.12
700.395	159.44
700.798	154.58
701.2	217.69
701.602	186.14
702.004	159.44
702.406	215.26
702.808	215.26
703.21	212.84
703.612	205.56
704.014	205.56
704.416	190.99
704.818	200.7
705.219	203.13
705.621	244.39
706.023	275.94
706.424	212.84
706.826	232.25
707.227	207.98
707.629	142.45
708.03	220.12
708.431	217.69
708.832	261.38
709.234	232.25
709.635	224.97
710.036	198.27
710.437	278.37
710.838	256.53
711.239	288.08
711.64	273.52
712.041	229.83
712.441	256.53
712.842	234.68
713.243	169.15
713.643	263.81
714.044	195.85
714.445	302.64
714.845	254.1
715.246	283.23
715.646	244.39
716.046	275.94
716.447	241.96
716.847	261.38
717.247	258.95
717.647	280.8
718.047	258.95
718.447	326.92
718.847	251.67
719.247	353.62
719.647	297.79
720.047	314.78
720.446	368.18
720.846	365.75
721.246	411.87
721.645	331.77
722.045	397.31
722.444	472.55
722.844	489.54
723.243	450.7
723.643	438.57
724.042	428.86
724.441	491.97
724.84	472.55
725.24	542.94
725.639	501.68
726.038	504.1
726.437	535.66
726.836	545.37
727.234	574.49
727.633	564.78
728.032	644.88
728.431	652.16
728.83	671.58
729.228	744.4
729.627	693.43
730.025	712.84
730.424	737.12
730.822	763.82
731.22	778.38
731.619	674.01
732.017	834.21
732.415	829.35
732.813	839.06
733.212	936.15
733.61	1079.36
734.008	1227.42
734.406	1441.01
734.803	1618.2
735.201	1710.43
735.599	1863.35
735.997	2178.89
736.395	2501.71
736.792	2620.64
737.19	2538.12
737.587	2705.59
737.985	2581.81
738.382	2373.06
738.78	2275.98
739.177	2217.72
739.574	2098.79
739.971	1924.03
740.369	1967.72
740.766	1943.45
741.163	2072.09
741.56	2404.62
741.957	2839.09
742.354	3312.4
742.751	4140.08
743.147	4831.84
743.544	5501.75
743.941	5793.02
744.338	6293.03
744.734	6397.4
745.131	6239.63
745.527	6084.29
745.924	5652.24
746.32	5144.95
746.716	4737.18
747.113	4176.49
747.509	4064.84
747.905	4285.72
748.301	4899.8
748.697	5819.72
749.093	7055.18
749.489	8375.59
749.885	10188.72
750.281	11749.42
750.677	12589.24
751.073	13288.28
751.468	12856.24
751.864	12613.52
752.26	11545.54
752.655	10412.02
753.051	9171.71
753.446	8642.58
753.842	8142.57
754.237	8754.23
754.632	9776.09
755.028	11863.5
755.423	13761.59
755.818	16234.93
756.213	18322.34
756.608	19118.47
757.003	19829.65
757.398	18960.7
757.793	17504.37
758.188	15499.48
758.583	13569.84
758.977	12011.56
759.372	11703.31
759.767	12472.74
760.161	14351.41
760.556	17613.59
760.95	21290.83
761.345	24451.08
761.739	27914.72
762.133	28902.6
762.527	28934.16
762.922	27400.15
763.316	25118.56
763.71	22077.25
764.104	19552.94
764.498	19011.67
764.892	19822.37
765.286	22033.56
765.68	26193.82
766.073	30392.92
766.467	34531.33
766.861	37227.98
767.255	38252.26
767.648	36798.36
768.042	34002.2
768.435	29764.27
768.829	26647.71
769.222	25795.76
769.615	26142.85
770.008	28222.98
770.402	32050.71
770.795	37329.92
771.188	41720.76
771.581	43189.23
771.974	42196.5
772.367	39147.91
772.76	35786.21
773.153	31031.28
773.545	28111.33
773.938	27006.94
774.331	29033.67
774.724	31946.34
775.116	38354.21
775.509	44269.35
775.901	48310.67
776.294	48723.3
776.686	47240.27
777.078	42385.82
777.471	39065.38
777.863	36410
778.255	36060.48
778.647	38511.98
779.039	42652.82
779.431	47706.29
779.823	52257.34
780.215	54645.72
780.607	53606.87
780.999	52133.55
781.39	47194.15
781.782	42813.01
782.174	39953.75
782.565	40924.64
782.957	44198.96
783.348	49803.41
783.74	54262.22
784.131	56386.04
784.522	57369.07
784.914	53699.11
785.305	49550.98
785.696	44948.97
786.087	41395.52
786.478	39944.04
786.869	41492.61
787.26	45487.81
787.651	49267
788.042	51604.41
788.433	50451.48
788.823	46781.52
789.214	42400.39
789.605	37640.6
789.995	33924.53
790.386	32667.23
790.776	35764.36
791.167	39788.7
791.557	45427.13
791.948	47131.04
792.338	47048.52
792.728	45524.22
793.118	40329.97
793.508	36473.11
793.898	34866.29
794.288	36669.71
794.678	40184.33
795.068	45179.56
795.458	47868.92
795.848	49092.24
796.238	46536.37
796.627	42383.4
797.017	38264.4
797.406	35419.7
797.796	35611.45
798.185	39334.8
798.575	44021.77
798.964	46830.07
799.354	49417.49
799.743	47572.8
800.132	43597.01
800.521	39288.69
800.91	35963.39
801.299	35827.47
801.688	38732.85
802.077	42191.65
802.466	46150.44
802.855	47298.52
803.244	43749.92
803.633	39839.67
804.021	35201.25
804.41	32703.63
804.799	31800.71
805.187	33519.18
805.576	36405.15
805.964	38244.98
806.352	38623.63
806.741	36968.26
807.129	32419.65
807.517	29278.82
807.905	27395.3
808.293	28422.01
808.681	31203.61
809.069	34723.08
809.457	38613.92
809.845	38944.02
810.233	35885.72
810.621	32050.71
811.009	29096.78
811.396	28686.58
811.784	30240
812.171	33293.45
812.559	35640.57
812.946	36769.23
813.334	35257.07
813.721	31764.3
814.108	27181.7
814.496	25790.9
814.883	26203.53
815.27	29812.81
815.657	32502.17
816.044	34191.52
816.431	33754.62
816.818	31281.28
817.205	27402.58
817.592	25201.09
817.979	24424.38
818.365	26455.96
818.752	27946.28
819.139	29159.89
819.525	29936.6
819.912	27412.29
820.298	24036.02
820.685	21254.43
821.071	19669.45
821.457	20514.12
821.843	22016.57
822.23	23703.49
822.616	23065.13
823.002	21305.4
823.388	18400.01
823.774	16409.69
824.16	15256.76
824.546	15569.87
824.931	17356.31
825.317	18436.42
825.703	18783.51
826.089	17664.56
826.474	15586.86
826.86	13938.78
827.245	13210.61
827.631	14208.2
828.016	15766.48
828.401	16749.5
828.787	16533.48
829.172	15057.73
829.557	13205.76
829.942	11766.41
830.327	11263.98
830.712	11972.73
831.097	13164.49
831.482	13919.36
831.867	13458.19
832.252	12402.35
832.636	10793.1
833.021	9829.49
833.406	9564.92
833.79	10290.66
834.175	11234.85
834.559	12230.01
834.944	11501.85
835.328	10329.5
835.713	8839.18
836.097	8091.6
836.481	7931.4
836.865	8635.3
837.249	9033.36
837.633	9198.41
838.017	8841.61
838.401	7666.84
838.785	6601.29
839.169	6079.43
839.553	6174.09
839.937	6640.12
840.32	6999.35
840.704	6729.93
841.087	6084.29
841.471	5293.01
841.854	4841.55
842.238	4555.14
842.621	4865.82
843.004	5339.13
843.388	5623.12
843.771	5407.09
844.154	4652.23
844.537	4144.94
844.92	3873.09
845.303	4059.98
845.686	4397.37
846.069	4712.91
846.452	4780.87
846.834	4409.5
847.217	3759.01
847.6	3319.68
847.982	3339.1
848.365	3700.76
848.748	3892.51
849.13	4081.83
849.512	3630.37
849.895	3363.37
850.277	3045.41
850.659	2700.74
851.041	3021.13
851.423	3161.91
851.806	3458.03
852.188	3152.2
852.57	2965.31
852.951	2678.89
853.333	2438.6
853.715	2312.38
854.097	2613.36
854.479	2817.25
854.86	2846.37
855.242	2593.94
855.623	2268.69
856.005	1899.76
856.386	1863.35
856.768	1928.88
857.149	2188.6
857.53	2205.59
857.911	2062.38
858.292	1916.75
858.674	1542.95
859.055	1467.71
859.436	1458
859.817	1550.24
860.197	1618.2
860.578	1644.9
860.959	1450.72
861.34	1227.42
861.72	1096.35
862.101	1166.74
862.482	1275.96
862.862	1307.51
863.243	1382.76
863.623	1191.01
864.003	1018.67
864.384	928.87
864.764	945.86
865.144	1045.37
865.524	1076.93
865.904	1008.97
866.284	982.27
866.664	873.04
867.044	749.25
867.424	710.42
867.804	834.21
868.183	984.69
868.563	873.04
868.943	841.49
869.322	751.68
869.702	630.32
870.081	632.75
870.461	724.98
870.84	693.43
871.22	775.95
871.599	671.58
871.978	654.59
872.357	538.08
872.736	487.11
873.115	538.08
873.494	550.22
873.873	545.37
874.252	511.39
874.631	513.81
875.01	387.6
875.388	373.03
875.767	392.45
876.146	424.01
876.524	448.28
876.903	397.31
877.281	348.76
877.66	365.75
878.038	336.63
878.416	295.36
878.794	339.05
879.173	356.04
879.551	450.7
879.929	300.22
880.307	312.35
880.685	290.51
881.063	292.94
881.441	307.5
881.818	331.77
882.196	283.23
882.574	246.82
882.951	300.22
883.329	249.25
883.707	229.83
884.084	283.23
884.461	227.4
884.839	237.11
885.216	193.42
885.593	239.54
885.971	222.55
886.348	251.67
886.725	181.28
887.102	232.25
887.479	220.12
887.856	290.51
888.233	239.54
888.609	263.81
888.986	164.29
889.363	229.83
889.74	329.34
890.116	268.66
890.493	256.53
890.869	144.87
891.246	195.85
891.622	258.95
891.998	149.73
892.375	135.17
892.751	210.41
893.127	205.56
893.503	234.68
893.879	164.29
894.255	210.41
894.631	215.26
895.007	251.67
895.383	159.44
895.759	135.17
896.134	198.27
896.51	127.88
896.886	115.75
897.261	200.7
897.637	186.14
898.012	132.74
898.388	137.59
898.763	135.17
899.138	159.44
899.514	176.43
899.889	127.88
900.264	123.03
900.639	190.99
901.014	157.01
901.389	149.73
901.764	154.58
902.139	127.88
902.513	205.56
902.888	171.57
903.263	161.87
903.638	203.13
904.012	152.16
904.387	157.01
904.761	142.45
905.136	130.31
905.51	135.17
905.884	164.29
906.259	135.17
906.633	106.04
907.007	132.74
907.381	147.3
907.755	140.02
908.129	86.62
908.503	210.41
908.877	137.59
909.251	137.59
909.624	157.01
909.998	152.16
910.372	152.16
910.745	140.02
911.119	140.02
911.492	118.18
911.866	93.9
912.239	135.17
912.612	198.27
912.986	147.3
913.359	142.45
913.732	188.56
914.105	118.18
914.478	159.44
914.851	120.6
915.224	203.13
915.597	166.72
915.97	142.45
916.343	64.78
916.715	224.97
917.088	171.57
917.461	110.89
917.833	171.57
918.206	227.4
918.578	203.13
918.951	135.17
919.323	96.33
919.695	152.16
920.067	193.42
920.44	113.32
920.812	157.01
921.184	186.14
921.556	215.26
921.928	110.89
922.3	113.32
922.672	183.71
923.043	166.72
923.415	210.41
923.787	188.56
924.158	190.99
924.53	144.87
924.901	217.69
925.273	69.63
925.644	193.42
926.016	161.87
926.387	118.18
926.758	103.61
927.129	132.74
927.5	140.02
927.872	220.12
928.243	190.99
928.613	108.47
928.984	67.2
929.355	130.31
929.726	152.16
930.097	127.88
930.467	123.03
930.838	108.47
931.209	140.02
931.579	169.15
931.95	123.03
932.32	96.33
932.69	137.59
933.061	166.72
933.431	171.57
933.801	161.87
934.171	169.15
934.541	125.46
934.911	108.47
935.281	169.15
935.651	200.7
936.021	154.58
936.391	149.73
936.761	154.58
937.13	110.89
937.5	115.75
937.87	135.17
938.239	72.06
938.609	164.29
938.978	193.42
939.347	106.04
939.717	110.89
940.086	137.59
940.455	123.03
940.824	212.84
941.193	169.15
941.562	125.46
941.931	81.77
942.3	149.73
942.669	157.01
943.038	123.03
943.407	115.75
943.775	144.87
944.144	186.14
944.513	110.89
944.881	205.56
945.25	101.18
945.618	96.33
945.986	110.89
946.355	127.88
946.723	181.28
947.091	123.03
947.459	195.85
947.827	178.86
948.195	110.89
948.563	96.33
948.931	157.01
949.299	171.57
949.667	183.71
950.035	144.87
950.402	149.73
950.77	127.88
951.138	176.43
951.505	147.3
951.873	154.58
952.24	157.01
952.607	127.88
952.975	181.28
953.342	144.87
953.709	137.59
954.076	140.02
954.443	123.03
954.81	169.15
955.177	161.87
955.544	152.16
955.911	258.95
956.278	217.69
956.645	152.16
957.012	108.47
957.378	115.75
957.745	140.02
958.111	164.29
958.478	193.42
958.844	154.58
959.211	178.86
959.577	130.31
959.943	84.19
960.309	205.56
960.675	113.32
961.042	135.17
961.408	152.16
961.774	217.69
962.139	164.29
962.505	157.01
962.871	157.01
963.237	103.61
963.603	154.58
963.968	103.61
964.334	161.87
964.699	127.88
965.065	113.32
965.43	181.28
965.796	159.44
966.161	142.45
966.526	140.02
966.891	174
967.256	103.61
967.622	171.57
967.987	113.32
968.352	59.92
968.716	157.01
969.081	142.45
969.446	123.03
969.811	207.98
970.176	215.26
970.54	149.73
970.905	164.29
971.269	183.71
971.634	142.45
971.998	135.17
972.363	178.86
972.727	132.74
973.091	186.14
973.455	212.84
973.819	152.16
974.183	157.01
974.547	178.86
974.911	132.74
975.275	174
975.639	149.73
976.003	142.45
976.367	166.72
976.73	110.89
977.094	157.01
977.458	164.29
977.821	220.12
978.185	108.47
978.548	137.59
978.911	76.91
979.275	149.73
979.638	125.46
980.001	76.91
980.364	135.17
980.727	130.31
981.09	178.86
981.453	125.46
981.816	174
982.179	186.14
982.542	144.87
982.905	137.59
983.267	120.6
983.63	193.42
983.992	166.72
984.355	217.69
984.717	152.16
985.08	140.02
985.442	93.9
985.804	171.57
986.167	178.86
986.529	144.87
986.891	154.58
987.253	137.59
987.615	210.41
987.977	207.98
988.339	181.28
988.701	125.46
989.062	183.71
989.424	72.06
989.786	74.49
990.147	200.7
990.509	186.14
990.87	149.73
991.232	159.44
991.593	96.33
991.955	118.18
992.316	115.75
992.677	76.91
993.038	166.72
993.399	176.43
993.76	159.44
994.121	251.67
994.482	135.17
994.843	152.16
995.204	154.58
995.565	203.13
995.926	147.3
996.286	130.31
996.647	108.47
997.007	152.16
997.368	118.18
997.728	200.7
998.089	161.87
998.449	135.17
998.809	149.73
999.169	193.42
999.53	127.88
999.89	159.44
1000.25	147.3
1000.61	234.68
1000.97	147.3
1001.329	205.56
1001.689	142.45
1002.049	161.87
1002.409	118.18
1002.768	108.47
1003.128	186.14
1003.487	110.89
1003.847	176.43
1004.206	152.16
1004.566	142.45
1004.925	195.85
1005.284	149.73
1005.643	132.74
1006.003	140.02
1006.362	210.41
1006.721	140.02
1007.08	215.26
1007.438	91.48
1007.797	147.3
1008.156	84.19
1008.515	176.43
1008.874	215.26
1009.232	125.46
1009.591	217.69
1009.949	140.02
1010.308	215.26
1010.666	159.44
1011.024	118.18
1011.383	171.57
1011.741	110.89
1012.099	115.75
1012.457	113.32
1012.815	123.03
1013.173	154.58
1013.531	193.42
1013.889	118.18
1014.247	135.17
1014.605	147.3
1014.962	93.9
1015.32	147.3
1015.678	130.31
1016.035	159.44
1016.393	135.17
1016.75	125.46
1017.107	115.75
1017.465	154.58
1017.822	101.18
1018.179	203.13
1018.536	125.46
1018.894	152.16
1019.251	91.48
1019.608	188.56
1019.964	166.72
1020.321	203.13
1020.678	166.72
1021.035	118.18
1021.392	164.29
1021.748	174
1022.105	174
1022.461	207.98
1022.818	166.72
1023.174	147.3
1023.531	186.14
1023.887	76.91
1024.243	96.33
1024.599	123.03
1024.955	137.59
1025.311	110.89
1025.667	91.48
1026.023	186.14
1026.379	130.31
1026.735	166.72
1027.091	152.16
1027.447	147.3
