189.514	87.23
189.973	87.23
190.431	87.23
190.889	2.28
191.348	65.38
191.806	2.28
192.264	-5.01
192.722	-12.29
193.18	-38.99
193.638	-53.55
194.096	26.55
194.554	-19.57
195.012	-7.43
195.47	-63.26
195.928	21.69
196.385	-53.55
196.843	67.81
197.301	16.84
197.758	45.97
198.216	19.27
198.674	-5.01
199.131	60.53
199.589	50.82
200.046	33.83
200.503	24.12
200.961	14.41
201.418	94.51
201.875	123.64
202.332	99.36
202.79	111.5
203.247	111.5
203.704	111.5
204.161	169.75
204.618	121.21
205.075	186.74
205.532	220.73
205.989	162.47
206.445	89.66
206.902	145.48
207.359	162.47
207.816	118.78
208.272	266.84
208.729	201.31
209.185	123.64
209.642	181.89
210.098	118.78
210.555	162.47
211.011	181.89
211.467	118.78
211.924	186.74
212.38	169.75
212.836	155.19
213.292	140.63
213.748	128.49
214.204	84.8
214.66	155.19
215.116	121.21
215.572	50.82
216.028	116.35
216.484	194.03
216.94	164.9
217.396	89.66
217.851	111.5
218.307	126.06
218.763	172.18
219.218	172.18
219.674	113.93
220.129	121.21
220.585	126.06
221.04	152.76
221.496	116.35
221.951	72.66
222.406	128.49
222.861	133.35
223.317	113.93
223.772	143.05
224.227	157.62
224.682	203.73
225.137	138.2
225.592	121.21
226.047	135.77
226.502	169.75
226.957	191.6
227.411	92.08
227.866	104.22
228.321	198.88
228.776	174.61
229.23	128.49
229.685	179.46
230.139	130.92
230.594	201.31
231.048	293.54
231.503	143.05
231.957	160.04
232.411	92.08
232.865	172.18
233.32	128.49
233.774	169.75
234.228	138.2
234.682	167.33
235.136	118.78
235.59	169.75
236.044	169.75
236.498	128.49
236.952	94.51
237.406	169.75
237.86	143.05
238.313	152.76
238.767	164.9
239.221	140.63
239.674	101.79
240.128	99.36
240.581	143.05
241.035	157.62
241.488	196.45
241.942	116.35
242.395	191.6
242.848	152.76
243.301	82.37
243.755	121.21
244.208	126.06
244.661	150.34
245.114	235.29
245.567	213.44
246.02	150.34
246.473	53.25
246.926	126.06
247.379	152.76
247.832	179.46
248.284	172.18
248.737	155.19
249.19	155.19
249.642	147.91
250.095	126.06
250.547	162.47
251	113.93
251.452	123.64
251.905	150.34
252.357	92.08
252.81	87.23
253.262	155.19
253.714	228.01
254.166	167.33
254.618	186.74
255.07	143.05
255.523	50.82
255.975	138.2
256.427	211.02
256.878	121.21
257.33	145.48
257.782	143.05
258.234	160.04
258.686	157.62
259.137	145.48
259.589	118.78
260.041	164.9
260.492	135.77
260.944	140.63
261.395	169.75
261.847	237.72
262.298	123.64
262.749	150.34
263.201	167.33
263.652	147.91
264.103	201.31
264.554	169.75
265.005	126.06
265.457	104.22
265.908	140.63
266.359	201.31
266.809	169.75
267.26	135.77
267.711	186.74
268.162	113.93
268.613	106.65
269.064	140.63
269.514	101.79
269.965	189.17
270.415	196.45
270.866	206.16
271.316	113.93
271.767	99.36
272.217	138.2
272.668	191.6
273.118	109.07
273.568	152.76
274.019	194.03
274.469	172.18
274.919	140.63
275.369	152.76
275.819	174.61
276.269	89.66
276.719	135.77
277.169	140.63
277.619	133.35
278.069	128.49
278.518	196.45
278.968	179.46
279.418	172.18
279.867	106.65
280.317	169.75
280.767	126.06
281.216	218.3
281.666	208.59
282.115	123.64
282.564	130.92
283.014	113.93
283.463	94.51
283.912	164.9
284.361	152.76
284.811	181.89
285.26	169.75
285.709	196.45
286.158	230.43
286.607	75.09
287.056	164.9
287.505	138.2
287.953	140.63
288.402	109.07
288.851	128.49
289.3	162.47
289.748	184.32
290.197	172.18
290.646	167.33
291.094	150.34
291.543	150.34
291.991	169.75
292.439	167.33
292.888	113.93
293.336	101.79
293.784	135.77
294.233	96.94
294.681	143.05
295.129	138.2
295.577	181.89
296.025	147.91
296.473	104.22
296.921	164.9
297.369	155.19
297.817	194.03
298.264	191.6
298.712	135.77
299.16	147.91
299.608	169.75
300.055	228.01
300.503	186.74
300.95	169.75
301.398	138.2
301.845	167.33
302.293	162.47
302.74	128.49
303.187	126.06
303.635	111.5
304.082	150.34
304.529	79.95
304.976	126.06
305.423	184.32
305.87	162.47
306.317	177.04
306.764	150.34
307.211	130.92
307.658	150.34
308.105	198.88
308.552	155.19
308.998	172.18
309.445	169.75
309.892	109.07
310.338	167.33
310.785	208.59
311.231	186.74
311.678	174.61
312.124	181.89
312.571	169.75
313.017	223.15
313.463	179.46
313.909	135.77
314.356	92.08
314.802	152.76
315.248	111.5
315.694	135.77
316.14	118.78
316.586	145.48
317.032	179.46
317.478	189.17
317.923	169.75
318.369	116.35
318.815	128.49
319.261	145.48
319.706	164.9
320.152	152.76
320.597	162.47
321.043	162.47
321.488	150.34
321.934	157.62
322.379	186.74
322.824	196.45
323.27	167.33
323.715	67.81
324.16	113.93
324.605	145.48
325.05	128.49
325.495	152.76
325.94	177.04
326.385	196.45
326.83	143.05
327.275	126.06
327.72	177.04
328.165	140.63
328.61	215.87
329.054	147.91
329.499	179.46
329.943	128.49
330.388	99.36
330.832	152.76
331.277	143.05
331.721	113.93
332.166	169.75
332.61	106.65
333.054	145.48
333.499	143.05
333.943	157.62
334.387	211.02
334.831	143.05
335.275	113.93
335.719	186.74
336.163	126.06
336.607	143.05
337.051	111.5
337.495	109.07
337.938	101.79
338.382	104.22
338.826	140.63
339.269	194.03
339.713	126.06
340.157	169.75
340.6	123.64
341.044	169.75
341.487	121.21
341.93	172.18
342.374	140.63
342.817	147.91
343.26	133.35
343.703	191.6
344.146	109.07
344.59	172.18
345.033	174.61
345.476	150.34
345.919	121.21
346.361	174.61
346.804	143.05
347.247	237.72
347.69	128.49
348.133	121.21
348.575	126.06
349.018	150.34
349.461	143.05
349.903	157.62
350.346	215.87
350.788	157.62
351.23	157.62
351.673	194.03
352.115	147.91
352.557	194.03
353	196.45
353.442	113.93
353.884	147.91
354.326	155.19
354.768	145.48
355.21	147.91
355.652	135.77
356.094	186.74
356.536	109.07
356.978	169.75
357.419	157.62
357.861	177.04
358.303	177.04
358.744	157.62
359.186	169.75
359.627	215.87
360.069	167.33
360.51	135.77
360.952	133.35
361.393	150.34
361.834	235.29
362.276	198.88
362.717	181.89
363.158	101.79
363.599	162.47
364.04	75.09
364.481	135.77
364.922	213.44
365.363	104.22
365.804	152.76
366.245	87.23
366.686	150.34
367.126	203.73
367.567	157.62
368.008	109.07
368.448	160.04
368.889	118.78
369.33	79.95
369.77	123.64
370.21	164.9
370.651	138.2
371.091	177.04
371.531	126.06
371.972	164.9
372.412	104.22
372.852	138.2
373.292	77.52
373.732	143.05
374.172	133.35
374.612	106.65
375.052	113.93
375.492	126.06
375.932	206.16
376.372	174.61
376.811	162.47
377.251	184.32
377.691	160.04
378.13	203.73
378.57	189.17
379.009	191.6
379.449	135.77
379.888	89.66
380.328	79.95
380.767	167.33
381.206	126.06
381.645	172.18
382.085	198.88
382.524	145.48
382.963	143.05
383.402	118.78
383.841	198.88
384.28	92.08
384.719	177.04
385.158	118.78
385.596	198.88
386.035	220.73
386.474	126.06
386.913	155.19
387.351	191.6
387.79	179.46
388.228	143.05
388.667	138.2
389.105	174.61
389.544	138.2
389.982	128.49
390.42	140.63
390.859	75.09
391.297	92.08
391.735	196.45
392.173	140.63
392.611	181.89
393.049	189.17
393.487	155.19
393.925	140.63
394.363	123.64
394.801	145.48
395.239	167.33
395.676	116.35
396.114	138.2
396.552	143.05
396.989	87.23
397.427	169.75
397.864	101.79
398.302	118.78
398.739	113.93
399.177	109.07
399.614	135.77
400.051	177.04
400.488	167.33
400.926	155.19
401.363	99.36
401.8	150.34
402.237	104.22
402.674	89.66
403.111	215.87
403.548	150.34
403.985	99.36
404.421	130.92
404.858	128.49
405.295	150.34
405.732	109.07
406.168	194.03
406.605	82.37
407.041	109.07
407.478	111.5
407.914	140.63
408.351	135.77
408.787	143.05
409.223	123.64
409.66	189.17
410.096	155.19
410.532	164.9
410.968	140.63
411.404	94.51
411.84	145.48
412.276	157.62
412.712	106.65
413.148	116.35
413.584	169.75
414.02	157.62
414.455	118.78
414.891	145.48
415.327	121.21
415.762	128.49
416.198	118.78
416.633	189.17
417.069	121.21
417.504	145.48
417.94	118.78
418.375	143.05
418.81	162.47
419.245	152.76
419.681	172.18
420.116	121.21
420.551	184.32
420.986	150.34
421.421	157.62
421.856	181.89
422.291	186.74
422.726	65.38
423.16	160.04
423.595	145.48
424.03	147.91
424.464	121.21
424.899	111.5
425.334	145.48
425.768	113.93
426.203	138.2
426.637	218.3
427.071	123.64
427.506	167.33
427.94	145.48
428.374	96.94
428.809	184.32
429.243	145.48
429.677	169.75
430.111	109.07
430.545	145.48
430.979	152.76
431.413	150.34
431.847	147.91
432.28	133.35
432.714	118.78
433.148	143.05
433.582	162.47
434.015	211.02
434.449	167.33
434.882	157.62
435.316	121.21
435.749	104.22
436.183	121.21
436.616	150.34
437.049	152.76
437.483	177.04
437.916	198.88
438.349	215.87
438.782	191.6
439.215	77.52
439.648	145.48
440.081	196.45
440.514	211.02
440.947	138.2
441.38	96.94
441.813	84.8
442.245	232.86
442.678	189.17
443.111	147.91
443.543	164.9
443.976	145.48
444.408	181.89
444.841	145.48
445.273	152.76
445.705	138.2
446.138	152.76
446.57	128.49
447.002	121.21
447.434	189.17
447.867	104.22
448.299	184.32
448.731	206.16
449.163	155.19
449.595	189.17
450.026	162.47
450.458	138.2
450.89	181.89
451.322	106.65
451.754	162.47
452.185	232.86
452.617	145.48
453.048	191.6
453.48	211.02
453.911	186.74
454.343	203.73
454.774	118.78
455.205	174.61
455.637	150.34
456.068	118.78
456.499	167.33
456.93	157.62
457.361	164.9
457.792	133.35
458.223	181.89
458.654	147.91
459.085	130.92
459.516	194.03
459.947	194.03
460.378	177.04
460.808	155.19
461.239	169.75
461.669	172.18
462.1	143.05
462.531	157.62
462.961	96.94
463.391	130.92
463.822	174.61
464.252	126.06
464.682	96.94
465.113	126.06
465.543	109.07
465.973	288.69
466.403	179.46
466.833	194.03
467.263	177.04
467.693	177.04
468.123	198.88
468.553	225.58
468.983	138.2
469.412	145.48
469.842	152.76
470.272	157.62
470.701	111.5
471.131	162.47
471.56	174.61
471.99	184.32
472.419	89.66
472.849	113.93
473.278	211.02
473.707	111.5
474.136	201.31
474.566	237.72
474.995	201.31
475.424	211.02
475.853	167.33
476.282	228.01
476.711	130.92
477.14	196.45
477.569	130.92
477.997	172.18
478.426	126.06
478.855	128.49
479.283	208.59
479.712	208.59
480.141	201.31
480.569	138.2
480.998	160.04
481.426	181.89
481.854	191.6
482.283	145.48
482.711	143.05
483.139	150.34
483.567	143.05
483.995	169.75
484.424	147.91
484.852	123.64
485.28	191.6
485.708	201.31
486.135	208.59
486.563	126.06
486.991	196.45
487.419	160.04
487.847	206.16
488.274	189.17
488.702	220.73
489.129	203.73
489.557	162.47
489.984	150.34
490.412	206.16
490.839	218.3
491.266	167.33
491.694	167.33
492.121	135.77
492.548	147.91
492.975	155.19
493.402	150.34
493.829	179.46
494.256	203.73
494.683	162.47
495.11	179.46
495.537	145.48
495.964	169.75
496.39	174.61
496.817	123.64
497.244	128.49
497.67	155.19
498.097	167.33
498.523	126.06
498.95	167.33
499.376	174.61
499.803	118.78
500.229	133.35
500.655	164.9
501.081	128.49
501.508	203.73
501.934	116.35
502.36	164.9
502.786	174.61
503.212	167.33
503.638	143.05
504.064	92.08
504.489	96.94
504.915	140.63
505.341	194.03
505.767	196.45
506.192	177.04
506.618	177.04
507.043	143.05
507.469	99.36
507.894	118.78
508.32	208.59
508.745	186.74
509.17	128.49
509.596	167.33
510.021	164.9
510.446	104.22
510.871	157.62
511.296	147.91
511.721	89.66
512.146	179.46
512.571	186.74
512.996	232.86
513.421	181.89
513.845	106.65
514.27	218.3
514.695	172.18
515.119	172.18
515.544	147.91
515.969	113.93
516.393	123.64
516.817	111.5
517.242	145.48
517.666	121.21
518.09	194.03
518.515	208.59
518.939	213.44
519.363	317.81
519.787	172.18
520.211	123.64
520.635	135.77
521.059	94.51
521.483	169.75
521.907	155.19
522.331	208.59
522.754	118.78
523.178	157.62
523.602	101.79
524.025	240.14
524.449	126.06
524.872	92.08
525.296	138.2
525.719	133.35
526.143	123.64
526.566	164.9
526.989	220.73
527.412	126.06
527.836	116.35
528.259	191.6
528.682	143.05
529.105	167.33
529.528	196.45
529.951	206.16
530.374	186.74
530.796	84.8
531.219	79.95
531.642	162.47
532.065	160.04
532.487	174.61
532.91	177.04
533.332	169.75
533.755	235.29
534.177	128.49
534.6	147.91
535.022	179.46
535.444	172.18
535.867	223.15
536.289	143.05
536.711	218.3
537.133	164.9
537.555	128.49
537.977	186.74
538.399	152.76
538.821	184.32
539.243	116.35
539.665	179.46
540.086	128.49
540.508	145.48
540.93	208.59
541.351	184.32
541.773	174.61
542.195	213.44
542.616	266.84
543.037	269.27
543.459	218.3
543.88	240.14
544.301	266.84
544.723	191.6
545.144	254.71
545.565	293.54
545.986	220.73
546.407	266.84
546.828	278.98
547.249	189.17
547.67	208.59
548.091	174.61
548.512	189.17
548.932	128.49
549.353	167.33
549.774	169.75
550.194	177.04
550.615	160.04
551.035	181.89
551.456	235.29
551.876	169.75
552.296	179.46
552.717	126.06
553.137	191.6
553.557	104.22
553.977	160.04
554.397	106.65
554.817	157.62
555.237	84.8
555.657	130.92
556.077	126.06
556.497	181.89
556.917	184.32
557.337	82.37
557.756	155.19
558.176	109.07
558.596	145.48
559.015	126.06
559.435	150.34
559.854	106.65
560.274	111.5
560.693	164.9
561.112	143.05
561.532	143.05
561.951	169.75
562.37	215.87
562.789	186.74
563.208	84.8
563.627	206.16
564.046	104.22
564.465	116.35
564.884	254.71
565.303	116.35
565.722	181.89
566.14	201.31
566.559	126.06
566.978	133.35
567.396	211.02
567.815	191.6
568.233	223.15
568.652	145.48
569.07	135.77
569.489	143.05
569.907	201.31
570.325	184.32
570.743	106.65
571.161	121.21
571.58	169.75
571.998	191.6
572.416	213.44
572.833	184.32
573.251	172.18
573.669	201.31
574.087	147.91
574.505	160.04
574.922	135.77
575.34	60.53
575.758	160.04
576.175	145.48
576.593	152.76
577.01	160.04
577.428	143.05
577.845	1621.23
578.262	288.69
578.68	174.61
579.097	75.09
579.514	150.34
579.931	223.15
580.348	106.65
580.765	126.06
581.182	232.86
581.599	203.73
582.016	143.05
582.433	189.17
582.849	128.49
583.266	145.48
583.683	194.03
584.099	215.87
584.516	266.84
584.933	113.93
585.349	186.74
585.765	201.31
586.182	157.62
586.598	179.46
587.014	174.61
587.431	225.58
587.847	206.16
588.263	126.06
588.679	155.19
589.095	147.91
589.511	201.31
589.927	198.88
590.343	181.89
590.759	184.32
591.174	135.77
591.59	155.19
592.006	145.48
592.421	135.77
592.837	99.36
593.252	109.07
593.668	55.67
594.083	140.63
594.499	126.06
594.914	179.46
595.329	184.32
595.745	164.9
596.16	186.74
596.575	111.5
596.99	101.79
597.405	164.9
597.82	198.88
598.235	198.88
598.65	162.47
599.065	206.16
599.479	194.03
599.894	133.35
600.309	145.48
600.724	164.9
601.138	225.58
601.553	160.04
601.967	116.35
602.382	172.18
602.796	230.43
603.21	160.04
603.625	99.36
604.039	147.91
604.453	138.2
604.867	150.34
605.281	196.45
605.695	211.02
606.109	150.34
606.523	196.45
606.937	140.63
607.351	225.58
607.765	130.92
608.178	225.58
608.592	223.15
609.006	135.77
609.419	223.15
609.833	198.88
610.246	104.22
610.66	235.29
611.073	225.58
611.487	257.13
611.9	327.52
612.313	172.18
612.726	213.44
613.139	261.99
613.553	203.73
613.966	169.75
614.379	206.16
614.792	184.32
615.204	143.05
615.617	77.52
616.03	155.19
616.443	152.76
616.856	203.73
617.268	147.91
617.681	155.19
618.093	121.21
618.506	194.03
618.918	147.91
619.331	184.32
619.743	121.21
620.155	121.21
620.568	152.76
620.98	121.21
621.392	155.19
621.804	218.3
622.216	157.62
622.628	213.44
623.04	106.65
623.452	211.02
623.864	169.75
624.276	164.9
624.687	135.77
625.099	162.47
625.511	208.59
625.922	113.93
626.334	126.06
626.745	155.19
627.157	164.9
627.568	172.18
627.979	191.6
628.391	116.35
628.802	172.18
629.213	162.47
629.624	184.32
630.035	237.72
630.446	138.2
630.857	145.48
631.268	99.36
631.679	143.05
632.09	135.77
632.501	162.47
632.912	135.77
633.322	140.63
633.733	174.61
634.144	123.64
634.554	198.88
634.965	164.9
635.375	109.07
635.785	201.31
636.196	174.61
636.606	160.04
637.016	128.49
637.427	126.06
637.837	174.61
638.247	172.18
638.657	189.17
639.067	152.76
639.477	106.65
639.887	235.29
640.297	109.07
640.706	155.19
641.116	162.47
641.526	135.77
641.935	128.49
642.345	79.95
642.755	121.21
643.164	196.45
643.573	167.33
643.983	140.63
644.392	213.44
644.801	189.17
645.211	130.92
645.62	179.46
646.029	194.03
646.438	254.71
646.847	196.45
647.256	145.48
647.665	121.21
648.074	121.21
648.483	196.45
648.892	109.07
649.3	162.47
649.709	184.32
650.118	162.47
650.526	140.63
650.935	172.18
651.343	194.03
651.752	164.9
652.16	177.04
652.568	181.89
652.977	130.92
653.385	189.17
653.793	143.05
654.201	138.2
654.609	177.04
655.017	143.05
655.425	152.76
655.833	169.75
656.241	126.06
656.649	172.18
657.057	206.16
657.464	145.48
657.872	155.19
658.28	157.62
658.687	152.76
659.095	128.49
659.502	128.49
659.91	157.62
660.317	164.9
660.724	155.19
661.132	155.19
661.539	186.74
661.946	140.63
662.353	113.93
662.76	106.65
663.167	101.79
663.574	189.17
663.981	157.62
664.388	189.17
664.795	121.21
665.202	150.34
665.608	213.44
666.015	109.07
666.422	160.04
666.828	128.49
667.235	235.29
667.641	118.78
668.047	157.62
668.454	172.18
668.86	135.77
669.266	162.47
669.673	123.64
670.079	123.64
670.485	152.76
670.891	203.73
671.297	167.33
671.703	179.46
672.109	116.35
672.515	140.63
672.92	118.78
673.326	184.32
673.732	174.61
674.138	121.21
674.543	116.35
674.949	150.34
675.354	123.64
675.76	162.47
676.165	160.04
676.57	101.79
676.976	162.47
677.381	143.05
677.786	169.75
678.191	143.05
678.596	145.48
679.001	211.02
679.406	230.43
679.811	155.19
680.216	123.64
680.621	184.32
681.026	109.07
681.43	240.14
681.835	111.5
682.24	118.78
682.644	150.34
683.049	121.21
683.453	143.05
683.858	155.19
684.262	174.61
684.667	123.64
685.071	172.18
685.475	121.21
685.879	130.92
686.283	213.44
686.687	181.89
687.091	174.61
687.495	130.92
687.899	118.78
688.303	186.74
688.707	179.46
689.111	181.89
689.514	211.02
689.918	177.04
690.322	181.89
690.725	198.88
691.129	201.31
691.532	208.59
691.936	169.75
692.339	96.94
692.742	184.32
693.146	215.87
693.549	213.44
693.952	223.15
694.355	106.65
694.758	218.3
695.161	211.02
695.564	194.03
695.967	101.79
696.37	162.47
696.773	198.88
697.175	113.93
697.578	157.62
697.981	215.87
698.383	201.31
698.786	278.98
699.188	155.19
699.591	186.74
699.993	191.6
700.395	164.9
700.798	152.76
701.2	143.05
701.602	155.19
702.004	201.31
702.406	184.32
702.808	194.03
703.21	77.52
703.612	245
704.014	240.14
704.416	157.62
704.818	213.44
705.219	174.61
705.621	218.3
706.023	252.28
706.424	203.73
706.826	194.03
707.227	203.73
707.629	198.88
708.03	242.57
708.431	138.2
708.832	225.58
709.234	206.16
709.635	208.59
710.036	215.87
710.437	196.45
710.838	198.88
711.239	220.73
711.64	211.02
712.041	259.56
712.441	186.74
712.842	252.28
713.243	150.34
713.643	213.44
714.044	198.88
714.445	269.27
714.845	252.28
715.246	298.4
715.646	276.55
716.046	276.55
716.447	300.82
716.847	312.96
717.247	281.41
717.647	257.13
718.047	286.26
718.447	334.8
718.847	281.41
719.247	361.5
719.647	344.51
720.047	308.11
720.446	293.54
720.846	283.83
721.246	361.5
721.645	342.09
722.045	332.38
722.444	412.48
722.844	359.08
723.243	414.9
723.643	310.53
724.042	300.82
724.441	410.05
724.84	405.19
725.24	395.49
725.639	478.01
726.038	422.18
726.437	456.17
726.836	492.57
727.234	446.46
727.633	582.38
728.032	526.56
728.431	635.78
728.83	696.46
729.228	638.21
729.627	672.19
730.025	764.42
730.424	820.25
730.822	978.02
731.22	895.49
731.619	919.77
732.017	1002.29
732.415	1162.49
732.813	1140.64
733.212	1310.55
733.61	1419.77
734.008	1473.17
734.406	1570.26
734.803	1791.14
735.201	1897.94
735.599	2096.97
735.997	2113.96
736.395	2228.04
736.792	2395.52
737.19	2541.15
737.587	2565.42
737.985	2662.51
738.382	2735.33
738.78	2883.39
739.177	3002.32
739.574	3215.92
739.971	3286.31
740.369	3405.24
740.766	3524.17
741.163	3669.81
741.56	4007.19
741.957	4077.58
742.354	4502.35
742.751	4677.11
743.147	4912.55
743.544	5181.97
743.941	5631
744.338	6058.19
744.734	6162.57
745.131	6419.85
745.527	6735.39
745.924	7065.49
746.32	7249.96
746.716	7441.71
747.113	7864.05
747.509	8067.93
747.905	7997.55
748.301	8157.74
748.697	8237.84
749.093	8776.68
749.489	8966.01
749.885	9300.96
750.281	9871.36
750.677	10201.46
751.073	10793.71
751.468	11247.6
751.864	11798.58
752.26	12291.3
752.655	13208.79
753.051	13660.25
753.446	14881.15
753.842	15274.36
754.237	16534.09
754.632	16665.16
755.028	17628.76
755.423	17847.21
755.818	18507.42
756.213	19014.71
756.608	19701.61
757.003	19944.33
757.398	20344.82
757.793	20643.37
758.188	20973.48
758.583	21223.48
758.977	21589.99
759.372	22274.47
759.767	22988.07
760.161	24560.91
760.556	25458.98
760.95	26298.8
761.345	27233.28
761.739	28075.53
762.133	28679.91
762.527	29692.06
762.922	29745.46
763.316	30366.83
763.71	30840.13
764.104	31507.62
764.498	31653.25
764.892	32252.78
765.286	32794.05
765.68	33155.7
766.073	33959.11
766.467	34291.64
766.861	34905.73
767.255	35980.99
767.648	36728.57
768.042	37272.27
768.435	37818.4
768.829	38206.75
769.222	38913.07
769.615	39653.38
770.008	39680.08
770.402	39131.52
770.795	39563.57
771.188	39728.62
771.581	39544.15
771.974	39757.75
772.367	39167.93
772.76	39425.22
773.153	38209.18
773.545	37791.7
773.938	38231.03
774.331	38825.69
774.724	39425.22
775.116	41024.76
775.509	41993.22
775.901	44430.15
776.294	45430.17
776.686	46153.48
777.078	47573.4
777.471	48685.07
777.863	50481.22
778.255	51687.55
778.647	53003.1
779.039	53862.34
779.431	54180.3
779.823	54340.5
780.215	55452.17
780.607	55316.24
780.999	57539.58
781.39	57279.87
781.782	57559
782.174	57745.89
782.565	58813.87
782.957	59003.19
783.348	60032.34
783.74	60610.01
784.131	59901.27
784.522	60182.82
784.914	59716.8
785.305	59372.13
785.696	58988.63
786.087	59544.46
786.478	58185.22
786.869	56622.09
787.26	55190.03
787.651	53915.74
788.042	52709.41
788.433	50000.63
788.823	48595.26
789.214	46041.83
789.605	43010.23
789.995	41036.89
790.386	38248.02
790.776	36711.58
791.167	35886.33
791.557	34954.28
791.948	34527.08
792.338	34485.82
792.728	35374.18
793.118	35507.68
793.508	36238.28
793.898	36548.96
794.288	38141.22
794.678	38852.39
795.068	41126.7
795.458	42022.35
795.848	44063.64
796.238	45833.09
796.627	47551.56
797.017	49005.46
797.406	49806.45
797.796	50658.4
798.185	51699.68
798.575	52471.54
798.964	53126.89
799.354	53376.89
799.743	52272.51
800.132	51306.47
800.521	49566.15
800.91	48267.59
801.299	45956.87
801.688	43665.58
802.077	40129.11
802.466	38422.78
802.855	36959.16
803.244	33585.32
803.633	32395.98
804.021	31252.76
804.41	30832.85
804.799	30621.68
805.187	30769.74
805.576	31650.83
805.964	33029.49
806.352	33840.18
806.741	35558.65
807.129	36811.1
807.517	38786.86
807.905	40502.91
808.293	41534.47
808.681	41005.34
809.069	41240.78
809.457	41325.73
809.845	39396.09
810.233	38456.76
810.621	36616.92
811.009	33662.99
811.396	31155.67
811.784	29255.16
812.171	27522.12
812.559	25789.08
812.946	24997.81
813.334	24604.6
813.721	25233.25
814.108	26611.91
814.496	27745.43
814.883	29403.22
815.27	31985.78
815.657	34291.64
816.044	36663.04
816.431	37187.32
816.818	37325.67
817.205	36964.02
817.592	36947.02
817.979	34507.67
818.365	32114.43
818.752	29099.82
819.139	25422.57
819.525	23090.01
819.912	21449.21
820.298	19451.61
820.685	19155.49
821.071	18628.78
821.457	19645.78
821.843	20194.34
822.23	21485.62
822.616	22024.46
823.002	22823.02
823.388	23022.05
823.774	22956.52
824.16	22502.63
824.546	21592.42
824.931	20560.85
825.317	19087.52
825.703	16978.27
826.089	15521.93
826.474	14441.82
826.86	13230.64
827.245	12422.37
827.631	12436.93
828.016	12638.39
828.401	13388.41
828.787	14104.44
829.172	15208.82
829.557	15992.82
829.942	16507.39
830.327	16687
830.712	16310.78
831.097	15439.41
831.482	14291.33
831.867	13388.41
832.252	12055.86
832.636	10572.83
833.021	10067.97
833.406	9225.72
833.79	8660.18
834.175	9060.67
834.559	9305.82
834.944	9905.34
835.328	10436.9
835.713	10966.04
836.097	11262.16
836.481	11473.33
836.865	10924.78
837.249	10533.99
837.633	9791.26
838.017	8895.62
838.401	7567.93
838.785	6732.96
839.169	6283.93
839.553	5888.29
839.937	5781.49
840.32	5570.32
840.704	5842.17
841.087	5951.4
841.471	6060.62
841.854	6334.9
842.238	6315.48
842.621	6135.87
843.004	5774.21
843.388	5274.2
843.771	5026.63
844.154	4609.14
844.537	4271.76
844.92	4033.89
845.303	3980.49
845.686	4111.56
846.069	4140.69
846.452	4339.72
846.834	4463.51
847.217	4514.48
847.6	4742.64
847.982	4667.4
848.365	4390.69
848.748	4152.83
849.13	3628.55
849.512	3405.24
849.895	3225.63
850.277	2851.83
850.659	2844.55
851.041	2978.05
851.423	3096.98
851.806	3184.36
852.188	3240.19
852.57	3310.58
852.951	3172.23
853.333	3286.31
853.715	3104.27
854.097	2914.94
854.479	2616.39
854.86	2422.22
855.242	2218.33
855.623	2145.51
856.005	2084.83
856.386	2079.98
856.768	2130.95
857.149	2130.95
857.53	2130.95
857.911	2155.22
858.292	1951.33
858.674	1803.27
859.055	1740.17
859.436	1558.12
859.817	1504.73
860.197	1376.08
860.578	1300.84
860.959	1315.4
861.34	1300.84
861.72	1240.16
862.101	1303.27
862.482	1220.74
862.862	1230.45
863.243	1126.08
863.623	1111.52
864.003	1087.24
864.384	968.31
864.764	951.32
865.144	893.07
865.524	900.35
865.904	902.77
866.284	851.8
866.664	902.77
867.044	849.38
867.424	783.84
867.804	815.39
868.183	805.69
868.563	757.14
868.943	667.33
869.322	592.09
869.702	664.91
870.081	643.06
870.461	623.64
870.84	650.34
871.22	582.38
871.599	521.7
871.978	567.82
872.357	507.14
872.736	538.69
873.115	448.88
873.494	451.31
873.873	412.48
874.252	434.32
874.631	422.18
875.01	397.91
875.388	361.5
875.767	305.68
876.146	393.06
876.524	417.33
876.903	334.8
877.281	274.12
877.66	278.98
878.038	269.27
878.416	281.41
878.794	242.57
879.173	349.37
879.551	320.24
879.929	312.96
880.307	322.67
880.685	281.41
881.063	249.85
881.441	298.4
881.818	228.01
882.196	203.73
882.574	213.44
882.951	276.55
883.329	242.57
883.707	211.02
884.084	247.42
884.461	264.42
884.839	211.02
885.216	203.73
885.593	276.55
885.971	257.13
886.348	223.15
886.725	167.33
887.102	218.3
887.479	140.63
887.856	203.73
888.233	274.12
888.609	237.72
888.986	252.28
889.363	169.75
889.74	230.43
890.116	225.58
890.493	196.45
890.869	228.01
891.246	220.73
891.622	147.91
891.998	230.43
892.375	230.43
892.751	174.61
893.127	152.76
893.503	140.63
893.879	135.77
894.255	201.31
894.631	194.03
895.007	152.76
895.383	201.31
895.759	167.33
896.134	194.03
896.51	177.04
896.886	169.75
897.261	147.91
897.637	194.03
898.012	155.19
898.388	179.46
898.763	157.62
899.138	147.91
899.514	113.93
899.889	104.22
900.264	99.36
900.639	206.16
901.014	145.48
901.389	62.96
901.764	123.64
902.139	128.49
902.513	135.77
902.888	104.22
903.263	116.35
903.638	155.19
904.012	203.73
904.387	96.94
904.761	126.06
905.136	92.08
905.51	48.39
905.884	111.5
906.259	162.47
906.633	128.49
907.007	198.88
907.381	106.65
907.755	121.21
908.129	143.05
908.503	179.46
908.877	106.65
909.251	126.06
909.624	140.63
909.998	157.62
910.372	181.89
910.745	181.89
911.119	70.24
911.492	177.04
911.866	181.89
912.239	104.22
912.612	123.64
912.986	145.48
913.359	186.74
913.732	87.23
914.105	106.65
914.478	113.93
914.851	126.06
915.224	169.75
915.597	196.45
915.97	135.77
916.343	150.34
916.715	162.47
917.088	55.67
917.461	133.35
917.833	126.06
918.206	96.94
918.578	128.49
918.951	152.76
919.323	145.48
919.695	106.65
920.067	201.31
920.44	104.22
920.812	106.65
921.184	121.21
921.556	196.45
921.928	147.91
922.3	194.03
922.672	89.66
923.043	223.15
923.415	160.04
923.787	177.04
924.158	174.61
924.53	96.94
924.901	164.9
925.273	79.95
925.644	152.76
926.016	104.22
926.387	150.34
926.758	174.61
927.129	111.5
927.5	111.5
927.872	145.48
928.243	145.48
928.613	130.92
928.984	157.62
929.355	184.32
929.726	152.76
930.097	150.34
930.467	89.66
930.838	213.44
931.209	75.09
931.579	48.39
931.95	160.04
932.32	191.6
932.69	130.92
933.061	152.76
933.431	155.19
933.801	92.08
934.171	201.31
934.541	220.73
934.911	145.48
935.281	111.5
935.651	123.64
936.021	111.5
936.391	145.48
936.761	75.09
937.13	104.22
937.5	106.65
937.87	101.79
938.239	62.96
938.609	152.76
938.978	143.05
939.347	145.48
939.717	196.45
940.086	106.65
940.455	186.74
940.824	123.64
941.193	160.04
941.562	172.18
941.931	150.34
942.3	179.46
942.669	130.92
943.038	121.21
943.407	150.34
943.775	155.19
944.144	130.92
944.513	160.04
944.881	123.64
945.25	201.31
945.618	123.64
945.986	26.55
946.355	172.18
946.723	99.36
947.091	60.53
947.459	111.5
947.827	155.19
948.195	150.34
948.563	145.48
948.931	147.91
949.299	230.43
949.667	128.49
950.035	96.94
950.402	181.89
950.77	174.61
951.138	82.37
951.505	118.78
951.873	130.92
952.24	164.9
952.607	104.22
952.975	130.92
953.342	111.5
953.709	184.32
954.076	118.78
954.443	99.36
954.81	116.35
955.177	133.35
955.544	143.05
955.911	186.74
956.278	177.04
956.645	208.59
957.012	130.92
957.378	179.46
957.745	89.66
958.111	111.5
958.478	145.48
958.844	177.04
959.211	140.63
959.577	152.76
959.943	169.75
960.309	174.61
960.675	196.45
961.042	118.78
961.408	135.77
961.774	143.05
962.139	138.2
962.505	140.63
962.871	184.32
963.237	130.92
963.603	194.03
963.968	138.2
964.334	157.62
964.699	203.73
965.065	140.63
965.43	126.06
965.796	135.77
966.161	89.66
966.526	130.92
966.891	189.17
967.256	118.78
967.622	162.47
967.987	109.07
968.352	126.06
968.716	160.04
969.081	133.35
969.446	106.65
969.811	118.78
970.176	121.21
970.54	167.33
970.905	164.9
971.269	116.35
971.634	145.48
971.998	160.04
972.363	104.22
972.727	147.91
973.091	138.2
973.455	118.78
973.819	79.95
974.183	155.19
974.547	184.32
974.911	96.94
975.275	194.03
975.639	172.18
976.003	106.65
976.367	126.06
976.73	177.04
977.094	104.22
977.458	228.01
977.821	169.75
978.185	138.2
978.548	135.77
978.911	135.77
979.275	99.36
979.638	130.92
980.001	189.17
980.364	92.08
980.727	101.79
981.09	77.52
981.453	116.35
981.816	82.37
982.179	230.43
982.542	157.62
982.905	116.35
983.267	140.63
983.63	208.59
983.992	135.77
984.355	162.47
984.717	162.47
985.08	128.49
985.442	43.54
985.804	118.78
986.167	162.47
986.529	130.92
986.891	130.92
987.253	150.34
987.615	143.05
987.977	84.8
988.339	96.94
988.701	135.77
989.062	152.76
989.424	101.79
989.786	65.38
990.147	184.32
990.509	160.04
990.87	177.04
991.232	160.04
991.593	157.62
991.955	167.33
992.316	184.32
992.677	206.16
993.038	133.35
993.399	208.59
993.76	135.77
994.121	143.05
994.482	113.93
994.843	109.07
995.204	138.2
995.565	60.53
995.926	96.94
996.286	155.19
996.647	169.75
997.007	104.22
997.368	145.48
997.728	138.2
998.089	164.9
998.449	135.77
998.809	121.21
999.169	145.48
999.53	75.09
999.89	162.47
1000.25	133.35
1000.61	198.88
1000.97	121.21
1001.329	203.73
1001.689	94.51
1002.049	77.52
1002.409	140.63
1002.768	143.05
1003.128	87.23
1003.487	70.24
1003.847	121.21
1004.206	111.5
1004.566	87.23
1004.925	203.73
1005.284	126.06
1005.643	167.33
1006.003	169.75
1006.362	123.64
1006.721	113.93
1007.08	65.38
1007.438	172.18
1007.797	96.94
1008.156	145.48
1008.515	160.04
1008.874	184.32
1009.232	113.93
1009.591	138.2
1009.949	130.92
1010.308	96.94
1010.666	242.57
1011.024	160.04
1011.383	118.78
1011.741	203.73
1012.099	150.34
1012.457	121.21
1012.815	79.95
1013.173	145.48
1013.531	220.73
1013.889	155.19
1014.247	211.02
1014.605	77.52
1014.962	123.64
1015.32	194.03
1015.678	113.93
1016.035	116.35
1016.393	126.06
1016.75	89.66
1017.107	177.04
1017.465	177.04
1017.822	128.49
1018.179	150.34
1018.536	152.76
1018.894	133.35
1019.251	167.33
1019.608	140.63
1019.964	179.46
1020.321	157.62
1020.678	140.63
1021.035	121.21
1021.392	130.92
1021.748	126.06
1022.105	172.18
1022.461	111.5
1022.818	220.73
1023.174	152.76
1023.531	140.63
1023.887	130.92
1024.243	150.34
1024.599	109.07
1024.955	75.09
1025.311	179.46
1025.667	186.74
1026.023	150.34
1026.379	82.37
1026.735	208.59
1027.091	164.9
1027.447	164.9
