189.514	91.48
189.973	91.48
190.431	91.48
190.889	62.35
191.348	-17.75
191.806	21.09
192.264	-12.89
192.722	25.94
193.18	-129.4
193.638	-32.31
194.096	-61.44
194.554	-76
195.012	-39.59
195.47	4.1
195.928	40.5
196.385	11.38
196.843	-12.89
197.301	-8.04
197.758	81.77
198.216	-3.19
198.674	86.62
199.131	125.46
199.589	55.07
200.046	81.77
200.503	69.63
200.961	69.63
201.418	132.74
201.875	103.61
202.332	176.43
202.79	55.07
203.247	159.44
203.704	149.73
204.161	137.59
204.618	113.32
205.075	174
205.532	152.16
205.989	157.01
206.445	140.02
206.902	205.56
207.359	207.98
207.816	123.03
208.272	135.17
208.729	176.43
209.185	171.57
209.642	164.29
210.098	159.44
210.555	207.98
211.011	181.28
211.467	183.71
211.924	140.02
212.38	154.58
212.836	227.4
213.292	152.16
213.748	81.77
214.204	222.55
214.66	171.57
215.116	169.15
215.572	183.71
216.028	217.69
216.484	120.6
216.94	118.18
217.396	157.01
217.851	140.02
218.307	217.69
218.763	205.56
219.218	251.67
219.674	183.71
220.129	217.69
220.585	176.43
221.04	149.73
221.496	157.01
221.951	147.3
222.406	169.15
222.861	113.32
223.317	203.13
223.772	152.16
224.227	181.28
224.682	161.87
225.137	115.75
225.592	164.29
226.047	198.27
226.502	140.02
226.957	157.01
227.411	178.86
227.866	132.74
228.321	132.74
228.776	171.57
229.23	203.13
229.685	93.9
230.139	154.58
230.594	203.13
231.048	161.87
231.503	130.31
231.957	154.58
232.411	115.75
232.865	198.27
233.32	166.72
233.774	188.56
234.228	195.85
234.682	186.14
235.136	130.31
235.59	183.71
236.044	113.32
236.498	169.15
236.952	154.58
237.406	169.15
237.86	161.87
238.313	130.31
238.767	164.29
239.221	152.16
239.674	171.57
240.128	164.29
240.581	149.73
241.035	164.29
241.488	154.58
241.942	161.87
242.395	164.29
242.848	115.75
243.301	220.12
243.755	154.58
244.208	144.87
244.661	132.74
245.114	130.31
245.567	132.74
246.02	123.03
246.473	106.04
246.926	164.29
247.379	154.58
247.832	147.3
248.284	157.01
248.737	174
249.19	232.25
249.642	186.14
250.095	137.59
250.547	127.88
251	67.2
251.452	159.44
251.905	106.04
252.357	132.74
252.81	144.87
253.262	130.31
253.714	220.12
254.166	89.05
254.618	203.13
255.07	115.75
255.523	181.28
255.975	178.86
256.427	198.27
256.878	103.61
257.33	198.27
257.782	210.41
258.234	181.28
258.686	144.87
259.137	193.42
259.589	188.56
260.041	193.42
260.492	183.71
260.944	198.27
261.395	130.31
261.847	159.44
262.298	181.28
262.749	166.72
263.201	200.7
263.652	154.58
264.103	241.96
264.554	171.57
265.005	171.57
265.457	169.15
265.908	140.02
266.359	171.57
266.809	89.05
267.26	195.85
267.711	140.02
268.162	123.03
268.613	198.27
269.064	149.73
269.514	140.02
269.965	130.31
270.415	188.56
270.866	220.12
271.316	120.6
271.767	125.46
272.217	106.04
272.668	171.57
273.118	140.02
273.568	110.89
274.019	176.43
274.469	159.44
274.919	144.87
275.369	137.59
275.819	181.28
276.269	137.59
276.719	178.86
277.169	176.43
277.619	147.3
278.069	188.56
278.518	222.55
278.968	166.72
279.418	108.47
279.867	144.87
280.317	149.73
280.767	232.25
281.216	178.86
281.666	181.28
282.115	183.71
282.564	239.54
283.014	147.3
283.463	232.25
283.912	198.27
284.361	152.16
284.811	169.15
285.26	217.69
285.709	220.12
286.158	251.67
286.607	224.97
287.056	147.3
287.505	147.3
287.953	169.15
288.402	205.56
288.851	125.46
289.3	176.43
289.748	152.16
290.197	113.32
290.646	203.13
291.094	137.59
291.543	195.85
291.991	220.12
292.439	181.28
292.888	154.58
293.336	142.45
293.784	81.77
294.233	183.71
294.681	198.27
295.129	154.58
295.577	159.44
296.025	144.87
296.473	217.69
296.921	210.41
297.369	157.01
297.817	193.42
298.264	261.38
298.712	200.7
299.16	193.42
299.608	217.69
300.055	106.04
300.503	249.25
300.95	164.29
301.398	254.1
301.845	237.11
302.293	127.88
302.74	166.72
303.187	161.87
303.635	115.75
304.082	166.72
304.529	210.41
304.976	174
305.423	98.76
305.87	222.55
306.317	178.86
306.764	157.01
307.211	178.86
307.658	181.28
308.105	149.73
308.552	183.71
308.998	222.55
309.445	164.29
309.892	142.45
310.338	159.44
310.785	154.58
311.231	130.31
311.678	203.13
312.124	123.03
312.571	164.29
313.017	149.73
313.463	190.99
313.909	161.87
314.356	103.61
314.802	210.41
315.248	195.85
315.694	190.99
316.14	183.71
316.586	205.56
317.032	181.28
317.478	159.44
317.923	207.98
318.369	188.56
318.815	161.87
319.261	217.69
319.706	171.57
320.152	157.01
320.597	210.41
321.043	157.01
321.488	183.71
321.934	193.42
322.379	159.44
322.824	98.76
323.27	154.58
323.715	140.02
324.16	212.84
324.605	164.29
325.05	190.99
325.495	215.26
325.94	278.37
326.385	152.16
326.83	169.15
327.275	118.18
327.72	169.15
328.165	178.86
328.61	154.58
329.054	246.82
329.499	81.77
329.943	135.17
330.388	108.47
330.832	178.86
331.277	174
331.721	188.56
332.166	144.87
332.61	186.14
333.054	152.16
333.499	140.02
333.943	120.6
334.387	263.81
334.831	176.43
335.275	174
335.719	222.55
336.163	157.01
336.607	195.85
337.051	183.71
337.495	190.99
337.938	125.46
338.382	127.88
338.826	149.73
339.269	222.55
339.713	103.61
340.157	147.3
340.6	193.42
341.044	190.99
341.487	161.87
341.93	176.43
342.374	106.04
342.817	181.28
343.26	142.45
343.703	227.4
344.146	140.02
344.59	169.15
345.033	135.17
345.476	232.25
345.919	130.31
346.361	101.18
346.804	157.01
347.247	186.14
347.69	178.86
348.133	132.74
348.575	123.03
349.018	164.29
349.461	103.61
349.903	135.17
350.346	164.29
350.788	144.87
351.23	91.48
351.673	137.59
352.115	152.16
352.557	123.03
353	157.01
353.442	76.91
353.884	176.43
354.326	183.71
354.768	181.28
355.21	125.46
355.652	159.44
356.094	193.42
356.536	164.29
356.978	93.9
357.419	251.67
357.861	140.02
358.303	164.29
358.744	144.87
359.186	123.03
359.627	115.75
360.069	227.4
360.51	164.29
360.952	169.15
361.393	115.75
361.834	207.98
362.276	137.59
362.717	200.7
363.158	195.85
363.599	190.99
364.04	174
364.481	118.18
364.922	220.12
365.363	137.59
365.804	135.17
366.245	256.53
366.686	164.29
367.126	164.29
367.567	137.59
368.008	193.42
368.448	120.6
368.889	210.41
369.33	132.74
369.77	125.46
370.21	200.7
370.651	222.55
371.091	149.73
371.531	123.03
371.972	161.87
372.412	120.6
372.852	115.75
373.292	210.41
373.732	120.6
374.172	229.83
374.612	169.15
375.052	159.44
375.492	110.89
375.932	140.02
376.372	171.57
376.811	174
377.251	246.82
377.691	132.74
378.13	220.12
378.57	198.27
379.009	127.88
379.449	171.57
379.888	190.99
380.328	239.54
380.767	149.73
381.206	258.95
381.645	237.11
382.085	127.88
382.524	147.3
382.963	147.3
383.402	166.72
383.841	152.16
384.28	251.67
384.719	193.42
385.158	207.98
385.596	200.7
386.035	176.43
386.474	227.4
386.913	205.56
387.351	186.14
387.79	152.16
388.228	152.16
388.667	110.89
389.105	159.44
389.544	215.26
389.982	181.28
390.42	125.46
390.859	123.03
391.297	140.02
391.735	74.49
392.173	152.16
392.611	224.97
393.049	137.59
393.487	127.88
393.925	144.87
394.363	212.84
394.801	174
395.239	140.02
395.676	174
396.114	130.31
396.552	144.87
396.989	110.89
397.427	159.44
397.864	198.27
398.302	142.45
398.739	161.87
399.177	203.13
399.614	251.67
400.051	193.42
400.488	178.86
400.926	157.01
401.363	220.12
401.8	135.17
402.237	118.18
402.674	181.28
403.111	174
403.548	205.56
403.985	205.56
404.421	176.43
404.858	137.59
405.295	147.3
405.732	123.03
406.168	113.32
406.605	178.86
407.041	190.99
407.478	215.26
407.914	195.85
408.351	137.59
408.787	193.42
409.223	188.56
409.66	207.98
410.096	241.96
410.532	152.16
410.968	190.99
411.404	154.58
411.84	183.71
412.276	164.29
412.712	159.44
413.148	137.59
413.584	84.19
414.02	152.16
414.455	161.87
414.891	120.6
415.327	120.6
415.762	174
416.198	154.58
416.633	181.28
417.069	249.25
417.504	142.45
417.94	125.46
418.375	176.43
418.81	154.58
419.245	190.99
419.681	174
420.116	178.86
420.551	149.73
420.986	198.27
421.421	169.15
421.856	193.42
422.291	183.71
422.726	195.85
423.16	186.14
423.595	224.97
424.03	166.72
424.464	217.69
424.899	161.87
425.334	101.18
425.768	120.6
426.203	106.04
426.637	125.46
427.071	142.45
427.506	157.01
427.94	110.89
428.374	147.3
428.809	178.86
429.243	161.87
429.677	149.73
430.111	152.16
430.545	215.26
430.979	205.56
431.413	178.86
431.847	132.74
432.28	174
432.714	207.98
433.148	115.75
433.582	263.81
434.015	152.16
434.449	215.26
434.882	178.86
435.316	147.3
435.749	227.4
436.183	174
436.616	157.01
437.049	205.56
437.483	147.3
437.916	154.58
438.349	166.72
438.782	212.84
439.215	106.04
439.648	161.87
440.081	101.18
440.514	152.16
440.947	183.71
441.38	108.47
441.813	161.87
442.245	166.72
442.678	159.44
443.111	171.57
443.543	164.29
443.976	186.14
444.408	186.14
444.841	207.98
445.273	159.44
445.705	152.16
446.138	96.33
446.57	178.86
447.002	152.16
447.434	130.31
447.867	127.88
448.299	193.42
448.731	215.26
449.163	190.99
449.595	161.87
450.026	212.84
450.458	195.85
450.89	174
451.322	154.58
451.754	227.4
452.185	169.15
452.617	174
453.048	135.17
453.48	140.02
453.911	222.55
454.343	84.19
454.774	181.28
455.205	234.68
455.637	200.7
456.068	203.13
456.499	271.09
456.93	193.42
457.361	149.73
457.792	161.87
458.223	159.44
458.654	222.55
459.085	174
459.516	227.4
459.947	96.33
460.378	205.56
460.808	169.15
461.239	188.56
461.669	188.56
462.1	215.26
462.531	181.28
462.961	251.67
463.391	174
463.822	181.28
464.252	154.58
464.682	118.18
465.113	183.71
465.543	154.58
465.973	144.87
466.403	193.42
466.833	144.87
467.263	210.41
467.693	195.85
468.123	205.56
468.553	120.6
468.983	224.97
469.412	210.41
469.842	205.56
470.272	212.84
470.701	190.99
471.131	256.53
471.56	176.43
471.99	157.01
472.419	254.1
472.849	171.57
473.278	140.02
473.707	239.54
474.136	186.14
474.566	186.14
474.995	193.42
475.424	159.44
475.853	142.45
476.282	205.56
476.711	195.85
477.14	130.31
477.569	195.85
477.997	147.3
478.426	152.16
478.855	98.76
479.283	183.71
479.712	152.16
480.141	106.04
480.569	132.74
480.998	198.27
481.426	234.68
481.854	205.56
482.283	101.18
482.711	127.88
483.139	256.53
483.567	149.73
483.995	203.13
484.424	186.14
484.852	193.42
485.28	108.47
485.708	241.96
486.135	152.16
486.563	210.41
486.991	186.14
487.419	135.17
487.847	120.6
488.274	186.14
488.702	135.17
489.129	215.26
489.557	161.87
489.984	169.15
490.412	207.98
490.839	198.27
491.266	174
491.694	251.67
492.121	224.97
492.548	149.73
492.975	152.16
493.402	205.56
493.829	232.25
494.256	120.6
494.683	166.72
495.11	193.42
495.537	166.72
495.964	159.44
496.39	108.47
496.817	125.46
497.244	212.84
497.67	215.26
498.097	149.73
498.523	190.99
498.95	266.24
499.376	106.04
499.803	217.69
500.229	169.15
500.655	203.13
501.081	212.84
501.508	203.13
501.934	154.58
502.36	176.43
502.786	169.15
503.212	166.72
503.638	164.29
504.064	186.14
504.489	161.87
504.915	198.27
505.341	183.71
505.767	166.72
506.192	183.71
506.618	224.97
507.043	118.18
507.469	181.28
507.894	188.56
508.32	137.59
508.745	154.58
509.17	183.71
509.596	188.56
510.021	135.17
510.446	203.13
510.871	186.14
511.296	147.3
511.721	113.32
512.146	195.85
512.571	164.29
512.996	98.76
513.421	89.05
513.845	205.56
514.27	210.41
514.695	178.86
515.119	154.58
515.544	171.57
515.969	159.44
516.393	164.29
516.817	157.01
517.242	120.6
517.666	174
518.09	161.87
518.515	169.15
518.939	178.86
519.363	436.14
519.787	169.15
520.211	220.12
520.635	149.73
521.059	98.76
521.483	186.14
521.907	108.47
522.331	154.58
522.754	157.01
523.178	142.45
523.602	152.16
524.025	183.71
524.449	157.01
524.872	220.12
525.296	159.44
525.719	157.01
526.143	149.73
526.566	144.87
526.989	178.86
527.412	190.99
527.836	140.02
528.259	183.71
528.682	132.74
529.105	249.25
529.528	176.43
529.951	178.86
530.374	137.59
530.796	157.01
531.219	161.87
531.642	188.56
532.065	135.17
532.487	174
532.91	161.87
533.332	176.43
533.755	171.57
534.177	188.56
534.6	125.46
535.022	212.84
535.444	176.43
535.867	174
536.289	149.73
536.711	169.15
537.133	176.43
537.555	224.97
537.977	178.86
538.399	217.69
538.821	190.99
539.243	93.9
539.665	254.1
540.086	171.57
540.508	166.72
540.93	169.15
541.351	181.28
541.773	251.67
542.195	152.16
542.616	149.73
543.037	229.83
543.459	215.26
543.88	232.25
544.301	198.27
544.723	200.7
545.144	241.96
545.565	215.26
545.986	195.85
546.407	217.69
546.828	186.14
547.249	147.3
547.67	215.26
548.091	137.59
548.512	210.41
548.932	237.11
549.353	178.86
549.774	176.43
550.194	164.29
550.615	137.59
551.035	181.28
551.456	203.13
551.876	174
552.296	207.98
552.717	154.58
553.137	140.02
553.557	188.56
553.977	169.15
554.397	246.82
554.817	152.16
555.237	188.56
555.657	171.57
556.077	144.87
556.497	200.7
556.917	161.87
557.337	140.02
557.756	161.87
558.176	123.03
558.596	207.98
559.015	157.01
559.435	152.16
559.854	98.76
560.274	108.47
560.693	178.86
561.112	152.16
561.532	113.32
561.951	266.24
562.37	188.56
562.789	147.3
563.208	164.29
563.627	154.58
564.046	166.72
564.465	212.84
564.884	159.44
565.303	164.29
565.722	222.55
566.14	190.99
566.559	159.44
566.978	132.74
567.396	232.25
567.815	195.85
568.233	227.4
568.652	210.41
569.07	181.28
569.489	135.17
569.907	144.87
570.325	142.45
570.743	178.86
571.161	193.42
571.58	178.86
571.998	164.29
572.416	217.69
572.833	169.15
573.251	113.32
573.669	135.17
574.087	220.12
574.505	244.39
574.922	147.3
575.34	171.57
575.758	176.43
576.175	125.46
576.593	227.4
577.01	229.83
577.428	190.99
577.845	1768.69
578.262	326.92
578.68	142.45
579.097	198.27
579.514	200.7
579.931	154.58
580.348	110.89
580.765	154.58
581.182	176.43
581.599	166.72
582.016	195.85
582.433	232.25
582.849	186.14
583.266	147.3
583.683	188.56
584.099	140.02
584.516	147.3
584.933	195.85
585.349	135.17
585.765	106.04
586.182	147.3
586.598	198.27
587.014	174
587.431	140.02
587.847	161.87
588.263	181.28
588.679	195.85
589.095	205.56
589.511	198.27
589.927	113.32
590.343	183.71
590.759	130.31
591.174	132.74
591.59	161.87
592.006	120.6
592.421	200.7
592.837	113.32
593.252	200.7
593.668	120.6
594.083	195.85
594.499	171.57
594.914	186.14
595.329	166.72
595.745	130.31
596.16	205.56
596.575	200.7
596.99	174
597.405	203.13
597.82	205.56
598.235	169.15
598.65	178.86
599.065	115.75
599.479	178.86
599.894	193.42
600.309	171.57
600.724	198.27
601.138	142.45
601.553	149.73
601.967	176.43
602.382	249.25
602.796	159.44
603.21	159.44
603.625	210.41
604.039	212.84
604.453	205.56
604.867	169.15
605.281	205.56
605.695	190.99
606.109	215.26
606.523	127.88
606.937	198.27
607.351	322.06
607.765	113.32
608.178	127.88
608.592	120.6
609.006	174
609.419	188.56
609.833	220.12
610.246	166.72
610.66	120.6
611.073	217.69
611.487	159.44
611.9	178.86
612.313	159.44
612.726	106.04
613.139	157.01
613.553	176.43
613.966	159.44
614.379	246.82
614.792	84.19
615.204	149.73
615.617	183.71
616.03	200.7
616.443	157.01
616.856	178.86
617.268	132.74
617.681	212.84
618.093	144.87
618.506	200.7
618.918	108.47
619.331	125.46
619.743	181.28
620.155	135.17
620.568	183.71
620.98	174
621.392	237.11
621.804	222.55
622.216	220.12
622.628	181.28
623.04	198.27
623.452	161.87
623.864	154.58
624.276	159.44
624.687	93.9
625.099	212.84
625.511	137.59
625.922	212.84
626.334	183.71
626.745	171.57
627.157	227.4
627.568	174
627.979	113.32
628.391	198.27
628.802	149.73
629.213	152.16
629.624	174
630.035	164.29
630.446	181.28
630.857	178.86
631.268	186.14
631.679	101.18
632.09	161.87
632.501	108.47
632.912	147.3
633.322	205.56
633.733	147.3
634.144	132.74
634.554	181.28
634.965	140.02
635.375	178.86
635.785	89.05
636.196	232.25
636.606	152.16
637.016	181.28
637.427	137.59
637.837	224.97
638.247	198.27
638.657	161.87
639.067	176.43
639.477	234.68
639.887	169.15
640.297	144.87
640.706	188.56
641.116	256.53
641.526	174
641.935	181.28
642.345	171.57
642.755	193.42
643.164	183.71
643.573	137.59
643.983	159.44
644.392	157.01
644.801	123.03
645.211	186.14
645.62	157.01
646.029	190.99
646.438	159.44
646.847	89.05
647.256	125.46
647.665	239.54
648.074	186.14
648.483	154.58
648.892	224.97
649.3	188.56
649.709	149.73
650.118	176.43
650.526	123.03
650.935	149.73
651.343	169.15
651.752	215.26
652.16	190.99
652.568	198.27
652.977	130.31
653.385	234.68
653.793	135.17
654.201	130.31
654.609	178.86
655.017	169.15
655.425	193.42
655.833	171.57
656.241	169.15
656.649	154.58
657.057	164.29
657.464	246.82
657.872	132.74
658.28	207.98
658.687	142.45
659.095	217.69
659.502	188.56
659.91	203.13
660.317	212.84
660.724	174
661.132	256.53
661.539	120.6
661.946	157.01
662.353	164.29
662.76	144.87
663.167	154.58
663.574	130.31
663.981	190.99
664.388	176.43
664.795	164.29
665.202	237.11
665.608	154.58
666.015	137.59
666.422	174
666.828	147.3
667.235	161.87
667.641	144.87
668.047	140.02
668.454	144.87
668.86	183.71
669.266	198.27
669.673	132.74
670.079	144.87
670.485	176.43
670.891	159.44
671.297	159.44
671.703	178.86
672.109	232.25
672.515	144.87
672.92	149.73
673.326	205.56
673.732	229.83
674.138	183.71
674.543	161.87
674.949	159.44
675.354	164.29
675.76	239.54
676.165	212.84
676.57	205.56
676.976	224.97
677.381	181.28
677.786	271.09
678.191	166.72
678.596	212.84
679.001	178.86
679.406	174
679.811	161.87
680.216	101.18
680.621	171.57
681.026	195.85
681.43	169.15
681.835	198.27
682.24	200.7
682.644	203.13
683.049	166.72
683.453	110.89
683.858	181.28
684.262	118.18
684.667	178.86
685.071	205.56
685.475	84.19
685.879	154.58
686.283	166.72
686.687	190.99
687.091	164.29
687.495	174
687.899	258.95
688.303	232.25
688.707	178.86
689.111	154.58
689.514	132.74
689.918	152.16
690.322	166.72
690.725	215.26
691.129	220.12
691.532	188.56
691.936	220.12
692.339	193.42
692.742	137.59
693.146	222.55
693.549	232.25
693.952	280.8
694.355	193.42
694.758	183.71
695.161	178.86
695.564	234.68
695.967	135.17
696.37	181.28
696.773	200.7
697.175	125.46
697.578	149.73
697.981	159.44
698.383	186.14
698.786	159.44
699.188	171.57
699.591	186.14
699.993	149.73
700.395	190.99
700.798	186.14
701.2	258.95
701.602	193.42
702.004	178.86
702.406	154.58
702.808	176.43
703.21	195.85
703.612	222.55
704.014	181.28
704.416	249.25
704.818	258.95
705.219	254.1
705.621	205.56
706.023	137.59
706.424	176.43
706.826	222.55
707.227	212.84
707.629	207.98
708.03	210.41
708.431	169.15
708.832	215.26
709.234	273.52
709.635	370.61
710.036	273.52
710.437	307.5
710.838	280.8
711.239	164.29
711.64	261.38
712.041	263.81
712.441	232.25
712.842	305.07
713.243	280.8
713.643	278.37
714.044	280.8
714.445	254.1
714.845	271.09
715.246	258.95
715.646	217.69
716.046	261.38
716.447	305.07
716.847	319.63
717.247	326.92
717.647	244.39
718.047	326.92
718.447	305.07
718.847	300.22
719.247	307.5
719.647	307.5
720.047	424.01
720.446	334.2
720.846	317.21
721.246	419.15
721.645	394.88
722.045	302.64
722.444	353.62
722.844	414.3
723.243	416.72
723.643	443.42
724.042	465.27
724.441	419.15
724.84	455.56
725.24	382.74
725.639	319.63
726.038	392.45
726.437	404.59
726.836	511.39
727.234	438.57
727.633	487.11
728.032	465.27
728.431	516.24
728.83	569.64
729.228	618.18
729.627	642.46
730.025	538.08
730.424	686.15
730.822	710.42
731.22	715.27
731.619	814.79
732.017	805.08
732.415	836.63
732.813	933.72
733.212	1006.54
733.61	1091.49
734.008	1064.79
734.406	1181.3
734.803	1227.42
735.201	1307.51
735.599	1470.14
735.997	1465.28
736.395	1576.94
736.792	1700.72
737.19	1773.54
737.587	1887.62
737.985	1950.73
738.382	2035.68
738.78	2040.54
739.177	2147.33
739.574	2339.08
739.971	2373.06
740.369	2569.67
740.766	2805.11
741.163	2632.78
741.56	2720.16
741.957	2822.1
742.354	3140.07
742.751	3072.1
743.147	3409.49
743.544	3467.74
743.941	3538.13
744.338	3734.74
744.734	3722.6
745.131	4072.12
745.527	4174.06
745.924	4397.37
746.32	4632.81
746.716	4897.38
747.113	5113.4
747.509	5205.63
747.905	5543.02
748.301	5654.67
748.697	5858.56
749.093	6249.34
749.489	6390.12
749.885	6601.29
750.281	7035.76
750.677	7373.14
751.073	7416.83
751.468	7938.69
751.864	8293.06
752.26	8312.48
752.655	8912
753.051	9072.2
753.446	9717.84
753.842	9693.57
754.237	10407.17
754.632	10314.94
755.028	10506.69
755.423	10982.42
755.818	11069.8
756.213	11499.42
756.608	11518.84
757.003	11878.07
757.398	12038.26
757.793	11958.17
758.188	12487.3
758.583	12754.29
758.977	13171.78
759.372	13467.9
759.767	13914.51
760.161	14890.25
760.556	15074.72
760.95	16006.77
761.345	16696.1
761.739	17514.08
762.133	17618.45
762.527	18188.84
762.922	18875.75
763.316	19506.83
763.71	20625.78
764.104	20264.12
764.498	21009.28
764.892	21873.37
765.286	21735.02
765.68	22989.89
766.073	23055.43
766.467	23465.63
766.861	23822.43
767.255	24681.66
767.648	25815.18
768.042	25441.38
768.435	26215.67
768.829	26514.22
769.222	27113.74
769.615	27727.83
770.008	27152.58
770.402	27570.06
770.795	27781.23
771.188	28514.25
771.581	28497.26
771.974	28181.72
772.367	28611.34
772.76	27883.17
773.153	27963.27
773.545	28781.24
773.938	28511.82
774.331	29601.64
774.724	29453.58
775.116	30977.88
775.509	32349.26
775.901	31931.78
776.294	33608.99
776.686	34082.3
777.078	34829.88
777.471	35257.07
777.863	36718.26
778.255	38613.92
778.647	38494.99
779.039	38419.74
779.431	38900.33
779.823	38412.46
780.215	39395.49
780.607	38825.09
780.999	40186.76
781.39	40567.83
781.782	39808.11
782.174	41499.89
782.565	41126.09
782.957	41138.23
783.348	41713.48
783.74	41245.03
784.131	41924.65
784.522	41689.21
784.914	40888.23
785.305	42228.05
785.696	40276.57
786.087	40769.29
786.478	39745.01
786.869	38213.43
787.26	38924.6
787.651	37587.2
788.042	37363.9
788.433	36038.64
788.823	34468.22
789.214	35524.07
789.605	34007.05
789.995	33788.6
790.386	32970.63
790.776	32339.55
791.167	32567.71
791.557	33193.93
791.948	33771.61
792.338	34041.03
792.728	34897.84
793.118	35002.21
793.508	35050.76
793.898	34929.4
794.288	35346.88
794.678	35038.62
795.068	35293.48
795.458	35232.8
795.848	34291.04
796.238	34866.29
796.627	34368.71
797.017	34184.24
797.406	34710.95
797.796	34116.28
798.185	34645.41
798.575	34849.3
798.964	34431.82
799.354	34922.11
799.743	34276.47
800.132	34575.02
800.521	35021.63
800.91	34497.35
801.299	33793.46
801.688	34485.21
802.077	33558.02
802.466	34130.84
802.855	33344.42
803.244	31968.19
803.633	32101.68
804.021	31494.88
804.41	31269.15
804.799	30232.72
805.187	29213.29
805.576	29138.04
805.964	28521.53
806.352	27060.34
806.741	27358.89
807.129	26438.97
807.517	26771.5
807.905	26732.67
808.293	26118.58
808.681	26989.95
809.069	27016.65
809.457	26756.94
809.845	27502.1
810.233	27548.21
810.621	27472.97
811.009	27283.65
811.396	26938.98
811.784	27538.5
812.171	27242.38
812.559	26244.8
812.946	26655
813.334	26070.04
813.721	25222.93
814.108	25208.37
814.496	24902.54
814.883	23980.2
815.27	24739.92
815.657	23917.09
816.044	24130.68
816.431	24203.5
816.818	23286.01
817.205	23196.2
817.592	23769.03
817.979	22642.8
818.365	22776.29
818.752	21647.64
819.139	20929.18
819.525	20885.49
819.912	20273.83
820.298	19858.77
820.685	19492.26
821.071	18722.83
821.457	18669.43
821.843	17958.26
822.23	16751.93
822.616	16589.31
823.002	15953.37
823.388	14827.14
823.774	14509.18
824.16	14339.27
824.546	13972.76
824.931	13747.03
825.317	13169.35
825.703	13511.59
826.089	13215.47
826.474	13035.85
826.86	12504.29
827.245	12926.63
827.631	12426.62
828.016	12188.75
828.401	11822.24
828.787	11467.87
829.172	11339.22
829.557	11186.31
829.942	10567.37
830.327	10504.26
830.712	10334.35
831.097	9817.36
831.482	9863.47
831.867	9703.28
832.252	9149.87
832.636	9344.05
833.021	9118.32
833.406	8800.35
833.79	8708.11
834.175	8261.51
834.559	8176.55
834.944	7992.08
835.328	7856.16
835.713	7555.18
836.097	7487.22
836.481	6921.68
836.865	6916.82
837.249	6807.6
837.633	6382.84
838.017	6409.54
838.401	6055.16
838.785	5776.03
839.169	5843.99
839.553	5562.43
839.937	5120.68
840.32	4853.69
840.704	4831.84
841.087	4535.72
841.471	4293
841.854	4334.26
842.238	4159.5
842.621	3979.89
843.004	3822.12
843.388	3761.44
843.771	3749.3
844.154	3863.38
844.537	3676.48
844.92	3700.76
845.303	3504.15
845.686	3511.43
846.069	3280.85
846.452	3387.64
846.834	3217.74
847.217	3200.75
847.6	3023.56
847.982	2936.18
848.365	2904.63
848.748	2924.04
849.13	2800.26
849.512	2698.31
849.895	2797.83
850.277	2691.03
850.659	2598.8
851.041	2482.29
851.423	2572.1
851.806	2407.05
852.188	2368.21
852.57	2278.4
852.951	2266.27
853.333	2234.71
853.715	2176.46
854.097	1999.27
854.479	1960.44
854.86	1907.04
855.242	1909.47
855.623	1834.22
856.005	1693.44
856.386	1741.99
856.768	1710.43
857.149	1615.77
857.53	1620.63
857.911	1494.41
858.292	1414.31
858.674	1377.9
859.055	1312.37
859.436	1258.97
859.817	1125.47
860.197	1147.32
860.578	1210.43
860.959	1113.34
861.34	1176.44
861.72	1042.95
862.101	1072.07
862.482	1040.52
862.862	955.57
863.243	936.15
863.623	919.16
864.003	894.89
864.384	875.47
864.764	941
865.144	831.78
865.524	724.98
865.904	754.11
866.284	771.1
866.664	788.09
867.044	734.69
867.424	727.41
867.804	700.71
868.183	722.55
868.563	569.64
868.943	627.89
869.322	499.25
869.702	533.23
870.081	632.75
870.461	589.06
870.84	484.69
871.22	477.4
871.599	530.8
871.978	504.1
872.357	513.81
872.736	438.57
873.115	462.84
873.494	390.02
873.873	533.23
874.252	445.85
874.631	474.98
875.01	365.75
875.388	363.32
875.767	302.64
876.146	387.6
876.524	339.05
876.903	380.32
877.281	319.63
877.66	280.8
878.038	339.05
878.416	392.45
878.794	319.63
879.173	305.07
879.551	239.54
879.929	244.39
880.307	256.53
880.685	239.54
881.063	254.1
881.441	309.93
881.818	292.94
882.196	263.81
882.574	280.8
882.951	314.78
883.329	273.52
883.707	268.66
884.084	302.64
884.461	263.81
884.839	205.56
885.216	256.53
885.593	220.12
885.971	256.53
886.348	258.95
886.725	278.37
887.102	302.64
887.479	217.69
887.856	203.13
888.233	229.83
888.609	198.27
888.986	261.38
889.363	232.25
889.74	305.07
890.116	169.15
890.493	254.1
890.869	140.02
891.246	263.81
891.622	227.4
891.998	224.97
892.375	251.67
892.751	232.25
893.127	212.84
893.503	188.56
893.879	249.25
894.255	181.28
894.631	154.58
895.007	205.56
895.383	210.41
895.759	195.85
896.134	234.68
896.51	207.98
896.886	174
897.261	178.86
897.637	140.02
898.012	147.3
898.388	183.71
898.763	161.87
899.138	149.73
899.514	125.46
899.889	154.58
900.264	161.87
900.639	152.16
901.014	190.99
901.389	147.3
901.764	123.03
902.139	164.29
902.513	147.3
902.888	169.15
903.263	188.56
903.638	169.15
904.012	251.67
904.387	135.17
904.761	176.43
905.136	176.43
905.51	207.98
905.884	149.73
906.259	176.43
906.633	154.58
907.007	120.6
907.381	198.27
907.755	239.54
908.129	186.14
908.503	275.94
908.877	164.29
909.251	89.05
909.624	183.71
909.998	183.71
910.372	183.71
910.745	113.32
911.119	137.59
911.492	147.3
911.866	183.71
912.239	142.45
912.612	203.13
912.986	217.69
913.359	79.34
913.732	142.45
914.105	220.12
914.478	205.56
914.851	174
915.224	108.47
915.597	164.29
915.97	142.45
916.343	188.56
916.715	166.72
917.088	159.44
917.461	159.44
917.833	79.34
918.206	135.17
918.578	96.33
918.951	241.96
919.323	212.84
919.695	130.31
920.067	171.57
920.44	166.72
920.812	164.29
921.184	169.15
921.556	190.99
921.928	161.87
922.3	176.43
922.672	198.27
923.043	144.87
923.415	110.89
923.787	132.74
924.158	123.03
924.53	142.45
924.901	166.72
925.273	93.9
925.644	205.56
926.016	164.29
926.387	157.01
926.758	135.17
927.129	254.1
927.5	144.87
927.872	115.75
928.243	176.43
928.613	74.49
928.984	154.58
929.355	123.03
929.726	200.7
930.097	154.58
930.467	135.17
930.838	205.56
931.209	183.71
931.579	98.76
931.95	159.44
932.32	169.15
932.69	215.26
933.061	174
933.431	193.42
933.801	205.56
934.171	166.72
934.541	188.56
934.911	186.14
935.281	149.73
935.651	176.43
936.021	174
936.391	159.44
936.761	132.74
937.13	106.04
937.5	125.46
937.87	207.98
938.239	127.88
938.609	198.27
938.978	169.15
939.347	190.99
939.717	164.29
940.086	120.6
940.455	157.01
940.824	166.72
941.193	198.27
941.562	147.3
941.931	125.46
942.3	210.41
942.669	210.41
943.038	101.18
943.407	137.59
943.775	203.13
944.144	186.14
944.513	159.44
944.881	142.45
945.25	125.46
945.618	154.58
945.986	154.58
946.355	169.15
946.723	152.16
947.091	142.45
947.459	154.58
947.827	123.03
948.195	224.97
948.563	176.43
948.931	93.9
949.299	130.31
949.667	178.86
950.035	178.86
950.402	203.13
950.77	188.56
951.138	159.44
951.505	171.57
951.873	157.01
952.24	149.73
952.607	157.01
952.975	166.72
953.342	140.02
953.709	125.46
954.076	132.74
954.443	64.78
954.81	127.88
955.177	140.02
955.544	190.99
955.911	174
956.278	140.02
956.645	183.71
957.012	120.6
957.378	186.14
957.745	169.15
958.111	132.74
958.478	229.83
958.844	171.57
959.211	137.59
959.577	120.6
959.943	217.69
960.309	227.4
960.675	171.57
961.042	186.14
961.408	115.75
961.774	152.16
962.139	152.16
962.505	157.01
962.871	142.45
963.237	125.46
963.603	164.29
963.968	176.43
964.334	198.27
964.699	142.45
965.065	166.72
965.43	181.28
965.796	176.43
966.161	132.74
966.526	147.3
966.891	193.42
967.256	113.32
967.622	190.99
967.987	169.15
968.352	193.42
968.716	198.27
969.081	203.13
969.446	72.06
969.811	147.3
970.176	161.87
970.54	207.98
970.905	149.73
971.269	144.87
971.634	110.89
971.998	140.02
972.363	171.57
972.727	132.74
973.091	127.88
973.455	84.19
973.819	147.3
974.183	135.17
974.547	127.88
974.911	186.14
975.275	142.45
975.639	93.9
976.003	234.68
976.367	157.01
976.73	183.71
977.094	144.87
977.458	161.87
977.821	205.56
978.185	147.3
978.548	110.89
978.911	147.3
979.275	135.17
979.638	127.88
980.001	127.88
980.364	198.27
980.727	96.33
981.09	147.3
981.453	81.77
981.816	132.74
982.179	127.88
982.542	224.97
982.905	178.86
983.267	200.7
983.63	149.73
983.992	178.86
984.355	135.17
984.717	140.02
985.08	183.71
985.442	103.61
985.804	176.43
986.167	205.56
986.529	154.58
986.891	174
987.253	210.41
987.615	166.72
987.977	190.99
988.339	186.14
988.701	169.15
989.062	91.48
989.424	108.47
989.786	135.17
990.147	174
990.509	149.73
990.87	220.12
991.232	195.85
991.593	135.17
991.955	140.02
992.316	125.46
992.677	149.73
993.038	183.71
993.399	120.6
993.76	123.03
994.121	161.87
994.482	174
994.843	135.17
995.204	152.16
995.565	174
995.926	190.99
996.286	125.46
996.647	106.04
997.007	203.13
997.368	154.58
997.728	178.86
998.089	123.03
998.449	224.97
998.809	154.58
999.169	166.72
999.53	152.16
999.89	203.13
1000.25	142.45
1000.61	174
1000.97	188.56
1001.329	193.42
1001.689	159.44
1002.049	205.56
1002.409	212.84
1002.768	161.87
1003.128	169.15
1003.487	241.96
1003.847	176.43
1004.206	220.12
1004.566	207.98
1004.925	132.74
1005.284	106.04
1005.643	203.13
1006.003	149.73
1006.362	205.56
1006.721	120.6
1007.08	147.3
1007.438	76.91
1007.797	86.62
1008.156	188.56
1008.515	195.85
1008.874	159.44
1009.232	76.91
1009.591	115.75
1009.949	118.18
1010.308	169.15
1010.666	91.48
1011.024	127.88
1011.383	176.43
1011.741	171.57
1012.099	161.87
1012.457	188.56
1012.815	125.46
1013.173	154.58
1013.531	137.59
1013.889	176.43
1014.247	120.6
1014.605	217.69
1014.962	142.45
1015.32	101.18
1015.678	142.45
1016.035	84.19
1016.393	106.04
1016.75	50.21
1017.107	186.14
1017.465	125.46
1017.822	110.89
1018.179	246.82
1018.536	261.38
1018.894	132.74
1019.251	164.29
1019.608	178.86
1019.964	210.41
1020.321	142.45
1020.678	241.96
1021.035	125.46
1021.392	142.45
1021.748	188.56
1022.105	152.16
1022.461	142.45
1022.818	135.17
1023.174	212.84
1023.531	188.56
1023.887	195.85
1024.243	154.58
1024.599	220.12
1024.955	159.44
1025.311	154.58
1025.667	76.91
1026.023	176.43
1026.379	174
1026.735	84.19
1027.091	186.14
1027.447	198.27
