189.514	89.81
189.973	89.81
190.431	89.81
190.889	-33.98
191.348	-38.84
191.806	77.67
192.264	26.7
192.722	33.98
193.18	-21.84
193.638	-89.81
194.096	-65.53
194.554	-21.84
195.012	48.54
195.47	7.28
195.928	-14.56
196.385	-26.7
196.843	-14.56
197.301	-16.99
197.758	60.68
198.216	16.99
198.674	21.85
199.131	55.83
199.589	80.1
200.046	128.64
200.503	70.39
200.961	99.52
201.418	101.94
201.875	116.51
202.332	89.81
202.79	174.76
203.247	138.35
203.704	101.94
204.161	152.91
204.618	152.91
205.075	126.22
205.532	128.64
205.989	155.34
206.445	160.2
206.902	135.92
207.359	179.61
207.816	206.31
208.272	116.51
208.729	133.5
209.185	196.61
209.642	118.93
210.098	116.51
210.555	165.05
211.011	216.02
211.467	220.88
211.924	155.34
212.38	162.62
212.836	145.63
213.292	152.91
213.748	152.91
214.204	169.91
214.66	186.9
215.116	99.52
215.572	114.08
216.028	174.76
216.484	189.32
216.94	213.6
217.396	133.5
217.851	133.5
218.307	111.65
218.763	152.91
219.218	169.91
219.674	150.49
220.129	167.48
220.585	199.03
221.04	165.05
221.496	167.48
221.951	135.92
222.406	160.2
222.861	121.36
223.317	104.37
223.772	94.66
224.227	199.03
224.682	97.09
225.137	172.33
225.592	97.09
226.047	152.91
226.502	172.33
226.957	128.64
227.411	106.8
227.866	169.91
228.321	179.61
228.776	118.93
229.23	128.64
229.685	114.08
230.139	184.47
230.594	157.77
231.048	135.92
231.503	189.32
231.957	150.49
232.411	101.94
232.865	138.35
233.32	140.78
233.774	121.36
234.228	165.05
234.682	89.81
235.136	111.65
235.59	162.62
236.044	133.5
236.498	109.23
236.952	186.9
237.406	177.19
237.86	106.8
238.313	201.46
238.767	220.88
239.221	160.2
239.674	126.22
240.128	211.17
240.581	121.36
241.035	160.2
241.488	165.05
241.942	145.63
242.395	150.49
242.848	116.51
243.301	133.5
243.755	101.94
244.208	184.47
244.661	140.78
245.114	123.79
245.567	111.65
246.02	172.33
246.473	152.91
246.926	138.35
247.379	118.93
247.832	128.64
248.284	104.37
248.737	179.61
249.19	143.21
249.642	97.09
250.095	145.63
250.547	148.06
251	213.6
251.452	150.49
251.905	174.76
252.357	157.77
252.81	148.06
253.262	140.78
253.714	211.17
254.166	152.91
254.618	118.93
255.07	121.36
255.523	186.9
255.975	140.78
256.427	145.63
256.878	63.11
257.33	118.93
257.782	157.77
258.234	155.34
258.686	172.33
259.137	179.61
259.589	250
260.041	162.62
260.492	126.22
260.944	206.31
261.395	114.08
261.847	196.61
262.298	179.61
262.749	92.23
263.201	213.6
263.652	148.06
264.103	165.05
264.554	89.81
265.005	63.11
265.457	150.49
265.908	172.33
266.359	140.78
266.809	148.06
267.26	152.91
267.711	167.48
268.162	169.91
268.613	133.5
269.064	169.91
269.514	123.79
269.965	182.04
270.415	135.92
270.866	186.9
271.316	121.36
271.767	123.79
272.217	114.08
272.668	160.2
273.118	114.08
273.568	89.81
274.019	106.8
274.469	101.94
274.919	94.66
275.369	140.78
275.819	131.07
276.269	82.53
276.719	111.65
277.169	133.5
277.619	167.48
278.069	152.91
278.518	116.51
278.968	184.47
279.418	191.75
279.867	184.47
280.317	77.67
280.767	92.23
281.216	118.93
281.666	177.19
282.115	211.17
282.564	182.04
283.014	150.49
283.463	135.92
283.912	167.48
284.361	121.36
284.811	191.75
285.26	145.63
285.709	116.51
286.158	225.73
286.607	169.91
287.056	135.92
287.505	208.74
287.953	189.32
288.402	169.91
288.851	133.5
289.3	211.17
289.748	135.92
290.197	104.37
290.646	157.77
291.094	177.19
291.543	135.92
291.991	114.08
292.439	138.35
292.888	99.52
293.336	174.76
293.784	133.5
294.233	138.35
294.681	155.34
295.129	133.5
295.577	145.63
296.025	121.36
296.473	128.64
296.921	179.61
297.369	186.9
297.817	126.22
298.264	233.01
298.712	177.19
299.16	84.95
299.608	152.91
300.055	106.8
300.503	97.09
300.95	201.46
301.398	189.32
301.845	133.5
302.293	155.34
302.74	165.05
303.187	160.2
303.635	184.47
304.082	179.61
304.529	145.63
304.976	75.24
305.423	145.63
305.87	131.07
306.317	97.09
306.764	174.76
307.211	111.65
307.658	116.51
308.105	123.79
308.552	194.18
308.998	82.53
309.445	155.34
309.892	111.65
310.338	138.35
310.785	152.91
311.231	174.76
311.678	172.33
312.124	167.48
312.571	111.65
313.017	172.33
313.463	123.79
313.909	75.24
314.356	135.92
314.802	167.48
315.248	162.62
315.694	162.62
316.14	157.77
316.586	143.21
317.032	162.62
317.478	135.92
317.923	143.21
318.369	218.45
318.815	196.61
319.261	196.61
319.706	165.05
320.152	186.9
320.597	133.5
321.043	218.45
321.488	218.45
321.934	169.91
322.379	165.05
322.824	160.2
323.27	114.08
323.715	140.78
324.16	174.76
324.605	138.35
325.05	99.52
325.495	143.21
325.94	138.35
326.385	203.89
326.83	111.65
327.275	160.2
327.72	199.03
328.165	177.19
328.61	131.07
329.054	186.9
329.499	186.9
329.943	128.64
330.388	133.5
330.832	89.81
331.277	184.47
331.721	145.63
332.166	162.62
332.61	118.93
333.054	177.19
333.499	84.95
333.943	67.96
334.387	131.07
334.831	157.77
335.275	162.62
335.719	160.2
336.163	162.62
336.607	143.21
337.051	165.05
337.495	228.16
337.938	143.21
338.382	118.93
338.826	128.64
339.269	94.66
339.713	201.46
340.157	53.4
340.6	89.81
341.044	196.61
341.487	126.22
341.93	165.05
342.374	92.23
342.817	182.04
343.26	191.75
343.703	143.21
344.146	131.07
344.59	177.19
345.033	165.05
345.476	245.15
345.919	174.76
346.361	165.05
346.804	92.23
347.247	199.03
347.69	138.35
348.133	92.23
348.575	72.82
349.018	106.8
349.461	140.78
349.903	143.21
350.346	84.95
350.788	145.63
351.23	167.48
351.673	123.79
352.115	140.78
352.557	140.78
353	172.33
353.442	160.2
353.884	138.35
354.326	114.08
354.768	116.51
355.21	106.8
355.652	128.64
356.094	114.08
356.536	109.23
356.978	167.48
357.419	140.78
357.861	172.33
358.303	138.35
358.744	182.04
359.186	97.09
359.627	157.77
360.069	152.91
360.51	155.34
360.952	109.23
361.393	182.04
361.834	106.8
362.276	143.21
362.717	148.06
363.158	143.21
363.599	194.18
364.04	94.66
364.481	186.9
364.922	135.92
365.363	169.91
365.804	165.05
366.245	165.05
366.686	118.93
367.126	177.19
367.567	179.61
368.008	247.58
368.448	199.03
368.889	194.18
369.33	150.49
369.77	148.06
370.21	128.64
370.651	167.48
371.091	160.2
371.531	184.47
371.972	160.2
372.412	131.07
372.852	157.77
373.292	169.91
373.732	208.74
374.172	131.07
374.612	94.66
375.052	184.47
375.492	218.45
375.932	92.23
376.372	145.63
376.811	189.32
377.251	133.5
377.691	223.3
378.13	135.92
378.57	138.35
379.009	189.32
379.449	186.9
379.888	114.08
380.328	135.92
380.767	189.32
381.206	106.8
381.645	165.05
382.085	174.76
382.524	84.95
382.963	140.78
383.402	218.45
383.841	128.64
384.28	208.74
384.719	206.31
385.158	133.5
385.596	135.92
386.035	179.61
386.474	128.64
386.913	189.32
387.351	167.48
387.79	179.61
388.228	133.5
388.667	165.05
389.105	182.04
389.544	201.46
389.982	172.33
390.42	206.31
390.859	128.64
391.297	177.19
391.735	150.49
392.173	155.34
392.611	126.22
393.049	162.62
393.487	97.09
393.925	148.06
394.363	143.21
394.801	196.61
395.239	116.51
395.676	140.78
396.114	114.08
396.552	182.04
396.989	189.32
397.427	162.62
397.864	179.61
398.302	123.79
398.739	135.92
399.177	140.78
399.614	201.46
400.051	114.08
400.488	128.64
400.926	172.33
401.363	111.65
401.8	191.75
402.237	194.18
402.674	177.19
403.111	152.91
403.548	114.08
403.985	186.9
404.421	143.21
404.858	194.18
405.295	152.91
405.732	145.63
406.168	131.07
406.605	211.17
407.041	213.6
407.478	135.92
407.914	165.05
408.351	135.92
408.787	80.1
409.223	177.19
409.66	160.2
410.096	155.34
410.532	184.47
410.968	123.79
411.404	179.61
411.84	152.91
412.276	150.49
412.712	165.05
413.148	174.76
413.584	179.61
414.02	150.49
414.455	109.23
414.891	138.35
415.327	121.36
415.762	138.35
416.198	101.94
416.633	111.65
417.069	155.34
417.504	143.21
417.94	150.49
418.375	72.82
418.81	252.43
419.245	118.93
419.681	184.47
420.116	111.65
420.551	203.89
420.986	150.49
421.421	80.1
421.856	101.94
422.291	97.09
422.726	123.79
423.16	179.61
423.595	87.38
424.03	126.22
424.464	165.05
424.899	162.62
425.334	123.79
425.768	152.91
426.203	150.49
426.637	157.77
427.071	150.49
427.506	131.07
427.94	157.77
428.374	97.09
428.809	242.72
429.243	167.48
429.677	201.46
430.111	160.2
430.545	143.21
430.979	172.33
431.413	155.34
431.847	114.08
432.28	148.06
432.714	148.06
433.148	194.18
433.582	213.6
434.015	186.9
434.449	199.03
434.882	213.6
435.316	65.53
435.749	92.23
436.183	75.24
436.616	174.76
437.049	206.31
437.483	133.5
437.916	128.64
438.349	104.37
438.782	145.63
439.215	199.03
439.648	116.51
440.081	199.03
440.514	99.52
440.947	126.22
441.38	99.52
441.813	162.62
442.245	148.06
442.678	126.22
443.111	165.05
443.543	145.63
443.976	177.19
444.408	148.06
444.841	152.91
445.273	94.66
445.705	155.34
446.138	97.09
446.57	189.32
447.002	82.53
447.434	128.64
447.867	213.6
448.299	172.33
448.731	182.04
449.163	206.31
449.595	196.61
450.026	150.49
450.458	157.77
450.89	218.45
451.322	150.49
451.754	92.23
452.185	165.05
452.617	169.91
453.048	157.77
453.48	228.16
453.911	247.58
454.343	259.71
454.774	148.06
455.205	114.08
455.637	165.05
456.068	189.32
456.499	138.35
456.93	213.6
457.361	131.07
457.792	97.09
458.223	203.89
458.654	184.47
459.085	174.76
459.516	225.73
459.947	252.43
460.378	109.23
460.808	138.35
461.239	196.61
461.669	114.08
462.1	172.33
462.531	189.32
462.961	118.93
463.391	172.33
463.822	167.48
464.252	121.36
464.682	94.66
465.113	143.21
465.543	223.3
465.973	191.75
466.403	186.9
466.833	191.75
467.263	87.38
467.693	177.19
468.123	208.74
468.553	84.95
468.983	298.55
469.412	208.74
469.842	203.89
470.272	189.32
470.701	196.61
471.131	182.04
471.56	152.91
471.99	182.04
472.419	182.04
472.849	121.36
473.278	213.6
473.707	143.21
474.136	116.51
474.566	199.03
474.995	162.62
475.424	174.76
475.853	191.75
476.282	155.34
476.711	116.51
477.14	157.77
477.569	196.61
477.997	148.06
478.426	145.63
478.855	186.9
479.283	218.45
479.712	189.32
480.141	223.3
480.569	211.17
480.998	174.76
481.426	169.91
481.854	203.89
482.283	77.67
482.711	271.85
483.139	196.61
483.567	194.18
483.995	143.21
484.424	172.33
484.852	150.49
485.28	148.06
485.708	189.32
486.135	213.6
486.563	126.22
486.991	189.32
487.419	174.76
487.847	150.49
488.274	203.89
488.702	206.31
489.129	179.61
489.557	118.93
489.984	131.07
490.412	223.3
490.839	218.45
491.266	228.16
491.694	145.63
492.121	165.05
492.548	126.22
492.975	155.34
493.402	213.6
493.829	199.03
494.256	128.64
494.683	72.82
495.11	148.06
495.537	92.23
495.964	148.06
496.39	165.05
496.817	148.06
497.244	143.21
497.67	131.07
498.097	203.89
498.523	128.64
498.95	155.34
499.376	114.08
499.803	160.2
500.229	160.2
500.655	116.51
501.081	160.2
501.508	152.91
501.934	92.23
502.36	228.16
502.786	216.02
503.212	174.76
503.638	218.45
504.064	160.2
504.489	206.31
504.915	70.39
505.341	177.19
505.767	191.75
506.192	135.92
506.618	199.03
507.043	184.47
507.469	150.49
507.894	104.37
508.32	191.75
508.745	169.91
509.17	111.65
509.596	106.8
510.021	199.03
510.446	174.76
510.871	133.5
511.296	152.91
511.721	143.21
512.146	191.75
512.571	199.03
512.996	167.48
513.421	84.95
513.845	169.91
514.27	160.2
514.695	101.94
515.119	211.17
515.544	194.18
515.969	160.2
516.393	160.2
516.817	160.2
517.242	131.07
517.666	172.33
518.09	128.64
518.515	152.91
518.939	118.93
519.363	359.23
519.787	196.61
520.211	155.34
520.635	128.64
521.059	182.04
521.483	167.48
521.907	189.32
522.331	223.3
522.754	148.06
523.178	191.75
523.602	208.74
524.025	162.62
524.449	174.76
524.872	165.05
525.296	165.05
525.719	184.47
526.143	196.61
526.566	131.07
526.989	199.03
527.412	155.34
527.836	160.2
528.259	143.21
528.682	177.19
529.105	177.19
529.528	189.32
529.951	191.75
530.374	179.61
530.796	174.76
531.219	230.59
531.642	201.46
532.065	208.74
532.487	155.34
532.91	160.2
533.332	148.06
533.755	138.35
534.177	114.08
534.6	145.63
535.022	167.48
535.444	179.61
535.867	174.76
536.289	133.5
536.711	99.52
537.133	106.8
537.555	101.94
537.977	165.05
538.399	174.76
538.821	177.19
539.243	182.04
539.665	189.32
540.086	140.78
540.508	245.15
540.93	228.16
541.351	191.75
541.773	172.33
542.195	160.2
542.616	165.05
543.037	218.45
543.459	121.36
543.88	201.46
544.301	177.19
544.723	174.76
545.144	186.9
545.565	179.61
545.986	220.88
546.407	216.02
546.828	211.17
547.249	162.62
547.67	152.91
548.091	152.91
548.512	167.48
548.932	157.77
549.353	157.77
549.774	131.07
550.194	182.04
550.615	138.35
551.035	128.64
551.456	126.22
551.876	189.32
552.296	145.63
552.717	126.22
553.137	138.35
553.557	118.93
553.977	143.21
554.397	218.45
554.817	148.06
555.237	148.06
555.657	104.37
556.077	145.63
556.497	157.77
556.917	177.19
557.337	109.23
557.756	114.08
558.176	133.5
558.596	89.81
559.015	111.65
559.435	101.94
559.854	189.32
560.274	191.75
560.693	104.37
561.112	148.06
561.532	138.35
561.951	250
562.37	169.91
562.789	160.2
563.208	145.63
563.627	152.91
564.046	133.5
564.465	233.01
564.884	143.21
565.303	162.62
565.722	135.92
566.14	148.06
566.559	60.68
566.978	242.72
567.396	184.47
567.815	152.91
568.233	116.51
568.652	123.79
569.07	128.64
569.489	167.48
569.907	177.19
570.325	143.21
570.743	143.21
571.161	106.8
571.58	133.5
571.998	169.91
572.416	138.35
572.833	138.35
573.251	196.61
573.669	131.07
574.087	203.89
574.505	177.19
574.922	162.62
575.34	116.51
575.758	140.78
576.175	97.09
576.593	123.79
577.01	167.48
577.428	143.21
577.845	1684.49
578.262	293.69
578.68	220.88
579.097	162.62
579.514	63.11
579.931	189.32
580.348	194.18
580.765	196.61
581.182	162.62
581.599	196.61
582.016	186.9
582.433	160.2
582.849	196.61
583.266	118.93
583.683	123.79
584.099	109.23
584.516	82.53
584.933	179.61
585.349	101.94
585.765	138.35
586.182	138.35
586.598	138.35
587.014	162.62
587.431	148.06
587.847	126.22
588.263	138.35
588.679	150.49
589.095	152.91
589.511	155.34
589.927	157.77
590.343	140.78
590.759	196.61
591.174	194.18
591.59	167.48
592.006	194.18
592.421	135.92
592.837	135.92
593.252	133.5
593.668	201.46
594.083	211.17
594.499	162.62
594.914	218.45
595.329	143.21
595.745	174.76
596.16	179.61
596.575	165.05
596.99	167.48
597.405	165.05
597.82	203.89
598.235	177.19
598.65	172.33
599.065	167.48
599.479	155.34
599.894	172.33
600.309	152.91
600.724	111.65
601.138	145.63
601.553	160.2
601.967	135.92
602.382	218.45
602.796	152.91
603.21	114.08
603.625	150.49
604.039	169.91
604.453	157.77
604.867	189.32
605.281	213.6
605.695	162.62
606.109	99.52
606.523	182.04
606.937	123.79
607.351	334.96
607.765	128.64
608.178	155.34
608.592	131.07
609.006	191.75
609.419	172.33
609.833	211.17
610.246	152.91
610.66	186.9
611.073	177.19
611.487	233.01
611.9	133.5
612.313	206.31
612.726	172.33
613.139	116.51
613.553	140.78
613.966	179.61
614.379	184.47
614.792	135.92
615.204	174.76
615.617	152.91
616.03	172.33
616.443	254.86
616.856	160.2
617.268	162.62
617.681	143.21
618.093	174.76
618.506	177.19
618.918	169.91
619.331	162.62
619.743	157.77
620.155	118.93
620.568	126.22
620.98	133.5
621.392	150.49
621.804	174.76
622.216	116.51
622.628	186.9
623.04	157.77
623.452	138.35
623.864	162.62
624.276	160.2
624.687	135.92
625.099	89.81
625.511	121.36
625.922	199.03
626.334	82.53
626.745	41.26
627.157	138.35
627.568	123.79
627.979	199.03
628.391	92.23
628.802	121.36
629.213	155.34
629.624	196.61
630.035	143.21
630.446	104.37
630.857	211.17
631.268	138.35
631.679	189.32
632.09	191.75
632.501	140.78
632.912	203.89
633.322	131.07
633.733	177.19
634.144	165.05
634.554	121.36
634.965	186.9
635.375	145.63
635.785	177.19
636.196	228.16
636.606	199.03
637.016	155.34
637.427	145.63
637.837	123.79
638.247	184.47
638.657	128.64
639.067	182.04
639.477	223.3
639.887	182.04
640.297	82.53
640.706	123.79
641.116	194.18
641.526	60.68
641.935	138.35
642.345	145.63
642.755	194.18
643.164	140.78
643.573	140.78
643.983	206.31
644.392	201.46
644.801	138.35
645.211	140.78
645.62	150.49
646.029	228.16
646.438	169.91
646.847	189.32
647.256	143.21
647.665	223.3
648.074	128.64
648.483	150.49
648.892	126.22
649.3	152.91
649.709	172.33
650.118	167.48
650.526	177.19
650.935	138.35
651.343	182.04
651.752	189.32
652.16	167.48
652.568	123.79
652.977	111.65
653.385	140.78
653.793	155.34
654.201	138.35
654.609	184.47
655.017	140.78
655.425	172.33
655.833	201.46
656.241	94.66
656.649	138.35
657.057	157.77
657.464	160.2
657.872	126.22
658.28	174.76
658.687	172.33
659.095	138.35
659.502	177.19
659.91	160.2
660.317	203.89
660.724	182.04
661.132	194.18
661.539	87.38
661.946	140.78
662.353	148.06
662.76	184.47
663.167	160.2
663.574	174.76
663.981	228.16
664.388	201.46
664.795	189.32
665.202	143.21
665.608	182.04
666.015	150.49
666.422	145.63
666.828	101.94
667.235	218.45
667.641	131.07
668.047	135.92
668.454	155.34
668.86	201.46
669.266	169.91
669.673	116.51
670.079	199.03
670.485	152.91
670.891	111.65
671.297	165.05
671.703	143.21
672.109	148.06
672.515	169.91
672.92	131.07
673.326	271.85
673.732	160.2
674.138	186.9
674.543	177.19
674.949	123.79
675.354	99.52
675.76	138.35
676.165	179.61
676.57	233.01
676.976	228.16
677.381	106.8
677.786	123.79
678.191	99.52
678.596	179.61
679.001	172.33
679.406	155.34
679.811	148.06
680.216	145.63
680.621	203.89
681.026	109.23
681.43	155.34
681.835	182.04
682.24	131.07
682.644	157.77
683.049	135.92
683.453	152.91
683.858	145.63
684.262	138.35
684.667	126.22
685.071	128.64
685.475	167.48
685.879	186.9
686.283	237.87
686.687	169.91
687.091	106.8
687.495	174.76
687.899	203.89
688.303	135.92
688.707	135.92
689.111	87.38
689.514	211.17
689.918	184.47
690.322	152.91
690.725	116.51
691.129	194.18
691.532	211.17
691.936	131.07
692.339	140.78
692.742	254.86
693.146	196.61
693.549	201.46
693.952	208.74
694.355	177.19
694.758	184.47
695.161	133.5
695.564	203.89
695.967	155.34
696.37	228.16
696.773	131.07
697.175	160.2
697.578	145.63
697.981	128.64
698.383	199.03
698.786	203.89
699.188	242.72
699.591	216.02
699.993	172.33
700.395	174.76
700.798	162.62
701.2	199.03
701.602	131.07
702.004	145.63
702.406	174.76
702.808	177.19
703.21	131.07
703.612	174.76
704.014	152.91
704.416	230.59
704.818	206.31
705.219	184.47
705.621	257.29
706.023	201.46
706.424	220.88
706.826	199.03
707.227	201.46
707.629	123.79
708.03	235.44
708.431	211.17
708.832	235.44
709.234	252.43
709.635	250
710.036	203.89
710.437	259.71
710.838	230.59
711.239	216.02
711.64	233.01
712.041	206.31
712.441	245.15
712.842	242.72
713.243	271.85
713.643	276.7
714.044	245.15
714.445	225.73
714.845	305.83
715.246	271.85
715.646	274.28
716.046	276.7
716.447	240.29
716.847	271.85
717.247	332.53
717.647	283.99
718.047	283.99
718.447	361.66
718.847	376.22
719.247	347.09
719.647	364.08
720.047	364.08
720.446	233.01
720.846	250
721.246	291.27
721.645	313.11
722.045	325.25
722.444	313.11
722.844	456.32
723.243	395.64
723.643	398.06
724.042	468.45
724.441	376.22
724.84	487.87
725.24	422.34
725.639	495.15
726.038	492.73
726.437	446.61
726.836	434.47
727.234	473.31
727.633	490.3
728.032	427.19
728.431	509.72
728.83	504.86
729.228	555.83
729.627	682.05
730.025	689.33
730.424	665.06
730.822	672.34
731.22	774.28
731.619	803.41
732.017	815.55
732.415	864.09
732.813	839.82
733.212	898.07
733.61	990.31
734.008	1109.24
734.406	1106.81
734.803	1196.62
735.201	1257.3
735.599	1334.97
735.997	1356.82
736.395	1383.52
736.792	1531.58
737.19	1703.91
737.587	1633.52
737.985	1822.84
738.382	1866.53
738.78	1902.94
739.177	1878.67
739.574	2065.57
739.971	2223.34
740.369	2271.88
740.766	2395.67
741.163	2609.26
741.56	2713.63
741.957	2648.1
742.354	2589.85
742.751	2784.02
743.147	3065.58
743.544	3143.25
743.941	3216.07
744.338	3599.57
744.734	3483.06
745.131	3594.72
745.527	3895.69
745.924	4128.7
746.32	4364.15
746.716	4335.02
747.113	4585.02
747.509	4835.03
747.905	5174.84
748.301	5483.1
748.697	5259.79
749.093	5861.74
749.489	6080.19
749.885	6126.31
750.281	6468.55
750.677	6941.86
751.073	7521.96
751.468	7560.8
751.864	7551.09
752.26	7917.6
752.655	8403.04
753.051	8762.27
753.446	8687.03
753.842	9364.22
754.237	10080.25
754.632	9893.36
755.028	9837.53
755.423	10136.08
755.818	10888.52
756.213	11026.87
756.608	10725.9
757.003	10849.68
757.398	11582.7
757.793	11441.93
758.188	11250.17
758.583	11585.13
758.977	12456.5
759.372	13165.25
759.767	12956.51
760.161	13473.51
760.556	14888.58
760.95	15575.49
761.345	15602.18
761.739	15830.34
762.133	17109.49
762.527	18670.19
762.922	18318.25
763.316	18094.94
763.71	19022.14
764.104	20209.05
764.498	20403.23
764.892	19973.61
765.286	20927.51
765.68	22194.52
766.073	22158.11
766.467	21675.09
766.861	22696.96
767.255	24182.42
767.648	25578.07
768.042	24463.97
768.435	24102.32
768.829	25798.94
769.222	27194.6
769.615	26366.92
770.008	25456.71
770.402	26524.68
770.795	27784.41
771.188	28216.46
771.581	26959.16
771.974	26189.73
772.367	27464.02
772.76	28320.83
773.153	26803.82
773.545	26005.26
773.938	27748
774.331	29051.42
774.724	28386.36
775.116	27908.2
775.509	30333
775.901	32757.79
776.294	33051.49
776.686	31362.14
777.078	31883.99
777.471	34942.29
777.863	36427.75
778.255	35745.7
778.647	35097.63
779.039	37376.79
779.431	38881.67
779.823	37570.97
780.215	36454.45
780.607	37454.47
780.999	40311.31
781.39	40100.14
781.782	37956.9
782.174	37663.21
782.565	40347.71
782.957	41481.23
783.348	40478.78
783.74	38952.06
784.131	39226.34
784.522	42029.78
784.914	40973.94
785.305	38580.7
785.696	38194.77
786.087	40260.33
786.478	39393.82
786.869	36937.47
787.26	34869.47
787.651	36083.09
788.042	37617.09
788.433	36578.24
788.823	32891.29
789.214	32653.42
789.605	33235.95
789.995	33643.73
790.386	31366.99
790.776	29949.5
791.167	31007.76
791.557	32784.49
791.948	33097.6
792.338	31636.41
792.728	32231.08
793.118	34908.31
793.508	35549.1
793.898	33847.61
794.288	32665.56
794.678	33466.54
795.068	35471.43
795.458	34668.01
795.848	32985.95
796.238	32648.57
796.627	33842.76
797.017	34483.55
797.406	34306.36
797.796	31660.69
798.185	32726.24
798.575	34575.78
798.964	34799.08
799.354	32794.2
799.743	31454.37
800.132	33289.35
800.521	35252.98
800.91	34405.88
801.299	31801.47
801.688	31383.98
802.077	33041.78
802.466	34391.31
802.855	32376.72
803.244	29699.49
803.633	30461.64
804.021	31699.52
804.41	31381.56
804.799	29056.28
805.187	26663.04
805.576	27733.44
805.964	28599.96
806.352	26692.16
806.741	25012.53
807.129	24376.59
807.517	25976.13
807.905	26815.95
808.293	25638.75
808.681	24427.56
809.069	24646.01
809.457	27257.71
809.845	27269.84
810.233	25997.98
810.621	24740.68
811.009	25738.26
811.396	27459.17
811.784	27216.44
812.171	24864.46
812.559	23983.38
812.946	24730.97
813.334	26109.63
813.721	24684.85
814.108	22381.42
814.496	22048.89
814.883	23716.39
815.27	24881.46
815.657	23277.06
816.044	22490.64
816.431	21842.57
816.818	23648.43
817.205	23561.05
817.592	22417.82
817.979	20536.73
818.365	20568.28
818.752	21429.94
819.139	20798.87
819.525	19187.19
819.912	18378.93
820.298	18592.52
820.685	19478.46
821.071	18446.89
821.457	17158.03
821.843	15626.46
822.23	15784.23
822.616	16313.36
823.002	15259.95
823.388	13864.29
823.774	13463.8
824.16	13400.69
824.546	13767.2
824.931	13184.67
825.317	12009.9
825.703	11534.16
826.089	12082.71
826.474	12978.36
826.86	12201.65
827.245	11369.11
827.631	10781.72
828.016	11361.83
828.401	11597.27
828.787	11274.45
829.172	10165.21
829.557	9733.16
829.942	10170.06
830.327	10191.91
830.712	9873.94
831.097	9014.7
831.482	8696.74
831.867	8927.32
832.252	9342.38
832.636	8638.48
833.021	8034.11
833.406	7827.79
833.79	8254.98
834.175	8308.38
834.559	8160.32
834.944	7373.9
835.328	6903.02
835.713	7116.62
836.097	7155.45
836.481	6842.34
836.865	6325.34
837.249	5883.59
837.633	5927.28
838.017	6097.18
838.401	5835.04
838.785	5242.8
839.169	5031.63
839.553	4924.83
839.937	4975.81
840.32	4854.44
840.704	4298.61
841.087	3956.37
841.471	3805.88
841.854	4162.69
842.238	4085.02
842.621	3594.72
843.004	3449.08
843.388	3354.42
843.771	3618.99
844.154	3747.63
844.537	3366.56
844.92	3189.37
845.303	3201.51
845.686	3310.73
846.069	3121.41
846.452	3184.52
846.834	2796.16
847.217	2781.6
847.6	2767.03
847.982	2890.82
848.365	2815.58
848.748	2517.03
849.13	2325.28
849.512	2359.26
849.895	2611.69
850.277	2470.91
850.659	2330.13
851.041	2189.35
851.423	2148.09
851.806	2279.16
852.188	2327.71
852.57	2118.97
852.951	1895.66
853.333	1871.39
853.715	1961.2
854.097	2140.81
854.479	1951.49
854.86	1703.91
855.242	1640.8
855.623	1597.11
856.005	1684.49
856.386	1754.88
856.768	1436.92
857.149	1412.64
857.53	1347.11
857.911	1419.92
858.292	1519.44
858.674	1230.6
859.055	1053.41
859.436	1155.36
859.817	1114.1
860.197	1172.35
860.578	1050.99
860.959	876.23
861.34	990.31
861.72	1067.98
862.101	1063.12
862.482	970.89
862.862	893.22
863.243	881.08
863.623	873.8
864.003	888.36
864.384	878.65
864.764	803.41
865.144	781.57
865.524	660.2
865.904	718.46
866.284	745.16
866.664	711.18
867.044	633.51
867.424	643.21
867.804	628.65
868.183	655.35
868.563	635.93
868.943	609.23
869.322	626.22
869.702	524.28
870.081	475.74
870.461	618.94
870.84	577.68
871.22	422.34
871.599	475.74
871.978	483.02
872.357	461.17
872.736	456.32
873.115	432.05
873.494	415.06
873.873	410.2
874.252	402.92
874.631	446.61
875.01	439.33
875.388	359.23
875.767	327.67
876.146	378.65
876.524	456.32
876.903	342.24
877.281	349.52
877.66	310.68
878.038	266.99
878.416	279.13
878.794	257.29
879.173	252.43
879.551	327.67
879.929	252.43
880.307	298.55
880.685	274.28
881.063	254.86
881.441	250
881.818	245.15
882.196	223.3
882.574	225.73
882.951	228.16
883.329	228.16
883.707	225.73
884.084	259.71
884.461	201.46
884.839	182.04
885.216	174.76
885.593	223.3
885.971	308.26
886.348	220.88
886.725	203.89
887.102	196.61
887.479	257.29
887.856	203.89
888.233	179.61
888.609	169.91
888.986	225.73
889.363	254.86
889.74	264.57
890.116	262.14
890.493	101.94
890.869	174.76
891.246	235.44
891.622	199.03
891.998	177.19
892.375	157.77
892.751	218.45
893.127	211.17
893.503	179.61
893.879	247.58
894.255	228.16
894.631	169.91
895.007	148.06
895.383	216.02
895.759	216.02
896.134	186.9
896.51	184.47
896.886	242.72
897.261	165.05
897.637	199.03
898.012	155.34
898.388	174.76
898.763	157.77
899.138	196.61
899.514	157.77
899.889	167.48
900.264	172.33
900.639	172.33
901.014	167.48
901.389	177.19
901.764	106.8
902.139	140.78
902.513	150.49
902.888	218.45
903.263	121.36
903.638	189.32
904.012	237.87
904.387	162.62
904.761	101.94
905.136	174.76
905.51	172.33
905.884	160.2
906.259	213.6
906.633	135.92
907.007	128.64
907.381	140.78
907.755	118.93
908.129	121.36
908.503	126.22
908.877	172.33
909.251	182.04
909.624	174.76
909.998	116.51
910.372	152.91
910.745	123.79
911.119	206.31
911.492	133.5
911.866	135.92
912.239	184.47
912.612	177.19
912.986	145.63
913.359	230.59
913.732	143.21
914.105	177.19
914.478	177.19
914.851	155.34
915.224	145.63
915.597	138.35
915.97	138.35
916.343	201.46
916.715	162.62
917.088	179.61
917.461	167.48
917.833	182.04
918.206	169.91
918.578	143.21
918.951	82.53
919.323	213.6
919.695	211.17
920.067	138.35
920.44	114.08
920.812	145.63
921.184	106.8
921.556	145.63
921.928	172.33
922.3	167.48
922.672	123.79
923.043	101.94
923.415	67.96
923.787	109.23
924.158	101.94
924.53	123.79
924.901	150.49
925.273	169.91
925.644	138.35
926.016	133.5
926.387	208.74
926.758	150.49
927.129	126.22
927.5	114.08
927.872	75.24
928.243	94.66
928.613	155.34
928.984	152.91
929.355	148.06
929.726	111.65
930.097	160.2
930.467	128.64
930.838	128.64
931.209	72.82
931.579	148.06
931.95	167.48
932.32	143.21
932.69	94.66
933.061	203.89
933.431	162.62
933.801	101.94
934.171	116.51
934.541	169.91
934.911	162.62
935.281	84.95
935.651	165.05
936.021	148.06
936.391	106.8
936.761	179.61
937.13	60.68
937.5	140.78
937.87	87.38
938.239	128.64
938.609	242.72
938.978	84.95
939.347	94.66
939.717	152.91
940.086	160.2
940.455	123.79
940.824	155.34
941.193	199.03
941.562	128.64
941.931	162.62
942.3	213.6
942.669	60.68
943.038	140.78
943.407	116.51
943.775	140.78
944.144	148.06
944.513	157.77
944.881	150.49
945.25	111.65
945.618	123.79
945.986	152.91
946.355	138.35
946.723	114.08
947.091	114.08
947.459	160.2
947.827	58.25
948.195	152.91
948.563	167.48
948.931	140.78
949.299	138.35
949.667	228.16
950.035	101.94
950.402	80.1
950.77	111.65
951.138	143.21
951.505	152.91
951.873	70.39
952.24	206.31
952.607	58.25
952.975	213.6
953.342	104.37
953.709	194.18
954.076	152.91
954.443	126.22
954.81	160.2
955.177	201.46
955.544	155.34
955.911	152.91
956.278	160.2
956.645	148.06
957.012	196.61
957.378	80.1
957.745	114.08
958.111	143.21
958.478	121.36
958.844	206.31
959.211	114.08
959.577	162.62
959.943	72.82
960.309	184.47
960.675	138.35
961.042	104.37
961.408	169.91
961.774	162.62
962.139	121.36
962.505	165.05
962.871	162.62
963.237	160.2
963.603	148.06
963.968	128.64
964.334	162.62
964.699	148.06
965.065	148.06
965.43	201.46
965.796	148.06
966.161	131.07
966.526	97.09
966.891	174.76
967.256	138.35
967.622	50.97
967.987	148.06
968.352	201.46
968.716	82.53
969.081	121.36
969.446	121.36
969.811	121.36
970.176	157.77
970.54	201.46
970.905	189.32
971.269	101.94
971.634	140.78
971.998	123.79
972.363	160.2
972.727	174.76
973.091	150.49
973.455	203.89
973.819	179.61
974.183	101.94
974.547	121.36
974.911	157.77
975.275	135.92
975.639	101.94
976.003	126.22
976.367	174.76
976.73	189.32
977.094	126.22
977.458	131.07
977.821	174.76
978.185	162.62
978.548	148.06
978.911	177.19
979.275	94.66
979.638	92.23
980.001	138.35
980.364	191.75
980.727	131.07
981.09	167.48
981.453	150.49
981.816	114.08
982.179	189.32
982.542	194.18
982.905	189.32
983.267	152.91
983.63	140.78
983.992	160.2
984.355	220.88
984.717	162.62
985.08	160.2
985.442	118.93
985.804	160.2
986.167	126.22
986.529	196.61
986.891	155.34
987.253	118.93
987.615	179.61
987.977	109.23
988.339	97.09
988.701	92.23
989.062	58.25
989.424	118.93
989.786	94.66
990.147	165.05
990.509	126.22
990.87	177.19
991.232	165.05
991.593	177.19
991.955	143.21
992.316	196.61
992.677	133.5
993.038	131.07
993.399	143.21
993.76	109.23
994.121	104.37
994.482	118.93
994.843	138.35
995.204	157.77
995.565	114.08
995.926	133.5
996.286	208.74
996.647	213.6
997.007	50.97
997.368	60.68
997.728	167.48
998.089	152.91
998.449	140.78
998.809	199.03
999.169	140.78
999.53	148.06
999.89	80.1
1000.25	118.93
1000.61	157.77
1000.97	145.63
1001.329	104.37
1001.689	152.91
1002.049	121.36
1002.409	145.63
1002.768	162.62
1003.128	169.91
1003.487	165.05
1003.847	77.67
1004.206	140.78
1004.566	116.51
1004.925	89.81
1005.284	167.48
1005.643	148.06
1006.003	133.5
1006.362	174.76
1006.721	145.63
1007.08	135.92
1007.438	143.21
1007.797	106.8
1008.156	118.93
1008.515	75.24
1008.874	111.65
1009.232	148.06
1009.591	157.77
1009.949	140.78
1010.308	152.91
1010.666	104.37
1011.024	118.93
1011.383	106.8
1011.741	152.91
1012.099	114.08
1012.457	89.81
1012.815	148.06
1013.173	126.22
1013.531	220.88
1013.889	123.79
1014.247	121.36
1014.605	99.52
1014.962	167.48
1015.32	157.77
1015.678	135.92
1016.035	148.06
1016.393	133.5
1016.75	97.09
1017.107	55.83
1017.465	106.8
1017.822	152.91
1018.179	179.61
1018.536	123.79
1018.894	167.48
1019.251	162.62
1019.608	157.77
1019.964	111.65
1020.321	228.16
1020.678	233.01
1021.035	196.61
1021.392	179.61
1021.748	177.19
1022.105	189.32
1022.461	194.18
1022.818	133.5
1023.174	131.07
1023.531	133.5
1023.887	189.32
1024.243	145.63
1024.599	140.78
1024.955	116.51
1025.311	123.79
1025.667	101.94
1026.023	118.93
1026.379	138.35
1026.735	162.62
1027.091	138.35
1027.447	133.5
