189.514	114.23
189.973	114.23
190.431	114.23
190.889	31.71
191.348	-48.39
191.806	34.13
192.264	22
192.722	-41.11
193.18	9.86
193.638	-36.26
194.096	26.85
194.554	-33.83
195.012	36.56
195.47	-72.66
195.928	-41.11
196.385	0.15
196.843	41.41
197.301	51.12
197.758	43.84
198.216	-75.09
198.674	34.13
199.131	34.13
199.589	99.67
200.046	131.22
200.503	104.52
200.961	82.68
201.418	75.4
201.875	131.22
202.332	155.49
202.79	131.22
203.247	94.81
203.704	143.36
204.161	160.35
204.618	136.08
205.075	182.19
205.532	82.68
205.989	99.67
206.445	99.67
206.902	172.48
207.359	157.92
207.816	189.48
208.272	80.25
208.729	102.1
209.185	196.76
209.642	131.22
210.098	167.63
210.555	194.33
211.011	174.91
211.467	216.17
211.924	150.64
212.38	131.22
212.836	128.79
213.292	245.3
213.748	184.62
214.204	89.96
214.66	94.81
215.116	233.17
215.572	184.62
216.028	242.87
216.484	221.03
216.94	174.91
217.396	162.78
217.851	189.48
218.307	133.65
218.763	128.79
219.218	257.44
219.674	179.77
220.129	187.05
220.585	87.53
221.04	143.36
221.496	148.21
221.951	70.54
222.406	187.05
222.861	165.2
223.317	165.2
223.772	223.46
224.227	165.2
224.682	153.07
225.137	204.04
225.592	68.11
226.047	119.09
226.502	114.23
226.957	182.19
227.411	208.89
227.866	102.1
228.321	104.52
228.776	177.34
229.23	102.1
229.685	123.94
230.139	121.51
230.594	225.88
231.048	225.88
231.503	189.48
231.957	194.33
232.411	162.78
232.865	150.64
233.32	204.04
233.774	116.66
234.228	116.66
234.682	109.38
235.136	179.77
235.59	184.62
236.044	165.2
236.498	121.51
236.952	143.36
237.406	116.66
237.86	216.17
238.313	160.35
238.767	114.23
239.221	138.5
239.674	99.67
240.128	104.52
240.581	119.09
241.035	170.06
241.488	114.23
241.942	104.52
242.395	194.33
242.848	143.36
243.301	136.08
243.755	208.89
244.208	196.76
244.661	199.18
245.114	160.35
245.567	208.89
246.02	153.07
246.473	165.2
246.926	143.36
247.379	131.22
247.832	194.33
248.284	160.35
248.737	194.33
249.19	155.49
249.642	189.48
250.095	119.09
250.547	109.38
251	111.8
251.452	196.76
251.905	114.23
252.357	187.05
252.81	131.22
253.262	184.62
253.714	148.21
254.166	140.93
254.618	196.76
255.07	138.5
255.523	206.47
255.975	104.52
256.427	201.61
256.878	194.33
257.33	174.91
257.782	133.65
258.234	126.37
258.686	199.18
259.137	133.65
259.589	177.34
260.041	136.08
260.492	150.64
260.944	150.64
261.395	104.52
261.847	196.76
262.298	255.01
262.749	174.91
263.201	174.91
263.652	165.2
264.103	174.91
264.554	143.36
265.005	218.6
265.457	165.2
265.908	85.1
266.359	170.06
266.809	242.87
267.26	199.18
267.711	184.62
268.162	184.62
268.613	153.07
269.064	204.04
269.514	116.66
269.965	131.22
270.415	167.63
270.866	143.36
271.316	143.36
271.767	196.76
272.217	133.65
272.668	216.17
273.118	199.18
273.568	170.06
274.019	114.23
274.469	201.61
274.919	116.66
275.369	174.91
275.819	138.5
276.269	194.33
276.719	155.49
277.169	204.04
277.619	228.31
278.069	153.07
278.518	199.18
278.968	160.35
279.418	138.5
279.867	196.76
280.317	223.46
280.767	148.21
281.216	182.19
281.666	160.35
282.115	157.92
282.564	150.64
283.014	216.17
283.463	148.21
283.912	160.35
284.361	87.53
284.811	123.94
285.26	143.36
285.709	123.94
286.158	177.34
286.607	106.95
287.056	201.61
287.505	102.1
287.953	157.92
288.402	184.62
288.851	199.18
289.3	114.23
289.748	126.37
290.197	143.36
290.646	136.08
291.094	191.9
291.543	155.49
291.991	148.21
292.439	199.18
292.888	121.51
293.336	194.33
293.784	72.97
294.233	160.35
294.681	199.18
295.129	126.37
295.577	189.48
296.025	165.2
296.473	87.53
296.921	150.64
297.369	165.2
297.817	201.61
298.264	138.5
298.712	155.49
299.16	126.37
299.608	97.24
300.055	97.24
300.503	126.37
300.95	199.18
301.398	136.08
301.845	157.92
302.293	191.9
302.74	187.05
303.187	148.21
303.635	162.78
304.082	80.25
304.529	174.91
304.976	189.48
305.423	167.63
305.87	189.48
306.317	179.77
306.764	133.65
307.211	172.48
307.658	160.35
308.105	133.65
308.552	116.66
308.998	138.5
309.445	153.07
309.892	138.5
310.338	225.88
310.785	114.23
311.231	145.79
311.678	225.88
312.124	167.63
312.571	172.48
313.017	143.36
313.463	143.36
313.909	109.38
314.356	157.92
314.802	109.38
315.248	189.48
315.694	174.91
316.14	165.2
316.586	94.81
317.032	167.63
317.478	194.33
317.923	160.35
318.369	177.34
318.815	162.78
319.261	85.1
319.706	121.51
320.152	123.94
320.597	174.91
321.043	189.48
321.488	162.78
321.934	218.6
322.379	119.09
322.824	179.77
323.27	157.92
323.715	121.51
324.16	140.93
324.605	126.37
325.05	218.6
325.495	182.19
325.94	240.45
326.385	153.07
326.83	97.24
327.275	189.48
327.72	165.2
328.165	140.93
328.61	136.08
329.054	157.92
329.499	128.79
329.943	162.78
330.388	199.18
330.832	204.04
331.277	245.3
331.721	89.96
332.166	102.1
332.61	196.76
333.054	179.77
333.499	106.95
333.943	187.05
334.387	92.39
334.831	206.47
335.275	150.64
335.719	213.75
336.163	102.1
336.607	174.91
337.051	170.06
337.495	128.79
337.938	150.64
338.382	199.18
338.826	150.64
339.269	189.48
339.713	157.92
340.157	213.75
340.6	162.78
341.044	87.53
341.487	191.9
341.93	191.9
342.374	126.37
342.817	121.51
343.26	177.34
343.703	165.2
344.146	157.92
344.59	116.66
345.033	155.49
345.476	126.37
345.919	143.36
346.361	143.36
346.804	140.93
347.247	160.35
347.69	170.06
348.133	155.49
348.575	204.04
349.018	94.81
349.461	119.09
349.903	194.33
350.346	121.51
350.788	157.92
351.23	136.08
351.673	167.63
352.115	238.02
352.557	111.8
353	187.05
353.442	177.34
353.884	116.66
354.326	179.77
354.768	121.51
355.21	179.77
355.652	150.64
356.094	114.23
356.536	221.03
356.978	189.48
357.419	126.37
357.861	157.92
358.303	189.48
358.744	196.76
359.186	165.2
359.627	145.79
360.069	165.2
360.51	145.79
360.952	160.35
361.393	182.19
361.834	119.09
362.276	187.05
362.717	174.91
363.158	123.94
363.599	165.2
364.04	106.95
364.481	160.35
364.922	230.74
365.363	150.64
365.804	272
366.245	116.66
366.686	179.77
367.126	143.36
367.567	194.33
368.008	184.62
368.448	184.62
368.889	157.92
369.33	167.63
369.77	160.35
370.21	172.48
370.651	242.87
371.091	97.24
371.531	230.74
371.972	155.49
372.412	208.89
372.852	150.64
373.292	153.07
373.732	89.96
374.172	172.48
374.612	114.23
375.052	208.89
375.492	225.88
375.932	138.5
376.372	143.36
376.811	191.9
377.251	145.79
377.691	143.36
378.13	172.48
378.57	133.65
379.009	165.2
379.449	109.38
379.888	235.59
380.328	194.33
380.767	165.2
381.206	121.51
381.645	187.05
382.085	167.63
382.524	162.78
382.963	228.31
383.402	172.48
383.841	194.33
384.28	136.08
384.719	136.08
385.158	94.81
385.596	114.23
386.035	162.78
386.474	128.79
386.913	138.5
387.351	189.48
387.79	228.31
388.228	213.75
388.667	167.63
389.105	184.62
389.544	136.08
389.982	162.78
390.42	165.2
390.859	172.48
391.297	133.65
391.735	208.89
392.173	184.62
392.611	133.65
393.049	250.16
393.487	128.79
393.925	72.97
394.363	177.34
394.801	213.75
395.239	208.89
395.676	131.22
396.114	191.9
396.552	150.64
396.989	213.75
397.427	153.07
397.864	238.02
398.302	177.34
398.739	87.53
399.177	138.5
399.614	109.38
400.051	99.67
400.488	140.93
400.926	196.76
401.363	111.8
401.8	104.52
402.237	162.78
402.674	133.65
403.111	138.5
403.548	131.22
403.985	155.49
404.421	172.48
404.858	228.31
405.295	172.48
405.732	189.48
406.168	82.68
406.605	131.22
407.041	94.81
407.478	160.35
407.914	153.07
408.351	213.75
408.787	208.89
409.223	155.49
409.66	97.24
410.096	167.63
410.532	128.79
410.968	121.51
411.404	97.24
411.84	131.22
412.276	174.91
412.712	150.64
413.148	114.23
413.584	160.35
414.02	191.9
414.455	172.48
414.891	187.05
415.327	82.68
415.762	128.79
416.198	172.48
416.633	150.64
417.069	194.33
417.504	184.62
417.94	140.93
418.375	167.63
418.81	138.5
419.245	189.48
419.681	153.07
420.116	162.78
420.551	177.34
420.986	140.93
421.421	155.49
421.856	184.62
422.291	174.91
422.726	170.06
423.16	259.86
423.595	204.04
424.03	153.07
424.464	150.64
424.899	138.5
425.334	187.05
425.768	116.66
426.203	157.92
426.637	140.93
427.071	133.65
427.506	177.34
427.94	208.89
428.374	206.47
428.809	143.36
429.243	99.67
429.677	196.76
430.111	191.9
430.545	140.93
430.979	68.11
431.413	119.09
431.847	162.78
432.28	228.31
432.714	126.37
433.148	165.2
433.582	174.91
434.015	131.22
434.449	179.77
434.882	123.94
435.316	121.51
435.749	182.19
436.183	165.2
436.616	216.17
437.049	126.37
437.483	170.06
437.916	162.78
438.349	160.35
438.782	184.62
439.215	191.9
439.648	128.79
440.081	191.9
440.514	225.88
440.947	174.91
441.38	191.9
441.813	170.06
442.245	245.3
442.678	140.93
443.111	174.91
443.543	255.01
443.976	138.5
444.408	160.35
444.841	194.33
445.273	182.19
445.705	199.18
446.138	208.89
446.57	150.64
447.002	131.22
447.434	194.33
447.867	199.18
448.299	194.33
448.731	240.45
449.163	201.61
449.595	174.91
450.026	196.76
450.458	170.06
450.89	196.76
451.322	228.31
451.754	230.74
452.185	223.46
452.617	245.3
453.048	204.04
453.48	238.02
453.911	293.85
454.343	257.44
454.774	281.71
455.205	218.6
455.637	131.22
456.068	223.46
456.499	213.75
456.93	216.17
457.361	211.32
457.792	257.44
458.223	167.63
458.654	259.86
459.085	252.58
459.516	223.46
459.947	255.01
460.378	242.87
460.808	230.74
461.239	233.17
461.669	191.9
462.1	240.45
462.531	170.06
462.961	128.79
463.391	223.46
463.822	204.04
464.252	230.74
464.682	218.6
465.113	216.17
465.543	201.61
465.973	242.87
466.403	189.48
466.833	238.02
467.263	235.59
467.693	157.92
468.123	194.33
468.553	189.48
468.983	245.3
469.412	223.46
469.842	233.17
470.272	318.12
470.701	225.88
471.131	179.77
471.56	145.79
471.99	204.04
472.419	136.08
472.849	194.33
473.278	126.37
473.707	174.91
474.136	223.46
474.566	167.63
474.995	182.19
475.424	252.58
475.853	206.47
476.282	119.09
476.711	194.33
477.14	196.76
477.569	182.19
477.997	167.63
478.426	174.91
478.855	131.22
479.283	233.17
479.712	199.18
480.141	221.03
480.569	157.92
480.998	225.88
481.426	259.86
481.854	201.61
482.283	179.77
482.711	196.76
483.139	199.18
483.567	123.94
483.995	136.08
484.424	179.77
484.852	223.46
485.28	218.6
485.708	247.73
486.135	218.6
486.563	182.19
486.991	167.63
487.419	223.46
487.847	182.19
488.274	119.09
488.702	240.45
489.129	238.02
489.557	172.48
489.984	211.32
490.412	196.76
490.839	170.06
491.266	153.07
491.694	182.19
492.121	206.47
492.548	179.77
492.975	160.35
493.402	221.03
493.829	187.05
494.256	143.36
494.683	123.94
495.11	191.9
495.537	167.63
495.964	148.21
496.39	133.65
496.817	153.07
497.244	177.34
497.67	162.78
498.097	121.51
498.523	196.76
498.95	174.91
499.376	165.2
499.803	128.79
500.229	150.64
500.655	150.64
501.081	199.18
501.508	199.18
501.934	208.89
502.36	187.05
502.786	228.31
503.212	155.49
503.638	179.77
504.064	216.17
504.489	184.62
504.915	85.1
505.341	167.63
505.767	196.76
506.192	102.1
506.618	196.76
507.043	179.77
507.469	170.06
507.894	145.79
508.32	133.65
508.745	182.19
509.17	182.19
509.596	252.58
510.021	201.61
510.446	138.5
510.871	174.91
511.296	194.33
511.721	145.79
512.146	184.62
512.571	140.93
512.996	218.6
513.421	189.48
513.845	182.19
514.27	191.9
514.695	177.34
515.119	201.61
515.544	133.65
515.969	194.33
516.393	167.63
516.817	235.59
517.242	235.59
517.666	223.46
518.09	150.64
518.515	136.08
518.939	184.62
519.363	347.24
519.787	225.88
520.211	194.33
520.635	148.21
521.059	153.07
521.483	172.48
521.907	235.59
522.331	189.48
522.754	126.37
523.178	165.2
523.602	179.77
524.025	172.48
524.449	208.89
524.872	208.89
525.296	179.77
525.719	206.47
526.143	155.49
526.566	174.91
526.989	162.78
527.412	150.64
527.836	191.9
528.259	187.05
528.682	128.79
529.105	162.78
529.528	177.34
529.951	116.66
530.374	196.76
530.796	208.89
531.219	221.03
531.642	228.31
532.065	204.04
532.487	208.89
532.91	189.48
533.332	191.9
533.755	170.06
534.177	155.49
534.6	162.78
535.022	221.03
535.444	131.22
535.867	177.34
536.289	206.47
536.711	162.78
537.133	133.65
537.555	148.21
537.977	140.93
538.399	189.48
538.821	225.88
539.243	170.06
539.665	184.62
540.086	245.3
540.508	194.33
540.93	199.18
541.351	157.92
541.773	160.35
542.195	162.78
542.616	218.6
543.037	160.35
543.459	133.65
543.88	182.19
544.301	179.77
544.723	170.06
545.144	194.33
545.565	211.32
545.986	252.58
546.407	165.2
546.828	153.07
547.249	216.17
547.67	138.5
548.091	128.79
548.512	187.05
548.932	201.61
549.353	206.47
549.774	255.01
550.194	206.47
550.615	216.17
551.035	230.74
551.456	157.92
551.876	174.91
552.296	157.92
552.717	184.62
553.137	143.36
553.557	182.19
553.977	167.63
554.397	204.04
554.817	189.48
555.237	218.6
555.657	150.64
556.077	153.07
556.497	174.91
556.917	182.19
557.337	199.18
557.756	252.58
558.176	167.63
558.596	114.23
559.015	172.48
559.435	123.94
559.854	114.23
560.274	189.48
560.693	238.02
561.112	211.32
561.532	233.17
561.951	172.48
562.37	223.46
562.789	170.06
563.208	128.79
563.627	230.74
564.046	177.34
564.465	216.17
564.884	208.89
565.303	138.5
565.722	199.18
566.14	196.76
566.559	170.06
566.978	216.17
567.396	218.6
567.815	194.33
568.233	138.5
568.652	184.62
569.07	199.18
569.489	177.34
569.907	172.48
570.325	153.07
570.743	162.78
571.161	140.93
571.58	194.33
571.998	233.17
572.416	233.17
572.833	155.49
573.251	194.33
573.669	223.46
574.087	206.47
574.505	182.19
574.922	162.78
575.34	155.49
575.758	153.07
576.175	191.9
576.593	174.91
577.01	213.75
577.428	189.48
577.845	1592.41
578.262	259.86
578.68	216.17
579.097	208.89
579.514	245.3
579.931	170.06
580.348	177.34
580.765	213.75
581.182	102.1
581.599	194.33
582.016	199.18
582.433	245.3
582.849	233.17
583.266	225.88
583.683	257.44
584.099	179.77
584.516	216.17
584.933	155.49
585.349	211.32
585.765	187.05
586.182	250.16
586.598	167.63
587.014	211.32
587.431	167.63
587.847	155.49
588.263	182.19
588.679	126.37
589.095	116.66
589.511	194.33
589.927	155.49
590.343	174.91
590.759	211.32
591.174	143.36
591.59	116.66
592.006	106.95
592.421	121.51
592.837	162.78
593.252	194.33
593.668	128.79
594.083	160.35
594.499	123.94
594.914	153.07
595.329	167.63
595.745	153.07
596.16	191.9
596.575	170.06
596.99	218.6
597.405	133.65
597.82	150.64
598.235	167.63
598.65	172.48
599.065	225.88
599.479	206.47
599.894	63.26
600.309	123.94
600.724	206.47
601.138	216.17
601.553	150.64
601.967	189.48
602.382	194.33
602.796	106.95
603.21	201.61
603.625	167.63
604.039	155.49
604.453	140.93
604.867	213.75
605.281	245.3
605.695	216.17
606.109	242.87
606.523	138.5
606.937	177.34
607.351	291.42
607.765	225.88
608.178	196.76
608.592	167.63
609.006	140.93
609.419	242.87
609.833	206.47
610.246	179.77
610.66	174.91
611.073	221.03
611.487	233.17
611.9	196.76
612.313	191.9
612.726	194.33
613.139	189.48
613.553	179.77
613.966	204.04
614.379	225.88
614.792	179.77
615.204	165.2
615.617	213.75
616.03	201.61
616.443	288.99
616.856	223.46
617.268	157.92
617.681	206.47
618.093	189.48
618.506	106.95
618.918	145.79
619.331	194.33
619.743	201.61
620.155	121.51
620.568	194.33
620.98	116.66
621.392	204.04
621.804	235.59
622.216	140.93
622.628	155.49
623.04	165.2
623.452	138.5
623.864	34.13
624.276	172.48
624.687	184.62
625.099	213.75
625.511	162.78
625.922	138.5
626.334	150.64
626.745	170.06
627.157	172.48
627.568	177.34
627.979	128.79
628.391	148.21
628.802	119.09
629.213	157.92
629.624	211.32
630.035	153.07
630.446	143.36
630.857	126.37
631.268	189.48
631.679	211.32
632.09	133.65
632.501	201.61
632.912	233.17
633.322	213.75
633.733	179.77
634.144	126.37
634.554	153.07
634.965	201.61
635.375	213.75
635.785	196.76
636.196	230.74
636.606	148.21
637.016	199.18
637.427	182.19
637.837	153.07
638.247	250.16
638.657	133.65
639.067	201.61
639.477	136.08
639.887	189.48
640.297	191.9
640.706	114.23
641.116	138.5
641.526	199.18
641.935	126.37
642.345	123.94
642.755	143.36
643.164	187.05
643.573	148.21
643.983	206.47
644.392	153.07
644.801	162.78
645.211	201.61
645.62	92.39
646.029	194.33
646.438	196.76
646.847	182.19
647.256	194.33
647.665	221.03
648.074	143.36
648.483	160.35
648.892	196.76
649.3	138.5
649.709	150.64
650.118	140.93
650.526	160.35
650.935	182.19
651.343	216.17
651.752	140.93
652.16	160.35
652.568	216.17
652.977	160.35
653.385	182.19
653.793	104.52
654.201	157.92
654.609	102.1
655.017	187.05
655.425	126.37
655.833	182.19
656.241	123.94
656.649	106.95
657.057	187.05
657.464	187.05
657.872	167.63
658.28	155.49
658.687	150.64
659.095	162.78
659.502	153.07
659.91	157.92
660.317	167.63
660.724	121.51
661.132	194.33
661.539	109.38
661.946	230.74
662.353	165.2
662.76	160.35
663.167	206.47
663.574	143.36
663.981	145.79
664.388	194.33
664.795	153.07
665.202	276.86
665.608	140.93
666.015	162.78
666.422	162.78
666.828	148.21
667.235	240.45
667.641	140.93
668.047	114.23
668.454	174.91
668.86	145.79
669.266	191.9
669.673	70.54
670.079	182.19
670.485	191.9
670.891	252.58
671.297	150.64
671.703	172.48
672.109	131.22
672.515	106.95
672.92	177.34
673.326	187.05
673.732	223.46
674.138	182.19
674.543	172.48
674.949	228.31
675.354	172.48
675.76	242.87
676.165	170.06
676.57	128.79
676.976	225.88
677.381	157.92
677.786	213.75
678.191	155.49
678.596	126.37
679.001	170.06
679.406	211.32
679.811	174.91
680.216	179.77
680.621	218.6
681.026	155.49
681.43	208.89
681.835	114.23
682.24	148.21
682.644	167.63
683.049	157.92
683.453	133.65
683.858	160.35
684.262	179.77
684.667	184.62
685.071	187.05
685.475	201.61
685.879	187.05
686.283	143.36
686.687	133.65
687.091	143.36
687.495	55.98
687.899	160.35
688.303	240.45
688.707	184.62
689.111	102.1
689.514	138.5
689.918	140.93
690.322	157.92
690.725	143.36
691.129	191.9
691.532	211.32
691.936	199.18
692.339	189.48
692.742	179.77
693.146	143.36
693.549	206.47
693.952	148.21
694.355	172.48
694.758	106.95
695.161	187.05
695.564	165.2
695.967	262.29
696.37	191.9
696.773	177.34
697.175	187.05
697.578	218.6
697.981	204.04
698.383	155.49
698.786	216.17
699.188	128.79
699.591	182.19
699.993	189.48
700.395	136.08
700.798	167.63
701.2	233.17
701.602	179.77
702.004	191.9
702.406	131.22
702.808	162.78
703.21	211.32
703.612	204.04
704.014	238.02
704.416	216.17
704.818	174.91
705.219	228.31
705.621	213.75
706.023	133.65
706.424	109.38
706.826	218.6
707.227	252.58
707.629	213.75
708.03	160.35
708.431	179.77
708.832	218.6
709.234	201.61
709.635	201.61
710.036	177.34
710.437	223.46
710.838	172.48
711.239	201.61
711.64	174.91
712.041	179.77
712.441	218.6
712.842	272
713.243	213.75
713.643	223.46
714.044	206.47
714.445	233.17
714.845	223.46
715.246	213.75
715.646	187.05
716.046	128.79
716.447	206.47
716.847	284.14
717.247	318.12
717.647	211.32
718.047	184.62
718.447	242.87
718.847	262.29
719.247	211.32
719.647	228.31
720.047	257.44
720.446	274.43
720.846	213.75
721.246	310.84
721.645	291.42
722.045	213.75
722.444	325.4
722.844	267.15
723.243	269.57
723.643	235.59
724.042	293.85
724.441	245.3
724.84	303.55
725.24	274.43
725.639	376.37
726.038	361.81
726.437	342.39
726.836	284.14
727.234	264.72
727.633	371.52
728.032	352.1
728.431	354.53
728.83	349.67
729.228	439.48
729.627	441.91
730.025	485.6
730.424	403.07
730.822	585.11
731.22	514.72
731.619	572.98
732.017	655.5
732.415	701.62
732.813	696.76
733.212	752.59
733.61	793.85
734.008	932.21
734.406	1007.45
734.803	1019.59
735.201	1070.56
735.599	1233.18
735.997	1262.31
736.395	1286.58
736.792	1463.77
737.19	1551.15
737.587	1660.37
737.985	1755.03
738.382	1769.6
738.78	1825.42
739.177	1917.66
739.574	2051.15
739.971	2153.1
740.369	2298.73
740.766	2420.09
741.163	2451.65
741.56	2502.62
741.957	2861.85
742.354	2813.3
742.751	2866.7
743.147	2995.34
743.544	3046.32
743.941	3133.7
744.338	3531.76
744.734	3718.66
745.131	3864.29
745.527	4177.4
745.924	4422.55
746.32	4757.51
746.716	4772.07
747.113	5056.06
747.509	5502.66
747.905	5675
748.301	5968.69
748.697	6480.84
749.093	6980.84
749.489	6927.44
749.885	7352.21
750.281	7854.64
750.677	8364.36
751.073	8444.46
751.468	8636.21
751.864	9434.76
752.26	9648.36
752.655	9784.28
753.051	10247.88
753.446	10990.61
753.842	10983.33
754.237	10665.37
754.632	11133.82
755.028	11478.49
755.423	11689.65
755.818	11369.26
756.213	12107.14
756.608	11927.52
757.003	11876.55
757.398	11638.68
757.793	11891.11
758.188	12315.88
758.583	12221.22
758.977	12483.36
759.372	13612.01
759.767	14456.69
760.161	14425.13
760.556	15121.75
760.95	16820.8
761.345	17723.73
761.739	17146.05
762.133	18466.46
762.527	20616.98
762.922	21182.52
763.316	20561.15
763.71	21005.33
764.104	22141.27
764.498	23964.12
764.892	23391.29
765.286	23340.32
765.68	25255.4
766.073	26449.59
766.467	25148.6
766.861	25483.56
767.255	28471.47
767.648	30952.09
768.042	30762.77
768.435	29493.33
768.829	30641.41
769.222	32527.36
769.615	33566.21
770.008	31175.39
770.402	30779.76
770.795	33634.17
771.188	34503.12
771.581	31272.48
771.974	29733.62
772.367	31066.17
772.76	33410.87
773.153	31080.73
773.545	29034.58
773.938	29852.56
774.331	31624.43
774.724	31753.07
775.116	30925.39
775.509	32430.27
775.901	35757.99
776.294	38168.22
776.686	37156.07
777.078	36335.67
777.471	37804.14
777.863	42110.03
778.255	44287.25
778.647	42843.05
779.039	41665.85
779.431	43289.66
779.823	46044.56
780.215	45440.18
780.607	41619.73
780.999	42165.86
781.39	44639.2
781.782	47724.2
782.174	46629.52
782.565	44595.51
782.957	44661.04
783.348	48054.3
783.74	49119.85
784.131	46447.48
784.522	44056.66
784.914	43787.24
785.305	45600.38
785.696	45896.5
786.087	44178.02
786.478	40122.14
786.869	38823.57
787.26	40971.66
787.651	41187.69
788.042	38306.57
788.433	34328.36
788.823	32168.13
789.214	33663.3
789.605	33743.4
789.995	31129.28
790.386	27629.22
790.776	28017.58
791.167	30121.98
791.557	32884.16
791.948	32088.03
792.338	29100.12
792.728	29939.94
793.118	33238.53
793.508	35359.93
793.898	34148.74
794.288	32105.02
794.678	31571.03
795.068	33976.41
795.458	36282.27
795.848	35998.28
796.238	32821.05
796.627	29672.94
797.017	31520.06
797.406	35095.36
797.796	35850.22
798.185	34284.67
798.575	31517.63
798.964	31238.5
799.354	34020.1
799.743	37563.84
800.132	37721.61
800.521	34381.75
800.91	32209.39
801.299	32782.22
801.688	35617.21
802.077	37408.5
802.466	37423.06
802.855	34160.88
803.244	31279.76
803.633	31573.46
804.021	33658.44
804.41	34427.87
804.799	32122.01
805.187	28187.48
805.576	26655.91
805.964	28061.27
806.352	29316.14
806.741	28879.24
807.129	25988.42
807.517	23151
807.905	22619.44
808.293	25286.95
808.681	28114.67
809.069	28236.03
809.457	27709.32
809.845	25199.57
810.233	25131.61
810.621	28056.41
811.009	30774.9
811.396	31148.69
811.784	28881.67
812.171	26694.74
812.559	25027.24
812.946	26384.06
813.334	28862.25
813.721	29420.51
814.108	26750.57
814.496	24905.88
814.883	24056.35
815.27	26386.48
815.657	28740.89
816.044	29699.64
816.431	29097.69
816.818	25692.3
817.205	23342.75
817.592	24876.75
817.979	25901.04
818.365	28155.93
818.752	27418.05
819.139	26114.64
819.525	22772.35
819.912	20794.16
820.298	21430.1
820.685	22820.9
821.071	23684.99
821.457	21488.35
821.843	19447.06
822.23	17119.35
822.616	16012.54
823.002	15942.15
823.388	16764.98
823.774	17034.4
824.16	15262.53
824.546	13517.35
824.931	12216.36
825.317	12277.04
825.703	13133.85
826.089	14456.69
826.474	14786.79
826.86	14012.51
827.245	12165.39
827.631	11395.96
828.016	11505.19
828.401	12192.09
828.787	13192.1
829.172	13696.97
829.557	12155.68
829.942	10597.4
830.327	9449.33
830.712	9565.83
831.097	10189.63
831.482	11162.95
831.867	11199.36
832.252	10577.99
832.636	9393.5
833.021	8109.5
833.406	7830.37
833.79	8293.97
834.175	8944.47
834.559	9570.69
834.944	9213.89
835.328	8374.07
835.713	7301.24
836.097	6463.84
836.481	6369.18
836.865	6961.43
837.249	7451.72
837.633	7672.6
838.017	7111.91
838.401	6225.98
838.785	5264.8
839.169	4721.1
839.553	4759.93
839.937	4997.8
840.32	5165.28
840.704	4963.82
841.087	4560.9
841.471	3922.54
841.854	3327.87
842.238	3306.03
842.621	3645.84
843.004	3825.45
843.388	4276.92
843.771	4296.34
844.154	3830.31
844.537	3434.67
844.92	2958.94
845.303	2769.61
845.686	2924.95
846.069	3517.2
846.452	3849.73
846.834	3886.13
847.217	3599.72
847.6	3065.73
847.982	2755.05
848.365	2332.71
848.748	2490.48
849.13	2604.56
849.512	3107
849.895	3274.47
850.277	3102.14
850.659	2762.33
851.041	2454.07
851.423	2131.25
851.806	2121.54
852.188	2325.43
852.57	2718.64
852.951	2820.58
853.333	3051.17
853.715	2665.24
854.097	2252.61
854.479	1997.76
854.86	1653.09
855.242	1672.51
855.623	1932.22
856.005	1961.35
856.386	2085.14
856.768	2179.8
857.149	1973.48
857.53	1536.58
857.911	1449.2
858.292	1109.39
858.674	1235.61
859.055	1230.75
859.436	1378.81
859.817	1500.18
860.197	1451.63
860.578	1342.41
860.959	1104.54
861.34	983.18
861.72	830.26
862.101	847.25
862.482	784.14
862.862	890.94
863.243	1014.73
863.623	968.61
864.003	1022.01
864.384	842.4
864.764	791.43
865.144	684.63
865.524	657.93
865.904	626.38
866.284	643.37
866.664	696.76
867.044	793.85
867.424	679.77
867.804	728.32
868.183	553.56
868.563	572.98
868.943	519.58
869.322	429.77
869.702	517.15
870.081	534.14
870.461	546.28
870.84	679.77
871.22	614.24
871.599	636.08
871.978	548.7
872.357	410.35
872.736	403.07
873.115	349.67
873.494	417.63
873.873	422.49
874.252	366.66
874.631	349.67
875.01	359.38
875.388	361.81
875.767	378.8
876.146	264.72
876.524	274.43
876.903	257.44
877.281	238.02
877.66	242.87
878.038	238.02
878.416	257.44
878.794	216.17
879.173	269.57
879.551	272
879.929	194.33
880.307	315.69
880.685	259.86
881.063	286.56
881.441	223.46
881.818	238.02
882.196	194.33
882.574	182.19
882.951	170.06
883.329	182.19
883.707	196.76
884.084	264.72
884.461	230.74
884.839	240.45
885.216	206.47
885.593	196.76
885.971	225.88
886.348	182.19
886.725	184.62
887.102	211.32
887.479	182.19
887.856	182.19
888.233	153.07
888.609	208.89
888.986	114.23
889.363	196.76
889.74	187.05
890.116	191.9
890.493	174.91
890.869	233.17
891.246	225.88
891.622	201.61
891.998	189.48
892.375	167.63
892.751	162.78
893.127	247.73
893.503	301.13
893.879	150.64
894.255	174.91
894.631	228.31
895.007	206.47
895.383	245.3
895.759	201.61
896.134	136.08
896.51	213.75
896.886	252.58
897.261	155.49
897.637	199.18
898.012	174.91
898.388	136.08
898.763	191.9
899.138	206.47
899.514	148.21
899.889	150.64
900.264	104.52
900.639	225.88
901.014	213.75
901.389	148.21
901.764	153.07
902.139	133.65
902.513	145.79
902.888	172.48
903.263	126.37
903.638	121.51
904.012	131.22
904.387	148.21
904.761	170.06
905.136	177.34
905.51	133.65
905.884	145.79
906.259	145.79
906.633	106.95
907.007	204.04
907.381	211.32
907.755	182.19
908.129	133.65
908.503	72.97
908.877	162.78
909.251	106.95
909.624	170.06
909.998	165.2
910.372	170.06
910.745	104.52
911.119	119.09
911.492	136.08
911.866	150.64
912.239	145.79
912.612	196.76
912.986	133.65
913.359	189.48
913.732	187.05
914.105	70.54
914.478	143.36
914.851	140.93
915.224	126.37
915.597	165.2
915.97	143.36
916.343	119.09
916.715	157.92
917.088	157.92
917.461	111.8
917.833	148.21
918.206	240.45
918.578	155.49
918.951	172.48
919.323	150.64
919.695	189.48
920.067	230.74
920.44	94.81
920.812	143.36
921.184	133.65
921.556	165.2
921.928	174.91
922.3	199.18
922.672	187.05
923.043	170.06
923.415	148.21
923.787	121.51
924.158	170.06
924.53	208.89
924.901	165.2
925.273	121.51
925.644	153.07
926.016	123.94
926.387	206.47
926.758	114.23
927.129	60.83
927.5	157.92
927.872	119.09
928.243	92.39
928.613	92.39
928.984	206.47
929.355	174.91
929.726	119.09
930.097	155.49
930.467	196.76
930.838	187.05
931.209	170.06
931.579	150.64
931.95	143.36
932.32	97.24
932.69	106.95
933.061	140.93
933.431	155.49
933.801	179.77
934.171	194.33
934.541	145.79
934.911	165.2
935.281	204.04
935.651	140.93
936.021	123.94
936.391	138.5
936.761	167.63
937.13	97.24
937.5	213.75
937.87	148.21
938.239	94.81
938.609	150.64
938.978	131.22
939.347	208.89
939.717	172.48
940.086	111.8
940.455	138.5
940.824	143.36
941.193	128.79
941.562	128.79
941.931	143.36
942.3	170.06
942.669	184.62
943.038	128.79
943.407	194.33
943.775	155.49
944.144	208.89
944.513	206.47
944.881	162.78
945.25	150.64
945.618	157.92
945.986	170.06
946.355	184.62
946.723	72.97
947.091	143.36
947.459	123.94
947.827	153.07
948.195	92.39
948.563	119.09
948.931	145.79
949.299	131.22
949.667	82.68
950.035	199.18
950.402	187.05
950.77	208.89
951.138	148.21
951.505	145.79
951.873	184.62
952.24	182.19
952.607	182.19
952.975	235.59
953.342	106.95
953.709	162.78
954.076	106.95
954.443	111.8
954.81	128.79
955.177	182.19
955.544	204.04
955.911	162.78
956.278	157.92
956.645	140.93
957.012	116.66
957.378	170.06
957.745	104.52
958.111	104.52
958.478	189.48
958.844	196.76
959.211	126.37
959.577	116.66
959.943	187.05
960.309	187.05
960.675	140.93
961.042	111.8
961.408	160.35
961.774	155.49
962.139	148.21
962.505	126.37
962.871	153.07
963.237	121.51
963.603	138.5
963.968	150.64
964.334	218.6
964.699	179.77
965.065	138.5
965.43	145.79
965.796	182.19
966.161	165.2
966.526	123.94
966.891	131.22
967.256	165.2
967.622	85.1
967.987	174.91
968.352	184.62
968.716	155.49
969.081	87.53
969.446	70.54
969.811	143.36
970.176	138.5
970.54	194.33
970.905	165.2
971.269	225.88
971.634	167.63
971.998	145.79
972.363	182.19
972.727	177.34
973.091	145.79
973.455	102.1
973.819	140.93
974.183	102.1
974.547	196.76
974.911	155.49
975.275	126.37
975.639	157.92
976.003	155.49
976.367	128.79
976.73	148.21
977.094	216.17
977.458	138.5
977.821	160.35
978.185	194.33
978.548	119.09
978.911	148.21
979.275	179.77
979.638	216.17
980.001	148.21
980.364	80.25
980.727	194.33
981.09	140.93
981.453	145.79
981.816	150.64
982.179	162.78
982.542	116.66
982.905	143.36
983.267	218.6
983.63	97.24
983.992	140.93
984.355	184.62
984.717	114.23
985.08	99.67
985.442	189.48
985.804	187.05
986.167	201.61
986.529	145.79
986.891	92.39
987.253	201.61
987.615	238.02
987.977	187.05
988.339	136.08
988.701	155.49
989.062	177.34
989.424	155.49
989.786	160.35
990.147	145.79
990.509	189.48
990.87	187.05
991.232	191.9
991.593	172.48
991.955	179.77
992.316	167.63
992.677	138.5
993.038	99.67
993.399	170.06
993.76	208.89
994.121	157.92
994.482	92.39
994.843	148.21
995.204	221.03
995.565	94.81
995.926	109.38
996.286	177.34
996.647	116.66
997.007	140.93
997.368	170.06
997.728	85.1
998.089	201.61
998.449	128.79
998.809	128.79
999.169	201.61
999.53	131.22
999.89	201.61
1000.25	191.9
1000.61	97.24
1000.97	204.04
1001.329	143.36
1001.689	184.62
1002.049	157.92
1002.409	177.34
1002.768	157.92
1003.128	187.05
1003.487	155.49
1003.847	155.49
1004.206	162.78
1004.566	143.36
1004.925	153.07
1005.284	218.6
1005.643	172.48
1006.003	111.8
1006.362	148.21
1006.721	160.35
1007.08	140.93
1007.438	123.94
1007.797	109.38
1008.156	145.79
1008.515	160.35
1008.874	55.98
1009.232	150.64
1009.591	177.34
1009.949	72.97
1010.308	114.23
1010.666	170.06
1011.024	160.35
1011.383	145.79
1011.741	189.48
1012.099	196.76
1012.457	225.88
1012.815	104.52
1013.173	72.97
1013.531	148.21
1013.889	133.65
1014.247	172.48
1014.605	179.77
1014.962	194.33
1015.32	123.94
1015.678	165.2
1016.035	121.51
1016.393	179.77
1016.75	157.92
1017.107	133.65
1017.465	167.63
1017.822	119.09
1018.179	119.09
1018.536	170.06
1018.894	150.64
1019.251	145.79
1019.608	128.79
1019.964	94.81
1020.321	179.77
1020.678	138.5
1021.035	177.34
1021.392	138.5
1021.748	155.49
1022.105	189.48
1022.461	114.23
1022.818	177.34
1023.174	160.35
1023.531	109.38
1023.887	116.66
1024.243	131.22
1024.599	191.9
1024.955	189.48
1025.311	211.32
1025.667	114.23
1026.023	165.2
1026.379	128.79
1026.735	177.34
1027.091	148.21
1027.447	160.35
