189.514	115.9
189.973	115.9
190.431	115.9
190.889	-22.45
191.348	18.81
191.806	-34.59
192.264	-15.17
192.722	-15.17
193.18	9.1
193.638	33.37
194.096	-37.02
194.554	-41.87
195.012	6.67
195.47	16.38
195.928	6.67
196.385	-20.02
196.843	6.67
197.301	-51.58
197.758	11.53
198.216	6.67
198.674	1.82
199.131	81.92
199.589	23.67
200.046	13.96
200.503	43.08
200.961	67.36
201.418	118.33
201.875	176.58
202.332	164.44
202.79	113.47
203.247	79.49
203.704	103.76
204.161	128.04
204.618	169.3
205.075	157.16
205.532	164.44
205.989	179.01
206.445	154.74
206.902	171.73
207.359	164.44
207.816	125.61
208.272	157.16
208.729	191.14
209.185	198.43
209.642	130.46
210.098	103.76
210.555	210.56
211.011	137.74
211.467	159.59
211.924	169.3
212.38	149.88
212.836	135.32
213.292	174.15
213.748	174.15
214.204	188.72
214.66	145.03
215.116	198.43
215.572	81.92
216.028	166.87
216.484	198.43
216.94	159.59
217.396	125.61
217.851	125.61
218.307	154.74
218.763	159.59
219.218	128.04
219.674	77.06
220.129	115.9
220.585	149.88
221.04	191.14
221.496	154.74
221.951	164.44
222.406	191.14
222.861	152.31
223.317	118.33
223.772	111.05
224.227	69.78
224.682	135.32
225.137	191.14
225.592	188.72
226.047	86.77
226.502	162.02
226.957	186.29
227.411	171.73
227.866	183.86
228.321	171.73
228.776	91.63
229.23	94.05
229.685	103.76
230.139	137.74
230.594	145.03
231.048	132.89
231.503	118.33
231.957	91.63
232.411	135.32
232.865	154.74
233.32	179.01
233.774	166.87
234.228	101.34
234.682	179.01
235.136	128.04
235.59	84.35
236.044	145.03
236.498	179.01
236.952	186.29
237.406	62.5
237.86	118.33
238.313	157.16
238.767	101.34
239.221	79.49
239.674	113.47
240.128	154.74
240.581	145.03
241.035	176.58
241.488	106.19
241.942	152.31
242.395	157.16
242.848	145.03
243.301	137.74
243.755	140.17
244.208	140.17
244.661	140.17
245.114	132.89
245.567	137.74
246.02	108.62
246.473	176.58
246.926	154.74
247.379	142.6
247.832	154.74
248.284	183.86
248.737	152.31
249.19	89.2
249.642	130.46
250.095	149.88
250.547	101.34
251	135.32
251.452	186.29
251.905	142.6
252.357	94.05
252.81	162.02
253.262	125.61
253.714	217.84
254.166	135.32
254.618	79.49
255.07	208.13
255.523	130.46
255.975	147.45
256.427	152.31
256.878	171.73
257.33	113.47
257.782	159.59
258.234	147.45
258.686	154.74
259.137	128.04
259.589	162.02
260.041	128.04
260.492	166.87
260.944	225.12
261.395	120.75
261.847	215.42
262.298	98.91
262.749	111.05
263.201	154.74
263.652	106.19
264.103	152.31
264.554	98.91
265.005	140.17
265.457	152.31
265.908	103.76
266.359	181.43
266.809	162.02
267.26	132.89
267.711	191.14
268.162	74.64
268.613	162.02
269.064	208.13
269.514	171.73
269.965	137.74
270.415	118.33
270.866	157.16
271.316	111.05
271.767	149.88
272.217	128.04
272.668	152.31
273.118	157.16
273.568	135.32
274.019	152.31
274.469	52.79
274.919	125.61
275.369	123.18
275.819	123.18
276.269	118.33
276.719	169.3
277.169	217.84
277.619	200.85
278.069	176.58
278.518	176.58
278.968	157.16
279.418	132.89
279.867	176.58
280.317	166.87
280.767	79.49
281.216	181.43
281.666	229.98
282.115	106.19
282.564	188.72
283.014	101.34
283.463	164.44
283.912	176.58
284.361	108.62
284.811	210.56
285.26	96.48
285.709	176.58
286.158	120.75
286.607	176.58
287.056	193.57
287.505	142.6
287.953	200.85
288.402	212.99
288.851	89.2
289.3	217.84
289.748	191.14
290.197	159.59
290.646	118.33
291.094	154.74
291.543	176.58
291.991	115.9
292.439	159.59
292.888	157.16
293.336	169.3
293.784	120.75
294.233	171.73
294.681	125.61
295.129	171.73
295.577	174.15
296.025	123.18
296.473	234.83
296.921	69.78
297.369	174.15
297.817	196
298.264	162.02
298.712	232.41
299.16	164.44
299.608	140.17
300.055	142.6
300.503	132.89
300.95	96.48
301.398	176.58
301.845	142.6
302.293	164.44
302.74	106.19
303.187	183.86
303.635	137.74
304.082	118.33
304.529	91.63
304.976	198.43
305.423	215.42
305.87	142.6
306.317	91.63
306.764	171.73
307.211	222.7
307.658	152.31
308.105	159.59
308.552	145.03
308.998	149.88
309.445	205.71
309.892	179.01
310.338	154.74
310.785	98.91
311.231	196
311.678	162.02
312.124	152.31
312.571	113.47
313.017	162.02
313.463	57.65
313.909	157.16
314.356	196
314.802	181.43
315.248	183.86
315.694	169.3
316.14	94.05
316.586	140.17
317.032	113.47
317.478	205.71
317.923	229.98
318.369	174.15
318.815	149.88
319.261	142.6
319.706	128.04
320.152	183.86
320.597	125.61
321.043	154.74
321.488	244.54
321.934	169.3
322.379	115.9
322.824	193.57
323.27	149.88
323.715	91.63
324.16	191.14
324.605	154.74
325.05	152.31
325.495	140.17
325.94	174.15
326.385	101.34
326.83	152.31
327.275	249.4
327.72	145.03
328.165	135.32
328.61	174.15
329.054	113.47
329.499	98.91
329.943	113.47
330.388	132.89
330.832	186.29
331.277	237.26
331.721	162.02
332.166	101.34
332.61	179.01
333.054	169.3
333.499	174.15
333.943	115.9
334.387	169.3
334.831	125.61
335.275	103.76
335.719	196
336.163	169.3
336.607	132.89
337.051	115.9
337.495	174.15
337.938	203.28
338.382	111.05
338.826	188.72
339.269	166.87
339.713	132.89
340.157	176.58
340.6	198.43
341.044	186.29
341.487	115.9
341.93	81.92
342.374	128.04
342.817	128.04
343.26	176.58
343.703	208.13
344.146	106.19
344.59	111.05
345.033	120.75
345.476	166.87
345.919	157.16
346.361	115.9
346.804	125.61
347.247	169.3
347.69	208.13
348.133	128.04
348.575	72.21
349.018	98.91
349.461	60.07
349.903	191.14
350.346	106.19
350.788	193.57
351.23	171.73
351.673	227.55
352.115	145.03
352.557	135.32
353	227.55
353.442	140.17
353.884	159.59
354.326	162.02
354.768	118.33
355.21	106.19
355.652	149.88
356.094	196
356.536	145.03
356.978	191.14
357.419	186.29
357.861	140.17
358.303	164.44
358.744	118.33
359.186	145.03
359.627	179.01
360.069	162.02
360.51	179.01
360.952	200.85
361.393	106.19
361.834	152.31
362.276	166.87
362.717	169.3
363.158	142.6
363.599	166.87
364.04	152.31
364.481	140.17
364.922	193.57
365.363	101.34
365.804	196
366.245	128.04
366.686	193.57
367.126	261.53
367.567	108.62
368.008	128.04
368.448	198.43
368.889	159.59
369.33	179.01
369.77	203.28
370.21	154.74
370.651	193.57
371.091	108.62
371.531	64.93
371.972	123.18
372.412	171.73
372.852	149.88
373.292	149.88
373.732	196
374.172	174.15
374.612	74.64
375.052	145.03
375.492	106.19
375.932	145.03
376.372	79.49
376.811	125.61
377.251	128.04
377.691	179.01
378.13	108.62
378.57	166.87
379.009	162.02
379.449	157.16
379.888	152.31
380.328	145.03
380.767	157.16
381.206	179.01
381.645	96.48
382.085	164.44
382.524	147.45
382.963	101.34
383.402	196
383.841	174.15
384.28	191.14
384.719	81.92
385.158	140.17
385.596	176.58
386.035	229.98
386.474	149.88
386.913	79.49
387.351	137.74
387.79	135.32
388.228	132.89
388.667	203.28
389.105	154.74
389.544	101.34
389.982	179.01
390.42	140.17
390.859	128.04
391.297	128.04
391.735	203.28
392.173	210.56
392.611	137.74
393.049	98.91
393.487	159.59
393.925	166.87
394.363	196
394.801	142.6
395.239	98.91
395.676	154.74
396.114	152.31
396.552	125.61
396.989	183.86
397.427	154.74
397.864	186.29
398.302	157.16
398.739	154.74
399.177	188.72
399.614	142.6
400.051	128.04
400.488	152.31
400.926	125.61
401.363	196
401.8	103.76
402.237	128.04
402.674	181.43
403.111	137.74
403.548	84.35
403.985	174.15
404.421	191.14
404.858	123.18
405.295	164.44
405.732	169.3
406.168	130.46
406.605	149.88
407.041	137.74
407.478	191.14
407.914	142.6
408.351	145.03
408.787	118.33
409.223	111.05
409.66	191.14
410.096	145.03
410.532	89.2
410.968	152.31
411.404	166.87
411.84	186.29
412.276	125.61
412.712	176.58
413.148	166.87
413.584	125.61
414.02	120.75
414.455	179.01
414.891	176.58
415.327	157.16
415.762	212.99
416.198	183.86
416.633	169.3
417.069	169.3
417.504	145.03
417.94	147.45
418.375	91.63
418.81	162.02
419.245	196
419.681	149.88
420.116	154.74
420.551	193.57
420.986	210.56
421.421	205.71
421.856	128.04
422.291	137.74
422.726	181.43
423.16	145.03
423.595	128.04
424.03	89.2
424.464	162.02
424.899	128.04
425.334	118.33
425.768	196
426.203	137.74
426.637	220.27
427.071	125.61
427.506	145.03
427.94	154.74
428.374	169.3
428.809	191.14
429.243	188.72
429.677	200.85
430.111	125.61
430.545	198.43
430.979	142.6
431.413	162.02
431.847	234.83
432.28	118.33
432.714	145.03
433.148	89.2
433.582	176.58
434.015	196
434.449	166.87
434.882	179.01
435.316	208.13
435.749	244.54
436.183	154.74
436.616	132.89
437.049	128.04
437.483	181.43
437.916	227.55
438.349	196
438.782	198.43
439.215	157.16
439.648	183.86
440.081	137.74
440.514	251.82
440.947	137.74
441.38	181.43
441.813	154.74
442.245	225.12
442.678	123.18
443.111	198.43
443.543	147.45
443.976	125.61
444.408	159.59
444.841	181.43
445.273	183.86
445.705	186.29
446.138	237.26
446.57	220.27
447.002	217.84
447.434	208.13
447.867	181.43
448.299	215.42
448.731	157.16
449.163	157.16
449.595	242.12
450.026	227.55
450.458	208.13
450.89	293.09
451.322	285.81
451.754	268.81
452.185	166.87
452.617	217.84
453.048	273.67
453.48	244.54
453.911	263.96
454.343	254.25
454.774	283.38
455.205	242.12
455.637	149.88
456.068	251.82
456.499	295.51
456.93	256.68
457.361	246.97
457.792	239.69
458.223	232.41
458.654	285.81
459.085	336.78
459.516	344.06
459.947	256.68
460.378	261.53
460.808	249.4
461.239	268.81
461.669	256.68
462.1	249.4
462.531	273.67
462.961	244.54
463.391	341.63
463.822	229.98
464.252	259.11
464.682	339.2
465.113	288.23
465.543	179.01
465.973	319.79
466.403	249.4
466.833	242.12
467.263	285.81
467.693	237.26
468.123	271.24
468.553	225.12
468.983	227.55
469.412	203.28
469.842	244.54
470.272	268.81
470.701	249.4
471.131	263.96
471.56	142.6
471.99	227.55
472.419	229.98
472.849	227.55
473.278	234.83
473.707	220.27
474.136	254.25
474.566	288.23
474.995	171.73
475.424	227.55
475.853	232.41
476.282	237.26
476.711	249.4
477.14	239.69
477.569	208.13
477.997	166.87
478.426	215.42
478.855	234.83
479.283	227.55
479.712	280.95
480.141	285.81
480.569	239.69
480.998	254.25
481.426	174.15
481.854	140.17
482.283	198.43
482.711	130.46
483.139	215.42
483.567	212.99
483.995	212.99
484.424	215.42
484.852	198.43
485.28	198.43
485.708	222.7
486.135	217.84
486.563	162.02
486.991	193.57
487.419	186.29
487.847	203.28
488.274	205.71
488.702	183.86
489.129	169.3
489.557	157.16
489.984	96.48
490.412	217.84
490.839	212.99
491.266	193.57
491.694	222.7
492.121	191.14
492.548	249.4
492.975	249.4
493.402	125.61
493.829	186.29
494.256	193.57
494.683	217.84
495.11	188.72
495.537	278.52
495.964	171.73
496.39	234.83
496.817	125.61
497.244	147.45
497.67	234.83
498.097	152.31
498.523	200.85
498.95	149.88
499.376	222.7
499.803	200.85
500.229	242.12
500.655	212.99
501.081	234.83
501.508	246.97
501.934	261.53
502.36	210.56
502.786	149.88
503.212	242.12
503.638	186.29
504.064	246.97
504.489	115.9
504.915	215.42
505.341	125.61
505.767	130.46
506.192	222.7
506.618	203.28
507.043	162.02
507.469	130.46
507.894	166.87
508.32	169.3
508.745	208.13
509.17	181.43
509.596	217.84
510.021	123.18
510.446	174.15
510.871	174.15
511.296	183.86
511.721	229.98
512.146	186.29
512.571	166.87
512.996	251.82
513.421	205.71
513.845	196
514.27	157.16
514.695	215.42
515.119	229.98
515.544	169.3
515.969	152.31
516.393	196
516.817	268.81
517.242	222.7
517.666	198.43
518.09	237.26
518.515	198.43
518.939	198.43
519.363	387.75
519.787	295.51
520.211	227.55
520.635	164.44
521.059	183.86
521.483	208.13
521.907	169.3
522.331	142.6
522.754	149.88
523.178	164.44
523.602	149.88
524.025	210.56
524.449	242.12
524.872	186.29
525.296	86.77
525.719	191.14
526.143	220.27
526.566	147.45
526.989	212.99
527.412	86.77
527.836	227.55
528.259	288.23
528.682	137.74
529.105	164.44
529.528	179.01
529.951	191.14
530.374	137.74
530.796	183.86
531.219	210.56
531.642	166.87
532.065	118.33
532.487	220.27
532.91	188.72
533.332	205.71
533.755	205.71
534.177	149.88
534.6	169.3
535.022	128.04
535.444	181.43
535.867	166.87
536.289	212.99
536.711	227.55
537.133	162.02
537.555	132.89
537.977	188.72
538.399	217.84
538.821	200.85
539.243	159.59
539.665	212.99
540.086	101.34
540.508	191.14
540.93	198.43
541.351	164.44
541.773	174.15
542.195	166.87
542.616	191.14
543.037	256.68
543.459	200.85
543.88	171.73
544.301	169.3
544.723	239.69
545.144	188.72
545.565	191.14
545.986	251.82
546.407	222.7
546.828	196
547.249	108.62
547.67	198.43
548.091	256.68
548.512	200.85
548.932	164.44
549.353	249.4
549.774	176.58
550.194	164.44
550.615	280.95
551.035	164.44
551.456	193.57
551.876	154.74
552.296	188.72
552.717	208.13
553.137	210.56
553.557	176.58
553.977	259.11
554.397	193.57
554.817	149.88
555.237	193.57
555.657	106.19
556.077	162.02
556.497	103.76
556.917	242.12
557.337	169.3
557.756	251.82
558.176	259.11
558.596	196
559.015	220.27
559.435	232.41
559.854	186.29
560.274	179.01
560.693	193.57
561.112	183.86
561.532	191.14
561.951	210.56
562.37	183.86
562.789	220.27
563.208	103.76
563.627	222.7
564.046	210.56
564.465	169.3
564.884	176.58
565.303	125.61
565.722	193.57
566.14	210.56
566.559	217.84
566.978	149.88
567.396	220.27
567.815	186.29
568.233	198.43
568.652	203.28
569.07	166.87
569.489	166.87
569.907	174.15
570.325	166.87
570.743	154.74
571.161	164.44
571.58	239.69
571.998	200.85
572.416	171.73
572.833	198.43
573.251	191.14
573.669	103.76
574.087	130.46
574.505	200.85
574.922	157.16
575.34	169.3
575.758	212.99
576.175	239.69
576.593	166.87
577.01	210.56
577.428	208.13
577.845	1533.4
578.262	346.49
578.68	171.73
579.097	142.6
579.514	193.57
579.931	147.45
580.348	130.46
580.765	198.43
581.182	200.85
581.599	191.14
582.016	142.6
582.433	203.28
582.849	191.14
583.266	217.84
583.683	179.01
584.099	210.56
584.516	183.86
584.933	220.27
585.349	111.05
585.765	181.43
586.182	186.29
586.598	120.75
587.014	135.32
587.431	210.56
587.847	203.28
588.263	145.03
588.679	237.26
589.095	159.59
589.511	210.56
589.927	200.85
590.343	203.28
590.759	186.29
591.174	101.34
591.59	205.71
592.006	188.72
592.421	210.56
592.837	176.58
593.252	169.3
593.668	152.31
594.083	169.3
594.499	225.12
594.914	140.17
595.329	210.56
595.745	145.03
596.16	162.02
596.575	183.86
596.99	210.56
597.405	181.43
597.82	176.58
598.235	123.18
598.65	137.74
599.065	179.01
599.479	210.56
599.894	125.61
600.309	200.85
600.724	149.88
601.138	203.28
601.553	225.12
601.967	259.11
602.382	198.43
602.796	210.56
603.21	154.74
603.625	193.57
604.039	203.28
604.453	132.89
604.867	198.43
605.281	154.74
605.695	254.25
606.109	217.84
606.523	166.87
606.937	166.87
607.351	307.65
607.765	203.28
608.178	142.6
608.592	200.85
609.006	162.02
609.419	137.74
609.833	234.83
610.246	179.01
610.66	208.13
611.073	244.54
611.487	176.58
611.9	217.84
612.313	215.42
612.726	225.12
613.139	147.45
613.553	191.14
613.966	254.25
614.379	234.83
614.792	152.31
615.204	145.03
615.617	149.88
616.03	234.83
616.443	169.3
616.856	166.87
617.268	254.25
617.681	208.13
618.093	234.83
618.506	166.87
618.918	200.85
619.331	220.27
619.743	154.74
620.155	179.01
620.568	154.74
620.98	149.88
621.392	203.28
621.804	174.15
622.216	191.14
622.628	132.89
623.04	154.74
623.452	215.42
623.864	210.56
624.276	166.87
624.687	222.7
625.099	179.01
625.511	169.3
625.922	215.42
626.334	159.59
626.745	154.74
627.157	79.49
627.568	149.88
627.979	149.88
628.391	108.62
628.802	176.58
629.213	179.01
629.624	200.85
630.035	113.47
630.446	162.02
630.857	154.74
631.268	191.14
631.679	157.16
632.09	181.43
632.501	200.85
632.912	171.73
633.322	174.15
633.733	132.89
634.144	74.64
634.554	159.59
634.965	205.71
635.375	149.88
635.785	171.73
636.196	152.31
636.606	181.43
637.016	166.87
637.427	191.14
637.837	220.27
638.247	152.31
638.657	152.31
639.067	210.56
639.477	140.17
639.887	203.28
640.297	217.84
640.706	212.99
641.116	157.16
641.526	179.01
641.935	130.46
642.345	149.88
642.755	130.46
643.164	263.96
643.573	135.32
643.983	149.88
644.392	229.98
644.801	256.68
645.211	132.89
645.62	152.31
646.029	140.17
646.438	220.27
646.847	193.57
647.256	193.57
647.665	191.14
648.074	145.03
648.483	186.29
648.892	183.86
649.3	130.46
649.709	215.42
650.118	128.04
650.526	164.44
650.935	98.91
651.343	171.73
651.752	181.43
652.16	210.56
652.568	152.31
652.977	159.59
653.385	145.03
653.793	205.71
654.201	145.03
654.609	115.9
655.017	145.03
655.425	208.13
655.833	132.89
656.241	96.48
656.649	137.74
657.057	191.14
657.464	125.61
657.872	115.9
658.28	217.84
658.687	176.58
659.095	149.88
659.502	123.18
659.91	157.16
660.317	174.15
660.724	84.35
661.132	210.56
661.539	149.88
661.946	203.28
662.353	186.29
662.76	94.05
663.167	188.72
663.574	193.57
663.981	118.33
664.388	142.6
664.795	128.04
665.202	203.28
665.608	166.87
666.015	135.32
666.422	212.99
666.828	67.36
667.235	162.02
667.641	171.73
668.047	154.74
668.454	249.4
668.86	154.74
669.266	162.02
669.673	176.58
670.079	188.72
670.485	164.44
670.891	147.45
671.297	162.02
671.703	157.16
672.109	142.6
672.515	128.04
672.92	193.57
673.326	181.43
673.732	166.87
674.138	196
674.543	186.29
674.949	215.42
675.354	176.58
675.76	227.55
676.165	94.05
676.57	162.02
676.976	193.57
677.381	147.45
677.786	208.13
678.191	186.29
678.596	210.56
679.001	125.61
679.406	135.32
679.811	217.84
680.216	111.05
680.621	183.86
681.026	166.87
681.43	74.64
681.835	115.9
682.24	147.45
682.644	128.04
683.049	94.05
683.453	128.04
683.858	183.86
684.262	171.73
684.667	196
685.071	123.18
685.475	157.16
685.879	181.43
686.283	135.32
686.687	132.89
687.091	130.46
687.495	183.86
687.899	162.02
688.303	181.43
688.707	234.83
689.111	188.72
689.514	142.6
689.918	198.43
690.322	86.77
690.725	193.57
691.129	149.88
691.532	166.87
691.936	111.05
692.339	171.73
692.742	145.03
693.146	135.32
693.549	157.16
693.952	205.71
694.355	191.14
694.758	191.14
695.161	16.38
695.564	145.03
695.967	128.04
696.37	152.31
696.773	174.15
697.175	101.34
697.578	91.63
697.981	123.18
698.383	171.73
698.786	212.99
699.188	140.17
699.591	130.46
699.993	217.84
700.395	159.59
700.798	162.02
701.2	94.05
701.602	149.88
702.004	152.31
702.406	181.43
702.808	164.44
703.21	181.43
703.612	210.56
704.014	254.25
704.416	120.75
704.818	205.71
705.219	145.03
705.621	203.28
706.023	171.73
706.424	268.81
706.826	154.74
707.227	162.02
707.629	154.74
708.03	244.54
708.431	210.56
708.832	188.72
709.234	205.71
709.635	215.42
710.036	210.56
710.437	191.14
710.838	176.58
711.239	217.84
711.64	196
712.041	244.54
712.441	188.72
712.842	212.99
713.243	198.43
713.643	130.46
714.044	244.54
714.445	234.83
714.845	196
715.246	217.84
715.646	227.55
716.046	200.85
716.447	280.95
716.847	244.54
717.247	266.39
717.647	220.27
718.047	246.97
718.447	225.12
718.847	288.23
719.247	295.51
719.647	327.07
720.047	254.25
720.446	280.95
720.846	239.69
721.246	317.36
721.645	215.42
722.045	288.23
722.444	266.39
722.844	242.12
723.243	259.11
723.643	273.67
724.042	246.97
724.441	351.34
724.84	285.81
725.24	261.53
725.639	295.51
726.038	365.9
726.437	334.35
726.836	227.55
727.234	441.15
727.633	307.65
728.032	293.09
728.431	319.79
728.83	358.62
729.228	412.02
729.627	358.62
730.025	441.15
730.424	387.75
730.822	509.11
731.22	528.53
731.619	482.41
732.017	467.85
732.415	453.28
732.813	545.52
733.212	572.22
733.61	688.72
734.008	637.75
734.406	628.04
734.803	698.43
735.201	749.4
735.599	916.88
735.997	836.78
736.395	853.78
736.792	909.6
737.19	892.61
737.587	1045.53
737.985	1069.8
738.382	1164.46
738.78	1171.74
739.177	1169.31
739.574	1229.99
739.971	1312.52
740.369	1409.61
740.766	1596.51
741.163	1511.55
741.56	1446.02
741.957	1550.39
742.354	1698.45
742.751	1975.15
743.147	1963.02
743.544	1790.68
743.941	1761.56
744.338	1980.01
744.734	2307.68
745.131	2414.48
745.527	2489.72
745.924	2331.95
746.32	2382.93
746.716	2657.2
747.113	3055.27
747.509	3324.69
747.905	3186.34
748.301	2919.34
748.697	3086.82
749.093	3620.81
749.489	4072.27
749.885	4171.79
750.281	3972.76
750.677	3897.51
751.073	4086.84
751.468	4574.71
751.864	5111.12
752.26	5052.87
752.655	4936.36
753.051	4742.19
753.446	4907.24
753.842	5632.98
754.237	6351.43
754.632	6324.73
755.028	5790.75
755.423	5557.73
755.818	5759.19
756.213	6744.64
756.608	7230.09
757.003	7193.68
757.398	6499.49
757.793	6069.88
758.188	6446.1
758.583	7324.75
758.977	8065.05
759.372	7970.39
759.767	7349.02
760.161	7145.14
760.556	7967.96
760.95	9698.57
761.345	10419.46
761.739	10417.03
762.133	9484.98
762.527	8994.68
762.922	9778.67
763.316	11358.79
763.71	12492.31
764.104	12339.39
764.498	11154.91
764.892	10793.25
765.286	11667.05
765.68	12885.52
766.073	14727.78
766.467	13737.47
766.861	12914.64
767.255	12128.22
767.648	12795.71
768.042	14589.43
768.435	16104.01
768.829	15849.15
769.222	14538.45
769.615	13538.44
770.008	13710.77
770.402	15849.15
770.795	17230.24
771.188	17441.41
771.581	15929.25
771.974	13975.34
772.367	13943.78
772.76	15574.88
773.153	16783.63
773.545	17057.91
773.938	16072.46
774.331	14608.84
774.724	14332.14
775.116	16390.42
775.509	18659.88
775.901	20329.81
776.294	19672.03
776.686	17582.19
777.078	16718.1
777.471	18468.13
777.863	21511.86
778.255	23363.83
778.647	22672.08
779.039	20405.05
779.431	18885.61
779.823	20002.13
780.215	22361.39
780.607	24193.94
780.999	23992.48
781.39	21841.97
781.782	20230.29
782.174	20099.22
782.565	22237.6
782.957	24810.46
783.348	25509.5
783.74	23094.41
784.131	20788.55
784.522	20477.87
784.914	21676.91
785.305	23718.21
785.696	24701.23
786.087	23511.89
786.478	21181.76
786.869	19104.06
787.26	19249.69
787.651	21019.14
788.042	22371.1
788.433	21511.86
788.823	19312.8
789.214	17235.1
789.605	16761.79
789.995	18082.2
790.386	19094.35
790.776	19861.35
791.167	18273.95
791.557	17091.89
791.948	16424.41
792.338	17261.8
792.728	19366.2
793.118	21264.29
793.508	21213.32
793.898	19278.82
794.288	17346.75
794.678	17023.93
795.068	18572.5
795.458	20511.85
795.848	20943.89
796.238	20116.21
796.627	17492.38
797.017	16948.69
797.406	17489.96
797.796	18895.32
798.185	20749.72
798.575	20482.72
798.964	18744.83
799.354	17497.24
799.743	17023.93
800.132	18147.73
800.521	20128.35
800.91	20924.48
801.299	19669.6
801.688	17972.97
802.077	16062.75
802.466	16601.59
802.855	17633.16
803.244	18764.25
803.633	19121.05
804.021	17361.31
804.41	15754.49
804.799	14759.33
805.187	14829.72
805.576	15807.89
805.964	16815.19
806.352	15934.11
806.741	14873.41
807.129	13487.47
807.517	12887.94
807.905	13985.05
808.293	15101.57
808.681	16137.99
809.069	15579.73
809.457	14412.24
809.845	13048.14
810.233	13142.8
810.621	14742.34
811.009	16031.2
811.396	16176.83
811.784	15623.42
812.171	13997.18
812.559	12771.44
812.946	12642.79
813.334	13701.06
813.721	14883.12
814.108	14812.73
814.496	13846.7
814.883	12266.57
815.27	11987.44
815.657	12225.31
816.044	13242.32
816.431	14303.01
816.818	14225.34
817.205	13300.57
817.592	11805.4
817.979	10851.5
818.365	10958.3
818.752	12057.83
819.139	12460.75
819.525	12361.24
819.912	11254.42
820.298	9999.55
820.685	9137.88
821.071	9470.41
821.457	10040.81
821.843	10261.69
822.23	9951
822.616	9123.32
823.002	7929.13
823.388	7249.51
823.774	7431.55
824.16	7768.93
824.546	8315.06
824.931	8137.87
825.317	7412.13
825.703	6589.3
826.089	6149.97
826.474	6475.22
826.86	7067.46
827.245	7327.18
827.631	7407.28
828.016	6666.97
828.401	5970.36
828.787	5548.02
829.172	5494.62
829.557	6033.47
829.942	6336.87
830.327	6443.67
830.712	6035.89
831.097	4958.21
831.482	4601.41
831.867	4501.89
832.252	5016.46
832.636	5421.81
833.021	5574.72
833.406	5038.31
833.79	4453.35
834.175	3963.05
834.559	3912.08
834.944	4293.15
835.328	4540.73
835.713	4523.74
836.097	4341.69
836.481	3671.78
836.865	3297.99
837.249	3356.24
837.633	3271.29
838.017	3504.3
838.401	3788.29
838.785	3504.3
839.169	3081.97
839.553	2632.93
839.937	2467.88
840.32	2465.45
840.704	2657.2
841.087	2780.99
841.471	2635.36
841.854	2302.83
842.238	2047.97
842.621	1970.3
843.004	1948.45
843.388	2038.26
843.771	2322.24
844.154	2453.31
844.537	2244.57
844.92	1807.67
845.303	1681.46
845.686	1669.32
846.069	1640.2
846.452	2040.69
846.834	2011.56
847.217	1899.91
847.6	1642.62
847.982	1424.17
848.365	1378.06
848.748	1463.01
849.13	1543.11
849.512	1642.62
849.895	1545.53
850.277	1492.13
850.659	1220.29
851.041	1266.4
851.423	1278.54
851.806	1312.52
852.188	1409.61
852.57	1489.71
852.951	1358.64
853.333	1154.75
853.715	953.29
854.097	1060.09
854.479	1021.25
854.86	1142.61
855.242	1222.71
855.623	1164.46
856.005	1047.95
856.386	858.63
856.768	807.66
857.149	778.53
857.53	783.39
857.911	885.33
858.292	924.16
858.674	776.1
859.055	754.26
859.436	696.01
859.817	569.79
860.197	567.36
860.578	662.02
860.959	635.33
861.34	671.73
861.72	676.59
862.101	625.62
862.482	547.95
862.862	577.07
863.243	513.96
863.623	635.33
864.003	603.77
864.384	581.93
864.764	560.08
865.144	397.46
865.524	368.33
865.904	446
866.284	475.13
866.664	545.52
867.044	547.95
867.424	421.73
867.804	448.43
868.183	399.88
868.563	300.37
868.943	365.9
869.322	397.46
869.702	448.43
870.081	460.57
870.461	327.07
870.84	414.45
871.22	361.05
871.599	336.78
871.978	380.47
872.357	285.81
872.736	363.48
873.115	331.92
873.494	356.19
873.873	268.81
874.252	256.68
874.631	239.69
875.01	232.41
875.388	251.82
875.767	242.12
876.146	276.1
876.524	242.12
876.903	200.85
877.281	232.41
877.66	249.4
878.038	198.43
878.416	254.25
878.794	278.52
879.173	157.16
879.551	276.1
879.929	208.13
880.307	249.4
880.685	159.59
881.063	225.12
881.441	200.85
881.818	181.43
882.196	246.97
882.574	191.14
882.951	225.12
883.329	171.73
883.707	174.15
884.084	166.87
884.461	220.27
884.839	183.86
885.216	215.42
885.593	251.82
885.971	166.87
886.348	179.01
886.725	183.86
887.102	135.32
887.479	171.73
887.856	191.14
888.233	220.27
888.609	154.74
888.986	179.01
889.363	91.63
889.74	183.86
890.116	220.27
890.493	166.87
890.869	157.16
891.246	212.99
891.622	113.47
891.998	200.85
892.375	205.71
892.751	128.04
893.127	147.45
893.503	159.59
893.879	118.33
894.255	162.02
894.631	162.02
895.007	145.03
895.383	128.04
895.759	210.56
896.134	193.57
896.51	152.31
896.886	169.3
897.261	113.47
897.637	208.13
898.012	145.03
898.388	273.67
898.763	164.44
899.138	98.91
899.514	200.85
899.889	169.3
900.264	79.49
900.639	176.58
901.014	169.3
901.389	237.26
901.764	152.31
902.139	147.45
902.513	188.72
902.888	128.04
903.263	135.32
903.638	132.89
904.012	169.3
904.387	115.9
904.761	159.59
905.136	157.16
905.51	159.59
905.884	149.88
906.259	147.45
906.633	159.59
907.007	176.58
907.381	130.46
907.755	79.49
908.129	98.91
908.503	176.58
908.877	128.04
909.251	188.72
909.624	142.6
909.998	120.75
910.372	149.88
910.745	137.74
911.119	69.78
911.492	171.73
911.866	154.74
912.239	111.05
912.612	142.6
912.986	152.31
913.359	108.62
913.732	162.02
914.105	118.33
914.478	162.02
914.851	140.17
915.224	137.74
915.597	108.62
915.97	188.72
916.343	174.15
916.715	137.74
917.088	169.3
917.461	123.18
917.833	200.85
918.206	115.9
918.578	111.05
918.951	81.92
919.323	94.05
919.695	159.59
920.067	246.97
920.44	232.41
920.812	147.45
921.184	103.76
921.556	198.43
921.928	123.18
922.3	142.6
922.672	174.15
923.043	208.13
923.415	140.17
923.787	196
924.158	108.62
924.53	123.18
924.901	217.84
925.273	162.02
925.644	157.16
926.016	62.5
926.387	135.32
926.758	140.17
927.129	125.61
927.5	140.17
927.872	98.91
928.243	198.43
928.613	123.18
928.984	152.31
929.355	159.59
929.726	191.14
930.097	183.86
930.467	145.03
930.838	159.59
931.209	149.88
931.579	84.35
931.95	176.58
932.32	81.92
932.69	157.16
933.061	125.61
933.431	106.19
933.801	118.33
934.171	94.05
934.541	157.16
934.911	118.33
935.281	166.87
935.651	79.49
936.021	118.33
936.391	128.04
936.761	123.18
937.13	130.46
937.5	108.62
937.87	147.45
938.239	118.33
938.609	198.43
938.978	140.17
939.347	208.13
939.717	130.46
940.086	176.58
940.455	132.89
940.824	145.03
941.193	193.57
941.562	215.42
941.931	120.75
942.3	159.59
942.669	142.6
943.038	157.16
943.407	140.17
943.775	125.61
944.144	142.6
944.513	120.75
944.881	191.14
945.25	137.74
945.618	188.72
945.986	169.3
946.355	89.2
946.723	125.61
947.091	186.29
947.459	113.47
947.827	196
948.195	171.73
948.563	198.43
948.931	86.77
949.299	145.03
949.667	162.02
950.035	145.03
950.402	123.18
950.77	98.91
951.138	135.32
951.505	171.73
951.873	137.74
952.24	205.71
952.607	115.9
952.975	118.33
953.342	174.15
953.709	125.61
954.076	166.87
954.443	135.32
954.81	132.89
955.177	125.61
955.544	176.58
955.911	225.12
956.278	157.16
956.645	50.36
957.012	115.9
957.378	132.89
957.745	106.19
958.111	98.91
958.478	181.43
958.844	115.9
959.211	164.44
959.577	145.03
959.943	142.6
960.309	140.17
960.675	176.58
961.042	118.33
961.408	91.63
961.774	179.01
962.139	118.33
962.505	162.02
962.871	128.04
963.237	166.87
963.603	196
963.968	154.74
964.334	154.74
964.699	130.46
965.065	162.02
965.43	132.89
965.796	74.64
966.161	89.2
966.526	103.76
966.891	268.81
967.256	152.31
967.622	171.73
967.987	179.01
968.352	188.72
968.716	154.74
969.081	111.05
969.446	154.74
969.811	186.29
970.176	222.7
970.54	181.43
970.905	120.75
971.269	164.44
971.634	147.45
971.998	159.59
972.363	123.18
972.727	154.74
973.091	157.16
973.455	166.87
973.819	166.87
974.183	157.16
974.547	171.73
974.911	140.17
975.275	157.16
975.639	120.75
976.003	123.18
976.367	108.62
976.73	188.72
977.094	220.27
977.458	137.74
977.821	157.16
978.185	200.85
978.548	62.5
978.911	135.32
979.275	149.88
979.638	164.44
980.001	200.85
980.364	162.02
980.727	176.58
981.09	229.98
981.453	200.85
981.816	67.36
982.179	132.89
982.542	130.46
982.905	145.03
983.267	166.87
983.63	166.87
983.992	227.55
984.355	96.48
984.717	171.73
985.08	113.47
985.442	84.35
985.804	106.19
986.167	113.47
986.529	128.04
986.891	140.17
987.253	188.72
987.615	159.59
987.977	118.33
988.339	81.92
988.701	179.01
989.062	157.16
989.424	183.86
989.786	239.69
990.147	239.69
990.509	215.42
990.87	196
991.232	130.46
991.593	297.94
991.955	113.47
992.316	217.84
992.677	157.16
993.038	106.19
993.399	145.03
993.76	120.75
994.121	152.31
994.482	149.88
994.843	118.33
995.204	125.61
995.565	176.58
995.926	135.32
996.286	176.58
996.647	137.74
997.007	176.58
997.368	128.04
997.728	166.87
998.089	147.45
998.449	152.31
998.809	149.88
999.169	142.6
999.53	108.62
999.89	128.04
1000.25	166.87
1000.61	181.43
1000.97	125.61
1001.329	98.91
1001.689	125.61
1002.049	81.92
1002.409	200.85
1002.768	77.06
1003.128	128.04
1003.487	176.58
1003.847	157.16
1004.206	198.43
1004.566	152.31
1004.925	159.59
1005.284	120.75
1005.643	132.89
1006.003	171.73
1006.362	135.32
1006.721	149.88
1007.08	159.59
1007.438	135.32
1007.797	164.44
1008.156	118.33
1008.515	152.31
1008.874	67.36
1009.232	115.9
1009.591	106.19
1009.949	166.87
1010.308	174.15
1010.666	176.58
1011.024	137.74
1011.383	162.02
1011.741	145.03
1012.099	140.17
1012.457	132.89
1012.815	154.74
1013.173	113.47
1013.531	140.17
1013.889	174.15
1014.247	159.59
1014.605	115.9
1014.962	142.6
1015.32	149.88
1015.678	152.31
1016.035	193.57
1016.393	96.48
1016.75	135.32
1017.107	157.16
1017.465	149.88
1017.822	74.64
1018.179	149.88
1018.536	193.57
1018.894	96.48
1019.251	169.3
1019.608	174.15
1019.964	166.87
1020.321	159.59
1020.678	225.12
1021.035	154.74
1021.392	120.75
1021.748	162.02
1022.105	101.34
1022.461	171.73
1022.818	249.4
1023.174	159.59
1023.531	166.87
1023.887	142.6
1024.243	98.91
1024.599	169.3
1024.955	132.89
1025.311	162.02
1025.667	198.43
1026.023	169.3
1026.379	113.47
1026.735	98.91
1027.091	152.31
1027.447	159.59
