<?xml version="1.0" encoding="UTF-8" standalone="no"?>
<svg
   xmlns:dc="http://purl.org/dc/elements/1.1/"
   xmlns:cc="http://creativecommons.org/ns#"
   xmlns:rdf="http://www.w3.org/1999/02/22-rdf-syntax-ns#"
   xmlns:svg="http://www.w3.org/2000/svg"
   xmlns="http://www.w3.org/2000/svg"
   viewBox="0 0 37.083752 88.169998"
   height="88.169998"
   width="37.083752"
   xml:space="preserve"
   version="1.1"
   id="svg2"><metadata
     id="metadata8"><rdf:RDF><cc:Work
         rdf:about=""><dc:format>image/svg+xml</dc:format><dc:type
           rdf:resource="http://purl.org/dc/dcmitype/StillImage" /></cc:Work></rdf:RDF></metadata><defs
     id="defs6" /><g
     transform="matrix(1.25,0,0,-1.25,0,88.17)"
     id="g10"><g
       transform="translate(2.964,8.569)"
       id="g12"><g
         id="g14"><g
           id="g16"><g
             id="g18"><g
               id="g20"><g
                 id="g22"><g
                   id="g24"><g
                     transform="translate(2.14474,-2.14474)"
                     id="g26"><path
                       id="path28"
                       style="fill:#808080;fill-opacity:0.15;fill-rule:nonzero;stroke:none"
                       d="m 11.86998,7.97023 7.97067,0 c 4.40213,-4.40211 4.40213,-11.53918 0,-15.94131 l -15.94133,8.5e-4 c -4.40211,4.40211 -4.40211,11.53918 0,15.94131 l 7.97066,-8.5e-4 z" /></g></g></g><g
                 id="g30"><path
                   id="path32"
                   style="fill:#e7ebcc;fill-opacity:1;fill-rule:nonzero;stroke:#586e75;stroke-width:1.19553006;stroke-linecap:butt;stroke-linejoin:miter;stroke-miterlimit:10;stroke-dasharray:none;stroke-opacity:1"
                   d="m 11.86998,7.97023 7.97067,0 c 4.40213,-4.40211 4.40213,-11.53918 0,-15.94131 l -15.94133,8.5e-4 c -4.40211,4.40211 -4.40211,11.53918 0,15.94131 l 7.97066,-8.5e-4 z" /></g><g
                 transform="translate(9.516,-2.69)"
                 id="g34"><g
                   id="g36"><g
                     transform="translate(-12.48,-5.879)"
                     id="g38"><g
                       id="text40"
                       style="font-variant:normal;font-weight:normal;font-size:8.96640015px;font-family:LMMono9;-inkscape-font-specification:LMMono9-Regular;writing-mode:lr-tb;fill:#000000;fill-opacity:1;fill-rule:nonzero;stroke:none"
                       transform="matrix(1,0,0,-1,12.48,5.879)"><path
                         id="path129"
                         style=""
                         d="m 4.4563009,-0.268992 c 0,-0.11656321 -0.044832,-0.20622721 -0.1524288,-0.25105921 -0.053798,-0.0268992 -0.2510592,-0.0268992 -0.3855552,-0.0268992 L 2.8333824,-5.2363777 c -0.080698,-0.3407232 -0.2062272,-0.3496896 -0.4841856,-0.3496896 -0.2600256,0 -0.403488,0 -0.4841856,0.3407232 l -1.08493439,4.69839369 c -0.1255296,0 -0.3317568,0 -0.3855552,0.0179328 C 0.2958912,-0.47521921 0.2420928,-0.38555521 0.2420928,-0.268992 0.2420928,0 0.47521921,0 0.62764801,0 L 1.5422208,0 c 0.1613952,0 0.3765888,0 0.3765888,-0.268992 0,-0.27795841 -0.179328,-0.27795841 -0.5021184,-0.27795841 l 0.2062272,-0.93250559 1.4525569,0 0.2062272,0.93250559 c -0.3227905,0 -0.5021185,0 -0.5021185,0.27795841 C 2.779584,0 2.9947776,0 3.1561729,0 l 0.9145728,0 c 0.1524288,0 0.3855552,0 0.3855552,-0.268992 z m -1.5153217,-1.7574144 -1.1835648,0 0.5917824,-2.8154497 0.5917824,2.8154497 z" /></g><g
                       transform="translate(12.48,5.879)"
                       id="g44" /></g></g><g
                   transform="translate(-9.516,2.69)"
                   id="g46" /></g></g></g><g
             id="g48"><g
               id="g50"><g
                 id="g52"><g
                   transform="translate(2.14474,-2.14474)"
                   id="g54"><path
                     id="path56"
                     style="fill:#808080;fill-opacity:0.15;fill-rule:nonzero;stroke:none"
                     d="m -2.56528,22.91434 28.87056,0 0,13.94781 -28.87056,0 0,-13.94781 z" /></g></g></g><g
               id="g58"><path
                 id="path60"
                 style="fill:#fffbb3;fill-opacity:1;fill-rule:nonzero;stroke:#586e75;stroke-width:0.79701;stroke-linecap:butt;stroke-linejoin:miter;stroke-miterlimit:10;stroke-dasharray:none;stroke-opacity:1"
                 d="m -2.56528,22.91434 28.87056,0 0,13.94781 -28.87056,0 0,-13.94781 z" /></g><g
               transform="translate(0.755,27.945)"
               id="g62"><g
                 id="g64"><g
                   transform="translate(-3.719,-36.514)"
                   id="g66"><g
                     id="text68"
                     style="font-variant:normal;font-weight:normal;font-size:6.97380018px;font-family:LMMono8;-inkscape-font-specification:LMMono8-Regular;writing-mode:lr-tb;fill:#000000;fill-opacity:1;fill-rule:nonzero;stroke:none"
                     transform="matrix(1,0,0,-1,3.719,36.514)"><path
                       id="path132"
                       style=""
                       d="m 3.5984809,-0.20921401 c 0,-0.2161878 -0.1464498,-0.2161878 -0.3975066,-0.2161878 l 0,-1.68765969 c 0,-0.139476 0,-0.9344892 -0.6206682,-0.9344892 -0.209214,0 -0.4951398,0.090659 -0.6904063,0.3626376 -0.104607,-0.2371092 -0.2998734,-0.3626376 -0.5300088,-0.3626376 -0.2231616,0 -0.43237558,0.097633 -0.59974678,0.2510568 -0.0139476,-0.209214 -0.1534236,-0.209214 -0.27895201,-0.209214 l -0.2231616,0 c -0.10460701,0 -0.28592581,0 -0.28592581,0.209214 0,0.2161878 0.1464498,0.2161878 0.39750661,0.2161878 l 0,2.15490429 c -0.25105681,0 -0.39750661,0 -0.39750661,0.2161878 C -0.0278952,0 0.1603974,0 0.25803061,0 l 0.61369441,0 c 0.10460701,0 0.28592578,0 0.28592578,-0.20921401 0,-0.2161878 -0.1464498,-0.2161878 -0.39750658,-0.2161878 l 0,-1.24831019 c 0,-0.6206683 0.28592578,-0.9484369 0.57185158,-0.9484369 0.1603974,0 0.2580306,0.1185546 0.2580306,0.5718516 l 0,1.62489549 c -0.1325022,0 -0.3068472,0 -0.3068472,0.2161878 C 1.2831792,0 1.4714718,0 1.569105,0 l 0.5230351,0 c 0.104607,0 0.2859258,0 0.2859258,-0.20921401 0,-0.2161878 -0.1464498,-0.2161878 -0.3975066,-0.2161878 l 0,-1.24831019 c 0,-0.6206683 0.2859258,-0.9484369 0.5718516,-0.9484369 0.1603974,0 0.2580306,0.1185546 0.2580306,0.5718516 l 0,1.62489549 c -0.1325022,0 -0.3068472,0 -0.3068472,0.2161878 C 2.5035943,0 2.6918869,0 2.7895201,0 l 0.523035,0 c 0.104607,0 0.2859258,0 0.2859258,-0.20921401 z" /><path
                       id="path134"
                       style=""
                       d="m 7.3245822,-0.21618781 c 0,-0.209214 -0.174345,-0.209214 -0.278952,-0.209214 -0.2928996,0 -0.3626376,-0.034869 -0.418428,-0.0557904 l 0,-1.50634089 c 0,-0.4951398 -0.3765852,-1.080939 -1.3808124,-1.080939 -0.2998734,0 -1.0112011,0 -1.0112011,0.5090874 0,0.209214 0.1464498,0.3207948 0.3138211,0.3207948 0.104607,0 0.2998734,-0.062764 0.3068472,-0.3207948 0,-0.05579 0.00697,-0.062764 0.1464498,-0.076712 0.097633,-0.00697 0.1882926,-0.00697 0.2510568,-0.00697 0.5300088,0 0.8926464,0.2161878 0.8926464,0.7113276 -1.2343626,0.020922 -2.0921401,0.3696115 -2.0921401,1.03909628 0,0.48119221 0.4393495,0.93448922 1.1506771,0.93448922 0.2580306,0 0.6904062,-0.0488166 1.0181748,-0.26500441 C 6.3761454,-0.0069738 6.7108878,0 6.9758922,0 c 0.1952664,0 0.34869,0 0.34869,-0.21618781 z M 6.14601,-0.93448922 c 0,0.1603974 0,0.3068472 -0.2719782,0.43237561 -0.2510568,0.1185546 -0.5648778,0.1185546 -0.6206682,0.1185546 -0.4323756,0 -0.7183014,-0.23710921 -0.7183014,-0.50908741 0,-0.34171618 0.5997468,-0.59974678 1.6109478,-0.62764198 l 0,0.58579918 z" /><path
                       id="path136"
                       style=""
                       d="m 10.611334,-0.87172502 c 0,-0.72527518 -0.8996201,-0.87172498 -1.1227817,-0.90659398 l -0.4742184,-0.083686 c -0.2022402,-0.027895 -0.6764586,-0.1115809 -0.6764586,-0.3835591 0,-0.1813188 0.2231616,-0.3975066 0.8856726,-0.3975066 0.5788254,0 0.6764586,0.209214 0.69738,0.3905328 0.00697,0.1185546 0.020921,0.2371092 0.2371091,0.2371092 0.244083,0 0.244083,-0.1464498 0.244083,-0.2859258 l 0,-0.4811922 c 0,-0.1115808 0,-0.2859258 -0.209214,-0.2859258 -0.167371,0 -0.1952663,0.097633 -0.2092139,0.1464498 -0.3068472,-0.1464498 -0.6136944,-0.1464498 -0.7461966,-0.1464498 -1.1646246,0 -1.325022,0.5718516 -1.325022,0.8229084 0,0.6415897 0.732249,0.7601443 1.3738386,0.8577775 0.3417162,0.05579 0.8996199,0.1464498 0.8996199,0.51606118 0,0.2580306 -0.2580303,0.48816601 -0.8926461,0.48816601 -0.3277686,0 -0.7183014,-0.0767118 -0.8926464,-0.62066819 -0.034869,-0.1255284 -0.062764,-0.2022402 -0.244083,-0.2022402 -0.244083,0 -0.244083,0.1464498 -0.244083,0.28592578 l 0,0.67645861 c 0,0.11158081 0,0.28592581 0.209214,0.28592581 0.062764,0 0.174345,-0.0069738 0.2580306,-0.26500441 0.3417162,0.25105681 0.7113276,0.26500441 0.906594,0.26500441 1.1018609,0 1.3250219,-0.57882541 1.3250219,-0.91356782 z" /><path
                       id="path138"
                       style=""
                       d="m 14.246776,-0.87869882 c 0,-0.12552838 0,-0.27197818 -0.244083,-0.27197818 -0.230136,0 -0.237109,0.1464498 -0.237109,0.26500438 -0.007,0.43237561 -0.404481,0.50211361 -0.564878,0.50211361 -0.536983,0 -0.536983,-0.36263761 -0.536983,-0.53698261 l 0,-1.65976448 1.143703,0 c 0.104607,0 0.278952,0 0.278952,-0.209214 0,-0.2161878 -0.167371,-0.2161878 -0.278952,-0.2161878 l -1.143703,0 0,-0.5718516 c 0,-0.1325022 0,-0.2859258 -0.237109,-0.2859258 -0.244083,0 -0.244083,0.1464498 -0.244083,0.2859258 l 0,0.5718516 -0.606721,0 c -0.11158,0 -0.285925,0 -0.285925,0.2161878 0,0.209214 0.174345,0.209214 0.278952,0.209214 l 0.613694,0 0,1.70160728 c 0,0.66948481 0.474218,0.92054162 0.983306,0.92054162 0.516061,0 1.080939,-0.29987341 1.080939,-0.92054162 z" /><path
                       id="path140"
                       style=""
                       d="m 18.056563,-0.76014422 c 0,-0.1952664 -0.20224,-0.1952664 -0.244083,-0.1952664 -0.125528,0 -0.181319,0.0209214 -0.230135,0.1534236 -0.153424,0.35566381 -0.530009,0.41842801 -0.725276,0.41842801 -0.523035,0 -1.04607,-0.34869001 -1.15765,-0.94843679 l 2.078192,0 c 0.14645,0 0.278952,0 0.278952,-0.2580306 0,-0.7950133 -0.446323,-1.4784457 -1.352917,-1.4784457 -0.829882,0 -1.499367,0.69738 -1.499367,1.5551575 0,0.85080358 0.704354,1.5551574 1.603974,1.5551574 0.920541,0 1.24831,-0.62764202 1.24831,-0.80198702 z m -0.49514,-0.99027958 -1.855031,0 c 0.09763,-0.5090875 0.509088,-0.8926465 0.997254,-0.8926465 0.362637,0 0.795013,0.174345 0.857777,0.8926465 z" /><path
                       id="path142"
                       style=""
                       d="m 21.922141,-2.6151751 c 0,-0.139476 -0.08369,-0.4323756 -0.662511,-0.4323756 -0.355664,0 -0.801987,0.1255284 -1.185546,0.5648778 l 0,-0.2371092 c 0,-0.2161878 -0.04184,-0.2859258 -0.278952,-0.2859258 l -0.767118,0 c -0.104608,0 -0.278953,0 -0.278953,0.209214 0,0.2161878 0.167372,0.2161878 0.278953,0.2161878 l 0.564877,0 0,2.15490429 -0.564877,0 c -0.104608,0 -0.278953,0 -0.278953,0.209214 C 18.749061,0 18.916433,0 19.028014,0 l 1.820161,0 c 0.104607,0 0.285926,0 0.285926,-0.20921401 0,-0.2161878 -0.181319,-0.2161878 -0.285926,-0.2161878 l -0.774091,0 0,-0.87172499 c 0,-0.6555373 0.411454,-1.3250221 1.255284,-1.3250221 0.007,0.1673712 0.125528,0.3068472 0.299873,0.3068472 0.153424,0 0.2929,-0.1115808 0.2929,-0.2998734 z" /></g><g
                     transform="translate(3.719,36.514)"
                     id="g72" /></g></g><g
                 transform="translate(-0.755,-27.945)"
                 id="g74" /></g></g><g
             id="g76"><path
               id="path78"
               style="fill:none;stroke:#808080;stroke-width:0.79701;stroke-linecap:butt;stroke-linejoin:miter;stroke-miterlimit:10;stroke-dasharray:0.79701, 0.99628;stroke-dashoffset:0;stroke-opacity:1"
               d="m 11.87032,14.7466 -3.4e-4,7.76922" /><g
               id="g80"><g
                 transform="matrix(0,-1,1,0,11.87032,14.7466)"
                 id="g82"><g
                   id="g84"><path
                     id="path86"
                     style="fill:#808080;fill-opacity:1;fill-rule:nonzero;stroke:#808080;stroke-width:0.79701;stroke-linecap:butt;stroke-linejoin:miter;stroke-miterlimit:10;stroke-dasharray:none;stroke-opacity:1"
                     d="M 4.53381,0 C 3.97704,0.13812 1.52963,0.92084 0,1.77261 L 0,-1.77261 C 1.52963,-0.92084 3.97704,-0.13812 4.53381,0 Z" /></g></g></g></g><g
             id="g88"><g
               id="g90"><g
                 id="g92"><g
                   transform="translate(2.14474,-2.14474)"
                   id="g94"><path
                     id="path96"
                     style="fill:#808080;fill-opacity:0.15;fill-rule:nonzero;stroke:none"
                     d="m 1.1396,47.62193 21.46075,0 0,13.94781 -21.46075,0 0,-13.94781 z" /></g></g></g><g
               id="g98"><path
                 id="path100"
                 style="fill:#f8d6d5;fill-opacity:1;fill-rule:nonzero;stroke:#586e75;stroke-width:0.79701;stroke-linecap:butt;stroke-linejoin:miter;stroke-miterlimit:10;stroke-dasharray:none;stroke-opacity:1"
                 d="m 1.1396,47.62193 21.46075,0 0,13.94781 -21.46075,0 0,-13.94781 z" /></g><g
               transform="translate(4.46,52.433)"
               id="g102"><g
                 id="g104"><g
                   transform="translate(-7.424,-61.002)"
                   id="g106"><g
                     id="text108"
                     style="font-variant:normal;font-weight:normal;font-size:6.97380018px;font-family:LMMono8;-inkscape-font-specification:LMMono8-Regular;writing-mode:lr-tb;fill:#000000;fill-opacity:1;fill-rule:nonzero;stroke:none"
                     transform="matrix(1,0,0,-1,7.424,61.002)"><path
                       id="path145"
                       style=""
                       d="m 3.5008477,-0.20921401 c 0,-0.2161878 -0.1673712,-0.2161878 -0.278952,-0.2161878 l -0.174345,0 0,-3.41018829 0.174345,0 c 0.104607,0 0.278952,0 0.278952,-0.209214 0,-0.2161878 -0.1673712,-0.2161878 -0.278952,-0.2161878 l -0.8298822,0 c -0.104607,0 -0.278952,0 -0.278952,0.209214 0,0.2161878 0.1673712,0.2161878 0.278952,0.2161878 l 0.174345,0 0,1.4087076 -1.4784457,0 0,-1.4087076 0.174345,0 c 0.104607,0 0.278952,0 0.278952,-0.209214 0,-0.2161878 -0.1673712,-0.2161878 -0.278952,-0.2161878 l -0.82988219,0 c -0.1115808,0 -0.27895201,0 -0.27895201,0.2161878 0,0.209214 0.17434501,0.209214 0.27895201,0.209214 l 0.17434501,0 0,3.41018829 -0.17434501,0 c -0.1115808,0 -0.27895201,0 -0.27895201,0.2161878 C 0.1534236,0 0.32776861,0 0.43237561,0 L 1.2622578,0 c 0.104607,0 0.278952,0 0.278952,-0.20921401 0,-0.2161878 -0.1673712,-0.2161878 -0.278952,-0.2161878 l -0.174345,0 0,-1.57607889 1.4784457,0 0,1.57607889 -0.174345,0 c -0.104607,0 -0.278952,0 -0.278952,0.209214 C 2.1130615,0 2.2804327,0 2.3920135,0 l 0.8298822,0 c 0.104607,0 0.278952,0 0.278952,-0.20921401 z" /><path
                       id="path147"
                       style=""
                       d="m 7.2060276,-0.28592581 0,-0.62066821 c 0,-0.13250218 0,-0.28592578 -0.2371092,-0.28592578 -0.244083,0 -0.244083,0.1464498 -0.244083,0.28592578 l 0,0.48119221 -1.8620046,0 0,-1.56910509 0.9135678,0 c 0,0.2859259 0,0.3975067 0.244083,0.3975067 0.2371092,0 0.2371092,-0.1534236 0.2371092,-0.2859258 l 0,-0.6485635 c 0,-0.1325022 0,-0.2859258 -0.2371092,-0.2859258 -0.244083,0 -0.244083,0.1115808 -0.244083,0.3975066 l -0.9135678,0 0,-1.4156814 1.708581,0 0,0.3696114 c 0,0.1325022 0,0.2859258 0.2371092,0.2859258 0.244083,0 0.244083,-0.1464498 0.244083,-0.2859258 l 0,-0.5090874 c 0,-0.2161878 -0.041843,-0.2859258 -0.278952,-0.2859258 l -2.6012275,0 c -0.104607,0 -0.2859258,0 -0.2859258,0.209214 0,0.2161878 0.1813188,0.2161878 0.2859258,0.2161878 l 0.209214,0 0,3.41018829 -0.209214,0 c -0.1115808,0 -0.2859258,0 -0.2859258,0.2161878 C 3.8864987,0 4.0678175,0 4.1724245,0 l 2.7546511,0 c 0.2301354,0 0.278952,-0.0627642 0.278952,-0.28592581 z" /><path
                       id="path149"
                       style=""
                       d="m 10.876339,-0.20921401 c 0,-0.0906594 -0.03487,-0.1603974 -0.118555,-0.1952664 -0.04184,-0.0209214 -0.195266,-0.0209214 -0.299873,-0.0209214 L 9.6140807,-4.0726993 c -0.062764,-0.2650044 -0.1603974,-0.2719782 -0.3765852,-0.2719782 -0.2022402,0 -0.313821,0 -0.3765852,0.2650044 l -0.8438298,3.65427129 c -0.097633,0 -0.2580306,0 -0.2998734,0.0139476 -0.076712,0.0418428 -0.1185546,0.1115808 -0.1185546,0.2022402 C 7.5986525,0 7.7799713,0 7.8985259,0 l 0.7113276,0 c 0.1255284,0 0.2928996,0 0.2928996,-0.20921401 0,-0.2161878 -0.139476,-0.2161878 -0.3905328,-0.2161878 l 0.1603974,-0.72527519 1.1297556,0 0.1603974,0.72527519 c -0.2510568,0 -0.3905328,0 -0.3905328,0.2161878 C 9.5722379,0 9.7396091,0 9.8651375,0 l 0.7113275,0 c 0.118555,0 0.299874,0 0.299874,-0.20921401 z m -1.1785727,-1.36686479 -0.9205416,0 0.4602708,-2.1897733 0.4602708,2.1897733 z" /><path
                       id="path151"
                       style=""
                       d="m 14.497833,-2.0991139 c 0,-1.115808 -0.599747,-2.161878 -1.527263,-2.161878 l -1.436602,0 c -0.111581,0 -0.285926,0 -0.285926,0.2161878 0,0.209214 0.181319,0.209214 0.285926,0.209214 l 0.153423,0 0,3.41018829 -0.153423,0 c -0.111581,0 -0.285926,0 -0.285926,0.2161878 C 11.248042,0 11.429361,0 11.533968,0 l 1.436602,0 c 0.913568,0 1.527263,-0.97633203 1.527263,-2.0991139 z m -0.481193,0 c 0,0.8159347 -0.40448,1.67371209 -1.178572,1.67371209 l -0.669485,0 0,-3.41018829 0.669485,0 c 0.78804,0 1.178572,0.9275154 1.178572,1.7364762 z" /></g><g
                     transform="translate(7.424,61.002)"
                     id="g112" /></g></g><g
                 transform="translate(-4.46,-52.433)"
                 id="g114" /></g></g><g
             id="g116"><path
               id="path118"
               style="fill:none;stroke:#808080;stroke-width:0.79701;stroke-linecap:butt;stroke-linejoin:miter;stroke-miterlimit:10;stroke-dasharray:0.79701, 0.99628;stroke-dashoffset:0;stroke-opacity:1"
               d="m 11.86998,43.43758 0,3.78585" /><g
               id="g120"><g
                 transform="matrix(0,-1,1,0,11.86998,43.43758)"
                 id="g122"><g
                   id="g124"><path
                     id="path126"
                     style="fill:#808080;fill-opacity:1;fill-rule:nonzero;stroke:#808080;stroke-width:0.79701;stroke-linecap:butt;stroke-linejoin:miter;stroke-miterlimit:10;stroke-dasharray:none;stroke-opacity:1"
                     d="M 4.53381,0 C 3.97704,0.13812 1.52963,0.92084 0,1.77261 L 0,-1.77261 C 1.52963,-0.92084 3.97704,-0.13812 4.53381,0 Z" /></g></g></g></g></g></g></g></g></svg>