\relax 
\providecommand\hyper@newdestlabel[2]{}
\@nameuse{bbl@beforestart}
\providecommand\HyperFirstAtBeginDocument{\AtBeginDocument}
\HyperFirstAtBeginDocument{\ifx\hyper@anchor\@undefined
\global\let\oldcontentsline\contentsline
\gdef\contentsline#1#2#3#4{\oldcontentsline{#1}{#2}{#3}}
\global\let\oldnewlabel\newlabel
\gdef\newlabel#1#2{\newlabelxx{#1}#2}
\gdef\newlabelxx#1#2#3#4#5#6{\oldnewlabel{#1}{{#2}{#3}}}
\AtEndDocument{\ifx\hyper@anchor\@undefined
\let\contentsline\oldcontentsline
\let\newlabel\oldnewlabel
\fi}
\fi}
\global\let\hyper@last\relax 
\gdef\HyperFirstAtBeginDocument#1{#1}
\providecommand\HyField@AuxAddToFields[1]{}
\providecommand\HyField@AuxAddToCoFields[2]{}
\AC@reset@newl@bel
\providecommand \oddpage@label [2]{}
\babel@aux{english}{}
\citation{hundt2020praktkium}
\@writefile{toc}{\contentsline {chapter}{\numberline {1}Introduction}{1}{chapter.1}\protected@file@percent }
\@writefile{lof}{\addvspace {10\p@ }}
\@writefile{lot}{\addvspace {10\p@ }}
\@writefile{loa}{\addvspace {10\p@ }}
\citation{Russell2016}
\citation{Russell2016}
\citation{Russell2016}
\citation{morgenstern1996multiple}
\citation{abdeddaim2000speeding}
\citation{hundt2020praktkium}
\@writefile{toc}{\contentsline {chapter}{\numberline {2}Basics}{3}{chapter.2}\protected@file@percent }
\@writefile{lof}{\addvspace {10\p@ }}
\@writefile{lot}{\addvspace {10\p@ }}
\@writefile{loa}{\addvspace {10\p@ }}
\@writefile{toc}{\contentsline {section}{\numberline {2.1}Multiple sequence alignment}{3}{section.2.1}\protected@file@percent }
\@writefile{lot}{\contentsline {table}{\numberline {2.1}{\ignorespaces Example of multiple sequence alignment. The gap symbol '-' represents an insertion or deletion (often combined as \textit  {indel}).\relax }}{3}{table.caption.4}\protected@file@percent }
\providecommand*\caption@xref[2]{\@setref\relax\@undefined{#1}}
\newlabel{tab:msa-example}{{2.1}{3}{Example of multiple sequence alignment. The gap symbol '-' represents an insertion or deletion (often combined as \textit {indel}).\relax }{table.caption.4}{}}
\newlabel{tab:msa-example@cref}{{[table][1][2]2.1}{[1][3][]3}}
\@writefile{toc}{\contentsline {section}{\numberline {2.2}Definition of Consistency and Alignments}{4}{section.2.2}\protected@file@percent }
\@writefile{thm}{\contentsline {mydef}{{Definition}{2.2.{1}}{Site}}{4}{mydef.2.2.1}\protected@file@percent }
\@writefile{thm}{\contentsline {mydef}{{Definition}{2.2.{2}}{Ordering of Sites}}{4}{mydef.2.2.2}\protected@file@percent }
\@writefile{thm}{\contentsline {mylemma}{{Lemma}{2.2.{1}}{Extension of binary relation to quasi order relation}}{4}{mylemma.2.2.1}\protected@file@percent }
\newlabel{lem:extension-quasiorder}{{2.2.{1}}{4}{Definition of Consistency and Alignments}{mylemma.2.2.1}{}}
\newlabel{lem:extension-quasiorder@cref}{{[mylemma][1][2,2]2.2.{1}}{[1][4][]4}}
\@writefile{thm}{\contentsline {mydef}{{Definition}{2.2.{3}}{Consistency}}{4}{mydef.2.2.3}\protected@file@percent }
\newlabel{def:consistency}{{2.2.{3}}{4}{Definition of Consistency and Alignments}{mydef.2.2.3}{}}
\newlabel{def:consistency@cref}{{[mydef][3][2,2]2.2.{3}}{[1][4][]4}}
\@writefile{thm}{\contentsline {mydef}{{Definition}{2.2.{4}}{Alignment}}{5}{mydef.2.2.4}\protected@file@percent }
\newlabel{def:alignment}{{2.2.{4}}{5}{Definition of Consistency and Alignments}{mydef.2.2.4}{}}
\newlabel{def:alignment@cref}{{[mydef][4][2,2]2.2.{4}}{[1][5][]5}}
\@writefile{lof}{\contentsline {figure}{\numberline {2.1}{\ignorespaces Example of an alignment graph representing a consistent equivalence relation $A$ on the set of sites $X$ for $S=\{S_1, S_2, S_3\}$. Undirected connections between nodes $x,y$ represent a relation $xAy$.\relax }}{5}{figure.caption.5}\protected@file@percent }
\newlabel{fig:consistent-alignment}{{2.1}{5}{Example of an alignment graph representing a consistent equivalence relation $A$ on the set of sites $X$ for $S=\{S_1, S_2, S_3\}$. Undirected connections between nodes $x,y$ represent a relation $xAy$.\relax }{figure.caption.5}{}}
\newlabel{fig:consistent-alignment@cref}{{[figure][1][2]2.1}{[1][5][]5}}
\citation{abdeddaim1997incremental}
\citation{morgenstern1996multiple}
\citation{abdeddaim2000speeding}
\citation{leimeister2014fast}
\citation{abdeddaim1997incremental}
\citation{abdeddaim2000speeding}
\@writefile{toc}{\contentsline {chapter}{\numberline {3}Prior Work}{7}{chapter.3}\protected@file@percent }
\@writefile{lof}{\addvspace {10\p@ }}
\@writefile{lot}{\addvspace {10\p@ }}
\@writefile{loa}{\addvspace {10\p@ }}
\@writefile{toc}{\contentsline {section}{\numberline {3.1}GABIOS-LIB}{7}{section.3.1}\protected@file@percent }
\@writefile{thm}{\contentsline {mydef}{{Definition}{3.1.{1}}{Transitivity frontiers as defined in \cite {abdeddaim2000speeding}}}{7}{mydef.3.1.1}\protected@file@percent }
\citation{abdeddaim1997incremental}
\newlabel{def:transi-frontiers}{{3.1.{1}}{8}{GABIOS-LIB}{mydef.3.1.1}{}}
\newlabel{def:transi-frontiers@cref}{{[mydef][1][3,1]3.1.{1}}{[1][8][]8}}
\newlabel{obs:frontier-relation}{{3.2}{8}{GABIOS-LIB}{equation.3.1.2}{}}
\newlabel{obs:frontier-relation@cref}{{[equation][2][3]3.2}{[1][8][]8}}
\citation{morgenstern1996multiple}
\citation{abdeddaim2000speeding,morgenstern1999dialign,sub:wey:kau:mor:05,sub:kau:mor:08,morgenstern2004dialign}
\citation{morgenstern2004dialign}
\citation{morgenstern1996multiple}
\@writefile{loa}{\contentsline {algocf}{\numberline {1}{\ignorespaces EdgeAddition(x, y) as proposed by Abdedda{\"\i }m \cite  {abdeddaim1997incremental}\relax }}{9}{algocf.1}\protected@file@percent }
\newlabel{alg:edge-addtition}{{1}{9}{GABIOS-LIB}{algocf.1}{}}
\newlabel{alg:edge-addtition@cref}{{[algocf][1][]1}{[1][8][]9}}
\@writefile{lof}{\contentsline {figure}{\numberline {3.1}{\ignorespaces Alignment graph visualizing for which nodes (highlighted in red) in sequence $i = 2$ with respect to sequence $j = 1$ the successor frontiers change due to the alignment of $(x, y)$.\relax }}{10}{figure.caption.7}\protected@file@percent }
\newlabel{fig:algo-exampl}{{3.1}{10}{Alignment graph visualizing for which nodes (highlighted in red) in sequence $i = 2$ with respect to sequence $j = 1$ the successor frontiers change due to the alignment of $(x, y)$.\relax }{figure.caption.7}{}}
\newlabel{fig:algo-exampl@cref}{{[figure][1][3]3.1}{[1][8][]10}}
\@writefile{toc}{\contentsline {section}{\numberline {3.2}Dialign}{10}{section.3.2}\protected@file@percent }
\citation{boden2013alignment}
\citation{ma2002patternhunter}
\citation{leimeister2014fast,leimeister2017fast,leimeister2018accurate}
\citation{ma2002patternhunter}
\citation{hundt2020praktkium}
\@writefile{toc}{\contentsline {section}{\numberline {3.3}Spaced Word Matches}{11}{section.3.3}\protected@file@percent }
\@writefile{lot}{\contentsline {table}{\numberline {3.1}{\ignorespaces Example of a Spaced Word Match\relax }}{11}{table.caption.8}\protected@file@percent }
\newlabel{tab:spaced-word}{{3.1}{11}{Example of a Spaced Word Match\relax }{table.caption.8}{}}
\newlabel{tab:spaced-word@cref}{{[table][1][3]3.1}{[1][11][]11}}
\@writefile{thm}{\contentsline {mydef}{{Definition}{3.3.{1}}{Pattern as defined in \cite {hundt2020praktkium}}}{11}{mydef.3.3.1}\protected@file@percent }
\@writefile{toc}{\contentsline {subsection}{\numberline {3.3.1}Multi dimensional matches}{11}{subsection.3.3.1}\protected@file@percent }
\@writefile{lot}{\contentsline {table}{\numberline {3.2}{\ignorespaces Example of a multi dimensional Spaced Word Match\relax }}{11}{table.caption.9}\protected@file@percent }
\newlabel{tab:multi-spaced-word}{{3.2}{11}{Example of a multi dimensional Spaced Word Match\relax }{table.caption.9}{}}
\newlabel{tab:multi-spaced-word@cref}{{[table][2][3]3.2}{[1][11][]11}}
\citation{hundt2020praktkium}
\citation{abdeddaim1997incremental}
\@writefile{toc}{\contentsline {chapter}{\numberline {4}Algorithm}{13}{chapter.4}\protected@file@percent }
\@writefile{lof}{\addvspace {10\p@ }}
\@writefile{lot}{\addvspace {10\p@ }}
\@writefile{loa}{\addvspace {10\p@ }}
\newlabel{chap:algorithm}{{4}{13}{Algorithm}{chapter.4}{}}
\newlabel{chap:algorithm@cref}{{[chapter][4][]4}{[1][13][]13}}
\@writefile{loa}{\contentsline {algocf}{\numberline {2}{\ignorespaces \bf  {align($S$, $P$)}\relax }}{13}{algocf.2}\protected@file@percent }
\newlabel{alg:align}{{2}{13}{Algorithm}{algocf.2}{}}
\newlabel{alg:align@cref}{{[algocf][2][]2}{[1][13][]13}}
\citation{abdeddaim2000speeding}
\citation{hundt2020praktkium}
\citation{hundt2020praktkium}
\citation{abdeddaim2000speeding}
\@writefile{loa}{\contentsline {algocf}{\numberline {3}{\ignorespaces add\_site\_pair(x, y) as proposed in \cite  {hundt2020praktkium}\relax }}{14}{algocf.3}\protected@file@percent }
\newlabel{alg:add-site-pair}{{3}{14}{Algorithm}{algocf.3}{}}
\newlabel{alg:add-site-pair@cref}{{[algocf][3][]3}{[1][14][]14}}
\citation{abdeddaim2000speeding}
\@writefile{lof}{\contentsline {figure}{\numberline {4.1}{\ignorespaces Since $a, b, c$ are aligned, their shared successor frontier towards sequence $3$ is at position $4$.\relax }}{15}{figure.caption.12}\protected@file@percent }
\newlabel{fig:eq-classes}{{4.1}{15}{Since $a, b, c$ are aligned, their shared successor frontier towards sequence $3$ is at position $4$.\relax }{figure.caption.12}{}}
\newlabel{fig:eq-classes@cref}{{[figure][1][4]4.1}{[1][15][]15}}
\newlabel{alg:add-site-pair-revised_data-dep}{{11}{16}{Algorithm}{AlgoLine.4.11}{}}
\newlabel{alg:add-site-pair-revised_data-dep@cref}{{[algocfline][4][]4}{[1][15][]16}}
\@writefile{loa}{\contentsline {algocf}{\numberline {4}{\ignorespaces revised add\_site\_pair(x, y) based on GABIOS-LIB implementation in Dialign2.2 \cite  {abdeddaim2000speeding}\relax }}{16}{algocf.4}\protected@file@percent }
\newlabel{alg:add-site-pair-revised}{{4}{16}{Algorithm}{algocf.4}{}}
\newlabel{alg:add-site-pair-revised@cref}{{[algocf][4][]4}{[1][15][]16}}
\@writefile{toc}{\contentsline {chapter}{\numberline {5}Implementation}{17}{chapter.5}\protected@file@percent }
\@writefile{lof}{\addvspace {10\p@ }}
\@writefile{lot}{\addvspace {10\p@ }}
\@writefile{loa}{\addvspace {10\p@ }}
\@writefile{lol}{\contentsline {listing}{\numberline {1}{\ignorespaces Data types responsible for storing transitive closure.\relax }}{17}{listing.1}\protected@file@percent }
\newlabel{lst:core-types}{{1}{17}{Data types responsible for storing transitive closure.\relax }{listing.1}{}}
\newlabel{lst:core-types@cref}{{[listing][1][]1}{[1][17][]17}}
\citation{hundt2020praktkium}
\citation{hundt2020praktkium}
\citation{thompson2005balibase,Russell2016}
\@writefile{toc}{\contentsline {chapter}{\numberline {6}Evaluation}{19}{chapter.6}\protected@file@percent }
\@writefile{lof}{\addvspace {10\p@ }}
\@writefile{lot}{\addvspace {10\p@ }}
\@writefile{loa}{\addvspace {10\p@ }}
\@writefile{toc}{\contentsline {section}{\numberline {6.1}BAliBASE 3 alignment benchmark dataset}{19}{section.6.1}\protected@file@percent }
\@writefile{lof}{\contentsline {figure}{\numberline {6.1}{\ignorespaces Semi automatic process used to establish the reference sets. Source: \cite  {hundt2020praktkium}\relax }}{19}{figure.caption.14}\protected@file@percent }
\newlabel{fig:balibase}{{6.1}{19}{Semi automatic process used to establish the reference sets. Source: \cite {hundt2020praktkium}\relax }{figure.caption.14}{}}
\newlabel{fig:balibase@cref}{{[figure][1][6]6.1}{[1][19][]19}}
\citation{thompson2005balibase}
\citation{thompson1999comprehensive}
\@writefile{toc}{\contentsline {subsection}{\numberline {6.1.1}Core blocks}{20}{subsection.6.1.1}\protected@file@percent }
\@writefile{lof}{\contentsline {figure}{\numberline {6.2}{\ignorespaces BAliBASE web interface. Black columns indicate core blocks. \href  {www.lbgi.fr/wscoperr?Balibase&FileMoi&macsimHtml&BB20006}{lbgi.fr}\relax }}{20}{figure.caption.15}\protected@file@percent }
\newlabel{}{{6.2}{20}{\bb web interface. Black columns indicate core blocks. \href {www.lbgi.fr/wscoperr?Balibase&FileMoi&macsimHtml&BB20006}{lbgi.fr}\relax }{figure.caption.15}{}}
\newlabel{@cref}{{[figure][2][6]6.2}{[1][20][]20}}
\@writefile{toc}{\contentsline {subsection}{\numberline {6.1.2}Quality of Alignments}{20}{subsection.6.1.2}\protected@file@percent }
\@writefile{toc}{\contentsline {section}{\numberline {6.2}Sum-of-pairs and column score}{20}{section.6.2}\protected@file@percent }
\@writefile{thm}{\contentsline {mydef}{{Definition}{6.2.{1}}{Sum-of-pairs score}}{20}{mydef.6.2.1}\protected@file@percent }
\citation{thompson1999comprehensive}
\@writefile{thm}{\contentsline {mydef}{{Definition}{6.2.{2}}{Column score}}{21}{mydef.6.2.2}\protected@file@percent }
\@writefile{toc}{\contentsline {section}{\numberline {6.3}Bali-Score}{21}{section.6.3}\protected@file@percent }
\citation{katoh2013mafft}
\@writefile{toc}{\contentsline {section}{\numberline {6.4}Evaluated programs}{22}{section.6.4}\protected@file@percent }
\@writefile{toc}{\contentsline {subsection}{\numberline {6.4.1}Mafft}{22}{subsection.6.4.1}\protected@file@percent }
\@writefile{toc}{\contentsline {subsection}{\numberline {6.4.2}Dialign}{22}{subsection.6.4.2}\protected@file@percent }
\@writefile{toc}{\contentsline {subsection}{\numberline {6.4.3}Spam-Align}{22}{subsection.6.4.3}\protected@file@percent }
\@writefile{toc}{\contentsline {section}{\numberline {6.5}Results}{22}{section.6.5}\protected@file@percent }
\@writefile{lof}{\contentsline {figure}{\numberline {6.3}{\ignorespaces Sum of pairs scores aggregated over BAliBASE reference sets and weights.\relax }}{23}{figure.caption.16}\protected@file@percent }
\newlabel{}{{6.3}{23}{Sum of pairs scores aggregated over \bb reference sets and weights.\relax }{figure.caption.16}{}}
\newlabel{@cref}{{[figure][3][6]6.3}{[1][22][]23}}
\@writefile{lof}{\contentsline {figure}{\numberline {6.4}{\ignorespaces Column scores aggregated over BAliBASE reference sets and weights.\relax }}{23}{figure.caption.17}\protected@file@percent }
\newlabel{}{{6.4}{23}{Column scores aggregated over \bb reference sets and weights.\relax }{figure.caption.17}{}}
\newlabel{@cref}{{[figure][4][6]6.4}{[1][22][]23}}
\@writefile{lof}{\contentsline {figure}{\numberline {6.5}{\ignorespaces Sum of pairs scores. Spam-Align is called with a pattern of weight 2 and 11 don't care positions.\relax }}{24}{figure.caption.18}\protected@file@percent }
\newlabel{}{{6.5}{24}{Sum of pairs scores. Spam-Align is called with a pattern of weight 2 and 11 don't care positions.\relax }{figure.caption.18}{}}
\newlabel{@cref}{{[figure][5][6]6.5}{[1][23][]24}}
\@writefile{lof}{\contentsline {figure}{\numberline {6.6}{\ignorespaces Column scores. Spam-Align is called with a pattern of weight 2 and 11 don't care positions.\relax }}{25}{figure.caption.19}\protected@file@percent }
\newlabel{}{{6.6}{25}{Column scores. Spam-Align is called with a pattern of weight 2 and 11 don't care positions.\relax }{figure.caption.19}{}}
\newlabel{@cref}{{[figure][6][6]6.6}{[1][24][]25}}
\@writefile{lof}{\contentsline {figure}{\numberline {6.7}{\ignorespaces Mean execution times in ms.\relax }}{25}{figure.caption.20}\protected@file@percent }
\newlabel{}{{6.7}{25}{Mean execution times in ms.\relax }{figure.caption.20}{}}
\newlabel{@cref}{{[figure][7][6]6.7}{[1][24][]25}}
\@writefile{toc}{\contentsline {chapter}{\numberline {7}Conclusion}{27}{chapter.7}\protected@file@percent }
\@writefile{lof}{\addvspace {10\p@ }}
\@writefile{lot}{\addvspace {10\p@ }}
\@writefile{loa}{\addvspace {10\p@ }}
\@writefile{toc}{\contentsline {section}{\numberline {7.1}Further work}{27}{section.7.1}\protected@file@percent }
\@writefile{toc}{\contentsline {subsection}{\numberline {7.1.1}Parallelisation Opportunities}{27}{subsection.7.1.1}\protected@file@percent }
\bibstyle{IEEEtran}
\bibdata{content/references}
\bibcite{hundt2020praktkium}{1}
\bibcite{Russell2016}{2}
\bibcite{morgenstern1996multiple}{3}
\bibcite{abdeddaim2000speeding}{4}
\bibcite{abdeddaim1997incremental}{5}
\bibcite{leimeister2014fast}{6}
\bibcite{morgenstern1999dialign}{7}
\bibcite{sub:wey:kau:mor:05}{8}
\bibcite{sub:kau:mor:08}{9}
\bibcite{morgenstern2004dialign}{10}
\bibcite{boden2013alignment}{11}
\bibcite{ma2002patternhunter}{12}
\bibcite{leimeister2017fast}{13}
\bibcite{leimeister2018accurate}{14}
\bibcite{thompson2005balibase}{15}
\bibcite{thompson1999comprehensive}{16}
\bibcite{katoh2013mafft}{17}
\@writefile{toc}{\contentsline {chapter}{Bibliography}{30}{chapter*.21}\protected@file@percent }
\gdef\minted@oldcachelist{,
  default-pyg-prefix.pygstyle,
  default.pygstyle,
  E45B7A2F8516CEB9E6C0335946DA76A3831DF6070A77E5FC48DB169574AF7604.pygtex,
  7077F45393D6EDC8B367C73348C830150236DA2DB8B0B014C4E4FF3372C44164.pygtex,
  507F1378CDC43B085FF9B2F030E2B56D0236DA2DB8B0B014C4E4FF3372C44164.pygtex,
  D2CD4AAF21EC908398737F330808A96D0236DA2DB8B0B014C4E4FF3372C44164.pygtex,
  D2CD4AAF21EC908398737F330808A96D0236DA2DB8B0B014C4E4FF3372C44164.pygtex,
  65EF90DCAC1CF0B8197A4A4A85102D370236DA2DB8B0B014C4E4FF3372C44164.pygtex,
  82FA795FB3CD6A2C7DA34E94F55A37440236DA2DB8B0B014C4E4FF3372C44164.pygtex}
