13.4403680000,72.4065100000,25.1731400000,30.0421310000,24.4988120000,61.2679570000,694.4787390000,217.9463960000,18.1174940000,27.4061660000,46.3020560000,68.7604760000,21.4360140000,229.2220150000,479.9995530000,31.2207000000,994.2970310000,9938.1646080000,24.1376690000,47.4990430000,3894.4761310000,447.4572760000,38.9770390000,4937.9419230000,24.1429790000,978.0410940000,189.1621320000,95.0626770000,15.1575490000,924.3106870000,22.6658630000,88.6436850000,20.7041100000,30.7220430000,55.8811140000,55.1504400000,70.8419140000,11756.5713960000,85.9305560000,36.1354100000,3833.8505990000,13.4611400000,73.5184620000,1564.9242570000,2163.4743490000,721.7648900000,25.3423090000,32.7863690000,73.1612180000,102.2584930000,642.9135550000,26.9923630000,20.8462080000,82.5214760000,94.4761010000,63.4572140000,28.3292450000,213.1392180000,338.5311520000,55.3742790000,29.3016460000,47.6139560000,514.9760670000,20.4281250000,31.8317720000,44.2254800000,16.5808360000,39.3775530000,193.3316030000,16.3025190000,27.3059700000,16.9049870000,20.4295560000,317.0893110000,49.8119620000,29.2173980000,541.5638240000,23.1374640000,28.3675080000,16.8514120000,122.1704650000,17.1587980000,555.8783240000,119.5623560000,600.1416840000,577.3684770000,132.5568020000,36.6407480000,75.0265880000,78.2998390000,19.1059440000,62.7986480000,25.6633130000,15.1213590000,355.0917770000,19.9067250000,42.5893150000,25.3257220000,29.7675980000,32.5726940000,44.8485170000,34.3602590000,15.4425340000,187.2025520000,161.7092330000,17.5070400000,303.3317190000,600.2724060000,26.9896380000,12.3463980000,17.8728080000,600.0492080000,49.9230360000,497.0656140000,57.7783920000,188.5145120000,23.9134870000,340.2083970000,40.0476240000,73.1246820000,30.3321800000,31.3490060000,600.0140870000,77.1986630000,17.7369930000,507.4428780000,19.8087930000,600.2828570000,14.9354990000,73.6132430000,20.3675480000,72.9583900000,261.6612340000,292.9805530000,33.7533970000,600.1073770000,49.5159500000,14.3604320000,34.8731520000,454.2280910000,40.5998500000,16.1412620000,514.8320850000,142.4857340000,600.2813370000,17.8497220000,11.6728970000
72.4065100000,-1.0000000000,77.8095880000,79.8715660000,73.8143730000,115.0463900000,711.1360980000,255.5471620000,69.5181210000,75.9664410000,92.8491610000,110.4275620000,69.2029880000,279.5805650000,501.8599720000,73.6992880000,914.4088150000,8477.6430250000,77.2293410000,80.6851910000,3270.3740620000,372.0662240000,77.3387590000,4590.7902630000,71.5113710000,929.4956270000,202.2998910000,145.6092500000,70.0297970000,839.0129710000,78.9994410000,132.6160330000,68.0282640000,66.1981750000,102.7433480000,96.3293080000,120.5075120000,10102.1342030000,144.4498370000,89.8096800000,3477.0822060000,64.8146230000,118.8774450000,20013.1448150000,2081.5160370000,765.6123850000,81.8169680000,88.7685760000,121.9633780000,188.0913000000,677.9613950000,80.7467680000,73.7689600000,125.9795890000,140.3957570000,104.3906480000,84.9880620000,249.2036220000,278.2124040000,102.9934070000,76.3483580000,86.8648780000,545.8454610000,68.4569180000,78.8590310000,90.3671210000,66.9053360000,83.0887110000,226.6643110000,70.9369410000,76.6168930000,66.1352520000,67.0823450000,375.2872320000,108.8657320000,76.3096120000,541.1226190000,69.8603880000,79.4590280000,68.6723010000,186.5267640000,65.9832870000,501.4753640000,157.5807240000,600.1903330000,589.2403150000,194.8501970000,90.4801420000,146.1229300000,132.6339820000,73.7226640000,112.4730520000,81.2511340000,68.2804320000,369.8158850000,68.4537500000,90.8260740000,73.2783180000,88.2869570000,87.8950940000,96.0313010000,86.2120050000,82.7583080000,238.4414250000,201.0204040000,73.2288920000,388.2520040000,600.4785030000,70.6990120000,67.4532720000,73.4031210000,600.0530160000,129.5627430000,539.6189190000,115.7885500000,239.5976760000,78.7092940000,410.4481140000,96.3186390000,116.0365360000,86.3124980000,86.6145920000,600.1174670000,123.5007980000,76.3652230000,501.2879950000,73.8280790000,600.2077330000,64.6479850000,159.7857840000,70.1940150000,130.7253240000,356.6935390000,379.4883830000,90.3890540000,600.2957390000,111.2863990000,70.0315020000,84.6414000000,471.6931430000,84.9202220000,72.8102050000,553.0471320000,199.8233650000,600.0237620000,68.3651260000,66.6421370000
25.1731400000,77.8095880000,-1.0000000000,36.9487530000,29.0118000000,75.6165180000,662.9796910000,240.6481130000,28.6445270000,39.1643260000,52.2696430000,83.0717900000,36.2139920000,262.7902010000,499.8300140000,43.0008780000,935.9662300000,9060.9983920000,35.2057320000,45.9078550000,3522.9630760000,445.7927720000,56.7860910000,4666.1276460000,36.4487850000,909.2037190000,200.5928400000,108.1799150000,37.9390210000,877.8363210000,31.5781380000,107.4445630000,31.3331580000,42.6562410000,69.7641440000,71.0072700000,87.5246110000,10530.6064680000,99.4675470000,51.6043720000,3366.0378140000,20.7003520000,116.8033140000,1757.8898080000,2109.5878500000,737.5195140000,36.0466960000,43.3960390000,85.1950560000,110.7786610000,659.5939120000,37.7211670000,31.2440640000,92.2461260000,112.3487210000,61.7770510000,42.1717570000,254.5752050000,360.8882410000,69.1515190000,40.0390960000,55.8579190000,521.4149360000,32.4499340000,42.2091310000,54.8769350000,25.4298490000,44.3483610000,192.5005690000,27.0389210000,32.6895020000,26.9506770000,30.1031950000,320.7461600000,65.3093300000,39.1928560000,484.9943950000,32.7241640000,39.8524810000,27.2901800000,128.7604150000,27.0660610000,441.5503450000,136.8681240000,600.2558350000,600.2618490000,133.6543180000,47.5419070000,96.6935490000,83.2236270000,28.1841320000,77.6062540000,36.0897200000,25.7559820000,362.5598710000,29.7378180000,54.7058240000,35.9127820000,35.5107590000,38.1688680000,55.2294160000,42.6125740000,23.1033090000,219.8881730000,171.8612550000,28.3001480000,310.1771500000,600.1959670000,35.4341360000,20.9623450000,27.9530790000,600.1189130000,57.5841050000,485.3350010000,70.1957470000,211.4319210000,34.7790170000,337.6585710000,52.0090280000,81.4969580000,41.7763820000,42.0952950000,600.2436360000,82.9221680000,27.4297110000,511.4229090000,27.7690690000,600.4943420000,22.7877760000,83.3925880000,29.1133380000,88.0253730000,272.7794210000,318.1671430000,45.5487490000,600.0109740000,64.5143230000,24.9237540000,42.2115060000,470.1654620000,42.1594800000,25.3694230000,508.3961600000,143.4796700000,600.2339110000,24.1041370000,24.1316640000
30.0421310000,79.8715660000,36.9487530000,-1.0000000000,36.6220540000,52.4784260000,767.2671800000,156.0269340000,28.4761390000,29.4739830000,52.3345440000,69.1615020000,22.2620760000,175.8651890000,422.9419560000,32.3970090000,879.4356480000,8833.4789080000,32.9247350000,30.3131810000,3232.0557120000,313.6070510000,26.4587100000,4519.5006610000,23.9551420000,882.6812480000,124.8303010000,77.2698420000,20.6929850000,855.8777500000,34.7756960000,74.4251660000,20.3957050000,23.1704100000,46.9074030000,58.8770280000,56.9904690000,10109.1727370000,73.7342400000,36.3248070000,3241.8963070000,22.4839770000,73.8177180000,1557.8730140000,1951.5364840000,745.7505910000,27.9976990000,42.4270700000,77.1313110000,118.4893540000,663.3923330000,28.7851170000,23.2139690000,64.2271970000,82.5741650000,70.5361910000,41.8282160000,228.3611830000,212.4447660000,45.7332820000,39.6394970000,44.4499800000,576.2828400000,21.0526240000,28.8376600000,44.2485510000,27.7063080000,46.5512010000,194.4404120000,25.6406600000,39.5229200000,19.1509960000,25.4232380000,353.0343380000,47.3176550000,30.3883330000,490.9141190000,25.8871920000,28.8289750000,20.2316770000,134.9974450000,19.0707330000,463.0706080000,105.9184410000,600.3994260000,495.8873090000,146.9148660000,36.9780390000,79.6498320000,86.5747380000,23.7012600000,53.2409200000,32.4125880000,19.6204460000,237.5101420000,25.0762200000,37.9546110000,24.0133540000,45.2044950000,46.9263010000,50.7817720000,33.9163220000,34.9555070000,158.4560460000,118.7050220000,23.0097730000,328.5119960000,600.1486280000,35.5587400000,19.5625490000,26.4600230000,600.1368230000,70.9406060000,490.8756420000,58.2700850000,147.2680000000,28.6966640000,343.5782710000,42.0494270000,63.5088820000,33.6282020000,33.5036480000,600.3305240000,86.2366720000,25.3177320000,478.2731620000,34.3904230000,600.3006630000,19.2538320000,99.8346090000,29.4277180000,63.7230140000,290.6912880000,319.8472380000,36.6949520000,600.1504450000,51.0124350000,21.5754510000,47.1852810000,429.3259110000,51.3382260000,22.6486080000,527.3551280000,150.6758620000,600.4550060000,24.4060670000,27.8020420000
24.4988120000,73.8143730000,29.0118000000,36.6220540000,-1.0000000000,68.6019390000,650.0876020000,235.8079240000,23.5096360000,34.8329630000,44.3941960000,69.8961830000,24.5563320000,248.0723730000,487.9878990000,32.3206860000,914.8377270000,9182.5932980000,29.0758740000,38.9839500000,3410.1281690000,293.3098640000,32.4631780000,4586.2321180000,28.7540660000,891.9884280000,173.4382460000,106.7481230000,20.1721190000,858.5310090000,24.4697130000,93.0553490000,24.8352620000,25.0435340000,62.0138470000,61.4733630000,77.0829840000,10440.1104710000,97.6762300000,43.3241480000,3220.1665160000,21.8200350000,82.7777310000,1755.6755220000,2061.3932140000,735.0899900000,32.5697870000,42.7452930000,69.4664610000,103.3796000000,650.4524320000,32.2159810000,27.1137370000,93.6742820000,106.0832680000,62.8615070000,34.8505750000,217.8092690000,252.0398360000,60.6850730000,32.0431060000,48.5280930000,502.1015380000,23.6797090000,35.4705710000,48.6085810000,20.8765620000,36.2889560000,179.7411300000,29.1913190000,33.4856990000,22.1936290000,24.2763280000,319.3521580000,59.9190290000,34.2175540000,472.1138480000,27.4829940000,35.1436360000,22.1533190000,121.8822790000,22.5234290000,428.1521400000,121.6097040000,600.4757630000,600.2357870000,133.2481100000,48.0678480000,87.3276090000,74.5611560000,28.9810570000,71.5092640000,35.7486810000,19.7160820000,341.8893150000,23.5759370000,49.3098370000,29.5868990000,35.0887730000,39.1368810000,54.7918220000,43.0542090000,23.6199160000,227.7092890000,168.4711270000,26.4584420000,306.6677820000,600.0014570000,37.6081580000,21.8990180000,27.5428090000,600.5049750000,59.3447980000,480.4960830000,68.6073900000,208.6418740000,34.8590680000,333.3123080000,52.6391960000,80.6705640000,41.5826830000,42.6901070000,600.2268680000,81.2318080000,28.2352590000,508.0017190000,27.7145580000,600.0991730000,24.1451350000,82.6014100000,30.5533480000,87.6459410000,274.3276140000,316.4049350000,45.8841990000,600.0676260000,65.0601860000,23.9781780000,43.5523510000,459.2744530000,42.6819270000,25.6068120000,505.6456140000,143.6338450000,600.2732880000,24.7201230000,22.7254680000
61.2679570000,115.0463900000,75.6165180000,52.4784260000,68.6019390000,-1.0000000000,840.3095770000,181.0383630000,64.6638080000,56.7099110000,96.3789060000,121.2056960000,51.1320310000,204.8271980000,515.4238210000,68.4823620000,948.3847410000,9051.5365020000,88.0299400000,54.1846660000,3654.4404230000,567.0760460000,48.3146680000,4677.0991370000,60.0268930000,1049.0341260000,143.2282280000,109.4881560000,49.2385330000,923.5170070000,113.2982950000,112.4694520000,41.2669530000,56.6570800000,65.9184160000,96.5660190000,100.4757980000,10759.5232090000,80.3040740000,54.2613010000,3651.7423570000,36.0862060000,156.0465160000,1627.2778200000,2622.7222780000,837.1397470000,47.7516300000,69.4256720000,129.0879670000,193.7545500000,731.3046000000,54.5305470000,43.7067950000,93.9769390000,114.8566890000,107.2317060000,86.2036850000,318.9213680000,343.4409440000,107.7969080000,79.3746100000,111.5834660000,745.6851600000,46.5236860000,49.1449280000,84.5152260000,65.1947390000,89.6682590000,248.6188040000,37.6546890000,75.5342960000,44.9062180000,59.3483550000,407.4244910000,66.1759200000,62.1628900000,582.0116020000,56.6467700000,47.1446170000,48.8201590000,190.4767710000,44.3253950000,555.9973980000,149.6701220000,600.0337700000,559.9452960000,194.1554120000,60.6269510000,110.0918170000,136.5987510000,42.9670100000,82.0878560000,57.4529550000,48.4163110000,249.3753540000,59.6608900000,59.3587290000,54.8163220000,85.9842570000,82.0885920000,79.7665070000,59.7945660000,71.4327350000,170.1275470000,161.8020400000,38.2989760000,489.1087300000,600.0127820000,65.9055350000,42.5940340000,50.8247410000,600.3027190000,120.5053370000,550.8037530000,91.1681660000,177.8502300000,46.4457940000,415.5347180000,53.2389640000,98.3410010000,52.3500620000,50.0863440000,600.0486420000,120.0296680000,48.2118920000,529.7022890000,66.5039340000,600.0282630000,42.0342770000,150.7859560000,57.2186870000,76.2552520000,358.4527190000,491.4463510000,48.1245170000,600.2303080000,69.2425770000,36.6349650000,78.3808710000,526.6672340000,86.8663370000,41.7211010000,600.0250310000,201.2844170000,600.0157990000,70.0111000000,102.0139940000
694.4787390000,711.1360980000,662.9796910000,767.2671800000,650.0876020000,840.3095770000,-1.0000000000,993.3319320000,711.5534080000,757.5571530000,655.1671650000,758.8922700000,807.9043330000,1060.3432380000,1204.0021140000,659.3989670000,1325.7073820000,9431.5435000000,689.4874430000,781.3413070000,4352.2070670000,1199.3049700000,1067.7721950000,4885.7995750000,776.6427910000,1400.0139300000,891.7959760000,869.9028000000,818.1976740000,1568.8651890000,711.2241650000,735.0545360000,1025.7044500000,645.5447040000,1130.9159080000,710.7145170000,1099.8714250000,11421.6059200000,873.1902650000,1068.5788090000,4221.7579970000,1109.4630200000,750.3388630000,2339.8053890000,2654.3504190000,1084.5060390000,803.1431430000,419.6540280000,480.5874880000,718.8586670000,1070.3791550000,452.0322180000,471.1794070000,515.3467530000,446.9523140000,433.3799190000,399.3621930000,591.9990700000,550.0786540000,535.7900500000,406.8399080000,432.0284210000,1009.6542460000,473.8066760000,482.5911340000,485.4342690000,406.3253480000,412.7656250000,473.4798310000,554.0117290000,600.5483510000,476.1190520000,416.5667500000,600.0013240000,600.3057060000,421.9917940000,600.0425260000,429.4751920000,491.6862040000,447.4870700000,581.2609130000,466.5440200000,600.0336410000,590.0139200000,600.1024200000,600.3611760000,524.3398730000,488.9545480000,449.1315580000,460.5747800000,472.9540950000,600.0013920000,452.0784000000,432.8271810000,600.3124740000,433.9742220000,511.0057940000,457.7316770000,407.6414350000,473.1638760000,453.3726810000,443.1277090000,407.2839130000,600.0604000000,504.3622150000,499.8748860000,600.0706630000,600.2014030000,436.2794540000,436.8579530000,438.9405440000,600.2400330000,541.1812260000,600.2377750000,448.8078700000,600.2652220000,465.6281190000,600.1346400000,505.0016920000,446.1906140000,483.0958500000,530.6931100000,600.0370280000,559.7694720000,445.5499090000,600.1738710000,490.3951270000,600.0112530000,450.1997810000,571.2583500000,434.6341310000,600.1911820000,600.2370300000,600.0233530000,544.1611070000,600.0133540000,509.7348850000,522.8705530000,474.8753260000,600.1449920000,445.4315760000,458.5450970000,600.1428390000,600.0634500000,600.0608340000,466.2267500000,395.7478320000
217.9463960000,255.5471620000,240.6481130000,156.0269340000,235.8079240000,181.0383630000,993.3319320000,-1.0000000000,220.3675260000,174.3939770000,277.7733660000,251.1589190000,175.8323060000,301.0257000000,594.3705330000,219.6085340000,1034.1098400000,8548.6984290000,300.2960650000,152.3627900000,3500.3106000000,644.2601810000,160.1110490000,4632.1601190000,219.9027280000,1096.2296400000,246.2070870000,220.1434990000,183.3131580000,1006.0444390000,270.9301780000,231.2201790000,154.9099880000,263.4991900000,175.9744550000,230.2934610000,190.5035290000,10165.6759580000,189.5397160000,180.0714180000,3439.5587690000,151.4230960000,358.2874110000,1679.2522180000,2687.9857360000,988.6296020000,169.3739130000,210.1602100000,311.1421740000,498.1384310000,856.5025260000,171.2389190000,161.5575810000,190.9538370000,240.0151340000,267.7054500000,304.1160550000,480.0997490000,530.3489320000,189.9640180000,241.6647950000,211.5762180000,600.0501970000,166.2885050000,163.2096740000,216.2382680000,328.1027230000,256.9953370000,412.7066710000,146.2980380000,234.8375980000,154.8427990000,195.0669580000,583.8498490000,193.3832810000,188.4244980000,480.5774700000,185.6902230000,161.9741670000,170.9736780000,423.8600100000,154.0827770000,600.0209570000,273.7365310000,600.0672390000,463.4708940000,402.4062430000,167.6276730000,271.9943970000,338.5808250000,143.7565770000,195.7980800000,183.6651110000,173.2754580000,356.3143380000,202.3296340000,163.1483010000,175.3218370000,269.4423350000,250.6395290000,210.0255520000,177.6235740000,277.8958560000,274.9801900000,267.7515920000,150.8215540000,600.0118440000,600.1354720000,194.9789140000,162.1824050000,179.0529920000,600.1943700000,363.8721430000,600.0467070000,221.7931460000,275.6791520000,155.6648720000,600.0738720000,166.4933300000,205.2527980000,156.7276890000,156.7321950000,600.2354930000,272.9334870000,173.6077140000,600.1730460000,230.1778270000,600.2071330000,151.4315820000,421.5623580000,191.5804320000,187.2232210000,600.0432410000,600.0302100000,165.8047880000,600.0362090000,177.2230610000,153.4641250000,228.6969530000,599.8919820000,246.9238350000,153.4998660000,600.0934730000,396.3757180000,600.0514800000,151.9986420000,207.2263100000
18.1174940000,69.5181210000,28.6445270000,28.4761390000,23.5096360000,64.6638080000,711.5534080000,220.3675260000,-1.0000000000,31.1349530000,48.6456070000,69.0349880000,22.1202830000,248.3133440000,518.4488940000,34.5062490000,1019.2717200000,9960.6006470000,39.0300410000,49.2979900000,4009.1013540000,333.3335110000,43.9106840000,5081.8704190000,28.4366780000,1028.7408950000,192.8606790000,103.3356770000,20.8843520000,975.4288250000,27.8003260000,99.6958270000,23.6271490000,25.5054800000,59.6150800000,61.3593710000,76.5592170000,11965.0040600000,93.0365940000,40.1284050000,856.5778630000,13.6884060000,73.8152080000,1550.2233370000,2232.7172040000,734.2300890000,29.4601150000,35.7728240000,79.3837960000,107.1101910000,646.8860260000,30.6301910000,23.9345870000,85.8512420000,92.3785090000,62.3251500000,33.7867780000,217.3991940000,342.9691080000,61.2583580000,35.8293190000,48.9216320000,521.4930710000,32.6647080000,35.3609890000,62.9628860000,22.1309280000,43.4109130000,204.1596700000,19.8156590000,31.0186170000,20.1669940000,23.7862150000,324.5549560000,53.3874090000,32.8344770000,588.6103480000,26.9423140000,31.7243320000,20.4796440000,129.0687010000,20.1510130000,440.7739610000,125.7437320000,600.2976970000,588.9075500000,141.0927190000,40.4043870000,84.1794530000,86.2950270000,21.7957250000,66.7330100000,29.0960620000,18.6264780000,367.6659430000,23.1486060000,46.2257490000,29.1575220000,33.8606680000,35.9188180000,49.3058270000,36.8062530000,19.5619350000,185.9660020000,169.5770780000,21.4099800000,312.2852460000,600.2235470000,29.6453230000,15.6671760000,21.7500820000,600.4774150000,54.3691200000,523.7719630000,62.6322620000,191.4185720000,27.1657130000,356.7136200000,43.6051840000,78.8739790000,34.2741770000,34.0338310000,600.1051660000,82.8952350000,20.8390810000,512.7932600000,22.9092420000,600.7889950000,17.4100860000,79.9524440000,23.4491870000,77.5439680000,273.1678820000,297.7452330000,36.7723570000,600.1254850000,53.6149200000,18.3005980000,37.8538810000,488.2245980000,44.2645070000,19.1890790000,505.5704160000,148.9337450000,600.0781620000,22.3151310000,16.7457210000
27.4061660000,75.9664410000,39.1643260000,29.4739830000,34.8329630000,56.7099110000,757.5571530000,174.3939770000,31.1349530000,-1.0000000000,63.4867150000,93.2778380000,25.9629050000,181.7767280000,413.9366100000,41.4920300000,911.8172140000,9456.0027770000,30.6134260000,49.9641150000,3246.6157590000,341.4114010000,45.8418840000,4559.8396020000,30.7598930000,890.2717930000,136.6563250000,77.2386350000,21.6313720000,849.9507410000,40.4422650000,118.9761490000,36.2369550000,30.1276380000,55.2057400000,70.4602870000,60.1607310000,10563.6764320000,72.9756680000,35.8139530000,3225.0952520000,24.7980160000,83.3907870000,1569.2351850000,1980.8202040000,745.2221120000,27.0229550000,46.8918820000,89.3168660000,127.1935770000,681.0792030000,32.1886380000,26.9170430000,64.6991970000,90.1438210000,72.5829870000,42.3392700000,233.8196620000,317.2859200000,48.9122940000,43.7804110000,56.7107890000,588.7615560000,25.5707400000,33.9247220000,51.2836720000,33.6088550000,53.5627790000,196.3516570000,22.3588770000,43.0777620000,25.0374920000,32.1625010000,355.2281460000,48.2776560000,35.2721180000,489.7322900000,30.3679010000,32.2169840000,23.5095810000,138.9389320000,24.5687410000,447.2239260000,116.9176200000,600.1115640000,521.3355490000,145.0715100000,36.6759490000,78.1742740000,92.8793350000,25.1742860000,56.5594830000,31.3572380000,22.9923390000,261.1957040000,30.7994970000,40.6618480000,29.7077580000,45.5272300000,45.3145320000,51.4251680000,32.5392550000,32.2319610000,158.0062520000,120.3530880000,23.4038350000,325.3398310000,600.2024840000,40.1357470000,20.1310230000,25.4011920000,600.4632840000,70.4592500000,491.8328180000,55.5124040000,150.6008020000,25.8122580000,346.7453900000,39.0498460000,69.5791580000,33.1593420000,30.3387380000,563.2812260000,90.8017570000,21.0166600000,491.4568330000,33.6203360000,600.0623580000,21.1011150000,95.9751970000,30.5994460000,61.7814470000,293.6907820000,344.1434310000,35.2836960000,600.3468380000,48.6626670000,21.0673570000,47.9442490000,443.2358140000,52.7978650000,22.6487270000,541.9491120000,158.4677660000,600.3007750000,22.3860450000,25.4074400000
46.3020560000,92.8491610000,52.2696430000,52.3345440000,44.3941960000,96.3789060000,655.1671650000,277.7733660000,48.6456070000,63.4867150000,-1.0000000000,123.5859440000,47.5971140000,307.4155260000,572.8835620000,62.8752030000,881.2330510000,9332.9600010000,58.4280850000,94.7584870000,3973.1291190000,317.9893160000,67.3006480000,4520.2709110000,58.1666510000,934.4060790000,224.2335880000,145.5241740000,53.3030660000,996.3219620000,67.3771110000,129.4489710000,56.7890980000,51.2383900000,106.6959330000,92.7268640000,115.9976770000,11252.9044950000,125.0963250000,89.0066080000,3752.8610170000,45.2816290000,110.0353250000,2005.7372630000,2060.6791390000,757.9508720000,62.3022700000,63.4381670000,90.3484290000,133.8011260000,706.7724670000,61.5713090000,51.9294850000,113.1108580000,127.7922180000,85.3194590000,82.4870970000,244.5355430000,440.9414440000,94.6200990000,61.3755420000,78.0247190000,542.6401400000,48.8828590000,66.2901040000,81.3050630000,45.6938160000,64.4864910000,209.8350540000,50.9379570000,47.2715770000,49.4620980000,48.7168250000,328.6672710000,96.5792820000,58.8828380000,556.3328960000,52.5439130000,61.0206830000,46.4812340000,143.4343470000,46.7527110000,477.3483400000,162.8075040000,600.3434030000,423.2905840000,146.3713310000,67.5705350000,136.5637050000,96.9383630000,46.1346190000,100.5556720000,55.0501170000,45.5225910000,425.1383640000,49.6687900000,78.6925220000,56.4794640000,52.3481360000,54.1318160000,76.3973550000,63.9025930000,39.4063660000,268.7419740000,209.9552410000,46.3711060000,329.7038440000,600.0120990000,51.9266610000,38.9710870000,47.3098280000,600.0276750000,76.2027510000,489.2964940000,94.0047300000,242.0160660000,56.6669710000,348.3779120000,72.8048530000,104.1874790000,65.2243300000,62.3883460000,600.2042630000,96.1310770000,48.1837590000,565.7681390000,47.8579190000,600.1076170000,40.0072380000,108.0397860000,47.7413640000,116.7127430000,284.0120200000,330.9783890000,66.5906890000,600.0462600000,92.2427830000,44.1686760000,61.5356140000,544.4569620000,62.7129300000,44.2463650000,570.6677140000,156.3111920000,600.0215930000,62.5657060000,56.0478140000
68.7604760000,110.4275620000,83.0717900000,69.1615020000,69.8961830000,121.2056960000,758.8922700000,251.1589190000,69.0349880000,93.2778380000,123.5859440000,-1.0000000000,68.3646570000,288.3760490000,524.1022900000,74.9607980000,978.6997010000,9182.9674010000,104.6680160000,113.5403640000,3783.7910960000,563.5815100000,101.4099840000,4803.5517810000,70.6583440000,1030.1838320000,225.4769430000,151.5324960000,67.7094500000,961.7984280000,81.2699630000,138.1043390000,69.1472590000,69.2787710000,98.1369160000,97.5567600000,157.9894320000,11135.7624910000,126.0438960000,88.0546860000,3968.1651440000,53.0843090000,118.7559240000,1608.1583710000,2190.6161880000,851.6192470000,79.4060440000,79.6761720000,135.0263220000,191.5784220000,739.6463660000,77.1016810000,68.2228890000,121.4457240000,143.9256150000,108.4748950000,110.6980690000,334.0228450000,372.2147170000,141.1029460000,89.2635520000,93.5634930000,669.3674800000,92.8741460000,79.6255790000,115.5838060000,67.7760830000,91.1145710000,256.1031900000,60.4391430000,77.3192740000,66.0834840000,66.1637510000,384.5965360000,102.2767300000,76.2819900000,583.5778830000,69.6938870000,75.5812640000,63.3817200000,195.7221410000,63.5429680000,533.1884340000,154.6860070000,600.1330610000,600.0891120000,199.6975380000,77.3654060000,147.0449660000,138.6872470000,61.1861480000,109.8265190000,67.0503980000,65.0139640000,393.1004520000,65.7166210000,89.2615550000,71.7968640000,85.1190850000,84.9670110000,85.7555540000,79.3245300000,73.3717940000,278.3296010000,212.1221700000,59.9206900000,385.2655790000,600.2761660000,67.7961760000,56.6624810000,61.5343970000,600.1491120000,123.2851600000,572.4641270000,109.7235200000,217.5678650000,69.8168590000,421.9354180000,84.4072920000,115.2735160000,78.5512820000,76.3866730000,600.0382830000,121.6169590000,63.7844790000,527.6478990000,66.9501660000,600.4941580000,56.7218350000,159.7789760000,64.3666570000,124.1208030000,358.7507030000,429.9654350000,77.7310560000,600.2158660000,104.2798560000,58.4871800000,79.3469290000,492.1825530000,88.8248010000,60.4504170000,600.0375820000,200.9778540000,600.0177030000,58.7448460000,57.7023560000
21.4360140000,69.2029880000,36.2139920000,22.2620760000,24.5563320000,51.1320310000,807.9043330000,175.8323060000,22.1202830000,25.9629050000,47.5971140000,68.3646570000,-1.0000000000,190.7418600000,465.9486310000,33.3499590000,923.0398710000,9722.3642760000,27.3030710000,30.7909220000,3618.9375460000,466.7604870000,35.8141310000,4739.4568540000,23.3937610000,959.1688340000,142.1009100000,87.2568620000,18.5824200000,930.3976500000,44.3015140000,116.3213640000,28.1959150000,23.9690130000,48.3221630000,61.7397950000,59.1269970000,10922.0069480000,69.0874310000,37.7544640000,3600.1481640000,11.0324600000,103.9441560000,1553.6735020000,2075.1775970000,739.3300520000,22.5275350000,33.6632970000,81.3494220000,111.0825580000,661.2691330000,24.6047830000,19.7016760000,65.6923980000,81.1473450000,62.5761910000,44.9653690000,259.1281940000,296.0806770000,47.3226100000,36.5437680000,45.9650890000,584.4370370000,27.2334120000,28.9608650000,45.0098700000,22.4998300000,44.5135910000,202.3067680000,15.5646480000,31.8427830000,17.5786540000,23.1095340000,353.0584870000,43.1361000000,28.9800600000,529.6683120000,23.8355840000,25.9037590000,16.9833560000,129.0111680000,17.0357940000,456.5467010000,113.9896210000,600.3077390000,524.0710010000,141.9732000000,32.1307170000,74.4043150000,84.5597660000,17.1415450000,53.0348580000,25.3834440000,15.6575590000,273.5189370000,22.9990280000,36.7310420000,24.5970730000,35.8644190000,37.4561350000,45.9049610000,28.1384890000,21.2661110000,150.8708820000,127.0346590000,16.9968180000,322.0935290000,600.0155790000,30.7995310000,12.6097770000,18.7095850000,600.1132750000,56.8434800000,500.8930260000,52.8100520000,149.3029940000,22.1938720000,343.0319200000,34.1035000000,65.8197890000,27.8817100000,26.4536010000,572.8661860000,81.2002360000,17.0516680000,504.2017720000,24.7872530000,600.1544450000,13.7882930000,82.7544840000,22.4118000000,59.7104220000,274.1280090000,323.7677700000,29.1420800000,600.4631870000,43.3360030000,14.6364740000,39.0872810000,479.9587260000,44.9039010000,15.3870760000,518.7880300000,145.8827330000,600.0122650000,14.5181530000,17.5353000000
229.2220150000,279.5805650000,262.7902010000,175.8651890000,248.0723730000,204.8271980000,1060.3432380000,301.0257000000,248.3133440000,181.7767280000,307.4155260000,288.3760490000,190.7418600000,-1.0000000000,651.7713880000,284.5526070000,1136.5482340000,9379.9491060000,229.8570620000,245.4195070000,3803.2721980000,696.6878050000,186.6180040000,4880.9567550000,174.1688480000,1200.1915490000,264.0592450000,249.2669380000,279.5972920000,1093.0499910000,414.3326330000,254.3845690000,239.3439830000,279.3649430000,203.4732690000,262.7345200000,205.1144150000,10834.9503320000,221.2552530000,189.1187200000,3600.2946360000,177.2138670000,290.0778610000,1796.0699850000,2853.2897050000,1159.9597110000,184.7114330000,231.3115440000,516.0099380000,536.5607000000,1037.8067520000,185.0266640000,183.7575330000,218.4335280000,263.1518540000,280.6775310000,348.4584860000,605.3679940000,568.2380670000,205.6907140000,272.8548410000,241.5235040000,1139.1764650000,170.0971980000,179.2430430000,234.6356930000,254.9997910000,280.8398390000,449.3895940000,163.6526010000,255.4804700000,165.6555070000,216.5655450000,600.0413650000,205.0333370000,208.2332880000,600.0080500000,199.0076920000,175.5098660000,185.8348740000,462.0259830000,167.0969270000,600.0228140000,300.7925840000,600.0009100000,600.0611490000,435.7017520000,190.8586550000,274.8323850000,365.7788720000,164.6739250000,215.0638250000,201.5474580000,190.2533180000,401.5930020000,220.6202690000,175.7231950000,193.3978070000,291.1906280000,276.3067310000,234.8532100000,195.5852760000,298.5804710000,374.2106980000,289.7128850000,167.3516940000,600.0970180000,600.1766160000,215.4507930000,176.8368950000,192.3065740000,600.1596250000,396.3320720000,600.0185460000,253.1567790000,316.0005190000,158.1948970000,600.0994380000,188.1488040000,231.2915240000,167.4481250000,174.8406740000,600.1031320000,303.9056170000,183.4705560000,600.0237300000,245.1544160000,600.5836530000,163.8121180000,437.8480940000,207.4427150000,216.3918190000,600.0410500000,600.0953710000,181.3616600000,600.0137000000,196.8251600000,160.3168100000,254.5970440000,563.4721260000,269.2525940000,168.6263210000,600.0397510000,441.6876810000,600.0772770000,250.3237370000,337.7589730000
479.9995530000,501.8599720000,499.8300140000,422.9419560000,487.9878990000,515.4238210000,1204.0021140000,594.3705330000,518.4488940000,413.9366100000,572.8835620000,524.1022900000,465.9486310000,651.7713880000,-1.0000000000,413.8564400000,1399.0147710000,9072.8172160000,455.7178530000,447.3373340000,3873.8196720000,1165.1454380000,589.9134370000,5230.9551610000,457.3648950000,1426.8647830000,538.6398860000,500.2837970000,500.5735690000,1299.1534300000,607.2186210000,450.2182650000,538.4982290000,404.0802680000,579.0044730000,501.8334590000,589.8157450000,10664.8149070000,536.7693610000,568.2621920000,3922.1659230000,565.2535110000,546.3304010000,1767.8950900000,2679.3406660000,1062.5038260000,486.2566680000,499.2133420000,434.2012010000,682.9860320000,933.6582850000,507.4727050000,486.7451240000,475.3337870000,490.0930600000,504.7190050000,541.4643490000,534.8133980000,592.9782090000,467.1367970000,510.6084520000,428.3566170000,947.9268210000,459.2396780000,467.0700070000,465.4906280000,552.4563490000,551.8471480000,412.4449550000,540.9521780000,490.3817410000,446.0561320000,441.0670350000,600.1750040000,596.9686840000,446.1872770000,600.1034080000,434.0335800000,453.4852370000,470.3644870000,588.4554560000,451.1073570000,600.0594360000,484.9869650000,600.0047950000,498.7207870000,506.6366120000,454.9132750000,526.1596060000,453.0210310000,482.7917530000,493.6293290000,479.2682970000,483.1542520000,405.8602520000,450.5609760000,459.0012250000,454.5461210000,600.3540070000,582.6668850000,463.5892670000,476.1403270000,366.2557260000,403.5435500000,555.2980130000,473.8646360000,600.0016860000,600.1561900000,409.2156050000,452.1606370000,439.8680280000,600.0963500000,510.2433440000,600.1243280000,537.8758240000,600.0464680000,428.1652120000,600.0194830000,519.9090370000,440.4715480000,436.3592290000,464.5043470000,600.0504400000,543.6059960000,486.6110470000,600.0414100000,539.1037260000,600.0405720000,409.7469550000,527.4246380000,410.4202650000,600.3595470000,600.0314670000,600.0895180000,499.3612130000,600.0113660000,481.2313300000,454.8581520000,529.8390830000,506.8547240000,520.7364220000,482.6752650000,600.1324390000,600.0430130000,600.0224070000,470.1405580000,476.2808180000
31.2207000000,73.6992880000,43.0008780000,32.3970090000,32.3206860000,68.4823620000,659.3989670000,219.6085340000,34.5062490000,41.4920300000,62.8752030000,74.9607980000,33.3499590000,284.5526070000,413.8564400000,-1.0000000000,884.6203760000,8695.5395350000,36.5904800000,47.9653370000,3479.8271350000,465.4377790000,37.3578760000,4551.3162200000,37.7941760000,918.8864890000,158.1509940000,104.2073300000,29.7260480000,857.1793650000,41.5598430000,89.4343610000,32.7814140000,32.8750560000,64.0600700000,66.3760390000,82.9647100000,10288.3762810000,83.4977550000,51.6661090000,3450.0559610000,20.8569700000,85.9721400000,1575.0516140000,2004.3140360000,748.2534720000,40.2206180000,41.7239430000,88.1922730000,130.8562560000,649.5368960000,40.7669180000,34.0509590000,79.5383270000,98.3448750000,70.0476430000,64.0798020000,231.7085880000,303.8897080000,62.7936030000,45.3743010000,51.9783390000,536.3609010000,45.0276150000,43.0097690000,49.7574170000,31.6995530000,52.8824880000,207.1453340000,25.1844200000,40.4573250000,32.1552810000,31.2276270000,334.3014970000,66.2525650000,40.2621220000,503.4377280000,35.0945900000,41.1725850000,28.4961740000,141.7156390000,29.3452090000,573.8109050000,112.6047580000,600.1201540000,490.3825960000,148.5635480000,43.5220090000,105.0316810000,91.3298500000,26.9940360000,70.4055610000,32.0063210000,26.7362330000,306.7085750000,31.2118150000,53.3998610000,36.0268200000,44.6052290000,47.0358130000,48.5258990000,43.1920900000,31.5653120000,188.6064540000,151.4125050000,26.1486160000,319.6035580000,600.1818190000,38.4195320000,22.8920100000,25.5112600000,600.0092620000,69.4891540000,490.1001760000,66.8015480000,165.0442850000,35.2248790000,346.8996570000,51.0702850000,71.9429290000,40.8599780000,41.8258620000,587.7153400000,81.4697740000,29.2939520000,489.7711550000,32.7008860000,600.4533890000,23.0452980000,99.6209830000,31.6334070000,85.3327030000,279.2509710000,316.9377530000,41.9454630000,600.0447190000,66.8561210000,23.5460490000,47.2339360000,438.8373000000,52.2740290000,25.7957850000,531.1397550000,150.3275940000,600.1130700000,34.8961030000,33.8194900000
994.2970310000,914.4088150000,935.9662300000,879.4356480000,914.8377270000,948.3847410000,1325.7073820000,1034.1098400000,1019.2717200000,911.8172140000,881.2330510000,978.6997010000,923.0398710000,1136.5482340000,1399.0147710000,884.6203760000,-1.0000000000,10025.5811090000,974.3971320000,885.7943990000,4511.1974540000,1489.7403330000,904.2814770000,5056.3013630000,884.7026390000,1542.9297660000,971.3568310000,966.2624020000,968.0621560000,1713.8247540000,962.3923280000,918.0500950000,854.6429070000,895.8088360000,895.8486010000,948.6253290000,914.9305640000,11759.2589500000,978.0868110000,920.8023250000,4357.1925530000,900.7213140000,1016.2663640000,2267.3536900000,2773.3563190000,1007.2583650000,356.7519360000,337.9104220000,378.7398920000,592.3809550000,964.5351590000,344.5264030000,351.7594530000,401.1663000000,352.7744760000,349.4496830000,318.6342780000,502.6351070000,461.5970370000,418.9970990000,325.4796000000,343.0681780000,851.9821830000,361.3756130000,365.2748550000,438.1143440000,397.7344100000,328.6652320000,394.7146590000,365.6631090000,333.9461680000,341.7177060000,374.8570840000,571.4658880000,420.2170340000,333.5885860000,560.3675170000,325.7407970000,372.8755090000,338.6136840000,582.7691700000,366.0615730000,600.0727190000,459.9578770000,600.0204670000,600.1529390000,421.1029050000,375.7672740000,321.8435570000,372.3633560000,362.6169720000,429.7140240000,351.6803310000,328.1834890000,479.2469270000,332.1527140000,404.2308770000,362.2504540000,328.6255430000,343.3670680000,368.6931650000,346.0110030000,327.6369670000,547.2900800000,398.7062270000,362.0393690000,600.0127650000,600.0440280000,353.4028600000,350.3761060000,337.0015790000,600.1718970000,445.8015020000,600.0763770000,340.3598300000,600.2678400000,401.7406090000,590.9344980000,462.8247880000,349.6026120000,357.7004900000,424.6694570000,600.0478640000,436.0417520000,349.5777510000,600.1637520000,363.3969270000,600.2049230000,339.4447690000,444.3421900000,406.1994370000,472.4322500000,600.0307980000,600.0203270000,404.6694390000,600.1816420000,370.4661440000,371.2808910000,380.2237400000,600.0096940000,334.0179520000,355.2234110000,600.0173760000,581.8227940000,600.0965460000,348.1652250000,317.7972940000
9938.1646080000,8477.6430250000,9060.9983920000,8833.4789080000,9182.5932980000,9051.5365020000,9431.5435000000,8548.6984290000,9960.6006470000,9456.0027770000,9332.9600010000,9182.9674010000,9722.3642760000,9379.9491060000,9072.8172160000,8695.5395350000,10025.5811090000,-1.0000000000,9809.1563760000,9050.6871380000,11061.4857040000,14935.9681470000,8960.1723370000,15639.5563810000,8997.3832560000,9605.0337910000,8361.9926420000,9204.1173340000,10278.0048340000,8544.4060430000,10144.6931940000,8311.5807320000,8583.1877670000,9272.8031050000,8453.3045300000,8905.6152390000,8314.0995290000,16905.6276510000,8869.2485150000,821.0796830000,1575.4896750000,784.8184790000,793.5517720000,2320.0190140000,1950.5805850000,1579.2911870000,782.5564120000,769.3422740000,929.9358800000,1467.4474440000,1361.1334660000,756.1393670000,784.4817210000,816.3231740000,775.4563370000,775.0060390000,749.8667220000,600.1880430000,861.3186670000,600.3564560000,752.3760100000,770.0115240000,600.0971250000,600.2305870000,600.3969960000,806.8583390000,748.2206750000,600.2286690000,600.1619850000,600.1071890000,600.3092940000,600.4635290000,600.2549930000,600.0055500000,600.1864840000,600.4412130000,600.1079140000,600.4063740000,600.1812270000,600.2863810000,600.2746960000,600.1916520000,600.2824350000,600.1251150000,600.1182580000,600.0205460000,600.2424380000,600.0020520000,600.0277880000,600.2461410000,600.3026670000,600.1184670000,600.1167970000,600.0030340000,600.0327580000,600.5921240000,600.4523610000,600.0127930000,600.4098560000,600.1655610000,600.0329640000,600.3301280000,600.2801940000,600.0429490000,600.1901800000,600.0258810000,600.2338520000,600.1838300000,600.1816550000,600.6587570000,600.2147380000,600.4248310000,600.0258670000,600.0303410000,600.0731740000,600.2964540000,600.5864230000,600.0609100000,600.2929110000,600.0748980000,600.0145270000,600.4554470000,600.2317150000,600.2235830000,600.0572760000,600.3241610000,600.5147240000,600.0400060000,600.0504880000,600.5324320000,600.3997580000,600.0064550000,600.5895030000,600.0080360000,600.0407240000,600.0338380000,600.3864020000,600.2140970000,600.1465310000,600.0037340000,600.0163880000,600.5130990000,600.5504180000,600.0184330000,600.0019160000,600.2859640000,600.3412170000
