-1.0000000000,65.0178080000,18.9993120000,24.9824290000,19.8353880000,53.6296140000,673.0522310000,209.1379790000,13.9641480000,35.4182070000,56.4023140000,55.3205340000,14.4791310000,215.1713860000,476.7944050000,32.6215100000,992.4061230000,745.9179330000,18.9338360000,42.5459610000,427.2678800000,297.0513850000,33.0051030000,1281.7374180000,18.8739760000,1450.0074210000,164.9218200000,95.4893490000,10.9662210000,923.5355740000,17.2049350000,82.0897930000,15.4879790000,15.8535910000,49.1141220000,49.8105420000,65.9023840000,1024.4968760000,85.5894060000,46.7857910000,1033.0228260000,9.6582500000,66.0152770000,1552.1736820000,2103.6931590000,721.8579920000,20.2004540000,31.1581280000,96.2942080000,89.8238520000,3311.1634810000,21.7331910000,25.1198930000,121.6513540000,88.8721850000,56.9463170000,23.3986490000,1320.0852560000,223.2091100000,72.7085130000,37.6050760000,58.3359770000,2788.3450570000,20.6138910000,36.6128000000,55.7267310000,18.7089500000,48.8414000000,278.8443130000,24.4974580000,40.6879500000,12.3427530000,15.3081810000,317.5260950000,45.1202930000,25.1294030000,803.2986480000,28.2415600000,24.2968360000,12.9347110000,115.9165570000,19.7611680000,1438.1228900000,110.0200900000,1383.0668950000,585.2543900000,131.8497210000,37.0521990000,68.1607270000,70.1947100000,28.3048540000,56.9568220000,25.9698040000,10.9826420000,349.6295120000,14.6382810000,38.0920190000,19.7082790000,28.4265130000,32.3744100000,45.6174380000,33.8374780000,15.8099580000,1227.1091730000,237.8551440000,17.4109440000,303.3633630000,622.7753180000,27.3466340000,12.4122710000,27.1970880000,620.9978540000,49.8624070000,496.7717750000,87.5053870000,191.0555580000,23.9444650000,338.6546190000,40.2958720000,109.0699950000,44.8751400000,31.7976990000,1729.8603100000,79.3845060000,17.7012730000,498.5579410000,19.6070390000,977.8654460000,14.5383700000,74.1333770000,20.8618590000,72.9259380000,265.8034380000,1567.2335500000,34.3031390000,1622.5820730000,49.8458800000,21.6562130000,52.0509180000,454.4873850000,38.7576670000,16.3526420000,2440.3357620000,212.5286810000,3338.6086880000,15.8783950000,13.2889460000
65.0178080000,-1.0000000000,69.6589820000,73.1031630000,68.7922800000,108.9139420000,691.8496530000,249.7782440000,70.2407230000,113.4692100000,137.6233680000,108.9896460000,68.2448900000,273.6061850000,500.8623790000,109.6383900000,917.6750470000,776.0195600000,75.1012700000,120.4821950000,3261.6413330000,373.1061750000,116.0030380000,1327.2508260000,72.6811490000,1375.1810290000,203.2967980000,218.5851050000,69.9179140000,846.3051580000,77.9334090000,132.2963860000,68.7640510000,67.2754760000,102.1350740000,97.5780920000,121.1222170000,1045.2611080000,139.9068300000,134.5348660000,3487.8701250000,65.6161420000,115.3474530000,1669.3925440000,2034.3517890000,759.6467280000,79.5794260000,86.9190910000,182.3084320000,187.5034280000,2995.1079660000,80.5041000000,107.6124450000,186.4908120000,137.6419110000,104.4139390000,84.8690450000,1207.1024750000,278.1501980000,101.7256550000,111.3127880000,131.1814550000,2639.5814550000,100.5159520000,116.3498840000,133.4377190000,99.2739450000,123.5067380000,334.0935170000,104.4676810000,77.5747580000,66.7737910000,67.6365480000,376.7508740000,109.1304730000,76.6896300000,802.2659430000,103.7923210000,80.3671980000,68.6171380000,188.7281740000,98.4055780000,1344.5175280000,157.4892610000,1402.5135420000,593.1461750000,194.8212250000,91.8220010000,146.4008930000,134.6260840000,109.8914050000,113.2956690000,82.4973340000,69.1915290000,372.2772550000,69.6309650000,92.3336820000,74.0848980000,89.2190800000,88.2678810000,97.5169740000,87.5786110000,123.5708630000,1185.4920780000,299.7570060000,73.4749660000,398.9776330000,676.8026910000,71.5615500000,67.0888490000,108.6256050000,653.3348290000,129.1595230000,540.9813110000,172.9378300000,238.4734780000,78.8782920000,413.7426850000,97.0036650000,173.1607900000,127.7402650000,87.4460620000,1644.3474350000,126.9521440000,76.3699130000,497.4111070000,74.1580360000,1253.4969650000,66.0471700000,160.0054860000,71.3634140000,132.1563780000,363.5829610000,1486.0640750000,91.3368320000,1487.0255590000,113.3625590000,104.1256610000,126.3159500000,475.6089170000,85.3737330000,73.3693230000,2211.4637440000,299.5915290000,3386.9512810000,68.9916360000,67.5228420000
18.9993120000,69.6589820000,-1.0000000000,33.4666020000,26.3125360000,67.1669300000,646.7730680000,231.2210020000,22.6285150000,51.1303460000,63.8752440000,68.2078670000,23.1527300000,241.8081170000,495.3457730000,48.6357990000,932.6197180000,759.4908690000,28.3896450000,56.2632260000,3600.1632050000,295.8159300000,48.5134130000,1292.4729960000,28.7147930000,1352.8456950000,178.2274350000,161.2869930000,20.3908540000,889.4697730000,24.2042980000,97.2994240000,24.5961340000,24.7033990000,62.2812490000,60.9179900000,79.4715730000,1032.2506770000,99.0774030000,66.7973150000,3343.3052630000,19.4165920000,77.5715240000,1761.6302490000,2055.2097400000,732.5427710000,30.9426750000,42.4468650000,102.8639390000,99.7646800000,3224.1861930000,32.5029420000,26.0607100000,137.3247760000,105.0113960000,61.9035650000,35.1178350000,1162.6496920000,257.3582740000,60.8267090000,47.9209020000,73.2817400000,2620.0737080000,34.9040610000,51.9425310000,69.9931840000,29.8065410000,55.6005890000,275.3559360000,40.1320060000,33.0262250000,21.2264490000,23.9332330000,318.6054790000,60.3384410000,34.4709530000,741.8900750000,27.9560540000,34.9251430000,22.0186770000,120.2551270000,32.6752870000,1345.7460180000,125.5551160000,1390.9824450000,630.3036870000,132.4754220000,48.0742730000,89.4791730000,75.7059690000,42.0778260000,71.6462260000,36.7169390000,19.6948920000,355.2007320000,23.1592110000,49.9306940000,29.5525550000,35.1428440000,38.4999750000,55.6597110000,43.0211500000,34.5108510000,1238.4993400000,255.6713430000,27.1314440000,309.1546890000,634.2926200000,35.7564730000,20.9459900000,41.6971420000,628.5382190000,58.2169930000,484.3257380000,105.3642590000,215.6563530000,34.5554330000,339.1840170000,52.2643060000,122.0044430000,62.8032700000,42.4651670000,1749.0294270000,82.6595530000,27.9243960000,508.4285210000,27.4234320000,984.9424970000,23.1734060000,84.7169380000,29.4179650000,87.5087500000,273.5852930000,1475.1383760000,45.5449580000,1453.7827620000,65.9714300000,37.2077090000,63.3522280000,474.0510110000,41.5833840000,26.1100060000,2198.1585020000,150.2560830000,3352.3107470000,24.6479740000,21.9128330000
24.9824290000,73.1031630000,33.4666020000,-1.0000000000,33.8601720000,51.3495800000,751.2266620000,155.6292930000,27.8947870000,43.7592720000,50.4044690000,66.3669840000,21.1706260000,173.3792320000,423.7227530000,49.2497830000,875.1163330000,761.8442810000,31.4257310000,45.0045780000,3241.8696820000,315.3984920000,40.3816760000,1533.9283680000,24.3437140000,1325.1551500000,125.1070680000,116.1202550000,20.9359190000,860.8659330000,35.0366040000,74.5660000000,20.5196270000,23.9373630000,47.1413670000,59.1723100000,57.1965520000,1038.5777030000,72.9614950000,53.7590860000,3224.5815100000,20.8630950000,109.2734670000,1738.6691540000,1905.9953970000,764.5992060000,27.8356840000,40.9039400000,116.4542770000,116.0300710000,2925.2353510000,29.0309050000,23.3306480000,95.3592470000,82.7555010000,68.4804290000,41.5020260000,1165.6125330000,211.0500510000,46.0245940000,57.1589730000,66.1783710000,2585.9054160000,30.6743180000,42.1090950000,65.6339710000,41.6639740000,67.8825460000,289.6575430000,37.4766870000,39.8027950000,19.6492310000,25.6741330000,356.0325920000,47.8917970000,30.4220040000,751.6461880000,26.7377320000,29.4392690000,20.1513820000,135.9623550000,29.0928740000,1326.3920570000,106.1841560000,1440.1942440000,498.5829590000,146.8646840000,55.1090910000,78.8663330000,86.1414470000,35.3247040000,53.7250340000,33.0867430000,19.7973130000,239.5674670000,25.8476770000,38.5684150000,24.0650540000,44.8732730000,47.8333410000,51.2253670000,34.7607340000,52.4887810000,830.0881200000,177.5196820000,23.3949860000,330.0669790000,639.7609480000,36.2778560000,19.7693900000,39.4175370000,636.1512240000,71.2194570000,487.7849690000,86.8014690000,147.6838150000,29.1953960000,345.4033010000,42.2754090000,64.2572250000,50.0572850000,34.2394520000,1385.2085600000,88.2094440000,25.7499530000,476.6305450000,34.5473030000,988.6511250000,18.9235480000,99.2763130000,30.0260300000,64.2145700000,293.4063280000,1415.1703190000,37.1294180000,1410.1622290000,52.1605560000,32.3158500000,48.0253610000,432.5624480000,49.4087470000,22.7361660000,2185.4483230000,225.2023450000,3371.2036000000,21.5845560000,26.7104410000
19.8353880000,68.7922800000,26.3125360000,33.8601720000,-1.0000000000,66.9587620000,639.3059710000,233.6191480000,34.0942050000,51.8173730000,44.4378570000,69.2584620000,24.1715660000,238.4028460000,486.8814960000,47.4861310000,929.4829810000,833.6693110000,29.0242200000,58.2389140000,3409.4916100000,298.5442160000,49.4239010000,1283.2055860000,28.4135270000,893.8863850000,174.5858000000,161.0796510000,20.4980580000,858.2288820000,24.4727250000,93.9737200000,24.6382900000,25.4419110000,61.8813610000,62.0409380000,77.4833260000,1029.6029240000,97.6030670000,64.6107390000,3238.5612440000,21.9224160000,118.3252270000,1912.9191270000,2010.6151820000,728.8813430000,31.8405820000,41.9281390000,104.5853620000,101.0266830000,3252.8538100000,32.5673650000,27.7011240000,137.2019080000,104.5788010000,61.8177110000,34.9835420000,1127.7959150000,256.4596440000,60.4418130000,47.4991300000,75.3531740000,2544.5312430000,34.5329870000,52.6944340000,70.3954520000,30.4097110000,54.5586970000,266.4469240000,43.3655760000,33.8413680000,22.3895560000,24.3932450000,321.7456610000,59.7074600000,33.9871730000,701.1034780000,28.2094240000,35.3590780000,22.3284500000,121.2900410000,33.7214380000,1313.8666720000,123.0873340000,1387.4554030000,626.2046260000,134.5489530000,72.1301740000,88.4191650000,75.2617780000,43.0278070000,71.4067470000,36.4154750000,19.8946620000,345.0429410000,23.6502680000,49.7531140000,30.0431710000,35.1460440000,39.4993150000,55.1263690000,43.2754890000,34.8047810000,1203.3771470000,167.8394280000,26.6960270000,310.0872910000,645.5458510000,37.7811950000,21.8463080000,40.8571960000,628.5233010000,58.2743110000,476.7581700000,102.4804990000,211.6957550000,36.2002470000,332.7348510000,53.3238000000,82.9634860000,62.1055000000,64.2795640000,1689.5186510000,82.0665060000,28.4164420000,505.3017800000,28.2269080000,1220.2861570000,23.7721570000,83.3627920000,30.5143920000,88.2018150000,274.7140070000,1448.5240360000,46.0357890000,1428.7280630000,96.8125730000,24.8022740000,44.4327750000,459.4053630000,42.3950710000,25.5918190000,2144.8806010000,143.3624420000,3345.8607270000,24.4370410000,22.4830630000
53.6296140000,108.9139420000,67.1669300000,51.3495800000,66.9587620000,-1.0000000000,824.1808810000,169.7554590000,85.6792610000,74.6177060000,90.4506210000,95.6391180000,43.8746000000,187.7116700000,771.3961520000,89.5529410000,945.7294200000,890.2972770000,56.2473820000,48.5194550000,3522.0434160000,383.9866530000,60.5165540000,1653.3039890000,38.5439430000,1049.2788250000,128.9363690000,162.9345940000,42.7735320000,927.6271130000,69.7858840000,102.8690490000,35.6316700000,49.2250950000,57.5600470000,89.5402290000,71.6548250000,1102.1454740000,80.4385260000,71.1006640000,3600.2938160000,34.6562910000,156.7788630000,1989.7945020000,2573.1344570000,838.6007520000,42.4098120000,68.1891990000,179.0360190000,177.7441130000,3035.8564620000,47.8649920000,38.4317040000,138.7500000000,108.4676250000,102.7774160000,72.1813680000,1339.1946480000,239.5857080000,69.6269370000,105.3128710000,109.9442270000,2880.1940840000,58.7410980000,61.4881270000,108.5259020000,87.8179820000,121.7496350000,361.3240440000,55.2485590000,76.1897660000,39.2298790000,53.6913680000,408.3533060000,60.8576000000,57.1720260000,865.0256750000,52.6367930000,42.6224310000,44.1369150000,182.9509050000,58.5923420000,1385.7072090000,141.3596290000,1453.7427710000,576.0590860000,192.9310830000,91.0809410000,105.5290680000,126.5982780000,63.3257430000,76.0999450000,58.5113910000,42.3877580000,242.7964520000,53.1173050000,54.8486930000,48.6974320000,86.0132870000,82.4258390000,81.7492410000,59.2990090000,106.5520720000,804.3954850000,162.4800010000,38.6160850000,491.1039030000,761.8938760000,67.0370280000,43.0904470000,50.8703950000,723.7717110000,120.1681750000,552.4920320000,135.1470680000,265.1803510000,47.1633370000,416.7085770000,53.4596080000,99.5837500000,77.9016010000,75.2494410000,1644.9768200000,122.8897770000,48.6074190000,521.2554780000,66.5476160000,1139.1189330000,42.1221360000,151.4741440000,58.1695420000,77.9492570000,364.8437130000,1515.3370210000,48.6161840000,1590.3697040000,103.9640550000,55.0860620000,79.8252130000,531.3970700000,86.0763870000,41.8984130000,3464.9830920000,202.6510150000,3524.7890540000,37.1043570000,55.1337530000
673.0522310000,691.8496530000,646.7730680000,751.2266620000,639.3059710000,824.1808810000,-1.0000000000,980.9227220000,1049.6642120000,1114.8899380000,648.3605230000,745.1195290000,778.7003580000,1039.4866370000,1765.4213330000,979.6043670000,1325.4897150000,1229.2832750000,683.5031420000,779.0661630000,892.0203690000,1190.1033940000,1585.2465220000,1718.1649110000,766.6550620000,1404.6794060000,890.6744880000,1284.3138040000,811.6616300000,1572.6976580000,697.2096730000,722.5641460000,1026.2980820000,642.1423660000,1132.8799640000,703.6355340000,1095.7759780000,1539.4037150000,862.9763270000,1588.8145560000,1436.6399860000,1106.7866460000,1101.0175310000,2352.2493260000,2618.8811660000,1078.2288920000,800.4971230000,713.4291650000,1020.2420060000,1063.8894070000,3581.0215530000,821.3614780000,787.5003600000,1214.1704590000,742.1730560000,669.0495570000,735.5234330000,1686.1830370000,908.0783470000,805.9226860000,706.4993250000,1012.0362620000,3600.3374930000,1157.3698540000,1152.3305310000,1041.8621650000,1059.9810920000,1026.5917960000,1181.6446810000,1085.0968810000,615.9658710000,772.2389190000,674.3818630000,954.5740640000,1164.1138280000,672.9651090000,1662.8165680000,666.0978220000,774.9281210000,789.0942580000,872.9667050000,1158.6657920000,1738.9391460000,777.4214640000,1915.8430850000,1315.1151220000,809.2652050000,1177.7301690000,793.1851100000,745.6009720000,1178.7501050000,834.5727380000,1038.9270320000,790.2250650000,1404.9345850000,678.6042860000,796.1881540000,792.7969250000,722.3328560000,680.4492130000,707.7288010000,805.0216550000,1081.6976650000,2111.3021280000,935.6666980000,799.0288490000,1209.8675000000,1007.1968830000,632.6150390000,780.0900620000,678.5553920000,1022.6408650000,850.7724840000,1207.6109210000,1125.1990250000,1498.5669050000,768.9937500000,1163.2821730000,819.8131210000,696.2053320000,1152.0635740000,1182.8095480000,2499.7534460000,685.3468870000,806.5949730000,1143.2360170000,708.8129650000,1419.7498030000,744.5715890000,902.3049070000,663.3895940000,1129.1315700000,1296.0880300000,2046.5926290000,813.3813570000,2143.6506840000,1236.4286090000,1151.4405530000,708.9917400000,1147.6150860000,674.7764970000,803.0188050000,917.2374720000,859.6187910000,3795.9629420000,779.4695100000,679.7214550000
209.1379790000,249.7782440000,231.2210020000,155.6292930000,233.6191480000,169.7554590000,980.9227220000,-1.0000000000,317.1590090000,244.8377020000,260.0410730000,235.2165190000,163.8370500000,284.4009830000,889.0969010000,185.1463120000,1032.1830940000,957.8342840000,298.3509630000,146.0479380000,3514.3757660000,643.2147780000,227.1380880000,1584.7057490000,150.6351950000,1104.0506020000,225.5605530000,331.0195330000,173.1823460000,1013.9144040000,253.7251440000,221.1220120000,142.7240230000,176.8193580000,165.3333930000,221.7536250000,180.3421000000,1252.7183310000,190.5578090000,250.6546030000,3420.4956040000,143.8605500000,373.9537970000,1681.0192110000,2656.5523700000,985.8621590000,162.5815690000,210.6972040000,447.8784470000,479.4315440000,2906.9898570000,163.7607520000,156.5085510000,282.4563940000,233.9655480000,265.4688180000,232.0607570000,1418.5910190000,354.1166050000,179.8441610000,234.8602300000,299.0603450000,3036.4139750000,222.7619410000,218.5941020000,307.1624230000,336.5623590000,370.8733890000,600.8314160000,145.9690740000,235.8625130000,148.0529770000,185.3858380000,583.9078730000,185.7722890000,188.3024730000,1007.7773530000,180.5740540000,160.5834990000,164.5695020000,415.0640060000,219.0793680000,1479.5810360000,267.3297640000,1596.9237780000,662.2477900000,402.7314940000,249.6466800000,265.8683900000,328.4435420000,213.5728870000,188.8023240000,271.8480020000,166.4733170000,349.8782780000,192.5870600000,157.9286900000,164.7274750000,267.7331380000,251.6553260000,211.8298190000,178.3943420000,412.5000810000,902.1941690000,267.0493630000,150.7252280000,729.9926060000,899.8506440000,194.3597590000,161.8765760000,178.5907310000,853.3621880000,364.9642600000,762.6060120000,222.8597890000,406.5120710000,155.1450880000,652.9806610000,167.9136770000,206.9341690000,235.8775250000,232.6680130000,1586.5070130000,272.0464480000,175.1372240000,621.2832750000,230.2066510000,1197.1920830000,153.3235340000,424.7394450000,191.0856260000,187.4869270000,685.3969750000,1654.4239550000,166.8058780000,1554.7875280000,273.2185150000,223.4351570000,231.0970660000,608.8111140000,249.9543970000,153.3202040000,2381.7232690000,400.0454330000,3660.1051330000,154.9341790000,208.5659270000
13.9641480000,70.2407230000,22.6285150000,27.8947870000,34.0942050000,85.6792610000,1049.6642120000,317.1590090000,-1.0000000000,40.6352540000,40.7972020000,58.3935660000,17.2121520000,224.4797450000,762.9244620000,25.0189380000,1004.4925030000,750.5642380000,32.5909130000,30.6196530000,427.0403350000,309.5669970000,37.2113740000,1505.9761550000,22.0437200000,1028.9469260000,175.3799450000,154.3830260000,14.1413810000,984.2440980000,20.8849100000,89.2937690000,18.1782670000,18.8867790000,52.2613450000,51.6585980000,70.4187410000,1025.7619370000,92.8982020000,51.9921270000,859.0156470000,13.0065060000,100.1390810000,1552.0835720000,2156.9044060000,728.4274740000,23.5840270000,33.7506990000,71.6793590000,144.9329670000,3282.0853870000,25.4594190000,19.7107330000,126.9937580000,89.1061100000,61.2429800000,27.4156900000,1393.1263370000,227.3903960000,53.6767550000,28.8350860000,63.1939000000,2876.0282120000,25.4724270000,41.3223700000,61.5882850000,23.4293510000,55.9008960000,295.1697450000,19.6700500000,31.0212040000,15.5194800000,18.2018610000,321.5624530000,49.5903080000,28.1899250000,873.1964430000,22.1270460000,27.7043490000,16.0296230000,182.0965170000,16.2100580000,1451.0361020000,115.9351050000,1386.5841980000,592.1778950000,139.3481500000,60.9899820000,76.6696440000,77.9797100000,32.5362540000,61.4122660000,43.9414040000,14.5024730000,373.8516250000,17.9929420000,40.9080720000,22.9090210000,32.3730250000,36.2081910000,50.9013060000,37.0825560000,29.2759080000,1274.1413320000,172.9188030000,21.3235640000,310.7598630000,645.7370830000,29.8471120000,15.1324520000,21.9287270000,643.2366910000,54.4026070000,518.6663440000,63.2962870000,286.7829510000,27.8852210000,358.9061010000,43.8334300000,79.4575960000,51.4199220000,50.7795070000,1848.0356730000,84.1800410000,21.1948150000,506.5799300000,23.0276570000,979.5152520000,17.4665260000,80.9861110000,23.7310210000,77.8936060000,267.4087700000,1638.2426100000,36.8614350000,1708.2375320000,79.6008650000,27.6269900000,39.2224020000,491.9863730000,41.5295270000,19.1168100000,2543.5568600000,150.0785660000,3369.7727080000,18.7254880000,16.3697830000
35.4182070000,113.4692100000,51.1303460000,43.7592720000,51.8173730000,74.6177060000,1114.8899380000,244.8377020000,40.6352540000,-1.0000000000,54.4599190000,67.8819160000,20.6519490000,167.7486360000,615.2436020000,32.6468220000,900.9447750000,758.2449710000,40.1506410000,29.1429500000,3270.8078390000,319.6597870000,27.0872130000,1312.2761730000,25.2393770000,883.4356620000,122.1027820000,115.5383480000,17.7779410000,850.6293570000,34.8565450000,73.3604600000,22.3994440000,24.4175350000,48.6898280000,63.6268510000,56.5652440000,1046.6511690000,72.4127410000,47.3766750000,3234.9259090000,19.7773510000,112.4445810000,1556.7827590000,1946.4428770000,739.5214820000,23.7866670000,37.9997850000,81.6847980000,174.5981410000,3101.2951430000,27.8547600000,22.6084730000,96.1619100000,126.1516720000,71.4518300000,37.0821370000,1201.3732260000,216.0483830000,43.2070760000,38.5526640000,72.0755620000,2623.4426980000,31.5498940000,40.6701240000,66.6668390000,40.1483760000,70.6432610000,283.4024660000,22.5237700000,43.8034790000,20.1407640000,26.4908310000,356.8223200000,43.7690300000,46.1017150000,726.8067940000,26.3668780000,28.2215850000,20.2418840000,196.0285600000,20.8875550000,1352.9061260000,107.7558690000,1393.9740860000,526.1097500000,145.4691010000,54.8396610000,71.4434560000,85.9695520000,37.1922090000,51.7031160000,47.0313730000,18.4647650000,251.0188650000,25.7462750000,36.2116650000,24.8028130000,44.8743560000,45.3966920000,52.0825290000,33.2043340000,47.5984270000,833.8200370000,120.3466070000,23.7571480000,328.0789570000,656.6240510000,40.8338560000,20.1546470000,25.8601090000,635.7480170000,70.6812130000,488.7107970000,55.9179150000,224.3840400000,26.2010460000,346.8752890000,39.0211940000,69.5767650000,50.1069740000,45.2987220000,1430.8317080000,90.3698230000,21.1467700000,489.5576110000,33.5556860000,1136.5438160000,21.1111670000,96.8679850000,30.8726370000,62.0785380000,298.6107090000,1425.4560280000,36.0948710000,1453.4900410000,72.6952660000,31.6178890000,49.3764010000,443.2616580000,51.9099750000,22.9729530000,2209.7596920000,159.8632140000,3357.4953570000,22.1417210000,25.5812650000
56.4023140000,137.6233680000,63.8752440000,50.4044690000,44.4378570000,90.4506210000,648.3605230000,260.0410730000,40.7972020000,54.4599190000,-1.0000000000,88.7948720000,41.6900030000,284.9903970000,846.8339040000,50.0812440000,885.6479530000,866.6065050000,73.1313220000,57.1089390000,529.5447370000,308.5458860000,56.2330200000,1315.4488020000,49.0825850000,932.4030830000,212.5658260000,203.7186700000,39.5774470000,1483.9300770000,41.5558080000,121.4433110000,46.2597690000,42.9043850000,88.8827790000,80.7923080000,106.6828600000,1168.7841610000,125.5719350000,108.0042250000,994.4443100000,42.8885420000,145.1280900000,1982.5009950000,2008.4744960000,781.6476440000,53.1481170000,61.8555170000,81.7520330000,184.5119400000,3144.9570010000,54.5115820000,46.5500740000,168.4572030000,180.7987700000,82.2803880000,59.6952990000,1131.9872920000,290.4470300000,83.4957370000,51.7385200000,69.0214890000,2654.8025990000,62.5658540000,80.6641680000,100.3136620000,57.1240700000,83.9105330000,204.3616860000,51.5051860000,47.8828210000,41.0274960000,40.7719880000,330.4317000000,91.5015190000,78.6142040000,825.3144820000,46.6315730000,55.1319230000,41.5891420000,201.8770540000,40.7498680000,1278.1280830000,151.8100400000,1627.7722600000,661.2967440000,145.4999710000,101.2494590000,128.4165070000,90.2658210000,68.7680120000,93.9756860000,82.7914010000,38.3516060000,419.3491260000,42.1899480000,71.2148630000,47.8194240000,52.8242700000,54.8630960000,114.1041470000,63.4789260000,59.1278100000,1410.7038500000,211.4926110000,47.0321600000,331.9937840000,654.3832820000,53.5920360000,39.5117260000,47.2958280000,689.7855090000,76.7650500000,490.7659000000,93.8454590000,360.7598140000,56.7398710000,346.2074710000,74.0539880000,105.1623990000,97.3807310000,92.7173460000,1976.4390050000,98.0360400000,48.2414260000,566.5244300000,47.8346960000,1056.3687540000,40.8931450000,109.9240240000,48.1074890000,117.8387200000,288.4840330000,1497.6195060000,68.3277200000,1644.8021090000,137.6671640000,66.5621460000,62.4471680000,544.9830220000,61.8875150000,44.9573050000,3349.9146680000,158.4425440000,4046.2983150000,42.9916610000,40.6719430000
55.3205340000,108.9896460000,68.2078670000,66.3669840000,69.2584620000,95.6391180000,745.1195290000,235.2165190000,58.3935660000,67.8819160000,88.7948720000,-1.0000000000,58.4748870000,262.8521130000,784.6174390000,62.4299600000,980.5886970000,842.8848730000,96.6284100000,71.4065440000,504.0244010000,379.7737300000,64.9584020000,1400.7548910000,63.7851410000,1026.9611010000,211.3639880000,212.5362560000,56.9638630000,1443.8224920000,72.2596460000,127.7533700000,58.7738850000,59.1413480000,89.7436160000,88.4766760000,113.3989950000,1119.8298380000,124.6069940000,79.0408840000,951.6930260000,53.8896800000,157.7653330000,1611.3039950000,2129.7365840000,845.2200910000,67.4585650000,77.9976690000,118.8277450000,270.1420250000,3107.0385890000,70.1085490000,62.0093680000,180.4509440000,201.7515140000,106.7207430000,77.0858350000,1353.0410290000,247.8794220000,94.2251710000,73.0183110000,82.7212630000,2845.7594620000,86.4778780000,101.0404690000,116.2930400000,89.4369490000,124.8252230000,248.6463430000,60.7969760000,78.5018240000,57.2515390000,59.2062620000,385.5192000000,94.6441520000,103.5657280000,868.2411270000,63.8971370000,69.0132050000,60.1880210000,277.6715100000,57.8546270000,1441.8208600000,145.9115460000,1466.1859180000,608.0714240000,200.4503320000,114.9208390000,142.8399460000,129.3413760000,61.7025950000,102.3823740000,100.5488620000,55.4595040000,381.7751540000,58.6627550000,84.1984080000,64.8277830000,85.9993470000,86.1452220000,128.3401170000,79.3837020000,110.2446880000,1287.5278310000,207.4779400000,61.4444970000,386.2440280000,740.3334390000,68.0548490000,56.7984960000,62.0919490000,728.7860180000,124.8406330000,572.8492290000,110.1889160000,320.8720660000,70.4612010000,421.2618660000,85.2878170000,115.1168530000,117.0704330000,113.3634590000,2570.9429040000,124.2416110000,64.5410840000,523.9697010000,67.5398810000,1334.7635110000,56.9771590000,158.3830790000,64.7504800000,125.4095430000,362.7372050000,1658.3026370000,78.2847260000,2432.6016070000,155.5180860000,88.1448420000,80.3422380000,496.2323580000,88.4626170000,60.3344530000,2475.7871390000,204.7340530000,3497.0980250000,59.8245760000,57.8141560000
14.4791310000,68.2448900000,23.1527300000,21.1706260000,24.1715660000,43.8746000000,778.7003580000,163.8370500000,17.2121520000,20.6519490000,41.6900030000,58.4748870000,-1.0000000000,172.2666360000,694.7639730000,23.8307680000,921.8953870000,753.3150400000,31.5925860000,23.7770780000,3600.1381830000,310.5156340000,19.7605560000,1297.6431380000,26.4014420000,960.0828510000,131.2457060000,118.6352580000,11.7128170000,1411.9405770000,23.3687840000,73.4050730000,14.2845280000,16.9199650000,41.2447030000,52.6504440000,53.5605350000,1034.8923160000,71.4297300000,27.8655840000,3600.2120130000,10.5518250000,101.0533780000,1552.3684120000,2021.0032180000,736.6569170000,19.6248880000,32.1052720000,70.4313780000,149.8200540000,3139.9323000000,20.7245700000,15.5385020000,97.6836240000,112.2796680000,61.6572810000,29.2061720000,1260.0673980000,210.7308310000,41.4033330000,29.0201720000,39.8012410000,2729.9447510000,20.7524900000,32.3931810000,56.7869760000,25.9799930000,57.5366600000,196.7957940000,15.7029170000,32.6496560000,12.9607380000,18.3326970000,353.4278520000,38.7851290000,36.8156890000,785.4578350000,19.2720480000,22.1400110000,13.1150220000,180.9929530000,13.6282180000,1381.2297360000,105.8393230000,1389.6866890000,527.0201550000,141.3456570000,48.0005350000,67.6492700000,77.4648650000,17.3774150000,47.7846590000,37.9297600000,11.4968170000,267.3279580000,17.2385600000,32.4857150000,18.4723500000,34.9694350000,37.2571220000,69.5468950000,28.1809950000,31.7873630000,946.3147220000,126.9401310000,24.9967200000,320.0761170000,638.1569360000,30.7669680000,12.6457980000,18.6810000000,642.4038730000,56.6520580000,496.7236820000,53.3469190000,221.6862950000,22.3838380000,348.7110170000,34.0728310000,66.8910940000,27.8671330000,39.3333590000,2288.3285000000,82.5081610000,17.3397290000,497.7682310000,25.0033670000,983.1231750000,13.8048690000,82.9684710000,22.9041730000,59.9091050000,277.7145630000,1538.8276760000,29.9703850000,2271.0345600000,45.3293800000,14.8442320000,39.4759140000,482.6574380000,43.1149040000,15.5237390000,2426.9919600000,147.8706740000,3354.7752710000,14.5170710000,17.5922510000
215.1713860000,273.6061850000,241.8081170000,173.3792320000,238.4028460000,187.7116700000,1039.4866370000,284.4009830000,224.4797450000,167.7486360000,284.9903970000,262.8521130000,172.2666360000,-1.0000000000,967.6142380000,199.6451130000,1119.1633320000,1091.6595540000,316.5573450000,165.0200840000,3600.2756170000,696.2076450000,168.5169370000,2064.0335910000,242.5945140000,1196.8194780000,252.8369450000,351.6533600000,182.0383960000,1637.6895990000,270.9269790000,237.3759030000,156.9955030000,181.9637590000,193.6423960000,364.5307060000,196.4731670000,1369.3806510000,217.4483190000,171.2620950000,3600.3579470000,161.5969270000,410.9289900000,1800.2022160000,2787.8363220000,1191.7843170000,171.0175970000,223.8986650000,329.5544820000,755.8589940000,3129.4955640000,173.7455130000,170.5984790000,319.6744350000,375.7337160000,278.2972460000,245.9790160000,1521.2480710000,388.0098750000,192.8170670000,245.0088830000,221.8494050000,2183.6596940000,232.0596180000,244.4139460000,331.1489810000,359.7522120000,265.5054850000,434.7035070000,159.0820230000,253.6719320000,154.8533000000,202.6999580000,634.5553270000,194.6329820000,295.1447660000,1121.9326970000,190.2669190000,168.6414830000,175.8277860000,664.9933960000,157.8467190000,1590.6260080000,290.2691830000,1773.4064400000,732.0157060000,428.8125040000,280.7575790000,263.5284380000,348.5711860000,162.1784880000,203.8587170000,295.3447510000,176.6764260000,578.8922260000,205.0891640000,167.6611270000,176.9980310000,287.0186380000,273.0840430000,344.8685680000,193.3409410000,433.7937590000,1013.2289960000,289.4799240000,244.5587330000,786.0496930000,1063.1674200000,216.9301790000,173.8229830000,189.6715860000,997.1989400000,390.6820600000,812.8610410000,248.0972380000,466.5641640000,158.1257090000,706.5002190000,185.4532470000,233.5301750000,166.2460310000,255.3284880000,2647.3899670000,301.5361010000,181.4506760000,685.3836600000,243.1991350000,1335.6607430000,161.9683010000,436.2061390000,206.2977320000,213.6684950000,706.0640430000,1769.0357140000,177.0820720000,2559.8507860000,290.3116810000,158.8348740000,252.2733020000,681.5690050000,264.1158610000,163.6965080000,2615.3020210000,448.6513480000,4862.7094470000,162.1693440000,216.7259310000
476.7944050000,500.8623790000,495.3457730000,423.7227530000,486.8814960000,771.3961520000,1765.4213330000,889.0969010000,762.9244620000,615.2436020000,846.8339040000,784.6174390000,694.7639730000,967.6142380000,-1.0000000000,409.4820460000,1397.7944190000,1025.3971630000,682.8490800000,447.7558310000,831.7731030000,1739.4356720000,589.4584590000,1832.0004950000,684.6599940000,1438.1393660000,535.5620240000,753.6710670000,502.7118420000,1916.6977730000,609.0323030000,452.8806750000,541.8506760000,408.6927950000,576.0020130000,748.5840370000,590.5534500000,1334.2280900000,537.3413840000,581.3107460000,1124.5368040000,569.9854120000,806.3268830000,1751.0492720000,2641.6892350000,1055.2844240000,484.5218640000,498.9500700000,645.0080500000,1521.3616720000,3446.8831440000,510.6923100000,487.8404900000,482.1737730000,733.5643800000,514.6977030000,535.4869150000,1748.5758900000,592.0804490000,466.7557850000,510.5643630000,433.9760910000,2490.4769760000,677.6129880000,692.7378260000,678.2889980000,814.3190170000,556.1570020000,693.7095100000,544.0595160000,491.6981200000,446.7758720000,444.8616390000,889.9969510000,602.5251180000,662.5773180000,960.5959220000,437.1763880000,454.6852750000,470.5716450000,1271.4249590000,452.5005010000,1896.6015550000,483.5281630000,1648.3791280000,891.4852100000,802.3325930000,685.4846540000,532.6339950000,737.1946320000,483.5573440000,499.2719710000,713.9321230000,486.4679530000,1256.4036810000,453.0173780000,474.7290070000,457.1661390000,631.6977360000,586.9241450000,694.9779030000,475.8574000000,1023.5088450000,1500.2414160000,555.3604790000,705.5900720000,1112.9980190000,971.0333730000,606.5288610000,455.1773700000,456.2915100000,928.2403130000,835.3042560000,1182.1006650000,546.4870650000,902.0060290000,430.1925350000,1157.9017560000,517.5315700000,442.7034950000,440.7246450000,710.0324600000,2689.9862790000,547.4021830000,488.9552610000,891.6063960000,546.7398210000,1286.4539960000,409.4949740000,871.1573030000,414.7249770000,614.7802680000,1277.3649630000,2102.9112730000,505.3642650000,2852.6946900000,719.5524040000,460.0308500000,534.4622470000,874.2461480000,520.8146380000,484.4471950000,779.2031770000,787.6448320000,3843.5908560000,467.5744180000,484.9834160000
32.6215100000,109.6383900000,48.6357990000,49.2497830000,47.4861310000,89.5529410000,979.6043670000,185.1463120000,25.0189380000,32.6468220000,50.0812440000,62.4299600000,23.8307680000,199.6451130000,409.4820460000,-1.0000000000,902.4383400000,764.5826150000,45.0667520000,37.1504810000,3479.3343770000,464.1230330000,30.2058880000,1605.5364570000,44.9571060000,909.9583550000,149.1144320000,141.5367700000,21.6349690000,1279.4366670000,30.9077550000,120.4659760000,24.7953510000,25.4112310000,53.7418090000,86.3401830000,74.4036450000,1039.8973680000,83.2024460000,42.8735570000,3451.9824880000,18.8406120000,110.2222040000,1555.1867760000,1963.0497630000,750.8523210000,33.9064560000,40.4131210000,75.8437700000,170.7029680000,2948.2840420000,34.1121920000,27.5423650000,79.7982110000,135.6888160000,68.9984750000,40.9707330000,1197.5906150000,200.4445910000,54.6071540000,37.3182130000,43.0731460000,1744.8116360000,23.4865300000,51.1478990000,64.1440630000,25.3208310000,44.5660230000,202.7050700000,25.4038910000,40.6969200000,24.1879590000,24.2390630000,337.7652730000,60.0311840000,50.9902160000,506.9030980000,28.7741580000,35.0121160000,23.1686050000,198.6159650000,23.2490120000,1334.8580580000,103.1720370000,1395.7856350000,494.7981100000,146.2351470000,64.1748170000,98.0743050000,82.7450580000,26.7194680000,64.2065470000,48.8468860000,19.9575320000,435.1810870000,23.5687780000,47.6364010000,28.9660660000,65.2538720000,47.2528500000,73.2146130000,42.4437410000,47.0052920000,1026.1475930000,150.1728970000,38.9232710000,315.6113170000,639.6569980000,57.8061420000,22.4836690000,25.5022090000,662.3011450000,68.8142480000,491.8810060000,66.2692820000,251.3161420000,35.6417060000,348.3520900000,50.3255480000,72.2710360000,40.7283440000,62.4509050000,2209.6752510000,83.0953730000,29.1702000000,483.2281470000,32.6726230000,997.2952370000,23.6088380000,101.1503120000,32.2168790000,84.1417870000,284.7870970000,1473.1194160000,41.7785370000,2192.8561740000,98.6962660000,25.3512160000,46.5806570000,440.0657290000,50.5258710000,25.3533180000,3399.6343610000,152.2094090000,3368.6801450000,25.6968560000,25.6065530000
992.4061230000,917.6750470000,932.6197180000,875.1163330000,929.4829810000,945.7294200000,1325.4897150000,1032.1830940000,1004.4925030000,900.9447750000,885.6479530000,980.5886970000,921.8953870000,1119.1633320000,1397.7944190000,902.4383400000,-1.0000000000,1138.4182210000,1433.3555230000,882.5703650000,786.4423230000,2214.2145500000,900.6017290000,1588.5337800000,1300.6514780000,1545.1154840000,969.7606910000,1444.5748440000,961.0252330000,2582.4937900000,961.4170460000,1356.7020060000,853.6014320000,1351.4851020000,896.6519920000,1402.5058900000,918.8300890000,1441.0312800000,957.2487350000,914.2582120000,1303.0284890000,896.4950980000,1518.3647830000,2272.1235950000,2727.6660970000,1002.9462150000,934.2332640000,981.9596660000,895.5815110000,2188.5517910000,959.3012560000,943.7779330000,912.8332950000,908.3393090000,1446.8233430000,919.9965780000,1014.3242690000,1860.8909180000,1115.9204460000,912.2197620000,964.6176720000,923.8708230000,2602.2062220000,911.2885600000,891.6556500000,943.6989640000,993.0837860000,927.3262360000,1055.1055610000,877.8179820000,851.8812060000,893.1931910000,930.1184240000,1080.0637960000,948.1342830000,1365.2158490000,1338.5063800000,929.9572100000,895.7272940000,929.6931340000,1725.6772130000,892.1033010000,1952.5372030000,977.0820630000,1868.1338200000,1517.3861860000,1070.6404990000,1335.9568470000,1020.2956130000,981.5676600000,901.9296500000,935.0328880000,1376.3904240000,938.4940480000,1790.4680900000,944.9351500000,1341.6934010000,897.9621620000,1425.7638640000,933.7680690000,1435.2589130000,942.7681920000,1503.7363280000,2185.7930730000,1025.2095070000,1334.7996970000,1456.2702530000,903.9496970000,1303.2766550000,909.4768840000,934.2099480000,960.0897210000,1173.5258790000,1461.9897640000,1010.4809630000,1584.1738180000,901.0959320000,1450.0895580000,947.5041920000,893.2426470000,886.1385440000,1337.0192960000,1047.9750610000,849.2800500000,947.7829760000,1347.8547540000,964.0727250000,1334.8310780000,870.3317150000,1284.9278620000,939.6589390000,926.8182510000,1760.5012750000,2219.5558870000,927.3595790000,3449.6644410000,1361.7100180000,887.5366620000,957.6621490000,1350.0986280000,921.1265600000,923.2905340000,3020.3430320000,1077.0494540000,3676.0020880000,893.0175450000,972.5311830000
745.9179330000,776.0195600000,759.4908690000,761.8442810000,833.6693110000,890.2972770000,1229.2832750000,957.8342840000,750.5642380000,758.2449710000,866.6065050000,842.8848730000,753.3150400000,1091.6595540000,1025.3971630000,764.5826150000,1138.4182210000,-1.0000000000,759.9177960000,779.3402860000,1137.7550580000,1472.6947710000,814.4930210000,2271.0679040000,787.1608340000,1379.9552050000,844.8245420000,786.7214390000,896.7351130000,968.4871050000,798.5075260000,817.2892790000,793.1778360000,767.4350710000,888.5794050000,784.5587610000,848.2416260000,1728.8955450000,886.5505610000,819.7847600000,1570.8447340000,978.9059060000,786.5286370000,2316.0692570000,1935.2546690000,1628.8433610000,775.2724290000,914.6331580000,935.6879840000,1460.8373240000,1349.1615170000,945.6136670000,788.6099250000,821.1627430000,808.6583320000,770.1433300000,746.0788420000,1006.8017240000,861.8447300000,1033.5447110000,756.3521650000,774.2906240000,1557.7122290000,755.6745820000,790.9948670000,813.6646010000,750.5645060000,759.1649080000,865.3370120000,796.2371750000,1017.6783090000,751.7903140000,753.9532580000,1155.8239660000,842.9500520000,790.5731200000,957.6772740000,751.8562020000,1010.9275050000,749.3951780000,1166.7451550000,754.0275570000,1460.5649330000,846.1210050000,2039.1826530000,1026.7723860000,1044.0087840000,793.8034500000,949.3449540000,931.5436270000,770.3300700000,837.1420570000,807.6875920000,746.5391000000,893.2913360000,918.0754530000,823.7045980000,762.2517990000,797.3650930000,813.8780900000,786.2766520000,759.9164900000,837.6805480000,940.2770500000,815.0084960000,821.8181760000,1654.2010080000,1427.0336100000,771.7575180000,755.9030270000,762.0029050000,1332.5050320000,1134.8056650000,1376.3247880000,768.5517040000,1051.0138580000,760.4770130000,1347.4373340000,808.4016620000,769.5319030000,763.8247760000,781.4422540000,1343.7992600000,894.0160660000,752.1097970000,1185.5938450000,754.7231720000,1669.6803200000,749.9553050000,1148.5519670000,757.3715890000,850.5049200000,1573.8631860000,1254.5351330000,835.0320440000,1332.4672210000,774.2935980000,771.8222180000,803.8943740000,985.6251700000,754.8988890000,756.1231740000,1217.8448580000,1198.4199420000,4486.0340520000,781.7489110000,9643.0550660000
