-1.0000000000,557.1492976700,454.1868790743,269.5269875297,299.9160625962,442.7004810605,564.2859284576,601.5512690683,258.1396418823,312.7626456407,436.8652412660,603.9626084394,314.2798950754,1212.1253601932,807.5692500671,441.9891013586,751.1301059438,842.8696599404,294.4660421066,263.2536482281,639.5836385090,541.0113066066,278.3306528563,616.9084854984,293.8062757808,986.1641857605,840.1993533396,810.4341016501,291.4325936373,520.1657708735,331.1290627399,457.0991137883,288.2980601719,271.6255817248,662.2230861918,347.2150007164,497.2388395000,959.9263070866,797.9716277134,271.5456852556,492.9312654255,510.6490271774,255.5628110268,980.6167742848,604.3651749250,945.7933340965,319.5283958084,256.0132264335,503.3209331850,501.0262107585,967.8782656880,272.7352610948,268.1717738447,382.2406161057,266.9775506375,555.6277303101,349.7229238601,1315.4508050120,709.6056157801,770.5323388144,262.6175353804,680.4746482354,664.8219188027,263.2030013854,1125.6117351118,903.2399188177,297.4021779005,252.1114319303,405.8953115840,467.0755472238,443.7030947091,272.9198498267,256.6165593250,568.8411806103,289.0630636430,314.6201425160,927.6010089527,297.2660170819,491.1213493555,294.5452982395,463.5212843251,272.9556082393,691.5412827968,1146.7762387680,1039.2164553412,850.6611776255,362.2367772211,442.1565670161,348.1393012522,443.6531394623,348.8576519853,554.8071229639,482.4689983480,331.0644754604,971.4610974490,299.7386462077,289.2075818472,286.3028421422,311.7780533639,408.5269266254,280.8032244464,982.3940116059,278.0846294244,896.0750741586,966.8568600068,517.8254031164,890.5574269175,1214.1263891800,481.4866279406,296.3887350153,371.2810538004,1591.1418680319,370.6469855824,546.3496774560,289.0345229995,680.0978510207,305.6242049505,561.4540200228,930.9188346886,458.8873740493,516.7823053403,283.5811214625,1000.4046909660,746.0914638671,305.1039155103,466.7814529776,311.4935878179,1227.0482963753,275.8311463254,446.7379893012,320.4638320234,291.0383948941,513.1821195963,754.6382360027,259.5861008824,870.2111322871,297.1888936604,376.0059834994,317.3498011997,762.4053926134,291.6369881346,244.5459881165,623.5068843331,738.3795246415,1150.5073785463,279.1851141978,310.3343011886
557.1492976700,-1.0000000000,241.0290477787,616.9876441752,469.3729960737,406.9322636453,970.2495564872,819.5951039425,547.0705274672,537.0427182123,420.1496232538,630.1303977967,532.3549463775,1629.2550955462,682.0951351269,513.4343471409,806.6830014400,839.4159789009,561.7822124195,507.7593934846,395.9218422009,501.3307077331,445.7194702817,609.8896905228,355.4200916442,729.2774556253,433.6522594651,523.5967358194,418.9366895795,672.9118112936,528.5221782095,390.3940849107,446.3975238367,614.5694959639,260.3332839157,461.0140949450,705.3304432555,995.2646399644,724.0063063344,617.4763134156,625.6792079075,452.2639651116,504.1154702796,680.5241725480,491.2702245828,938.2456385313,649.7950528013,602.2195662248,487.6835230462,861.8009857963,573.6529788071,461.5808135260,457.1462220337,731.6078996132,440.4638059346,591.8102563108,445.9944103739,867.1583729375,489.3066424031,587.1698691431,578.7114496262,428.6835327977,946.9085741049,420.6526867094,830.4505968146,442.5360535286,367.8640750038,550.8906185392,467.9471802264,358.0073538596,244.7732873491,655.2026503186,451.3748609567,756.3418413805,615.1086702404,341.7212210466,826.7517168317,503.1838366478,449.1739562921,629.6521003688,726.7874005359,528.6858142546,369.4757748375,734.7637954818,916.2996316741,1028.0070049315,590.7333715247,597.9515210734,369.2282513017,611.3011538984,466.8038144204,878.7107731787,658.1660163152,408.6799627431,886.0068575724,363.5706608594,637.7349664094,660.1186888442,640.5052208910,454.0441545635,655.6238951422,556.2141573989,500.3518972593,991.1046205835,747.1155624926,637.7290751709,977.2373882240,766.9725616943,344.5033973493,523.4877312410,575.9171451656,972.4585899964,701.0272738056,466.1797431127,556.1273420641,601.4885491865,631.7075746360,829.8255137202,1000.0871662399,550.7854071412,684.8099600716,589.5970682168,749.1443291361,574.1516685128,616.3883635271,638.1633981164,525.4349528124,932.4471962236,433.7907394565,562.1464420427,520.6511179498,615.6662803208,582.1609011784,761.0914476517,532.5476023966,587.6563664195,482.7815926603,454.4330979439,560.9677666972,517.3519244517,492.9875803937,621.5679785845,534.2398000880,740.9120593346,1328.2946870862,455.2998550723,476.3700005391
454.1868790743,241.0290477787,-1.0000000000,402.7768942813,396.1945568840,387.2890061144,790.7302427873,671.8721990902,402.0171929397,371.0908846828,374.1662271707,612.7365876731,400.1634169085,1316.4464233497,661.8436122825,410.2985677833,641.9548200397,812.1164484021,359.6715943952,354.4353950402,474.9569857264,413.8245166334,359.1337582180,652.7775641554,245.2188094638,891.9879794545,560.8151957114,585.8723010342,295.9121873373,579.5460901791,401.9667984307,409.6048000773,325.5005386940,458.1159762818,306.2188988025,307.2012491841,594.3392174881,969.6721968507,580.4362823297,465.3152737989,437.6261024134,452.5699673863,354.4612412503,785.4003322854,474.0938992352,850.0371133819,495.6482094948,448.0676236076,372.7859554359,641.9562482684,570.7607878084,340.9751811178,327.8021176686,595.1651534449,315.9311121985,453.6432921829,372.8909705278,1002.3013095849,566.9786182747,608.9683895686,386.3096996986,436.3556562259,867.7123856687,299.2214562105,851.9113312482,589.6206577375,322.2436992644,396.2351330402,358.9955845703,313.4319756950,239.3041013366,492.4002512342,306.8801944942,728.1707357108,402.1200752188,241.2606845897,799.1318295192,358.3485023315,381.4031089806,493.2152689784,535.5206400001,425.0742349835,416.5518639492,749.7720446798,911.0677190291,918.7254442164,453.7888086062,634.0680321148,265.0017320275,581.7542757266,375.0825974342,735.1180541085,511.1516669436,367.4987433315,764.4077623089,324.3780182584,463.3824265393,523.9705012322,470.6668567297,342.1831169866,546.9380565584,637.7161248710,356.8701402194,839.2362368649,785.8053836407,541.0489490859,1008.6520745668,875.0346460053,247.7607516802,358.5478077529,510.9321437353,1123.3948725637,527.2221863199,394.0263696666,369.8497351856,586.6403421431,433.9416968771,625.6544891338,919.8172596172,488.8658279592,540.8465838509,429.6234182304,943.8570882278,638.0047800107,472.2826397985,621.4031302568,321.0097906128,895.9146671312,296.9615811806,400.4720353399,395.5605270223,428.3916131099,473.7724143252,682.7678690539,401.6928207828,753.2680141861,358.8273263009,384.7813671080,429.6554330620,610.7379325472,316.2747209501,474.9128714877,609.1895677539,707.6514128749,1206.8108725215,319.7531655513,362.7111622009
269.5269875297,616.9876441752,402.7768942813,-1.0000000000,405.4971397341,446.8135324230,590.9826614852,580.1623391945,260.0280278849,258.9833705852,535.2269904122,719.5546679667,266.3741177955,1134.4023303103,759.1915512376,383.3332112141,713.6525866729,864.7217793294,214.2331777911,248.3325275892,597.3308073509,457.5623967199,261.5073849441,724.2125518663,262.0807667477,1189.7188030032,937.5312531416,777.1399187789,241.8487560844,565.5600378382,357.0224275353,546.5430728475,281.3045138968,266.4697329723,664.9073232704,298.6079621391,467.1616035049,996.2033698106,751.0502456481,237.3610478164,326.1964962450,507.3724798961,269.1238439664,1090.6601329003,600.2493963781,936.7702975193,290.8062397303,257.6256991506,501.8023093467,473.7717063175,863.9214005131,263.9068976041,225.5348395442,353.4718427995,265.7206761541,527.6112983574,448.1924707371,1417.4012788784,814.5282867488,738.7788820649,249.8251250997,672.5845889065,761.9410557773,240.5133727367,1161.3678609384,961.2225623956,371.5516667764,262.4938832120,366.7168860901,484.1869707214,505.1851363960,262.8619059987,249.8434681242,613.5971363859,240.6733875386,250.6209989394,1052.8860015862,235.0453988685,453.3502421972,251.1754716896,385.3823617265,263.6030724896,701.1354723600,1010.0874865844,1108.9641284724,922.8853556093,382.8755847874,465.1160686969,286.5732600810,547.1311498062,313.9339634360,546.3079593781,486.2982317926,320.5200045752,922.5956125150,320.4835331005,237.7503315656,305.4093169266,303.3484743708,303.7681790015,294.1939059454,985.7456009682,284.2288680201,917.0217851148,905.3327509359,547.8923639752,994.8167565396,1380.9426344099,394.5801328438,214.9586596707,356.3983027947,1661.1732477268,415.8134893824,420.2465520476,249.9618747573,691.8563903041,238.6024340605,442.5010325155,949.5521518167,473.6243309482,502.7399561090,249.7137422613,1159.8696025595,864.0657316254,326.4134332168,596.9982550806,248.5145905603,1256.3741340391,225.2472361278,352.2774877601,323.0146473797,240.4348813367,523.9919729431,795.4952823983,244.2773861018,1004.9946978725,300.2847002108,338.8787734133,349.0268127323,840.7331095735,261.0188533393,244.2885418550,755.0242594184,849.0344487938,1185.3772870393,256.1238930175,300.8373030924
299.9160625962,469.3729960737,396.1945568840,405.4971397341,-1.0000000000,503.8110956105,594.0553167843,642.0038620571,313.7583172108,417.0260409896,350.9650066705,669.2348412414,354.4894053531,1319.8054625394,766.9972156775,440.9435582602,805.3588507992,853.3408801087,402.2349677325,298.1980923054,526.8394012026,512.7208111687,352.6152405956,532.1240872419,308.2320886475,768.1740248731,597.6114256192,802.4041254598,316.3870611574,572.1549402119,355.6706893225,442.3249012857,316.0159250473,345.3383666644,584.3488180005,382.8997672705,538.2615520540,919.8145361091,791.8851292402,355.1349794096,523.8192968180,585.5928215368,298.6431040718,739.5176238204,580.5421076401,911.2234165354,391.8854666257,317.1804060326,549.7513008528,570.3811410132,872.7329959223,286.3563199934,314.8194590081,462.3567612710,281.9653245711,587.9427704862,370.0821754351,1105.1925639476,585.6784943123,706.4372083651,335.9230617149,630.7079867432,669.3096603078,295.3609331484,948.1373200280,783.9496868254,294.8418497593,282.1560984212,420.3606049243,445.9151760343,344.8119320425,345.0988597843,288.6195650775,579.9862606497,372.7458820053,349.1570673916,834.0045889965,369.9083012542,489.0295669304,399.5923647663,567.2433883502,340.3322745315,608.5431839101,1010.2265756191,953.2009748242,924.3851341910,396.3185986994,528.9551561527,390.1221992346,488.4348253558,408.5224575710,652.4388663600,519.3759969101,352.1095288999,920.3251969227,280.4612256802,374.7308981561,334.4518052816,393.2295131595,454.5943062344,388.0396656210,915.0177002532,298.8494665160,932.0755108794,870.2542934969,512.3972770399,793.2690405654,978.4643681939,462.4643791950,377.3841432440,476.7001705303,1339.7710614352,407.7703254335,575.5476844796,358.4706496735,562.7423515867,408.1653375684,683.2769313119,949.1624786282,463.7526909858,554.9324931134,359.1336834585,927.8953722465,584.3548676972,353.5071878727,460.1898197693,364.0696178274,1113.2089887802,308.3940301439,478.2456630709,358.3107805693,357.1921412162,488.1194470813,699.8536614289,330.8344588832,681.6408418785,324.8176307549,435.9887816702,352.7393418475,625.1115840982,313.9394742013,349.0758469965,489.4862279238,652.2882267158,1159.0307811231,309.8825737067,326.4018739770
442.7004810605,406.9322636453,387.2890061144,446.8135324230,503.8110956105,-1.0000000000,888.3717302084,589.2512705041,427.4534224807,418.4077002841,640.4241696277,502.7238902912,409.3235897250,1251.8100614134,764.4203577289,425.0127142806,548.2940061048,875.0432945048,472.0618246322,435.7292245368,446.6769493399,739.4537505485,268.9403780711,787.3571420989,342.7404517132,952.1725733430,669.2943865211,399.8548194766,442.8351067950,591.1867411019,479.0507272292,440.3615006314,389.9944062591,537.1805701313,271.5935622802,404.1009290585,685.4417429963,1066.5239240270,672.3404823836,485.1761365343,458.5693017628,179.9131565927,466.1399951398,918.9919872159,623.7317437347,815.8143434759,510.7174109169,542.1128653695,340.0036339387,723.0434126201,608.3753922445,415.8602544275,410.8889971534,591.6348996968,442.9789671425,416.5265255517,424.5802462321,1015.6578733772,590.4102937177,608.3049387698,491.7902611356,381.7855078999,963.4272888182,381.8953266763,953.7769691702,566.2755979158,427.1617951314,497.0623291516,553.5164508426,401.0551829303,455.7278508420,527.1391953046,414.0236031059,802.3971527551,475.9177287129,282.0153434068,868.6200823201,403.7059287333,237.7691391927,505.6845365617,577.3699192187,415.0074313355,452.1473963196,853.8960276694,1093.4020317821,710.3932608121,584.2942242569,578.6994802890,297.8796312357,435.1325621780,306.3565640195,688.7057243983,551.2893253797,274.3955976150,752.7084842551,363.0321027628,483.8322926285,554.1826364201,575.2915007031,535.8082194679,489.7008535594,509.6986410801,479.1743838649,882.0977318918,732.7951808324,475.8614415548,1067.8047856436,953.4797608508,300.9649217145,387.6224786679,321.1935540722,1208.7509813247,672.7876010643,645.0879419019,522.8845931132,662.2246225551,512.2385987687,643.8373824109,769.7712658664,517.4769622024,561.5386697125,488.6279880765,931.9550173310,687.6357373704,560.7861219155,728.8064828370,438.9950740281,955.8591428548,440.5579271699,551.0895465418,456.9567254511,503.2289090568,698.1852582311,616.3231786284,473.9645982770,929.6462899561,456.9060743572,312.6751908871,547.5426573842,721.3992172435,453.7452025943,450.3941062979,745.7274889703,949.4815385381,1065.0772687616,400.4592857448,554.6587464331
564.2859284576,970.2495564872,790.7302427873,590.9826614852,594.0553167843,888.3717302084,-1.0000000000,790.9900315368,516.0032409605,550.3911100248,693.8004880105,1010.9980681028,475.9131087192,1194.8996206362,753.7889281040,683.8609394407,1025.3461121671,969.2617838691,562.4068124827,520.6855208528,985.4300321422,776.5627689858,574.6971093463,945.5191335813,587.5784248369,1100.6242248898,1289.4945323467,1255.7534184998,593.0463352758,730.4196893575,603.2417419074,791.0854696135,532.6873673133,555.8096974934,1124.7965094097,577.5598789426,621.9442585177,792.8684753450,1093.5215263601,524.5031183736,764.8986272938,944.6480740794,506.2154258764,1240.8758296881,871.6511165135,974.5492853551,433.7419637471,480.4537291942,789.5635708180,548.5050686290,1138.7236146060,483.0486719222,572.0744497415,528.8424897570,552.4787137393,762.4532510878,680.4757656662,1517.6194726859,1189.0298418482,758.9161351780,504.3432380696,1134.8811295678,524.4712177863,555.3626948599,1299.5775377321,1400.7707510404,653.5381863497,482.9337874265,714.6255345094,839.5298347480,772.6561303904,512.6075627615,517.8361936767,580.0273504027,547.1928221551,646.3982225274,984.8682993706,536.4484080277,822.9291211726,593.3023517857,594.6346986486,568.8415261336,959.7900598768,1248.7706109995,1127.4323055890,983.6186739543,503.3634623117,777.9055635509,608.4815043827,782.3100543837,697.2545057637,738.0187714630,662.1492673107,567.6911698493,1150.4334229690,674.0629666326,474.6097378372,497.3862266425,612.1659831116,708.5412212476,563.8566445624,1431.7621428538,512.9056868715,1020.1384883181,996.7530522243,637.8221445654,728.4162077430,1433.7748148259,751.6995627303,543.0473243640,660.4939880789,1713.3141297456,492.3555470960,781.1686690703,539.9447832271,1023.4530893984,539.1427355913,700.8778167745,990.8753036578,635.2351299250,771.1373334831,454.9317644461,1232.5251606089,1061.6638888015,446.9268601371,562.7099320982,576.9659724124,1438.6892725079,532.6468297913,699.6154524340,511.5381433129,565.9992542996,750.8643301929,955.5294687727,597.6893681079,1068.1423985263,481.8738613977,760.4022474727,436.8985201597,964.5226459541,522.1996512422,548.3120606663,923.1272374683,767.3409470407,1024.3103830226,526.3782421137,561.6745272014
601.5512690683,819.5951039425,671.8721990902,580.1623391945,642.0038620571,589.2512705041,790.9900315368,-1.0000000000,597.0139849558,556.3240961881,665.9669989927,523.6735444271,457.1154945363,729.0740117440,810.8967454090,559.8215035680,539.1623239373,621.0274152601,616.5300985775,559.6202968969,721.1222074196,929.2229825146,470.1493977147,795.6977024418,534.3528706256,816.2585179923,931.7841244051,780.8109793341,605.7543099038,430.8568882924,685.8885579868,729.5600949842,443.3739071781,747.0334910043,703.6229414117,392.7652903841,770.7524065027,788.2995848715,452.3895384370,591.1140051433,575.8513813938,486.2536697515,599.1274034375,942.4832887869,860.2524778494,784.7710061217,533.3361975182,574.7213902326,533.4135096998,668.6357532625,821.6038234427,515.3627801222,560.2416369702,695.3711256266,579.6775529664,473.1636734318,640.7881587289,842.8579755659,703.7812747992,696.2188880833,624.7365046545,642.0625376212,786.3061202018,493.8685139740,641.2963487335,907.8432883101,608.1044392170,646.6054883625,756.6009788305,813.6494910610,756.3343355019,620.3418307107,554.6956484868,699.2834559493,607.6581164395,517.5320860369,701.3822370055,469.6341231801,501.2061443795,723.2792709033,659.8710890803,557.2879955494,879.4833419801,781.1413116892,727.2555206403,495.5981434571,689.2799953729,553.3041669931,458.0536078816,689.6554673097,459.6396362134,691.6084491016,447.4986689686,411.9227159993,446.1456345095,608.1925404413,502.5302640543,704.7161999163,837.0836200743,772.7884872975,728.1138003664,792.1220607784,593.5293481865,453.2366545795,675.1706383656,360.8635757523,1119.4695211170,1126.4271587607,521.1823491767,463.7592233837,477.1847205606,1065.1847791814,703.5615536483,866.6999341016,664.9392396344,693.5293581822,607.6269394328,717.4554897396,403.3503670059,331.2791862265,451.5086639088,566.0172084850,737.9966048479,629.9019415537,689.5907418223,529.1684191712,567.8678342478,777.1411871019,495.5348228494,752.7223355654,450.8449307434,613.7436248460,946.5487844944,448.0326205708,687.7309512578,694.7377864065,521.8157199545,549.5073798685,552.8223737271,681.1791904789,519.0707225858,651.9472262805,764.4578525934,575.5580494256,828.1537627381,454.6207582781,712.0186033768
258.1396418823,547.0705274672,402.0171929397,260.0280278849,313.7583172108,427.4534224807,516.0032409605,597.0139849558,-1.0000000000,281.0003745387,463.4998975421,717.9688391833,268.9475984702,1218.8989282957,770.5765242764,364.4169208164,750.2594062043,877.8208499275,265.3137195312,230.5900313322,617.0177869766,472.1100371430,272.5145913246,676.2926529021,274.1898654726,1116.8178383681,856.8000181569,756.5923911323,257.1981379928,557.0767129762,321.0555064842,488.3913826115,272.7512382678,264.9456699034,608.4721276449,305.8047327869,464.9862845038,966.6832457274,791.6443303309,250.7368968325,449.0891015595,502.8836758864,219.5717099078,1032.5650887840,576.0324334662,950.3129239745,285.2983887390,249.5772567389,489.4050324833,447.1996155172,887.9258191804,268.2441842028,244.2826249783,374.1152887442,253.3408894364,514.4193555437,345.8408363672,1348.5164926030,777.8165620861,696.9545182797,235.7546615282,669.0524045277,698.0359301621,242.9668497642,1187.9976763024,921.5162556239,316.5129409467,216.2627643785,357.1799688280,440.7759913668,435.5292447737,246.7946231967,218.8404224526,601.9574983218,264.1931619625,265.1022921242,1017.4718195687,265.3222267327,425.6179540517,265.8781492544,418.1536563444,271.0086020444,607.1508431786,1105.0850060064,1097.7864352636,904.9488767586,322.6804059176,485.2912500204,295.9416749950,468.8150247625,323.0915713620,612.8667492322,498.2102196803,285.1011301391,946.2028776023,309.2295416602,265.7578353105,268.0190000753,312.9540122354,323.1197044580,287.1683462080,943.6688011322,258.2430714566,940.6639203491,958.3489455293,524.5156949574,846.4040524980,1312.6273297297,369.9760662217,250.0511323284,360.2633405906,1606.9278419209,396.4958224812,482.7293351977,261.3696825177,711.4636604827,282.9590021185,486.0779920895,984.1749187620,476.6282583695,524.7620114624,252.6315536534,1116.1914415741,789.1322627161,297.1490245825,543.0118621846,255.7321372259,1231.9852392690,258.7293173745,379.5543629836,308.6204470731,265.7215555616,473.3338871238,760.0927686679,253.6674901708,951.8776117504,280.8728155750,369.3356681083,319.1234685089,840.2607252774,255.7196184293,244.5836839809,671.8142348024,827.8981590822,1161.7745790926,257.2757283259,268.5935025666
312.7626456407,537.0427182123,371.0908846828,258.9833705852,417.0260409896,418.4077002841,550.3911100248,556.3240961881,281.0003745387,-1.0000000000,486.3526890955,693.9526683186,231.9174782159,1112.7090085195,633.1804847411,422.1355203565,631.2139586024,814.9895496106,218.9048005022,242.1520609192,564.0779438611,537.6952812641,271.2321796031,740.3779692867,261.7163521284,1131.5892946748,877.6047881337,778.6847921363,263.6209589344,487.5244860037,382.3650488456,519.8233776124,244.6476993301,325.5121741029,585.3263706464,274.0030838706,481.7468739854,831.5705022693,751.7683454973,261.9751504109,308.2263478332,469.1473839744,254.2093213911,1042.6011879924,513.5404640270,770.5617143197,280.6025264003,275.5665509036,450.6437506089,406.5539865298,761.5357405779,274.3596681657,275.2505069596,399.8412616227,275.1819433301,405.4197968776,433.3680238339,1358.8042772721,792.9284898728,591.3489484472,243.3894600676,646.5271354933,713.0980778513,245.3326131829,1060.0372887935,939.8783285160,369.8005318803,296.2492237844,372.3934988373,436.0053611266,445.9076730171,297.3299697861,245.6283246709,579.8189412906,249.9503373309,240.2265458707,934.7754541075,197.8236562503,434.0395836821,339.2426007495,365.7099973092,266.1845549323,668.4310474169,909.0590896136,1057.1178399638,819.3854995578,320.6890221339,557.8646041771,234.8523409217,590.9736087386,336.7691559343,523.4179346508,449.5623567477,316.5759175975,828.2274956399,316.8892186776,222.1602200839,359.7046169430,383.5568139486,346.5166214791,383.9228133929,928.1623388892,298.3340472903,823.4815620298,766.3395547717,469.2516054527,955.7619238407,1223.0349673409,315.8003359907,187.8196489499,330.0977509806,1472.8952946693,441.1385323902,448.7841499890,260.2373874761,701.6459659400,248.8357220647,391.5063577926,808.4078015189,394.9841843688,525.8411160436,211.2567610442,1125.1560853266,848.2168026892,340.3660162574,566.2758814359,237.0207738630,1234.0803165614,240.5950788364,344.6857276778,289.1767415129,273.0099591547,546.7790954937,763.5224536796,300.3694255297,952.3182205040,271.6102121305,376.5212389391,344.4629843648,731.9700867921,239.8688214053,306.0579069569,756.0506724514,777.6134025796,980.6716870091,250.1776520124,312.3690788146
436.8652412660,420.1496232538,374.1662271707,535.2269904122,350.9650066705,640.4241696277,693.8004880105,665.9669989927,463.4998975421,486.3526890955,-1.0000000000,607.2041193129,435.5495478269,1368.6731735852,638.2845516119,572.9344723995,864.6991261452,750.5864220120,517.5237660229,401.0328284605,613.4249955585,492.6139359169,455.3648619124,508.1956058572,341.0407892053,728.6736382773,527.4733898004,805.9119771729,360.8195466500,527.8453076119,382.2667702146,428.7651407948,324.0753417409,453.7993442781,531.3530750310,421.3620485602,557.7151258820,740.6430676887,740.6959671034,473.5781030807,738.6039793275,693.7738697299,383.5872906528,617.6154256833,524.9926939876,902.9722849695,530.1055279489,430.1081762932,578.1918316370,649.9782272405,703.0855786266,297.5127771669,366.2795415882,564.0782020393,324.7708681907,604.2161235955,429.5513976321,952.5989398486,458.0400406164,600.3494327629,466.2278773985,580.6819796088,617.3760535736,315.3938741392,713.2384635067,651.3790118676,320.8954948067,421.5211220980,488.4079765682,516.3241171435,311.8082271547,503.0223945522,340.9905146013,575.7398396398,490.3530893122,408.0625471184,732.5737839999,466.3215214909,619.8725458512,569.2426591917,668.8937005308,435.5512859400,609.9837768550,865.6422407731,761.1431679843,857.5029349205,436.4245231793,557.7003851513,439.1341134453,621.0516939662,499.4886127950,680.7067157966,504.0684055737,479.0546102241,856.1729163202,362.7656910255,481.2940140427,487.2538647874,528.6341410635,533.4970086205,576.5569006468,845.9311723575,379.3439679946,747.0022617714,720.1132421520,449.9068783357,836.9015450996,944.0800703592,497.2222385631,442.6315008566,600.8804895481,1079.7949382175,375.1634125706,559.9582196094,424.7048028928,515.1541522279,502.6159346424,849.4400169150,853.4418426637,389.9157795138,560.3380691200,467.0423497947,821.8981324733,444.9388293392,453.2345649784,416.6255733765,458.6141035579,941.6885747811,317.7269788195,567.5482481741,365.4233496659,488.6356754834,505.9570802483,687.6474407893,424.7521619668,590.1524057483,324.4145536785,524.1708011304,320.1328795207,462.2270680995,361.4882321549,495.7962671508,518.8935025604,429.0039192962,1162.7841629619,334.2392222121,351.9114861975
603.9626084394,630.1303977967,612.7365876731,719.5546679667,669.2348412414,502.7238902912,1010.9980681028,523.6735444271,717.9688391833,693.9526683186,607.2041193129,-1.0000000000,558.0836164650,1178.1695235202,907.4123928495,625.7369934948,482.7966496535,752.0490915736,748.9107758722,671.5741521276,518.2459494530,906.2697777605,509.7349330049,767.0950839824,516.3259407223,654.5781772605,721.5179677966,636.8909060440,705.5171912809,582.9646165672,705.9510092552,436.2346721211,509.5234657278,786.3954298278,482.6945948787,545.4794585682,764.4539394086,1029.2646537865,608.7406112453,682.1749415140,768.1750829806,433.3404100994,696.0646308814,830.6766553860,854.0483918718,909.9734977996,719.9230761895,712.3169349236,483.4611166557,926.5194063037,575.6582427004,542.7757613185,604.2182495409,849.7326660926,629.4093020546,530.3831827038,582.5200600115,637.3743796643,556.9808481191,785.7579210884,749.7736739402,321.6570453565,936.1866099809,553.0376796956,514.0694292195,528.1964204141,550.1424551690,750.0050944731,824.6549482490,771.7713113897,601.7476621887,772.9336869085,597.0591733910,884.5964472074,750.5253836386,544.0988493818,697.8245220579,638.4667687309,475.5871649872,795.8207416715,831.9826854578,621.9311908270,646.6311945561,603.0308327256,790.3868890314,460.5189551363,839.7724454373,618.3385486349,535.5293101755,621.0524953201,504.1580808205,720.8023943328,453.8125874892,516.9218674385,520.8129319066,586.2921784640,733.7835421210,759.7933866967,906.5465667331,879.5869311750,727.6371089482,551.2053364361,685.6724219929,571.9414068325,646.6452709783,463.4598178996,1144.2755146101,761.3330528280,601.0504194788,623.4516447763,538.1713514222,832.6925401818,740.7603853211,896.5095038001,755.8510434606,536.3360778941,782.8284244449,926.3388685839,551.8881025741,502.7485982096,463.5765793898,704.9790702501,597.1681372270,540.5755235115,739.1441704561,643.9457287762,724.1530418944,741.2993712128,572.2718831382,948.1762872690,532.3379025154,723.7714092057,912.8204611638,580.1514251846,756.0640521429,685.7747407570,549.7166015506,530.5754468280,601.1755844210,607.1806563618,623.1159393433,681.7895501327,728.5504116756,667.0350956116,1007.4744660696,541.2606437498,733.9513204407
314.2798950754,532.3549463775,400.1634169085,266.3741177955,354.4894053531,409.3235897250,475.9131087192,457.1154945363,268.9475984702,231.9174782159,435.5495478269,558.0836164650,-1.0000000000,996.5856991404,511.7159926320,420.8130740655,602.0376155946,667.9732204907,255.1511253032,234.3691315767,553.2673555731,586.7042340344,215.5353587707,662.1493906521,215.4625156864,950.9905460929,841.6827767038,789.8638180340,291.6056016964,401.2196361909,378.6856453068,493.8105580869,174.3209482088,354.1936286874,565.6709682220,211.5799056414,463.7443927931,662.0909165323,650.1392872851,242.7605501408,350.4929351320,409.1764671414,258.0340468804,945.3307006841,582.9600840470,649.3685035867,229.0118708274,244.8286492451,403.1463084270,411.6611720142,710.2001098442,196.2382634234,265.0278236441,406.5833257480,251.4958902018,361.8442478414,423.1195569158,1134.9200219431,725.3551822412,497.4109315067,256.8519386108,597.7365299349,548.9579540945,205.8852904463,895.1417992961,850.2612665144,340.4353902477,279.2441686827,458.8624796077,497.6789797643,453.2094748291,280.1820291558,218.8624074058,536.4010023391,266.3074270938,248.6294127520,772.7868827962,190.4416079900,410.4767010228,363.1588082999,388.9229015405,272.7366355756,656.1866283985,852.0833373865,905.6775736821,673.5224359737,341.2133167595,486.8987094905,220.8324635178,568.4694956212,333.9578674125,508.9995669979,354.0534387535,228.5242680052,720.7139843933,308.6395905755,198.5576969574,317.0052257985,445.3027147744,456.9702329636,358.6913882725,879.4750209145,282.2265777726,667.6455428624,652.4745107268,313.6227326458,836.8918338112,1110.8898983275,358.8875366210,184.0373398960,290.1891020005,1287.6021507582,376.5234506814,558.6807946475,286.1143807636,629.7772840135,289.7278740798,448.0677783486,604.9196944311,256.5468187124,430.9046680543,212.2991055644,958.1494703313,711.3567376078,297.0226335901,423.9655214859,272.4160173415,1081.9573439316,239.4662053722,418.2770732307,199.0005529918,294.5701232119,575.9629160101,631.0165164465,332.9792305939,790.2491822752,206.4212637510,393.1660079629,237.7430589000,654.5256714129,237.7637592282,306.7514154264,711.3339464023,593.9804851556,854.5245916835,182.0172006289,313.8822481222
1212.1253601932,1629.2550955462,1316.4464233497,1134.4023303103,1319.8054625394,1251.8100614134,1194.8996206362,729.0740117440,1218.8989282957,1112.7090085195,1368.6731735852,1178.1695235202,996.5856991404,-1.0000000000,1488.0231459036,909.0533318423,921.5935244978,1214.5849023462,1130.3184027301,1073.1169065655,1340.6477553252,1389.4705337358,953.5202965824,1464.1393247862,1164.4115261015,1498.2392871100,1646.8157209441,1428.5388213411,1172.8914609708,734.2833204150,1245.2255104781,1482.8839065019,1022.0058498925,1281.0426181324,1566.7858359857,900.5111346826,1311.2529822767,1321.2212450549,568.9569780310,1116.5688154563,1051.1098790378,1183.6063758023,1170.3449654861,1621.3728292379,1434.2665801503,975.0396804107,1002.9068144601,1120.0678455360,949.7446192337,1171.1234546517,1351.2175949858,1086.9962287259,1145.2098217436,1140.5015694446,1169.3784148640,868.4977839117,1047.4245079400,1410.9814682251,1602.6134453337,1417.0951363037,1144.3125014993,1347.8298237111,1302.7610068261,1091.3109262914,1175.5500648714,1967.2759689433,1215.0709285986,1208.4821551042,1365.6723992041,1336.6825782924,1498.1879798981,1175.0574877286,1131.8216588565,1285.2840252616,1129.1089182513,1154.9147000673,913.4920112802,962.6762986324,986.3910759612,1247.8641012940,1145.6719435963,1118.7649074981,1618.3698477056,1318.2362363876,1024.7347489865,706.0211545284,1203.2894562843,1432.5380741269,1010.1926963994,1156.7610177099,955.2944243126,1045.8818621925,892.7014680721,960.4904920716,615.9981834794,1197.0827363487,1028.4737826010,1323.1211646894,1365.0474731607,1292.2394613830,1223.3864829750,1316.7285533256,1105.5784271646,589.8905955668,1372.4654867768,689.7228804969,1718.7241044421,1687.3506041464,1110.8533931791,993.1895254421,1083.4816330907,1609.5821416542,1289.1654811421,1456.0021193073,1192.9372282753,1356.0238379152,1124.9507063999,1147.4125246195,799.8684218605,926.3929645144,1026.5586178522,1125.1277174192,1538.9892602174,1221.1112360926,1236.8510853410,1066.1982744637,1146.4757305728,1181.3041825150,1108.0031440237,1340.0699089784,947.2783331328,1101.2577164265,1547.2173875703,893.4132351251,1271.4877434227,1366.9862942352,1089.2621634642,999.1912736708,1124.0376684665,1318.3544948742,1116.1521516300,1207.4007928000,1386.8886151388,1054.0445716809,966.1555369115,1055.4540917223,1272.1634995382
807.5692500671,682.0951351269,661.8436122825,759.1915512376,766.9972156775,764.4203577289,753.7889281040,810.8967454090,770.5765242764,633.1804847411,638.2845516119,907.4123928495,511.7159926320,1488.0231459036,-1.0000000000,813.0358713048,968.9989390673,802.6652647481,668.2577456935,733.7437780494,723.2187494746,791.0527231498,710.9237892531,908.9664917108,631.4625544855,894.5839282854,727.3577564213,955.4970426415,650.3126525706,756.1301821470,607.0458749151,624.4467420856,624.9114294574,789.3680830738,670.4297722288,663.4172576234,593.0305960233,561.0186719252,1005.0658199346,762.0018997375,814.9928597524,748.5624410578,703.6159652549,903.2474804035,756.4228855187,763.5138796929,674.0657742553,765.6684932041,788.4756707539,756.4595872523,589.0952527537,582.8154871801,711.2376390546,752.3312500246,652.8662100686,658.3448695538,772.6604743357,776.7308221453,724.4703758944,341.1729993942,729.0990527109,753.3002279773,780.7779199259,646.7833748278,794.2614631441,826.1294083530,665.3035861668,769.3695657998,713.4037194256,716.3127796591,641.6979321244,821.4694965140,667.0764432544,800.5545821222,733.1664830941,659.6339903253,800.7281156916,607.1957732009,798.8735409052,855.2470635070,794.2432020317,699.9538389974,851.6698055068,594.1144464258,962.2776644305,927.4253731742,754.4920076157,967.2055840009,629.4365419708,943.0089555664,708.9250216107,720.3482584673,710.2347336869,629.8891836235,1022.4435351357,729.2502178084,651.2643516475,812.2146843366,837.8103330636,758.7898371530,913.8508110301,879.7818270493,743.8957177429,997.7367898134,452.8728110505,639.4145585117,872.6418561104,638.2870659712,607.8232999261,583.4526907060,708.3158813093,847.5284667400,728.5031299889,786.5316875365,711.5463288860,887.0807480693,662.2480579150,859.9040983309,795.8941697963,541.8842288362,878.9990294170,712.6397444604,983.1864517791,711.2265689757,672.0548586011,697.0860837106,629.1033592219,1073.0731593145,619.0923542092,796.1806053085,607.4867930924,748.8783556849,870.0949926456,956.3972287241,707.0855564202,823.1392103191,581.6170020878,729.9931717977,610.1071057361,528.9278799131,683.2900330982,810.0902319479,861.4472357565,717.3771679383,1096.1882767243,611.7020975261,663.5036760964
441.9891013586,513.4343471409,410.2985677833,383.3332112141,440.9435582602,425.0127142806,683.8609394407,559.8215035680,364.4169208164,422.1355203565,572.9344723995,625.7369934948,420.8130740655,909.0533318423,813.0358713048,-1.0000000000,645.3340394330,929.3750614373,373.8561304090,346.2094862194,524.3180508399,535.7903151938,339.1728843594,819.0841530442,338.6089723080,1105.0092864501,757.2031735146,638.5609696792,352.9609367816,563.4141212281,413.0913775913,552.2075248018,378.9340811458,412.4233814317,559.8603857621,362.2680210192,580.5907196226,1037.3378598552,466.0042352586,421.9873218879,459.5406833945,477.6961866992,381.0383650609,994.9868123542,679.7698786186,881.1074330263,433.3148754985,418.2353080315,453.5221053638,633.5558304675,907.2644983587,356.8137222228,356.9687850103,489.2913869312,366.6738649975,557.5563266403,312.0674938423,1215.3487842203,761.5457661118,714.3496105637,396.3208026546,557.4938003454,911.2907292534,351.0562211520,1044.0724830755,915.5035260984,421.9103910572,380.3706738278,428.4746476712,401.7308366461,481.8649440076,398.1867341317,351.5259708998,794.5358070189,378.2192199472,332.8719083202,871.2191498339,376.0282761462,335.9347178441,385.0317424729,542.1801900554,426.8233352613,597.8255914053,973.5018195527,856.6929033128,683.0481812556,506.1766007668,689.5075934200,344.5322235513,409.9858980955,331.2717838504,598.9107882324,540.1916964105,351.6378181884,641.7488474316,407.8549601164,427.3427033870,455.5809962287,437.1148943959,420.1848359830,416.2397721588,684.8822632902,377.5666784107,710.1863453809,923.9449427304,480.7975319523,1021.8569649011,1233.1851651981,363.5300526870,383.6301845903,475.9654785966,1430.0001098887,573.8582166612,535.4064514445,396.9799516629,720.7477125040,397.6532254908,615.4053057623,860.0806029784,566.2093063061,505.7289862848,427.9834107134,1085.3544033368,731.8817521142,438.1337763097,698.8801117105,381.9520198882,909.9606404318,367.5381996028,480.0962037759,444.1425862662,381.0149896947,588.0666955291,642.4898080614,401.9421323640,1079.2597905903,395.4441898781,367.0053119286,471.9577133028,802.6904066712,398.8787285970,390.9049499897,795.5205858955,883.9139819615,1165.8205141365,380.8033989123,404.0770318389
751.1301059438,806.6830014400,641.9548200397,713.6525866729,805.3588507992,548.2940061048,1025.3461121671,539.1623239373,750.2594062043,631.2139586024,864.6991261452,482.7966496535,602.0376155946,921.5935244978,968.9989390673,645.3340394330,-1.0000000000,799.5476016459,671.9007669518,778.8070203490,742.7791567242,920.5745436259,587.9915163421,1013.6646371808,664.4973107834,964.1063786008,1051.2997100757,747.9339051697,796.4939062371,514.0107022088,829.5291391674,765.3142603086,644.6689673968,945.1288729726,711.8160209847,501.1901718021,973.1071972862,1077.3311446667,512.8232178604,806.9605308050,632.1539493291,479.3949758703,748.5053616913,1134.4827422476,828.5205756605,726.6435608226,741.6055295652,805.6701239027,399.3086865245,755.5237153229,799.0309639921,701.1037089697,758.1951497472,887.3147869312,716.1220941437,415.1140920845,672.6398102788,860.1000160576,898.3079791394,907.1897241257,714.9694639383,493.7560923577,1021.3639201044,675.6317936901,705.6059335105,816.0474496653,769.3026364842,825.8601577751,815.1205366476,860.8302946132,795.6898755183,887.1126064817,673.1567339590,979.0070247968,795.4941767666,579.0637048504,684.7319247655,556.3249407130,599.8463473958,904.6751607228,632.6356421424,695.6716155002,863.3442527794,762.2567402146,804.3985197409,558.2217798991,801.7473470927,854.5432470593,538.4802188225,720.0673727958,541.7218451886,804.7776218164,532.5934345430,604.9244326784,465.2242531422,729.6470219399,722.5657440251,952.4708020904,953.5768268150,823.1776072541,903.1670475168,629.0691905054,700.7582856214,552.1287155764,757.5165284116,539.8614623089,1323.7923020105,1050.1789189466,551.3176031724,579.7632840695,518.5144866619,952.6598723091,884.5628458167,820.9610000747,801.9614568402,832.4818203798,849.2163582696,623.2631352251,561.7040399742,562.6813494304,567.1360219892,765.4635936269,1032.0627463336,808.9139009796,933.9708738282,897.3236772424,650.3791845649,782.1128522187,653.7177269538,808.3592839172,553.5077823033,799.4030508754,989.1007267480,556.6702155495,908.9840869518,919.9719074072,721.4510627446,603.0564565968,748.1786117298,810.7788355821,619.3593856318,858.8895380925,1049.3376411415,797.5541632367,798.4239345604,648.3377397332,856.4451119797
842.8696599404,839.4159789009,812.1164484021,864.7217793294,853.3408801087,875.0432945048,969.2617838691,621.0274152601,877.8208499275,814.9895496106,750.5864220120,752.0490915736,667.9732204907,1214.5849023462,802.6652647481,929.3750614373,799.5476016459,-1.0000000000,843.2186394300,841.1167399071,782.7741533037,943.7215719690,723.0102301822,787.5450016014,807.7066431205,929.2995191334,807.4879824919,994.6763443373,814.7515017742,671.3143858889,817.1006680492,803.1120794784,728.6202735788,958.4438306270,832.6737030120,649.5395586230,843.6189433531,806.4633592234,734.7503961846,921.1879562246,822.7223084541,738.2039282987,844.9042023094,840.9447966658,901.7032129053,721.6875548147,753.0843954745,863.5377511560,704.1669645534,851.7078642750,784.6627108563,733.8514923880,805.8679108674,859.5938227355,763.9931432643,631.7540671834,869.8086775890,1029.7855796077,621.4209351836,798.0885036860,840.5457563484,806.3501479326,869.5670340592,767.1546975814,847.5675832901,913.8213958717,749.1209839920,900.3650856390,962.8052281770,941.2339600628,841.4491554686,941.4152510116,812.8770601110,969.3104534320,899.1011667751,772.7749865163,774.2993631183,707.8373442750,833.1864787139,960.5253539946,767.0914744655,835.6011772871,1000.8843750691,870.8610865222,740.6725420500,800.3868547815,835.4912536215,770.4723243334,741.8063606713,972.3181313664,731.7197088567,879.4425647484,712.8416843110,691.5996941956,799.8197160516,714.1526436231,800.9266304459,956.3460170593,975.1616156415,934.2500109084,1054.2911113295,892.5464537500,832.7396406552,721.3649440248,837.3405283420,675.6364276146,1121.3864335702,965.7495747447,764.8720003124,706.0817162372,680.2208528621,928.2629593196,831.7463522156,941.8995065780,897.8568692010,810.5761866358,873.7513975259,903.7906936318,679.9627294568,542.9127973534,830.8748384222,864.6640068931,902.0050127668,639.2483689248,902.8880479838,752.1279944740,809.0155053655,672.7621398874,731.1522395003,940.0492518285,665.1160770482,892.6101036705,1064.5150083783,733.4275868539,934.1160430658,652.5345697713,695.1540639861,714.4725515287,717.6673351199,654.0575228886,756.9095627823,934.5643413590,713.6170138242,748.3383590347,824.0239768123,744.2193880292,842.0969829342
