-1.0000000000,557.6163270536,454.5931185322,270.0159136407,300.5861584370,442.9250241923,565.2568722262,602.1482322042,258.9192035767,313.2979268631,437.5711919783,606.9870738189,314.3019389581,1213.0190381468,808.6034702976,442.4440512482,751.5697518975,843.2767855112,295.2580067247,263.6675585397,640.6558915335,541.6472074437,278.6804891741,617.8943301584,294.0549582528,986.9476400575,840.5470265099,810.9436875541,292.0205235692,521.3791699243,332.1303934021,457.8356196556,288.7242308432,271.8594943573,662.4024431625,347.7741081422,497.6119561597,960.5630075530,798.7970207412,271.6923689537,493.8906421453,511.1731929210,256.4901692705,981.4272150895,605.5223998889,946.3231298546,320.1467003430,256.3434232234,503.6298873843,501.7223800004,968.7421572860,272.8441157950,268.5560321421,382.9793844792,267.3633455617,556.3162485438,351.3576664219,1315.7212414980,711.1604135664,771.4775879432,263.0022720372,681.9454682504,666.6484140553,263.5752973384,1126.3298037983,904.2603935644,297.8139563013,253.1701348163,406.6467028889,467.3177651952,444.0733320870,273.3224364125,257.4871226174,569.6998627399,289.4239305267,315.1077428456,928.1863455258,297.6604237299,491.5734094538,295.0070692884,464.1376712938,273.3622994074,692.4449312500,1148.6398569680,1040.0891067517,851.5078131447,362.6939599632,442.8441823460,348.5275246616,444.7264303196,349.8644437782,555.8499719912,483.2912254669,331.7489538260,972.4899733328,300.0471127254,290.0968623614,287.5205736553,312.2933253555,409.7119875586,281.6323116001,983.1110918253,278.8954230485,896.9206672271,967.9471398628,518.0478698383,891.7654075195,1215.4201271132,481.9749078628,296.9683607491,371.9001828021,1592.2859190628,371.4559736930,546.5052004824,289.6187422199,681.8453772168,306.4751612276,561.9220197605,931.8228373263,459.1366388080,517.4054505332,283.7027341681,1001.0368459195,746.4707244156,305.2352442493,467.1237268812,311.6415213067,1227.9697907807,276.0138906175,447.4488006779,321.5528858271,291.2225908599,513.3643383081,755.1615589597,259.8725457985,870.8424235057,297.4814706532,376.1945384269,318.2883226976,763.8888086699,292.1072463022,244.9478538012,624.5162725477,738.8954635262,1151.4907091413,279.3801638015,310.9825547897
557.6163270536,-1.0000000000,241.9054928338,617.5050386781,470.1961164308,407.2417586738,970.6494455661,820.0433726004,548.0135240422,537.6154236948,420.5510869395,632.9296796860,532.6290341297,1630.0344063053,682.9779788800,513.7210966960,806.9727090122,839.8807444637,562.8364965109,508.0111750505,397.6671815231,501.6078108199,446.1011672226,610.8535068106,355.9297965001,729.7547837349,433.8786600278,523.9320018538,419.7171491585,673.7571443684,529.2575471340,390.9328291515,446.4969392906,615.1605489353,260.4159611940,461.2268805954,705.8088383144,995.7938533660,724.6207478223,617.8781596181,626.4872875179,452.6644501006,504.8690501651,681.0217788664,492.7044159864,939.1062558796,650.5128489844,602.5630439565,487.8989431013,862.3137297983,574.1511222707,462.3541439965,457.3208236379,732.5437302643,440.7741024965,592.1560026999,447.2661392824,867.4454675661,490.7533624674,588.1414401333,579.0951610790,429.6553415833,948.7196241199,420.9242758320,830.9884648077,443.2330635038,368.5885294631,552.0086655633,468.9058337963,358.1724557534,245.1598608734,655.5989547374,451.9091812724,757.8023848767,615.3929473914,342.0951453966,827.4495371569,503.5211405573,449.3619692506,629.9818683360,727.3082113289,529.2129743061,370.3244008093,736.4386876390,916.8863960923,1028.6956080009,591.0401066090,598.4965167296,369.9468844155,612.2443919937,467.6365350329,880.0638097714,659.1469785798,409.5830648376,886.4288753109,363.7358889030,638.8615729538,660.9133686349,640.9714735850,454.6740235898,656.3588341675,556.6534765918,500.8130564711,992.0848500970,748.2976931862,637.8636108042,977.5691915953,767.3566228266,344.7365365319,523.9950632266,576.3744892121,973.5737040133,701.2972657792,466.7139367919,557.0253933834,603.0513125016,632.9012445231,830.3316059081,1000.5261313296,551.0331539731,685.2887976301,590.0487973229,749.9778747331,574.7441518088,616.9141359400,638.4927995772,525.8407790624,933.3206152477,434.0346784043,562.6681596368,521.1758953987,615.7724879453,582.8435131424,761.5339532571,533.3864940395,588.1721767576,483.5932546570,454.8439912136,561.7233380295,518.6909869419,493.2169225056,622.0519090705,535.0203614677,741.4967458849,1328.8814355004,455.4663856297,476.8096945294
454.5931185322,241.9054928338,-1.0000000000,403.1684497707,397.0635105662,387.9202227674,791.5490114997,672.4199441179,403.1873697702,371.8874164262,374.9463947293,615.3779622082,400.6022507718,1316.7425502468,662.6789900422,410.6772993525,642.6340396697,812.5625441828,360.2884031150,354.7831904754,393.8843158708,414.6231624546,359.7794667516,653.6330148069,245.3164709739,892.8299320420,561.0237333015,586.0403142369,296.8895580484,580.3369718855,402.3467862331,410.4883479307,325.6008610868,458.5611575727,306.4833363984,307.6099246098,594.7352839627,970.5910240961,581.1691055190,466.0359156734,438.1301958905,452.7319990795,355.4062945018,786.0565480648,475.3996450263,850.6822661617,496.2180974701,448.3825197503,373.4226239200,642.5760955020,571.9139463168,341.4931244140,328.0394206933,596.1090492956,316.6547245364,454.2611986786,374.4221633432,1003.2834161274,568.1940936168,609.6975732416,386.7512647361,437.2200046562,868.7424321823,299.6394388712,852.2731333213,590.3404106972,323.4831593050,397.3075268164,359.2284107216,313.7255235027,239.7819664517,492.9736043185,307.7299038869,729.2490202692,402.5114770327,242.0983361164,800.3474725980,359.0229212836,381.6405271842,493.5674242905,535.9405039661,425.3777597862,417.7375716667,751.7502338074,912.0597268423,919.7626096265,454.1879117432,634.3420285137,265.8445617608,582.7015877357,375.8857208768,736.4928357881,511.9638277303,368.3875320095,764.9229296439,325.0703586461,464.3887827633,524.7649711605,471.5565525563,343.2354782427,547.8792813785,638.0968426233,357.9433058756,839.9662436543,786.6584954872,541.5041539503,1009.2498489206,876.1922370964,247.9464273321,359.4893825108,511.6123476282,1124.7979212868,527.6197353454,394.5141516345,371.0624248652,588.1743753047,434.7236942177,626.2458865650,920.3955573559,489.6149202643,541.4865678188,430.0271833803,944.8064416972,638.5450074420,472.5903282161,621.6191412386,321.3125601022,897.1580052848,297.4536322929,400.8792891204,396.1050931245,428.6918067605,474.2908629346,683.6232624686,402.6457015614,754.0089825776,359.1424788334,385.5006253064,430.2933245192,612.9350071528,316.9815562927,475.5020900021,610.0895981911,708.6556127056,1208.0525485779,319.9210301491,363.5760945995
270.0159136407,617.5050386781,403.1684497707,-1.0000000000,406.0303596250,447.1563264727,591.5095069673,580.4686597332,261.2089959296,259.6082327230,535.7056531394,721.2049210778,266.8433721091,1135.3079182589,759.8091192472,384.1618955401,714.5489406433,865.3667619030,215.0727485421,248.7247721269,598.1775574264,458.1918242309,262.4526007067,725.3055473953,262.5240060629,1190.4383351408,938.0007450394,777.6353584700,242.6983918663,566.5473812484,357.3310275997,547.1099451811,281.5363213232,266.5742089556,665.2989863775,298.8552185990,467.3344221969,996.9730215841,752.2800801387,237.6185608908,327.0664539781,507.7652350292,269.6361128918,1091.2737471079,601.6482826409,937.5187516985,291.5197511595,258.1793828594,502.3755463461,474.4936392274,864.5912957594,264.1590031245,226.2454626878,353.9754306682,266.1346614218,528.1192621931,448.7421938264,1418.2533313524,815.5040301445,740.0498077439,250.5074128707,673.4900830256,763.9108165231,241.2017972508,1162.1377924678,961.7470258562,372.4186710487,263.3369662506,367.1631319792,484.5110780521,505.7781778388,263.6128240034,250.5110434785,614.1343243819,240.9460180510,251.2545659671,1053.5817021695,235.4569169696,453.6433021360,251.5780697265,385.9139228339,264.1166266503,702.1620713456,1010.6773546893,1109.9040366075,923.0872968103,383.3794754579,465.4488517399,287.6426116304,548.1238255056,314.0720992269,547.1963541729,486.4440732582,320.9294566287,923.0462544952,321.2099557731,238.1411198241,306.4568707617,304.3779824337,305.1545172129,294.8135111348,986.4139050116,284.9589956297,918.1045668371,906.5192715320,548.1516300307,995.6713774899,1381.6846564728,395.2214845413,215.2048642466,357.0311865792,1662.1653908798,416.4481604057,421.0203536164,250.2507721531,693.0368403054,239.3727637460,443.3663063774,950.3373064096,474.2849312522,503.5302594948,249.9118936993,1160.8153450322,864.8134876417,326.6208132551,597.3934347166,249.3106713959,1257.3197264576,225.4657626066,352.6732812001,323.5832685183,240.9254077040,524.8346344183,796.2206698662,245.2553686485,1005.6880706341,300.8323018974,339.7062330195,349.4390645637,841.4856949415,261.6979477740,244.7064406122,755.8497679848,849.9314682744,1186.3199335062,256.4651496398,301.6475986745
300.5861584370,470.1961164308,397.0635105662,406.0303596250,-1.0000000000,504.6324326146,595.6037965358,642.8304366649,315.0419387217,417.5151001547,351.6115825512,671.6058464708,355.0156032686,1320.5245517251,768.2539438100,441.6457265590,806.3546902457,854.5965547865,403.3614711735,298.9833051055,528.2564209515,513.7420454836,353.0704002462,533.0577095611,308.4367901408,769.2404910323,598.2209336259,803.2954247622,317.6032297343,572.9236289756,356.8898861266,443.3855887510,316.4694086358,346.0941998566,584.9077855737,383.8324815208,538.7718539574,920.7007834446,792.7767753312,355.6505464694,524.8779514789,586.2610097968,299.6513571661,740.4010103266,582.0701763070,912.6675631798,392.0610035236,317.9481413515,550.6053254562,570.8863344149,873.9656150043,287.1869230490,315.7481462281,463.4250396287,282.5570947225,588.6857070782,371.0277543712,1105.8752336948,587.5990026045,707.7530147760,336.7136945181,631.9140675576,670.9149854859,296.2770581544,949.0880274735,785.3573409343,295.5505889871,283.6219176407,421.3293407471,446.4736667068,345.5049870814,345.8791668104,289.2381965417,581.3443160037,373.2350760920,349.6083547935,835.5517203793,370.5274398232,489.7903383770,400.7272356977,567.7661619332,340.9197179002,610.6006151652,1011.8127140157,954.2199006096,925.3609254841,397.5741542491,529.6879000166,390.6117216192,489.0387087938,409.6415625100,653.5127407032,520.8957320612,353.0487653556,921.2078819503,281.1142025225,375.8534367082,335.7366787137,394.1376817344,454.7840085449,389.4175529010,916.0084780054,299.7932765945,933.0141853671,871.7406229139,513.0526358206,793.8281996998,979.2389475910,462.9793949359,378.1197537179,477.7773553616,1341.6713045550,408.3238514850,575.9617868016,358.8704484655,564.7610633451,409.3249521411,683.7453926730,950.0924773067,464.7635517719,556.1892036953,359.6713176971,928.5917822434,585.3274708898,354.2121224043,460.8747292487,364.6387408490,1114.0131115704,309.1170670284,478.7676822750,359.1453523634,357.6043997821,488.8228818470,700.9875063868,331.5598067378,682.4879560670,325.1871050396,437.0120786854,353.2597263462,626.9343559805,314.6835371958,350.0286923612,490.2766431855,652.9977898460,1160.4731524271,310.2926825987,327.0344504399
442.9250241923,407.2417586738,387.9202227674,447.1563264727,504.6324326146,-1.0000000000,888.9440182555,589.4753727411,427.8364033403,419.1187604922,640.5518999465,503.2172650290,409.6077458541,1252.2942098917,765.1172180866,425.1106716270,548.5049193797,875.4000109940,472.6037249073,435.7622510051,447.5286703621,739.8592796579,269.3878862151,787.9926813251,342.9934723204,952.3790359879,669.4837599579,400.0105899189,442.8515171481,591.5904926433,479.5765305979,440.6572935684,390.0473617023,537.4075657887,271.6652759066,404.2210671979,685.8415399187,1066.8184947059,672.9849910413,485.5564577453,459.2878534242,180.3084272824,466.4812626539,919.2481031052,624.3448040011,816.0754027666,511.5803796556,542.6735671683,340.1841996592,723.6861804655,608.5932393482,416.0612706281,411.0456123257,591.6959128072,443.0899066992,416.8661267899,425.2522923211,1015.9167055195,590.6556614269,608.9438719908,492.4025802734,382.5685695633,964.7842477036,381.9832252742,954.2256606825,566.4647895746,427.3711750551,497.3486812602,554.1161622317,401.1070208858,456.0892158875,527.3440490419,414.8940642572,803.4627745050,476.3427897157,282.3851023545,868.8809357964,403.8027041092,237.8843516012,505.8947691492,577.7457305943,415.3072077518,452.3880226351,854.4912675726,1093.6292431964,710.8294420377,584.8881489972,578.8847906442,298.6489278938,435.4883185630,306.7292122741,689.6858569857,551.5385200743,274.7256327406,753.2677816734,363.2007903479,484.6011180672,554.4437629017,575.4277297620,536.3564274813,489.9603692852,510.0082883793,479.3247340326,883.2257973311,733.4331498186,476.1116728747,1068.2860045199,953.7019200704,301.2625465604,388.2209211535,321.7635386885,1208.9370119402,673.3179173150,645.5507794481,523.6256854008,663.2994183765,513.0712361096,644.7134595195,770.2422965663,517.8330689813,561.7021526649,489.3554474008,932.4472972078,687.8455176375,561.3974592729,729.0832604718,439.1916369186,956.1399462096,440.9302431339,551.7214043685,458.1930835291,503.2739401827,698.6711664084,616.5412411653,475.0328260494,929.9005413715,457.5041593113,313.0024399196,547.8097936766,721.5567736554,453.8379463246,450.4652652739,746.0794705687,949.9354763136,1065.2757867908,400.5567395550,554.7223595499
565.2568722262,970.6494455661,791.5490114997,591.5095069673,595.6037965358,888.9440182555,-1.0000000000,791.9020935366,517.3562501828,551.5584685633,694.3560554604,1013.3020724188,476.5447672359,1195.6781566019,754.5900684141,685.6384222446,1026.8271555036,970.0783323956,563.7577181958,520.9344925339,986.7873585052,778.2783024353,575.3603215842,947.3029443265,587.9109890854,1101.9857913607,1289.7255869589,1256.1723196219,593.6289005229,732.1720007784,604.7230094778,792.0826266684,532.8867939369,556.4895403704,1124.9411292583,578.5193127726,622.6869102621,793.6308800014,1094.1690062091,524.8197241304,765.9193302232,945.0821178929,507.1256555326,1241.4928197094,873.1287391122,976.2029174767,434.8279789095,481.3566429728,790.3766044104,549.6031139063,1139.5105304140,483.6098219280,572.2510522236,529.4430796663,553.2659721302,763.1444280947,682.0937984751,1519.2659378586,1191.2310798940,759.6332839149,505.3595763134,1136.0823916274,526.3136931688,555.6196168432,1299.9475726411,1402.1335199742,654.3406911006,483.9147050355,715.5856541506,839.6562189707,773.6836884326,513.0199038328,519.2389925313,581.4907592455,547.5304345944,647.4606328619,985.6774360320,537.1799393418,823.1502313556,594.0802157612,596.0414842867,569.3837511650,960.6422080354,1250.3013291485,1128.5041482486,984.6881583807,503.6886418984,778.4384181104,609.9829911446,783.8852257708,697.9034503364,738.9639336238,662.9752903588,569.1388665006,1151.4063138136,675.2035347407,476.0250431419,497.9509810371,613.0578213094,709.8783598141,564.4237690487,1432.1167178564,513.9932109973,1021.5628353201,997.5683567008,638.5658067644,730.1034982029,1434.7065031298,752.2093420646,543.9106159826,661.5130133892,1714.7273728094,493.3529211195,782.4533071957,541.1304942866,1024.8811910023,540.4018775896,702.6340049948,991.4005499319,635.8139198283,771.5202446148,455.4283159402,1233.3163476960,1062.3523349955,447.7257343400,562.9731505570,578.1664340267,1439.5467563077,533.1141644177,701.0429760154,512.5097791351,566.1394018580,752.3236499569,957.0501659537,598.5464778164,1068.9812636469,482.9238216846,760.7037697735,438.5672748564,966.4814096784,523.4336170777,548.8351906733,1026.0553471074,768.3074126463,1026.1044179921,527.0895356756,562.3140432461
602.1482322042,820.0433726004,672.4199441179,580.4686597332,642.8304366649,589.4753727411,791.9020935366,-1.0000000000,597.3935426843,557.3472215277,666.3993544895,524.3938656814,457.5267664292,729.7534745741,811.3473830635,560.2659064659,539.6436508542,621.7083634599,618.1664475228,559.9593791675,721.8023592072,929.7124820481,470.6159171919,796.3882314723,534.6395017689,816.7064871890,932.1418405924,781.5475969158,605.9958386636,431.2742226341,686.2581093298,729.9635657895,443.5003707496,747.6122043968,703.8627624503,393.4097374535,770.9866661895,788.9145191826,452.7341511164,591.6070787862,576.2461763938,486.4304490198,599.7230188603,942.7632857608,860.9123103307,785.3107066010,534.2910493416,575.6449649614,533.8715108567,668.9945267725,822.1572421021,515.7897755056,560.4472636869,695.7715242761,580.0031287241,473.4770479176,641.7442341828,843.2100763230,704.1299736978,696.4326600896,625.3816882025,642.5100101620,787.1831493527,494.0820425658,641.8733218858,908.3188449847,608.4977368736,647.0982231550,756.9545371721,814.0829501093,757.2604113566,621.0184108724,555.8900517047,700.1928032736,608.1326912411,518.1051373929,701.8124578856,470.5215879891,501.5017811208,723.3955025008,660.4165741379,557.8635393148,880.1672826412,781.8236726863,727.7373709657,495.9039745026,689.8207748484,554.0948691351,458.3890231173,690.1640994533,460.3281053574,692.4730266712,447.7765848007,412.2674504253,446.7293850539,608.6868662182,503.4034060881,705.6243617141,837.4943754837,774.1863082947,728.7405383358,792.6518061516,593.8208467360,453.7036064818,675.9478569961,361.1776836281,1120.0933345250,1127.1557898180,521.7471178187,464.3184434620,478.1084527787,1065.7713405007,704.2864531216,867.5484191795,665.3349493695,694.4594406501,608.3604407136,717.8715118771,403.9213095346,331.7152111212,451.9458753558,566.6864298023,738.3603559153,630.3607878100,689.8006419538,529.5140717525,568.3968048144,777.4634809403,496.1383751262,753.5555422895,451.6196906875,613.8067014722,947.2236283739,448.6362459175,688.6183958460,695.2672517482,522.6070829791,549.9707974442,553.2700254267,681.3990814276,519.3751712394,652.2502809421,765.1433752997,576.0337182050,828.7228262187,454.8228113508,713.1404476469
258.9192035767,548.0135240422,403.1873697702,261.2089959296,315.0419387217,427.8364033403,517.3562501828,597.3935426843,-1.0000000000,282.6353915692,464.4271640674,720.7290423897,270.3599583168,1219.5659621880,771.3757621111,365.3584276100,750.8923826258,878.5538978174,266.6038751322,231.4880619601,618.0322073692,473.2409626184,272.7539916760,677.4141148158,274.7240809192,1117.7040244483,857.0272261662,757.5336391878,257.8992985856,557.4762228138,322.1409041628,489.2320789310,273.2139738615,265.6375844700,608.7431110224,306.8087919755,465.4593085054,967.3106367704,792.1482141479,251.2678984719,449.9276669266,503.1701525827,220.2550877580,1033.4570477047,577.2641874650,951.5349563740,286.1395963447,250.3829628689,490.2792615408,448.1177649746,888.9368516734,268.6920900344,244.6775240409,374.8117699334,254.0638599779,515.1859346808,347.6048915534,1349.4796108853,779.7025496495,697.9593119251,237.1714748044,670.2495488929,699.9263074865,243.3223871942,1188.8471979919,922.8237735020,317.5578252221,217.2314968137,357.9883063210,440.9854811477,436.3908910223,247.5425852603,219.7040340169,603.6842334300,265.1368213294,266.1501041430,1018.1962350577,266.3973251642,426.0771786384,266.4560305479,419.2645008964,272.4143922534,608.0251002615,1106.4027121415,1098.5294353536,905.7101374824,323.8188846960,486.1590405917,297.0646894889,469.6956499291,323.5045181457,614.0257349487,498.8035532473,285.9029745352,946.8443241581,309.6635816614,267.5605930607,268.9972827148,313.8439379665,324.9314542769,287.8125931130,944.6227911360,259.4001531572,941.9148664381,959.9749421733,524.7410351798,847.1841221132,1313.2736117651,371.0212269034,251.2167264532,361.2686512996,1608.0117404323,397.3545483547,483.9818258747,262.4785638891,712.0457060346,284.8029892773,487.4819335686,984.5765719771,477.3821366597,525.1872038469,254.0505962271,1116.7988913829,790.0053985380,297.7319136463,543.7951451152,256.7278468238,1232.8914245636,259.4715082712,380.6192425725,310.2894188987,265.9759858190,474.3558889554,761.2074463202,255.1354733550,952.7648388109,281.8431424276,369.9957037766,320.6201115903,841.5928455785,256.6610339879,245.0432340702,672.8548483128,829.0343950996,1162.6581877085,257.5971604775,269.9925752898
313.2979268631,537.6154236948,371.8874164262,259.6082327230,417.5151001547,419.1187604922,551.5584685633,557.3472215277,282.6353915692,-1.0000000000,487.2972163120,695.6836836869,232.1506115004,1112.9175715399,634.3438146788,423.1675425170,632.4417079640,815.7352555663,218.9517566571,242.6981977536,564.9151063576,538.3841170083,271.9469301132,741.8922983172,262.2290653380,1132.7347621648,878.5319652076,779.4645941792,263.8831327337,488.0062148910,383.2887518724,520.4870771308,244.6870668554,325.9834168268,585.3648216549,274.9024207289,482.2896997999,832.9081865560,753.8803932210,262.4359080883,309.3522129530,469.5522502465,254.3937516003,1043.7133907628,515.3085596026,771.5051904190,281.9129128491,276.3073068033,451.5316929558,407.4039616267,762.6483187745,275.3638955446,276.1598985198,401.0337673213,275.4930682759,406.0383192681,433.9031072023,1359.3628260756,793.8084780246,592.9753693201,243.9554594874,648.0459695976,714.4200018351,246.7575732017,1061.3166894471,940.9252907770,370.8107561271,297.3156873973,372.5991530349,436.0388961141,446.7462736339,297.7043879355,246.3790255327,580.5298196822,250.4496759282,240.5289231414,935.7234297089,198.1944568101,434.1330059580,339.7023169643,366.0471874760,266.6028063968,669.6866593277,910.6390826103,1058.5970940182,820.1673006224,320.8934393831,558.4408820259,235.4676055170,591.6862953694,337.6994595526,524.2932523862,450.4779308189,317.2683361495,829.1143558614,318.2286674995,223.3841957443,361.1041045298,384.4085509381,346.8778324063,384.9295588499,929.5281447589,298.9622582119,825.5885684929,767.8729254863,469.5811254732,956.4418865716,1224.3592865841,316.1736916809,187.8706528520,330.7392074089,1474.1799359136,441.7540855434,449.4773379050,260.9646533119,703.3675029645,250.1454553527,391.8228436764,810.2677878622,395.6909062138,526.6872566848,211.2863543553,1126.3987554388,849.2917373754,340.6912209909,566.7774917691,237.6752861764,1235.2388931608,241.2761461006,344.8583610612,290.7505490139,273.9978178162,547.2261958019,764.4411265942,301.3678864136,953.4701302781,272.0465416172,377.4628708167,344.8069005707,733.3700017035,240.8242696170,306.6810965958,757.0904679639,778.5578431730,981.6258915639,251.6502240254,313.1301052298
437.5711919783,420.5510869395,374.9463947293,535.7056531394,351.6115825512,640.5518999465,694.3560554604,666.3993544895,464.4271640674,487.2972163120,-1.0000000000,609.5835983152,435.8314965175,1369.4517493160,639.1602334153,573.5216322711,865.6029393614,751.7300380811,518.4001836086,401.2040994853,614.4980930284,493.7008841387,455.8311111869,509.2512615217,341.6163161989,729.7011722437,527.6731131611,806.3435297392,361.4588328221,528.6089885347,382.9299376288,429.6199999428,324.1806223432,454.6035776529,531.4942119996,421.6755712740,558.0397230827,741.2859494840,741.3155609690,473.9426163893,739.8029084238,694.2735459565,384.3764791067,618.2848285893,526.4173737495,904.2223817033,530.9429413516,430.4950619920,578.7061055153,650.8890568882,704.2867602075,297.7393881652,366.4542152679,564.7932275774,325.0089776432,604.6916994440,431.3210497831,953.7293315460,459.2584477469,601.0556796321,466.8208185392,581.8224196182,619.4998770996,315.6173490620,713.7248435604,652.0062116862,321.9074654997,422.0562779764,489.6858436453,516.4987094674,312.3022653503,503.3874077872,342.0884063869,577.3589239382,490.9573412069,408.6789230470,733.1175375205,467.1499234992,619.9838622450,569.7230036137,669.5584383441,435.9629305450,610.7615208697,866.9546687643,762.2282014215,858.5370428670,437.0422438216,557.9569875403,440.0964532812,621.9351269087,500.3958032501,681.8583838635,504.9522673018,480.1987194246,856.6759645252,363.3685902966,482.2400224747,488.0311810550,529.4591052274,535.0536264393,577.2293554057,846.1512877606,379.9250355447,748.5471366978,721.2177642010,450.2288501479,837.7345549601,944.9485364606,497.4763478894,443.5890346550,601.5596802151,1081.1690960124,375.9604427729,560.9728184465,425.7964584457,516.7395959412,503.6596771680,850.1486123302,853.8701456519,390.2995210761,560.7340863168,467.6588663506,822.7397122290,445.9362713366,453.5346524833,417.2011526039,459.6327466760,942.3989010894,317.9539333269,568.7053911958,365.9507271409,488.6993673781,506.7509950508,688.8265680395,425.5631581134,590.6333182739,324.6730219713,524.9950498875,321.1196167394,463.4510552737,361.9472529662,496.0129268762,520.0067652026,429.4509780003,1164.3467412637,334.3867954092,352.6552467284
606.9870738189,632.9296796860,615.3779622082,721.2049210778,671.6058464708,503.2172650290,1013.3020724188,524.3938656814,720.7290423897,695.6836836869,609.5835983152,-1.0000000000,560.0129945099,1179.2442403865,909.1711126525,628.1152055375,484.4117574972,754.1661859164,750.9376804227,672.0900637362,520.1260904545,908.6459287811,510.3421972233,768.9253397578,516.8225878540,657.1167551184,721.9645091030,637.9837496765,706.6569121878,584.6510465371,707.3735047750,437.2473289323,509.6257377927,788.1873601821,482.7817250034,547.6889775731,765.1490340837,1031.3147365865,609.2546564079,682.9614009340,770.0677892196,433.8187965109,698.3087613761,832.6718061657,856.0909103187,911.7324416178,720.6464011989,713.7424226092,485.5884861308,928.3303144327,578.6564888168,543.1072292541,604.2941760987,850.5972684442,631.1021825357,533.1043616706,583.2441290443,640.1139430189,557.9262061733,787.7410854670,752.7146491228,324.2045686704,938.5798395179,553.7350338829,514.9543526433,530.2150262209,552.3321371180,751.4606231156,827.1794832833,771.8247905677,603.7560710419,774.1072970242,598.7798889114,886.7029842779,750.8942720611,545.9117149962,700.4080058056,639.9052603453,476.3455205660,796.6936319833,834.2574940834,623.2739747714,648.3057073689,604.3582962708,793.5192803214,461.8066797145,841.9718289034,619.3905488679,537.3456796168,623.1683156094,504.3838267291,721.6037493750,454.6506105454,517.7820772388,521.4624466151,588.9215289462,734.9731374297,760.7049653161,908.8065260653,882.0566304845,729.5303006471,552.9072911439,687.7140947143,572.9321312226,648.2578023284,463.9328186413,1147.0234711629,763.6891413191,603.8865858024,624.0769935566,540.4583318531,834.6496655681,743.2685954701,898.6913759573,757.5322733130,537.2236538826,784.0781866619,928.3943490230,552.5061727635,504.3557031549,464.9303890737,705.5192608218,598.5390942241,542.8949117987,740.1156033452,646.0074017653,726.5818640896,743.9496364821,574.0982982309,950.6197928760,533.7154920669,723.9161824152,915.0120655700,583.7903590823,757.3548501264,688.1480651239,550.6783844449,531.0967318111,603.9682211296,608.2970539461,626.0782034680,682.1047770096,731.2441065730,669.1834903465,1009.0138474098,541.3386494021,736.6710035917
314.3019389581,532.6290341297,400.6022507718,266.8433721091,355.0156032686,409.6077458541,476.5447672359,457.5267664292,270.3599583168,232.1506115004,435.8314965175,560.0129945099,-1.0000000000,997.3202492413,512.3568347601,421.2801033815,602.4334222270,668.3841011053,255.6158887250,234.7569498532,554.1344657424,586.9867977028,216.1729674253,662.9881842659,215.5407863085,951.6508904951,842.2373506056,790.1202384414,292.7055901317,401.9302300847,379.1480816758,494.5318617111,174.3536311741,354.3174361949,565.7080478533,211.8632648848,464.6799542864,662.8373454124,651.0910460937,243.0096714046,351.2611598446,409.4223109977,258.4453926539,946.1213314908,584.0712323237,649.7675399934,229.6749389490,245.1503334425,403.5101435125,411.9050533075,710.8100135501,196.3565414269,265.4808297360,407.6773438914,251.9076479488,362.2281655857,423.8076637023,1135.2738845230,725.9822666450,498.4928893670,257.2870310035,598.6504054160,550.0524750971,206.3941555578,896.1043045360,850.8983239530,340.9422497243,280.1386706891,459.4823686786,497.8248833037,453.8165905641,280.4828181341,219.5093094073,537.0849850185,266.7963630529,248.7375731819,773.3858306560,190.5381975299,410.9998613571,363.9034224273,389.1782386137,273.1560144111,657.0689640744,853.4206876161,906.6661724406,674.2569623989,341.4726562573,487.0446339234,221.0883492425,569.4867599818,335.0647824792,509.9734383293,355.0182522159,229.2117430392,721.5231247699,309.1004274312,199.4847415044,317.3583245830,446.0343491081,457.5444562556,359.4737470753,880.2913985983,282.6318635996,668.5581815402,653.3462616682,313.9112325897,837.5528421374,1111.6206401567,359.2243199210,184.6843765174,290.8368442022,1288.9868045276,376.7075514190,558.9231061125,287.0418089972,631.6211230997,290.5643887789,448.5446526089,605.6365919935,257.1338723804,431.6615015031,212.8236395103,958.8486852175,711.9707140656,297.5229450856,424.2303706014,272.6906224592,1082.8418771608,239.6593199955,418.4404552644,199.3197584246,295.0093986043,576.5830334657,631.7302934308,333.3129339244,790.9269002909,206.6745053861,393.4813015969,238.3205130002,655.6689647058,238.1918137338,307.4924621190,712.0524948955,594.5951745484,855.4288141852,182.3895883024,314.2982774141
1213.0190381468,1630.0344063053,1316.7425502468,1135.3079182589,1320.5245517251,1252.2942098917,1195.6781566019,729.7534745741,1219.5659621880,1112.9175715399,1369.4517493160,1179.2442403865,997.3202492413,-1.0000000000,1489.1824860692,909.6100639647,922.1895840725,1215.2205118652,1131.8911354793,1073.6308124526,1341.5163307652,1390.6569688615,953.9150006390,1464.9468836235,1164.7428794177,1499.0233341129,1647.6019456365,1429.4605205651,1173.7980710092,735.0083568677,1246.3534411062,1483.9453520171,1022.3531308503,1281.7958551290,1567.3999004984,901.2115023483,1312.3954764964,1321.7255094189,569.6741019959,1117.7691232353,1051.6354133621,1183.9194634482,1171.1158838972,1621.8650592109,1435.1396814929,975.7844342326,1003.5900013853,1120.7402416929,950.5620617679,1172.0157215815,1351.8303337506,1087.8467558300,1145.8739339821,1141.0059622281,1169.7213171280,868.8995230087,1047.7527471730,1411.7479481640,1603.3671178038,1418.2832629903,1145.1279624584,1348.6440862981,1304.2886095804,1091.9608829749,1176.5406069807,1968.0371554526,1216.0516189656,1208.8614375383,1365.9004205394,1337.5464305123,1498.6761459280,1175.8003489773,1132.5387849792,1285.9133999527,1129.9095208479,1155.1358521494,913.9486935330,963.2777410616,987.0513140772,1248.7206831311,1146.0155422741,1119.5599919240,1619.3308903178,1319.5251694735,1025.6836464200,706.6979335613,1204.2559997948,1433.4527363360,1010.4143159761,1157.8417543933,955.9641962633,1047.2725501741,893.4117080454,961.3080591130,617.0570578416,1197.2107707447,1030.2876224179,1323.7959385816,1365.8638342179,1293.0136028384,1224.3892359514,1317.5310824731,1105.7794227808,590.1578966937,1373.6248711902,689.9896717633,1719.6803601441,1688.3004432065,1111.6577047660,993.9864720414,1084.7002447775,1610.4485597991,1289.9572554128,1456.4439018902,1193.4976507232,1357.5859629525,1125.5435633447,1148.0248380767,800.6092582837,927.2158271712,1027.5081456052,1125.8862777505,1539.8234201590,1221.7023824757,1237.6967822893,1066.9721763416,1147.1704747452,1182.1926549941,1108.8107067130,1340.3316040486,948.2518559800,1101.8836979430,1547.5698811192,894.2651694647,1272.1104253642,1367.8662842896,1089.7302235747,1000.0945739123,1125.0042218342,1319.3428533962,1116.9522572324,1207.8888395601,1387.7928799443,1054.3844793026,966.9942050773,1055.9722859195,1272.7939880511
808.6034702976,682.9779788800,662.6789900422,759.8091192472,768.2539438100,765.1172180866,754.5900684141,811.3473830635,771.3757621111,634.3438146788,639.1602334153,909.1711126525,512.3568347601,1489.1824860692,-1.0000000000,813.7804924433,969.7742845674,803.6614465720,670.2296363768,734.2997056571,724.1210980750,791.7707565055,711.4091732828,909.9215290628,632.3253273581,895.4813808586,727.7355375071,956.1830787017,651.0796232254,756.9388767852,607.7811270954,625.0974950397,625.4444861136,790.1680333323,670.8452258956,664.3532128876,593.7945999512,561.6261857151,1005.5518844428,762.7879832086,815.7071426854,749.0865511152,704.4869330734,903.8678259018,757.5419551747,764.7957327669,675.4562331415,766.5278363863,789.2963842508,757.2873728238,590.2521033154,583.6281251191,711.5941298891,753.0386808705,653.7850988764,659.3191774684,773.6447311369,777.5066704669,725.5143386846,342.0061013502,729.8241575602,754.4944051057,781.8980038369,647.4941834869,794.8030307702,826.7251050453,665.8804600485,769.9150205204,714.6837781133,716.6460236467,642.8993108973,821.7070110516,668.2612234348,801.6598014133,734.0819168714,660.3759351877,801.7939975214,607.8165797100,799.2524910525,855.7092565361,795.3187903981,700.6049687521,852.4690560511,595.0647273236,962.7706081660,928.4964292302,755.4967399588,968.1606119713,631.0090155970,944.0046971622,710.0407770563,721.5851290142,711.2823218767,630.9522693192,1023.1788887014,730.0398366761,652.3417103419,813.1131605479,838.4507043744,760.1187390125,914.5895103250,880.1278483993,744.8590687379,998.8111209793,453.5952051638,640.0779643916,873.4518731821,638.8380697633,608.9002093571,584.7434764600,709.2646626188,848.3154465126,729.5218789864,787.7052753347,713.2893855534,887.9598895456,663.8393237121,860.9984465061,796.1836795511,542.4060979949,879.2933257141,713.7254277732,983.7664796442,712.1248910992,673.2520324265,697.7015257098,629.9263377204,1074.0694563271,619.7495806086,797.3287053308,608.2238925087,749.3036299335,870.8349122298,957.2016833415,708.1612962176,823.8681933095,582.8549803828,730.3020598818,611.3822551703,530.1485931556,684.2193411091,810.4717819242,943.7848916062,718.4388991248,1097.4298301054,612.1449392690,664.4937111866
442.4440512482,513.7210966960,410.6772993525,384.1618955401,441.6457265590,425.1106716270,685.6384222446,560.2659064659,365.3584276100,423.1675425170,573.5216322711,628.1152055375,421.2801033815,909.6100639647,813.7804924433,-1.0000000000,645.5278784260,929.7695461843,375.1393060219,346.4784577421,524.8005298484,536.5380364738,339.5145324878,819.7424953281,338.8693267926,1105.2436539933,757.3640274460,638.9046334499,353.6912347951,563.9287298853,413.6939231014,552.9768740134,379.0171485171,412.9835608077,559.9757648533,362.6991513527,581.3144507799,1037.7691766582,466.5084057700,422.4032219253,460.2603956302,478.1864782041,381.6083858414,995.6928200843,680.5042891497,881.4306374564,434.2897956047,418.9155963208,453.7937818383,634.0315489308,907.5036938363,357.1636824242,357.0490984207,489.7902868784,367.0034209393,557.7553993299,313.2981968061,1215.6329864760,762.8694649148,714.8758357280,397.2873000253,558.7906375498,913.2677359046,351.1974414717,1044.5064456012,916.2267123825,422.3164450134,380.9903477751,429.2168748257,401.8187452550,482.2249781336,398.5022669506,352.3370656840,795.4837317717,378.6313075434,333.4414379630,871.4198578766,376.6193522232,336.1079521490,385.4489473553,542.6410022867,427.3109693004,598.0984130588,975.1897370003,856.9747163262,683.9037571893,507.4403304413,689.7723420352,345.2914752903,410.5544143400,331.9302054487,600.0955245443,541.1146361626,352.5104999101,642.3682183460,408.1594618152,428.7920885718,456.2074149023,437.3109192283,421.3374294122,416.7693175106,685.1879777940,378.1558928162,710.8923564157,925.0335991696,481.0263212379,1022.2891153159,1233.7972954737,363.9098014034,384.4396426726,476.7975929919,1430.6782983504,574.6403491138,536.0078546489,398.1323954102,722.3318356516,399.4186126555,616.4446418774,860.6127085369,566.8533369014,506.1106181707,428.6584096741,1085.8411819747,732.1590547703,438.5856731909,699.1727442762,382.8774146137,910.4303538606,367.8770496559,480.7404123158,445.0140971076,381.1414416776,588.8137596962,642.8017469231,403.1297081893,1079.4939279750,396.2059433689,367.4565896311,472.6519262853,803.9272511576,399.0383289651,391.2826718975,796.0579680040,884.6317655169,1166.4821906953,380.9038588574,404.7156159615
751.5697518975,806.9727090122,642.6340396697,714.5489406433,806.3546902457,548.5049193797,1026.8271555036,539.6436508542,750.8923826258,632.4417079640,865.6029393614,484.4117574972,602.4334222270,922.1895840725,969.7742845674,645.5278784260,-1.0000000000,800.1541583731,673.5356130581,779.1047415706,744.0782686681,921.3127911467,588.3629803422,1014.5921913271,664.8127826586,964.8628202565,1051.5468700999,748.5772015083,797.3362642895,514.9719561755,830.5478670612,766.1433981322,644.8269334284,945.8238033443,712.0070614017,501.8293508089,973.8580835623,1077.7267877527,513.2165576918,807.3697022857,632.9253238628,479.7305403724,749.2582914716,1135.0615777115,829.7472168067,727.6641227605,742.5746697623,806.0533392457,399.6776440522,756.3928912391,799.9377443383,701.3810626306,758.4000375245,888.0586503444,716.4945591155,415.8029391145,674.0582571323,860.8549519916,899.8112694951,907.6640527267,715.8750584605,495.1515029629,1024.0483498133,676.0098345729,706.0921150915,816.7543372907,769.7751556237,826.5364507009,816.3106278707,860.9647485857,796.4169224789,887.3461743936,674.2556236856,980.3049020558,795.9488851883,579.8002484520,685.1557855334,556.7811405783,600.0419334582,905.1520060799,633.9698757695,696.0900312962,864.2958470351,763.6942692375,805.1995069946,558.9536382935,802.5908130056,855.0666567460,539.5101433889,720.6953394638,542.5988821816,805.9980858235,533.6165373349,605.9323736093,465.6475210205,730.1234603674,724.1055424558,953.1205904133,954.3707678257,823.9859872194,903.7028449217,629.4311435608,701.4406563576,553.3358844419,758.4070706750,540.2852301807,1324.6642276032,1050.9924423404,551.6526664896,580.6765385169,519.4405238995,953.5840174919,885.8579131210,822.0278988580,803.1011999465,834.0466673380,850.7137785783,624.3465735977,562.3052085493,563.2757091261,567.4148983201,765.9747807378,1131.9688953291,809.5210632694,934.5780525594,897.9996287797,651.5041862687,782.6854531056,653.9892742702,809.4151459095,554.4945860972,799.5256368345,990.1869233313,558.0207429179,909.9360567267,920.2758132599,722.2455513766,603.4055398410,749.0631143462,812.1284575078,619.7825665726,859.1291341318,1049.7970415547,798.6396487522,800.0393146695,648.4771052553,857.0456208826
843.2767855112,839.8807444637,812.5625441828,865.3667619030,854.5965547865,875.4000109940,970.0783323956,621.7083634599,878.5538978174,815.7352555663,751.7300380811,754.1661859164,668.3841011053,1215.2205118652,803.6614465720,929.7695461843,800.1541583731,-1.0000000000,844.7657108730,841.5779457945,784.3580332309,944.8081355928,723.4876693256,788.2481372273,808.0528753023,929.7465252205,807.6436758076,994.9101260961,815.6146735100,672.0641037618,817.6345913024,804.2568022533,728.7180844175,959.1560326409,832.7864418596,650.1245628670,844.2630496107,807.1357742430,735.3052373418,922.0622904162,823.2126765712,738.7213228735,845.7199833260,841.6181960661,902.3751418224,722.3033840575,754.0009476166,864.1787394378,704.8072695476,852.8808125101,785.5620193734,734.5130632410,805.9333884722,860.3504763766,764.4361663261,632.2136660012,871.4064206920,1030.6820531908,623.0803013188,798.9678227898,841.5244012132,808.3640867828,871.6802960314,767.5259937479,848.0910047088,914.3465859099,749.8134417130,901.8979630789,963.5612857797,941.3265828394,842.1792944851,941.8583991763,813.9724862489,969.9403525958,899.5540995532,773.1974381557,774.9851163099,708.3757850688,833.3783677494,960.9609208957,768.2377645323,836.1044901427,1001.6289606833,872.4269425478,742.2169412572,801.6422091100,836.7357465157,770.8134423496,742.6451552101,973.3215185640,732.6329548718,880.5278182944,713.3398760868,692.1782768196,800.3615238446,714.7389994930,801.9158301054,956.8495501156,975.9730271800,935.5909054169,1054.7204199316,893.1660332467,833.9310016921,722.3104705432,838.1572086296,676.0784980837,1122.3499867829,966.7863544751,765.1958440128,706.5960114701,681.1556888216,929.7941039548,832.4724532968,942.9042250603,898.9585180648,812.0948582134,874.5817505398,904.2961607526,680.4587375151,543.4303355487,831.1318300357,865.0815147283,902.7917015063,640.1859825864,903.6043453575,752.8118656968,809.7583949694,673.7372616860,731.4570987212,941.1436468112,666.1561155651,892.7432051163,1065.5190568793,734.8530186193,934.7952760487,653.3864219780,696.0299127355,714.7785628676,718.9741236633,656.2513195057,757.6694620521,935.0862371323,714.7034186156,749.2177776303,825.1823024511,744.2823268775,773.0824326826
