-1.0000000000,445.1538556133,338.3508498837,167.3417959700,198.8725704923,338.5490237660,381.3238799149,482.7674882982,158.3430861358,198.6387525556,308.7999256566,500.6026685604,211.6518372509,1084.0117246103,670.7112029839,342.8045611234,604.7555448037,636.9604650772,188.5744116901,156.2038739870,431.5490297972,337.6379029780,174.4100370861,349.0174955682,185.5791959886,800.8906281731,727.5808282533,694.3973792976,197.1231472368,399.4675674884,221.1446916600,343.4224139322,184.0312863400,174.6582661410,548.3058554412,249.9790470173,378.0543488503,719.4545912735,696.8463563031,152.5331137242,290.4229553284,407.4456760875,156.0643751449,736.2166173763,402.9468606032,729.0183670697,205.7866319364,159.1079051357,377.7489271186,289.5604961196,811.9487206621,175.7873918262,164.9685638335,263.5988899234,167.8875342499,441.6745724326,265.3275396510,1178.8319680351,596.8119207630,656.9767547433,167.4715746417,581.4424418995,463.7497135170,163.6911323731,1019.4349995601,797.4591690490,201.4677595464,152.5461587285,278.2923404461,356.0593964175,321.6905390284,176.1457698978,154.2659177735,405.9017554904,173.3471372771,218.6903956970,788.2016400679,202.2744137361,384.4349542188,197.5102924106,290.0225415587,174.9213730928,556.0971197199,1020.8561653879,805.9593354836,727.0106067758,207.1164762599,332.9054490446,248.8975750412,332.2452422449,249.3578355772,433.2555154237,376.4307203029,231.4979624704,855.1564036453,200.5472450275,179.3067457206,187.6360829642,199.5931465681,291.8424583022,180.6470135014,875.3726960478,169.2534152763,782.9655785009,848.7933684352,409.7708266045,657.5487144019,999.6560664569,378.3301976592,198.0523538381,272.8949458258,1384.3251336679,203.6114001737,361.8684324110,188.7013958237,565.0936065246,202.3600009389,384.0931874650,821.7072683866,357.2296283997,411.5965741381,171.2991343928,861.4663807758,628.5534178938,205.9652138887,329.5324493745,209.1122810485,1002.8999307150,176.7778652543,278.8387798531,223.4407599543,180.2552564216,252.9409924552,594.5108872420,158.1052615305,719.0186467194,186.8506600584,275.5333562403,207.0140358659,645.8389869415,176.8503920083,144.1089714334,454.3534741851,591.9614395150,825.4627976612,175.1570854223,200.5467029062
445.1538556133,-1.0000000000,126.6843401107,504.4171928575,351.7688253453,286.2841306623,789.6613410105,684.8841041624,435.5408556847,411.5811891823,292.4152877186,513.5509151125,422.8201993127,1490.1702944195,548.5304759782,404.1951688979,649.5742437110,614.5431816078,452.1225263642,389.2205462638,268.5393214312,299.1568048290,329.8262803480,336.2915511132,240.0986616330,540.5375469348,303.9574628848,401.3071427703,311.1997968337,543.0535195205,404.1058840864,264.9013761520,328.9712177273,506.1101203620,138.5985121625,354.7461558214,578.5810996134,748.0086169635,601.2175696608,491.1709810471,477.7524613622,328.3105509378,393.4886590879,421.7495016589,290.4673357225,716.7142659383,529.3733869459,486.9695365678,365.2788831139,643.5600265394,419.0090255001,352.3549309130,339.6225203015,604.6841748430,326.7716060798,478.8732657543,338.0982225538,744.5201757084,375.8446019244,466.9252498675,474.7765142936,327.2309740793,740.4617154781,310.8876955439,710.9878339881,328.7550276882,254.9337838557,445.7624689777,333.5319054020,231.0970126509,119.7341592320,543.0647867789,341.0071232975,589.7244811577,490.3732665988,235.3253415441,676.2852468166,390.3907874969,331.7456184266,516.7185382988,553.9022323928,410.8855487571,223.4206228850,614.5399133526,672.2892481340,898.3551063615,433.7223485389,477.5898237503,259.9209093820,476.0822853445,350.6136799449,752.9148276209,536.9193859047,298.5386304867,757.8154537681,255.0500091498,521.4673132765,543.5525798796,516.1652381480,324.8874796721,544.2080844650,443.6547356235,380.7582813289,863.8265748534,616.8264749338,519.0128405570,741.1218547924,549.3292650392,233.1833742936,415.5487558320,463.4621673809,761.3770485987,524.6311273287,286.6499977194,444.8302966784,472.5912526988,509.7867993276,648.6984975846,869.9642850472,442.1229078221,568.8260363650,469.4003992985,610.3394253799,448.4520166185,498.2133656079,501.9732870630,408.2225987961,694.8482291833,326.9025432801,398.7131115007,413.3057170709,489.5442118044,316.2470266261,591.7479845796,417.5653553400,441.8377212889,362.9902184318,339.1053210889,449.9081794358,391.7070339217,369.5505084422,506.0635037690,365.9440078837,589.4718172165,1005.3932698740,341.9587922382,370.5340288376
338.3508498837,126.6843401107,-1.0000000000,285.0090315834,281.4075094887,259.9643620815,614.9093117603,526.0545291064,285.6248217751,238.5210097028,248.8263098683,493.5066348445,280.4143779745,1164.7916625460,523.4662983273,288.6183316409,488.0233819368,595.9137100953,239.3664229948,231.9837021370,258.3453319127,219.7161213636,229.5596199420,385.0533570241,123.5314707638,706.1549542554,422.9085031311,456.1200119684,179.9582039620,443.4841222684,281.5524302545,273.6226236411,198.5571027455,346.2541399272,176.8644079079,192.5316596067,452.7171497511,720.4778770754,449.2672935983,323.0273091168,292.0238834972,322.2772221569,236.0755049013,528.3807938196,275.8521065403,629.3188871773,365.3255797848,325.7969545333,249.2090879957,432.0155125383,419.2326796109,220.4487327134,202.1831029504,455.3926506923,195.8854052368,339.5190000682,257.4854583074,870.8466084340,440.6642605836,474.4395652432,274.6365219317,323.2988650267,670.6172541857,176.6210134776,728.5709420241,470.5007584635,208.1891262656,288.3348011900,228.8468010762,176.9397232458,117.7733040851,369.0743216179,193.3944302349,565.2662586512,269.0998284262,126.9453118211,649.9249253063,238.3244057429,254.8298224368,369.6627755441,364.4963612430,304.2833140414,269.4400609944,626.3582238725,660.4017268955,781.3933869403,302.2621126465,503.4450617164,150.2296770446,449.4638489687,250.6377621388,598.9007612040,380.5188726462,245.3924219059,625.6162154668,207.6841341405,333.3328181157,399.4291867973,353.9193664892,218.1796737502,427.5076992304,513.2019818942,239.3342387702,702.9480352777,653.5517251519,412.8088271465,776.2118742864,665.6116259204,130.1632223801,239.8323711724,392.4433812741,918.2495458516,364.6964858697,212.2394186358,252.7202912747,448.0760684085,302.1361656626,446.4671732118,785.8927805107,370.6226433000,416.1093800114,298.5107585081,789.1878783049,508.7818806164,346.5960286668,479.1847615018,213.9926917660,664.6479790871,178.1280757758,236.8314869309,277.6353922428,291.1557042259,217.3116880954,520.2325158413,274.4380668032,606.5243651380,234.2474869043,262.0565921765,318.1387196998,476.7923658469,198.1312412784,352.6631635088,446.3478315121,561.6773012990,888.5676696549,198.3512023757,250.0917012180
167.3417959700,504.4171928575,285.0090315834,-1.0000000000,287.5585374999,356.0433481393,400.1233472547,474.6788672338,155.4854036159,152.4683512843,403.9372693819,623.9422203619,180.3813529107,1022.2846793828,624.3481779229,290.3102754883,555.2520536228,639.8569916190,113.4335909538,154.6031180063,472.3229766828,248.3587308901,175.1397859272,447.2921677624,173.8805521480,992.0953608862,835.9019657701,687.1335814579,161.3241875289,450.9915700783,238.3388230874,440.2182931343,190.5439641956,178.5341183835,574.0927157338,199.3688694176,369.7926595751,748.4727831197,659.7285017516,137.4119838897,180.7648632067,418.6810634920,161.9313100279,850.1060685394,395.2005710823,709.8575563322,192.9380232655,158.6050752932,375.0854466494,248.2156572044,705.0813353230,183.1123214770,138.7342619858,253.2037899985,172.6858654512,411.2330115514,355.6754881400,1283.5533254863,716.1098890622,633.7027069519,140.2416061912,585.3094996833,545.9657376166,156.1627109974,1066.8595844160,866.9986986388,262.7172862135,159.9909367728,223.8961065125,387.6819364860,375.4747724495,177.6402937218,155.6950864191,446.2045911152,146.1487706398,159.3797623118,903.7784034082,144.6610718522,362.1459400787,163.3225819526,201.8598667773,179.6209445298,563.7267848047,896.3061075011,879.3714096032,807.7618303363,215.5218873666,378.4438348857,197.0903179502,421.9619803321,227.0020633935,442.5507086191,391.3547814504,238.4540181117,822.8991842215,230.6404247655,143.2174979284,215.9035097285,180.6979040552,172.2547313688,206.2534317068,891.7632144632,164.1398100478,819.7540194531,806.5831939226,464.6182047942,748.2858901464,1161.1211875365,289.4270602101,128.3742125141,265.1556133928,1448.7189138144,240.0335135587,224.6153021453,161.0034564313,589.7183550135,144.5481819311,257.5111304467,845.7118427648,387.1869326621,416.0799851472,151.9527881647,1028.2194298969,735.7863621214,232.5944151747,461.7173058554,134.1496178327,1025.3747188313,141.4778361748,174.2769206146,226.9706930441,141.0657557375,245.5667241426,628.6027585630,159.0803566640,843.9840552425,208.7777714325,252.7168538738,235.7897595244,726.7297055801,137.2541168679,157.2581946169,577.6458904659,693.0408252067,861.8291305992,171.0836447172,197.6592461684
198.8725704923,351.7688253453,281.4075094887,287.5585374999,-1.0000000000,382.9168595707,419.0766259443,508.3268567060,207.5044761815,282.6457685583,231.2024270893,551.2197452251,236.3478841983,1175.7084863907,617.5796209263,331.6249862946,663.0037998274,637.3427784694,282.4517498041,174.5413160809,397.1441044712,318.5636948513,228.9459250600,271.3109620975,185.5656807364,584.5504130592,466.2418690623,672.9451089632,205.9077588526,436.0023433754,248.0922764173,310.0148253988,192.5752610466,232.3705540446,455.3437777930,274.1297191994,402.3967980274,673.1302497578,670.8481363027,217.5265384785,381.8647210793,462.4120049699,188.1276688245,474.5698946168,384.1139729856,688.3496703730,266.5397275698,202.6465579372,430.7841879728,370.6091586121,719.2060168168,176.1649433695,195.0968061666,329.8578984632,166.9258385108,478.1055187116,265.1123565717,971.2649777447,462.2568384694,571.8376757725,231.4842841349,519.9947687597,469.0473669293,179.9403945369,822.9227527955,668.0219441627,192.8982172591,184.1624013317,290.9506024440,320.2030965145,232.0176115065,229.2574649355,181.3786036475,419.5189712290,237.8598961058,235.7914967505,682.2725962277,258.5280177464,366.7459578549,286.8380447660,398.7267049677,223.1823785499,470.5434781004,869.1035082950,708.9760758932,787.3591687193,247.8425207840,409.8069961975,275.6672461945,370.2576857830,288.4385746182,520.9542656403,401.7737474482,240.2543593430,787.6107702522,170.4004249174,251.3843094486,221.3428589418,287.4652279210,337.3117979765,278.0420617421,788.7282288306,187.8568653509,797.6717148127,734.5009760596,394.0554432738,567.2325650870,761.7480231544,346.6352024401,258.9925501197,369.8924094505,1127.7063907996,242.5935887240,396.2099367865,243.9570734379,429.9712508833,283.1633703608,508.6947216146,819.2535566691,351.7877043186,439.5751598416,230.1658978161,779.3866620077,459.3973582006,232.0775354607,310.9181928286,253.1545570825,891.3295411820,198.3354063781,320.3658517589,248.1991236910,228.3511798314,231.6772908620,543.3288718976,213.1641363451,530.1752147047,197.1915681118,317.6106768368,231.6049290262,494.0358540074,201.7067377726,229.6923996209,327.2997017639,512.7601428677,844.6641524712,191.6390640528,210.7427528317
338.5490237660,286.2841306623,259.9643620815,356.0433481393,382.9168595707,-1.0000000000,690.7391997581,487.6559260567,312.5757832318,310.4224859851,501.9014098919,410.9145948726,317.6448960751,1149.2418756137,623.9667301487,325.6634974710,383.9392934741,653.0106055679,360.1589176666,350.1844260156,313.6874643740,518.7847704668,187.2283011135,510.0986954184,261.0500038705,743.0041133380,579.6827091208,303.4174342093,359.5978794387,466.9435525000,351.0783951597,333.1661455718,302.4194785353,443.6848635630,187.2996980061,294.2580797841,591.2489276794,816.1678738968,589.0329340195,395.0835068862,310.5282190389,95.4794951233,352.2549121398,670.9545288317,414.5238672182,590.1987745919,418.4422457429,438.6917942863,203.0682473389,492.6044843571,444.8972489015,335.1245734653,328.5700746021,490.7279211315,345.9293674599,286.7283513587,326.8552623838,874.1897887220,486.6279760945,504.7565855493,376.5628880843,282.8881628196,742.1084978982,300.3260434352,863.2857111748,461.7428038831,308.6644626342,383.0236054427,401.6777904381,313.0591898423,315.1924248940,439.8158604321,309.0304415391,629.7599750115,386.2559485862,184.5417977720,711.7098490868,305.2960730326,154.5987021499,421.6293826443,386.1704861331,332.0508405673,304.8814847638,732.3268270493,854.1688006893,595.6196285351,410.6335132865,482.0690233493,204.5879460380,310.2942917339,227.7981401406,589.9047998625,461.0353349495,190.7162761446,663.5893488026,271.5183088210,394.0452475944,465.9104006560,442.1742987733,394.2505522267,400.1252544896,410.5635707167,351.7296757167,798.8350297260,626.1719878978,396.8348964394,815.7783277237,724.1105372946,184.2957162087,299.8605240578,225.7735141369,989.3629817921,487.1206565543,441.7016047925,430.9280457152,559.9785710953,422.4593709390,446.8515758522,679.9712373442,420.6497737830,475.3895799040,390.8872505225,796.3092626468,554.0812629782,463.2866074787,586.6351683805,316.9271257123,717.7057233816,347.8237992525,367.7774381894,350.6038905813,415.3107315210,412.8420824425,441.7070022875,393.6611249880,763.2651388992,364.7859516611,235.1414740059,421.0588242001,609.1608177264,319.7979096786,366.6188058890,560.6085338417,785.6307293073,730.8600189245,317.6745769745,440.0836962389
381.3238799149,789.6613410105,614.9093117603,400.1233472547,419.0766259443,690.7391997581,-1.0000000000,587.2561422551,339.6687511392,367.4259332945,522.1097146847,822.3532482481,289.2110705755,990.1539941896,558.0467770435,500.0606153230,851.8732844095,689.8435416476,385.0972509524,331.3930796017,703.5569760812,554.3113821974,378.0097638030,638.7154345076,393.2060936918,909.5223105169,1098.8031881335,1060.7680506300,408.2938101733,540.5933097944,430.5914472529,603.2256397465,333.6986378134,376.1764856811,924.4539272140,397.1686134455,418.2640195575,490.3754094725,887.8083898946,321.7099098725,479.8662531864,736.9883362539,329.3309163178,927.1660642233,644.1405696960,693.0358586016,245.1420930933,296.4754862662,619.5411080538,314.4172550856,943.1638640134,295.2840102112,372.9580633615,338.7927552201,366.6511004137,586.9860425639,501.5102277718,1334.4417855200,996.0321346047,567.7896764153,332.0394983847,950.5595397484,305.4545575899,367.1892892393,1109.2289296578,1226.5749578418,478.1525304641,309.7833734480,545.9854993532,632.6579630775,601.7554175678,324.3455557233,342.9967911230,386.9744935715,344.5223991055,462.1515300235,791.2192782825,354.3281961859,627.4722626981,405.4183366258,399.8499793626,381.5618202921,771.7140100899,1050.0190308011,819.3020444746,791.6907685226,328.8321417969,583.6603955103,428.3637104729,603.3042266922,509.3270895920,543.1209383168,471.3966487812,370.6516619681,948.0451366140,490.2179256735,285.7804336133,308.1046214445,440.6528681821,540.3370027770,375.1336027025,1246.3724515678,341.5406629649,821.1058729762,806.6731879494,437.4940498825,488.5234834836,1155.3979683536,573.2987374091,356.1447293119,474.2179061557,1423.3869559630,299.3471159614,586.3954261356,357.8024050936,822.0087532371,357.1114999836,503.4082728500,790.7017828383,453.4846839343,580.3805074391,272.3653439430,1036.4468479438,881.8929949989,260.8660948859,374.2278640352,406.8686265965,1159.9629738211,354.7994442515,493.0447821172,328.8022998462,364.1313249872,470.1059083862,762.5251693183,399.8286076454,879.3014471615,290.8594259880,566.3624401184,264.1774778806,779.1457191140,352.9034685672,356.4502511237,737.1050838934,583.6250370000,679.4040146043,331.7452629486,383.8662212879
482.7674882982,684.8841041624,526.0545291064,474.6788672338,508.3268567060,487.6559260567,587.2561422551,-1.0000000000,472.9566968433,434.7400421759,512.6167059533,421.1162815499,347.8529032781,610.6352289770,667.0364035008,447.3430095246,362.9536185016,401.7371086370,488.5363004001,460.7583963436,584.0062583158,694.6744253425,373.6488812127,512.0897281231,432.5676183425,606.1635137591,834.1311332134,670.8658392441,503.2853791054,300.8798527384,549.9585152498,622.4753994985,346.8961902762,643.2515834750,601.8526505762,274.6747339537,660.1984455871,544.4146337480,361.7581944815,484.1294441329,413.5600428250,387.3881989599,481.5742244198,696.0823165294,636.4718363670,544.1319474955,423.8353092771,457.7475372358,394.4645262046,424.3369917628,653.6790540740,419.3555556472,465.6540348046,585.1141587439,471.2988669986,329.1393527442,532.8737924892,683.1917584472,586.9825741982,584.2727907596,497.9970485408,531.5880442807,558.4794273173,394.8532773606,544.2156687716,791.6768989999,484.6503464650,522.0586475348,598.8015382528,715.7777548876,610.6944452097,524.2365582357,435.3420157963,517.6759936958,501.4870872873,409.3709740438,542.9006129791,363.2121054953,409.4628603593,626.7758877732,457.6482237228,462.0507411658,728.7631896810,648.7162431732,491.0898705911,370.7420121640,513.0843643195,445.0577273235,346.0514217806,553.1826978002,371.4389473384,584.2101889642,348.5963108732,315.6287943360,347.1376983886,506.4319180094,397.8455493480,611.6468241239,694.8993188951,623.5702209770,624.5457886954,680.6803723238,452.2609793218,351.1764348321,561.4253177945,264.6527726581,865.7080565592,893.1466428449,388.3632749626,359.5155363064,369.6965388533,844.1104487295,504.0292817697,653.4419872848,562.1406677651,582.6672082856,511.2309577446,509.3923224148,298.7894220631,224.5472364885,353.4381873255,455.5052401039,598.2455735002,492.1306791493,587.3007729437,382.3028395710,433.3045901987,540.3464970613,395.4858886876,556.2909003647,339.4620725129,521.5290099925,650.9029744465,267.9676491963,593.6099763192,524.6203604896,413.2074886486,459.7023839602,415.5632364051,564.9754899059,380.7076110898,558.2773503575,580.5483995994,405.8399733031,493.1300971520,355.0041715105,586.6186042283
158.3430861358,435.5408556847,285.6248217751,155.4854036159,207.5044761815,312.5757832318,339.6687511392,472.9566968433,-1.0000000000,163.1842343393,338.2374982370,609.5692730740,166.8944106886,1085.1989908257,633.7312944605,261.6023530712,597.0389871826,668.0067595538,154.4594433313,120.9780141822,415.7505263692,271.7522612127,160.6078969979,400.7828452024,160.3936045363,930.0395356663,740.1029657184,639.4406261979,153.6753711405,429.4408538276,205.8812009426,367.1433294211,166.0822373595,164.7952753129,492.9109179885,204.5028825794,341.9779658806,718.4156229058,680.5070637838,127.1935162938,242.2230641311,391.6091860085,116.6988146709,782.9049931993,371.1305118680,719.8822732331,172.1974020938,142.4103879933,367.7474916595,237.9180586361,734.7730526280,165.1011471129,137.3740926549,253.1494756347,149.6023903968,402.1512285918,254.2583186530,1213.3940101006,669.6298045860,580.1660347564,130.8445439043,571.5402300550,490.6001769865,138.8754858491,1070.7688152644,818.1205921337,215.8168018580,117.4995682899,230.2926187321,321.8624277610,320.3075534573,143.7552143466,124.7045638233,440.8310508078,142.3056909279,162.7117608749,864.5746099461,165.6810494782,310.4550806905,168.5496235943,249.3458837814,165.8998974621,470.6481589629,976.9019799789,853.9850451330,782.3631305843,170.7528773473,378.5712454828,194.1447947689,344.2965442121,220.0534021150,485.3688683398,396.1575255074,184.7934544574,827.2157975314,211.5038957774,150.4426293909,171.9433223305,201.1602705766,202.0423665411,186.9798465399,831.7151104135,146.3485986894,820.5170802538,834.7712600307,417.6304037148,616.2628209696,1096.0013742837,268.0741394278,145.5176262372,255.5339322764,1398.4362262070,225.6209366579,296.1112839727,158.0901945250,590.6751063273,171.6450020722,309.0473914144,858.9332988743,375.3538268207,419.9735423891,140.8821124167,982.3575845542,668.9176563091,189.8235802138,408.5609473491,147.1667033136,1005.1271863339,155.6652586546,213.1751026021,211.7899250037,151.4774214345,207.7979090946,599.4819991085,143.7621347241,798.2997428111,169.4881346406,262.1080772565,207.4114658917,728.8141015369,142.4094356686,134.0758932237,504.4709970222,679.5416717038,840.1867694262,150.9403908744,163.4580141603
198.6387525556,411.5811891823,238.5210097028,152.4683512843,282.6457685583,310.4224859851,367.4259332945,434.7400421759,163.1842343393,-1.0000000000,339.9525642122,588.1839209982,136.7885039830,991.6075682018,499.5809623375,311.2222948754,470.8444612216,591.9059793844,115.3584318588,150.6539453043,419.8563864810,320.1183899271,162.6066137044,459.2049468717,157.5738594413,939.3913629705,773.8276558737,664.4939700836,166.6778218087,354.8811048385,248.1216192351,404.2744819362,140.0044136426,226.6150621002,471.2629749183,159.1994113237,362.2901380780,573.5221143619,633.9599289588,149.8418357259,156.3107623542,359.3780026297,138.7097078669,788.9609284908,292.8474610957,542.9106302655,173.1276679420,169.4579470920,308.8236105113,182.2531259137,594.5235541050,173.4043911086,164.2559906415,284.8500367654,166.8992440368,276.7546410064,328.0217588425,1213.6558917618,683.1710993470,486.2465239576,122.6694572037,541.1706820198,490.9885354245,145.7008719632,957.7669278926,830.8424480652,247.6523555838,173.0456399161,236.1494352366,317.7002588355,309.5407107708,195.6188661956,133.6432314033,405.3097222639,134.3762207805,141.1060013230,782.7123412342,98.3532808283,322.1127553097,245.7798872150,177.5297617219,166.7729141452,511.0886456548,782.2754841965,814.1455614114,700.8991086577,156.6990012972,445.9130437444,138.8244225141,451.9966744201,236.4685485535,411.1027195712,340.2838741228,208.4805550578,720.9374763090,209.9905673281,119.0878635746,255.0070194099,246.3070610437,218.6774809693,273.9497172506,827.8266173994,165.4950117434,716.9507748216,656.4156150785,362.1550891860,715.1418730784,1005.1573096744,203.5354726433,89.4701149074,220.5260687020,1249.9006539309,256.5441625846,256.6445087935,159.2246280804,580.2964158965,153.9924151593,196.5864255437,698.5642185729,294.1229830725,417.1615160694,118.6197841585,988.6519936033,721.2392842269,240.2461657016,430.1517575412,115.7757097110,1003.2047799148,148.7097938070,161.2546961764,172.9587609938,157.7803956394,265.2899848667,582.3081001104,194.7948570281,797.8061946830,170.0372142447,268.5376790367,225.6066327105,617.7459342180,117.8639668657,201.0141549538,588.7782181361,612.1241025185,655.9470199153,145.2355328283,210.0424370197
308.7999256566,292.4152877186,248.8263098683,403.9372693819,231.2024270893,501.9014098919,522.1097146847,512.6167059533,338.2374982370,339.9525642122,-1.0000000000,471.9967346065,307.4764058067,1215.0400069106,474.3459844379,440.8564845859,715.3676986300,516.1755261584,383.8570527872,261.3977110225,386.0206487661,303.9012046910,319.3186329483,242.2873231423,203.2842214172,544.8841904604,382.9124266049,659.7393090012,237.0860288263,384.4032858113,263.6387775211,281.0458341403,187.9602292905,325.1746598892,388.4699285552,297.5441844325,406.9619673362,486.1385119280,601.1024454088,322.1356649370,513.7326460792,551.5172879181,259.0361556377,349.7490978165,327.2494057786,673.6737298686,387.3637005615,295.2335372550,457.4419356456,456.8228549257,543.1282692804,173.2428762340,229.3043108427,420.2222032791,195.0884750848,480.6351266049,308.2833005478,814.9314539943,322.3366560325,448.6704428780,346.5246641160,456.0127849260,419.1347502777,182.1395192446,574.0849594735,525.6295370238,199.0198818866,305.3001446571,354.4752957966,371.9656322171,186.4209836734,372.6509097268,219.9061289496,412.6218064459,341.9395382382,281.6498298423,572.9336240337,338.2311030578,480.4844190603,439.6526479589,502.9094135097,301.3079820359,466.1669695571,716.6706605765,509.6902501832,713.8431852000,289.1444534046,419.2501030581,311.5986173729,488.7208278801,366.2811947694,532.3662062648,370.1507236680,351.0445113544,704.9445404523,238.0253291865,347.2400227121,355.4440925488,411.0552523030,411.4227147112,451.9004357948,711.6311233637,257.1065076575,600.2692384362,566.5716626907,313.9368508230,605.4513660230,726.3540686137,367.4112466417,313.8689825749,472.6958804269,845.6015618312,211.8397375849,387.1064530076,297.2642879131,369.7823915665,362.4022112798,679.3720004232,703.0770215501,260.7531525633,423.9791242804,325.1508318069,662.9172525826,311.6800673507,317.9112293898,254.4752674935,333.8540511790,710.0202312293,189.5808135386,410.4759634938,239.0567732114,339.1411170109,252.2896520066,527.3627115165,285.4762444194,426.3094314791,187.2819402840,387.1819628309,194.3410388430,315.2502318948,242.7189917443,360.0868247626,348.1062134535,295.8554692683,851.9725203078,197.8005860961,221.8074344560
500.6026685604,513.5509151125,493.5066348445,623.9422203619,551.2197452251,410.9145948726,822.3532482481,421.1162815499,609.5692730740,588.1839209982,471.9967346065,-1.0000000000,468.7600335645,1060.7402748379,779.1262957417,532.6933576227,318.1073889552,539.9622202493,639.1973311029,578.1435802306,314.0150199672,697.1692991461,421.0251167788,493.1095258089,433.7611343055,456.4736171955,627.6364223537,542.1758350020,614.3524887030,463.7387523461,583.1836682935,332.7125024585,425.4214141952,700.4835362874,396.5938831239,444.9678726772,670.8271174579,784.6573258887,520.9507353899,582.5849978278,559.0790457158,346.5186629773,586.3646369928,586.8353476247,641.3481804129,682.9926400772,620.7113706081,607.9628629971,356.1904925686,703.1774326374,418.1670501981,453.0806042732,517.6989623441,742.8975053704,531.0410078696,411.7831584990,484.0203619454,504.5793071521,457.9491013523,687.0323476202,636.7302300717,236.6656172749,724.2216925725,461.3703327745,430.5548030529,431.9469700776,441.3456192821,641.5168012972,686.3631490773,683.3679241088,475.9328020079,684.9784167163,495.6178964126,717.9135909470,658.0535812311,448.0326708069,540.9980450139,542.5099720869,393.9906250408,709.8004452436,646.6818147786,535.0460871390,500.1226650495,500.3115737987,557.4297280066,347.9519944176,681.6186760471,518.9605714591,446.4736149499,489.3722573329,417.2810991692,619.1292484686,364.9807267029,436.1537886229,429.8365077389,501.6524877321,635.4171013669,668.2970621250,777.2427762728,747.7733070441,634.6602059380,457.3219488817,564.1698301971,479.6327025102,548.1442588534,379.3607261590,900.3296277053,546.7386957193,490.5512350093,536.6319922662,438.5185880683,619.2646073286,563.2401112343,706.9791357557,663.6633959412,441.1331612204,689.8056366505,734.1385365570,466.1462759139,414.8753532317,379.5035076683,607.0398303280,461.9912990821,417.9759272447,641.9481777521,510.5709423891,612.0157888996,513.0856901881,481.3346415164,771.7419222541,428.6783324959,638.4040729743,633.9901968293,411.3560730817,671.7936911443,526.4236456878,461.2557107708,447.4105346565,487.6631509055,501.8017838285,497.2168147911,601.2822394048,551.2502803525,510.1220995666,683.2122523418,456.5801443898,630.5116305351
211.6518372509,422.8201993127,280.4143779745,180.3813529107,236.3478841983,317.6448960751,289.2110705755,347.8529032781,166.8944106886,136.7885039830,307.4764058067,468.7600335645,-1.0000000000,889.6259167803,389.0999207822,326.9635936272,438.1157205277,453.9165972610,156.5985450759,147.8173953474,421.2136773346,375.1936595436,125.0255181334,390.3775515481,132.0509351213,755.2950747465,746.8180781101,696.8077382964,208.9524712325,275.7757174529,258.3832232880,386.0272950990,93.8310150292,269.3513625211,472.9293632692,121.0338188227,362.5821376547,413.5993479261,555.3778602768,148.8608236059,203.6045816407,322.4426576756,157.4850276814,694.5496467076,372.9706421191,424.8473388469,136.4528778623,146.7300046781,277.1065594400,193.8549718738,556.1172912466,119.4285222668,172.9966442389,301.2144402057,158.2189214510,243.4877112764,327.7119947935,1008.3936284992,630.2751702382,401.0097808750,152.0923569283,513.1974998168,330.6636219808,123.6584795813,807.5100178590,754.2610046048,233.6293791911,170.7056576125,322.5951992442,401.4374860784,331.7515566513,191.4076166095,122.4713302939,366.6383601388,171.5151880357,159.2279241594,622.2871247737,101.7618620745,321.0589795802,280.8407654964,206.2594022210,187.5397749880,504.5475718347,750.5910082391,669.9019167969,567.2719875847,178.5333113522,391.3852958197,136.4079199492,440.5119971266,251.3566858029,409.7064513423,262.5930234862,148.2885618839,630.3172284119,213.8947837117,113.2375455324,225.4135793821,317.3983032927,333.4173768836,263.5338885081,791.6149973747,167.1838166407,575.4294822511,555.8982027321,228.3817115350,595.8393844148,902.1566136266,252.2329403224,101.1719138086,193.2270265016,1081.2525092434,199.0975256898,370.1910111044,199.5302326076,533.1363742672,199.3964550825,260.5708134256,507.3172597837,173.5715136860,343.7513834871,121.4631572614,827.0669456172,594.9606393249,206.9687638725,288.0045094332,160.1103423391,854.0986537152,153.8912667715,250.1247212262,101.2234269012,199.8684801467,299.5050836973,457.6788315312,246.3543884935,642.7377502321,122.4761513749,307.8189165218,129.7630207617,547.2625472708,117.2318648967,218.5091594328,538.6701956481,446.3307817444,529.7982370419,97.6813361135,220.4083602362
1084.0117246103,1490.1702944195,1164.7916625460,1022.2846793828,1175.7084863907,1149.2418756137,990.1539941896,610.6352289770,1085.1989908257,991.6075682018,1215.0400069106,1060.7402748379,889.6259167803,-1.0000000000,1327.9700434130,790.4114761320,745.7969182740,973.1734237899,1003.1239516176,968.9189959951,1187.3527052998,1156.1996266890,847.9431315652,1169.8439064586,1050.2806635129,1288.1225135647,1540.9470281935,1314.9244371072,1070.0101315572,592.5999785290,1098.7602426569,1357.7504819229,917.8688396679,1173.6038096358,1458.3136513741,775.8634655542,1190.9612713262,1060.5746497432,461.5873906724,1010.4413623493,886.6778202217,1067.0143839508,1046.7688832621,1370.3872201726,1205.9129663657,739.2778454157,895.4822849063,999.0858538511,794.7196118465,929.1952318368,1166.4865543012,986.0575471751,1041.7399559931,1025.3355774531,1049.0617072508,726.2512599643,931.2123965209,1251.2679451842,1474.4244875717,1293.6776576959,1010.3101233030,1229.6634382252,1067.7749632434,990.9674769850,1067.0738537968,1844.5919870294,1081.4666355482,1070.7905534887,1212.2138602211,1216.9527787057,1349.5593525419,1068.9651319387,1008.8467439971,1096.5150340070,1017.6250191393,1036.2284410257,746.2034954624,843.7496871677,876.0611802583,1145.0532701703,947.0424741983,1010.8896718706,1459.1842287633,1179.1429779248,782.5332921649,579.6834449371,1027.3685911485,1316.8163469342,896.6035525097,1010.0669314758,852.1344806763,920.7751347911,786.1106425212,855.2030500619,503.4483782034,1078.7803220890,924.8390706538,1213.8349620369,1214.8954718290,1144.8100745199,1110.6587127934,1209.6568632578,958.2215972830,482.4125874636,1247.2015124014,583.5325226059,1461.7550789693,1440.0381732016,975.6197472288,883.0676975159,964.5272921629,1368.9095581775,1091.4505419305,1240.8327620303,1084.8040812071,1232.9285824361,1019.0836114543,941.5835411010,677.1569003651,810.6392007086,918.0965966643,1019.4135468475,1404.5899708462,1071.0538195027,1136.8643020914,911.4379894943,1008.0473079708,942.6246984930,999.9872513373,1139.3123213617,830.1304196385,991.0043003915,1254.6240083624,702.9015047822,1164.2426256468,1199.1953866379,975.8086653891,893.3198261882,987.0774751243,1192.9687573875,972.1809314011,1095.6397140631,1205.6186412065,875.4725526600,632.9707098087,946.4135419615,1146.2924531611
670.7112029839,548.5304759782,523.4662983273,624.3481779229,617.5796209263,623.9667301487,558.0467770435,667.0364035008,633.7312944605,499.5809623375,474.3459844379,779.1262957417,389.0999207822,1327.9700434130,-1.0000000000,678.6730029518,788.6508493370,576.4018032868,536.1817633006,606.4778478644,499.4367194049,566.6046613621,572.7444198046,628.1359653410,510.5616294303,694.8062128288,593.8623388682,823.3249492555,515.1247350254,608.6364753449,455.4955415135,495.5570151090,495.2923641765,662.8675116480,535.5203691071,525.1956945912,459.6781315005,302.5226382818,866.2716717971,620.7893885791,596.1665097034,611.7422528570,570.9094122858,640.9735115880,529.4230083151,523.7205568899,532.4383047659,634.0229061858,632.4200107653,510.1151624932,422.3044202679,447.2943555730,575.8315946444,608.5141712687,523.9650203541,507.4027280971,637.9257294081,630.2779907418,596.7402689091,213.6272347807,589.3897679810,628.9576454162,559.3886495780,508.4263846894,669.7407213530,703.7152993453,526.8637518555,631.9898444726,554.6167433311,579.6245708920,485.0387110644,693.7861918248,537.3677830225,615.8276155838,595.8353390747,534.8423996951,635.4992207606,479.3031432184,664.3911047245,719.9911722601,590.7101818856,576.8581698484,677.5017314837,479.8039986630,707.6527895252,782.6512143442,576.9992003463,826.1911858241,505.2990676389,785.9821836061,586.3435071657,594.1473046125,572.8555874767,496.8546980351,889.7209166433,607.4203276245,517.4495833681,677.8509723196,680.9603419247,604.6817647601,780.9594303940,754.9010596014,591.0578571372,863.9994795677,332.1051664079,502.9089369688,623.9380990358,416.6993837268,472.6494692795,461.6156926715,575.9135676804,614.5852928475,535.5144647422,582.5214442566,579.4289998003,756.8141986522,528.9913624518,644.7932989474,667.6932649065,415.1358733915,747.1317289554,584.0668315470,824.2076746304,570.2948231288,539.0207191529,555.1668882040,493.9109153538,839.0199382494,489.9365490428,598.7316245362,474.8851283351,619.5004000724,577.3589593431,761.5329837532,577.2283160773,674.3768997448,459.3125171903,598.3567684372,481.8488700516,401.8963398044,531.3621526215,687.6058459088,682.9787631073,540.4649148206,759.0277197162,483.4756311784,539.4323641028
342.8045611234,404.1951688979,288.6183316409,290.3102754883,331.6249862946,325.6634974710,500.0606153230,447.3430095246,261.6023530712,311.2222948754,440.8564845859,532.6933576227,326.9635936272,790.4114761320,678.6730029518,-1.0000000000,486.3409867954,715.0073965081,274.4413220469,244.0954907359,399.4353675687,326.0202050629,241.3627667295,549.3938339832,241.2017515309,908.8328061524,650.0946185198,536.0244804646,265.7949699242,445.3928513357,297.2979393689,441.4353921578,281.1525893097,320.0144073604,462.4533483709,265.5559714605,471.4930319077,794.2551016496,368.0395885057,314.7824500340,320.3535453052,378.9309540390,281.2794876198,747.0466654298,476.8131131741,660.7452631485,331.0487797472,322.8723345752,329.3575750234,415.2104749792,751.2365024097,268.9557177657,260.4605592238,379.7716052178,269.0492803809,443.7252776537,222.0169947728,1084.9852867375,664.9685302956,607.4850545842,290.1604495674,470.1596431978,701.6452140581,260.5172007937,943.0427236597,818.8614018653,316.7586116625,277.8172851823,290.8057706078,299.1486254889,359.4518593148,303.7462523887,258.4671694981,632.9585769459,271.6247516274,241.7529021854,723.9915394998,283.7561327097,237.8376984719,297.5720495491,364.9321262888,331.0204291597,459.7497880661,860.7993590826,627.9982285113,569.5866602543,347.3150887845,589.0367292234,251.7698054110,285.0386293213,236.4239291315,484.4191917283,446.7664860934,262.4771501575,537.2070000942,316.8248076828,328.0043038731,364.6787416726,314.3179458087,293.5990455693,324.7605589076,581.7969162923,262.3660895846,604.7924371489,814.0386180795,388.1160383439,786.5117542905,1017.4162894651,261.8784237581,287.9023911659,385.3953737892,1224.3785135125,403.6105787656,347.9911676266,308.7969458570,612.9667249115,298.8154777246,430.1479195618,754.8298847330,478.4408633461,411.5622287275,320.9315540556,953.1649466972,609.3979649466,338.7171535941,564.3177984241,268.9575123928,686.2402600053,276.6741564707,309.4904526906,352.9214633614,277.0934518007,312.6656117980,479.2971230082,306.4781525427,922.4225551677,295.5478738729,271.1033691882,359.9591950541,689.8841716894,277.9455742557,292.6059061661,623.1041068379,734.5827279038,848.3289605519,284.1516380616,300.0240122137
604.7555448037,649.5742437110,488.0233819368,555.2520536228,663.0037998274,383.9392934741,851.8732844095,362.9536185016,597.0389871826,470.8444612216,715.3676986300,318.1073889552,438.1157205277,745.7969182740,788.6508493370,486.3409867954,-1.0000000000,558.6211745746,515.3880248881,618.2012192347,503.0861988154,712.0722343455,417.0110118410,737.7779672202,498.3775762208,779.1429955402,887.7224669043,568.3177702696,640.7472415680,352.4090871548,681.5807272185,603.1644620015,477.9012586315,790.7305981553,542.2332226616,348.4519158708,791.1416634538,805.2558468471,341.9128294732,629.1456076052,391.4542849776,301.9508193493,595.4249293963,854.3274847577,626.9881268865,482.3951615466,573.5206811026,647.7842339439,251.3261595622,539.5135070230,519.7509875695,543.2890243955,590.8074769473,718.5041031221,562.6686272116,264.1631204763,520.8729697436,693.0671806661,729.4654429584,738.2911541574,566.2699611494,334.2928605269,820.8883826207,515.0486892797,540.2564518330,664.2549435011,618.2710696770,680.2352985467,662.0035810931,681.2803391152,649.1742228513,727.1195424557,517.8526814029,807.1678145719,616.0143148281,426.7322764066,510.6230153985,404.1919126545,429.0927431314,741.2691867505,455.4559533506,537.8898041457,704.6848786165,582.4222464600,531.9488951326,386.8381602343,647.2672373693,686.6362402979,379.8714454087,568.6673892388,382.2688454103,628.9357910369,368.3285296379,439.7045919946,289.5000350723,575.0966765024,558.8030477354,793.1231617937,809.5884070479,675.2957558930,742.1272197350,465.3127538148,555.5184235215,381.6653246694,588.4414507746,368.8975764930,1089.6646898062,800.8256327168,396.8111373715,419.1304868354,362.4565744905,705.4725968237,709.5745407842,638.2886769645,647.0088469587,653.8201451964,686.3011816842,443.0415731955,391.2068766247,406.6546460162,401.9737236559,601.7981482647,858.1437706784,649.5188321381,773.7390170905,724.7426359030,500.6321873517,530.3347824309,496.9388267345,626.2668936965,400.7468413538,632.1515974480,729.0610018510,388.0867677431,739.9504788982,742.8745156291,558.8784615361,435.7238361471,594.1031961757,645.8180810240,470.6982480487,695.5689171795,867.1680842174,633.9546300287,469.4069730794,483.3759554536,702.6927707469
636.9604650772,614.5431816078,595.9137100953,639.8569916190,637.3427784694,653.0106055679,689.8435416476,401.7371086370,668.0067595538,591.9059793844,516.1755261584,539.9622202493,453.9165972610,973.1734237899,576.4018032868,715.0073965081,558.6211745746,-1.0000000000,619.2601144939,620.6279451109,549.5408980222,645.4349452099,504.8654241665,502.5395016430,584.1693899455,643.7436451222,578.9083018431,765.9351568141,602.1227056589,439.2552508448,591.9539797116,577.7698018122,505.1224697548,746.9582739156,609.8107589922,437.8199287746,613.3441489244,555.4197309501,508.1122178189,693.6094889598,582.3270824966,509.5976365672,624.2988847599,569.3328241506,566.9115760005,476.0910032964,521.7895673030,650.7000367117,477.5488933499,536.6220745388,504.1145679429,505.0552556982,582.3216480038,635.7363161908,544.1672925287,411.2985293622,655.4439774090,794.7308057399,399.3229055950,580.0364631950,629.8406155607,588.1337662098,559.3825233016,547.3232097501,626.6899440555,697.1354595266,540.7014110896,693.6883204014,731.5983208717,709.9260234706,612.2047328554,723.6421239469,592.9044433236,697.1292937042,673.1827929441,548.8844999294,532.7670777009,491.2877815508,612.3020724598,739.3525789496,490.2825027095,621.5496130264,763.6703533689,643.6275401888,474.6205162482,566.8684455843,582.5965560664,548.8780367009,524.9803663337,749.6873043944,514.3546441411,648.2586533389,496.9993614016,468.5051157713,574.3872522407,501.0084788598,569.8873044369,744.8458772220,757.0289690619,712.1175900485,837.6715716530,677.6858158133,610.9882828886,494.0320890740,607.2595094740,453.7526768898,790.1238358353,730.0070032048,555.8230922612,494.4238516749,468.1929882439,684.0113281283,565.2752465850,649.2555535736,679.4572753455,580.3284799903,656.6098621250,620.4970801269,453.1419085332,322.6617011820,612.0826899048,640.4884602555,655.6958453985,423.0088082070,679.9477489065,500.4027266205,605.3228356914,443.8603290396,509.9999215769,663.0545925311,446.8428150125,669.3910049210,696.8381670815,469.0968485585,708.7806405630,407.3460931728,475.4445261226,495.9476051482,497.5739935196,432.8445835531,540.6179433114,719.1911266543,448.5958069353,496.3430246581,495.5518419842,520.4156851721,630.2600579025
